##TITLE=Analysis number 327080
Compound Code cc 56246
Book Reference 470/172
Project Code adrs
Chemist Name mikem
##JCAMPDX= 6.0         $$ Bruker NMR JCAMP-DX V2.0
##DATA TYPE= NMR SPECTRUM
##DATA CLASS= NTUPLES
##ORIGIN= Bruker BioSpin GmbH
##OWNER= nmr
$$ XWIN-NMR		Version 3.5
$$ Thu Mar  8 11:16:05 2007 GMT Standard Time (UT+0h)  MAYBRIDGE\nmr@NMR_250MHZ
##.OBSERVE FREQUENCY= 250.131544655141
##.OBSERVE NUCLEUS= ^1H
##.ACQUISITION MODE= SIMULTANEOUS (DQD)
##.ACQUISITION SCHEME= undefined
##.AVERAGES= 16
##.DIGITISER RES= 18
##SPECTROMETER/DATA SYSTEM= dpx250
##.PULSE SEQUENCE= zg30
##.SOLVENT NAME= CDCl3
##.SHIFT REFERENCE= (INTERNAL, CDCl3, 0, 16.4547)
##AUDIT TRAIL= $$ (NUMBER, WHEN, WHO, WHERE, WHAT)
$$ ##TITLE= Audit trail, XWIN-NMR		Version 3.5
$$ ##JCAMPDX= 5.01
$$ ##ORIGIN= Bruker BioSpin GmbH
$$ ##OWNER= nmr
$$ C:\u/data/dgb/nmr/ADRS/590/pdata/1/auditp.txt
$$ ##AUDIT TRAIL=  $$ (NUMBER, WHEN, WHO, WHERE, WHAT)
(   1,<2007-03-08 11:15:44.84 +000>,<MAYBRIDGE\nmr>,<NMR_250MHZ>,
      <created by zg, POWCHK disabled, PULCHK disabled
       configuration hash MD5:
       49 4B E0 1D 92 C2 6B 37 9F E6 65 BC 52 41 86 1D
       data hash MD5: 64K
       F0 E6 1F 65 72 F3 EF DC 0D 82 6B 12 23 6E F2 3B>)
(   2,<2007-03-08 11:15:57.05 +000>,<MAYBRIDGE\nmr>,<NMR_250MHZ>,
      <Start of raw data processing
       ef LB = 0.3 FT_mod = 6 PKNL = 1 SI = 32K 
       data hash MD5: 32K
       19 7F 4C 66 2F D2 61 81 25 AD 67 44 4A 48 DB 0A>)
(   3,<2007-03-08 11:15:58.83 +000>,<MAYBRIDGE\nmr>,<NMR_250MHZ>,
      <apk 
       data hash MD5: 32K
       A1 21 D8 25 39 2C C3 08 A6 62 1D C6 17 78 E7 E1>)
(   4,<2007-03-08 11:15:59.52 +000>,<MAYBRIDGE\nmr>,<NMR_250MHZ>,
      <abs ABSG = 5 
       data hash MD5: 32K
       99 AF 9D 6A 92 E4 94 72 D3 AA 8C EF C7 50 0E 61>)
$$ ##END=
$$ 
$$ hash MD5
$$ 45 02 FC 17 9B C0 D0 75 06 18 6D 3D 8C 27 14 09
##$RELAX= 
##$RELAX= 
##$RELAX= 
##$RELAX= 
##$RELAX= 
##$RELAX= 
##$RELAX= 
$$ Bruker specific parameters
$$ --------------------------
##$DU= <C:\u>
##$EXPNO= 590
##$NAME= <ADRS>
##$PROCNO= 1
##$TYPE= <nmr>
##$USER= <dgb>
##$AMP= (0..31)
100 100 100 100 100 100 100 100 100 100 100 100 100 100 100 100 100 100 
100 100 100 100 100 100 100 100 100 100 100 100 100 100 
##$AQSEQ= 0
##$AQ_mod= 3
##$AUNM= <au_zg>
##$AUTOPOS= <43 >
##$BF1= 250.13
##$BF2= 250.13
##$BF3= 250.13
##$BF4= 250.13
##$BF5= 500.13
##$BF6= 500.13
##$BF7= 500.13
##$BF8= 500.13
##$BYTORDA= 1
##$CFDGTYP= 0
##$CFRGTYP= 5
##$CHEMSTR= <none>
##$CNST= (0..31)
1 1 145 1 1 1 1 1 1 1 1 1 1 1 1 1 1 1 1 1 1 1 1 1 1 1 1 1 1 1 1 1 
##$CPDPRG= <>
##$CPDPRG1= <>
##$CPDPRG2= <>
##$CPDPRG3= <>
##$CPDPRG4= <mlev>
##$CPDPRG5= <mlev>
##$CPDPRG6= <mlev>
##$CPDPRG7= <mlev>
##$CPDPRG8= <mlev>
##$CPDPRGB= <>
##$CPDPRGT= <>
##$D= (0..31)
0 1 0 0 0 0 0 0 0 0.06 0 0 0 0 0 0 0.0002 0 0 0 0 0 0 0 0 0 0 0 0 0 0 
0 
##$DATE= 1173352543
##$DBL= (0..7)
120 120 120 120 120 120 120 120 
##$DBP= (0..7)
150 150 150 150 150 150 150 150 
##$DBP07= 0
##$DBPNAM0= <>
##$DBPNAM1= <>
$$ [...]
##$SUBNAM7= <"">
##$SUBNAM8= <"">
##$SUBNAM9= <"">
##$SW= 20.6930455092707
##$SWIBOX= (0..15)
0 0 3 0 0 0 0 0 0 0 0 0 0 0 0 0 
##$SW_h= 5175.983436853
##$TD= 65536
##$TD0= 1
##$TE= 683.16
##$TE2= 300
##$TE3= 300
##$TEG= 300
##$TL= (0..7)
0 120 120 120 120 120 120 120 
##$TP= (0..7)
150 150 150 150 150 150 150 150 
##$TP07= 0
##$TPNAME0= <>
##$TPNAME1= <>
##$TPNAME2= <>
##$TPNAME3= <>
##$TPNAME4= <>
##$TPNAME5= <>
##$TPNAME6= <>
##$TPNAME7= <>
##$TPOAL= (0..7)
0.5 0.5 0.5 0.5 0.5 0.5 0.5 0.5 
##$TPOFFS= (0..7)
0 0 0 0 0 0 0 0 
##$TUNHIN= 0
##$TUNHOUT= 0
##$TUNXOUT= 0
##$USERA1= <user>
##$USERA2= <user>
##$USERA3= <user>
##$USERA4= <user>
##$USERA5= <user>
##$V9= 5
##$VALIST= <valist>
##$VCLIST= <CCCCCCCCCCCCCCC>
##$VD= 0
##$VDLIST= <DDDDDDDDDDDDDDD>
##$VPLIST= <PPPPPPPPPPPPPPP>
##$VTLIST= <TTTTTTTTTTTTTTT>
##$WBST= 1024
##$WBSW= 4
##$XGAIN= (0..3)
0 0 0 0 
##$XL= 0
##$YL= 0
##$YMAX_a= 285235
##$YMIN_a= -401766
##$ZGOPTNS= <>
##$ZL1= 120
##$ZL2= 120
##$ZL3= 120
##$ZL4= 120
##$ABSF1= 16.45465
##$ABSF2= -4.238522
##$ABSG= 5
##$ABSL= 3
##$ALPHA= 0
##$AQORDER= 0
##$ASSFAC= 0
##$ASSFACI= 0
##$ASSFACX= 0
##$ASSWID= 0
##$AUNMP= <proc_1d>
##$AZFE= 0.1
##$AZFW= 0.1
##$BCFW= 0
##$BC_mod= 0
##$BYTORDP= 0
##$COROFFS= 0
##$CY= 12.5
##$DATMOD= 1
##$DC= 0
##$DFILT= <>
##$DTYPP= 0
##$F1P= 14.0000005364418
##$F2P= -0.99999901652339
##$FCOR= 0.5
##$FTSIZE= 32768
##$FT_mod= 6
##$GAMMA= 0
##$GB= 0
##$INTBC= 1
##$INTSCL= 1
##$ISEN= 128
##$LB= 0.3
##$LEV0= 0
##$LPBIN= 0
##$MAXI= 10000
##$MC2= 0
##$MEAN= 0
##$ME_mod= 0
##$MI= 0
##$NCOEF= 0
##$NC_proc= -3
##$NLEV= 6
##$NOISF1= 0
##$NOISF2= 0
##$NSP= 0
##$NTH_PI= 0
##$NZP= 0
##$OFFSET= 16.45465
##$PC= 1
##$PHC0= 232.9427
##$PHC1= 4.932638
##$PH_mod= 1
##$PKNL= yes
##$PPARMOD= 0
##$PSCAL= 4
##$PSIGN= 0
##$REVERSE= no
##$SF= 250.130016846066
##$SI= 32768
##$SIGF1= 0
##$SIGF2= 0
##$SINO= 400
##$SIOLD= 32768
##$SREGLST= <1H.CDCl3>
##$SSB= 0
##$STSI= 32768
##$STSR= 0
##$SW_p= 5175.98343685301
##$SYMM= 0
##$S_DEV= 0
##$TDeff= 65536
##$TDoff= 0
##$TI= <Analysis number 999999
Compound Code 99
Book Reference 9
Project Code 9>
##$TILT= no
##$TM1= 0
##$TM2= 0
##$TOPLEV= 0
##$USERP1= <user>
##$USERP2= <user>
##$USERP3= <user>
##$USERP4= <user>
##$USERP5= <user>
##$WDW= 1
##$XDIM= 32768
##$YMAX_p= 416479647
##$YMIN_p= -54883
$$ End of Bruker specific parameters
$$ ---------------------------------
##NTUPLES= NMR SPECTRUM
##VAR_NAME=  FREQUENCY,     SPECTRUM/REAL,   SPECTRUM/IMAG
##SYMBOL=    X,             R,               I
##VAR_TYPE=  INDEPENDENT,   DEPENDENT,       DEPENDENT
##VAR_FORM=  AFFN,          ASDF,            ASDF
##VAR_DIM=   32768,         32768,           32768
##UNITS=     HZ,            ARBITRARY UNITS, ARBITRARY UNITS
##FACTOR=    0.157963299565203, 1,           1
##FIRST=     4115.80210153695, 0,            0
##LAST=      -1060.18133531606, 0,           0
##MIN=       -1060.18133531606, -54883,      0
##MAX=       4115.80210153695, 416479647,    0
$$ Real data points
##PAGE= N=1
##DATA TABLE= (X++(R..R)), XYDATA
$$ [...]
16811c405O800r568J787N339K615j1339N971K3q576q238r24M804P226J6850P936
$$ -3405 3395 -6173 -4386 953 3568 -7771 -1800 -1777 -10353 -18591 -19515 -14711 -7485 9365 17301
16796A7301J2594J1394k952j4134k3164k2606j0471O805J209Q360J8609M995m048
$$ 17301 29895 41289 38337 24203 1039 -21567 -32038 -25233 -24024 -15664 2945 7940 3892
16783C892p068l118p820R089L018N92m832k023r599O458L306p847P121J5968m132
$$ 3892 -3176 -6294 -14114 -5025 -2007 -1415 -6247 -8270 -17869 -11411 -8105 -15952 -8831 7137 3005
16768C005k718O159p761n456P56o562R202P466m542J893j4281L407J4677O138
$$ 3005 287 6446 -1315 -6771 -6015 -12577 -3375 4091 -451 1442 -12839 -9432 5245 11383
16754A1383l224k0301p529J8521L808q09J2179J1610Q24n494Q665j7475j1814
$$ 11383 8159 -12142 -19671 -1150 2658 1849 14028 25638 26462 20968 29633 12158 344
16741C44l128J724J606P723m478l936m110J825r363m637j872M650J2701N979n367
$$ 344 -2784 -1060 546 8269 3791 -145 -4255 -2430 -11793 -16430 -18302 -13652 -951 5028 -339
16726c39o702K844R07Q740Q233j613J62Q753m353j3138l665j5390p022J1247K386
$$ -339 -7041 -4197 -3290 5450 13683 12070 12232 20985 16632 3494 -171 -15561 -22583 -11336 -8950
16711h950p979p861q648J9502J0500l110M640M915j746l091j4689j0930K867J8386
$$ -8950 -16929 -24790 -33438 -13936 -3436 -6546 -1906 3009 1263 -1828 -16517 -27447 -24580 -6194
16697f194J7407J4769P413k6220j0639R877K16M659k016p080o245r377R808j5668
$$ -6194 11213 25982 33395 7175 -3464 6413 6629 11288 9272 2192 -4053 -13430 -3622 -19290
16683a9290l285J0408r00J0683M487m35O292K834j0731k06l635p689K854J0774
$$ -19290 -22575 -12167 -13067 -2384 2103 1668 7960 10794 63 -143 -3778 -11467 -8613 2161
16669B161K967l351k439n966M848k542N21P546J2215n70p683o839J2840J7197
$$ 2161 5128 1777 -662 -6628 -1780 -4322 -3801 3745 15960 15390 7707 868 13708 30905
16655C0905N824j3040q718j1762P305j504p65n453L968J3680L351k466l480j1892
$$ 30905 36729 23689 14971 3209 10514 9010 8245 2792 6760 20440 23791 21325 17845 5953
16641E953k27K3345L972Q952p57r307j6034m938J220J2109J2030K1022N170m746
$$ 5953 5726 29071 33043 41995 41238 31931 15897 10959 12179 24288 36318 57340 62510 57764
16627E7764l639r60K019q258J4896K8525j4418m860n5n986J1030R51j684Q51n842
$$ 57764 54125 53165 55184 46926 61822 90347 75929 71069 71014 65028 76058 77009 75325 76176 70334
16612G0334j2657J5029N295J155l602J597L20K260r953j2268n918j1974l056R081
$$ 70334 57677 72706 78001 79156 75554 77151 77471 79731 69778 57510 51592 39618 36562 45643
16598D5643K2395p051j301j453k2832r909N87L0632J5477j0331P174O679j3975
$$ 45643 68038 60987 59686 58233 35401 25492 26079 56711 72188 61857 69031 75710 61735
16585F1735j2478J0579r6k0478q558L036N562O205J5272J1803m322L815J2605
$$ 61735 49257 59836 59740 39262 30704 33740 39302 45507 60779 72582 68260 72075 84680
16572H4680p716o11J965k753K432N096k077N14j972L418M930j623l825j1786j0212
$$ 84680 76964 76353 78318 75565 77997 83093 81016 81530 79558 82976 87906 86283 82458 70672 60460
16557F0460J6464Q446k928k8775j1459m043P209P193o560r328J3066J2833K017
$$ 60460 76924 85370 82442 53667 42208 38165 45374 52567 46007 36679 49745 62578 64595
16544F4595j3246J128m995j380r935q116M785j190r062n669K583O155j631J6063
$$ 64595 51349 52477 47482 46102 36167 28051 32836 31646 22584 16915 19498 25653 24022 40085
16530D0085n107k4476j2079O20Q411j073P609O337L642J0634O34p304r772j0112
$$ 40085 34978 10502 -1577 -957 7454 6381 13990 20327 23969 34603 35237 27933 18161 8049
16516H049j990P083n722l826J166j30M582m41j0729j88o274R28N892K627N783
$$ 8049 6059 13142 7420 3594 4760 4630 9212 8771 -1958 -2146 -8420 -7492 -1600 1027 6810
16501F810J2033j105m630j2079P618Q70m546J2633j717K536J440j4240J4086Q132
$$ 6810 18843 17738 13108 1029 8647 9517 4971 17604 15887 18423 19863 5623 19709 27841
16487B7841n504q417j5791j5403l676K0413L358O123j1146j172j004M498Q422
$$ 27841 22337 13920 -1871 -17274 -20950 -537 2821 8944 -2202 -3374 -4378 120 8542
16474H542n005j2731k945p492L965P372q41j6897o782J492j920j3554L666J0663
$$ 8542 3537 -9194 -12139 -19631 -15666 -8294 -9135 -26032 -32814 -31322 -33242 -46796 -43130 -32467
16460c2467Q827L934j482m290J796J249J2607Q374n50n526k710o612k611k19n138
$$ -32467 -23640 -19706 -21188 -25478 -23682 -22433 -9826 -1452 -2002 -7528 -10238 -16850 -19461 -19680 -24818
16445b4818Q973K852N538j0890N105J1859k1646J924J9512l638j2452n289K3447
$$ -24818 -15845 -12993 -7455 -18345 -13240 -1381 -23027 -21103 -1591 -5229 -17681 -22970 477
16432D77j06n79r10N324L66j6115l768J5076r408n532o683p51J4022R14r138p802
$$ 477 371 -208 -1118 4206 4572 -11543 -15311 -235 -9643 -15175 -21858 -22609 -8587 -7673 -16811 -24613
16416b4613R399q757o481L837J7884O630j3606m966O550O668m767o078N323K573
$$ -24613 -15214 -23971 -30452 -26615 -8731 -2101 -15707 -20673 -14123 -7455 -12222 -18300 -12977 -10404
16402a0404j906M003p95j2134M63J8609Q844j81o930n836P48K096j2132j729P59
$$ -10404 -12310 -8307 -9102 -21236 -20773 -2164 6680 6499 -431 -6267 -5519 -3423 -15555 -17284 -16525
16387a6525J2007J0965j0394p853L515L056k71M82K207n757L420L702j4950j3546
$$ -16525 -4518 6447 -3947 -11800 -8285 -5229 -5500 -5018 -2811 -8568 -5148 -1446 -16396 -29942
16373b9942J1786J7423j360q123M87j437n594K443J170L894N589j0612K57r018
$$ -29942 -18156 -733 -2093 -10216 -9729 -11166 -16760 -14317 -13147 -9253 -3664 -14276 -14019 -23037
16359b3037j1908J3087J2481q85k732R146M790p196j1050r556k321K2621O501
$$ -23037 -34945 -21858 -9377 -10262 -12994 -3848 942 -6254 -17304 -26860 -29181 -6560 -59
16346e9K377P632m047q096O56L351N110j4223Q15j9295r389K920K670R237K1695
$$ -59 2318 9950 5903 -2193 -1537 1814 6924 -7299 -6484 -25779 -35168 -32248 -29578 -20341 1354
16331A354Q208J1845o701j4371m099j1340j722K137L877R876M00j2489K243Q613
$$ 1354 9562 21407 14706 335 -3764 -15104 -16826 -14689 -10812 -936 -536 -13025 -10782 -2169
16317b169m725L028j19R682K0694m760j1846K629O60l215R22N653r029p527m556
$$ -2169 -6894 -3866 -3985 5697 26391 21631 9785 12414 13074 9859 10781 16434 7405 -122 -4678
16302d678r904J980J1778o630m564m600J5381P151j6341p122J426j3263m453J0547
$$ -4678 -14582 -12602 -824 -7454 -12018 -16618 -1237 5914 -10427 -17549 -16123 -29386 -33839 -23292
16288b3292N085O763p576j1237m822N182K5109r177k1819P321J1797K708R188
$$ -23292 -18207 -11444 -19020 -30257 -35079 -29897 -4788 -13965 -35784 -28463 -16666 -13958 -4770
16275d770J746j7446p100J877K18K464m408r067P568J8592R009m852K540J020
$$ -4770 -3024 -20470 -27570 -25693 -25475 -23011 -27419 -36486 -28918 -10326 -1317 -6169 -3629 -2609
16261b609J69J004L632J15m60K197P019J690m154k700p023j0522m636p657J330
$$ -2609 -2440 -1436 2196 2311 1851 4048 11067 12757 8603 5903 -1120 -11642 -16278 -23935 -22605
16246b2605J527r432k583J3235J6054q428l907o730j1865Q233J722M539J5338
$$ -22605 -21078 -30510 -33093 -19858 -3804 -12232 -16139 -22869 -34734 -26501 -24779 -20240 -4902
16233d902P875j1558n542K515L494j0941m154N211K255n210R174N704o617L243
$$ -4902 2973 -8585 -14127 -11612 -8118 -19059 -23213 -18002 -15747 -20957 -11783 -6079 -12696 -9453
16219i453J0140R89j5174K453K1360j36j4132o758l52Q300j3435r08l541J49r723
$$ -9453 687 1676 -13498 -11045 10315 10179 -3953 -10711 -11063 -2763 -16198 -17106 -20647 -20498 -30221
16204c0221J0074K0985L195k4780o023M108L230j0727n636J1123J0512O318M150
$$ -30221 -20147 838 4033 -20747 -26770 -22662 -19432 -30159 -35795 -24672 -14160 -7842 -3692
16191c692r502m457O250J0777N978j873J507k671K515N784l946K28o298j6563
$$ -3692 -13194 -17651 -11401 -624 5354 3481 4988 2317 4832 10616 6670 6898 600 -15963
16177a5963q624K906N80j781k451j258q284L301J5235K0674J665j1230n370R723
$$ -15963 -24587 -21681 -21101 -22882 -25333 -26591 -34875 -31574 -16339 4335 6000 -5230 -10600 -877
16163h77J2777P212j866j4728L916O866q690q005M280J533j4509L970j0408K186
$$ -877 11900 19112 17246 2518 6434 13300 4610 -3395 885 2418 -12091 -8121 -18529 -16343
16149a6343k392J902N833J5660J4090r243j3229m229n716O242o135K645L347m23
$$ -16343 -18735 -16833 -11000 4660 18750 9507 -3722 -7951 -13667 -7425 -13560 -10915 -7568 -7991
16135g991M233O121p110j6865m061K1924M315O152j851j0861j500M491P069Q444
$$ -7991 -3758 2363 -4747 -21612 -25673 -3749 566 6718 4867 -5994 -7494 -3003 4066 12510
16121A2510j1112p083m808m254J0788L694l649k660J0037R026M229j0044n309
$$ 12510 1398 -5685 -10493 -14747 -3959 -265 -3914 -6574 3463 12489 16718 6674 1365
16108A365L500j242p388m796J9N300n742J2944P92j3202L041j179j2014Q919J4775
$$ 1365 4865 3623 -3765 -8561 -8542 -3242 -8984 3960 4752 -8450 -5409 -6588 -18602 -9683 5092
16093E092k685r860J568n499Q010K104r194j1679R77K050J5696J299J43J012l234
$$ 5092 2407 -7453 -5885 -11384 -3374 -1270 -10464 -22143 -21166 -19116 -3420 -2121 -1978 -966 -4200
16078d200Q237j539K61J7167o627n851r10m161q23N721k627k3130o731J7452k051
$$ -4200 4037 2498 2759 19926 13299 7448 6538 2377 1554 7275 4648 -18482 -25213 -7761 -9812
16063i812k2410l090L736J4109J5157L875o690J046M048J6591k670j6185l399
$$ -9812 -32222 -35312 -31576 -17467 -2310 1565 -5125 -4079 -31 16560 13890 -2295 -5694
16050e694J1139l727j597j0414K444J0063O016J093N765J0608j4800j0495r15
$$ -5694 5445 1718 121 -10293 -7849 2214 8230 9323 15088 25696 10896 401 -514
16037e14M377l48J4840M036N920j0169j7660j7439j8422l827J8084J5421N748
$$ -514 3863 3515 18355 22391 28311 18142 482 -16957 -35379 -39206 -21122 -5701 47
16024D7J621l84J2180j1179m336J222j3336r303J2662N442l612K001M128J4374
$$ 47 1668 1284 13464 2285 -2051 -829 -14165 -23468 -10806 -5364 -8976 -6975 -2847 11527
16010A1527M945j4996j3620j6614l679J8958J9634k643j2397M069R466M355k193
$$ 11527 16472 1476 -12144 -28758 -32437 -13479 6155 3512 -8885 -4816 4650 9005 6812
15997F812j0655J816J142J278r682N377J0309m422N312J1914l900j8738n281l46
$$ 6812 -3843 -2027 -885 393 -9289 -3912 6397 1975 7287 19201 15301 -3437 -8718 -9064
15983i064j8036j0892O515M977k208N54P836J4321J8021Q419j0600j1106n460
$$ -9064 -27100 -37992 -31477 -26500 -28708 -28154 -20318 -5997 12024 20443 9843 -1263 -6723
15970f723m895N422J3795k331n894p811o520j829M589J2183p056q954n714n348
$$ -6723 -11618 -6196 7599 5268 -626 -8437 -14957 -16786 -12197 -14 -7070 -16024 -21738 -27086
15956b7086K3088R440l070m886N3p694n412J8356K21J1858j47j2723J983L275
$$ -27086 -3998 5442 2372 -2514 -2461 -10155 -15567 2789 3010 14868 14721 1998 3981 7256
15942G256q714m246k624k550p063K083K702k826O758L79j054L519Q486j1008p060
$$ 7256 -1458 -5704 -8328 -10878 -17941 -15858 -13156 -15982 -9224 -8845 -9899 -6380 2106 -8902 -15962
15927a5962k310L327N457K278J645n27l32N107O851k897j3442l085J927o651J941
$$ -15962 -18272 -14945 -9488 -7210 -5565 -6092 -6424 -1317 5534 2637 -10805 -13890 -11963 -18614 -16673
15912a6673N789N444M495q46l087R793q357l366Q246K283r2o560j6706k935O207
$$ -16673 -10884 -5440 -945 -1791 -4878 4915 -3442 -6808 1438 3721 3629 -2931 -19637 -22572 -16365
15897a6365J2263J3012m091k647K4217J09j2950j5595p598j5406O05P008N398
$$ -16365 -4102 8910 4819 2172 26389 26498 13548 -2047 -9645 -25051 -24446 -17438 -12040
15884a2040n36J346K468l83J7212J6994p802N00R096j0082k0872j3495k51Q633
$$ -12040 -12576 -11230 -8762 -9145 8067 25061 17259 17759 26855 16773 -4099 -17594 -17845 -9212
15870i212p70o125J275q333R69J8532L074j953M976o774q744L043j195L158M960
$$ -9212 -9982 -16107 -14832 -23165 -22196 -3664 -590 -2543 2433 -4341 -13085 -10042 -11237 -8079 -3119
15855c119P558N059j5307r60M505r276n98K267M911k974k18j932j649M057l235
$$ -3119 4439 9498 -5809 -6769 -2264 -11540 -12138 -9871 -4960 -7934 -8152 -10084 -11733 -7676 -10911
15840a0911o152j449k356p609q797o388j771O404l989j765J9803P280l170j1215
$$ -10911 -17063 -18512 -20868 -28477 -37274 -43662 -45433 -39029 -43018 -44783 -24980 -17700 -20870 -32085
15826c2085j2244M105J2036N63p950J030R268K767j636M150r974P978J5369M07
$$ -32085 -44329 -40224 -28188 -27625 -35575 -34545 -25277 -22510 -24146 -19996 -29970 -21992 -6623 -6216
15812f216M715P49l063P561K821j4196p879L686J6127N967k532j0996M668K88
$$ -6216 -1501 -752 -3815 3746 6567 -7629 -15508 -11822 4305 10272 7740 -3256 1412 1700
15798A700j1922o472j6017K441k533J0868j0134k2814P175J7434K3723J1569m077
$$ 1700 -10222 -16694 -32711 -30270 -32803 -21935 -32069 -54883 -47708 -30274 -6551 5018 941
15785I41j2826J196k22q699m401R213J6174k386P40m971p309J537q276r511L81
$$ 941 -11885 -10689 -10911 -19610 -24011 -14798 1376 -1010 -270 -5241 -12550 -11013 -19289 -28800 -28419
15770b8419N840R473p233p772J4808M655r477o236j931K334K893M945k89j2502
$$ -28419 -22579 -13106 -20339 -28111 -13303 -8648 -18125 -24361 -26292 -23958 -21065 -16120 -16409 -28911
15756b8911j0592N925J0697P855O974k462J61k523j3294p405J5077J0506o552
$$ -28911 -39503 -33578 -22881 -15026 -8052 -10514 -10353 -12876 -26170 -33575 -18498 -7992 -14544
15743a4544q683l053p061l500J0962J295J408j1519N300J1697P70r517J4860J8531
$$ -14544 -23227 -26280 -33341 -36841 -25879 -24584 -23176 -34695 -29395 -17698 -16928 -26445 -11585 6946
15729F946j5481j1778J0155J0626Q531j2273n205l293q461k160r93j143J6803
$$ 6946 -8535 -20313 -10158 468 8999 -3274 -8479 -11772 -20233 -22393 -23386 -24529 -7726
15716g726Q953L326L54M948k793j1232j639J8726r015r089L381n51J122l06K233
$$ -7726 1227 4553 4907 9855 7062 -4170 -5809 12917 3902 -5187 -1806 -2357 -1235 -1541 692
15701F92J4645j881j3780j0226M161J6420n540j7180J506r73n166J5023k515k0676
$$ 692 15337 13456 -324 -10550 -6389 10031 4491 -12689 -11183 -12156 -17322 -2299 -4814 -25490
15687b5490J2814J3996o045p168M669J6758L11P15k666o46j307j0484r178O388
$$ -25490 -12676 1320 -4725 -11893 -7224 9534 9845 10560 7894 7248 5941 -4543 -13721 -7333
15673g333P864p013Q180n067l292K094l557n536J939K577O01m612m97N660N969
$$ -7333 531 -6482 1698 -3369 -6661 -4567 -8124 -13660 -11721 -9144 -8543 -13155 -13652 -7992 -2023
15658b023n079k972O642M076P486o031p505m702q203L689K406P210J4457K267
$$ -2023 -7102 -10074 -3432 644 8130 2099 -5406 -10108 -18311 -14622 -12216 -5006 9451 11718
15644A1718o575j7558m510O307k301n985P220m320J4367K5047P961j7667j3113
$$ 11718 5143 -12415 -16925 -10618 -12919 -18904 -11684 -16004 -1637 23410 31371 13704 591
15631E91n923n806j0399r15q190N078J1102N667k391N834j441L77j6931l101K1441
$$ 591 -5332 -11138 -21537 -22452 -30642 -25564 -14462 -8795 -11186 -5352 -6793 -6416 -23347 -26448 -5007
15616e007L598k981o536j3195k652P945K723J0722P879j556n857J0902m09l64
$$ -5007 -1409 -4390 -10926 -24121 -26773 -18828 -16105 -5383 2496 940 -4917 5985 5576 5212
15602E212J495J93l689K914M227J348j1828j7538q544J6654J1926P934j4446j3036
$$ 5212 6707 6900 3211 6125 10352 11700 -128 -17666 -26210 -9556 2370 10304 -4142 -17178
15588a7178K277l344j5345l938J6230N326J2660N922m903p650K018P485M137L6
$$ -17178 -14901 -18245 -33590 -37528 -21298 -15972 -3312 2610 -2293 -9943 -7925 -440 3697 3733
15574C733n607j62j4867k490R914K849J2550M611j5809l867J505N394j82j0705
$$ 3733 -1874 -2036 -16903 -19393 -9479 -6630 5920 10531 -5278 -9145 -7640 -2246 -2428 -13133
15560a3133r566P903Q087l300J262R261L213j1938n110L321Q660N972k231j1692
$$ -13133 -22699 -14796 -6709 -10009 -8747 514 3727 -8211 -13321 -10000 -1340 4632 2401 -9291
15546i291m478K360k453N422N966l348P35P202m818K60p445k024m385L911L37
$$ -9291 -13769 -11409 -13862 -8440 -2474 -5822 -5087 2115 -2703 -2443 -9888 -11912 -16297 -12386 -12049
15531a2049L268k776p422o990L323j0992N666J1410J7267Q832M517n123k938k370
$$ -12049 -8781 -11557 -18979 -25969 -22646 -33638 -27972 -16562 705 9537 14054 8931 5993 3623
15517C623o49j846k336k026j2133Q281N638L872r311l925O947N323k170m532J899
$$ 3623 2974 1128 -1208 -3234 -15367 -7086 -1448 2424 -6887 -10812 -3865 1458 -712 -5244 -3345
15502c345m781o991K493J734o909J0647J0887m972j756J3921L170j912O92o710
$$ -3345 -8126 -15117 -12624 -10890 -17799 -7152 3735 -1237 -2993 10928 14098 12186 12878 6168
15488F168j0076l800J666P177K294j0379O598R413q316p029m242q789k693M273
$$ 6168 -3908 -7708 -6042 1135 3429 -6950 -352 9061 745 -6284 -10526 -19315 -22008 -17735
15474a7735m86Q132J3423J038n566m994n310N0q794P61K4932J8107P361n537j8815
$$ -17735 -18221 -10089 3334 4372 -1194 -6188 -11498 -11448 -20242 -19481 5451 23558 30919 25382 6567
15459F567q409K569j520K282k165Q129O132K311r615Q245Q054q779j4133J629
$$ 6567 -1842 727 -793 1489 -676 7453 13585 15896 6281 14526 22580 13801 -332 1297
15445A297n375p578l852J6547R870K609J0080K320p006l611k0846q605R736K0789
$$ 1297 -4078 -11656 -15508 1039 10909 13518 23598 25918 18912 15301 -5545 -14150 -4414 16375
15431A6375M570o958j9895K2945N224j3657J0980l916K508l47K059N097p123q775
$$ 16375 20945 13987 -5908 17037 22261 8604 19584 15668 18176 17829 19888 24985 17862 9087
15417I087J778k160o724L148k3M122K024J3824j083M463K1042q412j3900P35j0992
$$ 9087 10865 8705 1981 5129 5106 9228 11252 25076 23993 28456 49498 41086 27186 27921 16929
15402A6929o050K239l238q233n638j6088k919O77M628L220k309p33L782J1165
$$ 16929 10879 13118 9880 1647 -3991 -20079 -22998 -22321 -17693 -14473 -16782 -17515 -13733 -2568
15388b568R485N48r692m150j432n25K1538J1082r048n733l144q615J412L325K1626
$$ -2568 6917 7465 -2227 -6377 -7809 -8334 13204 24286 15238 9505 6361 -2254 -842 2483 24109
15373B4109L388n197K015R154r024j191j1913j686O985p868o705M217O476o665
$$ 24109 27497 22300 24315 33469 24445 23254 11341 9655 16640 8772 2067 6284 12760 6095
15359F095r450m086j1174o044K118O612P782O893R259P740j049j5974J2149J1411
$$ 6095 -3355 -7441 -18615 -24659 -22541 -15929 -8147 -1254 8005 15745 14696 -1278 10871 22282
15345B2282q540j1458j4903j1198N337K725M573R387l415j1577N297J2089m159
$$ 22282 13742 2284 -12619 -23817 -18480 -15755 -11182 -1795 -5210 -16787 -11490 599 -3560
15332c560O671J4605J364m80O695m350j6655j8760J6349n389j0278q408k033O661
$$ -3560 3111 17716 19080 18600 25295 20945 4290 -14470 1879 -3510 -13788 -22196 -24229 -17568
15318a7568j416p33Q428J0346n370k574Q018J9196O842o105q971j7117k429K696
$$ -17568 -18984 -19717 -11289 -943 -6313 -8887 -869 18327 25169 19064 10093 -7024 -9453 -6757
15304f757M447N331M27k647O633O670Q246j5555j6466q521J791P616J3138J8348
$$ -6757 -2310 3021 3448 801 7434 14104 22350 6795 -9671 -18192 -16401 -8785 4353 22701
15290B2701M526q903j2071P281R50m350j7067p876n178k624J3198K849j2384M974
$$ 22701 27227 18324 6253 13534 14484 10134 -6933 -14809 -19987 -22611 -9413 -6564 -18948 -13974
15276a3974R61j0315J3590J1001J4627L401q731j4625L127J0012M755K197k1833
$$ -13974 -13013 -23328 -9738 1263 15890 19291 10560 -4065 -938 9074 13829 16026 -5807
15263e807p308K699k114L701J1237j4923m369Q299n111k969j066P228N73J286
$$ -5807 -13115 -10416 -12530 -8829 2408 -12515 -16884 -8585 -13696 -16665 -17731 -10503 -9930 -8644
15249h644k798Q849j94j0057r589l258O881Q446j2548Q55J3923M071j213o875
$$ -8644 -11442 -2593 -2787 -12844 -22433 -25691 -18810 -10364 -22912 -22057 -8134 -4063 -5276 -12151
15235a2151M790Q934J1533o72q507j4203j494K485J0496k72k167P815p319n694
$$ -12151 -7361 1573 13106 12434 3927 -10276 -11770 -9285 1211 939 -1228 6587 -732 -6426
15221f426J316j3305j899K735k216J2232m999O024Q368j5329n723M783N002K362
$$ -6426 -5110 -18415 -20314 -17579 -19795 -7563 -12562 -6538 1830 -13499 -19222 -14439 -9437 -7075
15207g075o879j035J1695Q401l84r691n974N351J030L85R734m753m530o448n781
$$ -7075 -13954 -14989 -3294 5107 4723 -4968 -10942 -5591 -4561 -4176 5558 805 -3725 -10173 -15954
15192a5954N190Q285j755l401p091M984R600Q168n080n937j1375j0697N181Q640
$$ -15954 -10764 -2479 -4234 -7635 -14726 -9742 -142 8026 2946 -2991 -14366 -25063 -19882 -11242
15178a1242J8626L511l873j9026q558Q367J3450N768j393l354r496J996Q869O437
$$ -11242 7384 10895 7022 -12004 -20562 -12195 1255 7023 5630 2276 -7220 -5224 3645 10082
15164A0082o914q320r354k02O909J2270K474j6084O108k220m406p016N000J1227
$$ 10082 3168 -5152 -14506 -14708 -7799 4471 6945 -9139 -3031 -5251 -9657 -16673 -11673 -446
15150d46k802j7024L43J3842m533j425R414J0814Q797k118p013j234k687m70J0628
$$ -446 -3248 -20272 -19929 -6087 -10620 -12045 -2631 8183 16980 14862 7849 6615 3928 3458 14086
15135A4086O925j1134j1006p269J1570Q839J7836J129j2508j3735k0674n346M844
$$ 14086 21011 9877 -1129 -8398 3172 12011 29847 30976 18468 4733 -15941 -21287 -16443
15122a6443j209N723M192J475N758n229o380R620M171J2022N911l696j6316l628
$$ -16443 -17652 -11929 -7737 -6262 -504 -5733 -12113 -2493 1678 13700 19611 15915 -401 -4029
15108d029j556m18L338Q752l65p597n499r655L199M246J3760j670j1347r127j06
$$ -4029 -5585 -6003 -2665 6087 5722 -1875 -7374 -17029 -13830 -9584 4176 2506 -8841 -17968 -18074
15093a8074Q177m079M776P969j2482m90R062J8294N037j3134K110P630Q330L478
$$ -18074 -9897 -13976 -9200 -1231 -13713 -14203 -5141 13153 18190 5056 7166 14796 23126 26604
15079B6604p234k1976j2190j511m547K275J0187R433j0781k7538Q60N100J396
$$ 26604 19370 -2606 -14796 -16307 -20854 -18579 -8392 1041 -9740 -37278 -36418 -31318 -29922
15066b9922J5539J0735j2716r876l555J2088j0201j1431j609M755J9838P487O797
$$ -29922 -14383 -3648 -16364 -26240 -29795 -17707 -27908 -39339 -40948 -36193 -16355 -8868 -2071
15053b071M366J0702L722j3138q594M434R080o490k606J600j3524J0160R517O332
$$ -2071 2295 12997 16719 3581 -5013 -579 8501 2011 -595 1005 -12519 -2359 7158 13490
15039A3490j4514q353P559K61j5511Q484p874M856M696J442r387p327J0622J0607
$$ 13490 -1024 -9377 -1818 -1557 -17068 -8584 -16458 -11602 -6906 -5464 -14851 -22178 -11556 -949
15025i49P958n869r512m380K19R150N037r272P648J2487R312N67q628J4714J330
$$ -949 7009 1140 -8372 -12752 -12533 -3383 1654 -7618 30 12517 21829 22396 13768 28482 29812
15010B9812j0055j1716m997n040q971R21M627L642L875O021O833r02J726q229
$$ 29812 19757 8041 3044 -1996 -10967 -10046 -5419 -1777 2098 8119 14952 14050 15776 7547
14996G547j0553k752l401R076R055P136N595n637j8575j4640k09q16Q345J4738
$$ 7547 -3006 -5758 -9159 -83 8972 16108 21703 16066 -2509 -17149 -17358 -18174 -9829 4909
14982D909q181j0852q844J1839J1817K365K733j891k770P728L091L822j1169m259
$$ 4909 -3272 -14124 -22968 -11129 688 3053 5786 3895 1125 8853 11944 15766 4597 338
14968C38L43k090R70O90N163N803J0552j320j0403j2065p259j135J4531n98j0913
$$ 338 681 -1409 -439 251 5414 11217 21769 20449 10046 -2019 -9278 -10413 4118 3520 -7393
14953g393K495o521j0462o971Q683J0541Q759J6969o543m995M617m045k913p577
$$ -7393 -4898 -11419 -21881 -28852 -20169 -9628 -869 16100 9557 4562 9179 5134 2221 -5356
14939e356r019q68N567k42l235p742O496J0378N166O2p782K009J3194o012R36
$$ -5356 -14375 -15243 -9676 -9918 -13153 -20895 -14399 -4021 1145 1207 -6575 -4566 8628 2616 3552
14924C552j6616K620Q192n199J135j488j0481r124O809O574J004P874j810N764
$$ 3552 -13064 -10444 -2252 -7451 -6316 -7804 -18285 -27409 -20600 -14026 -13022 -5148 -6958 -1194
14910a194J142p889m07M665J0350r282J1149Q78j3498L9Q542l278l120l148K65
$$ -1194 -52 -7941 -8348 -3683 6667 -2615 8534 9412 -4086 -4047 4495 1217 -1903 -5051 -4786
14895d786M083M656P188o712L51j0171j2598p688L322O144O274J218q16j4273
$$ -4786 -703 3953 11141 4429 4780 -5391 -17989 -25677 -22355 -16211 -9937 -8719 -9535 -23808
14881b3808M80L705J9648K114j0900q779M586R691J2826J359j6016o289R221J0832
$$ -23808 -23328 -19623 25 2139 -8761 -17540 -12954 -3263 9563 10922 -5094 -11383 -2162 8670
14867H670m20P030N452j3473j1836R958L953n954j432M152j6861j7606P831J7704
$$ 8670 8250 15280 20732 7259 -4577 5381 9334 3380 1948 6100 -10761 -28367 -20536 -2832
14853b832J1517o8L34m636k0200l075O190M720K488M016j9170J0437J9754n028
$$ -2832 8685 8617 8951 4315 -15885 -18960 -12770 -8050 -5562 -1546 -20716 -10279 9475 4447
14839D447k6627k881K2661J3283q064p003M596K0703j52R199P713k1560m20j2909
$$ 4447 -22180 -25061 -2400 10883 2819 -4184 412 21115 20963 30162 37875 16315 15895 2986
14825B986n356r729L088n78j2495n278P071K3939R548j1882r563N26J5292Q197
$$ 2986 -2370 -12099 -9011 -9589 -22084 -27362 -20291 3648 13196 1314 -8249 -7723 7569 15766
14811A5766L710j2459p940J510P649j4472l702R127O416j997m023P354L263n515
$$ 15766 19476 7017 -923 587 8236 -6236 -9938 -811 5605 3608 -415 6939 10202 4687
14797D687k707r028K4J2006L567K713O929K46l654j780m579q036L567N238o765
$$ 4687 1980 -7048 -7024 4982 8549 11262 18191 18437 14783 13003 8424 388 3955 9193 2428
14782B428o525Q182O299K318j2885j0830R589N563L547l724J429N234M038l945
$$ 2428 -4097 4085 10384 12702 -183 -11013 -1424 4139 7686 3962 5391 10625 14663 10718
14768A0718j1801m346l983k631Q067J1082L575l137K732j3829J722L600N501R990
$$ 10718 -1083 -5429 -9412 -12043 -3976 7106 10681 7544 10276 -3553 -1831 1769 7270 17260
14754A7260J9288Q54j6426j0869j0812n474J1787mj2333L584P281j1225l494k431
$$ 17260 36548 37402 20976 10107 -705 -6179 5608 5604 -6729 -3145 4136 -7089 -10583 -13014
14740a3014m209j920R237J2925P529n05j5843j0430n451M228O812M150q02l952
$$ -13014 -17223 -19143 -9906 3019 10548 10043 -5800 -16230 -21681 -17453 -10641 -6491 -7293 -11245
14726a1245r169J02o041J4489N734j0907M126J051J2639L619Q641M13M208q362
$$ -11245 -20414 -20312 -26353 -11864 -6130 -17037 -12911 -11860 779 4398 13039 13452 17660 9298
14712I298j1691j4154K034O594K2861j1435j0419l883j223Q27R259J0833p006
$$ 9298 -2393 -16547 -14513 -7919 14942 3507 -6912 -10795 -12018 -11191 -1932 8901 1895
14699A895o175J3428M588q185m918j3189J915k922o29L786J987J936m100k187
$$ 1895 -4280 9148 13736 5551 633 -12556 -10641 -13563 -14192 -10406 -8419 -6483 -10583 -12770
14685a2770Q450O555J0323n491p221O050N218o354q574K812Q764J2832J0423n979
$$ -12770 -4320 2235 12558 7067 -154 5896 11114 4760 -3814 -1002 7762 20594 31017 25038
14671B5038j9638k0127L056J959m485L51J964N759l213n838K38J2991O243N349
$$ 25038 5400 -14727 -11671 -9712 -14197 -13846 -11882 -6123 -9336 -15174 -14936 -1945 4298 9647
14657I647k513j8335J3652R483j5825k608P62N72J9794P607N016p632k151j779
$$ 9647 7134 -11201 2451 11934 -3891 -6499 -5737 -5165 14629 22236 27252 19620 17469 15690
14643A5690j6474m60O175m695j5872L64J877k187J2557O752r48k117r594K070
$$ 15690 -784 -1244 4931 236 -15636 -15272 -13395 -15582 -3025 3727 2779 662 -8932 -6862
14629f862J9771m036j6063m718K084j5435m342J609J1199L165N046L267J689Q349
$$ -6862 12909 8873 -7190 -11908 -9824 -25259 -29601 -27992 -16793 -13628 -8582 -5315 -3626 4723
14615D723o011K291j145n013j713J410J719m376R506P044j726K510p086N681o135
$$ 4723 -1288 1003 -142 -5155 -6868 -5458 -3739 -8115 1391 8435 6709 9219 2133 7814 1679
14600A679j2830J2722M35k2950j5336N230J3570K0518R478P28L049K803r569q686
$$ 1679 -11151 1571 2006 -20944 -36280 -31050 -17480 3038 12516 13244 16293 19096 9527 841
14586H41k256N714J7429k978j0958R016K105l697r476J1472P609R131n288q470
$$ 841 -1415 4299 21728 18750 7792 16808 18913 15216 5740 17212 24821 33952 28664 20194
14572B0194J3166N831p903j4850k246j1619l047P669J659k132k588N464k27p69
$$ 20194 33360 39191 31288 16438 14192 2573 -474 7195 8854 6722 4134 9598 9371 8602
14558H602l645K317n130l367r751j3536m650J3281K4057l329j075K997L64o930
$$ 8602 4957 7274 2144 -1223 -10974 -24510 -29160 -15879 8178 4849 3774 6771 7135 205
14544B05o50R294K874j8434p953P382J1861J1172p485n639J5039L544q918j4855
$$ 205 -445 8849 11723 -6711 -14664 -7282 4579 15751 8266 2627 17666 21210 12292 -2563
14530b563M205O840p364J6501R382o112j5136K971o461K303M206J7890q397q695
$$ -2563 1642 8482 1118 17619 27001 20889 5753 8724 2263 4566 8772 26662 18265 9570
14516I570K159J1865M732K921j9628j2416k148K753q673k509j0391m518J0257
$$ 9570 11729 23594 28326 31247 11619 -797 -2945 -192 -8865 -11374 -21765 -26283 -16026
14503a6026K783J1555L302j768p115N093j051l856k191J1503o53L035J9L869N643
$$ -16026 -13243 -1688 1614 -154 -7269 -2176 -3227 -7083 -9274 2229 1576 4611 4630 8499 14142
14488A4142j0241k209J238O311O609o113q729j104J597k301J960m811j500j413
$$ 14142 3901 1692 2930 9241 15850 9737 1008 -96 1501 -800 1160 -3651 -5151 -6564
14474f564J1406j175l090J201j2363L896j6470P560K4345P005j5894p782N797
$$ -6564 4842 3667 577 1778 -10585 -6689 -23159 -15599 8746 15751 -143 -7925 -2128
14461b128J0163r82j308m85P264L376N041q222j6587o298P712L486j2058j0665
$$ -2128 8035 7053 5745 5260 12524 15900 20941 12719 -3868 -10166 -2454 1032 -11026 -21691
14447b1691m244Q320P005k689k977J4432J3791o133m796k198m278J728J581J438
$$ -21691 -25935 -17615 -10610 -13299 -16276 -1844 11947 5814 1018 -1180 -5458 -3730 -2149 -711
14433g11M503j460j1928k563O065J0314P679l050l807K410L267J9777P524o014
$$ -711 3792 2332 -9596 -12159 -6094 4220 11899 8849 5042 7452 10719 30496 38020 32006
14419C2006n536j2781k6246P629J1870l466R49O15j2894q747q08R287P162Q423
$$ 32006 26470 13689 -12557 -4928 6942 3476 4425 5040 -7854 -16601 -17409 -8122 -960 7463
14405G463P109N928M125M038k328r878n422j336l462N768p232j6043m535l930
$$ 7463 14572 20500 24625 28663 26335 16457 11035 9699 6237 12005 4773 -11270 -15805 -19735
14391a9735M032J0997K2248P854j3088l103J3611j695l655m074q662N15p484n782
$$ -19735 -15703 -4706 17542 25396 12308 9205 22816 21121 17466 13392 4730 5245 -2239 -8021
14377h021m086k552Q424N791J0871L248p59J5341l419j2334j682l011j2244q55
$$ -8021 -12107 -14659 -6235 -444 10427 13675 12916 28257 24838 12504 10822 7811 -4433 -5288
14363e288J2521N895n683j017o506p903j466O422K166L863N526j0802l166J610
$$ -5288 7233 13128 7445 6428 -78 -7981 -9447 -3025 -859 3004 8530 -2272 -5438 -3828
14349c828J6428n344l573q50j1138N615R658p694j2385R126j0748j1386N133N953
$$ -3828 12600 7256 3683 2833 -8305 -2690 6968 -726 -13111 -3985 -14733 -26119 -20986 -15033
14335a5033P037n515q187N518J3570j80n818l821o426J1643O124l49O722J441
$$ -15033 -7996 -13511 -21698 -16180 -2610 -2790 -8608 -12429 -18855 -7212 -1088 -1437 5285 6726
14321F726r246k0313K217J3881p069P515J0137n317o714J1133O124q763m876j3829
$$ 6726 -2520 -22833 -20616 -6735 -13804 -6289 3848 -1469 -8183 2950 9074 311 -4565 -18394
14307a8394K526K209n675l128j719j036Q420Q319J8837O972L266j351q742j1429
$$ -18394 -15868 -13659 -19334 -22462 -24181 -25217 -16797 -8478 10359 17331 20597 19246 10504 -925
14293i25k185M787O266l670k488j0296p220J64J3480K986n677O543k083k080M098
$$ -925 -3110 1677 7943 4273 1785 -8511 -15731 -15567 -2087 899 -4778 1765 -318 -2398 1700
14278A700R03j2642J0876J1821J033j4244J409K3765L985j2611o825o521J0992
$$ 1700 2603 -10039 837 12658 13691 -553 856 24621 28606 15995 9170 2649 13641
14265A3641J2754j67m760m679n814n261K7M284O184j0162j0182m545j47Q536O745
$$ 13641 26395 26228 21468 16789 10975 5714 5741 10025 16209 6047 -4135 -8680 -8827 -291 6454
14250F454p436J0900P572j6671M77J3123o016n527O749m674m912K816k613R600
$$ 6454 -982 9918 17490 819 1296 14419 8403 2876 9625 4951 39 2855 242 9842
14236I842k128l802K2199J0221j4017j4499J266K696L18n459r680J371J2785R985
$$ 9842 7714 3912 26111 36332 22315 7816 9082 11778 12096 6637 -3043 -1672 11113 21098
14222B1098q033j936O42O133Q480q182j0876O232J2151J4428k075K157J1454p372
$$ 21098 13065 11129 11771 17904 26384 18202 7326 13558 25709 40137 38062 40219 51673 44301
14208D4301j3689n09k724J0927R055q407R63O348J0056J3876n750m772j0476l172
$$ 44301 30612 30103 27379 38306 47361 38954 39917 46265 56321 70197 64447 59675 49199 46027
14194D6027p830K982O476R048m949j648O540o62o93k458J5235r51j8401j072O682
$$ 46027 38197 41179 47655 56703 51754 50106 56646 55984 55291 52833 68068 67117 48716 47644 54326
14179E4326O879K34l009Q232K0255N413m102j1063m502j1238J7836J0224k877
$$ 54326 61205 61439 58430 66662 86917 92330 88228 77165 72663 61425 79261 89485 86608
14166H6608p577k960N112o00n309j4828J4630J5980l073O154j054j5321j3365
$$ 86608 79031 76071 81183 80583 75274 60446 75076 91056 87983 94137 93083 77762 64397
14153F4397K846O204j332J3411k346J2201P957o443j4358J3651J1986P617J5683
$$ 64397 67243 73447 72115 85526 83180 95381 103338 96895 82537 96188 108174 115791 131474
14140A31474N996m897o134M441J4952K3761J7830K7838O5498R7540J11447J33917
$$ 131474 137470 132573 126439 130880 145832 169593 187423 215261 280759 378299 489746 623663
14128F23663J29654J19039J18976Q9205N8512K5462m4798q5524j05655j14790
$$ 623663 753317 872356 991332 1080537 1139049 1164511 1119713 1034189 928534 813744
14118H13744j33266j16999j15039r8156q5877m4107l4156j3921j1460k1043j6869
$$ 813744 680478 563479 448440 350284 264407 220300 186144 172223 160763 139720 122851
14107A22851j5157n669j1032p700n196M246n109j4058p44M420p213m135K510P578
$$ 122851 107694 102025 90993 83293 78097 82343 77234 63176 62432 66852 59639 55504 58014 65592
14093F5592K529j0107j6652K31o243j829J861j981m522o065o531m514N902m85
$$ 65592 68121 58014 41362 41593 35350 33521 35382 33401 28879 22814 16283 11769 17671 17186
14079A7186O27M964J919J7283L227o290j563n441Q660K068L667R361R296P579
$$ 17186 17813 22777 24696 41979 45206 38916 37353 31912 40572 42640 46307 55668 64964 72543
14065G2543N247J2006M846J3590M336p739Q21Q592j8412j434q229o141p652k8338
$$ 72543 77790 89796 94642 108232 112568 104829 105650 114242 95830 94396 86167 80026 72374 44036
14051D4036k2905P53l603n297q384n185P103N544m615N06K925L515Q15j2777q341
$$ 44036 21131 21884 18281 12984 4600 -585 6518 12062 7447 7953 10878 14393 15208 2431 -5910
14036e910J2650M795R945J1545j7135m471p795n17n400M954J1787O379o815r0
$$ -5910 6740 11535 21480 33025 15890 11419 3624 3107 -2293 2661 14448 20827 14012 13922
14022A3922N638k21p97n1k50q09O992N813P676j1803K019K694j447M179k835M327
$$ 13922 19560 19339 18542 18491 18241 17432 24424 30237 37913 26110 28129 30823 29376 33555 30720 35047
14006C5047n411o431k460n253j0575O194q90n061l506R76J1437p429j0501J9718
$$ 35047 29636 23205 20745 15492 4917 11111 10221 5160 1654 2630 14067 6638 -3863 15855
13992A5855Q947p130j7896n59O103L720M437J1611L821l486J0535k584l278k063
$$ 15855 24802 17672 -224 -783 5320 9040 13477 25088 28909 25423 35958 33374 30096 28033
13978B8033p465p295j126L053L353m264o816q869r257R965J3689J3998j0536r228
$$ 28033 20568 13273 12147 15200 18553 14289 7473 -1396 -10653 -688 13001 26999 16463 7235
13964G235J4055p600r436l291j1903m642R884O735k614l983k265O827N383n347
$$ 7235 21290 13690 4254 963 -10940 -15582 -5698 1037 -1577 -5560 -7825 -998 4385 -962
13950i62k294m497J540k827k780n973Q0N070R675J3634J832o329L58J531K803
$$ -962 -3256 -7753 -6213 -9040 -11820 -17793 -17713 -12643 -2968 10666 12498 6169 6527 8058 10861
13935A0861r334q703K489O177N359Q917J650p140j343J669R24o80m908j0740R019
$$ 10861 1527 -7176 -4687 1490 6849 15766 17416 10276 8933 10602 11526 10846 5938 -4802 4217
13920D217Q597J1477N35n497R01j1084r565N600Q512j246r06K615m854M957L962
$$ 4217 12814 24291 24826 19329 20230 9146 -419 5181 13693 12447 11541 14156 9302 14259 18221
13905A8221p696J0734K90m925k019r16j2983M282L173R487R470j3448J2390N119
$$ 18221 10525 21259 21549 16624 14605 13689 706 4988 8161 17648 27118 13670 26060 31179
13891C1179o458o273q254o060o827o354J9638J6498j7608j8490l770J6453P483
$$ 31179 24721 18448 10194 4134 -2693 -9047 10591 27089 9481 -9009 -12779 3674 11157
13878A1157q591R047Q85j663J6833J5212k443j0100p931r92O114j7903k565l336
$$ 11157 2566 11613 12498 10835 27668 42880 40437 30337 22406 21414 27528 9625 7060 3724
13864C724N706l40j0383K452j767M145Q746m766P046l065j0984n8J6337k56j6247
$$ 3724 9430 9090 -1293 1159 -608 3537 12283 7517 14563 11498 514 456 16793 16537 290
13849B90P49K33o904K314N157J4771l170J943p769J2865Q242N709M177q094j102
$$ 290 1039 1272 -5632 -3318 1839 16610 13440 15383 7614 20479 28721 34430 38607 30513 29411
13834B9411K431j0387j7825R728O740O504m195j201j576n363m030P110Q277j3872
$$ 29411 31842 21455 3630 13358 20098 26602 22407 21206 19630 14267 10237 17347 25624 11752
13820A1752n058m530j8041J0523Q062l098p145O252P812K888O679o814j0790n013
$$ 11752 6694 2164 -15877 -5354 2708 -390 -7535 -1283 6529 9417 16096 9282 -1508 -6521
13806f521o214j3180J4047M513N105J5134J1793r089n064L639j2401r866j4791
$$ -6521 -12735 -25915 -11868 -7355 -2250 12884 24677 15588 10524 14163 1762 -8104 -22895
13793b2895n745Q603r3K991O458J1037q817j70Q037R299m426J3537J0253M785
$$ -22895 -28640 -20037 -20130 -17139 -10681 356 -8461 -8631 -594 8705 4279 17816 28069 32854
13779C2854l723o640o430j141j671K359K755o070K438J1186q400o428l202r539
$$ 32854 29131 22491 16061 14920 13249 15608 18363 12293 14731 25917 17517 11089 7887 -1652
13765a652p776R407Q046K094n037J0561J0227M211N012j7664q380p078M057J549
$$ -1652 -9428 -21 8025 10119 5082 15643 25870 30081 35093 17429 9049 1971 6028 7577
13751G577q51N509R926j0050n750j0794n653N163j274K561N223l406j4383J0227
$$ 7577 6726 12235 22161 12111 6361 -4433 -10086 -4923 -6197 -3636 1587 -1819 -16202 -5975
13737e975l725j1434K1374K0835J7482l735r027J387J108q987j0019l594M069
$$ -5975 -9700 -21134 240 21075 38557 34822 25795 27182 28290 19303 9284 5690 9759
13724I759O499P005l287j3756j596O407j7476p978J0989N315j1691j7311J2232
$$ 9759 16258 23263 19976 6220 4624 11031 -6445 -14423 -3434 1881 -9810 -27121 -14889
13711a4889M086m725K741P73J3367J8617J22o262k40n814l485J4M970K50k105
$$ -14889 -10803 -15528 -12787 -12014 1353 19970 20092 13830 13590 7776 4291 4305 9275 9525 7420
13696G420O07l079Q558N039m261j3469J2827J439k683M133n199k1869r01J0433
$$ 7420 8027 4948 13506 18545 14284 815 13642 15081 12398 16531 11332 -10537 -11438 -1005
13682a005l334p585K417J855N549N884o681r426p540P668R437N520M650j5196
$$ -1005 -4339 -11924 -9507 -7652 -2103 3781 -2900 -12326 -19866 -12198 -2761 2759 7409 -7787
13668g787r442L758J3771R760j4458O962O306r342n505Q724J3814M374k631j749
$$ -7787 -17229 -13471 300 10060 -4398 2564 8870 -472 -5977 2747 16561 20935 18304 16555
13654A6555J028k916j1286Q259j592J4285q735j4099O718M421J4745K13l085j0674
$$ 16555 17583 14667 3381 11640 10048 24333 15598 1499 8217 12638 27383 27596 24511 13837
13640A3837q421R10L357Q495p072j0651K946J0364m03J032M96l240Q548p428j3446
$$ 13837 5416 6326 9683 18178 11106 455 3401 13765 13362 14394 14890 11650 20198 12770 -676
13625f76r504l76j358P333K0914P571n440n320k58J4878j201n973j793P92R760
$$ -676 -10180 -10556 -11914 -4581 16333 23904 18464 13144 12886 27764 26563 20590 18797 19589 29349
13610B9349j8273n894l485J096K430O626K484M974j9109m703K6944L00K855K044
$$ 29349 11076 5182 1697 2793 5223 11849 14333 19307 198 -4505 22439 22739 25594 27638
13596B7638j4720q703R17N966J1483n756k028P408R662j0275k2287j4959K099
$$ 27638 12918 4215 5132 11098 22581 16825 14797 22205 31867 21592 -695 -15654 -13555
13583a3555N363N63J1414J2867J6790J3966j3m607n482j457p536j2418K998o349
$$ -13555 -8192 -7629 3785 16652 33442 47408 47395 42788 37306 35849 28313 15895 18893 12544
13569A2544M85M191O486p563j1309q985l08n799J0073J0856J2932J8736P919k484
$$ 12544 13029 17220 23706 16143 4834 -4151 -4459 -10258 -185 10671 23603 42339 50258 47774
13555D7774q331j0527r895K31j2259j2549Q150N091p202O036Q805Q607P616j0017
$$ 47774 39443 28916 19021 19252 6993 -5556 2594 7685 483 6519 15324 23931 31547 21530
13541B1530j1196P971n413p993N711j122J248Q992m114Q528j990j0578p08J123
$$ 21530 10334 18305 12892 4899 10610 9488 10736 19728 15614 24142 22152 11574 10866 11989
13527A1989j229K775N365L409m363p290j718R973n735o011j82J0782m83J1704
$$ 11989 10760 13535 18900 22309 17946 10656 8938 18911 13176 7165 6983 17765 17282 28986
13513B8986n099j5356m093J449Q561R095Q242O079m821o929m481N693r703K723
$$ 28986 23887 8531 4438 5887 14448 23543 31785 37864 33043 26114 21633 27326 17623 20346
13499B0346K586q695J1434P524j0068o104O132j687P190R815K712N403j4278O378
$$ 20346 22932 14237 25671 33195 23127 17023 23155 21468 28658 38473 41185 46588 32310 38688
13485C8688J2413R490j0495j8300j0219L148R770q68l677L081J656k507p079j3004
$$ 38688 51101 60591 50096 31796 21577 24725 34495 33627 29950 33031 34687 32180 25101 12097
13471A2097p909m493o515K4501O739o637j7376J1177M378R607J5611o84j3800
$$ 12097 4188 -305 -6820 17681 24420 17783 407 11584 15962 25569 41180 40496 26696
13458B6696P22J2150m035o799O805J65J0026j3830j0523O931Q429J4497Q374n453
$$ 26696 27418 39568 35533 28734 35539 35704 45730 31900 21377 28308 36737 51234 59608 54155
13444E4155N648N468Q100j2578j7030J598k663l128k394J0901J4471J0738k72
$$ 54155 59803 65271 73371 60793 43763 45361 42698 39570 37176 48077 62548 73286 73014
13431G3014j2061n785O310O384J3377J1553o517j6918o375M583j2019J1567k557
$$ 73014 60953 55168 61478 67862 81239 92792 86275 69357 62982 67565 55546 67113 64556
13418F4556n671N610J0086P650n644q57l925J581m981j6437k878J0533J0195M335
$$ 64556 58885 64495 74581 82231 76587 75730 71805 73386 68405 51968 49090 59623 69818 74153
13404G4153J8629R513M717m901K473J100N416J0211O457K232J9183P156m954L74
$$ 74153 92782 102295 107012 102111 104584 105684 111100 121311 127768 130000 149183 156339 151385 151759
13390A51759J8902J7194M1380P0809J20670J38184R9118k736j15068j17076o5905
$$ 151759 170661 187855 229235 300044 420714 558898 658016 655280 540212 423136 357231
13379C57231n612L3945N9924J01185J13750K9876r6532j42641r4518n4464j8951
$$ 357231 351619 385564 445488 546673 660423 690299 593767 451126 356608 302144 283193
13368B83193J349L0378O9348J04654R8955N3742n6534j15196q2182l5399R929
$$ 283193 284542 314920 384268 488922 587877 641619 585085 469889 387707 352308 362237
13357C62237M4962Q4268J07325N4702n5576j45863j31634o6209l5114l0173j7165
$$ 362237 407199 491467 598792 653494 597918 452055 320421 254212 219098 188925 171760
13346A71760k090k7914k1519L696J154r3K80J0906p474q257j6230n14j1538j5614
$$ 171760 169670 141756 120237 123933 125087 124994 125274 136180 128706 120449 104219 103705 92167 76553
13332G6553J232p814k0522j1632M114J7607P093j7997q179k212j8597m703R041
$$ 76553 77785 69971 49449 37817 41931 59538 66631 48634 40455 38243 19646 14943 23984
13319B3984L977k484Q446J6649j637k9330j9165Q258m83n918J4406j006J5534
$$ 23984 27961 25477 33923 50572 48935 19605 440 8698 8215 2297 16703 15697 31231
13306C1231J1636n54K33n129J417K564K943J0662j0899j2312L093k474O39J8326
$$ 31231 42867 42313 42546 37417 38834 41398 44341 55003 44104 31792 34885 32411 33050 51376
13292E1376K383l821o366n69j2764j5634K061j4286R93J8486J938l18J7571J6231
$$ 51376 53759 49938 43572 43003 30239 14605 16666 2380 3373 21859 23797 23479 41050 57281
13278E7281r637j4672j703l42P86l508P983J5290j3578j4814P770J2611j0715
$$ 57281 47644 32972 31269 30927 31713 28205 36188 51478 37900 23086 30856 43467 32752
13265C2752q680k002J370O777K446J571j5409o193Q689Q78n712J743o960q02O174
$$ 32752 24072 22070 23440 30217 32663 34234 18825 12632 21321 22199 16487 18230 11270 10468 16642
13250A6642r720R71Q583Q974j7851m029n861k486R936m81m478q0j0781K247L318
$$ 16642 6922 7893 16476 25450 7599 3570 -2291 -4777 5159 4678 200 120 -10661 -8414 -5096
13235e096Q422M756q291R715J0745L151J2506r461j0382M34q079o277K896m12
$$ -5096 3326 8082 -209 9506 20251 23402 35908 26447 16065 16499 8420 2143 5039 4627
13221D627r13j4187j6198n602J6177J0240k020J793Q991J0637Q854K1145r054
$$ 4627 3714 -10473 -26671 -32273 -16096 -5856 -7876 -6083 2908 13545 22399 43544 34490
13208C4490p487m51j3605p821o993M468J4964j569j0973j763P967l884K298n684
$$ 34490 27003 26552 12947 5126 -1867 2601 17565 15996 5023 3260 11227 7343 9641 3957
13194C957k246J1245J100J135L873j6361L029J2702K2258K307j4342J3095M758
$$ 3957 1711 12956 14056 15191 19064 2703 5732 18434 40692 42999 28657 41752 46510
13181D6510j0568o359k1282q680L110K706J7498J0992O722l36L56L20k514j440
$$ 46510 35942 29583 8301 -379 2731 5437 22935 33927 40649 40313 40669 40989 38475 37035
13167C7035N986k822j666r61j1396m576o630l855k586R279R040k276M401j251
$$ 37035 43021 40199 38533 37572 26176 21600 14970 11115 8529 17808 26848 24572 28973 27722
13153B7722O822N19j0512p249p670r930j623K670J0422O171m855J4296n17L4068
$$ 27722 34544 35063 24551 17302 9632 -298 -1921 749 11171 17342 12487 26783 26266 60334
13139F0334L6637K8434L89k6720k1072k0330j3327n742J067J316j3374o319O052
$$ 60334 96971 125405 125794 99074 78002 57672 44345 38603 39670 40986 27612 21293 27345
13126B7345J775M573q822k346J183n969j5495l107O122L408o027N490L861m127
$$ 27345 29120 33693 24871 22525 23708 17739 2244 -863 5259 8667 2640 8130 11991 7864
13112G864L314j868J4253O223J945j322k2902J941J5155l681P649J0748J0797
$$ 7864 11178 9310 23563 29786 31731 30409 7507 9448 24603 20922 28571 39319 50116
13099E0116k593j5102K756K2799L3363L0015K9184K3102l420j9659j1371j3341
$$ 50116 47523 32421 35177 57976 91339 121354 150538 173640 170220 150561 139190 125849
13087A25849n53J8311L9095K2547L8533O9300J00566J10069R3327P4123N5838
$$ 125849 125296 143607 182702 205249 243782 313082 413648 523717 617044 691167 747005
13076G47005M4462R244k3586l2687o4726q9024j07720j04257r3988o5972m0353
$$ 747005 791467 800711 777125 744438 679712 590688 482968 378711 284723 218751 178398
13065A78398j2760j0133j8712j6142o316j4208j9775j5391j275J1153J237j1386
$$ 178398 165638 155505 136793 120651 114335 100127 80352 64961 63686 74839 76076 64690
13053F4690j0525k054M278J0811J7101m811k92j1149j4558m657K104R811p397
$$ 64690 54165 52111 56389 67200 84301 79490 79198 68049 53491 48834 50938 60749 53352
13040E3352j0152j3276M147n66J690M754J1239j214l796J4879O671n102p418l695
$$ 53352 43200 29924 34071 33505 35195 39949 51188 49974 46178 61057 67728 62626 55208 51513
13026E1513k229k966p719O728M850r665J3283R352J0306J776n404j03q888n755
$$ 51513 49284 46318 38599 45327 50177 40512 53795 63147 73453 75229 69825 69722 60834 55079
13012E5079L869N672K954n65j0313O711L636k83j1397r058k364O144Q150l591
$$ 55079 58948 64620 67574 67009 56696 63407 67043 66760 55363 46305 43941 50085 58235 54644
12998E4644j3486l976O787K2972J663j6109o354j6408m349R59O442J0420j52j0601
$$ 54644 41158 37182 43969 66941 68604 52495 46141 29733 25384 26343 32785 43205 43053 32452
12984C2452J1229J3017M989k848n165J1060M639J634P88R533j3074k1443M60J1125
$$ 32452 43681 56698 61687 58839 53674 64734 69373 71007 71795 81328 68254 46811 47271 58396
12970E8396J0926O333M171j2437p914M730j2245j0358K66m358p027p32l793n694
$$ 58396 69322 75655 79826 67389 59475 64205 51960 41602 41868 37510 30483 29751 25958 20264
12956B0264J2725J3663j234o967l535J6586P204O747O1j9549k0130r792j250K62
$$ 20264 32989 46652 45418 38451 34916 51502 58706 65453 65514 45965 25835 16043 14793 15055
12942A5055J3228Q323M51K82Q085m814J017L041K636K306J5992M66j6122n365
$$ 15055 28283 36606 37057 37339 45424 40610 41627 44668 47304 49610 65602 66068 49946 44581
12928D4581K926J4677J3987p405j2140p244j0749k696J7161J5999j2216J1119
$$ 44581 47507 62184 76171 68766 56626 49382 38633 35937 53098 69097 56881 68000
12916F8000Q952L19J2693O785j542J4748J4551n885n440J4614J2043m812j2828
$$ 68000 76952 77271 89964 96749 95207 109955 124506 118621 113181 127795 139838 135026 122198
12903A22198q198j9535j8104j3441j3860j1278p867J9526J5043J0389Q704Q024
$$ 122198 114000 94465 76361 62920 49060 37782 29915 49441 64484 74873 83577 91601
12891I1601j2023r033R620J246j0965j2508J485j2016L337P184J4488j050j1853
$$ 91601 79578 70545 80165 81411 70446 57938 59423 47407 50744 57928 72416 71366 59513
12878E9513Q015n449k659j392M38L670J41l186O963o090p537j885J0735O028o271
$$ 59513 67528 62079 59420 58028 58466 62136 62277 59091 66054 59964 52427 50542 61277 67305 61034
12863F1034j2293P048J5036O10o631J0491J9235m786k599J407J0127M565j9926
$$ 61034 48741 55789 70825 71435 64804 75295 94530 89744 87145 88552 98679 103244 83318
12850H3318o374n024O918J3078J0023j375r867j0070L816j445j626J922K544q311
$$ 83318 76944 71920 78838 91916 101939 100564 90697 80627 84443 82998 81372 83294 85838 77527
12836G7527J811J3392J0800q834m633J27P607p479J256J0886j173j0576j0284
$$ 77527 79338 92730 103530 94696 90063 90190 97797 90318 91574 102460 101287 90711 80427
12823H0427j3684K05K0263J2837q533k8312q305J5325j2100r282L908p246K670
$$ 80427 66743 66948 87211 100048 91515 63203 54898 70223 58123 48841 52749 45503 48173
12810D8173J0985R973K4697J3537Q909N940J6269K6680J2353q252j2670j7212
$$ 48173 59158 69131 93828 107365 116274 122214 138483 165163 177516 169264 156594 139382
12798A39382n197R087L998J836j543j0052J6448m84r616j3781r803k653K7303
$$ 139382 134185 143272 147270 149106 147563 137511 153959 153475 143859 130078 120275 117622 144925
12785A44925R141j2934j3774J7972J5039J1209m959l0N764J9621K3688J5121K160
$$ 144925 154066 141132 127358 145330 160369 171578 166619 166589 172353 191974 215662 230783 232943
12772B32943k0331o174K204M012j4401n566J0243J314j648R601J3002O949l916
$$ 232943 212612 206438 208642 212654 198253 192687 202930 204244 202596 212197 225199 232148 228232
12759B28232R3K1579J3563m97P248r23j0539j1372Q094q468p94l095N766J6678
$$ 228232 228325 249904 263467 262970 270218 269295 258756 247384 255478 247010 246216 243121 248887 265565
12745B65565J0435L862K283Q973M779j274J2680J0010J4614q490k944K2938P029
$$ 265565 276000 279862 282145 291118 295897 294623 307303 317313 331927 323437 320493 343431 350460
12732C50460Q627K52J520J6249J0901J0219K972M12J9146j0251k78k26j6315q752
$$ 350460 359087 359339 360859 377108 388009 398228 401200 401612 420758 410507 410229 410003 393688 384936
12718C84936O300J9471K1533R052J3126K135k38M675J9609J4695K5879K7018J1708
$$ 384936 391236 410707 432240 441292 454418 456553 456315 460990 480599 495294 521173 548191 559899
12705E59899J6337K6869M1066M5213M1124L4554L4433K9518M4516M3901L5007
$$ 559899 576236 603105 644171 689384 730508 765062 799495 829013 873529 917430 952437
12694I52437M9202O0270M6815N8431P3494P1153Q7184R0643Q7386R2903J28445
$$ 952437 1001639 1061909 1108724 1167155 1240649 1311802 1398986 1489629 1577015 1669918 1798363
12683A798363J49181J72923K03829K50528L13531L87995M95151O10081P29268
$$ 1798363 1947544 2120467 2324296 2574824 2888355 3276350 3771501 4381582 5110850
12674E110850Q46050R28240J005170J087474J163289J317168J561514K008119
$$ 5110850 5956900 6885140 7890310 8977784 10141073 11458241 13019755 15027874
12666A5027874K834038M278065O541558R724056J3420905J6503485J8227910J8505550
$$ 15027874 17861912 22139977 28681535 38405591 51826496 68329981 86557891 105063441
12658A05063441J7210573J4310990R555807L004082m466966j0800800j5106036
$$ 105063441 122274014 136585004 146140811 149144893 144677927 133877127 118771091
12651A18771091j7506177j8310970j7675561j5706656j2595934q953483n922921
$$ 118771091 101264914 82953944 65278383 49571727 36975793 28022310 22099389
12644B2099389l904051k659320j919709j500092j257925j132266j051385r90917
$$ 22099389 18195338 15536018 13616309 12116217 10858292 9726026 8674641 7683724
12636G683724r24036q45528p45295o27462n16357m33148l57287l02062k47132
$$ 7683724 6759688 5914160 5168865 4541403 4025046 3591898 3234611 2932549 2685417
12627B685417k07696j96950j82591j61284j35070j30716j26625q4054p9521o6464
$$ 2685417 2477721 2280771 2098180 1936896 1801826 1671110 1544485 1460431 1380910 1314446
12617A314446m8093k0855k0140l734K6440J9246K5657K8330K2559M95j2414j8899
$$ 1314446 1266353 1245498 1225358 1221624 1248064 1267310 1292967 1321297 1343856 1344351 1331937 1313038
12605A313038o843M224q587J3519O5506J06911J71531K70333L83653M89102N56581
$$ 1313038 1306195 1310419 1301832 1315351 1380857 1487768 1659299 1929632 2313285 2802387 3358968
12594C358968N50888N00077M09782K69603M4767k17465m14256n53245n96539n97492
$$ 3358968 3909856 4409933 4819715 5089318 5134085 4916620 4502364 3949119 3352580 2755088
12584B755088n63171n01442l61664k40498j64135j19505q8693o6810k6280l2709
$$ 2755088 2191917 1690475 1328811 1088313 924178 804673 715980 649170 622890 590181
12574E90181l0336l2144j5910j5228j7118j4358J8129L4234N2231R3266J28753
$$ 590181 559845 527701 511791 496563 479445 465087 483216 517450 569681 662947 791700
12563G91700J42471J50032J43248J22458Q6693K0595m5847q7573r9938j10171
$$ 791700 934171 1084203 1227451 1349909 1436602 1457197 1411350 1323777 1223839 1113668
12553A113668j30333j03964n6686k6823K3855L9227N7121L3851r664p6839j02215
$$ 1113668 983335 879371 822685 795862 819717 858944 916065 949916 940252 863413 761198
12542G61198j18107j08462p6307o8915o5429l4180j1942j167M398j2418J704K1769
$$ 761198 643091 534629 458322 389407 323978 289798 277856 276689 281087 268669 270373 292142
12530B92142K5809K7494P602l460Q738K0776K5902J3878j0407k0934k0379m363
$$ 292142 317951 345445 353047 349587 358325 379101 405003 418881 408474 387540 367161 362798
12518C62798k0282l4335l8515m2375l1351l2112l4336k8507j3558J0511J2094
$$ 362798 342516 308181 269666 227291 195940 163828 129492 100985 87427 97938 110032
12507A10032J8149J7445J3520J991J1593K3806J1825j3559r750j0069n966p757
$$ 110032 128181 145626 159146 161137 172730 196536 208361 194802 185052 174983 169017 161260
12495A61260l606j3700L665o888L59m120j2564j2743r394p731j64o08j0212p230
$$ 161260 157654 143954 147619 140731 141090 136970 124406 111663 102269 94538 94374 93766 83554 76324
12481G6324l842j414j0482Q67K7487J3576J622j2540r023j8130j0694J379K3965
$$ 76324 72482 71068 60586 61453 88940 102516 104138 91598 82575 64445 53751 55130 79095
12468G9095l882j1391Q49M654O310Q61q24R176q80n957j2254P422J7819J3842
$$ 79095 75213 63822 64671 69325 75635 76496 75672 84848 83968 78011 65757 73179 90998 104840
12454A04840M002J805L114J1532R239m082j7292j2659q729m096n534j5501O89
$$ 104840 108842 110647 113761 125293 134532 130450 113158 100499 91770 87674 82140 66639 67328
12441F7328l978j049J1208P982k979q202J541Q435k347M3J8070J832M4R626J0226
$$ 67328 63350 62301 73509 81491 78512 70310 71851 80286 77939 77982 96052 97884 97928 107554 117780
12426A17780R637r444j9665l52Q703J1495j38R068O996k743P298P074L805J158
$$ 117780 127417 117973 98308 97956 106659 118154 118016 127084 134080 131337 138635 145709 149514 150672
12412A50672J9483L6208K7722K1039L5361K9764L7093N1254P5282Q8082J28308
$$ 150672 170155 206363 234085 255124 290485 320249 357342 408596 483878 571960 700268
12401G00268J71586K25155K93548L42503L15674K01862L3696j43053k92279l33724
$$ 700268 871854 1097009 1390557 1733060 2048734 2250596 2284292 2141239 1848960 1515236
12391A515236l17478k56018j81169j43786r5934p7635p0049o0804m1770l3476
$$ 1515236 1197758 941740 760571 616785 520851 443216 373167 312363 270593 237117
12381B37117l1695r132k4907j7707p265k0526j4256j0012l626J8020J441j7292
$$ 237117 205422 196290 171383 153676 146411 125885 111629 101617 97991 116011 117452 100160
12369A00160r673J21K288k944J2087Q915j6392j4020Q276K127j43m230k455K7
$$ 100160 90487 90608 92896 89952 102039 110954 94562 80542 88818 90945 90802 86572 84117 84144
12355H4144J8962J1980Q950o763j5346p6j2753n880n177k13j3260m431j1605o619
$$ 84144 103106 115086 124036 117273 101927 101851 89098 83218 78041 77828 64568 60137 48532 41913
12341D1913o769J1842J4795J1743q525j398k358p607n584N231K041l99j660P719
$$ 41913 35144 46986 61781 73524 64999 63601 61243 53636 48052 53283 55324 54925 53265 60984
12327F0984P299J9318K0145Q997J6926J679m645N169O384k320j3029o403j4831
$$ 60984 68283 87601 107746 116743 133669 135348 130703 135872 142256 139936 126907 120504 105673
12314A05673j0335j1641p403n084j6773j0659J4041J0970j108L529j1630j1689
$$ 105673 95338 83697 76294 71210 54437 43778 57819 68789 67681 71210 59580 47891
12302D7891o984j0463o18J6353Q681J087J0910Q961o553m977l712K244J6206J2524
$$ 47891 40907 30444 29826 46179 54860 55947 66857 75818 69265 64288 60576 62820 79026 91550
12288I1550O783M923j611r441o492l628o826j291J939J228p988N882j3174j1021
$$ 91550 98333 103256 101645 92204 85712 82084 75258 73967 75906 77134 69146 75028 61854 50833
12274E0833J3900O441K786j6120M438L6743K3633R636R83K0987J2567N964L826
$$ 50833 64733 71174 73960 57840 62278 99021 122654 132290 133273 154260 166827 172791 176617
12261A76617O290L276p389m859J613m282k1170j6571j4057j4717j2567K0000Q849
$$ 176617 182907 186183 178794 173935 175548 171266 150096 133525 119468 104751 92184 112184 121033
12248A21033P408M692M540J97J9904l716l043J4923J4268L4049M4969M4633O2222
$$ 121033 128441 133133 137673 137870 157774 154058 151015 165938 180206 214255 259224 303857 366079
12235C66079Q8761J06370J02574Q4597O2439N0023K1473j7903m9911p5438q8985
$$ 366079 454840 561210 663784 748381 810820 860843 882316 864413 814502 739064 650079
12224F50079r7885r9577q4545o4658o2387k9508j7724j3630J863m393j8365j6990
$$ 650079 552194 452617 368072 303414 241027 211519 193795 180165 182028 177635 159270 142280
12212A42280k4842q737k066R383O229m357k316k296K397P889J0252J6757J0599
$$ 142280 117438 108701 106635 116018 122247 117890 115574 113278 115675 123564 133816 150573 161172
12199A61172R234J90j5537j4169l0030p846Q788n782m168M814R495J1231l849
$$ 161172 170406 170596 155059 140890 110860 103014 111802 106020 101852 106666 116161 127392 123543
12186A23543q908K269N542J6433L119k746r681M733J8217L1773L5671K0856K3405
$$ 123543 114635 116904 122446 138879 141998 139252 129571 134304 152521 184294 219965 240821 264226
12173B64226L5871J4682j7663k102P144K042j3986r649q503j4179k1664o360r853
$$ 264226 300097 314779 297116 295014 302158 304200 290214 280565 272062 257883 236219 229859 220006
12160B20006j1719k2143k0313j5058L77j1179k0388o947M657l135q598R764m674
$$ 220006 208287 186144 165831 150773 151150 139971 119583 112636 117293 114158 105560 115324 110650
12147A10650m035m574K800N474r083j1602R857R404p015J0444J6888Q465K6893
$$ 110650 106615 102041 104841 110315 101232 89630 99487 108891 101876 112320 129208 137673 164566
12134A64566K0659M9347M9985N1872N9482P6664N7461M3540K4560L284j3846j2080
$$ 164566 185225 234572 284557 336429 395911 472575 530036 573576 598136 601420 587574 575494
12122E75494l9280n6162p1549o1876m9769n0167k8258k2269j5402o2o45L653j281
$$ 575494 536214 480052 408503 346627 296858 246691 218433 196164 180762 180700 180055 183708 182427
12109A82427k5931j4526j4935j2003j6188j5831j279Q850L451n620q039p390j2454
$$ 182427 156496 141970 127035 115032 98844 83013 81734 90584 94035 88415 80376 72986 60532
12096F0532P869m23j1469j1059J1647Q962m929j1007J187O412N244o797N979p56
$$ 60532 68401 67978 56509 45450 57097 66059 61130 50123 51310 57722 62966 56169 62148 61392
12082F1392p877R831J3159o977j0227p908K96J798R464M854Q12q135J044P489
$$ 61392 53515 63346 76505 69528 59301 51393 51689 53487 62951 67805 68617 60482 61526 69015
12068F9015J5650K836j544K0555J0230Q2k3913p495J7464n288k1411j2039m925
$$ 69015 84665 87501 85957 106512 116742 116824 92911 85416 102880 97592 76181 64142 59217
12055E9217P541m835j1297j214K655O587q957q984R770k486p799J2524q38r507
$$ 59217 66758 61923 50626 49412 52067 58654 49697 40713 50483 47997 40198 52722 51884 42377
12041D2377N212q653j1575J5089N701j0455j6163N809J3655l184N296J383L51
$$ 42377 47589 38936 27361 42450 48151 37696 21533 27342 40997 37813 43109 44492 44843
12028D4843n058o158J08K4616j7284o056J6174M830m475j560J1142o311K772K6484
$$ 44843 39785 33627 33735 58351 41067 35011 51185 56015 51540 49980 61122 54811 57583 84067
12014H4067n825l820p348q178j923j436r396pk972l95r553J208P483k170n523
$$ 84067 78242 74422 67074 58896 56973 55537 46141 46134 43162 42767 33214 34422 41905 39735 34212
11999C4212p488j2373p728J177N703Q949Q627N465r179r871j1514K121R364n650
$$ 34212 26724 14351 6623 7800 13503 22452 31079 36544 27365 17494 5980 8101 17465 11815
11985A1815P98M693M220M366J4153K6053n11R540K1693j2973j9517p967j119Q343
$$ 11815 12613 17306 21526 25892 40045 66098 65587 75127 96820 83847 64330 56363 55244 63587
11971F3587J2762N358N199q32j6240p817j3345j4934p376J38r162K449K834o278
$$ 63587 76349 81707 86906 86074 69834 62017 48672 33738 26362 26500 17338 19787 22621 16343
11957A6343L411k85o748J710j4135j8454o975J0989J2658K3106Q116m182p405
$$ 16343 19754 19469 12721 14431 296 -18158 -25133 -14144 -1486 21620 29736 25554 18149
11944A8149k468J2847J093k881j0242j9531m868K3160J5894r350j8490j4756K183
$$ 18149 15681 28528 29621 26740 16498 -3033 -7901 15259 31153 21803 3313 -11443 -9260
11931i260Q697L236j0248m664O977P905l963J3225J2047j0360j855m03n709k256
$$ -9260 -563 2673 -7575 -12239 -5262 2643 -1320 11905 23952 13592 11737 11334 5625 3369
11917C369o919j1894M037K027N055L344J0582P052j1705m599M427O903M015j9571
$$ 3369 -3550 -15444 -11407 -9380 -4325 -981 9601 16653 4948 349 4776 11679 15694 -3877
11903c877m177P093P176K820r327j6676n39R731R571p771J034P958R955J2107
$$ -3877 -8054 -961 6215 9035 -292 -16968 -17507 -7776 1795 -5976 -4942 3016 12971 25078
11889B5078K005o860P433K041M354M854m133j5476j042M555n196k289O20j3404
$$ 25078 27083 20223 27656 29697 34051 38905 34772 19296 18254 22809 17613 15324 15944 2540
11875B540j9665J4836J2933K368j5286q623J3624k354m35L312J0960j8423n345
$$ 2540 -17125 -2289 10644 13012 -2274 -10897 2727 373 -62 3250 14210 -4213 -9558
11862i558J0601o498o522J5332J3970m570M031M494N786m001M410j499j4067q80
$$ -9558 1043 -5455 -11977 3355 17325 12755 16786 21280 27066 23065 27475 25976 11909 11029
11848A1029P045m293j0554o758J0677q309j532L554K717K372k811Q14J756L476
$$ 11029 18074 13781 3227 -3531 7146 -1163 -2695 859 3576 5948 3137 3951 5707 9183
11834I183R905P065P458j6149j14k89Q077r328M194J0273j1384o900K4m7Q806
$$ 9183 19088 26153 33611 17462 17348 17059 25136 15808 20002 30275 18891 11991 12015 11968 20774
11819B0774j340O258l312p086q358k068j9623j799P390J1593Q150q108o093o562
$$ 20774 19434 25692 22380 15294 6936 4868 -14755 -16554 -9164 2429 10579 2471 -3622 -10184
11805a0184K3069N139q978O338J0915n36k830r463j1740k282K646q592L490J1351
$$ -10184 12885 18024 9046 15384 26299 25763 22933 13470 1730 -552 2094 -6498 -3008 8343
11791H343J4431N262Q182J4928n268j4708r391m95j0181L497J93j198q827N963
$$ 8343 22774 28036 36218 51146 45878 31170 21779 21284 11103 14600 14793 13595 4768 10731
11777A0731q510K738M097J2887M89j2972l837J0302j330N133L16j006Q504m703
$$ 10731 2221 4959 9056 21943 22432 9460 5623 15925 14595 19728 20044 19038 27542 22839
11763B2839m50J678o218L157P798J3811K296n424K941R32l041n883l952j1770
$$ 22839 22389 24067 17849 21006 28804 42615 44911 39487 42428 43360 40319 34436 30484 18714
11749A8714j3238j138J1565O747j3313p810J2267n3M219o269J032N642o230L089
$$ 18714 5476 4338 15903 22650 9337 1527 13794 13741 17960 11691 12723 18365 12135 15224
11735A5224R402q148n979O756P261N491L050J0439L63J127l911m722j3052r979
$$ 15224 24626 16478 10499 17255 24516 30007 33057 43496 43859 44986 41075 36353 23301 13322
11721A3322p243J217o743Q014R070j691r330P79p014j2875M285L642J49K067K060
$$ 13322 6079 7296 553 8567 17637 15946 6616 7395 381 -12494 -8209 -4567 -4418 -2351 -291
11706b91k076N684K0335J519n782K344K810J7617P667k5148r655m779j572L415
$$ -291 -2367 3317 23652 25171 19389 21733 24543 42160 49827 24679 15024 10245 8673 12088
11692A2088N777o788L353r104n637J0274N544j0405O187j705k667n754K4135J1490
$$ 12088 17865 11077 14430 5326 -311 9963 15507 5102 11289 9584 6917 1163 25298 36788
11678C6788K796J0809l012q716O280n97j0472j1363j055o443J0736J7j2557j881
$$ 36788 39584 50393 47381 38665 44945 44348 33876 22513 21458 15015 25751 25768 13211 11330
11664A1330M685k884J537l995k738J1394n762J126P506P971J006j5302j1931R86
$$ 11330 16015 13131 14668 10673 7935 19329 13567 14693 22199 30170 31176 15874 3943 4929
11650D929n810n925P784L625j585l907N869J6126n586m754J226q148J817O413
$$ 4929 -881 -6806 978 4603 3018 -889 4980 21106 15520 10766 11992 3844 5661 12074
11636A2074l212N601J2998Q166L589l210j0286j8885j4431k63K436p789q29J4683
$$ 12074 8862 14463 27461 35627 39216 36006 25720 6835 -7596 -7859 -5423 -13212 -14041 642
11622F42O633J5533k712J1499Q853j143j5812M001m471k227m296p409j1371j6842
$$ 642 7275 22808 20096 31595 40448 39305 23493 27494 23023 20796 16500 9091 -2280 -19122
11608a9122M62R025J2331P821r305k2666M47J7016k335n559O07M253J0605M256
$$ -19122 -18660 -9635 2696 10517 1212 -21454 -21007 -3991 -6326 -11885 -11278 -7025 3580 7836
11594G836O446N422O956j7983n53L219J8564J2194q477j4213L193r492o054l701
$$ 7836 14282 19704 26660 8677 8124 11343 29907 42101 33624 19411 22604 13112 7058 3357
11580C357N516N226j0274j381m265m593K500J880j0330J6972J344p937P113N545
$$ 3357 8873 14099 3825 2444 -1821 -6414 -3914 -2034 -12364 4608 5952 -1985 5128 10673
11566A0673J518K038r431n152p054n289J198Q755N390r282n343J3216J4490n028
$$ 10673 12191 14229 4798 -354 -7408 -12697 -11499 -2744 2646 -6636 -11979 1237 15727 10699
11552A0699j1937l293J6655P762r550k316N658J409n429P64p464n157o51j3407
$$ 10699 -1238 -4531 12124 19886 10336 8020 13678 15087 9658 10422 2958 -2199 -2850 -16257
11538a6257l028K2063M673M504n657J4608j8806j976R275J787k585j142j596P218
$$ -16257 -19285 2778 7451 11955 6298 20906 2100 124 9399 11186 8601 7459 5863 13081
11524A3081k493j4269R538O453L152j738r045p862J995o330k864J8661J0290k652
$$ 13081 10588 -3681 5857 12310 15462 13724 4679 -3183 -1188 -7518 -10382 8279 18569 15917
11510A5917M036O993j7357j4908O698M961J646r670K350N616l559n920L439J0499
$$ 15917 19953 26946 9589 -5319 1379 6340 7986 -1684 666 6282 2723 -3197 242 10741
11496A0741M993o171J271l986J6127K048j1962n410l398Q402o08J136j5143q687
$$ 10741 15734 9563 10834 6848 22975 25023 13061 7651 4253 12655 12047 13183 -1960 -10647
11482a0647j2302L870Q754J3761j479M041O145N039K357p539r633L798R049O815
$$ -10647 -22949 -19079 -10325 3436 1957 5998 12143 17182 19539 12000 2367 6165 15214 22029
11468B2029o222n460r253p797k382r658P537O084J6863p674j736M004P671L038
$$ 22029 15807 10347 1094 -6703 -9085 -18743 -11206 -5122 11741 4067 2331 6335 14006 17044
11454A7044l27l051n51Q548M247l779o450j4976J0232P000L952m349J0187p705
$$ 17044 16717 13666 13115 21663 25910 22131 15681 705 10937 17937 21889 17540 27727 20022
11440B0022p390K443M11q569o902l15P404P117j441K334r372O690J1551N991j3288
$$ 20022 12632 15075 15486 6917 15 -300 7104 14221 12780 15114 5742 12432 23983 29974 16686
11425A6686m528M30M055M398m11j1074l105P365O914j3998m759n305K001o441
$$ 16686 12158 12588 16643 21041 20630 9556 6451 13816 20730 6732 1973 -3332 -1331 -7772
11411g772j25O019L256L195j2095l894J8438P942K673j3082j597J4384J1215j650
$$ -7772 -7897 -1878 1378 4573 -7522 -11416 7022 14964 17637 4555 2958 17342 28557 26907
11397B6907l60N97j474L223o444K448Qj8374n868k65l62R602k625r031l250J0970
$$ 26907 26547 27144 25670 28893 22449 24897 24905 6531 663 398 36 9638 7013 -2018 -5268 5702
11381E702J3312M769j2339k729N717q771j8027k167R476J0203N179O33q999r807
$$ 5702 19014 23783 11444 8715 14432 5661 -12366 -14533 -5057 5146 10325 10958 1959 -7848
11367g848j205R347J0522O089k007r188p568j4694l687J0313J2006J864J5972
$$ -7848 -9053 294 10816 16905 14898 5710 -1858 -16552 -20239 -9926 2080 3944 19916
11354A9916j576j4471m325K01L585L730N569l805Q336Q80m419j1849K354M628
$$ 19916 18340 3869 -456 -255 3330 7060 12629 8824 17160 18040 13621 1772 4126 8754
11340H754m106J9031L679j0029n101n192k060J7658K532l171n498j7747j0765
$$ 8754 4648 23679 27358 17329 12228 7036 4976 22634 25166 21995 16497 -1250 -12015
11327a2015K486K3446K426o334K232K078N087q30p476p714j298M924P631j422
$$ -12015 -9529 13917 16343 10009 12241 14319 19406 18576 11100 3386 2088 7012 14643 13221
11313A3221l935J6638K1524M564n152q957o935m429k702l753Q986j5666n926q910
$$ 13221 9286 25924 47448 52012 46860 37903 30968 26539 23837 20084 29070 13404 7478 -1432
11299a432o4K0231O653L893J309j0001j3794l469J773N887j3945K084J0315K359
$$ -1432 -1496 18735 25388 29281 30590 20589 6795 3326 5099 10986 -2959 -875 9440 11799
11285A1799m58l564J2521j5502j0727m644j342L683J6208Q320m221k68J382K641
$$ 11799 11341 7777 20298 4796 -5931 -10575 -11917 -8234 7974 16294 12073 11805 13187 15828
11271A5828n736j948K690O136P725J1489r748L768N127m994O806R598J7909M0396
$$ 15828 10092 8144 10834 16970 24695 36184 26436 30204 35331 30337 37143 46741 64650 105046
11257A05046L1902L183j4089j0306l0543l0722q700J805j6985j2158J5353j975
$$ 105046 136948 140131 126042 115736 85193 54471 45771 47576 30591 18433 33786 31811
11245C1811J950l335j6K988j326m853j021r629q208N340O321K06r209q964m182
$$ 31811 33761 30426 30410 33398 32072 27219 26198 16569 8361 13701 20022 20228 11019 2055 -2127
11230b127K695J4004J7570Q768k150k7823j4862J2766J6517R411m53j3145K62
$$ -2127 568 14572 32142 40910 38760 10937 -3925 8841 25358 34769 34316 21171 21433
11217B1433L472r411j214J4325N855J4110K371m19N785o607j607o390q786R47
$$ 21433 24905 15494 14280 28605 34460 48570 50941 50522 56307 49700 48093 41703 32917 33864
11203C3864K495p262j3870N224J0447L718j3574K325O391o191l648M439N260j46
$$ 33864 36359 29097 15227 20451 30898 34616 21042 23367 29758 23567 19919 24358 29618 29472
11189B9472j490r526q652K557P518K3922R284K245L46o45r893K058k105K393k826
$$ 29472 27982 18456 9804 12361 19879 43801 53085 55330 55676 55031 45138 47196 45091 47484 44658
11174D4658J2181L209j240O364p313k469r820j352m157M306J2407K110Q046J114
$$ 44658 56839 60048 58808 65172 57859 55390 45570 44218 40061 44367 56774 58884 66930 68044
11160F8044j5209n610L777P963M553L466N597R463K8359L7143R270j2668j8940
$$ 68044 52835 47225 51002 58965 63518 66984 72581 82044 110403 147546 156816 144148 125208
11147A25208l329j576k3242k7693j0993r867j0995n279K96R509P809k14M704q223
$$ 125208 121879 120303 97061 69368 58375 48508 37513 32234 32530 42039 49848 49634 54338 46115
11133D6115j3434O963P354R876J485k708q051j405j8069k4186n676K743Q257j1534
$$ 46115 32681 39644 46998 56874 58359 55651 47600 46195 28126 3940 -1736 1007 9264 -2270
11119b270J9363K1567q446k0233r703R842Q166L390p280N540p45j0695L407R752
$$ -2270 17093 38660 30214 9981 278 10120 18286 21676 14396 19936 19191 8496 11903 21655
11105B1655m123q290o69J6419O996k560j749R646k68R07Q683q57m269q827j3267
$$ 21655 17532 9242 8573 24992 31988 29428 27679 37325 37057 37964 46647 45790 41521 32694 19427
11090A9427p559j746q803P256J2728j1084L355r703j5562J5436Q314q412N295
$$ 19427 11868 10122 1319 8575 21303 10219 13574 3871 -11691 3745 12059 3647 8942
11077H942M746N664M158p681j2799N343P625q408q340N264q3J3018M434J044k717
$$ 8942 13688 19352 23510 15829 3030 8373 15998 7590 -750 4514 4431 17449 21883 22927 20210
11062B0210l68N991Q20m750M730J8765n378j0148K666P901o675j6251p2J446n098
$$ 20210 19842 25833 26653 21903 26633 45398 40020 29872 32538 40439 33764 17513 17441 18887 13789
11047A3789L334m956L58P133j211k77O038M007m297p484K865k551N84k382q325
$$ 13789 17123 12167 12525 19658 18447 18170 24208 28215 23918 16434 19299 16748 17332 14950 6625
11032F625J8822J6634J191j1486J527P979j54O881j188N899J3357O319k9341j8974
$$ 6625 25447 42081 43272 31786 33313 41292 41138 48019 46831 52730 66087 72406 43065 24091
11018B4091P934R988j2341Q634m999p852L603q178O790q91l803p17l430j7325
$$ 24091 32025 42013 29672 38306 33307 25455 29058 20880 27670 26779 22976 22259 18829 1504
11004A504p646P881J126J2755K2017J2808N750J3036J338R40M028m462j0353L277
$$ 1504 -6142 1739 2865 15620 37637 50445 56195 69231 70569 71509 75537 71075 60722 63999
10990F3999K283k6647j479J9801R604q572j1109j6756j2949r957R727J4643P421
$$ 63999 66282 39635 38156 57957 67561 58989 47880 31124 18175 8218 17945 32588 40009
10977D0009J3807J6301M611l110n115J6659K0662J2929J4391j303q209q506N77
$$ 40009 53816 70117 74728 71618 66503 83162 103824 116753 131144 129841 121632 113126 113703
10964A13703J2938m481l628j420P433J2428q211q570J5813P564K007J344O935
$$ 113703 126641 122160 118532 117112 124545 136973 128762 120192 136005 143569 145576 146920 153855
10951A53855N046J227J0544J3856L7400P5844R8152J09608J65270K52587M03627
$$ 153855 158901 160128 170672 184528 221928 297772 395924 505532 670802 923389 1327016
10940A327016M83743L48902j30520n07642m80570l01808j91881j20319p5805m3408
$$ 1327016 1810759 2159661 2029141 1521499 1040929 739121 547240 426921 351116 307708
10930C07708k6237l2230k1560m467k948K231j941K894o353j4651q580j4949n581
$$ 307708 281471 249241 227681 223214 220266 222497 220556 223450 217097 202446 193866 178917 173336
10917A73336j1719m673m575M110n598q576n293j1273j1937j0318j4634k368P061
$$ 173336 161617 156944 152369 156479 150881 142305 137012 125739 113802 103484 88850 86482 93543
10904I3543o654k212P36R794J152q971j4703k1347R127K979P292J298R147R241
$$ 93543 86889 84677 85413 95207 96359 87388 72685 51338 60465 63444 70736 72034 81181 90422
10890I0422O149o555k6970j2277J6747O819m199k489N663R219O524m577O861Q604
$$ 90422 96571 90016 63046 50769 67516 74335 70136 67647 73310 82529 89053 84476 91337 99941
10876I9941j201J8348M888m947j571K361k361L238L928j019J94p999j2783R67
$$ 99941 98740 117088 121976 117029 115458 117819 115458 118696 122624 121605 121799 113800 101017 101984
10862A01984L730m46l797j4789j0850j0530j316M53J1382j5n867J211J3804n969
$$ 101984 105714 105268 101471 86682 75832 65302 63986 64439 75821 75806 69939 71150 84954 78985
10848G8985L420J8483l903j2577o14L294j6166p519K185R739L824j775N692Q572
$$ 78985 82405 100888 96985 84408 83794 87088 70922 63403 65588 75327 79151 77376 83068 91640
10834I1640L845J3801m704q384J659l9041k2166o666k50j0595o524K4R866K6547
$$ 91640 95485 109286 104582 96198 97857 58816 36650 29984 29734 19139 12615 12639 22505 49052
10820D9052J5750P879Q587m186j3358j3913R53Q047J9147M237j2760O061j675
$$ 49052 64802 72681 81268 77082 63724 49811 50764 58811 77958 82195 69435 75496 73821
10807G3821Q535K260p055J3754J5846k718Q362l164O935J6367q44q23J6763J2717
$$ 73821 82356 84616 77561 91315 107161 104443 112805 109641 116576 132943 132099 131276 148039 160756
10793A60756j6308o650N074N188k462k750l284n188J1175J0653j6822n115n958
$$ 160756 144448 137798 142872 148060 145598 142848 139564 134376 145551 156204 139382 134267 128309
10780A28309K25R285K0665K2612L5737K9413M2460M2825m622m8323m4081l6956
$$ 128309 128534 137819 158484 181096 216833 246246 288706 331531 326909 278586 234505 197549
10768A97549l5262k4124j0583l294l503q772r133M762j396Q631J3280O668J288
$$ 197549 162287 138163 127580 124286 120783 112011 102878 107640 106244 114875 128155 134823 136111
10755A36111l841K7778K6370M041o989m239o024r106J384L409o792N015L488j812
$$ 136111 132270 160048 186418 190459 183470 179231 173207 164101 165485 168894 162102 167117 170605 168793
10741A68793l690j8359n311L658k499j4709n079k631P054j492k491J7922J3799
$$ 168793 165103 146744 141433 145091 142592 127883 122804 120173 127227 125735 123244 141166 154965
10728A54965k5791l6600L443R494k948J5840L6643J2041m964K275K4602J7371
$$ 154965 129174 92574 96017 105511 102563 118403 155046 167087 162123 164398 189000 206371
10716B06371K900l461k9553q167q214j9658J001J7441J9268P013j3230j0449r158
$$ 206371 209271 205810 176257 168090 159876 140218 141219 158660 177928 184941 171711 161262 152104
10703A52104J2067J9392J1316m80j8956k0045k412J434O123R63Q700M534p924
$$ 152104 164171 183563 194879 194399 175443 155398 152986 154420 160543 161506 170206 174740 166816
10690A66816J991O59N919J1098k5412j3546J1025j0871j1683j1245j1116k0522
$$ 166816 168807 169466 175385 186483 161071 147525 158550 147679 135996 124751 113635 93113
10678I3113k2612k0457k577P703J4941J1648M4151P2558O3200K0176j1566j2395
$$ 93113 70501 50044 47467 55170 70111 81759 125910 198468 261668 281844 270278 257883
10666B57883p479r7K1342j2289j9691n767j0731j3591J2226J1473Q315J9951J2948
$$ 257883 250404 250307 271649 259360 239669 233902 223171 209580 221806 233279 241594 261545 274493
10653B74493k178j2083k6149l8834j1696J0346L8100Q0811N6194K1325m515J448
$$ 274493 272315 260232 234083 195249 183553 193899 231999 312810 369004 390329 385814 387262
10641C87262Q135J5836m514o310n430j4569j4514j5599j2164L301L031R245k06
$$ 387262 395397 411233 406719 400409 394979 380410 365896 350297 338133 341434 344465 353710 353504
10628C53504k1439p207J1353O809J6379K2316J4414n039R294J0025J5542L683
$$ 353504 332065 324858 336211 343020 359399 381715 396129 391090 400384 410409 425951 429634
10616D29634j929m369p920L304J467r114Q310K4873J7510J1768Q095M451O586
$$ 429634 427705 423336 415416 418720 420187 411073 419383 444256 461766 473534 481629 486080 492666
10603D92666L397J6471J109J7641L1095L2279J8109Q025j2096J1287J7728J4473
$$ 492666 496063 512534 513643 531284 562379 594658 612767 620792 608696 619983 637711 652184
10591F52184R393N33O332j049j1540k3241q800J912J7096M363J7822L542p253
$$ 652184 661577 662110 668442 667393 655853 632612 623812 625724 642820 647183 665005 668547 661294
10578F61294K319J6614L7248L7700L9344L4435L8812N0620L1937L2697N0490N6658
$$ 661294 663613 680227 717475 755175 794519 828954 867766 918386 950323 983020 1033510 1090168
10566A090168O2790O3940P3721M0762P638K1108P7159R1266Q4300P5468R5144
$$ 1090168 1152958 1216898 1290619 1331381 1339019 1360127 1437286 1528552 1612852 1688320 1783464
10555A783464R0634J11317J18286J24055J31823J48429J66442K17532K51627K84231
$$ 1783464 1874098 1985415 2103701 2227756 2359579 2508008 2674450 2891982 3143609 3427840
10545C427840L44762M61310N85191O72142P54902Q77852J056980J124291R18308
$$ 3427840 3772602 4233912 4819103 5491245 6246147 7123999 8180979 9305270 10223578
10536A0223578O79035P77075J272424J949971K646190L272351L981513N430431
$$ 10223578 10902613 11679688 12952112 14902083 17548273 20820624 24802137 30232568
10528C0232568Q018902J1897848J7117526K3828983L5740717N8192003Q6911570
$$ 30232568 38251470 50149318 67266844 91095827 126836544 185028547 271940117
10521B71940117R8305320M6234210n8499056j10366572q8001787n3436204l1565552
$$ 271940117 370245437 416479647 357980591 247614019 159612232 106176028 74610476
10514G4610476j9544927j2796453q923959o466178m741460l495292k515463j821257
$$ 74610476 55065549 42269096 33345137 26878959 22137499 18642207 16126744 14305487
10506A4305487j333281r73144o66051n32439p60421j130291j145442q75400o63731
$$ 14305487 12972206 11999062 11333011 10800572 10040151 8909860 7764418 6889018 6225287
10497F225287n19724m44745l88789l73031l62150l37267k91452k87746l04527
$$ 6225287 5705563 5260818 4872029 4498998 4136848 3799581 3508129 3220383 2915856
10488B915856k87578k47941j92611j45918j27366j12221r5806o2075l8930m5961
$$ 2915856 2628278 2380337 2187726 2041808 1914442 1802221 1706415 1644340 1605410 1559449
10478A559449n8603o8925o0535j6523j6637l8229m5087m8532o9956n7904m9150
$$ 1559449 1500846 1431921 1371386 1354863 1338226 1299997 1254910 1206378 1136422 1078518 1029368
10467A029368l0338l430J7498R493J7743L2898K8107K7349O3921J32564J83021
$$ 1029368 999030 995600 1013098 1022591 1040334 1073232 1101339 1128688 1192609 1325173 1508194
10456A508194K54437L91774O29462P99270N04298l51156r59346q15468m70827
$$ 1508194 1762631 2154405 2783867 3583137 4087435 3736279 2776933 1961465 1490638
10447A490638k48785j06875k50O0428P6132k0549j03794j18372j12843q6887r1368
$$ 1490638 1241853 1134978 1134728 1195156 1271288 1250739 1146945 1028573 915730 828843 737475
10436G37475n7244l8127k4593j7187n629J4486N7204J07054J38719J33672m0355
$$ 737475 680231 642104 617511 600324 594695 609181 666385 773439 912158 1045830 1005475
10425A005475j96986k03157j45705j02188o6940k8073j2162j7851j6172N067n576
$$ 1005475 808489 605332 459627 357439 290499 262426 250264 232413 216241 221308 215732
10414B15732j0915P613L288m029L058J1913o19o855j9213j1878m619q115M253
$$ 215732 204817 212430 215718 211689 214747 226660 226041 219186 199973 188095 183476 175361 179614
10401A79614P629P253K3363L7914N0374M6373N4995O8680N3355k2855m8053n0468
$$ 179614 187243 194496 217859 255773 306147 352520 407515 476195 529550 506695 458642 408174
10389D08174k9291m1761n0558k0765N6j1741k1566j9945j5653j4685j0561p660
$$ 408174 378883 337122 286564 265799 265855 254114 232548 212603 196950 182265 171704 164044
10377A64044r391r9O990J8006O457k161L6365Q5479J21969J32997J28425R5119
$$ 164044 154653 154554 161544 179550 186007 183846 220211 305690 427659 560656 689081 784200
10365G84200L2377p4669j22579j03641o4570l6206k2847l167K334j5284r356p722
$$ 784200 816577 741908 619329 515688 451118 414912 392065 388898 391232 375948 366592 358870
10353C58870j5662r111j4283j6144l0089k1295P30k196J0556J8509j152l4240
$$ 358870 343208 334097 319814 303670 273581 252286 253016 250820 261376 279885 278733 244493
10341B44493l3775j2764L409M163P058o525j0408j0934k7662j4702J8563J6809
$$ 244493 210718 197954 201363 205526 212584 206059 195651 184717 157055 142353 160916 177725
10329A77725J3601l795m0775m8962l7853j975J1703L337K3336J3347q35J023K4910
$$ 177725 191326 187531 146756 97794 59941 57966 69669 73006 96342 109689 108854 109877 134787
10316A34787M697o351J3985R164l465j0655m000m435p867J9425R974j4473l1086
$$ 134787 139484 133133 147118 156282 152817 142162 138162 133727 125860 145285 155259 140786 109700
10303A09700j0522N78P657j474j840o053l015J7293J4430J2875J0139j1834j1370
$$ 109700 99178 99756 107413 105939 104099 98046 95031 112324 126754 139629 149768 137934 126564
10290A26564r23j4479n709p007m255J8439P441M110r049j583J1432L723J192J0675
$$ 126564 125641 111162 105453 98446 94191 112630 120071 124181 115132 113549 124981 128704 129896 140571
10276A40571k375j7114k600K2144J5730N289L0822K2021J3246J4350J1093j741
$$ 140571 138196 121082 118482 140626 156356 161645 192467 214488 227734 242084 253177 251436
10264B51436j466J0395R360k405k0955l2858k5781k9319j1229l384j3276l747
$$ 251436 249970 260365 269725 267320 246365 213507 187726 158407 147178 143794 130518 126771
10252A26771K030Q643J8065J1567J2344L732R748r66k585L942K3056J3189J956
$$ 126771 128801 137444 155509 167076 179420 183152 192900 191934 189349 193291 216347 229536 231492
10239B31492R813J9954L5361M2572K8567L1329N0018N7185M4427O0508Q9571Q5253
$$ 231492 241305 261259 296620 339192 367759 399088 449106 506291 550718 611226 700797 786050
10227G86050J12343J49712J88613K75566M13878N94773Q31923J149093J464692
$$ 786050 898393 1048105 1236718 1512284 1926162 2520935 3352858 4501951 5966643
10218E966643J629102J154591j52822j414927j753583j451226j041283p01782
$$ 5966643 7595745 8750336 8597514 7182587 5429004 3977778 2936495 2234713
10210B234713m86824l34239k34577j65036j23284q4609p0875m4155j3871O946
$$ 2234713 1747889 1413650 1179073 1014037 890753 806144 735269 691114 677243 684189
10200F84189L985j3220k2549j7463m89N411q92J4583O2799J09217J86418K94993
$$ 684189 688174 674954 652405 634942 634453 639864 638972 653555 716354 825571 1011989 1306982
10188A306982M49234N78737N60794L15150j30869n05196n98040m92305l52081
$$ 1306982 1756216 2334953 2895747 3210897 3080028 2574832 1976792 1484487 1132406
10179A132406k44256j55686q3541m7522k4645j5799k6613m4021m1325m4232n0361
$$ 1132406 888150 732464 648923 601401 576756 560957 534344 490323 448998 404766 354405
10168C54405l2889k7167k2609k4995j4309j0298j7727m303j0279j5467j4082j250
$$ 354405 321516 294349 271740 246745 232436 222138 204411 200108 189829 174362 160280 159030
10156A59030J2242O235J152K63J3189N729J674J0720N607p866m239q805j6946
$$ 159030 171272 177507 178659 178922 192111 197840 199514 210234 215841 207975 203736 194931 177985
10143A77985r555L25q301n591J832O909K235J219k925J4025J6258K8220L1384
$$ 177985 168430 168755 160454 154863 156695 163604 165839 167058 164133 178158 194416 222636 254020
10130B54020J6389J0950l978L799j1775j6836L76J6564P553J651R989J2706J7915
$$ 254020 270409 281359 277381 281180 269405 252569 252945 269509 277062 278713 288702 301408 319323
10117C19323L4195L6046L2660J9523J6607l047k5157l2610l4991k4652j5441P815
$$ 319323 353518 389564 422224 441747 458354 455307 430150 397540 362549 337897 322456 330271
10105C30271O853K0253M4064P2687P0079J18648J94950K89352M22438M94699K12695
$$ 330271 337124 357377 401441 474128 544207 662855 857805 1147157 1569595 2064294 2276989
10094B276989k91313n31592m10227k68346j59134j02344o3688n6181o0017m9836
$$ 2276989 1985676 1454084 1043857 775511 616377 514033 450345 394164 334147 284311
10084B84311k7508k4278k2692k5754k4538j9607j5094r754j2044l797J232p372
$$ 284311 256803 232525 209833 184079 159541 139934 124840 115086 103042 99245 100477 93105
10072I3105j5901k769J1670J1375j3082m410n635N572J1663l250k399K4619K8657
$$ 93105 77204 74435 86105 97480 84398 79988 74353 79925 91588 88338 85939 110558 139215
10059A39215K0205J0409k022j1975j26J6722K0378J563k101k8446j9200j7297
$$ 139215 159420 169829 167807 155832 155706 172428 192806 194369 192268 163822 144622 127325
10047A27325j4257j2350J306P322K998n6n69J9034J2487n92P58j4517k1413r649
$$ 127325 113068 100718 102024 109346 112344 112288 111719 130753 143240 142648 143406 128889 107476 97827
10033I7827p462p82J0339J3927l882k24j2602j220O263o686j1412n777n627j4313
$$ 97827 90365 89583 99922 113849 109967 109743 97141 95921 102184 95498 84086 78309 72682 58369
10019E8369P089J7331j3800p354N173L513j931J6376Q993K701m514p789m694Q65
$$ 58369 65458 82789 68989 61635 66808 70321 68390 84766 93759 96460 91946 84157 79463 80328
10005H0328k223L704J6236J5328J9015Q079K709K374K0957J7941J4728J5289J5149
$$ 80328 78105 81809 98045 113373 132388 140467 143176 145550 166507 184448 199176 214465 229614
9992B29614L9100M5534M7376O9319J07862J78824K45629L36550M07458L78110
$$ 229614 268714 314248 361624 430943 538805 717629 963258 1299808 1707266 2085376
9982B085376J48696k04144m16487l94079l05644k21649j30203q8472r5734p1490
$$ 2085376 2234072 2029928 1613441 1219362 913718 692069 561866 473394 377660 306170
9972C06170m1666j8556j4981k1092k0130k4599n849j1662o860Q184j1021k8703
$$ 306170 264504 245948 230967 209875 189745 165146 159297 147635 140775 148959 137938 109235
9960A09235l178P245J3153j6602k2172J433N888l212N836J5019O628j1485j3529
$$ 109235 106057 113302 126455 109853 87681 89114 95002 91790 97626 112645 119273 107788 94259
9947I4259l452N996Q118j0855q026o467r610p653Q603M672m883k02L079j6424
$$ 94259 90807 96803 104921 94066 86040 79573 69963 62310 70913 75585 70702 70500 73579 57155
9933E7155j755N599p193j073k538K657R403j1064k1327l736O455J107J6023J9417
$$ 57155 55400 60999 53806 52733 50195 52852 62255 51191 29864 26128 32583 33690 49713 69130
9919F9130J510J0319J0124p897j2859J2042K4238J2266q835j6517j5921p892l529
$$ 69130 70640 80959 91083 83186 70327 82369 106607 118873 110038 93521 77600 69708 66179
9906F6179k2891P5J1648r93j1555m621M357o26k617J2436P207J864N271l113J809
$$ 66179 43288 43363 55011 54018 42463 37842 42199 41573 38956 51392 58599 60463 65734 62621 64430
9891F4430r390j2141k309j874l11J972J1665n344j785k088L662n956L013Q377
$$ 64430 55040 42899 40590 38716 38405 40377 52042 46698 44913 42825 46487 40531 43544 51921
9877E1921K120O15J5664j0869j7023o901J78R23l19L019R981m152k944K451o942
$$ 51921 54041 54656 70320 59451 42428 35527 35705 36628 36309 39328 49309 45157 42213 44664 37722
9862C7722L306M799M930j1426o102O744L179M812L523K19m929p073j3758o650
$$ 37722 41028 45827 50757 39331 33229 39973 43152 47964 51487 51706 46777 39704 25946 19296
9848A9296M652k217L397J4058J5517P501n132j1713j0114K090J3963J709K77J2110
$$ 19296 23948 21731 25128 39186 54703 62204 57072 45359 35245 37335 51298 53007 53284 65394
9834F5394K5088L9894P2891J04692J08187N4486n2863j31605j11497m8707k4783
$$ 65394 90482 130376 203267 307959 416146 470632 417769 286164 174667 125960 101177
9823A01177j2031o048j8385j5244r302l149q967P02P083l180n452M925O336R949
$$ 101177 89146 83098 64713 49469 40167 37018 28051 28753 35836 32656 27204 32129 38465 48414
9809D8414k254J0209P749M20p891p669j1030j0838K524J0184R034K8580J1595
$$ 48414 46160 56369 64118 64538 56647 48978 37948 27110 29634 39818 48852 77432 89027
9796H9027K3901M9570N3359O1160K9479o188m6387o1045n7744l3918j4161j79
$$ 89027 112928 162498 215857 277017 306496 300308 253921 192876 135132 101214 87053 86874
9784H6874j1911j4616m618J1965l555p756l852m414m270J04M916P140Q20P246
$$ 86874 74963 60347 55729 67694 64139 56383 52531 48117 43847 43951 48867 56007 56827 64073
9770F4073l134p170r536j1994q16L493N657M813p823n072J0109J5026J611l938
$$ 64073 60939 53769 44233 32239 31423 34916 40573 45386 37563 32491 42600 57626 59237 55299
9756E5299O470J1405j829j1279p162K592j349K749j1108m656j1560p495L171J158
$$ 55299 61769 73174 71345 60066 52904 55496 54147 56896 45788 41132 29572 22077 25248 26406
9742B6406J2577P40j1572N055j327q869J3934J0425k280j180K746j112J823N205
$$ 26406 38983 39723 28151 33206 31879 23010 36944 47369 45089 43909 46655 45543 47366 52571
9728E2571P359Q954K693j2437k0176j073J7832J7172n737O18k589K357j640J0236
$$ 52571 59930 68884 71577 59140 38964 37891 55723 72895 67158 67776 65187 67544 65904 76140
9714G6140R11J2263K885n280n665M515J0206R369j7715j3298J0078J1162L493
$$ 76140 77051 89314 92199 86919 81254 85769 95975 105344 87629 74331 84409 95571 99064
9701I9064K149q23o538o57j6317j5144p14J5340l187M489p806Q04M926P860L635
$$ 99064 101213 100390 93852 93195 76878 61734 61020 76360 73173 77662 69856 70660 75586 83446 87081
9686H7081O636r507j3649N631N658R44j068K907N783M393J7532o656j2858J024
$$ 87081 93717 84210 70561 76192 81850 82794 81726 84633 90416 94809 112341 105685 92827 93851
9672I3851n558J5j554R34J6178l743q088M862P111k488r059O994O631q617R863
$$ 93851 88293 88308 86754 87688 103866 100123 92035 96897 104008 101520 92461 99455 106086 97469 107332
9657A07332J0078j996o618j9273j8868p791J9308k043J341J1619L768j1631N82
$$ 107332 117410 115414 108796 89523 70655 62864 82172 80129 81470 93089 96857 85226 85808
9644H5808K0499J2625M93j5586p312N677j0177O133N494M617p364K041J7681J1574
$$ 85808 106307 118932 119425 103839 96527 102204 92027 98160 103654 108271 100907 102948 120629 132203
9630A32203P44J2504r5m339O924O497M548R777k374j193j2768j3425k925N392
$$ 132203 132947 145451 145356 141017 147941 154438 158986 168763 166389 165196 152428 139003 136078 141470
9616A41470P29Q428j1578r606j9911j3968k675j286p726K286R983J6186N878m292
$$ 141470 142199 150627 139049 129443 109532 95564 92889 91603 83877 86163 96146 112332 118210 113918
9602A13918j1258j2902O619j265J224Q557J337j0663p113k59l975m937R808k459
$$ 113918 102660 89758 96377 95112 96336 104893 106230 95567 88454 88195 84220 79283 89091 86632
9588H6632p333m983J1925R577K3641K5843O200j3775J3501J574J728N721J7661
$$ 86632 79299 74316 86241 95818 119459 145302 151502 137727 151228 152802 154530 160251 177912
9575A77912q162r559j3836l354l132l365q037j080n551k2158j7807n071N384m192
$$ 177912 169750 160191 146355 143001 139869 136504 128467 127387 121836 99678 81871 76800 82184 77992
9561G7992p47J7202p623l806m153n049m505M585n002J7185J7957l984J1118l514
$$ 77992 77245 94447 86824 83018 78865 73816 69311 73896 68894 86079 104036 100052 111170 107656
9547A07656j0162J240K0374l485J202J266k803l209m542K109R320P736j889Q423
$$ 107656 97494 98734 119108 115623 116825 118091 115288 112079 107537 109646 118966 126702 124813 133236
9533A33236j075p078j6222j0197J9513R167L216R764j2760r180n064p908j279
$$ 133236 132161 125083 108861 98664 118177 127344 130560 140324 127564 118384 113320 105412 104133
9520A04133l121L532L82o69J3166N259k3644j3272J257q742k545P171P041o094
$$ 104133 101012 104544 104926 104257 117423 122682 99038 85766 87023 78281 75736 82907 89948 83854
9506H3854q330k367J1938k680j0279r44R750l916n664J0167Q466j0350k374L638
$$ 83854 75524 73157 85095 82415 72136 71192 80942 77026 71362 81529 89995 79645 77271 80909
9492H0909P578J7576R17j498N898O903l048Q54j501j4393m334R795O230p859p053
$$ 80909 88487 106063 106980 105482 111380 118283 115235 116089 114588 100195 95861 105656 111886 104027 96974
9477I6974J1678Q170k4394j2777k844J4369K058j7086K67L501r926K119J0181
$$ 96974 108652 116822 92428 79651 76807 91176 93234 76148 76415 79916 69990 72109 82290
9464H2290P666n330q126n048j04j438J5388J1651o912n007p281m442p972m286
$$ 82290 89956 84626 76500 71452 71348 69910 85298 96949 90037 85030 77749 73307 65335 61049
9450F1049j3706J3025J0943l691k520J0484J5661q622K63j497m009Q65P820j1822
$$ 61049 47343 60368 71311 67620 65100 75584 91245 82623 82886 81389 77380 78245 86065 74243
9436G4243j0805P607J5560L706K545p70j2675q530j508r3K415J524j422r549n052
$$ 74243 63438 71045 86605 90311 92856 92086 79411 70881 69373 69280 71695 73219 71797 62248 57196
9421E7196O437M728R425Q024P065O003o404j96L231N683o992n110p009M535N068
$$ 57196 63633 68361 77786 85810 92875 98878 92474 92278 95509 101192 94200 89090 82081 86616 91684
9406I1684o89j0274q645m2j0387j452J2762N117P024R196K956O081l172j3942
$$ 91684 90995 80721 72076 72034 61647 60195 72957 78074 85098 94294 97250 103331 100159 86217
9392H6217j858O427k609j109L781o935k526P441m461j288L589J0762k159j5197
$$ 86217 84359 90786 88177 87068 90849 83914 81388 88829 84368 83080 86669 97431 95272 80075
9378H0075k4889j1790J7034J9356J3165O380j5995m9J2951J301m473j2355k110
$$ 80075 55186 43396 60430 79786 92951 99331 83336 83287 96238 97539 93066 80711 78601
9365G8601J0469l871q304j597o952j699K0192J300o068J240j846N143J6525J1278
$$ 78601 89070 85199 76895 75298 68346 66647 86839 88139 82071 83311 81465 86608 103133 114411
9351A14411p530o058p292J2888M609p804m212j22J199J991j2652n085N447L986
$$ 114411 106881 100823 93531 106419 111028 103224 99012 98890 100089 102080 89428 84343 89790 93776
9337I3776p526l140j596j810R630P387K085j476j0188M225M304j0205j261K35
$$ 93776 86250 83110 81514 79704 89334 96721 98806 97330 87142 91367 95671 85466 84205 84440
9323H4440P084M667L173k809J1993L594l950L220M58J0536j2151m315J915m928
$$ 84440 91524 96191 99364 96555 108548 112142 108192 111412 111870 122406 110255 105940 107855 102927
9309A02927K278M255J2571J6971n124k1112j4592J420J3131J234R4m909P545M106
$$ 102927 105205 109460 122031 139002 133878 112766 98174 99594 112725 113959 114053 109144 116689 120795
9295A20795q059j0889o894P718M30R605L485m843K224L194j677k508k628J919
$$ 120795 112736 101847 94953 102671 103101 112706 116191 111348 113572 116766 115089 112581 109953 111872
9281A11872J544n427K473J4608j1399M470J1013j698n258m139j0378p781j0528
$$ 111872 113416 107989 110462 125070 113671 118141 129154 127456 122198 118059 107681 99900 89372
9268H9372k854J8945K5916J3357m123j1021l698N360p088m293J6851L518M55L099
$$ 89372 86518 105463 131379 144736 140613 129592 125894 131254 124166 119873 136724 140242 140697 143796
9254A43796l571m996N095O874p529k802n150J596J0596r0q437r636Q796M641K067
$$ 143796 140225 135229 140324 147198 139669 136867 131717 133313 143909 143819 135382 125746 134542 139183 141250
9239A41250M034L656O244j494R398o09j2048j692r048m896O843j0659K707N645
$$ 141250 145284 148940 155184 153690 163088 162479 150431 148739 139691 134795 141638 130979 133686 139331
9225A39331j9366m456J0276K0717J2337r522L507m731Q523J1201L325J863J702
$$ 139331 119965 115509 125785 146502 158839 149317 152824 148093 156616 167817 171142 173005 174707
9212A74707j1340k905p793O334n676o562j068N683J2676r769m70R553O518j690
$$ 174707 163367 160462 152669 159003 153327 146765 145697 151380 164056 154287 153817 163370 169888 168198
9198A68198k503r335m309j971K400Q633L345L181j693J0043p15n590q250j722
$$ 168198 165695 156360 152051 150080 152480 161113 164458 167639 165946 175989 175274 169684 161434 159712
9184A59712K102J795l597J6927L213J0896r763n513m535J5877M030j7673k948
$$ 159712 161814 163609 160012 176939 180152 191048 181285 175772 171237 187114 191144 173471 170523
9171A70523L509J2164J0657N979m506q994m152j4620L69J3261J171m080l291o212
$$ 170523 174032 186196 196853 202832 198326 189332 185180 170560 170929 184190 185361 181281 177990 171778
9157A71778J932P853J0079J202j774m566j1274R07L988L838J0579R109J8410j0753
$$ 171778 173710 181563 191642 192844 191070 186504 175230 176137 180125 183963 194542 203651 222061 211308
9143B11308r52n704O180n213R13N794N18o668Q025P792p589j4292J1001P044m623
$$ 211308 210356 204652 210832 205619 206532 212326 212844 206176 214201 221993 214404 200112 211113 218157 213534
9128B13534J2647K0637n132p349K96k321o96j6591K502J2746l512j1059J4055
$$ 213534 226181 246818 241686 234337 234633 232312 231616 215025 217527 230273 226761 215702 229757
9115B29757J1636j124k990j384O511N357Q138P622m27K9K34r335k531J0479L991
$$ 229757 241393 240269 237279 235895 242406 247763 255901 263523 263096 263125 263359 254024 251493 261972 265963
9100B65963R72N821r341p467K5435P623L08j0741p52n169L266J8641P007q352
$$ 265963 266935 272756 263415 255948 281383 289006 289314 278573 277821 272652 275918 294559 301566 293214
9086B93214J3796o732O738J5750r566K071l943j619K386Q580J0783q989j2039
$$ 293214 307010 300278 307016 322766 313200 315271 311328 309709 312095 320675 331458 322469 310430
9073C10430J5849J2516k49l746J921j2951j8974Q31J5400J5519Q059J3520K2690
$$ 310430 326279 338795 338546 334800 336721 323770 304796 305627 321027 336546 344605 358125 380815
9060C80815L623j3863o900l534N386L482l212m084J5805K431r876L963P387J1509
$$ 380815 384438 370575 363675 360141 365527 369009 365797 361713 377518 379949 370073 374036 381423 392932
9046C92932K366K878P761j86k3238R424J4435K3P669J8005m52p325M280l421m657
$$ 392932 395298 398176 405937 405751 382513 391937 406372 406395 414064 432069 431617 424292 428572 425151 420494
9031D20494o603n812L837K3124J2490L883K0508Q718L53j259J1656p022n658O037
$$ 420494 413891 408079 411916 435040 447530 451413 471921 480639 480992 479733 491389 484367 478709 484746
9017D84746N378J4707r202l907J6510J7525K5645N623P74r380K14k081J0241J1270
$$ 484746 490124 504831 495629 491722 508232 525757 551402 557025 557799 548419 548633 546552 556793 568063
9003E68063J0044m364J510q4r905J317K391Q504J5171O358P432O110M742N851
$$ 568063 578107 573743 575253 575169 565264 566581 568972 577476 592647 599005 606437 612547 617289 623140
8989F23140k483J6381J5743J805Q418r918P096P983N815J5230J3537P766n136
$$ 623140 620657 637038 652781 654586 663004 653086 660182 668165 673980 689210 702747 710513 705377
8976G05377l907m770M053J3089J4735K999Q852K0192J1278K796P270J2776J0499
$$ 705377 701470 696700 700753 713842 728577 731576 740428 760620 771898 774694 781964 794740 805239
8963H05239N85J2490R595l134j882J3008K3583L5419Q151J1387L781P101J6037
$$ 805239 805824 818314 827909 824775 822893 835901 859484 894903 903054 914441 918222 925323 941360
8950I41360K0815J9094J1553J476m115r261J7280J3131J4873L4814K5552K5422
$$ 941360 962175 981269 992822 994298 990183 980922 998202 1011333 1026206 1061020 1086572 1111994
8938A111994L359j1907K2075J6361m30L986J2967K4765J2398J1976K9382J8435
$$ 1111994 1115353 1103446 1125521 1141882 1141452 1145438 1158405 1183170 1195568 1207544 1236926 1255361
8926A255361L469J5592K4659K9053M196J5584J8733K6460K9816J6029J8509K2421
$$ 1255361 1258830 1274422 1299081 1328134 1332330 1347914 1366647 1393107 1422923 1438952 1457461 1479882
8914A479882K7490K8728K4370l09J2758L2881L1880J9303J5754K6435L0551K7418
$$ 1479882 1507372 1536100 1560470 1560161 1572919 1605800 1637680 1656983 1672737 1699172 1729723 1757141
8902A757141K8437K5227J7787K6175L2398L2084L8241L3413L1954K3489L3479
$$ 1757141 1785578 1810805 1828592 1854767 1887165 1919249 1957490 1990903 2022857 2046346 2079825
8891B079825L6127K0114L7056M1590L7028K4303L3373M2316M5955M7595L9583
$$ 2079825 2115952 2136066 2173122 2214712 2251740 2276043 2309416 2351732 2397687 2445282 2484865
8880B484865N3826M2629K2399L9702N0723N3736N4816M8668L9075N0696N7537
$$ 2484865 2538691 2581320 2603719 2643421 2694144 2747880 2802696 2851364 2890439 2941135 2998672
8869B998672N2489O6457M9010L3526L9579N1171O7136O2895P0996P6709M4436
$$ 2998672 3051161 3117618 3166628 3200154 3239733 3290904 3358040 3420935 3491931 3568640 3613076
8858C613076N5989O4794N7041N9081N6441P4301P4162O5949Q5519R8250P2485
$$ 3613076 3669065 3733859 3790900 3849981 3906422 3980723 4054885 4120834 4206353 4304603 4377088
8847D377088N4437O6344P4491P5086Q3875O8752P8103P7689O7222P8733Q7761
$$ 4377088 4431525 4497869 4572360 4647446 4731321 4800073 4878176 4955865 5023087 5101820 5189581
8836E189581P3468Q0917Q4460Q5634P2864O1733O4175P8522O9886P4445O7643
$$ 5189581 5263049 5343966 5428426 5514060 5586924 5648657 5712832 5791354 5861240 5935685 6003328
8825F003328O4574M6765O3806P0526O7044P1243N4545M2213M7912O7727O0459
$$ 6003328 6067902 6114667 6178473 6248999 6316043 6387286 6441831 6484044 6531956 6599683 6660142
8814F660142N1455M1217J8602K8045L0163K8432J5246J8554R714p79o671j1423
$$ 6660142 6711597 6752814 6771416 6799461 6829624 6858056 6873302 6891856 6901570 6900791 6894120 6882697
8802F882697n537Q399r701o276j6128k7618m4255m1388l0895l2156l8695o1084
$$ 6882697 6877160 6885559 6875858 6869582 6853454 6825836 6781581 6740193 6709298 6677142 6638447 6577363
8790F577363n0749n6752m6377m8779n2611n8651p3188p2921o8181p9382q2600
$$ 6577363 6526614 6469862 6423485 6374706 6322095 6263444 6190256 6117335 6049154 5969772 5887172
8779E887172p2069p6414p0946p2677p8647o5785p9985q8513q0081q8820r3532
$$ 5887172 5815103 5738689 5667743 5595066 5516419 5450634 5370649 5282136 5202055 5113235 5019703
8768E019703q9380p0461o3217p2780p9492q5870o4460o3361o6414p0079p8047
$$ 5019703 4930323 4859862 4796645 4723865 4644373 4558503 4494043 4430682 4364268 4294189 4216142
8757D216142q9485q3346p4560m6267n6784p7568p5402p5089n3216n1259m7864
$$ 4216142 4126657 4043311 3968751 3922484 3865700 3788132 3712730 3637641 3584425 3533166 3485302
8746C485302n1018o4864n6249n5034p4651p8685m5800m4709m7520o6497n6959
$$ 3485302 3434284 3369420 3313171 3258137 3183486 3104801 3059001 3014292 2966772 2900275 2843316
8735B843316m7505l2082m9116n3864n0375l9524m5882m3817k8849m3652k8372
$$ 2843316 2795811 2763729 2714613 2660749 2610374 2570850 2524968 2481151 2452302 2408650 2380278
8724B380278l7012l4545m6091m3737l8501m5475l8922l0520k4180l1466k8908
$$ 2380278 2343266 2308721 2262630 2218893 2180392 2134917 2095995 2065475 2041295 2009829 1980921
8713A980921k2824l4705l3390l8806l5114l7826k2540j1778k6933j0216j4327
$$ 1980921 1958097 1923392 1890002 1851196 1816082 1778256 1755716 1743938 1717005 1706789 1692462
8702A692462k3221m5563j7073j6689l3196k2341l5909k6396k5193k6693k2884
$$ 1692462 1669241 1623678 1606605 1589916 1556720 1534379 1498470 1472074 1446881 1420188 1397304
8691A397304n632j2903k0690k1433j2802j9314k9409j4954j9495j9018k9984k2472
$$ 1397304 1391672 1378769 1358079 1336646 1323844 1304530 1275121 1260167 1240672 1221654 1191670 1169198
8679A169198J2182m709k4571k7608j8402n452q080q851r596q114k2594j7156j0904
$$ 1169198 1181380 1176671 1152100 1124492 1106090 1100638 1092558 1083707 1074111 1065997 1043403 1026247 1015343
8666A015343j0480n958j456j3193k3904k7581j8286j7784j4037o659j648o678
$$ 1015343 1004863 998905 997449 984256 960352 932771 914485 896701 882664 876005 874357 867679
8654H67679k3233j712r96j5871j5346j8459k6575j4961k106K841k201L265j9727
$$ 867679 844446 842734 841738 825867 810521 792062 765487 750526 748420 751261 749060 752325 732598
8641G32598o713L117L744l493r448k4391j9844J7831J8113j4837j1103J5867J0138
$$ 732598 725885 729002 732746 729253 719805 695414 675570 693401 711514 696677 685574 701441 711579
8628G11579J9557M242k7738k2587r357j4380k0889k0791j9457q807o110j1589
$$ 711579 731136 735378 707640 685053 675696 661316 640427 619636 600179 591372 585262 573673
8616E73673o568j0121n360O097J964J5672J8396r242j2540j8504l1259j2727N650
$$ 573673 567105 556984 551624 557721 559685 575357 593753 584511 571971 553467 522208 509481 515131
8603E15131J0891j5434k464R499J817k458N117p196j4818j3085j5384n362Q723
$$ 515131 526022 510588 508124 517623 519440 516982 522099 514903 500085 487000 471616 466254 474977
8590D74977k790k556j470L383K6047J4296K8641O4597M8857j5742o1585o4173
$$ 474977 472187 469631 468161 471544 497591 511887 540528 605125 653982 638240 576655 512482
8578E12482l6527r393M00j3034j0247p523J637r496q540n395L652N284L283n36
$$ 512482 475955 466562 466962 453928 443681 436158 437795 428299 419759 414364 418016 423300 426583 426047
8564D26047j6443j1696o173j90o764j3154j2987k668K092J711j7255j7265r59
$$ 426047 409604 397908 391735 391545 384781 371627 358640 355972 358064 359775 342520 325255 324296
8551C24296q47J127Q28J0736J395j0579m314P98J590M872O286J709R879J8379
$$ 324296 323449 324576 325404 336140 337535 326956 322642 323440 325030 329902 336188 337897 347776 366155
8537C66155L0518k639k7350k2770k9785k2290j1853l615n292J984J30k264p092
$$ 366155 396673 394034 366684 343914 314129 291839 279986 276371 271079 273063 273193 270929 263837
8524B63837l097l740p803k557m660J121O758J2502j9415j1347m335Q68J0651J4751
$$ 263837 260740 257000 249197 246640 241980 243101 249859 262361 242946 231599 227264 228132 238783 253534
8510B53534N291o370o514j3333L808K11j3348n07k120n364j757J288J0528m909
$$ 253534 258825 252455 245941 232608 236416 236627 223279 222772 220652 215288 213531 214819 225347 220438
8496B20438r887J0850m605m139m847J945M241R29J373n097m092k759M360j0416
$$ 220438 210551 221401 216796 212657 207810 209755 213996 214925 216298 211201 207109 204350 208710 198294
8482A98294j6176l863J1541P868M929p598r895P318J4134N62j3544j3800j579
$$ 198294 182118 178255 189796 197664 202593 194995 185100 192418 206552 207114 193570 179770 178191
8469A78191J5904l995n623P654J343J610j1028p644j6354q054N277N454K72j9028
$$ 178191 194095 190100 184477 192131 193474 195084 184056 176412 160058 152004 157281 162735 163007 143979
8455A43979j3415N399p705J0518J9472j413m903n48q82J0358P765l487j689n540
$$ 143979 130564 135963 128258 138776 158248 156835 151932 151384 150502 160860 168625 165138 163449 157909
8441A57909K655j463j3402O615P084r787j6889j8043L674J9307N738j811j07L671
$$ 157909 160564 159101 145699 152314 159398 149611 132722 114679 118353 137660 143398 141587 141480 145151
8427A45151l660K703o789J469M4p312n342J447p14L032O158o915l689R447n37
$$ 145151 141491 144194 137405 138874 138918 131606 126264 127711 126997 130029 136187 129272 125583 135030 134493
8412A34493q281m176m565n579j430K1278L222j7147k280p937N157J1218l788J3116
$$ 134493 126212 122036 117471 111892 110462 131740 134962 117815 115535 107598 112755 123973 120185 133301
8398A33301L163j329J2937q163q976j290j3491M303J4735r360j2484k060J420
$$ 133301 136464 135135 148072 139909 130933 129643 116152 120455 135190 125830 113346 111286 112706
8385A12706R010K2144J6572m597l3985j2980J488K792o690O129j373Mn240n525
$$ 112706 121716 143860 160432 155835 121850 108870 110358 113150 106460 112589 111216 111220 105980 100455
8371A00455j1526j0049k407R793J6585N576p960j7045o849n847J3981J722l458
$$ 100455 88929 78880 76473 86266 102851 108427 100467 83422 76573 70726 84707 86429 82971
8358H2971R575k355P415J376o723L277r193o589l595j3047N735J7777Q510M272
$$ 82971 92546 90191 97606 98982 92259 95536 86343 79754 76159 63112 68847 86624 95134 99406
8344I9406n00n057k790k0653n00J3300P256J8n929K30r239j0902K492K3291J3347
$$ 99406 98906 93849 91059 70406 69906 83206 90462 90480 84551 84781 75542 64640 67132 90423 103770
8329A03770J3584K5919K0687q408j3449R53j8025j6252j3032P03o09j958k063
$$ 103770 117354 143273 163960 155552 142103 143056 125031 108779 95747 96450 95841 93883 91820
8316I1820o174O58L435j6932m268R774Q702j2182r003o85J925n558L137R09J2931
$$ 91820 85646 86304 89739 72807 68539 78313 87015 74833 65830 65145 67070 61512 64649 65558 78489
8301G8489J2135K446r550n712M609k651m296j4720O763J1653N502K38k865Q205
$$ 78489 90624 93070 83520 77808 82417 79766 75470 60750 67513 79166 84668 84906 82041 90246
8287I0246J9837J3376O592r371k1471o997j2586m903k669m791L59Q101k525j867
$$ 90246 110083 123459 130051 120680 99209 92212 79626 74723 72054 67263 67622 75723 73198 71331
8273G1331n508N515K811j1986K188J5807Q237j8830j0250O793p925M219P365O645
$$ 71331 65823 71338 74149 62163 64351 80158 88395 69565 59315 66108 58183 62402 69767 76412
8259G6412J62j7457o664M925Q293m490l394J1495j5874r358J4553L373K179j3501
$$ 76412 76574 59117 52453 57378 65671 61181 57787 69282 53408 44050 58603 61976 64155 50654
8245E0654L656O527o336J2989J0290o414m425p70n847k3065M074j579M772Q031
$$ 50654 54310 60837 54501 67490 77780 71366 66941 66171 60324 37259 41333 39754 44526 52557
8231E2557P344r161j5699p356J179Q50J331R899p456P115K777j5600o442L735
$$ 52557 59901 50740 35041 27685 28864 29714 31045 40944 33488 40603 43380 27780 21338 25073
8217B5073J5198J8704M639j2869j016Q244Q62k855j7736p835J0117j161L55K99
$$ 25073 40271 58975 63614 50745 49729 57973 58835 55980 38244 30409 40526 39365 39720 40019
8203D0019L781M697K833j0806p037N509J6123K059n564j8642l448P133J4646R782
$$ 40019 43800 48497 51330 40524 33487 38996 55119 57178 51614 32972 29524 36657 51303 61085
8189F1085N440o121j3229j7453Q958P711n920q676m434n196K222J2985N419M819
$$ 61085 66525 60404 47175 29722 38680 46391 40471 31795 27361 22165 24387 37372 42791 47610
8175D7610j2567J057q44J3264O279r911k521N940J88O528M427j0744J588j3874
$$ 47610 35043 36100 35256 48520 54799 44888 42367 48307 48495 55023 59450 48706 50294 36420
8161C6420q953L384L516Q94P135M448L640q098j8142j8053n024R986Q506N074
$$ 36420 27467 30851 34367 35261 42396 46844 50484 42386 24244 6191 1167 11153 19659 24733
8147B4733R733R723l503n132j027J4229J0437Q67j3757j2764n948j678l065L778
$$ 24733 34466 44189 40686 35554 34527 48756 59193 60060 46303 33539 27591 25913 22848 26626
8133B6626k216J0100M462j1172L980J1108N879r742J277L012L539K0294m593j0015
$$ 26626 24410 34510 38972 27800 31780 42888 48767 39025 40302 43314 46853 67147 62554 52539
8119E2539j5846k0438q33J6063Q53M66J442Q701J245j6158J716K692n588j1315
$$ 52539 36693 16255 15422 31485 32338 32804 34246 42947 44192 28034 29750 32442 26854 15539
8105A5539j8428r405J4950J4974l614L11O204Q476q306q434P170J559n49j0356
$$ 15539 -2889 -12294 2656 17630 14016 14327 20531 29007 20701 12267 19437 20996 20447 10091
8091A0091J337N426l003P459k205k878J2274L620n246Q398J3894J4364K19j0692
$$ 10091 11428 16854 13851 21310 19105 16227 28501 32121 26875 35273 49167 63531 63750 53058
8077E3058j6890j8331J268N755l525j0719M094K168L150m180k365Q461J2220M821
$$ 53058 36168 17837 19105 24860 21335 10616 14710 16878 20028 15848 13483 21944 34164 38985
8063C8985JJ4203p13j1026j2689p256j2218J3668J7770m781j1702M260J0846L609
$$ 38985 38986 53189 52476 41450 28761 21505 9287 22955 40725 35944 24242 28502 39348 42957
8049D2957p616K374m169l716N269J4962L132l984j1460k1769R01r85O992M249
$$ 42957 35341 37715 33546 29830 35099 50061 53193 49209 37749 15980 16881 15896 22888 27137
8035B7137o036o647M934O812K115q151L102R750J678j003j004l381m82r567K667
$$ 27137 21101 14454 19388 26200 28315 20164 23266 33016 34694 33691 32687 29306 28824 19257 21924
8020B1924k361O116N023P453R076p904M34O949l325n49m047k0192k89N940J5765
$$ 21924 19563 25679 30702 38155 47231 39327 39761 46710 43385 42836 38789 18597 18308 24248 40013
8005D0013q410j9331P151k064K867J0907j1585O033K227j4540j53N614j3878L31
$$ 40013 31603 12272 19423 17359 20226 31133 19548 25581 27808 13268 13115 18729 4851 5182
7991E182N535n769J8415K867j5606j6645k800R992J8718K3661J743j9460J2193
$$ 5182 10717 4948 23363 26230 10624 -6021 -8821 1171 19889 43550 45293 25833 38026
7978C8026M856J814J346p058j0703N036L03q865J0170K556j2077j1358Q363J3438
$$ 38026 42882 44696 46042 38984 28281 33317 33620 24755 34925 37481 25404 14046 22409 35847
7964C5847K1590L015l410q389p142r679p346o98K224J2236J7320k3654j6966J531
$$ 35847 57437 60452 57042 48653 41511 31832 24486 23788 26012 38248 55568 31914 14948 16479
7950A6479q951M519n24J2665R600j0243P62o125q368O556j0r733l159M359J7028
$$ 16479 7528 12047 11523 24188 33788 23545 24307 18182 9814 16370 16360 6627 3468 7827 24855
7935B4855J0383M384n182l452L371j9593r40J3983M793q433j030n375j758l298
$$ 24855 35238 39622 34440 30988 34359 14766 13826 27809 32602 24169 23139 17764 16006 12708
7921A2708j502L632k753L924Q248l521M506q26L860r203q939J9729P432R51J0353
$$ 12708 11206 14838 12085 16009 24257 20736 25242 24416 28276 19073 10134 29863 37295 38246 48599
7906D8599l880j4432q870L941M059R180p942K313p887K718J605o682m664k035
$$ 48599 44719 30287 21417 25358 29417 38597 30655 32968 25081 27799 29404 22722 18058 16023
7892A6023n738P756J3610Q57n979Q07l560j7612o381J0337N750P766n491j2060
$$ 16023 10285 18041 31651 32508 26529 27336 23776 6164 -217 10120 15870 23636 18145 6085
7878F085J08J782q016k160n172k002R323J2531m829j0728j760J359J7403Q247
$$ 6085 6193 7975 -41 -2201 -7373 -9375 -52 12479 7650 -3078 -4838 -3479 13924 22171
7864B2171o410q689l313O321n486n354J2721P409r846j1904r82P905J3906R020
$$ 22171 15761 7072 3759 10080 4594 -760 11961 19370 9524 -2380 -3362 4543 18449 27469
7850B7469K954l401J318N465q237q187j813K790m777M956r396k735J170Q382l302
$$ 27469 30423 27022 28340 33805 25568 17381 15568 18358 13581 18537 9141 6406 7576 15958 12656
7835A2656n677o204K726J464P230J2727n897k2981j732O582O594J0502j2347q688
$$ 12656 6979 775 3501 4965 12195 24922 19025 -3956 -5688 894 7488 17990 5643 -3045
7821c045K476J8938J752j6221j2875Q776J6913O969j2329k0030J2058J3108K108
$$ -3045 -569 18369 20121 3900 -8975 -199 16714 23683 11354 -8676 3382 16490 18598
7808A8598j9252m120J4215N009j2499P687l651k751J7380L485k182r333n658P608
$$ 18598 -654 -4774 9441 14450 1951 9638 5987 3236 20616 24101 21919 12586 6928 14536
7794A4536R343J867M8J1734j713k4971j1211J0219o83R412P641j1336j2586P816
$$ 14536 23879 25746 25794 37528 35815 10844 -367 9852 9169 18581 26222 14886 2300 10116
7780A0116k933j2858l56O568M963P89r342K91K872k058Q804p92M397p545L764
$$ 10116 7183 -5675 -6031 537 5500 6289 -3053 -2762 110 -1948 6856 6064 10461 2916 6680
7765F680J0906j8721N34N678j981j5151q264K333J8780Q787N23K787Q292n350
$$ 6680 17586 -1135 -601 5077 3096 -12055 -20319 -17986 794 9581 10104 12891 21183 15833
7751A5833k024J75k535l324L337J1747r467p367m515k78J0581J0103j15O604P673
$$ 15833 13809 13984 11449 8125 11462 23209 13742 6375 1860 1582 12163 22266 22151 28755 36428
7736C6428j3431j4155L191j0072m0j099J957R88j45l05J440n848L169J1288Q031
$$ 36428 22997 8842 12033 1961 1921 822 2779 3767 3622 3317 4757 -1091 2078 13366 21397
7721B1397r299R84P56m814J6676j0467j3343K379o820p057O16K6673K74p045J351
$$ 21397 12098 13082 13838 9024 25700 15233 1890 4269 -2551 -9608 -8992 17681 17955 10910 12261
7706A2261p271j985k507j4924J0437J3356P070o307K411l17l409J071M446n080
$$ 12261 4990 3005 498 -14426 -3989 9367 16437 10130 12541 12224 8815 9886 14332 9252
7692I252L883j8267n712J5260M944q858P007M169N595p360j3750m458k705n042
$$ 9252 13135 -5132 -10844 4416 9360 502 7509 11678 17273 9913 -3837 -8295 -11000 -16042
7678a6042j3884L016R870K883J6627n141o803M666j921J7505L368n673j0173K447
$$ -16042 -29926 -26910 -17040 -14157 2470 -2671 -9474 -4808 -6729 10776 14144 8471 -1702 745
7664G45O838Q771n987o449k682j778N188Q429m759q123K370O759q842M69n920
$$ 745 7583 16354 10367 3918 1236 -542 4646 13075 8316 193 2563 9322 480 949 -4971
7649d971j1007J3200J6779M723K082p30j5686r412j1106m002l489M764R056K770
$$ -4971 -15978 -2778 14001 18724 20806 20076 4390 -5022 -16128 -20130 -23619 -18855 -9799 -7029
7635g029J496L6o025n729K194J3238Q661R951p037r076n80L327Q317Q937J1320
$$ -7029 -5533 -5497 -11522 -17251 -15057 -1819 6842 16793 9756 680 100 3427 11744 20681 32001
7620C2001j9119k5313j0489O590R997j498j007j031N999k161q650k784P242m942
$$ 32001 12882 -12431 -22920 -16330 -6333 -7831 -8838 -9869 -3870 -6031 -14681 -17465 -10223 -15165
7606a5165j222J2445J3706R51r955k438L181j2562L479P482O724L626q988j4329
$$ -15165 -16387 -3942 9764 10715 760 -1678 1503 -11059 -7580 -98 6626 10252 1264 -13065
7592a3065K114O058J0756J300R171L182j3043n440m345o980q943P121O602l598
$$ -13065 -10951 -4893 5863 7163 16334 19516 6473 1033 -3312 -10292 -19235 -12114 -5512 -9110
7578i110K550j1663J8540J5870M236M503M054n975j0226j1510j3731m267J1045
$$ -9110 -6560 -18223 317 16187 20423 24926 28980 23005 12779 1269 -12462 -16729 -5684
7565e684J1028J38j3541J438M429j447M735l407L304L053j2538l546q937k727
$$ -5684 5344 5482 -8059 -6621 -2192 -3639 1096 -2311 993 4046 -8492 -12038 -20975 -23702
7551b3702R219P77Q582m95j6100j8487J2607J7767n570o75l714j35J4736r14j2702
$$ -23702 -14483 -13706 -5124 -5619 -21719 -40206 -27599 -9832 -15402 -16077 -19791 -19926 -5190 -6104 -18806
7536a8806J008J4089P398Q602n176q948J0285J5487m236M25o583n534p865j3971
$$ -18806 -17798 -3709 3689 12291 7115 -1833 8452 23939 19703 20128 13545 8011 146 -13825
7522a3825q803L351K1157L668p979R870N091L51q385Q798j856q912j6418K431
$$ -13825 -22628 -19277 1880 5548 -2431 7439 12530 12881 4496 13294 11438 2526 -13892 -11461
7508a1461K640J061M703l895N414n850L84R882m768j2330l26Q789P142M664P937
$$ -11461 -8821 -7760 -3057 -6952 -1538 -7388 -7004 2878 -1890 -14220 -14546 -5757 1385 6049 13986
7493A3986Q418m599j0881j1827j459J988o998K672j496p535m080L681L195j1775
$$ 13986 22404 17805 6924 -4903 -6362 -4374 -11372 -8700 -10196 -17731 -21811 -18130 -14935 -26710
7479b6710l048J157O363Q148N078Q891L558l482J1909J1207L515m089j5407j8471
$$ -26710 -29758 -28601 -22238 -14090 -9012 -121 3437 -45 11864 23071 26586 22497 7090 -11381
7465a1381o20J8923J2504j4271l977L112J392j27m176J160O947n030n318J117
$$ -11381 -12001 6922 19426 5155 1178 4290 5682 5555 1379 2539 9486 4456 -862 255
7451B55J467l682J3597m140j3523q289j089n569m727r457P992J963P862J92M03
$$ 255 1722 -1960 11637 7497 -6026 -14315 -15404 -20973 -25700 -35157 -27165 -25202 -17340 -17148 -16745
7436a6745J3706J988r126J2750J0830q648o495r28O261O376q59J473q015j2256
$$ -16745 -3039 -1051 -10177 2573 13403 4755 -1740 -2668 3593 9969 9110 10583 2568 -9688
7422i688J87l610J5390J4529j1517j934o78L903r87M583k342J690l703j0176n068
$$ -9688 -9501 -13111 2279 16808 5291 3357 2679 6582 5595 10178 7836 9526 5823 -4353 -9421
7407i421j910R629J4506M840J879j278j0824j0723M616n397j678r040l386l154
$$ -9421 -11331 -1702 12804 17644 19523 18245 7421 -3302 1314 -4083 -5761 -14801 -18187 -21341
7393b1341Q650r945j412n975O266K158J7887R273n55o468R67j365m27N006j541
$$ -21341 -12691 -22636 -24048 -30023 -23757 -21599 -3712 5561 5006 -1462 -495 -1860 -2287 2719 1178
7378A178K864j9390q308m46J1292j590O21n367K261L080N870Q410n841j533L223
$$ 1178 4042 -15348 -23656 -24102 -12810 -14400 -13779 -19146 -16885 -13805 -7935 475 -5366 -6899 -3676
7363c676K099J55j1646K459o375j4312K486K1315o12j088R016J918l732k204R037
$$ -3676 -1577 -1422 -13068 -10609 -16984 -31296 -28810 -7495 -8107 -9195 -179 1739 -1993 -4197 4840
7348D840R982n558K379R437M446l997J490N777j3967j3384n26l234J449p364L912
$$ 4840 14822 9264 11643 21080 25526 21529 23019 28796 14829 1445 919 -2315 -866 -8230 -4318
7333d318M932O581j0245J3838R721O641m938r041p167l851P525l713L231j8614
$$ -4318 614 7195 -3050 10788 20509 27150 22212 13171 6004 2153 9678 5965 9196 -9418
7319i418r012L423L191K675n325K181J4949M165r455J463M145Q682J210q470O482
$$ -9418 -18430 -15007 -11816 -9141 -14466 -12285 2664 6829 -2626 -1163 2982 11664 12874 4404 10886
7304A0886Q306J487k0157o428N628j2172J6268J2336j122J167p144N041M508K268
$$ 10886 19192 20679 522 -5906 -278 -12450 3818 16154 15032 16199 9055 14096 18604 20872
7290B0872j9589o817k201J7287J3734L654q074m985j5239L218p96M288J475j916
$$ 20872 1283 -5534 -7735 9552 23286 26940 18866 13881 -1358 1860 1064 5352 6827 4911
7276D911K175k596R87J985R833q685j3953j10q56k759o954O352J8723L369Q893
$$ 4911 7086 4490 5477 7462 17295 8610 -5343 -5453 -6309 -9068 -16022 -9670 9053 12422 21315
7261B1315l528m082p663j501L688m485J2345k951m812m058o83P246l126l455P825
$$ 21315 17787 13705 6042 4541 8229 3744 16089 13138 8326 4268 3585 10831 7705 4250 12075
7246A2075J114r861o656N368q886j76n860o621L339J5768N509k296O827O620m765
$$ 12075 13189 3328 -3328 2040 -6846 -7022 -12882 -19503 -16164 -396 5113 2817 9644 16264 11499
7231A1499m450j687l155p338m631r21J3625n347M978P797K419l913m502j8713
$$ 11499 7049 5362 2207 -5131 -9762 -10683 2942 -2405 2573 10370 12789 8876 4374 -14339
7217a4339r191r47J886J404k904Q013M365J0218J06J920j1669N755K2831R036
$$ -14339 -23530 -24477 -22591 -21187 -24091 -16078 -11713 -1495 -1389 531 -11138 -5383 17448 26484
7203B6484o601k98p265j2948q137N587k573n985n615m513P908J1692K980k591
$$ 26484 19883 19585 12320 -628 -8765 -3178 -5751 -11736 -17351 -21864 -13956 -2264 716 -1875
7189a875j4811K50l15p25R035M526l666q309K147J1575J80j1226l734Q677O665
$$ -1875 -16686 -16436 -16751 -17476 -8441 -3915 -7581 -15890 -13743 -2168 -1988 -13214 -16948 -8271 -1606
7174a606J5102J5073L291j5895j0175R173o339j0767Q523J8778P893p415j2200
$$ -1606 13496 28569 31860 15965 5790 14963 8624 -2143 6380 25158 33051 25636 13436
7161A3436j0821q714n062q159J0387J0218p631o238L747o09J2855m26n947j9062
$$ 13436 2615 -6099 -11161 -19320 -8933 1285 -6346 -12584 -8837 -9446 3409 2983 -2964 -22026
7147b2026j7823J6496J2879K881j1815J098r58m170L166q842k084O55r85J810
$$ -22026 -39849 -23353 -10474 -7593 -19408 -18310 -19268 -23438 -20272 -29114 -31198 -30543 -31528 -29718
7133b9718J748K4666J6070N563j7707j2774L261k694L513r64J314J2103J5533
$$ -29718 -27970 -3304 12766 18329 622 -12152 -8891 -11585 -8072 -9036 -7722 4381 19914
7120A9914J694k170j1497p433Q268R912k027j4190n774J5651K280M5M113R06o02
$$ 19914 21608 19438 7941 508 8776 18688 16661 2471 -3303 12348 14628 14673 18786 19692 19090
7105A9090l88j368O104o412j9614j5231O081L593j2529L644K506Q501n041j4169
$$ 19090 18702 17334 23438 17026 -2588 -17819 -11738 -8145 -20674 -17030 -14524 -6023 -11064 -25233
7091b5233n264P934L973J8640P036O204n493m337O716N698m540j3470J0447k969
$$ -25233 -30497 -22563 -18590 50 7086 13290 7797 3460 10176 15874 11334 -2136 8311 5342
7077E342j7461j1853M483Q319L917k955R163J2242q359o066P659K142j316q701
$$ 5342 -12119 -23972 -19489 -11170 -7253 -10208 -1045 11197 2838 -3228 4431 6573 5257 -3444
7063c444q206j4012o673J1927K6494L231k015j2987j7395L509P08j635Q92M472
$$ -3444 -11650 -25662 -32335 -20408 6086 9317 7302 -5685 -23080 -19571 -18863 -20498 -19606 -15134
7049a5134O908J0457j0626r119P858L037R96Q031j513j3302m221J0946L9m022
$$ -15134 -8226 2231 -8395 -17514 -9656 -6619 -5623 2408 895 -12407 -16628 -5682 -5643 -9665
7035i665O34R946q484j6138j0010K2160J0307O546M085j362p045j3732o839l433
$$ -9665 -9031 915 -7569 -23707 -33717 -11557 -1250 5296 9381 8019 974 -12758 -19597 -23030
7021b3030N390L861K93J822m593N143M775r867j1582K735J4919n237r397O148
$$ -23030 -17640 -13779 -13486 -11664 -16257 -11114 -6339 -16206 -27788 -25053 -10134 -15371 -24768 -18620
7007a8620J2543L733M309P618J3518J3805r542p120o57k1067j1526R319q209M860
$$ -18620 -6077 -2344 1965 9583 23101 36906 27364 20244 19587 -1480 -13006 -3687 -11896 -7036
6993g036J4695K95p883o294O888J4194n633o676p009M732m987M371N254m6r366
$$ -7036 7659 7954 71 -6223 665 14859 9226 2550 -4459 273 -4714 -343 4911 4865 -4501
6978d501o308Q970J879j022J726K429L098j5467m120P911K849o732k546Q965J0652
$$ -4501 -10809 -1839 40 -982 744 3173 6271 -9196 -13316 -5405 -2556 -9288 -11834 -2869 7783
6963G783j5990k399J0893N178m276j055O175j526j4016r149n73j38J0665O769
$$ 7783 -8207 -10606 287 5465 1189 134 6309 4783 -9233 -18382 -18955 -19093 -8428 -1659
6949a659m98N682J0264k830j5426k76J4846L255j6359R019P902R37j8166o872
$$ -1659 -2157 3525 13789 10959 -4467 -4743 10103 13358 -3001 6018 13920 14857 -3309 -10181
6935a0181N209p047m72K149J598J2192L61l019O688n147q177J2767N24j6241o276
$$ -10181 -4972 -12019 -12491 -10342 -8744 3448 3809 790 7478 2331 -5846 6921 7445 -8796 -15072
6920a5072J264m26l672K159J0841j016q683j0192K0112N675o394p107j155j046
$$ -15072 -13808 -14234 -17906 -15747 -4906 -5922 -14605 -24797 -4685 990 -5404 -12511 -13666 -14712
6906a4712n991M479K679K863N777p40n56p229O082L968K775m747q866J7413N879
$$ -14712 -20703 -16224 -13545 -10682 -4905 -5645 -6201 -13430 -7348 -3380 -605 -5352 -14218 3195 9074
6891I074j8607J0140R683O237M828m732o2j1409q731m80M624o590k177N861J9506
$$ 9074 -9533 607 10290 16527 21355 16623 16561 5152 -3579 -4059 565 -6025 -8202 -2341 17165
6876A7165j654j6794j466K286n367m07j4266o810N997J8695O228m125m755l958
$$ 17165 15511 -1283 -2749 -463 -5830 -6237 -20503 -27313 -21316 -2621 3607 -518 -5273 -9231
6862i231J655m468M392L37K792k495m864M124n939K174M575Q232K682K370J43
$$ -9231 -7576 -12044 -7652 -7315 -4523 -7018 -11882 -7758 -13697 -11523 -6948 1284 3966 6336 6479
6847F479j1406q158P99j0072M760J511N916N627p606P273K3645L190k4099k0398
$$ 6479 -4927 -13085 -12286 -22358 -17598 -16087 -10171 -4544 -12150 -4877 18768 21958 -2141 -22539
6833b2539R205P654K162j1378O947M684n28K404j017N400K582M73K27j2845n3
$$ -22539 -13334 -5680 -3518 -14896 -7949 -3265 -3793 -1389 -2406 2994 5576 6049 6276 -6569 -6622
6818f622O131J773M691n288j494O77K564L365p560n394k782J0227K216r099n963
$$ -6622 -491 1282 5973 685 -809 -132 2432 5797 -1763 -7157 -9939 288 2504 -6595 -12558
6803a2558J415k938k986N303J6424j3590k606R99M687N602K93Q645J1107R037
$$ -12558 -11143 -14081 -17067 -11764 4660 -8930 -11536 -10537 -5850 -248 45 8690 19797 28834
6789B8834L299m396p310q065j1205N35O565m268r227j6397l098R561J0399R790
$$ 28834 32133 27737 20427 12362 1157 1692 8257 3989 -5238 -21635 -24733 -15172 -4773 5017
6775E017q514n718J7289r249j2140l445n055J4663K1748N242p653j5511n948O209
$$ 5017 -3497 -9215 8074 -1175 -13315 -16760 -21815 -7152 14596 19838 12185 -3326 -9274 -3065
6761c065J456p242O337Q075m931l547J9384M679N225j6870j453r86p015l443N678
$$ -3065 -1609 -8851 -2514 5561 630 -2917 16467 21146 26371 9501 8048 7062 47 -3396 2282
6746B282R067J0431l763M95J895P04Q64J245J902J2696l226J2364J681j1107m651
$$ 2282 11349 21780 18017 18512 20407 21111 21975 23220 25122 37818 34592 46956 48637 37530 32879
6731C2879o803R286Q636O945Q57k417l593R751j1375n610K4772K4365K8718L1984
$$ 32879 26076 35362 43998 50943 51800 49383 45790 55541 44166 38556 63328 87693 116411 148395
6717A48395M6887Q2915J33372J91196K34202J67536o5722k73682k39951j48318
$$ 148395 195282 278197 411569 602765 836967 1004503 938781 665099 425148 276830
6707B76830q7728m5060m0925k7179J775p808j9344q767j4105n403N016j1023o346
$$ 276830 189102 144042 103117 75938 77713 69905 50561 41794 27689 22286 27302 16279 9933
6694I933N564l346o512K458O104Q600n22O230l740J680j8894k4481j495K75K672
$$ 9933 15497 12151 5639 8097 14201 22801 22279 28509 24769 26449 7555 -16926 -18421 -18146 -15474
6679a5474M827N744N895J290o15J802R615J3176m492j8208N338m866q320k734
$$ -15474 -10647 -4903 992 2282 1667 3469 13084 26260 21768 3560 8898 4032 -4288 -7022
6665g022J679r66l907j0027q849J7424P786J019m189J025r900j201J1222m312
$$ -7022 -5343 -6309 -10216 -20243 -29092 -11668 -3882 -2863 -7052 -6027 -15927 -17128 -5906 -10218
6651a0218M329J6647m059j658j3322q716K342m065M865O689P483J2942J4860p120
$$ -10218 -5889 10758 6699 5041 -8281 -16997 -14655 -18720 -13855 -7166 317 13259 28119 20999
6637B0999p903r95o066l257j7173J4924J0087L534M394N772m672j3157n408Q52
$$ 20999 13096 12101 6035 2778 -14395 529 10616 14150 18544 24316 19644 6487 1079 1931
6623A931m047P286K800J540k380j0817O36Q132r327k006J7652P95j2334q398P781
$$ 1931 -2116 5170 7970 9510 7130 -3687 -3051 5081 -4246 -6252 11400 12195 -139 -8537 -756
6608g56m766m007K945j85J711k767n288K154J6251J0498j3099r517n730P425j1707
$$ -756 -5522 -9529 -6584 -6769 -5058 -7825 -13113 -10959 5292 15790 2691 -6826 -12556 -5131 -16838
6593a6838k4409k438R719N595j1974P036J9952O556k307j0463m136M766N371j1658
$$ -16838 -41247 -43685 -33966 -28371 -40345 -33309 -13357 -6801 -9108 -19571 -23707 -18941 -13570 -25228
6579b5228P205K1897M359l749k713o320m75L55j2343K282k586J4811J189M624
$$ -25228 -18023 3874 8233 4484 1771 -4549 -5024 -4669 -17012 -14730 -17316 -2505 -1316 3308
6565C308N770K649J741m561L947j208q6j208M424j0766j6848m19J2046N980q85
$$ 3308 9078 11727 13468 8907 12854 11646 11560 10352 14776 4010 -12838 -13257 -1211 4769 3884
6550C884m600n27k06R702J0409J2743q70j6674m66o115j4906M054j3784P620R299
$$ 3884 -716 -1243 -1449 8253 18662 31405 30535 13861 13395 7280 -7626 -3572 -17356 -9736 -437
6535d37M396l880m78J294j3237K409J0463R358j167q224o583n167O150R039o30
$$ -437 3959 79 -399 895 -12342 -9933 530 9888 8721 497 -6086 -11253 -5103 3936 3306
6520C306j5767M506J1188q119M013O339Q326N503j3710j8776j4748j4556J6130
$$ 3306 -12461 -7955 3233 -4886 -873 5466 13792 19295 5585 -13191 -27939 -42495 -26365
6507b6365K0316J6465n389J646L685k494q600k2267n147P418J2127n922o010r910
$$ -26365 -6049 10416 5027 6673 10358 7864 -736 -23003 -28150 -20732 -8605 -14527 -20537 -30447
6493c0447R037J4067r059j225J3368Q779j3881J054J2063M11K071J1824N463j621
$$ -30447 -21410 -7343 -16402 -17627 -4259 4520 -9361 -8307 3756 4167 6238 18062 23525 21904
6479B1904m160q191k6138n414L717O36K895J7592l936p133r307j6J041K387O481
$$ 21904 17744 9553 -16585 -21999 -18282 -17646 -14751 2841 -1095 -8228 -17535 -17551 -16510 -14123 -7642
6464g642J4942J0609k198o859j8163j0669q982K942R313q50q524L598R214J1194
$$ -7642 7300 17909 15711 8852 -9311 -19980 -28962 -26020 -16707 -17557 -26081 -22483 -13269 -2075
6450b075m361j2621J2173j2648R079K0859O895M155j3823q799m578K149K35m523
$$ -2075 -6436 -19057 -6884 -19532 -10453 10406 17301 21456 7633 -1166 -5744 -3595 -3360 -7883
6436g883J2979M473r365k026J3006L31j297j5279O107j762j2054J36r039N565
$$ -7883 5096 9569 204 -1822 11184 11515 10218 -5061 1046 -716 -12770 -12634 -21673 -16108
6422a6108J2589J1045j927j1885l976j918O186J4713O52q205K356J7072m538p072
$$ -16108 -3519 7526 5599 -6286 -10262 -12180 -5994 8719 9371 1166 3522 20594 16056 8984
6408H984L71j0649j0372p355o651P706M227J0964M331o76j1440j2614O543J545
$$ 8984 9355 -1294 -11666 -19021 -25672 -17966 -13739 -2775 1556 880 -10560 -23174 -16631 -15086
6394a5086l076l612K011O316n536L435J1852N493o116k373J1672J0482n385j1269
$$ -15086 -18162 -21774 -19763 -13447 -18983 -15548 -3696 1797 -4319 -6692 4980 15462 10077 -1192
6380a192k2469j5837r783M271R341k469K949J1778K447j117L628j3238P752J6002
$$ -1192 -23661 -39498 -49281 -45010 -35669 -38138 -35189 -23411 -20964 -22081 -18453 -31691 -23939 -7937
6366g937O133N854Q845M371j0979r32q519j4814J618Q0k198j2138M640J5404q808
$$ -7937 -1804 4050 12895 17266 6287 5355 -3164 -17978 -16360 -16280 -18478 -30616 -25976 -10572 -19380
6351a9380r56M305J470K643J1627Q999n40K031p565J30J2437L718j2150M067Q79
$$ -19380 -20336 -16031 -14561 -11918 -291 8708 8168 10199 2634 2764 15201 18919 6769 10836 11715
6336A1715r935j3050K381J4660J63O119n902L428j6447m150J1464Q066j3815N151
$$ 11715 1780 -11270 -8889 5771 5934 12053 6151 9579 -6868 -11018 446 8512 -5303 -152
6322a52K2800K184j2573o929N720k633j0090N249Q037l420j1688K891l218K279
$$ -152 22648 24832 12259 5330 11050 8417 -1673 3576 11613 8193 -3495 -604 -3822 -1543
6308a543l044Q176R598J68j372p33N544j0185q427J905J3522l892j8286j519j68
$$ -1543 -4587 3589 13187 13355 11983 11250 16794 6609 -1818 87 13609 9717 -8569 -10088 -10256
6293a0256J0532J978n423j4246r282M293P435l180k916K0229J3704l223j970j1643
$$ -10256 276 2254 -3169 -17415 -26697 -22404 -14969 -18149 -21065 -836 12868 9645 7675 -3968
6279c968j9183m606r434J7876O301J800J1618R723pn794j8460j1595J0422P537
$$ -3968 -23151 -27757 -37191 -19315 -13014 -11214 404 10127 10120 4326 -14134 -25729 -15307 -7770
6265g770J2010r714j702o55k107N648q084L257k479L013k978N188m885j1740k1264
$$ -7770 4240 -5474 -7176 -7831 -9938 -4290 -12374 -9117 -11596 -8583 -11561 -6373 -11258 -22998 -44262
6250d4262q234J3954J2706N667r414R048J5575P602o101l925K091K378K602n725
$$ -44262 -52496 -38542 -25836 -20169 -29583 -20535 -4960 2642 -3459 -7384 -5293 -2915 -313 -6038
6236f038j2140m607m686l65M211J4793P379l105J3512j2303q688l026o795O27
$$ -6038 -18178 -22785 -27471 -27836 -23625 -8832 -1453 -4558 8954 -3349 -12037 -15063 -21858 -21231
6222b1231k962Q704P190m112j2948L211P201Q779l020j3650j3463l391J0212k038
$$ -21231 -24193 -15489 -8299 -12411 -25359 -22148 -14947 -6168 -9188 -22838 -36301 -39692 -29480 -31518
6208c1518O32K1344J3671J026N77L892M634O032n61p301L765j778r252j8754R062
$$ -31518 -30886 -9542 4129 5155 5732 9624 14258 20290 19729 12428 16193 14415 5163 -13591 -4529
6193d529O114j3469J5103N361j39j3820J280q087o445K965J5960k718N661N670
$$ -4529 1585 -11884 3219 8580 8441 -5379 -4099 -12186 -18631 -15666 294 -2424 3237 8907
6179H907O015r278j5089q18O584m345m876J2961m21J0912l514l386n646O139j1208
$$ 8907 14922 5644 -9445 -10263 -3679 -8024 -12900 61 -360 10552 7038 3652 -1994 4145 -7063
6164g063j126K829R014R51o024p335Q204Q293N594o471k613q593l167n623o597
$$ -7063 -8189 -5360 3654 4605 -1419 -8754 -550 7743 13337 6866 4253 -4340 -7507 -13130 -19727
6149a9727O156R807m419l998Q417p92j639j5538Q941M733J2456k325R695m446
$$ -19727 -13571 -3764 -8183 -12181 -3764 -4556 -6195 -21733 -12792 -8059 4397 2072 11767 7321
6135G321j2872n611M062J0133K757r583p863k424j1152j4281L890R468Q704J782
$$ 7321 -5551 -11162 -7100 3033 5790 -3793 -11656 -14080 -25232 -39513 -35623 -26155 -17451 -15669
6121a5669J8218J5360k154k0031j192j7566N631J5596J512j125j3390k423M730
$$ -15669 2549 17909 15755 -4276 -5468 -23034 -17403 -1807 -295 -1420 -14810 -17233 -12503
6108a2503K963J1426J1950Q37o616j975J451q943m852j0211Q041o7m604k312P572
$$ -12503 -9540 1886 13836 14673 8057 6082 7533 -1410 -6262 -16473 -8432 -8499 -13103 -15415 -7843
6093g843J1365O429j1914m090J1701J0155j1170j2487N676J1825J25l617m344
$$ -7843 3522 9951 -1963 -6053 5648 15803 4633 -7854 -2178 9647 9772 6155 1811
6080A811l896l866J0040M25q092j6066J0172J0658k8J7591q129j5054M8j600R850
$$ 1811 -2085 -5951 4089 4514 -3578 -19644 -9472 1186 1158 18749 10620 -4434 -4386 -5986 3864
6065C864J0074o683j7698N67Q075Q846R335N938r591l351m841j0601j2196o547
$$ 3864 13938 7255 -10443 -9876 -1801 7045 16380 22318 12727 9376 4535 -6066 -18262 -24809
6051b4809l077J0481J1508k646j5078n116K274K819n191J4105L294m33l321o071
$$ -24809 -27886 -17405 -5897 -8543 -23621 -28737 -26463 -23644 -28835 -14730 -11436 -11869 -15190 -21261
6037b1261O728l37L825J2710M03N428l66p24P30l244j2674l45n10j0493l718O830
$$ -21261 -14533 -14870 -11045 1665 2068 7496 7130 6406 7136 3892 -8782 -9127 -9637 -20130 -23848 -17018
6021a7018k72L296J3706J3N893L507r263L811J3281J926l960p18j3252j930j004
$$ -17018 -17290 -13994 -288 -275 5618 9125 -138 3673 16954 18880 14920 14202 950 -980 -1984
6006a984r057q60Q382j583j395q11L218p134J454j555l83K190k975q686J4668
$$ -1984 -11041 -11901 -3519 -5102 -6497 -7308 -4090 -11224 -9770 -11325 -11708 -9518 -12493 -21179 -6511
5991f511l935l197L143K3140R962J1186m147L053l820q532j0898R93M284r147
$$ -6511 -10446 -13643 -10500 12640 22602 33788 29641 32694 28874 20342 9444 10437 14721 5574
5977E574r438j0617j4780l171l613K279k060N32J0375J1784Q418O131m020J2424
$$ 5574 -3864 -14481 -29261 -32432 -36045 -33766 -35826 -35294 -24919 -13135 -4717 1414 -2606 9818
5963I818J3201j623o803m559j2158J706n603k215J6666l616l71P723Q044k391
$$ 9818 23019 21396 14593 10034 -2124 -418 -6021 -8236 8430 4814 4443 12166 20210 17819
5949A7819n067n835n012L18N633l755q47O195n38r961J504N249L296P316l806
$$ 17819 12752 6917 1905 2223 7856 4101 3254 9449 8911 -1050 454 5703 8999 16315 12509
5934A2509m801n163q086r513o47m741o950Q908J0911P246j4691o753Q985M242
$$ 12509 7708 2545 -5541 -15054 -15701 -20442 -27392 -18484 -7573 -327 -15018 -21771 -12786 -8544
5920h544Q729L151K688j2563n332K307M934m964q767J2166M816j0109o36o459
$$ -8544 185 3336 6024 -6539 -11871 -9564 -4630 -9594 -18361 -6195 -1379 -11488 -12124 -18583
5906a8583O218J6126K613k287j9109l985J3641O399m167q448q318R633L614R879
$$ -18583 -12365 3761 6374 4087 -15022 -19007 -5366 1033 -3134 -11582 -19900 -10267 -6653 3226
5892C226O045N160n427p735J5906o520J93j481L610j073j2054m955j576j1172
$$ 3226 9271 14431 9004 1269 17175 10655 10848 9367 12977 11904 -150 -5105 -6681 -17853
5878a7853j0890J220R981J1818Q16J1645J2218q286k147O236o90K17l843N772
$$ -17853 -28743 -27523 -17542 -5724 -4908 6737 18955 10669 8522 14758 14068 14285 10442 16214
5864A6214l994K279o768j4436L372l826L000J0352p241j0614m620O996O40n300
$$ 16214 12220 14499 7731 -6705 -3333 -7159 -4159 6193 -1048 -11662 -16282 -9286 -8646 -13946
5850a3946j624j953J1485l709j2112O317k136j09J021q099L61N915P097J3142
$$ -13946 -15570 -17523 -6038 -9747 -21859 -15542 -17678 -17787 -16766 -24865 -24504 -18589 -11492 1650
5836A650J073l239l282M182K082k163n164m025L912N167L378J214r618j0086L649
$$ 1650 2723 -516 -3798 384 2466 303 -4861 -8886 -4974 193 3571 4785 -4833 -14919 -11270
5821a1270M898M655M80k208k2556p806J2566J2606R948J1568Q051l242M93j4862
$$ -11270 -6372 -1717 -1237 -3445 -26001 -33807 -21241 -8635 1313 12881 20932 17690 18183 3321
5807C321r053q610K02J968P726J838j3506Q336o464q737Q763l844L378P042N774
$$ 3321 -5732 -14342 -14140 -12172 -4446 -2608 -16114 -7778 -14242 -22979 -14216 -18060 -14682 -7640 -1866
5792a866p263r191n099N042J9445N687K816q278j8173O487J883m687J5621R551
$$ -1866 -9129 -18320 -23419 -18377 1068 6755 9571 1293 -16880 -10393 -8510 -13197 2424 11975
5778A1975j672L266j0639J533M397J526j668k695m425q961K334N898L687O987
$$ 11975 10303 13569 2930 4463 8860 10386 8718 6023 1598 -7363 -5029 869 4556 11543
5764A1543O586k3748J097P161j5374k5927J6155J9569J48m619n452l456j1012
$$ 11543 18129 -5619 -4522 2639 -12735 -38662 -22507 -2938 -2790 -7409 -12861 -16317 -27329
5751b7329J0020O078J3276o946k057Q270R022n571l187J2084n048j0338P926K0779
$$ -27329 -17309 -11231 2045 -4901 -6958 1312 10334 4763 1576 13660 8612 -1726 6200 26979
5737B6979M479j0626m438j0079j9859r908R853J103M629q873J76j7o087M114J1547
$$ 26979 31458 20832 16394 6315 -13544 -23452 -13599 -12496 -7867 -16740 -16564 -16581 -22668 -18554 -7007
5722g007M045q86M899R24j2967K298M995m514J8120J0027q324j4583j5185J0525
$$ -7007 -2962 -3848 1051 1975 -10992 -8694 -3699 -8213 9907 19934 11610 -2973 -18158 -7633
5708g633l954K404L486M604N561M541N256l551k597J30m501j2968j6253Q623Q135
$$ -7633 -11587 -9183 -5697 -1093 4468 9009 14265 10714 8117 8247 3746 -9222 -25475 -16852 -8717
5693h717R055J2245n225j911N210k558k975j1992j1039N204k096N681O818o132
$$ -8717 338 12583 7358 5447 10657 8099 5124 -6868 -17907 -12703 -14799 -9118 -2300 -8432
5679h432J990O364N259m424l168Q385P718j0568n032Q69p509r111k249O84K29
$$ -8432 -6442 -78 5181 757 -2411 5974 13692 3124 -1908 -1039 -8548 -17659 -19908 -19224 -18995
5664a8995R713O961J142J34k171p419p872J031n879o270L553J3277l264r672L019
$$ -18995 -9282 -2321 -1179 -1045 -3216 -10635 -18507 -17476 -23355 -29625 -26072 -12795 -16059 -25731 -22712
5649b2712K865l473l948Q693p000p860Q019J16Q449R484p765n857J2211n000p911
$$ -22712 -19847 -23320 -27268 -18575 -25575 -33435 -25416 -25300 -16851 -7367 -15132 -20989 -8778 -13778 -21689
5634b1689N962k450n00J1543O19p013J173j830N395P482L487k795l027r033J564
$$ -21689 -15727 -18177 -18677 -7134 -6515 -13528 -12355 -14185 -8790 -1308 2179 -616 -3643 -12676 -11112
5619a1112N340j2195m99J262J6863K6361J2893j2258j1305m278k063K131o264
$$ -11112 -5772 -17967 -18466 -17204 -341 26020 38913 26655 15350 11072 9009 11140 4876
5606D876p780M090l928j0863R308L147j675j383M682O279j4676j6111O099J2073
$$ 4876 -2904 1186 -2742 -13605 -4297 -1150 -2825 -4208 474 6753 -7923 -24034 -17935 -5862
5592e862j1121o783N512N732J4468n966Q75Q25R580R70N105j6129q992j2177p276
$$ -5862 -16983 -23766 -18254 -12522 1946 -4020 -3145 -2320 7260 8230 13335 -2794 -11786 -23963 -31239
5577c1239J0601K1382p14k0466K0J9780J3802j101j7488o627O320K2697n164j0875
$$ -31239 -20638 744 30 -20436 -20416 -636 13166 12065 -5423 -12050 -5730 16967 11803 928
5563I28r55j460l897P311L912P758o761j594l290J5j8283n162J1058Q384J645
$$ 928 -27 -1487 -5384 1927 5839 13597 6836 5242 1952 1967 -16316 -21478 -10420 -2036 -391
5548c91N156Q367p742p707M116J4418N420m541l40P044l260j6881r003n646j912
$$ -391 4765 13132 5390 -2317 1799 16217 21637 17096 16756 23800 20540 3659 -5344 -10990 -12902
5533a2902j2837K0146J4110L268J461O406j3228L10P891j193j5047j1839O581
$$ -12902 -25739 -5593 8517 11785 13246 19652 6424 6734 14625 13432 -1615 -13454 -6873
5520f873M323J5960j512j0402j039Q094J2884j2363n787P640R367r551J72n184
$$ -6873 -2550 13410 11898 1496 457 8551 21435 9072 3285 10925 20292 10741 10913 5729
5506E729r722l699K69K823J290J609j0984Q990J0757J525n187j4406n992Q507
$$ 5729 -3993 -7692 -7423 -4600 -3310 -1701 -12685 -3695 7062 8587 3400 -11006 -16998 -8491
5492h491P662j754q686M624l274n860l450j0465K81L535P685m38j205j7365J2894
$$ -8491 -829 -2583 -11269 -6645 -9919 -15779 -19229 -29694 -29413 -25878 -18193 -18631 -19836 -37201 -24307
5477b4307K3840J1819M707q733n841n047j3076q820m20N565J258J6156M339r829
$$ -24307 -467 11352 16059 7326 1485 -3562 -16638 -25458 -25878 -20313 -19055 -2899 1440 -8389
5463h389q815l348M922J9906J0984Q456m417k071j3392o37K722j585j1032j3362
$$ -8389 -17204 -20552 -15630 4276 15260 23716 19299 17228 3836 3199 5921 4336 -6696 -20058
5449b0058J2368O876o531j2443k429j68J5415L026k623J716j333J1663j26j5815
$$ -20058 -7690 -814 -7345 -19788 -22217 -22385 -6970 -3944 -6567 -4851 -6184 5479 5353 -10462
5435a0462m209N33n6O729J820K414M630L996K575j2227j0429K23J1767O31p29
$$ -10462 -14671 -14138 -14194 -7465 -5645 -3231 1399 5395 7970 -4257 -14686 -14463 -2696 -2065 -2794
5420b794R914l984n240M38O545o710K151l054o340L83K019L059o65r049K855R428
$$ -2794 7120 3136 -2104 -1666 4879 -1831 320 -2734 -9074 -8691 -6672 -3613 -4278 -13327 -10472 -1044
5404a044N598j2878j5079L640J1654l675L026l936O211M136k029j644r1j387K203
$$ -1044 4554 -8324 -23403 -19763 -8109 -11784 -8758 -12694 -6483 -2347 -4376 -6020 -6111 -7498 -5295
5389e295k705l576j0939R99j1295m490O703R612N844n497J3029Q55M972k027p562
$$ -5295 -8000 -11576 -22515 -21516 -32811 -37301 -30598 -20986 -15142 -20639 -7610 -6755 -1783 -3810 -11372
5374a1372n852L637l281k779m613K701J1542M009J7695M577O67j226k648j5931
$$ -11372 -17224 -13587 -16868 -19647 -24260 -21559 -10017 -6008 11687 16264 16931 15705 13057 -2874
5360b874n282Q867K918J343J930q961q134j0808K28J0254Q255N692j2237l346
$$ -2874 -8156 711 3629 4972 6902 -2059 -10193 -21001 -20773 -10519 -2264 3428 -8809 -12155
5346a2155n814M174m971K985Q384p658L946M767J4465j490p883o472J2538P129
$$ -12155 -17969 -13795 -18766 -15781 -7397 -15055 -11109 -6342 8123 6633 -1250 -7722 4816 11945
5332A1945N389j988l912o742j1409J954r957M235l47k285J266J4460P262p180
$$ 11945 17334 15346 11434 4692 -6717 -4763 -14720 -10485 -10832 -13117 -11851 2609 9871 2691
5318B691m850O064J4377j6631j0393O443L92q283j064j698o248m549J2955J4686
$$ 2691 -2159 3905 18282 1651 -8742 -2299 -1907 -10190 -11254 -12952 -19200 -23749 -10794 3892
5304C892j689j5714P490J4290k413K841Q186j716M952K055j6730M983k765j581
$$ 3892 2203 -13511 -6021 8269 5856 8697 16883 15167 20119 22174 5444 10427 7662 6081
5290F081j2601q738J382K085Q163J366j4439m132P911J5958r810o982N262l622
$$ 6081 -6520 -15258 -13876 -11791 -3628 -2262 -16701 -20833 -12922 3036 -6774 -13756 -8494 -12116
5276a2116J2527J9074r413j7643r3J3271Q755j3954q181K18P094j9098j323J1408
$$ -12116 411 19485 10072 -7571 -7664 5607 14362 408 -7773 -7555 -461 -19559 -20882 -9474
5262i474m348j100O296M047J5162l244j3597k083o22P16J2388J063j8406j1572
$$ -9474 -13822 -14922 -8626 -4579 10583 7339 -6258 -8341 -8963 -8247 4141 5204 -13202 -24774
5248b4774R105J3264o87O122j712J2253R120q747j5652R28P837o309q629J1656
$$ -24774 -15669 -2405 -3092 3030 1318 13571 22691 13944 -1708 -780 7057 748 -7881 3775
5234C775K86M808O209J2605j5811p042p405J4360Q03j0226L611K180K475j1023
$$ 3775 4061 8869 15078 27683 11872 4830 -2575 11785 12588 2362 5973 8153 10628 -395
5220c95k619k481J4092L357k101M02j878n529j5568r21j960N203N634K017j772
$$ -395 -3014 -5495 8597 11954 9853 10255 8377 2848 -12720 -13641 -15601 -10398 -4764 -2747 -4519
5205d519P135K457r390m718K236N107Lj2020m921J6424P974R123L258j683k250
$$ -4519 2616 5073 -4317 -9035 -6799 -1692 -1689 -13709 -18630 -2206 5768 14891 18149 16466 14216
5190A4216J517K239n212r854j774P57Q10J2891m065N552k668K871r632n474J353
$$ 14216 15733 17972 12760 2906 1132 1889 2699 15590 11525 17077 14409 17280 7648 2174 3527
5175C527j978l803j2438j931P2P835P762J853Q853k019j4188j932j2368n80r38
$$ 3527 1549 -2254 -14692 -16623 -16551 -8716 -954 899 9752 7733 -6455 -8387 -20755 -21335 -22273
5160b2273k808J7070J6719r197r359l113O030J0112Q55j9334J4440k032N410J3900
$$ -22273 -25081 -8011 8708 -489 -9848 -12961 -6931 3181 4036 -15298 -858 -2890 2520 16420
5146A6420j2214o208M359j890M606J490q584N902m810j888o631L758Q334k613
$$ 16420 4206 -2002 2357 467 5073 6563 -2021 3881 -929 -2817 -9448 -5690 2644 31
5132C1M087P158j2485R110J3201j2761L933j4079r960k607R069n324J713n961
$$ 31 4118 11276 -1209 7901 21102 8341 12274 -1805 -11765 -14372 -5303 -10627 -8914 -14875
5118a4875m486M470O550L710Q434j3895p027O615n441P50L949l551q297O980J0167
$$ -14875 -19361 -14891 -8341 -4631 3803 -10092 -17119 -10504 -15945 -15195 -11246 -14797 -23094 -16114 -5947
5103e947o475q079l779Q241J2463L432K217p346L296j0538j918J6996o408r46
$$ -5947 -12422 -20501 -24280 -16039 -3576 -144 2073 -5273 -1977 -12515 -14433 2563 -3845 -4791
5089d791J0199j0167j6199R05J227J0847J0466M846j389j7326n12M015Q47R048
$$ -4791 5408 -4759 -20958 -20053 -18826 -7979 2487 7333 5944 -11382 -11894 -7879 -7032 2016
5075B016J2588L67m397j1725j1938N733n80P152J6073K062j3367k309K953K980
$$ 2016 14604 14971 10574 -1151 -13089 -7356 -7936 -784 15289 17351 3984 1675 4628 7608
5061G608R480j2108j2423r925J2635J3120n110j0780N385q540j1309q35Q112J1786
$$ 7608 17088 4980 -7443 -17368 -4733 8387 3277 -7503 -2118 -10658 -21967 -22802 -14690 -2904
5047b904M203j1250J3213J1859j4782j8418J526l05P394j2053m155J6396K6008
$$ -2904 1299 -9951 3262 15121 339 -18079 -16553 -16858 -9464 -21517 -25672 -9276 16732
5034A6732M718o728j1066l244M755N9j3051m005O150J1436q76J849J3335k775
$$ 16732 21450 14722 3656 412 5167 5226 -7825 -11830 -5680 5756 4880 6729 20064 17289
5020A7289O354K657j8044r569K414O160J1148l211r350p445n713m893K709O55
$$ 17289 23643 26300 8256 -1313 1101 7261 18409 15198 5848 -1597 -7310 -12203 -9494 -8839
5006h839J5639j177j5772M416J3364L981m406O509m712j3184J4213Q525j9735
$$ -8839 6800 5623 -10149 -5733 7631 11612 7206 13715 9003 -4181 10032 18557 -1178
4993a178j5963o560J1065Q375m970j721K0872Q348j2692j7715R919j316P985M309
$$ -1178 -17141 -23701 -12636 -4261 -9231 -10952 9920 18268 5576 -12139 -2220 -3536 4449 8758
4979H758q72K645m963r436k641J5487n252j1262R793j241O015m463j078j406o325
$$ 8758 7886 10531 5568 -3868 -6509 8978 3726 -7536 2257 1016 7031 2568 1490 84 -6241
4964f241j7458n991Q143J7787O078L976m674J279J105K240m869J282N417l10j2757
$$ -6241 -23699 -29690 -21547 -3760 2318 6294 1620 2899 4004 6244 1375 2657 8074 7764 -4993
4949d993K787p561j1655N540J5978J524j693q641r555j7441k056P192J7396J3749
$$ -4993 -2206 -9767 -21422 -15882 96 1620 -73 -8714 -18269 -35710 -37766 -30574 -13178 571
4935E71J1943R189k257J2680K556j018j3198j1372r208o389q209P002J0215J397
$$ 571 12514 21703 19446 32126 34682 33664 20466 9094 -114 -6503 -14712 -7710 2505 3902
4921C902N026L548q013l243K924K668m800P103k684j2683k942j290J473K162J946
$$ 3902 8928 12476 4463 1220 4144 6812 2012 9115 6431 -6252 -9194 -10484 -9011 -6849 -4903
4906d903O011Q651k889l654n15N877M375K179q162k66P784O290j1275m07O08N054
$$ -4903 1108 9759 6870 3216 2701 8578 12953 15132 6970 6704 14488 20778 9503 9096 9704 14758
4890A4758j1297n433j112M261O03j464k4808o518J237P529J2156Q566J1806J1894
$$ 14758 3461 -1972 -3084 1177 1780 316 -24492 -31010 -29773 -22244 -10088 -1522 10284 22178
4876B2178M494j268j7825m156j1253p142o90J3283P855J6748l794q879n967j1320
$$ 22178 26672 25404 7579 3423 -7830 -14972 -15662 -2379 5476 22224 18430 9551 3584 -7736
4862g736M960Q313k504r26q659M312J7843k289J305j2721j6264N58l427O319J8363
$$ -7736 -2776 5537 3033 2107 -6552 -2240 15603 13314 14619 1898 -14366 -13808 -17235 -10916 7447
4847G447N018r573p521M264r210k360J4829J0003j5634j1444M285M079j383J473
$$ 7447 12465 2892 -4629 -365 -9575 -11935 2894 12897 -2737 -14181 -9896 -5817 -7200 -5727
4833e727J8344m440j5945L358L657J0605l715j1238j0216L455K805Q559J2983
$$ -5727 12617 8177 -7768 -4410 -753 9852 6137 -5101 -15317 -11862 -9057 -498 12485
4820A2485l433m159M406P473r26m456J1615N361k0282j3849n28p93j7044j7915
$$ 12485 9052 4893 9299 16772 15846 11390 23005 28366 8084 -5765 -6293 -7086 -24130 -42045
4806d2045K852K0749J4908J1915q567j2427j7839p391K402L646J0951J4540O024
$$ -42045 -39193 -18444 -3536 8379 -188 -12615 -30454 -37845 -35443 -31797 -20846 -6306 -282
4793b82n55k798M533j0237q480J4981k783q357R678R250k1915p632N940J3441
$$ -282 -837 -3635 898 -9339 -17819 -2838 -5621 -13978 -4300 4950 -16965 -24597 -18657 -5216
4779e216J2692Q559j8419j0718M021k285J6125p17q587r123j820J0854j348m298
$$ -5216 7476 16035 -2384 -13102 -9081 -11366 4759 4042 -4545 -13668 -15488 -4634 -5982 -10280
4765a0280J0513J3178J9623n750j5540o400r45k064p899J096J2569P944J0603
$$ -10280 233 13411 33034 27284 11744 5344 4399 2335 -5564 -4468 8101 16045 26648
4752B6648p851r463q522m490j973j5921O726J0888R681k632M3N863q196j637N737
$$ 26648 18797 9334 812 -3678 -5651 -21572 -14846 -3958 5723 3091 3134 8997 801 -836 4901
4737D901J7949n7q388n401Q52n113l890q93N522K130n270o600J149j0818k30m376
$$ 4901 22850 22793 14405 9004 9856 4743 853 -40 5482 7612 2342 -4258 -3109 -13927 -14157 -18533
4721a8533R395J0207K553n244j473n312L862Q330J1527j0068n004m483k022M462
$$ -18533 -9138 1069 3622 -1622 -3095 -8407 -4545 3785 15312 5244 240 -4243 -6265 -1803
4707a803j2955j105P958N125J5599j0356p176J326p193j0526O32J2829Q619K979
$$ -1803 -14758 -15863 -7905 -2780 12819 2463 -4713 -3387 -10580 -21106 -20474 -7645 974 3953
4693C953n290M531O813q556r268J572j562J0882K838r307l340J4946n343k897
$$ 3953 -1337 3194 10007 1451 -7817 -6245 -7807 3075 5913 -3394 -6734 8212 2869 -28
4679b8o177j9349l635L263Q641J0202J0773j4784n650J3500J0507j850J102M562
$$ -28 -6205 -25554 -29189 -25926 -17285 -7083 3690 -11094 -16744 -3244 7263 5413 6515 11077
4665A1077l221n146m615M817J2990P774k464l651O444L982j3692r912M119J7966
$$ 11077 7856 2710 -1905 2912 15902 23676 21212 17561 24005 27987 14295 4383 8502 26468
4651B6468J2446p398p098p086j0669q760r899k352J819Q179P774j159p020q514
$$ 26468 38914 31516 24418 17332 6663 -2097 -11996 -14348 -12529 -4350 3424 2265 -4755 -13269
4637a3269P216J8723R552l181j7606k136q080j7504K3380J0545j2176j2842M960
$$ -13269 -6053 12670 22222 19041 1435 -701 -8781 -26285 -2905 7640 -4536 -17378 -12418
4624a2418j594j1002m696M120J5622J2936R235P388N105q868k2129j1746R30l039
$$ -12418 -14012 -25014 -29710 -25590 -9968 2968 12203 19591 24696 15828 -6301 -18047 -17117 -20156
4610b0156p847J288M023q394n858J1641J0161J3141J949P530J551p739m336k808
$$ -20156 -28003 -26715 -22692 -31086 -36944 -25303 -15142 -2001 -52 7478 9029 1290 -3046 -5854
4596e854m8O877j8195Q250J0832J2905M52j1819j1214K252l034L947L617L281
$$ -5854 -5902 975 -17220 -8970 1862 14767 15219 3400 -7814 -5562 -8596 -4649 -1032 2249
4582B249j3375Q138j0647l161J2010q582p658l678M716J0363L091J5118J041j8662
$$ 2249 -11126 -2988 -13635 -16796 -4786 -13368 -21026 -24704 -19988 -9625 -6534 8584 9625 -9037
4568i037j13p691m153M720J0990N820p27o333L949N624m465m504n020R209R467
$$ -9037 -9150 -16841 -20994 -16274 -5284 536 -191 -6524 -2575 3049 -1416 -5920 -10940 -1731 7736
4553G736J2209N20j5812q480n04j867N051o155J549p623n685O84Q466K0441j417
$$ 7736 19945 20465 4653 -3827 -4331 -6198 -1147 -7302 -5753 -13376 -19061 -18377 -9911 10530 9113
4538I113p39P823q348j3422p393m755P238N135O861q44P3O635K983j207r474L445
$$ 9113 8374 16197 7849 -5573 -12966 -17721 -10483 -5348 1513 669 742 7377 10360 9153 -321 3124
4522C124P072O782R541p564j9861j5713K117o86N95M03k85J0061J1438p217j1126
$$ 3124 10196 16978 26519 18955 -906 -16619 -14502 -15188 -14593 -14190 -14475 -4414 7024 -193 -11319
4507a1319K803P491L733K550q299q197L490M059j1409M62n4o519M101O659l045
$$ -11319 -8516 -1025 2708 5258 -3041 -11238 -7748 -3689 -15098 -14636 -14690 -21209 -17108 -10449 -13494
4492a3494l967J1727J2080j6162l664P751R750j932P001M920l1383j9739J6158
$$ -13494 -17461 -5734 6346 -9816 -13480 -5729 4021 2089 9090 14010 -17373 -37112 -20954
4479b0954J9732O612j268j1105P654R314j1364L412n853j6028R68J2179j2632
$$ -20954 -1222 5390 4122 -6983 671 9985 -1379 2033 -3820 -19848 -18880 -6701 -19333
4466a9333N785J7159O529p973j1782k771J0439J2118N538J014j4761o918l451
$$ -19333 -13548 3611 10140 2167 -9615 -12386 -1947 10171 15709 16723 1962 -4956 -8407
4453h407J3219m305L21n168n976K965J4730N351m051j9954L673N836r647M398
$$ -8407 4812 507 828 -4340 -10316 -7351 7379 12730 8679 -11275 -7602 -1766 -11413 -7015
4439g015R004j911q833J506P864O300j974n156J0176R861J9m856m368K086j989
$$ -7015 1989 78 -8755 -7249 615 6915 4941 -215 9961 19822 19841 14985 10617 12703 10714
4424A0714p757k722K833J3952J021L37L862N558J575p913o191p167j4258M539
$$ 10714 2957 235 3068 17020 18041 18378 22240 27798 29373 21460 15269 8102 -6156 -1617
4410a617L194N081m315q07n73O690r023j0010L972o668j7297k966L82R607J3399
$$ -1617 1577 6658 2343 1536 963 7653 -1370 -11380 -7408 -14076 -31373 -34339 -33957 -24350 -10951
4395a0951J636j6870l828J6439J3132R552M280j2807j7483p872K22o716k456L321
$$ -10951 -9315 -26185 -30013 -13574 -442 9110 13390 583 -16900 -24772 -24550 -31266 -33722 -30401
4381c0401R820m854N809R554N843O943q66R639K528p094m787J943n660K988N23
$$ -30401 -20581 -25435 -19626 -10072 -4229 2714 1848 11487 14015 6921 2134 4077 -1583 1405 1928
4366A928m670K648J1578j0038j2663K608o550p584J8728J9195k400k598k3076
$$ 1928 -2742 -94 11484 1446 -11217 -8609 -15159 -22743 -4015 15180 12780 10182 -12894
4353a2894p188L142J0870N831J1583j507q277k6688L27K921Q802J4837J4519M700
$$ -12894 -20082 -16940 -6070 -239 11344 9837 1560 -25128 -24801 -21880 -13078 1759 16278 20978
4339B0978n078j4901l881J062j772k98J425l965q490J658J7039j96J1834l357
$$ 20978 15900 999 -2882 -1820 -3592 -3890 -2465 -6430 -14920 -13262 3777 3581 15415 12058
4325A2058K663r560o601Q397Q214J567r215Q49R728J02q991p364K308J2104P23
$$ 12058 14721 5161 -1440 6957 15171 16738 7523 8372 18100 18202 9211 1847 4155 16259 16982
4310A6982j0585K157J1427j7738q903K79Q518j87j4934M625K6005J791j8821k097
$$ 16982 6397 8554 19981 2243 -6660 -6381 2137 1950 -12984 -8359 17646 19437 616 -1481
4296a481L234r987p969j3519j837j057J6832J3990m17O845J0914L584j0511j6956
$$ -1481 1753 -8234 -16203 -29722 -31559 -32616 -15784 -1794 -2211 4634 15548 19132 8621 -8335
4282h335J2541O338k5968j2246J5713J4191n8o047J2373j3530p408L180M80k279
$$ -8335 4206 10544 -15424 -27670 -11957 2234 2176 -3871 8502 -5028 -12436 -9256 -8776 -11055
4268a1055J517N652P64J029p390o197L873j6433K643J5006o440P602J4896p701
$$ -11055 -9538 -3886 -3122 -2093 -9483 -15680 -11807 -28240 -25597 -10591 -17031 -9429 5467 -2234
4254b234j9547j015J7129j96K005n167N215N391q0o060j3383j2147N514k880j422
$$ -2234 -21781 -22796 -5667 -5863 -3858 -9025 -3810 1581 1501 -4559 -17942 -30089 -24575 -27455 -28877
4239b8877J5940J9596k807j1016J5402K657j4877l506J37j4483Q323J3058q643
$$ -28877 -12937 6659 3852 -7164 8238 10895 -3982 -7488 -7351 -21834 -13511 -453 -9096
4226i096j7797N177P211J0565J2140M975j1199j3875m401L341L013O704j0133
$$ -9096 -26893 -21716 -14505 -3940 8200 13175 1976 -11899 -16300 -12959 -9946 -3242 -13375
4213a3375K959O992p998j708P820j865j350M74j0383O71P841P271j0717j627R647
$$ -13375 -10416 -3424 -11422 -13130 -5310 -7175 -8525 -8051 -18434 -17763 -9922 -2651 -13368 -14995 -5348
4198e348N208j7011n229J1454J3280O323p462m519J1432m192r213k971J895J3607
$$ -5348 -140 -17151 -22380 -10926 2354 8677 1215 -3304 8128 3936 -5277 -8248 -6353 7254
4184G254L867m494O862Q620k999j6642K52J482j3764j0146n990J1329K0380R813
$$ 7254 11121 6627 13489 22109 19110 2468 2720 4202 -9562 -19708 -25698 -14369 6011 15824
4170A5824j751j169l170r127j2093n161l67J5711j299l848J7295l81N77N380K919
$$ 15824 14073 12904 9734 607 -11486 -16647 -17014 -1303 -2602 -6450 10845 10464 11041 16421 19340
4155A9340N954k0062J0140j5317o392N711r104R04j6496p140J1058J3054K475
$$ 19340 25294 5232 15372 55 -6337 -626 -9730 -8826 -25322 -32462 -21404 -8350 -5875
4142e875j373p958J0286O101M660j0162q401J4111N056p663l428Q713J2982k538
$$ -5875 -7248 -15206 -4920 1181 5841 -4321 -12722 1389 6445 -1218 -4646 4067 17049 14511
$$ [...]
##END NTUPLES=NMR SPECTRUM
##END=
