##TITLE=Analysis number 327346
Compound Code cc 56313
Book Reference 513/57/36
Project Code adrs
Chemist Name ronp
##JCAMPDX= 6.0         $$ Bruker NMR JCAMP-DX V2.0
##DATA TYPE= NMR SPECTRUM
##DATA CLASS= NTUPLES
##ORIGIN= Bruker BioSpin GmbH
##OWNER= nmr
$$ XWIN-NMR		Version 3.5
$$ Thu Mar 22 11:21:04 2007 GMT Standard Time (UT+0h)  MAYBRIDGE\nmr@NMR_250MHZ
##.OBSERVE FREQUENCY= 250.131544655141
##.OBSERVE NUCLEUS= ^1H
##.ACQUISITION MODE= SIMULTANEOUS (DQD)
##.ACQUISITION SCHEME= undefined
##.AVERAGES= 16
##.DIGITISER RES= 18
##SPECTROMETER/DATA SYSTEM= dpx250
##.PULSE SEQUENCE= zg30
##.SOLVENT NAME= CDCl3
##.SHIFT REFERENCE= (INTERNAL, CDCl3, 0, 16.522)
##AUDIT TRAIL= $$ (NUMBER, WHEN, WHO, WHERE, WHAT)
$$ ##TITLE= Audit trail, XWIN-NMR		Version 3.5
$$ ##JCAMPDX= 5.01
$$ ##ORIGIN= Bruker BioSpin GmbH
$$ ##OWNER= nmr
$$ C:\u/data/dgb/nmr/ADRS/1600/pdata/1/auditp.txt
$$ ##AUDIT TRAIL=  $$ (NUMBER, WHEN, WHO, WHERE, WHAT)
(   1,<2007-03-22 11:20:41.63 +000>,<MAYBRIDGE\nmr>,<NMR_250MHZ>,
      <created by zg, POWCHK disabled, PULCHK disabled
       configuration hash MD5:
       49 4B E0 1D 92 C2 6B 37 9F E6 65 BC 52 41 86 1D
       data hash MD5: 64K
       B8 55 62 2B 86 F4 7B F5 89 D4 BA 66 1B C4 BE 14>)
(   2,<2007-03-22 11:20:55.21 +000>,<MAYBRIDGE\nmr>,<NMR_250MHZ>,
      <Start of raw data processing
       ef LB = 0.3 FT_mod = 6 PKNL = 1 SI = 32K 
       data hash MD5: 32K
       41 69 64 B8 59 A1 51 68 60 C5 7F EE DF FF 1C A2>)
(   3,<2007-03-22 11:20:56.88 +000>,<MAYBRIDGE\nmr>,<NMR_250MHZ>,
      <apk 
       data hash MD5: 32K
       1B 2F 68 BE A2 5F E6 2C EA 2F CC 03 1E 6F E5 B8>)
(   4,<2007-03-22 11:20:57.66 +000>,<MAYBRIDGE\nmr>,<NMR_250MHZ>,
      <abs ABSG = 5 
       data hash MD5: 32K
       5C 0B 48 04 37 B0 17 EB 72 BA 69 68 11 78 A9 26>)
$$ ##END=
$$ 
$$ hash MD5
$$ B0 D9 66 4C 9D 59 1D 33 9E CE 31 30 62 75 04 04
##$RELAX= 
##$RELAX= 
##$RELAX= 
##$RELAX= 
##$RELAX= 
##$RELAX= 
##$RELAX= 
$$ Bruker specific parameters
$$ --------------------------
##$DU= <C:\u>
##$EXPNO= 1600
##$NAME= <ADRS>
##$PROCNO= 1
##$TYPE= <nmr>
##$USER= <dgb>
##$AMP= (0..31)
100 100 100 100 100 100 100 100 100 100 100 100 100 100 100 100 100 100 
100 100 100 100 100 100 100 100 100 100 100 100 100 100 
##$AQSEQ= 0
##$AQ_mod= 3
##$AUNM= <au_zg>
##$AUTOPOS= <16 >
##$BF1= 250.13
##$BF2= 250.13
##$BF3= 250.13
##$BF4= 250.13
##$BF5= 500.13
##$BF6= 500.13
##$BF7= 500.13
##$BF8= 500.13
##$BYTORDA= 1
##$CFDGTYP= 0
##$CFRGTYP= 5
##$CHEMSTR= <none>
##$CNST= (0..31)
1 1 145 1 1 1 1 1 1 1 1 1 1 1 1 1 1 1 1 1 1 1 1 1 1 1 1 1 1 1 1 1 
##$CPDPRG= <>
##$CPDPRG1= <>
##$CPDPRG2= <>
##$CPDPRG3= <>
##$CPDPRG4= <mlev>
##$CPDPRG5= <mlev>
##$CPDPRG6= <mlev>
##$CPDPRG7= <mlev>
##$CPDPRG8= <mlev>
##$CPDPRGB= <>
##$CPDPRGT= <>
##$D= (0..31)
0 1 0 0 0 0 0 0 0 0.06 0 0 0 0 0 0 0.0002 0 0 0 0 0 0 0 0 0 0 0 0 0 0 
0 
##$DATE= 1174562440
##$DBL= (0..7)
120 120 120 120 120 120 120 120 
##$DBP= (0..7)
150 150 150 150 150 150 150 150 
##$DBP07= 0
##$DBPNAM0= <>
##$DBPNAM1= <>
$$ [...]
##$SUBNAM7= <"">
##$SUBNAM8= <"">
##$SUBNAM9= <"">
##$SW= 20.6930455092707
##$SWIBOX= (0..15)
0 0 3 0 0 0 0 0 0 0 0 0 0 0 0 0 
##$SW_h= 5175.983436853
##$TD= 65536
##$TD0= 1
##$TE= 683.16
##$TE2= 300
##$TE3= 300
##$TEG= 300
##$TL= (0..7)
0 120 120 120 120 120 120 120 
##$TP= (0..7)
150 150 150 150 150 150 150 150 
##$TP07= 0
##$TPNAME0= <>
##$TPNAME1= <>
##$TPNAME2= <>
##$TPNAME3= <>
##$TPNAME4= <>
##$TPNAME5= <>
##$TPNAME6= <>
##$TPNAME7= <>
##$TPOAL= (0..7)
0.5 0.5 0.5 0.5 0.5 0.5 0.5 0.5 
##$TPOFFS= (0..7)
0 0 0 0 0 0 0 0 
##$TUNHIN= 0
##$TUNHOUT= 0
##$TUNXOUT= 0
##$USERA1= <user>
##$USERA2= <user>
##$USERA3= <user>
##$USERA4= <user>
##$USERA5= <user>
##$V9= 5
##$VALIST= <valist>
##$VCLIST= <CCCCCCCCCCCCCCC>
##$VD= 0
##$VDLIST= <DDDDDDDDDDDDDDD>
##$VPLIST= <PPPPPPPPPPPPPPP>
##$VTLIST= <TTTTTTTTTTTTTTT>
##$WBST= 1024
##$WBSW= 4
##$XGAIN= (0..3)
0 0 0 0 
##$XL= 0
##$YL= 0
##$YMAX_a= 277643
##$YMIN_a= -438366
##$ZGOPTNS= <>
##$ZL1= 120
##$ZL2= 120
##$ZL3= 120
##$ZL4= 120
##$ABSF1= 16.522
##$ABSF2= -4.171173
##$ABSG= 5
##$ABSL= 3
##$ALPHA= 0
##$AQORDER= 0
##$ASSFAC= 0
##$ASSFACI= 0
##$ASSFACX= 0
##$ASSWID= 0
##$AUNMP= <proc_1d>
##$AZFE= 0.1
##$AZFW= 0.1
##$BCFW= 0
##$BC_mod= 0
##$BYTORDP= 0
##$COROFFS= 0
##$CY= 12.5
##$DATMOD= 1
##$DC= 0
##$DFILT= <>
##$DTYPP= 0
##$F1P= 14.0000005364418
##$F2P= -0.99999901652339
##$FCOR= 0.5
##$FTSIZE= 32768
##$FT_mod= 6
##$GAMMA= 0
##$GB= 0
##$INTBC= 1
##$INTSCL= 1
##$ISEN= 128
##$LB= 0.3
##$LEV0= 0
##$LPBIN= 0
##$MAXI= 10000
##$MC2= 0
##$MEAN= 0
##$ME_mod= 0
##$MI= 0
##$NCOEF= 0
##$NC_proc= -4
##$NLEV= 6
##$NOISF1= 0
##$NOISF2= 0
##$NSP= 0
##$NTH_PI= 0
##$NZP= 0
##$OFFSET= 16.522
##$PC= 1
##$PHC0= 231.7884
##$PHC1= 10.36502
##$PH_mod= 1
##$PKNL= yes
##$PPARMOD= 0
##$PSCAL= 4
##$PSIGN= 0
##$REVERSE= no
##$SF= 250.13
##$SI= 32768
##$SIGF1= 0
##$SIGF2= 0
##$SINO= 400
##$SIOLD= 32768
##$SREGLST= <1H.CDCl3>
##$SSB= 0
##$STSI= 32768
##$STSR= 0
##$SW_p= 5175.98343685301
##$SYMM= 0
##$S_DEV= 0
##$TDeff= 65536
##$TDoff= 0
##$TI= <Analysis number 999999
Compound Code 99
Book Reference 9
Project Code 9>
##$TILT= no
##$TM1= 0
##$TM2= 0
##$TOPLEV= 0
##$USERP1= <user>
##$USERP2= <user>
##$USERP3= <user>
##$USERP4= <user>
##$USERP5= <user>
##$WDW= 1
##$XDIM= 32768
##$YMAX_p= 374085046
##$YMIN_p= -256164
$$ End of Bruker specific parameters
$$ ---------------------------------
##NTUPLES= NMR SPECTRUM
##VAR_NAME=  FREQUENCY,     SPECTRUM/REAL,   SPECTRUM/IMAG
##SYMBOL=    X,             R,               I
##VAR_TYPE=  INDEPENDENT,   DEPENDENT,       DEPENDENT
##VAR_FORM=  AFFN,          ASDF,            ASDF
##VAR_DIM=   32768,         32768,           32768
##UNITS=     HZ,            ARBITRARY UNITS, ARBITRARY UNITS
##FACTOR=    0.157963299565203, 1,           1
##FIRST=     4132.6476996994, 0,             0
##LAST=      -1043.33573715361, 0,           0
##MIN=       -1043.33573715361, -256164,     0
##MAX=       4132.6476996994, 374085046,     0
$$ Real data points
##PAGE= N=1
##DATA TABLE= (X++(R..R)), XYDATA
$$ [...]
18461H251459J168166J556145K325517L532667N439031Q485424J3766105K0346852
18453F4871366J9470333O753661l310524l162098L858001N278687m645188j3959401
18445G5154837j6193331j2341764o504365j417458K881632O028638O940214P143146
18437F1691549O179079J322403k847142m798068n514537m291177j511977J908165
18429E2138295M058576M929290N637822L075049j450300l356121l861890l152292
18421E8018429l72048N621253J6102303L1450487M1475754K4303680q805139k7754996
18413A40039723k7235228j1875554Q591061K8009449K8540679J380779k3620981
18406A43829928l4732040l1390643k1789692j3854222q705047n800793m195092
$$ y = [8251459, 9419625, 10975770, 13301287, 16833954, 22272985, 30758409, 44524514, 64871366, 84341699, 91095360, 87784836, 84622738, 88480739, 93759426, 89114238, 75154837, 58961506, 46619742, 40115377, 38697919, 41579551, 47608189, 54548403, 61691549, 67870628, 69193031, 66345889, 61547821, 56033284, 51742107, 50230130, 52138295, 56196871, 61126161, 66763983, 69839032, 68388732, 65032611, 61170721, 58018429, 57646381, 63267634, 79369937, 110820424, 152296178, 176599858, 167794719, 140039723, 112804495, 100928941, 109520002, 137529451, 166070130, 167450909, 143829928, 109097888, 77707245, 55917553, 42063331, 33358284, 27557491, 23362399]
18399B3362399l109206k278124j556282j190699r86844q55262m56222P5597L83794
18390A3389151O42530Q03900J06182l27965m93802o13803n79349m56158L4346
18381A2505032M32881O23524O42556K7038r44525j387013j544523j676340j530221
18372G148409j281614r73677o59676m51672l26288l14243j81691r5388j06052
18363B758108j36530q9248N0683P9260j0231r4167j47760k32175j27819j66921
18353A883200j32447r5805r6696m8684j1938m295k218M919N672L5466J61845K03618
18341A902637K49683L62417N40435P21010P51708M35579J74469l6607j86323m76561
18331D438447p17644p73562o44875m70766k53703j70919j30835m0119o3045k9611
$$ y = [23362399, 20253193, 17975069, 16418787, 15228088, 14241244, 13385982, 12929760, 13005357, 13389151, 14031681, 14835581, 14941763, 14613798, 14119996, 13506193, 12926844, 12470686, 12505032, 12937913, 13561437, 14203993, 14231031, 13286506, 11899493, 10354970, 8678630, 7148409, 5866795, 4893118, 4233442, 3781770, 3455482, 3141239, 2959548, 2864160, 2758108, 2621578, 2532330, 2583013, 2662273, 2652042, 2557875, 2410115, 2177940, 2050121, 1883200, 1750753, 1654948, 1558252, 1509568, 1497630, 1493335, 1491117, 1496036, 1501708, 1537174, 1699019, 1902637, 2152320, 2514737, 3055172, 3776182, 4527890, 4963469, 5137938, 5101331, 4915008, 4438447, 3720803, 2947241, 2302366, 1831600, 1577897, 1406978, 1276143, 1236024, 1172979, 1143368]
18321A143368k5164L9188j7072n5153k5185j3051N0391M9900Q8950N8023N2956
18310A347151L6767Q3587O4503j00122j04296r6406q4050p3745n8092p2767n7913
18299H84617L0447Q0267n984k6410N549J04900J33405K07384L94828M26233L57865
18288B593101J91403J24330K8529j19512l11114l58856l95489l55898j78903q4712
18278A132879q2813l6517q3823q5549l4330m6782m7241j8581n9595P7116J30806
18267H45570M5015R862O9950L6612R788n4020j6910m7539o3806k6594o3816r6518
18255F47594o8205n5218n5671l4164k1870K4411K650K415N5243L2787r267l9756
18243D80949l068K5929M9005k2291N8129Q133o739J6142n4239p5875K4943k2981
$$ y = [1143368, 1118204, 1157392, 1140320, 1085167, 1059982, 1046931, 1097322, 1147222, 1236172, 1294195, 1347151, 1383918, 1467505, 1532008, 1431886, 1327590, 1231184, 1147134, 1073389, 1015297, 942530, 884617, 915064, 995331, 989347, 962937, 968486, 1073386, 1206791, 1414175, 1809003, 2235236, 2593101, 2784504, 2908834, 2937363, 2817851, 2506737, 2147881, 1752392, 1396494, 1217591, 1132879, 1050066, 1013549, 929726, 844177, 809847, 763065, 715824, 697243, 637648, 714764, 845570, 890585, 900447, 970397, 1007009, 1016797, 962777, 945867, 898328, 834522, 807928, 744112, 647594, 579389, 524171, 468500, 434336, 412466, 436877, 439527, 441942, 497185, 529972, 520705, 480949, 477881, 503810, 552815, 530524, 588653, 596786, 590047, 606189, 551950, 476075, 501018, 478037]
18231D78037m1404k288J7936L3474R21j3781l9969J2271J004J4577K3759L819
18219D88356j4112M4L1277n8336k3154J2642L3470L6660P3870R1034N2608J2419
18207G36778l9865P3053Q1568J18584K06047K50252K88274K28071J94007J50051
18197B286820k9813l8802M3568J08977J63184J67763J53873K08216J88979J25584
18187C378349j7898k42981k15379j38013r5000j27622j79750r6152j0222o2472
18177B192860j34176j65221j74572j43246k00146j56990j58437j62265o4841M1759
18167H74725O671l7436l8714l2380n5026j3974L5314M4772J8669L3047Q7543R7702
18155A020913J55418J06904J38583J34213J10345k2441K1106J29311J17679N0125
$$ y = [478037, 436633, 434345, 452281, 485755, 486676, 472895, 432926, 445197, 446201, 460778, 484537, 488356, 474244, 474288, 505565, 447229, 424075, 436717, 470187, 506847, 580717, 671751, 724359, 736778, 696913, 769966, 851534, 970118, 1176165, 1426417, 1714691, 1942762, 2136769, 2286820, 2257007, 2218205, 2261773, 2370750, 2533934, 2701697, 2855570, 3063786, 3252765, 3378349, 3360451, 3117470, 2902091, 2764078, 2669078, 2541456, 2361706, 2265554, 2255332, 2192860, 2058684, 1893463, 1718891, 1575645, 1375499, 1218509, 1060072, 897807, 832966, 874725, 881396, 843960, 805246, 772866, 717840, 703866, 739180, 783952, 802621, 835668, 923211, 1020913, 1176331, 1283235, 1421818, 1556031, 1666376, 1643935, 1665041, 1794352, 1912031, 1962156]
18145A962156m8509L9509J40899K17263J71185O6782j29642j16005k7421j09571
18135B166646j30350l4961L9166N5409N4364J0268m0100o6738m9476M7355Q2180
18124B133763O5355J03692J72326K67445L47544N09613P02363Q46938J167719
18115F316758J708408K536715M001822P013377J2901860K5870975M3303754K0591786
18107A24245455j7981566l0941789k9831866j6993916q764725m993239l172784
18100A1565570k226718j608510j257458r59410p05476n85190n49074n09883l63750
18091B800101k58952k62492r9866j04064j58207j53722j25762j21886j15780l0821
18081A368549j7552l421m9381n9748l2461l3283q0617p1615l369m2412n7975o7782
$$ y = [1962156, 1913647, 1953156, 2094055, 2311318, 2482503, 2549285, 2419643, 2303638, 2276217, 2166646, 2036296, 2001335, 2040501, 2095910, 2150274, 2160542, 2120442, 2053704, 2004228, 2051583, 2133763, 2199118, 2302810, 2475136, 2742581, 3090125, 3599738, 4302101, 5149039, 6316758, 8025166, 10561881, 14563703, 21577080, 34478940, 60349915, 103653669, 124245455, 106263889, 75322100, 45490234, 28496318, 19731593, 14738354, 11565570, 9338852, 7730342, 6472884, 5513474, 4807998, 4222808, 3673734, 3163851, 2800101, 2541149, 2278657, 2178791, 2074727, 1916520, 1762798, 1637036, 1515150, 1399370, 1368549, 1350997, 1347576, 1298195, 1238447, 1205986, 1172703, 1092086, 1020471, 1017102, 974690, 916715, 848933]
18069H48933k4757M0675l1923J2935P0812M7200K6902l0373K8179K7620R8213
18058A114416R6198K3889M9347O4520P5271Q7151J42147J10855J35144K21688
18048B120626J79327K49593L42852M08235O08379Q73602J096653J255374J550179
18039H684820K390211L924522O693837J1816559K1055328K6054857Q651985j2666655
18031G6605464k1128277j9158581j1853787o610663l814011k442888j498233q73174
18023I225850n03999l44342m01819m60898l52938j20542l5610J36529M86613Q47909
18013H476753J151820J613718K091717K546667L458483N402174Q951400J5213843
18005D8906575K7355284M5652392M3638214J968133l1497149m1485085l3099443
$$ y = [848933, 824176, 864851, 832928, 845863, 916675, 963875, 990777, 960404, 988583, 1016203, 1114416, 1210614, 1234503, 1283850, 1348370, 1423641, 1510792, 1652939, 1763794, 1898938, 2120626, 2299953, 2549546, 2892398, 3300633, 3909012, 4782614, 5879267, 7134641, 8684820, 11075031, 14999553, 21693390, 33509949, 54565277, 80620134, 89272119, 76605464, 55477187, 36318606, 24464819, 17854156, 14040145, 11597257, 10099024, 9225850, 8721851, 8377509, 7975690, 7514792, 7161854, 7041312, 7005702, 7142231, 7628844, 8476753, 9628573, 11242291, 13334008, 15880675, 19339158, 24741332, 33692732, 48906575, 76261859, 121914251, 165552465, 167520598, 136023449, 94538364, 61438921]
17998F1438921j9605579j1247907o910320m378538k878110j742131j115299j105876
17990A2455161j300770j308954j063725p66336n24345j58167K35957M44438M76672
17981H489931O16020Q52320J170999J623766K756673M792672Q516029J5627015
17973D4445425K4244782J7119832n569440j8456406k0406271j4330820q172848
17966A8874254m811727k976179k034195j295035p04441n37235o62947p61838o61272
17957D429385n47529n02770l69150k30565m7528j7128j58250j49242j59663j57816
17947B089744j28160j26299j40293j42505j47325m7436K6315m6621m8607K586
17937A291399K6885j6307l9010j0182J6807N2541M3617O8630J0527m5322m9261
$$ y = [61438921, 41833342, 30585435, 23675115, 19296577, 16418467, 14676336, 13561037, 12455161, 11154391, 9845437, 8781712, 8015376, 7491031, 7332864, 7568821, 8013259, 8489931, 9105951, 9958271, 11129270, 12753036, 15509709, 20302381, 28818410, 44445425, 68690207, 85810039, 80240599, 61784193, 41377922, 27047102, 18874254, 14062527, 11086348, 9052153, 7757118, 7052677, 6515442, 5852495, 5090657, 4429385, 3881856, 3379086, 3009936, 2779371, 2731843, 2714715, 2556465, 2407223, 2247560, 2089744, 1961584, 1835285, 1694992, 1552487, 1405162, 1357726, 1384041, 1337420, 1288813, 1291399, 1318284, 1301977, 1262967, 1252785, 1269592, 1322133, 1365750, 1434380, 1444907, 1399585, 1350324]
17926A350324j03442j76919j54971r1563o8093r534o3071q8916n7962J8789j2509
17915E42133k725L944k1199p0629L9121N5932m4212q856o4417n7729N010O533
17903C82906N3752Q3854N8800R873j0146K592p308j3005q5250R267M6115n645
17891E25805p8125j5475M6545R0309m611J1377j6526K8778M8413l30k0884n7918
17879E57358l9795K2288q502p1558l5728m7251K312j4262n8333l4280J1719j4720
17867B69248J8609r3338j22890m2003O3268L3527o266j0094n2123m0626N1268
17856F8580M9051L5300l3354O088J0337j5235l0668j4221k1414l283Q8702J9397
17844A59280r999n7136j5053P2819K7298n7053o9295K2779j4483k7111J5104R1357
$$ y = [1350324, 1246882, 1069963, 914992, 823429, 755336, 745802, 682731, 593815, 535853, 554642, 542133, 539408, 543352, 522153, 451524, 490645, 546577, 502365, 493509, 429092, 371363, 376373, 382906, 436658, 520512, 579312, 589185, 579039, 581631, 574323, 561318, 476068, 485335, 531450, 525805, 447680, 432205, 478750, 569059, 564448, 575825, 559299, 588077, 636490, 636160, 615276, 557358, 517563, 539851, 531349, 459791, 424063, 376812, 379124, 364862, 306529, 272249, 283968, 269248, 287857, 194519, 71629, 29626, 92894, 126421, 120155, 110061, 57938, 17312, 68580, 117631, 152931, 119577, 125665, 136002, 120767, 90099, 75878, 54464, 51181, 139883, 159280, 149281, 92145, 77092, 149911, 177209, 120156, 50861, 73640, 59157, 32046, 47150, 138507]
17832A38507J8267j7422P615l9376N819K1411L2296k3868K8371l0885n4336J8675
17820A05074J1483k0006j0215m9054r116L6888j0575l1323k2349R018j4857j0190
17808a5222K3770j12J3644J9880K1818n837L9435R020j8683Q241j6911L0772L2146
17795A41961l608j1970q957j3343k3493k3225l2126l7638L6151J6516o918M285
17783C7635j9248K4117J2306j1184j44k7775P489L1692K073L0424J9807m4207
17771F2985l1197J2819l0508j7426J4629N3064l0680L4624L4103j9879o8603o6530
17759e2599K3051j0492J1542O2970r8Q100J5028j7533J276J2373K9417N5761k1807
17746A16989n4900j9199j6018K7299M5442j6576j4487K842j8520o2503J5429K2826
$$ y = [138507, 156774, 139352, 146967, 107591, 113410, 134821, 167117, 143249, 171620, 140735, 86399, 105074, 116557, 96551, 86336, 37282, 28166, 65054, 54479, 23156, 807, 9825, -5032, -15222, 8548, 8436, 22080, 41960, 63778, 57941, 97376, 106396, 87713, 95954, 79043, 109815, 141961, 138353, 126383, 117426, 104083, 80590, 57365, 25239, -12399, 23752, 40268, 33350, 37635, 18387, 42504, 54810, 43626, 43482, 15707, 23196, 54888, 56961, 87385, 107192, 62985, 31788, 44607, 14099, -3327, 11302, 64366, 33686, 68310, 102413, 82534, 13931, -52599, -29548, -40040, -28498, 34472, 34374, 42474, 57502, 39969, 41245, 53618, 83035, 138796, 116989, 62089, 42890, 26872, 54171, 99613, 83037, 68550, 71392, 52872, -9631, 5798, 28624]
17734B8624N3750k8410N526J1266k1528n3707L1337N712j8935n3926k0939m338
17722f5568O3737J8084L3808N6891N340N584m1751m6123j2461J00780k217o9353
17710D6751k1783j7493K3649M6841k832J3328m9765p9517O5288K4043M8830j8876
17698G8464m4126M4425J8714k7640n2990L2394N9103N2244j5910j9464m4028j7901
17686F3285R888k1146m4996L0229P364P3l4828K2826m8608K4015O5638m8002l1713
17673e975k3017M7737K8436Q833l7234m4521K1939K4958r929r59k7293j355l9369
17660e7749J2652M6725M5802M302k4406l8766k6823J4776L7168O284M1563j4977
17648D6551m7426m625m5935L0208M7543j3849J0483P0076L1292q2383m2412N9799
$$ y = [28624, 82374, 53964, 59490, 70756, 49228, -4479, 26858, 32570, 13635, -40291, -61230, -65568, -1831, 16253, 50061, 106952, 112292, 117876, 76125, 30002, 17541, 118321, 116104, 46751, 24968, 7475, 31124, 77965, 75133, 88461, 38696, -40821, 24467, 48510, 97340, 78464, 34338, 78763, 97477, 69837, 16847, 49241, 108344, 160588, 144678, 125214, 81186, 63285, 73173, 52027, 7031, 37260, 44624, 44697, 9869, 32695, -15913, 8102, 73740, 25738, -5975, -28992, 18745, 47181, 56014, 18780, -25741, -3802, 21156, 11227, 10268, -17025, -18380, -57749, -45097, 1628, 47430, 51732, 27326, -11440, -38263, -23487, 13681, 19965, 61528, 46551, -875, -5500, -51435, -21227, 26316, 12467, 22950, 93026, 124318, 41935, -477, 59322]
17636E9322K8562j3668N4366L6570n1786o0857j3514M900K9980l9108j7589O960
17624B4138m3328P3100J08649k9959o8797j19595q698J2475P4361K7448J0430
17613F0224l6036L2666K9432K572M7989l8422p1129p2325k5278N6572N8875j1399
17601C3741p182O2143N807p0218k1475n7124m2828r583K9552M0610k5749P6071
17589A3765K6644m8681m6477j0282j7878k4146M2531L7451N4711L154J6214o520
17577D0486q1952k9569M6250l4517Q777R135j8974M3796l209r3549M6878M3340
17565b3108j6603k7856r746K2485R6163M9718l9769o8272k2578J7420L660R183
17553i303r60o977L5194l2835L2567K8739r166l9379j4080q2J568l8667m0127
$$ y = [59322, 87884, 74216, 128582, 165152, 113366, 52509, 38995, 43895, 73875, 34767, 17178, 24138, -19190, 53910, 162559, 132600, 63803, -55792, -64490, -52015, 22346, 49794, 60224, 24188, 56854, 86286, 88858, 136847, 98425, 27296, -45029, -70307, -13735, 45140, 33741, 26559, 88702, 94509, 24291, 2816, -54308, -97136, -106719, -77167, -36557, -62306, 13765, 40409, -8272, -54749, -65031, -82909, -107055, -64524, -27073, 27638, 30792, 47006, 40486, -41466, -71035, -24785, -59302, -50525, -41390, -60364, -16568, -19777, -113326, -66448, -23108, -39711, -67567, -77313, -54828, 41335, 91053, 51284, -16988, -39566, -22146, -18486, -9303, -10263, -17240, 17954, -14881, 17686, 46425, 37259, -2120, -16200, -16282, -14714, -53381, -93508]
17540i3508J8879R5559J1718p3905l0626O6779L4212o315j0472n9914J1608P6744
17528D0759K1122l9177r623m7602k389L8689j1104J1864j523Q5042j4845M8894
17516A20107k9190l7010j7574p708j3661O400p7521r508P0572K7827L6808N0567
17504A20109l8904J2719L3668p76m276R800Q6095J03341J09665R087q1405j40338
17492B18785p9869k7399m9904l5712l0263K2551K7340K9160l0061j6194k0641
17481G793K0482m0409l3836M2643L1235m3342P996M1745N0332M8130j4205J293
17469A19857M6706J23181K33990K04842N3671p9635j65397j69953j34323r8626
17459A34313m2525J6763l7511j6728j9053J2012m1487l3155P6528M3948N0964
$$ y = [-93508, -74629, 20930, 32648, -41257, -71883, -5104, 29108, 22793, 12321, -47593, -35985, 40759, 61881, 22704, 13081, -34521, -36910, 1779, -9325, 2539, 1016, 86058, 71213, 120107, 90917, 53907, 36333, 28625, 14964, 21364, -56157, -65665, 4907, 32734, 69542, 120109, 81205, 93924, 127592, 126816, 122540, 132340, 218435, 321776, 431441, 440528, 359123, 218785, 138916, 111517, 61613, 25901, -4362, 18189, 45529, 74689, 44628, 28434, 7793, 28275, -12134, -45970, -3327, 27908, -15434, -7438, 34307, 84639, 132769, 118564, 119857, 166563, 289744, 523734, 728576, 782247, 702612, 537215, 367262, 232939, 134313, 91788, 108551, 71040, 54312, 35259, 47271, 5784, -27371, 49157, 93105, 144069]
17448A44069k9228j4170O7980Q2749J13359K07130K09827k794j37818k01442o4390
17437C75272J4422M45M3842p671r7729n2777n6399o1369n7962j0666K1503k4179
17425H6732n4288k3455O090l695L9999p095j7852J0459k2108l689K7210m235K150
17412C6223J4919k2250Q347n6188k8495J2278m904M6511R449l2988k3820r8Q6429
17399D5413J2393R262r56N731j7059L1310K4891l2037j9047J0013k183l5017o9681
17386c6967k2511K0548O7027l211k8203k704j7530J026M4196L1617J5246k837
17374F5697Q340n05n9742L658K3666j17844o6456M3245O3537Q0622R113J4933
17362F8264m097p6245M999k390M5153J2026L1465m2317l7444M3579K7444l7220
$$ y = [144069, 114841, 100671, 168651, 251400, 364759, 571889, 781716, 778922, 641104, 439662, 375272, 389694, 390139, 433981, 426310, 328581, 275804, 219405, 158036, 100074, 89408, 110911, 86732, 32444, 8989, 15079, 11384, 51383, 44288, 26436, 36895, 14787, 11098, 38308, 34073, 36223, 51142, 28892, 37239, -18949, -47444, -35166, -40070, 6441, 15890, -17098, -40918, -41016, 45413, 57806, 67068, 66112, 71843, 54784, 86094, 110985, 78948, 59901, 69914, 67731, 32714, -36967, -59478, -38930, 28097, 24886, -3317, -6021, -23551, -22525, 21671, 53288, 68534, 65697, 74037, 73532, 13790, 17448, 41114, -76730, -143186, -99941, -36404, 44218, 53331, 68264, 64167, -12078, -7079, -9469, 35684, 47710, 79175, 36858, -586, 42993, 70437, 33217]
17350C3217J5659J5485P7567j105j7033M378q2986p0166N4823N8420O336k3849
17338G0746m9666j3982l0142l163L221J5693J7266M9674M2800j7082n0529j9997
17326A4839n949l0978K4426K7875M2569k7972K2786L8945m8374j1191k7935J1728
17314C0769k9835j1816O1723M8205j615Q929j3162k3244o6657q78l3313j3700
17302d4594J1561J887O3487L8738m1939o1567l9610Q094k793N7200M4600K5394
17290F0458P067k1966q3983m933k754K7604O1464J6043n8527l9768J9359l5581
17278e5517M4275P7755n379o1875r49M5136M5092L8355J529m6909j1297n2824
17266A7392q7928K3394J02143J3179p1246l6110n4633j2555L5010N4449J0106
$$ y = [33217, 48876, 64361, 141928, 140823, 123790, 128168, 45182, -24984, 29839, 88259, 94595, 70746, 21080, 7098, -23044, -26207, -22986, -7293, 9973, 59647, 102447, 85365, 34836, 14839, 8890, -22088, 2338, 30213, 72782, 44810, 67596, 106541, 58167, 46976, 19041, 30769, 934, -10882, 50841, 99046, 97431, 106360, 93198, 69954, 3297, 2419, -30894, -44594, -33033, -31146, 32341, 71079, 29140, -32427, -72037, -63943, -66736, -9536, 35064, 60458, 67525, 45559, -38424, -43357, -46111, -18507, 42957, 59000, 473, -39295, -19936, -55517, -11242, 66513, 61134, -741, -1690, 43446, 88538, 126893, 128422, 81513, 70216, 17392, -70536, -47142, 55001, 68180, -3066, -39176, -93809, -106364, -71354, -16905, -6799]
17255f799K5019K213r720L0640l9061k7147J4652j713M5068q721j3933L9212l3027
17242A6683n7614J0546K4260j9936K7929l6899J7415J4949j1949O5372O6216J8123
17230A35095J1882n0681n2634m8144j1680j0311j6421R157l1091j5326M4589j4544
17218e0109l312J8877J7930J1694J1279J0534m2772Q187J8193Q837P129M0411
17206E6878k5342m213k2607k423K2482k3573j7500j2773N79K1041p5042o4912
17194a47405q720R4286M2429n6695l023J4133m4444L6805N0122J2949J3581K646
17182F664k4757M9301p116J2687O2974m1394k4621k9722l2666j9751L6206m2294
17170e4489m8257J1952Q221J3524k0451J8919K3868J4839K3487j4153q169J8580
$$ y = [-6799, 18220, 20433, 10713, 41353, 2292, -24855, -10203, -11916, 33152, 24431, 10498, 49710, 16683, -40931, -30385, -6125, -26061, 1868, -35031, -17616, -2667, -14616, 50756, 116972, 135095, 146977, 96296, 43662, -4482, -16162, -26473, -42894, -33737, -64828, -80154, -35565, -50109, -53421, -34544, -16614, -4920, 6359, 16893, -25879, -17692, 501, 9338, 16467, 56878, 31536, 27323, 4716, 2293, 24775, 1202, -16298, -29071, -28492, -7451, -82493, -147405, -156125, -61839, -19410, -76105, -79128, -64995, -109439, -72634, -22512, -9563, 4018, 6664, -18093, 31208, 24092, 36779, 99753, 58359, 33738, 4016, -28650, -48401, -12195, -54489, -102746, -90794, -82573, -69049, -89500, -70581, -46713, -31874, -8387, -22540, -30709, -12129]
17158a2129K5007J1879n5074o659l3211n1443P837o35L3576L4161K2499k4175
17146d8367K251Q858n374m9095j4211M3680l0116o090L6665J8235j4861J0377
17134d8048J8903L9359Q1998K4705l7924l7736m82L1883M7428o2708o6502l4554
17122d3678N0022m575k6386J6994Q25L4269R244n1392k4419j6143L1095O7957
17110D3813N42k4304j079r308J0071O1427M2251R129k8604k0818k9032l9354n1186
17097c6452J9625M0479J4401r7007p9716L4077J2275j52J4295k4840k7171L0298
17085i9888O7557J6960l5823k5809k8230L933j0784n419P921M0204O8411J2419
17073A1452l6364j2436J8412j6742l871K7467j4575p570K0007K6503K6296m0757
$$ y = [-12129, 12878, 24757, -30317, -36976, -70187, -121630, -113793, -114428, -80852, -46691, -24192, -48367, -46116, -37258, -42632, -91727, -105938, -62258, -92374, -98464, -61799, -43564, -58425, -48048, -29145, 10214, 92212, 116917, 78993, 41257, 40775, 72658, 120086, 57378, -9124, -43678, 6344, 1769, -24617, -7623, -6798, 27471, 36715, -14677, -39096, -55239, -24144, 43813, 44355, 20051, 18972, 9664, 19735, 81162, 123413, 132542, 103938, 83120, 54088, 14734, -36452, -16827, 23652, 38053, -58954, -138670, -104593, -92318, -92470, -78175, -103015, -130186, -99888, -32331, -15371, -51194, -77003, -105233, -101300, -112084, -117503, -109582, -69378, -967, 11452, -24912, -37348, -18936, -35678, -39549, -12082, -26657, -34227, -14220, 12283, 38579, -2178]
17061b178j3218o792O144l6627P5033J1304j6650K3094j7846l8419j3882R966
17049b0071m3565j9200J3871N2857R355k017N1328K2581m0239J4495J9896K1538
17037H0829j2329J088n1864k3491k6076j4309J4536k6891J7396R7507K2924l7415
17025D1905o8730k1899k8473j5359j6001K7442N4988J9543q038Q0987L6229R996
17013A12590n6164l5291K3226J0376l3776o9935m7712o5304r546P0169M4900P514
17001d8953m202Q7298K5322j5270j1363k7527L9195K0503k3175l2473m6829N7895
16989B0421R8487K7292m6004p662j5204l043j08862j5958L4622K3917P4127n0465
16977C1668o9538M8812p899n364K4567L4819m6264k3106l7296L4118L1810j4218
$$ y = [-2178, -15396, -22188, -16044, -52671, 22362, 33666, 17016, 40110, 22264, -16155, -30037, -20071, -63636, -82836, -68965, -16108, -6753, -8770, 42558, 65139, 24900, 39395, 59291, 80829, 68500, 69588, 17724, -5767, -31843, -46152, -31616, -58507, -41111, 56396, 79320, 41905, -26825, -48724, -77197, -92556, -108557, -81115, -26127, -6584, -14622, 66365, 102594, 112590, 56426, 21135, 44361, 54737, 20961, -48974, -96686, -161990, -171536, -101367, -56467, -48953, -53155, 34143, 59465, 44195, 32832, 5305, 44500, 65003, 41828, 9355, -37474, 20421, 118908, 146200, 100196, 92534, 77330, 74287, -34575, -50533, -15911, 8006, 82133, 31668, -37870, 10942, 3043, -2321, 22246, 57065, 10801, -12305, -49601, -15483, 16327, 2109]
16965B109n0656M3566K804P58J7400k2240j7397K191r715K1261j0408j9390k5894
16952f5611J4140M5044J0197l655J2601K6367L931m8669o2561o2907l503j6351
16940a50977Q5609M9530k0342L6893m1803j738N226O2634r227M4022M117k4423
16928C9521j5813N7763k465M884J6561l6439n4741J8545n0326m4333J8101J3838
16916c4904k8195j3639K9180M9524l2615p717Q5818K0250j3130l1933K8568m7938
16904C269l3682o7029k7887K4828K2380K1748M5937l2000j4444m5550j5305M8708
16892f9027O9725k0544k5295j868k6546J4008m5214l624J0997P0026J0448m6257
16880f3171j2053P7563M6972l2164k204o4100m1292j2276k7488K8558k1499J2333
$$ y = [2109, -48547, -4981, -2177, -1419, 15981, -6259, -23656, -21465, -31180, -9919, -20327, -39717, -65611, -51471, -6427, 3770, 115, 12716, 39083, 43014, -5655, -68216, -131123, -134626, -150977, -65368, -15838, -36180, 713, -41090, -42828, -37602, 25032, 15805, 59827, 63944, 39521, 23708, 81471, 79006, 83890, 100451, 64012, 9271, 27816, -22510, -66843, -48742, -34904, -63099, -76738, -47558, 1966, -30649, -38366, 47452, 67702, 54572, 22639, 51207, 3269, -30413, -97442, -125329, -100501, -78121, -56373, -10436, -42436, -56880, -102430, -117735, -69027, 698, -19846, -45141, -47009, -73555, -59547, -104761, -108385, -97388, -27362, -16914, -63171, -75224, 2339, 49311, 17147, 14943, -49157, -90449, -102725, -130213, -101655, -123154, -110821]
16868a10821O1899L5578l534J0421O3552m4065o614J5875n0748O1535N3492l7172
16856D9398K1285l9101o8535L7454j2675L262O8071N0815q4109p5135o7608P180
16844a09698M9706J7682K0047k0280j2555N9855K243R527K3019q2015N488J4179
16832b2802n8142M749O0412L9746m3143N632M3705j0850L9801k6814j32308j6287
16820a16301Q2943L9560k8484n0915j418P0311K9915P332k4251n7572m3444j7565
16808a09889N1661K6901P410l7045l4432M0042k0346J264j2332l2873J5304l1277
16796a35612K2425M5291K5124O6234o529j0228m9758n2099k4166J8249j9546O6567
16784e4048P3414K5461k0115J2502K9715n8448L0735m693l3653O497k9940m6805
$$ y = [-110821, -48922, -13344, -16878, -6457, 57095, 13030, 6416, 22291, -28457, 33078, 86570, 49398, 70683, 31582, -36953, 501, -12174, -8912, 59159, 109974, 25865, -49270, -116878, -109698, -59992, -42310, -22263, -42543, -55098, 4757, 7000, 16527, 39546, -42469, -36981, -22802, -80944, -76195, -15783, 23963, -19180, -13548, 30157, 19307, 59108, 32294, -100014, -116301, -33358, 6202, -22282, -73197, -74615, -4304, 25611, 32943, 8692, -48880, -92324, -109889, -58228, -31327, -23917, -60962, -95394, -55352, -75698, -74434, -86766, -119639, -104335, -135612, -113187, -67896, -42772, 23462, 16933, 6705, -43053, -95152, -119318, -101069, -120615, -54048, 19366, 44827, 24712, 37214, 66929, 8481, 39216, 34523, 870, 7367, -22573, -69378]
16772f9378J1077J3247o0753L842K6793L223J6259K77m6340p013L2125O5713O8430
16759E7502m2268q6561J9622M7790l9185j2255L514J6500m542J4144K0288j6423
16747b1874p6863M4364O5926N430m2054K0737M6661o5841j9419J7987L9403N8527
16735G2984k6062p224J9634M8578j1945j6692K2888k9512k7118K5537m0683o8571
16723c8186O3884M0023l6344j2990k943J7075p526j5161k1877K020n852l582L2579
16710A1120K4382k4154p6543K9214N7730j4111Q254K8594K7481q304m4318n0724
16698c1379L0543L8321q2545J7271k0437m1197j7791K6188L2941J6920N6663N904
16686C1402m3102l8910L0587j8024j7168m0752J059M4763O2196k7127l3723n495
$$ y = [-69378, -58301, -45054, -105807, -101965, -75172, -71949, -55690, -55413, -101753, -108766, -76641, -10928, 57502, 15234, -71327, -51705, -3915, -43100, -55355, -51841, -35341, -39883, -25739, -5451, -21874, -98737, -54373, 11553, 16983, -25071, -4334, 42327, -23514, -42933, -24946, 14457, 72984, 46922, 39698, 59332, 107910, 95965, 79273, 102161, 72649, 45531, 71068, 30385, -38186, 25698, 65721, 29377, 16387, 13444, 30519, 22993, 7832, -14045, -12025, -17877, -21459, 11120, 35502, 11348, -65195, -35981, 21749, 7638, 15892, 44486, 71967, 63663, 19345, -31379, -836, 37485, -45060, -27789, -48226, -89423, -107214, -81026, -48085, -31165, 25498, 31402, -11700, -50610, -20023, -38047, -55215, -95967, -94908, -50145, 12051, -15076, -48799, -54294]
16674e4294N5487K7450m5369L4002n5687n3559M5554M4266L7391k2198k3953m5884
16662e6794J0842M3451M551P2319J5010l5432p2006k0771k7843K0747P586K4496
16650a3844R2366J6983q6369j3724L1646m2561j8137L2075M9583m6979p618K1923
16638A5344J223j8971N513o4250k7419L7121K3728J4230J6590l877k2599k1550
16626d4917J0864o02J5644m2081M0341J4557j626m7896M1074Q8802j2565n5028
16614F567p7579m3151L2351J6836k2363O03Q7752N8678K112J6881l448n5894K2882
16601D2227M7543n534l5772j0030Q288n2425k9708L3272O2591R406N067j0353
16589F4572l6055k5155k52M5392m5041l9354M1476K4629k5445j9323j5159m6524
$$ y = [-54294, 1193, 28643, -16726, 17276, -38411, -91970, -46416, -2150, 35241, 13043, -10910, -56794, -45952, -2501, 2050, 74369, 89379, 53947, -18059, -38830, -66673, -45926, -38340, -13844, 78522, 95505, 9136, -4588, 27058, -15503, -33640, -1565, 48018, 1039, -6579, 15344, 16567, -2404, 3109, -61141, -88560, -51439, -27711, -13481, 3109, -768, -23367, -44917, -34053, -34655, -19011, -61092, -20751, -6194, -7820, -55716, -14642, 74160, 61595, 6567, -71012, -114163, -81812, -64976, -87339, -86736, 1016, 59694, 61806, 78687, 75239, 19345, 42227, 89770, 84236, 48464, 38434, 46722, -5703, -35411, -2139, 60452, 69858, 74925, 64572, 28517, 3362, 3110, 48502, 3461, -35893, 5583, 30212, 4767, -14556, -29715, -76239]
16577g6239L4455L1884J2897k7023n4732m2852J4884O2451O0736K8449J7440n8721
16565C629k0780L2476J5617k5058J3848k1624l8345O166L6902J1301k8702M1372
16553B6802K2106K6404P678l0223n8088l4747J3085j7250m7840m1104P8406R5838
16541D1067M9062m6093n1096m1173j7207K0435R0421L9635m470p7453J7174R846
16529C0148m9903k2809j3518J6699l136L2910M4329j2681k8314L7230l250m4752
16517a7047L3869l9299j8110M989K5802j8951k3803L6260L1879j5901m6238M7078
16505E28L3865L996p5360k7903k6328L5056K2348l9630P810K3938j3783k5132
16493h0595n1521K211R5906M7292m913q2071j6055k1051L5292N8497N99j0354
$$ y = [-76239, -41784, -9900, 2997, -24026, -78758, -121610, -106726, -44275, 16461, 44910, 62350, 3629, -17151, 15325, 30942, 5884, 19732, -1892, -40237, -34071, 2831, 14132, -14570, 26802, 48908, 75312, 82990, 52767, -5321, -40068, -26983, -44233, -92073, -133177, -54771, 41067, 90129, 44036, -7060, -48233, -65440, -45005, 45416, 85051, 80581, 3128, 20302, 30148, -19755, -42564, -56082, -39383, -42519, -9609, 34720, 22039, -6275, 30955, 27705, -17047, 16822, -22477, -40587, -35598, -9796, -28747, -52550, -16290, 15589, -312, -46550, 528, 34393, 38389, -36971, -64874, -91202, -56146, -33798, -73428, -65618, -41680, -55463, -80595, -132116, -129905, -33999, 13293, 8380, -73691, -89746, -110797, -75505, -17008, -16409, -26763]
16481b6763O9639j4592k3470m1795O8369r873p4620N495K8704J322q322M2706
16469A6800N0442o061K0214K3389l9153r7804m1195L3871P9847K3144j5796o0778
16457a3080o8177l7413M5380k296J6445P638l3122m000k5300p179N0864M1209
16445b9031J1879J0762N6454k5156k3896k1550n316M3484j3245n5020L1907L5335
16433A6607O408k3626j4438l9545r70k5378j9765L7291O7348m0928m9222p415
16421i3633M1394N0140L8930n0808o3898n028L0802l299k7561J9429m5408K0209
16409h8731M3923O7704m1150q1252k0082L5653N333L5566O5551J6471j438k7110
16397A0438m2921k8657n44K2162M5875M3485P3191n2471j8037l280k4537J9248
$$ y = [-26763, 42876, 28284, 4814, -36981, 31388, 21515, -53105, -47610, -18906, -17584, -25906, 16800, 67242, 61181, 81395, 104784, 65631, -32173, -73368, -39497, 40350, 63494, 47698, -13080, -81257, -118670, -73290, -75586, -59141, -51503, -84625, -88625, -113925, -121104, -70240, -29031, -17152, -6390, 50064, 24908, 1012, -20538, -25854, 17630, 4385, -50635, -18728, 16607, 23015, -611, -15049, -54594, -55564, -80942, -100707, -63416, 3932, -36996, -86218, -93633, -52239, -2099, 36831, -13977, -77875, -82903, -52101, -55400, -82961, -63532, -108940, -88731, -44808, 22896, -18254, -99506, -119588, -83935, -78602, -43036, 22515, 38986, 37548, 10438, -32483, -61140, -61684, -39522, 6353, 49838, 123029, 70558, 52521, 49241, 24704, 43952]
16385D3952L6659J2553o0789o9309k4598j7300K0211J5105j3047j4530J9158L7435
16373a4500k3908m8852k015N2344j9686K1844j2816L9819M3415J5291L0763l2701
16361D8998n6819J2572m0788j1900j5831p557M2216M8404k2295m8537l107k393
16349e7037n6888r178L5696J5514N7862j195l4412L966J0052k7919O167M5519
16337a1853J442o964j4267P183m7675k9925O49Q0565K4500o1057k4557L768p23
16324g8914J4961L4318J8593k1321j0158J3954k0140R071j0425J7144J4370j4365
16312c2912M326K2068j9802o0799N990M4761K0850k2279m0903K3601O7801P8497
16300I1199q658r74l1436l4200n2218j3512K7862k5470k0141k5401J5649K6232
$$ y = [43952, 80611, 93164, 32375, -36934, -61532, -78832, -58621, -43516, -56563, -71093, -51935, -14500, -38408, -87260, -89275, -36931, -56617, -34773, -47589, -7770, 35645, 50936, 81699, 48998, -7821, 4751, -36037, -47937, -63768, -71325, -29109, 19295, -3000, -51537, -54644, -57037, -113925, -123103, -87407, -71893, -14031, -15226, -49638, -45672, -35620, -63539, -57372, -11853, -10411, -17375, -31642, -24459, -72134, -102059, -101410, -20845, 3655, -57402, -81959, -78191, -78914, -63953, -29635, -11042, -32363, -42521, -28567, -48707, -39636, -50061, -32917, -18547, -32912, -28586, -6518, -26320, -87119, -81129, -36368, -15518, -37797, -78700, -55099, 12702, 91199, 82541, 81567, 50131, 15931, -36287, -49799, -21937, -47407, -67548, -92949, -77300, -51068]
16288e1068K7046P5585J1192k1102q3039p1002l0591q130J07129M7400k7097l0537
16276e4214m6137m3490N3540Q8042k525j7977n1617L1379j0609l5972K6603P4525
16264A1548j5221l0638K9640j4962N8365l092l9871L6114M4757j1529j01495m9613
16252h5997L4573q798J6187k1525N4618j5467P5665K9957l9252o4103o9839L5666
16240e8315k428j7356K7420J4956J2826m67J9962O4613r077p501k2461j6865M5412
16227E0719k8671k255J3607n3275j4581O880P665l1401k2252q794o885k1451R981
16214a00713J454N762N2420M5678l1429r3560k0796J5210L9886K1215R016j1894
16202f7751p4662j7315Q5600K4144n8142l134j077M0206M2111L9772j1514m3519
$$ y = [-51068, -24022, 51563, 62755, 41653, -41386, -112388, -142979, -151109, -43980, 3420, -23677, -54214, -100351, -143841, -90301, -2259, -4784, -22761, -74378, -42999, -53608, -89580, -62977, 11548, -3673, -34311, -4671, -19633, 38732, 35640, -4231, 31883, 76640, 65111, -36384, -85997, -51424, -60222, -44035, -65560, -10942, -26409, 49256, 79213, 39961, -24142, -93981, -58315, -60743, -78099, -50679, -35723, -22897, -23364, -3402, 61211, 52134, 44633, 22172, 5307, 50719, 22048, 19793, 33400, -19875, -34456, -27576, -19911, -51312, -73564, -82358, -89243, -110694, -100713, -99259, -93497, -41077, 4601, -26828, -120388, -141184, -125974, -86088, -64873, -55857, -67751, -142413, -159728, -74128, -49984, -108126, -111260, -112337, -72131, -30020, 9752, -1762, -45281]
16190d5281J5939L4721J3638k5930J5129k391J2739L4663l7381k5835L1180m8706
16178b7515r879K7283L9519J2044r4911o4811p649O9083M2168J8555N094M8773
16166E7754n1657R186j4953j5500L9600J0236L521O9849J2485q0066q0219j51
16154c9915L5260J1624n5229L0384M923L4662j3785m6032l2051K92N2583o780
16142b4064m2244j8492K9839J5873j0948j8655j7217M8734j381m5145J2129K0418
16130e1153L5929K1603p3417l9083J2349N4214j1245J3579J6578k0642k7645K1174
16118d7759j4764l1504P3538M0012J2845p401k7359K457l2265j4931k5721j0825
16106h3677N5418J6276l5550j4525j144n3116K3663O7246J9822P5312J0499j17539
$$ y = [-45281, -29342, 5379, 19017, -6913, 8216, 5825, 18564, 53227, 15846, -9989, 21191, -27515, -37394, -10111, 29408, 41452, -53459, -118270, -125919, -56836, -14668, 3887, 8981, 57754, 6097, 15283, 330, -15170, 24430, 34666, 38187, 108036, 120521, 40455, -39764, -39915, -4655, 6969, -48260, -17876, -12953, 21709, 7924, -38108, -70159, -69867, -17284, -24064, -66308, -84800, -54961, -39088, -50036, -68691, -85908, -37174, -38555, -83700, -71571, -51153, -15224, 6379, -67038, -106121, -93772, -39558, -50803, -37224, -20646, -41288, -68933, -47759, -62523, -94027, -20489, 19523, 32368, 24967, -2392, 65, -32200, -47131, -72852, -83677, -28259, -11983, -47533, -62058, -63202, -116318, -92655, -25409, -5587, 69725, 80224, -37315]
16094c7315o786l479n2036L3850J4134J6450k9959M1177k0794l0444P1144K5133
16082B1075j5910K8073P9314l2329m5780M65m0546l4754K1539l3161j0079N1472
16070a0621r950p5631K3573k829l7191j6870O0282O4635j865q988n3850m1077
16058a10382M6804M0119L3016l0328K4655P7627Q729m3326q3356n8084L300m2672
16046a33898m9568P6499P1336O362J3564K4621r563K3773L995K534K7606M0172
16034I7433k2457j7540j5086n876k0741j0397k676K0062k2876j7034j3430J7859
16022a2759l4947K9280K9607M7315l3383m746j4315m7309L369K991R69N949K9658
16009A679k96k1839L5406J7655L2583k2532M2216l8025j9060o9759n4260N1859
$$ y = [-37315, -44101, -47580, -99616, -65766, -51632, -35182, -65141, -23964, -44758, -75202, -4058, 21075, 5165, 33238, 112552, 80223, 34443, 34908, -5638, -40392, -18853, -52014, -62093, -10621, -20571, -96202, -72629, -75458, -112649, -129519, -69237, -4602, -6467, -15455, -69305, -110382, -63578, -23459, 9557, -20771, 3884, 81511, 90240, 46914, -36442, -94526, -91226, -133898, -183466, -106967, -35631, -29269, -15705, 8916, -647, 23126, 27121, 29655, 57261, 97433, 74976, 57436, 42350, 36474, 15733, 5336, 2660, 22722, -154, -17188, -30618, -12759, -47706, -18426, 11181, 58496, 25113, 20367, 6052, -41257, -37888, -34897, -33928, -27979, 1679, 1383, -20456, 14950, 32605, 65188, 42656, 84872, 46847, 27787, -41972, -96232, -44373]
15997d4373K7148n3651j2059L3338J066N6530M051l6404l395O0536J1283l6179
15985G891L855k8709l5582j1657L1579J2122j8228k8748j6751K9387k6926J5646
15973f6121k9697l1909m730P3811O8831m5971Q112J6111k8288R44q721N467L6639
15960e522N6713j6095O142K3147j6130j5951N9380j9675o3051J5384J7813q184
15948C3971l2137M4502J5605l2245n9641p5686K5831J02287M5170o0692o6893
15937e9928K7157m7765N213L8394J9075J0214m966N2957m0271j0865J708J8313
15925I236l1053K6157L9947K4462L17m4514k773K2583m378k487j7822l1586j23
15912a2034J8227P1428j9228m3398k1876m1432k1339J4235j4374n7397J0845M8450
$$ y = [-44373, -17225, -70876, -82935, -49597, -48531, 7999, 12050, -24354, -27749, 32787, 44070, 7891, 11746, -16963, -52545, -64202, -32623, -20501, -38729, -67477, -84228, -54841, -81767, -66121, -95818, -127727, -132457, -58646, 10185, -35786, -27674, -11563, -39851, -38907, -47628, -42161, -5522, 51191, 35096, 41238, 64385, 48255, 32304, 91684, 72009, 8958, 24342, 42155, 33971, 1834, 46336, 61941, 29696, -29945, -105631, -79800, 22487, 67657, 6965, -59928, -32771, -80536, -75323, -36929, -17854, -7640, -12606, 40351, 80, -10785, -9077, 9236, -21817, 4340, 44287, 68749, 69066, 24552, 21779, 44362, 39984, 37497, 19675, -11911, -12034, 6193, 77621, 58393, 14995, -6881, -48313, -69652, -55417, -69791, -127188, -116343, -67893]
15900f7893M3883M7894R392P564l3029j4681n4486n4655l7601M0618k0688l6570
15888a70252K2154P3532L0903o826n9732q6043L3170N9630N2642K1529o119k4389
15876e9801k4365L3849M001L2436M3766L6140l9733n2618m3388n6234L5667M6919
15864d3361M8224K100j2248m8187K1616J7291m5236J8364N3261n4019m9669K7911
15852f3953M1722O7061k8461l9449j7283R364K7690O761o5744L443K6976P787
15840b4086j2365k3282M161J1336M1791l2278p04L6526l434m3719k1757Q921j5566
15827g4456M2382k1155o533L3803J0347m1348m1225n3668k5501Q430J4876o112
15815a60160k356Q4571M4348N708m4458L6243L3327J0980l1046k9173n5224j8649
$$ y = [-67893, -24010, 23884, 33276, 40840, 7811, -6870, -61356, -116011, -153612, -112994, -133682, -170252, -148098, -74566, -43663, -50489, -110221, -196264, -163094, -103464, -50822, -29293, -35412, -59801, -84166, -50317, -46316, -13880, 29886, 66026, 26293, -26325, -69713, -125947, -90280, -43361, 4863, 6963, -5285, -53472, -31856, -14565, -59801, -41437, 11824, -42195, -91864, -63953, -22231, 44830, 16369, -23080, -40363, -30999, -3309, 3452, -62292, -58849, -31873, -24086, -36451, -59733, -55572, -44236, -2445, -34723, -35427, 1099, -2335, -46054, -67811, -58890, -74456, -32074, -53229, -59762, -25959, -15612, -56960, -98185, -151853, -177354, -168924, -154048, -160160, -162516, -77945, -33597, -27889, -72347, -36104, -2777, 8203, -22843, -52016, -107240, -125889]
15803a25889N0230j0451p535k7152N1881K5111j8097l8011l0934M5788L4728l2596
15791h2927R741k2178j8066L9681M9741j3975k8921j2070M8002M7628L9594Q230
15779F4480j27113m1469L3534m4768j2606j1601r269L6261N4325L3704L1383J0004
15767A6865j0105n7297l9289K2090M3925p004J9137k7708k4142J3536o1111M1236
15755f9867J9042J0339K8685J2825k7133j0045K6654l6097m1865k0041O5028L1264
15743a1211K4965j0365m8105j7440J444J9940L3230O7338P5251j4294j31711o2203
15731g3161N2805J7953m0303j0523n6751M650J6767M5623P0061k7511K9760P1292
15719A00662k280q3925j2765M089j8009K1758j5571l9106j6449M0349k5480j7190
$$ y = [-125889, -75659, -86110, -93645, -120797, -68916, -43805, -61902, -99913, -130847, -85059, -50331, -82927, -73186, -95364, -113430, -73749, -24008, -37983, -66904, -78974, -30972, 16656, 56250, 64480, -62633, -104102, -70568, -115336, -127942, -139543, -148812, -112551, -58226, -24522, 6861, 16865, 6760, -50537, -89826, -67736, -23811, -30815, -11678, -39386, -63528, -49992, -111103, -69867, -50825, -40486, -11801, 1024, -26109, -36154, -9500, -45597, -87462, -107503, -42475, -11211, 13754, 3389, -44716, -62156, -60712, -40772, -7542, 59796, 135047, 120753, -10958, -73161, -20356, -2403, -42706, -53229, -109980, -105330, -88563, -42940, 27121, -390, 29370, 100662, 98382, 14457, 1692, 5781, -12228, 9530, -6041, -45147, -61596, -21247, -46727, -63917]
15707f3917K1297m639j0318n4268K0772L4607m427p3707K8837o1764l8716N2836
15695a53407j0272K3877K5367M883N1110j9383m3922M7424n920J3800N757J3208
15683d7478M0826J1293O1162O2067M2122L196j8361m9814k6265J4480k771q4002
15671F455o2747p286L5014O62m7723J1526O4050K0230l1798K0693m5208K0982
15659a5150O2680N2264j7533q5193o6992N1046k2364j5435M7722M3789M8209o157
15647G6886k6376K3454o0646n3040N910k486M051J4988l2741p335K2111L6628
15635A404l1849K027K2456l5893J3356J6581K8461m4473k1384L3597m4810l6767
15623i7294n041k9973r83K0238j6759K4177L406k6146j7282L9645R1022K0300
$$ y = [-63917, -42620, -47259, -57577, -111845, -91073, -56466, -60893, -134600, -105763, -167527, -206243, -153407, -163679, -139802, -114435, -109552, -58442, -77825, -121747, -74323, -80243, -66443, -60686, -47478, -6652, 4641, 65803, 127870, 169992, 173188, 154827, 105013, 78748, 93228, 90457, 6455, -56292, -63578, -28564, -27902, -75625, -64099, -49, 20181, -11617, 9076, -36132, -15150, 47530, 99794, 82261, -2932, -69924, -18878, -41242, -56677, -8955, 34834, 83043, 76886, 50510, 73964, 13318, -39722, -33812, -36298, -32247, -17259, -50000, -57335, -35224, 1404, -30445, -28418, -5962, -41855, -28499, -11918, 16543, -27930, -49314, -15717, -60527, -97294, -102335, -132308, -133291, -113053, -129812, -105635, -102229, -128375, -145657, -106012, -14990, 5310]
15611E310J393J3664m660N5144L272m1497L6615J2828M982q1557k669l4257m2020
15598g3452j0188L6810J9198K1863q412O7438n038k0913P2413J1854k3339m6012
15586D2222j7271n679O8594k8978Q916l7221n7133L0504L3218K9063j9665q721
15574C7849K1780k8734o4535m5092k5210J3555j543M0300N2930L8723K9470j2931
15562E6562o220k4837l3512o6222o611R838k4374Q066K1541J1314M734l4350N6377
15549b7694K2186j5045j749j2797k4601j6504K4916k713o6271Q0507L3642j9391
15537b5514N316j3133N1562k0168k1392n514o2306j9434K7530k980j5335j9572
15525a20940m7152r98K1100N2012m2712n728J4847N9713N3241k905l4053p0174
$$ y = [5310, 6703, 20367, 15707, 70851, 74123, 32626, 69241, 82069, 87051, 5494, 2825, -31432, -73452, -83640, -46830, -27632, -5769, -14181, 53257, 48219, 27306, 99719, 111573, 88234, 42222, 24951, 19272, 87866, 58888, 67804, 30583, -26550, 3954, 37172, 66235, 46570, 37849, 59629, 30895, -33640, -78732, -103942, -90387, -91930, -51630, 1300, 40023, 69493, 56562, 50342, 25505, -8007, -74229, -80840, -71002, -95376, -87310, -65769, -54455, -49721, -84071, -27694, -5508, -20553, -22302, -35099, -59700, -76204, -51288, -54001, -120272, -39765, -6123, -25514, -20198, -33331, 18231, -1937, -23329, -28843, -91149, -110583, -83053, -86033, -101368, -120940, -168092, -169090, -147990, -95978, -138690, -144418, -129571, -69858, -16617, -19522, -53575, -123749]
15513a23749R747L6659m1124l0252L7732P3253l596o3806M162N325M2864p379
15501f0164l7209L2492M1563J4134o5628J1130J4206n7870L3064R2213O8987L6838
15489A23756o859k1288l4216j5824m884J3347K2973k7312L423m3836r800K2322
15477B1802l012k9013n2785J4119J16290j8662o407N88K2024J6714k6449k6505
15465B8704j845L7514j3512j8126p1542K7188l785r568J0102L1919l0645L379
15453a0217k8021K4184P023J3137M4105k1491n6765m1179M4449J28114M669k8312
15441G9696R018J7737k5996o8459K594K7412j1408M066l8489n5714O066l085N944
15428e0618O8838R635M571l2709P1947M6623L488O681j3992j2190q3219o3787
$$ y = [-123749, -114002, -77343, -118467, -148719, -110987, -37734, -41330, -105136, -100974, -95649, -52785, -60164, -97373, -64881, -23318, -9184, -74812, -63682, -49476, -107346, -74282, 17931, 86918, 123756, 116897, 95609, 61393, 45569, 40685, 54032, 77005, 49693, 53116, 9280, -520, 21802, 18790, -10223, -63008, -48889, 67401, 48739, 42332, 42920, 64944, 81658, 55209, 28704, 26859, 64373, 50861, 32735, -38807, -11619, -15404, -24972, -14870, 17049, -13596, -10217, -38238, -14054, -7031, 6106, 50211, 28720, -28045, -69224, -24775, 103339, 108008, 79696, 88714, 106451, 80455, 11996, 14590, 42002, 30594, 34660, -3829, -59543, -53477, -56562, -50618, 18220, 27855, 32426, -283, 71664, 118287, 121775, 128456, 114464, 102274, 19055, -44732]
15416d4732m3674n1627k7550L7524N3938J7439j2984kM0260J1221l4926j6952
15404g2065J2132N9804M2377m45J2097j2578J533L3562j1309k755k2783K1622
15392F1192l9508m9798k4558r397K9555K7662N7361k7572m6750J4234N5249j5418
15380C2252p498L4343O057q3948k1790N211L3567M3033n7110o4862K9048K1506
15368c0191M392K3148K256j027l5231j3282Q027m6040K134L2863k3807m0203N9754
15355e7207K0131j7142j5035M5172K852k0487K5500M1840K4398l9942l3237L2329
15343I172j3853j749p747J638K6479J1444M385K7078O125k4582j5903m842L2935
15330E0580k9705j0507j6400j5665j1423P103J0654J02192j3357l5851l3616m5735
$$ y = [-44732, -88406, -140033, -167583, -130059, -76121, -58682, -71666, -71668, -31408, -20187, -55113, -72065, -59933, -129, 42248, 41803, 53900, 41322, 42855, 76417, 65108, 62353, 39570, 61192, 21684, -28114, -52672, -62069, -32514, -4852, 52509, 24937, -21813, -7579, 47670, 32252, 24754, 59097, 65154, -18794, -40584, -35373, -1806, 41227, -15883, -80745, -51697, -30191, -25799, -2651, -395, -1422, -36653, -49935, -41908, -87948, -85814, -52951, -76758, -116961, -57207, -37076, -54218, -69253, -24081, -21229, -41716, -16216, 25624, 50022, 10080, -23157, 9172, -4681, -6430, -14177, -12539, 13940, 25384, 29769, 56847, 62972, 38390, 22487, 17645, 50580, 20875, 10368, -6032, -21697, -33120, -26017, -15363, 86829, 73472, 37621, 4005, -41730]
15318d1730L5138K8030P903j01493J5427J3469n8313j9429j6410L8227K1108j9684
15306i7757J0356m8374L0071o520j3194J2421P330j3629m195M474p248r542j6705
15293a52512L0202K9726N8735O3887n749j7791j314O6837m3838j00253n8776P9154
15281e1692O6240k8472j2696P4127l1090q9633j9549K7351M4864K2963n1968p7980
15269a27535O361O1252k6241k9721K7785m0628j0193Q526P478K746L1512L6100
15257e2558P867K6654L8902J8031m6728r0678M9379J3663m5247L6787j4972N2587
15245f313M2943K9843o2977k6352Q2764q600l7899l0169m2328m8902j7551j9222
15233a44763o442l2763L0570L1333k1159N337j7602M920K2942M7374K1932j4983
$$ y = [-41730, -6592, 21438, 29341, -72152, -56725, -43256, -101569, -120998, -137408, -99181, -78073, -97757, -87401, -135775, -105704, -112224, -125418, -112997, -105667, -119296, -123491, -119017, -126265, -135807, -152512, -122310, -92584, -33849, 30038, 24289, 6498, 5184, 72021, 28183, -72070, -130846, -51692, 14548, -13924, -26620, 47507, 16417, -73216, -92765, -65414, -20550, 2413, -49555, -127535, -121174, -59922, -86163, -115884, -88099, -128727, -138920, -130394, -122916, -120170, -88658, -52558, -44691, -18037, 20865, 38896, -7832, -98510, -49131, -35468, -80715, -43928, -58900, -6313, 36630, 66473, 3496, -22856, 59908, 51308, 13409, -16760, -59088, -107990, -125541, -144763, -151205, -183968, -153398, -122065, -143224, -137887, -155489, -150569, -127627, -80253, -58321, -73304]
15221g3304j5261L439j0699j2481l0483N907M1294M7128J9984r056J3901j5438
15209c5069K5933J6345J7752m5353K5241j4441K5248k47k7665m5018k3380Q221
15197g2433L6906N520k1075J0737J5119j4202J5734j5499q401Q245K4990M7372
15185C3013j8438m1391L2966Q879M047l1719J8738L3653l092n4116j5889K9503
15173c846p278K297j5978J5407l1658m4610J2358M5593q760k654k5738L8171R359
15160a7337n1604l5723j9566M4523N0965K7162k8624j1202J2679J24559K5019
15149A20851k057m2192p9132j6228M5614N0808O237m4487K5579k3517k9522p169
15137D785n7720M8463M7599l993o9875j19R794M4218j7316j9082L7352j8948K9786
$$ y = [-73304, -88565, -85126, -95825, -108306, -138789, -132882, -91588, -44460, -24476, -33532, -19631, -35069, -9136, 7209, 24961, -20392, 4849, -9592, 15656, 15409, -12256, -57274, -80654, -72433, -35527, -30007, -51082, -40345, -25226, -39428, -23694, -39193, -47594, -39349, -14359, 33013, 14575, -26816, 6150, 15029, 19076, -12643, 6095, 39748, 36656, -17460, -33349, -3846, -11124, -8827, -24805, -9398, -41056, -85666, -73308, -27715, -36475, -39129, -64867, -26696, -17337, -68941, -104664, -124230, -79707, -28742, -1580, -30204, -41406, -28727, 95832, 120851, 118794, 76602, -2530, -18758, 26856, 77664, 83901, 39414, 64993, 41476, 11954, 4785, -52935, -4472, 43127, 39134, -30741, -30860, -21066, 23152, 5836, -13246, 24106, 5158, 34944]
15124C4944j2456J581J04512M3266o0476m3846K7256l1771j0844k0656k3298m1569
15112c3357j8527J5406M363K4850p8969m4155p933K0425O8816k5761J7544j9613
15100g6911N9367k5610j5562J2515L6730J0078n2550J951J2450l7882n0211L473
15088a22162l665Q4815K8431K7922j328j3977o6682k2122L6108J3193L4603k2157
15076b7021k075k4855L1450M3580J0522m2264j20681q9345J3996J05083M3154
15065e8456m411K7262M5562o9539n6845m8501J2983K0355M8256M0610N5063M9061
15053F1400L085k8380r769l3992l4377n7940o198J1295k1011O2697N6022O8067
15041G0899m0389n5951n6K424l8576J7855n528m0114J0483J7111k7888q463K9740
$$ y = [34944, 22488, 24069, 128581, 171847, 111371, 67525, 94781, 63010, 52166, 31510, 8212, -33357, -51884, -36478, -32115, -7265, -86234, -130389, -138322, -117897, -49081, -74842, -57298, -76911, -17544, -43154, -58716, -46201, -9471, 607, -51943, -49992, -37542, -75424, -125635, -122162, -125827, -41012, -12581, 15341, 14013, 36, -66646, -88768, -52660, -39467, -4864, -27021, -29096, -53951, -22501, 21079, 31601, -10663, -131344, -220689, -206693, -101610, -58456, -62867, -35605, 9957, -59582, -116427, -164928, -151945, -131590, -83334, -42724, 12339, 61400, 64485, 36105, 26336, -7656, -42033, -99973, -106171, -94876, -115887, -53190, 2832, 70899, 30510, -25441, -25497, -23073, -61649, -43794, -49322, -89436, -78953, -61842, -89730, -98193, -68453]
15028f8453k927J6038M7143l6340p7158K0399N6021J08402P6052n0783o7464K304
15016B3234K5319k7751q3339k9912j4956L1151Q1742K472o0758K9004M1853m9334
15004c1275k6677N5617M6823M400j9900L9360l257n848m6911j8356k9739l8839
14992g4602L708M2467k712p9735o782O3406j5498J6773J3221K8099K3295n7067
14980d5427k6813l4595O0524K9526K8409n9386j9665L303M0628N765k6849M0731
14968c849J5196j2193J8014L2838l708L719m8436n0193L844J5819p861J0800n1822
14955g7832m8020K7662O0294J7032l1362P771K6937m5281L860o25O708Q1992J1325
14942D0461m4480r4440P680J4918L2999L6187j3775m2465j2415K681L5442O3370
$$ y = [-68453, -71380, -55342, -8199, -44539, -121697, -101298, -45277, 63125, 139177, 88394, 20930, 23234, 48553, 20802, -62537, -92449, -107405, -76254, 5488, 7960, -52798, -23794, 18059, -31275, -57952, -2335, 44488, 48888, 28988, 68348, 65091, 59243, 12332, -6024, -35763, -74602, -70894, -28427, -31139, -110874, -117656, -54250, -69748, -52975, -39754, -11655, 11640, -45427, -72240, -106835, -46311, -16785, 11624, -47762, -67427, -64124, -23496, -17731, -44580, -3849, 11347, -846, 17168, 50006, 46298, 50017, 1581, -48612, -44768, -28949, -36810, -26010, -77832, -125852, -98190, -37896, -20864, -52226, -44455, -17518, -62799, -58939, -59564, -52856, 29136, 40461, -4019, -98459, -90779, -75861, -42862, -6675, -20450, -62915, -75330, -72649, -37207, 26163]
14930B6163J0575l6874k6749q243J4586j9433J7559k255m3512j0652J2349R130
14918e7356K7620M5547p632o4656j4333K6549M753j3738J6598j5347N5151K2546
14906B5702j0719l1389m9651L5078j8956n3453O1884R513k1402K7022j4210l5657
14894g6238j7660L724O7751J9704K3723m3614k4468N5277L7348m1512m7929n7786
14882a01680j7925k3330K2964O6794J0477K7952L3990l3093k8229Q0735L6197
14871G4852m8327j4718r261K3880k5052m1679j9890M7958K2577k4065j1619q483
14859c3827K6374k9392r844K0234n0006j0903K4990M6574N226L6397o441L2280
14847E1662j9262j1836k9253M3086j94o75j4723L0984j4355o4085M29N4490P5524
$$ y = [26163, 36738, -136, -26885, -35128, -20542, -39975, -22416, -24671, -68183, -78835, -66486, -57356, -29736, 15811, 8179, -56477, -70810, -44261, -39508, -53246, -36648, -51995, 3156, 25702, 14983, -16406, -66057, -30979, -49935, -103388, -41504, -31991, -53393, -26371, -40581, -76238, -93898, -90174, -22423, -2719, 21004, -22610, -47078, 8199, 45547, 4035, -43894, -101680, -119605, -142935, -119971, -53177, -42700, -14748, 19242, -13851, -42080, 38655, 74852, 26525, 11807, 2546, 26426, 1374, -40305, -60195, -12237, 10340, -13725, -25344, -33827, -7453, -36845, -46689, -26455, -76461, -87364, -62374, -15800, -10574, 25823, 19382, 51662, 32400, 20564, -8689, 34397, 34203, 33528, 18805, 49789, 35434, -28651, -28222, 26268, 101792]
14834A01792N5004k4766j02153J3337l3152m2634Q135L8053L6330n1565j27584
14823a29203m7693K7497n423K3811Q0969Q4533K0241M349k689j9960n1042M013
14811a0597N353m6472o2335K1586J961J8384M2206J0446K6315k5720M1321k9205
14799f757o4528L8122J5850J2582L7272M0293j3670l3976J2063k4056l1425l8253
14787e6483J5398m3712Q9943J5289l0443p772l5302l2170J5049j2425M5308M2102
14775D782l543p8877M8475O2776l1143o5175N2362J1793k5906k6097J3082j0212
14763d7683n1283k6523R6536L4343k4445k5898O0090K8634p9343n1309m105j554
14751i2540l9305R095N9870P5158Q2728J5238n5730n3841Q291R761O2014k6661
$$ y = [101792, 156796, 132030, 29877, 43214, 10062, -32572, -24437, 13616, 49946, -1619, -129203, -176896, -149399, -154822, -131011, -50042, 34491, 54732, 59081, 56392, 36432, -14610, -10597, -5244, -51716, -114051, -92465, -90504, -72120, -29914, -19468, 6847, -18873, 22448, -6757, -71285, -33163, -17313, -4731, 32541, 72834, 59164, 25188, 37251, 13195, -18230, -56483, -41085, -84797, 5146, 20435, -10008, -17780, -53082, -85252, -70203, -82628, -37320, 4782, 1239, -77638, -29163, 33613, 2470, -62705, -10343, 1450, -24456, -50553, -37471, -47683, -98966, -125489, -28953, 5390, -19055, -44953, 15137, 43771, -35572, -86881, -90986, -92540, -131845, -122750, -62880, 12278, 95006, 110244, 54514, 673, 8964, 18725, 80739, 54078]
14739E4078o7101q758k0082N0600J1974N579k0080J0370J5638m0365J2232M7352
14727E1437K4378J8516k4210k4958k5143j0484j0852k2366k4327L8011J5862M74
14715F338p835K143J0229Q7732n934l2491n4825n6446J3727J8902l9561j1139
14703f9160J4542K4632p438n2m0110n5679k9177Q4257M8096j6160K763K4943L4440
14690A5897j9197J4002L9598n9448m5873L1439O062o5150J2435P9691J6653j1858
14678A4251j283j2345o5432K0268m092Q061L4035K1899j410m636p075o837j8468
14665b3064N1743K4690j9294J8456j2626j6353n973j7281k75K1993q744K014R138
14652B4424j2482l4592k1823r0201o1677J1141Q4614L2646m6572M1983L3703j8219
$$ y = [54078, -13023, -21781, -41863, 8737, 20711, 26290, 6210, 16580, 32218, -8147, 4085, 51437, 75815, 94331, 70121, 45163, 20020, 9536, -1316, -23682, -48009, -9998, 5864, 6338, -1497, 646, 10875, 98607, 92673, 60182, 5357, -51089, -37362, -18460, -58021, -69160, -54618, -29986, -37424, -37476, -77586, -133265, -162442, -78185, -30089, -46249, -43486, -18543, 15897, -3300, 10702, 50300, -9148, -55021, -23582, -17520, -82670, -70235, 9456, 26109, 14251, 12968, 623, -64809, -44541, -48633, -40572, -6537, 15362, 13952, 9316, 2241, -4596, -23064, 28679, 53369, 34075, 52531, 39905, 23552, 17579, 298, 23, 22016, 13272, 15286, 24424, 11942, -22650, -44473, -134674, -196351, -185210, -100596, -67950, -114522, -72539, -38836, -57055]
14640e7055j2456j7917n2828R5340Q7857J1747p1664n791j9663K1964M391n2142
14628f8217k551M3541N7059k3673J6460l2789k5018N0099K9945m5065o9690l9926
14616a09825K8119M294j3753k6052l6651j5667l3188n3441K3137N2189M9042K3047
14604a08749K5486K3243M240J2467o6449J4709k2681L5673j1908J3684L9184j8543
14592e9644K6578P8213j8198m8669o3851n421O2689J1685M821L0891J3638K9821
14580F2553k7831j134q480J5052q962n0813l5205r243R272K9285J4260K0457l7695
14567b8484K920O8104M8721l0300o0884l9215j1552k6242L537M9122J7271o7506
14555g4508L1596K9022O175J9169k4352q1585N9405l605j0014N8567P3902L3934
$$ y = [-57055, -69511, -87428, -140256, -44916, 42941, 54688, -16976, -22767, -42430, -20466, -16075, -68217, -70768, -27227, 29832, 6159, 22619, -10170, -35188, 14911, 44856, -209, -69899, -109825, -81706, -77412, -91165, -117217, -153868, -169535, -202723, -256164, -233027, -180838, -131796, -108749, -83263, -60020, -55780, -43313, -109762, -95053, -117734, -82061, -93969, -80285, -41101, -59644, -33066, 45147, 26949, -21720, -85571, -90992, -28303, -16618, -11797, 19094, 32732, 62553, 34722, 33588, 25108, 40160, 31198, -19615, -54820, -64063, -54791, -25506, -11246, 9211, -28484, -25564, 42540, 91261, 60961, 77, -39138, -50690, -76932, -73395, -24273, -7002, -74508, -42912, -13890, -7715, 11454, -12898, -94483, -35078, -38683, -48697, 9870, 83772, 117706]
14543A17706K832p0159o7893k4372j7044k6022n59P6051J1662j0574K869l7073
14531d2576k7388k4039N1099Q1589j3437k9182n954j0244k5488j5865l5970k3657
14519a21112M483P9860J4177L1784k5962N3470o389n2527l8245K4091p499k9634
14507g3503K5770N7075p0380o5530j3231L9175N9569J1829O550J7996L4478j3612
14495A6186j0623J253J0153q306L4945J4835p2983n1954J0713k741k4341M5230
14483c7633J959j3777k020n276M6955L8875n651J2194M9566L2557l8124l5401
14471D4224M0377j8233j7103k6587j144l8790l9865L3278J8899P2289P0540O578
14459A44463J095p188m4171K4899J5069o235k6408q444k4734m6073l2204J1937
$$ y = [117706, 120538, 50379, -17514, -41886, -58930, -84952, -85511, -9460, 2202, -8372, -5503, -42576, -69964, -94003, -42904, 38685, 25248, -3934, -9888, -20132, -45620, -61485, -97455, -121112, -116629, -36769, -22592, 9192, -16770, 36700, 30311, -22216, -60461, -36370, -43869, -73503, -47733, 9342, -61038, -126568, -139799, -100624, -41055, -29226, -22676, -4680, 29798, 16186, 5563, 6816, 16969, 8663, 43608, 58443, -14540, -66494, -55781, -58522, -82863, -37633, -35674, -49451, -51471, -56747, -9792, 29083, 23432, 35626, 85192, 117749, 79625, 44224, 84601, 66368, 49265, 22678, 21534, -17256, -57121, -23843, -4944, 67345, 137885, 144463, 145558, 138370, 94199, 119098, 134167, 127932, 101524, 93080, 68346, 22273, -9931, 2006]
14447B006M0630q575o5646r938M0802l3363M803L2189K5772o8603M133M726n59
14434c1623j8020K5831M5974Q793k7812j440L8506N3240k2395M7270R132o6221
14422F1235m2647M9867M917p5018n4604M984n4735q152N5164M5530Q7600N2883
14410A27024m3330q1930J1513o410j2582K9338K4431J6098O422o9753n6230M6158
14398i251M6060N6003j2648l4034J3553K3017l492j6737m5331J9663P8569M0213
14386A55585j8808p1799R086j919J644o0052j4271R636k8915r508m7846k0753
14374i7920M3800L9928K855r424j6431p1997l5048L5869O0971k8596j2755k0092
14362a08840L511L4265O0541J6090L2256J8018m9650n2139L1334L2062q703K3567
$$ y = [2006, 42636, 34061, -31585, -41523, -721, -34084, -29281, 2908, 28680, -39923, -35790, -31064, -31623, -49643, -23812, 22162, 30955, 3143, 1703, 40209, 93449, 71054, 118324, 127456, 61235, 18588, 68455, 73372, -1646, -56250, -51266, -106001, -114153, -58989, -13459, 74141, 127024, 83694, 1764, 13277, 6867, -5715, 23623, 48054, 64152, 70574, 821, -55409, -9251, 36809, 92812, 80164, 46130, 59683, 82700, 79208, 62471, 17140, 36803, 115372, 155585, 136777, 64978, 74064, 72145, 73789, 13737, -534, 9102, -19813, -29321, -77167, -97920, -54120, -14192, -11337, -20761, -37192, -109189, -144237, -108368, -47397, -75993, -88748, -108840, -105329, -71064, -10523, 5567, 37823, 55841, 6191, -45948, -14614, 17448, 8745, 32312]
14350C2312m2016m9540m7541K1357K6619J5146k4949l5687K8706N0620N5375J20
14338C0522j9912j7110L4064Q2535l7740q3744n1088M429J705N108M2211M9294
14326D0274J3098k3510k6404o5405j9620O7946K1576M670j3460L0981N3042L6930
14314A20118n2536o3821j880j3898k1507K8167N1403M7547l625q7834p7777j1390
14302h7033J2573K979J4596K0906n685J6163k5256L7617o1557j626M301m201K2704
14289e3519n8768P048M937M915J4574l0570n849j9461K821N9395L1805m9119M6250
14276d5541R8315l767l6423k0173L1260n4392O381j2722J129P794l049j3048m812
14263d9048M5410L2756J4037l6721j7269m2466K2615R611n9658m54k647J3588
$$ y = [32312, -9704, -59244, -106785, -85428, -58809, -43663, -68612, -104299, -75593, -24973, 30402, 30522, 10610, -6500, 27564, 110099, 72359, -11385, -62473, -58044, -56339, -51231, -9020, 40274, 53372, 29862, 3458, -61947, -81567, -13621, 7955, 12625, -835, 30146, 83188, 120118, 67582, 3761, 1881, -12017, -33524, -5357, 46046, 93593, 89968, 2134, -75643, -87033, -74460, -71481, -56885, -35979, -41664, -25501, -50757, -13140, -74697, -76323, -72022, -76223, -53519, -112287, -105239, -100302, -95387, -80813, -111383, -117232, -136693, -133872, -74477, -42672, -91791, -45541, 52774, 49007, 12584, -7589, 23671, -30721, -24340, -37062, -35933, -28139, -31188, -44236, -49048, -3638, 29118, 43155, 6434, -10835, -53301, -30686, -21075, -80733, -81187, -83834, -70246]
14251g0246R0780O0807M0352J3651n9223k0358m5382k1724o1956n289J6184k4830
14239h7234m019P7702M5267J4400k1101n5601L151j52k3981N378k5700P2652P8396
14226G9158N0842j3849l4656p8469K0212P5892L6501K3841L2089k9689m6316o013
14214A09543l2660j4855J1966J6605K4366k0212K6458k5780J518m112k8913K4862
14202H8786N7968j0174O5924J07109Q93m2350L5066P916L6071k0732k4917r3487
14190B08073r9258k2482k2186K1437j9277j1650J3301l8961p097n6339k2949J686
14178e5702M858j8686m2932L687K0694N4026P1029l0163p2364N6621L0918K0676
14166D2662N219o5050L7836J8017m178p715j3439Q3582J8420q2012l0010K3003
$$ y = [-70246, 20534, 81341, 121693, 135344, 76121, 55763, 10381, -11343, -73299, -78588, -62404, -87234, -91253, -13551, 31716, 46116, 25015, -30586, -27435, -27587, -51568, -46190, -71890, 762, 79158, 130000, 116151, 81495, 3026, 23238, 99130, 135631, 159472, 191561, 161872, 115556, 109543, 76883, 62028, 73994, 90599, 114965, 94753, 121211, 95431, 96949, 92837, 63924, 88786, 146754, 136580, 202504, 309613, 310506, 268156, 303222, 311138, 347209, 326477, 301560, 208073, 108815, 86333, 64147, 85584, 66307, 54657, 67958, 28997, 21900, -34439, -57388, -55702, -50844, -69530, -112462, -108775, -88081, -34055, 36974, 6811, -65553, -8932, 21986, 42662, 47881, -17169, 20667, 38684, 34506, 26791, 13352, 96934, 115354, 33342, 3332, 26335]
14154B6335K1278J7371K7318O853r598K4732K3159p2099j17765k0556N5073J7402
14142d97J0829L95r541K3705K1220K4792L522k0429K3282M1805k3867m3581n7124
14129e489O656M9257j8133n5290L778k4213Q383L1425Q697p795q594M802l6376
14116d2892j7057j238m3041O3668M9746k007j6333K2324P809j5882j5296m2635
14104e2834k9310K4311J07459j6915p3305M0010K6954R087o4080l701M9385M0244
14092E7305m4690l1385K2923N1256n7831M3428o408J0113J3290o586k0368n260
14080B5787k6059j0928m9822m9940N846Q4702J9548r0199j5879N5826R5739k425
14068D2196j6086k0394l9162k3083o651M1265K4960o6793j0974O5870M0796L9363
$$ y = [26335, 47613, 64984, 92302, 99155, 89557, 114289, 137448, 65349, -52416, -72972, -17899, -497, 10332, 10727, 1186, 24891, 46111, 70903, 74425, 53996, 77278, 119083, 95216, 51635, -5489, 1167, 50424, 32291, -22999, -19221, -43434, -35051, -3626, 5071, -2724, -11318, -6516, -42892, -59949, -61187, -104228, -40560, 9186, 7179, -9154, 13170, 20979, 5097, -10199, -52834, -82144, -57833, 49626, 32711, -40594, -584, 26370, 35457, -28623, -32324, 17061, 57305, 12615, -18770, 4153, 55409, -2422, 41006, 34598, 44711, 58001, 51415, 31047, 25787, -272, -11200, -61022, -110962, -105116, -20414, -866, -91065, -106944, -51118, 44621, 42196, 26110, 5716, -33446, -56529, -63180, -21915, 3045, -63748, -74722, -8852, 31944, 71307]
14056G1307J6145j8211k7471k4545j9087O2224M3794n0978j5376l6895L155O0159
14044F4221j8841r689K3672J3917o062k6988n252m3092k5622J5565J4579P2787
14032F9195N1749m2411o2722j6751L7187L742k4890q409l9659n76N0897K2354
14020C9706j0070k210J3523K6465n5247k9709M2943P689j6328O6878J6449m0899
14008E9190q1560k0325J4410J2204m75R761l1539O1990L2925J3836J1435k009
13996G9843L5654m2194j0492k6503j7804J22752R0755m4881n979j18N268J0368
13984A96669M3975j7754k4438l581n9166m9726J3667R4739Q676J801l0070l2207
13972A42585j1561k460o0178k1956m0223k1269k1401K4311L4524k0952J1947M4422
$$ y = [71307, 87452, 69241, 41770, 17225, -1862, 60362, 104156, 53178, 37802, 907, 4062, 64221, 45380, 35691, 59363, 73280, 67218, 40230, 34978, -8114, -33736, -18171, -3592, 69195, 120944, 78533, 15811, -940, 36247, 39989, 15099, 6690, -32969, -33545, 17352, 39706, 29636, 27426, 40949, 67414, 12167, -17542, 25401, 33090, 16762, 83640, 100089, 59190, -22370, -42695, -28285, -16081, -16556, -6795, -38334, 23656, 56581, 70417, 81852, 79843, 115497, 73303, 62811, 36308, 18504, 141256, 232011, 187130, 181151, 181033, 186301, 196669, 240644, 222890, 198452, 194871, 135705, 85979, 99646, 194385, 203061, 204862, 174792, 142585, 131024, 128564, 68386, 46430, 6207, -15062, -36463, -12152, 22372, 1420, 13367, 57789]
13960E7789L2172n866k5075n0927K1168L1269R505n420r940j2361J4341o9433
13948a2778k1448L0385j1741j232Q528J8627k0816l5545r539K8177K5034l9446
13936d1794o518J0853L6804l0138o8523M4969K5422L011j5196K9358L1848M5387
13924F5483j2018l283K729l9613M043l4004o3481M900N7716K1768K5702J6941
13912D6883l4155l3352L1818J919o2397l3416P2695O8339p222m2295j6093l0527
13900c7803m6139l120K8899K7119j455K0507L394O8619K5513q8064n09K8705J611
13887B7277J9606j5684l4985p551j6051R475l5046j1367n154l376j7495k0993
13875a11344N2715L624j9219k6905k3915n498M1593O1827j200j6204m4431K7049
$$ y = [57789, 89961, 84095, 59020, 8093, 29261, 60530, 70035, 64615, 54675, 42314, 56655, -12778, -34226, -3841, -15582, -16814, -8286, 10341, -10475, -46020, -55559, -27382, -2348, -41794, -48312, -37459, -655, -30793, -99316, -54347, -28925, -25914, -41110, -11752, 20096, 65483, 53465, 50182, 52911, 13298, 17341, -16663, -80144, -75244, -17528, 4240, 29942, 46883, 12728, -20624, 11194, 13113, -49284, -82700, -10005, 58334, 51112, 8817, -7276, -37803, -83942, -87062, -58163, -31044, -32499, -11992, -8598, 60021, 85534, -2530, -3039, 25666, 27277, 46883, 31199, -3786, -11337, -27388, -17913, -52959, -64326, -69480, -72856, -90351, -111344, -58629, -55005, -74224, -101129, -125044, -130542, -88949, -27122, -28322, -44526, -88957, -61908]
13863f1908L955p1573J3368L2674K0381J3968j9651m4910l508M056N4928K8354
13851b9866m8511j7005M8366k8074M48q498m5438M2812Q5967J4265k4663l1271
13839d1468m2041l3249J0714P1220J515n183L9825J3814l8308n8755k982J4951
13827f9947o0469R541O990J1212O1108O526j1077k6216M448J2579n0614n4883
13815a60802L8156j9761L2023J1647K7536K1312M4309p3058l0019k6299K5922
13804a09034j596m7393N4649P6030J1756r1915m1041J4264J01464j2498j5474
13793f0788j4215L8334K1214k6459o7684J3607P9920L6278k1668k2311k6491q27
13781e1090J1079J3046J3641O1864L8548o262p1932j0428N7263L0619p4439q7967
$$ y = [-61908, -57953, -129526, -116158, -83484, -63103, -49135, -68786, -113696, -117204, -113148, -58220, -29866, -78377, -95382, -47016, -75090, -74642, -83140, -128578, -85766, 201, 14466, -10197, -41468, -83509, -116758, -106044, -34824, -33309, -38492, 1333, 15147, -23161, -81916, -84898, -69947, -130416, -120875, -113885, -102673, -41565, -35039, -46116, -72332, -67884, -55305, -105919, -160802, -122646, -142407, -110384, -98737, -71201, -49889, -5580, -78638, -108657, -134956, -109034, -110630, -158023, -103374, -27344, -15588, -107503, -148544, -134280, -32816, -45314, -60788, -75003, -36669, -15455, -41914, -109598, -95991, -16071, 20207, -1461, -23772, -50263, -51090, -40011, -26965, -13324, 48540, 87088, 80826, 8894, -1534, 55729, 86348, 11909, -76058]
13769g6058j2671N5511M7244n170j2730j6129l0853L6904K599j2392l7735l6085
13757i7565L4056k3308J1823L9896n953K4879K708l3506p804M6025K6920l7764
13745a9593M6946N1521l2379n3824j13151J0639k7090r857K5360N0878r300J094
13733g8756k9974j9063O3089L8884O2117K7838k6491j5415m9562p5824J7749K0150
13721f5258k6673l1945L5993p904K5555M35o4915m784J31602N1518k1898k5275
13709c549n4294l6395J4165R314J0102O4950O3240R403o2641p894M4670k2988
13697B8083l5082Q817l9749Q7170p630o0924r699r3903l1780O0298K3464J7017
13685e3918p343N414l48k3380N0338P5875n1809P112J7887j4107l7777m0113M2462
$$ y = [-76058, -88729, -33218, 14026, 8856, -3874, -20003, -50856, -13952, -11353, -23745, -61480, -97565, -63509, -86817, -74994, -35098, -41051, -16172, -13464, -46970, -54774, -8749, 18171, -19593, 27353, 78874, 46495, -7329, -120480, -109841, -136931, -146788, -121428, -70550, -79850, -78756, -108730, -127793, -64704, -25820, 36297, 64135, 37644, 22229, -27333, -103157, -85408, -65258, -91931, -123876, -87883, -95787, -70232, -69797, -134712, -139496, -7894, 43624, 21726, -3549, -57843, -94238, -80073, -70759, -60657, 4293, 67533, 76936, 14295, 6401, 51071, 28083, -6999, 1818, -37931, 49239, 41609, -19315, -29014, -122917, -154697, -94399, -70935, -53918, -61261, -55847, -56195, -79575, -29237, 46638, -5171, 1941, 19828, 5721, -32056, -72169, -29707]
13672b9707R0843k7034n7348n6979K7165K3115n9136l4846L5352M6261k8438j9387
13660i0139j2051N5296P894m944L3360K1149m0608k8446J8769l1706M305O6052
13648a069j7610m9459K4530J3371J4586M6996J4678M2343k0084k9436r670N763
13636C4939o2350o8339K499j7991k42k7682Q151J4355J3814r655O085O9362P3480
13623C6426Q630r9436l8721K5383K7408L4939N4508p9075p1453Q424J7611l133
13611g8489O7314j8222N774P2615O893l0232K1659L1496l9461k4868K3514J0669
13599D8662K685J9984k0382k619l9534N888J0619M9980k3959n7912o749m7478
13587f0815q981M0958J9286j8209l9415n154n5449p3582J6504N7891J5279M3266
$$ y = [-29707, 61136, 34102, -23246, -80225, -53060, -29945, -89081, -123927, -88575, -42314, -70752, -90139, -102190, -46894, -39000, -43944, -10584, 10565, -30043, -58489, -39720, -71426, -67121, -1069, -18679, -68138, -43608, -30237, -15651, 31345, 46023, 88366, 68282, 38846, 29176, 34939, -27411, -95750, -93251, -111242, -111484, -139166, -131015, -116660, -102846, -112501, -106416, -37054, 36426, 45056, -54380, -93101, -67718, -40310, -5371, 49137, -29938, -101391, -92967, -75356, -78489, -11175, -29397, -23623, 48992, 55885, 25653, 47312, 78808, 39347, 14479, 37993, 48662, 51347, 71331, 50949, 48330, 8796, 14684, 25303, 75283, 51324, -6588, -13337, -60815, -69796, -28838, -9552, -27761, -67176, -72330, -127779, -201361, -184857, -126966, -111687, -68421]
13575f8421M2170J5188K7776l1123j887m886M8401L088n0394l2400J6486L4641
13563a361m3953l5973j1112m3M4554N8905J8228K2315J1363m2811q0887k4411
13551h5186J4739k963k8338N5343j9973n3837K7022J5891j859O9267L0727j6795
13539D038l128p540M495K4484K0656n5115m4161P052K554j0061K0616l3222o1711
13526a31043N8454P2430j9493j7029J1567M7056j3014l2643l9663J0451L9321
13515a3606p440j0199n4046L2052p237k2050l2223L1295J1779M5793q631l2141
13503f6654K8402j0695P310J6213K6073l181J5592K4545Q152p6547l4500m7972
13491a13262j8195L8854N9445J1462K508l2548l6574K2497n239j654k7256M2795
$$ y = [-68421, -26251, -11063, 16713, -14410, -16297, -21183, 27218, 30306, -20088, -52488, -36002, -1361, -45314, -81287, -92399, -92442, -47888, 11017, 29245, 51560, 62923, 20112, -60775, -85186, -70447, -73410, -101748, -46405, -66378, -120215, -93193, -77302, -79161, -9894, 20833, 4038, 910, -6630, -2135, 22349, 43005, -12110, -56271, -49219, -46665, -56726, -36110, -69332, -131043, -72589, -159, -19652, -36681, -25114, 21942, 8928, -23715, -63378, -52927, -13606, -21046, -31245, -85291, -53239, -60476, -82526, -114749, -83454, -71675, -25882, -34513, -66654, -38252, -48947, -41637, -25424, 649, -2532, 13060, 37605, 45757, -30790, -65290, -113262, -131457, -92603, -33158, -21696, -19188, -51736, -88310, -65813, -71052, -72706, -99962, -57167]
13479e7167N3671J2781J3574k384l9373j8707q0712j4161M4242j3305M5663J3402
13467d2476K7508O9377l6785l2330N060k1265p7935K4853k1800p6106o398M9977
13455a38320P2656P1335L5089q784m1008o6893L6633J0840r6157p4844K1888N2033
13443a25532O6710N5911J2623J1479O894l4200q2048k7095J7670j2622J8782L4449
13431e6979n3906R613P7890k55m1797Q036m960p8143m4800M971M5497L4253M6132
13418e4448O2661L259L4820k1157j7010Q6974O0010P2470O720j14234Q146O2236
13406A90447r373Q7116J8005P855K3683Q534o0038j07161q9842l2968M7417K2037
13394A05712N2539N5751O4441K0585L258K3572k1460q2235n8367m0987M976J5352
$$ y = [-57167, -3496, 9285, 22859, 20475, -18898, -37605, -118317, -132478, -88236, -101541, -55878, -42476, -14968, 54409, 17624, -14706, -9646, -30911, -108846, -83993, -105793, -181899, -188297, -138320, -65664, 5671, 40760, 31976, -9032, -75925, -39292, -28452, -124609, -199453, -177565, -125532, -58822, -2911, 9712, 21191, 28085, -6115, -88163, -115258, -97588, -110210, -91428, -56979, -110885, -101272, -23382, -23637, -65434, -57398, -62358, -140501, -185301, -180330, -134833, -100580, -54448, 8213, 11472, 46292, 25135, 8125, 95099, 155109, 227579, 234299, 120065, 128211, 190447, 181074, 268190, 286195, 294050, 317733, 326267, 266229, 159068, 69226, 36258, 83675, 105712, 158251, 214002, 278443, 299028, 302286, 325858, 304398, 222163, 163796, 122809, 127785, 143137]
13382A43137J02755J01810n2287j08041q6847l1431o3753n8757M4693J0268o1404
13371e9857L9958L6690O1609P029p7486l5792l3996l7660j7684L8542J1468k7518
13359i4697j0618k6585l1402J2549N9036L8900l1775R633N8714N6657o7005m5339
13347g1932q210q3944p037R5053O8112k8241J3576j1370J2289R5559N6653j9668
13335A10840o0091k3808o693P3814N2427j3963j7194K2975L3664M0148L0235R6755
13323C39109J02787R0596K06566L44931K73763J85109J87632J56640j7820k4629
13313A844684j00466k02539k13534k22498k72523j83538j34759r7849l6150m106
13303C76722J2206o0418r6964m929m9574j109J8917j9997j2734K2414j4077k3345
$$ y = [143137, 245892, 347702, 295415, 187374, 100527, 69096, 5343, -53414, -8721, 1547, -59857, -19899, 16791, 78400, 85429, 7943, -27849, -61845, -99505, -117189, -78647, -67179, -94697, -105315, -131900, -163302, -150753, -91717, -52817, -84592, -74959, -16245, 40412, -26593, -71932, -80142, -164086, -171123, -76070, -7958, -36199, -22623, -33993, -21704, 73855, 130508, 110840, 50749, 26941, 20248, 94062, 146489, 132526, 115332, 138307, 171971, 212119, 242354, 339109, 441896, 532492, 739058, 1083989, 1357752, 1542861, 1730493, 1887133, 1869313, 1844684, 1744218, 1541679, 1328145, 1105647, 833124, 649586, 514827, 416978, 380828, 376722, 388928, 328510, 231546, 226617, 177043, 175934, 194851, 174854, 162120, 184534, 170457, 147112]
13291A47112N916n75K8312q6904j8153J7020n5790l0831N1296l9804m7857n076
13279c5334M6685Q6545K2454p836J0678k4325N6254j0811r5759K0119n1545r335
13267G790K7574J1078L9046m2483o593M4884N860m3405l4917J0028p0294n1823
13255a03255j9142l0280Q8956L1180m2744k1778O013m019J7478L2566O4188L2064
13243E1227k3766j15795J3279N7957J5302K6777O075l7593k719L9779L0224q6475
13231b5728o1952K9243K0691M342k45k1689p634j0999l2713r250K3644K9685N425
13218e7180J5236K049o4384L6389K1417j2988L6997J7892j1608p485l5747j3495
13206g2907J0092K7929p3522j5930N4326p63n807l7630R17m8093k9142r61L7032
$$ y = [147112, 153028, 152453, 180765, 93861, 75708, 92728, 36938, 6107, 57403, 17599, -30258, -35334, 11351, 97896, 120350, 112514, 123192, 98867, 155121, 144310, 48551, 68670, 17125, 7790, 35364, 46442, 85488, 43005, 36412, 81296, 87156, 43751, 8834, 18862, -51432, -103255, -122397, -152677, -63721, -32541, -75285, -97063, -91050, -95069, -77591, -45025, 19163, 51227, 27461, -88334, -75055, -17098, -1796, 24981, 31056, -6537, -9256, 30523, 60747, -25728, -87680, -58437, -37746, -33404, -33649, -55338, -62972, -73971, -106684, -115934, -92290, -62605, -57180, -41944, -39895, -104279, -67890, -46473, -59461, -22464, -4572, -16180, -23665, -59412, -72907, -62815, -34886, -108408, -124338, -70012, -70775, -76582, -114212, -113295, -161388, -190530, -191491, -154459]
13193a54459N1918M751N577P638J8649K9688j5730l1551k1138K4534o297k3398
13181a09818n3418J6789R2045L8054m7170o138J639M9841j3540j5270L552L1745
13169a1689N3325M4089j5020j5200J2632M338L1134n5057o9546l053Q0437L3421
13157H9811k1147m3411K4894j6749K4557N2295K8991l4192l1836j2881M0512L5861
13145A36705p6223l703P7628J5432n0894o3051l6715r828L383j3286L482M126
13133a2944O3276j8517k2716l7K8654j9466L9297p568O8845j6470k3584n6252
13121B2518p8717K6788Q293l4478L3922j2070K8435N3978K1245k336k3993J1089
13109E4674j9356k0913k5552n5463k8055o315P547j0385R2709J0057n4894M0767
$$ y = [-154459, -102541, -97790, -92213, -84575, -65926, -36238, -51968, -83519, -104657, -80123, -86420, -109818, -163236, -146447, -54402, -16348, -63518, -69656, -68017, -18176, -31716, -46986, -43434, -11689, 41636, 85725, 70705, 55505, 68137, 72475, 103609, 48552, -20994, -24047, 56390, 89811, 68664, 25253, 50147, 33398, 57955, 110250, 139241, 105049, 73213, 60332, 100844, 136705, 60482, 56779, 134407, 149839, 98945, 35894, -821, -10649, -7266, -20552, -17070, -12944, 50332, 31815, 9099, 9062, 37716, 18250, 57547, 49979, 118824, 102354, 78770, 22518, -56199, -29411, -21118, -55596, -21674, -33744, -5309, 48669, 69914, 67578, 43585, 54674, 35318, 14405, -11147, -66610, -94665, -100980, -93433, -103818, -11109, -1052, -55946, -15179]
13097a5179J3328N4176P6834o015l0364p3354l6104j9327k7914L5770L2552M4936
13085D9339p621K0826K0089o0384l797j9221M0099m5227k2302K5259q368k7149
13073c8457o1594M1883O9031K5992k4972l8405N4652M139N355k3723N6052L6531
13061A06484n7781k2397j5949K6975j6346L1749m659n258R6107r207m7488L5204
13049A17434L0226m3819m3779l5197L8223n574j4760m2016P194P6200O1653r3425
13037E2360j07331N5061P0553J00397L0064N3563K2525n3130j7682O356m5426
13026A67310K6266M5086J8525L2554L1979O106K9636M0663m4980o2558L3863q8721
13014B35729Q970J0562k4866p3032k2903j4325n0376p0064O6523K4067M805k2255
$$ y = [-15179, -1851, 52325, 129159, 123144, 92780, 19426, -16678, -36005, -63919, -28149, 4403, 49339, 41718, 62544, 82633, 22249, 18452, -769, 39330, -5897, -28199, -2940, -11308, -38457, -100051, -58168, 10863, 36855, 11883, -26522, 28130, 32269, 37624, 13901, 69953, 106484, 48703, 26306, 10357, 37332, 20986, 52735, 48076, 42818, 138925, 129718, 82230, 117434, 147660, 103841, 60062, 24865, 63088, 57514, 42754, 738, 7932, 84132, 145785, 52360, -54971, 90, 70643, 171040, 201104, 254667, 277192, 224062, 206380, 212736, 167310, 193576, 238662, 257187, 289741, 321720, 327826, 357462, 398125, 353145, 290587, 324450, 235729, 244699, 255261, 230395, 157363, 134460, 120135, 69759, -305, 66218, 90285, 95090, 72835]
13002G2835J2536k2278K9504J4641l8827Q289o734l7115m0831J2288N6120P1052
12990A31480k1625K1338L6808J494J1830J0911j368K8193L0985k8272r691j1348
12978B00735J2496M9389K8511M593L5930m1827N773k9089k3731l894L6726M1989
12966C17601J2156l3813M9490O7342n4009p4430O4659O5013M2431J9416P1385
12955E47241K4541J1447j1171L9929R0466P9995r315L7365J00466M5781O8157
12944A024902Q6810P0874j4351M3514J34186O9415M3161L0133K4231N2111P5318
12933A640304K4525L0444L6523J41310J41226N9050Q7436J07631K04371J97433
12923B670253K34008L14490K53785K91825L89504L69702L99460N38931O33539
$$ y = [72835, 85371, 63093, 92597, 107238, 68411, 76700, 69966, 32851, -7980, 4308, 60428, 131480, 109855, 131193, 168001, 169495, 181325, 192236, 190868, 219061, 250046, 221774, 212083, 200735, 213231, 262620, 291131, 295724, 331654, 289827, 295600, 266511, 242780, 238886, 275612, 317601, 329757, 295944, 345434, 412776, 358767, 284337, 348996, 414009, 456440, 475856, 547241, 571782, 583229, 572058, 611987, 702453, 782448, 773133, 810498, 910964, 956745, 1024902, 1111712, 1182586, 1168235, 1211749, 1345935, 1415350, 1458511, 1488644, 1512875, 1564986, 1640304, 1664829, 1695273, 1731796, 1873106, 2014332, 2073382, 2160818, 2268449, 2472820, 2670253, 2904261, 3218751, 3472536, 3764361, 4153865, 4523567, 4923027, 5461958, 6095497]
12914F095497P61645Q60188J097902J328885J628061J902670K166138K338780
12906A8179766K497409K809409L298334M018997N220271P266559J0706430J6270704
12898G0267879K5363706L8722990N2159793N6491552M7374528L1649600K4353859
12891C46383907K1445247O255892k1550643m3330722m8341834m5098310m1917720
12884A73845817l7660918l1100617k3099810j5964258j1017076p912281n960412
12877D1130445m779215m057179l536960l183807k873356k475583k198608j926347
12869A6099390j585251j295926j145307q79637n59994m28589l18122k26393j76608
12860I483563q0241k0066P0703K9240J14663M42253O66372R38099J088561J230993
$$ y = [6095497, 6857142, 7717330, 8815232, 10144117, 11772178, 13674848, 15840986, 18179766, 20677175, 23486584, 26784918, 30803915, 36024186, 43290745, 53997175, 70267879, 95631585, 134354575, 186514368, 243005920, 290380448, 322030048, 346383907, 367829154, 374085046, 352534403, 309203681, 260861847, 215763537, 173845817, 136184899, 105084282, 81984472, 66020214, 55003138, 47090857, 41130445, 36351230, 32294051, 28757091, 25573284, 22699928, 20224345, 18025737, 16099390, 14514139, 13218213, 12072906, 11193269, 10633275, 10204686, 9886564, 9660171, 9483563, 9403322, 9383256, 9453959, 9483199, 9597862, 10040115, 10706487, 11644586, 12733147, 13964140]
12850A3964140J377081J309921R14574L98952j74568p09239j223165j600520j733038
12841A2524138j767837j684636j473081j187896q49436n53476m64810l94850l26211
12832C821905k30181k33595j74368k12388j84040j49485j70722j09182r7167j40651
12822B120126j33924j27453j28970j9405Q059m5550l7249r2228k9159m7146n2667
12811A414434m6622J2277M3755M4974l1075j14519n1566l0751M9859J24265N2397
12800A467428q951K3831P9305J92515J86711J71095J28406K6423M2177m6763p9595
12789B182582j38281j20611j07491j04819k14272j17771q2723p9822K4713q025
12779A233480p876K4912R7557O7693m770J14536J98004J45478K1712M9786q5155
$$ y = [13964140, 15341221, 16651142, 17565716, 17964668, 17790100, 17080861, 15857696, 14257176, 12524138, 10756301, 9071665, 7598584, 6410688, 5561252, 5007776, 4542966, 4148116, 3821905, 3591724, 3358129, 3183761, 2971373, 2787333, 2637848, 2467126, 2357944, 2260777, 2120126, 1986202, 1858749, 1729779, 1710374, 1718433, 1672883, 1635634, 1543406, 1514247, 1467101, 1414434, 1367812, 1380089, 1423844, 1468818, 1437743, 1323224, 1271658, 1240907, 1290766, 1415031, 1467428, 1458477, 1482308, 1561613, 1754128, 1940839, 2111934, 2240340, 2266763, 2308940, 2262177, 2182582, 2044301, 1923690, 1816199, 1711380, 1497108, 1379337, 1296614, 1216792, 1241505, 1233480, 1225604, 1250516, 1348073, 1415766, 1410996, 1525532, 1723536, 1869014, 1890726, 1940512, 1855357]
12768A855357p9848k1388j08549j50820j46845r4172q7104r3011j83715j28414
12758G61491p0353j8766L7536N2430K383q0750n8513J0885N7648o751j39276m3758
12746E04206O7227L1249L3610N7783O2207j2549k03J605m8142o1442L3666o754
12734F62463k7365p4370j02687k4891M5264m894k5923l6120K4034R2752N5104
12723E83367J02527P7186K8860k4878L3421L113l1501o0037l566n676q0748p1531
12711E50537L9462J6739K3544K6897M1316k1489o8801m1771l4353m8005J6727
12700E00803j1628J474r805p2307l2361K3068Q09n8495j5914M1789J4004m0887
12688C40550K1650N8515L4880r60p0468l449N0228K7840o8173k3754r632N6883
$$ y = [1855357, 1775509, 1754121, 1645572, 1494752, 1347907, 1253735, 1166631, 1073620, 889905, 761491, 691138, 672372, 709908, 762338, 764721, 683971, 625458, 636343, 693991, 687240, 547964, 504206, 571433, 602682, 636292, 694075, 756282, 743733, 743530, 745135, 696993, 635551, 669217, 662463, 635098, 560728, 458041, 433150, 478414, 473520, 447597, 411477, 435511, 528263, 583367, 685894, 763080, 791940, 767062, 800483, 803596, 772095, 712058, 708492, 702816, 622068, 550537, 589999, 606738, 630282, 657179, 698495, 677006, 608205, 566434, 532081, 484076, 500803, 489175, 490649, 480844, 408537, 376176, 399244, 400053, 341558, 325644, 367433, 381437, 340550, 362200, 420715, 455595, 454635, 384167, 380718, 430946, 458786, 390613, 366859, 357227, 414110]
12676D14110J2439k9389q8372o3317k7341J1602N6355L8909J6989K1901m0243
12665C23643m9603j7027R74j441R172K7298J9466Q775o2977q3309n5505O4976
12653A84442K7096m1929K5651l5065J3636K1644n6896J0318M6271L688j5806j8772
12641A64278O129L2281k4282o4982O1480O8755M2038j3477J2752n4265J345k8109
12629B03943r696K380K8027q661l3719j229n7604j2012J01852J3109n3090k3642
12617A49658K1196P5951J23332p627q1603o3640k9481k529M9428K9520k4613L7196
12605B76788P365m883N2209M7644k3633n5096l4625J6983M8802p723j8468j6720
12593B88643p547m0176M177K2660n3984K173J0141L1531l6671o192L506k9356
$$ y = [414110, 426549, 397160, 308788, 245471, 218130, 229732, 286087, 324996, 341985, 363886, 323643, 274040, 257013, 257987, 256546, 265718, 293016, 312482, 321257, 258280, 174971, 119466, 184442, 211538, 169609, 195260, 160195, 173831, 195475, 138579, 148897, 195168, 198856, 183050, 164278, 170407, 202688, 178406, 113424, 174904, 243659, 285697, 272220, 284972, 230707, 232052, 203943, 194247, 196627, 224654, 215993, 182274, 181045, 123441, 111429, 213281, 226390, 173300, 149658, 170854, 246805, 370137, 362510, 280907, 217267, 187786, 185257, 234685, 264205, 239592, 276788, 284153, 279270, 331479, 379123, 355490, 300394, 265769, 282752, 331554, 323831, 305363, 288643, 281096, 240920, 245097, 267757, 213773, 215946, 226087, 257618, 220947, 214755, 218261, 188905]
12581A88905M560l8392k8776J4091j7763j8606j1076K7069n1623k0061J9445L7138
12569A04911j6844m3990L1994j9110m7292L0151M7533m6539k3324K8673m3167
12558B996N1452K1521K4448R946R25j8582J4832N0080k6153l8241R8148Q161J1747
12545B11280N429K4619J6909l549o0668n4564n2638M8574K9987j0083Q6870M8174
12533B90340k5995J2628l5330k3270P0585J2138k8951p3033p8152m1172L9376
12522A19164j292k8583p4200n9388P2458P3789J5090M2994l4565o9639k4754j2219
12510A8855N5020O7865j7785n3882l3368J6981K2465K5303J25833J51666J23398
12499E02351J8384n5173j18852r4331k0039K929l2343j1150Q576R650k1628k3598
$$ y = [188905, 193465, 155073, 126297, 140388, 122625, 104019, 92943, 120012, 68389, 48328, 67773, 104911, 88067, 44077, 76071, 56961, 9669, 39820, 87353, 40814, 17490, 46163, 2996, 54448, 75969, 100417, 110363, 111288, 92706, 107538, 157618, 131465, 93224, 191372, 199533, 211280, 216709, 241328, 258237, 254688, 194020, 139456, 86818, 135392, 165379, 155296, 242166, 290340, 264345, 276973, 241643, 218373, 288958, 301096, 272145, 199112, 120960, 79788, 119164, 117872, 89289, 15089, -44299, 28159, 101948, 117038, 160032, 125467, 55828, 31074, 18855, 73875, 141740, 123955, 70073, 36705, 53686, 76151, 101454, 227287, 378953, 502351, 520735, 465562, 346710, 252379, 232340, 235269, 202926, 191776, 200352, 210002, 188374, 164776]
12487A64776j1146j0327K363m2758j3081O5015O3726k2529j09664n5552M5552
12476G6375L9449R5695L3411l907k691K8024Q6267N8183J06911J74498K74463
12465I66678K72916K52494K22214J32433J49910J22747k9235j17881j73815j72399
12455A626062j26737j83697k78764k23579k09366l6936q7759n2939j8162p1577
12445C36546j01107r050l0760j5919k1256L5893o386l3788L9052K2162k6437o7773
12433A21177l4766O1777K8147j7832j4362q929r0432j0604P1922Q6512P5376k459
12421B65527m5618l4324l3579Q026N5873K1723o981l8627l7933K05O4206J0404
12409B28902j5616m3155J5082j1250k8046l2377k5057J5340J9397j3832o846J5275
$$ y = [164776, 153630, 143303, 145666, 102908, 89827, 154842, 218568, 196039, 86375, 30823, 76375, 115824, 211519, 244930, 241023, 238332, 266356, 352623, 410806, 517717, 692215, 966678, 1239594, 1492088, 1714302, 1846735, 1996645, 2119392, 2090157, 1972276, 1798461, 1626062, 1499325, 1315628, 1036864, 813285, 603919, 566983, 479224, 426285, 408123, 336546, 235439, 226389, 195629, 179710, 158454, 194347, 187961, 154173, 193225, 215387, 188950, 121177, 86411, 148188, 176335, 158503, 144141, 135212, 44780, 34176, 106098, 192610, 267986, 265527, 219909, 185585, 152006, 160032, 215905, 237628, 230647, 192020, 154087, 154292, 218498, 228902, 213286, 170131, 185213, 173963, 145917, 113540, 88483, 103823, 123220, 109388, 102542, 117817]
12397A17817k6433m7100k0133m7147N1315J14166K5854j23417l9572J510N2712
12386E9572K6524L4466q632l0283k412K5870K3747J6265J6307j7700n228k7460
12374A11036j2694L43m0298k8050K4452M2581l0213K1560M1m0159q3931q757P5143
12361C1054N1158l955J6996L4164j3327p1659k9672K1640j5861J1961l3208l4865
12349c5574L7423L7587o594K3007M7028J967k7279j2672o5205l6535O9793L5680
12337F8626N8758P925o166k9592J911m214J0560n6134k9802L5623m0729N9635
12325G6401K3804j8336l0127k2752k7926O2435M6643l9853l6852L7094J13266
12314A83797j9482l1926O473O701M2336M005j4854o1897j6653q617M4815L0676
$$ y = [117817, 91384, 44284, 24151, -22996, 28319, 142485, 168339, 44922, 5350, 6860, 59572, 86096, 120562, 111930, 81647, 79235, 105105, 128852, 145117, 161424, 143724, 138496, 111036, 98342, 98685, 58387, 30337, 54789, 97370, 67157, 88717, 88758, 48599, -35332, -44089, 31054, 82212, 78257, 95253, 129417, 116090, 44431, 14759, 36399, 20538, 32499, -709, -35574, 1849, 39436, 32842, 55849, 102877, 104844, 77565, 64893, -312, -36847, 32946, 68626, 127384, 135309, 129143, 99551, 101462, 97248, 107808, 51674, 21872, 57495, 16766, 76401, 100205, 81869, 51742, 28990, 1064, 63499, 110142, 70289, 33437, 70531, 183797, 164315, 132389, 138862, 145563, 187899, 191904, 177050, 115153, 98500, 89883, 134698, 165374]
12302A65374j6096n7818l070j2284j2829N4426N4891M419N0643k5220n9876l2627
12290A09933K5678J8963j7543l0781r692N7672o025j4072J4084K1007j3748K3808
12278A79284l8689j2060L3092L2939j3842j060q321r231N367o4624N762O9539
12266A78156Q571l2043l5426m866M7994j061N662O0265J6214O6802J651N0945
12254C62864Q5767M7738P3927R1438N5758P9322m7805j03291p4453l2276j32905
12243D06084j50177p0345j4949l0300J2251M2039K9836N9320K2061l9553M2892
12232C09159J5726n9176l01j8700L4282J02138j0772k0244L9786J8668K4027J19228
12220E53821N6374L5775N128N7939Q0669R5735J32962O5468o859m6941r0137n4615
$$ y = [165374, 149278, 91460, 88390, 76106, 63277, 117703, 172594, 177013, 227656, 202436, 142560, 109933, 135611, 154574, 137031, 106250, 96558, 154230, 148205, 134133, 148217, 169224, 155476, 179284, 140595, 128535, 161627, 194566, 180724, 179664, 171343, 162112, 167479, 102855, 108617, 178156, 186727, 154684, 119258, 114392, 162386, 161325, 166987, 227252, 243466, 310268, 311919, 362864, 448631, 496369, 570296, 661734, 717492, 796814, 749009, 645718, 571265, 538989, 406084, 255907, 185562, 170613, 140313, 152564, 194603, 224439, 283759, 305820, 266267, 309159, 324885, 265709, 265408, 246708, 280990, 383128, 372356, 352112, 391898, 410566, 434593, 553821, 610195, 645970, 651098, 709037, 789706, 885441, 1018403, 1083871, 1077012, 1030071, 939934, 885319]
12208H85319p0495j17304n4033j4151J9885n2300r9660J9392k2122j2236q2742
12197C99553k1685j4924j2328l4882r6041O419M2849L5204l2047M804R579j1043
12185B75458J00157M470K704M612n661P6718Q8996Q4629J05480L4760j3635m6652
12173G12036k4624N337o1109j22821q3838J5991p3862p1082j0585o1609k0923
12162B02911l1256p94l0835K7477J4924k8237J733k6616J3435M122P457p6613
12150G7708m134O0403R163j9752n259M4414N6064P264n1963o0659m6447o3280
12138C522k3077O2112L6202L5246l8538p3760L335P3667O7643l6933q2676J2859
12126C9602l9839J2194R0254J3299L413L7730L38L131m1577o9752K5809n1243
$$ y = [885319, 814824, 697520, 643487, 629336, 649221, 596921, 497261, 516653, 494531, 482295, 399553, 377868, 362944, 350616, 315734, 219693, 226112, 268961, 304165, 272118, 276922, 286501, 275458, 375615, 380085, 382789, 387401, 381740, 458458, 547454, 632083, 737563, 772323, 758688, 712036, 687412, 692749, 631640, 508819, 424981, 440972, 367110, 296028, 285443, 223834, 202911, 171655, 170861, 140026, 167503, 182427, 154190, 155923, 129307, 142742, 146864, 154321, 77708, 73574, 133977, 143140, 123388, 118129, 162543, 218607, 225871, 173908, 113249, 66802, 3522, -19555, 42557, 78759, 114005, 75467, 1707, 5042, 78709, 146352, 109419, 26743, 39602, -237, 11957, 102211, 115510, 118923, 156653, 156991, 160122, 118545, 48793, 74602, 23359]
12114B3359L4321M8351k5630j6058l1370m6432L7984R0536L2291K1701p3130k1044
12102G4879n072l4530j7454J1808k019P4806L8950k3586q840M331j6424o4970
12090C1879p2667K2245J9711K9734N1593k0772L6409j723K5916L6456J7471q147
12078A68105p3845m996l687k7530n6616p0653N8710N9008m7134n3219K0990L5047
12066D180o852M5682L8427l481l7791r832L6609j5161L5541l9515j7521L0369
12054F0655j4027l4627J1804k6774q939P3932M7848r9696k7222P5630L06J0566
12042F9456l9021J7010J5845j5072J9796N8782K547O320n7605o3395J6707Q922
12030D0292J4462j8709L5775N1603j9576M4556k7429r048L964r1470j3351N013
$$ y = [23359, 57680, 106031, 80401, 64343, 32973, -13459, 24525, 115061, 147352, 169053, 95923, 74879, 69807, 35277, 17823, 29631, 27612, 102418, 141368, 117782, 108942, 113273, 96849, 31879, -40788, -18543, 1168, 30902, 82495, 61723, 98132, 96409, 122325, 158781, 176252, 168105, 94260, 89264, 85577, 58047, 1431, -69222, -10512, 48496, 1362, -51857, -30867, 4180, -2672, 43010, 81437, 77956, 40165, 30333, 66942, 51781, 87322, 47807, 30286, 60655, 46628, 12001, 23805, -2969, -11908, 62024, 109872, 10176, -17046, 58584, 58890, 69456, 30435, 47445, 63290, 48218, 68014, 126796, 129343, 135663, 78058, 14663, 31370, 40292, 54754, 36045, 71820, 123423, 103847, 148403, 120974, 111926, 115890, 24420, 11069, 16082]
12018A6082j5901L7862L6778j7944j1200K1493l1428l214k4376K6933J9244q703
12006D5626N70J19r042N0029k6413l0790P226N1584J3047P462l685q0143m4949
11993a9359O701j008M542K4792n608n791r2650m6240j4073L8697Q4070J0723l5204
11980e0408J264l479n242k4397L0722M6014L9596M421j9712l2298j961N022K0191
11967I733L944M2029M587m1218j2248j9615J9131R320k8907k5782L2218J5441
11955H633m5417l3158m604j6345J5011O0388R1295K1479J2901j9588l3352j9871
11943C7372J7704j017M744k5851k2055m4301K5812l7310j5730M9525K8477j6930
11931D40m0722L7267J2707K5091L4845K5110r4781Q972R1713P687L0497n930m4703
$$ y = [16082, 181, 38043, 74821, 56877, 45677, 67170, 35742, 32528, 8152, 35085, 54329, 45626, 46196, 46315, 37273, 87302, 60889, 30099, 37325, 88909, 101956, 109418, 105733, 25590, -19359, -12658, -13666, -9124, 15668, 10060, 4269, -88381, -134621, -148694, -109997, -25927, -15204, -50408, -49144, -52623, -57865, -82262, -51540, -5526, 34070, 38491, 18779, -13519, -15480, -10458, 9733, 13677, 55706, 60293, 19075, 6827, -12788, 6343, 15663, -13244, -39026, -6808, 8633, -36784, -69942, -74546, -90891, -75880, -15492, 75803, 97282, 110183, 90595, 57243, 37372, 55076, 54059, 58803, 32952, 10897, -33404, -7592, -44902, -60632, -11107, 17370, 440, -40282, -3015, 9692, 34783, 69628, 94738, -43, 8929, 100642, 108329, 138826, 132896, 88193]
11918H8193k1814o4473P259j3539m8744j7663L0793L7666P42o362l862L3142J4594
11905C5932l1682k2056r387k3686J5464L4334k9292K3128M543l4199p7693k4842
11893a39436N8902P6589N2834K3738l5612o2376m0448N0929J25179L9765k3842
11882A26222k7587j4611j079l9605m2693O824J6582k0068l6740J5588L0229p986
11870E076j3895l9252L9131k0130L3605O848j4888p486M0010J2454l9864m3688
11858d2079l8297K7844j6063K4184N6230K1371K7853K5246M036k1531r193L768
11846F3369L705J4935n4193m1235K7670k7197j0403J4668J9937M0167k022k2305
11834B7096Q093j7261K6646Q0624L5880k5091k9625k8368k2277k5439j6128j0922
$$ y = [88193, 66379, 1906, 9165, -4374, -53118, -70781, -39988, -2322, -1580, -7942, -11804, 21338, 35932, 4250, -17806, -27193, -50879, -35415, -1081, -30373, -7245, -2702, -36901, -114594, -139436, -80534, -3945, 48889, 72627, 37015, -25361, -65809, -14880, 110299, 150064, 126222, 98635, 84024, 82945, 43340, 647, 7471, 24053, 3985, -32755, -17167, 13062, 5076, -8819, -48071, -8940, -29070, 4535, 11383, -3505, -10991, 29019, 41473, 1609, -42079, -80376, -52532, -68595, -44411, 11819, 33190, 61043, 86289, 90325, 68794, 59601, 63369, 67074, 82009, 27816, -13419, 14251, -12946, -23349, -8681, 11256, 51423, 49401, 27096, 35189, 17928, 44574, 125198, 161078, 135987, 106362, 77994, 55717, 30278, 14150, 3228]
11822C228P80K9900k93M766o6008O950O0613K2424K0467k1399l0084j2771r55
11809A7618j186J8263N883n418k9242k2364m5118m491J0456L9574L4186M3814
11797F1975q2019j06305l0947M988o81q658N3051M4049P0363j0837m2389o2380
11785a09790K8431K0245M976L2760j42J4901O280l4808L5402L3453P145k844l2780
11772C229n267l3746k6306K1241J2120l1309k3594O8491Q5341r9908J05O2264
11760C2661Q49k6978N2615k2606r1249R86k2682J4472K7090L7733J9679j0919
11748A1651m1565K5205o663m47M7288P64k3722l1963k2411N2561L21p5569m776
11735f9326K4337J2562K2135q211M4808K3516k9749J2351K9155m717j8648K7569
$$ y = [3228, 4008, 33908, 33615, 38381, -27627, -20677, 39936, 62360, 82827, 61428, 31344, 18573, 17618, 16432, 34695, 40578, 35160, 5918, -16446, -61564, -66055, -55599, -16025, 18161, 61975, -20044, -126349, -157296, -152308, -152989, -161647, -108596, -64547, 5816, -5021, -47410, -109790, -81359, -61114, -56138, -23378, -23520, -8619, -2339, -37147, -1745, 31708, 38853, 36009, 3229, -2038, -35784, -62090, -40849, -28729, -60038, -83632, -15141, 70200, -29708, -29603, 32661, 33510, 6532, 59147, 36541, -54708, -53722, -76404, -61932, -34842, 2891, 22570, 11651, -29914, -4709, -11372, -11819, 35469, 36233, 12511, -19452, -41863, 10698, 11019, -64550, -69326, -44989, -32427, -10292, -18503, 26305, 49821, 20072, 32423, 61578, 56861, 38213, 65782]
11723F5782J835o2335L4983K1868k5607j6329L819j00135p274M3602O8586m283
11711B4512n1074Q674L7883Q930M077j507J1694K3735o267O1751L4392o0587n8483
11698C7730o8991K9108M6725m7707k2982k5175k675k3830p576j4776j0268L6508
11686g3909O325l0686j1116R453K9787N1721L2495O3937J3074j08m4204n213j8172
11673B3384K120j542j5371J0144J3537L8072N1606L330m3201q5130n4335j5435
11661g2821k0431m9431N5130K6610M802L6184P0296K7330o6663L7360K823L196
11649E4385j0574n2174K40K3651M998J1781l2847l2416N2148J6860k5189J328
11637A2191K0877l475J2791q337O306L5852k7204l0768L988K5424o873l0501p8776
$$ y = [65782, 67617, 5282, 40265, 62133, 36526, 20197, 24016, -76119, -83393, -39791, 28795, 24512, -26562, -17888, 19995, 28925, 33002, 31495, 43189, 66924, 60657, 122408, 156800, 96213, 37730, -31261, -2153, 44572, -3135, -26117, -51292, -53967, -77797, -85373, -100149, -110417, -73909, -67584, -98270, -109386, -99933, -70146, -18425, 14070, 78007, 91081, 90973, 46769, 41556, 23384, 25504, 23962, 8591, 18735, 32272, 70344, 121950, 125280, 82079, -3051, -57386, -72821, -93252, -142683, -87553, -60943, -56141, -19957, 50339, 77669, 11006, 48366, 51189, 54385, 43811, -8363, -8123, 15528, 20526, 32307, -540, -32956, 19192, 36052, 10863, 12191, 33068, 29593, 42384, 34047, 40353, 76205, 49001, 18233, 22221, 47645, 40772, 10271, -68505]
11624f8505M9099J3898n9855k9084Q751O9272P222L3566J8376K4600j2495l6325
11612A8520L8273J8997L5643L3831m5884n1213m9619k2136L999r754K1429K9970
11600B2056l4509p3970J5194P0956N0203j7172K3269l814j5990M9284l6902N210
11588E3815N9309K3013m3993L5431J2891m0934p5933J7003K0305k6361n8579k2649
11576d6682L9921L1129P8N3069N1695K5100j3945l5699K9461M4221J7696l3965
11564A62079n4468j1245L2608l720m4629j5450j9826J6600j2193n212L1191M4182
11552A19917J4575o4912l9635Q8978L5267n3154l5322k7257j9143l232K0556j4661
11540B1977m820k6453j8867k3182J3665n0356k4053P4947K3688j9423j3501l938
$$ y = [-68505, -19406, -5508, -65363, -94447, -85696, -16424, -9202, 24364, 42740, 67340, 54845, 18520, 56793, 75790, 111433, 145264, 99380, 48167, -1452, -23588, -19589, -29343, -7914, 22056, -12453, -86423, -71229, -273, 49930, 32758, 56027, 52213, 36223, 85507, 48605, 53815, 113124, 136137, 92144, 127575, 140466, 99532, 23599, 40602, 60907, 34546, -24033, -46682, -6761, 24368, 24446, 77515, 129210, 154310, 140365, 104666, 134127, 178348, 196044, 162079, 107611, 96366, 128974, 125254, 80625, 65175, 45349, 61949, 49756, 44544, 75735, 119917, 134492, 69580, 29945, 118923, 154190, 101036, 65714, 38457, 19314, 16082, 36638, 21977, 17157, -9296, -28163, -51345, -37680, -88036, -112089, -37142, -13454, -32877, -46378, -50316]
11528e0316K526r652O2967L7286k454m0367J5348j0528J2753K6031J1676q43o0450
11515f023P251L3148n884J4857O53J2416k5131N2737M94j6832j855m0246k4092
11502A493m5860L1254N49K9099N7883j7203n446m5115l7140N1294M2084m41l2767
11489B9684j01994K2980P7121K9394o5535R8j527M452K4823J4539l3959K0972
11477B1048k0624N2435L3476j7925m0545J7995j4100o9668N1314M4243J9280k1220
11465E5709J3099m478l1067J6129j5386J4529P6060l1887N818l7108l6583k021
11453B2814k2589l9375N1938L9306m2239l5843N3860J407k7723J0101N4800r119
11441E7338j7967k533j6471N4218K0853l4865N5241k461m6563P068J3000n8542
$$ y = [-50316, -47790, -57442, 5525, 42811, 40357, -10, 15338, 4810, 17563, 43594, 55270, 54427, -6023, 1228, 34376, 28492, 43349, 44002, 56418, 31287, 84024, 84518, 67686, 65831, 25585, 1493, -44367, -13113, -12564, 16535, 74418, 57215, 51769, 6654, -30486, 20808, 62892, 62451, 29684, -72310, -49330, 27791, 57185, -8350, -8252, -9779, -5327, 19496, 34035, 76, 21048, 424, 52859, 86335, 68410, 27865, 45860, 31760, -37908, 13406, 57649, 76929, 55709, 68808, 64330, 33263, 49392, 34006, 48535, 124595, 92708, 98526, 61418, 24835, 22814, 225, -39150, 12788, 52094, 9855, -25988, 27872, 29279, 1556, 11657, 66457, 57338, 39371, 36838, 20367, 74585, 95438, 60573, 115814, 113353, 66790, 73858, 86858, 28316]
11429B8316l8015L267j3566L5765L0782R465L4570l1338m4643k8891j4933j5269
11417d4490J7264k5639K6038P0854Q271K1283o8998m9034M139L8719N9708N8889
11405A17004n4844m5150O3424j9006k967l9144l5645L2555L9274k6898l0098L3818
11393C2323M2577j0694J5184N2437L761r2576q1545J651P3064N6623R988n0522
11381E2271l2110J6578L1150m4081m2592L105L5713q293L9488R320m1062n778
11369A3709l7783j1091m0346R1675N9404J9159l2477k0346Q413N388R483k1554
11357D3634l7328K4245N3394L3496n0587l3969l1364J9684K5707M4136J4545k0005
11345H5588O501n2097q1706L7100P7242k4650l8095j8607J3090M4691K0080k7719
$$ y = [28316, -9699, -6432, -19998, 15767, 46549, 56014, 90584, 59246, 14603, -14288, -29221, -44490, -27226, -52865, -26827, 44027, 52298, 73581, 4583, -44451, -40312, -1593, 58115, 117004, 62160, 17010, 80434, 61428, 58461, 19317, -16328, 16227, 55501, 28603, -1495, 32323, 74900, 64206, 79390, 131827, 135588, 43012, -38533, -36882, 36182, 92805, 102793, 52271, 20161, 36739, 67889, 23808, -18784, -15679, 20034, 11741, 51229, 60549, 19487, 13709, -24074, -35165, -75511, 16164, 75568, 94727, 62250, 41904, 50317, 55705, 65188, 43634, 6306, 30551, 83945, 117441, 66854, 32885, 1521, 21205, 46912, 91048, 105593, 85588, 92089, 39992, -41714, -4614, 72628, 47978, 9883, -8724, 4366, 49057, 69137, 41418]
11333D1418N238L9802k8934j58109j5858Q6068J8297l3700j5593M6717k8505l609
11321d6768O6598N1480N713k8256j4369O9149k6148p3031K2970r577N496L1954
11309E5211K3000O195m5211J2149j6459o941p389n9526j9274k0746m7411j3588
11297a39990P0475Q4466L9675k2089k5591J3241K4839o0721j5363p158O470k8401
11285f0147M9218K7980k8347L7117J6523j9688m0563j5902l736N1561N2326m457
11273F1885l7735n1149j0352L5021K9544L2068K373J8714p3594l9059L4126L6634
11261C8476l8k1367l6557o0172L664L6498K2235Q3715k1605n3624N3278L5119
11249G9622J8777O776l6493n4556o4670j1380N2416L2772M8470J9160K8627l6016
$$ y = [41418, 46656, 86458, 57524, -100585, -116443, -30375, -12078, -45778, -61371, -14654, -43159, -46768, 19830, 71310, 77023, 48767, 34398, 103547, 77399, 4368, 27338, 17761, 23257, 55211, 78211, 84406, 39195, 51344, 34885, 27944, 20555, -38971, -58245, -78991, -126402, -139990, -69515, 14951, 54626, 32537, 6946, 20187, 45026, -15695, -31058, -38216, -31746, -60147, -10929, 17051, -11296, 25821, 42344, 22656, -17907, -33809, -37545, 14016, 66342, 61885, 24150, -26999, -37351, -2330, 27214, 59282, 61655, 80369, 6775, -32284, 1842, 38476, 38438, 17071, -19486, -79658, -75994, -39496, -17261, 66454, 44849, -8775, 44503, 79622, 98399, 105175, 68682, 14126, -50544, -61924, -9508, 23264, 71734, 90894, 119521, 83505]
11237H3505K6599L7425k1922k1711l1827l5829l4459m2357o423k8678k7948J4044
11225h9581N1595L0339M002K2534k7866j4382j9852p4350j9404Q5760M3587J347
11213f271l695l4051m7763j5601J0686P8797N4027j8056l1030O190J2054K499
11201G786k7774k0807L8484N2907J0521J6423j3540p3091K5725q2990P161J7873
11189d1322j5352p849N3391K0714j3347K2134l9851o457k6862K0587M9199K515
11177A7500L7383m532n3836m235j0900N4055L0841J9249l6085l5950j4806m7419
11165d8735L5847M2552k4524P4531J5175m5609l8161l6271n2818p033L944L3023
11153d8079L8050Q005m0489l7806M7515K0376J6610k6966N016L32L5836K5946
$$ y = [83505, 110104, 147529, 125607, 103896, 72069, 36240, 1781, -40576, -46999, -75677, -103625, -89581, -37986, -7647, -3645, 18889, -8977, -23359, -43211, -117561, -136965, -51205, -7618, -6271, -9966, -44017, -91780, -107381, -96695, -17898, 36129, 18073, -12957, -6767, 5287, 7786, -19988, -40795, -2311, 50596, 61117, 77540, 64000, -9091, 16634, -66356, -59195, -41322, -56674, -64523, -11132, 9582, -3765, 18369, -21482, -27939, -54801, -34214, 14985, 17500, 54883, 50351, -3485, -7720, -18620, 35435, 66276, 85525, 49440, 13490, -1316, -48735, -12888, 29664, 5140, 79671, 94846, 49237, 11076, -25195, -78013, -85046, -81102, -48079, -10029, -2024, -42513, -80319, -32804, -12428, 4182, -22784, -17768, -17436, 18400, 44346]
11141D4346M4546M3178L1977J1154j8822p1524m7535k5654m2844l5568L9466L0187
11129B907J0446l1386L1230M9879o506r376j2554K2103L6845K9956m146N8321
11117A77719o8793q6485o871J5662J6889O2046K5095l3314l0854l0787p786l6446
11105c925O3347J6243N5937K451j0769K3017P8103j6722N9596O4927k3235K9510
11093C38480K4675n1290K4858M8782p842L9594J825r4827o5540r5986q1505k1785
11081E9439P4055R57l584k4689L1847l580l5526N7786o2819L9497M7192N7024
11069B37599P297j1892O658J3672M9439J51724J70218J79307R7198M8548O6641
11058A016409j1028j759Q6585M2483o0741j55085j06551o8359L7099N3254n2297
$$ y = [44346, 88892, 132070, 164047, 175201, 156379, 84855, 37320, 11666, -31178, -66746, -27280, 2907, 13353, -18033, 13197, 63076, 56570, 47194, 34640, 56743, 93588, 123544, 119398, 177719, 108926, 22441, 15570, 31232, 48121, 110167, 135262, 101948, 71094, 40307, 32521, -3925, 59422, 75665, 131602, 134053, 123284, 146301, 224404, 207682, 267278, 332205, 308970, 338480, 363155, 311865, 336723, 385505, 377663, 417257, 419082, 324255, 258715, 162729, 81224, 59439, 133494, 134451, 130867, 106178, 138025, 134445, 98919, 156705, 93886, 133383, 180575, 237599, 244896, 233004, 239662, 253334, 302773, 454497, 624715, 804022, 901220, 949768, 1016409, 1005381, 1003622, 1090207, 1132690, 1071949, 916864, 810313, 741954, 779053, 832307, 780010]
11047G80010o824q0706q4542q6006l4528m5266p9019j47479l6623N7096k1452
11036B14661l4527l6262J049N8436L4557l5997n7143R227L6996N6233Q3578R3467
11024D24275Q1464J69691J79041J68244J36870M8028O16j8144m8688k13995k20373
11013G07029k02368j87641r4472n0134l8007K092J776M8920M7924k223m4359k2716
11001A65821M2691O3424M5140r2977j50565o7160J262K7065O7962M2673l4452
10990A10884k0119K0585J0013n087R352K9544O316n7123N6392K9578k2229o1088
10978A07018k8039K2773M0977l0829l1017m5122L6546J6907p214L9305j6321n3418
10966E1566k7989J3841j909k2730p5831J076N4232N3233L0337N4234l0528l0776
$$ y = [780010, 773186, 692480, 607938, 521932, 487404, 442138, 363119, 215640, 179017, 236113, 214661, 180134, 143872, 144921, 203357, 237914, 201917, 144774, 154001, 190997, 247230, 330808, 424275, 505739, 675430, 854471, 1022715, 1159585, 1207613, 1208229, 1190085, 1141397, 927402, 707029, 504661, 317020, 222548, 172414, 134407, 136499, 138275, 187195, 235119, 232896, 188537, 165821, 208512, 271936, 317076, 224099, 73534, 6374, 7636, 34701, 102663, 145336, 110884, 90765, 111350, 121363, 116276, 125628, 155172, 161488, 104365, 160757, 190335, 168106, 107018, 78979, 101752, 142729, 111900, 80883, 35761, 72307, 89214, 82000, 121305, 104984, 51566, 23577, 37418, 35509, 12779, -63052, -61976, -7744, 45489, 75826, 130060, 99532, 68756]
10954F8756M4696k187k8939l0953o84N9558M8725K0330l9209K4840m9700q0870
10942C4363M2100R848p096l9793m0275L4722K7209O2175M7826L0486l0276p8466
10930I2823o5155m1177L6086O6054L1327n735K4999O2457N9082p0214m5803q16
10918A43928l7304p052L2339n3019n5183j7518k3401k8919M9176O6595k8492l4672
10906F478m8742K8556N2364j0629K862K2288K756o0577j1379K1934L1732L3256
10894G0899N1697J6985J0370R230k580M5188J07313J48476J80025J93271J89642
10883A020516P7491L8896O9574P6892l4316j92657k32091j97830j96105m1849
10873C88521q2036r5144L0767N2542l2661m3551o1125m2322j7413M37L3768N7368
$$ y = [68756, 113452, 111265, 82326, 51373, 50689, 110247, 158972, 179302, 140093, 164933, 115233, 34363, 76463, 86311, 79215, 39422, -853, 33869, 61078, 123253, 171079, 201565, 171289, 92823, 27668, -13509, 22577, 88631, 119958, 114223, 139222, 201679, 260761, 190547, 144744, 143928, 106624, 99572, 131911, 78892, 23709, 6191, -17210, -46129, 3047, 69642, 41150, 6478, -42264, -13708, 38656, 28027, 30889, 53177, 55933, -4644, -16023, 5911, 37643, 70899, 122596, 139581, 149951, 159181, 156601, 201789, 309102, 457578, 637603, 830874, 1020516, 1098007, 1136903, 1206477, 1283369, 1249053, 1056396, 824305, 626475, 430370, 388521, 306485, 211341, 242108, 294650, 261989, 218438, 157313, 114991, 97578, 98015, 131783, 189151]
10861A89151M1850Q5882k1949J8312P9186K1225j463L3465M8340P0929J21115
10850F86043K4090K9835K0943R5228J12342R2005M7870k2118l7723m2308l2275
10839I73932l6791j01710j28372j17176j15014m9975n6807j28286l9857k2953
10829A76991l4214k5429M0292J3467p8368j3147M7361l7107o004K4312Q959j0428
10817A06685L6634N5241J3762r6R0798P1756l949n0993o7403r368Q466N9863K810
10804C14206m6473o9583n8527n700j1801l9930m468j5388j5911m7177j8491k4474
10792d3717K7654K9379L1325k4398k7110M1293K4651k4231K1859N616m5948k1531
10780e158M6525j0255K473K3548L4334N683m4351N3674m610k0154n924J3874l5044
$$ y = [189151, 231001, 316883, 294934, 313246, 392432, 413657, 412194, 445659, 493999, 564928, 686043, 710133, 739968, 760911, 856139, 968481, 1060486, 1108356, 1086238, 1048515, 1006207, 973932, 937141, 835431, 707059, 589883, 474869, 424894, 368087, 239801, 199944, 176991, 142777, 117348, 157640, 171107, 92739, 79592, 126953, 89846, 83842, 108154, 117113, 106685, 143319, 198560, 212322, 212226, 303024, 374780, 370831, 319838, 252435, 243067, 251533, 311396, 314206, 267733, 198150, 139623, 133923, 122122, 82192, 77724, 62336, 46425, -752, -19243, -43717, -16063, 13316, 44641, 20243, -6867, 34426, 59077, 34846, 56705, 62321, 16373, -5158, 41367, 31112, 33585, 57133, 91467, 97150, 52799, 106473, 101863, 81709, 75785, 89659, 54615]
10767E4615l3441J3300J7487P854k8295M2870L6261j27763k8520M6375L2215N1030
10755H3988j4728l3230R785k7259n9182l7971P783J7258p619M7371k2959K9892
10743f871M6728j819l2397r879L4468o6502m8161O5867K981m5454J6569L1490
10731a2980j0129M7788M0873K8872J3155o771m5068l7694N0523J7991o269k674
10719G7617j8196M2744K8146M1063M0270Q332j32405p8930k4218l2844K0852N0205
10707B2636J818q616m6855J5334J9903J9401Q854L1979n4592m4087q258l0698
10695g3181M027r852j7076R103L5303L795r265N7922J04617J3260r9104l6996
10683a7447L5375m452k1977J8574m843K2535J9612n6324J3708j7425R169k4865
$$ y = [54615, 21174, 34474, 51961, 59815, 31520, 74390, 110651, -17112, -45632, 743, 32958, 83988, 69260, 36030, 45815, 18556, -40626, -78597, -70814, -53556, -61175, -13804, -36763, -6871, 39857, 38038, 5641, -4238, 30230, -36272, -84433, -18566, -15585, -61039, -44470, -12980, -23109, 24679, 65552, 94424, 107579, 100808, 55740, 18046, 68569, 86560, 80291, 77617, 59421, 102165, 130311, 171374, 211644, 219976, 87571, 8641, -15577, -48421, -27569, 22636, 24454, 15838, -31017, -15683, 4220, 23621, 32475, 64454, 9862, -34225, -42483, -73181, -69154, -79006, -96082, -86979, -51676, -47881, -57146, 776, 105393, 118653, 19549, -17447, 17928, 13476, -8501, 10073, 5230, 27765, 47377, -8947, 4761, -12664, -3495, -28360]
10671b8360j5541L1158j6966n4148L1601R1827L4524n8381o3181J0695L1755L1323
10659B6306J3287n9744L8689l6490o2924M5289L2095r4157n0241J02251P5561
10648B9922J3986J11067M2711m0826n8260N105J1430k2477o1762q959K236n8692
10636c4519l6119Q4910N6179Q499n620q4124j8079L015k4787K3829J11305k7955
10624E6534l3738j4763K0846j281j4581r169L5375K2827m1809L2737N0593O605
10612A10176l0580q2873n4951M9569M5977J7512M7207q43m1611q5913j3130K5686
10600a3774k4576m485j0949N021J8984o931L729J2021J4940L6474n507M7240P055
10587G9242o3687l5721k1461l525n049J9800M4471J1215m5525l9097L2207r447
$$ y = [-28360, -43901, -12743, -29709, -83857, -52256, 39571, 74095, 15714, -47467, -36772, -5017, 26306, 39593, -20151, 18538, -17952, -80876, -35587, -3492, -97649, -147890, -45639, 29922, 43908, 154975, 197686, 156860, 98600, 103705, 115135, 92658, 30896, 21937, 24173, -34519, -70638, 14272, 70451, 78950, 73330, -10794, -28873, -25858, -50645, -26816, 84489, 56534, 22796, 8033, 28879, 27598, 13017, 3848, 39223, 62050, 20241, 52978, 103571, 110176, 79596, -3277, -58228, -8659, 37318, 54830, 102037, 101194, 59583, -26330, -39460, -13774, -38350, -42835, -53784, -48763, -29779, -36710, -32981, -20960, -6020, 30454, 24947, 72187, 79242, 15555, -20166, -41627, -45152, -50201, -30401, 14070, 25285, -20240, -59337, -27130, -36577]
10575c6577J4708J3833k4861J915o4203J2524N4423Q0525K2908k0279j3402k4419
10563A7095L448j9278r873k2838m8811P2921N1531j0725l1189n177l213k608L3791
10550B5074K496j1275J0939L1809l214K3865j5663m2326N472j76J8568J5543J0812
10537G1924P2428N7795n7715k0943P3914J44166J67149P5685j9748p6982j64431
10526C23242o2889j08316r7788l5278m8162n998o459O2346N532J2269N5986p471
10514H7014j5882n3872O956K2499L7275O4908l1609n8421K2775M3323J7811k9702
10502A13075O7090j1515R849j5196l326l0255k0400Q6702J87828J77582J55757
10491G17191K04761K30410K77010K63488Q5564r347o343r1576j52892k16285k27713
$$ y = [-36577, -21869, -8036, -32897, -30982, -95185, -82661, -28238, 52287, 75195, 54916, 41514, 17095, 20543, 1265, -8608, -31446, -80257, -7336, 44195, 33470, 2281, -2896, -6109, -8717, 25074, 27570, 16295, 27234, 59043, 55829, 79694, 64031, 21705, 27177, 27001, 45569, 61112, 71924, 144352, 202147, 144432, 123489, 197403, 341569, 508718, 584403, 564655, 487673, 323242, 260353, 152037, 54249, 18971, -29191, -35189, -41648, 20698, 26230, 38499, 94485, 87014, 71132, 17260, 24216, 46715, 83990, 148898, 117289, 58868, 81643, 124966, 142777, 113075, 180165, 168650, 178499, 163303, 159977, 129722, 109322, 196024, 383852, 561434, 717191, 921952, 1152362, 1429372, 1692860, 1778424, 1769077, 1762734, 1671158, 1518266, 1301981, 1074268]
10480A074268j37073j15070j12419j48851j70650j35613q3703J4534K9741l0900
10470A84264n426n1956m93J443o450L0559j5125Q318m1304m4356l1235N787j1280
10457B2746l5554n299L0741j5981L547L3466P0666O5248J6764Q699K468k2031
10445A75480l4671m5560k1179L0425Q0148L4091O6273j4601n2682l5003J6936
10434A99657K1434P779p66m6905p0998J6718M9499j1407N41K45J3636l4456k1808
10421A23169K5957n1841m1057J9199M0711n8579p7261j6398j8737N9683L9804
10410D4650q954n805L7383R61J0859j5176k4433P203N5076j7192k5605N234L2372
10397I6573L0129L543q744l3284k6574o0756M442L5048j9122M535k2718J9014
$$ y = [1074268, 937195, 822125, 709706, 560855, 390205, 254592, 170889, 185423, 215164, 184264, 178838, 126882, 126389, 127832, 121382, 151941, 136816, 145134, 103830, 59474, 28239, 34026, 22746, -12808, -18107, 12634, -3347, 200, 33666, 104332, 169580, 186344, 195043, 197511, 175480, 140809, 95249, 74070, 104495, 184643, 218734, 285007, 270406, 217724, 182721, 199657, 221091, 228870, 228104, 181199, 110201, 126919, 176418, 165011, 165552, 165797, 179433, 144977, 123169, 149126, 97285, 56228, 75427, 116138, 57559, -19702, -36100, -54837, 4846, 44650, 35696, 29891, 67274, 68235, 79094, 63918, 39485, 46688, 101764, 84572, 58967, 64201, 96573, 126702, 130245, 121501, 88217, 61643, 887, 5329, 40377, 21255, 25790, 3072, 22086]
10385B2086l089P360l7168N4786K0233P053P792L381m4882l9764J9369P2787N3036
10372A42980N369K7324J9159L6280n7275n6571j2514N9791j6437q0411m9364J5145
10360C3476O3590j1075o7134p763j9007m293O9768N702m9775l0416J8000O9505
10348G0578K2557j5180L243k0585l106R028k811Q558n8489M3986J7299k9180l96
10335D5502J233n406k4356M5160M0382n4106J0938m8571O553j2228J0076M4735
10323E9912J1519L3534M8404n554Q588j0577k0067k3138l5670n22J467q550n8638
10310G08l697l0687M0614M6296m7334j4798k4548m9763O1079O5660o267j72j1455
10297B5636k847K5285o9194m3201J7656M3035P450Q6L7981J4071J0009k9257m0541
$$ y = [22086, 18997, 26357, -10811, 43975, 64208, 71261, 79053, 82434, 37552, -2212, 17157, 89944, 142980, 148349, 175673, 194832, 231112, 173837, 117266, 104752, 164543, 148106, 67695, 18331, 33476, 97066, 85991, 18857, 11094, -7913, -12206, 57562, 63264, 13489, -16927, 1073, 70578, 93135, 77955, 81198, 60613, 57507, 66535, 63724, 72282, 13793, 57779, 75078, 45898, 45502, 46735, 41329, 16973, 62133, 102515, 48409, 59347, 10776, 17329, 5101, 15177, 59912, 71431, 104965, 153369, 147815, 156403, 145826, 125759, 102621, 66951, 66429, 67896, 59346, 708, -2989, -33676, 6938, 53234, 5900, -8898, -33446, -83209, -22130, 43530, 37263, 37091, 25636, 22789, 48074, -21120, -64321, -46665, -3630, 3820, 3906, 41887, 55958, 65967, 36710, -3831]
10284c831l8938J719N6238L7531j715J4492l6413J1511q511m565j9467r2583q025
10271i2557O7164M6840M2063P5607p633n7857o7682o0395M8315L8602m3198p3335
10259h4066L413J2970R648l4217J7680J1348K0463J5888K3890m6523k0691M3708
10247b6489K6915Q888L6805J3524j7307k4575R226k1099k4398r994J7084n1145
10235f2565K3871N0968j533L6236L8706j6855m0195j4132J5258M581j0871l5487
10223a2018j3897m261q055O951L2052L5424k4383o0742k9743K5491K8917P3589
10211D9325R417L0418K3721o3962J3287O3992O7011p0579o6937L3988k2328q0719
10199a3366m181M2670L2731K9217m7730n3848k585R7757L2364j1504K5635L0450
$$ y = [-3831, -42769, -41050, 15188, 52719, 51004, 65496, 29083, 40594, 32083, 27518, 8051, -84532, -92557, -25393, 21447, 63510, 139117, 131484, 73627, 5945, -54450, -6135, 32467, -10731, -84066, -80653, -67683, -58035, -92252, -74572, -63224, -42761, -26873, -2983, -49506, -70197, -26489, 426, 9314, 46119, 59643, 42336, 17761, 26987, 5888, -18510, -28504, -11420, -62565, -38694, 12274, 10741, 46977, 85683, 68828, 28633, 14501, 29759, 34340, 23469, -12018, -25915, -30176, -38231, -31280, 772, 36196, 11813, -48929, -78672, -53181, -24264, 49325, 58742, 89160, 112881, 48919, 62206, 126198, 193209, 122630, 55693, 89681, 67353, -13366, -17547, 25123, 57854, 87071, 39341, -14507, -17092, 80665, 113029, 101525, 127160, 157610]
10187A57610K6792k4110l4832p5477o6235o451J9970j2733J3954j4644l3344J9478
10175c0022Q5218P5660K580l3477j0550k2489j8645R9594N6346j2315o2263o0617
10163F9020m1397j8400k8829J2485O8723J1840p5188J0500n9n623k3690j3788
10151c4406q290m649M208j5908l4414L9892L7564l2989k9758L722K5335K7246
10139b2447K2642N8557K7959O055P1978Q681l7115J5009n4537j3619o7252o5421
10127d9510L4430M9567L7734O314n4357j5431K1336N5616O4509l7095q2527m2269
10115a1683j0213L9656j3522n2611M733L9734j036M5613M2149l7065m9347k3479
10103b7071k4556k3071M6023n0551J8694J149m604N9234J6878M6145L7516o2728
$$ y = [157610, 184402, 160292, 125460, 49983, -16252, -22703, -2733, -15466, -1512, -16156, -49500, -30022, 55196, 130856, 133436, 99959, 89409, 66920, 48275, 147869, 204215, 191900, 129637, 69020, 27623, 9223, -19606, -7121, 61602, 73442, -1746, 8754, 8695, 3072, -20618, -34406, -42696, -47345, -43137, -59045, -93459, -53567, -16003, -48992, -78750, -75028, -49693, -22447, 195, 58752, 86711, 92766, 164744, 173425, 136310, 151319, 96782, 83163, 15911, -49510, -15080, 34487, 72221, 78535, 24178, 8747, 30083, 85699, 150208, 113113, 30586, -11683, -21896, 17760, 4238, -48373, -43640, -3906, -4942, 40671, 82820, 45755, -3592, -27071, -51627, -74698, -28675, -79226, -60532, -59383, -63987, -4753, 12125, 58270, 95786, 33058]
10091C3058k4227k6525k3727K0291J0195O7383k8576k5266l679K4336j2259J115
10079A2119K0745M3729J8781l3807l2124k3779J6316K6038K903n6783M763J6048
10067A4949k874k3270K075L7288P898N2918m713l6317k9420q8846p1066m2421
10055a83799O3665M4861K1869K1104N5160N1237o0655q1441m8364J8888R9177
10044A702P1472m8988q484k239n0107J6196m36O1523j157l2222R412n9524m9582
10031i2434J9482L8045Q6398L7259n7586K1696k8155o341j634j7111j4602K5904
10019A0921M8661K6545k9881K0044j4621o9201j0964Q668O037k5025l9560R122
10007e9254M4793n27N6181R428O890m3010J1532j312J3932L2312k2313k0906j3805
$$ y = [33058, 8831, -17694, -41421, -21130, -10935, 56448, 27872, 2606, -1073, 23263, 11004, 12119, 32864, 76593, 95374, 61567, 29443, 5664, 21980, 48018, 50921, -5862, -1099, 14949, 12075, -11195, -9120, 28168, 36066, 88984, 84271, 47954, 18534, -70312, -141378, -183799, -120134, -75273, -53404, -32300, 22860, 74097, 13442, -67999, -116363, -97475, 1702, 73174, 24186, 15702, 13463, -36644, -20448, -20884, 40639, 39482, 7260, 16672, -42852, -92434, -72952, -34907, 51491, 88750, 31164, 52860, 24705, 18364, 16730, -381, -14983, 10921, 59582, 86127, 56246, 76290, 61669, -7532, -18496, -9828, -3791, -28816, -68376, -59254, -14461, -14988, 41193, 50621, 57511, 14501, 26033, 24721, 38653, 70965, 48652, 27746, 13941]
9994A3941k4394K9100K2214k3058K7735J0939m3771P265O6986J8619l9968k9825
9982C5783k3050j8016M7056R770r319J5367P909q258Q022M336m1653k1327L0005
9969C6625L6721L9723j8123n80k2699L2637m8340m4335k8835m2368M2498l977
9957b1053k5142k4595j8864o555L4335J35447j0006j6250k8788p830L4931P639
9945E3269O3229K1811N831k5857M1676n2675j5490p823j7203n9989M678L1076
9933D2533j0385J8114J7643j4659Q007k0992p1155l5420l433L811P183N6680K8052
9920B5979J1810K2948L8311k6364o9571l0030j024P8083Q2549J6168n6355o53
9908I1851N2141j2734m8821m5690K2478M5425J2759j5751L3314l5403k2284K6758
$$ y = [13941, -10453, 18647, 40861, 17803, 45538, 56477, 12706, 19971, 86957, 105576, 65608, 35783, 12733, -5283, 41773, 51543, 42224, 57591, 65500, 57242, 65264, 69600, 27947, 6620, 36625, 73346, 113069, 94946, 94366, 71667, 104304, 55964, 11629, -17206, -59574, -17076, -21053, -46195, -70790, -89654, -96209, -61874, 73573, 63567, 47317, 18529, 10699, 45630, 53269, 116498, 138309, 144140, 118283, 159959, 107284, 91794, 83971, 66768, 6779, 11457, 42533, 32148, 50262, 67905, 53246, 61253, 40261, -30894, -66314, -69747, -65936, -58753, -2073, 25979, 37789, 60737, 99048, 72684, 3113, -26917, -27941, 50142, 132691, 148859, 92504, 91851, 143992, 131258, 82437, 36747, 59225, 104650, 117409, 101658, 134972, 99569, 77285, 104043]
9896A04043l8253J8862J6104p096k0379m3641q231K8084R1477J0066J3715N756
9884A70507k0569L717K1211N3586o9895p1305O857K1796K6130j1029m2791k2821
9872F5394P812K9219J1339l503p3670l387q030N0314P8713j2844k9877l7541j0743
9859F3196P141O5756R699l4260J4618M6785k47N432L4087p3538K4184K9012P0129
9846B61994P1386M5249M917j0709j2574l3773n5170M631n9891l7975j791j789
9834A74505j7861L0727O201j9449l113n445k3087n681j4836R3206J2715j6702
9822B11180Q240J4551J523P222L3298O1976J0396K7772J4278o5460j9710o4734
9810B40532l027k2743r9306j00286j6589L8073L1930m308j7744J6939L6113k0836
$$ y = [104043, 65790, 84652, 100756, 93660, 73281, 29640, 21409, 49493, 140970, 151036, 164751, 170507, 149938, 153655, 174866, 228452, 158557, 87252, 94109, 115905, 142035, 131006, 88215, 65394, 73206, 102425, 113764, 110261, 36591, 33204, 25174, 75488, 154201, 141357, 111480, 73939, 63196, 70337, 136093, 145792, 111532, 126150, 172935, 172688, 178120, 212207, 138669, 162853, 191865, 261994, 333380, 378629, 383546, 372837, 360263, 326490, 271320, 275951, 216060, 178085, 176294, 174505, 156644, 187371, 193572, 174123, 171010, 165565, 142478, 136797, 121961, 215167, 227882, 211180, 219420, 233971, 235494, 242716, 276014, 337990, 348386, 376158, 390436, 324976, 305266, 240532, 237505, 214762, 115456, 15170, -1419, 36654, 68584, 64276, 46532, 63471, 99584, 78748]
9798G8748k1442l8537P8113Q4379k3526o3538J0809K623J8159N4289j0806j6937
9786A52334J9091O496k9878j2017L7661J9494j8306m9945k7901l308K6628l4359
9774H5990l7927K0115K8956M6129l4854l8372j1415m4820m990m701J330K669m6633
9761c8523N4376R8677K8515k4173n0423J6546J9226M149Q983J7071o426n1775
9749G6223M0916k4079j2954K6878R471k4621l5368R664M4998N3793L1558m7201
9737A49278n069k4J257l3258L880M9005l253L9474J4133k3993J1219J5365l8927
9724A79087j2501K1966K9104L8760k5780J7450l8871j0701P337o456O265o680
9712A98980J8606K0183j5428m8872L6622O6348Q809N3605j2190o4257k4196Q2758
$$ y = [78748, 57306, 18769, 96882, 181261, 157735, 94197, 105006, 107629, 125788, 180077, 169271, 152334, 171425, 177921, 148043, 136026, 173687, 193181, 174875, 124930, 97029, 93721, 120349, 85990, 48063, 68178, 97134, 143263, 108409, 70037, 58622, 13802, 8812, 4111, 5441, 8110, -38523, 15853, 114530, 143045, 118872, 68449, 84995, 104221, 108370, 117353, 134424, 127998, 76223, 117139, 93060, 80106, 106984, 116455, 91834, 56466, 66130, 111128, 164921, 196479, 149278, 144209, 144185, 145442, 112184, 116064, 165069, 161816, 201290, 215423, 191430, 202649, 218014, 179087, 166586, 188552, 217656, 256416, 230636, 248086, 209215, 198514, 205851, 199395, 205660, 198980, 217586, 237769, 222341, 173469, 210091, 276439, 285248, 338853, 326663, 262406, 238210, 320968]
9700C20968M7295q234J3427r07O296n7312k3006m9795j2899j4222l8118K7105
9688B10598J6962l7571k3727j5400R4477j1527o771k2956K7543N2274J4784o144
9676B92542j3102O783k0358k3654J6109M0660j5366J2928J1616N4560Q1357K1251
9664D65326J1119n1797k4288k0327m8590p491j2421j5715K7466N5088j261m7238
9652C29871p3751j3856K3449k1444q502N924m4236J01162N1850k1914k9938j1416
9640B87199l282N2775K9078p670K5752J754l4726m2010K4303j2959N3341K3218
9628C96773r057j9887m6047q1220K1295L5328M3394N9182l3768o084j5184k0337
9616C24388k5025K555N1588J6970o1100n0524m0616K0499J6013n011K6752j1611
$$ y = [320968, 368263, 360029, 373456, 372549, 378845, 321533, 298527, 248732, 235833, 221611, 183493, 210598, 227560, 189989, 166262, 150862, 245339, 233812, 227041, 204085, 231628, 283902, 298686, 292542, 279440, 286223, 265865, 242211, 258320, 298980, 283614, 296542, 308158, 362718, 444075, 465326, 476445, 424648, 400360, 380033, 331443, 323952, 311531, 295816, 323282, 378370, 377109, 329871, 256120, 242264, 265713, 244269, 235767, 241691, 197455, 298617, 350467, 328553, 298615, 287199, 283917, 336692, 365770, 358100, 383852, 385606, 350880, 308870, 333173, 320214, 373555, 396773, 387716, 367829, 321782, 240562, 261857, 297185, 340579, 399761, 365993, 359909, 344725, 324388, 299363, 301918, 353506, 370476, 309376, 258852, 218236, 238735, 254748, 249737, 276489, 264878]
9604B64878n6873j0883N4245M5271J8291k8915l8942O209l5818O8777l4206k6053
9592B25981L2939J60L619n9609l3239K5116J8993m2279L5317L0416n6046k5949
9580A55419j8588J6652L7178j4338J6929J2191m1614J5936N3214j1382O393J7855
9568B45845P517J3588k8784o6616m8434L6394l3471l9326l7907J4508L1472N9913
9556A54699k3041j1856K8875M2001K8709m1696R497J2053m3521J5561J0646l9677
9544A42250N6657P9088k3651l4216M8474J8665o4184p0553N4999J4367L7220k2228
9532B36888n5772j0968N2266L1642j9319m4277L4590J667l3491N168L2575j5360
9520B15609n6598k7370L8829J3357m491k944O6681K8386m052L0856L9973M6836
$$ y = [264878, 208005, 197122, 251367, 296638, 314929, 286014, 247072, 253281, 217463, 286240, 252034, 225981, 258920, 259080, 262699, 203090, 169851, 194967, 213960, 171681, 206998, 237414, 181368, 155419, 136831, 153483, 190661, 176323, 193252, 205443, 163829, 179765, 232979, 221597, 227990, 245845, 253362, 266950, 238166, 171550, 123116, 159510, 126039, 86713, 48806, 63314, 94786, 154699, 131658, 119802, 148677, 190678, 219387, 177691, 187188, 199241, 155720, 171281, 181927, 142250, 198907, 277995, 254344, 220128, 268602, 287267, 223083, 152530, 207529, 221896, 259116, 236888, 181116, 170148, 222414, 254056, 234737, 190460, 225050, 226717, 193226, 198394, 230969, 215609, 159011, 131641, 170470, 183827, 179336, 176392, 243073, 271459, 267407, 298263, 338236, 385072]
9508C85072P69o641p7198l4959j7100m2295o469N190K5556J3262j6602l3500k2915
9495A72170J404L5477N8785n150p6781J3949P1879L8061l1212p7980j2118K6200
9483B14684r603k9126K1319Q097m0411Q8637J7512q2294l202O3356m964N337M8220
9470B97562M640n1019L5287P1421o222K0616L4852k9789o7411m3079L7607k2188
9458B82277K0025L8292L9563k6072p0007j6079Q076L8041P679j0854l5711j1821
9446B63409J9768M7928L3850m1023o835J8244K6577N1603O296k6665k9746n5757
9434C07649j1814k7195M8923L0394J2568R13l777M0917k7597L6463J3022k8041
9422C92425J3556J6874J4173N3989k2596k6569m9765l0276k3817k1129r62l5346
$$ y = [385072, 385841, 379200, 302002, 267043, 249943, 207648, 201179, 206369, 231925, 245187, 228585, 195085, 172170, 173574, 209051, 267836, 262686, 185905, 199854, 271733, 309794, 278582, 200602, 188484, 214684, 205081, 175955, 197274, 205371, 164960, 253597, 271109, 188815, 185613, 248969, 244005, 249342, 297562, 302202, 251183, 286470, 357891, 351669, 372285, 407137, 377348, 309937, 266858, 304465, 282277, 302302, 340594, 380157, 354085, 284078, 267999, 276075, 314116, 321795, 310941, 275230, 263409, 283177, 331105, 364955, 323932, 317097, 335341, 361918, 413521, 419817, 393152, 363406, 307649, 295835, 268640, 317563, 347957, 360525, 361438, 357661, 398578, 370981, 407444, 420466, 392425, 405981, 422855, 437028, 491017, 468421, 441852, 392087, 361811, 337994, 316865, 315903, 280557]
9410B80557J3419R082l1232R8032N2291m8288k6408l3665K4898L0288K8032k4058
9398C72948J0623Q2843O021l1179l5017l3570l0168N1967O7773K1416m895K5417
9386E04179M3064k3535j0581k8766k3172k8608m0617K4048m1903n3136N3850J28726
9374E03549J4060j9991l0701L6419L1510q297J3969J4789m3271j3592k7929q267
9362D62248o1506k2925N3314N4142k112R219Q0481M876l0681l1597M1391m8595
9350E08255l4000k2948j4051J3892L041j17O3046M6146J1351k9046N0657J5542
9338F11768L3776K3748k1536j043m363l7103l5525k5814J8216k2034J5621J4261
9326E69972N4291j5680M4358K4030K2826K8960k098m9235l4346q796j9807M0858
$$ y = [280557, 293976, 303058, 271826, 369858, 422149, 373861, 347453, 313788, 338686, 368974, 397006, 372948, 383571, 466414, 472435, 441256, 406239, 372669, 342501, 394468, 462241, 483657, 478762, 504179, 547243, 523708, 513127, 484361, 461189, 432581, 391964, 416012, 374109, 320973, 374823, 503549, 517609, 497618, 466917, 503336, 534846, 526549, 540518, 555307, 512036, 498444, 470515, 462248, 400742, 377817, 431131, 485273, 483161, 492380, 572861, 577737, 547056, 515459, 556850, 508255, 474255, 451307, 437256, 451148, 454189, 454072, 517118, 563264, 574615, 545569, 596226, 611768, 645544, 669292, 647756, 646713, 642350, 605247, 569722, 543908, 562124, 540090, 555711, 569972, 624263, 608583, 652941, 676971, 699797, 728757, 726659, 677424, 643078, 634282, 614475, 655333]
9314F55333J2598J1857l147q879M2204O1464j4168j9987k5626P1221J2164o3959
9302G31075k8513k1456K4768j501L9995M8277J8764l1338J3231N9945J7973p91
9290H70429m9883j8997j8298K8536M4767K3452P417l2075p7520j5476K6070K5281
9278H13703K6228J3630L3843Q5022N4683o430k3131L7494l3183M3601K2754q8696
9266I79518k2049L8860J148J8116M4806K3419n9461K2945K3726J5912m9559k5186
9254A012195J0690N0122L3042j860L1332J00819L2726m4273L46P603j1828K1369
9242A242283M484j3457J6736J3632p753l803J5851K0598k6236n9815k6667O3589
9230A239442L6477N1242Q654K5266K9086m1673M884L0338N6457J3327J4199n2097
$$ y = [655333, 667931, 679788, 676641, 667762, 709966, 771430, 757262, 737275, 711649, 782870, 795034, 731075, 702562, 681106, 705874, 704373, 744368, 792645, 811409, 780071, 793302, 853247, 871220, 870429, 820546, 801549, 783251, 811787, 856554, 880006, 887423, 855348, 777828, 762352, 788422, 813703, 839931, 853561, 887404, 972426, 1027109, 1020679, 997548, 1035042, 1001859, 1045460, 1068214, 979518, 957469, 996329, 997477, 1015593, 1060399, 1083818, 1024357, 1047302, 1071028, 1086940, 1037381, 1012195, 1022885, 1073007, 1106049, 1104189, 1135521, 1236340, 1269066, 1224793, 1225139, 1232742, 1220914, 1242283, 1246767, 1233310, 1250046, 1263678, 1255925, 1252122, 1267973, 1288571, 1262335, 1202520, 1175853, 1239442, 1275919, 1327161, 1335815, 1361081, 1390167, 1348494, 1353378, 1383716, 1440173, 1453500, 1467699, 1415602]
9218A415602k3954m9563j3446R6763J01698L3932k8605K2596P0014j0041L7068
9207A652064k795q01l007K8576P4977j2530k9997J5576j386M9045M1329l5134
9195A775917M518M2579J0994P1415L0908l961j0691K2655N4057n1928K6242R4119
9183B066824N756Q192N9515N5573K8927O327N3426N3921o969o033K4988k197M5280
9170B393530M0568k6984j765O8513P9513k615M530J6195l4716M7421Q0355K9001
9158B693546O3528N5583j0913J7455O9699O032K6874O3818N7989R715L3363L9389
9146C126078K9412P9509M9631M7168N9819J463j468P4425O2386K6694P2915L8356
9134C666388P4376M0711P5763J1191L443O3115M9116Q8516L0884J46715J01674
$$ y = [1415602, 1391648, 1342085, 1328639, 1425402, 1527100, 1561032, 1532427, 1555023, 1625037, 1614996, 1652064, 1649269, 1648468, 1645461, 1674037, 1749014, 1736484, 1706487, 1722063, 1720677, 1769722, 1811051, 1775917, 1780435, 1823014, 1834008, 1905423, 1936331, 1932370, 1921679, 1944334, 1998391, 1946463, 1972705, 2066824, 2072580, 2080772, 2140287, 2195860, 2224787, 2231114, 2284540, 2338461, 2331492, 2325459, 2350447, 2348250, 2393530, 2434098, 2407114, 2405349, 2473862, 2553375, 2550760, 2555290, 2571485, 2536769, 2584190, 2664545, 2693546, 2757074, 2812657, 2801744, 2819199, 2888898, 2894930, 2921804, 2985622, 3043611, 3053326, 3086689, 3126078, 3155490, 3234999, 3284630, 3331798, 3391617, 3393080, 3391612, 3466037, 3528423, 3555117, 3628032, 3666388, 3740764, 3781475, 3857238, 3868429, 3871872, 3934987, 3984103, 4072619, 4103503, 4250218, 4351892]
9123D351892N3296Q2076O1946N9804j1921O0826J42978Q2835L1876J04810J00895
9112E121313R0305R1557N8368N7777O0099R3990J19835J11076R8542J00569J06700
9101F110131L045M9883J20781K13708J84529J73513J19613O2092R3712J17355
9091G248362J01100R8164J35774J75655J74573J48898K11797J93262J22215J86463
9081H796263J94255J65424J96050K42102K12171J79256J97837K26939K15380K62845
9071A0888522K63306K36049K44914K62495K60278K19319L04500L10546L23963
9062A3313892L33911K70036K86243L04155L99207L83844L27717L97972M25835
9053A6442812M27267L92655M54969M72199M10895M74308M90790N10915N00651
$$ y = [4351892, 4405188, 4487264, 4549210, 4609014, 4597093, 4657919, 4800897, 4883732, 4915608, 5020418, 5121313, 5211618, 5303175, 5361543, 5419320, 5479419, 5573409, 5693244, 5804320, 5902862, 6003431, 6110131, 6113176, 6163059, 6283840, 6497548, 6682077, 6855590, 6975203, 7037295, 7131007, 7248362, 7349462, 7447626, 7583400, 7759055, 7933628, 8082526, 8294323, 8487585, 8609800, 8796263, 8990518, 9155942, 9351992, 9594094, 9806265, 9985521, 10183358, 10410297, 10625677, 10888522, 11151828, 11387877, 11632791, 11895286, 12155564, 12374883, 12679383, 12989929, 13313892, 13647803, 13917839, 14204082, 14508237, 14907444, 15291288, 15619005, 16016977, 16442812, 16870079, 17262734, 17717703, 18189902, 18600797, 19075105, 19565895, 20076810, 20577461]
9044B0577461M48840N54750O00372N58195N49348O33354O33971O50861O77858
9035B5885010P00927O52798O75547O98288P45181P05455O51223P99493P52141
9026C2266063O82885P99316P95330P86712P68578P43765P40024P99032P21393
9017C9103098P30250P47110P36382O80134O29179O02879N20728N54438N75033
9008D4879231M86820M41084L08977L52798L00608K20550J70582R0143N3156p7123
8998D7226826n3463j43044k30632k75511l08571l69632m58111m78051l91776n29873
8988D3988162n27097n77171o23181n95999o97959p19706o87675p49408o84900
8979C8125066o97724p89065p89454p13848p28204p42547p14918p27311p40328
$$ y = [20577461, 21026301, 21581051, 22181423, 22739618, 23288966, 23922320, 24556291, 25207152, 25885010, 26585937, 27238735, 27914282, 28612570, 29357751, 30063206, 30714429, 31513922, 32266063, 32948948, 33748264, 34543594, 35330306, 36098884, 36842649, 37582673, 38381705, 39103098, 39833348, 40580458, 41316840, 41996974, 42626153, 43229032, 43749760, 44304198, 44879231, 45366051, 45807135, 46116112, 46468910, 46769518, 46990068, 47160650, 47250793, 47303949, 47226826, 47173363, 47030319, 46799687, 46524176, 46215605, 45845973, 45387862, 44909811, 44518035, 43988162, 43461065, 42883894, 42260713, 41664714, 40966755, 40247049, 39559374, 38809966, 38125066, 37427342, 36638277, 35848823, 35134975, 34406771, 33664224, 32949306, 32221995, 31481667]
8970C1481667p76529p73946o78705o59689p20502o74171o07947o39457n88934
8961B5361787n80355o44980o18440n71459n78878n59094m99711m57631m97097
8952B0354142m91942m56257m49951m45954m01135m14587m25259m00538l42229
8943A6526290l69263l99624l43787l87248l04928k83790k89319l00691l26783
8934A3520857k28233k11533k79174l03312l34767l10329k30773j89597j94997
8925A1238142k49276k42590k02801k00279l06515k18562j61404j74173j83389
8916I299153j78332k22032q8012n2753p9486j70371j53785j97950j05884j88520
8906G862028k41368j41942q2130j19761j08500j60868j02847l7995j36924j39030
$$ y = [31481667, 30705138, 29931192, 29252487, 28592798, 27872296, 27198125, 26590178, 25950721, 25361787, 24781432, 24136452, 23518012, 22946553, 22367675, 21808581, 21308870, 20851239, 20354142, 19862200, 19405943, 18955992, 18510038, 18108903, 17694316, 17269057, 16868519, 16526290, 16157027, 15757403, 15413616, 15026368, 14721440, 14437650, 14148331, 13847640, 13520857, 13292624, 13081091, 12801917, 12498605, 12163838, 11853509, 11622736, 11433139, 11238142, 10988866, 10746276, 10543475, 10343196, 10036681, 9818119, 9656715, 9482542, 9299153, 9120821, 8898789, 8810777, 8758024, 8678538, 8508167, 8354382, 8156432, 8050548, 7862028, 7620660, 7478718, 7396588, 7276827, 7168327, 7007459, 6904612, 6866617, 6729693, 6590663]
8896F590663n6563q2182j19618q9074j37044j00945o2957o0787q5173j20584j25119
8885E550617n0428k2350j25274j24163n7368n0909m6612m9794j41345q4559r8618
8874D699197o7473l8543n4207k8757P13m7878r7034j03426j04863l9071l9617
8863D079041l0862r5992m6668l1591m7306m1927n6276R830k9399p6000p4749j04820
8851C453281p8438L990J4818p4266m2928q3452q096K0424m0471l7887k8282m7349
8839C051344j00813l9244l2423J8825j9409n1343j3441r373N267m843m7073j3899
8827B743575l2781k3254l0758p2221p8869j7493K7178n7786l7706N263K0383k9991
8815B415540q6155o9863N342j2382j3094j0538m552q068J4028J776o6863P868
$$ y = [6590663, 6534100, 6451918, 6332300, 6243226, 6106182, 6005237, 5942280, 5881493, 5796320, 5675736, 5550617, 5500189, 5477839, 5352565, 5228402, 5171034, 5120125, 5073513, 5023719, 4882374, 4797815, 4699197, 4631724, 4593181, 4538974, 4510217, 4510930, 4463052, 4366018, 4262592, 4157729, 4118658, 4079041, 4048179, 3952187, 3905519, 3873928, 3826622, 3784695, 3728419, 3738249, 3708850, 3632850, 3558101, 3453281, 3374843, 3378833, 3393651, 3319385, 3276457, 3193005, 3184909, 3205333, 3164862, 3126975, 3098693, 3051344, 2950531, 2911287, 2878864, 2897689, 2878280, 2826937, 2813496, 2804123, 2809390, 2804547, 2757474, 2743575, 2710794, 2687540, 2656782, 2584561, 2505692, 2488199, 2515377, 2457591, 2419885, 2425148, 2445531, 2415540, 2329385, 2259522, 2264864, 2252482, 2239388, 2228850, 2224298, 2216230, 2230258, 2232034, 2165171, 2173039]
8803B173039p0918q6209K5363L992l936m8920q0192K7343O6225L5521K0326k3435
8791B038199j18343n7216oO066n883l3506O24l106j8355k6950k3934K3799j0273
8778A771116j2037n3622o8037J1328K2729J1187j9965l6970J1409m4156l0659
8767A562323j0564j4631l6026K9433n2143l2419J4114L4582k764l377q272L633
8755A483889L2372r5876r615j462K5423N565j9780K2732o3272k3292Q905L9439
8743A405028N8943L1363J3062p8103k2803J1483J1987m2057r5688l5704j430J2049
8731A268130M5281k0213q563n7509p9710k7447M9467L1204n6371k6411P794p636
8719A118016r348J6544O2480P9441m2435j00975L3758M4021J2868R773k4611k8150
$$ y = [2173039, 2102121, 2015912, 2041275, 2045267, 2041331, 1992411, 1912219, 1939562, 2005787, 2041308, 2061634, 2038199, 1919856, 1862640, 1862634, 1868700, 1862817, 1829311, 1829935, 1826829, 1808474, 1781524, 1757590, 1781389, 1771116, 1759079, 1705457, 1637420, 1648748, 1671477, 1682664, 1662699, 1625729, 1637138, 1592982, 1562323, 1551759, 1537128, 1501102, 1530535, 1478392, 1445973, 1460087, 1494669, 1491905, 1488528, 1480256, 1483889, 1516261, 1420385, 1410770, 1409308, 1434731, 1440296, 1420516, 1443248, 1379976, 1356684, 1365589, 1405028, 1463971, 1495334, 1508396, 1430293, 1407490, 1418973, 1430960, 1388903, 1293215, 1257511, 1256081, 1268130, 1313411, 1293198, 1284635, 1227126, 1147416, 1119969, 1169436, 1200640, 1144269, 1117858, 1125652, 1118016, 1108668, 1125212, 1187692, 1267133, 1224698, 1123723, 1157481, 1201502, 1214370, 1224143, 1199532, 1171382]
8707A171382l2342n5470J0077K2102l1349l5378K9924N7832N977m0140k5578k2534
8695A054503m173Q012m2532K4073m410j5861m6518l8617l5454P0399K2908k6569
8683I65761o5478L1456P5647O2610O2124m0551N534k4897n5895O649K3098j0224
8671A035834l1227J070N728l542j2747p025J7634p713l8565k7385l528M8785j3235
8658I64084m6241M288K8204K9622J9456k9245l6685k0434l5921l2805K8576J59816
8646A032715P9803k2762J9623K6660o449p8864k1368j9851n4931n3613L7818L1267
8634I70048m3302k6179l6843N4039K2570k0166k7637M2081J7975l181j1820n302
8622I32283J9111m4534K8680J1893J7464r991j0270J2746k6989K1312q244M9530
$$ y = [1171382, 1139040, 1083570, 1093647, 1115749, 1084400, 1049022, 1078946, 1136778, 1142755, 1102615, 1077037, 1054503, 1050330, 1058342, 1015810, 1039883, 1035473, 1019612, 973094, 934477, 899023, 969422, 992330, 965761, 900283, 931739, 1007386, 1069996, 1132120, 1091569, 1097103, 1072206, 1016311, 1022960, 1046058, 1035834, 1004607, 1005677, 1011405, 1007863, 995116, 988091, 1005725, 998012, 959447, 932062, 928534, 977319, 964084, 917843, 922131, 950335, 979957, 999413, 970168, 933483, 913049, 877128, 844323, 872899, 1032715, 1112518, 1089756, 1109379, 1136039, 1129590, 1050726, 1029358, 1009507, 954576, 900963, 938781, 970048, 926746, 900567, 863724, 917763, 940333, 920167, 892530, 934611, 952586, 949405, 937585, 932283, 951394, 906860, 935540, 947433, 964897, 954906, 944636, 957382, 930393, 951705, 943461, 992991]
8610I92991K4542m4982M2077O5709K1807J5026P2821J22465K07576K25132Q0747
8599A825911K8403k1281q4468j17664o6807J2579K3769P5545P7514O5140L8892
8588A857533P7547J20771O9717N7213k0102r2421j41648p4624j41758k16685j16449
8577A379094r0073m5670o5281m1148p1716n3494l1609j3890K5279Q3719O3589
8566A138800L5749K1934j9194j3963n4516q4281O5102J06085K04848K15662O6893
8555A683119p2455j96599j97742q5510r0148j05008j39778m5649Q225N589l9023
8544G25021k9240J7160j8152k6874n631J0721M397N3870N5535o7410J1659N3195
8532G84251J13092P2150L4726m2533o8790o7416l4723K106l807m4660n9664k7989
$$ y = [992991, 1017533, 972551, 1014628, 1080337, 1102144, 1117170, 1189991, 1312456, 1520032, 1745164, 1825911, 1854314, 1833033, 1748565, 1630901, 1564094, 1576673, 1600442, 1675987, 1753501, 1818641, 1857533, 1935080, 2055851, 2125568, 2182781, 2162679, 2070258, 1928610, 1853986, 1712228, 1495543, 1379094, 1289021, 1243351, 1178070, 1136922, 1065206, 1011712, 980103, 966213, 991492, 1075211, 1138800, 1174549, 1196483, 1177289, 1163326, 1108810, 1024529, 1089631, 1195716, 1400564, 1616226, 1683119, 1610664, 1414065, 1216323, 1130813, 1040665, 935657, 795879, 750230, 758455, 764044, 725021, 695781, 712941, 694789, 667915, 662284, 673005, 677402, 731272, 786807, 719397, 731056, 784251, 897343, 969493, 1004219, 961686, 892896, 825480, 790757, 792863, 789056, 744396, 684732, 656743]
8520F56743j3065k8405k0308K1477m7625K3029P7463J53286R3035k8946j14925
8509G71759j57131m6585l5876K1183k3231m5967l2217L8499M0749p414m9791J6422
8497D90400K3445M886p977m244l8567l1994J2238j6323K4106L8770P1437k3781
8485E42396m4480p0152n0000M309L5597K0867j1109J2459N943N145l933K4839
8473D71881L4711l4990m7862j9775j5425M6261Q695o6891M202J8641J3826O982
8461D20256M9542N3537L3369o889n2184j1528N8700n794m5067k3596l0396O6360
8449E06310j159l039j0031J2681J450n0727m587L7574o1311m5653m7382j5830
8437C18296k6400J9903L606n59O896l7707l3516L2551L6112R282l9377J3011L9671
$$ y = [656743, 643678, 615273, 594965, 616442, 568817, 591846, 669309, 822595, 915630, 886684, 771759, 614628, 568043, 532167, 553350, 530119, 484152, 451935, 490434, 531183, 523769, 473978, 490400, 513845, 518731, 510754, 506510, 467943, 435949, 448187, 431864, 455970, 494740, 566177, 542396, 497916, 427764, 377764, 382073, 417670, 438537, 427428, 439887, 445830, 450975, 447042, 471881, 506592, 471602, 423740, 403965, 388540, 434801, 443496, 376605, 380807, 399448, 413274, 420256, 469798, 523335, 556704, 549815, 497631, 486103, 544803, 539009, 493942, 470346, 439950, 506310, 505151, 502112, 492081, 504762, 506212, 455485, 450898, 488472, 427161, 381508, 334126, 318296, 291896, 311799, 315405, 314846, 321742, 284035, 250519, 283070, 319182, 328464, 289087, 302098, 341769]
8424C41769N3022K1392L9789L1553L935m7970L9133R0581O0732J27702N5773p7740
8412G39671p9868q5203p1337m8095n4006j8734J7975J1436r78L5113j4861k1202
8400D09911m2946q4515j1203l8159L7164L4989P213o561O646K6269l242K5476
8388C61042L3824n187k2103k4323n1877m020J4254l913J2688k181Q790N7324K0589
8375C94907j0946K5648O8901L6346n027l4107J2421P5121K6428k0714q3067l6582
8363D49329j7046j2898L030n8922l8366O153N6226P3937L643k8046p5462k1152
8351C40426J2260j2360n1570R738K1439o4063l2435j3803k484Q328l7695K7852
8339B05633J1531M2233o4977L5315O2776K691m7633l8926O2313J0801p3782Q007
$$ y = [341769, 394791, 416183, 455972, 487525, 491460, 443490, 482623, 573204, 633936, 761638, 817411, 739671, 659803, 574600, 503263, 455168, 401162, 382428, 400403, 411839, 410861, 445974, 431113, 409911, 366965, 282450, 271247, 233088, 270252, 305241, 312454, 305893, 312539, 338808, 335566, 361042, 394866, 389679, 367576, 343253, 291376, 287356, 301610, 297697, 310385, 308204, 316994, 374318, 394907, 383961, 409609, 478510, 514856, 509829, 475722, 488143, 563264, 589692, 568978, 485911, 449329, 432283, 419385, 422415, 363493, 325127, 331280, 387506, 461443, 465086, 437040, 361578, 340426, 352686, 340326, 288756, 298494, 319933, 255870, 223435, 209632, 207148, 215476, 177781, 205633, 217164, 259397, 194420, 229735, 292511, 295202, 247569, 208643, 270956, 281757, 207975, 215982]
8327B15982K8471n710J3305M7046j9106J3082K5644L550k7061N609l7148j7630
8315B46034J5653L531j8177L4169J8578l2731R913j1371l0981n360o6348j1552
8303A51358J5850O4134l965O132j0184l0040k896J9312L4695O114k916j95q0993
8290A66406l3203J2144P1955N4285j0459k4492m3590l4736n342R796K5797k8337
8278A60224K3029J26451j4818N9852j2723p225l0455J0016J0898o0131J8096L0898
8266C14112J8150k9213m001K6235j9321M728P227m3422j3331l0978l9457L0310
8254B21039J8035P789n432j5785J0065J0558l5688k638J1411J2147L2180Q631
8242B72312p3207r494j2299n444M9863J8850L2237n8510o8908l459J02307O8235
$$ y = [215982, 244453, 238743, 252048, 299094, 279988, 293070, 318714, 322264, 295203, 300812, 263664, 246034, 261687, 265218, 247041, 281210, 299788, 267057, 276970, 265599, 234618, 229258, 162910, 151358, 167208, 231342, 227377, 233509, 223325, 193285, 190389, 209701, 244396, 250510, 247594, 247399, 166406, 133203, 145347, 217302, 271587, 261128, 236636, 193046, 158310, 152968, 162764, 188561, 160224, 183253, 309704, 294886, 354738, 342015, 334790, 304335, 314351, 325249, 265118, 283214, 314112, 332262, 303049, 299048, 325283, 305962, 310690, 317917, 274495, 261164, 230186, 190729, 221039, 239074, 246863, 241431, 225646, 235711, 246269, 210581, 207943, 219354, 231501, 263681, 272312, 199105, 189611, 177312, 171868, 221731, 240581, 272818, 214308, 145400, 141941, 244248, 312483]
8230C12483n4213q7367m4264O2823L3522l250O4255j1580k8769j8150K1303m03
8218B46390K3418r516j3134k2029J7164l8517M7905M65K5512j928m4355m2385
8206A88990r1938R494O2360L0804L6915O3851m0354m3402k4829J9471J9002o269
8194B24095l8978K7940l4952K857J2885Q134j7175o3590n6106j0850N1267K6554
8182A32081k8811O2331K2534J7877K5429k1927k4051q348l8361Q269n125K0757
8170A62655n4442l227N2587l3564k068Q8330J3318o6172j5546L1822L9970n746
8158B07917k2871m7864O434O5787o4725n6332l449J4184R3825N3992j4965k4346
8146B07587j1700L6028N764P5215m6542l1126P983L29j4534o2482j1597O4094
$$ y = [312483, 258270, 170903, 126639, 189462, 222984, 219734, 283989, 272409, 243640, 225490, 246793, 246390, 269808, 260292, 247158, 225129, 242293, 203776, 251681, 252146, 277658, 275730, 231375, 188990, 97052, 106546, 168906, 199710, 236625, 300476, 260122, 216720, 191891, 211362, 230364, 224095, 185117, 213057, 178105, 180962, 193847, 201981, 184806, 121216, 65110, 54260, 105527, 132081, 103270, 165601, 188135, 206012, 231441, 209514, 185463, 177115, 138754, 147023, 141898, 162655, 108213, 104986, 157573, 124009, 121941, 210271, 223589, 157417, 141871, 173693, 213663, 207917, 185046, 137182, 143616, 209403, 144678, 88346, 84897, 99081, 192906, 246898, 231933, 207587, 195887, 231915, 237679, 312894, 266352, 235226, 243209, 243538, 229004, 166522, 154925, 219019]
8134B19019r649j0539k7375k6518k0632p296j5378J934L7402P1377j9049p2169
8122A21127J8353Q530M1057K3067k4110m5012L7713N5424L3789K3248L9275N8568
8110C91029j9357r0986m7350L5569Q706n1649j2477J3J3627j8920L111R089n0705
8097A69700p9333M0457M5815j5327j4278Q707j444K8240j9444J5024O365m0819
8085A43663J3695M8877K9393K1874n7404n2734k2174R296L2766N9009J7406J6794
8073B60461O160N0731o7351m0022j1579L9446J0172k3839K1002j8798j2098P0389
8061B84674K8017J6673m0144n2653N309K9630l940k2615K1613K2675P1676J9639
8049C80554k8568n370k5180l9390n6680K9047J5527n5436j7376P225O6556Q7471
$$ y = [219019, 209370, 198831, 171456, 144938, 124306, 117010, 101632, 103566, 140968, 212345, 193296, 121127, 139480, 148010, 189067, 212134, 188024, 143012, 180725, 236149, 269938, 293186, 332461, 391029, 371672, 280686, 233336, 268905, 277611, 225962, 213485, 213498, 227125, 208205, 211316, 220405, 169700, 90367, 130824, 176639, 161312, 147034, 155741, 154297, 182537, 163093, 178117, 184482, 143663, 157358, 206235, 235628, 257502, 200098, 147364, 125190, 134486, 167252, 226261, 243667, 260461, 266621, 317352, 250001, 209979, 198400, 237846, 248018, 224179, 245181, 226383, 214285, 284674, 312691, 329364, 289220, 236567, 241876, 271506, 267566, 244951, 266564, 289239, 360915, 380554, 351986, 346616, 321436, 282046, 225366, 254413, 269940, 214504, 197128, 204353, 270909, 358380]
8037C58380j6763j4054M0104l2633l6863n8154M622p0320O698M1338L8198N997
8025B66550M7958m9265L7953K1989M1085J3974N4985N4825n0986m9532q1742k4253
8013B83541J6957j6039n939L3964L4835J4629L6103K6130J9948K4416J828k1441
8001D48932m1255k0263O062M8824M8746J6030J8390Q885P800L1227k2285m1130
7989E09963j3045r0982q0212j0867L0958j1819m2607o306M9066k5359l8407k0969
7977B49414L934k3813N7158P7192j7849l9130l875N960l4816l2843Q463m436J7153
7964B62512k8993M8560Q1871Q211k9837o2N7056O1807k1367K7194O6984M1915
7952E75851k1363j20595m7832M4130N6849m0955l4019L8913J3182N1850J9581
$$ y = [358380, 341617, 327563, 367667, 335034, 298171, 240017, 244639, 174319, 181017, 222355, 260553, 266550, 314508, 265243, 303196, 325185, 366270, 380244, 435229, 490054, 439068, 389536, 307794, 283541, 300498, 284459, 278520, 312484, 347319, 361948, 398051, 424181, 444129, 468545, 470373, 448932, 407677, 387414, 393476, 442300, 491046, 507076, 525466, 534351, 542151, 573378, 551093, 509963, 496918, 405936, 325724, 314857, 345815, 333996, 291389, 285083, 334149, 308790, 270383, 249414, 253348, 229535, 286693, 363885, 346036, 306906, 303031, 308991, 274175, 241332, 249795, 245359, 262512, 233519, 282079, 363950, 372161, 342324, 342262, 399318, 461125, 439758, 466952, 533936, 575851, 554488, 433893, 386061, 430191, 487040, 446085, 412066, 450979, 464161, 516011, 535592]
7941E35592l1803j04185k3329j6558o193l8800N8811m1880o4871K3162P4154N0491
7929D14591Q960k0220n9251l5638l6100J4055J057J9349O5509N0191m2791j1287
7917C68425j5019N718j2155K2824k002k2658K1976M357q847K5970l830K6059k0199
7904C90619j2929n301J2426R705k6078n8788L2143j0337m8111j1855k8175j6291
7892B27028O8990K4976j2779n736J3785K0523J2476r9614o4106j5585K5504l795
7880A91667m8681k1938J4015K99J9314j0004J7899L3608P940o9924j2232M4729
7868A66692P4212n6914r1728j9637P2525K9179L4838J5265n725L8016o0j5776
7856B40887k3181o503J9976N4667p742p1705k1064k0581J017R4420O27m9346p0586
$$ y = [535592, 503789, 399604, 376275, 359717, 353524, 314724, 373535, 331655, 266784, 289946, 364100, 414591, 423551, 403331, 344080, 308442, 272342, 286397, 287454, 306803, 372312, 422503, 379712, 368425, 353406, 359124, 346969, 369793, 367791, 345133, 367109, 371466, 362619, 388589, 384759, 410818, 390619, 377690, 372389, 384815, 394520, 368442, 309654, 341797, 331460, 283349, 271494, 243319, 227028, 296018, 320994, 308215, 302479, 316264, 336787, 349263, 249649, 185543, 169958, 195462, 191667, 142986, 121048, 135063, 135362, 154676, 144672, 162571, 196179, 204119, 134195, 121963, 166692, 240904, 183990, 92262, 72625, 145150, 174329, 209167, 224432, 218707, 256723, 256663, 240887, 217706, 211203, 231179, 285846, 278104, 206399, 185335, 164754, 165771, 260191, 260818, 211472, 140886]
7843A40886R377K1758m7269m1761m0727l321M4585j4878n162L4283O852l8252
7831F6371l2908O2462M7308l030j6217p563L2167M3922n3417j4501J0294J2209
7819A47097J9556L3345r9268q6172M8591M6435j5161K3042k3217l4230Q3805l2829
7807A10994n627J3031l585j315j1937L704l7839q388J0085R915k2668P397k8150
7794C5617R696M2230K0459j3530K6879l6998n5981J5400Q024N600q027k2008J1213
7781C8574N3263l0593j7821K0573M8542L502l4363l7293j1342k2290K40J3254
7769B4246O1117j0878K877J6487K8447K3839l3886k0316m361n0696l6353L1023
7757C1546L8050M321J1637L8645J6403l1874r3117m3178J9045P8094J9080j1267
$$ y = [140886, 150263, 172021, 124752, 82991, 42264, 38943, 83528, 68650, 63488, 97771, 104623, 66371, 33463, 95925, 143233, 140203, 123986, 116423, 148590, 192512, 139095, 124594, 134888, 147097, 166653, 199998, 100730, 14558, 63149, 109584, 94423, 117465, 94248, 60018, 143823, 110994, 105367, 118398, 114813, 113498, 101561, 105265, 67426, 59038, 69123, 79038, 56370, 63767, 35617, 45313, 87543, 108002, 94472, 121351, 84353, 28372, 43772, 51796, 57396, 49369, 27361, 38574, 91837, 61244, 43423, 63996, 112538, 116040, 81677, 44384, 33042, 10752, 10992, 24246, 85363, 74485, 77362, 93849, 122296, 146135, 112249, 91933, 87572, 36876, 523, 31546, 69596, 73917, 85554, 124199, 140602, 108728, 15611, -27567, -8522, 69572, 88652, 77385]
7745G7385j5207l6410M1558M339j7917p270M5759M059k5557o0510k1575k8941
7733d0287O993L8478l4998J1480J6641L1564M7730o180k4924m0561q639M2623
7721C9920J8098P3891q850j4820j9008K4110J3905k9190j9742j7993M6592Q199
7709A15112n9973o7940M195k7514k7505M4223N9829K5715j7653k9708K1760K0405
7697F0946o1566n9251j3581L3307J4594M4216M3743L4310J4382m5179r232j0963
7685D5726R96L958N4742J9166r4271j7336O8335J9413M1595j0290m8008J9731
7673A03757L1458P982p763L2464n9226o4380k6770Q677O8320O963K4967l2978
7661I3471j0586M6416j2683o8413Q689L3022j8945k5883J5724K5754m288l3528
$$ y = [77385, 62178, 25768, 67326, 71665, 53748, 46478, 92237, 96296, 70739, 10229, -11346, -40287, -33294, 5184, -29814, -18334, -1693, 29871, 77601, 71421, 46497, 5936, -2703, 39920, 58018, 131909, 123059, 108239, 89231, 113341, 127246, 98056, 78314, 60321, 106913, 115112, 55139, -12801, -8606, -36120, -63625, -19402, 40427, 66142, 48489, 18781, 40541, 60946, -620, -59871, -73452, -40145, -25551, 18665, 62408, 96718, 111100, 65921, 56689, 45726, 46722, 50680, 105422, 124588, 30317, 12981, 81316, 100729, 142324, 132034, 84026, 103757, 135215, 143197, 135434, 167898, 108672, 44292, 17522, 26199, 94519, 101482, 126449, 93471, 82885, 129301, 116618, 48205, 56894, 89916, 70971, 45088, 60812, 86566, 82278, 48750]
7649D8750K6590L7506k4592l8122N9363m6666m1361j0850J433L140k019J3188
7637B6360p167q6090Q607J4829K1985J3532q758L1710R87n9255l0007Q8529N0799
7624F6061l8658l870p4309n572M7415L8326L4229K2977M7772L1150l4686M850
7612A35685l3816J6209j5451q8976m36M9500L187n8774Q30J7555K1144J5919k9235
7599C3341J4572Q2185J4803p664l9839l2986N872L423J3330J4319M1022k3641
7587A18737j824o278l8510k1125m7576j0283M5359K2836K4066q1748j460j2257
7575a0063n7558N491L094L2026N3810J2711l9890m6595k1309L4950J6537J1006
7563e790n174J2779n124M5783L1329J7687M2674M3214m2112n1098o571M633l851
$$ y = [48750, 75340, 112846, 88254, 50132, 109495, 62829, 21468, 10618, 12051, 15191, 13172, 26360, 19193, -66897, -58290, -43461, -21476, -7944, -16702, 15008, 15995, -43260, -73267, 15262, 66061, 27403, 23533, -50776, -56348, -8933, 29393, 63622, 86599, 134371, 165521, 130835, 135685, 101869, 118078, 102627, 13651, 13215, 62715, 65902, 7128, 7958, 25513, 46657, 62576, 33341, 47913, 130098, 144901, 137237, 97398, 64412, 70284, 73707, 87037, 101356, 142378, 118737, 116913, 110635, 72125, 51000, 3424, -6859, 38500, 61336, 85402, 3654, 2194, -10063, -67621, -62130, -59036, -27010, 26800, 39511, -379, -46974, -68283, -33333, -16796, -5790, -10964, 1815, -3309, 42474, 73803, 91490, 134164, 177378, 135266, 84168, 77597, 82230, 78379]
7550G8379l1964k3898P0853L3093J6058m5084l4287k2052l9715l6707m9010K3006
7538f1328J22199Q5M0235L3588L1070m482m9573r4597p8448P506L2580k6699M8144
7525B80M4156l6271N055K4382O5648P848m0450o7846N8411O1085k304l460n5043
7512F1491r452k770k6751o8803k5189O7133K2238j01658M9203K2256N941O060
7500c01L4877K3550k0134k4415J7297J3554l9384q320k704Q293r591J752l937
7487i463M6237M2176r754n7674M356j153J5085l248k4002M3766N7000o3551q4991
7474d5216N6397j2658n3764L9810k118M3235J2096Q4446p3161q973K0699l656
7462E7137m2723p353m262J8301j2002L2492J2948J4019j1092p525m0972K7321
$$ y = [78379, 46415, 22517, 93370, 126463, 142521, 97437, 63150, 41098, 1383, -35324, -84334, -61328, 60871, 60956, 101191, 134779, 165849, 161367, 111794, 17197, -61251, -53745, -21165, -47864, 280, 44436, 8165, 13220, 37602, 103250, 111098, 70648, 2802, 61213, 122298, 119994, 116534, 61491, 52039, 49269, 22518, -46285, -71474, -4341, 17897, -83761, -34558, -12302, -6361, -301, 34576, 58126, 37992, 13577, 30874, 44428, 5044, -3276, -5980, 2313, -7278, -5526, -9463, 36774, 78950, 69196, 11522, 15878, 14725, 29810, 26562, 2560, 46326, 103326, 39775, -45216, 11181, -1477, -55241, -15431, -17549, 25686, 37782, 122228, 49067, 40094, 60793, 57137, 14414, 7061, 2799, 21100, 9098, 41590, 54538, 68557, 57465, 49940, 8968, 36289]
7450C6289K3472o5085k1452j7472j3843k4138j0218r812J8847M0668l4031r393
7438h6168K1517P323L6523J4910J5983K6706k2939Q129n343l8577P741m18N684
7425h929R283m8558J5943M577M6498m9976l9097k4612J9546J1076N7542N4384
7413D7677m8860p087L0928K9577L6731j6482l0342r1385j2490j0149O9269K9005
7401B6392o4513j7236N510L0394J6203M1605J0875M7924k4473k5279p4570n4158
7389h1326q100J8624m343k7921M7214O2695K237M3995r564k1485M2087r315J915
7376E6713l766L2352M6846m0308k1456J2448M5920q554J2361o3430j8871k7614
7364B2641l5326L8320J5223K2865M817J6070M207q526K3J1957J2785l4168l5215
$$ y = [36289, 59761, -5324, -26776, -44248, -58091, -82229, -92447, -102259, -83412, -42744, -76775, -86168, -64651, -57328, -20805, -5895, 10088, 36794, 13855, 21984, 16641, -21936, -14195, -14613, -8929, 354, -48204, -32261, -27684, 18814, -31162, -70259, -94871, -75325, -64249, -6707, 47677, -1183, -8270, 22658, 52235, 88966, 72484, 42142, -49243, -61733, -71882, -2613, 26392, -38121, -55357, -49847, -19453, -3250, 38355, 49230, 97154, 72681, 47402, -27168, -81326, -89426, -70802, -75145, -103066, -55852, 6843, 9080, 53075, 43511, 22026, 64113, 54798, 56713, 52947, 85299, 132145, 91837, 70381, 82829, 128749, 120195, 132556, 69126, 50255, 22641, -12685, 25635, 40858, 63723, 68540, 84610, 88817, 80291, 80314, 92271, 105056, 70888, 35673]
7351C5673K2397j3273l6789J4701l2413k3257K4260O397J5814O936J7290J4142
7339E1878n65q7128M120M9297j4638r469O0449L7506j5664k7477l6583n744M1014
7326D6996J486m0733m4549O8561J3358k3292o811l7559Q558Q433m5836J778Q313
7313d1297K7491K0173K6138r983N042R811k3072m0513K878j4087p635L0666P761
7300f627j9690k8141L3509O7445M102o5435k25K7974k8627m1634m6217j6255N3292
7287f6529N2473L6079P0781n6442l0677m8201p414L7501N4666L1308L1171K1382
7275A26098l9397k4676K7510o321n3735M7889M317k3140k669j6913k3695l2747
7263a7479k4604Q2424l0955n5002k9391m0337k3011O4766R5076K2285K0656l1681
$$ y = [35673, 58070, 44797, 8008, 22709, -9704, -32961, -8701, -2304, 13510, 20446, 37736, 51878, 51313, -35815, -31695, 17602, 2964, -6505, 53944, 91450, 75786, 48309, 11726, 5982, 46996, 48482, 7749, -36800, 31761, 45119, 21827, 15016, -22543, -13985, -5552, -51388, -49610, -41297, -13806, 6367, 32505, 22522, 27564, 37375, 14303, -26210, -23332, -37419, -45054, -14388, -6627, -26317, -54458, -20949, 46496, 50598, -14837, -15062, 12912, -15715, -57349, -103566, -119821, -66529, -14056, 22023, 92804, 36362, 5685, -42516, -49930, -12429, 42237, 73545, 104716, 126098, 86701, 62025, 89535, 83214, 29479, 77368, 81685, 58545, 55876, 38963, 15268, -17479, -42083, 40341, 9386, -45616, -75007, -115344, -138355, -73589, 21487, 43772, 64428, 32747]
$$ [...]
##END NTUPLES=NMR SPECTRUM
##END=
