##TITLE=Analysis number 326682
Compound Code cc 56324
Book Reference 513/44/30
Project Code adrs
Chemist Name ronp
##JCAMPDX= 6.0         $$ Bruker NMR JCAMP-DX V2.0
##DATA TYPE= NMR SPECTRUM
##DATA CLASS= NTUPLES
##ORIGIN= Bruker BioSpin GmbH
##OWNER= nmr
$$ XWIN-NMR		Version 3.5
$$ Mon Feb 19 09:08:31 2007 GMT Standard Time (UT+0h)  MAYBRIDGE\nmr@NMR_250MHZ
##.OBSERVE FREQUENCY= 250.131544655141
##.OBSERVE NUCLEUS= ^1H
##.ACQUISITION MODE= SIMULTANEOUS (DQD)
##.ACQUISITION SCHEME= undefined
##.AVERAGES= 16
##.DIGITISER RES= 18
##SPECTROMETER/DATA SYSTEM= dpx250
##.PULSE SEQUENCE= zg30
##.SOLVENT NAME= CDCl3
##.SHIFT REFERENCE= (INTERNAL, CDCl3, 0, 16.4473)
##AUDIT TRAIL= $$ (NUMBER, WHEN, WHO, WHERE, WHAT)
$$ ##TITLE= Audit trail, XWIN-NMR		Version 3.5
$$ ##JCAMPDX= 5.01
$$ ##ORIGIN= Bruker BioSpin GmbH
$$ ##OWNER= nmr
$$ C:\u/data/dgb/nmr/ADRS/1130/pdata/1/auditp.txt
$$ ##AUDIT TRAIL=  $$ (NUMBER, WHEN, WHO, WHERE, WHAT)
(   1,<2007-02-19 09:07:57.65 +000>,<MAYBRIDGE\nmr>,<NMR_250MHZ>,
      <created by zg, POWCHK disabled, PULCHK disabled
       configuration hash MD5:
       49 4B E0 1D 92 C2 6B 37 9F E6 65 BC 52 41 86 1D
       data hash MD5: 64K
       40 86 CE A8 15 68 79 59 BD 0A 7B F4 D6 D7 69 30>)
(   2,<2007-02-19 09:08:20.00 +000>,<MAYBRIDGE\nmr>,<NMR_250MHZ>,
      <Start of raw data processing
       ef LB = 0.3 FT_mod = 6 PKNL = 1 SI = 32K 
       data hash MD5: 32K
       09 A3 C5 A7 93 4A 25 B7 6B 37 FA 97 28 E2 8B 61>)
(   3,<2007-02-19 09:08:22.03 +000>,<MAYBRIDGE\nmr>,<NMR_250MHZ>,
      <apk 
       data hash MD5: 32K
       14 D8 C9 A8 25 2D 4D 06 FC 98 FE 5A A1 DA D1 41>)
(   4,<2007-02-19 09:08:22.70 +000>,<MAYBRIDGE\nmr>,<NMR_250MHZ>,
      <abs ABSG = 5 
       data hash MD5: 32K
       CF B0 81 81 23 5F 71 64 3B 1C B6 CD 7E 97 AD 4E>)
$$ ##END=
$$ 
$$ hash MD5
$$ 00 3B 85 5C 51 6B C2 3D E3 28 EC 1B FE 49 7B C3
##$RELAX= 
##$RELAX= 
##$RELAX= 
##$RELAX= 
##$RELAX= 
##$RELAX= 
##$RELAX= 
$$ Bruker specific parameters
$$ --------------------------
##$DU= <C:\u>
##$EXPNO= 1130
##$NAME= <ADRS>
##$PROCNO= 1
##$TYPE= <nmr>
##$USER= <dgb>
##$AMP= (0..31)
100 100 100 100 100 100 100 100 100 100 100 100 100 100 100 100 100 100 
100 100 100 100 100 100 100 100 100 100 100 100 100 100 
##$AQSEQ= 0
##$AQ_mod= 3
##$AUNM= <au_zg>
##$AUTOPOS= <31 >
##$BF1= 250.13
##$BF2= 250.13
##$BF3= 250.13
##$BF4= 250.13
##$BF5= 500.13
##$BF6= 500.13
##$BF7= 500.13
##$BF8= 500.13
##$BYTORDA= 1
##$CFDGTYP= 0
##$CFRGTYP= 5
##$CHEMSTR= <none>
##$CNST= (0..31)
1 1 145 1 1 1 1 1 1 1 1 1 1 1 1 1 1 1 1 1 1 1 1 1 1 1 1 1 1 1 1 1 
##$CPDPRG= <>
##$CPDPRG1= <>
##$CPDPRG2= <>
##$CPDPRG3= <>
##$CPDPRG4= <mlev>
##$CPDPRG5= <mlev>
##$CPDPRG6= <mlev>
##$CPDPRG7= <mlev>
##$CPDPRG8= <mlev>
##$CPDPRGB= <>
##$CPDPRGT= <>
##$D= (0..31)
0 1 0 0 0 0 0 0 0 0.06 0 0 0 0 0 0 0.0002 0 0 0 0 0 0 0 0 0 0 0 0 0 0 
0 
##$DATE= 1171876074
##$DBL= (0..7)
120 120 120 120 120 120 120 120 
##$DBP= (0..7)
150 150 150 150 150 150 150 150 
##$DBP07= 0
##$DBPNAM0= <>
##$DBPNAM1= <>
$$ [...]
##$SUBNAM7= <"">
##$SUBNAM8= <"">
##$SUBNAM9= <"">
##$SW= 20.6930455092707
##$SWIBOX= (0..15)
0 0 3 0 0 0 0 0 0 0 0 0 0 0 0 0 
##$SW_h= 5175.983436853
##$TD= 65536
##$TD0= 1
##$TE= 295.16
##$TE2= 300
##$TE3= 300
##$TEG= 300
##$TL= (0..7)
0 120 120 120 120 120 120 120 
##$TP= (0..7)
150 150 150 150 150 150 150 150 
##$TP07= 0
##$TPNAME0= <>
##$TPNAME1= <>
##$TPNAME2= <>
##$TPNAME3= <>
##$TPNAME4= <>
##$TPNAME5= <>
##$TPNAME6= <>
##$TPNAME7= <>
##$TPOAL= (0..7)
0.5 0.5 0.5 0.5 0.5 0.5 0.5 0.5 
##$TPOFFS= (0..7)
0 0 0 0 0 0 0 0 
##$TUNHIN= 0
##$TUNHOUT= 0
##$TUNXOUT= 0
##$USERA1= <user>
##$USERA2= <user>
##$USERA3= <user>
##$USERA4= <user>
##$USERA5= <user>
##$V9= 5
##$VALIST= <valist>
##$VCLIST= <CCCCCCCCCCCCCCC>
##$VD= 0
##$VDLIST= <DDDDDDDDDDDDDDD>
##$VPLIST= <PPPPPPPPPPPPPPP>
##$VTLIST= <TTTTTTTTTTTTTTT>
##$WBST= 1024
##$WBSW= 4
##$XGAIN= (0..3)
0 0 0 0 
##$XL= 0
##$YL= 0
##$YMAX_a= 379526
##$YMIN_a= -492060
##$ZGOPTNS= <>
##$ZL1= 120
##$ZL2= 120
##$ZL3= 120
##$ZL4= 120
##$ABSF1= 16.44728
##$ABSF2= -4.245892
##$ABSG= 5
##$ABSL= 3
##$ALPHA= 0
##$AQORDER= 0
##$ASSFAC= 0
##$ASSFACI= 0
##$ASSFACX= 0
##$ASSWID= 0
##$AUNMP= <proc_1d>
##$AZFE= 0.1
##$AZFW= 0.1
##$BCFW= 0
##$BC_mod= 0
##$BYTORDP= 0
##$COROFFS= 0
##$CY= 12.5
##$DATMOD= 1
##$DC= 0
##$DFILT= <>
##$DTYPP= 0
##$F1P= 14.0000005364418
##$F2P= -0.99999901652339
##$FCOR= 0.5
##$FTSIZE= 32768
##$FT_mod= 6
##$GAMMA= 0
##$GB= 0
##$INTBC= 1
##$INTSCL= 1
##$ISEN= 128
##$LB= 0.3
##$LEV0= 0
##$LPBIN= 0
##$MAXI= 10000
##$MC2= 0
##$MEAN= 0
##$ME_mod= 0
##$MI= 0
##$NCOEF= 0
##$NC_proc= -4
##$NLEV= 6
##$NOISF1= 0
##$NOISF2= 0
##$NSP= 0
##$NTH_PI= 0
##$NZP= 0
##$OFFSET= 16.44728
##$PC= 1
##$PHC0= 226.9016
##$PHC1= 8.036582
##$PH_mod= 1
##$PKNL= yes
##$PPARMOD= 0
##$PSCAL= 4
##$PSIGN= 0
##$REVERSE= no
##$SF= 250.130018688503
##$SI= 32768
##$SIGF1= 0
##$SIGF2= 0
##$SINO= 400
##$SIOLD= 32768
##$SREGLST= <1H.CDCl3>
##$SSB= 0
##$STSI= 32768
##$STSR= 0
##$SW_p= 5175.98343685301
##$SYMM= 0
##$S_DEV= 0
##$TDeff= 65536
##$TDoff= 0
##$TI= <Analysis number 999999
Compound Code 99
Book Reference 9
Project Code 9>
##$TILT= no
##$TM1= 0
##$TM2= 0
##$TOPLEV= 0
##$USERP1= <user>
##$USERP2= <user>
##$USERP3= <user>
##$USERP4= <user>
##$USERP5= <user>
##$WDW= 1
##$XDIM= 32768
##$YMAX_p= 589358935
##$YMIN_p= -239067
$$ End of Bruker specific parameters
$$ ---------------------------------
##NTUPLES= NMR SPECTRUM
##VAR_NAME=  FREQUENCY,     SPECTRUM/REAL,   SPECTRUM/IMAG
##SYMBOL=    X,             R,               I
##VAR_TYPE=  INDEPENDENT,   DEPENDENT,       DEPENDENT
##VAR_FORM=  AFFN,          ASDF,            ASDF
##VAR_DIM=   32768,         32768,           32768
##UNITS=     HZ,            ARBITRARY UNITS, ARBITRARY UNITS
##FACTOR=    0.157963299565203, 1,           1
##FIRST=     4113.95867483722, 0,            0
##LAST=      -1062.02476201579, 0,           0
##MIN=       -1062.02476201579, -239067,     0
##MAX=       4113.95867483722, 589358935,    0
$$ Real data points
##PAGE= N=1
##DATA TABLE= (X++(R..R)), XYDATA
$$ [...]
19649e5778J5990P9517M3403n507p635J0024M909l5960l818J4501k7854J0946
$$ -55778 -39788 39729 83132 77625 69990 80014 84923 48963 45145 59646 31792 42738
19637D2738N2215j0809o12m9730k0150j7113j0445j4096j5353j8700J7826K5027
$$ 42738 94953 84144 83532 33802 13652 -3461 -13906 -28002 -43355 -62055 -44229 -19202
19625a9202O928N6369q911J606l1673K3188j479n6428o6653k2609M5008N2664
$$ -19202 -12274 44095 35184 36790 5117 28305 26826 -29602 -96255 -118864 -73856 -21192
19613b1192j1268J2853J6723m8793k7462O5514J4609L5489J918j7797r90K205
$$ -21192 -32460 -19607 -2884 -51677 -79139 -13625 984 36473 38391 20594 19604 21809
19601B1809j8267k3096p5262m1280k2332N9196P5678M9762J9403L0819k4138K575
$$ 21809 3542 -19554 -94816 -136096 -158428 -99232 -23554 26208 45611 76430 52292 54867
19589E4867L6874K303k3670m6721j2421P4002J6494K6208N0418n9356n3463M5799
$$ 54867 91741 94044 70374 23653 11232 85234 101728 127936 178354 118998 65535 111334
19577A11334N2150m1123m5445k7658l527J4629K6028l6224J700K7873k894o9323
$$ 111334 163484 122361 76916 49258 45731 60360 86388 50164 51864 79737 76843 7520
19565G520j3359l2431J5732m497M3329o746Q6801J7506j4248Q0867j2301o5229
$$ 7520 -5839 -38270 -22538 -27035 16294 9548 96349 113855 99607 180474 168173 102944
19553A02944K089k246p941N8813J0238R477N8863N9481K1574j6747l086Q4399
$$ 102944 105033 102787 94846 153659 163897 173374 232237 291718 313292 296545 293459 377858
19541C77858R8675L2183O0410Q2205J9767j6440O5641k0268l2523j0504N1827
$$ 377858 476533 508716 569126 651331 671098 654658 720299 700031 667508 657004 708831
19530G08831N6263o861n5973r6969r3992m8538p26j2256J6756k8356o0132o6074
$$ 708831 765094 758233 702260 605291 511299 462761 462035 449779 466535 438179 378047 311973
19518C11973j3426N253j6724j12395q3722m596n3270l5570L2209j6224l3429j8684
$$ 311973 298547 303800 287076 174681 90959 86363 33093 -2477 29732 13508 -19921 -38605
19506c8605k52o435K3538k0240N1608N2916p743L0618L9956q9598r5333n8840
$$ -38605 -38857 -45292 -21754 -41994 9614 62530 54787 85405 125361 35763 -59570 -118410
19494a18410N3821J2150m2414k1558l545N8238O7836L6405l0385o510L5852q294
$$ -118410 -64589 -52439 -94853 -116411 -119956 -61718 6118 42523 12138 5628 41480 33186
19482C3186J4709j2793j1932o400o8425k7741O4942M1533l9436o096k4722N880
$$ 33186 47895 35102 23170 16770 -51655 -79396 -14454 27079 -12357 -18453 -43175 -37295
19470c7295M4488j4118n473M4360K0038l6367j2039j0533K4371R727n2798K6214
$$ -37295 7193 -6925 -12398 31962 52000 15633 3594 -6939 17432 27159 -25639 575
19458E75j6454k3984j5766M6455K2580j8207L8358Q1996L1790L2636j9133O748
$$ 575 -15879 -39863 -55629 -9174 13406 -4801 33557 115553 147343 179979 160846 167594
19446A67594q386K1670k0807k9598o2881M0022N7469K5865L4547o762l2269K7269
$$ 167594 159208 180878 160071 130473 67592 107614 165083 190948 225495 218733 186464 213733
19434B13733n697M4809k553K5361j6707j5000p2582o6793J5373j357k1598K6605
$$ 213733 208036 252845 250292 275653 258946 243946 171364 104571 119944 118587 96989 123594
19422A23594K9497j9R754J9946L8225j3902q485n4415m8851N3442L2612J2315
$$ 123594 153091 153072 162826 182772 220997 207095 198610 144195 95344 148786 181398 193713
19410A93713K1870L1257n357P66q071n5852M866N5819J9149k0056L6014J8650
$$ 193713 215583 246840 241483 242249 234178 178326 183192 239011 258160 238104 274118 292768
19398B92768o5172l62j4315J8045N9841O5009N476l1776m4885q2652Q246n0368
$$ 292768 227596 227234 212919 230964 290805 355814 361290 329514 284629 201977 210223 159855
19386A59855o6632J7117m591L5022O6226P7811l6685o7397p2497K2791k1288K681
$$ 159855 93223 110340 105749 140771 206997 284808 248123 180726 108229 131020 109732 112413
19374A12413k7346o0081r566J0461R101o3961m5352j3689K289L3197L4062K3791
$$ 112413 85067 24986 15420 25881 34982 -28979 -74331 -88020 -85731 -52534 -18472 5319
19362E319M7838m148q329J9359M5130o5274k8753N262j0151M6872K0113j2789
$$ 5319 53157 49009 40680 60039 105169 39895 11142 16404 6253 53125 73238 60449
19350F0449L1662Q355k1980j15408o2796J9681N7374M5172K8813n0532j2905L6852
$$ 60449 92111 100466 78486 -36922 -99718 -80037 -22663 22509 51322 790 -12115 24737
19338B4737K0028J8616K8750j2880L6390o2312n8996m3722J5244J8972J5370j6245
$$ 24737 44765 63381 92131 79251 115641 53329 -5667 -49389 -34145 -15173 197 -16048
19326a6048J9360L4957o2196l1010L7201r893n5449L7659O5348L4213l9073L785
$$ -16048 3312 38269 -23927 -54937 -17736 -27629 -83078 -45419 19929 54142 15069 18854
19314A8854m0256R326p992k0610K5530J0921p5558L870M4453M8090j2510k9874
$$ 18854 -21402 -12076 -20068 -40678 -15148 -4227 -79785 -75915 -31462 16628 4118 -25756
19302b5756o262j4817m5940n0685n92K3409M3605P2P604n626k5401Q627p040J4374
$$ -25756 -32018 -46835 -92775 -143460 -144052 -120643 -77038 -76966 -69362 -74988 -100389 -91762 -98802 -84428
19288h4428J6968o88j8367L4875O7038K9414m8602j5238M9168j2237k0476K0293
$$ -84428 -67460 -68148 -86515 -51640 15398 44812 -3790 -19028 30140 17903 -2573 17720
19276A7720n642r388J3728j7988q1891L253K4937N23m8739K2473K0873N7007P177
$$ 17720 12078 2690 16418 -1570 -83461 -80208 -55271 -54748 -103487 -81014 -60141 -3134 4043
19263D043M8683N0346m0110n7582m676K0178m0268M648M0613M0086l2208m148
$$ 4043 52726 103072 62962 5380 704 20882 -19386 -14738 25875 65961 33753 29605
19251B9605j4465n4510p541K5081k7867k2290L0108J1396n4841k8808r044J367
$$ 29605 15140 -39370 -46911 -21830 -49697 -71987 -41879 -30483 -85324 -114132 -123176 -121809
19239a21809N6912N0203P061l657l1974k4384J1089j0788J5076L9452N0173L9547
$$ -121809 -64897 -14694 -7633 -11290 -43264 -67648 -56559 -67347 -52271 -12819 37354 76901
19227G6901J0958j07157l4970K0989l5671L3486M8074N9203l3190K5249o412n1224
$$ 76901 87859 -19298 -54268 -33279 -68950 -35464 12610 71813 38623 63872 57460 6236
19215F236M5308R735k9607j8026m6614r333J0878K5693n9420K0843O7149l070
$$ 6236 51544 61279 31672 13646 -32968 -42301 -31423 -5730 -65150 -44307 22842 19772
19203A9772q067P469m0136N4366M2507l6860m6622N499k4366j3213k1595l8818
$$ 19772 11705 19174 -20962 33404 75911 39051 -7571 -2072 -26438 -39651 -61246 -100064
19191a00064K8069Q487M5596l3686k2620P1917Q5077Q302n4024k5682m2198J4601
$$ -100064 -71995 -63508 -17912 -51598 -74218 -2301 82776 91078 37054 11372 -30826 -16225
19179a6225j6156m8809l786m742j5195N4365M9166j3864K4662m957N381m7342
$$ -16225 -32381 -81190 -84976 -89718 -104913 -50548 -1382 -15246 9416 4459 9840 -37502
19167c7502k7698j238M3770O2367J9827J5306k1073j5686m121k4093J3423J2492
$$ -37502 -65200 -66438 -22668 39699 59526 74832 53759 38073 33952 9859 23282 35774
19155C5774k8042J8252j3954m959l0336j4762M591J8183K4563J9167K6509r285
$$ 35774 7732 25984 12030 7071 -23265 -38027 -33436 -15253 9310 28477 54986 45701
19143D5701J8345J1881K1221n6896m7564j0556M5730o821k8516k6200J8368k7970
$$ 45701 64046 75927 97148 40252 -7312 -17868 27862 21041 -7475 -33675 -15307 -43277
19131d3277K2353j0133N797j2115L37K3152M1457j3883n5691j4638M5379r672
$$ -43277 -20924 -31057 -25260 -37375 -37038 -13886 27571 13688 -42003 -56641 -11262 -20934
19119b0934j9583K3649J0383j2499L2681K9945k3908J3852k3861k4527k3773R977
$$ -20934 -40517 -16868 -6485 -18984 13697 43642 19734 33586 9725 -14802 -38575 -28598
19107b8598j032o7227j2641J5749M6384L0383K9435M0704k2311j17943q0722J2520
$$ -28598 -29630 -96857 -109498 -93749 -47365 -16982 12453 53157 30846 -87097 -167819 -155299
19095a55299N2036k0861O5581L9389J5151O9689j04853p496O8088P1588J2472
$$ -155299 -103263 -124124 -58543 -19154 -4003 65686 -39167 -46663 21425 93013 105485
19084A05485K5289k3298k9187N2463O1258J7280j516J0142L8130l1820K3156L5287
$$ 105485 130774 107476 78289 130752 192010 209290 207774 217916 256046 224226 247382 282669
19072B82669M3748l697l7584N152q32N135q898l0179N6941j1170l3252l6180l5458
$$ 282669 326417 322720 285136 290288 289456 294591 285693 255514 312455 301285 268033 231853 196395
19059A96395R907L5887J0518j0182J1028P3530P0583K5549K3291K8119l4044q8014
$$ 196395 206302 242189 252707 242525 253553 327083 397666 423215 446506 474625 440581 352567
19047C52567j04141m3082m3428R930n9410j5835p426j1466L8327K9454r985j685
$$ 352567 248426 205344 161916 171846 112436 96601 89175 77709 116036 145490 135505 133820
19035A33820K1844M4145L9375J0880r471N3174P7264L9597m6566Q260o059j1156
$$ 133820 155664 199809 239184 250064 240593 293767 371031 410628 364062 372322 366263 355107
19023C55107p4827P0125P8983L0451k6949K1070R303l0419p8991n3064l0444J5364
$$ 355107 280280 350405 429388 459839 432890 453960 463263 432844 353853 300789 270345 285709
19011B85709P6119O789k0003J6298j3015Q623Q6360J74930J57847N3433p3677
$$ 285709 361828 368617 348614 364912 351897 360520 446880 621810 779657 833090 759413
19000G59413m4589o5200r5966q5703j25344p1714l8966K230m9031n9392r8460
$$ 759413 714824 649624 553658 467955 342611 270897 231931 234161 185130 125738 27278
18989B7278Q072O5263M8348j2195m9614k5292K5109j7320P312k2798M2510L9694
$$ 27278 35350 100613 148961 136766 87152 61860 86969 69649 76961 54163 96673 136367
18977A36367p535j1590o3447j9659l5222P059O628m171K568J7283N2379q337l3981
$$ 136367 128832 117242 53795 34136 -1086 5973 12601 8430 10998 28281 80660 72323 38342
18964C8342m5321q1222L8221N2602j0537N9802O1837J2536O8491O4675M7914M9065
$$ 38342 -6979 -88201 -49980 2622 -7915 51887 113724 126260 194751 259426 307340 356405
18952C56405R581J636k597j13788r3899o668R47k3902m8179j7764k7250L558N871
$$ 356405 365986 367622 365025 251237 157338 150670 151617 127715 79536 61772 34522 38080 43951
18939D3951k0699K9801k2450J0458K3710J0383n6858l3929K5832J8567L9759k0065
$$ 43951 23252 53053 30603 41061 64771 75154 18296 -15633 10199 28766 68525 48460
18927D8460o2447N333K3814J5016j6671o9128K0338N3293q667p9673n6717J338
$$ 48460 -13987 -8654 15160 30176 13505 -55623 -35285 18008 9341 -70332 -127049 -125711
18915a25711k1455L1778m7433J9353P7408L1619j0165q914L3180q952J0L3777
$$ -125711 -147166 -115388 -162821 -143468 -66060 -34441 -44606 -53520 -20340 -29292 -29282 4495
18903D495L230j0446m9019r1390K3487J4082K3307J4392m338L1995M3741L8636
$$ 4495 7725 -2721 -51740 -143130 -119643 -105561 -82254 -67862 -72200 -40205 3536 42172
18891D2172N875k6536k6428j8218M4037j0432k0120j8323o77j5488l7009P0606
$$ 42172 48047 21511 -4917 -23135 20902 10470 -9650 -27973 -28650 -44138 -81147 -10541
18879a0541N270J7084M7636O3828M7837l8732l0822j342p0924m5728K9187K9913
$$ -10541 -5271 11813 59449 123277 171114 132382 101560 100218 29294 -16434 12753 42666
18867D2666K0942L3577j2641M288k7562m2171m068N573j6709M224K2820l446p6635
$$ 42666 63608 97185 84544 88832 61270 19099 15031 20604 3895 8119 30939 27493 -49142
18854d9142K8474P4045M4312k8898O228n1950N770K1648k0263M8939j8347n7030
$$ -49142 -20668 53377 97689 68791 75019 23069 28839 50487 30224 79163 60816 3786
18842C786K6797N9001j5753m7422m2546k7464k8968j9899N1535O4202j0729l6549
$$ 3786 30583 89584 73831 26409 -16137 -43601 -72569 -92468 -40933 23269 12540 -24009
18830b4009L335o15P2515K542p5504K822l192j0548L962M3998Q4262K5497k0247
$$ -24009 -20674 -21289 51226 53768 -21736 -18914 -22106 -32654 -28692 15306 99568 125065 104818
18817A04818Q1211n1187o2632q1419m1310m9504k3315p499Q0735O9404R608l7212
$$ 104818 186029 134842 72210 -9209 -50519 -100023 -123338 -130837 -50102 19302 28910 -8302
18805h302k626M0673K4433l4576k1601j9930k0457K8833O5372P2476k9319k8886
$$ -8302 -10928 29745 54178 19602 -1999 -21929 -42386 -13553 51819 124295 94976 66090
18793F6090J3878k6513j1391J06197K7755k9347K9126M4284N8171M2130j6045
$$ 66090 79968 53455 42064 148261 176016 146669 175795 220079 278250 320380 304335
18782C04335o0424m6540j4314j0506p081q463J529Q9897N1836m1710j9803J3686
$$ 304335 243911 197371 183057 172551 165470 157007 158536 248433 300269 258559 238756 252442
18770B52442J16616J26063J89291J38255N728o6892j32071j46992j84867q5529
$$ 252442 369058 495121 684412 822667 828395 761503 629432 482440 297573 212044
18760B12044n3816n9396N432l5663m2016O765K7606K8916K5483m5606n183k3237
$$ 212044 158228 98832 104264 68601 26585 33350 60956 89872 115355 69749 64566 41329
18748D1329r597J3025k745Q014l7358J12898M0199m4007J1405m781M1220j5776
$$ 41329 31732 44757 42012 50026 12668 125566 165765 121758 133163 128382 169602 153826
18736A53826N233J4611l6451k04M4066l4393l0452j3487P304k9895j1859K3732
$$ 153826 159059 173670 137219 137015 181081 146688 116236 102749 110053 80158 68299 92031
18724I2031N0859M5398L1229m2101P088r609m1696o3235o0380n977L8700m2419
$$ 92031 142890 188288 219517 177416 184504 174895 133199 69964 9584 3607 42307 -112
18712a12r300M1386m983Q711L0954P4604O4268k9777l2506J9818M4797q613J826
$$ -112 -9412 31974 26991 35702 66656 141260 205528 175751 143245 163063 207860 199247 201073
18699B01073j7023M1574k7126p304l8888J0421J6565l7635j3382M1871m4869L1373
$$ 201073 184050 225624 198498 191194 152306 162727 179292 141657 128275 170146 125277 156650
18687A56650P0219L1709j1887l9043j396N0660P723k0609M8741j0884Q445N3K61
$$ 156650 226869 258578 246691 207648 206252 256912 264635 244026 292767 281883 290328 290381 290642
18674B90642O605r4363l1892K5198P543N0580R6708N0438O4595L3428k8766l0627
$$ 290642 297247 202884 170992 196190 203733 254313 351021 401459 466054 499482 470716 440089
18662D40089K7688M3987l0562l4382O3127J45928N6537L0912L1998r237n1941
$$ 440089 467777 511764 481202 446820 509947 655875 712412 743324 775322 766085 714144
18651G14144j2458o237N2955l2212o1344o3659j0492K8306R859M5188K1438J5355
$$ 714144 701686 695449 748404 716192 654848 591189 580697 609003 618862 664050 685488 700843
18639G00843k8155q6523n2142p8126k930N5974m9532m4627K1803L1700J989k3683
$$ 700843 672688 586165 534023 455897 452967 508941 459409 414782 436585 468285 470274 446591
18627D46591j2402M1091K9922M838J7625N565J7789O8841J172j01054N15J02751
$$ 446591 434189 475280 505202 510040 527665 533230 551019 619860 621032 519978 520493 623244
18615F23244N1172R6645M7996j6984M1405R3804J02476K9993M097L4769j8673
$$ 623244 674416 771061 819057 802073 843478 937282 1039758 1069751 1073848 1108617 1089944
18604A089944O2396J61254R9592J42093J82752K69879K48409M02705M86718O63460
$$ 1089944 1152340 1313594 1413186 1555279 1738031 2007910 2256319 2659024 3145742 3809202
18594C809202J038227J411627J514635J311174O63638k38905p33537j016832p49528
$$ 3809202 4847429 6259056 7773691 9084865 9748503 9509598 8776061 7759229 7009701
18585G009701j60551O35881J430626K137102K913936L109140K704253K148230
$$ 7009701 6849150 7485031 8915657 11052759 13966695 17075835 19780088 21928318
18577B1928318J006698l98191j521439k560524k662194k046199j099891J22181
$$ 21928318 22935016 22536825 21015386 18454862 15792668 13746469 12646578 12768759
18569A2768759J336442K085228K353392J836679N14624o42527j818384k507889
$$ 12768759 14105201 16190429 18543821 20380500 20895124 20252597 18434213 15926324
18561A5926324k484440k188676j564315q37046l41214N087K50732M91856Q39813
$$ 15926324 13441884 11253208 9688893 8851847 8510633 8515720 8766452 9258308 10098121
18552A0098121J191962J673025K252879K912481L841696N469839Q213062J2038182
$$ 10098121 11290083 12963108 15215987 18128468 21970164 27440003 35653065 47691247
18544D7691247J5252589J6361272J3034200N295620k675095q061376p368573j600015
$$ 47691247 62943836 79305108 92339308 97634928 94959833 86898457 79529884 77929869
18536G7929869P859086K0147551L3627465M3639800L8848558J8445881l058209
$$ 77929869 85788955 105936506 139563971 183203771 222052329 240498210 237440001
18529B37440001j5864779j3885462o340476j0829023k2440647l0965010l0824065
$$ 237440001 221575222 207689760 201349284 190520261 168079614 137114604 106290539
18522A06290539k0291033q746340j483157K145600K852305k05055m303947q392582
$$ 106290539 85999506 77253166 75770009 77915609 80767914 80562859 76258912 67866330
18514F7866330j1184290j1078792r653368p455084n150475l493818k474164j734660
$$ 67866330 56682040 45603248 35949880 28494796 23344321 19850503 17376339 15641679
18506A5641679j286936j015220q71748p45150n95670l17445q4623J43571M43207
$$ 15641679 14354743 13339523 12467775 11722625 11126955 10809510 10724887 10868458 11311665
18497A1311665Q24448J313615J924254L021035M628195P135024J1013872J5480130
$$ 11311665 12136113 13449728 15373982 18395017 23023212 30158236 41172108 56652238
18489E6652238J8052869J5865106R889902M950119L005446R07469n548809j3765419
$$ 56652238 74705107 90570213 100460115 105410234 108415680 109323149 103774340 90008921
18481I0008921j9270549j8294961j3151257q499792o031816m886201m155537l302179
$$ 90008921 70738372 52443411 39292154 30792362 24760546 19874345 15718808 12416629
18473A2416629k366291j659089j193859q49595o88446m64076k95326j78584p8398
$$ 12416629 10050338 8391249 7197390 6347795 5659349 5195273 4899947 4721363 4642965
18464D642965j18446j12108q7601k28324k39512j84503j88779k30610k54100j75868
$$ 4642965 4524519 4412411 4324810 4096486 3856974 3672471 3483692 3253082 2998982 2823114
18454B823114j03781L5804M4678J30062K36608K19211L77806N93677Q15870J139126
$$ 2823114 2719333 2755137 2799815 2929877 3166485 3385696 3763502 4357179 5173049 6312175
18444F312175J727948K752180M126203N060421M736235K911211R40262q2787m73915
$$ 6312175 8040123 10792303 14918506 19978927 24715162 27626373 28566635 28483848 28009933
18435B8009933j535152l271982m801253m976080l983315k625318j707571j176493
$$ 28009933 26474781 23202799 18401546 13425466 9442151 6816833 5109262 3932769
18427C932769o97038m67323l80625l38725j93087j62584j62236j35522p2432N194
$$ 3932769 3235731 2768408 2387783 2049058 1855971 1693387 1531151 1395629 1323197 1328391
18417A328391J9679m0369j400l2206l2072r1720r4510q2797n6371n4197m8412
$$ 1328391 1348070 1307701 1306301 1274095 1242023 1150303 1055793 972996 916625 862428 814016
18406H14016K3556O6908Q2933P5573J4104J6274l974Pj02852j64978p0933n1100
$$ 814016 837572 904480 987413 1062986 1077090 1093364 1089390 1089397 986545 821567 750634 699534
18394F99534q0687p9551l2002n6796j5507n353j778j694j4428K1608j9944q0272
$$ 699534 618847 539296 507294 450498 434991 429638 427860 426166 411738 433346 413402 333130
18382C33130j09603l3345M0199P4245r149K722L7878K6742o2374r100n984R215
$$ 333130 223527 190182 230381 304626 295477 298199 336077 362819 300445 291345 285361 294576
18370B94576l7495L3770m7453r046N6967M4774K8694r35K5723P5492K0923J2945
$$ 294576 257081 290851 243398 234352 291319 336093 364787 363852 389575 465067 485990 498935
18358D98935j8823P8674O0941o1394j1120J4807p88n0766m614k671l3880l6357
$$ 498935 480112 558786 619727 558333 547213 562020 561232 510466 505852 503181 469301 432944
18346D32944k1107N1739M082j4590K685n2246O847k1922l9941n7451l0692K5087
$$ 432944 411837 463576 467658 453068 455753 403507 410354 388432 348491 291040 260348 285435
18334B85435J7631J12894J36810N5042r5926m3724J4341l6228M380l6378m2792
$$ 285435 303066 415960 552770 607812 511886 468162 482503 446275 450655 414277 371485
18323C71485m2165q439m8127L746p34P795K1957J8667J2955j06160o3116j8424
$$ 371485 329320 320881 272754 276500 275766 283561 305518 324185 337140 230980 167864 149440
18311A49440J17k3804k3297N2577J0286m6839K7778M6645N9410L129o8986L5476
$$ 149440 149557 125753 102456 155033 165319 118480 146258 192903 252313 255442 186456 221932
18299B21932K3323p6533K1460L5571P2886m74j8407L4139m150l5972R49j281L6300
$$ 221932 245255 168722 190182 225753 298639 298165 279758 313897 309747 273775 274724 273443 309743
18286C09743M1140Q5866J4327m7971o0135k8529q7425J4950K0439n584J2732k5271
$$ 309743 350883 436749 451076 403105 342970 314441 227016 241966 262405 256821 269553 244282
18274B44282q2730k3617L3702L9554L4242o9973m6159P394q066j6942J6918M9718
$$ 244282 161552 137935 171637 211191 245433 175460 129301 136695 128629 111687 128605 178323
18262A78323J1604q854O4915O6116L5798P546m4012K8228l1276O64K5720J1682
$$ 178323 189927 181073 245988 312104 347902 355448 311436 339664 308388 309052 334772 346454
18250C46454m4692p8523k3160k2051r734k03k0984Q0367q198m5186k4737m7345
$$ 346454 301762 223239 200079 178028 168294 168091 147107 227474 219276 174090 149353 102008
18238A02008M7167P574l025N335Q0959O3883M922p5214l3290p306J2716K5422
$$ 102008 149175 156749 153724 159059 240018 303901 308823 233609 200319 193013 205729 231151
18226B31151K7504j3294n6101k8463p1400l8631K0152N8039O2337R089l1059L6018
$$ 231151 258655 245361 189260 160797 89397 50766 70918 128957 191294 200383 169324 205342
18214B05342L3580N4714L6107o566k5388j1835j2661j7681l3161m2054l1325L8356
$$ 205342 238922 293636 329743 323177 297789 285954 273293 255612 222451 180397 149072 187428
18202A87428J75k6170K2198j2881K6722J9341n8682n0516J2527K6233k8956j1098
$$ 187428 187603 161433 183631 170750 197472 216813 158131 107615 120142 146375 117419 106321
18190A06321o570L0729N0274L7110Q116L6664N4989M3973J8438J8033k8979o9230
$$ 106321 99751 130480 180754 217864 225980 262644 317633 361606 380044 398077 369098 299868
18178B99868m3044l9500R134J2550K0401K9205m4570o5850K9355K9529P3305j6427
$$ 299868 256824 217324 226458 239008 259409 288614 244044 178194 207549 237078 310383 293956
18166B93956J466q7401j2099O7488N1434K2738J528J2129J3610J9934O8122M8583
$$ 293956 295422 208021 195922 263410 314844 337582 339110 351239 364849 384783 452905 501488
18154E01488J0962L4215j8265m2452j8298K3421k1451k1528O120O2300J5883J4477
$$ 501488 512450 546665 528400 485948 467650 491071 469620 448092 454212 516512 532395 546872
18142E46872j9338J1645K3106K3921k7202j6826j1586Q7350J15970J17268J42668
$$ 546872 527534 539179 562285 586206 559004 542178 530592 617942 733912 851180 993848
18131I93848J05252R2024J56277J67364J51750J56333J82387J52296K19327K34774
$$ 993848 1099100 1191124 1347401 1514765 1666515 1822848 2005235 2157531 2376858 2611632
18121B611632M14313M47259O27147R01493J238595J651184K360040L548382N649533
$$ 2611632 3025945 3473204 4100351 5001844 6240439 7891623 10251663 13800045 19449578
18112A9449578R356911J6096380K7276453L6619639K0720454n396633k6845755
$$ 19449578 28806489 44902869 72179322 108798961 129519415 124122782 97277027
18105I7277027l4592409k3687150j3144068p581546m624833l023546k088936j459831
$$ 97277027 62684618 38997468 25853400 18271854 13647021 10623475 8534539 7074708
18097G074708j055631q81747p07780m94904l68451l48263l19289j57238j13058
$$ 7074708 6019077 5137330 4429550 3934646 3566195 3217932 2898643 2741405 2628347
18088B628347j08058k1384r2270m0237J0170N4759Q8440J14721J58434J76115
$$ 2628347 2520289 2498905 2406635 2366398 2376568 2431327 2519767 2634488 2792922 2969037
18078B969037J59574J97578L13808M05783N82079R40972J273521J619876K013345
$$ 2969037 3128611 3326189 3639997 4045780 4627859 5568831 6842352 8462228 10475573
18069A0475573K746756M048193O501933J0661664J7427789K5004365K2729854
$$ 10475573 13222329 17270522 23772455 34434119 51861908 76866273 99596127
18062I9596127O427176j1706065k3769575k3044655j5271814r024355n471447
$$ 99596127 106023303 94317238 70547663 47503008 32231194 23206839 17735392
18055A7735392l460164k166796j397013p90944o63157o01270m69671l51971j77979
$$ 17735392 14275228 12108432 10711419 9920475 9257318 8656048 8186377 7834406 7656427
18046G656427J23883M11614P44886J123122J748097K477363L193749M186471N904377
$$ 7656427 7780310 8191924 8936810 10059932 11808029 14285392 17479141 21665612 27569989
18037B7569989R103690J4680526K4007374L7973559M9302801L5946238J498701
$$ 27569989 36673679 51354205 75361579 113335138 162637939 198584177 200082878
18030B00082878l1174414m7787415m0711668k5869925j5632833r701563o169915
$$ 200082878 168908464 121121049 80409381 54539456 38906623 29205060 23035145
18023B3035145l878121k512695j880026j670282j571057j393959j092433p97226
$$ 23035145 19157024 16644329 14764303 13094021 11522964 10129005 9036572 8239346
18015H239346n42275j56520Q6253L40366O66175J148069J584965J997561L012744
$$ 8239346 7697071 7540551 7626804 7967170 8633345 9781414 11366379 13363940 16376684
18006A6376684M908546Q054630J3301638K0724712K4184435J3403767m462554
$$ 16376684 21285230 29339860 42641498 63366210 87550645 100954412 96491858
17999I6491858j9342835k4164431j8236783j0978900o579608m131315k682926
$$ 96491858 77149023 52984592 34747809 23768909 17189301 13057986 10375060
17992A0375060j717698j179373r49241q39949p48323o88867n33187l82591k37181
$$ 10375060 8657362 7477989 6528748 5688799 4940476 4251609 3718422 3335831 3098650
17983C098650j82133j10068j08295o4374j39892j95786j89982k05311k04919j60456
$$ 3098650 2916517 2806449 2698154 2633780 2493888 2298102 2108120 1902809 1697890 1537434
17973A537434j27252j01766j17106k4481j02321j10389p6293q1486o0659J841
$$ 1537434 1410182 1308416 1191310 1166829 1064508 954119 877826 796340 735681 737522
17963G37522l3098k2769k0764l7846k3126r1k4765p2566l8595K4013K8541j3693
$$ 737522 704424 681655 660891 623045 599919 599828 575063 502497 463902 487915 516456 502763
17951E02763L4879m1941r3887o3242J0488M0051k5347Q574k996J9935k2319N8433
$$ 502763 537642 495701 401814 338572 349060 389111 363764 372338 369342 389277 366958 425391
17939D25391Q6519l8051l5282O2451L4413k9974K9820N7453n941K934j7883o1498
$$ 425391 511910 473859 438577 501028 535441 505467 535287 592740 586799 589733 571850 510352
17927E10352j21163n4285L6176P778j5126n4555o4714j3970n7382L0853J0395
$$ 510352 389189 334904 371080 378858 363732 309177 244463 230493 173111 203964 214359
17916B14359J799j4971N8150J0150n1069n2200o9059j3489j0960K9153M6368P2308
$$ 214359 216158 201187 259337 269487 218418 166218 97159 83670 72710 101863 148231 220539
17904B20539N705n0801p357Q945m6938m8102K8733M8453n5042K0741N7625L7396
$$ 220539 226244 175443 168086 177031 130093 81991 110724 159177 104135 124876 182501 219897
17892B19897k8209L517j4360p5739l9074P4548j7939n5282l4291j224J1207L98
$$ 219897 191688 195205 180845 105106 66032 140580 122641 67359 33068 31844 43051 43449
17880D3449J7966R2096K4269j0663l7459m652P2193k1346J1262K8551l9438q768
$$ 43449 61415 153511 177780 167117 129658 125006 197199 175853 187115 215666 176228 167460
17868A67460k5329m8002l6407M6099L0660k4670m302j5607M311k1151l1696k5474
$$ 167460 142131 94129 57722 103821 134481 109811 105509 89902 94213 73062 41366 15892
17856A5892K4919J3320n0665o2742M7381N4731r132K3922O6860L3561Q634K5545
$$ 15892 40811 54131 3466 -59276 -11895 42836 33704 57626 124486 158047 166681 192226
17844A92226l5391l8653j8371M7300O1048o3375m9009O758j6308O0551L758l8701
$$ 192226 156835 118182 99811 147111 208159 144784 95775 102533 86225 146776 150534 111833
17832A11833q5J2291n512n1892j9096J6679n3819o000M8098M0452K8112k189m8692
$$ 111833 111748 124039 118527 66635 47539 64218 10399 4399 52497 92949 121061 118872 70180
17819G0180k3080M8311J9742l1484M5912k7337m3401k0852n8177j9193K2591Q296
$$ 70180 47100 95411 115153 83669 129581 102244 58843 37991 -20186 -39379 -16788 -8492
17807h492O725Q433r266r248J262l7771j0448K5820r591L5041M391n3200L3629
$$ -8492 -1767 6666 -2600 -11848 -10586 -48357 -58805 -32985 -42576 -7535 -3144 -56344 -22715
17794b2715O9741P7432K5874m2656l2779j8730m9582J5406N7098R655j4120j6102
$$ -22715 47026 124458 150332 107676 74897 56167 6585 21991 79089 88744 74624 58522
17782E8522r1198o4460L0492J4845M6313K6407o899m224P6254K6456P519o1011
$$ 58522 -32676 -97136 -66644 -51799 -5486 20921 14022 9798 86052 112508 120027 59016
17770E9016n2341l074J9272M6253j1516q850l2072n3560J2669K2908q830P0304
$$ 59016 6675 3601 22873 69126 57610 48760 16688 -36872 -24203 -1295 -10125 60179
17758F0179P3289j5387p764J4382o0605o4704J6954k4830K7320N3774n506j4513
$$ 60179 133468 118081 110317 124699 64094 -610 16344 -8486 18834 72608 67102 52589
17746E2589p262J3022j1112k2134R306J004L3987l609J1626m1832l1426L1224
$$ 52589 45327 58349 47237 25103 34409 35413 69400 65791 77417 35585 4159 35383
17734C5383M7163K2366N9023k1481q103P454L5735m8283q0766p966L6057j4654
$$ 35383 82546 104912 163935 142454 134351 141805 177540 129257 48491 40525 76582 61928
17722F1928q964j0993o090n0416J3809N0987O783j9097n2055P505N9780l0903
$$ 61928 52964 41971 35881 -14535 -726 50261 57044 37947 -14108 -6603 53177 22274
17710B2274m9813n1618K8430O045l1925p5593q6867J435K8623R3382O6658L5212
$$ 22274 -27539 -79157 -50727 -44682 -76607 -152200 -239067 -237632 -209009 -115627 -48969 -13757
17698a3757L6990M13K6077J10n7112n5674p8332j3686J12728P6256K8186M3646
$$ -13757 23233 23646 49723 49833 -7279 -62953 -141285 -154971 -42243 34013 62199 105845
17686A05845j3960n8651L9652Q993l6134r316p2640n1654K6834L463M6786L2084
$$ 105845 91885 33234 72886 81879 45745 36429 -36211 -87865 -61031 -57568 -10782 21302
17674B1302m218L6065J8879n6586N246N5008j298l0270L0529P888n1988j8126
$$ 21302 17084 53149 72028 15442 20688 75696 74398 44128 74657 82545 30557 12431
17662A2431l1448K0038P6125N0559Q124p500j03364r1541J4279O5403Q4811M3279
$$ 12431 -19017 1021 77146 127705 135829 128329 24965 -66576 -52297 13106 97917 141196
17650A41196m8970o2920n5887l7561K8835M6955J1630R59l0828K36L5095L9254
$$ 141196 92226 29306 -26581 -64142 -35307 11648 23278 24237 -6591 -6355 28740 67994
17638F7994J710L0532J3749k1522q2873R646K8582n5658o1247K4937M7776j9636
$$ 67994 69704 100236 113985 92463 9590 19236 47818 -7840 -69087 -44150 3626 -16010
17626a6010o0940m2064L6661N9781M8284J127O837j8638l4852L6633R075O478
$$ -16010 -76950 -119014 -82353 -22572 25712 26839 33676 15038 -19814 16819 25894 32372
17614C2372l5882n7209L3138P0300L6118L8126N289p7298k4276j2851J1575O8255
$$ 32372 -3510 -60719 -27581 42719 78837 116963 122252 44954 20678 7827 19402 87657
17602H7657M7170o9780j1598m736L1964j0752l1658j0265l3987j2673J672Q800
$$ 87657 134827 65047 53449 48713 80677 69925 38267 28002 -5985 -18658 -16986 -8186
17590h186L6501K8417l1444k6312K2112m804R918j9911J4645Q09O6910N277p9
$$ -8186 28315 56732 25288 -1024 21088 16284 26202 6291 20936 21745 88655 93932 93853
17577I3853l1576l4602l7211l9731l5372K2454P1482N6866l5601K6492Q9295j07895
$$ 93853 62277 27675 -9536 -49267 -84639 -62185 9297 66163 30562 57054 146349 38454
17565C8454j20301m1250L3017O2332O182R825M6281o9120l9257K965l8803o0641
$$ 38454 -81847 -123097 -90080 -27748 -21566 -11741 34540 -34580 -73837 -70872 -109675 -170316
17553a70316L0503K5904J14070N1357j5779j2664l8858j8556l2581L3504M9388
$$ -170316 -139813 -113909 161 51518 35739 23075 -15783 -34339 -66920 -33416 15972
17542A5972j6431p1466J1851J14716P3374p027n957j323n452L410L0760o653j9605
$$ 15972 -459 -71925 -60074 54642 128016 120989 115032 113709 108257 111667 142427 135774 116169
17529A16169K2647R1999R0485P2429P9275K4110j03519j44169r4264l0469m6051
$$ 116169 138816 230815 321300 393729 473004 497114 393595 249426 155162 124693 78642
17518G8642n2626n5592P181L8630L8805P2826M3125m1656p4268m0901n791o104
$$ 78642 26016 -29576 -22395 16235 55040 127866 170991 129335 55067 14166 8375 2271
17506B271j0448K1187j3541J6779O0686L863P8864Q4282J04190J24433K08453
$$ 2271 -8177 13010 -531 16248 76934 80797 159661 243943 348133 472566 681019
17495F81019K07038J13182j00762j95957k21328j11254j12656j40958m8051J6809
$$ 681019 888057 1001239 900477 704520 483192 371938 259282 118324 70273 87082
17485H7082K2477K1828L2595l8158l889j5558J6906o3310k4983m3247k8981M8865
$$ 87082 109559 131387 163982 125824 121935 106377 123283 59973 34990 -8257 -37238 11627
17473A1627K48K4311O569K3659P1703O9833J3404O4860J14715J05006L0400n0951
$$ 11627 11875 36186 42755 66414 138117 207950 221354 286214 400929 505935 536335 485384
17461D85384q4529q4983j08390o9578j8198l3628l946L4617P715n4006J1349J4869
$$ 485384 400855 315872 207482 137904 119706 86078 82132 116749 124464 70458 81807 96676
17449I6676k8364O8181M9086M1239K7052R5597J40381J45588L8450p7609j52473
$$ 96676 68312 136493 185579 226818 253870 349467 489848 635436 673886 596277 443804
17438D43804j40951j21654o3187l1217q3335L5176P284j121p380N2n411l1080
$$ 443804 302853 181199 118012 86795 3460 38636 45920 44799 37419 37471 32060 980
17426I80j2283o912m0600l3523M3399J8684K8285J4828m0258m9220L4331M7989
$$ 980 -11303 -18215 -58815 -92338 -48939 -30255 -1970 12858 -27400 -76620 -42289 5700
17414E700K392Q466J7928P2016R958n8085o1995m6954j5197L7348J2206k1673
$$ 5700 8092 16558 34486 106502 116460 58375 -3620 -50574 -65771 -28423 -16217 -37890
17402c7890r966J6554O9255K9223m0912k8998l3451K1549N3519o6555k7183j8901
$$ -37890 -47856 -31302 37953 67176 26264 -2734 -36185 -14636 38883 -27672 -54855 -73756
17390g3756l8752J6637M0107K1785K1657K7918n5046n0489L9332m504L138l135
$$ -73756 -112508 -95871 -55764 -33979 -12322 15596 -39450 -89939 -50607 -55111 -51973 -55108
17378e5108K2202k2441L6862O1371R030l0953m4829k1318M7760O3935l2869j8885
$$ -55108 -32906 -55347 -18485 42886 51916 20963 -23866 -45184 2576 66511 33642 14757
17366A4757m824J3261j405N007j7473J1923L663l0130k3993j1392K1118l6118
$$ 14757 9933 23194 21789 26796 9323 21246 24909 -5221 -29214 -40606 -19488 -55606
17354e5606l6129N4214J3666M9211j2380j7631n1241J6762m0152k7359m2746J7517
$$ -55606 -91735 -37521 -23855 25356 12976 -4655 -55896 -39134 -79286 -106645 -149391 -131874
17342a31874N3422P5194O4782J7823o7708k2106K942L3176L2467k6454k9147K0927
$$ -131874 -78452 -3258 61524 79347 11639 -10467 -7525 25651 58118 31664 2517 23444
17330B3444l68J7141m3527K1100p621n6497l9361J6818M9251j5346P388L4383
$$ 23444 23076 40217 -3310 17790 10169 -46328 -85689 -68871 -19620 -34966 -27578 6805
17318F805j5300k7753J4224L1892l4465m213J9266R687N0258p972k1540j6508
$$ 6805 -8495 -36248 -22024 9868 -24597 -28810 -9544 143 50401 42429 20889 4381
17306D381K5578k6404L141m9520J9174M030n0945k6469K216J3811O4988M4156
$$ 4381 29959 3555 6696 -42824 -23650 -19620 -70565 -97034 -94818 -81007 -16019 28137
17294B8137k6358n1510J3191Q5085L9169j9084k9133l5511L9221N4816N393j4445
$$ 28137 1779 -49731 -36540 48545 87714 68630 39497 3986 43207 98023 103416 88971
17282H8971n2771J0022M0532p460J359J1300N037m3356k705q981l2479O175J9895
$$ 88971 36200 46222 86754 79294 80653 91953 96990 53634 50929 41948 9469 15644 35539
17269C5539q777J0185l2431l4886N9147J6554k6140L2637N969l8559l459L7846
$$ 35539 26762 36947 4516 -30370 28777 45331 19191 51828 57797 19238 15779 53625
17257E3625N1021q0166o1410j2459M6287M5386r416p3441r0019M3658Q4869k2078
$$ 53625 104646 24480 -36930 -49389 -3102 42284 32868 -40573 -130592 -86934 -2065 -24143
17245b4143n2210n8562k0582N6505K7141M7312Q3300K6284k4118N989l6987p8030
$$ -24143 -76353 -134915 -155497 -98992 -71851 -24539 58761 85045 60927 66916 29929 -48101
17233d8101M7149J8194K5718m955J6518J7027M148m3745n2398J8186j1587k3317
$$ -48101 -952 17242 42960 38005 54523 71550 75698 31953 -20445 -2259 -13846 -37163
17221c7163j2393J1524m263P726N8027M0593o4721J4135J6144k5161n4813K9619
$$ -37163 -49556 -38032 -42295 -34569 23458 64051 -670 13465 29609 4448 -50365 -20746
17209b0746P20J1056j2142K4754l4397j191N5336K3460O342m861k2511r095p530
$$ -20746 -20026 -8970 -21112 3642 -30755 -31946 23390 46850 53192 48331 25820 16725 9195
17196I195l458R506l4865p0251M6360M5901n474M6292L2126k7156l361q062k2847
$$ 9195 5737 15243 -19622 -89873 -43513 2388 -3086 43206 75332 48176 44815 36753 13906
17183A3906l9183j9691m0520n0113k1376N3100R8680L198M4110M5395n647p9077
$$ 13906 -25277 -44968 -85488 -135601 -156977 -103877 -5197 -1999 42111 87506 81859 2782
17171B782L169O9068N6977L2721m4704j06638K9547M2013l0876j9942j381J415
$$ 2782 5951 75019 131996 164717 120013 13375 42922 84935 54059 34117 32736 34151
17159C4151O2766P2779j1045l2788n3847l3812P1115K0330p9936j2941J0703J5789
$$ 34151 96917 169696 158651 125863 72016 38204 109319 129649 49713 36772 47475 63264
17147F3264n8655l0049j4508L3237r991O470k9557o0070k7104L2002P7652o849
$$ 63264 4609 -25440 -39948 -6711 -16702 -10232 -39789 -99859 -126963 -94961 -17309 -24158
17135b4158o1759L9971O685J3247m0752K549L4285J9545r972J4869m5366L3508
$$ -24158 -85917 -45946 -39261 -26014 -66766 -64217 -29932 -10387 -20359 -5490 -50856 -17348
17123a7348J8591L0873o500o835L5999K313p9329o7468J3596O2727M2133N5935
$$ -17348 1243 32116 25616 18781 54780 57093 -22236 -89704 -76108 -13381 28752 84687
17111H4687m1940k5623k0254l3167q2443j8532k632L9380L1294K0049J7954m7727
$$ 84687 42747 17124 -3130 -36297 -118740 -137272 -139904 -100524 -69230 -49181 -31227 -78954
17099g8954k1567L8573L8427M2464m1052P23K4222L2864q085m9708J0478P8056
$$ -78954 -100521 -61948 -23521 18943 -22109 -21386 2836 35700 27615 -22093 -11615 66441
17087F6441O526m0815R707l691o696k3081r83K1301J0468J1867m2641m1208R210
$$ 66441 72967 32152 41859 38168 31472 8391 7408 28709 39177 51044 8403 -32805 -23595
17074b3595j6705J3127K6608j4825k0978L1114M4389K5172J0653r9958k4735M7627
$$ -23595 -40300 -27173 -565 -15390 -36368 -5254 39135 64307 74960 -24998 -49733 -2106
17062b106P153K2008J1567M831j974r4180J389J7441n414n207M1343K0270M207
$$ -2106 5047 27055 38622 43453 41479 -52701 -51312 -33871 -39285 -44492 -3149 17121 21328
17049B1328k5607l8185k636l1089L4042j7349J4840P0849J0521K0802K5288N722
$$ 21328 -4279 -42464 -45100 -76189 -42147 -59496 -44656 26193 36714 57516 82804 88526
17037H8526p275o621p9146k2653o2816l2285L2936J2223N7444J2050L5920Q631
$$ 88526 81251 74630 -4516 -27169 -89985 -122270 -89334 -77111 -19667 -7617 28303 36934
17025C6934o2929J5710K5435j0040o932K2883j292j1290l8500l5554L2674L2452
$$ 36934 -25995 -10285 15150 5110 -1822 21061 19769 8479 -30021 -65575 -32901 -449
17013d49M7366m2220m8998m8995K8831j831L6131M2475l7945l5755n6768n6334
$$ -449 46917 4697 -44301 -93296 -64465 -66296 -30165 12310 -25635 -61390 -118158 -174492
17001a74492L0536r74N1947N1915Q039L0369J9501N2723j2284j09051n9223N7571
$$ -174492 -143956 -144930 -92983 -41068 -33029 -2660 16841 69564 57280 -51771 -110994 -53423
16989e3423L0079j2090P394j2966q582K9011K5958n7224L5958p821j3112n6530
$$ -53423 -23344 -35434 -28040 -41006 -49588 -20577 5381 -51843 -15885 -23706 -36818 -93348
16977i3348l7761L0599Q2561J2432m6782L5036J0816J9686J0441j3446K2072K7883
$$ -93348 -131109 -100510 -17949 -5517 -52299 -17263 -6447 13239 23680 10234 32306 60189
16965F0189r2337q7125L7029J4592J0536K8261l1016n523N1153L3034k0482j3612
$$ 60189 -32148 -119273 -82244 -67652 -57116 -28855 -59871 -65394 -14241 18793 -1689 -15301
16953a5301m2995j967K8677M76J5914M7366j4376p0663k2510l5307M2477J4388
$$ -15301 -58296 -60263 -31586 -31110 -15196 32170 17794 -52869 -75379 -110686 -68209 -53821
16941e3821k2040p136j3677M654P064k762K9832O0749J6266n6345k7023M5071
$$ -53821 -75861 -82997 -96674 -92020 -84956 -87718 -57886 2863 19129 -37216 -64239 -19168
16929a9168l3557N116J0728n6063l4929J1839P5102K5404q1741m2883M048L5151
$$ -19168 -52725 -47609 -36881 -92944 -127873 -116034 -40932 -15528 -97269 -140152 -136104 -100953
16917a00953N5312k1284J7821L3861l7447K2607J687k4185L5694k1868m3372L8940
$$ -100953 -45641 -66925 -49104 -15243 -52690 -30083 -28396 -52581 -16887 -38755 -82127 -43187
16905d3187O6972J3663M3727m3302k3543L5775m2294l5551Q644j7143J4745N8755
$$ -43187 23785 37448 81175 37873 14330 50105 7811 -27740 -19096 -36239 -21494 37261
16893C7261M6658l7468j6788P594n4704m0004L033N9351K4358M9697N096k5150
$$ 37261 83919 46451 29663 37257 -17447 -57451 -54418 4933 29291 78988 84084 58934
16881E8934p0029m5758K0391j4086Q000L0934L459k5063K5186N2589n756m9045
$$ 58934 -11095 -56853 -36462 -50548 -42548 -11614 -8155 -33218 -8032 44557 38801 -10244
16869a0244l733k086J0432m164J6634p737l150l3286M894M5673j8747m877r360
$$ -10244 -13977 -16063 -5631 -9795 6839 -898 -4048 -37334 -32440 13233 -5514 -10391 -19751
16856a9751j0565j4018K79o8006q361M8853K554m7567J6634Q0358J3333n0024
$$ -19751 -30316 -44334 -44055 -112061 -120422 -71569 -69015 -116582 -99948 -19590 -6257 -56281
16844e6281j4108q408j278M2927O7763j9475l6721o170M688l1801o8996J5598
$$ -56281 -70389 -78797 -80075 -37148 30615 11140 -25581 -31751 -27063 -58864 -127860 -112262
16832a12262N6748L0532K8744k6442n5036k6056M0380O7752l2494M493O4152r593
$$ -112262 -55514 -24982 3762 -22680 -77716 -103772 -63392 4360 -28134 -23641 40511 30918
16820C0918m073N597l3515n7568l7312K3734O0003N644j2665O36m2579m1500Q354
$$ 30918 26845 32442 -1073 -58641 -95953 -72219 -12216 -6572 -19237 -18601 -61180 -102680 -94326
16807i4326O5082N9871R7682n285p9288n9187J2470j4521m787l3667L1221M6327
$$ -94326 -29244 30627 128309 123024 43736 -15451 -2981 -17502 -22289 -55956 -24735 21592
16795B1592R085k079J0719k862o4105o0585K7063J06513L9570l1881r73m89l0598
$$ 21592 30677 28598 39317 36455 -27650 -88235 -61172 45341 84911 53030 52057 51568 20970
16782B0970k4142K9335J9619o3748j02128O908L4461O4192N5540J8146j2251n7456
$$ 20970 -3172 26163 45782 -17966 -120094 -113186 -78725 -14533 41007 59153 46902 -10554
16770a0554o0533j6948l7770P9454N0968m6477Nl601j5197K3118k7902J1481K1294
$$ -10554 -71087 -88035 -125805 -46351 4617 -41860 -41855 -45456 -60653 -37535 -65437 -53956 -32662
16757c2662P722j7601M085o3751m4784L1910O4620L218J2412k245j8626j2505
$$ -32662 -24940 -42541 -38456 -102207 -146991 -115081 -50461 -47243 -34831 -37076 -55702 -68207
16745f8207O0050P716n252r0536l563k5286O536R668m792Q3184L5796K029l8691
$$ -68207 -8157 -441 -5693 -96229 -99792 -125078 -118542 -108874 -113666 -30482 5314 7343 -31348
16732c1348k0827O5441R82k3266O149k1980k0956k1360L7131K7007L063r725m9525
$$ -31348 -52175 13266 14248 -9018 -2869 -24849 -45805 -67165 -30034 -3027 36 -9689 -59214
16719e9214J3308K3205l9467K2830q8610k4663L1719L0230J7719j1095K2960K3150
$$ -59214 -45906 -22701 -62168 -39338 -127948 -152611 -120892 -90662 -72943 -84038 -61078 -37928
16707c7928M1227L8044q319k1865L4722k6758K5891l285j589l9104l0941m7998
$$ -37928 3299 41343 33024 11159 45881 19123 45014 41729 40140 1036 -29905 -77903
16695g7903l0118p463k3559J1936k4363P8993J5361K27M2529q3767J6401k8854
$$ -77903 -108021 -115484 -139043 -127107 -151470 -72477 -57116 -56889 -14360 -98127 -81726 -110580
16683a10580M2185Q7177J9094q0920l4595J8388k0023l8676M9612L3574j2098
$$ -110580 -68395 18782 37876 -43044 -77639 -59251 -79274 -117950 -68338 -34764 -46862
16672d6862J7397j8844m17N8138J01730Q305m6463N331r3764j7840M0720J8181
$$ -46862 -29465 -48309 -48726 9412 111142 119447 72984 78315 -15449 -33289 7431 25612
16660B5612n33p358k7698n3281p337k4847J291K2837L190J412n1907j7673L7784
$$ 25612 25079 17721 -9977 -63258 -70595 -95442 -94151 -71314 -68124 -66712 -118619 -136292 -98508
16647i8508K654N8865O0975L5669O9557m5537m5214o6203j4111K5584j9967L7690
$$ -98508 -95854 -36989 23986 59655 129212 83675 38461 -27742 -41853 -16269 -36236 1454
16635A454k0094k8417L1274j9595l7427K7931M3066L4851K343k5957K921J5644
$$ 1454 -18640 -47057 -15783 -35378 -72805 -44874 -1808 33043 35386 9429 12350 27994
16623B7994k4955m4040l094J5451m5020n861L0283M2745J1138q268k1758L1742
$$ 27994 3039 -41001 -44095 -28644 -73664 -79525 -49242 -6497 4641 -3627 -25385 6357
16611F357N8633J1006m3068K363M3386n6062m5806o4474q471j959L7217P0694
$$ 6357 64990 75996 32928 35291 78677 22615 -23191 -87665 -96136 -98095 -60878 9816
16599I816N2294j991l0916p44N517l3505k7759k5400K7718K1543j0234l1065l5437
$$ 9816 62110 60119 29203 28459 33976 471 -27288 -52688 -24970 -3427 -13661 -44726 -80163
16586h0163k9114N341R5171O8083j975n7690l5342M8399K716k8988j1840N5955
$$ -80163 -109277 -103936 -8765 59318 57343 -347 -35689 12710 15426 -13562 -25402 30553
16574C0553l7448m4133n505L3421L6392k9348M8282L6724L4668m3513q8324q913
$$ 30553 -6895 -51028 -56533 -23112 13280 -16068 32214 68938 103606 60093 -28231 -37144
16562c7144M7754J7359M1983K5953o2603n9616J17k960m8439K6494m238m941K2533
$$ -37144 10610 27969 69952 95905 33302 -26314 -26197 -29157 -77596 -51102 -55340 -60281 -37748
16549c7748N3801K9295k7167l8246k8422R95l0396m2166k84J907M0001R2081N4502
$$ -37748 16053 45348 18181 -20065 -48487 -47492 -77888 -120054 -120338 -118431 -78430 13651 68153
16536F8153L0328m0558n3908k995J8548n4891j7408k543J4536l5598K9681P9730
$$ 68153 98481 57923 4015 1020 19568 -35323 -52731 -55274 -40738 -76336 -46655 33075
16524C3075L9994p0349m9066K6596j0016O513J5105M1216O208l827l5939l2098
$$ 33075 73069 2720 -46346 -19750 -29766 -23253 -8148 33068 39276 35449 -490 -32588
16512c2588j4139L7007K9694j7655n0874l6012K4528N2139M1667Q678R646M1674
$$ -32588 -46727 -9720 19974 2319 -48555 -84567 -60039 -7900 33767 42445 52091 93765
16500I3765o7111o058L607o8054k014K9172k1806J980L2333N0349N7267K1415
$$ 93765 26654 20596 24203 -43851 -45865 -16693 -38499 -36519 -4186 46163 103430 124845
16488A24845o549q1588n9303o2816K8066P6518M6267q195j9082j3311O723R440
$$ 124845 118296 36708 -22595 -85411 -57345 19173 65440 57245 38163 24852 31575 41015
16476D1015N2445N040j3628l6885l3803k2443n2471J0688N234L06j228j2302m058
$$ 41015 93460 98500 84872 47987 14184 -8259 -60730 -50042 -44808 -44502 -45730 -58032 -62090
16463f2090K7464l5483m4797o97J0474J6994J6903J1604K8861K1534K7646m3628
$$ -62090 -34626 -70109 -114906 -115603 -105129 -88135 -71232 -59628 -30767 -9233 18413 -25215
16451b5215Q292J3185q127O0835m6413P550L3704l8374p9531K9673R9557J0389
$$ -25215 -16923 -3738 -11865 48970 2557 10107 43811 5437 -74094 -44421 55136 65525
16439F5525l4667m1695J789N3667l7259p8146q288j5938K2919L7118j2916k6803
$$ 65525 30858 -10837 -9048 44619 7360 -70786 -79074 -95012 -72093 -34975 -47891 -74694
16427g4694j9730j9713M114M7234N9038J7471j0986m0342p0338l3228K2320M2499
$$ -74694 -94424 -114137 -110023 -62789 -3751 13720 2734 -37608 -107946 -141174 -118854 -76355
16415g6355L1437M280L3280M995M2515M466l0452P522M1852q1776n0663O9971
$$ -76355 -44918 -40638 -7358 -2363 40152 44618 14166 21688 63540 -18236 -68899 1072
16403A072L8454k327k9063m420J172L7527O531k221j8640k3117k1293j7646J7025
$$ 1072 39526 37199 8136 3716 4888 42415 48946 46725 28085 4968 -16325 -33971 -16946
16390a6946l1251n4841K628K7992J907M900M5066K0758k3617j8252k0284J1714
$$ -16946 -48197 -103038 -100410 -72418 -70511 -65611 -20545 213 -23404 -41656 -61940 -50226
16378e0226K9847l6780M8227K0099J004P855j5060p1274r623j9894p643P5797
$$ -50226 -20379 -57159 -8932 11167 12171 20026 4966 -66308 -75931 -95825 -103468 -27671
16366b7671j404r4485K3469P7114j5020k6834J5379r536J7086K1565M5569J5279
$$ -27671 -29075 -123560 -100091 -22977 -37997 -64831 -49452 -58988 -41902 -20337 25232 40511
16354D0511j3464L90l0950K624J1257l8176q1047l9997J13282P4140Q052m5324
$$ 40511 27047 27437 -3513 -889 10368 -27808 -108855 -148852 -35570 38570 46622 1298
16342A298l1859j617n7102o5262K8562N284L4486L8162J7121l0524m9859J05213
$$ 1298 -30561 -32178 -89280 -154542 -125980 -120696 -86210 -48048 -30927 -61451 -111310 -6097
16330f097K7779j0453m0455m3249k2861j1051P2364M4189p416K908K2621n2250
$$ -6097 21682 11229 -29226 -72475 -95336 -106387 -34023 10166 2750 5658 28279 -23971
16318b3971M2589o458k7786k1590K7054l7159J5535M4379N395k2778l2890L8346
$$ -23971 18618 12160 -15626 -37216 -10162 -47321 -31786 12593 17988 -4790 -37680 666
16306F66K6122o1360j6250M4525R877l2691k0852k3153M8183L767j4797r756l9576
$$ 666 26788 -34572 -50822 -6297 3580 -29111 -49963 -73116 -24933 -21166 -35963 -45719 -85295
16293h5295n4221M8285R5954K9246K5000N8570m0844J4574J426q317j8859k0175
$$ -85295 -139516 -91231 4723 33969 58969 117539 76695 91269 92695 84378 65519 45344
16281D5344n3127K1094l6809o8181J116J0166J6873k5683k2381j3909L8284M1584
$$ 45344 -7783 13311 -23498 -91679 -90563 -80397 -63524 -89207 -111588 -125497 -87213 -45629
16269d5629q865L1739r276K7566K5411J4822J0878l1870O3617j3525m2034j8895
$$ -45629 -54494 -22755 -32031 -4465 20946 35768 46646 14776 78393 64868 22834 3939
16257C939K6157j2885r663k1111l841O2133q28J996k8397j8804k1948n19k3827
$$ 3939 30096 17211 7548 -13563 -17404 44729 43901 45897 17500 -1304 -23252 -23771 -47598
16244d7598j0379k4473N9873j2334K1207o005o3212J0145K9865k638m5924k1605
$$ -47598 -57977 -82450 -22577 -34911 -13704 -19709 -82921 -72776 -42911 -45549 -91473 -113078
16232a13078J8898j5400M3124P7481l5021k6332N0421M982p6310M0524J0715k0568
$$ -113078 -94180 -109580 -66456 11025 -23996 -50328 93 5075 -71235 -30711 -19996 -40564
16220d0564J3936M8330K2492J7318m9514o7283O4113R047n1952n6868k4803n9536
$$ -40564 -26628 21702 44194 61512 11998 -55285 8828 17875 -34077 -90945 -115748 -175284
16208a75284M0035R9713M7441k6666j8398j3094P2644J6606L40l1238j1713N273
$$ -175284 -135249 -35536 11905 -14761 -33159 -46253 26391 42997 43337 12099 386 5659
16196E659K800k8234l4507l9975P287J8367J0288p181J1400k7409O923K1132j7289
$$ 5659 8459 -19775 -54282 -94257 -86970 -68603 -58315 -65496 -54096 -81505 -74582 -53450 -70739
16183g0739l5278l042N1229k9422j8613K0732M3274L1027J953m2764M7114K971
$$ -70739 -106017 -109059 -57830 -87252 -105865 -85133 -41859 -10832 -8879 -51643 -4529 -1558
16171a558q611j7479L4803q233p6379L0529N2181M1270l1216m1457k5019j2091
$$ -1558 -10169 -27648 7155 -1078 -77457 -46928 5253 46523 15307 -26150 -51169 -63260
16159f3260J3039J564N41k9618k147O9638J8498r644L4504Q538l7185q9740n1003
$$ -63260 -50221 -48657 -48116 -77734 -79881 -10243 8255 -1389 33115 41653 4468 -85272 -136275
16146a36275N2169K7149l7757M6203J6551l0602j882m3754K1197L6446M8767r72
$$ -136275 -84106 -56957 -94714 -48511 -31960 -62562 -64444 -108198 -87001 -50555 -1788 -2760
16134b760k6692o502J3706L3642K2167n9410p4072q106R7187M9212J5843P6586
$$ -2760 -29452 -35954 -22248 11394 33561 -25849 -99921 -108027 -10840 38372 54215 130801
16122A30801q4057q7799p9022J2894K8526l9953N037P9308J0189K5842O363n8809
$$ 130801 46744 -41055 -120077 -107183 -78657 -118610 -113573 -34265 -24076 1766 8129 -50680
16110e0680K4532L1916M1472k8779o052N0199O97j8515K5993L8138l8238o7788
$$ -50680 -26148 5768 47240 18461 12409 62608 63305 44790 70783 108921 70683 2895
16098B895L0048L2036j1451q5326K7013j1927J8111l8557J4687L6249O4031Q547
$$ 2895 32943 64979 53528 -31798 -4785 -16712 1399 -37158 -22471 13778 77809 86356
16086H6356n6251J74j8641r789L9316M453p623n7749o5351K7209J7700K5621k4133
$$ 86356 30105 30279 11638 1849 41165 45618 37995 -19754 -85105 -57896 -40196 -14575 -38708
16073c8708j4965L6060R6266K728o3191J7851k5692o3406n2001L0640M7847l7168
$$ -38708 -53673 -17613 78653 81381 18190 36041 10349 -53057 -105058 -74418 -26571 -63739
16061f3739M3812L2456k6182l163m6034q50K9661Q45j2925L9629K7851m8530l8155
$$ -63739 -19927 12529 -13653 -16816 -62850 -63700 -34039 -33194 -46119 -6490 21361 -27169 -65324
16048f5324k9962L6008j3212k254N1137J0920k4563k4562N653M6461J1207p0381
$$ -65324 -95286 -59278 -72490 -74744 -23607 -12687 -37250 -61812 -56159 -9698 1509 -68872
16036f8872m4294K3162O6833O0477l1054R522j6799n9118k2649j5847K7207J0496
$$ -68872 -113166 -90004 -23171 37306 6252 15774 -1025 -60143 -82792 -98639 -71432 -60936
16024f0936n001N4665K6621l6614l389k1337L8631k1061K2122L7244K2516j0493
$$ -60936 -65937 -11272 15349 -21265 -24654 -45991 -7360 -28421 -6299 30945 53461 42968
16012D2968J0966l9698m9490K5821m4052l9607k3656M1083K5849o006N0146j4063
$$ 42968 53934 14236 -35254 -9433 -53485 -93092 -116748 -75665 -49816 -55822 -5676 -19739
16000a9739m233O049M7871N1760Q223K3877K3379j0611k0017k3793q522j0456
$$ -19739 -23972 -17923 29948 81708 89931 113808 137187 126576 106559 82766 74244 63788
15988F3788o0785p1635O949L7591K941l6005m689j447R833K8061j0650O7012r763
$$ 63788 3003 -68632 -61683 -24092 -21151 -57156 -61845 -63292 -53459 -25398 -36048 30964 21201
15975B1201J7385N3081m0072n3208m0302k0336n1454K5459J1561J855J8952l207
$$ 21201 38586 91667 51595 -1613 -41915 -62251 -113705 -88246 -76685 -74830 -55878 -59085
15963e9085n9642j00663L2370O1905P834j2957L8464N6510N7268K5016M311m1823
$$ -59085 -118727 -219390 -187020 -125115 -117281 -130238 -91774 -35264 22004 47020 51331 9508
15951I508l7414m9134J9568m4653M3504L7001N5849k8157j8618j4704j0601M4814
$$ 9508 -27906 -77040 -57472 -102125 -58621 -21620 34229 6072 -12546 -27250 -37851 6963
15939F963l5149k7127N1897l4582Q5N8657p153k7910J8942l824j5595o6905M4765
$$ 6963 -28186 -55313 -3416 -37998 -37913 20744 13591 -14319 4623 799 -14796 -81701 -36936
15926c6936N4800j493J6671k8530P109p453Q798Q825N982J8406j8048J2357o4436
$$ -36936 17864 16371 33042 4512 11621 4168 12966 21791 27773 46179 28131 40488 -23948
15913b3948n2909K972L392J6034M4956j7506j5703L5963J9094m7222j550m2944
$$ -23948 -76857 -73885 -70493 -54459 -9503 -27009 -42712 -6749 12345 -34877 -36427 -79371
15901g9371P793K6425N499O2740k7850l3932K4798q633m8050j306R474J7712m994
$$ -79371 -71578 -45153 -39654 23086 -4764 -38696 -13898 -22531 -70581 -71887 -62413 -44701 -49695
15888d9695L5923N682J0504M6630K7453k1696M8526J8169l4833r456o9181m2071
$$ -49695 -13772 -8090 2414 49044 76497 54801 103327 121496 86663 77207 8026 -34045
15876c4045J4053j0786j9276j3347K111J0110j0950M9178J1514o733J6050L4141
$$ -34045 -19992 -30778 -50054 -63401 -61290 -51180 -62130 -12952 -1438 -8171 7879 42020
15864D2020J4772K7468k52J2994K709r615m8723r142o0041l232k2041o1122J9621
$$ 42020 56792 84260 84008 97002 99711 90096 41373 32231 -27810 -31042 -53083 -114205 -94584
15851i4584P3172K5819j3704n6453k7470J7014N5905J7905l9073k1634L5400N8854
$$ -94584 -21412 4407 -9297 -65750 -93220 -76206 -20301 -2396 -41469 -63103 -27703 31151
15839C1151J5960o4757r457J2190m8454j5666P4060K8438J3167P0375L193m7695
$$ 31151 47111 -17646 -27103 -14913 -63367 -79033 -4973 23465 36632 107007 110200 62505
15827F2505q5105m1148k1671j0851O4921N7119j8822K4223j5515q732n1909j111
$$ 62505 -22600 -63748 -85419 -96270 -31349 25770 6948 31171 15656 6924 -44985 -46096
15815d6096n5987j8956k2810m0241j0538Q4720K5935K0030L22O4149n0576m0817
$$ -46096 -102083 -121039 -143849 -184090 -194628 -109908 -83973 -63943 -63621 528 -50048 -90865
15803i0865K2393M2737J0842l3350n52l2754J4612J3727o4440M3965K8070K0942
$$ -90865 -68472 -25735 -14893 -48243 -48795 -81549 -66937 -53210 -117650 -73685 -45615 -24673
15791b4673J5515Q4728k4239n7966k3707J4398J3649L08M7061l6316r3979l0533
$$ -24673 -9158 75570 51331 -6635 -30342 -15944 -2295 -1987 45074 8758 -85221 -115754
15779a15754q213O8231O995l6981m4013o3424N0130R4872O2678K657K7494m3416
$$ -115754 -123967 -55736 -48741 -85722 -129735 -193159 -143029 -48157 14521 17178 44672 1256
15767A256j7064k0467p637K2524l690p768j9093K8640J563l3689o5307p198J5605
$$ 1256 -15808 -36275 -43912 -21388 -25078 -32846 -51939 -23299 -21736 -55425 -120732 -127930 -112325
15754a12325J8388P6780J9514o0920R808M3709O6724Q107K6760K2146k3044o0328
$$ -112325 -93937 -17157 2357 -58563 -48755 -5046 61678 69785 96545 118691 95647 35319
15742C5319m9775k0273l98M5331N1697J6293K9349q845j13115o2777J9213J2704
$$ 35319 -14456 -34729 -35127 10204 61901 78194 107543 98698 -14417 -77194 -57981 -45277
15730d5277M6164P2050N526o3741m2717J2803J5201l1995l7550N2998K2517j4781
$$ -45277 887 72937 78463 14722 -27995 -15192 9 -31986 -69536 -16538 5979 -8802
15718h802J2888J1859k1104m2186p450K7384k7182J2834K8696m613O855J4918
$$ -8802 4086 15945 -5159 -47345 -54795 -27411 -54593 -41759 -13063 -17676 -10821 4097
15706D097n0491n9204j0296M0525m60k2213n729N2744L3548l0739J4641M7918
$$ 4097 -46394 -105598 -115894 -75369 -75829 -98042 -103771 -51027 -17479 -48218 -33577 14341
15694A4341O2404J5811l9864m6640j6757k0401O8124l9818J4382N3258J9497k728
$$ 14341 76745 92556 52692 6052 -10705 -31106 37018 -2800 11582 64840 84337 81609
15682H1609L172j3603m0538j1807l5125M0148J0406L4594L7971R141K3199n6308
$$ 81609 84781 71178 30640 18833 -16292 23856 34262 68856 106827 115968 139167 82859
15670H2859l0159k0343k7570L1696M1513j065p8118P286K8577K662p000j8731
$$ 82859 52700 32357 4787 36483 77996 76931 -1187 6099 34676 37338 30338 11607
15658A1607j7338l7921n9941R622L3443P0273j2228L2077l5905q02m576N8628
$$ 11607 -5731 -43652 -103593 -93971 -60528 9745 -2483 29594 -6311 -7113 -11689 46939
15646D6939J5605K271j0914o124N1246j9913o0776p918K4845O733j8520o5368
$$ 46939 62544 64815 53901 47777 99023 79110 18334 10416 35261 41994 23474 -41894
15634d1894K0169O1809j8477J4925m1639l2678q369L011J1764J3899k646o894
$$ -41894 -21725 40084 21607 36532 -5107 -37785 -46154 -43143 -31379 -17480 -20126 -27020
15622b7020L3284k0546M2870J7371N395J0979m4400l8232j0765p2245l6968M8128
$$ -27020 6264 -14282 28588 45959 51354 62333 17933 -20299 -31064 -103309 -140277 -92149
15610i2149O1902J5864l2805m647l4559J3915L7910Q2623J6627J6747J700l1060
$$ -92149 -30247 -14383 -47188 -51835 -86394 -72479 -34569 48054 64681 81428 83128 52068
15598E2068m3144n7437k1993M1914M2894j5167j8064j7969J6141n112k2638P6624
$$ 52068 8924 -48513 -70506 -28592 14302 -865 -18929 -36898 -20757 -25869 -48507 28117
15586B8117J9739q7520k1932N9171j3164M153N2186q5917M455p971Q441q579k1435
$$ 28117 47856 -39664 -61596 -2425 -15589 -11436 40750 -45167 -40712 -48683 -40242 -48821 -70256
15573g0256P0852O5236k641j4717j6308M4357L1030o6200k9511J1095m2706L284
$$ -70256 596 65832 63191 48474 32166 76523 107553 41353 11842 22937 -19769 -16485
15561a6485L2000q072M950L833l8922J5127n6240l5356N3859K899m4043l3448
$$ -16485 15515 7443 12393 16226 -22696 -7569 -63809 -99165 -45306 -42407 -86450 -119898
15549a19898R1581K3895k6663N2621K0432r6962p5785L6913O3788J00385J3175
$$ -119898 -28317 -4422 -31085 21536 41968 -54994 -130779 -93866 -30078 70307 83482
15538H3482n2013r5763L3365P6730o385o7780j7607J419J853n2220l0887Q0366
$$ 83482 31469 -64294 -30929 45801 39416 -28364 -45971 -44552 -42699 -94919 -125806 -45440
15526d5440K0079n375K430j2204K4198L9585r536j3910l6611j0084J1384j972
$$ -45440 -25361 -30736 -28306 -40510 -16312 23273 13737 -173 -36784 -46868 -35484 -37456
15514c7456q527j8131N696K5588J8162L4897q543l5571r664J0351K580j7727j6142
$$ -37456 -45983 -64114 -58418 -32830 -14668 20229 11686 -23885 -33549 -23198 -20618 -38345 -54487
15501e4487K5483l0877M1142J7194j0845j3492m4076k1645M5875M9390J943l5231
$$ -54487 -29004 -59881 -18739 -1545 -12390 -25882 -69958 -91603 -45728 3662 5605 -29626
15489b9626K383L4222R379k7964k6194L693K9733k9671L6017J1754L815j5127
$$ -29626 -27243 6979 16358 -11606 -37800 -34107 -4374 -34045 1972 13726 17541 2414
15477B414m6987j9348K4085P085K4085J1352k3141n2882k644j9355k1522J1932
$$ 2414 -44573 -63921 -39836 -32751 -8666 2686 -20455 -73337 -75981 -95336 -116858 -104926
15465a04926K7033K7868L8727j8188o858L1072P5062J2571m9607o3364P1374j39
$$ -104926 -77893 -50025 -11298 -29486 -36344 -5272 69790 82361 32754 -30610 40764 40625
15453D0625L528J405l8134l734j5705m3212J1559j2222K2201J16740n3943l5917
$$ 40625 44153 45558 7424 3690 -12015 -55227 -43668 -55890 -33689 83051 29108 -6809
15441f809K1130n0780j2411J3751K0713k6429k2164K6909Q909k8276J0581o7449
$$ -6809 14321 -36459 -48870 -35119 -14406 -40835 -62999 -36090 -27181 -55457 -44876 -112325
15429a12325r611M3880O5993J7076O6747J670n769o3734o1278K1056L6260k9596
$$ -112325 -121936 -78056 -12063 5013 71760 73430 67661 3927 -57351 -36295 -35 -29631
15417b9631j03135k2467N2655R3004J6806m8175m005Q736O0133P5539l490k8314
$$ -29631 -132766 -155233 -102578 -9574 7232 -40943 -44948 -36212 23921 99460 95970 67656
15405F7656k5549j9221N5691n466k9055j4902M098m3591L9514N8041K534p753
$$ 67656 42107 22886 78577 73111 44056 29154 33252 -10339 29175 87216 89750 81997
15393H1997q2244o1169k4405J7987o567M5709M1562J8699m3358Q623N660K5538
$$ 81997 -247 -61416 -85821 -67834 -74401 -28692 12870 31569 -11789 -3166 2494 28032
15381B8032l859l955N816j7185l1453J971N5451L7804l150k1092o3900j3382L3310
$$ 28032 24173 20218 26034 8849 -22604 -20633 34818 72622 69472 48380 -15520 -28902 4408
15368D408r816j316k7976L9622M5580J6385L1357o3560n3421j6518l6045K0218
$$ 4408 -5408 -6724 -34700 4922 50502 66887 98244 34684 -18737 -35255 -71300 -51082
15356e1082N1746L7580Q885k230k6840k0783K6551m180n654J8543k7900L563k4152
$$ -51082 664 38244 47129 44899 18059 -2724 23827 19647 13993 32536 4636 8199 -15953
15343a5953R017j5867k6067M6453J4057m5847j8278N543K1679M850m5176R670
$$ -15953 -6936 -22803 -48870 -2417 11640 -34207 -52485 -46942 -25263 -20413 -65589 -55919
15331e5919P7240J8464O616j5031m6343l1240K6257L4128j1034m8643l5283p217
$$ -55919 21321 39785 46401 31370 -14973 -46213 -19956 14172 3138 -45505 -80788 -88005
15319h8005q999M0500J457l536o3173L6252L4964K6634N1859J1543j7970j6074
$$ -88005 -97004 -56504 -55047 -58583 -121756 -85504 -50540 -23906 27953 39496 21526 5452
15307E452J0553j5273k8440n0817M9399P6162k9774M319p578m905j9440k1338
$$ 5452 16005 732 -27708 -78525 -29126 47036 17262 21581 14003 9098 -10342 -31680
15295c1680O253L3219K5231L1323k512J4126M6268n9803o1993L28j0142L5576
$$ -31680 -25427 7792 33023 64346 61834 75960 122228 62425 432 760 -9382 26194
15283B6194l776J8997j3804m144K0289k2938o0566J1216J1445J9788K8311L2479
$$ 26194 22418 41415 27611 23467 43756 20818 -39748 -28532 -17087 2701 31012 63491
15271F3491j5843n3399o3651K5229P5849k0724n2358Q453K3539m6276M850M5816
$$ 63491 47648 -5751 -69402 -44173 31676 10952 -41406 -32953 -9414 -55690 -50840 -5024
15259e024K6505k140K8382J8986l1159K5724j6431n2933K8456O0196k9112k220
$$ -5024 21481 19341 47723 66709 35550 61274 44843 -8090 20366 80562 51450 49230
15247D9230M2911k2974n1139k6661n789k4068p2956O4972N1079N0962O5378o5278
$$ 49230 92141 69167 18028 -8633 -14422 -38490 -111446 -46474 4605 55567 120945 55667
15235E5667l7197N3765L9413q708k4191p360l4787Q473k4387j4545n9668K5323
$$ 55667 18470 72235 111648 102940 78749 71389 36602 45075 20688 6143 -53525 -28202
15223b8202M2144K09j2993M4235M5058M1704n2413k3596l3524P96k5281j666j3356
$$ -28202 13942 14151 1158 45393 90451 132155 79742 56146 22622 23418 -1863 -3529 -16885
15210a6885l0634l2416j1840P3139O9026K3952j8631k5640J1879L6816R659m743
$$ -16885 -47519 -79935 -91775 -18636 50390 74342 55711 30071 41950 78766 88425 83682
15198H3682j947p6934k5084R223j3481L868N2357o558k9400j5004J6162k309n2996
$$ 83682 81735 4801 -20283 -11060 -24541 -20673 31684 25126 -4274 -19278 -3116 -5425 -58421
15185e8421j7380N9552J7833K1568k0427r448K2580J7104j232R277k1739j4824
$$ -58421 -75801 -16249 1584 23152 2725 -6723 15857 32961 31729 41006 19267 4443
15173D443l1178j6921J1628o251M2948l7019J4831K955J2380l8212k7540M186
$$ 4443 -26735 -43656 -32028 -38279 4669 -32350 -17519 -14564 -2184 -40396 -67936 -63750
15161f3750R3830K1619l995L338Q299j7469p6152n3623N3574M5559J1961l9761
$$ -63750 30080 51699 47704 51042 59341 41872 -34280 -87903 -34329 11230 23191 -16570
15149a6570l3851l2409P609j8947j8642L9993O4157N9672J4985m9450l0075J7361
$$ -16570 -50421 -82830 -75221 -94168 -112810 -72817 -8660 51012 65997 16547 -13528 3833
15137C833K8626o1136j05489j06J11877J01698N1208P144l1181j13074l3741n2591
$$ 3833 32459 -28677 -134166 -134272 -22395 79303 130511 137655 106474 -6600 -40341 -92932
15125i2932J9295k4440q169O4589M0698K5783J8136L1999k2561o7741l4340P6854
$$ -92932 -73637 -98077 -106246 -41657 -959 24824 42960 74959 52398 -15343 -49683 27171
15113B7171J6417j3847Q394J7895l7787j4028m6134n8407J2776P9919L7480M4161
$$ 27171 43588 29741 38135 56030 18243 4215 -41919 -100326 -87550 -7631 29849 74010
15101G4010k703o944J678J8577Q506O2704j2948m1273n4165q582L4721l7903o4531
$$ 74010 71307 64363 66041 84618 93124 155828 142880 101607 47442 38860 73581 35678 -28853
15088b8853M482j4181J1145l9841K896L2994K2393q758j1932O8251M8224Q67q63
$$ -28853 -24371 -38552 -27407 -67248 -64352 -31358 -8965 -17723 -29655 38596 86820 87687 86824
15075H6824n7997N187m8702k7628Q662K8862k248j9326j6160l2097r410P5479
$$ 86824 28827 34014 -14688 -42316 -33654 -4792 -7040 -26366 -42526 -74623 -84033 -8554
15063h554O4123J5314l0608k4723L1585J6338m2864j7282r744l3181J3539R1189
$$ -8554 55569 70883 40275 15552 47137 63475 20611 3329 -6415 -39596 -26057 65132
15051F5132M7107k2689k7167j8781l6534k8135J6261J3630N832k1333j9399j74
$$ 65132 112239 89550 62383 43602 7068 -21067 -4806 8824 14656 -6677 -26076 -26250
15039b6250m3116k4427P3398l106L0826j950k7737k7271O4562L4201K3523k3677
$$ -26250 -69366 -93793 -20395 -23501 7325 5375 -22362 -49633 14929 49130 72653 48976
15027D8976o993n1072n4456k5092Q007q15N3082J0327L9425J2128m2286L0189
$$ 48976 41983 -9089 -63545 -88637 -80630 -81445 -28363 -18036 21389 33517 -8769 21420
15015B1420n3326l135K4979L3577o788l2073m7399l2509J1534n10m1450j5700
$$ 21420 -31906 -35041 -10062 23515 16727 -15346 -62745 -95254 -83720 -84230 -125680 -141380
15003a41380N9226L3048J3249l0494j620r36j2378N5774M0214k5803l6629J2649
$$ -141380 -82154 -49106 -35857 -66351 -67971 -68907 -81285 -25511 14703 -11100 -47729 -35080
14991c5080K8949l3028m6257l8294K5724M6510K6409P8450P861k3062o3918K2937
$$ -35080 -6131 -39159 -85416 -123710 -97986 -51476 -25067 53383 61244 38182 -25736 -2799
14979b799l1240K8459K0737m715P370p708j8379N8384M058Q393M805o57k2629
$$ -2799 -34039 -5580 15157 10442 17812 10104 -8275 50109 54167 62560 67365 66708 44079
14966D4079j4449j5569l6087j2860J5865m098j8271K5722K3985n6424n1787l4397
$$ 44079 29630 14061 -22026 -34886 -19021 -23119 -41390 -15668 8317 -48107 -99894 -134291
14954a34291M3651P5459M2714K1135p9885j7895m46K1799l8129o930L6511K1810
$$ -134291 -90640 -15181 27533 48668 -31217 -49112 -49558 -27759 -65888 -72818 -36307 -14497
14942a4497N4152j9004k9736K4929J6526k8604l4502L0761O50l2126k058l5577
$$ -14497 39655 20651 -9085 15844 32370 3766 -30736 25 675 -31451 -33509 -69086
14930f9086J7879M2391k8171m3089O0933j3533J7570M2198k1126J0427L5131Q694
$$ -69086 -51207 -8816 -36987 -80076 -19143 -32676 -15106 27092 5966 16393 51524 60218
14918F0218j4567n2682L6762j936j432J6752n9953m4587k0L1439Q507l6886Q1227
$$ 60218 45651 -7031 29731 27795 26363 43115 -16838 -61425 -61445 -30006 -21499 -58385 22842
14905B2842l2596r2893P5642N6719J791R732L0161n5641j2178l661k8400k8352
$$ 22842 -9754 -102647 -27005 29714 31505 41237 71398 15757 3579 -82 -28482 -56834
14893e6834L9892K2446j4760J4366O5098N8960q7413n6600J2984l1795m152L8445
$$ -56834 -16942 5504 -9256 5110 70208 129168 41755 -14845 -1861 -33656 -37808 637
14881F37K4792L1273k3557p14J229p823j565Q615m662l5735j0086L3339j3679
$$ 637 25429 56702 33145 32431 33660 25837 24272 32887 28225 -7510 -17596 15743 2064
14868B064n8865P9445Q7683m0112j9096k8920K0797r846m0233M0014J5532k1840
$$ 2064 -56801 22644 110327 70215 51119 22199 42996 33150 -7083 32931 48463 26623
14856B6623J2395J1806K515L4195K6631J12175R4856k4348k6739N650k3163m3861
$$ 26623 39018 50824 53339 87534 114165 226340 321196 296848 270109 275759 252596 208735
14844B08735j07842n9839m2102Q1386J5407j1933n3223m1453j8311r456j6121
$$ 208735 100893 41054 -1048 80338 95745 83812 30589 -10864 -29175 -38631 -54752
14833e4752Q1310P0215J4063l4438k6603k9887J2324N2352o1014R311L2074N7260
$$ -54752 26558 96773 110836 76398 49795 19908 32232 84584 23570 32881 64955 122215
14821A22215J6912l0861k1846j4684k1033L0977J1287l8787q755l7336m6251J7005
$$ 122215 139127 108266 86420 71736 50703 81680 92967 54180 45425 8089 -38162 -21157
14809b1157K5023M135j3901K427j0040n866M0102n862j2819j4641J2148M3210
$$ -21157 3866 8001 -5900 -3473 -13513 -19379 20723 14861 2042 -12599 -451 42759
14797D2759M5742K1847J6402j2630m9068m0370P159m1123l7943J1985L4082j7144
$$ 42759 88501 110348 126750 114120 65052 24682 31841 -9282 -47225 -35240 -1158 -18302
14785a8302o266O6929j4355N085l388m2220l1922K3421j3194K3985l8391N313
$$ -18302 -24568 42361 28006 33091 29703 -12517 -44439 -21018 -34212 -10227 -48618 -43305
14773d3305K707L1486L9562p184J7518K5700k4070K4306m2792m6533k1785K5884
$$ -43305 -40598 -9112 30450 23266 40784 66484 42414 66720 23928 -22605 -44390 -18506
14761a8506M4577K3283l7713m0108k3018L8418K4029N7865l7197k071K7481k2603
$$ -18506 26071 49354 11641 -28467 -51485 -13067 10962 68827 31630 29559 57040 34437
14749C4437p0290m1259K0390M6643K0487k4195j3484l682m579l1093Q0582M7196
$$ 34437 -35853 -77112 -56722 -10079 10408 -13787 -27271 -30953 -35532 -66625 13957 61153
14737F1153J7700J3022J6329m9595Q687l1914K1051L9252k6205P864n8511L165
$$ 61153 78853 91875 108204 58609 67296 35382 56433 95685 69480 77344 18833 21998
14725B1998K6426J1944M0602L0888N5816o9586m1789n9382m7517L0328j2954o6002
$$ 21998 48424 60368 100970 131858 187674 118088 76299 16917 -30600 -272 -13226 -79228
14713g9228L2141L1469l4391n0088r281N921L0364L0431R791k4390Q338O0998
$$ -79228 -47087 -15618 -50009 -100097 -109378 -103457 -73093 -42662 -32871 -57261 -48923 12075
14701A2075O0100R000R558m881J9826n8160r1473K6705K3410j028j5069j99M214
$$ 12075 72175 81175 90733 85852 105678 47518 -43955 -17250 6160 5132 -9937 -10136 -5922
14688e922L1791j2489J9466K7867q777L7020K0031j3353m3012k2331P2820K0039
$$ -5922 25869 13380 32846 60713 51936 88956 108987 95634 52622 30291 103111 123150
14676A23150K362J0296n4544n0014l5492k7370k2223j1580j5911n303K1721K2002
$$ 123150 125512 135808 81264 31250 -4242 -31612 -53835 -65415 -81326 -86629 -64908 -42906
14664d2906O7853P8608K1711J0112j4915r093j8114M3645R125p7405l7564J7194
$$ -42906 24947 103555 125266 135378 120463 111370 93256 136901 146026 68621 31057 48251
14652D8251J4846n9281l0282r56P7788j4644l1683L4341J9114l7623o807J3021
$$ 48251 63097 3816 -26466 -27422 50366 35722 4039 38380 57494 19871 13064 26085
14640B6085l5683N0702j9625k8088K6557R64l3783J408l4665J6332k8565K4711
$$ 26085 -9598 41104 21479 -6609 19948 20912 -12871 -11463 -46128 -29796 -58361 -33650
14628c3650N5063m8694k4436l12m322n4032p513J00519Q8831j2571j4881L5061
$$ -33650 21413 -27281 -51717 -52029 -56351 -110383 -117896 -17377 71454 58883 44002 79063
14616G9063J4164l6720k0353k8903n2650R103M4573L8267n907k6454k724l6645
$$ 79063 93227 56507 36154 7251 -45399 -36296 8277 46544 40637 14183 11459 -25186
14604b5186k7091j7924o776p826N1513J3708j2046j6408m501J5738k1186L3121
$$ -25186 -52277 -70201 -76977 -84803 -33290 -19582 -31628 -48036 -52537 -36799 -57985 -24864
14592b4864O1776L9009R526m037j5487k2084K4756n4372M1052L5296p9628l647
$$ -24864 36912 75921 85447 81410 65923 43839 68595 14223 55275 90571 10943 7296
14580G296M3282n127L4600J794k0251l1294l095J1435N0877J8022k8779k6755
$$ 7296 50578 45451 80051 81845 61594 30300 27205 38640 89517 107539 78760 52005
14568E2005K7342k0262j1360Q812L5258o5900l5314K773m5200n1088M5323M4957
$$ 52005 79347 59085 47725 56537 91795 25895 -9419 -6646 -51846 -102934 -57611 -12654
14556a2654O43k8108L2730m2348K8658P40m2092L3599j5763O883O8771O8933J5424
$$ -12654 -12011 -40119 -7389 -49737 -21079 -20339 -62431 -28832 -44595 -37712 31059 99992 115416
14543A15416Q756K2707k4449Q704n171k622L370p183k730M547o6143n2073m9612
$$ 115416 124172 146879 122430 131134 125963 123341 126711 119528 116798 121345 55202 3129 -46483
14530d6483K4243P3622P2341P4622K1311m6890k3545K0127M2362J4184Q6630J32339
$$ -46483 -22240 51382 123723 198345 219656 172766 149221 169348 211710 225894 312524 444863
14518D44863K58220L20052L50516M99739N50597L90212L24375L8517k06207l33793
$$ 444863 703083 1023135 1373651 1873390 2423987 2814199 3138574 3177091 2970884 2637091
14508B637091n13245n58822m26113l11796k36969j75152j10313j11074n3157J0867
$$ 2637091 2123846 1565024 1138911 827115 590146 414994 304681 193607 140450 151317
14498A51317k1384r438n201P6942M8029k2722o2171q48K2409K5797J3041K7120
$$ 151317 129933 120495 115294 192236 240265 217543 155372 154524 176933 202730 215771 242891
14486B42891p6816j7611q669k8980l8799n8333J8499L2451r18k8140K283L8235
$$ 242891 166075 148464 139795 110815 72016 13683 32182 64633 63715 35575 37858 76093
14474G6093k7332m946l5433j1780M1324l7381M0449M2332m8252m4390N4751O443
$$ 76093 48761 43815 8382 -3398 37926 545 40994 83326 35074 -9316 45435 51878
14462E1878j4018l5776O1541k5977K546K1807J7169J025n8606N15n5089n8443
$$ 51878 37860 2084 63625 37648 40194 62001 79170 80195 21589 22104 -32985 -91428
14450i1428K7492M6376O4767J8464N7491k8580q1173j7261K2870l3753l2757M5057
$$ -91428 -63936 -17560 47207 65671 123162 94582 13409 -3852 19018 -14735 -47492 -2435
14438b435L0926O2649M1255k7692o1945l7067p118j4317M2930j9414j4072j9778
$$ -2435 28491 91140 132395 104703 42758 5691 -1427 -15744 27186 7772 -6300 -26078
14426b6078N1835P7254j4122p1423k226k7193L0835J4992j0383k4952m0345k0784
$$ -26078 25757 103011 88889 17466 15240 -11953 18882 33874 23491 -1461 -41806 -62590
14414f2590n4147q072L2292Q0624L6819j928k7336k2615L7616M7864M0246o5323
$$ -62590 -116737 -124809 -92517 -11893 24926 22998 -4338 -26953 10663 58527 98773 33450
14402C3450k8923j6945r083J913Q516j4783O9074R429l0363k0397j4760q1464
$$ 33450 4527 -12418 -21501 -19588 -11072 -25855 43219 52648 22285 1888 -12872 -94336
14390i4336K5263M0327m5611J3469l420P662L7190K2109k1372j5485M0866l626
$$ -94336 -69073 -28746 -74357 -60888 -64308 -56646 -19456 2653 -18719 -34204 6662 3036
14378C036P4313j344k9082K3848m0412J8190J1406J0379K1467n0697o2140j96
$$ 3036 77349 76005 46923 70771 30359 48549 59955 70334 91801 41104 -21036 -21232
14366b1232M3158m0906L3962M3363L5656O2317j6934m645l8070m8859p2072k9957
$$ -21232 21926 -18980 14982 58345 94001 156318 139384 134739 96669 47810 -24262 -54219
14354e4219j7710L7014O6237p068L7023L0224j7981J2927m7466n6229l1355o6135
$$ -54219 -71929 -34915 31322 24254 61277 91501 73520 86447 38981 -17248 -48603 -114738
14342a14738m429K4586K6957Q214K0686J2662K681l8079k0311o77j2245q934l2330
$$ -114738 -119167 -94581 -67624 -59410 -38724 -26062 -23381 -61460 -81771 -82448 -94693 -103627 -135957
14329a35957K0262L1633Q111J2984l3806K8448L9618L2188p489k5202m155m9245
$$ -135957 -115695 -84062 -75951 -62967 -96773 -68325 -28707 3481 -4008 -29210 -33365 -82610
14317h2610l8981M3379M2235L6583j0354L107j8885k3012j7663N4533Q728l0942
$$ -82610 -121591 -78212 -35977 606 -9748 -6641 -25526 -48538 -66201 -11668 -2940 -33882
14305c3882o236M2990L6412N2524N8365q762p9160k8306O051Q5560N2409K7783
$$ -33882 -40118 2872 39284 91808 150173 141411 62251 33945 39996 125556 177965 205748
14293B05748Q0657P2189P0395q65O851P0315k7681p8793p9608j06318j09027j0700
$$ 205748 286405 358594 428989 428124 434975 505290 477609 398816 319208 212890 103863 93163
14281I3163q662P078L2936N445l2400n4193M5364n3883p4613k4907M9905M482
$$ 93163 84501 91579 124515 129960 97560 43367 88731 34848 -39765 -64672 -14767 -10285
14269a0285J6182K515r08J0003J7910L2527m8680n4543j9472j3821n6638J5824
$$ -10285 5897 8412 7504 17507 35417 67944 19264 -35279 -54751 -68572 -125210 -109386
14257a09386r324k3473N4519p222L1847K8331J4338k2684k1878O5625M6779j7440
$$ -109386 -118710 -142183 -87664 -94886 -63039 -34708 -20370 -43054 -64932 693 47472 30032
14245C0032J4873N6620n81m2252k5050l8130m2657K6761J3481K5189P4597K8027
$$ 30032 44905 101525 100944 58692 33642 -4488 -47145 -20384 -6903 18286 92883 120910
14233A20910n3182m024L8773M7422N244n9067J3770K7567L2988j05905o6041J3959
$$ 120910 67728 63704 102477 149899 155143 96076 109846 137413 170401 64496 -1545 12414
14221A2414L2489N147K0886K2508O498j5079p828j8315K0232M8220j3409k581
$$ 12414 44903 50050 70936 93444 99942 84863 77035 58720 78952 127172 113763 111182
14209A11182j4365M3097j3930k6345K4161O4980K6462J1545j1646k8001j3857
$$ 111182 96817 139914 125984 99639 123800 188780 215242 226787 215141 187140 173283
14198A73283p6248l2599J1204L6274L1725K9027n088J0004Q7K9152j3111q4281
$$ 173283 97035 64436 75640 111914 143639 172666 167578 177582 177669 206821 193710 109429
14186A09429K5703J3329j0347j3178M551n1817n4170K5997l3282l1076O2128M2596
$$ 109429 135132 148461 138114 124936 129487 77670 23500 49497 16215 -14861 47267 89863
14174H9863l8610R853j1468l6516J0264Q1981P017K64K1976Q353P1817P7890K8644
$$ 89863 51253 61106 49638 13122 23386 105367 112384 112648 134624 142977 214794 292684 321328
14161C21328N4355J8532m6294K210j7121k1907N714q49m9389N7018P7761k5726
$$ 321328 375683 394215 347921 350131 333010 311103 316817 315968 266579 323597 401358 375632
14149C75632m1316n3363l7879o090l1710M369K6174P1393J3723J9171K739M769
$$ 375632 334316 280953 243074 236984 205274 209643 235817 307210 320933 340104 342843 347612
14137C47612J0822O1672L5188l3758K477J7867L971l2234P751l8987L103K7674
$$ 347612 358434 420106 455294 421536 424013 441880 445851 413617 421368 382381 385484 413158
14125D13158m6999L2529J05369N880M3349K515K4398n1000j7929M1747L4834k8591
$$ 413158 366159 398688 504057 509937 553286 555801 580199 529199 511270 553017 587851 559260
14113E59260R265M9822J369P1246k4939k1101P5438P2956O0015m002j8479L7833
$$ 559260 568525 618347 619716 690962 666023 644922 720360 793316 853331 849329 830850 868683
14101H68683O121N568K2306O2484P6479Q5475J00949J6181M3170O7547o2272m2421
$$ 868683 874804 880372 902678 965162 1041641 1127116 1228065 1244246 1287416 1354963 1292691 1250270
14089A250270p7003k1321O7758K7394M6366N4244P1364N7997M4943N9059R3797
$$ 1250270 1173267 1151946 1219704 1247098 1293464 1347708 1419072 1477069 1522012 1581071 1674868
14078A674868M9909Q8176J02211J14517J79806J53438J58881K18825K51495K64099
$$ 1674868 1724777 1812953 1915164 2029681 2209487 2362925 2521806 2740631 2992126 3256225
14068C256225K32886K58297K47617L28956M21171M61741O38717Q13725J012901
$$ 3256225 3489111 3747408 3995025 4323981 4745152 5206893 5845610 6659335 7672236
14059G672236J347734J571153J879012K263141K480858K578058K772730K869567
$$ 7672236 9019970 10591123 12470135 14733276 17214134 19792192 22564922 25434489
14051B5434489L003718L434215M438955O199868R021451J3600962K1347602L3486014
$$ 25434489 28438207 31872422 36311377 42511245 51532696 65133658 86481260 119967274
14043A19967274M9911714O6683247Q2710080R4329324Q8970177O3594826K3192293
$$ 119967274 169878988 236562235 319272315 413601639 502571816 566166642 589358935
14036E89358935k1560602n7344073q2455462r3759163q8661338p1715303n0050617
$$ 589358935 567798333 510454260 427998798 334239635 245578297 173862994 123812377
14029A23812377l1930087k0164576j3112467q832571o261681m733031l854327
$$ 123812377 91882290 71717714 58605247 49772676 43510995 38777964 34923637
14022C4923637l493139l424242l396702l237133k914053k519782k121617j652404
$$ 34923637 31430498 28006256 24609554 21372421 18458368 15938586 13816969 12164565
14014A2164565j208960j034256q64265o57232n35284m58191m66760m92421m31279
$$ 12164565 10955605 9921349 9057084 8399852 7864568 7406377 6939617 6447196 6015917
14005F015917l59867l54421l55420k78164k90379j89309k13476k18607j81244
$$ 6015917 5656050 5301629 4946209 4668045 4377666 4188357 3974881 3756274 3575030
13996C575030k25965j84667o6629m4222l8010M3548J18426J24120J40889J20767
$$ 3575030 3349065 3164398 3097769 3053547 3015537 3059085 3177511 3301631 3442520 3563287
13986C563287O1502m5617k37982k49096l19666l41806l00180k38516j93505p4236
$$ 3563287 3624789 3579172 3341190 3092094 2772428 2430622 2130442 1891926 1698421 1624185
13976A624185k0934o562n4609o4532p1388k6250J3194n4090j22996q7379p321
$$ 1624185 1603251 1596689 1542080 1477548 1406160 1379910 1393104 1339014 1216018 1128639 1121318
13965A121318n5069j6702m2545k9158j3617p5420q4872j0978L4177j6299j5311
$$ 1121318 1066249 1049547 1007002 977844 964227 888807 803935 792957 827134 810835 795524
13954G95524l8252m767n8670n0649o7635k1528l3468J1316Q0290j9959l1130P531
$$ 795524 757272 752505 693835 643186 575551 554023 520555 531871 612161 592202 561072 568603
13942E68603L7170k299k2841p6n3061j6145j9409J3852O7223p308n5461o6815
$$ 568603 605773 603474 580633 580557 527496 511351 491942 505794 573017 565709 510248 443433
13930D43433k1659m5217L748M2608L1600n9084k1306o2690P29K1664J1103k6575
$$ 443433 421774 376557 380305 422913 454513 395429 374123 311433 312162 333826 344929 318354
13918C18354n4079l7446Q4045Q3430N2059J11370R8151R3320N3724L558R881o1798
$$ 318354 264275 226829 310874 394304 446363 557733 655884 749204 802928 806486 816367 754569
13906G54569j9242K2196o7188o7734l6833n708p691j21409n1739k5820L9908L0753
$$ 754569 735327 757523 690335 622601 585768 580060 572369 450960 399221 373401 413309 444062
13894D44062p944l7491k1082j4918m5866l6000l6789p849n012k90j4971J378Q738
$$ 444062 436118 398627 377545 362627 316761 280761 243972 236123 231111 230821 215850 217228 225966
13881B25966N0164J7330n8373p185j6128j8771K0275M629k1723n6753o9208k2178
$$ 225966 276130 293460 235087 227902 211774 193003 213278 217907 196184 139431 70223 48045
13869D8045M2369N2789L2842K1940J0889L156j3214L8515J1353M2938K8739k3479
$$ 48045 90414 143203 176045 197985 208874 212030 198816 237331 248684 291622 320361 296882
13857B96882l1227j2361O602J7308l5487p17L1909L5650J8044K0900m2154j24127
$$ 296882 265655 253294 259896 277204 241717 241000 272909 308559 326603 347503 305349 181222
13845A81222j2400J1503K9296n9803J6988J1057R747P3441J2691m5091p9725j7382
$$ 181222 168822 180325 209621 149818 166806 177863 187610 261051 273742 228651 148926 131544
13833A31544K9503O6671R1687k5664K5383J9955q4818l9216j0512L7254n02N6440
$$ 131544 161047 227718 319405 293741 319124 339079 254261 215045 204533 241787 241285 297725
13821B97725j4777J2451j2673k271N8785l56n9457K8366k1293k2173l6913j4741
$$ 297725 282948 295399 282726 280455 339240 338884 279427 307793 286500 264327 227414 212673
13809B12673l2844o7753m0065M3219j1170m2115K2327K1201J4574O1444k745j1012
$$ 212673 179829 112076 72011 115230 104060 61945 84272 105473 120047 181491 178746 167734
13797A67734m9611k9001l5469L186J3449q972J2700K0584O8144O8527L8905o6814
$$ 167734 118123 89122 53653 56839 70288 61316 74016 94600 162744 231271 270176 203362
13785B03362p1985J3070M3341O9132k7892p0015m5505j5676O8175K8431P747J9168
$$ 203362 131377 144447 187788 256920 229028 159013 113508 97832 166007 194438 202185 221353
13773B21353J890K4686M012n303l0698k9227l1892k0922k0281L5912J1724l5144
$$ 221353 223243 247929 251941 246638 215940 186713 154821 133899 113618 149530 161254 126110
13761A26110j2984K2624K9996M1987K6259l0197m2020J4162Q187j0737p2525p117
$$ 126110 113126 135750 165746 207733 233992 203795 161775 175937 184124 173387 100862 93745
13749I3745L4907l8245l7499m0769l0295K875M7526M6823o0244J8843L5720k122
$$ 93745 128652 90407 52908 12139 -18156 -15281 32245 79068 18824 37667 73387 71265
13737G1265L344m3011K5640N6202P0408J65611M1398k5981q3156q1597o4575o1198
$$ 71265 74609 31598 57238 113440 183848 349459 390857 364876 281720 200123 135548 74350
13725G4350J1404j6089M7576P1119l6871o6400l7783K4057L98n3382L3676P1330
$$ 74350 85754 69665 117241 188360 151489 85089 47306 71363 71761 18379 52055 123385
13713A23385J3495j456R087k9477l9616K8062N4645m951k6967J9696K1604o2780
$$ 123385 136880 135424 144511 115034 75418 103480 158125 153174 126207 145903 167507 104727
13701A04727n2533L4289K6355m9715L1358p050m5442l981L5094l0985J9514K3479
$$ 104727 52194 86483 112838 63123 94481 87431 41989 38008 73102 42117 61631 85110
13689H5110M0760j6643M8226L9255n8494j14962k3507k119J7705L8096K3979k5236
$$ 85110 125870 109227 157453 196708 138214 23252 -255 -2374 15331 53427 77406 52170
13677E2170r418j9361j1703J8392M5308N0l7782P9252O7623k8668k1212M1201
$$ 52170 42752 23391 11688 30080 75388 75438 37656 116908 184531 155863 134651 175852
13665A75852k7436m4168J3458L5015q957l9228k6122K5009L383l4630l6748K7858
$$ 175852 148416 104248 117706 152721 143764 104536 78414 103423 106806 72176 35428 63286
13653F3286K5343o7671j9574k3179J1837L0866j6872K4440o7976l8429j4776j4625
$$ 63286 88629 20958 1384 -21795 -9958 20908 4036 28476 -39500 -77929 -92705 -107330
13641a07330K7923K6950M8849K5072o0511p164N4975K957n1642k8110M575k4464
$$ -107330 -79407 -52457 -3608 21464 -39047 -46211 8764 11721 -39921 -68031 -63456 -87920
13629h7920k9607M1034J2770P5140M0185N3331m0181J785l7784j7309J0943k7024
$$ -87920 -117527 -76493 -63723 11417 51602 104933 64752 66537 28753 11444 22387 -4637
13617d637k9653O0207L1131J250n467j1687n6092O0861L854k6258N7313L8089
$$ -4637 -34290 25917 57048 58298 52831 41144 -14948 45913 49767 23509 80822 118911
13605A18911L1325l1433l5639J8991j8876o5438m6203N265K3642J4673M5956K6548
$$ 118911 150236 118803 83164 102155 83279 17841 -28362 -23097 545 15218 61174 87722
13593H7722R044K7899j3794p7256m2546n3707q525N2491Q5321m222J6117O8415
$$ 87722 96766 124665 110871 33615 -8931 -62638 -71163 -18672 66649 62427 78544 146959
13581A46959K1556P324M0564q591L4462l7388J5166N4567k1993m9867k7676K5773
$$ 146959 168515 175839 216403 207812 242274 204886 220052 274619 252626 202759 175083 200856
13569B00856M9994o623m6286P2499P2248P4842J01717J64362L37565M35587N54556
$$ 200856 250850 244227 197941 270440 342688 417530 519247 683609 1021174 1456761 2011317
13558B011317N38931L90643K43709J781k69797l78303m76346n20665l81987l64292
$$ 2011317 2550248 2940891 3184600 3186381 2916584 2538281 2061935 1541270 1159283 794991
13548G94991k37121j20682j37768n0641j7764n063K5402q039o9080L837K9086
$$ 794991 557870 437188 299420 248779 231015 225952 251354 243315 174235 178072 207158
13537B07158n354m7653n4264K61J289m3221M7470O2791l1761J2881J9176L7528
$$ 207158 201804 154151 99887 100148 101437 58216 105686 168477 136716 149597 168773 206301
13525B06301J6424p2473p8974r594K4089j0124k9451k3436P2000K2068j0514m6278
$$ 206301 222725 150252 71278 61684 85773 75649 46198 22762 94762 116830 106316 60038
13513F0038j2564j9480m0164m0777Q588L1318M4800J988K8756K7468m1664l9657
$$ 60038 47474 27994 -12170 -52947 -44359 -13041 31759 33747 62503 89971 48307 8650
13501H650n9336k9462R7670L9484R01J1911K9936M0547M1411m0723n1929L25M964
$$ 8650 -50686 -80148 17522 57006 57907 69818 99754 140301 181712 140989 89060 89385 94349
13488I4349K1500R27k7780o555L2718l9044r9782m9185M0931L0392l7212m844
$$ 94349 115849 116776 88996 82441 115159 76115 -23667 -72852 -31921 -1529 -38741 -43585
13476d3585J01389K4145m6428j1649J6990K6264M4050M9277M976k3441k8753m1159
$$ -43585 57804 81949 35521 23872 40862 67126 111176 160453 165429 141988 113235 72076
13464G2076j02032o5795M7183M1437L1581K1192M0230J1265l8695l6652O5111
$$ 72076 -29956 -95751 -48568 -7131 24450 45642 85872 97137 58442 21790 86901
13453H6901n2122N410j6478n4029l8022j7591P3598M2656N0334J0988j2086Q4798
$$ 86901 34779 40189 23711 -30318 -68340 -85931 -12333 30323 80657 91645 79559 164357
13441A64357K9191o8695l4279K8935j382l7337J4171k7406l7347N6083P1860L0925
$$ 164357 193548 124853 90574 119509 118127 80790 94961 67555 30208 86291 158151 189076
13429A89076k8129o7091j3720j1152N1506k6928m8751l0857J4405r866q191o281
$$ 189076 160947 93856 80136 68984 120490 93562 44811 13954 28359 18493 10302 4021
13417D021K5603P2790m6740q2957M031L9803O842M2621m5607M7385L5244j6587
$$ 4021 29624 102414 55674 -27283 -23252 16551 23393 66014 20407 67792 103036 86449
13405H6449l0507O633l5865n3684J5230P3175Q9211n3671j3889o4747o7220R703
$$ 86449 55942 62575 26710 -26974 -11744 61431 150642 96971 83082 18335 -48885 -39182
13393c9182O721j7310L1997M971L5566J3739P9711j5975r332p1194o4189l7764
$$ -39182 -32461 -49771 -17774 -12803 22763 36502 116213 100238 90906 19712 -44477 -82241
13381h2241J8379L1482J8304m024N902K9517p780l0465o636M1430R131K2814n53
$$ -82241 -63862 -32380 -14076 -18100 -12198 17319 9539 -20926 -27562 13868 22999 45813 45260
13368D5260m240j1914K3722k2591j6812o6404r03O7929L8985k8619j58486l5315
$$ 45260 41020 29106 52828 30237 13425 -52979 -53882 14047 53032 24413 -134073 -169388
13356a69388L4202O1179K2881l8297M5845L106m5606l8730K4328Q9062O0176J8139
$$ -169388 -135186 -74007 -51126 -89423 -43578 -40472 -86078 -124808 -100480 -11418 48758 66897
13344F6897k4951j8649m7411m5381L0336J2041m676J2138l38L8876k1430N179
$$ 66897 41946 23297 -24114 -69495 -39159 -27118 -31794 -19656 -19994 18882 -2548 2631
13332B631L2575j7440P060K1956m4586o4839o3292N6217K5554L4749N7545o278
$$ 2631 35206 17766 24826 46782 2196 -62643 -125935 -69718 -44164 -9415 48130 41852
13320D1852n7632m3378K2407P000K7698n401K0833M9960K3047l4445L0581j5494
$$ 41852 -15780 -59158 -36751 -29751 -2053 -7454 13379 63339 86386 51941 82522 67028
13308F7028m0548N203q674N2165K9090J5060k1107k5745q715J3417N4277L667
$$ 67028 26480 31683 23009 75174 104264 119324 98217 72472 63757 77174 131451 135118
13296A35118q5325p2536K019P2659J6343o3309j0146N4666K6513k9730j5257M7777
$$ 135118 49793 -22743 -20724 51935 68278 4969 -5177 49489 76002 46272 31015 78792
13284G8792K9196L4357k5014l9757K0772m8805p9550l162L2858M3807L9273m574
$$ 78792 107988 142345 117331 77574 98346 49541 -30009 -33171 -313 43494 82767 78193
13272G8193Q622M645q918l3927J2336j382n8696l2012O1768O143m3470M6996N3309
$$ 78193 86815 91460 82542 48615 60951 59569 873 -31139 30629 36772 -6698 40298 93607
13259I3607j9803m5234o791M1138p6344p1902L3609L9842L9440M7554o4321k1135
$$ 93607 73804 28570 21779 62917 -13427 -85329 -51720 -11878 27562 75116 10795 -10340
13247a0340N1708k1749q0280P0922K0177k359m741k1041K2368M9732l7416p4226
$$ -10340 41368 19619 -60661 10261 30438 28079 23338 2297 24665 74397 36981 -37245
13235c7245J0519p831K4272Q6128m2176m6729L6299N3067O668O9853m5843q2706
$$ -37245 -26726 -34557 -10285 75843 33667 -13062 23237 76304 82972 152825 106982 24276
13223B4276n619M8884K7073m1782M3965J7592j1911l4787k3749M218l8405n246
$$ 24276 18657 67541 94614 52832 96797 114389 102478 67691 43942 48160 9755 4509
13211D509m1275L6333K6547O1067L8625j0050j6701k7508N461P3824J3678k038
$$ 4509 -36766 -433 26114 87181 125806 115756 99055 71547 77008 150832 164510 162472
13199A62472m324m6945j1885q946m0830q271k4979l7899m465K3118J052K651Q630
$$ 162472 158148 111203 99318 90372 49542 41271 16292 -21607 -26072 -2954 -1902 749 9379
13186I379q847O0101J8652J207m6718k5719M121l9M9750R3128j7296p9405k3941
$$ 9379 532 60633 79285 80492 33774 8055 12176 12137 61887 155015 137719 58314 34373
13173C4373k4818K6248M7437L2419J6254p756l1476l1420j6721L1974m4219K7937
$$ 34373 9555 35803 83240 115659 131913 124157 92681 61261 44540 76514 32295 60232
13161F0232R1618P2623M8486P1988N4202l2075m9651K7430k5038r5893j40287
$$ 60232 151850 224473 272959 344947 399149 367074 317423 344853 319815 223922 83635
13150H3635J6735K0555m0154m1197m0798J9494n3578j2802o681K6426N1848L0886
$$ 83635 100370 120925 80771 39574 -1224 18270 -35308 -48110 -54791 -28365 23483 54369
13138E4369n027j8060j0499j360J5257K5047l660j7890O8181O395O272r709J880
$$ 54369 49342 31282 20783 19423 34680 59727 56067 38177 106358 112753 119025 109316 111196
13125A11196n075P663J8275J754L4095l3225K998l4446j6940J7442L2067O0925
$$ 111196 106121 113784 132059 133813 167908 134683 137681 103235 86295 103737 135804 196729
13113A96729P9207J06613M5923m5474o6487p3166p2781l8016p9471n9341L2483
$$ 196729 275936 382549 428472 382998 316511 243345 170564 132548 53077 -6264 26219
13102B6219L2936l3329m120K2394K1002k9305k1175l9535k1118p841K7631p28
$$ 26219 59155 25826 21706 44100 65102 35797 14622 -24913 -46031 -53872 -26241 -26969
13090b6969J5833M6310k8539j5891J5979L0589L854J1902p1256n6749N8672J30827
$$ -26969 -11136 35174 6635 -9256 6723 37312 41166 53068 -18188 -74937 -16265 114562
13078A14562J1223n7477m0519M6246l1528k2812K7349l1672q898l3438P2374L6765
$$ 114562 125785 68308 27789 74035 42507 19695 47044 15372 6474 -26964 45410 82175
13066H2175N0381j3925L444k3957o0560K451l785q836J198n0367k5061M4255N9738
$$ 82175 132556 118631 122075 98118 37558 40009 36224 27388 28586 -21781 -46842 -2587 57151
13053E7151J4586M4819O106o0794o2029K6764l152j0450L094L1665K8554J3248
$$ 57151 71737 116556 122662 61868 -161 26603 23451 13001 16095 47760 76314 89562
13041H9562K8874M3876n2701o8145P309j5125K5018K8532j0138R971K7917L42
$$ 89562 118436 162312 109611 41466 48775 33650 58668 87200 77062 87033 114950 115292
13029A15292m5581l8436J2489J2410o4125j2209K4079j5365j1570j8668o417j512
$$ 115292 69711 31275 43764 56174 -7951 -20160 3919 -11446 -23016 -41684 -48101 -49613
13017d9613N076M3969k8819M990J4841K0067r327r007o3324l7481p657N3343J6136
$$ -49613 -44537 -568 -29387 -24397 -9556 10511 1184 -7823 -71147 -108628 -116285 -62942 -46806
13004d6806R7509O1061l2737o7803P332N1122K1655K4943j8626k1754k5620N6529
$$ -46806 50703 111764 79027 11224 18556 69678 91333 116276 97650 75896 50276 106805
12992A06805l3199j16836K1807N6408M4788K2839l8364o013m5963l3404N260L1260
$$ 106805 73606 -43230 -21423 34985 79773 102612 64248 58235 12272 -21132 -15872 15388
12980A5388q825m2770k1895J5964N6756N1373r996l561l9013m9387m781k512J1174
$$ 15388 6563 -36207 -58102 -42138 14618 65991 55995 52434 13421 -35966 -40747 -43259 -32085
12967c2085n008L3678J2214P995k1512L2652L0196R8343P2151r6752n4003J9367
$$ -32085 -37093 -3415 8799 16794 -4718 27934 58130 156473 228624 131872 77869 97236
12955I7236j5081J7400Q849m5237q3155p0620J2905O9618M6684N3302r897o5992
$$ 97236 82155 99555 108404 63167 -19988 -90608 -77703 -8085 38599 91901 82004 16012
12943A6012l7650J9064L6456N7449j1789j0145l183j7699p851n108m019k9418
$$ 16012 -21638 -2574 33882 91331 79542 69397 66214 48515 40664 35556 31537 2119
12931B119m091K4071j0701K3961n8997K862j2805K2379O3740N2521K22N027o2788
$$ 2119 -1972 22099 11398 35359 -23638 -20776 -33581 -11202 52538 105059 105281 110308 47520
12918D7520k6850n6923q584Q2743Q5476k666n2627J2599j3759L5207Q42n0404
$$ 47520 20670 -36253 -44837 37906 123382 120716 68089 80688 66929 102136 102978 52574
12906E2574K771M1342L0278J857O2383R0214J07543J82165K15760J29088l7851
$$ 52574 55345 96687 126965 128822 191205 281419 388962 571127 786887 915975 878124
12895H78124j77014j80006r4882j34494j02426l0686k3552J6576j2478l6111L6153
$$ 878124 701110 521104 426222 291728 189302 158616 135064 151640 139162 103051 139204
12884A39204K5820r31o0296O104n977o3313J4043j0000j5790Q062M3496m5910
$$ 139204 165024 164093 103797 109901 103924 40611 54654 44654 28864 36926 80422 34512
12872C4512k5626K0754j3748j0959K1558l2806k8060O830J3386j5973l8274q029
$$ 34512 8886 29640 15892 4933 26491 -6315 -34375 -27545 -14159 -30132 -68406 -76435
12860g6435N2969L0687K6800N911M68M0591l5937n8874L723M5167K1915j9098
$$ -76435 -23466 7221 34021 39932 40400 80991 45054 -13820 -10097 35070 56985 37887
12848C7887L7931j1493n7201j4340O0103Q735o8549K5617O2139M014J2672J5094
$$ 37887 75818 64325 7124 -7216 52887 61622 -6927 18690 80829 84843 97515 112609
12836A12609l6898o5807m8504j3584L3724K7416J0166n7240m5541k8308n65J891
$$ 112609 75711 9904 -38600 -52184 -18460 8956 19122 -38118 -83659 -111967 -112532 -110641
12824a10641M9659M802l9084k5861O4601O1177M5697O670o815J1483j9037k0437
$$ -110641 -60982 -56180 -95264 -121125 -56524 4653 50350 57020 50205 61688 42651 22214
12812B2214l3027k7400J4257M0317K982O7711K2941l5057p923m3817l2791L5416
$$ 22214 -10813 -38213 -23956 16361 19343 87054 109995 74938 67015 23198 -9593 25823
12800B5823p028J5090q54j3433K3002L1352k8697M426l0498n4740l9Q062Q8468
$$ 25823 18795 33885 33031 19598 42600 73952 45255 49681 19183 -35557 -35596 -27534 60934
12787F0934L3003j5663P180j6295l2935l2553J7519K6067M7479K3164N177n3484
$$ 60934 93937 78274 85454 69159 36224 3671 21190 47257 94736 117900 123077 69593
12775F9593j8781K9997m8694J1400O710l2337K2179M2678l4393K5275M9999l5972
$$ 69593 50812 80809 32115 43515 50225 17888 40067 82745 48352 73627 123626 87654
12763H7654n5973M709K54n9263l5557j4363K512R0479m052j9924J811J8200j4713
$$ 87654 31681 36390 36644 -22619 -58176 -72539 -70027 20452 16400 -3524 -1713 16487 1774
12750A774l13M5862L5709j5138O6391L5971l0042l7181l4809j3668l4344J6290
$$ 1774 1461 47323 83032 67894 134285 170256 140214 103033 68224 54556 20212 36502
12738C6502P221J9845M2429r603Q261j0875l54K5883K5682L1764m4319k5976N8602
$$ 36502 43723 63568 105997 96394 104655 93780 93426 119309 144991 176755 132436 106460 165062
12725A65062O7652P5795Q2489L4399j4827k3828p9741m6863q2994p6514L7375
$$ 165062 232714 308509 390998 425397 410570 386742 307001 260138 177144 100630 138005
12714A38005P640o0635L2328k1004k9747K2069j1463m0858o1482j8167P8972N1868
$$ 138005 145645 85010 117338 96334 66587 88656 77193 36335 -25147 -43314 35658 87526
12702H7526N291k1932m5524j5287j3456l0036L2666M1979j5738j381j8679M880
$$ 87526 92817 70885 25361 10074 -3382 -33418 -752 41227 25489 24108 5429 10309
12690A0309N5167J2252m1789p8620k6878M435O5324M4651j4777l5986K0500j4240
$$ 10309 65476 77728 35939 -42681 -69559 -65124 200 44851 30074 -5912 14588 348
12678C48J352L2622L4840k2594j5124o8036l6738N9237L6746n314m9308L3294
$$ 348 1700 34322 69162 46568 31444 -36592 -73330 -14093 22653 17339 -31969 1325
12666A325j1944p837J8435l7407J7204M5048n2171m8196j3127L275N1712j5763
$$ 1325 -10619 -18456 -21 -37428 -20224 24824 -27347 -75543 -88670 -85395 -33683 -49446
12654d9446k8330J5641M4913l3510l5930K4430J5474N6200J2147m1318l3826j8182
$$ -49446 -77776 -62135 -17222 -50732 -86662 -62232 -46758 9442 21589 -19729 -53555 -71737
12642g1737K7687N0349p706J2268k9805Q578K5998q640k1845L1417M6007N683
$$ -71737 -44050 6299 -1407 10861 -18944 -10366 15632 6992 -14853 16564 62571 68254
12630F8254j1468j2356J996J9787m676m6307K9877J8963m3242m3704o641R45j813
$$ 68254 56786 44430 46426 66213 61537 15230 45107 64070 20828 -22876 -29517 -28572 -30385
12617c0385N0877L5101O1911o52J2797K3558r0920j5995l1094j9618M2018p155
$$ -30385 20492 55593 117504 116852 129649 153207 62287 46292 15198 -4420 37598 30443
12605C0443K2578k207q257r266J1555k5257k2617o725J6430r34o3955L2806p070
$$ 30443 53021 50814 42557 33291 44846 19589 -3028 -9753 6677 5743 -58212 -25406 -32476
12592c2476M0225J2972K6285j7690J8612L7274k1839J2335k6389L1104R090j1921
$$ -32476 7749 20721 47006 29316 47928 85202 63363 75698 49309 80413 89503 77582
12580G7582n6415K832M463m8783M43J5527L9792K1259j2429q6179k4963P7770
$$ 77582 21167 23999 28462 -20321 -19878 -4351 35441 56700 44271 -41908 -66871 10899
12568A0899M0419K9401j5653n3392l0035r255j4839k263L4924K4183K4876O475
$$ 10899 51318 80719 65066 11674 -18361 -27616 -42455 -44718 -9794 14389 39265 45740
12556D5740k3302K1311n375K2696l4800j5027k3112L1606M383k8910p022M9481
$$ 45740 22438 43749 38374 61070 26270 11243 -11869 19737 24120 -4790 -11812 37669
12544C7669K7457J2991J2360r850j8281K0679m3045j895q41K2273j5978J3770
$$ 37669 65126 78117 90477 80627 62346 83025 39980 38085 37244 59517 43539 57309
12532E7309q816j1721J3671k86k8719l2385k4781R691q090M0747J258p124M7890
$$ 57309 48493 36772 50443 50157 21438 -10947 -35728 -26037 -34127 6620 7878 754 48644
12519D8644l1135k9895P685j618J3871l5113k0297K2861N8974K4371K8216m4345
$$ 48644 17509 -12386 -4701 -6319 7552 -27561 -47858 -24997 33977 58348 86564 42219
12507D2219q038L6755R242k9919N6352L2862q0941j02370l058k6957J3644J9961
$$ 42219 34181 70936 80178 50259 106611 139473 58532 -43838 -46896 -73853 -60209 -40248
12495d0248K7760K1288n2534J2296j8839j7990k9711m44M1192L1212m9744L8130
$$ -40248 -12488 8800 -43734 -31438 -50277 -68267 -97978 -98422 -57230 -26018 -75762 -37632
12483c7632j0597J50J10429J1163m3527n6755o8437k5940l056K0286N2131P1052
$$ -37632 -48229 -48079 62350 73513 29986 -26769 -95206 -121146 -124202 -103916 -51785 19267
12471A9267k6030o0915k4469j9495R8366O0474P5786l349q1178k0412j2953P570
$$ 19267 -6763 -67678 -92147 -111642 -13276 47198 122984 119635 38457 18045 5092 12662
12459A2662j9916l0499L188P683N4235j1345m077m9918n892k998L0904M1668j0114
$$ 12662 -7254 -37753 -34565 -26882 27353 16008 11931 -37987 -43879 -46877 -15973 25695 15581
12446A5581N4940L5861K3832k2096n8740R624M378m4390L7149j0443l543l4051
$$ 15581 70521 106382 130214 108118 49378 59002 63380 18990 56139 45696 42153 8102
12434H102J6353K9032r940j801j8376o1817r960O8817k2326o7635m2441K4511
$$ 8102 24455 53487 43547 41746 23370 -38447 -48407 20410 -1916 -69551 -111992 -87481
12422h7481J5641N350K5707m9730O540P0034J5152O739L9469L1857k7246l623
$$ -87481 -71840 -66490 -40783 -90513 -83973 -13939 1213 7952 47421 79278 52032 48409
12410D8409n2514o2197p340M9584l7795l0546J1997j196N1694J0917M1924L1305
$$ 48409 -4105 -66302 -73642 -24058 -61853 -92399 -80402 -81598 -29904 -18987 22937 54242
12398E4242k2847n4625k5160j932j3652k1755K0920L4815L6212l3127p9689N315
$$ 54242 31395 -23230 -48390 -50322 -63974 -85729 -64809 -29994 6218 -26909 -106598 -101283
12386a01283J3072m9050L0181J4304j8112Q3670N6764K8503j3456K7814m0454
$$ -101283 -88211 -137261 -107080 -92776 -110888 -27218 29546 58049 44593 72407 31953
12375C1953n5597l8172n3057K1824J4915K0457J6211j5370J3913J7561P928K3829
$$ 31953 -23644 -61816 -114873 -93049 -78134 -57677 -41466 -56836 -42923 -25362 -17434 6395
12363F395K2128J7283j5904o143L1147N96p9781k1969L653k3197j0993k6951m7541
$$ 6395 28523 45806 29902 23759 54906 55502 -24279 -46248 -42595 -65792 -76785 -103736 -151277
12350a51277q296j4812J00166n301J5339N5971j826k8603l3033M2292L3761M0394
$$ -151277 -159573 -174385 -74219 -79520 -64181 -8210 -10036 -38639 -71672 -29380 4381 44775
12338D4775k3588l6971r3697n7233N2598O3691M9091j7243j3741k0718j6472N5377
$$ 44775 21187 -15784 -109481 -166714 -114116 -50425 -1334 -18577 -32318 -53036 -69508 -14131
12326a4131L009K0038m2881o7661l0463M3540K3973N8106L0681r468L1006k5840
$$ -14131 -11122 8916 -33965 -101626 -132089 -88549 -64576 -6470 24211 14743 45749 19909
12314A9909R381M844k9163l7801k7774K9465N75j7748K1360L0691J3655m8599
$$ 19909 29290 34134 4971 -32830 -60604 -31139 -30564 -48312 -26952 3739 17394 -31205
12302c1205m7297J6353M2946J473j1877l6722K2905N2494j6386L561K2830J2284
$$ -31205 -78502 -62149 -19203 -17730 -29607 -66329 -43424 9070 -7316 -3755 19075 31359
12290C1359m7449M4395m4721j6948M1152O1191l5655q048P5582R65n5407o9038
$$ 31359 -16090 28305 -16416 -33364 7788 68979 33324 25276 100858 101823 46416 -22622
12278b2622o003l424j0384L2549K2397r841J3410j0715l9640L2030J4694K5401
$$ -22622 -28625 -32049 -42433 -9884 12513 2672 16082 5367 -34273 -2243 12451 37852
12266C7852J4383n3506n2581L1381l6758M1996J0453k4894j8449L0906K1298k0151
$$ 37852 52235 -1271 -53852 -22471 -59229 -17233 -6780 -31674 -50123 -19217 2081 -18070
12254a8070J0450L7321j4039l1491k6034J9553L9184Q368J7040j6758j00Q455
$$ -18070 -7620 29701 15662 -15829 -41863 -22310 16874 25242 42282 25524 25424 33879
12242C3879q826k4432l0113r584j0050r342J1072k0210o3871L3257L7289J3K5655
$$ 33879 25053 621 -29492 -39076 -49126 -58468 -47396 -67606 -131477 -98220 -60931 -60918 -35263
12229c5263M9624K427N6245n578o2609m4523N4351j9627j2373j1543j4099l6697
$$ -35263 14361 16788 73033 67455 4846 -39677 14674 -4953 -17326 -28869 -42968 -79665
12217g9665m7143Q480K6921l5626K2432L3536J6710j777j0815N931N2722J30571
$$ -79665 -126808 -118328 -91407 -127033 -104601 -71065 -54355 -56132 -66947 -61016 -8294 122277
12205A22277J0766j13125o7779L0210L4308Q442l9036M3547Q075l0289L9828J0307
$$ 122277 133043 19918 -47861 -17651 16657 25099 -13937 29610 37685 7396 47224 57531
12193E7531r436j5848l5996l3672O685N235m121m3474o5896j1625Q7939M0277
$$ 57531 48095 32247 -3749 -37421 -30736 -25501 -29622 -73096 -138992 -150617 -62678 -22401
12181b2401n4512Q74K8377Q859j3736P191O2674J8817q2934k7195N170M1862K5329
$$ -22401 -76913 -76039 -47662 -38803 -52539 -45348 17326 36143 -46791 -73986 -68816 -26954 -1625
12168a625n054k6978M2469K7975l1137K1046j4274j3744m1532n2977o5040J16525
$$ -1625 -6679 -33657 8812 36787 5650 26696 12422 -1322 -42854 -95831 -160871 -44346
12156d4346N9584m8680n6816M8703m7407k8869N3661K3555O197K5639j3784m9840
$$ -44346 15238 -33442 -90258 -41555 -88962 -117831 -64170 -40615 -34418 -8779 -22563 -72403
12144g2403N1657L0184K0622L2614m549o7929j9998N8616k1912l8042L3982N8530
$$ -72403 -20746 9438 30060 62674 58125 -9804 -29802 28814 6902 -31140 2842 61372
12132F1372J8430l4377l9370K8683J09606P1663m3383n8522p7713q6300k3922
$$ 61372 79802 45425 6055 34738 144344 216007 172624 114102 36389 -49911 -73833
12121g3833l4551k7412k5845K8627P2415L3516J6928J1363j1866l0010L7036P5697
$$ -73833 -108384 -135796 -161641 -133014 -60599 -27083 -10155 1208 -10658 -40668 -3632 72065
12109G2065J3222o2550m3299K8535L8977k1616m8222J2940L8342K3134K0804j2882
$$ 72065 85287 22737 -20562 7973 46950 25334 -22888 -9948 28394 51528 72332 59450
12097E9450p3864o1167J0169M3205J7064k2011m4931K8942O1411n743j5714M3074
$$ 59450 -14414 -75581 -65412 -22207 -5143 -27154 -72085 -43143 18268 12525 -3189 39885
12085C9885m2744m6223L5287p638K8908O731n9584P224K4034J1312o8674j9861
$$ 39885 -2859 -49082 -13795 -21433 7475 14206 -45378 -38154 -14120 -2808 -71482 -91343
12073i1343J5308L4025n6792J086K0931k5327k8950M5722R5310R893m7561k6870
$$ -91343 -76035 -42010 -98802 -97716 -76785 -102112 -131062 -85340 9970 19863 -27698 -54568
12061e4568n865K6102j8461L1529o431l9858Q668O70q594J5150l6382l790j8608
$$ -54568 -60433 -34331 -52792 -21263 -27694 -67552 -58884 -58214 -66808 -51658 -88040 -91830 -110438
12048a10438N182R2944N4076P979m1750l3845m8329j9159J3678Q780k8458o2044
$$ -110438 -105256 -12312 41764 49743 7993 -25852 -74181 -93340 -79662 -70882 -99340 -161384
12036a61384N5926P3657L8153l2629J9932P1114j8786m503J0816o279l340R799
$$ -161384 -105458 -31801 6352 -26277 -6345 64769 45983 41480 52296 46017 42677 52476
12024E2476j1900k016l1655J4393P124k8744m4569J2987L6464m514o227l8029
$$ 52476 40576 38560 6905 21298 28422 -322 -44891 -31904 4560 46 -6181 -44210
12012d4210m9751J4646l945N6740K6049Q210l5884l7958n7982K9792O8093k1547
$$ -44210 -93961 -79315 -83260 -26520 -471 7739 -28145 -66103 -124085 -94293 -26200 -47747
12000d7747L9887M2312K6155L1480K2306o2820m9632o782N9272l1755J7142L2150
$$ -47747 -7860 34452 60607 92087 114393 51573 1941 -4841 54431 22676 39818 71968
11988G1968k6524M2629K2497J943q3827l009J00531l863r3062k3340J5037L9779
$$ 71968 45444 88073 110570 112513 28686 25677 126208 122345 29283 5943 20980 60759
11976F0759l5697N489N566j6756J1686J708k1592R202J0478j80k0500m9097M1854
$$ 60759 25062 30551 36117 19361 31047 32755 11163 20365 30843 30663 10163 -38934 2920
11963B920N7192k4801p1448m988K6212K22k2678P903M4550R1L5751K7530K497
$$ 2920 60112 35311 -36137 -41125 -14913 -14691 -37369 -29466 15084 15175 50926 78456 80953
11950H0953k6208p4277j2586K1373K044j9707J8715P0933J72m0455J2150o619
$$ 80953 54745 -19532 -32118 -10745 -8701 -28408 -9693 61240 61412 20957 33107 26488
11938B6488m2463m2462J1790L7907l6951l6789K0844K8958l7244r624k5725J0396
$$ 26488 -15975 -58437 -46647 -8740 -45691 -82480 -61636 -32678 -69922 -79546 -105271 -94875
11926i4875M3537K0408n814J820l1710R670j24n0236P8172R1538j9536l0053n5375
$$ -94875 -51338 -30930 -36744 -34924 -66634 -56964 -57088 -107324 -29152 62386 42850 12797 -42578
11913d2578p055K1499K1895m4249l1215J5109L0565n877j5727M341K2532M7983
$$ -42578 -49633 -28134 -6239 -50488 -81703 -66594 -36029 -41906 -57633 -53292 -30760 17223
11901A7223L2493k9124j225K676k6568n7214K7768j8716j426n616m538K4455j511
$$ 17223 49716 20592 19367 22043 -4525 -61739 -33971 -52687 -54113 -59729 -64267 -39812 -41323
11888d1323q729L9634J7119n6847j8859m0142k582M6159N5685L0380j9422k5790
$$ -41323 -50052 -10418 6701 -50146 -69005 -109147 -111729 -65570 -9885 20495 1073 -24717
11876b4717k6508m6484K2934P8008j0366p897O6421J0706l2853k9984J4347j2181
$$ -24717 -51225 -97709 -74775 3233 -7133 -15030 51391 62097 29244 -740 13607 1426
11864A426p6005J8306L4300N2986K3773q0750l6506k9919K0210N5602q180n4137
$$ 1426 -74579 -56273 -21973 31013 54786 -25964 -62470 -92389 -72179 -16577 -24757 -78894
11852g8894j2103J6267M3063O7375O171p858l022o1873k5144K3146j9591j1395
$$ -78894 -90997 -74730 -31667 35708 41879 34021 30999 -30874 -56018 -32872 -52463 -63858
11840f3858k2633q831K7159J8402O371k9266J718L4032j0910R339l956L3989k8276
$$ -63858 -86491 -95322 -68163 -49761 -43390 -72656 -70938 -36906 -47816 -38477 -42433 -8444 -36720
11827c6720j5545J9869Q346j7241j4632j8929j3577L2819L8918J5659p241l7669
$$ -36720 -52265 -32396 -24050 -41291 -55923 -74852 -88429 -55610 -16692 -1033 -8274 -45943
11815d5943o2653n366k9333K1990M5389j5343J2661N0144J04877K3125p1932J0990
$$ -45943 -108596 -113962 -143295 -121305 -75916 -91259 -78598 -28454 76423 99548 27616 38606
11803C8606q4089M199L5987J8080N033l4603K5931K9562n4888k0769m7174j3237
$$ 38606 -45483 -41284 -5297 12783 17816 -16787 9144 38706 -16182 -36951 -84125 -97362
11791i7362K5298p601j5511J4275J3242N8180L9767k1161k7318J542J8416j3964
$$ -97362 -72064 -79665 -95176 -80901 -67659 -9479 30288 9127 -18191 -16649 1767 -12197
11779a2197O2901L2771l3238l3808l111o714l1119j4082q604l359n1593m5258
$$ -12197 50704 83475 50237 16429 13318 6604 -24515 -38597 -47201 -50560 -102153 -147411
11767a47411J6298J9083P2153O5113J244l8483p4413M0946N3578r954J3046K7297
$$ -147411 -131113 -112030 -39877 25236 26480 -12003 -86416 -45470 8108 -1846 11200 38497
11755C8497o959k7649M065j5784p1871n1522o774J7334J5563m107L1241j6974
$$ 38497 31538 3889 7954 -7830 -79701 -131223 -137997 -120663 -105100 -109207 -77966 -94940
11743i4940l2573K5245K9448M2821N1622M8073n750j8829n9734k5836l8796N576
$$ -94940 -127513 -102268 -72820 -29999 21623 69696 63946 45117 -14617 -40453 -79249 -73673
11731g3673n203K843l8439L6204R5770j2345n350J4329l4958J6996m941l8306
$$ -73673 -78876 -76033 -114472 -78268 17502 5157 -193 14136 -20822 -3826 -8767 -47073
11719d7073n8655J7771L8620K5551R001k3731K6303J956N4301n0984K5089M2591
$$ -47073 -105728 -87957 -49337 -23786 -14785 -38516 -12213 -10257 44044 -6940 18149 60740
11707F0740j9937j3572L6894j9007j1762L105L583q038K80o7057k9917k1072j2610
$$ 60740 40803 27231 64125 45118 33356 36461 40044 32006 32286 -34771 -64688 -85760 -98370
11694i8370J114J5835J4263p4078K7157O3559l098N9670O6065K1925j01251k3550
$$ -98370 -97256 -81421 -67158 -141236 -114079 -50520 -53618 6052 72117 94042 -7209 -30759
11682c0759J8130K8602J7227k780J0284l326o1K5201R39p258m6589m0749l0338
$$ -30759 -12629 15973 33200 30420 40704 37378 37317 62518 63457 56199 9610 -31139 -61477
11669f1477q98P793N3178J7894J6172l1033k631l5548k0442O8513Q6374k8761
$$ -61477 -62375 -54582 -1404 16490 32662 1629 -1002 -36550 -56992 11521 97895 69134
11657F9134j1083K129q862q7325k2458K5738M4942k6516j7379J7694O764l2703
$$ 69134 58051 60180 51318 -36007 -58465 -32727 12215 -14301 -31680 -13986 -7222 -39925
11645c9925J0766J4489l7677J9549J7339J8517l2027K0664R512j9366r755L3465
$$ -39925 -29159 -14670 -52347 -32798 -15459 3058 -28969 -8305 1207 -18159 -27914 5551
11633E551K9236L1702N2301j8971m4746M2383k4238r7154J3113K1094k2292K5170
$$ 5551 34787 66489 118790 99819 55073 97456 73218 -23936 -10823 10271 -12021 13149
11621A3149O2265k793k1825p0944r3826J3997J22641L3528L9372j7080r0369r0450
$$ 13149 75414 72621 50796 -20148 -113974 -99977 22664 56192 95564 78484 -11885 -102335
11609a02335k4911l317K5328P5222N8709o99l3124l3153k0034Q4456J0640j4854
$$ -102335 -127246 -130563 -105235 -30013 28696 27997 -5127 -38280 -58314 26142 36782 21928
11597B1928l2314j7060m5393j5037P4082l891N7561p074J6909j3022l2287j5769
$$ 21928 -10386 -27446 -72839 -87876 -13794 -17685 39876 32802 49711 36689 4402 -11367
11585a1367l19l0945J1759m704q514M1048J5806n3235k6136N3627R1977l751r8228
$$ -11367 -11686 -42631 -30872 -35576 -44090 -3042 12764 -40471 -66607 -12980 78997 75246 -22982
11572b2982q6297K7541P6696p777k9045q2882L0829P1240L4138j2970M1995k992
$$ -22982 -109279 -81738 -5042 -12819 -41864 -124746 -93917 -22677 11461 -1509 40486 37494
11560C7494k0485m3446k7797n909N838Q2495j7440K5318m2600r1203M6875K0263
$$ 37494 17009 -26437 -54234 -60143 -54305 28190 10750 36068 -6532 -97735 -50860 -30597
11548c0597o0M2025N076j0335k8683J10200O0566q2157p2605m6668k5625j0569
$$ -30597 -30657 11368 16444 6109 -22574 87626 148192 66035 -6570 -53238 -78863 -89432
11536h9432K1725M3236k249K3018O6967M123n1127N0064J8673r8084l3590Q934
$$ -89432 -67707 -24471 -26720 -3702 63265 67388 16261 66325 84998 -13086 -46676 -37742
11524c7742m5770m420N5919J9101J0839k2818l7164K0318J6891p4955l688j0269
$$ -37742 -83512 -87932 -32013 -12912 -2073 -24891 -62055 -41737 -24846 -99801 -103489 -113758
11512a13758j8595J02745R3374L4712Q992r813n7961J8536k7515p341l3361j1837
$$ -113758 -132353 -29608 63766 98478 107470 97657 39696 58232 30717 23376 -9985 -21822
11500b1822r66m684K7684j2465n6192r917n194P317J2889k1929k1864L6788M8258
$$ -21822 -22788 -27472 212 -12253 -68445 -78362 -83556 -76239 -63350 -85279 -107143 -70355 -22097
11487b2097j6926P464o0155k072o104l9366K5065N5950N2896j9911l0658O4339
$$ -22097 -39023 -31559 -91714 -93786 -99890 -139256 -114191 -58241 -5345 -25256 -55914 8425
11475H425M1387N922J727m0386k028k280J2898k8731j2507N485J8967M163j2744
$$ 8425 49812 55734 57461 17075 15047 12767 25665 -3066 -15573 -10088 8879 13042 298
11462B98k0508r5160k2967K4649Q4667N6762p724jl148M1334K7880K5409j3044
$$ 298 -20210 -115370 -138337 -113688 -29021 27741 20017 20016 16868 58202 86082 111491 98447
11449I8447k1381k4336j9939q6796N2662j053q3811K9060N3465p107m068m85M0938
$$ 98447 77066 52730 32791 -54005 -1343 -2396 -86207 -57147 -3682 -10789 -14857 -15342 25596
11436B5596K4494r148k8287k8638n851Q16K9274n2381r775j1811J1910L7220O191
$$ 25596 50090 40942 12655 -15983 -21834 -21018 8256 -44125 -53900 -65711 -53801 -16581 -10390
11423a0390m160j1668L7093J9051p1104R196R8376O889o9130k8514J7335J6394
$$ -10390 -14550 -26218 10875 29926 -41178 -31982 66394 73283 4153 -24361 -7026 9368
11411I368p4722K7029n167o6623j1082N6121O4059J0833p637K2072o02M6038m3768
$$ 9368 -65354 -38325 -43492 -110115 -121197 -65076 -1017 9816 2179 24251 23649 69687 25919
11398B5919J0294J4167J5985m2271l1099j1213m0560R007O995r395n8471O1351
$$ 25919 36213 50380 66365 24094 -7005 -18218 -58778 -49771 -42776 -52171 -110642 -49291
11386d9291K0978K4966K2307j2968j812j02532k9676J9817J6613L0518M1254Q2164
$$ -49291 -28313 -3347 18960 5992 4180 -98352 -128028 -108211 -91598 -61080 -19826 62338
11374F2338m3007n6668r32P1945j5029k7489O7286K8370l0671M24K4818q0288
$$ 62338 19331 -37337 -38269 33676 18647 -8842 58444 86814 56143 56567 81385 1097
11362A097p0233K0603M6900J9811n8688l2540K4730N721j6668m8998K4430K6493
$$ 1097 -69136 -48533 -1633 18178 -40510 -73050 -48320 -42599 -59267 -108265 -83835 -57342
11350e7342K050M0612O5790n8814m4866J0925L2609j8659l0646j2830L8619N7274
$$ -57342 -55292 -14680 51110 -7704 -52570 -41645 -9036 -27695 -58341 -71171 -32552 24722
11338B4722n8852l5838j3823N281N2709j0486P332M367J0962L079l2747Q369M4381
$$ 24722 -34130 -69968 -83791 -78510 -25801 -36287 -28955 -24588 -13626 -10547 -43294 -34925 9456
11325I456j9499j6172l7167J484R239k9032r393r94M1003L8688q590N482R786
$$ 9456 -10043 -26215 -63382 -61898 -52659 -81691 -91084 -92078 -51075 -12387 -20977 -15495 -5709
11312e709n3151m6538o2076l4472J15249O4875r111L8939M4235J034n0800M1433
$$ -5709 -58860 -105398 -167474 -201946 -86697 -21822 -30933 8006 52241 53275 2475 43908
11300D3908j6511l4617l1522l521N7791k7186L8172J0970l455j405k2542n6148
$$ 43908 27397 -7220 -38742 -42263 15528 -11658 26514 37484 34029 32624 10082 -46066
11288d6066k9484J4306j5295q135L4446l15j5356K5309Q723l680M8954L5443n5261
$$ -46066 -75550 -61244 -76539 -84674 -50228 -50543 -65899 -40590 -31867 -35547 13407 48850 -6411
11275f411n2457k7659J2543j9443N1030J9771N9804m8148m9175j9169L7628L1337
$$ -6411 -58868 -86527 -73984 -93427 -42397 -22626 37178 -10970 -60145 -79314 -41686 -10349
11263a0349j9186m088m7852m2881J492L4431K1596R3869l2606L06J6657l7567
$$ -10349 -29535 -33623 -81475 -124356 -122864 -88433 -66837 27032 -5574 -5268 11389 -26178
11251b6178o9231j2101K2622n1338k2177L8656P9431J2279O6501O9966n522l0444
$$ -26178 -95409 -107510 -84888 -136226 -158403 -119747 -40316 -28037 38464 108430 102908 72464
11239G2464m7977l2121k1715K5866j9198J375J4962P2616M50m2556j5037J1366
$$ 72464 24487 -7634 -29349 -3483 -22681 -21306 -6344 66272 66722 24166 9129 20495
11227B0495k2149K8026q361M0209J0495K0998M7996L3583p4158n1305k8684l0890
$$ 20495 -1654 26372 18011 58220 68715 89713 137709 171292 97134 45829 17145 -13745
11215a3745j3781j2423j1915j1011P059K5411J5706k4542O720j0307j3415k8266
$$ -13745 -27526 -39949 -51864 -62875 -55816 -30405 -14699 -39241 -32521 -42828 -56243 -84509
11203h4509J3406M3631n463Q885K1237J5874j5441J6518J5902m6415l5702J8081
$$ -84509 -71103 -27472 -32935 -24050 -2813 13061 -2380 14138 30040 -16375 -52077 -33996
11191c3996k9099L252M6396J5739J9901O5082m3972k9018J4988m3729l8428k701
$$ -33996 -63095 -59843 -13447 2292 22193 87275 43303 14285 29273 -14456 -52884 -55585
11179e5585j1978k9576l7558L5566O6539Q786L2472k46m5040L2506J2014J1646
$$ -55585 -67563 -97139 -134697 -99131 -32592 -23806 8666 8420 -36620 -4114 7900 19546
11167A9546l6766n6120K3342M3290k222J5939N2059j7666m607O909Q683k6730
$$ 19546 -17220 -73340 -49998 -6708 -8930 7009 59068 41402 36795 43704 52387 25657
11155B5657j8377j0270k2390m9425j7610O420K1871L1082R1576L0532l9800m9338
$$ 25657 7280 -2990 -25380 -74805 -92415 -85995 -64124 -33042 58534 89066 49266 -72
11143g2P385M3734j2492n9778J3225K7182k8033l7041j7555R722O2888o395r7734
$$ -72 7313 51047 38555 -21223 -7998 19184 -8849 -45890 -63445 -53723 9165 2770 -94964
11130i4964j8594L2164O3637l5209o3075k047M5944K8097J8167m189j3964k407
$$ -94964 -113558 -81394 -17757 -52966 -116041 -118088 -72144 -44047 -25880 -30069 -44033 -46440
11118d6440O487K9098p052M1195K1509O0496m3394n5466K0265N5503j3312k6563
$$ -46440 -39953 -10855 -17907 23288 44797 105293 61899 6433 26698 82201 68889 42326
11106D2326L543k0439M7749K5658j1758l6925o5539K5158K0888K2994j6231l8776
$$ 42326 45869 25430 73179 98837 87079 50154 -15385 9773 30661 53655 37424 -1352
11094a352J6030M806n6788n8404J4496J9679K8112O7608l4816J3579l643j6115
$$ -1352 14678 19484 -37304 -95708 -81212 -61533 -33421 34187 -629 12950 9307 -6808
11082f808m9147L323k7263M3311P1506k0669j535K8865j559m7930L0273p669l6900
$$ -6808 -55955 -52632 -79895 -36584 34922 14253 12718 41583 40024 -7906 22367 14698 -22202
11069b2202L9099j7034P655j5766k2807q346Q145k9785j2378M317L9355J8955
$$ -22202 16897 -137 7518 -8248 -31055 -39401 -31256 -61041 -73419 -69102 -29747 -10792
11057a0792j0592k1984k6690j4222q472J6886O2085j2914j3957P01j6492k9562
$$ -10792 -21384 -43368 -70058 -84280 -92752 -75866 -13781 -26695 -40652 -39951 -56443 -86005
11045h6005L3603J4078J9002o3754n3140M2578K135K7358j1394k2345L1935L3859
$$ -86005 -52402 -38324 -19322 -83076 -136216 -93638 -91503 -64145 -75539 -97884 -65949 -32090
11033c2090M5414l106m7374p8785K2917N8271Q3261m1989k9963J3180K23p132
$$ -32090 13324 10218 -37156 -115941 -93024 -34753 48508 6519 -23444 -10264 -10041 -17173
11021a7173k0219k0782O9884K8069N077m8208K327r089r070j3942o642j7671J3197
$$ -17173 -37392 -58174 11710 39779 44856 -3352 -1025 -10114 -19184 -33126 -39768 -57439 -44242
11008d4242N8162j901q336m0709p6737q258L3956J8926K1218L5336L1518Q03n8935
$$ -44242 13920 12019 3683 -37026 -113763 -122021 -88065 -69139 -47921 -12585 18933 19736 -39199
10995c9199p3901K6479L0920k1318l0041l4403O421N634K4655K2775j6290K2496
$$ -39199 -113100 -86621 -55701 -77019 -107060 -141463 -135042 -129408 -104753 -81978 -98268 -75772
10983g5772K8424M6212K9747k747k7104K5733j0794m358M4391k506m905M0231
$$ -75772 -47348 -1136 28611 25864 -1240 24493 13699 9341 53732 51226 46321 86552
10971H6552m123m5339p4438l4384j1311R269q7678O194N7352N4874L1912m2486
$$ 86552 82429 37090 -37348 -71732 -83043 -73774 -161452 -155258 -97906 -43032 -11120 -53606
10959e3606k199K1258O071m9399M570K0339M3201J6250L3529q9583n8982J6488
$$ -53606 -55805 -34547 -28476 -77875 -73305 -52966 -9765 6485 40014 -49569 -108551 -92063
10947i2063r208l1609M2995O0321K9972J0989J346n2528M0199O4549n7537j4767
$$ -92063 -101271 -132880 -89885 -29564 408 11397 12743 -39785 414 64963 7426 -7341
10935g341j5868m2847J2004K3213R439k9320L6180L0732M995k8792N4222O0017
$$ -7341 -23209 -66056 -54052 -30839 -21400 -50720 -14540 16192 21187 -7605 46617 106634
10923A06634j8698o3603m9395J9001M0419J470j6919R994j8588L743J1264o7973
$$ 106634 87936 24333 -25062 -6061 34358 35828 18909 28903 10315 14058 25322 -42651
10911d2651m4906J2519j6481K7977N1727L2431K2334n764k1419q3995m9547m941
$$ -42651 -87557 -75038 -91519 -63542 -11815 20616 42950 37186 15767 -68228 -117775 -122716
10899a22716j9779J04670J2053o937L6476N1327l8146m0779L1453N3304q376L0936
$$ -122716 -142495 -37825 -25772 -32709 3767 55094 16948 -23831 7622 60926 52550 83486
10887H3486Q5975k3958p8914k9107k0095J256o80l6967l6326n4867l8630l0936
$$ 83486 169461 145503 66589 37482 17387 18643 17963 -19004 -55330 -110197 -148827 -179763
10875a79763K1668P3595M3660K2172N8569L0656k9290j6039K3853o99m1412m731
$$ -179763 -158095 -84500 -40840 -18668 39901 70557 41267 25228 49081 48382 6970 2239
10863B239p6274k0285N7040L3473k9640k4557k2221j8279n639M5296R7176q858
$$ 2239 -74035 -94320 -37280 -3807 -33447 -58004 -80225 -98504 -104143 -58847 38329 29471
10851B9471o7280K132p371l620o242K4173J8388J1729K0038j4601k852L6134M2429
$$ 29471 -37809 -35677 -43048 -46668 -52910 -28737 -10349 1380 21418 6817 3965 40099 82528
10838H2528K6850j2399m526p641p0643l3956o4631K7225J9451k5362L1227P395
$$ 82528 109378 96979 92453 84812 14169 -19787 -84418 -57193 -37742 -63104 -31877 -24482
10826b4482k7001L492M4941M8387l7811l4391m4911J7230O1471m0510q2656j8764
$$ -24482 -51483 -47991 -3050 45337 7526 -26865 -71776 -54546 6925 -33585 -116241 -135005
10814a35005M1271K4030N2286k607P079m2433P338N7532J1240k343k8390m4546
$$ -135005 -93734 -69704 -17418 -20025 -12946 -55379 -48041 9491 20731 18388 -10002 -54548
10802e4548k7953k1364K8121O130J3231m399R816j0752L3917N3986j4416K081
$$ -54548 -82501 -103865 -75744 -69614 -56383 -60782 -50966 -61718 -27801 26185 11769 13850
10790A3850J8316J7063n5472p1794p6991K5586J09549P7286J0169R639J0815j6420
$$ 13850 32166 49229 -6243 -78037 -155028 -129442 -19893 57393 67562 77201 88016 71596
10778G1596l5231J7407J070k1920K2949m5046p6528J9851J5363k7421M138L3746
$$ 71596 36365 53772 54842 32922 55871 10825 -65703 -45852 -30489 -57910 -53772 -20026
10766b0026L0105j2240o4875N570J4539m0559L1342O183K9609L458m4601J6616
$$ -20026 10079 -2161 -67036 -61466 -46927 -87486 -56144 -49961 -20352 -16894 -61495 -44879
10754d4879Q1159q02j4596l9304K5543O8687O771K4316q925m3180n0135r755J1984
$$ -44879 36280 35478 20882 -18422 7121 75808 82579 106895 97970 54790 4655 -5100 6884
10741F884L3705l148K7669l360k6593J2751J7074k2384J2589K1253j19966j0598
$$ 6884 40589 37441 65110 61750 35157 47908 64982 42598 55187 76440 -43526 -54124
10729e4124M3660L0328k5335l3218j4949K7960J2998R482k1092L3404l113m3657
$$ -54124 -10464 19864 -5471 -38689 -53638 -25678 -12680 -3198 -24290 9114 6001 -37656
10717c7656n6155l4041O8018M280J12L7969N3672o523p3118j4506J8405q5139
$$ -37656 -93811 -127852 -59834 -55554 -55442 -17473 36199 29676 -43442 -57948 -39543 -124682
10705a24682L8893L2325l0860m367R673Q36L170J2101L5675L8440J7380J6743
$$ -124682 -85789 -53464 -84324 -88691 -79018 -78182 -75012 -62911 -27236 11204 28584 45327
10693D5327J365k1974k2553p319k5906M0360j3467l6617l0377R833K5752J5890
$$ 45327 46692 24718 2165 -5154 -31060 9300 -4167 -40784 -71161 -61328 -35576 -19686
10681a9686j2995n4905N5740k7964L1784N7061L6163l5517k963j1264J6975k326
$$ -19686 -32681 -87586 -31846 -59810 -28026 29035 65198 29681 26718 15454 32429 30103
10669C0103n247K868j5504l9378j3493n7760k4666Q3675O0571j3166o5586m1695
$$ 30103 24856 27724 12220 -27158 -40651 -98411 -123077 -39402 21169 8003 -57583 -99278
10657i9278L1119M5862k0910p5940k5191M6805M0723k4786j773j0049L081K5419
$$ -99278 -68159 -22297 -43207 -119147 -144338 -97533 -56810 -81596 -83369 -93418 -90337 -64918
10645f4918n914k4973L6677N6464l786j8940J194m1994M659J3215L1592L8717
$$ -64918 -70832 -95805 -59128 -2664 -6450 -25390 -24196 -66190 -61531 -48316 -16724 21993
10633B1993k6360m7954j6817O9M1996P9691J5392l6508l0855m7945l296J6756
$$ 21993 -4367 -52321 -69138 -69069 -27073 52618 68010 31502 647 -47298 -50594 -33838
10621c3838K1143j303n0223l4274k6634o135j6425J7972M4743N7926J5327J1304
$$ -33838 -12695 -13998 -64221 -98495 -125129 -131264 -147689 -129717 -84974 -27048 -11721 -417
10609d17m8411J653K5105J7416k3460l2540k2499L5301N838m3910k743k4279M0848
$$ -417 -48828 -47175 -22070 -4654 -28114 -60654 -83153 -47852 -42014 -85924 -88667 -112946 -72098
10596g2098O4183J4392J4311k1283m144r935k6408k4414K0528j981N689m7096
$$ -72098 -7915 6477 20788 -495 -4639 -14574 -40982 -65396 -44868 -46849 -41160 -88256
10584h8256k6140J8243J1201j0951L8903L119J7827o778l6639o355O8631Q6947
$$ -88256 -114396 -96153 -84952 -95903 -57000 -53881 -36054 -42832 -79471 -85826 -17195 69752
10572F9752q2114l4337L9046K7956M022L6322J753J2845J3916j8622l5274p156
$$ 69752 -12362 -46699 -7653 20303 24325 60647 62400 75245 89161 70539 35265 28109
10560B8109M2311J5273l0353k4631j4538q1172n709N9167J6772J9567k4260j2037
$$ 28109 70420 85693 55340 30709 16171 -65001 -70710 -11543 5229 24796 536 -11501
10548a1501M627j6380l5609m1967N5635M9996M0547k9027m5893N4951K2540p9752
$$ -11501 -6874 -23254 -58863 -100830 -45195 4801 45348 16321 -29572 25379 47919 -31833
10536c1833m8769M2161J7893p711m6593Q4670j5800l6171L291M1083K1700l2783
$$ -31833 -80602 -38441 -20548 -28259 -74852 9818 -5982 -42153 -38862 2221 23921 -8862
10524h862n4536o847O863N3447M4417q0525k3234K3245l842K970n4294n5138M9235
$$ -8862 -63398 -70245 -63382 -9935 34482 -46043 -69277 -46032 -49874 -46904 -101198 -156336 -107101
10511a07101L7148P213k8400M414M0780N7015R1914j2493L825o6078m8444j8797
$$ -107101 -69953 -62740 -91140 -86726 -45946 11069 102983 90490 94315 28237 -20207 -39004
10499c9004k5582J2169K936m2681k8544M2371L8570M407l4621q3304m8261M7174
$$ -39004 -64586 -52417 -49481 -92162 -120706 -78335 -39765 -35358 -69979 -153283 -201544 -154370
10487a54370R0032N3958K2613J3459L3636j2587K4534j7001j7373m7736P933O388
$$ -154370 -64338 -10380 12233 25692 59328 46741 71275 54274 36901 -10835 -2902 3486
10475C486l512m421o5566L597Q6963O8438O969r8467p9499k4924M7948L8175l2723
$$ 3486 -26 -4447 -70013 -66416 20547 88985 95954 -2513 -82012 -106936 -58988 -20813 -53536
10462e3536p194J1445K3011O4077J5991m9598J5556j9309j7654r486K5974N1964
$$ -53536 -60730 -49285 -26274 37803 53794 4196 19752 443 -17211 -26697 -723 51241
10450E1241l2204n8248j1088O4610J7466m6632k8555k0128K5705O333j5233P3368
$$ 51241 19037 -39211 -50299 14311 31777 -14855 -43410 -63538 -37833 -31500 -46733 26635
10438B6635K8291k0838k7637o292j7224L5570J4396j7984l0507l9625R555J5144
$$ 26635 54926 34088 6451 159 -17065 18505 32901 14917 -15590 -55215 -45660 -30516
10426c0516j4687K5143K9081k1635m5030K2669K0395N1239k4792N719p0590m3362
$$ -30516 -45203 -20060 9021 -12614 -57644 -34975 -14580 36659 11867 17586 -53004 -96366
10414i6366k1559M8641P7688J7858m952l9838R930O4442k1282n8833M0754P0494
$$ -96366 -117925 -69284 8404 26262 21310 -18528 -8598 55844 34562 -24271 16483 86977
10402H6977k7662p3654J5589n3510m731P6157L0379j5715j1567k1175J7750n7636
$$ 86977 59315 -14339 1250 -52260 -56991 19166 49545 33830 22263 1088 18838 -38798
10390c8798m5380L2774k9012N5748N5589L1017l4046o6093K9017K1611R631l4625
$$ -38798 -84178 -51404 -80416 -24668 30921 61938 27892 -38201 -9184 12427 22058 -12567
10378a2567o9220j4959J2341O2108L5710l7224o5118j1782J0658M2157L0308O125
$$ -12567 -81787 -96746 -84405 -22297 13413 -23811 -88929 -100711 -90053 -47896 -17588 -11463
10366a1463k2843k0469k0873R137K6255N8798J4688j0662K6205l7248n4845j5367
$$ -11463 -34306 -54775 -75648 -66511 -40256 18542 33230 22568 48773 11525 -43320 -58687
10354e8687J2700j1216N156n862M5189J8728P377m0726m0280j7268P3442L8093
$$ -58687 -45987 -57203 -52047 -57909 -12720 6008 13385 -27341 -67621 -84889 -11447 26646
10342B6646K6263p614K2011l7045j2194k9341l9889Q492R5406K8837m7337j7316
$$ 26646 52909 45295 67306 30261 18067 -11274 -51163 -42671 52735 81572 34235 16919
10330A6919j2659k5540J6598L0655j8396J4726L0944l2302l5719j8410L8688M7802
$$ 16919 4260 -21280 -4682 25973 7577 22303 53247 20945 -14774 -33184 5504 53306
10318E3306k878p201p5083m831N0785k5506m8095K2434j4448n3017L158Q8890
$$ 53306 50428 43227 -31856 -36687 14098 -11408 -59503 -37069 -51517 -104534 -101376 -12486
10306a2486J1543J7915l7444l8379k2882Q465O1332l787M8386J5673m3543l9402
$$ -12486 -943 16972 -20472 -58851 -81733 -73268 -11936 -15723 32663 48336 4793 -34609
10294c4609m531k0601j9781k8477N9171L4700K5002N0217J265j890m7148J4457
$$ -34609 -39140 -59741 -79522 -107999 -48828 -14128 10874 61091 62356 60466 13318 27775
10282B7775k2452j7040K2179l9755k3048m875r446M3426J6812n9012p525O564
$$ 27775 5323 -11717 10462 -29293 -52341 -57216 -66662 -23236 -6424 -65436 -72961 -66397
10270f6397o8031J62P6349K206M5305r670m2468K250L4674j2827p0636M2767Q8773
$$ -66397 -134428 -134266 -57917 -55711 -10406 -20076 -62544 -60294 -25620 -38447 -109083 -66316 22457
10257B2457J0392o61l9506j1214K219J3785R729l18l9768n9736m3512M779M2452
$$ 22457 32849 32188 -7318 -18532 -16313 -2528 7201 6883 -32885 -92621 -136133 -131354 -88902
10244h8902k2189O0831O2942k269o6409l9920Q565K9145L1007R3446K1149l4285
$$ -88902 -111091 -50260 12682 10413 -55996 -95916 -87351 -58206 -27199 66247 87396 53111
10232E3111o5723p0016J3638k4890L4606P8639q2127p6043L6006P2697J4692J8611
$$ 53111 -12612 -82628 -68990 -93880 -59274 19365 -62762 -138805 -102799 -30102 -15410 3201
10220C201J4740O989J124k5839m4551m6023L7958O2077O5615J6927K9881O400
$$ 3201 17941 24930 26054 215 -44336 -90359 -52401 9676 75291 92218 122099 128499
10208A28499L473n5556m0609k6804N7126j2926k046p8935r421M397J9514J6782
$$ 128499 131972 76416 35807 9003 66129 53203 51157 -27778 -37199 -32802 -13288 3494
10196C494o3358q320l451N1048j0323l5867N4394K7901K41N3475l6701J2818j4185
$$ 3494 -59864 -68184 -71635 -20587 -30910 -66777 -12383 15518 15759 69234 32533 45351 31166
10183C1166K1651k093l0889K0342j3239J4950j6726j18043j1868L1826r947L7490
$$ 31166 52817 50724 19835 40177 26938 41888 25162 -92881 -104749 -72923 -82870 -45380
10171d5380M3037M2012O2496o5495m8769l3356L4881N1087K6077k2311o5388J5775
$$ -45380 -2343 39669 102165 36670 -12099 -45455 -10574 40513 66590 44279 -21109 -5334
10159e334K0737k021N506l1818j9374j8509N537K9232K29J1577L4331j2677q7906
$$ -5334 15403 13382 18888 -12930 -32304 -50813 -45276 -16044 -15815 -4238 30093 17416 -70490
10146g0490j2726J274Q650K1796K3931l1099j9960j3372k7153K9371J6692J139
$$ -70490 -83216 -81942 -73292 -51496 -27565 -58664 -78624 -91996 -119149 -89778 -73086 -71947
10134g1947J6948K0859j8970J9696J831K2739N7306J6436l4001K3591l1435l809
$$ -71947 -54999 -34140 -53110 -33414 -31583 -8844 48462 64898 30897 54488 23053 19244
10122A9244j9954p4576K0920L3594J6242J8953m9618n2717J4412J1020J3935q928
$$ 19244 -710 -75286 -54366 -20772 -4530 14423 -35195 -87912 -73500 -62480 -48545 -57473
10110e7473r180q491K4878J7806m8348K3186N6635l284k1667L415k6243J8062
$$ -57473 -66653 -75144 -50266 -32460 -80808 -57622 -987 -4271 -25938 -22523 -48766 -30704
10098c0704N5838L8939m1402p3275L418j4642l0131q099l0729o2947L1119K6879
$$ -30704 25134 64073 22671 -50604 -47186 -61828 -91959 -100058 -130787 -193734 -162615 -135736
10086a35736J6273Q0507M3729L140J7392L389q977k3127J5544R216m7683n0771
$$ -135736 -119463 -38956 4773 7913 25305 28694 19717 -3410 12134 21350 -26333 -77104
10074g7104l0015M9452j5170k7518j7362k4676n3385M2428K8387L210K6139k7824
$$ -77104 -107119 -57667 -72837 -100355 -117717 -142393 -195778 -153350 -124963 -121753 -95614 -123438
10062a23438k7867K8198J15100M9152J4290O941J9243r666k611l6405m0762N370
$$ -123438 -151305 -123107 -8007 41145 55435 62376 81619 71953 69342 32937 -7825 -2455
10050b455K3001o3941K8136j5402k8599K2959J6097O9356p1069m6319M2103O7303
$$ -2455 20546 -43395 -15259 -30661 -59260 -36301 -20204 49152 -21917 -68236 -26133 41170
10038D1170J8215j5130K7869R226j5016N123j7861J330P770l9498K01J9279m4894
$$ 41170 59385 44255 72124 81350 66334 71457 53596 54926 62696 23198 23399 42678 -2216
10025b216k5675l1116M8934K0878K8084J761j2020p5633k2369n958N2670N7721
$$ -2216 -27891 -59007 -10073 10805 38889 40650 28630 -47003 -69372 -75330 -22660 35061
10013C5061N3937J2913l5929k3176j1642j9765N22P56N6183k492q8617j619L3731
$$ 35061 88998 101911 65982 42806 31164 11399 11921 12677 68860 66368 -22249 -23868 9863
10000I863k6672n527J1968M818j919M2342o96J3695n924o1314p8765N3795N1290
$$ 9863 -16809 -22336 -10368 -5550 -7469 34873 34177 47872 41948 -19366 -98131 -44336 6954
9987F954J12945K7308J920M6743K18107J65974J21007K9283q3149k08570k51651
$$ 6954 119899 147207 149127 195870 413977 579951 700958 730241 647092 438522 186871
9976A86871j45883q8614M6533k4531k3691J2550L2334N4471J7660j3503k1061
$$ 186871 40988 -47626 -1093 -25624 -49315 -36765 -4431 50040 67700 54197 33136
9965C3136R08J1629r017m8741l5904K4584L754n920n0979k5029M1987P905L4889
$$ 33136 34044 45673 36656 -12085 -47989 -23405 -19651 -25571 -76550 -101579 -59592 -51687 -16798
9952a6798R575L408L3307J4051k8401J1842j9292m9071j4347P1972M045p4228
$$ -16798 -7223 -3815 29492 43543 15142 26984 7692 -41379 -55726 16246 20291 -53937
9940e3937n0488J7168M2944N7900q333l6143L534N36m662m0770R244O8940O6288
$$ -53937 -104425 -87257 -44313 13587 5254 -30889 -27355 -26819 -31481 -72251 -63007 5933 72221
9927G2221J9014j9053k8739K0259M458J40k958r516k7237l2022k8000J1109N7473
$$ 72221 91235 72182 43443 63702 68160 68300 65342 55826 28589 -3433 -31433 -20324 37149
9914C7149l7058J0477R627P0539n2007o0140l6693p469L1283P260L7058M9372
$$ 37149 91 10568 20195 90734 38727 -21413 -58106 -65575 -34292 -27032 10026 59398
9902E9398k7986n431j1966m7879K018j5539k9272P229m6897p9791J0048P8435
$$ 59398 31412 25981 14015 -33864 -31846 -47385 -76657 -69428 -116325 -196116 -186068 -107633
9890a07633N7418K679M5198N2539j6309l6269j5967j2443K1832M0398L326l6084
$$ -107633 -50215 -47536 -2338 50201 33892 -2377 -18344 -30787 -8955 31443 34769 -1315
9878a315m5512N1683j7653J9362P7295n842n3591q262j2286l0790l3513O2501
$$ -1315 -46827 4856 -12797 6565 83860 78018 24427 16165 3879 -26911 -60424 2077
9866B077J4808p8323n6697M6457L3567K5874j2998o0165J8132Q5220Q9280J6546
$$ 2077 16885 -61438 -118135 -71678 -38111 -12237 -25235 -85400 -67268 17952 107232 123778
9854A23778L1502P3624J65767K69684L40932M53010M30228J15493k65227m61807
$$ 123778 155280 228904 394671 664355 1005287 1458297 1888525 2004018 1738791 1276984
9844A276984m58039l35950j50976m3150p9108p5942k6696o766l8052k2980m9513
$$ 1276984 818945 482995 332019 288869 209761 133819 107123 100357 62305 39325 -10188
9833a0188M278N3548q999k3197m2455j6287K3507n913J8221M5651p614K4017N8251
$$ -10188 -5910 47638 38639 15442 -27013 -43300 -19793 -25706 -7485 38166 30552 54569 112820
9820A12820j7817n1053q364K4541p1235l9281J0288R165K8876j3102r945J7713
$$ 112820 95003 43950 35586 60127 -11108 -50389 -40101 -30936 -2060 -15162 -25107 -7394
9808g394J6587J4954k2944K2554j6740J2726K877P9970m6215K2685J3087n9194
$$ -7394 9193 24147 1203 23757 7017 19743 22620 102590 56375 79060 92147 32953
9796C2953k1604M9310j5487l1671R045j1088j580k8347j2846N624Q9857k8202
$$ 32953 11349 60659 45172 13501 22546 11458 9878 -18469 -31315 -25691 64166 35964
9784C5964j7109O2670k7205n4965m6378k6355L0343R313J4954M7638q1680o2867
$$ 35964 18855 81525 54320 -645 -47023 -73378 -43035 -33722 -18768 28870 -52810 -115677
9772a15677m5806J5285L091K5886j8343J2341L3577k097Q1325O7922k5275l9004
$$ -115677 -161483 -146198 -143107 -117221 -135564 -123223 -89646 -91743 -10418 57504 32229 -6775
9760f775J9511l8769L5573P3160K6158r136l2366n7401K5454K2666K535j2030
$$ -6775 12736 -26033 9540 82700 108858 99722 67356 9955 35409 58075 60610 48580
9748D8580m3251m1786L5690J8818k3092n6614L6472O1606k2535o0097L4363L0909
$$ 48580 5329 -36457 -767 18051 -5041 -61655 -25183 36423 13888 -46209 -11846 19063
9736A9063K5351k8026r011j6929j0219j8986l4614P510L6514l9644j1855J15274
$$ 19063 44414 16388 7377 -9552 -19771 -38757 -73371 -65861 -29347 -68991 -80846 34428
9724C4428M3697m2603p3900K1023m990M609K7032p611N7962J5319l5573l409j2145
$$ 34428 78125 35522 -38378 -17355 -22345 -17736 9296 1685 59647 74966 39393 35984 23839
9711B3839j404j5922M2954l7490l0828R772j5372l9183P1438M7269l9092p0719
$$ 23839 22435 6513 49467 11977 -18851 -9079 -24451 -63634 7804 55073 15981 -54738
9699e4738K6502k5468L7890M3425L3932j0817j32169q5330K0121P7526M2491n413
$$ -54738 -28236 -53704 -15814 27611 61543 50726 -81443 -166773 -146652 -69126 -26635 -32048
9687c2048l1318M8497N2095R850K6061o0557m5578K3176N3896N5950o8104l5953
$$ -32048 -63366 -14869 37226 47076 73137 12580 -32998 -9822 44074 100024 31920 -4033
9675d033j1226k9406N3318J6775m9196K5111R9j7749J0111P53P914J0731L8474
$$ -4033 -15259 -44665 8653 25428 -23768 1343 1442 -16307 -6196 -5443 2471 13202 51676
9662E1676m5648m2655J6575P34J2943K568K1977k7980k7612P4577k443L8746M0129
$$ 51676 6028 -36627 -20052 -19318 -6375 -3807 18170 -9810 -37422 37155 34712 73458 113587
9649A13587Q760M923k1771k1869J6557r651K484k3609K0449k9450m5642K9877
$$ 113587 122347 127270 105499 83630 100187 90536 93020 69411 89860 60410 14768 44645
9637D4645k5459l7986J8304M4017j7823l8342P284j8813P810J4480l3708l0144
$$ 44645 19186 -18800 -496 43521 25698 -12644 -5360 -24173 -16363 -1883 -35591 -65735
9625f5735j9594M025K0115M2363k3914o850n0921L4314j2945L1657P1108O0002
$$ -65735 -85329 -81304 -61189 -18826 -42740 -49590 -100511 -66197 -79142 -47485 23623 83625
9613H3625N883K3290m9401k6018J5912R278p5114l1663J6463K2336k7008j9750
$$ 83625 89508 112798 63397 37379 53291 62569 -12545 -44208 -27745 -5409 -32417 -52167
9601e2167q269K9170p863O524J5184m241M0485Q330j0006j3M9817r0783m978k4015
$$ -52167 -60436 -31266 -39129 -32605 -17421 -21662 18823 27153 17147 17134 66951 -23832 -28810 -52825
9587e2825j7645l409j4791k5807j7470L7904P1917J8879N759n1497o7012L956
$$ -52825 -70470 -73879 -88670 -114477 -131947 -94043 -22126 -3247 2512 -48985 -115997 -112041
9575a12041J906O0338j0847p5943P837M0079N7490J5996L1753k0522p0652J2910
$$ -112041 -110135 -49797 -60644 -136587 -128750 -88671 -31181 -15185 16568 -3954 -74606 -61696
9563f1696k6922k8272m2144J5414O5668M0675K0729K9521K0064J1749M5962n300
$$ -61696 -88618 -116890 -159034 -143620 -77952 -37277 -16548 12973 33037 44786 90748 85448
9551H5448m1766j9912J3063J0382l6736l1380r296L0332q803M889K4576j2042
$$ 85448 43682 23770 36833 47215 10479 -20901 -30197 135 -8668 -3779 20797 8755
9539H755L4197o90l437j3415J2259K136J1588L8003J4726l5274m5368K7533O671
$$ 8755 42952 42262 38825 25410 37669 39805 51393 89396 104122 68848 23480 51013 57684
9526E7684r642j8314l2843m5538p6982k3736m0624N2593P6050L2604k5148p5665
$$ 57684 48042 29728 -3115 -48653 -125635 -149371 -189995 -137402 -61352 -28748 -53896 -129561
9514a29561r492P1041R1470j455k5604Q666k0157M0406J6871j7543L1234N630
$$ -129561 -139053 -68012 23458 22003 -3601 5065 -15092 25314 42185 24642 55876 61506
9502F1506j5471J7497M6032L71o879R469j9887m1003p369n3549m8822M206J8141
$$ 61506 46035 63532 109564 109935 103056 112525 92638 51635 44266 -9283 -58105 -53899 -35758
9489c5758L8265j9878j7974j1752K7770M4507J857p652k9306K8114k2397j0646
$$ -35758 2507 -17371 -35345 -47097 -19327 25180 27037 19385 -9921 18193 -4204 -14850
9477a4850k1765L492J1359m1988Q837m865K8307K2889r448J8829k2231j5870p0586
$$ -14850 -36615 -33123 -21764 -63752 -54915 -59780 -31473 -8584 -18032 797 -21434 -37304 -107890
9464a07890m1937M7459J5004N752J3885Q0719O6420k0182l0878j3001K4532k4065
$$ -107890 -149827 -102368 -87364 -81612 -67727 12992 79412 59230 28352 15351 39883 15818
9452A5818l6396k8375j8028k9924M7157K6507p399M0860N9609L2800j0263J9472
$$ 15818 -20578 -48953 -66981 -96905 -49748 -23241 -30640 10220 69829 102629 92366 111838
9440A11838o8512P01n2859M5773O5715k6320j93J636L919q9035m1645M4959r902
$$ 111838 43326 44027 -8832 36941 102656 76336 76143 77779 81698 -7337 -48982 -4023 -13925
9427a3925l5792J9899L0599j8605m0958L772K8799j7873k9449O835J4368j4605
$$ -13925 -49717 -29818 781 -17824 -58782 -55010 -26211 -44084 -73533 -66698 -52330 -66935
9415f6935n759j0261O2419M497l9921j28R3663O3486k6220N4631L3567m3082o6352
$$ -66935 -72694 -82955 -20536 -16039 -55960 -56088 37575 101061 74841 129472 163039 119957 53605
9402E3605j2969j8532Q111P0442J6509l2052l936Q384j5369m852m8368J4600q428
$$ 53605 40636 22104 30215 100657 117166 85114 81178 89562 74193 69341 20973 35573 27145
9389B7145k1812J7168P424J1576o2370k7510L4397L9986m9473L554N9630M3447
$$ 27145 5333 22501 29925 41501 -20869 -48379 -13982 26004 -23469 -19915 39715 83162
9377H3162k4626n2108q867q667l132J5301l757P505K018l5434j7947r697L4744
$$ 83162 58536 6428 -2439 -11106 -14238 1063 -2694 4811 6829 -28605 -46552 -56249 -21505
9364b1505L2423O6212K9419q314m0796k7308L404M3406j3495O722q665L2055L1490
$$ -21505 10918 77130 106549 98235 57439 30131 33535 76941 63446 70168 61503 93558 125048
9351A25048l6601M9422K1729l9418m2152K6359J9758m2113k520q9188m1782L8603
$$ 125048 88447 137869 159598 120180 78028 104387 124145 82032 79512 -9676 -51458 -12855
9339a2855P506m6349n1339R5623J1583r716M8690N2397n2458k0917J4745J2210
$$ -12855 -5349 -51698 -103037 -7414 4169 -5547 43143 95540 43082 22165 36910 49120
9327D9120J3938j0547m1716N9829J0934n3829j4080j5151m9812k288O467L9514
$$ 49120 63058 52511 10795 70624 81558 27729 13649 -1502 -51314 -53602 -47135 -7621
9315g621L9377Q160K7874L9640l0116n5298j3014q634m7724l4144K0940N8538
$$ -7621 31756 39916 67790 107430 77314 22016 9002 368 -47356 -81500 -60560 -2022
9303b022K0483K0311j6744L7188M4885p2287m6346l0492O5053K5540n3114L371
$$ -2022 18461 38772 22028 59216 104101 31814 -14532 -45024 20029 45569 -7545 -4174
9291d174L6532L6518K4199K398N084o310m6815m1176O5483O8032n829n074m8310
$$ -4174 32358 68876 93075 95473 100557 94247 47432 6256 71739 139771 133942 128868 80558
9278H0558L681K618N341L3925p024k5945j7083j2759r161j3175R679Q050r354
$$ 80558 84239 86857 92198 126123 119099 93154 76071 63312 54151 40976 50655 58705 49351
9265D9351O7808O3m7366n7098j5798l236M6947J1156m5970l6247J3683m5255N0138
$$ 49351 117159 117222 69856 12758 -3040 -6276 40671 51827 5857 -30390 -16707 -61962 -11824
9252a1824N6727M7051R5639k2306m1081m1335n9069P473L0786q247J7304q965
$$ -11824 44903 91954 187593 165287 124206 82871 23802 31275 62061 53814 71118 62153
9240F2153N477p0315Q177M0390n347n506J8406K2315K4729m5332o5145N6782J7696
$$ 62153 67630 -2685 5492 45882 40535 35029 53435 75750 100479 55147 -9998 46784 64480
9227F4480o904k7213Q058Q232K6410k372l4476M7086O3084L8445J5827k0008l6173
$$ 64480 57576 30363 38421 46653 73063 70691 36215 83301 146385 184830 200657 180649 144476
9214A44476L9970K5251M3271k295M469O7927N6741K7005K3362K6644m446Q1072
$$ 144476 184446 209697 252968 250673 255142 323069 379810 406815 430177 456821 452375 533447
9202E33447J18528O089O7014J77166K74369M48148N27063P71918J249223K027385
$$ 533447 651975 658064 725078 902244 1176613 1624761 2151824 2923742 4172965 6200350
9192F200350L335844N294677O949681M279059o25169m526849o380944n086636
$$ 6200350 9536194 14830871 21780552 26059611 25434442 20907593 14526649 9440013
9184I440013l060734j861607j184329p49539m84030l30973k69549k62418k09803
$$ 9440013 6379279 4517672 3333343 2583804 2099774 1768801 1499252 1236834 1027031
9175A027031j39813q2889j23951r8995k6596j9277m9838n6794l1449m3236m8262
$$ 1027031 887218 804329 680378 581383 554787 535510 485672 428878 397429 354193 305931
9164C05931m1430k2075O5876N597L3158K72k8533o2737K86k6242k5265M6144L08
$$ 305931 264501 242426 308302 313899 347057 347329 318796 256059 256345 230103 204838 250982 251290
9151B51290o6857j7408K5609K3445M801l3751q5883k7128J3274o352L9246n317
$$ 251290 184433 167025 192634 216079 220880 187129 101246 74118 87392 81040 120286 114969
9139A14969j8727l1991n3294K6298l304J0537K8560j0366j1759J9181R604L042
$$ 114969 96242 64251 10957 37255 33951 44488 73048 62682 50923 70104 79708 82750
9127H2750N1319P161p2425n1723r734N3556L1941K3382J1234o5262n6545j1175
$$ 82750 134069 141230 68805 17082 7348 60904 92845 116227 127461 62199 5654 -5521
9115e521J1250j60k2878O54M7443N8049n2518J7611r472n8331o4570N3274P2634
$$ -5521 5729 5569 -17309 -16655 30788 88837 36319 53930 44458 -13873 -78443 -25169 47465
9102D7465L2081l620J440j7108O9116m7042o6450j5449M1322l8711l1979K0734
$$ 47465 79546 75926 77366 60258 129374 82332 15882 433 41755 3044 -28935 -8201
9090h201N9554N8359K044k1658p7771j6269r755K5244L7245M2751L0399j7611
$$ -8201 51353 109712 111756 90098 12327 -3942 -13697 11547 48792 91543 121942 104331
9078A04331m206j6305k8139J6996K7665K716J1357J5116J6792l0227j13917j9152
$$ 104331 100125 83820 55681 72677 100342 103058 114415 129531 146323 116096 2179 -16973
9066a6973j8280j2034N106q459N7898O2913M6612K5681j2918o0073l4944j8399
$$ -16973 -35253 -47287 -42181 -50640 7258 70171 116783 142464 129546 69473 34529 16130
9054A6130J2832j2577K10M4946J3932q173l9682n2391j0232j1824J3181J3844
$$ 16130 28962 16385 16595 61541 75473 67300 27618 -24773 -35005 -46829 -33648 -19804
9042a9804j5740P0072R609k5948L1143N5749n3639o0524n990N131J891P698M7437
$$ -19804 -35544 34528 44137 18189 49332 105081 51442 -9082 -15072 -9941 -8050 -352 47085
9029D7085m620J1887L2098R922R67k9648r9417k4164J5305Q700M7863J01143j0981
$$ 47085 42465 54352 86450 96372 97339 67691 -31726 -55890 -40585 -31885 15978 117121 106140
9016A06140K6864K0943k2589m2241k3288k9520o6601l9538K2916Q6400j8418k2993
$$ 106140 133004 153947 131358 89117 65829 36309 -30292 -69830 -46914 39486 21068 -1925
9004a925J623L2105O633L7089k9379M5044m410k4108K9963j813l260K6336j7969
$$ -1925 -302 31803 38436 75525 46146 91190 86780 62672 92635 90822 87562 113898 95929
8991I5929l7537l5200m4964N4613Q3358K9183j668m3334p8744l5752L6934L7390
$$ 95929 58392 23192 -21772 32841 116199 145382 143714 100380 21636 -14116 22818 60208
8979F0208j5753m6082k8971J8660m096j2456L3075k9066j997L9153O8205M6173
$$ 60208 44455 -1627 -30598 -11938 -16034 -28490 4585 -24481 -26478 12675 80880 127053
8967A27053M0929k9926l9409n5752O074K7112l5371n8394k5806o3269M5862L2854
$$ 127053 167982 138056 98647 42895 48969 76081 40710 -17684 -43490 -106759 -60897 -28043
8955b8043O4668N2516m5386k0269n3531m5133k8709j3980N6344N6362J5347k4917
$$ -28043 36625 89141 43755 23486 -30045 -75178 -103887 -117867 -61523 -5161 10186 -14731
8943a4731k5711q932J8308j3007k1410P544k511J912J7732Q2504L2484J9691k3182
$$ -14731 -40442 -49374 -31066 -44073 -65483 -57939 -60450 -58538 -40806 41698 74182 93873 70691
8930G0691k9410k8270J6438J6310m670k3806r344l9317L6117O2306l6397Q497
$$ 70691 41281 13011 29449 45759 41089 17283 7939 -31378 4739 67045 30648 39145
8918C9145o0255k3821J8529l0653o8908m6994N0967L748P1177J7925K0525n782
$$ 39145 -21110 -44931 -26402 -57055 -125963 -172957 -121990 -118242 -47065 -29140 -8615 -14397
8906a4397k5277N2543R06n5101N6596R5627o901m1160j305k992p3941J398J9753
$$ -14397 -39674 12869 13775 -41326 15270 110897 103996 62836 61531 58539 -15402 -14004 5749
8893E749j3575j862K4700L1633M8556k1562n605k3705L1056N2021j9556j011r8308
$$ 5749 -7826 -9688 15012 46645 95201 73639 68034 44329 75385 127406 107850 106839 8531
8880H531l9168N0542N5398K773p8360n9664K653N7225M2905J8634L992J2529O5590
$$ 8531 -30637 19905 75303 78076 -284 -59948 -57295 -70 42835 61469 65461 77990 143580
8867A43580K6076N7513N8701l9174o1558q9332m8140L7405M383j0374o8044M0389
$$ 143580 169656 227169 285870 246696 185138 95806 47666 85071 89454 79080 11036 51425
8855E1425L58k0596L1466k0840k9538O1950M2988M0252j3800l9106k0494O411
$$ 51425 51783 31187 62653 41813 12275 74225 117213 157465 143665 104559 84065 90476
8843I0476l4984L1140j6345j9974K5256L81n1063l5348K4839N196J2023l1692
$$ 90476 55492 86632 70287 50313 75569 75950 24887 -10461 14378 19574 31597 -95
8831i5r735K8098j5572k9518j2996j6605L6896Q4869l9405l9983N1649o912J8853
$$ -95 -9830 18268 2696 -26822 -39818 -56423 -19527 65342 25937 -14046 37603 30691 49544
8818D9544L3460L2043P238O3428K2361k9518l078j9037j1691p9372j27017O47
$$ 49544 83004 115047 122285 185713 208074 178556 175478 156441 144750 65378 -61639 -60992
8806f0992K0571l3069J8225O6934q100n393j6065L6312O2067M860k9709k3926
$$ -60992 -40421 -73490 -55265 11669 3569 -1824 -17889 18423 80490 85350 55641 31715
8794C1715K5689N605k1612k7540J1976k9873N376R0119M7285L5573n3997n4625
$$ 31715 57404 63009 41397 13857 25833 -4040 1336 91455 138740 174313 120316 65691
8782F5691J0866L351k1845o1424p1155k3757K5197K9398P5267L5181K9691l8997
$$ 65691 76557 79908 58063 -3361 -74516 -98273 -73076 -43678 31589 66770 96461 57464
8770E7464m5388k5825k6509r286J3827l7442Q7593O5232J0649l4961J5547J3965
$$ 57464 12076 -13749 -40258 -49544 -35717 -73159 14434 79666 90315 55354 70901 84866
8758H4866J3739l9967n1478K127j889K5603o379P495K0855K4924N447K3962K2718
$$ 84866 98605 58638 7160 9287 7398 33001 26622 34117 54972 79896 85343 109305 132023
8745A32023j6232j4380J3143k36k2220J5913p341J5828K2137o003o625p1191k4996
$$ 132023 115791 101411 114554 114318 92098 108011 100670 116498 138635 132632 126007 54816 29820
8732B9820P5614J2328P254J572P871J0475l2917l1896k6346N7538R955R507J1321
$$ 29820 105434 117762 125016 126588 134459 144934 112017 80121 53775 111313 121268 130775 142096
8719A42096j3477N8590M1574r4632q0794j9576L036L9927N647N6816N2793N5131
$$ 142096 128619 187209 228783 134151 53357 33781 36817 76744 82391 139207 192000 247131
8707B47131p2082q316k2393N2081O4198m2121P491l7270p0919J0489K0141j0648
$$ 247131 175049 166733 144340 196421 260619 218498 225989 188719 117800 128289 148430 137782
8695A37782N684l663k6042m6596J4630K8906K3253K4116j9956K856j8498j2243
$$ 137782 143466 139803 113761 67165 81795 110701 133954 158070 138114 140970 122472 110229
8683A10229J9573J6894k2486j3830K1303K2212P3416K270l3191k4454J846P7781
$$ 110229 129802 146696 124210 110380 131683 153895 227311 229581 196390 171936 173782 251563
8671B51563P8352n5832l7325l9566m1775L1599M0075M3183j1786L249o1495m3570
$$ 251563 329915 274083 236758 197192 155417 187016 227091 270274 258488 261737 200242 156672
8659A56672J5720K9446k9817l378L0880L7250R0677J9021K1657K9720O2314J32433
$$ 156672 172392 201838 172021 168643 199523 236773 327450 346471 368128 397848 460162 592595
8647E92595R4849O3815M3798n2642j23494j08228o6091J2701M017k7050J1553
$$ 592595 687444 751259 795057 742415 618921 510693 444602 457303 461320 434270 445823
8636D45823j0878l1642k307r99L8211J2516n3520l1341L9604M556J2041M3871
$$ 445823 434945 403303 400996 399997 438208 450724 397204 365863 405467 410023 422064 465935
8624D65935N0877m424M0675N7777O2540O1804O4471M6818m7615l8837L5743J7167
$$ 465935 516812 512388 553063 610840 673380 735184 799655 846473 798858 760021 795764 812931
8612H12931M8947L6101J9310N166j019L5856O2962O0380J11892J64277K69228
$$ 812931 861878 897979 917289 922455 921436 957292 1020254 1080634 1192526 1356803 1626031
8601A626031L22061J89991J735r2775j88271q0790r5978r9793q0293j02820q9862
$$ 1626031 1948092 2138083 2139818 2047043 1858772 1777982 1682004 1582211 1501918 1399098 1309236
8590A309236q5894j36056j70626j02737r8670n5977j10448l2187L5833m8653m7605
$$ 1309236 1223342 1087286 916660 813923 715253 659276 548828 516641 552474 503821 456216
8579D56216p1469o0053k5475J4550K9414k5638m4057o5007n9183j123L6032J4431
$$ 456216 384747 324694 299219 313769 343183 317545 273488 208481 149298 148175 184207 198638
8567A98638l8298L4412P972j296M7141o7k5301J3822N1008J24575J36184J12065
$$ 198638 160340 194752 202724 201428 248569 248502 223201 237023 288031 412606 548790 660855
8555F60855L6032k5924p0071j06850j03443j25785p5116K4434J9115l3303l5306
$$ 660855 696887 670963 600892 494042 390599 264814 189698 214132 233247 199944 164638
8544A64638k084m3742L2720M5557M7554j2806j4879R741o1836m8386k3972o8319
$$ 164638 162554 118812 151532 197089 244643 231837 216958 226699 164863 116477 92505 24186
8532B4186M749N3544O0105m5347o4730L7302O784j5090j2815l6970M376O6371
$$ 24186 28935 82479 142584 97237 32507 69809 76593 61503 48688 11718 16094 82465
8520H2465P5920L8172j2006l518q9000j12769l1629L6010O1909K6146k716l4641
$$ 82465 158385 196557 184551 181033 92033 -20736 -52365 -16355 45554 71700 68984 34343
8508C4343p631O4915M0247K7384o7802j3485p42j1267J5766q8485O5977Q1367
$$ 34343 26712 91627 131874 159258 91456 77971 77229 65962 81728 -6757 59220 140587
8496A40587m2687p2592J0884L2797k2948n3904O1493M7900o0895m5007J2606J2153
$$ 140587 97900 25308 36192 68989 46041 -7863 53630 101530 40635 -4372 8234 20387
8484B0387j4492L3361J00070Q1766J6407o31k5026o6155R099q9775l6119J3078
$$ 20387 5895 39256 139326 221092 237499 236868 211842 145687 154786 65011 28892 41970
8472D1970L6848N2885l7614l1207K6380j6476n2029K1238K7373J5383k7328m6593
$$ 41970 78818 131703 94089 62882 89262 72786 20757 41995 69368 84751 57423 10830
8460A0830J8249k4686l9643M3474K2025m2544k3646N7767J1812j3393J626Q375
$$ 10830 29079 4393 -35250 8224 30249 -12295 -35941 21826 33638 20245 21871 30246
8448C0246N4594l9518l1702j241M0567N6593k2572r088l4029K2360l4840p6538
$$ 30246 84840 45322 13620 12379 52946 109539 86967 77879 43850 66210 31370 -45168
8436d5168K1322J0998o162N6930L8333j4697k9235k588j97J9816J3225l4729l1387
$$ -45168 -23846 -12848 -19010 37920 76253 61556 32321 29733 29536 49352 62577 27848 -3539
8423c539L0798K7297l3891J1944K7461k9162k5580K5815M7707l7180n2705j5955
$$ -3539 27259 54556 20665 32609 60070 30908 5328 31143 78850 41670 -11035 -26990
8411b6990J3023o71k0590N6120k1191J0325L5778J3073O660M636n483m3092K469
$$ -26990 -13967 -14638 -35228 20892 -299 10026 45804 58877 65537 70173 64690 21598 24067
8398B4067j302o642N3224L5508n1025o7235j571N7539K4330Q941k4772o476j4072
$$ 24067 22765 16123 69347 104855 53830 -13405 -14976 42563 66893 75834 51062 44586 30514
8385C0514k629j6729j2149M8462N5061k1153l141K0890J8825O86l7987p9521J1721
$$ 30514 27885 11156 -993 47469 102530 81377 78236 99126 117951 118637 80650 1129 12850
8372A2850J1117m841M8195k5193j8931j6316N2107P6208q6380o5742K8655j7311
$$ 12850 23967 19126 67321 42128 23197 6881 58988 135196 48816 -16926 11729 -5582
8360e582o5233J6159m636r866K3597J1714m3185m374J7688M5147j498J9564J6605
$$ -5582 -70815 -54656 -59292 -69158 -45561 -33847 -77032 -81406 -63718 -18571 -20069 -505 16100
8347A6100n864N422r349K9511K2416K0224r114k7997k8360Q793J7139K5435k0725
$$ 16100 10236 15658 6309 35820 58236 78460 69346 41349 12989 21782 38921 64356 43631
8334D3631M348J6403L94n2671m0599K6319n4645J6617P426J8123N3564N360K5282
$$ 43631 47979 64382 64776 12105 -28494 -2175 -56820 -40203 -32777 -14654 38910 44270 69552
8321F9552l3805r364m953M068m142j1004j75K8833q913l0467N1966Q605m0671
$$ 69552 35747 26383 21430 25498 21356 10352 10177 39010 30097 -370 51596 60201 19530
8308A9530J605q354K5586n104J3513m6817L2201N4741j8182m3256j6512k3023
$$ 19530 21135 12781 38367 33263 46776 -41 32160 86901 68719 25463 8951 -14072
8296a4072J8040R286k4122q316N93j4044m6905K538K6508Q2079J5618k6681n2675
$$ -14072 3968 13254 -10868 -19184 -18591 -32635 -79540 -77002 -50494 31585 47203 20522 -32153
8283c2153J2199K4966J6486J9538J9725N6368K648l7026l5026l3620K9535j6104
$$ -32153 -19954 5012 21498 41036 60761 117129 119777 82751 47725 14105 43640 27536
8271B7536l58k096p005k3485p5202L440O6373N4818K31J55Q264j0049k3055l7473
$$ 27536 27178 25082 18077 -5408 -80610 -77170 -10797 44021 44252 44407 52671 42622 19567 -17906
8257a7906l902L4612K1418K652j6774J9691k1769J4766k3L955k1813K0230j5542
$$ -17906 -21808 12804 34222 36874 20100 39791 18022 32788 32765 36720 14907 35137 19595
8244A9595o671R034k7520k5094J7387K9469L9379q634Q329j7115K9772j595L704
$$ 19595 12924 21958 -5562 -30656 -13269 16200 55579 46945 55274 38159 67931 66336 70040
$$ [...]
##END NTUPLES=NMR SPECTRUM
##END=
