##TITLE=Analysis number 326826
Compound Code cc 57163
Book Reference 521/27
Project Code adrs
Chemist Name evam
##JCAMPDX= 6.0         $$ Bruker NMR JCAMP-DX V2.0
##DATA TYPE= NMR SPECTRUM
##DATA CLASS= NTUPLES
##ORIGIN= Bruker BioSpin GmbH
##OWNER= nmr
$$ XWIN-NMR		Version 3.5
$$ Tue Feb 27 12:24:18 2007 GMT Standard Time (UT+0h)  MAYBRIDGE\nmr@NMR_250MHZ
##.OBSERVE FREQUENCY= 250.131544655141
##.OBSERVE NUCLEUS= ^1H
##.ACQUISITION MODE= SIMULTANEOUS (DQD)
##.ACQUISITION SCHEME= undefined
##.AVERAGES= 16
##.DIGITISER RES= 18
##SPECTROMETER/DATA SYSTEM= dpx250
##.PULSE SEQUENCE= zg30
##.SOLVENT NAME= DMSO
##.SHIFT REFERENCE= (INTERNAL, DMSO, 0, 16.522)
##AUDIT TRAIL= $$ (NUMBER, WHEN, WHO, WHERE, WHAT)
$$ ##TITLE= Audit trail, XWIN-NMR		Version 3.5
$$ ##JCAMPDX= 5.01
$$ ##ORIGIN= Bruker BioSpin GmbH
$$ ##OWNER= nmr
$$ C:\u/data/dgb/nmr/ADRS/2470/pdata/1/auditp.txt
$$ ##AUDIT TRAIL=  $$ (NUMBER, WHEN, WHO, WHERE, WHAT)
(   1,<2007-02-27 12:23:50.00 +000>,<MAYBRIDGE\nmr>,<NMR_250MHZ>,
      <created by zg, POWCHK disabled, PULCHK disabled
       configuration hash MD5:
       49 4B E0 1D 92 C2 6B 37 9F E6 65 BC 52 41 86 1D
       data hash MD5: 64K
       87 CF EF AE 93 48 E0 81 25 C8 6C 82 C8 06 B3 51>)
(   2,<2007-02-27 12:24:06.98 +000>,<MAYBRIDGE\nmr>,<NMR_250MHZ>,
      <Start of raw data processing
       ef LB = 0.3 FT_mod = 6 PKNL = 1 SI = 32K 
       data hash MD5: 32K
       04 E0 7C 6E A6 2C E0 1F F9 85 04 70 C3 1D 2C F1>)
(   3,<2007-02-27 12:24:08.73 +000>,<MAYBRIDGE\nmr>,<NMR_250MHZ>,
      <apk 
       data hash MD5: 32K
       AB BD 9F BF 72 ED 94 80 AB E1 3E 06 53 21 5E 67>)
(   4,<2007-02-27 12:24:09.42 +000>,<MAYBRIDGE\nmr>,<NMR_250MHZ>,
      <abs ABSG = 5 
       data hash MD5: 32K
       46 B4 7E D4 BA B1 E5 73 67 C3 C7 7D 14 AB 1C 8B>)
$$ ##END=
$$ 
$$ hash MD5
$$ AD 38 15 00 A9 25 13 C3 DC 15 7D 77 F8 53 11 F9
##$RELAX= 
##$RELAX= 
##$RELAX= 
##$RELAX= 
##$RELAX= 
##$RELAX= 
##$RELAX= 
$$ Bruker specific parameters
$$ --------------------------
##$DU= <C:\u>
##$EXPNO= 2470
##$NAME= <ADRS>
##$PROCNO= 1
##$TYPE= <nmr>
##$USER= <dgb>
##$AMP= (0..31)
100 100 100 100 100 100 100 100 100 100 100 100 100 100 100 100 100 100 
100 100 100 100 100 100 100 100 100 100 100 100 100 100 
##$AQSEQ= 0
##$AQ_mod= 3
##$AUNM= <au_zg>
##$AUTOPOS= <47 >
##$BF1= 250.13
##$BF2= 250.13
##$BF3= 250.13
##$BF4= 250.13
##$BF5= 500.13
##$BF6= 500.13
##$BF7= 500.13
##$BF8= 500.13
##$BYTORDA= 1
##$CFDGTYP= 0
##$CFRGTYP= 5
##$CHEMSTR= <none>
##$CNST= (0..31)
1 1 145 1 1 1 1 1 1 1 1 1 1 1 1 1 1 1 1 1 1 1 1 1 1 1 1 1 1 1 1 1 
##$CPDPRG= <>
##$CPDPRG1= <>
##$CPDPRG2= <>
##$CPDPRG3= <>
##$CPDPRG4= <mlev>
##$CPDPRG5= <mlev>
##$CPDPRG6= <mlev>
##$CPDPRG7= <mlev>
##$CPDPRG8= <mlev>
##$CPDPRGB= <>
##$CPDPRGT= <>
##$D= (0..31)
0 1 0 0 0 0 0 0 0 0.06 0 0 0 0 0 0 0.0002 0 0 0 0 0 0 0 0 0 0 0 0 0 0 
0 
##$DATE= 1172579028
##$DBL= (0..7)
120 120 120 120 120 120 120 120 
##$DBP= (0..7)
150 150 150 150 150 150 150 150 
##$DBP07= 0
##$DBPNAM0= <>
##$DBPNAM1= <>
$$ [...]
##$SUBNAM7= <"">
##$SUBNAM8= <"">
##$SUBNAM9= <"">
##$SW= 20.6930455092707
##$SWIBOX= (0..15)
0 0 3 0 0 0 0 0 0 0 0 0 0 0 0 0 
##$SW_h= 5175.983436853
##$TD= 65536
##$TD0= 1
##$TE= 295.16
##$TE2= 300
##$TE3= 300
##$TEG= 300
##$TL= (0..7)
0 120 120 120 120 120 120 120 
##$TP= (0..7)
150 150 150 150 150 150 150 150 
##$TP07= 0
##$TPNAME0= <>
##$TPNAME1= <>
##$TPNAME2= <>
##$TPNAME3= <>
##$TPNAME4= <>
##$TPNAME5= <>
##$TPNAME6= <>
##$TPNAME7= <>
##$TPOAL= (0..7)
0.5 0.5 0.5 0.5 0.5 0.5 0.5 0.5 
##$TPOFFS= (0..7)
0 0 0 0 0 0 0 0 
##$TUNHIN= 0
##$TUNHOUT= 0
##$TUNXOUT= 0
##$USERA1= <user>
##$USERA2= <user>
##$USERA3= <user>
##$USERA4= <user>
##$USERA5= <user>
##$V9= 5
##$VALIST= <valist>
##$VCLIST= <CCCCCCCCCCCCCCC>
##$VD= 0
##$VDLIST= <DDDDDDDDDDDDDDD>
##$VPLIST= <PPPPPPPPPPPPPPP>
##$VTLIST= <TTTTTTTTTTTTTTT>
##$WBST= 1024
##$WBSW= 4
##$XGAIN= (0..3)
0 0 0 0 
##$XL= 0
##$YL= 0
##$YMAX_a= 418193
##$YMIN_a= -574011
##$ZGOPTNS= <>
##$ZL1= 120
##$ZL2= 120
##$ZL3= 120
##$ZL4= 120
##$ABSF1= 16.522
##$ABSF2= -4.171173
##$ABSG= 5
##$ABSL= 3
##$ALPHA= 0
##$AQORDER= 0
##$ASSFAC= 0
##$ASSFACI= 0
##$ASSFACX= 0
##$ASSWID= 0
##$AUNMP= <proc_1d>
##$AZFE= 0.1
##$AZFW= 0.1
##$BCFW= 0
##$BC_mod= 0
##$BYTORDP= 0
##$COROFFS= 0
##$CY= 12.5
##$DATMOD= 1
##$DC= 0
##$DFILT= <>
##$DTYPP= 0
##$F1P= 14.0000005364418
##$F2P= -0.99999901652339
##$FCOR= 0.5
##$FTSIZE= 32768
##$FT_mod= 6
##$GAMMA= 0
##$GB= 0
##$INTBC= 1
##$INTSCL= 1
##$ISEN= 128
##$LB= 0.3
##$LEV0= 0
##$LPBIN= 0
##$MAXI= 10000
##$MC2= 0
##$MEAN= 0
##$ME_mod= 0
##$MI= 0
##$NCOEF= 0
##$NC_proc= -5
##$NLEV= 6
##$NOISF1= 0
##$NOISF2= 0
##$NSP= 0
##$NTH_PI= 0
##$NZP= 0
##$OFFSET= 16.522
##$PC= 1
##$PHC0= 211.6146
##$PHC1= 8.661786
##$PH_mod= 1
##$PKNL= yes
##$PPARMOD= 0
##$PSCAL= 4
##$PSIGN= 0
##$REVERSE= no
##$SF= 250.13
##$SI= 32768
##$SIGF1= 0
##$SIGF2= 0
##$SINO= 400
##$SIOLD= 32768
##$SREGLST= <1H.DMSO>
##$SSB= 0
##$STSI= 32768
##$STSR= 0
##$SW_p= 5175.98343685301
##$SYMM= 0
##$S_DEV= 0
##$TDeff= 65536
##$TDoff= 0
##$TI= <Analysis number 999999
Compound Code 99
Book Reference 9
Project Code 9>
##$TILT= no
##$TM1= 0
##$TM2= 0
##$TOPLEV= 0
##$USERP1= <user>
##$USERP2= <user>
##$USERP3= <user>
##$USERP4= <user>
##$USERP5= <user>
##$WDW= 1
##$XDIM= 32768
##$YMAX_p= 297049886
##$YMIN_p= -252380
$$ End of Bruker specific parameters
$$ ---------------------------------
##NTUPLES= NMR SPECTRUM
##VAR_NAME=  FREQUENCY,     SPECTRUM/REAL,   SPECTRUM/IMAG
##SYMBOL=    X,             R,               I
##VAR_TYPE=  INDEPENDENT,   DEPENDENT,       DEPENDENT
##VAR_FORM=  AFFN,          ASDF,            ASDF
##VAR_DIM=   32768,         32768,           32768
##UNITS=     HZ,            ARBITRARY UNITS, ARBITRARY UNITS
##FACTOR=    0.157963299565203, 1,           1
##FIRST=     4132.6476996994, 0,             0
##LAST=      -1043.33573715361, 0,           0
##MIN=       -1043.33573715361, -252380,     0
##MAX=       4132.6476996994, 297049886,     0
$$ Real data points
##PAGE= N=1
##DATA TABLE= (X++(R..R)), XYDATA
$$ [...]
$$ plain form
23876 -8866 974 18139 53720 67264 48792 57761 19610 -12627 -33640 -21345 1749 -3188
23864 -3188 -20412 6030 25556 16584 -32093 -77492 -68808 -27070 -20337 11978 7578 -45665 -109632
23851 -109632 -112070 -51073 -18842 30875 44627 17442 23307 49206 379 -65253 -109678 -111739
23839 -111739 -48438 -22389 -50193 -78464 -70016 -37948 -19587 -69827 -61773 -95188 -91554 -82305
23827 -82305 -95814 -98375 -94783 -32786 -10051 -30895 -35904 -69733 -55989 -55837 -119922 -134368 -51845
23814 -51845 2800 69417 42110 20802 41933 42355 37128 -15830 -26525 -49828 -56394 -9848
23802 -9848 -17516 -29700 -28676 34679 52015 31805 -1942 22675 37772 11252 -87954 -101925
23790 -101925 -59338 23950 22057 -15089 -41823 -47996 -50117 -15672 15250 20278 -24924 -66528
$$ packed form
23876h866R840J7165L5581J3544j8472Q969l8151l2237k1013J2295K3094m937
23864c188j7224K6442J9526q972m8677m5399Q684M1738O733L2315m400n3243o3967
23851a09632k438O0997L2231M9717J3752k7185N865K5899m8827o5632m4425k061
23839a11739O3301K6049k7804k8271Q448L2068J8361n0240Q054l3415L634R249
23827h2305j3509k561L592O1997K2735k0844n009l3829J3744J52o4085j4446Q2523
23814e1845N4645O6617k7307k1308K1131M22n227n2958j0695k3303o566M6546
23802i848p668j2184J024O3355J7336k0210l3747K4617J5097k6520r9206j3971
23790a01925M2587Q3288j893l7146k6734o173k121L4445L0922N028m5202m1604
$$ plain form
23778 -66528 -51633 20345 18384 -19027 -45349 -27841 3495 -78784 -114653 -125735 -82025 -51054
23766 -51054 -26587 -27503 -209 40385 27202 -39294 -118389 -134395 -114597 -84961 -83879 -84864 -105201
23753 -105201 -129345 -119204 -122292 -99267 -57373 -27900 -50252 -83874 -53516 16295 7625 -15154
23741 -15154 -54625 -71136 -61161 -78180 -20838 -2694 3346 8593 21876 54451 62250 48652
23729 48652 -62220 -47922 1151 47298 90409 54137 -13562 -72433 -21832 -21916 -65745 -98978
23717 -98978 -75251 -91275 -111709 -128644 -113038 -60493 -26622 -34298 -46476 -53752 -68095 -44765
23705 -44765 -26927 -57346 -77754 -47884 -28884 -27583 -54933 -45087 10096 59729 42449 15705
23693 15705 -16905 -81535 -84636 -59220 -61658 10682 -2402 -28552 -19350 -76632 -77540 -100380 -5362
$$ packed form
23778f6528J4895P1978j961l7411k6322J7508L1336q2279l5869j1082M3710L0971
23766e1054K4467r16K7294M0594j3183o6496p9095j6006J9798K9636J082r85k0337
23753a05201k4144J0141l088K3025M1894K9473k2352l3622L0358O9811q670k2779
23741a5154l9471j6511R975j7019N7342J8144O040N247J3283L2575P799j3598
23729D8652j10872J4298M9073M6147M3111l6272o7699n8871N0601q4m3829l3233
23717i8978K3727j6024k0434j6935J5606N2545L3871p676j2178p276j4343K3330
23705d4765J7838l0419k0408K9870J9000J301k7350R846N5183M9633j7280k6744
23693A5705l2610o4630l101K5416k438P2340j3084k6150R202n7282r08k2840R5018
$$ plain form
23680 -5362 23522 16688 63493 77536 80898 81344 78522 59481 26191 50590 33528 61317 80232
23667 80232 80220 87075 101306 97964 100713 68290 -39833 -34949 11529 71246 63637 44787 -19306
23654 -19306 -83752 -114996 -90885 -18584 -20750 -89714 -79221 -101318 -74382 -30040 -32212 -50556
23642 -50556 -49640 -68441 -93754 -60696 -7876 -17303 -46367 -24815 -7889 10765 -26212 -51831
23630 -51831 -93215 -64889 -38304 7530 23597 9422 15792 14089 488 142 23849 45774
23618 45774 1338 -108 10162 -2065 -8881 12604 -37380 20052 52227 65861 88332 55753
23606 55753 -25280 -75385 -78789 -77463 -64286 -58621 -60901 -46542 -5745 -27524 -31330 -24410 -36021
23593 -36021 -80133 -71007 -40655 -77563 -59729 -20467 -19875 -14420 7790 33013 -19729 -20408 -50401
$$ packed form
23680e362K8884o834M6805J4043L362M46k822j9041l3290K4399j7062K7789J8915
23667H0232j2O855J4231l342K749l2423j08123M884M6478N9717p609j8850o4093
23654a9306o4446l1244K4111P2301k166o8964J0493k2097K6936M4342k172j8344
23642e0556R16j8801k5313L3058N2820r427k9064K1552J6926J8654l6977k5619
23630e1831m1384K8326K6585M5834J6067j4175O370j703j3601l46K3707K1925
23618D5774m4436j446J0270j2227o816K1485m9984N7432L2175J3634K2471l2579
23606E5753q1033n0105l404J326J3177N665k280J4359M0797k1779l806O920j1611
23593c6021m4112R126L0352l6908J7834L9262N92N455K2210K5223n2742o79k9993
$$ plain form
23580 -50401 -30317 11046 2205 43614 32953 40051 60667 57852 -5361 -38988 -47932 -54767 -45270
23567 -45270 -44854 -12258 3574 -8018 -17919 1696 57296 -2257 -11769 -5949 -20952 -24053 -13718
23554 -13718 8687 -9827 -51793 -62464 -52260 -45781 -37142 -40919 443 41169 12135 -14140
23542 -14140 -7288 -23615 -33598 -25938 -38314 -56832 -41262 -35645 24276 87029 106620 81706
23530 81706 -1598 -43282 15972 -51618 -98239 -74937 -91041 -90777 -34321 -36152 -80320 -95052
23518 -95052 -70980 -23408 -7139 -52051 -40888 -68442 -39259 -22718 25299 53774 -12883 -21231
23506 -21231 -15320 4803 21461 -3484 -10353 -62353 -83024 -69440 -85861 -57251 -3744 4328
23494 4328 8705 -38662 -95075 -76861 -87679 -102128 -81522 -29806 -23505 -37415 -62340 -119826
$$ packed form
23580e0401K0084M1363q841M1409j0661P098K0616k815o3213l3627q944o835R497
23567d5270M16L2596J5832j1592r901J9615N5600n9553r512N820j5003l101J0335
23554a3718K2405j8514m1966j0671J0204O479Q639l777M1362M0726k9034k6275
23542a4140O852j6327r983P660j2376j8518J5570N617N9921O2753J9591k4914
23530H1706q3304m1684N9254o7590m6621K3302j6104K64N6456j831m4168j4732
23518i5052K4072M7572J6269m4912J1163k7554K9183J6541M8017K8475o6657q348
23506b1231N911K0123J6658k4945o869n2000k0671J3584j6421K8610N3507Q072
23494D328M377m7367n6413J8214j0818j4449K0606N1716O301j3910k4925n7486
$$ plain form
23482 -119826 -179219 -180021 -144747 -119292 30310 99766 50502 4347 3464 59402 95952 95438
23470 95438 -19787 -8349 -732 -6595 -14114 -31501 -56116 -40240 -82072 -60394 -11594 28855
23458 28855 11342 -28857 -50288 -43110 -36033 14978 16105 -927 -27175 -610 45856 103962
23446 103962 107799 63170 15989 -2200 -13765 -26051 -34687 -37269 -79974 -85831 -45267 6473
23434 6473 -71900 -106845 -123035 -127180 -98037 -136902 -158443 -108465 -91633 -68465 -53160 -49344
23422 -49344 -44092 -54746 -70667 -54672 -16619 -67444 -39345 -173 -44843 -65678 -66697 -50306
23410 -50306 -54461 -80847 -99387 -82807 -68162 -65584 -71933 -44458 -21279 -31091 -61636 -64724 -82272
23397 -82272 -99273 -119207 -79549 -108622 -157916 -152442 -98810 -65230 -64152 -5149 -28422 -101543
$$ packed form
23482a19826n9393q02L5274K5455J49602O9456m9264m6155q83N5938L6550n14
23470I5438j15225J1438P617n863p519j7387k4615J5876m1832K1678M8800M0449
23458B8855j7513m0199k1431P178P077N1011J127j7032k6248K6565M6466N8106
23446A03962L837m4629m7181j8189j1565j2286q636k582m2705n857M0564N1740
23434F473p8373l4945j6190m145K9143l8865k1541M9978J6832K3168J5305L816
23422d9344N252j0654j5921J5995L8053n0825K8099L9172m4670k0835j019J6391
23410e0306m155k6386j8540J6580J4645K578o349K7475K3179r812l0545l088j7548
23397h2272j7001j9934L9658k9073m9294N474N3632L3580J078N9003k3273p3121
$$ plain form
23385 -101543 -78156 1479 35869 22925 -7612 4669 -27638 -17740 -19847 -70900 -99470 -117018
23373 -117018 -84586 -45612 -37072 -34876 -10569 -50783 -36845 37760 30062 7659 12695 -14502
23361 -14502 -5570 -53475 -86092 -46311 12526 -259 -28911 -46958 -76088 -50329 -90829 -122827
23349 -122827 -45536 44647 74301 44453 22196 2357 19106 4146 -56435 -50495 -76138 -41984
23337 -41984 64 -16363 -41499 2239 25792 -14811 -62946 -16368 27154 34010 10877 40078
23325 40078 90858 75134 53227 29451 3578 1737 24932 29864 50315 77303 59254 40958
23313 40958 55102 45222 28025 34385 48062 -16645 -46745 -58223 -70070 -61622 -8230 -32366
23301 -32366 -52858 -45013 -42670 -56780 15297 57498 28414 27836 16017 4574 6355 -24282 -90212
$$ packed form
23385a01543K3387P9635L4390j2944l0537J2281l2307R898k107n1053k8570j7548
23373a17018L2432L8974Q540K196K4307m0214J3938P4605p698k2403N036k7197
23361a4502Q932m7905l2617L9781N8837j2785k8652j8047k9130K5759m0500l1998
23349a22827P7291R0183K9654k9848k2257j9839J6749j4960o0581N940k5643L4154
23337d1984M2048j6427k5136M3738K3553m0603m8135M6578M3522O856k3133K9201
23325D0078N0780j5724k1907k3776k5873j841K3195M932K0451K6988j8049j8296
23313D0958J4144r880j7197O360J3677o4707l0100j1478j1847Q448N3392k4136
23301c2366k0492P845K343j4110P2077M2201k9084n78j1819j1443J781l0637o5930
$$ plain form
23288 -90212 -84657 -76582 -57014 -55347 -36539 -44472 -75618 -71982 -60769 -25403 -13464 2422 457
23275 457 -12899 -32039 -15648 16472 27707 -1150 7928 29351 44450 60988 71706 -4146
23263 -4146 -77748 -30845 -5838 -6485 4051 -12085 -46862 -30252 -26101 -3163 2716 12974 53943
23250 53943 54947 18018 -14834 -5843 -5288 393 6901 9582 7530 2809 38003 -17157 -48436
23237 -48436 -33329 -60233 -9835 30236 -17090 -56996 -81564 -87497 -82430 -93704 -123590 -85140
23225 -85140 -39808 -39448 18422 54643 -14812 -51774 -83197 -102033 -72150 -16064 -74070 -42476
23213 -42476 15785 11394 15982 44866 33740 41623 53645 30402 7261 -7829 24829 3442
23201 3442 11468 82382 119619 119065 49165 -1518 -2212 -57849 -71435 -41602 -49394 1107 -27186
$$ packed form
23288i0212N555Q075J9568J667J8808p933l1146L636J1213L5366J1939J5886j965
23275D57j3356j9140J6391L2120J1235k8857R078K1423J5099J6538J0718p5852
23263d146p3602M6903K5007o47J0536j6136l4777J6610M151K2938N879J0258M0969
23250E3943J004l6929l2852Q991N55N681O508K681k052m721L5194n5160l1279
23237d8436J5107k6904N0398M0071m7326l9906k4568n933N067j1274k9886L8450
23225h5140M5332L60N7870L6221o9455l6962l1423j8836K9883N6086n8006L1594
23213d2476N8261m391M588K8884j1126P883J2022k3243k3141j5090L2658k1387
23201C442Q026P0914L7237n54o9900n0683o94n5637j3586K9833p792N0501k8293
$$ plain form
23188 -27186 -73706 -73140 -27337 19914 38590 42589 -2467 -15715 -69768 -115221 -99881 -80194
23176 -80194 -62128 -73048 -87569 -69929 -25146 55396 3572 -37695 -99832 -103492 -44371 23341
23164 23341 45837 -23530 -25650 9960 10604 -9920 -70486 -101858 -130593 -124193 -110714 -99053
23152 -99053 -107537 -115191 -99697 -108683 -116811 -135606 -137716 -105065 -102882 -113841 -117289 -84444 -101737
23139 -101737 -83217 -34579 -64897 -70264 -56387 -60051 -21973 20023 -21558 -55450 -63941 -56356
23127 -56356 -28826 5837 50544 39975 -2095 -15504 22011 11371 -14182 4914 -478 -25270
23115 -25270 -264 -2163 21427 40936 37690 12195 -59764 -96943 -91645 -45467 -21870 -51733
23103 -51733 -19247 -20969 -11890 -36862 -37572 -34183 11358 -10496 26721 8576 -20616 -54240 -53950
$$ packed form
23188b7186m6520N66M5803M7251J8676L999m5056j3248n4053m5453J5340J9687
23176h0194J8066j0920j4521J7640M4783Q0542n1824m1267o2137l660N9121O7712
23164B3341K2496o9367k120L5610O44k0524o0566l1372k8735O400J3479J1661
23152i9053q484p654J5494q986q128j8795k110L2651K183j0959l448L2845j7293
23139a01737J8520M8638l0318n367J3877l664L8078M1996m1581l3892q491P585
23127e6356K7530L4663M4707j0569m2070j3409L7515j0640k5553J9096n392k4792
23115b5270K5006j899K3590J9509l246k5495p1959l7179N298M6178K3597k9863
23103e1733L2486j722R079k4972p10L389M5541k1854L7217j8145k9192l3624K90
$$ plain form
23090 -53950 -88691 -85301 -62370 -54987 -19388 -34679 -28550 13554 65365 39112 -56958 -90346
23078 -90346 -63452 -108967 -146799 -114554 -85768 -94787 -121828 -136964 -79769 17540 -28674 -68139
23066 -68139 -86356 -66701 -55281 -38434 -11115 -61531 -53170 -36240 -17922 -53118 -17545 34613
23054 34613 19333 -7217 -19802 -44372 -38912 -18289 20937 35604 33633 9071 17965 314
23042 314 2334 -31419 -39786 -53503 -51174 -49821 -31033 -49300 -10471 -7653 -25719 -28141 -5788
23029 -5788 -22886 -36084 -17401 -11602 -25937 -83430 -81009 -77326 -73894 -111527 -104104 -68839 -126848
23016 -126848 -140314 -101044 -30544 -37796 -58166 -39381 -31791 -3014 9003 38623 51223 -22083
23004 -22083 -85233 -98590 -102780 -52759 -26894 -28427 -12289 32086 -2267 -27036 -32870 -31856
$$ packed form
23090e3950l4741L390K2931P383L5599j5291O129M2104N1811k6253r6070l3388
23078i0346K6894m5515l7832L2245K8786r019k7041j5136N7195R7309m6214l9465
23066f8139j8217J9655J1420J6847K7319n0416Q361J6930J8318l5196L5573N2158
23054C4613j5280k6550j2585k4570N460K0623L9226J4667j971k4562Q894j7651
23042C14K020l3753q367j3717K329J353J8788j8267L8829K818j8066k422K2353
23029e788j7098j3198J8683N799j4335n7493K421L683L432l7633P423L5265n8009
23016a26848j3466L9270P0500p252k0370J8785P590K8777J2017K9620J2600p3306
23004b2083o3150j3357m190N0021K5865j533J6138M4375l4353k4769n834J014
$$ plain form
22992 -31856 -29776 -1028 -4932 -33683 -61531 -58989 -92228 -59321 -19918 -8972 12728 38544
22980 38544 3063 -15463 -26935 -3338 717 -7940 -6834 -42386 -29802 -1016 -37040 -54658
22968 -54658 -48891 -79030 -50061 -70819 -54644 -33294 -27341 -13856 -20380 6675 -14699 -63372
22956 -63372 -87290 -70179 -124614 -179820 -176722 -61805 4315 31428 -28733 -86795 -83436 -86216
22944 -86216 -74116 -91524 -103227 -89142 -84603 -100825 -135254 -64273 -87409 -32177 -5071 3661
22932 3661 -37131 -87337 -94766 -130828 -143834 -130691 -132116 -119439 -90136 -11200 11185 -74598
22920 -74598 -89511 -42277 -48691 -80447 -96898 -75297 -54231 -68733 -85375 -89229 -69129 -61335
22908 -61335 -44411 26029 18179 38218 78799 17658 -11951 -8624 9091 10277 20673 -6837
$$ packed form
22992c1856K080K8748l904k8751k7848K542l3239L2907L9403J0946K1700K5816
22980C8544l5481j8526j1472K3597M055q657J106l5552J2584K8786l6024j7618
22968e4658N767l0139K8969k0758J6175K1350N953J3485o524K7055k1374m8673
22956f3372k3918J7111n4435n5206L098J14917O6120K7113o0161n8062L359k780
22944h6216J2100j7408j1703J4085M539j6222l4429P0981k3136N5232K7106Q732
22932C661m0792n0206p429l6062j3006J3143j425J2677K9303P8936K2385q5783
22920g4598j4913M7234o414l1756j6451K1601K1066j4502j6642l854K0100P794
22908f1335J6924P0440p850K0039M0581o1141k9609L327J7715J186J0396k7510
$$ plain form
22896 -6837 -25038 -39493 -12225 -13010 -47534 -89047 -96716 -91581 -56776 -21937 -42606 -59365 -101528
22883 -101528 -150542 -137136 -124842 -86415 -80397 -92719 -103587 -116198 -135593 -112626 -75802 -39202
22871 -39202 -17970 -50171 -127276 -93059 -49051 3513 9887 -1184 -42232 -69735 -46824 -89071
22859 -89071 -116904 -128927 -148204 -158238 -137778 -138197 -154526 -153553 -106154 -79692 -69793 -95654 -90366
22846 -90366 -88230 -45411 -37843 -28523 -70617 -30030 -39253 -50175 -66672 -39583 897 -37692
22834 -37692 -80067 -68516 -77006 -65808 -67148 -41701 5512 -16934 -23756 -11955 -26557 -31356
22822 -31356 -42725 -2691 -4926 -74468 -78274 -69331 -94036 -47183 -54899 -36481 -30420 -97024 -107381
22809 -107381 -70494 -61668 -36054 -8044 -42941 -41461 -63293 -83812 -92490 -126786 -129944 -127359
$$ packed form
22896f837j8201j4455K7268p85l4524m1513p669N135L4805L4839k0669j6759m2163
22883a01528m9014J3406J2294L8427O018j2322j0868j2611j9395K2967L6824L6600
22871c9202K1232l2201p7105L4217M4008N2564O374j1071m1048k7503K2911m2247
22859h9071k7833j2023j9277j0034K0460m19j6329R73M7399K6462R899k5861N288
22846i0366K136M2819P568R320m2094M0587r223j0922j6497K7089M0480l8589
22834c7692m2375J1551q490J1198j340K5447M7213k2446o822J1801j4602m799
22822c1356j1369M0034k235o9542l806Q943k4705M6853p716J8418O061o6604j0357
22809a07381L6887Q826K5614K8010l4897J480k1832k0519q678l4296l158K585
$$ plain form
22797 -127359 -80937 -54146 -110240 -154023 -104354 -12785 7873 -43975 -35504 -71022 -73295 -37467
22785 -37467 -67949 -131865 -126906 -130738 -148194 -176605 -112080 -85670 -70913 -40802 1889 -26049
22773 -26049 -19431 48060 27945 -22466 -88654 -107189 -74311 -80914 -75443 -47357 6747 -3977
22761 -3977 3547 -29050 -66448 -51509 -55708 -40223 -87626 -109099 -99687 -75819 -74068 -88037 -80476
22748 -80476 -25947 36757 2451 -90105 -101374 -103770 -103752 -81564 -81140 -74131 -58062 -61104 -65350
22735 -65350 -76725 -84196 -109240 -127352 -73798 -68625 -127518 -146053 -104426 -86335 -64458 -71031
22723 -71031 -56106 -27061 14379 -4108 -117746 -119165 -105541 -56036 -12867 -20163 -34269 -43856
22711 -43856 -54419 -78392 -12214 2354 -10857 35484 12953 -60529 -33557 -31854 -45528 -1722
$$ packed form
22797a27359M6422K6791n6094m3783M9669R1569K0658n1848Q471l5518k273L5828
22785c7467l0482o3916M959l832j7456k8411O4525K6410J4757L0111M2691k7938
22773b6049O618O7491k0115n0411o6188j8535L2878o603N471K8086N4104j0724
22761c977P524l2597l7398J4939m199J5485m7403k1473R412K3868J751j3969P561
22748h0476N4529O2704l4306r2556j1269k396J8K2188M24P009J6069l042m246
22735f5350j1375p471k5044j8112N3554N173n8893j8535M1627J8091K1877o573
22723g1031J4925K9045M1440j8487j13638j419J3624M9505M3169p296j4106r587
22711d3856j0563k3973O6178J4568j3211M6341k2531p3482K6972J703j3674M3806
$$ plain form
22699 -1722 43298 27125 -4334 13269 24491 22714 -16514 -69552 -59889 -18066 10767 7072
22687 7072 -5132 -6007 -31837 -27864 -7413 33659 78793 84132 27286 -18748 -24522 -19169 -84011
22674 -84011 -140140 -173232 -174932 -181920 -132268 -4315 21988 31795 8025 -28447 -103087 -151355
22662 -151355 -122209 -139225 -152541 -102975 -91746 -79016 -60076 6257 17602 -22384 -85010
22651 -85010 -123785 -80297 -46051 -13504 -41926 -33981 -61597 -52759 -28150 -6020 -9502 -32160
22639 -32160 -55745 -41162 1484 15300 -24797 -58582 -112658 -84181 -69815 -129371 -176180 -164611
22627 -164611 -168711 -149561 -100900 -72592 -119053 -95406 -53735 -49588 -31204 -72465 -149128 -177417
22615 -177417 -116866 -64454 -8538 13905 -17531 5749 9291 11913 1305 7197 2507 22151
$$ packed form
22699a722M5020j6173l1459J7603J1222j777l9228n3038R663M1823K8833l695
22687G072j2204q75k5830L973K0451M1072M5134N339n6846m6034n774N353o4842
22674h4011n6129l3092j700o988M9652J27953K6303R807k3770l6472p4640m8268
22662a51355K9146j7016j3316M9566J1229J2730J8940O6333J1345l9986o2626
22651h5010l8775M3488L4246L2547k8422P945k7616Q838K4609K2130l482k2658
22639c2160k3585J4583M2646J3816m0097l3785n4076K8477J4366n9556m6809J1569
22627a64611m100J9150M8661K8308m6461K3647M1671M147J8384m1261p6663k8289
22615a77417O0551N2412N5916K2443l1436K3280L542K622j0608N892m690J9644
$$ plain form
22603 22151 14837 -12751 -32951 -398 17968 -4046 40610 4899 -82475 -65053 34723 55300
22591 55300 36558 -49549 -102337 -139303 -81580 -58384 -68198 -68977 -79416 -49149 -57162 -31983
22579 -31983 3946 20847 11150 -10292 -22160 -40677 -57080 -69261 -66084 -22348 -35515 -37944
22567 -37944 -54054 -73136 -38257 -15905 -26942 -38112 -69561 -82502 -115522 -92933 -116089 -120683
22555 -120683 -59958 -13636 -15799 -25338 19677 20776 21115 -17099 -8075 -17430 4107 22061 -20352
22542 -20352 -35674 -59770 -40725 -54498 -95299 -107567 -90456 -73199 -83256 -63442 -7371 26559
22530 26559 -9726 -31444 491 39375 166 -17599 -52520 -65096 -75674 -87759 -69874 -53204
22518 -53204 -57289 -47012 -74026 -84909 -106507 -45619 -19707 -53138 -45769 -58015 -18163 22753
$$ packed form
22603B2151p314k7588k0200L2553J8366k2014M4656l5711q7374J7422R9776K0577
22591E5300j8742q6107n2788l6966N7723K3196r814p79j0439L0267q013K5179
22579c1983L5929J6901r697k1442j1868j8517j6403j2181L177M3736j3167k429
22567c7944j6110j9082L4879K2352j1037j1170l1449j2941l3020K2589k3156m594
22555a20683O0725M6322k163r539M5015J099L39l8214R024r355K1537J7954m2413
22542b0352j5322k4096J9045j3773m0801j2268J7111J7257j0057J9814N6071L3930
22530B6559l6285k1718L1935L8884l9209j7765l4921j2576j0578j2085J7885J6670
22518e3204m085J0277k7014j0883k1598O0888K5912l3431P369j2246L9852M0916
$$ plain form
22506 22753 8568 10038 1206 -20758 -42663 -46611 -9731 49251 30893 -37289 -34291 -16061
22494 -16061 -19485 -46081 -33602 -51965 -74008 -101365 -88688 -57690 -53033 -79645 -79819 -104299
22482 -104299 -97906 -125036 -104993 -38536 19882 -21021 -59457 -83300 -35817 -26749 -25031 -23917
22470 -23917 -13139 -218 -46494 -59933 -28739 -36139 -13540 13389 -3682 34084 9939 -17593
22458 -17593 17176 36954 -40792 -71558 -102928 -92238 -77173 -57546 -78690 -77778 -13865 72214
22446 72214 74880 65885 1943 -72598 -67434 -60433 -47016 -38402 63175 42387 -2448 -3790 9841
22433 9841 20183 86693 133988 168710 204897 267278 323347 286081 261864 232053 134669 75949
22421 75949 56172 56027 69041 90749 54610 15091 15898 17829 13629 -4847 22616 52518 8854
$$ packed form
22506B2753j4185J470q832k1964k1905l948L6880N8982j8358o8182K998J8230
22494a6061l424k6596J2479j8363k2043k7357J2677L0998M657k6612j74k4480
22482a04299O393k7130K0043O6457N8418m0903l8436k3843M7483R068J718J114
22470b3917J0778J2921m6276j3439L1194p400K2599K6929j7071L7766k4145k7532
22458a7593L4769J9778p7746l0766l1370J0690J5065J9627k1144R12O3913Q6079
22446G2214K666q995o3942p4541N164P001J3417Q614J01577k0788m4835j342J3631
22433I841J0342O6510M7295L4722L6187O2381N6069l7266k4217k9811r7384n8720
22421G5949j9777j45J3014K1708l6139l9519Q07J931m200j8476K7463K9902m3664
$$ plain form
22408 8854 -41 11054 13374 -20612 -73858 -74973 -79435 -107660 -110544 -113776 -142363 -160758 -114579
22395 -114579 -62394 -107551 -56284 25188 -2623 -56647 -63778 -67384 -50476 -66868 -70360 -67263
22383 -67263 -64244 -32900 -57555 -75922 -109247 -119528 -59190 -66170 -93958 -92816 -99968 -112268
22371 -112268 -104485 -90265 -63570 -74200 -139373 -126011 -125823 -136151 -130170 -69366 -25127 -42695
22359 -42695 -34409 -60147 -67758 -65117 -89607 -83206 -66642 -61446 -49726 -40176 -49662 -11156 -43105
22346 -43105 -107480 -117056 -104447 -88479 -72531 -56512 -55284 -65411 -53926 -74678 -105978 -77259
22334 -77259 -73156 -49249 -29642 -28176 -40549 -24584 -47217 -42957 -92424 -86962 -49742 -48014 -71085
22321 -71085 -59444 -58162 -35112 -32153 -12856 -7131 8957 6912 -33746 -29326 -6769 -7356 15906
$$ packed form
22408H854q895J1095K320l3986n3246j115m462k8225k884l232k8587j8395M6179
22395a14579N2185m5157N1267Q1472k7811n4024p131l606J6908j6392l492L097
22383f7263L019L1344k4655j8367l3325j0281O0338o980k7788J142p152j2300
22371a12268P783J4220K6695j0630o5173J3362J88j0328N981O0804M4239j7568
22359d2695Q286k5738p611K641k4490O401J6564N196J1720R550r486L8506l1949
22346d3105o4375r576J2609J5968J5948J6019J228j0127J1485k0752l1300K8719
22334g7259M103K3907J9607J466j2373J5965k2633M260m9467N462L7220J728k3071
22321g1085J1641J282K3050K959J9297N725J6088k045m0658M420K2557n87K3262
$$ plain form
22308 15906 -3422 -56924 -70802 -70572 -54384 -17455 -41787 -65834 -53680 -61586 -67188 -98653
22296 -98653 -167640 -167378 -57719 -10077 -9685 -4366 -43433 -70616 -67438 -45584 -42703 -30201 -44184
22283 -44184 -32322 -50377 -75314 -92704 -41537 -49974 -112459 -103002 -88676 -63228 -23918 -22348
22271 -22348 -66843 -72033 -31268 -35361 19296 -1147 -12121 -18750 -53696 -71378 -33014 -15431
22259 -15431 5287 -523 24495 49928 57679 44535 -26892 19514 47938 21191 -4521 -10354
22247 -10354 2567 7277 -10605 605 -20205 -21637 4164 -27991 -53461 -54021 -9589 -15266 -26904
22234 -26904 -18165 -53563 -74535 -66575 -36276 -53538 -29116 30345 -9054 8258 47132 41205
22222 41205 -34482 -117036 -84805 -49695 -62453 -123308 -116844 -27711 -33857 -77111 -40717 -19754
$$ packed form
22308A5906j9328n3502j3878K30J6188L6929k4332k4047J2154p906n602l1465
22296i8653o8987K62J09659M7642L92N319l9067k7183L178K1854K881J2502j3983
22283d4184J1862j8055k4937j7390N1167q437o2485R457J4326K5448L9310J570
22271b2348m4495n190M0765m093N4657k0443j0974o629l4946j7682L8364J7583
22259a5431K0718n810K5018K5433P751j3144p1427M6406K8424k6747k5712n833
22247a0354J2921M710j7882J1210k0810j432K5801l2155k5470n60M4432n677j1638
22234b6904Q739l5398k0972P960L0299j7262K4422N9461l9399J7312L8874n927
22222D1205p5687q2554L2231L5110j2758o0855O464Q9133o146m3254L6394K0963
$$ plain form
22210 -19754 -23283 -34135 -20670 -3950 -36877 -61269 -38660 -46093 -38686 -21572 23779 -53985
22198 -53985 -99118 -98348 -75938 -60402 -2241 44389 13386 10648 -5987 -52215 -88290 -151045
22186 -151045 -149581 -158662 -148927 -105831 -61879 -34193 -24633 7145 22020 10176 -20578 -70624
22174 -70624 -33063 -4903 9444 8856 10385 7135 -35450 -56857 -68703 -62523 -63434 -39858 -41412
22161 -41412 -34416 -7843 705 -70276 -87379 -51607 -38418 -41302 -26586 -677 -20287 -33044
22149 -33044 -27882 -14762 -50240 -60004 -65943 -76879 -48737 -43898 -60696 -36711 -26712 17448 66708
22136 66708 48056 64565 114754 111994 119879 99284 31758 -11058 -67528 -61315 -46637 -21998
22124 -21998 2684 -20399 -19131 -15921 -42699 -18101 -65978 -62354 2756 29439 -31759 -19026
$$ packed form
22210a9754l529j0852J3465J6720l2927k4392K2609p433P407J7114M5351p7764
22198e3985m5133P70K2410J5536N8161M6630l1003k738j6635m6228l6075o2755
22186a51045J464r081R735M3096M3952K7686R560L1778J4875j1844l0754n0046
22174g0624L7561K8160J4347n88J529l250m2585k1407j1846O180r11K3576j554
22161d1412O996K6573Q548p0981j7103L5772J3189k884J4716K5909j9610j2757
22149c3044N162J3120l5478r764n939j0936K8142M839j6798K3985R999M4160M9260
22136F6708j8652J6509N0189k760P885k0595o7526m2816n6470O213J4678K4639
22124b1998K4682k3083J268L210k6778K4598m7877L624O5110K6683o1198J2733
$$ plain form
22112 -19026 61226 113860 80180 72195 75679 55467 36787 61427 68191 80278 115397 140818
22100 140818 103763 60312 32060 49535 87872 72076 54119 45099 17472 -22451 -19955 -22716
22088 -22716 -45870 -34834 -38065 -13690 13092 -26150 -51134 -24531 3353 5335 43529 73061
22076 73061 47115 44422 26748 22647 48804 10446 -34628 -29593 -1564 4505 -6117 -38573
22064 -38573 -85216 -129793 -141786 -125099 -141797 -91736 20533 88495 109519 47694 12839
22053 12839 -12628 -37245 -47940 -68589 -33896 -14396 9470 990 2677 -56652 -57118 -10008
22041 -10008 11268 25102 68 -19200 -13835 -6629 24214 30063 -22541 -49604 -7560 7568
22029 7568 -33674 -51649 -20272 -40847 -79967 -52805 -54679 -90246 -65923 -62253 -41330 -85169
$$ packed form
22112a9026Q0252N2634l3680p985L484k0212j8680K4640O764J2087L5119K5421
22100A40818l7055m3451k8252J7475L8337j5796j7957r020k7627l9923K496k761
22088b2716k3154J1036l231K4375K6782l9242k4984K6603K7884J982L8194K9532
22076G3061k5946k693j7674m101K6157l8358m5074N035K8029O069j0622l2456
22064c8573m6643m4577j1993J6687j6698N0061J12269O7962K1024o1825l4855
22053A2839k5467k4617j0695k0649L4693J9500K3866q480J687n9329m66M7110
22041a0008K1276J3834k5034j9268N365P206L0843N849n2604k7063M2044J5128
22029G568m1242j7975L1377k0575l9120K7162j874l5567K4323L670K0923m3839
$$ plain form
22017 -85169 -106827 -98443 -82025 -116815 -99226 -86260 -62903 -51191 -87489 -80138 -59177 -15490
22005 -15490 -9402 22888 7480 -19891 -86813 -87046 -72199 -67499 -75940 -81660 -43655 -48962 -69282
21992 -69282 -84742 -65751 -40856 -63109 -118817 -107451 -44306 -47404 -38408 -79004 -122250 -99027
21980 -99027 -88124 -77091 -37110 -60974 -35689 -32529 -29478 -23754 -15450 -17513 8517 37921 64648
21967 64648 72431 34927 17308 31922 30811 58401 45634 26290 -30795 -9500 56058 105547
21955 105547 63214 -10848 -4285 -28140 -54412 -20760 -18058 -19071 -59595 -96560 -97052 -130770
21943 -130770 -149044 -102683 -89129 -99148 -65351 -52756 31536 -6154 -58463 -43972 105
21932 105 22835 -9115 -63868 -71609 -63364 -115371 -100404 -68347 -63410 -65180 -30975 -25720 -25485
$$ packed form
22017h5169k1658Q384J6418l4790J7589J2966K3357J1712l6298P351K0961M3687
22005a5490O088L2290j5408k7371o6922k33J4847M700q441n720L8005n307k0320
21992f9282j5460J8991K4895k2253n5708J1366O3145l098Q996m0596m3246K3223
21980i9027J0903J1033L9981k3864K5285L160L051N724Q304k063K6030K9404K6727
21967F4648P783l7504j7619J4614j111K7590j2767j9344n7085K1295O5558M9489
21955A05547m2333p4062O563k3855k6272L3652K702j013m0524l6965m92l3718
21943a30770j8274M6361J3554j0019L3797J2595Q4292l7690n2309J4491M4077
21932A05K2730l1950n4753p741Q245n2007J4967L2057M937j770L4205N255K35
$$ plain form
21919 -25485 -50107 -40535 -74444 -64509 4280 58573 58709 65997 44570 -9503 -47312 -75341 -72323
21906 -72323 -14611 40464 -653 -27894 -23989 -27797 23337 68618 -6807 17990 21282 12694
21894 12694 -34400 -23585 -3921 -38524 -39785 -50785 -40608 -47779 -6860 4889 42863 -13012
21882 -13012 -44110 2120 17795 -4172 35806 29648 28302 -41414 -63572 -36235 -73987 -95553
21870 -95553 -63282 -41939 -11915 -23213 14501 25957 17262 4753 59058 52814 795 -31285
21858 -31285 -45153 -56449 -45790 -64557 -70148 -5358 -21738 -15625 39252 42588 6189 9569
21846 9569 8668 77738 116622 151081 145385 58282 62406 41103 -2431 -53511 -32245 -14520 -19160
21833 -19160 31799 104391 119718 116183 138506 159743 175271 126726 145353 111654 72813 59712
$$ packed form
21919b5485k4622R572l3909R935O8789N4293J36P288k1427n4073l7809k8029L018
21906g2323N7712N5075m1117k7241L905l808N1134M5281p5425K4797L292q588
21894A2694m7094J0815J9664l4603j261j1000J0177p171M0919J1749L7974n5875
21882a3012l1098M6230J5675k1967L9978o158j346o9716k2158K7337l7752k1566
21870i5553L2271K1343L0024j1298L7714J1456q695j2509N4305o244n2019l2080
21858c1285j3868j1296J0659j8767n591O4790j6380O113N4877L336l6399L380
21846I569r01O9070L8884L4459n696q7103M124k1303m3534n1080K1266J7725m640
21833a9160N0959P2592J5327l535K2323K1237J5528m8545J8627l3699l8841j3101
$$ plain form
21821 59712 68514 80934 42261 78265 120173 100559 59736 59970 6444 2400 12756 23730
21809 23730 15881 58526 55860 28997 -10257 -11192 35781 60923 -11672 -43839 -18313 41373
21797 41373 69736 134908 146895 128547 123086 116906 118442 116816 97015 141602 180457 156201
21785 156201 177403 193949 140863 152539 119189 107972 77476 45332 35562 76527 88087 98774
21773 98774 75052 49398 76133 127023 99350 85679 83026 58333 58068 45435 33218 17460
21761 17460 25401 43036 42430 73449 83234 65930 55101 48337 32502 35245 34364 8922 13832
21748 13832 44120 11894 -3350 -53073 -46970 -14153 -3593 19626 19078 868 -60562 -88276
21736 -88276 -46831 6225 53081 100232 144009 182962 141120 71636 41745 38267 28075 3226
$$ packed form
21821E9712Q802J2420l8673L6004M1908j9614m0823K34n3526m044J0356J0974
21809B3730p849M2645k666k6863l9254r35M6973K5142p2595l2167K5526N9686
21797D1373K8363O5172J1987j8348n461o180J536j626j9801M4587L8855k4256
21785A56201K1202J6546n3086J1676l3350j1217l0496l2144r770M0965J1560J0687
21773I8774k3722k5654K6735N0890k7673j3671k653k4693k65j2633j2217j5758
21761A7460P941J7635o06L1019R785j7304j0829o764j5835K743q81k5442M910
21748A3832L0288l2226j5244m9723O103L2817J0560K3219n48j8210o1430k7714
21736h8276M1445N3056M6856M7151M3777L8953m1842o9484k9891l478j0192k4849
$$ plain form
21724 3226 -16488 40625 36030 7049 -193 -16698 -39777 -53298 -39883 12567 62750 116547
21712 116547 64141 31241 54690 56707 22666 -5439 -65396 -84045 -9734 87291 143364 116673
21700 116673 97033 82365 86634 17433 -36168 -11182 20116 11780 13145 27794 -18321 -21621
21688 -21621 46857 39085 62580 42573 46615 62343 59029 52370 78374 55677 68871 11915
21676 11915 35464 137695 152334 101513 49895 73989 118247 104349 88153 54350 37426
21665 37426 46938 39600 26973 -7800 -68121 -82450 -16550 -14791 40558 57434 43399 42950 59179
21652 59179 64749 48587 21842 57457 59972 44506 47269 69364 61613 56659 24693 31595 40588
21639 40588 4590 4672 68409 94096 161523 178683 135840 79921 42353 14885 16308 24723 10499
$$ packed form
21724C226j9714N7113m595k8981p242j6505k3079j3521J3415N2450N0183N3797
21712A16547n2406l2900K3449K017l4041k8105n9957j8649P4311R7025N6073k6691
21700A16673j9640j4668M269o9201n3601K4986L1298q336J365J4649m6115l300
21688b1621O8478p772K3495k0007M042J5728l314o659K6004k2697J3194n6956
21676A1915K3549J02231J4639n0821n1618K4094M4258j3898j6196l3803j6924
21665C7426R512p338j2627l4773o0321j4329O5900J759N5349J6876j4035m49J6229
21652E9179N570j6162k6745L5615K515j5466K763K2095p751m954l1966O902Q993
21639D0588l5998Q2O3737K5687O7427J7160m2843n5919l7568k7468J423Q415j4224
$$ plain form
21626 10499 7031 33963 92468 43074 -46945 -47517 -31885 -2271 25815 15629 -5199 -13024
21614 -13024 -54261 -27296 15767 51926 69134 16217 -28966 -42979 -50756 -82757 -92495 -71955
21602 -71955 -55541 -37936 -65778 -86 17600 18504 -8608 -43833 -87431 -101720 -122639 -64064
21590 -64064 -11058 -8013 -36200 -13782 16796 21553 -17855 -6164 7139 2188 263 22219
21578 22219 8509 -6995 -6172 -17287 17241 49740 64515 92412 124804 136423 41952 -13199
21566 -13199 -31677 -11962 -25221 -99284 -86211 -66024 -45645 -38523 -40087 -15260 19957 92042
21554 92042 41553 -36684 -20451 -12378 13879 1705 -61395 -70679 -31526 -6289 -21969 -20901
21542 -20901 -60905 -63901 431 14028 19265 3214 65825 22416 -21719 -57368 -86318 -55736
$$ packed form
21626A0499l468K6932N8505m9394r0019n72J5632K9614K8086j0186k0828p825
21614a3024m1237K6965M3063L6159J7208n2917m5183j4013p777l2001r738K0540
21602g1955J6414J7605k7842O5692J7686R04k7112l5225m3598j4289k0919N8575
21590f4064N3006L045k8187K2418L0578M757l9408J1691J3303m951j925K1956
21578B2219j3710j5504Q23j1115L4528L2499J4775K7897L2392J1619r4471n5151
21566a3199j8478J9715j3259p4063J3073K0187K0379P122j564K4827L5217P2085
21554I2042n0489p8237J6233Q073K6257j2174o3100r284L9153K5237j5680J068
21542b0901m0004k996O4332J3597N237j6051O2611m3409m4135l5649k8950L0582
$$ plain form
21530 -55736 -20172 33387 51850 3849 -6517 -16846 65987 57703 23487 54392 53013 14163
21518 14163 6385 -21607 -24232 -26725 -56133 -822 77919 97914 54266 15795 -41895 16813
21506 16813 61932 34678 -25721 -37114 16814 -5767 -3583 33916 -5371 -46812 -48311 -10719
21494 -10719 -2185 -5918 6978 35732 57544 84492 102512 73738 37521 58900 28725 -8857
21482 -8857 -18278 -40864 -82728 -61890 -44897 -84687 -55424 59003 96410 31421 -37024 -66258
21470 -66258 -60079 -19561 47653 53426 84911 119618 140858 94133 57072 104399 131684 70765
21458 70765 99057 105229 122393 121603 59385 22123 4377 31195 22758 32440 9423 17672 55273
21445 55273 134202 137146 99862 74131 80837 33719 42629 64293 85163 42351 10514 55688
$$ packed form
21530e5736L5564N3559J8463m8001j0366j0329Q2833q284l4216L0905j379l8850
21518A4163p778k7992k625k493k9408N5311P8741J9995m3648l8471n7690N8708
21506A6813M5119k7254o0399j1393N3928k2581K184L7499l9287m1441j499L7592
21494a0719Q534l733J2896K8754K1812K6948J8020k8774l6217K1379l0175l7582
21482h857r421k2586m1864K0838J6993l9790K9263J14427L7407o4989o8445k9234
21470f6258O179M0518O7214N773L1485L4707K1240m6725l7061M7327K7285o0919
21458G0765K8292O172J7164p90o2218l7262j7746K6818q437R682k3017Q249L7601
21445E5273P8929K944l7284k5731O706m7118Q910K1664K0870m2812l1837M5174
$$ plain form
21433 55688 70482 48755 50781 63258 31205 -14439 47105 40219 59354 80652 92592 96133
21421 96133 101124 80664 92640 122217 109312 111323 113789 98975 71270 59280 95810 95100 107812
21408 107812 99172 51725 56623 22315 45043 74871 86009 118993 112459 85174 75624 50215
21396 50215 13518 28277 31636 2288 -581 1674 -3958 -27095 -76497 -40901 14039 37835
21384 37835 10077 26544 57120 44472 18738 37043 72873 66294 69041 76836 54078 39382
21372 39382 41956 44093 -5512 -17330 5377 51873 6835 -51154 8775 34660 -29229 -14058
21360 -14058 3006 42986 13892 30330 54877 59870 62509 90946 78669 27182 22063 23686
21348 23686 47816 74053 57429 6270 -5195 -8295 12226 30531 49118 72831 103685 84746
$$ packed form
21433E5688J4794k1727K026J2477l2053m5644O1544o886J9135K1298J1940L541
21421I6133M991k0460J1976K9577j2905K011K466j4814k7705j1990L6530p10J2712
21408A07812q640m7447M898l4308K2728K9828J1138L2984o534k7285r550k5409
21396E0215l6697J4759L359k9348k869K255n632k3137m9402L5596N4940K3796
21384C7835k7758J6467L0576j2648k5734J8305L5830o579K747P795k2758j4696
21372C9382K574K137m9605j1818K2707M6496m5038n7989N9929K5885o3889J5171
21360a4058J7064L9980k9094J6438K4547M993K639K8437j2277n1487n119J623
21348B3686K4130K6237j6624n1159j1465l100K0521J8305J8587K3713L0854j8939
$$ plain form
21336 84746 49200 -5637 -5259 19363 82516 59992 100529 142362 83377 44733 38281 -6564
21324 -6564 -15591 4478 59272 100736 90811 77415 73765 64493 111486 102177 55044 14662 11011
21311 11011 51317 77391 96834 135421 63649 28036 63450 52565 85265 113581 31723 -69393
21299 -69393 -59931 56906 150921 131015 90354 105431 143933 139124 82990 80180 106638 109864
21287 109864 64135 47473 75774 110529 104772 64401 47336 57189 44216 73461 108785 171808
21275 171808 198965 199050 170601 97544 36057 2776 -12213 -4853 -29785 33677 33345 89765 132741
21262 132741 122629 154895 117332 125619 141007 109262 85973 111787 169977 182903 151238 107697
21250 107697 97709 135280 141522 121198 105718 94359 69822 51325 63043 69564 70721 113844
$$ packed form
21336H4746l5546n4837L78K4622O3153k2524M0537M1833n8985l8644o452m4845
21324f564r027K0069N4794M1464r925j3396l650r272M6993r309m7133m0382l651
21311A1011M0306K6074J9443L8587p1772l5613L5414j0885L2700K8316q1858j01116
21299f9393R462J16837R4015j9906m0661J5077L8502m809n6134k810K6458L226
21287A09864m5729j6662K8301L4755n757m0371j7065R853j2973K9245L5324O3023
21275A71808K7157Q5k8449p3057o1487l3281j4989P360k4932O3462l32N6420M2976
21262A32741j0112L2266l7563Q287J5388l1745k3289K5814N8190J2926l1665m3541
21250A07697r988L7571O242k0324j5480j1359k4537j8497J1718O521J157M3123
$$ plain form
21238 113844 97279 74603 66713 92275 81796 83009 79601 168563 227825 214080 204087 173889
21226 173889 128196 131026 192810 142095 67865 54498 54450 14696 4523 32982 68219 49342
21214 49342 34361 34030 78104 131361 176754 206063 156465 140396 77713 108398 94691 85615
21202 85615 94255 50561 47246 97698 177223 216675 214677 151299 108340 97653 162184 180355
21190 180355 156437 128302 161717 140653 86714 78564 91443 88257 13401 10963 68738 91160
21178 91160 109564 136575 126575 174861 193277 218656 261739 255419 291654 267050 195346 144889
21166 144889 134705 166436 109390 101038 140505 125554 138401 145485 150445 153349 143558 131463
21154 131463 101206 128792 153264 137933 152849 189667 193441 137950 140682 144864 150873 191362
$$ packed form
21238A13844j6565k2676p890K5562j0479J213l408Q8962N9262j3745r993l0198
21226A73889m5693K830O1784n0715p4230j3367m8l9754j0173K8459L5237j8877
21214D9342j4981l31M4074N3257M5393K9309m9598j6069o2683L0685j3707r076
21202H5615Q640m3694l315N0452P9525L9452j998o3378m2959j0687O4531J8171
21190A80355k3918k8135L3415k1064n3939q150J2879l186p4856k438N7775K2422
21178I1160J8404K7011j0000M8286J8416K5379M3083o320L6235k4604p1704n0457
21166A44889j0184L1731n7046q352L9467j4951J2847P084M960K904r791j2095
21154A31463l0257K7586K4472j5331J4916L6818L774n5491K732M182O009M0489
$$ plain form
21142 191362 183578 159927 180573 195690 224611 214074 191716 172050 166630 202683 193647 237774
21130 237774 241741 230167 203514 190227 191423 225869 218247 239406 223013 177498 173052 116011
21118 116011 66212 114274 171972 268054 285409 223398 211230 187570 183371 228084 276571 246931
21106 246931 143196 74916 88622 177944 196752 206513 212702 192064 205759 203071 209365 200520
21094 200520 225198 312354 308544 286425 245352 269707 257057 241525 202746 179516 217594 205230
21082 205230 272228 282860 251197 228946 239421 293526 270179 283581 288784 265852 261567 256168
21070 256168 197826 205380 317731 284661 267503 254700 287051 281460 290253 286360 298365 307879
21058 307879 267122 207146 174346 222827 238325 236324 263048 253597 278044 315138 199070 138522
$$ packed form
21142A91362p784k3651K0646J5117K8921j0537k2358j9666n420L6053r036M4127
21130B37774L967j1574k6653j3287J196L4446p622K1159j6393m5515m446n7041
21118A16011m9799M8062N7698R6082J7355o2011j2168k3660m199M4713M8487k9640
21106B46931j03735o8280J3706Q9322J8808R761O189k0638J3695k688O294q845
21094B00520K4678Q7156l810k2119m1073K4355j2650j5532l8779k3230L8078j2364
21082B05230O6998J0632l1663k2251J0475N4105k3347J3402N203k2932m285n399
21070B56168n8342P554J12351l3070j7158j2803L2351n591Q793l893J2005R514
21058C07879m0757n9976l2800M8481J5498k001K6724r451K4447L7094j16068o0548
$$ plain form
21046 138522 146304 184293 182256 172993 179008 176402 196999 230986 233531 234410 237528 228933 259197
21033 259197 306405 347939 383708 372974 340739 317903 306740 295508 266620 288745 291993 296973
21021 296973 339637 335538 299871 279568 269739 260531 238097 259101 319971 349007 328163 306381
21009 306381 259529 241025 264263 268335 269213 240886 215067 235847 234102 245571 368543 383886
20997 383886 346376 297099 315086 300069 321909 313807 326953 309756 279714 277880 222238 234480
20985 234480 217498 209874 242436 271433 317742 325483 346856 293345 264873 299234 308417 356426
20973 356426 368881 365100 334130 306786 338988 367188 366604 345315 346325 321629 320605 318442 357841
20960 357841 353968 331915 379368 414755 377747 309787 291309 348279 351672 334089 307171 299379
$$ packed form
21046A38522P782L7989k037r263O015k606K0597L3987K545Q79L118q595L0264
21033B59197M7208M1534L5769j0734l2235k2836j1163j1232k8888K2125L248M980
21021B96973M2664m099l5667k0303r829r208k2434K1004O0870K9036k0844k1782
21009C06381m6852j8504K3238M072Q78k8327k5819K0780j745J1469J22972J5343
20997C83886l7510m9277J7987j5017K1840q102J3146j7197l0042j834n5642J2242
20985B34480j6982p624L2562K8997M6309P741K1373n3511k8472L4361R183M8009
20973C56426J2455l781l0970k7344L2202K8200n84k1289J010k4696j024k163L9399
20960C57841l873k2053M7453L5387l7008o7960j8478N6970L393j7583k6918p792
$$ plain form
20948 299379 294396 287006 312983 326519 349202 387584 363448 365558 352676 333690 348401 381189
20936 381189 380882 349706 340964 341136 383774 460987 524413 498699 457506 369063 405139 434392
20924 434392 437944 464120 523183 505546 480214 425064 408048 437829 478269 497002 434836 413023
20912 413023 437132 445265 491271 518868 537089 559997 558805 563078 520562 500454 452032 435609
20900 435609 481555 470691 450309 456841 478185 404583 376952 365369 386853 455100 520663 565490
20888 565490 516729 493357 507640 516451 487056 483640 523834 571374 530281 497213 484750 457012
20876 457012 508611 562970 500747 446867 452148 481125 459002 434798 471038 521922 575259 590163
20864 590163 524647 492942 504317 516997 527323 535490 516748 535581 547426 526960 574416 552278
$$ packed form
20948B99379m983p390K5977J3536K2683L8382k4136K110j2882j8986J4711L2788
20936C81189l07l1176q742J72M2638P7213O3426k5714m1193q8443L6076K9253
20924D34392L552K6176N9063j7637k5332n5150j7016K9781M0440J8733o2166k1813
20912D13023K4109Q133M6006K7597J8221K2908j192M273m2516k0108m8422j6423
20900D35609M5946j0864k0382O532K1344p3602k7631j1583K1484O8247O5563M4827
20888E65490m8761k3372J4283Q811k9395l416M0194M7540m1093l3068j2463k7738
20876D57012N1599N4359o2223n3880N281K8977k2123k4204L6240N0884N3337J4904
20864E90163o5516l1705J1375J2680J0326Q167j8742J8833J1845k0466M7456k2138
$$ plain form
20852 552278 491901 540319 570859 533482 548552 583646 582426 599476 608037 589811 637836 618459
20840 618459 620548 621922 569080 577789 596579 634741 726013 720185 687374 663841 693099 702620
20828 702620 674195 697509 704640 648293 627192 630881 590490 628500 631337 655728 651135 639279
20816 639279 636509 623963 678063 673369 664811 668729 641621 674061 746372 715890 699536 723988
20804 723988 704835 733969 807788 785829 754118 685799 683873 688176 725881 760695 828138 782659
20792 782659 718018 731750 676579 647779 704625 756810 824130 841397 832102 845397 872567 865915
20780 865915 815876 766804 750728 781153 801291 803062 871754 878605 843657 848246 813732 870048
20768 870048 876084 871448 839626 893676 937362 896867 836487 812764 812322 874859 900372 934632
$$ packed form
20852E52278o0377M8418L0540l7377J5070L5094j220J7050Q561j8226M8025j9377
20840F18459K089J374n2842Q709J8790L8162R1272n828l2811k3533K9258R521
20828G02620k8425K3314P131n6347k1101L689m0391L8010K837K4391m593j1856
20816F39279k770j2546N4100m694q558L918k7108L2440P2311l0482j6354K4452
20804G23988j9153K9134P3819k1959l1711o8319j926M303L7705L4814O7443m5479
20792G82659o4641J3732n5171k8800N6846N2185O7320J7267r295J3295K7170o652
20780H65915n0039m9072j6076L0425K0138J771O8692O851l4948M589l4514N6316
20768H70048O036m636l1822N4050M3686m0495o0380k3723m42O2537K5513L4260
$$ plain form
20756 934632 879975 859129 885228 902246 887421 844937 826543 835713 872259 879477 900663 932555
20744 932555 913655 942685 979249 956543 909293 951857 1016270 1000611 961747 952939 959054 968479
20732 968479 948039 901991 899538 903424 982475 1031478 1035515 1044055 1042271 1020478 1013733 988243 1026800
20719 1026800 1095385 1144757 1125506 1060446 1047883 1130381 1189848 1178320 1159573 1106893 1126386
20708 1126386 1171589 1170757 1126344 1084078 1101814 1104606 1134856 1167139 1191797 1193827 1235339 1255688
20696 1255688 1234729 1202080 1205091 1234137 1243408 1280651 1295586 1312168 1318285 1287873 1246460 1245815
20684 1245815 1292808 1281925 1303018 1319440 1264758 1269931 1236340 1210594 1274483 1328096 1348531
20673 1348531 1348665 1319127 1317801 1377116 1420067 1424044 1392419 1441478 1421692 1378750 1419233 1444795
$$ packed form
20756I34632n4657k0846K6099J7018j4825m2484j8394R170L6546P218K1186L1892
20744I32555j8900K9030L6564k2706m7250M2564O4413j5659l8864q808O115R425
20732I68479k0440m6048k453L886P9051M9003M037Q540j784k1793o745k5490L8557
20719A026800O8585M9372j9251o5060j2563Q2498N9467j1528j8747n2680J9493
20708A126386M5203q32m4413m2266J7736K792L0250L2283K4658K030M1512K0349
20696A255688k0959l2649L011K9046R271L7243J4935J6582O117l0412m1413o45
20684A245815M6993j0883K1093J6422n4682N173l3591k5746O3889N3613K0435
20673A348531J34k9538j326N9315M2951L977l1625M9059j9786m2942M0483K5562
$$ plain form
20661 1444795 1419905 1420207 1407465 1402968 1462919 1528028 1543757 1544814 1504507 1513841 1585082 1598156
20649 1598156 1601406 1610853 1594029 1615530 1605461 1628999 1627737 1606197 1599166 1582468 1665112 1719868
20637 1719868 1720265 1671546 1707189 1781418 1779218 1723459 1771966 1853527 1861495 1839789 1810060 1799572
20625 1799572 1808155 1787336 1748716 1754204 1809240 1819162 1853930 1945192 1969988 2018600 2043463 2028441
20613 2028441 2042783 2069686 2082869 2089711 2138532 2133530 2124563 2140724 2178455 2195580 2179131 2201527
20601 2201527 2219106 2248134 2265669 2273649 2283001 2274891 2344199 2392827 2401553 2386788 2360494 2396426
20589 2396426 2488391 2538960 2534190 2516619 2540629 2600668 2665798 2584397 2613478 2684787 2679822 2686333
20577 2686333 2670099 2707935 2735835 2713021 2706306 2726862 2761759 2770932 2780246 2820559 2851813 2868870
$$ packed form
20661A444795k4890L02j2742m497N9951O5109J5729J057m0307R334P1241J3074
20649A598156L250R447j6824K1501j0069K3538j262k1540p031j6698Q2644N4756
20637A719868L97m8719L5643P4229k200n5759M8507Q1561P968k1706k9729j0488
20625A799572Q583k0819l8620N488N5036R922L4768R1262K4796M8612K4863j5022
20613B028441J4342K6903J3183O842M8821n002q967J6161L7731J7125j6449K2396
20601B201527J7579K9028J7535P980R352q110O9308M8628Q726j4765k6294L5932
20589B396426R1965N0569m770j7571K4010O0039O5130q1401K9081P1309m965O511
20577B686333j6234L7836K7900k2814o715K0556L4897R173R314M0313L1254J7057
$$ plain form
20565 2868870 2907459 2953914 3017149 3065269 3123143 3140178 3158837 3192768 3206599 3261789 3323299
20554 3323299 3341903 3384099 3379782 3300016 3319607 3376559 3401174 3433558 3536631 3609462 3665975
20543 3665975 3712854 3651835 3668595 3688927 3699497 3752328 3821890 3845921 3883071 3913803 3943706
20532 3943706 3953488 3978550 3996794 3987083 3994205 4033523 4068773 4116670 4172610 4230105 4281121 4308937
20520 4308937 4348815 4406489 4486291 4565589 4571334 4602256 4611903 4614214 4561779 4582982 4650283 4723785
20508 4723785 4796353 4820220 4847471 4960660 5020070 5059707 5136959 5172113 5178227 5223940 5292543
20497 5292543 5329942 5398435 5479249 5537668 5626267 5714922 5792407 5808937 5819158 5853073 5872179
20486 5872179 5905509 5980540 6072930 6140006 6194152 6250589 6318731 6420049 6563348 6664277 6731298
$$ packed form
20565B868870L8589M6455O3235M8120N7874J7035J8659L3931J3831N5190O1510
20554C323299J8604M2196m317p9766J9591N6952K4615L2384J03073P2831N6513
20543C665975M6879o1019J6760K0332J0570N2831O9562K4031L7150L0732K9903
20532C943706R782K5062J8244r711P122L9318L5250M7897N5940N7495N1016K7816
20520D308937L9878N7674P9802P9298N745L0922R647K311n2435K1203O7301P3502
20508D723785P2568K3867K7251J13189N9410L9637P7252L5154O114M5713O8603
20497E292543L7399O8493Q0814N8419Q8599Q8655P7485J6530J0221L3915J9106
20486E872179L3330P5031R2390O7076N4146N6437O8142J01318J43299J00929O7021
$$ plain form
20475 6731298 6809794 6881140 6894911 6970964 7027268 7058879 7126148 7188807 7239294 7370814 7438682
20464 7438682 7559269 7684665 7746321 7811517 7975901 8078562 8148346 8245125 8332125 8449263
20454 8449263 8569333 8663388 8720198 8830276 8965728 9089708 9155533 9301062 9423380 9490471
20444 9490471 9568505 9664014 9784274 9977356 10147938 10302363 10449038 10621135 10752753 10844434
20434 10844434 10960372 11142818 11325493 11491400 11650508 11750329 11911956 12077308 12244528
20425 12244528 12423987 12616708 12804608 12947415 13126324 13300442 13487663 13739323 13961327
20416 13961327 14124799 14351619 14555456 14794934 15000478 15242268 15503340 15744110 15929370
20407 15929370 16139270 16402007 16635695 16890308 17210416 17490374 17771688 18090482 18406291
$$ packed form
20475F731298P8496P1346J3771P6053N6304L1611O7269O2659N0487J31520O7868
20464G438682J20587J25396O1656O5196J64384J02661O9784R6779Q7000J17138
20454H449263J20070R4055N6810J10078J35452J23980O5825J45529J22318O7091
20444I490471P8034R5509J20260J93082J70582J54425J46675J72097J31618R1681
20434A0844434J15938J82446J82675J65907J59108R9821J61627J65352J67220
20425A2244528J79459J92721J87900J42807J78909J74118J87221K51660K22004
20416A3961327J63472K26820K03837K39478K05544K41790K61072K40770J85260
20407A5929370K09900K62737K33688K54613L20108K79958K81314L18794L15809
$$ plain form
20398 18406291 18687236 18999189 19352396 19646009 19935514 20313079 20653394 20970217 21251871
20389 21251871 21640431 22086495 22445714 22881738 23323953 23742326 24228586 24607718 24997283
20380 24997283 25487466 26014921 26490066 26897861 27359618 27847077 28365525 28822460 29330917
20371 29330917 29883410 30431197 31068257 31693831 32325649 32962705 33604560 34281766 34924983
20362 34924983 35554366 36224453 36942128 37709613 38367579 39074294 39826376 40626103 41437688
20353 41437688 42251255 43078489 43913115 44790066 45639283 46506567 47388816 48314661 49249608
20344 49249608 50178637 51138590 52105902 53158780 54167620 55117816 56176324 57279731 58408279
20335 58408279 59528343 60631463 61726705 62825605 63920861 65021093 66100860 67281677
$$ packed form
20398A8406291K80945L11953L53207K93613K89505L77565L40315L16823K81654
20389B1251871L88560M46064L59219M36024M42215M18373M86260L79132L89565
20380B4997283M90183N27455M75145M07795M61757M87459N18448M56935N08457
20371B9330917N52493N47787O37060O25574O31818O37056O41855O77206O43217
20362C4924983O29383O70087P17675P67485O57966P06715P52082P99727Q11585
20353D1437688Q13567Q27234Q34626Q76951Q49217Q67284Q82249R25845R34947
20344D9249608R29029R59953R67312J052878J008840R50196J058508J103407J128548
20335E8408279J120064J103120J095242J098900J095256J100232J079767J180817
$$ plain form
20327 67281677 68516025 69682787 70840548 71986538 73173076 74346864 75489137 76652120
20319 76652120 77760140 78858834 80020524 81071837 82092181 83155668 84159396 85135812
20311 85135812 86132389 87062758 87946809 88784705 89593564 90380557 91135451 91824863 92476125
20302 92476125 93119777 93650950 94166246 94603252 95009975 95348347 95578068 95766615 95985350
20293 95985350 96098117 96097771 96056495 95951900 95805838 95550010 95227037 94896426 94499648 94053976
20283 94053976 93565507 93031970 92386600 91750231 91060000 90294033 89498691 88676247 87737805
20274 87737805 86835900 85892832 84878928 83909745 82896088 81883821 80864800 79790396
20266 79790396 78718078 77619256 76451901 75298047 74177715 73049341 71908486 70787625
$$ packed form
20327F7281677J234348J166762J157761J145990J186538J173788J142273J162983
20319G6652120J108020J098694J161690J051313J020344J063487J003728R76416
20311H5135812R96577R30369Q84051Q37896Q08859P86993P54894O89412O51262
20302I2476125O43652N31173N15296M37006M06723L38372K29721J88547K18735
20293I5985350J12767l46m1276j04595j46062k55828l22973l30611l96778m45672
20283I4053976m88469n33537o45370o36369o90231p65967p95342q22444r38442
20274H7737805r01905r43068j013904r69183j013657j012267j019021j074404
20266G9790396j072318j098822j167355j153854j120332j128374j140855j120861
$$ plain form
20258 70787625 69668210 68538563 67385357 66234340 65117652 63995214 62874594 61794615
20250 61794615 60763528 59697727 58611666 57498667 56463994 55469647 54437169 53478868
20242 53478868 52465682 51511667 50572608 49593085 48599502 47718787 46836674 45930444 45067484
20233 45067484 44218949 43411594 42603326 41824613 41067851 40302820 39528367 38767792 38008752
20224 38008752 37254616 36565293 35952418 35258248 34581168 33948398 33328278 32775937 32182341
20215 32182341 31572833 31034630 30509290 29916216 29365947 28865730 28390087 27880634 27372205
20206 27372205 26905362 26420589 25941353 25482157 25007571 24597986 24202264 23806895 23456157
20197 23456157 23069226 22668411 22279789 21937290 21550625 21162783 20785849 20406955 20066595
$$ packed form
20258G0787625j119415j129647j153206j151017j116688j122438j120620j079979
20250F1794615j031087j065801j086061j112999j034673r94347j032478r58301
20242E3478868j013186r54015r39059r79523r93583q80715q82113r06230q62960
20233D5067484q48535q07355q08268p78713p56762p65031p74453p60575p59040
20224C8008752p54136o89323o12875o94170o77080o32770o20120n52341n93596
20215C2182341o09508n38203n25340n93074n50269n00217m75643n09453n08429
20206B7372205m66843m84773m79236m59196m74586m09585l95722l95369l50738
20197B3456157l86931m00815l88622l42499l86665l87842l76934l78894l40360
$$ plain form
20188 20066595 19784184 19577019 19310794 18952209 18586364 18294191 18051317 17802284 17525566
20179 17525566 17220438 16868274 16583599 16351244 16095707 15877168 15718497 15431844 15167771
20170 15167771 14956550 14762832 14564484 14371006 14152574 13927825 13688483 13493837 13321996
20161 13321996 13179109 12999678 12853719 12687216 12505041 12305924 12111056 11928652 11766527
20152 11766527 11631727 11497574 11379191 11211078 11036462 10880064 10653387 10525066 10433695
20143 10433695 10329045 10212688 10136203 10032835 9908270 9728893 9600346 9499818 9409212 9349725
20133 9349725 9222984 9032059 8878730 8795360 8710032 8584446 8466045 8387302 8307574 8243440
20123 8243440 8195900 8119468 7981987 7877655 7820531 7726686 7698662 7616698 7499646 7420138 7299651
$$ packed form
20188B0066595k82411k07165k66225l58585l65845k92173k42874k49033k76718
20179A7525566l05128l52164k84675k32355k55537k18539j58671k86653k64073
20170A5167771k11221j93718j98348j93478k18432k24749k39342j94646j71841
20161A3321996j42887j79431j45959j66503j82175j99117j94868j82404j62125
20152A1766527j34800j34153j18383j68113j74616j56398k26677j28321r1371
20143A0433695j04650j16357p6485j03368j24565j79377j28547j00528r0606n9487
20133I349725j26741j90925j53329q3370q5328j25586j18401p8743p9728o4134
20123H243440m7540p6432j37481j04332n7124r3845k8024q1964j17052p9508j20487
$$ plain form
20112 7299651 7193107 7114531 7038158 6983077 6872073 6787671 6740428 6718397 6673181 6604157 6500987
20101 6500987 6421365 6302355 6220313 6219915 6257446 6171274 6089852 5983160 5918603 5879198 5814052
20090 5814052 5753865 5685382 5643048 5576595 5528180 5542046 5522259 5424080 5326021 5254717 5194877
20079 5194877 5113906 5002067 4959445 4993434 5031573 5019634 4960335 4861334 4798483 4796497 4745250
20068 4745250 4750058 4746517 4679544 4601439 4556833 4563439 4523040 4510836 4481793 4382125 4279494 4262419
20056 4262419 4263009 4281056 4256620 4239484 4201206 4169660 4092673 4051156 4048164 4005441 3920256 3875518
20044 3875518 3788811 3768013 3772242 3713562 3712513 3619455 3561898 3559885 3563416 3588148 3536617 3513878
20032 3513878 3524041 3494847 3420166 3405653 3393450 3344844 3272942 3181981 3174830 3192600 3189421 3166274
$$ packed form
20112G299651j06544p8576p6373n5081j11004q4402m7243k2031m5216o9024j03170
20101F500987p9622j19010q2042l98L7531q6172q1422j06692o4557l9405o5146
20090E814052o0187o8483m2334o6453m8415J3866j9787r8179r8059p1304n9840
20079E194877q0971j11839m2622L3989L8139j1939n9299r9001o2851j986n1247
20068D745250M808l541o6973p8105m4606O606m0399j2204k9043r9668j02631j7075
20056D262419N90J8047k4436j7136l8278l1546p6987m1517k992m2723q5185m4738
20044C875518q6707k0798M229n8680j049r3058n7557k013L531K4732n1531k2739
20032C513878J0163k9194p4681j4513j2203m8606p1902r0961p151J7770l179k3147
$$ plain form
20020 3166274 3163661 3167378 3124023 3029677 2981229 3015118 2994846 2977692 2931078 2868976 2854002 2883606
20008 2883606 2908753 2924441 2916267 2914996 2879847 2831454 2798256 2764210 2753950 2740225 2691508 2646338
19996 2646338 2629338 2643869 2655693 2613026 2564208 2510146 2543656 2526248 2507127 2482784 2481162
19985 2481162 2442937 2429536 2420986 2409199 2372309 2363656 2315320 2295012 2280548 2238146 2198772 2162171
19973 2162171 2145078 2163212 2178786 2182224 2162253 2173751 2129240 2105955 2127947 2130318 2107425 2105409
19961 2105409 2107780 2083315 2070827 2056017 2005454 2068567 2107773 2060887 2040833 1993699 1961388
19950 1961388 1955856 1945821 1936757 1895558 1858465 1832255 1888519 1932932 1922436 1894707 1822681 1780872
19938 1780872 1809389 1822388 1851592 1828284 1745943 1682668 1678971 1632825 1641193 1694610 1676921 1694162
$$ packed form
20020C166274k613L717m3355r4346m8448L3889k0272j7154m6614o2102j4974K9604
20008B883606K5147J5688q174j271l5149m8393l3198l4046j0260j3725m8717m5170
19996B646338j7000J4531J1824m2667m8818n4062L3510j7408j9121k4343j622
19985B481162l8225j3401q550j1787l6890q653m8336k0308j4464m2402l9374l6601
19973B162171j7093J8134J5574L438j9971J1498m4511k3285K1992K371k2893k016
19961B105409K371k4465j2488j4810n0563O3113L9206m6886k0054m7134l2311
19950A961388n532j0035r064m1199l7093k6210N6264M4413j0496k7729p2026m1809
19938A780872K8517J2999K9204k3308q2341o3275l697m6146Q368N3417j7689J7241
$$ plain form
19926 1694162 1685737 1666605 1635418 1605632 1633951 1617642 1612160 1607444 1579094 1595181 1636244 1608402
19914 1608402 1606246 1534489 1547721 1516585 1535784 1580399 1592636 1524762 1517384 1500623 1531721 1539482
19902 1539482 1499926 1474221 1419979 1369737 1399503 1435937 1452980 1440770 1387995 1395034 1425174
19891 1425174 1426561 1386622 1369488 1339989 1357476 1432145 1443581 1362969 1275429 1255623 1244610
19880 1244610 1293304 1288073 1275422 1300907 1297576 1294931 1246594 1240229 1240540 1188560 1175009 1163881
19868 1163881 1148253 1154932 1193330 1204396 1198765 1219291 1249432 1247177 1201300 1189963 1189706 1167631
19856 1167631 1197312 1170134 1139295 1143389 1120143 1093831 1109057 1140211 1145677 1155747 1194012 1089003
19844 1089003 1012221 1055796 1087452 1041109 1052733 1148101 1111627 1063439 1054253 1069908 1091841
$$ packed form
19926A694162q425j9132l1187k9786K8319j6309n482m716k8350J6087M1063k7842
19914A608402k156p1757J3232l1136J9199M4615J2237o7874p378j6761L1098P761
19902A539482l9556k5705n4242n0242K9766L6434J7043j2210n2775P039L0140
19891A425174J387l9939j7134k9499J7487P4669J1436q0612q7540j9806j1013
19880A244610M8694n231j2651K5485l331k645m8337o365L11n1980j3551j1128
19868A163881j5628O679L8398J1066n631K0526L0141k255m5877j1337k57k2075
19856A167631K9681k7178l0839M094k3246k6312J5226L1154N466J0070L8265j05009
19844A089003p6782M3575L1656m6343J1624R5368l6474m8188r186J5655K1933
$$ plain form
19833 1091841 1066159 1008316 942580 967420 1011472 1027977 1028863 987167 949342 943894 930091 934567
19821 934567 924776 930073 937649 938492 920079 948853 926764 947223 975975 918365 867418 854910
19809 854910 870614 901378 925312 940400 951964 915653 877755 838243 860429 856552 820695 820253
19797 820253 796348 804254 817379 844407 898864 877999 808418 780593 797916 803251 760050 743240
19785 743240 702710 647612 679258 684921 674938 687997 672034 665652 697986 728861 772277 796768
19773 796768 769502 723773 663726 670885 638842 589984 605959 617071 621329 639901 622559 618859
19761 618859 702876 703508 694558 732308 751194 737854 714601 723043 707731 751526 711428 657670
19749 657670 692217 690698 621842 597692 627442 655145 678328 682334 588857 578654 569237 562854
$$ packed form
19833A091841k5682n7843o5736K4840M4052J6505Q86m1696l7825n448j3803M476
19821I34567r791N297P576Q43j8413K8774k2089K0459K8752n7610n0947j2508
19809H54910J5704L0764K3934J5088J1564l6311l7898l9512K2186l877l5857m42
19797H20253k3905P906J3125K7028N4457k0865o9581k7825J7323N335m3201j6810
19785G43240m0530n5098L1646N663r983J3059j5963o382L2334L0875M3416K4491
19773G96768k7266m5729o0047P159l2043m8858J5975J1112M258J8572j7342l700
19761F18859Q4017O32q950L7750J8886j3340k3253Q442j5312M3795m0098n3758
19749F57670L4547j519o8856k4150K9750K7703K3183M006r3477j0203r417o383
$$ plain form
19737 562854 579452 622905 630037 571344 527001 522352 565033 597191 598299 540111 542324 562333
19725 562333 563442 605534 552741 541058 546088 534761 516929 569338 555958 538385 533367 535245
19713 535245 520920 508485 538997 548546 570709 546818 527948 494716 492553 525953 539526 545485
19701 545485 559813 539186 480809 486059 480565 492531 504911 500375 503719 531359 540866 492277
19689 492277 476145 522875 580996 590097 570971 524005 463194 484294 496694 490451 459369 463162
19677 463162 494144 477739 470567 450561 447198 459988 474212 512995 446802 424658 437466 471319
19665 471319 506463 580036 556432 556444 563282 572272 511320 491248 501626 526235 486292 442133
19653 442133 410240 427148 466833 410187 418779 435687 440742 464420 418256 445501 427057 430766
$$ packed form
19737E62854J6598M3453P132n8693m4343m649M2681L2158J108n8188K213K0009
19725E62333J109M2092n2793j1683N030j1327j7832N2409j3380j7573n018J878
19713E35245j4325j2435L0512R549K2163k3891j8870l3232k163L3400J3573N959
19701E45485J4328k0627n8377N250n494J1966J2380m536L344K7640R507m8589
19689D92277j6132M6730N8121R101j9126m6966o0811K1100J2400o243l1082L793
19677D63162L0982j6405p172k0006l363J2790J4224L8783o6193k2144J2808L3853
19665D71319L5144P3573k3604J2O838Q990o0952k0072J0378K4609l9943m4159
19653D42133l1893J6908L9685n6646Q592J6908N055K3678m6164K7245j8444L709
$$ plain form
19641 430766 414593 409401 469831 460237 422633 375832 370048 377773 400377 447061 470032 462505
19629 462505 481359 511325 467849 344343 352743 402510 375972 338474 372912 326587 281077
19618 281077 305060 361143 360219 368601 364770 305210 293425 333864 366856 407804 410036 382044
19606 382044 369384 362572 355440 340972 309956 310865 274554 252778 254555 268029 247823 298085
19594 298085 330302 305494 327976 331376 365330 351219 297427 233714 260825 314578 378598 389409
19582 389409 326691 287990 315593 328045 313050 293388 282532 304330 285344 318314 396734
19571 396734 355618 347103 394245 338975 316435 352931 343336 323498 293395 282606 306598 294266
19559 294266 318027 379223 385903 329851 252215 272924 274758 308104 267613 252045 216320 201734
$$ packed form
19641D30766j6173n192O0430r594l7604m6801n784P725K2604M6684K2971p527
19629D62505J8854K9966m3476j23506Q400M9767k6538l7498L4438m6325m5510
19618B81077K3983N6083r24Q382l831n9560j1785M0439L2992M0948K232k7992
19606C82044j2660o812p132j4468l1016R09l6311k1776J777J3474k0206N0262
19594B98085L2217k4808K2482L400L3954j4111n3792o3713K7111N3753O4020J0811
19582C89409o2718l8701K7603J2452j4995j9662j0856K1798j8986L2970P8420
19571C96734m1116q515M7142n5270k2540L6496r595j9838l0103j0789K3992j2332
19559B94266K3761O1196O680n6052p7636K0709J834L3346m0491j5568l5725j4586
$$ plain form
19547 201734 201992 234529 243949 282033 292308 326569 320057 278676 251887 289125 289971 255081 202095
19534 202095 168608 163005 218180 269033 224548 261057 293553 250573 208918 225759 263706 258185
19522 258185 252487 248289 210767 203919 223021 299465 309829 295396 300020 224111 203725 196156
19510 196156 196947 190266 225886 285939 259123 240427 210243 244094 258671 228631 189550 162503
19498 162503 182445 227162 192552 156373 167663 182075 174425 203402 242217 233385 201498 247458
19486 247458 222024 256646 281919 285000 222717 182293 203602 144717 153114 137822 120460 181411
19474 181411 245806 247462 227920 193227 171149 126594 145002 140642 155520 148674 127214 144323
19462 144323 169247 161917 158145 176584 183892 164703 142521 199281 192456 171539 204989 207387
$$ packed form
19547B01734K58L2537R420L8084J0275L4261o512m1381k6789L7238Q46l4890n2986
19534B02095l3487n603N5175N0853m4485L6509L2496m2980m1655J6841L7947n521
19522B58185n698m198l7522o848J9102P6444J0364j4433M624p5909k0386p569
19510A96156P91o681L5620O0053k6816j8696l0184L3851J4577l0040l9081k7047
19498A62503J9942M4717l4610l6179J1290J4412p650K8977L8815q832l1887M5960
19486B47458k5434L4622K5273L081o2283m0424K1309n8885Q397j5292j7362O0951
19474A81411O4395J656j9542l4693k2078m4555J8408m360J4878o846k1460J7109
19462A44323K4924p330l772J8439P308j9189k2182N6760o825k0917L3450K398
$$ plain form
19450 207387 180173 181212 144342 117652 145213 208605 245065 215090 184283 189231 178147 196383
19438 196383 203508 163095 112606 158908 148746 122234 95802 134661 151633 80625 85886 102616
19426 102616 142918 159518 150988 121853 107132 90154 141912 160906 161712 136393 137668 164025
19414 164025 150728 129424 161185 193325 216233 184368 159432 124226 112775 173768 163496
19403 163496 139896 141505 115811 124395 122075 82230 45249 38079 80177 82369 79450 97516 104339
19390 104339 106927 120903 170941 204927 175122 60447 50220 55384 123635 154109 144127 151138
19378 151138 134587 100019 71743 41865 50133 91645 106146 166956 163642 45333 34723 103364
19366 103364 139049 131474 160776 177808 93960 17209 10951 74213 76772 77756 103585 98072 136812
$$ packed form
19450B07387k7214J039l6870k6690K7561O3392L6460k9975l0807M948j1084J8236
19438A96383P125m0413n0489M6302j0162k6512k6432L8859J6972p1008N261J6730
19426A02616M0302J6600q530k9135j4721j6978N1758J8994Q06k5319J275K6357
19414A64025j3297k1304L1761L2140K2908l1865k4936l5206j1451O0993j0272
19403A63496k3600J609k5694Q584k320l9845l6981p170M2098K192k919J8066O823
19390A04339K588J3976N0038L3986k9805j14675j0227N164O8251L0474r982P011
19378A51138j6551l4568k8276k9878Q268M1512J4501O0810l314j18309j0610O8641
19366A03364L5685p575K9302J7032q3848p6751o258O3262K559R84K5829n513L8740
$$ plain form
19353 136812 99017 61426 61368 68130 43702 43751 90526 131946 121706 105436 111648 110434 109803 127026
19339 127026 181209 128252 110867 42886 21465 13623 -11472 12062 9108 -13784 13379 57146
19327 57146 98824 90376 81595 84891 56244 78634 100325 115061 96435 53025 53393 47421 17450
19314 17450 51540 93332 114668 72114 44938 30696 13000 56779 37149 24718 32302 55148
19302 55148 60101 37096 64520 71506 34076 -5455 18258 -2226 13539 119903 132612 138323
19290 138323 71000 81726 59319 83670 106205 150179 152182 71315 -16521 -6632 27269 100431
19278 100431 95436 73417 85934 106526 71890 23277 44609 70795 68562 81471 90012 64251
19266 64251 -14704 75384 137437 88854 74027 98542 91278 44675 34503 29197 56627 127907
$$ packed form
19353A36812l7795l7591n8O762k4428M9M6775M1420j0240j6270O212j214o31J7223
19339A27026N4183n2957j7385o7981k1421p842k5095K3534k954k2892K7163M3767
19327E7146M1678q448q781L296k8647K2390K1691J4736j8626m3410L68n972k9971
19314A7450L4090M1792K1336m2554k7176j4242j7696M3779j9630j2431P584K2846
19302E5148M953k3005K7424O986l7430l9531K3713k0484J5765J06364J2709N711
19290A38323o7323J0726k2407K4351K2535M3974K003q0867q7836R889L3901P3162
19278A00431m995k2019J2517K0592l4636m8613K1332K6186k233J2909Q541k5761
19266F4251p8955R0088O2053m8583j4827K4515p264m6603j0172n306K7430P1280
$$ plain form
19254 127907 153289 84588 9371 11087 26002 -3171 -16893 -6928 15674 23462 67831 97245
19242 97245 61591 -3962 -31654 -27500 -8135 43827 57728 -6873 -38489 -31987 39300 74221
19230 74221 30200 14948 17622 47754 98841 64555 72304 115288 114657 85407 129569 138892 111010
19217 111010 59209 81999 98233 128466 159578 176618 168030 113661 65635 57419 77587 102259
19205 102259 78148 -7342 7568 23019 13085 75194 89958 87065 55768 20892 -3273 20074
19193 20074 8510 -10122 -52187 -24580 41997 33432 6015 17455 -8735 -23632 13283 68339
19181 68339 59393 -29174 1253 29572 -4549 7009 36524 86842 82558 67029 74080 108485
19169 108485 105586 113776 88142 32946 59902 61067 45024 -7231 -33576 2239 -11826 -14221
$$ packed form
19254A27907K5382o8701p5217J716J4915k9173j3722R965K2602P788M4369K9414
19242I7245l5654o5553k7692M154J9365N1962J3901o4601l1616O502P1287L4921
19230G4221m4021j5252K674L0132N1087l4286P749M2984o31k9250M4162R323k7882
19217A11010n1801K2790J6234L0233L1112J7040q588n4369m8026q216K0168K4672
19205A02259k4111q5490J4910J5451r934O2109J4764k893l1297l4876k4165K3347
19193B0074j1564j8632m2065K7607O6577q565k7417J1440k6190j4897L6915N5056
19181F8339q946q8567L0427K8319l4121J1558K9515N0318m284j5529P051L4405
19169A08485k899Q190k5634n5196K6956J165j6043n2255k6345L5815j4065k395
$$ plain form
19157 -14221 -4480 -45840 -38591 4634 8207 42706 46823 40360 50733 57607 44562 304 57210
19144 57210 89554 19354 -78354 -78704 -26377 -64448 -81357 -63195 -31384 30621 -23692 -34499
19132 -34499 -78248 -81608 -13962 -3285 -54671 -86369 -56291 -58124 -67522 -86072 -48396 -17404
19120 -17404 50678 53507 -34941 -74001 -79391 -86966 -87092 -101613 -121382 -99803 10486 40086
19108 40086 48963 43074 7957 -38991 -28911 -10723 -17314 -15426 -31596 -50981 -102801 -142477
19096 -142477 -114137 -45768 -23029 -4286 -44918 -70046 -61107 13364 -3531 -48246 -1821 12182
19084 12182 -20428 -87016 -123332 -81766 -23834 -48627 -77638 -95367 -116786 -7294 11892
19073 11892 23854 23337 2428 -21020 -36334 -38943 13633 74898 52686 17619 -21732 11011
$$ packed form
19157a4221R741m1360P249M3225L573L4499M117o463J0373O874j3045m4258N6906
19144E7210L2344p0200r7708l50N2327l8071j6909J8162L1811O2005n4313j0807
19132c4499m3749l360O7646J0677n1386l1698L0078j833r398j8550L7676L0992
19120a7404O8082K829q8448l9060n390p575j26j4521j9769K1579J10289K9600
19108D0086Q877n889l5117m6948J0080J8188o591J888j6170j9385n1820l9676
19096a42477K8340O8369K2739J8743m0632k5128Q939P4471j6895m4715M6425J4003
19084A2182l2610o6588l6316M1566N7932k4793k9011j7729k1419J09492J9186
19073A1892J1962n17k0909k3448j5314k609N2576O1265k2212l5067l9351L2743
$$ plain form
19061 11011 66503 56572 54927 28112 31491 4615 4945 10669 -17702 -67757 -66312 -35770 -16713
19048 -16713 -6655 -10888 9228 33163 39810 19378 26194 21985 32508 38445 28578 21822 8472
19035 8472 24615 20664 4497 4949 -46152 -65177 -78448 -47526 12487 22593 54066 81430
19023 81430 66493 17022 -20302 -43137 942 39608 13730 -19430 -42181 -53351 -53640 -10848
19011 -10848 2737 -13631 -22336 29362 50321 41938 38483 41498 -4507 -24261 -34888 15007
18999 15007 60983 -11858 -55267 -60807 -76021 -87689 -82082 -72091 -51662 11223 22641 -18086
18987 -18086 13562 -22152 -117780 -100029 -45902 -9629 -42061 -67762 -60979 -33818 -44665 -56893
18975 -56893 -8471 3182 -7134 -17047 -22106 -26268 -7056 11714 8381 -1721 2688 -4446 -11920
$$ packed form
19061A1011N5492r931j645k6815L379k6876L30N724k8371n0055J445L0542J9057
19048a6713J0058m233K0116K3935O647k0432O816m209J0523N937r867o756j3350
19035H472J6143l951j6167M52n1101j9025j3271L0922O0013J0106L1473K7364
19023H1430j4937m9471l7324k2835M4079L8666k5878l3160k2751j1170k89M2792
19011a0848J3585j6368q705N1698K0959q383l455L015m6005j9754j0627M9895
18999A5007M5976p2841m3409n540j5214j1668N607R991K0429O2885J1418m0727
18987a8086L1648l5714r5628J7751N4127L6273l2432k5701O783K7161j0847j2228
18975e6893M8422J1653j0316r913n059m162J9212J8770l333j0102M409p134p474
$$ plain form
18962 -11920 18993 -6737 -59124 -54550 -45379 -79303 -70725 -57611 -40914 -44341 -58037 -54170 -28170
18949 -28170 -26803 -46162 -13575 81150 123850 141480 104304 74724 85146 50989 -13144 5374
18937 5374 7882 1366 31336 62977 92142 85401 50911 26334 21474 46987 71808 153518 260407
18924 260407 371977 477006 551432 564749 600210 593604 490077 369026 359871 401856 425796
18913 425796 479038 487077 436994 422610 432039 366718 307042 354843 417908 493760 560484 547529
18901 547529 504226 454643 352115 325834 357342 282523 259877 276650 305857 304145 305899 245339
18889 245339 188044 187798 193301 216716 235774 189971 144811 184436 217637 254264 332880 423693
18877 423693 554195 630209 705851 785233 900541 1057160 1159158 1217252 1287188 1233828 1118880
$$ packed form
18962a1920L0913k5730n2387M574R171l3924Q578J3114J6697l427j3696L867K6000
18949b8170J367j9359L2587R4725M2700J7630l7176k9580J0422l4157o4133J8518
18937E374K508o516K9970L1641K9165o741l4490k4577m860K5513K4821Q1710J06889
18924B60407J11570J05029P4426J3317L5461o606j03527j21051r155M1985K3940
18913D25796N3242Q039n0083j4384R429o5321n9676M7801O3065P5852O6724j2955
18901E47529m3303m9583j02528k6281L1508p4819k2646J6773K9207j712J754o0560
18889B45339n7295k46N503K3415J9058m5803m5160L9625L3201L6627P8616R0813
18877D23693J30502P6014P5642P9382J15308J56619J01998N8094O9936n3360j14948
$$ plain form
18866 1118880 1047791 991714 918940 863935 786742 782248 811062 881457 1025627 1158330 1189402
18855 1189402 1089659 1038620 941522 770835 715551 708654 745456 816808 908864 890987 733777
18844 733777 561950 462153 429261 444803 406563 370056 333137 313708 226897 129083 147520
18833 147520 194014 181966 215136 220373 236115 324134 406093 457350 496673 604658 722461
18822 722461 787032 787034 753845 651158 562731 505179 473695 476098 495233 594510 674961 727653
18810 727653 718010 705618 668837 598097 517459 416741 393318 416669 465386 534243 578881
18799 578881 530079 483721 454646 396833 347259 340668 265276 262330 299046 293481 265084 197726
18787 197726 133750 52275 58682 45731 89789 153287 243223 260945 254591 256642 232623 265811
$$ packed form
18866A118880p1089n6077p2774n5005p7193m494K8814P0395J44170J32703L1072
18855A189402r9743n1039r7098j70687n5284o897L6802P1352R2056j7877j57210
18844G33777j71827r9797l2892J5542l8240l6507l6919j9429q6811r7814J8437
18833A47520M6494j2048L3170N237J5742Q8019Q1959N1257L9323J07985J17803
18822G22461O4571Kl3189j02687q8427n7552l1484K403J9135R9277Q0451N2692
18810G27653r643j2392l6781p0740q0638j00718k3423K3351M8717O8857M4638
18799E78881m8802m6358k9075n7813m9574o591p5392k946L6716n565k8397o7358
18787A97726o3976q1475O407j2951M4058O3498Q9936J7722o354K051k4019L3188
$$ plain form
18775 265811 284774 351050 424359 485319 437861 429139 399126 434894 389458 340931 354030 408355
18763 408355 500494 507056 486654 524480 498933 426372 395518 353764 280830 248718 214659 166103
18751 166103 106032 42845 561 37426 49889 3073 -44259 -75120 -48259 35576 81502
18740 81502 89714 92152 80746 77956 14366 19198 69906 89293 101095 171965 201023 262111
18728 262111 364083 499541 619736 723509 784760 838414 853912 896652 925731 887126 927606
18717 927606 951702 1016241 1071437 1092281 1045209 991076 979381 920090 860264 766310 644001
18706 644001 593382 509195 419078 347502 331040 267616 214954 190522 188649 177592 124614 66814
18694 66814 46679 25685 77253 61500 53969 74778 32845 32970 38456 31143 47961 91237 159381
$$ packed form
18775B65811J8963O6276P3309O0960m7458q722l0013L5768m5436m8527J3099N4325
18763D08355R2139O562k0402L7826k5547p2561l0854m1754p2934l2112l4059m8556
18751A66103o0071o3187m2284L6865J2463m6816m7332l0861K6861Q3835M5926
18740H1502Q212K438j1406k790o3590M832N0708J9387J1802P0870K9058O1088
18728B62111J01972J35458J20195J03773O1251N3654J5498M2740K9079l8605M0480
18717I27606K4096O4539N5196K0844m7072n4133j1695n9291n9826r3954j22309
18706F44001n0619q4187r0117p1576j6462o3424n2662k4432j873j1057n2978n7800
18694F6814k0135k0994N1568j5753p531K0809m1933J25N486p313J6818M3276O8144
$$ plain form
18681 159381 198562 228569 253456 313750 344732 409969 484470 525384 602854 694739 773765
18670 773765 826413 853629 945220 949752 900968 861346 810509 780336 727915 719140 699993 639972
18658 639972 572908 555631 536373 491382 492616 442215 335876 279234 252479 266922 302255
18647 302255 257682 214562 148244 153344 196291 234197 224817 182669 166073 167669 181929 106756
18635 106756 93941 170566 193823 200714 172801 160361 171310 177676 192982 216549 340880 439547
18623 439547 519181 525403 564909 665329 730949 770296 826592 828131 828931 835429 828431 857301
18611 857301 893074 943924 1009657 1049874 1040403 1064226 1150239 1220952 1231527 1290794 1369590 1432036
18599 1432036 1472331 1540386 1544482 1495153 1479893 1458971 1358431 1223140 1173797 1070314 1024719
$$ packed form
18681A59381L9181L0007K4887O0294L0982O5237P4501M0914P7470R1885P9026
18670G73765N2648K7216R1591M532m8784l9622n0837l0173n2421q775j9147o0021
18658F39972o7064j7277j9258m4991J234n0401j06339n6642k6755J4443L5333
18647C02255m4573m3120o6318N100M2947L7906r380m2148j6596J596J4260p5173
18635A06756j2815P6625K3257O891k7913j2440J0949O366J5306K3567J24331R8667
18623D39547P9634O222L9506J00420O5620L9347N6296J539Q00O498o998K8870
18611H57301L5773N0850O5733M0217r471K3823Q6013P0713J0575N9267P8796O2446
18599A432036M0295O8055M096m9329j5260k0922j00540j35291m9343j03483m5595
$$ plain form
18588 1024719 1082507 1061477 987154 943840 920101 913564 819069 711973 608424 520289 423418
18577 423418 403912 445990 388869 389198 454605 502932 543317 611149 701764 778647 780902 744709
18565 744709 655951 566638 525331 532886 557359 618565 667528 699246 785856 874774 900653 909112
18553 909112 875325 823834 809227 799147 791296 799753 821159 817789 786385 844316 841092 839115
18541 839115 792460 836967 789453 718097 723480 658475 637529 705988 754373 755523 772077 794567
18529 794567 816410 830277 828763 870834 890910 894208 958741 1037856 1054794 1017917 1068018 1071940
18517 1071940 1030201 949216 944799 980475 996052 989077 937104 889945 885184 975491 1045723 1002337
18505 1002337 972982 969030 936752 858646 780660 712013 661688 656595 670707 709718 694636 652804
$$ packed form
18588A024719N7788k1030p4323m3314k3739o537r4495j07096j03549q8135r6871
18577D23418j9506M2078n7121L29O5407M8327M0385O7832R0615P6883K255l6193
18565G44709q8758q9313m1307P555K4473O1206M8963L1718Q6610Q8918K5879Q459
18553I09112l3787n1491j4607j0080p851Q457K1406l370l1404N7931l224j977
18541H39115m6655M4507m7514p1356N383o5005k0946O8459M8385J150J6554K2490
18529G94567K1843J3867j514M2071K0076L298O4533P9115J6938l6877N0101L922
18517A071940m1739q0985m417L5676J5577o975n1973m7159m761R0307P0232m3386
18505A002337k9355l952l2278p8106p7986o8647n0325n093J4112L9011j5082m1832
$$ plain form
18493 652804 671968 656998 599119 609194 618610 616824 658877 683917 771672 862657 858967 829834
18481 829834 824413 891240 1030936 1123559 1237674 1304059 1376317 1361362 1338688 1337606 1321404
18470 1321404 1266568 1171188 1121858 1158745 1160823 1148218 1136293 1158821 1218833 1365009 1453317
18459 1453317 1498968 1561471 1604454 1682444 1709966 1725968 1727222 1864378 2006649 2131159 2330984
18448 2330984 2586335 2847426 3107313 3347280 3647896 3847485 3898123 3842878 3746924 3697049
18438 3697049 3803701 4085676 4492864 4898322 5288047 5542423 5823497 6087562 6400653
18429 6400653 6843761 7381946 8160726 9250454 10786242 13021227 16049455 20407739 26873378
18420 26873378 36504620 49957518 66533164 82645360 93597898 97266703 94310790
$$ packed form
18493F52804J9164j4970n7879J0075R416j786M2053K5040Q7755R0985l690k9133
18481H29834n421O6827J39696R2623J14115O6385P2258j4955k2674j082j6202
18470A321404n4836r5380m9330L6887K078j2605j1925K2528O0012J46176Q8308
18459A453317M5651O2503M2983P7990K7522J6002J254J37156J42271J24510J99825
18448B330984K55351K61091K59887K39967L00616J99589N0638n5245r5954m9875
18438C697049J06652K81975M07188M05458L89725K54376K81074K64065L13091
18429F400653M43108N38185P78780J089728J535788K234985L028228M358284O465639
18420B6873378R631242J3452898J6575646J6112196J0952538L668805k955913
$$ plain form
18413 94310790 85966889 74228902 62524465 54109330 50926948 53871718 63832707 81363905
18405 81363905 104112009 124973455 138351263 142503322 136155424 121052913 104921986
18398 104921986 93220904 83026100 70815314 58573679 50038302 46489793 47427865
18391 47427865 52231709 59077053 63635920 61396039 53048924 43106120 35320711 30429030
18383 30429030 27624817 26201127 25746224 25995158 26907800 28572005 31226517 35363578
18375 35363578 41777399 51309681 64531996 81377581 101233207 124965316 152806697
18368 152806697 181829818 208008326 228113277 239008299 239596596 232024602 217682128
18361 217682128 199631347 186396224 188039902 208146069 237892291 260565981 264299320
$$ packed form
18413I4310790q343901j1737987j1704437q415135l182382K944770R960989J7531198
18405H1363905K2748104K0861446J3377808M152059o347898j5102511j6130927
18398A04921986j1701082j0194804j2210786j2241635q535377l548509R38072
18391D7427865M803844O845344M558867k239881q347115r942804p785409m891681
18383C0429030k804213j423690m54903K48934R12642J664205K654512M137061
18375C5363578O413821R532282J3222315J6845585J9855626K3732109K7841381
18368A52806697K9023121K6178508K0104951J0895022N88297p571994j4342474
18361B17682128j8050781j3235123J643678K0106167K9746222K2673690L733339
$$ plain form
18354 264299320 252305603 237014559 228382805 229880888 235282731 236088781 230509402 220425708
18346 220425708 204183037 181952561 158074948 134449079 110792369 88874568 71729032
18339 71729032 60135503 53213399 49928768 49504269 50933812 51815700 49400889 44073533
18331 44073533 38362665 34267904 31964007 31184425 31711787 33354751 36039112 40138073
18323 40138073 46259983 55424316 69058557 88810646 115476972 147516573 179935749
18316 179935749 206481194 221938118 220116468 198618212 165939420 135519499 116280295
18309 116280295 110104611 115055608 126487936 138215969 151388288 172106085 200095024
18302 200095024 222745098 227097611 208002028 170140152 127271015 91636302 67482767
$$ packed form
18354B64299320j1993717j5291044q631754J498083N401843Q06050n579379j0083694
18346B20425708j6242671k2230476k3877613k3625869k3656710k1917801j7145536
18339G1729032j1593529o922104l284631m24499J429543Q81888k414811n327356
18331D4073533n710868m094761k303897p79582N27362J642964K684361M098961
18323D0138073O121910R164333J3634241J9752089K6666326L2039601L2419176
18316A79935749K6545445J5456924j821650k1498256l2678792l0419921j9239204
18309A16280295o175684M950997J1432328J1728033J3172319K0717797K7988939
18302B00095024K2650074M352513j9095583l7861876m2869137l5634713k4153535
$$ plain form
18295 67482767 52310965 42628046 36308036 32139998 29642766 28668350 29436517 31915718
18287 31915718 35448751 37736365 36137737 31046023 25277590 20834256 17835273 15827342
18279 15827342 14561970 13643995 12878795 12220214 11503894 10780784 10204148 9795729 9530840
18270 9530840 9268595 8878534 8349875 7741667 7255965 6827158 6478373 6231801 6067589
18261 6067589 5890819 5667161 5492794 5371189 5293894 5179493 5088262 4976801 4818436 4654472
18251 4654472 4602046 4572980 4476546 4398360 4323537 4255714 4235677 4303915 4357670 4425930 4547431
18240 4547431 4623271 4739960 4895197 5124328 5407760 5732687 6132421 6631181 7109931 7538700
18230 7538700 7958417 8396404 8883474 9498139 10261177 11117804 12067172 13322385 14955884
$$ packed form
18295F7482767j5171802r682919o320010m168038k497232r74416P68167K479201
18287C1915718L533033K287614j598628n091714n768433m443334k998983k007931
18279A5827342j265372r17975p65200o58581p16320p23110n76636m08419k64889
18270I530840k62245l90061n28659o08208m85702m28807l48785k46572j64212
18261F067589j76770k23658j74367j21605p7295j14401r1231j11461j58365j63964
18251D654472n2426k9066r6434p8186p4823o7823k0037O8238N3755O8260J21501
18240D547431P5840J16689J55237K29131K83432L24927L99734M98760M78750M28769
18230G538700M19717M37987M87070O14665P63038Q56627R49368J255213J633499
$$ plain form
18221 14955884 17133938 19954493 23697474 28677730 35160150 43197027 52543003 62530127
18213 62530127 72115029 80008515 85780850 90484039 95814203 102918846 111876072 121703191
18205 121703191 130162068 135557648 137501998 135892528 131261893 125060446 118920592 114151824
18197 114151824 111130185 108889162 105288319 98231087 87661644 75171083 62615447
18190 62615447 51340122 41984803 34573813 28845917 24574064 21424316 19137517 17438671
18182 17438671 16160260 15252588 14557830 14060612 13803466 13672861 13615664 13670734 13968914
18173 13968914 14555245 15504378 17060117 19411666 22712103 26932455 32090921 37892963
18165 37892963 43679494 48423589 51513051 53505794 55488549 58509907 63046103 68879688
$$ packed form
18221A4955884K178054K820555L742981M980256O482420Q036877R345976R987124
18213F2530127R584902P893486N772335M703189N330164P104643Q957226R827119
18205A21703191Q458877N395580J944350j609470m630635o201447o139854m768768
18197A14151824l021639k241023l600843p057232j0569443j2490561j2555636
18190F2615447j1275325r355319p410990n727896m271853l149748k286799j698846
18182A7438671j278411r07672o94758m97218k57146j30605n7197N5070K98180
18173A3968914N86331R49133J555739K351549L300437M220352N158466N802042
18165C7892963N786531M744095L089462J992743J982755L021358M536196N833585
$$ plain form
18157 68879688 75051603 80440517 84438067 86219789 84969045 81262074 76455227 72012384
18149 72012384 68816214 66685144 64464831 60608505 54655761 47309071 39622375 32591376
18141 32591376 26691168 21963052 18336939 15658238 13675907 12211295 11140650 10306382
18133 10306382 9683207 9258198 8924110 8688268 8621314 8691194 8808514 8917275 9008251 9087681
18123 9087681 9245249 9604310 10067773 10619577 11434962 12486409 13849990 15658157 18049242
18114 18049242 21379469 26018139 32336545 40734978 51461133 64466808 79204889 94098188
18106 94098188 107195627 117064682 122471803 122909389 119591385 114912288 111516792 111348143
18098 111348143 115105856 122160461 131140961 140665538 149723972 157472474 163360780 166866486
$$ packed form
18157F8879688O171915N388914L997550J781722j250744l706971m806847m442843
18149G2012384l196170k131070k220313l856326n952744p346690p686696p030999
18141C2591376n900208m728116l626113k678701j982331j464612j070645q34268
18133A0306382o23175m25009l34088k35842o6954O9880J17320J08761R0976P9430
18123I087681J57568L59061M63463N51804Q15385J051447J363581J808167K391085
18114A8049242L330227M638670O318406Q398433J0726155J3005675J4738081J4893299
18106I4098188J3097439R869055N407121M37586l318004m679097l395496j68649
18098A11348143L757713P054605Q980500R524577R058434P748502N888306L505706
$$ plain form
18090 166866486 167243123 164359195 158180680 148934496 137968613 127568000 119723293 115424984
18082 115424984 114404773 115160221 115319705 112932461 107187803 98004474 86158364 73078798
18074 73078798 60265341 48865638 39530607 32125393 26471814 22212862 18989446 16618349
18066 16618349 14760916 13255308 11981043 10912147 10068158 9358494 8768175 8222358 7637762
18057 7637762 7104603 6626042 6263764 5929081 5674538 5545196 5331207 5077352 4935991
18048 4935991 4794806 4639259 4489368 4381882 4336260 4294035 4249073 4216643 4243141 4287295
18038 4287295 4291769 4309028 4316859 4319979 4276921 4257638 4282281 4331665 4468433 4654914 4788292
18027 4788292 4858568 4989608 5131717 5309999 5620175 6082205 6597333 7255865 8198262 9509460
$$ packed form
18090A66866486L76637k883928o178515r246184j0965883j0400613p844707m298309
18082A15424984j020211P55448J59484k387244n744658r183329j1846110j3079566
18074G3078798j2813457j1399703r335031p405214n653579m258952l223416k371097
18066A6618349j857433j505608j274265j068896q43989p09664n90319n45817n84596
18057G637762n33159m78561l62278l34683k54543j29342k13989k53855j41361
18048D935991j41185j55547j49891j07486m5622m2225m4962l2430K6498M4154
18038D287295M474J7259P831L120m3058j9283K4643M9384J36768J86481J33378
18027D788292P0276J31040J42109J78282L10176M62030N15128O58532R42397J311198
$$ plain form
18017 9509460 11384362 14218818 18554029 25222460 34761885 46140594 54859998 56787908
18009 56787908 54243809 53276654 58930881 72478526 91024019 105051940 103490485 88529001
18001 88529001 71563817 61804188 60610114 65052452 68877526 64801855 53124856 39802337
17993 39802337 29718062 23228867 18976731 16103209 14132647 12805418 11909021 11243529
17985 11243529 10701451 10315356 10059826 9973270 10038748 10149950 10307999 10434545 10533555 10865420
17975 10865420 11496183 12527454 14129196 16533389 20224801 26012393 34555245 45354950
17967 45354950 54585487 58017997 57964395 60150912 68207275 81008078 95622354 112826975
17959 112826975 134123492 154342839 163467233 156092568 138630839 120732168 104776252
$$ packed form
18017I509460J874902K834456M335211O668431R539425J1378709Q719404J927910
18009E6787908k544099r67155N654227J3547645J8545493J4027921j561455j4961484
18001H8529001j6965184r759629j194074M442338L825074m075671j1676999j3322519
17993C9802337j0084275o489195m252136k873522j970562j327229q96397o65492
17985A1243529n42078l86095k55530q6556O5478J11202J58049J26546R9010L31865
17975A0865420O30763J031271J601742K404193L691412N787592Q542852J0799705
17967D5354950R230537L432510n3602K186517Q056363J2800803J4614276J7204621
17959A12826975K1296517K0219347R124394p374665j7461729j7898671j5955916
$$ plain form
17952 104776252 88000112 72009502 61183546 57331704 57742191 57000628 51048435 41255894
17944 41255894 31598430 24510409 19837229 16730917 14580847 13014515 11872967 10946336
17936 10946336 10224538 9703482 9358827 9177620 9016021 8872749 8667943 8508964 8407116
17927 8407116 8467513 8724531 9258439 10152540 11569666 13776366 17218992 22624597 30102397
17918 30102397 37649736 40848735 39080405 36325912 37116528 43472486 54691758 66325681
17910 66325681 69380126 61315561 48727593 39516417 36332666 37761016 40593383 40111714
17902 40111714 34520130 26379794 19357514 14750734 11842181 9914994 8606855 7598548
17894 7598548 6857684 6282455 5810512 5436095 5202267 5047486 4962293 4947927 4936603 4861009
$$ packed form
17952A04776252j6776140j5990610j0825956l851842M10487p41563n952193r792541
17944D1255894r657464p088021m673180l106312k150070j566332j141548r26631
17936A0946336p21798n21056l44655j81207j61599j43272k04806j58979j01848
17927H407116O0397K57018N33908Q94101J417126K206700L442626N405605P477800
17918C0102397P547339L198999j768330k754493P90616O355958J1219272J1633923
17910F6325681L054445q064565j2587968r211176l183751J428350K832367m81669
17902D0111714n591584q140336p022280m606780k908553j927187j308139j008307
17894G598548p40864n75229m71943l74417k33828j54781q5193j4366j1324p5594
$$ plain form
17884 4861009 4733236 4561443 4376427 4172990 4018627 3898107 3887187 4008855 4085203 4126792
17874 4126792 4027356 3873625 3665961 3441770 3386282 3406256 3554648 3693605 3642006 3455833
17864 3455833 3248711 3155749 3041727 2881853 2721488 2633421 2537500 2447465 2542964 2738924
17854 2738924 2885664 3022426 3145500 3250908 3399106 3492748 3495102 3465417 3512951 3582253
17844 3582253 3627145 3700264 3730992 3680517 3500876 3236701 3038050 2848162 2771183 2807241
17834 2807241 2889112 3022651 3223498 3398837 3542128 3651669 3706688 3760430 3756727 3681069
17824 3681069 3616411 3598354 3649627 3833687 4011698 4082422 4072115 3999921 3966266 4027201 4153620
17813 4153620 4249075 4315827 4305088 4296008 4242115 4298338 4533320 4820146 5062122 5315129 5717493
$$ packed form
17884D861009j27773j71793j85016k03437j54363j20520j0920J21668P6348M1589
17874D126792r9436j53731k07664k24191n5488J9974J48392J38957n1599j86173
17864C455833k07122r2962j14022j59874j60365q8067r5921r0035R5499J95960
17854B738924J46740J36762J23074J05408J48198R3642K354k9685M7534O9302
17844C582253M4892P3119L0728n0475j79641k64175j98651j89888p6979L6058
17834B807241Q1871J33539K00847J75339J43291J09541N5019N3742l703p5658
17824C681069o4658j8057N1273J84060J78011P0724j0307p2194l3655O0935J26419
17813D153620R5455O6752j0739r080n3893N6223K34982K86826K41976K53007M02364
$$ plain form
17802 5717493 6278519 6933658 7632173 8347485 9112493 9890074 10663406 11611740 12976026
17793 12976026 14973733 17945896 22485841 28964474 36711830 43682353 48115883 50384056
17785 50384056 51249845 50763315 50189321 52192925 59717604 75333511 101819507 139878524
17777 139878524 183559803 218571223 227454653 210126404 185489703 175098628 190164707
17770 190164707 228739589 274333686 297049886 282967508 247310151 213687067 189043158
17763 189043158 165443957 138036183 110472092 88680951 75038654 68875606 68671818
17756 68671818 72425129 76518636 76007291 68681150 57225091 46075735 37758351 32244668
17748 32244668 28649833 26248244 24538106 23299840 22511780 22144992 22282443 22964386 24252495
$$ packed form
17802E717493N61026O55139O98515P15312P65008P77581P73332R48334J364286
17793A2976026J997707K972163M539945O478633P747356O970523M433530K268173
17785E0384056Q65789m86530n73994K003604P524679J5615907K6485996L8059017
17777A39878524M3681279L5011420Q883430j7328249k4636701j0391075J5066079
17770A90164707L8574882M5594097K2716200j4082378l5657357l3623084k4643909
17763A89043158k3599201k7407774k7564091k1791141j3642297o163048k03788
17756F8671818L753311M093507n11345p326141j1456059j1149356q317384n513683
17748C2244668l594835k401589j710138j238266p88060l66788J37451O81943J288109
$$ plain form
17739 24252495 26433078 29842351 35243102 43517345 55016684 68266149 79223711 85186372
17731 85186372 89047473 96667939 110734925 126406391 134013343 130857858 124924557 128376361
17723 128376361 149116054 186160711 225189276 243829260 238092917 220525605 208622805
17716 208622805 211737023 227519205 242586386 240308435 219706017 192991941 170662035
17709 170662035 154371617 141404972 130637850 123185269 119750867 118269173 114933748
17702 114933748 107681618 98272787 90607921 87561127 89708402 95447071 101273423 104090252
17694 104090252 102505674 97568803 91919436 88152161 87249275 88126485 88038834 83931968
17686 83931968 74943210 63006458 51152591 41182546 33609757 28099090 24143699 21319521
$$ packed form
17739B4252495K180583L409273N400751Q274243J1499339J3249465J0957562N962661
17731H5186372L861101P620466J4066986J5671466P606952l155485n933301L451804
17723A28376361K0739693L7044657L9028565J8639984n736343j7567312j1902800
17716B08622805L114218J5782182J5067181k277951k0602418k6714076k2329906
17709A70662035j6290418j2966645j0767122p452581l434402j481694l335425
17702A14933748p252130r408831p664866l046794K147275N738669N826352K816829
17694A04090252j584578m936871n649367l767275r02886Q77210q7651m106866
17686H3931968q988758j1936752j1853867r970045p572789n510667l955391k824178
$$ plain form
17678 21319521 19244865 17699982 16518875 15522017 14768736 14341880 14117189 14168674 14461516
17669 14461516 15007677 15995458 17492690 19827805 23484709 28948726 36804285 46986212
17661 46986212 58531662 69014729 75266551 76076156 73463651 71006475 71129242 73731925
17653 73731925 76835431 77778596 74780638 68874479 62934405 59517583 59995347 64301759
17645 64301759 70967453 77180720 79687468 77370353 72547023 68583759 67186630 67984078
17637 67984078 68873720 66879892 60532354 51053002 40991445 32344468 25692207 20789858
17629 20789858 17291682 14739160 12795487 11317289 10164586 9259828 8463495 7765382
17621 7765382 7172432 6677578 6299864 5968257 5631523 5337169 5120044 4876931 4643989
$$ packed form
17678B1319521k074656j544883j181107r96858p53281m26856k24691N1485K92842
17669A4461516N46161R87781J497232K335115L656904N464017P855559J0181927
17661D6986212J1545450J0483067O251822Q09605k612505k457176J22767K602683
17653G3731925L103506R43165k997958n906159n940074l416822M77764M306412
17645F4301759O665694O213267K506748k317115m823330l963264j397129P97448
17637F7984078Q89642j993828o347538r479352j0061557q646977o652261m902349
17629B0789858l498176k552522j943673j478198j152703r04758p96333o98113
17621G765382n92950m94854l77714l31607l36734k94354k17125k43113k32942
$$ plain form
17612 4643989 4447761 4234475 4050648 3953030 3855494 3720897 3604705 3499833 3393618 3292381
17602 3292381 3256309 3204690 3079788 3019416 3037506 3032533 3089319 3134467 3094601 3112540 3118028
17591 3118028 3109560 3056549 3002794 2970257 2969373 2962497 2950026 2935147 2906872 2902980 2836305 2785361
17579 2785361 2724281 2716620 2776623 2786841 2734093 2732193 2771370 2736203 2685578 2630285 2554658 2486540
17567 2486540 2412933 2366346 2236220 2096778 2054633 2048326 2015615 1995829 1958563 1877785 1826513
17556 1826513 1813109 1750768 1705800 1652806 1597257 1537703 1499914 1461508 1412575 1435956 1413317
17545 1413317 1417100 1400479 1415685 1365145 1291154 1227209 1227949 1268536 1324806 1360420 1342748 1386502
17533 1386502 1404714 1405533 1375834 1401375 1401492 1344885 1318631 1273202 1307234 1371878 1355060 1285407
$$ packed form
17612D643989j96228k13286j83827r7618r7536j34597j16192j04872j06215j01237
17602C292381l6072n1619j24902o0372J8090m973N6786M5148l9866J7939N488
17591C118028q468n3011n3755l2537q84o876j2471j4879k8275l892o6675n0944
17579B785361o1080p661O0003J0218n2748j900L9177l5167n0625n5293p5627o8118
17567B486540p3607m6587j30126j39442m2145o307l2711j9786l7266q0778n1272
17556A826513j3404o2341m4968n2994n5549n9554l7789l8406m8933K3381k2639
17545A413317L783j6621J5206n0540p3991o3945P40M0587N6270L5614j7672M3754
17533A386502J8212Q19k9699K5541J17n6607k6254m5429L4032O4644j6818o9653
$$ plain form
17521 1285407 1276648 1269754 1220472 1283341 1263210 1192306 1188968 1188173 1196288 1243353 1257301 1235041
17509 1235041 1214165 1228758 1229946 1234183 1152528 1067457 1077669 1178902 1233113 1245417 1238566 1188073
17497 1188073 1171466 1237192 1231794 1231095 1288506 1264525 1264449 1272722 1233673 1189119 1129868 1090088 1081819
17484 1081819 1125648 1116941 1044581 1046805 1073208 1090432 1077347 1038102 1021787 975407 984354 1063191
17472 1063191 1064509 1091787 1100629 1054541 1015404 957894 947603 1004833 1019455 1017052 1087122 1126671
17460 1126671 1119583 1179109 1228951 1213844 1188085 1275420 1286049 1268871 1299874 1326685 1374799
17449 1374799 1395436 1467253 1519234 1562698 1635805 1615753 1512800 1412443 1438935 1492351 1560500
17438 1560500 1659032 1707364 1729361 1688555 1640208 1569691 1535131 1525377 1491187 1469047 1428283
$$ packed form
17521A285407q759o894m9282O2869k0131p0904l338p95Q115M7065J3948k2260
17509A235041k0876J4593J188M237q1655q5071J0212J01233N4211J2304o851n0493
17497A188073j6607O5726n398o99N7411k3981p6Q273l9049m4554n9251l9780q269
17484A081819M3829q707p2360K224K6403J7224j3085l9245j6315m6380Q947P8837
17472A063191J318K7278Q842m6088l9137n7510j0291N7230J4622k403P0070L9549
17460A126671p088N9526M9842j5107k5759Q7335J0629j7178L1003K6811M8114
17449A374799K0637P1817N1981M3464P3107k0052j02953j00357K6492N3416O8149
17438A560500R8532M8332K1997m0806m8347p0517l4560r754l4190k2140m0764
$$ plain form
17427 1428283 1336007 1228580 1111783 948830 836581 764520 786763 771565 684255 612914
17417 612914 669453 711389 719869 728951 743267 732982 734050 754385 726653 729984 788751 862226
17405 862226 860265 886276 913096 887135 835270 842923 865262 901502 907576 864997 837152 827363
17393 827363 851612 902096 1003879 1058563 1079326 1098844 1145129 1244569 1298995 1364545 1344238
17382 1344238 1309948 1221407 1169804 1252992 1341879 1330649 1305401 1273246 1160389 1010760 931755
17371 931755 822831 750559 691178 690574 709679 669685 639662 637587 588726 587391 617855 599260
17359 599260 489560 455389 484739 488888 474763 457471 420777 444727 446803 426994 423355 359589
17347 359589 326184 375530 400934 380723 397859 369441 398355 482488 536184 494788 486798 492697
$$ packed form
17427A428283r2276j07427j16797j62953j12249p2061K2243j5198q7310p1341
17417F12914N6539M1936Q480R082J4316j0285J068K0335k7732L331N8767P3475
17405H62226j961K6011K6820k5961n1865P653K2339L6240O074m2579k7845r789
17393H27363K4249N0484J01783N4684K0763J9518M6285R9440N4426O5550k0307
17382A344238l4290q8541n1603Q3188Q8887j1230k5248l2155j12857j49629p9005
17371I31755j08924p2272n9381o04J9105l9994l0023k075m8861j335L0464j8595
17359E99260j09700l4171K9350M149j4125j7292l6694K3950K076j9809l639o3766
17347C59589l3405M9346K5404k0211J7136k8418K8914Q4133N3696m1396p990N899
$$ plain form
17335 492697 443061 438663 533599 551637 497296 464439 436977 468549 471648 426936 450307 488662
17323 488662 487114 457617 439203 426214 441149 411635 390599 392419 415833 451378 454025 481698
17311 481698 494889 459945 435089 412861 424501 391985 394913 401598 351545 393240 446065 444059
17299 444059 470669 458416 369199 313599 365863 365291 390913 416473 413847 410407 370138 390593
17287 390593 389616 370912 341999 361261 401967 436440 511516 506102 546771 560007 571087 608247
17275 608247 705139 790796 888184 972527 977343 983501 1055902 1103562 1113412 1101392 1108245 1069272
17263 1069272 1008083 974142 984696 983197 997585 1076180 1142193 1226120 1242237 1218432 1152778
17252 1152778 1112033 1086629 1064221 1043448 1007781 948058 816033 692039 644976 660019 634975
$$ packed form
17335D92697m9636m398R4936J8038n4341l2857k7462L1572L099m4712K3371L8355
17323D88662j548k9497j8414j2989J4935k9514k1036J820K3414L5545K647K7673
17311D81698J3191l4944k4856k2228J1640l2516K928O685n0053M1695N2825k006
17299D44059K6610j2253q9217n5600N2264n72K5622K5560k626l440m0269K0455
17287C90593r77j8704k8913J9262M0706L4473P5076n414M0669J3236J1080L7160
17275F08247R6892Q5657R7388Q4343M816O158P2401M7660R850j2020O853l8973
17263A069272o1189l3941J0554j499J4388P8595O6013Q3927J6117k3805o5654
17252A152778m0745k5404k2408k0773l5667n9723j32025j23994m7063J5043k5044
$$ plain form
17241 634975 559502 581053 596435 587690 564208 535400 549662 580766 567100 505660 455374 435913
17229 435913 474912 545760 584761 590287 614164 685175 801616 912845 955574 1022363 1086288
17218 1086288 1040182 1083636 1085774 1076448 1063316 1001875 961844 978692 984501 997678 999169 954250
17206 954250 872322 875273 914800 932604 1000016 1141118 1205612 1197156 1088793 1067701 1095705
17195 1095705 1078674 1107548 1156633 1153628 1074770 972438 869248 808371 729330 712200 755282
17184 755282 689536 597720 615796 666366 703629 713313 729758 694046 729216 709062 660737 628330
17172 628330 607257 552064 507974 455469 385053 335071 347303 377830 391273 363846 361339 362704
17160 362704 308740 265896 287136 272631 271317 281725 264785 238628 259291 334808 391270 409828
$$ packed form
17241F34975p5473K1551J5382q745k3482k8808J4262L1104j3666o1440n0286j9461
17229D35913L8999P0848L9001N526K3877P1011J16441J11229M2729O6789O3925
17218A086288m6106M3454K138r326j3132o1441m0031J6848N809J3177J491m4919
17206I54250q1928K951L9527J7804O7412J41102O4494q456j08363k1092K8004
17195A095705j7031K8874M9085l005p8858j02332j03190o0877p9041j7130M3082
17184G55282o5746r1816J8076N0570L7263R684J6445l5712L5170k0154m8325l2407
17172F28330k1073n5193m4090n2505p0416m9982J2232L0527J3443k7427k507J365
17160C62704n3964m2844K1240j4505j314J0408j6940k6157K0663P5517N6462J8558
$$ plain form
17148 409828 431630 444181 469343 507948 552907 607815 625296 597375 562358 589400 654213
17137 654213 653706 623344 604127 612332 620323 593854 618800 666030 646757 635573 607114 566061
17125 566061 537753 523816 544279 555210 540013 540074 543970 531305 503059 455707 427493 424159
17113 424159 395523 388633 358741 330341 350389 316217 293657 255478 265346 244889 232673 235509
17101 235509 218357 172105 181006 217926 239976 200732 188570 199045 274561 277672 166274 132398
17089 132398 160426 194178 226279 256473 258016 256795 245476 204381 168433 146116 171060 240366
17077 240366 295770 291869 320784 259740 211247 185026 169127 182010 206487 219742 218063 174132
17065 174132 205072 257431 263123 255987 199864 179512 178896 171973 149419 130482 122274 184248 257731
$$ packed form
17148D09828K1802J2551K5162L8605M4959N4908J7481k7921l5017K7042O4813
17137F54213n07l0362j9217Q205P991k6469K4946M7230j9273j1184k8459m1053
17125E66061k8308j3937K0463J0931j5197O1L896j2665k8246m7352k8214l334
17113D24159k8636o890k9892k8400K0048l4172k2560l8179R868k0457j2216K836
17101B35509j7152m6252Q901L6920K2050l9244j2162J0475P5516L111j11398l3876
17089A32398K8028L3752L2101L0194J543j221j1319m1095l5948k2317K4944O9306
17077B40366N5404l901K8915o1044m8493k6221j5899J2883K4477J3255j679m3931
17065A74132L0940N2359N692p136n6123k0352o16o923k2554j8937q208O1974P3483
$$ plain form
17052 257731 250638 232190 230523 195798 194192 237671 287910 236772 202725 142827 154589 217490
17040 217490 253693 264486 216732 194185 206870 141119 86878 104954 118715 120062 135706 168008
17028 168008 151746 138583 120077 123003 158036 147849 192216 235307 190628 144835 142630 144335
17016 144335 139333 103158 78021 80110 83713 102153 134519 204201 229240 212395 191919 173144
17004 173144 210539 198682 217750 229697 199859 203002 225866 172273 168074 220864 222671 203556
16992 203556 150815 195014 233180 225517 218340 176614 155514 139992 112576 143557 196812 209792
16980 209792 175774 183810 202964 192121 173571 117825 138996 105490 122728 138051 144415 134434
16968 134434 106596 67559 93889 139809 180896 171091 187376 196048 133579 79624 47405 24825
$$ packed form
17052B57731p093j8448j667l4725j606M3479N0239n1138l4047n9898J1762O2901
17040B17490L6203J0793m7754k2547J2685o5751n4241J8076J3761J347J5644L2302
17028A68008j6262j3163j8506K926L5033j0187M4367M3091m4679m5793k205J705
17016A44335n002l6175k5137K089L603J8440L2366O9682K5039j6845k0476j8775
17004A73144L7395j1857J9068J1947k9838L143K2864n3593m199N2790J807j9115
16992B03556n2741M4199L8166p663p177m1726k1100j5522k7416L0981N3255J2980
16980B09792l4018Q036J9154j0843j8550n5746K1171l3506J7238J5323O364r981
16968A34434k7838l9037K6330M5920M1087r805J6285Q672o2469n3955l2219k2580
$$ plain form
16956 24825 18846 39015 50325 120347 142856 166619 132096 138290 174832 148840 114664 88385
16944 88385 97614 145673 158239 104043 43852 23633 61176 114098 110190 83596 102297 89210
16932 89210 103392 149295 93923 20145 20206 23137 41653 72067 65427 108153 137619 123155 136270
16919 136270 174242 213705 271344 263870 163398 144269 174062 208954 221584 285029 245091
16908 245091 192332 139522 132338 103122 39322 82601 121640 110116 121041 154200 128181 71435
16896 71435 104227 142737 180901 176960 163934 195969 237637 275943 294299 264049 228597 221159
16884 221159 134888 102812 144129 174746 161105 147625 148940 162782 207183 171308 149355 184873
16872 184873 229260 184033 139271 103934 112269 154706 164663 176301 150132 97149 54563 70174
$$ packed form
16956B4825n979K0169J1310P0022K2509K3763l4523O194L6542k5992l4176k6279
16944H8385R229M8059J2566n4196o0191k0219L7543N2922l908k6594J8701j3087
16932H9210J4182M5903n5372p3778O1K931J8516L0414o640M2726K9466j4464J3115
16919A36270L7972L9463N7639p474j00472j9129K9793L4892J2630O3445l9938
16908B45091n2759n2810p184k9216o3800M3279L9039j1524J0925L3159k6019n6746
16896G1435L2792L8510L8164l941j3026L2035M1668L8306J8356l0250l5452p438
16884B21159q6271l2076M1317L0617j3641j3480J315J3842M4401l5875k1953L5518
16872A84873M4387m5227m4762l5337Q335M2437R957J1638k6169n2983m2586J5611
$$ plain form
16860 70174 94649 118788 186845 181776 140007 121718 154958 121134 72823 26097 74943 148246
16848 148246 125847 134222 99528 121358 161771 152243 153983 116447 104954 143130 178596 140912
16836 140912 156989 123155 66707 100183 150585 174349 149698 123955 127090 130896 149896 184168
16824 184168 172158 129790 73910 56005 34425 26386 18375 85228 141525 93172 27337 41779
16812 41779 105321 96162 107166 131802 164791 170772 178126 141448 125329 130689 126597 67328 96933
16799 96933 206376 230647 168014 139979 107854 116861 107540 96619 65921 41249 38913 58054
16787 58054 130117 132517 163649 132565 120635 87462 103694 122584 109153 106418 103718 114318
16775 114318 114348 103606 62821 83295 88580 97366 101351 102294 134989 99417 52921 71931 67977
$$ packed form
16860G0174K4475K4139O8057n069m1769j8289L3240l3824m8311m6726M8846P3303
16848A48246k2399Q375l4694K1830M0413r528J740l7536j1493L8176L5466l7684
16836A40912J6077l3834n6448L3476N0402K3764k4651k5743L135L806J9000L4272
16824A84168j2010m2368n5880j7905k1580q039q011O6853N6297m8353o5835J4442
16812D1779O3542r159J1004K4636L2989N981P354l6678j6119N360m092n9269K9605
16799I6933J09443K4271o2633k8035l2125R007r321j0921l0698k4672k336J9141
16787E8054P2063K400L1132l1084j1930l3173J6232J8890j3431k735k700J0600
16775A14318L0j0742m0785K0474N285Q786L985R43L2695l5572m6496J9010l954
$$ plain form
16762 67977 80442 62464 108385 132273 118293 60003 76699 95370 97946 90033 94121 112778
16750 112778 128036 135259 108542 88101 50057 81309 149434 163304 161541 135050 73955 83645
16738 83645 100543 70720 65300 86110 55899 24195 82372 162779 150269 111307 123522 163144
16726 163144 170947 181231 179453 150728 127655 117731 87816 24101 4817 11146 55322 86241
16714 86241 74570 84834 76388 88518 78223 106117 100915 156691 216213 154591 109476 97727
16702 97727 74135 56474 73995 129673 130617 141362 170903 129123 132183 136554 155366 102657
16690 102657 66539 27220 -12350 -12583 -1257 74032 58890 81767 82342 14982 40344 109665
16678 109665 129108 149841 169148 131004 105126 123953 90493 69258 69935 63567 116353 117157
$$ packed form
16762F7977J2465j7978M5921K3888j3980n8290J6696J8671K576p913M088J8657
16750A12778J5258P223k6717k0441l8044L1252O8125J3870j763k6491o1095R690
16738H3645J6898k9823n420K0810l0211l1704N8177Q0407j2510l8962J2215L9622
16726A63144P803J0284j778k8725k3073r924k9915o3715j9284O329M4176L0919
16714H6241j1671J0264q446J2130j0295K7894n202N5776N9522o1622m5115j1749
16702I7727k3592j7661J7521N5678R44J0745K9541m1780L060M371J8812n2709
16690A02657l6118l9319l9570k33J1326P5289j5142K2877N75o7360K5362O9321
16678A09665J9443K0733J9307l8144k5878J8827l3460k1235O77o368N2786Q04
$$ plain form
16666 117157 83787 14422 31833 53380 39881 114451 117324 39574 11251 48021 21510 31936
16654 31936 69607 92528 128648 118025 99409 35658 35024 48371 44522 61842 100992 48041
16642 48041 -18973 4952 44374 54813 78092 42802 41772 66782 85363 76316 64276 36701
16630 36701 52916 48989 84089 103926 115528 91563 55276 80456 111152 92784 113435 135578
16618 135578 89899 51582 29439 60970 94755 103091 81416 98833 88194 84473 107056 99051
16606 99051 66038 62934 128524 118431 69725 62415 12644 -47560 -50196 -18935 -800 54200
16594 54200 30802 15149 21839 50556 47408 71124 69141 41376 58492 108600 88380 34973
16582 34973 21330 84289 138817 152818 112360 164120 262774 234423 182685 152287 115664 74521
$$ packed form
16666A17157l3370o9365J7411K1547j3499P4570K873p7750k8323L6770k6511J0426
16654C1936L7671K2921L6120j0623j8616o3751o34J3347l849J7320L9150n2951
16642D8041o7014K3925L9422J0439K3279l5290j030K5010J8581r047j2040k7575
16630C6701J6215l927L5100J9837J1602k3965l6287K5180L0696j8368K0651K2143
16618A35578m5679l8317k2143L1531L3785Q336k1675J7417j0639l721K2583q005
16606I9051l3013l104O5590j0093m8706p310m9771o0204k636L1261J8135N5000
16594E4200k3398j5653O690K8717l148K3716j983k7765J7116N0108k0220n3407
16582C4973j3643O2959N4528J4001m0458N1760R8654k8351n1738l0398l6623m1143
$$ plain form
16570 74521 78972 96378 112626 82493 38992 5245 -22720 -3110 44334 57292 75839 69915
16558 69915 87243 90738 67942 148368 165132 92473 39480 19642 -2930 -6650 12654 27303
16546 27303 70894 79977 48649 50574 3526 49855 32579 30908 19297 -25058 -79447 -26832
16534 -26832 17899 70021 69422 76558 99853 84947 75234 40445 28357 17417 57531 69367
16522 69367 75043 49141 92456 170891 150534 127877 101873 87966 102839 122299 135466 131702
16510 131702 99030 98650 100023 152115 185832 151482 61132 6079 -16373 3780 -1232 -11029
16498 -11029 18553 17128 68213 42077 44002 73919 66979 53519 61796 77765 65512 58658 121681
16485 121681 91335 50227 34336 31275 27521 57070 97283 132495 68914 28217 55836 90672
$$ packed form
16570G4521M451J7406J6248l0133m3501l3747k7965J9610M7444J2958J8547n924
16558F9915J7328L495k2796Q0426J6764p2659n2993j9838k2572l720J9304J4649
16546B7303M3591R083l1328J925m7048M6329j7276j671j1611m4355n4389N2615
16534b6832M4731N2122n99P136K3295j4906r713l4789j2088j0940M0114J1836
16522F9367N676k5902M3315P8435k0357k2657k6004j3907J4873J9460J3167l764
16510A31702l2672l80J373N2092L3717l4350r0350n5053k2452K0153n012r797
16498a1029K9582j425N1085k6136J925K9917o940j3460Q277J5969j2253o854O3023
16485A21681l0346m1108j5891l061l754K9549M0213L5212o3581m0697K7619L4836
$$ plain form
16473 90672 108468 110799 132322 153719 107047 93591 97709 78982 67033 82093 80297 37230
16461 37230 -6610 20026 39839 80054 84866 55341 83929 33965 7198 58007 141798 146095
16449 146095 81584 31190 53141 8645 52703 60990 104904 146832 132665 59766 14966 10604
16437 10604 21471 37390 76565 113421 143144 120147 114866 52056 56704 12042 -26127 -2420
16425 -2420 38479 32646 26102 25777 46129 124941 64796 2407 5920 49603 40982 36677 10015
16412 10015 49302 85096 58053 67159 110589 121415 53053 -9626 23234 32037 -10073 -629
16400 -629 -21192 -57021 -57049 -21549 -16742 -22966 -17341 -22013 -49107 -23709 18880 43500 93352
16387 93352 116907 107937 114846 112266 87181 78026 23951 54718 57890 45079 52687 40532 50384
$$ packed form
16473I0672J7796K331K1523K1397m6672j3456M118j8727j1949J5060j796m3067
16461C7230m3840K6636J9813M0215M812k9525K8588m9964k6767N0809Q3791M297
16449A46095o4511n0394K1951m4496M4058Q287M3914M1928j4167p2899m4800m362
16437A0604J0867J5919L9175L6856K9723k2997n281o2810M648m4662l8169K3707
16425b420M0899n833o544l25K0352P8812o0145o2389L513M3683q621m305k6662
16412A0015L9287L5794k7043R106M3430J0826o8362o2679L2860Q803m2110R444
16400f29k0563l5829k8L5500M807o224N625m672k7094K5398M2589K4620M9852
16387I3352K3555q970O909k580k5085r155n4075L0767L172j2811P608j2155R852
$$ plain form
16374 50384 31776 10574 16929 35345 10964 26182 58504 55383 57969 65297 78407 86301 58122
16361 58122 44498 70810 95556 89852 65978 29672 33378 50748 85282 100572 48949 5872
16349 5872 -26015 -35526 -53532 -48775 -10623 52394 37144 4077 28647 42102 9979 1155
16337 1155 16875 63538 67194 109957 79254 46402 50798 62457 63237 64138 78878 75701 98530
16324 98530 126472 87856 54046 78453 62216 60111 55040 49598 47228 12056 9334 30666 17474
16311 17474 -33600 -73835 -50990 -39390 12127 41295 6055 -58934 -23864 7524 27685 26121
16299 26121 -32703 -38489 -45897 -49288 7394 22226 35986 41915 40514 27355 565 41305 90643
16286 90643 72496 37807 15782 16614 45184 23456 3536 71786 133658 144944 101556 69415
$$ packed form
16374E0384j8608k1202O355J8416k4381J5218L2322l121K586P328J3110P894k8179
16361E8122j3624K6312K4746n704k3874l6306L706J7370L4534J5290n1623m3077
16349E872l1887r511j8006M757L8152O3017j5250l3067K4570J3455l2123q824
16337A155J5720M6663L656M2763l0703l2852M396J1659P80R01J4740l177K2829
16324I8530K7942l8616l3810K4407j6237k105n071n442k370l5172k722K1332j3192
16311A7474n1074m0235K2845J1600N1517K9168l5240o4989L5070L1388K0161j564
16299B6121n8824n786p408l391N6682J4832J3760N929j401j3159k6790M0740M9338
16286I0643j8147l4689k2025Q32K8570k1728j9920O8250O1872J1286m3388l2141
$$ plain form
16274 69415 111477 164122 129079 90513 96106 85442 53586 38813 92052 58916 -1941 13941
16262 13941 9287 16355 -30046 -21936 960 -3673 -27029 11547 39894 38583 12957 14298 -24088
16249 -24088 19254 93947 58220 -15935 14446 26891 2297 5988 18584 43691 58300 111986
16237 111986 145463 55363 -21185 -51407 -18956 52865 53784 27971 23003 55109 79049 86353
16225 86353 5591 -29256 9490 42884 14757 -40506 -16764 53367 45557 85570 111650 102157
16213 102157 154184 141378 114193 54968 26228 34740 44622 61951 22585 78557 90085 65792
16201 65792 35039 -24380 -43400 -14973 65608 69055 70573 55661 -26398 -55443 4547 64747
16189 64747 90386 79464 54647 80404 80551 118970 178833 170566 87550 27896 70002 55143
$$ packed form
16274F9415M2062N2645l5043l8566N593j0664l1856j4773N3239l3136o0857J5882
16262A3941m654P068m6401Q110K2896m633k3356L8576K8347j311k5626J341l8386
16249b4088M3342P4693l5727p4155L0381J2445k4594L691J2596K5107J4609N3686
16237A11986L3477r0100p6548l0222L2451P1821R19k5813m968L2106K3940P304
16225H6353q0762l4847L8746L3394k8127n5263K3742P0131p810M0013K6080r493
16213A02157N2027j2806k7185n9225k8740Q512R882J7329l9366N5972J1528k4293
16201F5792l0753n9419j9020K8427Q0581L447J518j4912q2059k9045N9990O0200
16189F4747K5639j0922k4817K5757J47L8419N9863q267q3016n9654M2106j4859
$$ plain form
16177 55143 82326 60514 -14467 -49039 -59737 -45582 -48436 -34961 -22283 20692 21672 15160
16165 15160 53941 30969 13443 -19812 -60176 -19870 -25625 -27255 -32544 -31881 -64709 -28573 17638
16152 17638 65297 51403 33903 74762 108714 72425 30180 -3168 -58942 -21938 25785 24786
16140 24786 -18994 -43644 -47704 -31431 -59047 -10144 73262 50185 67541 48873 54176 45079
16128 45079 17585 -17009 -962 11346 20248 22736 -30801 -25390 -39326 -65586 -56209 -22875
16116 -22875 16687 26900 -24749 -42683 -21405 33103 3677 -5292 50003 9726 10122 5181
16104 5181 -17573 5713 -53989 -95184 -33377 3431 -2577 43782 17832 -7564 58062 56536
16092 56536 -21857 -57066 -48866 14084 21524 -21383 31457 -28842 -45339 9470 36930 58686
$$ packed form
16177E5143K7183k1812p4981l4572j0698J4155k854J3475J2678M2975R80o512
16165A5160L8781k2972j7526l3255m0364M0306n755j630n289O63l2828L6136M6211
16152A7638M7659j3894j7500M0859L3952l6289m2245l3348n5774L7004M7723r99
16140B4786m3780k4650m060J6273k7616M8903Q3406k3077J7356j8668N303r097
16128D5079k7494l4594J6047J2308Q902K488n3537N411j3936k6260R377L3334
16116b2875L9562J0213n1649j7934K1278N4508k9426q969N5295m0277L96m941
16104E181k2754K3286n9702m1195O1807L6808o008M6359k5950k5396O5626j526
16092E6536p8393l5209Q200O2950P440m2907N2840o0299j6497N4809K7460K1756
$$ plain form
16080 58686 11660 10800 -24291 -19445 23027 -24986 -61854 -33357 -51370 -96773 -58624 -28224
16068 -28224 9746 19860 -8916 -355 32698 20725 -11607 -43014 -48521 -16881 52236 33636
16056 33636 41810 73063 95333 55437 26475 97134 54654 19495 21525 1702 6605 21149
16044 21149 24663 61917 89261 91541 54931 32079 5529 11274 23559 9629 -5090 3701
16032 3701 -12413 -10380 -4969 -3252 -37409 -71901 -109004 -75173 -51221 8513 42158 24260
16020 24260 -11096 11559 7667 16334 49140 68806 77607 124847 119616 99919 67157 39216
16008 39216 40504 79637 99399 124782 179424 175690 180134 109172 93780 60130 44089 78687
15996 78687 71640 -13381 -58081 -110640 -65978 -69770 -44762 -4480 29691 -623 -29783 25507
$$ packed form
16080E8686m7026q60l5091M846M2472m8013l6868K8497j8013m5403L8149L0400
16068b8224L7970J0114k8776Q561L3053j1973l2332l1407n507L1640O9117j8600
16056C3636Q174L1253K2270l9896k8962P0659m2480l5159K030j9823M903J4544
16044B1149L514L7254K7344K280l6610k2852k6550N745J2285j3930j4719Q791
16032C701j6114K033N411J717l4157l4492l7103L3831K3952N9734L3645j7898
16020B4260l5356K2655l892Q667L2806J9666Q801M7240n231j9697l2762k7941
16008C9216J288L9133J9762K5383N4642l734M444p0962j5392l3650j6041L4598
15996G8687p047q5021m4700n2559M4662l792K5008M0282L4171l0314k9160N5290
$$ plain form
15984 25507 42054 68728 91353 93159 67665 16715 -15996 -23144 -6171 25283 57102 60987
15972 60987 5315 9393 10955 -9010 -11904 -21101 -32976 -55541 -19942 -20947 -49499 -46219 -11542
15959 -11542 27598 -43529 -76779 -77772 -48156 -37677 -40732 -9738 18116 22121 12988 9889 -41000
15946 -41000 -58083 -21397 16475 15143 17496 22331 -61990 -65081 -37084 -4272 4636 -33245 -42467
15933 -42467 -10316 6990 -55402 -84044 -42541 -18229 76504 86610 28748 47830 42258 28636
15921 28636 21127 -2717 8868 21013 26045 12696 8140 3402 3991 10094 7562 -31947 30746
15908 30746 71701 20791 573 37686 61994 45031 58814 64082 62438 41293 45782 27458
15896 27458 -172 -18918 -16316 -15942 -34663 -56941 -60553 -56504 -12949 25500 54810 7021 -34476
$$ packed form
15984B5507J6547K6674K2625J806k5494n0950l2711p148J6973L1454L1819L885
15972F0987n5672M078J562j9965k894r197j1875k2565L5599j005k8552L280L4677
15959a1542L9140p1127l3250r93K9616J0479l055L0994K7854M005r133l099n0889
15946d1000j7083L6686L7872j332K353M835q4321l091K7997L2812Q908l7881r222
15933d2467L2151J7306o2392k8642M1503K4312R4733J0106n7862J9082n572j3622
15921B8636p509k3844J1585J2145N032j3349m556m738N89O103k532l9509O2693
15908C0746M0955n0910k0218L7113K4308j6963J3783N268j644k1145M489j8324
15896B7458k7630j8746K602L74j8721k2278l612M049M3555L8449K9310m7789m1497
$$ plain form
15883 -34476 -18255 -15070 -12082 -5463 -4669 -13385 -43722 -38297 21479 73792 -2313 -6891 -13489
15870 -13489 -22898 -1532 -11768 -39760 -28908 -64225 -64464 -8256 -4167 -40246 -79253 -53291
15858 -53291 -28647 1774 4262 -13978 -18801 -43615 -82814 -26543 13921 65833 68923 39982
15846 39982 53364 4105 -7957 26458 47324 20695 35740 62178 32406 47987 88092 30133
15834 30133 -2573 41901 84303 98635 54737 23369 8497 -17607 33445 28188 5067 41918
15822 41918 74307 70894 48826 77300 57363 -13422 -51071 -95570 -86036 -15350 4630 -54157
15810 -54157 -42818 -18934 -46518 -48836 -42487 -53358 -41275 1493 9314 -14228 6593 6867 -20871
15797 -20871 -34504 -30270 35050 77266 99718 26661 -31854 -37867 -17720 20119 21056 -6896
$$ packed form
15883c4476J6221L185K988O619P94q716l0337N425N9776N2313p6105m578o598
15870a3489r409K1366j0236k7992J0852l5317k39N6208M089l6079l9007K5962
15858e3291K4644L0421K488j8240m823k4814l9199N6271M0464N1912L090k8941
15846C9982J3382m9259j2062L4415K0866k6629J5045K6438k9772J5581M0105n7959
15834C0133l2706M4474M2402J4332m3898l1368j4872k6104N1052n257k3121L6851
15822D1918L2389l413k2068K8474j9937p0785l7649m4499R534P0686J9980n8787
15810e4157J1339K3884k7584k318O349j0871J2083M2768P821k3542K0821K74k7738
15797b0871j3633M234O5320M2216K2452p3057n8515o013K0147L7839R37k7952
$$ plain form
15785 -6896 21948 121372 174106 117914 67249 24496 49989 47042 5604 37118 20155 3616
15773 3616 32142 34461 48736 61013 44797 -19408 -44979 -40056 -35360 -42130 -21341 -31624 36179
15760 36179 37948 -56485 -119188 -98762 -66458 -48117 -8054 -26270 -45515 -32529 -38277 -56080
15748 -56080 -70927 -40209 -12098 -17695 5384 73415 62843 60861 46568 55217 61731 87559
15736 87559 91153 59700 -11900 -58813 -14683 -9994 36714 93539 59163 -11089 -83221 -45732
15724 -45732 -22860 -7378 -54991 -111457 -102138 -65343 -33659 -15060 -19540 17379 -39211 -77945
15712 -77945 -57991 -65088 -50190 -10364 63706 106083 85446 102853 68315 69386 51183 -1762
15700 -1762 20920 28944 44796 85973 78003 62067 34217 29474 49801 49855 -8882 -35509 -33797
$$ packed form
15785f896K8844R9424N2734n6192n0665m2753K5493k947m1438L1514j6963j6539
15773C616K8526K319J4275J2277j6216o4205k5571M923M696o770K0789j0283O7803
15760C6179J769r4433o2703K0426L2304J8341M0063j8216j9245J2986n748j7803
15748e6080j4847L0718K8111n597K3079O8031j0572j982j4293Q649O514K5828
15736H7559L594l1453p1600m6913M4130M689M6708N6825l4376p0252p2132L7489
15724d5732K2872J5482m7613n6466R319L6795L1684J8599m480L6919n6590l8734
15712g7945J9954p097J4898L9826P4070M2377k0637J7407l4538J071j8203n2945
15700a762K2682Q024J5852M1177p970j5936k7850m743K0327N4n8737k6627J712
$$ plain form
15687 -33797 -6924 13533 20546 -7548 -73894 -116090 -109251 -55924 -25065 40314 73054 53181
15675 53181 34195 -1806 17342 -9434 -36727 -64140 -47260 -28583 -8424 -27844 20375 25217
15663 25217 -15181 -4156 -16774 -73066 -49527 12084 -5121 -43117 -33127 -41479 -74972 -73044
15651 -73044 -81266 -84308 -91134 -89887 -36910 2912 -18916 -24662 -35177 -78467 -43019 -6702 2029
15638 2029 -11113 6908 -35083 -54563 -64520 -31213 -59907 -76755 -120056 -56851 -10786 12350
15626 12350 -2616 6271 10305 18268 -3244 -8406 -7824 -5226 3256 -18025 -11574 -7119 -60113 -54228
15612 -54228 -25293 -4001 -32947 -79806 -74871 -45461 -44509 -18736 -26603 -21124 -28597 -31164 -21187
15599 -21187 -16590 -28050 366 13415 -20237 -43870 -80514 -61408 -32439 -67574 -90047 -55538
$$ packed form
15687c3797K6873K0457P013k8094o6346m2196O839N3327L0859O5379L2740j9873
15675E3181j8986l6001J9148k6776k7293k7413J6880J8677K0159j9420M8219M842
15663B5217m0398J1025j2618n6292K3539O1611j7205l7996R990q352l3493J928
15651g3044q222l042o826J247N2977L9822k1828n746j0515m3290L5448L6317Q731
15638B029j3142J8021m1991j9480r957L3307k8694j6848m3301O3205M6065K3136
15626A2350j4966Q887M034P963k1512n162N82K598Q482k1281O451M455n2994N885
15612e4228K8935K1292k8946m6859M935K9410R52K5773p867N479p473k567R977
15599b1187M597j1460K8416J3049l3652k3633l6644J9106K8969l5135k2473L4509
$$ plain form
15587 -55538 -54378 -36930 6104 9553 -75949 -48974 49632 93954 81081 23038 163 30457
15575 30457 325 -42179 -53117 -7221 7657 -1515 44648 95092 88497 43158 24654 9576
15563 9576 -38303 -55406 -26179 -48532 -9097 42407 63702 100303 84817 61425 102748 113260
15551 113260 80734 46954 76729 93390 47630 2121 -31270 -8510 11572 11916 -69266 -95173
15539 -95173 -93190 -51556 -73429 -29195 -27044 -66076 -95801 -126263 -102198 -87394 -52107 -50833
15527 -50833 -29223 -12215 -1278 31579 53910 20878 3533 9146 -12472 -2125 55156 30255
15515 30255 -6027 31127 18916 25591 29993 73107 71389 61247 1870 -15481 -12261 9442
15503 9442 24354 64991 137604 119868 105733 80954 27793 -8577 998 33455 -69 -52436
$$ packed form
15587e5538J160J7448M3034L449q5502K6975R8606M4322j2873n8043k2875L0294
15575C0457l0132m2504j0938M5896J4878r172M6163N0444o595m5339j8504j5078
15563I576m7879j7103K9227k2353L9435N1504K1295L6601j5486k3392M1323J0512
15551A13260l2526l3780K9775J6661m5760m5509l3391K2760K0082L44q1182k5907
15539i5173J983M1634k1873M4234K151l9032k9725l0462K4065J4804L5287J274
15527e0833K1610J7008J0937L2857K2331l3032j7345N613k1618J0347N7281k4901
15515C0255l6282L7154j2211O675M402M3114j718j0142n9377j7351L220K1703
15503I442J4912M0637P2613j7736j4135k4779n3161l6370R575L2457l3524n2367
$$ plain form
15491 -52436 6221 22412 -44381 -31877 40345 42599 -7574 -33871 -18155 -23045 7391 85
15479 85 -37729 -65017 -66917 -77293 -57181 -29293 -69973 -35843 37873 73282 114292 101022
15467 101022 70292 -12636 -47944 -97725 -101009 -38107 -23309 -38155 -27389 2426 -21246 -63779
15455 -63779 -32798 -42687 -35723 26377 57269 42201 20604 -24402 -35039 -27502 -17190 -2346
15443 -2346 34470 43867 44948 42709 12672 -24662 -72242 -104196 -86640 -32697 -12658 1418
15431 1418 31309 53000 112188 107888 102225 111408 80441 42586 33862 20795 8158 12346 7710
15418 7710 15802 45066 50228 27435 31172 36570 -4813 -13382 24463 51431 30160 8000 393
15405 393 -54220 -42880 -20735 12069 -10776 -15919 -44372 -78092 -47929 5338 27880 351
$$ packed form
15491e2436N8657J6191o6793J2504P2222K254n0173k6297J5716m890L0436p306
15479H5l7814k7288j900j0376K0112K7888m0680L4130P3716L5409M1010j3270
15467A01022l0730q2928l5308m9781l284O2902J4798j4846J0766K9815k3672m2533
15455f3779L0981r889O964O2100L0892j5068k1597m5006j0637P537J0312J4844
15443b346L6816R397J081k239l0037l7334m7580l1954J7556N3943K0039J4076
15431A418K9891K1691N9188m300n663R183l0967l7855q724j3067j2637M188m636
15418G710Q092K9264N162k2793L737N398m1383q569L7845K6968k1271k2160p607
15405C93n4613J1340K2145L2804k2845n143k8453l3720L0163N3267K2542k7529
$$ plain form
15393 351 -7601 -12322 -13290 9101 -13317 -8094 18059 -2693 -17896 -12349 5107 27872 43152
15380 43152 61415 43536 22359 9803 3297 -1505 -14732 -16732 -14238 -26231 -56522 -68207
15368 -68207 -53778 -42461 -65992 -38011 1911 -32686 -61026 -87082 -110282 -88699 -52260 -40819
15356 -40819 -55731 3576 42500 19481 -11511 24586 -27865 -47393 -12465 11538 57272 63533
15344 63533 61373 35665 -15542 -49021 -40740 31841 -8262 -46292 -52391 15703 37618 37887 73053
15331 73053 16712 -17601 -59305 -74760 -99495 -80940 -70944 -95066 -44748 -44691 14144 21281 11322
15318 11322 -22828 -10534 -12887 -33249 22023 16690 -12826 6214 -30503 -17106 -34016 -78061
15306 -78061 -96534 -82272 -102293 -95025 -57176 -38811 -9288 -41398 -55598 -37565 -280 6817
$$ packed form
15393C51p952m721r68K2391k2418N223K6153k0752j5203N547J7456K2765J5280
15380D3152J8263j7879k1177j2556o506m802j3227k000K494j1993l0291j1685
15368f8207J4429J1317k3531K7981L9922l4597k8340k6056k3200K1583L6439J1441
15356d0819j4912N9307L8924k3019l0992L6097n2451j9528L4928K4003M5734O261
15344F3533k160k5708n1207l3479Q281P2581m0103l8030o099O8094K1915K69L5166
15331G3053n6341l4313m1704j5455k4735J8555R996k4122N0318N7N8835P137r959
15318A1322l4150J2294k353k0362N5272n333k9516J9040l6717J3397j6910m4045
15306g8061j8473J4262k0021P268L7849J8365K9523l2110j4200J8033L7285P097
$$ plain form
15294 6817 -19286 -42160 -99587 -61956 -78939 -46810 -77493 -101740 -129402 -111984 -88126 -108888
15282 -108888 -92861 -45818 -52554 -29630 -4763 26679 60180 29499 -1228 -17377 -53046 -71048
15270 -71048 -39547 -10381 37606 39611 -13952 -5534 22370 -8150 -24955 -11475 -6299 13721
15258 13721 -21502 -21197 -21809 7901 62100 62247 67931 35053 49966 62055 30520 43305 48935
15245 48935 55414 59227 -20166 -37675 4385 -30692 -39016 -68395 -66789 -60175 -42046 -13532 2648
15232 2648 36954 70422 90244 7243 -85533 -109824 -68748 -18437 -16467 -15270 -49542 -106791
15220 -106791 -100379 -99043 -79671 21122 21712 -16081 -44296 -62469 -59474 -57798 -94907 -61318
15208 -61318 -8815 24633 10490 -14984 34874 80051 27642 -20226 -50917 -65776 -71425 -103392
$$ packed form
15294F817k6103k2874n7427L7631j6983L2129l0683k4247k7662J7418K3858k0762
15282a08888J6027M7043o736K2924K4867L1442L3501l0681l0727j6149l5669j8002
15270g1048L1501K9166M7987K005n3563Q418K7904l0520j6805J3480N176K0020
15258A3721l5223L05o12K9710N4199J47N684l2878J4913J2089l1535J2785N630
15245D8935O479L813p9393j7509M2060l5077q324k9379J606O614J8129K8514J6180
15232B648L4306L3468J9822q3001r2776k4291M1076N0311J970J197l4272n7249
15220a06791O412J336J9372J00793N90l7793k8215j8173K995J676l7109L3589
15208f1318N2503L3448j4143k5474M9858M5177n2409m7868l0691j4859n649l1967
$$ plain form
15196 -103392 -136016 -117832 -93526 -69332 -51559 -19528 -32046 -48654 -47768 -50874 -33720 -29121
15184 -29121 -37407 -33962 -5488 -47245 -53110 -33713 -32629 14403 33157 8237 3212 -11490 -49851
15171 -49851 -94452 -92141 -16802 -39029 -88563 -66599 -37267 -66370 -63906 -56986 -57619 -56843 -86714
15158 -86714 -97867 -111876 -107539 -80314 -68727 -30020 -46268 -30031 -15969 -21981 -42274 -33530
15146 -33530 11171 22815 37297 16892 8527 -25331 -69074 -41887 -9808 -9787 7736 37955
15134 37955 39017 22659 78236 21447 -71361 -88942 -23531 -3813 -8800 -36352 -73730 -56286
15122 -56286 -16775 1316 42881 28862 69381 72794 26765 -13179 -53223 -60031 -32248 -16123
15110 -16123 138 -7504 2620 -13021 22875 55483 5807 17258 13122 -19498 -51716 -44710
$$ packed form
15196a03392l2624J8184K4306K4194J7773L2031j2518j6608Q86l106J7154M599
15184b9121q286L445K8474m1757n865J9397J084M7032J8754k4920n025j4702l8361
15171d9851m4601K311P5339k2227m9534K1964K9332k9103K464O920o33P76k9871
15158h6714j1153j4009M337K7225J1587L8707j6248J6237J4062o012k0293Q744
15146c3530M4701J1644J4482k0405q365l3858m3743K7187L2079K1J7523L0219
15134C7955J062j6358N5577n6789r2808j7581O5411J9718m987k7552l7378J7444
15122e6286L9511J8091M1565j4019M0519L413m6029l9944m0044o808K7783J6125
15110a6123J6261p642J0124j5641L5896L2608m9676J1451m136l2620l2218P006
$$ plain form
15098 -44710 -50052 -21166 -29949 -14530 -33759 -38108 -27483 -54568 -9585 18536 72808 14972
15086 14972 41301 69058 75967 -1638 -1797 78232 69739 36352 25536 6695 15715 10276 70028
15073 70028 89432 56071 59637 35095 63087 129784 136827 125910 106318 84610 56893 27930
15061 27930 19320 39435 45095 102363 100529 81980 61390 53245 61897 30113 17485 47694 84487
15048 84487 122480 56884 -3041 8104 -23641 -13635 11591 31466 64585 112035 108487 63295
15036 63295 49280 59261 43025 22001 38724 21984 26029 6228 43813 39187 776 -29747
15024 -29747 -68699 -43482 -27395 -20958 -24564 -73552 -20272 32124 -8261 -5792 33197 47452
15012 47452 4867 -36416 -18230 198 -3599 -23943 -14616 22611 63443 40585 -7472 -52150
$$ packed form
15098d4710n342K8886q783J5419j9229m349J0625k7085M4983K8121N4272n7836
15086A4972K6329K7757O909p7605j59Q0029q493l3387j0816j8841R020n439N9752
15073G0028J9404l3361L566k4542K7992O6697P043j0917j9592k1708k7717k8963
15061B7930q610K0115N660N7268j834j8549k0590q145Q652l1784j2628L0209L6793
15048H4487L7993o5596n9925J1145l1745J0006K5226J9875L3119M7450l548m5192
15036F3295j4015R981j6236k1024J6723j6740M045j9801L7585m626l8411l0523
15024b9747l8952K5217J6087O437l606m8988N3280N2396m0385K469L8989J4255
15012D7452m2585m1283J8186J8428l797k0344R327L7227M0832k2858m8057m4678
$$ plain form
15000 -52150 -65571 -71796 -80498 -53149 -7 21739 65634 42359 31175 50684 40688 3363
14988 3363 -85506 -85848 -73544 -26198 -13405 -62409 -15936 -3864 -7091 53815 89013 66170
14976 66170 33349 10134 17699 8493 35479 57790 32958 42430 57348 71823 7766 -40432
14964 -40432 -37059 -13718 -40740 -63598 -30705 -6760 28897 -7473 -61883 -39128 4544 65793
14952 65793 23266 -10104 -21536 15589 -5652 -26731 -28165 5484 -3256 -19802 -9164 15292
14940 15292 20984 -36239 -103920 -88756 -12276 42594 -9593 -52878 -69973 -62312 -42576 1648
14928 1648 40719 50284 47075 16732 -15181 -6749 -3458 11777 15422 5562 13040 32597 24944
14915 24944 -22535 -59104 -56298 -57645 -44856 -29345 -4508 -4326 -8647 -19730 -8160 22691 7301
$$ packed form
15000e2150j3421o225q702K7349N3142K1746M3895k3275j1184J9509r996l7325
14988C363q8869l42J2304M7346J2793m9004M6473J2072l227O0906L5198k2843
14976F6170l2821k3215P565r206K6986K2311k4832R472J4918J4475o4057m8198
14964d0432L373K3341k7022k2858L2893K3945L5657l6370n4410K2755M3672O1249
14952F5793m2527l3370j1432L7125k1241k1079j434L3649q740j6546J0638K4456
14940A5292N692n7223o7681J5164P6480N4870n2187m3285j7095P661J9736M4224
14928A648L9071R565l209l0343l1913Q432L291J5235L645r860P478J9557p653
14915B4944m7479l6569K806j347J2789J5511K4837J82m321j1083J1570L0851j5390
$$ plain form
14902 7301 -22510 -66831 -75652 -107974 -150366 -169996 -113903 -26456 -25463 -27113 -29512 12372 580
14889 580 7076 30661 16536 -2815 -33177 -35637 -85187 -100040 -73340 -59523 -52019 -537 -8701
14876 -8701 -1939 31870 64745 71777 67314 67353 31923 -4922 -31327 -52563 -48729 -56899 -39186
14863 -39186 -65416 -119774 -66461 -30324 -33565 -9183 -47179 -73018 -91151 -51378 -21724 -64402
14851 -64402 -124639 -133191 -91038 -24755 3290 3631 66302 100238 64305 -3545 -39767 -35297
14839 -35297 -11981 -49440 -50595 -15858 -37104 -64471 -41757 -25908 -28894 -48655 -23465 -30888
14827 -30888 -32166 -52833 -50073 -51744 -78213 -80941 -98894 -116679 -96796 -122076 -133362 -142150 -144354
14814 -144354 -126668 -89345 -51388 -28348 -27902 -37248 -45567 -36825 -40191 -26900 -68404 -89049 -34944
$$ packed form
14902G301k9811m4321q821l2322m2392j9630N6093Q7447R93j650k399M1884j1792
14889E80O496K3585j4125j9351l0362k460m9550j4853K6700J3817P504N1482q164
14876h701O762L3809L2875P032m463L9l5430l6845k6405k1236L834q170J7713
14863c9186k6230n4358N3313L6137l241K4382l7996k5839j8133L9773K9654m2678
14851f4402o0237q552M2153O6283K8045L41O2671L3936l5933o7850l6222M470
14839c5297K3316l7459j155L4737k1246k7367K2714J5849k986j9761K5190p423
14827c0888j278k0667K760j671k6469k728j7953j7785J9883k5280j1286q788k204
14814a44354J7686L7323L7957K3040M46r346q319Q742l366J3291m1504k0645N4105
$$ plain form
14801 -34944 -9825 -33859 -83174 -65937 -69452 -150077 -138689 -45965 -23350 -81767 -92258 -90308
14789 -90308 -11286 12406 -51814 -97130 -48153 744 59167 71336 24138 13552 6186 -8576
14777 -8576 -35176 -52701 -32771 10340 1586 -40657 -33112 -38484 28780 46859 4091 -1913 -35107
14764 -35107 -85660 -65811 -17219 -113426 -142599 -117039 -51944 -633 40173 74757 78459 8379
14752 8379 18765 -6214 -40803 -108991 -100020 -116236 -84120 -51790 -72080 -69967 -57869 -33423
14740 -33423 -63199 -78269 -68058 -60558 -57342 -91631 -84990 -13766 -9488 -27400 -39925 -51677
14728 -51677 -44222 -77773 -149968 -109781 -2463 -15455 -22969 5612 -15715 -9137 -22194 45382
14716 45382 53231 13829 12740 -33048 -26812 -31216 -2635 41673 15493 -24564 -79674 -81831 -78461
$$ packed form
14801c4944K5119k4034m9315J7237l515q0625J1388R2724K2615n8417j0491J950
14789i0308P9022K3692o4220m5316M8977M8897N8423J2169m7198j0586p366j4762
14777h576k6600j7525J9930M3111q754m2243P545n372O7264J8079m2768o004l3194
14764c5107n0553J9849M8592r6207k9173K5560O5095N1311M0806L4584L702p0080
14752H379J0386k4979l4589o8188Q971j6216L2116L2330k0290K113J2098K4446
14740c3423k9776j5070J0211P500L216l4289O641P1224M278j7912j2525j1752
14728e1677P455l3551p2195M0187J07318j2992p514K8581k1327O578j3057O7576
14716D5382P849l9402j089m5788O236m404K8581M4308k6180m0057n5110k157L370
$$ plain form
14703 -78461 -90909 -109451 -80046 -59039 -103977 -127114 -124936 -96639 -69001 -68090 -64657 -102349
14691 -102349 -93927 -87094 -80491 -73535 -65981 -34647 -34734 -73886 -134237 -149798 -93078 -70645 -70430
14678 -70430 -101449 -95292 -56825 -75028 -57710 -68986 -70194 -52053 -71461 -97540 -114147 -158095
14666 -158095 -134245 -167743 -170510 -154178 -154818 -94746 -55836 -42005 -40669 -24101 -2365 -31811
14654 -31811 -18040 37772 40181 87044 70305 24689 -4562 -36007 -75660 -73077 -36419 -71839
14642 -71839 -117211 -156917 -124097 -89384 -89411 -81920 -48292 -11654 -24377 -50117 -45023 -59447 -51893
14629 -51893 -131197 -151425 -133064 -57724 -55365 -69568 -36605 28797 37526 -21930 -74698 -77460
14617 -77460 -50170 -3464 -37949 -30576 -6307 20259 39561 -28115 -105769 -87074 -93672 -123987
$$ packed form
14703g8461j2448j8542K9405K1007m4938k3137K178K8297K7638R11L433l7692
14691a02349Q422O833O603O956P554L1334q7l9152o0351j5561N6720K2433K15
14678g0430l1019O157L8467j8203J7318j1276j208J8141j9408k6079j6607m3948
14666a58095K3850l3498k767J6332o40O0072L8910J3831J336J6568K1736k9446
14654c1811J3771N5812K409M6863j6739m5616k9251l1445l9653K583L6658l5420
14642g1839m5372l9706L2820L4713k7P491L3628L6638j2723k5740N094j4424P554
14629e1893p9304k0228J8361P5340K359j4203L2963O5402Q729n9456n2768k762
14617g7460K7290M6706l4485P373K4269K6566J9302o7676p7654J8695o598l0315
$$ plain form
14605 -123987 -80613 19637 32376 60574 65758 26800 -14800 -100428 -75223 29716 35890
14594 35890 1081 24929 59825 36638 38841 26529 61232 73487 47740 22688 -14002 -25453
14582 -25453 -10507 5653 -21894 -30804 -14122 -15358 -17443 -3738 -4982 4414 21657 -6475 -19385
14569 -19385 -31130 11143 48155 -18406 -45008 -8033 -45075 -39551 31979 26250 12743 -5254
14557 -5254 -22340 -9257 -4403 -17913 27456 58125 74058 80103 58071 84018 93798 19453
14545 19453 -31142 899 59646 159529 144965 24380 -39426 6617 6549 37369 74539 65653
14533 65653 68351 72826 43098 36905 28294 -16914 -9365 63105 87706 67748 93972 82207 61990
14520 61990 49161 26035 33584 49039 20932 -4592 -503 -34216 -23749 42999 46712 59317
$$ packed form
14605a23987M3374J00250J2739K8198N184l8958m1600q5628K5205J04939O174
14594C5890l4809K3848L4896k3187K203j2312L4703J2255k5747k5052l6690j1451
14582b5453J4946J6160k7547q910J6682j236k085J3705j244R396J7243k8132j2910
14569a9385j1745M2273L7012o6561k6602L6975l7042N524P1530n729j3507j7997
14557e254j7086J3083M854j3510M5369L0669J5933O045k2032K5947R780p4345
14545A9453n0595L2041N8747R9883j4564j20585o3806M6043o8L0820L7170q886
14533F5653K698M475k9728o193q611m5208P549P2470K4601j9958K6224j1765k0217
14520F1990j2829k3126P549J5455k8107k5524M089l3713J0467O6748L713J2605
$$ plain form
14508 59317 47795 8651 21512 80686 101752 85201 91266 73713 96296 91604 39740 2081
14496 2081 42725 101283 78493 6387 -67910 -62476 -75841 -61651 -1007 -18498 1384 35108
14484 35108 51005 27959 35126 59983 91181 123802 146059 105086 28886 21356 -10777 -15839
14472 -15839 28487 63043 119566 160268 94817 9057 19422 -17612 -49849 -27114 35767 14885
14460 14885 -6089 34933 65933 59408 41801 49222 63880 47165 30706 26208 73377 89895
14448 89895 29206 49102 133995 101241 42252 88381 150692 161400 200135 191866 108574 55854
14436 55854 68644 125053 166570 173418 154671 156979 87179 69632 72479 77953 129322 136392 111925
14423 111925 67558 51462 68514 40530 14628 9603 6406 32387 59964 64723 35672 54387
$$ packed form
14508E9317j1522l9144J2861N9174K1066j6551O065j7553K2583m692n1864l7659
14496B081M0644N8558k2790p2106p4297N434j3365J4190O0644j7491J9882L3724
14484C5108J5897k3046P167K4857L1198L2621K2257m0973p6200p530l2133n062
14472a5839M4326L4556N6523M0702o5451q5760J0365l7034l2237K2735O2881k0882
14460A4885k0974M1022L1000o525j7607P421J4658j6715j6459m498M7169J6518
14448H9895o0689J9896Q4893l2754n8989M6129O2311J0708L8735q269q3292n2720
14436E5854J2790N6409M1517O848j8747K308o9800j7547K847N474N1369P070k4467
14423A11925m4367j6096J7052k7984k5902n025l197K5981K7577M759k9051J8715
$$ plain form
14411 54387 77353 28641 17265 40476 89683 96432 50981 32430 6746 -86568 -75140 -45531
14399 -45531 -77218 -100254 -89495 -41001 -11043 59133 43134 7257 -13226 -6480 -13747 -16905
14387 -16905 -14502 -26871 -12793 19807 49548 17064 16320 19177 3455 25507 26342 26864 46908
14374 46908 9191 19859 10496 -12986 -25040 -46377 -31185 -36349 -78703 -62544 -49077 -28260
14362 -28260 -5110 -20162 10484 -9526 -87559 -98018 -36384 -9994 51974 16865 -44252 -78712
14350 -78712 -39699 -32789 -99250 -129758 -126095 -126441 -99102 -21666 -4535 15283 9386 -18391 9880
14337 9880 -4401 -45865 -70103 -82432 -10076 11908 3715 2804 49764 30546 6178 -52179
14325 -52179 -73198 -59186 -30814 -64931 -92278 -121531 -88765 690 10719 -61429 -47000 20501
$$ packed form
14411E4387K2966m8712j1376K3211M9207O749m5451j8551k5684r3314J1428K9609
14399d5531l1687k3036J0759M8494K9958P0176j5999l5877k0483O746p267l158
14387a6905K403j2369J4078L2600K9741l2484p44K857j5722K2052Q35N22K0044
14374D6908l7717J0668r363k3482j2054k1337J5192n164m2354J6159J3467K0817
14362b8260K3150j5052L0646k0010p8033j0459O1634K6390O1968l5109o1117l4460
14350g8712L9013O910o6461l0508L663l46K7339P7436J7131J9818n897k7777K8271
14337I880j4281m1464k4238j2329P2356K1984q193r11M6960j9218k4368n8357
14325e2179k1019J4012K8372l4117k7347k9253L2766Q9455J0029p2148J4429O7501
$$ plain form
14313 20501 2471 -4106 -30345 -54799 -59984 -30152 -8730 -10864 -1012 4836 -45548 -73928 -107050
14300 -107050 -98734 -75965 -52942 -35052 -41496 -48423 -40298 -28190 -48881 -110878 -163460 -228535
14288 -228535 -202550 -138248 -88562 -49313 -20314 -33786 -37082 -64205 -77000 -67606 -40837 -11027
14276 -11027 -9581 -33067 -60543 -66055 -40643 29803 -5505 -34844 -46402 -85763 -27241 -19104
14264 -19104 -23 -11869 -60655 -58528 -88660 -104723 -94360 -99835 -91150 -95066 -47493 -2926
14252 -2926 -15869 -27092 -42750 -37481 -36577 -5119 46008 75243 56604 -5451 -75872 -112568
14240 -112568 -119861 -135431 -129358 -124420 -69072 -105855 -165366 -96425 -60553 -49252 -54144 -69694
14228 -69694 -80898 -97678 -30528 19635 35051 38948 -20940 -36540 -32605 -33719 -50690 -29649
$$ packed form
14313B0501j8030o577k6239k4454n185K9832K1422k134R852N848n0384k8380l3122
14300a07050Q316K2769K3023J7890o444o927Q125J2108k0691o1997n2582o5075
14288b28535K5985O4302M9686L9249K8999j3472l296k7123j2795R394K6769K9810
14276a1027J446k3486k7476n512K5412P0446l5308k9339j1558l9361N8522Q137
14264a9104J9081j1846m8786K127l0132j6063J0363n475Q685l916M7573M4567
14252b926j2943j1223j5658N269R04L1458N1127K9235j8639o2055p0421l6696
14240a12568p293j5570O073M938N5348l6783n9511O8941L5872J1301m892j5550
14228f9694j1204j6780O7150N0163J5416L897n9888j5600L935j114j6971K1041
$$ plain form
14216 -29649 -9273 13567 33620 49060 19810 4504 18016 10980 2503 -42870 -88091 -47613
14204 -47613 -31806 -27819 -51386 -50540 -45983 -21720 -29236 -51992 -62684 -90042 -90283 -46319 22215
14191 22215 13935 -15306 -13094 -1548 15407 -21448 -1330 24731 17281 -27287 -55372 -18129
14179 -18129 -30997 -61638 -34685 -28461 -43172 -16398 -43958 -46191 -23791 -13169 33528 57959
14167 57959 79125 29480 -65999 -78022 -55539 13209 36645 19842 -5032 -16963 -798 5793
14155 5793 51551 57695 66780 48509 69445 139726 168372 189520 197968 182472 240974 217708
14143 217708 184800 161298 182116 225517 229887 185106 208114 183100 215680 223947 233759 256162
14131 256162 217997 210153 215779 271055 301809 311880 311501 302683 287705 327493 281000 283023 320037
$$ packed form
14216b9649K0376K2840K0053J5440k9250j5306J3512p036q477m5373m5221M0478
14204d7613J5807L987k3567Q46M557K4263p516k2756j0692k7358k41M3964O8534
14191B2215q280k9241K212J1546J6955l6855K0118K6061p450m4568k8085L7243
14179a8129j2868l0641K6953O224j4711K6774k7560k233K2400J0622M6697K4431
14167E7959K1166m9645r5479j2023K2483O8748K3436j6803k4874j1931J6165O591
14155E793M5758O144R085j8271K0936P0281K8646K1148Q448j5496N8502k3266
14143B17708l2908k3502K0818M3401M370m4781K3008k5014L2580Q267R812K2403
14131B56162l8165p844N626N5276L0754J0071l79q818j4978L9788m6493K023L7014
$$ plain form
14118 320037 321485 299858 256727 222885 262578 250345 230685 219578 177456 143111 140971 160888
14106 160888 225052 236202 205475 182775 197725 193239 159531 134435 103711 57835 4075 -24506
14094 -24506 -29799 -20629 23422 74153 99213 121346 130343 49779 10669 11366 32370 68952 28068
14081 28068 -2635 -11239 -7606 -21862 -34386 -47247 -25587 -24345 7217 19714 1546 25965
14069 25965 -29234 -61416 -41551 -35865 -73085 -89386 -447 20923 4804 31274 51477 90666
14057 90666 65041 48054 28376 7185 4052 -13873 -39835 -33165 -87922 -87036 -53917 -1791
14045 -1791 -28014 -27727 -48724 -31697 -28051 -56194 -93367 -98509 -98905 -44564 11385 -21412 -34401
14032 -34401 -71908 -56879 -57554 -52406 -69694 -36977 4636 -39554 -82368 -75591 -56441 -33746
$$ packed form
14118C20037J448k1627m3131l3842L9693j2233j9660j1107m2122l4345k140J9917
14106A60888O4164J1150l0727k2700J4950m486l3708k5096l0724m5876n3760k8581
14094b4506n293R170M4051N0731K5060K2133Q997q0564l9110O97K1004L6582m0884
14081B8068l0703q604L633j4256j2524j2861K1660J242L1562J2497j8168K4419
14069B5965n5199l2182J9865N686l7220j6301Q8939K1370j6119K6470K0203L9189
14057I0666k5625j6987j9678k1191l133j7925k5962O670n4757Q86L3119N2126
14045a791k6223K87k0997J7027L646k8143l7173n142l96N4341N5949l2797j2989
14032c4401l7507J5029o75N148j7288L2717M1613m4190m2814O777J9150K2695
$$ plain form
14020 -33746 24561 37451 -74 -34442 -85416 -52757 -22981 3020 -35008 -26493 -2494 -6517
14008 -6517 -41861 -131328 -109599 -52079 7388 43543 63445 11340 -5666 -19433 -76159 -121619
13996 -121619 -99802 -33144 27958 17008 14550 -30033 -79642 -49886 -26902 -44275 -48650 -46480
13984 -46480 -63368 -112930 -96589 -41106 -35857 -31589 -44178 -51901 -51489 -69416 -79759 -85731 -83017
13971 -83017 -69864 -100017 -120106 -145415 -126583 -75403 -50040 -45259 -60382 -21900 -25766 -7903
13959 -7903 -7098 -14147 -59886 -66779 -51202 -30883 -7180 -43144 -115068 -60985 -79142 -31067 2087
13946 2087 -66114 -87381 -79381 -51558 5719 69372 52498 11613 69428 66912 39369 49899
13934 49899 38839 37906 15038 -65047 -66322 -2878 -10620 -108757 -146758 -126728 -124025 -71652 -30826
$$ packed form
14020c3746N8307J2890l7525l4368n0974L2659K9776K6001l8028Q515K3999m023
14008f517l5344q9467K1729N7520N9467L6155J9902n2105j7006j3767n6726m5460
13996a21619K1817O6658O1102j0950k458m4583m9609K9756K2984j7373m375K170
13984d6480j6888m9562J6341N5483N249M268j2589p723M12j7927j0343n972K714
13971h3017J3153l0153k0089k5309J8832N1180K5363M781j5123L8482l866J7863
13959g903Q05p049m5739o893J5577K0319K3703l5964p1924N4083j8157M8075L3154
13946B087o8201k1267Q000K7823N7277O3653j6874m0885N7815k516k7543J0530
13934D9899j1060r33k2868q0085j275O3444p742r8137l8001K0030K703N2373M0826
$$ plain form
13921 -30826 -20562 -62974 -75829 -38814 -74074 -97838 -97390 -106854 -85112 -123029 -113953 -88172
13909 -88172 -39960 -47699 -2007 25325 -21128 -66596 -90290 -91412 -90649 -137470 -99167 -77129
13897 -77129 -64447 -65978 -33241 -24653 -55594 -54625 -34203 -36608 13833 45105 58723 54086 31444
13884 31444 4898 -21250 12533 20824 -11892 -48836 -84418 -133856 -123361 -137466 -19185 12537
13872 12537 4850 -9407 -16744 -6712 11665 -52219 -94472 -87416 -78724 -86088 -59100 -54230 -69606
13859 -69606 -122505 -181989 -187387 -154315 -93721 -109902 -78982 -115405 -99548 -102733 -126966 -136116
13847 -136116 -60883 26223 -47065 -98031 -68215 -85857 -90169 -94680 -72464 -96708 -68055 -47656
13835 -47656 -57771 -76161 -90621 -59111 -20031 -26023 -27877 -68305 -53222 -82773 -86659 -71344
$$ packed form
13921c0826J0264m2412j2855L7015l5260k3764M48r464K1742l7917R076K5781
13909h8172M8212p739M5692K7332m6453m5468k3694j122P63m6821L8303K2038
13897g7129J2682j531L2737Q588l0941R69K0422k405N0441L1272J3618m637k2642
13884C1444k6546k6148L3783Q291l2716l6944l5582m9438J0495j4105J18281L1722
13872A2537p687j4257p337J0032J8377o3884m2253P056Q692p364K6988M870j5376
13859f9606n2899n9484n398L3072O0594j6181L0920l6423J5857l185k4233r150
13847a36116P5233Q7106p3288n0966K9816j7642m312m511K2216k4244K8653K0399
13835d7656j0115j8390j4460L1510L9080n992j854m0428J5083k9551l886J5315
$$ plain form
13823 -71344 -65418 -52779 -72895 -59017 -25292 36346 38295 4866 -18455 -37380 -30252 20218
13811 20218 39782 -8276 -42826 -58506 -43571 -3443 -32692 -27936 -29014 -40990 -25775 8021
13799 8021 7073 -2884 29662 73424 47970 26240 28913 3789 -26970 -50438 -40469 -17860 6251
13786 6251 49144 86138 116789 61433 -33844 -41616 -3919 68054 43721 -39593 -27883 999
13774 999 -13228 3298 7597 1160 6718 65765 12323 -29502 -62307 -54932 -73196 -93092 -51962
13761 -51962 -38918 -21835 -14845 16849 17055 21046 47990 31595 18528 -37576 -36011 -17984 26412
13748 26412 13744 -30215 18285 23971 19593 49530 72247 73800 98039 68932 116693 154532
13736 154532 140070 101806 104265 61294 13471 3438 66215 138244 152950 152633 232365 289345
$$ packed form
13823g1344N926J2639k0116J3878L3725O1638J949l3429k3321j8925P128N0470
13811B0218J9564m8058l4550j5680J4935M0128k9249M756j078j1976J5215L3796
13799H021r48r957L2546M3762k5454k1730K673k5124l0759k3468R969K2609K4111
13786F251M2893L6994L0651n5356r5277p772L7697P1973k4333q3314J1710K8882
13774I99j4227J6526M299o437N558N9047n3442m1825l2805P375j8264j9896M1130
13761e1962J3044J7083O990L1694K06L991K6944j6395j3067n6104J565J8027M4396
13748B6412j2668m3959M8500N686m378K9937K2717J553K4239k9107M7761L7839
13736A54532j4462l8264K459m2971m7823j0033O2777P2029J4706l17P9732N6980
$$ plain form
13724 289345 329774 346608 320646 333797 402865 438265 412660 447924 518734 503941 541855
13713 541855 578736 613795 617954 728817 717784 675875 662743 631468 513747 449377 466097
13702 466097 400689 364076 320979 310681 300018 277693 282128 296202 286679 288501 206622 200622
13690 200622 200689 177721 141651 95702 67074 22946 24079 17172 939 -6435 -32147 -21833 -28503
13677 -28503 -71434 -101060 -49646 -13628 -17293 -20131 -31311 -18135 -40057 -32225 -27303 19585
13665 19585 33361 52108 32238 -28383 -54207 -30567 51220 92315 109808 105111 36893 -173
13653 -173 -24958 -72197 -59537 -52467 -67385 -50760 -86912 -103499 -124246 -63577 15011 -38397
13641 -38397 -132166 -72183 -78009 -72888 -95906 -111027 -118313 -143049 -184994 -185826 -193940 -222412 -175057
$$ packed form
13724B89345M0429J6834k5962J3151O9068L5400k5605L5264P0810j4793L7914
13713E41855L6881L5059M159J10863j1033m1909j3132l1275j17721o4370J6720
13702D66097o5408l6613m3097j0298j0663k2325M435J4074r523J822q1879o000
13690B00622O7k2968l6070m5949k8628m4128J133o907j6233p374k5712J0314o670
13677b8503m2931k9626N1414L6018l665k838j1180J3176k1922P832M922M6888
13665A9585J3776J8747j9870o0621k5824K3640Q1787M1095J7493m697o8218l7066
13653a73k4785m7239J2660P070j4918J6625l6152j6587k0747O0669P8588n3408
13641c8397r3769N9983n826N121k3018j5121p286k4736m1945q32q114k8472M7355
$$ plain form
13628 -175057 -140569 -91204 -58728 -95814 -67837 -34456 -30015 -79171 -101958 -156130 -157353 -159572
13616 -159572 -149578 -111677 -85329 -101816 -104687 -104327 -94917 -39748 -51505 -71864 -79108 -72832 -52447
13603 -52447 -25991 -63047 -92444 -68080 -45189 -79386 -28466 -52546 -109706 -117274 -115413 -148637
13591 -148637 -115728 -57516 -68217 -41801 -19071 -69089 -59091 -107809 -69359 -75607 -73417 -67015
13579 -67015 -73531 -82504 -83914 -62094 -77950 -107057 -89509 -63882 -62394 -61104 -14611 -56180 -106563
13566 -106563 -87130 -83092 -65053 -64954 -87235 -102197 -141843 -169117 -130964 -94098 -52280 -74414
13554 -74414 -86114 -60590 -30489 -60691 -78632 -25852 -25193 -42426 -15573 -13289 -46277 -90720
13542 -90720 -105612 -151529 -173824 -166811 -188457 -125782 -127150 -123127 -106838 -128636 -144644 -129828
$$ packed form
13628a75057L4488M9365L2476l7086K7977L3381M441m9156k2787n4172j223k219
13616a59572R994L7901K6348j6487k871L60R410N5169j1757k0359p244O276K0385
13603e2447K6456l7056k9397K4364K2891l4197N0920k4080n7160p568J861l3224
13591a48637L2909N8212j0701K6416K2730n0018R998m8718L8450o248K190O402
13579f7015o516q973j410K1820j5856k9107J7548K5627J488J290M6493m1569n0383
13566a06563J9433M038J8039R9k2281j4962l9646k7274L8153L6866M1818k2134
13554g4414j1700K5524L0101l0202j7941N2780O59j7233K6853K284l2988m4443
13542i0720j4892m5917k2295P013k1646O2675j368M023J6289k1798j6008J4816
$$ plain form
13530 -129828 -77166 -19484 21371 -34705 -63433 -125018 -128865 -52851 11674 13441 -15821 -43545
13518 -43545 -56245 -39799 -7574 -38102 -35545 -82383 -103698 -82588 -79619 -9703 -35812 -104384
13506 -104384 -113773 -106251 -116970 -90263 -94333 -148553 -175309 -121951 -130756 -139777 -71877 -13670
13494 -13670 14284 40937 55297 20879 8953 43133 50118 20203 -5899 -16449 1584 17521
13482 17521 16429 8971 14633 6901 16782 19478 16722 -31967 -17965 -624 67834 49966 100156
13469 100156 115723 117121 78527 3208 -16628 -53269 -38472 -44293 8985 24637 84316 88627
13457 88627 90194 137089 94176 50361 50593 99611 169324 139577 123135 150594 137733 142036
13445 142036 165761 164441 166968 186590 192030 217402 326799 376140 378424 406898 452053 436615
$$ packed form
13530a29828N2662N7682M0855n6076k8728o1585l847P6014O4525J767k9262k7724
13518d3545j2700J6446L2225l0528K557m6838k1315K1110K969O9916k6109o8572
13506a04384r389P522j0719K6707m070n4220k6756N3358q805r021O7900N8207
13494a3670K7954K6653J4360l4418j1926L4180O985k9915k6102j0550J8033J5937
13482A7521j092p458N662p732R881K696k756m8689J4002J7341O8458j7868N0190
13469A00156J5567J398l8594p5319j9836l6641J4797n821N3278J5652N9679M311
13457H8627J567M6895m2913m3815K32M9018O9713k9747j6442K7459j2861M303
13445A42036K3725j320K527J9622N440K5372J09397M9341K284K8474M5155j5438
$$ plain form
13433 436615 408447 425351 384634 358057 345562 345401 359935 409638 442265 501262 567685 587542
13421 587542 620730 652562 746299 720345 715553 769789 824123 845766 885873 869509 856380 845343
13409 845343 868994 843836 803026 763381 818931 870186 900230 884561 838806 870699 817501
13398 817501 730892 671173 629055 519400 483854 485771 545716 511547 479442 450268 430251
13387 430251 447071 465825 415872 397702 374026 332967 286870 290416 274977 219255 152555 133504
13375 133504 171749 184564 189406 165988 127101 130907 123584 143100 181359 207354 160576 113953
13363 113953 110636 116056 44854 31494 63299 52817 6845 -9181 -45260 -62892 -72485 -58756
13351 -58756 -3922 56681 43467 23947 33161 4628 -5019 -16706 -34370 11487 97885 114156
$$ packed form
13433D36615k8168J6904m0717k6577j2495j61J4534M9703L2627N8997O6423J9857
13421E87542L3188L1832R3737k5954m792N4236N4334K1643M0107j6364j3129j1037
13409H45343K3651k5158m0810l9645N5550N1255L0044j5669m5755L1893n3198
13398H17501q6609n9719m2118j09655l5546J917N9945l4169l2105k9174k0017
13387D30251J6820J8754m9953j8170k3676m1059m6097L546j5439n5722o6700j9051
13375A33504L8245J2815M842k3418l8887L806p323J9516L8259K5995m6778m6623
13363A13953l317N420p1202j3360L1805j0482m5972j6026l6079j7632r593J3729
13351e8756N4834O0603j3214j9520R214k8533r647j1687j7664M5857Q6398J6271
$$ plain form
13339 114156 143054 168684 160370 117849 107123 130044 134148 130961 80768 122387 164038 156719
13327 156719 126136 99119 63228 2670 -21624 16835 50852 69063 54696 -23058 -72871
13316 -72871 -46185 -19683 -8820 31457 -34550 -100074 -78143 -52500 -27064 -18196 -14602 25049
13304 25049 21851 41355 61413 36175 37671 85864 164702 184660 155969 100712 78790 76971
13292 76971 67566 42530 47500 -10751 -49394 -42992 -77685 -107315 -158459 -144896 -96089 -91867
13280 -91867 -80788 -68601 -76628 -90466 -84463 -52061 -21288 -24540 -34041 -48158 -25123 -44684
13268 -44684 255 70186 57722 91863 74532 6404 -38808 -35711 -10343 13649 6669 1760
13256 1760 -25930 5999 50336 -2037 21245 20951 53290 112208 142181 119350 117239 67095
$$ packed form
13339A14156K8898K5630q314m2521j0726K2921M104l187n0193M1619M1651p319
13327A56719l0583k7017l5891o0558k4294L8459L4017J8211j4367p7754m9813
13316g2871K6686K6502J0863M0277o6007o5524K1931K5643K5436Q868L594L9651
13304B5049l198J9504K0058k5238J496M8193P8838J9958k8691n5257k1922j819
13292G6971r405k5036M970n8251l8643O402l4693k9630n1144J3563M8807M222
13280i1867J1079J2187q027j3838O003L2402L0773l252r501j4117K3035j9561
13268d4684M4939O9931j2464L4141j7331o8128m5212L097K5368K3992o980m909
13256A760k7690L1929M4337n2373K3282k94L2339N8918K9973k2831k111n0144
$$ plain form
13244 67095 18380 6641 46249 87930 93278 146253 173806 187439 216322 244143 175284 113554
13232 113554 109198 103750 124561 151594 113962 141346 105752 104463 163348 168857 171146 162770 167125
13219 167125 139296 116835 131025 168258 171671 220397 206385 187639 233539 285185 240368 197649
13207 197649 204692 229168 240840 220754 172077 122609 151341 207418 221343 146058 88371 95001
13195 95001 131758 140440 197647 222620 257569 246382 247600 247731 240822 249131 251979 264399 235813
13182 235813 205643 224794 266924 225793 174807 175111 193094 183832 167138 169539 165054 166638 173915
13169 173915 173937 233953 280517 318780 287108 311625 327594 250549 240254 314291 346060 295123
13157 295123 320816 374951 385954 416799 501681 521828 483723 479988 533310 519577 522031 495435
$$ packed form
13244F7095m8715j1739L9608M1681N348N2975K7553J3633K8883K7821o8859o1730
13232A13554m356n448K0811K7033l7632K7384l5594j289N8885N509K289q376M355
13219A67125k7829k2461J4190L7233L413M8726j4012j8746M5900N1646m4817m2719
13207A97649P043K4476J1672k0086m8677m9468K8732N6077J3925p5285n7687O630
13195I5001L6757Q682N7207K4973L4949j1187J218J31o909Q309K848J2420k8586
13182B35813l0170J9151M2130m1131n0986L04J7983r262j6694K401m485J584P277
13169A73915K2O0016M6564L8263l1672K4517J5969p7045j0295P4037L1769n0937
13157B95123K5693N4135J1003L0845Q4882K0147l8105l735N3322j3733K454k6596
$$ plain form
13145 495435 472687 515826 521661 497000 464952 432857 415941 444842 506287 476754 499490 571432
13133 571432 616704 562008 501367 531282 547189 550105 587668 608577 607532 552435 575163 657771
13121 657771 687090 733010 766504 678877 672750 723200 742485 783051 809794 821098 793561 865512
13109 865512 1001065 1033538 1055393 1083139 1108699 1128796 1173786 1222456 1242710 1224816 1228961
13098 1228961 1275925 1262147 1294518 1326806 1359181 1363109 1339437 1361533 1422009 1467378 1548616
13087 1548616 1606872 1607745 1607912 1671273 1676775 1647104 1602077 1636383 1669531 1774180 1860616 1898309
13075 1898309 1942337 1973366 2031675 2074936 2130632 2225353 2237061 2325032 2429702 2564752 2716755
13064 2716755 2876446 2977820 3010896 2998265 2998775 3041863 3122670 3245486 3415191 3560150 3670204
$$ packed form
13145D95435k2748M3139N835k4661l2048l2095j6916K8901O1445k9533K2736P1942
13133E71432M5272n4696o0641K9915J5907K916L7563K0909j045n5097K2728Q2608
13121F57771K9319M5920L3494q7627o127N0450J9285M0566K6743J1304k7537P1951
13109H65512J35553L2473K1855K7746K5560K0097M4990M8670K0254j7894M145
13098A228961M6964j3778L2371L2288L2375L928k3672K2096O0476M5369Q1238
13087A548616N8256Q73J67O3361N502k9671m5027L4306L3148J04649Q6436L7693
13075A898309M4028L1029N8309M3261N5696R4721J1708Q7971J04670J35050J52003
13064B716755J59691J01374L3076j2631N10M3088Q0807J22816J69705J44959J10054
$$ plain form
13053 3670204 3772717 3876325 4028034 4172666 4327953 4486878 4600297 4786672 4957482
13044 4957482 5148691 5365810 5614617 5795368 6055858 6321632 6534807 6808266 7102924
13035 7102924 7388831 7668486 7982936 8325269 8706602 9044677 9420149 9729616 10049878
13026 10049878 10487573 11008362 11524492 12027962 12557521 13274760 14038700 14634161 15082696
13017 15082696 15496215 15940515 16452222 17011496 17675782 18359511 19158326 20035223 20947845
13008 20947845 21928650 22930554 23952905 25062256 26287132 27565616 28901358 30335472
13000 30335472 31861541 33503443 35214271 36982755 38917258 41093421 43275669 45567499
12992 45567499 47982935 50633517 53451995 56292157 59305845 62447914 65841021 69405157
$$ packed form
13053C670204J02513J03608J51709J44632J55287J58925J13419J86375J70810
13044D957482J91209K17119K48807J80751K60490K65774K13175K73459K94658
13035G102924K85907K79655L14450L42333L81333L38075L75472L09467L20262
13026A0049878M37695N20789N16130N03470N29559P17239P63940N95461M48535
13017A5082696M13519M44300N11707N59274O64286O83729P98815Q76897R12622
13008B0947845R80805J001904J022351J109351J224876J278484J335742J434114
13000C0335472J526069J641902J710828J768484J934503K176163K182248K291830
12992D5567499K415436K650582K818478K840162L013688L142069L393107L564136
$$ plain form
12984 69405157 73081737 76991057 81096667 85467288 89982509 94766689 99723054 104887191
$$ packed form
12984F9405157L676580L909320M105610M370621M515221M784180M956365N164137
$$ [...]
##END NTUPLES=NMR SPECTRUM
##END=
