##TITLE=Analysis number 326921
Compound Code cc 58301
Book Reference 467/130
Project Code adrs
Chemist Name benw
##JCAMPDX= 6.0         $$ Bruker NMR JCAMP-DX V2.0
##DATA TYPE= NMR SPECTRUM
##DATA CLASS= NTUPLES
##ORIGIN= Bruker BioSpin GmbH
##OWNER= nmr
$$ XWIN-NMR		Version 3.5
$$ Thu Mar  1 13:12:22 2007 GMT Standard Time (UT+0h)  MAYBRIDGE\nmr@NMR_250MHZ
##.OBSERVE FREQUENCY= 250.131544655141
##.OBSERVE NUCLEUS= ^1H
##.ACQUISITION MODE= SIMULTANEOUS (DQD)
##.ACQUISITION SCHEME= undefined
##.AVERAGES= 16
##.DIGITISER RES= 18
##SPECTROMETER/DATA SYSTEM= dpx250
##.PULSE SEQUENCE= zg30
##.SOLVENT NAME= DMSO
##.SHIFT REFERENCE= (INTERNAL, DMSO, 0, 16.522)
##AUDIT TRAIL= $$ (NUMBER, WHEN, WHO, WHERE, WHAT)
$$ ##TITLE= Audit trail, XWIN-NMR		Version 3.5
$$ ##JCAMPDX= 5.01
$$ ##ORIGIN= Bruker BioSpin GmbH
$$ ##OWNER= nmr
$$ C:\u/data/dgb/nmr/ADRS/90/pdata/1/auditp.txt
$$ ##AUDIT TRAIL=  $$ (NUMBER, WHEN, WHO, WHERE, WHAT)
(   1,<2007-03-01 13:11:56.33 +000>,<MAYBRIDGE\nmr>,<NMR_250MHZ>,
      <created by zg, POWCHK disabled, PULCHK disabled
       configuration hash MD5:
       49 4B E0 1D 92 C2 6B 37 9F E6 65 BC 52 41 86 1D
       data hash MD5: 64K
       35 10 DD A2 B9 54 C7 9F 9E 22 92 00 B5 72 BF 6A>)
(   2,<2007-03-01 13:12:12.05 +000>,<MAYBRIDGE\nmr>,<NMR_250MHZ>,
      <Start of raw data processing
       ef LB = 0.3 FT_mod = 6 PKNL = 1 SI = 32K 
       data hash MD5: 32K
       55 7B 29 F8 7E B4 E3 26 AC 53 67 BF 13 AB DF 71>)
(   3,<2007-03-01 13:12:13.68 +000>,<MAYBRIDGE\nmr>,<NMR_250MHZ>,
      <apk 
       data hash MD5: 32K
       C3 61 AC C1 CB 24 FA 72 91 65 C3 53 C9 F6 E7 B7>)
(   4,<2007-03-01 13:12:14.68 +000>,<MAYBRIDGE\nmr>,<NMR_250MHZ>,
      <abs ABSG = 5 
       data hash MD5: 32K
       B8 34 49 B6 97 67 29 B1 7C CE EC 90 F4 35 C4 12>)
$$ ##END=
$$ 
$$ hash MD5
$$ 0B E9 6F 37 09 7D 5C 7D 9D 88 0D 82 8F 83 6A 0C
##$RELAX= 
##$RELAX= 
##$RELAX= 
##$RELAX= 
##$RELAX= 
##$RELAX= 
##$RELAX= 
$$ Bruker specific parameters
$$ --------------------------
##$DU= <C:\u>
##$EXPNO= 90
##$NAME= <ADRS>
##$PROCNO= 1
##$TYPE= <nmr>
##$USER= <dgb>
##$AMP= (0..31)
100 100 100 100 100 100 100 100 100 100 100 100 100 100 100 100 100 100 
100 100 100 100 100 100 100 100 100 100 100 100 100 100 
##$AQSEQ= 0
##$AQ_mod= 3
##$AUNM= <au_zg>
##$AUTOPOS= <3 >
##$BF1= 250.13
##$BF2= 250.13
##$BF3= 250.13
##$BF4= 250.13
##$BF5= 500.13
##$BF6= 500.13
##$BF7= 500.13
##$BF8= 500.13
##$BYTORDA= 1
##$CFDGTYP= 0
##$CFRGTYP= 5
##$CHEMSTR= <none>
##$CNST= (0..31)
1 1 145 1 1 1 1 1 1 1 1 1 1 1 1 1 1 1 1 1 1 1 1 1 1 1 1 1 1 1 1 1 
##$CPDPRG= <>
##$CPDPRG1= <>
##$CPDPRG2= <>
##$CPDPRG3= <>
##$CPDPRG4= <mlev>
##$CPDPRG5= <mlev>
##$CPDPRG6= <mlev>
##$CPDPRG7= <mlev>
##$CPDPRG8= <mlev>
##$CPDPRGB= <>
##$CPDPRGT= <>
##$D= (0..31)
0 1 0 0 0 0 0 0 0 0.06 0 0 0 0 0 0 0.0002 0 0 0 0 0 0 0 0 0 0 0 0 0 0 
0 
##$DATE= 1172754714
##$DBL= (0..7)
120 120 120 120 120 120 120 120 
##$DBP= (0..7)
150 150 150 150 150 150 150 150 
##$DBP07= 0
##$DBPNAM0= <>
##$DBPNAM1= <>
$$ [...]
##$SUBNAM7= <"">
##$SUBNAM8= <"">
##$SUBNAM9= <"">
##$SW= 20.6930455092707
##$SWIBOX= (0..15)
0 0 3 0 0 0 0 0 0 0 0 0 0 0 0 0 
##$SW_h= 5175.983436853
##$TD= 65536
##$TD0= 1
##$TE= 295.16
##$TE2= 300
##$TE3= 300
##$TEG= 300
##$TL= (0..7)
0 120 120 120 120 120 120 120 
##$TP= (0..7)
150 150 150 150 150 150 150 150 
##$TP07= 0
##$TPNAME0= <>
##$TPNAME1= <>
##$TPNAME2= <>
##$TPNAME3= <>
##$TPNAME4= <>
##$TPNAME5= <>
##$TPNAME6= <>
##$TPNAME7= <>
##$TPOAL= (0..7)
0.5 0.5 0.5 0.5 0.5 0.5 0.5 0.5 
##$TPOFFS= (0..7)
0 0 0 0 0 0 0 0 
##$TUNHIN= 0
##$TUNHOUT= 0
##$TUNXOUT= 0
##$USERA1= <user>
##$USERA2= <user>
##$USERA3= <user>
##$USERA4= <user>
##$USERA5= <user>
##$V9= 5
##$VALIST= <valist>
##$VCLIST= <CCCCCCCCCCCCCCC>
##$VD= 0
##$VDLIST= <DDDDDDDDDDDDDDD>
##$VPLIST= <PPPPPPPPPPPPPPP>
##$VTLIST= <TTTTTTTTTTTTTTT>
##$WBST= 1024
##$WBSW= 4
##$XGAIN= (0..3)
0 0 0 0 
##$XL= 0
##$YL= 0
##$YMAX_a= 283887
##$YMIN_a= -348491
##$ZGOPTNS= <>
##$ZL1= 120
##$ZL2= 120
##$ZL3= 120
##$ZL4= 120
##$ABSF1= 16.522
##$ABSF2= -4.171173
##$ABSG= 5
##$ABSL= 3
##$ALPHA= 0
##$AQORDER= 0
##$ASSFAC= 0
##$ASSFACI= 0
##$ASSFACX= 0
##$ASSWID= 0
##$AUNMP= <proc_1d>
##$AZFE= 0.1
##$AZFW= 0.1
##$BCFW= 0
##$BC_mod= 0
##$BYTORDP= 0
##$COROFFS= 0
##$CY= 12.5
##$DATMOD= 1
##$DC= 0
##$DFILT= <>
##$DTYPP= 0
##$F1P= 14.0000005364418
##$F2P= -0.99999901652339
##$FCOR= 0.5
##$FTSIZE= 32768
##$FT_mod= 6
##$GAMMA= 0
##$GB= 0
##$INTBC= 1
##$INTSCL= 1
##$ISEN= 128
##$LB= 0.3
##$LEV0= 0
##$LPBIN= 0
##$MAXI= 10000
##$MC2= 0
##$MEAN= 0
##$ME_mod= 0
##$MI= 0
##$NCOEF= 0
##$NC_proc= -6
##$NLEV= 6
##$NOISF1= 0
##$NOISF2= 0
##$NSP= 0
##$NTH_PI= 0
##$NZP= 0
##$OFFSET= 16.522
##$PC= 1
##$PHC0= 210.9632
##$PHC1= 12.55085
##$PH_mod= 1
##$PKNL= yes
##$PPARMOD= 0
##$PSCAL= 4
##$PSIGN= 0
##$REVERSE= no
##$SF= 250.13
##$SI= 32768
##$SIGF1= 0
##$SIGF2= 0
##$SINO= 400
##$SIOLD= 32768
##$SREGLST= <1H.DMSO>
##$SSB= 0
##$STSI= 32768
##$STSR= 0
##$SW_p= 5175.98343685301
##$SYMM= 0
##$S_DEV= 0
##$TDeff= 65536
##$TDoff= 0
##$TI= <Analysis number 999999
Compound Code 99
Book Reference 9
Project Code 9>
##$TILT= no
##$TM1= 0
##$TM2= 0
##$TOPLEV= 0
##$USERP1= <user>
##$USERP2= <user>
##$USERP3= <user>
##$USERP4= <user>
##$USERP5= <user>
##$WDW= 1
##$XDIM= 32768
##$YMAX_p= 464018261
##$YMIN_p= -922658
$$ End of Bruker specific parameters
$$ ---------------------------------
##NTUPLES= NMR SPECTRUM
##VAR_NAME=  FREQUENCY,     SPECTRUM/REAL,   SPECTRUM/IMAG
##SYMBOL=    X,             R,               I
##VAR_TYPE=  INDEPENDENT,   DEPENDENT,       DEPENDENT
##VAR_FORM=  AFFN,          ASDF,            ASDF
##VAR_DIM=   32768,         32768,           32768
##UNITS=     HZ,            ARBITRARY UNITS, ARBITRARY UNITS
##FACTOR=    0.157963299565203, 1,           1
##FIRST=     4132.6476996994, 0,             0
##LAST=      -1043.33573715361, 0,           0
##MIN=       -1043.33573715361, -922658,     0
##MAX=       4132.6476996994, 464018261,     0
$$ Real data points
##PAGE= N=1
##DATA TABLE= (X++(R..R)), XYDATA
$$ [...]
15461B25513q8875m7003j9671j63025R0314O4298J54916o5138j48602j46431P4527
$$ 225513 136638 89635 69964 -93061 -2747 61551 216467 151329 2727 -143704 -69177
15450f9177J21666j0784K6302l5909J72059J41214o0889J79861J99074j09251
$$ -69177 52489 41705 68007 32098 204157 345371 284482 464343 663417 554166
15440E54166J29931K21225p0006l19540k45504o4520J706j93677J3914P2084J25995
$$ 554166 684097 905322 835316 515776 270272 205752 207458 13781 27695 99779 225774
15429B25774k4560J8894q7308J27444P402j49184l7470l7599O2699J14726k8791
$$ 225774 201214 220108 132800 260244 267646 118462 80992 43393 106092 220818 192027
15418A92027J72510j8957P7919J01151j64382L1838L6016L2891k0743q7840k01978
$$ 192027 364537 345580 423499 524650 360268 392106 428122 461013 440270 352430 150452
15407A50452K2949J78228n6185p1719p6058q7928L1628J30518K05979M3333N9647
$$ 150452 173401 351629 295444 223725 147667 59739 91367 221885 427864 471197 530844
15396E30844L6272j04723l8683l410j86707k11258j2403J20056q5559j51308K4468
$$ 530844 567116 462393 423710 420300 233593 22335 9932 129988 44429 -106879 -82411
15385h2411J5845K0713J98149K8616p8874J41405J40811j12271l22026j46799
$$ -82411 -66566 -45853 152296 180912 102038 243443 384254 271983 -50043 -196842
15375a96842J00274K34992R9922J11604n5600j58593k37317p0683L34619L1646
$$ -196842 -96568 138424 238346 349950 294350 135757 -101560 -172243 162376 194022
15365A94022k20614L295J63300j31097N1877O8489L6194l7691K9051J50952L8002
$$ 194022 -26592 -23297 140003 8906 60783 129272 165466 127775 156826 307778 345780
15354C45780n3203J9576j21974j69648j74169k10453R7702J02000R7324q1209
$$ 345780 292577 312153 190179 20531 -153638 -364091 -266389 -164389 -67065 -148274
15344a48274R1074m7139j00296J00244J12586J42942J44285n4592k20104K9733
$$ -148274 -57200 -104339 -204635 -104391 8195 151137 295422 240830 20726 50459
15334E0459j61167j52882q7512J23282N8140J82960J26826n6817p8837K6131L8590
$$ 50459 -110708 -263590 -351102 -227820 -169680 13280 140106 83289 4452 30583 69173
15323F9173n7426j48424K2404J61885j40050l16775P260Q6382N7319j06329J48389
$$ 69173 11747 -136677 -114273 47612 -92438 -409213 -401953 -315571 -258252 -364581 -216192
15312b16192R2981J14249n0333J3886J2923K5077n9737J9143r5880N6378J29516
$$ -216192 -123211 -8962 -59295 -45409 -32486 -7409 -67146 -48003 -143883 -87505 42011
15301D2011M3614K6700J74795q9169l29747J979K98373p4929l00336j49836m1609
$$ 42011 85625 112325 287120 197951 -131796 -129817 168556 93627 -206709 -356545 -398154
15290c98154J35399Q2851J41488n9930k23185P6756J13725K149P7706k5390k00929
$$ -398154 -262755 -179904 -38416 -98346 -321531 -244775 -131050 -128901 -51195 -76585 -277514
15279b77514J45563K19471j41476k6311l7982o4475l8218n6263l7318k4726P7113
$$ -277514 -131951 87520 -53956 -80267 -118249 -182724 -220942 -277205 -314523 -339249 -262136
15268b62136M1665l3378K42621l7070j48564N9313K26992j46581n5842J35564
$$ -262136 -220471 -253849 -11228 -48298 -196862 -137549 89443 -57138 -112980 22584
15258B2584K51218m1313o6130J191r2257J6427k7924j32296r3420K53353J40264
$$ 22584 273802 232489 166359 167550 75293 91720 63796 -68500 -161920 91433 231697
15247B31697K560J7885J66524k93042j54276j42659L6440o7668k20115m9130J11430
$$ 231697 234257 252142 418666 125624 -28652 -171311 -134871 -202539 -422654 -471784 -360354
15236c60354J76265j03887r4114M3549J27848J63552P678j44303J07504P5299
$$ -360354 -184089 -287976 -382090 -338541 -210693 -47141 -39463 -183766 -76262 -963
15226i63R1826J46024j15714j52596p8383M7893M5779n3035L4659n8573J18699
$$ -963 90863 236887 121173 -31423 -109806 -61913 -16134 -69169 -34510 -93083 25616
15215B5616K80326j2334k04203q8188n0466j12353j5219P1829J7923Q6010L2930
$$ 25616 305942 293608 89405 1217 -49249 -161602 -176821 -104992 -87069 -1059 31871
15204C1871o4971n0802N5110J80566l3881p4022q6564k563Q7673O0463M4956K5294
$$ 31871 -33100 -83902 -28792 151774 117893 43871 -42693 -45256 42417 102880 147836 173130
15192A73130j4661N4076n9094n6188J02078j36023j71755j74033m7382o6306J03875
$$ 173130 158469 212545 153451 97263 199341 63318 -108437 -282470 -329852 -396158 -292283
15181b92283K74688M8208j73850R1607J3182k8264K9361o7023O8732J49652J20045
$$ -292283 -17595 30613 -143237 -51630 -38448 -66712 -37351 -104374 -35642 114010 234055
15170B34055J49159o1383l4740p2880q0864j10895k55298J9335J35448J0568Q6214
$$ 234055 383214 321831 287091 214211 133347 22452 -232846 -213511 -78063 -67495 18719
15159A8719j39951j24881k5369j0994p3769k3304M7588J67275R5721l5377R5101
$$ 18719 -121232 -246113 -271482 -282476 -356245 -379549 -331961 -164686 -68965 -104342 -9241
15148i241K13688N42k45912N5322k1725l0072o8997K9765R5881q9466j27541l2598
$$ -9241 204447 204989 -40923 14399 -7326 -37398 -106395 -76630 19251 -70215 -197756 -230354
15136b30354R3751Q6979J58123r471n4741j2694Q2959j44099l5877K96869O8193
$$ -230354 -136603 -49624 108499 99028 44287 31593 114552 -29547 -65424 231445 299638
15125B99638p8526O946j01043j49936J15986N4328j60552N2355K27902J07433
$$ 299638 221112 228058 127015 -22921 93065 147393 -13159 39196 267098 374531
15115C74531j42354j26877J82630K07448j16254k4507L6534M5113N9917M3501
$$ 374531 232177 105300 287930 495378 379124 354617 391151 436264 496181 539682
15105E39682p5274j38393j63885n937O6896k7030n1733k37498L883L55205J14051
$$ 539682 464408 326015 162130 156193 223089 196059 144326 -93172 -89289 265916 379967
15094C79967M9445J28386P299j48861j5752J13105j7147M5007O030J72894L5538
$$ 379967 429412 557798 565097 416236 400484 513589 496442 541449 547479 720373 755911
15083G55911N8441k6047j56611J46172P8247J81575J60573J27418J86886K70091
$$ 755911 814352 788305 631694 777866 856113 1037688 1198261 1325679 1512565 1782656
15073A782656J23367K55329L95644L98852M99414O62650Q21302J069637J470463
$$ 1782656 1906023 2161352 2556996 2955848 3455262 4117912 4939214 6008851 7479314
15064G479314J893624J972059K379482K853107L010196K970361K574825K143296
$$ 7479314 9372938 11344997 13724479 16577586 19587782 22558143 25132968 27276264
15056B7276264R05216l47087j111234j665502k021153k025393k171381j879806
$$ 27276264 28181480 27834393 26723159 25057657 23036504 21011111 18839730 16959924
15048A6959924j470941r24612p41822k63587o2005N35632O52228R18093J086352
$$ 16959924 15488983 14564371 13822549 13558962 13496957 14032589 14684817 15602910 16689262
15039A6689262J710275K541132L503484M166301M945253O006745O603952N827312
$$ 16689262 18399537 20940669 24444153 28610454 33555707 39562452 46166404 51993716
15031E1993716M799748L174674R64561j673565l671848m857219n571499n452459
$$ 51993716 56793464 59968138 60932699 59259134 55587286 50730067 45158568 39706109
15023C9706109m623208l833226l062496k322089j728521j340553q00501m31764
$$ 39706109 35082901 31249675 28187179 25865090 24136569 22796016 21995515 21563751
15015B1563751m6959M83053Q04783J279393J776689K477325L433557M642149N670724
$$ 21563751 21516792 21999845 22804628 24084021 25860710 28338035 31771592 36413741 42084465
15006D2084465O442791P321550P649334P233274O222521M999312L194750P70460
$$ 42084465 48527256 55848806 63498140 70731414 76953935 81953247 85147997 85918457
14998H5918457j684594m189792n899206p007820o995731o476811n842395m616759
$$ 85918457 84233863 80044071 74144865 67137045 60141314 53664503 47822108 43205349
14990D3205349l414526k618549j835910j112855p88507m8571P26563J492303K456326
$$ 43205349 39790823 37172274 35336364 34223509 33435002 33386431 34112994 35605297 38061623
14981C8061623L813862N209678O957057R060897J0927467J2520985J2844616J2015452
$$ 38061623 41875485 47085163 54042220 63103117 74030584 86551569 99396185 111411637
14973A11411637R326551N174100L27775m758063q783787j1274063j2212418j1755307
$$ 111411637 120738188 125912288 126240063 121482000 112698213 101424150 89211732 77456425
14965G7456425r938014p985352o213528m928297l764605k655796k043475j367833
$$ 77456425 67518411 59533059 53319531 48391234 44626629 41970833 39927358 38559525
14957C8559525r90841l75385N48732J516493K280734L200576M633047N924101
$$ 38559525 37568684 37193299 37742031 39258524 41539258 44739834 49372881 55296982
14949E5296982P028674P514033P152017O074724M429613K365994k6381k297220
$$ 55296982 62325656 69839689 76991706 83066430 87496043 89862037 89835656 87538436
14941H7538436m228245n753806o815982p042073p027903o543011n707503m961922
$$ 87538436 83310191 77556385 70740403 63698330 56670427 50127416 44419913 39457991
14933C9457991m091257l172130k199445j714271j322639r32107o47406j19478
$$ 39457991 35366734 32194604 29995159 28280888 26958249 26026142 25378736 25259258
14925B5259258K51480Q28990J598058K384942L475737M476051N390994N896956
$$ 25259258 25510738 26339728 27937786 30322728 33798465 38274516 43665510 49562466
14917D9562466O290593N594768L952961J964693n51983l185094n029250o055980
$$ 49562466 55853059 61447827 65400788 67365481 66813498 63628404 58599154 52543174
14909E2543174o313406o060848n143169m308260l280052k338393j886525j624867
$$ 52543174 46229768 40168920 35025751 30717491 27437439 25099046 23212521 21587654
14901B1587654j042948o94036o07742j86297K14799N63222R18799J275844J818594
$$ 21587654 20544706 19850670 19242928 19056631 19271430 19834652 20753451 22029295 23847889
14892B3847889K138810K248889K254659J809832J173173J57359j190241j864809
$$ 23847889 25986699 28235588 30490247 32300079 33473252 33630611 32440370 30575561
14884C0575561k535913l126545l027390k531102k218405k088881j625607j265334
$$ 30575561 28039648 24913103 21885713 19354611 17136206 15047325 13421718 12156384
14876A2156384r57854j026695o90026q75171q69096o56943o15875n51749n68170
$$ 12156384 11198530 10171835 9481809 8606638 7737542 7080599 6464724 5912975 5344805
14867E344805n71972k98214k34197k64360j94533k05675k66833k74044j53016
$$ 5344805 4772833 4474619 4240422 3976062 3781529 3575854 3309021 3034977 2881961
14858B881961L990p6094j46961k06950k1939j74089K4304j83796j93698l1989
$$ 2881961 2885951 2809857 2662896 2455946 2434007 2259918 2284222 2100426 1906728 1874739
14848A874739J23557j9098P9626k8373j30687j03545r9775k42574j69703m13q3278
$$ 1874739 1998296 1979198 2058824 2030451 1899764 1796219 1696444 1453870 1284167 1283754 1200476
14837A200476J4298J30311L9399k36976n8273J12536r3016j65400L2164k7244
$$ 1200476 1214774 1345085 1384484 1147508 1089235 1201771 1108755 943355 975519 948275
14827I48275J11496K2501n548o6557N5001N6958k08640k09367J6507k2945K58367
$$ 948275 1059771 1082272 1076724 1010167 1065168 1122126 913486 704119 720626 697681 956048
14816I56048J90680p5626j05146m6561m8205j02773k5865J6481p5476l1960p786
$$ 956048 1146728 1071102 965956 919395 871190 768417 742552 759033 683557 651597 643811
14805F43811R1481J66548Q6056K7578r158j37455j56640N4927m0553L2288n94
$$ 643811 735292 901840 987896 1015474 1006316 868861 712221 767148 726595 758883 758289
14794G58289K68761m2954k36357j27298N868J53007j65057p9442J36935Q8908
$$ 758289 1027050 984096 747739 620441 626309 779316 614259 534817 671752 760660
14784G60660q9314j02710j1511M2925j2830L7475k37201l23728N3155J54176J21683
$$ 760660 671346 568636 557125 600050 587220 624695 387494 63766 116921 271097 392780
14773C92780j5731n0284n0475j0577J49948P1749J8824l3032p7608M7637p3864
$$ 392780 377049 326765 276290 265713 415661 487410 506234 473202 395594 443231 369367
14762C69367n9350N3392K62408J57767J4859p8658k39753k28031j31237p6341
$$ 369367 310017 363409 625817 783584 798443 719785 480032 252001 120764 44423
14752D4423L1377J13074J5789J62811P9929J7185J9998K3194j81962N883q1935
$$ 44423 75800 188874 204663 367474 447403 464588 484586 507780 325818 331701 249766
14741B49766l1467l4877J60557k5018l6337N3114J34206J56908k2243O2288Q0004
$$ 249766 218299 183422 343979 318961 282624 335738 469944 626852 604609 666897 746901
14730G46901l1156k36250J9398J79617R422q28m0929j26656k86777j89410l9656
$$ 746901 715745 479495 498893 678510 687932 687104 646175 519519 232742 43332 3676
14719C676r8031J73364K16654n8727p9072J64631k6810q0891Q1946J12148j21046
$$ 3676 -94355 79009 295663 236936 157864 322495 295685 214794 296740 408888 287842
14708B87842j33848j0382n4788J50201M3586j15876M911K4052J73611M9150j21084
$$ 287842 153994 143612 88824 239025 282611 166735 171646 195698 369309 418459 297375
14697B97375j79872k44294M0825J20747O7148J26624J31854k07131J3114J76222
$$ 297375 117503 -126791 -85966 34781 101929 228553 360407 153276 166390 342612
14687C42612R0194K3230n3916k58182L6510J39318j45965k24612J23297L2234
$$ 342612 432806 456036 402120 143938 180448 319766 173801 -50811 72486 104720
14677A04720R4489J97707J54904L00n8745l3685o6582l4318K7966j16839r1872
$$ 104720 199209 396916 551820 552120 493375 459690 393108 358790 386756 269917 178045
14666A78045J26683M5497j229M0541j63234j84160j47297R9307P6017K8264O1245
$$ 178045 304728 350225 348996 389537 226303 42143 -105154 -5847 70170 98434 159679
14655A59679N4996L8803J69514k6136P9013p8456q1216o2435j75082j06007J40872
$$ 159679 214675 253478 422992 396856 475869 397413 316197 253762 78680 -27327 113545
14644A13545j2352K5557M4325O6696r0534J2083n1667R080k8939J46522N2014
$$ 113545 101193 126750 171075 237771 147237 159320 107653 116733 87794 234316 286330
14633B86330M1552l142N8434R9668Q50r5656k0052o968j24177j6460q6240j73566
$$ 286330 327882 324740 383174 482842 483692 388036 367984 361016 236839 220379 134139 -39427
14621c9427r8407J70984K61817p6844k01716r5338o8874J46689J41960M9898k41701
$$ -39427 -137834 33150 294967 218123 16407 -78931 -147805 -1116 140844 190742 -50959
14610e0959m9641P0536M2008k769J29356Q1294L765j33630k7894K3125M6542J41481
$$ -50959 -100600 -30064 11944 9175 138531 219825 223590 89960 62066 85191 131733 273214
14598B73214K9582l4341j06107l2186R2762K15779j64566j47454j75631M2415
$$ 273214 302796 268455 162348 130162 222924 438703 274137 126683 -48948 -6533
14588f533J17941n717R7707m5323M243J8131j00379j64151J74660J72780K66368
$$ -6533 111408 105691 203398 158075 162318 180449 80070 -84081 90579 263359 529727
14577E29727L3019m618p1658J10467p8745k25267L5176k5994j81355L168K09144
$$ 529727 562746 558128 486470 596937 518192 292925 328101 302107 120752 123920 333064
14566C33064J68451o0621k10987r196O7619Q9182J88554N7211o5321o1922n0050
$$ 333064 501515 440894 229907 220711 288330 377512 566066 623277 557956 496034 445984
14555D45984k69516j6110K14834K17682O9302j02408j09050j22211L49m3102k5879
$$ 445984 176468 160358 375192 592874 662176 559768 450718 328507 328856 285754 259875
14544B59875k08145n5520p4514J48406K35906q6334k3095q422n6363j44851K65404
$$ 259875 51730 -3790 -78304 70102 306008 219674 196579 188157 131794 -13057 252347
14533B52347Q9772k3611K8923J7022K5118M6064n3219o1239N4753L15055j2496
$$ 252347 342119 318508 347431 364453 389571 435635 382416 321177 375930 690985 678489
14522F78489j71270j36539k2378j69959j5719J20968J04303J50675r5138r3865
$$ 678489 507219 370680 348302 178343 162624 283592 387895 538570 443432 349567
14512C49567N2663j26994J32002J78342m096l07212l81387J10351K70854K93709
$$ 349567 402230 275236 407238 585580 581484 274272 -107115 3236 274090 567799
14502E67799o5130R953P2361j6248n4870J98079O7595j9169k1482N569l6883j05661
$$ 567799 502669 512622 584983 568735 513865 711944 779539 760370 738888 744457 707574 601913
14490F01913n6250J9727L8825j81736j32874q735Q1429p358J01618J26154j12787
$$ 601913 545663 565390 604215 422479 289605 280870 362299 354941 456559 582713 469926
14479D69926l4153P9451J08688J01701p8828K3227O7224j97618j13678J30017
$$ 469926 435773 515224 623912 725613 646785 670012 737236 539618 425940 555957
14469E55957K4550m014J68046r283r5579j51092j24659j86783j57073m0439N6538
$$ 555957 580507 576493 744539 735256 639677 488585 363926 177143 20070 -20369 36169
14458C6169R9919r6022M5596K14664Q0455k74212j24141Q1920O7810J7061m6653
$$ 36169 136088 40066 85662 300326 380781 106569 -17572 64348 132158 149219 102566
14447A02566m6417J24102q7610q0024R4974L33487K6958M7907Q7125r0667o5003
$$ 102566 56149 180251 92641 12617 107591 441078 468036 515943 603068 512401 447398
14436D47398M820l6991J06778Q8701k74332j19425j3967j28810O6667Q4080k3381
$$ 447398 452218 415227 522005 610706 336374 216949 202982 74172 140839 224919 201538
14425B01538P4046q9977r8332J47972j45975k36088r565J35617J7575K29013K85758
$$ 201538 275584 185607 87275 235247 89272 -146816 -156381 -20764 -3189 225824 511582
14414E11582r3129j76897O6159J1219q058K791k1889o8497n3353J08584K24659
$$ 511582 418453 241556 307715 318934 310876 313667 291778 223281 169928 278512 503171
14403E03171j48885j50174N5662k8825k22639j19648J18452R2060K6922O8899
$$ 503171 354286 204112 259774 230949 8310 -111338 7114 99174 126096 194995
14393A94995l8955n0214J45230J50049j74370j45544n67J03433K38506p1177n5518
$$ 194995 156040 105826 251056 401105 226735 81191 80624 184057 422563 351386 295868
14382B95868q747J9153j62308j27394q233J71454j42387j26787J54840J48463
$$ 295868 287121 306274 143966 16572 8339 179793 37406 -89381 65459 213922
14372B13922n8490k44962j15075K9827R7493k47268k6357J96269R4177J88326
$$ 213922 155432 -89530 -204605 -174778 -77285 -324553 -350910 -154641 -60464 127862
14362A27862n7266m4840Q7080p8582K954j51257O0144K91179q5299k32217j31482
$$ 127862 70596 25756 112836 34254 37208 -114049 -53905 237274 151975 -80242 -211724
14351b11724K71732J01368Q3415R314l7869O535j35896M8687L0504N646L3882
$$ -211724 60008 161376 244791 254105 216236 222771 86875 135562 166066 171712 205594
14340B05594n8222j92288L1025O1799J58436P2529p7251L5097J66194j04176k49217
$$ 205594 147372 -44916 -13891 47908 206344 278873 201622 236719 402913 298737 49520
14329D9520j31286O3459q3711j25271L5018J25659K23347P5729Q4046J7710j11406
$$ 49520 -81766 -18307 -102018 -227289 -192271 -66612 156735 232464 316510 334220 222814
14318B22814q9795J0033j83430J12721O8253J12849K3254j81929k25252L5088
$$ 222814 133019 143052 -40378 72343 140596 253445 276699 94770 -130482 -95394
14308i5394J35477R2674R8810K48609J8185l44535p1961N1842k89033j47595J53282
$$ -95394 40083 132757 231567 480176 498361 153826 81865 133707 -155326 -302921 -149639
14297a49639J95694j61960O8178K31869J24230M2370l7817j14843k9947Q236J37660
$$ -149639 46055 -115905 -47727 184142 308372 350742 312925 198082 168135 176371 314031
14286C14031J770O3589J2111k4106J5277j18581J72244m8774k9419o6981l7544
$$ 314031 315801 379390 391501 367395 382672 264091 436335 387561 358142 291161 253617
14275B53617L434Q7406l4314M101n9973o4066Q372J25016J13856l3302j89980
$$ 253617 257051 344457 310143 314244 254271 190205 198577 323593 437449 404147 214167
14264B14167q5653j17543j05151J66938J53596J32118P8513l743m7208j97143
$$ 214167 128514 10971 -94180 72758 226354 358472 436985 433242 386034 188891
14254A88891N658J10524j8531k54699k84542q6529N8450J82276R5244Q1316J55562
$$ 188891 194549 305073 286542 31843 -252699 -339228 -280778 -98502 -3258 78058 233620
14243B33620j30343J37155J45870r1940k31065j30990L56024p792j49001j22655
$$ 233620 103277 240432 386302 294362 63297 -67693 288331 280539 131538 8883
14233H883J77292J36042k4694j67751q1996J31175J09923p0094j3158j4092j25064
$$ 8883 186175 322217 297523 129772 47776 178951 288874 218780 205622 191530 66466
14222F6466j3478J17149K61840o0920j72892l0613O3951R7590O1532m9654K0986
$$ 66466 52988 170137 431977 371057 198165 167552 231503 329093 390625 340971 361957
14211C61957q1919j24623p1754j58827K2010K8445Q6045P019J6637n3645P638
$$ 361957 280038 155415 83661 -75166 -53156 -24711 61334 68353 84990 31345 38983
14200C8983N6771o2432J0364J71859j06825o1991N4453K3979J14619j4752j0063
$$ 38983 95754 33322 43686 215545 108720 46729 101182 125161 239780 225028 214965
14189B14965N6396j39478j30175p0302L718J84994J88481o1504m6958J08008q7241
$$ 214965 271361 131883 1708 -68594 -64876 120118 308599 247095 200137 308145 220904
14178B20904q0348k7026K3602k10634m4421k9847O2743J51740J91937n4473N0056
$$ 220904 140556 113530 137132 -73502 -117923 -147770 -85027 66713 258650 204177 254233
14167B54233q7047k6571K31795J42140j39063j39689j38350l4414K7575J33036
$$ 254233 167186 140615 372410 514550 375487 235798 97448 63034 90609 223645
14157B23645J6485O426k9650k17606M2893J86507J28592J54553r5922k61553p9602
$$ 223645 240130 246556 216906 -700 42193 228700 357292 511845 415923 154370 74768
14146G4768m1570J50851r810K8846J6365p1485j4202j6004L323O7758j10323j4984
$$ 74768 33198 184049 174239 203085 219450 147965 133763 117759 121082 188840 78517 63533
14134F3533m5773q3231J68496K8596k2879o648K13519J95595j89270l70161j07082
$$ 63533 17760 -65471 103025 131621 108742 102094 315613 511208 321938 -48223 -155305
14123a55305J52324J80130L7993p9894Q6825L1316k8462r2847k06394j31342K3070
$$ -155305 -2981 177149 215142 135248 222073 253389 224927 132080 -74314 -205656 -182586
14112a82586N0830M3361j42551K0597Q8016N3720O5158p8694l1510J09676J3662
$$ -182586 -131756 -88395 -230946 -210349 -122333 -68613 -3455 -82149 -113659 -3983 9679
14101I679j28225p23M9230J54389J93766l079l3856l9772l7270O6791O423l6551
$$ 9679 -118546 -119269 -70039 84350 278116 275037 241181 201409 164139 230930 237353 200802
14089B00802Q8937J89143r4553j71936j20638J27990M1338p6102k6642N328j76476
$$ 200802 289739 478882 384329 212393 91755 219745 261083 184981 158339 163667 -12809
14078a2809K980O0946L0382Q4637K32594o4704R4567R5203j08416j59285j02317
$$ -12809 -9829 51117 81499 166136 398730 334026 428593 523796 415380 256095 153778
14067A53778K0845P4032K3310Q4968M6831j58164J8104J40308M147l01453r8274
$$ 153778 174623 248655 271965 356933 403764 245600 263704 404012 408159 106706 8432
14056H432L8749J6492J34775n5714J012l0732K4738M5123O8527l6211N4985l307
$$ 8432 47181 63673 198448 142734 143746 113014 137752 182875 251402 215191 270176 266869
14044B66869p318q0230K5480n0311N3053K1241N13J327J94189J55247j07822j63503
$$ 266869 259551 179321 204801 154490 207543 228784 229297 230624 424813 580060 472238 308735
14032C08735j37285r1580j63376k93673M6246J79250K44058K41883j0025r8107
$$ 308735 171450 79870 -83506 -377179 -330933 -151683 92375 334258 324233 226126
14022B26126j59715j26191k7686R3085J46575N3114l26516k72072N9853K34045
$$ 226126 66411 -59780 -87466 5619 152194 205308 -121208 -393280 -333427 -99382
14012i9382Q2298L21497j7581L1161j40050q6631m3154j04799k4053K0040M519
$$ -99382 -17084 304413 286832 317993 177943 91312 48158 -56641 -80694 -60654 -56135
14001e6135J33175J77587j82567l9890K22543J44301o5796o0345J09761j0625
$$ -56135 77040 254627 72060 32170 254713 399014 333218 272873 382634 372009
13991C72009j95744Q7006J22754n0845J83575R8817k6713P253p6447o8934j75403
$$ 372009 176265 263271 386025 335180 518755 617572 590859 598112 521665 452731 277328
13980B77328J22571K5669k6369O195j70496n697O2058o7225J55488j03250l23402
$$ 277328 399899 425568 399199 405394 234898 229201 291259 224034 379522 276272 -47130
13969d7130n0543J62746J59186n0094J2058R9800J37553j9826O8943N1479j31100
$$ -47130 -97673 65073 224259 174165 186223 286023 423576 403750 472693 524172 393072
13958C93072j68234J28262J17653M0739R0678k71945j51572K10242O0477J50898
$$ 393072 224838 353100 470753 511492 602170 330225 178653 388895 449372 600270
13948F00270N3907j68602k82171j83854m827J09046N3235m8991r382j09442k46133
$$ 600270 654177 485575 203404 19550 14723 123769 177004 128013 118631 9189 -236944
13937b36944J0302O3224M10292J84664j16025k16621J45186J32803j34204p0744
$$ -236944 -226642 -163418 246874 431538 315513 98892 244078 376881 242677 171933
13927A71933k2013R2536n1411L3215j6691n1557l1953o4393J39672J36853j79575
$$ 171933 149920 242456 191045 224260 207569 156012 124059 59666 199338 336191 156616
13916A56616j33560N2611L3398R6875q2688k36148P7761J22472l5093l0395Q8095
$$ 156616 23056 75667 109065 205940 123252 -112896 -35135 87337 52244 21849 109944
13905A09944J58834j9059j7779r0714j08346o2419J44618J07164J50075L5416
$$ 109944 268778 249719 231940 141226 32880 -29539 115079 222243 372318 407734
13895D07734M6289J74857L9426k06347j30746j85954K0238k7172J7903r661J1202
$$ 407734 454023 628880 668306 461959 331213 145259 165497 138325 156228 146567 157769
13884A57769m0395P955L0662j4616N1851o2789J16363J57793J36008j1805j02696
$$ 157769 117374 125329 155991 141375 193226 130437 246800 404593 540601 528796 426100
13873D26100j44876j67176J57910K2081j61892J58751r877j53351j03322r3647
$$ 426100 281224 114048 271958 294039 132147 290898 281021 127670 24348 -69299
13863f9299R8476R3576r0057J52909J13524K3434o1447k28574n2025M328O0469
$$ -69299 29177 122753 32696 185605 299129 322563 261116 32542 -19483 -15155 45314
13852D5314k50405k11081K23364J44888Q5562o7580M3048R3796p5767m8187J93280
$$ 45314 -205091 -416172 -192808 -47920 37642 -29938 13110 106906 31139 -17048 176232
13841A76232J18953K23945Q1450N5158j10779j98079p1573L5207o9427r221j42012
$$ 176232 295185 519130 600580 655738 544959 346880 275307 310514 241087 231866 89854
13830H9854o9375J80870J73662r1941O4153J11976K5515j86393l4884Q8168r6127
$$ 89854 20479 201349 375011 283070 347223 459199 484714 298321 263437 351605 255478
13819B55478j09361k2555Q9778p0477J6764M0289q6022p7576M1726q1626q7160
$$ 255478 146117 123562 213340 142863 159627 199916 113894 36318 78044 -3582 -90742
13808i0742K9165J00903K13384J85757j09351j15868p0368J76803J07462K9696
$$ -90742 -61577 39326 252710 438467 329116 213248 142880 319683 427145 456841
13798D56841l79021k45039J59919J61161R0803K4623j23657j58114P8535J05166
$$ 456841 77820 -167219 -7300 153861 244664 269287 145630 -12484 66051 171217
13788A71217n0054j6329O7313J97421Q3385n7976j54152k3946M7715J37245P0940
$$ 171217 121163 104834 172147 369568 452953 394977 240825 216879 264594 401839 472779
13777D72779L8502n5531j3649M4944k70039j22250q4444J6368J34020n0583J02171
$$ 472779 511281 455750 442101 487045 217006 94756 10312 26680 160700 110117 212288
13766B12288R3772Q1690P9963L1197j99318R0323O8762j87446k70553j87464L12671
$$ 212288 306060 387750 467713 498910 299592 389915 458677 271231 678 -186786 125885
13755A25885M0820P4512j4517k04880j16256L2054j3839J03241J21091L6669N5692
$$ 125885 166705 241217 226700 21820 -94436 -62382 -76221 27020 148111 184780 240472
13744B40472P5167r7662L5673j5016j18790j03726J13590l1868K9589Q3970l2010
$$ 240472 315639 217977 253650 238634 119844 16118 129708 97840 127429 211399 179389
13733A79389r1366j01966P6174L1257K13891O7820l0970j3540j3554j3494O3274
$$ 179389 88023 -13943 62231 93488 307379 375199 344229 330689 317135 303641 366915
13722C66915l6307j13450j76655J3213k7503L2207K0156q8256K35118J2037o5568
$$ 366915 330608 217158 40503 53716 26213 58420 78576 -9680 225438 237475 171907
13711A71907J25362J17850K7944j6720L5714J2474p1795o1361K9863J4506r186
$$ 171907 297269 415119 443063 426343 462057 474531 402736 341375 371238 385744 376558
13700C76558J04416l0009j98887M6469o8745j86183j44547J12674K977p6213O7787
$$ 376558 480974 450965 252078 298547 229802 43619 -100928 11746 14723 -61490 6297
13689F297J29980P1860L6347n3852m4373O4315j13591k6215N974j89499O6410
$$ 6297 136277 208137 244484 190632 146259 210574 96983 70768 76742 -112757 -46347
13678d6347J85749K07079Q2257j03614j36162O662n3475O0522K2075j37016j0021
$$ -46347 139402 346481 428738 325124 188962 195624 142149 202671 224746 87730 77709
13667G7709J8527J83879J21660J42490J4440j77962j47581J00639j55468j00223
$$ 77709 96236 280115 401775 544265 558705 380743 233162 333801 178333 78110
13657G8110p3776k0396J62414J39253J25078O5032k7091J0638K03204L7886j13879
$$ 78110 4334 -16062 146352 285605 410683 475715 448624 459262 662466 700352 586473
13646E86473k56408r5751l0799J93705M0877M1078J82605p3452j84855J13730
$$ 586473 330065 234314 203515 397220 438097 479175 661780 588328 403473 517203
13636E17203q8829l4449q7218J05849P6760P1487j55118p9984n0977J24236R4920
$$ 517203 428374 393925 306707 412556 489316 560803 405685 325701 274724 398960 493880
13625D93880J93754L60486N11646K89700M24641O67394O41817K46567l7675l77495
$$ 493880 687634 1048120 1559766 1849466 2274107 2941501 3583318 3829885 3792210 3414715
13615C414715p77354o35878k34015k58403j28677j85238j51291L5909k10691L2335
$$ 3414715 2637361 2001483 1767468 1509065 1380388 1195150 1043859 1079768 869077 901412
13605I01412J46334N7573k78536j86216J72686O8603k80363r5179J57731l3833
$$ 901412 1047746 1105319 826783 640567 813253 881856 601493 506314 664045 630212
13595F30212k9803m6927J44952J305j17428m6315J3777j6736P1923M0746K06151
$$ 630212 600409 553482 698434 699739 582311 535996 549773 533037 604960 645706 851857
13584H51857P7314K37726K68484L68383M91816P35643J133900J507747J949028
$$ 851857 929171 1166897 1435381 1803764 2295580 3031223 4165123 5672870 7621898
13575G621898J997488J708754Q45203l74131j932295k396036j864948j373233
$$ 7621898 9619386 11328140 12173343 11799212 9866917 7470881 5605933 4232700
13567D232700p46671k57876k07562l48185l36026j71546l16070k50760Q8612Q5943
$$ 4232700 3486029 3228153 3020591 2672406 2336380 2164834 1848764 1598004 1686616 1772559
13557A772559j12285k01378j40823k6888M7436j09077l7963j45639j54623n8206
$$ 1772559 1660274 1458896 1318073 1291185 1338621 1229544 1191581 1045942 891319 833113
13547H33113O2357k39648J10926m007K4455L29017K10909J18163J9997j9769J10105
$$ 833113 895470 655822 766748 762741 787196 1116213 1327122 1445285 1465282 1445513 1555618
13536A555618N36921N71360P68349J227042J683494K082421K074618J647791N77902
$$ 1555618 2092539 2663899 3432248 4659290 6342784 8425205 10499823 12147614 12725516
13527A2725516j050215k358000k347533j767796j146568m82048m39938l94021
$$ 12725516 11675301 9317301 6969768 5201972 4055404 3573356 3133418 2739397
13519B739397k95972k86889l91060j49028N5816j23568Q958K8026J9395J68310
$$ 2739397 2443425 2156536 1765476 1616448 1672264 1548696 1557654 1585680 1605075 1773385
13509A773385q0890k08267k41800j75551n7480p5486P1746l5882j49478L5924
$$ 1773385 1692495 1484228 1242428 1066877 1009397 933911 1005657 969775 820297 856221
13499H56221J26631l0015J1587J2043J4377N9553J81487J27305O5084J1134L96254
$$ 856221 982852 952837 964424 976467 990844 1050397 1231884 1359189 1424273 1435407 1831661
13488A831661N67195N05206N99337K98822K28808r9870l35486o83483o69155l67762
$$ 1831661 2398856 2904062 3503399 3802221 4031029 3931159 3595673 2912190 2243035 1875273
13478A875273m50694k73268J32249n2842m8248j44066n3822j2260J54639J84103
$$ 1875273 1424579 1151311 1283560 1230718 1182470 1038404 984582 972322 1126961 1311064
13468A311064l3545L8960n7178j11730J1378m4569j80617n7117J7208k27311o8947
$$ 1311064 1277519 1316479 1259301 1147571 1158949 1114380 933763 876646 893854 666543 597596
13457E97596R6116J57889Q4640r9694L1448n7901J07743j14749l6168n6208P709
$$ 597596 693712 851601 936241 836547 867995 810094 917837 803088 766920 710712 718421
13446G18421J99789j21357j44170J49428K32857j73983k02148N858J2837k45082
$$ 718421 918210 796853 652683 802111 1034968 860985 658837 664695 677532 432450
13436D32450J409K59762J35821r6608j4089l6888q7362M5354M4449j25077M1484
$$ 432450 433859 693621 829442 732834 718745 681857 594495 639849 684298 559221 600705
13425F00705j1623L550L1204j19652L5678J46573j7404J8828k1922j15896k50090
$$ 600705 589082 592632 623836 504184 539862 686435 669031 687859 665937 550041 299951
13414B99951n6665J65955R5930m9014j45930k8263J14432J36462J00812j26976
$$ 299951 243286 409241 505171 456157 310227 281964 396396 532858 633670 506694
13404E06694k31753j06526K94916R41j14073J06147J87559n7772j35431r5222
$$ 506694 274941 168415 463331 464272 350199 456346 643905 586133 450702 355480
13394C55480j31979R0931R3786P2135J48641l7861k22355N4025L2016p8184J30806
$$ 355480 223501 314432 408218 480353 628994 591133 368778 422803 454819 376635 507441
13383E07441M1711n2128k01031l01272r9254M6298m378N835R5808K52433J94147
$$ 507441 549152 497024 295993 -5279 -104533 -58235 -62613 -56778 39030 291463 485610
13372D85610m3534J85976n3091j9603n7855n1802J95498m7310j86560P1492J21490
$$ 485610 442076 628052 574961 555358 497503 445701 641199 593889 407329 478821 600311
13361F00311j6992J5547J01146j17369m9851j43119O447K02129k08226q8657K31
$$ 600311 583319 598866 700012 582643 532792 389673 396120 598249 390023 301366 301597
13350C01597J68067J75004q7674K04423J22276j20089j48895k90795j81319O143
$$ 301597 469664 644668 556994 761417 883693 763604 614709 323914 142595 148738
13340A48738J19024J73586M9049J23500l9956J08665J2086j11671j67638L6250
$$ 148738 267762 441348 490397 613897 573941 682606 694692 583021 415383 451633
13330D51633m5066p4784L8095n4015P1806J95964j72398l2949j9532k2195J0893
$$ 451633 406567 331783 369878 315863 387669 583633 411235 378286 358754 336559 347452
13319C47452L7903J08105Q1578L729L476J46221l1134k43138j37735J21323J53169
$$ 347452 385355 493460 575038 578767 582243 728464 697330 454192 316457 437780 590949
13308E90949Q6319L4198J6788j31658n9084j11594j03248k4438J33473q0023M1934
$$ 590949 677268 711466 728254 596596 537512 425918 322670 298232 431705 351682 393616
13297C93616k2921N4638O7069m2427K9797R9221O4948o293j26170j79292O6527
$$ 393616 370695 425333 492402 449975 479772 578993 643941 637648 511478 332186 398713
13286C98713J39582N7507J18361J63085n8813j12103J3005J57008P7636O7002
$$ 398713 538295 595802 714163 877248 818435 706332 719337 876345 953981 1020983
13276A020983K3801p5253j82867j60564M4611Q7545J18756J3081n5634o0333K8202
$$ 1020983 1044784 969531 786664 626100 670711 758256 877012 890093 834459 774126 802328
13265H02328n3736m560O6681N4211o1643N4196P7484r4083l5041J63732Q0076
$$ 802328 748592 744032 810713 864924 803281 857477 934961 840878 805837 969569 1049645
13254A049645m9808j47278j6495Q904o5271l8680M1118J54797j0237L5524j11105
$$ 1049645 999837 852559 836064 844968 779697 741017 782135 936932 926695 962219 851114
13243H51114Q2407Q8965P2375J13916K2134K559J01487J84432J9722N1492L1759
$$ 851114 933521 1022486 1094861 1208777 1230911 1233470 1334957 1519389 1539111 1590603 1622362
13232A622362Q6418j36433k07363J0963J63664M506j11642m3148l3063P443k00369
$$ 1622362 1708780 1572347 1364984 1375947 1539611 1544117 1432475 1389327 1356264 1363707 1163338
13221A163338j49392n8382J27798L1463j58128J02248K17556j20665l58742o9623
$$ 1163338 1013946 955564 1083362 1114825 956697 1058945 1276501 1155836 797094 727471
13211G27471J41807M8773J11824o3249J53563J28846q8373Q93P2658l6158j03896
$$ 727471 869278 918051 1029875 966626 1120189 1249035 1160662 1161555 1234213 1198055 1094159
13200A094159j727P2501p6780R351j35047j08605J30036J45069K0682k2023J71843
$$ 1094159 1092432 1164933 1088153 1097504 962457 853852 983888 1128957 1149639 1127616 1299459
13189A299459J54115j73068j48067K6014J91357N4691P9600P4032j87670o0047
$$ 1299459 1453574 1280506 1132439 1158453 1349810 1404501 1484101 1558133 1370463 1310416
13179A310416n956j76679N132j5630j63608p9266K505P3249K7085p4316J64699
$$ 1310416 1304460 1127781 1132913 1117283 953675 874409 876914 950163 977248 902932 1067631
13168A067631J79873K05600J02307k2358j08839J26470J08606j01789R1203p3002
$$ 1067631 1247504 1453104 1555411 1533053 1424214 1550684 1659290 1557501 1648704 1575702
13158A575702r369j4041O1063J88867k73151q937k9488r5684j6790J30868k4328
$$ 1575702 1566333 1552292 1613355 1802222 1529071 1520134 1490646 1394962 1378172 1509040 1484712
13147A484712k1111J57319L9076N0461O8795j51356j00536l07972p1212L67117
$$ 1484712 1463601 1620920 1659996 1710457 1779252 1627896 1527360 1219388 1148176 1515293
13137A515293N7622l31276j60481N6703J13891j31204o1702Q4815Q4103K67970
$$ 1515293 1572915 1241639 1081158 1137861 1251752 1120548 1058846 1143661 1227764 1495734
13127A495734R3812o8303M5201j58385l42513k58404J14107J69542p620j20082
$$ 1495734 1589546 1521243 1566444 1408059 1065546 807142 921249 1090791 1083171 963089
13117I63089M0151j2700J37220k5298k18127j68465r4789J20773J87518K5274
$$ 963089 1003240 990540 1127760 1102462 884335 715870 621081 741854 929372 954646
13107I54646J24647N8365L3338l1480P3757J48997K4388j9827k15291j26974n7210
$$ 954646 1079293 1137658 1170996 1139516 1213273 1362270 1386658 1366831 1151540 1024566 967356
13096I67356L2990q9900j93257j16824P0686O1779k1966J00825L9082j12254j16787
$$ 967356 1000346 910446 717189 600365 671051 732830 710864 811689 850771 738517 621730
13085F21730J04174J06246R3017J32532Q9708L5037j38174k2987k5927j12719
$$ 621730 725904 832150 925167 1057699 1147407 1182444 1044270 1021283 995356 882637
13075H82637K8664J32270R6570j19346k19624M0404r1901j68507J75364k3410
$$ 882637 911301 1043571 1140141 1020795 801171 841575 749674 581167 756531 733121
13065G33121n3854K05604J96204j69335M5824K16236q8035P0938n0393o2649k60939
$$ 733121 679267 884871 1081075 911740 957564 1173800 1085765 1156703 1106310 1043661 782722
13054G82722j04014j58966k2719n2259R2771K0153j10654J75373J3698o9938P7323
$$ 782722 678708 519742 497023 444764 537535 557688 447034 622407 636105 566167 643490
13043F43490Q713O4163r1443j26371N9723L3327J21446J35609K3314M2975o9962
$$ 643490 652203 716366 624923 498552 558275 591602 713048 848657 871971 914946 844984
13032H44984L7233o1915j37714j59464J60017K82761j2761m1561P3770K41998
$$ 844984 882217 820302 682588 523124 683141 965902 953141 911580 985350 1227348
13022A227348k11549k40452Q7537Q5033L6478N1061M9957j84769m7087l7193j32509
$$ 1227348 1015799 775347 862884 947917 984395 1035456 1085413 900644 853557 816364 683855
13011F83855L9367R1328R8651n2839j84116J71330Q0679r3275j5163k8373J77597
$$ 683855 723222 814550 913201 860362 676246 847576 928255 834980 819817 791444 969041
13000I69041j18320k310N4888r3584n3077K08886Q4108O0211j17309l1501j6055
$$ 969041 850721 848411 903299 809715 756638 965524 1049632 1109843 992534 961033 944978
12989I44978m1934J03065M3954k3810Q5134M6402j52637k19567j8811M5190J11369
$$ 944978 903044 1006109 1050063 1026253 1111387 1157789 1005152 785585 766774 811964 923333
12978I23333J69712J89503Q07p9310O4650m5103k35764q655J33589j48744q5930
$$ 923333 1093045 1282548 1283355 1204045 1268695 1223592 987828 979173 1112762 964018 878088
12967H78088M7714J10950K9853j4072l0116l4784M4523P0157J33928Q2740m0057
$$ 878088 925802 1036752 1066605 1052533 1022417 987633 1032156 1102313 1236241 1318981 1278924
12956A278924j36805j15926J8558Q9266Q1741j03829j7218L2786J38636k69828
$$ 1278924 1142119 1026193 1044751 1134017 1215758 1111929 1094711 1127497 1266133 996305
12946I96305J7390J10195j44285q6155p9007k5559K54305P6295j09404M4907J88046
$$ 996305 1013695 1123890 979605 893450 814443 788884 1043189 1119484 1010080 1054987 1243033
12935A243033J50058K3842K9220N7834j73419O2183j1992j77605j71001L8032
$$ 1243033 1393091 1416933 1446153 1503987 1330568 1392751 1380759 1203154 1032153 1070185
12925A070185j50542n1240o0114j44J18441O6728R4323o9231k241J4229R0366
$$ 1070185 919643 868403 808289 808145 926586 993314 1087637 1018406 1016165 1030394 1120760
12914A120760L8044k12928O5106J62192K83082j3861p1064k53928j07681o2191
$$ 1120760 1158804 945876 1010982 1173174 1456256 1442395 1371331 1117403 1009722 947531
12904I47531L8477M3372M4707O4487m3572n2305P1985j4643L3955J2515J5507
$$ 947531 986008 1029380 1074087 1138574 1095002 1042697 1114682 1100039 1133994 1146509 1162016
12893A162016J01218K0086O3894n3109k9114j41471n2652P4441K16319K305r0416
$$ 1162016 1263234 1283320 1347214 1294105 1264991 1123520 1070868 1145309 1361628 1363933 1273517
12882A273517j31343J6498L847J33605N7927R5924j9665j05238J10098n9291J08415
$$ 1273517 1142174 1158672 1162519 1296124 1354051 1449975 1430310 1325072 1435170 1375879 1484294
12871A484294K2465p2931K1504n8038l5324K26160M3902n2350L8587o0839N7106
$$ 1484294 1506759 1433828 1455332 1397294 1361970 1588130 1632032 1579682 1618269 1557430 1614536
12860A614536L6184j60785j44460J19695K72028J05053j252j05702r2072M6261
$$ 1614536 1650720 1489935 1345475 1465170 1737198 1842251 1840999 1735297 1643225 1689486
12850A689486J09495J96866J91600J74103K9923J64462J40232L50608L49851M92974
$$ 1689486 1798981 1995847 2187447 2361550 2391473 2555935 2696167 3046775 3396626 3889600
12840C889600P44948R75348Q97569O62765N23660q0556p84012p74662l96617j67934
$$ 3889600 4634548 5609896 6507465 7170230 7693890 7613334 6829322 6054660 5658043 5490109
12830E490109m7555R0252J38249J43672J74938M70142M21564O34400Q14502N79396
$$ 5490109 5442554 5532806 5671055 5814727 5989665 6459807 6881371 7515771 8330273 8909669
12820H909669Q50544J163858J546173J881259K159733K896182L433805M344146
$$ 8909669 9760213 10924071 12470244 14351503 16511236 19407418 22841223 27185369
12812B7185369N312385O203199P143470P657781P818495P545206O451701N003029
$$ 27185369 32497754 38700953 45844423 53502204 61320699 68865905 75317606 80320635
12804H0320635L600340J594586l05272j818429l046564m201292m972898n060528
$$ 80320635 83920975 85515561 85210289 83391860 80345296 76144004 71171106 66110578
12796F6110578m604518m083695l279781k082219j315012l97320O21668J770909
$$ 66110578 61506060 57422365 54142584 52060365 50745353 50348033 50969701 52740610
12788E2740610L273048M669164O306434Q440143J0828860J3617879J5865883J6964412
$$ 52740610 56013658 60682822 66989256 75429399 86258259 99876138 115742021 132706433
12780A32706433J7187272J5622430J2704550Q133318L315947j742376n853844
$$ 132706433 149893705 165516135 178220685 186354003 189669950 187927574 182073730
12773A82073730r424420j1760641j2681554j2890705j2438475j1734042j0584955
$$ 182073730 172649310 160888669 148207115 135316410 122877935 111143893 100558938
12766A00558938r211449p482716n958744m702195l148817j907525o93565N63929
$$ 100558938 91347489 83864773 77906029 73203834 70055017 68147492 67453927 68017856
12758F8017856J717409L052606M052526M842137N361292N559947N068649M349691
$$ 68017856 69735265 72787871 76840397 81682534 87043826 92603773 97672422 102022113
12750A02022113L508094K121340P94931o08189j489718k232592k879371l362978
$$ 102022113 105530207 107651547 108446478 107838289 106348571 104115979 101236608 97873630
12742I7873630l191762k537288j330200J36313J693230L339338M679591N271688
$$ 97873630 94681868 92144580 90814380 90950693 92643923 95983261 100662852 105934540
12734A05934540N459074N546750N063782M030796K634775R82402n02952k403908
$$ 105934540 111393614 116940364 122004146 126034942 128669717 129652119 129149167 126745259
12726A26745259m304852n735406o840526p252763p217413o382655n403130m206786
$$ 126745259 122440407 116705001 109864475 102611712 95394299 89011644 83608514 79401728
12718G9401728k614639j292099L91746K304416L942704O125344Q432335J0770831
$$ 79401728 76787089 75494990 75886736 78191152 82133856 88259200 96691535 107462366
12710A07462366J3146894J5009220J6530143J7844667J8410704J7953842J6317046
$$ 107462366 120609260 135618480 152148623 169993290 188403994 206357836 222674882
12703B22674882J3139944Q301044K276109m090779j0005419j4922856j8340136
$$ 222674882 235814826 244115870 246391979 242301200 232295781 217372925 199032789
12696A99032789j9858957j9216469j7377796j4757038j2081298r539483p553079
$$ 199032789 179173832 159957363 142579567 127822529 115741231 106201748 98648669
12689I8648669n762422m214911k782279j374771j10116J304065K650667L848970
$$ 98648669 92886247 88671336 85889057 84514286 84404170 85708235 88358902 92207872
12681I2207872N179307N924740O361700O145691N278501M190332K536662L54800
$$ 92207872 97387179 103311919 109673619 115819310 121097811 125288143 127824805 128179605
12673A28179605k156601m188916o324121q136109r512288r955150r339813q841932
$$ 128179605 126023004 121834088 115509967 107373858 97861570 87906420 78566607 69724675
12665F9724675p647773o345240n213298m414199m106310l488502l014517k830462
$$ 69724675 62076902 55731662 50518364 46104165 41997855 38509353 35494836 32664374
12657C2664374k311077j957327j728183j851342j574741j474564j279508j271906
$$ 32664374 30353297 28395970 26667787 24816445 23241704 21767140 20487632 19215726
12649A9215726j154569r01494q76879r03838j025752p77934n85317n60057o32644
$$ 19215726 18061157 17159663 16282784 15378946 14353194 13575260 12989943 12429886 11797242
12640A1797242m21659l93836o18083o35256m73213l99952k62304p4055k08253
$$ 11797242 11375583 10981747 10363664 9728408 9255195 8855243 8592939 8518884 8310631
12631H310631j18414k11610l93584k05314j36627k97550j03750O2005r6732L5385
$$ 8310631 8192217 7980607 7587023 7381709 7245082 6947532 6843782 6905787 6809055 6844440
12621F844440R4526k0217j13839k04843j48589p5427k01481r2352p2998k7498
$$ 6844440 6938966 6918749 6804910 6600067 6451478 6376051 6174570 6082218 6009220 5981722
12611E981722J11032J10299l4614R513j30481k05963j75086J99489k60824j20583
$$ 5981722 6092754 6203053 6168439 6177952 6047471 5841508 5666422 5865911 5605087 5484504
12601E484504m5884j11810k5932q1581J29834J56882j41250m84855j27830k9620
$$ 5484504 5438620 5326810 5300878 5219297 5349131 5506013 5364763 4879908 4752078 4722458
12591D722458O4008m1458m7932j97227j85398M6687J11066J4578P9492M4968j19781
$$ 4722458 4786466 4745008 4697076 4499849 4314451 4361138 4472204 4486782 4566274 4611242 4491461
12580D491461o551m9403K8141J56931r9580k26421Q95j0090J7699j40655j47899
$$ 4491461 4484910 4435507 4463648 4620579 4520999 4294578 4295473 4285383 4303082 4162427 4014528
12569D014528N8231J9900k25149q8354M6272k3400o9400J55501M5708Q5089j18168
$$ 4014528 4072759 4092659 3867510 3779156 3825428 3802028 3732628 3888129 3933837 4018926 3900758
12558C900758N636M4040j79599r4601K57537K78785j92989n4273J52427K71864
$$ 3900758 3906394 3950434 3770835 3676234 3933771 4212556 4019567 3965294 4117721 4389585
12548D389585N1275j37079k34791J16567j5488p1477K5477j06375L257K45381
$$ 4389585 4440860 4303781 4068990 4185557 4170069 4098592 4124069 4017694 4020951 4266332
12538D266332M0349j26585j46076J01229J23347p9903q8417k36757l52762O0849
$$ 4266332 4306681 4180096 4034020 4135249 4258596 4178693 4090276 3853519 3500757 3561606
12528C561606J54132j98687m38340k05000Q5657K42627p204k6556q2893L1471
$$ 3561606 3715738 3517051 3078711 2873711 2959368 3201995 3194791 3168235 3085342 3116813
12518C116813K35253M7189m8000o3243N9238j7144p9389p1059j62688j36454j31388
$$ 3116813 3352066 3399255 3351255 3288012 3347250 3330106 3250717 3179658 3016970 2880516 2749128
12507B749128J5090P6316q010j66431j50910J10365J75480K9020J17013j1525
$$ 2749128 2764218 2840534 2832524 2666093 2515183 2625548 2801028 2830048 2947061 2935536
12497B935536k59269L1189L343M9987O3889N9399o6535j2869k0016R7833Q3775
$$ 2935536 2676267 2707456 2710799 2760786 2824675 2884074 2817539 2804670 2784654 2882487 2966262
12486B966262K62774K7700k53111k65006O3637L4659J49533O2397k10038k2J32944
$$ 2966262 3229036 3256736 3003625 2738619 2802256 2836915 2986448 3048845 2838807 2838785 2971729
12475B971729O327j1705K9930r4547k04502Q0147m1019q8387k597J20886M1595
$$ 2971729 2978056 2966351 2996281 2901734 2697232 2777379 2736360 2647973 2645376 2766262 2807857
12464B807857j09772m9000m3995N2595L5772j28227k4861j66647J13972K58985
$$ 2807857 2698085 2649085 2605090 2657685 2693457 2565230 2540369 2373722 2487694 2746679
12454B746679J42421p9929q3373k9174N1322j42401j27317j77898P4160J87320
$$ 2746679 2889100 2809171 2725798 2696624 2747946 2605545 2478228 2300330 2374490 2561810
12444B561810l2033Q752N489P3049N4734m43m2261m9461O2631K22733m9922k26424
$$ 2561810 2529777 2538529 2544018 2617067 2671801 2671358 2629097 2579636 2642267 2865000 2815078 2588654
12432B588654J22320O492O5949K28383j08864P333P1679r7424M0573p3210j2482
$$ 2588654 2710974 2717466 2783415 3011798 2902934 2910267 2981946 2884522 2925095 2851885 2839403
12421B839403j4784J8860J02139O8238j79012q7978J40542m685n2634K5747j25458
$$ 2839403 2824619 2843479 2945618 3013856 2834844 2746866 2887408 2882723 2830089 2855836 2730378
12410B730378P536J44576j77337j97748K85952K27192r1687j46001L3000n2018
$$ 2730378 2737914 2882490 2705153 2507405 2793357 3020549 2928862 2782861 2815861 2763843
12400B763843k3115J4632K8531L8369J9324J18021J25697r8296j17754J56198
$$ 2763843 2740728 2755360 2783891 2822260 2841584 2959605 3085302 2987006 2869252 3025450
12390C025450P1267j24069r9783P4062K09126Q3837J17457j79060k10411l7595
$$ 3025450 3096717 2972648 2872865 2946927 3156053 3239890 3357347 3178287 2967876 2930281
12380B930281J56597m1619r9678J12142k6868o0914k76643j29078J11873O7184
$$ 2930281 3086878 3045259 2945581 3057723 3030855 2969941 2693298 2564220 2676093 2743277
12370B743277J33656P7436j0744k30919j20695K8042l4041J37216L9861L819n642
$$ 2743277 2876933 2954369 2943625 2712706 2592011 2620053 2586012 2723228 2763089 2766908 2761266
12359B761266Q8928Q7086J61687M3613J3889r1481k55004m2828j2929o5350K972
$$ 2761266 2850194 2937280 3098967 3142580 3156469 3064988 2809984 2767156 2754227 2688877 2691849
12348B691849N0522J08283J69101J64003J02815O5109Q6750J27915J99464J18738
$$ 2691849 2742371 2850654 3019755 3183758 3286573 3351682 3438432 3566347 3765811 3884549
12338C884549j47258k17285J23174P2626q7764p6930j03546j79808K3605Q098
$$ 3884549 3737291 3520006 3643180 3715806 3628042 3551112 3447566 3267758 3291363 3299461
12328C299461J00628J78361J52818k13837j48176q5130Q0531J01653O4943J15293
$$ 3299461 3400089 3578450 3731268 3517431 3369255 3284125 3364656 3466309 3531252 3646545
12318C646545J93313J36201J30270P5133R9536j63227k295j07283j04943L2963
$$ 3646545 3839858 3976059 4106329 4181462 4280998 4117771 4115476 4008193 3903250 3936213
12308C936213K8328j27055j69401m0414n0662j67075j33632J3093K46644N5453
$$ 3936213 3964541 3837486 3668085 3627671 3577009 3409934 3276302 3289395 3536039 3591492
12298C591492j3223J95378J39465M5694O3058O206j35023n6034j183J61228j33090
$$ 3591492 3578269 3773647 3913112 3958806 4021864 4028070 3893047 3837013 3835830 3997058 3863968
12287C863968N5044J00537J06422K46417J34726J36031K3352L3245J3176J44128
$$ 3863968 3919012 4019549 4125971 4372388 4507114 4643145 4666497 4699742 4712918 4857046
12277D857046r2250R0594J26665J24054K35344K90675K81335K27311L36320M5275
$$ 4857046 4764796 4855390 4982055 5106109 5341453 5632128 5913463 6140774 6477094 6522369
12267F522369L7718P2943J79626M83622M92579M10388N90434P30673O98397Q71943
$$ 6522369 6560087 6633030 6812656 7296278 7788857 8199245 8789679 9520352 10218749 11090692
12257A1090692J042646J098872J325934J791417K184200K543199L292698L888326
$$ 11090692 12133338 13232210 14558144 16349561 18533761 21076960 24369658 28257984
12249B8257984M909996N743143P398536R162820J1148601J3283265J5018392J5293922
$$ 28257984 33167980 38911123 46309659 55472479 66621080 79904345 94922737 110216659
12241A10216659J3593108R759416M417180j981989o982036r761162j0289288r041502
$$ 110216659 123809767 133569183 137986363 136004374 129022338 119261176 108971888 99930386
12233I9930386o916973m312742j380372J456380M233218P081729J0018706J2403245
$$ 99930386 93013413 88700671 87320299 88776679 93009897 100091626 110110332 122513577
12225A22513577J3760458J2606483R104831L764107k963091q935878j3008069
$$ 122513577 136274035 148880518 157985349 161749456 158786365 149850487 136842418
12218A36842418j4816374j4369361j2926843j1233372r582395p690191o227017
$$ 136842418 122026044 107656683 94729840 83496468 73914073 66223882 59996865
12211E9996865n181621m403305l637030l296939k970784k548379k348093k078634
$$ 59996865 54815244 50411939 46774909 43477970 40507186 37958807 35610714 33532080
12203C3532080j655726j685572j298387r12112o54535l80461o8342O7429K65914
$$ 33532080 31876354 30190782 28892395 27980283 27325748 26945287 26876945 26944374 27210288
12194B7210288P37008J050152J115891J973712K574272L221267M177431N201921
$$ 27210288 27947296 28997448 30113339 32087051 34661323 37882590 42060021 47261942
12186D7261942O668637Q602856J0885430J3450584J5656665J6849767J6300184
$$ 47261942 53930579 62533435 73418865 86869449 102526114 119375881 135676065
12179A35676065J3869572R700310M303863m47581l229702l928910l501678j787573
$$ 135676065 149545637 159245947 163549810 163102229 159872527 155943617 152441939 150654366
12171A50654366J393120N632259R497958J2605495J4635490J4410498J2712803
$$ 150654366 152047486 157679745 167177703 179783198 194418688 208829186 221541989
12164B21541989J0061543O385545L243613O2325m035111q953943j3431658j5270939
$$ 221541989 231603532 237989077 241232690 241295015 237259904 228305961 214874303 199603364
12156A99603364j4320532j0898261p082379l463447p50470J028052R63460k16117
$$ 199603364 185282832 174384571 167302192 163838745 163088275 164116327 165079787 164863670
12148A64863670k473049n524158r101687j2324922j4158134j3981959j2319534
$$ 164863670 162390621 156866463 147764776 135439854 121281720 107299761 94980227
12141I4980227j0435928q567940p118946n813208n039276m141871l798275l577317
$$ 94980227 84544299 75976359 68857413 63044205 58004929 53863058 50064783 46487466
12133D6487466l134956k907515k458125k419400k185568j747426j455392j180435
$$ 46487466 43352510 40444995 37986870 35567470 33381902 31634476 30179084 28998649
12125B8998649r96794r48357p04994m01236o904J35421M16789R73977J442717
$$ 28998649 28001855 27053498 26348504 25947268 25940364 26075785 26492574 27466551 28909268
12116B8909268J681769K061089L149271M474891N499335P038317Q614375J0079126
$$ 28909268 30591037 32652126 35801397 40276288 45775623 52813940 61428315 71507441
12108G1507441J1712556J2801241J2388203J0405053O994849K180737l078230
$$ 71507441 83219997 96021238 108409441 118814494 125809343 127990080 124911850
12101A24911850p731077j0174793j0282534q320214o047950l621247j073529J045712
$$ 124911850 117180773 107005980 96723446 88403232 82355282 78734035 77660506 78706218
12093G8706218L319583N547588P415963Q896421R500029Q360807N407907R81030
$$ 78706218 82025801 87573389 94989352 103885773 113385802 121746609 127154516 128135546
12085A28135546m192709q939048j1961853j2784817j1712742r831300p866988
$$ 128135546 123942837 115003789 103041936 90257119 78544377 68713077 60846089
12078F0846089o282734m955732m274661l589487l323968k926146k802135k505669
$$ 60846089 54563355 49607623 45332962 41743475 38419507 35493361 32691226 30185557
12070C0185557k387585k187024j795405j422231j388811j296076j242450j050377
$$ 30185557 27797972 25610948 23815543 22393312 21004501 19708425 18465975 17415598
12062A7415598r70818q77030o59506q27306o68693k32361k54846l74008k03255
$$ 17415598 16444780 15567750 14908244 14080938 13412245 13179884 12925038 12551030 12347775
12053A2347775M0108L76969J4928j9201r1955n06376o92372q32670n22193l42455
$$ 12347775 12387883 12764852 12779780 12760579 12668624 12162248 11469876 10637206 10115013 9772558
12043I772558l49016j55766k50573j41336q5468j3352j66482l82092j76946R2023
$$ 9772558 9423542 9267776 9017203 8875867 8790399 8777047 8610565 8228473 8051527 8143550
12033H143550K403m13184k62966k20911J6213j55304l38208n8172j23756j27066
$$ 8143550 8145953 7732769 7469803 7248892 7265105 7109801 6771593 6713421 6589665 6462599
12023F462599J33428J44096m5746o2264j82589l95759r1275n6327K5022J72935
$$ 6462599 6596027 6740123 6694377 6632113 6449524 6053765 5962490 5906163 5931185 6104120
12013F104120p4350r1953J12378J56962J8269l177J61347Q3799m1998J7511j05764
$$ 6104120 6029770 5937817 6050195 6207157 6225426 6222249 6383596 6467395 6425397 6442908 6337144
12002F337144m1289n9084L3778m7219L2538R4327k53868k09221m4155r6696k02935
$$ 6337144 6295855 6236771 6270549 6223330 6255868 6350195 6096327 5887106 5842951 5746255 5543320
11991E543320r4655m5559O4319j0285j39692j0695j08089N3208J09170P7440p1705
$$ 5543320 5448665 5403106 5467425 5457140 5317448 5306753 5198664 5251872 5361042 5438482 5366777
11980E366777n5211M5769Q1234j35996o218J9544k7691k03056j57161j15596k962
$$ 5366777 5311566 5357335 5438569 5302573 5296355 5315899 5288208 5085152 4927991 4812395 4809433
11969D809433Q0300o0377p6675o9575m5847M3185N6375Q610L0172K28036j7271
$$ 4809433 4889733 4829356 4752681 4683106 4637259 4680444 4736819 4745429 4775601 5003637 4986366
11958D986366n6919J81334N40948M5192j14077j43137j82595k95956k43746J2039
$$ 4986366 4929447 5110781 5651729 5696921 5582844 5439707 5257112 4961156 4717410 4729449
11948D729449N0988m8576n0644j16877j2082L8628J84817J25571o2729j12317
$$ 4729449 4780437 4731861 4681217 4564340 4552258 4590886 4775703 4901274 4838545 4726228
11938D726228k07950n9267m2220J03096q9124M479O606J60323o1018j6341o6881
$$ 4726228 4518278 4459011 4416791 4519887 4430763 4435242 4441848 4602171 4541153 4524812 4457931
11927D457931r2164k74492Q2006K0243J19413o590j4336R760o8767j07026j34636
$$ 4457931 4365767 4091275 4173281 4193524 4312937 4306347 4292011 4301771 4233004 4125978 3991342
11916C991342k8827J05577Q7467O6144O716J56497Q2662L1118m1256q2067J91849
$$ 3991342 3962515 4068092 4155559 4221703 4228419 4384916 4467578 4498696 4457440 4375373 4567222
11905D567222k2270k16643j01153R9177K8167k5744J64935M2585k07945p8026
$$ 4567222 4544952 4328309 4227156 4326333 4354500 4328756 4493691 4536276 4328331 4250305
11895D250305M7976j1731j20537j02698r7278R9124J85930j06062M3819J45575
$$ 4250305 4298281 4286550 4166013 4063315 3966037 4065161 4251091 4145029 4188848 4334423
11885D334423j22553j12839L9153r6493j8477n0517K579r1580j71998q6647J30698
$$ 4334423 4211870 4099031 4138184 4041691 4023214 3972697 3975276 3883696 3711698 3625051 3755749
11874C755749K03669r5883K35528k182L8740l9593m524M1638M645m2039J14122
$$ 3755749 3959418 3863535 4099063 4096881 4135621 4096028 4091504 4133142 4137787 4095748 4209870
11863D209870j12914k42704m5298J36225o3229k17460K224J64540O4294q0191
$$ 4209870 4096956 3854252 3808954 3945179 3881950 3664490 3666714 3831254 3895548 3815357
11853C815357R0201P80j28833J0895Q2000R4347o4197j60340N6202P5210K4250
$$ 3815357 3905558 3906338 3777505 3788400 3870400 3964747 3900550 3740210 3796412 3871622 3895872
11842C895872j42987l0435J85675O0496k519o2012L2789M391k3774k4341L6608
$$ 3895872 3752885 3722450 3908125 3968621 3966102 3904090 3936879 3941270 3917496 3893155 3929763
11831C929763j18472J92844J11158r3052k32766k41397j6159J94460J23867K574
$$ 3929763 3811291 4004135 4115293 4022241 3789475 3548078 3531919 3726379 3850246 3852820
11821C852820q3081j1643n419p2265J19446j194m1583j11339j19950p4558J1712
$$ 3852820 3769739 3758096 3752677 3680412 3799858 3798664 3757081 3645742 3525792 3451234 3462946
11810C462946J05711J00006J11222Q2676p8603J01273L7473m4699j8719j4812
$$ 3462946 3568657 3668663 3779885 3862561 3783958 3885231 3922704 3878005 3859286 3844474
11800C844474k4923j04586J56582l3854n3149P1912J70768O1246R2054J32958
$$ 3844474 3819551 3714965 3871547 3837693 3784544 3856456 4027224 4088470 4180524 4313482
11790D313482P9721j12320j16225k83372q5500J70651m2779K0556R9871P6919
$$ 4313482 4393203 4280883 4164658 3881286 3795786 3966437 3923658 3944214 4044085 4121004
11780D121004j64011j78022K6488J0089M11602M9614j55036J60228M9113N0844
$$ 4121004 3956993 3778971 3805459 3815548 4227150 4276764 4121728 4281956 4331069 4381913
11770D381913q4489j22240k3609n9579r9968j26588q5124k07887O9594L1300m9840
$$ 4381913 4297424 4175184 4151575 4091996 3992028 3865440 3780316 3572429 3642023 3673323 3623483
11759C623483P7072J84060K7378J91811n6593k10741k30937l5539o9834r5588
$$ 3623483 3700555 3884615 3911993 4103804 4047211 3836470 3605533 3569994 3500160 3404572
11749C404572J21561J15042k05654l8470j175K1055J1690j5783R3131P370L2450
$$ 3404572 3526133 3641175 3435521 3397051 3395876 3416931 3428621 3412838 3505969 3513339 3545789
11738C545789j16698M9107L6668J64387j457l3543j66150k2232j5221K09664K70837
$$ 3545789 3429091 3478198 3514866 3679253 3677796 3644253 3478103 3455871 3440650 3650314 3921151
11727C921151j61495J1713K0459M8876P5603o7728J1278J3735m6575J12945q7737
$$ 3921151 3759656 3771369 3791828 3840704 3916307 3848579 3859857 3873592 3827017 3939962 3852225
11716C852225N0446M00716L4110j71660J19581M7164k52147k36150M8088K43748
$$ 3852225 3902671 4303387 4337497 4165837 4285418 4332582 4080435 3844285 3892373 4136121
11706D136121n5464L0548o6037j17022N7055q3148j20269J34813j7516j31281
$$ 4136121 4080657 4111205 4045168 3928146 3985201 3902053 3781784 3916597 3899081 3767800
11696C767800j8628k47996k32990j18230j27761J50822J72283O667k15007O5040
$$ 3767800 3749172 3501176 3268186 3149956 3022195 3173017 3345300 3351967 3136960 3202000
11686C202000J02762j06512k39484J13533R857j59303J02421Q1641J33193m0203
$$ 3202000 3304762 3198250 2958766 3072299 3082156 2922853 3025274 3106915 3240108 3199905
11676C199905J87891k2945j80616l1312l2877J33099J3836M0612M5224p8613q6249
$$ 3199905 3387796 3364851 3184235 3152923 3120046 3253145 3266981 3307593 3352817 3274204 3187955
11665C187955J11415l5678o2872J03196J42112r174j52566P2245J65483k16695
$$ 3187955 3299370 3263692 3200820 3304016 3446128 3436954 3284388 3356633 3522116 3305421
11655C305421J36883R3577l8322P3288m5337k89964j08531J67386Q9594j61855
$$ 3305421 3442304 3535881 3497559 3570847 3525510 3235546 3127015 3294401 3383995 3222140
11645C222140J460J24476J75931P1222p5744k05576J72405L4947N1270j55263
$$ 3222140 3223600 3348076 3524007 3595229 3519485 3313909 3486314 3521261 3572531 3417268
11635C417268l21684O8033J68658j14137k93893n824P6214P9795J6905J8421j01740
$$ 3417268 3095584 3163617 3332275 3218138 2924245 2918421 2994635 3074430 3091335 3109756 3008016
11624C008016Q3888Q1792j21556k7262j10971j77589m7695J12952J45255k16231
$$ 3008016 3091904 3173696 3052140 3024878 2913907 2736318 2688623 2801575 2946830 2730599
11614B730599M8241k5608j57062J7173K20883l6129j54237J21162P2078r5552
$$ 2730599 2778840 2753232 2596170 2613343 2834226 2798097 2643860 2765022 2837100 2741548
11604B741548K356j47195K11749J4425p6362n9543M9306k667J85997j28862k11965
$$ 2741548 2743904 2596709 2808458 2822883 2746521 2686978 2736284 2733617 2919614 2790752 2578787
11593B578787o9695M4125J720L7216j6320n0881J434j11328q898n9909J55706
$$ 2578787 2509092 2553217 2554937 2592153 2575833 2524952 2526386 2415058 2406160 2346251 2501957
11582B501957J41014k0164N2800K4971K9975j60606J2076K52165J2295k19157
$$ 2501957 2642971 2622807 2675607 2700578 2730553 2569947 2582023 2834188 2846483 2627326
11572B627326j23160K89079J2298L684p1839k0745j90114q1077Q1645K27738O7406
$$ 2627326 2504166 2793245 2805543 2809227 2737388 2716643 2526529 2445452 2527097 2754835 2822241
11561B822241j91454k08138j49001p5540J32075K31189J90707P7312j30990k09987
$$ 2822241 2630787 2422649 2273648 2198108 2330183 2561372 2752079 2829391 2698401 2488414
11551B488414L4406r5165j48567K14367p2777m14941M0937J31780j89802J48372
$$ 2488414 2522820 2427655 2279088 2493455 2420678 2005737 2046674 2178454 1988652 2137024
11541B137024J10750j048J20215J07619q5251r5049m5555o7855K22046K5965k7638
$$ 2137024 2247774 2246726 2366941 2474560 2389309 2294260 2248705 2180850 2402896 2428861 2401223
11530B401223r1837p2031J18401k7239j39551K7854J06722n8959j29337R7155
$$ 2401223 2309386 2237355 2355756 2328517 2188966 2216820 2323542 2264583 2135246 2232401
11520B232401L0757k5847M759N8854K3585J70155J02754N4028j42407j53789L5045
$$ 2232401 2263158 2237311 2242070 2300924 2324509 2494664 2597418 2651446 2509039 2355250 2390295
11509B390295j00226j97952l6249L4348k4737q2435r9654O6358n0262k12680J3073
$$ 2390295 2290069 2092117 2055868 2090216 2065479 1983044 1883390 1949748 1899486 1686806 1699879
11498A699879K64150J87102j26466k76889N8824P3354J51304j02937P6391j8633
$$ 1699879 1964029 2151131 2024665 1747776 1806600 1879954 2031258 1928321 2004712 1986079
11488A986079j53883M5390K18287M5988L6584Q0950k06342J7058M7037p4458J44947
$$ 1986079 1832196 1877586 2095873 2141861 2178445 2259395 2053053 2070111 2117148 2042690 2187637
11477B187637K08466m815J8638j22573m7321N4715r0023P8624P0352P4177o2584
$$ 2187637 2396103 2391288 2409926 2287353 2240032 2294747 2204724 2283348 2353700 2427877 2365293
11466B365293J65073O6078j48156k08402M4557r0014k1500r1174r5771L905Q4530
$$ 2365293 2530366 2596444 2448288 2239886 2284443 2194429 2172929 2081755 1985984 1989889 2074419
11455B074419N0433j01317Q183J01854r6029K27889Q7965Q4479l7255j79231k5046
$$ 2074419 2124852 2023535 2031718 2133572 2037543 2265432 2353397 2437876 2400621 2221390 2196344
11444B196344j9298j12345p5448m7871p9049J5014P5856k837k1754O5604o2746
$$ 2196344 2177046 2064701 1989253 1941382 1862333 1877347 1953203 1950366 1928612 1994216 1931470
11433A931470O5138J4491M3137j15184j65943k0482P8529j7504q529Q8802J27381
$$ 1931470 1996608 2011099 2054236 1939052 1773109 1752627 1831156 1813652 1805123 1893925 2021306
11422B021306m9868P9946L11j3929n3891k9065J17467n1307j07883J5343R2712
$$ 2021306 1971438 2051384 2051695 2037766 1983875 1954810 2072277 2020970 1913087 1928430 2021142
11411B021142o6643q5740q3118l1249j7379m9898j56165K03864K90094j08429
$$ 2021142 1954499 1868759 1785641 1754392 1737013 1687115 1530950 1734814 2024908 1916479
11401A916479q174J48532j40328J9405j3556o6407r0677J70099J26346J04775
$$ 1916479 1908305 2056837 1916509 1935914 1922358 1855951 1765274 1935373 2061719 2166494
11391B166494m5911j7237o1933m2726m4821J17154j1876j96754l6174r835k02124
$$ 2166494 2120583 2103346 2041413 1998687 1953866 2071020 2059144 1862390 1826216 1816381 1614257
11380A614257J25535J40553R071Q8905J44215l5595m8595l1747k64830j17354
$$ 1614257 1739792 1880345 1889416 1978321 2122536 2086941 2038346 2006599 1741769 1624415
11370A624415N9666N9393M1451J69137r4156j66907r6684R2827Q1390n2474r6765
$$ 1624415 1684081 1743474 1784925 1954062 1859906 1692999 1596315 1689142 1770532 1718058 1621293
11359A621293p2869K7659O5094R976q7782q2033K04954M3149j00587O2356R1147
$$ 1621293 1548424 1576083 1641177 1651153 1563371 1481338 1686292 1729441 1628854 1691210 1782357
11348A782357Q3404O5106J46738j4526k58386k42576m0891L2011j08408K9450
$$ 1782357 1865761 1930867 2077605 2063079 1804693 1562117 1521226 1553237 1444829 1474279
11338A474279K19289L6146J07463K3767k0755n9686P5070K5971k53523j27950
$$ 1474279 1693568 1729714 1837177 1860944 1840189 1780503 1855573 1881544 1628021 1500071
11328A500071J55328L15910J3226j94534O5074q2954Q6772Q599j13436p6206p7181
$$ 1500071 1655399 1971309 1984535 1790001 1855075 1772121 1858893 1867492 1754056 1677850 1600669
11317A600669k6800o7176j10952j67897J33275K01227j42784j2184l5894j38305
$$ 1600669 1573869 1506693 1395741 1227844 1361119 1562346 1419562 1407378 1371484 1233179
11307A233179K05910L01485j35972j57574P3621P0569j76741L2476L1823K7936
$$ 1233179 1439089 1740574 1604602 1447028 1520649 1591218 1414477 1446953 1478776 1506712
11297A506712J07082p6949q9464j06154L6895K530J21411M0731J93524j86373
$$ 1506712 1613794 1536845 1447381 1341227 1378122 1380652 1502063 1542794 1736318 1549945
11287A549945k3356n6090l9422K1456J39033n0155P3483l704L4945J54948J39624
$$ 1549945 1526589 1470499 1431077 1452533 1591566 1541411 1614894 1611190 1646135 1801083 1940707
11276A940707j69668l10861j05085l6569l8477J84024J43473J02999R137j01888
$$ 1940707 1771039 1460178 1355093 1318524 1280047 1464071 1607544 1710543 1719680 1617792
11266A617792q8286m5500r08J40406N2833M6518m9727k5610o6292j28781j7646
$$ 1617792 1529506 1484006 1483098 1623504 1676337 1722855 1673128 1647518 1581226 1452445 1434799
11255A434799j03796M069K7295j44132J671R4355k5223j48431J79765M1471j89216
$$ 1434799 1331003 1335072 1362367 1218235 1219906 1314261 1289038 1140607 1320372 1361843 1172627
11244A172627m2574Q7625K06279J60016j43704m1535q4374k51568R6390K27064
$$ 1172627 1130053 1217678 1423957 1583973 1440269 1398734 1314360 1062792 1159182 1386246
11234A386246J38583P5938M0518j8747r012P5827j82185k76409l9792K60528p3361
$$ 1386246 1524829 1600767 1641285 1622538 1613526 1689353 1507168 1230759 1190967 1451495 1378134
11223A378134k11656M6971M2493o6484N0593j63531j47453L6010J23514J76111
$$ 1378134 1166478 1213449 1255942 1189458 1240051 1076520 929067 965077 1088591 1264702
11213A264702O1086j6690j95412n6311q4984O400K41185P2842m3662j10317o4480
$$ 1264702 1325788 1309098 1113686 1057375 972391 978791 1219976 1292818 1249156 1138839 1074359
11202A074359P5735K9736M2225j03141K22653J26165m8853k21351k56917k4228
$$ 1074359 1150094 1179830 1222055 1118914 1341567 1467732 1418879 1197528 940611 916383
11192I16383K5397j92355n2496J00095Q0046m1620K5874j06746J79892K23150
$$ 916383 941780 749425 696929 797024 877070 835450 861324 754578 934470 1157620
11182A157620J17549j2142l27497k33346R0893K1668K44312K08604o7571l6168
$$ 1157620 1275169 1263027 935530 702184 793077 814745 1059057 1267661 1200090 1163922
11172A163922j921j05394J1512J66224o6409j24961L7317R5819j09052k24845
$$ 1163922 1162001 1056607 1068119 1234343 1167934 1042973 1080290 1176109 1067057 842212
11162H42212r8567L11850O3312q6340r8465J9583j05938N3219p8417j66127M4696
$$ 842212 743645 1055495 1118807 1032467 934002 953585 847647 900866 822449 656322 701018
11151G01018K33981L38993J05814k1465j66069m8157Q9902R9877m090j54884j99407
$$ 701018 934999 1273992 1379806 1358341 1192272 1144115 1234017 1333894 1329804 1174920 975513
11140I75513q114J92710K81437q0651r220j09258n7701j0224L3126K4223k38693
$$ 975513 967399 1160109 1441546 1360895 1351675 1242417 1184716 1174492 1207618 1231841 993148
11129I93148l2717O0932k4972k369K67233K6781j36194q590O1474j80661l41964
$$ 993148 960431 1021363 996391 994022 1261255 1288036 1151842 1143252 1204726 1024065 682101
11118F82101j48344J16971J41833J3113Q8817N3223K4374r0127l3653J60242j03349
$$ 682101 533757 650728 792561 805674 894491 947714 972088 881961 848308 1008550 905201
11107I05201l5709r8189j37725R3809Q084K7653P7817O2418K71024M986q3619
$$ 905201 869492 771303 633578 727387 735471 763124 840941 903359 1174383 1179369 1095750
11096A095750j3254J0456j96117j59180O0746R7926j0467K3441J44257O8119j00350
$$ 1095750 1082496 1092952 896835 737655 798401 896327 885860 909301 1053558 1121677 1021327
11085A021327o3948N0859Q0663n9907k17267n57j19276l3047R7350J5664J484
$$ 1021327 957379 1008238 1088901 1028994 811727 811170 691894 658847 756197 771861 773345
11074G73345N2305K7263K4600N3157J36058m6582k68326j14754j45460J35676
$$ 773345 825650 852913 877513 930670 1066728 1020146 751820 637066 491606 627282
11064F27282K59016J28705J72773m658r776k20634r5381J78122M1312p5845J75376
$$ 627282 886298 1015003 1187776 1183118 1173342 952708 857327 1035449 1076761 1000916 1176292
11053A176292j38183j27968O2544O7135J94842J26126M8023O590P217n6850q3051
$$ 1176292 1038109 910141 972685 1039820 1234662 1360788 1408811 1415401 1422618 1365768 1282717
11042A282717r1730J15327m8914K37616K53885Q7783J13497K14172K59269L05647
$$ 1282717 1190987 1306314 1257400 1495016 1748901 1836684 1950181 2164353 2423622 2729269
11032B729269L8187j34642L4514j88190m8824P6841j37521P5745L50007M63053
$$ 2729269 2767456 2632814 2667328 2479138 2430314 2507155 2369634 2445379 2795386 3258439
11022C258439J71330r5757j12077l1344k26403k26631k19548q5398o1j0460p9285
$$ 3258439 3429769 3334012 3221935 3190591 2964188 2737557 2518009 2432611 2432550 2422090 2342805
11011B342805J55907J55637J29039R1469l11530l94078j47122k15268M8813n6833
$$ 2342805 2498712 2654349 2783388 2874857 2563327 2169249 2022127 1806859 1855672 1798839
11001A798839P0626Q9607j04747m3650J12389p7389k43977k51210q0289q0943
$$ 1798839 1869465 1959072 1854325 1810675 1923064 1845675 1601698 1350488 1270199 1189256
10991A189256L2531k63431n3421q4078m7832L4903M0468J73757J97472m8413j28529
$$ 1189256 1221787 958356 904935 820857 773025 807928 848396 1022153 1219625 1171212 1042683
10980A042683k01749n8645j52570k13142J28656J81372k8774K670L5965n01K16633
$$ 1042683 840934 782289 629719 416577 545233 726605 697831 700501 736466 735965 952598
10969I52598j42024Q5130p5651K4780R1558M3883R121M21j69673r3687m3752j29239
$$ 952598 810574 895704 820053 844833 936391 980274 989395 989816 820143 726456 682704 553465
10957E53465l7585J06522K26884J9435j47659J03098r5064k72963J9694o1508
$$ 553465 515880 622402 849286 868721 721062 824160 729096 456133 475827 414319
10947D14319J38942Q8070M28o0501J1233R3761p467j26541j43378n0646j90224
$$ 414319 553261 641331 641759 581258 592491 686252 678785 552244 408866 358220 167996
10936A67996N0743L44199J63954j4626R3552P373j37080j9338k6966o0417Q0649
$$ 167996 218739 562938 726892 712266 805818 813191 676111 656773 629807 569390 650039
10925F50039R515j69901j23252j39870p6137J62300K12382J45004R4524j64206
$$ 650039 659554 489653 366401 226531 150394 312694 525076 670080 764604 600398
10915F00398l20990N1251k7068j85442J81060J14736q1993q274q8173L5391J87422
$$ 600398 279408 330659 303591 118149 299209 413945 331952 323678 235505 270896 458318
10904D58318p3887k5797j9889k01238l994Q2842L3079P9343O6797l8250L512j16144
$$ 458318 384431 358634 338745 137507 133513 216355 249434 328777 395574 357324 360836 244692
10892B44692N1249J16484L6709k02758j46705J35036m0899j00032o8572k0914
$$ 244692 295941 412425 449134 246376 99671 234707 193808 93776 25204 4290
10882D290J12965J51709N2876K4806N1855M9692j8663k5805J26882j38202j30359
$$ 4290 117255 268964 321840 346646 398501 448193 429530 403725 530607 392405 262046
10871B62046K76903L7239j0008o8208r1712o2855j22261m4585J10736o597k399
$$ 262046 538949 576188 566180 497972 406260 343405 221144 176559 287295 280698 278299
10860B78299J04439L3797K0156K21975o894n0239j05360l2413n2748J7721J34480
$$ 278299 382738 416535 436691 658666 651772 601533 496173 463760 411012 428733 563213
10849E63213O7521p4008p5124k43718J8277J36989O8604k1625O1933Q71m7500
$$ 563213 630734 556726 481602 237884 256161 393150 461754 440129 502062 502933 455433
10838D55433K09780q7929j50717K2063m3678O4477q0532k8074N1454j68725k08405
$$ 455433 665213 577284 426567 448630 404952 469429 388897 360823 412277 243552 35147
10827C5147p5090N0926M6168Q5658L11R4981n8086k69769K59011L24440j25853
$$ 35147 -39943 10983 57151 142809 143120 238101 180015 -89754 169257 493697 367844
10816C67844j46837L476l7531M6841M8220j91920n8562Q4220P0496q8406M0293
$$ 367844 221007 224483 186952 233793 282013 90093 31531 115751 186247 97841 138134
10805A38134O9782M952M4137N318r5080J19013J70538J08577k8659j73065m8250
$$ 138134 207916 212868 257005 262323 167243 286256 456794 565371 536712 363647 315397
10794C15397j58746k84077J24518P2555j56934M7645n4272o0143J3691J69532
$$ 315397 156651 -127426 -2908 69647 -87287 -39642 -93914 -154057 -140366 29166
10784B9166l9291O855j8220J49245J93441m5758j42836r1697j08816k21915j3314
$$ 29166 -10125 -3270 -21490 127755 321196 275438 132602 40905 -67911 -289826 -303140
10773c03140R2709K9328K17020n885l15830K4951J60309P9329K46632J56269j81080
$$ -303140 -210431 -181103 35917 30032 -285798 -260847 -100538 -21209 225423 381692 200612
10762B00612l9464J27799J8941j15058o0834J09329m1497N4355k80949M9680J53161
$$ 200612 161148 288947 307888 192830 131996 241325 199828 254183 -26766 22914 176075
10751A76075r1584J2857m8866L4813J2202J2874J28176K16846j53387k66852j37372
$$ 176075 84491 97348 48482 83295 95497 108371 236547 453393 300006 33154 -104218
10740a04218o6271K0271K2279l1664L7952P2662m7958j75065J37751k23644k44605
$$ -104218 -170489 -150218 -127939 -159603 -121651 -48989 -96947 -272012 -134261 -357905 -602510
10729f02510p5517m0069J52426K12323k7612M1480R7330n466l3274k17589j13332
$$ -602510 -678027 -718096 -565670 -353347 -380959 -339479 -242149 -247615 -280889 -498478 -611810
10718f11810j59207r9757Q5812J21969J09561Q4098l4713j5417J89845r7284m2996
$$ -611810 -771017 -870774 -784962 -662993 -553432 -469334 -504047 -519464 -329619 -426903 -469899
10707d69899j23252j0801M2292M6160J58415j5465J38828L3827L1556J1612k35492
$$ -469899 -593151 -603952 -561660 -515500 -357085 -372550 -233722 -199895 -168339 -156727 -392219
10696c92219j56760J25814L14166k7333m1697P4442j29869J7912M3219K16465
$$ -392219 -548979 -423165 -108999 -136332 -178029 -103587 -233456 -215544 -172325 44140
10686D4140n675j42459K9734R7657J05744o3032m8074O5341N5606J6557r6592
$$ 44140 38465 -103994 -74260 23397 129141 66109 18035 83376 138982 155539 58947
10675E8947k00908j17043K66554J86467j11932l6723J18104J51727j13704k07392
$$ 58947 -141961 -259004 7550 194017 82085 45362 163466 315193 201489 -5903
10665e903n7950k9980N425j71023Q3124K87044J69330K34402K33651K37330Q0966
$$ -5903 -63853 -93833 -88408 -259431 -176307 110737 280067 514469 748120 985450 1066416
10654A066416l3639K79699j70898k72557j20894l7209K3035K6370o7026j02485
$$ 1066416 1032777 1312476 1141578 869021 748127 710918 733953 760323 693297 590812
10644E90812j06306m0562K55366K09086K20566J1236P0402Q7944L14823N51500
$$ 590812 484506 443944 699310 908396 1128962 1140198 1210600 1298544 1613367 2164867
10634B164867O56223P30124R31869Q95376P53496P98136R31944J113743J654653
$$ 2164867 2821090 3551214 4483083 5378459 6131955 6930091 7862035 8975778 10630431
10625A0630431K393160L286901M719447O398843Q542556J1329467J4469396J6854826
$$ 10630431 13023591 16310492 21029939 27428782 35971338 47300805 61770201 78625027
10617G8625027J8363781J7949229J5442428J0097900L407362j986225l202766
$$ 78625027 96988808 114938037 130380465 140478365 143885727 141899502 138696736
10610A38696736P77606P613477J5594446K4361480L1969694L5403662L3599708
$$ 138696736 139474342 147087819 162682265 187043745 219013439 254417101 288016809
10603B88016809K6055346J2593376n094425j8777695k0718868j2137470J501592
$$ 288016809 314072155 326665531 321571106 302793411 282074543 269937073 271438665
10596B71438665J6252541K9616896L9623814M3016886L7553711K3891476K624272
$$ 271438665 287691206 317308102 356931916 399948802 437502513 461393989 464018261
10589D64018261k4247092m3996676m5356048l3607354j8087107l457494R054882
$$ 464018261 439771169 395774493 350418445 316811091 298723984 295266490 304321372
10582C04321372J7093618J9333582J5247322N307407j0057213k7773293l9072453
$$ 304321372 321414990 340748572 355995894 361303301 351246088 323472795 284400342
10575B84400342l8163313k9198563j8576074r556123k916819J095490K053809
$$ 284400342 246237029 217038466 198462392 188906269 185989450 187084940 189138749
10568A89138749J1151m601753j1118966j7734216k1489887k1261882j7783255
$$ 189138749 189149900 184548147 173429181 155694965 134205078 112943196 95159941
10561I5159941j3985377j0946189q283638o461509n253587m644624l687936l186807
$$ 95159941 81174564 70228375 61944737 55483228 50229641 45585017 41897081 38710274
10553C8710274k819335k910688k894829k479374k108974j940634j807949j615059
$$ 38710274 35890939 32980251 30085422 27606048 25497074 23556440 21748491 20133432
10545B0133432j397046j399771j063157j154633q03488q15666p84506n59972o66505
$$ 20133432 18736386 17336615 16273458 15118825 14315337 13499671 12715165 12155193 11488688
10536A1488688p12030l83373m27478o12917l19613l73439n06527l22851m41690
$$ 11488688 10776658 10393285 9965807 9352890 9033277 8659838 8153311 7830460 7388770
10527G388770l42056j69796l15120j75749k65083l26665j92908j61811n5930l71354
$$ 7388770 7046714 6876918 6561798 6386049 6120966 5794301 5601393 5439582 5383652 5012298
10517E012298j95415j76620k10158j82526r8646j23001j76805k47054m5176J36330
$$ 5012298 4816883 4640263 4430105 4247579 4148933 4025932 3849127 3602073 3556897 3693227
10507C693227R1588j31713Q70m8920m04854k62634P5339j19109n0300j61494J3603
$$ 3693227 3784815 3653102 3653972 3605052 3200198 2937564 3012903 2893794 2843494 2682000 2695603
10496B695603j23695n7061l8747j5807J81400O3618R182J46799Q9995j06367j17215
$$ 2695603 2571908 2514847 2476100 2460293 2641693 2705311 2714493 2861292 2951287 2844920 2727705
10485B727705p3565N2730m1073L2019j59615P6468J94459K50404K5409M137k23548
$$ 2727705 2654140 2706870 2665797 2697816 2538201 2614669 2809128 3059532 3084941 3089078 2865530
10474B865530n7462n2575o6108o8041p467J89007J57312J24435J08581k8814q0390
$$ 2865530 2808068 2755493 2689385 2621344 2613877 2802884 2960196 3084631 3193212 3164398 3084008
10463C084008M7310m8528l08682j64286p3178L408R7659J30998J15890J36717
$$ 3084008 3131318 3082790 2774108 2609822 2536644 2540052 2637711 2768709 2884599 3021316
10453C021316L4954O6472k14627j65313j63828j57569J05108Q5559j18006m627
$$ 3021316 3056270 3122742 2908115 2742802 2578974 2421405 2526513 2612072 2494066 2489439
10443B489439k1698J6325J76143j27895j40107j2725K90706J23860j75802j49845
$$ 2489439 2467741 2484066 2660209 2532314 2392207 2379482 2670188 2794048 2618246 2468401
10433B468401j16228j03927r78k4938K7389R7624j32204k03500j25557M5649j38347
$$ 2468401 2352173 2248246 2247268 2222330 2249719 2347343 2215139 2011639 1886082 1931731 1793384
10422A793384n0654p7183L4971p7318m8503P2787J64704N7674j94022r5438k65672
$$ 1793384 1742730 1665547 1700518 1623200 1574697 1647484 1812188 1869862 1675840 1580402 1314730
10411A314730j82232M9248K53585K52429k6402q1118j82591o3138J30731K6168
$$ 1314730 1132498 1181746 1435331 1687760 1661358 1580240 1397649 1334511 1465242 1491410
10401A491410m403j33043o1341n67K75221L4162N1370j13937q5702Q7104M9241
$$ 1491410 1487007 1353964 1292623 1292056 1567277 1601439 1652809 1538872 1453170 1540274 1589515
10390A589515o8972r2542o7256o4767q6916k03463L3318J98023J6514k4707p5369
$$ 1589515 1520543 1428001 1360745 1295978 1209062 1005599 1038917 1236940 1253454 1228747 1153378
10379A153378j53589J6525J12122J44973K9847p4351o2089k3697j3844r0601Q015
$$ 1153378 999789 1016314 1128436 1273409 1303256 1228905 1166816 1143119 1129275 1038674 1046689
10368A046689j32599j58645J44587J66773Q5726j61057k41074j13348O7620J73686
$$ 1046689 914090 755445 900032 1066805 1152531 991474 750400 637052 704672 878358
10358H78358n5992n6274n2834K12J32693J33027j35532k5771k2982j36692L8008
$$ 878358 822366 766092 713258 713470 846163 979190 843658 817887 794905 658213 696221
10347F96221J30849n3148k7278J00268l2256M628N8787K3493J63956l2779j90357
$$ 696221 827070 773922 746644 846912 814656 819284 878071 901564 1065520 1032741 842384
10336H42384j0606Q7717n3846r9760k36621L2034m5367J40578K77176M7853l6041
$$ 842384 831778 919495 865649 765889 529268 561302 515935 656513 933689 981542 945501
10325I45501K9119K18836Q3033k22270j38742N8505N3920j9880n4860j01802k24531
$$ 945501 974620 1193456 1276489 1054219 915477 973982 1027902 1008022 953162 851360 626829
10314F26829r3452M3097J28646O8606r7381R1555m2956j27994l5319k09657o0938
$$ 626829 533377 576474 705120 773726 676345 767900 724944 596950 561631 351974 291036
10303B91036R7200K57404J38956N9716M6590l44j19238n2293m3943N4645o090
$$ 291036 388236 645640 784596 844312 890902 890558 771320 719027 675084 729729 723639
10292G23639M0318J51540L7613Q9314J33068k04939l77416j18573k331K64121
$$ 723639 763957 915497 953110 1042424 1175492 970553 593137 474564 472233 736354
10282G36354K2996j6821Q6912l3327j11573l2697M7761P5616K08377M7685o4915
$$ 736354 759350 742529 829441 796114 684541 651844 699605 775221 983598 1031283 966368
10271I66368q9924P0985N7550J95760J43294o9048j05740l64662k81870J47237
$$ 966368 876444 947429 1004979 1200739 1344033 1274985 1169245 804583 522713 669950
10261F69950K91964N4612k07331O6132J98449r7076k04047k3295j4691o4220J08515
$$ 669950 961914 1016526 809195 875327 1073776 976700 772653 749358 734667 670447 778962
10250G78962J63156N8018p1174m0057M1885k9704j30145M1633O6686N2586J27945
$$ 778962 942118 1000136 928962 888905 930790 901086 770941 812574 879260 931846 1059791
10239A059791j06298r140r646M8533n8185K2718q1434k04221p7774j27411O685
$$ 1059791 953493 944353 934707 983240 925055 947773 866339 662118 584344 456933 463618
10228D63618Q7153K10810P0968p9696J70289L7445j23756j01324q9393Q2206k0369
$$ 463618 550771 761581 832549 752853 923142 960587 836831 735507 646114 728320 707951
10217G07951k3301J70245j12009r2329J02188J4028K5953J01468o5955m0099j32910
$$ 707951 684650 854895 742886 650557 752745 766773 792726 894194 828239 788140 655230
10206F55230O6522R944J33358J60916k8292k24040j20766q3021J09198M1863J18373
$$ 655230 721752 731696 865054 1025970 997678 773638 652872 569851 679049 720912 839285
10195H39285k5947j9047l2283j30567M6354J69617J86027J95921J6099K4913o6181
$$ 839285 813338 794291 762008 631441 677795 847412 1033439 1229360 1245459 1270372 1204191
10184A204191l1850m3562K50921K41493L6984l6213p9109K43079J95902M4487
$$ 1204191 1172341 1128779 1379700 1621193 1658177 1621964 1542855 1785934 1981836 2026323
10174B026323o9421j89328q0903P6528K61926M09803L10267J82611Q3292K4149
$$ 2026323 1956902 1767574 1686671 1763199 2025125 2434928 2745195 2927806 3011098 3035247
10164C035247j23575k01228k24038k20214o359J34853K17195K71664J78505K22218
$$ 3035247 2911672 2710444 2486406 2266192 2259833 2394686 2611881 2883545 3062050 3284268
10154C284268K02681p4695k86103j65881l36370j18736p2159N5732K08142J86942
$$ 3284268 3486949 3412254 3126151 2960270 2623900 2505164 2433005 2488737 2696879 2883821
10144B883821K6847n0069K2862k04671k80711j59732k68516k65290M880n3643
$$ 2883821 2910668 2860599 2883461 2678790 2398079 2238347 1969831 1704541 1709421 1655778
10134A655778j60821N3978J21902N0553j74309j27719o2607k66466k18045j57337
$$ 1655778 1494957 1548935 1670837 1721390 1547081 1419362 1356755 1090289 872244 714907
10124G14907k12982j18847J06023L7449R3386Q5920q8082k31461O5441j82486
$$ 714907 501925 383078 489101 526550 619936 705856 617774 386313 451754 269268
10114B69268j25244J35375j3038j12298r916o0382l7822k2946K02125K16921p918
$$ 269268 144024 279399 266361 154063 144147 83765 45943 22997 225122 442043 434125
10103D34125L672r410k29100l0574j18072R6073l7724M9867O0328o7598j3421
$$ 434125 437797 428387 199287 168713 50641 146714 108990 158857 219185 151587 138166
10092A38166J31497O3992N982l5160n1150j34236K02626J1937Q773k40457j30366
$$ 138166 269663 333655 339637 304477 253327 119091 321717 333654 342427 101970 -28396
10081b8396J29469J38653k5211j88256j18078J62109K37515Q2499j59854l8032
$$ -28396 101073 239726 214515 26259 -91819 70290 307805 390304 230450 192418
10071A92418q3346r971R003O0089l4471q2425r0371J74798n8076J699R1789J58777
$$ 192418 109072 99101 108104 168193 133722 51297 -39074 135724 77648 79347 171136 329913
10059C29913J08723k39137j2372J81095O0883n5195n428j85925n7667J23323n6381
$$ 329913 438636 199499 187127 368222 429105 373910 368482 182557 124890 248213 191832
10048A91832p4772N9492K00092P3754l444j00297N2671n4329k72349j12911K40639
$$ 191832 117060 176552 376644 450398 446954 346657 399328 344999 72650 -40261 200378
10037B00378M4062J17952r2144m6410m5180l845j06853R476J52071j17170m2296
$$ 200378 244440 362392 270248 223838 178658 174813 67960 77436 229507 112337 70041
10026G0041K1074M8485Q4023l4389N0793k8520j29198J52933O1098o0111q3064
$$ 70041 91115 139600 223623 189234 240027 211507 82309 235242 296340 236229 153165
10015A53165o2531p8477J507J03103J35949j77688k79608J268J90466P8633k98331
$$ 153165 90634 12157 13664 116767 252716 75028 -204580 -203312 -12846 65787 -232544
10004b32544p1065J59516r8506l2314J04882K44400q4452j19447M8191k2867q1797
$$ -232544 -303609 -144093 -242599 -274913 -170031 74369 -10083 -129530 -81339 -104206 -186003
9993a86003L65J69431J08405j44966r6605q9098p6659J8287K38643J00399M629
$$ -186003 -185638 -16207 92198 -52768 -149373 -238471 -315130 -296843 -58200 42199 46828
9982D6828J11938J13678J96301k04921j80839Q7748K1879j05975m4559l7607J0072
$$ 46828 158766 272444 468745 263824 82985 170733 192612 86637 42078 4471 14543
9971A4543j40594K9588N4874L2509Q8143N4747j23935j38194q8837O465O7766
$$ 14543 -126051 -96463 -41589 -9080 79063 133810 9875 -128319 -217156 -210691 -142925
9960a42925K2797L5962J5584J61429J97707k9167k29034j20009r6751L9347L0436
$$ -142925 -120128 -84166 -68582 92847 290554 261387 32353 -87656 -184407 -145060 -114624
9949a14624O0379j9866M3119R1962J11926J52702j53489r1827J31762M6924J68021
$$ -114624 -54245 -74111 -30992 60970 172896 325598 172109 80282 212044 258968 426989
9938D26989M0362j64220j14925J06134Q9404j9411K18586K4062J41096J08376
$$ 426989 467351 303131 188206 294340 383744 364333 582919 606981 748077 856453
9928H56453N16j9630j66307j23299K23079r9725l05389r3034J15452q640J83814
$$ 856453 856969 837339 671032 547733 770812 671087 365698 272664 388116 379476 563290
9917E63290J12078M4517J52864K50525L50747Q4383K14768K87130J97310L38166
$$ 563290 675368 719885 872749 1123274 1474021 1558404 1773172 2060302 2257612 2595778
9907B595778K06304M53270M87118L53400O48399R65006J291635J620914J610213
$$ 2595778 2802082 3255352 3742470 4095870 4744269 5709275 7000910 8621824 10232037
9898A0232037J789627K351911K619575K730032K773211K632189K314985K204260
$$ 10232037 12021664 14373575 16993150 19723182 22496393 25128582 27443567 29647827
9890B9647827J837258J384281J633870J713303J615129J940548K108126J870387
$$ 29647827 31485085 32869366 34503236 36216539 37831668 39772216 41880342 43750729
9882D3750729J492043J020753O92326O26630J166244J317111J925708K585639
$$ 43750729 45242772 46263525 46955851 47582481 48748725 50065836 51991544 54577183
9874E4577183L064396L123105L054521L137875L483945M152428N050767O208027
$$ 54577183 57641579 60764684 63819205 66957080 70441025 74593453 79644220 85852247
9866H5852247O735489O104320M567109K673308P37017r98316j867556j785263
$$ 85852247 92587736 98692056 103259165 105932473 106669490 105671174 103803618 102018355
9858A02018355j384049n02243k94265n544J06843k9478j92509n9639M32064P50827
$$ 102018355 100634306 100132063 99837798 99832254 99939097 99909619 99717110 99657471 100089535 100840362
9848A00840362J156287J282012J158057R59369N44302L19630M69219J166462J862545
$$ 100840362 101996649 103278661 104436718 105396087 105940389 106260019 106729238 107895700 109758245
9839A09758245K420942K618962J776222k90821k109020l791929n037722n629840
$$ 109758245 112179187 114798149 116574371 116283550 114174530 110382601 105344879 99715039
9831I9715039n285867m708104m329331l796720k814957k085534j662137j357006
$$ 99715039 94429172 89721068 85391737 81595017 78780060 76694526 75032389 73675383
9823G3675383j146178o26424m36O50410J005180J406183J663284J494777J768099
$$ 73675383 72529205 71902781 71902345 72552755 73557935 74964118 76627402 78122179 79890278
9814G9890278K285680J866204J610674J372405Q17565L43735J09977J02963J23836
$$ 79890278 82175958 84042162 85652836 87025241 87842806 88186541 88296518 88399481 88523317
9805H8523317k17809n18781n02680l70877k67317m31040q89414q02322l81070
$$ 88523317 88305508 87786727 87284047 86913170 86645853 86214813 85325399 84523077 84142007
9796H4142007l6053O27189J291795J827622K410001K833563L836631N019901O032158
$$ 84142007 84105954 84733143 86024938 87852560 90262561 93096124 96932755 101952656 107984814
9787A07984814P212102P790767P452475O774218N306199L432543R06908j071534
$$ 107984814 115196916 122987683 130440158 137214376 142520575 145953118 146860026 145788492
9779A45788492k140544k523590j757707n79180J90063P04371N78467j47527q11019
$$ 145788492 143647948 141124358 139366651 138787471 138977534 139681905 140260372 140112845 139301826
9770A39301826j233954j162364q23674l83319L2507K80038J84990L07665O51449
$$ 139301826 138067872 136905508 136081834 135698515 135731022 136011060 136196050 136503715 137155164
9761A37155164J123990J737970K855796L301266L034807K112054J14741k690085
$$ 137155164 138279154 140017124 142872920 146174186 149208993 151321047 151435788 148745703
9753A48745703n176213o940804p688812p429618o466983n192094l668095l488101
$$ 148745703 143569490 136628686 128939874 121510256 115043273 109851179 106183084 102694983
9745A02694983l370237l396890l482290l388916l069137k446997j704204j370776
$$ 102694983 99324746 95927856 92445566 89056650 85987513 83540516 81836312 80465536
9737H0465536j487351j690728k266514k685431k683432k477488k383962k050004
$$ 80465536 78978185 77287457 75020943 72335512 69652080 67174592 64790630 62740626
9729F2740626j903430k174963k432714k744079l263628l799549l781279l672417
$$ 62740626 60837196 58662233 56229519 53485440 50221812 46422263 42640984 38968567
9721C8968567l598578l246731k622643k700757k365103j799045j461887j465054
$$ 38968567 35369989 32123258 29500615 26799858 24434755 22635710 21173823 19708769
9713A9708769j374432j284954j086652j027051r62730p09758o24726q33153p27506
$$ 19708769 18334337 17049383 15962731 14935680 13972950 13263192 12638466 11805313 11077807
9704A1077807l39655m27663n08528n91273n28510k84982l67898o17424m07044
$$ 11077807 10738152 10310489 9801961 9210688 8682178 8397196 8029298 7411874 7004830
9695G004830j35920j42178j71434k68470k22451j19244n8580o5435j89304p9076
$$ 7004830 6868910 6726732 6555298 6286828 6064377 5945133 5886553 5821118 5631814 5552738
9685E552738p5462j13120p0306P2131L8191k88869l41689k41868n3637k9863k79828
$$ 5552738 5477276 5364156 5293850 5365981 5404172 5115303 4773614 4531746 4478109 4448246 4168418
9674D168418j44894J28003n5242j37010q7020k56523p6030J49220J11076n446
$$ 4168418 4023524 4151527 4096285 3959275 3872255 3615732 3539702 3688922 3799998 3794552
9664C794552R1311J35424k2963l0266R846J89399J30572M52601Q95680Q22847
$$ 3794552 3885863 4021287 3998324 3968058 3977904 4167303 4297875 4750476 5646156 6469003
9654F469003J369168K172422K485343J907947J259780L85562k078202l538835
$$ 6469003 7838171 10010593 12495936 14403883 15663663 16049225 13971023 10432188
9646A0432188k483779j298546p47177m66125l68035k61238j52459j49403j11043
$$ 10432188 7948409 6649863 5902686 5436561 5068526 4807288 4654829 4505426 4394383
9637D394383k243J2982J3068m27109j45560J17267k34831k89566j57477R0096
$$ 4394383 4392140 4405122 4418190 3991081 3845521 3962788 3727957 3438391 3280914 3371010
9627C371010J62050n209j56701L314l5349j03792o8387r7415j07865k48921l304
$$ 3371010 3533060 3527851 3371150 3374464 3339115 3235323 3166936 3069521 2961656 2712735 2709431
9616B709431q9575K009k22495Q9995J3344p5273j59937j08518J04012M4062J00876
$$ 2709431 2619856 2621865 2399370 2489365 2502709 2427436 2267499 2158981 2262993 2307055 2407931
9605B407931R7410L8011P9252J02679j45916j44179J52587M8391q114k83071k08661
$$ 2407931 2505341 2543352 2622604 2725283 2579367 2435188 2587775 2636166 2628052 2344981 2136320
9594B136320m3174p0264O7587l4387m1567R3997P470Q0451P3903k78777k17480
$$ 2136320 2093146 2022882 2090469 2056082 2014515 2108512 2115982 2196433 2270336 1991559 1774079
9583A774079K0873R2477J12136k2870l1905N1268j47874j47921r8854o8711J47508
$$ 1774079 1794952 1887429 1999565 1976695 1944790 1996058 1848184 1700263 1601409 1532698 1680206
9572A680206m7190q9632k1417J33117q8280n5100j56858J8590N9070j3895p55
$$ 1680206 1633016 1543384 1521967 1655084 1566804 1511704 1354846 1373436 1432506 1418611 1417856
9561A417856M6338P5121o1927j56236N7251L4413j31233k7322j6765l4952m8034
$$ 1417856 1464194 1539315 1477388 1321152 1378403 1412816 1281583 1254261 1237496 1202544 1154510
9550A154510Q1385J1826K4540L7446m8534N1544R1460l8343j57781K806J76568
$$ 1154510 1235895 1247721 1272261 1309707 1261173 1312717 1404177 1365834 1208053 1210859 1387427
9539A387427K62530m2756j00344j32299k29711o7894j49751l8215Q477r3606N6882
$$ 1387427 1649957 1607201 1506857 1374558 1144847 1076953 927202 888987 897464 803858 860740
9528H60740N3506m5743j10508M2450J21105M8361k7582k1507J35662R1650q1584
$$ 860740 914246 868503 757995 800445 921550 969911 942329 920822 1056484 1148134 1066550
9517A066550J0193J56145N5775M4850k61720r8336k9557K85220r1942j37654k04385
$$ 1066550 1076743 1232888 1288663 1333513 1071793 973457 943900 1229120 1137178 999524 795139
9506G95139j24597P8334J46091P4343O5338l6855k12132K6806K46672K3672j51295
$$ 795139 670542 748876 894967 969310 1034648 997793 785661 812467 1059139 1082811 931516
9495I31516j29561R8058N3782j71741j3837q671j44129N4166M6237K8717o0769
$$ 931516 801955 900013 953795 782054 768217 759546 615417 669583 715820 744537 683768
9484F83768j12448P9939P7549J05463J5991n3325n699J89599j05977j33993J6741
$$ 683768 571320 651259 728808 834271 850262 796937 791238 980837 874860 740867 757608
9473G57608j44943j05466M9210J82274R0635J08159j61461j06974R6252J2749
$$ 757608 612665 507199 556409 738683 829318 937477 776016 669042 765294 778043
9463G78043R4686n8880n8369K6141O4071o519K7682J70998M6646j51721r7714
$$ 778043 872729 813849 755480 781621 845692 839173 866855 1037853 1084499 932778 835064
9452H35064p6947K09838K41069P5163j39411L2205N2938j07807k5888N5957J01834
$$ 835064 758117 967955 1209024 1284187 1144776 1176981 1229919 1122112 1096224 1152181 1254015
9441A254015M0581j53239p5781j51056j1971J2050l927l5864N4165J5932L0277
$$ 1254015 1294596 1141357 1065576 914520 902549 914599 910672 874808 928973 944905 975182
9430I75182J08448L8542k5881j60426L3030j06089n482J9456j07513j4106J6508
$$ 975182 1083630 1122172 1096291 935865 968895 862806 857324 876780 769267 755161 771669
9419G71669J67871j5267j03083j03352j9996J88297O2376m486j05736j04472l9347
$$ 771669 939540 924273 821190 717838 697842 886139 948515 944029 838293 733821 694474
9408F94474l8189R2605J91099k4228J4286J07269o7816r2874j5610M5788j9207
$$ 694474 656285 748890 939989 915761 930047 1037316 969500 876626 861016 906804 887597
9397H87597n3090K37839j3644j13393K2717m7374L790R1041Q1087J75326J52811
$$ 887597 834507 1072346 1058702 945309 968026 920652 924442 1015483 1096570 1271896 1424707
9386A424707J13840L9611j99813j97051p4460l5710j0193O3742J2523O8195k4996
$$ 1424707 1538547 1578158 1378345 1181294 1106834 1071124 1060931 1124673 1137196 1205391 1180395
9375A180395K20568P4621K45130K56488Q7437j28337N2665J48875K25870J094
$$ 1180395 1400963 1475584 1720714 1977202 2064639 1936302 1988967 2137842 2363712 2364806
9365B364806N8041k9986J69089K42353J86075K88562K72090L74891M21903L66458
$$ 2364806 2422847 2392861 2561950 2804303 2990378 3278940 3551030 3925921 4347824 4714282
9355D714282M47159M56831P55902R36886Q90588J167104J405291J738757K160032
$$ 4714282 5161441 5618272 6374174 7311060 8201648 9368752 10774043 12512800 14672832
9346A4672832K774025L660748M319827N362233O291843O997748P124538O730421
$$ 14672832 17446857 21107605 25427432 30789665 37081508 44079256 51203794 57934215
9338E7934215N407434L099972J80946k784392m931206n924771n730340n132107
$$ 57934215 63341649 66441621 66622567 63838175 58906969 52982198 47251858 42119751
9330D2119751m202258l522355k892838j988852j558341j097775o68856j09937
$$ 42119751 37917493 34395138 31502300 29513448 27955107 26857332 26188476 26078539
9322B6078539L75202Q22541J449002K367618L322707M353005N064901N902745
$$ 26078539 26453741 27276282 28725284 31092902 34415609 38768614 43833515 49736260
9314D9736260O545620O320261N093366L187974R69071j443077l692835n076188
$$ 49736260 56281880 62602141 67695507 70883481 71852552 70409475 66716640 61640452
9306F1640452n652811n133442m502469m014342l699249l079236k570717j918388
$$ 61640452 55987641 50854199 46351730 42337388 38638139 35558903 32988186 31069798
9298C1069798j409844j074148j001379l94919m41N43247R29380J396765J819998
$$ 31069798 29659954 28585806 27584427 27189508 27189067 27732314 28661694 30058459 31878457
9289C1878457K452047L622871M677108N856285P179532Q560819R984929J0598084
$$ 31878457 34330504 37953375 42630483 48486768 55666300 64227119 74212048 84810132
9281H4810132J1239282J0587920R015364O156926K938332n09617m124119o539268
$$ 84810132 96049414 106637334 115652698 121809624 124747956 124238339 120114220 113574952
9273A13574952p584528q071590p642487o865808n772140m455951l169489j604199
$$ 113574952 105990424 97918834 90276347 83410539 77638399 73182448 70012959 68408760
9265F8408760l02725J128376K674101M217518N790429P637463R785684J1161870
$$ 68408760 68106035 69234411 71908512 76126030 81916459 89553922 99339606 110501476
9257A10501476J2450048J2797509J2108062J0287550P111612K993614r88348m722367
$$ 110501476 122951524 135749033 147857095 158144645 165256257 168249871 167261523 162539156
9249A62539156p542200r413855j0748760j1137249j0627998r882796q783077p274061
$$ 162539156 154996956 145583101 134834341 123697092 113069094 103186298 94403221 87129160
9241H7129160n931554n347621l890649k618664j771217o14930Q77667J778678
$$ 87129160 81197606 75849985 71959336 69340672 67569455 66954525 67832192 69610870
9233F9610870K585933K834190K855539K587901J846640Q83199N3605q88469j261690
$$ 69610870 72196803 75030993 77886532 80474433 82321073 83204272 83257877 82369408 81107718
9224H1107718p39476J64630J311322K219531K594394K536253J442456l34512k239093
$$ 81107718 80368242 80532872 81844194 84063725 86658119 89194372 90636828 90302316 88063223
9215H8063223l554208m614331m828840m854708m285945l100420k173738j314848
$$ 88063223 84509015 79894684 75065844 70211136 65925191 62824771 60651033 59336185
9207E9336185J8261J485688K777132L896456N305402O745942Q000441R273909
$$ 59336185 59354446 60840134 63617266 67513722 72819124 79565066 87565507 96839416
9199I6839416R991327J0839843J0527538R447228P834972N192931K118743j616819
$$ 96839416 106830743 117670586 128198124 137645352 145480324 150673255 152791998 151175179
9191A51175179n237214q346410j0125684j0543671j0329397r415609q217918o831453
$$ 151175179 145937965 137591555 127465871 116922200 106592803 97177194 88959276 82127823
9183H2127823n582733m206646k912941j860068n42092R66772K041750L212340
$$ 82127823 76545090 72338444 69425503 67565435 67023343 67990115 70031865 73244205
9175G3244205M339626N445849O044841N974953N203992L719278J682835q99097
$$ 73244205 77583831 83029680 89074521 95049474 100253466 103972744 105655579 104756482
9167A04756482l677006n940735p262923q143289q309285p520755o396113n468909
$$ 104756482 101079476 95138741 87875818 79732529 71423244 63902489 57506376 52037467
9159E2037467m508134l856365l215520k673914k573855k360623j720494j407099
$$ 52037467 47529333 43672968 40457448 37783534 35209679 32849056 31128562 29721463
9151B9721463j029195o44564o18902j57319J34256Q39192J241571J679852K419424
$$ 29721463 28692268 28047704 27428802 27271483 27405739 28244931 29486502 31166354 33585778
9142C3585778L008301L416851L635280L995115M219857L513670K517885J063908
$$ 33585778 36594079 40010930 43646210 47641325 51861182 55374852 57892737 58956645
9134E8956645j136831l015215l899186m327515m299887l878268l222228k512490
$$ 58956645 57819814 54804599 50905413 46577898 42278011 38399743 35177515 32665025
9126C2665025j969470j134044p56422j07943P16940J764631K661417M181507O286385
$$ 32665025 30695555 29561511 28805089 28697146 29414086 31178717 33840134 38021641 44308026
9117D4308026P941194Q411854P299668M922273J801355j015680k110946j868271
$$ 44308026 52249220 60661074 67960742 72883015 74684370 73668690 71557744 69689473
9109F9689473k339758l090281m174497n421371n727055n442333m765578m153743
$$ 69689473 67349715 64259434 60084937 54663566 48936511 43494178 38728600 34574857
9101C4574857l608593l042028k491862k117196j952199j609765j575855j330160
$$ 34574857 30966264 27924236 25432374 23315178 21362979 19753214 18177359 16847199
9093A6847199r86705j022033j050442j194791p36245o55803o20392o35469o78263
$$ 16847199 15860494 14838461 13788019 12593228 11856983 11201180 10580788 9945319 9267056
9084I267056o37810k96648l20530m36552l84136l05917j85688k67175j98447q7839
$$ 9267056 8629246 8332598 8012068 7575516 7191380 6885463 6699775 6432600 6234153 6146314
9074F146314m06062k17334o3416j64178k9500k01821k08431k35450k07685n1831
$$ 6146314 5740252 5522918 5459502 5295324 5265824 5064003 4855572 4620122 4412437 4360606
9064D360606J36093j88223j42004r2806K0652J09623J08440j86576o9601j46117
$$ 4360606 4496699 4308476 4166472 4073666 4094318 4203941 4312381 4125805 4056204 3910087
9054C910087O8364R3619j59370j38003Q3747j25186l40142j17875l6108j27087
$$ 3910087 3978451 4072070 3912700 3774697 3858444 3733258 3393116 3275241 3239133 3112046
9044C112046j0008J47313N9137k5675q2365p3856j95494j30036p0007j7435j80910
$$ 3112046 3102038 3249351 3308488 3282813 3200448 3126592 2931098 2801062 2731055 2713620 2532710
9033B532710K3579J00254K9322q372K8808k6532j39358o8541n8944k0986J27299
$$ 2532710 2556289 2656543 2685865 2677493 2706301 2679769 2540411 2471870 2412926 2391940 2519239
9022B519239J1046N9500M9390j95766j43478q3761j25792L5830K8194O5587Q7022
$$ 2519239 2530285 2589785 2639175 2443409 2299931 2216170 2090378 2126208 2154402 2219989 2307011
9011B307011l3111p6861J8817O7659J4844j20790j30875J45881N3997m9950j32971
$$ 2307011 2273900 2197039 2215856 2283515 2298359 2177569 2046694 2192575 2246572 2196622 2063651
9000B063651p837p5891j84950Q953R3904j6119J3274J3071Q6439J0897J80357
$$ 2063651 2055814 1979923 1794973 1803926 1897830 1881711 1894985 1908056 1994495 2005392 2185749
8989B185749J37397J18107p0040j88112j76781n2649R3763m0222q8799q3574J84697
$$ 2185749 2323146 2441253 2371213 2183101 2006320 1953671 2047434 2007212 1918413 1834839 2019536
8978B019536M964j27247m9541j49455j61925l5982K21519L3619R6913l9287M1816
$$ 2019536 2024500 1897253 1847712 1698257 1536332 1500350 1721869 1755488 1852401 1813114 1854930
8967A854930J73028r0565j08142l5222j34374k5600R8591L9675q9679k37959J62077
$$ 1854930 2027958 1937393 1829251 1794029 1659655 1634055 1732646 1772321 1682642 1444683 1606760
8956A606760J95339J48452k18613k45872p776L317p1473l0505L7870j85935P1985
$$ 1606760 1802099 1950551 1731938 1486066 1478290 1481607 1410134 1379629 1417499 1231564 1303549
8945A303549K05896J12711k2180m9548m9929O4994j33447q1787r8248N127P0849
$$ 1303549 1509445 1622156 1599976 1550428 1500499 1565493 1432046 1350259 1252011 1257138 1327987
8934A327987J75140J02470J46446J25334J29300q7456k50451P294j96703j29853
$$ 1327987 1503127 1605597 1752043 1877377 2006677 1919221 1668770 1676064 1479361 1349508
8924A349508J01046M1930Q6341j75502j38563L2887K4730R8417J2382j76522j31515
$$ 1349508 1450554 1492484 1578825 1403323 1264760 1297647 1322377 1420794 1433176 1256654 1125139
8913A125139O7958J05539k5558k4640o1639l1791J31534P1430J02190O8377l1613
$$ 1125139 1193097 1298636 1273078 1248438 1186799 1155008 1286542 1357972 1460162 1528539 1496926
8902A496926N944j38666L2272P4471Q5094m5390J2969m6125Q0452Q5730Q0485
$$ 1496926 1502870 1364204 1396476 1470947 1556041 1510651 1523620 1477495 1557947 1643677 1724162
8891A724162j43356j11685q0193q9858j32919P2168m0331J40426P8456o5700J54282
$$ 1724162 1580806 1469121 1388928 1299070 1166151 1238319 1197988 1338414 1416870 1351170 1505452
8880A505452J35124o7329r8378J20204m4835m1082L909j44716m6360K20375J2847
$$ 1505452 1640576 1573247 1474869 1595073 1550238 1509156 1513065 1368349 1321989 1542364 1555211
8869A555211j75599K6827J90231k5219j62406L8984R6379j13171j42341J81K9025
$$ 1555211 1379612 1406439 1596670 1571451 1409045 1448029 1544408 1431237 1288896 1289077 1318102
8858A318102K33578J38448o4258Q5074j42871q8760q9843j17907M9414J06844
$$ 1318102 1551680 1690128 1625870 1710944 1568073 1479313 1389470 1271563 1320977 1427821
8848A427821n6117Q3704J01259Q6257J27026J3688R3483j0141P0879m452N8511
$$ 1427821 1371704 1455408 1556667 1642924 1769950 1783638 1877121 1866980 1937859 1933407 1991918
8837A991918M7270j65732L6513L1182k98662j23368k8531n8169r4874N3675R2234
$$ 1991918 2039188 1873456 1909969 1941151 1642489 1519121 1490590 1432421 1337547 1391222 1483456
8826A483456K5571J43936K34811P3525Q3436M6260Q2316q3190j60224j16427l6423
$$ 1483456 1509027 1652963 1887774 1961299 2044735 2090995 2173311 2090121 1929897 1813470 1777047
8815A777047p1318j81540q6884J43651L4622N1185k03909j61225J48993J0643
$$ 1777047 1705729 1524189 1437305 1580956 1615578 1666763 1462854 1301629 1450622 1461265
8805A461265N4747P1302L493J27095o2122k04678M674q9814j17818J22692j7694
$$ 1461265 1516012 1587314 1590807 1717902 1655780 1451102 1455776 1365962 1248144 1370836 1353142
8794A353142j69996J63920J16782K60745L01562J2179m5175j0018J30813J92614
$$ 1353142 1183146 1347066 1463848 1724593 2026155 2038334 1993159 1983141 2113954 2306568
8784B306568R4384L87188K32269M44300O49260P08055J149432J679543K057244
$$ 2306568 2400952 2788140 3020409 3464709 4113969 4822024 5971456 7650999 9708243
8775I708243J812389J046440J73870j279680k356533k161677j367347o75313m69164
$$ 9708243 11520632 12567072 12740942 11461262 9104729 6943052 5575705 4900392 4431228
8766D431228m30276l57334j75940k75729j02867L2710m8077j37071j08414q9467
$$ 4431228 4000952 3643618 3467678 3191949 3089082 3121792 3073715 2936644 2828230 2738763
8756B738763m05657j78584o9316R7876j02667p6964o0725R6495P518M9099j63010
$$ 2738763 2333106 2154522 2085206 2183082 2080415 2003451 1942726 2039221 2046739 2095838 1932828
8745A932828m5183J04879Q6046k7286J76108M71559K73775L34989M84364Q20410
$$ 1932828 1887645 1992524 2078570 2051284 2227392 2698951 2972726 3307715 3792079 4612489
8735D612489J427518K020950K997856L923138M322758L646737K009676m79254
$$ 4612489 6040007 8060957 11058813 14981951 19304709 22951446 24961122 24481868
8727B4481868l929670m838836l873670k482414j653822j270761q76533m94437
$$ 24481868 20552198 15713362 11839692 9357278 7703456 6432695 5556162 5061725
8719E061725n27760l12536j96840j86083j99359l61210j01326r8634j82054j86258
$$ 5061725 4533965 4221429 4024589 3838506 3639147 3277937 3176611 3077977 2895923 2709665
8709B709665m0394j22149l2780L0969n1714M4452N7112R7182o6656k47211J70674
$$ 2709665 2669271 2547122 2514342 2545311 2493597 2538049 2595161 2692343 2625687 2378476 2549150
8698B549150L3457q5053o4867o6879J13620J21084M86995N97401P82486J220770
$$ 2549150 2582607 2497554 2432687 2365808 2479428 2600512 3087507 3684908 4467394 5688164
8688E688164J455323J690371J823447J357988N77543p75369k102693k103328j543226
$$ 5688164 7143487 8833858 10657305 12015293 12592836 11817467 9714774 7611446 6068220
8679F068220j168156p79447l88583k28775k24206m95935l04461q8698R7730p4199
$$ 6068220 4900064 4120617 3732034 3503259 3279053 2783118 2478657 2389959 2487689 2413490
8669B413490j11963j60163j43426k09298j94931k17759J1815l8572o3823N3186
$$ 2413490 2301527 2141364 1997938 1788640 1593709 1375950 1387765 1349193 1285370 1338556
8659A338556j58258k15143j92838N5738L6635j7373o6386J12494J09949L6311
$$ 1338556 1180298 965155 772317 828055 864690 847317 780931 893425 1003374 1039685
8649A039685o0853l0128R5243M3340k29222k05121J03170k49J27530k0511r8456
$$ 1039685 978832 948704 1043947 1087287 858065 652944 756114 755865 883395 862884 764428
8638G64428J48545q0064l8991J25766O6084j36479j97328j06242n4633j999J4041
$$ 764428 912973 832909 793918 919684 985768 849289 651961 545719 491086 489087 503128
8627E03128J39220J9787q6018k19971q3899K3325K16453n6187q6608J75215J34983
$$ 503128 642348 662135 576117 356146 272247 295572 512025 455838 369230 544445 679428
8616F79428N0347j25843m8530R6138j19995k3641N4775j81075K27752J1760q5707
$$ 679428 729775 603932 555402 651540 531545 507904 562679 381604 609356 621116 535409
8605E35409j9666K8003j06027P2345P3175J35412M9253n4263r671M6268n5471
$$ 535409 515743 543746 437719 510064 583239 718651 767904 713641 703970 750238 694767
8594F94767o567J36518m9526n3657j24018R191J48645q0671j62070J34590J42190
$$ 694767 688200 824718 775192 721535 597517 606708 755353 674682 512612 647202 789392
8583G89392J28869M6401p3023l5042k18252j05267q3395k4500J99993J23846P1648
$$ 789392 918261 964662 891639 856597 638345 533078 449683 425183 625176 749022 820670
8572H20670m8407N0924J47366n4890l0777l0535j66492j20878J3598J84404Q6943
$$ 820670 772263 823187 970553 915663 884886 854351 687859 566981 580579 764983 851926
8561H51926k2074r7717r3654o5376p7022j16553K404J42116o2896J5870o2741
$$ 851926 829852 732135 638481 573105 496083 379530 381934 524050 461154 477024 414283
8550D14283P1097r422J01415N9883r7758p6263O3217q5373j23813J58213o283
$$ 414283 485380 475958 577373 637256 539498 463235 526452 441079 317266 475479 469196
8539D69196L1823J80212J13768q0771K5553q3478j64010j47803j33248M0023L6815
$$ 469196 501019 681231 794999 714228 739781 656303 492293 344490 211242 251265 288080
8528B88080K15698O9987K8728J01667l6675n3646j8613P9775o4991j95334k23773
$$ 288080 503778 573765 602493 704160 667485 613839 595226 675001 610010 414676 190903
8517A90903l5054K0557J74761K17385l2634l8161K6374J63922J70969J09017k25984
$$ 190903 155849 176406 351167 568552 535918 497757 524131 688053 859022 968039 742055
8506G42055j79246j65057J25623J01072j31670j40501L00881K16011j33661j16126
$$ 742055 562809 397752 523375 624447 492777 352276 653157 869168 735507 619381
8496F19381M6985M8124k83419j18710R3116j324J64721K5490O2088J93329k07859
$$ 619381 666366 714490 431071 312361 405477 404153 568874 594364 656452 849781 641922
8485F41922k32639J20619K35317J28871M6043j43417k40903k27703o6251J15507
$$ 641922 409283 529902 765219 894090 940133 796716 555813 328110 261859 377366
8475C77366M0495j22653Q7242Q2275j9972J740P8297N4854L0309J452j22057l2561
$$ 377366 417861 295208 382450 464725 444753 446493 524790 579644 609953 611405 489348 456787
8463D56787r3395j87185j9809Q4479J49086J47266n6198j22585j67189J9455J09777
$$ 456787 363392 176207 156398 240877 389963 537229 481031 358446 191257 210712 320489
8452C20489N9882Q6819M8027j22958j45347P4628K23882q026p7477L0069K9651
$$ 320489 380371 467190 515217 392259 246912 321540 545422 537396 459919 489988 519639
8441E19639O0054J46068k03211j99542K0321K0650j12638j65189K12548J08734
$$ 519639 579693 725761 522550 323008 343329 363979 251341 86152 298700 407434
8431D07434k1445j5157m8883j48125K08771L28726r1321r4593p1262l4497m5458
$$ 407434 385989 370832 321949 173824 382595 711321 620000 525407 454145 419648 374190
8420C74190j22622k76860O7904J17790N1422K26129J11867p7863j54238N5750
$$ 374190 251568 -25292 42612 160402 211824 437953 549820 471957 317719 373469
8410C73469K43845Q2054k6137j54300r3035j90162j51597n8380o1936O4448K49734
$$ 373469 617314 699368 673231 518931 425896 235734 84137 25757 -36179 28269 278003
8399B78003J56271P7634K13178K43699L47582K7274m922l1380k67188j3310K13502
$$ 278003 434274 511908 725086 968785 1316367 1343641 1338719 1307339 1040151 1026841 1240343
8388A240343K93858K73460J38616L52627N85090O82750P65745P76384O20012K12815
$$ 1240343 1534201 1807661 1946277 2298904 2883994 3566744 4332489 5108873 5728885 5941700
8378E941700q42009j478989j212173m90616j48173k43637k73318j28004m5802
$$ 5941700 5099691 3620702 2408529 1917913 1769740 1526103 1252785 1124781 1078979
8369A078979K7006k60108k63416O9904K7552N5564J0790J28242o0530k03687j60224
$$ 1078979 1105985 845877 582461 652365 679917 735481 746271 874513 813983 610296 450072
8358D50072M858J33969P376J75390J99836J49462L00518J97153K95842K34679
$$ 450072 454930 588899 596275 771665 971501 1120963 1421481 1618634 1914476 2149155
8348B149155j096j41471m92606k73052L1209L38004N33825N76031K90553R4044
$$ 2149155 2148059 2006588 1513982 1240930 1272139 1610143 2143968 2719999 3010552 3104596
8338C104596j1225m34945o42478m87975k61318j48084m7306j31489j76576Q1734
$$ 3104596 3093371 2658426 2015948 1527973 1266655 1118571 1071265 939776 763200 844934
8328H44934J86686j12124n7322k48160j08484O9989J34474L2778o8822j95489
$$ 844934 1031620 919496 862174 614014 505530 575519 709993 742771 673949 478460
8318D78460O1764J3197n4306R4468J03462P3537M1199Q1115R1611j12616N7685
$$ 478460 540224 553421 499115 593583 697045 770582 811781 892896 984507 871891 929576
8307I29576J71071L4245L20908k5221l4564N6337r7175L51651N90082O94841J012258
$$ 929576 1100647 1134892 1455800 1430579 1396015 1452352 1355177 1706828 2296910 2991751 4004009
8296D004009P69116O81412M35830o09199j470972j120061p13627l98488j75480
$$ 4004009 4773125 5454537 5890367 5281168 3810196 2690135 1976508 1578020 1402540
8287A402540j93052j57216o4040O0675m0341k7766j616J24144n7806M2278K0594
$$ 1402540 1209488 1052272 988232 1048907 1008566 980800 979184 1103328 1045522 1087800 1108394
8276A108394k83528r4685K6931K05926k0473l3704j89069k25259m4923q2491n580
$$ 1108394 824866 730181 757112 963038 942565 908861 719792 494533 449610 367119 361539
8265C61539J96036J39429j22514L3958j03964j14733J03962Q3612K61107L01712
$$ 361539 557575 697004 574490 608448 504484 389751 493713 577325 838432 1140144
8255A140144O4735L47563M19796L41353M45021J20783l13687n87679l83192l51224
$$ 1140144 1204879 1552442 1972238 2313591 2758612 2879395 2565708 1978029 1594837 1243613
8245A243613l56641j55994k11450j72401J29505K63434J55440j668m03038j50681
$$ 1243613 886972 730978 519528 347127 476632 740066 895506 893838 490800 340119
8235C40119N7487J69573O3697j03464q4768r0898j72021q5664K72692J24416J30707
$$ 340119 397606 567179 630876 527412 442644 351746 179725 94061 366753 491169 621876
8224F21876m7377j45437l7763J65124J97071L147k33041j92455P136j57838j75696
$$ 621876 574499 429062 391299 556423 753494 756641 523600 331145 338281 180443 4747
8213D747j1012J34955J62943L9823p5796N8237J1745m3962Q7435L4203R9617o8585
$$ 4747 -6265 128690 291633 331456 255660 313897 325642 281680 369115 403318 502935 434350
8201D34350r8729l3734Q3822O0547p758j41308N3248J05183j30104p1050P4201
$$ 434350 335621 301887 385709 446256 438498 297190 350438 455621 325517 254467 328668
8190C28668Q9312P6302j74627k28801N0851l7456Q8455K8115o5514K13875J78040
$$ 328668 417980 494282 319655 90854 141705 104249 192704 220819 155305 369180 547220
8179E47220K75081J19012J219J01342n535K15836L1770l1825q3396p6543k23854
$$ 547220 822301 941313 942532 1043874 1038339 1254175 1285945 1254120 1170724 1094181 870327
8168H70327j85657r7723k46728j56292M5355l7478K81955K59152p7867k06679
$$ 870327 684670 586947 340219 183927 229282 191804 473759 732911 655044 448365
8158D48365j2019O1366L3813n0829m4836J83378M6522l8898j37658O3721R00J01395
$$ 448365 436346 497712 531525 480696 435860 619238 665760 626862 489204 552925 553825 655220
8146F55220n4804p0289q8056j62587J02289J64812p1411J4099K25276K97911L51036
$$ 655220 600416 530127 442071 279484 381773 546585 475174 489273 714549 1012460 1363496
8135A363496J62476K38603K98393P1075R374l65356j91517k43824j22699j27306
$$ 1363496 1525972 1764575 2062968 2134043 2143417 1778061 1586544 1342720 1220021 1092715
8125A092715j74688n8923o5992N0767R0875j50353n9260j61318k36k9233k6071
$$ 1092715 918027 859104 793112 843879 934754 784401 725141 563823 563587 534354 508283
8114E08283r3407k34961o2408R0254J04201m4827m4944M7393J38762o4732k97431
$$ 508283 414876 179915 117507 207761 311962 267135 222191 269584 408346 343614 46183
8103D6183K33432o4016l9463M9815r1763r4483K71272O2502m1882J9208L8128
$$ 46183 279615 215599 176136 225951 134188 39705 310977 373479 331597 350805 388933
8092C88933K2726J56703J96448K90088R544m5307j0137o6519j5293p1272R555
$$ 388933 411659 568362 764810 1054898 1064442 1019135 1008998 942479 927186 855914 865469
8081H65469k59234k46785J0150P4639k20600m8834J49311J05191j53973K5437
$$ 865469 606235 359450 369600 444239 223639 174805 324116 429307 275334 300771
8071C00771j0001j60250o1136J76978J13071K5329o1483j24463M8246j2769N8819
$$ 300771 290770 130520 69384 246362 359433 384762 323279 198816 247062 234293 293112
8060B93112K22825O8139K2815J07118j64516R765o466m1804q2445j4869O8916
$$ 293112 515937 584076 606891 714009 549493 559258 552792 510988 428543 413674 482590
8049D82590N9740m1526o0561M3963l405L3502k7622J13299j96627P981P9256q4603
$$ 482590 542330 500804 440243 484206 480801 514303 486681 599980 403353 411334 490590 405987
8037D05987j24343m6626P8241O8138O998M8392n1143J23009n8146j49620o8744
$$ 405987 281644 235018 313259 381397 388395 436787 385644 508653 450507 300887 232143
8026B32143Q463q198N0870J87085J0540k9099J238r1820k1534k2707P9428L2722
$$ 232143 240606 232408 283278 470363 480903 451804 453042 361222 339688 316981 396409 429131
8014D29131l1712L1264O1229o6453n2306j87737N7571O3933P1853j021m4017J52484
$$ 429131 397419 428683 489912 423459 371153 183416 240987 304920 376773 375752 331735 484219
8002D84219L56556N3960q9021o1000k59461r6905Q0745K0058K8200j37014k557
$$ 484219 840775 894735 805714 744714 485253 388348 469093 489151 517351 380337 377780
7991C77780n6367L2188M7979k1486j63434l7718P1396r82L9454k37214j59885
$$ 377780 321413 353601 401580 380094 216660 178942 250338 249356 288810 51596 -108289
7980a08289J12626K16356m9592k24416j5371K9946J40004J86102k3292M8732M22
$$ -108289 4337 220693 171101 -53315 -68686 -38740 101264 287366 264074 312806 313228
7969C13228j59427Q9529N1118j45264j77583J28496K48612n6434j39487j05335
$$ 313228 153801 243330 294448 149184 -28399 100097 348709 292275 152788 47453
7959D7453k5553O9155J0205j05997M079J41588J57206J19436J23118j48409n2025
$$ 47453 21900 91055 101260 -4737 -658 140930 298136 417572 540690 392281 340256
7948C40256l6025j8543k5543l8019J77760N723j68505K6040J36602o7895o1285
$$ 340256 304231 285688 260145 222126 399886 405609 237104 263144 399746 331851 270566
7937B70566n5534K492R6699m5009k15957j66597r609J39509J11882o902l5451
$$ 270566 215032 217524 314223 269214 53257 -113340 -122949 16560 128442 121540 86089
7926H6089J15001R354m3585J40082Q5791J05207L3468n5875j26603r6498q2909
$$ 86089 201090 210444 166859 306941 392732 497939 531407 475532 348929 252431 169522
7915A69522j09680k7328K1019Q145J84142M8390l0999P639r7791k33779j76286
$$ 169522 59842 32514 53533 61678 245820 294210 263211 270850 173059 -60720 -237006
7904b37006R4260K25255M269N1419N3116M0578L7998q5733k21900o916K27888
$$ -237006 -142746 82509 86778 138197 191313 231891 269889 184156 -37744 -44660 183228
7893A83228r7880n2425J91069K9668j80478q8323m1962J7593K06215o4482j35045
$$ 183228 85348 32923 223992 253660 73182 -15141 -57103 -39510 166705 102223 -32822
7882c2822J42715Q6656O3476J41367J55163j5078j07761j70024k37443j25298
$$ -32822 109893 196549 260025 401392 556555 541477 433716 263692 26249 -99049
7872i9049J06920J13235J61788j36747k10752j01570O4142J19604O4465O8615
$$ -99049 7871 121106 282894 146147 -64605 -166175 -102033 17571 82036 150651
7862A50651J44806k32332k42351J62487J65375J29144K14717p6688r9755r5070
$$ 150651 295457 63125 -179226 -16739 148636 277780 492497 415809 316054 220984
7852B20984j34684k98936J591K96946J48812j44345J62135K10610j18288j78716
$$ 220984 86300 -212636 -211045 85901 234713 90368 252503 463113 344825 166109
7842A66109n6494k7761o0156q0136J4218J00117q5529m9601J94831r3172j13802
$$ 166109 109615 81854 21698 -58438 -44220 55897 -29632 -79233 115598 22426 -91376
7831i1376l6867O6547J5406o2895J2661K8167O3973K27026M5969P8296j31089
$$ -91376 -128243 -61696 -46290 -109185 -96524 -68357 -4384 222642 268611 346907 215818
7820B15818j03758R9121n5442K31955N9951m2833Q5823r9050l78338K9678J05331
$$ 215818 112060 211181 155739 387694 447645 404812 490635 391585 13247 42925 148256
7809A48256l4251R3901N0829j50066k46325P4151J54369N6980o5119K0704o401
$$ 148256 114005 207906 258735 108669 -137656 -63505 90864 147844 82725 103429 97028
7798I7028Q5087J13341J0144N2709K7283j1738j3903n1948J02150o0444n3383
$$ 97028 182115 295456 305600 358309 385592 373854 359951 308003 410153 349709 296326
7787B96326J17967r3919o6136J07467O660j17026p5399j94581o48R3841K05608
$$ 296326 414293 320374 254238 361705 368365 251339 175940 -18641 -19289 74552 280160
7776B80160N7940O0064j54571K3632p0438Q520j08077J9483o555M2397J3191R1421
$$ 280160 338100 398164 243593 267225 196787 205307 97230 116713 110158 152555 165746 257167
7764B57167Q3459j62001j23973m6813m6240l8495L0581R1248J07767m2672p4074
$$ 257167 340626 178625 54652 7839 -38401 -76896 -46315 44933 152700 110028 35954
7753C5954q5685j32366J610l1544K2939k4868J51116Q0825K37263R7289j61770
$$ 35954 -49731 -182097 -180487 -212031 -189092 -213960 -62844 17981 255244 352533 190763
7742A90763L5685M5337O9612r6614k17811N7994l5440r2036J54326M7782m7012
$$ 190763 226448 271785 341397 244783 26972 84966 49526 -42510 111816 159598 112586
7731A12586J22413Q1119q0182r2845L0532J16282N0041M6440J01781j56881r5117
$$ 112586 234999 316118 235936 143091 173623 289905 339946 386386 488167 331286 236169
7720B36169n3115j14260n5435R2037j4532n2416O6834o4533P6097K04628Q4024
$$ 236169 183054 68794 13359 105396 90864 38448 105282 40749 116846 321474 405498
7709D05498j0140j68329j34751l1278l8060j33401J11889Q5505K18686n5486j84779
$$ 405498 395358 227029 92278 61000 22940 -110461 1428 86933 305619 250133 65354
7698F5354j42085n4722J13476J66575r0892l5405m9889J0199N3881j24744m2193
$$ 65354 -76731 -131453 -17977 148598 57706 22301 -27588 -17389 36492 -88252 -130445
7687a30445m4857J97759J79980n9004j64191j7681l3517N448J20121M5368j03433
$$ -130445 -175302 22457 202437 143433 -20758 -38439 -71956 -66508 53613 98981 -4452
7676d452j16968j69891p9219J33376J53425J67844J44410m5014L2157L6791J80115
$$ -4452 -121420 -291311 -370530 -237154 -83729 84115 228525 183511 215668 252459 432574
7665D32574J4103q8487J5310P1811J5257o4939k23414k7574j2754o5494j9258
$$ 432574 446677 358190 373500 445311 460568 395629 172215 144641 131887 66393 47135
7654D7135n8514J3764Q3536n7888k8209J22514j15706m6211l6940p0756K45009
$$ 47135 -11379 2385 85921 28033 -176 122338 6632 -39579 -76519 -147275 97734
7643I7734M4617o5673j26015l4788J12834m5874k6639o8240M0992P1113J25758
$$ 97734 142351 76678 -49337 -84125 28709 -17165 -43804 -112044 -71052 61 125819
7632A25819p9300n9780r10j15500J12785L8647o2820L9420K49779N4159j39016
$$ 125819 46519 -13261 -14171 -129671 -16886 21761 -41059 -1639 248140 302299 163283
7621A63283j80096j37761r2161P8834K40330N0727p4407J7857j47516J4933O3860
$$ 163283 -16813 -154574 -246735 -167901 72429 123156 48749 66606 -80910 -65977 -2117
7610b117J384K17798N4401j22305k15989M5439l6284J68836L4864O5830j136j88693
$$ -2117 -733 217065 271466 149161 -66828 -21389 -57673 111163 146027 211857 210721 22028
7598B2028l45873j80379R7824J69229K45019J91099Q0455k09011N1739j41942
$$ 22028 -323845 -504224 -406400 -237171 7848 198947 279402 70391 122130 -19812
7588a9812k74262q766J44099j2097Q5065K40628k2409j65182N6455K00927O3113
$$ -19812 -294074 -302840 -158741 -170838 -85773 154855 132446 -32736 23719 224646 287759
7577B87759n9381j27030j09536j05118j12160m8023J64509J3180L1936K32293
$$ 287759 228378 101348 -8188 -113306 -225466 -273489 -108980 -95800 -63864 168429
7567A68429J14214N4822q6596r0923k10585k19635q2781J385K04126K70235o5824
$$ 168429 282643 337465 250869 159946 -50639 -270274 -353055 -351670 -147544 122691 56867
7556E6867N2848j15390P6766J03239j88837Q4177q558j49262j20816K09156J57069
$$ 56867 109715 -5675 71091 174330 -14507 69670 61112 -88150 -208966 190 157259
7545A57259o1972l3665N8444r951j8875O8669N5143j3734j71606N875J39141J7956
$$ 157259 95287 61622 120066 110115 91240 159909 215052 201318 29712 35587 174728 192684
7533A92684j03880q7034L8660J08161j1555n6514Q5661j89797j03460K60439j6804
$$ 192684 88804 1770 40430 148591 137036 80522 166183 -23614 -127074 133365 116561
7522A16561q3690K40922n5646M1643J81540R0755p0222K6460k43913k0974j91659
$$ 116561 32871 273793 218147 259790 441330 532085 461863 488323 244410 223436 31777
7511C1777o0414m4866P7273K48507J73285k36379j22625k0208J95300J38262m8498
$$ 31777 -28637 -73503 3770 252277 425562 189183 66558 46350 241650 379912 331414
7500C31414k44335q7863J46075J65305j16541j60545l0084M7514R7983n4090o3864
$$ 331414 87079 -784 145291 310596 194055 33510 3426 50940 148923 94833 30969
7489C0969k7062J53697l9870L4627j3998j1082Q0034P2039r9524J63985J46493
$$ 30969 3907 157604 117734 152361 138363 127281 207315 279354 179830 343815 490308
7478D90308p5428j03678j8556r0841p6409l5867J14338o217k4828L2983J13561
$$ 490308 414880 311202 292646 201805 125396 89529 203867 197650 172822 205805 319366
7467C19366R1182k41315J0589n0920m6144M8385J45420L2678n9779m6151j21901
$$ 319366 410548 169233 179822 128902 82758 131143 276563 309241 249462 203311 81410
7456H1410k90684N9833J10898K1413J24793N5456r9945L9807j81269p2238J72359
$$ 81410 -209274 -149441 -38543 -17130 107663 163119 63174 102981 -78288 -150526 21833
7445B1833l372o4350N9211Q1592j2110j39168J53783N6889Q4670j4143n5364m1406
$$ 21833 18461 -45889 13322 94914 82804 -56364 97419 154308 238978 224835 169471 128065
7433A28065k523J06010o4246j04013m0749k2357j67056K89136N8016j45042k97281
$$ 128065 125542 231552 167306 63293 22544 187 -166869 122267 180283 35241 -262040
7422b62040l33944K78733R6364N1393O8908j20114k47199l1268K11738R6446K14429
$$ -262040 -595984 -317251 -220887 -169494 -100586 -220700 -467899 -499167 -287429 -190983 23446
7411B3446L7621J16351r9315k16777J9969Q3908J14636R7170J59575J09570J3028
$$ 23446 61067 177418 78103 -138674 -118705 -34797 79839 177009 336584 446154 459182
7400D59182j37329l61891j56169j23122J12339K65576r085j74530j96094q081
$$ 459182 321853 -40038 -196207 -319329 -206990 58586 49501 -125029 -321123 -329204
7390c29204Q4495P8657M7526R7463K2377o8022J8173J82308P2798j28930R584
$$ -329204 -244709 -166052 -118526 -21063 1314 -66708 -48535 133773 206571 77641 87225
7379H7225Q8608M2489k10264M9449J31641o8794j87971k5627Q7008P7695k2892
$$ 87225 175833 218322 8058 57507 189148 120354 -67617 -93244 -6236 71459 48567
7368D8567j21067m6045l7477K1416O1122J22032M6269J12750J6747k21670J45770
$$ 48567 -72500 -118545 -156022 -134606 -73484 48548 94817 207567 224314 2644 148414
7357A48414O634j74984n5324J12991J36900O4841k9736j10914k1204R4480j12954
$$ 148414 155048 -19936 -75260 37731 174631 239472 209736 98822 77618 172098 59144
7346E9144L0615j65580j01402K27183J20296k2996J9806q4057J136k17290J25115
$$ 59144 89759 -75821 -177223 49960 170256 147260 167066 83009 84145 -133145 -8030
7335h030k6090n9359J55552q8903O683O4008J8197k7271j66559p8749m7973K02126
$$ -8030 -34120 -93479 62073 -26830 -20147 43861 62058 34787 -131772 -210521 -258494 -56368
7323e6368K01802q6496l5122p2092k9475p5154k38162J41428J45344O1381o6040
$$ -56368 145434 58938 23816 -48276 -77751 -152905 -391067 -249639 -104295 -42914 -108954
7312a08954m6396q5233M4668K358p2142n4266j2727q4161J67943K40124J62566
$$ -108954 -155350 -240583 -195915 -193557 -265699 -319965 -332692 -416853 -248910 -8786 153780
7301A53780j0036r0936M2948j23868o7081R27L6936R9142O4066r6464r1717j16999
$$ 153780 143744 52808 95756 -28112 -95193 -94266 -57330 41812 105878 9414 -82303 -199302
7289a99302P0668P3260N2604j28143j80874J9605l8457K95023J69700o6486j21420
$$ -199302 -128634 -55374 -2770 -130913 -311787 -292182 -330639 -35616 134084 67598 -53822
7278e3822J27282n2838n0598J7424p1548j32265o7885R7554K05462J81844Q507
$$ -53822 73460 20622 -29976 -12552 -84100 -216365 -284250 -186696 18766 200610 209117
7267B09117K2035J11523j20551o4045N4963N7098r4618P9987l3032M6289p3746
$$ 209117 231152 342675 222124 158079 213042 270140 175522 255509 222477 268766 195020
7256A95020j12287m3910J23776m7950j29584p2546j7009K35783K70491O3779j34755
$$ 195020 82733 38823 162599 114649 -14935 -87481 -104490 131293 401784 465563 330808
7245C30808j57916j19714O0109j3811l61350M1004K0344r9040J11414J71528p6927
$$ 330808 172892 53178 113287 99476 -261874 -220870 -200526 -299566 -188152 -16624 -93551
7234i3551K29248R8420j86708j15657l3325N248J1807J13586L7508j9474L685
$$ -93551 135697 234117 47409 -68248 -101573 -96325 -84518 29068 66576 47102 50787
7223E0787J28818P998j31664l9527k63766p93J48289L19102J98566M2778J0950
$$ 50787 179605 187603 55939 16412 -247354 -248147 -99858 219244 417810 460588 471538
7212D71538j34362l50530j74643n6285P9737J7756J62433K56694j36891j95607
$$ 471538 337176 -13354 -187997 -244282 -164545 -146789 15644 272338 135447 -60160
7202f0160j27332j10680j27101J2654K41420O6199Q9622o7974j26169J34333L8243
$$ -60160 -187492 -298172 -425273 -412619 -171199 -105000 -15378 -83352 -209521 -75188 -36945
7191c6945n4535P1322P2391l7642K08345r2621p7766J15192l8096l0896K0363
$$ -36945 -91480 -20158 52233 14591 222936 130315 52549 167741 129645 98749 119112
7180A19112Q3266j25324k16663j39586j2540J71674P9918J156O3247l9701n8585
$$ 119112 202378 77054 -139609 -279195 -291735 -120061 -40143 -38987 24260 -15441 -74026
7169g4026j51423J1954L9307N4784N8273L6685J9113o3526o7633m9301J33403
$$ -74026 -225449 -213495 -174188 -119404 -61131 -24446 -5333 -68859 -136492 -185793 -52390
7158e2390M8371k2248J51635J45633J00561K2980o9507j19498q3994j3231r2209
$$ -52390 -4019 -26267 125368 271001 371562 394542 325035 205537 121543 108312 16103
7147A6103r7620n9563R5786O2191R8008J10081J6468j49818j47720K8386l0533
$$ 16103 -81517 -141080 -45294 16897 114905 224986 241454 91636 -56084 -27698 -58231
7136e8231j02425M45j5328q1772J98370N9526K5445k00221j64698Q8704J91648
$$ -58231 -160656 -160211 -175539 -257311 -58941 585 26030 -174191 -338889 -250185 -58537
7125e8537N6218j9400P0145L7411j64846J71636N0354k4123r3924P5990R6933
$$ -58537 -2319 -21719 48426 85837 -79009 92627 142981 118858 24934 100924 197857
7114A97857p7721K8318j67079k00009J05414p0975n7258K56284N5739p1321k2588
$$ 197857 120136 148454 -18625 -218634 -113220 -184195 -241453 14831 70570 -751 -23339
7103b3339P2592M4865m8869P4325j27531q3384p5230K38431K7360J32670K227
$$ -23339 49253 94118 45249 119574 -7957 -91341 -166571 71860 99220 231890 234117
7092B34117q0136j70279p5958q2062L3993Q8399l6941j21894q1396q848M2117
$$ 234117 153981 -16298 -92256 -174318 -140325 -51926 -88867 -210761 -292157 -301005 -258888
7081b58888j6209k3756K41489R9994l0814J4762j1233k93018p965L19019L48473
$$ -258888 -275097 -298853 -57364 42630 11816 26578 15345 -277673 -285638 33381 381854
7070C81854j76300m05888p4487J45399K9838p1066L9825J96861O6404P2265p4631
$$ 381854 205554 -200334 -274821 -129422 -99584 -170650 -130825 66036 132440 204705 130074
7059A30074j99540p6659m0066J65261K32393o5622j37334j11694P0844j12522
$$ 130074 -69466 -146125 -186191 -20930 211463 145841 8507 -103187 -32343 -144865
7049a44865K7481Q27j31598r0629j8228K14814O0231K00489o5270j15062K45305
$$ -144865 -117384 -116557 -248155 -338784 -357012 -142198 -81967 118522 53252 -61810 183495
7038A83495L7202m4582J1409J6929m859k15187M5337J01697j28286J0352J29295
$$ 183495 220697 176115 187524 204453 199594 -15593 29744 131441 3155 13507 142802
7027A42802N4350Q2196j217p0926j78082n1712m2932k4019J2646L7586J39511
$$ 142802 197152 279348 278131 207205 29123 -22589 -65521 -89540 -76894 -39308 100203
7016A00203J4572l6600M2614q7512P8014j32046j77228N3762q832Q8894O994K4423
$$ 100203 114775 78175 120789 33277 111291 -20755 -197983 -144221 -153053 -64159 -57165 -32742
7004c2742j3885m7305q0125K7301L4229J31863m5120k64526j34979N2069J01185
$$ -32742 -46627 -93932 -174057 -146756 -112527 19336 -25784 -290310 -425289 -373220 -272035
6993b72035M431J07279J50697Q8215l8591R281P25m3110L6416r6704k6140K3021
$$ -272035 -267604 -160325 -9628 78587 39996 49277 50002 6892 43308 -53396 -79536 -56515
6981e6515N3204J88197P574o0438j20124l1054j0235M4391R7876j6065j3249R9479
$$ -56515 -3311 184886 192460 132022 11898 -19156 -29391 15000 112876 96811 83562 183041
6969A83041O279j5728j87111r6825J17600J17823J422p1095r5544q569j13635
$$ 183041 189320 173592 -13519 -110344 7256 125079 126501 55406 -40138 -48707 -162342
6958a62342k04217k501J45726K15214p6995J8237Q6472j43162j9798J29911j9728
$$ -162342 -366559 -369060 -223334 -8120 -85115 -66878 19594 -123568 -143366 -13455 -33183
6947c3183j87216p5481K00848J36648j16178j31937j8781L0993j51304N9048J64723
$$ -33183 -220399 -295880 -95032 41616 -74562 -206499 -225280 -194287 -345591 -286543 -121820
6936a21820l0173J07497n0192j18524r1650R3193L6734j6164N4301j01917O6204
$$ -121820 -151993 -44496 -94688 -213212 -304862 -211669 -174935 -191099 -136798 -238715 -172511
6925a72511J25231J82o1466p4605m6231N3954J35318J64451k3572n5860j8428
$$ -172511 -47280 -47098 -108564 -183169 -229400 -175446 -40128 124323 100751 44891 26463
6914B6463j62087o836n2790J06640P7746P7506k7396j38789m972L4785J91051
$$ 26463 -135624 -142460 -195250 -88610 -10864 66642 39246 -99543 -104515 -69730 121321
6903A21321M7657j47253M3782p9920J16320J75915m6099k05306j65372k467L2742
$$ 121321 168978 21725 65507 -14413 101907 277822 231723 26417 -138955 -141422 -108680
6892a08680R3228m2531K8677N7763N5078N1653k16962k2452J59524m4342q5136
$$ -108680 -15452 -57983 -29306 28457 83535 135188 -81774 -104226 55298 10956 -74180
6881g4180r1036n6774J78943K98102J8347O089n1834n5152j63090l50241k0902
$$ -74180 -165216 -221990 -43047 255055 273402 279491 227657 172505 9415 -340826 -361728
6870c61728J58666K27424j02292j81145Q4456K41363j37991o5742j08087j13402
$$ -361728 -203062 24362 -77930 -259075 -174619 66744 -71247 -136989 -245076 -358478
6860c58478J66935J80773l3398j33970j18208l3498O8396j3954M0272P7698Q0689
$$ -358478 -191543 -10770 -44168 -178138 -296346 -329844 -261448 -275402 -235130 -157432 -76743
6849g6743j51238j90486J26352K34001o597j7852j39860n1833L6430Q6309q0136
$$ -76743 -227981 -418467 -292115 -58114 -64711 -82563 -222423 -274256 -237826 -151517 -231653
6838b31653J0111J49102K34350J8258l7965l3265L4242m7683J64980J01383k39900
$$ -231653 -221542 -72440 161910 180168 142203 108938 143180 95497 260477 361860 121960
6827A21960j84114n6420j85321K1911J21480k6351j68534o6488Q4159J26210R9698
$$ 121960 -62154 -118574 -303895 -281984 -160504 -186855 -355389 -421877 -337718 -211508 -111810
6816a11810O8281R3693L395L6289J26894j50385j80969k37007j3088L9503j81553
$$ -111810 -43529 50164 53559 89848 216742 66357 -114612 -351619 -364707 -325204 -506757
6805e06757K87046L43262r1084j01873J18762J51022K5425Q741l5368l51336m7878
$$ -506757 -219711 123551 32467 -69406 49356 200378 225803 234544 199176 -152160 -200038
6794b00038J18058P4161m7297M7717R555p1395m9521J01439J44447j27087K94352
$$ -200038 -81980 -7819 -55116 -7399 2156 -69239 -118760 -17321 127126 39 294391
6783B94391J35818q9180j52308P8343K6938o9170o5377k79930o8028J67243K68350
$$ 294391 430209 341029 188721 267064 294002 224832 159455 -120475 -188503 -21260 247090
6772B47090O2791P6915j25797l36046K1738L7329n0896J4996J11879R6178J55395
$$ 247090 309881 386796 260999 -75047 -53309 -15980 -66876 -51880 59999 156177 311572
6761C11572J6810R3968J07536o4750j28570M5060j01629m1441K8663j17091O586
$$ 311572 328382 422350 529886 465136 336566 381626 279997 238556 267219 150128 156714
6750A56714k003k84042j96629Q1688J84626m9016p1866N9433o8411p0400J12032
$$ 156714 154711 -129331 -325960 -244272 -59646 -108662 -180528 -121095 -189506 -259906 -147874
6739a47874L12567J77509k27823l38902m5686J87955R9673r132N2034j18102n0760
$$ -147874 164693 342202 114379 -224523 -270209 -82254 17419 8287 60321 -57781 -108541
6728a08541l3694J78232J54331j27677l642J69021l5078j93412n6726J95655L2297
$$ -108541 -142235 35997 190328 62651 59009 228030 192952 -460 -57186 138469 170766
6717A70766k51830q7862J63203K00446j9399j02811j66433M3374k5461J7542m0569
$$ 170766 -81064 -168926 -5723 194723 175324 72513 -93920 -50546 -76007 -58465 -99034
6706i9034q3406j8819n3525K53753K79130n4618j46302j07772o1768K7876n416
$$ -99034 -182440 -201259 -254784 -1031 278099 223481 77179 -30593 -92361 -64485 -69901
6695f9901o9717q4396K8866n1340o4729M6540Q251J43477J37362L2149r5975J45267
$$ -69901 -139618 -224014 -195148 -246488 -311217 -264677 -256426 -112949 24413 56562 -39413 105854
6683A05854R2576j3367p7719q3974q3263J0562J4085P9641N1449J09462Q6629
$$ 105854 198430 185063 107344 23370 -59893 -49331 -35246 44395 95844 205306 291935
6672B91935j20492j91252j6312J47645j43854j59548M9662o5938J14461P5890
$$ 291935 171443 -19809 -36121 111524 -32330 -191878 -142216 -208154 -93693 -17803
6662a7803Q7333j05309J04409q2330j22576Q8547N2610m299l9257M1193p0483
$$ -17803 69530 -35779 68630 -13700 -136276 -47729 4881 582 -38675 2518 -67965
6651f7965j19884J7711j4552j4268j96565r0994J47726K410j36971Q1780K94249
$$ -67965 -187849 -170138 -184690 -198958 -395523 -486517 -338791 -336381 -473352 -391572 -97323
6640i7323J09605r6793l072Q5531m6332q8896L4839p8144Q622J55739p6533j1571
$$ -97323 12282 -84511 -87583 -2052 -48384 -137280 -102441 -180585 -171963 -16224 -92757 -104328
6628a04328O2910J3094j40858j65433P0811k9965k0664J1023K23668m4757p2549
$$ -104328 -41418 -28324 -169182 -334615 -263804 -293769 -314433 -303410 -79742 -124499 -197048
6617a97048M763R3580J3079J82170K589j41959l3303j82513k4164J07773J86560
$$ -197048 -192285 -98705 -85626 96544 99133 -42826 -76129 -258642 -282806 -175033 11527
6606A1527Q8416l631J67310N1368r2511j50849j2637J52221K7541J21719K8621
$$ 11527 99943 96312 263622 314990 222479 71630 58993 211214 238755 360474 389095
6595C89095p7436k05862j83521k6553M5106k4407j52570l6813J30310J56066K2509
$$ 389095 311659 105797 -77724 -104277 -59171 -83578 -236148 -272961 -142651 13415 35924
6584C5924j34944M3038O601j2782k2154k1972J87521p1107R7736N2632J1295k35860
$$ 35924 -99020 -55982 -49381 -62163 -84317 -106289 81232 10125 107861 160493 171788 -64072
6572f4072m7658L5275N7230J5226j3966j6813L5902J22968N5089o6480k38416
$$ -64072 -111730 -76455 -19225 -3999 -17965 -34778 1124 124092 179181 112701 -125715
6561a25715j32552N974K15493Q7074K6278K9784j01699j28625N9841O5186J68943
$$ -125715 -258267 -252293 -36800 50274 76552 106336 4637 -123988 -64147 1039 169982
6550A69982J90818Q193j15166j50012n476K50440L4419L1538j28267l51818o2252
$$ 169982 360800 368993 253827 103815 98339 348779 383198 414736 286469 -65349 -127601
6539a27601K20437J17778K5999J26067J87248J24362R7707J77540p2096q540N8746
$$ -127601 92836 210614 236613 362680 549928 674290 771997 949537 877441 868901 927647
6528I27647q2578J570r5144o5058p5905k35573p2859j12897r8231m4580K36610
$$ 927647 845069 846639 751495 686437 610532 374959 302100 189203 90972 46392 283002
6517B83002J00563K01614l4844k73399j75113o225P8002k7041k9209O6481L1471
$$ 283002 383565 585179 550335 276936 101823 95598 173600 146559 117350 183831 215302
6506B15302j82083j24665N9446N1679j10636n554J09505O6382j76111k08120j4381
$$ 215302 33219 -91446 -32000 19679 -90957 -96511 12994 79376 -96735 -304855 -319236
6495c19236J2203k6013K46893L9274j03561J01317O4339J01656j01561k07760
$$ -319236 -307033 -333046 -86153 -46879 -150440 -49123 15216 116872 15311 -192449
6485a92449p744K94477K2393k07079O4303M1994O4795J56927j44449p5877J12007
$$ -192449 -200193 94284 116677 -90402 -26099 15895 80690 237617 93168 17291 129298
6474A29298P6953j36354j69831L8017k413k770N1592k07201j10842j17685O8288
$$ 129298 206251 69897 -99934 -61917 -64330 -67100 -15508 -222709 -333551 -451236 -382948
6463c82948O433K12759Q8224J52695o974L9909P6628j04711k03467J36087J33295
$$ -382948 -376515 -163756 -75532 77163 70189 110098 186726 82015 -121452 14635 147930
6452A47930p6043J3443J09963p5941m471j54155n4962N7451k09202j70077R8615
$$ 147930 71887 85330 195293 119352 114881 -39274 -94236 -36785 -245987 -416064 -317449
6441c17449J55177J515j00013q6540j44060M5311L0435J7134L02258J19975r9314
$$ -317449 -162272 -160757 -260770 -347310 -491370 -446059 -415624 -398490 -96232 23743 -75571
6430g5571j21974j15688P78J09190P1776k711k26783K37639J42667j51607p7735
$$ -75571 -197545 -313233 -312455 -203265 -131489 -134200 -360983 -123344 19323 -132284 -210019
6419b10019K3493J496J2830m3942p6900J15764J14232N4663j0239M1641j54996
$$ -210019 -186526 -185030 -172200 -216142 -293042 -177278 -63046 -8383 -18622 23019 -131977
6408a31977l1625J14403P5068j95726m3552J83018J37566j08785P5198l9567k05711
$$ -131977 -163602 -49199 25869 -169857 -213409 -30391 107175 -1610 73588 34021 -171690
6397a71690J5040J11189J24358J72455J50773j49980j47290k8028r0740o7128
$$ -171690 -156650 -45461 78897 251352 402125 252145 104855 76827 -13913 -81041
6387h1041j72213n1524K46445J65361N4614M1329j65723L6172J29554n5047n0851
$$ -81041 -253254 -304778 -58333 107028 161642 202971 37248 73420 202974 147927 97076
6376I7076n6315M4545r890k04580J7017j13508l9023K06345k4331j2606J626O5053
$$ 97076 40761 85306 75416 -129164 -112147 -225655 -264678 -58333 -82664 -95270 -93644 -28591
6364b8591R2634j5263q9011J44844O1690j84553n7490p5202j8612p012p3665L6367
$$ -28591 64043 48780 -40231 104613 166303 -18250 -75740 -150942 -169554 -176566 -250231 -213864
6352b13864J9856J84753j19647j64364J57891R5353o1302O695o9990n5871J49747
$$ -213864 -194008 -9255 -128902 -293266 -135375 -40022 -101324 -94629 -164619 -220490 -70743
6341g0743J05177J1759N0023o3952K7956l0926p4167l6415P386J58209J84906
$$ -70743 34434 46193 96216 32264 60220 29294 -44873 -81288 -73902 84307 269213
6330B69213r384l15243j20618M0734O8111j25889j31108R1792K61054L2751m4350
$$ 269213 259829 -55414 -176032 -135298 -67187 -193076 -324184 -232392 28662 61413 17063
6319A7063N059P5708n054r1355q4953j8951J87576J01129j9938M9474K1103l416
$$ 17063 22122 97830 92776 1421 -83532 -102483 85093 186222 166284 215758 236861 233445
6307B33445j15622k8554o7919m9191L3186j3485k29492j11260J58369R5925o1368
$$ 233445 117823 89269 21350 -27841 5345 -8140 -237632 -348892 -190523 -94598 -155966
6296a55966n4946p0899r6992J0202P6570n087j39562K51463K31746Q6300J32118
$$ -155966 -210912 -281811 -378803 -368601 -292031 -297118 -436680 -185217 46529 132829 264947
6285B64947r3008j69267j07442J36312J25679k10119q7764R7219m6380j40584
$$ 264947 171939 2672 -104770 31542 157221 -52898 -140662 -43443 -89823 -230407
6275b30407M3914L1590r4833J1913O0694l3824j51851J9936J29706J58950k1529
$$ -230407 -186493 -154903 -249736 -237823 -177129 -210953 -362804 -342868 -213162 -54212 -75741
6264g5741R0696J02830Q4507o7114M9104K6217l6178L660r2641q5595L5519m9729
$$ -75741 14955 117785 202292 135178 184282 210499 174321 177981 85340 -255 35264 -14465
6252a4465M9982l3651J7857K1855O0725J70165j0583j98950j00816L2013J45201
$$ -14465 35517 1866 19723 41578 102303 272468 261885 62935 -37881 -5868 139333
6241A39333j26669j60403J63544J08224j8898j29931p7784j54802p5275p6247
$$ 139333 12664 -147739 15805 124029 105131 -24800 -102584 -257386 -332661 -408908
6231d08908j84279K0410K32389O8444K3451L9154L1897L2703J26530J09409M6
$$ -408908 -593187 -572777 -340388 -271944 -248493 -209339 -177442 -144739 -18209 91200 91246
6220I1246K3191m8220j16618k14882j98278L54550N3588M1594K4432J7088j50984
$$ 91246 114437 66217 -50401 -265283 -463561 -109011 -55423 -13829 10603 27691 -123293
6209a23293j01297J72376J31588j21691k47355m2002p6722J4527q4715J68819
$$ -123293 -224590 -52214 79374 -42317 -289672 -331674 -408396 -393869 -478584 -309765
6199c09765K74244J96242j1656k03572j58698J462R7423K49137J16838j71569
$$ -309765 -35521 160721 149065 -54507 -213205 -211743 -114320 134817 251655 80086
6189H0086j35973l1226k2555j08777p331L8114m6045J255J24654J30281P8216
$$ 80086 -55887 -87113 -109668 -218445 -225776 -187662 -233707 -232452 -107798 22483 100699
6178A00699M0401l6469j85617j76931Q8056m9861J9810J26838O6956k4590R8374
$$ 100699 141100 104631 -80986 -257917 -169861 -219722 -199912 -73074 -6118 -30708 67666
6167F7666m1520q9434j70064j19360J92539K99587k5360R1046o6962k61448j12074
$$ 67666 26146 -63288 -233352 -352712 -160173 139414 114054 205100 138138 -123310 -235384
6156b35384M6334j07521j91652K0632L7584J66937N279k3244L94189j972j49416
$$ -235384 -189050 -296571 -488223 -467591 -430007 -263070 -257791 -281035 113154 111182 -38234
6145c8234k8889K071p3976J47637O7422j0494k18171j72787N9772r6404Q891j6490
$$ -38234 -67123 -65052 -139028 8609 76031 65537 -152634 -325421 -265649 -362053 -353162 -369652
6133c69652k09130K35434K44880J532k45855l0637K86019J23174l9362L5291j54549
$$ -369652 -578782 -343348 -98468 -96936 -342791 -373428 -87409 35765 -3597 31694 -122855
6122a22855k49562J91108k6385K7549L2731k3163J78536J63609J0651k40307j25506
$$ -122855 -372417 -181309 -207694 -180145 -147414 -170577 7959 171568 182219 -58088 -183594
6111a83594R2748q2235j56949j07200J19718P1900J45370N7163N0446k025K3370
$$ -183594 -90846 -173081 -330030 -437230 -317512 -245612 -100242 -43079 7367 5342 28712
6100B8712K3278k40834m3502n5930o6820L2393R8808o2725R7589P6629J75128
$$ 28712 51990 -188844 -232346 -288276 -355096 -322703 -223895 -286620 -189031 -112402 62726
6089F2726Q5375j0256M5702q9145P5266k2293n4807q802r42l8580l7046J53517
$$ 62726 148101 137845 183547 94402 169668 147375 92568 83766 82824 44244 7198 160715
6077A60715L00836j61407k59125l8739L5181J8869P6536Q5089J24321j88660k40323
$$ 160715 461551 300144 41019 2280 37461 56330 132866 217955 342276 153616 -86707
6066h6707J50522J94435n18j77617m7300J26479J27834j63766l12735o2038J37413
$$ -86707 63815 258250 257732 80115 32815 159294 287128 123362 -189373 -251411 -113998
6055a13998L14239K9195m201j38585l0227N2360O2481M2510n6361j91214N5322
$$ -113998 200241 229436 225235 86650 56423 108783 171264 213774 157413 -33801 21521
6044B1521r4484j34729j1300o9681q0134J61216K9617Q425o3578j14120O6220
$$ 21521 -72963 -207692 -218992 -288673 -368807 -207591 -177974 -169549 -233127 -347247 -281027
6033b81027J15587R0239J40513J51948j72671j22306n4862m1723r2787K0746J36340
$$ -281027 -165440 -75201 65312 217260 44589 -77717 -132579 -174302 -267089 -246343 -110003
6022a10003j04606M3155m2516m9516N4852j28805l8761Q4557j2607N5495n6901
$$ -110003 -214609 -171454 -213970 -263486 -208634 -337439 -376200 -291643 -304250 -248755 -305656
6011c05656N0401O3395j09431o7149M9674J78962L7357n5033k1405r8864K2537
$$ -305656 -255255 -191860 -301291 -368440 -318766 -139804 -102447 -157480 -178885 -277749 -255212
6000b55212j44286J43151M7724J49778J8594M4122l5652N4866j1682m2276m6641
$$ -255212 -399498 -256347 -208623 -58845 -40251 3871 -31781 23085 11403 -30873 -77514
5989g7514r7073k6200J7123p2720p6177J45678M2112J72840P0525j07062J8303
$$ -77514 -174587 -200787 -183664 -256384 -332561 -186883 -144771 28069 98594 -8468 9835
5978I835O736k7135j2480m328M2249R2763O794k8035R599q6428J7071q3791m8651
$$ 9835 16571 -10564 -23044 -27372 14877 107640 114434 86399 95998 9570 26641 -57150 -105801
5965a05801J2838n4288m3881K22143J54740r3126j08390P3293j59120j39747J42614
$$ -105801 -92963 -147251 -191132 31011 185751 92625 -15765 57528 -101592 -241339 -98725
5954i8725o9245k34881J14907k831L03699K16539j7373j67246k18759j21713N3046
$$ -98725 -167970 -402851 -287944 -290775 12924 229463 212090 44844 -173915 -295628 -242582
5943b42582n0673m384O6522l8614L3615k6554M1463j1124Q5602L3796J0793m1611
$$ -242582 -293255 -297639 -231117 -269731 -236116 -262670 -221207 -232331 -146729 -112933 -102140 -143751
5931a43751l4445K3233m5782j60566p4881J44036K14441j57710j46778J56070
$$ -143751 -178196 -154963 -200745 -361311 -436192 -292156 -77715 -235425 -382203 -226133
5921b26133L51931Q5182O534j34299k37672q5577O3905J28982N8082k53347j47613
$$ -226133 125798 210980 217514 83215 -154457 -240034 -176129 -47147 10935 -242412 -390025
5910c90025K68789J90341J6350k71489q8936R2452P0155j1767n925J952J39704
$$ -390025 -121236 69105 85455 -186034 -274970 -182518 -112363 -124130 -130055 -128103 11601
5899A1601J54646o576p5549N5363j58577m9655j05217K55618J18726j93703K21959
$$ 11601 166247 159671 84122 139485 -19092 -68747 -173964 81654 200380 6677 228636
5888B28636k8862k64468j67386J44306Q9700P2726l6185j2208J5641L9582j39321
$$ 228636 199774 -64694 -232080 -87774 1926 74652 38467 26259 41900 81482 -57839
5877e7839l2282J01053K8387j85921q4594J18374J29065L791L5511j68142L6289
$$ -57839 -90121 10932 39319 -146602 -231196 -112822 16243 20034 55545 -112597 -76308
5866g6308m2424L8155J14286N3074J05290j0196j8088j16548J3792k0978q5945
$$ -76308 -118732 -80577 33709 86783 192073 181877 163789 47241 61033 40055 -45890
5855d5890l9723j01793q5443K34376J59154j59559j17979L4236Q0963q5550p0907
$$ -45890 -85613 -187406 -272849 -38473 120681 -38878 -156857 -122621 -41658 -127208 -198115
5844a98115J54101J04353p0524M6626K6102q0739r5106r7207j09331j51779l6154
$$ -198115 -44014 60339 -10185 36441 62543 -18196 -113302 -210509 -319840 -471619 -507773
5833e07773O6628Q3972J1049J7052R8477J87132l5947r3306J17179k7191j72118
$$ -507773 -441145 -357173 -346124 -329072 -230595 -43463 -79410 -172716 -55537 -82728 -254846
5822b54846N4359M9426p1085J37759J44601j76755j54074M8303k3004J62214J59455
$$ -254846 -200487 -151061 -222146 -84387 60214 -116541 -270615 -222312 -245316 -83102 76353
5811G6353j9102l36807j34935J53669J54182Q1580k2032J12874q8900Q1109J10155
$$ 76353 57251 -279556 -414491 -260822 -106640 -25060 -47092 65782 -23118 57991 168146
5800A68146q9333j29720l8113j82305j09462K2600j0016K37123N8051J2795L5975
$$ 168146 78813 -50907 -89020 -271325 -380787 -358187 -368203 -131080 -73029 -60234 -24259
5789b4259j9973R1309Q6473j44080p1129K942n9385j23381L2119q6634k7999j4729
$$ -24259 -44232 47077 133550 -10530 -81659 -78717 -138102 -261483 -229364 -315998 -343997 -358726
5777c58726J51669L2194k03430l2323M2682K19797J4420j60485J0751J21894l8461
$$ -358726 -207057 -174863 -378293 -410616 -367934 -148137 -133717 -294202 -283451 -161557 -200018
5766b00018j0643k72290j3828M30708J77546l4162j27628K6026o1172o2142j16898
$$ -200018 -210661 -482951 -496779 -66071 111475 77313 -50315 -24289 -85461 -147603 -264501
5755b64501N346m8061k2806P2026R3873N7782p8678n8507K0013J12661Q5354j58807
$$ -264501 -259155 -307216 -330022 -257996 -164123 -106341 -185019 -243526 -223513 -110852 -25498 -184305
5743a84305J0016j54535J46520K34995j07354j21280p4870j57113n250j4403K08987
$$ -184305 -174289 -328824 -182304 52691 -54663 -175943 -250813 -407926 -413176 -427579 -218592
5732b18592q015o2110J90204m4420M9741R8356k8475l508J4807J41368k5516R0783
$$ -218592 -226607 -288717 -98513 -142933 -93192 5164 -23311 -26819 -12012 129356 103840 194623
5720A94623K4021p2316q6978m1115M8119J05336K7502K1106m1327j30498j748
$$ 194623 218644 146328 59350 18235 66354 171690 199192 220298 178971 48473 46725
5709D6725L2250K3314j02757j53046N615J31751P5719N8555j96898n2835J05842
$$ 46725 78975 102289 -468 -153514 -147899 -16148 59571 118126 -78772 -131607 -25765
5698b5765N2937j0216O0947n173j97712J29641n9009k56799K0757K3112p8845
$$ -25765 27172 16956 77903 72730 -124982 4659 -54350 -311149 -290392 -267280 -346125
5687c46125n4882J06358K18477J29749j74658J12577J63365r8597j9793p5359
$$ -346125 -401007 -294649 -76172 53577 -121081 -8504 154861 56264 36471 -38888
5677c8888j72817q8273J54399O0093L1961J06059j71195j41923J36534P2844j317
$$ -38888 -211705 -299978 -145579 -85486 -53525 52534 -118661 -260584 -124050 -51206 -52523
5666e2523j36629j35771Q4685K0871M9781J8931J6635j45778n2j34475p5085R3335
$$ -52523 -189152 -324923 -240238 -219367 -169586 -150655 -134020 -279798 -279850 -414325 -489410 -396075
5654c96075J5674J20672J86527R2409j28046j9305L6228j01585r779j27026J08041
$$ -396075 -380401 -259729 -73202 19207 -108839 -128144 -91916 -193501 -203280 -330306 -222265
5643b22265K55704j0428k8073m9088J07786j47498J8564J05949J15145J075j61264
$$ -222265 33439 23011 -5062 -54150 53636 -93862 -75298 30651 145796 146871 -14393
5632a4393j85132k24789o5982K66628J71093k5634k11852j13765j05073L3644
$$ -14393 -199525 -424314 -490296 -223668 -52575 -78209 -290061 -403826 -508899 -475255
5622d75255J25716J28347r683k02181Q6239J7037P9397L8766K8048l8128L1552
$$ -475255 -349539 -221192 -230875 -433056 -346817 -329780 -250383 -211617 -183569 -221697 -190145
5611a90145M5932L8455r9733o7007N1376K3662n4747K28900O5020P7220k71508
$$ -190145 -144213 -105758 -205491 -272498 -221122 -197460 -252207 -23307 41713 118933 -152575
5600a52575j02121l2689O7744P2657R3237J38443k2520j53882q306J78622n5k6606
$$ -152575 -254696 -287385 -219641 -146984 -53747 84696 62176 -91706 -100012 78610 78555 51949
5588E1949m47k3374P573m0875j38955p194l2365q5434R6827L6419L8544L2464
$$ 51949 51502 28128 35701 -5174 -144129 -151323 -183688 -269122 -172295 -135876 -97332 -64868
5576f4868J27702n5466k63232J3485J49552J35320L264K1057J630m8964j47484
$$ -64868 62834 7368 -255864 -242379 -92827 42493 45757 66814 68444 19480 -128004
5565a28004j91288k0915l3305l6709n6037J28418J50783n801O9894L7228J05123
$$ -128004 -319292 -340207 -373512 -410221 -466258 -337840 -187057 -192858 -122964 -85736 19387
$$ [...]
##END NTUPLES=NMR SPECTRUM
##END=
