##TITLE=Analysis number 327264
Compound Code cc 58339
Book Reference 467/134/4
Project Code adrs
Chemist Name benw
##JCAMPDX= 6.0         $$ Bruker NMR JCAMP-DX V2.0
##DATA TYPE= NMR SPECTRUM
##DATA CLASS= NTUPLES
##ORIGIN= Bruker BioSpin GmbH
##OWNER= nmr
$$ XWIN-NMR		Version 3.5
$$ Fri Mar 16 14:41:05 2007 GMT Standard Time (UT+0h)  MAYBRIDGE\nmr@NMR_250MHZ
##.OBSERVE FREQUENCY= 250.131544655141
##.OBSERVE NUCLEUS= ^1H
##.ACQUISITION MODE= SIMULTANEOUS (DQD)
##.ACQUISITION SCHEME= undefined
##.AVERAGES= 16
##.DIGITISER RES= 18
##SPECTROMETER/DATA SYSTEM= dpx250
##.PULSE SEQUENCE= zg30
##.SOLVENT NAME= CDCl3
##.SHIFT REFERENCE= (INTERNAL, CDCl3, 0, 16.522)
##AUDIT TRAIL= $$ (NUMBER, WHEN, WHO, WHERE, WHAT)
$$ ##TITLE= Audit trail, XWIN-NMR		Version 3.5
$$ ##JCAMPDX= 5.01
$$ ##ORIGIN= Bruker BioSpin GmbH
$$ ##OWNER= nmr
$$ C:\u/data/dgb/nmr/ADRS/1140/pdata/1/auditp.txt
$$ ##AUDIT TRAIL=  $$ (NUMBER, WHEN, WHO, WHERE, WHAT)
(   1,<2007-03-16 14:40:28.22 +000>,<MAYBRIDGE\nmr>,<NMR_250MHZ>,
      <created by zg, POWCHK disabled, PULCHK disabled
       configuration hash MD5:
       49 4B E0 1D 92 C2 6B 37 9F E6 65 BC 52 41 86 1D
       data hash MD5: 64K
       67 F5 12 A2 F6 A3 8F B4 1F F3 01 45 0E D2 F9 84>)
(   2,<2007-03-16 14:40:45.07 +000>,<MAYBRIDGE\nmr>,<NMR_250MHZ>,
      <Start of raw data processing
       ef LB = 0.3 FT_mod = 6 PKNL = 1 SI = 32K 
       data hash MD5: 32K
       75 91 52 0C 29 30 E0 6B 4C F5 43 1C 2E E0 37 4C>)
(   3,<2007-03-16 14:40:49.74 +000>,<MAYBRIDGE\nmr>,<NMR_250MHZ>,
      <apk 
       data hash MD5: 32K
       23 E4 13 1A 12 C0 4B FF 22 08 C8 18 F1 B8 D1 B0>)
(   4,<2007-03-16 14:40:51.35 +000>,<MAYBRIDGE\nmr>,<NMR_250MHZ>,
      <abs ABSG = 5 
       data hash MD5: 32K
       DA 79 19 ED 38 9F 78 32 7A E4 FE 7D A2 8A 7D 70>)
$$ ##END=
$$ 
$$ hash MD5
$$ 18 2F DD 4F C3 60 33 86 5A A8 34 B7 42 4B C8 86
##$RELAX= 
##$RELAX= 
##$RELAX= 
##$RELAX= 
##$RELAX= 
##$RELAX= 
##$RELAX= 
$$ Bruker specific parameters
$$ --------------------------
##$DU= <C:\u>
##$EXPNO= 1140
##$NAME= <ADRS>
##$PROCNO= 1
##$TYPE= <nmr>
##$USER= <dgb>
##$AMP= (0..31)
100 100 100 100 100 100 100 100 100 100 100 100 100 100 100 100 100 100 
100 100 100 100 100 100 100 100 100 100 100 100 100 100 
##$AQSEQ= 0
##$AQ_mod= 3
##$AUNM= <au_zg>
##$AUTOPOS= <44 >
##$BF1= 250.13
##$BF2= 250.13
##$BF3= 250.13
##$BF4= 250.13
##$BF5= 500.13
##$BF6= 500.13
##$BF7= 500.13
##$BF8= 500.13
##$BYTORDA= 1
##$CFDGTYP= 0
##$CFRGTYP= 5
##$CHEMSTR= <none>
##$CNST= (0..31)
1 1 145 1 1 1 1 1 1 1 1 1 1 1 1 1 1 1 1 1 1 1 1 1 1 1 1 1 1 1 1 1 
##$CPDPRG= <>
##$CPDPRG1= <>
##$CPDPRG2= <>
##$CPDPRG3= <>
##$CPDPRG4= <mlev>
##$CPDPRG5= <mlev>
##$CPDPRG6= <mlev>
##$CPDPRG7= <mlev>
##$CPDPRG8= <mlev>
##$CPDPRGB= <>
##$CPDPRGT= <>
##$D= (0..31)
0 1 0 0 0 0 0 0 0 0.06 0 0 0 0 0 0 0.0002 0 0 0 0 0 0 0 0 0 0 0 0 0 0 
0 
##$DATE= 1174056026
##$DBL= (0..7)
120 120 120 120 120 120 120 120 
##$DBP= (0..7)
150 150 150 150 150 150 150 150 
##$DBP07= 0
##$DBPNAM0= <>
##$DBPNAM1= <>
$$ [...]
##$SUBNAM7= <"">
##$SUBNAM8= <"">
##$SUBNAM9= <"">
##$SW= 20.6930455092707
##$SWIBOX= (0..15)
0 0 3 0 0 0 0 0 0 0 0 0 0 0 0 0 
##$SW_h= 5175.983436853
##$TD= 65536
##$TD0= 1
##$TE= 683.16
##$TE2= 300
##$TE3= 300
##$TEG= 300
##$TL= (0..7)
0 120 120 120 120 120 120 120 
##$TP= (0..7)
150 150 150 150 150 150 150 150 
##$TP07= 0
##$TPNAME0= <>
##$TPNAME1= <>
##$TPNAME2= <>
##$TPNAME3= <>
##$TPNAME4= <>
##$TPNAME5= <>
##$TPNAME6= <>
##$TPNAME7= <>
##$TPOAL= (0..7)
0.5 0.5 0.5 0.5 0.5 0.5 0.5 0.5 
##$TPOFFS= (0..7)
0 0 0 0 0 0 0 0 
##$TUNHIN= 0
##$TUNHOUT= 0
##$TUNXOUT= 0
##$USERA1= <user>
##$USERA2= <user>
##$USERA3= <user>
##$USERA4= <user>
##$USERA5= <user>
##$V9= 5
##$VALIST= <valist>
##$VCLIST= <CCCCCCCCCCCCCCC>
##$VD= 0
##$VDLIST= <DDDDDDDDDDDDDDD>
##$VPLIST= <PPPPPPPPPPPPPPP>
##$VTLIST= <TTTTTTTTTTTTTTT>
##$WBST= 1024
##$WBSW= 4
##$XGAIN= (0..3)
0 0 0 0 
##$XL= 0
##$YL= 0
##$YMAX_a= 365515
##$YMIN_a= -407377
##$ZGOPTNS= <>
##$ZL1= 120
##$ZL2= 120
##$ZL3= 120
##$ZL4= 120
##$ABSF1= 16.522
##$ABSF2= -4.171173
##$ABSG= 5
##$ABSL= 3
##$ALPHA= 0
##$AQORDER= 0
##$ASSFAC= 0
##$ASSFACI= 0
##$ASSFACX= 0
##$ASSWID= 0
##$AUNMP= <proc_1d>
##$AZFE= 0.1
##$AZFW= 0.1
##$BCFW= 0
##$BC_mod= 0
##$BYTORDP= 0
##$COROFFS= 0
##$CY= 12.5
##$DATMOD= 1
##$DC= 0
##$DFILT= <>
##$DTYPP= 0
##$F1P= 14.0000005364418
##$F2P= -0.99999901652339
##$FCOR= 0.5
##$FTSIZE= 32768
##$FT_mod= 6
##$GAMMA= 0
##$GB= 0
##$INTBC= 1
##$INTSCL= 1
##$ISEN= 128
##$LB= 0.3
##$LEV0= 0
##$LPBIN= 0
##$MAXI= 10000
##$MC2= 0
##$MEAN= 0
##$ME_mod= 0
##$MI= 0
##$NCOEF= 0
##$NC_proc= -2
##$NLEV= 6
##$NOISF1= 0
##$NOISF2= 0
##$NSP= 0
##$NTH_PI= 0
##$NZP= 0
##$OFFSET= 16.522
##$PC= 1
##$PHC0= 231.2457
##$PHC1= 5.173646
##$PH_mod= 1
##$PKNL= yes
##$PPARMOD= 0
##$PSCAL= 4
##$PSIGN= 0
##$REVERSE= no
##$SF= 250.13
##$SI= 32768
##$SIGF1= 0
##$SIGF2= 0
##$SINO= 400
##$SIOLD= 32768
##$SREGLST= <1H.CDCl3>
##$SSB= 0
##$STSI= 32768
##$STSR= 0
##$SW_p= 5175.98343685301
##$SYMM= 0
##$S_DEV= 0
##$TDeff= 65536
##$TDoff= 0
##$TI= <Analysis number 999999
Compound Code 99
Book Reference 9
Project Code 9>
##$TILT= no
##$TM1= 0
##$TM2= 0
##$TOPLEV= 0
##$USERP1= <user>
##$USERP2= <user>
##$USERP3= <user>
##$USERP4= <user>
##$USERP5= <user>
##$WDW= 1
##$XDIM= 32768
##$YMAX_p= 442979264
##$YMIN_p= -64448
$$ End of Bruker specific parameters
$$ ---------------------------------
##NTUPLES= NMR SPECTRUM
##VAR_NAME=  FREQUENCY,     SPECTRUM/REAL,   SPECTRUM/IMAG
##SYMBOL=    X,             R,               I
##VAR_TYPE=  INDEPENDENT,   DEPENDENT,       DEPENDENT
##VAR_FORM=  AFFN,          ASDF,            ASDF
##VAR_DIM=   32768,         32768,           32768
##UNITS=     HZ,            ARBITRARY UNITS, ARBITRARY UNITS
##FACTOR=    0.157963299565203, 1,           1
##FIRST=     4132.6476996994, 0,             0
##LAST=      -1043.33573715361, 0,           0
##MIN=       -1043.33573715361, -64448,      0
##MAX=       4132.6476996994, 442979264,     0
$$ Real data points
##PAGE= N=1
##DATA TABLE= (X++(R..R)), XYDATA
$$ [...]
14794B3027m469j2982l194r003j851k682m106P971J6086O062n260p035J2335l520
$$ 23027 18558 5576 2382 -6621 -8472 -11154 -15260 -7289 8797 14859 9599 2564 14899 11379
14780A1379J800K218J2315O783O935j4976j2151N1m307p641K168O383j85j6673
$$ 11379 13179 15397 27712 34495 41430 26454 14303 14354 10047 2406 4574 10957 10772 -5901
14766e901k405J8130J6912j651j0693q465M5q917j9233J578J7488M849k998K397
$$ -5901 -8306 9824 26736 25085 14392 5927 5972 -2945 -22178 -20600 -3112 1737 -1261 1136
14752A136k136q730J2252O951J75l355L84Q344j839n541R942j6723Q755l902j528
$$ 1136 -1000 -9730 2522 9473 9648 6293 6677 15021 13182 7641 17583 860 9615 5713 4185
14737D185M978M934j2239k1943Q292R317J210k688K258J4231M866j8957j4958
$$ 4185 9163 14097 1858 -20085 -11793 -2476 -1266 -3954 -1696 12535 17401 -1556 -16514
14724a6514o579J3149P625K853j725J4459J5722n838n388N6j509j7340N980O86
$$ -16514 -23093 -9944 -2319 534 -1191 13268 28990 23152 17764 17820 16311 -1029 4951 5637
14710E637k312J1069K1147M960J894q210p814j046j4414o353M465L755l159J773
$$ 5637 3325 14394 35541 40501 42395 34185 26371 25325 10911 4558 9023 12778 9619 11392
14696A1392o813p885P222L511Q809P440j6374P388K463j4905J2189K2280N485
$$ 11392 4579 -3306 3916 7427 16236 23676 7302 14690 17153 2248 14437 36717 42202
14683D2202p30j0273j6747j6407O359p011q52n900r230K709J0327L467j2152p29
$$ 42202 41472 31199 14452 -1955 4404 -2607 -3459 -9359 -18589 -15880 -5553 -2086 -14238 -14967
14669a4967L6K472N769J6742J6737l704n362Q440N003K24p689q213j6774k0862
$$ -14967 -14931 -12459 -6690 10052 26789 23085 17723 26163 31166 31390 23701 15488 -1286 -22148
14655b2148O592M252L234M391q237J6034L708Q878J812p689j6073j3250j944L114
$$ -22148 -15556 -11304 -8070 -3679 -11916 4118 7826 16704 18516 10827 -5246 -18496 -20440 -17326
14641a7326M103o206j4238J2352K0462J0223R887R803m990P347p952r286P603
$$ -17326 -13223 -19429 -33667 -21315 -853 9370 19257 29060 24070 31417 23465 14179 21782
14628B1782k737j3171N80J760k0026j88Q722J5311l212J78k19o853J62J4501M499
$$ 21782 19045 5874 6454 8214 -11812 -12000 -3278 12033 8821 8999 8780 1927 2089 16590 21089
14613B1089N691j274r55j9522j0261n75R45O691O934J3995p445j1164J69j839
$$ 21089 26780 25506 24551 5029 -5232 -5807 -4862 1829 8763 22758 15313 4149 4318 2479
14599B479l166l335J4181N981j1868p825k0675n459J1517J4807Q767K275j7502
$$ 2479 -687 -4022 10159 16140 4272 -3553 -24228 -29687 -18170 -3363 5404 7679 -9823
14586i823q459J5779J264P173M518k972m572j537J1334k651q935n295j5274p635
$$ -9823 -18282 -2503 -1239 5934 10452 7480 2908 1371 12705 10054 1119 -4176 -19450 -27085
14572b7085R406J1073K358n422n45P241M902J5337J7122l688J4096j890k0132
$$ -27085 -17679 -6606 -4248 -9670 -10215 -2974 1928 17265 34387 30699 44795 42905 22773
14559B2773j1774m916O073Q764k268p65J8775M790j6426j7376L450l41M311r091
$$ 22773 10999 6083 12156 20920 18652 17887 36662 41452 25026 7650 11100 10759 15070 5979
14545E979L352J3037j0754R443N909j191L728M712J3374j955q510M7P960L71j0599
$$ 5979 9331 22368 11614 21057 26966 25775 29503 34215 47589 45634 37124 37171 45131 45502 34903
14530C4903q992j0923j1895k731J5476O063Q584O153j2619P668Q497n954j1345
$$ 34903 25911 14988 3093 362 15838 21901 30485 36638 24019 31687 40184 34230 22885
14517B2885l1492Q71J9310O934q199j6841j0664J1746J7015o424J4908L111j159
$$ 22885 -8607 -7736 11574 18508 10309 -6532 -17196 -5450 11565 5141 20049 23160 22001
14504B2001p942q903l18j272m264K006j521L927J3015J0422K815J531j3028j4880
$$ 22001 14059 5156 4838 3566 -698 1308 -213 3714 16729 27151 29966 31497 18469 3589
14490C589m775N987J4219O624l084N83J32q274P831N429M036J4087R48j6055j9922
$$ 3589 -1186 4801 19020 25644 22560 23143 23275 15001 22832 28261 32297 46384 47332 31277 11355
14475A1355m482J5686J711n471k2002j2953J2807J0844J4716j6266r991o576J6489
$$ 11355 6873 22559 24270 18799 -3203 -16156 -3349 7495 22211 5945 -4046 -10622 5867
14462E867J0138J4868K273j4510j3803o752J9655J813k422j3296q476J424m941
$$ 5867 16005 30873 33146 18636 4833 -1919 17736 19549 17127 3831 -4645 -3221 -8162
14449h162K589R683L71o873M829Q955P632p90j2352l489K456L289r680j5233k656
$$ -8162 -5573 4110 4481 -2392 2437 11392 19024 18234 5882 2393 4849 8138 -1542 -16775 -19431
14434a9431m928p324R004J3855J1469q11n691O540j0813K426L081p758p534o114
$$ -19431 -24359 -31683 -22679 -8824 2645 1834 -3857 2683 -8130 -5704 -2623 -10381 -17915 -24029
14420b4029J9878M217l345j0262j1748j501K62Q463J2606j825j0715L545r601
$$ -24029 -4151 66 -3279 -13541 -25289 -26790 -26528 -18065 -5459 -7284 -17999 -14454 -24055
14407b4055J0005J4318q800q123M572J1935L963p278r3r388k2141j049R636J7049
$$ -24055 -14050 268 -8532 -16655 -12083 -148 3815 -3463 -3556 -12944 -35085 -36134 -26498 -9449
14393i449M193n638J686K08p807J0241J4938qN586N821j0142j443l29J1133m769
$$ -9449 -5256 -10894 -9208 -9000 -16807 -6566 8372 8364 13950 19771 9629 8186 7857 18990 14221
14378A4221N673J104p639j0769K960J61j0531m454p067O329N057n833K751l567
$$ 14221 19894 20998 13359 2590 5550 5711 -4820 -9274 -16341 -10012 -4955 -10788 -8037 -11604
14364a1604O34J3159L677p435l23j684J1452R932P00o293m920m728L306n272m625
$$ -11604 -10970 2189 5866 -1569 -1892 -3576 7876 17808 18508 12215 7295 2567 5873 601 -4024
14349d024N424Q931J250R849Q781m72k4996J680n181P089J88j9427m002q358N756
$$ -4024 1400 10331 11581 21430 30211 29739 4743 6423 1242 8331 8519 -10908 -14910 -23268 -17512
14334a7512K218o879Q715J4262O161p309J025r701J657m417M380m83Q384R319
$$ -17512 -15294 -22173 -13458 804 6965 -344 681 -9020 -7363 -11780 -7400 -7883 501 9820
14320I820N398j127j022N618J0761m063L750j3503k748R578q041l756r274r951
$$ 9820 15218 14091 13069 18687 29448 25385 29135 15632 12884 22462 14421 10665 1391 -8560
14306h560M234R003L9k024q23n976l343M126O393n626O131J553j0156n668J842
$$ -8560 -4326 4677 4716 2692 1869 -4107 -7450 -3324 3069 -2557 3574 5127 -5029 -10697 -8855
14291h855p669J4215m065m057K752K1760J1882j1775k726j267K174J504o172j2035
$$ -8855 -16524 -2309 -6374 -10431 -7679 14081 25963 14188 11462 10195 12369 13873 7701 -4334
14277d334k172K997J133j0629J17m402K960K0092n258N404Q283Q778o493q96j0904
$$ -4334 -6506 -3509 -2376 -13005 -12888 -17290 -14330 5762 504 5908 14191 22969 16476 15580 4676
14262D676n821q551P6K2206q038k2738o502p60J6229K2697L692j4204k663m346
$$ 4676 -1145 -9696 -9620 12586 4548 -18190 -24692 -25452 -9223 13474 17166 2962 299 -4047
14248d047N630Q190j2680j090l614n789r015L98J6213J6198L995p194J388j1041
$$ -4047 1583 9773 -2907 -3997 -7611 -13400 -22415 -22017 -5804 10394 14389 7195 8583 -2458
14234b458k404K234J893L157J1186r316p287J1729J826j619o291j190J2491j3687
$$ -2458 -4862 -2628 -735 2422 13608 4292 -2995 8734 10560 8941 2650 1460 13951 264
14220B64j6755R369O722J3581k570L03P494j1906j1573M726J2050o682j0503R746
$$ 264 -16491 -7122 -400 13181 10611 10914 18408 6502 -5071 -345 11705 5023 -5480 4266
14206D266N264O736J3199k277j6289j1199J3448n930n820j3726m787o130J857
$$ 4266 9530 16266 29465 27188 10899 -300 13148 7218 1398 -12328 -17115 -23245 -21388
14193b1388J5055R96j6337m936J8433J3004O557p054j659p21m869k0463r904M628
$$ -21388 -6333 -5337 -21674 -26610 -8177 4827 11384 4330 2671 1950 -2919 -23382 -33286 -28658
14179b8658J2772L748J4362l305J609j0817j51K0335l141j1606J1688J2799j202
$$ -28658 -15886 -12138 2224 -1081 528 -10289 -10440 9895 6754 -4852 6836 19635 18433
14166A8433j5309R7J0289K5500O648j1820j8133j3026n341J312J0186J1228j5823
$$ 18433 3124 3221 13510 39010 45658 33838 15705 2679 -2662 -1350 8836 20064 4241
14153D241K292J4894m257M194j6244j0314o847J513l532J486N334M270N996m738
$$ 4241 6533 21427 17170 21364 5120 -5194 -12041 -10528 -14060 -12574 -7240 -2970 3026 -1712
14139a712k0206j137K915J2245J8285o130o551k60n131P549j11j9100j3826P417
$$ -1712 -21918 -23055 -20140 -7895 10390 4260 -2291 -2551 -7682 -133 -244 -19344 -33170 -25753
14125b5753R95J1588Q695K0149l328j2288p680k094o940l54L686j0958O706J4857
$$ -25753 -24758 -13170 -4475 15674 12346 58 -7622 -9716 -16656 -17010 -13324 -24282 -17576 -2719
14111b719m298q643J442l41N425Q379Q443M776j1615j5593r497J218R359J5463
$$ -2719 -7017 -15660 -14218 -14559 -9134 -755 7688 12464 849 -14744 -24241 -23023 -13664 1799
14097A799J7898p728j4119j8882o702J3893K0736M455l38K255P844J865n974o856
$$ 1799 19697 11969 -2150 -21032 -27734 -13841 6895 11350 11012 13267 21111 22976 17002 10146
14083A0146j966l151N532m176j3830o457J762R676R938N717k810P43M576Q506
$$ 10146 8180 5029 10561 6385 -7445 -13902 -12140 -2464 7474 13191 10381 11124 15700 24206
14069B4206l158l203m819j1875p80j2354o681K1650m072m524n14j5686J0158J9231
$$ 24206 21048 17845 13026 1151 371 -11983 -18664 2986 -1086 -5610 -6124 -21810 -11652 7579
14055G579k236n621l368P657J1507J4448k661j1968p490J094l434P5m730r400
$$ 7579 5343 -278 -3646 4011 15518 29966 27305 15337 7847 8941 5507 5582 852 -8548
14041h548k373p424J7126K1239M821k073k3755j4909N473r09O255M835R524J2739
$$ -8548 -10921 -18345 -1219 20020 24841 22768 -987 -15896 -10423 -11332 -5077 -242 9282 22021
14027B2021p814J0849O236O444n119k8989j0938p33J668J1579J1417k2891j9884
$$ 22021 14207 25056 31292 37736 32617 3628 -7310 -8043 -6375 5204 16621 -6270 -26154
14014b6154J3326J2878M639L014N081J2382L223l650q646j4153q031l713J4945
$$ -26154 -12828 50 4689 7703 12784 25166 28389 24739 16093 1940 -6091 -9804 5141
14001E141J3232o345j7319j8076J1138J5089q328j5784J4732J6543J572m970P76
$$ 5141 18373 12028 -5291 -23367 -12229 2860 -5468 -21252 -6520 10023 11595 6625 7401
13988G401m57p36n54j1886P674Q18P28N262P454l063r060o186l810k129K820M831
$$ 7401 6944 6208 5654 -6232 1442 2260 2988 8250 15704 12641 3581 -2605 -6415 -8544 -5724 -893
13972h93n310R313N773p085n331j871r807j0476k960J7199J242o736q207M67Q725
$$ -893 -6203 3110 8883 1798 -3533 -5404 -15211 -25687 -28647 -11448 -10206 -16942 -25149 -24682 -15957
13957a5957o466l379R100q94n693J0353R185k862J908K87l350o715J0116K738
$$ -15957 -22423 -25802 -16702 -17596 -23289 -12936 -3751 -6613 -4705 -4418 -7768 -14483 -4367 -1629
13943a629j4966J7563J3842q020P315J991R858o662m737m396j6481j5720M783
$$ -1629 -16595 968 14810 6790 14105 16096 25954 19292 14555 10159 -6322 -22042 -17259
13930a7259m21p151J821J3238N363J4959J790j2460J4372M959q806P101J410P125
$$ -17259 -17680 -24831 -23010 -9772 -4409 10550 12340 -120 14252 19211 10405 17506 18916 26041
13916B6041n128j6254j0867j0018Q880K0612j473j2980K117m376K457k861K301
$$ 26041 20913 4659 -6208 -16226 -7346 13266 11793 -1187 930 -3446 -989 -3850 -1549
13903a549J3789o375o62R152m671j3440l12L040P921m999N025m281K179J9331
$$ -1549 12240 5865 5203 14355 9684 -3756 -4068 -1028 6893 1894 6919 2638 4817 24148
13889B4148j4545j8657j747N70k2q329J0059J571K168J0353Q26N49M612Q915o812
$$ 24148 9603 -9054 -10801 -10231 -10253 -18582 -8523 -6952 -4784 5569 6395 6944 11556 20471 13659
13874A3659J085l260m064m245o186O22L031J1467j866j2612k2090Q479J6380k650
$$ 13659 14744 11484 7420 3175 -3011 -2389 642 12109 10243 -2369 -24459 -15980 400 -2250
13860b250j0787O06l839J6258J1333J0004P755l818Q065l978j0897M272j0305
$$ -2250 -13037 -12431 -16270 -12 11321 21325 29080 25262 33327 29349 18452 22724 12419
13847A2419q57j2208J047N512m405m062l825j0701M519n943m005o3J0350k144
$$ 12419 11562 -646 401 5913 1508 -2554 -6379 -17080 -12561 -18504 -22509 -22572 -12222 -14366
13833a4366K662n633J6098Q179p237j640R11q672q633m647q247L753J7003J8312
$$ -14366 -11704 -17337 -1239 6940 -297 -1937 -1026 -9698 -18331 -22978 -31225 -27472 -10469 7843
13819G843J038j3114q160j6189m900r258N380J0617J9227m619N897J3641J0601
$$ 7843 8881 -4233 -12393 -28582 -33482 -42740 -37360 -26743 -7516 -12135 -6238 7403 18004
13806A8004n138p072r960j4554q212p122L146K2702J6042L154n378J151q715j2713
$$ 18004 12866 5794 -4166 -18720 -26932 -34054 -30908 -8206 7836 10990 5612 6763 -1952 -14665
13792a4665R142L854m740R2J332n864n73P570j2079j220J0636M669O953N21J28
$$ -14665 -5523 -1669 -6409 -6317 -4985 -10849 -11422 -3852 -15931 -17151 -6515 -1846 5107 5628 5756
13777E756M083j2495k844M589r415n231J3115m819J137R664M111o662p271N263
$$ 5756 9839 -2656 -5500 -911 -10326 -15557 -2442 -7261 -6124 3540 7651 989 -6282 -1019
13763a019J760J962k59l719J1753n110j2955m627L672J654L328R636J8064k865
$$ -1019 741 2703 2444 -1275 10478 5368 -7587 -12214 -8542 -6888 -3560 6076 24140 21275
13749B1275o93K675J1418o66j2162m854j0055q408N937j73Q01q958m401l2p510
$$ 21275 20582 23257 34675 34009 21847 16993 6938 -1470 4467 4294 5095 -3863 -8264 -8296 -15806
13734a5806J0259J5844J5317q081j2823m075M536O53j37R89J2807j81O27O975
$$ -15806 -5547 10297 25614 17533 4710 635 5171 5824 5687 6676 19483 19302 19929 26904
13720B6904m073o636p499m776p52q667J530O906J2971P250k0044j1830p640k0947
$$ 26904 22831 16195 8696 3920 3168 -5499 -3969 2937 15908 23158 3114 -8716 -16356 -37303
13706c7303m384J0834O504J1743J6543N942K949j187j4786K932q645n849j626
$$ -37303 -41687 -30853 -24349 -12606 3937 9879 12828 11641 -3145 -213 -8858 -14707 -16333
13693a6333o266L540J1140J4420r424k220m417m993m046N6K289j778M551p217
$$ -16333 -22599 -19059 -7919 6501 -2923 -5143 -9560 -14553 -18599 -18543 -16254 -18032 -13481 -20698
13679b0698j0202p183Q209J1930J3941R331J687M149j0073Q38m671J551n38J49
$$ -20698 -30900 -38083 -29874 -17944 -4003 5328 7015 11164 1091 1929 -2742 -1191 -1729 -1580
13665a580l358O638N252M494M073J3945N543N518j0926j7124k3034o948J24J1460
$$ -1580 -4938 1700 6952 11446 15519 29464 35007 40525 29599 12475 -10559 -17507 -17383 -5923
13651e923J4310l719j102j0795L713O755j426P584J385K297p714p554j4875N673
$$ -5923 8387 4668 3566 -7229 -3516 3239 1813 9397 10782 13079 5365 -2189 -17064 -11391
13637a1391Q64J5678L719j1046l926J3295L254Q018J4705o222j9878l21o364J3503
$$ -11391 -10527 5151 8870 -2176 -6102 7193 10447 18465 33170 26948 7070 6749 385 13888
13623A3888R833p112j9155j6058j0950o354J5753M691l837K103j1192N697L638
$$ 13888 23721 16609 -2546 -18604 -29554 -35908 -20155 -15464 -19301 -17198 -28390 -22693 -19055
13610a9055M532J5347L505k187J910n271k299K49l935n891q77p053O746m082J523
$$ -19055 -14523 824 4329 2142 4052 -1219 -3518 -3269 -7204 -13095 -13972 -21025 -14279 -18361 -16838
13595a6838j000J2538J887N462R144M342m639j1103j2026K009M812J3723k837
$$ -16838 -17838 -5300 -3413 2049 11193 15535 10896 -207 -12233 -10224 -5412 8311 5474
13582E474O730P747n245P307K685p540j3115k1488l338Q76l751J86J5110J6343
$$ 5474 12204 19951 14706 22013 24698 17158 4043 -17445 -20783 -19907 -23658 -23472 -8362 7981
13568G981k669p254j047K426O684j3358k3915R567J7764L254l868L248n276k573
$$ 7981 5312 -1942 -2989 -563 6121 -7237 -31152 -21585 -3821 -567 -4435 -1187 -6463 -9036
13554i036j255j1646q797o96J1920J3126p330J1871k388n996P970M016R446q565
$$ -9036 -10291 -21937 -30734 -31430 -19510 -6384 -13714 -1843 -4231 -10227 -2257 1759 11205 2640
13540B640o257k72J0835P941k6827q550Q29M76N14J471m523l72O893j922K477
$$ 2640 -3617 -3889 6946 14887 -11940 -20490 -19661 -19185 -18671 -17200 -21723 -22095 -15202 -17124 -14647
13525a4647J3904J0304j1005j3241l683J258O45n42o974j4263R524J1223m943
$$ -14647 -743 9561 -1444 -14685 -18368 -17110 -16465 -17007 -23981 -38244 -28720 -17497 -22440
13512b2440p83m457O366J8211J3410M001j0819j2889l519o663m595J8724J7671
$$ -22440 -23223 -27680 -21314 -3103 10307 14308 3489 -9400 -12919 -19582 -24177 -5453 12218
13499A2218k2590k0807L118Q618Q425o441L467J025O617J6914l787o591J390M676
$$ 12218 -10372 -31179 -28061 -19443 -11018 -17459 -13992 -12967 -6350 10564 6777 186 1576 6252
13485F252O627k722L090Q810k0888r689j0045J2934K6710j0236j6468j142O941
$$ 6252 12879 10157 13247 22057 1169 -8520 -18565 -5631 21079 10843 -5625 -6767 174
13472A74J1802j650J755J421M453L344n47m974j333k3103j3178L797J6688J4703
$$ 174 11976 10326 12081 13502 17955 21299 20752 15778 14445 -8658 -21836 -18039 -1351 13352
13458A3352M804P7O943L83n975R2j7325j4499J5605J2110m145l811q093J953j4799
$$ 13352 18156 18233 25176 25559 19584 19676 2351 -12148 3457 15567 11422 7611 -482 1471 -13328
13443a3328k3325L291P866J5950N934j4430M413Q232J042J8057J5356J938j0904
$$ -13328 -36653 -33362 -25496 -9546 -3612 -18042 -13629 -5397 -4355 13702 29058 30996 20092
13430B0092l372J4952K074r629j1201l864j7755K963lM737J9211k078l300M070
$$ 20092 16720 31672 33746 24117 12916 9052 -8703 -5740 -5743 -1006 18205 16127 12827 16897
13416A6897P87j5098j2473P63M017J9912N015M964N944J0395N902j991r587K796
$$ 16897 17684 2586 -9887 -9124 -5107 14805 19820 24784 30728 41123 47025 45034 35447 38243
13402C8243J6135M243j0766n47p771M568J7k409n200j7502j6344O705J0595l215
$$ 38243 54378 58621 47855 47308 39537 44105 44122 41713 36513 19011 2667 9372 19967 16752
13388A6752j7967o326K22R715J6398M134n880j005k204k882P482J853K592J246
$$ 16752 -1215 -7541 -7319 2396 18794 22928 17048 16043 13839 10957 18439 20292 22884 24130
13374B4130K015L395M857q140j7778j2600K160j966R348P892M148K411l778q70
$$ 24130 26145 29540 34397 26257 8479 -4121 -1961 -3927 5421 13313 17461 19872 16094 15224
13360A5224n346L672J8694k096o846J7851O884k639m648n245q268m952l17n691
$$ 15224 9878 13550 32244 30148 23302 41153 48037 45398 40750 35505 27237 22285 21968 16277
13346A6277j0135P760N86K392l762r874Q008K0808R010k4226p537L358n665L066
$$ 16277 6142 13902 14488 16880 13118 3244 11252 32060 41070 16844 9307 12665 7000 10066
13332A0066R649J9264m351L016O33j762p459m352l515q522O475M504R939K155
$$ 10066 19715 38979 34628 37644 38277 36515 29056 24704 21189 12667 19142 23646 33585 35740
13318C5740l958N285P796j2937o872J1335N679L386j3204n507m694j5648j2070
$$ 35740 31782 37067 44863 31926 25054 36389 42068 45454 32250 26743 22049 6401 -5669
13305e669J2460J32p34J4303J531O23k014J7436Q516M176r193n904K513r225n030
$$ -5669 6791 6923 6189 20492 22023 22646 20632 38068 46584 50760 41567 35663 38176 28951 23921
13290B3921m078j880k985l407o74M974J1146r546l560l431k163L561P76R147N776
$$ 23921 19843 17963 14978 11571 10897 15871 27017 17471 13911 10480 8317 11878 12654 21801 27577
13275B7577J117P50k1836j1495O827N679o293j8443o070J1373j1244P126J2904
$$ 27577 28694 29444 7608 -3887 2940 8619 2326 -16117 -22187 -10814 -22058 -14932 -2028
13262b028P119J712j7760R832J1176q124K555m686L822L126k755j887n456Q396
$$ -2028 5091 6803 -10957 -1125 10051 1927 4482 -204 3618 6744 3989 2102 -3354 5042
13248E042o446j0841k0940p944M907N548J2419N469N053N502K204l906q798M840
$$ 5042 -1404 -12245 -33185 -41129 -36222 -30674 -18255 -12786 -7733 -2231 -27 -3933 -12731 -7891
13234g891l040o819L689j1990QK7255P014J282N621j1886j3196l46J509K1407
$$ -7891 -10931 -17750 -14061 -26051 -26043 1212 8226 9508 15129 3243 -9953 -10299 -8790 12617
13220A2617O212k318M148L050j5956p086n01K824k010r486n8O68j66p438N173
$$ 12617 18829 16511 20659 23709 7753 667 166 2990 980 -8506 -8564 -7896 -8062 -15500 -10327
13205a0327j504N400K6098J2683j2559l927P224o169j915j2355J478Q600m710
$$ -10327 -11831 -6431 19667 32350 19791 15864 23088 16919 15004 2649 4127 12727 8017
13192H017j4269P466J1028J4805l956k1745r942j648o690l550l282P87J1740Q102
$$ 8017 -6252 1214 12242 27047 23091 1346 -8596 -10244 -16934 -20484 -23766 -22979 -11239 -3137
13178c137J6386k110j3899r985J3192O093p188p38n025r482J0056K237L48q486
$$ -3137 13249 11139 -2760 -12745 447 6540 -648 -1386 -6411 -15893 -5837 -3600 -3252 -11738
13164a1738r678J6253m519q856J8032l662j7705j0810O596J6887J1594k877j3331
$$ -11738 -21416 -5163 -9682 -18538 -506 -4168 -21873 -32683 -26087 -9200 2394 -483 -13814
13151a3814M611K1894K588p401J841r654k178J0137J066j3053j1868m784K914
$$ -13814 -9203 12691 15279 7878 9719 65 -2113 8024 9090 -3963 -15831 -20615 -17701
13138a7701Q204m536R106R324J2448O446j2701j1670j4578K634J3093J299O447
$$ -17701 -9497 -14033 -4927 4397 16845 23291 10590 -1080 -15658 -13024 69 1368 7815
13125G815J1280N624k669j0284q701p453o087m29K118K09J0446M804q692j2034
$$ 7815 19095 24719 22050 11766 3065 -4388 -10475 -10904 -8786 -8577 1869 6673 -2019 -14053
13111a4053L068L424q696j4035O555M586P213J9471J8752L542q141o351m834Q447
$$ -14053 -10985 -7561 -16257 -30292 -23737 -19151 -11938 7533 26285 29827 21686 15335 10501 18948
13097A8948K0324L859j7837j3267m60J2592n249M764k729r564j7419l577J0568
$$ 18948 39272 43131 25294 12027 11567 24159 18910 23674 20945 11381 -6038 -9615 953
13084I53J3995P156j050p272J3801j197j3029j418k836R800P839p8m592o96N899
$$ 953 14948 22104 21054 13782 27583 26386 13357 11939 9103 18903 26742 26664 22072 21376 27275
13069B7275K805R767J442k8088Q68o765j0401J7616K5164J146k662M518L500j1328
$$ 27275 30080 39847 41289 13201 14069 7304 -3097 14519 39683 40829 38167 42685 46185 34857
13055C4857n359M91l289k7P796L342n278o421l488J1325Q734m803K177K85k203
$$ 34857 29498 29989 26700 26673 34469 37811 32533 26112 22624 33949 42683 37880 40057 40342 38139
13040C8139O378J5521j9669j9636J6191L610r290j832M345J0566J4571Q490m54
$$ 38139 44517 60038 40369 20733 36924 40534 31244 29412 33757 44323 58894 67384 66930
13027F6930J229J1999J8587Q396J2990J0982M214K0911M740j0861r33J1512J972
$$ 66930 68159 80158 98745 107141 120131 131113 135327 156238 160978 150117 149184 160696 162668
13014A62668q186Q330j3974n594N937o556N390j652q200Q00n88J9320M0140J6958
$$ 162668 154482 162812 148838 143244 149181 142625 148015 146363 138163 138963 138375 157695 197835 214793
13000B14793J6679M3660K6662K1400K7089K3995J4164K7004M3784O1894N9767
$$ 214793 231472 275132 301794 323194 350283 374278 388442 415446 459230 521124 580891
12989E80891P4441P9824R7305J09887J44316K06689K69682L68537M86785N49820
$$ 580891 655332 735156 832461 942348 1086664 1293353 1563035 1931572 2418357 2968177
12979B968177N67500N24961M28976L12288J55418m11j73443k93196l67925m15243
$$ 2968177 3535677 4060638 4489614 4801902 4957320 4956909 4783466 4490270 4122345 3707102
12969C707102m23695m22607l93509l09410k32551j42074p4102o944L4323J02483
$$ 3707102 3283407 2860800 2467291 2157881 1925330 1783256 1709154 1702210 1736533 1839016
12959A839016J63155K20395L16449M28467N71827O70380P27888P22692O93651
$$ 1839016 2002171 2222566 2539015 2967482 3539309 4209689 4937577 5660269 6353920
12950F353920O45021N52486L97175K31378Q9643n8025k14436l54062m44014m69461
$$ 6353920 6998941 7551427 7948602 8179980 8269623 8211598 7997162 7643100 7199086 6729625
12940F729625m69707m89429m84108m70123m52437m64883m74468m14726l48999
$$ 6729625 6259918 5770489 5286381 4816258 4363821 3898938 3424470 3009744 2660745
12931B660745k79607j94387q9639o657N1231J22380K28392L09048L62346M16111
$$ 2660745 2381138 2186751 2097112 2090455 2141686 2264066 2492458 2801506 3163852 3579963
12921C579963M31658M24200L85987L38231K64583J55892P3222J5046m3438j14093
$$ 3579963 4011621 4435821 4821808 5160039 5424622 5580514 5653736 5668782 5625344 5511251
12911E511251j28233q9548j5750M5633J45863K23059K63523K62120K28488J65790
$$ 5511251 5383018 5293470 5277720 5323353 5469216 5692275 5955798 6217918 6446406 6612196
12901F612196N9556m9844j92221l15208m41329m96019n05493m95899m62837l99183
$$ 6612196 6671752 6621908 6429687 6114479 5673150 5177131 4671638 4175739 3712902 3313719
12891C313719l19889k27281j51458o2241M8644J39846K49896L72756M70823N33368
$$ 3313719 2993830 2766549 2615091 2552850 2601494 2741340 2991236 3363992 3834815 4368183
12881D368183N47632N61228N71742O11957O28792O46481O68274O68648N82356
$$ 4368183 4915815 5477043 6048785 6660742 7289534 7936015 8604289 9272937 9855293
12872I855293M28174K20344L1691j43234l48297n21714o70052p71042q55787r00022
$$ 9855293 10283467 10503811 10535502 10392268 10043971 9522257 8852205 8081163 7225376 6325354
12862F325354r10357p92258o74015n45883m11986l06699k09676j42174o8551J6166
$$ 6325354 5414997 4622739 3948724 3402841 2990855 2684156 2474480 2332306 2263755 2279921
12852B279921J05251K20267L33983M36980N30968N61534N51705N37180M76993
$$ 2279921 2385172 2605439 2939422 3376402 3907370 4468904 5020609 5557789 6034782
12843F034782L68073K28934J1544k17372m26905n95567p04792p53998p13777n96776
$$ 6034782 6402855 6631789 6643333 6425961 5999056 5403489 4698697 3944699 3230922 2634146
12833B634146m70491l52893k81604k29501j66054j36860j18940j15809q6687o6588
$$ 2634146 2163655 1810762 1529158 1299657 1133603 996743 877803 761994 675307 608719
12823F08719n9619m8515k1877l0933l5615k5002k1683o878k1561l9172j5908j9073
$$ 608719 549100 500585 478708 447775 412160 387158 365475 358597 337036 297864 281956 262883
12811B62883j1389k1842o319j2062k5582j8780J525q789j8408o457p58j421K794
$$ 262883 251494 229652 223333 211271 185689 166909 168434 159645 141237 134780 134022 132601 135395
12798A35395n448J3379K117j0263l950J7299O435j3012j0535K610n505j2075k0627
$$ 135395 129947 143326 145443 135180 131230 148529 154964 141952 131417 134027 128522 116447 95820
12785I5820j3137J1328Q656j5751K973J1388Q330Q572n604N444K0159M72j4604
$$ 95820 82683 94011 102667 86916 89889 101277 109607 118179 112575 118019 138178 138650 124046
12772A24046K129r72q192n026p836j0688p241j1847P276j195K152R839K056O52
$$ 124046 126175 125203 117011 111985 104149 93461 86220 74373 81649 80454 82606 92445 94501 95153
12758I5153k800Q475m436r822q692P603j2368j7956Q21L698j962M934J5827j6190
$$ 95153 92353 100828 96392 86570 77878 85481 73113 55157 55978 59676 57714 62648 78475 62285
12744F2285k3223k620K690N107n322j1826J2433O615j7126R636P131p555j3629
$$ 62285 39062 36442 39132 44239 38917 27091 39524 46139 29013 38649 45780 38225 24596
12731B4596N671O952p872P993Q556R887R06M654J3444L479l337j37J048M246j1799
$$ 24596 30267 37219 29347 37340 45896 55783 56689 61343 74787 78266 74929 74792 75840 80086 68287
12716F8287j2460J0591L937j5914j468k030J5017o63o661q218K638L330J1799
$$ 68287 55827 66418 70355 54441 52973 50943 65960 65297 58636 50418 53056 56386 68185
12703F8185M334q722J4975o930j9829k8943j109J3401M540O125J2880P168l305
$$ 68185 72519 63797 78772 71842 52013 23070 21961 35362 39902 46027 58907 66075 62770
12690F2770k776k6327k2019P672j266M475R873K1793M792p471r580j3165O573
$$ 62770 59994 33667 11648 19320 18054 22529 32402 54195 58987 51516 41936 28771 35344
12677C5344j95j665j855N908k140J962M837n542Q514m979j3390l060p08J3488
$$ 35344 35149 33484 31629 37537 35397 37359 42196 36654 45168 40189 26799 23739 23031 36519
12663C6519n346P49N035p767j5411J1305O184o273L61N19M317m172r77q952o502
$$ 36519 31173 31922 36957 29190 13779 25084 31268 24995 25356 25875 30192 26020 25043 16091 9589
12648I589P716P355o171j8679o996L476n169J1592P733j146m110P810J2741P939
$$ 9589 17305 24660 18489 -190 -7186 -3710 -8879 2713 10446 9300 5190 13000 25741 33680
12634C3680j6541P533J3690o481m974k987m054k534J852o687O948J5353p882j2038
$$ 33680 17139 24672 38362 31881 26907 23920 19866 17332 19184 12497 19445 34798 26916 14878
12620A4878j066Q770R615J2833k007k7409o452m559O250J6632J4368K944o409
$$ 14878 13812 22582 32197 45030 43023 15614 9162 4603 10853 27485 41853 44797 38388
12607C8388p836n509l773K66J2931O246N887j0646j1800J6084K166k1238r381
$$ 38388 30552 25043 21270 21536 34467 40713 46600 35954 24154 40238 42404 21166 11785
12594A1785q810m920Q655M997n59l366J5384J0145j5917r387j0569n431J0408
$$ 11785 2975 -1945 6710 11707 11148 7782 23166 33311 17394 8007 -2562 -7993 2415
12581B415J9897P842j5001p532l557o305Q873Q181J3545j1278j0911j1307j443
$$ 2415 22312 30154 15153 7621 4064 -2241 6632 14813 28358 17080 6169 -5138 -6581
12568f581Q634m279j740m423M023n5J0198M621n469N656p878J075J3537n70N509
$$ -6581 2053 -2226 -3966 -8389 -4366 -4421 5777 10398 4929 10585 2707 3782 17319 16749 22258
12553B2258J78j7689J2311Q336q488n483j6838j1987R943L320N0N399l346R89
$$ 22258 22436 4747 17058 25394 16906 11423 -5415 -17402 -7459 -4139 -4089 1310 -2036 -1047
12539a047K888l729K990J0833J5033Q223q77J1187J543j4365K128N752m681j2928
$$ -1047 1841 -1888 1102 11935 26968 35191 34314 45501 47044 32679 34807 40559 35878 22950
12525B2950m132P844m350k327J0762J3169j1731q87R639J5732J0150K633J0868
$$ 22950 18818 26662 22312 19985 30747 43916 32185 31298 40937 56669 66819 69452 80320
12512H0320j2123j8730k1794J8204k086k0718R420K920m446k460L298j816J412
$$ 80320 68197 49467 27673 45877 43791 23073 32493 35413 30967 28507 31805 29989 31401
12499C1401P957o269J0966R601j4964j2485L840J8751J473Q34n970n521J6050
$$ 31401 39358 33089 44055 53656 38692 26207 30047 48798 50271 51105 45135 39614 55664
12486E5664J590j3767p986l168J598M412P873L920J7877K1408o366n08j0196j6816
$$ 55664 57254 43487 35501 32333 33931 38343 46216 50136 68013 89421 83055 82547 72351 55535
12472E5535j3177J1593L616j2278L002K925J0339Q881J9783M688q785q912J1559
$$ 55535 42358 53951 57567 45289 48291 51216 61555 70436 90219 94907 86122 77210 88769
12459H8769M763M301J7392J200m863J0014N369l960l336j6082J918J1372K087
$$ 88769 93532 97833 115225 116425 111562 121576 126945 122985 119649 103567 105485 116857 118944
12446A18944M386K632J0609J7427Q231R884J7830J4964n535j475K2420K2828J5130
$$ 118944 123330 125962 136571 153998 162229 172113 189943 204907 199372 197897 220317 243145 258275
12433B58275L5346K9611L2605J8953J0850K7688J6955J8334l617K7148N7789P9795
$$ 258275 293621 323232 355837 374790 385640 413328 430283 448617 445000 472148 529937 609732
12421F09732J08688J46065J49928J78226K16901K73103L90239N34272O85843R14799
$$ 609732 718420 864485 1014413 1192639 1409540 1682643 2072882 2607154 3292997 4207796
12411D207796J130008J242839J123954P22012M4886o49552j077765j176136j022088
$$ 4207796 5337804 6580643 7704597 8426609 8471495 7821943 6744178 5568042 4545954
12402D545954p72125n24666l52165k02375n8760R9116K74766M18462N82895P58659
$$ 4545954 3773829 3249163 2896998 2694623 2635863 2734979 3009745 3428207 4011102 4769761
12392D769761R53630J046540R79813O34217J04052m71563q83979j064919j058287
$$ 4769761 5723391 6769931 7749744 8383961 8488013 8016450 7132471 6067552 5009265
12383E009265r56097p80673n84765m23982k97773k22695j74978j18217q7229p1966
$$ 5009265 4053168 3272495 2687730 2263748 1965975 1743280 1568302 1450085 1362856 1290890
12373A290890o6515o3318o9408o1866k6863j6043J731J9091M2265Q6743J19177
$$ 1290890 1224375 1161057 1091649 1029783 1002920 986877 988608 1007699 1049964 1136707 1255884
12362A255884J48475J80596K30042K88505L80125N22988P00326R18406J164870
$$ 1255884 1404359 1584955 1814997 2103502 2483627 3006615 3706941 4625347 5790217
12353E790217J287338J143340O94923K9641n09367q20439r18753q76097p26623
$$ 5790217 7077555 8220895 8915818 8945459 8436092 7615653 6696900 5820803 5094180
12344E094180n12599k92106n1630J68980M15249P15800J032366J376401J675475
$$ 5094180 4581581 4289475 4237845 4406825 4822074 5537874 6570240 7946641 9622116
12335I622116J813730J681466J153362K97517o78399j428382j779530j751813
$$ 9622116 11435846 13117312 14270674 14568191 13889792 12461410 10681880 8930067
12327H930067j506396j195419q92036o42304m02584j89691L4941K57962M71763
$$ 8930067 7423671 6228252 5336216 4693912 4291328 4101637 4136578 4394540 4866303
12318D866303O20795O73224O21513M01813k2267m93286q67204r85398q82419p20305
$$ 4866303 5487098 6160322 6781835 7183648 7161381 6668095 5800891 4815493 3933074 3212769
12308C212769n72577m02351k83949k43463j95643j52534j16767q7755n9716n4331
$$ 3212769 2640192 2237841 1953892 1710429 1514786 1362252 1245485 1157730 1098014 1043683
12298A043683n8028m8908n3700l3454J4535q78K70J0038M4318N5898P4994J08470
$$ 1043683 985655 936747 883047 849593 864128 863250 863520 873558 917876 973774 1048768 1157238
12286A157238J53189K40242L35344M54604O20975P84933R12912R32120P73433
$$ 1157238 1310427 1550669 1886013 2340617 2961592 3746525 4659437 5591557 6364990
12277F364990M53357J9074m33819p33496q28663p70800o41649n10852l83507k43667
$$ 6364990 6818347 6837421 6403602 5670106 4841443 4070643 3428994 2918142 2534635 2290968
12267B290968j43173k8721J05075K50099M17731O21875Q48207J019851R58151
$$ 2290968 2147795 2119074 2224149 2474248 2891979 3513854 4362061 5381912 6340063
12258F340063O25727N9561n17078q97298j012482r27661p55342n90466m09552
$$ 6340063 6965790 7025351 6508273 5610975 4598493 3670832 2915490 2325024 1915472
12249A915472k99769k26958j77271j62182j18183j05154r8922r1560p3125o0516
$$ 1915472 1615703 1388745 1211474 1049292 931109 825955 727033 635473 562348 501832
12239E01832o3236l8094k2139k9681m0729l0719j4062l0835j4768j0179k4011
$$ 501832 438596 400502 378363 348682 307953 277234 263172 232337 217569 207390 183379
12228A83379j4570o625j682M243m467K503N729m344J6303l303j3304k9809l5284
$$ 183379 168809 162184 160502 164745 160278 162781 168510 164166 180469 177166 163862 134053 98769
12215I8769q32N478l094j8334j6702j590L255K786o829m738O786J1583O010j5944
$$ 98769 97937 103415 100321 81987 65285 63695 66950 69736 62907 58169 64955 76538 82548 66604
12201F6604o574J0739j4504n307R356P880K289p879n49q188L42j4048l913P918
$$ 66604 60030 70769 56265 50958 60314 68194 70483 62604 62055 53867 54209 40161 36248 44166
12187D4166j998N511m14o902L561Q760j663l293j054Q700N212m657o512n98j391
$$ 44166 42168 47679 47265 40363 43924 52684 51021 47728 46674 55374 60586 55929 49417 48819 47428
12172D7428o267q743m584J1814R266k209r677j0739J5828J5701j193p864j1706
$$ 47428 41161 32418 27834 39648 48914 46705 37028 26289 42117 57818 56625 48761 37055
12159C7055J3744K396j5779p459q179j3171j2442J1669J604p592K036J6185L500
$$ 37055 50799 53195 37416 29957 21778 8607 -3835 7834 9438 1846 3882 20067 23567
12146B3567r709R744J3748K739N139r202j1782m385j7743j0428j5522J8147K4226
$$ 23567 13858 23602 37350 40089 45228 36026 24244 19859 2116 -8312 -23834 -5687 18539
12133A8539M131l392P223r315j247k842n32K3391O234j1849N014J0898k0015L60
$$ 18539 22670 19278 26501 17186 15939 13097 12565 35956 42190 30341 35355 46253 26238 26598
12119B6598J0643m194n746j707p389R793j350p011j9996Q301q76q386Q522K0674
$$ 26598 37241 33047 27301 25594 18205 27998 26648 19637 -359 7942 7066 -1320 7202 27876
12105B7876O335n992m746l419N048r933j5285j4119J3256K478m268P42M046J0505
$$ 27876 34211 28219 23473 20054 25102 15169 -116 -14235 -979 1499 -2769 -2027 2019 12524
12091A2524J4919o826k8716O420J0574K121P763P290j6482l726r120O87P440K968
$$ 12524 27443 20617 -8099 -1679 8895 11016 18779 26069 9587 5861 -3259 -2572 4868 7836
12077G836L341l610J1113r574K781L054n531k88k590Q797l147j4144N070M12M188
$$ 7836 11177 7567 18680 9106 11887 14941 9410 9122 6532 15329 12182 -1962 3108 3520 7708
12062G708P949J916P135J998j4906j1298j7285J4664L0306N059O559j9480j0228
$$ 7708 15657 17573 24708 26706 11800 502 -16783 -2119 28187 33246 39805 20325 10097
12049A0097L24j073Q11k385q051j0182J3181M805J5579p557m252K470N700j5797
$$ 10097 10421 9348 10159 7774 -277 -10459 2722 7527 23106 15549 11297 13767 19467 3670
12035C670o873K11R0o17J926J0150J2845O061J756M74k669q555R798r588k3901
$$ 3670 -3203 -2992 -2902 -3519 -1593 8557 21402 27463 29219 29693 27024 18469 28267 18679 -5222
12020e222r03J418R311j123J14R860k597j4747k0521J5190Q083N214J390J6051
$$ -5222 -6125 -4707 4604 3481 3595 13455 10858 -3889 -24410 -9220 -1137 4077 5467 21518
12006B1518N49j711n039j1013k900l071M003Q58q416L434K160k729m796Q322j394
$$ 21518 22067 20356 15317 4304 1404 -1667 2336 3194 -5222 -1788 372 -2357 -7153 1169 -225
11991b25m058o718k150J565K3114L719j235N80j0093N400p572j2642o230l472
$$ -225 -4283 -11001 -13151 -11586 11528 15247 14012 14592 4499 9899 2327 -10315 -16545 -20017
11977b0017J5825Q058J245N083o478l056J0520n418j0817J374N240j3292J1597
$$ -20017 -4192 3866 5111 10194 3716 660 11180 5762 -5055 -3681 1559 -11733 -136
11964a36J3156n507O556J5451n91q394O732O705J2479J3485r088o41r870j4402
$$ -136 13020 7513 14069 29520 28929 20535 27267 33972 46451 59936 50848 50207 40337 25935
11950B5935M38R953P802K230j0460o200J1839J4490K039j8548K528J6833L093
$$ 25935 26373 36326 44128 46358 35898 29698 41537 56027 58066 39518 42046 58879 61972
11937F1972J2915k616j4740k8577j7633q039J0290J1151r133k050K171n802r514
$$ 61972 74887 72271 57531 28954 11321 3282 13572 24723 15590 13540 15711 9909 395
11924C95j0299L776N962r6j894l80j0686J2888K5496R262o711q744J945R347j2889
$$ 395 -9904 -6128 -166 -262 -2156 -2536 -13222 -334 25162 34424 27713 18969 20914 30261 17372
11909A7372q145n791p454J3494L949M596K712k784P146L18J5288P684j5698j2168
$$ 17372 9227 3436 -4018 9476 13425 18021 20733 17949 25095 25413 40701 48385 32687 20519
11895B0519l982o203j3732Q761J7155L727n54J0981J6892R848n10R208j1978L671
$$ 20519 16537 10334 -3398 5363 22518 26245 25691 36672 53564 63412 62902 72110 60132 63803
11881F3803J6185q208j1431r673r514p126L433R158q948j4359j0826Q560J0878
$$ 63803 79988 71780 60349 50676 41162 34036 37469 46627 37679 23320 12494 21054 31932
11868C1932J2490j1519l677O582J0923j797j6192r054j6534j4150L271L81J8053
$$ 31932 44422 32903 29226 35808 46731 44934 28742 19688 3154 -10996 -7725 -7344 10709
11855A0709J6487R518j5359j5872p148J6272k75q476r785l265R483N314p5k6493
$$ 10709 27196 36714 21355 5483 -1665 14607 14332 5856 -3929 -7194 2289 7603 7528 -18965
11841a8965p698J0437O314J4198O738l876J544N6o209p339J4489J6661J8150K3991
$$ -18965 -26663 -16226 -9912 4286 11024 7148 8692 8748 2539 -4800 9689 26350 44500 68491
11827F8491J6398j2173k3077k1647j7063j4603N24O109q178P003N815M239R966
$$ 68491 84889 72716 49639 27992 10929 -3674 -3150 2959 -5219 1784 7599 11838 21804
11814B1804L646q930l654O681N247J2218m673M854q487q476j0096r275o623N435
$$ 21804 25450 16520 12866 19547 24794 37012 32339 37193 28706 20230 10134 859 -5764 -329
11800c29J3864l076j2819k1556J748J3120J389J744J6142N600o592J0195L192
$$ -329 13535 10459 -2360 -23916 -22168 -9048 -7659 -5915 10227 15827 9235 19430 22622
11787B2622j6789J028R628p972j847n430j9870q064O177k670j8131J4586O282
$$ 22622 5833 6861 16489 8517 6670 1240 -18630 -26694 -20517 -23187 -41318 -26732 -20450
11774b0450J0752O967O590O986K2258r758j3016r120l373m621N371M493l553P06
$$ -20450 -9698 -2731 3859 10845 33103 23345 10329 1209 -2164 -6785 -1414 3079 -474 232
11760B32k824l896o799L319j1291J1757J499j324k127n337J1065J002j534M806
$$ 232 -2592 -6488 -13287 -9968 -21259 -9502 -8003 -9327 -11454 -16791 -5726 -4724 -6258 -1452
11746a452r035j4569l757Q105M935J1482J3258J2939j3826j2807l863n196M013
$$ -1452 -10487 -25056 -28813 -20708 -15773 -4291 8967 21906 8080 -4727 -8590 -13786 -9773
11733i773J0930p822j6026o264R956o623l363J2073O477R986l75j6615k0042O380
$$ -9773 1157 -6665 -22691 -28955 -18999 -25622 -28985 -16912 -10435 -449 -824 -17439 -37481 -31101
11719c1101J8421J1616J261J940n895M533o138p115o54J3224J0391J823m537J3577
$$ -31101 -12680 -1064 197 2137 -3758 775 -5363 -12478 -13132 92 10483 12306 7769 21346
11705B1346m762j4562k1889o152J6281K3852n137N660J0582p948j1458J646L677
$$ 21346 16584 2022 -19867 -26019 -9738 14114 8977 14637 25219 17271 5813 7459 11136
11692A1136q932M037Q414r489P689k1045j8076O017P71Q069O122o562J825L941
$$ 11136 2204 6241 14655 5166 12855 -8190 -26266 -20249 -19478 -11409 -5287 -11849 -10024 -6083
11678f083O377J0651N420r127q663n240p678j0319l83J0201k245o93R820Q302
$$ -6083 294 10945 16365 7238 -1425 -6665 -14343 -24662 -25045 -14844 -17089 -17782 -7962 340
11664C40q906j2253J607J012L094J2316J3141J0504j5527j3868j6359M758O406
$$ 340 -8566 -20819 -19212 -18200 -15106 -2790 10351 20855 5328 -8540 -24899 -20141 -13735
11651a3735m674q472J523p419P794K0485J7777J0763l583j3675m103r559j8973
$$ -13735 -18409 -26881 -25358 -32777 -24983 -4498 13279 24042 20459 6784 2681 -6878 -25851
11638b5851M030O590l078k245P048Q938K568j053J144O856j1158k2277j4436n556
$$ -25851 -21821 -15231 -18309 -20554 -13506 -4568 -2000 -3053 -1909 4947 -6211 -28488 -42924 -48480
11624d8480J0121k90J5177l855j5744J8795p13n05j864m350P891q84j3795R31
$$ -48480 -38359 -38649 -23472 -27327 -43071 -24276 -24989 -25494 -27358 -31708 -23817 -24701 -38496 -37565
11610c7565M454K3006m145j2899J2979l367j4965l217O711L097l950k976J4560
$$ -37565 -33111 -10105 -14250 -27149 -14170 -17537 -32502 -35719 -29008 -25911 -29861 -32837 -18277
11597a8277J0137P449p749m350J1241M325j3897K81N457P545k095O634P80J3619
$$ -18277 -8140 -691 -8440 -12790 -1549 2776 -11121 -10840 -5383 2162 67 6701 7481 21100
11583B1100J4692j3357l95l848k292m169o224m401m358r440r235j4997j4154N263
$$ 21100 35792 22435 22040 18192 15900 11731 5507 1106 -3252 -12692 -21927 -36924 -51078 -45815
11569d5815J3295J8873N613q052j0727R680J3848j356j1467k181P900M278P730
$$ -45815 -32520 -13647 -8034 -16086 -26813 -17133 -3285 -4641 -16108 -18289 -10389 -6111 1619
11556A619M516j6456j4520J4886J4090K2160M355j9842k0790p887M168N593n630
$$ 1619 6135 -10321 -24841 -9955 4135 26295 30650 10808 -9982 -17869 -13701 -8108 -13738
11543a3738o042J2998n69Q881J2576j3555n122L934K544N560p699M920j354m63
$$ -13738 -19780 -6782 -7351 1530 14106 551 -4571 -637 1907 7467 -232 4688 3334 2871
11529B871L947n152J5205l946j4420K13o142P824q98j6332j2425p119J475O692
$$ 2871 6818 1666 16871 12925 -1495 -1282 -7424 400 -498 -16830 -29255 -36374 -34899 -28207
11515b8207Q317K043K41q723j8445K3383J8385L76r70m477J000l486j0511R321
$$ -28207 -19890 -17847 -17606 -26329 -44774 -21391 -3006 -2630 -3600 -8077 -7077 -10563 -21074 -11753
11501a1753K95j1045N479J0047P135j2944n006L664n699p517N090P390n002J701
$$ -11753 -11458 -22503 -17024 -6977 158 -12786 -17792 -14128 -19827 -27344 -22254 -14864 -19866 -18165
11487a8165P918P410J6141J1636l580n851r923j269j141j817K389j312j2665j6235
$$ -18165 -10247 -2837 13304 24940 21360 15509 5586 4317 3176 1359 3748 2436 -10229 -26464
11473b6464L850O598J6854J2644n458O98l160j226n109p151j8423N647p047j6668
$$ -26464 -22614 -16016 838 13482 8024 8722 5562 4336 -773 -7924 -26347 -20700 -27747 -44415
11459d4415l270N37J1210j0J159N047l472j3676K712J3595J1481J0641n645J1209
$$ -44415 -47685 -47148 -35938 -35948 -34789 -29742 -33214 -46890 -44178 -30583 -19102 -8461 -14106 -2897
11445b897R96p551l584j5516M772M560o166j0298Q497N88m083L503j628N768l636
$$ -2897 -1901 -9452 -13036 -28552 -23780 -19220 -25386 -35684 -27187 -26599 -30682 -27179 -28807 -23039 -26675
11430b6675J7859J2937k506k800m948l61p930K323P75J2240N988R82j5893J5004
$$ -26675 -8816 4121 1615 -1185 -6133 -6494 -14424 -12101 -11326 914 6902 7884 -8009 6995
11416F995R138r427j2704q636J3541N467r04M155o957j5853P751O703m633j0902
$$ 6995 16133 6706 -5998 -14634 -1093 4374 3470 7625 668 -15185 -7434 -731 -5364 -16266
11402a6266n599q932n544Q054Q467n054m490J858P134j1682K294J4841J1007k147
$$ -16266 -21865 -30797 -36341 -28287 -19820 -24874 -29364 -27506 -20372 -32054 -29760 -14919 -3912 -6059
11388f059p510n525k792P254K175R653j0729j5669P294L539Q298N826J0387K061
$$ -6059 -13569 -19094 -21886 -14632 -12457 -2804 -13533 -29202 -21908 -18369 -10071 -4245 6142 8203
11374H203o257J844p344r880j0232L765j872q017J499J5462M200n874K669J2682
$$ 8203 1946 3790 -3554 -13434 -23666 -19901 -21773 -29790 -28291 -12829 -8629 -14503 -11834 848
11360H48R425j9159j518O933q77j7576k927j1524q991Q781k460M581l044J8308
$$ 848 10273 -8886 -10404 -3471 -4348 -21924 -24851 -36375 -45366 -36585 -39045 -34464 -37508 -19200
11346a9200Q348m469J1409J0454J534j5854K37J6819l375p109l799N135N654J888
$$ -19200 -10852 -15321 -3912 6542 8076 -7778 -7541 9278 5903 -1206 -5005 130 5784 7672
11332G672J860k129r787j6372P352J3510l542j7347J1808j064j8184K852j0643
$$ 7672 9532 7403 -2384 -18756 -11404 2106 -1436 -18783 -6975 -8039 -26223 -23371 -34014
11319c4014j6521N610j133p86J1692M671K1707j840J0554M305N157j1761p31Q075
$$ -34014 -50535 -44925 -46058 -46844 -35152 -30481 -8774 -10614 -60 4245 9402 -2359 -3090 4985
11305D985j0866j0530L81Q321q169R25J1655j435k697K2356K191j5089m086q274
$$ 4985 -5881 -16411 -16030 -7709 -15878 -14953 -3298 -4733 -7430 14926 17117 2028 -2058 -10332
11291a0332j0333q846J1459L989J5491J0297P16q125o86j0184K024m751Q861l073
$$ -10332 -20665 -29511 -18052 -14063 1428 11725 12441 4316 3630 -6554 -4530 -9281 -420 -3493
11277c493k284j902r96J8922L631j1429Q874j2344j4794R122J0014j673j511q343
$$ -3493 -5777 -7679 -8675 10247 13878 2449 11323 -1021 -15815 -6693 3321 1648 137 -8206
11263h206p430M739r77m114m484J0345l150J078J2047j0789k806L624J2367M911
$$ -8206 -15636 -10897 -11874 -15988 -20472 -10127 -13277 -12199 -152 -10941 -13747 -10123 2244 7155
11249G155k1527j901J9362R111k511k228m78l953m37n951l241R331L893J2078
$$ 7155 -14372 -16273 3089 12200 9689 7461 6983 3030 2593 -3358 -6599 2732 6625 18703
11235A8703J901j5449m147J0491K379j886P849l527l009r392M883L698j6220k920
$$ 18703 20604 5155 1008 11499 13878 11992 19841 16314 13305 3913 8796 12494 -3726 -6646
11221f646K666K745j3949q570O928O267n16j0953K903K2317o534J363R363k457
$$ -6646 -3980 -1235 -15184 -23754 -16826 -10559 -11075 -22028 -19125 3192 -3342 -1979 7384 4927
11207D927j2380Q537K457k6937k4342j6710P036J7409J9858J1824j318o227J1703
$$ 4927 -7453 1084 3541 -23396 -47738 -64448 -57412 -40003 -20145 -8321 -9639 -15866 -4163
11194d163O417o060j1058o59J2527R893L135q257M712L5574L813q136k2026j6431
$$ -4163 2254 -3806 -14864 -15523 -2996 6897 10032 1775 6487 42061 45874 37738 15712 -719
11180g19J3759o94j1894k584L179l629L400K682J295n71j5680n090M957J2738
$$ -719 13040 12346 452 -2132 1047 -2582 818 3500 4795 4224 -11456 -16546 -11589 1149
11166A149j476j5669r784J0964L176j740r288m453J426J0311j1590R849J0432
$$ 1149 -327 -15996 -25780 -14816 -11640 -13380 -22668 -27121 -25695 -15384 -26974 -17125 -6693
11153f693j9921O405J3165j1658p900P263J3109J7124R964k5544j5854J2421J0252
$$ -6693 -26614 -20209 -7044 -18702 -26602 -19339 -6230 10894 20858 -4686 -20540 -8119 2133
11140B133n469j4237M090J1142O03N74o593M281K3836j369o560L380K411l6427
$$ 2133 -3336 -17573 -13483 -2341 -1738 -1164 -7757 -3476 20360 18991 12431 15811 18222 -18205
11126a8205j0861Q191p052j3131O353P657j372L638J5134P282Q921j3416j108
$$ -18205 -29066 -20875 -27927 -41058 -34705 -27048 -28420 -24782 -9648 -2366 6555 -6861 -7969
11113g969M540m205m614Q652j8964l117J4412p037q846O099K529M264q078j0981
$$ -7969 -3429 -7634 -12248 -3596 -22560 -25677 -11265 -18302 -27148 -21049 -18520 -14256 -22334 -33315
11099c3315Q353J1260k77o162J966P790M153m693j129j2125j2092J316L465o361
$$ -33315 -24962 -13702 -13979 -20141 -18175 -10385 -6232 -10925 -12054 -24179 -36271 -34955 -31490 -37851
11085c7851r276k142j403l736N312J3705K0094l050k009j86J432j0851k495L76
$$ -37851 -47127 -49269 -50672 -54408 -49096 -35391 -15297 -18347 -20356 -20542 -19110 -29961 -32456 -32080
11071c2080k698R29R935J3678n970J8449J617k510J2598j983K925K15M79o801
$$ -32080 -34778 -33849 -23914 -10236 -16206 2243 3860 1350 13948 11965 14890 15105 15584 8783
11057H783n480j3293k825L906j0349K026m997J460K2434p154n416j178M527N206
$$ 8783 3303 -9990 -12815 -8909 -19258 -17232 -22229 -20769 1665 -5489 -10905 -12083 -7556 -2350
11043b350L364n670q331j0715J1080J2547J5935N230k439p183O693M676r092p729
$$ -2350 1014 -4656 -12987 -23702 -12622 -75 15860 21090 18651 11468 18161 22837 13745 6016
11029F016N898M461l32p522n221N292l507q09j621n05p510m046L92n015o160J2462
$$ 6016 11914 16375 16043 8521 3300 8592 5085 4276 2655 2150 -5360 -9406 -9014 -14029 -20189 -7727
11013g727K204r720r094k003J0724j035o274J7646j638j835J3210j2687j2011
$$ -7727 -5523 -15243 -24337 -26340 -15616 -16651 -22925 -5279 -6917 -8752 4458 -8229 -20240
11000b0240J7380J6095n020j4668N140n090j1372j653p789j052J5086J1229N563
$$ -20240 -2860 13235 8215 -6453 -1313 -6403 -17775 -19428 -27217 -28269 -13183 -1954 3609
10987C609j0818p853n724j1942P653P113l641M620J0039j7576p142L990M09q922
$$ 3609 -7209 -15062 -20786 -32728 -25075 -17962 -21603 -16983 -6944 -24520 -31662 -27672 -27263 -36185
10973c6185M393O737K4120j549j1381M378J2774K47j4305j0634J2362M165K346
$$ -36185 -31792 -25055 -935 -2484 -13865 -9487 3287 3534 -10771 -21405 -9043 -4878 -2532
10960b532Q16p074j734p046q41n92P610j3184m428J6054J0573J0224R530j9524
$$ -2532 -1716 -8790 -10524 -17570 -18411 -19003 -11393 -24577 -29005 -12951 -2378 7846 17376 -2148
10946b148O061n431j0901j0717l963q344Q438P162J526j580P039N147J801k152
$$ -2148 3913 -1518 -12419 -23136 -27099 -35443 -27005 -19843 -18317 -19897 -12858 -7711 -5910 -8062
10932h062Q090j997l726l249n473q361K595R372j037k086J2492j532P300J841
$$ -8062 28 -1969 -5695 -8944 -14417 -22778 -20183 -10811 -11848 -13934 -1442 -2974 4326 6167
10918F167o050j3388KM745m297r573p123n811K690K0020J0317l503m135K287p874
$$ 6167 117 -13271 -13269 -8524 -12821 -22394 -29517 -35328 -32638 -12618 -2301 -5804 -9939 -7652 -15526
10903a5526k220N124R247J1866R439m962j5355j6769j6445P899J4141l687R88
$$ -15526 -17746 -12622 -3375 8491 17930 12968 -2387 -19156 -35601 -27702 -13561 -17248 -16260
10890a6260N040J181l751n853P098K0716J6227r023K115l15m428q479j5840j1453
$$ -16260 -11220 -10039 -13790 -19643 -12545 8171 24398 15375 17490 17175 12747 4268 -11572 -23025
10876b3025r540N4J0930J0166L772L300K642K210J3835Q994j3100k6953n736J0993
$$ -23025 -32565 -32511 -21581 -11415 -7643 -4343 -1701 509 14344 23338 10238 -16715 -22451 -11458
10862a1458n911l976K657K298Q773n71q316j4530l750K1J0311J9432n274j1314
$$ -11458 -17369 -21345 -18688 -16390 -7617 -8188 -16504 -31034 -34784 -34763 -24452 -5020 -10294 -21608
10848b1608q417K2151J6605m094m136j3658j2503p523J172M167M079J8076l330
$$ -21608 -30025 -7874 8731 4637 501 -13157 -25660 -33183 -32011 -27844 -23765 -5689 -9019
10835i019k380p973J0958j1919J411O823q441o314L271J225j4176J1459K4643
$$ -9019 -11399 -19372 -8414 -20333 -18922 -12099 -20540 -26854 -23583 -22358 -36534 -25075 -432
10822d32P876N009L072p447q929k411M514o257o088N328K986l005J991r167l967
$$ -432 7444 12453 15525 8078 -851 -3262 1252 -5005 -11093 -5765 -2779 -5784 -3793 -12960 -16927
10807a6927p202m819J5228R490n629l940q905J0791q091q999J1285M089J061p912
$$ -16927 -24129 -28948 -13720 -4230 -9859 -13799 -22704 -11913 -20004 -29003 -17718 -13629 -12568 -20480
10793b0480J0970Q922K405Q922n538j5998P038R125K082j4835k2559J2288p97
$$ -20480 -9510 -588 1817 10739 5201 -10797 -3759 5366 7448 -7387 -29946 -17658 -18455
10780a8455m686O025L176R245J0692m44j3021m842Q676L80o459N691P895r871
$$ -18455 -23141 -17116 -13940 -4695 5997 5553 -7468 -12310 -3634 -3254 -9713 -4022 3873 -5998
10766e998n484j7112j024N426l013M632N677P466k926o094j3789o488J3877J1488
$$ -5998 -11482 -28594 -29618 -24192 -27205 -22573 -16896 -9430 -12356 -18450 -32239 -38727 -24850 -13362
10752a3362j249q820J904M51N015N548J2891k533k0575j4444P740J2414P216K527
$$ -13362 -14611 -23431 -21527 -21076 -16061 -10513 2378 -155 -20730 -35174 -27434 -15020 -7804 -5277
10738e277j474J7606N506l289q564j5845J841M71L810J3743N3L063m089j5328
$$ -5277 -6751 10855 16361 13072 4508 -11337 -9496 -9025 -5215 8528 8581 11644 7555 -7773
10724g773n557J002Q457P492k399k05j296K721m800J0906Lr997m711j414j2514
$$ -7773 -13330 -12328 -3871 3621 1222 1017 -279 2442 -2358 8548 8551 -1446 -6157 -7571 -20085
10709b0085j109J6011J0626J4887q399r849p199J1838K354r892j3096l316R701
$$ -20085 -21194 -5183 5443 20330 11931 2082 -5117 6721 9075 -817 -13913 -17229 -7528
10696g528J9353K830p241M80ok041j2110l556Q111p41J0446J9560k105l294m423
$$ -7528 11825 14655 7414 7894 7888 5847 -6263 -9819 -1708 -2449 7997 27557 25452 22158 17735
10681A7735j9501r412p242r072J082j539j235J5836O643l987j2794k894M404J999
$$ 17735 -1766 -11178 -18420 -27492 -26410 -27949 -29184 -13348 -6705 -10692 -23486 -26380 -21976 -19977
10667a9977J1909j2477r036J2098J1126q361O0J26o241Q153M676o318n861Q911
$$ -19977 -8068 -20545 -29581 -17483 -6357 -14718 -14658 -14532 -20773 -12620 -7944 -14262 -20123 -11212
10653a1212K4285J0485N050q106m129o593q105p401m174j5241O166l0j122n22
$$ -11212 13073 23558 28608 20502 16373 9780 1675 -5726 -9900 -25141 -18975 -19005 -20127 -20649
10639b0649L754K6796R640K273j5239j9640l754J85O195l93K751J5460Q341m010
$$ -20649 -16895 9901 19541 21814 6575 -13065 -16819 -16634 -10439 -10832 -8081 7379 15720 11710
10625A1710j3319P969R062p253q901l495M712N651r266j0611J4493N590j3320
$$ 11710 -1609 6360 15422 8169 -732 -4227 485 6136 -3130 -13741 752 6342 -6978
10612f978q242p20o162j1200j589J9203K0910J3037p132p12K18j4097k007Q873
$$ -6978 -15220 -15940 -22102 -33302 -34891 -15688 5222 18259 11127 10415 10633 -3464 -5471 3402
10598C402k175J3499k022j7111N952J8743L502j1076K700M559k990j9429L763
$$ 3402 1227 14726 12704 -4407 1545 20288 23790 12714 15414 19973 16983 -2446 1317
10585A317L933j0284k397J0637j413p536n479R723k83J171m803O058K241p248
$$ 1317 5250 -5034 -7431 3206 1793 -5743 -11222 -1499 -1782 -611 -5414 644 2885 -4363
10571d363q645O732j3881j2916J4414N623o701j8465P340N072n447n07R243J4191
$$ -4363 -13008 -6276 -20157 -33073 -18659 -13036 -19737 -38202 -30862 -25790 -31237 -31744 -22501 -8310
10557h310R678J1628j721j4548j1506l944J1952J6052j3269j3406o457R765p156
$$ -8310 1368 12996 11275 -3273 -14779 -18723 -6771 9281 -3988 -17394 -23851 -14086 -21242
10544b1242J0529J5556m554j6509J285l802p66K818J1243n613j217j4737m275
$$ -21242 -10713 4843 289 -16220 -14935 -18737 -19503 -16685 -5442 -11055 -12272 -27009 -31284
10531c1284J1452l449n709p486J0299R070l649p17L576M755M981j1945k292k77
$$ -31284 -19832 -23281 -28990 -36476 -26177 -17107 -20756 -21473 -17897 -13142 -8161 -20106 -22398 -22675
10517b2675m772J0397J6245l81L870R387k804j3878k804N41m767j985j988k668
$$ -22675 -27447 -17050 -805 -1186 2684 12071 9267 -4611 -7415 -6874 -11641 -13626 -15614 -18282
10503a8282m864Q144q599P67L149P771J4080P798j5795l230k843j661Q700L645
$$ -18282 -23146 -15002 -23601 -22834 -19685 -11914 2166 9964 -5831 -9061 -11904 -13565 -4865 -1220
10489a220Q606j130o041m675n622n375J117N327R76p035j4513m178J2094J1691
$$ -1220 7386 6256 215 -4460 -10082 -15457 -14340 -9013 -8037 -15072 -29585 -33763 -21669 -9978
10475i978J667l989q046J0046O553m119r737M908J0557L313L845l263J417J2202
$$ -9978 -8311 -12300 -20346 -10300 -3747 -7866 -17603 -12695 -2138 1175 5020 1757 3174 15376
10461A5376m443j0244j2273M321p613m793J0360J0388K832n042j0574j6371m220
$$ 15376 10933 689 -11584 -7263 -14876 -19669 -9309 1079 3911 -1131 -11705 -28076 -32296
10448c2296J348j431J2678r84P959Q124m594m673j7933J4180J7833j0311O688
$$ -32296 -30948 -32379 -19701 -20685 -12726 -4602 -9196 -13869 -31802 -17622 211 -10100 -3412
10435c412N569Q222n11j1705j1326j117p637j810o649J2190K1317j06M256L795
$$ -3412 2157 10379 9868 -1837 -13163 -14280 -21917 -23727 -30376 -18186 3131 3025 7281 11076
10421A1076k583k268N101j5717j3581p144Q582m619n257J912J2687M694J111M437
$$ 11076 8493 6225 11326 -4391 -17972 -25116 -16534 -21153 -26410 -24498 -11811 -7117 -6006 -1569
10407a569J1125N611l773R54r992J0616J944j5859p750J379M350L218m496J83
$$ -1569 9556 15167 11394 12348 2356 12972 14916 -943 -8693 -7314 -2964 254 -4242 -4059
10393d059o372q694n405R809j3760N583K8397L991j966Q938K172p786q864n549
$$ -4059 -10431 -19125 -24530 -14721 -28481 -22898 5499 9490 7524 16462 18634 10848 1984 -3565
10379c565N208k436k425L55l36O470r996j2720J057Q558n623J104p06k589P551
$$ -3565 1643 -793 -3218 -2863 -3199 3271 -6725 -19445 -18388 -9830 -15453 -14349 -15055 -17644 -10093
10364a0093L765J5453J2041M302o99j2927q748K27m547R855N169r239j383r526
$$ -10093 -6328 9125 21166 25468 24769 11842 3094 3321 -1226 8629 13798 4559 3176 -6350
10350f350M805J3188J2441j0499k0060Q039J0509R60o132m261K159m022q755P718
$$ -6350 -1545 11643 24084 13585 -6475 1564 12073 13033 6901 2640 4799 777 -7978 -260
10336b60J8572J1159o605N129L815m146J145o5o241j1733l907l612j764j855J1747
$$ -260 18312 29471 22866 27995 31810 27664 28809 28744 22503 10770 6863 3251 1487 -368 11379
10321A1379J9164Q848l548K421p467M599M163l131j4961n755L594J0074L558o982
$$ 11379 30543 39391 35843 38264 30797 35396 39559 36428 21467 15712 19306 29380 32938 25956
10307B5956N570o815L487J3271n034m18j355k488L952l337k338m191j2662j2678
$$ 25956 31526 24711 28198 41469 36435 36017 34662 32174 36126 32789 30451 26260 13598 920
10293I20j0132J1075J8359L272J531j1101L910q031q920K518o678J4769J5224
$$ 920 -9212 1863 20222 23494 25025 13924 17834 9803 883 3401 -3277 11492 26716
10280B6716k41o964J288l944l316q539N354j4176J786N283n974J2886J9829R998
$$ 26716 26475 19511 20799 16855 13539 5000 10354 -3822 -2036 3247 -2727 10159 29988 39986
10266C9986J1058P248k506j9089n771M934P438j0737M948j414J181j570r716j20
$$ 39986 51044 58292 55786 36697 30926 35860 43298 32561 37509 36095 37276 35706 25990 25870
10252B5870J1335M454K223N321n356j2134j0838J1159j0636M084J2994K159k886
$$ 25870 37205 41659 43882 49203 43847 31713 20875 32034 21398 25482 38476 40635 37749
10239C7749k1874k0923n224K6826J1636m369N47J0114L536J0661J5639m164r3
$$ 37749 15875 -5048 -10272 16554 28190 23821 24368 34482 38018 48679 64318 60154 60061
10226F0061r108m593o656j1850j657R82O478M101q376j3787O792L167O158J787
$$ 60061 50953 46360 39704 27854 26197 27179 33657 37758 29382 15595 22387 25554 31712 33499
10212C3499Q014m932j1704J160P320L710n11r861r923j6603R45J4779j0532j8863
$$ 33499 41513 36581 24877 26037 33357 37067 36556 26695 16772 169 1114 15893 5361 -13502
10198a3502m588J0711J299l135L140m300j0080O644j356r01j0475M720N789J3343
$$ -13502 -18090 -7379 -6080 -9215 -6075 -10375 -20455 -13811 -15167 -16068 -26543 -21823 -16034 -2691
10184b691K056M344K204p267N005J0522O721j2859n894J078L932O003j2992L833
$$ -2691 -635 3709 5913 -1354 3651 14173 20894 8035 2141 3219 7151 13154 162 3995
10170C995J2244L32j2072j311k857k707K472k681p473L251n758j371J2078J0764
$$ 3995 16239 16571 4499 3188 331 -2376 96 -2585 -10058 -6807 -12565 -13936 -1858 8906
10156H906K867P462n983o398j6369k724J4446P569k093j0963n415l563j0983J980
$$ 8906 11773 19235 13252 6854 -9515 -12239 2207 9776 7683 -3280 -8695 -12258 -23241 -21261
10142b1261k911M329r565n790m738J8946J4349n52O46j9917m802J8716K5122L087
$$ -21261 -24172 -19843 -29408 -35198 -39936 -20990 -6641 -7193 -6547 -26464 -31266 -12550 12572 15659
10128A5659n192K691j467p913j5484J4543J4139q729j4595M207J209N163K1840
$$ 15659 10467 13158 11691 3778 -11706 2837 16976 8247 -6348 -2141 -932 4231 26071
10115B6071o151j3448k2767j017J2712q411M173l726K208J9912l202q189J3461
$$ 26071 19920 6472 -16295 -17312 -4600 -13011 -8838 -12564 -10356 9556 6354 -1835 11626
10102A1626J6928J1999Q070J084k274j8359k0600j4441m319J3427L483L702J1514
$$ 11626 28554 40553 48623 49707 47433 29074 8474 -5967 -10286 3141 6624 10326 21840
10089B1840r04j863N347q730p937m446J79J9678j8083j5235O187m479k570K484
$$ 21840 20936 19073 24420 15690 7753 3307 3486 23164 5081 -10154 -3967 -8446 -11016 -8532
10075h532k25o752k867J9179J9777m430k407l745N332N763L363m263n279R737
$$ -8532 -8757 -15509 -18376 803 20580 16150 13743 9998 15330 21093 24456 20193 14914 24651
10061B4651k28R29k185N114J1188m665n572m970J1400K8099L4474O7945Q2326
$$ 24651 24423 25352 23167 28281 39469 34804 29232 24262 35662 63761 98235 166180 248506
10048B48506P1589l1287p4725o1455m9833m0781k3502j3861l51P109j2234q422
$$ 248506 320095 288808 214083 152628 102795 62014 38512 24651 24300 31409 19175 10753
10036A0753J0618J0493P152n640k0338K281P636k673p992j1339J6556j461N93
$$ 10753 21371 31864 39016 33376 13038 15319 22955 20282 12290 951 17507 16046 16639
10023A6639J3843J0432L967m346k783J442j3424J2217q76m801j2147J6015J092
$$ 16639 30482 40914 44881 40535 37752 39194 25770 37987 37111 32310 20163 36178 37270
10010C7270m406J6166O916l271L511o417J0458J4527O337j3157p388l813n593
$$ 37270 32864 49030 55946 52675 56186 49769 60227 74754 81091 67934 60546 56733 51140
9997E1140J0536J6902M031j5335j2875J6848J9660J2058K1095K2518r500O852
$$ 51140 61676 78578 82609 67274 54399 71247 90907 102965 124060 146578 137078 143930
9985A43930J2301J0251K0164L355j5322j0252m243Q759O535K522J5017R898J6100
$$ 143930 156231 166482 186646 190001 174679 164427 160184 168943 175478 178000 193017 202915 219015
9972B19015K9319J8007K0610J4193K1228L2092L3356O9021Q9335J04448J14658
$$ 219015 248334 266341 286951 301144 322372 354464 387820 456841 546176 650624 765282
9961G65282J31304J82346J95234J83657J59690J11083O0192M0634L3780L6490
$$ 765282 896586 1078932 1274166 1457823 1617513 1728596 1788788 1829422 1863202 1899692
9951A899692P8345J34676J18933Q3847j151j01745j59715j59310r8481j3811N6272
$$ 1899692 1978037 2112713 2231646 2315493 2314342 2212597 2052882 1893572 1795091 1781280 1837552
9940A837552J44938K26135K32570K11396J96167J90492J45978J41624J82960K39491
$$ 1837552 1982490 2208625 2441195 2652591 2848758 3039250 3185228 3326852 3509812 3749303
9930C749303K72152K83940K75723K07957J18114N0705K3033n5425j35570k00193
$$ 3749303 4021455 4305395 4581118 4789075 4907189 4957894 4980927 4925502 4789932 4589739
9920D589739k56230k66342k17878j34886l5940Q0288J57491J61013P9778k7964
$$ 4589739 4333509 4067167 3849289 3714403 3678463 3758751 3916242 4077255 4157033 4129069
9910D129069r1172j08858n4434K847P0554K00449K77796K93289K48045J41938
$$ 4129069 4037897 3929039 3874605 3877452 3948006 4148455 4426251 4719540 4967585 5109523
9900E109523K4921p7705j52335j91099k01550j62752j08294r7633j43796k08550
$$ 5109523 5134444 5056739 4904404 4713305 4511755 4349003 4240709 4143076 3999280 3790730
9890C790730j99247j37003j00837j21593j90955k11540j75709j04129M573J61096
$$ 3790730 3591483 3454480 3353643 3232050 3041095 2829555 2653846 2549717 2554290 2715386
9880B715386K82941L37554L90480L86166K90381J71992L7331p3834j34928p3311
$$ 2715386 2998327 3335881 3726361 4112527 4402908 4574900 4612231 4538397 4403469 4330158
9870D330158K6543J25130J67078J51028O6402p6166k15337l03605l39449l39302
$$ 4330158 4356701 4481831 4648909 4799937 4866339 4790173 4574836 4271231 3931782 3592480
9860C592480k55843j06306N2447J91461K69169K80167K12609J79386J98270K68600
$$ 3592480 3336637 3230331 3282778 3474239 3743408 4023575 4236184 4415570 4613840 4882440
9850D882440L29275K94525K21621J77499K12000L03004L47344K97331J85739M9484
$$ 4882440 5211715 5506240 5727861 5905360 6117360 6420364 6767708 7065039 7250778 7300262
9840G300262p7786k21298l49536l90681l41629k20311j10227O861J07922J43068
$$ 7300262 7222476 7001178 6651642 6260961 5919332 5699021 5588794 5595655 5703577 5846645
9830E846645Q1446k3666j64638k43849k16689q1465P9327J94377K84504L64480
$$ 5846645 5928091 5904425 5739787 5495938 5279249 5197784 5277111 5471488 5755992 6120472
9820F120472L55232L16701K24574J11860J1651j11335k24789l14933l93290m05032
$$ 6120472 6475704 6792405 7016979 7128839 7140490 7029155 6804366 6489433 6096143 5691111
9810E691111l54283k74223k33550j91479j65001j90882k74216l73397l80357l23030
$$ 5691111 5336828 5062605 4829055 4637576 4472575 4281693 4007477 3634080 3253723 2930693
9800B930693k17098q4210K5801J29082J92507J85339Q8558n2199j33011j68367
$$ 2930693 2713595 2629385 2655186 2784268 2976775 3162114 3250672 3198473 3065462 2897095
9790B897095j48642p8658k9174j8542k6827q3669j74475k33672k67581k84819
$$ 2897095 2748453 2669795 2640621 2622079 2595252 2511583 2337108 2103436 1835855 1551036
9780A551036k58362k20930j66097j40938j08630r2258p6836m8846l4439k9165
$$ 1551036 1292674 1071744 905647 764709 656079 563821 486985 438139 403700 374535
9770C74535k6475r522l1574r450k8806l0288k0208j5759j7905j8057j9214j6522
$$ 374535 348060 338538 306964 297514 268708 238420 218212 202453 184548 166491 147277 130755
9758A30755j0443j269M397R561j2203M244m379L155K669n291o798l821j0542n668
$$ 130755 120312 119043 123440 133001 120798 125042 120663 123818 126487 121196 114398 110577 100035 94367
9744I4367l611l22O348j1272r235J6958O499P77m573m829Q23r955o315R62n708
$$ 94367 90756 90434 96782 85510 76275 93233 99732 100509 95936 91107 91930 81975 75660 76622 70914
9729G0914l099n468L440k272o116Q386l547r363J7177R215l761j3161J745O081
$$ 70914 67815 62347 65787 63515 57399 65785 62238 52875 70052 79267 75506 62345 64090 70171
9715G0171L637p013r720o227P618R153M625j7300k0147J4296J4207j7844J200
$$ 70171 73808 66795 57075 50848 58466 67619 72244 54944 34797 49093 63300 45456 46656
9702D6656P523J253j340j7241k325n062L988k589n768k113o48R620o659j094Q788
$$ 46656 54179 55432 54092 36851 34526 29464 33452 30863 25095 22982 22334 31954 25295 24201 32989
9687C2989R390j0453r257J16J0264J5188m323N88J3428O402o073L841K6791J6683
$$ 32989 42379 31926 22669 22785 33049 48237 43914 44502 57930 64332 58259 62100 88891 105574
9673A05574J7477L4283N3316L2157j1353l3591l8743l9914j5883j6208r135j1839
$$ 105574 123051 157334 210650 242807 231454 197863 159120 119206 103323 87115 77980 66141
9661F6141j3135m561P183J324j9833J2638k24j286m460j077j7639r428J5380K973
$$ 66141 53006 48445 55628 56952 37119 49757 49533 48247 43787 42710 25071 15643 31023 33996
9647C3996k462O085R082K94O513K878n027r746K948r24j681P941R698J636k982
$$ 33996 31534 37619 46701 46995 53508 56386 51359 41613 44561 43637 41956 49897 59595 61231 58249
9632E8249j3992n985M00m420P00M853N969q204k416m561P889k684J275J7659j2648
$$ 58249 44257 38272 38672 34252 34952 39805 45774 37570 35154 30593 38482 35798 37073 54732 42084
9617D2084m225k026K431L793O119l68j7751L068K6020K2517o568L866m889j0851
$$ 42084 37859 35833 38264 42057 48176 47808 30057 33125 59145 81662 75094 78960 74071 63220
9603F3220k817k629J08J2989Q133P360J3742K6118J0641j2155j2554q145k454
$$ 63220 60403 57774 57882 70871 79004 86364 100106 126224 136865 124710 112156 104011 101557
9590A01557k050j285Q13q533n628P071J227Q88R276j1912j2548R821L684M583
$$ 101557 99507 98222 99035 90502 84874 91945 93172 94060 103336 91424 78876 88697 92381 96964
9576I6964J2143K1649q923p885K4160J6888J0178L816J3530l71P308K063j7631
$$ 96964 109107 130756 121833 113948 138108 154996 165174 168990 182520 182149 189457 191520 173889
9563A73889l184N498J9381J8439J1394O459J5899K3668L1770L5460K9870L6855
$$ 173889 170705 176203 195584 214023 225417 231876 247775 271443 303213 338673 368543 405398
9551D05398N3998P4632R7336J25823J50471J86955K60235L38313M29240N31959
$$ 405398 459396 534028 631364 757187 907658 1094613 1354848 1693161 2122401 2654360
9541B654360O32846O30505M74236J58667j95071m78273n90355n68587m91316l66931
$$ 2654360 3287206 3917711 4391947 4550614 4355543 3877270 3286915 2718328 2227012 1860081
9531A860081k68437k23003j44537r8203n7608k7435L959N1324O6708P9177J48665
$$ 1860081 1591644 1368641 1224104 1125901 1068293 1040858 1044817 1096141 1162849 1242026 1390691
9520A390691K36804L25916M04123M85304N10195M71631L56687J82222l5906k31394
$$ 1390691 1627495 1953411 2357534 2842838 3353033 3824664 4181351 4363573 4327667 4096273
9510D096273l83795m60011m61133l90065l32083k63668k30609j63557j17691p8690
$$ 4096273 3712478 3252467 2791334 2401269 2069186 1805518 1574909 1411352 1293661 1214971
9500A214971l5386k9593j373L2501M5337Q3715J34856J84123K33329L39871M34112
$$ 1214971 1179585 1149992 1148619 1181120 1226457 1310172 1445028 1629151 1862480 2202351 2636463
9489B636463N48227P27911R01585R88645R10243P08137L77948l5104l90568o38901
$$ 2636463 3184690 3912601 4814186 5802831 6713074 7421211 7799159 7764055 7373487 6734586
9479F734586p79574q22726p62687o48617n08650l61292k78298j92044j18883m6794
$$ 6734586 5955012 5132286 4369599 3720982 3212332 2851040 2572742 2380698 2261815 2215021
9469B215021J3674R7634K08749L23128M39210N81843P58378R00528J020100J060323
$$ 2215021 2228695 2326329 2535078 2858206 3297416 3879259 4637637 5538165 6558265 7618588
9459G618588R85445Q04325N09356J12453l20975p01074r75774j092185j064521
$$ 7618588 8604033 9408358 9917714 10030167 9709192 9008118 8032344 6940159 5875638
9450E875638r47344p83299o26642m72344l56954k90517k07699j56213j24027o3428
$$ 5875638 4928294 4144995 3518353 3046009 2689055 2398538 2190839 2034626 1910599 1847171
9440A847171J2596N3400J05849J89174K73210L75685M96620O02531O92698P15058
$$ 1847171 1859767 1913167 2019016 2208190 2481400 2857085 3353705 3956236 4648934 5363992
9430E363992O29630M39816K01961q7598l73628n94229o94665o89758o28273n22398
$$ 5363992 5993622 6433438 6635399 6547801 6174173 5579944 4885279 4195521 3567248 3044850
9420C044850m09791l08567k29218j71168j07149k4741O89L5456J16066J68109
$$ 3044850 2635059 2326492 2097274 1926106 1818957 1794216 1794905 1830361 1946427 2114536
9410B114536K27268L04917M44853O18034P70669Q98613R81634R47326P80208M97038
$$ 2114536 2341804 2646721 3091574 3709608 4480277 5378890 6360524 7307850 8088058 8585096
9400H585096J25800k56263n44383p72614q81101q90654q25004p05453n84699m72672
$$ 8585096 8710896 8454633 7910250 7137636 6256535 5365881 4540877 3835424 3250725 2778053
9390B778053l69211k74622j90280j35556n2511j9994M5136J09812J88638K60060
$$ 2778053 2408842 2134220 1943940 1808384 1755873 1735879 1781015 1890827 2079465 2339525
9380B339525L43185M58989N34751N87328N45625M13903K14601l7644k94255n26380
$$ 2339525 2682710 3141699 3676450 4263778 4809403 5223306 5437907 5400263 5106008 4579628
9370D579628o53778o66129n87679m50085l57587k64068k07296j57102j26453q4185
$$ 4579628 3925850 3259721 2672042 2221957 1864370 1600302 1393006 1235904 1109451 1025266
9360A025266p5052o6258m2961k441P676K2071L2750L9876P9131J36397J91925
$$ 1025266 950214 883956 840995 838554 846230 868301 901051 940927 1020058 1156455 1348380
9349A348380K25217K79483K88197K77479K36258J43263P446j29531k37824l00431
$$ 1348380 1573597 1853080 2141277 2418756 2655014 2798277 2805723 2676192 2438368 2137937
9339B137937l25620l01513k27041j89041j40917j13046o7660o2851m8585j6060
$$ 2137937 1812317 1510804 1283763 1094722 953805 840759 773099 710248 661663 645603
9329F45603O236K4924O7970R3263J30248J95365K44588L36653L99396L87250K67007
$$ 645603 651839 676763 744733 837996 968244 1163609 1408197 1744850 2144246 2531496 2798503
9318B798503P2215j23608k88255l82879l82038l16102k52971j90436j46445j14274
$$ 2798503 2870718 2747110 2458855 2075976 1693938 1377836 1124865 934429 787984 673710
9308F73710j05778r7657o8208m3377m0816l3548k3424r979q045j2783j5215j3011
$$ 673710 567932 470275 402067 358690 317874 284326 260902 250923 242878 230095 214880 201869
9296B01869p407k087j6407k4126r227L449k0995j6078p939q495M641q088j1361
$$ 201869 194462 192375 175968 151842 142615 146064 125069 108991 101052 92557 97198 89110 77749
9283G7749L650R346K106m647j8150q055J0793M792n657j3498L120Q444l715j1654
$$ 77749 81399 90745 92851 88204 70054 61999 72792 77584 71927 58429 61549 69993 66278 54624
9269E4624k149r105J0166L917l477K9202M813m972k2612j7057m79R377L555n673
$$ 54624 52475 43370 53536 57453 53976 83178 87991 83019 60407 43350 42871 52248 55803 50130
9255E0130j665N856j001J6082P884l891j215l17o642k8240R87K1198M034L361
$$ 50130 48465 54321 53320 69402 77286 73395 72180 71863 65221 36981 37968 59166 63200 66561
9241F6561k258J0507J1006j62n002k81N3j2437j4963p391o302M813K56l557K534
$$ 66561 64303 74810 85816 85654 80652 80371 80424 67987 53024 45633 39331 44144 44400 40843 43377
9226D3377Q744N574J3103J9268J6570o45k027r583R730J6493k274K883P336L054
$$ 43377 52121 57695 70798 90066 106636 105991 103964 94381 104111 120604 118330 121213 128549 131603
9212A31603O552R6j0392n922L762p055M188J4949p868N559J2816n78R811K1161
$$ 131603 138155 138251 127859 121937 125699 118644 122832 137781 129913 135472 148288 147710 157521 178682
9198A78682L946k999N40L3844M7948K8398O449J5916N2012N2833O8946P7424Q6545
$$ 178682 182628 179629 180169 214013 261961 290359 296808 312724 364736 417569 486515 563939 650484
9185F50484R0196J30109J67496J89006K34794L19229L70854L80021L53360K75987
$$ 650484 740680 870789 1038285 1227291 1462085 1781314 2152168 2532189 2885549 3161536
9175C161536J19658q3414k44622l32881l70144l29205k97483k59354k15634j67838
$$ 3161536 3281194 3197780 2953158 2620277 2250133 1920928 1623445 1364091 1148457 980619
9165I80619j37444j13411q0251n2577p0157o2043m5403m9931l1629j9944j2950
$$ 980619 843175 729764 649513 596936 526779 464736 419333 369402 337773 317829 304879
9154C04879j0997k7085k8851k756q30j3550j5288k9873M636P884j3676j5795k460
$$ 304879 293882 266797 237946 235190 234360 220810 205522 175649 180285 188169 174493 158698 156238
9141A56238P702n44p055l879j6224p334l636m761J0757P946N275P472K5723K7840
$$ 156238 163940 163396 156341 152462 136238 128904 125268 120507 131264 139210 144485 151957 177680 205520
9127B05520J2930J7464L5272M2415M8880N3254Q1317J03750J19936J34341J60627
$$ 205520 218450 235914 271186 313601 362481 415735 497052 600802 720738 855079 1015706
9116A015706J71600J80572J27311O3794P499p3586j42624j72811j75891j49740
$$ 1015706 1187306 1367878 1495189 1558983 1566482 1492896 1350272 1177461 1001570 851830
9106H51830j19734j17839r4636q4000o2992n8388l4634k1471l6255k4798j4357
$$ 851830 732096 614257 519621 435621 372629 314241 279607 258136 221881 197083 182726
9095A82726j8504j1695j1144j8597j9838M343q50m597r527q499j5120J8317P794
$$ 182726 164222 152527 141383 122786 102948 107291 106441 101844 92317 83818 68698 87015 94809
9082I4809j2501j7134R359o675j0844J550R087J6522j184N622K1649R360k214
$$ 94809 82308 65174 74533 67858 57014 58564 67651 84173 82989 88611 110260 119620 117406
9069A17406j3048j6902k3326J0966J6189k038j8412l493L334K743p026p297q729
$$ 117406 104358 87456 64130 75096 91285 89247 70835 67342 70676 73419 66393 59096 50367
9056E0367K558J4628J0664O912k236P359m484j5575j1253R135J395j019O944n392
$$ 50367 52925 67553 78217 85129 82893 90252 85768 70193 58940 68075 69470 68451 75395 70003
9042G0003n286p284j4927L340J7582n993m982j64j8743m756J0389K546p577l863
$$ 70003 64717 57433 42506 45846 63428 57435 52453 52289 33546 28790 39179 41725 34148 30285
9028C0285M637J2397n549n97J5219J057N715J909M875l966K998K597L390L467
$$ 30285 34922 47319 41770 41173 56392 57449 63164 65073 69948 65982 68980 71577 74967 78434
9014G8434R584L548m629j4870M97O937R701j6506k1054j656q84p520k196O647
$$ 78434 88018 91566 86937 72067 72564 79501 89202 72696 51642 49986 49102 41582 39386 46033
9000D6033p959J5634R73M616q595q320m08p318j6806m673K0124K1940O564R104
$$ 46033 38074 53708 54681 59297 50702 42382 41974 34656 17850 13177 33301 55241 61805 70909
8986G0909j24M625N980J1908J2079j0976j1047J5004M700q722M024J9638K5179
$$ 70909 70785 75410 81390 93298 105377 94401 83354 98358 103058 94336 98360 117998 143177
8973A43177L3707L2436M7621N5537O0525J6554N981l3274p3485n7771k7342k8831
$$ 143177 176884 209320 256941 312478 373003 389557 395538 362264 288779 231008 203666 174835
8961A74835l778J0650j1527k3482j8446k3103o250j6515L75p123P571k442r342
$$ 174835 171057 181707 170180 146698 128252 105149 98899 82384 82759 75636 83207 80765 71423
8948G1423n314m863p287k1007j110j5054k5075J5600J6338l453k933o543Q919
$$ 71423 66109 61246 53959 32952 31842 16788 -8287 7313 23651 20198 17265 10722 19641
8935A9641J0713J6727J7245Q857j984k336m545j2190o504j4617l860Q037Q903
$$ 19641 30354 47081 64326 73183 71199 68863 64318 52128 45624 31007 27147 35184 44087
8922D4087Q267p896J5084L5911O169p597K108N915M25j9339k0057j2565K004Q764
$$ 44087 52354 44458 59542 95453 101622 94025 96133 102048 102473 83134 63077 50512 52516 61280
8908F1280K0175k254o928m297j51k6168k4512j7888K743M444J1552Q765k74P523
$$ 61280 81455 79201 72273 67976 67825 41657 17145 -743 2000 6444 17996 26761 26487 34010
8894C4010r33J6179K2297J6100J3107P417j3868n061k01r187j6369j3205q686
$$ 34010 33077 49256 71553 87653 100760 108177 94309 89248 89047 79860 63491 50286 41600
8881D1600j2656J9257J7996Q033J6095m810K815k215j3766j8078j8048j5675j7139
$$ 41600 28944 48201 66197 74230 90325 85515 88330 86115 72349 54271 36223 20548 3409
8868C409k860J8179L299l716J4124K0981j0506r702R015n988J543o194O704K2942
$$ 3409 549 18728 22027 18311 32435 53416 42910 33208 42223 36235 37778 31584 38288 61230
8854F1230J8232J7100J0298r229M073J1348K0547M2077O8789J24500J71618J90198
$$ 61230 79462 96562 106860 97631 101704 113052 133599 175676 244465 368965 540583 730781
8842G30781J95793J27339N292j22769j70601j50319r6460q3847o3242r550J2428
$$ 730781 926574 1053913 1059205 936436 765835 615516 519056 435209 371967 362417 374845
8831C74845M49j3426k2273r575n9j6610j8385j3762n00j510J546J8403K362j1141
$$ 374845 375294 361868 339595 330020 329961 313351 294966 281204 280704 279194 280740 299143 301505 290364
8817B90364l895K450n789j5656N581o67J8632J6042J5186p969p075L394N132q268
$$ 290364 286469 288919 283130 267474 273055 272388 291020 307062 322248 314279 307204 310598 315730 307462
8803C07462Q138L4284K7581J8111K1698K1226K9411K1167J7571L3586L7285K0499
$$ 307462 315600 349884 377465 395576 417274 438500 467911 489078 506649 540235 577520 598019
8791E98019K4516J8358l302J1837L0334K0520J9238K2180P54L232J3615L673m152
$$ 598019 622535 640893 637591 649428 679762 700282 719520 741700 742454 745686 759301 762974 758822
8778G58822K3869L1908N0294O4393M7902L7656K6065L3658M1793M7712N1866N4956
$$ 758822 782691 814599 864893 929286 977188 1014844 1040909 1074567 1116360 1164072 1215938 1270894
8766A270894K9536O53J7994L7252K6039J5355M2466O8266O0290R0516J13666J23595
$$ 1270894 1300430 1301083 1319077 1356329 1382368 1397723 1440189 1508455 1568745 1659261 1772927 1896522
8754A896522J25059J37180J40542J45528J61683J54013J64359J90442K08675K40656
$$ 1896522 2021581 2158761 2299303 2444831 2606514 2760527 2924886 3115328 3324003 3564659
8744C564659K80989L21502L84025M41105M91332N06711N35569O23388P26794Q46139
$$ 3564659 3845648 4167150 4551175 4992280 5483612 5990323 6525892 7149280 7876074 8722213
8734H722213J028049J300258J612973J989509K445795K984337L524052L932438
$$ 8722213 9750262 11050520 12663493 14653002 17098797 20083134 23607186 27539624
8726B7539624M299106M866962O101115Q467358J2476096J8810216K8600644M3652388
$$ 27539624 31838730 36705692 42806807 51274165 63750261 82560477 111161121 154813509
8718A54813509O4867263Q6811254Q8990520M7496718k2641249p4795060q6568490
$$ 154813509 219680772 306492026 395482546 442979264 420338015 345542955 258974465
8711B58974465p0947402m9597390l2934863k2073121j5324545j0986057q100660
$$ 258974465 188027063 138429673 105494810 83421689 68097144 57111087 49010427
8704D9010427o219222n008594m163989l618135l353089l178600k905527k526494
$$ 49010427 42791205 37782611 33618622 30000487 26647398 23468798 20563271 18036777
8696A8036777k136426j801522j525240j288047j086479r34019q00005o63356n98022
$$ 18036777 15900351 14098829 12573589 11285542 10199063 9265044 8465039 7801683 7203661
8687G203661n44785m91143m29381m27063l89933l33127l12715k81759k29222k15036
$$ 7203661 6658876 6167733 5738352 5311289 4921356 4588229 4275514 3993755 3764533 3549497
8677C549497j79969j55671j64207j39763j27930j27817j23698j05504j09082j30969
$$ 3549497 3369528 3213857 3049650 2909887 2781957 2654140 2530442 2424938 2315856 2184887
8667B184887j28000j08861r2603j12293r7589p2381n5191n4318o0640n7391o1645
$$ 2184887 2056887 1948026 1855423 1743130 1645541 1573160 1517969 1463651 1403011 1345620 1283975
8656A283975m5060k9645l1085k5897j6053l6599m5381l5165m3049m9679n6570
$$ 1283975 1238915 1209270 1178185 1152288 1136235 1099636 1054255 1019090 976041 926362 869792
8645H69792l9644k2813r67j1033j9550j9216j3498j5043j5389k7087j4155Q228
$$ 869792 830148 807335 806368 795335 775785 756569 743071 728028 712639 685552 671397 679625
8633F79625k418j9534n877j0390P069K675K490O683j4737k8069j6546j644J1656
$$ 679625 677207 657673 651796 641406 648475 651150 653640 660323 645586 617517 600971 599327 610983
8620F10983J6580K5216L2441N1034P944o8602p7751n2398l5867k4005q113m398
$$ 610983 627563 652779 685220 736254 744198 675596 597845 545447 509580 485575 477462 473064
8608D73064k563q905n372k9695j8359j3788j8751j9491j2837j0365j5849j6204
$$ 473064 470501 461596 456224 426529 408170 394382 375631 356140 343303 332938 317089 300885
8596C00885k80l672j8309n645l7633o3653n6952k3639P4306J22455J04217N3715
$$ 300885 300605 296933 278624 272979 235346 171693 114741 91102 165408 287863 392080 445795
8584D45795J3077L2768J2242k325p435K2442M1757M7352J19948K61469M21357
$$ 445795 458872 491640 503882 501557 494122 516564 558321 605673 725621 987090 1408447
8573A408447M59307J54201k93901m40374l56192k12616j18530o5318j7980j7167
$$ 1408447 1867754 2021955 1728054 1287680 931488 718872 600342 535024 517044 499877
8563D99877l8434m4726j9596o207l1419l6326k9845j7147j5417k996J0491P496
$$ 499877 461443 416717 397121 390914 359495 323169 293324 276177 260760 257764 268255 275751
8551B75751p227j0376J8827K6040J7687j959j2082j0224k603l37j2624k6434k8462
$$ 275751 268524 258148 276975 303015 320702 318743 306661 296437 293834 293497 280873 254439 225977
8538B25977j4615o592K213R763K6848K2576J2844l676r626O080k806j4206n022
$$ 225977 211362 204770 206983 216746 243594 266170 279014 275338 265712 271792 268986 254780 249758
8525B49758r025k3184j1960j6631r240J463L982j3348j4659j4552q428p1n416
$$ 249758 240733 217549 205589 188958 179718 181181 185163 171815 157156 142604 134176 134105 128689
8512A28689P068M341L2428O156j3697q878O200P679r921j7169j1730J0491K1434
$$ 128689 135757 140098 172526 178682 164985 156107 162307 169986 160065 142896 131166 141657 163091
8499A63091K2245J987K8520J8880J3772j7913r457j6568r217J541K392k3946o574
$$ 163091 185336 187323 215843 234723 248495 230582 221125 204557 195340 196881 199273 175327 168753
8486A68753q982k4829K130L415j3015j7429l70j921j0938R002J5112J5634Q970
$$ 168753 159771 134942 137072 140487 127472 110043 109673 107752 96814 105816 120928 136562 145532
8473A45532q577n12k4413k0606K150Q415J8596J7036R75m03j321P195O427J1606
$$ 145532 136955 136443 112030 91424 93574 101989 120585 137621 138596 138193 136872 144067 150494 162100
8459A62100j1734k3886j4676O250O891N347J031J256j911l032l52J5611J3975
$$ 162100 150366 126480 111804 118054 124945 130292 131323 132579 130668 127636 127284 142895 156870
8446A56870j0710o343R66j1003n652j1943j210J2067M183l488j9298m391K853
$$ 156870 146160 139817 140783 129780 124128 112185 110975 123042 127225 123737 104439 100048 102901
8433A02901l145r589j398n017O222q36K316k279o850N40J4177p436P63L831j3195
$$ 102901 99756 90167 88769 83752 89974 89138 91454 89175 82325 82865 97042 89606 90369 94200 81005
8418H1005m399n164K44Q430L205N963n08N557k326r106k2855O130J3888j820j573
$$ 81005 76606 71442 71686 80116 83321 89284 88776 94333 92007 82901 60046 66176 80064 78244 76671
8403G6671P900k713r489j5605j6260k23K2157J4502r012J708N912N058R778j8335
$$ 76671 84571 81858 72369 56764 40504 40281 62438 76940 67928 69636 75548 80606 90384 72049
8389G2049j4560K867N764q731j3343o65K1707k704j9019j514k251N759K931j0079
$$ 72049 57489 60356 66120 57389 44046 43381 65088 62384 43365 41851 39600 45359 48290 38211
8375C8211J7477J3262R527j256j1117p03r050R530J955o199n964J565l142m868
$$ 38211 55688 68950 78477 77221 66104 65401 56351 65881 67836 61637 55673 57238 54096 49228
8361D9228M2J6798k778k473M663m372j7078l61R165J0157N266J4510N762l908
$$ 49228 49270 66068 63290 60817 65480 61108 44030 43669 52834 62991 68257 82767 88529 84621
8347H4621M611j879o218m363k769J1137K229Q523K345J61q711j0329J989P497
$$ 84621 89232 87353 81135 76772 74003 85140 87369 95892 98237 98398 89687 79358 81347 88844
8333H8844J513l921O061Q087L589K8235L0306J8037L1626K9179K9100M7510N3201
$$ 88844 90357 86436 92497 100584 104173 132408 162714 180751 212377 241556 270656 318166 371367
8320C71367N7875R7870J22075J36801J67157J84190J77055J33265Q1955K1895
$$ 371367 429242 527112 649187 785988 953145 1137335 1314390 1447655 1529610 1551505
8310A551505m3472r9382j58143j81335j71463j58210j22810j02813q3417p2053
$$ 1551505 1508033 1408651 1250508 1069173 897710 739500 616690 513877 430460 358407
8300C58407m5174k6288k3367l1922k0598k6466k5209k0802k909J475k155p885
$$ 358407 313233 286945 263578 231656 211058 184592 159383 138581 135672 137147 134992 127107
8288A27107l645P705j4480m461k9157j1838r167L800J2776j2264P527L056j1323
$$ 127107 123462 131167 116687 112226 83069 71231 62064 65864 78640 66376 73903 76959 65636
8275F5636K559q339q744l598J0842m932M030m079N22N248l218N232J2478j6657
$$ 65636 68195 59856 51112 47514 58356 53424 57454 53375 53897 59145 55927 61159 73637 56980
8261E6980j7898Q395K1323K710q733J6649J704k466L589j0462J237J935q60j2400
$$ 56980 39082 47477 68800 71510 62777 79426 81130 78664 82253 71791 73028 74963 74103 61703
8247F1703J8596Q91j0348j0452o529q025P139r454q471K394p059k64n578j291
$$ 61703 80299 81190 70842 60390 53861 45836 52975 43521 35050 37444 30385 30121 24543 23252
8233B3252p285M361L971p979R994J4489L154l533O14M668J1834K10j0357o343
$$ 23252 15967 20328 24299 16320 26314 40803 43957 40424 41038 45706 57540 57750 47393 41050
8219D1050o739p828O272O84j0208l959j2547n178J6521K6663P167J4154n571j0688
$$ 41050 34311 26483 32755 33439 23231 19272 6725 1547 18068 44731 51898 66052 60481 49793
8205D9793P064l781m456r015P792P083j482J3974k2894r097o871l233k93Q989
$$ 49793 56857 53076 48620 39605 47397 54480 52998 66972 44078 34981 28110 24877 24584 33573
8191C3573O25j0738o601J3112K4265J881k1855j0641J0081L947k1110n792J5313
$$ 33573 34198 23460 16859 29971 54236 56117 34262 23621 33702 37649 16539 10747 26060
8178B6060J9612J2515r674q690O320K843j0294N11O520p278j0727j5171j4620
$$ 26060 45672 58187 48513 39823 46143 48986 38692 39203 45723 38445 27718 12547 -2073
8165b073Q43J3524J1620Q824J2888p331j4035L036M728o424K436Q948n238K774
$$ -2073 -1230 12294 23914 32738 45626 38295 24260 27296 32024 25600 28036 36984 31746 34520
8151C4520n577Q209M955j320N9R57l848n957q021j1625j0630Q673R326P51J926
$$ 34520 28943 37152 42107 40787 40846 41803 37955 31998 23977 12352 1722 10395 19721 20472 22398
8136B2398N286K0251Q265o730j4236L505p807j1115J5111j0209n673j507q344
$$ 22398 27684 47935 56200 49470 35234 38739 30932 19817 34928 24719 19046 17539 9195
8123I195L54j760N571K232M437J9112P915J746j9707l184Q702j0908j1701k404
$$ 9195 9549 7789 13360 15592 20029 39141 47056 48802 29095 25911 34613 23705 12004 9600
8109I600L971L552j944P08m49J4578N679J688k876l637n572j4316m785Q443J4679
$$ 9600 13571 17123 15179 15887 15438 30016 35695 37383 34507 30870 25298 10982 6197 14640 29319
8094B9319k025R706n96J1516j1894o723P852n463j741P787J5778P327m535j0388
$$ 29319 27294 37000 36404 47920 36026 29303 37155 31692 29951 37738 53516 60843 56308 45920
8080D5920K205p477r827l845J1270m373N431j063L417r429L375m987K26l617p526
$$ 45920 48125 40648 30821 26976 38246 33873 39304 38241 41658 32229 35604 30617 30843 27226 19700
8065A9700l759k309L727Q90P627k298l384J571R883l360l574j892M975j6860M001
$$ 19700 15941 13632 17359 18249 25876 23578 20194 21765 31648 28288 24714 22822 27797 10937 14938
8050A4938J15k190k426l194K1639N081j841q143n891n93J0476Q696L996m761m952
$$ 14938 15053 12863 10437 7243 28882 33963 32122 23979 18088 17495 27971 36667 40663 35902 30950
8035C0950m350R147J6240j220j2767m346J1851M544j5776p401j0007M353l431
$$ 30950 26600 35747 51987 50767 38000 33654 45505 50049 34273 26872 16865 21218 17787
8022A7787J0841k475j51J0844j451q256r237q978J127l053J0049O699p941J1651
$$ 17787 28628 26153 26002 36846 35395 27139 17902 8924 10051 6998 17047 23746 15805 27456
8008B7456J3539n707o137J813K865m135Q39J11j722l910Q16j168j7265P568K207
$$ 27456 40995 35288 29151 30964 33829 29694 30533 30644 28922 25012 25828 24660 7395 14963 17170
7993A7170N32N898N176J3334K931j6146o185P727n527j4586N233n181o428j2428
$$ 17170 17702 23600 28776 42110 45041 28895 22710 30437 24910 10324 15557 10376 3948 -8480
7979h480O179J8568M178J5734m27k058l937n627L095P551J564j4234j2484j0959
$$ -8480 -2301 16267 20445 36179 35752 33694 29757 24130 27225 34776 36340 22106 9622 -1337
7965a337L814R306K3900L266r215j1932L988j8003j0034Q331J6638R653j001L286
$$ -1337 2477 11783 35683 38949 29734 17802 21790 3787 -6247 2084 18722 28375 27374 30660
7951C0660k071r834p085Q475L395n813M756j113p943N67J989J5277O178j628m574
$$ 30660 28589 18755 11670 20145 23540 17727 22483 21370 13427 13994 15983 31260 37438 35810 31236
7936C1236j548k674J916j1688q483J1921O878J891O509l151O702j3113j3484j859
$$ 31236 29688 27014 28930 17242 8759 20680 27558 29449 35958 32807 39509 26396 12912 11053
7922A1053N18J2009L496l597k3631j5616R645O954j1919q688J5104K1650Q013
$$ 11053 11571 23580 27076 23479 -152 -15768 -6123 831 -11088 -19776 -4672 16978 24991
7909B4991m024q865L350J6543k082j6756M448n125K404P024L671j4703j1635m31
$$ 24991 20967 12102 15452 31995 29913 13157 17605 12480 14884 21908 25579 10876 -759 -1190
7895a190R242l120n281r350J600j121o52J0024Q377J5159N193J881j3232j2689
$$ -1190 8052 4932 -349 -9699 -8099 -9220 -9872 152 8529 23688 28881 30762 17530 4841
7881D841J1873J2450O75l634O154K973k0832j5369P309K1967J0913r425J896O091
$$ 4841 16714 29164 29839 26205 32359 35332 14500 -869 6440 28407 39320 29895 31791 37882
7867C7882j626k802k517l768j2753J6471K965o061r67J0258l632K10j9050j2887
$$ 37882 36256 33454 30937 27169 14416 30887 33852 27791 26824 37082 33450 33660 14610 1723
7853A723k243O833o388N470P921q526P21P886o251j502L755M878n566n498R291
$$ 1723 -520 6313 -75 5395 13316 4790 5511 13397 7146 5644 9399 14277 8711 3213 12504
7838A2504q856m581J048J2225k337o450k06K1554K829j4698j3105j069j520j1501
$$ 12504 3648 -933 115 12340 10003 3553 3347 24901 27730 13032 -73 -1142 -2662 -14163
7824a4163P352Q425o189k305K330N141J0059N309k48j0294Q098J7653L7j4165
$$ -14163 -6811 1614 -4575 -6880 -4550 591 10650 15959 15711 5417 13515 31168 31205 17040
7810A7040o26M841j1676k1966J9734K2626J139j8m717j9964m672P132O288k2008
$$ 17040 16414 21255 9579 -12387 7347 29973 31112 31094 26377 6413 1741 8873 15161 -6847
7796f847k144Q31m22n949N538J1289P687j1918O763L945r517Q590K133L624k327
$$ -6847 -8991 -8160 -8582 -14531 -8993 2296 9983 -1935 4828 8773 -744 7846 9979 13603 11276
7781A1276j0394L216J2173l180R21L474K066j1687r480J6515M676J084O293K594
$$ 11276 882 4098 16271 13091 14012 17486 19552 7865 -1615 14900 19576 20660 26953 29547
7767B9547j2429j2812J2142R658p582j0981R710j099q13M06J0146J6382n50k2722
$$ 29547 17118 4306 16448 26106 18524 7543 17253 16154 15341 15747 25893 42275 41725 19003
7753A9003j2988l579R337K5717m929j6613k032J963n880j3761j170L458k960l051
$$ 19003 6015 2436 11773 37490 32561 15948 13916 15879 9999 -3762 -4932 -1474 -4434 -7485
7739g485j3629k528R017J2532L703R23k83l54N112O314j3583j3411q283M402n173
$$ -7485 -21114 -23642 -14625 -2093 1610 2533 2250 1896 7008 13322 -261 -13672 -21955 -17553 -22726
7724b2726p498O275J5545m490o645k168K828l315L706Q568N492L952k320k022
$$ -22726 -30224 -23949 -8404 -12894 -19539 -21707 -18879 -22194 -18488 -9920 -4428 -476 -2796 -4818
7710d818k558l005q646R839J0746P664k489q856p091J6398Q546m026k100J0143
$$ -4818 -7376 -10381 -19027 -9188 1558 9222 6733 -2123 -9214 7184 15730 11704 9604 19747
7696A9747R811j788p757j4776J39q18j8056O716J3880P907l511P00N02M375j8491
$$ 19747 29558 27770 20013 5237 5376 4558 -13498 -6782 7098 15005 11494 12194 12696 17071 -1420
7681a420k119K240j977j053K66l834o096l75J7834J1487J7035O426j9554M042
$$ -1420 -3539 -1299 -3276 -4329 -4063 -7897 -13993 -14368 3466 14953 31988 38414 18860 22902
7667B2902R441j4147j6483r167j977R688O640n891J4275M086o370k102n540Q502
$$ 22902 32343 18196 1713 -7454 -9431 257 6897 1006 15281 19367 12997 10895 5355 13857
7653A3857m373R059P712j0574O738rL739q649l345M238j824p024L229l502N41
$$ 13857 9484 18543 26255 15681 22419 22410 26149 17500 14155 18393 16569 9545 12774 9272 9813
7638I813m90J392J425o12o030l748l086m297O354L198K152J3105J855k810j0347
$$ 9813 9323 10715 12140 11528 5498 1750 -1336 -5633 721 3919 6071 19176 21031 18221 7874
7623G874j5419K19n791k266m921J2415K1008M379P565r334O792p598j4451M588
$$ 7874 -7545 -7326 -13117 -15383 -20304 -7889 13119 17498 25063 15729 22521 14923 472 5060
7609E060J5550L436j2111j4064k748J0637m184j582R466j187k526j7855j4122
$$ 5060 20610 24046 11935 -2129 -4877 5760 1576 -6 9460 8273 5747 -12108 -26230
7596b6230j517j744J0311J0293J0957K438K434J2134k735l6212j1645N534R804
$$ -26230 -27747 -29491 -19180 -8887 2070 4508 6942 19076 16341 -19871 -31516 -25982 -16178
7583a6178J9062O611o57j6564j7459j022N321r321l095J256j397J3006M319N326
$$ -16178 2884 9495 8838 -7726 -25185 -26207 -20886 -30207 -33302 -32046 -33443 -20437 -16118 -10792
7569a0792J6365K0265K385j3445p552o549n497Q769n46j1138l152P048J9698J8654
$$ -10792 5573 25838 28223 14778 7226 677 -4820 3949 3403 -7735 -10887 -3839 15859 34513
7555C4513n303r549q976j0833q338p458N886K94P590j518j0335q717K423J9186
$$ 34513 29210 19661 10685 -148 -8486 -15944 -10058 -9764 -2174 -3692 -14027 -22744 -20321 -1135
7541a135K0432r661j9315J0573K232O806J5584P053n145p643J58K398P047o812
$$ -1135 19297 9636 -9679 894 3126 9932 25516 32569 27424 19781 19939 22337 29384 22572
7527B2572J68P360R228j4365k4724j0801J2400J061Q634J395R655r115k0121p295
$$ 22572 22740 30100 39328 24963 239 -10562 1838 2899 11533 12928 22583 13468 -6653 -13948
7513a3948M338j577O721P124p111J636n425l077J2718m342j876K47N960K793l008
$$ -13948 -9610 -11187 -4466 2658 -4453 -2817 -8242 -11319 1399 -2943 -4819 -4572 1388 4181 1173
7498A173n047j173n667m875R176n614L556K073p827L153J3937r141L153K166J316
$$ 1173 -3874 -5047 -10714 -15589 -6413 -12027 -8471 -6398 -14225 -11072 2865 -6276 -3123 -957 359
7483C59L314o914K24M0n256J2721l125k221N301J2683j065n874O86L652N54k158
$$ 359 3673 -3241 -3017 -2977 -8233 4488 1363 -858 4443 17126 16061 10187 10873 14525 15079 12921
7467A2921j5492k784P837m412K832m441J564M128O13l201K076J541j400J3386
$$ 12921 -2571 -5355 2482 -1930 902 -3539 -1975 2153 2766 -435 1641 3182 1782 15168
7453A5168J4177j2994j0528P846l175k1026K208J2144j3369N32j3649l596O589
$$ 15168 29345 16351 5823 13669 10494 -10532 -8324 3820 -9549 -9017 -22666 -26262 -19673
7440a9673J961N171O719m76J2313k856k2805K828K4689R789j455N401j2406j2593
$$ -19673 -17712 -12541 -5822 -6298 6015 3159 -19646 -16818 7871 17660 16205 21606 9200 -3393
7426c393q455j3449m724J4107O950J5342M917n056J1609n217J5218J7151o24k5914
$$ -3393 -11848 -25297 -30021 -15914 -8964 6378 11295 6239 17848 12631 27849 45000 44376 18462
7412A8462r305L04L900p650n162m980M71P076J366q64j8294J627P131J0246N538
$$ 18462 9157 9461 13361 5711 549 -4431 -3960 3116 4482 3618 -14676 -13049 -5918 4328 9866
7397I866o916K510J4559J0948l426j3123j0371j396j667j1079m225P284J5275
$$ 9866 2950 5460 20019 30967 27541 14418 4047 2651 984 -10095 -14320 -7036 8239
7384H239k07l402k0873r996J7483J8517l304l445j269J471J431Q465j211q846
$$ 8239 8032 4630 -16243 -26239 -8756 9761 6457 3012 1743 3214 4645 13110 11899 3053
7370C053L412O364j7067j057J5744J1479m33l527j539j7560p717N072M076r104
$$ 3053 6465 12829 -4238 -5295 10449 21928 21495 17968 16429 -1131 -8848 -3776 300 -8804
7356h804N570O098R547n996q61m006P272J960k558L552m292O875k028O670p041
$$ -8804 -3234 2864 12411 6415 5554 1548 8820 10780 8222 11774 7482 14357 12329 18999 11958
7341A1958K519Q753j834j5203j247n892qJ014R29P990J8237J855j1537q072Q599
$$ 11958 14477 23230 21396 6193 4946 -946 -954 60 989 8979 27216 29071 17534 9462 18061
7326A8061R85m203L192P369o817j9108j367J3966k137j0498Q663Q239L018O265
$$ 18061 19046 14843 18035 25404 18587 -521 -1888 12078 9941 -557 8106 16345 19363 25628
7312B5628j6058j4264Q086R73r983O4L541Q686p852O576J1131k5767l373K0362
$$ 25628 9570 -4694 3392 4365 -5618 -5554 -2013 6673 -1179 5397 16528 -9239 -12612 7750
7298G750p92r963O582M916L854m258k064J0825m61r751j0701N021R159K452N142
$$ 7750 6958 -3005 3577 8493 12347 8089 6025 16850 16389 6638 -4063 958 10117 12569 17711
7283A7711J495j3545p847J3095N719j0273P683q466l938J5409p969j1105j0586
$$ 17711 19206 5661 -2186 10909 16628 6355 14038 5572 1634 17043 9074 -2031 -12617
7270a2617l804M945L079m394M792l946q892M106M369N045P507R46M941J0988r684
$$ -12617 -16421 -11476 -8397 -12791 -7999 -11945 -20837 -16731 -12362 -7317 190 1136 6077 17065 7381
7255G381j2271K225J212j901Q665q469L185p869j1895j30J774N01R990j8870j33
$$ 7381 -4890 -2665 -1453 -3354 5311 -3158 27 -7842 -19737 -19867 -18093 -17592 -7602 -26472 -26605
7240b6605R595O877P697J0790j971k927Q89J995o239M07M782N590N009p57l815
$$ -26605 -17010 -10133 -2436 8354 6383 3456 4345 6340 101 508 5290 10880 15889 15132 11317
7225A1317m618j7507j5725l058J1431J4078Q861j5082L047n273P9J3522J0572
$$ 11317 6699 -10808 -26533 -29591 -18160 -4082 4779 -10303 -7256 -12529 -12450 1072 11644
7212A1644K571j965m307R560J084Q010m661j7305Q248J0007M393o280j0742p888
$$ 11644 14215 12250 7943 17503 18587 26597 21936 4631 12879 22886 27279 20999 10257 2369
7198B369p397j5932P483R856M94K4689O003j2514k578j6629p976R66M283Q462
$$ 2369 -5028 -20960 -13477 -3621 -3127 21562 27565 15051 12473 -4156 -12132 -11166 -6883 1579
7184A579K754O48P80R720j876J594O312K210l561k2504N192P635m834M514q814
$$ 1579 4333 4981 5761 15481 13605 15199 21511 23721 20160 -2344 2848 10483 5649 10163 1349
7169A349R115p560r976l784J0609J3j1932l933j88m122K745M778m299J813J4890
$$ 1349 10464 2904 -7072 -10856 -247 -234 -12166 -16099 -16287 -20409 -17664 -12886 -17185 -15372 -482
7154d82j126P48J0768j114q788R842j1175m809k05r88M001o129j0381o31K95q929
$$ -482 -1608 -860 9908 8794 6 9848 -1327 -6136 -6341 -7329 -3328 -9457 -19838 -20469 -20174 -29103
7138b9103o092K5569K3684P33j3953L33j147J0047k946n103j1273J155k1859J5787
$$ -29103 -35195 -9626 14058 14791 838 1171 24 10071 7125 2022 -9251 -8096 -29955 -14168
7124a4168K1080r862N612K52p382j0007m587O898J2133J0856m518m547Q487R81
$$ -14168 6912 -2950 2662 2914 -4468 -14475 -19062 -12164 -31 10825 6307 1760 10247 11228
7110A1228q560k679P43n369n259J0254K160l28R573L152O993r349j4056O071Q165
$$ 11228 2668 -11 732 -4637 -9896 358 2518 2190 11763 14915 21908 12559 -1497 4574 12739
7095A2739r61n875p339J600m13m086R357J001p408j787l427M766R402k286R823
$$ 12739 11778 5903 -1436 164 -249 -4335 5022 6023 -1385 -3172 -6599 -1833 7569 5283 15106
7080A5106O610j4123j4827q396J8121M511k794r275k294j314P241J7355k245K03
$$ 15106 21716 7593 -7234 -15630 2491 7002 4208 -5067 -7361 -8675 -1434 15921 13676 13879
7066A3879Q660N996K194Q003M063j2441k0048m65N543j0011O074L979j729j512
$$ 13879 22539 28535 30729 38732 42795 30354 10306 9841 15384 5373 11447 15426 13697 12185
7052A2185P73r690o870J130J0056M726O661R445n191ol070j153m95n022R261L082
$$ 12185 12958 3268 -3602 -2472 7584 12310 18971 28416 23225 23219 20149 18996 18501 13479 22740 25822
7036B5822K036M81j8019j744J1631Q52o249o798j6447J73Q630j2581k985Q216
$$ 25822 27858 28339 10320 8576 20207 21059 14810 8012 -8435 -8262 368 -12213 -15198 -6982
7022f982Q02k805J124r972M76Q308J5705L913J766K119l14n206m915O551j239
$$ -6982 -6180 -8985 -7861 -17833 -17357 -9049 6656 10569 12335 14454 14140 8934 4019 10570 9331
7007I331j064j462j1710L206N892K631k661n921R135Q283N797K916q917o57j911
$$ 9331 8267 6805 -4905 -1699 4193 6824 4163 -1758 7377 15660 21457 24373 15456 14799 12888
6992A2888o221J0043J066j6702q569k94J4259o192n835n639q718J304J717M596
$$ 12888 6667 16710 17776 1074 -7495 -7789 6470 278 -5557 -11196 -19914 -18610 -16893 -12297
6978a2297J3156J1153M753O190l490n959j6194p746M923J2714R52R301N786j4504
$$ -12297 859 12012 16765 22955 19465 13506 -2688 -10434 -5511 7203 8155 17456 23242 8738
6964H738n038j437r671q210j1292J4701j012N455Q524k200j741J9158P185J384
$$ 8738 3700 2263 -7408 -15618 -26910 -12209 -13221 -7766 758 -1442 -3183 15975 23160 24544
6950B4544o282k036l959k244m15r530l681N841M284n258j362R346m931o672J8403
$$ 24544 18262 16226 12267 10023 9608 78 -3603 2238 6522 1264 -98 9248 4317 -2355 16048
6935A6048J802k075j0448q110K831n322R452J6826n454j3429o896k220L510o034
$$ 16048 17850 15775 5327 -2783 48 -5274 4178 21004 15550 2121 -4775 -6995 -3485 -9519
6921i519o417m575N96J3612m099L727J4847j7658j845J7422L346j1103l632k91
$$ -9519 -15936 -20511 -19915 -6303 -10402 -6675 8172 -9486 -11331 6091 9437 -1666 -5298 -5589
6907e589R112J873k0240l950K0324J8893L599k747j7051L799p591o906N888J2747
$$ -5589 3523 5396 -14844 -18794 1530 20423 24022 21275 4224 8023 432 -6474 -586 12161
6893A2161M702j729j0318q380o449j0317j2384n137J8986N180O420L228J195p733
$$ 12161 16863 15134 4816 -3564 -10013 -20330 -32714 -37851 -18865 -13685 -7265 -4037 -2842 -10575
6879a0575o461P899J2474L935L818j972o382M126L552o220j2071k1180R65Q957
$$ -10575 -17036 -9137 3337 7272 11090 9118 2736 6862 10414 4194 -7877 -29057 -28092 -19135
6865a9135J431O335q369L791J8799M488p616k592l843J531O231q302r768m7L03
$$ -19135 -17704 -11369 -19738 -15947 2852 7340 -276 -2868 -6711 -5180 1051 -7251 -17019 -17066 -16763
6850a6763J1482J0389r211M09J6751J6938k0947j7007J3482K723J0495K304j0237
$$ -16763 -5281 5108 -4103 -3694 13057 29995 9048 -7959 5523 8246 18741 21045 10808
6837A0808q084L650n286M117M604O480l646m595N35Q224M503Q963k0721l013J0713
$$ 10808 2724 6374 1088 5205 9809 16289 12643 8048 8583 16807 21310 30273 9552 6539 17252
6822A7252k952o620r804j93o240L957k036P31K3053m250j8068j0250j369J8246
$$ 17252 14300 7680 -2124 -2317 -8557 -4600 -6636 -5905 17148 12898 -5170 -15420 -16789 1457
6808A457J7125j3247n660J9500L347K843j0261j6970j4853n280R981J0035J7891
$$ 1457 18582 5335 -325 19175 22522 25365 15104 -1866 -16719 -21999 -12018 -1983 15908
6795A5908J176l606J118l898j507N277M901R903k4924j7415J299l828m319p254
$$ 15908 17084 13478 14596 10698 9191 14468 19369 29272 4348 -13067 -11768 -15596 -19915 -27169
6781b7169J069J0522O207N128k881j0797J0701j2390M225J921o63o552J701Q904
$$ -27169 -26100 -15578 -9371 -4243 -7124 -17921 -7220 -19610 -15385 -13464 -14127 -20679 -18978 -10074
6767a0074J8857J0734o355j987L614M47k5038j4721O000J8070l159j0545K0576
$$ -10074 8783 19517 13162 11175 14789 15236 -9802 -24523 -18523 -453 -3612 -14157 6419
6754F419M899q92L374j3147J485N873l935q702j7957r641J4461O47m598Q99Q216
$$ 6419 11318 10426 13800 653 2138 8011 4076 -4626 -22583 -32224 -17763 -17116 -21714 -20815 -12599
6739a2599M249q665J8856P562P539p996R45K894n099J181J897L793m785j2001
$$ -12599 -8350 -17015 1841 9403 16942 8946 9891 12785 7686 8867 10764 14557 9772 -2229
6725b229J4744J6804M372M951j7337J3184K3976K2193J4428L086o223j1981k6976
$$ -2229 12515 29319 33691 38642 21305 34489 58465 80658 95086 98172 91949 79968 52992
6712E2992k4054j0239j1894Q004J0393q600r962m70P889n190j0208O7j0344j1835
$$ 52992 28938 18699 6805 14809 25202 16602 6640 6170 14059 8869 -1339 -1272 -11616 -23451
6698b3451N818R769O149P790l990L692r834n286o631P84N810R877M259k9q36P253
$$ -23451 -17633 -7864 -1715 6075 2085 5777 -4057 -9343 -15974 -15190 -9380 497 4756 4727 3891 11144
6682A1144J2821O3o787j3541o571n736Q53k795K356J9082O759J3290j3861r136
$$ 11144 23965 24028 17241 3700 -2871 -8607 -7754 -10549 -8193 10889 17648 30938 17077 7941
6668G941J047J1078j249j5656n490j2269o152K9764l788n197J1799K769J4726
$$ 7941 8988 20066 18817 3161 -2329 -14598 -20750 9014 5226 29 11828 14597 29323
6655B9323k0754j1962q310j767K1145K982p335j2492k745N020K018Q391j511q281
$$ 29323 8569 -3393 -11703 -13470 7675 10657 3322 -9170 -11915 -6895 -4877 3514 2003 -6278
6641f278L881L359K549m34M359J4502M479J834k042j0124j0248j7675o156j039
$$ -6278 -2397 962 3511 3077 7436 21938 26417 28251 26209 16085 5837 -11838 -17994 -19033
6627a9033k037N39J0617n310K875J0399p524M1J730l171K4529m552j8220J7665
$$ -19033 -21070 -20531 -9914 -15224 -12349 -1950 -9474 -9433 -7703 -10874 13655 9103 -9117 8548
6613H548K923p26o86l571q934n635L37J2037J907p128j3004j568P798J0834n807
$$ 8548 11471 10745 10059 6488 -2446 -8081 -7744 4293 6200 -928 -13932 -15500 -7702 3132 -2675
6598b675o556j256P606O024O783j4001k681J1493q276M830O518m933j0269j0769
$$ -2675 -9231 -10487 -2881 3143 9926 -4075 -6756 4737 -3539 1291 7809 2876 -7393 -18162
6584a8162J0146J859o539j198p075R242l205R890r268j298L628R307K2236j923
$$ -18162 -8016 -6157 -12696 -13894 -20969 -11727 -14932 -5042 -14310 -15608 -11980 -2673 19563 17640
6570A7640q013m048l903k322o524Q250j0558o892J1400J3107R261l508j8096J31
$$ 17640 9627 5579 1676 -646 -7170 1080 -9478 -16370 -4970 8137 17398 13890 -4206 -4075
6556d075o339P913P148P963J0068p001m912O435q462l511M237o676k7242J3193
$$ -4075 -10414 -2501 4647 12610 22678 15677 10765 17200 8738 5227 9464 2788 -24454 -11261
6542a1261O620K354K899P726J1712N954k898P383N601j4942r170j5749q513m366
$$ -11261 -4641 -2287 612 8338 20050 26004 23106 30489 36090 21148 11978 -3771 -12284 -16650
6528a6650J169J2752J4210j2317j6397J646j471P600K7478M495j2784q284j6401
$$ -16650 -15481 -2729 11481 -836 -17233 -15587 -17058 -9458 18020 22515 9731 1447 -14954
6515a4954j2317l257J250J4981L416o872J6084M992Q601L008o183q104l436p594
$$ -14954 -27271 -30528 -29278 -14297 -10881 -17753 -1669 3323 11924 14932 8749 645 -2791 -10385
6501a0385N961O885l601J0565J7779l943j8631n880r158L251o224l499M803J288
$$ -10385 -4424 2461 -1140 9425 27204 23261 4630 -1250 -10408 -7157 -13381 -16880 -12077 -10789
6487a0789p315j331K616J6653L238o29n699M939J9071l952r698m440j1198r577
$$ -10789 -18104 -19435 -16819 -166 3072 2443 -3256 1683 20754 16802 7104 2664 -8534 -18111
6473a8111J0109J3382J1357k2764Q547k064r497Q603k449j0124r064M909J1586
$$ -18111 -8002 5380 16737 -6027 2520 456 -9041 -438 -2887 -13011 -22075 -17166 -5580
6460e580K723J0187K5372l407n968j2215j9001j3097L221J3546M134P331P104
$$ -5580 -2857 7330 32702 29295 23327 11112 -7889 -20986 -17765 -4219 -85 7246 14350
6447A4350j282J737o106j1689l028M535J966n371j5066m351Q052l822p538J7818
$$ 14350 13068 14805 8699 -2990 -6018 -1483 483 -4888 -19954 -24305 -16253 -20075 -27613 -9795
6433i795l36r042K273J7601Q73o296M855m314q618J4069M414j030L047n804q986
$$ -9795 -10131 -19173 -16900 701 1574 -4722 133 -4181 -12799 1270 5684 4654 7701 1897 -7089
6418g089m804N50p96p820Q91l304Q176J052l999O093N473k379N701p67r016j0969
$$ -7089 -11893 -11343 -12139 -19959 -19068 -22372 -14196 -13144 -17143 -11050 -5577 -7956 -2255 -3022 -12038 -23007
6402b3007K281J0877J8848N813j5499j3303k45m801J4408j869m602K849J7336
$$ -23007 -20726 -9849 8999 14812 -687 -13990 -14235 -19036 -4628 -6497 -11099 -8250 9086
6389I086Q039l069k031p814q862K531q752j0170J3915K1940n69j0632j250O072
$$ 9086 17125 14056 12025 4211 -4651 -2120 -10872 -21042 -7127 14813 14244 3612 2362 8434
6375H434P679Q429j0896j4929j3964J359l424o358m609P638J4667J3111j539n741
$$ 8434 16113 24542 13646 -1283 -15247 -13888 -17312 -23670 -28279 -20641 -5974 7137 5598 -143
6361a43l348M08k872L762M503q101j835n059p191J344Q005m902J1144J7048p337
$$ -143 -3491 -3083 -5955 -2193 2310 -5791 -7626 -12685 -19876 -18532 -10527 -15429 -4285 12763 5426
6346E426M09j1892R924q532o898R826J5855K0504m073j6196j5409j6132Q533K552
$$ 5426 5835 -6057 3867 -4665 -11563 -1737 14118 34622 30549 14353 -1056 -17188 -8655 -6103
6332f103L125M916J100j384J1049k316j4841j035J0701K41L63J1136Q107m462
$$ -6103 -2978 1938 3038 1654 12703 10387 -4454 -5489 5212 5453 5816 16952 25059 20597
6318B0597J146n226j8623m439J4048n889m514r333O729m1O24J3684k357Q614P056
$$ 20597 21743 16517 -2106 -6545 7503 1614 -2900 -12233 -5504 -5545 -4921 8763 6406 15020 22076
6303B2076j1065K146j2570j0624J1876R171l534L640M128J3343N150p322j487
$$ 22076 11011 13157 587 -10037 1839 11010 7476 11116 15244 28587 33737 26415 24928
6290B4928M369o274j0900r070q913j3279J089Q418L577N278Q443m712j3483N65
$$ 24928 29297 23023 12123 3053 -5860 -19139 -18050 -9632 -6055 -777 7666 2954 -10529 -9964
6276i964J4175l048J6695J7641o349j0067r867j4872P25J1828J0009J0820q044
$$ -9964 4211 1163 17858 35499 29150 19083 9216 -5656 -4931 6897 16906 27726 19682
6263A9682l215o972k0781j3326R331Q721j389M070Q199R355R263r265j0012p311
$$ 19682 16467 9495 -11286 -24612 -15281 -6560 -7949 -3879 4320 13675 22938 13673 3661 -3650
6249c650K189r385j1080r285K5593J5623M039o752p395J742J213m136j65J000
$$ -3650 -1461 -10846 -21926 -31211 -5618 10005 14044 7292 -103 1639 2852 -1284 -1449 -449
6235d49p30P753j0045P073J3501p017j1844p847j824N509K391O973J3290R078
$$ -449 -1179 6574 -3471 3602 17103 10086 -1758 -9605 -11429 -5920 -3529 3444 16734 25812
6221B5812l27k0809j0371M818O979J0358K015q671q349J492K004J4082J0550J426
$$ 25812 25485 4676 -5695 -877 6102 16460 18475 9804 1455 2947 4951 19033 29583 31009
6207C1009j058O883j0041j9629m971K522p341J880N887k2194O279R360o750J3846
$$ 31009 29951 36834 26793 7164 2193 4715 -2626 -746 5141 -17053 -10774 -1414 -8164 5682
6193E682M117j2194N071J29n874j4945j2451J0781J1766M417M263J414j3919q035
$$ 5682 9799 -2395 2676 2805 -3069 -18014 -30465 -19684 -7918 -3501 762 2176 -11743 -19778
6179a9778J0423m46K423J0680N697r502l210O722k939N132J1924j0689j3300O839
$$ -19778 -9355 -9801 -7378 3302 8999 -503 -3713 3009 70 5202 17126 6437 -6863 -24
6165b4J601j0631L787J0936J1217j1073q262J1729L843N568k432k531J8197K618
$$ -24 1577 -9054 -5267 5669 16886 5813 -2449 9280 13123 18691 16259 13728 31925 34543
6151C4543l497j0387j7925m167j6532m312J3152R447K497P142j855j2958O735
$$ 34543 31046 20659 2734 -1433 -17965 -22277 -9125 322 2819 9961 8106 -4852 1883
6138A883Q038M229M69Q74l140k2851j2033n659J3885K2014o12j0591J4411N539
$$ 1883 9921 14150 14619 15493 12353 -10498 -22531 -28190 -14305 7709 7097 -3494 10917 16456
6124A6456j2897k1826Q573J4320p22m51p903J897K066j6209j2379M769m180K6819
$$ 16456 3559 -18267 -9694 4626 3904 3453 -4450 -2553 -487 -16696 -29075 -24306 -28486 -1667
6110a667J8894j6800J6581O010p825j1961Q994P844r379o536L915J3749j0791
$$ -1667 17227 427 17008 23018 15193 3232 12226 20070 10691 4155 8070 21819 11028
6097A1028k1300q370j0897j759K2992J1599J0600Q682o8k543j7656m249n503j3893
$$ 11028 -10272 -18642 -29539 -31298 -8306 3293 13893 22575 22507 19964 2308 -1941 -7444 -21337
6083b1337l319J4541o418K668J0049r2j4521P725J1964J7662l362j3216o618N754
$$ -21337 -24656 -10115 -16533 -13865 -3816 -3908 -18429 -10704 1260 18922 15560 2344 -4274 1480
6069A480J5956l379q983j1418J724Q984l772M285J4398j2485M730N144O344j1242
$$ 1480 17436 14057 5074 -6344 -4620 4364 592 4877 19275 6790 11520 16664 23008 11766
6055A1766j1941r968N514Q291J6201o373j2538J3470o290j0109n990J3521O650
$$ 11766 -175 -10143 -4629 3662 19863 13490 952 14422 8132 -1977 -7967 5554 12204
6042A2204j2525m856o066K332J0043r974N203L576n63r298P727J0812M590m786
$$ 12204 -321 -5177 -11243 -8911 1132 -8842 -3639 -63 -626 -9924 -2197 8615 13205 8419
6028H419M022o008O132j3703j4375J7971J4214Q926J206r904j6609j6984k116
$$ 8419 12441 6433 12565 -1138 -15513 2458 16672 25598 26804 16900 291 -16693 -18809
6015a8809R649R863j000J2290J900Q55k814J611q256l123k671p000J1460J2018
$$ -18809 -9160 703 -297 11993 13893 14748 11934 13545 5289 2166 -505 -7505 3955 15973
6001A5973k786l365m61J1372r15j5115k892j808n746K981l170j4445l984J2616
$$ 15973 13187 9822 9361 20733 19818 4703 1811 3 -5743 -2762 -5932 -20377 -24361 -11745
5987a1745O165J2277l748O902J51p948n943l100Q707Q376J439j4003j634J8311
$$ -11745 -5580 6697 2949 9851 10002 2054 -3889 -6989 1718 10094 11533 -2470 -4104 14207
5973A4207O442n090j4871q432M293J4793M090J452j1003p798j8073K465Q143O560
$$ 14207 20649 15559 688 -7744 -3451 11342 15432 16884 5881 -1917 -19990 -17525 -9382 -2822
5959b822O695J64o272L026J596o803K478N396j1705j760K770n889Q388J7619K0472
$$ -2822 3873 4037 -2235 791 2387 -4416 -1938 3458 -8247 -10007 -7237 -13126 -4738 12881 33353
5944C3353N155q474j1885j9374o579P113j1973R29R513o677l890K466L757P218
$$ 33353 38508 30034 18149 -1225 -7804 -691 -12664 -11735 -2222 -8899 -12789 -10323 -6566 652
5930F52l300n826K666J6582Q251l452O492j7482j163l34M373m951j6876m361L242
$$ 652 -2648 -8474 -5808 10774 19025 15573 22065 4583 3420 3086 7459 2508 -14368 -18729 -15487
5915a5487R598M608P440P022O93j3273j4537J0667J522k903N453Q577j0593p6
$$ -15487 -5889 -1281 6159 13181 13874 601 -13936 -3269 -1747 -4650 803 9380 -1213 -1289
5901a289n710j3654J716J890k273J1372k708j1590N143Q105N104l443J2745R130
$$ -1289 -6999 -20653 -18937 -17047 -19320 -7948 -10656 -22246 -17103 -8998 -3894 -7337 5408 14538
5887A4538j3961p285L401l77o423q028k543j4657l277K6636P230P854J466K674
$$ 14538 577 -6708 -3307 -3684 -10107 -18135 -20678 -35335 -38612 -11976 -4746 3108 4574 7248
5873G248m701p882j924K2404j1392p993J4407R77l211N069j567j0082j2919o380
$$ 7248 2547 -5335 -7259 15145 3753 -4240 10167 11144 7933 13002 11435 1353 -11566 -17946
5859a7946N025M747Q764N257O590k0773j2607L557K964N827k396l844R383k811
$$ -17946 -12921 -8174 590 5847 12437 -8336 -20943 -17386 -14422 -8595 -10991 -14835 -5452 -8263
5845h263K665p910J2619K2519N77m503k470k972J798J024j3167p068j4181O200
$$ -8263 -5598 -13508 -889 21630 22207 17704 15234 12262 14060 15084 1917 -5151 -19332 -13132
5831a3132J448n474J4788J604k102J0366N081j5209q454j143K844o72k407l823
$$ -13132 -11684 -17158 -2370 -766 -2868 7498 12579 -2630 -11084 -12227 -9383 -10055 -12462 -16285
5817a6285k326J240J6758P622N764O61j0414P69r10j659J154J1985L307j6252
$$ -16285 -18611 -17371 -613 7009 12773 13434 3020 3789 2879 1220 2374 14359 17666 1414
5803A414j312j9654R152R605K03J079j8112m558N698N770K1848N543m507o393
$$ 1414 102 -19552 -10400 -795 -592 487 -17625 -22183 -16485 -10715 11133 16676 12169 5776
5789E776o067j797J835k446K272l421K182R430l563j1735l457o416P601o680K293
$$ 5776 -291 -2088 -253 -2699 -427 -3848 -1666 7764 4201 -7534 -10991 -17407 -9806 -16486 -14193
5774a4193P05J885k947j5288L522J7419M871j0142J2084j917r647M165n911K074
$$ -14193 -13488 -11603 -14550 -29838 -26316 -8897 -4026 -14168 -2084 -4001 -13648 -9483 -15394 -13320
5760a3320O321J176n086p86J5248K525J993M598l269p570K192K951m197K707P571
$$ -13320 -6999 -5823 -10909 -11695 3553 6078 8071 12669 9400 1830 4022 6973 2776 5483 13054
5745A3054j1090l178L082J798J663q614k2202o34J8550K77r620m882L358n43j216
$$ 13054 1964 -1214 1868 3666 5329 -3285 -25487 -26121 -7571 -7294 -16914 -21796 -18438 -18981 -20197
5730b0197J1028J0423R637j1657j3466J0367k114j1288K406K3550J576j4908O043
$$ -20197 -9169 1254 10891 -766 -14232 -3865 -5979 -17267 -14861 8689 10265 -4643 1400
5717A400J9924J884j812N239J48K571n083o336m584K492j2945J82P68j1760M664
$$ 1400 21324 23208 21396 26635 26783 29354 24271 17935 13351 15843 2898 3080 3848 -7912 -3248
5702c248J5416P80j0534M568J1383m648M911R79j8813n06J0633J1708J1722o669
$$ -3248 12168 12948 2414 6982 18365 13717 18628 19607 794 288 10921 22629 34351 27682
5688B7682J083j4711j2198J925q678n67R604M266k2658l196k455m738R558R013
$$ 27682 28765 14054 1856 3781 -4897 -5464 4140 8406 -14252 -17448 -19903 -24641 -15083 -6070
5674f070r694k985J0612l403j2271J968P879Q043o56M264O643o40L218P53M685
$$ -6070 -15764 -18749 -8137 -11540 -23811 -21843 -13964 -5921 -6577 -2313 4330 3690 6908 7661 12346
5659A2346q123j1257O006Q407J916J099l700O000j964j6081l805n09r948n602
$$ 12346 4223 -7034 -1028 7379 9295 10394 6694 12694 10730 -5351 -9156 -9665 -19613 -25215
5645b5215O109J4324p043k642J5039O125m306O482J3866o671q963J768m534m11
$$ -25215 -19106 -4782 -11825 -14467 572 6697 2391 8873 22739 16068 7105 8873 4339 3928
5631C928j457R406l425o929n12o747j0974J2501j727p73P217O26O15K636m852
$$ 3928 2471 11877 8452 1523 1011 -5736 -16710 -4209 -5936 -6709 508 1134 1749 4385 -467
5616d67J409j0677K423M182q15J0790J182l421m105p20n837j7158k842m054J3661
$$ -467 942 -9735 -7312 -3130 -3945 6845 8027 4606 501 -219 -6056 -23214 -26056 -30110 -16449
5601a6449M659o395N922J3559R874q182j4994J789j0948j651Q832J3359N577m581
$$ -16449 -11790 -18185 -12263 1296 11170 2988 -12006 -10217 -21165 -22816 -13984 -625 4952 371
5587C71j3041j1378m514J9363J5288k32l807O575P271Q413n60j7655j6597M171
$$ 371 -12670 -24048 -28562 -9199 6089 5857 2050 8625 15896 24309 23749 6094 -10503 -6332
5573f332P342q78N597p709j651K840j2016L34J4871J0395J684K297J303o06j1549
$$ -6332 1010 132 5729 -1980 -3631 -791 -12807 -12473 2398 12793 14477 16774 18077 17471 5922
5558E922j2733l307P603l258k891O901J0205N817L149j4151j3625O300J2501L833
$$ 5922 -6811 -10118 -2515 -5773 -8664 -1763 8442 14259 17408 3257 -10368 -4068 8433 12266
5544A2266L276n381J0598J416p282o306l650j320Q33O348r122J3762L499j1565
$$ 12266 15542 10161 20759 22175 14893 8587 4937 3617 4450 10798 1676 15438 18937 7372
5530G372l688q534m503J7960J9907l13j0535j9709j7453J2428P858L975J1790
$$ 7372 3684 -4850 -9353 8607 28514 28201 17666 -2043 -19496 -7068 790 4765 16555
5517A6555K98M07m40m86l771m817n821Q76q377M746J1462J7386j80m607j3788
$$ 16555 16853 17260 16820 16334 12563 7746 1925 2801 -5576 -830 10632 28018 27838 23231 9443
5502I443j2722r230J898N005J5973L519o013J953p949M714O810j096o007o995
$$ 9443 -3279 -12509 -10611 -5606 10367 13886 7873 9826 1877 6591 13401 12305 6298 -697
5488f97R241m755j5889N712o464j0861n213J202Q734P723Q360J6481m942p56l329
$$ -697 8544 3789 -12100 -6388 -12852 -23713 -28926 -27724 -18990 -11267 -2907 13574 8632 7876 4547
5473D547m828l874l513k331O097L241j963j712l064N343j5327j0048J6499J0328
$$ 4547 -281 -4155 -7668 -9999 -3902 -661 -2624 -4336 -7400 -2057 -17384 -27432 -10933 -605
5459f05k92j2028l624o535O855J4441M549j007M432L796o53o767r737l959K976
$$ -605 -897 -12925 -16549 -23084 -16229 -1788 2761 1754 6186 9982 9329 2562 -7175 -11134 -8158
5444h158k90m749J1697J4152J3249k410j7343q917k587M828N775J1943N021R273
$$ -8158 -8448 -13197 -1500 12652 25901 23491 6148 -2769 -5356 -528 5247 17190 22211 31484
5430C1484j2249m077J1363k2850p878P102l797P040P237M712o202q181l014N639
$$ 31484 19235 15158 26521 3671 -4207 2895 -902 6138 13375 18087 11885 3704 690 6329
5416F329J631n468j6441p469p517q461R115J6150J9190N968k2887o793O895J112
$$ 6329 7960 2492 -13949 -21418 -28935 -37396 -28281 -12131 7059 13027 -9860 -16653 -9758 -8646
5402h646J2535L428K082p358j1379n562O01r85R822J1848J5616k6254o717M679
$$ -8646 3889 7317 9399 2041 -9338 -14900 -14299 -15284 -5462 6386 22002 -4252 -10969 -6290
5388f290l316l535l54M337J4650O874o348p840J045k00P00L832j988n655r30k255
$$ -6290 -9606 -13141 -13495 -9158 5492 12366 6018 -1822 -777 -977 -277 3555 1567 -4088 -5018 -7273
5372g273q854m628J6327o750K113J9629J3700o185j3807Q710k962n512J2744o93
$$ -7273 -16127 -20755 -4428 -11178 -9065 10564 24264 18079 4272 12982 10020 4508 17252 16559
5358A6559j7577j4770J6235R402N829j3418j1314J1308J1427l744o712m914P361
$$ 16559 -1018 -15788 447 9849 15678 2260 -9054 2254 13681 9937 3225 -1689 5672
5345E672R074q873q950k718n942O524J2614L923m452L25o125J741m349j812J9554
$$ 5672 14746 5873 -3077 -5795 -11737 -5213 7401 11324 6872 7197 1072 2813 -1536 -3348 16206
5330A6206N402j2122k671Q447M78J3866M024k4022j2665k0604k738R146R127Q267
$$ 16206 21608 9486 6815 15262 15740 29606 33630 9608 -3057 -23661 -26399 -17253 -8126 141
5316A41J2760j608n874P343O774K193M782j6098n590j236j964N705n274o639R169
$$ 141 12901 11293 5419 12762 19536 21729 26511 10413 4823 3587 1623 7328 2054 -4585 4584
5301D584o149o548n114k65q836p927j1635J0841R154J1891j1133R277J8974J0228
$$ 4584 -1565 -8113 -13227 -13492 -22328 -30255 -41890 -31049 -21895 -10004 -21137 -11860 7114 17342
5287A7342j0988k9089k040j244J9311J6562Q501j0186r665J3179P016O340O550
$$ 17342 6354 -22735 -24775 -26019 -6708 9854 18355 8169 -1496 11683 18699 25039 31589
5274C1589r52j3836j2504j2628L396L142j344j770j40p431j115J4702j0089m217
$$ 31589 30637 16801 4297 -8331 -4935 -1793 -3137 -4907 -5047 -12478 -13593 1109 -8980 -13197
5260a3197R589N166k228r38J2346o125q496p869M876J6051O875l378r753j6061
$$ -13197 -3608 1558 -670 -1608 10738 4613 -3883 -11752 -6876 9175 16050 12672 2919 -13142
5246a3142q202R646P639q41M075p830n92q017J4122J7299K459n304K697j4213
$$ -13142 -21344 -11698 -4059 -4900 -825 -8655 -9247 -17264 -3142 14157 16616 11312 14009 -204
5232b04R47R2k879J0496L849o152J93M179j576q275l371m651o116k346N155M820
$$ -204 743 835 -2044 8452 12301 6149 6342 10521 8945 670 -2701 -7352 -13468 -15814 -10659 -5839
5216e839m592j592L12m674l308R279L211o311J191J2169n965q636K013M140J757
$$ -5839 -10431 -12023 -11711 -16385 -19693 -10414 -7203 -13514 -12323 -154 -6119 -14755 -12742 -8602 -6845
5201f845j980r376P684K800O646Q867J0226j5681k5610m405Q492N339l40q37n729
$$ -6845 -8825 -18201 -10517 -7717 -1071 7796 18022 2341 -23269 -27674 -19182 -13843 -14183 -15020 -20749
5186b0749O695J0131j8919j2477J0914Q283r702P941J4261j1186j9250P208L146
$$ -20749 -14054 -3923 -22842 -35319 -24405 -16122 -25824 -17883 -3622 -14808 -34058 -26850 -23704
5173b3704Q499J6483N354j4420j4230n251J0648J4273M523n190j0682o519L94
$$ -23704 -15205 1278 6632 -7788 -22018 -27269 -16621 -2348 2175 -3015 -13697 -20216 -19822
5160a9822J6972N107M089l612j541p291j363O60j924k234M217K425R388P574n639
$$ -19822 -2850 2257 6346 2734 1193 -6098 -7461 -6801 -8725 -10959 -6742 -4317 5071 12645 7006
5145G006m990k137k1600k739K1551J0666L033j526M795L526j3077o421K519j605
$$ 7006 2016 -121 -21721 -24460 -2909 7757 10790 9264 14059 17585 4508 -1913 606 -999
5131i99M839N972j8975k784Q839j3866o446Q173J6688j1760n248J6184J0990k028
$$ -999 3840 9812 -9163 -11947 -3108 -16974 -23420 -15247 1441 -10319 -15567 617 11607 9579
5117I579r224p914j1643j567j607J2758J5988m43p212J413J5044L74j191o90j0427
$$ 9579 355 -7559 -19202 -20769 -22376 -9618 6370 5927 -1285 128 15172 15546 14355 13665 3238
5102C238q064N399m791j8522Q010m30r150p330P281K0488O963k4494m603J0213
$$ 3238 -4826 573 -4218 -22740 -14730 -15160 -24310 -31640 -24359 -3871 3092 -21402 -26005 -15792
5088a5792K2296L586k282O2J862r55k336m776P582J011J7745P886r389j4164j9697
$$ -15792 6504 10090 7808 7870 9732 8777 6441 1665 9247 10258 28003 35889 26500 12336 -7361
5073g361q106J0821K949N167K732P447j1020j875P767n651n50M932j594j2595
$$ -7361 -15467 -4646 -1697 3470 6202 13649 2629 754 8521 2870 2320 7252 5658 -6937
5059f937j438j2309l198J617k219J7282J6932j971q370j9263j3595O365K713P019
$$ -6937 -8375 -20684 -23882 -22265 -24484 -7202 9730 7759 -611 -19874 -33469 -27104 -24391 -17372
5045a7372P799J3606k150K608o371r205p464P597P496l45Q933J0919p872P851
$$ -17372 -9573 4033 1883 4491 -1880 -11085 -18549 -10952 -3456 -3801 5132 16051 8179 16030
5031A6030j0285J651J4404J727l343k924j8684o138K497M724j2472J588J0766
$$ 16030 5745 7396 21800 23527 20184 17260 -1424 -7562 -5065 -341 -12813 -11225 -459
5018d59p64P622L307K334Q67k997k82j1012o534r755L003N638R803o098L774Q04
$$ -459 -1223 6399 9706 12040 12907 9910 9628 -1384 -7918 -17673 -14670 -9032 771 -5327 -1553 -749
5002g49j4843r42R745P837j160O985j4901l125L200M543k130q462m947M287J8885
$$ -749 -15592 -16534 -6789 1048 -112 6873 -8028 -11153 -7953 -3410 -5540 -14002 -18949 -14662 4223
4987D223M712o958l552o238J8167n958q165M206q963M490l17J519j3990N88K181
$$ 4223 8935 1977 -1575 -7813 10354 4396 -3769 437 -8526 -4036 -4353 -2834 -16824 -16236 -14055
4972a4055N684J012O185P64m376n204j287m794j411J2026N286M83J1535K6364
$$ -14055 -8371 -7359 -1174 -410 -4786 -9990 -11277 -16071 -17482 -5456 -170 313 11848 38212
4958C8212M329p917k5919r262o003J004q136j5566J2303M765Q643k297j3607O038
$$ 38212 42541 34624 8705 -557 -6560 -5556 -13692 -29258 -16955 -12190 -3547 -5844 -19451 -13413
4944a3413J9802J221n284J5518n899q440O989r939p312o249o155p449l228L765
$$ -13413 6389 7610 2326 17844 11945 3505 10494 555 -6757 -13006 -19161 -26610 -29838 -26073
4930b6073L294O257P674J1599M725l969p169j0859r510q650o14J0472P140p309
$$ -26073 -22779 -16522 -8848 2751 7476 3507 -3662 -14521 -24031 -32681 -33295 -22823 -15683 -22992
4916b2992L14J9639p27m510K035K330J483J0954m264j4425P81k638K807j6249
$$ -22992 -22678 -3039 -3766 -8276 -6241 -3911 -2428 8526 4262 -10163 -9382 -12020 -9213 -25462
4902b5462M497N822Q485K0416J9476k650j7413j1758O619n266j057j0732Q741
$$ -25462 -20965 -15143 -6658 13758 33234 30584 13171 1413 8032 2766 1709 -9023 -282
4889b82K6147J1687J065k536N316r860n637k465m989M617Q10k0528j9864j4218
$$ -282 25865 37552 38617 36081 41397 31537 25900 23435 18446 23063 23873 3345 -16519 -30737
4875c0737L599k822J422N951J1702K4175J210q455j177P541L223P880p258N386
$$ -30737 -27138 -29960 -28538 -22587 -10885 13290 14500 6045 4868 12409 15632 23512 16254 21640
4861B1640P857J2974j1152k2447j6785L860O422n47k962j8727k823k862j969N608
$$ 21640 29497 42471 31319 8872 -7913 -4053 2369 1822 -1140 -19867 -22690 -25552 -27521 -21913
4847b1913J6920m270p995J313n85K212r688N5K1280R925j1808j0155J8963L179
$$ -21913 -4993 -9263 -17258 -15945 -16530 -14318 -24006 -23951 -2671 7254 -4554 -14709 4254 7433
4833G433k6753j995P305m05q423J5123J1125j2889j6589J1063J0410l530k4500
$$ 7433 -19320 -21315 -14010 -14415 -22838 -7715 3410 -9479 -26068 -15005 -4595 -8125 -32625
4820c2625J4091N260J700P003J913j061j3649M175R133k663l524q637J659J1346
$$ -32625 -18534 -13274 -11574 -4571 -2658 -3719 -17368 -13193 -4060 -6723 -10247 -18884 -17225 -5879
4806e879J3048l205j2875j3536j3599O058J1782J0761j581j2975j400J4993P842
$$ -5879 7169 3964 -8911 -22447 -36046 -29988 -18206 -7445 -9026 -22001 -23401 -8408 -566
4793e66N7K873M127l848m771m789q759r867O193p211K814M284N649o847o974Q758
$$ -566 -509 2364 6491 2643 -2128 -6917 -15676 -25543 -19350 -26561 -23747 -19463 -13814 -20661 -27635 -18877
4777a8877Q813Q160J0719P870l105o862p286l328k191L108P559m669P673j2653
$$ -18877 -10064 -1904 8815 16685 13580 6718 -568 -3896 -6087 -2979 4580 -89 7584 -5069
4763e069j4048q848M371J5353l498R984j1167j6554K281J6663P905N073j8578
$$ -5069 -19117 -27965 -23594 -8241 -11739 -1755 -12922 -29476 -27195 -10532 -2627 2446 -16132
4750a6132j1926P939j101P58Q816Q610K0008l793j2915q177j2448j386N271J8021
$$ -16132 -28058 -20119 -21220 -20462 -11646 -3036 16972 13179 264 -7913 -20361 -21747 -16476 1545
4736A545j0361p618N109L46k573R223J2301p640l292J4944J0356l245r433o613
$$ 1545 -8816 -16434 -11325 -10979 -13552 -4329 7972 332 -2960 11984 22340 19095 9662 3049
4722C049j1197o994J5310k013n838N397m837N343j372p681P628J999p395l25k9
$$ 3049 -8148 -15142 168 -1845 -7683 -2286 -7123 -1780 -3152 -10833 -3205 -1206 -8601 -8926 -8955
4707h955L34M615P266p492M459M371m080L354P740Q325m11j0038k284o880O512
$$ -8955 -8621 -4006 3260 -4232 227 4598 518 3872 11612 19937 19526 9488 7204 324 6836
4692F836M164k338p722J0598M612L786l298j6279l534R866r210J0980j725k031
$$ 6836 11000 8662 940 11538 16150 19936 16638 359 -3175 6691 -2519 8461 6736 4705
4678D705J698l028O813k087j0408l056L54J8006J4195r384k5244j5609o013M036
$$ 4705 6403 3375 10188 8101 -2307 -5363 -5009 12997 27192 17808 -7436 -23045 -29058 -25022
4664b5022K070Q261J9774J70j142Q493K233L691j087k633M420l903l105J856k2328
$$ -25022 -22952 -14691 5083 5253 4111 12604 14837 18528 17441 14808 19228 15325 12220 14076 -8252
4649h252j8638L218L08J0359K2313J7269k005j1336k5913j0620P947o501q756
$$ -8252 -26890 -23672 -23364 -13005 9308 26577 24572 13236 -12677 -23297 -15350 -21851 -30607
4636c0607o51J9366J1486j4225j5251N587J621J6533N002k834R048K309j9023
$$ -30607 -31258 -11892 -406 -14631 -29882 -24295 -22674 -6141 -1139 -3973 5075 7384 -11639
4623a1639j8692O640K666Q050P795o389j5246J4545J7967j960j995l147k586r246
$$ -11639 -30331 -23691 -21025 -12975 -5180 -11569 -26815 -12270 5697 3737 1742 -1405 -3991 -13237
4609a3237l43J4672K904j2398j0968k955P220J2044K0592Q659J7433N255j0554
$$ -13237 -13580 1092 3996 -8402 -19370 -22325 -15105 -3061 17531 26190 43623 48878 38324
4596C8324j7791m458j275K044j5475j4505r14J4036j226n534L487l806q6J109
$$ 38324 20533 16075 14800 16844 1369 -13136 -14050 -14 -1240 -6774 -3287 -7093 -7179 -6070
4582f070r150q150K857O904J1080O990l521j770L604L064J027J3864n704j3913
$$ -6070 -15220 -23370 -20513 -13609 -2529 4461 940 -830 2774 5838 6865 20729 15025 1112
4568A112j3971p35J624j670j671N567m848N218J1163m086j693R173l323j1542
$$ 1112 -12859 -13594 -11970 -13640 -15311 -9744 -14592 -9374 1789 -2297 -3990 5183 1860 -9682
4554i682Q538k204l593J119m080J1666j255j6315L182R625r407P500N769n418
$$ -9682 -1144 -3348 -6941 -5822 -9902 1764 509 -15806 -12624 -2999 -12406 -4906 863 -4555
4540d555K151l444K623j137n12J6556k029M56p22j0620o711J0189K191N49l0940
$$ -4555 -2404 -5848 -3225 -4362 -4874 11682 9653 10109 9387 -1233 -7944 2245 4436 4985 -25955
4525b5955l446J6225J7170N796n050o461j16P262L882j3527J112J1976Q870j0886
$$ -25955 -29401 -13176 3994 9790 4740 -1721 -1837 5425 9307 -4220 -3108 8868 17738 6852
4511F852m465Jl239N417l299J8N927R459J2519L538j2139J829P152L680j0210
$$ 6852 2387 2388 -851 4566 1267 1285 7212 16671 29190 32728 20589 22418 29570 33250 23040
4496B3040J343Q667Q330j4402j6736o188n548p269pJ736N091R112Q445P889j2514
$$ 23040 24383 33050 41380 26978 10242 4054 -1494 -8763 -8770 -7034 -1943 7169 15614 23503 10989
4481A0989J2606O630l816p284L750q429j364k251j679J920P785j1228j8949M471
$$ 10989 23595 30225 26409 19125 22875 14446 13082 10831 9152 11072 18857 7629 -11320 -6849
4467f849K816M961J2746q628r188J5813J2282L227p23l712j5819j2147N73N27
$$ -6849 -4033 928 13674 5046 -4142 11671 23953 27180 26457 22745 6926 -5221 -4648 -4121
4453d121n491j0381L009N595P902J0582l73j004j2434n094J8412K401j724o519
$$ -4121 -9612 -19993 -16984 -11389 -3487 7095 6722 5718 -6716 -11810 6602 9003 7279 760
4439G60j1287n636K116M321k721K117P995j909O851L146m412k697j1078j2708
$$ 760 -10527 -16163 -14047 -9726 -12447 -10330 -2335 -4244 2607 5753 1341 -1356 -12434 -25142
4425b5142P156J6458o57J0597j1259j9206Q90R069k644N135j62L152j0317R108
$$ -25142 -17986 -1528 -2185 8412 -2847 -22053 -21163 -12094 -14738 -9603 -9765 -6613 -16930 -7822
4411g822J2086N358o10j125j0446j2680r255p38J1764N230k151M505J014O874
$$ -7822 4264 9622 9012 7887 -2559 -15239 -24494 -25232 -13468 -8238 -10389 -5884 -4870 2004
4397B004N424L370m733Q043R216n740n485K765j3815l867N290J0989M640J538
$$ 2004 7428 10798 6065 14108 23324 17584 12099 14864 1049 -2818 2472 13461 18101 19639
4383A9639j1949n813m272M233J8410Q281K816k400r308j9474L025P480p513j7437
$$ 19639 7690 1877 -2395 1838 20248 28529 31345 28945 19637 163 3188 10668 3155 -14282
4369a4282O245J9440j691k5173k857m822j1714K473J5578m768J0720M225J7887
$$ -14282 -8037 11403 9712 -15461 -18318 -23140 -34854 -32381 -16803 -21571 -10851 -6626 11261
4356A1261J3462q923j0011q007r42J0576K0450q636N6L027L75M01p794N931r991
$$ 11261 24723 15800 5789 -2218 -3160 7416 27866 19230 19286 22313 22688 23089 15295 21226 11235
4341A1235k2205q446J3691P728L649L596L791r494j1372o359n391j0369Q576R371
$$ 11235 -10970 -19416 -5725 2003 5652 9248 13039 3545 -7827 -14186 -19577 -29946 -21370 -11999
4327a1999l581J3369J2091N466l263q6p254K598o018j8500n941J4220O239j1275
$$ -11999 -15580 -2211 9880 15346 12083 11997 4743 7341 1323 -17177 -23118 -8898 -2659 -13934
4313a3934r044J5323J0291m12R325N685M686j2028j996o522p56m05R872l316j0918
$$ -13934 -22978 -7655 2636 2224 11549 17234 21920 9892 7896 1374 618 213 10085 6769 -4149
4298d149J1149k962j2804j298n849Q780K8513N716q962j6252j4036l39n82P505
$$ -4149 7000 4038 -8766 -10064 -15913 -7133 21380 27096 18134 1882 -12154 -12493 -13075 -5570
4284e570K264L991N712J1939j5557j1544P618p39N88o224r404q45K5000O761j253
$$ -5570 -3306 685 6397 18336 2779 -8765 -1147 -1886 -1298 -7522 -16926 -17771 7229 13990 12737
4269A2737J2l709P183q428k122J0947M642j952o757p486P701J768k997n172o155
$$ 12737 12749 9040 16223 7795 5673 16620 21262 19310 12553 5067 12768 14536 11539 6367 212
4254B12j937Q847N807M057L666K94k727m766n398r889j4680r427J3623m930k54
$$ 212 -1725 7122 12929 16986 20652 20946 18219 13453 8055 -1834 -16514 -25941 -12318 -17248 -17502
4239a7502N709j03k847O94l13O442k16o227j126N948j358k329k38J0640J2341
$$ -17502 -11793 -11896 -14743 -14049 -14362 -7920 -8136 -14363 -15489 -9541 -10899 -13228 -13466 -2826 9515
4224I515m823J0155N632q874j8622J5792O445k0761o876N867L041O055R682j3624
$$ 9515 4692 14847 20479 11605 -7017 8775 15220 -5541 -12417 -6550 -3509 2546 12228 -1396
4210a396j4814q7l247P020J1154n080N954P643K090J4119O227L645p725j163l73
$$ -1396 -16210 -16297 -19544 -12524 -1370 -6450 -496 7147 9237 23356 29583 33228 25503 24340 23967
4195B3967j1702j5193j7525j6284m360M21J8153J3690N3l317O247J106q970j0308
$$ 23967 12265 -2928 -20453 -36737 -41097 -40676 -22523 -8833 -8780 -12097 -5850 -4744 -13714 -24022
4181b4022q408J8871o203j1587L166N070O057P61j718R332J6154k718m013r199
$$ -24022 -32430 -13559 -19762 -31349 -28183 -23113 -17056 -16295 -18013 -8681 7473 4755 742 -8457
4167h457k774R543l184J020q410k334R37j6204Q922J2323j989O59N881r806n334
$$ -8457 -11231 -1688 -4872 -3852 -12262 -14596 -13659 -29863 -20941 -8618 -10607 -9948 -4067 -13873 -19207
4152a9207N053k613P483J0387j0188k231J7494P778K184k2522j9621M397J592
$$ -19207 -14154 -16767 -9284 1103 -9085 -11316 6178 13956 16140 -6382 -26003 -21606 -20014
4139b0014Q941K899p797M915O176J2095j243p88L624M572j0444m061J499j236
$$ -20014 -11073 -8174 -15971 -11056 -4880 7215 5972 5184 8808 13380 2936 -1125 374 -862
4125h62M38n16J3547q289m330O449L691l727j6102j0090l373P438K762k851l769
$$ -862 -424 -940 12607 4318 -12 6437 10128 6401 -9701 -19791 -23164 -15726 -12964 -15815 -19584
4110a9584j907K9923J0943r023j5472M587M187K903n78r844l313R39J964l254
$$ -19584 -21491 8432 19375 10352 -5120 -533 3654 6557 5979 -3865 -7178 -6239 -4275 -7529
4096g529J957J1583P890M300k493m957L323N00r178o183r056j506R668O676M475
$$ -7529 -5572 6011 13901 18201 15708 10751 14074 14574 5396 -787 -9843 -11349 -1681 4995 9470
4081I470M535p101o407O368P894q795j7163J786J2449Q85J1924Q308j09k0142
$$ 9470 14005 6904 497 6865 14759 5964 -11199 -9413 3036 3921 15845 24153 24044 3902
4067C902j1670p638n32Q739n43k0343J4688j174P701m346k628K56J9313P379j0029
$$ 3902 -7768 -15406 -15938 -7199 -7742 -28085 -13397 -14571 -6870 -11216 -13844 -13588 5725 13104 3075
4052C075l603J3595l312L090o304j2166j3001q937K419P748N422J8204q857r417
$$ 3075 -528 13067 9755 12845 6541 -5625 -18626 -27563 -25144 -17396 -11974 6230 -2627 -12044
4038a2044O908M346N032q042j316o1R17J649N154o815J0843J704J1260n379j6645
$$ -12044 -5136 -790 4242 -3800 -5116 -5177 -4260 -2611 2543 -4272 6571 8275 19535 14156 -2489
4023b489j346L435n725j5271J1909J930l899O587J0655Q032r851m952J556P530
$$ -2489 -3835 -400 -6125 -21396 -9487 -7557 -11456 -4869 5786 13818 3967 -985 571 8101
4009H101j499j0836J118m826J0605K726j0210q565K2323P636l173K170j4136J077
$$ 8101 6602 -4234 -3116 -7942 2663 5389 -4821 -13386 8937 16573 13400 15570 1434 2511
3995B511K0229k099k164o859k156J1497l604n297J1936J0944j6713o818n767p558
$$ 2511 22740 20641 18477 11618 9462 20959 17355 12058 23994 34938 18225 11407 5640 -1918
3981a918Q83m582j922k528j842K426P535j387l858l498J2177j4614l750m582L550
$$ -1918 -1035 -5617 -7539 -10067 -11909 -9483 -1948 -3335 -7193 -10691 1486 -13128 -16878 -21460 -17910
3966a7910J210J7732J3857j529k4189r023R565J1232P995N268j795K310m526j4927
$$ -17910 -16700 1032 14889 13360 -10829 -19852 -10287 945 8940 14208 12413 14723 10197 -4730
3952d730l797J537k19o979K346J272j518m367J1825R862M888K003N66J977j953
$$ -4730 -8527 -6990 -7209 -14188 -11842 -10570 -12088 -16455 -4630 5232 10120 12123 12689 14666 12713
3937A2713J0707p354m170r327j0216m409J3965q428o381J039j920r779K605O647
$$ 12713 23420 16066 11896 2569 -7647 -12056 1909 -6519 -12900 -11861 -13781 -23560 -20955 -14308
3923a4308P174K453J472L144j1314K7492J0931Q74m35p597m075j2917r59M129
$$ -14308 -7134 -4681 -3209 -65 -11379 16113 27044 27918 27483 19886 15811 2894 1935 6064
3909F064P661K862k485j1092r670M11q504m883Q442P120J2380O673j837P012L064
$$ 6064 13725 16587 14102 3010 -6660 -6249 -14753 -19636 -11194 -4074 8306 14979 13142 20154 23218
3894B3218o054n851j6681J107L327p148L206P757p804j5519L765K6471L537j403
$$ 23218 17164 11313 -5368 -4261 -934 -8082 -4876 2881 -4923 -20442 -16677 9794 13331 11928
3880A1928j6654j388L275N054j0338n530j0987J8702J4874J578j7148j928J7199
$$ 11928 -4726 -6114 -2839 2215 -8123 -13653 -24640 -5938 8936 10514 -6634 -8562 8637
3867H637q98j1850j8269J2868J5363R89p818r559j1805Q11J1681n555P55j8834
$$ 8637 7739 -4111 -22380 -9512 5851 6840 -978 -10537 -22342 -21531 -9850 -15405 -14650 -33484
3853c3484J0266J7677J3208J1570J993J042j837k322j4785N381r75l874J7523
$$ -33484 -23218 -5541 7667 19237 21230 22272 20435 18113 3328 8709 7734 3860 21383
3840B1383o269j9198m346M953j0757l106R954j695L234l67n339j2641O077L846
$$ 21383 15114 -4084 -8430 -3477 -14234 -17340 -7386 -9081 -5847 -6214 -11553 -24194 -18117 -14271
3826a4271j1117R30Q644J4988N472N440J3758j5222k5856k1233J2205K7436m499
$$ -14271 -25388 -24458 -15814 -826 4646 10086 23844 8622 -17234 -38467 -26262 1174 -3325
3813c325J0955j1573j298R749J8260k831j0204m093R574R212L485k400o382j0361
$$ -3325 7630 -3943 -5241 4508 22768 19937 9733 5640 15214 24426 27911 25511 19129 8768
3799H768P046K92l131r88p67O891j4368k731j2817K490J2471O305O165J1460o549
$$ 8768 15814 16106 12975 11987 11220 18111 3743 1012 -11805 -9315 3156 9461 15626 27086 20537
3784B0537q834j7282j1416K474J2191L820n996Q67O545q068n467j0797J0785J2751
$$ 20537 11703 -5579 -16995 -14521 -2330 1490 -4506 -3639 2906 -5162 -10629 -21426 -10641 2110
3770B110p791k0376q788J4650K3656N192r697j3801J327J2391N755k477o028M299
$$ 2110 -5681 -26057 -34845 -20195 3461 8653 -1044 -14845 -13518 -1127 4628 2151 -3877 422
3756D22O248m6L891q47j3137l327j5702L215J9468K2618q94j9589r704k946J4450
$$ 422 6670 6624 10515 9668 -3469 -6796 -22498 -19283 185 22803 21909 2320 -7384 -10330 4120
3741D120J756l855q788r231n543L175l00k730J0753J7690J140J602K579k539p939
$$ 4120 5876 2021 -6767 -15998 -21541 -18366 -18666 -21396 -10643 7047 8187 9789 12368 9829 1890
3726A890j0476j2050Q287L575J794J2842R352K337j221k150m212j2740r983J2821
$$ 1890 -8586 -20636 -12349 -8774 -6980 5862 15214 17551 16330 14180 9968 -2772 -12755 66
3712F6n028j0773p422q105L684J0893J2456P234M374m501O763N341n630j1172
$$ 66 -4962 -15735 -23157 -31262 -27578 -16685 -4229 3005 7379 2878 9641 14982 9352 -1820
3698a820Q347O237p719o12o644o188J1965N921j5681j1965n957j603R112K145
$$ -1820 6527 12764 5045 4433 -2211 -8399 3566 9487 -6194 -18159 -24116 -25719 -16607 -14462
3684a4462O425J9337P071J3535l098j7164j0815k950p05P605l694P307K332j5625
$$ -14462 -8037 11300 18371 31906 28808 11644 829 -2121 -2826 4779 1085 8392 10724 -4901
3670d901l194J5493M676n915j2551r435Q815L373j2541j1913M838J5457R819j4262
$$ -4901 -8095 7398 12074 6159 -6392 -15827 -7012 -3639 -16180 -28093 -23255 -7798 2021 -12241
3656a2241j5312K1475L015j3777k703O70K2998L467M515j237q32O591r447K500
$$ -12241 -27553 -6078 -3063 -16840 -19543 -18873 4125 7592 12107 10870 10038 16629 7182 9682
3642I682O667K128j0845j227L747n63r6n634j9769j9326K804J3667R606K923j479
$$ 9682 16349 18477 7632 6405 10152 9589 9493 3859 -15910 -35236 -32432 -18765 -9159 -6236 -7715
3627g715k628J374m248J275P393J2085q029m659J3356J7063J1099j3996j0319
$$ -7715 -10343 -8969 -13217 -11942 -4549 7536 -493 -5152 8204 25267 36366 22370 12051
3614A2051j3984j2456L465q645n480K1385J8564P443K252N30j9709k9263L775
$$ 12051 -1933 -14389 -10924 -19569 -25049 -3664 14900 22343 24595 25125 5416 -23847 -20072
3601b0072O424k727L119j749P380q969m432o518M554J8485N428R390J0659K813
$$ -20072 -13648 -16375 -13256 -15005 -7625 -16594 -21026 -27544 -22990 -4505 923 10313 20972 23785
3587B3785p615n057j3502j868J560p376M968l408J9N912J7598J251k397j621k422
$$ 23785 16170 11113 -2389 -4257 -2697 -10073 -5105 -8513 -8494 -2582 15016 16267 13870 12249 9827
3572I827L751r833k3216M030J4179m378j3107l125O50J2356J0042J518q729J938
$$ 9827 13578 3745 -19471 -15441 -1262 -5640 -18747 -21872 -21222 -8866 1176 2694 -6035 -4097
3558d097J5341K389n187m485Q78M326L374J9189J2258l3213j7455j0257m151J43
$$ -4097 11244 13633 8446 3961 4839 9165 12539 31728 43986 10773 -6682 -16939 -21090 -20947
3544b0947m051j2837N885K6187J5771q79p407j1235m618k878o78l222p506J0278
$$ -20947 -24998 -37835 -31950 -5763 10008 9129 1722 -9513 -14131 -17009 -17687 -20909 -28415 -18137
3530a8137N958j717K1707L568l293K260P79r416j5108L83O626N571o50J3562Q852
$$ -18137 -12179 -13896 7811 11379 8086 10346 11125 1709 -13399 -13016 -6390 -819 -1469 12093 20945
3515B0945j7926j2940P703O223J715j2Q618m285j0262j7663J222J4150p780q316
$$ 20945 3019 -9921 -2218 4005 5720 5708 14326 10041 -221 -17884 -16662 -2512 -10292 -18608
3501a8608m825J7888J0298J774O10j4926m175J7262N534m751k350P968K721j583
$$ -18608 -23433 -5545 4753 6527 7137 -7789 -11964 5298 10832 6081 3731 11699 14420 12837
3487A2837j0967j6358M434Q848J0537J3889o332p869N064J368K968j2238P118
$$ 12837 1870 -14488 -10054 -1206 9331 23220 16888 9019 14083 15451 18419 6181 13299
3474A3299J5407q870m280j0632P95J315k550L74L300q556N040k420r692J820L737
$$ 13299 28706 19836 15556 4924 5719 7034 4484 4858 8158 -398 4642 2222 -7470 -5650 -1913
3459a913m426R197M169j7241O031J1935O763p574j2408j6133n903J5076J2987
$$ -1913 -6339 2858 7027 -10214 -4183 7752 14515 6941 -5467 -21600 -27503 -12427 560
3446E60Q362o079o656M704L562J1087O632l2n579m444L841j6993j4306q022q515
$$ 560 8922 2843 -3813 891 4453 15540 22172 22140 16561 12117 15958 -1035 -15341 -23363 -31878
3431c1878M390J2996J4425r407p825l316N640p462o614K1979J0021L957n474m429
$$ -31878 -27488 -14492 -67 -9474 -17299 -20615 -14975 -22437 -29051 -7072 2949 6906 1432 -2997
3417b997M561N57O866O790Q060o790j1329j263M566k935o236J3020J4387l837
$$ -2997 1564 2121 8987 15777 23837 17047 5718 4455 9021 6086 -150 12870 27257 23420
3403B3420k1591j1175J2877Q112m910j0721j2337P714R35m116R601M379l497j0682
$$ 23420 1829 -9346 3531 11643 6733 -3988 -16325 -8611 -7676 -11792 -2191 2188 -1309 -11991
3389a1991J9985j5542j5659J2735P68L402N676m83Q336Q145m121r486j497q877
$$ -11991 7994 -7548 -23207 -10472 -9704 -6302 -626 -1109 7227 15372 11251 1765 268 -8609
3375h609j2504P552M272l271r396k189k237K371J0358Q656m796q865m796J893
$$ -8609 -21113 -13561 -9289 -12560 -21956 -24145 -26382 -24011 -13653 -4997 -9793 -18658 -23454 -21561
3361b1561N518L223K865n272K022J556o764O785M231R927J6026o251j4504n717
$$ -21561 -16043 -12820 -9955 -15227 -13205 -11649 -18413 -11628 -7397 2530 18556 12305 -2199 -7916
3347g916m310J2130J950j1905r056k952K930R814J695M102N18J1537r62j2801
$$ -7916 -12226 -96 1854 -10051 -19107 -22059 -19129 -9315 -7620 -3518 -3000 8537 7575 -5226
3333e226K66j626q523M620P627J0471R673j95Q47L090l934q160q041r05q520l069
$$ -5226 -4960 -6586 -15109 -10489 -2862 7609 17282 17087 17934 21024 17090 8930 889 -16 -8536 -11605
3317a1605R746L142J1188j210j4477j1419P726K467k632o203K310K23p413J5732
$$ -11605 -1859 1283 12471 11261 -3216 -14635 -6909 -4442 -7074 -13277 -10967 -10744 -18157 -2425
3303b425J4417J3899j4762r037q877l117K896P815q12Q021O849J839k4156j1765
$$ -2425 11992 25891 11129 2092 -6785 -9902 -7006 809 -3 8018 14867 16706 -7450 -19215
3289a9215Q167J3010Pp92j131n949J1590R14L521J2136J8048L066j1786q875j7020
$$ -19215 -11048 1962 1969 1177 46 -5903 5687 6601 10122 22258 40306 43372 31586 22711 5691
3274E691p911L083Q996k316j646O117j2532j0633j862M081N806J3902Q77n685
$$ 5691 -2220 863 9859 7543 5897 12014 -518 -11151 -13013 -8932 -3126 10776 11653 5968
3260E968j7971m124J2083q473k087L373j007m245N140J2389O411l651n260l112
$$ 5968 -12003 -16127 -4044 -12517 -14604 -11231 -12238 -16483 -11343 1046 7457 3806 -1454 -4566
3246d566k1496j1529R654Q553R958P885j0094J094M069n905n75j0624n373j0182
$$ -4566 -26062 -37591 -27937 -19384 -9426 -1541 -11635 -10541 -6472 -12377 -12952 -23576 -28949 -39131
3232c9131J2525J4364Q681j929n904j4819k774J1276Q733k56J0690Q524q53r728
$$ -39131 -26606 -12242 -3561 -5490 -11394 -26213 -28987 -17711 -8978 -9234 1456 9980 9127 -601
3218f01q173M043P6j8684L546J1165n277N556l895m419O533J3682O468j091o328
$$ -601 -8774 -4731 -4655 -23339 -19793 -8628 -13905 -8349 -12244 -16663 -10130 3552 10020 8929 2601
3203B601l793N972l694K545n127j779J566n164j2782J4547J5156o407r055k168
$$ 2601 -1192 4780 1086 3631 -1496 -3275 -1709 -6873 -19655 -5108 10048 3641 -5414 -7582
3189g582q310j749L570M752K392Q53l851o326p709q594J5776L212J6631N568n09
$$ -7582 -15892 -17641 -14071 -9319 -6927 -6074 -9925 -16251 -23960 -32554 -16778 -13566 3065 8633 8124
3174H124q406n720r975J446J701Q333o125P897J3063o254j2593n277J4457J0216
$$ 8124 -282 -6002 -15977 -14531 -12830 -4497 -10622 -2725 10338 4084 -8509 -13786 671 10887
3160A0887O00k580J0681R665j4150j4557K608k166q718N260l008J311N578J100
$$ 10887 11487 8907 19588 29253 15103 546 3154 988 -7730 -2470 -5478 -4167 1411 2511
3146B511j6248n774P498k396P267j592j7686p610J0891K1745K2225j1948r926
$$ 2511 -13737 -19511 -12013 -14409 -7142 -8734 -26420 -34030 -23139 -1394 20831 8883 -1043
3133a043j7939L824J1357J7761o32j361n005q701p872l782L484O042P314R09l485
$$ -1043 -18982 -15158 -3801 13960 13328 11967 6962 -1739 -9611 -13393 -9909 -3867 3447 4356 871
3118H71O572P424L798k657N727q831P329n200r431j7683n248P648J0478J558N284
$$ 871 7443 14867 18665 16008 21735 12904 20233 15033 5602 -12081 -17329 -9681 797 2355 7639
3103G639j0905j4928J733J0295j382N058j8099j4421J5837J8015J1198K660j1788
$$ 7639 -3266 -18194 -16461 -6166 -7548 -2490 -20589 -35010 -19173 -1158 10040 12700 912
3090I12j1160j882J377J914N255J994l635J6366L841j2583L636j50n696o281n661
$$ 912 -10248 -12130 -10753 -8839 -3584 -1590 -5225 11141 14982 2399 6035 5885 189 -6092 -11753
3075a1753N818R403J3607K477r385k439m70O152k289R686l790j9335l332l85K763
$$ -11753 -5935 3468 17075 19552 10167 7728 7258 13410 11121 20807 17017 -2318 -5650 -6035 -3272
3060c272P407J512K734o156l841j0153M679O260L604M449J709q119J846Q846k633
$$ -3272 4135 5647 8381 2225 -1616 -11769 -7090 -830 2774 7223 8932 813 2659 11505 8872
3045H872j4898O011J0420l047j0857J601O560l698m487Q408j144r950p798k122
$$ 8872 -6026 -15 10405 7358 -3499 -1898 4662 964 -3523 4885 3741 -6209 -14007 -16129
3031a6129j6479N081J1482J1244O160K526j082Q941J0360r546k5115n410M469
$$ -16129 -32608 -27527 -16045 -4801 1359 3885 2803 11744 22104 12558 -12557 -17967 -13498
3018a3498O835L679n594r335O06N413J4195o122k1077j3950O503M536k155J670
$$ -13498 -6663 -2984 -8578 -17913 -17307 -11894 2301 -3821 -24898 -38848 -32345 -27809 -29964 -28294
3004b8294J6936J2475J2254p937n562m95m751R641P515p613m714q593M613J1233
$$ -28294 -11358 1117 13371 5434 -128 -623 -5374 4267 11782 4169 -545 -9138 -4525 6708
2990F708M144l805O844J404o672M547J8085l17j5006k099j9485q760J6830J2072
$$ 6708 10852 7047 13891 15295 8623 13170 31255 30938 15932 13833 -5652 -14412 2418 14490
2976A4490q009J7125q21k563k4254j2635k393k076k122O010Q433n597r327R20
$$ 14490 6481 23606 22785 20222 -4032 -16667 -19060 -21136 -23258 -17248 -8815 -14412 -23739 -22819
2962b2819m045L102J6184Q04j032q912L197k38n849L039l973p472L309J2240K521
$$ -22819 -26864 -23762 -7578 -6774 -7806 -16718 -13521 -13759 -19608 -16569 -20542 -28014 -24705 -12465 -9944
2947i944Q536R282M756k6610K223J7710j930o381m059j7201m498N37O407O354
$$ -9944 -1408 7874 12630 -13980 -11757 5953 4023 -2358 -6417 -23618 -28116 -27579 -21172 -14818
2933a4818J0009M295l330m119M92k217P81Q85q709l076q60J1713R032J4135K125
$$ -14818 -4809 -514 -3844 -7963 -7471 -9688 -8907 -8022 -16731 -19807 -20667 -8954 78 14213 16338
2918A6338k2112k1940J5740N032j390M469J5676k39L40m404j3425l128L180p272
$$ 16338 -5774 -27714 -11974 -6942 -8332 -3863 11813 11574 11914 7510 -5915 -9043 -5863 -13135
2904a3135q914J4941q88j792J2029N109J5651q753r092q184L753k596j1293j041
$$ -13135 -22049 -7108 -7996 -9788 2241 7350 23001 14248 5156 -3028 725 -1871 -13164 -14205
2890a4205j169K432o438J077N794J0226k1742n060R163K2162L473j7659j4692
$$ -14205 -15374 -12942 -19380 -18303 -12509 -2283 -24025 -29085 -19922 2240 5713 -11946 -26638
2877b6638J1142Q461R964J338j729J459P657j1089M392j220n22J0364j093p217
$$ -26638 -15496 -7035 2929 4267 2538 3997 11654 565 4957 3737 3215 13579 12486 5269
2863E269K099J0116j485K034m038m659r141j0790p829j1194k898M331J0517J5344
$$ 5269 7368 17484 15999 18033 13995 9336 195 -10595 -18424 -29618 -32516 -28185 -17668 -2324
2849b324L195j4285q998N350J4489K1515K814Q192j5520q415J0120J0734P692
$$ -2324 871 -13414 -22412 -17062 -2573 18942 21756 29948 14428 6013 16133 26867 34559
2836C4559l748r110o627n316m783J0531m364p274K160L339q215K194J0170l475
$$ 34559 30811 21701 15074 9758 4975 15506 11142 3868 6028 9367 1152 3346 13516 10041
2822A0041m411r283O766K7162L957k3269j5815j1420O107l11J4742j051N970j398
$$ 10041 5630 -3653 3113 30275 34232 10963 -4852 -16272 -10165 -10476 4266 3215 9185 7787
2808G787l766P148j4136l708L688J1034O682L045j3977j2018J8387Q310j6832
$$ 7787 4021 11169 -2967 -6675 -2987 8047 14729 17774 3797 -8221 10166 18476 1644
2795A644r199l624J1810J0706P366J0136l520l830n579j5633o475J2477Q652n183
$$ 1644 -7555 -11179 631 11337 18703 28839 25319 21489 15910 277 -6198 6279 14931 9748
2781I748m44m703l185o044j192j6Q599Q709J368r423m319m240M761P222j510m796
$$ 9748 9304 4601 1416 -4628 -5820 -5836 2763 11472 12840 3417 -902 -5142 -381 6841 5331 535
2765E35O857J1678J9384J0393j4345k4839k6757J651j805m151J3619J842K882
$$ 535 7392 19070 38454 48847 34502 9663 -17094 -15443 -17248 -21399 -7780 -5938 -3056
2752c056k913j919k078k593K989J0310J0039j0427p56l659p694J5524J5181n103
$$ -3056 -5969 -7888 -9966 -12559 -9570 740 10779 352 -404 -4063 -11757 3767 18948 13845
2738A3845o36O126j4383n022m793p080l486J2613J5730k987o799k734m726N164
$$ 13845 13209 19335 4952 -70 -4863 -11943 -15429 -2816 12914 9927 3128 394 -4332 832
2724H32n750p4n118k921J0726J750L212K147O570J0074m426K875m049k0944q172
$$ 832 -4918 -4992 -10110 -13031 -2305 -555 2657 4804 11374 21448 17022 19897 15848 -5096 -13268
2709a3268k120N915J1662L163J95k623J299J0170J6599M827p696k0720j560q620
$$ -13268 -15388 -9473 2189 5352 5547 2924 4223 14393 30992 35819 28123 7403 5843 -2777
2695b777j2133L117K250l261J4644j63j4748M49L568K823N013J1315o25r309j5330
$$ -2777 -14910 -11793 -9543 -12804 1840 1677 -13071 -12622 -9054 -6231 -1218 10097 9472 163 -15167
2680a5167k275J0780J0352o936j7914J315J4419N272K171J0247j970n042j864
$$ -15167 -17442 -6662 3690 -3246 -21160 -19845 -5426 -154 2017 12264 10294 5252 3388
2667C388K734j4310n56J5356O681o036J66j1435J1478m509J4149L036p722p989
$$ 3388 6122 -8188 -8744 6612 13293 7257 7423 -4012 7466 2957 17106 20142 12420 4431
2653D431M871k078O096k921q295j979N975m701l851q76j54K032n074O115n135
$$ 4431 9302 7224 13320 10399 2104 125 6100 1399 -2452 -3328 -3482 -1450 -6524 -409 -5544
2638e544n141N611P247J4143o566o609N512n770J662k064J8772M333m992p125
$$ -5544 -10685 -5074 2173 16316 9750 3141 8653 2883 4545 2481 21253 25586 20594 13469
2624A3469j8002n865M514R06l798m860O182J4838J0713l380j1719j4250j459N100
$$ 13469 -4533 -10398 -5884 -4978 -8776 -13636 -7454 7384 18097 14717 2998 -11252 -12711 -7611
2610g611J963o893l559R932O320J0812k136j248q461J7511J5503p801r225l611
$$ -7611 -5648 -12541 -16100 -6168 152 10964 8828 7580 -881 16630 32133 24332 15107 11496
2596A1496m238k453q923l225k860L040j3417r947k693J0055L316J3242J7291J870
$$ 11496 7258 4805 -4118 -7343 -10203 -7163 -20580 -30527 -33220 -23165 -19849 -6607 10684 12554
2582A2554J862j1092q787k386n40J4447J0671k146j622l337j4615Q767j0760l115
$$ 12554 14416 3324 -5463 -7849 -8389 6058 16729 14583 12961 9624 -4991 3776 -6984 -10099
2568a0099n610R853Q689J09r703j1617j900J8085J1939Q817k3393o532J2776J3837
$$ -10099 -15709 -5856 2833 2942 -6761 -18378 -20278 -2193 9746 18563 -4830 -11362 1414 15251
2554A5251O486m992k4856j1589n192J1038P327Q331L567N083J019j1301R144j7151
$$ 15251 21737 16745 -8111 -19700 -24892 -13854 -6527 1804 5371 10454 11473 172 9316 -7835
2540g835RJ7335J0297m970J2199j637k0804o326Q668o979m441N437J1860N541
$$ -7835 -7826 9509 19806 14836 27035 25398 4594 -1732 6936 -43 -4484 953 12813 18354
2526A8354p838k1801o651K0677r14j0253l134j4644J0924J6196j7676J18J0931
$$ 18354 10516 -11285 -17936 2741 1827 -8426 -11560 -26204 -15280 916 -16760 -16642 -5711
2513e711p717J4130o309r009n94j3315J5050J2999k607l089J0791J3349R768j0797
$$ -5711 -13428 702 -5607 -14616 -15210 -28525 -13475 -476 -3083 -6172 4619 17968 27736 16939
2499A6939Q8R716N323j4682j8497k546p069j1517j277J2142m780P472J6241m683
$$ 16939 17027 26743 32066 17384 -1113 -3659 -10728 -22245 -23522 -11380 -16160 -8688 7553 2870
2485B870k093j2313Q421r28p305L8Q134J231M580q685K6n473O728K2307O269L136
$$ 2870 777 -11536 -3115 -4043 -11348 -11310 -3176 -1945 2635 -6050 -6024 -11497 -4769 17538 23807 26943
2469B6943p662j0605m784O084q431l397O807J261K343K974k473M95r998k654Q290
$$ 26943 19281 8676 3892 9976 1545 -1852 4955 6216 8559 11533 9060 9555 -443 -3097 5193
2454E193n292K962J6509r45j5945J4791K561j4460j1453j1567n162J1043R648
$$ 5193 -99 2863 19372 18427 2482 17273 19834 5374 -6079 -17646 -22808 -11765 -2117
2441b117j2514J438J3072J1872j0917k907j84N432M713j952k812J185J825M678
$$ -2117 -14631 -13193 -121 11751 834 -2073 -2257 3175 7888 5936 3124 4309 6134 10812
2427A0812R991j3494q319p433j4100J3768J7180k668j96o38m435n79l18R988r755
$$ 10812 20803 7309 -1010 -8443 -22543 -8775 8405 5737 5541 4903 468 -111 -429 9559 -196
2412a96P830R2P808L398L97P276J789N578L248j2806r436q50J1003r622k1838
$$ -196 7634 7726 15534 18932 19329 26605 28394 33972 37220 24414 14978 14128 25131 15509 -6329
2397f329J601k090J2402k455k4001k628J4062N347l452J2742J0368L505j0221
$$ -6329 -4728 -6818 5584 3129 -20872 -23500 -9438 -4091 -7543 5199 15567 19072 8851
2384H851k922p356j7708k726J9517J833O172k698m12j4429o967J403o540j143
$$ 8851 5929 -1427 -19135 -21861 -2344 -511 5661 2963 2551 -11878 -18845 -17442 -23982 -25125
2370b5125K3171P319P172n70r1k413K713J946M796K22M575r563q366k320L482
$$ -25125 -1954 5365 12537 11967 11876 9463 12176 14122 18918 19140 23715 14152 5786 3466 6948
2355F948p173N019j6130o594P898p051k893J0604m65m634N107L262L986M358o945
$$ 6948 -225 4794 -11336 -17930 -10032 -17083 -19976 -9372 -9837 -14471 -9364 -6102 -2116 2242 -4703
2340d703J3611N995j7438j0723j635J8317k530O072K252q535p342k364J3914J0810
$$ -4703 8908 14903 -2535 -13258 -14893 3424 894 6966 9218 683 -6659 -9023 4891 15701
2326A5701M974j1845o968j1667l643k127n187j3054J3922N683J2814j66j1374
$$ 15701 20675 8830 1862 -9805 -13448 -15575 -20762 -33816 -19894 -14211 -1397 -1563 -12937
2313a2937J86N8k919R46m345k498M635M783J449r607J3467J772P834L949m976
$$ -12937 -12751 -12693 -15612 -14666 -19011 -21509 -16874 -12091 -10642 -20249 -6782 -5010 2824 6773 1797
2298A797L829j0946j5798P944P790j954l494R211j3185J768m408p281J2957Q233
$$ 1797 5626 -5320 -21118 -13174 -5384 -7338 -10832 -1621 -14806 -13038 -17446 -24727 -11770 -3537
2284c537j5509r644o90O835J1516k135j8614R130J0430R824m287j0076j0689K0070
$$ -3537 -19046 -28690 -29380 -22545 -11029 -13164 -31778 -22648 -12218 -2394 -6681 -16757 -27446 -7376
2270g376P177j0728j1082J3457Q411L097Q855L350J632O396J1645n600r660p582
$$ -7376 -199 -10927 -22009 -8552 -141 2956 11811 15161 16793 23189 34834 29234 19574 11992
2256A1992j4452q181J0903J2214q980j2180p097l279P745P766k973K111P123J3515
$$ 11992 -2460 -10641 262 12476 3496 -8684 -15781 -19060 -11315 -3549 -6522 -4411 2712 16227
2242A6227p013j5921J3295Q149L157J5589k970o373j872k869j1964M748L980n494
$$ 16227 9214 -6707 6588 14737 17894 33483 30513 24140 22268 19399 7435 12183 16163 10669
2228A0669j1023j1185N322L492m209j6786r279Q113O048k432O121n263O617p932
$$ 10669 -354 -11539 -6217 -2725 -6934 -23720 -32999 -24886 -18838 -21270 -15149 -20412 -13795 -21727
2214b1727J3464J1145J870l591p47r436n601q984K553J2443j2661J2326J0846
$$ -21727 -8263 2882 4752 1161 414 -9022 -14623 -23607 -21054 -8611 -21272 -8946 1900
2201A900l90P355r04k139R526M061r077J641j04p93R068l893p299j2403j421M917
$$ 1900 1510 8865 7961 5822 15348 19409 10332 11973 11869 11076 20144 16251 8952 -3451 -4872 45
2185D5J3111l39j7279j308J5091J7955K585j1780j7635r708m7P92n090o734K934
$$ 45 13156 12817 -4462 -5770 9321 27276 29861 18081 446 -9262 -9309 -8517 -13607 -20341 -17407
2170a7407O214J691K560J826O816P9J5274K471o658j0084P622n148J109N870J7251
$$ -17407 -11193 -9502 -6942 -5116 1700 1779 17053 19524 12866 2782 10404 5256 6365 12235 29486
2155B9486j2346k3494l827p738j939N925J2783J5115l35o878n57l25J1627L679
$$ 29486 17140 -6354 -10181 -17919 -19858 -13933 -1150 13965 13630 6752 6195 5870 17497 21176
2141B1176m679K513j405R612n616j2334M216J080l766l423M740j0092o126j2122
$$ 21176 16497 19010 17605 27217 21601 9267 13483 14563 10797 7374 12114 2022 -4104 -16226
2127a6226j939j164P323R392N301J303K587j4162L76N100q560n710J119O728R019
$$ -16226 -18165 -19329 -12006 -2614 2687 3990 6577 -7585 -7209 -2109 -10669 -16379 -15260 -8532 487
$$ [...]
##END NTUPLES=NMR SPECTRUM
##END=
