##TITLE=Analysis number 326591
Compound Code cc 59409
Book Reference 494/124
Project Code adrs
Chemist Name craigr
##JCAMPDX= 6.0         $$ Bruker NMR JCAMP-DX V2.0
##DATA TYPE= NMR SPECTRUM
##DATA CLASS= NTUPLES
##ORIGIN= Bruker BioSpin GmbH
##OWNER= nmr
$$ XWIN-NMR		Version 3.5
$$ Wed Feb 14 12:23:12 2007 GMT Standard Time (UT+0h)  MAYBRIDGE\nmr@NMR_250MHZ
##.OBSERVE FREQUENCY= 250.131544655141
##.OBSERVE NUCLEUS= ^1H
##.ACQUISITION MODE= SIMULTANEOUS (DQD)
##.ACQUISITION SCHEME= undefined
##.AVERAGES= 16
##.DIGITISER RES= 18
##SPECTROMETER/DATA SYSTEM= dpx250
##.PULSE SEQUENCE= zg30
##.SOLVENT NAME= CDCl3
##.SHIFT REFERENCE= (INTERNAL, CDCl3, 0, 16.522)
##AUDIT TRAIL= $$ (NUMBER, WHEN, WHO, WHERE, WHAT)
$$ ##TITLE= Audit trail, XWIN-NMR		Version 3.5
$$ ##JCAMPDX= 5.01
$$ ##ORIGIN= Bruker BioSpin GmbH
$$ ##OWNER= nmr
$$ C:\u/data/dgb/nmr/ADRS/870/pdata/1/auditp.txt
$$ ##AUDIT TRAIL=  $$ (NUMBER, WHEN, WHO, WHERE, WHAT)
(   1,<2007-02-14 12:22:54.40 +000>,<MAYBRIDGE\nmr>,<NMR_250MHZ>,
      <created by zg, POWCHK disabled, PULCHK disabled
       configuration hash MD5:
       49 4B E0 1D 92 C2 6B 37 9F E6 65 BC 52 41 86 1D
       data hash MD5: 64K
       97 F3 67 59 C6 07 F6 7B 06 89 12 4D E8 9A FC 4A>)
(   2,<2007-02-14 12:23:05.25 +000>,<MAYBRIDGE\nmr>,<NMR_250MHZ>,
      <Start of raw data processing
       ef LB = 0.3 FT_mod = 6 PKNL = 1 SI = 32K 
       data hash MD5: 32K
       31 D5 AA 34 83 28 10 85 08 23 01 18 A2 6B 84 CC>)
(   3,<2007-02-14 12:23:06.95 +000>,<MAYBRIDGE\nmr>,<NMR_250MHZ>,
      <apk 
       data hash MD5: 32K
       AC 0B A5 7F 8E 79 AE 55 C9 D2 D8 8B 1E 03 36 D0>)
(   4,<2007-02-14 12:23:08.03 +000>,<MAYBRIDGE\nmr>,<NMR_250MHZ>,
      <abs ABSG = 5 
       data hash MD5: 32K
       E4 B2 BE B7 63 C5 5D 5B 71 D0 E8 F3 D4 76 75 54>)
$$ ##END=
$$ 
$$ hash MD5
$$ CA 0B FB F9 74 4D A9 14 21 C7 D8 6C 00 5C 48 FF
##$RELAX= 
##$RELAX= 
##$RELAX= 
##$RELAX= 
##$RELAX= 
##$RELAX= 
##$RELAX= 
$$ Bruker specific parameters
$$ --------------------------
##$DU= <C:\u>
##$EXPNO= 870
##$NAME= <ADRS>
##$PROCNO= 1
##$TYPE= <nmr>
##$USER= <dgb>
##$AMP= (0..31)
100 100 100 100 100 100 100 100 100 100 100 100 100 100 100 100 100 100 
100 100 100 100 100 100 100 100 100 100 100 100 100 100 
##$AQSEQ= 0
##$AQ_mod= 3
##$AUNM= <au_zg>
##$AUTOPOS= <53 >
##$BF1= 250.13
##$BF2= 250.13
##$BF3= 250.13
##$BF4= 250.13
##$BF5= 500.13
##$BF6= 500.13
##$BF7= 500.13
##$BF8= 500.13
##$BYTORDA= 1
##$CFDGTYP= 0
##$CFRGTYP= 5
##$CHEMSTR= <none>
##$CNST= (0..31)
1 1 145 1 1 1 1 1 1 1 1 1 1 1 1 1 1 1 1 1 1 1 1 1 1 1 1 1 1 1 1 1 
##$CPDPRG= <>
##$CPDPRG1= <>
##$CPDPRG2= <>
##$CPDPRG3= <>
##$CPDPRG4= <mlev>
##$CPDPRG5= <mlev>
##$CPDPRG6= <mlev>
##$CPDPRG7= <mlev>
##$CPDPRG8= <mlev>
##$CPDPRGB= <>
##$CPDPRGT= <>
##$D= (0..31)
0 1 0 0 0 0 0 0 0 0.06 0 0 0 0 0 0 0.0002 0 0 0 0 0 0 0 0 0 0 0 0 0 0 
0 
##$DATE= 1171455773
##$DBL= (0..7)
120 120 120 120 120 120 120 120 
##$DBP= (0..7)
150 150 150 150 150 150 150 150 
##$DBP07= 0
##$DBPNAM0= <>
##$DBPNAM1= <>
$$ [...]
##$SUBNAM7= <"">
##$SUBNAM8= <"">
##$SUBNAM9= <"">
##$SW= 20.6930455092707
##$SWIBOX= (0..15)
0 0 3 0 0 0 0 0 0 0 0 0 0 0 0 0 
##$SW_h= 5175.983436853
##$TD= 65536
##$TD0= 1
##$TE= 295.16
##$TE2= 300
##$TE3= 300
##$TEG= 300
##$TL= (0..7)
0 120 120 120 120 120 120 120 
##$TP= (0..7)
150 150 150 150 150 150 150 150 
##$TP07= 0
##$TPNAME0= <>
##$TPNAME1= <>
##$TPNAME2= <>
##$TPNAME3= <>
##$TPNAME4= <>
##$TPNAME5= <>
##$TPNAME6= <>
##$TPNAME7= <>
##$TPOAL= (0..7)
0.5 0.5 0.5 0.5 0.5 0.5 0.5 0.5 
##$TPOFFS= (0..7)
0 0 0 0 0 0 0 0 
##$TUNHIN= 0
##$TUNHOUT= 0
##$TUNXOUT= 0
##$USERA1= <user>
##$USERA2= <user>
##$USERA3= <user>
##$USERA4= <user>
##$USERA5= <user>
##$V9= 5
##$VALIST= <valist>
##$VCLIST= <CCCCCCCCCCCCCCC>
##$VD= 0
##$VDLIST= <DDDDDDDDDDDDDDD>
##$VPLIST= <PPPPPPPPPPPPPPP>
##$VTLIST= <TTTTTTTTTTTTTTT>
##$WBST= 1024
##$WBSW= 4
##$XGAIN= (0..3)
0 0 0 0 
##$XL= 0
##$YL= 0
##$YMAX_a= 435522
##$YMIN_a= -412263
##$ZGOPTNS= <>
##$ZL1= 120
##$ZL2= 120
##$ZL3= 120
##$ZL4= 120
##$ABSF1= 16.522
##$ABSF2= -4.171173
##$ABSG= 5
##$ABSL= 3
##$ALPHA= 0
##$AQORDER= 0
##$ASSFAC= 0
##$ASSFACI= 0
##$ASSFACX= 0
##$ASSWID= 0
##$AUNMP= <proc_1d>
##$AZFE= 0.1
##$AZFW= 0.1
##$BCFW= 0
##$BC_mod= 0
##$BYTORDP= 0
##$COROFFS= 0
##$CY= 12.5
##$DATMOD= 1
##$DC= 0
##$DFILT= <>
##$DTYPP= 0
##$F1P= 14.0000005364418
##$F2P= -0.99999901652339
##$FCOR= 0.5
##$FTSIZE= 32768
##$FT_mod= 6
##$GAMMA= 0
##$GB= 0
##$INTBC= 1
##$INTSCL= 1
##$ISEN= 128
##$LB= 0.3
##$LEV0= 0
##$LPBIN= 0
##$MAXI= 10000
##$MC2= 0
##$MEAN= 0
##$ME_mod= 0
##$MI= 0
##$NCOEF= 0
##$NC_proc= -2
##$NLEV= 6
##$NOISF1= 0
##$NOISF2= 0
##$NSP= 0
##$NTH_PI= 0
##$NZP= 0
##$OFFSET= 16.522
##$PC= 1
##$PHC0= 226.1984
##$PHC1= 8.077712
##$PH_mod= 1
##$PKNL= yes
##$PPARMOD= 0
##$PSCAL= 4
##$PSIGN= 0
##$REVERSE= no
##$SF= 250.13
##$SI= 32768
##$SIGF1= 0
##$SIGF2= 0
##$SINO= 400
##$SIOLD= 32768
##$SREGLST= <1H.CDCl3>
##$SSB= 0
##$STSI= 32768
##$STSR= 0
##$SW_p= 5175.98343685301
##$SYMM= 0
##$S_DEV= 0
##$TDeff= 65536
##$TDoff= 0
##$TI= <Analysis number 999999
Compound Code 99
Book Reference 9
Project Code 9>
##$TILT= no
##$TM1= 0
##$TM2= 0
##$TOPLEV= 0
##$USERP1= <user>
##$USERP2= <user>
##$USERP3= <user>
##$USERP4= <user>
##$USERP5= <user>
##$WDW= 1
##$XDIM= 32768
##$YMAX_p= 347986850
##$YMIN_p= -41650
$$ End of Bruker specific parameters
$$ ---------------------------------
##NTUPLES= NMR SPECTRUM
##VAR_NAME=  FREQUENCY,     SPECTRUM/REAL,   SPECTRUM/IMAG
##SYMBOL=    X,             R,               I
##VAR_TYPE=  INDEPENDENT,   DEPENDENT,       DEPENDENT
##VAR_FORM=  AFFN,          ASDF,            ASDF
##VAR_DIM=   32768,         32768,           32768
##UNITS=     HZ,            ARBITRARY UNITS, ARBITRARY UNITS
##FACTOR=    0.157963299565203, 1,           1
##FIRST=     4132.6476996994, 0,             0
##LAST=      -1043.33573715361, 0,           0
##MIN=       -1043.33573715361, -41650,      0
##MAX=       4132.6476996994, 347986850,     0
$$ Real data points
##PAGE= N=1
##DATA TABLE= (X++(R..R)), XYDATA
$$ [...]
20965 -894 -7871 589 9223 3013 -14 1014 -455 -3117 4964 3694 1384 -238 -1952 -1213 -2572
20950 -2572 -11599 -12600 -3860 -1490 1074 7349 6361 6484 -1177 -12861 -19114 -22017 -16167 -6797 -1348
20935 -1348 5877 4589 254 -10750 -21737 -16470 -1578 7069 12172 9309 8784 11957 7846 4159
20921 4159 -4847 -14758 -10176 -13602 -15597 -14558 -15460 -6881 1233 -5668 -4613 3578 984 -2424 -10685
20906 -10685 -19063 -14688 -11165 -4486 -907 -1663 -13297 -20473 -16531 -11882 -14987 -17354 -16827 -8268 4516
20891 4516 7640 5141 1399 -162 -2251 -4026 604 -9505 -9524 2102 1902 5908 2481 -7261 -10144
20876 -10144 -9034 -6382 -3667 -3938 -4164 -5626 -8589 -10076 -3513 -6608 -5328 1785 -2861 -3588 1617
20861 1617 1571 1277 -300 -5705 2826 4035 -4347 -8215 -6626 664 -3382 -3209 -2764 -5257 -7795 -14173
20845 -14173 -10747 -7458 536 -3117 -15445 -17401 -7229 -9201 -14152 -17271 -11736 -13870 -4040 3992
20831 3992 46 -9625 -18001 -15957 -11332 -7615 -15956 -14983 -2101 -5620 -8734 1302 2840 -6614
20817 -6614 -14370 -6930 -5246 -8960 -2740 6010 7716 781 -1935 2802 6997 5446 -952 -16199
20803 -16199 -19556 -25568 -24559 -11822 -3161 1989 4913 7615 3895 2399 573 -6763 -7342 -8374
20789 -8374 -9019 -1192 2016 849 3385 -1540 -3762 -2784 1845 4300 -5628 -3546 7625 5063 1534
20774 1534 4358 6351 1657 1187 -2793 -3966 -4449 -3070 2307 -2148 -6364 -13838 -8783 -11608 -13872
20759 -13872 -13735 -12296 -14280 2792 11965 2655 -4310 -4042 -5180 -9488 -10901 -15876 -15622 -18525 -9467
20744 -9467 -2420 1675 8664 -120 -8613 -7228 -5995 -21588 -21134 -10871 -14802 -22429 -18239 -19343
20730 -19343 -10580 340 2533 -1319 2099 978 -4352 -7785 -6815 -8299 -15721 -13042 -9347 -14698
20716 -14698 -12275 -10930 -10289 -7898 -4975 4538 6663 2847 1602 -374 -2892 -7916 -12483 -12626 -15205
20701 -15205 -14509 -17902 -16656 -2952 2670 -1659 -10065 -7448 -2925 -1231 -7284 -10432 -15566 -20613
20687 -20613 -21149 -15110 -9098 3609 1573 3604 10529 -355 -1405 -2492 -4568 -5107 -11915 -16185
20673 -16185 -10613 -9499 -6350 -9250 -15572 -20983 -13433 -3795 1297 -6202 -1676 -1340 4669 9103 1568
20658 1568 -2835 -2012 2577 2828 1666 1548 -2658 -10762 -8610 -6437 -8467 -8928 -11284 -13679 -3809 504
20642 504 3501 10312 12225 7683 -921 -10606 -8978 -2225 1288 -2632 -4386 -8254 -12887 -20108 -18393
20627 -18393 -14114 -8737 -3802 1910 -3210 -5263 4069 7012 5986 2698 5054 5650 1845 -5127 -955
20612 -955 -6835 -4631 -1321 -2864 -2023 -1856 -4373 -9970 -16081 -14274 -11422 -6350 -8995 -21464 -28013
20597 -28013 -18225 -11968 -7030 -2398 -10059 -10820 4668 13940 20888 21009 15827 13659 12065 12607 3630
20582 3630 1011 -3848 -6422 -10851 -3454 -5734 -6413 -2513 -2649 -2900 -6415 -7966 -9371 -14383 -16212
20567 -16212 -17405 -15575 -18904 -15431 -12313 -10777 -16683 -20144 -15369 -4854 -7753 4079 11887 5371
20553 5371 7392 1742 -1764 -7458 -7725 -8779 -16497 -6497 -1520 5751 8687 5670 11904 14008 11160
20538 11160 17969 14847 5639 5554 8644 5698 -4116 -10093 -9303 -12920 -13819 -11845 -7671 -5304 -703
20523 -703 -151 -8175 -21462 -19127 -9536 104 952 4636 11956 15910 12413 7063 5723 -3374 -12579
20508 -12579 -7280 -7367 -10026 -8068 791 6535 7348 -4022 -4049 -2400 2662 9516 2251 -4791 -9697
20493 -9697 -12760 -15651 -9570 -14468 -12492 -7154 -5660 415 -2210 -8157 -3642 239 1545 -1391 -1460
20478 -1460 -1036 -1655 -3344 1883 4832 1478 -9305 -16275 -19506 -8593 6370 -3173 -12435 -11071
20464 -11071 -3950 -2114 -4359 -4682 -9966 -8738 -4921 -331 4014 5193 -3366 -16331 -26662 -24119
20450 -24119 -7217 -3613 -477 252 6167 8371 1810 -498 4925 11513 14199 11002 6466 -4002
20436 -4002 -1764 -5700 -7070 -586 1454 3172 946 186 894 4639 4836 1590 1490 -3615 -10961 -9608
20420 -9608 -1299 -2684 -8730 -8865 -13879 -17523 -19824 -11527 2729 61 -4908 -6802 -9138 -1903 1112
20405 1112 -7327 -11098 -2998 5309 8838 11014 9164 8605 4743 3282 -8441 -10524 -16250 -11603 -5943
20390 -5943 -7376 -10115 -12037 -8624 -5722 -3307 914 10406 7527 -7562 -12607 -8588 -7107 -7569 -2458
20375 -2458 -2279 226 -6265 -11018 -4890 -2384 1089 5350 14795 7789 -11373 -19656 -17554 -7285
20361 -7285 -12512 -11722 -1400 -4658 -12925 -6605 -1289 -770 -7488 -10053 -5258 -10628 -3375 -6217 -10285
20346 -10285 -7662 -10072 -8753 -1915 1534 -3239 400 8265 8041 1653 -791 -8544 -8216 -3632 -8779
20331 -8779 -3036 8927 14231 6797 2761 1538 2760 740 8662 15067 21043 17692 18429 10887 8285
20316 8285 14086 19140 10155 -1420 -11727 851 6963 6720 -4730 -6174 5177 9166 11560 2678
20302 2678 5437 11113 10801 7189 -1541 -1315 7037 2017 -259 -2572 -3631 -6209 -5547 1510 -2943
20287 -2943 -4835 -1883 7959 8044 1867 11624 14525 6714 -4284 -18806 -16252 -17239 -15202 -6546 -3959
20272 -3959 -2777 -4581 -948 8462 4813 786 -3564 -1261 -4522 -2060 -1858 323 -9405 -11157 -7807
20257 -7807 -9415 -10059 -1518 4794 1752 -7205 -2855 1421 5056 9847 15283 15423 17155 14108 12050
20242 12050 -656 -6798 -4411 2161 4799 12262 11239 14638 6332 -7283 -13076 -13072 -7360 -7843 -929
20227 -929 -270 -5255 -5463 -6324 573 3022 2761 -296 -5281 -9875 -18702 -12693 -7053 -455 -1985 -2693
20211 -2693 -8343 -3584 -4082 -6137 -3468 846 5875 4199 -1366 -7270 -1942 3561 2406 -5559 -10622
20196 -10622 -13463 -4486 -373 -1295 3101 -422 -9815 -13853 -11401 -43 9582 8514 9617 15216
20182 15216 10807 12743 9161 727 4388 -781 7271 13429 7195 8566 7216 3013 1969 1696 -66
20167 -66 -588 -4952 -6515 -137 -2882 -4622 -5216 -1409 -4800 -10075 -8420 -5244 -1776 12998 18598
20152 18598 12371 12466 11689 5556 -1022 -8324 -8418 -10178 -3061 1405 5471 2226 -11483 -11032 -3216 -2910
20136 -2910 -4409 -4136 -7054 -6514 -485 -593 -6498 -1735 -2409 -5176 -2152 7626 15171 17967 11226 6996
20120 6996 5918 -2949 -5595 2778 20149 20263 19750 7597 5203 13041 8377 5813 10949 17652 13989
20105 13989 3589 -4577 -2739 5402 5087 -7478 -7129 -4182 -10898 -10228 7276 8226 5230 1261 468
20090 468 3179 3810 -4292 -11244 -7805 -6814 -621 -4735 -14478 -14634 -12735 -12750 -10986 -2400 54 1643
20074 1643 4883 3567 4740 -2338 -683 161 1373 816 2392 668 -2468 5965 1744 -4290 -8819
20059 -8819 -12691 -14539 -19001 -10874 -4485 -5119 844 5599 2180 -341 4513 4454 -2059 -2441 -4106 -6931
20043 -6931 -5948 -2929 -3613 414 3492 -802 -2441 -11489 -13294 -21010 -21904 -21724 -8397 1513 -1145
20028 -1145 -5710 -12024 -7816 -5407 2039 3822 -6111 -9859 -1860 -3077 -7030 -11675 -8484 -7249 -10232
20013 -10232 -6148 -865 5007 4066 5041 3035 -6250 -12381 -11088 -10632 2289 -4284 -13109 -20607 -12748
19998 -12748 -2300 -2628 -3348 -1876 1520 1028 -310 -1241 -10592 -5159 3530 5404 13594 14313 3689
19983 3689 1393 -7683 -11564 144 11464 14108 8547 -180 -3096 2577 -4541 -7306 -11604 -10105
19969 -10105 -10477 -9064 -10130 -7011 -10460 -9992 -8701 -10643 -6015 921 4171 3163 -7277 -8070 -5100
19954 -5100 -7447 -10656 -2936 -2884 -9903 -14467 -12857 -10342 -3686 7055 2167 1000 6403 -3754 -2756
19939 -2756 3897 17760 21927 21606 13769 591 -6065 -1697 -5367 -370 -1322 -3104 -2435 1310 6272
19924 6272 6268 -9964 -10176 -11020 -12247 -15675 -17029 -20019 -20623 -16795 -14090 -20859 -22819 -21597 -18813 -13446
19908 -13446 -1473 4373 10755 1762 -7899 -3045 -198 6070 12687 7059 115 20 7272 10093 4869
19893 4869 408 6205 7535 1984 7452 3104 -824 -4799 -6541 -9933 -6650 -9393 -7912 -13734 -3632
19878 -3632 6982 11383 10083 5305 3121 -6317 -3740 4820 10814 2073 -6950 -7742 -3365 -2105 -4126
19863 -4126 -160 -770 -1545 -2007 -6721 -12108 -8004 -9434 -2234 8921 6244 -3913 -2222 7606 4658
19848 4658 1657 -912 -4143 -6810 -16089 -16317 -14611 -18838 -10269 -11385 -3560 965 1377 4280 8786
19833 8786 7869 5404 5429 5430 845 -3164 3300 27 -560 1026 -3929 -8161 5066 6468 1423 -403
19817 -403 -2982 574 345 9041 12166 10848 6207 -744 -11501 -15186 -13799 -8499 -13984 -20927 -15677
19802 -15677 -22561 -21448 -20081 -19277 -8935 -6074 -6700 -1690 -4247 -6389 334 2714 1932 9770 998
19787 998 -13115 -20383 -12453 -4446 -11306 -7368 2010 8634 12202 14607 11668 549 838 6648 10362
19772 10362 -4458 -13585 -11734 -14888 -10860 -4730 -2617 667 -1070 1855 3323 -9654 -14856 -11609
19758 -11609 -3135 -1405 -9834 -7072 -12071 -4083 -10684 -3692 2736 -1458 -15098 -17552 -19645 -18450
19744 -18450 -15016 -6849 -4399 -11970 -16660 -4837 7442 10539 9849 14145 15060 8008 2251 10131
19730 10131 9755 -1122 -10550 -18265 -23016 -19028 -7254 -4896 -2689 -3397 -9550 -14173 -10747 -11247 -9403
19715 -9403 -6016 -3288 6814 13079 3880 2398 -1286 -646 2456 2633 4987 5997 -5844 -9546 -2888
19700 -2888 6159 4060 2152 3550 -5076 -7524 -5321 -4386 -9513 -10258 -3423 -5686 -2927 -8333 -2559
19685 -2559 5818 740 -12949 -14362 -11763 -9173 -9401 -10724 -9780 -11029 -6193 -3384 316 -7715 -11104
19670 -11104 -6698 -3985 -5957 -20081 -22821 -21447 -13746 -8509 -15317 -14468 -13038 -10944 -6172 -209
19656 -209 -1901 -12475 -3836 6420 2977 -3468 -3183 -1274 6204 6944 13357 9014 -1 -5434 -11204
19641 -11204 -12528 -5502 -3141 -5245 5810 5643 8540 5723 -3446 4955 13186 2832 -8033 -9511
19627 -9511 -6356 -4499 -3564 -2844 809 -7553 -12984 -9049 -7588 -2870 3234 1571 -5243 -482 9334
19612 9334 6045 -1877 -1596 122 -318 -3484 1662 -4816 -4912 -12110 -12168 751 6153 2280 -8673 -16868
19596 -16868 -20163 -13187 -6604 -15275 -14384 -11090 -14892 -12182 2142 7458 9692 8148 3800 -1422
19582 -1422 -2680 -2304 5784 7657 5560 5339 2300 -1138 3935 5293 -2316 -5011 1008 864 5127
19567 5127 5344 3404 2396 2883 6455 2500 -4991 -7732 -14527 -16997 -11431 -17999 -19138 -6327 -2711
19552 -2711 -2460 1868 -8060 -9589 -13277 -2247 7029 3775 6946 4689 -4535 -9724 5659 2390
19538 2390 -9801 -6995 -12700 -8437 4088 11458 14095 14904 12682 11260 4460 -2364 1447 3816
19524 3816 -11286 -15879 -14939 -10579 -16778 -15093 -1208 -460 -5442 -5951 -3347 -6240 -4581 -3414 -5218
19509 -5218 286 -6207 -22161 -20919 -9070 -7756 -11990 -8318 -4543 -4139 -8719 -8031 -3441 -7077 -10424
19494 -10424 -9058 -10431 -7584 3066 2058 -1653 -232 787 866 2057 -401 -2716 943 12991
19480 12991 11278 -5168 -6392 -9717 -707 10475 5143 -1264 3623 2014 8171 5618 -375 668
19466 668 5733 12445 11007 6822 1322 -7230 -9148 -10383 -7557 -2956 3106 4354 -2536 -7570 -3024
19451 -3024 2034 6183 -3956 -4141 -1029 1382 12595 18929 14557 15504 12401 -4116 -5859 -9436
19437 -9436 -13258 -9514 -3202 2935 3067 -3763 -238 -2655 -9815 -8797 -4645 -2847 -9412 -1409 3999
19422 3999 10096 3598 766 -2877 -6277 -11181 -14014 -12993 -15108 -17123 -18200 -22832 -20457 -9420
19408 -9420 -3575 -999 -1764 10208 4539 -614 -5359 -1013 -5872 -11270 -5386 3700 895 4152 -1135
19393 -1135 -12102 -17480 -1002 2487 -2896 -817 -7978 -12666 -11790 -7664 2289 15213 9106 -4303
19379 -4303 -6004 792 7665 6729 2478 3961 5288 4709 13735 16114 18194 7388 -4578 -9634 -17832
19364 -17832 -20616 -6357 5675 8614 10498 10149 1689 -6903 468 2660 4330 4228 -438 -11891
19350 -11891 -24712 -19325 -24553 -20281 -12731 -13661 -11619 -17881 -12690 -10285 -11175 -2378 -281 -2752 1674
19335 1674 5599 4129 1534 1074 2543 -4281 -1759 2866 2630 7659 5882 2504 3152 7269 1975
19320 1975 1786 1242 3614 11519 13653 7317 1774 -3530 -6906 -1429 -10393 -15513 -7851 -6183 -6286
19305 -6286 -9514 -6951 -391 5578 8467 6579 -1702 4444 11356 15745 10048 7387 5548 1829 -4072
19290 -4072 -11735 -16347 -7127 -8771 538 1448 -3720 -3100 2136 5259 -2975 -1125 7325 10480 8334
19275 8334 3349 3719 -87 -11828 -20893 -19223 -9353 -4788 -11418 -16849 -14363 -14085 -10553 -1784 -3475
19260 -3475 -9474 -12510 -10822 -10446 -11606 -14256 -8433 -9773 -8436 -6294 -281 5551 4700 7055 2506
19245 2506 3530 6414 410 -5533 -5563 7530 4264 -5220 -2955 443 -1905 -1865 -1386 -3307 -4395 597
19229 597 -8552 -8589 -964 1118 -1845 -11846 -12667 -4320 -2423 -113 9002 13574 7552 9145 4422
19214 4422 -3628 -1877 1308 1875 376 8746 9748 4455 1449 5482 3114 1205 928 5202 9173
19199 9173 14172 12500 10476 9868 8110 9864 5783 6811 5294 1961 -5994 -9971 -11863 -4559 -3064
19184 -3064 -6196 -3371 -16479 -13841 -3796 9633 6919 8996 6094 8625 7522 3808 884 -5782
19170 -5782 -5307 -1128 937 907 228 -3370 -6420 -10218 -12307 -9888 -97 -3748 -2113 2374 5523 7798
19154 7798 7939 10731 2657 1658 776 -6288 -5121 -8454 -17075 -16256 -8427 -10433 -23683 -17098 -9389
19139 -9389 206 968 -661 -306 4886 5318 634 4299 4415 -4121 -3172 -7555 -320 4874 8771 2813
19123 2813 -6462 -6386 -5168 -8475 -6179 -3555 7395 16282 7762 -4814 -6992 -4476 8192 4137
19109 4137 -1824 -1660 -5735 -15496 -14297 -9561 -6302 -2946 -3367 -7639 -11654 -11864 -161 5566 -2037
19094 -2037 2236 3323 -1673 -4768 -3059 -3918 3199 15950 20337 9469 2930 2502 -310 -1442 -11041
19079 -11041 -13910 176 7451 5802 -5251 -10528 -5656 -4217 154 -6230 -4417 -4696 -1717 -8616
19065 -8616 -7932 1860 251 7535 7511 -205 -4992 -4316 2300 -6487 -12184 -3694 13321 12947 3448 -2202
19049 -2202 627 1952 6455 4468 6825 8958 13702 16436 18882 19400 16319 15163 6588 3322 3569
19034 3569 544 5726 6547 118 4792 1905 -12 -116 2339 867 -6948 -3385 -8619 -10488 -7158
19019 -7158 -4136 -1322 994 -3191 -11846 -5417 -2734 4794 5278 5296 1396 -4494 -10933 -10647 1977
19004 1977 12448 18304 15250 2134 -9033 -9201 -5054 -2822 -344 1475 4610 -4846 -8076 -6427
18990 -6427 -3185 2329 7540 3659 5351 11744 10763 10877 2950 -12027 -11150 -1191 5928 4529 -1954
18975 -1954 -6017 -10367 -8736 -21481 -28342 -11075 2749 6556 4983 9635 15339 20932 19113 12103
18961 12103 8439 3547 -1838 -856 -1439 -1778 -14266 -24077 -21375 -12158 -12033 -17592 -17567 -19132 -15340 -10873
18945 -10873 -7082 2971 1575 -8070 -9207 -7057 -3399 3659 1632 -1696 -5433 -5874 3384 5619
18931 5619 9668 12432 5237 -9423 -14761 -8319 -8384 -7551 -11025 -875 925 -2378 -1336 843 2938
18916 2938 2978 7242 6507 -412 -5713 -3850 -5599 -6886 -2517 -4382 678 6704 11557 7121 7931 5447
18900 5447 1139 -4186 -818 8549 10493 4276 3170 -794 675 2605 13556 19162 15516 8251
18886 8251 1507 1173 1557 2465 -2025 -7500 -1002 11459 17175 10588 -1241 -7199 -5020 -4291 -5447
18871 -5447 -587 3210 2278 4159 2840 -3011 -3599 -13154 -10571 422 -7468 -11164 -7409 -7540 -8260
18856 -8260 -13812 -9147 -1469 3095 8006 10208 9194 13387 16017 7029 9544 12161 17597 10126 -8525
18841 -8525 -6911 -9742 -15037 -11753 -1161 3456 5886 16486 15720 3679 325 -2404 -4403 -8663
18827 -8663 -3378 9434 9822 7955 4158 2235 4707 -1101 2445 13485 19303 20503 15980 6595
18813 6595 2926 7324 9584 6236 8892 7760 7554 4123 -3933 -6934 -6544 -2860 4138 1550 653
18798 653 -100 6124 6573 11153 9811 10598 5918 1057 -281 1858 -96 4599 8942 5303 1522 -3347
18782 -3347 -12251 -14266 -7037 -5221 -11685 -14521 -4944 15787 27122 21369 12318 15050 25657 40046
18768 40046 69361 129929 178583 124345 64100 35185 24637 19177 13869 7615 -2802 -2454 7727
18755 7727 17961 17736 15715 22833 16483 8583 10200 -7258 -5934 -7695 -5019 4696 9979 6190
18741 6190 12769 20200 11472 4583 -3508 3237 9568 5682 -3424 -8953 -7737 -3225 2853 -36 -3125
18726 -3125 -6265 1173 3782 7868 -1640 2829 11092 10319 8711 6987 4275 5696 3710 5534 2683
18711 2683 -4321 -6789 4423 13928 13370 13409 10793 6984 3045 -838 -4244 -2258 -6186 -7571 -4575
18696 -4575 -3632 -4197 -2821 -6427 -4890 8971 18870 9298 2812 -1474 10831 12670 5271 926 247
18681 247 -10811 -9064 -4841 -7297 2062 14120 14375 13937 7223 -4036 -7613 -1896 -3743 2859 12182
18666 12182 14551 10279 7576 3303 5190 10473 14105 8944 4664 4308 8269 10207 10218 5513 8086
18651 8086 5731 4421 16534 14823 9036 14160 19199 13240 9674 8505 13067 12353 12550 16294 17783
18636 17783 23930 36867 46350 49512 55105 52884 47878 44590 38627 37221 31246 23549 15884 15188
18622 15188 17359 24765 29352 32875 25168 17756 5606 9303 3814 6631 11814 7246 15926 20165
18608 20165 14897 10351 7287 9123 19685 17429 11635 6347 11925 3550 2157 3803 5801 12679
18594 12679 16556 18232 23408 36579 43275 43301 35960 42647 43739 44185 53977 71585 99320 116064
18580 116064 113415 103980 76267 48470 31193 28362 29022 27082 26235 16966 9324 4513 8498 19327
18566 19327 22603 25373 19937 21093 25370 21732 13713 7124 -1042 3509 15277 5796 -4347 -1797
18552 -1797 -3370 -1732 4437 15767 17070 20257 20570 20850 20141 25835 15282 8687 11164 13885 15200
18537 15200 25276 27371 28827 27106 34885 55191 63806 65079 63682 48759 37811 28333 25243
18524 25243 24419 24120 19673 14781 11148 14226 13955 14078 13093 12614 16662 17231 24481 27655 14537 5121
18508 5121 -4264 -3338 -12 3255 2237 1486 -8252 -4310 1456 -1530 1348 12339 13853 12245 8818
18493 8818 -7187 -5340 3164 -641 3664 13414 8612 6257 -2773 -9813 -7110 -8530 -10768 -7007
18479 -7007 -7816 -5837 -1811 1217 12034 11193 977 5970 1103 -10955 965 15277 13124 12763
18465 12763 17866 22440 20049 17413 18556 17461 10596 499 -4872 1844 2413 7029 12636 15337
18451 15337 12558 6621 11039 5903 -1173 -5422 -1770 13189 16222 13811 4182 3024 -4774 -11049
18437 -11049 -10260 144 8723 9453 2954 11306 2658 -5232 9654 17039 15846 15308 11933 13352 11520
18422 11520 9068 13534 15467 16371 11190 1182 -660 -7015 -1413 11700 3248 -2358 5437 8171
18408 8171 10972 14036 19075 11297 9963 14918 13759 6023 8879 13899 6002 7617 9797 10895 10560
18393 10560 13645 12984 14436 11508 8010 12968 25240 30866 25319 17948 23654 28068 28115 21937 18608
18378 18608 24759 24514 24756 19270 12203 14884 18020 23235 23456 20452 19259 11871 5521 7092 18953
18363 18953 26753 34238 44776 40679 23886 17189 11427 2358 -3066 -1276 -1652 10304 22215 18372
18349 18372 14474 19987 23658 29924 22705 10907 14820 25192 26756 18307 15706 16869 14616 11018
18335 11018 14073 8688 6213 12579 23787 32053 36272 39676 31889 29501 27378 23454 17289 18694
18321 18694 13956 12389 16489 12459 13689 14217 19690 18032 17598 19129 15649 12720 13200 15507 6089
18306 6089 18841 33408 31847 23116 12244 11400 19008 27825 27686 23482 28219 23000 25083 29523
18292 29523 30786 27859 18510 14522 19844 22653 22011 26577 28908 31207 18603 22932 30362 36619
18278 36619 39222 41408 29645 28908 24439 20467 28612 32286 28566 22608 23343 26490 24586 33764 31778
18263 31778 21890 21621 21715 32020 42547 46631 46748 45849 38412 36524 34006 35938 28702 23845 25754
18248 25754 31453 19494 11414 16951 27809 25538 23275 32042 31341 22822 23856 34068 46315 46969
18234 46969 39260 38524 28863 22677 23382 27375 35773 27491 21129 24548 27278 36392 33374 23029 24828
18219 24828 26389 29956 30656 37876 48009 33457 17423 16165 27122 30529 34529 45108 52520
18206 52520 52603 52192 51211 51211 58970 52954 49103 53169 55419 64548 58272 51119 52734 55618 55158 57183
18190 57183 63550 59924 55431 49780 49866 55711 66789 74541 73243 60687 65028 75567 82721 84938
18176 84938 82718 83530 87796 98702 91935 103219 120657 134596 147676 161762 176866 189205 194497
18163 194497 197966 199268 207131 221737 225047 233664 248354 271166 295794 313489 304880 311227 329256
18150 329256 343641 351679 367676 401365 440941 505267 582996 682695 851963 1129137 1533990
18139 1533990 2038331 2583622 3139612 3869448 4978048 6299066 7327745 7401983 6774351
18130 6774351 6269913 6270904 6486254 6226137 5176214 3888375 2798669 2082772 1683075
18121 1683075 1455161 1315484 1234808 1234142 1311445 1454989 1674666 2040544 2689044 3923416
18111 3923416 6343985 11209484 20427867 29596364 23036822 12387994 7063665 4653076
18103 4653076 3469744 2780319 2303039 1960437 1754665 1651730 1601535 1595149 1666487 1858520
18093 1858520 2195331 2750371 3664388 5024756 6638423 8114521 9043842 9803528 11334929
18084 11334929 14132094 17568805 19879051 19449852 16466926 12610363 9335913 7056562
18076 7056562 5527308 4500414 3872450 3619863 3701748 3920237 3979379 3594742 2904400
18067 2904400 2221879 1714112 1394872 1214926 1134889 1102733 1074147 1026666 982586 962890
18057 962890 955449 957430 953625 928245 892885 865285 832994 822605 818160 848167 962097 1183659
18045 1183659 1543617 2059777 2678005 3219976 3436846 3261196 2906326 2624956 2577761 2839287
18035 2839287 3541905 4924071 7266864 10381152 13245973 14277381 12651339 9557168
18027 9557168 6498097 4305591 2954594 2131958 1613694 1265649 1023710 855844 728227
18018 728227 615291 523003 455738 408886 370666 338774 316246 306633 291286 282396 263043 242786
18006 242786 223564 217104 217517 211778 204597 194539 187329 180423 167527 143876 115907 112269 103999
17993 103999 97264 101229 88343 69964 65786 62315 69019 75779 72656 82093 79195 72827 56921
17980 56921 58407 63362 63903 59326 67610 69542 68784 69967 73270 75913 66999 70190 70665 76485 74242
17965 74242 62620 57777 58769 60228 63163 63376 70863 83425 90720 92349 92650 105223 121675 125075
17951 125075 117015 101943 98597 86441 78153 75943 73983 62271 57778 51799 42675 36694 40219
17938 40219 41298 45552 47448 43732 42639 49341 62989 74500 81431 78384 80304 82668 86554 92196
17924 92196 90286 83177 93821 98380 110102 114227 112416 114737 111268 111168 106379 109421 104149 111580
17910 111580 108891 118136 135824 166032 190063 208165 225656 235328 224934 200321 166080 131212
17898 131212 101592 68862 49500 43624 39724 34921 29437 36023 42808 34775 26445 32250 26832
17885 26832 17594 13626 11165 16364 25213 26560 27308 33883 35438 45187 48483 52683 55782 58344 58586
17870 58586 60799 68777 70159 64434 66316 69893 69203 69488 69124 64972 64916 74583 102534 130356 141666
17855 141666 151697 156652 153067 143077 120017 94326 60122 34986 32278 41393 36816 39650 42426
17842 42426 46711 46752 51495 48546 41462 33272 29934 27111 28179 34988 34186 29585 35595 41103 32896
17827 32896 22948 14868 16344 17373 13412 12244 7318 4455 9372 11062 4575 4200 10129 20271
17813 20271 30524 23255 12820 8386 7030 12844 24022 29195 35849 22827 15552 20834 19122
17800 19122 21019 23523 29065 22102 22523 27706 27624 34370 35041 32944 29471 23912 29295 41509 47802
17785 47802 48411 53641 51806 43272 33682 23670 13805 16664 16249 17763 23936 29587 32342 27057 22357
17770 22357 29666 40567 41951 35805 28875 20000 13305 11119 11331 14575 17092 23681 28128 30397
17756 30397 24552 13083 10195 11592 10522 13721 26384 27767 22097 20267 6491 -3535 8393
17743 8393 9263 8514 8312 19804 27394 28019 27949 21808 31332 30919 23891 32845 26437 17322 17038 18815
17727 18815 23504 26210 18800 17489 24832 33882 39033 32564 21009 18974 27396 42165 45286 49977
17713 49977 57195 49764 42506 35826 42060 51415 53675 58189 69319 70594 64782 56256 57197 57909 52828
17698 52828 52868 42942 48715 54612 51179 47528 39269 39154 42437 50909 58152 62350 60566 55943 56942
17683 56942 60201 61929 59770 66577 61522 50946 60878 74306 75016 65694 64678 72362 78370 78037
17669 78037 74670 77409 77373 86264 83619 76090 83437 98298 96800 103354 106732 110721 113770 110965 114405
17654 114405 114895 119345 117622 113450 122668 126437 132294 136996 133960 135278 138077 148448 158855 158277
17640 158277 161677 164770 170860 180324 188495 199136 198157 196927 201076 217021 229659 233747 248412
17627 248412 267600 273911 288916 328538 367538 408767 453149 484647 532835 596522 646715 672503
17615 672503 713788 791326 867952 917325 977275 1058543 1169706 1269854 1362091 1486993 1662752
17604 1662752 1876693 2125164 2438630 2869901 3507404 4360067 5371045 6552749 8255696
17595 8255696 10901081 14234903 16932165 18378521 20286468 23837518 26762395 25910454
17587 25910454 23473544 22836322 23730793 24315629 24314203 24377624 24925171 26323814 28431207
17578 28431207 29550447 28493950 25931638 23110828 20845923 18722364 16391079 13979049
17570 13979049 12127788 11265824 10985912 10360002 9104297 7859155 6957568 6093878 5056456
17561 5056456 4058368 3305876 2812438 2501011 2306594 2193569 2115990 2098460 2138912 2231202
17551 2231202 2435236 2858941 3580930 4399245 4914943 5394928 6436800 7812577 8392413
17542 8392413 8430180 8792444 9289788 9835468 10515070 10731956 9960952 9458492 9627547 9256905
17532 9256905 8247765 7347741 6689825 6171626 5892839 5511219 4608910 3796664 3354701
17523 3354701 2966087 2372858 1808792 1409280 1143530 970883 855876 770917 698450 641101
17513 641101 593612 542396 493975 461062 439263 420756 399333 377100 362644 347632 319743
17502 319743 305947 298775 287169 269989 251640 249987 246376 241830 230326 218697 222482 218144 201429
17489 201429 187151 187230 189551 189119 185780 191766 192911 193571 196404 193799 196888 203571 213310 232920 239905
17474 239905 243527 257849 277328 286363 284389 281238 278126 263639 246365 245454 244153 236463 235234
17461 235234 233612 230816 237294 256134 271441 287447 309238 324932 338645 348075 363903 378103
17449 378103 383027 385766 399083 420837 449949 501238 575877 680062 745567 782680 865364 998991
17437 998991 1211840 1555253 2115547 3016618 4288404 5728803 7104192 8344619 9052672
17428 9052672 8734645 7886410 6973433 6067452 5461518 5467705 6133585 7214325 8428065
17419 8428065 9651677 10377234 10134388 9299810 8138973 6827995 5711313 5047024 4931262
17410 4931262 5306944 5926860 6566456 7158788 7332732 6750096 5791316 4748685 3667590
17401 3667590 2726439 2067110 1656776 1401933 1219676 1084505 981068 904559 850333 816854
17391 816854 807768 815728 833106 872061 926530 1015695 1178454 1435807 1869785 2566461 3534101
17380 3534101 4608706 5648974 6663462 7325829 7388192 7313113 7340275 7304124 7290300 7354746
17370 7354746 7076434 6381570 5663895 5027999 4599135 4587032 4976240 5513766 6140930 6690802
17360 6690802 6765307 6562974 6457070 6333722 6180923 6140858 5945645 5289723 4429875 3568487
17350 3568487 2701719 1968015 1451601 1111157 904349 760981 650420 563013 492334 434595
17340 434595 388228 346986 309853 281582 269118 252312 225683 206959 200779 195768 177400 165725
17328 165725 159487 142895 128560 117921 110409 100086 91424 90942 84894 73969 76099 79669 78050
17315 78050 77122 77653 75729 75142 66290 58818 57041 64358 73197 72339 72743 74783 85689 92938 96955
17300 96955 96318 102799 114184 116997 106945 102535 111576 110093 96796 91723 91539 92161 99002 109565
17286 109565 89181 67864 68956 69281 59141 44915 32854 26943 28968 30411 39452 34897 31897
17273 31897 36856 43981 30663 23356 21242 20308 27881 38433 35283 33169 37445 47044 49826 54852
17259 54852 54675 57726 60055 64187 65920 68023 82687 91498 97881 105049 106400 103156 99608 101537
17245 101537 100943 99764 101714 97999 94230 96847 91469 71143 68011 81084 80373 82239 89473 92188
17231 92188 90138 100983 113422 122595 114241 106619 104817 108997 112518 110803 113886 117424 141601 171328
17217 171328 174730 160870 152799 154511 157768 136583 111937 106743 108201 104052 105919 92894 80395
17204 80395 76595 65611 55237 56322 52943 47935 38047 30466 28650 28790 26886 21037 23024 21688
17190 21688 13830 8010 11847 12211 11485 10412 5879 11159 12517 10616 18800 24727 26493 33718 29635
17175 29635 19707 7886 16925 23739 14933 8628 12654 16082 7172 3595 11541 10582 575 -7076
17161 -7076 -174 6599 2229 2966 13955 19313 18031 15605 17356 11425 6344 15289 12719 4156 10935
17146 10935 10317 15757 22296 28889 33350 29738 17272 13691 15404 24857 22124 24645 24440 19390 22601
17131 22601 27439 31464 26145 22600 33312 37304 25019 20864 24984 31090 34269 22384 19020 20140
17117 20140 24202 20722 26004 37825 41698 32843 32919 30192 32620 22369 25744 33967 35769 44232
17103 44232 60495 67582 86323 108476 119542 131491 134789 142010 154815 162796 163582 168100 172826
17090 172826 154172 145229 137125 135715 155923 173244 188984 191863 190016 194181 187513 186188 186156 193923
17076 193923 192159 180879 167315 161273 143196 132883 123757 104101 93643 85344 75121 71800
17064 71800 54269 34725 18142 16140 19052 26864 17471 8348 14076 30613 26617 34569 49410
17051 49410 49165 46142 55330 72742 63874 57163 65497 78547 75885 79697 83227 83301 83920 89731 89957
17036 89957 89221 88195 89833 100643 120834 122705 107121 90957 75178 75865 81428 73585 63202
17023 63202 60193 52168 48078 40473 34478 23338 12684 8969 1888 4852 16002 7470 -9730
17010 -9730 -7673 5959 12394 6389 -5326 -2740 -1161 -146 -1064 -3368 6138 13128 7833 -854
16996 -854 -5305 -8444 -7397 -4914 -6782 1046 498 -2722 -1854 1010 -4975 -10188 -7130 -3163 5299
16981 5299 12538 3044 3404 13621 21697 16324 11799 3700 1200 2895 4034 4030 -8853 -6656 -2437
16966 -2437 2403 8846 4081 7921 13787 19279 8303 -1025 3446 10263 4274 8106 6472 -639
16952 -639 -10493 -9108 -2739 -12865 -16437 -13241 -7798 1700 7494 3912 1847 5703 7216 8070 11768
16937 11768 18806 16353 10856 7443 3897 4819 -487 8415 11570 984 7292 14348 15741 28846
16923 28846 32452 26167 21148 21077 17424 21907 30692 29173 32974 35135 34877 26839 25563 38703 44771
16908 44771 50442 46684 51184 52057 49716 38284 31511 34817 38053 33104 31019 23648 24165 20756 14301
16893 14301 12937 19764 26419 23793 19408 16427 15747 16224 9630 1214 -423 6235 6456 2884 -12325
16878 -12325 -12135 -6974 -867 156 6382 9586 16690 24368 19154 19681 26506 34879 35544 34599 29442
16863 29442 23854 22219 15522 11796 8810 7533 7420 13726 22786 27122 29677 20883 13546 15531 20459
16848 20459 25147 22594 10751 -1665 -2320 4822 10194 2964 -6765 -10613 -9585 -22060 -22293 -21038
16834 -21038 -18460 -14597 -15638 -11925 -9053 -7680 6 -4963 -13250 -16101 -16687 -12787 -13796 -11493 -12729
16819 -12729 -21244 -23805 -27885 -21092 -14263 -12456 -15178 -18195 -10894 -4761 -16135 -10709 -11330 -24460
16805 -24460 -15073 -326 3760 5183 4582 -1883 -3950 -13478 -20915 -20539 -15391 -15650 -15769 -8618 -2853
16790 -2853 -9424 -12562 -11592 -4978 -4326 -21424 -18879 -6002 -1699 -9220 -8058 -13136 -11840 -9762 -6734
16775 -6734 -2635 -5487 -2611 -7412 -11548 -18125 -24078 -18247 -10650 -5228 615 1824 -2591 -8639 -9089
16760 -9089 3228 -2272 -19104 -16149 2051 1576 1213 -917 36 2684 -236 -15048 -29657 -25568
16746 -25568 -17313 -11629 -798 7416 9348 3864 2805 -2594 -3505 -2111 -11771 -18652 -12801 -8850
16732 -8850 -7468 -8504 -15526 -18187 -12571 -12306 -12464 -14936 -13558 -4924 9032 5491 1342 -2168 -6309
16717 -6309 -10064 -8476 -144 7368 4384 -2492 1962 5010 822 -8588 -14073 -15654 -7165 -853 -2641
16702 -2641 -8616 -7055 -6051 -7793 -11609 -9883 -16735 -19319 -9876 2329 -2103 -13842 -12148 -3322
16688 -3322 -6962 -14628 -16596 -10306 -7295 -9158 -2414 474 -2707 -10215 -11591 -275 1913 998 846
16673 846 -4786 -6100 -2664 -1789 -9869 -12371 -7346 521 -9376 -4259 3478 -1614 -11525 -19741 -23065
16658 -23065 -21340 -16006 -19761 -11644 -10101 -5143 5463 15824 16582 8231 1395 -9115 -15224 -20758
16644 -20758 -19241 -18094 -14066 -10136 -19924 -20170 -15257 -19418 -25580 -19350 -11420 -10996 -13241 -14942 -16726
16629 -16726 -15803 -17692 -14654 -13141 -12844 -15986 -15042 -20244 -31456 -28143 -19197 -11329 -18112 -21956 -18818
16614 -18818 -16758 -18777 -24375 -25122 -21885 -28744 -18203 -3697 -6884 -17945 -12710 -8832 -11347 -13551
16600 -13551 -6142 1789 2313 -1921 -4646 -6867 -12338 -10666 -5399 -12336 -20066 -23095 -22276 -21258 -19146
16585 -19146 -22871 -27697 -28156 -20344 -22236 -21827 -19095 -13611 -7117 162 5727 950 -10120 -15778 -14018
16570 -14018 -9903 -9418 -5609 -13435 -24856 -21819 -16728 -9831 -10143 -2361 1482 -511 -3656 -11687 -8172
16555 -8172 2894 3525 -141 2838 103 -9194 -8972 -10079 -2569 5559 5330 4298 4149 -4235 -6946
16540 -6946 -8364 -11944 -28797 -40537 -29177 -13608 -11221 -13137 -6237 -1032 -9626 -11511 -2699 -5328
16526 -5328 -17310 -26350 -33728 -24295 -10333 -3528 -1668 1988 -2017 -6581 -4668 -7330 -1406 8585
16512 8585 4010 3010 -299 -1849 -8535 -14185 -19791 -27510 -35428 -31285 -24765 -19010 -10899 -7171 2440
16497 2440 12875 2640 -7799 -8015 -6681 -10649 -9872 -12847 -7365 -2101 6874 11757 -1012 -15263
16483 -15263 -21905 -9144 7606 13728 15003 11567 8532 9600 10597 -2993 -12226 -11216 -1629 -5085
16469 -5085 -10387 -5014 -10504 -21177 -19316 -22459 -18300 -10716 -8780 -8401 1493 -715 -4982 -1894 -812
16454 -812 -349 2327 6890 4535 -10675 -10470 -7161 -5903 -2060 -2501 1322 5914 305 -1892 -1276 -1466
16438 -1466 -7582 -2737 -2456 4240 7961 -472 822 5343 -2417 -9123 -24348 -16160 -20515 -17687 -14614
16423 -14614 -5922 3663 -366 -3057 -2687 -470 2792 9449 5271 -1938 -4865 -5912 -16254 -22830
16409 -22830 -14168 -7512 -1084 -7912 -11642 -8342 -10882 -14607 -3899 -3321 -1084 -4855 -12305 -8721
16395 -8721 -15847 -6041 -6719 -14009 -17895 -22205 -21435 -13426 -6156 -6129 2339 9153 11679 5008 -3271 -3766
16379 -3766 -170 -4909 -15099 -17689 -14187 -15162 -16270 -13512 -7260 -9201 -10250 -12206 -14469 -3578
16365 -3578 -1512 -13066 -18535 -18521 -14540 -10965 -22245 -24538 -9011 -3591 -4108 -6089 -5677 -1209 3653
16350 3653 1295 -5748 -4589 -4097 -15873 -22664 -20328 -10773 -11286 3082 3723 -5567 -4901 -12649 -15555
16335 -15555 -12424 -20580 -20319 -15410 -21232 -23468 -18756 -11081 1289 6018 13784 14282 8562 12840 19819
16320 19819 11177 5500 7161 6808 6317 1755 -17 3306 8044 9817 5561 5816 3915 5295 2489
16305 2489 -7253 -1030 -2247 -14779 -12565 -9983 -5081 -2792 -2369 -3811 439 2656 10116 17494 13080
16290 13080 15703 34484 50688 43712 24338 18777 7658 -2702 1518 5149 6465 6362 521
16277 521 -4137 -8377 -13104 -16237 -8565 -10357 -13288 -15916 -11944 -3765 -10769 -4847 7927 13325 8951
16262 8951 8897 4032 -1106 7084 9105 11672 23384 40976 50961 39903 17538 9754 7857 1776
16248 1776 -1501 2483 5551 7121 3783 -3850 -14230 -14647 -7165 -7278 -6508 -18207 -17595 -17926 -10128
16233 -10128 -5914 -1653 -8776 -15984 -15917 -15304 -8021 -70 5271 14989 23458 49347 65411 50041
16219 50041 29348 25758 16859 4675 2125 17848 39311 43931 35795 21563 8371 9093 3670
16206 3670 6153 3620 -2140 -4070 -7830 -6477 -130 588 -24 6038 869 6380 10220 -1023 -6188
16191 -6188 313 4707 17301 31486 23002 9952 4623 1924 8967 20349 32888 44397 54165
16178 54165 53808 38138 21911 4442 -8211 -16037 -12079 -2072 -2499 -3076 -1819 -4297 776 3708
16164 3708 -4257 -4916 -2825 -14252 -20605 -14855 -14575 -19801 -19533 -15936 -9943 -10625 -1993 1198 4916
16149 4916 8888 13626 28574 55192 61037 47435 27977 17961 5203 1570 1575 -4032 -3783 -12611
16135 -12611 -15374 -16424 -13669 -16657 -13995 -10674 -6445 -8049 -8891 -6935 -8501 -10399 -12279 -5895 -3927
16120 -3927 899 8593 2994 -3581 741 15743 34856 56236 67715 40863 17150 3873 -2825
16107 -2825 -5452 -7369 -3452 1095 5391 661 -8017 -20554 -20844 -12651 -10637 -11012 -6666 -5607 6461
16092 6461 13441 10517 42 -7268 -85 -2354 -11215 -13840 -12211 -7449 955 13586 20299 20745
16078 20745 16209 11459 8259 11521 11713 7391 -5089 -12324 -6507 -4735 -12649 -13717 -10834 -6755
16064 -6755 -7737 -8586 -3904 -4566 3800 13114 5106 1558 169 -5082 -8058 -314 -1145 -5466 -9735 -2672
16048 -2672 1622 -3194 -6410 -16356 -23350 -12386 -7632 -2571 1553 13613 12161 7788 5722 441
16034 441 3741 9407 10204 9784 88 5107 8458 -4671 -17922 -20603 -18279 -15214 -13034 -10263 -18302
16019 -18302 -16888 -17268 -23196 -22215 -13550 -8687 -9957 -17268 -10385 -5583 -11123 -15492 -14993 -22257 -34194
16004 -34194 -31400 -27450 -29840 -26650 -19359 -20670 -20024 -10215 -6712 -9898 -21695 -25404 -14312 -7591
15990 -7591 -20832 -23347 -18540 -13349 -13736 -18667 -18631 -15273 -15932 -9350 -12353 -14882 -7561 -11733 -21038
15975 -21038 -31808 -34004 -26953 -18384 -11951 -9961 -6218 3881 8773 -6967 -11645 -4176 -2003 -10165
15961 -10165 -6260 490 2276 -433 -12363 -11822 201 6065 -7461 -5068 3284 -1960 -1266 8279
15947 8279 12328 10718 11904 -289 -190 -458 -840 -2783 -2531 -10295 -2355 11283 347 -9062 -12942
15932 -12942 -21361 -15532 -19733 -21413 -16607 -8854 -8373 -11834 -13357 -19047 -18935 -14159 -5466 2088 -2940
15917 -2940 -1794 -6342 -10973 -11871 -14169 -3397 2576 530 1745 -3891 -8497 -11070 -20561 -16348 -8042
15902 -8042 -5168 -1239 4793 12586 5510 5762 9417 10918 8230 13279 27617 26377 8790 -227
15888 -227 -8469 -4611 -1263 3670 11161 7876 8782 3681 5466 2385 -3722 -3850 -6266 -10358 -13256
15873 -13256 -9423 -12564 -15939 -9946 -7767 -8374 -10613 -7984 -5927 -4753 -6743 -3710 -3172 -5889 -8066
15858 -8066 -10777 -7832 4393 11122 9717 -1999 -8261 3234 8133 277 -3705 462 -3131 -3724
15844 -3724 5691 13258 16677 7262 -2113 -7594 1275 7988 9600 6263 -996 -6393 -5767 -1648 6723
15829 6723 7831 6966 7370 8115 -741 -6042 860 -475 -2643 -14154 -12415 -5846 -8359 -1664 -2187
15814 -2187 -3742 -5213 -252 -1953 -5927 -14606 -19786 -21390 -22238 -20909 -21597 -13725 -12543 -1573 -16
15799 -16 -3689 -8187 -3021 649 7830 5123 3779 7062 -6312 -4501 102 7981 13237 9856 13239
15784 13239 7634 4800 1289 -3472 -5404 -3175 -5347 -10437 -4535 -12368 -17782 -7276 -1791 1042
15770 1042 348 -1500 -1767 1828 -2512 -1409 11587 11910 5482 -6142 -7126 -6999 5009 8304 8385 499
15754 499 3533 1271 5434 -4656 -4374 9933 6839 6071 -2647 3965 10034 5916 7439 5625 -14824
15739 -14824 -22848 -18151 -19951 -26515 -17302 -8058 -10998 -13681 -11669 -6098 3001 3614 4338 5283 2282
15724 2282 -8185 -4275 -1085 -4848 -5701 -4311 -6908 -965 3589 6377 16163 25647 22860 9758
15710 9758 923 -843 -1290 -2495 -2225 -3886 677 -2325 -8367 2019 9291 10760 20214 8323 4603
15695 4603 2202 -4600 -4736 -11730 -9369 -4706 -485 -1699 -10772 -12736 -8633 -2672 2583 -113 8575
15680 8575 5417 7900 4176 -4028 -5764 -3370 -1083 1385 -6995 -13839 -8056 -3618 -6167 -10615 -6025
15665 -6025 -517 -3963 472 1529 13146 24006 23979 15937 4738 757 -3814 -8446 -5453 -13863
15651 -13863 -21644 -32553 -20028 -1201 -2023 -58 -1128 -11388 -8906 -6103 -12916 -16417 -5253
15638 -5253 5304 10944 4289 2214 3060 -2173 -2330 2592 -5939 -15818 -14939 -3746 -660 -3397 -11124
15623 -11124 -11192 -8162 -5569 -1714 -3415 -1045 779 -2738 -9630 -8347 -4941 -4493 2137 -3313 2147
15608 2147 -3177 -2790 4319 3373 10076 15979 9486 1376 -6313 -4772 -4878 -2983 -2401 949 -6870 -10751
15592 -10751 -4448 4276 1962 7912 11299 2814 -16878 -17219 -12570 -8197 -5851 -6148 -13972 -17224 -15058
15577 -15058 -17325 -5729 1658 12212 10413 761 -5953 -6034 2668 5251 11055 15719 17479 15281
15563 15281 7021 2216 -3061 312 7317 -6481 -6173 -2683 -9400 -10283 -7562 -5514 135 5302 2037
15548 2037 -1041 -1633 -3093 -5545 -3905 -11121 -8069 -7936 -4817 -5898 -10577 -17401 -14614 -10434 -13730
15533 -13730 -21823 -17680 -22800 -22600 -16311 -21261 -16033 -7188 -15194 -11598 -11030 -8994 -4735 -212 -968
15518 -968 -10053 -10142 -3710 -12356 -12977 -8372 -10013 -9198 -10668 -22965 -32188 -23238 -5125 7073 4981
15503 4981 -4801 -3590 -1235 -2989 -9077 -9084 -5452 -3356 7984 10175 3902 -10018 -17926 -11787 -4919
15488 -4919 -2167 -4555 -14113 -19716 -23967 -21293 -10226 4528 8436 5685 -1225 -3689 -6576 -1393
15474 -1393 1908 6617 377 -7951 -13396 -11770 -8291 1808 1339 -14313 -13329 -4406 -3361 -2957 -4721
15459 -4721 -3827 -12671 -10513 -2870 1931 15773 16662 5720 -4912 -3073 -7683 -19401 -18835 -9072
15445 -9072 -8427 -11751 -9067 -9963 -7890 -5423 -5509 -8350 -12894 -10099 -7072 -12295 -6871 -2490 -1421 -1438
15429 -1438 3914 1786 748 -10087 -5936 2860 -6677 -14570 -16099 -7391 2804 8969 2300 -10724
15415 -10724 -8341 4161 9235 441 2237 10858 13863 2510 -8559 -17420 -12758 -6633 -15424 -14117
15401 -14117 -16707 -16384 -14549 -10893 -6440 -11712 -15932 -3511 -1531 -2555 -1390 -6158 -16069 -8629
15387 -8629 8000 14509 3808 3373 7041 13408 3111 -10360 -20339 -16028 -6830 -7155 -12536 -11599
15373 -11599 -2736 -2401 -4852 -4170 -5551 -8135 -8321 -5103 -4339 -19092 -11482 2556 -4016 -13954 -9439
15358 -9439 -16111 -15450 -15966 -15754 -16992 -6782 -5534 -4419 -6213 -15152 -11159 -3150 -3235 3914 5664 -2067
15342 -2067 -5196 -4475 6846 9288 -1177 -4947 2472 2553 3754 -3283 -6614 -2867 2181 -3227 -13989
15327 -13989 -14141 -6596 -9955 -6111 -3607 -5077 -327 6717 10515 14264 11128 7401 -3054 -1003
15313 -1003 8971 17267 22506 20407 19277 18001 10725 -1949 410 3168 7211 -4154 -10372 -7068
15299 -7068 -14724 -12429 -4675 896 -1188 -2489 2709 4190 809 610 61 -6525 2295 6333 3140
15284 3140 11081 26173 19433 3579 -3943 -8709 -8506 -10266 -4725 -264 1066 4483 -339 -2773
15270 -2773 -7696 -4030 -15199 -25814 -19310 -14722 -12769 -9877 2328 -625 -2635 -4918 -16071 -15822
15256 -15822 -15849 -24500 -20510 -23896 -10900 -2874 2583 17981 26608 24734 11729 4435 7619 15039
15242 15039 12988 20125 35768 61913 88586 86392 57088 30403 17226 18650 27283 36258 47418
15229 47418 67717 95681 102571 69415 50328 42797 30454 19314 18106 23633 35204 49034
15217 49034 46619 38353 24874 16590 3240 -668 -893 -1853 957 2880 -2829 7939 13265 16016
15203 16016 11607 1953 -6267 -10774 -10723 -11013 -3506 -6679 -9262 -8907 -5304 -5721 1763 4669 2659 861
15187 861 6201 2471 -925 4362 -467 -4609 757 5765 -2493 -467 1421 6673 2061 -2115 -10343
15172 -10343 -10141 -704 2868 -170 -6797 -10476 -1796 -3241 -1916 -750 -2486 -12075 -16423 -8276 -15526
15157 -15526 -8951 -6058 -9271 -8719 -6489 -5760 -795 1643 706 521 3443 185 -9344 -10630 -6942
15142 -6942 -767 5113 13932 26627 30693 25714 19851 19176 18361 12607 12257 20831 44994 79276 95449
15127 95449 66425 28243 15641 16680 10790 10531 30157 58708 88546 106701 89657 54572
15115 54572 26702 22033 15356 8443 8447 17756 25888 27025 27820 16174 11122 11599 18959 19380 14957
15100 14957 6184 -3606 -11457 -13517 -5502 3513 5310 4835 -1452 -10154 -1106 4756 5968 3862 11020
15085 11020 10281 11471 1424 -2925 -6091 -7521 -7824 -6542 -8276 -1795 4690 10743 7136 5202 8411
15070 8411 6817 891 -8895 -14146 -9553 -6921 -5526 4959 8059 11723 11217 9072 8426 9068 13796
15055 13796 10628 2959 -8033 -5280 -7397 -5253 -9249 -10833 -8868 -4732 -12887 -17196 -20495 -17655
15041 -17655 -8709 -4844 -6973 -9460 -2765 1951 -12088 -15320 -10307 -1725 5480 81 -4972 -9385
15027 -9385 -731 917 2298 4555 12017 20393 24898 28909 34492 35701 35651 36462 49004 59376 79000
15012 79000 110864 123724 93967 58029 42512 36060 39678 47975 61773 98349 114239 86525
15000 86525 56922 27954 17072 19079 11651 14399 25782 33259 18179 2552 3167 14564 21907
14987 21907 15561 24821 21531 9433 5186 2666 1325 264 -687 843 -1412 5038 11976 7121
14973 7121 713 7101 -749 -4830 -2172 1288 5561 9267 1421 -6514 -13663 -7643 9168 9460 8112
14958 8112 12594 9225 11188 32562 34449 30869 21963 14556 9465 6426 23119 48097 78931 96126
14944 96126 80295 49181 37483 38590 33716 38761 47349 70800 96500 91352 56003 30270 29016
14931 29016 27403 22668 20550 23829 31595 31713 22977 12160 5564 -4782 -7815 -9312 -17253 -10368
14917 -10368 -13679 -21216 -12534 -1837 -3194 -4420 -16472 -18716 -13742 -11801 -6409 -7929 -8684 -14312
14903 -14312 -7207 1959 -3038 -431 6685 2173 5147 11598 6004 4485 -462 -158 -5150 -12595 -20177
14888 -20177 -27207 -23114 -11401 -3093 1452 9206 4546 -1586 -8479 -8612 -1983 4951 13141 11895
14874 11895 88 -8189 -10157 -4702 1323 -2150 -9890 -8625 -12418 -13593 -3068 -8625 -19479 -17253
14860 -17253 -16319 -15238 -19239 -18149 -20891 -23480 -11694 -7472 -2576 -6026 -3941 6419 -389 -2422
14846 -2422 378 4861 4959 4481 4975 3419 -817 3579 3511 -5815 -7776 -4254 -2186 -8834 -8805 3478
14830 3478 19828 19023 17183 21393 16086 7619 4503 3623 8894 4935 4504 6487 18459 24024 18294
14815 18294 21320 22996 23517 19582 14231 9372 827 270 -11330 -8624 5744 5218 5286 2050 5665
14800 5665 5820 10049 17890 6414 -1020 -2683 5638 10106 6638 -3462 813 723 -7117 -6281 -931
14785 -931 7838 10796 15929 14490 7755 -4062 -13653 -14626 -11026 -5242 1840 5494 10003 14289 5983
14770 5983 -420 1613 5183 15918 25274 17547 13744 7746 10732 12405 6080 -3806 907 4366
14756 4366 12861 16123 15435 13148 4344 -3943 2503 8113 8897 11206 6629 1352 6490 8322 12742
14741 12742 17052 12718 8174 6378 -1528 -13088 -7773 4338 12961 13090 5825 -1302 3166 13081
14727 13081 11423 13511 5686 2563 926 -3001 1450 11885 13820 21464 23029 18920 16000 8062
14713 8062 10319 5307 10791 23138 23936 26240 29590 25697 26333 26674 26804 28799 22595 11465 13128
14698 13128 28757 39978 40453 31475 18876 21157 24014 20902 15611 23853 24250 19590 18336 24541
14684 24541 17876 16635 15280 5903 -3229 -5924 -9149 -6121 3959 10185 16245 13091 6589 -837
14670 -837 -667 -3101 -3857 -844 -1103 -608 7590 15528 17875 14973 19341 7450 -1492 -8991 -14361 -18666
14654 -18666 -20150 -19774 -14496 -9341 -7536 -6457 -8136 1989 3585 1002 -9455 -6856 3516 17874
14640 17874 20933 14548 12522 23510 35231 42327 47948 56010 65111 88350 114841 140175 180641
14627 180641 212025 238121 254093 249885 228290 204079 181664 144098 108991 79060 58872 48989
14615 48989 34266 21436 9619 5942 8177 8455 14001 5933 3759 4464 14126 28764 24397 28071
14601 28071 25514 10373 -1138 3668 4614 19 3666 3081 3616 5053 12610 8604 2111 5683 8593
14586 8593 11518 3872 -1319 -877 -7142 -6022 -1542 4759 4717 -2452 -4685 -7286 -7111 821 930 3049
14570 3049 620 1385 6727 -4587 -546 -2263 -737 14539 8896 -2185 -9671 -8343 4101 -2692
14556 -2692 -2148 -654 -337 12659 16155 14450 7294 2754 3228 9447 19555 19736 23889 16200 11243
14541 11243 10565 984 1036 6965 11584 716 -4304 -5631 -3905 1152 8165 4601 -6239 6056
14527 6056 12098 14620 20394 13311 7948 13443 13681 14607 13153 1312 3887 4635 1364 2438 6723
14512 6723 3065 4376 5549 -1390 54 -3822 1678 8836 14678 10045 5743 13550 12428 17377 10987
14497 10987 14160 14681 10399 -2426 -8991 -7001 -610 9894 -950 -4804 -641 10763 17339 10809
14483 10809 11237 16182 18814 17374 9498 10281 11313 10709 7761 2896 10949 13533 13778 11319 7924
14468 7924 9968 9565 13502 13205 18266 29033 22722 12512 3027 5513 7302 3815 1020 620 4212
14453 4212 14676 16269 12246 14682 16751 19402 16087 19644 15776 6488 5966 7479 2308 5661 3413
14438 3413 6372 17727 15412 3607 13402 16969 13907 12971 21234 25115 26391 13741 12364 14399
14424 14399 25989 29868 35683 41994 47203 48298 37868 44930 62302 71416 89854 115783 151690
14411 151690 186025 231336 268031 295385 321369 330642 317478 310271 295508 261816 222301 182649
14399 182649 146607 104861 80347 63290 53807 51285 54411 54220 49069 36271 24795 19946 15268
14386 15268 18422 14796 10668 7149 5039 938 -6225 -4863 12553 25619 21387 10967 15754 9915
14372 9915 14629 20191 15036 9140 6820 3394 -1071 -13505 -7924 -7808 -4466 -3181 -765 -10322 -10498
14357 -10498 -4071 7019 11766 10767 5870 5583 5440 2548 7943 5737 6802 1452 4535 6030 12545
14342 12545 16457 20549 16406 11192 15073 11926 13105 17615 10016 3738 1453 5801 1982 3817
14328 3817 5544 2131 1867 6906 20282 25506 25173 25979 24914 13195 -5507 -7019 301 3896 -218
14313 -218 -4386 -1676 -8653 -1551 8799 15083 8361 5815 13088 10648 8308 11921 13435 7027 14880
14298 14880 29644 31817 26773 28362 21397 3604 -681 -2087 -4738 5131 7021 6151 6544 1269
14284 1269 -2375 -8070 -2521 4190 5303 8861 10444 2639 -2958 27 -7680 -16021 -18914 -13092 -16767
14269 -16767 -17689 -23634 -20746 -15418 -18383 -10166 -18160 -27385 -18759 -13944 -11369 -10725 -7591 -9571 -5366
14254 -5366 5221 10251 859 -1316 -204 2549 -3043 -5574 -7935 -6520 -6023 10743 11573 6632 771
14239 771 -2044 8478 9995 11385 18508 15165 10039 11977 10257 7757 2738 6208 12070 18601 18401
14224 18401 14872 8986 15609 28689 34963 39518 44580 35996 22761 29429 38468 47750 52499 51512
14210 51512 57707 46283 37612 28927 23713 31793 40061 37273 21819 23750 27484 24291 19409 13029
14196 13029 13712 15510 15716 18012 11931 12081 18133 18912 9140 -3587 -11041 -1390 6757 5785 12537
14181 12537 16941 12655 5627 6093 8337 17383 27593 19896 13245 19825 18577 3339 10543 19204
14167 19204 16103 10217 9553 11244 9960 14246 15282 7999 875 15174 27354 34136 34682 32423
14153 32423 29182 25626 29628 25182 29873 31810 37351 29521 25161 23240 18197 15986 9309 12723
14139 12723 18476 4482 -3518 -5192 3009 8143 14863 15441 6767 -733 -3481 -2611 -7706 3600
14125 3600 4913 17551 22078 20278 20320 22291 21589 20306 20444 17504 3693 1514 13353 17541 11482
14110 11482 10429 17577 15083 17920 20634 28444 37657 34412 17717 8330 3791 8769 865 4243
14096 4243 12104 20213 22160 26656 39316 56419 60619 58869 61841 64359 72584 82604 82919 85063
14082 85063 85047 77496 81001 86136 79148 73864 80638 80925 73913 69232 70917 72850 82282 83515 82967
14067 82967 75838 66456 55765 49675 48565 50767 57099 67873 65965 68063 72821 76780 71679 76679
14053 76679 75400 66839 68181 79140 87166 89766 88771 81925 85953 76456 63388 71256 86078 93790
14039 93790 104987 115955 117388 125214 141685 155547 159895 164615 173485 190048 202388 214931 228165
14026 228165 244087 246767 242586 229538 227879 231861 242063 243888 250990 255148 250624 241023 237878
14013 237878 246278 266642 283263 285617 280092 284673 301265 315346 329004 337125 346192 362522 376100
14000 376100 400269 429122 464454 491930 522844 562489 610523 668863 729392 792648 857625
13989 857625 920248 976498 1041280 1111288 1180938 1275921 1402036 1557304 1744156 1967834 2250679
13978 2250679 2590476 2975974 3409912 3901946 4456920 5086590 5822325 6764964 8030189
13969 8030189 9824588 12481731 16382945 21712902 28151572 35196856 42636725 50078373
13961 50078373 56546437 60878060 62745685 62276849 59499464 54353989 47467642 40089306
13953 40089306 32983061 26334662 20374688 15632214 12228453 9850583 8154854 6890725
13945 6890725 5909678 5109007 4440447 3868135 3372765 2948173 2583901 2285020 2022359
13936 2022359 1799140 1623431 1479641 1365906 1257601 1159621 1069532 989945 922233 855856
13926 855856 808261 758697 706070 663647 628751 598029 572252 540901 519813 495052 473270
13915 473270 464430 455273 441427 441682 424761 415030 409027 398219 393335 395226 405049 417115 437221
13902 437221 445466 438818 429286 411035 382411 355695 325804 299932 267174 258386 259331 258830 264584
13889 264584 274719 289296 310430 342789 378563 407305 430908 460683 494705 542286 591405
13878 591405 632063 673229 700882 710797 703719 677298 634033 581092 513015 439878 374003 310187
13866 310187 251412 220150 191306 172656 161761 153684 143808 136941 127336 121702 127827 119111 115094
13853 115094 111575 104936 97605 83707 74790 73650 76543 69923 63909 68033 73336 71650 69266 85210
13839 85210 86037 86981 78205 73983 75112 74426 84035 96464 102648 124705 164892 203959 218224 201321
13825 201321 176838 162793 149609 144342 163681 205394 255443 278726 270105 230307 174911 130047
13813 130047 109824 110597 118472 138625 170637 185063 168078 130619 102722 97480 90309 85399 82795
13800 82795 86615 90260 88854 103943 138699 174736 198692 186834 151685 119649 118820 133241 156521
13787 156521 196313 239810 275170 282249 244426 190971 149313 117549 101552 99932 118318 146716
13775 146716 166535 157016 122290 88307 67935 60025 52792 36586 27511 18954 17940 18385 13348
13762 13348 17841 18631 19355 27861 37957 38836 23931 9192 8346 16736 21929 25439 26340 28548 29130
13747 29130 14795 9163 4243 3545 1018 6580 11984 16729 26393 26113 15737 9914 14933 26746
13733 26746 26568 20710 18514 29239 34734 33956 33573 25388 3467 -6052 -5028 -1481 -6851 -3179 -3583
13718 -3583 -914 8246 10658 3291 16251 24247 17166 14880 17846 22296 32181 25397 15491 17106
13704 17106 21199 30958 33275 26161 17705 19400 26242 30103 30528 14102 10432 14828 12793 15286
13690 15286 13022 7873 7045 8241 15769 15197 19818 23015 20570 16256 6006 -3349 -3726 10785 8336
13675 8336 7928 16233 21121 11486 6249 18347 24774 24093 20116 12582 3626 -2867 -1410 13535 14712
13660 14712 18442 23890 20065 8370 4167 4490 7037 10739 19638 25113 21019 20246 20698 23107 26037
13645 26037 20481 20365 21977 20999 18851 16770 22910 22796 22370 10683 9932 2206 8149 17345 33023
13630 33023 32412 24480 18873 9308 9428 10412 6880 4643 7948 5428 9483 15119 9070 7383 13222
13615 13222 18165 26201 27620 21091 20339 22786 17566 20243 17837 11414 533 -2792 -2337 -3637 -5016
13600 -5016 -1988 2315 6773 9202 7893 12286 12308 15503 13833 16271 18627 22943 19101 19433 21430
13585 21430 25704 23051 11185 1112 -13155 -13401 -9749 -13577 -7992 -1641 569 1754 200 3051
13571 3051 5880 2565 777 8289 14464 13555 12970 4239 324 5537 12603 3545 -11520 -22014 -21655
13556 -21655 -4766 9131 3625 -6480 1039 3661 5619 9697 10078 18732 19381 11933 12937 13329
13542 13329 8151 11197 14240 14298 5673 -3661 -3932 -4951 -1540 4247 763 6104 15076 19744 18098
13527 18098 6675 6575 16389 28969 38672 41903 42727 37639 35636 43901 53748 54194 62471 86470
13513 86470 115774 143732 175137 210770 247400 286931 312088 326530 326054 315759 305706 284634
13501 284634 242322 204856 164710 144258 123053 93677 69335 57567 45396 28129 19138 19121
13489 19121 30258 30388 27654 26938 26499 17126 15264 18148 22722 29275 28138 14277 5780 10371 12074
13474 12074 11146 12468 9608 13428 21312 11829 3702 4265 -3801 -1193 1987 2605 -1661 215 3552
13459 3552 4071 -753 -402 634 5563 1774 -3137 666 7332 10985 6616 4264 -4265 6899 17958
13444 17958 14013 14592 16825 15705 7671 -5269 742 16061 22457 26623 31002 26311 18778 12203
13430 12203 14235 17321 14397 18230 28338 23200 23526 30652 44820 61666 79724 93923 102719
13417 102719 98816 95899 84338 65191 52386 50928 44128 37072 26748 23355 17894 3736 5840
13404 5840 5875 16548 16846 8642 -2574 -17715 -8644 -1635 -7369 -7895 808 1771 -1530 4230 20139
13389 20139 23349 18254 30197 39906 40672 49995 52359 72413 99357 118740 143589 186153 209934
13376 209934 207584 192320 165919 123071 85687 65850 52499 42680 32226 23649 13920 19529
13364 19529 16281 9322 14912 20173 14195 6728 2904 9177 11358 16160 26125 21214 17913 24176
13350 24176 26777 21371 17215 14160 22401 30438 37337 43046 46909 50716 58243 70859 78375 93001
13336 93001 110562 110656 111028 99982 75667 58783 40586 37610 35898 23269 17974 20515 25184 25591
13322 25591 21232 15734 16622 15254 11103 16107 9821 9001 11514 14015 21178 17812 14439 18659 14654
13307 14654 12963 21129 18713 18501 18659 17309 12197 3057 6091 6675 5887 6132 5792 1892 -1320 -5399
13291 -5399 2260 12125 2048 -10279 -22727 -19907 -12183 1873 2301 -14182 -14313 3328 11841 -218
13277 -218 -1351 -1394 4986 -43 -9498 -6646 -1534 -5271 -8533 -9077 -11622 -7252 2314 5366 635 2015
13261 2015 10177 8148 -5366 -2637 9077 16824 7127 -8429 -6145 2809 1988 551 -9864 -9370
13247 -9370 -3581 8227 9096 3920 5257 7054 21872 31059 10809 1878 3983 7091 6374 2152
13233 2152 -7214 -11365 -10750 -11510 -1322 2771 4162 2996 -730 7343 13141 14163 18133 23098 24560
13218 24560 18396 14897 11385 2037 5445 9623 10052 2146 836 6768 17591 25178 27543 17353
13204 17353 9260 10327 18963 17987 7635 11190 14135 16216 20546 16175 16330 13880 7385 -3778
13190 -3778 -1127 12010 18008 21657 13425 15727 22565 32445 39256 41459 40731 36393 36232 40701 39037
13175 39037 38412 41028 38865 29605 27614 36952 40144 27532 26352 21319 22447 23987 25439 29828
13161 29828 31822 30636 30707 26570 16799 19851 15863 9783 8785 9094 3304 2442 6473 11019 15053 20810
13145 20810 27413 22146 13345 11925 10628 24755 32033 28205 21824 23575 22966 20782 25359 25741 18314
13130 18314 15042 24004 26248 28659 29481 24733 29921 31659 30703 31617 31850 27021 28215 31853 46577
13115 46577 66606 80045 92519 105266 94512 68871 50960 46127 34470 19301 17106 18329
13103 18329 19981 25372 28086 22777 16620 13754 20598 21080 34304 50500 47572 36896 48485 48930
13089 48930 49678 50050 53312 61786 53595 39865 42955 55762 67997 85708 110327 141744 157096
13076 157096 169135 161407 140752 117011 98644 81478 54377 42251 31434 37397 32109 21853
13064 21853 23023 21894 15130 15577 17226 22621 35517 40583 43076 50774 62995 67806 65960 71262
13050 71262 66621 69657 72170 76470 81090 90555 101761 101193 114776 132799 143795 150565 142263 123946
13036 123946 109055 109244 102371 93799 87893 84158 81877 76221 79833 75189 80577 90959 95674 94064
13022 94064 94696 90484 81263 91119 102999 115624 111569 117536 127984 134222 138250 139369 140785 142839
13008 142839 140689 146238 170894 185197 184906 198897 208084 218743 226954 231438 239383 253239 269401
12995 269401 302003 333906 360052 397541 435807 472008 501709 531919 574888 635620 710569
12984 710569 809363 931325 1061781 1210517 1372938 1587235 1866516 2238549 2755147 3483653
12974 3483653 4547116 6133217 8471152 11741552 15735033 19547528 21756688 21346879
12966 21346879 18628148 14884279 11340783 8567075 6589762 5225708 4260078 3556280
12958 3556280 3052344 2668807 2379038 2158901 2010099 1906637 1819589 1763157 1730438 1705221
12948 1705221 1680668 1672997 1695229 1773870 1904553 2093676 2316015 2560310 2836147 3162938
12938 3162938 3556951 4114198 4898195 6001539 7580148 9907432 13446935 18791281 26305058
12929 26305058 35324695 43510737 47425773 45009870 37625820 28697125 20931550 15275649
12921 15275649 11472191 8906293 7128944 5858333 4924026 4202959 3644532 3231249 2889664
12912 2889664 2611702 2375846 2175713 2003371 1867260 1772950 1709904 1662923 1646256 1670345
12902 1670345 1727811 1820877 1927484 2060074 2239135 2464331 2776444 3221975 3861864 4780780
12892 4780780 6139299 8173111 11099552 14918581 19072296 22281769 23130440 21180922
12884 21180922 17372683 13220139 9752372 7243478 5523492 4341458 3483812 2849365
12876 2849365 2376494 2007273 1720485 1491131 1302221 1134102 986326 862771 757852
12867 757852 673837 608249 552984 502156 457986 420590 388950 362845 333236 310402 295750
12856 295750 285802 270830 251246 233286 223222 213885 210116 211345 201020 187948 170405 160525
12844 160525 158120 160333 160682 163014 162725 158544 147126 140944 132601 126315 119464 108514 103359 102878
12830 102878 97388 88396 94339 92215 93310 88693 95571 93303 85122 78504 77393 74040 70469 71190
12816 71190 78754 75745 67879 66497 67661 68863 62730 57590 53039 51542 56530 65164 66212 73420
12802 73420 75546 79271 78725 68330 64323 60909 56203 58826 58949 63021 67727 61729 59205 61280 58924
12787 58924 48952 33639 34862 44736 48575 43628 41720 42020 36821 38382 36912 35331 28170 29427
12773 29427 37624 35367 24668 23891 23519 23231 29309 28711 28638 37022 39773 41012 43053 46185 55553 54168
12757 54168 44246 39598 38933 36754 34560 34121 32188 35389 33924 30577 20408 22414 17077 4431
12743 4431 544 10379 31716 32219 33605 34880 36938 34410 26341 18811 22816 47164 70641 75411
12729 75411 64909 47782 33996 26703 26220 24110 33226 38069 35104 23444 18513 35032 46484
12716 46484 39107 30843 34874 35506 26658 13622 19281 19105 13922 -934 6335 14973 26978 21310
12702 21310 22270 30559 25076 19173 15625 19938 22133 10803 9779 12876 11 -9700 -12258 -14843
12688 -14843 -9779 -415 -2599 -1399 2098 10236 18774 19995 18116 28294 31590 24072 14622 10112
12674 10112 15896 14751 7969 11554 12373 26781 30703 34395 47008 41602 39998 32839 27316 32385
12660 32385 32512 27537 24253 25862 24915 24534 28003 32709 43778 43713 40464 50631 76895 119277 183919
12645 183919 300737 444937 482542 372015 238795 158328 124103 123481 135506 143589 140819
12634 140819 127544 117578 107887 87166 67696 49032 46737 33239 32179 29816 25674 23397 21646
12621 21646 22311 20871 23610 21677 24694 27670 23992 33255 36278 38263 48362 65273 76262 72402
12607 72402 78100 89070 108619 128138 138412 144287 131467 115270 105882 98969 79782 63411
12595 63411 58528 51590 46823 44755 39232 35658 28000 23112 25690 22059 20182 22978 23069 30426 35519
12580 35519 26226 17594 15269 15617 16364 20289 28754 31696 49906 68357 88578 104634 113282 112272
12566 112272 103143 90765 70880 51087 37869 23828 19046 14950 11463 16016 17334 10447 6283
12553 6283 2764 11802 23055 15045 4899 5706 14718 22291 20922 14789 1040 7148 15786 14413
12539 14413 8233 4600 14619 24719 15816 8162 8392 20219 23735 29959 30942 23995 27056 27505
12525 27505 30274 34283 33162 33468 33191 33573 42261 41508 34240 46581 53745 65592 85356 105856
12511 105856 123969 126558 116621 103519 94332 79830 64417 47993 39923 39849 43261 27390 18813
12498 18813 11690 9775 25680 24964 19722 22400 27650 19891 24271 27350 33423 27568 25033 37309
12484 37309 42440 47354 48127 48595 39865 43823 58133 66216 82275 100191 122663 153765 188683
12471 188683 218369 250922 270780 257316 222981 190151 165278 138319 114853 96998 83499
12460 83499 81091 84946 90157 87348 82695 82049 91348 92211 75358 71425 78087 87822 92022 89195 80562
12445 80562 68439 63748 64336 71608 80270 87536 94453 102837 108028 115677 124118 127973 138917 171062
12431 171062 211861 235210 235911 214761 192417 165929 142994 115472 105124 105322 94713 90522
12419 90522 91001 94194 88165 88596 101019 105602 104155 93933 95546 100741 96358 93869 79293 78789
12405 78789 83911 85569 80316 79150 81136 80891 91235 106277 124389 155007 179578 191872 197149
12392 197149 172263 147763 140498 123837 110993 90099 83586 88455 84175 82505 86373 84229 78887
12379 78887 71259 67520 66103 64004 55941 54812 52612 51844 51694 49061 48196 42110 47012 44481 28889
12364 28889 17005 17312 17264 22796 35092 45105 64235 71967 63976 60984 55506 48993 35929 21818
12350 21818 14838 15223 11400 15455 24012 21276 13076 6514 3925 2381 3055 -4881 -6730 -5983 -3460
12335 -3460 6072 7461 6648 3860 -1723 2831 -1998 6469 15150 9672 11843 13118 9880 12717 17344
12320 17344 11009 13927 14950 10409 5276 9604 9993 10605 8292 9994 11903 -2674 -6082 2678 13271
12305 13271 11605 11428 12695 9226 9380 4304 3238 2037 11772 20405 20459 15883 1258 -9252 -4990
12290 -4990 -6567 -10210 -6980 -5760 4169 9029 14797 9349 5192 13698 12201 -369 2486 5082
12276 5082 -1406 -10837 -4215 -4878 -7450 -1602 -6213 4616 17414 17107 9672 9266 4296 6585 21871
12261 21871 22474 5250 -5573 -4317 -9571 620 11293 11218 13466 21136 10429 1320 -4368 -8763
12247 -8763 -6641 4454 7414 180 -10707 -6446 4958 -1115 -1359 -2094 -1376 -5454 -2349 5363 8174
12232 8174 8941 5319 5674 4627 -7005 -7082 3893 10338 9605 4481 4886 11077 6111 3822 910 -1297
12216 -1297 -2005 -6562 -7429 -9509 -5864 -3994 -6433 3682 14722 6568 -1157 3614 954 1817 6971
12201 6971 9783 11521 15464 17394 21080 18052 20644 15677 6147 7429 8653 -2571 -5841 -7333
12187 -7333 593 1515 -5055 -5115 -6608 -849 5905 6388 -2640 -6465 10 4477 -5759 -6509 7200
12172 7200 11051 -1536 -20014 -14798 -5704 -6416 360 8489 9255 6636 7329 3695 5038 10016 10899
12157 10899 8422 1870 560 1651 -4511 -10503 -19223 -12615 -6429 -3741 -2202 -3069 -3228 386 2331
12142 2331 -2523 -3070 -3770 -12438 -9626 -3160 -3234 -7036 -8555 -9942 -10942 -7478 -824 -4935 -5156 -1673
12126 -1673 1292 4184 9861 19523 15619 11408 12247 13699 4972 899 4858 7203 13203 3900 3590
12111 3590 12445 10963 8511 14611 15632 22256 19896 16181 5420 -386 -1308 -213 -1126 -6252 -3353
12096 -3353 3314 12714 14930 5470 8345 7995 3449 3841 2167 -806 -7953 -11662 -5604 6624 2273
12081 2273 4996 1831 1855 8368 4370 1987 4332 1663 -4255 -9067 -9638 -5008 -1193 -5085 -7629
12066 -7629 -11037 -17894 -20093 -3889 4003 5225 9940 12010 11807 19108 12074 6564 11190 11098 8458
12051 8458 7146 8182 5256 -3901 -5739 -3924 -9957 -11641 -2250 9736 2906 -911 3925 5199
12037 5199 8089 11301 11266 9872 -629 -3075 -3374 -8218 -6256 -4843 -7521 -7264 -7615 -4533 -1951 7607
12021 7607 9653 -2570 -3135 -5510 -3160 -10346 -22766 -18556 -12598 -2373 -7491 -9557 2328 1113
12007 1113 1731 -1214 769 1824 10770 4209 -1327 -6650 -13375 -14677 -15572 -21308 -15533 -10645 -8984
11992 -8984 -7033 -7207 -8693 -726 3292 7720 4482 4053 4961 11509 16541 15518 8926 3512 6655
11977 6655 1171 5415 11432 11453 5559 5642 9978 935 -5456 3723 6431 9694 9430 9705 15248 23964
11961 23964 41828 63394 79361 82773 90915 100510 108397 112420 109819 99702 86432 66650 46369
11948 46369 44530 37330 23115 8403 1311 -1471 -3035 6495 8853 -3036 -7037 -6402 -4112 -1272
11934 -1272 2410 11645 18602 8917 11400 10304 13186 8121 1605 710 4941 9867 10393 13967 20274
11919 20274 17340 16333 20098 14278 14782 17211 17999 20763 18584 11561 13579 7798 5804 7159 6206
11904 6206 12897 23960 21785 7783 877 -5678 -8171 -4521 -9587 -1086 4875 13745 16820 5588
11890 5588 -1344 -1282 -4524 -6775 -3019 7480 5333 -131 58 -1365 -8675 -12181 -4644 -946 2236
11875 2236 6258 -2083 -9450 -7084 4448 20631 33803 33108 32208 26208 20299 14769 8387 5060
11861 5060 11932 16439 9673 2065 6364 11217 4673 5612 10946 3415 -4352 -14237 -3845 -7713 -6189
11846 -6189 3483 11430 5341 7806 10454 7424 -2562 -8497 -4787 2191 12101 7176 1585 -1065 -5044
11831 -5044 -1555 7790 12223 15414 14006 8096 4396 -1242 1266 2233 7026 14741 18574 15474 14187
11816 14187 9458 6819 8340 1613 -6862 -7231 -1673 3739 5242 8577 16442 13400 -2118 -4324
11802 -4324 1378 14499 20654 18288 10374 2778 767 -2229 -6994 -9524 -4051 1871 7882 10480
11788 10480 4276 10090 10507 -3810 -9597 -5698 -3565 -8711 -8393 -6300 -7702 -1834 7167 9327 2403
11773 2403 8219 13619 12732 11857 3219 -2809 -2757 -2677 1225 -8613 -9273 -4739 -7304 -6213 2515 -1631
11757 -1631 -2312 7788 5595 -2590 -4936 -4721 6672 5947 11375 8132 9852 15727 7576 -6293 -12579
11742 -12579 -10779 -11819 -11548 -8281 -1995 6541 4563 -1958 -6150 -6162 -6956 8257 7167 6643 -634
11727 -634 -8978 -5875 -6204 1872 -296 -1577 -9588 -8290 -41 5926 2755 -5010 -13837 -4628 -4117
11712 -4117 -3538 -3844 1254 3382 7405 12572 13694 18463 18238 7064 2915 -905 6907 13327 6811
11697 6811 13113 4271 -1777 -3284 -3106 3835 -3 -2384 910 4970 10353 7081 5604 8033 13712
11682 13712 17863 21229 22385 16057 10056 14006 21586 19968 21954 27264 22823 19947 10243 3524
11668 3524 7046 13497 18494 20099 14021 8015 11360 10071 8099 1086 3582 11130 15320 17802 17674
11653 17674 20797 22227 24276 20123 13550 10775 10397 8953 9931 6676 6453 8547 21038 26235 24429
11638 24429 22113 27784 21768 19026 22901 27139 17856 14927 10539 12662 16434 8221 3752 11646
11624 11646 14430 26350 30418 27083 24252 17693 16146 11308 6237 14105 20529 22737 23795 25277
11610 25277 22461 22653 23923 20118 14888 11437 14187 14645 22541 36027 37255 31020 29607 27126 27193
11595 27193 35318 33934 27950 28949 29750 24749 20457 28059 28090 13849 13246 16224 16696 21769 33409
11580 33409 27524 22335 12094 1047 3445 16650 23717 19548 14317 19164 18591 17345 14833 5586
11566 5586 9858 15093 20822 26873 26216 14928 18884 25382 24304 24038 22821 27654 28184 28980 25185
11551 25185 15379 9384 9369 17550 27742 19319 15426 16656 17660 13881 11896 11515 12795 14320 25127
11536 25127 27441 22914 15271 11748 7573 9953 14513 15669 16500 12484 14816 19607 22753 25365 22010
11521 22010 16265 11628 12135 8433 8349 4498 8524 10234 17187 16095 9838 7525 16149 16022 17210
11506 17210 13640 9312 10827 16664 23576 29885 35252 30409 20849 13173 9765 13663 15870 19722
11492 19722 26768 25776 12614 1057 -2556 -1396 1829 8093 12223 12786 19521 17466 12957 10942
11478 10942 4406 18680 28930 33695 34743 27433 21271 21182 27833 18340 15765 17804 18404 15497 18109
11463 18109 13391 15492 23079 17946 14259 19938 19197 19365 26312 25132 32391 45781 46132 39112 38587
11448 38587 31062 23840 22077 35032 35809 32817 33648 36505 28760 24013 30925 27504 24149 20395 19530
11433 19530 22139 27372 27712 24728 21222 21277 25600 21931 25481 33903 31980 33515 34103 31909 24732
11418 24732 19276 16518 17094 20732 23600 24538 21917 16804 23135 33079 28015 21674 29479 36014 42316
11403 42316 39630 34378 26974 20724 28578 37662 37103 39986 34448 34930 41889 41094 34778 36539 36759
11388 36759 31336 29892 30847 33478 30342 29149 31078 35817 41824 40062 49063 46239 41003 47794 46171
11373 46171 36913 33761 40047 31760 38428 49182 45499 33641 40480 48030 43577 51465 52684 40388
11359 40388 32471 39102 46556 51605 46399 50084 54840 53309 47217 50658 49783 40977 38653 44602 49215
11344 49215 45849 53347 62949 60833 59609 57583 57982 54907 55864 50381 47629 41061 37959 41617 45533
11329 45533 47124 47665 47654 54298 64532 65032 67224 72705 68287 57691 54055 55763 61709 60268 52979
11314 52979 60120 59654 52827 57736 62616 54752 56679 60056 58680 58383 65450 65984 64930 59158 56160
11299 56160 63917 69644 58645 49869 55434 68458 72374 67180 60800 57271 53541 57769 56047 60071
11285 60071 62690 65256 74176 72167 73784 76406 75456 79280 81794 77835 76953 73646 76138 71791 64513
11270 64513 71277 83097 84736 85362 78309 79777 84706 88708 80965 78682 82262 80053 80666 75438 74125
11255 74125 92217 101495 93456 87156 93970 96777 93931 94484 92306 98190 106710 107770 116318 127727
11241 127727 142452 176183 205289 216639 205063 173612 149533 135355 133845 131597 137774 135169
11229 135169 139327 134136 133973 132494 129171 126390 129095 131625 129375 127904 123296 129627 137726 139590
11215 139590 124535 125491 130896 122311 121935 127131 131002 133556 136877 145304 142419 135119 133247 141509
11201 141509 145814 147198 148344 137639 137605 151241 160155 161143 163694 171780 176440 174856 166035 161479
11187 161479 160315 165011 165084 159380 164824 165719 166149 170439 181914 187103 192823 194569 188949 187841 192442
11172 192442 179764 171286 178293 199346 206777 209996 214268 216369 208589 202317 193802 193081 202861 205893
11158 205893 207916 205540 202548 212995 211025 217082 219327 217959 229802 237515 241774 237961 236239 249719
11144 249719 248969 243612 254279 269086 261315 255136 260857 268069 277329 275112 269041 270383 271639 271598
11130 271598 273655 284095 283943 281439 290304 298753 301352 300585 296869 296212 308231 319713 329063 330901
11116 330901 328860 332919 346698 353126 350063 338413 335528 341112 344301 357171 362591 364539 373837
11103 373837 385457 386654 393584 401288 411144 407093 401674 403655 416766 422029 425832 437604 444264
11090 444264 440887 446871 452365 462437 472369 479035 482846 476777 481894 489237 501064 506126 520399
11077 520399 531630 532242 531549 538804 540679 546271 547387 549043 555768 575120 587368 596146 593895 600477
11063 600477 603613 607312 622382 639250 643237 646458 650885 659630 668364 670717 683278 695177 706900
11050 706900 715020 723642 727311 740994 759006 768489 776093 788343 804217 819947 828867 839285 847224
11037 847224 853724 856134 873814 898336 912774 911062 919996 936388 950714 971195 993621 1000828
11025 1000828 1007097 1014317 1026495 1048156 1070764 1087286 1103542 1117979 1130465 1150744 1159827 1179434
11013 1179434 1186989 1194910 1205636 1221773 1237780 1252210 1266611 1285347 1300634 1319691 1337251 1348086
11001 1348086 1368144 1398642 1418769 1433077 1453279 1461174 1480205 1505800 1526899 1538164 1554803
10990 1554803 1575192 1589691 1602947 1609207 1633122 1652525 1672433 1693125 1700270 1717420 1728274 1749663
10978 1749663 1772240 1789142 1805611 1821905 1841971 1857143 1870478 1885465 1898292 1907246 1931140
10967 1931140 1947463 1960289 1970735 1974316 1988573 1982287 1982368 1994601 2006121 2019860 2024872 2027369 2034430
10954 2034430 2041346 2043144 2041767 2044798 2054446 2055602 2053812 2054188 2051256 2055129 2062678 2060619 2049309 2046460
10940 2046460 2049534 2043545 2036525 2019101 2002140 1996733 1994131 1993743 1999329 1996083 1987855 1984911 1982656 1955044
10926 1955044 1932417 1934555 1926521 1914675 1904752 1884567 1865467 1854124 1843700 1830013 1813315 1800135
10914 1800135 1793450 1775815 1750619 1730331 1720501 1714291 1709595 1710021 1705766 1710154 1708914 1698160 1689153
10901 1689153 1677896 1653710 1621532 1595858 1568488 1538827 1508047 1490266 1464714 1448345 1435519
10890 1435519 1415236 1395840 1380478 1356962 1349044 1340458 1328526 1323052 1305644 1280001 1261670 1248847
10878 1248847 1232335 1228168 1222341 1219066 1216553 1205004 1195005 1177671 1168474 1157446 1139376 1123240
10866 1123240 1117871 1124912 1131351 1128375 1124374 1117112 1117477 1111570 1105423 1100717 1100301 1089955 1072096 1050647
10852 1050647 1036007 1020181 995902 982681 980155 965617 939617 909953 899061 889904 873370 870625
10840 870625 865978 860991 847669 831865 813063 792947 789870 788874 772576 755704 742928 734762 726906
10827 726906 723170 725441 720714 711997 705212 696087 685546 679986 677592 665299 655758 663343 676910
10814 676910 683157 676343 684476 699376 711532 722517 706676 681017 661761 644648 627077 613574
10802 613574 598575 580931 564821 556178 549053 546560 534424 530616 528490 523621 515800 503377 504270
10789 504270 499892 492221 486298 476098 475729 476770 474046 470871 462396 464312 459367 449252 444101 449442
10775 449442 445209 441864 446008 445842 446525 442218 431222 416987 408027 410957 403203 403502 404087 396057 388500
10760 388500 383788 382435 390754 381313 382321 376228 365965 362397 363324 371015 370957 361580 366329 371524 366892
10745 366892 367648 371922 372102 372127 364011 366807 359959 364693 355299 344754 343485 351037 347310 342706 338341
10730 338341 336345 320888 313005 313289 313833 321293 329478 323063 314469 320173 318863 318006 320784 313280 308747
10715 308747 303744 296284 293812 309737 315131 308584 295859 293708 294129 301522 299844 296420 288267 286902
10701 286902 294428 289727 281166 286661 296685 290156 283759 276616 274831 270907 274263 276034 276804 275379
10687 275379 269088 272412 277078 280754 281085 274462 257065 247014 240398 242566 244605 240985 245000 256901
10673 256901 256358 243712 231358 216713 217225 224750 224135 229254 236001 232841 222961 218985 223725 223763 222732
10658 222732 226538 222688 213096 218925 222737 222774 222858 222520 224772 231416 230078 236769 242776 245171 262368
10643 262368 279571 290832 299258 307385 315986 303484 273259 255901 248728 231666 221909 222324 226348
10630 226348 221959 221456 222901 219564 222622 230484 231075 223223 215694 213922 214102 216360 220779 228433 230901
10615 230901 231632 234143 236947 240020 242358 258708 274763 299280 323955 340487 349399 357285 359114
10602 359114 345671 325373 298521 275362 272827 278201 285115 296299 303507 295596 292995 289444 281937
10589 281937 266700 245154 226291 218396 212142 208199 205049 203004 205180 201638 198451 200166 196907
10576 196907 202584 206135 210889 216463 232241 263039 304243 342326 370714 386378 380583 368667
10564 368667 362330 357178 367380 386767 409667 447591 500459 573504 683177 826529 1000667
10553 1000667 1192826 1374881 1513458 1554458 1510126 1380818 1195943 996873 822787 679231
10543 679231 563131 484498 431784 402976 385237 360443 337808 321533 319852 321251 318545 315043
10531 315043 312155 317048 312363 309307 306678 307346 316397 337304 359248 382677 409538 430936 446754
10518 446754 458675 488979 518962 547743 573808 598080 612273 621495 622160 643109 672066 721573
10506 721573 789800 879092 995507 1128130 1270984 1421855 1593280 1791220 2055120 2430857
10496 2430857 2969973 3764092 4960758 6676905 8956643 11654029 14317381 16326662
10488 16326662 17216831 16814905 15262957 12961079 10449935 8164522 6322024 4963329
10480 4963329 4000106 3332111 2872122 2558676 2330357 2157087 2015606 1892039 1789019
10471 1789019 1710560 1649088 1605208 1581223 1573049 1594626 1642527 1741002 1907715 2167400 2565141
10460 2565141 3102686 3747886 4442831 5058852 5456711 5607910 5616021 5683929 6023968 6843662
10450 6843662 8328619 10636265 13743164 17357646 20924248 23807712 25559635 25908548
10442 25908548 24745300 22317979 19261631 16367756 14286202 13246580 13070113 13221211
10434 13221211 13091800 12244197 10722596 8952840 7340197 6149139 5436283 5153689 5229615
10425 5229615 5473249 5637544 5461398 4917917 4167247 3432970 2850228 2437885 2152184
10416 2152184 1963752 1851284 1796702 1790758 1833289 1914728 2030255 2171703 2332649 2504293
10406 2504293 2702328 2957021 3331095 3882723 4707538 5946983 7773133 10320186 13549986
10397 13549986 17112571 20281055 22190055 22292416 20609579 17647342 14186138 10956895
10389 10956895 8355891 6436200 5093626 4166605 3487096 2950998 2532503 2201543 1937813
10380 1937813 1713336 1510350 1333437 1183710 1062514 968487 874240 801761 738482 681499
10370 681499 624162 577148 541886 519507 503185 482077 466350 439364 415083 396213 375872
10359 375872 373507 371849 355820 344047 329586 321373 312247 318823 324437 330459 343451 343219 324468
10346 324468 298439 268107 257485 251383 230368 223964 206220 194576 195642 204008 216574 234600
10334 234600 250675 254105 266655 284851 288640 274293 246031 231461 218347 203022 188715 173001
10322 173001 162372 175903 192148 204025 199324 214463 221881 218693 214131 203289 184656 160416
10310 160416 144368 139998 142160 140619 142417 146343 140006 134211 142934 157493 163679 150967 133136
10297 133136 120779 119709 125989 142326 153178 172388 182284 172802 154651 134418 113799 98169
10285 98169 101508 122195 149510 184449 221172 252719 267610 251665 231027 211514 197692 186698
10273 186698 180864 177787 170263 163433 158695 160706 153908 157041 164826 166826 178789 212631 280340
10260 280340 378551 453393 449442 398257 363768 325726 295131 282088 273618 267995 256322 242944
10248 242944 236590 226742 229527 238111 239057 243294 245946 242948 244512 244527 235162 222890 225168 233632 232258
10233 232258 224198 218031 231927 247420 257802 276875 296473 302425 292278 288018 284861 292481 306776
10220 306776 311409 296714 280621 277671 285304 299732 315616 323572 324011 331266 345521 362825 383000
10207 383000 405451 421703 434720 452928 472143 490505 505525 523275 531350 535306 544985 563826
10195 563826 580630 607546 633187 653293 667268 694958 723238 741785 755216 774474 780110 786344
10183 786344 799098 804802 810528 821272 838703 874214 926155 984435 1027367 1079848 1136489 1182207
10171 1182207 1233545 1322436 1438534 1598329 1805746 2121181 2600034 3233291 3748165 3788388
10161 3788388 3501205 3328868 3440369 3754343 4243541 4919612 5685219 6350131 6965122
10152 6965122 7620500 8256961 8945250 9808474 10754245 11609046 12526469 13681126 15126624
10143 15126624 17005260 19600313 23352378 28824797 36892665 49370346 69694587 103356260
10135 103356260 157572999 235278367 316415392 347986850 300603149 217280281 147007683
10128 147007683 100950512 72434570 54218795 41865060 33124861 26854282 22245200
10121 22245200 18757793 16159971 14385389 13294729 12594333 11908742 10965788 9794831
10113 9794831 8620526 7582993 6680118 5892201 5226821 4666999 4203989 3839758 3549990
10104 3549990 3304282 3069691 2829279 2612479 2447735 2313875 2217058 2136817 2062517 1988014
10094 1988014 1918440 1836944 1754768 1700461 1663046 1594013 1497253 1403325 1322793 1248845 1171538
10083 1171538 1086422 997871 939055 900105 862104 820853 784045 754235 738043 738685 744206 742458
10071 742458 729980 716179 703149 692152 663042 627287 606636 582081 575862 581892 576456 571197
10059 571197 570392 566289 559163 553618 546935 543247 540247 522384 503829 499815 499095 487029 474338 458767
10045 458767 440548 419538 413629 413980 407281 390808 368522 361646 381783 414065 448036 480556
10033 480556 489057 478706 466434 463876 473113 484422 480870 467936 453759 439518 422199 394288
10021 394288 377343 374790 373166 376152 380196 382311 382914 370706 363713 377329 377347 364360 355439 342215
10007 342215 344487 338713 325451 337112 356024 363465 358032 351088 345204 338893 340582 336634 324503
9994 324503 308113 292203 282744 283967 283568 266896 253032 238162 220144 210095 212668 243899 279964
9981 279964 314331 344071 378022 394964 388915 360426 345586 340334 333402 329968 324851 311201 303123
9968 303123 301576 289065 264165 253280 243758 231060 237062 252575 265599 272813 276408 265972 260404
9955 260404 254261 251577 237693 212975 202938 191247 174688 174813 198252 222672 254029 323025
9943 323025 467494 686864 893158 893475 665404 442438 299552 213444 158485 125520 115156
9932 115156 118759 142421 167536 170070 186635 189569 180858 166971 156465 160149 164235 160289 151449
9919 151449 139533 124096 125055 122536 123288 129626 136624 143970 150584 145160 130453 126582 126982 115588
9905 115588 121296 131048 129669 130020 122703 112665 112494 111406 102213 100556 101216 94042 82990 72647
9891 72647 68083 68410 77665 79681 83763 94130 106674 115786 110870 109869 121585 129536 141148 152502
9877 152502 155923 153704 155819 147939 138070 135348 137529 140767 138674 138687 139279 141489 132811 124525 116672
9862 116672 112996 110266 113792 112243 110886 105612 108667 111435 110726 112704 128728 138761 133667 134392
9848 134392 145271 139096 119184 118868 121749 119785 115273 108395 107838 106304 106167 116590 110235 105483
9834 105483 102368 106746 118134 132107 149100 155495 169764 188946 198915 193275 177318 167553 161398
9821 161398 154432 146897 152648 162934 165982 151999 131300 122717 123683 126950 134896 133373 134508 132616
9807 132616 131352 132960 125815 121203 123538 132514 130571 119947 117723 120493 126075 128913 127562 123508
9793 123508 121163 129062 145518 150109 157587 173114 195748 212397 217419 226963 244091 254243 253541
9780 253541 256833 265100 279513 294989 298126 300432 300613 299408 295439 302624 330592 359949 390228
9767 390228 424395 471644 524206 588912 657483 737803 851218 1001590 1214554 1520400 1966330
9756 1966330 2604354 3434060 4363342 5132996 5580828 5696400 5415124 4715916 3825285 3012770
9746 3012770 2391929 1958505 1646379 1425050 1273109 1169087 1092499 1045338 1016052 993474
9736 993474 967054 935445 915444 910297 927813 957567 1010346 1091780 1210915 1367971 1573292
9725 1573292 1838196 2156925 2456687 2638816 2731630 2848451 3112718 3587765 4376160 5609865
9715 5609865 7460209 9990056 12859613 15125330 16049674 15683097 14340169 12618707 11230847
9706 11230847 10491530 10245770 10129648 9781370 9150747 8312112 7290649 6122741 5050210
9697 5050210 4228105 3651703 3251133 2999718 2870321 2861462 2924623 2950271 2843232 2697894
9687 2697894 2620584 2682334 2883174 3236256 3700931 4034227 4003860 3775473 3644421 3740942
9677 3740942 4093078 4768674 5877670 7530300 9680113 11750658 12760214 12528309 11731863
9668 11731863 11031365 10894013 11568623 12999591 14706283 16044897 16763751 16951851 16644011
9659 16644011 15432622 13357143 11103326 9077868 7397993 6118320 5235584 4724440
9651 4724440 4545149 4537342 4364755 3909390 3377278 2977756 2737809 2639980 2653782 2713811
9641 2713811 2705298 2556937 2364624 2247235 2225131 2314889 2535426 2885839 3372168 3916964
9631 3916964 4328986 4409408 4300299 4294343 4569674 5169704 6089154 7258485 8553913 9913609
9621 9913609 11352236 12758478 13706783 13707990 12829424 11338990 9373822 7357799 5715588
9612 5715588 4548868 3778616 3302932 3000740 2723381 2377018 2016118 1714598 1497346
9603 1497346 1335061 1210523 1106905 1014375 924379 867637 824749 774441 753159 738235 737454
9592 737454 727246 724785 743352 774995 822270 883276 962622 1084538 1239287 1469104 1818838
9581 1818838 2299184 2899898 3539376 4005026 4209157 4195424 3927432 3356314 2661807 2043517
9571 2043517 1572356 1242450 1004190 829667 701912 608809 527681 478517 441455 402460
9561 402460 371727 349783 315725 283852 255829 240394 234267 227492 223205 207609 199310 190667 198745
9548 198745 200771 182490 170744 171328 167491 162770 157143 153484 151539 158593 157008 149757 146132 146258
9534 146258 151982 154626 147588 143674 140285 128932 124414 132927 131063 125862 133918 124033 111374 113525
9520 113525 121954 114093 108630 113350 110255 104568 100750 98492 101016 98281 109129 102424 101961 100298
9506 100298 76290 79289 90368 89598 88334 87141 91029 93632 88304 83694 76750 84651 85786 91000
9492 91000 96733 95483 96652 89477 77146 67961 80331 84624 86197 82619 84974 82592 76953 81310
9478 81310 96326 97056 88143 84520 79404 64077 53403 57243 61433 63839 72116 75444 73490 74602
9464 74602 80557 67070 68478 77394 76702 78372 74157 89176 87291 83492 80557 72280 72656 75860 79298
9449 79298 78739 79673 74142 71049 65179 65376 62328 63039 64789 62922 62773 51905 41804 46270 45948 46398
9433 46398 49317 52139 54317 63979 65518 60503 57985 51172 52374 65857 82783 92389 93660 82911
9419 82911 64792 58047 53868 57300 64133 61963 58126 56520 65630 63030 63273 64591 65003 61011 52622
9404 52622 51757 47434 41054 43805 48528 53119 45604 40731 37694 39140 42931 45021 48231 48182 45993
9389 45993 43527 50587 61455 59133 42897 45184 51303 58920 68895 85897 89368 93506 96747 90179
9375 90179 76552 70344 68924 61748 59359 53737 45254 34739 39532 41602 44457 34335 33098 42647
9361 42647 50119 49949 43722 50412 57696 57740 61522 62257 60435 58545 62574 63956 68579 77092 83354 75362
9345 75362 73347 65903 62187 71963 73930 72020 71948 76174 88560 102306 104904 93921 95994 94554
9331 94554 95268 95093 79151 67250 69861 68452 69369 67948 70216 68597 61510 53192 56822 59226 57000
9316 57000 52126 57677 62690 63228 70604 84519 109395 131855 155781 173495 173677 157652 145430
9303 145430 148104 144104 146431 143803 136445 136306 131133 119589 106119 92377 84361 86803 81322 78021
9289 78021 70255 61733 61822 70649 73327 70938 75027 83393 88322 97102 105158 117886 133996 145127
9275 145127 136659 117805 108072 110642 123103 144443 167082 184866 196337 196158 187866 198974 216969
9262 216969 238356 252718 248063 223913 216945 219755 214408 206550 191649 170016 143733 121444 111903
9249 111903 107562 101168 98543 112031 122288 141378 173297 212716 238361 238239 221326 191782 155355
9236 155355 126493 123165 127675 126343 134839 144932 157468 154831 144753 142602 145613 150719 158616
9223 158616 157533 150587 148211 144329 145514 142706 130156 127821 127964 136445 144917 132670 111527 99879
9209 99879 94735 102107 105481 109572 122164 119951 109434 102422 89186 70017 66142 61043 55084 52950
9195 52950 60063 61899 59465 58238 48967 43245 29858 18681 22478 26121 27631 24358 24480 23020
9181 23020 22106 26753 23713 28898 32803 30247 35606 45887 45798 53194 52983 48982 47519 37898 33574
9166 33574 29723 30308 27788 29770 36506 26089 19004 19713 23675 33440 32416 23312 26406 19933 18243
9151 18243 18119 26888 23238 30652 35328 39023 31597 30251 34497 32360 21369 23133 27586 22716 16870
9136 16870 17878 26357 25136 20485 22171 25850 24875 18466 26092 34958 34221 32717 31694 37729 32287
9121 32287 29683 28285 22304 14846 18167 20785 17570 17629 27914 34271 39746 30539 20606 15761 18207
9106 18207 26905 23212 12574 12699 16075 14142 11472 14508 17593 23442 30817 40132 27137 15310
9092 15310 10573 9499 16660 27958 29604 24906 24350 20100 17842 12891 15634 24349 29971 22825 30459
9077 30459 30215 24842 18636 15128 13888 15484 13235 13646 18749 26206 20356 23171 27618 22268 17412
9062 17412 8983 9886 15513 27514 27084 25209 32049 20638 7237 2504 652 5642 15863 19793
9048 19793 19262 10412 16282 15242 12129 18108 23872 27861 26009 30929 26745 17376 13151 16153 20153
9033 20153 13457 8664 2181 2974 10923 14497 20313 13402 13586 19091 20597 22419 16659 7963 1219
9018 1219 -784 1847 2418 6041 6911 5421 4298 11491 19300 22260 11228 7199 17231 25287 14224
9003 14224 21242 30266 38281 37419 18780 5020 6520 13771 23666 30653 25128 11686 12538 29059
8989 29059 27261 25778 23468 20375 14780 19472 22719 23294 15252 7546 12162 10294 14051 16592 21482
8974 21482 11531 4274 8476 7125 5293 5737 882 -13314 -21091 -14409 -7959 3975 9951 26893
8960 26893 34544 33512 28301 36755 34626 24879 12647 13427 20181 24950 15833 10967 10843 6245 8145
8945 8145 2521 799 8043 20918 21298 18894 13383 13855 20082 28899 21770 3095 4109 2242 3891
8930 3891 9179 7842 11895 12952 2616 3430 4801 -1896 619 6765 14994 20339 10839 8975 10158
8915 10158 5050 6077 12267 12886 18741 17562 14055 12864 12681 9211 22006 24929 19456 8813 11738
8900 11738 13595 18584 26725 22756 23542 21702 19380 24812 25192 22640 23058 9172 10053 13131 10697
8885 10697 5402 12644 9013 3637 8523 20634 27590 21368 23171 21168 25021 29553 23757 25181
8871 25181 21479 14470 11473 2663 -784 1887 1348 880 7934 13910 10685 8205 6905 15718 16563
8856 16563 10976 9099 13067 10673 4809 -3638 -4140 -7 4568 4309 6529 18003 19083 30384 42405
8841 42405 27494 10872 -3237 -4245 2162 1445 1385 3065 8651 13103 17955 16351 7483 1734 -4019
8826 -4019 -3216 3495 -3738 -1514 900 1159 -1161 -7902 -9915 -9345 -6975 3335 6331 2359 9746
8811 9746 5299 3835 3017 -2561 1740 3962 7283 6709 -2709 3168 4818 2121 -3809 -4242 -749 176
8795 176 -1520 -3917 7275 9533 7747 6418 2305 -1038 5610 10814 14234 10295 10611 15166 13172
8780 13172 14886 17504 8042 8098 6114 12145 12271 13925 11002 7649 2670 7590 12785 18533 12609
8765 12609 3700 -7675 -10084 375 7700 12141 32585 25729 16234 18805 17167 14783 15802 12277
8751 12277 20374 20871 3607 2244 9937 16043 14735 3219 4697 615 2580 5152 7593 12346
8737 12346 15345 7701 2752 1269 5282 13250 19629 18323 12600 5092 9457 13166 15889 13482 9863
8722 9863 7731 14833 7411 843 1729 5500 10745 12046 13131 13927 18749 22301 17208 3900 14
8707 14 10424 19851 23114 23764 30699 28963 7161 3958 8916 16494 20747 13061 8264 2473 5785
8692 5785 12092 12924 10080 10572 1519 -6970 -5309 906 -9927 -23521 -20582 -16516 -12181 -5439 1924
8677 1924 -1684 1868 3933 1003 3797 -470 5210 21001 26831 26870 27250 22655 26178 26335 19864 9204
8661 9204 6494 13270 10483 12208 2138 -5650 -4046 5429 11644 12531 15368 16809 20346 19574 8215
8646 8215 5408 952 -7615 -9965 2050 10409 4511 -1204 -3263 2257 5302 13402 12914 10559 13638
8631 13638 13208 13690 10354 11708 14304 16825 20164 27304 25635 12189 21480 29364 23829 11458 4497
8616 4497 2431 4238 7357 4149 -2612 6729 9433 15479 24912 33036 35058 27511 22780 23410 32058
8601 32058 40230 51286 58216 50720 51142 71066 90813 99585 90078 90762 91159 82572 58711 46890
8587 46890 44209 38142 38107 37052 30997 22428 22038 24934 21040 16293 16116 20480 20573 24432 19778 11959
8571 11959 11057 8055 5657 8459 11618 13269 12432 15657 20560 7167 -117 8805 8488 7388 7179
8556 7179 -4612 -11369 -8316 -3932 -5884 6126 8649 9250 8209 6246 11273 9752 12461 9766 6973
8541 6973 6545 1052 1758 3226 429 1021 -1649 -5829 883 2898 717 3670 8581 12152 4751 2143
8525 2143 -1593 -2439 -5283 -3669 9385 10856 6742 -259 204 3370 6540 14211 10990 7085 6235
8510 6235 -1474 2150 1480 2548 14156 8213 -5504 -7397 -3471 2894 2004 200 5406 699 -9690
8495 -9690 -7216 7723 8122 7144 7690 6271 7722 17563 22507 21224 16315 18480 12323 15812 24826
8480 24826 26672 28764 20291 16288 20315 13885 5860 6518 2536 3060 3703 7798 1503 -3016 -1237
8465 -1237 5288 6907 16519 19639 15342 15948 20849 14304 11681 13740 13454 7826 11511 6483 2743
8450 2743 9756 7846 -700 498 11495 20452 19947 14961 15942 18251 16025 12846 7068 5565 8354
8435 8354 18682 27191 29959 22926 10784 7931 9194 10788 1606 6823 7661 -356 -12967 -8206
8421 -8206 5688 7493 -391 -1143 -4649 2982 6453 7282 7269 3155 876 -1341 -792 799 2537 13214
8405 13214 18000 2122 -10204 -5877 -1073 -2002 1264 327 -1789 10576 11581 6195 2217 -2368
8391 -2368 -515 -4 -3731 -3985 7390 3098 -1516 671 -4565 -7659 -5939 456 10647 22716 15775
8376 15775 3306 -4544 2426 3912 8614 9641 5783 -9408 -9469 -2485 -1605 -3873 -4283 2794 614
8361 614 6052 -817 -16401 -14501 -3872 2151 2197 5468 4526 2218 -2374 657 4675 3419 -966
8346 -966 -743 -3501 2766 5949 3962 9554 6614 5195 -1547 -9867 -10413 -917 5822 13458 7326 6077
8330 6077 8108 830 -177 1461 9313 8668 6650 8956 9085 8653 9378 6231 3596 1717 -1174 -4794
8314 -4794 -12065 -4088 1263 5097 15495 14841 14308 9482 -915 -7686 -7203 -2539 -8009 -7290 1768
8299 1768 432 -1773 714 380 -5790 -4920 -478 503 1988 -119 -5062 -6025 -5940 -10067 -6352 -4804
8283 -4804 -446 -6483 -5326 -5355 5636 16903 26101 21410 12144 6559 2703 3347 3104 3618 4476 1569
8267 1569 -3420 -8595 -9636 -4335 817 10126 5174 4556 12993 5957 9129 -935 -1054 -3648 -5774
8252 -5774 -10115 -22027 -23033 -12497 -6338 -811 -1510 -1955 2903 6549 7 -4668 -7404 -11425 -12711
8237 -12711 -4215 5715 5182 8711 14774 2026 -6561 174 -172 -5044 2916 9851 8766 5494 3230
8222 3230 -1936 -7063 2032 10313 8165 3510 -1794 260 2159 -4191 -2024 908 -6676 -4051 946
8207 946 -5521 1040 12020 15959 14311 15256 8601 -1219 7100 12188 18379 26164 29856 20972 4642
8192 4642 -3996 -2086 4880 3719 -2043 -2522 4062 7779 7686 5515 -324 2382 1127 -2568 2359 768
8176 768 4836 5290 6194 3017 -4596 3922 15903 10128 1843 -3945 2491 11751 13677 14016 21425 23359
8160 23359 7672 -8410 -3906 -4997 -6996 -5879 6548 3483 4282 2449 -5040 -1693 -2324 -8273
8146 -8273 -5630 -8838 -6278 -12575 -9685 -3425 -3645 -8555 -5532 -4294 -3500 -7348 3137 3682 -300
8131 -300 5926 17148 23242 25305 23850 12931 14908 15597 10161 5095 4107 5278 3286 10052 15260
8116 15260 9604 5973 -3177 -10509 -11228 -9430 -4084 -7623 -3770 -4496 -3227 -7168 -8445 -6877 -5919
8101 -5919 3363 3764 3261 8738 4620 7814 14147 7159 2523 131 -3728 -5204 -2157 1382 1668 2266
8085 2266 1924 3514 20304 20294 12069 15977 3382 -1972 4000 7766 10383 8699 13780 19393 2377
8070 2377 -13757 -11245 -6958 -8029 -3250 1167 1397 -4348 -436 7346 9458 10280 7407 11730 11243
8055 11243 8445 4323 1811 7272 2605 1459 5574 7040 -40 -12797 -3290 8843 19263 18567
8041 18567 19970 19360 17709 20245 16165 11355 9042 7354 6028 1869 -4449 -6029 -1644 -7503 -12773
8026 -12773 -12227 -8109 -7031 -9751 -11050 -11653 -13102 -6650 809 3106 4983 5383 2531 7990 21112
8011 21112 27887 24789 17117 6683 1544 5017 6980 9714 8214 4480 -3834 2927 22338 24929
7997 24929 17396 16144 10459 -1678 -7421 5033 14015 9599 11062 12675 16376 16153 22661 19795
7983 19795 24072 22384 22530 13273 5462 -739 3245 933 12654 17962 14642 13758 14619 14985 15164 19730
7967 19730 11971 1981 6241 4899 2899 8168 2600 411 6499 3945 3239 4301 3981 1625 9460
7952 9460 18453 14919 10393 4737 5910 3956 -1820 -6755 -10890 -8051 -3289 1632 2230 2896 -304
7937 -304 1611 4914 11049 15998 8259 2440 8064 12368 13641 16314 16051 18581 17124 21444 17091
7922 17091 9487 5817 11314 6988 5265 3141 6109 9554 9213 12136 8548 -1024 6501 11500 10503
7907 10503 14525 22120 27909 26216 14375 12080 10416 10362 10751 7685 10573 14180 18251 14082 14251
7892 14251 18513 19141 19820 22310 14038 15837 9012 6331 8168 6060 1518 -7985 -6831 -3982 -5332
7877 -5332 -17237 -18165 -9617 1684 3667 3142 731 6122 16679 22655 26418 31714 14847 6437
7863 6437 -1454 -5328 -1184 1477 -906 -9205 -4811 -566 -2794 -6786 662 8888 13822 20588 15320
7848 15320 12708 20070 17163 6300 2774 -3289 -5600 -1310 -2998 -522 11815 16589 13768 15610
7834 15610 15440 13776 11679 15561 21144 17040 4325 -2345 -3518 -1424 5113 -4727 -4635 -3876 -8674
7819 -8674 -2875 -4149 -2923 -1877 547 6710 16114 16946 7604 204 361 -937 -5984 -2130 9959
7804 9959 22963 19940 13794 2963 3552 -6992 -6516 -4456 -1811 769 2034 3500 -83 -4658 -5154
7789 -5154 -191 3815 -249 2350 6598 3312 -5392 -8419 -331 5954 8606 7133 -492 6308 14958
7774 14958 17720 16229 17630 16694 6564 -4719 -6514 -11314 -15841 -9727 -9222 -5702 2609 3261 -8574
7759 -8574 -11593 -7007 -6099 -8310 -3837 -3547 4428 5195 -2854 -7460 -1636 6830 10695 2817 -2563 -8106
7743 -8106 -12255 -6442 -6836 -11709 -15448 -7226 -56 2849 7908 4781 2902 -7495 -12943 -12929 -6776
7728 -6776 -6947 -9349 -1724 4756 7919 2593 2161 14648 15398 10378 5719 -3751 -10755 -12222 -3250
7713 -3250 9976 15254 5830 -13957 -23322 -17582 -15628 -5812 -9757 -13434 -9068 -8186 -8403 1974 -78
7698 -78 6391 7446 3970 -5014 -2757 1354 -5687 -3717 -5570 -3293 7494 11006 18861 17388 22066
7683 22066 32578 29306 23930 19139 12416 3287 -5714 -5060 -11235 -3634 4441 8346 9874 23520
7669 23520 22523 10043 5845 8180 7808 9512 6767 -344 605 -3639 -5520 -8117 -11402 -186 3113
7654 3113 -777 -4560 -3972 -1207 -6549 -7883 -10079 -10599 980 -11386 -24757 -18617 -12399 -13723 -10674
7639 -10674 -12690 -12497 -10624 -16123 -10531 -6693 -3633 3242 14500 19082 15024 10036 3722 2699 3592
7624 3592 -703 1127 -1443 -1595 -16205 -19475 -7285 -5662 -3001 4789 11921 13984 11974 5145 6275
7609 6275 371 8682 8819 13822 10229 2578 -2320 -5823 -8330 -6924 -8890 -20039 -13211 1001 6893
7594 6893 2324 117 -1661 -7361 -11708 -9014 1373 4307 4217 8638 6435 11330 14994 9102 4773
7579 4773 -8077 -10937 470 -1075 -9120 -12662 -10956 -11987 -17739 -13517 -15655 -5672 2718 9117
7565 9117 12352 2888 2829 -1093 -4482 -9098 -10534 -2011 -901 -5487 -4040 -2006 -8394 -16403 -16449 -5013
7549 -5013 -2192 -5117 -11645 -3799 885 10724 8891 -254 843 4473 4121 5490 -779 -624 -2683
7534 -2683 388 1091 -3182 -2047 1713 -1118 2344 10262 14900 15041 16335 12504 13760 12477 1960
7519 1960 -3119 -4626 -1974 -3753 -472 -789 -7456 -19600 -24182 -16792 -13554 -5342 -4685 -8778 -10309
7504 -10309 -9320 -12127 -6838 -4204 -12376 -16028 -16711 -12138 -4310 89 6169 1174 -6277 -10225 -9419
7489 -9419 -4020 1597 -1508 -6358 -19738 -18382 -19922 -17267 -4819 560 -2245 -3223 1670 2483 2922
7474 2922 -85 -2870 -1860 930 1431 5353 -2957 -9469 -6358 -1276 5604 5231 -5436 -7620 148
7459 148 243 1256 -6435 -11079 -3706 -2459 259 6270 9780 267 -7022 -12595 -6009 -8368 -5381 -2367
7443 -2367 -3158 -7651 -6434 8040 10456 8738 -738 -9634 -6064 -3258 -5930 -5622 -6288 -3007 -7839
7428 -7839 -197 14132 13432 3495 -7345 -8740 -372 -5152 -13534 -16575 -5123 757 4004 5896
7414 5896 1282 -3735 5376 8115 395 -10289 -2995 -2008 -11847 -4298 -6346 3459 19080 18700 7652
7399 7652 -426 -4281 -11688 -8812 -1995 -1473 -5983 -3646 2842 -2456 1218 2479 -3987 -1301 -4134
7384 -4134 -13167 -21492 -20429 -2356 6162 16378 8917 -4387 -3575 -3365 -671 2320 5330 -6080
7370 -6080 -5409 -724 7464 9409 4468 4776 5758 3037 1413 -2774 -5446 -10582 -11554 -6490 -1411 -1735
7354 -1735 -6705 -10832 -8622 -14732 -15354 -15873 -11599 -7659 -4999 -2757 -7396 -9590 -7511 -2473 1212
7339 1212 -588 7122 17233 13372 1175 -11010 -11289 -6816 -7532 -3969 -4921 -9394 -4671 -480 4667
7324 4667 10316 7248 8740 -565 -5166 -4978 -1049 -2430 1329 148 -4806 -9841 -10453 -4290 -5653
7309 -5653 -8577 -5759 -2526 -10052 -11342 -5149 258 2386 -2580 -5160 -3577 3488 13565 19343 11869
7294 11869 196 -17448 -13629 -6815 -11169 -6029 -2388 -5921 -9316 -16048 -20684 -27807 -32543 -29106
7280 -29106 -18556 -5835 5101 3808 1033 1715 -4867 -5187 -5030 1760 -750 6651 12084 2906 528
7265 528 -750 2578 2919 9859 19200 15545 8910 4510 8335 5168 -2915 6221 6527 -9813 -20749
7250 -20749 -18822 -19893 -23304 -20703 -20756 -17946 -14957 -20232 -20266 -14679 -11299 -19676 -26670 -20330 -10880 -2774
7234 -2774 4802 1011 -13634 -8283 3179 10109 11624 11395 909 2733 3155 -1142 -12984 -11435
7220 -11435 -6134 -3478 -7152 -13585 -5960 -2820 -52 173 -2710 -6109 -14361 -26072 -25639 -20004 -5455
7205 -5455 5863 20358 29631 23121 15101 16503 14540 16520 10423 -657 -600 7716 11895 9820 2294
7190 2294 -233 -1429 -1608 -990 -2973 -1442 2155 -3800 -8155 -11648 -502 5495 -4330 -7314 -7055
7175 -7055 -6509 -13826 -9347 -4085 -5460 -11211 -17570 -13161 -11262 -12470 -16262 -13684 791 2084 2552
7160 2552 10892 4713 -2078 -2173 -3501 -10950 -6854 -9904 -14716 -24507 -28110 -18913 -14812 -12468 -199
7145 -199 1881 -1447 -2728 -9339 -14949 -6520 3583 9217 3640 2862 161 -684 -6236 -8916 -2263
7130 -2263 -3623 -9492 -9308 -12774 -12707 -10196 -12516 -18981 -16557 -12899 -12401 -12354 -8718 -15023 -15814 -9102 -4163
7113 -4163 -5670 -2060 1408 8051 4528 4862 7091 -158 206 -5984 -14667 -10784 -8845 5505 12644
7098 12644 8346 -4585 -15151 -11896 -3217 142 3848 -7481 -12365 -6967 2191 3860 -8205 -14747
7084 -14747 -10038 -591 -3287 -12618 -9556 1662 7201 5095 3503 2559 12403 13226 -6735 -16789
7070 -16789 -17246 -12096 -19068 -7118 814 515 3020 -1198 -3966 -2845 6405 19685 14030 611
7056 611 1194 -4974 -6581 -8140 -6658 -11326 -9066 -1189 -712 6807 2484 -4982 -8430 1516 -959 134
7040 134 7688 10899 18035 14381 5049 -4694 -14238 -6237 -759 7853 9502 11648 8298 2921 1821
7025 1821 4904 8834 6319 6212 13302 1004 -5040 1697 6275 -585 -2715 -2694 -2868 4575 -198 4344
7009 4344 1982 10530 13322 16468 11843 -1038 5047 11241 12351 11201 8277 -2479 -7661 -11134
6995 -11134 -4038 -561 202 1540 2052 2524 4236 -1922 -7477 -2490 -15870 -27875 -17597 -8191 -9356
6980 -9356 -8054 -11927 -14753 -17832 -19296 -9153 -9395 -7491 5087 5436 680 3130 12449 21658 12894
6965 12894 3282 5366 3806 6791 1553 5858 1353 -5389 -4619 -8367 -7567 -5242 -5843 459 -650
6950 -650 -633 6156 8683 8566 5175 -10978 -12433 -7465 -1706 -5704 -5571 2208 2452 575 5445 10156
6934 10156 4269 -7955 -10528 -2076 -688 8264 14253 12216 6708 -1636 -10704 -15454 -17699 -5569
6920 -5569 1969 7343 15712 9934 1727 540 1361 -11186 -9586 8402 9152 6156 7645 14575 22662
6905 22662 18216 5667 -8085 -12223 -9189 -3917 -8118 -4902 -3880 -628 10186 14685 16208 10459
6891 10459 2477 -185 -177 -6945 -8225 -6569 -3199 7540 23395 27318 19586 10433 4495 653 -2901
6876 -2901 -1052 580 -923 7947 4901 1841 -2162 -4994 -5215 -4079 -12291 -6141 -7973 -12048 -6695
6861 -6695 -8706 -10356 -13259 -5181 3066 -2960 -13842 -13552 -4008 3707 4815 2120 1432 267 -3824
6846 -3824 1425 1913 -473 3280 1796 -1947 -4518 -9737 -28176 -27039 -21316 -20688 -21746 -14038 -618
6831 -618 2087 10333 8271 -1113 -10440 -6209 -1076 -6371 -8568 -7527 -7023 -4522 409 7142 6296 2701
6815 2701 1241 -2626 -14035 -14619 1303 3557 -6128 -12776 -12313 -11635 -13126 -19542 -21960 -7911 4150
6800 4150 6174 -6824 -5979 -713 -5305 -2128 901 1128 -335 2062 10297 11587 2331 7003 9763
6785 9763 7674 3151 6361 12069 15413 20259 20329 10499 -1392 -2000 1444 -6481 -14300 -10312 3348
6770 3348 7420 7337 14531 10041 1892 -9113 -11955 -11934 -9612 8745 21779 15889 5409 -4257 -5768
6755 -5768 -7831 -5099 -1462 5446 6946 10502 17108 17223 22513 27801 25002 22113 11185 7081 9205
6740 9205 5022 -9143 -16781 -14935 -10556 -9762 -3785 1380 2150 4858 4142 -2479 -6091 2268 15345
6725 15345 21753 24593 21153 17809 25281 11569 171 -13185 -10956 -7322 -602 10190 4239 -2368
6711 -2368 -7894 -5161 5722 15013 22334 8319 -4051 -6631 -6591 -17686 -26603 -18810 -8577 -5062
6697 -5062 -10372 -10041 -10840 852 -4654 -7852 6577 570 500 -2589 -11388 -4941 2671 4745 4806 -3649
6681 -3649 -1853 2880 -1866 -7251 -12216 -9865 -16414 -15331 -3153 8763 7782 -655 474 -2994 -1777
6666 -1777 4831 7150 769 -6205 4006 13989 19442 9363 -2053 -638 5201 4328 -4435 -18018
6652 -18018 -18972 -16989 -14337 -14370 -17874 -14433 -12295 -16109 -14737 -20003 -23441 -21188 -14092 -12435 -12333 -15699
6636 -15699 -17337 -4606 13100 14577 -1930 -4115 966 39 -1634 -1396 -2637 2197 946 -4465
6622 -4465 -3735 -2627 -2063 -278 5303 3153 5272 8307 4254 -64 -927 -2737 -5219 -11628 -10459 -13569
6606 -13569 -13886 -13530 -7672 4694 10472 15358 16321 10324 11865 7414 5604 -1067 -3210 -4054 -10822
6591 -10822 -2738 -3864 -2246 576 -3333 -10275 -8507 -8285 -10554 354 9762 12122 10397 8413 -128
6576 -128 -11686 -14414 -18017 -12956 -9902 -11502 -13437 -8949 -5528 -8312 -4623 -3534 -3984 3074 -939
6561 -939 -6994 -8329 1440 11091 16763 14794 11813 14641 17760 6510 6507 -6218 -14351 -8995 1508
6546 1508 2957 -1480 -702 1126 -4947 -2377 7273 7346 367 -3892 -3430 -5279 -1514 1529 11464 7950
6530 7950 -4067 -506 1608 3828 2516 -1242 -3014 -444 -2852 -9030 -15141 -9444 -8409 -8807 -8355
6515 -8355 -7841 -11732 -6377 -1451 369 3439 -721 -13036 -17925 -17909 1533 13998 6652 -3145 -324
6500 -324 -6029 -8979 -3252 1376 7893 8862 2758 1145 -2778 -14536 -13489 -12836 -6994 -4589 1204
6485 1204 -3054 -3787 -4797 -5305 7504 8551 5588 9449 10861 10428 7662 3100 2391 -4542 -7099 -1160
6469 -1160 -356 -1310 -5581 -12262 -12044 -10989 -9407 -6421 -1433 6927 -3823 -13586 -12579 -5208 5091
6454 5091 -4056 -16952 -17553 -6062 2774 -1260 -9629 -18020 -14267 -8033 -9565 -6717 -2350 -6216 -5027
6439 -5027 1607 -397 -137 10276 3396 3566 9163 9577 6089 1816 -7592 -6427 -13228 -15280 -12086
6424 -12086 -13104 -6972 -8564 -8327 -5397 -573 -60 -3280 -3059 2575 9377 6294 7342 10221 9993 14199
6408 14199 15312 10707 61 -11926 -5785 4433 4512 -3125 -12414 -10919 -4069 1061 -3306 -2978 4873
6393 4873 -7084 -4880 -441 3696 9800 6174 -5404 -5658 -1303 4916 3940 -5168 -1352 -2173 -585
6378 -585 8413 6333 -5522 -6345 3248 9727 -1856 -15544 -15054 -13624 -19823 -15371 -9755 -6255 2097
6363 2097 -8004 -6728 -3891 -12647 -17963 -16407 -12433 -3826 3404 4633 1136 3564 159 -8142 -4710
6348 -4710 -6497 -8489 -12305 -1400 -5841 -9017 -17022 -17151 -8445 -9277 -9332 -6257 438 -279 -3270 -5463
6332 -5463 -2707 -6017 -2182 799 -464 -234 -6209 -6802 2630 -6466 -16654 -11733 -3216 -15134 -26023
6317 -26023 -17783 -13002 -8550 -6686 -10989 -17701 -9650 -2194 -3293 4840 12514 15092 16344 13161 3989
6302 3989 1047 3005 7598 8790 3042 1347 -434 929 -1845 -291 3877 10344 4441 3016 3054
6287 3054 5782 1894 1842 6234 6330 -2464 -1521 -3725 -13909 -18558 -18069 -10945 -7789 -5669 -1220 -536
6271 -536 -435 5748 6270 -386 -6982 -10925 614 3911 -7197 -5647 1250 6689 7020 -8152 -12060
6256 -12060 -4830 120 -3695 -4163 -10311 -25967 -30472 -25549 -19998 -14552 -7426 -8401 -9833 -4974 -3541
6241 -3541 2414 9950 7920 10170 4014 971 -1676 -4243 -461 9705 7700 -1608 -1129 8634 6239
6226 6239 104 1699 2293 -1857 -2546 4786 4732 1715 594 2997 5690 5217 5291 12361 14523 8171 2925
6209 2925 15025 12197 9610 9249 -818 -8798 -11035 -8137 -3130 -8194 -9806 -7976 -9081 2711
6195 2711 3309 -6781 -6437 2506 2341 -7018 -17326 -20354 -10225 -6867 -3470 -9744 -16681 -13549 -6508
6180 -6508 -11368 -10656 -4704 1800 -2389 -6758 -7721 -8643 -4081 -3890 -977 -5256 -14876 -16300 -7045 -7318
6164 -7318 -5616 -10280 -11705 -1475 4893 5460 -4494 -7367 -16176 -22426 -13116 -1837 -2870 -7620 -4832
6149 -4832 -8987 -13388 -7776 -1313 1284 -796 6013 11041 6323 1288 -5896 -2004 474 -3540 -2053
6134 -2053 7432 7093 -109 -614 -3397 1361 3176 -1797 -7521 -17075 -16593 -13759 -7872 -2071 6232 4197
6118 4197 7094 9692 6986 680 10986 18124 4745 -4126 -7159 -6530 -2981 -6245 -8740 -11616 -6655
6103 -6655 144 4682 2624 -6420 -4770 -10394 -9165 -5573 -5526 -2813 -1488 1875 4711 -459 2463
6088 2463 4938 6083 3069 -6864 -10940 -12118 -6505 -1706 -852 -5901 -9965 -8527 -8569 -20244 -30051
6073 -30051 -23467 3576 7712 11921 14272 4362 -292 1196 1546 1271 -5713 -12086 -10501 -8124 -1848
6058 -1848 12356 13806 6159 2788 6440 3712 -2988 -2249 -3457 -3755 -7563 -12893 -16035 -16689 -8821
6043 -8821 -6462 -12103 -17533 -17399 -23760 -24102 -31334 -31292 -34910 -33384 -20889 -8135 -11368 -8622 -1696
6028 -1696 -1666 -10140 -5035 -8690 -9495 -7858 5517 1129 -7896 -12702 -21984 -12798 -11502 -7815 -7705 -9950
6012 -9950 -7163 -8575 -10249 -7766 2249 10699 10111 1992 8279 10214 8755 13367 10757 11330 1398
5997 1398 -7578 -1055 -120 -1220 -681 -5921 -314 -2607 -6043 -5120 -15367 -18894 -11285 -1611 -3622
5982 -3622 -1407 -1631 -9235 -12645 -15643 -9662 -8688 -15101 -9641 -12468 -19025 -12890 -7165 -5547 674
5967 674 3531 2353 -4904 -11380 -13611 -4857 -8261 664 -557 -6010 -2809 -695 -6913 -2265 4782
5952 4782 2030 -3109 -9197 -8293 -15053 -19170 -12039 -10045 -19066 -14876 -7984 -4924 -5715 -4640 -12799
5937 -12799 -9800 8567 10072 4385 1170 6144 937 -11365 -20784 -25380 -15981 -5113 3000 5434
5923 5434 6585 5738 2792 1383 -2063 -1116 2033 -1036 -7302 -8394 5129 6039 6394 3926 1529 -9193
5907 -9193 -13613 -7346 -9748 710 7713 -732 -2984 -3133 -11876 -10937 -7315 -5032 -813 6466 4796
5892 4796 2215 -3230 -4265 -2526 4937 12541 13600 11477 7298 1630 464 3668 436 317 5452
5877 5452 -2629 -4907 -2108 3128 3485 6106 981 -6207 -3063 972 -1219 2794 18566 29374 22332
5862 22332 10855 10782 12879 5460 1931 -3742 -7811 -5925 -4522 -2050 5074 10033 7311 -3778 -11988
5847 -11988 -8136 -11825 -11710 -8800 -7333 -6460 -2090 -3312 -962 5114 8937 5664 6334 9064 5488
5832 5488 9752 16514 11851 15573 18661 10760 6256 3309 3186 2160 936 -4835 -7198 2839 8176
5817 8176 -1294 -7285 7325 12102 10357 14909 7863 -437 965 -1739 -7355 -4417 -7298 -7400 -14595
5802 -14595 -23285 -22179 -19750 -14093 -13705 -13794 -3015 -5426 -8958 -10887 -12449 -17729 -17399 -10147 -5000
5787 -5000 6821 5830 -4469 -3000 -478 -6927 -5235 -2083 -643 -1713 -99 1565 -2830 -2728 4104
5772 4104 -4691 -6126 -3655 -5688 -11831 -3376 1120 -588 622 2330 6544 12581 14890 5333 -877
5757 -877 16 4137 1984 2720 2706 -6767 -11671 -14778 -12239 -3997 -837 4906 14292 11358 5715 -6585
5741 -6585 -12913 -1110 1104 1780 -1217 872 928 -4761 -2027 730 5108 11148 14601 15600 18758 21079
5725 21079 16968 4581 8034 11210 7770 -16 -7663 -2143 -6684 -5981 -11013 -20583 -14867 -321
5711 -321 11810 11076 5484 898 -8951 -7117 7268 19058 24760 20971 15183 13388 14382 26127 24779
5696 24779 17375 14774 12112 6187 7840 3967 6781 13246 9421 2670 10348 20556 16676 6592
5682 6592 2167 -3973 -17417 -20950 -6587 2106 6284 3491 -3254 -6019 -6029 -7082 -6501 -1132 -5088
5667 -5088 -5464 -768 -9288 -21302 -28644 -24216 -18466 -9631 -3645 590 2812 5318 11013 19915 20765
5652 20765 11149 9484 5881 9363 10477 4246 944 -4467 -12489 4572 13637 4250 402 6380
5638 6380 14561 5487 -1387 -2783 -4292 -4114 1933 10918 4340 9603 10504 -765 -6788 -9424 -14157
5623 -14157 -9497 -7023 -13226 -8677 -8768 -7864 -7932 -5452 -4668 -4561 -6392 -5981 -829 -7088 -2563 1871 -1185
5606 -1185 -342 -10169 -10446 -9067 -11628 -17589 -20939 -20308 -17684 -13542 -5474 -1998 -3956 -2564 1021 1260
5590 1260 -4428 10995 20038 10344 -637 -8255 -4034 -11104 248 9131 11527 14244 6446 -5486
5576 -5486 -12848 -10652 -4893 -920 529 785 2548 8771 8188 -8824 -17986 -13020 -2385 2759 -428
5561 -428 -590 15084 18753 8754 8190 2577 -4811 -3472 -7809 -11478 -3903 -1110 -4292 -1481 -1742 -9170
5545 -9170 -13873 -14102 -15728 -9823 6150 14660 11070 6021 3250 -2767 2201 8305 335 1415 8006
5530 8006 2216 4407 -1836 -919 2947 3119 -1420 -6843 -4258 9489 14264 12350 8807 11688 5596
5515 5596 -2434 -851 -7457 -16446 -17787 -21171 -20971 -22242 -9158 -2523 10734 6391 1546 662 -2641
5500 -2641 -1184 -1343 621 -144 -3262 -6051 -186 -2089 7227 4323 -2630 1695 2600 6729 10421 15833
5484 15833 16474 15061 22509 12163 362 489 5121 1287 507 1580 -1166 -5503 -7726 -12724 -18209
5469 -18209 -20845 -17799 -6339 -2093 -16853 -16579 -7856 -2054 2942 3910 -130 -7473 -4254 -761 -1831
5454 -1831 -571 -2722 -4551 -5909 -6016 -10641 -8562 -5398 -1011 549 2945 2854 6090 -793 3532 11395
5438 11395 7397 1775 1665 -6581 -11767 -3059 -4123 -3771 -5142 -14002 -16513 -9975 -7450 -14893 -14592
5423 -14592 -11064 -13760 -9514 2522 6271 10648 17149 28292 27793 20740 13509 10367 6924 12249
5409 12249 17967 15191 11480 13036 11921 -4788 -4167 -7263 -11325 -11148 -11279 -1932 7629 8895 17208
5394 17208 12536 16315 14057 19236 8945 1936 4071 777 -10442 -15236 -21170 -15868 -5338 3808
5380 3808 5341 1206 -1605 -1920 -9665 -13310 -10686 -4808 466 6196 19878 14685 9104 6150 -6058
5365 -6058 -8549 460 -6231 -14786 -10585 134 -1790 -10918 -18370 -14361 -6992 -6395 -6928 -7518 1865
5350 1865 1356 -5 -6117 -9550 -5601 -11327 -21711 -12007 -6494 -5779 -8449 -4343 -99 -10075 -14995
5335 -14995 -8594 -11254 -16376 -11660 -9915 -13350 -1206 -5636 -15157 -15447 -13364 -7807 2570 11778
5321 11778 22713 20994 1418 -6765 -10729 -5835 -992 -1163 -7170 -16561 -19434 -12333 -8430 -5217
5307 -5217 -5328 -4592 -581 4151 -3965 -15836 -15482 -14410 -9216 -11269 -5730 -5911 -9346 -8006 -8193 -14966
5291 -14966 -12167 -6141 -16734 -22594 -9137 -3001 2254 7992 12845 3169 -135 3100 4189 -1526
5277 -1526 -7015 -640 -6899 -1811 4989 -150 -2813 1397 7168 7355 17401 14477 4344 -1716 -7139
5262 -7139 -15630 -17275 -19931 -21049 -7932 -3628 -9525 -8389 -9967 -8079 777 5007 1711 11900
5248 11900 13411 -1198 -5563 -4538 5064 11955 10784 8200 3558 3808 -3824 -1281 2945 6429 7836
5233 7836 3437 -11871 -20784 -17667 -9162 -3054 -12796 -18131 -16737 -14352 -14610 -10858 -4338 -942 3582
5218 3582 4909 3507 -6619 -11416 -25374 -23205 -10925 -8039 -5209 -8845 -12704 -14513 -9796 -6274
5204 -6274 -5569 8003 12738 6620 6814 15354 11063 -3350 -2279 2633 4154 4849 5036 3566 -3950
5189 -3950 -9365 -19329 -15515 -12952 -13157 -13084 -3185 6485 11994 15364 11055 10669 5129 2557 6202 -3121
5173 -3121 -1250 -8654 -4743 -571 923 -7883 588 4666 -1739 484 10119 12179 8505 -6079 -15079
5158 -15079 -16482 -14167 -12984 -13029 -3246 6002 13005 3586 -2886 5851 1916 -251 -5778 -6467 971
5143 971 -3439 -7100 -2477 -4497 -515 -1843 3775 7951 5065 -990 -5000 -5113 -11875 -9758 -5855
5128 -5855 1793 2740 149 -5087 -8021 -11703 -9021 -8308 -8995 -6254 -5368 1492 1214 663 12 4201 7990
5111 7990 -5176 -11127 218 2342 -2980 -528 -3237 -6620 -12644 -22235 -21509 -16328 -17530 -12591 -3295
5096 -3295 4546 10868 -1371 -5542 -2365 5432 11645 20037 13501 4601 2409 -1054 2159 4988 6813
5081 6813 1451 -987 -6047 -15217 -14404 -2106 1894 4673 1378 2972 3263 1704 -2434 -8600 -3981
5066 -3981 8261 -1111 -6 -2102 -7499 -6306 1822 9520 4808 -1901 -11859 -18116 -20479 -17164 -10873
5051 -10873 -9123 -14323 -8864 -1420 11572 16720 11722 10551 8407 4188 4229 601 -6251 -7407 -1804
5036 -1804 6792 -548 -1210 148 -4426 -5740 -7761 -7087 -10856 -11859 -14747 -18310 -18719 -15313 -15796 -6834
5020 -6834 -6612 -14185 -20594 -10403 -5864 -9999 -12523 -14761 -13343 -12187 -463 -479 1163 -7285 -15083
5005 -15083 -22843 -24641 -26183 -16998 -11779 -13011 -3396 2580 -795 -1090 3892 6492 3135 6653 4450
4990 4450 4379 -592 -1082 49 6085 11692 2577 1885 5022 10616 439 -7766 -5734 -1618 -143 -3986
4974 -3986 -3592 -4787 -5862 -20077 -28555 -23056 -19865 -13437 -16121 -14747 -11278 -12704 -13555 -8969 -905
4959 -905 -4912 -4421 -10385 -9093 -5470 -3715 -2994 -4521 -92 7574 2281 -2259 -10826 -14502 2688
4944 2688 18367 23662 20545 20729 15185 12562 11678 13091 10332 6126 -4889 -8422 766 1594 -3543
4929 -3543 2376 10321 14223 14949 4667 3594 4690 9325 6842 -1505 -6775 -2665 99 4922 5437
4914 5437 8782 21124 14743 -909 462 2853 1608 2514 266 -2756 -149 6841 12942 14801 11234
4899 11234 -202 -10748 -13022 -2181 -5347 -11485 -2473 4937 5962 2229 5387 -2844 -5424 -1236
4885 -1236 -1159 -9166 -12384 -10690 438 2501 9495 16236 13363 16352 14288 8786 8062 4496 12809
4870 12809 21158 25099 24795 15059 7320 9902 5192 -2593 -6086 -1852 7236 9739 7835 2260 -7399
4855 -7399 -8679 -8111 -9668 2769 1638 -3441 -645 -2193 -4805 -8559 -351 7082 4202 -997 -3484
4840 -3484 -2273 -12711 -11958 -11313 -5109 -3062 2433 10219 10589 12635 7692 8441 -56 -10161 -6823
4825 -6823 -4625 -8804 -10131 -3857 -547 -12831 -16709 -12996 -4755 -3318 64 -3634 -685 4149 149
4810 149 963 -5023 -3392 -5019 -3567 -5366 -4377 3413 15791 22875 21647 12220 8388 -256 -7879
4795 -7879 -6986 -16481 -12741 -2614 2387 696 -5489 -6223 86 4216 -3089 -380 14476 2624 -6756
4780 -6756 -11093 -5432 4124 15477 14540 -192 -6440 -3975 -382 4213 772 -5090 -12038 -12631 -9293
4765 -9293 -4362 1812 764 1944 15246 21506 14557 -172 -11234 -11478 -17878 -5071 8237 7965
4751 7965 7731 4905 -3631 3529 2394 -2700 -10620 -7883 432 3548 -2162 -3748 -2222 -965 1852
4736 1852 9535 20890 32715 25761 11573 -1191 -10392 -14421 -10981 -6654 -5018 -2234 7282 6487
4722 6487 -5900 -6955 -11221 -15477 -13378 -11192 3786 3588 -10642 -14119 -4323 2510 -11526 -12284
4708 -12284 -4357 -5223 -6886 419 9174 6562 1399 5672 2799 -631 3685 2275 -6041 7411 4778
4693 4778 8256 4113 -3416 184 -2358 -2508 8339 12632 13420 14967 15140 20303 15893 24071 27592
4678 27592 15936 104 -8091 -10477 -8580 -1853 2715 2985 3011 3556 4597 4374 1604 1179 -1110 -1812
4662 -1812 12687 15183 11439 4676 383 6926 2770 676 5855 4666 752 -9200 -9116 -7308 -7846
4647 -7846 -4551 -2561 2114 2982 590 -92 7671 9119 5858 4779 9703 10129 -269 -10846 -5847
4632 -5847 -2554 -14553 -12692 -8039 -6880 -12506 -2671 4443 -472 1193 -3186 -5993 -13168 -15273 -12673
4617 -12673 -13738 -7628 -9029 -15187 -13555 -13288 -13312 -17791 -15802 -13127 -5831 543 2681 -1074 -5155
4602 -5155 -8996 -8596 -6008 1572 1572 5830 -7750 -9313 -10293 -13824 -3806 -998 -5404 4476 13616 5583
4586 5583 -1674 -10363 -19048 -15778 -6257 -685 1150 10211 2713 -7820 -12690 -7209 3997 4173 3488
4571 3488 4020 2502 -7041 -4845 -2489 437 4315 1587 -1799 -4894 6677 14079 10690 7542 14126
4556 14126 16347 9475 2234 -4670 -6133 -19279 -20640 -15232 -7470 6640 9944 8039 9971 2679
4542 2679 -5199 -2284 5599 3813 3173 9271 1134 2118 -7310 -14099 -19078 -2305 -2365 1597 10993 5625
4526 5625 -2653 583 -8310 -12373 -8863 -7864 -5970 -2686 -4483 -1736 10228 11748 6927 -803 -6295
4511 -6295 -12102 -856 -4630 -5494 1171 5338 4962 -2236 -1198 592 -2831 1449 7952 6705 2421
4496 2421 -5985 -5610 2988 -2171 -1257 4404 1900 880 -1949 2758 3084 -708 -7167 -19282 -14970
4481 -14970 -4112 -8111 -7124 -9690 -4781 -1904 1433 1365 -1289 -7081 -11807 -8904 -1362 1200 5027
4466 5027 7087 6329 428 1940 -8878 -12399 -6088 -2438 -4052 -5982 -2038 -7244 -10469 1618 3029
4451 3029 -6809 -7172 -2592 4525 9129 6220 336 -6878 -7000 1357 10342 5812 -1588 3716 296
4436 296 -3239 -1773 9040 11427 5500 15169 8226 1558 -6561 -941 -2548 -1659 6843 8651 -1434
4421 -1434 -9422 -6261 6314 9054 2009 -6463 -14740 -20906 -6639 388 11176 6567 -5305 -5719
4407 -5719 -3616 6499 12030 11266 1160 -1895 1694 -1723 1196 1436 831 786 9503 6177 4485 1577
4391 1577 3934 248 699 3327 -6913 -5715 -4070 -4733 4861 7975 -2405 -4181 -383 2151 -1691
4376 -1691 -8811 -9916 -6608 -8557 1099 8133 2512 293 -57 -8345 -13693 -20886 -20555 1006 6344
4361 6344 5220 10453 6778 4078 11708 16454 21531 21107 1124 -6798 -2350 3526 999 6005 11723
4346 11723 10590 15031 14784 11265 755 -5068 -2056 791 655 -4914 -5727 -5802 -1480 -6886 -2041 5624
4330 5624 -348 -10150 -10649 -4675 -4236 -11794 -10231 -2602 -4801 -761 3519 -1884 -12163 -13982 -12618
4315 -12618 -11772 -14236 -4559 -6427 -7220 -9006 -12565 -21046 -20315 -12162 -14178 -7918 -8422 -9999 -11598 -14867
4299 -14867 -13024 -17402 -16221 -11885 -11547 -7043 -873 -2246 -8000 -4492 573 -6949 -6261 -168 406
4284 406 -2411 -8175 -13969 -5678 1051 -5348 -1205 -7126 -6720 1858 26 -1932 -2897 3408 6014 3244
4268 3244 117 -2795 619 4740 -3753 -11466 -10756 -13833 -11412 -7742 -2331 354 -3863 -6737 -10253
4253 -10253 -11570 -15384 -8690 78 -169 5678 8413 726 -1704 7254 10743 -3834 -8353 -8005 -6341
4238 -6341 -751 2252 12689 19850 15716 13902 6592 -679 -6988 -2940 -3548 -6830 -17857 -15358 -9905
4223 -9905 -353 300 2196 -2733 1832 3495 3738 433 -11493 -11063 -8995 -8430 1569 813 -6146 -5315
4207 -5315 1780 -2985 -9936 -10348 -4047 -35 3421 5012 -3091 -1477 -966 -1853 -622 6840 2464 -7988
4191 -7988 -1861 -792 -11512 -17151 -17180 -15024 -12169 -17267 -8276 -12567 -16956 -11968 -5023 -5023 -6012 -5027
4175 -5027 2621 4208 13549 18739 21620 7811 -3455 -3421 2770 -5544 -12391 -7431 -1334 9199 11963
4160 11963 3716 4684 14966 7973 -8510 -13921 -18370 -14182 -9482 -1199 5777 8419 5573 91
4146 91 -9644 -19165 -18064 -15296 -11743 -7719 -4241 -1809 27 1402 12912 7484 6238 2643 -4019
4131 -4019 -2367 4900 13094 14245 4481 -6698 -18963 -22026 -4700 11111 9670 11022 5727 10293
4117 10293 10316 188 -12705 -19392 -15037 -6689 -8132 -9573 -9593 -10320 -5669 -7702 -8072 -15122 -22998 -20299
4101 -20299 -12737 2651 6626 419 -2332 -2712 -6897 -13939 -19893 -22282 -14546 -13411 -20798 -32773
4087 -32773 -25540 -24977 -21749 -14716 -11046 -6696 -12797 -12342 -13472 -14896 -12569 -11048 -3385 -5070 -8400
4072 -8400 -11106 -10370 2354 8900 -1356 -2758 -2507 -3507 4651 11049 12196 3344 -7610 -16257 -21966
4057 -21966 -15654 -854 -707 -3889 -3942 -2082 5399 13443 11131 -2448 -7629 -15504 -24313 -11346 -1499
4042 -1499 -1832 -6728 -7862 -3613 -35 11741 10719 -188 5549 5942 -9166 -11762 -13208 -3791 11046
4027 11046 11821 1258 -11635 -18495 -16019 -14025 -11262 -4472 -1760 -6247 -8024 -8896 -7851 -7352 -5392
4012 -5392 1503 -1511 -10533 -8831 -3579 9784 12053 2354 1716 8268 10468 10052 12163 8576 9422
3997 9422 6786 9321 14676 11545 1339 -712 2807 2082 72 -3813 -13626 -10980 -5144 -19 2410
3982 2410 5419 4315 10142 15504 2412 -4324 -8531 -9006 2066 -2756 -9851 -13060 -10851 -12922 -6469
3967 -6469 -6417 2642 5693 5024 -4041 -1517 -3863 -18460 -19374 -8003 -3889 -5782 3443 5375 13762
3952 13762 14718 3611 4120 11230 5488 -4004 -7471 -9358 -1311 1635 2043 1857 9543 12494 10505
3937 10505 13657 -725 -2335 -428 4994 19165 16174 11904 10753 18939 25035 19835 15190 19359
3923 19359 21521 21296 5695 -8208 -6789 -1132 -2812 -4587 -10199 -23221 -16035 798 -4967 -7347
3909 -7347 -10440 1082 3731 -2529 -1779 2744 2996 -2993 3549 6933 6317 7217 10891 16343 5209
3894 5209 1040 3266 7357 -2632 -5068 -1458 3607 12200 -2706 -10262 -12327 318 4449 -1859
3880 -1859 755 -2578 -10318 -15952 -14212 -11245 -11380 -10917 -7725 -12312 -15669 -16232 -14696 -3461 4037
3865 4037 1627 -11507 -5613 -293 1283 1549 -5654 -4462 3718 1418 -5554 -5940 -1797 -1214 -1897 -388
3849 -388 2453 6382 6015 3131 5522 9931 -1285 -14481 -10283 -2182 7263 16441 17600 11106 58
3834 58 -6619 -6653 -3678 -10082 -13937 -12129 -9054 -8380 3934 9404 1932 -1688 -1199 4519 6053 -832
3818 -832 -1573 -1756 -23 2005 3537 4538 5858 10137 7847 9053 12387 5334 -8090 -4991 271
3803 271 -531 -3670 -2705 -2293 -6509 -8990 -8404 -17961 -18718 -22126 -23761 -16667 -6101 -7275 5053 11307
3787 11307 13034 9141 1584 6079 7049 9667 15812 8599 2525 4897 -1319 -3477 -4224 -5427 -5999
3772 -5999 -7270 -16435 -12616 -2663 -2910 2204 6447 3266 5736 4601 3913 5267 2925 -5094 -1728
3757 -1728 2446 7314 8173 3896 -4876 -12379 -9028 -4876 -1595 -4017 -1318 895 3173 -1267 -14660
3742 -14660 -12142 -5613 -719 -7851 -7881 -11306 -12508 -8964 -8692 1598 6603 2013 -5498 -5052 91
3727 91 2132 7827 16469 1686 -13259 -14683 -11504 -2341 5265 8659 4122 -641 6679 12249 6786
3712 6786 -9637 -18567 -9597 5614 3905 -8007 -5042 7285 7161 5927 14093 8120 11073 16467
3698 16467 8588 3223 7808 3312 7589 8097 5869 7453 5568 7546 9629 2697 -2678 1564 633
3683 633 1216 4209 4411 -5365 -6483 -393 -8456 -13058 -13175 -13131 -11995 -12035 -3926 -6946 -6297 -7706 -2172
3666 -2172 -2037 1999 5565 11788 10859 268 -3601 7396 12047 4118 1190 5295 19645 18533 11884
3651 11884 3645 -1593 -13930 -26946 -25743 -15883 -13081 -17670 -16012 -18825 -22741 -12302 -948 8570
3637 8570 7002 -1261 -738 9852 14836 8604 1079 -7566 -16452 -20840 -23236 -12129 -3162 -2492 -2139
3622 -2139 2799 77 -1207 2273 10438 11785 8842 9937 5232 -137 -5890 -16355 -14448 -3732
3608 -3732 -1416 -4801 -12169 -15614 -16241 -9955 4069 9759 6907 1051 -4897 -11388 -11840 -1539 8150
3593 8150 2937 -911 8163 1886 2451 -2922 -10632 -5732 -2834 1952 4382 6088 6276 3875 -8645
3578 -8645 -9671 -11773 -12250 -10252 -8803 -16286 -16618 -13398 -2784 9168 16715 17219 9079 7002 10759
3563 10759 12788 8859 5994 -844 -5143 -4614 -4879 -5482 -2693 -5857 790 8019 1686 1832 2177 5512
3547 5512 7994 1256 4006 2933 -1029 -7709 670 6168 1385 -1415 2393 4489 4802 -1691 -7790
3532 -7790 -225 5973 512 -4809 -3033 -1348 -1890 -4866 -4744 -5887 -7772 -11310 -11969 -10389 -8458 -8106
3516 -8106 -14263 -7152 -3089 -2945 -3199 -1232 2227 -1578 -15112 -14652 -10147 -1750 -2034 -6122 -5151 1382
3500 1382 10739 3867 5230 -2478 -8244 -8290 -9938 -5012 2126 13052 5776 6283 12372 20246 17038
3485 17038 8386 6180 -7740 -13852 -11323 -7139 2664 -1252 -20938 -32165 -27318 -21796 -16855 -18553
3471 -18553 -21338 -15511 -8718 -4794 -1509 -1238 -7116 -4800 -5181 -7528 -13895 -15894 -5983 -738 -2995
3456 -2995 -2764 5085 15553 16045 7624 4302 4763 1235 -12011 -24107 -22650 -13672 -9989 -9300 11637
3441 11637 20024 12821 2284 3124 7244 12206 4708 3159 45 -2931 720 4434 3659 -7247 -5181
3426 -5181 -2150 -4019 -10971 -16005 -16048 -13715 -8003 -6544 9340 10875 10102 11602 9802 11722 12048 15490
3410 15490 5500 2012 -958 -2292 5917 7115 -4778 -11795 -7469 2760 11099 9191 -910 -6186
3396 -6186 4777 10493 3946 -2002 -5010 -5530 -6573 -12883 -15382 -19998 -17488 -9690 -1565 3584 6755
3381 6755 1785 4303 5019 -542 -5214 -14937 -10890 -4754 -6136 577 2268 -3991 -7938 -18785 -8711
3366 -8711 -7082 -9265 53 -2728 -4239 -11276 -19636 -11065 -5391 -11015 -4589 -7325 -10770 -13984 -21352
3351 -21352 -25728 -27587 -17483 -1340 -367 -2159 2738 9094 -1442 -12039 -18999 -22379 -17966 -17097
3337 -17097 -13734 -16211 -8531 -2968 1249 1074 99 -2901 707 711 -1916 843 -4418 -4503 -1314 15271
3321 15271 17608 5401 -4371 -6104 -10466 -1839 2893 -5090 -9132 294 10704 470 -6676 -476
3307 -476 -1036 -6535 -676 369 1537 410 -270 -5038 -11459 -12575 -12493 -10231 -5652 -9413 -10805 -18393
3291 -18393 -17080 -10110 -7331 -6035 5182 11793 9771 8936 7781 5298 1016 128 -133 -5788 -13748
3276 -13748 -17149 -16239 -19618 -15042 -12154 -7308 1825 -627 2348 -14048 -20815 -11943 -12763 -17086 -14618
3261 -14618 -13260 -5407 -610 -3202 -4886 3377 1539 7342 9061 12989 6756 -496 6215 7073 4281
3246 4281 8309 9950 6041 -2528 -7166 -5888 1096 -2295 -3693 187 8175 12264 14302 15457 6472
3231 6472 -1302 -6819 -5674 -4136 -4723 -2330 -338 1294 6782 6233 997 6434 10847 8036 2262
3216 2262 -44 2348 1121 3758 -8732 -16660 -15251 -17157 -20110 -15232 -12358 -11218 -5800 390 5878
3201 5878 6961 2269 -1526 -3388 1957 10909 8458 -15379 -22613 -19916 -10324 -10041 -15349 -11399 -10881
3186 -10881 -19550 -22331 -19251 -16382 -10470 -8212 -9690 -6682 -3340 -8708 -8587 -1663 -1939 3940 3235
3171 3235 743 7622 6739 2724 -11244 -14302 -11122 -9895 -11689 -15063 -9196 -6504 -3403 7579 7082
3156 7082 2459 1172 -1011 -9177 -9150 -10559 -247 -9088 -6086 -4047 -1549 -6370 -16442 -23658 -25240
3141 -25240 -15476 -14248 -17114 -6444 -4345 -7992 -6228 -9560 -11735 -3422 -6365 -16497 -14024 -13059
3127 -13059 -13223 -13516 -12325 -12714 -11780 -13080 -13446 -11056 -1894 18487 25841 18872 17242 15031 10524 -2681
3111 -2681 -5082 1963 -557 -829 1160 -4360 -6903 -8769 -7801 -5554 -10869 -13574 -13347 -5801 -9162 -12287
3095 -12287 -4767 -3134 -11856 -17083 -16642 -13624 -14482 -6873 -3297 724 13526 19105 7318 30 225
3080 225 -3991 -5182 -5695 -4094 -5497 -1010 4988 8379 1039 59 6467 10639 6442 2537 -10053
3065 -10053 -6423 -3903 -824 -3671 -6005 -3224 -6430 -3527 3007 2967 5894 -774 -9758 -4243 -10102
3050 -10102 -16211 -5175 7896 8816 3519 1191 -2106 -11968 -9778 -4613 120 1131 -296 -3450
3036 -3450 1392 -547 -3608 -4331 -7039 -7412 -6254 -4475 -5632 -6300 -2388 -32 -3451 -5775 -1622 3018
3020 3018 6559 -1905 -11384 -5661 -9913 -14185 -12252 -2555 7505 5686 5171 5431 6905 1655 3944
3005 3944 7026 5227 3674 9878 1973 -3009 8780 11522 10926 13264 11379 13109 18010 17456 19464
2990 19464 19070 18509 20513 15269 2050 -6735 -7122 1788 -2349 -6278 4887 425 -6637 -4133 6110
2975 6110 -1621 -6126 2323 -2729 1359 10899 12014 4955 1715 -6722 -7722 -9123 -12249 -1027 2930
2960 2930 2885 -3583 -3380 7910 12613 10786 1635 -1305 0 2045 11073 13153 7027 6737 4565 9580
2944 9580 9618 5066 449 -3256 -3653 -442 9389 4505 6024 821 -7770 1601 -4396 -8907 -11562 -12653
2928 -12653 -12175 -7287 -2277 -755 2124 -6091 -12756 -14340 -9436 242 7539 -2602 -15038 -14366 -10877
2913 -10877 -10696 -7251 -11317 -11884 -6685 3526 3279 -1871 -3912 -7817 -9679 -6136 -3786 -3842 -5457 -1249
2897 -1249 7413 6994 274 1965 5135 2653 -6808 -1859 1528 -1309 -13800 -15819 -6671 4798 8073
2882 8073 19493 22206 16293 20794 9491 6923 7536 -879 -2602 -5931 -2572 1603 -3388 -1479 -5753
2867 -5753 -10646 -10950 -1923 1957 -3803 -10135 -6126 2706 7011 21763 21562 11342 7181 6745 3990
2852 3990 3970 4986 7815 13453 12517 13228 13555 5796 -4873 -2336 6080 955 2368 5822 1785 -10161
2836 -10161 -17633 -22831 -15020 -6076 -2777 142 3087 9921 18087 19126 13118 9580 3051 1365 4933
2821 4933 8698 18267 22110 13542 7445 3981 -219 -2926 -4439 -3318 -6942 -13112 -13177 -3759 7187
2806 7187 6914 3404 -3452 -4149 -4600 -1033 4296 671 -814 2084 10217 13654 10448 4418 -391 -6920
2790 -6920 -3313 -4355 951 -2637 -5977 -7523 -3306 -1818 379 6374 9918 8883 3041 4784 5464
2775 5464 100 -1346 -8193 -4148 578 3538 7291 4809 -3571 -6087 -6895 7339 11879 14622 6430
2760 6430 1490 5051 9038 -879 -8523 -6618 -7052 -8118 -6214 -5227 -920 -3279 -7098 -8753 -11637
2745 -11637 -6782 -4847 -10458 -9653 -32 5840 9452 6889 5179 12031 7362 4817 -3629 -9908 -8526
2730 -8526 8643 11124 -2300 -38 -2195 -14186 -8614 -546 3182 7733 5286 -679 1274 -261
2716 -261 -5583 -6635 -11570 -4764 -3054 -4614 -5895 -3550 -504 1193 3149 1746 -3384 389 10173
2701 10173 15824 15886 5927 5413 3937 4793 227 -2453 -4817 -2954 634 1831 -520 -206 6990 4403
2685 4403 2459 1193 -7295 -4081 2982 8075 3677 9635 11655 11564 14139 8442 11743 10933 8832 3324
2669 3324 4818 9464 2956 -8633 -3736 2425 -1467 2853 4176 -3501 -16355 -17884 -19942 -27289
2655 -27289 -16542 -9918 -7618 -11164 -9472 -11978 -8332 -2153 648 -3665 -2156 -1295 4666 -271 -1356
2640 -1356 -1416 1919 3959 -1066 -8541 -6985 4052 6167 6421 10684 13010 12802 16297 19406 17501 10340
2624 10340 8467 11780 11758 6246 7292 6299 -5083 -14195 -14969 -7243 -11763 -3275 10895 10773 -4276
2609 -4276 -11088 3641 8597 7925 5382 9753 13880 11131 10442 10830 9010 6648 7432 5866 3115 -6489
2593 -6489 -12651 -12377 -13118 -13810 -13053 -11582 -8175 -17090 -20540 -20912 -19515 -7619 -4098 -5903 -915 3836
2577 3836 1149 -3334 -10308 -5481 1608 3048 -235 -3680 -9491 -292 11600 10730 4699 -6850 -5266
2562 -5266 -1353 2498 12305 24025 18451 12180 -917 -9146 -12399 -12937 -12158 -9614 -10438 -8125 -4607
2547 -4607 -10931 -9592 1626 179 1420 -2190 -5522 -1002 4159 -8060 -5648 -1927 -4558 -5821
2533 -5821 -7278 -8 6350 11530 5840 1335 2399 -2286 3826 10223 7258 2704 6637 5915 -10144
2518 -10144 -12434 -7523 -5238 -249 7739 1057 6151 9183 58 4545 11724 18105 28140 21913
2504 21913 10735 10967 18089 12408 6401 4507 10778 10887 12541 16767 17466 -1852 -5856 479 3603
2489 3603 2954 3862 3127 1986 6975 9652 2977 2379 2935 -2179 -6591 -5003 188 153 -6921 -5863 -12630
2472 -12630 -13819 -13024 -6225 3491 2106 1181 7442 6362 -2548 -13233 -11589 -4852 2959 1835 -1779
2457 -1779 7262 9507 7652 248 -2610 -10551 -11635 -7893 -4213 6424 10269 8152 13342 21652 365
2442 365 -16109 -7896 -6502 -7961 -912 10392 10975 2609 -481 1741 -772 -7041 -5397 -7521 -7864
2427 -7864 -3085 -21 -8373 -11763 -2021 3518 1559 6213 6571 1357 -6362 -12684 -5138 2094 -954
2412 -954 1993 -3745 -10125 -9968 -4547 173 1600 -7173 -1921 -1629 -9649 -9145 861 2356 4014 6896
2396 6896 -1075 -2893 403 6773 11564 13727 9663 402 -13154 -23570 -18799 -12547 -9986 -3591
2382 -3591 -2173 -2287 3062 2969 -5155 -7252 -8521 -83 6975 7085 3064 1663 2784 -5383 -11106 -3529
2366 -3529 -2245 -4438 5884 4297 -976 -725 1477 2074 4024 14453 15691 11112 13068 10547 5923
2351 5923 3692 9444 11922 8448 2321 -587 -6399 2529 6016 1955 4979 9016 13146 17709 18470
2336 18470 6698 -2893 -4335 -6350 -9601 -2450 7551 15788 10628 7390 9298 6880 7 6837
2322 6837 4161 4036 -2161 -8954 -8476 -1927 5163 -1201 -4078 -3993 -6719 -8042 -2575 1706 -9054 -10258
2306 -10258 -6199 614 -6323 -18725 -11625 -393 -4405 50 2978 11855 16284 12989 9431 5988
2292 5988 5350 307 160 -12493 -17041 -19293 -6460 293 2708 -6013 -13090 -12465 -2232 834 8197
2277 8197 11690 6912 3234 -6917 -14851 -15949 -7251 -6544 -1836 607 4241 178 -12096 -11630 -9838
2262 -9838 -11198 -4651 7829 14677 18587 11856 7714 5864 -8013 -6783 -442 7355 10802 19391
2248 19391 24079 21573 13759 6311 6414 5475 7675 1874 11349 13869 4470 4905 11677 8586 1583
2233 1583 7949 130 -6457 -4211 -1653 920 -2396 959 -954 4363 5991 8702 13404 11614 11701
2218 11701 7159 -1220 -4643 -5667 4761 3322 10989 16788 18618 17400 12175 6121 6460 3004 13187
2203 13187 10480 10420 9315 8519 4256 561 -1259 -4472 -7570 -9099 -9043 527 3377 -2347 -8506 -14900
2187 -14900 -17369 2546 13200 8671 6831 11782 17781 16783 11775 3744 2347 3398 -3243 -1810
2173 -1810 15244 16429 14411 10666 2488 7366 11949 18852 20021 15243 7605 8728 3448 -7123
2159 -7123 -2485 11462 12305 7315 -5750 -20587 -10649 3942 4514 3728 5792 2733 2410 14872 15567
2144 15567 4970 -111 -10285 -10162 1911 13289 8101 -5801 -16169 -11383 -2247 2941 9447
2131 9447 9182 8171 8356 5269 16 4169 12170 16658 15568 10626 6721 -1190 -4691 1265 7980
2116 7980 10449 7089 9202 9849 2747 4735 4253 6915 13640 7491 3372 7688 5830 -1647 -2349 -6347
2100 -6347 -1461 7694 19589 19321 13407 15181 12870 9102 13066 11059 7445 -2009 -3339 6230 5731
2085 5731 6289 8063 6548 2787 4615 -1085 614 7559 9382 8834 9630 6887 6452 3403 -2743 -7643
2069 -7643 -1635 491 -3025 -4469 806 1109 232 2432 3585 -1681 -2513 -2972 -3548 4714 11097 6735
2053 6735 8266 12133 12114 8018 4356 1579 -7224 -5880 -1527 167 1627 287 -3945 -3784 656 -5734
2037 -5734 -5452 -12097 -17547 -9197 -2656 264 -4006 1013 486 -1661 -2324 3259 2091 -3150 -4476 829
2021 829 3455 1437 1253 6836 2373 327 10989 17692 25253 25443 23680 20476 17386 13158 9858
2006 9858 8145 7432 633 -2162 -7789 -6746 -1744 -5482 -19153 -10542 229 3790 4517 -299 -4442
1991 -4442 -8808 -4792 1939 6533 3420 1948 441 4837 4062 -219 -4120 -6844 -9260 -8965 -8436 -11622
1975 -11622 -10664 -10990 -3986 3472 1684 -7344 -5679 -1147 -3353 -5540 -7038 1071 3036 -105 5214
1960 5214 2014 -6487 -5649 8365 9462 17777 10593 2305 8002 7449 9177 10201 58 -864 -1051
1945 -1051 -3443 -2101 -3288 1164 5520 5841 5912 97 -5500 -8453 -6061 -911 4469 4235 4990 9229
1929 9229 10936 2945 7377 2924 2467 2645 3861 -1229 -6975 -2814 2615 6837 4157 1597 5162
1914 5162 9564 2962 -2155 5247 4926 7553 5257 3310 -1219 -4331 -1659 -182 -2995 810 10034
1899 10034 6779 -150 -3557 9983 14892 18835 16675 18224 14205 8616 10918 2293 -6446 -5491 -4067
1884 -4067 2687 10825 9185 3566 4412 1267 -7092 -11753 -8278 5761 8719 2859 2245 -8257 -5706
1869 -5706 -12421 -17227 -10840 -1919 -5879 -8022 -2194 -7545 -9084 1376 3647 -9461 -13395 -2508
1855 -2508 -4799 -5407 -469 4011 -2542 -1649 6591 3873 3655 4203 743 -2700 -3754 -4135 -8696 -6015
1839 -6015 -1292 6454 5766 -1833 -1897 -524 -2853 2086 6700 4644 470 -4971 -9251 -15529 -18783 -16852
1823 -16852 -11670 -2913 -5782 -8970 -12678 -6836 1197 -2604 -8083 -2208 -492 -689 5934 5077 -38
1808 -38 -4915 1463 -348 2807 2938 369 -2559 634 1682 9785 20737 20061 6949 -3162 -5918
1793 -5918 2102 5914 12007 9086 7104 3294 -8624 -3151 3382 11674 15983 16454 18855 20157 12838
1778 12838 15983 19287 8351 6001 3483 -3255 -7647 -4167 -7133 -10770 -3475 -6383 -2296 6554
1764 6554 8334 7229 2878 -7241 -3470 12135 24926 17755 10688 482 -302 -8247 -9622 -5061
1750 -5061 -9309 -18145 -14891 -15459 -9858 -8189 -13828 -11680 -9409 -2793 -199 6085 13824 15614 19179
1735 19179 20556 16616 5413 4487 7133 3614 3135 4838 4333 6061 11058 3611 -13460 -15696 -10177
1720 -10177 3289 7560 7705 7917 15656 15047 3423 -7943 -9764 -12796 -12098 -1916 -3337 -7401 -5355
1705 -5355 -12918 -14024 -17579 -7509 -3574 1504 3561 -907 -5632 143 -4510 -2735 -1061 -672 4842
1690 4842 11874 17063 15287 1807 -2454 7837 7625 4608 3647 4826 7935 12375 13321 6014 -9150
1675 -9150 -9787 -14512 -16879 -15684 -11689 -5559 7131 11135 6661 11508 10615 438 -3437 2810 11160
1660 11160 13296 13771 13718 15250 3850 452 -1641 -5333 -5680 -11726 -10314 -20868 -27145 -22736 -18407
1645 -18407 -17734 -20148 -4218 5446 4403 -13469 -17671 -12499 -14889 -2082 8374 6560 -5346 -7049
1631 -7049 -2605 -9066 -3419 2804 6980 15496 18871 17268 16564 12180 4576 1642 862 -2051 -2703 1578
1615 1578 12620 11813 -4978 -5783 2952 1558 -7252 275 -9457 -20187 -24275 -18519 -7103 -6146 -11631
1600 -11631 -9601 -11222 -3909 -2260 -7614 -6011 -3053 7967 7918 2793 -1691 -5760 -2996 -1139 -6271
1585 -6271 4977 10047 2919 -11023 -14330 -6572 -188 2065 -1240 -9409 -11021 -8032 -5577 -1813
1571 -1813 -9 10456 20628 21798 10824 7539 9592 7019 7155 7141 2202 -2160 9925 9169 3928
1556 3928 1612 -1290 2402 9428 2168 -9400 -5731 -3714 -1964 -1159 -2603 6949 6513 9859 8908
1541 8908 8599 6168 2079 -875 1003 11201 14977 8353 5878 4168 7145 3110 247 -5885 -6517
1526 -6517 1251 3993 2575 -717 -11318 -8713 -5237 4234 9393 9844 13194 13959 3208 -6329 -7708
1511 -7708 -13461 -12240 -2502 -4434 7951 11816 -1794 -9383 633 -2614 -2519 614 1524 -4314 -11747
1496 -11747 -19065 -25206 -18135 -8962 5911 7284 -4413 -1392 3464 5089 1692 8679 269 -16985
1482 -16985 -14004 -3063 5515 1493 -3816 159 7083 2041 148 -5040 -1027 3534 5725 -238
1468 -238 -3695 9627 17134 19002 13768 14239 12096 11901 16774 25766 26980 17555 15143 16091 13361 2837
1452 2837 5459 18749 21195 18227 22839 26321 18169 14000 15862 15469 19131 20566 20829 23229 24869
1437 24869 18241 13459 9580 592 -4126 -8685 -7238 -3872 4115 7741 7501 11310 6655 2481 -441
1422 -441 3480 8680 6274 3135 1000 -1111 2063 4492 4409 11381 -3493 -8703 -10745 -1975 3702
1407 3702 -2961 539 -5270 -2638 -4938 -2924 276 674 -8711 -4416 3855 8429 6835 2563 -2503
1392 -2503 2616 4284 6892 13947 12888 5521 -1426 9164 14487 5054 9393 2983 -1884 -3790 -4011
1377 -4011 -2352 11963 9791 -2094 5750 1215 2415 6510 2186 -818 1518 2572 9102 8606 12249
1362 12249 24549 22218 9414 -841 -4347 -3372 -3632 -5806 1337 7650 11878 1579 -8863 -1142
1348 -1142 9045 11433 5130 2232 1644 3349 -3887 -13333 -9605 -7431 -13346 -9774 -5902 -7543 -7226
1333 -7226 -12527 -15510 -16524 -12457 -5034 -5907 3028 5913 -2230 -4429 6733 15017 12907 9959 -286
1318 -286 -6508 3952 8350 7169 -6121 -13550 -15736 -15127 -14349 -11098 -9313 -2780 -5342 -6419 -3135
1303 -3135 -492 -7231 -11181 -13707 -4804 12117 13077 7488 8984 5426 -939 2213 13156 12920 10902
1288 10902 14881 19241 22194 22499 22000 14091 8142 326 -3221 -1977 3194 5033 11166 18607 7021
1273 7021 -3842 -7250 -3002 488 -1034 -4993 -13868 -13454 3459 4358 -4181 -4233 3235 344 6922
1258 6922 1987 -11951 -19356 -15203 -8433 -1744 -1262 -8353 -1390 3943 10720 16746 10714 11120 3245
1243 3245 6597 2831 -10759 -10306 -3415 -205 -603 4197 9848 12453 13950 8976 11988 12415 10589
1228 10589 8014 -7637 -12994 -7183 3697 7908 6004 3569 3068 471 2952 2108 -3849 -599 8770
1213 8770 7288 1421 9423 14775 1923 -6586 -1905 289 8600 17791 13515 -3507 -8622 -9469 -9811
1198 -9811 -9916 7831 9321 7787 9108 17912 15614 -1029 -8467 -5225 -4544 1572 6262 7200 2748
1183 2748 156 7157 7136 10137 7139 5318 10687 11106 12721 16928 16191 15004 10544 10254 8995 -920
1167 -920 3024 6815 2878 5041 -1553 -7497 -11167 -12613 3378 8192 399 1727 5461 12764 9749
1152 9749 8451 499 -4395 -5805 -1804 9040 6024 -9162 -2492 -1711 -2630 -5711 975 346 -1723
1137 -1723 -7566 -11632 430 9786 13055 17586 9750 11164 10105 7210 -2429 3789 9658 8306 -3738
1122 -3738 -16858 -11591 -9577 -10514 -2815 -5057 -5754 -1926 -815 -4254 -2751 971 -3685 -5155 -4704
1107 -4704 -9268 -6157 -1698 -10574 -15836 -18663 -24723 -15223 -705 8935 15147 16543 2570 614
1093 614 11016 7380 -3011 -4262 -7450 -4823 -5193 -1821 -2809 -4637 4886 8494 12528 4875 -1625
1078 -1625 -6454 -3629 8467 7006 6957 5312 7717 14204 10903 9798 12574 8144 8330 12108 9166
1063 9166 10950 13321 6246 -1280 2740 10712 12497 10065 4186 3073 5045 15340 12812 1530
1049 1530 -1135 2961 3983 -3897 -8533 -15530 -13142 -14374 -18108 -13010 -3323 -256 897 -2426 -7066
1034 -7066 -2811 2447 -5411 -1929 8618 10845 2633 -1410 5756 9587 13948 9569 9514 9956 11537
1019 11537 391 -9357 -5728 -3907 -2240 12281 10048 5683 10748 6900 3959 15105 12816 12252
1005 12252 16570 23448 24826 16343 4607 -653 -2923 -627 30 -9898 -7187 250 -3550 1645 3600
990 3600 56 201 -11117 -12383 -4190 685 -1953 765 592 -5607 3707 3453 -1735 -7019 -2091 -813
974 -813 3080 -4321 -2091 -6561 -9074 -280 -6389 -8958 305 4536 6119 -8382 -5212 -1009 -3809
959 -3809 4082 14218 17796 1981 -7074 -8368 2306 -3038 -7444 -9369 -6333 993 6665 12710
945 12710 19267 11957 11143 11772 -11 113 -757 6328 12203 6765 6805 571 -4812 -1912 -4225 -7964
929 -7964 -7654 -2964 -2983 3553 -6839 -13054 -6667 -4296 328 9562 3526 -2769 2762 7816 3934 3716
913 3716 4604 8753 3990 -775 -3331 -4083 -1122 265 -5248 337 5716 -2178 -7755 -12110 -4239 7759
897 7759 -758 -1457 2592 12117 13034 13214 6972 1631 3069 3949 6214 15294 21922 23923 14086 12369
881 12369 15661 15688 10998 2057 -5880 -13873 -7155 6682 15058 18747 10239 17106 8082 7956 9152
866 9152 13857 10588 8883 5001 2058 12749 9725 9467 6003 3197 1449 9401 9604 5183 1585
851 1585 2074 -4595 -5291 -2479 -8734 -5306 273 2239 8319 10874 6708 2583 -5517 7089 9506
836 9506 2261 -5768 -3407 1386 -122 -4586 -4734 263 3448 3751 5370 -912 1793 -1952 2062 5437
820 5437 12532 13786 -519 -7215 -2633 2478 -7344 -7168 -7639 -10871 -10200 283 9385 4824 -8143
805 -8143 -10926 -4775 -6342 -3300 518 -9253 -10007 -1099 8080 4561 1009 282 4929 3379 -6158 -7187
789 -7187 -3763 -429 6610 6006 4017 8098 4044 -7228 -15718 -17251 -13924 -11965 -11980 -11465 -3629 -2748
773 -2748 -4006 -9208 -6587 -11620 -7335 1187 8469 18732 22249 14916 9200 8621 6867 6425 5920 255
757 255 -3292 -3610 2 -9381 -10182 -12587 -8223 -230 2364 142 -1356 1508 10021 6355 4403 7698
741 7698 5394 10738 17462 8622 1925 4962 2215 -4412 -5503 1166 6924 3840 2670 4437 -3210
726 -3210 -698 7421 349 7086 11947 13559 20135 10322 -1193 -65 -1758 -5602 -4713 -6059 -14458
711 -14458 -9946 -10538 -7797 -8492 -10159 -8011 3306 -1272 -3947 -5870 -9352 -6324 -2140 -5989 -8485
696 -8485 -8927 -7379 -3444 1368 6366 1287 3926 7139 -638 -6451 -4095 -4816 -764 -2348 2700 -7057
680 -7057 -13089 -17797 -21844 -24754 -20452 -9274 -5157 -1439 1722 -696 -10456 -1969 5660 -410 -5226
665 -5226 3723 8607 2349 458 -397 -2933 -1021 5074 10351 5860 12651 4568 3356 1097 3597
650 3597 1211 -3755 -5551 -8255 -9359 -6881 -9543 421 6095 14426 11408 11732 11557 1395 832 10780
634 10780 6833 7390 7970 7214 4533 2376 2083 4750 2605 8560 6871 -1478 -2825 2129 5588 11042
618 11042 11455 11002 4659 3269 598 4963 5048 -2853 -7905 -7238 -9572 -8167 -763 1074 -3374 -322
602 -322 10481 7874 7834 8020 1991 -1064 -6887 -5840 -7947 -11715 -6963 -1831 -8489 -18194 -21495 -24103
586 -24103 -12111 -7032 -4569 -10420 -8710 2566 1998 -1889 -3084 6718 -1746 -4794 -6244 -10187 -11246
571 -11246 -1025 496 -2044 2989 7086 -5452 -7247 -1643 2443 970 -5675 -1998 3644 4693
557 4693 3702 13859 11498 -4398 -13756 -5586 -2940 -2100 -4326 -4199 -2258 -7631 -6752 -9226 -4600 -1267
541 -1267 -415 -8396 -1281 1455 5604 8497 7013 -6234 -5000 -11749 -10364 -10048 -19632 -13057 -6271
526 -6271 -5551 98 7605 6687 -3653 -436 -1133 -3628 -828 -117 1398 -4641 -8130 -13065 -13778 -6007
510 -6007 -4225 3481 4971 -4906 -10481 -9985 -2337 -531 1271 1410 3639 -274 -1582 -1926 -9086 -13064
494 -13064 -9558 545 5226 8433 7063 2693 4816 4260 904 6420 690 -9542 -15225 -7938 -9051
479 -9051 -2350 5157 10445 11642 2971 -2430 -4235 -1111 -5737 -5644 -5585 -5444 -8580 -7908 -1610 2003 5232
462 5232 1109 804 3789 789 2853 -873 1475 5891 -1711 -9254 -8108 -7117 -5167 8895 14465
447 14465 8319 -7159 -5772 6725 3130 -5210 -448 -377 3041 2283 4447 5654 -2516 -12754 -8474
432 -8474 1652 3943 -2540 2308 -3436 -2269 2284 -2461 12339 21204 15807 15171 21290 19209 18640
417 18640 19006 15367 15312 669 -5835 -3025 614 2713 3878 4005 994 -1872 -628 4289 14270 13849
401 13849 9833 8298 3571 1880 -2818 -582 5186 6200 -5414 -12989 -6820 -1765 5483 2623 -520
386 -520 -5181 -2126 -1100 -6681 -6205 1363 -369 3194 -706 -741 -2693 658 2814 4173 10563 17875
370 17875 12661 12324 3948 -3646 -8146 -10091 -2306 2264 -3024 -5259 -5118 -5015 613 2670 9945 16053
354 16053 11933 6448 -906 -2523 -125 6844 3101 7352 13533 15586 11608 -502 -14086 -11386
340 -11386 342 7397 7182 2259 2096 828 -2885 -10677 -12865 -7575 -9053 -10901 -4034 -4652 -5795
325 -5795 -3953 -195 -5414 -8077 -8340 -1883 9883 9853 4852 -480 -749 8186 6009 8058 6830 -3020
309 -3020 -3616 515 944 -80 -7071 -11769 -4106 8826 14012 12754 -3946 -17494 -16125 -9645 -4815
294 -4815 801 12953 7982 926 6801 3750 3482 5274 -4226 -4474 2651 3223 -2931 -20216 -26338
279 -26338 -10976 -254 -4213 -8466 -10566 -8490 -32 399 -3212 -87 4152 -5503 997 6459 -2114
264 -2114 -12298 -13205 -13530 -8565 -11256 -7410 -9385 -9568 -1374 7336 2658 2446 -424 -6316 -11490 -13504
248 -13504 -9739 285 3627 -3022 -7989 -6863 -1313 1684 10077 9822 7371 2503 3328 -4499 -8786
233 -8786 -6534 -44 1994 3923 11492 10505 11920 12178 1825 5608 9879 15035 10084 599 -3395
218 -3395 -389 1941 9760 11219 8250 10980 8249 -1638 -8643 -5019 -7115 -2919 -1263 -2178 3591
203 3591 12422 10496 8770 6615 8296 13783 12235 8781 6790 7354 469 530 1440 3695 4433 4916 -2432
186 -2432 -3766 -1582 -9065 -10028 -6468 2171 -4202 -12937 -8563 -1249 -1769 -512 -3867 3694 9074 9661
170 9661 3991 736 -1669 -7440 -4481 2257 7935 1208 -8225 -6354 -6704 -12623 -9418 -3526 -5792
155 -5792 -8563 -7810 -7710 -1753 1573 2452 11707 12817 4124 -7720 -13556 -11553 -8218 -5074 4897 13233
139 13233 9946 9542 8558 4834 1963 -439 602 -54 2028 1215 4025 8809 8335 5934 4008 4007 -2072
122 -2072 -4604 -8076 -15550 -10447 -8803 -8327 -7333 -1740 -1241 -1843 807 8581 9684 5813 1500 1148
106 1148 1539 -57 5400 9172 2228 -1408 4939 5541 4727 11902 10767 5383 2874 -581 -7278 -9696
90 -9696 -6911 -3222 477 -5216 -12615 -4172 1138 -711 1985 7522 6077 -998 -6211 -3996 3920
75 3920 6327 8445 9390 -402 -1982 2594 5751 2345 -7642 -6263 96 5394 8351 8673 5192 9210
59 9210 9050 2675 -4508 -27 -3087 -7433 -4015 -3871 -2764 -797 2659 5462 9463 9015 6234 8678
43 8678 7251 5068 746 -273 3452 1319 -1765 -4095 -4130 -234 1547 -1748 3050 4087 -4250 -4044
27 -4044 4376 7538 645 -6030 338 7424 2845 -874 745 2875 3720 3616 195 -2167 -2471 -7809
11 -7809 -6402 -5017 -2569 -586 -1074 -4022 -40 2497 6405 7690 6748
0 6748
$$ Imaginary data points
##PAGE= N=2
##DATA TABLE= (X++(I..I)), XYDATA
32767 33750 36788 37887 40508 43179 40096 41289 42779 45342 41372 34283 30277 34571 39333 38625 43646
32752 43646 41257 41391 39463 45025 49063 52228 53783 58925 55869 48811 53371 57773 56024 48148 49772
32737 49772 50205 58073 57032 52776 55906 56731 52346 56198 51973 51001 52382 52762 57102 52375 49975
32722 49975 52081 54936 55406 57971 61418 62218 59122 53778 49536 46701 52445 58530 55722 52795 56365
32707 56365 60871 63006 64355 64751 62430 66801 59145 57663 68214 80413 81944 80687 74827 62037
32693 62037 59752 60139 57854 60425 68585 67565 70769 75133 63766 56319 56602 58274 61394 66130 72181
32678 72181 74905 65060 60509 65930 67903 73558 73847 69213 76237 80822 80190 72136 70486 70228 65068
32663 65068 60730 61938 62633 65600 69493 74074 75328 75029 76822 83150 88086 87117 78883 76063 79806
32648 79806 84775 86185 92488 95052 93393 93948 90830 86707 79501 80051 79836 82285 85209 81185 84858
32633 84858 92665 95533 92736 91864 92917 97095 99422 99069 98313 94969 96580 95806 91357 93782 94928
32618 94928 93045 93251 99175 99128 99462 95075 93567 96839 100330 96710 98100 95501 96321 96093 91067 92943
32602 92943 100720 108633 106864 111633 105721 100649 100055 100823 101969 108730 112920 117475 114539 108016 104108
32587 104108 111159 111332 108653 107418 113730 111986 102651 103503 106387 111081 110020 108241 106767 110390 107995
32572 107995 104313 109373 111467 107868 108198 100769 99171 111231 121657 122077 123675 124607 114564 109883
32558 109883 121615 116238 111187 114348 113217 104816 107364 110874 116701 123394 121137 118986 123472 128429
32544 128429 125432 118727 124320 121853 119364 108059 107764 110520 111351 103904 103086 103601 110141 117482 121986
32529 121986 122432 121638 115309 110463 123150 130280 127821 127301 127820 129220 130572 132855 137236 141873 137900
32514 137900 130870 129201 127231 119835 114386 116842 123676 123026 130619 126897 130312 129022 124220 126166
32500 126166 127251 117702 117113 122570 122332 122425 126052 134961 133844 135306 126912 127245 134760 135457 134242 133252
32484 133252 135715 135449 142318 145705 138676 134176 131420 138024 137849 131658 128208 128067 123463 127118 133089
32469 133089 136026 137036 142752 137969 140791 145784 146273 142299 136391 142774 145602 143459 148818 142895
32455 142895 130123 117593 110804 110626 121946 131055 134274 133898 134973 138982 142306 146143 145094 147455
32441 147455 150255 146394 144857 143994 149481 151530 154247 158818 160176 153268 150998 151777 152600 152285 152924
32426 152924 150354 154185 157015 159281 156695 154486 146344 144598 155078 158964 160801 160552 156448 149988
32412 149988 151809 161876 165266 160153 157663 153687 150574 152571 147119 154930 159951 162521 156049 159329
32398 159329 155747 154674 152970 148531 152196 149568 145991 157100 159577 155115 154529 145708 151558 154252
32384 154252 152912 159150 165500 170314 163543 159072 159836 154259 154523 157063 154210 151019 145015 147859 156831
32369 156831 153404 153145 160425 158799 152978 150875 157231 160583 160024 163320 161109 160727 156079 154860 150672
32354 150672 151506 162646 162282 154504 153013 160222 168161 172918 172411 171765 170918 170870 170945 159150 161128 170473
32338 170473 158620 151791 153404 160220 164877 162703 163333 156170 156066 162640 166085 169777 165304 163190
32324 163190 162516 158299 158911 166200 161030 152478 157505 166154 167101 164027 165187 167006 170245 176949 177061
32309 177061 166709 160468 160090 157098 160522 165822 174064 170099 175939 178517 173682 172928 160124 159603
32295 159603 159866 161747 161475 164564 164743 164956 167440 155461 151245 157329 164312 169865 174624 175787 173853
32280 173853 172613 172877 173672 172963 169463 167329 162868 152024 163404 166080 165543 165163 170321 171350 168243
32265 168243 170476 166960 165603 164256 163021 161053 164328 155482 148904 160115 171500 179782 171619 176246
32251 176246 172726 160946 168579 176938 171407 161233 155377 161731 164176 172611 178897 179223 175207 168133
32237 168133 168697 170928 171019 172173 168816 174008 175522 172981 164989 163029 170457 181754 179967 174218 175874
32222 175874 177729 179689 183507 176656 177515 181452 184637 184684 189481 190197 189592 176266 174168 175695 176779
32207 176779 179738 178937 173779 172525 169714 165245 167267 163575 155939 160259 166575 172000 169528 167905
32193 167905 171454 180680 174231 170614 172066 175807 169060 163514 172573 184653 181495 170075 165556 174658
32179 174658 178549 176478 182767 183460 182005 173966 172779 176397 185526 191040 185106 171979 168298 164752
32165 164752 166032 171638 178291 177582 169871 163367 162901 160205 150714 150872 156056 166540 175352 168293 160047
32150 160047 159578 163318 160224 162871 176248 178223 170191 169930 171860 174058 177266 171336 168606 161922
32136 161922 164056 173034 173729 163051 158211 157185 165714 167707 174769 179139 183550 179008 168692 173529
32122 173529 176328 173529 173900 172202 176698 181267 193479 193882 188497 176182 165638 178401 185128 171470
32108 171470 164275 171769 184665 179975 178409 179590 181351 174823 165073 170276 178666 178018 181350 180278
32094 180278 177935 174404 168347 176726 182138 176824 177212 179468 174310 167492 177555 183476 179895 182919
32080 182919 185275 184960 184257 180629 177781 177798 175840 176324 168478 174939 181161 182050 173743 170346 165678 161949
32064 161949 165379 160287 164424 168698 173267 179736 179830 176496 177440 189359 190484 184309 174412 172262 173269
32049 173269 177465 186854 178445 166848 165677 168124 165231 167482 170588 172187 165462 174183 182177 183524
32035 183524 181712 178106 177172 169752 165840 166933 178519 184371 191697 188484 177032 173108 173491 171077
32021 171077 174960 186510 182343 168557 166582 164551 163433 170991 186498 193715 182638 186637 190040
32008 190040 186222 187422 187774 186157 188350 180222 178945 173907 170674 182191 185647 184153 180716 183351
31994 183351 185851 186806 182045 183438 186081 186625 180317 173774 173743 184670 179637 182289 179586 169637 165726
31979 165726 169360 176298 183622 192032 191351 184462 172861 172984 183400 188044 176279 169616 182864 183106
31965 183106 179042 180298 185706 191938 193679 198501 182913 176088 181185 174939 178693 178997 176905 176117
31951 176117 180567 179879 181895 184323 171241 157631 158292 171674 171497 168059 169873 175551 179521 177110
31937 177110 170791 179383 187480 175165 172407 175833 168802 167512 170249 177692 177987 176428 179332 175703
31923 175703 173777 175595 167075 165239 170357 177524 175952 171997 175515 186933 182935 183259 180980 171708
31909 171708 171681 174656 169548 162569 168347 174052 175884 179691 179190 177297 170572 167240 177872 181852 177500
31894 177500 180715 184531 186973 190870 192878 177955 172168 175487 174729 174799 168241 167744 174252 179522 182350
31879 182350 175875 173117 173677 175711 178706 172954 163335 164733 177683 177373 175835 179676 186553 183215
31865 183215 179503 188866 185741 186431 181200 188296 193112 190663 175881 174846 186324 188906 180818 174750
31851 174750 176506 170332 167317 187125 188923 192654 189962 183808 174357 171648 170913 172620 171901 173853
31837 173853 177538 175132 176644 180800 183477 184595 179280 182599 194010 193233 189776 190989 190256 190709 197105
31822 197105 197250 176908 171898 172758 178136 188541 193283 183393 173245 162831 158500 155657 156842 158900
31808 158900 163155 169367 172646 176136 183703 190110 181316 173083 173939 163331 164598 170466 172507 176060
31794 176060 179425 176790 176392 179979 181588 190452 196568 191236 182626 172341 175614 185029 185187 176446
31780 176446 177069 179096 180822 175708 176890 178894 184885 181049 174698 167328 163705 167136 174241 173811 183722
31765 183722 178558 174915 179803 180167 181926 182356 184595 185539 185929 182040 187034 190025 182266 181132 176684
31750 176684 176423 173157 177518 177260 177952 178528 177895 174835 178839 184842 187367 194431 203184 201304 196064
31735 196064 193607 189414 181488 176071 181308 185795 175507 176527 171263 172021 173357 173272 190768 199762
31721 199762 196825 196678 192773 193214 194178 184295 185533 179322 175249 181029 182723 181200 180768 175016 182052
31706 182052 179176 180547 180075 177850 180114 180049 188254 188528 187512 198380 196632 187173 185991 192557 193266
31691 193266 192820 188251 181547 188331 195973 200457 189205 177889 183109 184297 179494 170381 170088 177210
31677 177210 177725 191349 189896 183180 183032 193838 184172 181450 174207 175487 189307 191778 189080 193923
31663 193923 188382 179303 186728 196204 186130 181335 179078 176651 176561 182499 190018 192333 183335 184460
31649 184460 181099 173141 180482 178262 177085 180433 176564 171146 172992 173982 187712 186781 176187 172910
31635 172910 168920 167016 174740 188874 182889 178175 175308 167005 157655 163839 170806 177454 181210 179102
31621 179102 175331 174758 182312 179949 173680 175788 186074 189721 182891 178815 185746 191135 181577 174104
31607 174104 173730 171010 169998 176305 184293 184209 176531 180509 178601 175762 174453 173282 173010 180493 188613
31592 188613 179655 173469 167234 161371 157258 163977 183686 193641 191834 189985 195324 195424 188256 186813
31578 186813 175898 175469 172923 175032 185142 190481 187749 181000 176562 187155 185832 178926 177431 171434
31564 171434 167050 174906 182913 188314 195634 193758 194130 198117 195149 185530 177270 177353 187778 181158 171807
31549 171807 172568 180670 176753 175408 171046 170896 170696 169468 170352 168798 173096 191662 201597 196395 190997
31534 190997 189670 187429 185290 180063 177150 185424 183500 185753 183425 182158 190636 189060 183790 183249
31520 183249 175756 181181 185944 193120 190598 184699 182386 181472 184402 186831 186803 195372 200119 190547 189081
31505 189081 201117 199957 205282 203707 203911 202480 189470 177391 169242 184004 198027 196103 192534
31492 192534 196501 194813 183795 181421 178125 175152 170866 175674 176151 178654 183201 187844 178898 177838
31478 177838 183592 184125 184076 193364 193309 182689 188491 187106 184522 182441 177313 174031 173676 174319 177895 179559
31462 179559 187095 189186 184950 189002 186176 183120 185527 197380 204151 200127 197707 188252 185764 182408
31448 182408 170828 165473 168608 168734 180811 193158 191385 175771 180089 180750 180918 186127 182600 171233
31434 171233 169522 164751 173024 178185 172597 170740 172326 180406 182701 182622 179406 173626 172381 175681 166926
31419 166926 171826 173970 181610 180292 180320 187274 193374 184247 174703 178321 185008 195403 196894 185833
31405 185833 177732 177771 178795 178359 184776 189674 181614 174444 179834 182325 191000 186038 190445 188478 186683
31390 186683 180397 179912 179919 182225 189160 183300 181639 184599 188729 186566 185381 194769 194671 187122 179310 172438
31374 172438 161307 154902 155724 159091 165141 171280 168644 174543 182134 192373 187987 173027 176803 186384
31360 186384 192114 185561 180619 180912 183266 182379 179845 181861 183116 178699 178409 170886 163315 155312 162768
$$ [...]
##END NTUPLES=NMR SPECTRUM
##END=
