##TITLE=Analysis number 326279
Compound Code cc 59422
Book Reference 494/112
Project Code adrs
Chemist Name craigr
##JCAMPDX= 6.0         $$ Bruker NMR JCAMP-DX V2.0
##DATA TYPE= NMR SPECTRUM
##DATA CLASS= NTUPLES
##ORIGIN= Bruker BioSpin GmbH
##OWNER= nmr
$$ XWIN-NMR		Version 3.5
$$ Wed Jan 31 10:40:48 2007 GMT Standard Time (UT+0h)  MAYBRIDGE\nmr@NMR_250MHZ
##.OBSERVE FREQUENCY= 250.131544655141
##.OBSERVE NUCLEUS= ^1H
##.ACQUISITION MODE= SIMULTANEOUS (DQD)
##.ACQUISITION SCHEME= undefined
##.AVERAGES= 16
##.DIGITISER RES= 18
##SPECTROMETER/DATA SYSTEM= dpx250
##.PULSE SEQUENCE= zg30
##.SOLVENT NAME= CDCl3
##.SHIFT REFERENCE= (INTERNAL, CDCl3, 0, 16.522)
##AUDIT TRAIL= $$ (NUMBER, WHEN, WHO, WHERE, WHAT)
$$ ##TITLE= Audit trail, XWIN-NMR		Version 3.5
$$ ##JCAMPDX= 5.01
$$ ##ORIGIN= Bruker BioSpin GmbH
$$ ##OWNER= nmr
$$ C:\u/data/dgb/nmr/ADRS/2380/pdata/1/auditp.txt
$$ ##AUDIT TRAIL=  $$ (NUMBER, WHEN, WHO, WHERE, WHAT)
(   1,<2007-01-31 10:40:11.37 +000>,<MAYBRIDGE\nmr>,<NMR_250MHZ>,
      <created by zg, POWCHK disabled, PULCHK disabled
       configuration hash MD5:
       49 4B E0 1D 92 C2 6B 37 9F E6 65 BC 52 41 86 1D
       data hash MD5: 64K
       31 70 27 60 35 39 D0 76 04 46 27 89 30 B6 F4 0D>)
(   2,<2007-01-31 10:40:29.58 +000>,<MAYBRIDGE\nmr>,<NMR_250MHZ>,
      <Start of raw data processing
       ef LB = 0.3 FT_mod = 6 PKNL = 1 SI = 32K 
       data hash MD5: 32K
       B9 DA D9 F7 8C 45 9C 6A D7 7B E9 5E C4 E2 C9 43>)
(   3,<2007-01-31 10:40:34.22 +000>,<MAYBRIDGE\nmr>,<NMR_250MHZ>,
      <apk 
       data hash MD5: 32K
       8D 31 94 28 76 D0 4E 9C 30 25 67 AE 60 E6 3D 34>)
(   4,<2007-01-31 10:40:36.06 +000>,<MAYBRIDGE\nmr>,<NMR_250MHZ>,
      <abs ABSG = 5 
       data hash MD5: 32K
       DD 4D E0 99 CA 42 33 5C 1E 01 8B 8C 6F 63 0C 9E>)
$$ ##END=
$$ 
$$ hash MD5
$$ A8 96 04 36 4D 0C 94 C8 37 52 CA 14 19 0F 38 1D
##$RELAX= 
##$RELAX= 
##$RELAX= 
##$RELAX= 
##$RELAX= 
##$RELAX= 
##$RELAX= 
$$ Bruker specific parameters
$$ --------------------------
##$DU= <C:\u>
##$EXPNO= 2380
##$NAME= <ADRS>
##$PROCNO= 1
##$TYPE= <nmr>
##$USER= <dgb>
##$AMP= (0..31)
100 100 100 100 100 100 100 100 100 100 100 100 100 100 100 100 100 100 
100 100 100 100 100 100 100 100 100 100 100 100 100 100 
##$AQSEQ= 0
##$AQ_mod= 3
##$AUNM= <au_zg>
##$AUTOPOS= <29 >
##$BF1= 250.13
##$BF2= 250.13
##$BF3= 250.13
##$BF4= 250.13
##$BF5= 500.13
##$BF6= 500.13
##$BF7= 500.13
##$BF8= 500.13
##$BYTORDA= 1
##$CFDGTYP= 0
##$CFRGTYP= 5
##$CHEMSTR= <none>
##$CNST= (0..31)
1 1 145 1 1 1 1 1 1 1 1 1 1 1 1 1 1 1 1 1 1 1 1 1 1 1 1 1 1 1 1 1 
##$CPDPRG= <>
##$CPDPRG1= <>
##$CPDPRG2= <>
##$CPDPRG3= <>
##$CPDPRG4= <mlev>
##$CPDPRG5= <mlev>
##$CPDPRG6= <mlev>
##$CPDPRG7= <mlev>
##$CPDPRG8= <mlev>
##$CPDPRGB= <>
##$CPDPRGT= <>
##$D= (0..31)
0 1 0 0 0 0 0 0 0 0.06 0 0 0 0 0 0 0.0002 0 0 0 0 0 0 0 0 0 0 0 0 0 0 
0 
##$DATE= 1170240009
##$DBL= (0..7)
120 120 120 120 120 120 120 120 
##$DBP= (0..7)
150 150 150 150 150 150 150 150 
##$DBP07= 0
##$DBPNAM0= <>
##$DBPNAM1= <>
$$ [...]
##$SUBNAM7= <"">
##$SUBNAM8= <"">
##$SUBNAM9= <"">
##$SW= 20.6930455092707
##$SWIBOX= (0..15)
0 0 3 0 0 0 0 0 0 0 0 0 0 0 0 0 
##$SW_h= 5175.983436853
##$TD= 65536
##$TD0= 1
##$TE= 294.16
##$TE2= 300
##$TE3= 300
##$TEG= 300
##$TL= (0..7)
0 120 120 120 120 120 120 120 
##$TP= (0..7)
150 150 150 150 150 150 150 150 
##$TP07= 0
##$TPNAME0= <>
##$TPNAME1= <>
##$TPNAME2= <>
##$TPNAME3= <>
##$TPNAME4= <>
##$TPNAME5= <>
##$TPNAME6= <>
##$TPNAME7= <>
##$TPOAL= (0..7)
0.5 0.5 0.5 0.5 0.5 0.5 0.5 0.5 
##$TPOFFS= (0..7)
0 0 0 0 0 0 0 0 
##$TUNHIN= 0
##$TUNHOUT= 0
##$TUNXOUT= 0
##$USERA1= <user>
##$USERA2= <user>
##$USERA3= <user>
##$USERA4= <user>
##$USERA5= <user>
##$V9= 5
##$VALIST= <valist>
##$VCLIST= <CCCCCCCCCCCCCCC>
##$VD= 0
##$VDLIST= <DDDDDDDDDDDDDDD>
##$VPLIST= <PPPPPPPPPPPPPPP>
##$VTLIST= <TTTTTTTTTTTTTTT>
##$WBST= 1024
##$WBSW= 4
##$XGAIN= (0..3)
0 0 0 0 
##$XL= 0
##$YL= 0
##$YMAX_a= 333092
##$YMIN_a= -459465
##$ZGOPTNS= <>
##$ZL1= 120
##$ZL2= 120
##$ZL3= 120
##$ZL4= 120
##$ABSF1= 16.522
##$ABSF2= -4.171173
##$ABSG= 5
##$ABSL= 3
##$ALPHA= 0
##$AQORDER= 0
##$ASSFAC= 0
##$ASSFACI= 0
##$ASSFACX= 0
##$ASSWID= 0
##$AUNMP= <proc_1d>
##$AZFE= 0.1
##$AZFW= 0.1
##$BCFW= 0
##$BC_mod= 0
##$BYTORDP= 0
##$COROFFS= 0
##$CY= 12.5
##$DATMOD= 1
##$DC= 0
##$DFILT= <>
##$DTYPP= 0
##$F1P= 14.0000005364418
##$F2P= -0.99999901652339
##$FCOR= 0.5
##$FTSIZE= 32768
##$FT_mod= 6
##$GAMMA= 0
##$GB= 0
##$INTBC= 1
##$INTSCL= 1
##$ISEN= 128
##$LB= 0.3
##$LEV0= 0
##$LPBIN= 0
##$MAXI= 10000
##$MC2= 0
##$MEAN= 0
##$ME_mod= 0
##$MI= 0
##$NCOEF= 0
##$NC_proc= -2
##$NLEV= 6
##$NOISF1= 0
##$NOISF2= 0
##$NSP= 0
##$NTH_PI= 0
##$NZP= 0
##$OFFSET= 16.522
##$PC= 1
##$PHC0= 230.8216
##$PHC1= 7.911049
##$PH_mod= 1
##$PKNL= yes
##$PPARMOD= 0
##$PSCAL= 4
##$PSIGN= 0
##$REVERSE= no
##$SF= 250.13
##$SI= 32768
##$SIGF1= 0
##$SIGF2= 0
##$SINO= 400
##$SIOLD= 32768
##$SREGLST= <1H.CDCl3>
##$SSB= 0
##$STSI= 32768
##$STSR= 0
##$SW_p= 5175.98343685301
##$SYMM= 0
##$S_DEV= 0
##$TDeff= 65536
##$TDoff= 0
##$TI= <Analysis number 999999
Compound Code 99
Book Reference 9
Project Code 9>
##$TILT= no
##$TM1= 0
##$TM2= 0
##$TOPLEV= 0
##$USERP1= <user>
##$USERP2= <user>
##$USERP3= <user>
##$USERP4= <user>
##$USERP5= <user>
##$WDW= 1
##$XDIM= 32768
##$YMAX_p= 312540288
##$YMIN_p= -36946
$$ End of Bruker specific parameters
$$ ---------------------------------
##NTUPLES= NMR SPECTRUM
##VAR_NAME=  FREQUENCY,     SPECTRUM/REAL,   SPECTRUM/IMAG
##SYMBOL=    X,             R,               I
##VAR_TYPE=  INDEPENDENT,   DEPENDENT,       DEPENDENT
##VAR_FORM=  AFFN,          ASDF,            ASDF
##VAR_DIM=   32768,         32768,           32768
##UNITS=     HZ,            ARBITRARY UNITS, ARBITRARY UNITS
##FACTOR=    0.157963299565203, 1,           1
##FIRST=     4132.6476996994, 0,             0
##LAST=      -1043.33573715361, 0,           0
##MIN=       -1043.33573715361, -36946,      0
##MAX=       4132.6476996994, 312540288,     0
$$ Real data points
##PAGE= N=1
##DATA TABLE= (X++(R..R)), XYDATA
$$ [...]
16614I984k559r841J0860J156q495k907n166j1243Q134J787P391L250k724o629
$$ 9984 7425 -2416 8444 9600 1105 -1802 -6968 -18211 -10077 -8290 -899 2351 -373 -7002
16600g002p151l100M051L360P85k09L794M252n151m916N99p315O950R892J227
$$ -7002 -14153 -17253 -13202 -9842 -9057 -9266 -5472 -1220 -6371 -11287 -10688 -18003 -11053 -1161 66
16585F6J195L802l392k31P93r32m193n214K899n862j1726k10J2260O077k523q341
$$ 66 1261 5063 1671 1440 2233 1301 -2892 -8106 -5207 -11069 -22795 -23005 -10745 -4668 -7191 -15532
16569a5532N452o294q428K112J2343R990m928M492J2624k517k3241q346J206J914
$$ -15532 -10080 -16374 -24802 -22690 -10347 -357 -5285 -793 11831 9314 -13927 -22273 -21067 -19153
16555a9153N060Q65K679K190j35k468m364P116L555J175j103n063L549P709N40
$$ -19153 -14093 -13228 -10549 -8359 -8494 -10962 -15326 -8210 -4655 -3480 -4583 -9646 -6097 1612 2152
16540B152j4391J404J0023K11j2068k725J2855Q252J710N491J232j260L361j0219
$$ 2152 -12239 -10835 -812 -601 -12669 -15394 -2539 5713 7423 12914 14146 12886 16247 6028
16526F028n780p218o053l183N798Q724n125J262N11L491p423o500p213L913J601
$$ 6028 248 -6970 -13023 -16206 -10408 -1684 -6809 -5547 -5036 -1545 -8968 -15468 -22681 -18768 -17167
16511a7167j35L710q0P925Q202J729M213n904m496J115j224k302L750M211L806
$$ -17167 -17302 -13592 -13672 -5747 2455 4184 8397 2493 -2003 -888 -2112 -4414 -664 3547 7353
16496G353R20O881K429k894O50r106N28M153M29p808j2068j2005L036M22P831
$$ 7353 8273 15154 17583 14689 15339 6233 6761 10914 11343 3535 -8533 -20538 -17502 -17080 -9249
16481i249J8484k285j0885k132J0829L685j4877L708K203M760j36p624j0802M506
$$ -9249 9235 6950 -3935 -6067 4762 8447 -6430 -2722 -519 4241 4105 -3519 -14321 -9815
16467i815q762J510R130O542N075m729q130K67Q684R786M509J878j0840r557k930
$$ -9815 -18577 -17067 -7937 -1395 3680 -1049 -9179 -8912 -228 9558 14067 15945 5105 -4452 -7382
16452g382j4444p386J432L447M55m337n626L101N628R688l10m5K285J462R54L414
$$ -7382 -21826 -29212 -27780 -24333 -23878 -28215 -33841 -30740 -25112 -15424 -15734 -15779 -13494 -12032 -11078 -7664
16436g664L086K89O254J579r921r873J0029N784k444J345l158J646o380m89L366
$$ -7664 -4578 -4289 1965 3544 -6377 -16250 -6221 -437 -2881 -1536 -4694 -3048 -9428 -9917 -6551
16421f551L01k884J519P41p976M038M854k168k67j234M264K099N862q220j164
$$ -6551 -6250 -9134 -7615 -6874 -14850 -10812 -5958 -8126 -8393 -9627 -5363 -3264 2598 -5622 -6786
16406f786k192j496N919o37o176J842j123k555k374k027m236P272Q723M758M690
$$ -6786 -8978 -10474 -4555 -5192 -11368 -9526 -10649 -13204 -15578 -17605 -21841 -14569 -5846 -1088 3602
16391C602K995l301p045q102k424M865J336j494O273Q186r161K656M832j399m426
$$ 3602 6597 3296 -3749 -11851 -14275 -9410 -8074 -9568 -3295 4891 -4270 -1614 3218 1819 -2607
16376b607l25l887o238p32k885N094N334O156L99j5546j0608k778Q149k839n428
$$ -2607 -2932 -6819 -13057 -13789 -16674 -11580 -6246 -90 309 -15237 -25845 -28623 -20474 -23313 -28741
16361b8741J0121O182j392k698n612m056L526L594k41K907P994M351P165J0045
$$ -28741 -18620 -12438 -13830 -16528 -22140 -26196 -22670 -19076 -19317 -16410 -8416 -4065 3100 13145
16347A3145M941k932j0061o998n788n451j082q366L325P714N401j0531L832Q093
$$ 13145 18086 15154 5093 -1905 -7693 -13144 -14226 -22592 -19267 -11553 -6152 -16683 -12851 -4758
16333d758j549K681M249k664l425N72j0045M750J682J232M691M841l244m208k238
$$ -4758 -6307 -3626 623 -2041 -5466 -4894 -14939 -10189 -8507 -7275 -2584 2257 -987 -5195 -7433
16318g433k205R482M765P31p69P4l425q859k175L852N948J691j744k955p42k908
$$ -7433 -9638 -156 4609 5340 4571 4645 1220 -7639 -9814 -5962 -14 1677 -67 -3022 -3764 -6672
16302f672K534P466K904n058K563q787j9024l215J9170J0248k318n135O256Q906
$$ -6672 -4138 3328 6232 1174 3737 -5050 -24074 -27289 -8119 2129 -189 -5324 932 9838
16288I838n37o069n044O02n335j4380m379J5986K0654N003l855m092j0320k807
$$ 9838 9301 3232 -1812 -1210 -6545 -20925 -25304 -9318 11336 16339 12484 8392 -1928 -4735
16274d735N44j650k057o621k909O460M061N610k818J209O076Q013M42M969R237
$$ -4735 -4191 -5841 -7898 -14519 -17428 -10968 -6907 -1297 -4115 -2906 3170 11183 11625 16594 25831
16259B5831j048q655j1036O025J3350K044l603m772j1702q566N88p716k056m44
$$ 25831 24783 16128 5092 11117 24467 26511 22908 18136 6434 -2132 -1544 -9260 -11316 -11760
16245a1760m50Q696m852q045j334Q297Q453rm515M526Q105n659j2840n04P665
$$ -11760 -12210 -3514 -8366 -16411 -17745 -9448 -995 -1004 -5519 -993 7112 1453 -11387 -11891 -4226
16230d226M285O127J306m214j2787P254M983L421O014O39l415j4451n264N249
$$ -4226 59 6186 7492 3278 -9509 -2255 2728 6149 12163 12802 9387 -5064 -10328 -5079
16216e079k587j691j982N065K671L16o45M705o71R79q53J0157N85m293l859o779
$$ -5079 -7666 -9357 -11339 -6274 -3603 -3287 -3932 773 102 1081 228 10385 10970 6677 2818 -3961
16200c961j589L932n334r990m698P693R22M951O068O747O757J0564Q997k648p153
$$ -3961 -5550 -1618 -6952 -16942 -21640 -13947 -13025 -8074 -2006 4741 11498 22062 31059 28411 21258
16185B1258L954o701m286r645m439n732P634j644O056j296j0697K956O421K966
$$ 21258 25212 18511 14225 4580 141 -5591 2043 399 6455 5159 -5538 -2582 3839 6805
16171F805m463j683J0347p44o920j3734J868P647k320r494n59J2989M853l985
$$ 6805 2342 659 11006 10262 3342 -10392 -8524 -877 -3197 -12691 -13250 -261 4592 607
16157F07r30J284M712L30K104L659R694N322J119p258m709Q819M987j3340l605
$$ 607 -323 961 5673 6003 8107 11766 21460 26782 27901 20643 15934 24753 29740 16400 12795
16142A2795k180j691j4831j551N259k7n217q027r43j421O439J876p099q122M457
$$ 12795 10615 8924 -5907 -7458 -2199 -2226 -7443 -15470 -16413 -17834 -11395 -9519 -16618 -24740 -20283
16127b0283N843L195R910l426J622Q447R338o67j431o539j501K652Q02m821k989
$$ -20283 -14440 -11245 -1335 -4761 -3139 5308 14646 13979 12548 6009 4508 7160 7962 3141 152
16112A52L570P499q76m909o165L826K806n647P517o854n680M650j1021j0301O662
$$ 152 3722 11221 10345 5436 -729 3097 5903 256 7773 919 -4761 -111 -11132 -21433 -14771
16097a4771M379q12q514J077K416P007j811M424R376O081j679N215k988p770n952
$$ -14771 -10392 -11204 -19718 -18641 -16225 -9218 -11029 -6605 2771 8852 7173 12388 9400 1630 -4322
16082d322J2027J6700R531K713j4984q912j377K171r050o018n720R857O642j5589
$$ -4322 7705 24405 33936 36649 21665 12753 11376 13547 4497 -1521 -7241 2616 9258 -6331
16068f331r351N121J8073J1942J690m098o688n729k049j891M84r935l948Q201
$$ -6331 -15682 -10561 7512 19454 21144 17046 10358 4629 2580 689 1173 -8762 -12710 -4509
16054d509L515n16K138k605J1356o764n953M400j207k013K729M93l846j0134J1
$$ -4509 -994 -1510 628 -1977 9379 2615 -3338 1062 -145 -2158 571 1064 -2782 -12916 -12905
16039a2905N555J767m504m743N609J2514N543n002o509Q61K537N055j256k287
$$ -12905 -7350 -5583 -10087 -14830 -9221 3293 8836 3834 -2675 -1814 723 5778 4522 2235
16025B235n947j176J846j505k12K031o772Q476N015M334M560p836p157N45J907
$$ 2235 -3712 -4888 -3042 -4547 -4759 -2728 -9500 -1024 3991 8325 12885 5049 -2108 -1563 344
16010C44j0212k932J289J067M010K226m478l804j0096O77J000r843N355J1837
$$ 344 -9868 -12800 -11511 -10444 -6434 -4208 -8686 -12490 -22586 -21909 -20909 -30752 -25397 -13560
15996a3560M292J845K382l055m75n140n981K800N824J485K482n13O299L407j87
$$ -13560 -9268 -7423 -5041 -8096 -8571 -13711 -19692 -16892 -11068 -9583 -7101 -7614 -1315 2092 1905
15981A905k623k082j1200L675L014K783P649K221O1j1389n914l443l956m348J2629
$$ 1905 -718 -2800 -14000 -10325 -7311 -4528 3121 5342 5403 -5986 -11900 -15343 -19299 -23647 -11018
15966a1018M083J205QL418M74l41o499J2488o40N584K14m212L16K288j435k257
$$ -11018 -6935 -5730 -5722 -2304 -1830 -2171 -8670 3818 3178 8762 8976 4764 5080 7368 5933 3676
15950C676N247P1o828m271O972R748j6257n532J3649m054J053j223K113J513q406
$$ 3676 8923 8994 2166 -2105 4867 14615 -1642 -7174 6475 2421 3474 2251 4364 5877 -2529
15935b529j242L865o432o286Q888L212j0269j1243J5209J3600r84n980r918p749
$$ -2529 -3771 94 -6338 -12624 -3736 -524 -10793 -22036 -6827 6773 5789 -191 -10109 -17858
15921a7858n37L324J0267K203k264L961J734j195j387J0263q348m309l504N529
$$ -17858 -18395 -15071 -4804 -2601 -4865 -904 830 -365 -1752 8511 163 -4146 -7650 -2121
15907b121j1742K162k288p099N430J4955M664k624n01q071r0j045K499K111j1457
$$ -2121 -13863 -11701 -13989 -21088 -15658 -703 3961 1337 836 -7235 -7325 -8370 -5871 -3760 -15217
15892a5217M711J9902J7114J565j4901j6935N772k137o58k606O214M335q178P794
$$ -15217 -10506 9396 26510 28075 13174 -3761 2011 -126 -784 -3390 2824 7159 -1019 6775
15878F775J980m732J340l184n789M085M220p62j0681r284L153L775L799J5890
$$ 6775 8755 4023 5363 2179 -3610 475 4695 3933 -6748 -16032 -12879 -9104 -5305 10585
15864A0585J591j1582k505n655q984o074N249l205K048J558L608M822r3O143j443
$$ 10585 12176 594 -1911 -7566 -16550 -22624 -17375 -20580 -18532 -16974 -13366 -8544 -8637 -2494 -3937
15849c937L454J614K24n729j025m522l030J3502n355q533N749K285J3812P821
$$ -3937 -483 1131 1355 -4374 -5399 -9921 -12951 551 -4804 -13337 -7588 -5303 8509 16330
15835A6330J1126k505j6837n695Q627k384R85J040K254j815O820o858p000L407
$$ 16330 27456 24951 8114 2419 11046 8662 9647 10687 12941 11126 17946 11088 4088 7495
15821G495R912l766p745M889o756k569K723K427O53M141NL887j114o391l806j000
$$ 7495 17407 13641 5896 10785 4029 1460 4183 6610 7263 11404 11409 15296 14182 7791 3985 2985
15805B985n490m109k880n22O43k763N204N978Q758k24l085Q38J758J035Q77M085
$$ 2985 -2505 -6614 -9494 -10016 -9373 -12136 -6932 -954 7804 7580 4495 5333 7091 8126 9003 13088
15789A3088p2m820J990k199j019l057m222j0242Q798K674L025r995j1479l616
$$ 13088 13016 8196 10186 7987 6968 3911 -311 -10553 -1755 919 3944 -6051 -17530 -21146
15775b1146P322l709l630K311N559K398l726L112J905j195o551m346K917O030
$$ -21146 -13824 -17533 -21163 -18852 -13293 -10895 -14621 -11509 -9604 -10799 -17350 -21696 -18779 -12749
15761a2749P133j988N224L242J0009p488K462l201m438l655K221M979p951n081
$$ -12749 -5616 -7604 -2380 862 10871 3383 5845 2644 -1794 -5449 -3228 1751 -6200 -11281
15747a1281L304Q752P098J832J384j0798o069K146J58O139m506m481J915N59k658
$$ -11281 -7977 775 7873 9705 11089 291 -5778 -3632 -3474 2665 -1841 -6322 -4407 -3848 -6506
15732f506p232l642J1385J1342l255n677n267j647J0973N86Q268p587M420M436
$$ -6506 -13738 -17380 -5995 5347 2092 -3585 -8852 -10499 474 1060 9328 1741 6161 10597
15718A0597k323n360j1364Q849N360r328p294o958L189J2178L540q702j621O145
$$ 10597 8274 2914 -8450 399 5759 -3569 -10863 -17821 -14632 -2454 1086 -7616 -9237 -3092
15704c092N400L104k899p726N622R954N97k625r330j831p570p284O286O604N056
$$ -3092 2308 5412 2513 -5213 409 10363 10960 8335 -995 -2826 -10396 -17680 -11394 -4790 266
15689B66J456M538K113q4q245k978j2592n506J0918J4976K428j3195k794n067
$$ 266 1722 6260 8373 8289 44 -2934 -15526 -21032 -10114 4862 7290 -5905 -8699 -13766
15675a3766N06M216n6m635p80m89j296n168J605L428K825j703O585L287n446N00
$$ -13766 -13260 -9044 -9100 -13735 -14515 -15004 -16300 -21468 -19863 -16435 -13610 -15313 -8728 -5441 -10887 -10387
15659a0387J257L386J120R270Q073n867j4252J2250N97p338r495O087L230K215
$$ -10387 -9130 -5744 -4624 4646 12719 6852 -7400 4850 5447 -1891 -11386 -5299 -2069 146
15645A46N187k536p966J425k218m583n284l115k2L712M01m015O601J3247j758
$$ 146 5333 2797 -5169 -3744 -5962 -10545 -15829 -18944 -18966 -15254 -14853 -18868 -12267 980 -778
15630g78n624M35m232n249l450O232J0078K164l376r234R84r86J965r802J30P688
$$ -778 -6402 -5967 -10199 -15448 -18898 -12666 -2588 -424 -3800 -13034 -12050 -13036 -11071 -20873 -20743 -13055
15614a3055O139J80p199J001J2374O911P303m695o52l154N359L492l365m274p661
$$ -13055 -6916 -6736 -13935 -12934 -560 6351 13654 8959 8307 5153 10512 14004 10639 6365 -1296
15599a296j3772n275J2193P807R489j2715o670J812N104P445n386j2123k164m527
$$ -1296 -15068 -20343 -8150 -343 9146 -3569 -10239 -8427 -3323 4122 -1264 -13387 -15551 -20078
15585b0078L999R688k974R348J2831L595m182q619n955q603q989j984P079J851
$$ -20078 -16079 -6391 -9365 -17 12814 16409 12227 3608 -2347 -10950 -19939 -21923 -14844 -12993
15571a2993L842P51n15j2068K676Q183J1044J80p938m648m199o104q92M611k839
$$ -12993 -9151 -8400 -8915 -20983 -18307 -10124 920 1100 -6838 -11486 -15685 -21789 -22681 -18070 -20909
15556b0909k663O328m181r05N247N458N538n225J309Q344l379k398L612k187j2908
$$ -20909 -23572 -17244 -21425 -22330 -17083 -11625 -6087 -11312 -10003 -1659 -5038 -7436 -3824 -6011 -18919
15541a8919j8027M472J205Q930N867K449L33l465L062Q605J144r651j1746l098
$$ -18919 -36946 -32474 -31269 -22339 -16472 -14023 -13690 -17155 -14093 -5488 -4344 -13995 -25741 -28839
15527b8839P603n176M337N796N580Q361j192M65k040L838J0957M317j0804P310
$$ -28839 -21236 -26412 -22075 -16279 -10699 -2338 -3530 -3065 -5105 -1267 9690 14007 3203 10513
15513A0513j0901j3438J650J1168m165q193N697j479j680n631m384P012R973j178
$$ 10513 -388 -13826 -12176 -1008 -5173 -13366 -7669 -9148 -10828 -16459 -20843 -13831 -3858 -5036
15499e036P972O071p218Q65l151M537M4Q000O545q664j9564o133O194L723l323
$$ -5036 2936 9007 1789 2654 -497 4040 4084 12084 18629 9965 -9599 -15732 -9538 -5815 -9138
15484i138K009n305M629O545J273p20m822k707m222o281K336J0123L366K458q893
$$ -9138 -7129 -12434 -7805 -1260 13 -707 -5529 -8236 -12458 -18739 -16403 -6280 -2914 -456 -9349
15469i349M918N873j671M506P411q764m69r96J547M557Q354L153p984j065r258
$$ -9349 -4431 1442 -229 4277 11688 2924 2455 1459 3006 7563 15917 19070 11086 10021 763
15454G63j155N805N81p386m802l066l432J743N652K383j4838p040Q797J2077K51
$$ 763 -392 5413 5994 -1392 -6194 -9260 -12692 -10949 -5297 -2914 -17752 -24792 -15995 -3918 -3667
15439c667k97K785J2190p890n608PL365j611J436k587j938K086r17l212n346l924
$$ -3667 -3964 -1179 11011 3121 -2487 -2480 885 -726 710 -1877 -3815 -1729 -2646 -5858 -11204 -15128
15423a5128O503Q56J103L782J998K895l495j483m7l321r558M814R442J7494j786
$$ -15128 -8625 -7769 -6666 -2884 -886 2009 -1486 -2969 -3016 -6337 -15895 -11081 -1639 15855 14069
15408A4069j1593m632r620N35J1882Q470j213p989R839k430j7106p612o33P121
$$ 14069 2476 -2156 -11776 -11241 641 9111 7898 -91 9748 7318 -9788 -17400 -18033 -10912
15394a0912J2038o895j1400n784J840J791J0066O716o825O359j775j596J3644
$$ -10912 1126 -5769 -17169 -22953 -21113 -19322 -9256 -2540 -9365 -3006 -4781 -6377 7267
15381G267k60j946m818m405q007p6l414k664K643K140L821Q657o252k159M334
$$ 7267 7007 5061 243 -4162 -12169 -12245 -15659 -18323 -15680 -13540 -9719 -1062 -7314 -9473 -5139
15366e139K97l436m550o552M108J0037J347R27o227j703K319l98J0493O867j006
$$ -5139 -4842 -8278 -12828 -19380 -15272 -5235 -3888 -2961 -9188 -10891 -8572 -8970 1523 8390 7384
15351G384j7158l811J5240j80l040p33N77J420o02j1299o980N759L08M008L73
$$ 7384 -9774 -13585 1655 1475 -1565 -2298 -1721 -301 -903 -12202 -19182 -13423 -13115 -9107 -8734
15336h734j523J546N769j0074j1378j911L597M976R82O884J2853P509o244l724
$$ -8734 -10257 -8711 -2942 -13016 -24394 -26305 -22708 -17732 -16750 -9866 2987 10496 4252 528
15322E28l151p606q965o416J3956J2342m070L444L973n327n482L769j980q674
$$ 528 -2623 -10229 -19194 -25610 -11654 688 -3382 62 4035 -1292 -6774 -3005 -4985 -13659
15308a3659Q56L765m865K375Q440K68m509M162m877n844K441L039l717N978N135
$$ -13659 -12803 -9038 -13903 -11528 -3088 -2820 -7329 -3167 -8044 -13888 -11447 -8408 -12125 -6147 -1012
15293a012j057L955Q215m574m844j3384r48O724M494k561O803R348K148J1856
$$ -1012 -2069 1886 10101 5527 683 -12701 -13649 -6925 -2431 -4992 1811 11159 13307 25163
15279B5163Q197j008j0942j0216o197m65k812r351P327J3825M396Q850l731o785
$$ 25163 33360 32352 21410 11194 4997 4532 1720 -7631 -304 13521 17917 26767 23036 16251
15265A6251O39m29j885R412o566N196m173J594O782m080j3355K164M818j482o700
$$ 16251 16890 16461 14576 23988 17422 22618 18445 20039 26821 22741 9386 11550 16368 14886 8186
15250H186l032O806P811j3953N112K821m964k891J25r684N358j796q313q22J1916
$$ 8186 5154 11960 19771 5818 10930 13751 8787 5896 6021 -3663 1695 -101 -8414 -9236 2680
15235B680Q99m381j001j0024M298P758L534N393P910J3236M449o829j2900j5893
$$ 2680 3579 -802 -1803 -11827 -7529 229 3763 9156 17066 30302 34751 27922 15022 -871
15221h71q847j1429J3833J6235J0439J5637L556n604r209j7547m31K968n809K561
$$ -871 -9718 -21147 -7314 8921 19360 34997 38553 32949 23740 6193 5762 8730 2921 5482
15207E482N672P74j4020k526M001J655J697n499q95J1467O317j0217j0409j9154
$$ 5482 11154 11928 -2092 -4618 -617 1038 2735 -2764 -3659 7808 14125 3908 -6501 -25655
15193b5655J027K671N644J2989O424M109N510m682m523n307l386J484P356K939
$$ -25655 -24628 -21957 -16313 -3324 3100 7209 12719 8037 3514 -1793 -5179 -3695 3661 6600
15179F600J188l102n934K790J054l144K6L726o122n271k974J3961L545M310l564
$$ 6600 7788 4686 -1248 1542 2596 -548 -522 3204 -2918 -8189 -11163 2798 6343 10653 7089
15164G089p761n167M065k67N505k566j560J647j929j2864P047J0604Q539p881
$$ 7089 -672 -5839 -1774 -2041 3464 898 -662 985 -944 -13808 -6761 3843 12382 4501
15150D501p180J4518M087m015M910R654R227J395q269l554n144j989L591q730
$$ 4501 -2679 11839 15926 11911 16821 26475 35702 37097 28828 25274 20130 18141 21732 13002
15136A3002n618r226O005m915m690P064N538l747N133L757k096l874M324N93j0031
$$ 13002 7384 -1842 4163 -752 -5442 1622 7160 3413 8546 12303 10207 6333 10657 11250 1219
15121A219m345J0720P771J5508N784o993o922j4228j0416m665P210K415K442J5063
$$ 1219 -3126 7594 15365 30873 36657 29664 22742 8514 -1902 -6567 643 3058 5500 20563
15107B0563K169l281N70p812l051P139L782p432l039q384l064r575m878j614K583
$$ 20563 22732 19451 20021 12209 9158 16297 20079 12647 9608 1224 -1840 -11415 -16293 -17907 -15324
15092a5324P724P01l691q450K113J921Q59m094J097M571m68K950P507J341m733
$$ -15324 -7600 -6899 -10590 -19040 -16927 -15006 -14147 -18241 -17144 -12573 -13041 -10091 -2584 -1243 -5976
15077e976K59J011k154Q812O36M873J321J577J019m020j0422n565J839P271K907
$$ -5976 -5717 -4706 -6860 1952 2588 7461 8782 10359 11378 7358 -3064 -8629 -6790 481 3388
15062C388p87M000J744J284o864N433l593r782J1935P687r207j0940K438M045
$$ 3388 2601 6601 8345 9629 2765 8198 4605 -5177 6758 14445 5238 -5702 -3264 781
15048G81O346J3910q35r780j223M961J0395j027m349n145j228N107O089q828K497
$$ 781 7127 21037 20202 10422 9199 14160 24555 23528 19179 14034 12806 17913 24002 15174 17671
15033A7671P713q146r627o788K238M362J900N59j036K330P310Q994j086l67q444
$$ 17671 25384 17238 7611 823 3061 7423 9323 9882 8846 11176 18486 27480 26394 26027 17583
15018A7583m563J2064J8403j633l871n799J137p496J024R694M782j21r262n368
$$ 17583 13020 25084 43487 41854 37983 32184 33321 25825 26849 36543 41325 41204 31942 26574
15004B6574j0089j4346k408o682Q719J0069L245l445j8665p432K012M952Q902
$$ 26574 16485 2139 -269 -6951 1768 11837 15082 11637 -7028 -14460 -12448 -7496 1406
14991A406J982M424P810p83j791j759k485k892P035M046K97P949j084M998q564
$$ 1406 3388 7812 15622 14839 13048 11289 8804 5912 12947 16993 17290 25239 24155 29153 20589
14976B0589m657j923O755J942Q643J274j5959k233R491n410m497o478j532J827
$$ 20589 15932 14009 20764 22706 31349 32623 16664 14431 23922 18512 14015 7537 6005 7832
14962G832j245k309K997P927l894k790L473J840M357J766R920J3310J330r599
$$ 7832 6587 4278 7275 15202 11308 8518 11991 13831 18188 19954 29874 43184 44514 34915
14948C4915l033o85j1457m765N498J0905P132M673j0011j7830r119R61K766P335
$$ 34915 31882 31197 19740 14975 20473 31378 38510 43183 33172 15342 6223 7184 9950 17285
14934A7285j211L476l856p590m965J755K579l289j4410p395O720J6360l801j315
$$ 17285 16074 19550 15694 8104 3139 4894 7473 4184 -10226 -17621 -10901 5459 1658 343
14920C43j7m379K090P638q776M76P259o43k208n813j8n88j262L535O464K742R20
$$ 343 326 -4053 -1963 5675 -3101 -2625 4634 3991 1783 -4030 -4048 -4636 -5898 -2363 4101 6843 7763
14903G763K349p182k706j466k084l542J33N488j238P361j976j363m69O97J637
$$ 7763 10112 2930 224 -1242 -3326 -6868 -6735 -1247 -2485 4876 2900 1537 1068 1765 3402
14888C402K341L212m651n249l87n587n24P639o874j0248k289K843J13P819N53
$$ 3402 5743 8955 4304 -945 -1332 -6919 -7443 196 -6678 -16926 -19215 -16372 -16259 -8440 -7887
14873g887j0453L435j328q56O184P932J054j0466j1L875K182M491j915k979L780
$$ -7887 -18340 -14905 -16233 -17089 -10905 -2973 -1919 -12385 -12396 -8521 -6339 -1848 -3763 -6742 -2962
14858b962k06q026o204O535J3684N032J295k488n620N160L988q972p53l475L89
$$ -2962 -3168 -11194 -17398 -10863 2821 7853 9148 6660 1040 6200 10188 1216 463 -3012 -2623
14843b623o953o917O891M941n68P14P3L930R396O13l884j6692n419J094N478m5
$$ -2623 -9576 -16493 -9602 -4661 -5229 -4515 -4442 -512 8884 9497 5613 -11079 -16498 -15404 -9926 -9971
14827i971j572O300N260N255j337r35Q3o0j15n814p81Q195R430K239q463j3250
$$ -9971 -11543 -5243 17 5272 3935 3000 3083 3023 2908 -2906 -3687 4508 13938 16177 7714 -5536
14811e536j838J9758J492j4227q496n387K101j808R738J030J42J453o745L631
$$ -5536 -7374 12384 13876 -351 -8847 -14234 -12133 -13941 -4203 -3173 -3031 -1578 -8323 -4692
14797d692m386n816j4940l764K354K978J5607P925Q537O460J67j1729P0J930J636
$$ -4692 -9078 -14894 -29834 -33598 -31244 -28266 -12659 -4734 3803 10263 10430 -1299 -1229 701 2337
14782B337n709n943n678L963M727N686j050J589o33q10K832R403J108m690m556
$$ 2337 -3372 -9315 -14993 -11030 -6303 -617 -1667 -78 -711 -1521 1311 10714 11822 7132 2576
14767B576Q465O213j844j1414o086N062J2481J0133p569q641K702m106Q349K575
$$ 2576 11041 17254 15410 3996 -2090 2972 15453 25586 18017 9376 12078 7972 16321 18896
14753A8896j6428j5105j0933N764N793M971J4176j226P440M592j262q163k201
$$ 18896 2468 -12637 -23570 -17806 -12013 -7042 7134 5908 13348 17940 16678 8515 6314
14740F314j286q843l392J0293M178R155m932j6027O124O200k503m503n465Q398
$$ 6314 5028 -3815 -7207 3086 7264 16419 11487 -4540 1584 7784 5281 778 -4687 3711
14726C711Q251K940K736o694j9629j1675n526L010J483O928M428Q015O491P521
$$ 3711 11962 14902 17638 10944 -8685 -20360 -25886 -22876 -21393 -14465 -10037 -2022 4469 11990
14712A1990K227m287j0449J175J575L889r95l325N296Q066k935q51K238P095l695
$$ 11990 14217 9930 -519 656 2231 6120 5125 1800 7096 15162 12227 11376 13614 20709 17014
14697A7014l677o415m627r012r167n144M408R242K738p902r72Q08L420q113L815
$$ 17014 13337 6922 2295 -6717 -15884 -21028 -16620 -7378 -4640 -12542 -13514 -12706 -9286 -17399 -13584
14682a3584P7K745L509J954J505O301L86l403Q16Q35O79p197k57J0066K443M27
$$ -13584 -13507 -10762 -7253 -5299 -3794 2507 2893 -510 306 1141 1820 -5377 -5634 4432 6875 7302
14666G302K99K42j4459l760M480N45m417N364l61j011K279J2156M65j4670n301
$$ 7302 7601 7843 -6616 -10376 -5896 -5351 -9768 -4404 -4765 -5776 -3497 8659 9124 -5546 -10847
14651a0847j1612l056O110P766N281M672L473O708j1217j0696L886l165n992M870
$$ -10847 -22459 -25515 -19405 -11639 -6358 -1686 1787 8495 -2722 -13418 -9532 -12697 -18689 -13819
14637a3819R445l420Q300L12q24J632k662k976N3j727o567k456l850jm96L650
$$ -13819 -4374 -7794 506 818 -6 1626 -1036 -4012 -3959 -5686 -12253 -14709 -18559 -18560 -19056 -15406
14621a5406j603J006j556P171J091n97M799L753J2396j626r814j1378m647L100
$$ -15406 -17009 -16003 -17559 -10388 -9297 -9894 -5095 -1342 11054 9428 -386 -11764 -16411 -13311
14607a3311k161Q725L348L434N399l603j872R570J0769q15M656m177r830o623
$$ -13311 -15472 -6747 -3399 35 5434 1831 -41 9529 20298 19483 24139 19962 10132 3509
14593C509l890J07J338m822R63L95l337J144n62r9k365r773o905j330Q238P978
$$ 3509 -381 -274 1064 -3758 -2795 -2400 -5737 -4593 -5155 -5254 -7619 -17392 -24297 -25627 -17389 -9411
14577i411N267n1l741J1204N2J185Q427L869q296L249J0053j321p484l796N479
$$ -9411 -4144 -4195 -7936 3268 3320 4505 12932 16801 8505 11754 21807 20486 13002 9206 14685
14562A4685O111L990r08p040L241k437o407L087J99p619m51L32l189p227N159
$$ 14685 20796 24786 23878 16838 20079 17642 11235 14322 14521 6902 6451 6783 3594 -3633 1526
14547A526O711j076M149J402P10o130j513j950j321l022o287j392q01J939N455
$$ 1526 8237 7161 11310 12712 13422 7292 5779 3829 2508 -514 -6801 -8193 -8994 -7055 -1600
14532a600P789J396l228j234j0568k415J755j353L276o171r90M662J042j380k345
$$ -1600 6189 7585 4357 3123 -7445 -9860 -8105 -9458 -6182 -12353 -13343 -8681 -7639 -9019 -11364
14517a1364O632k613r206l764O267j68J921J877j578l733M311L506M270J2528
$$ -11364 -4732 -7345 -16551 -20315 -14048 -14216 -12295 -10418 -11996 -15729 -11418 -7912 -3642 8886
14503H886L057o614r310O669K988j0500J754j392j0993K57K0138J242L229m885
$$ 8886 11943 5329 -3981 2688 5676 -4824 -3070 -4462 -15455 -15198 4940 6182 9411 4526
14489D526M300N311N560J169r415p923J40p784j3379Q729Q147j278P50O091J622
$$ 4526 8826 14137 19697 20866 11451 3528 3668 -4116 -17495 -8766 -619 -1897 -1147 4944 6566
14474F566p992j800J1876M469n151J162M980j0631r447J512J4726J871k886n041
$$ 6566 -1426 -3226 8650 13119 7968 9130 14110 3479 -5968 -4456 10270 12141 9255 4214
14460D214k624m586L823O536N857p580k215R393K435o482n140j206m684k425j891
$$ 4214 1590 -2996 827 7363 13220 5640 3425 12818 15253 8771 3631 2425 -2259 -4684 -6575
14445f575R332j338k095K366J2296L832j0914n638O143j339n897l252N419J0180
$$ -6575 2757 1419 -676 1690 13986 17818 6904 1266 7409 6070 173 -3079 2340 12520
14431A2520Q27o518J265j212j3080J503K68Q1l393k062p366j812k6L407J411O396
$$ 12520 13347 6829 8094 6882 -6198 -4695 -4427 -4346 -7739 -9801 -17167 -18979 -19005 -15598 -14187 -7791
14415g791J2451J0887k706p736n144O384L914l16n31r224J326r10p091o813K407
$$ -7791 4660 15547 12841 5105 -39 6345 10259 9943 9412 188 1514 604 -6487 -13300 -10893
14400a0893N178M651j942P436m508n893p259r318r58R326R548k226m098j908o11
$$ -10893 -5715 -1064 -3006 4430 -78 -5971 -13230 -22548 -23506 -14180 -4632 -6858 -10956 -12864 -13475
14385a3475O132O800N554N207k290n119K941M832q050k42L291j267N808N110Q901
$$ -13475 -7343 -543 5011 10218 7928 2809 5750 10582 2532 2290 5581 4314 10122 15232 24133
14370B4133L283m509q108N380j236n373j0789j827M825j095J684r017l932P54
$$ 24133 27416 22907 14799 20179 18943 13570 2781 954 5779 4684 6368 -2649 -6581 -5827
14356e827p020m0K392N922R757n496o613q795l336r9K063j958l465k909L809r063
$$ -5827 -12847 -12887 -10495 -4573 5184 -312 -6925 -15720 -19056 -19155 -17092 -19050 -22515 -25424 -21615 -30678
14340c0678Q649O757Q69J0809N211Q42m8n773n76J90J454j4536J312R461K945
$$ -30678 -22029 -15272 -14403 -3594 1617 2459 2411 -3362 -3938 -3748 -2294 -16830 -15518 -6057 -3112
14325c112R884M09n857p581k849O61n117m989L395M305J2607N610m319p601r90
$$ -3112 6772 7181 1324 -6257 -9106 -8445 -13562 -18551 -15156 -10851 1756 7366 3047 -4554 -5544
14310e544N341J485J70M280n190p770m215M383M756N376K342q011L9k966o88k43
$$ -5544 -203 1282 1452 5732 542 -7228 -11443 -7060 -2304 3072 5414 -2597 -2558 -5524 -6212 -6455
14294f455O292k698M92L01m84m141j385J0108M326l813k425p057Q16Q457P117
$$ -6455 -163 -2861 -2369 -2068 -2552 -6693 -8078 2030 6356 2543 118 -6939 -6123 2334 9451
14279I451q58j591K89o456j718N035n672o166q535O369J000m81J1087k488m500
$$ 9451 8593 7002 7291 835 -883 4152 -1520 -7686 -16221 -9852 -8852 -9333 1754 -734 -5234
14264e234P39J1607J1985K7262K952m115J628n037l460J0024J1752J6492J0948
$$ -5234 -4495 7112 19097 46359 49311 45196 46824 41787 38327 48351 60103 76595 87543
14251H7543J896j4749j6678j0545j4097o264O391K344P420R001j1200k0907o70
$$ 87543 89439 74690 58012 47467 33370 27106 33497 35841 43261 52262 41062 20155 19485
14238A9485j1823n826O552N775j2477k43n073j102Q218R365J1126P885N325K0026
$$ 19485 7662 1836 8388 14163 1686 1443 -3630 -4732 3486 12851 23977 31862 37187 57213
14224E7213r206j3412j4956L978P089P587J3819J5772J0282J2484j0069k0671
$$ 57213 48007 34595 19639 23617 30706 38293 52112 67884 78166 90650 80581 59910
14212E9910k0787j0271R718q226Q31O580j043k0658j6191p025p099m623K187J2061
$$ 59910 39123 28852 38570 30344 31175 37755 36712 16054 -137 -7162 -14261 -18884 -16697 -4636
14198d636M920n845k998n309k193O900K887q21l144K152j851p470o65N009J681
$$ -4636 284 -5561 -8559 -13868 -16061 -9161 -6274 -7095 -10239 -8087 -9938 -17408 -18073 -13064 -11383
14183a1383M852O800j0205j1965M102J2479L436r54L450o80k240p161j0621P763
$$ -11383 -6531 269 -9936 -21901 -17799 -5320 -1884 -2838 612 -68 -2308 -9469 -20090 -12327
14169a2327K818k344N172P352o486q752k592k674p26L28J5622P893m057j988k996
$$ -12327 -9509 -11853 -6681 671 -5815 -14567 -17159 -19833 -20559 -20231 -4609 3284 -773 -2761 -5757
14154e757l354k567N837O421l274n325o397n93J989K646N12k911K959P002r602
$$ -5757 -9111 -11678 -5841 580 -2694 -8019 -14416 -15009 -13020 -10374 -9862 -12773 -9814 -2812 -12414
14139a2414m365J1609k313N13J4336M48n914j1751j775O102l564N744K349R303
$$ -12414 -16779 -5170 -7483 -6970 7366 7814 1900 -9851 -11626 -5524 -9088 -3344 -995 8308
14125H308O20n701k159k395j1552l390J138J2825N69k179K120N452R92p344p597
$$ 8308 8928 3227 1068 -1327 -12879 -16269 -15131 -2306 -1737 -3916 -1796 3656 4648 -2696 -10293
14110a0293M157R00p080N610K520k110l092K504j3318o531P158J1157M454J206
$$ -10293 -6136 -5236 -12316 -6706 -4186 -6296 -9388 -6884 -20202 -26733 -19575 -8418 -3964 -2758
14096b758P313L619l186q227K284j0235k693L251J2226J091m835k919J368q185
$$ -2758 4555 8174 4988 -3239 -955 -11190 -13883 -10632 1594 2685 -2150 -5069 -3701 -11886
14082a1886j707N551M700l651O698k2M340M656n9n204K273n59J181r381j020L236
$$ -11886 -13593 -8042 -3342 -6993 -295 -317 4023 8679 8620 3416 5689 5130 6311 -3070 -4090 -854
14066h54l592j1287l368K845K485P623L941m877N351k146q107m102J749O798p546
$$ -854 -4446 -15733 -19101 -16256 -13771 -6148 -2207 -7084 -1733 -3879 -11986 -16088 -14339 -7541 -15087
14051a5087R01N912N558M106k83j2027m603L071Q81l500J0292J3973J794k957
$$ -15087 -14186 -8274 -2716 1390 1107 -10920 -15523 -12452 -11571 -15071 -4779 9194 10988 8031
14037H031N552k932r383o723j056l379l874l394M593L837k841K533k03l480N347
$$ 8031 13583 10651 1268 -5455 -6511 -9890 -13764 -17158 -12565 -8728 -11569 -9036 -9239 -12719 -7372
14022g372L775K426j331k450m653L733P108K52l315o846k584O790J189L777j0875
$$ -7372 -3597 -1171 -2502 -4952 -9605 -5872 1236 1488 -1827 -8673 -11257 -4467 -3278 499 -10376
14007a0376j005M005j285J216k085J259O904o866j2048p160l324O467J040M895
$$ -10376 -11381 -7376 -8661 -7445 -9530 -8271 -1367 -8233 -20281 -27441 -30765 -24298 -23258 -18363
13993a8363M601k620P830k21l242m561P459N766j90j038N096Q886J254j1078L611
$$ -18363 -13762 -16382 -8552 -8773 -12015 -16576 -9117 -3351 -3541 -4579 517 9403 10657 -421 3190
13978C190n269j1964K44J950O308P053R83k697q092L516k394m27J114j212K379
$$ 3190 -2079 -14043 -13799 -11849 -5541 1512 2495 -202 -8294 -4778 -7172 -7599 -6485 -7697 -5318
13963e318O90L01k906j093l404J0163J1008O964m693l317R174O195J756p068k878
$$ -5318 -4628 -4327 -7233 -8326 -11730 -1567 9441 16405 11712 8395 17569 23764 25520 18452 15574
13948A5574J0178o222q448J757K375k508K192N174O197q546p043l096P478O2k935
$$ 15574 25752 19530 11082 12839 15214 12706 14898 20072 26269 17723 10680 7584 15062 15124 12189
13933A2189n156j434n831n369j0410J69J3289j117Q715o174p709k33o363M805
$$ 12189 7033 5599 -232 -5601 -16011 -15842 -2553 -3670 5045 -1129 -8838 -9071 -15434 -10629
13919a0629M221J332K74O768M342J86K509L164j417n687k459P124L268M344M49
$$ -10629 -6408 -5076 -4802 1966 6308 6494 9003 12167 10750 5063 2604 9728 12996 17340 17789
13904A7789o479o589j752j0135O342K507j572n108n197K655O476O765K138J1118
$$ 17789 11310 4721 2969 -7166 -824 1683 111 -4997 -10194 -7539 -1063 5702 7840 18958
13890A8958P033o177Q132K577k930j089k889L360N025P758J2276O246n620j1220
$$ 18958 25991 19814 27946 30523 27593 26504 23615 26975 32000 39758 52034 58280 52660 41440
13876D1440N75n317j1961p142O152J0894Q623q604j8292n536K246m173m812j1902
$$ 41440 42015 36698 24737 17595 23747 34641 43264 34660 16368 10832 13078 8905 4093 -7809
13862g809q453Q673M61l657R743Q168J0132Q680m142l643N779n719P105l018O481
$$ -7809 -16262 -7589 -7128 -10785 -1042 7126 17258 25938 21796 18153 23932 18213 25318 22300 28781
13847B8781Q311j184O490p655j9144o643L047L65J012nJ3063J2343j0060q006
$$ 28781 37092 35908 42398 34743 15599 8956 12003 12368 13380 13375 26438 38781 28721 20715
13833B0715m410j020n751j2827j1056n9N382L04Q376L371m158p345N254M238N95
$$ 20715 16305 15285 9534 -3293 -14349 -14408 -9026 -8722 -346 3025 -1133 -8478 -3224 1014 1609
13818A609o577j0884p71Q690N747L077Q74j0408R03M550k962Q55j0277m07k713
$$ 1609 -4968 -15852 -16623 -7933 -2186 891 1765 -8643 -7740 -3190 -6152 -5297 -15574 -15981 -18694
13803a8694M202L914L365k862l208j526O328J015l156M540Q562M386j682J18r814
$$ -18694 -14492 -10578 -7213 -10075 -13283 -14809 -8481 -7466 -10622 -6082 2480 6866 5184 5302 -4512
13788d512p459J1226J0414j195j397L235p733m983l334j0047p52O786O505o94
$$ -4512 -11971 -745 9669 8474 7077 10312 2579 -2404 -5738 -15785 -16537 -9751 -3246 -3940
13774c940L121r87m581R49j597o202N819K588M205Q564m534J0528L108r150q358
$$ -3940 -819 -1806 -6387 -5438 -7035 -13237 -7418 -4830 -625 7939 3405 13933 17041 7891 -467
13759d67P539p89q277n192J0804J888n000K758o594n533J530m385N696j058l590
$$ -467 7072 6283 -1994 -7186 3618 5506 506 3264 -3330 -8863 -7333 -11718 -6022 -7080 -10670
13744a0670N828O080K290L369J049l916n829j725L491K239j5j5993J339J3813
$$ -10670 -4842 1238 3528 6897 7946 4030 -1799 -3524 -33 2206 2191 -13802 -12463 1350
13730A350L638k138M540q598m367m738m945L295J1986N317o928j199R500m139
$$ 1350 4988 2850 7390 -1208 -5575 -10313 -15258 -11963 23 5340 -1588 -2787 6713 2574
13716B574j494K761O790r497l818Q784N511m240l991p295q979N794O498q042J044
$$ 2574 1080 3841 10631 1134 -2684 6100 11611 7371 3380 -3915 -12894 -7100 -602 -8644 -7600
13701g600r210K166O491m234P735K95k152O384N577J181p192Q42R702Q511N422
$$ -7600 -16810 -14644 -8153 -12387 -4652 -4357 -6509 -125 5452 6633 -559 283 9985 18496 23918
13686B3918l643k099o170j1782J462j192p258j060J4981M312j5257j8255j0573
$$ 23918 20275 18176 12006 224 1686 494 -6764 -7824 7157 11469 -3788 -22043 -32616
13673c2616P143P055J3800J2082K741m792m709m265k556J0843M678J941K898l734
$$ -32616 -25473 -18418 -4618 7464 10205 5413 704 -3561 -6117 4726 9404 11345 14243 10509
13659A0509r606P128K197p050n851j942n08R59m1K045L562j961j0099L9K918J078
$$ 10509 903 8031 10228 3178 -2673 -4615 -5123 -4164 -4205 -2160 1402 -559 -10658 -10619 -7701 -6623
13643f623K520P888n044j3363l896o139R302J1169l452l344m256O699P629p561
$$ -6623 -4103 3785 -1259 -14622 -18518 -24657 -15355 -4186 -7638 -10982 -15238 -8539 -910 -8471
13629h471L632O97j289n16p389Q491J1615j968l915R341J2319j703p324p210n016
$$ -8471 -4839 -4142 -5431 -5947 -13336 -4845 6770 4802 887 10228 22547 20844 13520 6310 1294
13614A294l854j1070k653M957N194J589O399k188L128M4M604o03Q100L246p272
$$ 1294 -2560 -13630 -16283 -11326 -6132 -4543 1856 -332 2796 2840 7444 6841 14941 18187 10915
13599A0915j662K632m824n610L706n258k598k577J981m39O62j549N493J125N255
$$ 10915 9253 11885 7061 1451 5157 -101 -2699 -5276 -3295 -3734 -3072 -4621 872 1997 7252
13584G252N681N191N819K246n029r703j0287L02m228k658L118k660K569N539L017
$$ 7252 12933 18124 23943 26189 21160 11457 1170 1472 -2756 -5414 -2296 -4956 -2387 3152 6169
13569F169J043m173o22k917p135J366P519k653L440J3023L874P187J6796J2512
$$ 6169 7212 3039 2417 -500 -7635 -6269 1250 -1403 2037 15060 18934 26121 42917 55429
13555E5429L565J853j7534j9142o304j81n786N25K879j0144r349Q955J447P380
$$ 55429 58994 60847 43313 24171 17867 17686 11900 12425 15304 5160 -4189 4766 6213 13593
13541A3593N646k248m266K160R617k893K213l022p013p68L09N6R2R615O687J9831
$$ 13593 19239 16991 12725 14885 24502 21609 23822 20800 13787 13019 13328 13384 13476 23091 29778 49609
13525D9609J7632J6741O782J0298O632l978r619L85n526j632L346Q01n493j0492
$$ 49609 67241 83982 90764 101062 107694 103716 94097 94482 88956 87324 90670 91471 85978 75486
13511G5486j3569j2036j3201q224n381q512L667R121J837k577l323n306j407L574
$$ 75486 61917 49881 36680 28456 23075 14563 18230 27351 29188 26611 23288 17982 16575 20149
13497B0149J1502K667l484j0243N120J3114N013l613L927J3647J3709J5342K3772
$$ 20149 31651 34318 30834 20591 25711 38825 43838 40225 44152 57799 71508 86850 110622
13484A10622L3849L8918K0678R303L20k0456l7955k9165j4143j2018j5360j2825
$$ 110622 144471 183389 204067 213370 213690 193234 155279 126114 111971 99953 84593 71768
13472G1768o937j5556j0870p585o471o263k033K450p084L169R084n815j6884N04
$$ 71768 64831 49275 38405 30820 24349 18086 16053 18503 11419 14588 23672 17857 973 1477
13458A477J8680M090r279P239R906k099q624q835M41R140j911Q266O481N158J0916
$$ 1477 20157 24247 14968 22207 32113 30014 21390 12555 12996 22136 20225 28491 34972 40130 51046
13443E1046J5762K8711J7298n490j5394j7090n695j4670j3541j832o735j6312
$$ 51046 66808 95519 112817 107327 91933 74843 69148 54478 40937 39105 32370 16058
13431A6058K411J3534q86p967r879N092K630r430J530J265k76l4p808j2678L889
$$ 16058 18469 32003 31117 23150 13271 18363 20993 11563 13093 14358 14082 14048 6240 -6438 -2549
13416b549M978j077M516R722K654r665j222r57j4268L789Q353P88L579M048o44
$$ -2549 2429 1352 5868 15590 18244 8579 7357 6400 -7868 -4079 4274 5062 8641 12689 12045
13401A2045M87o161m675o86k774J09j897K92M383l956p07N742M607R96k028L031
$$ 12045 12532 6371 1696 1010 -1764 -1655 -3552 -3260 1123 -2833 -3540 2202 6809 7805 5777 8808
13385H808L139L801J293m142n611l845K790N742l145n852j559J488P886l407q347
$$ 8808 11947 15748 17041 12899 7288 3443 6233 11975 8830 2978 1419 2907 10793 7386 -961
13370i61o680R045l159p023l775k0J0201J1875M94J771p224j788k270j544L710
$$ -961 -7641 1404 -1755 -8778 -12553 -12573 -2372 9503 9997 11768 4544 2756 486 -1058 2652
13355B652N310n931o717L79N110M895M054L299l750k942J032Q255R008J990R79
$$ 2652 7962 2031 -4686 -4307 803 5698 9752 13051 9301 6359 7391 15646 24654 26644 27623
13340B7623n711j498j054n038j1347j626k896K698P693j651O117m187n084L470
$$ 27623 21912 20414 19360 14322 2975 1349 -1547 1151 8844 7193 13310 9123 4039 7509
13326G509M769J5309O259j1637K111k408R63j390k128j235J096P037m553j2508
$$ 7509 12278 27587 33846 22209 24320 21912 22875 21485 19357 18122 19218 26255 21702 9194
13312I194l891K887n74J183J731Q216Q280P887J0073R79q624r319l441M099l870
$$ 9194 5303 8190 7616 8799 10530 18746 27026 34913 44986 45965 37341 28022 24581 28680 24810
13297B4810l015O3K199L279K373K285m838J872n871p314J5288J6175M008j524
$$ 24810 21795 21858 24057 27336 29709 31994 27156 29028 23157 15843 31131 47306 51314 49790
13283D9790M432Q75j2331j2394j5031m235J579L012L06P242N876J043J966J3868
$$ 49790 54222 55097 42766 30372 15341 11106 12685 15697 16003 23245 29121 30164 32130 45998
13269D5998K413p64j011k04M910J3451J6372J2257R506J7610K5280K9444O4592
$$ 45998 48411 47647 46636 46432 51342 64793 81165 93422 102928 120538 145818 175262 239854
13256B39854J01448J70684K62347K15533k9870k15928k24444j68046j04225n8648
$$ 239854 341302 511986 774333 989866 959996 744068 519624 351578 247353 188705
13246A88705l7662j7505j9445j6675l467r295q906o011j559o942j1859j0012m183
$$ 188705 151043 133538 114093 97418 93951 84656 75750 69739 68180 61238 49379 39367 35184
13233C5184N094Oj400o568n130J0623N986K44j69p30J674m84J497L860P92K268
$$ 35184 40278 40284 38884 32316 27186 37809 43795 44039 43870 43140 44814 44330 45827 49687 50479 52747
13217E2747M6r54j1805j546N825l035K11l654q961p553L556N357J2832P439P447
$$ 52747 52793 51839 40034 38488 44313 41278 41489 37835 28874 21321 24877 30234 43066 50505 57952
13202E7952J0580K89n001p283J118p418j4283n76P438N081K520L408K053K352
$$ 57952 68532 68821 63820 56537 57655 50237 35954 35378 42816 47897 50417 53825 55878 58230
13188E8230J159k2052j6188j0135P648L736N590P783J751M38p218k018m442o804
$$ 58230 59389 37337 21149 11014 18662 22398 27988 35771 37522 37960 30742 28724 24282 17478
13174A7478R294M847J491Q8J2051J2214L990r682m935j93P264Q093K38J4347P912
$$ 17478 26772 31619 33110 33198 45249 57463 61453 51771 46836 46643 53907 62000 62238 76585 84497
13159H4497Q186N761M138q486j6634r888m859J2910m615k779L487n449m475M746
$$ 84497 92683 98444 102582 94096 77462 67574 62715 75625 71010 68231 71718 66269 61794 66540
13145F6540m191L872m97j902l792n124K759J3354J1821L925j8191q20K182R525
$$ 66540 62349 66221 65724 63822 60030 54906 57665 71019 82840 86765 68574 67754 69936 79461
13131G9461R642L451n039m776K332K382K463N88L922N209P662J5424P920J1176
$$ 79461 89103 92554 87515 82739 85071 87453 89916 90504 94426 99635 107297 122721 130641 141817
13117A41817Q994K193R701J1897J4247N026K534L802K935k212J356Q635J2415
$$ 141817 150811 153004 162705 174602 188849 193875 196409 200211 203146 200934 202290 210925 223340
13104B23340P059M425M374J2710N871L3640K8671K6725K7966K3311K7362L7510
$$ 223340 230399 234824 239198 251908 257779 291419 320090 346815 374781 398092 425454 462964
13092D62964L6827M4501P4214Q0668R2017J02352J17607J40558J73471K18504
$$ 462964 499791 544292 618506 699174 791191 893543 1011150 1151708 1325179 1543683
13082A543683K75640L64405M93064O75217R46032J380411J995530K755434L361264
$$ 1543683 1819323 2183728 2676792 3352009 4298041 5678452 7673982 10429416 13790680
13073A3790680L375689K361461M58307j567993k894231l217286k842544k205633
$$ 13790680 17166369 19527830 19986137 18418144 15523913 12306627 9464083 7258450
13065G258450j599198j119666p79404n71809m26059l09398k29985j69219j34390
$$ 7258450 5659252 4539586 3760182 3188373 2762314 2452916 2222931 2053712 1919322
13056A919322j13211q5431o0310k9328K300K4581M0787R6141J32591J71718K28238
$$ 1919322 1806111 1720680 1660370 1631042 1633342 1657923 1698710 1794851 1927442 2099160 2327398
13045B327398K69196L02989L27643L98447N30137P26437J016264J430992K060046
$$ 2327398 2596594 2899583 3227226 3625673 4155810 4882247 5898511 7329503 9389549
13036I389549L043979M472858O221498P562860P311849M582704p2930m605931
$$ 9389549 12433528 16906386 23127884 30690744 38002593 42585297 42512367 37906436
13028C7906436p146628p339329o060833m415933l056307k095557j467338j052500
$$ 37906436 30759808 23420479 17359646 12943713 9887406 7791849 6324511 5272011
13020E272011p81617n84961m53438l66843l18809k70044k34178j79996j32231
$$ 5272011 4490394 3905433 3451995 3085152 2766343 2496299 2262121 2082125 1949894
13011A949894j11141p8761m9225j9672J8319M3612O7531J15330J44258J69792
$$ 1949894 1838753 1759992 1710767 1691095 1709414 1753026 1820557 1935887 2080145 2249937
13001B249937K27397L10644M23539N89349Q18842J180925J721671K431414L183393
$$ 2249937 2477334 2787978 3211517 3800866 4619708 5800633 7522304 9953718 13137111
12992A3137111L565678L055533J463905p47930k633746l501325l379390k712872
$$ 13137111 16702789 19758322 21222227 20474297 17840551 14339226 10959836 8246964
12984H246964k000204j408048r78697o99002n30449m12251l14865k52222k08773
$$ 8246964 6246760 4838712 3860015 3161013 2630564 2218313 1903448 1651226 1442453
12975A442453j87704j62376j29490r9855r0706p4251o6708o0570m4542k8632j7419
$$ 1442453 1254749 1092373 962883 863028 772322 698071 631363 570793 526251 497619 480200
12964D80200j3290k8549k5855j5319j9900j8353j6567l0219k3608k1208j2981
$$ 480200 466910 438361 412506 397187 377287 358934 342367 312148 288540 267332 254351
12953B54351j6760m118r515j4050L150J1144j0722k0848j0409p70P969n198m041
$$ 254351 237591 233473 223958 209908 213058 224202 213480 192632 182223 181453 189422 184224 180183
12940A80183J640k607q238M62l384r247j2306J208J1681j311r111N138J0226p045
$$ 180183 181823 179216 170978 171440 168056 158809 146503 147711 159392 158081 148970 154108 164334 157289
12926A57289K421O450J4447J5727K7684K4589L5453J5752J0456j9610m4048n0128
$$ 157289 159710 166160 180607 196334 224018 248607 284060 299812 310268 290658 246610 196482
12914A96482l5073j3269j5103j5732R083N736O267l997p437j0857j6894q230q852
$$ 196482 161409 148140 133037 117305 126388 132124 138391 134394 126957 116100 99206 90976 82124
12901H2124k48J2760J90M754J4739O81p608L290L062J800j624o467k756Q820K786
$$ 82124 81876 94636 94826 99580 114319 115000 107392 110682 113744 115544 113920 107453 104697 113517 116303
12886A16303j3903m911J110P911J4113Q310J677J972N457J5071K0101K100j2987
$$ 116303 102400 97489 98599 106510 120623 128933 130610 132582 138039 153110 173211 175311 162324
12873A62324m867L670O034J792N189k023j2216j0752q838m107l131J595P590J2167
$$ 162324 157457 161127 167161 168953 174142 172119 159903 149151 140313 136206 133075 134670 142260 154427
12859A54427J4589K1944J7321J2987L683j2400n554M533K0656K1760J2875N775
$$ 154427 169016 190960 208281 221268 224951 212551 206997 211530 232186 253946 266821 272596
12847B72596P479L340o111l424j6691k3516j203J5820K5866K7172K8858L5406
$$ 272596 280075 283415 277304 273880 257189 233673 232470 248290 274156 301328 330186 365592
12835C65592K9228L0959K9103L3995K2699K7362J1286J0092K6542L6837K9028
$$ 365592 394820 425779 454882 488877 511576 538938 550224 560316 586858 623695 652723
12824F52723K5992L1518L4167M5251L6141O2893R1762J04407J04086J14148J38394
$$ 652723 678715 710233 744400 789651 825792 888685 980447 1084854 1188940 1303088 1441482
12813A441482J32326J28350J70672K33464K90259L25952L74436N05769P43984
$$ 1441482 1573808 1702158 1872830 2106294 2396553 2722505 3096941 3602710 4346694
12804D346694J013037J076900R55331J078140J575315K311344L446504N315330
$$ 4346694 5359731 6436631 7391962 8470102 10045417 12356761 15803265 21118595
12796B1118595Q535388J4631967K6042937M4687692N6261651K2763491l0029216
$$ 21118595 29653983 44285950 70328887 115016579 171278230 194041721 164012505
12789A64012505n1001466m0867318k4954010j4682963q943752n716295l835962
$$ 164012505 113011039 72143721 47189711 32506748 23562996 17846701 14010739
12782A4010739k620979j782728j188878q71473q64831r25292q63133p11365n67701
$$ 14010739 11389760 9607032 8418154 7546681 6681850 5756558 4893425 4182060 3614359
12773C614359m16814l01945k59531k48882k35900j84774j36246j16901r2299p8052
$$ 3614359 3197545 2895600 2636069 2387187 2151287 1966513 1830267 1713366 1621067 1543015
12763A543015p5580m9943m993N1781J36429J11320p2183k22543k37694j81528
$$ 1543015 1467435 1417492 1412499 1464280 1600709 1712029 1639846 1417303 1179609 998081
12753I98081j31616j04584o5848m1646k8769k5018k5455j5301k4337j4366j859
$$ 998081 866465 761881 696033 654387 625618 600600 575145 559844 535507 521141 519282
12742E19282p437j4073o099k7414m0264m1289l0553k5032j8450k1577M150L574
$$ 519282 511845 497772 491673 464259 423995 382706 352153 327121 308671 287094 291244 294818
12730B94818j2406q285k4359k2791r348m318K269q168k499N865N5J557q628Q9
$$ 294818 282412 274127 249768 226977 217629 213311 215580 207412 204913 210778 210833 212390 203762 203851
12716B03851p35j1302j2684j0146j6357m043J914j2389L392J691J4115J5491N549
$$ 203851 203116 191814 179130 168984 152627 148584 150498 138109 141501 143192 157307 172798 178347
12703A78347j2624j2193j0238j840r80M751p1K541o749n139N517q719r404n831
$$ 178347 165723 153530 143292 141452 140472 145223 145152 147693 140944 135805 141322 132603 123199 117368
12689A17368l047m058k949O513K624Q491p526o799p74Q74o204p986K908m491k074
$$ 117368 114321 110263 107314 113827 116451 124942 117416 110617 109843 110717 104513 96527 99435 94944 92870
12674I2870m798J0423K3653Q631n376k956q911m804j6154m0691m1996O75j517
$$ 92870 88072 98495 122148 130779 125403 122447 113536 108732 92578 51887 9891 10566 9049
12661I049J0152Q514J033M342K802q02Q53P569P396j855J1914L247j088r731r56
$$ 9049 19201 27715 28748 33090 35892 35090 35943 43512 50908 49053 60967 64214 63126 53395 52439
12646E2439o782J273N367R57J3917J604O0l588n086m671R44m1L617M710P435J5466
$$ 52439 45657 46930 52297 53254 67171 68775 68835 65247 60161 55490 56434 56393 60010 64720 72155 87621
12630H7621p158r281j0186j305l151M87j007r58k401J0862n08o06J5864K3323
$$ 87621 80463 71182 60996 59691 56540 57027 56020 55062 52661 63523 63015 62409 78273 101596
12616A01596J7477J5762K7321J7385j1175k3874k080j4284j7916j5739j8492j0751
$$ 101596 119073 134835 162156 179541 168366 144492 142412 128128 110212 94473 75981 65230
12604F5230P559j2221j1501m608m722J34m355j434l32K4885J5098n068j2052j1982
$$ 65230 72789 60568 49067 44459 39737 39871 35516 34082 33750 58635 73733 68665 56613 44631
12590D4631K04J2216J2127M816q186p339o136K009J5231K273M809L369J7042J9678
$$ 44631 44835 57051 69178 73994 65808 58469 52333 54342 69573 71846 76655 80024 97066 116744
12576A16744K5555L8935L1530K5483Q442j3234k5876k6535l5216l1255j5828r050
$$ 116744 142299 181234 212764 238247 246689 233455 207579 181044 145828 114573 98745 89695
12564H9695j2848j6854O700m224j0401k2549q634R20O410L274q002P70P033Q367
$$ 89695 76847 59993 66693 62469 52068 29519 20885 21805 28215 31489 23487 24257 31290 39657
12550C9657N427J1526L361p849q729o826O062R224N849O989L394o605K323P087
$$ 39657 45084 56610 59971 52122 43393 36567 42629 51853 57702 64691 68085 61480 63803 70890
12536G0890R249P485J2928J5176J3532n208q995o494l0389j2520n022j3061l664
$$ 70890 80139 87624 100552 115728 129260 124052 115057 108563 78174 65654 60632 47571 43907
12523D3907n88p577m473j498l179n583K32P910O564o871p264N681k689l276j555
$$ 43907 43319 35742 31269 29771 26592 21009 21241 29151 35715 28844 21580 27261 24572 21296 19741
12508A9741J0376K531n835j2878N314N81J745p268m748J2961m13m033M910j665
$$ 19741 30117 32648 26813 13935 19249 19830 21575 14307 9559 22520 22107 18074 22984 21319
12494B1319p132k759K822K537n011n848r667P71O972k395k359R035n958q365Q80
$$ 21319 14187 11428 14250 16787 11776 5928 -3739 -2968 4004 1609 -750 8285 2327 -6038 -5158
12479e158j304n573P795M338J081R05N358m493j183N438n63p909k189P318K625
$$ -5158 -6462 -12035 -4240 98 1179 2084 7442 2949 1766 7204 6641 -1268 -3457 3861 6486
12464F486M959K082k918o401J903j761q50k659r000o302L600L012M535R318o87
$$ 6486 11445 13527 10609 4208 6111 4350 3500 841 -8159 -14461 -10861 -7849 -3314 6004 5317
12449E317Q741P650q22p171r832m742K842j030J2938J7493o60j0044p016l730
$$ 5317 14058 21708 20886 13715 3883 -859 1983 953 13891 31384 30724 20680 13664 9934
12435I934M205O708R11J371J414n545K678m492m047J880L027o127p155p03m563
$$ 9934 14139 20847 21758 23129 24543 18998 21676 17184 13137 15017 18044 11917 4762 4059 -504
12420e04L221K319J267J676k245Q307K986L471L790J225l372j2813k849q79p051
$$ -504 2717 5036 6303 7979 5734 14041 17027 20498 24288 25513 22141 9328 6479 5600 -1451
12405a451L368o028k614OQ053K912J388n506k516O463J203N830J995l36N394P561
$$ -1451 1917 -4111 -6725 -6719 1334 4246 5634 128 -2388 4075 5278 11108 13103 12767 18161 25722
12389B5722J443m695k248P2k742j1055r557J422J1470K382o431o81j55Q86R081
$$ 25722 27165 22470 20222 20294 17552 6497 -3060 -1638 9832 12214 5783 5102 4947 5833 14914
12374A4914J2555q27j3450q767N451J955j60m735j0538O883M395k229p633K470
$$ 14914 27469 26642 13192 4425 9876 11831 11671 6936 -3602 3281 7676 5447 -2186 284
12360B84R381j58K602O060o152o119K702k840M356q22N127J0969q98j0411k208
$$ 284 9665 9507 12109 18169 12017 5898 8600 5760 10116 9294 14421 25390 24492 14081 11873
12345A1873r820K260L836L480O923J1596N931j553Q713N247R08r13O788N759J6720
$$ 11873 2053 4313 8149 11629 18552 30148 36079 34526 43239 48486 49394 48481 55269 61028 77748
12330G7748R581J5656K5728K3253O1300J13436J85666K67710K04849m9725k27522
$$ 77748 87329 102985 128713 151966 213266 326702 512368 780078 984927 935202 707680
12319G07680k40606j62743j01755n8731l6850k0566j7250j3651q520j5936K866
$$ 707680 467074 304331 202576 143845 106995 86429 69179 55528 47008 31072 33938
12308C3938P210R88o687J169j3370j3443o64M562O517R847p945J37o819R058J309
$$ 33938 41148 42136 35449 36618 23248 9805 9141 13703 20220 30067 22122 22259 15440 24498 25807
12293B5807l422m209l31j0898L152O849m266l72k106P746q227r627J2752l304
$$ 25807 22385 18176 17845 6947 10099 16948 12682 12310 10204 17950 9723 96 12848 9544
12279I544j6844o91M031O817n69j374n367K839n93m040o410j27M01n75M929n772
$$ 9544 -7300 -7991 -3960 2857 2288 914 -4453 -1614 -2207 -6247 -12657 -12784 -12383 -12958 -8029 -13801
12263a3801k838o19K313L218N950K256J1718R733n999j520N41R414l14r01o303
$$ -13801 -16639 -17258 -14945 -11727 -5777 -3521 8197 17930 11931 10411 10952 20366 20052 19151 12848
12248A2848j37p543O313M546j236m62n818j598l512K417J507P581M006N539l908
$$ 12848 12711 5168 11481 16027 14791 14329 8511 6913 3401 5818 7325 14906 18912 24451 20543
12233B0543m763K15m542k190n702j379M120P199l465k223M09n815L71J79J189
$$ 20543 15780 15995 11453 9263 3561 2182 6302 13501 10036 7813 8222 2407 2778 2957 4146
12218D146N202n139o423n834m407N108R245j0525J41P481l631m839O87J369R066
$$ 4146 9348 4209 -2214 -8048 -12455 -7347 1898 -8627 -8486 -1005 -4636 -9475 -8788 -7419 1647
12203A647k588m617P767O661n352k090R651J5571P050n531pm8r961o254O86Q58
$$ 1647 -941 -5558 2209 8870 3518 1428 11079 26650 33700 28169 28162 28114 18153 11899 12585 13443
12187A3443l824J262m836o271L15O154J5350k676l267m880j3808n537M618p004
$$ 13443 9619 10881 6045 -226 89 6243 21593 18917 15650 10770 -3038 -8575 -3957 -10961
12173a0961J599L492p802j9J548M081L904J2214O620p321m991P434j169j1854
$$ -10961 -9362 -5870 -13672 -13691 -12143 -8062 -4158 8056 14676 7355 2364 9798 8629 -3225
12159c225o442J0226l664l171J742j011P001R373J0639k405r924N111p01q821
$$ -3225 -9667 559 -3105 -6276 -4534 -5545 1456 10829 21468 19063 9139 14250 13549 4728
12145D728M579P27j1538N045P059R569J898o864l525P288N538p917q428k789K321
$$ 4728 9307 10034 -1504 3541 10600 20169 22067 15203 11678 18966 24504 16587 8159 5370 7691
12130G691J676l945l78k850j176J0693Q421p285p745O250L534n491n6K513o679
$$ 7691 9367 5422 5044 2194 1018 11711 20132 12847 5102 11352 14886 9395 9339 11852 5173
12115E173L89L334k449k20j944L031j378k321P107J0018J187o181m495m623m661
$$ 5173 5562 8896 6447 6227 4283 7314 5936 3615 10722 20740 21927 15746 11251 6628 1967
12100A967k355m334P407J2320m575m680M739L285M814K248j840j726j295L603
$$ 1967 -388 -4722 2685 15005 10430 5750 10489 13774 18588 20836 18996 17270 15975 19578
12086A9578K257l181o895o995j395P064l343n361o018L618K026o091n513k58J0662
$$ 19578 21835 18654 11759 4764 3369 10433 7090 1729 -4289 -671 1355 -4736 -10249 -10507 155
12071A55N17j805K563O802r187O67O350J762Q541M528n655J171R334n260p777
$$ 155 672 -1133 1430 8232 -955 -288 6062 7824 16365 20893 15238 16409 25743 20483 12706
12056A2706o072Q529J505l06N126l037q007q662j074K608k17K090l942J0812N739
$$ 12706 6634 15163 16668 16362 21488 18451 10444 1782 708 3316 3099 5189 1247 12059 17798
12041A7798o720J918j899j0083m834k985j903J037j148l879l539P73K644J0696
$$ 17798 11078 12996 11097 1014 -3820 -6805 -8708 -7671 -8819 -12698 -16237 -15464 -12820 -2124
12027b124q32k165o95J1661M971K90k99p11J368o47J613j251r267r019r71j215
$$ -2124 -2956 -5121 -5816 5845 10816 11106 10807 10096 11464 10817 12430 11179 1912 -7107 -8078 -9293
12011i293L689m135r7N875M559K375R23J844L531n657l911O431L408L481L029
$$ -9293 -5604 -9739 -9836 -3961 598 2973 3896 5740 9271 3614 -297 6134 9542 13023 16052
11996A6052l704q180m969K191J1552r787J785k510j1985J7116J4733p686r642
$$ 16052 12348 4168 -801 1390 12942 3155 4940 2430 -9555 7561 22294 14608 4966
11983D966p228l227N029K076n314m803n81L334R607l553N6m781Q138K793K0Q53
$$ 4966 -2262 -5489 -460 1616 -3698 -8501 -9082 -5748 3859 306 362 -4419 3719 6512 6532 7385
11967G385j7p17L704j091k295l68K201J595j102J713j453j6325j2651j91J1178
$$ 7385 7368 6651 10355 9264 6969 6601 8802 10397 9295 11008 9555 -6770 -19421 -19612 -8434
11952h434O341N446R528o911q939n300m784P905J461J463M854O059n441L164P944
$$ -8434 -2093 3353 12881 5970 -2969 -8269 -13053 -5148 -3687 -2224 2630 8689 3248 6412 14356
11937A4356n47m829l327N444O75j115o321j1837j5687k369J934J0735N015N037
$$ 14356 13809 8980 5653 11097 11772 10657 4336 -7501 -23188 -25557 -23623 -12888 -7873 -2836
11923b836J1075K37m824j1642M16K558p448k769L260N044Q005j043O362J001J137
$$ -2836 8239 8476 3652 -7990 -7574 -5016 -12464 -15233 -11973 -6929 1076 33 6395 7396 8533
11908H533L745l823O08m454M959R168P129M622M026m756q643j3491l966m983J096
$$ 8533 12278 8455 9063 4609 9568 18736 25865 30487 34513 29757 21114 7623 3657 -1326 -230
11893b30o85r90k459o00K464K054j849L859K519L132k847r92K358o36O781n69
$$ -230 -915 -1905 -4364 -4964 -2500 -446 -2295 1564 4083 7215 4368 3376 5734 5098 11879 11310
11877A1310m059J427p285R21n000L446Q138J2429j940j770l307j710R041K98m855
$$ 11310 7251 8678 1393 2314 -2686 760 8898 21327 19387 17617 14310 12600 21641 21939 17084
11862A7084l41o052j603p556n528l426R989L765L94L275k160L281m223n624J5393
$$ 17084 16743 10691 9088 1532 -3996 -7422 2567 6332 6726 10001 7841 11122 6899 1275 16668
11847A6668R454j1123n393j923j0270p706M904P066P815M393Q057N570n904j1550
$$ 16668 26122 14999 9606 7683 -2587 -10293 -5389 1677 9492 13885 21942 27512 21608 10058
11833A0058o756J563K019l544n752n235O062Q267o658m93k300N189P189r720l951
$$ 10058 3302 4865 6884 3340 -2412 -7647 -1585 6682 24 -469 -2769 2420 9609 -111 -4062
11818d062O686K300n21l06m995q61J0773P563p819l746P37m122j1317j626J427
$$ -4062 2624 4924 4403 4097 -898 -1759 9014 16577 8758 5012 5749 1627 -9690 -11316 -9889
11803i889N404J0573l83N889k036q713r290K772K158L869l744m351J379r11o609
$$ -9889 -4485 6088 5705 11594 9558 845 -8445 -5673 -3515 354 -3390 -7741 -6362 -7273 -13882
11788a3882L754L358q153k212L433O909R294O206L560k001K977k531n382M608
$$ -13882 -10128 -6770 -14923 -17135 -13702 -6793 2501 8707 12267 10266 13243 10712 5330 9938
11774I938K580K696j1768j1419L014J2657k509K6l331o017k813k345k497L329
$$ 9938 12518 15214 3446 -7973 -4959 7698 5189 5215 1884 -4133 -6946 -9291 -11788 -8459
11760h459Q859J2491L969j10r897KO710N569n196n460N416p105k218N959j1430
$$ -8459 400 12891 16860 16750 6853 6855 13565 19134 13938 8478 13894 6789 4571 10530 -900
11745i00j6684p15Q201R977j428l071k308M708o125L495N83n373J175P283N773
$$ -900 -17584 -18299 -10098 -121 -1549 -4620 -6928 -2220 -8345 -4850 -4267 -9640 -8465 -1182 4591
11730D591k562k875J0828m415m705p740q184J891Q446j2103n325O639P883k657
$$ 4591 2029 -846 9982 5567 862 -6878 -15062 -13171 -4725 -16828 -22153 -15514 -7631 -10288
11716a0288J1869J1599K852K376n985o376j316L810K111K216j2218k686k62o212
$$ -10288 1581 13180 16032 18408 12423 6047 4731 8541 10652 12868 650 -2036 -2298 -8510
11702h510p95N076O412m468L389P187l939o48Q303j705J17Q85q39p787q119J4153
$$ -8510 -9305 -4229 2183 -2285 1104 8291 4352 3704 12007 10302 10419 11304 10465 2678 -5441 8712
11686H712J0574n491m432l215m31k450R258n969p503j0806n22J1449L914K94m248
$$ 8712 19286 13795 9363 6148 5717 3267 12525 6556 -947 -11753 -12275 -826 3088 3382 -866
11671h66j180p293L799Q017j0311L495J3379L027M30o241o207P31O216m10K078
$$ -866 -2046 -9339 -5540 2477 -7834 -4339 9040 12067 12497 6256 49 780 6996 6586 8664
11656H664j6015j27L027N01J624L784k097m39M241l044p811N176K325J4953J383
$$ 8664 -7351 -7478 -4451 -3950 -2326 1458 -639 -1078 3163 119 -7692 -2516 -191 14762 16145
11641A6145m485j7141q143J684O831N145p663j3863q88J0085J1478O041m130o146
$$ 16145 11660 -5481 -13624 -11940 -5109 36 -7627 -21490 -22378 -12293 -815 5226 1096 -5050
11627e050K239K192J707j813L25q647n170J05J077j188k825N041J2267R321M411
$$ -5050 -2811 -619 1088 -725 -400 -9047 -14217 -14112 -13035 -14223 -17048 -12007 260 9581 13992
11612A3992k285q841p084O099j455p128m892K247K429J1034O613q527k172J2778
$$ 13992 11707 2866 -4218 1881 426 -6702 -11594 -9347 -6918 4116 10729 2202 30 12808
11598A2808P797Q424L0233J7047m778k0946j7846j0319j2359j2018L564q03M605
$$ 12808 20605 29029 59262 76309 71531 50585 32739 22420 10061 -1957 1607 804 5409
11585E409K297L91j1641o884L083p009P661M469k710J268l943p609K599j542O992
$$ 5409 7706 8097 -3544 -10428 -7345 -14354 -6693 -2224 -4934 -3666 -7609 -15218 -12619 -14161 -7169
11570g169P815n080K459N683o180K543j695j0548k470Q786l077M787M38j351n550
$$ -7169 646 -4434 -1975 3708 -2472 71 -1624 -12172 -14642 -5856 -8933 -4146 -3708 -5059 -10609
11555a0609M57j161P053Q95O20L565o677l040k596L624J5687M392o351l745j010
$$ -10609 -10152 -11313 -4260 -3365 -2745 820 -5857 -8897 -11493 -7869 7818 12210 5859 2114 1104
11540A104p58J209R25O514j395m87j1416L71p98J68J229K255N126n58n630Q769
$$ 1104 346 1555 2480 8994 7599 7112 -4304 -3933 -4731 -4563 -3334 -1079 4047 3489 -2141 6628
11524F628P33j212o784k825l242k896j64L498j506l8O07p33m30k652J597K91K150
$$ 6628 7361 6149 -635 -3460 -6702 -9598 -9762 -6264 -7770 -7808 -7201 -7934 -8364 -11016 -9419 -9128 -6978
11507f978k662R19J0787K79l392l573o848m999j138O411k011q04J856J3565O872
$$ -6978 -9640 -8721 2066 2345 -1047 -4620 -11468 -16467 -17605 -11194 -13205 -14009 -12153 1412 8284
11492H284l306p326j894j3292m940R236N634J217M905M369M529M46N108r58j2821
$$ 8284 4978 -2348 -4242 -17534 -22474 -13238 -7604 -6387 -1482 2887 7416 7862 12970 12012 -809
11477h09q544O416k321l313j549K726o31Q478L601m136K596K692k687l373M063
$$ -809 -9353 -2937 -5258 -8571 -10120 -7394 -8025 453 4054 -82 2514 5206 2519 -854 3209
11462C209m908n257j304R621N206r182n554n145R220L137j953N390J428j008j414
$$ 3209 -1699 -6956 -8260 1361 6567 -2615 -8169 -13314 -4094 -957 -2910 2480 3908 2900 1486
11447A486j250k084Q005M548k020P99j831p419m277K87m55M579o752l18J48p661
$$ 1486 236 -1848 6157 10705 8685 9484 7653 234 -4043 -3756 -4211 368 -6384 -6702 -6554 -14215
11431a4215O13Q078o33L752m558k098P135M37j498M659r020q60L399M641K878
$$ -14215 -13602 -5524 -6157 -2405 -6963 -9061 -1926 -1489 -2987 1672 -7348 -8208 -4809 -168 2710
11416B710m2J897N552k063J412r71J334m586j061L205j133M838j307k610M421
$$ 2710 2668 4565 10117 8054 9466 8495 9829 5243 4182 7387 6254 11092 9785 7175 11596
11401A1596J492K356j575N434J637k423j0206j1299k159J2913j674L802N558o754
$$ 11596 13088 15444 13869 19303 20940 18517 8311 -2988 -5147 7766 6092 9894 15452 8698
11387H698l912P974q340k039P002R46n312j309M65O080K133M125n06o083J756
$$ 8698 4786 12760 4420 2381 9383 10329 5017 3708 4173 10253 12386 16511 16005 9922 11678
11372A1678O700m738p423k582O154J0602J474k621l386l879L931j991p084k865
$$ 11678 18378 13640 6217 3635 9789 20391 21865 19244 15858 11979 15910 13919 6835 3970
11358C970k101j1322j733L975k644k110n122o25L044J2675M281j0650J919P040
$$ 3970 1869 -9453 -11186 -7211 -9855 -11965 -17087 -17712 -14668 -1993 2288 -8362 -6443 597
11344E97O829N367r960n776n578m1R749K031k16L722o574L268n244K250K646L464
$$ 597 7426 12793 2833 -2943 -8521 -8562 1187 3218 3002 6724 150 3418 -1826 424 3070 6534
11328F534o89O927j0491j1806Q005o821o695k618l077N627J0931M397K154o345
$$ 6534 5845 12772 2281 -9525 -1520 -8341 -15036 -17654 -20731 -15104 -4173 224 2378 -3967
11314c967l488O233Q16j2929M659J0411j060o039J4339K913q68l98k034r33N716
$$ -3967 -7455 -1222 -406 -13335 -8676 1735 675 -5364 8975 11888 11020 10622 8588 7655 13371
11299A3371J0195L785m047R495J3425L14L495Q202J6773K3781L9821M2229R1058
$$ 13371 23566 27351 23304 32799 46224 46538 50033 58235 75008 98789 138610 180839 271897
11286B71897J86973K87300K94991J80114N9635j665j37427k78970k87093k00662
$$ 271897 458870 746170 1041161 1221275 1280910 1279245 1141818 862848 575755 375093
11276C75093j20787p3639m8574l9479k6565j5691m440p085K736r54j0772n714
$$ 375093 254306 180667 132093 92614 66049 50358 45918 38833 41569 40615 29843 24129
11264B4129k929M113o081L012L798K75j466q747O702L634n652r352n098r28r115
$$ 24129 21200 25313 19232 22244 26042 26317 24851 16104 22806 26440 20788 11436 6338 5410 -3705
11249c705l975m322m25J4133R458m870q983p083n48m027R939J1897K253o245n061
$$ -3705 -7680 -12002 -12427 1706 11164 6294 -2689 -9772 -10320 -14347 -4408 7489 9742 3497 -1564
11234a564m142j244L662K032M656L111n114j1471l953P538R639l45L63l485J420
$$ -1564 -5706 -6950 -3288 -1256 3400 6511 1397 -10074 -14027 -6489 3150 2805 3168 -317 1103
11219A103j812k684M51R749Q025j114n634p806q728P867J6035N38l993K953L390
$$ 1103 -709 -3393 -2942 6807 14832 13718 8084 278 -8450 -583 15452 15990 11997 14950 18340
11204A8340K590q619r345K068L515O855K903q091j2967l498L893O821J1134J44
$$ 18340 20930 12311 2966 5034 8549 15404 18307 10216 -2751 -6249 -2356 4465 15599 15743
11190A5743q50m35L414J324l78j866R9Q171Q712J625R359J5557K2261J4140K6948
$$ 15743 14893 14458 17872 19196 18818 16952 17051 25222 33934 35559 44918 60475 82736 96876 123824
11175A23824N0400P5803J38585K52978K74708J36636k1491j1539N4156l0577k01034
$$ 123824 174224 250027 388612 641590 916298 1052934 1031443 1019904 1074060 1043483 842449
11164H42449k64443k00884j24001q2130n3880k6869j1045m967j2281n413j1784
$$ 842449 578006 377122 253121 170991 117111 90242 79197 74230 61949 56536 44752
11153D4752r434m856m087l447Q29J029n146l823q21l650N674n294p033J0449L974
$$ 44752 35318 30462 26375 22928 23757 24786 19640 15817 14996 11346 17020 11726 4693 15142 19116
11138A9116K212m421q912k114M364K639j3518K258K918L959o227N693L66q626
$$ 19116 21328 16907 7995 5881 10245 12884 -634 1624 4542 8501 2274 7967 8333 -293
11124b93R614K343K382q772j922M932N273O112n777j1447Q01k741q897K473L907
$$ -293 9321 11664 14046 5274 3352 8284 13557 19669 13892 2445 3246 505 -8392 -5919 -2012
11109b012K541j2264k772Q655Q260O790M107k612j175J017o992l85N121P896o50
$$ -2012 529 -11735 -14507 -5852 2408 9198 13305 10693 9518 10535 3543 3158 8279 16175 15525
11094A5525k160m159p631O419L981p286%J41J453n389o160l37N006m702q114K937
$$ 15525 13365 9206 1575 7994 11975 4689 4689 4830 6283 894 -5266 -5603 -597 -5299 -13413 -10476
11078a0476J633l710L674J1146N809K834p280m531M455O021o435n75m527m99M32
$$ -10476 -8843 -12553 -8879 2267 8076 10910 3630 -901 3554 9575 3140 2565 -1962 -2461 -2029
11063b029P489K184J005n508Q143K997j6148r697Q312P08o773j933J009p804j4932
$$ -2029 5460 7644 8649 3141 11284 14281 -1867 -11564 -3252 -2544 -9317 -11250 -10241 -18045 -32977
11048c2977l913N000J5468O372m604P660J0462L792m526k632M252q77k502o000
$$ -32977 -36890 -31890 -16422 -10050 -14654 -6994 3468 7260 2734 102 4354 3477 975 -5025
11034e025j2724N165J3222L209p04l703j0547L760k440M502L153J914K336m739
$$ -5025 -17749 -12584 638 3847 3143 -560 -11107 -7347 -9787 -5285 -2132 -218 2118 -2621
11020b621m661L649J070k082q68m187L56K752j123O202J523K0o472J604O70M785
$$ -2621 -7282 -3633 -2563 -4645 -5513 -9700 -9344 -6592 -7715 -1513 10 30 -6442 -4838 -4168 617
11004F17P748r43M218J0149l156N94m389o031r443k128P255j459j665j5422m327
$$ 617 8365 7422 11640 21789 18633 19227 14838 8807 -636 -2764 4491 3032 1367 -14055 -18382
10989a8382K959J3027K245q526k035Q942J1488q52r411k509j383M283k695m42
$$ -18382 -15423 -2396 -151 -8677 -10712 -1770 9718 8866 -545 -3054 -4437 -154 -2849 -3291
10975c291J766p897q420J1001J0680Q796k245n092J363L959n866j0436n287k520
$$ -3291 -1525 -9422 -17842 -6841 3839 12635 10390 5298 6661 10620 4754 -5682 -10969 -13489
10961a3489k101J498P868J1501K173N664j179k589J8722J0664J5994O275R742
$$ -13489 -15590 -14092 -6224 5277 7450 13114 11935 9346 28068 38732 54726 61001 70743
10948G0743P071M65j145l3j7361j6541m488n313j44m469j3416n482n69N5J466
$$ 70743 77814 78279 77134 77101 59740 43199 38711 33398 33254 28785 15369 9887 9318 9373 10839
10933A0839K813M174j92n035P239J3656j96j4119j8278j2556p770R324J3562J5504
$$ 10839 13652 17826 17634 12599 19838 33494 33298 19179 901 -11655 -19425 -10101 3461 18965
10919A8965l745j157j0291k672J4159K270k258L659p381L767K2391J3657K0777
$$ 18965 15220 14063 3772 1100 15259 17529 15271 18930 11549 15316 37707 51364 72141
10906G2141J1354K5446L1236J6714K267j6107k0066j4661j1344q566n069o088
$$ 72141 83495 108941 140177 156891 159158 143051 122985 108324 96980 88414 83345 77257
10894G7257m303o42O747j1039j2295j7288q279L867l502m953L252k009L268j0733
$$ 77257 72954 72312 79059 68020 55725 38437 30158 34025 30523 25570 28822 26813 30081 19348
10880A9348r126m42L121J525j457J848n965n81Q849M412j667m275k876K799N19
$$ 19348 10222 9780 12901 14426 12969 14817 8852 8271 17120 21532 19865 15590 12714 15513 16032
10865A6032j14Q04K277j233J4757J0191O984K0129J3822J6737J7855J0475j0810
$$ 16032 15918 16722 18999 17766 32523 42714 49698 69827 83649 100386 118241 128716 117906
10852A17906k1770k0487j5702l522o343j3436r070m619q46N076j233p090j0892
$$ 117906 96136 75649 59947 56425 50082 36646 27576 22957 22111 27187 25954 18864 7972
10839G972N331O135l939j7388q18n96J984L780J13N70k20j505J692J341l809k879
$$ 7972 13303 19438 15499 -1889 -2707 -3303 -1319 2461 2574 3144 2924 1419 3111 4452 643 -2236
10823b236j436o32M590J1541K075j5576n345J282J0774L793n295j171P196M227
$$ -2236 -3672 -4304 286 11827 13902 -1674 -7019 -5737 5037 8830 3535 2364 9560 13787
10809A3787Q059L59p871l27J9760k061q148j75k555O619K904R96L090q544p756
$$ 13787 21846 22205 14334 14007 33767 31706 23558 23383 20828 27447 30351 31347 34437 25893 18137
10794A8137p278n287J54L88P606J627Q11K840K213k524q207L727P612p266j0799
$$ 18137 10859 5572 5726 6114 13720 15347 16158 18998 21211 18687 10480 14207 21819 14553 3754
10779C754J121M412p718l185j222N056n007J150Q515J560Q056J2744q520q250
$$ 3754 4875 9287 1569 -1616 -2838 2218 -2789 -1639 6876 8436 16492 29236 20716 12466
10765A2466k018k115K797o35j126j158J559O54L680k637n784L934N223J69L979
$$ 12466 10448 8333 11130 10495 9369 8211 9770 10424 14104 11467 5683 9617 14840 15009 18988
10750A8988l644Q938N631n63L287M492m70m09m29o052o938p993M36k274j526M611
$$ 18988 15344 24282 29913 29350 32637 37129 36659 36250 35821 29769 22831 14838 15274 13000 11474 16085
10734A6085n590n130Q116O544O636J0130M453j9389r075p705l796m573j818p69
$$ 16085 10495 5365 13481 20025 26661 36791 41244 21855 12780 5075 1279 -3294 -5112 -5881
10720e881j18O59j0103j794J3288R878o045J05J2873qm795Q787K28o556K049j793
$$ -5881 -5999 -5340 -15443 -17237 -3949 5929 -116 -11 12862 12854 8059 16846 17074 10518 12567 10774
10704A0774N228O983n137k874J194J5583M688l115j0983K759J911n733k181K023
$$ 10774 16002 22985 17848 14974 16168 31751 36439 33324 22341 25100 27011 21278 19097 21120
10690B1120R334J0929n237j5625l396R815J2624n763j0587n121L998N137l981
$$ 21120 30454 41383 36146 20521 17125 26940 39564 33801 23214 18093 22091 27228 23247
10677B3247n42j4007L63L893q326l752Q150K242N727k73q39o463R42Q400Q709
$$ 23247 22705 8698 9061 12954 4628 876 9026 11268 16995 16722 15883 9420 10362 18762 27471
10662B7471J0986L850J082J277k702l832K90M753q62m433P578K313m793p84l747
$$ 27471 38457 42307 43389 44666 41964 38132 38422 43175 42313 37880 45458 47771 42978 42194 38447
10647C8447k263L808j901m571m281k234J0586J226M117m425r24k165j3655r396
$$ 38447 36184 39992 38091 33520 29239 27005 37591 38817 42934 38509 37585 35420 21765 12369
10633A2369j279J735Q731J747o838l863O214N915M802J8298J7928O895l781J079
$$ 12369 11090 12825 21556 23303 16465 12602 18816 24731 29533 47831 65759 72654 68873 69952
10619F9952J9189N553o388O56q96o680j2037M108J9283R419o32q31Q808J1343
$$ 69952 89141 94694 88306 88962 88066 81386 69349 73457 92740 102159 101527 100696 109504 120847
10605A20847Q772N523P647J6172K1655L7849N2624P2829R6671J16658J50222J73952
$$ 120847 129619 135142 142789 158961 180616 218465 271089 343918 440589 557247 707469 881421
10593H81421J76948J39657O2630j8106j00678j58173j74415j62769j35720r9562
$$ 881421 1058369 1198026 1260656 1242550 1141872 983699 809284 646515 510795 411233
10583D11233o9375m7139l8232k3114k0242j2951o422k421l039O946J1731R564
$$ 411233 341858 294719 256487 233373 213131 200180 193758 191337 188298 195244 206975 216539
10571B16539m408k625K297R331l172M130P838M476m910k489K2865L0934K2044
$$ 216539 212131 209506 211803 221134 217962 222092 229930 234406 229496 227007 249872 280806 302850
10558C02850K4152K8443K6317L3147M9108N1551P3404P9422R0236J03963J20259
$$ 302850 327002 355445 381762 414909 464017 515568 588972 668394 758630 862593 982852
10547I82852J52393J74850J95952K41369L23037M36703O24033R16154J306101
$$ 982852 1135245 1310095 1506047 1747416 2070453 2507156 3131189 4047343 5353444
10538E353444J784499K236865K466531K248868J548006M96948o30477j575665
$$ 5353444 7137943 9374808 11841339 14090207 15638213 16135161 15504684 13929019
10530A3929019k148037k263156k032260j642923j238872r00547o18279m44829
$$ 13929019 11780982 9517826 7485566 5842643 4603771 3703224 3084945 2640116
10522B640116l16025k23727j64907j34645j10864j08386q4216o3434l0790j2095
$$ 2640116 2324091 2100364 1935457 1800812 1689948 1581562 1497346 1433912 1403122 1391027
10512A391027N593K9941O4060J02538J64573K29961L44750M41418N30994N70751
$$ 1391027 1396620 1426561 1490621 1593159 1757732 1987693 2332443 2773861 3304855 3875606
10502C875606N28590M24786K91330K39844L27465N68392J029049J704955K571458
$$ 3875606 4404196 4828982 5120312 5360156 5687621 6256013 7285062 8990017 11561475
10493A1561475L512483M229299M263683L280603J416849o84513k270606k889504
$$ 11561475 15073958 19303257 23566940 26847543 28264392 27579879 25309273 22419769
10485B2419769k601839j910525j350765j270998j567653j891980j990174j788358
$$ 22419769 19817930 17907405 16556640 15285642 13717989 11826009 9835835 8047477
10477H047477j395638r62224n62952k39404k5846L3164r4237l13832n13229n80154
$$ 8047477 6651839 5689615 5126663 4887259 4861413 4894577 4800340 4486508 3973279 3393125
10467C393125n21628m16127l09812k21534j31592q1788l8611J3155M0995P2404
$$ 3393125 2871497 2455370 2145558 1924024 1792432 1710644 1672033 1685188 1726183 1798587
10457A798587J04115J22091J44889J77600K08319K81797L99125N87633Q50972
$$ 1798587 1902702 2024793 2169682 2347282 2555601 2837398 3236523 3824156 4675128
10448D675128J250146J770845K387695K943832L168512K780899J708134J78203
$$ 4675128 5925274 7696119 10083814 13027646 16196158 18977057 20685191 20863394
10440B0863394j374050k524940l053727k978911k529896j951987j429848j004916
$$ 20863394 19489344 16964404 13910677 10931766 8401870 6449883 5020035 4015119
10432D015119o91985m82539l48849k53069j87326j75682j99602k01486j87928
$$ 4015119 3323134 2840595 2491746 2238677 2051351 1875669 1676067 1474581 1286653
10423A286653j63811j44946j24194j00508p3144n7980n0611l5934k7567j7750
$$ 1286653 1122842 977896 853702 753194 680050 622070 571459 535525 507958 490208
10413D90208l0305m0491k6336j3975j6984j5277j7923l3178l3658r587j1464M971
$$ 490208 459903 419412 393076 379101 362117 346840 328917 295739 262081 252494 241030 246001
10401B46001j019j0271m801J229O283J857j1308L11J964L33p397j3064q576k415
$$ 246001 244982 234711 229910 231139 237422 239279 227971 228282 230246 230579 223182 210118 201542 199127
10387A99127m61o963j2819r421L493j4194j2971K675K405r111j0811L921J1907
$$ 199127 198666 191703 178884 169463 172956 158762 145791 148466 150871 141760 130949 134870 146777
10374A46777J5461m415j1943j0620m762Q569K0523N432j5776j4850j1721m263
$$ 146777 162238 157823 145880 135260 130498 139067 159590 165022 149246 134396 122675 118412
10362A18412j0325k0396j5738j5089l505N743R283q108l43M477q451K403P07J6355
$$ 118412 108087 87691 71953 56864 53359 59102 68385 60277 59934 64411 55960 58363 59070 75425
10348G5425J8614K968R130Q429N50J915K412K086M231J986m025P22L250J955J893
$$ 75425 94039 97007 106137 114566 115116 117031 119443 121529 125760 127746 123721 124443 127693 129648 131541
10333A31541j0476J568l922J0392J3823p169j724J0571K948J1121P836m272M14
$$ 131541 121065 122633 118711 129103 142926 135757 134033 144604 147552 158673 166509 162237 162651
10320A62651q885j288J1438Q830m09J965J1056J3815r56j454P193Q072K692K2530
$$ 162651 153766 152478 163916 172746 172337 174302 185358 199173 198217 196763 203956 212028 214720 237250
10306B37250L5229M0741N0464N5376L7663J7471j7615n9439p1947m8132k5262
$$ 237250 272479 313220 363684 419060 456723 474194 456579 397140 325193 277061 251799
10295B51799j7096l295j516j3523j5769j4692j1254r173M065O232q774r527K971
$$ 251799 234703 231408 229892 216369 200600 185908 174654 165481 169546 175778 167004 157477 160448
10282A60448k684Q89Q919J5042J2839M508R711q114j1360j593j1418p442j70l973
$$ 160448 157764 158653 167572 182614 195453 199961 209672 201558 190198 188605 177187 169745 169575 165602
10268A65602N149L728J2602K2797K4592O589O892P211J5166J3383J4350J5033
$$ 165602 170751 174479 187081 209878 234470 241059 247951 255162 270328 283711 298061 313094
10256C13094k90R380k298r714N536O989n455r118J779Q394L351J6623J4359J3362
$$ 313094 312804 322184 319886 310172 315708 322697 317242 308124 309903 318297 321648 338271 352630 365992
10242C65992J6301J7785J5269J4132P60l324J624K1383K4994K5581K2139K4266
$$ 365992 382293 400078 415347 429479 430239 426915 428539 449922 474916 500497 522636 546902
10230E46902J8948R840n650j6463q907n285N894K6108N1808O5063O0599N6368
$$ 546902 565850 575690 570040 553577 544670 539385 545279 571387 623195 688258 748857 805225
10218H05225O4045O3217O4489P2343Q3851O5773M5832L6869N8535P1309Q5608
$$ 805225 869270 932487 996976 1069319 1153170 1218943 1264775 1301644 1360179 1431488 1517096
10207A517096R2405R9866J08849J20503J37844J73127K08354K50245K97217L43412
$$ 1517096 1609501 1709367 1818216 1938719 2076563 2249690 2458044 2708289 3005506 3348918
10197C348918M04079M72009N72169P09211Q74954J017670J067321R69287P81319
$$ 3348918 3752997 4225006 4797175 5506386 6381340 7399010 8466331 9435618 10216937
10188A0216937P54899R84141J412610K001442K790840L863453N370093P689457
$$ 10216937 10971836 11955977 13368587 15370029 18160869 22024322 27394415 35083872
10180C5083872J1489527J7844220K8586242M5432129O5073042P0257220L8774036
$$ 35083872 46573399 64417619 93003861 138435990 203509032 273766252 312540288
10173C12540288j7669851n8917282o6141477n2025279l5046328k2654193j4794761
$$ 312540288 294870437 235953155 169811678 117786399 82740071 60085878 45291117
10166D5291117r969101o977396n036143l692343k689887j903594j298108r08402
$$ 45291117 35322016 28344620 23308477 19616134 16926247 15022653 13724545 12816143
10158A2816143p52260q20750r89909j081002j054423r72665q63164p24427n83336
$$ 12816143 12063883 11243133 10253224 9172222 8117799 7145134 6281970 5557543 4974207
10149D974207m71374l87872l36491k82548k47830k32491k04905j89237j70688
$$ 4974207 4502833 4114961 3778470 3495922 3248092 3015601 2810696 2621459 2450771
10140B450771j49664j27887j13745j17979j14171r2084p9946o9410n0829n3127
$$ 2450771 2301107 2173220 2059475 1941496 1827325 1735241 1655295 1585885 1535056 1481929
10130A481929m7203l1914j9328j2371j145N824n173j1627k187k9989o1059r6479
$$ 1481929 1434726 1402812 1383484 1371113 1369968 1375792 1370619 1358992 1356805 1326816 1265757 1169278
10118A169278r7705o3801n2048l2760k7676k3379k1246l8199m2647m8763l0636
$$ 1169278 1071573 1007772 955724 922964 895288 871909 850663 812464 769817 721054 690418
10107F90418j8269k2131j6896l118k473j2657q683k1610k6001k4103l2033k3630
$$ 690418 672149 650018 633122 630004 627531 614874 606191 584581 558580 534477 502444 478814
10095D78814j8345j7310k0789p492j5069j6443J1603K5198R203Q78J206J2389
$$ 478814 460469 443159 422370 414878 399809 383366 394969 420167 429370 430248 431454 443843
10083D43843P895p126O387N374l797M822k23J2434J4907P858M989R251k425m20
$$ 443843 451738 444612 450999 456373 452576 457398 457175 469609 484516 492374 497363 506614 504189 503769
10069E03769j2066j7127p571j9703j7317o633j1132j0960N49m326j4930j9397
$$ 503769 491703 474576 467005 447302 429985 423352 412220 401260 401809 397483 382553 363156
10057C63156k6102m301R905N647J045L571J1043P110l1932n8053n4528k9056O392
$$ 363156 337054 332753 342658 348305 349350 352921 363964 371074 339142 281089 226561 197505 203897
10044B03897M6542P9957P0249k0338o6999o3147k6415r752M779J5338M535r389
$$ 203897 250439 330396 400645 380307 313308 250161 223746 213994 218773 234111 238646 229257
10032B29257R392P935J6957J2135J4791J1242R906Q884O708q87j437p641j4074
$$ 229257 238649 246584 263541 275676 290467 301709 311615 320499 327207 326320 324883 317242 303168
10019C03168j4479j9503j7041m723j4784j2643j2486J88J165L305m658j3972j9859
$$ 303168 288689 269186 252145 247422 232638 219995 207509 207697 208862 212167 207509 193537 173678
10006A73678n964p677M949J3365l620J3478M642M778K352L501P82o495n687M597
$$ 173678 167714 160037 164986 178351 174731 188209 192851 197629 199981 203482 204264 197769 192082 196679
9992A96679Q755O250l075j2910j6919o214j2766p233p485m386p651n229J82J4742
$$ 196679 205434 211684 208609 195699 178780 172566 159800 152567 145082 140696 133045 127816 127998 142740
9978A42740R214Q584k1093q953l158N624J6490J5699n984j114L71k367L59j2151
$$ 142740 151954 160538 139445 130492 127334 132958 149448 165147 159163 158049 158420 156053 156412 144261
9964A44261k411p874P32p263Q239J3812L300j1012q126P450n163r63K507p524
$$ 144261 141850 133976 134708 127445 135684 149496 152796 141784 133658 141108 135945 134982 137489 129965
9950A29965n107O581M328N531m70J312L530P582n981p247R75R852J1474P733K611
$$ 129965 124858 131439 135767 141298 140828 142140 145670 153252 147271 140024 140999 150851 162325 170058 172669
9935A72669K329n401n900K37O8K24J0534J304j1066r713Q013O269P708Q505J614
$$ 172669 174998 169597 163697 163934 164002 164226 174760 176064 164998 155285 163298 169567 177275 185780 187394
9920A87394n121p846q049n575l282j0535p25o234O620N944O492K325j226l239
$$ 187394 182273 174427 166378 160803 157521 146986 146261 140027 146647 152591 159083 161408 160182 156943
9906A56943J114p846k132O000J1831L998p91o986L465J5261P201n90O993J1432
$$ 156943 158057 150211 148079 154079 165910 169908 169117 162131 165596 180857 188058 187468 194461 205893
9892B05893j7105q953J3421N497q114r410J242R715O658N490Q088k605J274L856
$$ 205893 188788 179835 193256 198753 190639 181229 182471 192186 198844 204334 212422 209817 211091 214947
9878B14947K669j5224m144J0594p85q061j0685m255q772j4523k212m856R147L448
$$ 214947 217616 202392 198248 208842 208057 199996 189311 185056 176284 161761 159549 154693 163840 167288
9864A67288R725J0930O016l013Q143R519l253j2940j2529K973J0770J2421P533
$$ 167288 177013 187943 193959 190946 199089 208608 205355 192415 179886 182859 193629 206050 213583
9851B13583J2407J6893R663j806J936L568J2570N277K758R135O725p59m376o268
$$ 213583 225990 242883 252546 250740 252676 256244 268814 274091 276849 285984 292709 291950 287574 281306
9837B81306k295K435L224M336J7895J1805R61Q139N657R039J4284J1225Q172K1645
$$ 281306 279011 281446 284670 289006 306901 318706 319667 327806 333463 342502 356786 368011 376183 397828
9823C97828K5301L4622K8853L0177L6855N0659O1741P2985Q0877J07948J51065
$$ 397828 423129 457751 486604 516781 553636 604295 666036 739021 819898 927846 1078911
9812A078911K00439K78161L89799N33598P02133Q09287P53427N31537K30253j20053
$$ 1078911 1279350 1557511 1947310 2480908 3183041 3992328 4745755 5277292 5507545 5387492
9802E387492m84479p36529p85484o78136n09818l72265k65221j88226j35309r3957
$$ 5387492 4903013 4166484 3381000 2702864 2193046 1820781 1555560 1367334 1232025 1138068
9792A138068o9160l5835k6662j5465p958j2837m022R561K9025L3610N6744Q6200
$$ 1138068 1068908 1033073 1006411 990946 982988 970151 966129 975690 1004715 1038325 1095069 1181269
9780A181269J16865J37755J82969K27747K68254K48328K01889J87630K56608M05543
$$ 1181269 1298134 1435889 1618858 1846605 2114859 2363187 2565076 2752706 3009314 3414857
9770C414857O24269R48640J397846J962216K417062K371598J628737M25346p35724
$$ 3414857 4039126 4987766 6385612 8347828 10764890 13136488 14765225 15190571 14454847
9761A4454847j310176j175626o35965j75770j52074n47193j034643j278681j186866
$$ 14454847 13144671 11969045 11333080 11157310 11005236 10458043 9423400 8144719 6957853
9752F957853r23602o84288n10220m09118l63119l06823k43706k26626k44417k46315
$$ 6957853 6034251 5349963 4839743 4430625 4067506 3760683 3516977 3290351 3045934 2799619
9742B799619k03598j34617m6236L1323J13568K05214L10408L55186K32754O3429
$$ 2799619 2596021 2461404 2415168 2446491 2560059 2765273 3075681 3430867 3663621 3727050
9732C727050j4657N2668K39021M82365P70371J153801J665948K116796K089996
$$ 3727050 3712393 3765061 4004082 4486447 5256818 6410619 8076567 10193363 12283359
9723A2283359J304682K61384k51888K2121Q01471J583961J842302J245148o5037
$$ 12283359 13588041 13849425 13597537 13619658 14421129 16005090 17847392 19092540 19027503
9714A9027503j472268k301894k442397k219073j869794j503206j131694p84148
$$ 19027503 17555235 15253341 12810944 10591871 8722077 7218871 6087177 5303029
9706E303029m71267k70707k72953l91836m54266m09462l27068k27044j51018p8499
$$ 5303029 4831762 4561055 4288102 3896266 3442000 3032538 2705470 2478426 2327408 2248909
9696B248909l94M1341M6845N119l9040m8421j3303N2883J45178K29683L54371
$$ 2248909 2248515 2289856 2336701 2341820 2302780 2254359 2241056 2293939 2439117 2668800 3023171
9685C023171M98411O03542O03253M41958L27387M20693P26733J124218J462833
$$ 3023171 3521582 4125124 4728377 5170335 5497722 5918415 6645148 7769366 9232199
9676I232199J661771J611063J105559K19289o04992j169917j581940j821990j742358
$$ 9232199 10893970 12505033 13610592 13829881 13224889 12054972 10473032 8651042 6908684
9667F908684j416724j036837p13956m93029l81348l47906l23548k87040k35442
$$ 6908684 5491960 4455123 3741167 3248138 2866790 2518884 2195336 1908296 1672854
9658A672854j75182j31359j25420j01353r7161q3911o2521m7437l4764k2326p244
$$ 1672854 1497672 1366313 1240893 1139540 1042379 958468 895947 848510 813746 791420 784176
9647G84176L017r232Q839J7120J9908L7668O4380Q6751J19824J89650K70666L73888
$$ 784176 787193 777961 786800 803920 823828 861496 925876 1012627 1132451 1322101 1592767 1966655
9635A966655M86967N65606N29596L69333J59032p1834l44312n45092o11534n49271
$$ 1966655 2453622 3019228 3548824 3918157 4077189 4005355 3661043 3115951 2504417 1955146
9625A955146m19530l08246k21433j54012j06825q1208o9102m9568m3053k8751
$$ 1955146 1535616 1227370 1005937 851925 745100 663892 594790 545222 502169 473418
9615D73418l5796m5584k7182k4280l2912l0299r713r162J431r864j0570j729n071
$$ 473418 437622 392038 364856 340576 307664 277365 267652 258490 259921 250057 239487 237758 232687
9602B32687o229j2275j114o847j0678m860k205m385o274j0982j1158j0795r101
$$ 232687 226458 214183 213069 206222 195544 190684 188479 184094 177820 166838 155680 144885 135784
9589A35784n063Q879J1349o310j2078j3777J718K121k300o684m296R623J401q350
$$ 135784 130721 139600 150949 144639 132561 118784 120502 122623 120323 113639 109343 118966 120367 112017
9575A12017J014Q73O334K262J130o624j030R022o01n098j3448K212p75n043o8
$$ 112017 113031 113904 120238 122500 123630 117006 115976 124998 124397 119299 105851 108063 107288 102245 102177
9560A02177M387l194p285P007K400o74J511m59L54k012r727n642J863O123l238
$$ 102177 106564 103370 96085 103092 105492 104818 106329 105870 106224 104212 94485 88843 90706 96829 93591
9545I3591p83p413j2205j1096L153J3215M071J0191R94N368j51j2562o878r16
$$ 93591 92808 85395 73190 62094 65247 78462 82533 92724 93718 99086 98935 86373 79495 78579
9531G8579l747j455L636j67p045J616j4424m644J0736J2987K268M862L330p029
$$ 78579 74832 73377 77013 76846 69801 71417 56993 52349 63085 76072 78340 83202 86532 79503
9517G9503J098N254N592J177k27K952r089m373l515J91M919O360n98q995n548
$$ 79503 80601 85855 91447 92624 92397 95349 86260 81887 78372 78563 83482 89842 89244 80249 74701
9502G4701j008j784p334p484k880Q150J610j392j037M861M445o168o634k21r29
$$ 74701 73693 71909 64575 57091 54211 62361 63971 62579 61542 66403 70848 64680 58046 57825 56896
9487E6896J844K039k095k889q53n240R976N431n44M282r43j0840n490k117P756
$$ 56896 58740 60779 58684 55795 54942 49702 59678 65109 64565 68847 67904 57064 51574 49457 57213
9472E7213o496J638N902o495K804N417J06P090l5p743K054J136p226J652j018
$$ 57213 50717 52355 58257 51762 54566 59983 60089 67179 67144 59401 61455 62591 55365 57017 55999
9457E5999p217p643L158J4731M616q795r082j1157Q505Q332J250r69M69j287L22
$$ 55999 48782 41139 44297 59028 63644 54849 45767 34610 43115 51447 52697 51728 52197 50910 51232
9442E1232n146O817N384P46J403m330k522J302l997n075M930K818K910P544l784
$$ 51232 46086 52903 58287 59033 60436 56106 53584 54886 50889 45814 50744 53562 56472 64016 60232
9427F0232o302o136P007k104j4767o232N557R579l373j567m108n770k564k606
$$ 60232 53930 47794 54801 52697 37930 31698 37255 46834 43461 41894 37786 32016 29452 26846
9413B6846O777Q581L422K372n653n536P096N961R950O085K052Q746L327j203P17
$$ 26846 33623 42204 45626 47998 42345 36809 43905 49866 59816 65901 67953 76699 80026 78823 79540
9398G9540m477j9578j4369K845p83j0135K828K134j255K364m941j011j329q889
$$ 79540 75063 55485 41116 43961 43178 33043 35871 38005 36750 39114 34173 33162 31833 22944
9384B2944L159P936J5116l003j0725j0117k562P392O375l386O915J9872l461j5635
$$ 22944 26103 34039 49155 46152 35427 25310 22748 30140 36515 33129 40044 59916 56455 40820
9370D0820P92L931P76o00l944P077N703O292R858K0555J4775P280n671q195j3511
$$ 40820 41612 45543 46319 45719 41775 48852 54555 60847 70705 91260 106035 113315 107644 99449 85938
9355H5938r825L29j80o244p305l903n107N118j294j153j2689J387O286N526N30
$$ 85938 76113 76442 76262 70018 62713 58810 53703 58821 57527 56374 43685 45072 51358 56884 57414
9340E7414k95p117m305r290N186j794l830N714Q538n37o660j0374j765J2594N124
$$ 57414 57119 50002 45697 36407 41593 39799 35969 41683 50221 49684 43024 32650 30885 43479 48603
9325D8603j59J4324M025L581L226Q592J1984L848O081J2311J601O235J437l488
$$ 48603 48444 62768 66793 70374 73600 82192 94176 98024 104105 116416 118017 124252 125689 122201
9311A22201J269r007j0129j4466j6395q793o832j2595q017R56N766m486K19J808
$$ 122201 123470 114463 104334 89868 73473 64680 57848 45253 37236 38192 43958 39472 39691 41499
9297D1499P282R272O154l118p353k543l445n784q154J995J3248O401K24p076j534
$$ 41499 48781 58053 64207 61089 53736 51193 47748 41964 33810 35805 49053 55454 55678 48602 47068
9282D7068k108m74o701l400O132M370L292J1921J5374K562P411K551J3527J2776
$$ 47068 44960 44486 37785 34385 40517 44887 48179 60100 75474 78036 85447 87998 101525 114301
9268A14301N050o055j5022j1372j8214j0346l191m106J117p986m439N83j977L168
$$ 114301 119351 113296 98274 86902 68688 58342 55151 51045 52162 44176 39737 40320 38343 41511
9254D1511J131r4j922j5499K206O917l211l845j583K004m19n712N65k648j557
$$ 41511 42642 42548 40626 25127 27333 34250 31039 27194 25611 27615 27196 21484 22049 19401 17844
9239A7844j566m523R717J3133J0056k486p611J395K887K312J0013Q26k077k130
$$ 17844 16278 11755 21472 34605 44661 42175 34564 35959 38846 41158 51171 51997 49920 47790
9225D7790M99j6835j4742M922L927M335l928r196K279r51O396K509m878P369J642
$$ 47790 48289 31454 16712 21634 25561 29896 25968 16772 19051 18100 24496 27005 22127 29496 31138
9210C1138l063P447p353m677p228J486m737R61J847M928O169j0771o490k898l387
$$ 31138 28075 35522 28169 23492 16264 17750 13013 13974 15821 20749 26918 16147 9657 6759 3372
9195C372n30J2188L657m358j693J414J077j339O209K984k644n887j673L902K258
$$ 3372 2842 15030 18687 14329 12636 14050 15127 13788 19997 22981 20337 14450 12777 16679 18937
9180A8937q859n355J450O411J370l440r121o177L312O723N51P457q0p602m051
$$ 18937 10078 4723 6173 12584 13954 10514 1393 -4784 -1472 5251 5802 13259 13179 5577 1526
9165A526M164M873K486J602k664M935L096L227K382L568o989m783Q000n18M098
$$ 1526 5690 10563 13049 14651 11987 16922 20018 23245 25627 29195 22206 17423 25423 24905 29003
9150B9003Q621l9q716p631j4488j100N205J0111j485j397K862n88J851l646k925
$$ 29003 37624 37585 28869 21238 6750 5650 10855 20966 19481 18084 20946 20358 22209 18563 15638
9135A5638m959k198N819Q155K36j299M888p11l730K25J028m738p464j762K962
$$ 15638 10679 8481 14300 22455 22691 21392 26280 25569 21839 22064 23092 18354 10890 9128 12090
9120A2090M860J1556K826L744j2460j0295J03p946L904J0877m504n790q35k433
$$ 12090 16950 28506 31332 35076 22616 12321 12424 4478 8382 19259 14755 8965 8130 5697
9106E697j537j122l130o058P179K693K794J0010J2439j75p10j256q109l453J373
$$ 5697 4160 3038 -92 -6150 1029 3722 6516 16526 28965 28790 28080 26824 18715 15262 16635
9091A6635o757l182O480l769j607L077M406k292n93J0460n162J067l405k493Q188
$$ 16635 9878 6696 13176 9407 7800 10877 15283 12991 12398 22858 17696 18763 15358 12865 21053
9076B1053M421m107p033k957n781L746N729M505K433K244n146r782j137M178R813
$$ 21053 25474 21367 14334 11377 5596 9342 15071 19576 22009 24253 19107 9325 8188 12366 22179
9061B2179o22J943j881m477k373Q932l018k660l292n756q469M914O809O37O514
$$ 22179 21557 23500 21619 17142 14769 23701 20683 18023 14731 8975 506 5420 12229 12866 19380
9046A9380m334m975M605k132j0813m921p073K924R244Q781o91K607k763j0935
$$ 19380 15046 10071 14676 12544 1731 -3190 -10263 -7339 1905 10686 9995 12602 9839 -1096
9032a096n086j302n650O145K687P965j080J160L284O85q352M31P579P178m745
$$ -1096 -6182 -7484 -13134 -6989 -4302 3663 2583 3743 7027 7712 -640 -209 7370 14548 9803
9017I803n069p373n272P369L392o468M279L535m349k980k398k70O98K855j798
$$ 9803 4734 -2639 -7911 -542 2850 -3618 661 4196 -153 -3133 -5531 -5801 -5103 -2248 -4046
9002d046J0085Q313j413m563L13p74r695r954O318P148J2232k641K139R82q248
$$ -4046 6039 14352 12939 8376 8689 7915 -1780 -11734 -5416 1732 13964 11323 13462 14444 6196
8987F196P566J5095o46r116j1634R875R143l149k142o256N896N043R89n815J640
$$ 6196 13762 28857 28211 19095 7461 17336 26479 23330 21188 14932 20828 25871 26860 21045 22685
8972B2685j464L385K051K582L1P34m152l161m829Q94M535M928j0852R95l736l323
$$ 22685 21221 24606 26657 29239 29270 30004 25852 22691 17862 18756 23291 28219 17367 18362 14626 11303
8956A1303J590o891l652l913K824R456M059J2432J975p887j0231k366J1332o97
$$ 11303 12893 6002 2350 -1563 1261 10717 14776 27208 29183 21296 11065 8699 20031 19334
8942A9334K657k064m103j562p547j436o32M387k121M371J172N28M988m171o126
$$ 19334 21991 19927 15824 14262 6715 5279 4647 9034 6913 11284 12456 12984 17972 13801 7675
8927G675m325N475N308k169m638J953J471l643p179L184J1686k351r824q06k926
$$ 7675 3350 8825 14133 11964 7326 9279 10750 7107 -72 3112 14798 12447 2623 1817 -1109
8912a109O857q908j531R885R078o610M894n38p95K086Q876K014j2184l815q343
$$ -1109 5748 -3160 -4691 5194 14272 7662 12556 12018 11223 13309 22185 24199 12015 8200 -143
8897a43l795J677l948j091Q699M467j778P3K843l573K44O82K847k578m346Q258
$$ -143 -3938 -2261 -6209 -7300 1399 5866 4088 4161 7004 3431 3675 4357 7204 4626 280 8538
8881H538P836n872m956K867o643M097J484K012p380j287n64M998j196l514m67
$$ 8538 16374 10502 5546 8413 1770 5867 7351 9363 1983 696 132 5130 3934 420 -47
8866d7Q00m347M856l13L65m506L506O080k783o73Q558P704l661j0537Q38j293
$$ -47 753 -3594 1262 949 1314 -3192 314 6394 3611 2938 11496 19200 15539 5002 5840 4547
8850D547k980Q427m822K657J209J449N854N64n685N823l345p000j741M302J5001
$$ 4547 1567 9994 5172 7829 9038 10487 16341 16905 11220 17043 13698 6698 4957 9259 24260
8835B4260R59j1265p128K281J0257j357j0518k558O877R216k673p78j1435M852
$$ 24260 25219 13954 6826 9107 19364 18007 7489 4931 11808 21024 18351 17573 6138 10990
8821A0990O19m418K170q97K344K779O71K587q149j820K845M890K779m836M282
$$ 10990 11609 7191 9361 8464 10808 13587 14258 16845 8696 6876 9721 14611 17390 12554 16836
8806A6836R687N340j649j0048k819L456n145p57l599k916o132K196R050o893M630
$$ 16836 26523 31863 30214 20166 17347 20803 15658 14901 11302 8386 2254 4450 13500 6607 11237
8791A1237k15k840l424K896K571J0942L282L30p302n052l768O504l797L865M892
$$ 11237 11022 8182 4758 7654 10225 21167 24449 24779 17477 12425 8657 15161 11364 15229 20121
8776B0121J409J585o180N128K466J956o341l499O611p002r352K164l669J451K195
$$ 20121 21530 23115 16935 22063 24529 26485 20144 16645 23256 16254 6902 9066 5397 6848 9043
8761I043K829k843k964k079j185l449l098J268K377K549K234J4188Q090j843r14
$$ 9043 11872 9029 6065 3986 2801 -648 -3746 -2478 -101 2448 4682 18870 26960 25117 24203
8746B4203m398p007O51r878n4R089J3736N593j952q312p479P411J4991N338j163
$$ 24203 19805 12798 13449 3571 3517 12606 26342 31935 29983 21671 14192 21603 36594 41932 40769
8731D0769l693j2309k82o206o221l754P027k892q429j334N629P602J3222P35m978
$$ 40769 37076 24767 24485 18279 12058 8304 15331 12439 4010 2676 8305 15907 29129 29864 24886
8716B4886l02l494L239K678n149n593R97l04m582j339n20N180N067j048j1164
$$ 24886 24584 21090 24329 27007 21858 16265 17262 16958 12376 11037 10517 15697 20764 19716 8552
8701H552j417K139M239O76M045Q99Q4k524k201L138n943K242Q477O735O964M81
$$ 8552 7135 9274 13513 14189 18234 19133 19217 16693 14492 17630 11687 13929 22406 29141 36105 36586
8685C6586M080j992J1098Q084K859k533J2823Q612K5556L6374M3438N1624J9281
$$ 36586 40666 38674 49772 57856 60715 58182 71005 79617 105173 141547 184985 236609 255890
8672B55890j7894m7657m4640l6208k3138j3357j5302j5077n516k225r22m087Q758
$$ 255890 237996 190339 145699 109491 86353 72996 57694 42617 37101 34876 33954 29867 38625
8659C8625J2757J1567j2020o050M917p976L770k220K229l10o006J229o163K254
$$ 38625 51382 62949 50929 44879 49796 41820 45590 43370 45599 45289 39283 40512 34349 36603
8645C6603R78n57N28q35p916J32M941K814L169J0882R353j2816r897j1281N401
$$ 36603 37581 37024 37552 36717 28801 28933 33874 36688 39857 50739 60092 47276 37379 26098 31499
8630C1499P052J931q67m277O014J2239J7588P310p528q250q83L138J0691P561
$$ 31499 38551 40482 39615 35338 41352 53591 71179 78489 70961 62711 61828 64966 75657 83218
8616H3218p733l206j306J0166Q412k382J2219R527k876l474K00P960J1350J4160
$$ 83218 75485 72279 70973 81139 89551 87169 99388 108915 106039 102565 102765 110725 122075 136235
8602A36235J7972P861P396K0236J6935O946J1618K1010L9535L0495L4826L5932
$$ 136235 154207 162068 169464 189700 206635 213581 225199 246209 285744 316239 351065 386997
8590C86997L3919L6981K0939p704j1551j5198l7134n4584n1756m2818l3324k9031
$$ 386997 420916 457897 478836 471132 459581 444383 407249 352665 300909 258091 224767 195736
8578A95736k5884j6331m530p023m511k147K025P669J6951K8454L3990O5561J22795
$$ 195736 169852 153521 148991 141968 137457 135310 137335 145004 161955 190409 224399 289960 412755
8565D12755K49431L40422J22834k04910l06496k23010j29598o6977l1034k4995
$$ 412755 662186 1002608 1125442 920532 614036 391026 261428 194451 163417 138422
8555A38422k7810j1711o975n740n620p593n381o094N79k414j264j0677m866j508
$$ 138422 110612 98901 91926 86186 80566 72973 67592 61498 62077 59663 58399 47722 42856 41348
8541D1348m423N682L404k022l544j332r483K8Q846n806R506J7461J6415K747q819
$$ 41348 36925 42607 46011 43989 40445 39113 29630 29658 38504 32698 42204 59665 76080 78827 70008
8526G0008k6673j3469n55J877p649n287k458L713l902k530O456K500r40l77n403
$$ 70008 43335 29866 29311 31188 23539 18252 15794 19507 15605 13075 19531 22031 21091 20714 15311
8511A5311m791L074P213K966j193n732j200P91L423K73q196J30J0678J065J847
$$ 15311 10520 13594 20807 23773 22580 16848 15648 16439 19862 20135 11939 12069 22747 23812 25659
8496B5659j74N85R130n573M6R465m550l724M28j987q271P23J0350N662n1j8452
$$ 25659 25485 26070 35200 29627 29673 39138 34588 30864 31292 29305 21034 21757 32107 37769 37718 19266
8480A9266j0625j213N192M292J254j2646j4275Q9Q288J5634m122J005N919n134
$$ 19266 8641 7428 12620 16912 18166 5520 -8755 -8666 -378 15256 11134 12139 18058 12924
8466A2924P038L586r011n70m412r453N855Q502J20J16M654l825j1735k582j0525
$$ 12924 19962 23548 14537 13967 9555 102 5957 14459 14579 14695 19349 15524 3789 1207 -9318
8451i318n041R948n50M474R096K303l573K662J0100K528j626O35R25J0583J1138
$$ -9318 -14359 -4411 -4961 -487 8609 10912 7339 10001 20101 22629 21003 21638 22563 33146 44284
8436D4284j3899j0020o808N12k330k691L21m401K2K213M989L412l266Q209q68
$$ 44284 30385 20365 13557 14069 11739 9048 9369 4968 4990 7203 12192 15604 12338 20547 19679
8421A9679o907m347kO000k670j558O982Q71k807K223M372j547q380K017N324j1
$$ 19679 12772 8425 8423 14423 11753 10195 17177 18048 15241 17464 21836 20289 11909 13926 19250 19239
8405A9239k414j083J688J2085M65O060Q151J558P337o64k1836j9790k202J2349
$$ 19239 16825 15742 17430 29515 29980 36040 44191 45749 53086 52422 30586 10796 8594 20943
8391B0943n0n011o658n386Q163J0795l896l012P47J350O02K084m030k057o387
$$ 20943 20893 15882 9224 3838 12001 22796 18900 15888 16635 17985 18587 20671 16641 14584 8197
8376H197j15N517N717p151q890K253l635L372M606p413m381J057J0531J1180p615
$$ 8197 8082 13599 19316 12165 3275 5528 1893 5265 9871 2458 -1923 -866 9665 20845 13230
8361A3230k199L989q983m411Q067L747J608p669n218m081J522M897o262j614Q399
$$ 13230 11031 15020 6037 1626 9693 13440 15048 7379 2161 -1920 -398 4499 -1763 -3377 5022
8346E022Q069p45N866l770o975O584N138j067n564n653P52N341j490J0868J07
$$ 5022 13091 12346 18212 14442 7467 14051 19189 18122 12558 6905 7657 12998 11508 22376 22483
8331B2483k946n583p59P144K088q180m878n870J374l059n33l415K292j784j153
$$ 22483 19537 13954 13195 20339 22427 14247 9369 3499 4873 1814 1281 -2134 158 -1626 -2779
8316b779m285o05K50M520N571o001p55k556M413O167Q636N701k467l037n195K754
$$ -2779 -7064 -7669 -7419 -2899 2672 -3329 -4084 -6640 -2227 3940 12576 18277 15810 12773 7578 10332
8300A0332R42j085k012l665k526m940k697O295M259l841K844L314M893L679Q460
$$ 10332 11274 10189 8177 4512 1986 -2954 -5651 644 4903 1062 3906 7220 12113 15792 24252
8285B4252P560J6507J0876m773r926j1396j8226n653j697j504J84Q620M093m543
$$ 24252 31812 48319 59195 54422 44496 33100 14874 9221 7524 6020 6204 14824 18917 14374
8271A4374l209M303J6081o311j8879k0486k135J1926K811O77R06O570N486j186
$$ 14374 11165 15468 31549 25238 6359 -14127 -16262 -4336 -1525 -848 58 6628 12114 10928
8257A0928K423k992K818j1599m563O552k714n522k993P325P147j221k206l732
$$ 10928 13351 10359 13177 1578 -2985 3567 853 -4669 -7662 -337 6810 5589 3383 -349
8243c49L275J1395R40K071R026K005L797m635j2440k730l337M721L776R974j003
$$ -349 2926 14321 15261 17332 26358 28363 32160 27525 15085 12355 9018 13739 17515 27489 26486
8228B6486n473J3435q9k279l829k71m497k952o431k908j0598k785L491Q929O10
$$ 26486 21013 34448 34359 32080 28251 27980 23483 20531 14100 11192 594 -2191 1300 10229 10839
8213A0839J360o393m395j867J916N886K697m571O661N722q291q993j045Q808K1119
$$ 10839 12199 5806 1411 -456 1460 7346 10043 5472 12133 17855 9564 571 -474 8334 29453
8198B9453N706r750j0847m600L967M587K171o108j0237m17M382N900k093J348
$$ 29453 35159 25409 14562 9962 13929 18516 20687 14579 4342 3925 8307 14207 12114 13462
8184A3462N622j7795L735R264k01j1836l931P208L02k073j044J383k197j914K77
$$ 13462 19084 1289 5024 14288 14087 2251 -1680 5528 5830 3757 2713 4096 1899 -15 262
8169B62P60o97p408J205L317J3029N471M912j064j1619j1609o457n035P561O799
$$ 262 1022 325 -7083 -5878 -2561 10468 15939 20851 19787 8168 -3441 -9898 -14933 -7372 -573
8154e73Q685m779l324O412R042K990p861J511j513j0922j930K965P036j1637j0035
$$ -573 8112 3333 9 6421 15463 18453 10592 12103 10590 -332 -2262 703 7739 -3898 -13933
8139a3933K852J1594O837k920r976j0531J215P218J022r892Q457L458J032Q531
$$ -13933 -11081 513 7350 4430 -5546 -16077 -14862 -7644 -6622 -16514 -8057 -4599 -3567 4964
8125D964L059k701m283o085l020J0155O517Q52J970j388j1019p183N89L251Q750
$$ 4964 8023 5322 1039 -5046 -8066 2089 8606 9458 11428 10040 -979 -8162 -7573 -4322 4428
8110D428J391o386k541k631J6231K4938J6249j416r119q387k797q256l625q4o845
$$ 4428 5819 -567 -3108 -5739 10492 35430 51679 50263 41144 32757 29960 21704 18079 17995 11150
8095A1150o473j883O325q755p975R289L144M34r701o8J1492O404j4085j886Q454
$$ 11150 4677 2794 9119 364 -7611 1678 4822 5256 -4445 -4513 6979 13383 -702 -2588 5866
8080E866K788l0r84l187K190k960k387N321P230J386J837P32O107J338r310j510
$$ 5866 8654 8624 7640 4453 6643 3683 1296 6617 13847 15233 17070 17802 23909 25247 15937 14427
8064A4427J0961P534k552J0282J967K899L898n791q096o361q341j253m847M653
$$ 14427 25388 32922 30370 40652 42619 45518 49416 43625 35529 29168 20827 19574 14727 19380
8050A9380J0608l516L611J155r836K07j2005R40N817k722O16J868m168N753O155
$$ 19380 29988 26472 30083 31238 21402 21609 9604 10544 16361 13639 14255 16123 11955 17708 23863
8035B3863k731M554m85p488M826K194l447m496O0O506Q211P765J027n760j169
$$ 23863 21132 25686 25201 17713 22539 24733 21286 16790 16850 23356 31567 39332 40359 34599 33430
8020C3430J2615k749j0930l063M287N524m364Q255N030j5880m563j038j707K865
$$ 33430 46045 43296 32366 29303 33590 39114 34750 43005 48035 32155 27592 26554 24847 27712
8006B7712j613P073P816J2343R990P740R813L824j001r662m025M336K151j252
$$ 27712 26099 33172 40988 53331 63321 71061 80874 84698 83697 74035 70010 74346 76497 75245
7992G5245l953l274j558o509k73q857j3848j2365j257O030N780n903P650Q827
$$ 75245 71292 68018 66460 59951 59678 50821 36973 24608 23351 29381 35161 29258 36908 45735
7978D5735j20n715m037K683m280l743K133q659q496l775R993M353k904L382L785
$$ 45735 45615 39900 35863 38546 34266 30523 32656 23997 15501 11726 21719 26072 23168 26550 30335
7963C0335J2092J1016N461J2879j818j03J137k724j2212j3699j1622J990K350
$$ 30335 42427 53443 58904 71783 69965 69862 70999 68275 56063 42364 30742 32732 35082
7950C5082M621N554l720n776n066M534M587j0798r662n444o51p784N495Q10P974
$$ 35082 39703 45257 41537 35761 30695 35229 39816 29018 19356 13912 13261 5477 10972 11782 19756
7935A9756O218r63J909L37J875p512j0264R990K955n036j285J347l795j318N914
$$ 19756 25974 25011 26920 27257 29132 21620 11356 21346 24301 19265 17980 19327 15532 14214 20128
7920B0128r81K962o12r68J543o509j0281M038J1539k721p851J2340M800K056N179
$$ 20128 19147 22109 21497 20529 22072 15563 5282 9320 20859 18138 10287 22627 27427 29483 34662
7905C4662J407O44p613n430r947q662m409R326M440L857k058m701j178m325j764
$$ 34662 36069 36713 29100 23670 13723 5061 652 9978 14418 18275 16217 11516 10338 6013 4249
7890D249m94N052k452q799m97Q269K47l625p570l995K350Q093K046m47O597L504
$$ 4249 3755 8807 6355 -2444 -2941 5328 5575 1950 -5620 -9615 -7265 828 2874 2427 9024 12528
7874A2528l563M02l104L294J0263l286L14r209p617J0666P717q713q460L163J802
$$ 12528 8965 9367 6263 9557 19820 16534 16848 7639 22 10688 18405 9692 1232 4395 6197
7859F197r92J370k822j992O433M026k61p001m844J365J005o837M522O390n034
$$ 6197 5205 6575 3753 1761 8194 12220 11959 4958 114 1479 2484 -4353 169 6559 1525
7844A525m998n987P02L658M843k73K530K753j711J2158N796L853q981l58J857
$$ 1525 -3473 -9460 -8758 -5100 -257 -530 2000 4753 3042 15200 20996 24849 15868 15510 17367
7829A7367o207O42k906O915J409o697L323O376j3497j0878p066j250Q254L120
$$ 17367 11160 11802 8896 15811 17220 10523 13846 20222 6725 -4153 -11219 -12469 -4215 -1095
7815a095L73k227j233l056p282m07J3561K481m536p24j1903l56K397P91j752p042
$$ -1095 -722 -2949 -4182 -7238 -14520 -14927 -1366 1115 -3421 -4145 -16048 -16404 -14007 -13216 -14968 -22010
7799b2010J403O800P949L92L825L262K625q07J108J239o678L718M34o989r090
$$ -22010 -20607 -13807 -5858 -5466 -1641 1621 4246 3439 4547 5786 -892 2826 3260 -3729 -12819
7784a2819J0718M366O289K642r755m853n987Q996j794n84j970Q988J80K210J1572
$$ -12819 -2101 2265 8554 11196 1441 -3412 -9399 -403 -2197 -2781 -4751 4237 4417 6627 18199
7769A8199N634r138k862k728n844O03p05L908J303K310o154j0688j343P732O911
$$ 18199 23833 14695 11833 9105 3261 3864 3159 7067 8370 10680 4526 -6162 -7505 227 7138
7754G138r51m151k515Qj3923o872M066L717L036O513o93O894M878l511k153j196
$$ 7138 6187 2036 -479 -471 -14394 -21266 -17200 -13483 -10447 -3934 -4627 2267 7145 3634 1481 285
7738B85q99L149M202l974q983l860p960p826J2249L811J495L780K702j867l399
$$ 285 -614 2535 6737 2763 -6220 -10080 -18040 -25866 -13617 -9806 -8311 -4531 -1829 -3696 -7095
7723g095K150L969j061J0249L268q278j4296j299N907L442J0719O58n13J706L327
$$ -7095 -4945 -976 -2037 8212 11480 3202 -11094 -12393 -6486 -3044 7675 8333 7820 9526 12853
7708A2853k599o77n652j1318O64M244O230J064p240r611l417Q466J0267R62N45
$$ 12853 10254 9577 3925 -7393 -6729 -2485 3745 4809 -2431 -12042 -15459 -6993 3274 4236 4781
7693D781k918J647Q195o818n539J63j1514L118N771M865O499J1498M01n094j3650
$$ 4781 1863 3510 11705 4887 -652 -489 -12003 -8885 -3114 1751 8250 19748 20149 15055 1405
7678A405J717J866J1081m545o502J107r979n236N224K520J236R552P82n856k926
$$ 1405 3122 4988 16069 11524 5022 6129 -3850 -9086 -3862 -1342 -106 9446 10228 4372 1446
7663A446l545J268J1538k781p721r69l918j372J129M314l668m375k764Q921R36
$$ 1446 -2099 -831 10707 7926 205 -764 -4682 -6054 -4925 -611 -4279 -8654 -11418 -2497 -1561
7648a561q70o37l293r65r550j57q37N59J232k004l891n430J358R624R194r65M918
$$ -1561 -2431 -3068 -6361 -7326 -16876 -17033 -17870 -17311 -16079 -18083 -21974 -27404 -26046 -16422 -7228 -8193 -3275
7631c275J428N551m24n06j1698K160J464n116J3065P329j706k507j020k807o256
$$ -3275 -1847 3704 3280 2774 -8924 -6764 -5300 -10416 2649 9978 8272 5765 4745 1938 -4318
7616d318l862q693p37K390R711M936k334p395l53l443k137N141j70Q532J993o275
$$ -4318 -8180 -16873 -17610 -15220 -5509 -573 -2907 -10302 -10655 -14098 -16235 -11094 -11264 -2732 -739 -7014
7600g014k615M424M916l124k63J941k684N659N964l555n004K581O361J896n830
$$ -7014 -9629 -5205 -289 -3413 -3676 -1735 -4419 1240 7204 3649 -1355 1226 7587 9483 3653
7585C653J1128R637j2163j2718k277K110J337N705M89j200j5177N11J0077K442
$$ 3653 14781 24418 12255 -463 -2740 -630 707 6412 6901 5701 -9476 -8965 1112 3554
7571C554K118l78m611j745m430k947K435P366k226j3149j1048J3309K9066K6510
$$ 3554 5672 5294 683 -1062 -5492 -8439 -6004 1362 -864 -14013 -25061 -11752 17314 43824
7557D3824K8506O453k9419m1697j7515o281j49N124Q475O208J882j503K932L01
$$ 43824 72330 78783 49364 7667 -9848 -16129 -16278 -11154 -2679 3529 5411 3908 6840 7141
7543G141j1778J621J555l161L908R522Q316o311j0227o062J43l885N02L832j0296
$$ 7141 -4637 -3016 -1461 -4622 -714 8808 17124 10813 586 -5476 -5333 -9218 -8716 -4884 -15180
7528a5180J022O754n066K605R257M611J183r716j496N723J610q852J662k444j0921
$$ -15180 -14158 -7404 -12470 -9865 -608 4003 5186 -4530 -6026 -303 1307 -7545 -5883 -8327 -19248
7513a9248M310k636L736M774K199m865R984j790n13k925m675k679m679M864M840
$$ -19248 -14938 -17574 -13838 -9064 -6865 -11730 -1746 -3536 -4049 -6974 -11649 -14328 -19007 -14143 -9303
7498i303L903n872J311J2447R748O633m679j965k731r362j82L699n652j965p98
$$ -9303 -5400 -11272 -9961 2486 12234 18867 14188 12223 9492 130 -52 3647 -2005 -3970 -4768
7483d768O022M202J55r012o162n662O29l069J310J2014J0861M489q479q18o409
$$ -4768 1254 5456 5611 -3401 -9563 -15225 -14596 -17665 -16355 -4341 6520 11009 2530 1712 -4697
7468d697q234L241Q382P630O59p594q815q839j1969J2407J7124O53j167K207j1
$$ -4697 -12931 -9690 -1308 6322 6981 -613 -9428 -18267 -30236 -17829 -705 -52 -1219 988 977
7453I77L687o954l524n031R154J0561q004m694N39O329m333n986L002J032r706
$$ 977 4664 -2290 -5814 -10845 -1691 8870 866 -3828 -3289 3040 -1293 -7279 -4277 -3245 -12951
7438a2951q317J4530P995l953p998p713L491R651L892m48K34m887r546O010K3147
$$ -12951 -21268 -6738 1257 -2696 -10694 -18407 -14916 -5265 -1373 -1821 -1587 -6474 -16020 -10010 13137
7423A3137N321j0529r788p326k114R79O088O818O0k619K33n31l337o571m828m221
$$ 13137 18458 7929 -1859 -9185 -11299 -10320 -4232 2586 2646 27 260 -271 -3608 -10179 -15007 -19228
7407a9228k94j817n561j645J8048M519j617k877j228M225N362J992r084m684N035
$$ -19228 -19522 -21339 -26900 -28545 -10497 -5978 -7595 -10472 -11700 -7475 -2113 -121 -9205 -13889 -8854
7392h854k517O122N599l958lJ0577N302q064o466k257p630l623J154K687M500
$$ -8854 -11371 -5249 350 -3608 -3611 6966 12268 4204 -2262 -4519 -12149 -15772 -14618 -11931 -7431
7377g431p271j980J285L578K274O165l096R93N070j670j0740p17R541K654p55
$$ -7431 -14702 -16682 -15397 -11819 -9545 -3380 -6476 -5483 -413 -2083 -12823 -13540 -3999 -1345 -2100
7362b100o208J566J4638o131k388n95p828K063L780K652N210O125J370j312m292
$$ -2100 -8308 -6742 7896 1765 -623 -1218 -9046 -6983 -3203 -551 4659 10784 12154 10842 6550
7347F550k220N711M578k907k147o115j9723q687O781J1641Q661l444k100n600
$$ 6550 4330 10041 14619 11712 9565 3450 -16273 -24960 -18179 -6538 2123 -1321 -3421 -9021
7333i021k886n77K567K244K155n222K916J22j0192K04J800L552O563Q452R748
$$ -9021 -11907 -12484 -9917 -7673 -5518 -10740 -7824 -7702 -17894 -17690 -15890 -12338 -5775 2677 12425
7318A2425J5226r799j3232J0390J0628j3603j7519l92Q516m303r23mQ350O462
$$ 12425 27651 17852 4620 15010 25638 12035 -5484 -5876 2640 -1663 -2586 -2590 5760 12222
7304A2222j4850j5655J1264N863k251j2922o871R225R959j392n811k465k150p97
$$ 12222 -2628 -18283 -7019 -1156 -3407 -16329 -23200 -13975 -4016 -5408 -11219 -13684 -15834 -16631
7290a6631R99j380J3163J3067L661K367j0496p601J090J112J056p006K625J2576
$$ -16631 -15632 -17012 -3849 9218 12879 15246 4750 -2851 -1761 -649 407 -6599 -3974 8602
7276H602m022r565N848o69J337j0518q2n497L755m352M432M617k039K072L758
$$ 8602 4580 -4985 863 194 1531 -8987 -9069 -14566 -10811 -15163 -10731 -6114 -8153 -6081 -2323
7261b323J991k085Q462j885k081M610K732L7j0044j2113j702J1074L658O50j583
$$ -2323 -332 -2417 6045 4160 2079 6689 9421 9458 -586 -12699 -14401 -3327 331 981 -602
7246f02k961j461J902J860j1773q59L156j269P282J1561P74n90l567p374L186
$$ -602 -3563 -5024 -3122 -1262 -13035 -13894 -10738 -12007 -4725 6836 7610 7020 3453 -3921 -735
7231g35M002N711M814L336n730n264m305N645Q8o832J2713K218n229k174p472
$$ -735 3267 8978 13792 17128 11398 6134 1829 7474 7562 730 13443 15661 10432 8258 786
7216G86j200O045M575N730o038p921o678J4361J1834j0862k0660j088O473J1019
$$ 786 -414 5631 10206 15936 9898 1977 -4701 9660 21494 10632 -10028 -11116 -4643 6376
7202F376m52j850j0365N190k63m950N757n82K389k708p727k99J6687J2019o848
$$ 6376 5924 4074 -6291 -1101 -1364 -6314 -557 -1139 1250 -1458 -9185 -9484 7203 19222 12374
7187A2374L03j387q867o875k208J911n246J614N120N019q308j0664m564M462P474
$$ 12374 12677 11290 2423 -4452 -6660 -4749 -9995 -8381 -3261 1758 -6550 -17214 -21778 -17316 -9842
7172i842N027J507K535M119K051K622o909j757r625p629n310K867J6798O988j528
$$ -9842 -4815 -3308 -773 3346 5397 8019 1110 -647 -10272 -17901 -23211 -20344 -3546 3442 1914
7157A914k90M595k876p578j328L450J2622L121l702J041J091j1209K91j797J543
$$ 1914 1624 6219 3343 -4235 -5563 -2113 10509 13630 9928 10969 12060 851 1142 -655 888
7142H88P170j098j659j009n804q303M890N478K414J358M83k348j871r237Q366
$$ 888 8058 6960 5301 4292 -1512 -9815 -4925 553 2967 4325 4808 2460 589 -8648 -282
7127b82K500m088o731p388k482J815j467K244N612M237J286J325J745J9J696J5207
$$ -282 2218 -1870 -8601 -15989 -18471 -16656 -18123 -15879 -10267 -6030 -4744 -3419 -1674 -1655 41 15248
7111A5248l463r632m937p1R847j6655j3913J184P594J0564N471k907R864p57l808
$$ 15248 11785 2153 -2784 -2855 6992 -9663 -23576 -22392 -14798 -4234 1237 -1670 8194 7437 3629
7096C629L674m652j752J384N081j631j589j356o126p79m242M090J881j823K554
$$ 3629 7303 2651 899 2283 7364 5733 4144 2788 -3338 -4117 -8359 -4269 -2388 -4211 -1657
7081a657O966k960j3642K366O665M801M877j0382l847k23k60N892J742o685l052
$$ -1657 5309 2349 -11293 -8927 -2262 2539 7416 -2966 -6813 -7036 -7296 -1404 338 -6347 -9399
7066i399L181L825j176J0545J513j0300k926O257p383j831M156N617J157J728
$$ -9399 -6218 -2393 -3569 6976 8489 -1811 -4737 1520 -5863 -7694 -3538 2079 3236 4964
7052D964Q594R98q921n477M994N588l020j0023p730O80K376K999L189K516k172
$$ 4964 13558 14556 5635 158 5152 10740 7720 -2303 -10033 -9353 -6977 -3978 -789 1727 -445
7037d45O347J357k203K10m658j1728L50K892M819Q740m964N339M537j1043r412
$$ -445 5902 7259 5056 5266 608 -11120 -10770 -7878 -3059 5681 717 6056 10593 -450 -9862
7022i862o44l360L19J5845K482o385l440L468j881n288N060R447m547o574k993
$$ -9862 -10506 -13866 -13547 2298 4780 -1605 -5045 -1577 -3458 -8746 -3686 5761 1214 -5360 -8353
7007h353J0829O854m140j741L351k903j864L355m905k930J445n673J902j050O50
$$ -8353 2476 9330 5190 3449 6800 3897 2033 5388 483 -2447 -1002 -6675 -4773 -5823 -5173
6992e173R313O704N615R47k300j779n459r423o516J634J0912j925n347O063Q292
$$ -5173 4140 10844 16459 17406 15106 13327 7868 -1555 -8071 -6437 4475 2550 -2797 3266 11558
6977A1558R99J627m651o449k217l287p794Q128O19L749k398J064o884j869P195
$$ 11558 12557 14184 9533 3084 867 -2420 -10214 -2086 -1467 2282 -116 948 -5936 -7805 -610
6962f10J203m780M878j525L926P055o367O78P216k695r498J108M391K46o504j4016
$$ -610 593 -4187 691 -834 3092 10147 3780 4458 11674 8979 -519 589 4980 5226 -1278 -15294
6946a5294q274Q760P796L695j364j280j971P425k815l203m786j018P311Q032j913
$$ -15294 -23568 -14808 -7012 -3317 -4681 -5961 -7932 -507 -3322 -6525 -11311 -12329 -5018 3014 1101
6931A101L591M881L367k608n780K751L829o652j1766m287J471R437M391p01P347
$$ 1101 4692 9573 12940 10332 4552 7303 11132 4480 -7286 -11573 -10102 -665 3726 3025 10372
6916A0372o375q802j083J2024j552K326O20o347K002K488o210j419L456P905M73
$$ 10372 3997 -4805 -5888 6136 4584 6910 7530 1183 3185 5673 -537 -1956 1500 9405 9878
6901I878j82J838L545N96n541r348k64K478q6J858P379N549M13j670q878r740
$$ 9878 9696 11534 15079 15675 10134 786 522 3000 2914 4772 12151 17700 18113 16443 7565 -2175
6885b175r574N711q95O616R65r128N453K0202K788q453k232l049n736L322M278
$$ -2175 -11749 -6038 -6933 -317 648 -8480 -3027 17175 19963 11510 9278 6229 493 3815 8093
6870H093L08K261K051j76l847n608l794J0118p593J534j148m635l356P548P592
$$ 8093 8401 10662 12713 12537 8690 3082 -712 9406 1813 3347 2199 -2436 -5792 1756 9348
6855I348r89p025p587q082Q000R227l923K464k754m078k273k770k670K333K605
$$ 9348 8359 1334 -6253 -14335 -6335 2892 -1031 1433 -1321 -5399 -7672 -10442 -13112 -10779 -8174
6840h174L542r098j020M276L627L246j327m728j845m00N57l680J256m326J666
$$ -8174 -4632 -13730 -14750 -10474 -6847 -3601 -4928 -9656 -11501 -11901 -11344 -15024 -13768 -18094 -16428
6825a6428O63l291p91P288l051o03R328Q416p842j783L727M387K80j96l43n062
$$ -16428 -15765 -19056 -19847 -12559 -15610 -16213 -6885 1531 -6311 -8094 -4367 20 300 104 -239 -5301
6809e301p403l596O376L065L678P203j95J44K132N647M614M503l508n814j2926
$$ -5301 -12704 -16300 -9924 -6859 -3181 4022 3827 3971 6103 11750 16364 20867 17359 11545 -1381
6794a381N19o587Q800j194p109L362Q364M066q916p597l11JM015J173l884J002
$$ -1381 -862 -7449 1351 157 -6952 -3590 4774 8840 -76 -7673 -7984 -7983 -3968 -2795 -6679 -5677
6778e677Q701P045K202l353N10j2283j772N706l587j8079n019L835k18Q395R840
$$ -5677 3024 10069 12271 8918 9428 -2855 -4627 1079 -2508 -20587 -25606 -21771 -21989 -13594 -3754
6763c754J879m32m091j530m447M379R093K81q53l045L847j483n482J798N284M376
$$ -3754 -1875 -2307 -6398 -7928 -12375 -7996 1097 1378 525 -2520 1327 -156 -5638 -3840 1444 5820
6747E820J400k421p744o8L777l560j673J42l936M392P164n729R29J967L00j387
$$ 5820 7220 4799 -2945 -3013 764 -2796 -4469 -4327 -8263 -3871 3293 -2436 -1507 460 760 -627
6731f27M390J3042M00q356l010J1142m237k786k722p814l264P477q023q983n630
$$ -627 3763 16805 17205 8849 5839 16981 12744 9958 7236 -578 -3842 3635 -4388 -13371 -19001
6716a9001L834N681M613R955o539n145j187J1786J200m809J517j25j755N524L008
$$ -19001 -15167 -9486 -4873 5082 -1457 -6602 -7789 3997 5197 388 1905 1780 25 5549 8557
6701H557l495k563k459J178k21K67k194n128J405N645K445J504L055j470j634
$$ 8557 5062 2499 40 1218 997 1264 -930 -6058 -4653 992 3437 4941 7996 6526 4892
6686D892l394L827m005o044P177m62N742k943p965j699j446Q780Q310j0m653m948
$$ 4892 1498 5325 1320 -4724 2453 1991 7733 4790 -3175 -4874 -6320 2460 10770 10760 6107 1159
6670A159l384O897K409m859q658R414J1231J972q468j781J999k82K149p518n037
$$ 1159 -2225 4672 7081 2222 -6436 2978 14209 16181 7713 5932 7931 7649 9798 2280 -2757
6655b757j963M55R31m455K816J331l166J701k805J510j037j197k790Q329n501
$$ -2757 -4720 -4265 -3334 -7789 -4973 -3642 -6808 -5107 -7912 -6402 -7439 -8636 -11426 -3097 -8598
6640h598l223O16L278O684L252m011m594l358Q688j21l55L838m207n857L655K714
$$ -8598 -11821 -11205 -7927 -1243 2009 -2002 -6596 -9954 -1266 -1387 -1742 2096 -2111 -7968 -4313 -1599
6624a599N48O829j276m486L594j173j1064M546M419R791n998j776k463m06O970
$$ -1599 -1051 5778 4502 16 3610 2437 -8627 -4081 338 10129 4131 2355 -108 -514 6456
6609F456N41o190l597Q936j1041k097K779j401R17J944L100N573m951q850L032
$$ 6456 6997 807 -2790 6146 -4895 -6992 -4213 -5614 -4697 -2753 347 5920 969 -7881 -4849
6594d849J1815J0136J656o456j0312o477m282J1379j071j588M25k751j932k695
$$ -4849 6966 17102 18758 12302 1990 -4487 -8769 2610 1539 -49 376 -2375 -4307 -7002
6580g002N365N215l13o825n322j2447j784N435J0051N767k759J15k746J424p167
$$ -7002 -1637 3578 3265 -3560 -8882 -21329 -23113 -17678 -7627 -1860 -4619 -4504 -7250 -5826 -12993
6565a2993o170M369O343J452R180o85J771j273k827l278L696j166K876k344o608
$$ -12993 -19163 -14794 -8451 -6999 2181 1496 3267 1994 -833 -4111 -415 -1581 1295 -1049 -7657
6550g657N333M748l462K844n863q736L645R197k562l286K348L025j1882R00R631
$$ -7657 -2324 2424 -1038 1806 -4057 -12793 -9148 49 -2513 -5799 -3451 -426 -12308 -11408 -1777
6535a777j609O299O882K984m86o440m155J503P268L812L952p45j123p567p418
$$ -1777 -3386 2913 9795 12779 12293 5853 1698 3201 10469 14281 18233 17488 16365 8798 1380
6520A380k015m275j2556J71M624O590M134j911o746n664l740K411M529J845J0472
$$ 1380 -635 -4910 -17466 -17295 -12671 -6081 -1947 -3858 -10604 -16268 -20008 -17597 -13068 -11223 -751
6505g51P435j0368j767M16k686K267m254m109n793k376Q92j303l112J3330J4974
$$ -751 6684 -3684 -5451 -5035 -7721 -5454 -9708 -13817 -19610 -21986 -21094 -22397 -25509 -12179 2795
6490B795R10p466m368P896p43j0022P525N869R315N1q980M059P465N393m755o085
$$ 2795 3705 -3761 -8129 -233 -976 -10998 -3473 2396 11711 11762 2782 6841 14306 19699 14944 8859
6474H859j1451n022J2120R00m768j190n817k240M735O043k671r361n824l578N564
$$ 8859 -2592 -7614 4506 5406 638 -552 -6369 -8609 -3874 2169 -502 -9863 -15687 -19265 -13701
6459a3701P166P561n24o622l395L253N830K929M691M480r972j297M885k04l658
$$ -13701 -6535 1026 502 -6120 -9515 -6262 -432 2497 7188 11668 1696 399 5284 5080 1422
6444A422L238k543L52N501J899j1104k952P37M325l165m970j594R180L128l596
$$ 1422 4660 2117 2469 7970 9869 -1235 -4187 -3450 875 -2290 -7260 -8854 326 3454 -142
6429a42J456O590n375l331k92m926o08m800P653N120Q287j318n661k713N641K366
$$ -142 1314 7904 2529 -802 -1094 -6020 -6628 -11428 -3775 1345 9632 8314 2653 -60 5581 7947
6413G947O416k0m717o586m675k615j418M401j73O103n394j9963J02P217J2606
$$ 7947 14363 14343 9626 3040 -1635 -4250 -5668 -1267 -1440 4663 -731 -20694 -20592 -13375 -769
6398g69O961R820l655n511L20P978P85n180m819K553K67r775j0384P336Q7J448
$$ -769 6192 16012 12357 6846 7166 15144 15929 10749 5930 8483 8750 -1025 -11409 -4073 -3986 -2538
6382b538n042o55K014l708o67Q416o865j064L51N088R606M188m051R635o244j1116
$$ -2538 -7580 -8235 -6221 -9929 -10596 -2180 -9045 -10109 -9758 -4670 4936 9124 5073 14708 8464 -2652
6366b652m745N909N968Q1l725l983k379P112O1m249k801j1L218M574L378o956
$$ -2652 -7397 -1488 4480 4561 836 -3147 -5526 1586 1647 -2602 -5403 -5414 -2196 2378 5756 -1200
6350a200n850m022K505K828k955P800M967Q1j426k037k281n308j0125j156J398
$$ -1200 -7050 -11072 -8567 -5739 -8694 -894 4073 4154 2728 691 -1590 -6898 -17023 -18179 -16781
6335a6781Q370L018j158j547L138N952o325p545Q632J1849K980o097J905k525
$$ -16781 -8411 -5393 -6551 -8098 -4960 992 -5333 -12878 -4246 7603 10583 4486 6391 3866
6321C866k775o087J3374J519m864M394N180m446L414n92r701l766n197J166m442
$$ 3866 1091 -4996 8378 9897 5033 9427 14607 10161 13575 12983 3282 -484 -5681 -4515 -8957
6306h957j040m169j488L764K120N597J1473R71o045k060K419o892k225J181M161
$$ -8957 -9997 -14166 -15654 -11890 -9770 -4173 7300 8271 2226 166 2585 -4307 -6532 -5351 -1190
6291a190l535R313Q938j2809n876r191M0K690r289j2738J1134K4546Q881j7317
$$ -1190 -4725 4588 13526 717 -5159 -14350 -14310 -11620 -20909 -33647 -22513 2033 10914 -6403
6277f403m633k838k862M64k734K131J0612P443M384M674k197k920K361n41J201
$$ -6403 -11036 -13874 -16736 -16272 -19006 -16875 -6263 1180 5564 10238 8041 5121 7482 6941 8142
6262H142k703n540O328K247k76m903k80J000K595m47q517r421k367m827j1557
$$ 8142 5439 -101 6227 8474 8198 3295 3015 4015 6610 6163 -2354 -11775 -14142 -18969 -30526
6247c0526N815J2515j42q50J1636Q091j42o469J47N429k293k755q110O38L641
$$ -30526 -24711 -12196 -12338 -13188 -1552 6539 6397 -72 75 5504 3211 456 -7654 -7016 -3375
6232c375o07N974J992j0768n534P851m211P641p74k968M648J623p665q970R693
$$ -3375 -3982 1992 3984 -6784 -12318 -4467 -8678 -1037 -1811 -4779 -131 1492 -6173 -15143 -5450
6217e450l622o307j590m883J07J1306J367k4j0266J1465J0443q438j0055O429
$$ -5450 -9072 -15379 -16969 -21852 -21745 -10439 -9072 -9096 -19362 -7897 2546 -5892 -15947 -9518
6203i518L115l740m881Q937P622n188R66J406N893k729k143O95j952K769O141
$$ -9518 -6403 -10143 -15024 -6087 1535 -3653 -2687 -1281 4612 1883 -260 435 -1517 1252 7393
6188G393N146r172p272r80o31m981l515R400P813K314q092m069M668m702J721
$$ 7393 12539 3367 -3905 -4885 -5516 -10497 -14012 -4612 3201 5515 -2577 -6646 -1978 -6680 -4959
6173d959K927O506P952J4387j446m025q430j126j999l371m844p383n300k026Q227
$$ -4959 -2032 4474 12426 26813 25367 21342 12912 11786 9787 6416 1572 -5811 -11111 -13137 -4910
6158d910J286o000o294p247p209j576O292O525o272J6208K3982Q932j332l1111
$$ -4910 -3624 -9624 -15918 -23165 -30374 -31950 -25658 -19133 -25405 -9197 14785 23717 22385 -8726
6144h726r705O788o2r838k049L683o282M515p7r29O701J1205N880J463p3J4797
$$ -8726 -18431 -11643 -11705 -21543 -23592 -19909 -26191 -21676 -21753 -22682 -15981 -4776 1104 2567 2494 17291
6128A7291m051j0657p636q229M414O388j473J13K214o148l514r605k039N663M338
$$ 17291 13240 2583 -5053 -13282 -8868 -2480 -3953 -3840 -1626 -7774 -11288 -20893 -22932 -17269 -12931
6113a2931N487l710J2493O432k118l58j406K495k727p259M023P929o620l120L075
$$ -12931 -7444 -11154 1339 7771 5653 5295 3889 6384 3657 -3602 421 8350 1730 -1390 1685
6098A685m982q912M522M563m635q78M426M33r82p850M491J7739m650r888o686
$$ 1685 -3297 -12209 -7687 -3124 -7759 -8637 -4211 -3778 -4760 -12610 -8119 9620 4970 -4918 -11604
6083a1604n857l274N041J1442P844J028j0040q777J5622Q546q322J649O609M167
$$ -11604 -17461 -20735 -15694 -4252 3592 4620 -5420 -14197 1425 9971 1649 3298 9907 14074
6069A4074p841k798P178l247m930l898M256Q533m415P029R013j7413j4397P13
$$ 14074 6233 3435 10613 7366 2436 -1462 2794 11327 6912 13941 22954 5541 -8856 -8143
6055h143l395M773N115j706l883l578k24P939l650j274m651n808m385J629Q953
$$ -8143 -11538 -6765 -1650 -3356 -7239 -10817 -11041 -3102 -6752 -8026 -12677 -18485 -22870 -21241 -12288
6040a2288O954J2977O066k038m590j667L114M253n263J742l098o723n308J790
$$ -12288 -5334 7643 13709 11671 7081 5414 8528 12781 7518 9260 6162 -561 -5869 -4079
6026d079j744j303K792N339P549o708j1834j253N989j412J574J927m401N850k685
$$ -4079 -5823 -7126 -4334 1005 8554 1846 -9988 -11241 -5252 -6664 -5090 -3163 -7564 -1714 -4399
6011d399j309P967l822j436m140J649n272m028K751N984j525m773K626Q154Q779
$$ -4399 -5708 2259 -1563 -2999 -7139 -5490 -10762 -14790 -12039 -6055 -7580 -12353 -9727 -1573 7206
5996G206o363K122k038J473P100l08r060l94o88q447O453J027q015P702K05o12
$$ 7206 843 2965 927 2400 9500 9192 132 -262 -950 -9397 -2944 -1917 -9932 -2230 -2025 -2637
5980b637O573k244j8214p558o215R361M885J7235L915L148j0322j768M026m349
$$ -2637 3936 1692 -16522 -24080 -30295 -20934 -16049 1186 5101 8249 -2073 -3841 185 -4164
5966d164n956l740r571L292P52M700J4305L371j885N201K734J734o069j4320m184
$$ -4164 -10120 -13860 -23431 -20139 -19387 -14687 -382 2989 1104 6305 9039 10773 4704 -9616 -13800
5951a3800Q173O293o835n237j434j418J2318O849m636k350J214M907R586j341
$$ -13800 -5627 666 -6169 -11406 -12840 -14258 -1940 4909 273 -2077 -863 4044 13630 12289
5937A2289l274o396k359q463l489n289N308O646R945J754l059M667K932m062r673
$$ 12289 9015 2619 260 -8203 -11692 -16981 -11673 -5027 4918 6672 3613 8280 11212 7150 -2523
5922b523J68J0774K537n281r039m108J9200O388M373l228j4460q163n349j1062
$$ -2523 -2355 8419 10956 5675 -3364 -7472 11728 18116 22489 19261 4801 -3362 -8711 -19773
5908a9773K72P785K869j554J906J1938R781m289p278p216L272m446L08J93l405
$$ -19773 -19501 -11716 -8847 -10401 -8495 3443 13224 8935 1657 -5559 -2287 -6733 -6425 -6232 -9637
5893i637j476p243L297j44L251P085j92K570L756M65p360O915m14n394L91J0868
$$ -9637 -11113 -18356 -15059 -15203 -11952 -4867 -5059 -2489 1267 1732 -5628 1287 873 -4521 -4130 6738
5877F738K985j0625n587n083J930K225M384M324j0328p787K065O644M970K973
$$ 6738 9723 -902 -6489 -11572 -9642 -7417 -3033 1291 -9037 -16824 -14759 -8115 -3145 -172
5863a72O91J31m686q426o269J780P451J2136M72J779N217K859j068k956j0724
$$ -172 519 650 -4036 -12462 -18731 -16951 -9500 2636 3108 4887 10104 12963 11895 8939 -1785
5848a785n280l652n977m961J857O86N801P288J113q028q799n698J2684M281K221
$$ -1785 -7065 -10717 -16694 -21655 -19798 -19112 -13311 -6023 -4910 -12938 -21737 -27435 -14751 -10470 -8249
5833h249K269j969O65M8L047L370m525o021L151j1127o275Q895K860M961M972
$$ -8249 -5980 -7949 -7284 -7236 -4189 -819 -5344 -11365 -8214 -19341 -25616 -16721 -13861 -8900 -3928
5818c928J0098P158P10k720Qr536j1490o54k935j442L836N415n650n144O84J0157
$$ -3928 6170 13328 14038 11318 11326 1790 -9700 -10354 -13289 -14731 -10895 -5480 -11130 -16274 -15590 -5433
5802e433j518p171Q104M304O66p18m230n805N775m954O642J0853l304o50Q366
$$ -5433 -6951 -14122 -6018 -1714 -1048 -1766 -5996 -11801 -6026 -10980 -4338 6515 3211 2561 10927
5787A0927P792j5947r855P163J0898K814m829j0493L179N975n832O87N967O312
$$ 10927 18719 2772 -7083 80 10978 13792 8963 -1530 1649 7624 1792 2479 8446 14758
5773A4758o96r132n277L607o8m914K665K956o972r509J309J2561J1765K801O21
$$ 14758 14062 4930 -347 3260 3192 -1722 943 3899 -3073 -12582 -11273 1288 13053 15854 16475
5758A6475L008m417k350l366n545J2956K131j1824n777j563l59p381p866O634
$$ 16475 19483 15066 12716 9350 3805 16761 18892 7068 1291 -272 -631 -8012 -15878 -9244
5744i244N574n792L83L853o680l991o207P66Q95P031P863m946J008l322j523J724
$$ -9244 -3670 -9462 -9079 -5226 -11906 -15897 -22104 -21338 -20443 -13412 -5549 -10495 -9487 -12809 -14332 -12608
5728a2608N129M642N28q232m910N436J2438J470j0044p255N583M828O963j038
$$ -12608 -7479 -2837 -2309 -10541 -15451 -10015 2423 3893 -6151 -13406 -7823 -2995 3968 2930
5714B930J733K568n693j0883K960L421K484J0325P096q706j2619j1889N082J0451
$$ 2930 4663 7231 1538 -9345 -6385 -2964 -480 9845 16941 8235 -4384 -16273 -11191 -740
5700g40L600q512k846L408j293m957n20m430N737J3123n674r01P18k083K60M40
$$ -740 2860 -5652 -8498 -5090 -6383 -11340 -11860 -16290 -10553 2570 -3104 -4005 -3287 -5370 -5110 -4670
5684d670k359L231L886j3767Q347L552L409J124N686K029k444n62K626M822j5357
$$ -4670 -7029 -3798 88 -13679 -5332 -1780 1629 2753 8439 10468 8024 7462 10088 14910 -447
5669d47o113R253o688q569K255M407M168n720j2430k383Q87L580K293K220J379
$$ -447 -6560 2693 -3995 -12564 -10309 -5902 -1734 -7454 -19884 -22267 -21380 -17800 -15507 -13287 -11908
5654a1908K352j566L778K644R566K334k548l639p510p623M523J939n370R120M249
$$ -11908 -9556 -11122 -7344 -4700 4866 7200 4652 1013 -6497 -14120 -9597 -7658 -13028 -3908 341
5639C41q879m901O598J1074P546p243n050K502J947p644l853J085J0167K681l641
$$ 341 -8538 -13439 -6841 4233 11779 4536 -514 1988 3935 -3709 -7562 -6477 3690 6371 2730
5624B730K170p751J103l771k629j260N402j947k587j380m225p811J64k280L154
$$ 2730 4900 -2851 -1748 -5519 -8148 -9408 -4006 -5953 -8540 -9920 -14145 -21956 -21792 -24072 -20918
5609b0918N09O51R084O106L176m072n197q27L689l158J0794j685p12k460J461
$$ -20918 -20409 -19758 -10674 -4568 -1392 -5464 -10661 -11488 -7799 -10957 -163 -1848 -2560 -5020 -3559
5594c559J21P966K960j152r384K911O554L776L041j0240j1739j231l896l564m944
$$ -3559 -3438 4528 7488 6336 -3048 -137 6417 10193 13234 2994 -8745 -9976 -13872 -17436 -22380
5579b2380N33J2491L476L315J632p02Q171K165k366l600L234K43q55j184m780
$$ -22380 -21847 -9356 -5880 -2565 -933 -1635 6536 8701 6335 2735 5969 6212 5357 4173 -607
5564f07j374l614K474j3177L481N161J113J6M359N416j1006R319Q647j125p182
$$ -607 -1981 -5595 -3121 -16298 -12817 -7656 -6543 -6527 -2168 3248 -7758 1561 10208 9083 1901
5549A901m76j066k655j1745j1057l177r18m14K76N963J2227R592Q19j397n160
$$ 1901 1425 359 -2296 -14041 -25098 -28275 -29193 -29607 -29331 -23368 -11141 -1549 -730 -2127 -7287
5534g287J158Q885P278j6228o809J690L661N290j216k676J148j982j910j862P251
$$ -7287 -6129 2756 10034 -6194 -13003 -11313 -7652 -2362 -3578 -6254 -5106 -7088 -8998 -10860 -3609
5519c609N471j659l112k5j437J303n454K807j026J812k185p094O199N624P463
$$ -3609 1862 203 -2909 -2934 -4371 -3068 -8522 -5715 -6741 -4929 -7114 -14208 -8009 -2385 5078
5504E078N186j6n32j520n566q853L572j2307m04o883M591J5465N542j296k944
$$ 5078 10264 10248 9716 8196 2630 -6223 -2651 -14958 -15362 -22245 -17654 -2189 3353 2057 -887
5489h87o578n543N045O151p44j2006m283M498P515P074p478q996N351K578N518
$$ -887 -7465 -13008 -7963 -1812 -2556 -14562 -18845 -14347 -6832 242 -7236 -16232 -10881 -8303 -2785
5474b785L144J0939o679j1931r872K850R488N725j161J520L235P033K450r756
$$ -2785 359 11298 4619 -7312 -17184 -14334 -4846 879 -282 1238 4473 11506 13956 4200
5460D200O37R94P25l937r814j1071r59k414P400L337p35k924q173l732R093Q727
$$ 4200 4837 5831 6556 2619 -7195 -18266 -19225 -21639 -14239 -10902 -11637 -14561 -22734 -26466 -17373 -8646
5444h646n324O722N053n4J31J855j049j3279R380l70m880K994p643J493P241R341
$$ -8646 -13970 -7248 -2195 -2249 -2118 -263 -1312 -14591 -5211 -5581 -10461 -7467 -15110 -13617 -6376 2965
5428B965o778L815K637j973J895n727m929L000J0744P96n329M457R55L024o015
$$ 2965 -3813 2 2639 666 2561 -3166 -8095 -5095 5649 6445 1116 5573 6528 9552 3537
5413C537q026o597N872J465M29O564J833J621m942O127J521M992k65j0664q773
$$ 3537 -4489 -11086 -5214 -3749 -3320 3244 5077 6698 1756 7883 9404 14396 14131 3467 -5306
5398e306O20N409k392L314n218Q041J629m02k91r460j1189k438J84N939k443k662
$$ -5306 -4686 723 -1669 1645 -3573 4468 6097 5695 5404 -4056 -15245 -17683 -17499 -11560 -14003 -16665
5382a6665L004K321P682J1994o266m281O32l130Q57q481P859N388l749p202J243
$$ -16665 -13661 -11340 -3658 8336 2070 -2211 -1579 -4709 -3852 -12333 -4474 914 -2835 -10037 -8794
5367h794P954N040m382l859J961k375O568O835j609j575n056K612n441l330q491
$$ -8794 -840 4200 -182 -4041 -2080 -4455 2113 8948 7339 5764 708 3320 -2121 -5451 -13942
5352a3942j986L954J1822J1972L093n452K13J0356K972r053q46k700j4860j4666
$$ -13942 -15928 -11974 -152 11820 14913 9461 9674 20030 23002 13949 13103 10403 -4457 -19123
5338a9123L888P627J000q728O039N846r523K68L083q414k57J8339K876R56K096
$$ -19123 -15235 -7608 -6608 -15336 -9297 -3451 -12974 -12706 -9623 -18037 -18294 45 2921 3877 5973
5323E973j719k610j1381q004L362J3793L777m51M133k92J029L45Q90M774r866
$$ 5973 4254 1644 -9737 -17741 -14379 -586 3191 2740 6873 6581 7610 7955 8845 13619 3753
5308C753o433O62m738L356r468j376O940J125N053l02R175j29n293n717m413P55
$$ 3753 -2680 -2018 -6756 -3400 -12868 -14244 -7304 -6179 -1126 -1428 7747 7618 2325 -3392 -7805 -7050
5292g050J986L322j037p421L952k679Q530L634N79j064J756L354l943r411k395
$$ -7050 -5064 -1742 -2779 -10200 -6248 -8927 -397 3237 3816 2752 4508 7862 3919 -5492 -7887
5277g887Q961k598L677J0626K531j6586j2469K769J0126n48k859l834j0272l895
$$ -7887 1074 -1524 2153 12779 15310 -1276 -13745 -10976 -850 -1398 -4257 -8091 -18363 -22258
5263b2258J435p033R75L935M006K400N528k867n877m792J887K21N685J0635N182
$$ -22258 -20823 -27856 -26881 -22946 -18940 -16540 -11012 -13879 -19756 -24548 -22661 -22440 -16755 -6120 -938
5248i38P608J492J726L43o456k671p836L884K0633Rq418r183p311p791j305N194
$$ -938 6670 8162 9888 10231 3775 1104 -6732 -2848 17785 17794 9376 193 -7118 -14909 -16214 -11020
5232a1020K005j651k770L225o799l817N220K66Q23P882J2123L05n957n146o332
$$ -11020 -9015 -10666 -13436 -10211 -17010 -20827 -15607 -15341 -14518 -6636 5487 5792 -165 -5311 -11643
5217a1643K060L414M824o731L511l938j671O388N153L299J283M210Q10j31K132
$$ -11643 -9583 -6169 -1345 -8076 -4565 -8503 -10174 -3786 1367 4666 5949 10159 10969 10838 12970
5202A2970j385l300j0229O679M810O003j4322j8556K758R388k461Q158J974j488
$$ 12970 11585 8285 -1944 4735 9545 15548 1226 -17330 -14572 -5184 -7645 513 2487 999
5188I99o580j3339o906K884J157r789L112J7791Q677k256j513R018K64Q106M440
$$ 999 -5581 -18920 -25826 -22942 -21785 -31574 -28462 -10671 -1994 -4250 -5763 3255 3519 11625 16065
5173A6065l882n750M234L340p937q035J085j303p80N475L232r747o257l686J741
$$ 16065 12183 6433 10667 14007 6070 -1965 -880 -2183 -2963 2512 5744 -4003 -10260 -13946 -12205
5158a2205N159n141j0378J134n141J694J9082J1107k267L435j214j989j675N866
$$ -12205 -7046 -12187 -22565 -21431 -26572 -24878 -5796 5311 3044 6479 5265 3276 1601 7467
5144G467j532J665N271L38l241P124l742q258j908o763L816P867M426M576j2168
$$ 7467 5935 7600 12871 13209 9968 17092 13350 5092 3184 -3579 237 8104 12530 17106 4938
5129D938j1450m743n548L631M792Q777K80q186J41L546J1593r0R90l847j2444
$$ 4938 -6512 -11255 -16803 -13172 -8380 397 677 -7509 -7368 -3822 7771 7681 8671 4824 -7620
5114g620p649M12P790L961N455P457K329N46p812l682l71q90J302o682j0715j023
$$ -7620 -15269 -14857 -7067 -3106 2349 9806 12135 12681 4869 1187 816 -74 1228 -5454 -16169 -17192
5098a7192l296L457r6n06M810M944m815M322K010J170Q38R878J880o179p779J436
$$ -17192 -20488 -17031 -17127 -17633 -12823 -7879 -12694 -8372 -6362 -5192 -4354 5524 7404 1225 -6554 -5118
5082e118N56j331K886n211j408r304K377K869Q980J3141K594M325P159m807n150
$$ -5118 -4562 -5893 -3007 -8218 -9626 -18930 -16553 -13684 -4704 8437 11031 15356 22515 17708 12558
5067A2558n746m825l415J638L978n49k864j0885N029P130J306q692Q82n830k736
$$ 12558 6812 1987 -1428 210 4188 3639 775 -10110 -5081 2049 3355 -5337 -4455 -10285 -13021
5052a3021N486O518N230k114j115k959J408K93j042k18l480o920J221N466J332
$$ -13021 -7535 -1017 4213 2099 984 -1975 -567 -274 -1316 -1534 -5014 -11934 -10713 -5247 -3915
5037c915O082j834J314m750n514j521n15K965Q996K147j0130q752J528K165J595
$$ -3915 2167 333 1647 -3103 -8617 -10138 -10653 -7688 1308 3455 -6675 -15427 -13899 -11734 -10139
5022a0139Q796L529j1658k212O639J827q021N356J852K668m607q528N15O785l650
$$ -10139 -1343 2186 -9472 -11684 -5045 -3218 -11239 -5883 -4031 -1363 -5970 -14498 -13983 -7198 -10848
5007a0848m320l661p876J005M030J2720N294N463l89n972l646l80K430J044M301
$$ -10848 -15168 -18829 -26705 -25700 -21670 -8950 -3656 1807 1418 -4554 -8200 -8580 -6150 -5106 -805
4992h05K157m048M450o10k21P23M419j273o867o801M50r243q37Q923N244Q015
$$ -805 1352 -2696 1754 1144 923 1646 6065 4792 -2075 -8876 -8426 -17669 -18506 -9583 -4339 3676
4976C676J866l983o8J1437j0019m788j381n709L393N240L910l836J378J1318Q409
$$ 3676 5542 1559 1491 12928 2909 -1879 -3260 -8969 -5576 -336 3574 -262 1116 12434 20843
4961B0843n546j1044p103r192R721P265m129l318P30k507J845k484l373L265K396
$$ 20843 15297 4253 -2850 -12042 -2321 4944 815 -2503 -1773 -4280 -2435 -4919 -8292 -5027 -2631
4946b631L530O516J567m35r723j5749j3611K520J1142O298o04P711N976n419l347
$$ -2631 899 7415 8982 8547 -1176 -16925 -30536 -28016 -16874 -10576 -11180 -3469 2507 -2912 -6259
4931f259M482k697N128K443p913j3793K775P043N688N926l312q191J2952N546
$$ -6259 -1777 -4474 654 3097 -4816 -18609 -15834 -8791 -3103 2823 -489 -8680 4272 9818
4917I818J848M415p605j553k696j1612J158o90K402j380P164Q63j80M233N670
$$ 9818 11666 16081 8476 6923 4227 -7385 -6227 -6917 -4515 -5895 1269 2132 1952 6185 11855
4902A1855O771j920j0772j906L109K860l8m623M596j2237L92O841K196o2j072
$$ 11855 18626 16706 5934 4028 7137 9997 9959 5336 9932 -2305 -1913 4928 7124 7062 5990
4887E990l242n717J692J784K708n090r215p657M898m895j589N437L039K949J030
$$ 5990 2748 -2969 -1277 507 3215 -1875 -11090 -18747 -13849 -18744 -20333 -14896 -11857 -8908 -7878
4872g878q176n56R51p047R965M521Q103P278L812Q594l482r412k479O694n927
$$ -7878 -16054 -16610 -15659 -22706 -12741 -8220 -117 7161 10973 19567 16085 6673 4194 10888 4961
4857D961J837l541q403J399L298M737j363J536m477l994K57R922L718n434k525
$$ 4961 6798 3257 -5146 -3747 -449 4288 2925 4461 -16 -4010 -3753 6169 9887 4453 1928
4842A928l534p395J023P246J6948K208k326j854j1037r118l039q988j819M768
$$ 1928 -1606 -9001 -7978 -732 16216 18424 16098 14244 3207 -5911 -8950 -17938 -19757 -14989
4828a4989K901K754R692j579p129k199J064m892N627J1158l867L333O027j0025
$$ -14989 -12088 -9334 358 -1221 -8350 -10549 -9485 -14377 -8750 2408 -1459 1874 7901 -2124
4814b124r77j720R05O034Q869m988n738P32k992o667J289k62O979J0494K621J604
$$ -2124 -3101 -4821 -3916 2118 10987 5999 261 993 -1999 -8666 -7377 -7639 -660 9834 12455 14059
4798A4059J686J2864l798k285L61K35j1773n904J3567L285j5783p920k382p707
$$ 14059 15745 28609 24811 22526 22887 23122 11349 5445 19012 22297 6514 -1406 -3788 -11495
4784a1495L427L580j179k11n186m914o764N757J3862j169N464P209J0250l330
$$ -11495 -8068 -4488 -5667 -5878 -11064 -15978 -22742 -16985 -3123 -4292 1172 8381 18631 15301
4770A5301p414m255k221N430o003q62P084k102j097j005j635j423r0K184j0285
$$ 15301 7887 3632 1411 6841 838 -24 7060 4958 3861 2856 1221 -202 -292 1892 -8393
4755h393m123M354k741O542J996o859m807L904N617J0938q648q009n333N145M419
$$ -8393 -12516 -8162 -10903 -4361 -2365 -9224 -14031 -10127 -4510 6428 -2220 -10229 -15562 -10417 -5998
4740e998o403j814l9o479Q22J642k626Q071M630J053n989J400P450J797L548p896
$$ -5998 -12401 -14215 -14254 -20733 -19911 -18269 -20895 -12824 -8194 -7141 -13130 -11730 -4280 -2483 1065 -6831
4724f831J205L15K986N767L78l240R931j993n208P166M672p736q184l283K630
$$ -6831 -5626 -5311 -2325 3442 3820 580 10511 8518 3310 10476 15148 7412 -772 -4055 -1425
4709a425P908Q091q285m421M432J1082r718j2565p724L229j841J563J069J950
$$ -1425 6483 14574 6289 1868 6300 17382 7664 -4901 -12625 -9396 -11237 -9674 -8605 -6655
4695f655j708N359L965O586L614K046n280m658N654O730r690j5479J214q126l183
$$ -6655 -8363 -3004 961 7547 11161 13207 7927 3269 8923 15653 5963 -9516 -8302 -16428 -19611
4680a9611M063M888P23m792K710J471K611J612L757Q496L558p271r08k882J989
$$ -19611 -15548 -10660 -9937 -14729 -12019 -10548 -7937 -6325 -2568 5928 9486 2215 1307 -1575 414
4665D14q067m218J2982J0288m053m26p978m309P679L761q202n467M020L763K649
$$ 414 -7653 -11871 1111 11399 7346 6920 -1058 -5367 2312 6073 -2129 -7596 -3576 187 2836
4650B836N55l683M314P066J363l412j1769K009q684n63k792J658j822N748o56
$$ 2836 3391 -292 4022 11088 12451 9039 -2730 -721 -9405 -9968 -12760 -11102 -12924 -7176 -7832
4635g832O480L173k965o215L777J2940O476l188j7980j4273L193K803K047q966
$$ -7832 -1352 1821 -1144 -7359 -3582 9358 15834 12646 -5334 -19607 -16414 -13611 -11564 -20530
4621b0530j925J1887N812q132M909j950j969M717K231N819P270p884r880j1005
$$ -20530 -22455 -10568 -4756 -12888 -7979 -9929 -11898 -7181 -4950 869 8139 255 -9625 -20630
4607b0630L137J1531J5951m716J79j3499o896j26n951Q706Q438L95L746N182q149
$$ -20630 -17493 -5962 9989 5273 5452 -8047 -14943 -15069 -21020 -12314 -3876 -3481 265 5447 -2702
4592b702J800J213n983k899p181n317K283J127P360Q917M227K844j576l305k058
$$ -2702 -902 311 -5672 -8571 -15752 -21069 -18786 -17659 -10299 -1382 2845 5689 4113 808 -1250
4577a250k592J264M472Q490p411l094l534P123m134L84L932r433j0199L384Q996
$$ -1250 -3842 -2578 1894 10384 2973 -121 -3655 3468 -666 -282 3650 -5783 -15982 -12598 -3602
4562c602j335p818j253n028L956J7566Q675j4435o727M671l000j422O562K452
$$ -3602 -4937 -12755 -14008 -19036 -15080 2486 11161 -3274 -10001 -5330 -8330 -9752 -3190 -738
4548g38n156k269L954m628K812P539P88m019l952L627M549J5302M609q826q589
$$ -738 -5894 -8163 -4209 -8837 -6025 1514 2302 -1717 -5669 -2042 2507 17809 22418 13592 5003
4533E003j0295n30O824j0762n117J5033J1279J607j3636r055Q237k5J964J0848
$$ 5003 -5292 -5822 1002 -9760 -14877 156 11435 13042 -594 -9649 -1412 -1437 527 11375
4519A1375j1347l031L749n616P732j817j999P018N866q1m006p050M645O456j493
$$ 11375 28 -3003 746 -4870 2862 1045 -954 6064 11930 11849 7843 793 5438 11894 10401
4504A0401j0800P79j206l509l072N618N980l952n563K603j585j848J78J1713L090
$$ 10401 -399 380 -826 -4335 -7407 -1789 4191 239 -5324 -2721 -4306 -6154 -5976 5737 8827
4489H827j080p628q401M930n18L593M498k741n558l685J349l493L684J827J1827
$$ 8827 7747 119 -8282 -3352 -3870 -277 4221 1480 -4078 -7763 -6414 -9907 -6223 -4396 7431
4474G431K268j1523K16R401K058l931o97m831O891m566m690J727k991l753K945
$$ 7431 9699 -1824 -1608 7793 9851 5920 5223 392 7283 2717 -1973 -246 -3237 -6990 -4045
4459d045J10m053N080P481K049l61j0038J300M076o222l172k158J396j315L970
$$ -4045 -3935 -7988 -2908 4573 6622 6261 -3777 -2477 1599 -4623 -7795 -9953 -8557 -9872 -5902
4444e902K445J399O627J94J502K466M335m225q691j831n902m345N56L864L999
$$ -5902 -3457 -2058 4569 4763 6265 8731 13066 8841 150 -1681 -7583 -11928 -11372 -7508 -3509
4429c509R595N291L572N03j195p070p129l736K623O54n777q058L665P306l182
$$ -3509 6086 11377 14949 15452 14257 7187 58 -3678 -1055 -401 -6178 -14236 -10571 -3265 -6447
4414f447k020M968k615J766J517L061O994K077J181j051l247r771j2554M395N128
$$ -6447 -8467 -3499 -6114 -4348 -2831 230 7224 9301 10482 9431 6184 -3587 -16141 -11746 -6618
4399f618lM146j169M287N812j429j952L324n143m433n014K827L199K243q113l153
$$ -6618 -6621 -2475 -3644 643 6455 5026 3074 6398 1255 -3178 -8192 -5365 -2166 77 -8036 -11189
4383a1189K235P662K253j722l912n663K496j210m293J4213M991j3010j1J948o360
$$ -11189 -8954 -1292 961 -761 -4673 -10336 -7840 -9050 -13343 870 5861 -7149 -7160 -5212 -11572
4368a1572j983J7648L297j715k029q645Q095O10j0934R95l789J577N180Q125N664
$$ -11572 -13555 4093 7390 5675 3646 -4999 3096 3706 -7228 -6233 -10022 -8445 -3265 4860 10524
4353A0524j1685n525Q63L504J202P746m553M3r353M772M003J148n209J477N619
$$ 10524 -1161 -6686 -5823 -2319 -1117 6629 2076 2119 -7234 -2462 1541 2689 -2520 -1043 4576
4338D576k014j5061j760O772Q368O401M042q930j0579N644J883O40J65n089j882
$$ 4576 2562 -12499 -14259 -7487 881 7282 11324 2394 -8185 -2541 -658 -18 147 -4942 -6824
4323f824R67m806j576k972N403O096P828Q21j0824m577J1629M447j889J484j156
$$ -6824 -5857 -10663 -12239 -15211 -9808 -3712 4116 4937 -5887 -10464 1165 5612 3723 5207 4051
4308D051n235j3802l393N156J6581O619q70J63M233J829n226j5571o532M541Q419
$$ 4051 -1184 -14986 -18379 -13223 3358 9977 9107 9270 13503 15332 10106 -5465 -11997 -7456 963
4293I63k211j1220K680J1358P64J149j0950p982j430N558K622N36o91N130K779
$$ 963 -1248 -12468 -9788 1570 2334 3483 -7467 -15449 -16879 -11321 -8699 -8163 -8854 -3724 -945
4278i45j714j0576q206M914P206M654j2545O302J3890J463m233p056m945J911
$$ -945 -2659 -13235 -21441 -16527 -9321 -4667 -17212 -10910 2980 4443 210 -6846 -11791 -9880
4264i880O07j416P380J951n318l738J395K918K054m786P36LK201m17K009n52N017
$$ -9880 -9273 -10689 -3309 -1358 -6676 -10414 -9019 -6101 -4047 -8833 -8097 -8094 -5893 -6310 -4301 -4853 164
4247A64P070R29m8n513j5124n141M435Q181j50p958m180J555M46k312M568J998
$$ 164 7234 8163 8115 2602 -12522 -17663 -13228 -5047 -5197 -13155 -17335 -15780 -15334 -17646 -13078 -11080
4231a1080P112J229p43j1760J718j762M108J3853m599m500K769R116K407k741
$$ -11080 -3968 -2739 -3482 -15242 -13524 -15286 -11178 2675 -1924 -6424 -3655 5461 7868 5127
4217E127j0651k599K128R341p718j4559L569J0018M196l184l877p911J397J949
$$ 5127 -5524 -8123 -5995 3346 -4372 -18931 -15362 -5344 -1148 -4332 -8209 -16120 -14723 -12774
4203a2774K338q251q004M320P198N345J122L745J702n266n463K597O565R340K408
$$ -12774 -10436 -18687 -26691 -22371 -15173 -9828 -8706 -4961 -3259 -8525 -13988 -11391 -4826 4514 6922
4188F922q358j94m400O459j895J138P40o290j683k182J88J8468J0212n243j48
$$ 6922 -1436 -1630 -6030 429 -1466 -328 412 -5878 -7561 -9743 -9555 8913 19125 13882 13734
4173A3734o483j1994l793K215m572M078P830k64k311o751o113J449J600k642j589
$$ 13734 7251 -4743 -8536 -6321 -10893 -6815 1015 751 -1560 -8311 -14424 -12975 -11375 -14017 -15606
4158a5606q392k200k739L103J852J049O681J4087J5745n59m738K916m260j4801
$$ -15606 -23998 -26198 -28937 -25834 -23982 -22933 -16252 -2165 13580 13021 8283 11199 6939 -7862
4144g862k986R96J886Q97l214J47r448M826M694M417O201k86K487j331j3169P67
$$ -7862 -10848 -9852 -7966 -7069 -10283 -10136 -19584 -14758 -10064 -5647 554 268 2755 1424 -11745 -10978
4128a0978K085k513K699p03m327J0085J1074k544o130n545k607m476j0469j410
$$ -10978 -8893 -11406 -8707 -9410 -13737 -3652 7422 4878 -1252 -6797 -9404 -13880 -24349 -25759
4114b5759J420P893Q636K772m996l7J1999l240m69K199r150J090O631J208J247
$$ -25759 -24339 -16446 -7810 -5038 -10034 -10071 1928 -1312 -1781 418 -8732 -7642 -1011 197 1444
4099A444m040J15k24O87m134m825N159L662q415j242K123L350J4635k770J616
$$ 1444 -2596 -2481 -2705 -2018 -6152 -10977 -5818 -2156 -10571 -11813 -9690 -6340 8295 5525 7141
4084G141j202O196L018M713n244l834j090o500n774n488O526L371p833r600L017
$$ 7141 5939 12135 15153 19866 14622 10788 9698 3198 -2576 -8064 -1538 1833 -6000 -15600 -12583
4069a2583Q075O106n973L247j659k224k870J1822j839r172K177J0080N534M158
$$ -12583 -4508 1598 -4375 -1128 -2787 -5011 -7881 3941 2102 -7070 -4893 5187 10721 14879
4055A4879n273p123J180J0686o107o125l767M61J1896J796N381l836N516m177
$$ 14879 9606 2483 3663 14349 8242 2117 -1650 -1189 10707 12503 17884 14048 19564 15387
4041A5387k373l773j2282m689L281O783Q73p459j1603r46n04R090M589q75k074
$$ 15387 13014 9241 -3041 -7730 -4449 2334 3207 -4252 -15855 -16801 -17305 -8215 -3626 -4501 -6575
4026f575n17J808N932O478M25k036k372k839j0219o148N554Q68L059M99J13L255
$$ -6575 -7092 -5284 648 7126 7551 5515 3143 304 -9915 -16063 -10509 -9641 -6582 -6083 -5970 -2715
4010b715m067m077L304J179j478M051P128L866j676m50m28N742j043K597k303
$$ -2715 -6782 -10859 -7555 -6376 -7854 -3803 3325 7191 5515 5065 4637 10379 9336 11933 9630
3995I630m135L911L130j0512p456k222K3O061l52L580P847l388L901k7q899p916
$$ 9630 5495 9406 12536 2024 -5432 -7654 -7631 -1570 -1922 1658 9505 6117 10018 9991 1092 -6824
3979f824L539L941J0742K872K07n161j4093k338O665R415R04j875K54m273K24
$$ -6824 -3285 656 11398 14270 14477 9316 -4777 -7115 -450 8965 9869 7994 8248 3975 4199
3964D199j714m602n211k71M15L576K46j2930k628M415J1107J0321m332o072J155
$$ 4199 2485 -2117 -7328 -7599 -7184 -3608 -3362 -16292 -18920 -14505 -3398 6923 2591 -3481 -2326
3949b326j0147k810K447J7059Q455j0756q621M156l34N865j092j798L631J483
$$ -2326 -12473 -15283 -12836 4223 12678 1922 -6699 -2543 -2877 2988 1896 98 3729 5212
3935E212l236m237o183J0025N082k960n572L969O639m647p986K400R997l269j0823
$$ 5212 1976 -2261 -8444 1581 6663 3703 -1869 2100 8739 4092 -3894 -1494 8503 5234 -5589
3920e589L64m195j1527m226M966K786L424N261M312l318R98j587J755j829K554
$$ -5589 -5225 -9420 -20947 -25173 -20207 -17421 -13997 -8736 -4424 -7742 -6744 -8331 -6576 -8405 -5851
3905e851K834J1142Q32j769k297k599J759l14l593m003L102L721k212J539j924
$$ -5851 -3017 8125 8957 7188 4891 2292 4051 3737 144 -3859 -757 2964 752 2291 367
3890C67j0491j268j65j032L609l448K900O234p51Q81o07M737J1634j797k886l374
$$ 367 -10124 -11392 -11557 -12589 -8980 -12428 -9528 -3294 -4045 -3164 -3771 966 12600 10803 7917 4543
3874D543O66L528R16p335q973O710j392M944n531k788j0210O50J1628o751K423
$$ 4543 5209 8737 9653 2318 -6655 55 -1337 3607 -1924 -4712 -14922 -14272 -2644 -9395 -6972
3859f972Q903Q903J986p444p058N117K498L690k867j3081n112Q453K995l216m176
$$ -6972 1931 10834 12820 5376 -1682 3435 5933 9623 6756 -6325 -11437 -2984 11 -3205 -7381
3844g381j174J3838j618N533L740n498J957o109j1401R475P207n749m831j801
$$ -7381 -8555 5283 3665 9198 12938 7440 9397 3288 -8113 1362 8569 2820 -2011 -3812
3830c812q232l944P206j616L750L584K99m735K144J788o437M979O542m062L929
$$ -3812 -12044 -15988 -8782 -10398 -6648 -3064 -2765 -7500 -5356 -3568 -10005 -5026 1516 -2546 1383
3815A383l690o153J870j703P472Q349k307k317K524P445m495o687K727O260q862
$$ 1383 -2307 -8460 -6590 -8293 -821 7528 5221 2904 5428 12873 8378 1691 4418 10678 1816
3800A816n02m542J073R248M351k298k993n445p42N150q294j1431k136M163m171
$$ 1816 1314 -3228 -2155 7093 11444 9146 6153 708 -34 5116 -3178 -14609 -16745 -12582 -16753
3785a6753k137L850J270j271J445O512j046r55R163L313m238o207m255N185Q969
$$ -16753 -18890 -15040 -13770 -15041 -13596 -7084 -8130 -9085 78 3391 -847 -7054 -11309 -6124 2845
3770B845K560k61l172l661k430q788j3755o4P574n74L069O357J2541N885l348
$$ 2845 5405 5144 1972 -1689 -4119 -12907 -26662 -26726 -19152 -19726 -16657 -10300 2241 8126 4778
3755D778q84Q877L60Q588K995q727J328r93j5509l655P357N263Q14j212k242p505
$$ 4778 3894 12771 13131 21719 24714 15987 17315 16322 813 -2842 4515 9778 10592 9380 7138 -367
3739c67j268M990r19K974j755j312k341o29J0045L430k270r265P50J262l895q35
$$ -367 -1635 3355 2436 5410 3655 2343 2 -627 9418 12848 10578 1313 2063 3325 -570 -1405
3723a405L959Q817l693n523j645M285J89L117l533L01M841k588p025n99N938m961
$$ -1405 2554 11371 7678 2155 510 4795 4984 8101 4568 4869 9710 7122 97 -502 5436 475
3707D75r811L171n196n82l12K441K282K862k373n093J0446Q59m810k806j149J494
$$ 475 -9336 -6165 -11361 -11943 -12255 -9814 -7532 -4670 -7043 -12136 -1690 -831 -5641 -8447 -9596 -8102
3691h102N645P42L439R492k309p298j500p27R342q440j821o044j993P759L603
$$ -8102 -2457 -1715 1724 11216 8907 1609 109 -618 8724 284 -1537 -7581 -9574 -1815 1788
3676A788J497m719l576j461Q471k428r552o202L128J535R422j341p3N094l626
$$ 1788 3285 -1434 -5010 -6471 2000 -428 -9980 -16182 -13054 -11519 -2097 -3438 -3511 1583 -2043
3661b043p519r95N15O554k239M116j262P51J592M695K816j038o707l687K762R002
$$ -2043 -9562 -10557 -10042 -3488 -5727 -1611 -2873 -2122 -530 4165 6981 5943 -764 -4451 -1689 7313
3645G313O798k344j1972k997o05q074J793P591J488O398n541r526j895L603R298
$$ 7313 14111 11767 -205 -3202 -3807 -11881 -10088 -2497 -1009 5389 -152 -9678 -11573 -7970 1328
3630A328j821r929R603J865k673o625m071Q29P635J005M809J503l496k767K786
$$ 1328 -493 -10422 -819 1046 -1627 -8252 -12323 -11494 -3859 -2854 1955 3458 -38 -2805 -19
3615a9j026r230N44j673O672Q707k815N14k642n350l237l264J800K072j931o883
$$ -19 -1045 -10275 -9731 -11404 -4732 3975 1160 1674 -968 -6318 -9555 -12819 -11019 -8947 -10878 -17761
3599a7761M717M661M694j382J551m668N030K607n668M169L718m60j486m45J1780
$$ -17761 -13044 -8383 -3689 -5071 -3520 -8188 -3158 -551 -6219 -2050 1668 1208 -278 -723 11057
3584A1057K129o8j0546q128o097J513l026O01K331j050J8K914M480M762m883M700
$$ 11057 13186 13118 2572 -5556 -11653 -10140 -13166 -12565 -10234 -11284 -11266 -8352 -3872 890 -3993 707
3568G07N137n311p541l477J5661N256m042o911O278q12l633P89M303n741K264
$$ 707 5844 533 -7008 -10485 5176 10432 6390 -521 5757 4945 1312 2101 6404 663 2927
3553B927K063q847K236R219O140M809p743L203l465m08o619j0431q962L187L569
$$ 2927 4990 -3857 -1621 7598 13738 18547 10804 14007 10542 10134 3515 -6916 -15878 -12691 -9122
3538i122r272n115J0281Q680K792j218N553j94o56j181K487k964j0329j74R46
$$ -9122 -18394 -23509 -13228 -4548 -1756 -2974 2579 2385 1729 548 3035 71 -10258 -10432 -9486
3523i486l365k893J5695O803k032R257R100k126j429n704j0648o73L599r51m283
$$ -9486 -12851 -15744 -49 6754 4722 13979 23079 20953 19524 13820 3172 2499 6098 5147 864
3508H64J597l081J347J286m977j1333l351J6577L237k243L967j381N538K921o459
$$ 864 2461 -620 727 2013 -2964 -14297 -17648 -1071 2166 -77 3890 2509 8047 10968 4509
3493D509j0327j0747O203M52J683P028J0998o33q27j835J267K167N032o693k0587
$$ 4509 -5818 -16565 -10362 -9910 -8227 -1199 9799 9166 8339 6504 7771 9938 14970 8277 -12310
3478a2310l109J2680p714n3R854M211P48j424o990M441Q816L386k111n218k213
$$ -12310 -15419 -2739 -10453 -10506 -652 3559 4307 2883 -4107 334 9150 12536 10425 5207 2994
3463B994N528L454n40L417J106k035m873N194L927r487j5128k864J1494P117m998
$$ 2994 8522 11976 11436 14853 15959 13924 9051 14245 18172 8685 -6443 -9307 2187 9304 4306
3448D306q985q974R82R659J694p423l786M522L183o093j839l704l645l014L995
$$ 4306 -4679 -13653 -12671 -3012 -1318 -8741 -12527 -8005 -4822 -10915 -12754 -16458 -20103 -23117 -19122
3433a9122J8423M39j293o284J4240L752j980j5811M283J2186p714p659j242l462
$$ -19122 -699 -260 -1553 -7837 6403 10155 8175 -7636 -3353 8833 1119 -6540 -7782 -11244
3419a1244p838N835l659N697J3957k477L200k273L371R215k866M974K75r287r118
$$ -11244 -19082 -13247 -16906 -11209 2748 271 3471 1198 4569 13784 10918 15892 16167 6880 -2238
$$ [...]
##END NTUPLES=NMR SPECTRUM
##END=
