##TITLE=Analysis number 326824
Compound Code cc 59474
Book Reference 494/128
Project Code adrs
Chemist Name craigr
##JCAMPDX= 6.0         $$ Bruker NMR JCAMP-DX V2.0
##DATA TYPE= NMR SPECTRUM
##DATA CLASS= NTUPLES
##ORIGIN= Bruker BioSpin GmbH
##OWNER= nmr
$$ XWIN-NMR		Version 3.5
$$ Tue Feb 27 12:18:05 2007 GMT Standard Time (UT+0h)  MAYBRIDGE\nmr@NMR_250MHZ
##.OBSERVE FREQUENCY= 250.131544655141
##.OBSERVE NUCLEUS= ^1H
##.ACQUISITION MODE= SIMULTANEOUS (DQD)
##.ACQUISITION SCHEME= undefined
##.AVERAGES= 16
##.DIGITISER RES= 18
##SPECTROMETER/DATA SYSTEM= dpx250
##.PULSE SEQUENCE= zg30
##.SOLVENT NAME= CDCl3
##.SHIFT REFERENCE= (INTERNAL, CDCl3, 0, 16.522)
##AUDIT TRAIL= $$ (NUMBER, WHEN, WHO, WHERE, WHAT)
$$ ##TITLE= Audit trail, XWIN-NMR		Version 3.5
$$ ##JCAMPDX= 5.01
$$ ##ORIGIN= Bruker BioSpin GmbH
$$ ##OWNER= nmr
$$ C:\u/data/dgb/nmr/ADRS/2460/pdata/1/auditp.txt
$$ ##AUDIT TRAIL=  $$ (NUMBER, WHEN, WHO, WHERE, WHAT)
(   1,<2007-02-27 12:15:23.70 +000>,<MAYBRIDGE\nmr>,<NMR_250MHZ>,
      <created by zg, POWCHK disabled, PULCHK disabled
       configuration hash MD5:
       49 4B E0 1D 92 C2 6B 37 9F E6 65 BC 52 41 86 1D
       data hash MD5: 64K
       61 AF 6B 62 66 83 42 4E F1 03 A1 96 6A BB 30 7A>)
(   2,<2007-02-27 12:15:37.39 +000>,<MAYBRIDGE\nmr>,<NMR_250MHZ>,
      <Start of raw data processing
       ef LB = 0.3 FT_mod = 6 PKNL = 1 SI = 32K 
       data hash MD5: 32K
       83 37 E4 BE B9 5C B6 34 41 6D 11 D6 D2 E4 30 92>)
(   3,<2007-02-27 12:15:39.04 +000>,<MAYBRIDGE\nmr>,<NMR_250MHZ>,
      <apk 
       data hash MD5: 32K
       5A 87 F5 18 8A 69 1B 20 AC 92 BB C2 0C 58 57 25>)
(   4,<2007-02-27 12:15:39.78 +000>,<MAYBRIDGE\nmr>,<NMR_250MHZ>,
      <abs ABSG = 5 
       data hash MD5: 32K
       64 9A 7D 3B 71 76 E2 47 29 AD D7 AE E9 EE F1 5E>)
$$ ##END=
$$ 
$$ hash MD5
$$ 09 B6 D5 70 B9 3E FC CF 08 5A 7B FA 34 E0 99 8F
##$RELAX= 
##$RELAX= 
##$RELAX= 
##$RELAX= 
##$RELAX= 
##$RELAX= 
##$RELAX= 
$$ Bruker specific parameters
$$ --------------------------
##$DU= <C:\u>
##$EXPNO= 2460
##$NAME= <ADRS>
##$PROCNO= 1
##$TYPE= <nmr>
##$USER= <dgb>
##$AMP= (0..31)
100 100 100 100 100 100 100 100 100 100 100 100 100 100 100 100 100 100 
100 100 100 100 100 100 100 100 100 100 100 100 100 100 
##$AQSEQ= 0
##$AQ_mod= 3
##$AUNM= <au_zg>
##$AUTOPOS= <46 >
##$BF1= 250.13
##$BF2= 250.13
##$BF3= 250.13
##$BF4= 250.13
##$BF5= 500.13
##$BF6= 500.13
##$BF7= 500.13
##$BF8= 500.13
##$BYTORDA= 1
##$CFDGTYP= 0
##$CFRGTYP= 5
##$CHEMSTR= <none>
##$CNST= (0..31)
1 1 145 1 1 1 1 1 1 1 1 1 1 1 1 1 1 1 1 1 1 1 1 1 1 1 1 1 1 1 1 1 
##$CPDPRG= <>
##$CPDPRG1= <>
##$CPDPRG2= <>
##$CPDPRG3= <>
##$CPDPRG4= <mlev>
##$CPDPRG5= <mlev>
##$CPDPRG6= <mlev>
##$CPDPRG7= <mlev>
##$CPDPRG8= <mlev>
##$CPDPRGB= <>
##$CPDPRGT= <>
##$D= (0..31)
0 1 0 0 0 0 0 0 0 0.06 0 0 0 0 0 0 0.0002 0 0 0 0 0 0 0 0 0 0 0 0 0 0 
0 
##$DATE= 1172578522
##$DBL= (0..7)
120 120 120 120 120 120 120 120 
##$DBP= (0..7)
150 150 150 150 150 150 150 150 
##$DBP07= 0
##$DBPNAM0= <>
##$DBPNAM1= <>
$$ [...]
##$SUBNAM7= <"">
##$SUBNAM8= <"">
##$SUBNAM9= <"">
##$SW= 20.6930455092707
##$SWIBOX= (0..15)
0 0 3 0 0 0 0 0 0 0 0 0 0 0 0 0 
##$SW_h= 5175.983436853
##$TD= 65536
##$TD0= 1
##$TE= 295.16
##$TE2= 300
##$TE3= 300
##$TEG= 300
##$TL= (0..7)
0 120 120 120 120 120 120 120 
##$TP= (0..7)
150 150 150 150 150 150 150 150 
##$TP07= 0
##$TPNAME0= <>
##$TPNAME1= <>
##$TPNAME2= <>
##$TPNAME3= <>
##$TPNAME4= <>
##$TPNAME5= <>
##$TPNAME6= <>
##$TPNAME7= <>
##$TPOAL= (0..7)
0.5 0.5 0.5 0.5 0.5 0.5 0.5 0.5 
##$TPOFFS= (0..7)
0 0 0 0 0 0 0 0 
##$TUNHIN= 0
##$TUNHOUT= 0
##$TUNXOUT= 0
##$USERA1= <user>
##$USERA2= <user>
##$USERA3= <user>
##$USERA4= <user>
##$USERA5= <user>
##$V9= 5
##$VALIST= <valist>
##$VCLIST= <CCCCCCCCCCCCCCC>
##$VD= 0
##$VDLIST= <DDDDDDDDDDDDDDD>
##$VPLIST= <PPPPPPPPPPPPPPP>
##$VTLIST= <TTTTTTTTTTTTTTT>
##$WBST= 1024
##$WBSW= 4
##$XGAIN= (0..3)
0 0 0 0 
##$XL= 0
##$YL= 0
##$YMAX_a= 249385
##$YMIN_a= -298415
##$ZGOPTNS= <>
##$ZL1= 120
##$ZL2= 120
##$ZL3= 120
##$ZL4= 120
##$ABSF1= 16.522
##$ABSF2= -4.171173
##$ABSG= 5
##$ABSL= 3
##$ALPHA= 0
##$AQORDER= 0
##$ASSFAC= 0
##$ASSFACI= 0
##$ASSFACX= 0
##$ASSWID= 0
##$AUNMP= <proc_1d>
##$AZFE= 0.1
##$AZFW= 0.1
##$BCFW= 0
##$BC_mod= 0
##$BYTORDP= 0
##$COROFFS= 0
##$CY= 12.5
##$DATMOD= 1
##$DC= 0
##$DFILT= <>
##$DTYPP= 0
##$F1P= 14.0000005364418
##$F2P= -0.99999901652339
##$FCOR= 0.5
##$FTSIZE= 32768
##$FT_mod= 6
##$GAMMA= 0
##$GB= 0
##$INTBC= 1
##$INTSCL= 1
##$ISEN= 128
##$LB= 0.3
##$LEV0= 0
##$LPBIN= 0
##$MAXI= 10000
##$MC2= 0
##$MEAN= 0
##$ME_mod= 0
##$MI= 0
##$NCOEF= 0
##$NC_proc= -5
##$NLEV= 6
##$NOISF1= 0
##$NOISF2= 0
##$NSP= 0
##$NTH_PI= 0
##$NZP= 0
##$OFFSET= 16.522
##$PC= 1
##$PHC0= 223.1538
##$PHC1= 8.886724
##$PH_mod= 1
##$PKNL= yes
##$PPARMOD= 0
##$PSCAL= 4
##$PSIGN= 0
##$REVERSE= no
##$SF= 250.13
##$SI= 32768
##$SIGF1= 0
##$SIGF2= 0
##$SINO= 400
##$SIOLD= 32768
##$SREGLST= <1H.CDCl3>
##$SSB= 0
##$STSI= 32768
##$STSR= 0
##$SW_p= 5175.98343685301
##$SYMM= 0
##$S_DEV= 0
##$TDeff= 65536
##$TDoff= 0
##$TI= <Analysis number 999999
Compound Code 99
Book Reference 9
Project Code 9>
##$TILT= no
##$TM1= 0
##$TM2= 0
##$TOPLEV= 0
##$USERP1= <user>
##$USERP2= <user>
##$USERP3= <user>
##$USERP4= <user>
##$USERP5= <user>
##$WDW= 1
##$XDIM= 32768
##$YMAX_p= 397404038
##$YMIN_p= -506111
$$ End of Bruker specific parameters
$$ ---------------------------------
##NTUPLES= NMR SPECTRUM
##VAR_NAME=  FREQUENCY,     SPECTRUM/REAL,   SPECTRUM/IMAG
##SYMBOL=    X,             R,               I
##VAR_TYPE=  INDEPENDENT,   DEPENDENT,       DEPENDENT
##VAR_FORM=  AFFN,          ASDF,            ASDF
##VAR_DIM=   32768,         32768,           32768
##UNITS=     HZ,            ARBITRARY UNITS, ARBITRARY UNITS
##FACTOR=    0.157963299565203, 1,           1
##FIRST=     4132.6476996994, 0,             0
##LAST=      -1043.33573715361, 0,           0
##MIN=       -1043.33573715361, -506111,     0
##MAX=       4132.6476996994, 397404038,     0
$$ Real data points
##PAGE= N=1
##DATA TABLE= (X++(R..R)), XYDATA
$$ [...]
19086A00967J5743L0271j06299j05512J0959R5866J27152M9828q1793j00887o3260
$$ 100967 116710 146981 40682 -64830 -53871 41995 169147 218975 137182 36295 -26965
19075b6965R487l9046J08723n6938l3198J18637p8571m7279J2503Q7583J01691
$$ -26965 -17478 -56524 52199 -4739 -37937 80700 2129 -45150 -32647 54936 156627
19064A56627K9014r3531j10669j0102J27672J14608M0028O9843j22011j18591
$$ 156627 185641 92110 -18559 -28661 99011 213619 253647 323490 201479 82888
19054H2888j06354r3302l5993K5064O550N8430N1290L122l5591m2930r2453N2385
$$ 82888 -23466 -116768 -152761 -127697 -121147 -62717 -11427 -8305 -43896 -86826 -179279 -126894
19042a26894j5313O9590O4739q5195q0474K9918K8826M5952R6079k4030p6531
$$ -126894 -142207 -72617 -7878 -93073 -173547 -143629 -114803 -68851 27228 3198 -73333
19031g3333L8772J48593m8217J434O7605N3907o7757k05915o2670J05821R4594
$$ -73333 -34561 114032 65815 67249 134854 188761 121004 -84911 -147581 -41760 52834
19020E2834J20174r6939p3205r2640k190M0234J79907Q1502n9295j59521q8584
$$ 52834 173008 76069 2864 -89776 -91966 -51732 128175 209677 150382 -9139 -97723
19009i7723Q1657J8161J5254j11338J30665Q9093m2100K3008j11690R9639R520
$$ -97723 -16066 2095 17349 -93989 36676 125769 83669 106677 -5013 94626 104146
18998A04146R6861P8881j37701j37159m9162N9561N621J2513l2485j22003J4599
$$ 104146 201007 279888 142187 5028 -44134 15427 21048 33561 1076 -120927 -106328
18987a06328J9874M4936R2351j01090m7723j8896n3762J3239n7928k1761K7081
$$ -106328 -86454 -41518 50833 -50257 -97980 -116876 -170638 -157399 -215327 -237088 -210007
18976b10007J07837J10304N5139K450o7936J295J5355o1369l8400q5675j01336
$$ -210007 -102170 8134 63273 65723 -2213 -918 14437 -46932 -85332 -171007 -272343
18965b72343m0969K15860J17199M209O8549k0920q9688O68Q4738k455p9936j20872
$$ -272343 -313312 -97452 19747 23956 92505 71585 -18103 -17435 67303 64848 -15088 -135960
18953a35960K0725J0772P1875M7023N4802l1214o7616L7911N3142J0146n7343
$$ -135960 -115235 -104463 -32588 14435 69237 38023 -29593 8318 61460 71606 14263
18942A4263o4636j2327J6370k6991j9381M8047l3837l6909N5503r4761J5584J32391
$$ 14263 -50373 -62700 -46330 -73321 -92702 -44655 -78492 -115401 -59898 -154659 -139075 -6684
18930f684N4027j06899j5795L556m5664M8138l7034J00345N4371q6210r3564j9358
$$ -6684 47343 -59556 -75351 -71795 -117459 -69321 -106355 -6010 48361 -37849 -131413 -150771
18918a50771R3055N603P1623q7666K4368J33444n6733J0562l8070O8264J05125
$$ -150771 -57716 -52113 19510 -68156 -43788 89656 32923 43485 5415 73679 178804
18907A78804r1316j09088l5179m9486O0378J17901J27954J6283j98378M8091k3603
$$ 178804 87488 -21600 -56779 -106265 -45887 72014 199968 216251 17873 65964 42361
18896D2361j37683r445P267N4077L7463o9625J96123J69201k3400j09073k46668
$$ 42361 -95322 -104767 -97500 -43423 -5960 -75585 120538 289739 266339 157266 -89402
18885h9402r2497M1378M1619O4504n3399l7979J71951J20650n1546l3217K9495
$$ -89402 -181899 -140521 -98902 -34398 -87797 -125776 46175 166825 115279 82062 111557
18874A11557o5879K9118n23l1098J01454l0988j55014o0724L8884L2082n2112
$$ 111557 45678 74796 74273 43175 144629 113641 -41373 -102097 -63213 -31131 -83243
18863h3243J07730P1532l7580j1444N8331L7213j17116j30838M4450O6584K899
$$ -83243 24487 96019 58439 46995 105326 142539 25423 -105415 -60965 5619 8518
18852H518n2680k5628n7215R4773J93692M0909k36706l4122o5113l9265M6518
$$ 8518 -44162 -69790 -127005 -32232 161460 202369 -34337 -68459 -133572 -172837 -126319
18841a26319P9215Q0385J24347l8869j24116q1574P0944J6670q6313r1879J50652
$$ -126319 -47104 33281 157628 118759 -5357 -86931 -15987 683 -85630 -177509 -26857
18830b6857J37581q3946J7931L1119j29994J11610O6390l3254K4697R8054k9775
$$ -26857 110724 26778 44709 75828 -54166 57444 123834 90580 115277 213331 183556
18819A83556K2021Q9538m2856n4239j35914r5881K789J69675l0316j14697j39504
$$ 183556 205577 295115 252259 198020 62106 -33775 -30986 138689 108373 -6324 -145828
18808a45828Q9143O1119j5349l1071M0115N0400l4609N2278J8620l8254J8409
$$ -145828 -56685 4434 -10915 -41986 -1871 48529 13920 66198 84818 46564 64973
18797F4973Q4026r24j12373O7197K6227n9972M0053j29666n0154J7601n6246K931
$$ 64973 148999 148075 35702 102899 129126 69154 109207 -20459 -70613 -53012 -109258 -106327
18785a06327N2042J60775n4937l2225k4364o2525o9785k329J40850J18058P9755
$$ -106327 -54285 106490 51553 19328 -5036 -67561 -137346 -139675 1175 119233 198988
18774A98988m1405J9397k971P5959J41444M23943N12572J34232n6707k24452m36916
$$ 198988 157583 176980 174009 249968 391412 815355 1327927 1462159 1405452 1181000 744084
18763G44084k56291r8786j63836j10848j19952R5092M8985M1972j1324n1013L013
$$ 744084 487793 389007 225171 114323 -5629 89463 138448 180420 169096 118083 121096
18752A21096M4177l1819O6000M9594N5571L3619O9314O0668j90718r8377j5376
$$ 121096 165273 133454 199454 249048 304619 338238 407552 468220 277502 179125 163749
18741A63749n171k2832J00368J7540O660n609n393j8155J07530o6445L5533M9583
$$ 163749 158578 135746 236114 253654 260314 254705 249312 231157 338687 272242 307775 357358
18729C57358J2424j55644p4460O2659k4388m0937j16652J1872K8495K0002J1122
$$ 357358 369782 214138 139678 202337 177949 137012 20360 32232 60727 80729 91851
18718I1851n4678N3415P222O5363M212l5519j9222Q8354o3735j16933n8250N1676
$$ 91851 37173 90588 97810 163173 167385 131866 112644 200998 137263 20330 -37920 13756
18706A3756n9320K0603Q2046k9689L0416O5277n2785l5717Q6533O1819j9661o1056
$$ 13756 -45564 -24961 57085 27396 57812 123089 70304 34587 121120 182939 163278 102222
18694A02222r7117R0686K4909o8376L7422K0657p6333j8298L9041K5840R8524
$$ 102222 5105 95791 120700 52324 89746 110403 34070 15772 54813 80653 179177
18683A79177O3338o5678j23692j00651m8890j12830O9922K58942M0395j0683P4768
$$ 179177 242515 176837 53145 -47506 -96396 -209226 -139304 119638 160033 149350 224118
18672B24118P9574L8607L4383J6574j52792j51391m4834m3008J9551M0022j04836
$$ 224118 303692 342299 376682 393256 240464 89073 44239 1231 20782 60804 -44032
18661d4032N0744J62848r9650k8315O47r9131m2077K8692K9173P5920P8085j9229
$$ -44032 6712 169560 69910 41595 42242 -56889 -98966 -70274 -41101 34819 112904 93675
18649I3675q7117p4043N3283k5978l1052J47391J13358n8662J5403N1329k6578
$$ 93675 6558 -67485 -14202 -40180 -71232 76159 189517 130855 146258 197587 171009
18638A71009O2962j5616j05015l2307J9623o3989N8136N5896N2216J7561J17447
$$ 171009 233971 218355 113340 81033 100656 36667 94803 150699 202915 220476 337923
18627C37923Q1297J6566r3649L9371J01180J46315l7682j19772j11578m0906p728
$$ 337923 419220 435786 342137 381508 482688 629003 591321 471549 359971 319065 311337
18616C11337m6466p4430r7811K0204O3843j4460O4935q9702o8120l386K331p8323
$$ 311337 264871 190441 92630 112834 176677 162217 227152 137450 69330 65944 68275 -10048
18604a0048O119M2393M7288Q447m3915k8539o9573L1621P6535R1077m4241q3116
$$ -10048 -3929 38464 85752 94199 50284 21745 -47828 -16207 60328 151405 107164 24048
18592B4048j27743m3386P6461J26847O4476j16745q3904J10923J78651P5786n7662
$$ 24048 -103695 -147081 -70620 56227 120703 3958 -79946 30977 209628 285414 227752
18581B27752l1350n6579O5786L7382J4371k0573k6970Q6102P5399k5485K7576
$$ 227752 196402 139823 205609 242991 257362 236789 209819 295921 371320 345835 373411
18570C73411m5485k1876m0485j49352j12166p2131o3838Q425j63042k4874R6696
$$ 373411 327926 306050 265565 116213 4047 -68084 -131922 -123497 -286539 -311413 -214717
18559b14717J43161K81821N2947j00630j1371o798p5437N3654k1769l0711L0350
$$ -214717 -71556 210265 263212 162582 151211 144413 68976 122630 100861 70150 100500
18548A00500J4010j11695n1919k1069J07475N7530m3918N3124j7399O0386k3313
$$ 100500 114510 2815 -49104 -70173 37302 94832 50914 104038 86639 147025 123712
18537A23712p3591j54864K8526L6147J60436o6048n5547j7821M6925k7896P5519
$$ 123712 50121 -104743 -76217 -40070 120366 54318 -1229 -19050 27875 -21 75498
18526G5498O348O1752l3889J01136j36070K7581L8173q6607J6643O477M4349J6323
$$ 75498 81846 143598 109709 210845 74775 102356 140529 53922 70565 77042 121391 137714
18514A37714j0942J3344K8437o6886o0332n5127J4440k4757j18013r703n1162
$$ 137714 126772 140116 168553 101667 41335 -13792 648 -24109 -142122 -151825 -202987
18503b02987J30703J39831N8852n0011K3100j1860k4517Q6456m3040j98279j16065
$$ -202987 -72284 67547 126399 76388 99488 87628 63111 149567 106527 -91752 -207817
18492b07817Q7841K1302P1330J08468J0267j0448P107R1364p672J17609P5398
$$ -207817 -119976 -98674 -27344 81124 91391 80943 88050 179414 171742 289351 364749
18481C64749p9455m3479j05009p4975K7972J49903L5455N0320k8682l4736q2375
$$ 364749 285294 241815 136806 61831 89803 239706 275161 325481 296799 262063 179688
18470A79688j5926m5790Q6775r3038n2669j38183j6586J5690J14043J24026R3897
$$ 179688 163762 117972 204747 111709 59040 -79143 -95729 -80039 34004 158030 251927
18459B51927o4557k5869j2109n5956r4933J6431R0565Q8576q8358O5674J4327
$$ 251927 187370 161501 149392 93436 -1497 14934 105499 194075 105717 171391 185718
18448A85718j16331l6564J1604j8490J38179O4022m7579k3264J1392p3460j6112
$$ 185718 69387 32823 44427 25937 164116 228138 180559 157295 168687 95227 79115
18437G9115J33273j30791j9764J4901m6842J5801J34590o007J4194l5707m4240
$$ 79115 212388 81597 61833 76734 29892 45693 180283 174276 188470 152763 108523
18426A08523L4332K8237j13989q427J17524k2611j592j9438k7399K6971L7227
$$ 108523 142855 171092 57103 48676 166200 143589 141997 122559 95160 122131 159358
18415A59358O545Q510n9525Q5195l0721K4578P0510n5102m0647j2563k4322P1567
$$ 159358 165903 174413 114888 200083 169362 193940 264450 209348 168701 156138 131816 203383
18403B03383R5569q0807n1788r0105j45661l0044K5570J02131Q2272L4862n8643
$$ 203383 298952 218145 166357 76252 -69409 -99453 -73883 28248 110520 145382 86739
18392H6739j1688l4168j64673R2776R1003O9564M2303q499o0781L1638j04764
$$ 86739 75051 40883 -123790 -31014 59989 129553 171856 163357 102576 134214 29450
18381B9450O265j09768J2854L0141N5970R5013J77620p6885o110j0178p3624N114
$$ 29450 35715 -74053 -61199 -31058 24912 119925 297545 220660 214550 204372 130748 135862
18369A35862J74605R8415j13692q0175K8212N3630L4677P6874q907q9653q4697
$$ 135862 310467 408882 295190 215015 243227 296857 331534 408408 399501 309848 225151
18358B25151J5618m4244K3085l0027k9763k017k884O3746Q4594J8278R6850N3526
$$ 225151 240769 196525 219610 189583 159820 157803 154919 218665 303259 321537 418387 471913
18346D71913p4991j91928j49604L8826R3391J51633P6925N7810N4254n7313k12680
$$ 471913 396922 204994 55390 94216 187607 339240 416165 473975 528229 470916 258236
18335B58236j05531J2271M9034q0285j27264j7993J28555K22183Q3795j84217
$$ 258236 152705 164976 214010 133725 6461 -11532 117023 339206 423001 238784
18325B38784m7145L6745L224l046O7423J20954q2452j54381k8608L8356M1945
$$ 238784 191639 228384 231608 228562 295985 416939 334487 180106 151498 189854 231799
18314B31799o4039r1791M7034M4661j49657Q5012O7491O0570J1458m5711K6920
$$ 231799 167760 75969 123003 167664 18007 103019 170510 231080 242538 196827 223747
18303B23747p1971N0582J07469M4086O6124m8889k5890j3045j31300J1227L0640
$$ 223747 151776 202358 309827 353913 420037 371148 345258 332213 200913 212140 242780
18292B42780O9685J3732o6107m7708j4999l8403R5309J36890j34382M9184k3164
$$ 242780 312465 326197 260090 212382 197383 158980 254289 391179 256797 305981 282817
18281B82817q2145J55754Q1781J2978n7469J2093M7235m0476R6742M1862M4644
$$ 282817 200672 356426 438207 451185 393716 405809 453044 412568 509310 551172 595816
18270E95816j28950n664M4205q0358p3725r4706l2979j8343J18881k086J16357
$$ 595816 466866 461202 505407 425049 351324 256618 223639 205296 324177 322091 438448
18259D38448L2740p4695o046J1575N6691n8098j27527j425Q506M5402J68290J57189
$$ 438448 471188 396493 390447 402022 458713 400615 273088 271663 280169 325571 493861 651050
18247F51050r762n0636j10264o9029Q014J0827n176N206l8621P4344P2528O9260
$$ 651050 641288 590652 480388 411359 419373 430200 425024 430230 391609 465953 538481 607741
18235F07741Q2404M8347K7123Q9387k963r8377j01987j21520l9866N533l569J25717
$$ 607741 690145 738492 765615 855002 852039 753662 651675 530155 490289 495822 492253 617970
18223F17970J228m9011j6941J31961J55057K0129J3836j24944m6937Q3180J04475
$$ 617970 619198 570187 553246 685207 840264 860393 874229 749285 702348 785528 890003
18212H90003k7774r6765l8704N7237R7124Q6620m9155o7710O0035J03704Q5563
$$ 890003 862229 765464 726760 783997 881121 967741 918586 850876 910911 1014615 1100178
18201A100178J35657J67161N4949r8912M1999M2035K4251q6965j07621q6662K7055
$$ 1100178 1235835 1402996 1457945 1359033 1401032 1443067 1467318 1380353 1272732 1186070 1213125
18190A213125J03018L1004j02196M2970K20066J33190J23980J05501K33996K11933
$$ 1213125 1316143 1347147 1244951 1287921 1507987 1641177 1765157 1870658 2104654 2316587
18180B316587K81698M02851O21199P85125J001433J580314K478067M153388O008480
$$ 2316587 2598285 3001136 3622335 4407460 5408893 6989207 9467274 13620662 19629142
18171A9629142P780149P979727P000893M711227M96926l839590o367502p586596
$$ 19629142 27409291 35389018 42389911 47101138 47598064 43758474 37390972 29804376
18163B9804376p224452n766611m060208k763062j755009j143151q38088n02344
$$ 29804376 22579924 16813313 12753105 9990043 8235034 7091883 6253795 5751451
18155E751451l16889l45044k32848j18636j14820n8876k13060j05172j5211p2843
$$ 5751451 5434562 5089518 4856670 4738034 4623214 4564338 4351278 4246106 4230895 4158052
18145D158052R951j7169j62856j22286J4207Q3792J07945J69303J90429K31970
$$ 4158052 4168003 4150834 3987978 3865692 3879899 3963691 4071636 4240939 4431368 4663338
18135D663338J83012K10522M49644O11430O68105R27842J374100J687835K466750
$$ 4663338 4846350 5056872 5506516 6117946 6786051 7713893 9087993 10775828 13242578
18126A3242578L895114O030081Q811650J1655723J2863803J3210492J2957748
$$ 13242578 17137692 23167773 31979423 43635146 56498949 69709441 82667189
18119H2667189J0029402N938887K456371o92027l429394l932707Q60028J5037501
$$ 82667189 92696591 98635478 101091849 100399822 96970428 93037721 93897749 108935250
18111A08935250M6657071O9713938J9013464l600727j7382109o7071529o3898196
$$ 108935250 155592321 225306259 244319723 240718996 223336887 156265358 92367162
18104I2367162l2633249j6912602r914363o346192m411531l203660k331447j772480
$$ 92367162 59733913 42821311 32906948 26560756 22149225 18945565 16614118 14841638
18096A4841638j447808j347203j115207r41227n88137o25038o31535m98253l51620
$$ 14841638 13393830 12046627 10931420 9990193 9402056 8777018 8145483 7647230 7295610
18087G295610k66439k41127k72706k22424l20971j63785L7626K42042L05049M77003
$$ 7295610 7029171 6788044 6515338 6292914 5971943 5808158 5845784 6087826 6392875 6869878
18077F869878R50009J383855K042211L184235N153543Q070495J0727376J1595890
$$ 6869878 7819887 9203742 11245953 14430188 19583731 27654226 38381602 49977492
18069D9977492J0237651P184943J244459n249719r121849j1055867j1030920q761548
$$ 49977492 60215143 67400086 68644545 63394826 54272977 43217110 32186190 23424642
18061B3424642o101046m054213k739426j818919j343814j058558q80026n70114
$$ 23424642 17323596 13269383 10529957 8711038 7367224 6308666 5428640 4858526
18053D858526n56532l60521j72609k26748l47744l37854l13157j27080j6169o6505
$$ 4858526 4301994 3941473 3768864 3542116 3194372 2856518 2543361 2416281 2400112 2333607
18043B333607m4842J38571K9374n97p0608j86255j90465j6245j44033j96807j45710
$$ 2333607 2288765 2427336 2456710 2456113 2385505 2199250 2008785 1992540 1848507 1651700 1505990
18032A505990k42473q7067J5336j08583m3659N4595N9413n4591J3200j17929r9998
$$ 1505990 1263517 1176450 1191786 1083203 1039544 1094139 1153552 1098961 1112161 994232 894234
18021H94234j49842p9435L5337M0568P0065r9778q1636N689j17575o3202K4339
$$ 894234 744392 664957 700294 740862 810927 711149 629513 635202 517627 454425 478764
18010D78764j02765Q7244J3884q1482p5364q9238J34362J80952Q2693r4698j38774
$$ 478764 375999 463243 477127 395645 320281 231043 365405 546357 629050 534352 395578
17999C95578j58534k6566O7612j8577q2383p1857O020j5131Q3464J17909l0649
$$ 395578 237044 210478 278090 259513 177130 105273 111293 96162 179626 297535 266886
17988B66886n8515K1472j24049Q6614j8903o2757k4602J09262K10002K7710q6926
$$ 266886 208371 229843 105794 192408 173505 110748 86146 195408 405410 433120 346194
17977C46194k5594r0081j01199K8885O9315Q2203N1281j0149m9177p4474m3381
$$ 346194 320600 230519 129320 158205 227520 309723 361004 350855 301678 227204 183823
17966A83823J25514o4558K0439J44494J7064j11579j85898k2102J34185N2562
$$ 183823 309337 244779 265218 409712 426776 315197 129299 107197 241382 293944
17956B93944O9207J01633L4507j03968j61948j11993P3924Q3007J79861L9157
$$ 293944 363151 464784 499291 395323 233375 121382 195306 278313 458174 497331
17946D97331O1713r8413j68838j34992L0500J67779J22807O4058n9471k9979q6720
$$ 497331 559044 460631 291793 156801 187301 355080 477887 541945 482474 452495 365775
17935C65775m1330O0110J49350J15994k792j00659O0484J76305k8367j43113j77299
$$ 365775 324445 384555 533905 649899 647107 546448 606932 783237 754870 611757 434458
17924D34458K5795O0074j05804P2159K4099j03316j17800j47075j11438r967j5345
$$ 434458 460253 520327 414523 486682 510781 407465 289665 142590 31152 21185 5840
17913E840L7611o894J04278J32784k5725k4618J5964j9511n2083j29794R8884
$$ 5840 43451 36557 140835 273619 247894 223276 239240 219729 167646 37852 136736
17902A36736M6365M621r4487l177J40163J06222N962k9079J12731J4365l8703
$$ 136736 183101 187722 93235 90058 230221 336443 342405 313326 426057 440422 401719
17891D01719q7289m1920N8575n6434j04820N0906J38953j4059K274Q5117R3542
$$ 401719 314430 272510 331085 274651 169831 220737 359690 345631 347905 433022 526564
17880E26564q0491o0855P7984O3972m3440R084K8479o3149l2656r2710m4941n5134
$$ 526564 446073 385218 463202 527174 483734 492818 521297 458148 425492 332782 287841 232707
17868B32707m7520j18884j13809J42077J25887O540o1749J25793p0980j38309
$$ 232707 185187 66303 -47506 94571 220458 226998 165249 291042 220062 81753
17858H1753p285j9845n5963q070m4836M4185K6361M9358L784N5533N563P779M5467
$$ 81753 74468 54623 -1340 -9410 -54246 -10061 16300 65658 69442 124975 130538 138317 183784
17845A83784L6279m190n3430k7633K7103J8653L3477J3965J35672k982K8440R390
$$ 183784 220063 215873 162443 134810 161913 180566 214043 228008 363680 360698 389138 398528
17833C98528O9717P6080m6600j41826r1510j118L2231m1246q0863j8123q3095
$$ 398528 468245 544325 497725 355899 264389 263271 295502 254256 173393 155270 72175
17822G2175k012Q5349N4780P6786J4922o1008k21434R18J28624K3110o07R362
$$ 72175 70163 155512 210292 287078 302000 240992 19558 20476 149100 172210 171603 180965
17810A80965j17546Q398p601K6043n1686R0581K00284J6245j10956Q7223m3725
$$ 180965 63419 71817 64216 90259 38573 129154 329438 345683 234727 321950 278225
17799B78225j2139J6821K1640r7366m0514L1956J87107J36523j57320l6904j5152
$$ 278225 266086 282907 304547 207181 166667 198623 385730 522253 364933 328029 312877
17788C12877N4090k922K557j54060J10800J15554m7418q9926j59808p21J14714
$$ 312877 366967 364045 366602 212542 323342 438896 391478 301552 141744 141023 255737
17777B55737P2808L8964K7149q4670L615j7895Q1389J14926N2055r4854j26981
$$ 255737 328545 367509 394658 309988 313603 295708 377097 492023 544078 449224 322243
17766C22243J3675Q3958K5995j4086m0178o3062R313P5667k4103J7524r0992N1267
$$ 322243 335918 419876 445871 431785 391607 328545 337858 413525 389422 406946 315954 367221
17754C67221Q5679N4718l7545R2416J08065J9656n3377o9010L3974m3475j13960
$$ 367221 452900 507618 470073 562489 670554 690210 636833 567823 601797 558322 444362
17743D44362R3839j1097Q6345Q4338R5318j3979m854k814J32338R5513L5329J3902
$$ 444362 538201 527104 613449 697787 793105 779126 774272 771458 903796 999309 1034638 1048540
17731A048540n3644J05184O4011K5529J66961Q6580J83083Q8004J05936J03067
$$ 1048540 994896 1100080 1164091 1189620 1356581 1443161 1626244 1714248 1820184 1923251
17721A923251K43936J88048K59325J42404J87794K30694K00657M69855N35003
$$ 1923251 2167187 2355235 2614560 2756964 2944758 3175452 3376109 3845964 4380967
17712D380967N75984R96863J634898K446540L274805L998965M882273N585868
$$ 4380967 4956951 5953814 7588712 10035252 13310057 17309022 22191295 27777163
17704B7777163M567243L600664L828814K589113K024474L552163L352282J879877
$$ 27777163 32344406 35945070 39773884 42362997 44387471 47939634 51291916 53171793
17696E3171793K137199J995829L37329j011804r79672j249944k108895j249321
$$ 53171793 55308992 57304821 57642150 56630346 55650674 54400730 52291835 51042514
17688E1042514q11106k826261l785356m201046n923130o258926n335114m586984
$$ 51042514 50231408 47405147 43619791 39418745 33495615 27236689 21901575 17314591
17680A7314591l649854k465980j574271j038865q69150n21424l72106k65017k85387
$$ 17314591 13664737 11198757 9624486 8585621 7716471 7195047 6822941 6557924 6272537
17671F272537j53126j26196k11533j42396m9455K08593K00565M39802O97927J238871
$$ 6272537 6119411 5993215 5781682 5639286 5589831 5798424 5998989 6438791 7136718 8375589
17661H375589J815881K648351L226151L823454M485036L688506K761969K816328
$$ 8375589 10191470 12839821 16065972 19889426 24374462 28062968 30824937 33641265
17653C3641265J721190J190015K404972K591756J782988J952991K276920P71091
$$ 33641265 35362455 36552470 38957442 41549198 43332186 45285177 47562097 48333188
17645D8333188o99094n71475r67199k305206j397042j025788k759913l275535
$$ 48333188 47634094 47062619 46095420 43790214 42393172 41367384 38607471 35331936
17637C5331936l452997m874441n259618m346752l760528k997965j899019j335788
$$ 35331936 31878939 27004498 21744880 17398128 13637600 10639635 8740616 7404828
17629G404828j069593q07606o54329m52820l38589k61576k68357j55267j88594
$$ 7404828 6335235 5527629 4873300 4420480 4081891 3820315 3551958 3396691 3208097
17620C208097j77057j58663l05895j93171n7636j36372j77232j69775j34593m8219
$$ 3208097 3031040 2872377 2566482 2373311 2315675 2179303 2002071 1832296 1697703 1649484
17610A649484j34623j61529l1082K2803J00481R5003n7646m2566J20052J14806
$$ 1649484 1514861 1353332 1322250 1345053 1445534 1540537 1482891 1440325 1560377 1675183
17600A675183J24504m6116M0942j26737j64764j60382j04728r2217m6082j5380
$$ 1675183 1799687 1753571 1794513 1667776 1503012 1342630 1237902 1145685 1099603 1084223
17590A084223J31138n2431J2754L0492J7364J26695J06043Q791K3710J6012M8889
$$ 1084223 1215361 1162930 1175684 1206176 1223540 1350235 1456278 1465069 1488779 1504791 1553680
17579A553680K46985P1667J23346J58598M3254J13504J98048L12176J50709K49672
$$ 1553680 1800665 1872332 1995678 2154276 2197530 2311034 2509082 2821258 2971967 3221639
17569C221639K77654K57215M67663N45718P08286R02291J324171J900022K797762
$$ 3221639 3499293 3756508 4224171 4769889 5478175 6380466 7704637 9604659 12402421
17560A2402421L863279N046827O381127P147191O599898N818782M462000J330858
$$ 12402421 16265700 21312527 27693654 34840845 41440743 47259525 51721525 53052383
17552E3052383j026878j915710k566315j674005J18422K245771L917800M934245
$$ 53052383 52025505 50109795 47543480 45869475 45987897 48233668 52151468 57085713
17544E7085713N848117N633361M797230M703262L362153J032041j58047k496611
$$ 57085713 62933830 68567191 73364421 78067683 81429836 82461877 82303830 79807219
17536G9807219n176797n720980n505164m823097k674139Q5941J958867J826624
$$ 79807219 74630422 68909442 63404278 58581181 55907042 55992983 57951850 59778474
17528E9778474J234258l68663l454151n451407o718228p681327p451660o117002
$$ 59778474 61012732 60644069 57189918 51738511 45020283 37338956 29887296 23770294
17520B3770294m933606l654937k628838j894161j378769j217883q76388p06477
$$ 23770294 18836688 15181751 12552913 10658752 9279983 8062100 7185712 6479235
17512F479235o28892n75361m68953l16595m22063l09888k14898k78912k68460
$$ 6479235 5850343 5274982 4806029 4489434 4067371 3757483 3542585 3263673 2995213
17503B995213j68819o9831j75818k39766k36953j79262k7800m3710n1004Q708
$$ 2995213 2826394 2756563 2580745 2340979 2104026 1924764 1896964 1853254 1802250 1810958
17493A810958o1807j00273K9422j07272r6169o0621k7109j26053J3752R995o0141
$$ 1810958 1749151 1648878 1678300 1571028 1474859 1414238 1387129 1261076 1274828 1284823 1224682
17482A224682J50987j17265r2469j4774l6124j6415P8398J53406P1238n4527P4464
$$ 1224682 1375669 1258404 1165935 1151161 1115037 1098622 1177020 1330426 1401664 1347137 1421601
17471A421601K30710K72321J70296N2163n9451N4349q0675r3941J23672N4258
$$ 1421601 1652311 1924632 2094928 2147091 2087640 2141989 2061314 1967373 2091045 2145303
17461B145303K66979K29474J39995K08928L22602L85779M25906O50983Q18861
$$ 2145303 2412282 2641756 2781751 2990679 3313281 3699060 4124966 4775949 5594810
17452E594810J035508J661361K551552L921724N658933P069361P391478O030506
$$ 5594810 6630318 8291679 10843231 14764955 20423888 27493249 34884727 40915233
17444D0915233M222918K254119O24186K91087N59380j01746j449759l323156m953237
$$ 40915233 45138151 47392270 48016456 48307543 48866923 48765177 47315418 43992262 39039025
17435C9039025n616508m447983k498043k02925J986422L519190L350008K220696
$$ 39039025 33422517 28974534 26476491 26273566 28259988 31779178 35129186 37349882
17427C7349882J025876j49518n66040l55988k28015r90863k409151l933317n044807
$$ 37349882 38375758 38226240 37660200 37304212 37076197 36085334 33676183 29742866 24698059
17418B4698059n114814m260061l337577k309764j504368q52893o19497o55173
$$ 24698059 19583245 15323184 11985607 9675843 8171475 7318582 6699085 6043912
17410F043912n09445l35963k38113k26133L8986R4394J29750Q3660K55913O65890
$$ 6043912 5534467 5198504 4960391 4734258 4773244 4867638 4997388 5081048 5336961 6002851
17400F002851Q19589J111152J734937L044735M464747N717170O205157N315899
$$ 6002851 6822440 7933592 9668529 12713264 17178011 22895181 29100338 34416237
17392C4416237L505033J623284J70929l23424K38770L42259n12971k145898l742822
$$ 34416237 37921270 39544554 39715483 39392059 39630829 39973088 39460117 37314219 33571397
17383C3571397m475912l857862k264047j90862J876097L209570L432318K278555
$$ 33571397 29095485 25237623 22973576 22782714 24658811 27868381 31300699 33579254
17375C3579254R73662k13435r57595o23981k48987n95737j853446l201221m320914
$$ 33579254 34552916 34339481 33381886 32757905 32508918 31913181 30059735 26858514 22537600
17366B2537600m624630m109133l251046k365490j653137j017836o95379p22616
$$ 22537600 17912970 13803837 10552791 8187301 6534164 5516328 4820949 4098333
17358D098333n81758l95915k52481k05464j92954j76013k65670k00719j06307
$$ 4098333 3516575 3120660 2868179 2662715 2469761 2293748 2028078 1827359 1721052
17349A721052j49458j70123j86528j76140p5770J34496m9989j26875p1879q3049
$$ 1721052 1571594 1401471 1214943 1038803 963033 1097529 1047540 920665 848786 765737
17339G65737j24568j85907J1880R1729o3217K3304p9614J8182O3672j32134j222
$$ 765737 641169 455262 467142 558871 495654 518958 439344 457526 521198 389064 387842
17328C87842P8705j9713m2624j44274j5131k3116J03171R578l2107n6071j14703
$$ 387842 466547 446834 404210 259936 244805 221689 324860 334438 302331 246260 131557
17317A31557q8463O1232k8573j37549m887O0965N3671k9015M7806M4485q1016
$$ 131557 43094 104326 75753 -61796 -66683 -5718 47953 18938 66744 111229 30213
17306C0213K1652Q1172K4701j8556k0029K9623L6839j05598j8401P6000j09338
$$ 30213 51865 133037 157738 139182 119153 148776 185615 80017 61616 137616 28278
17295B8278o899J28342j28958j26943n4781J18555K5811j7546p5801r6261l0551
$$ 28278 21379 149721 20763 -106180 -160961 -42406 -16595 -34141 -109942 -206203 -236754
17284b36754K4977N8128N1298K6675O8121J12148m3555k8354r551l6243P2679
$$ -236754 -211777 -153649 -102351 -75676 -7555 104593 61038 32684 23133 -13110 59569
17273E9569J00991k8470j5720q7909N1271J8439m4090L8039J0985N2509p4612
$$ 59569 160560 132090 116370 28461 79732 98171 54081 92120 103105 155614 81002
17262H1002q5420n1132j3621R8821m1723j28742n0212O9868q930R702M7784k7695
$$ 81002 -4418 -55550 -69171 29650 -12073 -140815 -191027 -121159 -130089 -120387 -72603 -100298
17250a00298r6032k2026m7955O4070N1629o7596R1260M1442p843L9630P4965j3235
$$ -100298 -196330 -218356 -266311 -202241 -150612 -218208 -126948 -85506 -93349 -53719 21246 8011
17238H011N0961K1111L3495r4454N313j15479l4857J44566J03344n0749J3551
$$ 8011 58972 80083 113578 19124 24437 -91042 -125899 18667 122011 71262 84813
17227H4813r5632k9655q719m8n5313m6744m3126O19K9993k1168N0173P9482J0563
$$ 84813 -10819 -40474 -49193 -49241 -104554 -151298 -194424 -193805 -163812 -184980 -134807 -55325 -44762
17214d4762M4060L7914J0054j22562j36806l0309P2997j5403N8066k8466N6881
$$ -44762 -702 37212 47266 -75296 -212102 -242411 -169414 -184817 -126751 -155217 -98336
17203i8336L3873J19401O3828k0709k00199R4395J38262n7661P6054M8563m8219
$$ -98336 -64463 54938 118766 98057 -102142 -7747 130515 72854 148908 197471 149252
17192A49252l8824N9789n4715n5699P069N0666Q2959j981J0328J34292K2258q2282
$$ 149252 110428 170217 115502 59803 66872 117538 200497 198516 208844 343136 365394 283112
17180B83112j60904J1116N2237q0951J9539L9090m0640M655n60j69283p3701l741
$$ 283112 122208 133324 185561 104610 124149 163239 122599 127254 126694 -42589 -116290 -120031
17168a20031N6293O0847m299O9872n7126L6162P5671j36576j8608K3348n0747
$$ -120031 -63738 -2891 -7190 62682 5556 41718 117389 -19187 -37795 -14447 -65194
17157f5194Q1558N5478q8137k2152J3314p343P1332k706j35213r1749Q1475R9583
$$ -65194 16364 71842 -16295 -38447 -25133 -32476 38856 36150 -99063 -190812 -109337 -9754
17145i754P4155R5062N5003K9519M3491m8560P3140r755l6716r1525j09071j8669
$$ -9754 64401 159463 214466 243985 287476 238916 312056 302301 265585 174060 64989 46320
17133D6320Q0760J37125J5421J1384M312k6865n5550j82616j09974n3411l9059
$$ 46320 127080 264205 279626 291010 295322 268457 212907 30291 -79683 -133094 -172153
17122a72153l2145J6840P2808j0084j7582P0118J06614k4308j4642o1044p8100
$$ -172153 -204298 -187458 -114650 -124734 -142316 -72198 34416 10108 -4534 -65578 -143678
17111a43678K763J2445o1426J658N8166O6801K127l6601m2826Q0412o3340K9911
$$ -143678 -140915 -128470 -189896 -188238 -130072 -63271 -61144 -97745 -140571 -60159 -123499 -93588
17099i3588l4431O4647Q2594j96600j78582o418L8224L3464j02340J10058J28250
$$ -93588 -128019 -63372 19222 -177378 -355960 -362378 -324154 -290690 -393030 -282972 -154722
17088a54722j06694q143J15764j6206k4400K3438n7993P4003q6240J64235K18748
$$ -154722 -261416 -269559 -153795 -170001 -194401 -170963 -228956 -154953 -241193 -76958 141790
17077A41790L6907j0643o5789j18909k7345l7599P7225L1190m316j84125j2824
$$ 141790 178697 168054 102265 -16644 -43989 -81588 -4363 26827 22511 -161614 -174438
17066a74438J30206J78k8672p9899l2964Q0683R8498l6857j691O4610o020L2101
$$ -174438 -44232 -44054 -72726 -152625 -185589 -104906 -6408 -43265 -44956 19654 13634 45735
17054D5735L8918J6209p9811K160L0806j9387J22509M7798l3991k1703P270L8617
$$ 45735 84653 100862 21051 23211 54017 34630 157139 204937 170946 149243 156513 195130
17042A95130L1899J41175J1523m7427Q215M2954M4992K2041j08232k9948K868
$$ 195130 227029 368204 379727 332300 340515 383469 428461 450502 342270 312322 315190
17031C15190q4612l6950N6284k6085N1238M827j32857l4954J1412R8047o286r2462
$$ 315190 230578 193628 249912 223827 275065 279892 147035 112081 123493 221540 215254 122792
17019A22792r1889k2579O077l4528j11599k8949L0375o148K5472q0991m7420K0681
$$ 122792 30903 8324 14401 -20127 -131726 -160675 -130300 -136448 -110976 -191967 -239387 -218706
17007b18706j9504K5860J32180J15356O5030k16032j26024M9487O3960k643l0698
$$ -218706 -238210 -212350 -80170 35186 100216 -115816 -241840 -192353 -128393 -131036 -161734
16996a61734n5740N6655J8699k5738J8157L2489M4711O1606N0595l8536Q895l4147
$$ -161734 -217474 -160819 -142120 -167858 -149701 -117212 -72501 -10895 39700 1164 10059 -24088
16984b4088j6490q0082j31698k4492j7823R5167J74824j3194j3961O6174J10365
$$ -24088 -40578 -120660 -252358 -276850 -294673 -199506 -24682 -37876 -51837 14337 124702
16973A24702r8884r7662k5050N2804L0445M8286r6913r8720P8705K6839n3834
$$ 124702 25818 -71844 -96894 -44090 -13645 34641 -62272 -160992 -82287 -55448 -109282
16962a09282M4529j23359J15839K9979L1874n8036N1550N4329K7062m2826j19039
$$ -109282 -64753 -188112 -72273 -42294 -10420 -68456 -16906 37423 64485 21659 -97380
16951i7380p8815K9165R9506l5198o416p163L5486J9165J1256j4415j2358O9998
$$ -97380 -176195 -147030 -47524 -82722 -89138 -96301 -60815 -41650 -30394 -44809 -57167 12831
16939A2831J66962O4008n259K4740Q1830K4098r2344j9494R1640O7937k1525r8525
$$ 12831 179793 243801 238542 263282 345112 369210 276866 257372 349012 416949 395424 296899
16927B96899j11015n5345j3444j14226J9335R389r4208o9876q673L1991J05552
$$ 296899 185884 130539 117095 2869 22204 31593 -62615 -132491 -141164 -109173 -3621
16916c621J09215k339l4428q5701R403J00596K3717j9486j49588q1771K9838j4180
$$ -3621 105594 103255 68827 -16874 -7471 93125 116842 97356 -52232 -134003 -104165 -118345
16904a18345j6916l0717q4402j07055N8619l3075P5559J63463O4870O3498j8642
$$ -118345 -135261 -165978 -250380 -357435 -298816 -331891 -256332 -92869 -27999 35499 16857
16893A6857o2187k389P6278J05911J9873r8254r0417O7280K3257O659m6814o3824
$$ 16857 -45330 -47719 28559 134470 154343 56089 -34328 32952 56209 62868 16054 -47770
16881d7770K9766J06010P1108K744n6809j1057N4825o9989o4636M0403N7156L6453
$$ -47770 -18004 88006 159114 161858 105049 93992 148817 78828 14192 54595 111751 148204
16869A48204O9518N2472p6592L6482n7464P0081j11566p6280L7091J6113J5285
$$ 148204 217722 270194 193602 230084 172620 242701 131135 54855 91946 108059 123344
16858A23344J7622q8200J6114j72681n762j8794o1432K2087O1469J27183j929
$$ 123344 140966 52766 68880 -103801 -109563 -128357 -189789 -167702 -106233 20950 19021
16847A9021j06697l3237q9540p1048L3014J3333j5052J7318Q2803j06877L9937
$$ 19021 -87676 -120913 -210453 -281501 -248487 -235154 -250206 -232888 -150085 -256962 -217025
16836b17025P2096M0279L9320K2278r1051j24357Q3044J22473k5970o8790Q2037
$$ -217025 -144929 -104650 -65330 -43052 -134103 -258460 -175416 -52943 -78913 -147703 -65666
16825f5666R0454J04782O926j61033j09690M0824p4626o1418N1520j25648L0108
$$ -65666 24788 129570 136496 -24537 -134227 -93403 -168029 -229447 -177927 -303575 -273467
16814b73467J07037J4673p5212j7096L1025N2767N874O9221p09k9146L991J0316
$$ -273467 -166430 -151757 -226969 -244065 -213040 -160273 -154399 -85178 -85887 -115033 -111042 -100726
16802a00726p4140r8653j6113J45186J07647k3776M4197R0820j4339o1701O238
$$ -100726 -174866 -273519 -289632 -144446 -36799 -60575 -16378 74442 60103 -1598 4640
16791D640j3472m0049R654l860o2870r2953P0077N1595n678P518K9468K7891o8103
$$ 4640 -8832 -48881 -39227 -43087 -105957 -198910 -128833 -77238 -82916 -75398 -45930 -18039 -86142
16778h6142q214M7081l8415K3512Q727k9834K3030l7962q2224l350k3409J06445
$$ -86142 -94356 -47275 -85690 -62178 -53451 -83285 -60255 -98217 -180441 -183791 -207200 -100755
16766a00755P7390j8375P8573O5989R293p5674p9396n5854p6361m1472J10870
$$ -100755 -23365 -41740 36833 102822 112115 36441 -42955 -98809 -175170 -216642 -105772
16755a05772o4247l9793J70499J28123q0661j52735r6908l8937m6273L1492P814
$$ -105772 -170019 -209812 -39313 88810 8149 -144586 -241494 -280431 -326704 -295212 -287398
16744b87398m6515l601J1301R109J05675K169l5879l1245l0128R595j22613q6581
$$ -287398 -333913 -337514 -326213 -317104 -211429 -209260 -245139 -276384 -306512 -296917 -419530 -506111
16732e06111J09205J67743Q4616j8558p2226K1063P5116J15148R7345n2362O14
$$ -506111 -396906 -229163 -144547 -163105 -235331 -214268 -139152 -24004 73341 20979 21593
16721B1593j9742Q7204J1801P9390l7906j16291M5438O5889j58183j32284L0514
$$ 21593 1851 89055 100856 180246 142340 26049 71487 137376 -20807 -153091 -122577
16710a22577q4360J4563O5536N3457o5162P9400R6646q1679j29846p073M4783
$$ -122577 -206937 -192374 -126838 -73381 -138543 -59143 37503 -44176 -174022 -181095 -136312
16699a36312k6047J61965J02481m5381j38444R3953K0737o8338q4071k36018J1851
$$ -136312 -162359 -394 102087 56706 -81738 12215 32952 -35386 -119457 -355475 -343624
16688c43624J97039J04505O4579n2717j62524j76547P1092J97967J48392l6796
$$ -343624 -146585 -42080 22499 -30218 -192742 -369289 -298197 -100230 48162 11366
16678A1366o0424N2620J3426k9223M354N9840K3335r940j12290m745j5555Q5224
$$ 11366 -49058 3562 16988 -12235 -7881 51959 75294 65354 -46936 -51681 -67236 17988
16666A7988m757K531M0j720J9104L4187L5710p5074R679K8854r8431j30458l7818
$$ 17988 13231 15762 15802 14082 33186 67373 103083 28009 37688 66542 -31889 -162347 -200165
16653b00165j4724N6145Q9736p7750l946Q579j9461M995J44257Q6829o7116n0016
$$ -200165 -214889 -158744 -69008 -146758 -150704 -142125 -161586 -156591 -12334 74495 7379 -42637
16641d2637K0566k4496o1577l0900m6192J01471P3739O85l7781K9991J4294r5406
$$ -42637 -22071 -46567 -108144 -139044 -185236 -83765 -10026 -9341 -47122 -17131 -2837 -98243
16629i8243p033J18953K6811k9739J9914K9051l3004n4374j09158k4341Q9049
$$ -98243 -105276 13677 40488 10749 30663 59714 26710 -27664 -136822 -161163 -72114
16618g2114M2734L0387n7295k0280J1734m3207L0817o1159m4449L9512J83302
$$ -72114 -29380 1007 -56288 -76568 -64834 -108041 -77224 -138383 -182832 -143320 39982
16607C9982j3079j04508n3725n761K1376R8646K4611q944Q5920l1287l7121P1854
$$ 39982 26903 -77605 -131330 -137091 -115715 -17069 7542 -1402 84518 53231 16110 87964
16595H7964j14597N6294J5391m6444p2166M6038Q7079K1597q4535o0312r685P6368
$$ 87964 -26633 29661 45052 -1392 -73558 -27520 59559 81156 -3379 -63691 -73376 2992
16583B992M5200J12656j18667j44349r1752O9019O8744k1201j5675O9069P224
$$ 2992 48192 160848 42181 -102168 -193920 -124901 -56157 -77358 -93033 -23964 -16740
16572a6740j13905m9501j7140J00433k3667j08180L38R4048J37491L3832n4172
$$ -16740 -130645 -180146 -197286 -96853 -120520 -228700 -228362 -134314 3177 37009 -17163
16561a7163K7320o465Q9681J2348j4494O720p4406q906J04554L8751j11261J2135
$$ -17163 10157 3692 93373 105721 91227 97947 23541 14635 119189 157940 46679 58814
16549E8814J96101o613j67501o1579Q204L6034l4454j3082J09511J05988o8657
$$ 58814 254915 248302 80801 19222 27426 63460 29006 15924 125435 231423 162766
16538A62766l8151p006o191r8399j60583J11862P2555l1164M286L8142l9000l0576
$$ 162766 124615 117609 111418 13019 -147564 -35702 36853 5689 9975 48117 9117 -21459
16526b1459o9262j47873j9303N0891L9154N9317L1999K8517j0801l2752l4874
$$ -21459 -90721 -238594 -257897 -207006 -167852 -108535 -76536 -48019 -58820 -91572 -126446
16515a26446J66554J1358k0219k4265l8941J02040j52764m4641M0041K1938J9237
$$ -126446 40108 51466 31247 6982 -31959 70081 -82683 -127324 -87283 -65345 -46108
16504d6108K8320j0155J16432j5280j143j08633L5539n8605M850K6312K9197R335
$$ -46108 -17788 -27943 88489 73209 72066 -36567 -1028 -59633 -54783 -28471 726 10061
16492A0061q0821O0105M2270p7101j20512m3222l442K6869O3323K1460P5409m2342
$$ 10061 -70760 -10655 31615 -45486 -165998 -209220 -212662 -185793 -122470 -101010 -25601 -67943
16480f7943K913J5067n6913l5609J7080J76085K9843O134o9272m7364k7751n4136
$$ -67943 -65030 -49963 -106876 -142485 -125405 50680 80523 86657 17385 -29979 -57730 -111866
16468a11866j04803R2559J96312k1453j38372n8039R0300J19325m9132o8597K8374
$$ -111866 -216669 -124110 72202 50749 -87623 -145662 -55362 63963 14831 -53766 -25392
16457b5392J5864j88430r2172j4860M1573n6024k2420K07164O8960j30473n7492
$$ -25392 -9528 -197958 -290130 -304990 -263417 -319441 -341861 -134697 -65737 -196210 -253702
16446b53702J2134j6189j2576j1544Q183M9086K0346J80033J231l1040m4516l7920
$$ -253702 -241568 -257757 -270333 -281877 -273694 -224608 -204262 -24229 -22998 -54038 -98554 -136474
16434a36474K0599P1101P9395l6248j90822K5733Q5411J12251K8062n0280J5522
$$ -136474 -115875 -44774 34621 -1627 -192449 -166716 -81305 30946 59008 8728 24250
16423B4250P854p9158j64381j48758Q6654M5398M3535P2670k7687L5367k7604
$$ 24250 32104 -47054 -211435 -360193 -273539 -228141 -184606 -111936 -139623 -104256 -131860
16412a31860N5157j08063K2469R2060K9424j07436J09890Q0410m4728n5740l6179
$$ -131860 -76703 -184766 -162297 -70237 -40813 -148249 -38359 42051 -2677 -58417 -94596
16401i4596P1005j3306m7985j67479l0446J82587J19247p7861k432r395o0226
$$ -94596 -23591 -36897 -84882 -252361 -282807 -100220 19027 -58834 -61266 -70661 -130887
16390a30887l4874J3238j6866m1691J18203R6829Q7326N2260k4649j76848q1035
$$ -130887 -165761 -152523 -169389 -211080 -92877 3952 91278 143538 118889 -57959 -138994
16379a38994J1543J67900J86445Q6670j11503j22012p8632O7482O2135j23120
$$ -138994 -127451 40449 226894 313564 202061 80049 1417 68899 131034 7914
16369G914j49314J932R6717Q6732l1717j50809j17365j15924J57057J65385J6116
$$ 7914 -141400 -139468 -42751 43981 12264 -138545 -255910 -371834 -214777 -49392 -33276
16358c3276M5485M3745n6300q0748K5776N1906L9789K614m3012j37691o6074j7294
$$ -33276 12209 55954 -346 -81094 -55318 -3412 36377 38991 -4021 -141712 -207786 -225080
16346b25080J45002J20082n2637p955m9615M2805K9229q8026j6494O1381o7429
$$ -225080 -80078 40004 -12633 -20588 -70203 -27398 1831 -86195 -102689 -41308 -108737
16335a08737o2917m1914J4870n7695k5811K5924R4017P4177L3848o7469n6631
$$ -108737 -171654 -213568 -198698 -256393 -282204 -256280 -162263 -88086 -54238 -121707 -178338
16324a78338j40299k0706N4574R1690J07683R4478J1503L0862K8486k7406q402
$$ -178338 -318637 -339343 -284769 -193079 -85396 9082 20585 51447 79933 52527 44125
16313D4125o0621q2377k8874K1918N1503Q0202r1192j06734m0231O7066J75956
$$ 44125 -16496 -98873 -127747 -105829 -54326 25876 -65316 -172050 -212281 -145215 30741
16302C0741L3605j0657q3109J3396m8114l3731j2118r6922l3406O9588R9781n5525
$$ 30741 64346 53689 -29420 -16024 -64138 -97869 -109987 -206909 -240315 -170727 -70946 -126471
16290a26471j1135M7225k0416l531O0940J02172j23548m2424o1158l0228o6595
$$ -126471 -137606 -90381 -110797 -114328 -53388 48784 -74764 -117188 -178346 -208574 -275169
16279b75169j7697K1936K2396Q7831M3330K1853J8289o4424j716J54903R7516
$$ -275169 -292866 -270930 -248534 -160703 -117373 -95520 -77231 -141655 -143371 11532 109048
16268A09048k12190j35924N4641R2042K0953M938k8529p906p6444K9965J29563
$$ 109048 -103142 -239066 -184425 -92383 -71430 -66492 -95021 -102927 -179371 -149406 -19843
16257a9843k5396P811K4951L659R734J9425Q3923L6715M643j1921j03838j4835
$$ -19843 -45239 -37428 -12477 -8818 916 20341 104264 140979 145622 133701 29863 15028
16245A5028j02742n8597O3387P8334l4172J0765K442P5468O4418n1397j9602m2064
$$ 15028 -87714 -146311 -82924 -4590 -38762 -27997 -25555 49913 114331 62934 43332 1268
16233A268L7832J23245K3541j69354j35116Q8118J1734q1218k870m4560J17118
$$ 1268 39100 162345 185886 16532 -118584 -30466 -18732 -99950 -102820 -147380 -30262
16222c0262J45155K3155j36841l5163j9798l987o3449R0003K7047l2290r7584
$$ -30262 114893 138048 1207 -33956 -53754 -57741 -121190 -31187 -4140 -36430 -134014
16211a34014l0237j4583N401o8038m2588M3815J15554m9347j65870K7434L9305
$$ -134014 -164251 -178834 -173433 -241471 -284059 -240244 -124690 -174037 -339907 -312473 -273168
16200b73168J534N8905P2788J08520K7044j03294k5620L7992m354j41979q902
$$ -273168 -271634 -212729 -139941 -31421 -4377 -107671 -133291 -95299 -99653 -241632 -250534
16189b50534J02329J93461J19747m9242j78824p1693O2842Q7777N1416q0464j69822
$$ -250534 -148205 45256 165003 115761 -63063 -134756 -71914 15863 67279 -13185 -183007
16178a83007r1431M8100J91833J75825N1271j24542j66556p582J46338L6283Q5190
$$ -183007 -274438 -226338 -34505 141320 192591 68049 -98507 -106089 40249 76532 161722
16167A61722p7178j23252m8681L7566P1952J13264r3681o8083l6500o0152n0350
$$ 161722 84544 -38708 -87389 -49823 22129 135393 41712 -26371 -62871 -123023 -173373
16156a73373j967k2755M5600P3361o7018m7551K4473j8516K1341j3046J6559O7391
$$ -173373 -175340 -198095 -152495 -79134 -146152 -193703 -169230 -187746 -166405 -179451 -162892 -95501
16144i5501m2517O9687N5505q0512j93159p803J61540J13937j3688M2356L6360
$$ -95501 -138018 -68331 -12826 -93338 -286497 -294300 -132760 -18823 -32511 9845 46205
16133D6205p5411N557L5686k1342N0333o2041P819j1335J20743M7646l3702k5513
$$ 46205 -29206 -23649 12037 -9305 41028 -21013 -13194 -24529 96214 143860 110158 84645
16121H4645p5053L362n7752J3872k83o2889N0767j6912K912J7408R392Q4865J828
$$ 84645 9592 12954 -44798 -30926 -31209 -94098 -43331 -60243 -57331 -39923 -30531 54334 56162
16108E6162k9353k2570J0177q9180q3845M4507J1262J7461p510R0162J9960O0321
$$ 56162 26809 4239 14416 -74764 -158609 -114102 -102840 -85379 -92889 -2727 17233 77554
16096G7554p7300k14458r264J14329J8828q614N8311j7512j308k1252o6616j13934
$$ 77554 254 -214204 -223468 -109139 -90311 -98925 -40614 -58126 -59434 -80686 -147302 -261236
16084b61236J00626N4480p3091r3991M117Q5876J11195N2943l2530L4013J03491
$$ -261236 -160610 -106130 -179221 -273212 -269095 -183219 -72024 -19081 -51611 -17598 85893
16073H5893J28967p3989j10072N1269M025j3843o6424N4572k8559P3494J11803
$$ 85893 214860 140871 30799 82068 86093 72250 5826 60398 31839 105333 217136
16062B17136j24640j08227Q0781j5702n5239j17249j0977P6553R1773J1878m0654
$$ 217136 92496 -15731 65050 49348 -5891 -123140 -134117 -57564 34209 46087 5433
16051E433j04286J03416J29614j02883j6939p5835L4535K8141J7769k3412n3768
$$ 5433 -98853 4563 134177 31294 14355 -61480 -26945 1196 18965 -4447 -58215
16040e8215o0435k1275L1371q3567o964R2701J43094o8349q5121m6064Q1752R5806
$$ -58215 -118650 -139925 -108554 -192121 -199085 -106384 36710 -31639 -116760 -162824 -81072 14734
16028A4734n9172k7270j6585r4346N4302l0807Q7777J2001j18905p1710N8010
$$ 14734 -44438 -71708 -88293 -182639 -128337 -159144 -71367 -59366 -178271 -249981 -191971
16017a91971o1868P1909J03452j4793N232J98456O1200j07788k1019M9888j64297
$$ -191971 -253839 -181930 -78478 -93271 -88039 110417 171617 63829 42810 92698 -71599
16006g1599n1799Q7776J07598o8650j82784r6981M6872P6868J33588O573n8931
$$ -71599 -123398 -35622 71976 3326 -179458 -276439 -229567 -152699 -19111 -12538 -71469
15995g1469k7808J5501k1893k1572K6391N9608n7718o4870l6736J4574Q8405Q8518
$$ -71469 -99277 -83776 -105669 -127241 -100850 -41242 -98960 -163830 -200566 -185992 -97587 -9069
15983i069r5516J2636R7568m5535m3504l6471N1767K6397n8938n7256j1118Q4755
$$ -9069 -104585 -91949 5619 -39916 -83420 -119891 -68124 -41727 -100665 -157921 -169039 -84284
15971h4284J12074M8208P1805J4748n5544j91374j44588m476j5621J4848J8875
$$ -84284 27790 75998 147803 162551 107007 -84367 -228955 -233431 -249052 -234204 -215329
15960b15329j00513P6733R4167R6510L6167M519Q4788L1185j45864j34215q3672
$$ -215329 -315842 -239109 -144942 -48432 -12265 -7746 77042 108227 -37637 -171852 -255524
15949b55524J15662L7038Q3602n4057j3177N5068n918n5343J16970J28795l3422
$$ -255524 -139862 -102824 -19222 -73279 -86456 -31388 -37306 -92649 24321 153116 119694
15938A19694j41966j08747J2114J49761P7670O9136J61754q7307j74121j05016
$$ 119694 -22272 -131019 -118905 30856 108526 177662 339416 252109 77988 -27028
15928b7028O4716r8762j53719N3284P9393L002J3283k1305M2821J5548p9523l8779
$$ -27028 37688 -61074 -214793 -161509 -82116 -79114 -65831 -87136 -44315 -28767 -108290 -147069
15916a47069J3987K6691j3838L7854l4610J41857l2838j21047l6175M314Q6420
$$ -147069 -133082 -106391 -120229 -82375 -116985 24872 -7966 -129013 -165188 -160874 -74454
15905g4454L7867R5256j3104q9054j20348L210J75420J29328O6084m2685l3665
$$ -74454 -36587 58669 45565 -43489 -163837 -160627 14793 144121 210205 167520 133855
15894A33855m9019j82524q0566K4345N6573n4139r3868m8930o4981K9738K0223
$$ 133855 84836 -97688 -178254 -153909 -97336 -151475 -245343 -294273 -359254 -329516 -309293
15883c09293l4964q612J52142J12038J80653J33009j15110K3285k9676o6832l8813
$$ -309293 -344257 -352869 -200727 -88689 91964 224973 109863 133148 103472 36640 -2173
15872b173K8734o465p6557L7264N6208r3062J4054N6461j22332N8646O1655j23941
$$ -2173 26561 20096 -56461 -19197 37011 -56051 -41997 14464 -107868 -49222 12433 -111508
15860a11508o853J72371j12844O8799K6011j42415N3443N4788k3858L6502M7892
$$ -111508 -118361 54010 -58834 9965 35976 -106439 -52996 1792 -22066 14436 62328
15849F2328N9467p8132q0498O626n5581Q1460j4188l7172n5221l4034j0576q8541
$$ 62328 121795 43663 -36835 -30209 -85790 -4330 -18518 -55690 -110911 -144945 -155521 -244062
15837b44062j0389M1861j9962R5241J8520N2088L2385M6472J7370o5871n4409
$$ -244062 -254451 -212590 -232552 -137311 -118791 -66703 -34318 12154 29524 -36347 -90756
15826i0756L2166Q6080q1981q511K01394J8574k0954j27118j25086M6753Q6083
$$ -90756 -58590 27490 -54491 -63002 138392 156966 136012 8894 -116192 -69439 16644
15815A6644m9231q3357J24573M5500L4373j61971M9538J64921L3563o4590M1557
$$ 16644 -32587 -115944 8629 54129 88502 -73469 -23931 140990 174553 109963 151520
15804A51520j55622j54392R0025Q5063Q6701l2055o6833N1057k6601N3883R0248
$$ 151520 -4102 -158494 -68469 16594 103295 71240 4407 55464 28863 82746 172994
15793A72994m2132k0362J21776j18412j93592j59693M7497M3335P4218R0222q901
$$ 172994 130862 110500 232276 113864 -79728 -239421 -191924 -148589 -74371 15851 6950
15782F950L493j4187j13529O1790L8026O1373M4077M0736J1427M1029m9645r2857
$$ 6950 10443 -3744 -117273 -55483 -17457 43916 87993 128729 140156 181185 131540 38683
15770C8683j53537j29730L4113J85077J43964K9289o6004o2656p5358L6808j5296
$$ 38683 -114854 -244584 -210471 -25394 118570 147859 81855 19199 -56159 -19351 -34647
15759c4647l1338N1606M5391N658k2446n5931J16670K9971j11277m2568j6446
$$ -34647 -65985 -14379 31012 36670 14224 -41707 74963 104934 -6343 -48911 -65357
15748f5357k7168j06123J18781K3004j5201N0816L3820m0852M1773o2945n4853
$$ -65357 -92525 -198648 -79867 -56863 -72064 -21248 12572 -28280 13493 -49452 -104305
15737a04305K42164N4068j41637j1511j32856o2879K9230m2525J6944J27168K7084
$$ -104305 137859 191927 50290 38779 -94077 -156956 -127726 -170251 -153307 -26139 945
15726I45J2210j7344m6687j7759R9837J14565o5790j31247k445N3522M5228j44
$$ 945 13155 -4189 -50876 -68635 31202 145767 79977 -51270 -53715 -193 45035 44891
15714D4891R083n8839R999J7622R6769J5596p9504j2980j79883R401Q9760J50050
$$ 44891 53974 -4865 5134 22756 119525 135121 55617 42637 -137246 -127845 -38085 111965
15702A11965J3533k118l2386l1915L7623j7152p0119n4054j30946J9367J56278
$$ 111965 125498 123380 90994 59079 96702 79550 9431 -44623 -175569 -156202 76
15691G6R9548j4025l4362q0620q1023J1147k3162K9146p0986j5945o3043M7657
$$ 76 99624 85599 51237 -29383 -110406 -99259 -122421 -93275 -164261 -180206 -243249 -195592
15679a95592J1963J32548J7751n4081J08002j3709J7703L412L4279m3227l2856
$$ -195592 -183629 -51081 -33330 -87411 20591 6882 24585 27997 62276 19049 -13807
15668a3807j45934L358M4946J18581N5523m4068O3151k3808m7553n221P7009L601
$$ -13807 -159741 -156383 -111437 7144 62667 18599 81750 57942 10389 5168 82177 85778
15656H5778j57029j7175Q3994J39314K8739O4222j11788l2430j16868M956q8919
$$ 85778 -71251 -88426 -4432 134882 163621 227843 116055 83625 -33243 -28287 -117206
15645a17206k2020j7151k6604l1030M1812K2074M3922J15773Q8145m0415O5920
$$ -117206 -139226 -156377 -182981 -214011 -172199 -150125 -106203 9570 97715 57300 123220
15634A23220R350j41382n4606o5285j52373k6130K25375J75596l1053j14021n3619
$$ 123220 132570 -8812 -63418 -128703 -281076 -307206 -81831 93765 62712 -51309 -104928
15623a04928J2550l2629J3264p254M7825n274r5815Q1207L6669J4101P7443R3955
$$ -104928 -92378 -125007 -111743 -118997 -71172 -76446 -172261 -91054 -54385 -40284 37159 131114
15611A31114j8180j06225j29320n6385J4112O3704P178j1167N8294m2157n1143
$$ 131114 112934 6709 -122611 -178996 -164884 -101180 -94002 -105169 -46875 -89032 -140175
15600a40175K8171P6522R9066K1968k947K7709o9501j01581Q9397L8030j62310
$$ -140175 -112004 -35482 63584 85552 82605 110314 40813 -60768 28629 66659 -95651
15589i5651k7097O8015Q3546o8390m7943j8209n9311J2234l0721k8705j4097J8085
$$ -95651 -122748 -54733 28813 -39577 -87520 -105729 -165040 -152806 -183527 -212232 -226329 -208244
15577b08244L3311K10109J27615l1631N850J19588j09215j71306P3582J1550m4438
$$ -208244 -174933 35176 162791 131160 137010 256598 147383 -23923 49659 61209 16771
15566A6771m3505Q7872R4373o5353r0234k776k8495j0096j5327K1902M7709J8960
$$ 16771 -26734 61138 155511 90158 -76 -2852 -31347 -41443 -56770 -34868 12841 31801
15554C1801o8524n1732J08307J7573j35975j017k0437L2224P2667r080n3551j0359
$$ 31801 -36723 -88455 19852 37425 -98550 -99567 -120004 -87780 -15113 -24193 -77744 -88103
15542h8103K6700k03o8142N2276N866M5586n1622j4493L6129K2407l3734p2431
$$ -88103 -61403 -61606 -129748 -77472 -71606 -26020 -77642 -92135 -56006 -33599 -67333 -139764
15530a39764j0028o7536m1558P2147P585m1457l6169L3416J98917J06048r1242
$$ -139764 -149792 -217328 -258886 -186739 -179154 -220611 -256780 -223364 -24447 81601 -9641
15519i641m0217q6995l5486J53724J27219l9658m3405m2562j8465N172M1570o5446
$$ -9641 -49858 -136853 -172339 -18615 108604 68946 25541 -17021 -35486 -30314 11256 -54190
15507e4190j1139N2387M8328m7753K9813l6457l9739n6545q377P7518M7420J880
$$ -54190 -65329 -12942 35386 -12367 17446 -19011 -58750 -115295 -123672 -46154 1266 3146
15495C146n8223O4035Q2999J1995l2411q031K3312R3105j45751p6931q1870K0276
$$ 3146 -55077 8958 91957 103952 71541 63510 86822 179927 34176 -42755 -124625 -104349
15483a04349R8927M9849j4738J40830N5622j82815j38980l4236P2986Q693J7116
$$ -104349 -5422 44427 29689 170519 226141 43326 -95654 -129890 -56904 -48211 -31095
15472c1095N0928K2223r5066o4734k9550l1361K3683j46553l2062k8920L4051
$$ -31095 19833 42056 -53010 -117744 -147294 -178655 -154972 -301525 -333587 -362507 -328456
15461c28456J11770M5498K9261o4395k4870J7520k4344N270j18071N6721O2998
$$ -328456 -216686 -171188 -141927 -206322 -231192 -213672 -238016 -232746 -350817 -294096 -231098
15450b31098P0855L8581P8641n3385N5785J241M0171j09871q437L7659r527N6271
$$ -231098 -160243 -121662 -43021 -96406 -40621 -39380 791 -109080 -117517 -79858 -89385 -33114
15438c3114j68245j71733L7657K1141M0448R5173J33920J27201o1057k7473r5159
$$ -33114 -201359 -373092 -335435 -314294 -273846 -178673 -44753 82448 21391 -6082 -101241
15427a01241q1381l9075L9779N6441j2182J15851J25939m0977j76986l2394R0224
$$ -101241 -182622 -221697 -181918 -125477 -137659 -21808 104131 63154 -113832 -146226 -56002
15416e6002Q6821N2909J1343m2481L4866j7478k4654L4495n943j23496r4640J31813
$$ -56002 30819 83728 95071 52590 87456 69978 45324 79819 73876 -49620 -144260 -12447
15404a2447L4265j13889l6903N8639j3395j7799Q4228Q6615p9894j77350p3312
$$ -12447 21818 -92071 -128974 -70335 -83730 -101529 -17301 69314 -10580 -187930 -261242
15393b61242O4700O8269K9440P2162p576j13834K2850K2690R5468J15084k9844
$$ -261242 -196542 -128273 -98833 -26671 -34247 -148081 -125231 -102541 -7073 108011 78167
15382G8167N8146l7671M4514O8662j06026r6304L0028j23297Q723J49772M3636
$$ 78167 136313 98642 143156 211818 105792 9488 39516 -83781 -75058 74714 118350
15371A18350N8982q6623n1414M4907L6133Q4850n7233l6039j68520j42669J177
$$ 118350 177332 90709 39295 84202 120335 205185 147952 111913 -56607 -199276 -198099
15360a98099N6393J06212K7658K6984L2687m9139l70N2786p9603P171J8801N113
$$ -198099 -141706 -35494 -7836 19148 51835 2696 2326 55112 -24491 -17320 1481 6594
15348F594O6454K0264l3345l6143k3237j05435m5221n1478J2821j4002N9062N1421
$$ 6594 73048 93312 59967 23824 587 -104848 -150069 -201547 -188726 -202728 -143666 -92245
15336i2245q098J8444p023J529M3882M1919k8011k2123j484r28l9861N4685k4187
$$ -92245 -100343 -81899 -88922 -87393 -43511 -1592 -29603 -51726 -53210 -54138 -93999 -39314 -63501
15323f3501k3590P949M0179m1486P8158J4807L5281m3273m8759N8876r6378L5839
$$ -63501 -87091 -79142 -38963 -80449 -2291 12516 47797 4524 -44235 14641 -81737 -45898
15311d5898l6235p809o1825Q0521J21063p0954n2286N6777M4061K6946J4905N0060
$$ -45898 -82133 -89942 -151767 -71246 49817 -21137 -73423 -16646 27415 54361 69266 119326
15299A19326L7274r5688j20655n0970q321J404N1914o9708r9513J04299Q5009
$$ 119326 156600 60912 -59743 -110713 -119034 -117630 -65716 -135424 -234937 -130638 -45629
15288d5629R3575L4685N8578M5541M8658p9507j18550N3730q5725j21707O0059
$$ -45629 47946 82631 141209 186750 235408 155901 37351 91081 5356 -116351 -56292
15277e6292K5304Q7705M9743m1928m9827R2711O6833j51218j01025n2224J7991
$$ -56292 -30988 56717 106460 64532 14705 107416 174249 23031 -77994 -130218 -112227
15266a12227K2051J9366M7527K06748k0662j80636k9658L2095n5696O160J29294
$$ -112227 -90176 -70810 -23283 183465 162803 -17833 -47491 -15396 -71092 -64932 64362
15255F4362J16714j13796p4640N1235m1807r6559q5880K2548P5115Q2799O0241
$$ 64362 181076 67280 -7360 43875 2068 -94491 -180371 -157823 -82708 91 60332
15244F0332M4921j06756j62139n3547M9141l5935r12j8783N6998P0720L3247K3728
$$ 60332 105253 -1503 -163642 -217189 -168048 -203983 -204895 -223678 -166680 -95960 -62713 -38985
15232c8985M1080J0303m6977m9540n0178o9538k2626Q5458J19406m919L134n054
$$ -38985 2095 12398 -34579 -84119 -134297 -203835 -226461 -141003 -21597 -26516 -23382 -28436
15220b8436Q256N9491o614m3215o9058j05230N1979N7195J3340L406M2117j6088
$$ -28436 -20180 39311 32697 -10518 -79576 -184806 -132827 -75632 -62292 -58886 -16769 -32857
15208c2857J0178o1504p2990N9474O2853j1884m14r4509J5257p222o5557N9949
$$ -32857 -22679 -84183 -157173 -97699 -34846 -46730 -47144 -141653 -126396 -133618 -199175 -139226
15196a39226J00606j2862j17766M850N1225N7514J19635m439o0148K9260J3263
$$ -139226 -38620 -51482 -169248 -164398 -113173 -55659 63976 59537 -611 28649 41912
15185D1912K9433k4878N3375L1231J9629m6868j7820o32r3660l6123j32301k2746
$$ 41912 71345 46467 99842 131073 150702 103834 86014 85382 -8278 -44401 -176702 -199448
15173a99448L9332J0144J3025R2845L1133n1343M4353M4417j5429J03100R2830
$$ -199448 -160116 -149972 -136947 -44102 -12969 -64312 -19959 24458 9029 112129 204959
15162B04959p9054q4304m9595p6635M358l9785K8069J11729Q644L8708p9537n4642
$$ 204959 125905 41601 -7994 -84629 -80271 -120056 -91987 19742 28386 67094 -12443 -67085
15150f7085k11036O8249J74492J7837N3624L9923P9500q6769j64360j1376J06876
$$ -67085 -278121 -209872 -35380 -17543 36081 76004 155504 68735 -95625 -107001 -125
15139a25O9694j28513r9486n5293Q5936K6830o4962M2490J43303j863j941m1907
$$ -125 69569 -58944 -158430 -213723 -127787 -100957 -165919 -123429 19874 18011 16070 -25837
15127b5837o6911P0352J92122N1918r7643o6199m2772n8609K559L9053q4060Q9815
$$ -25837 -92748 -22396 169726 221644 124001 57802 15030 -43579 -41020 -1967 -86027 3788
15115C788K635J495j8184K5812L7756O4803M9250j6811j13869n0101j01214L9181
$$ 3788 6423 7918 -10266 15546 53302 118105 167355 150544 36675 -13426 -114640 -75459
15103g5459K99J36783R9180J38044j8029n2065j12496j6967j19154j3562j9500
$$ -75459 -75160 61623 160803 298847 280818 228753 116257 99290 -19864 -33426 -52926
15092e2926j5405J58686J18582o9934j09300k4530q568R1846J2871j56958j2810
$$ -52926 -68331 90355 208937 139003 29703 5173 -3395 88451 101322 -55636 -68446
15081f8446k0759O6570k2297M2650n1882q185j8757R057K6439M3656N5845l7591
$$ -68446 -89205 -22635 -44932 -2282 -54164 -62349 -81106 -72049 -45610 -1954 53891 16300
15069A6300k3809L5604J7772N7473l89m4839q6004m3853n9474M0293J12614J10465
$$ 16300 -7509 28095 45867 103340 102951 58112 -27892 -71745 -131219 -90926 21688 132153
15057A32153m1265m2932j964n6237k6691K0673K8246r591n5471Q5720L6333q2262
$$ 132153 90888 47956 45992 -10245 -36936 -16263 11983 2392 -53079 32641 68974 -13288
15045a3288l5018P8640O1252M7248J6285j56874L1200l0945j10978j8116o5474
$$ -13288 -48306 30334 91586 138834 155119 -1755 29445 -1500 -112478 -130594 -196068
15034a96068J58000J15176L7650k0976L6479q9984q1197M8102M7841r4983K4930
$$ -196068 -38068 77108 114758 93782 130261 40277 -40920 7182 55023 -39960 -15030
15023a5030p2102R8242J32340j22729n1972Q5050r2513o6904P2144Q6123j00003
$$ -15030 -87132 11110 143450 20721 -31251 53799 -38714 -105618 -33474 52649 -47354
15012d7354m942j07208O0274J06021j8479n5712P9857L7554j02242N050K2954
$$ -47354 -52296 -159504 -99230 6791 -11688 -67400 12457 50011 -52231 -47181 -24227
15001b4227m1618o6839R826k9982j32996J3849J15828L3871L0731O2919J01753
$$ -24227 -65845 -132684 -122858 -152840 -285836 -271987 -156159 -122288 -91557 -28638 73115
14990G3115P7795J7758k20760j07956N273J53501J1550M6454K617O4561J74551
$$ 73115 150910 168668 -52092 -160048 -154775 -1274 10276 56730 59347 123908 298459
14979B98459O765j16367l9381N6984l7914p4604n0103n3008M3400Q4698j4325
$$ 298459 305224 188857 149476 206460 168546 93942 43839 -9169 34231 118929 104604
14968A04604q3233O6998O6411n8467k6999j40610o5906l5652N6954M7083K8281
$$ 104604 21371 88369 154780 96313 69314 -71296 -137202 -172854 -115900 -68817 -40536
14957d0536J42480j06759j33932J36273P2795q138K9933k3679j54416m0768l4530
$$ -40536 101944 -4815 -138747 -2474 70321 62183 92116 68437 -85979 -126747 -161277
14946a61277R122q3268K8784J50093R8161L4587r7383j10239K2359K1679L4632
$$ -161277 -152155 -235423 -206639 -56546 41615 76202 -21181 -131420 -109061 -87382 -52750
14935e2750P420l1252k883J16863N5891k5379j2460j26574j62367J14744K46126
$$ -52750 -45330 -76582 -79465 37398 93289 67910 55450 -71124 -233491 -118747 127379
14924A27379j6723o8283o2896m930Q8247j6044j065K077l1977q225O5599P8463
$$ 127379 110656 42373 -20523 -25453 62794 46750 45685 47762 15785 7560 73159 151622
14912A51622R4967k3059j23843q5490m1864O485m5948p6293J69174Q9718O336
$$ 151622 246589 223530 99687 14197 -27667 -21182 -67130 -143423 25751 115469 121805
14901A21805j41277o4592p4841N286P510n3399N6140Q5713o2135J6005L7340M5309
$$ 121805 -19472 -84064 -158905 -153619 -146109 -199508 -143368 -57655 -119790 -103785 -66445 -21136
14889b1136n6943M3001n6100R764R1545K0758m4067N8656m8411j1298k3147n2910
$$ -21136 -78079 -35078 -91178 -81414 10131 30889 -13178 45478 -2933 -14231 -37378 -90288
14877i0288l7433R001O9034K4942N7339m7382J6875O5244N5975P290j3380N2543
$$ -90288 -127721 -118720 -49686 -24744 32595 -14787 2088 67332 123307 130597 117217 169760
14865A69760K2392p5263j07115j24380R0967k2975j4056r1352J1327N476P6559
$$ 169760 192152 116889 9774 -114606 -23639 -46614 -60670 -152022 -140695 -135219 -58660
14854e8660K7873j1397l4841q0648j5582N5130n6409q839J8316J020j8964P3428
$$ -58660 -30787 -42184 -77025 -157673 -173255 -118125 -174534 -183373 -165057 -164037 -183001 -109573
14842a09573R9064L726J2008J31078J05603O9314p3090k06819n9885N0515M2821
$$ -109573 -10509 -6783 5225 136303 241906 311220 238130 31311 -28574 21941 64762
14831F4762j0922r28l9739P6447j0091o7034R8170Q4073j19295k7016l5131n2500
$$ 64762 53840 52912 13173 89620 79529 12495 110665 194738 75443 48427 13296 -39204
14819c9204K8277P6959K5906n4196N5095J72251j28617j05726Q5199l5612j05249
$$ -39204 -10927 66032 91938 37742 92837 265088 136471 30745 115944 80332 -24917
14808b4917K0048j384j9524L7822n6780J167l7144n7659L6033N723L1532M6791
$$ -24917 -4869 -6253 -25777 12045 -44735 -43568 -80712 -138371 -102338 -96615 -65083 -18292
14796a8292O4194J08546O600K5343q1463j45910J4622m4348K6590k2915k1213
$$ -18292 45902 154448 161048 186391 104928 -40982 -26360 -70708 -44118 -67033 -88246
14785h8246k0776r3j5835Q8802R5197Q9248n2001M9505M1244L8225n4060k14098
$$ -88246 -109022 -109115 -124950 -36148 59049 148297 96296 145801 187045 225270 171210 -42888
14773d2888q1224j1712M4270k733P4268J59330j1622j12711j84189N7693J09094
$$ -42888 -124112 -135824 -91554 -94287 -20019 139311 127689 14978 -169211 -111518 -2424
14762b424J1557Q3372R3548N8214J4979k6868o5487j9168m9395J14455O1355j5642
$$ -2424 9133 92505 186053 244267 259246 232378 166891 147723 98328 212783 274138 258496
14750B58496q9254j26472k39387m2569R9788P0877K8141N3693O0200o6171l5447
$$ 258496 169242 42770 -196617 -239186 -139398 -68521 -40380 13313 73513 7342 -28105
14739b8105R1658J19198M8120r0756o8160P942O5750l9250j44888k5509p068o9592
$$ -28105 63553 182751 230871 140115 71955 79897 145647 106397 -38491 -64000 -71068 -140660
14727a40660J18698J49747o1177n8217L2402M9596o9800j04414J901N6219Q0722
$$ -140660 -21962 127785 66608 8391 40793 90389 20589 -83825 -81924 -25705 55017
14716E5017n6284N088M0996P5728n7281o9195j4399J49j089q1351j8944M4312
$$ 55017 -1267 3821 44817 120545 63264 -5931 -20330 -20181 -21270 -102621 -121565 -77253
14704g7253Q0910N9336O4579R4386m9808k60047k1705L0032J04760M8675m7170
$$ -77253 3657 62993 127572 221958 172150 -87897 -109602 -79570 25190 73865 26695
14693B6695q174o7098k8636n6300L8700J37165o1137q9823j67464L1204k0430
$$ 26695 18521 -48577 -77213 -133513 -94813 42352 -18785 -108608 -276072 -244868 -265298
14682b65298K050n480N6344J415l3663Q7943k0917P5460J59096k0829o2224J09014
$$ -265298 -263248 -268728 -212384 -210969 -244632 -156689 -177606 -102146 56950 36121 -26103 82911
14670H2911n8509j22335k6042J30395L7375M5730N2220M1706r1024j499n5723
$$ 82911 24402 -97933 -123975 6420 43795 89525 141745 183451 92427 90928 35205
14659C5205p7515K7211L552o1698n0346J09548K1732o5052l9402J36315q392m8267
$$ 35205 -42310 -15099 -11547 -73245 -123591 -14043 7689 -57363 -96765 39550 31158 -17109
14647a7109Q5625l1227n4964l5276O7240K0261K4746R1176j596n7950l5335K3420
$$ -17109 68516 37289 -17675 -52951 14289 34550 59296 150472 148876 90926 55591 79011
14635G9011J17525K54664J97121J19434o2975k0897Q9128Q2700K7028l9994l7411
$$ 79011 196536 451200 648321 767755 704780 683883 773011 855711 882739 842745 805334
14624H05334L4087q9086j73058j52239J6547j02059l2727o5465K619L6943K0265
$$ 805334 839421 750335 577277 425038 441585 339526 306799 241334 243953 280896 301161
14613C01161l4757l976Q5700J5719k12700n5649j4134o8758j00713Q0617L5017
$$ 301161 266404 262428 348128 363847 151147 95498 81364 12606 -88107 -7490 27527
14602B7527n8937l3343N7030J49249R06n9007J12687L9459J2761J9142m458n6343
$$ 27527 -31410 -64753 -7723 141526 142432 83425 196112 235571 248332 267474 263016 206673
14590B06673o4104J53320j4149l6561k0515o2775j9367o9979j4702Q0364M3567
$$ 206673 142569 295889 281740 245179 224664 161889 142522 72543 57841 138205 181772
14579A81772j7870j3401J11582p8873K168Q4214m5521q539k2871k16536j46918
$$ 181772 163902 150501 262083 183210 185378 269592 224071 215532 192661 -23875 -170793
14568a70793J08175J22982K2157O964o0379j25730j2153l4011Q0046J37537k7494
$$ -170793 -62618 60364 82521 89485 29106 -96624 -108777 -142788 -62742 74795 47301
14557D7301M3278J0510Q7106K8279j31368j04670r659J20412j2099j02226J02991
$$ 47301 90579 101089 188195 216474 85106 -19564 -29223 91189 79090 -23136 79855
14546G9855M4381r8592p2936J02066j4881l2663L8142m8196j4142q013j24844
$$ 79855 124236 25644 -47292 54774 39893 7230 45372 -2824 -16966 -24979 -149823
14535a49823M0846J31385l2438k4398J5240L7545K1662P5041K8513R440j2549
$$ -149823 -108977 22408 -10030 -34428 -19188 18357 40019 115060 143573 153013 140464
14524A40464j23503r5461Q4737Q0766N3803k1816J22668R0973l4131N1228J00116
$$ 140464 16961 -78500 6237 87003 140806 118990 241658 332631 298500 349728 449844
14513D49844M8729L7381r4268j5562M4320J5734l6299j3898N460j03716n4190
$$ 449844 498573 535954 441686 426124 470444 486178 449879 435981 441441 337725 283535
14502B83535N883N021o7009j5708n5758j5011j2637p4343M3927n6791L133p587
$$ 283535 289418 294439 227430 211722 155964 140953 128316 53973 97900 41109 44242 36655
14490C6655j01714n7537N6634N5989L7753Q7148M1672m770j1809P1799R5726Q6610
$$ 36655 -65059 -122596 -65962 -9973 27780 114928 156600 151830 140021 211820 307546 394156
14478C94156l9087o0753m3549j23016l2342k748j57258m9546N7598J08813R808
$$ 394156 355069 294316 250767 127751 95409 92661 -64597 -114143 -56545 52268 62076
14467F2076J12338n1514l736L8195r250j32710k8258L7538j50957j08557m6709
$$ 62076 174414 122900 119164 157359 148109 15399 -12859 24679 -126278 -234835 -281544
14456b81544M9978N0043Q4513M5712j6325P6296J9850p7874M5978L2620j26823
$$ -281544 -231566 -181523 -97010 -51298 -67623 8673 28523 -49351 -3373 29247 -97576
14445i7576j0214J89123N2728m1529R9006n7841P1558J07571N6509j13372j79203
$$ -97576 -107790 81333 134061 92532 191538 133697 205255 312826 369335 255963 76760
14434G6760n7461J8364O917k8725J5261J1940l9026M1707Q3614N266L9262o4478
$$ 76760 19299 37663 44580 15855 31116 43056 4030 45737 129351 134617 173879 109401
14422A09401o1676j08739r5721Q1044J6231q1133j8571k8569P3358M1055m1150
$$ 109401 47725 -61014 -156735 -75691 -59460 -140593 -159164 -187733 -114375 -73320 -114470
14411a14470N1845J26413J500l216L5148P1841J4956j84213l8617j13138k6130
$$ -114470 -62625 63788 65288 62072 97220 169061 184017 -196 -38813 -151951 -178081
14400a78081J75842O2057j09425o1484j1292J7918l3991q8568j5570L5794N5899
$$ -178081 -2239 59818 -49607 -111091 -122383 -104465 -138456 -227024 -242594 -206800 -150901
14389a50901J40035k2794O0361M7081j12793p7569R8022J17595L6500p8401j6426
$$ -150901 -10866 -33660 26701 73782 -39011 -116580 -18558 99037 135537 57136 40710
14378D0710P560o3561N668q0434k9099R3054J65860J9139m4869M1339R431P165
$$ 40710 48270 -15291 -9623 -90057 -119156 -26102 139758 158897 114028 155367 164798 171963
14366A71963Q5778q5811j14567k8760j7830o1699M8188J8667j13394m1953J23131
$$ 171963 257741 171930 57363 28603 10773 -50926 -2738 15929 -97465 -139418 -16287
14355a6287R6949n9764j53670j4787N1545J07411K6505n1204M04R5188K7805l137
$$ -16287 80662 20898 -132772 -147559 -96014 11397 37902 -13302 -12898 82290 110095 106958
14343A06958m2031l1337j00477J8360N8561P5107K9044j2333Q989O060p4213k12502
$$ 106958 64927 33590 -66887 -48527 10034 85141 114185 101852 110841 116901 42688 -169814
14331a69814O7783Q5831N3P1338R8954q9436r3804M356R1686o895L7769M7996
$$ -169814 -102031 -16200 -16147 55191 154145 64709 -29095 -24739 66947 60052 97821 145817
14319A45817j0514m6759M5474O497K2497M927m1703K4471j16228J1897j5768k1354
$$ 145817 135303 88544 134018 140515 163012 167939 126236 150707 34479 46376 30608 9254
14307I254l2305J03646R9J6761K5130j0016j00743j9771J2261N9887N4724q4555
$$ 9254 -23051 80595 80694 97455 122585 112569 11826 -7945 4316 64203 118927 34372
14295C4372j6483O9302M0162k303J50809K3944K0358K43307L15699M68812N19497
$$ 34372 17889 87191 127353 125050 275859 299803 320161 563468 879167 1347979 1867476
14284A867476K24980M7458n7858L5206j67363l20909k75701l17133k87214j46273
$$ 1867476 2092456 2139914 2082056 2117262 1949899 1628990 1353289 1036156 748942 602669
14274F02669q0184j56672p3857j41987o7927Q9009k151L5074o9156o2442n6758
$$ 602669 522485 365813 291956 149969 82042 171051 168900 203974 134818 72376 15618
14263A5618L0000J02247j5334k9068q0150k1553M4796P0670P257n6079r3076m4028
$$ 15618 45618 147865 132531 103463 23313 1760 46556 117226 124483 68404 -24672 -68700
14251f8700J16130L8005n1485O7675l8757R705R0063O6240l4687n098P732j30160
$$ -68700 47430 85435 33950 101625 62868 72573 162636 228876 194189 189091 196823 66663
14239F6663j77534n8091K8776M8111M5609J09248L6903q9601o7243R154M6445
$$ 66663 -110871 -168962 -140186 -92075 -46466 62782 99685 10084 -57159 -48005 -1560
14228a560j2152p890K9878m439O9999J24630j4601J7290P3527P242m7348r2556
$$ -1560 -13712 -21602 8276 3837 73836 198466 183865 201155 274682 281924 234576 142020
14216A42020J7970Q5319k9921m7225L3534o4355M8807L2322q2613M523J4831m5310
$$ 142020 159990 245309 215388 168163 201697 137342 186149 218471 135858 140381 155212 109902
14204A09902j05322q3326k2508P8833L7134q914O0266m3983m8070K2326J1914
$$ 109902 4580 -78746 -101254 -22421 14713 5799 66065 22082 -25988 -3662 8252
14193H252r1300m6720J5545J25281J52748P8317o6549r7645j12621o5768k7552
$$ 8252 -83048 -129768 -114223 11058 163806 242123 175574 77929 -34692 -100460 -128012
14182a28012J16884P4022R039k7742P1743j02081j79436K6825J12564K3542K3882
$$ -128012 -11128 62894 71933 44191 115934 13853 -165583 -138758 -26194 -2652 21230
14171B1230J52716L7584j17051j50936m4127N719p0642M6580R7325L0500l5102
$$ 21230 173946 211530 94479 -56457 -100584 -94865 -165507 -118927 -21602 8898 -26204
14160b6204n8270N7289L5396J0033K6150Q3933o9137l9746R2952L0949j04247
$$ -26204 -84474 -27185 8211 18244 44394 128327 59190 19444 112396 143345 39098
14149C9098P565j162p3031L5697l7871k0261O2955N3988p7769j60229j4193R1579
$$ 39098 46663 45501 -27530 8167 -29704 -49965 12990 66978 -10791 -171020 -185213 -93634
14137i3634P0506L8104j1332N3787k975m0374M9890Q7192K5956n1815p1543j1084
$$ -93634 -23128 14976 3644 57431 54456 14082 63972 151164 177120 125305 53762 42678
14125D2678M0420M2931K6168K4864p6512j15747K0521N8393j6006K4261N2651
$$ 42678 83098 126029 152197 177061 100549 -15198 5323 63716 47710 71971 124622
14114A24622j3906m2961J31671O4957j5190j29259M4364L0473j2586K0848J04440
$$ 124622 110716 67755 199426 264383 249193 119934 164298 194771 182185 203033 307473
14103C07473j35612J082K618K0101n6935n5780k1065l5601M4573l9148J51017
$$ 307473 171861 172943 175561 195662 138727 82947 61882 26281 70854 31706 182723
14092A82723J0001j27869j7570J57985m8612P3697R4114j01184j36871p7137r151
$$ 182723 192724 64855 47285 205270 156658 230355 324469 223285 86414 9277 126
14081A26j21561K553J36510J02778J9597l1526n3213o277Q8311J06017p2974L0984
$$ 126 -121435 -118882 17628 120406 140003 108477 55264 48987 137298 243315 170341 201325
14069B01325J6845j03949k6172K02836N0721p0921L3702K1244k131R7813Q2993
$$ 201325 218170 114221 88049 290885 341606 270685 304387 325631 323500 421313 504306
14058E04306J8960m9424r4207j13396l3604O1911m918j25530l5660N9094k0991
$$ 504306 523266 473842 379635 266239 232635 294546 289628 164098 128438 187532 166541
14047A66541l6582o6668L2945L1345j0884k2273k1314j48591m2177J53977J91116
$$ 166541 129959 63291 96236 127581 116697 94424 73110 -75481 -117658 36319 227435
14036B27435p9271j19248j61866R5200R4764Q930N8403J27300J51707n476m8985
$$ 227435 148164 28916 -132950 -37750 57014 65944 124347 251647 403354 397878 348893
14025C48893j06529P2228R8478n4498j03350R5152Q7669k23392j52296N9717O6229
$$ 348893 242364 314592 413070 358572 255222 350374 438043 214651 62355 122072 188301
14014A88301J03186L3337K1796J9614m1121n2778l7893j5013M7472O117l0930
$$ 188301 291487 324824 346620 366234 325113 272335 234442 219429 266901 273018 242088
14003B42088J19827N3607j01402l8779L3641k5029K6082M2423j22274p5206l1761
$$ 242088 361915 415522 314120 275341 308982 283953 310035 352458 230184 154978 123217
13992A23217O9458Q4060R3766j28392j76422k6150r2282J61702L2361N5181O7529
$$ 123217 192675 276735 370501 242109 65687 39537 -52745 108957 141318 196499 264028
13981B64028l3552j23115j42547q9278N2472L330J61586P3715j20421p24N6875
$$ 264028 230476 107361 -35186 -124464 -71992 -68662 92924 166639 46218 45494 102369
13970A02369J35819n9679J34072P5242j5860j73221j30065Q562K6923J04724N7338
$$ 102369 238188 178509 312581 387823 371963 198742 68677 77239 104162 208886 266224
13959B66224m898N1678O8885K72q158j0784K3465l8944J5945K6033K7310r0139
$$ 266224 261326 313004 381889 382161 374003 363219 386684 347740 363685 389718 417028 326889
13947C26889p0640J18212j2268l697P7621Q1163j5865K1624m51J8285O4342J35322
$$ 326889 256249 374461 362193 358496 436117 517280 501415 523039 522588 540873 605215 740537
13935G40537J87661P2471q5657J00409J20389M8773p3269j36635j56917o1740
$$ 740537 928198 1000669 915012 1015421 1135810 1184583 1111314 974679 817762 756022
13925G56022O7137r094j46495r6729L6763n4639r0774L5474K2003N0294k2899
$$ 756022 823159 814065 667570 570841 607604 552965 462191 497665 519668 569962 547063
13914E47063r2087r2583P009N7637k5592M185m6506j3693K9752J114Q8229j7148
$$ 547063 454976 362393 369402 427039 401447 405632 359126 345433 375185 376299 464528 447380
13902D47380k1990j5644j24696J15401N9401j32826j1881q444J6028J14562M165
$$ 447380 425390 409746 285050 400451 459852 327026 315145 306701 322729 437291 441456
13891D41456l0588O3952J04005N7171q383O0569O9382j1575q784n0560n6357p1183
$$ 441456 410868 474820 578825 635996 627613 688182 757564 745989 737205 686645 630288 559105
13879E59105j8502L353K4257P8929Q1187l703m4806M0338j9590N6046n7752k9259
$$ 559105 540603 543956 568213 647142 728329 724626 679820 720158 700568 756614 698862 669603
13867F69603R9603k4681J80584m3845n5722K1499P8834m701m7475L5183N9641
$$ 669603 769206 744525 925109 881264 825542 847041 925875 921174 873699 908882 968523
13856I68523J21974J25116L785l8220J26906J85807J40618J02592M1727L2969
$$ 968523 1090497 1215613 1219398 1181178 1308084 1493891 1634509 1737101 1778828 1811797
13846A811797N3118J65678K44803L14370K77520K31317J68984J9718J10121J30911
$$ 1811797 1864915 2030593 2275396 2589766 2867286 3098603 3267587 3287305 3397426 3528337
13836C528337J48501J63606M06087M76417L64471N17947P56044P72009R64718
$$ 3528337 3676838 3840444 4246531 4722948 5087419 5605366 6361410 7133419 8098137
13827H098137J245398J460569J845470J996910K033838K259246K608526K956456
$$ 8098137 9343535 10804104 12649574 14646484 16680322 18939568 21548094 24504550
13819B4504550L802985N176166P793529J2392431K0055647L0618468M2275498
$$ 24504550 28307535 33483701 41277230 53669661 73725308 104343776 146619274
13812A46619274N3653247O0372644N8903261M7803814K7459215K592583k2901591
$$ 146619274 200272521 260645165 319548426 367352240 394811455 397404038 374502447
13805C74502447m3515677n5256688n8356773n2744532m2375497l1500882k1546959
$$ 374502447 330986770 275730082 217373309 164628777 122253280 90752398 69205439
13798F9205439j3776734r014009o244020m547298l620339l069033k690901k624558
$$ 69205439 55428705 46414696 40170676 35623378 32003039 28934006 26243105 23618547
13790B3618547k588021k346818k282946k048163j695678j464535j123368r37680
$$ 23618547 21030526 18683708 16400762 14352599 12656921 11192386 10069018 9131338
13782I131338p65266o12620p36902n99866m32414m22286m87361l43894j92523
$$ 9131338 8366072 7753452 7016550 6416684 5984270 5561984 5074623 4730729 4538206
13773D538206k19509k19275k02927j78124j68693r2759j36357p0098k5790j90209
$$ 4538206 4318697 4099422 3896495 3718371 3549678 3456919 3320562 3250464 3224674 3034465
13763C034465k30582j29438r7648j8902j72998j68444j64393o4974m4320m8741
$$ 3034465 2803883 2674445 2576797 2557895 2384897 2216453 2052060 1987086 1942766 1894025
13753A894025r1277Q57l3462q0176j07874j10370j19038l7287Q2817N3561p0532
$$ 1894025 1802748 1803605 1770143 1689967 1582093 1471723 1352685 1315398 1398215 1451776 1381244
13742A381244j87593o7499j7477o0217p6636P790k8592J7894L6867p7195j46839
$$ 1381244 1193651 1126152 1108675 1048458 971822 979612 951020 968914 1005781 928586 781747
13731G81747k7108N6720n7627O916o3508K8329q7310m7340j97049r2188R1308
$$ 781747 754639 811359 753732 760648 697140 725469 638159 590819 393770 301582 392890
13720C92890j2623j9319m0059k5362R5007R5116M8457K9850q3091l1172j6880
$$ 392890 380267 360948 320889 295527 390534 485650 534107 563957 480866 449694 432814
13709D32814N0908J9456K1762n6319m1680R797K8060q9267p8924j9745Q979N6932
$$ 432814 483722 503178 524940 468621 426941 436738 464798 375531 296607 276862 285841 342773
13697C42773n2930j00259j15936N054j2555m8086O5493J17627j12373M0029J40734
$$ 342773 289843 189584 73648 78702 66147 18061 83554 201181 88808 128837 269571
13686B69571R5494K6162q359r3578j61203K1936J12261k5837M652k8570J6274
$$ 269571 365065 391227 382868 289290 128087 150023 262284 236447 241099 212529 228803
13675B28803J17420n2330j14320o3869J29182J8254j4387K9840m1306M5242j6695
$$ 228803 346223 293893 179573 115704 244886 263140 248753 278593 237287 282529 265834
13664B65834j10688k337J01605M0000K5405j8733k7424N0346J01981J7196J6654
$$ 265834 155146 152809 254414 294414 319819 301086 273662 324008 425989 443185 459839
13653D59839j1150j19156j33226n5140L6633l8060J0309j18200l7579j7318R5483
$$ 459839 448689 329533 196307 141167 177800 139740 150049 31849 -5730 -23048 72435
13642G2435J25511k3409L2550R2523j01911j63778K59J7045r700J7418j8497o0248
$$ 72435 197946 174537 207087 299610 197699 33921 34180 51225 41525 58943 40446 -19802
13630a9802r2761l0057P3996J37496J32012Q0926r0153K6913l2100L6262o0140
$$ -19802 -112563 -142620 -68624 68872 200884 281810 191657 218570 186470 222732 162592
13619A62592k08442O0606l301o3221p0121m913m9001N9288L1496J2737R2998Q4784
$$ 162592 -45850 14756 11455 -51766 -121887 -126800 -175801 -116513 -85017 -72280 20718 105502
13607A05502J16261J21240j15551r1379r9070q8352J19141K3259o8356k0345o8252
$$ 105502 221763 343003 227452 136073 37003 -51349 67792 91051 22695 2350 -65902
13596f5902J56079k3625n6340K6366J98446k7894M7697J37040K246o5608j3048
$$ -65902 90177 66552 10212 36578 235024 207130 254827 391867 394113 328505 315457
13585C15457k7203m2391k4271l3577o7619J3871l5196Q0945Q1431j05902j3583
$$ 315457 288254 245863 221592 188015 120396 134267 99071 180016 261447 155545 141962
13574A41962j00583n8993l7715o4751O2265Q6858R1563l5383L1517P6056O4305
$$ 141962 41379 -17614 -55329 -120080 -57815 29043 120606 85223 116740 192796 257101
13563B57101Q0048P0248J35854K5064J41306J77124J838j49225j4428Q0065j3667
$$ 257101 337149 407397 543251 568315 709621 886745 888583 739358 724930 804995 791328
13552G91328k3873j32514j73793m0908k1925q0962p0150l8970J26521Q752j59555
$$ 791328 767455 634941 461148 420240 398315 317353 247203 208233 334754 343506 183951
13541A83951m032J6670q7198r4962k4022J23990N3496O9442P9033j21690q958
$$ 183951 179919 196589 109391 14429 -9593 114397 167893 237335 316368 194678 185720
13530A85720P6393j59524l1136K07818J40442P1874O8707Q0204J2196p3552p0460
$$ 185720 262113 102589 71453 279271 419713 491587 560294 640498 652694 579142 508682
13519E08682o8583k6232p0182j20546j64340o9248M5375j5698Q605J4981L4307
$$ 508682 440099 413867 343685 223139 58799 -10449 34926 19228 27833 42814 77121
13508G7121k6201o0570l4232N4827J20702j257O3685Rl8960L8237J51122j12867
$$ 77121 50920 -9650 -43882 10945 131647 130390 194075 194084 155124 193361 344483 231616
13496B31616q8850q7491j69052N6274K25404J38843j60135r3541q9245m3504K3524
$$ 231616 142766 55275 -113777 -57503 167901 306744 146609 53068 -36177 -79681 -56157
13485e6157r9311N5619N3752J42495P3108J9123j7883n1051j2032n47o7869m9725
$$ -56157 -155468 -99849 -46097 96398 169506 188629 170746 119695 107663 107116 39247 -10478
13473a0478L3229O8969L2687N7710J2362M7569q1428K1377m3073k0346k2941l2574
$$ -10478 22751 91720 124407 182117 194479 242048 160620 181997 138924 118578 95637 63063
13461F3063o7081l2627J14532J0417p7584P3897K1051m2374j03727n9907M4879
$$ 63063 -4018 -36645 77887 88304 10720 84617 105668 63294 -40433 -100340 -55461
13450e5461m0035O0289J44336N2684o5989j16869k6352J53634J07328j0100j7648
$$ -55461 -95496 -35207 109129 161813 95824 -21045 -47397 106237 213565 203465 185817
13439A85817l9905q1487j7980K094J5581N5813j2961j01967p4806J15698R9023
$$ 185817 145912 64425 46445 48539 64120 119933 106972 5005 -69801 45897 144920
13428A44920K6706j44404m1628L0544j15601k6658k1733O5480L6340n3647m7612
$$ 144920 171626 27222 -14406 16138 -99463 -126121 -147854 -82374 -46034 -99681 -147293
13417a47293J85170M6335J2232r8679j69503O016K07983O2957j56071j6539J2069
$$ -147293 37877 84212 96444 -2235 -171738 -165722 42261 105218 -50853 -67392 -55323
13406e5323M599J9812J30285R1183m1294m0658l0377j5983k468J8808k2668r3915
$$ -55323 -50724 -30912 99373 190556 149262 108604 78227 62244 59776 78584 55916 -37999
13394c7999J3023P0176J24141l8142j76970l4005J61093L0393O1787K5145l431
$$ -37999 -24976 45200 169341 131199 -45771 -79776 81317 111710 173497 198642 195211
13383A95211j40666k5120J9223J1388q0504K4891J11622J60984k9343j9852r8852
$$ 195211 54545 29425 48648 60036 -20468 4423 116045 277029 247686 227834 128982
13372A28982M3885M2932J3095J9721Q8053l963n1092K1666N4086o1356m7620J0791
$$ 128982 172867 215799 228894 248615 336668 332705 281613 303279 357365 296009 248389 259180
13360B59180k8321k7276J09192j1554j9699j17958O0499K18289J10653O0213q3116
$$ 259180 230859 203583 312775 301221 281522 163564 224063 442352 553005 613218 530102
13349E30102N3333j0929k9796l2137r7434Q2324l3259j05106m0708K5646m3596
$$ 530102 583435 572506 542710 510573 413139 495463 462204 357098 316390 342036 298440
13338B98440r188K5510J1978J20503R5290J13774K62215L30350M73037K91405
$$ 298440 289252 314762 326740 447243 542533 656307 918522 1248872 1721909 2013314
13328B013314L02638J56659l0467p3174r2315k61185m13015j80175j06814k47726
$$ 2013314 2315952 2472611 2442144 2368970 2276655 2015470 1602455 1422280 1315466 1067740
13318A067740j80276j67504m8187Q7341o5431p4121r9359r114R2966k1256j41368
$$ 1067740 887464 719960 671773 759114 693683 619562 520203 511089 604055 582799 441431
13307D41431J1756R2394J3034k3865j1265n8349k9014N154M3692j8957R391L9869
$$ 441431 453187 545581 558615 534750 523485 465136 436122 441276 484968 466011 475402 515271
13295E15271k8255n5281q2417r1523m696K6713l4677N9375J13540J1541M1820
$$ 515271 487016 431735 349318 257795 253099 279812 245135 304510 418050 429591 471411
13284D71411q9312j33399k6502J4749R4586R1466N8755L1434q8388J39891L356
$$ 471411 382099 248700 222198 236947 331533 422999 481754 513188 424800 564691 568047
13273E68047n9245k1964K7572n6479q7094N1537j0307o6946n0658M5826N7937
$$ 568047 508802 486838 514410 457931 370837 422374 412067 345121 294463 340289 398226
13262C98226J05775J0810n4421q903k4649o37J3480k6426M1892Q6152l999j8850
$$ 398226 504001 514811 460390 451487 426838 426201 439681 413255 455147 541299 537300 518450
13250E18450N8112j01287P801o8721p0282m9984N7391J36274N7256o7139m3393
$$ 518450 576562 475275 483076 414355 344073 294089 351480 487754 545010 477871 434478
13239D34478P4575P2147j7465p3024j36719j6027R9685J26943R2766R180L4310
$$ 434478 509053 581200 563735 490711 353992 337965 437650 564593 657359 666539 700849
13228G00849J06071J14963O4678j00555j08113J23245J694o0522Q9492n0792j25099
$$ 700849 806920 921883 986561 886006 777893 901138 902832 842310 931802 881010 755911
13217G55911q0683l5330j7537O4654n823J36779K2270l5544o2209j40590J4148
$$ 755911 675228 639898 622361 687015 681192 817971 840241 804697 742488 601898 616046
13206F16046k915j14222k598J25448N5169o7281J27680R4561n9728o3509L1737
$$ 616046 613131 498909 496311 621759 676928 609647 737327 831888 772160 708651 740388
13195G40388R6837K52242J34684R7917O5249K10512J75685J40286o6877o0880
$$ 740388 837225 1089467 1224151 1322068 1387317 1597829 1773514 1913800 1846923 1786043
13185A786043k31026p5384q2977N8888o1487j27369J7546r614j25981L4755O5645
$$ 1786043 1555017 1479633 1396656 1455544 1394057 1266688 1284234 1274620 1148639 1183394 1249039
13174A249039J6360J11220J44446l075j08579J26489J35100J28102J14809J7584
$$ 1249039 1265399 1376619 1521065 1517990 1409411 1535900 1671000 1799102 1913911 1931495
13164A931495J54859M4066J04440L00961L07667L34248K62024R9842O8551L25510
$$ 1931495 2086354 2130420 2234860 2535821 2843488 3177736 3439760 3539602 3608153 3933663
13154C933663L95195L44321M48695N43264N56724P75775J192564J500759J988271
$$ 3933663 4328858 4673179 5121874 5665138 6221862 6997637 8190201 9690960 11679231
13145A1679231K576567L148310L964382N225631O964905R245755J1727153J3115173
$$ 11679231 14255798 17404108 21368490 26594121 33559026 42804781 54531934 67647107
13137F7647107J2201023Q537335K813169l453108q639248j1275823j1461451j0136214
$$ 67647107 79848130 88385465 91198634 87745526 79106278 67830455 56369004 46232790
13129D6232790p937339o004052m395865l216205k442576j826063j408096j132818
$$ 46232790 38295451 32291399 27895534 24679329 22236753 20410690 19002594 17869776
13121A7869776q22970m70434j00559J89218N89848R78983J433915K230804K900779
$$ 17869776 17046806 16576372 16475813 16665031 17254879 18233862 19667777 21898581 24799360
13112B4799360L617011M529183N816274P294482Q972225J0400148J1143602J1978374
$$ 24799360 28416371 32945554 38761828 46056310 55028535 65428683 76572285 88550659
13104H8550659J2403052J1993846J0309355P109558K692180k332779o766234r355656
$$ 88550659 100953711 112947557 123256912 130366470 133058650 130725871 123959637 114603981
13096A14603981j0467411j0638355j0313181j0048969r487767q717227p714973
$$ 114603981 104136570 93498215 83185034 73136065 63648298 54931071 47216098
13089D7216098o496272n384025m576077l758446k859955k145713j652066j213038
$$ 47216098 40719826 35335801 30759724 27001278 24141323 21995610 20343544 19130506
13081A9130506q87899n05530l19936J41710N68143J019425J607647K514732L481104
$$ 19130506 18242607 17737077 17417141 17558851 18126994 19146419 20754066 23268798 26749902
13072B6749902M648973O200279Q135597J0442470J2451018J2772013J0324817
$$ 26749902 31398875 37599154 45734751 56177221 68628239 81400252 91725069
13065I1725069N271151j304187p646498j2095230j3630252j2498057j0198152
$$ 91725069 96996220 95692033 88045535 75950305 62320053 49821996 39623844
13058C9623844p809353n748523m196707l144673k216811j870641j555111j376102
$$ 39623844 31814491 26065968 21869261 18724588 16507777 14637136 13082025 11705923
13050A1705923j238546j097318q43815q30640o93997n31250n92771m21545l97376
$$ 11705923 10467377 9370059 8526244 7695604 7001607 6470357 5877586 5456041 5058665
13041E058665m66893l84164k86326k04331k43256l10410j42279p8704k35816k65708
$$ 5058665 4591772 4207608 3921282 3716951 3473695 3163285 3021006 2942302 2706486 2440778
13031B440778j75758j52369n9197j97182j46306j1839M7620q7874q8668n5769
$$ 2440778 2265020 2112651 2053454 1856272 1709966 1698127 1745747 1657873 1569205 1513436
13021A513436j13150j00099M465l7200k0129L9325p9681j26430Q313k247m789
$$ 1513436 1400286 1300187 1304652 1267452 1247323 1286648 1206967 1080537 1088850 1086603 1081814
13010A081814o6220L3166L2932o8255j50329o3119l2794m0169n242j23647j05723
$$ 1081814 1015594 1048760 1081692 1013437 863108 799989 767195 727026 721784 598137 492414
12999D92414J41919J06569M6139J23412j21055j19644K471N0286l7377o2410N7518
$$ 492414 634333 740902 787041 910453 789398 669754 672225 722511 685134 622724 680242
12988F80242O1974j16028n5352K2897j2225o3263o2214J5185N1031r0709j43006
$$ 680242 742216 626188 570836 593733 581508 518245 456031 471216 522247 431538 288532
12977B88532J27701N0726q8231K1095J14304l6110l7418l6170j26066j46867n4705
$$ 288532 416233 466959 378728 399823 514127 478017 440599 404429 278363 131496 76791
12966G6791L4551M0246l2963N0849L0304j2905k7184J25461j7389J3691q3981
$$ 76791 111342 151588 118625 169474 199778 186873 159689 285150 267761 281452 197471
12955A97471K6777L9245N9114o3625l4925m9624n2351P2489L7477k5373P0757
$$ 197471 224248 263493 322607 258982 224057 174433 122082 194571 232048 206675 277432
12944B77432R3161o3575k8760p3137j50086R7748J18187k0161j21412l5878J12261
$$ 277432 370593 307018 278258 205121 55035 152783 270970 250809 129397 93519 205780
12933B05780j987J225J93192J02277k2231j70161k59k6931p7383n1687k9797m1661
$$ 205780 203793 205018 398210 500487 478256 308095 307836 280905 203522 151835 122038 80377
12921H0377K0369m8820m3996J01643J26729J4909L9174n5104m5675j8040K3680
$$ 80377 100746 51926 7930 109573 236302 251211 290385 235281 189606 171566 195246
12910A95246l0774o102j4604k6131J2249p1573p4797Q120J15131L591k1760O8036
$$ 195246 164472 158370 143766 117635 129884 58311 -16486 -8366 106765 110356 88596 156632
12898A56632P3002m2207O267l7674M433o1800k0746n8606j01480o6572r0024J29782
$$ 156632 229634 187427 193694 156020 160453 98653 77907 19301 -82179 -148751 -238775 -108993
12886a08993J43198K3735L5436j08324j11977Q5884L1211M3577j14854M2871Q0347
$$ -108993 34205 57940 93376 -14948 -126925 -41041 -9830 33747 -81107 -38236 42111
12875D2111L57p0394j1804l3078L0866J8945N8592n1778q9199Q4790R6283m9958
$$ 42111 42468 -27926 -39730 -72808 -41942 -22997 35595 -16183 -105382 -20592 75691 25733
12863B5733j14008M0294L7862K3945r1542j66460j2343J48933J15610O7639J04272
$$ 25733 -88275 -47981 -10119 13826 -77716 -244176 -256519 -107586 8024 75663 179935
12852A79935q0766K282m4739r9824J57363R8331r3835p5178p0230q1765r95l5194
$$ 179935 99169 101451 56712 -43112 114251 212582 118747 43569 -26661 -108426 -109421 -144615
12840a44615K2520J52892N5767n4933o0245N1807L2989j2663p2520l4964K0353
$$ -144615 -122095 30797 86564 31631 -28614 23193 56182 43519 -29001 -63965 -43612
12829d3612J8473j8534J01071P2233J7248K3951J7167J6033p5791n7100K8718
$$ -43612 -25139 -43673 57398 129631 146879 170830 187997 204030 128239 71139 99857
12818I9857j821L3808O8749k4396q9376k2653l8313l8667M156j34431j06365J11500
$$ 99857 98036 131844 200593 176197 86821 64168 25855 -12812 -8656 -143087 -249452 -137952
12806a37952J02202Q4979O5799J2221n4688P5796J7886m2548j25116k1073l8941
$$ -137952 -35750 49229 115028 127249 72561 148357 166243 123695 -1421 -22494 -61435
12795f1435Q1439M4425L3752o6398J43948l5482j78928O2682m0884O4797O7630
$$ -61435 20004 64429 98181 31783 175731 140249 -38679 24003 -16881 47916 115546
12784A15546O7751j2621q6893l2354M2465L1614k3990j5066j7632M3499j15651
$$ 115546 183297 170676 83783 51429 93894 125508 101518 86452 68820 112319 -3332
12773c332K7752j426j04748j2640j7752L6425m646K3583M907K5959j05286j17517
$$ -3332 24420 22994 -81754 -94394 -112146 -75721 -80367 -56784 -51877 -25918 -131204 -248721
12761b48721N6963J95326m4755r1192J5229P0837R5427K7665m8467m7310N4935
$$ -248721 -191758 3568 -41187 -132379 -117150 -46313 49114 76779 28312 -18998 35937
12750C5937P6802j8698n5117n2979K9030k8841r5630O5229J521l9514m3917l811
$$ 35937 112739 94041 38924 -14055 14975 -13866 -109496 -44267 -42746 -82260 -126177 -129988
12738a29988N4014J00982r79J06445Q607j31755n2291K7071k994K0005m517N3107
$$ -129988 -75974 25008 24029 130474 139081 7326 -44965 -17894 -20888 -883 -5400 47707
12726D7707J07786Q945j4718p5398k4201J33112M449m4636P646j01683m3254o680
$$ 47707 155493 164438 149720 74322 50121 183233 187682 143046 150692 49009 5755 -925
12714i25k8634l5966L6961J14988P060J05703o358o5729j62830m7511l3461O9562
$$ -925 -29559 -65525 -28564 86424 93484 199187 192829 127100 -35730 -83241 -116702 -47140
12702d7140k6877k1049J16048K7620l4825o5434q8485L2912J20677J809j1383
$$ -47140 -74017 -95066 20982 48602 13777 -51657 -140142 -107230 13447 15256 3873
12691C873P544K336J233K726j01569k702O9591O4066R3915J28607n8598j49313
$$ 3873 11417 13753 14986 17712 -83857 -86559 -16968 47098 141013 269620 211022 61709
12679F1709j28786K5362J27834L9924Q3921N9895J20699L3822M522R3031M0508
$$ 61709 -67077 -41715 86119 126043 209964 269859 390558 424380 428902 521933 562441
12668E62441k7814n344j69982j80850k8717p0694j1328l7035K1086N2337P4076
$$ 562441 534627 529283 359301 178451 149734 79040 67712 30677 51763 104100 178176
12657A78176L2042L1198O0216m2649M5454q3170j18571O952O6489o1288P5057
$$ 178176 210218 241416 301632 258983 304437 221267 102696 109648 176137 114849 189906
12646A89906J38263J52328j42338j51636O2290J19172J46590J48207O4306P247
$$ 189906 328169 480497 338159 186523 248813 367985 514575 662782 727088 734335
12636G34335l4801k519M4902q6438L623j71910j51808M5483J54445L7561j63649
$$ 734335 699534 697015 741917 655479 659102 487192 335384 380867 535312 572873 409224
12625D09224j16040P3984L1782q5859m0557J4067P3437p8694j20965O0647Q0463
$$ 409224 293184 367168 398950 313091 272534 286601 360038 281344 160379 221026 301489
12614C01489j191n0817o9542n5707R3563J23894Q6122m621m2511o3134N1286J26273
$$ 301489 300298 249481 179939 124232 217795 341689 427811 423190 380679 317545 368831 495104
12602D95104L6995M3025r7211l063M058j81989j46136j02618L8128O1751L7066
$$ 495104 532099 575124 477913 474850 478908 296919 150783 48165 86293 148044 185110
12591A85110j549j17612o0745M8157J7517J15487M8625j13013j86012M6629P8547
$$ 185110 183561 65949 5204 53361 70878 186365 234990 121977 -64035 -17406 61141
12580F1141J11202l7m2902p8082q46Q3231L7311K565L2504n0227K6167n1364j02275
$$ 61141 172343 172306 129404 51322 50476 133707 171018 173583 206087 155860 182027 130663 28388
12567B8388o3679K4801N0847J5279j8372K0382J17286N5807j00821n4225r7234
$$ 28388 -35291 -10490 40357 55636 37264 57646 174932 230739 129918 75693 -21541
12556b1541o8009O2525J04852L1405N8815o074q8767j3319R621j59979J5844P0497
$$ -21541 -89550 -27025 77827 109232 168047 161973 73206 59887 69508 -90471 -74627 -4130
12544d130P9619r14M2083j32021n6687O3105p8179n2787J1070k8497P2219P4548
$$ -4130 75489 74575 116658 -15363 -72050 -8945 -87124 -139911 -128841 -157338 -85119 -10571
12532a0571p0368j1171J22691m9839j15155p471M6907R3060J26456o548K7428
$$ -10571 -80939 -92110 30581 -19258 -134413 -141884 -94977 -1917 124539 117991 145419
12521A45419l1107k9551p0039P0261N9176N8519n8319o2327l6909K6091L0655
$$ 145419 114312 84761 14722 84983 144159 202678 144359 82032 45123 71214 101869
12510A01869p7936p6503P2606j1086p297N1940l6255n9133N6045m132L6445k1594
$$ 101869 23933 -52570 20036 8950 1653 53593 17338 -41795 14250 10118 46563 24969
12498B4969m6737r5524R3121N7800K5048J4002p4257l0012K6971m5051m782o793
$$ 24969 -21768 -117292 -24171 33629 58677 72679 -1578 -31590 -4619 -49670 -54452 -61245
12486f1245L554K4059M777R5782J01120J2763N0847N2682L6827J013J62210l5724
$$ -61245 -57691 -33632 -28855 66927 168047 180810 231657 284339 321166 322179 484389 448665
12474D48665j09881j25599N6902Q2815q8893j36371N413j02189j04090P1781L4147
$$ 448665 338784 213185 270087 352902 264009 127638 133051 30862 -73228 -1447 32700
12463C2700N9518R6040Q4060r6384k0445m1947j60704R9237J87374P8574q8971
$$ 32700 92218 188258 272318 175934 155489 113542 -47162 52075 239449 318023 229052
12452B29052j65792P721M9631J3999j5094n0195j1543j02061J2068N9803n2972
$$ 229052 63260 70981 120612 134611 119517 69322 57779 -44282 -32214 27589 -25383
12441b5383N07O1294K15501Q2557j39075Q549J32936J06547j68776j22170Q447
$$ -25383 -24876 36418 251919 334476 195401 203950 336886 443433 274657 152487 160934
12430A60934l1614M2919J6733j88514j41276k3243K609J16531O0007J14458J1006
$$ 160934 129320 172239 188972 458 -140818 -164061 -161452 -44921 15086 129544 140550
12419A40550J9705m4784J25877R5787p2369l8987j76079j07486K15837Q7894l459
$$ 140550 160255 115471 241348 337135 264766 225779 49700 -57786 158051 245945 242486
12408B42486q8370O778j9569N8836O4649L4342k2913O7945R3422J58825o666q8016
$$ 242486 154116 160894 141325 200161 264810 299152 276239 344184 437606 596431 589765 501749
12396E01749q2070m8835j35781k19419j62643k5989P0432M4982P9939M0720q0931
$$ 501749 419679 370844 235063 15644 -146999 -172988 -102556 -57574 22365 63085 -17846
12385a7846q6937M2171J61758k8477j53866k5321K8903J43105L4059l292O8133
$$ -17846 -104783 -62612 99146 70669 -83197 -108518 -79615 63490 97549 94257 162390
12374A62390N8829j27669J6211p9818j41417M6270K2096n2450K1347l5368p2713
$$ 162390 221219 93550 109761 29943 -111474 -65204 -43108 -95558 -74211 -109579 -182292
12363a82292L4421M9927N3607j3028J32892J16808J3640k8129p5727k8754l055
$$ -182292 -147871 -97944 -44337 -57365 75527 192335 205975 177846 102119 73365 70310
12352G0310P6572J06452k7959R600o8693j26092j59322N6341N2647n0155l0557
$$ 70310 146882 253334 225375 234975 166282 40190 -119132 -62791 -10144 -60299 -90856
12341i0856m2484P8246K39298J03159m3870j5903k3225j39638n1004J5982o4109
$$ -90856 -133340 -55094 184204 287363 243493 227590 204365 64727 13723 29705 -34404
12330c4404k0908J4269m578J5096p1054p3967J13535J03165L3370q1879p6272
$$ -34404 -55312 -41043 -45621 -30525 -101579 -175546 -62011 41154 74524 -7355 -83627
12319h3627N8453J08694M7879n4942l9609R892l8632m3721N0171p972J1556O5250
$$ -83627 -25174 83520 131399 76457 36848 46740 8108 -35613 14558 6586 18142 83392
12307H3392p760p9656L1389M1242r838N231r76Q060R5358j4628O5443k9254n3501
$$ 83392 75632 -4024 27365 68607 58769 64000 63024 71084 166442 151814 217257 188003 134502
12294A34502r9300m0038J17178N3179K5295l3472q6587n5631j867L4069J5587
$$ 134502 35202 -4836 112342 165521 190816 157344 70757 15126 13259 47328 62915
12283F2915Q2619M5028q6246m0793K3965m134Q6797o4516q0542n5054M4986J22685
$$ 62915 145534 190562 104316 63523 87488 83354 170151 105635 25093 -29961 15025 137710
12271A37710k1005p9993L0232J91599R476j10229m3515l4427q6773J6959Q0158
$$ 137710 116705 36712 66944 258543 268019 157790 114275 79848 -6925 10034 90192
12260I0192J11193o7755k2705k9313N2010O4829q7802j2404j00116l9897l405
$$ 90192 201385 133630 110925 81612 133622 198451 110649 98245 -1871 -41768 -45173
12249d5173l4864j22800M7086J99006J07974L5333j12866K4110J05507p9895j40625
$$ -45173 -80037 -202837 -155751 43255 151229 186562 73696 97806 203313 123418 -17207
12238a7207J0735J09467J46197P5250R1579K6476p8951o1075q3763j40051l5420
$$ -17207 -6472 102995 249192 324442 416021 442497 363546 302471 218708 78657 43237
12227D3237J12914J64206L7580o9371j28682j95813K1267J80397J56909j2502
$$ 43237 156151 320357 357937 288566 159884 -35929 -14662 165735 322644 310142
12217C10142j8901m9787o1903Q9256Q8296J08861m8116L3794P5559n5790j14712
$$ 310142 291241 241454 179551 268807 357103 465964 417848 451642 527201 471411 356699
12206C56699j40055k4051K02007M6368o3559Q242K286j308K0830j56577K9149
$$ 356699 216644 192593 394600 440968 377409 385651 387937 386629 407459 250882 280031
12195B80031O6878M6380n1627q4801n3464J15309Q4475M0816n4889r1743r6359
$$ 280031 346909 393289 341662 256861 203397 318706 403181 443997 389108 297365 201006
12184B01006L3417o0084m4283O2748J09642J30238m8880m0069O1620o0992j38568
$$ 201006 234423 174339 130056 192804 302446 432684 383804 343735 405355 344363 205795
12173B05795l3768K1899K776r573N1307J03996J05293j27282j50947J04806M3222
$$ 205795 172027 193926 196702 187129 238436 342432 447725 320443 169496 274302 317524
12162C17524n4036O7569R4321o7899P0161m4105k5147m4734r9667o1867O3805
$$ 317524 263488 331057 425378 357479 427640 383535 358388 313654 213987 152120 215925
12151B15925M9187p734L9778L2696n8054N0986j02911K5416n759R9057J4625j23491
$$ 215925 265112 257378 297156 329852 271798 322784 219873 245289 239530 338587 353212 229721
12139B29721j19234r0110M9508L1402J0347k0154J31K7991J15271L7894l7333
$$ 229721 110487 20377 69885 101287 111634 91480 91611 119602 234873 272767 235434
12128B35434r7240o0770M2140K7847P7151J09889n9563J5570j1483l8101m5794
$$ 235434 138194 77424 119564 147411 224562 334451 274888 290458 278975 240874 195080
12117A95080j17753m0922Q9053J25199R7342R935j51200k1955R5153N1466l9705
$$ 195080 77327 36405 125458 250657 347999 357934 206734 184779 279932 331398 291693
12106B91693j05868p5058L2422L6755j22503q5687m7607J59372J15250o5309j78667
$$ 291693 185825 110767 143189 179944 57441 -28246 -75853 83519 198769 133460 -45207
12095d5207J8750Q5317L9734l6895O000p7416N491q7671L2276J72233P6439l8555
$$ -45207 -26457 58860 98594 61699 67699 -9717 -4226 -91897 -59621 112612 189051 150496
12083A50496M081L7928o3203q2807J2243Q5982o8852j31587l8709p3676O7928
$$ 150496 154577 192505 129302 46495 58738 144720 75868 -55719 -94428 -168104 -100176
12072a00176N0771N6959j1631q0040l0205P4502M5737L1191K3253j20978j48668
$$ -100176 -49405 7554 -4077 -84117 -114322 -39820 5917 37108 60361 -60617 -209285
12061b09285M3030N5834J25878O7419n8186o7167k801J11777K7005n9626N022
$$ -209285 -166255 -110421 15457 82876 24690 -42477 -45278 66499 93504 33878 38900
12050C8900M924J196N3178o2187p0651L4034Q7397j8347M6291l6126j78151q1137
$$ 38900 43824 45020 98198 36011 -34640 -606 86791 68444 114735 78609 -99542 -180679
12038a80679O619L2227J47222J47479K5798J42352l3763M9268J4375q6962m9346
$$ -180679 -174060 -141833 5389 152868 178666 321018 287255 336523 350898 263936 214590
12027B14590P0341n3193k9294J5768M3595J2655l8026q0299j8157n4482q4134
$$ 214590 284931 231738 202444 218212 261807 274462 236436 156137 137980 83498 -636
12016f36P5730N1189O7461J06470q7405o3453k2163O1425M9113r4738j13035o5481
$$ -636 75094 126283 193744 300214 212809 149356 127193 188618 237731 142993 29958 -35523
12004c5523N9427J27983J32623K7641o9859j27954L9975P7051l5207m0884j7843
$$ -35523 23904 151887 284510 312151 242292 114338 154313 231364 196157 155273 137430
11993A37430J04453J8198j8750k9442o6582o4731J22205J08210m7654j00348O1344
$$ 137430 241883 260081 241331 211889 145307 80576 202781 310991 263337 162989 224333
11982B24333J10518j9554o1630k9789K0294K3849N491l1047j3375N5914j3834
$$ 224333 334851 315297 253667 223878 244172 268021 273512 242465 229090 285004 271170
11971B71170k5204J7972o5875j12202J5433L4417J64316L854j48150k1163J43975
$$ 271170 245966 263938 198063 85861 101294 135711 300027 303881 155731 134568 278543
11960B78543M858l6227m1585n3954n0503k042p4654M4476M3633Q7737q0046J04556
$$ 278543 283401 247174 205589 151635 101132 99090 24436 68912 112545 200282 120236 224792
11948B24792j6947n1737N960J12937R1484M1285P983l2725J43822o856O0775L3708
$$ 224792 207845 156108 162068 275005 366489 407774 415757 383032 526854 519998 580773 614481
11936F14481o8753m5885Q41J19992K6884q1527J504K7776O8519j6104j10380J2448
$$ 614481 545728 499843 500684 620676 647560 566033 567537 595313 663832 647728 537348 549796
11924E49796J19436N6684K7357k1582o7071J2765J04144n4126j1027K5283m0628
$$ 549796 669232 725916 753273 731691 664620 677385 781529 727403 716376 741659 701031
11913G01031L2759J4996L0427m6513N3181J88272M3738J31887K27168l0640m2061
$$ 701031 733790 748786 779213 732700 785881 974153 1017891 1149778 1376946 1346306 1304245
11902A304245J03542J37018L5219p6484Q5706L6889j3892Q2258K8337r2380o4143
$$ 1304245 1407787 1544805 1580024 1503540 1589246 1626135 1612243 1694501 1722838 1630458 1566315
11891A566315p6523m4898p9529l7255j33154n217p6382k4337N4178J4313J6853
$$ 1566315 1489792 1444894 1365365 1328110 1194956 1189739 1113357 1089020 1143198 1157511 1174364
11880A174364o5863r4978j34158O7044L5687j21793p4910L6343J9174j01529J3556
$$ 1174364 1108501 1013523 879365 946409 982096 860303 785393 821736 840910 739381 752937
11869G52937P7312N6487j15348M8686Q4171p8176q1447n737L5191P1876P8234
$$ 752937 830249 886736 771388 820074 904245 826069 744622 738885 774076 845952 924186
11858I24186N3476J14494l4760k9872k8964O7295N5964l7652k081k0865m5535
$$ 924186 977662 1092156 1057396 1027524 998560 1065855 1121819 1084167 1082086 1061221 1015686
11847A015686L4008J23423L3236N3333P3687m3217J7996J24339R7326J36054N8620
$$ 1015686 1049694 1173117 1206353 1259686 1333373 1290156 1308152 1432491 1529817 1665871 1724491
11836A724491K57113K66290J24283O6753K20531J75739P5914K28946L20761L93846
$$ 1724491 1981604 2247894 2372177 2438930 2659461 2835200 2911114 3140060 3460821 3854667
11826C854667L77755M32657O06823P35567Q82567J096208J291057J406642J536673
$$ 3854667 4232422 4665079 5271902 6007469 6890036 7986244 9277301 10683943 12220616
11817A2220616J923772K130352K291718K149169J934152J694293J157939P09780
$$ 12220616 14144388 16274740 18566458 20715627 22649779 24344072 25502011 26211791
11809B6211791J35099n44063r44533j096379j219714j277113j173023r68054q98400
$$ 26211791 26346890 25802827 24858294 23761915 22542201 21265088 20092065 19124011 18225611
11800A8225611o41018m06279k88149j17033q1117J35348L14024N15144N65543
$$ 18225611 17584593 17178314 16890165 16773132 16692015 16827363 17141387 17656531 18222074
11791A8222074P99047J108063J523004J851316J905645K032444K066945K202354
$$ 18222074 19021121 20129184 21652188 23503504 25409149 27441593 29508538 31710892
11783C1710892K351880J987217J593329J250764O80940J01709m14210j015158
$$ 31710892 34062772 36049989 37643318 38894082 39575022 39676731 39262521 38247363
11775C8247363j158729j133905j185737j140437q17532n81662l65170n4127K87796
$$ 38247363 37088634 35954729 34768992 33628555 32811023 32229361 31864191 31810064 32097860
11766C2097860M53385N20715N59198O81482O63907N50811N27367L18180L09173
$$ 32097860 32551245 33071960 33631158 34312640 34976547 35527358 36054725 36372905 36682078
11757C6682078K53169l0467o5644j2020j08971q3032r7011J02590J7901J77878
$$ 36682078 36935247 36904780 36839136 36827116 36718145 36635113 36538102 36640692 36658593 36836471
11747C6836471L77795L72631L91898L31934K95304L13339L12843K22763J80875
$$ 36836471 37214266 37586897 37978795 38310729 38606033 38919372 39232215 39454978 39635853
11738C9635853K12880K04359K00821K14877J95265N1689j36236n06897m72712
$$ 39635853 39848733 40053092 40253913 40468790 40664055 40715744 40579508 40072611 39599899
11729C9599899n67209q00900q86950j002579r31345j043917r66477q93080p14740
$$ 39599899 39032690 38231790 37344840 36342261 35410916 34366999 33400522 32507442 31792702
11720C1792702n04137k88184J28071O13921R68169J202779J513226J896237J922223
$$ 31792702 31288565 31000381 31128452 31742373 32710542 33913321 35426547 37322784 39245007
11711C9245007J745690J702663J481629P06240n3637p60060j197531j614729k021314
$$ 39245007 40990697 42693360 44174989 44881229 44827592 44067532 42870001 41255272 39233958
11702C9233958k160247k365442k419739k102336k006099j946011j608870j358183
$$ 39233958 37073711 34708269 32288530 30186194 28180095 26234084 24625214 23267031
11694B3267031j032477q03180n77447l86303k02880J3926K74471M97573M89702
$$ 23267031 22234554 21431374 20853927 20467624 20264744 20278670 20553141 21050714 21540416
11685B1540416O49243R75063J298390J593968J633849J452849J222229R25421
$$ 21540416 22189659 23164722 24463112 26057080 27690929 29143778 30366007 31291428
11677C1291428M51570k13021j065569j599922j987029k319985k540921k411845
$$ 31291428 31742998 31529977 30464408 28864486 26877457 24557472 22016551 19604706
11669A9604706k348900k154866j731172j457463j371092j213048j033080r05494
$$ 19604706 17255806 15100940 13369768 11912305 10541213 9328165 8295085 7389591
11661G389591p28980n92446o33679m66944l48425m59471k95153j99958l74977
$$ 7389591 6660611 6068165 5434486 4967542 4619117 4159646 3864493 3664535 3289558
11652C289558l56514j63295l4864q1364j88558q2097j12582j31806j30653j20314
$$ 3289558 2933044 2769749 2734885 2653521 2464963 2382866 2270284 2138478 2007825 1887511
11642A887511j23277j15431j62053O341n7168q4568l3183P2534j5442n3693Q7561
$$ 1887511 1764234 1648803 1486750 1493091 1435923 1351355 1318172 1390706 1375264 1321571 1409132
11631A409132o0152o4997K1903q6614l6593N354m1124j66557r5698O5424Q863
$$ 1409132 1348980 1283983 1305886 1219272 1182679 1188033 1146909 980352 884654 950078 958941
11620I58941L900j56687j07009m2210J0970N4656L7824J837J04859K9495j01704
$$ 958941 962841 806154 699145 656935 667905 722561 760385 762222 867081 896576 794872
11609G94872J2768N6802J28908J63659j36058j50373r6011j1064O886L6781J35037
$$ 794872 807640 864442 993350 1157009 1020951 870578 774567 763503 770389 807170 942207
11598I42207P0489J1822R5386K27808K41607J72221K02500J04253J52391J69331
$$ 942207 1012696 1024518 1119904 1347712 1589319 1761540 1964040 2068293 2220684 2390015
11588B390015Q4935L6016P186j9581k44755k22431j47267j9032j13229j90614
$$ 2390015 2474950 2510966 2518152 2498571 2253816 2031385 1884118 1865086 1751857 1561243
11578A561243q6842N9191m0878q4070J24068L8339J535O4622J5088j07680P3863
$$ 1561243 1474401 1533592 1492714 1408644 1532712 1571051 1572586 1637208 1652296 1544616 1618479
11567A618479N056J13784J46910J04116O9232k0926J0118L8597J9982J24133K3838
$$ 1618479 1623535 1737319 1884229 1988345 2057577 2036651 2046769 2085366 2105348 2229481 2253319
11556B253319k04783j34405m8995k01235j89918N0665j11057k66836j74841q7670
$$ 2253319 2048536 1914131 1865136 1663901 1473983 1524648 1413591 1146755 971914 884244
11546H84244j19197j09058o6202q1381L0518L583j36493p4231J24546N8453j06777
$$ 884244 765047 655989 589787 508406 538924 542507 406014 331783 456329 514782 408005
11535D08005p5244j23903l0199R5206j8741n4960o3685J8856P0289J03699K7212
$$ 408005 332761 208858 178659 273865 255124 200164 136479 155335 225624 329323 356535
11524C56535K8728l3291j19774p5227N1932J8833M8183q8795l5811J23746M7621
$$ 356535 385263 351972 232198 156971 208903 227736 275919 187124 151313 275059 322680
11513C22680k615m3477r9071n2592j15858N5872J2761n7852j3056J2545Q9996
$$ 322680 320065 276588 177517 124925 9067 64939 77700 19848 6792 19337 109333
11502A09333J36305J33179O4842q4456j77654q7067P5360J70687M1621k6778L0616
$$ 109333 245638 378817 443659 359203 181549 94482 169842 340529 382150 355372 385988
11491C85988J7529q2496l8389j2305K0992j16764j25511j5975R8391N8946M7625
$$ 385988 403517 321021 282632 270327 291319 174555 49044 33069 131460 190406 238031
11480B38031j41459n0818L7676J14914O6747O7281j29282n2991l8079q9738q6197
$$ 238031 96572 45754 83430 198344 265091 332372 203090 150099 112020 22282 -63915
11469f3915J00242J19444m0705o357J76226M1282l5956j05740n5899R4389K840
$$ -63915 36327 155771 115066 108709 284935 326217 290261 184521 128622 223011 225851
11458B25851l9468K3230K1028m8643l2767M6836p3147p9692n5427N5339J16849
$$ 225851 186383 209613 230641 181998 149231 196067 122920 43228 -12199 43140 159989
11447A59989Q1774J8326j52301j10229K5194J59427J26694r0955j04058m000P9473
$$ 159989 241763 260089 107788 -2441 22753 182180 308874 217919 113861 109861 189334
11436A89334O0785j78683j11297N8122J32233O7463j22839m4561J62261K4450
$$ 189334 250119 71436 -39861 18261 150494 217957 95118 50557 212818 237268
11426B37268m7132O7694j34193j7809J28507K939O2167q8601k4192J1085m9658
$$ 237268 190136 257830 123637 105828 234335 237274 299441 210840 186648 197733 148075
11415A48075J92230m7895l5552l2403N8493k4014K8413P606p8797q4958J02091
$$ 148075 340305 292410 256858 224455 282948 258934 287347 294953 216156 131198 233289
11404B33289J15611P3354L8899M3091j71092p4966j7333q1167J84809o7019n4184
$$ 233289 348900 422254 461153 504244 333152 258186 240853 159686 344495 277476 223292
11393B23292J76201K03640N134j64918r0207j672j5035p2009M607j4974J06653
$$ 223292 399493 603133 608267 443349 353142 351470 336435 264426 269033 254059 360712
11382C60712J35237p9344p1341j31492Q2310J50102m1208j3436p4886K5760Q465
$$ 360712 495949 416605 345264 213772 296082 446184 404976 391540 316654 342414 350879
11371C50879r1208p7798R9448Q6500J45514J22962J6280R1865P0666j04719Q3636
$$ 350879 259671 181873 281321 367821 513335 636297 652577 744442 815108 710389 794025
11360G94025N7179M4317Q524j45747j23652j101q5094M0104J5955P2717J1875
$$ 794025 851204 895521 904045 758298 634646 633545 548451 588555 604510 677227 689102
11349F89102l974p8493j31645j19445j19513Q868N3056q284j1020Q5116K0272
$$ 689102 685128 606635 474990 355545 236032 244900 297956 289672 278652 363768 384040
11338C84040J5825K4884J8086J55781K58684o1802j29639j42430J7143m5744n1131
$$ 384040 399865 424749 442835 598616 857300 795498 665859 523429 540572 494828 443697
11327D43697L4105N5909k1364j22494m157m0314Q513Q4992J91039J35612r6299
$$ 443697 477802 533711 512347 389853 385696 345382 353895 438887 629926 765538 669239
11316F69239K4039p791n2204j75718M5919J07965O0084l3627J0394N788K6700
$$ 669239 693278 685487 633283 457565 503484 611449 671533 637906 648300 654088 680788
11305F80788J03052l621m9779m0692l1390n8517p4366N0402R3089J908m4882n3924
$$ 680788 783840 780219 730440 689748 658358 599841 525475 575877 668966 670874 625992 572068
11293E72068O6861O7425J1464m4716j4871J23359J19504p552j56508m0750L9311
$$ 572068 638929 706354 717818 673102 658231 781590 901094 893542 737034 696284 735595
11282G35595N2207O6667L855m1767O9718L524j26517k3097J58614J87236J41857
$$ 735595 787802 854469 858324 816557 886275 889799 763282 740185 898799 1086035 1227892
11271A227892K3215p6336R4805R3313n5804j01001n2603K5207R4008j9923N4758
$$ 1227892 1251107 1174771 1269576 1362889 1307085 1206084 1153481 1178688 1272696 1252773 1307531
11260A307531j7675n927J518O6190L4363m1595J2732M7652O9673o5507j9103O4236
$$ 1307531 1289856 1283929 1285447 1351637 1386000 1344405 1357137 1404789 1474462 1408955 1389852 1454088
11248A454088o031r4017o7540K2231N9523O7399j4407n5058M2924J38903J07445
$$ 1454088 1448057 1354040 1286500 1308731 1368254 1435653 1421246 1366188 1409112 1548015 1655460
11237A655460M1569P4924O8757k55521k50906J1468J13493J7457J04416N4523
$$ 1655460 1697029 1771953 1840710 1585189 1334283 1345751 1459244 1476701 1581117 1635640
11227A635640L448L7466Q6993P7413o5620j4693k6288n9891J09764j1482m3607
$$ 1635640 1639088 1676554 1763547 1840960 1775340 1760647 1734359 1674468 1784232 1772750 1729143
11216A729143m1425J8884N4382k792J69623K4129k6369M1364N6000L5484P8832
$$ 1729143 1687718 1706602 1760984 1758192 1927815 1951944 1925575 1966939 2022939 2058423 2137255
11205B137255R838k7837N7198M6789J41615J2706J76949J18588j3134O7957J53936
$$ 2137255 2147093 2119256 2176454 2223243 2364858 2377564 2554513 2673101 2659967 2727924 2881860
11194B881860J01106Q4086J2188J49713K10076P6010K36094L09180J59971K37380
$$ 2881860 2982966 3067052 3079240 3228953 3439029 3515039 3751133 4060313 4220284 4457664
11184D457664J36647J95793J93863L31386L92865L70164M07664M08241K74895
$$ 4457664 4594311 4790104 4983967 5315353 5708218 6078382 6486046 6894287 7169182
11175G169182L16114N16579N06410O75404O44281P19190Q26634Q77072J013308
$$ 7169182 7485296 8001875 8508285 9183689 9827970 10547160 11373794 12250866 13264174
11166A3264174J224055J297484J539918J735903J972627K209737K647921L191468
$$ 13264174 14488229 15785713 17325631 19061534 21034161 23243898 25891819 29083287
11158B9083287L671621M264898N169779O171410P278708Q718735J0469715J2807755
$$ 29083287 32754908 37019806 42189585 48360995 55639703 64358438 74828153 87635908
11150H7635908J5889830J9656645K3952625K8911803L3792921L7972637L9376564
$$ 87635908 103525738 123182383 147135008 176046811 209839732 247812369 287188933
11143B87188933L6747878K9346280J8140660N284640o799440j6441929k2190739
$$ 287188933 323936811 353283091 371423751 376708391 369908951 353467022 331276283
11136C31276283k4234464k3601081k1361593j8547845j5413078j2458410r827838
$$ 331276283 307041819 283440738 262079145 243531300 228118222 215659812 205831974
11129B05831974p383457n177343l077779r10509R02621K825916M993764P267274
$$ 205831974 198448517 193271174 190193395 189282886 190185507 193011423 198005187 205272461
11121B05272461R956559J2940659J6327711J9758360K3151357K5784077K6448088
$$ 205272461 215229020 228169679 244497390 264255750 287407107 313191184 339639272
11114C39639272K4206915J7844620P480279n458284j8494382k9253716l5837857
$$ 339639272 363846187 381690807 389171086 383712802 365218420 335964704 300126847
11107C00126847l7728538l6175696l2465662k7887436k3471862j9363064j5940647
$$ 300126847 262398309 226222613 193756951 165869515 142397653 123034589 107093942
11100A07093942j3202549j1028894r374026p876025o850971n855407n111916m534344
$$ 107093942 93891393 82862499 73488473 65612448 58761477 52906070 47794154 43259810
11092D3259810l846393l403285l208480k690016k334901k052585j844167j695365
$$ 43259810 39413417 36010132 32801652 30111636 27776735 25724150 23879983 22184618
11084B2184618j419531j420470j160051j067526r57892j004976r70640q51244
$$ 22184618 20765087 19344617 18184566 17117040 16159148 15154172 14183532 13332288
11076A3332288o32179p85961o31124m83156m36140l88286l33095m59131l87514
$$ 13332288 12700109 11914148 11283024 10799868 10363728 9975442 9642347 9183216 8795702
11067H795702k57090m27421l50959l44366k50556m38203l74106l25816k18954
$$ 8795702 8538612 8111191 7760232 7415866 7165310 6727107 6353001 6027185 5808231
11058E808231j58788k65064k90218k75660j91411j63749j00011j4101o8436l35975
$$ 5808231 5649443 5384379 5094161 4818501 4627090 4463341 4363330 4349229 4280793 3944818
11048C944818k65003n5007R065j62510j04357j50613j15977j17506j93567K823
$$ 3944818 3679815 3624808 3633873 3471363 3367006 3216393 3100416 2982910 2789343 2792166
11038B792166p1692p4728j09115k40289k30336j31371l9258K9666L9116j19884
$$ 2792166 2720474 2645746 2536631 2296342 2066006 1934635 1895377 1925043 1964159 1844275
11028A844275l8487n8783P7657j7961j17980k796j8099j56870r1619p9702M3479
$$ 1844275 1805788 1747005 1824662 1806701 1688721 1685925 1667826 1510956 1419337 1339635 1383114
11017A383114M9754l8649q2538m5116j73702j857J3408J5037Q6288n0365j11884
$$ 1383114 1432868 1394219 1311681 1266565 1092863 1091006 1104414 1119451 1205739 1155374 1043490
11006A043490J19712P3170m8690p7828j60175r3254Q9626J614k7548R4968L6705
$$ 1043490 1163202 1236372 1187682 1109854 949679 856425 946051 947665 920117 1015085 1051790
10995A051790j07716j35533l9493l8927Q3067L9372k4523J03356O4970p1386q5623
$$ 1051790 944074 808541 769048 730121 813188 852560 828037 931393 996363 924977 839354
10984H39354k0192P480j22880q1991K6418l5236j61029K9522o8185r9323j029
$$ 839354 819162 826642 703762 621771 648189 612953 451924 481446 413261 313938 312909
10973C12909J17124r339k8561K3406l1035J0854l9006J53308m049m8691k4416
$$ 312909 430033 420694 392133 415539 384504 395358 356352 509660 505611 456920 432504
10962D32504m7583p359P1306Q7848k4913k4725N8679n2050k6492R3959p3610r7821
$$ 432504 384921 377562 448868 536716 511803 487078 545757 493707 467215 561174 487564 389743
10950C89743j28207m2154R3316L4087o1007r2954L2185P3266P2565k145o7623
$$ 389743 261536 219382 312698 346785 285778 192824 225009 298275 370840 368695 301072
10939C01072m9859R041K9584j97020m5179l7446J26509J86852M7759o2609m8857
$$ 301072 251213 260254 289838 92818 47639 10193 136702 323554 371313 308704 259847
10928B59847J0087j5098K2345k9779p8440L2944Q1336M562j1721l6122M9378Q944
$$ 259847 269934 254836 277181 247402 168962 201906 283242 287804 276083 239961 289339 298283
10916B98283j13405j9681J26588K5173r2780l2392L0318k6243O2960Q7779k1445
$$ 298283 184878 165197 291785 316958 224178 191786 222104 195861 258821 346600 325155
10905C25155r6258l5207P909N4681r0748q1410J4403P9207r835n2238L863K1224
$$ 325155 228897 193690 201599 256280 165532 84122 98525 177732 167897 115659 119522 140746
10893A40746l45Q7751J04834J37149j988r7809q166N2594l8898l5929n5330L097
$$ 140746 140401 228152 332986 470135 468147 370338 362172 414766 375868 339939 284609 287706
10881B87706j7937m8332l9544r8809K9115l3844J14964R5008Q5676M9580L9086
$$ 287706 269769 221437 181893 83084 112199 78355 193319 288327 374003 423583 462669
10870D62669l6935n4052L6951l7993j34951n0082P2771K170N8403n7414r0675
$$ 462669 425734 371682 408633 370640 235689 185607 258378 260548 318951 261537 170862
10859A70862N9582J45377M2169j09807K790J55193Q9373Q9570l0465j7375o1436
$$ 170862 230444 375821 417990 308183 310973 466166 555539 645109 614644 597269 535833
10848E35833j43388p529N7398N3942j09243k3824L857m3480n7115K2637n1584
$$ 535833 392445 384916 442314 496256 387013 363189 367046 323566 266451 289088 237504
10837B37504n1472m1832O6424j26251l5465J20800J32879Q7151o7457r5956J3650
$$ 237504 186032 144200 210624 84373 48908 169708 302587 389738 322281 226325 239975
10826B39975R0473J1968n8237n3408J0117l4221K5191j9530J576P9036K6095n5954
$$ 239975 330448 342416 284179 230771 240888 206667 231858 212328 213904 292940 319035 263081
10814B63081j42766j21586J09269N0780J04492r0q6592j7717P3003j7411J43742
$$ 263081 120315 -1271 107998 158778 263270 263180 176588 158871 231874 214463 358205
10803C58205N5661j28626o5546j00491m2083j3073M1396J18784J74771K6466j14480
$$ 358205 413866 285240 219694 119203 77120 64047 105443 224227 398998 425464 310984
10792C10984q0639N4303l7557k9139Q9602Q0753q3934N5982Q732j42427O8009
$$ 310984 230345 284648 247091 217952 307554 388307 304373 360355 369087 226660 294669
10781B94669L1273l9244p3957R5549r842p8178j6535J602M3599N3649q2235j4161
$$ 294669 325942 286698 212741 308290 298448 220270 203735 205337 248936 302585 220350 206189
10769B06189N9997L3151p1190k18099n4987r48k8284J38528J14832J9576L8917
$$ 206189 266186 299337 228147 10048 -44939 -45887 -74171 64357 179189 198765 237682
10758B37682r8997j54569n8483l3631N7949J19068J40372r6155j02098K2281q2094
$$ 237682 138685 -15884 -74367 -107998 -50049 69019 209391 113236 11138 33419 -48675
10747d8675N8174K38688J11563Q9512j56338j57033o8937L7471N0463J02212j03424
$$ -48675 9499 248187 359750 449262 292924 135891 66954 104425 154888 257100 153676
10736A53676j20647K5626M0190J307j1543J0593J07271j34311m0305P0170R9363
$$ 153676 33029 58655 98845 100152 88609 99202 206473 72162 31857 102027 201390
10725B01390j4219o8916n6207M0145m503n0101q3564K6425J71397N6761r5375
$$ 201390 187171 118255 62048 102193 97690 47589 -35975 -9550 161847 218608 123233
10714A23233n5929K745L1470p0483R0784K174O6485N2996j08379Q9605M6282O9989
$$ 123233 67304 70049 101519 31036 121820 123994 190479 243475 135096 224701 270983 340972
10702C40972N2659M9062M448P5430M7203L9607J40769k1477O7712J85464M7521
$$ 340972 393631 442693 447141 522571 569774 609381 750150 728673 796385 981849 1029370
10691A029370K64597L03047J17070J49181J45805O398j20169o9303J11614Q3378
$$ 1029370 1293967 1597014 1714084 1863265 2009070 2015468 1895299 1825996 1937610 2020988
10681B020988q9119j70825j59792n6926j60504r8360R839j59485r0497J4800J77557
$$ 2020988 1931869 1761044 1601252 1544326 1383822 1285462 1295301 1135816 1045319 1060119 1237676
10670A237676K2457L000M4481K10011J31753O2878k8662k9678K9708P0278K8555
$$ 1237676 1260133 1263133 1307614 1517625 1649378 1712256 1683594 1653916 1683624 1753902 1782457
10659A782457J05716J75996p632P0007j9927j66383k46586k30973j13268r0291
$$ 1782457 1888173 2064169 2056537 2126544 2106617 1940234 1693648 1462675 1349407 1259116
10649A259116j21627q8298m9937m2050n6600j33146j35741j52539o7424K6648
$$ 1259116 1137489 1049191 999254 957204 900604 767458 631717 479178 411754 438402
10639D38402l4175j4743L4264M7164k589n6388M2865J80277n2252r3285p0814
$$ 438402 404227 389484 423748 470912 468323 411935 454800 635077 582825 489540 418726
10628D18726R8068N6042o1964m1422o4514r7165q5572j0886o990M5812N6422P5956
$$ 418726 516794 572836 510872 469450 404936 307771 222199 211313 204323 250135 306557 382513
10616C82513P9890l1466J786M454j09640N2491m986n6011J06192J14332N8726
$$ 382513 462403 430937 432723 437177 327537 380028 375042 319031 425223 539555 598281
10605E98281m530p9239o6423J7300K647L9324N8913k5612j4978j02189j86246
$$ 598281 593751 514512 448089 465389 468036 507360 566273 540661 525683 423494 237248
10594B37248n3951J8495j9492K4808N7629P6492J1956j11914N6913Q4225q940
$$ 237248 183297 201792 182300 207108 264737 341229 353185 241271 298184 382409 373469
10583C73469J15099M5889l0943M1643M965k3434j19270n7243J43735O6213m6431
$$ 373469 488568 534457 503514 545157 550122 526688 407418 350175 493910 560123 513692
10572E13692j25636j2312L8686Q3419P9489j2296j23033K536Q2250J7521j0239
$$ 513692 388056 375744 414430 497849 577338 565042 442009 444545 526795 544316 534077
10561E34077O2482J63512N7904j18956j35667J5050k4971J0843J68508j726J5784
$$ 534077 596559 760071 817975 699019 563352 578402 553431 564274 732782 731056 746840
10550G46840J31994M3111N1572l7832k0085k0500j8117J18501P9930q6382J57319
$$ 746840 878834 921945 973517 935685 915600 895100 876983 995484 1075414 989032 1146351
10539A146351J83956M2019J67246M0960Q179P5037K79519L38365M1369O3651K55617
$$ 1146351 1330307 1372326 1539572 1580532 1588711 1663748 1943267 2281632 2323001 2386652 2642269
10528B642269L09635N06276M52222O18789R78920J121032J550806K119507K657613
$$ 2642269 2951904 3458180 3910402 4529191 5508111 6629143 8179949 10299456 12957069
10519A2957069K895712L121177K734320J722699L11802q58529j804609k425745
$$ 12957069 15852781 18973958 21708278 23430977 23742779 22884250 21079641 18653896
10511A8653896k514808k174163j908572j381296j076938r43346p44777n60856
$$ 18653896 16139088 13964925 12056353 10675057 9598119 8654773 7909996 7349140
10503G349140l79092j90096j66367j52523J14155K76785K88646L67975O99869
$$ 7349140 6970048 6779952 6613585 6461062 6575217 6852002 7140648 7508623 8208492
10494H208492J017277J101267J479540J964845K267132K442024K705900L362092
$$ 8208492 9225769 10327036 11806576 13771421 16038553 18480577 21186477 24548569
10486B4548569M064316M751942M950131M422755L401142J875896O6540j533007
$$ 24548569 28612885 33364827 38314958 42737713 46138855 48014751 48081291 46548284
10478D6548284l081464m108488m578320m447249l824057k848083j853308p40301
$$ 46548284 43466820 39358332 34780012 30332763 26508706 23660623 21807315 21067014
10470B1067014J36550Q87194J525267J907372J899905J374484P50453P5453n40566
$$ 21067014 21203564 22090758 23616025 25523397 27423302 28797786 29548239 29623692 29083126
10461B9083126q46939r92618q13095o13560l68074K06164N32717R02331J534094
$$ 29083126 28236187 27243569 26430474 25816914 25448840 25655004 26187721 27090052 28624146
10452B8624146K360930L300693M230810M302663L661638K482706Q69475n07772
$$ 28624146 30985076 34285769 38516579 42819242 46480880 48963586 49833061 49325289
10444D9325289j471637j834517k063869k263675k138893k070849j583735j278970
$$ 49325289 47853652 46019135 43955266 41691591 39552698 37481849 35898114 34619144
10436C4619144j195960j001687q79504o23402n42766o54704m81176l24602o7126
$$ 34619144 33423184 32421497 31541993 30918591 30375825 29721121 29239945 28915343 28848217
10427B8848217K59336P90419R79642J458268J599101J802050J992979J978505
$$ 28848217 29107553 29897972 30877614 32335882 33934983 35737033 37730012 39708517
10419C9708517J662552J299260J225261J426136J964703K199331J477361k34932
$$ 39708517 41371069 42670329 43895590 45321726 47286429 49485760 50963121 50728189
10411E0728189k269526m002962m853888m667503l734040k776693k146665j630697
$$ 50728189 48458663 44455701 39601813 34934310 31200270 28423577 26276912 24646215
10403B4646215j379475j075180n19416j07298O55847J187481J369895J065262
$$ 24646215 23266740 22191560 21672144 21564846 22220693 23408174 24778069 25843331
10395B5843331M33749m6240j94751l47071m41535l70619n14635o00605l58223
$$ 25843331 26277080 26230840 26036089 25689018 25247483 24876864 24362229 23761624 23403401
10386B3403401J40976R55240J911678K450392K414490K445698K311492J829568
$$ 23403401 23544377 24499617 26411295 28861687 31276177 33721875 36033367 37862935
10378C7862935J238073N71532j08683r24030j798671k718433l225099l567554
$$ 37862935 39101008 39672540 39563857 38639827 36841156 34122723 30897624 27330070
10370B7330070l591031l318127l076418k664731k042320j617719j214699r07562
$$ 27330070 23739039 20420912 17344494 14679763 12637443 11019724 9805025 8897463
10362H897463o93590n99765n06737k88900k12480k39953K4797P5169J85997K74723
$$ 8897463 8203873 7604108 7097371 6808471 6595991 6356038 6380835 6456004 6642001 6916724
10352F916724K87270N24641O97451J036640J223512J593570K027813K192683J951703
$$ 6916724 7203994 7728635 8426086 9462726 10686238 12279808 14307621 16500304 18452007
10343A8452007J404647N28504n95634j677117k301205k607790k387462j725304
$$ 18452007 19856654 20385158 19789524 18112407 15811202 13203412 10815950 9090646
10335I090646j531030j199276r55772o80399m54092m55865l24029k93332l23477
$$ 9090646 7559616 6360340 5404568 4724169 4270077 3814212 3490183 3196851 2873374
10326B873374k64183j88445j88941j59960r0095o1677p8532j27272r2978l8200
$$ 2873374 2609191 2420746 2231805 2071845 1981750 1920073 1841541 1714269 1621291 1583091
10316A583091q3016m4548j03844o2622j21952k4790o0805j51130j20794p6123
$$ 1583091 1500075 1455527 1351683 1289061 1167109 1142319 1081514 930384 809590 733467
10306G33467O5987J83660M6535p3409j8138j5572k02038J044P3572J7185J1840
$$ 733467 799454 983114 1029649 956240 938102 922530 720492 721536 795108 812293 824133
10295H24133p179j11041q6130J2413L8823j29412k1323M8596M9763k2587J12013
$$ 824133 816954 705913 619783 632196 671019 541607 520284 568880 618643 596056 708069
10284G08069m5341r5861m7602j25277j9474m6072k7036j5366L5673j5548n0296
$$ 708069 662728 566867 519265 393988 374514 328442 301406 286040 321713 306165 255869
10273B55869j4905q9095r8257Q3022K6336m1014N1460J61991J31321K4335o3637
$$ 255869 240964 151869 53612 136634 162970 121956 173416 335407 466728 491063 427426
10262D27426p114l8394j9819l3607N3403L5279P7m4845m2268j16057Q0973j7649
$$ 427426 420312 381918 362099 328492 381895 417174 417251 372406 330138 214081 295054 277405
10250B77405J7289J8028l2154l4379O7441m4907l5061N8709q5104J5720Q3058
$$ 277405 294694 312722 280568 246189 313630 268723 233662 292371 207267 222987 306045
10239C06045j0219M9226J6539j11514L3648L2952N536n9777j18942O0968J45409
$$ 306045 295826 345052 361591 250077 283725 316677 322213 262436 143494 204462 349871
10228C49871Q1296l5293k8774N429Q0882K6910m0407r2007o6635j02362m4606
$$ 349871 431167 395874 367100 372529 453411 480321 439914 347907 281272 178910 134304
10217A34304o7611L3342l3015r6559N3032J42302K3000P1181j33577p2641M9086
$$ 134304 66693 100035 67020 -29539 23493 165795 188795 259976 126399 53758 102844
10206A02844r7729m1946J02984O0980q1338m6534j16144p6548J4919P1932L6738
$$ 102844 5115 -36831 66153 127133 45795 -739 -116883 -193431 -178512 -106580 -69842
10195f9842j29394O2728J60922J16325O1149p431j51043j26387J4722O0878m8586
$$ -69842 -199236 -136508 24414 140739 201888 194457 43414 -82973 -68251 -7373 -55959
10184e5959L0760N3703p060L4017l6909j44334k8520N303J0313L1582j1415N3045
$$ -55959 -25199 28504 21444 55461 18552 -125782 -154302 -148999 -138686 -107104 -118519 -65474
10172f5474O9394N7133r3641q6028N1477p97P7291K9525K2022r6345l2125O9403
$$ -65474 3920 61053 -32588 -118616 -67139 -67936 9355 38880 60902 -35443 -67568 1835
10160A835P9306J2821r0893L0918L639j5848k8537P525L6976p3395P9325J18539
$$ 1835 81141 93962 3069 33987 37626 21778 -6759 766 37742 -35653 43672 162211
10148A62211o364L260o6598j9392j3065R6601k3214j49825K9189M9722M5015m4822
$$ 162211 155847 159107 92509 73117 60052 156653 133439 -16386 12803 62525 107540 62718
10136F2718o0687j8781J05769M2901j28263l2891L1928N4797j9902M1149m784
$$ 62718 2031 -16750 89019 131920 3657 -29234 2694 57491 37589 78738 73954
10125G3954k3143j8313Q3313p2350j01546k2030J63681O1424K2404k1068k9719
$$ 73954 50811 32498 115811 43461 -58085 -80115 83566 144990 167394 146326 116607
10114A16607M2975N7675j5752k2333r9534o1462J4047j6105M9884L9998J4105
$$ 116607 159582 217257 201505 179172 79638 18176 32223 16118 66002 106000 120105
10103A20105l107K7024m8273m9225N9318j14891r5294R4777J3630Q8581r0247
$$ 120105 116998 144022 95749 46524 105842 -9049 -104343 -9566 4064 92645 2398
10092B398j36328N0744N315J16658m4043q8518J49324K5969o7317Q634N2018m2704
$$ 2398 -133930 -83186 -77871 38787 -5256 -93774 55550 81519 14202 22836 74854 32150
10080C2150j16441j18594J62719J44154p6177j2948Q4053P5751p819J3493Q1551
$$ 32150 -84291 -202885 -40166 103988 27811 14863 98916 174667 166848 180341 261892
10069B61892R6850l0414p9867K3627m3916l7920j45121o4488l1189O3582M1238
$$ 261892 358742 328328 248461 272088 228172 190252 45131 -19357 -50546 13036 54274
10058E4274p723l6525O9366K6955l297O7243P6674L9817Q151q3226r1740P3073
$$ 54274 46551 10026 79392 106347 103050 170293 246967 286784 294935 211709 119969 193042
10046A93042O3642M7028q6249J9591n6521K7119K1797q2370J41397J52329N4773
$$ 193042 256684 303712 217463 237054 180533 207652 229449 147079 288476 440805 495578
10035D95578k7604j39298j04250l6713Q9486O8664r8930m5649n3297L3901M3869
$$ 495578 467974 328676 224426 187713 277199 345863 246933 201284 147987 181888 225757
10024B25757n7865m0610P9732K4404P4795M2577j22493j01748l4214m018P3347
$$ 225757 167892 127282 207014 231418 306213 348790 226297 124549 90335 86317 159664
10013A59664l5502j5449O5726n5870p4427N5002R858j726m333q0255L1756J91188
$$ 159664 124162 108713 174439 118569 44142 99144 109002 107276 102943 22688 54444 245632
10001B45632K5780k5338j31789P729j8018j9955m3709M0536p4951J24883R7359
$$ 245632 271412 246074 114285 122014 103996 84041 40332 80868 5917 130800 228159
9990B28159l9634j05782J3761o1160l5053M2317J03269j12222j22202J89304J11180
$$ 228159 188525 82743 96504 35344 291 42608 145877 33655 -88547 100757 211937
9979B11937M7162j1782n8335N1367j04329j25490p4029j9169Q1325K3555Q7705
$$ 211937 259099 247317 188982 240349 136020 10530 -63499 -82668 -1343 22212 109917
9968A09917N8654L0919Q9J3541J12968l424j67179q9511j56414R7270J18507l1925
$$ 109917 168571 199490 199579 213120 326088 322664 155485 65974 -90440 6830 125337 93412
9956I3412J20330O1929K4598n2234j6931J54529L23854M80889M47465K07545J06366
$$ 93412 213742 275671 300269 248035 231104 385633 709487 1190376 1637841 1845386 1951752
9945A951752j22678l49882m75415l22628j96757j38113p8270m1049n3760o7878
$$ 1951752 1829074 1479192 1003777 681149 484392 346279 268009 226960 173200 105322
9935A05322m905P0525J00079J3761q5914m7328n6819j1912R0044Q5954l12p4925
$$ 105322 100417 170942 271021 284782 198868 151540 94721 82809 172853 258807 258495 183570
9923A83570l0607m0926O837r8608j16601J29809O5183J8633J2573j0426L3199
$$ 183570 152963 112037 118874 20266 -96335 33474 98657 117290 129863 119437 152636
9912A52636o8132p5748M1146p1608l9486J55419J46148j5067o5254o8801r6112
$$ 152636 84504 8756 49902 -21706 -61192 94227 240375 225308 160054 91253 -4859
9901d859q2402k2161J05031Q8688j5101j8275j12532p6309n1891M0862N2713L3056
$$ -4859 -87261 -109422 -4391 84297 69196 50921 -61611 -137920 -189811 -148949 -96236 -63180
9889f3180l0986J4948j6407l3542M4678j7079N9679j8957p9q321N1922j5264K9367
$$ -63180 -94166 -79218 -95625 -129167 -84489 -101568 -41889 -60846 -60925 -69246 -17324 -32588 -3221
9876c221J7876j4569L7323P6973j24825M0751K6241M129J14441K3557j03287j38267
$$ -3221 14655 86 37409 114382 -10443 30308 56549 60678 175119 198676 95389 -42878
9864d2878L9353n9713p664Q2174P5300j1631n3544J95936J47159K1787j68035
$$ -42878 -3525 -63238 -70902 11272 86572 74941 21397 217333 364492 386279 218244
9853B18244j08132m8839J5860L5171N8587J70430K21375M9132M8705Q8717Q1720
$$ 218244 110112 61273 77133 112304 170891 341321 562696 611828 660533 749250 830970
9842H30970J27701L38803M82463J016881K126852K616305J949851O65247o74782
$$ 830970 958671 1297474 1779937 2796818 4923670 7539975 9489826 10155073 9480291
9833I480291j909814k494171j885651j052685n90727n43340l14218k9385q963
$$ 9480291 7570477 5076306 3190655 2137970 1547243 1003903 689685 660300 651337
9824F51337k09117m2318k9353N624q0952n6731P4815j2890O168N8838j0845q3932
$$ 651337 442220 399902 370549 376173 295221 238490 313305 300415 306583 365421 354576 270644
9812B70644k17340j13871p8097M3352q188J28940J54824M2390K3965q7720r7731
$$ 270644 53304 -60567 -138664 -95312 -103500 25440 180264 222654 246619 158899 61168
9801F1168r508P147j84984q9861J77386J58707p5342j45843n7834R9109R7276
$$ 61168 51660 58807 -126177 -216038 -38652 120055 44713 -101130 -158964 -59855 37421
9790C7421N973K4978o4825p0261L0265O6149J9518M2826Q4024L6872O7313l4243
$$ 37421 43394 68372 3547 -66714 -36449 29700 49218 92044 176068 212940 280253 246010
9778B46010r6352j04708J1877J1237n0791l9102m5013o1674m0132o2576R4492
$$ 246010 149658 44950 56827 68064 17273 -21829 -66842 -128516 -168648 -231224 -136732
9767a36732N9365M1067j32457k5483J61738j1194o8079J51676N2337M5210q6352
$$ -136732 -77367 -36300 -168757 -194240 -32502 -43696 -111775 39901 92238 137448 51096
9756E1096l1489J4546M1858N221K7104m3375O9077L6411m3198J7491j04130n3461
$$ 51096 19607 34153 76011 81232 108336 64961 134038 170449 127251 144742 40612 -12849
9744a2849q7207k9041J598P6873R8168r3460r6494l2296k0653R4598J36734j9586
$$ -12849 -100056 -129097 -127499 -50626 47542 -45918 -142412 -174708 -195361 -100763 35971 16385
9732A6385o2739L7322J1513L1287J25043j1550p9641K4689R7385n3617k23784
$$ 16385 -46354 -9032 2481 33768 158811 147261 67620 92309 189694 136077 -87707
9721h7707j10551Q1959L8300L2671m443n9600j61252k8104R0910L5859k038q945
$$ -87707 -198258 -116299 -77999 -45328 -49771 -109371 -270623 -298727 -207817 -171958 -173996 -182941
9709a82941L0182N5957J04856P1969j07772r1066m2888K5077N5634O1200M802
$$ -182941 -152759 -96802 8054 80023 -27749 -118815 -161703 -136626 -80992 -19792 -14990
9698a4990J10927R935k2084J0576m3318K4744O1560N5513J8755j19314k2880l6147
$$ -14990 95937 105872 83788 94364 51046 75790 137350 192863 211618 92304 69424 33277
9686C3277J4573J8918K9125k7147O5587k1330Q5741P3559O9584q5441j44487r2162
$$ 33277 47850 66768 95893 68746 134333 113003 198744 272303 341887 256446 111959 19797
9674A9797K8397P1185K8089p1973m1715Q2140J22499k0663j29695N012q0540j75418
$$ 19797 48194 119379 147468 75495 33780 115920 238419 217756 88061 93073 12533 -162885
9662a62885j64321P5363J57248K689L0414R6923P62n1786L2802N1729q0417j22596
$$ -162885 -327206 -251843 -94595 -91906 -61492 35431 36193 -15593 17209 68938 -11479 -134075
9650a34075r8474j2115K4354o7553R2271J07988P2492R7650L9560j544P2375o8463
$$ -134075 -232549 -244664 -220310 -287863 -195592 -87604 -15112 82538 122098 120554 192929 124466
9638A24466k14717n9994O2153J33173l4284j17905K4534J61688L6919k7282P355
$$ 124466 -90251 -150245 -88092 45081 10797 -107108 -82574 79114 116033 88751 96106
9627I6106N0215J78r2404P2989q4221j27601M3755Q7006l9939J0116Q2674K6507
$$ 96106 146321 146499 54095 127084 42863 -84738 -40983 46023 6084 16200 98874 125381
9615A25381j16549Q3373M8104o0724j31001r0451O7774O5589J5048J32875l0712
$$ 125381 8832 92205 140309 79585 -51416 -141867 -74093 -8504 6544 139419 108707
9604A08707L2990m4991j7653Q7327L7231o1023j70603l2467m4325K8764Q4219
$$ 108707 141697 96706 79053 166380 203611 142588 -28015 -60482 -104807 -76043 8176
9593H176N0777k2792K4025J5016k3140p4288L7016k0448j16654R3764O5128R2549
$$ 8176 58953 36161 60186 75202 52062 -22226 14790 -5658 -122312 -28548 36580 129129
9581A29129j3589q7764J35077K0359l0418o1888j52271J09199m6581n4508J12393
$$ 129129 115540 27776 162853 183212 152794 90906 -61365 47834 1253 -53255 59138
9570E9138R9537L755k1457j09773n5697K5700j0708L1686K9518q062k0778l4779
$$ 59138 158675 162430 140973 31200 -24497 1203 -9505 22181 51699 43637 22859 -11920
9558a1920O7535J27262m0556j4649Q6228J2266p8939j51874J5895r532N4668J19029
$$ -11920 55615 182877 142321 127672 213900 226166 147227 -4647 11248 1716 56384 175413
9546A75413j8939N0787p4697j56546K3334P1043l7531o5980P0381J39126J42355
$$ 175413 156474 207261 132564 -23982 -648 70395 32864 -33116 37265 176391 318746
9535C18746m6241m8078K5740k5454m8735j9699p4087K6892J18836J2870q6035
$$ 318746 272505 224427 250167 224713 175978 156279 82192 109084 227920 240790 154755
9524A54755o9513K0349N6595j1390n1434k7636J18714l7213n7589L3278J57224
$$ 154755 85242 105591 162186 150796 99362 71726 190440 153227 95638 128916 286140
9513B86140R7286J6593p363o9698r6843j11614J32514Q087n7579k7614l7402L6456
$$ 286140 383426 400019 392656 322958 226115 114501 247015 255102 197523 169909 132507 168963
9501A68963k3412p2658P1445P068N0006Q946j56911r123J11959J4477m4836l4069
$$ 168963 145551 72893 144338 151406 201412 210358 53447 44324 156283 170760 125924 91855
9489I1855R7325J04961q8590j04021J2725K4360J26700O8030n1802l1488p7883
$$ 91855 189180 294141 205551 101530 114255 138615 265315 333345 281543 250055 172172
9478A72172k9801J322Q2853J63122N4575l9253J1542K8398m5284j905l0669n8899
$$ 172172 142371 143693 226546 389668 444243 404990 416532 444930 399646 397741 367072 308173
9466C08173L0819Q9355r1288o9771J59137J57593R575o1407M459l9034j48233
$$ 308173 338992 428347 337059 267288 426425 584018 593593 532186 536645 497611 349378
9455C49378J933P2341R6254J63828p5563j1517L5393k148j8707j01359O135M088
$$ 349378 351311 423652 519906 683734 608171 596654 632047 629899 611192 509833 515968 520056
9443E20056L4010P8200Q1597k2757J12630k8687j15010P365o2549J7557J21839
$$ 520056 554066 632266 713863 691106 803736 775049 660039 667404 604855 622412 744251
9432G44251p7886K1330N0573o2957J03674L2295r5887m4440Q3029J08609K0110
$$ 744251 666365 687695 738268 675311 778985 811280 715393 670953 753982 862591 882701
9421H82701R222P4606R1981L8617o1701J35533L9827k5310L3534Q2105m3150j0459
$$ 882701 891923 966529 1058510 1097127 1035426 1170959 1210786 1185476 1219010 1301115 1257965 1247506
9409A247506J19597K8000p48l1655L3132R1119J64285J41167L8109j12135O3368
$$ 1247506 1367103 1395103 1394355 1362700 1395832 1486951 1651236 1792403 1830512 1718377 1781745
9398A781745K55195Q4112j17839M7657J12089J27671J23421L4795J02205O4134
$$ 1781745 2036940 2121052 2003213 2050870 2162959 2290630 2414051 2448846 2551051 2615185
9388B615185J70276P9404K24315J26064O4422K6865N5795J20596J53924J52913
$$ 2615185 2785461 2864865 3089180 3215244 3279666 3306531 3362326 3482922 3636846 3789759
9378C789759K54831J93187K21380J86016K42214N1905J91300J98877M9246R5752
$$ 3789759 4044590 4237777 4459157 4645173 4887387 4939292 5130592 5329469 5378715 5474467
9368E474467J50725J75545J45468K20749K53524Q8604K7824l0414J27885J86476
$$ 5474467 5625192 5800737 5946205 6166954 6420478 6509082 6536906 6506492 6634377 6820853
9358F820853J22630P5756O9996n3296P0861J59437J6670q9084j44320j76782n6735
$$ 6820853 6943483 7019239 7089235 7035939 7106800 7266237 7282907 7193823 7049503 6872721 6815986
9347F815986l5981j19526j60978j04684p9457l4583q3370p5040j28061k90615
$$ 6815986 6780005 6660479 6499501 6394817 6315360 6280777 6197407 6122367 5994306 5703691
9337E703691j79029j00506j90321j68212q1738j25803k24584j15172p4081k70867
$$ 5703691 5524662 5424156 5233835 5065623 4983885 4858082 4633498 4518326 4444245 4173378
9327D173378k07632j16775r311j65388q0863p4936n3737k14993p7921j04435j33207
$$ 4173378 3965746 3848971 3839660 3674272 3593409 3518473 3464736 3249743 3171822 3067387 2934180
9316B934180j18070n4274j27660m8062q0879j37488q7888l3677j3913r3539o6736
$$ 2934180 2816110 2761836 2634176 2586114 2505235 2367747 2279859 2246182 2232269 2138730 2071994
9305B071994j13409j17084k1730j6423m2059o0991o8735q7572k6578j04732j26932
$$ 2071994 1958585 1841501 1819771 1803348 1761289 1700298 1631563 1543991 1517413 1412681 1285749
9294A285749r6576Q6842P0382O7318J3443m6380j18969k6024K5170n2698r7729
$$ 1285749 1189173 1276015 1346397 1413715 1427158 1380778 1261809 1235785 1260955 1208257 1110528
9283A110528r7708J7399J8641j4746o0058K0258j31784q8110J41713k7353l5386
$$ 1110528 1012820 1030219 1048860 1034114 974056 994314 862530 774420 916133 888780 853394
9272H53394Q0421j3957N7624j05223j63116m3384O197J2684P4220M4179j05465
$$ 853394 933815 919858 977482 872259 709143 665759 671956 684640 758860 803039 697574
9261F97574l2642j7612j74948J5270q2274O552j0587O7519j0233j03240q1354
$$ 697574 664932 647320 472372 487642 405368 411920 401333 468852 458619 355379 274025
9250B74025J545k3973O2042J62043P3507n9178l8079J3248l6766j45398j01804
$$ 274025 275570 251597 313639 475682 549189 490011 451932 465180 428414 283016 181212
9239A81212P7941J56701J4728n1876J0777J4994M7306n6658n2803P4611n5042
$$ 181212 259153 415854 430582 378706 389483 404477 451783 395125 342322 416933 361891
9228C61891n3901o9351J9480M425p2306J09680q8268o3685J59586N6928n8199
$$ 361891 307990 238639 258119 262544 190238 299918 211650 147965 307551 364479 306280
9217C06280j09180j13872L1677k948J38317P8811R6995N1237J0278j10067j00098
$$ 306280 197100 83228 114905 111957 250274 329085 426080 477317 487595 377528 277430
9206B77430m0231M2973L3385j43871O0367Q5929J296M980N5619j22885q0594K6921
$$ 277430 237199 280172 313557 169686 230053 315982 317278 322258 377877 254992 174398 201319
9194B01319J7142q2707m0534j877p9162q8209n103P1221P5727K118l381M1104
$$ 201319 218461 135754 95220 93343 14181 -74028 -79131 -7910 67817 69935 66554 107658
9182A07658L5090R4519N7605n4464l6318L1507n5023M08R355N2297o526k4804
$$ 107658 142748 237267 294872 240408 204090 235597 180574 180982 190337 242634 236108 211304
9170B11304l2483j5111o6863J2696L8524l1050M8240o6374k3651j4109J0315K3326
$$ 211304 178821 163710 96847 109543 148067 117017 165257 98883 75232 61123 71438 94764
9158I4764N6799M031q5563O2926J7624j53804K9201R3320P4566r447j11486J1697
$$ 94764 151563 155594 70031 132957 150581 -3223 25978 119298 193864 184417 72931 84628
9146H4628l682m2421q451j4809M3373J0809j67650k1277k0726O4487K7759j0884
$$ 84628 80946 38525 30074 15265 58638 69447 -98203 -119480 -140206 -75719 -47960 -58844
9134e8844L653J89452J8646l1729p8667o736J39396L9252J2716m0990o9357n1852
$$ -58844 -55191 134261 152907 121178 42511 35775 175171 214423 227139 186149 116792 64940
9122F4940l171Q918j02641N102J2660K6804M8227K1682o2478K4652o6898L4696
$$ 64940 61769 70687 -31954 -26852 -14192 12612 60839 82521 20043 44695 -22203 12493
9110A2493p3310J6390J09976m3250j1014K4251j1061O8072J362m6776J5919N240
$$ 12493 -60817 -44427 65549 22299 11285 35536 24475 92547 93909 47133 63052 68292
9098F8292n5331O4971n1407j08952n0030p470O2796J1109N1264P1314P4073m3493
$$ 68292 12961 77932 26525 -82427 -132457 -139927 -77131 -66022 -14758 56556 130629 87136
9086H7136k6691j6487m4652L0007n3700L3868O1390k7425J2198m0501Q6135j00777
$$ 87136 60445 43958 -694 29313 -24387 9481 70871 43446 55644 15143 101278 501
9074E01j40256j4947L1478J26013R4199n1186m0092k6330K2171M5485L1857N7898
$$ 501 -139755 -154702 -123224 2789 96988 45802 5710 -20620 1551 47036 78893 136791
9062A36791L5189j61811j9434J72976l968k9842m1605j28426l0730Q4635N5558
$$ 136791 171980 10169 -9265 163711 159743 129901 88296 -40130 -70860 13775 69333
9051F9333p3732K9781K10387M8440j71973p5317o5903m5993J07999O195q1914
$$ 69333 -4399 25382 235769 284209 112236 36919 -28984 -74977 33022 39217 -42697
9040d2697J04999N7896o7202J9844J00289q2389n0442n0714n0425J84434R4296
$$ -42697 62302 120198 52996 72840 173129 90740 40298 -10416 -60841 123593 217889
9029B17889j09255j47377k922j4172o171M8388M8388O8697L7288k8949M4737Q2821
$$ 217889 108634 -38743 -41665 -55837 -62008 -13620 34768 103465 140753 111804 156541 239362
9017B39362K3798m0268j41878n7365j24927N48N9698O0856p3799j688N7999M7492
$$ 239362 263160 222892 81014 23649 -101278 -100730 -41032 19824 -53975 -55663 2336 49828
9005D9828L4822J45378K3108n575m1035J2905k3361j1292R8046j9030j21723l6093
$$ 49828 84650 230028 253136 247561 206526 219431 196070 184778 282824 263794 142071 105978
8993A05978j6084l6091n9381o3370P7060j12797M7455O8173J4813k1625l7236
$$ 105978 89894 53803 -5578 -68948 8112 -104685 -57230 10943 25756 4131 -33105
8982c3105m9368M8922o22o4032p441l1906j20991J38545J17963k5124M0765M7228
$$ -33105 -82473 -33551 -34173 -98205 -105646 -137552 -258543 -119998 -2035 -27159 13606 60834
8970F0834k4474K61J914q8939n813r317K141j9741j7455J52778J31790j4264n9129
$$ 60834 36360 36621 38535 -50404 -56217 -65534 -63393 -83134 -100589 52189 183979 169715 110586
8957A10586r3549Q8961p0217j04766q697j62956L9774J03925J2374r9124l8932
$$ 110586 17037 105998 35781 -68985 -77682 -240638 -200864 -96939 -84565 -183689 -222621
8946b22621L5052R3196j25165M6551q2627k2642J02660r473L1056J79221J19485
$$ -222621 -187569 -94373 -219538 -172987 -255614 -278256 -175596 -185069 -154013 25208 144693
8935A44693r945j04401l2747m3710N5783O6792r130j12877p3421k9494r891J9307
$$ 144693 134748 30347 -2400 -46110 9673 76465 67335 -45542 -118963 -148457 -158348 -139041
8923a39041J19910N9510j239N6275K1560p4478j57881K4375P8898K9196j1798
$$ -139041 -19131 40379 39140 95415 116975 42497 -115384 -91009 -12111 17085 5287
8912E287M9352L4424Q4373N8503J6409J5377n4401l9331k3217r1813k02817q880
$$ 5287 54639 89063 173436 231939 248348 263725 209324 169993 146776 54963 -147854 -156734
8900a56734R8720L0473K6610j8554j5134q7709m5817R8174P8022j1095m9417l6836
$$ -156734 -58014 -27541 -931 -19485 -34619 -122328 -168145 -69971 8051 -3044 -52461 -89297
8888h9297K707O2103L0745N8666P3577M0553K261j9366j06718J8849O6898j06180
$$ -89297 -86590 -24487 6258 64924 138501 179054 181315 161949 55231 74080 140978 34798
8876C4798j55394J06198M4445J4815l4355N610N403J49165L584j85347l9574j17198
$$ 34798 -120596 -14398 30047 44862 10507 16117 21520 170685 174269 -11078 -50652 -167850
8864a67850n3215m8014N0084J73167N0991r363o276L8450K8946N4276r6621o5886
$$ -167850 -221065 -269079 -218995 -45828 5163 -4200 -10476 27974 56920 111196 14575 -51311
8852e1311O8173k53p705M7522J9154p589j05437N3617K8029o3907j74168o940
$$ -51311 16862 16609 8904 56426 75580 67991 -37446 16171 44200 -19707 -193875 -200815
8840b00815Q9781J4007J4607L8155l2316P826K4351O16L9257K9032O4654Q4584
$$ -200815 -111034 -97027 -82420 -44265 -76581 -68755 -44404 -43788 -4531 24501 89155 173739
8828A73739n1571O465o2361j29010o1097r9879K11822q464m2318q093l9765M1336
$$ 173739 122168 128633 66272 -62738 -123835 -223714 -11892 -20356 -62674 -70767 -110532 -69196
8816f9196K14239m3684j37083q0000M0675k222J05511J28231J9467r58n7670q1730
$$ -69196 145043 101359 -35724 -115724 -75049 -77271 28240 156471 175938 174980 117310 35580
8804C5580j0856N0834P1726O6070k548k2777q7324p9834K0964m6381N3426j1981
$$ 35580 24724 75558 147284 213354 210806 188029 100705 20871 41835 -4546 48880 36899
8792C6899L6213l10L5468J2847p5949p8894N81n6126M7097p1892O7961Q8959N0123
$$ 36899 73112 72802 108270 121117 45168 -33726 -33145 -89271 -42174 -114066 -46105 42854 92977
8779I2977q758M6655Q872l0202J4483o0563j66864j0930m7923N9887L7119J817
$$ 92977 84219 130874 139746 109544 124027 63464 -103400 -114330 -162253 -102366 -65247 -63430
8767f3430K5055K8250L962L2993r190n1638M1284m1167j3161L2403O4826o053
$$ -63430 -38375 -10125 -6163 26830 17640 -33998 7286 -33881 -47042 -14639 50187 44134
8755D4134o6442M4151n9077l3489j6598L2341J6363P6008K2429m5655q080P6785
$$ 44134 -22308 21843 -37234 -70723 -87321 -54980 -38617 37391 59820 14165 6085 82870
8743H2870O5122n3746n5006q6750O6237O4298K6788j0076q1019j56878n4J44933
$$ 82870 147992 94246 39240 -47510 18727 83025 109813 99737 18718 -138160 -138214 6719
8731F719n733o0224J2253M5596m209o9556k0477R0933m6116p9154n9722n3302
$$ 6719 986 -59238 -46985 -1389 -5598 -75154 -95631 -4698 -50814 -129968 -189690 -242992
8719b42992J84453J34743k1127n1121L4111J43362O8159m6717k9881l7432k9163
$$ -242992 -58539 76204 55077 3956 38067 181429 249588 202871 172990 135558 106395
8708A06395q792J12177o42j28059n9377J20976l7893j72548K6817O0045l5583
$$ 106395 97603 209780 209138 81079 21702 142678 104785 -67763 -40946 19099 -16484
8697a6484l0419Q118q745L1381J29754R2339r2179m8019j6051m2175m2473N3967
$$ -16484 -46903 -38785 -47530 -16149 113605 205944 113765 65746 49695 7520 -34953 19014
8685A9014l3526j27276j12679M6698J36227J02815J61727K7301q7111J3692J4904
$$ 19014 -14512 -141788 -254467 -207769 -71542 31273 193000 220301 133190 146882 161786
8674A61786o4199j13883n4347J18597P8089n143J03886R0265q9299r6956j53971
$$ 161786 97587 -16296 -70643 47954 126043 120900 224786 315051 225752 128796 -25175
8663b5175O6066j5957j7178N1527P4773n8749o0228J38646P8661o305l1150q7254
$$ -25175 40891 24934 7756 59283 134056 75307 15079 153725 232386 226081 194931 107677
8651A07677j49856J4535J4563J7998J65384Q7415j13345l7423N0975J08984j767
$$ 107677 -42179 -27644 -13081 4917 170301 257716 144371 106948 157923 266907 265140
8640B65140J72279Q3693J91622N32603Q25326M81692K4384k40273n66892n88622
$$ 265140 437419 521112 712734 1245337 2070663 2552355 2576739 2336466 1769574 1180952
8630A180952k69554j51922j32924m3352o2027j01341n4732j28845p8860K6571
$$ 1180952 911398 759476 626552 583200 521173 419832 365100 236255 157395 183966
$$ [...]
##END NTUPLES=NMR SPECTRUM
##END=
