##TITLE=Analysis number 326748
Compound Code cc 59509
Book Reference 508/50
Project Code adrs
Chemist Name antons
##JCAMPDX= 6.0         $$ Bruker NMR JCAMP-DX V2.0
##DATA TYPE= NMR SPECTRUM
##DATA CLASS= NTUPLES
##ORIGIN= Bruker BioSpin GmbH
##OWNER= nmr
$$ XWIN-NMR		Version 3.5
$$ Wed Feb 21 13:27:54 2007 GMT Standard Time (UT+0h)  MAYBRIDGE\nmr@NMR_250MHZ
##.OBSERVE FREQUENCY= 250.131544655141
##.OBSERVE NUCLEUS= ^1H
##.ACQUISITION MODE= SIMULTANEOUS (DQD)
##.ACQUISITION SCHEME= undefined
##.AVERAGES= 16
##.DIGITISER RES= 18
##SPECTROMETER/DATA SYSTEM= dpx250
##.PULSE SEQUENCE= zg30
##.SOLVENT NAME= CDCl3
##.SHIFT REFERENCE= (INTERNAL, CDCl3, 0, 16.522)
##AUDIT TRAIL= $$ (NUMBER, WHEN, WHO, WHERE, WHAT)
$$ ##TITLE= Audit trail, XWIN-NMR		Version 3.5
$$ ##JCAMPDX= 5.01
$$ ##ORIGIN= Bruker BioSpin GmbH
$$ ##OWNER= nmr
$$ C:\u/data/dgb/nmr/ADRS/1400/pdata/1/auditp.txt
$$ ##AUDIT TRAIL=  $$ (NUMBER, WHEN, WHO, WHERE, WHAT)
(   1,<2007-02-21 13:27:32.17 +000>,<MAYBRIDGE\nmr>,<NMR_250MHZ>,
      <created by zg, POWCHK disabled, PULCHK disabled
       configuration hash MD5:
       49 4B E0 1D 92 C2 6B 37 9F E6 65 BC 52 41 86 1D
       data hash MD5: 64K
       B2 FB F7 2F 1E 5F B5 69 1F B3 A4 C2 09 EF D5 AA>)
(   2,<2007-02-21 13:27:44.57 +000>,<MAYBRIDGE\nmr>,<NMR_250MHZ>,
      <Start of raw data processing
       ef LB = 0.3 FT_mod = 6 PKNL = 1 SI = 32K 
       data hash MD5: 32K
       AA F8 70 92 64 BD 86 68 59 9E FB 8F 50 75 58 63>)
(   3,<2007-02-21 13:27:46.28 +000>,<MAYBRIDGE\nmr>,<NMR_250MHZ>,
      <apk 
       data hash MD5: 32K
       57 21 8D D8 02 C1 A7 85 E5 38 3F CF 7C C0 B3 40>)
(   4,<2007-02-21 13:27:47.07 +000>,<MAYBRIDGE\nmr>,<NMR_250MHZ>,
      <abs ABSG = 5 
       data hash MD5: 32K
       82 D3 A6 AB 3F 0F E3 30 CA 06 5A 3C 31 55 94 B8>)
$$ ##END=
$$ 
$$ hash MD5
$$ F3 D3 67 14 54 8A 0D 3E 41 2A 69 33 4F A3 EE CA
##$RELAX= 
##$RELAX= 
##$RELAX= 
##$RELAX= 
##$RELAX= 
##$RELAX= 
##$RELAX= 
$$ Bruker specific parameters
$$ --------------------------
##$DU= <C:\u>
##$EXPNO= 1400
##$NAME= <ADRS>
##$PROCNO= 1
##$TYPE= <nmr>
##$USER= <dgb>
##$AMP= (0..31)
100 100 100 100 100 100 100 100 100 100 100 100 100 100 100 100 100 100 
100 100 100 100 100 100 100 100 100 100 100 100 100 100 
##$AQSEQ= 0
##$AQ_mod= 3
##$AUNM= <au_zg>
##$AUTOPOS= <19 >
##$BF1= 250.13
##$BF2= 250.13
##$BF3= 250.13
##$BF4= 250.13
##$BF5= 500.13
##$BF6= 500.13
##$BF7= 500.13
##$BF8= 500.13
##$BYTORDA= 1
##$CFDGTYP= 0
##$CFRGTYP= 5
##$CHEMSTR= <none>
##$CNST= (0..31)
1 1 145 1 1 1 1 1 1 1 1 1 1 1 1 1 1 1 1 1 1 1 1 1 1 1 1 1 1 1 1 1 
##$CPDPRG= <>
##$CPDPRG1= <>
##$CPDPRG2= <>
##$CPDPRG3= <>
##$CPDPRG4= <mlev>
##$CPDPRG5= <mlev>
##$CPDPRG6= <mlev>
##$CPDPRG7= <mlev>
##$CPDPRG8= <mlev>
##$CPDPRGB= <>
##$CPDPRGT= <>
##$D= (0..31)
0 1 0 0 0 0 0 0 0 0.06 0 0 0 0 0 0 0.0002 0 0 0 0 0 0 0 0 0 0 0 0 0 0 
0 
##$DATE= 1172064450
##$DBL= (0..7)
120 120 120 120 120 120 120 120 
##$DBP= (0..7)
150 150 150 150 150 150 150 150 
##$DBP07= 0
##$DBPNAM0= <>
##$DBPNAM1= <>
$$ [...]
##$SUBNAM7= <"">
##$SUBNAM8= <"">
##$SUBNAM9= <"">
##$SW= 20.6930455092707
##$SWIBOX= (0..15)
0 0 3 0 0 0 0 0 0 0 0 0 0 0 0 0 
##$SW_h= 5175.983436853
##$TD= 65536
##$TD0= 1
##$TE= 295.16
##$TE2= 300
##$TE3= 300
##$TEG= 300
##$TL= (0..7)
0 120 120 120 120 120 120 120 
##$TP= (0..7)
150 150 150 150 150 150 150 150 
##$TP07= 0
##$TPNAME0= <>
##$TPNAME1= <>
##$TPNAME2= <>
##$TPNAME3= <>
##$TPNAME4= <>
##$TPNAME5= <>
##$TPNAME6= <>
##$TPNAME7= <>
##$TPOAL= (0..7)
0.5 0.5 0.5 0.5 0.5 0.5 0.5 0.5 
##$TPOFFS= (0..7)
0 0 0 0 0 0 0 0 
##$TUNHIN= 0
##$TUNHOUT= 0
##$TUNXOUT= 0
##$USERA1= <user>
##$USERA2= <user>
##$USERA3= <user>
##$USERA4= <user>
##$USERA5= <user>
##$V9= 5
##$VALIST= <valist>
##$VCLIST= <CCCCCCCCCCCCCCC>
##$VD= 0
##$VDLIST= <DDDDDDDDDDDDDDD>
##$VPLIST= <PPPPPPPPPPPPPPP>
##$VTLIST= <TTTTTTTTTTTTTTT>
##$WBST= 1024
##$WBSW= 4
##$XGAIN= (0..3)
0 0 0 0 
##$XL= 0
##$YL= 0
##$YMAX_a= 508785
##$YMIN_a= -492016
##$ZGOPTNS= <>
##$ZL1= 120
##$ZL2= 120
##$ZL3= 120
##$ZL4= 120
##$ABSF1= 16.522
##$ABSF2= -4.171173
##$ABSG= 5
##$ABSL= 3
##$ALPHA= 0
##$AQORDER= 0
##$ASSFAC= 0
##$ASSFACI= 0
##$ASSFACX= 0
##$ASSWID= 0
##$AUNMP= <proc_1d>
##$AZFE= 0.1
##$AZFW= 0.1
##$BCFW= 0
##$BC_mod= 0
##$BYTORDP= 0
##$COROFFS= 0
##$CY= 12.5
##$DATMOD= 1
##$DC= 0
##$DFILT= <>
##$DTYPP= 0
##$F1P= 14.0000005364418
##$F2P= -0.99999901652339
##$FCOR= 0.5
##$FTSIZE= 32768
##$FT_mod= 6
##$GAMMA= 0
##$GB= 0
##$INTBC= 1
##$INTSCL= 1
##$ISEN= 128
##$LB= 0.3
##$LEV0= 0
##$LPBIN= 0
##$MAXI= 10000
##$MC2= 0
##$MEAN= 0
##$ME_mod= 0
##$MI= 0
##$NCOEF= 0
##$NC_proc= -2
##$NLEV= 6
##$NOISF1= 0
##$NOISF2= 0
##$NSP= 0
##$NTH_PI= 0
##$NZP= 0
##$OFFSET= 16.522
##$PC= 1
##$PHC0= 227.0754
##$PHC1= 6.504819
##$PH_mod= 1
##$PKNL= yes
##$PPARMOD= 0
##$PSCAL= 4
##$PSIGN= 0
##$REVERSE= no
##$SF= 250.13
##$SI= 32768
##$SIGF1= 0
##$SIGF2= 0
##$SINO= 400
##$SIOLD= 32768
##$SREGLST= <1H.CDCl3>
##$SSB= 0
##$STSI= 32768
##$STSR= 0
##$SW_p= 5175.98343685301
##$SYMM= 0
##$S_DEV= 0
##$TDeff= 65536
##$TDoff= 0
##$TI= <Analysis number 999999
Compound Code 99
Book Reference 9
Project Code 9>
##$TILT= no
##$TM1= 0
##$TM2= 0
##$TOPLEV= 0
##$USERP1= <user>
##$USERP2= <user>
##$USERP3= <user>
##$USERP4= <user>
##$USERP5= <user>
##$WDW= 1
##$XDIM= 32768
##$YMAX_p= 377957218
##$YMIN_p= -28995
$$ End of Bruker specific parameters
$$ ---------------------------------
##NTUPLES= NMR SPECTRUM
##VAR_NAME=  FREQUENCY,     SPECTRUM/REAL,   SPECTRUM/IMAG
##SYMBOL=    X,             R,               I
##VAR_TYPE=  INDEPENDENT,   DEPENDENT,       DEPENDENT
##VAR_FORM=  AFFN,          ASDF,            ASDF
##VAR_DIM=   32768,         32768,           32768
##UNITS=     HZ,            ARBITRARY UNITS, ARBITRARY UNITS
##FACTOR=    0.157963299565203, 1,           1
##FIRST=     4132.6476996994, 0,             0
##LAST=      -1043.33573715361, 0,           0
##MIN=       -1043.33573715361, -28995,      0
##MAX=       4132.6476996994, 377957218,     0
$$ Real data points
##PAGE= N=1
##DATA TABLE= (X++(R..R)), XYDATA
$$ [...]
16588g295K068m040J236j976J222l794j901N797R311J201l288P69O46R38J913
16573B807j941n440J117n223j459j63L683M773r65m905k03J51l103K475K107j740
16557h029L389Q903K971n889p46p587l819M629J969K78J0277k701n302k098j24
16542c879q22J865N521l155p598K74L657M854N589L74k880L982q758l046n17K93
16526d246Q41L871k236M950m02l870r513M192K042K763N728O409m663k948n876
16511b958l407l424L421j865P59K799N21n197L435j215L763N912J718k449n370
16496c557j999L282J754J562n684q012k864P30l651M633M643j823o362k30M278
16481a3300Q953L010k494M223M082l742l324n246m367L141J164N189L757L99k224
$$ y = [-7295, -5227, -9267, -8031, -10007, -8785, -12579, -14480, -8683, 628, 1829, -1459, -690, -44, 894, 2807, 866, -4574, -3457, -8680, -10139, -10302, -6619, -1846, -2811, -7716, -7919, -7768, -10871, -8396, -6289, -8029, -4640, 4263, 7234, 1345, 599, -6988, -10807, -6178, -4209, -3931, 6346, 3645, -1657, -3755, -3879, -4701, -2836, 2685, -470, -8068, -7794, -4137, 717, 6306, 6680, 3800, 7782, -976, -4022, -4539, -4246, -3405, 466, -1770, 3180, 2778, -1092, -10605, -6413, -4371, -1608, 4120, 10529, 5866, 2918, -2958, -6365, -9789, -6368, -8233, -7474, -4675, -4154, -9351, -5916, -7131, -3368, 2544, 4262, 1813, -3557, -5556, -2274, -520, 1042, -4642, -12654, -15518, -14788, -18439, -13806, -9163, -10986, -17348, -17578, -13300, -4347, -1337, -3831, 392, 4474, 732, -2592, -7838, -12205, -9064, -7900, -2711, 1046, 1445, -779]
16466g79L390k526O77k968j687K652Q776l98n554m648j003l10J329J034q149l666
16450a3830N612J782k404j561K305L487n948L484m50o172j355J761R96R22K630
16435h741J801J913j585n789m012M023L231o564l949K499N539L591k491m755J667
16420a3622P156P031q3l908K492K435J216R55o015l412q017q130K125R566L025
16405g186M355J5Q730m67r881p726m020J402j082p59J580L876N003j954j790L341
16389f563L277K981l214l028j717J412M357k43K066K5k503K422k182k140K237
16374b813J687k369k01M359O374J367q120j2470O152N772O92k938k084J977J1160
16359H545m677L760k224j465k962N04K178n422m090j831L006Q428k35o466p976
$$ y = [-779, 2611, 85, 762, -2206, -3893, -1241, 7535, 7137, 1583, -3065, -4068, -4378, -3049, -2015, -10164, -13830, -8218, -6436, -8840, -10401, -8096, -4609, -10557, -7073, -7523, -13695, -15050, -13289, -12293, -11371, -8741, -6940, -5027, -6612, -12401, -16413, -12390, -9159, -15723, -19672, -17173, -11634, -8043, -10534, -15289, -13622, -6466, 565, 482, -3426, -934, 1501, 2717, 3672, -2343, -5755, -13772, -21902, -19777, -10211, -7186, -2831, -2816, 5914, 5447, -4434, -12160, -16180, -14778, -15860, -16619, -15039, -11163, -6160, -8114, -9904, -6563, -3286, -305, -3519, -6547, -8264, -6852, -2495, -2738, -672, -647, -3150, -728, -2910, -5050, -2813, -1126, -3495, -3696, 663, 7037, 8404, 284, -12186, -6034, -262, 430, -2508, -4592, -2615, 8545, 3868, 7628, 5404, 3939, 977, 1481, 3659, -1763, -5853, -7684, -4678, 3750, 3515, -2951, -10927]
16344a0927M323P704k328L209l640m199K123J184K982j145l745R873P433n000
16330G847q96m191p992k079P7M875j053K228M279q781O31j57O2j932n396L912
16314h566J0846M705M671o220J10m895n219K230O396M831M129q728p861L743M46
16299F18J257l262N58k229Q6P267J31k137L134j043o603m625k452R01O670N031
16283C302n377j0820j674J752J0421L007j0k769j882j020M953k546p14N701N739
16268H063j512l207k06M732j6125r330L732j961p717k487O723O638Q249R76K170
16253a262K216K571k605k062j384M23L569j994p604K601J0707l380q877k292j179
16238a0552K47K64K253k441l413j312N523m239k891M974J0045J756k508K967K779
$$ y = [-10927, -6604, 1100, -1228, 1981, -1659, -5858, -3735, -2551, 431, -714, -4459, 5414, 12847, 7847, 6951, 2760, -5232, -7311, -7234, -2359, -3412, -1184, 3095, -5686, -5055, -5212, -5150, -7082, -12478, -8566, 2280, 6985, 11656, 5436, 5546, 651, -4568, -2338, 4058, 8889, 13018, 4290, -3571, 172, 618, 1875, -1387, -829, -3058, -2972, 4295, 4426, 2289, 5423, 4380, -2223, -6848, -9300, -8399, -1729, 3302, -2075, -12895, -14569, -12817, -2396, 611, 601, -2168, -4050, -5070, -117, -2663, -3377, 2324, 8063, 6551, 3344, 3138, 7870, -8255, -17585, -13853, -15814, -23531, -26018, -19295, -12657, -4408, -3432, -1262, 954, 3525, 920, -1142, -2526, -2103, 1466, -528, -8132, -5531, 5176, 1796, -7081, -9373, -10552, -10305, -10041, -7788, -10229, -13642, -14954, -9431, -13670, -16561, -11587, -1542, 214, -2294, 673, 3452]
16223C452m482K345k513l742k296J117P465j392m09j15k874k911n921L271K714
16208f291k679j106M802q92m806k856L031J1329K015l090m204q065k761K977K608
16193i988l681k781Q0L239L687n779k424M307P592J781M877K372k407J042k787
16178h70p441Q67K467k380P834M877N016n617j0163j705J369j879j846O963l32
16163b840O128N262L195k720q443k831n712o495m668Q040O963m3M271Q035k547
16148E595o187J72K664J874K901k370K313n189p130N430k888m152J376L447j442
16133c586O516o05j601M714p8l652j014O391n439k523m786N817L571O711K031
16118A2467n107m863j99K247O844P42o531n69j99L348l278q104J511O284o243
$$ y = [3452, -1030, 1315, -1198, -4940, -7236, -6119, 1346, -46, -455, -570, -3444, -6355, -12276, -9005, -6291, -8970, -10076, -5274, -6166, -10972, -13828, -10797, 532, 2547, -543, -4747, -12812, -15573, -12596, -9988, -13669, -16450, -16370, -13131, -9444, -15223, -17647, -13340, -5748, -3967, 910, 3282, 875, 1917, -870, -8311, -7444, -4977, -7357, 477, 5354, 10370, 4753, -5410, -7115, -5746, -7625, -9471, -2508, -2840, 3288, 8550, 11745, 9025, 582, -2249, -7961, -14456, -19124, -11084, -4121, -4164, 107, 8142, 5595, -592, -420, 2244, 4118, 7019, 4649, 6962, 1773, -5357, 73, -2815, -6967, -5591, -2144, -3586, 2930, 2325, 724, 5438, 5360, 1708, 694, 7085, 1646, -877, -5663, 154, 3725, 10436, 12467, 7360, 2497, 2298, 4545, 11389, 12131, 5600, 5031, 4832, 8180, 4902, -3202, -1691, 4593, -1650]
16103a650l646J076K583m82j311m430J022j327J578p065N853L389k332Q25K889
16088c028p491P3M320O221J727M678K612m419k528K79n866m480L365m591Q62R45
16072g321O542K095m590j828Q90L558L941R46k402j610K499J63M030R46j0432
16057b573m167l227k519n391l549R858L623M375Q153l014q223M25k828L596J1606
16042F145M201J666n607K378o10o240o109L633k212q99n614m7O603N636o716l291
16026g083K021O301j375j975j293L630N257m042k229n422K654N115k225j757P18
16011a705k997K317l642l105J716P263M900o563O456l933p098L423r59m167M49
15996g645j458M22m671L635O837K379K85k830r95K396J863l494l112J682j859
$$ y = [-1650, -5296, -4220, -1637, -2119, -3430, -7860, -6838, -8165, -6587, -13652, -7799, -4410, -6742, -5917, -3028, -10519, -10446, -6126, 95, 1822, 6500, 9112, 4693, 2165, 2444, -3422, -7902, -4537, -9128, -8266, -7321, -779, 1316, -3274, -5102, -4212, -654, 3287, 4233, 1831, 221, 2720, 2883, 6913, 7859, -2573, -6740, -9967, -12486, -17877, -21426, -11568, -7945, -3570, 4583, 1569, -6654, -6229, -9057, -5461, 6145, 10346, 12012, 6405, 8783, 8173, 1933, -4176, -543, -2755, -3654, -9268, -9315, -2712, 2924, -3792, -7083, -5062, 1239, -136, -2111, -3404, 226, 5483, 1441, -788, -6210, -3556, 1559, -666, -2423, -1705, -4702, -2385, -6027, -9132, -7416, -153, 4747, -1816, 4640, 707, -6391, -2968, -3927, -8094, -7645, -9103, -8681, -13352, -9717, -2880, -501, -216, -3046, -4041, -1645, 218, -3276, -6388, -4706, -6565]
15981f565l372o679j666rL359n80P55L330K959P183J879m257K949o917r773m971
15965b2375N681j792L09P840J645J751PO346Q467j564o502J68j582o623K808j481
15949f897n307q2N302J506m181j280M409M979P28n089l725K342o735L012N733
15934e285O356L090N569L596m329K557M110L317m268m963j646j0743p292M196
15920e735L309N670k786J220l625j335O65m548J294L867N917m83n833k75L638
15905I60m068m158J709Q022Q59R91l381k335K460k917o126J979k051m554k619
15890a5229M23P814O093o765j399J221L698M714j743j849K333L420K681m322l713
15875b623k234k689j787O558l629l562R692P15m372p526n348r2M860N606K630
$$ y = [-6565, -9937, -16616, -18282, -18291, -14932, -15512, -14757, -11427, -8468, -1285, 594, -3663, -714, -7631, -17404, -22375, -16694, -18486, -18177, -10337, -8692, -6941, -6934, -588, 7879, 6315, -187, -19, -1601, -8224, -5416, -6897, -12204, -12286, -6984, -5478, -9659, -10939, -6530, -1551, -823, -5912, -9637, -7295, -14030, -11018, -5285, 1071, 4161, 9730, 13326, 8997, 11554, 15664, 18981, 14713, 9750, 8104, -2639, -9931, -5735, -2426, 3244, 458, 1678, -1947, -3282, -2617, -7165, -5871, -2004, 3913, 3430, -2403, -2678, 960, -3108, -7266, -5557, 2465, 3324, 4315, 934, -1401, 1059, -1858, -7984, -6005, -8056, -12610, -15229, -14806, -6992, -899, -7664, -9063, -7842, -4144, 570, -1173, -3022, -689, 2731, 5412, 1090, -2623, -4857, -7546, -9333, -2775, -6404, -9966, -274, 441, -3931, -11457, -16805, -16897, -12037, -6431, -3801]
15860c801l359n792N250j161j598J217l681J01O568O789m410R29J45o561k590
15845a1954j161K822k877M297J860j687k398P98J778o038n214K368J2948J96n97
15830d859k313R24n79L064l821r69K536N178N086K700q486J080J059J756j962
15815C94j583n85m485m1q88o29j29M55m256M05K174M388k534m896M126M738M457
15798A111n29o367P73j885m85P35P511n289l707R42J38q20j870R63O09L839k557
15781f888J373L516N286K078L543M286k071p061l760m386j888m081K910L594l235
15766f784Q424Q522K976M013n959r776P68k044n361K049M81n418k02j774j806
15751a1891M512M376J986q32N942r9k645K51m168K585l209q091K142L563k491
$$ y = [-3801, -7160, -12952, -7702, -8863, -10461, -9244, -12925, -12824, -6256, 533, -3877, -2948, -2803, -9364, -11954, -13115, -10293, -13170, -8873, -7013, -8700, -11098, -10300, -8522, -14560, -19774, -17406, -4458, -4262, -4859, -7172, -6248, -6827, -3763, -7584, -8553, -6017, -839, 4247, 6947, -1539, -459, 600, 2356, 394, -1189, -1774, -6259, -6300, -7188, -7817, -7946, -7491, -11747, -11342, -9168, -4780, -7314, -12210, -8084, -3346, 1111, 582, -5785, -5012, -6897, -7382, -6647, 864, -4425, -8132, -7190, -7052, -7872, -9742, -8779, -8170, -4331, -6888, -5515, -1999, 3287, 5365, 8908, 13194, 11123, 4062, 302, -4084, -5972, -10053, -7143, -3549, -6784, 1640, 10162, 13138, 17151, 11192, 1416, 2184, 140, -5221, -3172, -2691, -8109, -8311, -10085, -11891, -7379, -3003, -1017, -1849, 4093, 3994, 1349, 1600, -2568, 17, -3192, -11283, -9141, -5578, -8069]
15736h069N16j173j310K070k885j1018k684N346J6160O189P665n051j0689p157
15722a2090P123r23l145p321m40J099R430K44l576P241l617o599m70M14L479K639
15706f512K101J138n579p698K398P331K871l503J9N138N403L598M333j445j0693
15691a100p177K948k827j975M008L114l63P22k02l156Q08L311N303n674N447Q21
15675D008l941k788N516N084m950q222l663j234j284J959n6J905N204L268j966
15660a160l711p955q54L850Q63N227L08o329j451L675N059j962q91J001k666m223
15644a1219L273Q812M19J040k639l821R4K399M260j090j095m661K186J646L960
15629C564j436j973o028j962P947K052n822K271R03j707N17r066J156j672K47
$$ y = [-8069, -7553, -8726, -10036, -7966, -10851, -21869, -24553, -19207, -3047, 3142, 10807, 5756, -4933, -12090, -4967, -5890, -9035, -16356, -16796, -15697, -6267, -6023, -9599, -2358, -5975, -12574, -13044, -12630, -9151, -6512, -4411, -3273, -8852, -16550, -14152, -6821, -3950, -7453, -7434, -2296, 3107, 6705, 11038, 9593, -1100, -8277, -5329, -8156, -10131, -6123, -3009, -3372, -2650, -2852, -6008, -5200, -1889, 3414, -2260, 3187, 4008, 67, -2721, 2795, 7879, 2929, -5293, -8956, -10190, -11474, -9515, -9571, -7666, -2462, 806, -1160, -4871, -12826, -13680, -9830, -8967, -3740, -3432, -9761, -11212, -7537, -2478, -4440, -5331, -4330, -6996, -11219, -7946, 866, 1285, 2325, -314, -4135, -4041, -1642, 2618, 1528, 433, -4228, -2042, -396, 3564, 2128, 155, -5873, -7835, 112, 2164, -3658, -1387, -484, -2191, -1674, -10740, -9584, -11256, -11009]
15614a1009L377n86l018l209L2O837J1930L57L566m309q722N795l23J017k915
15599a180J2K332M285J683m520m642j71O084j81m919k974M284O1K23J643n367
15583c347k205L878m92j129J448N448N429p870n484o843N416K443o071L782k66
15568e863o238k428o07J944R534K779P910J357p676J557L684J378J226J942l854
15553F645J682l33n191k680j725L165J311l744M253O746p072O66K823q100j485
15538c039P78l082r849M899M353q94m452m671M046J231j790m719N067L505k098
15523a0715J286L585M808o56n214N882O941J213m643l137l391j8l818N20O854
15508e03k319q452O62k215m030j498Q891J526j611N11Q38Q659K181m721k40p963
$$ y = [-11009, -7632, -8218, -11236, -14445, -14413, -7576, 4354, 4711, 8277, 3968, -4754, 1041, 718, 1735, -1180, -1168, 1164, 5449, 7132, 2612, -2030, -2201, 3883, 3702, -1217, -4191, 93, 154, 377, 2020, -3347, -5552, -1674, -2166, -3295, -1847, 3601, 9030, 1160, -4324, -11167, -5751, -3308, -9379, -5597, -5863, -12101, -14529, -15136, -13192, -3658, -879, 7031, 8388, 712, 2269, 5953, 7331, 8557, 10499, 6645, 8327, 7994, 2803, 123, -1602, 1563, 2874, -870, 3383, 10129, 3057, 3723, 6546, -1554, -3039, -2261, -5343, -15192, -10293, -5940, -6834, -11286, -15957, -11911, -10680, -12470, -17189, -12122, -8617, -10715, -9429, -5844, -1036, -1692, -6906, -1024, 5917, 7130, 2487, -650, -4041, -4059, -7877, -7357, -503, -2822, -11274, -10612, -12827, -16857, -18355, -9464, -7938, -9549, -9038, -8200, 459, 2640, -2081, -2321, -10284]
15492a0284l909l077K884K039K051N304l694J921J191l969k741J695M061J368
15478e160K44o32J338J341k864n284r68m090m86M649j124j046N167K019L662J27
15462c107m157n664J610P747j469L01J175k404K661M552o961r716M029j922M001
15447i324N077R77M222l399j197J40L5n392j946j084K04L30M99M085O038K278
15431A543k876l967k284l530M47J578j609K717N600j518p579n299J1423K746j603
15416d211K778N810j749n129K999k241K759m365K803j993M938n01P77L806j211
15401E270o991K824O22m844j305K02J705j817J657J862o027l468J0054J470o71
15386E43K422m98q72k765n085J025m975Q007Q746o4k415J407n801J157j960k200
$$ y = [-10284, -14193, -17270, -14386, -12347, -10296, -4992, -8686, -6765, -5574, -9543, -12284, -10589, -6528, -5160, -4916, -5548, -4210, -2869, -5733, -11017, -11985, -16075, -16561, -11912, -13036, -14082, -8915, -6896, -3234, -3107, -7264, -12928, -11318, -3571, -5040, -4739, -3564, -5968, -3307, 1245, -5716, -15432, -11403, -13325, -9324, -4247, -3270, 952, -2447, -3644, -3504, -3469, -8861, -10807, -11891, -11687, -11357, -10858, -6773, -735, 1543, -1333, -5300, -7584, -11114, -10667, -9089, -10698, -7981, -2381, -3899, -11478, -16777, -5354, -2608, -4211, -1433, 4377, 2628, -2501, 498, -1743, 1016, -3349, -546, -2539, 2399, 1898, 2675, 6481, 5270, -1721, 1103, 1725, -3119, -4424, -4222, -2517, -4334, -2677, -815, -6842, -10310, -256, 1214, 543, 2965, 2467, 1595, -1170, -6255, -5230, -10205, -2198, 6548, 6484, 4069, 5476, -325, 832, -1128, -3328]
15370c328M741P39m105j400K923N27o97L94l480n273j382k337J501M839M875K22
15354a241Q9n205m693L101O183j455J175L332n314P31M62O48N689q29o570m853
15338h750k441q26M340M919N082p49J154l648l664J811k71j87k544n175j789K619
15322a0119J349o332L476J167m242J222M323Q015N237m847q108n25M868p96r65
15307f277p942j442L396P205M050k939r40L905K940o213n958m23J653j600M169
15292f416J528K284j067J500P212L384l865p128p628n88N419K960M34J163o572
15277g380m975O803k71M005N339j611j3858k485O715L098M814M163k300j514P22
15262A265m434j525N05l158O39n546P36M671k225j150N624M449k280K815Q78l534
$$ y = [-3328, 1413, 2152, -1953, -3353, -430, 97, -600, -206, -3686, -8959, -10341, -12678, -11177, -6338, -1463, -1241, -1152, -6357, -11050, -7949, -1766, -3221, -2046, 1286, -4028, -3297, -2835, -2187, 3502, 2673, -3897, -8750, -11191, -12017, -7677, -2758, 2324, 1575, 2729, -919, -4583, -2772, -3043, -3230, -5774, -10949, -12738, -10119, -8770, -15102, -11626, -10459, -14701, -13479, -9156, -1141, 4096, -751, -8859, -9384, -4516, -5312, -6277, -14219, -15661, -12265, -5060, -1010, -3949, -4889, -984, 1956, -4257, -10215, -10638, -8985, -10585, -6416, -4888, -2604, -3671, -2171, 5041, 8425, 4560, -2568, -10196, -10784, -5365, -2405, -1971, -808, -7380, -12355, -5552, -5823, -1818, 3521, 1910, -11948, -14433, -7718, -4620, 194, 4357, 2057, 543, 1265, -3169, -4694, -4189, -7347, -6708, -12254, -11518, -6847, -9072, -10222, -4598, -149, -2429, 386, 1264, -2270]
15246b270o598L59L451O750N04j457J895O723n440k491J137M315K288q617p952
15231g403p49N322N871j34K290l330k655m494L216R278M433j178J548j908n706
15216D401j412m911J914K465M628L848o526l63o383l328L78k339J279j2530r490
15201b8369R416Q837R853R823l345K361n83j936K592M585o976j6079p864O131
15187a1554R334p45m313l270Q530k413K943K467J888l56l043q814j814M965M878
15172a317j760m69k012p654P31M610K08J082k52J356J700M776l269m884L351J762
15156b041k784l009N605R145m528k711k205l868M202L317k580k604j685l801L330
15141f217N353R7m286q80Q453M130n09l550k296r22m532o120M69O262Q774k191
$$ y = [-2270, -8868, -8509, -5058, 1692, 2196, 739, 2634, 9357, 3917, 1426, 2563, 6878, 9166, 549, -7403, -8152, -2830, 3041, 2907, 5197, 1867, -788, -5282, -2066, 7212, 11645, 10467, 12015, 10107, 4401, 2989, -1922, -8, 2457, 7085, 10933, 4407, 4044, -2339, -5667, -5289, -7628, -6349, -18879, -28369, -18953, -10116, -263, 9560, 6215, 8576, 7993, 6057, 8649, 13234, 6258, -9821, -17685, -11554, -2220, -2965, -7278, -10548, -2018, -4431, -1488, 979, 2867, 2511, -532, -9346, -11160, -6195, -1317, -3077, -3546, -5558, -13212, -12481, -7871, -7663, -6581, -6833, -5477, -3777, 999, -2270, -7154, -3803, -2041, -4825, -7834, -2229, 6916, 2388, -323, -2528, -6396, -2194, 1123, -1457, -4061, -5746, -9547, -6217, -864, -767, -5053, -5933, 2520, 6650, 6141, 2591, 295, -627, -5159, -11279, -10810, -4548, 4226, 2035]
15125B035M072j431n351r17k433L915M453J573l684L975P23j426l449j3551l175
15110a4671O402R091l09J204j459q81J211j389L446R37o597j720L810K281r11
15095D45k514l285k633m855K791j329N469O569L706L410k349n782O54Q449N422
15080A4168m716p61j0130k604o08m587r339J396O238L928m358j803K891N476k41
15065e050K749j153q86K963N275p47k086R25K963O54R07J833r98n138k552l55
15049f96J818m295r26m856l481L863Q236K97m128n52j80P762N318J638l689j640
15033D489J566p485j1031o218L997M024K194Q058N398J169q830m378P272L975
15019D200m671m339M01K762M368N455l161k021j438l823j604M268K209m553p73
$$ y = [2035, 6107, 4676, -675, -1592, -4025, -110, 4343, 5916, 2232, 6207, 6930, 5504, 2055, -11496, -14671, -8269, 822, 513, 1717, 258, -623, 588, -801, 2645, 3582, -3015, -4735, -925, 1356, 445, -2069, -5354, -7987, -12842, -10051, -11380, -5911, 658, 4364, 7774, 5425, -357, 297, 8746, 14168, 9452, 8691, -1439, -4043, -4651, -9238, -18577, -17181, -10943, -7015, -11373, -13176, -10285, -4809, -5050, -2301, -3454, -4340, -1377, 3898, 3151, 1065, 1990, 4953, 5607, 6514, 8347, 7349, 2211, -341, -696, 1122, -3173, -4099, -8955, -12436, -8573, -337, -40, -4168, -4720, -4900, 2862, 8180, 9818, 6129, 4489, 6055, -1430, -12461, -18679, -14682, -10658, -8464, -406, 4992, 6161, -2669, -7047, 225, 4200, -471, -4810, -4409, -1647, 2721, 8176, 5015, 2994, 1556, -2267, -3871, 397, 2606, -1947, -2720]
15004b720O618N451l512j855P451K28l804l715O59r65L848L989M804K059r845
14989H691q744o678l349l522J830Q147Q286n150k388J235N347k96l673n100j536
14974f900J32K586P703r562p010k940O765Q988l021o322p24L084j240J668L501
14959c292O175m79l467J771n45ml051n517K279M820K149j186j839N211j59n972
14943c106o920R15L244N61M357l891p293l958M127O440R012J104m222p994m465
14928a2089L556m846k639k81L840N498K042L670k689n75K217K157l811N529k632
14913a053K575M465j591k875j533l251j730M704R585n682j0572L764P969N384
14899A0159j530K398M370q860n113k064J223K398N426k741o633j864K722L242
$$ y = [-2720, 3898, 9349, 5837, 3982, 11433, 11661, 7857, 4142, 4801, 3836, 7684, 11673, 16477, 18536, 8691, -53, -6731, -10080, -13602, -11772, -3625, 4661, -489, -2877, -1642, 3705, 3409, -264, -5364, -6900, -6768, -4182, 3521, -6041, -13051, -15991, -9226, -238, -3259, -9581, -10305, -7221, -8461, -6793, -3292, 2883, 2404, -1063, 708, 163, 159, -2892, -8409, -6130, -1310, 839, -347, -2186, 3025, 2866, -3106, -10026, -9111, -5867, -5306, -949, -4840, -12133, -16091, -11964, -5524, 3488, 4592, 370, -7624, -12089, -8533, -13379, -16018, -16299, -12459, -6961, -4919, -1249, -3938, -4513, -2296, -139, -3950, 1579, -1053, 1522, 5987, 4396, 1521, -12, -3263, -4993, -289, 9296, 3614, -6958, -3194, 4775, 10159, 8629, 11027, 15397, 6537, 1424, -640, 583, 2981, 8407, 5666, -967, -2831, -109, 3133]
14885C133l428j240o43n667j010O114N283j644o52M690j08J338k581p464L775
14870a04L722n143m903L949M358L324p31k274J741J864n38o553k234L843j950
14855a629l095N683L522l36m039N799l426r54R46L269L754j138j292l836J105
14840D333o047J963J105J612p279q18N568j895L372M283l302k078j475J413K046
14825B801j653o057o612K255J962n752l75N765N970n668l929k756K585N225N327
14810i12J767j436n662K641K856L81K024L73j533k326O122K707K44l701l671O15
14794D89m832K169o492j586L904Q769J278m972L801n10q569l819O071k551J887
14779d963P444n871n282L561R646N906p55n756m506J766j640M69O32K485k031
$$ y = [3133, -295, -1535, -2178, -7845, -8855, -2741, 2542, 898, 246, 4936, 4828, 6166, 3585, -3879, -104, 3618, -1525, -6428, -2479, 1879, 5203, 4472, 2198, 3939, 5803, 5265, -1288, -3522, 321, -1629, -4724, 959, 4481, 4145, 106, 5905, 2479, 1525, 2471, 5740, 9494, 8356, 7064, 3228, 4333, -1714, 249, 1354, 2966, -4313, -5131, 437, -1458, 1914, 6197, 2895, 817, -658, 755, 2801, 1148, -4909, -11521, -9266, -7304, -13056, -13431, -7666, -1696, -7364, -11293, -14049, -11464, -6239, -912, 855, -581, -6243, -3602, -746, -365, 1659, 2032, 499, -1827, 4295, 7002, 7246, 3545, -126, 489, -4343, -2174, -8666, -10252, -6348, 2421, 3699, -1273, 2528, 2018, -6551, -10370, -4299, -6850, -4963, 2481, -3390, -8672, -5111, 4535, 10441, 9686, 3930, -576, 1190, -450, 19, 651, 3136, 1105]
14764A105K91k853J543N7p861M739M16J50q82l962K629J610k07j341m523J660
14748g429Q844M43j0850J548K12l182K667O97l87P78M430j424l060R112L54q136
14732e383m742J554N337j234j557N970L474l6p495l554J553k908O852M155n249
14717c263n744P073N738P44l045L691N716p02j701p052p313o367l755O884P088
14702b008N787j38K450J0230P95m300l282P58J686K34l80j085k199j497p707j952
14686b608L135k441l87j743K465m492m502J820O019j929m75R76k923K88j783n936
14670a4516j983M644R34O159M868j305r616n443J717j238K413l129P517J1728
14656B750k551k590j985M432k373m365q366j130N475P466O98j272k092m36K460
$$ y = [1105, 1396, -1457, 86, 143, -7718, -2979, -2563, -2413, -3295, -7257, -4628, -3018, -3225, -4566, -9089, -7429, 1415, 1858, -8992, -7444, -7232, -10414, -7747, -7050, -7437, -6659, -2229, -3653, -6713, 2399, 2753, -5383, -10125, -8571, -3234, -4468, -6025, -55, 3419, 3383, -4112, -7666, -6113, -9021, -2169, 1986, -3263, -9007, -1934, 3804, 4548, 1503, 5194, 10910, 10208, 8507, 1455, -5858, -12225, -15980, -9096, -2008, 3779, 3641, 6091, 16321, 17116, 12816, 9534, 10292, 11978, 12212, 11832, 10747, 8548, 7051, -656, -2608, 527, -1914, -2301, -4044, -1579, -6071, -10573, -8753, -2734, -4663, -5138, -4162, -7085, -6797, -8580, -14516, -16499, -11855, -10921, -4762, 106, -1199, -10815, -16258, -14541, -15779, -13366, -16495, -8978, 2750, 199, -2391, -4376, 56, -2317, -6682, -15048, -16178, -10703, -3237, -2539, -3811, -5903, -6339, -3879]
14641c879j938Q82k278L435m8j85n663q469O47Q478K420L968K116k349o375j672
14625a0910P157J1683M365r339j215l439k207J530k315n692J327M198J077L884
14611A04l099n833m424k223Q266N220l6L54K998J2720k108j4215o446O199J226
14596a297j631N431J912n908j47J720k961o425L929N658M556p53n10o923K433
14581i16M030L804l413J942j722P043M947M512j01l998Q410J5205R869J6034K3246
14566H8892L3527L6725L4154J5809j513p618k3130l2057k8123k8740j9593j7935
14554E0398j2333j0471n024l274p776k773k261n01M988L010k143J764M538k983
14540A5159j2288J473N220K591K642r72r36J135L287q903j1332q577j078J099
$$ y = [-3879, -5817, -4935, -7213, -3778, -3826, -4011, -9674, -18143, -17496, -9018, -6598, -2630, -514, -2863, -9238, -10910, -3753, 7930, 12295, 2956, 1741, -1698, -3905, -2375, -4690, -10382, -9055, -4857, -3780, 104, -2995, -8828, -13252, -15475, -7209, -1989, -2025, -1671, 1327, 14047, 11939, -2276, -8722, -2523, -1297, -2928, 2503, 4415, -1493, -1640, 80, -2881, -9306, -5377, 281, 4837, 4084, 3574, -3349, -916, 3114, 6918, 3505, 5447, 3725, 10768, 15715, 20227, 20126, 16128, 24538, 39743, 49612, 65646, 88892, 122419, 159144, 193298, 209107, 207594, 199976, 176846, 144789, 116666, 87926, 68333, 50398, 38065, 27594, 22570, 19296, 11520, 8747, 6486, 5985, 10973, 13983, 11840, 13604, 18142, 15159, 2871, 4344, 9564, 12155, 14797, 13825, 12889, 14024, 17311, 8408, -2924, -11501, -12579, -11480]
14526a1480P587Q304k419j157K730m506m465L818K598j623n50P209j016q748l710
14511g428L627n993r372n693R42J0033J2441N145Q16P53n768p454J588M313q9
14496b139j565O098j27p380o73l304L102P34j977k698O863J198O59o49n413N877
14480a394P436L372n322j596P96L390o899n239j336P217l59l73j82j563L983J459
14464C390J496M25K143P540P8j977l795n759J095K615o133n408l427j992n057
14449a4766m823J524J0736R305m339n252J603N505L215m211J671L802J125n527
14435d32P93M355m990n264O841L717m77j575l820n404M727J323l12K176l350q379
14419a0071j332O280J639J372P16q331j522L253J831M772n795k445N11J331m7
$$ y = [-11480, -3893, 4411, 1992, 835, 3565, -941, -5406, -1588, 1010, -613, -1163, 6046, 5030, -3718, -7428, -3801, -9794, -19166, -24859, -23917, -13884, -1443, 3702, 4518, 5271, -497, -7951, -6363, -2050, -2139, -3704, 2394, 2267, -5113, -5786, -9090, -5988, -5254, -7231, -9929, -3066, -1868, -1209, -1858, -7271, -1394, 6042, 9414, 4092, 2496, 3292, 6682, -217, -5456, -6792, 425, 66, -307, -489, -2052, 1931, 3390, 4886, 5311, 7454, 14994, 15072, 13095, 9300, 3541, 4636, 7251, 1118, -4290, -7717, -9709, -14766, -19589, -18065, -7329, 1976, -2363, -7615, -6012, -507, 2708, -1503, 168, 3970, 5095, -432, 361, 4716, -274, -5538, 1303, 5020, 4543, 2968, -852, -6256, -1529, -206, -518, 1658, -1692, -10071, -11403, -5123, -3484, -2112, -1396, -9727, -11249, -7996, -6165, -1393, -7188, -9633, -9122, -7791, -7838]
14404g838R05K810N53Q51j319k451K638n02L156K806K053k08r840N889K576q80
14388A199L464r395n289K346l38j371K177M514l53K094j972o796J97N79l706N788
14372f862Q541N412r69r081j974J161R905L819l157k767j190o355L665N800j1
14357E937K991m4M333K206j0917l858Q312J517j61N873j648j166k475J367n236
14342G031n353O231J468L493M618n475j056J479l417J984O12j05R28j142L446
14327A4742P513K309J1963J2561Q104Q376N875M771J0710O995K4120K6227K4789
14314A69055K8031L2204L1362L0305K1696J5709M81q416k3159k6790k3660l3601
14302B13217k8564k5551j8091k0433k0422j8655j1619o741j0378q945l151o230
$$ y = [-7838, -6933, -4123, -3570, -2719, -4038, -6489, -3851, -4353, -1197, 1609, 3662, 3454, -6386, -497, 2079, 1199, 4663, -4732, -10021, -7675, -8013, -9384, -7207, -2693, -3046, -952, -2924, -9720, -9523, -8944, -12650, -6862, 1679, 7091, 6122, -2959, -4933, -3772, 6133, 9952, 6795, 4028, 2838, -3517, 148, 5948, 5937, 8928, 8884, 13217, 15423, 4506, 648, 8960, 10477, 10316, 16189, 14541, 13375, 10900, 12267, 7031, 1678, 7909, 9377, 12870, 17488, 12013, 10957, 12436, 9019, 11003, 11615, 11510, 12438, 11296, 14742, 22255, 24564, 36527, 49088, 57192, 65568, 71443, 76214, 86924, 93919, 118039, 144266, 169055, 197086, 229290, 260652, 290957, 312653, 328362, 328843, 320427, 297268, 270478, 246818, 213217, 184653, 159102, 141011, 120578, 100156, 81501, 69882, 63141, 52763, 43818, 40667, 34437]
14290C4437k469J195m359n301j040O514J798n303l233l247m6j801p028j810J745
14275A0052k27O032K190n406j896l206M56K034R304j649r013j558J952L067K586
14260A4718l277J172j003m818j573J17M182L887m86n748J17n663J450k853J98
14245D20K957p299p029Q651P432p472k532J438N69J809k100L237N071q20J567
14230E899M343L285n040q875r654O139J0322K246k964L995J867L776L57J23l55
14215A5464j790K89n095n015n192K05O662L982k71j666k774J722M710%P209N393
14199B3833n643m463m613m787l521r188r172j41P781O553P501O387k637n81M407
14184A1716J553N957l436m12K637j719m955j249J98N744P323N068J717j0654q806
$$ y = [34437, 31968, 33163, 28804, 23503, 22463, 28977, 30775, 25472, 22239, 18992, 18946, 17145, 10117, 8307, 10052, 9825, 15857, 18047, 12641, 10745, 7539, 7995, 10029, 19333, 17684, 8671, 7113, 9065, 12132, 14718, 11441, 12613, 11610, 6792, 5219, 5336, 9518, 13405, 12919, 7171, 7288, 1625, 3075, 222, 420, 3377, -3922, -10951, -2300, 5132, -2340, -4872, -3434, -2865, -1056, -3156, 81, 5152, 4332, 5899, 10242, 13527, 8487, -388, -10042, -3903, 6419, 8665, 5701, 9696, 11563, 15339, 15696, 15819, 15464, 13674, 13963, 8868, 3853, -1339, -1134, 5528, 9510, 9239, 7573, 4799, 6521, 11231, 11231, 18440, 23833, 18190, 13727, 9114, 4327, 806, -8382, -17554, -17695, -9914, -3361, 4140, 10527, 7890, 7309, 11716, 13269, 19226, 15790, 15378, 18015, 16296, 11341, 10092, 10290, 16034, 23357, 28425, 30142, 19488, 10682]
14169A0682n341j937J23P71j889m516k09L99L308L200l641n412l183K124M901
14154f20L931K085j071m849M279o72n925O3J199j005k110J08R354R914o15m233
14138I833j712p296K414J638N619N837l85m021J329J336L800N013R169K937M350
14123C9861M296j686J134K527K538L365O30n194K449q204l611j471M383L741l497
14108D1261k807r832p565K818j099n862K150L118p878K345K857J08Q60L441k258
14093B1657m675m033j895N941J970n19L335l974k853n92M939M871o212J488M299
14078B3747N54o037j978L559L707K061O32j692j020j945j951j557N141o399o258
14063A0564m86l302n864K059J1107J0318J0888j083n980j24J492j472K650PJ0064
$$ y = [10682, 5341, 3404, 3527, 4298, 2409, -2107, -2316, -1917, 1391, 4591, 950, -4462, -7645, -5521, -620, 3311, 5396, 4325, -524, 3755, 3083, -2842, -2779, -1580, -2585, -4695, -4587, 4767, 14681, 14066, 9833, 8121, 825, 3239, 4877, 10496, 16333, 15948, 11927, 13256, 14592, 18392, 23405, 32574, 35511, 39861, 44157, 42471, 43605, 46132, 48670, 52035, 52665, 47471, 49920, 41716, 38105, 36634, 41017, 44758, 41261, 38454, 28622, 21057, 23875, 22776, 16914, 19064, 22182, 14304, 16649, 19506, 19614, 20474, 23915, 21657, 16982, 12949, 11054, 16995, 18965, 18446, 21781, 17807, 14954, 14362, 19301, 24172, 17960, 19448, 23747, 24301, 18264, 16286, 19845, 23552, 25613, 26245, 24553, 23533, 21588, 19637, 18080, 23221, 16822, 10564, 10078, 6776, 912, 2971, 14078, 24396, 35284, 34201, 28221, 28097, 29589, 28117, 30767, 30774, 40838]
14048D0838M031l707m902m6j492j109O340m032n868K905L125K185J873l524Q58
14033C7475M82n76L924M988J451j129k033n012N278j091n428J876Q377J105l587
14018D6100J439r885j408J644K027P308p50m3N291L173K388O672L174j291j042
14003F4797L452J1514L854L070M800M364O254J1882J1521K528k888m762k478q597
13989A09311j7319j7425j5488j2525r097J140J568j598N052j664l664N279J0878
13976E4448K072j511j065N066O461j307J923P209K018k487O080K229M376r33l58
13961H4221N914J2585l742L027N725N958j164J655L953M162O416J1124J983j999
13947A39818N362Q397K132Q897O634m604M089K65N301O360J6611J0848J902J1090
$$ y = [40838, 44869, 41162, 36260, 36214, 34722, 33613, 39953, 35921, 30053, 32958, 36083, 38268, 40141, 36617, 37475, 37957, 37381, 41305, 46293, 47744, 46615, 44582, 39570, 44848, 43757, 38329, 40205, 48582, 49687, 46100, 47539, 37654, 36246, 37890, 39917, 47225, 46475, 46432, 51723, 54896, 57284, 63956, 67130, 65839, 64797, 68249, 79763, 83617, 86687, 91487, 95851, 102105, 113987, 125508, 128036, 125148, 120386, 117908, 109311, 91992, 74567, 59079, 46554, 37457, 38597, 40165, 38567, 43619, 41955, 38291, 43570, 54448, 56520, 55009, 53944, 59010, 65471, 64164, 66087, 73296, 75314, 72827, 78907, 81136, 85512, 84579, 84221, 90135, 102720, 98978, 102005, 107730, 113688, 112524, 114179, 118132, 122294, 128710, 139834, 141817, 139818, 145180, 153577, 155709, 164606, 171240, 166636, 170725, 170990, 176291, 182651, 199262, 210110, 212012, 223102]
13933B23102J5817R372J1055J3706R453M545L394J8631K3055Q666N114J4345K2408
13920C82663J6684J4409J8949K2926K1309J6916J4873J8292K7795L1733K9364
13909F15913K6498L3601L7281L8411M4097L7578M3471M9248N4456N7569O3904
13898A102027P1116P9781Q5418R1404J08501J16811J27571J45515J61062J73777
13888B262983K03985K29021K56429K92384L37733L92650M63728N39928O20834
13879E599675P18903Q39462R91635J176953J435596J788828K257305K882512L675983
13870B1366852M596232N503214O241069O603646O451847N720710M388370K538878
13862F3410818L71254j819931l726022n169504o054719o349096o126128n525725
$$ y = [223102, 238919, 248291, 259346, 273052, 282505, 287050, 290444, 309075, 332130, 340796, 345910, 360255, 382663, 399347, 413756, 432705, 455631, 476940, 493856, 508729, 527021, 554816, 586549, 615913, 642411, 676012, 713293, 751704, 795801, 833379, 876850, 926098, 980554, 1038123, 1102027, 1173143, 1252924, 1338342, 1429746, 1538247, 1655058, 1782629, 1928144, 2089206, 2262983, 2466968, 2695989, 2952418, 3244802, 3582535, 3975185, 4438913, 4978841, 5599675, 6318578, 7158040, 8149675, 9326628, 10762224, 12551052, 14808357, 17690869, 21366852, 25963084, 31466298, 37707367, 44311013, 50762860, 56483570, 60871940, 63410818, 63782072, 61962141, 58236119, 53066615, 47011896, 40662800, 34536672, 29010947]
13854B9010947m713845l866897l118774k504234k021488j663553j393161j179501
13846H549494j014608q80168p66810o60527n70953m90563m21841l69909l07162
13837C066953k64093k37739k01540j74345j49729j39506j28373j07519r8858r5316
13827A469935q0908p3334p8567o9667n5485n1162n7816m7275k7977l0723l9645
13816H57376l8265l7564l6014k9224l0145k8030k8585k5127j6283k1571l0804
13805E35764k1104j3917j2397r405k1350k2960j4455j0814r524o064j0247k618
13793C80909n307r719j0629j6296j3795p894n521q803j546n998r350j2993j1278
13780B61780l478l269j2996j2025M461L196k862r290p932m758R34m286k398n334
$$ y = [29010947, 24297102, 20430205, 17311431, 14807197, 12785709, 11122156, 9728995, 8549494, 7534886, 6654718, 5887908, 5227381, 4656428, 4165865, 3744024, 3374115, 3066953, 2802860, 2565121, 2363581, 2189236, 2039507, 1900001, 1771628, 1664109, 1565251, 1469935, 1389027, 1315693, 1237126, 1167459, 1111974, 1060812, 1002996, 955721, 927744, 897021, 857376, 819111, 781547, 745533, 716309, 686164, 658134, 629549, 604422, 588139, 566568, 535764, 514660, 500743, 488346, 478941, 457591, 434631, 420176, 409362, 399838, 393774, 383527, 380909, 375602, 365883, 355254, 338958, 325163, 317269, 311748, 302945, 301399, 295401, 286051, 273058, 261780, 258302, 255033, 242037, 230012, 234473, 237669, 234807, 225517, 217585, 212827, 213761, 209475, 207077, 201743]
13766B01743p279n694L621M19n896J317o19M063m219p103P37j208o460l168P225
13751A77479N780l083j1257n19K072n127K218L255R541n078q161p655r104n205
13737A45156m209p587o210m549r111j2025j1167p944l793m021m62o017l4j161
13723F6866o937O268M928k570O94n713j023K605k897q428n848p83J080J22P956
13708E6320k210k916l868k022l067L067K437J550Q33l137M743O194K971j2355
13694D8540n834m250n010L656m382M3l10m081j489l348K866Q29j331n393O74J1636
13678C2816R82n452n451m20R464M601m11O992O575J0752q826n321J530n040o409
13663C6382K156M133m571j060j631J498R9j664j568l85O323j717j224p986m006
$$ y = [201743, 194464, 188770, 192391, 192810, 186914, 188231, 187612, 191675, 187456, 180353, 181090, 179882, 173422, 170254, 177479, 183259, 180176, 168919, 168400, 170472, 165345, 167563, 170818, 180359, 175281, 167120, 159465, 150361, 145156, 140947, 133360, 127150, 122601, 113490, 101465, 90298, 82354, 78561, 74540, 74078, 68061, 68027, 66866, 59929, 66197, 71125, 68555, 69249, 63536, 62513, 65118, 62221, 53793, 47945, 47162, 48242, 48364, 56320, 54110, 51194, 47326, 45304, 42237, 45304, 47741, 49291, 50124, 46987, 51730, 57924, 60895, 48540, 42706, 38456, 33446, 37102, 32720, 32763, 32453, 28372, 26883, 23535, 26401, 27230, 25899, 20506, 21180, 32816, 33798, 28346, 22895, 22475, 31939, 36540, 36129, 43121, 49696, 60448, 51622, 46301, 47831, 42791, 36382, 38538, 42671, 38100, 37040, 35409, 36907, 37006, 35342, 33774, 33389, 39712, 37995, 36771, 28785, 24779]
13648B4779M163k430n583j63l80k328N905P419o974j392O105j50J240n874P1j522
13632B2886L887K540L244n631p389n021N936J829l474K317n720k913K288K261
13618A7040m923k355K103K745M895N553L375K566k976O50k006R65N315K062n484
13603B9525n489j432m771l869m250K362Q051k3J787K036J179O17j249j884j403
13588B1187p89o169K654n968j532K736J2393J331r738n215J728Q081K845m429
13574A9115o678p427l131M866l016J541M340j681K830Q57K644M265n12m958q333
13559D722o5N434K331l21Q437K804l453L43R301j601j0292o691j581O642L769
13544A9779k593l869l466n279j63k130N23q20J539j20R49K319P260m20n806J602
$$ y = [24779, 28942, 26512, 20929, 20766, 20386, 18058, 23963, 31382, 24408, 23016, 29121, 28971, 30211, 24337, 24408, 22886, 26773, 29313, 32557, 26926, 19537, 14516, 20452, 22281, 18807, 21124, 15404, 12491, 14779, 17040, 12117, 9762, 11865, 14610, 19505, 25058, 28433, 30999, 28023, 28673, 26667, 27632, 32947, 35009, 29525, 24036, 22604, 17833, 13964, 9714, 12076, 20127, 20104, 21891, 23927, 25106, 25723, 24474, 22590, 21187, 20398, 14229, 16883, 10915, 9383, 12119, 24512, 25843, 16105, 10890, 12618, 20699, 23544, 19115, 12437, 5010, 1879, 6745, 3729, 5270, 9610, 7929, 10759, 11616, 14260, 18525, 18013, 13055, 4722, 4657, 10091, 12422, 12101, 20538, 23342, 19889, 20232, 29533, 27932, 17640, 10949, 9368, 16010, 19779, 17186, 13317, 9851, 4572, 4409, 2279, 2802, 1982, 3521, 3401, 4350, 6669, 13929, 13509, 7703, 9305]
13528I305o13L89o74K189l300m700L218O482K892l558j450N49n265k673O152q6
13512H857J029j564l528L758r49l461j876K590q32N302M684j768p409r4l755j347
13496c63K710K537L601k42j067n47n310q554M086J2943J007K608n294o26J539
13481I028J325n505j851K000m17J4627M410q083k773l191J051J466n419m552k470
13466c54J416L063k530O88J351j727J956R378o137k598j026l780n007K847O033
13451C573N289K31l784L734P108m743N00M575l238n536R079N600r22n64l863l064
13435A3975j649J06N809L146j869r812j6N232J4268N084O508Q757L046J2399J3428
13420G8412N370J3346K5973K8737L5870L3721L0983K3834K2549K1193Q771k934
$$ y = [9305, 8692, 9081, 8407, 10596, 7296, 2596, 5814, 12296, 15188, 11630, 10180, 10729, 5464, 2791, 8943, 8857, 9886, 8322, 4794, 8552, 7603, 4142, 2266, 4856, 4024, 9326, 14010, 12242, 4833, 4739, 984, -363, 2347, 4884, 8485, 8243, 7176, 6629, 1319, -7235, -3149, 9794, 10801, 13409, 8115, 7489, 9028, 10353, 4848, 2997, 4997, 4580, 19207, 23617, 15534, 12761, 9570, 10621, 12087, 6668, 2116, -354, 1062, 4125, 1595, 2283, 3634, 1907, 3863, 13241, 7104, 4506, 3480, -300, -5307, -2460, 3573, 8862, 9093, 5309, 9043, 16151, 11408, 11908, 16483, 13245, 7709, 16788, 22388, 21466, 20902, 17039, 13975, 12326, 12432, 18241, 21387, 19518, 9706, 9690, 14922, 29190, 34274, 40782, 49539, 52585, 64984, 78412, 83782, 97128, 123101, 151838, 187708, 221429, 252412, 276246, 298795, 319988, 328759, 325825]
13408C25825q495j7039k2153k9854l0043k8614l0667l0835j4762j0705n386p715
13396H9557j1716q542j2524r640j345j444j895m097m490m725k167k868L95P013
13382C1512O696Q719P445N629J6606K1136J5096J2784R108L35j4105j6150k1139
13369H3672j5437j3800j0559l783J492l958k864q866n602J410j89n358k797L37
13355A3698j857j797P334K267m256o072N384J4431N964P93J526L545M454P775
13341E3189J2784J6720J4252K5587L6421M2768L9181K7677k914j9375l7762l4280
13329A74248l4731k4591k3103k0110j3212r321q345j0034n237o947n805m59J922
13316A4275L99O536K38K781l392n705m353j884k341l776J166K546L959P685K223
$$ y = [325825, 317330, 300291, 278138, 248284, 218241, 189627, 158960, 128125, 113363, 102658, 97272, 89557, 77841, 69299, 56775, 47135, 45790, 44346, 42451, 38354, 33864, 29139, 26972, 24104, 24499, 31512, 38208, 46927, 54372, 60001, 76607, 97743, 112839, 125623, 134731, 135066, 120961, 104811, 83672, 68235, 54435, 43876, 40093, 41585, 37627, 34763, 25897, 20295, 21705, 21516, 16158, 13361, 13698, 11841, 10044, 17378, 19645, 15389, 9317, 14701, 29132, 35096, 35889, 37415, 40960, 45414, 53189, 65973, 82693, 96945, 122532, 158953, 201721, 240902, 268579, 265665, 246290, 208528, 174248, 139517, 114926, 91823, 71713, 58501, 49180, 40835, 30801, 25564, 18617, 12812, 12353, 14275, 14674, 21210, 21448, 24229, 20837, 15132, 10779, 8895, 6554, 2778, 3944, 6490, 10449, 18134, 20357]
13301B0357R334R816J1417J2750Q317J1374J9464J7277M818l287j1719j7202j7918
13288G4798r962n495m438r492o801j0345l692m043r179p296K380N808N28L80J099
13273A4250P122k104j2125l906K147l587K269m214J238O849k6R37l292n077q469
13258g988P07J0648N040n472j862Q135J572j724p370Q81R80k305l556K930K682
13243C298l152N102K058k641l70o184J963N131O241Q65O67k272o156J296n80K704
13227G970j46N32m138o003L448m104k94J711l238r67N190n66k223j680p64K439
13211b833N313J248l911Q60L657m496L068K570L248P67R246J838q606k805L963
13196A3127J686j911M622K42p022k759M116N353l873m008N509N940M599Lj479
$$ y = [20357, 29691, 39507, 50924, 63674, 71991, 83365, 102829, 120106, 124924, 121637, 109918, 92716, 74798, 64836, 59341, 54903, 45411, 38610, 28265, 24573, 20530, 11351, 4055, 6435, 12243, 12771, 13151, 14250, 21372, 19268, 7143, 3237, 5384, 1797, 4066, -148, 1090, 7939, 7913, 8850, 5558, 481, -7988, -7281, 3367, 8407, 2935, 1073, 9208, 10780, 9056, 1686, 2567, 3547, 1242, -2314, 616, 3298, 146, 5248, 7306, 4665, 4295, -1889, 74, 5205, 11446, 12311, 12978, 10706, 4550, 5846, 5266, 7970, 7824, 8356, 4218, -1785, 1663, -2441, -2735, -1024, -4262, -5229, -39, -605, -2828, -4508, -5272, -2833, 2480, 3728, -183, 677, 4334, -162, 2906, 5476, 8724, 9491, 18737, 20575, 11969, 9164, 13127, 14813, 12902, 17524, 17766, 10744, 7985, 12101, 17454, 13581, 9573, 15082, 21022, 25621, 25624, 24145]
13181B4145n396l044k790k727K144L546K751L74J245j599n355L59l138M7K459
13166A3021L252R59N576L317m34m849l632l326k307l295M209M845L581k543k893
13151A5481n072J14O132J3231O707K903J975P147N147R558q0j878l647k08J850
13136E9360m671j3203r783M80l145p97K131q653j2370l385N840J194K839j586
13122A4251L110N634O794L223q760p179k958q54M503N026L715K248q009r08m157
13107A5679k484O878n203n028L087Q482O959N527N257Q483J1298j0693r527m46
13093C8269m848J76j191j95o167j653N457N176M39r77k538l525l338n432Q21J261
13077B1735Q210L228l536k682q09N848m72p51k742n590j333n10P744M804N2K967
$$ y = [24145, 18749, 15705, 12915, 10188, 12332, 15878, 18629, 19003, 20248, 18649, 13294, 13653, 10515, 10562, 13021, 16273, 17232, 22808, 26125, 25691, 20842, 17210, 13884, 11577, 8282, 12491, 17336, 20917, 18374, 15481, 10409, 10523, 16655, 29886, 36593, 39496, 41471, 48618, 53765, 63323, 63243, 61365, 57718, 57510, 59360, 54689, 41486, 31703, 32183, 29038, 28241, 30372, 21719, 9349, 5964, 11804, 12998, 15837, 14251, 17361, 22995, 29789, 33012, 24252, 17073, 14115, 13261, 17764, 22790, 26505, 28753, 20744, 19836, 15679, 13195, 20073, 14870, 9842, 12929, 21411, 28370, 33897, 39154, 47637, 58935, 48242, 38715, 38269, 33421, 33597, 32406, 32211, 26044, 24391, 29848, 35024, 35463, 34486, 31948, 28423, 25085, 19653, 20474, 21735, 29945, 33173, 29637, 26955, 26146, 31994, 31522, 30771, 28029, 22439, 21106, 20596, 28340, 33144, 33196, 36163]
13061C6163L711R840N599j352L365Q333Q78m42P50k242j0617j7610j1945M077
13047B8508L673k450m370m099m325J1039N256J783L418Q502n686q250r210K54
13033B4043M134K593k42K492m771l162R685J1292K455l479K316N426J1032L143
13019F6957N278M663O738J2896J1831Q955j285j4659l1941k5789j8760o028K226
13006B1082Q264Q84K879K509L856M647k000J610J061P67M772J592o254k494k273
12991D0902M741J1016K957P17j832L908Q770L143P985J4271J0403P392O070N808
12977A26251P226Q486J0686J627M848K816l373o117n849K705Q40K037R155J9617
12963A80955J1618J54O884R948J1252K0165J7335J7165K4261J4247K0836K9951
$$ y = [36163, 39874, 49714, 55313, 53961, 57326, 65659, 66537, 66095, 66845, 64603, 53986, 36376, 24431, 28508, 32181, 29731, 25361, 21262, 16937, 27976, 33232, 35015, 38433, 46935, 41249, 32999, 23789, 24043, 28177, 30770, 30528, 33020, 28249, 25087, 34772, 46064, 48519, 45040, 47356, 52782, 63814, 66957, 72235, 76898, 83636, 96532, 108363, 117318, 116033, 101374, 69433, 43644, 24884, 18856, 21082, 29346, 30230, 33109, 35618, 39474, 44121, 42121, 43731, 44792, 45559, 50331, 51923, 45669, 43175, 40902, 45643, 56659, 59616, 60333, 58501, 62409, 71179, 74322, 82307, 96578, 106981, 114373, 120443, 126251, 133477, 141963, 152649, 154276, 159124, 161940, 158567, 152450, 146601, 149306, 150146, 152183, 161338, 180955, 192573, 192727, 199611, 209559, 220811, 240976, 258311, 275476, 299737, 313984, 334820, 364771]
12951C64771L2034L4977K8872L5879M7528N4215N4334O7007Q8870J07901J20495
12940A036883J32396J54203J84846K24501L00629M09955N52835P54193J061345
12931D811786J538201K258722L210516M161029M523656L671859J523668j129289
12923B4570148l184452m012572l794133l064019k279940j629762j161649q48069
12915D595552o36632m77065l67386k92264k23727j80524j50938j16957q5751m4047
12905B020261k502L8211P2122J06238J54949K04190K45835K76668L32601M36903
12895C885476N89400Q14862J120482J555164K202466L226834M819249O986098
12887B5200031R179162J0028683P999344K893397l313181p839577r386094q500780
$$ y = [364771, 396805, 431782, 460654, 496533, 544061, 598276, 652610, 719617, 808487, 916388, 1036883, 1169279, 1323482, 1508328, 1732829, 2033458, 2443413, 2996248, 3750441, 4811786, 6349987, 8608709, 11819225, 15980254, 20503910, 24175769, 25699437, 24570148, 21385696, 17373124, 13578991, 10514972, 8235032, 6605270, 5443621, 4595552, 3958920, 3481855, 3114469, 2822205, 2598478, 2417954, 2267016, 2150059, 2064308, 2020261, 2017759, 2055970, 2128092, 2234330, 2389279, 2593469, 2839304, 3115972, 3448573, 3885476, 4474876, 5289738, 6410220, 7965384, 10167850, 13394684, 18213933, 25200031, 34379193, 44407876, 52407220, 55300617, 51987436, 44147859, 34761765, 26260985]
12879B6260985o568955m664421l233789k280249j654513j241440r54468p40680
12871D922470n90314m94322m25042l57896k93800k33498j76684j35655q6686m5102
12861B083471j0977J6864N1480Q2897J26815J71566K31520L17698M35644O10236
12851D117214Q51543J211415J770644K572757L569889M432480M531861L281582
12843B6339385P72243k000819l890293m442639l969881l083010k240137j585682
12835E899167j142220q44507o37618m92873l90658l23541k74409k37144k01416
12826A354781j75400j38437j15478r6329q2740o2303n1475n2507m2857l1246k4474
12815D81535k7225l0487k5349j5813j2693j5699j6958k0390j6629j2494q452q609
$$ y = [26260985, 19692030, 15027609, 11793820, 9513571, 7859058, 6617618, 5663150, 4922470, 4332156, 3837834, 3412792, 3054896, 2761096, 2527598, 2350914, 2215259, 2128573, 2083471, 2072494, 2089358, 2140838, 2223735, 2350550, 2522116, 2753636, 3071334, 3506978, 4117214, 4968757, 6180172, 7950816, 10523573, 14093462, 18525942, 23057803, 26339385, 27111628, 25110809, 21220516, 16777877, 12807996, 9724986, 7484849, 5899167, 4756947, 3912440, 3274822, 2781949, 2391291, 2067750, 1793341, 1556197, 1354781, 1179381, 1040944, 925466, 829137, 746397, 684094, 632619, 580112, 537255, 506009, 481535, 454310, 423823, 398474, 382661, 369968, 354269, 337311, 316921, 300292, 287798, 279346, 270737]
12803B70737n789k097k828j0528j4776j0622j6195j4748j6129p955N27n030q262
12790A56305l58N063n11o996n755n759M06p368o456N86M262P050p155l696k506
12775A27112j545O530L960m927l896m654L113P373j779r777k288K014M827K677
12761A28740N95K332o557j6622k2000j6145p724n933k417l093j79k541n698J1052
12747E3810P248L007k388N71L05o051k179L247k795o677J109K814K670O783M791
12732F6265K368m531j48N47K677L908k572n803P297J062o243k150j91j784L90
12717F1092n648r186r119q541o616m083k77L116P091L087L99R425N697o208j0661
12702B9568L354M460m760m266k996N58m609O1N114J058J8K513J302M029J622J011
$$ y = [270737, 264948, 262851, 260023, 249495, 234719, 224097, 207902, 193154, 177025, 169070, 169597, 164567, 156305, 155947, 161010, 160499, 153503, 147748, 141989, 142395, 135027, 128571, 129157, 133419, 140469, 133314, 129618, 127112, 125567, 132097, 136057, 131130, 127234, 122580, 125693, 133066, 131287, 121510, 119222, 121236, 126063, 128740, 129335, 131667, 125110, 108488, 86488, 70343, 62619, 56686, 54269, 51176, 50997, 48456, 42758, 53810, 61058, 64065, 61677, 62248, 62553, 56502, 54323, 57570, 54775, 48098, 49207, 52021, 54691, 61474, 66265, 68633, 64102, 63954, 64501, 67178, 71086, 68514, 62711, 70008, 71070, 64827, 62677, 62486, 60702, 61092, 55444, 46258, 37139, 28598, 21982, 17899, 17622, 20738, 27829, 30916, 31315, 40740, 46437, 40229, 29568, 32922, 37382, 32622, 28356, 25360, 25918, 21309, 21370, 26484, 27542, 27560, 30073, 31375, 35404, 37026, 38037]
12686C8037K205k97n704o440L374J952m761K021J521r16J281L869N618k682n856
12671C3222j849J341J086J437J913j694l137q064o959O480M335o299l603O30K754
12656B1593K410k291j37L25J009O27j1568n393n197j854R857J5384K846O125L584
12641C7320p4O364L2k510q97L027k660n927o416K314j491j205K909l300p156R10
12625B1240O764j774K621P136P457L300k031J823k913M582j665K882J0760Q733
12611F8915j923k510j847n068n950j3444o750n592Q07O154N816K57l942l432m716
12596B6775o311k699J054n74L361J0979L831J568J790J264k588P690Q727J1345
12582F6212R087J0766p84O68j407J814n631o837j0692M375n952o861j0271o722
$$ y = [38037, 40242, 39945, 34241, 27801, 31175, 33127, 28366, 30387, 31908, 30992, 32273, 36142, 41760, 39078, 33222, 31373, 32714, 33800, 35237, 37150, 35456, 32319, 24255, 17296, 23776, 28111, 21812, 18209, 18839, 21593, 24003, 21712, 21575, 21900, 22909, 23536, 11968, 6575, 1378, -476, 9381, 24765, 27611, 33736, 37320, 37246, 43610, 43642, 41132, 40235, 43262, 40602, 34675, 28259, 30573, 29082, 27877, 30786, 27486, 20330, 21240, 28004, 26230, 28851, 35987, 43444, 46744, 44713, 46536, 43623, 48205, 46540, 49422, 60182, 68915, 66992, 64482, 62635, 57567, 51617, 38173, 31423, 25831, 26638, 32792, 38608, 38865, 34923, 31491, 26775, 20464, 17765, 18819, 18245, 21606, 32585, 36416, 37984, 39774, 41038, 38450, 46140, 54867, 66212, 75299, 86065, 85281, 85949, 84542, 86356, 80725, 73888, 63196, 67571, 61619, 54758, 44487, 37765]
12568C7765k311L017N378M258J0842J0469k02n697p668j111M774J459k388n105
12554E3480j101K515k665l916K232N303N412J9268J4383M149o509j0656k592q396
12540G0907p365o225J815K541L091j1369j3375k184k724K321K175P043J3153J0198
12526G0002L130n59K998J1910J5629L1174K8998o629k6036j6193j4214j5328j89
12513H4693l191m466r725r787J438q050k119J744k814K03p698m620M16K928O250
12498D5202O82l686j801Q583L066m216p492q533k509J399K862J466j169N843O224
12483D5921R550P667R95k685Q031J5992P908j5385j6875O7P837J0058J7086J5109
12469A11276J1464J8206m267j1164j8842j5720j2875j1762j8759j0920K80k159
$$ y = [37765, 35454, 38471, 43849, 48107, 58949, 69418, 69216, 63519, 55851, 54740, 59514, 60973, 58585, 53480, 52379, 54894, 52229, 48313, 50545, 55848, 61260, 80528, 94911, 99060, 92551, 81895, 79303, 70907, 63542, 57317, 59132, 61673, 64764, 53395, 40020, 37836, 35112, 37433, 39608, 46651, 59804, 70002, 73132, 72573, 75571, 87481, 103110, 134284, 163282, 156653, 130617, 114424, 100210, 84882, 84693, 81502, 77036, 67311, 57524, 58962, 50912, 48793, 50537, 47723, 47926, 40228, 35608, 36024, 38952, 45202, 45884, 42198, 40397, 48980, 52046, 47830, 40338, 31805, 29296, 30695, 33557, 35023, 33854, 39697, 45921, 55471, 63138, 64133, 61448, 69479, 85471, 93379, 77994, 61119, 61186, 69023, 79081, 96167, 111276, 122740, 140946, 136679, 125515, 106673, 90953, 78078, 66316, 47557, 36637, 36917, 34758]
12457C4758l500j47q290o321O302L24n213K456N365M666L96l46J870m868l262
12442B4190J0159P173P27j201R457K853L626M476R683R977J8407K9870L2606M1164
12428B03167M1869K3307o69k3228m3691l9011l3163k3179j6711j8489j1843l041
12416E5318k961r983q734m859n888m745K931J0649L226j921M686j44L16N243q53
12401D2281k855j631j37M870Q364r47l307N09O265L934R096J2380J9361K5040
12387A23223K6974R397k326j2423k0669j7125j0045j2502q335j4240j1601q5j778
12374D8465J011j557k558p535n146N023J6726J0310J936L325K740l877o202q229
12360E4432n022o032j527n429k723n204j97L474J940q578L692J847J81p246m586
$$ y = [34758, 31258, 31111, 22821, 16500, 22802, 23126, 17913, 20369, 25734, 30400, 30796, 30450, 32320, 27452, 24190, 34349, 41522, 42249, 41048, 50505, 53358, 56984, 61460, 71143, 81120, 99527, 129397, 162003, 203167, 245036, 268343, 267674, 244446, 200755, 161744, 128581, 105402, 88691, 70202, 58359, 55318, 52357, 42374, 33640, 28781, 22893, 18148, 21079, 31728, 34954, 33033, 37719, 37575, 37891, 43134, 42281, 39426, 37795, 37658, 42528, 50892, 49945, 46638, 47147, 53412, 57346, 66442, 78822, 98183, 123223, 150197, 159594, 157268, 144845, 124176, 107051, 97006, 84504, 76169, 61929, 50328, 50243, 48465, 49476, 47919, 45361, 37826, 32680, 37703, 54429, 64739, 66675, 70000, 72740, 68863, 62661, 54432, 49410, 43378, 41851, 36422, 33699, 28495, 28298, 31772, 33712, 25134, 28826, 30673, 30854, 23608, 19022]
12345A9022O598L519q041j607L300m675p730n478N531N423K478J185n687l177
12331A0661M208N805N810N345M635r646n874m703M655M822l482j0467k334O946
12317A6381K744p693n342k073M220K117k453o17k71m96K203o732j0622K966l39
12302f007K794R531N617j038m450l601m417r05K901P27n925O598K542L162n03
12287G026J607m09m91l853p223l02J87O174j990n596k553Q436J0696K715r768
12272D656m868k09J860k239n859o56O74m299P687O955l092p37k874j09j98P658
12256D350N902m655K074k724j825L076m427l283K715k008J753j067l560R1J160
12241b428P206R120k209r036o90O999k071l813k403L142L836l185J279M898k568
$$ y = [19022, 25620, 29139, 21098, 19491, 22791, 18116, 10386, 4908, 10439, 15862, 18340, 19525, 13838, 10661, 14869, 20674, 26484, 31829, 36464, 26818, 20944, 16241, 20896, 25718, 22236, 11769, 9435, 16381, 19125, 11432, 6090, 4017, 8237, 10354, 7901, 7284, 7013, 6517, 8720, 1988, -8634, -5668, -6007, -3213, 6318, 11935, 10897, 6447, 2846, -1571, -2476, 425, 1152, -4773, 1825, 4367, 7529, 7026, 8633, 8224, 7733, 3880, -3343, -3645, -3458, 2716, 726, -4870, -7423, 1013, 11709, 14424, 4656, -212, -421, 1439, -800, -6659, -7315, -6641, -10940, -3253, 3702, 610, -127, -3001, -3110, -3308, 4350, 10252, 5597, 7671, 4947, 3122, 6198, 1771, -1512, 1203, -805, 948, -119, -3679, -3588, -2428, 4778, 13898, 11689, 2653, 1963, 8962, 6891, 3078, 675, 3817, 7653, 4468, 5747, 10645, 8077]
12226H077j2879Q90n11o61M206p74K37K880K141L891J924l056m676J656k801k257
12210a713n189l274o012j508J609N901J1237l564n755l917K826p47K866K446p321
12195a2115N893P012N54m841j657r21L443N54l372M290J59J286J881P78p875K355
12179b576L835m242K034M972L920J725pj098J541j335m688p550p336l62R468L772
12163B073m35K22L270R5K746J712o12K133q91r905O64Q633L047o467m572J252
12147B965J448K776q63k704q861l322K681n903J899R555O782q17j994M571k92
12132G921O88o165p821J175L856J518j38N722l241r92M160M493L907N435p591
12117A2927r085J826m466m629M109M194o061O578O837r37n022j586j391o952m496
$$ y = [8077, -4802, -3912, -4423, -5084, -878, -1652, -1415, 1465, 3606, 7497, 9421, 6365, 1689, 3345, 544, -1713, -6902, -10176, -16188, -17696, -16087, -10186, 1051, -2513, -8268, -12185, -9359, -10106, -7240, -4794, -12115, -6222, 790, 1344, -3497, -5154, -6075, -2632, -2078, -5450, -1160, -1001, 285, 2166, 2944, -4931, -2576, 1259, -2983, -949, 4023, 7943, 9668, 9661, 8563, 10104, 8769, 4081, -3469, -10805, -11167, -1699, 2073, 1638, 1860, 5130, 5225, 7971, 9683, 9071, 11204, 10313, 408, 1072, 9705, 12752, 6285, 1713, 2965, 4413, 7189, 6326, 3622, -5239, -8561, -5880, -11783, -9884, -329, 6453, 5636, 3642, 8213, 7921, 8609, 2444, -5377, -4202, -346, 1172, 1034, 6756, 3515, 2523, 6683, 11176, 15083, 20518, 12927, 3842, 5668, 1202, -3427, 682, 4876, -1185, 5393, 12230, 11293, 6271, 4685, 3294, -3658, -8154]
12102h154J165o09m04R300N642k578l125m093J421P219L56N51k326o164K117L871
12086D189J626k708n285J949J893J819o082L454Q298r227j2320l236k113J828
12072a5915M316N238J791K908K086K789m683j131L621R49l415n111K787R066J8
12057E314K005j466J337R50o23m531q172j559N939O915k558l184L403l97j200
12042B173N354j487p483j348l88p143M969Q700P298k067l428j076M797M487j879
12027A1479k536o27K680j514q276o0q61N082j239M837J0548j120j4689l335M015
12012D384J349J618k17o613r787K540J037J349M4L99Q21k135K492K948R654k296
11996G587n313n468j862J98M865K97L469J021m627J856k972k107k3o80L80j089
$$ y = [-8154, -6989, -7598, -8002, 1298, 6940, 4362, 1237, -2856, -1435, 5784, 6140, 6691, 4365, -1799, 318, 4189, 5815, 3107, -2178, -229, 1664, 3483, -2599, 855, 9153, -74, -12394, -15630, -17743, -15915, -11599, -6361, -4570, -1662, 424, 3213, -1470, -2601, 1020, 1969, -1446, -6557, -3770, 5296, 5314, 7319, 5853, 7190, 8140, 7517, 2986, -5186, -6745, -806, 6109, 3551, 367, 3770, 3373, 2173, 7527, 6040, -1443, -2791, -3179, -10322, -5353, 3347, 10645, 8578, 5150, 4074, 8871, 13358, 11479, 8943, 8316, 10996, 9482, 1206, 1146, 285, 5367, 4128, 8965, 19513, 18393, 3704, 369, 4384, 5733, 7351, 7134, 521, -9266, -6726, -5689, -4340, -4296, -3897, -3076, -5211, -2719, 229, 9883, 7587, 2274, -3194, -5056, -4858, 7, 304, 3773, 4794, 167, 2023, -949, -3056, -3079, -3759, -3379, -4468]
11980d468l800K867J607L458k898m577m148R64N537K87J002P053K609p45o756
11965b008n252l70L084M309J622m66J950r187m39O33N709P554J380o278j0755
11950h514J151m889m066K941Q98J665O084L011n538j769N419R565N067l560n080
11935B385K48m412l883l82O4O141O619R054n897o283l705j852J31j840L87J224
11919b001O57j416M715O70k71l021k257l497K672J425K405J2527l651n657r31
11904B369l331k251l851J994N084l470l198m035p64r00K618M35Q970K253Q66N899
11888H688n661l143M929M9p61k860j197l090L614R18m237k772j614L719J910k234
11872c742M155K378j768J02J591o20J230k630L039j304l033m057k541J463N736
$$ y = [-4468, -8268, -5401, -3794, -336, -3234, -7811, -11959, -10995, -5458, -5171, -4169, 2884, 5493, 4748, -2008, -7260, -7630, -4546, -237, 1385, 919, 2869, -6318, -6757, -6124, -415, 7139, 8519, 2241, -8514, -7363, -12252, -16318, -13377, -12479, -10814, -4730, -1719, -7257, -9026, -3607, 5958, 11025, 7465, 2385, 2633, -1779, -5662, -6044, -5980, 161, 6780, 15834, 9937, 3654, -51, -1903, -1772, -3612, -3225, -2001, -1344, -2760, 1955, 2625, 2354, -667, -2924, -6421, -3749, -2324, 81, 12608, 8957, 3300, 2369, -962, -3213, -7064, -5070, 14, -3456, -6654, -10689, -11453, -12353, -9735, -9300, -330, 1923, 2789, 8688, 3027, -116, 4813, 4862, 4101, 1241, 44, -3046, 568, 1486, -2751, -5523, -7137, -3418, -1508, -3742, 413, 2791, 1023, 1125, 2716, 2096, 3326, 696, 3735, 2431, -602, -4659, -7200, -5737, -1]
11857aj198j553m401K205L917l815l229J33K050l337j735R209r36m923p829Q870
11841f573K358j051J720P644M753o2O46o537l739l167K236k99L820j167k433K384
11825E33j328n409k64L092R43j027j733J809K590j488m290p66J0884M392m458
11810C480k859K853J767M87l797o148mR36j02L303N248n818r25J960J000n060
11794c679L66l489k248N071L979N85n982P410l033j633M679j127J191N404L399
11779A0893k285p545o876l374k583R69L620O110r93L76R99j487p74O00l717L90
11763e677J002L283J607q451l215P656n00n175L107J082k905j968m88L022L395
11748d225K561n563l712Q923R420k486m047n879K797R381k592p785j0041l299
$$ y = [-1, -1199, -2752, -7153, -4948, -1031, -4846, -8075, -7942, -5892, -9229, -10964, -1755, -2691, -7614, -15443, -6573, -4215, -5266, -3546, 4098, 8851, 8789, 9435, 2898, -841, -4008, -1772, -2071, 1749, 582, -1851, 533, -795, -6204, -6468, -3376, -2433, -3460, -5193, -3384, -794, -2282, -6572, -7338, 3546, 7938, 3480, 621, 3474, 5241, 5728, 1931, -4217, -4221, -3285, -3387, -84, 5164, -654, -1579, 381, 1381, -3679, -3313, -6802, -9050, -3979, 0, 585, -5397, 2013, -1020, -2653, 2026, 899, 2090, 7494, 10893, 8608, 1063, -5813, -9187, -11770, -10801, -7181, -1071, -2064, -1688, -689, -2176, -2950, -2350, -6067, -5677, -4675, -1392, 215, -8236, -11451, -3795, -4295, -9470, -6363, -5281, -8186, -10154, -10642, -7620, -4225, -1664, -7227, -10939, -2016, 7404, 4918, 871, -5008, -2211, 7170, 4578, -3207, -13248, -16547]
11734a6547J478P852M801M046K462k25M40J058K23k657o304j746m189K207P683
11719E82m448k53K360k135N40l785l946M134j114J498L202L356K087o261j171
11704e354j154j4N480Q225L568r05l998Q46k469M337l69K150r2j036l97L22K216
11687A1356n953l092J780J128r46m412j23j708m279Q540K221P51q40M775R70j007
11671I161l859m141J746Q01n682N004M283l952j0270l400N193M472M555N316J524
11656A0751j237n923K559M086M24k473k789m319M022j579p80N542N430R41j512
11641A3143M3m943M664k536k756l236j253r468n781N578J634J778L778K439l297
11626b13p862k066M317Q498Q165n062l967p62n505n185M285l899K015J319J532
$$ y = [-16547, -15069, -7217, -2416, 1630, 4092, 3867, 4307, 5365, 5588, 2931, -3373, -5119, -9308, -7101, 582, -3866, -4119, -1759, -3894, -3354, -7139, -11085, -6951, -8065, -6567, -3365, -9, 2078, -4183, -5354, -6508, -6522, -1042, 7183, 10751, 9846, 5848, 6694, 4225, 8562, 8193, 10343, 10251, 9215, 8818, 9140, 11356, 5403, 2311, 4091, 5219, 4273, -139, -262, -1970, -6249, 2291, 4512, 5263, 4423, 9198, 10168, 9161, 5302, 1161, 2907, 3708, -1974, 3030, 7313, 3361, -6909, -10309, -5116, -644, 3911, 9227, 10751, 9514, 3591, 6150, 10236, 10660, 8187, 5398, 1079, 5101, 3522, 2742, 8284, 13714, 14655, 13143, 13186, 8243, 12907, 10371, 7615, 4379, 3126, -6342, -12123, -6545, -4911, -3133, 645, 3084, -213, -8075, -10141, -5824, 2674, 10839, 5777, 1810, 1048, -4457, -9642, -5357, -9256, -7241, -5922, -4390]
11611d390P39M715l529o862j849M234j591j50O213N187j348o68O490J0891o6M4
11595A8060j820m073o53M488j491K59q22p057j885P23K056J667l295N265L359
11580A4781J911j958j552M850n043m632m835M306L011M683l171m768m127o940
11566c484k530P914K42k93n418K968N711L160N94L178j947m260J051L721m522
11551F085k930p19N62J303J817l487r654n118M567M570M278N786K98R84m0j199
11535G103K518M663k90m502J657L616j0893l8N716K389j1403q393Q460K058r28
11520A733j730J71L588O97k010L662J1294k376m947k729J988J971p813N255M499
11505A3253j372P283K058p802l000k600M07M929K106J295K656o483n283m334r09
$$ y = [-4390, -3651, 1064, -2465, -9327, -11176, -6942, -8533, -8683, -2470, 2717, 1369, 701, 7191, 18082, 18016, 18060, 16240, 12167, 11514, 16002, 14511, 14770, 13948, 6891, 5006, 5729, 7785, 9452, 6157, 11422, 14781, 16692, 14734, 13182, 18032, 12989, 8357, 3522, 7828, 10839, 15522, 12351, 7583, 3456, -3484, -6014, 1900, 2142, 1849, -3569, -601, 5110, 8270, 8864, 12042, 10095, 5835, 6886, 10607, 6085, 3155, 2436, 2998, 4301, 6118, 2631, -7023, -12141, -7574, -3004, 1274, 7060, 7358, 8342, 8302, 7103, 9621, 14284, 13994, 9492, 11149, 14765, 3872, 3834, 9550, 11939, 536, -7857, 603, 2661, 1733, 3, 174, 3762, 4459, 2449, 6111, 17405, 15029, 10082, 7353, 9341, 11312, 3499, 8754, 13253, 11881, 19164, 21222, 13420, 10420, 7820, 8227, 13156, 15262, 16557, 19213, 12730, 7447, 3113, 2204]
11490B204o184J466O747l576J774O496J835M686l539n509r94M911L47j634k513
11475F517J134J970l35j538k170O031J781o184n042q99n105n93O295L126j421
11460C567N927J176p960p30M697L585M92j727%M303M459l570L565M503J083m143
11444A9227j362k032n639n890L522Q982j82j086j327j135R02L542n360k817j143
11429H202K90L328M788k022k091q53l486k105M584m724o087J1838o76q37k828
11414G321o868l792K486M301Q987L612j414N58J030J423K442L456k331o64L723
11399B4270K070k925j432K585K02J420N062k255o313O29j30j345l312M158P090
11384B9774n542n574n516N28O149J1013l189l224L278n148m806j530m243N55P444
$$ y = [2204, -3980, -2514, 4233, 657, 2431, 8927, 10762, 15448, 11909, 6400, 5406, 10317, 10664, 9030, 6517, 7651, 9621, 9286, 7748, 5578, 11609, 13390, 7206, 2164, 1265, -3840, -4433, 1862, 4988, 3567, 9494, 10670, 2710, 1980, 6677, 10262, 10754, 9027, 9027, 13330, 17789, 14219, 17784, 22287, 23370, 19227, 17865, 15833, 10194, 4304, 7826, 16808, 16626, 15540, 14213, 13078, 13980, 17522, 12162, 9345, 8202, 8492, 11820, 16608, 14586, 12495, 11642, 8156, 6051, 10635, 5911, -176, 11662, 10986, 10149, 7321, 453, -3339, -853, 3448, 12435, 16047, 14633, 15191, 16221, 17644, 20086, 23542, 21211, 20547, 24270, 26340, 23415, 21983, 24568, 24770, 26190, 31252, 28997, 22684, 23313, 23183, 21838, 18526, 22684, 29774, 24232, 18658, 13142, 13670, 19819, 30832, 27643, 24419, 27697, 22549, 17743, 16213, 11970, 12525, 19969]
11369A9969M381j604j09J302o08K777J552m94m99l882M319n134j38L157k199k925
11353A9865j892L820M403L120p53m202m975p221r003L066P505L388K79M018M904
11338B6322j0004l419L208N378L732j113l950K043o210j631L706P434k966L3P557
11323C0120K33k898j405O204Q165K031j0837l956J214k02J84M887P205N087k825
11308D3207k38k569K161K465m298k5m758m337P166K329n56R84L954k545k241J0897
11292E1596K598K077N56p597N256J908j125o392o394l610P21K63J465P346J212
11277D9880m29k53j477P71J473K409J98L893M129j326j073N17j57K359p391k63
11261E3260l495m455K911q36k646J851m382j276J397R635K537O541J499K043M070
$$ y = [19969, 24350, 22746, 22637, 23939, 23331, 26108, 27660, 27166, 26667, 22785, 27104, 21970, 21832, 24989, 22790, 19865, 17973, 21793, 26196, 29316, 28563, 24361, 19386, 12165, 3162, 6228, 13733, 17121, 17400, 21418, 26322, 16318, 12899, 16107, 21485, 25217, 24104, 20154, 22197, 15987, 14356, 18062, 25496, 22530, 22563, 30120, 30353, 27455, 26050, 32254, 40419, 42450, 31613, 27657, 28871, 28669, 28853, 33740, 40945, 46032, 43207, 42969, 40400, 42561, 45026, 40728, 40703, 35945, 31608, 38774, 41103, 40547, 41531, 45485, 42940, 40699, 51596, 54194, 56271, 56827, 49230, 54486, 56394, 55269, 48877, 42483, 38873, 39594, 39857, 41322, 48668, 49880, 49451, 49198, 47721, 48492, 49965, 52374, 52572, 56465, 60594, 59268, 58195, 58712, 58555, 60914, 53523, 53260, 49765, 45310, 48221, 47385, 44739, 46590, 42208, 40932, 42329, 51964, 54501, 61042, 62541, 64584, 68654]
11246F8654J323M450P42M55p9M51j124m918l63N249M917j085n58k319j603P926
11230H2118j769k405k588R46k545J901P495P681N97K272q73L275L440r720K024
11215I1849J1481P180L428l588J074N81O631O480p89o345p544N26L592Q427L296
11200A26279N10n42O488L144q109m808M343P729Q473M945m06O140j008p3O898
11185A60003J230k316K33L573J589n332N145P940O149L005k640J565j709j061
11171A77374j36K419N559N677L533O470J652N773J392M712Q852j419n277R931
11157B26512O002J429L434P463Q179M477J0729P820P269L65N997J204J818P699
11143C00397J0221J4513J1778M699Q303N868N213L858J7473Q989M577J2438J3751
$$ y = [68654, 69977, 74427, 75169, 75624, 75545, 75996, 74872, 69954, 69591, 74840, 79757, 78672, 78114, 75795, 74192, 82118, 80349, 77944, 75356, 76302, 73757, 75658, 83153, 90834, 91431, 93703, 92830, 96105, 99545, 89825, 91849, 103330, 110510, 113938, 110350, 111424, 112005, 118636, 125116, 124327, 117982, 110438, 110964, 114556, 122983, 126279, 126789, 126247, 132735, 135879, 127770, 122962, 127305, 135034, 143507, 148452, 148046, 154186, 153178, 153105, 160003, 161233, 158917, 159150, 162723, 164312, 158980, 164125, 172065, 178214, 181219, 178579, 180144, 178435, 177374, 177238, 179657, 185216, 190893, 194426, 200896, 202548, 208321, 209713, 214425, 223277, 221858, 216581, 226512, 232514, 233943, 237377, 244840, 253019, 257496, 268225, 276045, 283314, 283679, 289676, 290880, 292698, 300397, 310618, 325131, 336909, 341608, 349911, 355779, 360992, 364850, 382323, 391312, 395889, 408327, 422078]
11130D22078J2905Q161N879M056J1230K1073J3742K996J6128J3403J2317J1080
11118E55048J7219J6024K0643K3091K1802K2101J3214J4017K2881K9115K6690
11107G81845K5157J9760K7826K7483L0336L1963K9880L2103L7080M0478M1089
11096A125000M1871M5907M3799N0272M7623M4202N6848O4679O0748O2349O6813
11085A710111P3210P1671Q6385Q9048Q4688Q9676R8947J11864J17564J25322J23344
11074B781830J31800J46258J53755J55902J67210J84039K03102K07346K20190
11065D351432K27468K32864K47830K55848K67955K81197K90057L12650L24836
11056F792137L13914K98249L08764L03387K86388K68335K50957K35985J97569
$$ y = [422078, 434983, 443144, 449023, 453079, 464309, 485382, 499124, 502120, 518248, 531651, 543968, 555048, 572267, 588291, 608934, 632025, 653827, 675928, 689142, 703159, 726040, 755155, 781845, 807002, 826762, 854588, 882071, 912407, 944370, 974250, 1006353, 1043433, 1083911, 1125000, 1166871, 1212778, 1256577, 1306849, 1354472, 1398674, 1455522, 1520201, 1580949, 1643298, 1710111, 1783321, 1854992, 1941377, 2030425, 2115113, 2204789, 2303736, 2415600, 2533164, 2658486, 2781830, 2913630, 3059888, 3213643, 3369545, 3536755, 3720794, 3923896, 4131242, 4351432, 4578900, 4811764, 5059594, 5315442, 5583397, 5864594, 6154651, 6467301, 6792137, 7106051, 7404300, 7713064, 8016451, 8302839, 8571174, 8822131, 9058116, 9255685]
11047I255685J59597J08713N9191J8368j4429o9081j14480j52634j85943k13827
11037H851160k42066k64345k80559k94477l03806l06380k99760l01146k91613
11028F267008k79819k67683k72478k58458k44053k31966k22943k16258k09593
11019D063757j92533j73819j67497j62549j46962j35077j29416j35418j24861
11010B695625j11222j02065j07318r6614q9934r2692q9736p7990p7447o5745n9643
10999A725219n9030n3876o0513n4571n4704m8312l8572m9459n4397m2316k5311
10988A184158k5095l3335l8684m1536k8240k8993l4524k1516k4876k3772j7989
10977H65598k5524k9154j7141j9689k0285k2925k4877j2043n408j1040j7338j3939
$$ y = [9255685, 9415282, 9523995, 9583186, 9601554, 9587125, 9518044, 9403564, 9250930, 9064987, 8851160, 8609094, 8344749, 8064190, 7769713, 7465907, 7159527, 6859767, 6558621, 6267008, 5987189, 5719506, 5447028, 5188570, 4944517, 4712551, 4489608, 4273350, 4063757, 3871224, 3697405, 3529908, 3367359, 3220397, 3085320, 2955904, 2820486, 2695625, 2584403, 2482338, 2375020, 2278406, 2188472, 2095780, 2006044, 1928054, 1850607, 1784862, 1725219, 1666189, 1612313, 1551800, 1497229, 1442525, 1394213, 1355641, 1306182, 1251785, 1209469, 1184158, 1159063, 1125728, 1087044, 1045508, 1017268, 988275, 953751, 932235, 907359, 883587, 865598, 840074, 810920, 793779, 774090, 753805, 730880, 706003, 693960, 688552, 677512, 660174, 646235]
10965F46235r567j4255j5434j0275j5347j1485j0824r227j7373j5603j9361j1309
10953D86175m758l291k500o239p991o208p329o418j1025j7482j1828q123p401
10940C85582j264n495J552k949j0542j1473j0060m130k946r46n588q410l099p617
10926C12615M004l742n394j0896j2100m707o14N517o40l232o203q931l665m766
10912B57246m705L080J980j101l044J986o387l801Qp00l938j1236j6117l776q54
10897B08641L100q844q462O105J2311J5848K1297J8161J8639O856K139q359j9641
10884B67791k2648j9802p344r597j3245o045n471r150j651k54k291l070m615l064
10870A59544l514K267j361o951P38O096K473R57J875N864l997K140J43N124L692
$$ y = [646235, 636668, 622413, 606979, 596704, 581357, 569872, 559048, 549821, 532448, 516845, 497484, 486175, 481417, 478126, 475626, 469387, 461396, 455188, 447859, 441441, 430416, 412934, 401106, 392983, 385582, 384318, 378823, 380375, 377426, 366884, 355411, 345351, 341221, 338275, 337329, 331741, 323331, 320232, 312615, 316619, 312877, 307483, 296587, 284487, 279780, 279166, 284683, 284043, 280811, 274608, 265677, 262012, 257246, 252541, 255621, 257601, 256500, 253456, 255442, 249055, 245254, 245262, 244562, 240624, 229388, 213271, 209495, 208641, 211741, 202897, 194435, 200540, 212851, 228699, 249996, 268157, 286796, 293652, 295791, 287432, 267791, 245143, 225341, 217997, 208400, 195155, 189110, 183639, 174489, 172838, 172584, 170293, 167223, 162608, 159544, 156030, 158297, 156936, 149985, 150723, 156819, 159292, 160249, 162124, 167988, 163991, 166131, 166274, 171398, 175090]
10855A75090l915o167k54O526N880Q758J1715J0222Q641J6169J0873J1774O133
10842B61445L513l039K059r210j1381j7965j4553m838p665o614j5270q170m671
10829A63641j3767n328o786l183O89J366J14o365k306j967l667l84o074j1052
10815A04931L429n254l275r15M288L030P99l683J059n475n42P404J107P6N909
10800A12888J3049J7468J0263J4865K3218J2234J0197o71j5989j0548j5924j5131
10788A55919j7053j5664m626r173j386p7r347p887o70K505M379k445j186O91j1109
10773H2871o750M214L070m193l526L229J452J92o287p539o64K625J017K215P401
10758G9327J326r971k034J960q39l095o68q55j375M478L073J472j646n430J835
$$ y = [175090, 171175, 165008, 164754, 171280, 177160, 185918, 197633, 207855, 216496, 232665, 243538, 255312, 261445, 264958, 261919, 263978, 254768, 243387, 225422, 210869, 206031, 198366, 191752, 176482, 168312, 163641, 149874, 144546, 137760, 134577, 135266, 136632, 136746, 130381, 128075, 126108, 122441, 122057, 115983, 104931, 108360, 103106, 99831, 98916, 103204, 106234, 107033, 103350, 104409, 98934, 98392, 105796, 106903, 106979, 112888, 125937, 143405, 153668, 168533, 191751, 203985, 214182, 213511, 197522, 186974, 171050, 155919, 138866, 123202, 118576, 109403, 108017, 107940, 98593, 90706, 90036, 92541, 96920, 94475, 93289, 93980, 82871, 76121, 80335, 83405, 79212, 75686, 78915, 80367, 80559, 74272, 66733, 66069, 68694, 69711, 71926, 79327, 80653, 70682, 68648, 70608, 69769, 66674, 66006, 65151, 63776, 68254, 71327, 72799, 71153, 65723, 67558]
10743F7558j593n332K452J438Q455k629j1816R390O677l909j517k326P084N089
10729G9021K940J971R890K459m474n473o389m808k90j104o306O89q55j914m825
10714F0532o664o385K666P715J876n035N412J888L946p780p166j442M428N074
10700E9065R49q220K917K800N215m008N16L42q9M885N490Q814l096r3L974P336
10684H6797L043j065j809m116L92j888p305r694r11K090N107J714m230O7J734
10669F9926N4m25o498m461k325n384J090P812O077J740j507m565m96N096o584
10654E9550l943p820K078r28r35l73J1217M657L077K753k727J79j585l233l71
10639F1596M870M767K803j814L308P595L973J301K230L858N628J0109Q529N292
$$ y = [67558, 65965, 60633, 63085, 64523, 72978, 70349, 58533, 67923, 74600, 70691, 69174, 66848, 73932, 79021, 81961, 83932, 93822, 96281, 91807, 86334, 79945, 75137, 74847, 73743, 67437, 68126, 67271, 65357, 60532, 53868, 47483, 50149, 57864, 59740, 54705, 60117, 62005, 65951, 58171, 51005, 49563, 53991, 59065, 60014, 51794, 54711, 57511, 62726, 58718, 59234, 59576, 59487, 64372, 69862, 78676, 75580, 75487, 79461, 86797, 89840, 88775, 86966, 82850, 83242, 81354, 74049, 64355, 63444, 65534, 70641, 72355, 68125, 68192, 69926, 69980, 69555, 63057, 58596, 56271, 50887, 51977, 59789, 65866, 67606, 66099, 61534, 61038, 66134, 59550, 55607, 47787, 49865, 48937, 48002, 47629, 58846, 63503, 66580, 69333, 66606, 66785, 65200, 61967, 61596, 66466, 71233, 74036, 72222, 75530, 83125, 87098, 88399, 90629, 94487, 100115, 110224, 118753, 124045]
10625A24045K38m370j66l350o483r890p117J224R66l479n002n244o209o203K397
10610G1357Q285O051O970N744k180N324P358N17q656o019n196j932J722P831P756
10595A04932N768J3549J8411J8736J6463L045M943j363k956p728j1066j8979j2792
10582A30963j240m205J438M024l568m503L986K380Q91J898j241L387j056j878
10568A31276k274K573J156n164l851Q82N430O709J1346J0158P296J0668J6090
10555A92295J3201K0416J8737J1253J4163J1750P420R234J4799L5196N1681P5873
10543D76018J26451J69608K07648K30729K20260J47614N2402n3614j53257k05554
10533A218305k13149j95570j51835j16097q0398p0546m9335k8205j9427k1891
$$ y = [124045, 124283, 119913, 119747, 116397, 109914, 100024, 92907, 94131, 95097, 91618, 86616, 81372, 75163, 68960, 71357, 79642, 85693, 92663, 98407, 96227, 101551, 108909, 109426, 100770, 94751, 89555, 87623, 89345, 97176, 104932, 110700, 124249, 142660, 161396, 177859, 180904, 185847, 184484, 181528, 173800, 162734, 143755, 130963, 129723, 125518, 126956, 130980, 127412, 122909, 126895, 129275, 130166, 132064, 130823, 134210, 133154, 131276, 129002, 131575, 132731, 127567, 123716, 124598, 130028, 136737, 148083, 158241, 165537, 176205, 192295, 205496, 225912, 244649, 255902, 270065, 281815, 289235, 298469, 313268, 348464, 400145, 476018, 602469, 772077, 979725, 1210454, 1430714, 1578328, 1630730, 1577116, 1423859, 1218305, 1005156, 809586, 657751, 541654, 461256, 390710, 341375, 313170, 293743, 271852]
10523B71852j0787n548n405n400m778j77j153O267K689l332j124P518J5457J0759
10509B76838J1271J2707O379q890K422O086J1961J7800K1272K1599K7591K8181
10497D35217L7540M4198N0623N2934O2360P1785R3346J17329J31605J46538J69835
10486A413310J91045K21593K85071L70830N24677P47644J082065J570577K182811
10477H589623K779210L130621K969113K188796R36058m98313j761002k573739
10469A5760367k824369k623900k178766j671744j222485q77074o33414m55987
10461C272628l36085k58553k10366j71234j39927j14849r6461p0658l4102R11
10451A841304M1549Q3379J46180K34558L43918M82150O40597P64973P96332O87844
$$ y = [271852, 261065, 255517, 250112, 244712, 239934, 239757, 238604, 244871, 247560, 244228, 243104, 250622, 266079, 276838, 288109, 300816, 307195, 298305, 300727, 306813, 318774, 336574, 357846, 379445, 407036, 435217, 472757, 516955, 567578, 620512, 682872, 754657, 848003, 965332, 1096937, 1243475, 1413310, 1604355, 1825948, 2111019, 2481849, 3006526, 3754170, 4836235, 6406812, 8589623, 11368833, 14499454, 17468567, 19657363, 20593421, 20095108, 18334106, 15760367, 12935998, 10312098, 8133332, 6461588, 5239103, 4362029, 3728615, 3272628, 2936543, 2677990, 2467624, 2296390, 2156463, 2041614, 1945153, 1874495, 1840393, 1841304, 1882853, 1966232, 2112412, 2346970, 2690888, 3173038, 3813635, 4578608, 5374940, 6062784]
10441F062784M66757K41371J47584K45734N89812J178534J971393K876190L687257
10432A7467416M109284L929951L155553J910728L61402j257857k594615l273341
10424B3808521l137401k350370j307554m41356q4277l65526j043774j700625j992867
10415A1384771j861579j453225r19936m10482j5836J51295K4732l07721o62159
10406E929860q45706q29926o85024n12432l62615k37250j46458p8511j6051L0074
10396B245961O6093J03831J44794J74833K05061K80103L76522N22520P52985J103960
10386E976663J613679K301118L105323L819999M052400L494843K086716J32659
10378B6583400j809440l203200l793698l655763l094931k414585j797053j313021
$$ y = [6062784, 6529541, 6770912, 6918496, 7164230, 7754042, 8932576, 10903969, 13780159, 17467416, 21576700, 25506651, 28662204, 30572932, 30934334, 29676477, 27081862, 23808521, 20671120, 18320750, 17013196, 16571840, 16487563, 16122037, 15078263, 13377638, 11384771, 9523192, 8069967, 7150031, 6739549, 6723713, 6875008, 6899740, 6592019, 5929860, 5084154, 4254228, 3569204, 3056772, 2694157, 2456907, 2310449, 2231938, 2215887, 2245961, 2312054, 2415885, 2560679, 2735512, 2940573, 3220676, 3597198, 4119718, 4872703, 5976663, 7590342, 9891460, 12996783, 16816782, 20869182, 24364025, 26450741, 26583400, 24773960, 21570760, 17777062, 14121299, 11026368, 8611783, 6814730, 5501709]
10370E501709r59839p12885n38189m25349l55451l04752k63540k37556k04242
10361A499906j84082j52415j19843j04869p9831o5750n4555m9302n2925m1542
10351E94792l5022l2015k3157k5643k9451l0167l0084k3998j9202j6850j2523
10340C16680j1148p731p85K967K557j764r359j2524l179n852M392J091j0338j5670
10326B49337p755m555N669m984N71K185p514m75n101j1480k145r255n680j972
10312A96846Q758J0078K0026K2242J7932N844j622j2943j3736n957j7512j9679
10300B10277o87J1864J6746J1749K41r534q372q908Q71K703l04n734n870l326
10286B11716L35J028J1924M346N066J355N092k61L262k652p925M911q11j1378
$$ y = [5501709, 4541870, 3828985, 3290796, 2865447, 2509996, 2205244, 1941704, 1704148, 1499906, 1315824, 1163409, 1043566, 938697, 858866, 793116, 738561, 689259, 636334, 594792, 559770, 527755, 504598, 478955, 449504, 419337, 389253, 365255, 346053, 329203, 316680, 305532, 297801, 297016, 299983, 302540, 300776, 291417, 278893, 275714, 269862, 274254, 275345, 265007, 249337, 241582, 237027, 242696, 237712, 238283, 240468, 232954, 232479, 227378, 215898, 213753, 204498, 198818, 196846, 205604, 215682, 235708, 257950, 275882, 281726, 280104, 267161, 253425, 247468, 229956, 210277, 209590, 221454, 238200, 249949, 250190, 240656, 232284, 223376, 224247, 226950, 226646, 220912, 215042, 211716, 212051, 213079, 225003, 229349, 234415, 235770, 240862, 240601, 243863, 241211, 233286, 238197, 237386, 226008]
10272B26008p209N835R017P421M878K0297K1419K1315J4017J292q545j0081p328
10259B98336K563Q322J7616J6767J7735J4444J6844L5181O0633P9088P5747J7806
10247F61082j07148k22136k04639j06299k9480J4394L1885K1026J7334R124P428
10236I2571K996Q399J0204M783O201n173k445M813P281j818O092Q893J5848J9089
10222A77734J4453J2496N521l0J3850J0363J2822J9922J5224J1686K0945J3210
10210C28196O230J7174J7844M4824P0153O4799M9793M8903N6764O7437J6817k8791
10198G60143l8069l6320m8164o9503o0761m1470j1835J3714J4540J7855K7813
10187E27943K0470J2188J153P47P647O730Q706Q832J8560L0237L2013L7285L9213
$$ y = [226008, 218799, 224634, 233651, 241072, 245950, 266247, 287666, 308981, 322998, 324290, 315745, 305664, 298336, 300899, 309221, 326837, 343604, 361339, 375783, 392627, 427808, 488441, 567529, 643276, 661082, 553934, 331798, 127159, 20860, -8620, 5774, 37659, 58685, 76019, 85143, 92571, 95567, 103966, 114170, 118953, 125154, 119981, 117536, 122349, 129630, 127812, 133904, 142797, 158645, 177734, 192187, 204683, 210204, 210174, 224024, 234387, 247209, 267131, 282355, 294041, 314986, 328196, 334426, 351600, 369444, 414268, 484421, 549220, 599013, 647916, 704680, 772117, 788934, 760143, 722074, 685754, 637590, 568087, 507326, 465856, 454021, 467735, 482275, 500130, 527943, 548413, 560601, 561754, 562501, 570148, 576878, 585584, 594416, 612976, 643213, 675226, 712511, 751724]
10174G51724K4653K4049L2957L7088M1345L8085L1047L7848M5623N5130O7489
10163A187038P7112P7167P0439O1927P5494Q3391J04150J15050J38392J71254
10153B161414K23886L04155M25087M94808L85904J79708M8186P1710J72764K73005
10143D740627L85970N14326O67214Q42415J027090J208805J335854J272619J014004
10134A3008924P99647Q89914J333738K072466L036150M286737O046733Q627727
10126D0102036J2634965J9321978L0821047M9329977P3106215Q6662711O2973178
10119C74952107L005111n3217438p6423734o9467172n0964741l4263053k2802260
10112G0818820j5563461j1014952q064861o048157m597784l506490k633560j917781
$$ y = [751724, 776377, 800426, 833383, 870471, 911816, 949901, 980948, 1018796, 1064419, 1119549, 1187038, 1264150, 1341317, 1411756, 1473683, 1549177, 1632568, 1736718, 1851768, 1990160, 2161414, 2385300, 2689455, 3114542, 3609350, 3995254, 4174962, 4223148, 4294858, 4467622, 4740627, 5126597, 5640923, 6308137, 7150552, 8177642, 9386447, 10722301, 11994920, 13008924, 13808571, 14698485, 16032223, 18104689, 21140839, 25427576, 31474309, 40102036, 52737001, 72058979, 102880026, 152210003, 225316218, 311978929, 374952107, 377957218, 324739780, 248316046, 178848874, 127884133, 93621080, 70818820, 55255359, 44240407, 36175546, 30127389, 25529605, 22023115, 19389555, 17471774]
10104A7471774j429074j291308j389952j489521j455508j314328j140648r81419
10096F980016q30379o88652n54872m38442l44629k88014k52525k15838j90311
10087C176354j71854j52283j39752j35101j41477j26989j10379r1929r0987q6489
10077A929114p5247o1480m8144n3916p0093p2215n7692o1288n5165m9863m5221
10066A278790n0902m7508l7403l4364j9653q649p888r969j6291k1344l0323k8406
10054I66090l0354j2217O159R620Q905Q549J6335K7895L6594L6442K2952J750
10042A098720j0310j6024J3816P4853J82402L82574Q15716J599770J549352k38534
10032E452335j407746j358895q34017m48401k57774j64244j06216p7422m8417
$$ y = [17471774, 16042700, 14751392, 13361440, 11871919, 10416411, 9102083, 7961435, 6980016, 6149637, 5460985, 4906113, 4467671, 4123042, 3835028, 3582503, 3366665, 3176354, 3004500, 2852217, 2712465, 2577364, 2435887, 2308898, 2198519, 2106590, 2015603, 1929114, 1853867, 1792387, 1744243, 1690327, 1620234, 1548019, 1490327, 1429039, 1373874, 1324011, 1278790, 1227888, 1180380, 1142977, 1108613, 1088960, 1080311, 1072423, 1062454, 1046163, 1024819, 994496, 966090, 935736, 923519, 929678, 939298, 948203, 956752, 973087, 1000982, 1037576, 1074018, 1096970, 1098720, 1088410, 1072386, 1086202, 1161055, 1343457, 1726031, 2541747, 4141517, 5690869, 5452335, 4044589, 2685694, 1851677, 1403276, 1145502, 981258, 875042, 797620, 749203]
10023G49203l2045k1695j9050k8805k6403j6942L522J3099K9533K6318J1746Q745
10011F97226M760m318r418j8633j8750k1147j5598n321q722k717J5673K9102M3987
9998F86124M9555O2369M4816n644r5823j59734j52222r6102l1488n416L732o8
9986C00099m207n558n775l841L590N569o46n764o284q380q350l038n239O22K916
9971B55714r043J151M891M371R075J3947J5831J4994N329R042l925m848p356n989
9957C03184q153j4184j2551j4744r002j6547j8005m700J308m013l047o813m707
9944A88026q376q219l769L331K451J131J0292J832J013p103j8172j5811p944R826
9930A48508K0161K1162J2471J2170M105n846j4200n554m444k277r152p486K342
$$ y = [749203, 717158, 695463, 676413, 647608, 621205, 604263, 607785, 620884, 650417, 676735, 688481, 697226, 701986, 697668, 688250, 669617, 650867, 629720, 614122, 608801, 600079, 597362, 613035, 642137, 686124, 735679, 798048, 842864, 837220, 741397, 581663, 429441, 333339, 301851, 296435, 300167, 300099, 295892, 290334, 284559, 280718, 284308, 289877, 289231, 283467, 277183, 268803, 260453, 257415, 252176, 252798, 255714, 246671, 247822, 252713, 257084, 266159, 280106, 295937, 310931, 316260, 325302, 321377, 316529, 309173, 303184, 295031, 280847, 268296, 253552, 244550, 228003, 209998, 205298, 206606, 202593, 199546, 192733, 188026, 179650, 171431, 167662, 170993, 173444, 174575, 184867, 186699, 187712, 180609, 162437, 146626, 138682, 148508, 168669, 189831, 202302, 214472, 218577, 212731, 198531, 192977, 188533, 186256, 177104, 169618, 171960]
9917A71960O85p25M274J186p148j1568m980R29j200p00J660K709m626J228r6K699
9901A56287J3671j757K029O423K700k028n649o752o629m865K880k71q661j215
9887A46163j3656j0171l226N157R244J2134L1844M9672L9583R642k0153l6592
9875B19641l2685j4840q167j252O350k229r27k561n217l289p545j554k738p068
9861A35919o327n002l604m614p88P142J1917N106q35m333k577Q399M857N307Q285
9846A58852P580O543J713p387j6580j2388n414M900N164J2764K1571J9979O051
9833B03348j9241j8260k3416k2988N049j26M767k299r599p162K764K862L352n480
9819A13571k779Q517J1649K1303J9537k163j1714j1101j4338j8398j4335n13l033
$$ y = [171960, 172645, 171920, 176194, 177380, 170232, 158664, 153684, 154613, 153413, 152713, 154373, 157082, 152456, 153684, 153588, 156287, 169958, 168201, 170230, 176653, 179353, 177325, 171676, 164924, 158295, 153430, 156310, 156039, 147378, 146163, 132507, 122336, 119110, 124267, 133511, 145645, 177489, 227161, 266744, 276386, 256233, 219641, 186956, 172116, 163949, 162697, 169047, 166818, 165891, 163330, 158113, 154824, 147279, 145725, 142987, 135919, 129592, 124590, 120986, 116372, 115584, 122726, 134643, 139749, 138914, 134581, 132004, 140403, 145260, 150567, 158852, 166432, 172975, 174688, 167301, 150721, 138333, 132919, 137819, 142983, 155747, 177318, 197297, 203348, 184107, 165847, 142431, 119443, 124492, 124366, 129133, 126834, 117235, 110073, 112837, 115699, 119051, 113571, 110792, 119309, 130958, 152261, 171798, 169635, 157921, 146820, 132482, 114084, 99749, 99236, 96203]
9806I6203R763J1361L019O03J446P92r16n114k089k914l382k846k722m524l018
9791I5662K277J981K632r52K059P119P25P524M764j116J92K246K044J220M240
9776A32617O049k87j848o863l586J0486M629Q762L756k251m735M420J0975Q589
9762A70713j737N520M265m674l155M090O146J0295Q342J2529J1353J2349J7574
9749B53610J9267K4444K2307K6212L1543M2960N0355N0566N9874P1672Q4298J13177
9737H50285J53301K01364K84639M01062N73219P85494R79562J032972Q68195N42981
9727F673074J27476l43693p61183r67601r24058p50131n63904m14988l06403k17326
9717A551263j53744j01907o4888n1967l1448k7166j9783l166J0544L0815O1463
$$ y = [96203, 105966, 117327, 120346, 120949, 122395, 123187, 122271, 117157, 115068, 112154, 108772, 105926, 103204, 98680, 95662, 97939, 99920, 102552, 101600, 103659, 110778, 111503, 119027, 123791, 122675, 122867, 125113, 127157, 128377, 132617, 138666, 138379, 136531, 129668, 126082, 136568, 141197, 149959, 153715, 151464, 146729, 151149, 162124, 170713, 168976, 174496, 178761, 174087, 170932, 175022, 181168, 191463, 199805, 212334, 223687, 236036, 253610, 272877, 297321, 319628, 345840, 377383, 420343, 470698, 521264, 581138, 652810, 737108, 850285, 1003586, 1204950, 1489589, 1890651, 2463870, 3249364, 4228926, 5261898, 6130093, 6673074, 6800550, 6456857, 5695674, 4728073, 3804015, 3053884, 2489980, 2074992, 1768589, 1551263, 1397519, 1295612, 1230724, 1178757, 1147309, 1120143, 1100360, 1097194, 1107738, 1138553, 1200016]
9706A200016R8252J31043J68507K38188L27372M33620N16317N24243M58291L68047
9696D463896L39794L92926N20671P87137J254096J918440K598937K821735K180763
9687A7278395R30811m13045j428235j788501j488908q58222l30015j61212l19039
9678A1422029n94411q59182j107740j252507j200731r98207p49089n31722l40425
9669C788015j80709m2202J6986l4773j23948j52929q6769N0668K11029M02799
9659C848167N05997L71818P7068j21685q7327J13103M07325P90071J286403J883290
9649I074230K351846K169134J231650J48836n11256n54796p0520P30694J483818
9640A6053636J781599J515738R44375L69521l02612j249739k124114k537847k461273
$$ y = [1200016, 1298268, 1429311, 1597818, 1836006, 2163378, 2596998, 3113315, 3637558, 4095849, 4463896, 4803690, 5196616, 5717287, 6504424, 7758520, 9676960, 12275897, 15097632, 17278395, 18209206, 17796161, 16367926, 14579425, 13090517, 12232295, 11902280, 11741068, 11422029, 10827618, 9968436, 8860696, 7608189, 6407458, 5409251, 4660162, 4128440, 3788015, 3607306, 3565104, 3582090, 3547317, 3423369, 3270440, 3183671, 3234339, 3445368, 3848167, 4354164, 4725982, 4803050, 4681365, 4594038, 4707141, 5114466, 5904537, 7190940, 9074230, 11426076, 13595210, 14826860, 14975696, 14464440, 13909644, 13839124, 14569818, 16053636, 17835235, 19350973, 20295348, 20664869, 20362257, 19112518, 16988404, 14450557, 11989284]
9631A1989284k096209j642900j172009p26350l52285j83089k85637m94273o01331
9622D435201n23983l57447j89504n2204J9176j9056j10096j72408j47695m5221
9612B836763P7278K11407L71722N23291N74879M51764J95245K2299O9911L13007
9602E647566O59367J016452J302135J512582J660449J758981J686350J197688
9594A6441570K79603p38136j615085k186861k295246k010105j548248j087491
9586E240001p20140m94178m21811m40773m29408l80491l02651k35376j85908j52738
9576A476527j36756j14688r6212p6707n7703l6991q875N655k400n077P129J8485
9564I72387L5275O6768Q3504J23007J86879K68704L94446N45349O79607P29460
$$ y = [11989284, 9893075, 8250175, 7078166, 6351816, 5999531, 5816442, 5530805, 5036532, 4435201, 3911218, 3553771, 3364267, 3312063, 3331239, 3312183, 3202087, 3029679, 2881984, 2836763, 2914041, 3125448, 3497170, 4020461, 4595340, 5047104, 5242349, 5264648, 5334559, 5647566, 6306933, 7323385, 8625520, 10138102, 11798551, 13557532, 15243882, 16441570, 16721173, 15983037, 14367952, 12181091, 9885845, 7875740, 6327492, 5240001, 4519861, 4025683, 3603872, 3163099, 2733691, 2353200, 2050549, 1815173, 1629265, 1476527, 1339771, 1225083, 1128871, 1052164, 994461, 957470, 948595, 954250, 951850, 946773, 953902, 972387, 1007662, 1074430, 1157934, 1280941, 1467820, 1736524, 2130970, 2676319, 3355926, 4085386]
9554D085386O10688L70541Q1554k32828n41904p40943p44804o22981m74375l37399
9544A452935k47284j86049j43296j03818p7341o7577n7163m2207l3514l6807l5444
9533D22435l5780k0625r617p247O020K6121J9122P09k9641m1212k6544k8712k1403
9520B53626k2492j0629J344L445k319j0949q118k984o250j2707k824m490o029
9507A68624k36P938L791l877j0628p059q581q922o086J20j005l325p357j1648
9493A11749M471P055N913N104r53l037n985R183J2649P512j0535j5683p893o930
9479A12620p051K515K505J251j625o6k459o379k599p908n757l584O297m80n153
9464H2127p755p983l379j638l0L862N22K930o065j0313m964M263r90k088R586
$$ y = [4085386, 4696074, 5066615, 5148169, 4915341, 4373437, 3632494, 2887690, 2264709, 1790334, 1452935, 1205651, 1019602, 876306, 772488, 695147, 627570, 570407, 528200, 494686, 457879, 422435, 386655, 366030, 356413, 349166, 355186, 381307, 400429, 401138, 371497, 330285, 303741, 275029, 253626, 231134, 220505, 221849, 225294, 222975, 212026, 203908, 200924, 194674, 181967, 179143, 174653, 168624, 168388, 176326, 180117, 176240, 165612, 158553, 149972, 141050, 134964, 135084, 134079, 130754, 123397, 111749, 116220, 123275, 129188, 134292, 133339, 130302, 124317, 133500, 146149, 153661, 143126, 127443, 119550, 112620, 105569, 108084, 110589, 111840, 110215, 110149, 107690, 101311, 98712, 90804, 85047, 81463, 87760, 87280, 82127, 74372, 66389, 63010, 61372, 61342, 65204, 65726, 68656, 62591, 52278, 47314, 51577, 50587, 48499, 58085]
9449E8085O326K398L176M028P440J738j367j261k896p016r191o276O563O608k462
9434F5893j340R238N27l176j249p036l119o23p43K439N50j721k926o24l659m552
9418D7879L768o78l850J855J395k632L475l951r19J092N383L648n964m393j004
9403D5104M704J57o59k216l959j11k580L183o184m208R693Q262o278o009l596
9388C5303o98J101L873k208K949N119K614L589o96j1425p549j952n436j13L041
9373B7512K013M956P009O07k074K396N741J455o608n02L49m462j335l562l000
9358C0495J602M245R089K137n501m996N681L127m119l134p462P22j092M335P102
9343D2231K098o534m68l008l992J144K953q46j078l738N337J0827K396l699j872
$$ y = [58085, 64411, 66809, 69985, 74013, 81453, 83191, 81824, 80563, 77667, 70651, 61460, 55184, 61747, 68355, 65893, 64553, 73791, 74318, 71142, 69893, 62857, 59738, 59115, 58372, 60811, 61361, 59640, 56714, 56090, 52431, 47879, 51647, 50969, 47119, 48974, 50369, 47737, 51212, 47261, 46342, 47434, 52817, 56465, 50501, 46108, 45104, 49808, 49965, 49306, 47090, 43131, 43020, 40440, 43623, 37439, 33231, 42924, 51186, 44908, 38899, 35303, 34605, 35706, 39579, 37371, 40320, 45439, 48053, 51642, 50946, 39521, 31972, 30020, 24584, 24471, 27512, 29525, 34481, 41490, 42097, 40023, 42419, 48160, 49615, 43007, 42505, 42854, 38392, 37057, 33495, 30495, 32097, 36342, 45431, 47568, 42067, 37071, 42752, 45879, 41760, 38626, 31164, 31886, 30794, 35129, 42231, 44329, 37795, 37327, 34319, 30327, 31471, 34424, 33578, 32500, 28762, 34099, 44926, 47322, 43623, 41751]
9328D1751N627N962J0247J1924O538L973L45k52l035j2722j1213k266L69j0312
9314D6936l456k318O0R62J692K304P22P668M741m498j0761p604O124N216k460
9299D5328r979M763P485M364j57L143R733J779N58J3131Q239L083R164J9426K1977
9284A42037J7695L455o622j8542j2609p256l540j0248l962l865m276n047q526
9271G8694o804p017j240j173L239L738L600K230m409K963J1021K463P58j505O019
9256I2577N904O503J0401P149R076O458r975n871L255J144K633R920J1363K129
9242A52666n328j0222q806r04K521P910J0872N525q87o878p328J310o396q099
9228A25956p416o520p580R42l117n833L237j201K403Q13P457Q622J4755J8622
$$ y = [41751, 47378, 53340, 63587, 75511, 82049, 86022, 86367, 86115, 83080, 70358, 59145, 56879, 57248, 46936, 43480, 41162, 41222, 42184, 43876, 46180, 46902, 54570, 59311, 54813, 44052, 36448, 42572, 47788, 45328, 35349, 40112, 47597, 51961, 51804, 54947, 64680, 66459, 67017, 80148, 88387, 91470, 100634, 120060, 142037, 159732, 163187, 156565, 138023, 125414, 118158, 114618, 104370, 100408, 96543, 92267, 87220, 78694, 71890, 64873, 63633, 62460, 65699, 69437, 73037, 75267, 70858, 73821, 84842, 87305, 88063, 86558, 92577, 98481, 104984, 115385, 122534, 131610, 138068, 128093, 122222, 125477, 126621, 129254, 139174, 150537, 152666, 147338, 137116, 128310, 127406, 129927, 137837, 148709, 154234, 153347, 146469, 139141, 140451, 134055, 125956, 118540, 112020, 104440, 105382, 102265, 96432, 99669, 98468, 100871, 101684, 109141, 117763, 132518, 151140]
9214A51140N795l946j2686j0615j3681j8440j4829j3660j0135o602P458R585O460
9201G5844P99J853J751N176O476O344R373N440P887Q59M256r55L711j2372k2807
9186I3635j8620o908J997m046j194M87K454P525M654l369q631j1302k752q298
9172D5632r642P05j490p371K62k059o52Q355m005m623N566J677N958m445K928
9157C6796J843n156m585K459J0300P156N459P351M244l01q548o421k331l860j1972
9142C2434n22J1185m547o977p077J644o17Q86k421l011o739l694j813k97N810
9127A4244O202K834k497K352l657L622K194j517m24l385k313K220L322j779j610
9112A9808n03r60K210k9R25J973L375K493j965J013L566L823j3972q068J042j840
$$ y = [151140, 156935, 152989, 140303, 129688, 116007, 97567, 82738, 69078, 58943, 52341, 59799, 69384, 75844, 76643, 78496, 80247, 85423, 91899, 98243, 107616, 113056, 120943, 121802, 126058, 125103, 128814, 116442, 93635, 75015, 68107, 70104, 66058, 64864, 65351, 67805, 75330, 79984, 76615, 67984, 56682, 53930, 45632, 35990, 36695, 35205, 27834, 28096, 26037, 25385, 33740, 29735, 25112, 30678, 32355, 38313, 33868, 36796, 38639, 33483, 28898, 31357, 41657, 48813, 54272, 61623, 65867, 65566, 57018, 50597, 48266, 44406, 32434, 31912, 43097, 38550, 31573, 24496, 26140, 25523, 26409, 23988, 20977, 14238, 10544, 8731, 8434, 14244, 20446, 23280, 20783, 23135, 19478, 23100, 25294, 23777, 23353, 19968, 17655, 19875, 23197, 21418, 19808, 19305, 18345, 20555, 20526, 21451, 23424, 26799, 29292, 27327, 28340, 31906, 35729, 21757, 13689, 14731, 12891]
9096A2891m642L567L618K258O490J734n86p699m913R6M718N018k150j121j360
9081A7919P349j587q380K441J829n627L971L163K589N771k710n508n799l652K96
9066A2065j521j700O56N939M076l510j158J884k447m783o29N415o22N07r20L198
9050A6450M987P41j15j723M514J859K5p465k166k312J598M137Q978n03j4296n475
9034I234N018O307K407j059q905p620O67M972J211p59k671K842k701L698N479
9019A8120n435m753K149q375Q73N047P083K227j491M356J850l227m015M383j700
9004A7092M076K144l776k745J969L116p987p35R03o417j424L448N625O66l837
8989A2118N826N77l475l741m838N026N737Q84J62m842q262L178M0Q484J343p896
$$ y = [12891, 8249, 11816, 15434, 17692, 24182, 25916, 25330, 17631, 12718, 12814, 17532, 22550, 20400, 19279, 17919, 25268, 23681, 15301, 17742, 19571, 13944, 17915, 21078, 23667, 29438, 26728, 21220, 15421, 11769, 12065, 10544, 8844, 9500, 15439, 19515, 16005, 14847, 16731, 14284, 9501, 8872, 14287, 13665, 14172, 13252, 16450, 21437, 22178, 22063, 20340, 24854, 26713, 26738, 19273, 17107, 14795, 16393, 20530, 29508, 29005, 14709, 9234, 14252, 20559, 22966, 21907, 13002, 5382, 6049, 11021, 12232, 11473, 8802, 11644, 8943, 12641, 18120, 12685, 7932, 10081, 1706, 2579, 7626, 14709, 16936, 15445, 19801, 21651, 18424, 14409, 18792, 17092, 21168, 23312, 19536, 16791, 18760, 21876, 13889, 13154, 14057, 7640, 6216, 9664, 15289, 15955, 12118, 17944, 18521, 15046, 11305, 6467, 11493, 17230, 18114, 18276, 13434, 5172, 8350, 8390, 16874, 18217, 10321]
8973A0321j020M800L731k434p922l173P071L218K570k785j452M91k107k682L077
8958A1704K273M445J585L516M090n578k250J41Q847M750m084m456p772K790Q18
8943B0819m626j845k780M884M406k789j592m1l674j793N753M108j2523j198K464
8928I573M483K489K465n546p853l80J580L330L09K984P775L076j758L538j919
8913B4146k399M929r390j98n121j978M499P200L448L251N582L426o727p7P022
8898C7613P89lK23L318O907M770R168P364O298O078N491J1891J5574J3523R221
8883A38225J5506K3541K2844K0414K3286L0381M3668P0982J14494J97401L31598
8872A032340N78814R25652J131150N71208l98176r44580r00661o25039l92968
$$ y = [10321, 9301, 14101, 17832, 15398, 7476, 4303, 11374, 14592, 17162, 14377, 12925, 13416, 11309, 8627, 11704, 13977, 18422, 20007, 23523, 27613, 22035, 19785, 19926, 28773, 33523, 29439, 24983, 17211, 20001, 20819, 16193, 14348, 11568, 16452, 20858, 18069, 16477, 16436, 12762, 10969, 16722, 20830, 8307, 7109, 9573, 14056, 16545, 19010, 13464, 5611, 5231, 6811, 10141, 10450, 13434, 21209, 24285, 22527, 26065, 24146, 21747, 26676, 17286, 17088, 11967, 9989, 14488, 21688, 25136, 28387, 33969, 37395, 30668, 30591, 37613, 38402, 38399, 38622, 41940, 48847, 53617, 62785, 70149, 76447, 82525, 88016, 99907, 115481, 129004, 138225, 153731, 177272, 200116, 220530, 243816, 274197, 317865, 388847, 503341, 700742, 1032340, 1611154, 2536806, 3667956, 4239164, 3840988, 2896408, 1995747, 1370708, 977740]
8863I77740k49700j70265j11219p4083m7329l1962k4879k7513k2221l3279k8948
8852A56342j8592j6567r397j4259j4392j5204J287o100n671J716m895j1148J771
8839D4891l516l617m278P246q92L63o007n395N937J141L836m557m7M28k500M778
8823C7811M12o781j3198n723k463O942N872p55R94J587J238k10L216K115k760
8808B8297l451k927M554n195r498k709M890L695M065j190l403k880K314O407l66
8793B2603l217J609m740j154P337l193k546m607k938j438R95P379j368k380l897
8778H445O95M29j370J801J521k436M828N949K656k425M595j951K030j785o814
8763A6168q053M112M978k283J110p27n668J760m045N733K314R73L598l175l779
$$ y = [977740, 728040, 557775, 446556, 372473, 325144, 293182, 268303, 240790, 218569, 185290, 156342, 137750, 121183, 111786, 97527, 83135, 67931, 69218, 63118, 57447, 59163, 54268, 43120, 44891, 41375, 37758, 33480, 40726, 39834, 40197, 34190, 28795, 34732, 35873, 39709, 35152, 35105, 35533, 33033, 37811, 38223, 31442, 18244, 12521, 10058, 17000, 22872, 22117, 23111, 24698, 25936, 25726, 28942, 31057, 28297, 24846, 21919, 26473, 21278, 11780, 9071, 13961, 17656, 21721, 20531, 17128, 14248, 16562, 22969, 22603, 19386, 20995, 16255, 15101, 22438, 19245, 16699, 12092, 9154, 7716, 8711, 16090, 14722, 12342, 8445, 9140, 9569, 8199, 10000, 11521, 9085, 13913, 19862, 22518, 20093, 24688, 22737, 24767, 22982, 16168, 8115, 12227, 17205, 14922, 16032, 15305, 9637, 11397, 7352, 13085, 15399, 16372, 19970, 16795, 13016]
8748A3016k92k525L33q70M521j569m998l60p842J389N210K441J42j122J787M896
8732A4157O24k254n252p06k858L20N932O636L307m717k803k351K039R182L550
8717B4806j1301p360K789J570j257P728K377m63k543o513p590m445O618J026N442
8702A0884M061o079j072N142o536o606K927O30O349K440O403M802m796m825k093
8687A1631l343j085J712M062q37L29L750p8j179J7o562N288J681m540m120L484
8671A0210J419N78l086n327m892k523N925j669Q9P511k960l449P467L631J912
8656A4836L092j165j694k5O567n816q898l884O48M175Q933P037O791m461j054
8641B5082o813J125L8L855j174o583r19r79o713P23P318o485j30K908L528M608
$$ y = [13016, 12724, 10199, 10532, 9662, 14183, 12614, 7616, 7256, -586, 803, 6013, 8454, 8596, 7474, 9261, 14157, 14781, 12527, 7275, 6569, 3711, 4031, 9963, 16599, 19906, 15189, 12386, 10035, 12074, 21256, 24806, 13505, 6145, 8934, 10504, 9247, 16975, 19352, 18889, 16346, 9833, 2243, -2202, 4416, 5442, 10884, 14945, 8866, 7794, 12936, 6400, -206, 2721, 3351, 9700, 12140, 18543, 23345, 18549, 13724, 11631, 8288, 7203, 8915, 12977, 12140, 12469, 16219, 16141, 14962, 14979, 8417, 13705, 15386, 10846, 6726, 10210, 11629, 12207, 9121, 3794, -1098, -3621, 2304, 635, 724, 8235, 5275, 1826, 9293, 12924, 14836, 17928, 16763, 15069, 15044, 21611, 15795, 6897, 3013, 3661, 7836, 16769, 23806, 30597, 26136, 25082, 18269, 19394, 19432, 23287, 22113, 15530, 14611, 13632, 6919, 7642, 14960, 8475, 8345, 11253, 14781, 19389]
8625A9389Q18j24K291l106m48K28o451j531L262M874m297m712K983M545O918l254
8609B1385j484p56j449M36k990l12Q813N441Q822K991Q76J260j15N754Q971J5397
8593G3040J6961K0452R717k726n075l302n254j3288j3488j1593j5258j1898n903
8580C2385k997j857N444O006q092l623q825r705N713M568n9k037j647N009j172
8565A9111l162m083J943m877j122R40M130N357M848K880j485n108q561L253n87
8550A3477m202L603J2505N773M359n724o987k77k92J744N596k837m050j0386m557
8535G745r73m09N447L758J872l760l799n64M68M807L731l507K265p24j643N422
8519B0136n46j512P99m904j0719k339M838L373N31n54K16O106k192K231K263p134
$$ y = [19389, 20207, 20083, 22374, 19268, 18820, 19048, 12597, 11066, 14328, 19202, 14905, 10193, 13176, 17721, 24639, 21385, 19901, 19145, 17696, 18132, 15142, 14830, 23643, 29084, 37906, 40897, 41773, 43033, 42918, 48672, 57643, 73040, 90001, 110453, 120170, 117444, 112369, 109067, 103813, 90525, 77037, 65444, 50186, 38288, 32385, 29388, 27531, 32975, 38981, 30889, 27266, 18441, 8736, 14449, 19017, 18958, 16921, 15274, 20283, 19111, 15949, 11866, 13809, 8932, 7810, 8750, 12880, 18237, 23085, 25965, 24480, 19372, 10811, 14064, 13477, 9275, 12878, 25383, 31156, 35515, 29791, 22804, 22527, 22235, 23979, 29575, 26738, 22688, 12302, 7745, 6772, 6363, 11810, 15568, 17440, 13680, 9881, 9317, 9785, 14592, 18323, 14816, 17081, 16357, 14714, 20136, 19590, 18078, 18877, 13973, 3254, 915, 5753, 9126, 9657, 9103, 9319, 15425, 13233, 15464, 17727, 10593]
8503A0593n880J693L585N073O067m521o146m583l458K349r52M064k096j401m62
8488C925J655J4170m329j2243K94L629J0269O089k49m550j33p648O14P315P01
8473A9509o714J400J82K537J812J082P600Q532r756j7018q759j366P444O063L992
8458A6540m684p684r476l014K225K58P381R328m827p838l824J644j887J620p11
8443d949M53M63N661l698m876P786R368K913j452n163k098k135l119k563j566
8428d975P103M69K344q57Q071M961K162l472o758K757K479k715k175L372N454
8413A8220k677j1960j862L756j071M047K058L257k191N101L332l658q376K89K063
8398A0328k812l75n076k084j875j769R028N92n167r09J580O911N090l748k758
$$ y = [10593, 4713, 6406, 9991, 15064, 21131, 16610, 10464, 5881, 2423, 4772, 3820, 7884, 5788, 4387, 3925, 5580, 19750, 15421, 3178, 3472, 7101, 17370, 23459, 23210, 18660, 18527, 10879, 11493, 18808, 19509, 12795, 14195, 14377, 16914, 18726, 19808, 27408, 35940, 26184, 9166, 407, -959, 6485, 12548, 16540, 11856, 4172, -5304, -8318, -6093, -5835, 1546, 10874, 6047, -1791, -5615, -3971, -5858, -4238, -4949, -4496, -4033, 1628, -2070, -6946, 840, 10208, 13121, 11669, 6506, 4408, 2273, -846, -3409, -4975, 2128, 2597, 4941, 4084, 12155, 17116, 19278, 15806, 9048, 11805, 14284, 11569, 9394, 12766, 18220, 15543, 3583, 1721, 5477, 4406, 8453, 10511, 13768, 11577, 16678, 20010, 16352, 7976, 8265, 10328, 7516, 7141, 2065, -19, -1894, -3663, 5365, 5957, 790, -119, 1461, 8372, 13462, 9714, 6956]
8383F956l347j537Q45j497j326j371r052P488O503O745m04q489J364o31j282k352
8367a387O662R104k946m469q237l557J894L677M174J894Q97P398K342n984j156
8352A0306k3m040J569N965P014l299k736n468J512Q430N971j255r321m399n781
8337D445P55P139m005l289k616L432Q90j56j229L49J0867J787p723j5221m618
8322i193J0055M346k28j93M112K188J048L2P823J1807J831m288j0626r579j555
8307G580L178K808k999J310Q572j219r37J64m474r817r373J771M962J0005k586
8292H945O531J490k797l916o9M29L508m736K786k383k128p30p84m180m651k903
8276e588O809O730K954J42l285O125J011K640J1687L759M315l955j2204j0259
$$ y = [6956, 3609, 2072, 2917, 1420, 94, -1277, -10329, -2841, 3662, 10407, 10003, 1514, 2878, 2247, 965, -1387, 5275, 14379, 11433, 6964, -1273, -4830, -2936, 741, 4915, 6809, 7706, 15104, 17446, 11462, 10306, 10283, 6243, 7812, 13777, 20791, 17492, 14756, 9288, 10800, 19230, 25201, 23946, 14625, 10226, 4445, 5200, 12339, 8334, 5045, 2429, 5861, 6751, 6595, 5366, 5715, 16582, 18369, 10646, -4575, -9193, 862, 5208, 4980, 4787, 8899, 11087, 12135, 12167, 19990, 31797, 33628, 29340, 18714, 9135, 7580, 10758, 13566, 10567, 11877, 20449, 19230, 18293, 18457, 13983, 4166, -5207, -3436, 1526, 11531, 8945, 15476, 16966, 14169, 10253, 10184, 10613, 14121, 9385, 12171, 9788, 7660, 6930, 6146, 1966, -2685, -5588, 1221, 7951, 10905, 11047, 7762, 13887, 14898, 17538, 29225, 32984, 37299, 33344, 21140, 10881]
8262A0881j972o836r24P825M807N757Q0K890n609p175R77j305l30N405q68n377
8246H226p103p77M460K880j058o530k235O871L206P427J204m14o16m893p782J16
8230B982j82j142N959J367M218k040J808J855L665l430j0102l566Q862P565l013
8215A4806o500o207k710M089N368q5q294P47K922N03J085k249O334O463l083m417
8199H772J249l031k312l474j032N572K008n961K292P907N873l681K645j338O583
8184B2072j409p839j3312p815K136K952J4309M436q254K762q71O51L343p626j963
8169C572O57l318J166J073l782k321J749J466n15p9m786N786Q383m625j318K56
8153C364O311k343m855J043j524j408n648J382l324l452M252J869M400J1061N248
$$ y = [10881, 8909, 2073, 1149, 8974, 13781, 19538, 19618, 22508, 16899, 9724, 10701, 9396, 9066, 14471, 13603, 8226, 1123, 346, 4806, 7686, 6628, 98, -2137, 4734, 7940, 15367, 16571, 16157, 15541, 10648, 2866, 2982, 2800, 1658, 7617, 8984, 13202, 11162, 12970, 14825, 18490, 15060, 4958, 1392, 10254, 17819, 14806, 8306, 2099, -611, 3478, 8846, 8761, 467, 1214, 4136, 4639, 5724, 3475, 9809, 16272, 13189, 8772, 10021, 6990, 4678, 1204, 172, 5744, 7752, 1791, 4083, 11990, 17863, 14182, 16827, 15489, 22072, 20663, 12824, -488, -8303, -6167, -3215, 11094, 15530, 7276, 10038, 9167, 9818, 13161, 5535, 3572, 4229, 911, 2077, 3150, -632, -2953, -1204, 262, -253, -332, -5118, 668, 9051, 4426, 3108, 3364, 9675, 7332, 2477, 3520, 1996, 588, -5060, -3678, -7002, -10454, -6202, -4333, 67, 11128, 16376]
8138A6376l513j092l399r89l974K582J083k666l536j761K421L287J55L375P055
8123A5404L852k963r148o732P119P275P43j768M582l057q349M134j211J594K563
8108A4038O24m146j0666m971K530k904o4P173J539L881R71n941K103j0237k074
8093h144L44O71K82O009P649J670m387J054k503j0073j262N825M456k573J615
8078F33L067M729L484L115l858o455J762L41L81k839j440L755K333r75l198K37
8062E072j895J865K628K235k040N670J396l554j142k158j948N386K315k180K032
8047A3682l477o307L810J405L198R532l081l752K432o290n625K04P87N489J841
8032A3848m151k139N60M106L633k549o546O96J266L141Q535l67j106k926k444
$$ y = [16376, 12863, 11771, 8372, 7383, 3409, 5991, 7074, 4408, 872, -889, 1532, 4819, 4974, 8349, 15404, 19256, 16293, 7145, 413, 7532, 14807, 15550, 13782, 18364, 15307, 6958, 11092, 9881, 11475, 14038, 14662, 10516, -150, -5121, -2591, -5495, -5559, 1614, 3153, 7034, 8005, 2064, 4167, -6070, -8144, -7800, -7129, -6847, -838, 6811, 8481, 4094, 5148, 2645, -7428, -8690, -2865, 1591, -982, 633, 3700, 8429, 11913, 15028, 11170, 4715, 6477, 6818, 7199, 4360, 2920, 6675, 9008, 8033, 4835, 5072, 3177, 5042, 7670, 9905, 7865, 13535, 14931, 11377, 10235, 8077, 6129, 11515, 13830, 11650, 13682, 10205, 3898, 7708, 9113, 12311, 21843, 18762, 15010, 17442, 11152, 5527, 5731, 6518, 12007, 13848, 9697, 7558, 8118, 12224, 15857, 13308, 6762, 7458, 8724, 11865, 20400, 20033, 18927, 16001, 13557]
8017A3557k384L085L710J89k952o317O911P083j002N276n6j557n051n242k500
8002A2750k817K581R062J454N698j13K424j174k393Q61l454j4765j179o289L062
7987E708M814R9n688l517m271L545J2093M365q460N514K52j0390n867Q084J205
7972G486m052J351J791N192K165l778R033O450k20m307o610p82q092m156j549
7957g8K645k222L887N322O727J724o01m578K229O33K656l325m134N21m340j987
7941E079K116M374m654l949J242l76j37Q87N384L379M345k677n562R60j403N582
7925A4590O595o844l442q533l161k335P947R505M641L872j0538k823K302n172
7911F604k013Q58L7O817J132J870N758n654j0247l111P568J591k611l946P748
$$ y = [13557, 11173, 14258, 17968, 18157, 15205, 8888, 15799, 22882, 21880, 27156, 27100, 25543, 20492, 15250, 12750, 9933, 12514, 21576, 23030, 28728, 28615, 31039, 29865, 27472, 28333, 24879, 10114, 8935, 2646, 5708, 10522, 10621, 4933, 1416, -2855, 690, 12783, 17148, 8688, 14202, 14454, 4064, -1803, 6281, 7486, 3434, 4785, 6576, 11768, 13933, 10155, 19188, 25638, 25418, 21111, 14501, 13719, 5627, 1471, -78, 2567, 345, 4232, 9554, 16281, 18005, 17404, 12826, 15055, 15688, 18344, 15019, 10885, 11406, 7066, 5079, 7195, 11569, 6915, 2966, 4208, 3832, 3695, 4582, 9966, 13345, 17690, 15013, 9451, 10411, 9008, 14590, 21185, 14341, 10899, 2366, -795, -3130, 4817, 14322, 18963, 22835, 12297, 9474, 11776, 6604, 4591, 5449, 5486, 12303, 13435, 15305, 21063, 15409, 5162, 2051, 9619, 11210, 8599, 4653, 12401]
7896A2401M407n360j550K564O059K25J947j586q446l447L415j258l94k339P78
7881G416o66M706p379m238n281J413M698P239m122k888J454m45k250j953o97N299
7865B306j107j935K016N432k240p241N596M77j0368J779P225j341K043L776n486
7850I32j815K607O83n131j190R95j214m559M584Q688J483R1K508m614l18n317
7834a587m093P88q81j762O119L578j652k473l871m033K385Q729K58m644o842L83
7818i598M513J98n451R609N680O85p55l038o19K62p52N06p820K4M860k352j757
7801e805O234O30m812n345J0511L750L310O427J004m683L785k112k026J597l902
7786H563l824l009K448j298o470p51M115j16Q8j82O280K594l727j980j637N00
$$ y = [12401, 16808, 11448, 9898, 12462, 18521, 18746, 20693, 19107, 10661, 7214, 10629, 9371, 8977, 6638, 7416, 6750, 11456, 4077, -161, -5442, -4029, 669, 7908, 3786, 898, 2352, 1907, -343, -2296, -2993, 2306, 1199, -736, 1280, 6712, 4472, -2769, 2827, 3304, -7064, -5285, 1940, 599, 2642, 6418, 932, -883, 1724, 2407, -2724, -3914, -2919, -4133, -8692, -4108, 4580, 6063, 6154, 8662, 4048, 3730, -1587, -5680, -4892, -5773, -7535, -1416, 2162, 510, -1963, -5834, -9867, -7482, 1247, 1505, -3139, -9981, -9598, -5085, -4887, -10338, -729, 4951, 5636, 4881, 1843, 1224, 1486, 734, 1240, -6580, -6556, -1696, -4048, -5805, 429, 1059, -3753, -9098, 1413, 5163, 8473, 14900, 15904, 11221, 15006, 12894, 10868, 12465, 8563, 4739, 1730, 4178, 2880, -3590, -4341, -226, -342, -254, -436, 5844, 8438, 4711, 2731, 1094, 1594]
7770A594k191k967K098m001L094N625l922K624l144j502J457o671Q79K349O80
7755c998j093L157O975j969J862n725r54K064R21N054N558l919m555m707j878
7740c207L218K234l861P97n032k721k420M377N39J65o61j413L943m357j429L566
7724f262M167L973M087Q59N918M94k22m063l644k787l911k213M875L202J41j271
7708C343M9O78K424M60o952j0715K702J057k763N87Q38l65Q784N227k078M936
7692H212K599m725k305p206J588N873j479O231j611K12L550p440p32j991m002
7677c226J934Q039L280L903r86l571j530K612N914j226m083L302k473q496j923
7662A470L275K922k175N8m82o352k737K817l534P78P914J693j1107m684Q733l132
$$ y = [1594, -597, -3564, -1466, -5467, -2373, 3252, -670, 1954, -1190, -2692, -1235, -7906, -7027, -4678, -3998, -5091, -1934, 5041, 3072, 4934, -791, -1745, 319, 1240, 6294, 11852, 7933, 3378, -1329, -3207, 11, 2245, -1616, -819, -5851, -8572, -10992, -6615, -6076, -5911, -6572, -7985, -4042, -8399, -9828, -6262, -2095, 1878, 5965, 6824, 12742, 13236, 13014, 8951, 5307, 2520, -1391, -3604, 1271, 4473, 4614, 3343, 3392, 4070, 6494, 6954, 2, -10713, -8011, -6954, -9717, -9130, -8292, -8657, 127, 5354, 3276, 8212, 10811, 6086, 3781, -3425, -1837, 4036, 2557, 8788, 7177, 7389, 10939, 3499, 2767, 776, -3226, -1292, 6747, 10027, 13930, 12944, 9373, 7843, 10455, 16369, 15143, 11060, 14362, 11889, 3393, 1470, 4745, 7667, 5492, 5550, 5068, -1284, -4021, -1204, -4738, -3960, 3954, 5647, -5460, -10144, -1411, -4543]
7646d543J923L282j021j979M311N063K204j929k68m265M49N23k444p45P139L235
7630A0935O74k162L542l224q10j562j236m247j709O77K209r908J151Q978m878
7615a570L010o26l962q992Q82P414L99J995J490j283m747O908o135j344P947K251
7599C637L847J979j229l57L270M021k241o411m940n39J100O298J704j850J138
7584I427n994J62l597L774N991k57q881j0413K033K191j011m99M647P940M444
7569I957J757n000k085M524M492o768q262q39M598k618n158r37M030L45M561K350
7553D947o133K415o21K070l246j0855o109N364O384N843l125m036r36L867k655
7538f826K329K938J942o549l850K092J2279L740l670n106k150K309n895J83L519
$$ y = [-4543, -2620, 662, -359, -2338, 1973, 7036, 9240, 7311, 7043, 2778, 3227, 3750, 1306, 561, 7700, 10935, 11609, 9447, 12989, 9765, 8955, 7393, 6157, 1910, 201, 878, 3087, -6821, -5670, 3308, -1570, 1440, 814, -3148, -12140, -11258, -3844, -3445, -1450, 40, -1243, -5990, 918, -5217, -6561, 1386, 3637, 7484, 9463, 8234, 7877, 11147, 15168, 12927, 6516, 1576, 1037, 2137, 8435, 10139, 8289, 9427, 3433, 3595, -2, 3772, 9763, 9506, 625, -9788, -7755, -5564, -6575, -7074, -2427, 5513, 9957, 11714, 6714, 4629, 9153, 13645, 6877, -1385, -2224, 2374, -244, -5402, -6339, -2309, -1964, 2597, 4947, -1186, 1229, 608, 2678, -568, -11423, -17532, -12168, -5784, 59, -3066, -7102, -8038, -4171, -6826, -4497, -1559, 383, -6166, -10016, -7924, 4355, 8095, 4425, -681, -2831, -522, -6417, -6234, -2715]
7523b715J916L209m222l211P356L146K92J790k296l012l943p7k840L645j536j086
7507c584j144Q25J600j66j0258k579K880L336R361M400k912K00N477N2j270p360
7491a142K549J856j534o477L401K688m027m457K653K541m707l762L063m4K65M318
7475b816M539l295K518n585p638M40N423J2126N29m255j372j11n105M939K239
7460B576q478m009N501Q23q290k304m49L175R278J012l435K373o55m925n466K269
7444a1004L992l689j91K865P911N964j208n12n017l264N969Q687n899n116r38
7429a450m39j9J860o85M202K330j468J559O852r368p413j956l033R16Q28l842
7413a1126J164l23l861J068P294K613j536R94K565M034M548n87P74J485L292r100
$$ y = [-2715, -799, 2410, -1812, -5023, 2333, 5479, 5771, 7561, 5265, 2253, -1690, -1767, -4607, -962, -2498, -3584, -4728, -3903, -2303, -2469, -12727, -15306, -12426, -9090, 271, 4671, 1759, 1959, 7436, 7488, 6218, -1142, 1407, 3263, 1729, -4748, -1347, 1341, -2686, -7143, -4490, -1949, -6656, -10418, -7355, -7399, -7134, -2816, 1723, -1572, 946, -4639, -12277, -11837, -6414, 5712, 6241, 1986, 614, 503, -4602, 337, 2576, -5902, -9911, -4410, -3587, -11877, -14181, -14630, -11455, -2177, -1165, -4600, -2227, -2882, -7807, -13273, -11004, -7012, -10701, -10892, -8027, -116, 5848, 4640, 4128, -889, -4153, 1816, 10503, 4604, -512, -1450, -1889, -1908, -48, -733, 3469, 5799, 4331, 5890, 12742, 3374, -4039, -5995, -9028, -8112, -7284, -11126, -9962, -10285, -14146, -13078, -5784, -3171, -4707, -3713, -1148, 2886, 7434, 6847, 7621, 9106, 12398, 3298]
7397C298n020L688J174k35k213M176k218n012o289l779K045O123l477k525M298
7382e966k72n373n518L366J0339Q960J904N32K398q515k874R573K16j3505o01
7367e336P473M501n835J936J0542p116k630m331n771J060N727Q172M407m023m456
7352D320n834K152N835K330m697k534m476j363J523J3917K068r490n502N004L796
7337G049j615n894o156q37o533l322l037k79L660J0459M209l612k974O373P533
7322E024R69K355J673m149l199k416r387N075J1734j473o51k088j046n326K820
7307h5O235o301n570N297L49m235k678k079N451M3j624m235M778N514K826L68
7291D054m881k372L070N821j096l909N990k824l823j158O071k969o477Q343J466
$$ y = [3298, -1722, 1966, 3140, 2905, 692, 4868, 2650, -2362, -8651, -12430, -10385, -4262, -7739, -10264, -5966, -6238, -11611, -17129, -13763, -3424, 5536, 7440, 7972, 10370, 1855, -1019, 8554, 8770, -4735, -5336, 2137, 6638, 803, 2739, 13281, 6165, 3535, -796, -6567, -5507, 220, 8392, 12799, 8776, 4320, -1514, 638, 6473, 8803, 4106, 1572, -2904, -4267, -2744, 11173, 13241, 3751, -1751, 3253, 7049, 5434, -460, -6616, -7453, -13986, -17308, -20345, -20624, -16964, -6505, -2296, -5908, -8882, -2509, 5024, 5993, 8348, 10021, 5872, 2673, 257, -9130, -4055, 7679, 6206, 5555, 3467, 2421, -2905, -85, 6150, -151, -5721, -424, -75, -4310, -6988, -9067, -3616, -3573, -5197, -9432, -4654, 860, 3686, 4054, -827, -3199, -129, 5692, 4596, 687, 6677, 3853, 30, -1128, 4943, 1974, -4503, 3840, 5306]
7276E306j5442p20L782P866L134n677k054O997k909K124L185q44n471l721J230
7261c214j15k445n466l205Q146M871L713N291L83l940L187M470O26o20K840O71
7245A5193r841M928K669l446n242l072q98N081k60J56p721m060O97J35j211J967
7229d925o392J825R657Q369l191k63K831l389j0924N499q58n895Q72N276l496
7214e004K162J109K672n33n185o677K792L174M672J1701N014p151m327l00j661
7199B458n588o580l065q58N833J573p18J374L23l219N830j980M082k324k054M318
7183e95J611m362k459l152p26L092n40J77P480R085l949l955n824K481l202K685
7167b153M026j882q015K105O39Q17K893J050o600p646P133N11K115N834J062l935
$$ y = [5306, -10136, -10856, -7074, 792, 3926, -1751, -3805, 3192, 283, 2407, 5592, 4748, -723, -4444, -3214, -3329, -5774, -11240, -14445, -6299, -1428, 2285, 7576, 7959, 4019, 7206, 11676, 12302, 11682, 14522, 15193, 5352, 10280, 12949, 9503, 4261, 1189, 291, 5372, 5112, 5268, -2453, -6513, -5816, -5681, -6892, -4925, -11317, -9492, 165, 8534, 5343, 5080, 7911, 4522, -6402, -903, -1761, -7656, -6784, -1508, -5004, -2842, -1733, 939, 406, -4779, -11456, -8664, -5490, -818, 10883, 15897, 8746, 4419, 4119, 2458, -3130, -9710, -12775, -13633, -7800, -6227, -6945, -5571, -5248, -8467, -2637, -4617, -535, -2859, -4913, -595, 1016, -3346, -5805, -8957, -9683, -6591, -7131, -6954, 526, 9611, 5662, 1707, -4117, -1636, -4838, -2153, 1873, -9, -8024, -5919, -5280, -4463, -1570, -520, -7120, -14766, -7633, -7122, -5007, 827, 1889, -2046]
7151b046j815n63N15K913J553k486j704l530m886Q527K434J522N98l123n24K600
7135a5K449N705k698j1657q179L082O744j111j544K016m178n021J477O489m114
7120a0555M63M700N168l037k704M471j487O118M160p292J78J121J007Q519L876
7105A4706P303j1875m457o9J182j938l617M960Q46l766k090k637L321j484L435
7090C820K512l448o184k576K890K385L927M344N292n400p229q001k55M371Q349
7075D797J066J391o366o481J017j45P69J54L042m155k162R575J188mq81Q890N313
7058A7008p525o978p922K569J412M467m242n729p94P765J394l311p219j790P167
7043c728J404n94N504L13m704K40J0347L709o115q783k689l060L701K290p089
$$ y = [-2046, -3861, -4424, -3909, -996, 557, -1929, -3633, -7163, -12049, -3522, -1088, 434, 1032, -2091, -2615, -15, 2434, 8139, 5441, -6216, -14395, -11313, -4569, -5680, -7224, -5208, -9386, -14407, -12930, -6441, -10555, -10092, -5392, -224, -3261, -5965, -1494, -2981, 3137, 7297, 5, 183, 1304, 2311, 10830, 14706, 22009, 10134, 5677, 5608, 6790, 4852, 1235, 6195, 7041, 3275, 1185, -1452, 1869, 385, 3820, 6332, 2884, -3300, -5876, -2986, -601, 3326, 7670, 12962, 7562, 333, -7668, -7923, -3552, 4797, 5863, 7254, 888, -5593, -4576, -4721, -3952, -3798, -756, -4911, -7073, 2502, 3690, 3686, 2805, 11695, 17008, 9483, 2505, -5417, -2848, -1436, 3031, -1211, -6940, -7734, 31, 1425, -1886, -9105, -10895, -3728, -2324, -2918, 2586, 2899, -1805, -1565, 8782, 12491, 6376, -2407, -5096, -8156, -4455, -2165, -9254]
7028i254N31P861J577M81l70l299n057l488J64P525O204O86O895l717k728N303
7012I314N260l830r383j01P57j477o103n520k196j053M425M605L792j3245j2458
6997b7213R52L37R823M098K348K776l21r701M227J1760M553L383J551l287o010
6982g24M77K535L023r29L246o85q101K125k076n73Q284L779k465N96J3m07l075
6965E043m551j339P206p16l467q991l976K277K711J009N946k719j2111j222J5302
6950D02Q880j964n694J228L91K326j265L481j270L188l372p388O76Q142J636J124
6934A0521M78k304j777l51m535j191k926L282P80n095J030L351m431j092L088
6919a172K119l985j751k419K566N407J484M066o7p316q445n834R12P511P544N064
$$ y = [-9254, -8723, -862, 715, 1196, 826, -2473, -7530, -11018, -10854, -3329, 2875, 3561, 10456, 6739, 4011, 9314, 14574, 10744, 1361, 1260, 2017, 540, -5563, -11083, -13279, -14332, -9907, -5302, -1510, -14755, -27213, -26261, -25924, -16101, -12003, -9655, -6879, -7200, -16901, -12674, -914, 3639, 7022, 8573, 5286, -724, -247, 2288, 5311, 4382, 7628, 6943, -1158, 967, -1109, -1682, 6602, 10381, 7916, 8512, 8525, 8118, 5043, 492, -847, 6359, 5643, 2176, -6815, -10791, -8514, -5803, -4794, 1152, -1567, -13678, -14900, 402, 9282, 7318, 1624, 2852, 3243, 5569, 4304, 7785, 6515, 9703, 6331, -1057, -381, 7761, 9397, 10521, 10999, 8695, 6918, 6567, 2032, 841, -2085, 1197, 1977, -3118, -2088, 1263, -3168, -4260, -1172, 947, -3038, -4789, -7208, -4642, 765, 2249, 6315, 6248, -1068, -9513, -15347, -14435, -6924, 620, 5684]
6903E684N153n421l561m681j459L454Q42P222L02p28J367K325K045L013o244q397
6887I16m115M77l128M798L845N694j5j743r93k509k472O173M819N372K6j006l463
6870A2676j918O236o168r098l823j851M832K81o255N112K516J55RK656m804k611
6854b055N27l609N514J374J700K232Q88m282l49l538m563O28L173J935N234J942
6838F751j970m308j424L874L465K612j348q77j767r357j1250K404J221K589P772
6823a613R842J237p634k527r47j518j474j969L376J853l891j099J924O288O642
6808H490o654m959k593m271L191M006K256O011K268m005l250l115m839K067P211
6793A814p791l443J481L259O11r66K844L148Q52Q04l027p78L817l805J014K188
$$ y = [5684, 10837, 5416, 1855, -2826, -4285, -831, 11, 7233, 7535, 6807, 8174, 10499, 12544, 15557, 9313, 916, -3199, -2722, -5850, -1052, 2793, 8487, 8472, 6729, 5736, 3227, 755, 6928, 11747, 17119, 17145, 16139, 12676, 10758, 16994, 10826, 1728, -2095, -3946, 886, 1167, -5088, 24, 2540, 2695, 2704, 5360, 556, -2055, -1528, -5137, 377, 1751, 3451, 5683, 6571, 2289, 1940, -1598, -6161, -5533, -2360, -425, 4809, 6751, 4781, 473, -951, 2923, 6388, 9000, 7652, 6775, 5008, -4349, -15599, -13195, -11974, -9385, -1613, 8229, 9466, 1832, -695, -1642, -3160, -4634, -6603, -3227, -1374, -5265, -6364, -4440, 1848, 8490, 1836, -3123, -5716, -9987, -6796, -2790, -534, 5477, 7745, 3740, 490, -2625, -7464, -5397, 1814, -5977, -9420, -7939, -4680, -4069, -5035, -2191, 957, 1809, 2613, -414, -1192, 2625, -1180, -166, 2022]
6777B022p30K220p007l840K43J723o894N061N977q66k860k624J188N154K522K261
6761C550l24o517q385L035P337n704q8L122p404j00M917j671K742N9l586k534
6745a1551K057P647J980l784n577J361R867P275m635k363l32L562p838j150O221
6730B740k468J372N750M650j957m664q092p75L268O38j138J0205J0325O924Q38
6715B7616n101o060q544o858l106k586J363J367O891K894m493n484k966k599J773
6700e893o68O75j593P921M931K033K116j072o676p989q267M734N079O110N428
6685F869k31o660k456J81k342j433k980K823R716M4j151j171j666k005q404K770
6669h096M88o0K976P124k229p443l244J0840O744l176q79l303m264K23J722O568
$$ y = [2022, 1292, 3512, -3495, -7335, -7092, -5369, -12263, -7202, -1225, -2091, -4951, -7575, -6387, -1233, 1289, 3550, 3226, -3291, -11676, -8641, -1304, -7008, -7096, -3974, -11378, -11478, -6561, -8232, -5490, -5431, -9017, -11551, -9494, -1847, 133, -3651, -9228, -7867, 2000, 9275, 4640, 2277, 1945, 5507, -2331, -3481, 2740, 272, 1644, 7394, 12044, 10087, 5423, -2669, -3444, -176, 462, -676, 9529, 19854, 26778, 27616, 22515, 16455, 7911, 1053, -2053, -4639, -3276, -1909, 4982, 7876, 3383, -2101, -5067, -7666, -5893, -6561, -5886, -7479, 442, 5373, 7406, 9522, 8450, 1774, -6215, -14482, -9748, -4669, 1441, 6869, 6638, -22, -2478, -2297, -4639, -6072, -9052, -6229, 3487, 3531, 2380, 1209, -457, -2462, -10866, -8096, -7608, -7668, -4692, 2432, 203, -7240, -10484, 356, 7100, 3924, 3045, -258, -4522, -4299, -2577, 3991]
6653C991K9q27o18l620n630l299k943o54L569L528o595l034O021J1631M422k04
6637E767k677k675l794K313Q66j506N414M06M090r535m556j785M212l521k575
6622i556R41K697Q18o445k605J554L765K724Q73j362L828J4136k55k898m06n174
6606B635l026j353k065j807l31O397L640P63j0521j532J251L558n225o479R530
6591d565O172l66J890o24j453l97k660M998N529K217L190n407j1080p516J764
6576h308k133J171J0159Q723Q12m904l858J315m114r33j151N122n42k479r791
6561a0911M263K601q653K467J773J413L938k032K401M012P39J200k770m083n41
6546d183J969Q97k77N510K269j789l841P491N142o877o172K871j712j649K770
$$ y = [3991, 4020, 3193, 2575, -1045, -6675, -9974, -12917, -13571, -10002, -6474, -13069, -16103, -10082, 1549, 5971, 5767, 3090, 415, -3379, -1066, -200, -1706, 3708, 4114, 8204, -1331, -5887, -7672, -3460, -6981, -9556, -8615, -5918, -5100, -11545, -14150, -12596, -8831, -6107, -5234, -6596, -2768, 11368, 11113, 8215, 7809, 2635, -391, -1744, -3809, -5616, -5947, 450, 4090, 4853, -5668, -7200, -5949, -2391, -7616, -14095, -4565, 1607, 1241, 3131, 2507, 1054, 657, -2003, 2995, 8524, 10741, 13931, 8524, -2556, -10072, -8308, -10441, -9270, 889, 9612, 10424, 5520, 1662, 2977, -1137, -2070, -3221, 1901, 1359, -1120, -10911, -6648, -4047, -12700, -10233, -8460, -7047, -3109, -5141, -2740, 1272, 2011, 3211, 441, -3642, -4183, -2214, -1317, -1594, 3916, 6185, 4396, 555, 8046, 13188, 6311, 139, 3010, 1298, -351, 2419]
6531B419M62p087r938K329L979J508j430P319N892l784j0113P36R784k412r167
6516i503J209J0530N544P332L133O01k025p575m637j777l279K775o815n47P227
6501B193Q580p331n862Q90J694k948M363k566J236j456p649l031O464R629J150
6486E356j904j303o977o933m27j235O203L265L751l845r078L430m32K931Q242
6471A044k445p616j777N359R249N165k21k809l789K665k476m479L313O88k206
6456c35Q382K565m438k722j545J103O96m416K081N004l286q95k02j1012p259K705
6440a3574L258O286Q263q009n087N284l686M349j731r318K938P611J174K670k140
6425a712l953k301r37K714N699L009l991lk291r487k584J322Q33M796r7K69j85
$$ y = [2419, 2881, -4206, -14144, -11815, -7836, -6328, -7758, -439, 5453, 1669, -8444, -7708, 2076, -336, -9503, -8294, 2236, 7780, 15112, 18245, 18846, 16821, 9246, 4609, 2832, -447, 2328, -4487, -5034, 2193, 10773, 3442, -2420, -1530, 164, -2784, 1579, -987, 249, -1207, -8856, -11887, -5423, 4206, 5356, 3452, 2149, -4828, -11761, -12188, -13423, -7220, -3955, -204, -4049, -13127, -9697, -10129, -7198, 1044, -1401, -9017, -10794, -5435, 3814, 8979, 8758, 5949, 2160, 4825, 2349, -2130, 1183, 1871, -335, 8047, 10612, 6174, 3452, 1907, 3010, 3706, -710, 1371, 6375, 3089, 2194, 1992, -9020, -16279, -13574, -10316, -4030, 4233, -3776, -8863, -3579, -7265, -2916, -4647, -13965, -11027, -3416, -2242, 428, -1712, -5665, -7966, -8903, -6189, -490, 2519, -1472, -1475, -3766, -13253, -15837, -14515, -13682, -8886, -8983, -8714, -8899]
6408h899O723K480p26j534m831l901Q083J339L170j491l136m119K388J442p441
6393a0453k468O419K352J670R72N895m573m437k889j361L901j02J713O462P823
6378A0924J417l694p507k35O45k280N451j948m806n585j329N868l68L641j754
6363a560P58P125L379l079l19J535j323n344n470p634l07M084O341N539L581q413
6347a107r795j07J424J183n989J438j503M250O32j500R032j835m220M58J330M104
6331b205j020r53J300L71j29k037m177L892j526m162J1173j685l892K673N362
6316B985J619N972k59m531n455n34r943k472J655j448k107P836O581j48n767K223
6300c793J685J132K117Nj49j078j694M967k196r51P105O663q615J524J919j409
$$ y = [-8899, -2176, 304, -422, -1956, -6787, -10688, -2605, -1266, 1904, 413, -2723, -6842, -4454, -3012, -10453, -12921, -6502, -4150, -2480, -1508, 4387, -186, -4623, -7512, -8873, -4972, -5074, -3361, 3101, 10924, 12341, 8647, 1140, 905, 1550, -730, 4721, 2773, -2033, -7618, -8947, -3079, -3447, 194, -1560, -802, 6323, 9702, 6623, 6304, 7839, 6516, 1172, -4298, -11932, -12239, -8155, -1814, 3725, 7306, -1107, -10902, -11009, -9585, -8402, -14391, -12953, -14456, -10206, -9574, -11074, -2042, -3877, -8097, -7639, -6309, -2205, -3225, -4178, -2878, -2507, -2636, -4673, -8850, -4958, -6484, -10646, 527, -1158, -5050, -2377, 2985, 4604, 10576, 10317, 5786, 331, -203, -10146, -12618, -10963, -12411, -14518, -6682, -101, -249, -6016, -3793, -2108, -976, 1141, 1146, 997, -81, -1775, 3192, 996, 45, 7150, 13813, 5198, 6722, 8641, 7232]
6284G232O30n91p43n154l442K97r45k156q825O1N759L934N71P482R740K299j301
6267A4848r124p575N92J386N885r340k590O110N847J743m388k289l392j122L003
6252d06M50p450l831J364M836J830J455L048o040M732O958j533o065m061j405
6237f118l104j100L572L287j244n945M474L045K468m087k361J257K015J659L30
6222a852M305n07k992j60J550m802L084N78k030o46J786L619J038k856l336j103
6206d324l284J438J689J566n658l181J1441p793m468M490M345M239K878m589n040
6191f251k100L751J65N517L48p201n76J780J817K632k34k507l861k025L002J977
6175c766k612J400j286P235J455k584J320p61L009L406L311p472m630M521m208
$$ y = [7232, 7862, 7271, 6528, 1374, -2068, -1771, -2716, -4872, -13697, -13636, -7877, -3943, -3372, 4110, 13850, 16149, 14848, 5724, -1851, -1259, 127, 6012, -3328, -5918, 192, 6039, 7782, 3394, 1105, -2287, -3409, -406, 44, -7406, -11237, -9873, -5037, -3207, -1752, 1296, -4744, -12, 6946, 5413, -652, -4713, -6118, -9222, -10322, -6750, -3463, -4707, -10652, -6178, -3133, -665, -4752, -7113, -5856, -3841, -2182, -1852, 2453, 1946, -1046, -1206, 344, -4458, -1374, -796, -2826, -3472, -1686, 1933, 2971, 115, -3221, -4324, -7608, -6170, -4481, -2915, -8573, -11754, -313, -8106, -12574, -8084, -3739, 500, 3378, -1211, -6251, -8351, -4600, -4435, 1082, 1430, -5771, -6347, -4567, -2750, -118, -352, -2859, -6720, -8745, -5743, -3766, -6378, -4978, -6264, 971, 2426, -158, 1162, 401, 3410, 6816, 10127, 2655, -1975, 2546, -1662]
6160a662q921l984N981J232K695M388O142R6N76K819J381k884K801P54j865p008
6144B541K657K886rJ420l638j63k141n427n194J870K339k158m874K480J029M328
6128b054J435j306j34n118K371O930j710k769n95m236M172N499r542l354N446
6113d965P219J975m593m839k682j591J635R628n155n890M081K120l658l015k405
6098a2135k974M130N873K372J1671j126p547K20K741J671m532p854q744J068J775
6083a3391K168K261M296M748k63P54K297L098O884m545n787p001k44Q14n290l902
6067a3103M773J5111l805p521m221m115M919N464l17k157L749j485j0916K392
6053a1232J0219J727l488M160l682M516J140n3L906l17o211j791J884k165J011
$$ y = [-1662, -10583, -14567, -8586, -7354, -4659, -271, 5871, 5967, 6543, 9362, 10743, 7859, 10660, 11414, 9549, 2541, 5198, 8084, 8075, 9495, 5857, 5694, 3553, -1874, -7068, -5198, -2859, -5017, -9891, -7411, -6382, -2054, -619, -1925, -2059, -7177, -4806, 2124, 414, -2355, -2950, -7186, -3014, 2485, -7057, -10411, -4965, 2254, 4229, -364, -5203, -7885, -9476, -7841, 1787, -3368, -9258, -5177, -3057, -6715, -9730, -12135, -15109, -10979, -5106, -2734, 8937, 7811, 264, 484, 3225, 4896, 364, -7490, -16234, -15166, -13391, -11223, -8962, -4666, 82, -181, 573, 2870, 5968, 12852, 8307, 2520, -4481, -4725, -3911, -9201, -13103, -8330, 6781, 2976, -4545, -8766, -12881, -7962, -2498, -2815, -4972, -1223, -2708, -13624, -11232, -1013, 714, -2774, 1386, -2296, 2220, 3360, 3307, 7213, 6896, 685, -1106, 778, -1387, -376]
6038c76m738n44L198M883o2o364L865K423m259K594l560j42k42l329K561N534
6022A442L507k667q764k188K468J132l083k435M524O607j488m381l902n63K241
6007g550M375N40K79j29L443n713k289J547J331j530p00j516l862M152K601L327
5991a694L261R93J819m02j608P5M443N3N71n156n376j191O564l56j120L033k148
5974A761j391j997L61L351L521o70O116l008j978J588m799l180K938m560r380
5959a1327K803P88m770k033L520R224J2244m622r723P020K403l144Q279k636n360
5944B666k128l350k443m61j771k841J382K096j503k217O832K718j182M285L130
5929E213o01r423J42j859J833j913J48K721P307R24n352O0m702O863j304j25P74
$$ y = [-376, -5114, -5658, -2460, 2423, 2361, -4003, -138, 2285, -1974, 620, -2940, -3082, -3324, -6653, -4092, 1442, 4949, 2282, -6482, -8670, -6202, -5070, -8153, -10588, -6064, 543, -945, -5326, -9228, -9791, -7550, -3175, -2635, -2356, -2485, 958, -4755, -7044, -5497, -4166, -5696, -6396, -7912, -11774, -7622, -5021, -1694, 1567, 2560, 4379, 3977, 2369, 2444, 6887, 6940, 7511, 2355, -3021, -4212, 2352, 1996, 876, 3909, 1761, 370, -1627, -1266, 2085, 5606, 4936, 11052, 8044, 6066, 7654, 2855, -325, 2613, -1947, -11327, -8524, -7736, -12506, -14539, -11019, -1795, 10449, 5827, -3896, 3124, 5527, 2383, 10662, 8026, 2666, 538, -2812, -5255, -5716, -7487, -10328, -8946, -6850, -8353, -10570, -3738, -1020, -2202, 2083, 5213, 4612, -4811, -4669, -6528, -4695, -6608, -6460, -3739, 3568, 4492, -860, -800, -5502, 1361, 57, -68, 706]
5912G06n940K634n037M24L874N056K66J836R332j077n558n687l502n664j03N848
5896b592K208L355k52m180r330m116M087J1287N976m664J389l505R2O386q067
5881a926k529M347k534l956L899N079q709j165P385M540P04r904n335O240J589
5866b275L95K531l95L067M29k868K481L63p219m690K731P573M860L08m327K50
5850C214L498k269R78Q571n338m005o723j247l839q22R755O010K987L35l332p365
5834D08Q44j308k390l437M48N088N458m177m186L099l183Q6K084N56m128l77j317
5817f432m827J544J630J172l076M404K171Q282J876q161K61l461k2J908j59N89
5801b301N073N755p587j407n389j922J173P002M735p780l2j677k260N169J632
$$ y = [706, -5234, -2600, -7637, -7213, -3339, 1717, 1983, 3819, 13151, 12074, 6516, 829, -2673, -8337, -8440, -2592, -384, 2971, 2719, -1461, -10791, -14907, -10820, 467, 6443, 1779, 3168, -337, -245, 6141, -1926, -4455, -108, -2642, -6598, -2699, 2380, -6329, -7494, -109, 4431, 5135, -4769, -10104, -3864, -2275, -1880, 651, 256, 3323, 3752, 884, 3365, 3728, -3491, -8181, -5450, 2123, 6983, 7291, 2964, 3214, 6712, 4443, 5421, 13992, 8654, 4649, -2074, -3321, -7160, -7982, 1773, 7783, 10770, 11105, 7773, 408, 1252, -56, -2446, -5883, -5435, -347, 5111, 934, -3252, -153, -3336, -3250, -1166, -610, -4738, -5115, -6432, -11259, -9715, -8085, -6913, -9989, -5585, -3414, 4868, 6744, -1417, -1156, -4617, -4639, -2731, -2890, -2301, 2772, 8527, 940, -467, -5856, -7778, -6605, 397, 5132, -2648, -2680, -4357, -6617, -1448, 184]
5786A84o002j353m465j086J2989O746n325m581J234m344k586O32J0730K864k694
5771B943k623K037J674R07K535o776l285k570j091K835r72m18k106k409j77M346
5755e150L249O370L799m471l178l770M642L904m039K671k31n77r74j173m028j98
5739c154N779J323l56n024j854J944K919J038p503K211o81j3877j386K743l158
5724a9036P45N071N489M832j538J026O37k075M55K670l393j212M214k19l454J488
5708d300J279n652J299P500J01p538L536K233m590J0580O675m456l735n954L956
5693I34N453j905m065k264N300N938J342o639k290K284K237o952q256N418L766
5678C01l886K436K126l827J626M235l362L64K500R97L446J093j824r496r359N009
$$ y = [184, -5818, -7171, -11636, -12722, 267, 7013, 1688, -2893, -1659, -6003, -8589, -7957, 2773, 5637, 2943, 320, 2357, 4031, 4938, 7473, 697, -2588, -5158, -6249, -3414, -4386, -4804, -6910, -9319, -9496, -5150, -1901, 4469, 8268, 3797, 619, -3151, 1491, 5395, 1356, 4027, 3796, 3219, 2245, 1072, -2956, -3154, 2625, 3948, 3592, -1432, -3286, -1342, 1577, 2615, -4888, -2677, -3358, -17235, -18621, -15878, -19036, -18291, -13220, -7731, -2899, -4437, -3411, -2774, -4849, -4394, -1724, -5117, -6329, -2115, -2334, -5788, -4300, -3021, -8673, -7374, 126, 227, -7311, -3775, -1542, -6132, 4448, 11123, 6667, 2932, -3022, 934, 6387, 4482, 417, -1847, 3453, 9391, 10733, 4094, 1804, 4088, 6325, -627, -8883, -3465, 301, -3585, -1149, 977, -2850, -1224, 3011, -351, 13, 2513, 3510, 6956, 8049, 6225, -3271, -12630, -7621]
5662g621K784L047m634o861k332K942J9K295K361j879j890J03L125l413k82R73
5646a1263P429k921j356M745k322m999J315K327P441k416n802j532K725k681M67
5631h843l749M402M799M384q08m962j315p122N181m75r73O298O107J153j517o183
5615c623j291O53r88l527k635L272Q519J973K474l724k386k61L904j727j516L411
5599B528k008P420J176j0951p142L919K4l175J78j399l400K80J559M811J067J380
5583c733j680k812R704O633r586p569J51R675O83j243J417o06j019k14M4n271
5567e426K554L716L034j848p838r22N110J586j329j805p193l566O101P47L777
5552c302O396M601N955M600q26o485p801m20k810o794k012o583l945L835Q449
$$ y = [-7621, -4837, -1790, -6424, -13285, -15617, -12675, -12656, -10361, -8000, -9879, -11769, -11666, -8541, -11954, -12236, -11263, -3834, -6755, -8111, -3366, -5688, -10687, -9372, -7045, 396, -2020, -7822, -9354, -6629, -9310, -8843, -12592, -8190, -3391, 993, 185, -4777, -6092, -13214, -8033, -8508, -9481, -3183, 2924, 4077, 2560, -3623, -4914, -4261, -5249, -8776, -11411, -8139, 380, 2353, 4827, 1103, -1283, -1544, 2360, 633, -883, 2528, 520, 7940, 9116, -1835, -8977, -5058, -5034, -8209, -8031, -9430, -12830, -12550, -10991, -6180, -5113, -3733, -5413, -8225, 1479, 8112, -1474, -9043, -8892, 783, 1466, 223, 1640, 1034, 15, -199, -155, -5426, -2872, 844, 3878, 2030, -5808, -6730, -1620, -34, -1363, -3168, -10361, -13927, -7826, -7079, -3302, 3094, 7695, 13650, 18250, 17424, 10939, 3138, 2718, -92, -6886, -8898, -15481, -19426, -15591, -7142]
5537g142Q810j739k518R14k838M58m897j380M657M257l812m539P056M770L597
5522E654O266j83j2205m470K167L242J0453J180L614q078r717J24k533j695l984
5507a0165N55K616M529M310P083J060n959j0609j571m83m40J520M124m47l114
5492f991L022n27k60J2002Q770m157r658o006m857l197O709J142j03o357m116
5477a4584j41K578K533N754M428J31L733K818o058j524L55q06J624j840k279n033
5461h311J485l911M005O528p951n864m029P76P769O997N885o562m261O535l326
5446d235k117L692J718J425R68N608K00R39o518M013N6L99J740m869p114m227
5430h322R96j562L805J419L373L100l75K765k919m988K387n907O98K611l844r306
$$ y = [-7142, 1668, -71, -2589, -1675, -4513, -4055, -8952, -10332, -5675, -1418, -5230, -9769, -2713, 2057, 5654, 11920, 11737, -468, -4938, -2771, 471, 10924, 12104, 15718, 7640, -2077, -1953, -4486, -6181, -10165, -9610, -6994, -2465, 1845, 8928, 9988, 4029, -6580, -8151, -8634, -9074, -7554, -3430, -3877, -6991, -3969, -4496, -4756, 7246, 16016, 11859, 2201, -3805, -8662, -11859, -5150, -4008, -4111, -10468, -14584, -14725, -12147, -9614, -3860, 568, 699, 4432, 7250, 1192, -332, 23, -783, 841, -999, -3278, -8311, -6826, -10737, -6732, -204, -8155, -14019, -18048, -17272, -9503, -2506, 3379, -3183, -7444, -909, -4235, -6352, -2660, -942, 483, 1451, 7059, 7259, 8198, 1680, 5693, 5749, 6148, 7888, 3019, -4095, -8322, -7326, -8888, -5083, -3664, -291, 2809, 2434, 5199, 2280, -2708, -321, -6228, -5530, -2919, -6763, -16069]
5414a6069k68O304O335M01o41l262m776l864m09O914N815l705l133Q54M574l216
5398h146J78J628j419m029J535J1041N559p04L697p598l016L73J042l14N248N640
5382A0715k831m883l351O928j79J729l212k843N47l46L422j55O27j702M7O66K083
5365G262j1033l462K116m557j14Q267q93k948O31O73K46P850R085p07n60j291
5349A0565j0639j8915l411O371k73K090R630l647k394J1863Q269P57l97p111l909
5334a151L057M21L148j009l026r4l114m313K706Q903m070j288K302N092L166q324
5318B406n346o23m039K833K506k545k714O34K928P183k453n297N298J007K324
5303D102O907n16o449k22j651j328m653l135k762O093J0750M673o157k556r521
$$ y = [-16069, -16337, -10033, -3698, -3297, -3938, -7200, -11976, -15840, -16249, -9335, -3520, -7225, -10358, -9504, -4930, -8146, -7968, -6340, -7759, -11788, -10253, 788, 6347, 5643, 9340, 1742, -1274, -901, 141, -173, 5075, 10715, 7884, 3001, -350, 6578, 6399, 8128, 4916, 2073, 2620, 2274, 5696, 5541, 6168, 4466, 4513, 5179, 7262, -3771, -7233, -5117, -9674, -9788, -1521, -2414, -5362, -4731, -4058, -3812, 4038, 13123, 12416, 11856, 10565, -74, -18989, -22400, -16029, -16302, -14212, -4582, -8229, -10623, 1240, 9509, 10266, 9869, 2758, -1151, 1906, 2327, 5475, 4466, 1440, 1346, -1768, -6081, -3375, 5528, 1458, 170, 2472, 7564, 10730, 2406, -2940, -3563, -7602, -4769, -2263, -4808, -7522, -6888, -3960, 3223, 770, -4527, 771, 1778, 4102, 11009, 10493, 4044, 3822, 2171, 843, -3810, -6945, -9707, -3614, 7136, 11809, 5652, 3096, -6425]
5288f425j2928j817J2094J0805r83Q89l346l437J358R15L274j362l685q417m230
5273a7295k155L077J0301Q378j449j573j056J026l621j033r6j001j285M902J703
5258a177Q928Q26m268r090L90K161n42J861K967L423k068k24l291m930L17k472
5242g189L546m55m361J579M843J971k827N035k671o581j904R79L116o06k637K715
5226e447M810L706j082l421j322K014K02k632l680M012M559N593o442p101L555
5211b676L704J272P49p97r439o219Q825L584k527L352j98j0022L35L223J699m787
5195i922N31K453K105n424m02k414j76N803J201l025R35P222n295n196K07M543
5179f854O478L92p64K083k221j629j602M65K617M01o709M292J0887n407k486J608
$$ y = [-6425, -19353, -21170, -9076, 1729, 746, 1635, -1711, -5148, -3790, -2875, 399, -963, -4648, -13065, -17295, -19450, -16373, -6072, 2306, 857, -716, -1772, -746, -4367, -5400, -5496, -6497, -7782, -2880, -1177, 7751, 8577, 4309, -4781, -4391, -2230, -2772, -911, 2056, 5479, 3411, 3187, -104, -5034, -4717, -7189, -3643, -4098, -8459, -6880, -2037, -66, -2893, 2142, -529, -7110, -9014, -8035, -4919, -5525, -8162, -5447, -637, 3069, 1987, -1434, -2756, -742, -540, -3172, -6852, -2840, 1719, 7312, 870, -6231, -2676, 1028, 2300, 3049, 2252, -7187, -13406, -4581, -997, -3524, -172, -370, -10392, -10057, -6834, -5135, -9922, -9391, -6938, -4833, -10257, -10659, -13073, -13249, -7446, -6245, -9270, -8335, -1113, -6408, -11604, -11397, -6854, -376, 16, -748, 1335, -886, -2515, -4117, -3652, -1035, -634, -7343, -3051, 7836, 2429, -57, 1551]
5163A551P392O041J2j0742r244J115N563m078l276j066j052j520O096M899P7k528
5147g60J977K859n89l176l88n760K459o746o093K657N528R341j607K905k71j144
5131A192j877o92k10K229p989p125O752O278m556l176M150P230q51o076l121l11
5115h153Q146k827m199l13j459m547O057M986J229K86L5j394n223R11j704K621
5099e548N867j03K2q09J753P020j007J953k619l676k169o53n384p678j258J520
5083a2769J252N584p082k286J0802R870J966o924J637M90k417j903J803l066r575
5068a2618l039l645L103Q027P102p95l032K616L817l084m980K475N90n33J281
5053b715p938j299K932L176L176Q56L895k738m958J76J101Q48J256k302J669L088
$$ y = [1551, 8943, 14984, 14996, 4254, -4990, -3875, 1688, -2390, -5666, -6732, -7784, -9304, -3208, 1691, 1768, -760, 1217, 4076, 3487, 311, -77, -5837, -3378, -10124, -16217, -13560, -8032, 1309, -298, 2607, 2336, 1192, -685, -1377, -1587, 642, -7347, -14472, -7720, -1442, -5998, -9174, -5024, 2206, 1355, -4721, -7842, -8153, -7, -2834, -7033, -7346, -8805, -13352, -7295, -2309, -1080, -794, -759, -2153, -7376, -6465, -8169, -5548, 319, 216, 238, -571, 1182, 8202, 7195, 9148, 6529, 2853, 684, 31, -5353, -13031, -14289, -12769, -11517, -5933, -13015, -15301, -4499, 5371, 7337, 413, 2050, 2540, 123, -1780, 23, -3043, -12618, -15657, -19302, -16199, -8172, -1070, -1865, -4897, -2281, 1536, -1548, -6528, -4053, -3463, -3996, -2715, -10653, -11952, -9020, -5844, -2668, -1812, 2083, -655, -5613, -5437, -4336, -3488, -2232, -4534, -2865, 223]
5037B23L945k985o631l257J592j935n204J0467Q766n541k03N500K170J837k383
5022F361m003q55J136k259l931k391J964J626m133k477n981R672R196k93j893
5007A739k715j525R01L451K247j149o617o614o26L982J769L835L800K841k724
4992B595j1726M903J2744o13o630p08L028J958K024k689o498l99k660q59K879
4977b651K249O43k322p88L698M520l746j173k214j900N17M27P666l102l167N558
4961D215n633n925K097o722K250J90L21L086nM470N122J46o172o660o483n967
4945b1670K909J5603N73k841J987O375n182j475k753n469l439P403L486k864m544
4930a1901J043L106k796L634M400K855O786l992K09l319m966J051m014j000q331
$$ y = [223, 4168, 1183, -5448, -8705, -7113, -9048, -14252, -3785, 4981, -560, -763, 4737, 6907, 8744, 6361, 2358, 1503, 2639, 380, -3551, -5942, -3978, -2352, -6485, -8962, -14943, -5271, 3925, 3632, 1739, -976, -2501, -1600, 1851, 4098, 2949, -3668, -10282, -10908, -6926, -5157, -1322, 2478, 5319, 2595, -9131, -4228, 8516, 7903, 1273, 565, 3593, 5551, 7575, 4886, -1612, -2011, -4671, -5530, -2651, -402, 241, -2081, -2869, 829, 5349, 1603, 430, -1784, -3684, -3167, -2740, 4926, 1824, -1343, 4215, -1418, -7343, -5246, -11968, -9718, -9528, -9207, -6121, -6126, -1656, 3466, 3612, -2560, -9220, -15703, -21670, -18761, -3158, -2585, -5426, -3439, 2936, -2246, -3721, -6474, -11943, -15382, -7979, -4493, -7357, -11901, -10858, -7752, -10548, -6914, -2514, 341, 7127, 3135, 3344, 25, -4941, -3890, -7904, -8904, -17235]
4915a7235J147R767N319J221j717m718L040O667k36J207J5p145m001k668K111
4900g226N663l143j08N10P39p15L561k349k225K139J417M572n04o711J597J485
4884a298m255n463K020j50l885K736P186j579n333m684j159K205N481P588j019
4869a609j85J565j097K635l323k288J061j736j093K124n69l529O30O137J427j0278
4853a0128m724M407Q890M667j210N60M398j0491n638k611k104j33N696K656J477
4838d288K904M058L488q07m211l625J356n534K219O978L219l709o193l480n36
4823h161P666j13l338j17P649J225m936p882j236J845k257o154N497N97j107J237
4807i585K665K74j045l172Q57M661J32l466N36K662Q149J855o217q315p47Q772
$$ y = [-17235, -16088, -6321, -1002, 219, -1498, -6216, -3176, 3491, 3255, 4462, 4477, -2668, -6669, -9337, -7226, -1563, -4706, -4814, -4304, -3565, -4280, -719, -3068, -5293, -3154, -1737, 2835, 2331, -4380, -2783, -1298, -5553, -11016, -8996, -9146, -13031, -10295, -3109, -4688, -10021, -14705, -15864, -13659, -8178, -590, -1609, -1794, -229, -1326, 1309, -2014, -4302, -3241, -4977, -6070, -3946, -4515, -8044, -7414, -1277, 150, -10128, -14852, -10445, -1555, 3112, 1902, 2462, 6860, -3631, -9269, -11880, -13984, -14117, -8421, -5765, -4288, -1384, 2674, 6162, 5355, 1144, -2481, -1125, -6659, -4440, 2538, 5757, 2048, -4145, -7625, -8161, -495, -608, -3946, -4063, 3586, 4811, -125, -8007, -9243, -7398, -9655, -15809, -10312, -9715, -10822, -9585, -6920, -6646, -7691, -10863, -10006, -5345, -5213, -8679, -8143, -5481, 2668, 4523, -1694, -10009, -10756, -1984]
4791a984R266k614K374l128j0266n94m28P888P534m752r63J063J643l824K606
4776C821o540K280k91J467J707q736m501K907J041K58M684P025L809k735j278
4761D918n574j008J54R41L014k537j64J690O11M141l710k343l463K053P070N092
4745A0885r803m389j3N37L577K299k730q39P436M65M195k938j643J830j317l537
4729D015M20m330k865M1k75L038Q663M807j029p690j0791n733K684k35m52P52
4713h980K612l438m534J403M185R249N40j935m413k324J581m050p717K826O753
4698h242J615k72P289l041q088k400k354K850O779j943Q55k878K201j600j160
4683a0389m016K976J034P361M147O36p952l121l905L193j609m62L508N305K030
$$ y = [-1984, 7282, 4668, 7042, 3914, -6352, -6946, -7374, 514, 8048, 3296, 2333, 3396, 5039, 1215, 3821, -2719, -439, -730, 737, 2444, -6292, -10793, -7886, -6845, -6587, -1903, 5122, 8931, 6196, 4918, -656, -1664, -1510, -569, 2445, -92, -256, 1434, 2045, 6186, 2476, 133, -3330, -1277, 5793, 10885, 1082, -3307, -3320, -2783, 794, 3093, 363, -476, 6960, 7425, 11620, 8682, 7039, 8869, 7552, 4015, 4435, 105, -2760, -2719, -2994, 44, 8707, 13514, 12485, 4795, -5996, -11729, -9045, -9280, -9732, -8980, -6368, -9806, -14340, -12937, -8752, 497, 1037, -898, -5311, -7635, -6054, -10104, -17821, -14995, -8242, -6627, -6899, 390, -2651, -10739, -13139, -15493, -12643, -5864, -7807, -6952, -9830, -7629, -9229, -10389, -14405, -11429, -10395, -3034, 1113, 1749, -6203, -9324, -13229, -10036, -11645, -12107, -8599, -3294, -1264]
4668a264k65l179m54O771k577L86J016n662l710l19J638P549J628K42k431m072
4652d703L913M200n821r200M65J0347L893l017j414j208n731p440K952K083q32
4637a1513L546P81L870L069j044M903K761l889K661l57M038L240k091k139K574
4622A0410l621m937M63O972J766l864n158L65L473K461m920l699n063p093L768
4607h677L935R3l644K240j740K53r12k255Q301N941l828o718k457Q75k387j671
4591a2651J613l156J616m19M158N330Q462m49k027m09k783l857j0144L198K796
4576h722q906r978j389L625N058K429M893R497n276J027L612N558L42k687k683
4561c600P580N902o07m110m694J87n244M80M554p052l303L424k404l690M968P810
$$ y = [-1264, -1529, -4708, -5162, 1609, -968, -582, 434, -5228, -8938, -9257, -7619, -70, 1558, 1800, -631, -4703, -790, 3410, -2411, -11611, -11146, -799, 3094, 77, -1337, -2545, -8276, -15716, -12764, -10681, -11513, -7967, -7186, -3316, -247, -1291, 3612, 6373, 2484, 5145, 4788, 8826, 12066, 9975, 7836, 10410, 6789, 1852, 2315, 9287, 11053, 7189, 2031, 2396, 5869, 8330, 3410, -289, -5352, -12445, -8677, -4742, -4649, -8293, -6053, -7793, -7540, -8452, -10707, -2406, 3535, -293, -7011, -9468, -8593, -10980, -12651, -11038, -14194, -12578, -12997, -8839, -3509, 4953, 4504, 2477, 2068, -715, -4572, -14716, -11518, -8722, -17628, -27606, -28995, -25370, -20312, -17883, -12990, -3493, -8769, -7742, -4130, 1428, 1770, -917, -3600, 3980, 9882, 9275, 5165, 471, 658, -4586, -4106, 448, -6604, -9907, -6483, -8887, -12577, -7609, 201]
4545B01k535k851p18r92m534j084Q775J931N005j086m126n362L418J242n139j30
4529g985N04k02N75J348k103M076L005p082J012L465m98J611p03l87M446k99K294
4512C077m098k301J796p43r27j66j30j424p61k727j160M273L602L389L304j645
4496C359n255k876L152r22J33R37n217J702J657j276k591J882K984m009k920O22
4480h638M309L365j554p70K981k445n500l63L986L325m251j230J482J359j846
4465e790L399O57o35M752K002K210j043l834M531p720n322oJ587n555k50J764
4449i253J278j496k592K857l792o27R489Q670n17L68l88P33K887k01p057j586
4433a227p629m177J519N963P641q36l43l683m616N522P474j931q377L003O11n566
$$ y = [201, -2334, -5185, -5903, -6895, -11429, -12513, -3738, -1807, 3198, 2112, -2014, -7376, -3958, -2716, -7855, -7985, -7481, -7683, -7108, -5760, -7863, -3787, -782, -7864, -6852, -3387, -3885, -2274, -2977, -3364, 1082, 783, 3077, -1021, -3322, -1526, -2269, -3196, -3362, -3492, -4916, -5677, -8404, -9564, -5291, -1689, 1700, 5004, 3359, -1896, -4772, -1620, -2542, -2409, -1472, -6689, -4987, -3330, -4606, -7197, -5315, -2331, -6340, -9260, -8638, -4329, -964, -2518, -3288, -307, -2752, -8252, -8615, -4629, -1304, -5555, -6785, -5303, -3944, -5790, -2391, -1734, -2369, 2383, 4385, 6595, 5552, 1718, 6249, -1471, -6793, -6799, -5212, -10767, -11017, -9253, -7975, -9471, -12063, -9206, -12998, -13625, -4136, 4534, 4017, 4385, 3997, 4730, 7617, 7416, 359, -1227, -8856, -13033, -11514, -5551, 2090, 1254, 911, -2772, -7388, -1866, 5608, 3677, -4700, -1697, -1086, -6652]
4417f652l504m588Q02J0989k266q16K613M88n772M360N753L890M596o712M109
4402G290P310k504p752q314K479J950n519l344N379K046J46o61k009j881M956
4387d28L47l096n938J253K737K395J951l086j352J583k806l120k069Q388O361
4372C120l131k584l275l116k065P616L212p8j679k199j07j681O276l322l707O189
4356e31P980n137k953j952k3k112L502M368m679J671p28m584K895K436j764K450
4340H39j925m157q425K142K443M134L221j754K326M892k239n891k769n4m34r45
4324h596K225J90k090J514L040L484m473p064j547O61p232j105M062Q018M99o799
4308a5213m386m287O206Q640R274O394K201J511q271l761P268M819n158q532k134
$$ y = [-6652, -10156, -14744, -13942, -2953, -5219, -6035, -3422, -2934, -8706, -4346, 1407, 5297, 9893, 3181, 7290, 14600, 12096, 4344, -3970, -1491, 459, -5060, -8404, -3025, -979, -833, -1494, -3503, -5384, -428, -81, -3177, -9115, -7862, -5125, -2730, -779, -3865, -5217, -3634, -6440, -9560, -11629, -3241, 3120, -11, -2595, -5870, -8986, -11051, -3435, -223, -301, -1980, -4179, -4286, -5967, 309, -3013, -6720, -531, 7449, 2312, -641, -2593, -2616, -4728, -1226, 3142, -1537, 134, -594, -5178, -2283, 153, -1611, 839, -1086, -5243, -13668, -11526, -9083, -4949, -1728, -3482, -1156, 3736, 1497, -4394, -7163, -7217, -7651, -8596, -6371, -6181, -8271, -6757, -3717, -233, -4706, -11770, -13317, -12656, -19888, -20993, -16931, -8913, -8414, -15213, -19599, -23886, -17680, -9040, 234, 6628, 8829, 10340, 2069, -1692, 5576, 10395, 5237, -3295, -5429]
4293e429j601J906K440j397J458o15l644L062k203J251L017J95m294j370J758
4278e466J037m215P084j397n13P165R11m557j202J708J001o105P49J0754P482
4263A4436k964k652q6J243O863k012j1477r263m588P025J041m211k102L470L550
4248a727n6J28j861R54M566l703m555j967R80J419j418J237j052M046k703m781
4232a0493J061N970K963k06l572Q26K310J432N762j54n630m062j594J575K745
4217a067k366K862J766n32l995j660p13k695L554M691j125M22M208l223l064m712
4201g649l907m100m713K32O28N139J7045J2202J566j0864o398k619J518O874L344
4186H298J625k598m194p050M83L348m925J70M721j801q961J335J257N876M200
$$ y = [-5429, -7030, -5124, -2684, -4081, -2623, -3238, -6882, -3820, -6023, -4772, -1755, -1560, -5854, -7224, -5466, -4429, -8644, -1560, -2957, -3470, 3695, 4606, 49, -1153, 555, 1556, -4549, -3800, 6954, 14436, 11472, 8820, 8734, 9977, 16840, 14828, 3351, -5912, -10500, -3475, -2434, -6645, -8747, -5277, -1727, -1783, -1655, -3516, -2562, 2004, -1699, -6254, -8221, -7241, -5822, -7240, -6003, -7055, -3009, -5712, -10493, -9432, -3462, -499, -705, -4277, -3451, -1141, 291, 6053, 5899, 269, -3793, -5387, -3812, -1067, -3433, -571, 1195, 663, -3332, -4992, -5705, -8400, -4846, -155, -1280, -858, 3350, 127, -2937, -7649, -11556, -15656, -20369, -20137, -19509, -14370, 2675, 14877, 16443, 5579, -819, -3438, -1920, 4954, 8298, 9923, 7325, 3131, -3919, -3436, -88, -5013, -4843, -122, -1923, -10884, -9549, -8292, -2416, 1784]
4171A784R604L460M27k262l814m84m360p638o303N380J2888O070j1979n339m535
4156g101m212j669L20Q839M963m098k946M79M273N5n991o92N933J078l968O52
4140d085N858N194l86L730m254m093M895j343l199J153K103N479k739L127m323
4125G117n195K053l44m803n045K089M944K982j626J92N533L751l810n809o508
4110d479m356J695j110k530Q509P318j0599N309P591n877k319J414n210m076J483
4095g237n250M064M495P516j235j077p12k521J474O88k152k55n40L753R07R20
4079B838k696p120o533J1447K043n750k92O727O491N6r012j72L36l135K677J139
4063i56L61m200K854K400J109n211j119k731j379q079k185p2K132L061K721J270
$$ y = [1784, 11388, 14848, 15275, 13013, 9199, 8715, 4355, -3283, -9586, -4206, 8682, 14752, 2773, -2566, -7101, -11313, -12982, -12662, -3823, 1140, -2958, -5904, -5425, -1152, -1097, -7088, -7780, -1847, -769, -4737, -4085, 1773, 6967, 6581, 10311, 6057, 1964, 6859, 5516, 2317, 3470, 5573, 11052, 8313, 11440, 7117, 1922, 3975, 3631, -1172, -6217, -4128, 816, 3798, 2172, 2364, 7897, 11648, 7838, 2029, -4479, -8835, -7140, -8250, -10780, -2271, 5047, -5552, -243, 7348, 1471, -848, 566, -4644, -8720, -7237, -12487, -8423, -3928, 3588, 2353, 1276, 564, -1957, -483, 205, -1947, -2202, -2742, 1011, 1918, 2838, 142, -6978, -13511, -2064, -21, -5771, -6063, 664, 7155, 7211, -1801, -1973, -1637, -4772, -2095, -956, -595, -4795, -1941, 459, 1568, -3643, -4762, -7493, -8872, -16951, -19136, -19208, -17076, -14015, -11294, -10024]
4047a0024r41k635L409L495L252n534M4J307J1261L582o325p315N795O843k521
4032C693l511J174M705l782j626J114m904J358O05L177l699p566j432K403K873
4017e418l096l390R59j529l96N250P032m88m152M694k220L147R57p145L149j45
4001b791K79j593n686k27N350k903p37J0872M142L298L06l476j417K444P11r628
3985a056k531l693K018j295j017Q4m818L632O599R383m849r20k09K733l886n366
3969e191o387n056M978O194L277O075N726k573o143l778j582M180o11L432M894
3954G435k295n011q90K637M864r13l685l49L11p35n622j291M409K223j26p074
3938f112o206o9k68J415j129L913N477K320n19L492R11k015k415j333O38k236
$$ y = [-10024, -10965, -13600, -10191, -6696, -3444, -8978, -8934, -7627, 3634, 7216, 891, -6424, -629, 6214, 3693, 182, 1356, 6061, 2279, 653, 1767, -3137, -1779, -1174, 2003, -1696, -9262, -10694, -8291, -5418, -8514, -11904, -10945, -12474, -12870, -7620, -588, -1076, -5228, -534, -2754, 393, 1350, -5795, -2646, -2791, -2512, -4105, -9791, -10018, -4668, -7571, -8308, 2564, 6706, 10004, 10310, 6834, 5417, 7861, 8572, -1056, -3587, -7280, -5262, -6557, -7574, -7490, -12308, -8676, -2077, 7306, 2457, 1537, 1328, 4061, 175, -5191, -11578, -16634, -11656, -5462, -2185, 3890, 9616, 7043, 900, -2878, -4460, -280, -891, 2541, 7435, 5140, 129, -761, 1876, 6740, 5827, 2142, 1793, 2104, 1369, -4253, -5544, -1135, 1088, 962, -6112, -12318, -12387, -12655, -11240, -12369, -8456, -2979, -659, -1178, 2314, 3225, 1210, -1205, -2538, -1900, -4136]
3922d136l134k27M288J487p478n849j387M211j290J14J782O592P726N507j365
3907F841o170r28l299n237J0497L673J472K085k908r125j0251M136P307J102L346
3892B541N715l242J514K006Q08k213L191j568j872o108j0839J366j043k720Q051
3877d413O16r71N568J869j329r039j428J568J0j60q06P688O102m49m227o103J412
3860d092K498K870m156J0319k215j1483o20L193M497K767P59l746m241J427R12
3845a311l206M568N560K538p360j197o225j350N955J0540P706J980o967j3238
3831b007O29N419O028l665n489O161M794l250p142n01l750L172K921l903M119
3816C536K785L086j719q645m654K693L991l100m561N24R53J719K762R151o727
$$ y = [-4136, -7270, -7497, -3209, -1722, -9200, -15049, -16436, -12225, -13515, -13401, -11619, -5027, 2699, 8206, 6841, 671, -257, -3556, -8793, 1704, 5377, 6849, 8934, 6026, -3099, -13350, -9214, -1907, -805, 2541, 8256, 5014, 6528, 8534, 9342, 7129, 10320, 8752, 6880, 772, -10067, -8701, -9744, -12464, -4413, -3797, -4768, 800, 2669, 1340, -7699, -9127, -7559, -7549, -7709, -8515, -827, 5275, 4826, 599, -5504, -4092, -1594, 1276, -2880, 7439, 5224, -6259, -6879, -3686, 811, 3578, 4337, 591, -3650, -2223, -1311, -4517, 51, 5611, 8149, 789, -408, -6633, -7983, -2028, 8512, 16218, 18198, 11231, -2007, -1378, 4041, 10069, 6404, 915, 7076, 11870, 8620, 1478, 977, -2773, 399, 3320, -583, 3536, 6321, 9407, 7688, -957, -5611, -2918, 1073, -2027, -6588, -6064, -5111, -3392, -630, 8521, 1794]
3801A794p718O253O297j455j1114l632O583N328j665m61l165j276j95O969j964
3786E79L246K941K060p307L593R53o59k249Q24j081K022O069q042o000L53n95
3770c293O204L686n458j359J920M627p642j220j755K514L821m56j128l065l917
3755f521p547k334R712j439J319N490l489m646Q604k132j17O256M259P82Q52l399
3739E650j967p308o818n63M109J628O226k443k204M321r90o279j789k067O224
3724d270L502K819K774m151o327r1Q804J0942m985o001n011m853n974N02L711
3709h609o63J957j572O706J79O046J824n426m045j000K900j969n48j000J927Q292
3693D999j111o434j817M6J354L894K639L99r354j780O572L184Q32L498N701n340
$$ y = [1794, -5924, 329, 6626, 5171, -5943, -9575, -2992, 2336, 671, 210, -2955, -4231, -4426, 2543, 579, 3825, 6766, 8826, 1519, 5112, 6065, 5406, 3157, 3981, 2900, 4922, 10991, 2949, -3051, -2698, -3293, 2911, 6597, 1139, -220, 1700, 6327, -1315, -2535, -4290, -1776, 2045, 1589, 461, -2604, -6521, -14068, -16402, -6690, -8129, -6810, -1320, -4809, -9455, -851, -2983, -3100, 3156, 7415, 8197, 9049, 5650, 3683, -3625, -10443, -11006, -6897, -5269, 957, -1486, -3690, 631, -359, -6638, -8427, -10494, -4270, -768, 2051, 4825, 674, -5653, -5744, 3060, 14002, 9017, 3016, -1995, -6848, -12822, -12320, -8609, -9272, -7315, -8887, -2181, -2002, 4044, 5868, 442, -3603, -4603, -1703, -3672, -4220, -5220, -3293, 4999, 3888, -2546, -4363, -4317, -2963, 931, 3570, 3969, -5385, -7165, -593, 2591, 3423, 6921, 12622, 7282]
3677G282o111o53p09L008p414m016M808K43L260M819L428o739l878j457l102l118
3661a0349K524k021P33r27J731m459J702M516J129m243l995O991L279j760k647
3646g796j531O48l344m343N872J0716j574o302k973M356O456m559j79r26m257
3631i736p09l379J54Q208l166K623Q578L191m951n336l517o335O422L709M927
3616F83n997j815r11M764k564k60j209m216L958O522N656j602l015J154l045k526
3600d423N331R51n790n923l52R77M592P61j28M200p49k375l451N450O041K732
3584G844o539j2925k086M685m39N53O436O402p71n923p568p26l976J103Q669j369
3568f630r769m695Q204J3074R122p80o360M621k641N4M50n945m277j323K620P60
$$ y = [7282, 1171, 518, -191, 2817, -4597, -8613, -3805, -3562, -302, 4517, 7945, 1206, -2672, -4129, -7231, -10349, -7825, -9846, -9113, -10040, -8309, -12768, -11066, -6550, -5421, -9664, -13659, -6668, -3389, -5149, -7796, -9327, -8679, -12023, -16366, -10494, 222, -1352, -7654, -10627, -6271, 185, -4374, -4553, -5479, -9736, -10445, -13824, -13670, -5462, -8628, -6005, 2573, 5764, 813, -4523, -8040, -14375, -7953, -4244, 683, -5314, -7129, -8040, -3276, -5840, -6100, -7309, -11525, -7567, -1045, 4611, 3009, -6, 1148, -1897, -4423, 908, 1859, -3931, -9854, -10206, -9229, -4637, -3876, -4004, 196, -553, -2928, -6379, -929, 5112, 7844, 1305, -11620, -13706, -9021, -9460, -8907, -2471, 3931, 3160, -2763, -10331, -11057, -15033, -13930, -5261, -6630, -16399, -21094, -12890, 184, 9306, 8526, 2166, 6787, 4146, 4200, 4650, -1295, -5572, -6895, -4275, -3515]
3552c515J125K034k419j905M761L984l424m214j335R80n525l397K098J399J039
3537h314L537J0423P74o555p306k175R99q17M238L011L128P046O292q72k804n678
3521D927K069j855n790k665K23q96N656N782J935n81l187o718m075r82J608j059
3505e608j957L888j404M221j478L429N076J761j106k053Q596L364o27r268m51
3490F383P23j332j0053R06L767m979n341K911Q643k006l802J21j403K651O028
3475C217M82N264l152n422n831o385J468N229N289k909M098m253K05l37L428N591
3459E982l640p004N134L356K81J838N56l090n585n478m051M788M727J201K141
3444A156J11J32M126k078j243L595K441k640j0976p377Q45M250K561N389l947
$$ y = [-3515, -2390, -356, -2775, -4680, 81, 4065, 641, -3573, -4908, -3928, -9453, -12850, -10752, -9353, -8314, -4777, 5646, 6420, -135, -7441, -9616, -8617, -9434, -5196, -2185, 943, 7989, 14281, 13409, 10605, 4927, 6996, 5141, -649, -3314, -3091, -3987, 1669, 7451, 9386, 8805, 5618, -1100, -5175, -6157, -4549, -5608, -7565, -3677, -5081, -860, -2338, 1091, 6167, 7928, 6822, 4769, 13365, 16729, 16102, 6834, 6383, 7106, 5774, -4279, -3373, 394, -4585, -9926, -7015, 1628, -378, -4180, -4059, -5462, -2811, 3217, 3699, 8963, 5811, 389, -5442, -11827, -10359, -5130, 159, -2750, 1348, -2905, -2700, -3037, 391, 5982, 2342, -4662, 472, 3828, 4109, 5947, 6503, 3413, -2172, -7650, -11701, -6913, -2186, -985, 1156, 1267, 1399, 5525, 3447, 2204, 5799, 8240, 5600, -5376, -12753, -11908, -7658, -5097, 292, -3655]
3429c655m04O66j111m233J048P539M737m934j096n64J228j943r668M368J2744
3414D722Q337P414p054r044J838L179j0457o384k10M398J624q693m727J348R371
3399d338n50l743q037k506k463O197Q533O507M445K674j893n894k391J743n396
3384g112p78O67K707M909L499m42j009l724m660N296r41k059N181Q048o578r540
3368f536j012M124n108J546M151k768k952M817L842M395q44j199m653m654K894
3353c957J750j276l32k43N1M591K205q508k011J1711N161J29l924K720R98L181
3337A2246k641o229J098N311j943R69j0951m009M384q469k031J187P482K644J736
3322G84j755o55j690n36L56j813j742J585O188L937P167j135m090j899m321n751
$$ y = [-3655, -4059, -3393, -4504, -8737, -7689, -150, 4587, -347, -1443, -2007, -779, -2722, -12390, -8022, 4722, 13059, 20473, 13419, 4375, 6213, 9392, -1065, -7449, -7659, -3261, -1637, -10330, -15057, -13709, -4338, -4888, -8631, -16668, -19174, -21637, -15440, -6907, -400, 4045, 6719, 4826, -1068, -3459, -1716, -7112, -7890, -7223, -4516, 393, 3892, 3450, 2441, -1283, -5943, -647, -1588, -3647, 1534, 9582, 3004, -6536, -7548, -3424, -8532, -6986, -2835, -5603, -8555, -3738, 104, 4499, 3655, 2456, -2197, -6851, -3957, -2207, -3483, -3815, -4058, -4007, 584, 2789, -5719, -7730, 3981, 9142, 9271, 5347, 8067, 9065, 12246, 9605, 3376, 4474, 9785, 7842, 8811, -2140, -6149, -1765, -10234, -12265, -11078, -3596, -952, 784, -971, -1626, -3316, -3852, -3496, -5309, -7051, -5466, 722, 4659, 11826, 10691, 6601, 4702, 381, -5370]
3306e370n445L052K346o17o728j95M766P184L050M447J511k783o518p026K761
3291e565L266j890m029p70j458K031rK810J2271m376r126l836j743N918J538k099
3275g067M57J012m418Q50o50K000N97K247j675L608J593N200O835l090o725j3774
3259a3000O38P637r58J559O048k786m68o722k173M736K341M378L109J07J114m29
3243E131j448R43K13r69p892q07m766o391P092Q457P69n012j221K077j027l09
$$ y = [-5370, -10815, -7763, -5417, -6034, -12762, -12957, -8191, -1007, 2043, 6490, 8001, 5218, -1300, -8326, -5565, -2299, -4189, -8218, -8988, -10446, -8415, -8424, -5614, 6657, 2281, -6845, -10681, -12424, -6506, -4968, -7067, -6610, -5598, -10016, -9166, -9816, -7816, -7219, -4972, -6647, -3039, -1446, 3754, 10589, 7499, 774, -13000, -12362, -4725, -5683, -4124, 1924, -862, -1330, -8052, -10225, -5489, -3148, 1230, 4339, 4446, 5560, 5131, 3683, 4626, 4839, 3870, -4022, -4829, -9595, -15986, -8894, -437, 332, -4680, -5901, -3824, -4851, -5160]
$$ [...]
##END NTUPLES=NMR SPECTRUM
##END=
