##TITLE=Analysis number 326766
Compound Code cc 59510
Book Reference 508/60
Project Code adrs
Chemist Name antons
##JCAMPDX= 6.0         $$ Bruker NMR JCAMP-DX V2.0
##DATA TYPE= NMR SPECTRUM
##DATA CLASS= NTUPLES
##ORIGIN= Bruker BioSpin GmbH
##OWNER= nmr
$$ XWIN-NMR		Version 3.5
$$ Wed Feb 21 14:13:28 2007 GMT Standard Time (UT+0h)  MAYBRIDGE\nmr@NMR_250MHZ
##.OBSERVE FREQUENCY= 250.131544655141
##.OBSERVE NUCLEUS= ^1H
##.ACQUISITION MODE= SIMULTANEOUS (DQD)
##.ACQUISITION SCHEME= undefined
##.AVERAGES= 16
##.DIGITISER RES= 18
##SPECTROMETER/DATA SYSTEM= dpx250
##.PULSE SEQUENCE= zg30
##.SOLVENT NAME= CDCl3
##.SHIFT REFERENCE= (INTERNAL, CDCl3, 0, 16.522)
##AUDIT TRAIL= $$ (NUMBER, WHEN, WHO, WHERE, WHAT)
$$ ##TITLE= Audit trail, XWIN-NMR		Version 3.5
$$ ##JCAMPDX= 5.01
$$ ##ORIGIN= Bruker BioSpin GmbH
$$ ##OWNER= nmr
$$ C:\u/data/dgb/nmr/ADRS/1430/pdata/1/auditp.txt
$$ ##AUDIT TRAIL=  $$ (NUMBER, WHEN, WHO, WHERE, WHAT)
(   1,<2007-02-21 14:12:59.62 +000>,<MAYBRIDGE\nmr>,<NMR_250MHZ>,
      <created by zg, POWCHK disabled, PULCHK disabled
       configuration hash MD5:
       49 4B E0 1D 92 C2 6B 37 9F E6 65 BC 52 41 86 1D
       data hash MD5: 64K
       43 5A 80 04 CF 91 FA CD D7 77 2E 61 4E F4 27 08>)
(   2,<2007-02-21 14:13:16.48 +000>,<MAYBRIDGE\nmr>,<NMR_250MHZ>,
      <Start of raw data processing
       ef LB = 0.3 FT_mod = 6 PKNL = 1 SI = 32K 
       data hash MD5: 32K
       11 B6 E3 5B 43 68 ED B9 49 7E 81 A2 CF 21 66 42>)
(   3,<2007-02-21 14:13:18.56 +000>,<MAYBRIDGE\nmr>,<NMR_250MHZ>,
      <apk 
       data hash MD5: 32K
       E7 E2 69 A7 C5 E5 99 AD A2 28 BB 5B 2C 62 C7 E7>)
(   4,<2007-02-21 14:13:19.28 +000>,<MAYBRIDGE\nmr>,<NMR_250MHZ>,
      <abs ABSG = 5 
       data hash MD5: 32K
       78 0C 75 59 40 08 B6 4F 6F 86 09 57 6B 03 F3 84>)
$$ ##END=
$$ 
$$ hash MD5
$$ 3E F9 A4 A6 8F 58 EC 02 5F 43 E6 1C 14 89 06 AD
##$RELAX= 
##$RELAX= 
##$RELAX= 
##$RELAX= 
##$RELAX= 
##$RELAX= 
##$RELAX= 
$$ Bruker specific parameters
$$ --------------------------
##$DU= <C:\u>
##$EXPNO= 1430
##$NAME= <ADRS>
##$PROCNO= 1
##$TYPE= <nmr>
##$USER= <dgb>
##$AMP= (0..31)
100 100 100 100 100 100 100 100 100 100 100 100 100 100 100 100 100 100 
100 100 100 100 100 100 100 100 100 100 100 100 100 100 
##$AQSEQ= 0
##$AQ_mod= 3
##$AUNM= <au_zg>
##$AUTOPOS= <24 >
##$BF1= 250.13
##$BF2= 250.13
##$BF3= 250.13
##$BF4= 250.13
##$BF5= 500.13
##$BF6= 500.13
##$BF7= 500.13
##$BF8= 500.13
##$BYTORDA= 1
##$CFDGTYP= 0
##$CFRGTYP= 5
##$CHEMSTR= <none>
##$CNST= (0..31)
1 1 145 1 1 1 1 1 1 1 1 1 1 1 1 1 1 1 1 1 1 1 1 1 1 1 1 1 1 1 1 1 
##$CPDPRG= <>
##$CPDPRG1= <>
##$CPDPRG2= <>
##$CPDPRG3= <>
##$CPDPRG4= <mlev>
##$CPDPRG5= <mlev>
##$CPDPRG6= <mlev>
##$CPDPRG7= <mlev>
##$CPDPRG8= <mlev>
##$CPDPRGB= <>
##$CPDPRGT= <>
##$D= (0..31)
0 1 0 0 0 0 0 0 0 0.06 0 0 0 0 0 0 0.0002 0 0 0 0 0 0 0 0 0 0 0 0 0 0 
0 
##$DATE= 1172067177
##$DBL= (0..7)
120 120 120 120 120 120 120 120 
##$DBP= (0..7)
150 150 150 150 150 150 150 150 
##$DBP07= 0
##$DBPNAM0= <>
##$DBPNAM1= <>
$$ [...]
##$SUBNAM7= <"">
##$SUBNAM8= <"">
##$SUBNAM9= <"">
##$SW= 20.6930455092707
##$SWIBOX= (0..15)
0 0 3 0 0 0 0 0 0 0 0 0 0 0 0 0 
##$SW_h= 5175.983436853
##$TD= 65536
##$TD0= 1
##$TE= 295.16
##$TE2= 300
##$TE3= 300
##$TEG= 300
##$TL= (0..7)
0 120 120 120 120 120 120 120 
##$TP= (0..7)
150 150 150 150 150 150 150 150 
##$TP07= 0
##$TPNAME0= <>
##$TPNAME1= <>
##$TPNAME2= <>
##$TPNAME3= <>
##$TPNAME4= <>
##$TPNAME5= <>
##$TPNAME6= <>
##$TPNAME7= <>
##$TPOAL= (0..7)
0.5 0.5 0.5 0.5 0.5 0.5 0.5 0.5 
##$TPOFFS= (0..7)
0 0 0 0 0 0 0 0 
##$TUNHIN= 0
##$TUNHOUT= 0
##$TUNXOUT= 0
##$USERA1= <user>
##$USERA2= <user>
##$USERA3= <user>
##$USERA4= <user>
##$USERA5= <user>
##$V9= 5
##$VALIST= <valist>
##$VCLIST= <CCCCCCCCCCCCCCC>
##$VD= 0
##$VDLIST= <DDDDDDDDDDDDDDD>
##$VPLIST= <PPPPPPPPPPPPPPP>
##$VTLIST= <TTTTTTTTTTTTTTT>
##$WBST= 1024
##$WBSW= 4
##$XGAIN= (0..3)
0 0 0 0 
##$XL= 0
##$YL= 0
##$YMAX_a= 653931
##$YMIN_a= -493446
##$ZGOPTNS= <>
##$ZL1= 120
##$ZL2= 120
##$ZL3= 120
##$ZL4= 120
##$ABSF1= 16.522
##$ABSF2= -4.171173
##$ABSG= 5
##$ABSL= 3
##$ALPHA= 0
##$AQORDER= 0
##$ASSFAC= 0
##$ASSFACI= 0
##$ASSFACX= 0
##$ASSWID= 0
##$AUNMP= <proc_1d>
##$AZFE= 0.1
##$AZFW= 0.1
##$BCFW= 0
##$BC_mod= 0
##$BYTORDP= 0
##$COROFFS= 0
##$CY= 12.5
##$DATMOD= 1
##$DC= 0
##$DFILT= <>
##$DTYPP= 0
##$F1P= 14.0000005364418
##$F2P= -0.99999901652339
##$FCOR= 0.5
##$FTSIZE= 32768
##$FT_mod= 6
##$GAMMA= 0
##$GB= 0
##$INTBC= 1
##$INTSCL= 1
##$ISEN= 128
##$LB= 0.3
##$LEV0= 0
##$LPBIN= 0
##$MAXI= 10000
##$MC2= 0
##$MEAN= 0
##$ME_mod= 0
##$MI= 0
##$NCOEF= 0
##$NC_proc= -2
##$NLEV= 6
##$NOISF1= 0
##$NOISF2= 0
##$NSP= 0
##$NTH_PI= 0
##$NZP= 0
##$OFFSET= 16.522
##$PC= 1
##$PHC0= 75.97267
##$PHC1= 5.857308
##$PH_mod= 1
##$PKNL= yes
##$PPARMOD= 0
##$PSCAL= 4
##$PSIGN= 0
##$REVERSE= no
##$SF= 250.13
##$SI= 32768
##$SIGF1= 0
##$SIGF2= 0
##$SINO= 400
##$SIOLD= 32768
##$SREGLST= <1H.CDCl3>
##$SSB= 0
##$STSI= 32768
##$STSR= 0
##$SW_p= 5175.98343685301
##$SYMM= 0
##$S_DEV= 0
##$TDeff= 65536
##$TDoff= 0
##$TI= <Analysis number 999999
Compound Code 99
Book Reference 9
Project Code 9>
##$TILT= no
##$TM1= 0
##$TM2= 0
##$TOPLEV= 0
##$USERP1= <user>
##$USERP2= <user>
##$USERP3= <user>
##$USERP4= <user>
##$USERP5= <user>
##$WDW= 1
##$XDIM= 32768
##$YMAX_p= 461159135
##$YMIN_p= -19943
$$ End of Bruker specific parameters
$$ ---------------------------------
##NTUPLES= NMR SPECTRUM
##VAR_NAME=  FREQUENCY,     SPECTRUM/REAL,   SPECTRUM/IMAG
##SYMBOL=    X,             R,               I
##VAR_TYPE=  INDEPENDENT,   DEPENDENT,       DEPENDENT
##VAR_FORM=  AFFN,          ASDF,            ASDF
##VAR_DIM=   32768,         32768,           32768
##UNITS=     HZ,            ARBITRARY UNITS, ARBITRARY UNITS
##FACTOR=    0.157963299565203, 1,           1
##FIRST=     4132.6476996994, 0,             0
##LAST=      -1043.33573715361, 0,           0
##MIN=       -1043.33573715361, -19943,      0
##MAX=       4132.6476996994, 461159135,     0
$$ Real data points
##PAGE= N=1
##DATA TABLE= (X++(R..R)), XYDATA
$$ [...]
$$ plain form
16983 7250 4528 3415 5067 10095 11931 14239 6738 -537 -2139 -1999 293 551 -1515 -33 4445
16968 4445 6964 5418 6162 10790 9184 6765 5272 11549 11345 9967 10963 7583 4725 4056 5926 6166
16952 6166 6881 10081 10116 10812 15360 14108 9311 5862 5804 1211 3324 6279 6919 7426 10504 11771 9270
16935 9270 7713 9583 7462 4549 6439 8963 6638 6193 6465 8008 10182 9589 4584 2792 3865
16920 3865 6700 8795 9119 9737 14444 14816 9136 4440 3133 4920 6139 8882 5606 5838 11278 9565
16904 9565 8809 6932 4398 5043 5308 4537 1616 2059 6701 9064 7756 9919 6258 4538 7186 2856
16888 2856 308 498 1269 1459 4063 3718 4053 11310 9958 6429 3197 5551 7999 10974 13366 12261
16872 12261 13677 14311 18706 21616 24502 31777 30127 28762 30346 25010 25873 34660 47376 66228
$$ packed form
16983G250k722j113J652N028J836K308p501p275j602J40K292K58k066J482M478
16968D445K519j546P44M628j606k419j493O277k04j378R96l380k858o69J870K40
16952F166P15L200L5O96M548j252m797l449n8m593K113K955O40N07L078J267k501
16935I270j557J870k121k913J890K524k325m45K72J543K174n93n005j792J073
16920C865K835K095L24O18M707L72n680m696j307J787J219K743l276K32N440j713
16904I565p56j877k534O45K65p71k921M43M642K363j308K163l661j720K648m330
16888B856k548J90P71J90K604l45L35P257j352l529l232K354K448K975K392j105
16872A2261J416O34M395K910K886P275j650j365J584n336Q63Q787J2716J8852
$$ plain form
16858 66228 93993 121939 143743 145412 135790 127101 118858 125269 134777 129496 111310 94380 73179
16845 73179 65151 65828 73176 89030 105419 114412 121013 131053 139270 135494 125439 95864 67287
16832 67287 48492 32643 25895 30951 35841 35871 37865 44061 51776 56518 52942 42936 36203 25697
16818 25697 16801 16198 14611 12957 11422 16545 19731 18015 21134 30576 37039 52434 76511 97936
16804 97936 107494 109412 109928 107959 113367 126818 133157 126876 112013 97306 87041 83479 83005 74965
16790 74965 67001 56964 52470 51122 49869 46915 52370 54173 64274 78589 99381 123767 132526
16777 132526 124134 114328 104250 88794 76384 63165 46358 34881 31218 30205 23183 15594 9157
16764 9157 7534 7550 6801 6138 5535 3895 3746 2664 3544 6585 6255 445 -874 594 2566 1410 538
$$ packed form
16858F6228K7765K7946K1804J669r622q689q243O411R508n281j8186j6930k1201
16845G3179q028O77P348J5854J6389Q993O601J0040Q217l776j0055k9575k8577
16832F7287j8795j5849o748N056M890L0J994O196P715M742l576j0006o733j0506
16818B5697q896o03j587j654j535N123L186j716L119R442O463J5395K4077K1425
16804I7936R558J918N16j969N408J3451O339o281j4863j4707j0265l562m74q040
16790G4965p964j0037m494j348j253k954N455J803J0101J4315K0792K4386Q759
16777A32526q392r806j0078j5456j2410j3219j6807j1477l663j013p022p589o437
16764I157j623J6p49o63o03j640j49j082Q80L041l30n810j319J468J972j156q72
$$ plain form
16747 538 3140 1992 -443 -3096 -3951 -3099 -3816 -7590 -6672 -5806 -7285 1056 6636 8131 7453 1225
16731 1225 -1089 1156 2798 4702 5185 5257 10073 10651 8839 689 -4622 95 5764 3478 186 1105
16715 1105 -2050 -3156 -3712 -699 2129 -5205 -9234 -2592 -2726 -3561 -5185 -5450 -1278 -2491 -2080 -6984
16699 -6984 -5123 -133 1605 985 -2006 -1811 525 -444 334 -944 -6072 -7133 -5079 -3689 -1674 -586
16683 -586 -578 -2442 -2691 -5047 -7219 -4869 -2312 -429 -846 -6922 -11137 -12611 -13574 -10529 -8410 -7043
16667 -7043 -1923 -724 -2739 -5798 -7691 -6152 -470 -4062 -11015 -14324 -13546 -13968 -10520 -7282 -2236
16652 -2236 184 -2540 -3173 451 -3435 -5501 -4127 -885 4324 4953 4297 8344 9414 9527 7072 10078
16636 10078 5548 941 -2198 937 1478 953 -1805 -1679 -3507 -2272 -2069 -3152 -5512 -4284 4897
$$ packed form
16747E38K602j148k435k653q55Q52p17l774R18Q66j479Q341N580J495o78o228
16731A225k314K245J642J904M83P2M816N78j812q150n311M717N669k286l292R19
16715A105l155j106n56L013K828p334m029O642j34q35j624k65M172j213M11m904
16699f984J861M990J738o20k991J95K336r69P78j278n128j061K054J390K015J088
16683e86Qj864k49k356k172K350K557J883m17o076m215j474r63L045K119J367
16667g043N120J199k015l059j893J539N682l592o953l309P78m22L448L238N046
16652b236K420k724o33L624l886k066J374L242N209O29o56M047J070J13k455L006
16636A0078m530m607l139L135N41n25k758J26j828J235K03j083k360J228R181
$$ plain form
16621 4897 1663 2128 1746 4475 4211 270 -1548 -2859 5775 9019 7165 7699 8534 3272 2359 244
16605 244 -3463 -3869 -1486 2870 2537 2180 -1353 1937 6214 6155 2742 303 -940 -1859 -170 587 171
16588 171 -2122 -3211 -4119 -2904 -3613 -4411 -7187 -7568 -1425 -872 -718 -2737 -497 111 -2051 -7136 -2601
16571 -2601 155 -507 122 -3659 -6670 -2755 252 -846 624 4978 5616 3240 -1158 -2279 -1773 1779
16555 1779 2823 5656 1583 -5852 -10532 -7009 -2591 -1404 2178 -1522 -2865 -6950 -2991 410 391
16540 391 -1817 -3099 -348 503 1155 1977 271 -2769 -5202 -8232 -3739 -1724 -254 -1223 -4665 -6857
16524 -6857 -2113 2453 67 -5845 -5806 -5483 -1574 4422 2646 -3421 -4877 -5637 -4912 -550 -4107 -5908
16508 -5908 -3196 -2193 -720 5637 4051 -2489 -1042 -2130 -1922 -3112 -4821 -9098 -7745 -5051 -5824
$$ packed form
16621D897l234M65l82K729k64l941j818j311Q634L244j854N34Q35n262r13k115
16605B44l707m06K383M356l33l57l533L290M277n9l413k439j243r19J689P57m16
16588A71k293j089r08J215p09p98k776l81O143N53J54k019K240O08k162n085M535
16571b601K756o62O29l781l011L915L007j098J470M354O38k376m398j121N06L552
16555A779J044K833m073p435m680L523M418J187L582l700j343m085L959L401j9
16540C91k208j282K751Q51O52Q22j706l040k433l030M493K015J470r69l442k192
16524f857M744M566k386n912L9L23L909N996j776o067j456p60P25M362l557j801
16508e908K712J003J473O357j586o540J447j088K08j190j709m277J353K694p73
$$ plain form
16493 -5824 -1511 2403 6120 8260 8483 6012 5462 2532 -5193 -6077 -3944 -4265 -5433 1068 380 917
16477 917 1176 -1275 663 711 -956 491 2223 3093 2298 1888 -3334 -642 2807 1380 -1855 -4973
16461 -4973 -7168 -6570 -5834 -6579 -4659 -3338 -2627 740 4594 162 -2150 -2935 -6203 -6939 -3382 -316
16445 -316 1727 1272 401 -1530 -2022 -1224 57 -1843 -6009 -5885 -5894 -5645 -7349 -8265 -7565 -9676 -5514 2389
16427 2389 3748 3232 -735 -2266 -1159 1693 -691 -1664 1864 649 -3283 -2450 -1360 -1002 -1088 1472
16411 1472 1298 392 627 1737 4103 2032 182 1622 1084 -1113 2130 1349 -1382 -4333 -6464 -7645
16395 -7645 -1047 2989 -4611 -6925 -1498 -2151 -6933 -3696 -2584 492 -120 499 1348 0 -5328 -1288
16379 -1288 2103 759 -2326 3364 2535 -6354 -11053 -9274 -7580 -5418 1047 5500 3488 251 -36
$$ packed form
16493e824M313L914L717K140K23k471n50k930p725q84K133l21j168O501o88N37
16477I17K59k451J938M8j667J447J732Q70p95m10n222K692L449j427l235l118
16461d973k195N98P36p45J920J321P11L367L854m432k312p85l268p36L557L066
16445c16K043m55q71j931m92P98J281j900m166J24rK49j704r16P00k111M162P903
16427B389J359n16l967j531J107K852k384r73L528j215l932Q33J090L58q6K560
16411A472j74r06K35J110K366k071j850J440n38k197L243p81k731k951k131j181
16395g645O598M036p600k314N427o53m782L237J112L076o12O19Q49j348n328M040
16379a288L391j344l085N690q29q889m699J779J694K162O465M453k012l237k87
$$ plain form
16364 -36 2347 2365 4075 4162 5559 659 -873 219 2486 1563 1516 3167 4846 5955 5926 5547 8590 10217
16346 10217 7000 5493 2920 2762 1622 -435 -5553 -7653 -1599 -199 285 2942 2658 2143 741
16331 741 -101 898 -372 -2124 -3283 -2493 884 -584 -5757 -4313 -4821 -3754 269 5945 6060 3488
16315 3488 2305 3 -4362 -4655 -6906 -2366 -2231 -76 -3108 -2322 -1908 -1483 3103 1876 -115 -2484
16299 -2484 -4300 -1649 -2438 -10128 -7885 -10568 -12399 -7963 -6154 -7517 -4064 972 1258 3350 274
16284 274 1608 -648 -1164 1904 -3482 -6385 -2822 -2689 -5023 -4677 -5369 -9603 -8660 -7958 -4075 -665
16268 -665 -3319 -4810 373 3809 6044 6104 4639 2012 -2130 -2563 -1479 -1258 -994 -7012 -8169 -5546
16252 -5546 -475 628 -388 -3244 -1218 2230 2468 2465 -1238 -3296 -3330 1582 3823 3852 1917 5169 4616
$$ packed form
16364c6K383J8J710Q7J397m900j532J092K267r23m7J651J679J109k9l79L043J627
16346A0217l217j507k573j58j140k057n118k100O054J400M84K657k84n15j402
16331G41q42R99j270j752j159P90L377j468n173J444n08J067M023N676J15k572
16315C488j183k302m365k93k251M540J35K155l032P86M14M25M586j227j991k369
16299b484j816K651p89p690K243k683j831M436J809j363L453N036K86K092l076
16284B74J334k256n16L068n386k903L563J33k334L46o92m234R43P02L883L410
16268f65k654j491N183L436K235O0j465k627m142m33J084K21K64o018j157K623
16252e546N071J103j016k856K026L448K38ll703k058l4M912K241K9j935L252n53
$$ plain form
16235 4616 6360 7182 3293 -2671 -4105 -2318 -910 1616 -1243 3698 2393 -4244 -7394 -4113 -3703
16220 -3703 -8019 -2789 7405 8829 4094 3301 -2831 -8307 -6667 1034 -1455 2321 3862 1485 5004
16205 5004 3658 764 -5067 -2700 -474 -115 180 -844 -1822 -2984 -927 857 -1053 -4589 -7241
16190 -7241 -9106 -4289 -2661 -2851 806 2463 -3166 -5550 -5160 -2895 1306 3310 244 -2562 1985
16175 1985 2122 1926 1268 -4017 -8704 -3816 1076 5158 5503 6463 5824 3310 3065 1535 -2612 2087
16159 2087 5884 3242 1758 1429 -317 -3244 -512 -6509 -11469 -5297 1925 6518 5439 -2678 -8000
16144 -8000 -8183 -8200 -11947 -11462 -5037 -4780 -5071 -2207 398 2414 1243 2496 704 -415 -1560 -522
16128 -522 -3096 511 3441 -1526 -2192 -3382 -6019 -5284 -3139 -4648 -7854 -7461 -4379 -1922 -4623 -8701
$$ packed form
16235D616J744Q22l889n964j434J787J408K526k859M941j305o637l150L281M10
16220c703m316N230J0194J424m735p93o132n476J640P701k489L776J541k377L519
16205E004j346k894n831K367K226L59K95j024r78j162K057J784j910l536k652
16190g241j865M817J628j90L657J657n629k384L90K265M201K004l066k806M547
16175A985J37j96o58n285m687M888M892M082L45R60o39k514k45j530m147M699
16159B087L797k642j484l29j746k927K732n997m960O172P222M593j079q117n322
16144h000j83j7l747M85O425K57k91K864K605K016j171J253j792j119j145J038
16128e22k574L607K930m967o66j190k637P35K145j509l206L93L082K457k701m078
$$ plain form
16112 -8701 -10787 -10973 -8229 -12746 -13420 -14787 -16657 -10820 -5029 -697 1688 -22 -6967 -5817 -4756
16097 -4756 -3899 -698 235 -1861 -6849 -6779 -5503 -6606 -5501 -5620 -4798 1596 6945 8747 9305 10706
16081 10706 6809 2813 2973 -3853 -2178 -1817 -2813 -2392 -3257 -3375 -2189 -1503 -2108 -2697 -139 1597 -642
16064 -642 -1505 -999 -1111 -3799 -299 3636 2918 939 480 3263 6480 7092 245 598 4316 4387 6816
16047 6816 4227 379 -2688 125 -6053 -8502 -9485 -3908 -1470 -4220 -7471 -1730 -1951 -5329 -5750
16032 -5750 -5235 -5300 -7412 -9408 -5184 -1324 -217 -2276 -1198 -403 -41 2651 -652 -427 -118 -3863
16016 -3863 -6968 -9546 -11983 -8680 -4950 -3346 -1754 -2915 -5643 -3090 -1368 -2960 -4233 -3244 -137
16001 -137 1689 -1412 1133 2336 2083 114 -6649 -6812 -4356 -6245 -4412 -1531 -4301 -755 2195
$$ packed form
16112h701k086j86K744m517o74j367j870N837N791M332K385j710o945J150J061
16097d756Q57L201R33k096m988P0J276j103J105j19Q22O394N349J802N58J401
16081A0706l897l996J60o826J675L61r96M21q65j18J186O86o05n89K558J736k239
16064f42q63N06j12k688L500L935p18j979m59K783L217O12o847L53L718P1K429
16047F816k589l848l067K813o178k449r83N577K438k750l251N741k21l378m21
16032e750N15o5k112j996M224L860J107k059J078P95L62K692l303K25L09l745
16016c863l105k578k437L303L730J604J592j161k728K553J722j592j273R89L107
16001a37J826l101K545J203k53j969o763j63K456j889J833K881k770L546K950
$$ plain form
15986 2195 4819 4279 -715 -3131 2028 -1527 -5492 -5406 -5778 -9233 -7609 -2331 898 1408 -1496 -4038
15970 -4038 -4407 -4328 -4829 -5097 -4734 -1982 -6220 -6973 -2565 -5595 -8702 -11045 -14901 -13023 -9467 -2719
15954 -2719 2624 6581 1479 893 2654 1945 1483 -1330 -2906 -3530 -2548 2107 1251 1393 1473 1959 6548
15937 6548 5429 2215 3030 4883 3782 1605 -3808 -6171 -8462 -4299 22 -2000 -6637 -6829 -3052
15922 -3052 -4529 -6291 -3105 -1950 -458 -4980 -9704 -14349 -16430 -14874 -10372 -4384 -5447 -9100 -9988
15907 -9988 -7754 -7951 -14336 -14582 -13617 -9628 -5940 -6536 -10914 -7318 -4008 -5350 -8461 -9635 -6019 528
15891 528 -1030 957 2329 -581 -982 -1590 -7118 -8093 -5812 -2540 -2057 -1179 -1860 -3863 -1819 -4230
15875 -4230 -851 5913 6360 2429 -4086 -5320 -7631 -3280 -2246 -1703 2643 4079 695 -1957 -4086
$$ packed form
15986B195K624n40m994k416N159l555l965Q6l72l455J624N278L229N10k904k542
15970d038l69P9n01k68L63K752m238p53M408l030l107k343l856J878L556O748
15954b719N343L957n102n86J761p09m62k813j576o24R82M655q56J42Q0M86M589
15937F548j119l214Q15J853j101k177n413k363k291M163M321k022m637j92L777
15922c052j477j762L186J155J492m522m724m645k081J556M502N988j063l653q88
15907i988K234j97o385k46R65L989L688n96m378L596L310j342l111j174L616O547
15891E28j558J987J372k910m01o08n528r75K281L272M83Q78o81k003K044k411
15875d230L379O764M47l931o515j234k311M351J034N43M346J436l384k652k129
$$ plain form
15860 -4086 -3329 1050 1283 -1448 -2884 109 3414 2720 1082 848 -2624 -2422 -3809 -2407 -5983 -13579
15844 -13579 -16291 -15650 -10294 -6868 -4769 -6863 -7645 -6392 -5211 -2859 3444 1501 -4769 -5575 -3711
15829 -3711 -6449 -7531 -6603 -5487 -2881 -2996 -3423 -2919 -250 -76 -2705 246 -1473 1227 2111 -95
15813 -95 -1563 -3752 -917 2463 4737 6686 3890 -6080 -6432 -8419 -10754 -13171 -14664 -11268 -6454
15798 -6454 -6430 -10589 -10419 -6141 -1228 -1033 -6033 -2401 3347 2081 -1883 -6816 -5384 -10121 -11500 -10164
15782 -10164 -8791 -4249 -587 1673 -2078 -5669 -8040 -7990 -5378 -1285 -1522 -4880 -3965 -4685 -4438 -5445
15766 -5445 -8469 -6604 -6398 -13026 -18471 -19267 -14048 -14088 -12773 -9970 -3455 -1097 -5030 -9007 -8114 -4283
15750 -4283 -7179 -10339 -9872 -10182 -10059 -6888 -8045 -9704 -6444 6 -2270 -9544 -7128 -1470 1990
$$ packed form
15860d086P57M379K33k731j436K993L305o94j638k34l472K02j387J402l576p596
15844a3579k712O41N356L426K099k094p82J253J181K352O303j943o270q06J864
15829c711k738j082R28J116K606j15m27N04K669J74k629K951j719K700Q84k206
15813i5j468k189K835L380K274J949k796r970l52j987k335k417j493L396M814
15798f454K4m159J70M278M913J95n000L632N748j266l964m933J432m737j379J336
15782a0164J373M542L662K260l751l591k371N0K612M093k37l358R15p20K47j007
15766e445l024J865K06o628n445p96N219m0J315K803O515K358l933l977Q93L831
15750d283k896l160M67l10J23L171j157j659L260O450k276p274K416N658L460
$$ plain form
15735 1990 2543 3893 5685 1667 -3195 -4050 -3631 -1512 -4283 -4117 -2969 -3114 -1553 4103 6320 5618
15719 5618 2725 3509 6780 1070 -5027 -4171 -4936 -2037 3616 4732 418 71 -279 -4594 -3449 -4959
15703 -4959 -3753 -5914 -7446 -4571 -3048 2419 5649 5975 4955 -113 -1523 -3701 -9650 -3729 -66
15688 -66 -3769 -609 -1028 -6642 -11346 -4018 -5181 -9770 -11024 -6532 -1396 -1678 -2881 -135 75 -172
15672 -172 2056 632 -2591 -4980 -3117 -7342 -8006 -8343 -11317 -15941 -11299 -6900 -6573 -5584 -3596 -1936
15656 -1936 -3317 -4655 -1148 2192 -5834 -5633 -214 -80 -5231 -5312 -1065 -2691 -1787 722 -1662 -7890
15640 -7890 -7551 -2131 -3312 -5961 -3924 2519 3616 8034 10621 8280 2524 502 2758 1572 -2117
15625 -2117 -4751 -5268 -4799 -3282 -7414 -7738 -7260 -9852 -8238 -7780 -4118 -2341 -2999 -5466 -2380 -2262
$$ packed form
15735A990N53J350J792m018m862q55M19K119k771J66J148j45J561N656K217p02
15719E618k893P84L271n710o097Q56p65K899N653J116m314l47l50m315J145j510
15703d959J206k161j532K875J523N467L230L26j020n068j410k178n949N921L663
15688f6l703L160m19n614m704P328j163m589j254M492N136k82j203K746K10k47
15672a72K228j424l223k389J863m225o64l37k974m624M642M399L27R89J988J660
15656a936j381j338L507L340q026K01N419J34n151q1M247j626R04K509k384o228
15640g890L39N420j181k649K037O443J097M418K587k341n756k022K256j186l689
15625b117k634n17M69J517m132l24M78k592J614M58L662J777o58k467L086J18
$$ plain form
15609 -2262 -2539 -4278 -4956 -8270 -7091 -6068 -6808 -4919 -3075 -3362 -6620 -9933 -5963 -3585 -5945 -5159
15593 -5159 -3519 -3526 -542 -2295 -2284 921 -85 -2201 -2755 -2810 1834 3571 1190 3136 3081 5546 8300
15576 8300 5140 -2229 -1286 2876 1135 -3305 -5076 -3137 -3190 -4043 -5607 -6202 -3118 -4717 407 1912
15560 1912 2820 2963 2679 2966 3108 3518 -2215 506 -1272 -2543 3038 2321 620 -644 -461 4294 5661
15543 5661 854 3263 3871 8234 16128 21579 24042 13698 5609 2143 -1167 -2158 -2986 -5476 -9840
15528 -9840 -9384 -8456 -6522 -7783 -8222 -5645 -482 5781 867 -5926 -4761 -2830 -4105 -5679 -5403 -10400
15512 -10400 -14253 -16374 -14467 -9416 -3726 -3072 -5829 -8173 -8025 -5944 -2885 -3633 -5249 -4142 -5555
15497 -5555 -6275 -3949 -2768 -1087 1618 2890 1078 -2276 -5994 -8667 -8360 -7146 -6967 -3915 1714
$$ packed form
15609b262k77j739o78l314J179J023p40J889J844k87l258l313L970K378k360P86
15593e159J640pK984j753J1L205j006k116n54n5M644J737k381J946n5K465K754
15576H300l160p369R43M162j741m440j771J939n3q53j564n95L084j599N124J505
15560A912R08J43k84K87J42M10n733K721j778j271N581p17j701j264J83M755J367
15543E661m807K409O08M363P894N451K463j0344q089l466l310r91q28k490m364
15528i840M56R28J934j261m39K577N163O263m914o793J165J931j275j574K76m997
15512a0400l853k121J907N051N690O54k757k344J48K081L059p48j616J107j413
15497e555p20K326J181J681K705J272j812l354l718k673L07J214J79L052N629
$$ plain form
15482 1714 3532 2784 -716 -2863 -2152 -4506 -8867 -5749 -2467 3301 4868 1460 115 -270 -3287
15467 -3287 -2321 1527 2886 1310 1005 -2208 -225 3379 8318 8215 2846 -217 -124 -706 -5491 -5509 -4302
15450 -4302 1308 -388 -6962 -9902 -7970 277 2011 -3278 -8757 -8413 -6260 -2168 -1060 -2550 -1090
15435 -1090 -1708 -2558 -1455 -3552 -2407 -5065 -10904 -10394 -10104 -14042 -10238 -6383 944 -67 -2351 -2786
15419 -2786 -4840 -6198 -3990 -4091 -7952 -9163 -8618 -5733 -304 -2130 -5905 -9232 -7944 -1624 -531
15404 -531 -5252 -4783 -2628 -5122 -7845 -7393 -5997 -5603 -1136 -3063 -8255 -8279 -4153 -3778 -5415 -4549 -2970
15387 -2970 -3947 -3254 -500 -601 -932 -1197 -2940 -64 -2354 -2809 -591 -1589 -1311 119 -1984 -2104 2040
15370 2040 6151 4203 559 -1373 -3907 -5723 -5109 -6418 -11103 -13075 -9950 -5928 -3182 -3218 -4716
$$ packed form
15482A714J818p48l500k147P11k354m361L118L282N768J567l408j345l85l017
15467c287R66L848J359j576l05l213J983L604M939j03n369l063R3n82m785j8J207
15450d302N610j696o574k940J932Q247J734n289n479L44K153M092J108j490J460
15435a090o18q50J103k097J145k658n839N10K90l938L804L855P327j011k284m35
15419b786k054j358K208j01l861j211N45K885N429j826l775l327J288O320J093
15404e31m721M69K155k494k723M52J396L94M467j927n192k4M126L75j637Q66J579
15387b970r77O93K754j01l31k65j743K876k290m55K218r98K78J430k103j20M144
15370B040M111j948l644j932k534j816O14j309m685j972L125M022K746l6j498
$$ plain form
15355 -4716 -3410 -4253 -3515 -4540 -4489 -3080 -3139 -5416 -4738 -4820 -6794 -2947 -1222 -6349 -8494 -11424 -8356
15338 -8356 -4647 -268 6218 10388 6902 609 1141 2170 1702 -988 -1183 -735 277 3029 1411 -3201
15322 -3201 -3528 285 -1329 -2962 -5970 -6583 -7864 -7630 -5773 -8713 -10184 -7115 -8189 -14051 -10563
15307 -10563 -7618 -5751 -5241 -4452 -99 -876 -59 -940 -5204 -9954 -8796 -9711 -11350 -8046 -7760 -8538
15291 -8538 -6205 -1599 -3187 -50 -1856 -3807 -2621 507 2356 -610 -3229 -5307 -6591 -2161 -671
15276 -671 -1518 -7133 -9989 -14444 -11911 -12444 -8528 -2571 -1510 10 1636 -5344 -9603 -7755 -6836 -10113
15260 -10113 -9451 -3503 -5003 -3117 -1064 2515 6859 394 -5654 -7792 -5023 -118 2081 -278 144
15245 144 -949 -7749 -7011 -1523 2483 4927 4116 -1266 -2784 -4658 -7752 -4189 -2703 -712 -5728
$$ packed form
15355d716J306q43P38j025N1J409n9k277O78q2j974L847J725n127k145k930L068
15338h356L709M379O486M170l486o293N32J029m68k690j95M48J012K752j618m612
15322c201l27L813j614j633l008o13j281K34J857k940j471L069j074n862L488
15307a0563K945J867N10P89M353p77Q17q81m264m750J158r15j639L304K86p78
15291h538K333M606j588L137j806j951J186L128J849k966k619k078j284M430J490
15276f71q47n615k856m455K533n33L916N957J061J520J626o980m259J848R19l277
15260a0113O62N948j500J886K053L579M344o465o048k138K769M905K199k359M22
15245A44j093o800P38N488M006K444q11n382j518j874l094L563J486J991n016
$$ plain form
15230 -5728 -7431 -7652 -7051 -4558 -5794 -10127 -7428 -299 2527 1364 -2228 -7111 -4202 -7346 -5644
15215 -5644 -4945 -2803 -1065 -1254 -2409 -1559 143 592 2218 -1444 -6997 -9878 -9802 -3777 -1285 -1488
15199 -1488 -1716 -1781 -5490 -6115 -3561 -16 -1619 -9280 -6971 -4997 -3531 2387 3177 -1420 -223 -902
15183 -902 -1277 1126 -1234 336 190 -1657 -3787 -3996 -1980 25 701 -1346 -1932 -2415 486 3876
15167 3876 2056 103 421 8474 5331 3123 317 2950 884 277 1761 2960 -342 -1092 -680 -4145
15151 -4145 -6217 -1680 1923 7591 8923 9221 8508 3086 954 -1151 -4514 -3268 828 -80 -4259
15136 -4259 -3287 -1263 1716 -154 -3084 -5471 -1434 1059 1538 -2209 -1983 -353 1731 -1533 -4516
15121 -4516 -3512 -1733 355 1575 361 -3653 -4129 -5727 -6979 -5703 -4254 -2622 -426 -2470 -6645
$$ packed form
15230e728j703k21O01K493j236m333K699P129K826j163l592m883K909l144J702
15215e644O99K142J738j89j155Q50J702M49J626l662n553k881P6O025K492k03
15199a488k28o5l709o25K554L545j603p661K309J974J466N918P90m597J197o79
15183i02l75K403k360J570j46j847k130k09K016K005O76k047n86m83K901L390
15167C876j820j953L18Q053l143k208k806K633k066o07J484J199l302p50M12l465
15151d145k072M537L603N668J332K98p13n422k132k105l363J246M096r08m179
15136d259R72K024K979j870k930k387M037K493M79l747K26J630K084l264k983
15121d516J004J779K088J220j214m014m76j598j252J276J449J632K196k044m175
$$ plain form
15106 -6645 -3524 -2851 -1496 3179 7584 7061 3981 -1082 -1252 186 -4701 -5284 -1109 -2535 -4363 -7738
15090 -7738 -8159 -4971 651 -637 -3880 -3400 -951 -3442 802 4045 2124 -2164 -5943 -10489 -8392
15075 -8392 -5756 1156 4747 1475 -2250 -2042 -4567 -7614 -6310 -4830 -8532 -4686 -3458 -5096 -3660
15060 -3660 790 -1464 -6902 -7035 -2306 513 1530 -756 -6539 -10464 -10036 -6251 -1312 -939 316
15045 316 -1568 2427 3046 3318 -685 -3656 -4264 -1111 2214 3606 1460 -1577 1112 4163 3783 1699
15029 1699 -837 2280 1982 1894 3231 1972 2485 1444 3104 3834 3611 -4121 -2640 8340 12089 12689
15013 12689 9785 7417 6054 4209 6315 11306 12308 13819 18961 20491 24138 29049 29880 32039 39460
14998 39460 46908 53686 61043 64189 71701 81329 96081 117254 141750 179318 229274 306440 433922
$$ packed form
15106f645L121O73J355M675M405n23l080n063j70J438m887n83M175j426j828l375
15090g738m21L188N622j288l243M80K449k491M244L243j921m288l779m546K097
15075h392K636O912L591l272l725K08k525l047J304J480l702L846J228j638J436
15060c660M450k254n438j33M729K819J017k286n783l925M28L785M939L73J255
15045C16j884L995O19K72m003k971o08L153L325J392k146l037K689L051l80k084
15029A699k536L117k98q8J337j259N13j041J660P30k23p732J481J0980L749O00
15013A2689k904k368j363j845K106M991J002J511N142J530L647M911Q31K159P421
14998C9460P448O778P357L146P512R628J4752K1173K4496L7568M9956P7166J27482
$$ plain form
14985 433922 638466 980429 1598369 2671872 4024449 4334488 3460610 2225595 1305857
14976 1305857 796302 526585 374660 277105 218020 179428 148435 123204 101029 80074 66205
14965 66205 57261 50175 50951 49764 43651 40949 35740 30508 31855 30743 27061 26603 24242 25649 22582
14950 22582 13872 7440 6411 5901 7619 4582 6011 6822 9115 8778 9728 8246 5112 5080 6061 2562
14934 2562 4170 9379 11117 10609 8690 5663 1524 -4562 -6136 -1016 2780 7681 9128 5798 -618
14919 -618 -1405 -1549 -6257 -6348 -2695 -5477 -3320 -616 -700 2650 6752 4324 3822 1615 -483 -2202 -3629
14902 -3629 -1548 1374 3521 4724 2814 1186 -757 -700 457 5236 7682 4817 959 3415 5904
14887 5904 10902 7692 1980 -5833 -4241 -3231 3660 4358 2083 -880 1091 1875 6562 6979 4810
$$ packed form
14985D33922K04544L41963O17940J073503J352577L10039q73878j235015r19738
14976A305857n09555k69717j51925r7555n9085l8592l0993k5231k2175k0955j3869
14965F6205q944p086P76j187o113k702n209n232J347j112l682m58k361J407l067
14950B2582q710o432j029n10J718l037J429Q11K293l37R50j482l134l2R81l499
14934B562J608N209J738n08j919l027m139o086j574N120L796M901J447l330o416
14919f18p87j44m708r1L653k782K157K704q4L350M102k428n02k207k098j719j427
14902c629K081K922K147J203j910j628j943N7J157M779K446k865l858K456K489
14887E904M998l210n712p813J592J010O891O98k275k963J971P84M687M17k169
$$ plain form
14872 4810 2931 -2300 -7753 -8686 -6239 -6722 -3524 2075 2564 -2535 -8585 -8423 -7026 -7146 -3270 1165
14856 1165 5163 3496 2204 3977 5230 3309 2766 2723 2108 3714 7903 4205 4839 676 2148 2713
14840 2713 3904 3795 1775 -3211 -5925 -6393 -6353 -2251 28 3327 2739 -573 -2095 -3013 -4494 -3684
14824 -3684 -4799 722 3285 925 1075 -972 -4683 -688 -4384 -8535 -11225 -10456 -5358 -7163 -6691
14809 -6691 -5604 -1650 -3293 -4879 -2968 -2658 -4177 -4661 -2209 -4989 -5879 -6340 -9456 -7181 -9768 -10220
14793 -10220 -10824 -10540 -7369 -3233 -3142 -354 1922 2957 2361 5544 4931 6483 6033 3636 -1150 -1542
14777 -1542 -3179 991 -287 -1450 319 2675 2310 -2201 -28 1653 -1413 -4051 -4210 -10460 -13486
14762 -13486 -15730 -13554 -14192 -11389 -9512 -10261 -8826 -6771 -8204 -14949 -11919 -8291 -6713 -4832 -7383
$$ packed form
14872D810j879n231n453r33K447m83L198N599M89n099o050J62J397j20L876M435
14856A165L998j667j292J773J253j921n43m3o15J606M189l698O34m163J472N65
14840B713J191j09k020m986k714m68M0M102K279L299n88l312j522r18j481Q10
14824c684j115N521K563k360J50k047l711L995l696m151k690P69N098j805M72
14809f691J087L954j643j586J911L10j519m84K452k780q90m61l116K275k587m52
14793a0220o04K84L171M136R1K788K276J035n96L183o13J552m50k397m786l92
14777a542j637M170j278j163J769K356l65m511K173J681l066k638j59o250l026
14762a3486k244K176o38K803J877p49J435K055j433o745L030L628J578J881k551
$$ plain form
14747 -7383 -7726 -2222 -2469 -3170 -768 1499 3304 2647 -2141 694 -2080 -1248 2247 473 -1163 -5867
14731 -5867 -12043 -10884 -5880 -7213 -7357 -6659 -8640 -10724 -8064 -4231 -3858 -1182 -267 -629 -3759 -3652
14715 -3652 -2151 -2231 -15 -1807 -392 4321 4794 4552 6908 4420 -696 -3153 -5609 -8133 -4714 -4432
14699 -4432 -185 2482 4109 4592 3587 1599 -2834 -5093 -5286 -6470 -5384 -5855 -3853 -4255 -6134 -4498
14683 -4498 -217 3731 2071 -1081 -4138 -3504 -1161 -3293 -5452 -3863 -2755 -4630 -5193 -5229 -5393 -6501
14667 -6501 -6514 -3395 -5398 -4338 -5768 -6365 -5976 -5204 -6433 -3721 -4791 -2084 -2991 -1563 265 633
14651 633 2246 1390 747 -4825 -7341 -9165 -4526 -3509 -4590 -1505 -1159 1103 -3071 -6065 -7400 -11031
14635 -11031 -10816 -5895 -4136 -275 -2957 -7539 -8637 -1125 -2287 -7781 -10111 -9912 -7906 -6302 -5295
$$ packed form
14747g383l43N504k47p01K402K267J805o57m788K835k774Q32L495j774j636m704
14731e867o176J159N004j333j44O98j981k084K660L833L73K676R15l62l130J07
14715c652J501q0K216j792J415M713M73k42K356k488n116k457k456k524L419K82
14699d432M247K667J627M83j005j988m433k259j93j184J086m71K002m02j879J636
14683d498M281L948j660l152l057O34K343k132k159J589J108j875n63l6j64j108
14667f501j3L119k003J060j430n97L89P72j229K712j070K707r07J428J828L68
14651F33J613q56o43n572k516j824M639J017j081L085L46K262m174k994j335l631
14635a1031K15M921J759L861k682m582j098P512j162n494k330J99K006J604J007
$$ plain form
14620 -5295 -7535 -8310 -7815 -13833 -16066 -14069 -7908 -7174 -4813 -7371 -10993 -9717 -8664 -13211 -11725
14605 -11725 -12120 -8827 -7755 -5339 -3804 -5217 -8691 -8088 -1366 2694 -174 3459 886 -2563 187
14590 187 432 6709 9170 5434 3971 1697 -523 -2977 -458 6859 5487 2839 3108 1222 2621
14575 2621 4119 3684 3805 3136 1850 -634 1302 -847 270 4726 4040 6 -3594 -8000 -7438 -9042
14559 -9042 -9065 -6696 -599 3581 6734 3963 -1097 -5916 -4927 -3382 -4010 -3785 -1426 3168 5037 -17
14543 -17 295 -2069 -8699 -7851 -2142 3164 2987 -3381 -5066 -6148 -3205 -1124 -4324 -6427 -8275 -7893
14527 -7893 -2438 -5601 -9786 -9566 -9037 -7575 -2997 257 1005 -4091 -9737 -10374 -8355 -6330 -8047 -5830
14511 -5830 260 -1009 -1668 3630 2770 -2728 -7482 -4702 -5753 -6380 -8339 -4807 -3536 -1593 -1076 -4813
$$ packed form
14620e295k240p75M95o018k233J997O161P34K361k558l622J276J053m547J486
14605a1725l95L293J072K416J535j413l474O03O722M060k868L633k573l449K750
14590A87K45O277K461l736j463k274k220k454K519P317j372k648K69j886J399
14575B621J498m35J21o69j286k484J936k149J117M456o86m034l600m406N62j604
14559i042k3K369O097M180L153k771n060m819R89J545o28K25K359M594J869n054
14543a7L12k364o630Q48N709N306j77o368j685j082K943K081l200k103j848L82
14527g893N455l163m185K20N29J462M578L254P48n096n646o37K019K025j717K217
14511e830O090j269o59N298q60n498m754K780j051o27j959L532J271J943N17l737
$$ plain form
14495 -4813 -7001 -3110 -3118 -5116 -5860 -3840 -6256 -6260 -2829 -4482 -5353 -2060 -939 400 -1627 -544 6122
14478 6122 1557 1096 -139 1368 -467 -178 -3509 -6824 -5463 -6480 -11143 -14301 -11071 -7050 -4117
14463 -4117 -1769 717 2264 2954 647 -1234 -4052 -3851 -3054 -2325 -5184 -11845 -12308 -8261 -3562 -2859
14447 -2859 -5297 -10144 -10583 -6665 -8564 -9545 -2732 -5753 -10137 -8296 -1619 1387 -6750 -11228 -7878
14432 -7878 -3322 -2065 -6368 -5704 -8351 -10676 -15010 -10906 -6527 -2287 -836 -3093 -2228 -3303 -1599
14417 -1599 7861 15556 23827 23194 17319 5904 -32 -2476 -4049 -1859 -855 -1524 -3138 -6209 -9403
14402 -9403 -14571 -12476 -7798 -6962 -4464 -3815 -847 -4834 -5283 -4973 -5740 -3559 -3848 -7710 -3138 -4333
14386 -4333 -7098 -9847 -7113 -3612 -3657 -6331 -7959 -10201 -9948 -7358 -6147 -2895 -4801 -3538 -1220
$$ packed form
14495d813k188L891qj998p44K020k416mL431j653q71L293J121J339k027J083O666
14478F122m565m61j235J507j835K89l331l315J361j017m663l158L230M021K933
14463d117K348K486J547O90k307j881k818K01P97P29k859o661m63M047M699P03
14447b859k438m847m39L918j899r81O813l021m384J841O677L006q137m478L350
14432g878M556J257m303O64k647k325m334M104M379M240J451k257Q65j075J704
14417a599R460P695Q271o33n875j1415n936k444j573K190J004o69j614l071l194
14402i403n168K095M678Q36K498O49K968l987m49L10p67K181k89l862M572j195
14386d333k765k749K734L501m5k674j628k242K53K590J211L252j906J263K318
$$ plain form
14371 -1220 2097 1147 -3262 -4212 -1204 84 -554 -3005 -5485 -6005 -4765 -3396 -922 1065 -584 -326
14355 -326 -2945 -1616 -1380 -3041 -7410 -9969 -6696 -1910 -3298 -7034 -4144 -3583 -2816 -2167 -1722 -3996
14339 -3996 -2377 748 3029 3057 459 -1793 5494 4540 -2558 -3551 -5064 -6384 -6368 -4496 -4039 -5789
14323 -5789 -5195 -467 -23 -2255 -3289 -7669 -8486 -7249 -4393 -1976 -24 -1178 -889 -5117 -8650 -10836
14307 -10836 -7396 -6967 -5283 -5269 -7624 -7747 -4799 -2078 -4730 -7757 -11225 -7823 -4530 -5957 -5307 -1968
14291 -1968 -726 546 -1964 -4937 -2504 -3275 -3660 -5451 -5820 -3911 2387 3377 1672 2862 2515 -1580
14275 -1580 -7407 -5515 -2344 -4800 -10992 -9615 -5043 -4212 -2886 -3095 -4278 -708 -799 -1783 -4894 -9582
14259 -9582 -5325 -5309 -5054 -5103 -4783 -6339 -7610 -6642 -6834 362 -355 -1839 -1329 479 -3018 -3614 -1898
$$ packed form
14371a220L317r50m409r50L008J288o38k451k480n20J240J369K474J987j649K58
14355c26k619J329K36j661m369k559L273M786j388l736K890N61P67O49M45k274
14339c996J619L125K281K8k598k252P287r54p098r93j513j320J6J872M57j750
14323e789N94M728M44k232j034m380q17J237K856K417J952j154K89m228l533k186
14307a0836L440M29J684J4k355j23K948K721k652l027l468L402L293j427O50L339
14291a968J242J272k510k973K433p71l85j791l69J909O298R90j705J190l47m095
14275a580n827J892L171k456o192J377M572Q31J326k09j183L570r1r84l111m688
14259i582M257J6K55m9L20j556j271R68j92P196p17j484N10J808l497n96J716
$$ plain form
14242 -1898 2686 6493 4486 1813 1595 6208 7397 8037 10668 2702 -1369 -7417 -9771 -10402 -6884
14227 -6884 -5476 -668 4435 6824 3635 -2501 -3520 -5208 -6063 -5364 -4822 -6700 -6802 -9858 -10823 -14385
14211 -14385 -13630 -10357 -5801 -3750 -2733 -969 -1680 -8747 -7997 889 1434 -6401 -5193 -973 -4083
14196 -4083 -6250 -4293 -5354 -8328 -7055 -2507 -1772 -2839 -2955 -4821 -7391 -5655 -4253 -8889 -12711
14181 -12711 -10505 -5097 -1990 -5418 -6399 -5256 -5250 103 1777 2723 -1328 -3714 -3328 -4838 -441 3773
14165 3773 3981 1381 -2264 -736 2202 4225 4509 1071 -562 -3411 -1217 2030 -269 2606 8339
14150 8339 -443 -3992 -4865 -1804 1410 292 -6612 -5276 -4762 -3792 -2375 -4404 -6163 -3014 -1613
14135 -1613 -736 713 134 -2230 -1850 -2909 -1878 -1175 -2308 -6374 -9195 -3910 -3354 -811 -1761 -1952
$$ packed form
14242a898M584L807k007k673k18M613J189O40K631p966m071o048k354o31L518
14227f884J408M808N103K389l189o136j019j688q55O99N42j878j02l056r65l562
14211a4385P55L273M556K051J017J764p11p067P50Q886N45p835J208M220l110
14196d083k167J957j061k974J273M548P35j067j16j866k570J736J402m636l822
14181a2711K206N408L107l428r81J143ON353J674R46m051k386L86j510M397M214
14165C773K08k600l645J528K938K023K84l438j633k849K194L247k299K875N733
14150H339q782l549q73L061L214j118o904J336N14R70J417k029j759L149J401
14135a613Q77J449n79k364L80j059J031P03j133m066k821N285N56K543r50j91
$$ plain form
14119 -1952 243 -594 -3546 -440 -2522 -2423 -5298 -7830 -8535 -11206 -10746 -3734 -491 -2 -1858 -2748
14103 -2748 -1430 -2604 -5057 -7265 -3864 -3358 -7830 -8244 -6413 -3766 -3034 -2353 -3051 -796 -1480 -1049
14087 -1049 2536 651 -883 -3293 -6851 -5645 -4580 -6025 -2181 905 3028 -3542 -11022 -7604 -2817
14072 -2817 -4934 -5054 -7233 -6559 -5337 1981 1619 -3314 -4638 -7861 -7310 -5013 -1766 -955 -1188 1696
14056 1696 4543 -1434 -6760 -5571 -7604 -9446 -9451 -1532 -2230 -4422 743 -665 -5782 -2588 -2523 -4803
14040 -4803 -4059 -4500 1118 -2978 -7166 -5611 -2229 1431 480 -3191 -6155 -7445 1480 9594 8348
14025 8348 641 -893 1987 2721 -1761 731 -1188 -7981 -8591 -8454 -3352 -218 717 495 1418 -2087
14009 -2087 -2955 -6462 -8927 -9392 -5973 -4351 -2682 -1139 -4690 -6539 -1901 -1298 9069 11858 3583
$$ packed form
14119a952K195q37k952L106k082R9k875k532p05k671M60P012L243M89j856q90
14103b748J318j174k453k208L401N06m472m14J831K647P32O81o98K255o84M31
14087a049L585j885j534k410l558J206J065j445L844L086K123o570p480L418M787
14072b817k117j20k179O74J222P318l62m933j324l223N51K297L247Q11k33K884
14056A696K847n977n326J189k033j842nP919o98k192N165j408n117L194O5k280
14040d803P44m41N618m096m188J555L382L660r51l671k964j290Q925Q114j246
14025H348p707j534K880P34m482K492j919o793o10J37N102L134R35k22R23l505
14009b087q68l507k465m65L419J622J669J543l551j849M638O03J0367K789q275
$$ plain form
13994 3583 -1778 -6186 -6090 -6340 -6299 -4867 -6426 -5163 593 -271 -4317 -4144 -4705 -6063 -5124 -5873 -6125
13977 -6125 -5475 -5105 -2538 -3615 619 -1345 -8612 -6056 -2921 -250 -1617 -2342 -796 -2994 -3893 484
13961 484 127 -1875 -1084 -1850 -612 458 -4392 -2834 -992 -3782 -2607 -2037 -330 -2361 -5728 -5396
13945 -5396 -1785 662 -3882 -5619 -6677 683 1803 -644 -10709 -11744 -12388 -16598 -9988 -4173 -5291
13930 -5291 -517 5031 4930 1514 -363 1704 1755 -3614 -1587 2168 6212 3110 3370 -111 -7454 -8942
13914 -8942 -5864 -3228 1147 -820 1497 3744 5903 5011 7172 2488 -4824 -4249 857 4127 -661
13899 -661 -1108 2550 2164 1466 -2867 -4399 -7877 -4405 2725 779 -120 1334 1454 3245 1767 2047
13883 2047 2167 3020 2082 -235 -962 -514 -4543 64 1593 1299 4283 5031 9804 10066 11045 7481 7397
$$ packed form
13994C583n361m408R6k50M1J432j559J263N756q64m046J73n61j358R39p49k52
13977f125O50L70K567j077M234j964p267K556L135K671j367p25J546k198q99M377
13961D84l57k002P91p66J238J070m850J558J842k790J175N70J707k031l367L32
13945e396L611K447m544j737j058P360J120k447j0065j035o44m210O610N815j118
13930e291M774N548j01l416j877K067N1n369K027L755M044l102K60l481p343j488
13914h942L078K636M375j967K317K247K159q92K161m684p312N75N106L270m788
13899f61m47L658l86o98m333j532l478L472P130j946q99J454J20J791j478K80
13883B047J20Q53r38k317p27M48m029M607J529k94K984P48M773K62R79l564q4
$$ plain form
13866 7397 9164 7800 3056 800 -1375 359 -1981 -1905 -764 -573 -1330 -2683 -3739 -2843 -4167 -4702
13850 -4702 -2640 -1231 -3353 52 -2440 -1387 -959 -7943 -10821 -11284 -10390 -9751 -9722 -9733 -8491 -5406 -3490
13833 -3490 -4372 -11925 -9148 -4723 -7315 -6597 -1075 -3677 -4408 -911 572 -2665 -2677 -1773 -66 2515
13817 2515 -1169 -3510 -2825 -2880 -2948 -1325 681 2468 2354 5304 2877 -139 -2908 -3784 -2185 -1919 -599
13800 -599 -237 -3168 -3750 -2628 -4870 -8154 -5149 -6496 -4980 -969 1509 4499 592 -3635 -2292
13785 -2292 2149 2412 -547 -3069 -3885 1158 -2011 -3943 1776 5352 2620 1691 -912 -6885 -5906 -4115
13769 -4115 -4157 -6136 -2212 -3732 -163 1813 1084 -1039 -4762 -92 4789 5231 2595 -2029 -5340 -8116
13753 -8116 -4735 -820 -3768 -1870 -1424 -3878 -5011 -332 1170 2005 -1988 -3277 -4675 -9376 -7798
$$ packed form
13866G397J767j364m744k256k175J734k340P6J141J91p57j353j056Q96j324n35
13850d702K062J409k122L405k492J053M28o984k878m63Q94O39K9j1J242L085J916
13833c490q82p553K777M425k592P18N522k602p31L497J483l237j2R04J707K581
13817B515l684k341O85n5o8J623K006J787j14K950k427l016k769q76J599K66J320
13800e99L62k931n82J122k242l284L005j347J516M011K478K990l907m227J343
13785b292M441K63k959k522q16N043l169j932N719L576k732r29k603n973R79J791
13769d115m2j979L924j520L569J976p29k123l723M670M881M42k636m624l311k776
13753h116L381L915k948J898M46k454j133M679J502Q35l993j289j398m701J578
$$ plain form
13738 -7798 -3992 -3193 -6640 -5319 -1754 -2707 -1022 4048 10225 7124 1795 3695 4636 8139 9661
13723 9661 5470 4487 -2105 -2960 99 -2198 -3580 -3036 -3263 -5313 -10997 -11644 -8004 -7166 -7489 -9431
13707 -9431 -1990 3005 2423 210 -3248 -91 -3166 -5128 -1221 1727 5191 8766 6038 3481 5492
13692 5492 3044 -1916 -3060 -760 18 622 1130 195 1425 953 -90 -2287 -6811 -12279 -11147 -4156
13676 -4156 -4434 -8666 -13633 -8703 -4489 -5408 -6062 -5008 -3894 -3983 -2338 -1776 -4419 -6067 -2141 -2165 -2904
13659 -2904 -1417 -810 1788 -264 -1819 -3264 -4039 -5075 -6620 -3536 -6950 -6497 -1043 -1603 -313 1203
13643 1203 1641 1543 2463 -651 -5048 -5437 -625 4245 3139 -3398 -4674 -528 -442 -3934 -5285 -4514 -4784
13626 -4784 -5270 -4632 -5493 -4407 -6619 -6740 -1869 468 618 3901 4897 4245 4103 1061 -267 -35 3962
$$ packed form
13738g798L806P99l447J321L565r53J685N070O177l101n329J900R41L503J522
13723I661m191r83o592q55L059k297j382N44k27k050n684o47L640Q38l23j942
13707i431P441M995n82k213l458L157l075j962L907K948L464L575k728k557K011
13692E492k448m960j144K300P78O04N08r35J230m72j043k197m524n468J132O991
13676d156k78m232m967M930M214r19o54J054J114q9J645N62k643j648L926k4p39
13659b904J487O07K598k052j555j445p75j036j545L084l414M53N454n60J290J516
13643A203M38r8R20l114m397l89M812M870j106o537j276M146Q6l492j351P71k70
13626d784m86O38q61J086k212j21M871K337J50L283R96o52j42l042j328K32L997
$$ plain form
13609 3962 4606 3463 2345 -537 -2873 -54 983 2174 3520 954 -1268 -1974 83 -623 2407
13594 2407 4811 709 -1374 -780 374 2781 5096 7622 5038 3368 4287 6412 6985 4112 -92
13579 -92 2399 2857 1769 4275 10298 8170 9958 14760 14057 12078 9821 7837 4397 1639 5283 5495
13563 5495 7692 4965 2647 -3692 -6194 -4311 -4366 -6641 -4632 -3652 -1574 -1458 -344 -2628 -4488 -6446
13547 -6446 -2120 990 1226 3968 5635 5220 4205 3723 -395 -2061 -866 -2653 2249 8001 7579 13023
13531 13023 12409 7681 5756 6060 3318 6952 9110 6717 1400 127 -890 90 2698 4069 2816
13516 2816 995 -4001 -2303 -3737 -704 -353 -2298 1996 7832 6623 8744 5219 -1350 -8430 -9979
13501 -9979 -11052 -10000 -11801 -9357 -4842 -4006 -2474 -861 2776 5892 6878 3758 4490 3940 6739 10013
$$ packed form
13609C962O44j143j118k882k336K819J037J191J346k566k222p06K057p06L030
13594B407K404m102k083N94J154K407K315K526k584j670R19K125N73k873m204
13579i2K491M58j088K506O023k128J788M802p03j979k257j984l440k758L644K12
13563E495K197k727k318o339k502J883n5k275K009R80K078J16J114k284j860j958
13547f446M326L110K36K742J667m15j015m82m118j666J195j787M902N752m22N444
13531A3023o14m728j925L04k742L634K158k393n317j273j017R80K608J371j253
13516B816j821m996J698j434L033L51j945M294N836j209K121l525o569p080j549
13501i979j073J052j801K444M515Q36J532J613L637L116R86l120P32n50K799L274
$$ plain form
13485 10013 5918 -25 -3126 -3370 -2657 -2597 -655 -361 -3597 -6457 -7215 -5829 -819 -1336 169 4905
13469 4905 2990 -3384 -47 7282 4849 3144 -3147 -6630 -5805 -6136 -3596 737 2364 4378 -569
13454 -569 -1015 -1619 -3573 -1899 1225 58 -1405 646 128 -2748 458 3899 6377 5392 3208 -1246
13438 -1246 257 2014 2561 3162 2954 3075 884 -2990 2509 3089 -1312 332 4145 4690 8647 9062
13422 9062 5823 5609 10001 13659 10658 9622 7477 9347 9976 9492 11302 11608 5646 6417 8925 9124
13406 9124 5645 3510 5040 1647 -1600 4525 8296 8176 5212 2983 5053 5898 11583 15268 20041
13391 20041 19765 20690 28578 32253 34453 39165 40730 45380 59377 79670 100462 126563 143644 151052
13377 151052 146088 132307 115591 93848 68812 51396 43381 38148 36563 31496 26964 20334 16223
$$ packed form
13485A0013m095n943l101k44P13O0J942K94l236k860p58J386N010n17J505M736
13469D905j915o374L337P329k433j705o291l483Q25l31K540M333J627K014m947
13454e69m46o04j954J674L124j167j463K051n18k876L206L441K478r85k184m454
13438a246J503J757N47O01k08J21k191l874N499N80m401J644L813N45L957M15
13422I062l239k14M392L658l001j036k145J870O29m84J810L06n962P71K508J99
13406I124l479k135J530l393l247O125L771j20k964k229K070Q45N685L685M773
13391B0041k76R25P888L675K200M712J565M650J3997K0293K0792K6101J7081P408
13377A51052m964j3781j6716k1743k5036j7416q015n233j585n067m532o630m111
$$ plain form
13364 16223 17394 17799 22513 19304 19049 18367 18277 17856 20226 22157 23305 20379 21242 27785 32571 33711
13348 33711 39131 47500 53062 62208 73575 89775 122541 163468 217033 274364 322355 343872
13336 343872 330127 283454 225146 170889 127901 96032 77680 60816 45969 37044 36849 36336
13324 36336 31516 28341 23085 18359 16492 16615 20429 18221 6918 3506 6214 9301 10802 10115 7622
13309 7622 10704 21818 25601 27542 34462 42484 47755 54714 65514 82677 110433 139735 164576
13296 164576 172398 163781 137392 106508 82594 64436 49329 36494 28512 21416 18357 12407 12016
13283 12016 10655 14778 16251 10862 9799 6095 2880 1083 353 -608 3794 5747 10379 13086 12016
13268 12016 6195 5755 10826 13387 13530 9328 10198 15428 9749 2871 4201 4782 3838 6050 3145 3103
$$ packed form
13364A6223J171M05M714l209k55o82r0m21K370J931J148k926Q63O543M786J140
13348C3711N420Q369N562R146J1367J6200L2766M0927N3565N7331M7991K1517
13336C43872j3745m6673n8308n4257m2988l1869j8352j6864j4847q925j95n13
13324C6336m820l175n256m726j867J23L814k208j1303l412K708L087J501o87k493
13309G622L082J1114L783J941O920Q022N271O959J0800J7163K7756K9302K4841
13296A64576P822q617k6389l0884k3914j8158j5107j2835p982p096l059n950l91
13283A2016j361M123J473n389j063l704l215j797p30r61M402J953M632K707j070
13268A2016n821m40N071K561J43m202Q70N230n679o878J330N81r44K212k905m2
$$ plain form
13252 3103 3643 5554 6163 4301 2261 8367 6590 4311 7963 9634 7166 9691 7744 5369 7196
13237 7196 5078 1347 4568 5962 5090 5984 3352 5629 7548 3963 1386 4670 8397 9715 7697
13222 7697 9624 13910 14462 12998 13420 17871 19154 12942 8844 12346 11846 12052 12861 14777 11061 10724
13206 10724 12208 10228 4336 1259 1769 3081 4967 5182 3677 4219 7217 6905 5322 2030 219
13191 219 -4825 -5927 -438 3386 12870 16403 18694 19744 22687 30684 28137 27620 27353 25797 24589
13176 24589 22568 21241 19895 21107 22122 19789 21901 16292 9984 11029 11476 8150 6805 8968 8853
13161 8853 5505 6713 10162 12508 16813 16983 15506 10985 8122 12251 16187 18206 16216 14962 23513
13146 23513 32959 36361 40456 42427 47123 56020 56407 53543 56423 55906 53238 48078 41237 37100 28533
$$ packed form
13252C103N40J911O09j862k040O106j777k279L652J671k468K525j947k375J827
13237G196k118l731L221J394q72Q94k632K277J919l585k577L284L727J318k018
13222G697J927M286N52j464M22M451J283o212m098L502n00K06Q09J916l716l37
13206A0724J484j980n892l077N10J312J886K15j505N42K998l12j583l292j811
13191B19n044j102N489L824R484L533K291J050K943P997k547n17k67j556j208
13176B4589k021j327j346J212J015k333K112n609o308J045M47l326j345K163j15
13161H853l348J208L449K346M305J70j477m521k863M129L936K019j990j254Q551
13146B3513R446L402M095J971M696Q897L87k864K880n17k668n160o841m137q567
$$ plain form
13131 28533 21048 19646 18210 21447 23295 28723 27258 22877 20462 17786 16902 15712 10788 11232 17328
13116 17328 16209 17036 18173 24943 32073 30025 27156 28055 30926 31114 31829 30257 34392 44242 45633
13101 45633 50072 56251 59137 56469 51580 46537 41264 36554 35800 34790 34963 35403 35208 28338 25946
13086 25946 24888 28757 32868 29260 28452 29192 31578 31351 30432 30485 35861 36898 35788 35480 41447 44334
13070 44334 45420 41599 36492 36802 34029 34814 33246 31099 35839 38918 41680 45084 48733 50136 52520
13055 52520 54085 54487 54984 56003 53738 53613 55236 54860 55690 57899 54700 54366 53564 52987 46013 42068
13039 42068 40101 36007 36605 45342 45409 45415 51585 53265 47666 49000 51869 54021 55939 56128 56713 57885
13023 57885 59536 60960 58973 60762 69101 81716 93501 102518 106549 105199 105431 110597 106445 98577
$$ packed form
13131B8533p485j402j436L237J848N428j465m381k415k676q84j190m924M44O096
13116A7328j119Q27J137O770P130k048k869Q99K871J88P15j572M135R850J391
13101D5633M439O179K886k668m889n043n273m710p54j010J73M40j95o870k392
13086B5946j058L869M111l608q08P40K386k27r19N3N376J037j110l08N967K887
13070D4334J086l821n107L10k773P85j568k147M740L079K762L404L649J403K384
13055E2520J565M02M97J019k265j25J623l76Q30K209l199l34q02n77o974l945
13039D2068j967m094N98Q737O7OO170J680n599J334K869K152J918J89N85J172
13023E7885J651J424j987J789Q339J2615J1785R017M031j350K32N166m152p868
$$ plain form
13009 98577 89351 87903 91088 93734 96268 99448 100719 96051 95495 95453 92050 89110 83128 87222 92613
12994 92613 96475 103764 107218 111192 112182 111742 109315 112154 109718 109817 112550 123009 132388 140961 150675
12979 150675 158369 165915 174477 186420 192438 195906 203725 211843 220631 224492 228616 232739 239647 251284
12965 251284 262925 276038 291267 302961 315098 328994 346276 366255 385986 408813 434298
12954 434298 468001 504905 544561 590979 644200 710685 785239 870671 972070 1101492 1257129
12943 1257129 1438941 1645013 1885113 2177632 2547996 3034004 3697054 4608173 5890297
12934 5890297 7723224 10386479 14201738 19273770 25100014 30297759 33070283 32320385
12926 32320385 28440412 22962100 17514680 13070006 9844964 7643206 6154649 5121425
$$ packed form
13009I8577r226j448L185K646K534L180J271m668n56m2l403k940n982M094N391
12994I2613L862P289L454L974R90m40k427K839k436R9K733J0459R379Q573R714
12979A50675P694P546Q562J1943O018L468P819Q118Q788L861M124M123O908J1637
12965B51284J1641J3113J5229J1694J2137J3896J7282J9979J9731K2827K5485
12954D34298L3703L6904L9656M6418N3221O6485P4554Q5432J01399J29422J55637
12943A257129J81812K06072K40100K92519L70364M86008O63050R11119J282124
12934E890297J832927K663255L815259N072032N826244N197745K772524p49898
12926C2320385l879973n478312n447420m444674l225042k201758j488557j033224
$$ plain form
12918 5121425 4380520 3834170 3422547 3103763 2853684 2654240 2496840 2384373 2312098 2282852
12908 2282852 2300444 2356939 2453632 2608745 2820815 3092285 3423393 3807119 4261620 4820165
12898 4820165 5541901 6524981 7889020 9790038 12477414 16358276 22059505 30305453
12890 30305453 41315546 53862893 64777466 70052770 67440372 58121200 45705868
12883 45705868 33827381 24487156 17965611 13652189 10791688 8824355 7397014 6320579
12875 6320579 5495877 4836001 4289812 3829371 3432258 3101360 2844486 2656266 2520490
12866 2520490 2434422 2395226 2396589 2438015 2522343 2644707 2806596 3017392 3292210 3665375
12856 3665375 4187600 4917657 5940959 7401312 9518572 12589617 16914999 22461050
$$ packed form
12918E121425p40905n46350m11623l18784k50079j99444j57400j12467p2275k9246
12908B282852J7592N6495R6693J55113K12070K71470L31108L83726M54501N58545
12898D820165P21736R83080J364039J901018K687376L880862N701229Q245948
12890C0305453J1010093J2547347J0914573N275304k612398r319172j2415332
12883D5705868j1878487r340225o521545m313422k860501j967333j427341j076435
12875F320579q24702o59876n46189m60441l97113l30898k56874j88220j35776
12866B520490q6068l9196J363M1426Q4328J22364J61889K10796K74818L73165
12856C665375N22225P30057J023302J460353K117260L071045M325382N546051
$$ plain form
12848 22461050 28445842 33245083 35065836 33104852 28169875 22041249 16375434 11978534
12840 11978534 8898982 6831936 5431184 4442311 3705317 3141918 2695789 2328513 2014623
12831 2014623 1752411 1534208 1351350 1201664 1078829 974158 884035 812295 750341 693882
12821 693882 642687 598115 559643 518646 486562 459575 430149 406940 387617 367816 345392
12810 345392 331276 321354 310161 298509 293591 286160 271287 262239 249650 238092 231079 228987 220951
12797 220951 215994 208289 196391 185340 175255 169876 168503 162846 161137 163947 162340 154887 151966
12784 151966 148717 142537 138933 134562 133086 130401 132056 132082 125393 116146 112845 108380 109884 112161 114089
12769 114089 114367 106527 106295 107285 108409 108170 107562 107417 110620 108240 105161 103602 99857 92253 89725 85439
$$ packed form
12848B2461050N984792M799241J820753j960984m934977o128626n665815m396900
12840A1978534l079552k067046j400752r88873p36994n63399m46129l67276l13890
12831B014623k62212k18203j82858j49686j22835j04671r0123p1740o1954n6459
12821F93882n1195m4572l8472m0997l2084k6987k9426k3209j9323j9801k2424
12810C45392j4116r922j1193j1652m918p431j4873r048j2589j1558p013k092q036
12797B20951m957p705j1898j1051j0085n379j373n657j709K810j607p453k921
12784A51966l249o180l604m371j476k685J655K6o689r247l301m465J504K277J928
12769A14089K78p840k32R90J124k39o08j45L203k380l079j559l745p604k528m286
$$ plain form
12753 85439 85120 83719 83389 79766 76998 75587 71697 69004 65608 65022 65605 66757 64968 58599 57592
12738 57592 59245 64906 61397 57359 57345 54045 45597 37429 33522 34545 39503 41848 43598 42892 47329
12723 47329 55215 55906 54068 54078 55211 55360 54902 53607 49074 46605 43758 44611 45923 46357 45945 44648
12707 44648 40925 35043 33771 29591 26692 25871 27033 27723 30490 31366 29900 28416 29714 33987 33799
12692 33799 30407 28420 26577 22942 21021 24904 25677 28128 31261 29145 28104 31791 33208 37416 36407
12677 36407 37414 37678 35197 39849 45161 41484 37754 31233 28680 25496 25479 25188 15938 12700 12842 18120
12661 18120 19797 19500 18536 16728 21644 22023 23210 21196 21737 18898 18464 18383 17117 19153 18851 19195 19654
12644 19654 16835 18059 21411 20362 20758 21386 16315 16575 20052 19876 22798 26235 28070 28795 24652 20467
$$ packed form
12753H5439l19j401l30l623k768j411l890k693l396n86N83J152j789o369j007
12738E7592J653N661l509m038j4l300q448q168l907J023M958K345J750p06M437
12723D7329P886O91j838J0J133J49m58j295m533k469k847Q53J312M34m12j297
12707D4648l723n882j272m180k899q21J162O90K767Q76j466j484J298M273j88
12692C3799l392j987j843l635j921L883P73K451L133k116j041L687J417M208j009
12677C6407J007K64k481M652N312l677l730o521k553l184j7k91r250l238J42N278
12661A8120J677k97r64j808M916L79J187k014N41k839m34q1j266K036l02L44M59
12644A9654k819J224L352j049L96O28n071K60L477j76K922L437J835P25m143m185
$$ plain form
12628 20467 17203 14957 14347 13185 18117 24335 25401 20241 14020 12262 10224 11694 18131 17883 18067
12613 18067 19290 20630 21228 17093 12832 12766 18593 21191 15267 12409 14666 12913 7854 6765 7807
12598 7807 9832 9275 10601 16171 13821 10979 6980 4192 2704 -904 2180 2815 3562 8181 12084
12583 12084 10554 13800 16808 17444 21029 17012 12377 13943 15243 16961 20405 19917 18838 18505 11913
12568 11913 8964 7295 3289 3183 7703 8750 4791 1846 625 -436 2766 6434 7936 9311 7496
12553 7496 10595 11247 9799 10900 7379 5204 4835 575 2350 5909 7626 8639 6718 3585 -1611
12538 -1611 -314 -2292 -4540 -6629 -4916 -2501 -1833 3608 9646 10070 8929 3533 -395 745 -953
12523 -953 -2966 -6299 -8412 -5378 -188 -858 -2456 -2168 5034 7999 11140 9448 6125 10772 15808
$$ packed form
12628B0467l264k246o10j162M932O218J066n160o221j758k038J470O437k48J84
12613A8067J223J340N98m135m261o6N827K598n924k858K257j753n059j089J042
12598G807K025n57J326N570k350k842l999k788j488l608L084O35P47M619L903
12583A2084j530L246L008O36L585m017m635J566J300J718L444m88j079l33o592
12568A1913k949j669m006j06M520J047l959k945j221j061L202L668J502J375j815
12553G496L099O52j448J101l521k175l69m260J775L559J717J013j921l133n196
12538a611J297j978k248k089J713K415O68N441O038M24j141n396l928J140j698
12523i53k013l333k113L034N190o70j598K88P202K965L141j692l323M647N036
$$ plain form
12508 15808 12508 11443 7438 2244 457 175 846 1965 431 708 3872 4952 9320 10563 12273
12493 12273 15204 13745 8761 7687 12367 13129 15692 17750 21341 25407 24000 19654 19560 19909 20851 22534
12477 22534 25770 34575 51082 75816 100009 122773 144056 158926 160534 140366 115386 93185
12465 93185 78747 59295 42837 32558 30214 24244 18558 17915 15463 13835 13494 18820 21099 17247
12451 17247 17263 20334 23617 24385 21323 20393 17279 18873 23916 27457 30747 36377 40249 46361 58337
12436 58337 69946 91870 118207 150924 193310 246852 302967 331964 323727 289077 239075 185186
12424 185186 137341 104290 77758 55845 49702 47904 37000 32014 31200 28548 24266 20996 17826
12411 17826 20168 15676 17581 21303 17073 12392 12168 12673 14872 19213 22151 26044 27870 32947 37366
$$ packed form
12508A5808l300j065m005n194j787k82O71J119j534K77L164J080M368J243J710
12493A2273K931j459m984j074M680P62K563K058L591M066j407m346r4L49R42J683
12477B2534L236Q805J6507K4734K4193K2764K1283J4870J608k0168k4980k2201
12465I3185j4438j9452j6458j0279k344n970n686o43k452j628l41N326K279l852
12451A7247J6L071L283P68l062r30l114J594N043L541L290N630L872O112J1976
12436E8337J1609K1924K6337L2717M2386N3542N6115K8997q237l4650n0002n3889
12424A85186m7845l3051k6532k1913o143j798j0904m986q14k652m282l270l170
12411A7826K342m492J905L722m230m681k24N05K199M341K938L893J826N077M419
$$ plain form
12396 37366 38453 43434 51143 61649 83499 109150 135470 159948 171532 160945 140090 119915
12384 119915 96890 63675 45774 42877 36424 29748 29154 25639 19421 15629 15438 16842 20123 22211
12370 22211 20391 17459 14278 9744 7408 4671 3250 -193 1622 -6 -218 3374 8031 6828 1295
12355 1295 2514 7634 8680 2807 5 610 652 -813 -2088 -3393 -6375 -6877 -3325 673 3572 3522
12339 3522 2012 365 580 1891 3560 3206 4221 8457 11903 10864 11128 9181 8016 1486 -1993
12324 -1993 548 3298 7067 13217 8732 1161 -508 -2528 -1786 -3828 -4688 -3627 1663 4068 4421
12309 4421 8968 8178 8795 -265 -2632 107 -546 3064 5175 3723 8911 10296 8745 7995 6211 2887
12293 2887 2634 -1243 -1379 -2247 3701 5254 5060 6580 8838 2838 -490 1141 6766 11221 9661 6428
$$ packed form
12396C7366J087M981P709J0506K1850K5651K6320K4478J1584j0587k0855k0175
12384A19915k3025l3215j7901k897o453o676n94l515o218l792j91J404L281K088
12370B2211j820k932l181m534k336k737j421l443J815j628k12L592M657j203n533
12355A295J219N120J046n873k802O05M2j465j275j305k982n02L552L998K899n0
12339C522j510j647K15J311J669l54J015M236L446j039K64j947j165o530l479
12324a993K541K750L769O150m485p571j669k020P42k042q60J061N290K405L53
12309D421M547p90O17r060k367K739o53L610K111j452N188J385j551p50j784l324
12293B887k53l877j36q68N948J553j94J520K258o000l328J631N625M455j560l233
$$ plain form
12277 6428 1432 1406 4527 617 -6721 -11368 -7471 -5642 -1573 6890 6113 1787 5503 4915 4845 6978
12261 6978 5790 6629 -190 -3804 -4485 2700 7471 2847 740 1942 1878 3233 6700 9392 4332 5276
12245 5276 6409 1454 3291 3440 3758 1044 785 590 4537 3659 1048 -2084 -4438 -1947 -3329 -8286
12229 -8286 -8031 -8830 -11103 -5612 -2356 -5122 -5422 -6361 -7373 -7738 -3166 -424 1527 671 2656 4818
12213 4818 5171 376 1772 6225 7313 10232 11827 8485 5583 6409 6398 7617 5499 710 -127 3058
12197 3058 422 -1017 786 4638 3774 8466 8626 5059 5600 5937 10705 15294 16125 10031 9410 5454
12181 5454 2018 -1270 -874 -2049 2977 1611 667 -313 173 -2804 -7208 -7996 -10718 -11237 -9166 -7341
12165 -7341 -9403 -5604 -520 4646 943 -6502 -7271 -1367 4135 6540 2238 2662 -186 928 1321
$$ packed form
12277F428m996k6L121l910p338m647L897J829M069Q463p77m326L716n88p0K133
12261F978j188Q39o819l614o81P185M771m624k107J202o4J355L467K692n060R44
12245E276J133m955J837J49L18k714k59j95L947q78k611l132k354K491j382m957
12229h286K55p99k273N491L256k766l00r39j012l65M572K742J951q56J985K162
12213D818L53m795J396M453J088K919J595l342k902Q26j1J219k118m789q37L185
12197C058k636j439J803L852q64M692J60l567N41L37M768M589Q31o094o21l956
12181E454l436l288L96j175N026j366r44r80M86k977m404p88k722n19K071J825
12165g341k062L799N084N166l703p445p69N904N502K405m302M24k848J114L93
$$ plain form
12150 1321 2578 -1075 -836 3415 -111 -2223 -1197 -2859 364 891 1222 1328 -649 -5629 -1845 -3412
12134 -3412 -5579 -5201 -3547 -1575 -4539 -1094 -622 -907 2042 -171 -1742 -5328 -7460 -4514 -5376 -5091
12118 -5091 -2626 -3853 -2184 -2948 -5135 -8610 -6764 -3314 -5265 -7804 -10433 -7220 -3358 -1194 -702
12103 -702 2865 3849 3931 -1479 -2635 1860 4449 -1052 -2315 -1420 1433 4077 6113 5435 1329 6215
12087 6215 8552 8915 7677 5380 2282 -6451 -9396 -6849 -3686 -1356 -349 -1984 -5185 -3996 755
12072 755 1400 153 3035 6310 6959 8476 6278 4470 5273 7479 9571 7822 4503 1786 3268 8032
12056 8032 5324 5659 606 -6009 -7253 -3117 -265 3086 -213 -2507 -1364 3942 7116 10701 7144
12041 7144 7837 9000 7840 9671 7594 7108 11543 10015 6347 4541 5437 4854 676 -4621 -6334 -372
$$ packed form
12150A321J257l653K39M251l526k112J026j662L223N27L31J06j977m980L784j567
12134c412k167L78J654J972k964L445M72k85K949k213j571l586k132K946q62K85
12118e091K465j227J669p64k187l475J846L450j951k539k629L213L862K164M92
12103g02L567R84Q2n410j156M495K589n501j263Q95K853K644K036o78m106M886
12087F215K337L63j238k297l098q733k945K547L163K330J007j635l201J189M751
12072G55O45j247K882L275O49J517k198j808Q03K206K092j749l319k717J482M764
12056H032k708L35n053o615j244M136K852L351l299k294J143N306L174L585l557
12041G144O93J163j160J831k077m86M435j528l668j806Q96n83m178n297j713N962
$$ plain form
12025 -372 3575 3036 1669 -827 -4413 -3056 -2184 -5147 -7099 -5509 -1354 -233 -3271 -2016 3711
12010 3711 6487 10228 11963 3694 839 -727 -499 3948 5463 2823 101 -2728 -9752 -9533 -8223
11995 -8223 -5189 -3069 19 -3522 -5929 -5935 -5269 -2135 -4554 -5026 -3796 -2120 -2617 -2905 -1717 -484
11979 -484 135 -2276 -3659 -3381 -5050 -3429 -4555 -3758 -1403 275 3387 8875 5643 1989 6516 5649
11963 5649 6231 2110 -441 -3897 -4713 -4751 -4135 -1045 1141 2615 8867 9097 5995 5386 1550 -728
11947 -728 -3987 -5798 -8529 -8776 -3073 1109 3996 -239 -2767 3342 6776 3888 1313 1700 1357 987
11931 987 497 1963 3931 3889 2516 3384 4095 3211 850 -2366 -1738 -913 -2323 -1470 -2929 -1695 -518
11914 -518 583 -639 -3417 -4661 -3028 -4604 930 948 1724 -3673 -7528 -9237 -6327 -8370 -8774 -4434
$$ packed form
12025c72L947n39j367k496l586J357Q72k963j952J590M155J121l038J255N727
12010C711K776L741J735q269k855j566K28M447J515k640k722k829p024K19J310
11995h223L034K120L088l541k407oO66L134k419m72J230J676m97k88J188J233
11979d84O19k411j383K78j669J621j126P97K355J678L112N488l232l654M527q67
11963E649N82m121k551l456q16l8O16L090K186J474O252K30l102o09l836k278
11947g28l259j811k731k47N703M182K887m235k528O109L434k888k575L87l43l70
11931I87m90J466J968m2j373Q68P11q84k361l216O28Q25j410Q53j459J234J177
11914e18J101j222k778j244J633j576N534J8P76n397l855j709K910k043m04M340
$$ plain form
11898 -4434 -3957 -3490 -5347 -5243 -1562 247 -1895 215 -1473 -3360 1637 615 -4683 -3013 -2345 -1578
11882 -1578 562 4847 4568 1542 -3894 -7721 -3999 -59 -697 -2457 -2464 -1019 -1053 -369 2726 496 -2630
11865 -2630 -4951 -4964 -3854 -7219 -11654 -5002 -3297 2195 2727 -3612 -5885 -5056 -4272 -4946 -3164 -1444
11849 -1444 -567 3908 5985 -1554 -5555 2520 4773 77 -996 -1180 612 6356 6837 5198 3342
11834 3342 818 -4435 -4866 -5475 -4523 -1874 -1242 -2360 -4363 -1397 1469 -279 -3483 -3488 -6014 -6090 -3630
11817 -3630 209 1945 55 437 1768 -1400 -2681 -6586 -7033 -1832 2545 2333 4813 10436 12896
11802 12896 12016 8765 7704 2103 -2284 269 1591 2744 6154 4170 -150 -2876 -1358 -2248 -256
11787 -256 -1914 1456 3821 2163 773 -2496 -4740 -7349 -8805 -4277 -804 4848 10534 8735 2300
$$ packed form
11898d434M77M67j857J04L681J809k142K110j688j887M997j022n298J670O68P67
11882a578K140M285k79l026n436l827L722L940o38j760pJ445l4O84L095k230l126
11865b630k321j3J110l365m435O652J705N492N32o339k273Q29P84o74J782J720
11849a444Q77M475K077p539m001Q075K253m696j073j84J792N744M81j639j856
11834C342k524n253m31o09R52K649O32j118k003K966K866j748l204nk526p6K460
11817c630L839J736j890L82J331l168j281l905m47N201M377k12K480N623K460
11802A2896q80l251j061n601m387K553J322J153L410j984m320k726J518q90J992
11787b56j658L370K365j658j390l269k244k609j456M528L473N652N686j799o435
$$ plain form
11772 2300 -3250 -3873 -4778 -3414 -928 834 2868 1624 -2536 -3210 -3715 -4020 861 4504 -143 -5570
11756 -5570 -10483 -10717 -4908 -914 -2969 -2661 3401 -1355 -4381 -3730 -962 839 -616 -517 -1549 -1155
11740 -1155 -751 -790 -2068 -2328 -605 -2714 -3397 -4905 -4217 -1443 326 -1023 2484 8225 8601 8811 6279
11723 6279 -5 -1869 -4033 1154 4319 2944 2718 3847 3628 1918 1536 1465 3741 5917 7387 1768
11707 1768 -3312 -2100 -6353 -4067 -232 5078 4927 6349 6350 2219 -1944 -5303 -5115 -2511 214 2649
11691 2649 3426 5153 6412 2212 -795 -1513 234 -1324 -3065 -3340 -1489 3557 1029 1890 -299 689
11675 689 6810 7256 7757 5852 1272 852 1880 -1138 -1579 977 2847 5813 3530 -1790 -7337 -9568
11659 -9568 -7133 -3542 -4461 -3725 949 5856 7871 3532 -2563 -1199 -1434 -2290 -1981 -4350 -6931 -5626
$$ packed form
11772B300n550o23r05J364K486J762K034j244m160o74n05l05M881L643m647n427
11756e570m913k34N809L994k055L08O062m756l026O51K768J801j455R9j032L94
11740a155M04l9j278k60J723k109o83j508O88K774J769j349L507N741L76K10k532
11723F279o284j864k164N187L165j375k26J129k19j710l82p1K276K176J470n619
11707A768n080J212m253K286L835N310j51J422Jm131m163l359J88K604K725K435
11691B649P77J727J259m200l007p18J747j558j741k75J851N046k528Q61k189R88
11675F89O121M46N01j905m580m20J028l018m41K556J870K966k283n320n547k231
11659i568K435L591r19P36M674M907K015m339o095J364k35q56L09k369k581J305
$$ plain form
11643 -5626 -4654 -661 407 -273 6275 13067 9399 3417 -425 -2910 -3260 -930 -1003 -1595 -2878 -4672
11627 -4672 -1311 381 -3749 -2254 966 1189 -2311 -5217 -5965 -5705 -1467 887 -1422 -3761 -557
11612 -557 1829 -2252 -7669 -9930 -8142 -992 -4566 -8540 -8409 -5325 -7864 -8467 -4431 -4141 -3648 -8419
11596 -8419 -11728 -6611 -6602 -8665 -8630 -8815 -3726 -79 -191 2013 82 -3684 -3788 794 696 -2923 -3989
11579 -3989 -7163 -5195 737 908 175 -2971 -1917 -898 -139 2087 2261 -577 -2442 238 -2610 -6335
11563 -6335 -4174 636 -747 1386 5128 3541 -3156 -5180 -1707 -3099 -6221 -9787 -9180 -7994 -7296
11548 -7296 -3553 1503 2791 670 3950 4676 525 -4877 -570 -672 1028 5583 8782 9860 6311
11533 6311 378 -1726 -2641 -2965 -3378 -1336 -3375 1284 6465 9304 10702 6267 1997 1452 386 -4381
$$ packed form
11643e626R72L993J068o80O548O792l668n982l842k485l50K330p3n92j283j794
11627d672L361J692m130J495L220K23l500k906p48K60M238K354k309k339L204
11612e57K386m081n417k261J788P150l574l974J31L084k539o03M036K90M93m771
11596h419l309N117Rk063L5j85N089L647j12K204j931l766j04M582r8l619j066
11579c989l174J968N932J71p33l146J054J019P59K226J74k838j865K680k848l725
11563f335K161M810j383K133L742j587o697k024L473j392l122l566O07J186O98
11548g296L743N056J288k121L280P26m151n402M307j02J700M555L199J078l549
11533F311n933k104r15l24m13K042k039M659N181K839J398m435m270n45j066m767
$$ plain form
11517 -4381 -5766 -7102 -8463 -3420 -1286 1257 5584 388 -4544 -4663 -5057 -6323 -4971 -4787 -6036
11502 -6036 -4331 -2551 -3280 810 4819 1067 -2013 -1227 -1883 -5828 -3614 -3311 -3566 -3584 -8180 -6531
11486 -6531 -3599 734 2617 3588 1604 -5487 -4705 -1207 -1161 -2472 274 -3247 -4874 -7101 -7774 -1446
11470 -1446 5931 8173 4603 4721 3152 -713 -3191 -2958 1438 -854 -4633 -3504 514 2637 636
11455 636 -886 -2519 -364 897 -4477 -5738 -1794 733 -2950 -4426 -7589 -8201 -4036 1776 3871
11440 3871 8846 9968 8711 8568 8422 7250 11006 11874 5131 4967 3317 4386 9424 9016 5437 2760
11424 2760 3323 406 -1229 -1350 -1235 -1397 -580 -16 -1457 -6813 -10245 -9729 -4546 -1874 50 -1226
11408 -1226 415 2501 5313 5772 6227 5516 3037 -4314 -5548 -3694 -3998 -9464 -8995 -4926 -4027 -4738
$$ packed form
11517d381j385j336j361N043K134K543M327n196m932j19l94j266J352J84j249
11502f036J705J780p29M090M009l752l080P86o56l945K214L03k55j8m596J649
11486f531K932M333J883R71j984p091P82L498M6j311K746l521j627k227o73O328
11470a446P377K242l570J18j569l865k478K33M396k292l779J129M018K123k001
11455F36j522j633K155J261n374j261L944K527l683j476l163o12M165N812K095
11440C871M975J122j257j43j46j172L756Q68o743j64j650J069N038m08l579k677
11424B760N63k917j635j21J15j62Q17N64j441n356l432N16N183K672J924j276
11408a226J641K086K812M59M55p11k479p351j234J854l04n466M69M069Q99p11
$$ plain form
11392 -4738 -5307 -2844 2008 5247 3348 -868 -3715 -2412 -4168 -3962 1617 6091 6847 294 1237 1222
11376 1222 -2 1166 117 457 5510 5835 -513 -2286 -692 554 -1070 -680 147 -1440 -1334 1533
11360 1533 2236 1572 958 673 4841 6215 9450 6594 3259 -702 132 1625 -1701 -211 3421 2771
11344 2771 2329 897 1384 5614 4959 4799 2920 715 1106 5765 9377 9163 6886 5897 6201 5831 6947
11327 6947 7764 5660 7944 10122 9866 4985 3198 1628 1220 1334 4954 10117 10694 8423 7027 10542
11311 10542 10150 9228 8160 8914 8062 1758 6278 8113 3784 1672 4871 5493 4083 6708 7031 2676
11295 2676 2558 -1751 -846 4424 7423 7734 4796 4670 1407 -4473 -9007 -3335 -168 5023 1954 -1494
11279 -1494 -5211 -5464 -3018 478 163 1852 2950 2938 5336 3639 10580 16162 27885 34199 30974
$$ packed form
11392d738n69K463M852L239j899m216k847J303j756K06N579M474P56o553R43j5
11376A222j224J168j049L40N053L25o348j773J594J246j624L90Q27j587J06K867
11360A533P03o64o14k85M168J374L235k856l335l961Q34J493l326J490L632o50
11344B771m42j432M87M230o55j60j879k205L91M659L612k14k277r89L04l70J116
11327F947Q17k104K284K178k56m881j787j570m08J14L620N163N77k271j396L515
11311A0542l92r22j068P54q52o304M520J835m329k112L199O22j410K625L23m355
11295B676j18m309R05N270K999L11k938j26l263n880m534N672L167N191l069l448
11279a494l717k53K446L496l15J689J098j2K398j697O941N582J1723O314l225
$$ plain form
11264 30974 30503 23595 19246 14149 14885 12703 4731 643 -1234 -2129 -2711 587 -383 386 4001 1913
11248 1913 2419 3545 163 2740 3813 5746 9794 9494 7995 4392 7520 8049 7767 8458 3752 7855
11232 7855 10430 5526 2011 -1628 -3197 -4295 -3438 -289 1820 3861 3965 6851 5094 3582 7723
11217 7723 15162 16570 14753 11821 9127 8781 7588 5398 3814 6225 9679 9500 5932 6863 4231
11202 4231 2079 4716 10719 14133 12418 5841 2310 1546 -3101 -3182 -748 -1949 -785 -1402 -2363 -4321
11186 -4321 -3881 -2457 -580 603 947 867 891 -232 9472 7187 6746 4162 3136 2302 4136 5547 7950
11169 7950 6141 9198 13794 9994 6510 10974 18266 20622 15527 15339 17088 19856 21414 23967 23054
11154 23054 23817 22228 20893 15666 18782 19939 14699 10601 5790 3406 2970 2877 6891 6555 1565 -2160
$$ packed form
11264C0974m71o908m349n097P36k182p972m088j877q95n82L298r70P69L615k088
11248A913N06J126l382K577J073J933M048l00j499l603L128N29k82O91m706M103
11232G855K575m904l515l639j569j098Q57L149K109K041J04K886j757j512M141
11217G723P439J408j817k932k694l46j193k190j584K411L454j79l568R31k632
11202D231k152K637O003L414j715o577l531p64m647q1K434j201J164o17r61j958
11186d321M40J424J877J183L44q0K4j123R704k285m41k584j026q34J834J411K403
11169G950j809L057M596l800l484M464P292K356n095j88J749K768J558K553r13
11154B3054P63j589j335n227L116J157n240m098m811k384m36r3M014l36m990l725
$$ plain form
11138 -2160 -1809 -1114 2467 1598 2176 4596 4850 1879 485 -4974 -4137 4947 8099 11239 10734 5385
11122 5385 3374 6414 3891 8222 10053 10894 3445 1906 7802 8297 5946 6210 901 399 6694 10763
11106 10763 12969 10638 5070 1608 -1993 1494 2253 801 4624 13826 16908 14828 14540 17734 19238
11091 19238 14199 10004 12045 11275 11961 10589 8329 9773 11789 13715 13920 10762 6970 9353 11389
11076 11389 11713 12762 8392 10491 14959 15194 8569 6336 3789 4547 9567 7883 6596 5213 5558
11061 5558 5624 6121 6703 4182 3064 10002 16752 10373 2866 3093 2299 -940 -3484 -2224 1931 2929
11045 2929 7832 12650 11656 7494 6958 4717 439 2981 7629 8795 10214 8188 6219 6781 7524 7066
11029 7066 10627 15196 15128 12005 11951 13435 13623 15194 16157 10264 3268 412 1310 5093 8413 11227
$$ packed form
11138b160L51O95L581q69N78K420K54k971j394n459Q37R084L152L140n05n349
11122E385k011L040k523M331J831Q41p449j539N896M95k351K64n309n02O295M069
11106A0763K206k331n568l462l601L487P59j452L823R202L082k080k88L194J504
11091A9238n039m195K041p70O86j372k260J444K016J926K05l158l792K383K036
11076A1389L24J049m370K099M468K35o625k233k547P58N020j684j287j383L45
11061E558O6M97N82k521j118O938O750o379p507K27p94l239k544J260M155R98
11045B929M903M818r94m162n36k241m278K542M648J166J419k026j969N62P43m58
11029G066L561M569o8l123n4J484J88J571R63n893o996k856Q98L783L320K814
$$ plain form
11013 11227 18329 20904 18863 18685 14464 10358 11185 17680 17942 18904 18835 18896 18137 13276 15648 19081 19415
10996 19415 14231 6372 1394 2062 4404 7900 12541 12463 10672 11943 15124 16692 19596 17055 11612
10981 11612 10789 9514 7547 5496 6105 4649 6589 7706 7803 5508 9364 14849 13514 9210 5044
10966 5044 6662 9894 11154 12857 17128 17486 15028 15727 20817 20980 18743 20508 22281 21671 20696 19881
10950 19881 16557 12911 12432 15349 19190 20253 18981 14180 8607 11947 13227 11242 10830 16543 21087
10935 21087 16332 18267 16747 18829 23740 22462 18400 15371 19416 26228 27910 24902 22187 17571
10921 17571 15114 14751 16523 21224 29931 31710 33188 31866 30797 37193 40685 40377 38339 38174 49699
10906 49699 65516 82110 106562 125428 137254 153979 157766 147283 135139 117064 96606 75853
$$ packed form
11013A1227P102K575k041j78m221m106Q27O495K62R62o9O1p59m861K372L433L34
10996A9415n184p859m978O68K342L496M641p8j791J271L181J568K904k541n443
10981A1612q23j275j967k051O09j456J940J117R7k295L856N485j335m304m166
10966E044J618L232J260J703M271L58k458O99N090J63k237J765J773o10r75q15
10950A9881l324l646m79K917L841J063j272m801n573L340J280j985m12N713M544
10935B1087m755J935j520K082M911j278m062l029M045O812J682l008k715m616
10921A7571k457l63J772M701Q707J779J478j322j069O396L492l08k038j65J1525
10906D9699J5817J6594K4452J8866J1826J6725L787j0483j2144j8075k0458k0753
$$ plain form
10894 75853 59369 47488 41170 39068 28203 22059 23252 25670 31563 30084 34151 37278 31929 29649
10880 29649 28836 27181 25694 29190 32697 34009 39802 39913 42547 49071 50883 54529 55800 57844 58412
10865 58412 63186 70798 80525 93649 111727 142744 179868 213809 241598 254439 256315 243488
10853 243488 221150 195977 180842 159803 136679 122111 110004 94227 77810 67275 59929 52118
10841 52118 45661 46583 44950 43335 42221 40343 37974 35570 32763 35047 35753 34758 35573 34167 35272
10826 35272 35566 30762 31736 32176 32912 31877 35235 41385 47077 52774 58777 70960 86202 107190 136596
10811 136596 162283 182485 193723 190296 172611 144346 115150 97069 81078 68297 63028 57072
10799 57072 54678 51137 46346 41709 38369 31016 31563 33523 30630 26994 25716 27831 28961 25931 22738
$$ packed form
10894G5853j6484j1881o318k102j0865o144J193K418N893j479M067L127n349k280
10880B9649q13j655j487L496L507J312N793J11K634O524J812L646J271K044N68
10865E8412M774P612R727J3124J8078L1017L7124L3941K7789J2841J876j2827
10853B43488k2338k5173j5135k1039k3124j4568j2107j5777j6417j0535p346p811
10841E2118o457R22j633j615j114j878k369k404k807K284P06r95Q15j406J105
10826C5272K94m804R74M40P36j035L358O150N692N697O003J2183J5242K0988K9406
10811A36596K5687K0202J1238l427j7685k8265k9196j8081j5991j2781n269n956
10799E7072k394l541m791m637l340p353N47J960k893l636j278K115J130l030l193
$$ plain form
10784 22738 22683 19413 18195 21372 26879 23505 22764 26487 25892 25537 23864 18881 21324 22114 18492 19788
10768 19788 23982 23597 23406 24470 28916 21854 18439 23072 24573 27260 30309 30601 29892 34180 39397
10753 39397 37648 34942 34944 29197 27285 32189 31607 30955 38067 42438 43468 43075 39195 35183 36435 36409
10737 36409 37930 46048 48006 42728 38426 37145 35823 37791 38816 38775 39842 40904 42785 37566 34077
10722 34077 32656 31640 32966 31549 29008 27876 25999 29892 32719 32178 30878 28491 31176 35118 28602
10707 28602 24189 32584 34559 37993 35944 38706 47418 48779 51156 56763 63336 66199 64020 61892
10693 61892 61533 62096 55290 50444 52639 57804 53716 51119 48444 48441 47197 47719 48587 45359 38109 38723
10677 38723 44635 47427 49109 54741 55571 51550 51892 57730 57129 51401 50489 49686 54324 62127 63949 60319
$$ packed form
10784B2738n5l270j218L177N507l374p41L723n95l55j673m983K443P90l622J296
10768A9788M194l85j91J064M446p062l415M633J501K687L049K92p09M288N217
10753C9397j749k706Kn747j912M904n82o52P112M371J030l93l880m012J252k6
10737C6409J521Q118J958n278m302j281j322J968J025m1J067J062J881n219l489
10722C4077j421j016J326j417k541j132j877L893K827n41j300k387K685L942o516
10707B8602m413Q395J975L434k049K762Q712J361K377N607O573K863k179k128
10693F1892l59N63o806m846K195N165m088k597k675lj244N22Q68l228p250O14
10677C8723N912K792J682N632Q30m021L42N838o01n728r12q03M638P803J822l630
$$ plain form
10661 60319 57891 51710 52417 54417 53404 57864 64283 67829 70250 71943 74176 60746 56619 64509
10647 64509 68126 70650 69826 70051 70835 69810 68052 66753 67404 66641 56864 52350 53605 54105 58710 62864
10631 62864 63144 60895 63055 67909 72887 74551 70533 66337 65477 64229 65455 70820 73766 78706 75466
10616 75466 77544 83577 90654 106325 118484 126260 128924 131635 126886 115031 106406 96302 88018
10603 88018 82782 79063 78890 79061 83209 92297 91917 89391 91609 100769 104012 101272 103287 103758 105412
10588 105412 114444 125198 139736 151706 163618 172268 180000 191796 207182 224061 248047 290924
10576 290924 347645 427086 541612 703708 924555 1186599 1474653 1745036 1944024 2021984
10566 2021984 1958558 1768599 1509081 1226952 969848 756469 592239 478545 401130 343280
$$ packed form
10661F0319k428o181P07K000j013M460O419L546K421J693K233j3430m127P890
10647F4509L617K524q24K25P84j025j758j299O51p63r777m514J255N00M605M154
10631F2864K80k249K160M854M978J664m018m196q60j248J226N365K946M940l240
10616G5466K078O033P077J5671J2159P776K664K711m749j1855q625j0104q284
10603H8018n236l719j73J71M148R088l80k526K218R160L243k740K015M71J654
10588A05412R032J0754J4538J1970J1912Q650P732J1796J5386J6879K3986M2877
10576B90924N6721P9441J14526J62096K20847K62044K88054K70383J98988P7960
10566B021984o3426j89959k59518k82129k57104k13379j64230j13694p7415n7850
$$ plain form
10556 343280 305887 280430 264436 249415 233059 223665 216107 206318 196300 196439 199335 199683 200488
10543 200488 204265 209480 215485 213702 211577 215288 219902 226879 233914 234000 234233 237103 241692 245052 248781
10528 248781 253007 265952 273163 280042 296257 308624 322872 337827 350922 362461 376098 393461
10516 393461 416570 441196 468563 495110 524984 562913 609674 667689 733991 816957 920307
10505 920307 1039454 1176865 1341065 1534275 1746471 1985007 2263882 2604247 3044305 3650909
10495 3650909 4512163 5759086 7563043 10095048 13415134 17324395 21275984 24496868
10487 24496868 26235229 26104870 24181051 20959885 17165528 13487895 10374387 7989634
10479 7989634 6275330 5086805 4276108 3717954 3324670 3037012 2819960 2637198 2474051
$$ packed form
10556C43280l7393k5457j5994j5021j6356r394p558r789j0018J39K896L48Q05
10543B00488L777N215O005j783k125L711M614O977P035Q6K33K870M589L360L729
10528B48781M226J2945P211O879J6215J2367J4248J4955J3095J1539J3637J7363
10516C93461K3109K4626K7367K6547K9874L7929M6761N8015O6302Q2966J03350
10505I20307J19147J37411J64200J93210K12196K38536K78875L40365M40058O06604
10495C650909Q61254J246923J803957K532005L320086L909261L951589L220884
10487B4496868J738361j30359j923819l221166l794357l677633l113508k384753
10479G989634j714304j188525q10697n58154l93284k87658k17052j82762j63147
$$ plain form
10470 2474051 2340382 2233507 2144933 2095785 2088851 2123920 2208744 2357592 2585854 2912224
10460 2912224 3368763 3974805 4731412 5585093 6451139 7220680 7834893 8328097 8856421
10451 8856421 9652272 11019179 13294753 16824272 21877946 28372423 35563950 41992008
10443 41992008 45974903 46497146 43828313 39323600 34604304 30705255 27712976 25079670
10435 25079670 22223915 18997403 15691009 12738492 10439301 8873341 7968340 7583031
10427 7583031 7522566 7529222 7346034 6833634 6037395 5140748 4314624 3656235 3174569 2842974
10417 2842974 2638074 2522039 2480035 2506117 2587760 2718299 2893018 3116167 3376246 3682345
10407 3682345 4046478 4527291 5196131 6138726 7476161 9397485 12133868 15858766 20521348
$$ packed form
10470B474051j33669j06875q8574m9148o934L5069Q4824J48848K28262L26370
10460B912224M56539O06042P56607Q53681Q66046P69541O14213M93204N28324
10451H856421P95851J366907K275574L529519N053674O494477P191527O428058
10443D1992008L982895N22243k668833m504713m719296l899049k992279k633306
10435B5079670k855755l226512l306394k952517k299191j565960r05001l85309
10427G583031o0465O656j83188n12400p96239q96647q26124o58389m81666l31595
10417B842974k04900j16035m2004K6082Q1643J30539J74719K23149K60079L06099
10407C682345L64133M80813O68840R42595J337435J921324K736383L724898M662582
$$ plain form
10398 20521348 25644135 30294959 33351854 33995798 32057726 28074201 23052146 18023846
10390 18023846 13698534 10348411 7940291 6270407 5120024 4328750 3765924 3341751
10382 3341751 2999733 2710096 2450710 2205820 1988928 1798503 1638230 1511674 1412517 1333053
10372 1333053 1279954 1244381 1215588 1195038 1180701 1178817 1190910 1212543 1230530 1250806 1271653
10361 1271653 1281714 1281023 1276944 1268253 1257620 1238874 1205363 1164531 1122435 1067072 1010041 961975
10349 961975 916232 870197 823951 782357 740061 702365 671876 645231 626749 601955 569175
10338 569175 541647 524429 519360 512975 504207 488132 467559 447407 426556 398614 369138 350690
10326 350690 344899 346850 356720 357925 352697 350582 347162 336793 332464 328160 322129 318972 318516 321000
$$ packed form
10398B0521348N122787M650824L056895O43944j938072l983525n022055n028300
10390A8023846m325312l350123k408120j669884j150383p91274n62826m24173
10382C341751l42018k89637k59386k44890k16892j90425j60273j26556r9157p9464
10372A333053n3099l5573k8793k0550j4337j884J2093K1633J7987K0276K0847
10361A271653J0061o91m079q691j0633j8746l3511m0832m2096n5363n7031m8066
10349I61975m5743m6035m6246m1594m2296l7696l0489k6645j8482k4794l2780
10338E69175k7528j7218n069o385q768j6075k0573k0152k0851k7942k9476j8448
10326C50690n791J951R870J205n228k115l420j0369m329m304o031l157m56K484
$$ plain form
10312 321000 324606 327936 329613 336774 340138 328902 307214 279242 244478 216843 204260 207658 222160
10299 222160 232694 235243 232862 227350 224823 226017 223915 218224 213403 212856 209154 209005 211239 213324
10285 213324 222118 238997 263929 297744 347906 409469 488360 556346 589297 579426 544075 511484
10273 511484 481353 449629 424757 395597 370645 360039 353759 350026 345457 340699 337035 336906 338652
10260 338652 347790 356944 364960 371321 372197 373561 375638 372142 364651 357994 352740 354457 352437 355865
10246 355865 367519 384469 407577 427584 441218 448443 448557 446123 442943 443292 443003 433717 419556
10233 419556 406324 398975 400140 414490 443495 472452 498651 530045 561094 588399 614046 630131
10221 630131 641019 639301 628068 616263 615143 621358 634276 649874 666635 690818 727469 767635
$$ packed form
10312C21000L606L330J677P161L364j1236k1688k7972l4764k7635j2583L398J4502
10299B22160J0534K549k381n512k527J194k102n691m821n47l702j49K234K085
10285B13324Q794J6879K4932L3815N0162O1563P8891O7986L2951r871l5351l2591
10273E11484l0131l1724k4872k9160k4952j0606o280l733m569m758l664j29J746
10260C38652R138R154Q016O361Q76J364K077l496p491o657n254J717k020L428
10246C55865J1654J6950K3108K0007J3634P225J14k434l180L49k89r286j4161
10233D19556j3232p349J165J4350K9005K8957K6199L1394L1049K7305K5647J6085
10221F30131J0888j718j1233j1805j120O215J2918J5598J6761K4183L6651M0166
$$ plain form
10209 767635 806759 859000 909942 950954 990350 1031492 1067668 1098617 1131468 1177343 1244259
10198 1244259 1326084 1409090 1492657 1566653 1636272 1709367 1797958 1897653 2007574 2127729 2253832
10187 2253832 2389281 2526928 2661049 2801372 2962991 3153130 3378392 3627500 3894899
10178 3894899 4201733 4560807 4983851 5493509 6112016 6865739 7794877 8926226 10252123
10169 10252123 11766642 13459781 15225412 16820382 18130209 19425468 21165816 23741008
10161 23741008 27474384 32788092 40322195 51054054 66557179 89442920 123953366
10154 123953366 176260475 252035965 346576100 430653643 461159135 423160724 339732320
10147 339732320 247617275 172959496 121740492 88667742 67237439 52880535 42805438
$$ packed form
10209G67635L9124N2241N0942M1012L9396M1142L6176L0949L2851M5875O6916
10198A244259Q1825Q3006Q3567P3996O9619P3095Q8591R9695J09921J20155J26103
10187B253832J35449J37647J34121J40323J61619J90139K25262K49108K67399
10178C894899L06834L59074M23044N09658O18507P53723R29138J131349J325897
10169A0252123J514519J693139J765631J594970J309827J295259J740348K575192
10161B3741008L733376N313708P534103J0731859J5503125K2885741L4510446
10154A23953366N2307109P5775490R4540135Q4077543L0505492l7998411q3428404
10147C39732320r2115045p4657779n1219004l3072750k1430303j4356904j0075097
$$ plain form
10140 42805438 35428055 29889684 25729258 22652785 20461312 18954925 17775510 16509797
10132 16509797 14979188 13297274 11681670 10253586 9026171 8003737 7162137 6467030
10124 6467030 5890440 5392773 4955684 4573694 4242331 3958396 3704319 3461158 3228856
10115 3228856 3011157 2826984 2676109 2547929 2430985 2338337 2263277 2191705 2111399 2020017
10105 2020017 1926754 1849478 1797594 1754760 1708338 1654220 1590479 1515896 1442669 1377383 1324556
10094 1324556 1280760 1241291 1219599 1198698 1166067 1138261 1112266 1084013 1048967 1016954 989686
10083 989686 961857 922463 869716 820263 780775 761360 752679 751763 756270 772976 791928 811786
10071 811786 824056 830457 829816 823009 814675 797097 770942 745954 715447 681250 659934 645179
$$ packed form
10140D2805438p377383n538371m160426l076473k191473j506387j179415j265713
10132A6509797j530609j681914j615604j428084j227415j022434q41600o95107
10124F467030n76590m97667m37089l81990l31363k83935k54077k43161k32302
10115C228856k17699j84173j50875j28180j16944r2648p5060p1572q0306r1382
10105B020017r3263p7276n1884m2834m6422n4118o3741p4583p3227o5286n2827
10094A324556m3796l9469k1692k0901l2631k7806k5995k8253l5046l2013k7268
10083I89686k7829l9394n2747m9453l9488j9415q681r16M507J6706J8952J9858
10071H11786J2270O401o41o807q334j7578k6155k4988l0507l4197k1316j4755
$$ plain form
10059 645179 634354 622059 613026 605993 598163 587014 570250 552533 530765 517820 506577 492640
10047 492640 476989 460145 450940 444667 443655 455362 480664 516678 566139 631500 724862 866289
10035 866289 1096258 1495327 2226240 3487482 4867013 4865833 3800109 2566638 1768304
10026 1768304 1361205 1163228 1048661 953311 868754 806495 758370 726026 699922 672547 638963
10015 638963 604641 572796 544070 521048 491439 454785 419975 394072 370437 354909 348506 341218
10003 341218 328130 318559 314265 314961 315174 310917 290488 251553 205953 172269 154440 155494 165066
9990 165066 173526 181029 191421 200231 211032 219768 227513 240077 250844 267133 284631 305639 318031
9977 318031 332641 346687 356165 354885 333796 304749 268926 230876 203479 180334 162928 150894
$$ packed form
10059F45179j0825j2295r033p033p830j1149j6764j7717k1768j2945j1243j3937
10047D92640j5651j6844r205o273j012J1707K5302L6014M9461O5361R3362J41427
10035H66289K29969L99069P30913J261242J379531j180j065724j233471p98334
10026A768304m07099j97977j14567r5350q4557o2259m8125l2344k6104k7375l3584
10015F38963l4322l1845k8726k3022k9609l6654l4810k5903k3635j5528o403p288
10003C41218j3088r571m294O96K13m257k0429l8935m5600l3684j7829J054R572
9990A65066Q460P503J0392Q810J0801Q736P745J2564J0767J6289J7498K1008J2392
9977C18031J4610J4046R478j280k1089k9047l5823l8050k7397k3145j7406j2034
$$ plain form
9965 150894 148778 154252 162654 167595 166282 157836 155891 163759 169170 172166 171752 170046 166043 168015 171191
9950 171191 172351 173980 168919 165208 162536 158902 155464 151322 150135 150722 140662 134335 124248 119144
9936 119144 122510 128868 131569 130702 126268 114594 107792 103762 99078 98522 101726 99616 97869 94140 96500
9921 96500 95658 102223 107886 110908 113054 115077 114072 114321 113943 110409 108074 108900 108098 101714 102985 103526
9905 103526 104377 107529 110865 118861 137520 153966 168375 175270 176144 174200 166758 160488 150665 138393
9891 138393 127346 119257 116082 111738 111103 105640 107623 107490 106945 107509 104764 100629 101337 110179 115694
9876 115694 117274 117568 119919 124657 127808 122640 118156 113167 114368 120827 125292 125148 107892 94419
9862 94419 86058 76063 68586 65328 68314 65069 56754 53290 52076 49270 48030 53352 59606 63785 75434
$$ packed form
9965A50894k116N474Q402M941j313q446j945P868N411K996m14j706m003J972L176
9950A71191J160J629n061l711k672l634l438m142j187N87j0060o327j0087n104
9936A19144L366O358K701q67m434j1674o802m030m684n56L204k110j747l729K360
9921I6500q42O565N663L022K146K023j005K49l78l534k335Q26q02o384J271N41
9905A03526Q51L152L336P996J8659J6446J4409O895Q74j944p442o270r823j2272
9891A38393j1047q089l175m344o35n463J983j33n45N64k745m135P08Q842N515
9876A15694J580K94K351M738L151n168m484m989J201O459M465j44j7256j3473
9862I4419q361r995p477l258K986l245q315l464j214k806j240N322O254M179J1649
$$ plain form
9847 75434 100765 120644 121695 107649 94268 81183 78689 79240 87401 100009 115339 126878 125713
9834 125713 120218 113922 108635 104225 105491 105015 107839 111055 110566 109298 105453 100222 96125 89828 87325
9819 87325 94131 99407 97134 96134 99477 99799 99129 98606 101723 107082 109329 109968 111464 111321 115030 114341
9803 114341 115091 120050 127030 129323 125940 123825 121382 125765 131597 135305 136853 140378 145642 152784 157756
9788 157756 163867 177200 186012 194156 198298 198966 201071 205987 210008 212933 215796 218993 230098 242200
9774 242200 256331 263408 274489 288266 307841 333362 365523 399536 443965 496129 561088 627254
9762 627254 703605 793155 901618 1043536 1239209 1508906 1882093 2416136 3172777 4217500
9752 4217500 5540819 6949644 8104537 8777493 8887064 8348439 7226898 5837900 4541852
$$ packed form
9847G5434K5331J9879J051j4046j3381j3085k494N51Q161J2608J5330J1539j165
9834A25713n495o296n287m410J266m76K824L216m89j268l845n231m097o297k503
9819H7325O806N276k273j000L343L22o70n23L117N359K247O39J496j43L709o89
9803A14341P50M959O980K293l383k115k443M383N832L708J548L525N264P142M972
9788A57756O111J3333Q812Q144M142O68K105M916M021K925K863L197J1105J2102
9774B42200J4131P077J1081J3777J9575K5521L2161L4013M4429N2164O4959O6166
9762F27254P6351Q9550J08463J41918J95673K69697L73187N34043P56641J044723
9752D217500J323319J408825J154893O72956J09571n38625j121541j388998j296048
$$ plain form
9743 4541852 3528785 2811393 2321480 1990545 1768272 1627356 1543801 1509717 1523245 1587844
9733 1587844 1703427 1881698 2121817 2406194 2712405 2998760 3209303 3316335 3323097 3269508
9723 3269508 3232649 3268292 3410132 3636418 3880236 4092025 4339839 4749222 5465502 6613611
9713 6613611 8375411 10968158 14524464 18715465 22514005 24749211 24838958 23152185 20872478
9704 20872478 19161711 18401405 18026193 17069463 15080278 12456936 9898585 7847171 6379730
9695 6379730 5384986 4748841 4362937 4156446 4049526 3929441 3717542 3437800 3176577 3002521
9685 3002521 2926687 2948577 3086518 3339942 3739526 4288381 4863538 5235255 5340028 5365350
9675 5365350 5547985 6038078 6921566 8319130 10419877 13396190 17112457 20681046 22814820
$$ packed form
9743D541852j013067p17392m89913l30935k22273j40916q3555l4084J3528O4599
9733A587844J15583J78271K40119K84377L06211K86355K10543J07032O762n3589
9723C269508l6859L5643J41840K26286K43818K11789K47814M09383P16280J148109
9713F613611J761800K592747L556306M191001L798540K235206Q9747j686773k279707
9704B0872478j710767p60306l75212r56730j989185k623342k558351k051414j467441
9695F379730r94744o36145l85904k06491j06920j20085k11899k79742k61223j74056
9685C002521p5834K1890J37941K53424L99584N48855N75157L71717J04773K5322
9675E365350J82635M90093Q83488J397564K100747K976313L716267L568589K133774
$$ plain form
9666 22814820 23243453 22993629 23468695 25433500 28502719 31261567 32015039 30053566 26205665
9657 26205665 21809848 17735238 14274009 11499138 9435774 8041202 7195027 6713217
9649 6713217 6300716 5726463 5018563 4347061 3809469 3428377 3174905 3022252 2964846 3002939
9639 3002939 3121147 3246771 3291063 3244501 3179348 3181543 3299692 3553170 3965786 4589276
9629 4589276 5474837 6582265 7692749 8555945 9252585 10171251 11692044 13971080 16838889
9620 16838889 19845167 22228230 23151591 22449379 20570006 17870861 14699085 11568724
9612 11568724 8948425 7029051 5736466 4890977 4283335 3744032 3227661 2768570 2396062
9603 2396062 2110714 1891497 1712694 1551410 1410088 1289950 1191730 1121299 1065109 1023945
$$ packed form
9666B2814820M28633k49824M75066J964805L069219K758848P53472j961473l847901
9657B6205665m395817m074610l461229k774871k063364j394572q46175m81810
9649F713217m12501n74253p07900o71502n37592l81092k53472j52653n7406L8093
9639C002939J18208J25624M4292m6562o5153K195J18149K53478M12616O23490
9629D589276Q85561J107428J110484Q63196O96640R18666J520793K279036K867809
9620A6838889L006278K383063R23361p02212j879373k699145l171776l130361
9612A1568724k620299j919374j292585q45489o07642n39303n16371m59091l72508
9603B396062k85348k19217j78803j61284j41322j20138r8220p0431n6190m1164
$$ plain form
9593 1023945 996334 986702 989301 1001433 1026702 1062682 1118128 1205269 1331870 1518483 1779074
9582 1779074 2160592 2701158 3448292 4399891 5405797 6207814 6638375 6656297 6210895 5333358
9572 5333358 4247109 3224933 2425263 1861828 1471791 1196770 999443 857651 752592
9563 752592 673146 611481 564755 527597 481230 438350 402675 371002 341446 314048 286867 262405
9551 262405 247142 234230 224623 213552 206216 196475 188968 182799 176629 174766 173555 170516 169964 167851
9537 167851 166412 162854 157637 152120 149851 147242 144614 136328 131322 125522 121697 121010 120658 120262 119169
9522 119169 121499 114883 109739 109877 110996 110767 110269 105702 96194 90994 85137 80331 78647 78175 76560
9507 76560 78802 80136 78530 76328 79042 78006 75953 80731 86114 90845 89851 89728 89773 85238 80817 79493
$$ packed form
9593A023945k7611r632K599J2132K5269L5980N5446Q7141J26601J86613K60591
9582A779074L81518N40566P47134R51599J005906Q02017M30561J7922m45402q77537
9572E333358j086249j022176p99670n63435l90037k75021j97327j41792j05059
9563G52592p9446o1665m6726l7158m6367m2880l5675l1673k9556k7398k7181k4462
9551B62405j5263j2912r607j1071p336r741p507o169o170j863j211l039n52k113
9537A67851j439l558n217n517k269k609k628q286n006n800l825o87l52l96j093
9522A19169K330o616n144J38J119k29m98m567r508n200n857m806j684m72j615
9507G6560K242J334j606k202K714j036k053M778N383M731r94j23M5m535m421j324
$$ plain form
9491 79493 74714 68769 67948 67562 69607 73613 70282 61466 57456 64555 67383 64575 61303 56700 56991
9476 56991 56290 58436 57191 59806 56275 55042 52473 51776 53181 57361 58552 62457 60848 52574 47331
9461 47331 43978 49794 53799 55700 54718 55431 55913 53036 53570 53381 57317 56772 53614 51487 51699 51326 49946
9444 49946 48686 44143 43498 46993 43441 45674 46822 43807 43738 39076 35404 31468 34238 34719 32057 34998
9428 34998 37729 37195 38839 42630 39698 42561 39305 40086 37214 33680 33334 34369 37761 36003 33931
9413 33931 35325 33837 34895 40915 40603 42679 39894 36753 39689 40546 44253 42085 35976 31801 26812
9398 26812 32633 36262 34037 33084 31591 32123 33450 30692 28226 28016 26404 23004 23000 22896 23864 27344 29230
9381 29230 22271 20249 21204 24674 31001 27030 25853 31424 31954 25039 27181 27843 31005 29092 23753
$$ packed form
9491G9493m779n945q21l86K045M006l331q816m010P099K828k808l272m603K91
9476E6991p01K146j245K615l531j233k569o97J405M180J191L905j609q274n243
9461D7331l353N816M005J901r82P13M82k877N34j89L936n45l158k127K12l73j380
9444D9946j260m543o45L495l552K233J148l015o9m662l672l936K770M81k662K941
9428C4998K731n34J644L791k932K863l256P81k872l534l46J035L392j758k072
9413C3931J394j488J058O020l12K076k785l141K936Q57L707k168o109m175m989
9398B6812N821L629k225r53j493N32J327k758k466k10j612l400mj04R68L480J886
9381B9230o959k022R55L470O327l971j177N571N30o915K142O62L162j913n339
$$ plain form
9366 23753 22236 23454 25804 23148 21093 22606 22475 27902 28176 26598 27261 28331 27650 33925 34763 38805
9350 38805 41312 44441 47714 53399 58973 62409 65971 65701 61813 53748 42977 36994 32550 27681 27278
9335 27278 21442 18438 17639 15477 19713 21736 22172 23483 23669 22279 26531 32004 27836 27476 28249 26393
9319 26393 30532 27948 25846 29588 32302 34347 38412 41746 45208 48517 58019 67334 80989 100628
9305 100628 126051 147375 154442 148409 134400 125033 116194 102223 89445 79245 71670 59314 52794
9292 52794 50068 44779 40002 35320 37568 41971 37805 38098 39613 40365 37865 39042 37581 32330 33101
9277 33101 38123 44261 48344 47262 51280 51166 47979 46057 48717 58084 74688 92196 111144 127130
9263 127130 140339 149309 149278 150884 156624 165336 171479 173299 167966 158687 141320 117350 98961 85634
$$ packed form
9366B3753j517J218K350k656k055J513j31N427K74j578O63J070o81O275Q38M042
9350C8805K507L129L273N685N574L436L562k70l888q065j0771n983m444m869m03
9335B7278n836l004p99k162M236K023M36J311J86j390M252N473m168l60P73j856
9319B6393M139k584k102L742K714K045M065L334L462L309R502R315J3655J9639
9305A00628K5423K1324P067o033j4009r367q839j3971j2778j0200p575j2356o520
9292E2794k726n289m777m682K248M403m166K93J515P52k500J177j461n251P71
9277C3101N022O138M083j082M018j14l187j922K660R367J6604J7508J8948J5986
9263A27130J3209Q970l1J606N740Q712O143J820n333r279j7367k3970j8389j3327
$$ plain form
9249 85634 73336 66711 64053 62232 57814 47845 41912 37608 38650 35586 33975 34283 29871 24645 25655
9234 25655 32776 32832 28438 32824 36888 38941 36702 34480 37185 45953 50276 60116 63741 63337 70261
9219 70261 80818 90241 103657 118726 127556 132943 129198 121814 106706 91256 75149 58901 53384
9206 53384 48077 38792 37319 37713 35373 39673 42848 38175 32337 28851 26826 28626 27519 22111 20142
9191 20142 13544 13545 18715 19009 15954 11859 14070 18313 20251 16748 16374 19836 18387 19271 23616 26109
9175 26109 34521 38759 40756 42684 41636 37656 34574 30487 26315 22279 23523 23200 19920 19160 18240
9160 18240 15219 12802 13243 16111 18380 16370 19886 21603 19461 16922 20238 17290 12544 12231 10291
9145 10291 10109 12072 11253 7049 5406 6719 7793 5772 11970 15429 11948 9807 8349 7556 9374
$$ packed form
9249H5634j2298o625k658j821m418r969n933m304J042l064j611L08m412n226J010
9234B5655P121N6m394M386M064K053k239k222K705Q768M323R840L625m04O924
9219G0261J0557R423J3416J5069Q830N387l745p384j5108j5450j6107j6248n517
9206E3384n307r285j473L94k340M300L175m673n838l486k025J800j107n408j969
9191B0142o598JN170K94l055m095K211M243J938l503l74L462j449Q84M345K493
9175B6109Q412M238J997J928j048l980l082m087m172m036J244l23l280p60r20
9160A8240l021k417M41K868K269k010L516J717k142k539L316k948m746l13j940
9145A0291j82J963q19m204j643J313J074k021O198L459l481k141j458p93J818
$$ plain form
9130 9374 12601 13575 9156 6936 6281 7152 12321 15383 18801 19994 9349 3464 5240 5897 2519 5352
9114 5352 6580 10427 12870 9352 7923 8655 7712 5580 4299 3201 7720 11756 12971 12516 10456 8058
9098 8058 3210 1652 6138 10239 10153 8602 12191 13637 11614 12811 18233 20005 15408 12065 8151
9083 8151 6049 80 -5080 533 2446 1772 3297 3181 2914 460 470 6236 10427 9071 6311 7151
9067 7151 8780 9084 7203 2512 2587 6379 6464 4073 1786 -1065 5377 9948 8086 10568 12849 12011
9051 12011 12179 11688 9339 6778 6191 5310 5477 4185 4527 7153 7295 10179 12984 9599 10584 13951 12108
9034 12108 11198 8686 11046 12224 13668 10110 3306 4084 10290 11775 8817 8849 9747 14863 11581 4570
9018 4570 556 2192 7577 7604 5707 5207 3921 3139 1601 790 3080 3020 -650 560 3809 5278 4481
$$ packed form
9130I374L227R74m419k220o55Q71N169L062L418J193j0645n885J776O57l378K833
9114E352J228L847K443l518j429P32r43k132j281j098M519M036J215m55k060k398
9098H058m848j558M486M101q6j551L589J446k023J197N422J772m597l343l914
9083H151k102n969n160N613J913o74J525j16k67k454J0N766M191j356k760Q40
9067G151J629L04j881m691P5L792Q5k391k287k851O442M571j862K482K281q38
9051A2011J68m91k349k561n87q81J67j292L42K626J42K884K805l385R85L367j843
9034A2108r10k512K360J178J444l558o804P78O206J485k958L2Q98N116l282p011
9018D570m014J636N385K7j897n00j286p82j538q11K290o0l670J210L249J469p97
$$ plain form
9001 4481 2144 3261 9287 13637 11991 7983 11234 10426 11241 8726 5395 6187 3884 -2333 -1625 1661
8985 1661 3554 2023 2903 1516 1467 -1420 -1441 2901 5434 6245 4869 4200 4601 8790 9569 3596 163
8968 163 -1296 -331 303 -1898 2908 4978 2969 2499 785 -171 -2617 -1189 1918 7798 8212 4982
8952 4982 3278 6913 8197 10869 9480 8893 9523 9420 7802 4912 6612 7764 3573 -1890 -3933 -493
8936 -493 2070 8558 8849 5141 6392 9996 8429 12692 13375 9124 12277 11857 6190 3354 457 2431
8920 2431 4798 8919 8421 8299 6833 4261 3276 9894 11082 8846 9223 5657 8073 11062 14382 13136
8904 13136 10755 10910 11354 10633 9311 9966 14041 13995 12525 7493 4450 1552 4571 771 1473 3108
8888 3108 4842 3842 5629 9163 10337 11317 7126 3977 9821 10127 3293 -265 1830 4906 7529
$$ packed form
9001D481k337J117O026M350j646m008L251q08Q15k515l331P92k303o217P08L286
8985A661J893j531Q80j387m9k887k1M342K533Q11j376o69M01M189P79n973l433
8968A63j459R65O34k201M806K070k009m70j714r56k446J428L107N880M14l230
8952D982j704L635J284K672j389n87O30j03j618k890J700J152m191n463k043L440
8936d93K563O488K91l708J251L604j567M263O83m251L153m20n667k836k897J974
8920B431K367M121m98j22j466k572r85O618J188k236L77l566K416K989L320j246
8904A3136k381J55M44p21j322O55M075m6j470n032l043k898L019l800P02J635
8888C108J734j000J787L534J174R80m191l149N844L06o834l558K095L076K623
$$ plain form
8873 7529 8801 8171 812 -3890 608 4320 6840 8649 6270 3066 1759 4857 6629 7904 7175
8858 7175 5820 1702 3834 8259 8797 9522 9755 10135 8195 -737 403 2792 4148 2516 -782 -436
8842 -436 2028 8688 8979 13799 12257 9265 6370 8250 4872 2898 8562 12502 10330 7223 3665
8827 3665 3287 1922 1919 -1188 -2913 -4726 651 1273 2495 6480 6343 2352 1873 6126 12014 12412 10922
8810 10922 7607 4273 3542 1214 2358 2470 4821 6457 9155 6357 20 -607 4251 717 -3028
8795 -3028 988 1199 3182 7629 11210 15759 11844 14056 15138 9758 8825 10078 8963 10857 12282
8780 12282 7108 -750 -2114 -3097 -1194 2328 2506 1901 2772 4274 4167 2009 519 -1885 206 3863
8764 3863 4905 7763 6279 5683 5585 7785 9756 5968 4806 5431 10158 9551 6538 6696 7556 10597 12538
$$ packed form
8873G529J272o30p359m702M498L712K520J809k379l204j307L098J772J275p29
8858G175j355m118K132M425N38P25K33L80j940q932J140K389J356j632l298L46
8842d36K464O660K91M820j542k992k895J880l378j974N664L940k172l107l558
8827C665l78j365ll107j725j813N377O22J222L985j37l991m79M253N888L98j490
8810A0922l315l334p31k328J144J12K351J636K698k798o337o27M858l534l745
8795c028M016K11J983M447L581M549l915K212J082n380r33J253j115J894J425
8780A2282n174p858j364r83J903L522J78o05Q71J502j07k158j490k404K091L657
8764C863J042K858j484n96r8K200J971l788j162O25M727o07l013J58Q60L041J941
$$ plain form
8747 12538 13936 10981 8890 5809 4606 11610 11031 9972 8534 6771 5119 1293 -1980 -19 9595
8732 9595 9287 8131 7188 5408 3260 861 904 -922 268 4233 5869 8841 8308 7498 8949 7826
8716 7826 9106 10291 12845 9774 8742 9241 10916 10021 7707 5532 8910 7237 5718 10388 13458
8701 13458 7767 5446 10133 11522 6895 4102 -630 3348 6192 2581 5777 6656 8262 8794 7065
8686 7065 4678 8773 10823 13390 11787 12257 6643 5064 8021 8296 5825 2633 128 2605 5461
8671 5461 7085 3577 -496 1190 3845 7181 7617 4891 2874 3247 6117 10730 8956 9703 12133 9816
8655 9816 9932 11978 11943 10177 7958 7333 7267 6383 9378 8984 7740 7831 5867 6831 5686 4832 5652 9602
8637 9602 10120 6870 6031 4604 3853 1830 3896 4077 4005 6232 5603 1280 968 2422 9230 15930 11655
$$ packed form
8747A2538J398k955k091l081j203P004n79j059j438j763j652l826l273J961R614
8732I595l08j156r43j780k148k399M3j826J190L965J636K972n33q10J451j123
8716G826J280J185K554l071j032M99J675q95k314k175L378j673j519M670L070
8701A3458n691k321M687J389m627k793m732L978K844l611L196Q79J606N32j729
8686G065k387M095K050K567j603M70n614j579K957K75k471l192k505K477K856
8671E461J624l508m073J686K655L336M36k726k017L73K870M613j774P47K430k317
8655I816J16K046l5j766k219o25o6q84K995l94j244R1j964R64j145q54Q20L950
8637I602N18l250q39j427p51k023K066J81p2K227o29m323l12J454O808O700m275
$$ plain form
8620 11655 3845 -954 -2049 2979 6267 12538 16700 16095 17771 24975 28008 24156 17640 19375 14118
8605 14118 6227 6335 7323 10081 12980 11549 11726 14727 17930 19634 21547 24450 28213 26446 33656
8590 33656 41202 47978 50463 54630 61257 64421 61521 52960 42826 35085 26179 23874 21208 15593
8576 15593 11668 15629 14843 11921 8498 7532 8797 10230 12668 13464 10915 11577 11479 9938 15637 14944
8560 14944 10156 10610 12692 10366 8772 12245 5463 2595 6922 8897 5539 5259 8748 13075 14592
8545 14592 9751 517 4555 7581 5533 4479 3221 4142 1630 4179 2786 6685 5639 5747 2865
8530 2865 4202 338 -1078 4343 -61 -4302 -2135 6235 7266 1881 594 7118 8891 12376 14631
8515 14631 18652 15928 8471 3580 2475 3029 7496 3840 1406 -262 -2684 -934 -687 -471 -6457
$$ packed form
8620A1655p810m799j095N028L288O271M162o05J676P204L033l852o516J735n257
8605A4118p891J08R88K758K899j431J77L001L203J704J913K903L763j767P210
8590C3656P546O776K485M167O627L164k900q561j0134p741q906k305k666n615
8576A5593l925L961p86k922l423r66J265J433K438P96k549O62r8j541N699o93
8560A4944m788M54K082k326j594L473o782k868M327J975l358k80L489M327J517
8545A4592m841r234M038L026k048j054j258R21k512K549j393L899j046J08k882
8530B865J337l864j416N421m404m241K167Q370J031n385j287O524J773L485K255
8515A4631M021k724p457m891j105N54M467l656k434j668k422J750K47K16n986
$$ plain form
8500 -6457 -7112 -4835 -518 4321 5622 7152 10040 11143 14234 12142 6634 3380 -544 1110 6926
8485 6926 8052 5157 4166 6793 8424 11460 6490 4222 8161 8543 6264 1404 -2290 1492 5231
8470 5231 5745 1082 -4483 -4668 2333 7337 7365 8231 5255 0 -3475 -3043 1745 4670 1536 2685
8454 2685 408 -941 498 1892 3530 4908 5232 10839 15374 16639 12480 9710 8471 4225 -90
8439 -90 -6343 -6771 -542 -523 1212 6653 6360 459 -834 -1676 2942 4089 6771 9371 12496 11309 6961
8422 6961 2007 2626 -1265 -1746 -3489 -9501 -8539 -4660 567 -281 -3110 -5673 -5740 -2025 -2409 -5044 -4937
8405 -4937 -5783 -5549 -5606 -770 4950 5564 4052 -559 -438 -1923 -1432 -1352 -876 2311 7148 9430 7670
8388 7670 991 -2330 -4776 -4992 -3105 -3838 -4909 -1934 -65 1338 2732 5170 2740 361 -2601
$$ packed form
8500f457o55K277M317M839J301J530K888J103L091k092n508l254l924J654N816
8485F926J126k895r91K627J631L036m970k268L939L82k279m860l694L782L739
8470E231N14m663n565j85P001N004K8Q66k976n255l475M32M788K925l134J149
8454B685k277j349J439J394J638J378L24N607M535J265m159k770j239m246m315
8439i0o253m28O229J9J735N441k93n901j293q42M618J147K682K600L125j187m348
8422F961m954O19l891m81j743o012R62L879N227q48k829k563o7L715l84k635J07
8405d937q46K34n7M836N720O14j512m611J21j485M91Q0M76L187M837K282j760
8388G670o679l321k446k16J887p33j071K975J869J403J394K438k430k379k962
$$ plain form
8373 -2601 5930 7156 4907 3431 2929 1331 175 -81 5702 6262 5529 1230 -2815 -865 5682 6390
8357 6390 2925 1547 107 1523 6590 6173 4603 1945 53 1924 1019 1941 4792 5605 3360 -596
8341 -596 -114 -1421 -2145 823 732 1173 33 4924 11615 10875 7518 4785 4337 2164 6560 5740 -557
8324 -557 -225 3576 5150 3788 -583 -6341 -5354 -930 1891 3890 6308 8902 10022 6148 853 6826
8308 6826 3437 -878 1301 5441 2773 2466 -624 -5799 -6732 -5147 -4280 -605 4491 6844 8004 8560
8292 8560 346 -4875 4394 8170 8897 9606 6417 2914 1592 1805 67 618 8958 8072 7861 9207
8276 9207 8293 6566 1571 1185 3700 2406 596 -4152 -1069 5449 9428 10405 9862 6580 2864 2782
8260 2782 682 -2235 -3803 -677 3390 438 -2166 -3422 3247 2434 1840 4317 4993 -11 -2630 -2823
$$ packed form
8373b601Q531J226k249j476n02j598j156k56N783N60p33m299m045J950O547P08
8357F390l465j378j440J416N067m17j570k658j892J871r05R22K851Q13k245l956
8341e96M82j307p24K968r1M41j140M891O691p40l357k733m48k173M396q20o297
8324e57L32L801J574j362m371n758R87M424K821J999K418K594J120l874n295N973
8308F826l389m315K179M140k668l07l090n175r33J585Q67L675N096K353J160N56
8292H560q214n221R269L776P27P09l189l503j322K13j738N51Q340q86k11J346
8276I207r14j727m995l86K515j294j810m748L083O518L979R77n43l282l716q2
8260B782k100k917j568L126M067k952k604j256O669q13n94K477O76n004k619j93
$$ plain form
8244 -2823 -4488 -6318 -5080 -2454 -1931 -71 2833 4134 3320 211 811 2 527 3954 2126 -2095
8228 -2095 -973 -3725 -6736 -5144 -3026 272 801 1135 2223 3231 5455 3408 1294 -74 3679
8213 3679 8485 8965 5692 -1079 -1459 -111 1444 2074 2634 -1206 -4507 -5278 -3091 -2269 758 5460
8197 5460 2618 6108 7247 2819 5104 5331 6018 8359 7463 5330 5248 9253 7847 931 834 4236 827
8180 827 -2965 -3045 -2061 1050 2769 828 2413 4023 3529 6889 4559 5120 10012 7997 4441 2226
8164 2226 -112 1265 1828 67 -900 5368 9550 6820 9741 5075 2571 2825 1146 4887 7705 5993
8148 5993 7790 10977 2335 -3418 -9499 -8637 -6017 -2396 -9 2581 4572 10060 12959 11371 8433
8133 8433 5544 1904 1458 4668 3289 1454 1378 1110 -50 -991 -3844 -3455 -5065 -5556 -2254 2208 1983
$$ packed form
8244b823j665j830J238K626N23J860K904J301q14l109O00q09N25L427j828m221
8228b095J122k752l011J592K118L298N29L34J088J008K224k047k114j368L753
8213C679M806M80l273o771l80J348J555O30N60l840l301p71K187Q22L027M702
8197E460k842L490J139m428K285K27O87K341q96k133q2M005j406o916r7L402l409
8180H27l792q0R84L111J719j941J585J610m94L360k330N61M892k015l556k215
8164B226k338J377N63j761r67O268M182k730K921m666k504K54j679L741K818j712
8148E993J797L187q642n753o081Q62K620L621K387K590J991N488K899j588k938
8133H433k889l640m46L210j379j835p6k68j160r41k853L89j610m91L302M462k25
$$ plain form
8116 1983 4000 6414 8551 6283 5064 4952 3226 2053 3829 739 112 -2163 -1667 -2911 -2286 0
8100 0 -2010 1607 2318 1466 2708 7301 7352 5926 -1231 1473 1913 870 2616 4780 5107 5589 5469 1240
8082 1240 -257 1722 -2081 -3127 -341 -1083 -2187 2153 5081 4405 7685 11629 14124 12650 4537
8067 4537 2659 2141 664 153 6139 5347 5138 5655 2937 -1909 -2607 -3151 -4271 -1926 892 1481 -694
8050 -694 -3393 -6318 -6188 -1058 -1200 -3717 1367 7371 6708 5647 5938 11984 13458 9920 2636 -2203
8034 -2203 222 4444 2221 9059 6671 5407 10750 12806 10093 7383 5804 2614 925 523 1048
8019 1048 4554 6536 6938 6684 6203 2723 2058 5650 6839 4986 5119 807 -3380 -1298 2453 3110
8003 3110 2993 5344 3780 5614 8823 10276 5340 -1640 32 4022 5197 7522 6922 7542 5501 4148
$$ packed form
8116A983K017K414K137k268j219j12j726j173J776l090o27k275M96j244O25K286
8100@k010L617P11q52J242M593N1j426p157K704M40j043J746K164L27M82j20m229
8082A240j497J979l803j046K786p42j104M340K928o76L280L944K495j474q113
8067D537j878n18j477n11N986p92k09N17k718m846o98n44j120K345K818N89k175
8050f94k699k925J30N130j42k517N084O004o63j061K91O046J474l538p284m839
8034b203K425M222k223O838k388j264N343K056k713k710j579l190j689m02N25
8019A048L506J982M02k54m81l480o65L592J189j853J33m312m187K082L751O57
8003C110j17K351j564J834L209J453m936o980J672L990J175K325o00O20k041j353
$$ plain form
7987 4148 11520 15837 17133 14618 5318 822 1094 3957 8351 9391 9666 12990 13368 10374 4210 4593
7971 4593 -56 -3992 -5821 -2976 -442 -2422 -2952 2459 7499 5554 4313 5420 2281 1848 5302
7956 5302 7213 6335 9286 7128 7654 11297 2710 -2787 -659 4091 4727 5703 4226 6038 5480 2647
7940 2647 3140 388 2929 2183 4968 6980 7905 10015 6688 5970 8041 9016 6619 5760 7605 8305 6728
7923 6728 7189 6609 7967 7014 6761 4441 4798 5497 8012 12332 10307 11252 11341 6268 9884 8473 6074
7906 6074 -484 -3624 -4308 -5957 -5539 -3427 -4480 -6862 -6352 -3436 -1824 2960 4043 2816 2475 264
7890 264 -295 801 -1498 7580 12115 7201 4846 4839 255 4664 3639 5356 7456 4901 -82 -3009
7874 -3009 995 5608 9594 10543 6574 1999 -3119 -822 237 -1296 -1431 -2878 -4142 -4913 67 5030
$$ packed form
7987D148P372M317J296k515r300m496K72K863M394J040K75L324L78k994o164L83
7971D593m649l936j829K845K534j980n30N411N040j945j241J107l139m33L454
7956E302J911q78K951k158N26L643q587n497K128M750O36R76j477J812n58k833
7940B647M93k752K541p46K785K012R25K110l327p18K071R75k397q59J845P00j577
7923F728M61n80J358r53k53k320L57O99K515M320k025R45Q9n073L616j411k399
7906F074o558l140o84j649M18K112j053k382N10K916J612M784J083j227l41k211
7890B64n59J096k299R078M535m914k355pm584M409j025J717K100k555m983k927
7874c009M004M613L986R49l969m575n118K297J059j533j35j447j264p71M980M963
$$ plain form
7858 5030 -335 -2435 970 1169 3018 4288 4439 6656 3805 3583 6940 3288 4295 6473 8367 -186
7842 -186 -5078 -3698 -4118 -5356 -3565 697 285 -86 1096 996 1624 1155 1580 367 -176 -3204 -5184
7825 -5184 -5597 -3917 -1762 -1321 -2673 -5427 -7650 -4381 -5513 -3527 -3966 -3358 -789 4883 8089 6327
7809 6327 9547 9738 5975 2263 5 4305 -138 -1423 -3874 -7616 -4100 -813 -3904 -4752 -3612
7794 -3612 841 8020 9069 5706 4759 3974 1383 -1248 -3287 -1837 4631 5407 3695 6372 3369 3536
7778 3536 8187 5419 2692 3301 -950 -3158 -10676 -9071 -8673 -10262 -7718 -1294 -468 -2834 -8068 -5643
7762 -5643 1717 4022 6050 5351 2909 1530 6741 6446 -2767 -7516 -5953 -2513 -1300 -4056 -1994
7747 -1994 -3450 -3936 -1833 -2854 -6567 -5626 -754 2192 3659 2930 1394 1969 1485 4739 5452 5127 5014
$$ packed form
7858E030n365k100L405J99J849J270J51K217k851k22L357l652J007K178J894q553
7842a86m892J380m20j238J791M262m12l71J182j00O28m69M25j213n43l028j980
7825e184m13J680K155M41j352k754k223L269j132J986m39O08K569N672L206j762
7809F327L220J91l763l712k258M300m443j285k451l742L516L287l091q48J140
7794c612M453P179J049l363r47p85k591k631k039J450O468P76j712K677l003J67
7778C536M651k768k727O09m251k208p518J605L98j589K544O424Q26k366n234K425
7762e643P360K305K028o99k442j379N211k95r213m749J563L440J213k756K062
7747a994j456m86K103j021l713R41M872K946J467p29j536N75m84L254P13l25j13
$$ plain form
7730 5014 3541 3083 2879 -1175 -1699 2689 1429 1069 2379 3726 4019 2731 -421 -3145 -286 -354 860
7713 860 683 -2316 -4445 -4136 -120 789 -449 -2317 -1928 -759 -1549 -2750 -5462 -4420 -2013 799
7697 799 -411 740 -880 570 3416 6837 4875 4931 3023 68 -2844 1628 5515 6320 2405 -2355
7681 -2355 -3613 -4496 -2921 -3574 -2361 -2815 -3959 -2029 1130 5327 4557 2855 -1145 2706 -544 -5991
7665 -5991 -6394 -4177 -4384 -1782 -726 1467 3367 2166 -1164 -550 -323 -6950 -9891 -5433 -6705 -9313
7649 -9313 -10833 -11602 -9909 -10995 -9113 -4374 -3843 -654 -1804 -5508 -1378 -781 -1114 -1118 -3343 -3098 -10
7632 -10 -2579 -2145 -3700 -4328 884 703 1247 -1733 -2063 51 2395 3406 672 -1771 -2106 2218 3402
7615 3402 3199 1884 3542 -1275 -4249 -3121 -1875 1515 1706 1414 679 -1168 731 -1135 -7237 -9950
$$ packed form
7730E014j473m58k04m054n24M388j260l60J310J347K93j288l152k724K859o8J214
7713H60j77k999k129L09M016R09j238j868L89J169p90j201k712J042K407K812
7697G99j210J151j620J450K846L421j962N6j908k955k912M472L887Q05l915m760
7681b355j258q83J575o53J213m54j144J930L159M197p70j702m000L851l250n447
7665e991m03K217k07K602J056K193J900j201l330O14K27o627k941M458j272k608
7649i313j520p69J693j086J882M739N31L189j150l704M130N97l33mk225K45L088
7632a0k569M34j555o28N212j81N44k980l30K114K344J011k734k443l35M324J184
7615C402k03j315J658m817k974J128J246L390J91k92p35j847J899j866o102k713
$$ plain form
7599 -9950 -5290 -4605 -3801 -6479 -5278 -4806 -7677 -6906 -1548 -878 -3138 -1626 -3051 -3826 -1453 -1699 -2327
7582 -2327 -1912 -4271 -5603 -2578 -2730 -5140 -3821 853 -1050 -2164 632 4367 5580 3743 -1994
7567 -1994 -1049 -3543 -4027 -5947 -6552 -5536 -932 -4070 -3979 -2414 -3231 -1033 -512 -1868 -6878 -8261 -2802
7550 -2802 -898 -4796 -3105 -2549 -4976 -1279 356 5073 5398 1589 -1415 -3395 -8019 -10358 -6205
7535 -6205 -2135 -5850 -10491 -9107 -3899 -3045 -776 1791 4108 1185 -3662 -4558 -309 1316 -1125
7520 -1125 -1299 -6703 -5444 -509 6384 10707 11029 5852 2213 103 -1610 379 580 -3117 -6961 -5166
7504 -5166 -3915 -4954 -4321 1558 4830 1747 -3370 -1620 4213 8624 9203 9942 13403 9010 5871 3385
7488 3385 1547 2309 3976 4413 1308 -1642 966 2658 4551 4196 3803 4880 9133 8090 2218 -1902
$$ packed form
7599i950M660O85Q04k678J201M72k871P71N358O70k260J512j425p75K373k46o28
7582b327M15k359j332L025j52k410J319M674j903j114K796L735J213j837n737
7567a994R45k494m84j920o05J016M604l138R1J565q17K198N21j356n010j383N459
7550b802J904l898J691N56k427L697J635M717L25l809l004j980m624k339M153
7535f205M070l715m641J384N208Q54K269K567K317k923m847q96M249J625k441
7520a125j74n404J259M935O893M323L22n177l639k110j713J989K01l697l844J795
7504e166J251j039O33N879L272l083n117J750N833M411N79P39L461m393l139k486
7488C385j838P62J667M37l105k950K608J692J893l55l93J077M253j043n872m120
$$ plain form
7472 -1902 -1652 -3269 -2144 -691 -8121 -8764 -5958 -3565 -2065 -1038 -351 -463 -616 4007 4294 2907
7456 2907 1545 2903 -1121 -1097 2761 2681 -1951 -5768 -4263 -8391 -7722 -3946 -1607 -2405 -6520 -7978
7440 -7978 -2956 -6749 -6451 -3562 -5193 -5816 -2627 -119 -1850 -3835 -3704 1899 -1242 -7727 -4901 2024
7424 2024 4386 852 -2024 -620 1571 1192 -640 2592 6107 4922 6557 9727 6334 -1883 -3798
7409 -3798 -3463 -1900 -2673 21 2106 -3490 -5458 -6505 -4487 -3019 -5391 -4875 -4631 -5513 -1497 -481
7393 -481 -1876 -792 239 -1460 -4617 -6489 -4428 -2720 -1733 -384 344 -4558 -4414 -2074 -1139 -1209 -2431
7376 -2431 -4313 -5026 5281 10258 10003 6542 3170 -4079 -6716 -7826 -6634 -4524 -1336 -1957 -2889 -1340
7360 -1340 -1197 636 -3168 -4173 -4276 -5509 -1787 -4104 -8083 -8535 -4480 2712 1206 -2655 -407 407
$$ packed form
7472a902K50j617J125J453p430o43K806K393J500J027O87j12j53M623K87j387
7456B907j362J358m024K4L858q0m632l817J505m128O69L776K339p98m115j458
7440g978N022l793K98K889j631o23L189K508j731j985J31N603l141o485K826O925
7424B024K362l534k876J404K191l79j832L232L515j185J635L170l393q217j915
7409c798L35J563p73K694K085n596j968j047K018J468k372N16K44q82M016J016
7393d81j395J084J031j699l157j872K061J708R87J349P28m902J44K340R35p0j222
7376b431j882p13J0307M977k55l461l372p249k637j110J192K110L188o21r32J549
7360a340J43J833l804j005j03j233L722k317l979m52M055P192j506l861K248Q14
$$ plain form
7344 407 4720 5542 1658 -1128 3296 5133 2693 2057 5743 6912 -279 -116 -2262 -2301 -2926 -4553 -6466
7327 -6466 -2714 2430 2662 651 -105 -3404 -5387 -6101 -6760 -8844 -8558 -6241 -6378 -4649 -340 -4156
7311 -4156 -4277 -5779 -6670 -8661 -4345 -3222 273 1777 1668 1649 -693 428 -4431 -8616 -5198 558
7295 558 473 3887 2144 1118 5701 6944 7447 1192 -4188 -5735 -4636 -6600 -4225 307 943 502
7279 502 -3473 -6269 -6350 -2411 3740 6929 3593 2043 2455 3281 125 -3449 -2489 529 -376 -1940 -1449
7262 -1449 3238 3424 4200 2063 -2476 2037 5142 3455 4344 7467 5994 6626 4907 4180 5181 1917
7246 1917 -28 741 -83 -1422 -4663 -5478 -5259 -5210 -3750 753 3550 5105 2149 -657 1046 -2347
7230 -2347 -3380 -6434 -10876 -7800 -5284 -2056 -2920 -4016 -6854 -10412 -6019 -3838 -10844 -13541 -6776
$$ packed form
7344D07M313Q22l884k786M424J837k440o36L686J169p191J63k146l9o25j627j913
7327f466L752N144K32k011p56l299j983p14o59k084K86K317j37J729M309l816
7311d156j21j502q91j991M316J123L495J504j09j9k342J121m859m185L418N756
7295E58q5L414j743j026M583J243N03o255n380j547J099j964K375M532O36m41
7279E02l975k796q1L939O151L189l336j550M12Q26l156l574R60L018r05j564M91
7262a449M687J86P76k137m539M513L105j687Q89L123j473O32j719p27J001l264
7246A917j945P69q24j339l241q15K19M9J460M503K797J555k956k806J703l393
7230b347j033l054m442L076K516L228q64j096k838l558M393K181p006k697O765
$$ plain form
7215 -6776 -1511 579 -669 -1086 -907 -566 -3490 -185 -1955 1836 1531 -277 -623 -253 1970 2437 -49
7198 -49 -2682 -54 2278 -832 -3707 -552 4741 6917 2287 -2428 -4633 -6816 -7864 -7802 -5548 -4430
7182 -4430 -1499 2081 -555 -6129 -10310 -10549 -4335 -1054 2847 4333 1668 -2639 -7349 -9866 -4214
7167 -4214 2537 2927 1845 27 766 3896 -895 -1725 -2997 -6977 -6567 -5526 -6974 -10293 -9622 -6738
7151 -6738 -4261 -2962 -35 1654 -3262 -877 -5314 -6165 -3552 -6069 -11020 -10074 -5746 -3739 -1549
7136 -1549 1917 5725 6531 5723 -606 -2432 -1206 4931 8167 7158 2480 397 1122 1067 179 3070
7120 3070 1955 1715 -333 -5627 -8517 -8179 -6684 -4564 3077 7082 2251 -3883 -968 -2187 -3882
7105 -3882 -1992 -1247 2688 7091 1719 -1805 -2501 -2769 -2260 -4500 -5693 -3184 841 1802 3665 634
$$ packed form
7215f776N265K090j248m17J79L41k924L305j770L791l05j808l46L70K223M67k486
7198d9k633K628K332l110k875L155N293K176m630m715k205k183j048O2K254J118
7182d430K931L580k636n574m181k39O214L281L901J486k665m307m710k517N652
7167d214O751L90j082j818P39L130m791q30j272l980M10J041j448l319O71K884
7151f738K477J299K927J689m916K385m437q51K613k517m951R46M328K007K190
7136a549L466L808Q06q08o329j826J226O137L236j009m678k083P25n5q88K891
7120C070j115k40k048n294k890L38J495K120P641M005m831o134K915j219j695
7105c882J890P45L935M403n372l524o96k68N09k240j193K509M025R61J863l031
$$ plain form
7089 634 -2742 -373 -1060 -3120 -4468 -5129 -11735 -14170 -13330 -13266 -9425 -5856 -4915 -1973 997 -2619 1872
7072 1872 10625 11797 7443 1814 -1472 -6608 -9177 -9939 -8634 -5029 -3856 -2694 2998 3834 -1165
7057 -1165 -4670 -5333 -2574 -1347 -3997 -6003 -2441 2763 6293 5208 1893 -1955 -4667 -4580 -2169 1499
7041 1499 4214 2307 1855 -591 -2644 -5166 -8144 -6114 -1669 4801 -1865 -5411 -3117 -543 -3943
7026 -3943 -4708 -6939 -4047 512 5866 5092 5317 3953 2069 -1125 -3496 1836 1219 2274 7428 5070
7010 5070 134 -3314 -4609 -3337 -4295 -1454 -2901 -1214 285 -2908 -2646 -4961 -1514 -164 947
6995 947 -66 -2444 -1124 -1869 -6557 -4954 -2419 5406 5900 5901 1766 251 740 1378 2515 1622 2082
6978 2082 223 -1120 -1586 -94 4308 72 -2543 -3067 -555 -43 -2705 -2702 -2538 -4434 -2892 -5476 -4540
$$ packed form
7089F34l376K369o87k060j348o61o606k435Q40O4L841L569R41K942K970l616M491
7072A872Q753J172m354n629l286n136k569p62J305L605J173J162N692Q36m999
7057a165l505o63K759J227k650k006L562N204L530j085l315l848k712Q7K411L668
7041A499K715j907m52k446k053k522k978K030M445O470o666l546K294K574l400
7026c943p65k231K892M559N354p74K25j364j884l194k371N332o17J055N154k358
7010E070m936l448j295J272r58K841j447J687J499l193K62k315L447J350J111
6995I47j013k378J320p45m688J603K535P825M94Jm135j515M89O38J137q93M60
6978B082j859j343m66J492M402m236k615n24K512N12k662LJ64j896J542k584R36
$$ plain form
6961 -4540 -4427 -2118 -2098 560 2338 3883 10652 10645 9793 9244 5793 -1262 -2307 -441 2314 1472 327
6944 327 1568 -1179 -1340 -1163 -640 968 6397 7547 3755 1678 -1212 -3164 1418 463 -2493 -4398
6928 -4398 -1772 -1191 482 -2591 -4324 -6454 -7364 -1768 662 -4362 -12724 -14653 -13564 -11208 -6487
6913 -6487 -1608 -5746 -3611 -4194 -1725 -477 -3411 -2105 245 -1657 2480 6666 4016 3600 4086 4598
6897 4598 3952 5281 4143 4193 2378 -964 493 -876 -3170 -4657 -6109 -9055 -3253 -2241 -218 5050
6881 5050 5627 6904 -1244 -4078 -2340 843 2860 -78 52 927 1790 -1669 -3285 -7560 -6564 -9168
6865 -9168 -5926 -5416 160 3573 -25 -1717 -3048 719 4464 3915 2969 5546 5322 7 -1398 -3115
6849 -3115 435 4551 4535 1430 1450 5127 8297 5618 6404 6032 3223 311 -749 -1991 473 7805
$$ packed form
6961d540J13K309K0K658J778J545O769pq52n49l451p055j045J866K755q42j145
6944C27J241k747j61J77N23J608N429J150l792k077k890j952M582r55k956j905
6928d398K626N81J673l073j733k130r10N596K430n024q362j929J089K356M721
6913f487M879m138K135n83K469J248k934J306K350j902M137M186k650m16M86N12
6897D598o46J329j138N0j815l342J457j369k294j487j452k946N802J012K023N268
6881E050N77J277q148k834J738L183K017k938J30Q75Q63l459j616m275R96k604
6865i168L242N10N576L413l598j692j331L767L745n49r46K577k24n315j405j717
6849c115L550M116j6l105K0L677L170k679P86l72k809k912j060j242K464P332
$$ plain form
6833 7805 8165 1475 -2567 -5926 -6265 -3188 1889 3149 4847 5118 1508 -254 4635 5197 1223 -4959
6817 -4959 -5499 1280 4960 6710 7682 5676 -357 -5228 -7383 -6672 -6276 -5092 -5744 -7228 -6294 -5765 -145
6800 -145 1795 949 -5228 -4690 -1892 -4640 -4252 -5034 -5874 -4268 978 895 -396 -4951 -4953 -1704 -3625 -6520
6782 -6520 -6545 -7950 -8309 -2648 170 -5822 -5159 -7437 -8737 -5107 -3288 -3509 -6902 -10767 -8575 -2270
6766 -2270 1076 2901 -2671 -7797 -2049 1833 -1038 -5085 1127 6104 3901 1358 -2452 -3553 -1536
6751 -1536 -1302 2226 6323 5746 -2088 -7084 -9195 -10740 -9615 -3947 66 -899 28 2303 584 -608
6735 -608 -1067 -3072 -2304 559 8622 12087 6387 2472 6460 7212 7568 7635 6910 14081 24361 34044 35606
6718 35606 33101 27078 20664 13845 2940 -3114 -2332 -116 1652 287 -1729 1529 3477 7244 4793
$$ packed form
6833G805L60o690m042l359l39L077N077J260J698K71l610j762M889N62l974o182
6817d959n40O779L680J750R72k006o033m871k155P11L96J184o52j484R34N29N620
6800a45J940q46o177N38K798k748L88p82q40J606N246q3j291m555kL249j921k895
6782f520k5j405l59N661K818n992O63k278j300L630J819k21l393l865K192O305
6766b270L346J825n572n126N748L882k871m047O212M977k203k543l810j101K017
6751a536K34L528M097n77p834m996k111j545J125N668M013r65R27K275j719j192
6735f08m59k005P68K863Q063L465n700l915L988P52L56O7p25P171J0280R683J562
6718C5606k505o023o414o819j0905o054P82K216J768j365k016L258J948L767k451
$$ plain form
6703 4793 -607 -1975 1561 2754 2222 5280 4430 90 -5040 -4179 -6596 -2908 -4129 -4658 -3915 -2580
6687 -2580 -4868 -3902 -2843 -1211 1746 2900 260 2244 -57 170 -3455 -3655 2233 1366 -4037 -7747
6671 -7747 -5272 -3676 -5187 -3769 -2510 -181 349 -8 672 -1309 -3190 -1299 465 -1746 -2108 3721
6655 3721 5656 10927 8033 3592 3578 3209 7244 9094 4653 3348 7177 5518 -253 -2584 -4028 -6605
6639 -6605 -8399 -7900 -4509 -4796 -8190 -10509 -9024 -6426 -7367 -10232 -3347 2338 5710 3671 2157 3940
6623 3940 -1585 -1687 -2476 2054 5071 4629 2259 3048 1467 -3065 -4839 -7525 -5399 745 3106 6745
6607 6745 7951 7287 3272 2080 859 -1003 1594 146 1288 3204 1201 -2857 -2940 -2139 923 7084
6591 7084 4786 2317 -772 -974 3573 4106 8383 10333 8608 237 -7338 -9622 -10179 -8620 -5013 -4032
$$ packed form
6703D793n400j368L536J193n32L058q50m340n130Q61k417L688j221n29P43J335
6687b580k288R66J059J632K957J154k640J984k301K27l625k00N888q67n403l710
6671g747K475J596j511J418J259K329N30l57O80j981j881J891J764k211l62N829
6655C721J935N271k894m441j4l69M035J850m441j305L829j659n771k331j444k577
6639f605j794M99L391k87l394k319J485K598r41k865O885N685L372k039j514J783
6623C940n525j02p89M530L017m42k370P89j581m532j774k686K126O144K361L639
6607F745J206o64m015j192j221j862K597j448J142J916k003m058q3Q01L062O161
6591G084k298k469l089k02M547N33M277J950j725q371p575k284n57J559L607R81
$$ plain form
6575 -4032 -3907 -2246 -3193 -3130 -330 1397 4353 1159 -6199 -9599 -14042 -11717 -8130 -5126 -3840 -4024
6559 -4024 672 5001 5234 4902 2919 -86 2266 2051 -561 -3523 -4128 -938 -1342 -3379 -3270 -1382
6543 -1382 1187 3726 5467 3297 -1679 -4472 -3515 -1848 -2369 375 6012 5651 2489 4100 1645 1223
6527 1223 -1253 -4677 -7588 -6200 -5780 -6505 -4756 -126 625 4396 -1651 -9730 -12082 -9354 -7021 -6760
6511 -6760 -10522 -12983 -7663 -5202 -3575 -1691 -1767 -8877 -7411 797 1159 -59 4557 6085 5074 1442
6495 1442 -1554 -2364 -3726 -5859 -8000 -10132 -7421 -6251 -4588 1623 1976 -3995 -2610 -2603 -593 5396
6479 5396 6117 1904 -387 -632 2787 2410 1117 -875 -480 4920 -750 -6204 -3754 -2275 -1035 908
6463 908 121 -2340 -3039 -3400 -4124 -4334 -1278 593 -1428 -1800 -764 -2944 -3249 -4049 -2245 -3074 -1009
$$ packed form
6575d032J25J661r47O3K800J727K956l194p358l400m443K325L587L004J286j84
6559d024M696M329K33l32j983l005K352k15k612k962o05L190m04k037J09J888
6543a382K569K539J741k170m976k793R57J667n21K744N637l61l162J611k455m22
6527A223k476l424k911J388M20p25J749M630P51L771o047q079k352K728K333K61
6511f760l762k461N320K461J627J884p6p110J466Q208L62j218M616J528j011l632
6495A442k996q10j362k133k141k132K711J170J663O211L53n971J385PK010N989
6479E396P21m213k291k45L419l77j293j992L95N400n670n454K450J479J240J943
6463I08p87k461o99l61p24k10L056J871k021l72J036k180l05q00J804q29K065
$$ plain form
6446 -1009 -553 -1426 -3321 -5151 385 589 1780 -565 -1160 -3633 -429 -1966 -2614 -114 -2840 -940
6430 -940 -2213 -3204 -2768 172 148 -614 -1325 -6410 -5664 -5656 -4543 -1263 -3561 -7067 -10495 -9871 -8419 -8420 -4491
6411 -4491 -3906 -5602 -7490 -9155 -6761 -2291 1018 2683 4651 6582 6084 -3089 -9252 -10777 -7879
6396 -7879 -6869 -8592 -5898 -3951 -3602 -6235 -4949 -3750 -65 5919 7828 1140 1795 1345 -1763 -5767
6380 -5767 -1532 5251 7628 7985 3908 -957 781 147 -6232 -7033 -4694 -838 1485 -358 1933 2304
6364 2304 -2468 -1899 -2721 -5723 -5424 -5311 -4812 -1267 55 -844 -1916 -803 3084 1783 1174 1199 2916
6347 2916 7382 10194 7838 1112 -2365 -1513 -2955 619 2551 -1714 -2729 -156 -1489 -724 810
6332 810 -2470 -5825 -5423 -1181 784 -1347 -7294 -9875 -11580 -8240 -6538 -4819 -3007 -1950 1980
$$ packed form
6446a009M56q73j895j830N536K04J191k345n95k473L204j537o48K500k726J900
6430i40j273r91M36K940k4p62p11n085P46QJ113L280k298l506l428O24J452jL929
6411d491N85j696j888j665K394M470L309J665J968J931m98r173o163j525K898
6396g879J010j723K694J947L49k633J286J199L685N984J909o688O55m50l108m004
6380e767M235O783K377L57m077m865J738o34o379q01K339L856K323j843K291L71
6364B304m772N69q22l002K99J13M99L545J322q99j072J113L887j301o09K5J717
6347B916M466K812k356o726l477Q52j442L574J932m265j015K573j333P65J534
6332H10l280l355M02M242J965k131n947k581j705L340J702J719J812J057L930
$$ plain form
6317 1980 3714 -39 -5501 -7536 -6798 -6044 -6678 -8820 -8493 -6272 -2898 -3095 -7486 -8042 -6212 -8104
6301 -8104 -4991 -578 2729 4060 3258 4559 8286 7049 4456 -269 -1890 1446 -59 -2142 -3554
6286 -3554 965 3506 -202 818 6182 5765 -354 -3586 -5488 -5693 -3860 -1044 -4348 -10134 -8923
6271 -8923 -4864 -1008 -644 -422 -1954 -2715 -2131 -6026 -5873 -3059 -2347 -2762 1588 686 -222 -2321 -1382
6254 -1382 95 -400 -5503 -5210 -1506 2927 1164 1352 4678 1806 -6643 -3397 -2096 -5064 -4405 -1460
6238 -1460 -5675 -3413 -3853 -2526 -2936 -3170 235 -255 -3057 -4117 -3213 -2717 1905 1935 -3089 -4857 -3107
6221 -3107 -4826 -223 196 -2739 -5535 -6619 -6233 -3621 4024 5635 6046 3856 -216 -5233 -3391 -1669
6205 -1669 797 528 1614 4061 2777 3759 6254 5526 7044 3319 -2112 608 2800 3026 7122 7720
$$ packed form
6317A980J734l753n462k035P38P54o34k142L27K221L374j97m391n56J830j892
6301h104L113M413L307J331q02J301L727j237k593m725j621L336j505k083j412
6286c554M519K541l708J020N364m17o119l232j902k05J833K816l304n786J211
6271h923M059L856L64K22j532p61N84l895J53K814P12m15M350r02r08k099R39
6254a382J477m95n103K93L704M433j763J88L326k872q449L246J301k968O59K945
6238a460m215K262m40J327m10k34L405m90k802j060R04M96M622L0n024j768J750
6221c107j719M603M19k935k796j084L86K612P645J611M11k190m072n017J842J722
6205a669K466k69J086K447j284R82K495p28J518l725n431K720K192K26M096N98
$$ plain form
6189 7720 6552 7156 4475 -1194 -4417 -4499 -4759 -4847 -6551 -4284 -5098 -3809 -9613 -11975 -7402 -2222 -933
6172 -933 387 -1355 -5267 -4611 -5017 -2455 23 2868 -201 -1676 -1030 2759 -636 -3614 -1843 386
6156 386 3144 -1110 -5225 -6616 -7761 -10361 -7821 -11026 -11354 -5485 -2880 -38 -486 -1885 -2041 -775
6140 -775 -2957 -2911 -4245 -7996 -11791 -11573 -11314 -4535 -178 -2545 -4422 -7395 -6203 1257 -2482 759
6124 759 5010 5895 1760 1905 2684 4433 7331 2306 -3747 -4140 -561 -632 777 -2346 -1706 2490 -1849
6107 -1849 -3949 480 -1471 -2659 -5875 -5618 -5819 -5068 -4140 1198 -3123 -10696 -12710 -10849 -7245 -3646
6091 -3646 -3025 -1639 -5813 -3418 -2138 -2643 -4889 -10147 -7911 -4759 -2952 -1034 -2234 -1063 -1808 -1804
6075 -1804 -4248 -4126 -1650 -5295 -9699 -12585 -11668 -8402 -4236 -1747 -2626 -539 6678 9968 5117 810
$$ packed form
6189G720j168O04k681n669l223q2k60q8j704K267q14J289n804k362M573N180J289
6172i33J320j742l912O56m06K562K478K845l069j475O46L789l395k978J771K229
6156C86K758m254m115j391j145k600K540l205l28N869K605K842m48j399j56J266
6140g75k182M6j334l751l795K18K59O779M357k367j877k973J192P460l739L241
6124G59M251Q85m135J45P79J749K898n025o053l93L579p1J409l123O40M196m339
6107a849k100M429j951j188l216K57k01P51R28N338m321p573k014J861L604L599
6091c646O21J386m174K395J280n05k246n258K236L152J807J918j200J171p45M
6075a804k444J22K476l645m404k886R17L266M166K489q79K087P217L290m851m307
$$ plain form
6059 810 817 1736 861 -1212 -3807 -4501 -5153 786 7588 6795 5710 2704 2331 5632 8957 4126 909
6042 909 1371 1232 760 -614 1965 2459 561 -851 3505 6267 5880 3447 208 307 -1831 1066 1695
6025 1695 -1096 -3198 -2480 -3179 -2582 1575 46 1419 5148 6038 154 -6727 -9187 -8648 -5704 -2825
6009 -2825 1749 -1065 -5209 -2760 852 -2537 -3687 -5678 -3558 3822 5202 3231 951 1967 3975
5994 3975 1705 -473 -4880 -4389 -328 532 -2203 -6329 -5239 -5741 1007 2976 856 -3514 -6051 -5832
5978 -5832 -4274 -8704 -8461 -2314 -5649 -5600 -2139 1335 3799 1879 -2032 -1316 915 -4838 -1571 1990
5962 1990 -282 -2910 -4437 -9151 -9659 -7443 43 3004 1247 -2779 -1824 -3235 -2138 -3054 416 411
5946 411 -2547 -4933 -5063 -3770 -3308 -63 622 -675 -4950 -4367 -4828 -5504 -4460 -4441 -7668 -4986 -7445
$$ packed form
6059H10PR19q75k073k595o94o52N939O802p93j085l006l73L301L325m831l217
6042I09M62j39m72j374K579M94j898j412M356K762l87k433l239R9k138K897O29
6025A695k791k102P18o99N97M157j529J373L729Q90n884o881k460N39K944K879
6009b825M574k814m144K449L612l389j150j991K120P380J380j971k280J016K008
5994C975k270k178m407M91M061Q60k735m126J090n02O748J969k120m370k537K19
5978e832J558m430K43O147l335M9L461L474K464j920l911P16K231n753L267L561
5962A990k272k628j527m714n08K216P486K961j757m026R55j411J097r16L470n
5946D11k958k386j30J293M62L245O85j297m275N83m61o76J044J9l227K682k459
$$ plain form
5929 -7445 -8697 -7286 -5339 -3391 -3849 -3645 351 -696 -4924 -5507 -2094 3422 2843 -2500 -7049 -4801
5913 -4801 196 -795 -2832 -5693 -10266 -10150 -10662 -7485 -5635 -5106 -4086 -7503 -7534 -6207 -4539 -6407
5897 -6407 -6879 -7899 -8322 -9588 -12780 -10752 -10592 -10700 -3677 5061 3617 -1658 -6560 -3623 -836 269
5881 269 -139 -2364 -3022 -4848 -7630 -2497 -1955 -1080 -3131 -7376 -8976 -8826 -7264 -3991 -1301 233
5865 233 2486 1294 -2463 -11442 -17090 -18728 -12479 -7010 -7097 -8216 -4937 -5772 -7834 -5544 -3800 -8030
5849 -8030 -8702 -7461 -2198 -1885 -4029 -5066 229 -350 -8391 -9683 -7017 -3856 -6149 -2168 -2510 -5506
5833 -5506 -4671 -3669 -2241 -3828 -228 4127 6934 7671 8691 6130 634 2027 900 1135 -793 -2374
5817 -2374 -1260 2202 2154 1362 3791 6151 3723 932 -178 -4196 -7189 -3686 -1987 1920 5212 6986
$$ packed form
5929g445j252J411J947J948m58K04L996j047m228n83L413N516n79n343m549K248
5913d801M997r91k037k861m573J16n12L177J850N29J020l417l1J327J668j868
5897f407m72j020m23j266l192K028J60j08P023Q738j444n275m902K937K787J105
5881B69m08k225o58j826k782N133N42Q75k051m245j600J50J562L273K690J534
5865B33K253j192l757q979n648j638O249N469q7j119L279q35k062K290J744m230
5849h030o72J241N263L13k144j037N295n79q041j292K666L161k293L981l42k996
5833e506Q35J002J428j587L600M355K807P37J020k561n496J393j127K35j928j581
5817b374J114L462m8p92K429K360k428k791j110m018k993L503J699L907L292J774
$$ plain form
5801 6986 11503 11894 8973 5878 4077 252 -1222 -5820 -10274 -9624 -5059 -3939 -638 253 1820 6637
5785 6637 7229 8213 7068 2578 8435 10123 7934 4582 531 2226 5199 3729 740 -722 3885
5770 3885 2262 -4213 -1613 1322 3637 4686 3452 -476 131 1842 4856 4211 2121 -3825 -2905 541
5754 541 144 87 -3866 -4140 -2093 -305 -2258 -4269 -5956 -2668 -3159 -317 1277 2782 -447 1111
5738 1111 4348 6385 3470 -1814 -654 -590 -5482 -12530 -12623 -10966 -13453 -12507 -7484 -3628 -7141 -7115 -8482
5721 -8482 -3858 -2564 416 -244 2829 3961 -3064 -647 331 -201 -429 -308 585 -2163 -373 -1836
5705 -1836 -4727 -7722 -12200 -17985 -12411 -5484 -1687 490 1901 972 42 2961 3499 2208 2138 -354
5689 -354 -772 -3381 460 2401 -656 -5060 -3990 -3644 -5859 -7327 -9058 -9036 -9984 -7627 -4143 -4507 -1689
$$ packed form
5801F986M517L91k921l095j801l825j474m598m454O50M565J120L301Q91J567M817
5785F637N92R84j145m490N857J688k189l352m051J695K973j470k989j462M607
5770C885j623o475K600K935K315J049j234l928O07J711L014o45k090n946R20L446
5754E41l97n7l953k74K047J788j953k011j687L288m91K842J594J505l229J558
5738A111L237K037k915n284J160O4m892p048r3J657k487R46N023L856l513K6j367
5721h482M624J294K980o60L073J132p025K417R78n32k28J21Q93k748J790j463
5705a836k891k995m478n785N574O927L797K177J411r29r30K919N38j291p0k492
5689c54m18k609L841J941l057m404J070L46k215j468j731K2r48K357L484l64K818
$$ plain form
5672 -1689 793 -1108 189 589 -1398 405 6175 2777 -1471 -3883 -7236 -6540 -6065 -1955 1538 4657
5656 4657 7171 4896 1918 54 1574 -2714 -6041 -7229 -9119 -9039 -4634 -3750 -5673 -4392 -2845 -1908
5640 -1908 -3906 -7597 -7464 -3244 -4565 -9473 -7849 -2312 -1900 -1282 -1665 -2125 -2610 -475 -845 -5154 -9780
5623 -9780 -6985 -1867 -4157 -346 159 317 -2871 1331 866 -739 -366 -2574 -3534 -915 -295 2593
5607 2593 1303 2597 5150 6248 4220 3830 -4109 -4847 -2065 -3951 -2948 2345 4061 5406 5581 5780
5591 5780 1052 -3399 -3619 -1778 1466 -645 -3870 -6158 -10545 -10054 -3978 -1650 -3022 -1115 2048
5576 2048 1811 -604 -1954 -376 2489 2076 887 -323 1547 475 1570 2811 3925 6823 153
5561 153 -3446 -3272 608 1416 4434 4175 3201 -80 -263 -2367 -3803 -1223 3264 4158 4988 6234 1806
$$ packed form
5672a689K482j901J297M00j987J803N770l398m248k412l353O96M75M110L493L119
5656D657K514k275k978j864J520m288l327j188j890Q0M405Q84j923J281J547R37
5640a908j998l691J33M220j321m908J624N537M12O18l83m60m85K135l70m309m626
5623i780K795N118k290L811N05J58l188M202m65j605L73k208r60K619O20K888
5607B593j290J294K553J098k028l90p939p38K782j886J003N293J716J345J75J99
5591E780m728m451k20J841L244k111l225k288m387M91O076K328j372J907L163
5576B048k37k415j350J578K865m13j189j210J870j072J095J241J114K898o670
5561A53l599J74L880Q08L018k59r74l281j83k104j436K580M487Q94Q30J246m428
$$ plain form
5544 1806 1733 2399 1694 -1703 -4570 -1885 2685 5549 3201 -1442 -1564 -2203 -3179 -5642 -10098 -10368 -10524
5527 -10524 -5313 -2878 -722 6955 7585 2762 1268 1918 -166 -4389 -434 6351 2657 -1884 1244
5512 1244 3357 6256 4403 -2900 -3888 -1445 2750 7077 5299 -1774 -9066 -7034 -926 -6394 -9518
5497 -9518 -11789 -13004 -8288 -7413 -7953 -9284 -5297 -233 1486 -1010 -802 48 -3267 -3932 -3714 -5560
5481 -5560 -4775 -7231 -6698 -3287 -4534 -6463 -3690 -517 -3953 -3582 -5361 -7752 -7391 -2789 -3846 -2752
5465 -2752 -1234 1016 3955 2042 296 -3388 -4931 -3540 1331 1393 339 -1894 -1667 -3139 -4146 -5077
5449 -5077 -4701 -6031 -7177 -3185 3100 6705 9987 4791 -2342 -6594 -4312 2996 -595 -6243 -684
5434 -684 -1174 -6490 -3599 -265 800 -2163 -3718 -3631 -5348 -5609 869 4409 2034 -4297 -3044 282
$$ packed form
5544A806p3O66p05l397k867K685M570K864k348m643j22o39r76k463m456k70j56
5527a0524N211K435K156P677O30m823j494O50k084m223L955O785l694m541L128
5512A244K113K899j853p303r88K443M195M327j778p073p292K032O108n468l124
5497i518k271j215M716Q75n40j331L987N064J719k496K08Q50l315o65K18j846
5481e560P85k456N33L411j247j929K773L173l436L71j779k391L61M602j057J094
5465b752J518K250K939j913j746l684j543J391M871O2j054k233K27j472j007r31
5449e077L76j330j146L992O285L605L282n196p133m252K282P308l591n648N559
5434f84m90n316K891L334J065k963j555Q7j717k61O478L540k375o331J253L326
$$ plain form
5418 282 1675 -610 -7783 -5940 -3624 -1132 -344 -271 1536 195 1114 -1647 235 434 -1992 -1902 -4993
5401 -4993 -5951 -6045 -4277 -1309 2659 2600 -900 -5855 -5222 -2982 -60 -6254 -5621 -5710 -7149 -7766 -7321 -3470
5383 -3470 -4476 683 -2603 -4480 -2829 -1355 -602 4872 9297 2202 -3423 -5106 -297 2131 999
5368 999 -3760 -1605 -5465 -11828 -12299 -8668 -9854 -9786 -3925 -6780 -7806 -6488 -7846 -6471 -8325 -5110
5352 -5110 -3419 -4709 -2930 -2140 -1467 -1854 1405 4904 7964 4345 -181 -3277 -4752 -5700 -5693 -2372 -1658
5335 -1658 -6481 -4261 -644 1347 2116 3197 7336 0 -7471 -8924 -913 2531 -1232 3534 5870
5320 5870 6505 6011 4888 3294 -1271 557 -340 -2960 1981 1689 1539 -2346 -1562 -984 -5769 -6725 -1591
5303 -1591 -302 1107 4936 6776 3950 1622 -63 -4460 -763 1700 609 -7459 -8139 -4920 -3706
$$ packed form
5418B82J393k285p173J843K316K492P88P3J807j341R19k761J882J99k426R0l091
5401d993r58r4J768K968L968n9l500m955O33K240K922o194O33q9j439o17M45L851
5383c470j006N159l286j877J651J474P53N474M425p095n625j683M809K428j132
5368I99m759K155l860o363m71L631j186O8N861k855j026J318j358J375j854L215
5352e110J691j290J779P90O73l87L259L499L060l619m526l096j475r48PL321P14
5335a658m823K220L617J991P69J081M139p336p471j453Q011L444l763M766K336
5320E870O35m94j123j594m565J828q97k620M941k92j50l885P84N78m785r56N134
5303a591J289J409L829J840k826k328j685m397L697K463j091q068o80L219J214
$$ plain form
5288 -3706 -5266 -3263 -4000 -6752 -5735 -2462 -4234 -6239 -5593 -6612 -7345 -8115 -1097 3444 -297 -321
5272 -321 2137 1306 -1877 2076 -1135 -6776 -9465 -8375 -516 2587 2255 1749 1915 173 3875 7976
5256 7976 6283 8230 6286 4276 -3577 -8326 -9953 -11451 -10250 -4942 -2023 -1539 -3839 -2157 2398
5241 2398 -1779 -6135 -8483 -7510 -2323 -1411 422 1155 3116 3786 4984 1763 113 -6158 -4277 -71
5225 -71 -950 -1577 706 5407 3869 -2087 -4988 -5105 -1067 -2174 -5898 -1009 -5876 -8708 -7100 -8171
5209 -8171 -8310 -8225 -2602 4568 1703 676 3910 3025 1889 4085 2150 5644 9343 7817 4482 2159
5193 2159 -4518 -3067 1995 2270 3820 2637 2777 -2704 -6200 -3155 775 -2767 -7559 -5408 -5360 -3815
5177 -3815 -5019 -2820 -1135 -2777 -2507 2581 10056 7728 4189 3482 3946 4177 3320 1613 2116 2082 2271
$$ packed form
5288c706j560K003p37k752J017L273j772k005O46j019p33p70P018M541l741k4
5272c21K458q31l183L953l211n641k689J090P859L103l32n06J66j742L702M101
5256G976j693J947j944k010p853m749j627j498J201N308K919M84k300J682M555
5241B398m177m356k348R73N187R12J833P33J961O70J198l221j650o271J881M206
5225g1q79o27K283M701j538n956k901j17M038j107l724M889m867k832J608j071
5209h171j39Q5N623P170k865j027L234q85j136K196j935L494L699j526l335k323
5193B159o677J451N062K75J550j183J40n481l496L045L930l542m792K151M8J545
5177c815j204K199J685j642K70N088P475k328l539p07M64K31q57j707N03l4J89
$$ plain form
5160 2271 1908 -964 -3502 -792 2066 4742 4301 675 -2662 -3188 -6050 -3082 2637 29 -2565 -433
5144 -433 -2693 -4405 -1262 -3566 -3429 216 4315 3891 2945 1725 -1281 -5264 -3910 2259 5534 3765
5128 3765 1833 635 -614 -2369 -677 -1877 -167 765 647 -1721 -1713 -275 552 1208 1154 -1077 -252
5111 -252 3248 1421 -3748 -2496 -1248 -2503 -6643 -7314 -4933 -633 814 715 1884 293 -2205 -4586
5095 -4586 -5529 1032 3171 -2267 -2513 -3756 -1027 -3061 -4260 -457 1075 857 -4500 -6320 -2748 -1618
5079 -1618 -1097 -1305 -1567 -2116 2554 4965 5516 1319 -3690 -3561 -4247 -3580 -889 -705 -2355 -796 5032
5062 5032 6539 3168 -2256 -4175 -4701 -2248 -5763 -2371 -246 -4562 -6754 -3381 -1040 -2006 1014
5047 1014 4155 4136 1650 227 -3178 -3894 2597 4119 5904 4333 4460 6492 5157 -587 -2905 -3864
$$ packed form
5160B271l63k872k538K710K858K676m41l626l337n26k862K968N719k608k594K132
5144d33k260j712L143k304J37L645M099m24r46j220l006l983J354O169L275j769
5128C765j932j198j249j755J692j200J710R32j18k368QJ438Q27O56n4k231Q25
5111b52L500j827n169J252J248j255m140o71K381M300J447r9J169j591k498k381
5095d586r43O561K139n438k46j243K729k034j199L803J532k18n357j820L572J130
5079a618N21k08k62n49M670K411N51m197n009J29o86O67K691J84j650J559N828
5062E032J507l371n424j919n26K453l515L392K125m316k192L373K341r66L020
5047A014L141j9k486j423l405p16O491J522J785j571J27K032j335n744k318r59
$$ plain form
5031 -3864 -1692 1342 4984 147 -3193 -3444 -5394 -5453 -8785 -2137 -130 760 -1782 -1122 -1812 -1758 561
5014 561 1600 4826 -1852 -3055 1217 3482 2522 1277 1441 4699 1986 -4176 -572 6046 4699 4863
4998 4863 127 -2687 -2879 -6509 -4701 -740 -75 1417 -403 -2516 -3893 -5957 -2609 942 2720
4983 2720 5483 5090 4487 1507 -2723 -499 -1242 -3394 -1658 -212 2224 -1810 -5600 -3072 2841 5544
4967 5544 6168 -988 -432 -2894 -4645 -6063 -5083 -6616 -2134 -1692 -2281 544 1568 -1198 -2132 386
4951 386 1666 1522 -1357 -3921 631 -3372 -8563 -4707 -5738 -2175 980 -2067 -3977 -4594 -5098 -6958
4935 -6958 -3779 454 1294 -170 -3021 -1338 350 -1219 -5872 -5182 -1767 1634 4994 811 -3568
4920 -3568 2302 -1812 -6846 -11096 -10631 -5851 -4775 -4971 174 1075 -169 1589 -189 2594 4551 -3639
$$ packed form
5031c864K172L034L642m837l340k51j950n9l332O648K007Q90k542O60o90N4K319
5014E61J039L226o678j203M272K265r60j245J64L258k713o162L604O618j347J64
4998D863m736k814j92l630J808L961O65J492j820k113j377k064L348L551J778
4983B720K763l93o03k980m230K224p43k152J736J446K436m034l790K528N913K703
4967E544O24p156N56k462j751j418R80j533M482M42n89K825J024k766r34K518
4951C86J280j44k879k564M552m003n191L856j031L563L155l047j910o17n04j860
4935f958L179M233Q40j464k851J683J688j569m653O90L415L401L360m183m379
4920c568N870m114n034m250M65M780J076j96N145R01j244J758j778K783J957q190
$$ plain form
4904 -3639 -1178 4795 3469 -1833 -4905 -3328 130 2117 4021 7263 5546 1510 3262 5613 7638
4889 7638 6860 9241 11774 14913 9155 1651 -2735 -7606 -8534 -11478 -11559 -6642 -3644 -4608 -6953 -4162
4873 -4162 -2461 -3171 -3773 833 4677 3453 4702 7086 6833 5859 1967 -4675 -6173 -5281 -6366 -3321
4857 -3321 -852 -3226 -4843 -6176 -5304 -4498 -6987 -3344 2474 6280 -1965 -3034 -2078 -6517 -3652 -253
4841 -253 375 1289 2857 148 -3416 -6599 -5891 -5568 -4031 -5765 -8372 -11207 -11158 -9431 -1157 6265 5797
4824 5797 4237 4561 6069 4061 2080 2618 2780 407 215 2589 -3161 -6991 -7773 -7082 -5136 -2031
4808 -2031 -3242 -9035 -9927 -7165 -871 3452 2647 3304 4841 5723 6787 7435 4248 1013 3181 3628
4792 3628 2754 -51 -397 2713 -2866 -6975 -7571 -8976 -4160 224 2840 9008 7319 5623 6007 2794
$$ packed form
4904c639K461N973j326n302l072J577L458J987J904L242j717m036J752K351K025
4889G638p78K381K533L139n758p504m386m871r28k944q1M917K998r64k345K791
4873d162J701p10o02M606L844j224J249K384k53r74l892o642j498Q92j085L045
4857c321K469k374j617j333Q72Q06k489L643N818L806q245j069R56m439K865L399
4841b53O28R14J568k709l564l183P08L23J537j734k607k835M9J727Q274P422m68
4824E797j560L24J508k008j981N38J62k373j92K374n750l830p82O91J946L105
4808b031j211n793q92K762O294M323q05O57J537Q82J064O48l187l235K168M47
4792C628q74k805l46L110n579m109n96j405M816M384K616O168j689j696L84l213
$$ plain form
4776 2794 987 1100 -3096 -3231 -890 -1478 -5604 -4535 2085 5273 3155 -1326 -595 771 -2064 -126
4760 -126 6881 9978 13347 12594 8064 6102 4912 9951 10751 8033 4548 5792 1964 2855 -137 -1555
4744 -1555 -3156 -290 -2643 -7294 -4799 -1898 -4283 -5586 -3555 -2008 -1103 -1778 760 -1887 -914 303
4728 303 -4574 -6102 -4804 -273 -329 1629 5550 5599 1691 177 -2751 -4335 -6421 -5076 -2553 -3065
4712 -3065 2346 2531 -2043 -8445 -3826 1281 844 -3488 -6370 -4079 -1058 3110 1869 2928 4816
4697 4816 3156 727 -500 -3360 -3100 -2848 -694 -3603 -6323 -4806 -4085 -7309 -8197 -6700 -7224 -3369
4681 -3369 -1826 -4335 -6750 -3456 -2483 -6160 -7399 -8221 -5199 -4016 -438 -401 -604 -2568 -3700 -7625
4665 -7625 -8938 -10891 -9770 -10986 -8729 -5363 -2716 1960 2040 -234 -4879 -3431 1811 3587 1652
$$ packed form
4776B794j807J13m196j35K341n88m126J069O620L188k118m481P31J366k835J938
4760a26P007L097L369p53m530j962j190N039Q00k718l485J244l828Q91k992j418
4744a555j601K866k353m651K495K901k385j303K031J547R05o75K538k647R73J217
4728C03m877j528J298M531n6J958L921M9l908j514k928j584k086J345K523n12
4712c065N411J85m574o402M619N107m37m332k882K291L021M168j241J059J888
4697D816j660k429j227k860K60K52K154k909k720J517P21l224q88J497n24L855
4681c369J543k509k415L294R73l677j239q22L022J183L578L7k03j964j132l925
4665g625j313j953J121j216K257L366K647M676Q0k274m645J448N242J776j935
$$ plain form
4650 1652 -1202 -5561 -3132 -5946 -9841 -9023 -8226 -10218 -10359 -8427 -4189 -3407 -2639 -752 -2238 -3017
4634 -3017 -2688 -1425 -139 -164 -1893 -3783 -5568 579 4291 3237 3870 10005 4845 -1321 -6180 -9204
4618 -9204 -11532 -8937 -9298 -7782 -3398 420 -2862 -5266 -3130 547 2237 4346 3128 1271 -596
4603 -596 -4303 -2746 -626 -7421 -7779 -5673 -3119 608 -2823 -7896 -7821 -4495 -4658 -1198 2196 2007
4587 2007 -2482 -9575 -6419 -4841 -7531 -5468 -6079 -3645 -3289 -5374 -3146 -643 4167 3100 -774
4572 -774 -3352 -5607 -7621 -10655 -12547 -11508 -9276 -3033 4438 7603 5536 1533 -3697 -7140 -7593
4557 -7593 -4542 -3346 -2841 -3290 -7093 -9473 -10290 -3910 -3614 -7636 -7876 -7201 -5340 -6343 -3417 -930
4541 -930 -3294 -962 -2377 -2187 -1609 518 -934 -194 -1960 -3296 -3859 692 1048 2439 5350 2452
$$ packed form
4650A652k854m359K429k814l895Q18P97j992j41J932M238P82P68J887j486p79
4634c017L29J263J286k5j729j890j785O147L712j054O33O135n160o166m859l024
4618i204k328K595l61J516M384L818l282k404K136L677J690K109j218j857j867
4603e96l707J557K120o795l58K106K554L727l431n073P5L326j63L460L394j89
4587B007m489p093L156J578k690K063o11K434L56k085K228K503M810j067l874
4572g74k578k255k014l034j892J039K232O243P471L165k067m003n230l443m53
4557g593L051J196N05m49l803k380q17O380K96m022k40O75J861j003K926K487
4541i30k364K332j415J90N78K127j452P40j766j336n63M551L56J391K911k898
$$ plain form
4525 2452 -1341 408 -1443 2812 4884 1030 644 2436 791 669 1507 309 -6235 -4175 -1090 37
4509 37 2798 71 -535 1123 868 3063 4634 6235 8644 5835 5942 8888 11260 1685 -5377 -5687
4493 -5687 -4272 -2814 -2552 -2735 -5764 -7066 -3961 318 2413 -742 -3365 -3549 -853 -3364 -6326 -1775
4477 -1775 -900 -5684 -3861 -3882 1177 -1350 -4429 -5012 -1755 5146 8105 6483 926 -4951 -6422 -3042
4461 -3042 -22 1793 4490 816 -2249 1616 4215 -752 -4389 -3779 -1684 672 -4349 -3260 1202
4446 1202 -1016 -1322 1024 838 409 -1851 -3620 -4498 -6337 -6969 -4077 -5935 -5856 -1563 4521 8657 4298
4429 4298 -3182 -10178 -9129 -5097 -6650 -6237 -3762 1865 4414 6591 6934 1178 -811 -2620 -1398
4414 -1398 -160 -2019 -2895 5886 9235 2923 -883 -4531 -2690 -733 -3099 -4314 -2946 434 -12
$$ packed form
4525B452l793J749j851M255K072l854l86J792j645j22Q38j198o544K060L085J127
4509C7K761k727o06J658k55K195J571J601K409k809J07K946K372r575p062l10
4493e687J415J458K62j83l029j302L105M279K095l155k623j84K696k511k962M551
4477a775Q75m784J823k1N059k527l079n83L257O901K959j622n557n877j471L380
4461c042L020J815K697l674l065L865K599m967l637O10K095K356n021J089M462
4446A202k218l06K346j86m29k260j769q78j839o32K892j858P9M293O084M136m359
4429D298p480o996J049M032j553M13K475N627K549K177L43n756j989j809J222
4414a398J238j859q76Q781L349o312l806l648J841J957k366j215J368L380m46
$$ plain form
4399 -12 1053 2083 3695 2458 -1750 -1440 -2031 -1577 279 4451 6110 6193 3107 4842 2850 2205 2949
4382 2949 1424 2170 3756 3841 3002 8582 3804 -1586 -241 -2958 -6133 -7997 -8917 -6170 907 3825
4366 3825 3946 6422 5175 3159 2682 1966 -527 -747 -3168 -4759 -3132 -5312 -5271 -4599 509 2883 5010
4349 5010 7558 3776 3063 3757 4235 226 -2179 -4252 -6310 -9341 -9344 -5404 1656 3612 2966 -568 -710
4332 -710 -2383 -4640 -5965 -6576 -7007 -11003 -7598 -7456 -7778 -9480 -8753 -6946 -1381 -582 -240 636 2681
4315 2681 1852 3777 2518 5323 484 4027 6016 2580 1993 1280 -3203 -4833 -5668 -5071 -7059 -5856
4299 -5856 -913 3002 612 -5338 -8385 -7213 -1668 120 2055 321 -84 -3104 -5275 -3410 -5042
4284 -5042 -10466 -12124 -4057 2691 3265 -5771 -7098 -3857 -1003 3114 7628 5933 533 -5552 -8586
$$ packed form
4399a2J065J030J612j237m208L10n91M54J856M172J659Q3l086J735j992o45P44
4382B949j525P46J586Q5q39N580m778n390J345k717l175j864r20K747P077K918
4366C825J21K476j247k016m77p16k493k20k421j591J627k180M1O72N108K374K127
4349E010K548l782p13O94M78m009k405k073k058l031lL940P060J956o46l534j42
4332g10j673k257j325o11m31l996L405J42l22j702P27J807N565P99L42Q76K045
4315B681q29J925j259K805m839L543J989l436n87p13m483j630q35N97j988J203
4299e856M943L915k390n950l047J172N545J788J935j734m05l020k171J865j632
4284e042n424j658Q067O748N74r036j327L241K854M117M514j695n400o085l034
$$ plain form
4269 -8586 -7890 -3169 -1837 -1737 -2061 -4801 -5886 -6691 -5203 -227 -152 -4752 -437 1009 2014 7364
4253 7364 5764 3288 931 -1650 -7010 -5067 -4817 -7760 -11217 -10067 -8313 -4406 -234 398 -298 1182
4237 1182 -1081 -2570 -4348 -2621 -4276 -7567 -6983 -2803 2582 -865 -3167 -4143 -6406 -4882 -2669
4222 -2669 -3830 -3828 -3125 1310 -1111 -4875 -8224 -5856 -1220 550 1268 -948 -1900 -1887 -2523 -2965 -5294
4205 -5294 445 -324 -881 1235 49 -51 3417 -1912 -6831 -3413 595 -2471 -3923 -4035 -3377 370
4189 370 3077 5114 4434 2204 622 -1140 -757 -2595 -7499 -5042 -3581 -4321 -3046 -3373 1128 3347
4173 3347 5054 361 -3469 -6222 -11574 -10011 -4561 -4721 -8641 -7576 -3987 -4853 -5853 -8795 -9051 -5073
4157 -5073 -7641 -9628 -10968 -9300 -4794 -3186 -1313 503 179 642 -601 3892 5573 833 987 844
$$ packed form
4269h586O96M721J332J00l24k740j085q05J488M976P5m600M315J446J005N350
4253G364j600k476k357k581n360J943K50k943l457J150J754L907M172O32o96J480
4237A182k263j489j778J727j655l291N84M180N385l447k302r76k263J524K213
4222b669j161KP03M435k421l764l349K368M636J770P18k216r52J3o36m42k329
4205e294N739p69n57K116j186j00L468n329m919L418M008l066j452j12O58L747
4189C70K707K037o80k230j582j762L83j838m904K457J461p40J275l27M501K219
4173C347J707m693l830k753n352J563N450j60l920J065L589q66j000k942k56L978
4157e073k568j987j340J668M506J608J873J816l24M63j243M493J681m740J54j43
$$ plain form
4141 844 -4623 -4671 -6635 -8391 -7415 -3138 -346 4631 3652 1696 2769 6549 4198 -1567 -6245 -5094
4125 -5094 -4500 -2754 -3188 855 -1259 -4951 -7919 -7046 -6933 -5864 -4571 -4155 -5605 -7138 -10051 -8548
4109 -8548 -7535 -6880 -6347 -5839 -5938 -3990 -9630 -7144 -539 -283 -4827 -10502 -8879 -4265 -4381 -5606 -1073
4092 -1073 -1939 -2582 -185 -344 -3705 -149 -1987 -3164 -3738 -6513 -5500 -7822 -4447 -2462 -3345 -5425
4076 -5425 -6071 -5748 -5361 -818 3145 3007 6821 6741 -2563 -7464 -7768 -7101 -2317 -1507 599 2231 44
4059 44 -3530 -4535 -8424 -9694 -7491 -5398 -5618 -5985 -2790 -1197 -4791 -6399 -3637 -598 2050 757
4043 757 2239 999 569 -2455 239 800 2548 5141 5464 8847 11008 13203 10344 9520 5162 444
4027 444 -3099 -7805 -9615 -4917 -1714 -3740 -4684 -1654 -6144 -9707 -9207 -7582 -6074 -3327 -949 -4463
$$ packed form
4141H44n467m8j964j756R76M277K792M977r79j956J073L780k351n765m678J151
4125e094N94J746m34M043k114l692k968Q73J13J069J293M16j450j533k913J503
4109h548J013O55N33N08r9J948n640K486O605K56m544n675J623M614j16j225M533
4092a073q66o43K397j59l361L556j838j177n74k775J013k322L375J985q83k080
4076e425o46L23L87M543L963j38L814q0r304m901l04O67M784Q10K106J632k187
4059D4l574j005l889j270K203K093k20l67L195J593l594j608K762L039K648j293
4043G57J482j240m30l024K694N61J748K593L23L383K161K195k859q24m358m718
4027D44l543m706j810M698L203k026r44L030m490l563N00J625J508K747K378l514
$$ plain form
4011 -4463 -5693 -8788 -7898 0 2570 -475 -2532 -1582 -6361 -10245 -17407 -16639 -12367 -10448 -6353 -4952
3995 -4952 4107 6915 7865 6220 816 -5670 -4707 -2722 -5498 -2020 -5844 -6437 -8105 -5541 -1749 -819
3979 -819 1247 3488 -48 -1963 -3747 1324 5676 5567 4590 5339 3264 739 1028 2794 -1150 -4500
3963 -4500 -3817 -4160 -8405 -7149 -1235 5003 1396 -5346 -5109 -1875 -2009 -2055 1415 -15 835 -1592 1314
3946 1314 2767 2467 2594 4194 3733 137 -706 1979 -1969 120 2514 1674 2590 -959 -5105 -5372 -5153
3929 -5153 -6280 -7237 -8930 -10803 -8346 -1727 -233 2122 2794 3043 -537 -495 -2989 -4225 -320 -831
3913 -831 -6492 -11532 -9630 -3956 -3693 -5027 125 -4959 -3661 1065 186 -5521 -4341 -1955 -3809 -6927
3897 -6927 -3198 3438 7437 6944 2286 -1272 -1061 1220 2289 -4146 -7356 -3569 -1552 -879 657 3570
$$ packed form
4011d463j230l095Q90P898K570l045k057R50m779l884p162P68M272J919M095J401
3995d952R059K808R50j645n404o486R63J985k776L478l824n93j668K564L792R30
3979h19K066K241l536j915j784N071M352j09r77P49k075k525K89J766l944l350
3963d500O83l43m245J256N914O238l607o742K37L234j34m6L470j430Q50k427K906
3946A314J453l00J27J600m61l596q43K685l948K089K394q40R16l549m146k67K19
3929e153j127r57j693j873K457O619J494K355O72K49l580M2k494j236L905n11
3913h31n661n040J902N674K63j334N152n084J298M726q79n707J180K386j854l118
3897f927L729O636L999m93m658l558K11K281J069o435l210L787K017O73J536K913
$$ plain form
3881 3570 4244 4176 -1632 -5308 -637 530 -1905 -5191 -5776 -3635 -4254 -2622 -3365 -2131 -2112 -4157 -3179
3864 -3179 -3669 -5863 -5643 -3834 -3961 -4217 -2421 28 2555 3317 929 -3194 -2682 -3494 -351 4597 4230
3847 4230 -3660 -7014 -4146 -391 26 -2167 -1036 4153 7337 1448 -2659 785 8926 8182 -47
3832 -47 -824 4535 7684 5657 3925 -1467 -1770 1580 3867 5643 6212 4685 4479 3352 1425 4331
3816 4331 7261 3519 1569 6418 10058 4058 578 632 4813 4117 3093 -806 657 258 977 3602
3800 3602 5298 5848 1694 -2460 -4715 -8381 -7074 -1892 1470 141 19 4793 6964 10129 10816 5953
3784 5953 6723 2970 -96 1061 -227 1799 1430 -1239 -1750 -814 -5318 -5035 814 5987 6569 653
3768 653 -1420 -1025 377 -1984 -3586 -2889 -3169 -8222 -8080 -5687 -2753 -1462 -1809 754 5525 3383
$$ packed form
3881C570O74o8n808l676M671J167k435l286n85K141o19J632p43J234J9k045R78
3864c179m90k194K20J809j27k56J796K449K527P62k388m123N12q12L143M948l67
3847D230p890l354K868L755M17k193J131N189L184n889m107L444Q141p44q229
3832d7p77N359L149k027j732n392l03L350K287J776N69j527k06j127j927K906
3816D331K930l742j950M849L640o000l480N4M181o96j024l899J463l99P19K625
3800C602J696N50m154m154k255l666J307N182L362j329j22M774K171L165O87m863
3784E953P70l753l066J157j288K026l69k669n11R36m504K83N849N173N82n916
3768F53k073L95J402k361j602O97k80n053J42K393K934J291l47K563M771k142
$$ plain form
3752 3383 574 -3525 -1689 -229 -23 -4318 -3567 -2677 -3516 -4695 -4038 -2587 -3065 -1978 -1423 235 -72
3735 -72 -1673 -5395 -10590 -6426 -6308 -5708 -4491 -395 3736 595 -1540 17 2222 1653 2045 2623 4529
3718 4529 4300 -2298 -6826 -3595 -8353 -6806 -2514 2444 -321 -3551 -2515 -672 3099 1443 -3427
3703 -3427 -1203 -3183 -873 3594 5773 10624 12552 12262 4911 3337 2234 680 4341 1976 352
3688 352 1792 4979 4012 370 2533 4676 5811 3583 -963 -821 -3213 -4807 -4154 -2161 524 579
3672 579 31 3341 145 -2911 -2537 -2281 -2421 -10 -5626 -12900 -8765 -3297 806 5245 5266 5388 3876
3655 3876 3570 5042 4525 1596 -1692 -2445 2653 4622 223 -76 363 2935 30 2581 2557 2262 2520
3638 2520 1722 2076 6767 6011 2250 343 -1785 2276 7207 4057 452 -2829 -703 1791 625 398
$$ packed form
3752C383k809m099J836J460K06m295P51Q90q39j179O57J451m78J087N55J658l07
3735g2j601l722n195M164J18O00J217M096M131l141k135J557K205n69L92N78J906
3718D529k29o598m528L231m758J547M292M958k765l230J036J843L771j656m870
3703c427K224j980K310M467K179M851J928k90p351j574j103j554L661k365j624
3688C52J440L187r67l642K163K143J135k228m546J42k392j594O53J993K685N5
3672E79n48L310l196l056L74K56j40K411n616p274M135N468M103M439K1J22j512
3655C876l06J472n17k929l288p53N098J969m399k99M39K572k905K551k4k95K58
3638B520p98L54M691p56l761j907k128M061M931l150l605l281K126K494j166k27
$$ plain form
3622 398 2394 2390 -1405 1101 1963 -1256 -4189 -2227 -511 2367 5285 3992 4811 7452 10905 6241
3606 6241 -2070 -7832 -7381 -3047 1568 -1664 -3372 -4874 -5493 -6502 -5589 -856 -2266 -5470 -1932 -2880
3590 -2880 -9974 -10188 -46 2416 -3628 -3698 -1126 4481 7330 9212 7937 3983 -2286 -2201 -363 -1203
3574 -1203 -4145 -3315 -4644 337 895 562 -2675 -2029 3335 6105 7016 10426 6699 8284 11991 11105
3558 11105 7255 9292 5220 4829 -488 -2276 -1839 -2200 -3480 -413 -2263 -3593 74 2838 3551 -678
3542 -678 -461 2998 6114 6264 6009 2777 3091 1434 -704 -5050 -2776 934 2874 692 -1256 -2089
3526 -2089 2464 663 2040 3983 -616 -1410 -2002 2102 4534 1148 -809 -4651 -7726 -6542 -4022
3511 -4022 -2694 -4722 -4727 -1538 -1057 -838 -4806 -6616 -5421 -767 -4092 -9446 -4367 129 1631 -1235
$$ packed form
3622C98J996ml795K506Q62l219k933J962J716K878K918j293Q19K641L453m664
3606F241q311n762M51M334M615l232j708j502o19j009R13M733j410l204L538r48
3590b880p094k14J0142K462o044p0K572N607K849J882j275l954o269Q5J838q40
3574a203k942Q30j329M981N58l33l237O46N364K770R11L410l727J585L707q86
3558A1105l850K037m072l91n317j788M37l61j280L067j850j330L667K764P13m229
3542f78K17L459L116J50k55l232L14j657k138m346K274L710J940k182j948q33
3526b089M553j801J377J943m599p94n92M104K432l386j957l842l075J184K520
3511d022J328k028nL189M81K19l968j810J195M654l325n354N079M496J502k866
$$ plain form
3495 -1235 -4811 -7234 -3844 386 -3783 -5286 -6131 -8743 -8191 -6757 -1352 750 352 1306 -1774 -1738
3479 -1738 1476 -4033 -7200 -11647 -10554 -5916 -2957 -1998 -53 -3501 -3350 -5045 -7066 -6055 -3459
3464 -3459 -2309 -5085 -6608 -1297 -3985 -2749 -1143 -668 2220 5709 6331 5321 2666 3482 3881 4084
3448 4084 -451 -904 1591 2570 1393 -429 2666 6133 4735 -1261 -2608 1455 2277 -1345 -4222 -8036
3432 -8036 -8845 -7096 -4504 -160 4610 2370 3237 -136 -1910 -1192 -1448 317 -2713 -5528 -5562 -4170
3416 -4170 850 1043 1796 3686 1274 3420 1534 1044 -340 -7788 -11251 -9068 -7269 -1461 6007 3542
3400 3542 3061 2190 2386 3406 -4410 -12262 -10939 -4170 -3459 -7296 -6224 -3350 -3051 -6244 -3724 1682
3384 1682 2127 237 -1523 -5760 -2236 2226 -2550 -4088 -1753 410 4042 5019 2947 3404 2767 2139
$$ packed form
3495a235l576k423L390M230m169j503q45k612N52J434N405K102l98R54l080L6
3479a738L214n509l167m447J093M638K959R59J945l448J51j695k021J011K596
3464c459J150k776j523N311k688J236J606M75K888L489O22j010k655Q16L99K03
3448D084m535m53K495R79j177j822L095L467j398n996j347M063Q22l622k877l814
3432h036q09J749K592M344M770k240Q67l373j774P18k56J765l030k815l4J392
3416d170N020J93P53J890k412K146j886m90j384p448l463K183J799N808P468k465
3400C542m81q71J96J020p816p852J323O769P11l837J072K874K99l193K520N406
3384A682M45j890j760m237L524M462m776j538K335K163L632R77k072M57o37o28
$$ plain form
3368 2139 2092 2643 1422 -297 -766 1781 3364 3300 1956 87 673 191 -244 3757 7202 4977 -1824
3351 -1824 -5070 -7598 -2359 -2106 1577 -673 -4071 -8219 -10385 -10462 -6924 -1060 -3172 -2907 -481 2031
3335 2031 3267 5539 4434 2626 1726 7 -3284 -3882 212 1293 -991 7498 11402 3935 810
3320 810 -1976 -1952 1927 2361 2824 7729 9031 6485 1342 6259 7242 9302 8231 7312 4658 4239 2697
3303 2697 2841 4099 2948 546 -454 1580 942 -2791 -7397 -1648 3833 2101 2927 2814 -884 -2610
3287 -2610 -5424 -6513 -2923 -1035 -3135 -2204 2888 3694 3065 4518 7625 5734 5951 5682 4423 2516
3271 2516 41 -2309 -6708 -5616 -486 3720 2212 3569 7156 6647 5482 688 -2258 -2204 -1440 -2035
3255 -2035 2377 1448 -967 4050 3409 121 85 -1923 -3938 -926 -865 -1557 -2670 -3236 -2964 -3922 -2101
$$ packed form
3368B139m7N51j221j719m69K547J583o4j344j869N86m82m35M001L445k225o801
3351a824l246k528N239K53L683k250l398m148k166p7L538N864k112K65K426K512
3335B031J236K272j105j808r00j719l291n98M094J081k284Q489L904p467l125
3320H10k786K4L879M34M63M905J302k546n143M917R83K060j071r19k654m19j542
3303B697J44J258j151k402j000K034o38l733m606N749N481j732Q26j13l698j726
3287b610k814j089L590J888k100R31N092Q06o29J453L107j891K17k69j259j907
3271B516k475k350m399J092N130M206j508J357L587n09j165m794k946N4P64n95
3255b035M412r29k415N017o41l288l6k008k015L012O1o92j113n66K72r58J821
$$ plain form
3238 -2101 -1621 288 6605 6725 3414 2715 5608 6407 6385 3436 164 -3370 1064 4821 3237 3104 2692
3221 2692 79 19 -41 74 -4455 -5158 -2651 -507 -1009 -4176 -5765 -1285 -2390 -6867 -7457 -5090 -5706
3204 -5706 -1896 4101 4923 703 -1647 -387 2062 2123 -2737 -863 -1975 -4098 -2535 -2763 2438 6688
3188 6688 11115 9180 384 -5918 -1589 451 425 2678 3021 5682 1680 2073 3873 4662 4879 3085
3172 3085 -3423 -4255 -2897 -4824 -3419 -2092 -4370 -1339 -2510 -1096 -2016 -1225 -651 1564 2520 2379
3156 2379 -41 653 28 1022 -864 -2009 -4059 -1851 896 -889 -2606 -5825 -6667 -5330 -6893 -6199
3140 -6199 -5300 -1472 -17 3685 3787 1157 2156 4411 3140 4059 4966 1178 -2132 -1165 638 84 -934
3123 -934 890 3151 3596 -1825 113 -2092 -1406 3636 3782 -546 -3931 -101 3111 -3503 -5308 -3488
$$ packed form
3238b101M80J909O317J20l311o99K893P99k2k949l272l534M434L757j584j33m12
3221B692k613o0o0J15m529p03K507K144n02l167j589M480j105m477n90K367o16
3204e706L810N997Q22m220k350J260K449O1m860J874j112k123J563k28N201M250
3188F688M427j935q796o302M329K040k6K253L43K661m002L93J800P89K17j794
3172C085o508q32J358j927J405J327k278L031j171J414r20P91N74K215R56j41
3156B379k420O94o25R94j886j145k050K208K747j785j717l219q42J337j563O94
3140f199Q99L828J455L702J02k630R99K255j271R19R07l788l310R67J803n54j018
3123i34J824K261M45n421J938k205O86N042J46m328l385L830L212o614j805J820
$$ plain form
3107 -3488 -1621 312 -2672 -5102 -620 163 -1281 1783 1121 -163 320 2089 3031 -1751 -4187 -4449
3091 -4449 -1972 1816 7515 7119 -1325 -7421 -7928 -7256 -5374 -2617 -1243 1165 -1864 -4653 -5017 -2867
3075 -2867 -905 2697 2355 -171 -2374 -2704 -4710 -5301 -1696 -1182 -3686 -6034 -5017 -574 -484 -175 -186
3058 -186 -5099 -7639 -7142 -2535 -4334 -5682 -6131 -4308 -5316 -9716 -9514 -5259 -3448 -4417 -7496 -11821
3042 -11821 -7434 -3056 1452 2342 -1340 -4210 -2946 1763 2884 -1580 -3034 -4996 -3407 -4319 -5526
3027 -5526 -6193 -6204 -10019 -10943 -5316 289 1050 22 1917 1289 -790 -880 454 -2274 -2950 -3933 -1083
3010 -1083 -2152 -1796 -2765 425 1922 4071 1445 1365 5828 14685 19987 21911 18189 11940 5734 1190
2994 1190 2286 2541 -1530 -6226 -11830 -12133 -9634 -4491 3342 1380 -4313 -6464 -4234 -1178 -3062
$$ packed form
3107c488J867J933k984k430M482P83j444L064o62j284M83J769R42m782k436k62
3091d449K477L788N699l96q444o096n07O72J882K757J374K408l029k789l64K150
3075b867J962L602l42k526k203l30k006n91L605N14k504k348J017M443R0L09j1
3058a86m913k540M97M607j799j348m49J823j008m400K02M255J811r69l079m325
3042a1821M387M378M508Q90l682k870J264M709J121m464j454j962J589r12j207
3027e526o67j1l815r24N627N605P61j028J895o28k079r0J334k728o76r83K850
3010a083j069L56r69L190J497K149k626q0M463Q857N302J924l722o249o206m544
2994A190J096K55m071m696n604l03K499N143P833j962n693k151K230L056j884
$$ [...]
##END NTUPLES=NMR SPECTRUM
##END=
