##TITLE=Analysis number 326977
Compound Code cc 59539
Book Reference 508/68/3
Project Code adrs
Chemist Name antons
##JCAMPDX= 6.0         $$ Bruker NMR JCAMP-DX V2.0
##DATA TYPE= NMR SPECTRUM
##DATA CLASS= NTUPLES
##ORIGIN= Bruker BioSpin GmbH
##OWNER= nmr
$$ XWIN-NMR		Version 3.5
$$ Mon Mar  5 14:08:16 2007 GMT Standard Time (UT+0h)  MAYBRIDGE\nmr@NMR_250MHZ
##.OBSERVE FREQUENCY= 250.131544655141
##.OBSERVE NUCLEUS= ^1H
##.ACQUISITION MODE= SIMULTANEOUS (DQD)
##.ACQUISITION SCHEME= undefined
##.AVERAGES= 16
##.DIGITISER RES= 18
##SPECTROMETER/DATA SYSTEM= dpx250
##.PULSE SEQUENCE= zg30
##.SOLVENT NAME= CDCl3
##.SHIFT REFERENCE= (INTERNAL, CDCl3, 0, 16.522)
##AUDIT TRAIL= $$ (NUMBER, WHEN, WHO, WHERE, WHAT)
$$ ##TITLE= Audit trail, XWIN-NMR		Version 3.5
$$ ##JCAMPDX= 5.01
$$ ##ORIGIN= Bruker BioSpin GmbH
$$ ##OWNER= nmr
$$ C:\u/data/dgb/nmr/ADRS/360/pdata/1/auditp.txt
$$ ##AUDIT TRAIL=  $$ (NUMBER, WHEN, WHO, WHERE, WHAT)
(   1,<2007-03-05 14:07:50.70 +000>,<MAYBRIDGE\nmr>,<NMR_250MHZ>,
      <created by zg, POWCHK disabled, PULCHK disabled
       configuration hash MD5:
       49 4B E0 1D 92 C2 6B 37 9F E6 65 BC 52 41 86 1D
       data hash MD5: 64K
       DF AD D7 49 A0 90 EB 74 FB 4F B9 BC 5E 73 FD 6C>)
(   2,<2007-03-05 14:08:06.73 +000>,<MAYBRIDGE\nmr>,<NMR_250MHZ>,
      <Start of raw data processing
       ef LB = 0.3 FT_mod = 6 PKNL = 1 SI = 32K 
       data hash MD5: 32K
       BA 9D 4F EF 77 86 DB 35 9E EA 8F 46 4C E9 17 30>)
(   3,<2007-03-05 14:08:08.39 +000>,<MAYBRIDGE\nmr>,<NMR_250MHZ>,
      <apk 
       data hash MD5: 32K
       0E 07 7D B7 80 93 2A 99 D6 07 E8 89 1B D9 97 75>)
(   4,<2007-03-05 14:08:09.09 +000>,<MAYBRIDGE\nmr>,<NMR_250MHZ>,
      <abs ABSG = 5 
       data hash MD5: 32K
       4E 70 90 26 62 C8 DB C4 C5 3E 4D 21 9D 07 E8 7B>)
$$ ##END=
$$ 
$$ hash MD5
$$ 78 47 B8 41 6A 5D 9A AE 01 3C 02 71 59 17 94 4A
##$RELAX= 
##$RELAX= 
##$RELAX= 
##$RELAX= 
##$RELAX= 
##$RELAX= 
##$RELAX= 
$$ Bruker specific parameters
$$ --------------------------
##$DU= <C:\u>
##$EXPNO= 360
##$NAME= <ADRS>
##$PROCNO= 1
##$TYPE= <nmr>
##$USER= <dgb>
##$AMP= (0..31)
100 100 100 100 100 100 100 100 100 100 100 100 100 100 100 100 100 100 
100 100 100 100 100 100 100 100 100 100 100 100 100 100 
##$AQSEQ= 0
##$AQ_mod= 3
##$AUNM= <au_zg>
##$AUTOPOS= <35 >
##$BF1= 250.13
##$BF2= 250.13
##$BF3= 250.13
##$BF4= 250.13
##$BF5= 500.13
##$BF6= 500.13
##$BF7= 500.13
##$BF8= 500.13
##$BYTORDA= 1
##$CFDGTYP= 0
##$CFRGTYP= 5
##$CHEMSTR= <none>
##$CNST= (0..31)
1 1 145 1 1 1 1 1 1 1 1 1 1 1 1 1 1 1 1 1 1 1 1 1 1 1 1 1 1 1 1 1 
##$CPDPRG= <>
##$CPDPRG1= <>
##$CPDPRG2= <>
##$CPDPRG3= <>
##$CPDPRG4= <mlev>
##$CPDPRG5= <mlev>
##$CPDPRG6= <mlev>
##$CPDPRG7= <mlev>
##$CPDPRG8= <mlev>
##$CPDPRGB= <>
##$CPDPRGT= <>
##$D= (0..31)
0 1 0 0 0 0 0 0 0 0.06 0 0 0 0 0 0 0.0002 0 0 0 0 0 0 0 0 0 0 0 0 0 0 
0 
##$DATE= 1173103669
##$DBL= (0..7)
120 120 120 120 120 120 120 120 
##$DBP= (0..7)
150 150 150 150 150 150 150 150 
##$DBP07= 0
##$DBPNAM0= <>
##$DBPNAM1= <>
$$ [...]
##$SUBNAM7= <"">
##$SUBNAM8= <"">
##$SUBNAM9= <"">
##$SW= 20.6930455092707
##$SWIBOX= (0..15)
0 0 3 0 0 0 0 0 0 0 0 0 0 0 0 0 
##$SW_h= 5175.983436853
##$TD= 65536
##$TD0= 1
##$TE= 295.16
##$TE2= 300
##$TE3= 300
##$TEG= 300
##$TL= (0..7)
0 120 120 120 120 120 120 120 
##$TP= (0..7)
150 150 150 150 150 150 150 150 
##$TP07= 0
##$TPNAME0= <>
##$TPNAME1= <>
##$TPNAME2= <>
##$TPNAME3= <>
##$TPNAME4= <>
##$TPNAME5= <>
##$TPNAME6= <>
##$TPNAME7= <>
##$TPOAL= (0..7)
0.5 0.5 0.5 0.5 0.5 0.5 0.5 0.5 
##$TPOFFS= (0..7)
0 0 0 0 0 0 0 0 
##$TUNHIN= 0
##$TUNHOUT= 0
##$TUNXOUT= 0
##$USERA1= <user>
##$USERA2= <user>
##$USERA3= <user>
##$USERA4= <user>
##$USERA5= <user>
##$V9= 5
##$VALIST= <valist>
##$VCLIST= <CCCCCCCCCCCCCCC>
##$VD= 0
##$VDLIST= <DDDDDDDDDDDDDDD>
##$VPLIST= <PPPPPPPPPPPPPPP>
##$VTLIST= <TTTTTTTTTTTTTTT>
##$WBST= 1024
##$WBSW= 4
##$XGAIN= (0..3)
0 0 0 0 
##$XL= 0
##$YL= 0
##$YMAX_a= 284734
##$YMIN_a= -334305
##$ZGOPTNS= <>
##$ZL1= 120
##$ZL2= 120
##$ZL3= 120
##$ZL4= 120
##$ABSF1= 16.522
##$ABSF2= -4.171173
##$ABSG= 5
##$ABSL= 3
##$ALPHA= 0
##$AQORDER= 0
##$ASSFAC= 0
##$ASSFACI= 0
##$ASSFACX= 0
##$ASSWID= 0
##$AUNMP= <proc_1d>
##$AZFE= 0.1
##$AZFW= 0.1
##$BCFW= 0
##$BC_mod= 0
##$BYTORDP= 0
##$COROFFS= 0
##$CY= 12.5
##$DATMOD= 1
##$DC= 0
##$DFILT= <>
##$DTYPP= 0
##$F1P= 14.0000005364418
##$F2P= -0.99999901652339
##$FCOR= 0.5
##$FTSIZE= 32768
##$FT_mod= 6
##$GAMMA= 0
##$GB= 0
##$INTBC= 1
##$INTSCL= 1
##$ISEN= 128
##$LB= 0.3
##$LEV0= 0
##$LPBIN= 0
##$MAXI= 10000
##$MC2= 0
##$MEAN= 0
##$ME_mod= 0
##$MI= 0
##$NCOEF= 0
##$NC_proc= -3
##$NLEV= 6
##$NOISF1= 0
##$NOISF2= 0
##$NSP= 0
##$NTH_PI= 0
##$NZP= 0
##$OFFSET= 16.522
##$PC= 1
##$PHC0= 228.1014
##$PHC1= 3.781038
##$PH_mod= 1
##$PKNL= yes
##$PPARMOD= 0
##$PSCAL= 4
##$PSIGN= 0
##$REVERSE= no
##$SF= 250.13
##$SI= 32768
##$SIGF1= 0
##$SIGF2= 0
##$SINO= 400
##$SIOLD= 32768
##$SREGLST= <1H.CDCl3>
##$SSB= 0
##$STSI= 32768
##$STSR= 0
##$SW_p= 5175.98343685301
##$SYMM= 0
##$S_DEV= 0
##$TDeff= 65536
##$TDoff= 0
##$TI= <Analysis number 999999
Compound Code 99
Book Reference 9
Project Code 9>
##$TILT= no
##$TM1= 0
##$TM2= 0
##$TOPLEV= 0
##$USERP1= <user>
##$USERP2= <user>
##$USERP3= <user>
##$USERP4= <user>
##$USERP5= <user>
##$WDW= 1
##$XDIM= 32768
##$YMAX_p= 577162227
##$YMIN_p= -58304
$$ End of Bruker specific parameters
$$ ---------------------------------
##NTUPLES= NMR SPECTRUM
##VAR_NAME=  FREQUENCY,     SPECTRUM/REAL,   SPECTRUM/IMAG
##SYMBOL=    X,             R,               I
##VAR_TYPE=  INDEPENDENT,   DEPENDENT,       DEPENDENT
##VAR_FORM=  AFFN,          ASDF,            ASDF
##VAR_DIM=   32768,         32768,           32768
##UNITS=     HZ,            ARBITRARY UNITS, ARBITRARY UNITS
##FACTOR=    0.157963299565203, 1,           1
##FIRST=     4132.6476996994, 0,             0
##LAST=      -1043.33573715361, 0,           0
##MIN=       -1043.33573715361, -58304,      0
##MAX=       4132.6476996994, 577162227,     0
$$ Real data points
##PAGE= N=1
##DATA TABLE= (X++(R..R)), XYDATA
$$ [...]
14788f180O915M290n930o998l15J2367M369J282k972r903l218K29r428p155J0553
$$ -6180 735 5025 -905 -7903 -8218 4149 8518 9800 6828 -3075 -6293 -6064 -15492 -22647 -12094
14773a2094p992k5186R286J5788L695R319J3530p460n418j4268j5432Q548J1933
$$ -12094 -20086 -45272 -35986 -20198 -16503 -7184 6346 -1114 -6532 -20800 -36232 -27684 -15751
14760a5751Q924J1574O070k704M313p020j6799j9493j9386J2138K2019J2894J9179
$$ -15751 -6827 4747 10817 8113 12426 5406 -11393 -30886 -50272 -38134 -16115 -3221 15958
14747A5958q208n188N421K055q331m096Q46J1208p415l544N470K779J999L250
$$ 15958 7750 2562 7983 10038 1707 -2389 -1543 9665 2250 -1294 4176 6955 8954 12204
14733A2204m197r89Q616J024o583l780N53J631m276Q715o472j6385j1612M799
$$ 12204 8007 7018 15634 16658 10075 6295 6848 8479 4203 12918 6446 -9939 -21551 -16752
14719a6752M646O551O546l558j2238K151J111Q361K31j3830k986K358L379J6644
$$ -16752 -12106 -5555 991 -2567 -14805 -12654 -11543 -3182 -2951 -16781 -19767 -17409 -14030 2614
14705B614P464j686n721o397r342r51J0942J4850j759j1493p184L307q316j84
$$ 2614 10078 8392 2671 -3726 -13068 -14019 -3077 11773 10014 -1479 -8663 -5356 -13672 -13856
14691a3856J4492l6l752J169l366m75r064K316J72n640p864Q184J3560J2166J1110
$$ -13856 636 600 -3152 -1983 -5349 -5824 -14888 -12572 -12400 -18040 -25904 -17720 -4160 8006 19116
14676A9116J244j023L181K575k3058j2473n234n646k72J0997K433J737Q462n291
$$ 19116 20360 19337 22518 25093 2035 -10438 -15672 -21318 -21590 -10593 -8160 -6423 2039 -3252
14662c252K603N154P325k492k905j0875j1896p816l657l906j4523O146J9491J9171
$$ -3252 -649 4505 11830 9338 6433 -4442 -16338 -24154 -27811 -31717 -46240 -40094 -20603 -1432
14648a432O549r35q022O69Q44P635r805r895M712J116J439J928Q62j0466q031
$$ -1432 5117 4182 -3840 -3171 -2327 5308 -4497 -14392 -9680 -8564 -7125 -5197 -4335 -14801 -22832
14633b2832k460r365N437J3554O625J857K1239p425k0257q855N161O891j387l795
$$ -22832 -25292 -34657 -29220 -15666 -9041 -7184 14055 6630 -13627 -22482 -17321 -10430 -11817 -15612
14619a5612j0113j333j0587J4146J0520P34J1807M274j822J1721M622l757o186
$$ -15612 -25725 -27058 -37645 -23499 -12979 -12245 -438 3836 2014 13735 18357 14600 8414
14606H414K915M195o999r407j1799o723N820J0208k193L508N603Q188r254n263
$$ 8414 11329 15524 8525 -882 -12681 -19404 -13584 -3376 -5569 -2061 3542 11730 2476 -2787
14592b787N112m631k887l222m536R625P010o215N5N558r687L638N939L963p397
$$ -2787 2325 -2306 -5193 -8415 -12951 -3326 3684 -2531 -2476 3082 -6605 -2967 2972 6935 -462
14577d62j1621o506J299O043k487l08J2256j991j0821M849J168L402N463N993
$$ -462 -12083 -18589 -17290 -11247 -13734 -14042 -1786 -3777 -14598 -9749 -8581 -5179 284 6277
14563F277o269J0671n403p652k814L468K87R961J2683K427m266j2853p325J3870
$$ 6277 8 10679 5276 -2376 -5190 -1722 -1435 8526 21209 23636 19370 6517 -808 13062
14549A3062J0973j4931j33N404j3643l544J165P939L397M716q759M66L018n727
$$ 13062 24035 9104 8971 14375 732 -2812 -1647 6292 9689 14405 5646 6112 9130 3403
14535C403o903k2694J270P211O522q185j2438O257J4232J1090J0422j9752k2287
$$ 3403 -3500 -26194 -24924 -17713 -11191 -19376 -31814 -25557 -11325 -235 10187 -9565 -31852
14522c1852L979P604M704o609k175Q304j546P11M949j975o962J95k771m175k375
$$ -31852 -27873 -20269 -15565 -22174 -24349 -16045 -17591 -16880 -11931 -13906 -20868 -20673 -23444 -27619 -29994
14507b9994J3708J6183J5817j0700p933n457J5127n202k0805M317L644l858J6307
$$ -29994 -16286 -103 15714 5014 -2919 -8376 6751 1549 -19256 -14939 -11295 -15153 1154
14494A154M170j21j2561k039M277r325O350N146k096J603j900J5762J4511m244
$$ 1154 5324 5203 -7358 -9397 -5120 -14445 -8095 -2949 -5045 -3442 -5342 10420 24931 20687
14480B0687q831j3908k753k799K008J1575l239j0967n670K271J0263M656K970
$$ 20687 11856 -2052 -4805 -7604 -5596 5979 2740 -8227 -13897 -11626 -1363 3293 6263
14467F263j874M663J3739p505k252n90j099K328k681N476J740M966k042m129O088
$$ 6263 4389 9052 22791 15286 13034 12444 11345 13673 10992 16468 18208 23174 21132 17003 23091
14452B3091J75N842k0098q181P204r413J806K938o36p596J751j2313n483l856
$$ 23091 23266 29108 9010 829 8033 -1380 426 3364 2728 -4868 -3117 -15430 -20913 -24769
14438b4769k212J1233L513J2297J758j715j0865j2242o415P899M975k112N233
$$ -24769 -26981 -15748 -12235 62 1820 105 -10760 -23002 -29417 -21518 -16543 -18655 -13422
14425a3422m317p572L113O890p342M219K625L606J1038J0601P205p640m358o161
$$ -13422 -17739 -25311 -22198 -15308 -22650 -18431 -15806 -12200 -1162 9439 16644 9004 4646 -1515
14411a515j4295j6840L124J3681J0994j0188J319L299p239r786R503Q738J753
$$ -1515 -15810 -32650 -29526 -15845 -4851 -15039 -13720 -10421 -17660 -27446 -17943 -9205 -7452
14398g452m014l133P531J3296j350k886k883p007o769n656N618O941m083J0013
$$ -7452 -11466 -14599 -7068 6228 4878 1992 -891 -7898 -14667 -20323 -14705 -7764 -11847 -1834
14384a834R095l707j1580P59M663p489J372J5450j050j2506L277o280l021j1286
$$ -1834 7261 3554 -8026 -7267 -2604 -10093 -8721 6729 5679 -6827 -3550 -9830 -12851 -24137
14370b4137O053K075O815l576N453r10Q371J1752Q912j3691j987N86o746J1468
$$ -24137 -18084 -16009 -9194 -12770 -7317 -8227 144 11896 20808 7117 5130 5716 -1030 10438
14356A0438p5j3037q703L28J0727K351k653M085j01o031j1444O894Q864O448O629
$$ 10438 10363 -2674 -11377 -11049 -322 2029 -624 3461 3360 -2671 -14115 -7221 1643 8091 14720
14341A4720n422j3753j1302O852J9456p997k176o221n556R753M544m566R363k333
$$ 14720 9298 -4455 -15757 -8905 10551 2554 378 -5843 -11399 -1646 2898 -1668 7695 5362
14327E362n006j6914Q776J5142L189n392j7135K608r316J0625P919n901j458J29
$$ 5362 356 -16558 -7782 7360 10549 5157 -11978 -9370 -18686 -8061 -142 -6043 -7501 -7372
14313g372j3348L360K2827N618j865J2297l832p527P81J23Q645J1632j175n255
$$ -7372 -20720 -17360 5467 11085 9220 21517 17685 10158 10939 11062 19707 31339 30164 24909
14299B4909J4368j981q753j4326o031Q340J0166m174q347J5185J524j0216M902
$$ 24909 39277 37296 28543 14217 8186 16526 26692 22518 14171 29356 30880 20664 25566
14286B5566R431q925m72j1988J112J2016o24j536m941k12o476m066N613J186l5261
$$ 25566 34997 26072 25600 13612 14724 26740 26116 24580 19639 19427 12951 8885 14498 15684 -19577
14271a9577l093J7081K516N160n261r852K111J7745p37o234l961r00P676j0668
$$ -19577 -22670 -5589 -3073 2087 -3174 -13026 -10915 6830 6093 -141 -4102 -5002 2674 -7994
14257g994j2223P203L828l790p796N761P919j6030R595J3914p123j2634J203M792
$$ -7994 -20217 -13014 -9186 -12976 -20772 -15011 -7092 -23122 -13527 387 -6736 -19370 -18167 -13375
14243a3375J0307j7907Q00p053M732J6156j019N494N464K9j5930M069J1116K587
$$ -13375 -3068 -20975 -20175 -27228 -22496 -6340 -7359 -1865 3599 3628 -12302 -8233 2883 5470
14229E470N49o263l82k31K853m092M972p644o623R903N379K944O41K035j3289
$$ 5470 6019 -244 -626 -857 1996 -2096 2876 -4768 -11391 -1488 3891 6835 7476 9511 -3778
14214c778M387Q753N004p115r974J795j690l240J8077m105j0012l698j423j0183
$$ -3778 609 9362 14366 7251 -2723 -928 -2618 -5858 12219 8114 -1898 -5596 -7019 -17202
14200a7202J3311R418N209r346n572j3992M15M575J187K489K092n479j1113j3613
$$ -17202 -3891 5527 10736 1390 -4182 -18174 -17759 -13184 -11997 -9508 -7416 -12895 -24008 -37621
14186c7621J6641J0277O108J1479r911k8128r09J9935j172j4774P902J2126n101
$$ -37621 -20980 -10703 -4595 6884 -3027 -31155 -32064 -12129 -13301 -28075 -20173 -8047 -13148
14173a3148J1905J7584o510n470p961N5O938p323K929j956Q926M148k4389q971
$$ -13148 -1243 16341 9831 4361 -3600 -3545 3393 -3930 -1001 -2957 5969 10117 -14272 -23243
14159b3243j183r508J1271J3241k870j2189j397K1122n970J236p626N829J2108
$$ -23243 -24426 -33934 -22663 -9422 -12292 -24481 -25878 -4756 -10726 -9490 -17116 -11287 821
14146H21P925N019j4706o955q41m306J4255K88r5N336o22O918J5145k730j5542
$$ 821 8746 13765 -941 -7896 -8737 -13043 1212 1500 1405 6741 6119 13037 28182 25452 9910
14131I910j2731j7976l384J3293K835J536J774k406p041j683O156J14r107K504
$$ 9910 -2821 -20797 -24181 -10888 -8053 -6517 -4743 -7149 -14190 -15873 -9717 -9603 -18710 -16206
14117a6206n729q72j061M801J2417J24l051O166J3175k375m687r961m517O871
$$ -16206 -21935 -22807 -23868 -19067 -6650 -6526 -9577 -3411 9764 7389 2702 -7259 -11776 -4905
14103d905k650Q39J0550j888q273M266j516j06M669j597m930j6315k761L039j0001
$$ -4905 -7555 -6716 3834 1946 -6327 -2061 -3577 -3683 986 -611 -5541 -21856 -24617 -21578 -31579
14088c1579n681P051Q064J4467j326k330P192N430r136n248k46R178M545L251
$$ -31579 -37260 -30209 -22145 -7678 -9004 -11334 -4142 1288 -7848 -13096 -13342 -4164 381 3632
14074C632j0953o72M476J1312L00j1595l151R128J3696j4173j5691o425Q885M077
$$ 3632 -7321 -7993 -3517 7795 8095 -3500 -6651 2477 16173 2000 -13691 -20116 -11231 -7154
14060g154J410n634K611l609r22J20Q533M679r756j9789n625q422kO204J2180
$$ -7154 -5744 -11378 -8767 -12376 -13298 -13178 -4645 34 -9722 -29511 -35136 -43558 -43560 -37356 -25176
14045b5176J5650O340o265L256O935q670j0814n279m180K736J0473N72R777L016
$$ -25176 -9526 -3186 -9451 -6195 740 -7930 -18744 -24023 -28203 -25467 -14994 -14422 -4645 -1629
14031a629P247o22N885L747j3036J964L261R077p151j5511n788J706P936J5336
$$ -1629 5618 4996 10881 14628 1592 3556 6817 15894 8743 -6768 -12556 -10850 -2914 12422
14017A2422j5889j9099k251J4711J1522p663q650R374L847m293l356j6945L290
$$ 12422 -3467 -22566 -24817 -10106 1416 -6247 -14897 -5523 -1676 -5969 -9325 -26270 -22980
14004b2980J1965L268R28k657R436l826m479l873P872J5557p663k2439k03j881
$$ -22980 -11015 -7747 -6819 -9476 -40 -3866 -8345 -12218 -4346 11211 3548 -18891 -19094 -20975
13990b0975N535R162P967O05p076P57O034j7007n501K1140p126r142m005N361
$$ -20975 -15440 -6278 1689 2294 -4782 -4025 2009 -14998 -20499 641 -6485 -15627 -19632 -14271
13976a4271M768J8398r18K692j8049j6166L265J6389J0317O92j0389o323q969
$$ -14271 -9503 8895 7977 10669 -7380 -23546 -20281 -3892 6425 7117 -3272 -9595 -18564
13963a8564l489Q720N426k429j2023q523K539J4220R396J0177J0657J52J43k195
$$ -18564 -22053 -13333 -7907 -10336 -22359 -30882 -28343 -14123 -4727 5450 16107 16259 16402 14207
13949A4207l978J198Q188m35j0844r262k205L69O943R644j4459m186N939P68R34
$$ 14207 10229 11427 19615 19180 8336 -926 -3131 -2762 4181 13825 -634 -4820 1119 1887 2821
13934B821q106j5155j4308j0827J0409P886P981p229j670J0365O869M870j444
$$ 2821 -5285 -20440 -34748 -45575 -35166 -27280 -19299 -26528 -28198 -17833 -10964 -6094 -7538
13921g538K700R232q86J595o90q866P21M013k505q306j5165k11R124J8734J0528
$$ -7538 -4838 4394 3508 5103 4413 -4453 -3732 281 -2224 -10530 -25695 -25906 -16782 1952 12480
13906A2480R0j3089J633r038j1213P123q45q89N814M908j1569p24k005p529J933
$$ 12480 12570 -519 1114 -7924 -19137 -12014 -12859 -13748 -7934 -3026 -14595 -15319 -17324 -24853 -22920
13891b2920R033R299N198Q955K551O510j4178j9019j2040P13q84M373L525O680
$$ -22920 -13887 -4588 610 9565 12116 18626 4448 -14571 -26611 -25898 -26782 -22409 -18884 -12204
13877a2204j3498J159M508Q369m874J8168k333M847L633n741K214k587j1141j0874
$$ -12204 -25702 -24543 -20035 -11666 -16540 1628 -705 4142 7775 2034 4248 1661 -9480 -20354
13863b0354K4371Q410j2529j1322P119J6263j1518j7642q344N655m772O17n072
$$ -20354 4017 12427 -102 -11424 -4305 11958 440 -17202 -25546 -19891 -24663 -24046 -29118
13850b9118J3537Q901k715j1717J4433N349Q133J878K880k502n270j0633M035
$$ -29118 -15581 -6680 -9395 -21112 -6679 -1330 6803 8681 11561 9059 3789 -6844 -2809
13837b809J1067P965j606K174j3368R36o468J0565o584j8127k890J2249J1413
$$ -2809 8258 16223 14617 16791 3423 4359 -2109 8456 1872 -16255 -19145 -6896 4517
13824D517j3719m609M121j0209Q461K7514J75j298j0391r843K927n237l226j1780
$$ 4517 -9202 -13811 -9690 -19899 -11438 16076 16251 14953 4562 -5281 -2354 -7591 -10817 -22597
13810b2597q124N16M590O880R783L925L529q069r940k887q007j589K4029N065
$$ -22597 -30721 -30205 -25615 -18735 -8952 -5027 -1498 -9567 -19507 -22394 -30401 -31990 -7961 -2896
13796b896Q010k868K363M797j2561l556l471M27Q026j208P67m306l418K417k324
$$ -2896 5114 2246 4609 9406 -3155 -6711 -10182 -9755 -1729 -2937 -2170 -6476 -9894 -7477 -9801
13781i801L057P936N202K610j2647m961J0248q981j1190J5388l832J335l308L885
$$ -9801 -6744 1192 6394 9004 -3643 -8604 1644 -7337 -18527 -3139 -6971 -5636 -8944 -5059
13767e059k099p419n617p980M864p939J753J0106J775M663k4106l017J8426J5805
$$ -5059 -7158 -14577 -20194 -28174 -23310 -31249 -29496 -19390 -17615 -12952 -37058 -40075 -21649 -5844
13753e844J2108m039m814j0858K492J3329K516j4058j662j0064q53j0956P485
$$ -5844 6264 2225 -2589 -13447 -10955 2374 4890 -9168 -10830 -20894 -21747 -32703 -25218
13740b5218j1058N810K3112p400j0162O781O201R683K713J808M24M919o501l261
$$ -25218 -36276 -30466 -7354 -14754 -24916 -18135 -11934 -2251 462 2270 2694 7613 1112 -2149
13726b149M584L733r547j2316J5378R001p524j390O46j2617N899J5136R524r33
$$ -2149 2435 6168 -3379 -15695 -317 8684 1160 -230 416 -12201 -6302 8834 18358 17425
13712A7425j060j5964K541R726l939r593P999k26p365l949r05k792o247K406M687
$$ 17425 16365 401 2942 12668 8729 -864 7135 6909 -456 -4405 -5310 -8102 -14349 -11943 -7256
13697g256J095L49N569j3719l231Q578Q781R381J1194n415j0583j6745p287o638
$$ -7256 -6161 -5812 -243 -13962 -17193 -8615 166 9547 20741 15326 4743 -12002 -19289 -25927
13683b5927J66L879J1597r239l329R469j196k487J4163k426n797N385n544O447
$$ -25927 -25761 -21882 -10285 -19524 -22853 -13384 -14580 -17067 -2904 -5330 -11127 -5742 -11286 -4839
13669d839N52n019l356n133M157j72J977L940J0379J2879k572j6689j3986M956
$$ -4839 -4287 -9306 -12662 -17795 -13638 -13810 -11833 -7893 2486 15365 12793 -3896 -17882 -12926
13655a2926J0540p15K57J884K742p6Q012q843j7357k573j382K09K707J0447j3318
$$ -12926 -2386 -3101 -2844 -960 1782 1706 9718 875 -16482 -19055 -20437 -20228 -17521 -7074 -20392
13640b0392J2276J4932J6100K922j6839j1209P377P957o799k3066k486K0942J4952
$$ -20392 -8116 6816 22916 25838 8999 -2210 5167 13124 6325 -16741 -19227 1715 16667
13627A6667J3585K599O86j6207j8680q673R518l654j338L210N153J8010O043j6349
$$ 16667 30252 32851 33537 17330 -1350 -10023 -505 -4159 -5497 -2287 2866 20876 26919 10570
13613A0570J072n24j2240L720R947j2458j5830J908J8562k144m210n362O110L541
$$ 10570 11642 11118 -1122 2598 12545 87 -15743 -13835 4727 2583 -1627 -6989 -879 2662
13599B662O825j0604l620n344j260J1742M195q823k52J3608J1155N048M315p243
$$ 2662 9487 -1117 -4737 -10081 -11341 401 4596 -4227 -4479 9129 20284 25332 29647 22404
13585B2404l516m96l404o811O586q241j970j0541l164O930K879J2497O68j8325
$$ 22404 18888 18392 14988 8177 14763 6522 4552 -5989 -9153 -2223 656 13153 13821 -4504
13571d504j0268P89m678P831k915l811N897J6885M288j0026J490L190r313k533
$$ -4504 -14772 -13983 -18661 -10830 -13745 -17556 -11659 5226 9514 -512 978 4168 -5145 -7678
13557g678L810M206J1785L409J2399p178m88J2694M598j0565k0073j2288R285
$$ -7678 -3868 338 12123 15532 27931 20753 20265 32959 37557 26992 6919 -5369 3916
13544C916O148Q67l284R321J305j5010O751J3587j0807j2043j3725O685L896J0440
$$ 3916 10064 10931 7647 16968 18273 3263 10014 23601 12794 751 -12974 -6289 -2393 8047
13530H047p362J812K5208m460j4017O110Q807r967p345M061j4322n276J926R898
$$ 8047 685 2497 27705 23245 9228 15338 24145 14178 6833 10894 -3428 -8704 -6778 3120
13516C120R548k386p49j3425p574K986Q572n734j1880N454L645m822J8795J9194
$$ 3120 12668 10282 9533 -3892 -11466 -8480 92 -5642 -17522 -12068 -8423 -13245 5550 24744
13502B4744J7067k796l001k586m719k096M121j0719R436N632R159L3678J9443
$$ 24744 41811 39015 36014 33428 28709 26613 30734 20015 29451 35083 44242 77920 97363
13489I7363P109K388j0443j4129k3789n204l267o231o616j8025j5765N737J6945
$$ 97363 104472 106860 96417 82288 58499 53295 50028 43797 37181 19156 3391 9128 26073
13476B6073k317n191L347K374m019k61N97n799m790m180q968M629J1783R519O662
$$ 26073 23756 18565 21912 24286 20267 20006 20603 14804 10014 5834 -3134 1495 13278 22797 29459
13461B9459R919N916j4676r994k002P896O622J0781J4808L0758K6441L3851K0191
$$ 29459 39378 45294 30618 20624 18622 26518 33140 43921 58729 89487 115928 149779 169970
13448A69970J3922n167j1268j3893j4525l4350k7738J791j1725k7802k9959j3227
$$ 169970 183892 178725 167457 153564 139039 104689 76951 78742 67017 39215 9256 -3971
13436c971P328J7710L775o084r256q443L060K878N404j2335l490j6519j189J9998
$$ -3971 3357 21067 24842 18758 9502 1059 4119 6997 12401 66 -3424 -19943 -21132 -1134
13422a134K7290q210r47J0380J1992m530o729N245J057J2618l701J0690J4012
$$ -1134 26156 17946 16999 27379 39371 34841 28112 33357 34414 47032 43331 54021 68033
13409F8033Q402J8948N502r078j6670l2317k7657j6998Q836P793Q802Q697n118
$$ 68033 76435 95383 100885 91807 75137 42820 15163 -1835 7001 14794 23596 32293 27175
13396B7175J994n46k608k540O34q483p720r316k465r79k541P14j509j2452K466
$$ 27175 29169 28623 26015 23475 24109 15626 7906 -1410 -3875 -4854 -7395 -6681 -8190 -20642 -18176
13381a8176J3815O271j0343n40j706M468M685N8J1492m584j3195k310l110j256
$$ -18176 -4361 1910 -8433 -8973 -10679 -6211 -1526 -1468 10024 5440 -7755 -10065 -13175 -14431
13367a4431k825R462J3283M588k3524L340R688J4674j129p044J195o707m017n152
$$ -14431 -17256 -7794 5489 10077 -13447 -10107 -419 14255 13126 6082 7277 570 -3447 -8599
13353h599j808K126M139r193Q246J3520m997j2008n123K278Q44J349p842l175
$$ -8599 -10407 -8281 -4142 -13335 -5089 8431 3434 -8574 -13697 -11419 -10575 -9226 -17068 -20243
13339b0243Q720L93L067J450L020L107M083n319l382K035l016J0508J445N599
$$ -20243 -11523 -11130 -8063 -6613 -3593 -486 3597 -1722 -5104 -3069 -6085 4423 5868 11467
13325A1467N652q752r421q958p116j1936P45lJ1346O909J2984J527J317J3203
$$ 11467 17119 8367 -1054 -10012 -17128 -29064 -28319 -28322 -16976 -10067 2917 4444 5761 18964
13311A8964n178l360l024j559m584j0636j2344J094P710J0857J8160J627j6769
$$ 18964 13786 10426 7402 5843 1259 -9377 -21721 -20627 -12917 -2060 16100 17727 958
13298I58k317K060K218K611K990p258p125p998J5984P560j4074o487l215m62j316
$$ 958 -1359 701 2919 5530 8520 1262 -5863 -13861 2123 9683 -4391 -10878 -14093 -14555 -15871
13283a5871R533J2193K682j1979K090j0993j1833M751J7288J0552O201r12l942
$$ -15871 -6338 5855 8537 -3442 -1352 -12345 -24178 -19427 -2139 8413 14614 13702 9760
13270I760j4420j0084M65J1210J696P01p959k777N765m969n070J2512N828o829
$$ 9760 -4660 -14744 -14279 -3069 -1373 -672 -8631 -11408 -5643 -10612 -15682 -3170 2658 -4171
13256d171j1045P368J0119P48P815N686j0483r918l362J188L831J8012m193k556
$$ -4171 -15216 -7848 2271 3019 10834 16520 6037 -3881 -7243 -6055 -2224 15788 11595 9039
13242I039j060j68r839J6284R60j1773j1891L133J2158J162j971n267p701K112
$$ 9039 7979 7811 -2028 14256 15216 3443 -8448 -5315 6843 8005 6034 767 -6934 -4822
13228d822N4p524r147j5802k1063Q818J7278Q659R866k600m572J1411J5615N0
$$ -4822 -4768 -12292 -21439 -37241 -58304 -49486 -32208 -23549 -13683 -16283 -20855 -9444 6171 6221
13214F221o362Q729J9914J5611j4180J63J1114r820r534r551l727J44P13J2215
$$ 6221 -141 8588 28502 44113 29933 30096 41210 31390 21856 12305 8578 8722 9435 21650
13200B1650j0131l809J7538K567j1903n585J1405P872k166N313o286j202L7972
$$ 21650 11519 7710 25248 27815 15912 10327 21732 29604 27438 32751 26465 25263 63235
13187F3235N3130N1946l3371n8824l7929l6732j1022j1044r31J856R989N115J454
$$ 63235 116365 168311 134940 76116 38187 1455 -9567 -20611 -21542 -19686 -9697 -4582 -3128
13174c128O147j4412K983K3653J6713j0504j4709J3789J5344j052j763L922l945
$$ -3128 3019 -11393 -8410 15243 31956 21452 6743 20532 35876 34824 33061 36983 33038
13161C3038j5448K648j2284j1882j4665j449k406Q259j214N280J0323K1190q472
$$ 33038 17590 20238 7954 -3928 -18593 -20042 -22448 -14189 -15403 -10123 200 21390 12918
13148A2918q365J0576l476l689j289l852J71L404M498N83J556j868j4587j5106
$$ 12918 4553 15129 11653 7964 6675 2823 2994 6398 10896 11479 13035 11167 -3420 -18526
13134a8526j61N763J0243J3142J8971k513Q998O41J3338K2535R977j83p414j3617
$$ -18526 -18687 -12924 -2681 10461 29432 26919 35917 36558 49896 72431 82408 82225 74811 61194
13120F1194j193Q617p199q659j7167r579j4938l003Q067M991J1059l534k90j4194
$$ 61194 60001 68618 61419 52760 35593 26014 11076 8073 16140 21131 32190 28656 28366 14172
13106A4172j0802L665K8822J1070r446n340j1006j394Q843Q526o724L811P258
$$ 14172 3370 7035 35857 46927 37481 32141 21135 19741 28584 37110 30386 34197 41455
13093D1455J5607N80p156K969K679J0019N088o821J4457J3278O124Q583J1951
$$ 41455 57062 57642 50486 53455 56134 66153 71241 64420 78877 92155 98279 106862 118813
13080A18813Q684R557k685K640J906K687J7292J1002K71J664N258J1346J7102
$$ 118813 127497 137054 134369 137009 138915 141602 158894 169896 170167 171831 177089 188435 205537
13067B05537K0074L0817K9397J6255J1276K1799L7822L0121L7374M6681N4939
$$ 205537 225611 256428 285825 302080 313356 335155 372977 403098 440472 487153 542092
13056E42092Q2841J00150J27524J26415J47377J65645K18084L11467L95931N08628
$$ 542092 624933 725083 852607 979022 1126399 1292044 1510128 1821595 2217526 2726154
13046B726154P21109J051123J504345K146567K884748L407608L198789J933422
$$ 2726154 3447263 4498386 6002731 8149298 11034046 14441654 17640443 19573865
13038A9573865q1704j984422k996196l050521k561251j928247j420470j033704
$$ 19573865 19492161 17507739 14511543 11461022 8899771 6971524 5551054 4517350
13030D517350p40085n48384m09950l14920k38865j92414j36743j01732j02666
$$ 4517350 3777265 3228881 2818931 2504011 2265146 2072732 1935989 1834257 1731591
13021A731591o9900l1021j5528q53L2011P8785J00826J60512K07138K39206K76682
$$ 1731591 1661691 1630670 1615142 1614289 1646300 1725085 1825911 1986423 2193561 2432767 2709449
13010B709449L30743M03285N37972P43440J026279J464290K100325L056373M412176
$$ 2709449 3040192 3443477 3981449 4724889 5751168 7215458 9315783 12372156 16784332
13001A6784332O105246P509516P435639M874518J51473m596446p228423p352249
$$ 16784332 22889578 30399094 37834733 42709251 42860724 38264278 31035855 23683606
12993B3683606n998695m352449l016354k081993j487002j100435q26018o56584
$$ 23683606 17684911 13332462 10316108 8234115 6747113 5646678 4820660 4164076
12985D164076n09744l95378l25303k65163k14075j68751j34243j18907j00834
$$ 4164076 3654332 3258954 2933651 2668488 2454413 2285662 2151419 2032512 1931678
12976A931678p2244k7592J1343L0935P1569Q5560J05783J40221K18881L10569
$$ 1931678 1859434 1831842 1843185 1874120 1945689 2031249 2137032 2277253 2496134 2806703
12966B806703M25425N96542Q35491J169002J631153K224562K883197L333701L144246
$$ 2806703 3232128 3828670 4664161 5833163 7464316 9688878 12572075 15905776 19050022
12957A9050022J951770p3653k123305l313816l441357k888295k154322j543936
$$ 19050022 21001792 20928139 18804834 15491018 12049661 9161366 7007044 5463108
12949E463108j099207q01295n92724m57552l56663k78030k26404j96230j48282
$$ 5463108 4363901 3562606 2969882 2512330 2155667 1877637 1651233 1455003 1306721
12940A306721j15483j23371j07807q3813o6185p1089n7140n2201l6948k8134l7341
$$ 1306721 1191238 1067867 960060 876247 810062 738973 681833 629632 592684 564550 527209
12929E27209k2076j9411r889J51R437K7582L6373N7641L0315J1364m0007q1830
$$ 527209 505133 485722 475833 475984 485421 513003 549376 607017 637332 648696 608689 526859
12917E26859q0537n7064m5918m2173l4640j3585k875l875j7763j5651p596q573
$$ 526859 446322 389258 343340 301167 266527 252942 250067 246192 228429 212778 205182 196609
12905A96609r257m813n014j0421k0822O630P915l147p764k2035j5647J1853Q73
$$ 196609 187352 182539 177525 167104 146282 152912 160827 157680 149916 127881 112234 124087 124960
12892A24960J1711J4325j0467k110P242j2735j2470J0702L744N845O242j1431
$$ 124960 136671 150996 140529 138419 145661 132926 120456 131158 134902 140747 146989 135558
12880A35558q106n509o988o445j5149j3519n224J6823p109r103O296m733q339
$$ 135558 127452 121943 114955 108510 93361 79842 74618 91441 84332 75229 81525 76792 68453
12867F8453j3314L397K0590P108k24J5345R893q861j9798q459L534m45R787j234
$$ 68453 55139 58536 79126 86234 86010 101355 111248 102387 82589 74130 77664 77219 87006 85772
12853H5772j3411n247Q531J1315j806r363q201p317p435L449L31O949j4007J740
$$ 85772 72361 67114 75645 86960 85154 75791 67590 60273 52838 56287 56618 63567 49560 51300
12839E1300P830N637J1447j4361j6455O941q47m805P578M591j127P780l520K294
$$ 51300 59130 64767 76214 61853 45398 52339 51492 46687 54265 58856 57729 65509 61989 64283
12825F4283p777q457O43K514K713n145j0220p480j0823O354J2877n28n952o646
$$ 64283 56506 48049 48692 51206 53919 48774 38554 31074 20251 26605 39482 38954 33002 26356
12811B6356r793r821J1761O777q112j4091m974J003N06J0034J2837n928l30R697
$$ 26356 16563 6742 18503 25280 17168 3077 -1897 -894 -388 9646 22483 16555 16225 25922
12797B5922q405p675n763J3123M104J3927R318j204q373j4727K340N574j7927
$$ 25922 17517 9842 4079 17202 21306 35233 44551 43347 34974 20247 22587 28161 10234
12784A0234p188J160J341o051r217m279m313M760j149M826J3749J3219k980j4755
$$ 10234 3046 4206 5547 -504 -9721 -14000 -18313 -13553 -14702 -9876 3873 17092 14112 -643
12770f43l376R208r888n512J2466P289L86O923j923j850j484j7854k862N928n676
$$ -643 -4019 5189 -4699 -10211 2255 9544 9930 16853 14930 13080 11596 -6258 -9120 -3192 -8868
12755h868J8034P232k042J3059N421l489L920N563K017L823l480r200o444j4117
$$ -8868 9166 16398 14356 27415 32836 29347 33267 38830 40847 44670 41190 31990 25546 11429
12741A1429j3528P856L389r496J203J5343O657p09n064l283O060J2616J2510j3546
$$ 11429 -2099 5757 9146 -350 853 16196 22853 22144 17080 13797 19857 32473 44983 31437
12727C1437j2233J289P177Q540j2981p807O169K2735J1487k18j4972j2707R465
$$ 31437 19204 20493 27670 36210 23229 15422 21591 44326 55813 55595 40623 27916 37381
12714C7381L314K113n193R61r264l012r636P5R648k841R815r74P556k7p666r920
$$ 37381 40695 42808 37615 38576 29312 26300 16664 16739 26387 23546 33361 32387 39943 39916 32250 22330
12698B2330N383p800j4576l683J3879K525l977o085Q374J7709p478l891k797j994
$$ 22330 27713 19913 5337 1654 15533 18058 14081 7996 16370 34079 26601 22710 19913 17919
12684A7919P089n150K100r836o944J1029m39n24K16J970o55R738m134L073q763
$$ 17919 25008 19858 21958 12122 5178 16207 15768 15244 15460 17430 16775 26513 22379 25452 16689
12669A6689L823l079M396r09j2845j7561p408J4902L742J052L502n25l949M691
$$ 16689 20512 17433 21829 20920 8075 -9486 -16894 -1992 1750 2802 6304 5779 1830 6521
12655F521N977q37j7736p631M681J6241J184r161o078J3441j223j314o07M438
$$ 6521 12498 11661 -6075 -13706 -9025 7216 8400 -761 -6839 6602 5379 4065 3458 7896
12641G896P78Q982k61j0364m5p533k245Q569M948k841r28L271j1837Q790Q30J453
$$ 7896 8674 17656 17395 7031 6986 -547 -2792 5777 10725 7884 6956 10227 -1610 7180 8010 9463
12625I463P651k48l744j78K673J181j7083j3491J2078Q336o808p594m502j750
$$ 9463 17114 16866 13122 12944 15617 16798 -285 -13776 -1698 6638 -170 -7764 -12266 -14016
12611a4016J5883J4412M646n470M757L024N586q552l939J83K686o97J79j253l297
$$ -14016 1867 16279 20925 15455 20212 23236 28822 20270 16331 16514 19200 18503 18682 17429 14132
12596A4132j8691J2805J1494j4281k540M710J0604L704M577O70k989R67J3123
$$ 14132 -4559 8246 19740 5459 2919 7629 18233 21937 26514 27184 24195 25162 38285
12583C8285K6966J4302K266J0374o544j4844r140j9191j1195j979M576n441j1590
$$ 38285 65251 79553 81819 92193 85649 70805 61665 42474 31279 29300 33876 28435 16845
12570A6845n332O356K156j8213j4732J2819J0615J2473N833p509j092J6712k751
$$ 16845 11513 17869 20025 1812 -12920 -101 10514 22987 28820 21311 20219 36931 34180
12557C4180L344l832j1268r729O714P264P334N692R208j0593Q753J6421J2962
$$ 34180 37524 33692 22424 12695 19409 26673 34007 39699 48907 38314 47067 63488 76450
12544G6450O615K7313M5617K4446J7538L581m285l0737o625l9878k6923q821j0734
$$ 76450 83065 110378 155995 180441 197979 201560 197275 166538 159913 120035 93112 84291 73557
12531G3557k2865r678L022M775Q88j0945j9932j1673p074m490J4656l047l637
$$ 73557 50692 41014 44036 48811 49699 38754 18822 7149 75 -4415 10241 7194 3557
12518C557j039j2032K810J7449N640O351m217J2114M00M513K0946R976o257K075
$$ 3557 2518 -9514 -6704 10745 16385 22736 18519 30633 31033 35546 56492 66468 60211 62286
12504F2286m79o277j2946J2346K2351J0901J3198p7j7079k4778j2672R37p609
$$ 62286 61807 55530 42584 54930 77281 88182 101380 101303 84224 59446 46774 47711 40102
12491D0102k1901j3607J652K682K0861l509o108m957j0030K826N958j96K011r455
$$ 40102 18201 4594 6246 8928 29789 26280 20172 15215 5185 8011 13969 13773 15784 6329
12477F329P418r092m438p347n752J0789r73L952l083O99J272j6598l335m68o15
$$ 6329 13747 4655 217 -7130 -12882 -2093 -3066 886 -2197 -1498 -226 -16824 -20159 -20627 -21242
12462b1242K849Q123k551K98Q758N915L585r172j1856j5723k876J5976J3663J6491
$$ -21242 -18393 -10270 -12821 -12523 -3765 2150 5735 -3437 -15293 -31016 -33892 -17916 -4253 12238
12448A2238j0506k2616n285P996l004o968J7561J3295r30N692J5185Q72j5704
$$ 12238 1732 -20884 -26169 -18173 -21177 -28145 -10584 2711 1781 7473 22658 23530 7826
12435G826m999J011O347k177j1468Q704K421n273l976m531j3660l255M075L87
$$ 7826 2827 3838 10185 8008 -3460 5244 7665 2392 -1584 -6115 -19775 -23030 -18955 -18568
12421a8568P718O037J0968K201m667L767r859j1316P517L914l534O448L755L010
$$ -18568 -10850 -4813 6155 8356 3689 7456 -2403 -13719 -6202 -2288 -5822 626 4381 7391
12407G391J0008j1731j0800J3892J011nP340M336R27O822L38j7287m133q646p43
$$ 7391 17399 5668 -5132 8760 9771 9766 17106 21442 22369 29191 29529 12242 8109 -537 -1280
12392a280l570K539j394Q405J1250k023M435N819j1786j0316L615j980l598L177
$$ -1280 -4850 -2311 -3705 4700 15950 13927 18362 24181 12395 2079 5694 3714 116 3293
12378C293L460Q661j0770k715K852R696j6847j5846o170P907q051K699K651q60
$$ 3293 6753 15414 4644 1929 4781 14477 -2370 -18216 -24386 -16479 -24530 -21831 -19180 -20040
12364b0040O903J0832L96P515L451o711N005M832l543K713k120N004o046l551
$$ -20040 -13137 -2305 -1909 5606 9057 2346 7351 12183 8640 11353 9233 14237 8191 4640
12350D640P615N363J175j7965j7202J4681L409M569p639j2692l049j608J1343
$$ 4640 12255 17618 18793 828 -16374 -1693 1716 6285 -1354 -14046 -17095 -18703 -7360
12337g360J0965M298k8037k797J4065J2269J0310L51o487r48L909r286m427j1117
$$ -7360 3605 7903 -20134 -22931 -8866 3403 13713 14064 7577 6629 10538 1252 -3175 -14292
12323a4292p233Q913L398L485Q72O886O377R838l676j7345q608L191J4090P851
$$ -14292 -21525 -12612 -9214 -5729 -4857 2029 8406 18244 14568 -2777 -11385 -8194 5896 13747
12309A3747j0449k770K289m604k98m88J7300r909k722J1120N608o334k2478J805
$$ 13747 3298 528 2817 -1787 -2085 -2573 14727 4818 2096 13216 18824 12490 -9988 -8183
12295h183O450m144j2473Q34J450J2241J1934P94j924o341p236P6M641j2615o560
$$ -8183 -1733 -5877 -18350 -17516 -16066 -3825 8109 8903 6979 638 -6598 -6522 -1881 -14496 -21056
12280b1056O637Q860R317K55J3761l322j7338P43P353R718l589j1990q510J1958
$$ -21056 -14419 -5559 3758 4013 17774 14452 -2886 -2143 5210 14928 11339 -651 -9161 2797
12266B797P283j4666r877J0196K9600J286j8375k269j0892j388K3959m772r993
$$ 2797 10080 -4586 -14463 -4267 25333 26619 8244 5975 -4917 -6305 17654 12882 2889
12253B889p665k620k995j474k563j734J7837R549r145o379J3894Q684l255p448
$$ 2889 -4776 -7396 -10391 -11865 -14428 -16162 1675 11224 2079 -4300 9594 18278 15023 7575
12239G575p506J91O736O467L767k683n5J633j8059j5052L900J4299R845J7009
$$ 7575 69 260 6996 13463 17230 14547 14492 16125 -1934 -16986 -13086 1213 11058 28067
12225B8067j2746j7666l066m404k417j068j938q755l155J5309J4044o895o451
$$ 28067 15321 -2345 -5411 -9815 -12232 -13300 -15238 -23993 -27148 -11839 2205 -4690 -11141
12212a1141L518k760R572J2824p20k1539j348M035j3880J955P131o006K358N767
$$ -11141 -7623 -10383 -811 12013 11293 -10246 -11594 -7559 -21439 -19484 -12353 -18359 -16001 -10234
12198a0234L810N21O419R781j5956j2050P470M150n827L571O532J323m919R90
$$ -10234 -6424 -5903 516 10297 -5659 -17709 -10239 -6089 -11916 -8345 -1813 -490 -5409 -4419
12184d419j6170K545L605K021K353M474o587k595M127r690O79N286J7896M250
$$ -4419 -20589 -18044 -14439 -12418 -10065 -5591 -12178 -14773 -10646 -20336 -19657 -14371 3525 7775
12170G775n260m859k521J189O782M053L267q140Q519J572Q82p92j828Q549m945
$$ 7775 2515 -2344 -4865 -3676 3106 7159 10426 2286 10805 12377 13259 12467 10639 19188 14243
12155A4243o84l098j0386K792L003K291J0841J5955j42k3197j6188J801L451L479
$$ 14243 13559 10461 75 2867 5870 8161 19002 34957 34815 11618 -4570 -2769 682 4161
12141D161J759j3789j6656l436K6503J846j3923R529J529o541p11J183J3581J1934
$$ 4161 5920 -7869 -24525 -27961 -1458 388 -13535 -4006 -2477 -9018 -9729 -8546 5035 16969
12127A6969R077R015Q462J8762J5735j4545k0361p988j6940k2106j3015l734L330
$$ 16969 26046 35061 43523 62285 78020 63475 43114 35126 18186 -3920 -16935 -20669 -17339
12114a7339K1072P759n886J1429N058o917q860m085K892Q704o192k074k146J206
$$ -17339 3733 11492 5606 17035 22093 15176 6316 2231 5123 13827 7635 5561 3415 4621
12100D621Q897J0243J2219J6306R378J2172K0508K792k2114j2598j1908j4892
$$ 4621 13518 23761 35980 52286 61664 73836 94344 97136 75022 62424 50516 35624
12088C5624N668J320O024q844R24J943J0313K989j2462k1704p117m841l342J927
$$ 35624 41292 42612 48636 39792 40716 42659 52972 55961 43499 21795 14678 9837 6495 8422
12074H422l403K337K627J1708n68K548O722J114N533m481r05K0155L0754N513
$$ 8422 5019 7356 9983 21691 21123 23671 30393 31507 37040 32559 31654 51809 82563 88076
12060H8076j5614r823j6042j3737n513q593j710j3840j5579j0361k371J457Q965
$$ 88076 72462 62639 46597 32860 27347 18754 17044 3204 -12375 -22736 -25107 -23650 -14685
12047a4685L179l769M414R532j614j6295J066J1924J0814q07j3961n870l176Q77
$$ -14685 -11506 -15275 -10861 -1329 -2943 -19238 -18172 -6248 4566 3759 -10202 -16072 -19248 -18371
12033a8371J437m507l354O999L376r802J6528J3945P049l193r263j2878m142J5704
$$ -18371 -16934 -21441 -24795 -17796 -14420 -24222 -7694 6251 13300 10107 844 -12034 -16176 -472
12019d72Q760j0456j1242J55l183J8394M573j4583n874r72l247N263J3848Q248
$$ -472 8288 -2168 -13410 -13255 -16438 1956 6529 -8054 -13928 -14900 -18147 -12884 964 9212
12005I212Q802m867r208q832o190n690L461N611J3364k821q975p445o085k526
$$ 9212 18014 13147 3939 -4893 -11083 -16773 -13312 -7701 5663 2842 -6133 -13578 -19663 -22189
11991b2189O859m340n663N230Q853J6935r179r969J4937O062K021l151o523p135
$$ -22189 -15330 -19670 -25333 -20103 -11250 5685 -3494 -13463 1474 7536 9557 6406 -117 -7252
11977g252J637L018M589o285p867q346j3317o758J1937m965P823j122M544M810
$$ -7252 -5615 -2597 1992 -4293 -12160 -20506 -33823 -40581 -28644 -33609 -25786 -26908 -22364 -17554
11963a7554N725J6119m115j5332r71l534l991n74J980M54m324K22P443J2514L288
$$ -17554 -11829 4290 175 -15157 -16128 -19662 -23653 -24227 -22247 -21793 -26117 -25895 -18452 -5938 -2650
11948b650P237Q372k001j5018j5403k863R393K919l664j0766J0485L693P15k948
$$ -2650 4587 12959 10958 -4060 -19463 -22326 -12933 -10014 -13678 -24444 -13959 -10266 -9551 -12499
11934a2499n431n927P263J4504N541N286o921j2427O254L604l615J1909L042j0400
$$ -12499 -17930 -23857 -16594 -2090 3451 8737 1816 -10611 -4357 -753 -4368 7541 10583 183
11920A83n633j190m072m830L739J3544O48j1329j6474m203l828J3544J2154N86
$$ 183 -5450 -6640 -10712 -15542 -11803 1741 2389 -8940 -25414 -29617 -33445 -19901 -7747 -7161
11906g161m320j2746k016j317o263p37J2592R738n727J29Q702J4099q873K181
$$ -7161 -11481 -24227 -26243 -27560 -33823 -34560 -21968 -12230 -17957 -17828 -9126 4973 -3900 -1719
11892a719n181m125O748M480P4n465Q312q11j3388p778l191J7464R520O176p060
$$ -1719 -6900 -11025 -4277 203 277 -5188 3124 2313 -11075 -18853 -22044 -4580 4940 11116 4056
11877D056o960j684Q11n345k092o476K751N615K798O515K335J456j277j704J1400
$$ 4056 -2904 -4588 -3777 -9122 -11214 -17690 -14939 -9324 -6526 -11 2324 3780 2503 799 12199
11862A2199n234j0294J6962R211o430k1733j4839k247K1086J7906M569o000j4115
$$ 12199 6965 -3329 13633 22844 16414 -5319 -20158 -22405 -1319 16587 21156 15156 1041
11849A041N35k488l68r565O717J0762j612o806r318J329r232O366N08K3L557O315
$$ 1041 1576 -912 -1280 -10845 -4128 6634 5022 -1784 -11102 -9773 -19005 -12639 -12131 -12108 -8551 -2236
11833b236Q944K582j7119l155J0185M477N755P319J3699K0315J9261J4640j4968
$$ -2236 6708 9290 -7829 -10984 -799 3678 9433 16752 30451 50766 70027 84667 69699
11820F9699k1353p337k2025q896J8283m497o587K445n227L71j0279j8207L71L570
$$ 69699 48346 41009 18984 10088 28371 23874 17287 19732 14505 14876 4597 -13610 -13239 -9669
11806i669J1107L827K055N711N166J3952R540k758l729j3489k0229j0412J8347
$$ -9669 1438 5265 7320 13031 18197 32149 41689 38931 35202 21713 1484 -8928 9419
11793I419J3222J1282K9657J7741O680l127n106o813m639j3943m0877r997m64
$$ 9419 22641 33923 63580 81321 88001 84874 79768 72955 68316 54373 13496 3499 3035
11780C035K949L987m302q245k516q608q60M358n710j1190J1499j347Q343J1261
$$ 3035 5984 9971 5669 -2576 -5092 -13700 -14560 -10202 -15912 -27102 -15603 -16950 -8607 2654
11766B654J1421M82J004J4637J8004M498k227L482j357l828m473k3963k0402j2909
$$ 2654 14075 14557 15561 30198 48202 52700 50473 53955 52598 48770 44297 20334 -68 -12977
11752a2977Q22J0755L394L141L000J381k911p022k070N673p894j206M204j0461
$$ -12977 -12155 -1400 1994 5135 8135 9516 6605 -417 -2487 3186 -4708 -5914 -1710 -12171
11738a2171L920O24M779M298l183L499R6j419j0462n208R536K243n509k406J774
$$ -12171 -8251 -7627 -2848 1450 -1733 1766 1862 443 -10019 -15227 -5691 -3448 -8957 -11363 -9589
11723i589K330L397k05r220j099k564R788j641M510l084q528M074K1416J3225
$$ -9589 -7259 -3862 -4067 -13287 -14386 -16950 -7162 -8803 -4293 -7377 -15905 -11831 9585 22810
11709B2810j5712k2864j696J2573J935k610r38R462J1340J3871j1569j8090j1995
$$ 22810 7098 -15766 -17462 -4889 -2954 -5564 -6502 2960 14300 28171 16602 -1488 -13483
11696a3483L308l327M93j0705l125K3269J0009n116o700J6209J2294k589m461
$$ -13483 -10175 -13502 -13009 -23714 -26839 -3570 6439 1323 -5377 10832 23126 20537 16076
11683A6076j1726j5689n696J4557P781K991j845j4136q304j1198m192O948J490
$$ 16076 4350 -11339 -17035 -2478 5303 8294 6449 -7687 -15991 -27189 -31381 -24433 -22943
11670b2943N158Q675M387R0p556o321M290P383n62O980q64K681j3773r10O62J185
$$ -22943 -17785 -9110 -4723 -4633 -12189 -18510 -14220 -6837 -7399 -419 -1283 1398 -12375 -13285 -12623 -11438
11654a1438M406J1291j164k288Q927j1240p286l248k905j9853L627J333N854J3315
$$ -11438 -7032 4259 3095 807 9734 -1506 -8792 -12040 -14945 -34798 -31171 -29838 -23984 -10669
11640a0669j0278p195R849J0282j637j8629J3171J3243o43M280r628k2165N933
$$ -10669 -20947 -28142 -18293 -8011 -9648 -28277 -15106 -1863 -2506 1774 -7854 -30019 -24086
11627b4086J6820m139J1527M647l029P814N967l232k796j0343j3570j2934k096
$$ -24086 -7266 -11405 122 4769 1740 9554 15521 12289 9493 -850 -14420 -27354 -29450
11614b9450R743J6874l583j4455p454Q553N979K258k157k926m110N236m302K2939
$$ -29450 -19707 -2833 -6416 -20871 -28325 -19772 -13793 -11535 -13692 -16618 -20728 -15492 -19794 3145
11600C145k260j2445k733L942p332o179j0487L702L761l715j2505K818J4232n200
$$ 3145 885 -11560 -14293 -10351 -17683 -23862 -34349 -30647 -26886 -30601 -43106 -40288 -26056 -31256
11586c1256o394N559r850L478J3397M202J737J4730J939k798j2511j782L886o256
$$ -31256 -37650 -32091 -41941 -38463 -25066 -20864 -19127 -4397 -2458 -5256 -17767 -19549 -15663 -21919
11572b1919J53Q174Q598P925o449n852J3884Q17j4317q684m354J0018N915J2063
$$ -21919 -21766 -13592 -4994 2931 -3518 -9370 4514 5331 -8986 -17670 -22024 -12006 -6091 5972
11558E972n438l178N690J851m077J0330Q499L501j4658k4520m647R923L141m01
$$ 5972 534 -2644 3046 4897 820 11150 19649 23150 8492 -16028 -20675 -10752 -7611 -8012
11544h012o445q921M793J0460N013J6251j391o651p657j433J062k392q703j3956
$$ -8012 -14457 -23378 -18585 -8125 -3112 13139 11748 5097 -2560 -3993 -2931 -5323 -14026 -27982
11530b7982j660M522L605j592J0512Q184K223n380j1789K440j45p82l168m243
$$ -27982 -29642 -25120 -21515 -23107 -12595 -4411 -2188 -7568 -19357 -16917 -17062 -17844 -21012 -25255
11516b5255L979j3185l176p941J0550J2702M787L40l9j914m160L138o423p124
$$ -25255 -21276 -34461 -37637 -45578 -35028 -22326 -17539 -17199 -17238 -19152 -23312 -20174 -26597 -33721
11502c3721L69M423K2032o64O30P424j0351j0618j2689J950J2804J9003j486j334
$$ -33721 -33352 -28929 -6897 -7561 -6931 493 -9858 -20476 -33165 -31215 -18411 592 -894 -2228
11488b228l539j1316j175R007Q44r470J875N612j470O300p08m113m809j5952p313
$$ -2228 -5767 -17083 -18258 -9251 -8407 -17877 -16002 -10390 -11860 -5560 -6268 -10381 -15190 -31142 -38455
11473c8455K284N664J4574N967q447K277N132k886J636n600R416J0513K229J666
$$ -38455 -36171 -30507 -15933 -9966 -18413 -16136 -11004 -13890 -12254 -17854 -8438 2075 4304 5970
11459E970j4672l243o595K566o145o250J0915N332o977q037p724K592J2317J0806
$$ 5970 -8702 -11945 -18540 -15974 -22119 -28369 -17454 -12122 -19099 -27136 -34860 -32268 -19951 -9145
11445i145m534n733p830q452J3918R950L13O881J3798N780k244r349K590P929
$$ -9145 -13679 -19412 -27242 -35694 -21776 -11826 -11513 -4632 9166 14946 12702 3353 5943 13872
11431A3872P588j3471l803K814J0909J6107j1904j8365j0348R79n210J3934J0197
$$ 13872 21460 7989 4186 7000 17909 34016 22112 3747 -6601 -5622 -10832 3102 13299
11418A3299N32j4165j1634M601M825p121n377n903K317L974j1003M89K0404J8200
$$ 13299 13831 -334 -11968 -7367 -2542 -9663 -15040 -20943 -18626 -14652 -25655 -25166 -4762 13438
11404A3438k800j1561j7322M260M462K027R78L465L120Q86j0867j830J6966o043
$$ 13438 10638 -923 -18245 -13985 -9523 -7496 -6518 -3053 67 953 -9914 -11744 5222 -821
11390h21j0669P247o75R312p757j1156O844p740p818l548N516P096j3849L688
$$ -821 -11490 -4243 -4918 4394 -3363 -14519 -7675 -15415 -23233 -26781 -21265 -14169 -28018 -24330
11376b4330O57N565l390k416J1806N175j6742l653j5432l564K6521J1201p027
$$ -24330 -23673 -18108 -21498 -23914 -12108 -6933 -23675 -27328 -42760 -46324 -19803 -8602 -15629
11363a5629L804J7799n472J042K248j0388j3921j4270J1390J950K784J710L087
$$ -15629 -11825 5974 502 1544 3792 -6596 -20517 -34787 -23397 -21447 -18663 -16953 -13866
11350a3866J0792m149K931o057n148O940k049M363L434K768j0204l283p696q506
$$ -13866 -3074 -7223 -4292 -10349 -15497 -8557 -10606 -6243 -2809 -41 -10245 -13528 -21224 -29730
11336b9730O212M548O525J5025k586l995k711p950O982J531m647r04M818j1904
$$ -29730 -23518 -18970 -12445 2580 -6 -4001 -6712 -14662 -7680 -6149 -10796 -11700 -6882 -18786
11322a8786j2616j763K7312K0516j4434o451p785j380Q145j038n087P24p195q486
$$ -18786 -31402 -33165 -5853 14663 229 -6222 -14007 -15387 -7242 -8280 -13367 -12643 -19838 -28324
11308b8324p705J0715k571n214J0079O603l511M835J5027j497j1415j1872N82
$$ -28324 -36029 -25314 -27885 -33099 -23020 -16417 -19928 -15093 -66 -1563 -12978 -24850 -24268
11295b4268J4944n929r309O254J2686Q686O318M30m007k416r41l375j1869p424
$$ -24268 -9324 -15253 -24562 -18308 -5622 3064 9382 9812 5805 3389 2448 -927 -12796 -20220
11281b0220O224K1074J944j0259p629J393k0324R47J5809O354K206r47j818Q88
$$ -20220 -13996 7078 9022 -1237 -8866 -7473 -27797 -26850 -11041 -4687 -2481 -3428 -5246 -4358
11267d358L224K160J0541O89j0221Q955l521j923N122Q235J1567K554L488K0074
$$ -4358 -1134 1026 11567 12256 2035 10990 7469 5546 10668 18903 30470 33024 36512 56586
11253E6586L6183N6974R8004J41564J22959O1965k6068j06986j45681j28669p8008
$$ 56586 92769 149743 247747 389311 512270 574235 548167 441181 295500 166831 88823
11242H8823k0195j5558n007n370K757p095j1545N448O587j3311k29n512O854J751
$$ 88823 68628 53070 48063 42693 45450 38355 26810 32258 38845 25534 25305 19793 26647 28398
11228B8398l292j0609n356n464l316o63q865q756K15J0564N399n758j9771O286
$$ 28398 25106 14497 9141 3677 361 -302 -9167 -17923 -17708 -7144 -1745 -7503 -27274 -20988
11214b0988K2072K525o463o200J800L341n971j0731K336K2960J7861l095O20j4878
$$ -20988 1084 3609 -2854 -9054 -7254 -3913 -9884 -20615 -18279 4681 22542 19447 20067 5189
11200E189q1K23J359K269m316j5765l405k096O072J3154Q013N356q140P171j4387
$$ 5189 5108 5331 6690 8959 4643 -11122 -14527 -16623 -10551 2603 10616 15972 7832 15003 616
11185F16k0578j3398Q449R316J3682k160L182j064j8107J174J4327J2327L092
$$ 616 -19962 -33360 -24911 -15595 -1913 -4073 -891 -1955 -20062 -18888 -4561 7766 10858
11172A0858K175J5864q538j8417r184J1083k797o167m447p423j8822l357P478
$$ 10858 13033 28897 20359 1942 -7242 3841 1044 -5123 -9570 -16993 -35815 -39172 -31694
11159c1694K2088L415Q159J273n090Q525j879p404j804O041p970k379M876N198
$$ -31694 -9606 -6191 1968 3241 -1849 6676 4797 -2607 -4411 1630 -6340 -8719 -3843 1355
11145A355O299O941j7982l295L592J2972K2904R562j0479K984m682m287J7551
$$ 1355 7654 14595 -3387 -6682 -3090 9882 32786 42348 31869 34853 30171 25884 43435
11132D3435J070J0660M7833P7021J08055J47368R0303P603l9398j06113j29495
$$ 43435 44505 55165 102998 180019 288074 435442 525745 533348 493950 387837 258342
11121B58342q5022n3608l5744r008j2716j3844p947P372l020k77j4968o586J299
$$ 258342 173320 119712 83968 74960 62244 48400 40453 47825 44805 44528 29560 22974 24273
11108B4273r688j3538L25J5657L294j6157j5984j3397m605M518J5250J2410J3356
$$ 24273 14585 1047 1372 17029 20323 4166 -11818 -25215 -29820 -25302 -10052 2358 15714
11095A5714j0361n683k294J408J3291n756q104l901L565m590Q09q10K617O193
$$ 15714 5353 -330 -2624 -1216 12075 6319 -1785 -5686 -2121 -6711 -5902 -6712 -4095 2098
11081B098L42k805j4796j712k305L92l338p424M438K335N659R678K484k993L428
$$ 2098 2440 -365 -15161 -16873 -19178 -18786 -22124 -29548 -25110 -22775 -17116 -7438 -4954 -7947 -4519
11066d519L713j0201J700J3292k242n432P388J0051r514N658M77k98q218j7431
$$ -4519 -806 -11007 -9307 3985 1743 -3689 3699 13750 4236 9894 10371 10073 1855 -15576
11052a5576J089P814J3968J581m717M384k677o070k974j643n875p799j907l216
$$ -15576 -14487 -6673 7295 8876 4159 8543 5866 -204 -3178 -4821 -10696 -18495 -20402 -23618
11038b3618j391Q176q21J0257Q778P812l635o265k255r034p737P864O702p369
$$ -23618 -25009 -16833 -17654 -7397 1381 9193 5558 -707 -2962 -11996 -19733 -11869 -5167 -12536
11024a2536j0470L906L787M950j0522M165P621R95L931K387r930N063K478O772
$$ -12536 -23006 -19100 -15313 -10363 -20885 -16720 -9099 -8104 -4173 -1786 -11716 -6653 -4175 2597
11010B597L129j0737k25m237K416m894K064K008J442k240J255m230o484l554N582
$$ 2597 5726 -5011 -5236 -9473 -7057 -11951 -9887 -7879 -6437 -8677 -7422 -11652 -18136 -21690 -16108
10995a6108N88R00N947K953q595q411J44L415J0157m826n695r908r38K052P515
$$ -16108 -15520 -14620 -8673 -5720 -14315 -22726 -22582 -19167 -9010 -13836 -19531 -29439 -30377 -28325 -20810
10980b0810J2041N725p989N461K884l26l696M278L545O907R238r767k620J256
$$ -20810 -8769 -3044 -11033 -5572 -2688 -3014 -6710 -2432 1113 8020 17258 7491 4871 6127
10966F127M429N107O849r316p765o347M917Q841R400k178l33L4j1926J594K0501
$$ 6127 10556 15663 22512 13196 5431 -916 4001 12842 22242 20064 19731 19765 7839 9433 29934
10951B9934J8610m598q90K555M618J0854n321o28J5105j6834k7732p203k96O103
$$ 29934 48544 43946 43056 45611 50229 61083 55762 55134 70239 53405 25673 18470 18174 24277
10937B4277l604p72p652p968k816o73k89j121R020M863m038p378m950j669L06
$$ 24277 20673 19901 12249 4281 1465 792 503 -618 8402 13265 9227 1849 -3101 -4770 -4464
10922d464N250Q467K1111n125j4173l0600o692J9804J8530N225J0823o63l6J116
$$ -4464 786 9253 30364 25239 11066 -19534 -26226 -6422 12108 17333 28156 27493 27457 28573
10908B8573J5068P251o820p083K1765K1740K2141K2922J5165j2593j0929N982
$$ 28573 43641 50892 44072 36989 58754 80494 102635 125557 140722 128129 117200 123182
10896A23182j281j2498k0836j9909K117N216p538j7692r691j7177J1515q348o753
$$ 123182 121901 109403 88567 68658 70775 75991 68453 50761 41070 23893 35408 27060 20307
10883B0307j2888m393J3413l60O17J855j1353J0243J4481j3211o252M039j1140
$$ 20307 7419 3026 16439 16079 16696 18551 7198 17441 31922 18711 12459 16498 5358
10870E358r592J1441L356k603j6926P784J1406K479p312k497J083J0348J073k4
$$ 5358 -4234 7207 10563 7960 -8966 -1182 10224 12703 5391 2894 3977 14325 15398 15374
10856A5374K2289K1918J7189L4919M710q493q844j8277k7314j6231j0033j1075
$$ 15374 37663 59581 76770 111689 116399 107906 99062 80785 53471 37240 27207 16132
10844A6132j5091l603l58k358j2368J1861N458K389R588K495j086J0575k945q778
$$ 16132 1041 -2562 -2920 -5278 -17646 -5785 -327 2062 11650 14145 13059 23634 20689 11911
10830A1911p221j4904l554J4166l533j028M796M152j938j1456n422N233J064o350
$$ 11911 4690 -10214 -13768 398 -3135 -4163 633 4785 2847 -8609 -14031 -8798 -7734 -14084
10816a4084O746J3275J3856J510o918j6667j048J0918l003r781j5450P565n220
$$ -14084 -7338 5937 19793 21303 14385 -2282 -3330 7588 4585 -5196 -20646 -13081 -18301
10803a8301J70o788R120J0646k727l335j140j09j431J5487M530j2996n000K308
$$ -18301 -18131 -24919 -15799 -5153 -7880 -11215 -12355 -12464 -13895 1592 6122 -6874 -11874 -9566
10789i566J4497P215O201O348j3247l419J2458J1646k462o585N742l741j3248
$$ -9566 4931 12146 18347 24695 11448 8029 20487 32133 29671 23086 28828 25087 11839
10776A1839n014K2970o006j0534o047l939l108K162m710q656J3894J1391r18j3159
$$ 11839 6825 29795 23789 13255 7208 3269 161 2323 -2387 -11043 2851 14242 13324 165
10762A65p698P08K186O556K130k358R618J3175J333n033m558o031k432N810R044
$$ 165 -7533 -6825 -4639 1917 4047 1689 11307 24482 25815 20782 16224 10193 7761 13571 22615
10747B2615p068j0484n735J2104K3178J07o346N81j979o772p091J4632l91o553
$$ 22615 15547 5063 -672 11432 34610 34717 28371 28952 26973 20201 13110 27742 27351 20798
10733B0798j0364L26k522k348j829p919l319q3r049m89J5945K0839N663K20l11
$$ 20798 10434 10760 8238 5890 4061 -3858 -7177 -7260 -16309 -16798 -853 19986 25649 25869 25558
10718B5558j2306j0045J0476R842j4785n053J1684o863j573j125p51R258l904
$$ 25558 13252 3207 13683 23525 8740 3687 15371 8508 6935 5810 5059 14317 10413
10705A0413k989o402O846l740R47R335j4787m672N636M405j1001J1120K0855L316
$$ 10413 7424 1022 7868 4128 5075 14410 -377 -5049 587 4992 -6009 5111 25966 29282
10691B9282n143j706j342O82j515n343M970O471q396q746M776J183L788r153n910
$$ 29282 24139 22433 21091 21773 20258 14915 19885 26356 17960 9214 13990 15173 18961 9808 3898
10676C898k758Q203J1925L904o301j5258m498j3099p2P945J0545o157j2667q566
$$ 3898 1140 9343 21268 25172 18871 3613 -885 -13984 -14056 -6111 4434 -1723 -14390 -22956
10662b2956M762k539J1399R577Q963Q399M008M018J1732k974m008Q893L462n081
$$ -22956 -18194 -20733 -9334 243 9206 17605 21613 25631 37363 34389 30381 39274 42736 37655
10648C7655j0352n501K58o563r735J0333M635m345o008K397L780q263j0348l945
$$ 37655 27303 21802 22060 15497 5762 16095 20730 16385 10377 12774 16554 8291 -2057 -6002
10634f002K1000J3041j1857m252J3488n709l819l846P198l269j1057J2076P936
$$ -6002 14998 28039 16182 11930 25418 19709 15890 12044 19242 15973 4916 16992 24928
10621B4928M473r20Q22L728J7205Q778P970J1425Q216K743J7128J1186J919m286
$$ 24928 29401 28481 29303 33031 50236 59014 66984 78409 86625 89368 106496 117682 119601 115315
10607A15315m472J3014K2340K212K992J2075L497K2275M0267M7595N6879Q9028
$$ 115315 110843 123857 146197 148409 151401 163476 166973 189248 229515 277110 333989 423017
10595D23017J36466J73622J88889J62453J43827M8768l8790j16292j72648j80879
$$ 423017 559483 733105 921994 1084447 1228274 1277042 1238252 1121960 949312 768433
10585G68433j68948j06344p6532q5804o0511m4002k7756j6183O268o512J650K327
$$ 768433 599485 493141 416609 330805 270294 226292 198536 182353 188621 182109 183759 186086
10573A86086o276n527L635J0204j1209n221J1330J0217O785J9155J8712J1739
$$ 186086 179810 174283 177918 188122 176913 171692 183022 193239 200024 219179 237891 249630
10561B49630o425K904J9690J8412R447K1838K3641M5113L7460K8207N6168Q6933
$$ 249630 243205 246109 265799 284211 293658 315496 339137 384250 421710 449917 506085 593018
10549E93018J01120J19827J48416J71909J61230J34719J60152J84584K39797L34210
$$ 593018 694138 813965 962381 1134290 1295520 1430239 1590391 1774975 2014772 2348982
10539B348982M81773P26219J080022J530831K024229K418538K473271K025124
$$ 2348982 2830755 3556974 4636996 6167827 8192056 10610594 13083865 15108989
10531A5108989J117015m8100j154829j961554k298993k187897j849343j413918
$$ 15108989 16226004 16177904 15023075 13061521 10762528 8574631 6725288 5311370
10523E311370j035809p61357n39229l79662k78861k05998j58458j32848j12937
$$ 5311370 4275561 3514204 2974975 2595313 2316452 2110454 1951996 1819148 1706211
10514A706211p3261o5375o5801m9003k0103J2500L7219R5317J59159K35117L18736
$$ 1706211 1632950 1567575 1501774 1452771 1432668 1445168 1482387 1577704 1736863 1971980 2290716
10503B290716M53791N82346O39809O49176N21970L44933J75714J59794L45339
$$ 2290716 2744507 3326853 3966662 4615838 5137808 5482741 5658455 5818249 6163588
10494F163588P14660J292850K078290K985499L793669M147916L652444K229115
$$ 6163588 6878248 8171098 10249388 13234887 17028556 21176472 24828916 27058031
10486B7058031K94254j524211k654793k879188k352514j528611q58505p19876
$$ 27058031 27352285 25828074 23173281 20294093 17941579 16412968 15554463 14834587
10478A4834587j079338j599751j874339j797752j437683r75006n31481k11705
$$ 14834587 13755249 12155498 10281159 8483407 7045724 6070718 5539237 5327532
10470E327532l7168O22j20025l73113n80844o41540n75359m65330l24345k21531
$$ 5327532 5290364 5290986 5170961 4797848 4217004 3575464 3000105 2534775 2210430 1988899
10460A988899j46890p6624j9766K7972P5319J11556J41460J72465J68493J71970
$$ 1988899 1842009 1765385 1745619 1773591 1848910 1960466 2101926 2274391 2442884 2614854
10450B614854J97520K51979L73862N44007Q07321J192467J741169K345926K940771
$$ 2614854 2812374 3064353 3438215 3982222 4789543 5982010 7723179 10069105 13009876
10441A3009876L205795K850320J781052K14753j391643k585705l099231k992998
$$ 13009876 16215671 19065991 20847043 21061796 19670153 17084448 13985217 10992219
10433A0992219k498664j916227j383910r65625o89851n00090l76920k60960k40570
$$ 10992219 8493555 6577328 5193418 4227793 3537942 3037852 2660932 2399972 2159402
10424B159402k71702k28331k10259j89439j57175j24041j30687r3413m8308m8760
$$ 2159402 1887700 1659369 1449110 1259671 1102496 978455 847768 754355 706047 657287
10414F57287o2576o9503n5210k5383j5514k2133l6404k1687k4217j9749j3230
$$ 657287 594711 525208 469998 444615 429101 406968 370564 348877 324660 304911 291681
10403B91681M757L47p29j4016j5362o851q108j2818q809k384o316m276o093J636
$$ 291681 296438 296785 296056 282040 266678 259827 251719 238901 230092 227708 221392 217116 211023 212659
10389B12659j4389p510k2996q303P499l4M700J12k7078n037K5527N987k177J5594
$$ 212659 198270 190760 167764 159461 166960 166926 171626 171738 144660 139623 165150 171137 168960 184554
10375A84554K1102J0659r787j8737j6932k740k6786j6572k08l905o545K763L116
$$ 184554 205656 216315 206528 187791 170859 168119 141333 124761 124553 120648 114103 116866 119982
10362A19982J9569J6509J8776k222j1633l2147j4322L385R371q219j1734O555
$$ 119982 139551 156060 174836 172614 160981 128834 114512 117897 127268 119049 107315 113870
10350A13870j7195j9071j6359j0346k733L478J2196M828J0268J5213n275j0717
$$ 113870 96675 77604 61245 50899 48166 51644 63840 68668 78936 94149 88874 78157
10338G8157j987l786l114o886r50r66j616k807j0320q63J0834R334M614M31L055
$$ 78157 76170 72384 69270 62384 61434 60468 58852 56045 45725 44862 55696 65030 69644 70075 73130
10323G3130K658m574J9835P698l630r060l65j94j5815j3840p094k1736J039K7106
$$ 73130 75788 71214 91049 98747 95117 86057 85692 85498 69683 55843 48749 27013 28052 55158
10309E5158J0774j1J1772K1907L5089J8339N915M9767J09407J17245N4243l0357
$$ 55158 65932 65921 77693 99600 134689 153028 158943 208710 318117 435362 489605 459248
10297D59248p3072n1357k6843m6924l8403k1577k6734j9241j0022o46J400L70
$$ 459248 386176 334819 307976 261052 222649 201072 174338 155097 145075 144429 145829 146199
10285A46199J8257J6818r261j5105o365r305o426q99N309q85J1498m277K569O811
$$ 146199 164456 181274 172013 156908 150543 141238 134812 133913 139222 138337 149835 145558 148127 154938
10271A54938l642j014O189n35J53J4574R626j920J2481R209R875m192n670J3829
$$ 154938 151296 150282 156471 155936 156089 170663 180289 178369 190850 200059 209934 205742 200072 213901
10257B13901J3091m69n466O424L766J0859l500J1025O838J3221k746j0805M527
$$ 213901 226992 226523 221057 227481 231247 242106 238606 249631 256469 269690 266944 256139 260666
10244B60666J1902J1801J4192K2063K964r398L088J6181P308L240O475K0777J8747
$$ 260666 272568 284369 298561 320624 323588 314190 317278 333459 340767 344007 350482 371259 390006
10231C90006J1799K104K4383K4470K9382M8566L7399M8012M0162K2639K8019N7697
$$ 390006 401805 403909 428292 452762 482144 530710 568109 616121 656283 678922 706941 764638
10219G64638P6809N7720L3472J1942J2045J6028K1695N7980O0318O8299Q3727
$$ 764638 841447 899167 932639 944581 956626 972654 994349 1052329 1112647 1180946 1264673
10208A264673R4762R6660J18639J24051J42586J86993K17785K32231K23632J88373
$$ 1264673 1359435 1456095 1574734 1698785 1841371 2028364 2246149 2478380 2702012 2890385
10198B890385K15292K89063L63471M42494N23478O60854Q41005J014448J129755
$$ 2890385 3105677 3394740 3758211 4200705 4724183 5385037 6226042 7240490 8370245
10189H370245J086458R49822R51915J355133K105335K959472L483331L513191
$$ 8370245 9456703 10406525 11358440 12713573 14818908 17778380 21261711 24774902
10181B4774902L999064O141127J0302028J7106043K8498927M6542851O8597715
$$ 24774902 28773966 34915093 45217121 62323164 90822091 137364942 205962657
10174B05962657P8212661M8258830j8718193o9660067p3710108n3846086l4615965
$$ 205962657 284175318 332434148 313715955 244055888 170345780 116499694 81883729
10167H1883729k1953804j4304301r764673p042592n291521l960139k873940k032229
$$ 81883729 59929925 45625624 35860951 28818359 23526838 19566699 16692759 14660530
10159A4660530j363812q93089o77696p64912r66577j058906j025319r41528q36649
$$ 14660530 13296718 12403629 11725933 10961021 9994444 8935538 7910219 6968691 6132042
10150F132042p08001n88868m80793m14588l29688k77292k63649k41768k01187
$$ 6132042 5424041 4835173 4354380 3939792 3610104 3332812 3069163 2827395 2626208
10141B626208j65425j53923j34580j12507j14669q0543p6386q0744r8130r7922
$$ 2626208 2460783 2306860 2172280 2059773 1945104 1864561 1788175 1707431 1609301 1511379
10131A511379r5324r7334r2604q3413n4356k8438k0122j2937k1180k3520j9648
$$ 1511379 1416055 1318721 1226117 1142704 1088348 1059910 1039788 1026851 1005671 982151 962503
10120I62503k763O02o423j0071o385l381k2752j5116q224q348j5256j795P593
$$ 962503 959740 960342 953919 943848 937463 934082 911330 896214 887990 879642 864386 862591 870184
10107H70184J9552l326j8144k3111m8703m6665n4857m6082l8046l7521j9874j487
$$ 870184 889736 886410 868266 845155 796452 749787 694930 648848 610802 573281 553407 551920
10095E51920j1246r916j8729l4227j6795r54j951M116j581j9434k5042k8201j9347
$$ 551920 540674 530758 512029 477802 461007 460053 458102 462218 460637 441203 416161 387960 368613
10082C68613n488J5358J42P34p545M125q681M603R410J9717J3188J1184R755J4165
$$ 368613 363125 378483 378625 379359 371814 375939 367258 371861 381271 400988 414176 425360 435115 449280
10068D49280J649n794m671j401o602l1399j2379j3071o079j0763M397l378j2782
$$ 449280 450929 445135 440464 439063 432461 401062 388683 375612 369533 358770 363167 359789 347007
10055C47007k6908k3767j0656j1696j2401j8258l166O475n046L2167N3535L4004
$$ 347007 320099 296332 285676 273980 261579 243321 240155 246630 241584 273751 327286 361290
10043C61290N876j5727k8679k2187j104O171O496r954p662p130r667J14j4322
$$ 361290 367166 351439 322760 300573 299469 305640 312136 302182 294520 287390 277723 277837 263515
10030B63515N862j1693p181J4652L3182P404J7789J9601M249j4966j7307K835
$$ 263515 269377 257684 250503 265155 298337 305741 323530 343131 347380 332414 315107 317942
10018C17942n977L191J446k733j6249k7024j8409j4846k4235j1541M867M556p667
$$ 317942 311965 315156 316602 313869 297620 270596 252187 237341 213106 201565 206432 210988 203321
10005B03321j7229n34o538j479J1226J4399M264n208j6332j2141n518j3211k2829
$$ 203321 186092 185558 179020 177541 188767 203166 207430 202222 185890 173749 168231 155020 132191
9992A32191K597J4494l293j1471r272j2146q547k250k228o285J7117K5972K7035
$$ 132191 134788 149282 145989 134518 125246 113100 104553 102303 100075 93790 110907 136879 163914
9979A63914J2831J0592L787k4290k9298j4788j5443j4126J0066P779J034K295
$$ 163914 176745 187337 191124 166834 137536 122748 107305 93179 103245 111024 112058 114353
9967A14353J8965L3164K9227r427r018r156j3988N266p394l515k0750J10J404
$$ 114353 133318 166482 195709 186282 177264 168108 154120 159386 151992 148477 127727 127837 129241
9954A29241q288p644L661q53p120L998J801L001k151J0136j4753N460K2087M847
$$ 129241 120953 113309 116970 116117 108997 112995 114796 117797 115646 125782 111029 116489 138576 143423
9940A43423r776R49o866P620r523M614j8299k5753k5718P234J4164N69n46O198
$$ 143423 133647 134596 127730 135350 125827 130441 112142 86389 60671 67905 82069 82638 82092 88290
9926H8290Q970p908n395k313M868N356R840P406j409O427O181J5336J3851L134
$$ 88290 97260 89352 83957 81644 86512 91868 101708 109114 107705 114132 120313 135649 149500 152634
9912A52634r798j7610o898k687J1435P188P248p812j4200o585j467j9950p142
$$ 152634 142836 125226 118328 115641 127076 134264 141512 133700 119500 112915 111448 91498 84356
9899H4356n522Q597L567J416J7451K6139J5066Q14j6620j3001o771O613M74j0855
$$ 84356 78834 87431 90998 92414 109865 136004 151070 151884 135264 122263 115492 122105 122579 111724
9885A11724J363J7482Q54K09Q634M837r950o238M46P361J1546o52K47M999q863
$$ 111724 113087 130569 131423 131632 140266 145103 135153 128915 129361 136722 148268 147616 147863 152862 143999
9870A43999p263k534P648K041j6763j6924k6218m552q838j6688n759J0790k607
$$ 143999 136736 134202 141850 143891 127128 110204 83986 79434 70596 53908 48149 58939 56332
9857E6332R896J0612P076O802J092p001p895L191Q768L681J2302L709n448J1120
$$ 56332 66228 76840 83916 90718 91810 84809 76914 80105 88873 92554 104856 108565 103117 114237
9843A14237J3184Q894o457J61M608j8376J1417K5480N368L45N104J5867p215j1384
$$ 114237 127421 136315 129858 130019 134627 116251 127668 153148 158516 158861 163965 179832 172617 161233
9829A61233P461J5049n271M190r598M721J1092J0523P955l343P62K517N169O082
$$ 161233 168694 183743 178472 182662 173064 177785 188877 199400 207355 204012 204774 207291 212460 218542
9815B18542J3178K9715M0431M5869L8661M1676N2798M3114P4258R2266J03556
$$ 218542 231720 261435 301866 347735 386396 428072 480870 523984 598242 690508 794064
9804G94064J37857K03018K76309L94080N46163O87680P74639P13314N15809K37785
$$ 794064 931921 1134939 1411248 1805328 2351491 3039171 3813810 4527124 5042933 5280718
9794E280718q9995m28071p00574p56042o51047n03676l67707k65039j82074j40380
$$ 5280718 5190723 4762652 4062078 3306036 2654989 2151313 1783606 1518567 1336493 1196113
9784A196113j05695o9993m8301l3747k5042p313j6026j5410J3913L0942M2018
$$ 1196113 1090418 1020425 972124 938377 913335 906022 889996 874586 888499 919441 961459
9773I61459N2086P6662J17503J43034J89417K37836K67906K55055K02015J66109
$$ 961459 1013545 1090207 1207710 1350744 1540161 1777997 2045903 2300958 2502973 2669082
9763B669082K24630L69196O08673R27724J350761J893119K372111K428457J792467
$$ 2669082 2893712 3262908 3871581 4799305 6150066 8043185 10415296 12843753 14636220
9754A4636220O53834m01447r96012j037725o79243l20518k52317n45779j001131
$$ 14636220 15290054 14888607 13892595 12854870 12175627 11855109 11602792 11057013 10055882
9745A0055882j383226j460575j276529r99071p25474m98954l19899j82504j06289
$$ 10055882 8672656 7212081 5935552 4936481 4211007 3712053 3392154 3209650 3103361
9736C103361o7033j03296j80233j88699j16287m9197J7292R1685K03598L06959
$$ 3103361 3036328 2933032 2752799 2564100 2447813 2398616 2415908 2507593 2711191 3018150
9726C018150L89358L17943J07147m5442m416J59018L86173O67511J036482J512961
$$ 3018150 3407508 3725451 3832598 3787156 3782740 3941758 4327931 4995442 6031924 7544885
9716G544885J946814K007829J341470L25623k57619j32226M72948J211689J680540
$$ 7544885 9491699 11499528 12840998 13166621 12909002 12776776 13249724 14461413 16141953
9707A6141953J567561Q93807k19713j481439k281216k398917k140053j748666
$$ 16141953 17709514 18603321 18383608 16902169 14620953 12222036 10081983 8333317
9699H333317j365031r93500o41181l54550k21340k77289m53368n02227m10771
$$ 8333317 6968286 5974786 5333605 4979055 4757715 4480426 4027058 3524831 3114060
9690C114060l05169j96920j27255m8192m987N3921M7700k0906p7007n9925P873
$$ 3114060 2808891 2611971 2484716 2436524 2431537 2485458 2533158 2512252 2435245 2375320 2383193
9679B383193Q6857J76636K92169M19026N18278N24301M15671K56315K53337M67550
$$ 2383193 2470050 2646686 2938855 3357881 3876159 4400460 4816131 5072446 5325783 5793333
9669E793333P89392J141845J445746J642823J618765J196658L47832o11319j280445
$$ 5793333 6582725 7724570 9170316 10813139 12431904 13628562 13976394 13365075 12084630
9660A2084630j720277j888029j711891j348480r51453o41467m59043l71746l51352
$$ 12084630 10364353 8476324 6764433 5415953 4464500 3823033 3363990 2992244 2640892
9651B640892l45404k97082k32147j84327j49107j16159j12359j03976q2905n3342
$$ 2640892 2295488 1998406 1766259 1581932 1432825 1316666 1204307 1100331 1017426 964084
9641I64084m3093l4662k1323L494n236j6750l198J3516J9345L7566Q1508R1803
$$ 964084 920991 886329 865006 868500 863264 846514 843316 856832 876177 913743 995251 1087054
9629A087054J43044J82860K28657L41663M67974N55333N16931L74813J63189n9870
$$ 1087054 1230098 1412958 1641615 1983278 2451252 3006585 3523516 3898329 4061518 4001648
9619D001648k88220n06223o01882n52587m29596l14160k27941j68032j25136q1627
$$ 4001648 3713428 3207205 2605323 2052736 1623140 1308980 1081039 913007 787871 706244
9609G06244o1380n6116m6222l1584k3637l8592k9927k1676k0990p132j5882r234
$$ 706244 644864 588748 542526 510942 487305 448713 418786 397110 376120 368988 353106 343872
9597C43872q533k6800l3086k2515p67j7309j5498q133O776k540l054Q383K340
$$ 343872 335339 308539 275453 252938 252171 234862 219364 211231 218007 215467 212413 220796 223136
9584B23136m881k412j3721p370R398J0047L716R69J0591o334k0163j3212m467
$$ 223136 218255 215843 202122 194752 204150 214197 217913 218882 229473 223139 202976 189764 185297
9571A85297k702n775l559K3402O209O683r726Qo144J3031O738j1342o914K234
$$ 185297 182595 176820 173261 196663 202872 209555 199829 199837 193693 206724 213462 202120 195206 197440
9557A97440P175j0309o575q565O461p64L90M100L446j314O430j490j4909k074
$$ 197440 204615 194306 187731 179166 185627 184863 185253 189353 192799 191485 197915 196425 181516 179442
9543A79442j282j3353k1K008q769j4906O108J5705k041j5382O949p151k616J2986
$$ 179442 178160 164807 164786 166794 158025 143119 149227 164932 162891 147509 154458 147307 144691 157677
9529A57677P696L02k127j802R988j799O724j65j0470K671q009j4561K948K642
$$ 157677 165373 165675 163548 161746 171734 169935 176659 176494 166024 168695 160686 146125 149073 151715
9515A51715L979L953J0523o59r096j7511r543k392J2756L0j919L910k473K024
$$ 151715 155694 159647 170170 169511 160415 142904 133361 130969 143725 143755 141836 145746 143273 145297
9501A45297P255k805m102o174k471J3054J3190J1943P104n331O401J168j7481
$$ 145297 152552 149747 145645 139471 137000 150054 163244 175187 182291 176960 183361 184529 167048
9488A67048k8411r398N61R22N626j759N339j1342j2122o838J0046J5085J4345
$$ 167048 138637 129239 129800 130722 136348 134589 139928 128586 116464 109626 119672 134757 149102
9475A49102l071p710J8778J2988m237k0470k2023j590o556k037Q174k860o690
$$ 149102 146031 138321 157099 170087 165850 145380 123357 121767 115211 113174 121348 118488 111798
9462A11798J129N781o200j1073J666M867J7441J4638o273k0947Q712Q494Q624
$$ 111798 112927 118708 112508 101435 103101 107968 125409 140047 133774 112827 121539 130033 138657
9449A38657o330j1930j7784o124J2841J2539Q325N050J84j2373j2140o401N560
$$ 138657 132327 120397 102613 96489 109330 121869 130194 135244 135428 123055 110915 104514 110074
9436A10074N855j2372o988J860K396J6247K103R08k353J2006n653j0394l910R997
$$ 110074 115929 103557 96569 98429 100825 117072 119175 120083 117730 129736 124083 113689 109779 119776
9422A19776J391o819j4886P7l596M957N954K167n459L502k363J382q003k884M136
$$ 119776 121167 114348 99462 99539 95943 100900 106854 109021 103562 107064 104701 106083 98080 95196 99332
9407I9332J0616l675q155j632J291J4405J593k238K880J2172M242J0272J543P587
$$ 99332 109948 106273 98118 96486 97777 112182 113775 111537 114417 126589 130831 141103 142646 150233
9393A50233r921K606L520k7306j8915p082L023J3546O980J1528R067p111j5506
$$ 150233 140312 142918 146438 119132 100217 93135 96158 109704 116684 128212 137279 130168 114662
9380A14662j648J9973j857q630j975J985l132m032j5835k008M519L618m361k435
$$ 114662 113014 132987 131130 122500 120525 122510 119378 115346 99511 97503 102022 105640 101279 98844
9366I8844n557m02j2933m106J0193K784l519J3645J065M892J1522J6374O727P781
$$ 98844 93287 92885 79952 75846 86039 88823 85304 98949 100014 104906 116428 132802 139529 147310
9352A47310P954Q067K746n026j7305m763p007K470M547j809k1382j1506J6855
$$ 147310 155264 163331 166077 161051 143746 138983 131976 134446 138993 137184 115802 104296 121151
9339A21151j0183j0505l32k57o203K740J1429J0514O344N048j8278j2891L492
$$ 121151 110968 100463 100131 99874 93671 96411 107840 118354 124698 129746 111468 98577 102069
9326A02069J9620m368L613q109K172O266l057k276p561n055k378m242Q997J4033
$$ 102069 121689 117321 120934 112825 114997 121263 118206 115930 108369 103314 100936 96694 105691 119724
9312A19724K1353K7586J3954K460q306j1980k624q48j5875K0242J9074M310Q491
$$ 119724 141077 168663 182617 185077 176771 164791 162167 161319 145444 165686 184760 189070 197561
9299A97561j5416k0125j3344p341p444j1776j1150M613J583L450J0136r019J180
$$ 197561 182145 162020 148676 141335 133891 122115 110965 115578 117161 120611 130747 121728 122908
9286A22908N952j9537j6162Q24J2363O935j0875j3094q414Q747M847P970m619
$$ 122908 128860 109323 93161 93985 106348 113283 102408 89314 80900 89647 94494 102464 97845
9273I7845N542k738N149N97k053J009J0071N460J1043J390j334j0359J0555J7499
$$ 97845 103387 100649 105798 106395 104342 105351 115422 120882 131925 133315 131981 121622 132177 149676
9259A49676N834Q08p353p234r457j5272j4776q363m130j3965p962n65J4268K1979
$$ 149676 155510 156318 148965 141731 132274 117002 102226 93863 89733 75768 67806 67241 81509 103488
9245A03488q2j1821J0705n247j6116k40j873n732K026j536l170q457J0420K958
$$ 103488 103406 91585 102290 97043 80927 80687 78814 73082 75108 73572 70402 61945 72365 75323
9231G5323p797J69P098M926J3766J2609m807j0613q41j309M143J1962M73Q365
$$ 75323 67526 67695 74793 79719 93485 106094 101287 90674 89833 88524 92667 104629 105102 113467
9217A13467K597O203j6498k2209J848n260J999n247J0387l898j2574l285J1909
$$ 113467 116064 122267 105769 83560 85408 80148 82147 76900 87287 83389 70815 67530 79439
9204G9439P197k823n208P927J770j1193j0037q437N810j857l07k773J001m394
$$ 79439 86636 83813 78605 86532 88302 77109 67072 58635 64445 62588 62281 59508 60509 56115
9190E6115j2336n354J6743J0136J2846r291j2030J3649M682J4634P054L056L628
$$ 56115 43779 38425 55168 65304 78150 68859 56829 70478 75160 89794 96848 99904 103532
9177A03532O666l132M408j0226k7278j0295J5401J4829O369q225K931L183o851
$$ 103532 110198 107066 111474 101248 73970 63675 79076 93905 100274 92049 94980 98163 91312
9164I1312j875l588o270l333m483q242j4136j4080J0110R135J460J5294J1165
$$ 91312 89437 85849 79579 76246 71763 63521 49385 35305 45415 54550 56010 71304 82469
9151H2469J4298M86j0194j2593J0839L462m099k154l316L489M258m135P958J2984
$$ 82469 96767 97253 87059 74466 85305 88767 84668 82514 79198 82687 86945 82810 90768 103752
9137A03752K90O993j426J5326L738J4052K4606K711P843K5593K8840L6314M1967
$$ 103752 104042 111035 109609 124935 128673 142725 167331 170042 177885 203478 232318 268632 310599
9124C10599L5223M9585O9839Q2201J22365J50099J56958J96978K26968K23554
$$ 310599 345822 395407 465246 547447 669812 819911 976869 1173847 1400815 1624369
9114A624369J94923J38703M6724m5230j25727j95374k25424k13305j73780j53862
$$ 1624369 1819292 1957995 2004719 1959489 1833762 1638388 1412964 1199659 1025879 872017
9104H72017j22962r2332r1452p5824n9170n9383m5682l7093k2153j5628j5814
$$ 872017 749055 656723 565271 489447 430277 370894 325212 288119 265966 250338 234524
9093B34524k3344k0130j2031n114o18l520j7540j0977j070J324l08j2142k5145
$$ 234524 211180 191050 179019 173905 173287 169767 152227 141250 140180 141504 141196 129054 103909
9080A03909K554Q252Q830K420n503o910p52j873j2088O259n685q317q590j1489
$$ 103909 106463 114715 123545 125965 120462 113552 112800 110927 98839 105098 99413 91096 82506 71017
9066G1017Q905R86o180r243m089L465l150L550J9280K577N626K510r70P782q194
$$ 71017 79922 80908 74728 65485 61396 64861 61711 65261 84541 87118 92744 95254 94284 102066 93872
9051I3872m492o059k1198K401K626R751R935Q173j1565j1259j1296J6867O803
$$ 93872 89380 83321 62123 64524 67150 76901 86836 95009 83444 72185 60889 77756 84559
9038H4559J2447K3436O343k738L674L33J1003O220j0514p28K1560J0381J886j645
$$ 84559 97006 120442 126785 124047 127721 128054 139057 145277 134763 134035 155595 165976 167862 166217
9024A66217j4078k7677m9219k8991j9528P056K689J7953J2522l753l120P260l666
$$ 166217 152139 124462 75243 46252 26724 33780 36469 54422 66944 63191 60071 67331 63665
9011F3665J2017K2243J5976m750O127J9260P152o655n995l6q160k3125L456K4818
$$ 63665 75682 97925 113901 109151 115278 134538 141690 135035 129040 129004 120844 97719 101175 125993
8997A25993K508j7273j7247q893r13j0271q49m970L326J0860J3011N682m980p022
$$ 125993 128501 111228 93981 85088 84175 73904 73055 68085 71411 82271 95282 100964 95984 88962
8983H8962r443J0714K209J8367L0479J9682J2432K1818K9572L0008M2058N4113
$$ 88962 79519 90233 92442 110809 141288 160970 173402 195220 224792 254800 296858 350971
8971C50971O6313N9174N5326O3605K9447o0275q8117q2684o2532n0604l4449k2221
$$ 350971 417284 476458 531784 595389 624836 564561 476444 393760 331228 280624 246175 223954
8959B23954j3640j6140j0962k2937j1829j3500q006p200q608j2133j3780p195
$$ 223954 210314 194174 183212 160275 148446 134946 126940 119740 111132 98999 85219 78024
8947G8024K099J353L405J2944J2491r06q816K218J1486J0733j2633M761J5073
$$ 78024 80123 81476 84881 97825 110316 109410 100594 102812 114298 125031 112398 117159 132232
8934A32232n104k048O714n249j7832j0741L299J8745q860j2567r746J883J6144
$$ 132232 127128 125080 131794 126545 108713 97972 101271 120016 111156 98589 88843 90726 106870
8921A06870K5393K0129L043J6392K2599K8367J301n500p656l1688l8621l6729
$$ 106870 132263 152392 155435 171827 194426 222793 224094 218594 210938 179250 140629 103900
8909A03900o90P331J9105M1483J9194J1710R70K555m348l0730k3552j2387j2118
$$ 103900 103210 110541 129646 171129 190323 202033 203003 205558 201210 170480 146928 134541 122423
8896A22423M503Q182q685r301j4597j4304j615L431k070J1477N549J3162J2052
$$ 122423 126926 135108 126423 117122 102525 88221 86606 90037 87967 99444 104993 118155 130207
8883A30207K284P371Q094J6945O1061Q4203J00542O2609o1646j21387q5758m7818
$$ 130207 132491 139862 147956 164901 225962 310165 410707 473316 411670 290283 204525 156707
8871A56707n280m526p977j3877k8544j6112q083J9048K9822J9055R825R133n153
$$ 156707 151427 146901 138924 125047 96503 80391 72308 91356 121178 140233 150058 159191 154038
8858A54038k9238m251Q453r843j7540R491L802k9K7058L6321L6965L8965M0514
$$ 154038 124800 120549 129002 119159 101619 111110 114912 114883 141941 178262 215227 254192 294706
8845B94706M9299R7649J77277K06067J07083l3020j07787r1744o1468m2724l8299
$$ 294706 344005 441654 618931 824998 932081 899061 791274 699530 638062 595338 557039
8834E57039j7852j0883J424L1289L0306J4718l6465n5075m7962l4481p279J441
$$ 557039 539187 528304 529728 561017 591323 606041 569576 514501 466539 432058 424779 426220
8822D26220J1376J5434Q338J1004M0251N7252N5923K4228j2796k7149l4434m2423
$$ 426220 437596 453030 461368 472372 512623 569875 625798 650026 637230 610081 575647 533224
8810E33224k8739l624n667O825Q769P340J1836P195k045J1743P246J4531J3281
$$ 533224 504485 500861 495194 502019 510788 518128 529964 537159 535114 546857 554103 568634 581915
8797E81915J3431J1792Q43Q846J7516J1521J7484J7874K9481J3813K2803K9795
$$ 581915 595346 607138 607981 616827 634343 645864 663348 681222 710703 724516 747319 777114
8785G77114K2895K3759J4702Q174K0488K4894L2665M4004M0027N0233N5483L0225
$$ 777114 800009 823768 838470 846644 867132 892026 924691 968695 1008722 1058955 1114438 1144663
8773A144663J5947K2459N1857O6690Q0201J09011J14879J10637Q5241Q5335J18137
$$ 1144663 1160610 1183069 1234926 1301616 1381817 1490828 1605707 1716344 1801585 1886920 2005057
8762B005057J38057J39597J25094J01869M0841J6491M5382P9867J14803J26351
$$ 2005057 2143114 2282711 2407805 2509674 2550515 2567006 2612388 2692255 2807058 2933409
8752B933409J56280K15335K64626K98271L23936K85213K72712L05330L61773M57595
$$ 2933409 3089689 3305024 3569650 3867921 4191857 4477070 4749782 5055112 5416885 5874480
8742E874480N07026M53112M08671N07879O22100P46541Q72094J085181J353347
$$ 5874480 6381506 6834618 7243289 7751168 8373268 9119809 9991903 11077084 12430431
8733A2430431J667356K002883K403060K967445L688837M433616M958636N211434
$$ 12430431 14097787 16100670 18503730 21471175 25160012 29593628 34552264 39763698
8725C9763698N585521O776144R513228J4224813K1389947L2318255M9528261P5601953
$$ 39763698 45349219 52125363 61638591 75863404 97253351 129571606 179099867 254701820
8717B54701820J07815403J25771280Q8873724j2256296j02386121j19758128r3010645
$$ 254701820 362517223 488288503 577162227 564905931 462519810 342761682 249751037
8710B49751037o1946565l8681495k3289538j5648642j4913843j5763292j3962597
$$ 249751037 187804472 149122977 125833439 110184797 95270954 79507662 65545065
8703F5545065j0909205q179563o183034n094668m600369m118099l426048k773416
$$ 65545065 54635860 46456297 40273263 35178595 30578226 26460127 23034079 20260663
8695B0260663k266705j914035j618343j391680j242781j098117r39142q16266
$$ 20260663 17993958 16079923 14461580 13069900 11827119 10729002 9789860 8973594
8687H973594p12315o34173n71921n00750m27582l84342l21432l10015k70936k23687
$$ 8973594 8261279 7627106 7055185 6554435 6126853 5742511 5421079 5111064 4840128 4616441
8677D616441k10633k35935k30799k27684k26383k37085k16313j82618j25498q6918
$$ 4616441 4405808 4169873 3939074 3711390 3485007 3247922 3031609 2848991 2723493 2636575
8667B636575q9228q1050p6098q6468o0227m0558k0454m1158o7513n6328n4073
$$ 2636575 2547347 2466297 2390199 2303731 2243504 2202946 2182492 2141334 2073821 2017493 1963420
8656A963420o9536m9449k9641m0396n2342m4530n2721n0599l2957m0859n2732
$$ 1963420 1893884 1844435 1814794 1774398 1722056 1677526 1624805 1574206 1541249 1500390 1447658
8645A447658n4820l5870k4632m434r933o588k3826j3385k1304k3083k3112k5496
$$ 1447658 1392838 1356968 1332336 1327902 1317969 1311381 1287555 1274170 1252866 1229783 1206671 1181175
8633A181175P21R649J1131J6466N464j1629M151O9140J01996J05027O532q9586
$$ 1181175 1181896 1191545 1202676 1219142 1224606 1212977 1217128 1286268 1388264 1493291 1499823 1410237
8621A410237j37203j00825o4009o9181l7070k0431j3208k1594j9376j4339j80
$$ 1410237 1273034 1172209 1108200 1039019 1001949 981518 968310 946716 927340 913001 912821
8610I12821k285j3748k729K7605L2584J0379k5898m9876k1181N703l078L587J6231
$$ 912821 910536 896788 894059 921664 954248 964627 938729 888853 867672 873375 870297 873884 890115
8597H90115J1590J6953K4401L9599N6215O3354O3648P0378P6748P3792R2861J03801
$$ 890115 901705 918658 943059 982658 1038873 1102227 1165875 1236253 1313001 1386793 1479654 1583455
8585A583455P2907Q1855R4716J27554J63481J78211J66953K33563L73428N86390
$$ 1583455 1656362 1738217 1832933 1960487 2123968 2302179 2469132 2702695 3076123 3662513
8575C662513R14999J481366K511997M192506O122916O187011J498995m896873
$$ 3662513 4577512 6058878 8570875 12763381 18886297 25073308 26572303 21675430
8567B1675430o491133m745981k937741j814929j167647p74089n33794l91810k90470
$$ 21675430 15184297 10438316 7500575 5685646 4517999 3743910 3210116 2818306 2527836
8558B527836k16263j72277j56893j38638j22728j00369r2590r8720r0970o4076
$$ 2527836 2311573 2139296 1982403 1843765 1721037 1620668 1528078 1429358 1338388 1274312
8548A274312r1309p1742o0456n0761m3533l0376j5911l5655m4911n4839l9779
$$ 1274312 1183003 1111261 1050805 1000044 956511 926135 910224 874569 829658 774819 735040
8537G35040l7523m3554m5283k1195m647j2906l8524m5269l8865k1687l3793k1177
$$ 735040 697517 653963 608680 587485 582838 569932 531408 486139 447274 425587 391794 370617
8525C70617k0330m82J7596K0015K8806n96k7164l7980l5254k0247k2244m677K2740
$$ 370617 350287 349805 367401 387416 416222 415626 388462 350482 315228 294981 272737 268060 290800
8512B90800K0682L233n588P145K9747K2776J1562N71J2643j6590j1746N637Q16
$$ 290800 311482 314715 309127 316272 346019 368795 380357 380928 393571 376981 365235 370872 371688
8499C71688j1461k8405k4243j7912j6746J1083k115j1596q201R313J3585j172
$$ 371688 360227 331822 307579 289667 272921 284004 281889 270293 262092 271405 284990 283818
8487B83818j3125j3997j229J1945N798j3343n9j4338j2838J3135j730Q477k095
$$ 283818 270693 256696 255467 267412 273210 259867 259808 245470 232632 245767 244037 252514 250419
8474B50419j0184j3940k858o154n232j187M683J9610o022j2025J9263R530q911
$$ 250419 240235 226295 223437 217283 212051 210864 215547 235157 229135 217110 236373 245903 236992
8461B36992j2834Q153l0j0578j1834k752p237m680o472m033K4204l409p467J1319
$$ 236992 224158 232311 232281 221703 209869 207117 199880 195200 188728 184695 208899 205490 198023 209342
8447B09342j651j0608K318o046r331l448o324L772J1292R288J1304o115j4940
$$ 209342 207691 197083 199401 193355 184024 180576 174252 178024 189316 198604 209908 203793 188853
8434A88853j886n600j9739P703Q234N555J080k275L02O969j3005j3920k882J374
$$ 188853 186967 181367 161628 169331 177565 183120 184200 181925 182227 189196 176191 162271 159389 160763
8420A60763n374K808O784J5644N991r014o508R001N319J4121J6659P568j6787
$$ 160763 155389 158197 164981 180625 186616 177602 171094 180095 185414 199535 216194 223762 206975
8407B06975m3685m0481j6320J306k0105o953Q69j2584r808j0679K001J2979J3012
$$ 206975 163290 122809 106489 107795 87690 80737 81606 69022 59214 48535 50536 63515 76527
8394G6527r099j921P431M991O011J6692J6203r237k832J6432J1288N610J2908
$$ 76527 67428 65507 72938 77929 83940 100632 116835 107598 104766 121198 132486 138096 151004
8381A51004N385n995j2399r841q891O633J0239o762n080Q945O59l934m730n153
$$ 151004 156389 150394 137995 128154 119263 125896 136135 129373 124293 133238 133897 129963 125233 120080
8367A20080R01j3558j3470J3250O175R152M552M84j8537k119M11j6743r606P22
$$ 120080 120981 107423 93953 107203 113378 122530 127082 127566 109029 106910 107321 90578 80972 81694
8353H1694Q413J8579Q374L247j3707o324J736J476l431k088J1369K1606M873J295
$$ 81694 90107 108686 117060 120307 106600 100276 102012 103488 100057 97969 109338 130944 135817 137112
8339A37112J3837mk458l836O876M511O693J6986J5214r59J4503J0886K5125L2498
$$ 137112 150949 150945 148487 144651 151527 156038 162731 179717 194931 193972 208475 219361 244486 276984
8325B76984K9669K9027N4272O2437P3699Q3131J06979J50046J87446K04514K19945
$$ 276984 306653 335680 389952 452389 526088 609219 716198 866244 1053690 1258204 1478149
8314A478149K12708J78932J00519J7726n7986j33062j82583k13421k12248j94429
$$ 1478149 1690857 1869789 1970308 1988034 1930048 1796986 1614403 1400982 1188734 994305
8304I94305j53933j03384r4745r8827o3110n7283n4565l4613k4672n0085l1585
$$ 994305 840372 736988 642243 543416 480306 423023 368458 333845 309173 259088 227503
8293B27503l531k500j2710o701L348j4373k254k750j0513j0272l967o59q820q519
$$ 227503 223972 221472 208762 202061 205409 191036 188782 186032 175519 165247 161280 160621 151801 143282
8279A43282m794j625q475l557o742n091O945O497r715K168K763l236M655J217
$$ 143282 138488 136863 128388 124831 118089 112998 119943 126440 116725 118893 121656 118420 123075 124292
8265A24292k781l878j0088j3256j867j1513J208N417R544K411n159j5008M423
$$ 124292 121511 117633 107545 94289 92422 80909 82117 87534 97078 99489 94330 79322 83745
8252H3745P52l628J320J0899N950O31N494L960P427K193l471j48q740j7147M34
$$ 83745 84497 80869 82189 93088 99038 99669 105163 109123 116550 118743 115272 115124 106384 89237 89671
8237H9671K324L954N797L709K376j606M035q775k3000o282N197k731R348J0094
$$ 89671 91995 95949 101746 105455 107831 106225 110260 101485 78485 72203 77400 74669 84017 94111
8223I4111N656q86J0708l409n549J382J2268r96j2524p774J1132r821o549O173
$$ 94111 99767 98881 109589 106180 100631 102013 114281 113285 100761 92987 104119 94298 87749 93922
8209I3922p881p762Q339R127n128r742K136j729L130o971Q374K0163J2813K589
$$ 93922 86041 78279 86618 95745 90617 80875 83011 81282 84412 77441 85815 105978 118791 121380
8195A21380j0325j2409Q032J310j4518j0746m974r960j6457o354J4207k341J0339
$$ 121380 111055 98646 106678 107988 93470 82724 77750 67790 51333 44979 59186 56845 67184
8182F7184l651j51Q367R955l063q71J2464P987l000J6064J6058J5639J3776P33
$$ 67184 63533 63382 71749 81704 78641 77770 90234 98221 95221 111285 127343 142982 156758 157491
8168A57491J9379J1095M781J179k2342j8404k0138k6339k3583k513J1396J8438
$$ 157491 176870 187965 192746 193925 171583 153179 133041 106702 83119 80606 92002 110440
8156A10440l040O352R025q715j2544k329o551n375K763k372P344n137J059j0118
$$ 110440 107400 113752 122777 114062 101518 99189 92638 87263 90026 87654 94998 89861 90920 80802
8142H0802R581k275o674L600O799k873J582J0273l757k0205q552N220K330J954
$$ 80802 90383 88108 81434 85034 91833 88960 90542 100815 97058 76853 68301 73521 75851 77805
8128G7805N13M986N145o44K2734J7472L138j7290j3082j1690M374r54n10j669
$$ 77805 78318 83304 88449 87805 110539 128011 131149 113859 100777 89087 93461 92507 91997 90328
8114I0328L47M346J725o652L854j2987p561l375j262M663p662J595m2O134J7399
$$ 90328 90675 95021 96746 90094 93948 80961 73400 70025 68763 73426 65764 67359 67317 73451 90850
8099I0850P941r958K300J2229N986q147K912K1110L2481o492k0012r207j8952
$$ 90850 98791 88833 91133 103362 109348 101201 104113 125223 157704 151212 131200 121993 103041
8086A03041n37n54J0446P041P975n61q265n128K1175r80m443o586J6430L858P
$$ 103041 102504 101950 112396 119437 127412 126851 118586 113458 134633 133653 129210 122624 139054 142912 142919
8071A42919q114N477N409J0598K2244J0464J6441L340O248j6428l7788p554m082
$$ 142919 134805 140282 145691 156289 178533 188997 205438 208778 215026 198598 160810 153256 149174
8058A49174j563N360j273k531K895L897J8293m510n935o43R763o899r779j0677
$$ 149174 147611 152971 151698 149167 152062 155959 174252 169742 163807 163164 172927 166028 156249 145572
8044A45572q783O037j189N346J5234Q405p024R881J654K370K373j1638p979m928
$$ 145572 136789 142826 141637 146983 162217 170622 163598 173479 175133 177503 179876 168238 160259 155331
8030A55331j307l317J486k949k876k2022j4806j5096p212j248M979k410L265N074
$$ 155331 154024 150707 152193 149244 146368 124346 109540 94444 87232 85984 90963 88553 91818 96892
8016I6892r785L554k05Q137J1538R598J6584J408k4928j4937j194J178J2233J6635
$$ 96892 87107 90661 90456 98593 110131 119729 136313 137721 112793 97856 96662 97840 110073 126708
8002A26708P444K710n411j8625K277J7471l680p391J470l49q394O610q472r263
$$ 126708 134152 136862 131451 112826 115103 132574 128894 121503 122973 122624 114230 120840 112368 103105
7988A03105m234n234J1656J4560M906p013M638J5533J7717R997J5822K64j0588
$$ 103105 98871 93637 105293 119853 124759 117746 122384 137917 155634 165631 181453 181717 171129
7975A71129j3214o487j5750j0458k643j1811l455L434o390N110N768l832l054
$$ 171129 157915 151428 135678 125220 122577 110766 107311 110745 104355 109465 115233 111401 108347
7962A08347j0152n396K1964J0075j8287j1990p159l921M317m629K299k87L787
$$ 108347 98195 92799 114763 124838 106551 94561 87402 83481 87798 83169 85468 85181 88968
7949H8968K157l18Q226J3669n722L757J2064j1773k1586q749k853J3496r628J319
$$ 88968 91125 90807 99033 112702 106980 110737 122801 111028 89442 80693 77840 91336 81708 83027
7935H3027l527j5284k843Q60m399Q644Q027J278n82J3080K914l206J962P55q854
$$ 83027 79500 64216 61373 62233 57834 66478 74505 75783 75201 88281 91195 87989 89951 90706 81852
7920H1852k0252R580K1916P259o143J3066R910j0256k4661p70J587j2603k4879
$$ 81852 61600 71180 93096 100355 94212 107278 117188 106932 82271 81501 83088 70485 45606
7907D5606M360K3023R826j222O632J7466p804j3494p237J6727L907q851n185p187
$$ 45606 49966 72989 82815 81593 88225 105691 97887 84393 77156 93883 97790 88939 83754 76567
7893G6567o02O35l36J0089j942o925j4838R979J5299j759J9748J1051l535K1079
$$ 76567 75965 76600 76264 86353 84411 77486 62648 72627 87926 86167 105915 116966 113431 134510
7879A34510K7075l083L569J0663p386j7273j4328j2532o995j4040r486M411J1098
$$ 134510 161585 158502 162071 172734 165348 148075 133747 121215 114220 100180 90694 95105 106203
7866A06203K362N600J5k0642L249Q486l947r123k290o647k956j4962j5386j1071
$$ 106203 108565 114165 114180 93538 96787 105273 101326 92203 89913 83266 80310 65348 49962 38891
7852C8891L646J6614j633n648J2457j2765q86J1297J3313N778l480Q843M554j0834
$$ 38891 42537 59151 57518 51870 64327 51562 50676 61973 75286 81064 77584 86427 90981 80147
7838H0147j1075o646l953l863O55p046p284N276N100p425j1530l916k01O291l518
$$ 80147 69072 62426 58473 54610 55265 48219 40935 46211 51311 43886 32356 28440 28239 34530 31012
7823C1012J3556L83j2041K438N696P011j427O90m845l843J3015O384j9088j1588
$$ 31012 44568 44951 32910 35348 41044 48055 46628 47318 42473 38630 51645 58029 38941 27353
7809B7353r862j2859m187J7898J6354J0875l156L20j583j0356m029r520O625K878
$$ 27353 17491 4632 445 18343 34697 45572 42416 42736 41153 30797 26768 17248 23873 26751
7795B6751l861K881J5670P823J1229K955j0652p567j2133J4897J4498n071j2911
$$ 26751 22890 25771 41441 49264 60493 63448 52796 45229 33096 47993 62491 57420 44509
7782D4509j0480k5352p75J8352K360K833K2809M840k1118J27R570j6590q815j933
$$ 44509 34029 8677 7902 26254 28614 31447 54256 59096 37978 38105 47675 31085 22270 20337
7768B0337R515L743m572J494k831R12Q924M88n373r736K0305K257j2734m032N328
$$ 20337 29852 33595 29023 30517 27686 28598 37522 38010 32637 22901 43206 45463 32729 28697 34025
7753C4025m226p078R976O875K593k0927o161J0670J902j3691p621L380J2957j652
$$ 34025 29799 22721 32697 39572 42165 21238 15077 25747 27649 13958 6337 9717 22674 21022
7739B1022q895Q080J581m956q225o229O321R700O044p398R524P851L990k177j5744
$$ 21022 12127 20207 21788 16832 8607 2378 8699 18399 24443 17045 26569 34420 38410 36233 20489
7724B0489m471r383n621J3963J3148J699N234l868j754o782N737P741n105j989
$$ 20489 16018 6635 1014 14977 28125 29824 35058 31190 29436 22654 28391 36132 31027 29038
7710B9038o757k50j805O817N431J062j3919j5463k153R762O212j1254j4313J0614
$$ 29038 22281 22031 20226 27043 32474 33536 19617 4154 2001 11763 17975 6721 -7592 3022
7696C022j021J0841Q752L777p207j197j0877k68K806N214k741K341M338j296m515
$$ 3022 2001 12842 21594 25371 18164 16967 6090 5822 8628 13842 11101 13442 17780 16484 11969
7681A1969n041L716l996L903J107O023K085l252q285n160J2913K7311M884k1763
$$ 11969 6928 10644 6648 10551 11658 17681 19766 16514 8229 3069 15982 43293 48177 26414
7667B6414o749J4451M767j1559j5939j1418l993p52N150J5603J8850L170n44j594
$$ 26414 19665 34116 38883 27324 11385 -33 -4026 -4778 372 15975 34825 37995 37451 35857
7653C5857n811o059k523J0647l502l617M827j3659O77P072Q661p608j7527j7382
$$ 35857 30046 23987 21464 32111 28609 24992 29819 16160 16837 23909 32570 24962 7435 -9947
7639i947Q894J8348o892J1419R819q450r623L983J0541K696r945K287o235N625
$$ -9947 -1053 17295 10403 21822 31641 23191 13568 17551 28092 30788 20843 23130 16895 22520
7625B2520O179j0092k149Q879k872L920j0686r609J2385L39k537j2017J692j644
$$ 22520 28699 18607 16458 25337 22465 26385 15699 6090 18475 18814 16277 4260 5952 4308
7611D308q5j476n075l799j649J0588Q588J0940q712l411j4r55J0480N25K572J4554
$$ 4308 4223 2747 -2328 -6127 -7776 2812 11400 22340 13628 10217 10203 9248 19728 20253 22825 37379
7595C7379N731m526r121r950J424M840l866j733N674q07n556k88J873j0140N373
$$ 37379 43110 38584 29463 19513 20937 25777 21911 20178 25852 25045 19489 19201 21074 10934 16307
7580A6307L682M587k093M80J0177K893n775j1494o653l852n773o115L474J8556
$$ 16307 19989 24576 22483 22963 33140 36033 30258 18764 12111 8259 2486 -3629 -155 18401
7566A8401J5674N610j1868j5728j18O751j430O986j112j0548M988N049L075l83
$$ 18401 34075 39685 27817 12089 11971 18722 17292 24278 23166 12618 17606 22655 25730 25347
7552B5347l649r248r490k289o297R241Q318Q781l287k0366j0255K885J6401J9902
$$ 25347 21698 12450 2960 671 -5626 3615 11933 20714 17427 -2939 -13194 -10309 6092 25994
7538B5994Q559J242j5262j8921R32q738m19J2948j207l174k178J1194o672o640
$$ 25994 34553 35795 20533 1612 2544 -6194 -6613 6335 5128 1954 -224 10970 4298 -2342
7524b342J0362J8221o834k5333o830N844M73k288m802M408Q147j651r738O76J8339
$$ -2342 8020 26241 19407 -5926 -12756 -6912 -6439 -8727 -13529 -9121 -974 -2625 -12363 -11687 6652
7509F652J511M678M173n043l512Q086L948j8554j0823k084K674P35J3676R412
$$ 6652 8163 12841 17014 11971 8459 16545 20493 1939 -8884 -10968 -8294 -7559 6117 15529
7495A5529M333P128J2075o415q244j0246j1246q33P39J919J0489K917P365n65
$$ 15529 19862 26990 39065 32650 24406 14160 2914 2081 2820 4739 15228 18145 25510 24945
7481B4945m694l701K327n179j1124n698R077M3j08m301R789M155r12J1393J717
$$ 24945 20251 16550 18877 13698 2574 -3124 5953 5996 5888 1587 11376 15531 14619 26012 27729
7466B7729j1486Q660j1796o930N291J5412m889j2311j3298O808J3193J9579n609
$$ 27729 16243 24903 13107 6177 11468 26880 21991 9680 -3618 3190 16383 35962 30353
7453C0353p329R542j8587o642R985J4732j2393j0312j1k057k865P39n001J1885
$$ 30353 23024 32566 13979 7337 17322 32054 19661 9349 9338 7281 4416 5155 154 12039
7439A2039R251p664K930K395l402j0596M933Q474P451j0758j7766m902J0279r360
$$ 12039 21290 13626 16556 18951 15549 4953 9886 18360 25811 15053 -2713 -7615 2664 -6696
7425f696p555J8628J6737j184n841k585P114N798q861L384M840l832L225j473
$$ -6696 -14251 4377 21114 19930 14089 11504 18618 24416 15555 18939 23779 19947 23172 21699
7411B1699p707J4914m291j2712r774R535P075m686l42J4819l997q849j1824J007
$$ 21699 13992 28906 24615 11903 2129 11664 18739 14053 13711 28530 24533 15684 3860 4867
7397D867O344N907Q710J6519q273n073q326q250j404R078J6393q653j2174j1308
$$ 4867 11211 17118 25828 42347 34074 29001 20675 12425 11021 20099 36492 27839 15665 4357
7383D357j1230j8619J4403J4253J0833o646Q669O894L345n990K299K747j011r858
$$ 4357 -6873 -25492 -11089 3164 13997 7351 16020 22914 26259 20269 22568 25315 24304 14446
7369A4446o495K0409L635j4324l896p009K49J4978O744O424m589j248p586Q996
$$ 14446 7951 28360 31995 17671 13775 6766 7015 21993 28737 35161 30572 29324 21738 30734
7355C0734J0009q414j3369q219j358n619P475K803k070J762J2320o549k080K367
$$ 30734 40743 32329 18960 10741 9383 3764 11239 14042 11972 13734 26054 19505 17425 19792
7341A9792Q312o483K312Q266j539p89k754j4028N891Q083J564o817j4800k957
$$ 19792 28104 21621 23933 32199 30660 29871 27117 13089 18980 27063 28627 21810 7010 4053
7327D053j962N355P282L216O381r654j8351J783P679K0430p79j2856j9470k331
$$ 4053 2091 7446 14728 17944 24325 14671 -3680 -1897 5782 26212 25433 12577 -6893 -9224
7313i224J6393N412J944M069Q373j724P015j0024q794q363R798n774j1991j4710
$$ -9224 7169 12581 14525 18594 26967 25243 32258 22234 13440 5077 14875 9101 -2890 -17600
7299a7600P896n414K293J2026O693j582o103J0024P205p03J3972m844N293M073
$$ -17600 -9704 -15118 -12825 -799 5894 4312 -1791 8233 15438 14735 28707 23863 29156 33229
7285C3229n001j6711k3760m776r523J3360J0899j0865M19J0853L402M267K370
$$ 33229 28228 11517 -12243 -17019 -26542 -13182 -2283 -13148 -12729 -1876 1526 5793 8163
7272H163R060j5625j1409k458l451R818K391j0967N599K331o649J2177L7929M3294
$$ 8163 17223 1598 -9811 -12269 -15720 -5902 -3511 -14478 -8879 -6548 -13197 -1020 36909 80203
7258H0203L3631K7835j208l7494o0609o4762o998O750N053R725P748n736n863
$$ 80203 113834 141669 140461 102967 42358 -22404 -29402 -22652 -17599 -7874 -126 -5862 -11725
7245a1725L353N347p408l229r42R188Q566p867j156j535L281j826j139K2255M178
$$ -11725 -8372 -3025 -10433 -13662 -14604 -5416 3150 -4717 -5873 -7408 -4127 -5953 -7092 15163 19341
7230A9341r139n027J2776L237k888l93p90l992K041j1977k569J3238j1609n598
$$ 19341 10202 5175 17951 21188 18300 17907 17117 13125 15166 3189 620 13858 2249 -3349
7216c349j315q162k774J6487Q923l098K464N39j4798q026l13O181J1413L876J5252
$$ -3349 -4664 -12826 -15600 887 9810 6712 9176 9715 -5083 -13109 -13422 -7241 4172 8048 23300
7201B3300J9601r099r235J759j990N845j379N571j3955j7711r49N630n021N335
$$ 23300 42901 33802 24567 26326 24336 30181 28802 34373 20418 2707 1758 7388 2367 7702
7187G702J620M723o8j0986M049K904k387n492O56Q376N61j9739l363J3581L036
$$ 7702 9322 14045 13977 2991 7040 9944 7557 2065 2721 11097 11658 -8081 -11444 2137 5173
7172E173j063N179P909o87l778K221N447j0727L408J0495j2016j6760J5438P141
$$ 5173 4110 9289 17198 16511 12733 14954 20401 9674 13082 23577 11561 -5199 10239 17380
7158A7380j5524l545J2477L89j2242o604j3227N371P291Q314J7199M546N648q566
$$ 17380 1856 -1689 10788 11177 -1065 -7669 -20896 -15525 -8234 80 17279 21825 27473 18907
7144A8907k4970j3384J6635O857O110N626M776K344K656l306n961j0199Q521K92
$$ 18907 -6063 -19447 -2812 4045 10155 15781 20557 22901 25557 22251 16290 6091 14612 14904
7130A4904r63J289L633P774r529n597O890M286J2861L54j7817l498K689K019N78
$$ 14904 13941 15230 18863 26637 17108 11511 18401 22687 35548 35902 18085 14587 17276 19295 19873
7115A9873q489q479J0164K1503l443j9502p475L098J931J2075R907p001n734p163
$$ 19873 11384 2905 13069 34572 31129 11627 4152 7250 9181 21256 31163 24162 18428 11265
7101A1265J696M326o884J734j1381M382L649N94k3832j5175N037O874J3129Q754
$$ 11265 12961 17287 10403 12137 756 5138 8787 9381 -14451 -29626 -24589 -17715 -4586 4168
7087D168M607m654k3784K080J1226M998J4806m090j8057R252J0394J698M756j4256
$$ 4168 8775 4121 -19663 -17583 -6357 -1359 13447 9357 -8700 552 10946 12644 17400 3144
7073C144j116J4628K2l019n852l715r400P223O421J150J1615J7829l028P081o534
$$ 3144 2028 16656 16678 13659 7807 4092 -5308 1915 8336 9486 21101 38930 35902 42983 36449
7058C6449k4121q216M964j0505J039J2634N676r829M011r765j969M415n061j1744
$$ 36449 12328 4112 9076 -1429 -390 12244 17920 8091 12102 2337 368 4783 -278 -12022
7044a2022J0897K006M231J3318l449j2896m058k164q243J1462J424j1816M689
$$ -12022 -1125 881 5112 18430 14981 2085 -1973 -4137 -12380 -918 506 -11310 -6621
7031f621n80m279J2266N591J778J004j867j3164j5756O939J384Q780J9251J1821
$$ -6621 -7201 -11480 786 6377 8155 9159 7292 -5872 -21628 -14689 -13305 -4525 14726 26547
7017B6547o150n89J877j1896K367K616J178m502L018p547o598r484r07J8032J2566
$$ 26547 20397 19808 21685 9789 12156 14772 15950 11448 14466 6919 321 -9163 -10070 7962 20528
7002B0528j1664L338j884m713N274l350L919J1258l764j2013J0848P780P52N185
$$ 20528 8864 12202 10318 5605 10879 7529 11448 22706 18942 6929 17777 25557 26309 31494
6988C1494q501j6095m858M023o719n125N700N97R45J0053j696l202m535l498M046
$$ 31494 22993 6898 2040 6063 -656 -5781 -81 516 1461 11514 9818 6616 2081 -1417 2629
6973B629j0744K823J6759N442K872L955j758m471j1588m186J2115n37J107R303
$$ 2629 -8115 -5292 11467 16909 19781 23736 21978 17507 5919 1733 13848 13311 14418 23721
6959B3721j130o315L858N367j5673L199Q80l390o89J0647q296j99N141J313J232
$$ 23721 22591 16276 20134 25501 9828 13027 13907 10517 9828 20475 12179 11980 17121 18434 19666
6944A9666n220k479M198p793r676j466j790J1639L912j2031L129N441K743k309
$$ 19666 14446 11967 16165 8372 -1304 -2770 -4560 7079 10991 -1040 2089 7530 10273 7964
6930G964o900m869o552J0566L573q037o899m087o686M594O355Q347K649N228L816
$$ 7964 1064 -3805 -10357 209 3782 -4255 -11154 -15241 -21927 -17333 -10978 -2631 18 5246 9062
6915I062M284R801J320l999N029N73q564l951j21j1186k502P172Q221o707O88
$$ 9062 13346 23147 24467 20468 25497 26070 17506 13555 13434 2248 -254 6918 15139 8432 9120
6900I120k201P958Q55j1599l30M271R388j511m768N433p281n033M158j052j2304
$$ 9120 6919 14877 15732 4133 3803 8074 17462 15951 11183 16616 9335 4302 8460 7408 -4896
6885d896K353O845j0090q011O10J4608O507q65Q79J1862m857m203j2688L618P966
$$ -4896 -2543 4302 -5788 -13799 -13189 1419 7926 7061 7940 19802 14945 10742 -1946 1672 9638
6870I638J1726O139j1892j4867L518Q284n922m367N368j7419N722J2036N59j0389
$$ 9638 21364 27503 15611 744 4262 12546 6624 2257 7625 -9794 -4072 7964 8523 -1866
6856a866r212R435O456j3579q431J9834K0847j4366j0456p598j0846R207O034
$$ -1866 -11078 -1643 4813 -8766 -17197 2637 23484 9118 -1338 -8936 -19782 -10575 -4541
6843d541J2557P681J3744j2591j3693q522p41j948l343O995J9847o17j106l453
$$ -4541 8016 15697 29441 16850 3157 -5365 -6106 -8054 -11397 -4402 15445 14828 13722 10269
6829A0269M02k340n652r055N40J276l589K438K181P395n484m973J4936J114J2827
$$ 10269 10671 8331 2679 -6376 -5836 -4560 -8149 -5711 -3530 3865 -1619 -6592 8344 9458 22285
6814B2285K857k107N521K650O55o278r680J950m772q239j2018J2443K5226J0612
$$ 22285 25142 23035 28556 31206 31861 25583 15903 17853 13081 4842 -7176 5267 30493 41105
6800D1105j5934j3833R03M774J7419Q910k9091j1338N337j7319L321P274Q077
$$ 41105 25171 11338 12241 17015 34434 43344 14253 2915 8252 -9067 -5746 1528 9605
6787I605q508j1912o287j0482o393J0398K95M784J6397O440l418M777j27N922
$$ 9605 1097 -10815 -17102 -27584 -33977 -23579 -23284 -18500 -2103 4337 919 5696 5569 11491
6773A1491m116j4268J7066M994R450l489r216L278N4M025J2109k671m798o202
$$ 11491 7375 -6893 10173 15167 24617 21128 11912 15190 15244 19269 31378 28707 23909 17707
6759A7707L42l043p165j366j0713r9J6513J242o070l034k065q475m754M569J9448
$$ 17707 18049 15006 7841 6475 -4238 -4337 12176 13418 7348 4314 2249 -6226 -10980 -6411 13037
6744A3037J6833n016N446p429r385r039L315J341J973P540L321k862j970K5465
$$ 13037 29870 24854 30300 22871 13486 4447 7762 9103 11076 18616 21937 19075 17105 42570
6730D2570m94M904j8044j8063m411K816M989o118J3010K120n404J7921j0761j4185
$$ 42570 42076 46980 28936 10873 6462 9278 14267 8149 21159 23279 17875 35796 25035 10850
6716A0850o028J178K016J669N875k614l40J904j5060K647N458j5516J0057J2523
$$ 10850 4822 6000 8016 9685 15560 12946 12606 14510 -550 2097 7555 -7961 2096 14619
6702A4619N614k943k218l586k883j1915j031M273j4259O573n966K220J0229J2322
$$ 14619 20233 17290 15072 11486 8603 -3312 -4343 -70 -14329 -7756 -13722 -11502 -1273 11049
6688A1049j1668j2813K405J3957j896j0129O658Q006n568J48N268L396L302o570
$$ 11049 -619 -13432 -11027 2930 1034 -9095 -2437 5569 1 149 5417 8813 12115 5545
6674E545p373J682N086J161j119k674j7487j8855Q304M169R082J7281k988j0328
$$ 5545 -1828 -146 4940 6101 4982 2308 -15179 -34034 -25730 -21561 -12479 4802 1814 -8514
6660h514L035L23L021J163M725j416J199p652j310K060r168J5473J2530L679k592
$$ -8514 -5479 -5156 -2135 -972 3753 2337 3536 -4116 -5426 -3366 -12534 2939 15469 19148 16556
6645A6556o894o236j4899M622j99J7361J0251j0735n369J478M822j4053o842L618
$$ 16556 9662 3426 -11473 -6851 -7050 10311 20562 9827 4458 5936 10758 -3295 -10137 -6519
6631f519R0m506j1249P640J0794K218M869J2161L086m662Q16j0358O61k164P813
$$ -6519 -6429 -10935 -22184 -14544 -3750 -1532 3337 15498 18584 13922 14738 4380 5041 2877 10690
6616A0690K7l716r371n891J1976o74j2599j521n348q934J3129J5672Q375L108
$$ 10690 10717 7001 -2370 -8261 3715 3041 -9558 -11079 -16427 -25361 -12232 3440 11815 14923
6602A4923j0407L07R755l98j1198l023j1123M881N618k781k895R764P382M337
$$ 14923 4516 4823 14578 14180 2982 -41 -11164 -6283 -665 -3446 -6341 3423 10805 15142
6588A5142j0038j2045j1571L601O759Q94J0015M23k020j554l59J1677p614j1550
$$ 15142 5104 -6941 -18512 -14911 -8152 -7258 2757 3180 1160 -394 -753 10924 3310 -8240
6574h240K238k679M811j71j594r840J4061K0289J3935J174r755k429j5728j0839
$$ -8240 -6002 -8681 -3870 -4041 -5635 -15475 -1414 18875 32810 33984 24229 21800 6072 -4767
6560d767J701N064K748N880m913n92r808j2120K451J785r081M70O487J0930J1273
$$ -4767 -3066 1998 4746 10626 5713 5121 -4687 -16807 -14356 -12571 -21652 -21182 -14695 -3765 7508
6545G508p249j3579q921m070l978J0111K1345o564j3810l380k551p08J3984J9156
$$ 7508 259 -13320 -22241 -26311 -30289 -20178 1167 -5397 -19207 -22587 -25138 -25846 -11862 7294
6531G294K0795K83j5865j802J1924j2257M59O867l11j5609j2016l584J4420j470
$$ 7294 28089 28372 12507 10705 22629 10372 10831 17698 17387 1778 -10238 -13822 598 -872
6517h72j7987M326P274P420K647q935q588L379J1684R299J3694K151n100q16q220
$$ -872 -18859 -14533 -7259 161 2808 -6127 -14715 -11336 348 9647 23341 25492 20392 19576 11356
6502A1356k1444l063l054N466L752j2050n72J5084k816P38o914J356M278j3908
$$ 11356 -10088 -13151 -16205 -10739 -6987 -19037 -19609 -4525 -7341 -6603 -13517 -12161 -7883 -21791
6488b1791P151J5135J2498l782M802p862j3761K898Q442L171n459M473k246r526
$$ -21791 -14640 495 12993 9211 14013 6151 -7610 -4712 3730 6901 1442 5915 3669 -5857
6474e857j2386n080J754J530j0964K3338K8495o98l745J2207l39j3341k904p374
$$ -5857 -18243 -23323 -21569 -20039 -31003 -7665 20830 20132 16387 28594 28255 14914 12010 4636
6460D636j6732r290M882O651j448M290k85N861P890k322n544J2017l369j1245
$$ 4636 -12096 -21386 -16504 -9853 -11301 -7011 -7296 -1435 6455 4133 -1411 10606 7237 -4008
6446d008j42p871j3765O802J3539J2042N671j1552j2325L288R07J4953P672N540
$$ -4008 -4150 -12021 -25786 -18984 -5445 6597 12268 716 -11609 -8321 -7414 7539 15211 20751
6432B0751Q828p443j3604p701p654J582N655R866j619j3917j5988J1912N268m350
$$ 20751 29579 22136 8532 831 -6823 -5241 414 10280 8661 -5256 -21244 -9332 -4064 -8414
6418h414k292r83N594L94M78K262m927M201O399N562K824N371j5270j0566L681
$$ -8414 -10706 -11689 -6095 -5701 -5223 -2961 -7888 -3687 2712 8274 11098 16469 1199 -9367 -5686
6403e686J0327Q021j277p280q68m837j100n718N933r076k167o866q265M636J0365
$$ -5686 4641 12662 11385 4105 3237 -1600 -2700 -8418 -2485 -11561 -13728 -20594 -28859 -24223 -13858
6388a3858K260n525j1666k444J5437J855R542m649j051P40l560M131J830M074
$$ -13858 -11598 -17123 -28789 -31233 -15796 -13941 -4399 -9048 -10099 -9359 -12919 -8788 -6958 -2884
6374b884m658K2113N902O474M62j4779r356o477M667N101o45k1026M960N140K634
$$ -2884 -7542 14571 20473 26947 27409 12630 3274 -3203 1464 6565 5920 -15106 -10146 -5006 -2372
6359b372L845j091L525m875j4569n428K319J3483J2222j0816j4530O216O559r794
$$ -2372 1473 382 3907 -968 -15537 -20965 -18646 -5163 7059 -3757 -18287 -12071 -5512 -15306
6345a5306j533J0518Q129l321K610m234l070j6M289N108j500j1914j5355K47J3888
$$ -15306 -16839 -6321 1808 -1513 1097 -3137 -6207 -6223 -1934 3174 1674 -10240 -25595 -25348 -11460
6330a1460K9597J0896j3118j7885j0263L150k873m174k895j650K354J2087n62
$$ -11460 18137 29033 15915 -1970 -12233 -9083 -11956 -16130 -19025 -20675 -18321 -6234 -6796
6317f796l163j0143J0974O907O333m403k447l602m335R625J2396K630M926J467
$$ -6796 -9959 -20102 -9128 -2221 4112 -291 -2738 -6340 -10675 -1050 11346 13976 18902 20369
6303B0369J673j5456j451J3559L058p206j1997J4n142p870R539N439k742j573
$$ 20369 22042 6586 5135 18694 21752 14546 2549 2563 -2579 -10449 -910 4529 1787 214
6289B14J2409O885P73J333r180o159K069j0919J215K246l414m16J5548J9274r088
$$ 214 12623 19508 20281 21614 12434 6275 8344 -2575 -1360 886 -2528 -2944 12604 31878 22790
6274B2790j4990q808j7658J4640J6342Q518q896N308k307j5911p998M572q24n521
$$ 22790 7800 -1008 -18666 -4026 12316 20834 11938 17246 14939 -972 -8970 -4398 -5222 -10743
6260a0743r74k585l116J2776K416P528L758L723J2615o044j4908k3144J1431J4412
$$ -10743 -11717 -14302 -17418 -4642 -2226 5302 9060 12783 25398 19354 4446 -18698 -7267 7145
6246G145l210k620J0937n04m5j7135r806J876o386m080N934N063K146P602l840
$$ 7145 3935 1315 12252 11748 11703 -5432 -15238 -13362 -19748 -23828 -17894 -12831 -10685 -3083 -6923
6231f923j936O71q91n439j2878q68J0271J7721l405j3083j1550q174R861J5973
$$ -6923 -8859 -8188 -9079 -14518 -27396 -28264 -17993 -272 -3677 -16760 -28310 -36484 -26623 -10650
6217a0650M276J057m36N578j63J191k081M896j889j860q305j0996j611L156K56
$$ -10650 -6374 -5317 -5753 -175 -338 853 -1228 3668 1779 -81 -8386 -19382 -20993 -17837 -17581
6202a7581L872N274J1263J4095j1892l067O295J0218j0670j2088j5934k4818J088
$$ -17581 -13709 -8435 2828 16923 5031 1964 8259 18477 7807 -4281 -20215 -45033 -43945
6189d3945J6791Q741J4556J7688J120p775j0511j590Q294L275K739Q461O21l87
$$ -43945 -27154 -18413 -3857 13831 14951 7176 -3335 -4925 3369 6644 9383 17844 18465 18078
6175A8078n994j9118j0026M941J1226K206j1189m031N728p16L505P168J2722n767
$$ 18078 12084 -7034 -17060 -12119 -893 1313 -9876 -13907 -8179 -8895 -5390 1778 14500 8733
6161H733p501r105n72r29O457j336Q571K2237l173q852J0949P25k098j3105m793
$$ 8733 1232 -7873 -8445 -9374 -2917 -4253 4318 26555 23382 14530 25479 26204 24106 11001 6208
6146F208O496M09K518K637p866k7048n649J5035R079N329J0589K905L091l498
$$ 6208 12704 13113 15631 18268 10402 -16646 -22295 -7260 1819 7148 17737 20642 23733 20235
6132B0235j1985m639o291n579P340k09k51m836Q663J4000k137Q19J136m139l83
$$ 20235 8250 3611 -2680 -8259 -919 -1128 -1379 -6215 2448 16448 14311 15130 16266 12127 11744
6117A1744j0410p466J633l563p829j0850J0176J0121J0470P073o835j1372R224
$$ 11744 1334 -6132 -4499 -8062 -15891 -26741 -16565 -6444 4026 11099 4264 -7108 2116
6104B116J380N538M913Q781n056q925j2924J1190j3514n007J2891O42j871j0800
$$ 2116 3496 9034 13947 22728 17672 8747 -4177 7013 -6501 -11508 1383 2025 154 -10646
6090a0646o964P852R504k973N479Q696n804K647P901R403m797j0282j5534p006
$$ -10646 -17610 -9758 -254 -3227 2252 10948 5144 7791 15692 25095 20298 10016 -5518 -12524
6076a2524J0581Q825J208m042j042k635r282P730K682m581l618N173P043r377
$$ -12524 -1943 6882 8090 4048 3006 371 -8911 -1181 1501 -3080 -6698 -1525 5518 -3859
6062c859o818L655p570j0766k609M64K417J8341Q267q989j7347O344R307J179
$$ -3859 -10677 -7022 -14592 -25358 -27967 -27503 -25086 -6745 1522 -7467 -24814 -18470 -9163 -7984
6048g984J4432k685J027n23p543J424J1859L039L920l377k590l636j934j753q267
$$ -7984 6448 3763 4790 4267 -3276 -1852 10007 13046 16966 13589 10999 7363 5429 3676 -4591
6033d591K93J704j0169n20P449K0873K303p476o807o336r652m224J1691R033r298
$$ -4591 -4298 -2594 -12763 -13283 -5834 15039 17342 9866 3059 -3277 -12929 -17153 -5462 3571 -5727
6018e727p85N038R984j0621l326n048L990j1270j4183P300J4272R051k9K386L510
$$ -5727 -6512 -1474 8510 -2111 -5437 -10485 -6495 -17765 -31948 -24648 -10376 -1325 -1354 1032 4542
6003D542N343J254l9o291j5862r334J0328J3387j0883K533o022O526J0170o302
$$ 4542 9885 11139 11100 4809 -11053 -20387 -10059 3328 -7555 -5022 -11044 -4518 5652 -650
5989f50q810o648J1894Q649K561P092j9412n357M59j762J1042N439o008Q69q431
$$ -650 -9460 -16108 -4214 4435 6996 14088 -5324 -10681 -10222 -11984 -942 4497 -1511 -642 -9073
5974i073p65P07R250J3495k266k745q684P849J2340J958j0202n669j461p445P068
$$ -9073 -9838 -9131 119 13614 11348 8603 -81 7768 20108 22066 11864 6195 4734 -2711 4357
5959D357R125L18k208j132q641J4434L807Q56k426p641n829J174p898l735L498
$$ 4357 13482 13800 11592 10460 1819 16253 20060 20916 18490 10849 5020 6194 -1704 -5439 -1941
5944a941l47L52Q41P289Q664l980l631J963O333O687j666p490j2295r118M57J1515
$$ -1941 -2288 -1936 -1095 6194 14858 10878 7247 9210 15543 22230 20564 13074 779 -8339 -7882 3633
5928C633J0424m82r520m850q95N867J0700k655o284l789L042M114O141L061m949
$$ 3633 14057 13575 4055 -795 -1690 4177 14877 12222 5938 2149 5191 9305 15446 18507 13558
5913A3558j1006n91o241j1446M722P503j5208l005j92J1784J2851p02N820m142
$$ 13558 2552 1961 -4280 -15726 -11004 -3501 -18709 -21714 -21906 -10122 2729 2027 7847 3705
5899C705j1837P810k062j1015j0321m67L201K3047K1072N59J828j0474o841P843
$$ 3705 -8132 -322 -2384 -13399 -23720 -24187 -20986 2061 23133 23692 25520 15046 8205 16048
5885A6048N485p901j9013k045M603P812k324P98L778P31Q048J4453q338j7505
$$ 16048 21533 13632 -5381 -7426 -2823 4989 2665 3463 7241 7972 16020 30473 22135 4630
5871D630k0211j8270K8626J3546l794j9821j3598n399J6203J2419j0893J6191
$$ 4630 -15581 -33851 -5225 8321 4527 -15294 -28892 -34291 -18088 -5669 -16562 -371
5859c71M642O329L744K811m904J020q356q155l080N631J7552o38j5606N133M042
$$ -371 4271 10600 14344 17155 12251 13271 4915 -3240 -6320 -689 16863 16225 619 5752 9794
5844I794J148R98k1797j042K854J487K003j3958k373J1603p89r873J3731N242
$$ 9794 10942 11940 -9857 -10899 -8045 -6558 -4555 -18513 -20886 -9283 -10072 -19945 -6214 -972
5830i72l801r514r41R468M706M211l653N734n690j0580p901J627J193j1693O036
$$ -972 -4773 -14287 -15228 -5760 -1054 3157 -496 5238 -452 -11032 -18933 -17306 -16113 -27806 -21770
5815b1770K3905J095o891l102j0855k791K1129N289j645J4071j069J0908j467
$$ -21770 2135 3230 -3661 -6763 -17618 -20409 720 6009 4364 18435 17366 28274 26807
5802B6807l0489j4674j0619j9108K825L738R348L0067K1922j2196j7445k510O101
$$ 26807 -3682 -18356 -28975 -48083 -45258 -41520 -32172 -2105 19817 7621 -9824 -12334 -6233
5789f233J3183L276j949j237K955J217M106j0501k6725j661Q177J1092J2260j142
$$ -6233 6950 10226 8277 7040 9995 11212 15318 4817 -21908 -23569 -15392 -4300 7960 6818
5775F818o370j4223q28m830K32P665r170p01J9447K1124P793j1603j6796k4mK969
$$ 6818 448 -13775 -14603 -19433 -19201 -11536 -20706 -21407 -1960 19164 26957 15354 -1442 -1466 -1470 1499
5759A499n826l078P661N063O448J246j511j1718J177N662N373r642j492M251j3831
$$ 1499 -4327 -7405 256 5319 11767 13013 11502 -216 961 6623 11996 2354 862 5113 -8718
5744h718R563Q765j0744j3349O262J1170N857j4112l021n80O061J0150l043j3205
$$ -8718 845 9610 -1134 -14483 -8221 2949 8806 -5306 -8327 -8907 -2846 7304 4261 -8944
5730h944j419J2829L285l061p916J0238N420o945k615n273J3458R114o136r141
$$ -8944 -10363 2466 5751 2690 -5226 5012 10432 3487 872 -4401 9057 18171 12035 2894
5716B894p899n71k059p466j664J678o719J0823R290q362m238p428K416L589J1027
$$ 2894 -5005 -5576 -7635 -15101 -16765 -15087 -21806 -10983 -1693 -10055 -14293 -21721 -19305 -15716 -4689
5701d689J892l218J224q00r298R11L872Q921M749n498k3J1491M986p546j816Q42
$$ -4689 -2797 -6015 -4791 -5591 -14889 -13978 -10106 -1185 3564 -1934 -1957 9534 14520 6974 5158 6000
5685F000L3L637J2823O84m466o493o003p938j924j200N925M782J0561O523q662
$$ 6000 6033 9670 22493 23177 18711 12218 6215 -1723 -3647 -4847 1078 5860 16421 22944 14282
5670A4282l581P537N456k97k040j4269o395l958M280L902n414R165j399o050Q293
$$ 14282 10701 18238 23694 23397 21357 7088 693 -3265 1015 4917 -497 8668 7269 1219 9512
5655I512j4300o335L642J7475L793r002J198R518o260j3550n060J043R806Q540
$$ 9512 -4788 -11123 -7481 9994 13787 4785 5983 15501 9241 -4309 -9369 -8326 1480 10020
5641A0020N308r229k378N02p164n141J1139L581J730k73K768k317M846o703j9680
$$ 10020 15328 6099 3721 4223 -2941 -8082 3057 6638 8368 8095 10863 8546 13392 6689 -12991
5626a2991o208J3364L300M234M705K574j534J175n019R315k274k355K890L20O413
$$ -12991 -19199 -5835 -2535 1699 6404 8978 7444 8619 3600 12915 10641 8286 11176 11496 17909
5611A7909m836p770l040q300j4113l711K1925N549j230Q406q474j0685k987J3192
$$ 17909 13073 5303 2263 -6037 -20150 -23861 -1936 3613 2383 10789 2315 -8370 -11357 1835
5597A835p16J4304l395j255k854j2307l000k156J989P404K0712P411j704M27j4645
$$ 1835 1119 15423 12028 10773 7919 -4388 -7388 -9544 -7555 -151 20561 27972 26268 26695 12050
5582A2050j4947N02J5133R577K206l361r626o621N97J0705k618r600K33L72J803
$$ 12050 -2897 -2395 12738 22315 24521 21160 11534 4913 5510 16215 13597 3997 4230 4602 6405
5567F405P199R78j677M086j4266L316j342n742l783J2955J905j1073j2995o917
$$ 6405 13604 14582 12905 16991 2725 6041 4699 -1043 -4826 8129 10034 -1039 -14034 -20951
5553b0951J3799J1315P234L757N22o450o510l890p203k842J1025q12j6937L435
$$ -20951 -7152 4163 11397 15154 15676 9226 2716 -1174 -8377 -11219 -194 -1006 -17943 -14508
5539a4508O111J7786J4853q615k4285j5383N810M600n526K837l708P046N519R54
$$ -14508 -8397 9389 24242 15627 -8658 -24041 -18231 -13631 -19157 -16320 -20028 -12982 -7463 -6509
5525f509j0140o544M684J1097J704k869j1223j257J674J2992l408J566Q843J779
$$ -6509 -16649 -23193 -18509 -7412 -5708 -8577 -19800 -21057 -19383 -6391 -9799 -8233 610 2389
5511B389O872J516J1186M619J82r188r983j0088q238q771J6328L16o577M428L959
$$ 2389 9261 10777 21963 26582 26764 17576 7593 -2495 -10733 -19504 -3176 -2860 -9437 -5009 -1050
5496a050j3329K738J972M539O038P92o12M430L853j0513j2233p771n999K784K4398
$$ -1050 -14379 -11641 -9669 -5130 908 1700 1088 5518 9371 -1142 -13375 -21146 -27145 -24361 37
5481C7L442q571o948N076J4103M998n27J7688J1624n126j6327j5217q409L938
$$ 37 3479 -5092 -12040 -6964 7139 12137 11610 29298 40922 35796 19469 4252 -4157 -219
5467b19R020j2949k73J578l609J293k070R292k649j2793k088K439P392J0927N334
$$ -219 8801 -4148 -4421 -2843 -6452 -5159 -7229 2063 -586 -13379 -15467 -13028 -5636 5291 10625
5452A0625N62l078j830J733K149n587K653m072o614M590N779k992r526n092R502
$$ 10625 11187 8109 6279 8012 10161 4574 7227 3155 -3459 1131 6910 3918 -5608 -10700 -1198
5437a198P273j5703j2240J1085K533J060R689r511j194O101q322p760N775J8807
$$ -1198 6075 -9628 -21868 -10783 -8250 -7190 2499 -7012 -8206 -2105 -10427 -18187 -12412 6395
5423F395J6443J1533k852n353j267j1691n726n684R478Q593q025o090J677j0856
$$ 6395 22838 34371 31519 26166 24899 13208 7482 1798 11276 19869 11844 5754 7431 -3425
5409c425N181M637m967M594J0614K893J2762J0134m519j9521p7j0558o205L709
$$ -3425 1756 6393 1426 6020 16634 19527 32289 42423 37904 18383 18306 7748 1543 5252
5395E252r08r586n457k486J990j023j374O544j1235P405J3901n027q452R641J1655
$$ 5252 4344 -5242 -10699 -13185 -11195 -12218 -13592 -7048 -18283 -10878 3023 -2004 -10456 -815 10840
5380A0840q981j6543j7405M697J5856M678N790J6920l731r10n089N360j0178J92
$$ 10840 1859 -14684 -32089 -27392 -11536 -6858 -1068 15852 12121 11211 6122 11482 1304 1496
5366A496j574j3522r424O291K4389j172n205J459j7880k1420n83J6212J4347P914
$$ 1496 -78 -13600 -23024 -16733 7656 6484 1279 2738 -15142 -36562 -37145 -20933 -6586 1328
5352A328N249q93p023M842M579O869l457R411p991j0260l481k410N55L634O559
$$ 1328 6577 5684 -1339 3503 8082 14951 11494 20905 12914 2654 -827 -3237 -2682 952 7511
5337G511N294n64j3445J870N251J2049J280k6505m352J4865R684J501l81j2237
$$ 7511 12805 12241 -1204 666 5917 17966 19246 -7259 -11611 3254 12938 14439 14058 1821
5323A821J7144k641o426j3118o17K734O470J5693j0366J043r450j2162j2763o006
$$ 1821 18965 16324 9898 -3220 -3837 -1103 5367 21060 10694 11737 2287 -9875 -22638 -28644
5309b8644J668q725K419M974m809O434J3576M538l91n434O675R436l177O298O360
$$ -28644 -26976 -35701 -33282 -28308 -33117 -26683 -13107 -8569 -8960 -14394 -7719 1717 -1460 4838 11198
5294A1198P20l134j1082n386P642J6264M818n159j4790j0185j0178l06M536J0372
$$ 11198 11918 8784 -2298 -7684 -42 16222 21040 15881 1091 -9094 -19272 -19578 -15042 -4670
5280d670j610m333l450R915K618j4464j0689r269J6182J8912J491o784o775j5921
$$ -4670 -6280 -10613 -14063 -4148 -1530 -15994 -26683 -35952 -19770 -858 633 -6151 -12926 -28847
5266b8847k504j769R000K0536J4258M580q999r372M192j1536q684P221k259j238
$$ -28847 -31351 -33120 -24120 -3584 10674 15254 6255 -3117 1075 -10461 -19145 -11924 -14183 -15421
5252a5421o982O275J2224k297J0875J0333o410q621O722L403k773J944J470j0149
$$ -15421 -22403 -16128 -3904 -6201 4674 15007 8597 -24 6698 10101 7328 9272 10742 593
5238E93M76J8823J6211q964j4267j7069m283Q464k757J4R573n888j2352P824m178
$$ 593 1069 19892 36103 27139 12872 -4197 -8480 -16 -2773 -2759 6814 926 -11426 -3602 -7780
5223g780N13l853R817K3495P456j1178m57q432q285o279P451l054L073Q36N945
$$ -7780 -7267 -11120 -1303 22192 29648 18470 18013 9581 1296 -4983 2468 -586 2487 3323 9268
5208I268O598k443o673J0152o302k2752j0747J1553J1412m65l112O670K037o189
$$ 9268 15866 13423 6750 16902 10600 -12152 -22899 -11346 66 -399 -3511 3159 5196 -993
5194i93r25P620O066J262o297J603K252j4789j129J805M965k388o111J0744Q019
$$ -993 -1918 5702 11768 13030 6733 8336 10588 -4201 -5330 -3525 1440 -948 -7059 3685 11704
5179A1704j0847l204o059p252J2487R833l691N28p170M457k509J400M06J572q201
$$ 11704 857 -2347 -8406 -15658 -3171 6662 2971 3499 -3671 786 -1723 -323 83 1655 -6546
5164f546o115n947O032J4438n673p008J5122O609l370N06J1411o736q310r794
$$ -6546 -12661 -18608 -12576 1862 -3811 -10819 4303 10912 7542 8048 19459 12723 4413 -5381
5150e381j0624K2175K1226j8237j4250M636j097o736Q043k269N137n065L085o655
$$ -5381 -16005 6170 27396 9159 -5091 -455 -1552 -8288 -245 -2514 2623 -2442 643 -6012
5136f012L477Q562q538L204N886q053l474k299R558L119o686j2222n79N358l508
$$ -6012 -2535 6027 -2511 693 6579 -1474 -4948 -7247 2311 5430 -1256 -13478 -14057 -8699 -12207
5121a2207j1436O333N302o970p511n773J5626P189J478M089K146m94j603P552
$$ -12207 -23643 -17310 -12008 -18978 -26489 -32262 -16636 -9447 -7969 -3880 -1734 -2228 -3831 3721
5107C721j5m447l33j233r190M578k228p009J109R759M197k877K326l113J3221
$$ 3721 3706 -741 -1074 -2307 -11497 -6919 -9147 -16156 -15047 -5288 -1091 -3968 -1642 -4755 8466
5092H466o27M66J791m045P127l210m500R721K204j4156m278k527r720k417M672
$$ 8466 7839 8305 10096 6051 13178 9968 5468 15189 17393 3237 -1041 -3568 -13288 -15705 -11033
5077a1033N845K427m437N331p29k422J269L221m971l729P249P042L080K931P382
$$ -11033 -5188 -2761 -7198 -1867 -2596 -5018 -3749 -528 -5499 -9228 -1979 5063 8143 11074 18456
5062A8456p860L19m778o248j4406p31J4333m96O994k543M980m13n487K428P553
$$ 18456 10596 10915 6137 -111 -14517 -15248 -915 -1411 5583 3040 8020 7607 2120 4548 12101
5047A2101K685m851j6955j356K294j400P263J3016m912J3089M475j0841k3152
$$ 12101 14786 9935 -7020 -8376 -6082 -7482 -219 12797 7885 20974 25449 14608 -8544
5034h544q237K0024R831j0472j0262K964q956n087N834P579J600N474p84p065
$$ -8544 -16781 3243 13074 2602 -7660 -4696 -13652 -18739 -12905 -5326 -3726 1748 964 -6101
5020f101p277J936J4963Q408q831k649l022n438J328P656l862o065J4630Q814
$$ -6101 -13378 -11442 3521 11929 3098 449 -2573 -8011 -6683 973 -2889 -8954 5676 14490
5006A4490j1147l990p869N637J3570M841R95p752R800J4394r872p249k712o442
$$ 14490 3343 -647 -8516 -2879 10691 15532 16527 8775 18575 32969 23097 15848 13136 6694
4992F694j3080N590K890r675j1483J8398K2131M001q826j603M905P035l462n224
$$ 6694 -6386 -796 2094 -7581 -19064 -666 21465 25466 16640 15037 19942 26977 23515 18291
4978A8291L89P829j8404j4400l649N998K1075N764R21j13j0532j5241j9738j2952
$$ 18291 18680 26509 8105 -6295 -9944 -3946 17129 22893 23814 23701 13169 -2072 -21810 -34762
4964c4762J1419M827J1879O301J2825Q484J443p16O545r863n244j2663r198r88
$$ -34762 -23343 -18516 -6637 -336 12489 20973 22416 21700 28245 18382 13138 475 -8723 -9711
4950i711K516N160q38N759j735O707J780j0055j4925J455R435J2649R125J926
$$ -9711 -7195 -2035 -2873 2886 1151 7858 9638 -417 -15342 -13887 -4452 8197 17322 19248
4936A9248j9665j0720N071J3274K600j2462j145J5347m113k3611O776j766j4589
$$ 19248 -417 -11137 -6066 7208 9808 -2654 -3799 11548 7435 -16176 -9400 -11166 -25755
4923b5755J044L210M114M714J1263K0820o636r271l228k853p58M023m475L085
$$ -25755 -24711 -21501 -17387 -12673 -1410 19410 12774 3503 275 -2578 -3336 687 -3788 -703
4909g03j143j1201o667K8085N942k137J2247j1171j5749n897J5418J350j4683
$$ -703 -1846 -13047 -19714 8371 14313 12176 24423 13252 -2497 -8394 7024 8374 -6309
4896f309j1564o122J712M36P57N183q680J8185O915k720J779J975p948n398N50
$$ -6309 -17873 -23995 -22283 -21847 -21090 -15907 -24587 -6402 513 -2207 -428 1547 -6401 -11799 -11249
4881a1249R171L524m901J4672J399k914j1311K783k222p180P60k747J2668P11
$$ -11249 -2078 1446 -3455 11217 12616 9702 -1609 1174 -1048 -8228 -7468 -10215 2453 3164
4867C164j323L706j073j5839J539O083J1652J9346q775j7850o094J653R370J6369
$$ 3164 1841 5547 4474 -11365 -9826 -3743 7909 27255 18480 630 -5464 -3811 5559 21928
4853B1928q845j0581n815J933L023m264q088j40l741K507M313J716n320K628J129
$$ 21928 13083 2502 -3313 -1380 1643 -2621 -10709 -10849 -14590 -12083 -7770 -6054 -11374 -8746 -7617
4838g617p544R947R362R463j5812q172J219o619K013R974J0613k296P215J0276
$$ -7617 -15161 -5214 4148 13611 -2201 -10373 -9154 -15773 -13760 -3786 6827 4531 11746 22022
4824B2022j7005N99Q647j1115n690Q907J228L015m959j0201p710n936j8817N681
$$ 22022 5017 5616 14263 3148 -2542 6365 7593 10608 5649 -4552 -12262 -18198 -37015 -31334
4810c1334N667J3300N34P806R271M314p181j2184j2428R665J0674J0955p842j1856
$$ -31334 -25667 -12367 -11833 -4027 5244 9558 2377 -9807 -22235 -12570 -1896 9059 1217 -10639
4796a0639N09j600J570J0227m473j1040j1528O793n8R120O825n373r38j3046n37
$$ -10639 -10130 -11730 -10160 67 -4406 -15446 -26974 -20181 -20239 -11119 -4294 -9667 -10605 -23651 -24188
4781b4188Q942J3337P448p777q851J108K4977J0576j6480l139R504j0876q160
$$ -24188 -15246 -1909 5539 -2238 -11089 -9981 14996 25572 9092 5953 15457 4581 -3579
4768c579Q807J2020J0530J373j3462o22o192j6309k188J120N190m308o542N13
$$ -3579 5228 17248 27778 29151 15689 15067 8875 -7434 -9622 -8502 -3312 -7620 -14162 -13649
4754a3649O080P357K980j144j5432R25j7243l750K0009J9491R390m002j7170p220
$$ -13649 -7569 -212 2768 1624 -13808 -12883 -30126 -33876 -13867 5624 15014 11012 -6158 -13378
4740a3378M478o473r741k629L121J3374k237M879R861J8477J7357o925j5460j6260
$$ -13378 -8900 -15373 -25114 -27743 -24622 -11248 -13485 -8606 1255 19732 37089 30164 14704 -1556
4726a556J1465N058j3073k826k407l960r75k882k263N793R247j56l125R693o07
$$ -1556 9909 14967 1894 -932 -3339 -7299 -8274 -11156 -13419 -7626 1621 1465 -1660 8033 7426
4711G426j3191o715O427J6274m27q002j6179j923M350L788j1162O534P736P929
$$ 7426 -5765 -12480 -6053 10221 9794 1792 -14387 -16310 -11960 -8172 -19334 -12800 -5064 2865
4697B865q086R15P301r445j1980j457k297j0991k258N032N917J8350J0080J0324
$$ 2865 -5221 -4306 2995 -6450 -18430 -19887 -22184 -33175 -35433 -30401 -24484 -6134 3946 14270
4683A4270l456j4744J5976J1399j1097j1782j8326k839L425J06J3989J6058p362
$$ 14270 10814 -3930 12046 23445 12348 566 -17760 -20599 -17174 -17068 -3079 12979 5617
4670E617j0918l224R190L584N181k556N015L549r542o511q078p124J512O375P301
$$ 5617 -5301 -8525 665 4249 9430 6874 11889 15438 5896 -615 -8693 -15817 -14305 -7930 -629
4655f29j169r059N949L858J4130j142j2578r420l198L700l189K619K964j3524
$$ -629 -1798 -10857 -4908 -1050 13080 11938 -640 -10060 -13258 -9558 -12747 -10128 -7164 -20688
4641b0688o208R077P526P858l592O060K134R74j57M831p776l091J094l65P464
$$ -20688 -26896 -17819 -10293 -2435 -6027 33 2167 3141 2984 7815 39 -3052 -1958 -2323 5141
4626E141j3064p32k762J798l040J3928O413L883j1004j100j3662J0205O790j2833
$$ 5141 -7923 -8655 -11417 -9619 -12659 1269 7682 11565 561 -539 -14201 -3996 2794 -10039
4612a0039q534J984Q757O681o77j3370k536n130K0476J771r888k693Q063J6799
$$ -10039 -18573 -16589 -7832 -1151 -1828 -15198 -17734 -22864 -2388 -617 -10505 -13198 -5135 11664
4598A1664L770M47j0332q589O569m197p361J669J8857L198O792Q342j326L102
$$ 11664 15434 15881 5549 -3040 3529 -668 -8029 -6360 12497 15695 22487 30829 29503 32605
4584C2605j6484j925N931k117p486J1499j45j2162l223k282j6455J2863O951r261
$$ 32605 16121 14196 20127 18010 10524 22023 21878 9716 6493 4211 -12244 619 7570 -1691
4570a691K69p185M875q95L55J1089J940j2707o481M069q505k4359p797M484O491
$$ -1691 -1422 -8607 -3732 -4627 -4272 6817 8757 -3950 -10431 -6362 -14867 -39226 -47023 -42539 -36048
4555c6048K3499j759l597o495J779o470q06J8904p144j339o188Q73J3898R445
$$ -36048 -12549 -14308 -17905 -24400 -22621 -29091 -29897 -10993 -18137 -19476 -25664 -24791 -10893 -1448
4541a448n435L527j824o869m149M58N865O954N18J2470J9467J1073M371k316p259
$$ -1448 -6883 -3356 -5180 -12049 -16198 -15740 -9875 -2921 -2403 10067 29534 40607 44978 42662 35403
4526C5403j7185m643P258l073r899p238J884J1556r190J99K211k667k868n368
$$ 35403 18218 13575 20833 17760 7861 623 2507 14063 4873 5072 7283 4616 1748 -3620
4512c620Q512J2148N241J273j7774n589J75M714J463J1407q462N601n657q345
$$ -3620 4892 17040 22281 23554 5780 191 366 5080 6543 17950 9488 15089 9432 1087
4498A087n109J0907m28O797K005K354m299r900j0067L110l061o061Q526K073m496
$$ 1087 -4022 6885 6457 13254 15259 17613 13314 3414 -6653 -3543 -6604 -12665 -4139 -2066 -6562
4483f562k038R648m741n180k21q172L101J1566J6828j0665j2718k676N286K152
$$ -6562 -8600 1048 -3693 -8873 -9094 -17266 -14165 -2599 14229 3564 -9154 -11830 -6544 -4392
4469d392n499n461P831J3623r118j2063Q885J836P082o432j6997N663J1536k299
$$ -4392 -9891 -15352 -7521 6102 -3016 -15079 -6194 -4358 2724 -3708 -20705 -15042 -3506 -5805
4455e805j3253l504l832P044O691J242l488J0308L180j036Q45n648j220j992M036
$$ -5805 -19058 -22562 -26394 -19350 -12659 -11417 -14905 -4597 -1417 -2453 -1608 -7256 -8476 -10468 -6432
4440f432J0603K419Q92j2083O259r776j3199O512J8801n415r742L738m887l254
$$ -6432 4171 6590 7482 -4601 1658 -8118 -21317 -14805 3996 -1419 -11161 -7423 -12310 -15564
4426a5564n05O388P01r933K753O100j677p417k344P161K917l392r339R083J2767
$$ -15564 -16069 -9681 -8980 -18913 -16160 -10060 -11737 -19154 -21498 -14337 -11420 -14812 -24151 -15068 -2301
4411b301O217R484n596j271L9j1397P326R851k045L176J1625l434j4707j5554
$$ -2301 3916 13400 7804 6533 6572 -4825 2501 12352 10307 13483 25108 21674 6967 -8587
4397h587p055o062j1093R189J4933M137L750L753Q428M016M536r332p530l706
$$ -8587 -15642 -21704 -32797 -23608 -8675 -4538 -788 2965 11393 15409 19945 10613 3083 -623
4383f23N190J35p525j3792j2267N038N926J935l046L209K2325J7202M687K215
$$ -623 4567 4702 -2823 -16615 -28882 -23844 -17918 -15983 -19029 -15820 6505 23707 28394 30609
4369C0609j3857k139Q650l726l458j1371j9075P64K1841J3398P29j1990M327P049
$$ 30609 16752 14613 23263 19537 16079 4708 -14367 -13603 8238 21636 22365 10375 14702 21751
4355B1751L209m932j5774j1321Q309l702M138Q47k455j1392O356K0059J7363J4694
$$ 21751 24960 20028 4254 -7067 1242 -2460 1678 2525 70 -11322 -4966 15093 32456 47150
4341D7150N699L621r410n571j0341j4728k504K188m285q003M541r092j0708l109
$$ 47150 52849 56470 47060 41489 31148 16420 13916 16104 11819 3816 8357 -735 -11443 -14552
4327a4552J463K181K087M63j0679K509P610K218l810P067J1436M581j648o684
$$ -14552 -13089 -10908 -8821 -8358 -19037 -16528 -8918 -6700 -10510 -3443 7993 12574 10926 4242
4313D242n990l785J3731M156J505r365j4821L274L080p764l274m959M531M014
$$ 4242 -1748 -5533 8198 12354 13859 4494 -10327 -7053 -3973 -11737 -15011 -19970 -15439 -11425
4299a1425q66L347J1090l222n856J0641K195j1291m108k986j0631Q01J2963R323
$$ -11425 -12291 -8944 2146 -1076 -6932 3709 5904 -5387 -9495 -12481 -23112 -22311 -9348 -25
4285b5k345N106P486K751J095j4595P508j560N602K179l460n741N347J741L536
$$ -25 -2370 2736 10222 12973 14068 -527 6981 5421 11023 13202 9742 4001 9348 11089 14625
4270A4625m938j714K387M328M232L761L902j0868j3194K761m373R58O983Q1q891
$$ 14625 9687 7973 10360 14688 18920 22681 26583 15715 2521 5282 909 1867 8850 8931 40
4255D0l526j923R67l738o066N060l379j3407J3714J5524J4581J30o839l42k449
$$ 40 -3486 -5409 -4442 -8180 -14246 -9186 -12565 -25972 -12258 3266 17847 17977 11138 10796 8347
4240H347j3236J445J0704L447p222j1955j6810n040J8887j485m526J888N157J6563
$$ 8347 -4889 -3444 7260 10707 3485 -8470 -25280 -30320 -11433 -12918 -17444 -15556 -10399 6164
4226F164K027m14k434r783j8075J2290J6854Q722n385m760o448J0332M499k304
$$ 6164 8191 7777 5343 -4440 -22515 -10225 6629 15351 9966 5206 -1242 9090 13589 11285
4212A1285n491K463j0456k811O650o698j875L784j187N118j4527o236L680R172
$$ 11285 5794 8257 -2199 -5010 1640 -5058 -6933 -3149 -4336 782 -13745 -19981 -16301 -7129
4198g129p38l814J418j3887l249n880j500K0286P108J625n932J7044J4760n130
$$ -7129 -7867 -11681 -10263 -24150 -27399 -33279 -34779 -14493 -7385 -5760 -11692 5352 20112 14982
4184A4982j0102j1361P509O383l514q676P07O417K603n621q179n278J8334K054
$$ 14982 4880 -6481 1028 7411 3897 -4779 -4072 2345 4948 -673 -8852 -14130 4204 6258
4170F258p264q037J1851K256j5496n678r101J240J0424J2345J7691O235k2123
$$ 6258 -1006 -9043 2808 5064 -10432 -16110 -25211 -23971 -13547 -1202 16489 22724 601
4157F01P299K448P309n243k788j2002l575J423P95J2840N248r973Q52K173r380
$$ 601 7900 10348 17657 12414 9626 -2376 -5951 -4528 -3733 9107 14355 4382 5234 7407 -1973
4142a973l558L607P433p626j990l440j1839J2928N231o294m376p406L349n270
$$ -1973 -5531 -1924 5509 -2117 -4107 -7547 -19386 -6458 -1227 -7521 -11897 -19303 -15954 -21224
4128b1224l19j155Q63J7120J0418N486l527p111J185K133o487j3328j1008J463
$$ -21224 -21543 -22698 -21835 -4715 5703 11189 7662 551 1736 3869 -2618 -15946 -26954 -25491
4114b5491M901K487N585k8p783k688Q608J147O87K190P884O001j274N509Q012
$$ -25491 -20590 -18103 -12518 -12546 -20329 -23017 -14409 -13262 -12575 -10385 -2501 3500 2226 7735 15747
4099A5747p63J327q976j0845J0561p396r361p287r708l442K2141N768j2597P607
$$ 15747 14984 16311 7335 -3510 7051 -345 -9706 -16993 -26701 -30143 -8002 -2234 -14831 -7224
4085g224N930j0090R083j332j1206l226J1758J2152Q15l653j186N229o780n979
$$ -7224 -1294 -11384 -2301 -3633 -14839 -18065 -6307 5845 6660 3007 1821 7050 270 -5709
4071e709J1019J3567k922n701j7947m946K828R333Q59q502l90J8084J2637k952
$$ -5709 5310 18877 15955 10254 -7693 -12639 -9811 -478 381 -8121 -8511 9573 22210 19258
4057A9258N387k5460j0905k734O133l296M895L266l013k336L648N417N338o148
$$ 19258 24645 -815 -11720 -14454 -8321 -11617 -6722 -3456 -6469 -8805 -5157 260 5598 -550
4043e50j1155j374J0064m931k913K956J7895j850j1759n489J095M116N786P243
$$ -550 -11705 -13079 -3015 -7946 -10859 -7903 9992 8142 -3617 -9106 -8011 -3895 1891 9134
4029I134K468j5648p437N900k478l19p89m523P069j1872j0267j3763J0571J6054
$$ 9134 11602 -4046 -11483 -5583 -8061 -8380 -9169 -13692 -6623 -18495 -28762 -42525 -31954 -15900
4015a5900o187j4297N13M980J1966J0530J985M501J250l301J3379P223j3884j4310
$$ -15900 -22087 -36384 -35871 -30891 -18925 -8395 -6410 -1909 -659 -3960 9419 16642 2758 -11552
4001a1552j0396Q028J5384R0M693j5329j4270l996o183k00R951N395O088J9770
$$ -11552 -21948 -13920 1464 1554 6247 -9082 -23352 -27348 -33531 -33731 -23780 -18385 -12297 7473
3987G473J1985p049j4627K851r454j889N192j0216j0146J3604P262J146q797o709
$$ 7473 19458 12409 -2218 633 -8821 -10710 -5518 -15734 -25880 -12276 -5014 -3868 -12665 -19374
3973a9374j1663N693R610l83R558R099J3582m269j2130r310k435j717L984O81
$$ -19374 -31037 -25344 -15734 -16117 -6559 2540 16122 11853 -277 -9587 -12022 -13739 -9755 -9074
3959i074L137l598M273L332J2776Q548j111J0133m820P567R028R182j5384k0643
$$ -9074 -5937 -9535 -5262 -1930 10846 19394 18283 28416 23596 31163 40191 49373 33989 13346
3945A3346j3778K038J2132n16j0346p085N030K21j1121J0579m868r795O008l420
$$ 13346 -432 1606 13738 13222 2876 -4209 821 1042 -10079 500 -4368 -14163 -8155 -11575
3931a1575Q030L956J5705N939j3458m96k43j3362n780M797N127M873j147j0141
$$ -11575 -3545 411 16116 22055 8597 8101 7858 -5504 -11284 -6487 -1360 3513 2366 -7775
3917g775J451K3606R34m728o89l880r124q084Q15J0528J3678L839j273j9479j8013
$$ -7775 -6324 17282 18216 13488 12799 8919 -205 -8289 -7474 3054 16732 20571 19298 -181 -18194
3902a8194j937m886N091J1050N823O319n025k309j0319n902l401M684k219J297
$$ -18194 -20131 -25017 -19926 -8876 -3053 3266 -1759 -4068 -14387 -20289 -23690 -19006 -21225 -19928
3888a9928L974J0242J1493k486j6245l261p23O530P687J205j0563q696m900O194
$$ -19928 -15954 -5712 5781 3295 -12950 -16211 -16934 -10404 -2717 -1512 -12075 -20771 -25671 -19477
3874a9477P617j4206J497J8209Q423L448Q116k186j3961q669Q095J773j381k221
$$ -19477 -11860 -26066 -24569 -6360 2063 5511 13627 11441 -2520 -11189 -3094 -1321 -2702 -4923
3860d923l103l713Q990L599P826J7726m132j0694j946O489O240k3516j1077J0864
$$ -4923 -8026 -11739 -2749 850 8676 26402 22270 11576 9630 16119 22359 -1157 -12234 -1370
3846a370J210K796L323O99J808o214j2775k557l008k541N465L772k485r98j0230
$$ -1370 -160 2636 5959 6658 8466 2252 -10523 -13080 -16088 -18629 -13164 -9392 -11877 -12875 -23105
3831b3105K0063r673L735J9342j3862r027J929J0074K372j0038J426m000J2703
$$ -23105 -3042 -12715 -8980 10362 -3500 -12527 -10598 -524 1848 -8190 -6764 -10764 1939
3818A939L088k759L206j895J435j0206q005n452M955j3457p720J858J6280M795
$$ 1939 5027 2268 5474 3579 5014 -5192 -13197 -18649 -13694 -27151 -34871 -33013 -16733 -11938
3804a1938J0014J4561K413j7295j4306R396J0638n9L99m80J874j4961p043J3612
$$ -11938 -1924 12637 15050 -2245 -16551 -7155 3483 3424 3823 3343 5217 -9744 -16787 -3175
3790c175Q154o47J0015j969j0623j0847N597j824J617P803J416j896l083R794
$$ -3175 4979 4332 14347 12378 1755 -9092 -3495 -5319 -3702 4101 5517 3621 538 10332
3776A0332m222m603O065J8984j3475k7933p24J9172j776j836J3569K7j925p34
$$ 10332 6110 1507 7572 26556 13081 -14852 -15576 3596 1820 -16 13553 13580 11655 10921
3762A0921M257L617j5447p790r42k242r073J2690M085j3713m428n86N212K966
$$ 10921 15178 18795 3348 -4442 -5384 -7626 -16699 -4009 76 -13637 -18065 -18651 -13439 -10473
3748a0473O395K2J7260L448j3765K749L914l014K827m915j2909l198J9837P373
$$ -10473 -4078 -4056 13204 16652 2887 5636 9550 6536 9363 4448 -8461 -11659 8178 15551
3734A5551j6235q791P66k445n416k269N803N65N582Q148J659j369m698P398P572
$$ 15551 -684 -9475 -8709 -11154 -16570 -18839 -13036 -12471 -6889 1259 2918 1549 -3149 4249 11821
3719A1821j2070j0557p895N292J4546o935M359j705n1p278j390J0575k990j7269
$$ 11821 -249 -10806 -18701 -13409 1137 -5798 -1439 -3144 -3195 -10473 -11863 -1288 -4278 -21547
3705b1547L464N252N299n69j162L297O971P746J6215L346j7057j2273K261O860
$$ -21547 -18083 -12831 -7532 -8101 -9263 -5966 1005 8751 24966 28312 11255 -1018 1243 8103
3691H103M378j5072J454j203R70K73k709K9N46J4297j1274j7650k745q403q84
$$ 8103 12481 -2591 -1137 -2340 -1370 -1097 -3806 -3777 -3231 11066 -208 -17858 -20603 -29006 -29890
3676b9890Q011O700j696k809Q252j941J6354J8069P894j765j1525l02j577p764
$$ -29890 -21879 -15179 -16875 -19684 -11432 -13373 2981 21050 28944 27179 15654 15352 13775 6011
3662F011J0373k915j1381l239j190l796P251J1676m60J207J470j1114q222m831
$$ 6011 16384 13469 2088 -1151 -2341 -6137 1114 12790 12330 13537 15007 3893 -4329 -9160
3648i160K090k63m527L751J0361j3550j926J66L020J1762R72m669p186N124Q145
$$ -9160 -7070 -7333 -11860 -8109 2252 -11298 -13224 -13058 -10038 1724 2696 -1973 -9159 -4035 4110
3633D110j1276n771J4611Q411L794j4300j1471N713o202R990M804m559k410N447
$$ 4110 -7166 -12937 1674 10085 13879 -421 -11892 -6179 -12381 -2391 2413 -2146 -4556 891
3619H91k644Q504L690L624K669j1226j0588m369J3872Q992O570k428J82M151j0470
$$ 891 -1753 6751 10441 14065 16734 5508 -5080 -9449 4423 13415 19985 17557 17739 21890 11420
3604A1420J1179N225j3410l698j2527o086K210j160n8Q820j0053k262M385K294
$$ 11420 22599 27824 14414 10716 -1811 -7897 -5687 -6847 -6905 1915 -8138 -10400 -6015 -3721
3590c721n027J0892M841Q373K605p208P095J228m419r036R15O418K60k022j3807
$$ -3721 -8748 2144 6985 15358 17963 10755 17850 19078 14659 5623 6538 12956 13216 11194 -2613
3575b613M417K096k074J4595L877m510N319P664m585q088m944m638n344r451q859
$$ -2613 1804 3900 1826 16421 20298 15788 21107 28771 24186 16098 11154 6516 1172 -8279 -17138
3560a7138N390P659K241Q033J0327K624j4699j1522J2245O636L82p664P414l697
$$ -17138 -11748 -4089 -1848 6185 16512 19136 4437 -7085 5160 11796 12178 4514 11928 8231
3546H231L035m97M466l287j7433r717Q026J2881N648M74r229j6670r310k288j288
$$ 8231 11266 10769 15235 11948 -5485 -15202 -7176 5705 11353 11827 2598 -14072 -23382 -25670 -26958
3531b6958M673J6342L696q291J2769r05j0605M6r386j5459J4041N588j121q294
$$ -26958 -22285 -5943 -2247 -10538 2231 1326 -9279 -9233 -18619 -34078 -20037 -14449 -15570 -23864
3517b3864o301L354M833L146J628P4P722N721N093j5702n015N214Q458J0493Q06
$$ -23864 -30165 -26811 -21978 -18832 -17204 -17130 -9408 -3687 1406 -14296 -19311 -14097 -5639 4854 5660
3502E660l531M101N201l834j5070j2152m790l368j478L55J2194m217M901l56J541
$$ 5660 2129 6230 11431 7597 -7473 -19625 -24415 -27783 -29261 -28906 -16712 -20929 -16028 -16384 -14843
3487a4843n843j0502J1722O368N36m772j5999m263J0155J8877J150r70n883m802
$$ -14843 -20686 -31188 -19466 -13098 -12562 -17334 -33333 -37596 -27441 -8564 -7414 -8384 -14267 -19069
3473a9069j3793J197R506J1029Q725l179J246p032j3427n164J4622R945R143R975
$$ -19069 -32862 -31665 -22159 -11130 -2405 -5584 -4338 -11370 -24797 -29961 -15339 -5394 3749 13724
3459A3724o857j1854k141m172o516J3641J927J3189M242o938n642L553N477K540
$$ 13724 6867 -4987 -7128 -11300 -17816 -4175 -2248 10941 15183 8245 2603 6156 11633 14173
3445A4173J715n307j7929Q85J467j342P045N412O410r085K685J3406M210k9381
$$ 14173 15888 10581 -7348 -6463 -4996 -6338 707 6119 12529 3444 6129 19535 23745 -5636
3431e636k2202M096J0842p778j885L083L067L835Q26L737r84M059o527Q284J0667
$$ -5636 -27838 -23742 -12900 -20678 -22563 -19480 -16413 -12578 -11752 -8015 -8999 -4940 -11467 -3183 7484
3416G484j4180q447J023k052m084P152j429N508q3j0945K025R250R394J5507m786
$$ 7484 -6696 -15143 -14120 -16172 -20256 -13104 -14533 -9025 -9108 -20053 -18028 -8778 616 16123 11337
3401A1337p99r555o360o140l554O116R514J0168k842K013j2511M53p086q90j265
$$ 11337 10538 983 -5377 -11517 -15071 -8955 559 10727 7885 9898 -2613 -2160 -9246 -10136 -11401
3386a1401N709j40m271J294p087r554J18J080N598O404J2688O82j766m121J0209
$$ -11401 -5692 -5832 -10103 -8809 -15896 -25450 -25332 -24252 -18654 -12250 438 1120 -646 -4767 5442
3371E442m963l016r393J837J1222j0478J2201o30j3606l882l093R981J6221j0399
$$ 5442 479 -2537 -11930 -10093 1129 -9349 2852 2222 -11384 -15266 -18359 -8378 7843 -2556
3357b556j5745N955P710L675j2130o059M523l534P98R994K354j0938j1775j172
$$ -2556 -18301 -12346 -4636 -961 -13091 -19150 -14627 -18161 -17363 -7369 -5015 -15953 -27728 -28900
3343b8900N997Q002L469p484J8156M550N586N579j6470J772N099o159j2214Q825
$$ -28900 -22903 -14901 -11432 -18916 -760 3790 9376 14955 -1515 257 5356 -803 -13017 -4192
3329d192J9846J4157O44r405j961l235r834q776j6119m106r233J1511J5144o550
$$ -4192 15654 29811 30455 21050 19089 15854 6020 -2756 -18875 -22981 -32214 -20703 -5559 -12109
3315a2109J070o466N927J555q202Q627O934P816O793r455p44J636M099j3660j1910
$$ -12109 -11039 -17505 -11578 -10023 -18225 -9598 -2664 5152 11945 2490 1746 3382 7481 -6179 -18089
3300a8089r982R189j075K281J096R372j441l516M953n891l92J106J0175Q177P888
$$ -18089 -28071 -18882 -19957 -17676 -16580 -7208 -8649 -12165 -7212 -13103 -13495 -12389 -2214 5963 13851
3285A3851j2016j371j6634K763J2092o223J996o298j28L610o266J915j832M104
$$ 13851 1835 464 -16170 -13407 -1315 -7538 -5542 -11840 -11968 -8358 -14624 -12709 -14541 -10437
3271a0437l886r272O58K0882j618k2150j0166J0417R530K118P697m967m343K168
$$ -10437 -14323 -23595 -22937 -2055 -3673 -25823 -35989 -25572 -16042 -13924 -6227 -11194 -15537 -13369
3257a3369m522m483J6344R592M461Q326M618p330p398k009J864K75r842j5442
$$ -13369 -17891 -22374 -6030 3562 8023 16349 20967 13637 6239 4230 6094 6369 -3473 -18915
3243a8915q288O291M45N345K523J8780j0673o960o113j322J8134J9652n073q797
$$ -18915 -27203 -20912 -20467 -15122 -12599 6181 -4492 -11452 -17565 -18887 -753 18899 13826 5029
3229E029m242Q437l474O557j8721j4024P178P164J2850O286j4877j1521m668J2113
$$ 5029 787 9224 5750 12307 -6414 -20438 -13260 -6096 6754 13040 -1837 -13358 -18026 -5913
3215e913J6561K865M204j0024r270j23j852J1701j931j517j052k0798j109Q235
$$ -5913 10648 13513 17717 7693 -1577 -1700 -3552 8149 6218 4701 3649 -17149 -18258 -10023
3201a0023n32n729m249N332P502J9426R786p191j4750j025J119J1380j2638Q513
$$ -10023 -10555 -16284 -20533 -15201 -7699 11727 21513 14322 -428 -1453 -334 11046 -1592 6921
3187F921K328n879q273K873Q432p279j2323k2998J521J0002Q58O116p379o682
$$ 6921 9249 3370 -4903 -2030 6402 -877 -13200 -36198 -34677 -24675 -23817 -17701 -25080 -31762
3173c1762M793K1119J3762J555n735p365j1157K70N943o883m844o042R956R301
$$ -31762 -26969 -5850 7912 9467 3732 -3633 -14790 -14520 -8577 -15460 -20304 -26346 -16390 -7089
3159g089l114J1468P637P685q472k973j2258o726N971J5792N399M755O55j123
$$ -7089 -10203 1265 8902 16587 8115 5142 -7116 -13842 -7871 7921 13320 18075 18730 17607
3145A7607j2866j012j5350j1985P767J538q084m824O420P026K289M445Q491j0311
$$ 17607 4741 3729 -11621 -23606 -15839 -14301 -22385 -27209 -20789 -13763 -11474 -7029 1462 -8849
3131h849m61P201l577L146p429m300J871q68k975J3292K0438j453q173N710n281
$$ -8849 -9310 -2109 -5686 -2540 -9969 -14269 -12398 -13266 -16241 -2949 17489 16036 7863 13573 8292
3116H292m907J1369m381q588l304M1J0201j3636j5387L444J2258l826J2050O823
$$ 8292 3385 14754 10373 1785 -1519 -1478 8723 -4913 -20300 -16856 -4598 -8424 3626 10449
3102A0449o037n468m262J4707j0426p391m09K961K32K633M901L375m960L408J9713
$$ 10449 4412 -1056 -5318 9389 -1037 -8428 -8837 -5876 -5644 -3011 1890 5265 305 3713 23426
3087B3426J4706O064l09p094k6180k4389j896J2677R581r454k1923m556O823O140
$$ 23426 38132 44196 43887 36793 10613 -13776 -15672 -2995 6586 -2868 -24791 -29347 -22524 -16384
3073a6384J0124O687l408q510J1516J6960K64j9974j9154m360K5179J4580K929
$$ -16384 -6260 427 -2981 -11491 25 16985 17249 -2725 -21879 -26239 -1060 13520 16449
3060A6449j3455m983K3053L273j7951p926N189j135R17Q642k018r32j0172n333
$$ 16449 2994 -1989 21064 24337 6386 -1540 3649 2514 3431 12073 10055 9123 -1049 -6382
3046f382n111J3217K098J339m750o730K102P946j889L11j1176J465M443j5152
$$ -6382 -11493 1724 3822 5161 411 -6319 -4217 3729 1840 2151 -9025 -7560 -3117 -18269
3032a8269j3360K2251K898r78j5989N810j326p763R074J0817J048q499M381o76
$$ -18269 -31629 -9378 -6480 -7458 -23447 -17637 -18963 -26726 -17652 -6835 -5787 -14286 -9905 -10581
3018a0581Q69j3162l077O480K943J7148O525K015o216k153P052J2353o265N25
$$ -10581 -9712 -22874 -25951 -19471 -16528 620 7145 9160 2944 791 7843 20196 13931 14456
3004A4456Q339j2862q099L442j421k822K904Q21j5034m972K708J8623J1573m529
$$ 14456 22795 9933 1834 5276 3855 1033 3937 4758 -10276 -15248 -12540 6083 17656 13127
2990A3127nm464n646l601k030R174P138j82j2668m090p11l332L428p144j1251
$$ 13127 13122 8658 3012 -589 -2619 6555 13693 13511 843 -3247 -3958 -7290 -3862 -11006 -22257
2975b2257j1037J740K185N237J7750n325L370M327j578K219P969j085p68L750
$$ -22257 -33294 -31554 -29369 -24132 -6382 -11707 -8337 -4010 -5588 -3369 4600 3515 2747 6497
2961F497L413L128K206K649j1626j3782o106j466J3781L95j28j2164J0600O574
$$ 6497 9910 13038 15244 17893 6267 -7515 -13621 -15087 -1306 -911 -1039 -13203 -2603 3971
2947C971P417L077O249j1587L124J141j6169q785J2180p753k6533R27J1641J5159
$$ 3971 11388 14465 20714 9127 12251 13392 -2777 -11562 618 -7135 -33668 -32741 -21100 -5941
2933e941N774K060J2690J560p328j0887j4286K189J1426j959R660J773q7j308
$$ -5941 -167 1893 14583 16143 8815 -2072 -16358 -14169 -2743 -4702 4958 6731 6644 5336
2919E336j1963j3280q696J588K912M187J057J717K258L853j083r027L724J7P892
$$ 5336 -6627 -19907 -28603 -27015 -24103 -19916 -18859 -17142 -14884 -11031 -12114 -21141 -17417 -17400 -9508
2904i508J2514P512j4236l538L300l426K90K832N326Q987L617L57k342l95J2906
$$ -9508 3006 10518 -3718 -7256 -3956 -7382 -7092 -4260 1066 10053 13670 14027 11685 11290 24196
2889B4196P884j3444j7611j3917R727J1553J1441L25r694K598J671J482l255j5321
$$ 24196 32080 18636 1025 -12892 -3165 8388 19829 20154 10460 13058 14729 16211 12956 -2365
2875b365J068j813l988M693j134l573J0288N674o472K144Q370l284o539M471O716
$$ -2365 -1297 -3110 -7098 -2405 -3539 -7112 3176 8850 2378 4522 12892 9608 3069 7540 14256
2860A4256Q347r794k7542J340J0068k475K442N55J3147M802k37k335j5696J053
$$ 14256 22603 12809 -14733 -13393 -3325 -5800 -3358 -2803 10344 15146 14909 12574 -3122 -2069
2846b069O541J0501K024j1401q979J403J017n427j817N439l447L686N511q895
$$ -2069 4472 14973 16997 5596 -3383 -1980 -963 -6390 -8207 -2768 -6215 -2529 2982 -5913
2832e913J893N132l551j6747l150L173K2102J5255L4M558m672q480J809Q492k50
$$ -5913 -4020 1112 -2439 -19186 -22336 -19163 2939 18194 18228 22786 18114 9634 11443 19935 19685
2817A9685K292j1761j7958R110J1140q554k184J141o114m023J2401L917j2830
$$ 19685 21977 10216 -7742 1368 12508 3954 1770 2911 -3203 -7226 5175 9092 -3738
2804c738j361j5982J907P844M608J2382R843O390l492p515j4111K496K808P117
$$ -3738 -5099 -21081 -19174 -11330 -6722 5660 15503 21893 18401 10886 -3225 -729 2079 9196
2790I196J3266q954r611o856m400J061M339J0127j715r267n572k753L476K0131
$$ 9196 22462 13508 3897 -2959 -7359 -6298 -1959 8168 6453 -2814 -8386 -11139 -7663 12468
2776A2468q77j7701q714L601q329L249O897J0924o068j0982m152M560O979K277
$$ 12468 11591 -6110 -14824 -11223 -19552 -16303 -9406 1518 -4550 -15532 -19684 -15124 -8145 -5868
2762e868j904q259J4996J0779j0018N382K3183j948r050l681j4967j5029K11J0100
$$ -5868 -7772 -16031 -1035 9744 -274 5108 28291 26343 17293 13612 -1355 -16384 -16173 -6073
2748f073J1118M48j6554O03Q898O861j697j686J0193R024o60p939k1419M91p558
$$ -6073 5045 5493 -11061 -10458 -1560 5301 3604 1918 12111 21135 20475 12536 -8883 -8392 -15950
2733a5950j941O228n862Q473j217M625J4011m151o528o542J1333k525p615j232
$$ -15950 -17891 -11663 -17525 -9052 -10269 -5644 8367 4216 -2312 -8854 2479 -46 -7661 -8893
2719h893p483j2987J009J243K1275K4034p01l352O446j1224j2356j299k674j14
$$ -8893 -16376 -29363 -28354 -27111 -5836 18198 17497 14145 20591 9367 -2989 -4288 -6962 -7076
2705g076k886J4505j556j3182J759J8432J0077m544p872Q378q219J6111P203p486
$$ -7076 -9962 4543 2987 -10195 -8436 9996 20073 15529 7657 16035 7816 23927 31130 23644
2691B3644r675j1539q758j4173O669J9949J601p859K023K943l591m859J760r156
$$ 23644 13969 2430 -6328 -20501 -13832 6117 7718 -141 1882 4825 1234 -3625 -1865 -11021
2677a1021J0922J1869o088j4555O493m658l851Q811l625q038J2080J8384Q912
$$ -11021 -99 11770 5682 -8873 -2380 -7038 -10889 -2078 -5703 -13741 -1661 16723 25635
2664B5635o063j2413j5102j712l114O546R548p830O999J1530Q352L715j2073j6548
$$ 25635 19572 7159 -7943 -9655 -12769 -6223 3325 -4505 2494 14024 22376 26091 14018 -2530
2650b530j3533P220L519m792k591L978L608o706J1658Q037o021n615O048l734
$$ -2530 -16063 -8843 -5324 -10116 -12707 -8729 -5121 -11827 -169 7868 1847 -3768 2280 -1454
2636a454j990P378Q264k5l287r718j576J439J4084Q486O053M87r234j3784k0076
$$ -1454 -3444 3934 12198 12173 8886 -832 -2408 -969 13115 21601 27654 28141 18907 5123 -14953
2621a4953q90N484L438M57P253J3097m767L002M938P725k761o982r292q714L75
$$ -14953 -15843 -10359 -6921 -6464 789 13886 9119 12121 17059 24784 22023 15041 5749 -2965 -2590
2606b590j220K88J0141j6031l522j656M281n208P363P432k555r334p952K759j536
$$ -2590 -3810 -3522 6619 -9412 -12934 -14590 -10309 -15517 -8154 -722 -3277 -12611 -20563 -17804 -19340
2591a9340O592J4589N534l29J529q83O631p979n352N094n593p449J454K2800P360
$$ -19340 -12748 1841 7375 7046 8575 7692 14323 6344 992 6086 493 -6956 -5502 17298 24658
2576B4658j911m579N169p766o906j9979K253J1044Q768J1971P452r818n899p375
$$ 24658 22747 18168 23337 15571 8665 -11314 -9061 1983 10751 22722 30174 20356 14457 7082
2562G082k480k631l973n911L72N238Q76n625M436J64k618J542p17o038n550n717
$$ 7082 4602 1971 -2002 -7913 -7541 -2303 -1427 -7052 -2616 -2452 -5070 -3528 -4245 -10283 -15833 -21550
2546b1550N398P98M42J0544J0480K034r604j6043n693J582Q110J1282k434j2255
$$ -21550 -16152 -15354 -14912 -4368 6112 8146 -1458 -17501 -23194 -21612 -13502 -2220 -4654 -16909
2532a6909J0281J1957n96q030P236N73j2396p289J3815K946O751R92j2611r067
$$ -16909 -6628 5329 4733 -3297 3939 4512 -7884 -15173 -1358 1588 8339 9331 -3280 -12347
2518a2347J121J5057o556j276R300J717K269k041L555J581q254m096J504l355
$$ -12347 -11226 3831 -2725 -4001 5299 7016 9285 7244 10799 12380 4126 30 1534 -1821
2504a821Q841P338j4531J599n31J872J6743Q343r264j0705q044p569Q349J5284
$$ -1821 7020 14358 -173 1426 895 2767 19510 27853 18589 7884 -160 -7729 620 15904
2490A5904q088O031j946j2405k269M168O435p725m694O312n525j2028n317P627
$$ 15904 7816 13847 11901 -504 -2773 1395 7830 105 -4589 1723 -3802 -15830 -21147 -13520
2476a3520K3834P715p157j5766l362P633J3662q671p432Q34Q565K979j976P008
$$ -13520 10314 18029 10872 -4894 -8256 -623 13039 4368 -3064 -2230 6335 9314 7338 14346
2462A4346j6282p967j948J2839O545J196j7987k144L40l911p891p818J377J1779
$$ 14346 -1936 -9903 -11851 988 7533 8729 -9258 -11402 -11062 -14973 -22864 -30682 -29305 -17526
2448a7526J3512Q948J2953o619L015p238r720J2389j9892q425N460K2391K521
$$ -17526 -4014 4934 17887 11268 14283 7045 -2675 9714 -10178 -18603 -13143 9248 11769
2435A1769L222j3218r836N828o772K041M542P447K3279o92j5332j8192J1385J1194
$$ 11769 14991 1773 -8063 -2235 -9007 -6966 -2424 5023 28302 27610 12278 -5914 5471 16665
2421A6665L137l440j2922q719J4354J3286o194n911j509o70r903j7814j28J2781
$$ 16665 19802 16362 3440 -5279 9075 22361 16167 10256 8747 8077 -1826 -19640 -19768 -6987
2407f987J3852J0755r492J622J2028j199o06m187r343N342N857P744r98j0616
$$ -6987 6865 17620 8128 9750 21778 20579 19973 15786 6443 11785 17642 25386 24388 13772
2393A3772L38p09j1703r479j4237K337N953J8336r958l177J0172p23k867L206
$$ 13772 14110 13401 1698 -7781 -22018 -19681 -13728 4608 -5350 -8527 1645 922 -1945 1261
2379A261J5922O241p082j3605n879j725q616j3074m322K349J6299O35k889P504
$$ 1261 17183 23424 16342 2737 -3142 -4867 -13483 -26557 -30879 -28530 -12231 -11596 -14485 -6981
2365f981P333J7N518j0221m606O66R513p138p049K19m041m985j57J838J4312Q268
$$ -6981 352 369 5887 -4334 -8940 -8274 1239 -5899 -12948 -12729 -16770 -21755 -21912 -20074 -5762 2506
2349B506q03p475N753O294r39l339J231k008k630P353r220l830l685M379J3802
$$ 2506 1703 -5772 -19 6275 5336 1997 3228 1220 -1410 5943 -3277 -7107 -10792 -6413 7389
2334G389M71r928r795O941J1698R586p364L6j3643k102q237n080N894O526p991
$$ 7389 7860 -2068 -11863 -4922 6776 16362 8998 9034 -4609 -6711 -14948 -20028 -14134 -7608 -15599
2319a5599n316N617o95n717O425l68O006K509J1596R149j320K142J962j7366l581
$$ -15599 -20915 -15298 -15993 -21710 -15285 -15653 -9647 -7138 4458 13607 12287 14429 16391 -975 -4556
2304d556p47J925L205N017j892K293o348j4271L903k252R05n35R974Q626N978
$$ -4556 -5303 -3378 -173 4844 2952 5245 -1103 -15374 -11471 -13723 -12818 -13353 -3379 5247 11225
2289A1225N486m136m136m50r899q970L742L621k233m239J4097K424o857L383l015
$$ 11225 16711 12575 8439 7989 -1910 -10880 -7138 -3517 -5750 -9989 4108 6532 -325 3058 43
2274D3m87M324o736J1513m343j0909n844J4168O871m579N713m413k3262l329N376
$$ 43 -444 3880 -2856 8657 4314 -6595 -12439 1729 8600 4021 9734 5321 -17941 -21270 -15894
2259a5894M738P011L509N451K122L050l718j485l60r800R05R843m353J750N571
$$ -15894 -11156 -4145 -636 4815 6937 9987 6269 4784 4424 -5376 -4471 5372 1019 2769 8340
2244H340j5268l171R997L059j322k3924N99J8713l283n217Q848L140n897k0530
$$ 8340 -6928 -10099 -102 2957 1635 -22289 -21690 -2977 -6260 -11477 -2629 511 -5386 -25916
2230b5916M307R531M604J2599K4666j897j0728k4103N106L109j0380m821R396
$$ -25916 -21609 -12078 -7474 5125 29791 27894 17166 -6937 -1831 1278 -9102 -13923 -4527
2217d527Q125L138r987m546K749Q899j0461j442l91M457N864j1794n187K082K382
$$ -4527 3598 6736 -3251 -7797 -5048 3851 -6610 -8052 -8443 -3986 1878 -9916 -15103 -13021 -10639
2202a0639R077K852o519L967Q263p662l617q338K0580Q246l053j0446m294j900
$$ -10639 -1562 1290 -5229 -1262 7001 -661 -4278 -12616 7964 16210 13157 2711 -1583 -3483
2188c483M731M558M613R73k756O418J836j972m970j465O750K886k534L504j1313
$$ -3483 1248 5806 10419 11392 8636 15054 16890 14918 9948 8483 15233 18119 15585 19089 7776
2173G776l908L259l620Q209r182j0743O28J961l929m309r683J8895J8018k063
$$ 7776 3868 7127 3507 11716 2534 -8209 -7581 -5620 -9549 -13858 -23541 -4646 13372 11309
$$ [...]
##END NTUPLES=NMR SPECTRUM
##END=
