##TITLE=Analysis number 326624
Compound Code cc 59546
Book Reference 508/48
Project Code adrs
Chemist Name antons
##JCAMPDX= 6.0         $$ Bruker NMR JCAMP-DX V2.0
##DATA TYPE= NMR SPECTRUM
##DATA CLASS= NTUPLES
##ORIGIN= Bruker BioSpin GmbH
##OWNER= nmr
$$ XWIN-NMR		Version 3.5
$$ Thu Feb 15 13:24:14 2007 GMT Standard Time (UT+0h)  MAYBRIDGE\nmr@NMR_250MHZ
##.OBSERVE FREQUENCY= 250.131544655141
##.OBSERVE NUCLEUS= ^1H
##.ACQUISITION MODE= SIMULTANEOUS (DQD)
##.ACQUISITION SCHEME= undefined
##.AVERAGES= 16
##.DIGITISER RES= 18
##SPECTROMETER/DATA SYSTEM= dpx250
##.PULSE SEQUENCE= zg30
##.SOLVENT NAME= CDCl3
##.SHIFT REFERENCE= (INTERNAL, CDCl3, 0, 16.522)
##AUDIT TRAIL= $$ (NUMBER, WHEN, WHO, WHERE, WHAT)
$$ ##TITLE= Audit trail, XWIN-NMR		Version 3.5
$$ ##JCAMPDX= 5.01
$$ ##ORIGIN= Bruker BioSpin GmbH
$$ ##OWNER= nmr
$$ C:\u/data/dgb/nmr/ADRS/1020/pdata/1/auditp.txt
$$ ##AUDIT TRAIL=  $$ (NUMBER, WHEN, WHO, WHERE, WHAT)
(   1,<2007-02-15 13:23:53.00 +000>,<MAYBRIDGE\nmr>,<NMR_250MHZ>,
      <created by zg, POWCHK disabled, PULCHK disabled
       configuration hash MD5:
       49 4B E0 1D 92 C2 6B 37 9F E6 65 BC 52 41 86 1D
       data hash MD5: 64K
       7F 95 8F B0 9E 60 34 5F C5 1F 03 D2 26 53 D6 BC>)
(   2,<2007-02-15 13:24:05.22 +000>,<MAYBRIDGE\nmr>,<NMR_250MHZ>,
      <Start of raw data processing
       ef LB = 0.3 FT_mod = 6 PKNL = 1 SI = 32K 
       data hash MD5: 32K
       2F 8D 5E 5C 56 FC DD 9B 7B B0 F7 8D CA 26 6F B9>)
(   3,<2007-02-15 13:24:07.19 +000>,<MAYBRIDGE\nmr>,<NMR_250MHZ>,
      <apk 
       data hash MD5: 32K
       51 B0 B4 40 CE 57 39 8E EB 27 69 46 D4 56 23 53>)
(   4,<2007-02-15 13:24:07.94 +000>,<MAYBRIDGE\nmr>,<NMR_250MHZ>,
      <abs ABSG = 5 
       data hash MD5: 32K
       19 86 83 92 B3 99 00 3C 66 C8 B3 17 E1 B1 9B AD>)
$$ ##END=
$$ 
$$ hash MD5
$$ 5C E0 5C 5F 4A C6 54 71 F5 E4 59 0C C6 3B CD BC
##$RELAX= 
##$RELAX= 
##$RELAX= 
##$RELAX= 
##$RELAX= 
##$RELAX= 
##$RELAX= 
$$ Bruker specific parameters
$$ --------------------------
##$DU= <C:\u>
##$EXPNO= 1020
##$NAME= <ADRS>
##$PROCNO= 1
##$TYPE= <nmr>
##$USER= <dgb>
##$AMP= (0..31)
100 100 100 100 100 100 100 100 100 100 100 100 100 100 100 100 100 100 
100 100 100 100 100 100 100 100 100 100 100 100 100 100 
##$AQSEQ= 0
##$AQ_mod= 3
##$AUNM= <au_zg>
##$AUTOPOS= <43 >
##$BF1= 250.13
##$BF2= 250.13
##$BF3= 250.13
##$BF4= 250.13
##$BF5= 500.13
##$BF6= 500.13
##$BF7= 500.13
##$BF8= 500.13
##$BYTORDA= 1
##$CFDGTYP= 0
##$CFRGTYP= 5
##$CHEMSTR= <none>
##$CNST= (0..31)
1 1 145 1 1 1 1 1 1 1 1 1 1 1 1 1 1 1 1 1 1 1 1 1 1 1 1 1 1 1 1 1 
##$CPDPRG= <>
##$CPDPRG1= <>
##$CPDPRG2= <>
##$CPDPRG3= <>
##$CPDPRG4= <mlev>
##$CPDPRG5= <mlev>
##$CPDPRG6= <mlev>
##$CPDPRG7= <mlev>
##$CPDPRG8= <mlev>
##$CPDPRGB= <>
##$CPDPRGT= <>
##$D= (0..31)
0 1 0 0 0 0 0 0 0 0.06 0 0 0 0 0 0 0.0002 0 0 0 0 0 0 0 0 0 0 0 0 0 0 
0 
##$DATE= 1171545831
##$DBL= (0..7)
120 120 120 120 120 120 120 120 
##$DBP= (0..7)
150 150 150 150 150 150 150 150 
##$DBP07= 0
##$DBPNAM0= <>
##$DBPNAM1= <>
$$ [...]
##$SUBNAM7= <"">
##$SUBNAM8= <"">
##$SUBNAM9= <"">
##$SW= 20.6930455092707
##$SWIBOX= (0..15)
0 0 3 0 0 0 0 0 0 0 0 0 0 0 0 0 
##$SW_h= 5175.983436853
##$TD= 65536
##$TD0= 1
##$TE= 295.16
##$TE2= 300
##$TE3= 300
##$TEG= 300
##$TL= (0..7)
0 120 120 120 120 120 120 120 
##$TP= (0..7)
150 150 150 150 150 150 150 150 
##$TP07= 0
##$TPNAME0= <>
##$TPNAME1= <>
##$TPNAME2= <>
##$TPNAME3= <>
##$TPNAME4= <>
##$TPNAME5= <>
##$TPNAME6= <>
##$TPNAME7= <>
##$TPOAL= (0..7)
0.5 0.5 0.5 0.5 0.5 0.5 0.5 0.5 
##$TPOFFS= (0..7)
0 0 0 0 0 0 0 0 
##$TUNHIN= 0
##$TUNHOUT= 0
##$TUNXOUT= 0
##$USERA1= <user>
##$USERA2= <user>
##$USERA3= <user>
##$USERA4= <user>
##$USERA5= <user>
##$V9= 5
##$VALIST= <valist>
##$VCLIST= <CCCCCCCCCCCCCCC>
##$VD= 0
##$VDLIST= <DDDDDDDDDDDDDDD>
##$VPLIST= <PPPPPPPPPPPPPPP>
##$VTLIST= <TTTTTTTTTTTTTTT>
##$WBST= 1024
##$WBSW= 4
##$XGAIN= (0..3)
0 0 0 0 
##$XL= 0
##$YL= 0
##$YMAX_a= 553111
##$YMIN_a= -413248
##$ZGOPTNS= <>
##$ZL1= 120
##$ZL2= 120
##$ZL3= 120
##$ZL4= 120
##$ABSF1= 16.522
##$ABSF2= -4.171173
##$ABSG= 5
##$ABSL= 3
##$ALPHA= 0
##$AQORDER= 0
##$ASSFAC= 0
##$ASSFACI= 0
##$ASSFACX= 0
##$ASSWID= 0
##$AUNMP= <proc_1d>
##$AZFE= 0.1
##$AZFW= 0.1
##$BCFW= 0
##$BC_mod= 0
##$BYTORDP= 0
##$COROFFS= 0
##$CY= 12.5
##$DATMOD= 1
##$DC= 0
##$DFILT= <>
##$DTYPP= 0
##$F1P= 14.0000005364418
##$F2P= -0.99999901652339
##$FCOR= 0.5
##$FTSIZE= 32768
##$FT_mod= 6
##$GAMMA= 0
##$GB= 0
##$INTBC= 1
##$INTSCL= 1
##$ISEN= 128
##$LB= 0.3
##$LEV0= 0
##$LPBIN= 0
##$MAXI= 10000
##$MC2= 0
##$MEAN= 0
##$ME_mod= 0
##$MI= 0
##$NCOEF= 0
##$NC_proc= -2
##$NLEV= 6
##$NOISF1= 0
##$NOISF2= 0
##$NSP= 0
##$NTH_PI= 0
##$NZP= 0
##$OFFSET= 16.522
##$PC= 1
##$PHC0= 75.85933
##$PHC1= 3.930949
##$PH_mod= 1
##$PKNL= yes
##$PPARMOD= 0
##$PSCAL= 4
##$PSIGN= 0
##$REVERSE= no
##$SF= 250.13
##$SI= 32768
##$SIGF1= 0
##$SIGF2= 0
##$SINO= 400
##$SIOLD= 32768
##$SREGLST= <1H.CDCl3>
##$SSB= 0
##$STSI= 32768
##$STSR= 0
##$SW_p= 5175.98343685301
##$SYMM= 0
##$S_DEV= 0
##$TDeff= 65536
##$TDoff= 0
##$TI= <Analysis number 999999
Compound Code 99
Book Reference 9
Project Code 9>
##$TILT= no
##$TM1= 0
##$TM2= 0
##$TOPLEV= 0
##$USERP1= <user>
##$USERP2= <user>
##$USERP3= <user>
##$USERP4= <user>
##$USERP5= <user>
##$WDW= 1
##$XDIM= 32768
##$YMAX_p= 288573782
##$YMIN_p= -14227
$$ End of Bruker specific parameters
$$ ---------------------------------
##NTUPLES= NMR SPECTRUM
##VAR_NAME=  FREQUENCY,     SPECTRUM/REAL,   SPECTRUM/IMAG
##SYMBOL=    X,             R,               I
##VAR_TYPE=  INDEPENDENT,   DEPENDENT,       DEPENDENT
##VAR_FORM=  AFFN,          ASDF,            ASDF
##VAR_DIM=   32768,         32768,           32768
##UNITS=     HZ,            ARBITRARY UNITS, ARBITRARY UNITS
##FACTOR=    0.157963299565203, 1,           1
##FIRST=     4132.6476996994, 0,             0
##LAST=      -1043.33573715361, 0,           0
##MIN=       -1043.33573715361, -14227,      0
##MAX=       4132.6476996994, 288573782,     0
$$ Real data points
##PAGE= N=1
##DATA TABLE= (X++(R..R)), XYDATA
$$ [...]
16934A4090R710J0465Q369R467J0620O836K474m070L549O684M399n088j0158j1837
16920E5510q932r165p365p819K10O243L529P99M426P342N322O084J1108O545O89
16905G4526n432q715j0416q816r953o161k345n312n954j246J693K04j220M02l217
16890H038j414Q18j550l377l020J057K088K177J079j759j498M34q61j741L92K33
16874A096j167m864o76J716K500K373J259o73l227k971j324O77j360J885L413
16859a343L297j108k573j001K969L71k020j872j160n753j000K916M393P03j97
16844c378k413q88L086j309l251L685N21r67K477K463j079K7k96j686r91l885
16828g884K561J364L37j095L31L357L169J140k70l210j018p77k330r34J82P73
$$ plain form
16934 14090 23800 34265 42634 52101 62721 69557 72031 67961 71510 78194 82593 77505 67347 55510
16920 55510 46578 37413 30048 22229 22439 28682 32211 33010 37436 44778 50100 56184 67292 73837 74526
16905 74526 69094 60379 49963 41147 31194 25033 22688 17376 11422 10176 11869 12073 10853 11255 8038
16890 8038 6624 7442 5892 2515 -505 552 2640 4817 5896 4137 2639 3073 2212 471 863 1096
16874 1096 -71 -4935 -5611 -3895 -1395 978 2237 1564 -1663 -4634 -5958 -5281 -6641 -4756 -1343
16859 -1343 1954 846 -1727 -2728 241 612 -1408 -3280 -4440 -10193 -11193 -8277 -3884 -3181 -3378
16844 -3378 -5791 -6679 -3593 -4902 -8153 -4468 -3947 -4914 -2437 26 -1053 -1026 -1322 -3008 -3999 -7884
16828 -7884 -5323 -3959 -3622 -4717 -4386 -1029 2140 3280 3010 -200 -1218 -1995 -4325 -5259 -5077 -4304
16812d304J091j543o5o36L242J044J722N02n16j099n04m443J71J693R58R97m8
16795a738r63j84J538K249R64p35k343j15L770pm934j67j842l82J316l71J035
16778b909j8J688K745K471j822j215q40oj426k892j50K1J80L83Q13J96J62K85
16760b334K280K021p08j126j10J333j947k099j893qK595K932k09l020k334p74
16744e401J989J211k141j230J779m97K38m67L12j145q06j67m02L32J795K109J001
16727a490j851L716j571R80M152n01J20m854p05O11L12j772j10k568j409J946
16711d994R25K497J939k679j164k290q41M690O55j454J403r67k27l370r22J521
16695e278N14P06R3l28m318j696J285p03J696J930J061k709J940j540p97K769
$$ plain form
16812 -4304 -3213 -4756 -4821 -5457 -2215 -1171 551 1053 537 -562 -1066 -5509 -5338 -3645 -2687 -1690 -1738
16795 -1738 -2701 -2885 -1347 902 1866 1131 -1212 -1327 2443 2436 -2498 -2665 -4507 -4889 -3573 -3944 -2909
16778 -2909 -2927 -1239 1506 3977 2155 940 100 94 -1332 -4224 -4374 -4353 -4173 -3790 -2977 -2781 -2619 -2334
16760 -2334 -54 1967 1259 133 23 1356 -591 -2690 -4583 -4591 -1996 936 727 -2293 -4627 -5401
16744 -5401 -3412 -2201 -4342 -5572 -3793 -4290 -4052 -4519 -4207 -5352 -6158 -6325 -6727 -6395 -4600 -2491 -1490
16727 -1490 -3341 375 -1196 -216 3936 3435 3555 -1299 -2004 -1393 -1081 -2853 -2963 -5531 -6940 -4994
16711 -4994 -4069 -1572 367 -2312 -3476 -5766 -6607 -1917 -1262 -2716 -1313 -2280 -2507 -5877 -6799 -5278
16695 -5278 -4764 -4058 -3965 -4293 -8611 -10307 -9022 -9725 -8029 -6099 -5038 -7747 -5807 -7347 -8144 -5375
16679e375K916P99K939N48k303q11n61o45N554K405p97n517j20j930j169K190
16663a877j572J402l82j201j927m77L229K435j12k775m681J503K56j891J699J731
16647d640j832m34o31m97K319L974J421k538l29j033j826n17J468J854N13j308
16631d036j76L33K9J288K90J705q7J438q58p78k000r64m3J462K3J624j065l995
16613e810J782J511j303k005j65J126J698N4j317j717N66R79K262L124k449q49
16597b513j090O85K974J890m413P99K741j392n289j722M43K343l70K281K097j641
16581b177q92o96M41j47o1K25J862J97j214Q74J206PJ967j39J116L355m116j696
16563A12o04j206j242P66L166j352k804k974J407J522Nj915m328l60J959J123
$$ plain form
16679 -5375 -2459 -1660 1279 1827 -476 -1287 -1848 -2493 3061 5466 4669 -848 -968 -2898 -4067 -1877
16663 -1877 -3449 -2047 -2429 -3630 -5557 -6034 -2805 -370 -482 -3257 -7938 -6435 -6179 -8070 -6371 -4640
16647 -4640 -6472 -6906 -7537 -8034 -5715 -1741 -320 -2858 -3187 -4220 -6046 -6563 -5095 -3241 -2728 -4036
16631 -4036 -4212 -3879 -3850 -2562 -2272 -567 -654 784 -74 -852 -2852 -3816 -3859 -2397 -2374 -750 -1815 -5810
16613 -5810 -4028 -2517 -3820 -5825 -5990 -4864 -3166 -3112 -4429 -6146 -5580 -4601 -2339 785 -1664 -2513
16597 -2513 -3603 -2918 56 1946 -2467 -1668 1073 -319 -5608 -7330 -6887 -4544 -4914 -2633 -536 -2177
16581 -2177 -3069 -3765 -3324 -3471 -3532 -3307 -1445 -1248 -2462 -1588 -382 -375 1592 1453 2569 5924 1808 112
16563 112 -492 -1698 -2940 -2174 992 -360 -3164 -6138 -4731 -3209 -3204 -5119 -9447 -9807 -7848 -6725
16547f725k94J385J556K935J865l486k731k303k003n44J204M923K737J138O97
16532C54J277J737R44j309L47Q18J052K029k233m023j400o95j905k384j509J671
16516e229N47m23M84J051N06l440j222J651j94K502K778P02K033j5j613l29j06
16499c17J343k376k039L051J114j80k962p5l81K142j359k073k263n64M79q24J177
16482f107J679l213j675J135p19K315K771L161N83k010J671J114k453j341k330
16467e419q65J058j917k443K242K053J641J031j99j478j7j45L791J465J203J727
16451C728l222m926k79J60j390K229J763n69j693l03N77J103l011k708K78j460
16435i723j740K772O184N171k232k450j970j590K559R29l026k376J245r2R39p3
$$ plain form
16547 -6725 -7019 -5634 -4078 -1143 722 -2764 -5495 -7798 -9801 -10345 -9141 -4218 -1481 -343 354
16532 354 1631 3368 4312 3003 3350 4168 5220 7249 5016 993 -407 -1102 -3007 -5391 -6900 -5229
16516 -5229 -4682 -5105 -4621 -3570 -3064 -6504 -7726 -6075 -6269 -3767 -989 -287 1746 1731 118 -211 -317
16499 -317 1026 -1350 -3389 -338 776 596 -2366 -2441 -2822 -680 -2039 -4112 -6375 -6939 -6460 -7284 -6107
16482 -6107 -4428 -7641 -9316 -8181 -8900 -6585 -3814 -653 -70 -2080 -409 705 -1748 -3089 -5419
16467 -5419 -6284 -5226 -7143 -9586 -7344 -5291 -3650 -2619 -2818 -4296 -4313 -4458 -667 798 2001 3728
16451 3728 506 -4420 -4699 -4539 -5929 -3700 -1937 -2506 -4199 -4502 -3925 -2822 -5833 -8541 -8263 -9723
16435 -9723 -11463 -8691 -2507 2664 432 -2018 -3988 -5578 -3019 -2090 -5116 -7492 -6247 -6339 -5400 -5473
16419e473k758J332k664l654K297O649r85m598L20J322k82M174J349J476j217
16404b712k340k32k247m266Q14L19K489J944J074q37J48R46n93K28M81L382J808
16387D06j508J234k17l231k443l94j600J182o1L505k49J309L421Q2p31j643J542
16370F04o28Q45j385l438J028P56m134k602p17L420L48K324K618o34M2J205j421
16353a769K61J564k022L091n68k631N293N01k083k200j982k127R96J370l25K62
16337b369L622j580l452l338K446J167k520k577R79J703J728J518J723r44o374
16322h268O74J30K632J488j014l026N86M3K309Q34k132j303k68K64K377K313K616
16305B55J474j188l677k692l50K740j714k306K678J407j618J614L98P13K25k121
$$ plain form
16419 -5473 -8231 -6899 -9563 -13217 -10920 -4271 -5256 -9854 -9534 -8212 -8494 -4320 -2971 -1495 -2712
16404 -2712 -5052 -5284 -7531 -11797 -10983 -10664 -8175 -6231 -5157 -5994 -5846 -4900 -5493 -5265 -4784 -1402 406
16387 406 -1102 132 -85 -3316 -5759 -6153 -7753 -6571 -6632 -3127 -3376 -2067 1354 1436 705 -938 604
16370 604 -24 821 -564 -4002 -2974 -2218 -6352 -8954 -9671 -6251 -5903 -3579 -961 -1595 -1553 -348 -1769
16353 -1769 -1508 56 -1966 1125 557 -2074 3219 3720 1637 -563 -2545 -4672 -3676 -2306 -2631 -2369
16337 -2369 1253 -327 -3779 -7117 -4671 -3504 -6024 -8601 -7622 -5919 -4191 -2673 -950 -1894 -8268
16322 -8268 -7594 -7464 -4832 -3344 -4358 -7384 -6798 -6755 -4446 -3612 -5744 -7047 -7315 -7051 -4674 -2361 255
16305 255 1729 541 -3136 -5828 -6178 -3438 -5152 -7458 -4780 -3373 -4991 -3377 -2979 -2266 -2041 -4162
16289d162k542M40N911K236k054J371J627j628k986j800j837j287Q21J524J201
16274c165M32o65K523Q89k412J102Q49m37j999k043o95m42k621j51J858m1L042
16257c976J372j323j320k620n80K807K80k403K857M466M41k144l023r76J272J374
16241c496j351j082K607j414l838J093M438J928K362j748j169j196Oj791j59N55
16225d255J09k015K902L325k438q6J933K10k42l72k866j5Q27k507k858j271J258
16208h361K182M046J188r32k026k604K001O35N72m53j864J82o47j316M872J073
16192a452n052R87K739r80M250K038l018k972k353J158J736k364j82K830K100
16177e35m010J95K324K743j856K07J928J549J124P33j057o057L54L87k370j574
$$ plain form
16289 -4162 -6704 -6264 -353 1883 -171 1200 2827 1199 -1787 -3587 -5424 -6711 -5890 -4366 -3165
16274 -3165 -2733 -3398 -875 14 -2398 -1296 -447 -884 -2883 -4926 -5621 -6063 -8684 -8835 -6977 -7018 -3976
16257 -3976 -2604 -3927 -5247 -7867 -8447 -5640 -5360 -7763 -4906 -440 1 -2143 -5166 -6142 -4870 -3496
16241 -3496 -4847 -5929 -3322 -4736 -8574 -7481 -3043 -1115 1247 -501 -1670 -2866 -2860 -4651 -4810 -4255
16225 -4255 -4146 -6161 -3259 66 -2372 -2458 -525 -315 -557 -929 -3795 -3810 -2983 -5490 -8348 -9619 -8361
16208 -8361 -6179 -2133 -945 -1877 -3903 -6507 -4506 -3871 -3299 -3752 -5616 -5434 -6081 -7397 -2525 -1452
16192 -1452 -6504 -5517 -2778 -3758 492 2530 -488 -3460 -5813 -4655 -2919 -5283 -5465 -2635 -535
16177 -535 -4545 -4350 -2026 717 -1139 -932 996 2545 3669 4402 3345 -2712 -2358 -1971 -4341 -5915
16161e915L610K874K81R44p96k887q45q20O27O867j164n167j157j440n41K307
16145c222k947l28o16P07K71j488O4L489M095J111j818J883N73l229p890L837
16129e508L996J03j182O46j566M13K035K443K44k171j325m22m88J486R43L30m331
16112d354k311L120M32j377J453J635j142J176P46l499m14l54J292k274k690%
16096h561L624R93J699k190k990L246K502j223K78j901K876K954o73o92O37L533
16080D112k593m606J484l104q78K150K495l203k596l72J786N30J267l08k121m35
16064f392KL600k80o38N42n35l776J520J73M367J545l826k252M46p81L40K182
16047c763M519O55k597j907J457j482M671o65k059l043k698m62M85J058K019k53
$$ plain form
16161 -5915 -2305 569 850 1794 998 -1889 -2734 -3554 -2927 3940 2776 -2391 -3548 -4988 -5529 -3222
16145 -3222 -6169 -6497 -7113 -6406 -6135 -7623 -7559 -4070 25 1136 -682 1201 1774 -1455 -9345 -5508
16129 -5508 -1512 -1409 -2591 -1945 -3511 -3098 -1063 1380 1624 -547 -1872 -2294 -2782 -1296 -353 -23 -4354
16112 -4354 -6665 -3545 -3113 -4490 -3037 -1402 -2544 -1368 -622 -4121 -4535 -4889 -3597 -5871 -8561 -8561
16096 -8561 -4937 -3944 -2245 -4435 -7425 -4179 -1677 -2900 -2622 -4523 -1647 1307 634 -58 579 4112
16080 4112 1519 -3087 -1603 -4707 -5585 -3435 -940 -4143 -6739 -7111 -5325 -4795 -3528 -3836 -5957 -6392
16064 -6392 -6390 -2790 -3070 -3708 -3166 -3701 -7477 -5957 -5784 -1417 128 -3698 -5950 -5504 -6285 -5945 -3763
16047 -3763 756 1411 -1186 -3093 -1636 -3118 1553 888 -1171 -4214 -6912 -7374 -6889 -5831 -3812 -4065
16031d065k4l331J47r41M519j463J067L148K051k134j113R4L45J421k491j521
16015d291J190r15m43J484L371k177l128M034J368k15O23l874o41j143J868J569
15999a320J497K232l420l688k378J559O74O06K286k574O32J492l97j331m1n84
15983d755L58k8N22j675r74R97M560J309P08k319l634k897J254n56j725K092K437
15966d326J911l073j131k224k932L09L740J510L371J194r70p05k614k861J231
15951g570R8K956j35k220M20M00J707q97J25K429J597m64l16m30r94R10L782K855
15933D253j241j267m489n612j303N613J809J015J23r01j953J605L960K2P29k971
15917f08k810K208J158j265m272j495k44k91J058k64j02l49J323J070j323j446
$$ plain form
16031 -4065 -4089 -7420 -7273 -8214 -3695 -5158 -4091 -943 1108 -1026 -2139 -2045 -1700 -279 -2770 -4291
16015 -4291 -3101 -4016 -4459 -2975 396 -1781 -4909 -875 493 278 901 -2973 -3614 -4757 -2889 -1320
15999 -1320 177 2409 -1011 -4699 -7077 -5518 -4844 -4238 -1952 -4526 -3894 -2402 -2799 -4130 -4171 -4755
15983 -4755 -4397 -4425 -3903 -5578 -6552 -5555 -995 314 1022 -1297 -4931 -7828 -6574 -7130 -8855 -6763 -4326
15966 -4326 -2415 -5488 -6619 -8843 -11775 -11466 -7726 -6216 -2845 -1651 -2621 -3326 -5940 -8801 -7570
15951 -7570 -7472 -4516 -4651 -6871 -6451 -6051 -4344 -5241 -5116 -2687 -1090 -1554 -1870 -2300 -3294 -2384 1398 4253
15933 4253 3012 1745 -2744 -8356 -9659 -4046 -2237 -1222 -1099 -2000 -3953 -2348 1612 1634 2363 -608
15917 -608 -3418 -1210 -52 -1317 -5589 -7084 -7328 -7619 -6561 -6825 -6927 -7276 -5953 -4883 -6206 -7652
15901g652n41o86P71J18K167K971j721j614l464J703K575j955K619l772P43N096
15885b642K407j591j667j628l19j013o1J594L216L608j949q96J068K71J457j598
15869B57p02r31r57M68J085Q64k258r39j56j127o51L759L521l411n948k789J784
15852h131P61p34J76J824K154L132L461M72k35j247k890j884m23j695p28L545
15836b442R13rP44m582k351K906Q95m57j83q6j699J905L256K466j187m11l2K26
15818a28k881J418J763Q91M99q00J452k348k882J357M817J062l184j918j49Q69
15802a62O23J296m525k591r58K67K113K148J22l401L815J712j367j092j048j977
15786e025j521K519K465j212J15O34K931J869k597l244k676j245J584N243P00
$$ plain form
15901 -7652 -8193 -8879 -8108 -7990 -5823 -2852 -4573 -6187 -9651 -7948 -5373 -7328 -4709 -8481 -7738 -2642
15885 -2642 -235 -1826 -3493 -5121 -5440 -6453 -6514 -4920 -1704 1904 -45 -941 127 398 1855 257
15869 257 -445 -1376 -2333 -1865 -780 84 -2174 -3113 -3269 -4396 -5047 -1288 2233 -1178 -7126 -9915 -8131
15852 -8131 -7370 -8104 -7928 -6104 -3950 -818 2643 3115 2880 1633 -1257 -3141 -3564 -5259 -5987 -2442
15836 -2442 -1529 -1538 -794 -5376 -7727 -4821 -3926 -4383 -4566 -4652 -6351 -4446 -1190 1276 89 -322 -354 -128
15818 -128 -3009 -1591 172 1063 1562 762 2214 -134 -3016 -1659 3158 4220 1036 -882 -1031 -162
15802 -162 461 1757 -2768 -5359 -6317 -6050 -3937 -1789 -1667 -5068 -1253 459 -908 -2000 -3048 -5025
15786 -5025 -6546 -4027 -1562 -2774 -2659 -2025 906 2775 178 -3066 -5742 -6987 -5403 -160 540
15771E40k100k276k059J183J841j736p65p97J013N30o28J739j500j703L834Q81
15755b003j128j806O90R11R91j014j383K779m39J17j970j090M319M117k909l585
15739c403J624K037J049J36J126j508l777J21j537K55J006J404K107l296j868
15724d524K378r59r64r7q4J601j187j626N71Q36l530J546L033o0j180R11p55J44
15706c946n6M66L528j657j052J1L67J895j143M387J175o363j518J267k630j28
15690e397L169J227l6J416N7j922j951j671M14p94j615k063J94m74K471j075P82
15673g268M740L064j871l326j017k952J27K32j273M77j737j680L455J253M570
15658c206M73P9O00j260m20L118j548l958J83K492q50l195m47r36q6K774J393
$$ plain form
15771 540 -1560 -3836 -5895 -4712 -2871 -4607 -5372 -6169 -5156 -4626 -5254 -3515 -5015 -6718 -2884 -2003
15755 -2003 -3131 -4937 -4247 -3336 -2345 -3359 -4742 -1963 -2402 -2285 -4255 -5345 -1026 3091 182 -3403
15739 -3403 -1779 258 1307 1443 2569 1061 -2716 -2595 -4132 -3877 -2871 -1467 640 -2656 -4524
15724 -4524 -2146 -3105 -4069 -4166 -4250 -2649 -3836 -5462 -4891 -4055 -7585 -6039 -3006 -3066 -4246 -3335 -4090 -3946
15706 -3946 -4002 -3536 -8 -1665 -2717 -2706 -2339 -444 -1587 2800 3975 -2388 -3906 -2639 -5269 -5397
15690 -5397 -2228 -1001 -1037 379 436 -1486 -3437 -5108 -4694 -5488 -7103 -9166 -8972 -9446 -6975 -8050 -7268
15673 -7268 -2528 536 -1335 -4661 -5678 -8630 -8503 -8271 -9544 -9067 -10804 -12484 -9029 -7776 -3206
15658 -3206 -2733 -2654 -2054 -3314 -3734 -616 -2164 -6122 -5939 -3447 -4297 -7492 -7939 -8875 -8961 -6187 -4794
15641d794l698N08J949K567p25J344J95O71J76l956k251k97L529j245K443O22
15625b962k565Q90k269J787M644J963q47k557o531k557N3j672L08L858L843k430
15609g044j874J452O342K741o116n240L684N083J497j304j828r69J584o42k293
15594d927J357P16J160P94j963Q54m27j746J02l71J218l43o62J713J278J646j765
15577a366J673j258J915J596l1j879q1j22j901n16j675J662L536j20j787j507
15561a861K256L489M22k516l210j48K618j345J8N66j347m52J727j985J415J364
15545A011M716k330m383J049r55o62K070J237k379L8m36J720j4J563r40l837J137
15528a395K422J042J465q93l91k175l877r21J021J611L83j47j676q35j706L548
$$ plain form
15641 -4794 -8492 -7984 -6035 -3468 -4193 -2849 -2654 -1983 -1807 -5763 -8014 -8311 -4782 -6027 -3584 -2962
15625 -2962 -5527 -4637 -6906 -5119 -475 1488 641 -1916 -8447 -11004 -10951 -12623 -12315 -8457 -4614 -7044
15609 -7044 -8918 -7466 -1124 1617 -4499 -9739 -6055 -972 525 -779 -2607 -3576 -1992 -2634 -4927
15594 -4927 -3570 -2854 -1694 -900 -2863 -2009 -2436 -4182 -4080 -4451 -3233 -3576 -4238 -2525 -1247 399 -1366
15577 -1366 307 -951 964 2560 2529 650 569 447 -1454 -1970 -3645 -1983 1553 1433 -354 -1861
15561 -1861 395 3884 4306 1790 -1420 -1568 1050 -295 -277 289 -1058 -1510 217 -1768 -353 1011
15545 1011 5727 3397 -986 63 -892 -1554 516 1753 -626 -588 -1024 696 682 2245 1305 -2532 -1395
15528 -1395 1027 2069 3534 2641 2250 75 -3802 -4723 -3702 -2091 -1708 -1855 -3531 -4366 -6072 -2524
15512b524K503j969M156L110o09R22O92m114m622J070M68k694m183K193L616M050
15496B065k037k987l68Q55r96l079j513k25M30R46K245J772K469K929j685r42
15480a21j343l819m89J245J651J104L18n32k783m36J618l55k313l56J108O47m33
15463e289j407K757K953j841q68k950J055K188j410m37K021j367R42L899K909
15448C155l281n418j734O43J645QM70K608j968k979J720K282j115j006L142R18
15432i10j059j680K280j081j827P19J104j329P4J309J589J053K034R54j744o1
15416A425L38r22j160j816R6M906K424l505l127j644r38j273m3L593o41j845M31
15399c701J428K017O47j315J016P87n86m65j342r03M28k62K661k508J617K026
$$ plain form
15512 -2524 -21 -1990 2166 5276 4667 5589 6281 2167 -2455 -1385 -917 -3611 -7794 -5601 -1985 2065
15496 2065 28 -2959 -3327 -2472 -3468 -6547 -8060 -8285 -7855 -6909 -4664 -2892 -423 2506 821 -121
15480 -121 -1464 -5283 -5772 -4527 -2876 -1772 -1454 -1986 -4769 -5205 -3587 -3942 -6255 -6611 -5503 -4856 -5289
15463 -5289 -6696 -3939 -986 -2827 -3695 -6645 -5590 -3402 -4812 -5249 -3228 -4595 -3653 246 3155
15448 3155 -126 -5544 -7278 -6635 -4990 -4982 -4512 -1904 -3872 -6851 -5131 -2849 -3964 -4970 -1828 -910
15432 -910 -1969 -3649 -1369 -2450 -4277 -3558 -2454 -3783 -3709 -2400 -811 242 2276 3230 1486 1425
15416 1425 1763 841 -319 -2135 -2039 2867 5291 1786 -1341 -2985 -3923 -5196 -5239 -1646 -2287 -4132 -3701
15399 -3701 -2273 -256 391 -924 92 879 293 -172 -1514 -2417 -1989 -2251 410 -2098 -481 1545
15383A545j056J527K946L247m439k293l26J117r70j595j844k27j957j5l40j293
15367e973j313L218J123j560K235K19m67J439K707m157o79K829N44M7J71L89m03
15350C69k316K771j83k494Q7j648j306j090N16j583r90L67K553M492l53J429R28
15333A549J416l901n345l416m45K723J975K506K454j096N23L41j489k75j254J288
15317b446M27j842q32L56k201k110k046K37K397m81k265K026r6J372k102k006
15301a1612K743M904N411j34m088l17J170j736L58J117J002J667K720L87J19j798
15285A913j926n8j039n66K691N49k680k631m014J146L524j181j101J110O51Q9
15269c523p06r81O22p15K85K946K30J694l10J352R49j793O91k379k215l04J411
$$ plain form
15383 1545 489 2016 4962 8209 3770 1477 1151 2268 1298 -297 -2141 -2368 -4325 -4340 -4680 -5973
15367 -5973 -7286 -4068 -2945 -4505 -2270 -2051 -2518 -1079 1628 -2529 -3208 -379 165 212 383 772 369
15350 369 -1947 824 641 -1853 -1766 -3414 -4720 -5810 -5294 -6877 -7867 -7500 -4947 -455 -808 621 1549
15333 1549 2965 -936 -6281 -9697 -10142 -7419 -5444 -2938 -484 -1580 -1057 -716 -2205 -2480 -3734 -2446
15317 -2446 -2019 -3861 -4693 -4337 -6538 -8648 -10694 -10457 -8060 -8541 -10806 -8780 -8876 -7504 -9606 -11612
15301 -11612 -8869 -3965 1446 1312 -2776 -3093 -1923 -3659 -3301 -2184 -1182 485 3205 3592 3711 1913
15285 1913 -13 -71 -1110 -1676 1015 1564 -1116 -3747 -7761 -6615 -3091 -4272 -5373 -4263 -3612 -3523
15269 -3523 -4229 -5210 -4588 -5303 -5018 -2072 -1842 -148 -458 894 1843 50 741 -1638 -3853 -4157 -2746
15252b746o91J206Q06l59J157M39K96k084j822j05J385K213P45J144j884k83J086
15235E03q77k655K84j037l922R70M040l57P99m91Q19J185k298k282P74K429K104
15218a2P02J408k002R85L40l20N60R48j429l12K240K288j366k319J819N177k699
15201F008l638k819r93n36O40N02K489J202j115o83J351j877j92J32r56M957Q69
15184E341k564p36m790j019K801M73J290j938L08k26j742R63K53j913k26L40J602
15167a783k701k064K950M996L20m003m02m59k466j215O899L231j001j197l535
15152b430j870M32K394L069m155r18j926p24j089Q03r2K365L899K12J932J93k588
15135d93R50P68n29k302p89J49l460J018K535M81r17K4O33k134j595k117q10N889
$$ plain form
15252 -2746 -3437 -2231 -1425 -1784 -627 -188 108 -1976 -3798 -3903 -2518 -305 440 1584 -300 -583 503
15235 503 -374 -3029 -2745 -3782 -7704 -6734 -2694 -3051 -2252 -2743 -1924 -739 -3037 -5319 -4545 -2116 -12
15218 -12 690 2098 96 1081 1421 1101 1661 2609 1180 868 3108 5396 4030 1711 3530 8707 6008
15201 6008 2370 -449 -1442 -1978 -1338 -836 1653 2855 1740 1057 2408 531 339 471 -485 4472 5341
15184 5341 2777 2041 -2749 -3768 -967 -494 796 -1142 -834 -1060 -2802 -1839 -1586 -3499 -3725 -3385 -1783
15167 -1783 -4484 -6548 -3598 1398 1718 -2285 -2687 -3146 -5612 -6827 72 3303 2302 1105 -2430
15152 -2430 -4300 -3868 -1474 1595 -2560 -3478 -5404 -6128 -7217 -6414 -6506 -4141 -242 -30 1902 2095 -493
15135 -493 457 1225 696 -1606 -2395 -2246 -5706 -4688 -2153 -1672 -2589 -2565 -1932 -4066 -5661 -7778 -8588 -2699
15117b699K067m16N543j882k563l856l800L822J485L424K995j664j756Q96K46
15102A842L585K407n213m044k934k652M724L128Q68J834l19j398k044L15K302
15087B401K366L299j57l683n748k678K014R96j264j751K124M008J40n691k577
15072f201k779l75K878j14J425K316J713M27q30n47Q26Q83k383J972K703r47p50
15055B17j80j200p93M88K4M900K803k961j201J021M61r47k889j14k25L106K641
15038E151k658l438k255L957j953k723J851K245j58k105J558L577Q9m002J397
15023E33L483N7p39j582L06k747j147L5j96K098k14K790J935m159l545j675J421
15006c346R02k34r27m293n54L448K822k821n53J04J513K560J293P62M532k106
$$ plain form
15117 -2699 -632 -1048 4495 2613 50 -3806 -7606 -3784 -2299 1125 4120 2456 700 1596 1842
15102 1842 5427 7834 2621 -1423 -4357 -7009 -2285 843 1711 3545 3226 1828 -216 99 2401
15087 2401 4767 8066 7909 4226 -1522 -4200 -2186 -1190 -2454 -4205 -2081 1927 2067 -3624 -6201
15072 -6201 -8980 -9355 -6477 -6591 -5166 -2850 -1137 -710 -1540 -2087 -1261 -378 -2761 -789 1914 967 217
15055 217 37 -1163 -1956 -1468 -1444 3456 6259 3298 2097 3118 3579 2632 -257 -371 -596 2510 5151
15038 5151 2493 -945 -3200 757 -1196 -3919 -2068 177 19 -2086 -528 3049 3138 -864 533
15023 533 4016 4073 3334 1752 2058 -689 -1836 -1801 -1997 101 -113 2677 4612 453 -3092 -4767 -3346
15006 -3346 -2444 -2678 -3605 -7898 -8452 -5004 -2182 -5003 -5556 -5452 -3939 -1379 -86 676 5208 3102
14990C102k619J433j573r53J039o60n37K199L648K385k35L69k563k146J058j563
14974B384j937K444J445j691k89J291J751j047R39K187l30j370r27l508m617k434
14958e709J109L378k01K198J341k341k629j601L61L743L48k64n27k467K49J35
14942b877M90j887m126L166N183J03m334k222K714M357j349j701O90k36K685L1
14926F87N35l097l713o9K579K418K592r35m192l51R21N428M010j886k758k379
14910b10l081l81L680p19k655j520N95Q39j514R47L512J568J19j051l93K97J3
14893D6K593M96k076n3K245o08j624l237k442j732J616k58k50J209P91j885m0
14876e209J231Q17Q12K87J048J321j325o83J886K501P35j770j022J609K429K998
$$ plain form
14990 3102 483 1916 343 -610 429 -231 -768 1431 5079 7464 7229 7598 5035 2889 3947 2384
14974 2384 447 2891 4336 2645 2356 3647 5398 4351 5290 7477 7147 5777 4850 1342 -3275 -5709
14958 -5709 -4600 -1222 -1423 775 2116 -225 -2854 -4455 -4094 -351 -3 -267 -794 -3261 -3012 -2877
14942 -2877 -2387 -4274 -8400 -5234 -51 52 -4282 -6504 -3790 567 -782 -2483 -1793 -2029 656 687
14926 687 1222 -1875 -5588 -5657 -3078 -660 1932 997 -3195 -3546 -2625 2803 6813 4927 2169 -210
14910 -210 -3291 -3672 8 -711 -3366 -4886 -4291 -3452 -4966 -4019 -507 1061 1180 129 -264 33 46
14893 46 2639 3135 1059 1006 3251 2643 1019 -2218 -4660 -6392 -4776 -5034 -5284 -4075 -3284 -5169 -5209
14876 -5209 -3978 -3161 -2349 -2062 -1014 307 -1018 -1701 185 2686 3421 1651 629 2238 4667 7665
14860G665l272n993m728n21k154J728L522K515k666q64M04K469M399J927j978
14845B453q143l270j152J44K646N258M01j557R39K108j638j10J366Q67j739m553
14829e980j450K866J303P93J51Q81Q10k358J030R90J466L958j90j193j543k201
14813f67K978j698l767k061Q28L356K476J354J174k27j28q19k759j550j735O27
14797b618J53K916n96m523k811J66J926L067L700m019j375O446Q63j883j215l132
14781b935k172K076J525j231o94L661J082j663q96p75K697K493j86k22J479J176
14765E415q74j313K9j228j868m161j732p87M84M528J612J754j301k741j253j63
14749c599j835M281L276m34j665k074L617J44j168M87l087l586l367J771N748
$$ plain form
14860 7665 4393 -1600 -6328 -6849 -9003 -7275 -3753 -1238 -3904 -4768 -4364 -1895 2504 4431 2453
14845 2453 -5690 -8960 -10112 -9968 -7322 -2064 -1663 -3220 -2281 -173 -1811 -1921 -555 312 -1427 -5980
14829 -5980 -7430 -4564 -3261 -2468 -2317 -1436 -626 -2984 -1954 -964 502 4460 4270 3077 1534 -667
14813 -667 2311 613 -3154 -5215 -4387 -1031 1445 2799 3973 3746 3618 2799 40 -1510 -3245 -2618
14797 -2618 -2465 451 -145 -4668 -7479 -7313 -5387 -2320 1380 -2639 -4014 2432 3295 1412 197 -2935
14781 -2935 -5107 -3031 -1506 -2737 -3431 230 1312 -351 -1247 -2022 675 3168 2982 2760 4239 5415
14765 5415 4541 3228 3257 2029 161 -4000 -5732 -6519 -6035 -1507 105 1859 558 -2183 -3436 -3599
14749 -3599 -5434 -1153 2123 1689 24 -2050 1567 1711 543 1030 -2057 -5643 -9010 -7239 -1491
14734a491M831j543k054R66N16K515k661K11J114j572j359k476O7n99j262N2K727
14717b018m88N15j372l690K754O28k046N43j318j949J172R12q43K459L959J961
14701A179j171j035M78j014k46k160j709N84K669K87L039J919j270r55M72R02
14685A969J693R06k598p10J45R75j78m61j586K244l15K07k862m296k051J633k98
14668e583p79O84J075L099L733K105k233j538l818k013K874M657L186j727l573
14653A49k123j134l17M309M480J712m973l662Q9J469J869l492O02L864M031j153
14637E720j644K458k342l601l223J095O55N5L121L133j061l362O84j024p90L290
14621C164J600O04J716K27q25k672j740k249J92K189L186K37m163k132p63r90
$$ plain form
14734 -1491 3340 1797 -257 709 1225 3740 1079 1290 2404 832 -527 -3003 -2936 -3535 -4797 -4745 -2018
14717 -2018 -2506 -1991 -3363 -7053 -4299 -3671 -5717 -5174 -6492 -8441 -7269 -6357 -7200 -4741 -782 1179
14701 1179 8 -1027 -549 -1563 -1809 -3969 -5678 -5094 -2425 -2138 901 2820 1550 595 1067 1969
14685 1969 3662 4568 1970 1260 1405 2380 2202 1741 155 2399 2084 2291 -571 -4867 -6918 -5285 -5583
14668 -5583 -6362 -5678 -4603 -1504 2229 4334 2101 563 -3255 -5268 -2394 2263 5449 3722 149
14653 149 -1974 -3108 -3425 884 5364 7076 2103 -1559 -1470 -1 1868 -1624 -1022 2842 6873 5720
14637 5720 4076 6534 4192 591 -2632 -1537 -882 -827 2294 5427 4366 1004 1688 664 -126 3164
14621 3164 4764 5368 7084 7311 6486 3814 2074 -175 17 2206 5392 5629 1466 -666 -1429 -2419
14605b419K406J932O13R08K073k866l521O70o70j006j690K173k234J529K238q69
14589g33M89j405j47p00j573Q82J041j199k271M15O5J698M402k542j238j581j206
14572e603J835O40L49J305r04O15K74L9j661N17J017j488n57k66K146M626L439
14555F323o33J979R54l453k835o75N440L889l482k941k566j813J778J433k662
14540G36k332J238l181m79K168l728K50O90j062L40o14M38J083K177J799J64j401
14523a714p36J068N06r55P6K37o76M86J69j257K719L548J054j416r18m421m11
14506b641M625j569j114j096k795K357j922L69J235P58J49K850j93k51j465j522
14490b225j841N65K152J098N91O19O00n75k213k272q02m62o65J407K731J046J988
$$ plain form
14605 -2419 -13 1919 2532 3440 5513 2647 -874 -204 -874 -1880 -3570 -1397 -3631 -2102 136 -733
14589 -733 -244 -1649 -1796 -2496 -4069 -3187 -2146 -3345 -5616 -5201 -5136 -3438 964 -1578 -2816 -4397 -5603
14572 -5603 -3768 -3128 -2779 -1474 -2378 -1763 -1489 -1450 -3111 -2594 -1577 -3065 -3622 -3888 -1742 2884 6323
14555 6323 5690 7669 8623 5170 2335 1660 7100 10989 7507 4566 2000 187 1965 3398 736
14540 736 -1596 -358 -3539 -4018 -1850 -5578 -5328 -4638 -5700 -5360 -5974 -5536 -4453 -2276 -477 -313 -1714
14523 -1714 -2450 -1382 -876 -1831 -1755 -1518 -2194 -1708 -1539 -2796 -77 3471 4525 3109 2191 -2230 -2641
14506 -2641 1984 415 -699 -1795 -4590 -2233 -4155 -3786 -2551 -1793 -1644 1206 1013 762 -703 -2225
14490 -2225 -4066 -3501 -1349 -251 340 959 1559 984 -1229 -3501 -4303 -4765 -5430 -4023 -1292 -246 1742
14473A742k97M85P54n151j003J439L21J089o69R48j940j703J45K089K155K305
14457B709k418l138J065p91k073j502n03J047L322l12J80N98K393j324N22J370
14441A145J42M57j159k689J228K717J407l529l08O62j024K4k315r36j350J105
14425d423m55N7K750Q03m25k347q53j457K08L52O640L841m884J732L216N0l048
14408A757m659k738K533J450j952J066L065K970K550k330K21o19j509j199j693
14393a087L421j121k399L2j495K434j894J762L204p58J078J529l020N21J7O29
14377B853m05K359J289l366k328K582k959m080K849K688l69l53k74K501k229k126
14361a368k1P87J477J097j387k666j963k517j65J412K908J859n18j074k828K410
$$ plain form
14473 1742 1445 1930 2684 -2467 -3470 -2031 -1710 -621 -1290 -342 -2282 -3985 -3840 -1751 404 2709
14457 2709 291 -2847 -1782 -2573 -4646 -6148 -6651 -5604 -2282 -2594 -2414 -1816 577 -747 -225 1145
14441 1145 1287 1744 585 -2104 -876 1841 3248 -281 -589 73 -951 -927 -3242 -4178 -5528 -4423
14425 -4423 -4878 -4821 -2071 -1268 -1693 -4040 -4893 -6350 -6142 -5790 850 4691 -193 1539 4755 4805 1757
14408 1757 -2902 -5640 -3107 -1657 -3609 -2543 522 3492 6042 3712 3933 3314 1805 606 -1087
14393 -1087 2334 1213 -1186 -1154 -2649 -215 -2109 -347 2857 2099 3177 4706 1686 2207 2224 2853
14377 2853 2448 4807 6096 2730 402 2984 25 -4055 -1206 1482 1113 760 486 2987 758 -1368
14361 -1368 -1389 -602 875 1972 585 -2081 -4044 -6561 -6726 -5314 -2406 -547 -1065 -2139 -4967 -2557
14345b557M850k223l171O17R76K310Q62K744J540r92k887j537J556P75k126L937
14329D674L770j071k511l748p48l790Q45P201j975n335l93J313J045M490L726
14314G493o56l544j654j821K738J600k980j879j24O35K826J158n438n7J57j232
14298b778K785J566L842l434m51N57j281k028k41Q88M278J015m7J006P3l299p06
14281A745n50L807K535m117k625J523j378J706L767j1k846k515l902K412J111
14266F62l17J628J709q04j028m14l212K999R66N27Q42J577j547K69J267M27J463
14249G014J115m04n333l773j250J372K397K19J98j397K087K958J831j112r71P4
14233E025J010k15m624l83L024L111J333J254n553k637L39N49j855j346M481N519
$$ plain form
14345 -2557 2293 70 -3101 -2484 -1508 802 1664 4408 5948 4956 2069 532 2088 2863 737 4674
14329 4674 8444 7373 4862 1114 366 -3424 -2579 4622 2647 -2688 -3081 -1768 -723 3767 7493
14314 7493 6837 3293 1639 -182 2556 4156 1176 -703 -827 -192 2634 3792 -1646 -1703 -1546 -2778
14298 -2778 7 1573 5415 1981 1530 2087 806 -1222 -1463 -575 3703 4718 4671 5677 5750 2451 1745
14281 1745 1195 5002 7537 3420 795 2318 940 2646 6413 6402 3556 1041 -2861 -449 662
14266 662 345 1973 3682 2878 1850 1436 -1776 1223 2189 2716 3558 5135 3588 3857 5124 5551 7014
14249 7014 8129 7725 2392 -1381 -2631 -1259 1138 1357 1555 158 2245 5203 7034 5922 4951 5025
14233 5025 6035 5820 1196 813 3837 6948 8281 9535 3982 1345 1684 2233 378 -968 3513 9032
14217I032m34o733l03j68Q54J272j116J424j004k195J820O94k213M25K212J355
14201D922J2m931l323N245L053j689k454o09j288k296R07q1j136M54K336R98q08
14184f88j475n66K22M913J084K817k367k581r88k687J437K982l44J366j855k737
14168a467N04L589J809L54j446k021j984J684L042o13k952l781J884k002j277
14153d677L570P8L074J883j410r47m25K858L064Q86k595k707J19k812j461L473
14137A971L098P73j358L357K285j615j252O00j553m531J76J189P15J097J459k561
14121C850q08J512p05k049J387j81j74p56N07j275r89J298j685RO5j484k176j198
14103d852j816l96M205M899J016L21K106j41m239j785K491o40J307L82j956k129
$$ plain form
14217 9032 8598 1865 1562 1394 2248 3520 2404 3828 2824 629 2449 3143 930 1355 3567 4922
14201 4922 4934 3 -3320 1925 4978 3289 835 226 -1062 -3358 -2451 -2532 -3668 -3214 -878 120 -688
14184 -688 -2163 -2729 -2507 2406 3490 6307 3940 1359 371 -2316 -879 2103 1759 3125 1270 -1467
14168 -1467 -963 2626 4435 4789 3343 1322 -662 1022 4064 3451 499 -3282 -1398 -3400 -4677
14153 -4677 -1107 -1029 2045 3928 2518 1571 1146 4004 7068 7954 5359 2652 2771 -41 -1502 1971
14137 1971 5069 5842 4484 7841 10126 8511 7259 7859 6306 1775 1951 3140 3855 4952 6411 3850
14121 3850 3042 4554 3849 1800 3187 3006 2832 2076 2583 1308 319 1617 -68 -59 6 -1478 -3654 -4852
14103 -4852 -6668 -7064 -2859 2040 3056 3377 5483 5342 1103 -682 1809 1169 2476 2858 902 -1227
14087a227J710k79J791j482k440M86l72P72O09J986M697K627p39k633j388r02
14071C216j961j895K110k777K123L392K175j426n244L95P17q15M020L268j805
14056E493m251k545k036K491L000L409m89L175r23l029K160k346n687k628L080
14041a126p35K46L832Q78J150K923K175n8j912o27M45K339P16l726j597o22j359
14024B942J827j744j585K147L860K230j40k145q12j047l69j758l074K16p4l348
14008b874J836K903j549j368k444K365O325J738k584o031k402K781K657J646Q28
13993C827J244q83k180k21K994O0j113j409J387K094k079l297j443M284n83p45
13977A937k361k633j013l31P99M573K343Q19J888J906n90n784j148L473K957j716
$$ plain form
14087 -1227 483 204 1995 513 -1927 -1441 -1813 -1041 -432 1554 6251 8878 8139 5506 4118 3216
14071 3216 1255 -640 1470 -1307 816 4208 6383 4957 -287 108 825 10 4030 7298 5493
14056 5493 1242 -1303 -3339 -848 2152 5561 5072 8247 7324 4295 6455 4109 -1578 -4206 -1126
14041 -1126 -1861 -1615 2217 3095 4245 7168 9343 9285 7373 6746 7191 9530 10246 6520 4923 4301 2942
14024 2942 4769 3025 1440 3587 7447 9677 9537 7392 6580 5533 5164 3406 332 548 474 -2874
14008 -2874 -1038 1865 316 -1052 -3496 -1131 5194 6932 4348 -1683 -4085 -1304 1353 2999 3827
13993 3827 5071 4188 2008 1787 4781 4841 3728 2319 3706 5800 3721 424 -1019 3265 2682 1937
13977 1937 -424 -3057 -4070 -4401 -3602 971 3314 4133 6021 7927 7337 1553 405 3878 6835 5119
13961E119k052j025R54K313k259n009J626L294L035L748K747k226m568l813K652
13946D536J23k244j420p02J57j33L53j166l95k256l145J597K729o50j129J34L335
13929b76l87J283k37M581J523p06k328k302N70R97J833P48r28J208j697l044J832
13912B670k468Q63J10M32N646O5k426j777k575J837j76j162K16M000J272J064
13896G591L08K166l490k689l157j291J137J856l72J172J611K263k142k285J054
13881C732Q7n26n60j621j128N20K111J037K265k84r24q55J540k5k369N4L14l66
13863C002j817n15J522j981l865j28J453K343L521L774J926P96j175o221k199
13848D36M385L713K083k684j224j755j200p01j206k207O88r61R74P72J712J165
$$ plain form
13961 5119 3067 2042 2996 5309 3050 -1959 -333 2961 5996 9744 12491 10265 5697 1884 4536
13946 4536 4659 2415 995 293 450 317 670 -496 -891 -3147 -6292 -4695 -1966 -2616 -3745 -3611 -276
13929 -276 -663 620 383 4964 6487 5781 3453 1151 1721 2718 4551 5299 4371 5579 3882 838 2670
13912 2670 202 1065 1175 1607 7253 7318 4892 3115 540 2377 2201 1039 1255 5255 6527 7591
13896 7591 7899 10065 6575 3886 729 -562 575 2431 2059 3231 4842 7105 4963 2678 3732
13881 3732 3819 3293 2733 1112 -16 504 2615 3652 5917 5633 4709 3854 5394 5369 3000 3054 3368 3002
13863 3002 1185 670 2192 211 -3654 -3782 -2329 14 3535 7309 9235 10031 8856 2635 436
13848 436 4821 8534 10617 7933 6709 4954 3754 3053 1847 -360 328 -633 341 1113 2825 3990
13832C990k976J799q40J323J615l392J65K533K238j229k905j260J598J909k263
13817B305j615L828J678J054J480J075l409k587j547k89K863K038L635J034m484
13802G059l684j95k283J60M72j295K098k717P54M051J287K007j959k766M37M316
13786G742J390j237l482l813L69K146J608N34K943K923k67o11j922O13K533M16
13770A1885k575Q8j003K893J403K01m638R45J458R30k30Q40M067j567q15j222
13754A2660k259l379o218j348K633P877L670k550p57K22K73L614m45j942q24n865
13738E362j206K019J676K942P52j282k646J075j088p64k36K011J155q10R29j42
13722I747q39l735j401J984p56j306j140n46j944L01M606M90j009L106K81j279
$$ plain form
13832 3990 1014 2813 1973 3296 4911 1519 1684 4217 6455 5226 2321 1061 2659 4568 2305
13817 2305 690 4518 6196 7250 8730 9805 6396 3809 2262 1973 4836 6874 10509 11543 7059
13802 7059 3375 3180 897 1057 1529 234 2332 -385 369 4420 5707 7714 5755 2989 3426 7742
13786 7742 9132 7895 4413 600 969 3115 4723 5257 8200 11123 10856 10245 8323 8936 11469 11885
13770 11885 9310 9398 8395 11288 12691 12892 8254 9199 10657 11587 11357 12197 16264 14697 13882 12660
13754 12660 10401 7022 804 -544 2089 9966 13636 11086 10329 10551 10824 14438 13993 12051 11227 5362
13738 5362 4156 6175 7851 10793 11545 10263 7617 8692 7604 6840 6604 8615 9770 8960 9889 9747
13722 9747 8908 5173 3772 5756 5000 3694 2554 2008 64 365 4971 5461 4452 7558 7839 6560
13706F560K18n04R21J423j276O62j265j085L960j68k74j895l736O11m56M248K666
13689A0610j895k695K612O30M18j232j746J553r38j748J4L645k132J910L002j586
13673A0422n398q51L294j63k293J265M288P98k51j685m988j909K466J784P16k579
13657D916n14j018j550q71m09K296L087K297J854M68j931j55J997J105K517m122
13641I967m474r6J182M87j024J045j546j873J729J082Q52o77K874P76J386J282
13625A2972k895m605J139M619j025M40q4P12J676k697k694q9l92m329j066J777
13609C459o8K226L053K127J93R25P99J811o74l026k140k747n6K058J367K776N22
13592A2605j660J294M109L068m81j079k737k582r78J374K587j982K101o2n37n5
$$ plain form
13706 6560 6778 6274 7195 8618 7342 8004 6739 5654 9614 9446 9172 7277 3541 4152 3696 7944 10610
13689 10610 8715 6020 8632 9262 9680 8448 6702 8255 7317 5569 5583 9228 7096 9006 12008 10422
13673 10422 5024 4173 7467 7304 5011 6276 10564 11362 11111 9426 4438 2529 4995 6779 7495 4916
13657 4916 4402 3384 1834 963 554 2850 5937 8234 10088 10556 8625 8470 10467 11572 14089 9967
13641 9967 5493 5397 6579 7066 6042 7087 5541 3668 5397 6479 7331 6654 9528 10304 11690 12972
13625 12972 10077 5472 6611 11230 10205 10645 10561 11273 12949 10252 7558 7469 7077 2748 1682 3459
13609 3459 3391 5617 8670 10797 10990 11915 12714 14525 13851 10825 8685 5938 5882 7940 9307 12083 12605
13592 12605 10945 12239 16348 19416 18935 17856 15119 12537 11559 12933 15520 13538 15639 15577 15040 14985
13576A4985j452j44K39p66q36j153K72j470O01q05k092L668L669j452j849r18
13560A0497P53n80j639o55Q12J517P7j260J760J542J251j749N9N08J766J374k878
13543A3155l509N05j9N7k956k138O48J411r74O49J693Q31j724L192J74J187K402
13526A4584k927j376R48j944M94q18O71L452j509j153j189l782j84M113M007k188
13510A1199k295L14J475O756J750n420o82P96k31j498j899J7r63N89J050k643
13494H315p99P45p87k757j053J690J942K832N47j808N27L47k113j83j10r6l302
13477C937P28M09j110J737J368M436L546k41K397k571k225k205J31P70j553l337
13461F217M168K834j800K7Q0L461M22m177j074J602O40Q00j716k639r80J949L176
$$ plain form
13576 14985 13533 13389 13628 12862 12026 10873 11145 9675 10276 9471 7379 11047 14716 13264 11415 10497
13560 10497 11250 10670 9031 8376 9188 10705 10782 9522 11282 12824 14075 12326 12385 12893 14659 16033 13155
13543 13155 9646 10151 10132 10189 7233 5095 5743 7154 6180 6829 8522 9353 7629 10821 10995 12182 14584
13526 14584 11657 10281 11229 9285 9779 8961 9632 13084 11575 10422 9233 5451 5267 9380 13387 11199
13510 11199 8904 9218 10693 17449 19199 13779 13097 13893 13662 12164 10265 10282 9319 9908 10958 8315
13494 8315 7516 8261 7474 4717 3664 5354 7296 10128 10675 8867 9394 9741 7628 7445 7335 7239 3937
13477 3937 4665 5074 3964 5701 7069 11505 15051 14810 17207 14636 12411 10206 10337 11107 9554 6217
13461 6217 10385 13219 11419 11446 11526 14987 15409 11232 10158 11760 12400 13200 11484 8845 7865 9814 12990
13444A2990J877p74j300l235j862Q47L81k648J588K965o17P93K847M43l423o51
13428A0221J963M979J670M186m63l051J54J240J901O400J681J974M759O108P926
13413E1648J2130J9483J4474O836j160p503j1931j2569j1903o938q946q358n665
13400B9598j706J271N13q24l673J860J405j884j748k050L02J5k755j242l292J3
13384A5803M170L621l13N092L817J329M951P388R626J1770J4586J9847K6319L3349
13370A61355K9421K0391L607j8097l2812l2751k8489j6543j2141j1158o789n710
13358E0284o563p310m448j352j43O07k673m430m769k24K14j043j341J505j415
13343A6899K22J943r62r85L869P240L221K546K331N576P514J0823J1401J2399
$$ plain form
13444 12990 14867 14093 12793 9558 7696 8543 8924 6276 7864 10829 10212 11005 13852 14295 10872 10221
13428 10221 12184 17163 18833 23019 22556 19505 19659 20899 22800 29200 30881 32855 37614 43722 51648
13413 51648 63778 83261 97735 104571 103411 95908 83977 71408 59505 52567 43621 35263 29598
13400 29598 27892 29163 29676 28852 25179 27039 28444 26560 24812 22762 23064 23079 20324 19082 15790 15803
13384 15803 19973 23594 23281 28373 32190 33519 38470 45858 55484 67254 81840 101687 128006 161355
13370 161355 190776 211167 214774 196677 163865 131114 102625 86082 73941 62783 55994 50284
13358 50284 43721 36411 31963 30611 30468 31075 28402 23972 19203 18979 19193 18150 16809 18314 16899
13343 16899 17121 19064 18102 17117 20986 28226 31447 33993 36324 41900 49414 60237 71638 84037
13329H4037J5679P047k939p579j4605j6084j6614j1423n699k453k209m205k761
13316B0192j513J13j259j105p89K735K134k355n737l38K517O01K844J90k6j189
13300A7015l758J229J460r63K589q69L750l77l427k48j76l869q45r46K000l80
13284A2185p10J769K289P5J582o18k982n83L923p02J11k02J490L083J268m936
13268A7042k505j242J331K577K333j249k329J095J33j751J374M100j809l424L87
13253A6063K102k678j291j16r82j09L77M403J315j750P32k31k28m84m91j592M04
13236A5444o5L023J457J753l19J897M442l155j386K586k32n64l226l530j095K905
13220A9935L694O040K196N031L952L52j497k116m574m456m059m351l073Q61M683
$$ plain form
13329 84037 99716 106763 103824 96245 81640 65556 48942 37519 31820 29367 27158 22953 20192
13316 20192 18679 18792 17533 16428 15639 18374 20508 18153 12416 12078 14595 15196 18040 18230 18204 17015
13300 17015 13257 14486 15946 14983 17572 16703 20453 20076 16649 16401 16225 12356 11511 10565 12565 12185
13284 12185 11475 13244 15533 15608 17190 16572 13590 13007 16930 16228 16339 16137 17627 20710 21978 17042
13268 17042 14537 13295 14626 17203 19536 18287 15958 17053 17186 15435 16809 20909 19100 15676 16063
13253 16063 18165 15487 14196 14080 13098 12989 13366 17769 19084 17334 18066 17835 17607 17123 16632 15040 15444
13236 15444 15379 18402 19859 21612 21293 23190 27632 24477 23091 25677 25445 24881 21655 18125 17030 19935
13220 19935 23629 29669 31865 36896 40848 41200 39703 37587 33013 28557 24498 20147 17074 17935 22618
13205B2618q39j239m737n063k017M759L169K645L194K581K689r69L33j516n27
13190B5081J220K202J7l684N28N50K857P21J6J778J589L855N261L113N316O732
13174E7152q70j336j488m296n284o718n86P62j942j698N18J099l384l124J206
13159C0011J318j305j180p8K577J065n05L244K735l027n099J736M743J054k517
13144C4772L221N570L023K099k624j07J505K27R80L751j380k975K641L165l054
13129E0814m048L97J231n33J512j8o90n825l613J708L339K267J044j888j855j617
13113D2225l104N63j013J847L357O86k335n04K89J790J13N139M088M529L25J14
13097E8109J031N24m63k251N0n51M584M247K157J22K374K790q00J526k621n780
$$ plain form
13205 22618 21779 20540 15803 10740 8723 13482 16651 19296 22490 25071 27760 26791 27124 25608 25081
13190 25081 26301 28503 28520 24836 25364 25914 28771 29492 29508 31286 32875 36730 41991 45104 50420 57152
13174 57152 56282 54946 53458 49162 43878 37160 36574 37336 35394 33696 34214 35313 31929 28805 30011
13159 30011 31329 30024 28844 28766 31343 32408 31903 35147 37882 34855 29756 31492 36235 37289 34772
13144 34772 37993 43563 46586 48685 46061 45954 47459 47686 48666 52417 51037 48062 50703 53868 50814
13129 50814 46766 47163 48394 47861 49373 49355 48665 42840 39227 40935 44274 46541 47585 45697 43842 42225
13113 42225 39121 39684 38671 40518 43875 44561 42226 41722 42011 43801 43914 49053 53141 57670 57995 58109
13097 58109 59140 59664 59201 56950 57000 56449 61033 65280 67437 67559 69933 72723 71923 73449 70828 65048
13081F5048j465K282j537j391J082N15qm844l009k595j281M78m32j536P46o78
13065E1375J575J977L074L545o60j875J081L401L310j125j201o86k513j818N777
13050F5237J1211J0111O603Q683N366J675n124k528j236k449m18j737m563o196
13036H4635J37Q20j66M93M83L424J466M65Q9K626L581K016M949P22N77K739Q56
13019A09912J390K543N024k200K34J407L121J1311J2004R622J3229J4415J6851
13006A98863J6983J8171J7729J1025K527m579j0939q796l353j241K483N765J0517
12993B55155P447O618J0174R752R887J6281J9292K4079K7579L2963L4813M1641
12981D95681M5457N1885O4608P6000R3641J13080J28065J48274J74035K15680
$$ plain form
13081 65048 63583 65865 64328 62937 64019 64534 64526 59682 56673 54078 52797 53275 52843 51307 52053 51375
13065 51375 52950 54927 58001 61546 60886 59011 60092 63493 66803 65678 64477 63791 61278 59460 65237
13050 65237 76448 86559 93162 101845 107211 108886 103762 101234 99998 97549 97131 95394 90831 84635
13036 84635 84772 85592 85426 85919 86402 89826 91292 91757 91846 94472 98053 100069 105018 105740 106317 109056 109912
13019 109912 111302 113845 118869 116669 116903 118310 121431 132742 144746 154368 167597 182012 198863
13006 198863 215846 234017 251746 262771 265298 260719 249780 240984 237631 236390 238873 244638 255155
12993 255155 262602 269220 279394 289146 299033 315314 334606 358685 386264 419227 454040 495681
12981 495681 541138 593023 657631 733631 827272 940352 1068417 1216691 1390726 1606406
12971A606406K79624L73832N03274O93861R83155J411749K028060K760158L345443
12962A3985562L316267K284593L55710j698494l019971l311998k874189k175155
12954F862325j535974j062039p47686n41706l98693k99223k17420j63424j22318
12945A773842r2352o8916m2951j8566J855K0120M5776P7950J19043J58541J95919
12934B170261K35921K76165L20448L96790N25375P10661R79628J373492J958156
12925H946897K858241M164796N795376P195218P319560N159666Q46608l889867
12917C8396495o935694p524398o380545m670239l181618k136725j473845j058366
12909E035065p85562n93175m56071l54637k86383k41829k07126j70918j32649
$$ plain form
12971 1606406 1886030 2259862 2763136 3456997 4440152 5851901 7879961 10640119 13985562
12962 13985562 17301829 19586422 19942132 18243638 15223667 11911669 9037480 6862325
12954 6862325 5326351 4264312 3516626 2974920 2576227 2277004 2059584 1896160 1773842
12945 1773842 1681490 1612574 1569623 1551057 1552912 1573032 1618808 1696758 1815801 1974342 2170261
12934 2170261 2406182 2682347 3002795 3399585 3924960 4635621 5615249 6988741 8946897
12925 8946897 11805138 15969934 21765310 28960528 36280088 41439754 42286362 38396495
12917 38396495 31460801 23936403 17555858 12885619 9704001 7567276 6093431 5035065
12909 5035065 4249503 3656328 3200257 2845620 2559237 2317408 2110282 1939364 1806715
12900A806715r5773o9389m4124j5776R418M1273P0660R5885J19430J46643J91765
12889B256727K63479L64434N05204P15976J019113J482247K122324K862243L441109
12880A5032856L367509K236976J85386j986623l355190l602939l068467k282101
12872F527407j583453j081958p62065n52762m14507l19696k49403k02062j73115
12863A188386j49843j23286j00931q5090p0885o0551n1733m4771l5900l4648k8301
12852D02447k1948k2551k3571k0903j6802j8123j5891j5946j2667q161j0231j1561
12840B04092o894l767j019l157o626m514n307p491j060K5J757Q179J1792J0872
12826A96882J7746K5516L1506L3873L1671K9951K3001O194j1397k1435k7778l4913
$$ plain form
12900 1806715 1710942 1641553 1597429 1581653 1591071 1632344 1703004 1798889 1918319 2064962 2256727
12889 2256727 2520206 2884640 3389844 4105820 5124933 6607180 8729504 11591747 15032856
12880 15032856 18400365 20637341 20822727 18836104 15480914 11877975 8809508 6527407
12872 6527407 4943954 3861996 3099931 2547169 2132662 1812966 1563563 1361501 1188386
12863 1188386 1038543 915257 814326 729236 658351 597800 546067 501296 465396 430748 402447
12852 402447 380499 357948 334377 313474 296672 278549 262658 246712 234045 225884 215653 204092
12840 204092 197198 193431 192412 189255 182629 178115 172808 165317 164257 164282 166039 174218 186010 196882
12826 196882 214628 240144 271650 305523 337194 367145 390146 396340 384943 363508 335730 300817
12814C00817m3356m0335l5253k7730k0846j6136j3063o059m454o381o930q34N937
12801H5377J241m635m143m69j162m95j968J200k725l759l459l178N3q42l087m64
12785E7485P41q24l089J170n94l356l092l76o77o64K642M66o74j799j200n88J381
12768D6952j068j796m007m586j482j110K876N13K040M07k74J5k796n20k346N65
12752C3383P32l472l12q45q65J565K382p91m18N59m379n166j226M310K973m028
12736B4402k352q20O35L465J307l750M083O667K592J61J404N60l260m054q3l912
12720B7045m006o83K487M026q41J596J534n29Q16J428L596J188k199m142o136
12705B5180m046P91j638j95j854p41L313K423M4k649k886j257j582J601K079m090
$$ plain form
12814 300817 257461 217126 181873 154143 133297 117161 104098 98039 93585 87204 80274 79440 85377
12801 85377 86618 81983 77840 77371 76209 75714 73746 74946 72221 68462 65003 61825 61878 61036 57949 57485
12785 57485 58226 57402 54313 55483 54889 51533 48441 48065 47388 46724 49366 49832 49158 47359 46159 45571 46952
12768 46952 45884 44088 40081 35495 34013 32903 35779 36292 38332 38739 38465 38480 35684 35164 32818 33383
12752 33383 34115 30643 30331 29486 28621 30186 32568 31777 31359 31918 27539 22373 21147 25457 28430 24402
12736 24402 22050 21230 21865 25330 26637 22887 26970 33637 36229 36390 37794 38354 35094 31040 30957 27045
12720 27045 23039 22356 24843 28869 28028 29624 31158 30629 31445 32873 36469 37657 35458 31316 25180
12705 25180 21134 21925 20287 20092 18238 17497 20810 23233 23277 20628 17742 16485 14903 16504 18583 14493
12689A4493k812J862K926J161M36k29P55K505L533J425k161k166R13L382K375
12674B8398K101J585M070O61J027K752r47k84k508k224K117L043J775K686J438
12659D5690R68K833P121P121K319r95J662K293j366j0178n105r686o664l373j865
12644C0775j927k461l536L520N291J937p516p50j798J352K05j459Q41K682J067
12629B8223L926O29m22j584J432K286M021K85j472l33k117K165L347j428m20o91
12613C7847j103k929o075j153L125r5j139M130P86K010P47J353M462J33L81q80
12597D1600J802m35j588J515k00n20Q69k234K276K880k526l055j327M95k484j86
12581C6882l16m10m41J012J424M08J445P90q66k443l228m339r42j109Q93L467
$$ plain form
12689 14493 11681 13543 16469 17630 18066 17837 18592 21097 24630 26055 23894 21728 22641 26023 28398
12674 28398 30499 32084 36154 36815 37842 40594 39647 39363 36855 34631 36748 39791 41566 44252 45690
12659 45690 46658 49491 56612 63733 66052 65057 66719 69012 67646 57468 52363 42677 36013 32640 30775
12644 30775 28848 26387 22851 26371 31662 33599 26083 25333 23535 24887 25092 23633 24474 27156 28223
12629 28223 32149 32778 32356 30772 32204 34490 38511 38796 37324 36991 34874 37039 40386 38958 38538 37847
12613 37847 36744 33815 27740 26587 29712 29617 28478 32608 33394 35404 36151 37504 41966 42099 42480 41600
12597 41600 43402 42967 41379 42894 42694 42174 43043 40809 43085 45965 43439 40384 39057 39552 37068 36882
12581 36882 36566 36156 35715 36727 38151 38559 40004 40794 39928 37485 34257 29918 28976 27867 28760 32227
12565C2227K690j472k950r95Q57j962K99M761J158k411n82k947l219L155L01k082
12549B6828k115J766K502J879J092k45K007K284M07J162M99j425k236j954K092
12534C4543N152N899R232J0361R127P767J2281O191N889L458j651n631m358k360
12520I5900j655K60m766l179J154P88J888L87R08L831K948M885J0239J3912J3689
12505A41189J5173J2582K174m493r662j5868r966j0241r335l004j973n563k331
12492I8682j392Q17M79j197j746j784M191J974L585M73j758K224K311J27J638
12477A08624M493P946M963L370O038Q340J0804J0739J1999J8335K5523L0472L7585
12464B89231L5275L0345J0921j0689k3962k8574k2396j7177j1728m388J097l05
$$ plain form
12565 32227 34917 33445 30495 29500 30357 28395 28694 33455 34613 32202 31620 28673 25454 28609 28910 26828
12549 26828 24713 26479 28981 30860 31952 31707 33714 35998 36405 37567 38066 36641 34405 32451 34543
12534 34543 39695 45594 54826 65187 74314 82081 94362 100553 106442 109900 108249 102618 98260 95900
12520 95900 94245 94505 89739 86560 87714 88502 90390 90777 91685 95516 98464 103349 113588 127500 141189
12505 141189 156362 168944 171118 166625 156963 141095 131129 120888 111553 108549 106576 101013 98682
12492 98682 97290 98107 98586 97389 95643 93859 98050 100024 103609 104082 102324 104548 106859 106986 108624
12477 108624 113117 121063 126026 129396 135434 143774 154578 165317 177316 195651 221174 251646 289231
12464 289231 324506 354851 365772 355083 331121 302547 280151 262974 251246 246858 247955 247650
12452B47650N912P927Q256P024N122N040P461J2233J1370J0942J2843J7045K1593
12439C80418K4438K6307K8064K9513K8733L2334L4536L6140L8923M4654N6280
12428G60340O7645P9131R4855J13363J36641J63316J93324K28009K73890L16240
12418B426754L54866L90411M29661M59568M93954N53369O78728R11605J309293
12409H008209J951126K925533M263883N811729P121382P765520P618550O705673
12401E2171605M954177K302929q97408l858698o004939p260593p759613p487185
12393B6160275o464216m976498l503152k350252j561795j059448p52719n74187
12385D918008m85018m49313m29631m13707l94415l64381l21771k71066k14710
$$ plain form
12452 247650 253562 261489 269745 276769 281891 286931 294392 306625 317995 328937 341780 358825 380418
12439 380418 404856 431163 459227 488740 517473 549807 584343 620483 659406 704060 760340
12428 760340 827985 907116 1001971 1115334 1251975 1415291 1608615 1836624 2110514 2426754
12418 2426754 2781620 3172031 3601692 4061260 4555214 5108583 5787311 6698916 8008209
12409 8008209 9959335 12884868 17148751 22960480 30081862 37847382 45465932 52171605
12401 52171605 57125782 59428711 58531303 54672605 48667666 41407073 33647460 26160275
12393 26160275 19696059 14719561 11216409 8866157 7304362 6244914 5492195 4918008
12385 4918008 4432990 3983677 3554046 3140339 2745924 2381543 2059772 1788706 1573996
12376A573996j73530j41553j18622r9326q3932p4266o9816o6184n9906n1113m8876
12365E86872m1997l5995l0705k4130k1312j6251j2771j4095j5185j5010j4976
12354C44445k0482j6901j0891j3116j4270j4819j4112j1533j2954q220o596m823
12342A95728l740q655r925j0897p427n968q682n368J1L8k177k828k85k834n566
12327A21425m19n962o067n749m312L877N01j530o258m348o165m951l323o04K44
12312G6359L61m00k605j303j502l367J41N41k147l985j424L311J763J218K442
12297F9403M60K349K151N60k463m881l698m158m533o202m216k734m523K369K092
12282D1976P33j583J111P57m14Q99O88j152L483p01p37R71k297k224K479q93k69
$$ plain form
12376 1573996 1400466 1258913 1140291 1040965 957033 882767 812951 746767 686861 635748 586872
12365 586872 544875 508880 478175 454045 432733 416482 403711 389616 374431 359421 344445
12354 344445 323963 307062 296171 283055 268785 253966 239854 228321 215367 207147 200551 195728
12342 195728 191988 183333 173408 162511 155084 149116 140434 135066 135077 135115 132938 130110 129825 126991 121425
12327 121425 121006 115044 108977 103228 98916 102793 103294 101764 95506 91158 84993 80042 76719 76115 76359
12312 76359 76720 76320 73715 72412 70910 67543 67684 68225 66078 62093 60669 63980 65743 66961 69403
12297 69403 69863 72212 74363 74923 72460 67579 63881 59723 55190 48988 44772 42038 37515 39884 41976
12282 41976 42709 41126 42237 42994 42580 43479 44167 43015 46498 45797 45060 46031 43734 41510 43989 43096 42827
12265D2827k529J551L567K180j364K84%j172j954l740k8j94J081j937j809j544
12249C5219K146K396l299j126Q0j328o189l029k187Q27K26j068J458j446L012
12234B5692K020o4m291m769m249m33K883j031l371l442Q4J888R46K870J952k20
12218A6465l298n398j250J343j310k272j394k415n41j160p65R07K397L92K044
12203C745l31j067R80k712j957K846K933J982p82j142k294j356L102M949K729
12188A1625r92l298p15j477q33j081n70J237J407K287O33q55L89J045j888K528
12172I442L817J275L264K033k494j686l570J92P40l416j95L425K801J504o34q92
12156A5606J604o32J013J119J95M47j59M32j198q11j036J12L294L00k842j794
$$ plain form
12265 42827 40298 41849 45416 47596 46232 46516 46516 45344 43390 39650 39622 39428 40509 38572 36763 35219
12249 35219 37365 39761 36462 35336 35416 34088 27899 24870 22683 23510 23736 22668 24126 22680 25692
12234 25692 27712 27648 23357 18588 14339 13906 16789 15758 12387 8945 9029 10917 11863 14733 16685 16465
12218 16465 13167 7769 6519 7862 6552 4280 2886 471 -70 -1230 -1995 -1088 1309 1701 3745
12203 3745 3414 2347 3327 615 -1342 1504 4437 6419 5637 4495 2201 845 3947 8896 11625
12188 11625 10633 7335 6620 5143 4310 3229 2659 3896 5303 7590 8223 7368 7757 8802 6914 9442
12172 9442 13259 14534 17798 19831 17337 15651 12081 12273 13013 9597 9402 12827 15628 17132 16498 15606
12156 15606 17210 16578 17591 18710 18905 19352 19193 19625 18427 17616 16580 16692 19986 20286 17444 15650
12140A5650l889m096k623j4K345K087J961J766j089k61K97j26k177r07k027L01
12124G198j951MK435K147j156l30l893m34q66j806N010L954m87j37K063J661n19
12107A2893m579J114L958J118n06K02n42k45L17r59p5m24l414k615l886k595L91
12090A53K404N170K25j64J523K010p89J45K290K088Q4l110k208L027k66j180J663
12073A3065j435j576k402N26K678J996k535k364k099j919r61j012J015Q01q11
12058B967J55J769N001N765k207m166m24J272J533m48N35o88j336k59M02m62J452
12041A0861j830K141J023k701l75M00o78K139J952j311O8j057L674L479N613K409
12025B5807K638o31L396Q492P842O941J706J590j457J057k550l113o856o393n223
$$ plain form
12140 15650 11761 7665 5042 5028 7373 9460 11421 13187 12098 11837 12134 12008 9831 8924 6897 7198
12124 7198 5247 5251 7686 9833 8677 8347 4454 4020 3154 1348 6358 10312 9825 9688 11751 13412 12893
12107 12893 8314 9428 13386 14504 13998 14200 13658 13413 13730 12771 12696 12272 8858 6243 2357 -238 153
12090 153 2557 7727 7952 7788 9311 11321 10532 10677 12967 15055 15139 12029 9821 12848 12582 11402 13065
12073 13065 11630 10054 7652 8178 10856 12852 10317 7953 5854 3935 2974 1962 2977 3778 2967
12058 2967 3122 4891 9892 15657 13450 9284 8860 10132 11665 11217 11752 11064 9728 9469 9871 9409 10861
12041 10861 9031 11172 12195 9494 9119 9519 8841 10980 12932 11621 11689 10632 14306 17785 23398 25807
12025 25807 28445 27814 31210 39702 47544 54485 56191 57781 56324 57381 54831 51718 44862 38469 33246
12010C3246k226j862k217l179l471J614j386j483N45l21N35J010R95K06K643L310
11994B7959J733P52J681R91M608M823J478M414L905M214P856J1100J8624K7423
11980A21561L8675M0131L6413L2074K5489J5844K499j2505k3249l2074l9005l9019
11968A66834l5478l1490k0067j3677j2732o249p63p278o330k308k931R55J019
11955B9505m598l121l620j930N06J072J955M53l27K69R62J046p82K80M312L831
11939B9813l94J652o48k211K293q97k770J126M648l23j706J873L29j770Q91J745
11923C3651k821J039Q63L032L599L984M379K984Q85L423J907k8J509N764O120
11908G0290J0212R860R817R517J2932J1234J4352K1405K3329K9173L5860M0600
$$ plain form
12010 33246 31020 29158 26941 23762 20291 21905 20519 19036 19581 19260 19795 20805 21800 22006 24649 27959
11994 27959 29692 30444 32125 33116 37724 42547 44025 48439 52344 56558 64414 75514 94138 121561
11980 121561 160236 200367 236780 268854 294343 310187 312686 300181 276932 244858 205853 166834
11968 166834 131356 99866 79799 66122 53390 47141 46378 39100 32770 30462 27531 28486 29505
11955 29505 24907 21786 18166 16236 16742 17814 19769 20222 19895 20164 21126 22172 21390 21670 25982 29813
11939 29813 29419 31071 30423 28212 30505 29608 26838 27964 32612 32289 30583 32456 32785 31015 31906 33651
11923 33651 30830 31869 32732 35764 39363 43347 47726 50710 51595 55018 56925 56897 58406 64170 70290
11908 70290 80502 90362 100179 109696 122628 133862 148214 169619 192948 222121 257981 298581
11896B98581M2159M7997M8503N4968O5894P9446J11218J63323K37198L40400M57685
11885A947372N79584O73156P09266O70754N52419L56301J00951j81261m26372
11876D982170o01166o94085p05793o49820n44545m18580l03709k11785j44216
11867G08471j00439p2122n5716m5152l9362m1170m3910l9238l7197l2724k4381
11856A77060j8385j7138j6003j3113q866r297p299o499p470q432l153j714o347
11843E3344n544k464q77J535l056n570j466j057J406J291m707l07K254P3m192
11828C0663r88m20k170J231j902m845j442O46k533O23j62j074j938R74J382o91
11812A7354j126l067l339K77K96l55j77K18L53l96K075J576j585k801k983l31
$$ plain form
11896 298581 340740 388737 437240 492208 558102 637548 748766 912089 1149287 1489687 1947372
11885 1947372 2526956 3200112 3909378 4580132 5132551 5488852 5589803 5408542 4982170
11876 4982170 4381004 3686919 2981126 2331306 1786761 1368181 1064472 852687 708471
11867 708471 608032 535910 480194 435042 395680 354510 310600 271362 234165 201441 177060
11856 177060 158675 141537 125534 112421 103555 94258 86959 80460 72990 64558 61405 59691 53344
11843 53344 47800 45336 44459 45994 42938 37368 35902 34845 36251 37542 32835 32528 34782 34855 30663
11828 30663 29675 29255 27085 28316 26414 21569 20127 20773 18240 18863 18701 17627 15689 16663 18045 17354
11812 17354 16228 13161 9822 10099 10395 10040 9863 10081 10434 10038 12113 13689 12104 9303 6320 5989
11796E989L570J486K283J389j543j570j232k160K40K772J849N37P24j179M66k36
11780A3385m98j254L65J944K211J097j276k256j870m174o41J113J634l31j705
11765G744j720Q76N56O50J405K209j173l992J797L829P64k205J292k362r02l149
11749E619J353K541L829r11l879j297J709R79Q71J120p78J94j034j096j164k212
11733E844j454M682L116k502J480L49l624j688P90k776J719L016J268q64j12k701
11717F543k786j738j47K34J968K614n42J589J485J198j819l280J927L534j160
11702I620l550j500r55K090l901j399K787J738l97n40J087n13M87j653j510K922
11686D813R73J060K107N3o3m471n33K385J147J552J629l042k328l33j380l097
$$ plain form
11796 5989 9559 11045 13328 14717 13174 11604 10372 8212 8452 11224 13073 13610 14334 13155 13621 13385
11780 13385 12887 11633 11998 13942 16153 17250 15974 13718 11848 7674 7033 8146 9780 9449 7744
11765 7744 6024 6900 7456 8106 9511 11720 10547 6555 8352 12181 12945 10740 12032 9670 8768 5619
11749 5619 6972 9513 13342 12431 8552 7255 8964 9943 10814 11934 11156 11350 10316 9220 8056 5844
11733 5844 4390 9072 12188 9686 11166 11515 7891 6203 6993 4217 5936 8952 10220 9356 9244 6543
11717 6543 3757 2019 1872 2106 4074 6688 6146 7735 9220 10418 8599 5319 7246 10780 9620
11702 9620 6070 4570 3615 5705 1804 405 3192 4930 4533 3993 5080 4567 5054 3401 1891 4813
11686 4813 5786 6846 8953 9006 8943 4472 3939 6324 7471 9023 10652 7610 5282 4949 3569 472
11670D72k404K126M512J228l45j761j725k034J331R38J54N31L094Q47k056j820
11654C088K266L924J534J122J828j366o62q93K62J56j154l406j993k011Q7J713
11638D495J815K205P80P62m51LL106o31K265K282L98K024k599k703m36m78o44
11621A2193l007J025M01m486l155K030O20L112J76p97m67J724l64k378J150J073
11605H850p49M85L43k064J136K60O33j143K234L117o0k305o271K032K447j33J337
11588A0149J454j081j206k732m408J020R17J083J103P61J997M54l764k56L60L350
11572I201j0l424j54K417K035l200N37J04N05N05p06j756M02l442M494M08R44
11555H860J912n29k971J740M154j217K360k473J758R54K321K362l888l159J554
$$ plain form
11670 472 -1932 194 4706 5934 5589 3828 2103 69 1400 2338 2492 3023 6117 6964 4908 3088
11654 3088 5354 9278 10812 11934 13762 12396 11734 10841 11103 11259 10105 6699 4706 2695 2782 4495
11638 4495 6310 8515 9295 10057 9606 9609 12715 12084 14349 16631 17029 19053 16454 13751 13315 12837 12193
11621 12193 9186 10211 10612 6126 2971 5001 5621 8733 8909 8112 7645 9369 9005 6627 7777 8850
11605 8850 8101 8586 8929 6865 8001 8261 8894 7751 9985 13102 13042 10737 4466 6498 8945 8812 10149
11588 10149 11603 10522 9316 6584 2176 3196 4113 5196 6299 7060 9057 9511 5747 5491 5851 9201
11572 9201 9191 5767 5613 8030 10065 6865 7402 7506 8011 8516 7810 6054 6456 3014 7508 7916 8860
11555 8860 10772 10243 7272 9012 13166 11949 14309 11836 13594 14548 16869 19231 15343 12184 13738
11540A3738j671k159Q11J618l70l45L062L459l96O89j533j590k916k015J296K256
11524A3934O00q59j78m02r8L26l794L61K131q18j610L284K84m1N07j624l1J104
11506A3076r53o31L42j018l06j528l26j047j355J33K895O85QJ740L526j113l001
11489A1127k036P51J175L124J339r47L97R18J620J089J253k962J230J658q10l237
11473A5689j905J902K337k879o04o76p96M061K940L199J089M988L746L245L163
11458C9499j236J061j885m935k106J215j389l741j314k186k745k94j966J766O93
11443B0437j487K97m335p58m102j163L017K31J578K217j178n39j341k807P41J801
11427A2609J35N6m78o61m12k660j573M743L454j100j136m0L5k729J445O27J747
$$ plain form
11540 13738 12067 9908 10719 12337 11967 11622 14684 18143 17747 18436 16903 15313 12397 10382 11678 13934
11524 13934 14534 13675 13497 13095 12997 13323 9529 9890 12021 11203 9593 12877 13161 13120 13627 12003 11972 13076
11506 13076 12123 11492 11834 10816 10510 8982 8656 7609 6254 6387 9282 9967 9975 11715 15241 14128 11127
11489 11127 9091 9842 11017 14141 15480 14533 14930 15848 17468 18557 19810 16848 18078 19736 18926 15689
11473 15689 13784 15686 18023 15144 14540 13864 13068 17129 20069 23268 24357 29345 33091 36336 39499
11458 39499 38263 39324 37439 32504 30398 31613 30224 26483 25169 22983 20238 19944 17978 19744 20437
11443 20437 18950 19247 14912 14154 10052 8889 11906 12137 13715 15932 14754 14215 12874 10067 10808 12609
11427 12609 12744 12800 12322 11661 11249 8589 7016 11759 15213 14113 12977 12937 12972 10243 11688 12315 14062
11410A4062J0J213J978q05k577O13N17p37k176R14K620j829k853K817K492P00
11394A6959k060J524R70j941k16K078J739M26l448j613K768k4J960j67j607l173
11378A4175j930n89R56J598K209K285L85l957q1K86J778m69p23o74l97J041k272
11361A3621M11L814M450N53J283j194l380m008m863J427J48L934N28Q56J82j556
11345A6206M05N227K674l199n713k203K908L322J245P56j4k571l331k461l054
11330A0197J799K898N398L382k534j199j60l31J806K163J315N75j332k643o986
11315A4348j839M546R68o24j517J823L602J2l542l550K113K731M85m06j947q26
11299A6377K960J353l562k362R73j54o2K93J749O86K396K095j277o03J670j389
$$ plain form
11410 14062 14072 15285 17263 16458 13881 14494 15011 14274 12098 13012 15632 13803 10950 13767 16259 16959
11394 16959 14899 16423 17393 15452 15236 17314 19053 19479 16031 14418 17186 17162 19122 18955 17348 14175
11378 14175 12245 11656 12612 14210 16419 18704 19089 15132 15051 15337 17115 16646 15923 15249 14852 15893 13621
11361 13621 14032 17846 22296 22849 24132 22938 19558 15550 10687 12114 12262 16196 16724 17580 17762 16206
11345 16206 16611 21838 24512 21313 15600 13397 16305 19627 20872 21628 21614 19043 15712 13251 10197
11330 10197 11996 14894 20292 23674 21140 19941 19781 19450 21256 23419 24734 25309 23977 21334 14348
11315 14348 12509 17055 18023 17399 15882 17705 21307 21319 17777 14227 16340 19071 19556 19150 17203 16377
11299 16377 19337 20690 17128 14766 15739 15585 15523 15816 17565 18251 20647 22742 21465 20862 22532 21143
11283B1143j498r6m806j387J510k07k282J561K209m6m24j811K868O204K133j822
11267B3249j929k837J023K77J511K748M78o5q76k787j97K241J111o66K15k536
11251B0960k541J927j410J628N786k965n138J730j532r64J327L578J686j929l37
11236B1806P50j351J741p07j657j090L829P51j218j398j363N06M532J380j626
11221B4885l533m32N06k308K643N963K493m32l94k352k123J866J251O84K839j414
11205C0142j783j863m925J030L018J181L081K720j492l040r7J431N172L935K499
11190D1009M524J267K523M831N97K839N465J710M430K590L079j23n153k852k384
11175F4352k353m084n593j597j357j587p40o479m939m621m51j014K879L232J688
$$ plain form
11283 21143 19645 19549 14743 13356 14866 14659 12377 13938 16147 16101 15677 13866 16734 22938 25071 23249
11267 23249 21320 18483 19506 19783 21294 24042 24520 24455 23579 20792 20595 22836 23947 23281 23496 20960
11251 20960 18419 20346 18936 20564 26350 23385 18247 19977 18445 17481 18808 22386 24072 22143 21806
11236 21806 22556 21205 22946 22239 20582 19492 23321 24072 22854 21456 20093 20599 25131 26511 24885
11221 24885 21352 20920 21426 19118 21761 27724 30217 29785 29391 27039 24916 26782 28033 28717 31556 30142
11205 30142 28359 26496 21571 22601 25619 26800 29881 32601 31109 28069 27972 29403 34575 38510 41009
11190 41009 45533 46800 49323 54154 54751 57590 63055 64765 69195 71785 74864 74741 69588 66736 64352
11175 64352 61999 57915 52322 50725 49368 47781 47041 40562 35623 31002 30551 29537 32416 35648 37336
11160C7336l100j038l032k211J448K93p08j270J241n28l064l212K095N510K115
11145C1875j876K9O66J354N820j411p11L637J273j367L120L25m057o012J751j00
11129C4316k136J636l848m765R19j14K053Q87m63p39J904r80Q13K32l336K450
11113B8829K41k72k76L430j146j824l320q75M189l77l910L11O379J432p11k169
11097B9931K73J723J493J087p10K063o97j517l14r37l613j557K819o85k385J033
11081B8007K742p2l45K589k6j788J383r02l27j659m84O29j186K933J954J389j229
11064C3608l61J314R6K599L079k252n99K670M32M72l018N46R94k925r73K25J921
11047C7828j57k462k961J439P619P928n966o968m162J257R52l56L222L859O14
$$ plain form
11160 37336 34236 33198 30166 27955 29403 29696 28988 27718 28959 28431 25367 22155 24250 29760 31875
11145 31875 29999 30028 30694 32048 37868 36457 35746 39383 40656 39289 42409 42734 38677 32665 34416 34316
11129 34316 32180 33816 29968 25203 26122 26008 28061 28948 28485 27746 29650 28670 29483 29715 26379 28829
11113 28829 29070 28798 28522 31952 30806 28982 25662 24787 28976 28599 24689 25000 31379 32811 32100 29931
11097 29931 30204 31927 33420 34507 33797 35860 35163 33646 33332 32395 28782 27225 30044 29359 26974 28007
11081 28007 30749 30677 30332 32921 32895 31107 32490 31588 31261 29602 29118 29747 28561 31494 33448 34837 33608
11064 33608 33247 34561 34657 37256 40335 38083 37484 40154 40586 41058 38040 38586 39580 36655 35682 35907 37828
11047 37828 37671 35209 32248 33687 41306 49234 43268 36300 32138 33395 34347 33991 37213 41072 41686
11032D1686k763m316N2P225K455j267l58J610j126m101M96J880L804R26k767r51
11016D2485O172L639P141P940Q347J3775J3187J4582O060L306m340j0332j1805
11003A00157j1503j0611m930l967K206O184N258P489L524K839N1j229q487j0260
10989G6721o310k866m646j459j003m059MK52J466R75n11L289K072J421J659N120
10973G2125N373O506Q205J1608J7705K3525K5506L1981L2525K4703J0900j0045
10961B60617k8881l5591l0834k6533k2845k0330j0071n274m845n783k607Q15l299
10948F4539N25k87m666j949j19K27J601J482R61N65j366k636l60r63k618J736
10932E6672M27K36J822P030N519N014M133P293J4621J5755J4558Q821P246K791
$$ plain form
11032 41686 38923 34607 34659 41884 44339 43072 42714 44324 43198 39097 39593 41473 45277 46203 43436 42485
11016 42485 48657 52296 59437 67377 75724 89499 102686 117268 123328 126634 122294 111962 100157
11003 100157 88654 78043 73113 69146 71352 77536 82794 90283 93807 96646 96697 95468 86981 76721
10989 76721 70411 67545 62899 61440 60437 56378 56382 56634 58100 59075 58564 61853 63925 65346 67005 72125
10973 72125 77498 84004 92209 103817 121522 145047 170553 202534 235059 259762 270662 260617
10961 260617 231736 196145 165311 138778 115933 95603 85532 80258 75413 69630 67023 67838 64539
10948 64539 65064 64777 60111 58162 58043 58270 59871 61353 62314 62879 61513 58877 58517 57554 54936 56672
10932 56672 57099 57335 59157 66187 71706 76720 80853 88146 102767 118522 133080 141901 149147 151938
10918A51938j177j4407j3381p581l961j793Q290R181P393L236j483q726r023j3802
10904A04704j6162j2318n349K106n8o4J89m515L61L042L234j26j661J88J205k488
10888G2288Q06R16j896j656N54N423M707K135M098O298K550J49M842K677J562
10873A05453M681Q651J7030K3022L0412L2262L6973M5084O1069Q4221J16461J52072
10861G17391J51774N1568j04184j81230j65082j15835p7256n1232m1149k7919
10851A56846j9834j5032p778q823k555k527k882k632l916q518p264n277l449l020
10837F3339K78J32L712L153K986J667N71k093r80k258R16K173L36N675P155Q519
10821I5281J1444J4342J4872J4429Q018R56q260j3939j5739j4193j1676r080l580
$$ plain form
10918 151938 150761 136354 122973 115392 111431 109638 117928 127109 134502 137738 136255 127529 118506 104704
10904 104704 88542 76224 70875 72981 72923 72859 73048 68533 68894 71936 75170 75044 73383 73571 74776 72288
10888 72288 73094 74010 72114 70458 71012 76435 81142 83277 87375 93673 96223 96372 101214 103891 105453
10873 105453 110134 118785 135815 158837 189249 221511 258484 303568 364637 448858 565319 717391
10861 717391 869165 920733 816549 635319 470237 354402 277146 225914 184765 156846
10851 156846 137012 121980 114202 105379 102824 100297 97415 94783 90867 82349 75085 69808 66359 63339
10837 63339 63617 63749 67461 70614 73600 75267 75838 73745 72765 70507 71423 73596 73932 79607 86762 95281
10821 95281 106725 121067 135939 150368 158386 159342 151082 137143 121404 107211 95535 86455 82875
10808H2875o994o132k423j244j218j639k401J082j822r88J958N71k14K174q72
10793F2713k186l528l485j23M76j513j050J704O095K274R4k42J64j604O79K886
10777F3354L471k790j962J756J78m64O18K641K708J285J358n162l127j407L724
10762F6181L332j135n077k20L006J72K30j02M817O424Q941K445l831p390m814
10747G2979K099r5j1597n914J1201J2836Q025K861l736j4452j7593m755R656Q945
10733G0460k219m273j222Q149M196n334l606K073N029N393N064J587K71l008j823
10718H0737Q41m96L518K991K671N187L697L90L075M054J790J077O024N651o3K888
10702A24032M943N174Q487J0413Q395J1480J0526j85j7930j8043j4198j0767j3195
$$ plain form
10808 82875 75881 69749 67326 66082 64864 63225 60824 61906 60084 59096 61054 61625 61411 63585 62713
10793 62713 60527 56999 53514 53391 53867 52354 51304 53008 59103 61377 61471 61229 61393 59789 60468 63354
10777 63354 66825 64035 62073 63829 64007 63543 64161 66802 69510 70795 72153 66991 63864 62457 66181
10762 66181 69513 68378 63301 63081 66087 66259 66489 66387 71204 77628 86569 89014 85183 77793 72979
10747 72979 75078 74983 63386 57472 68673 81509 89534 92395 88659 74207 56614 51859 61515 70460
10733 70460 68241 63968 62746 70895 75091 69757 66151 68224 73253 78646 83710 85297 85568 82560 80737
10718 80737 81578 81082 84600 87591 90262 95449 99146 99536 102611 106665 108455 109532 115556 121207 121144 124032
10702 124032 128975 134149 142636 153049 161444 172924 183450 183265 165335 147292 133094 122327 109132
10689A09132q465n301o136m408J741J514K973l6K032J610k454j288K294L16J707
10674I5231K660o13k770l76N532O064L922P56n02K029J561N087N688K515L532
10659A30316L566j758L04K228k483q656q421k497J349L331M748K401L053N219
10645A32700LJ043M453l133l792M0L185K846J971k037R17L637O785R276L975J110
10629A62979j526l095k829J46l83n604k884J3Q37L565M021L151P77K91l652m797
10613A51010n798n092k861k149j259k204l848k244Q62N44K723R489Q741R460Q069
10598A65443L633L776l980o961n825m953L33M265O495L700O093Q966M463k773
10584A82675M842Q358Q273R848J2361J1220M511J308J565R564K2503K9095M4704
$$ plain form
10689 109132 100667 95366 89230 84822 86563 88077 91050 91014 93046 94656 92202 90914 93208 93524 95231
10674 95231 97891 97278 94508 94132 99664 105728 109650 110406 109904 111933 113494 118581 124269 126784 130316
10659 130316 133882 132124 132428 134656 132173 123517 115096 112599 113948 117279 122027 124428 127481 132700
10645 132700 132703 133746 138199 135066 131274 131314 134499 137345 139316 137279 138196 141833 148618 157894 161869 162979
10629 162979 161453 158358 155529 155675 155292 149688 146804 146817 147654 151219 155240 158391 159168 159459 155807 151010
10613 151010 145212 140120 137259 135110 133851 131647 127799 125555 126417 126961 129684 139173 147914 157374 165443
10598 165443 169076 172852 168872 161911 156086 151133 151466 155731 162226 165926 172019 180985 185448 182675
10584 182675 187517 195875 204148 213996 226357 237577 242088 243396 244961 254525 277028 306123 350827
10571C50827P6142Q5418N8707M9879P8972J17342J52097J66967J52347J00464
10561A389162K6418n4506j30185j69891j71914j54272j19656r2317o7889m8669
10551D06281l2169j9957j2731m915k951L52K342N503P121M877K465J019N53K269
10537C60059M15N902P578O674Q765J4210K1568J9817J1916P879Q094N755R619
10524D88251J6590K3530K4025K5875K8773L3335L7952M7994O4712P7221R0330
10513I58588J03422J19364J36625J56687J78054K03692K37814K99226L94699N49791
10503C337962P71520J086306J480858J894394K209615K252973J877249J081180
10495A5992057L9518j000456j794843k188809k171968j874560j462507j068483
$$ plain form
10571 350827 426969 512387 571094 620973 699945 817287 969384 1136351 1288698 1389162
10561 1389162 1415580 1361074 1230889 1060998 889084 734812 615156 522839 454950 406281
10551 406281 374112 354155 341424 336509 333558 333910 336252 341755 348876 353753 356218 357237 357790 360059
10537 360059 360474 366376 373954 380628 389393 403603 425171 444988 456904 464783 472877 478632 488251
10524 488251 504841 528371 552396 578271 607044 640379 678331 726325 791037 868258 958588
10513 958588 1062010 1181374 1317999 1474686 1652740 1856432 2094246 2393472 2788171 3337962
10503 3337962 4109482 5195788 6676646 8571040 10780655 13033628 14910877 15992057
10495 15992057 16031575 15031119 13236276 11047467 8875499 7000939 5538432 4469949
10487D469949p50842n18837l57937k32302j42706r0623m8403j8113M185J6809
10477B331180L5563O5695J15399J87761K84583L56654L09305J91894J98568L46671
10467D423273N24021O51172P04951O96859O43856O13728O87899Q82701J174628
10458A1003088J634416K345561L210587L998961M435761M287619L501575K379731
10450C6797299J486501J482212K998992O571901J2615733K1058006K9940206L1648498
10442A44599348J3400417j7594764l4540906l2315073k2667865j4273512q867352
10435B7740293n653861l784627k760712k240014j951064j703160j405045j060571
10427G181239p39320m92808l48998l33686l88403l96495l32692k39939j51683
$$ plain form
10487 4469949 3719107 3200270 2842333 2610031 2467325 2376702 2328299 2310186 2314371 2331180
10477 2331180 2366743 2432438 2547837 2735598 3020181 3376835 3686140 3878034 4076602 4423273
10467 4423273 4947294 5598466 6303417 7000276 7644132 8257860 8945759 9828460 11003088
10458 11003088 12637504 14983065 18193652 22192613 26628374 30915993 34417568 36797299
10450 36797299 38283800 39766012 42765004 49336905 61952638 83010644 112950850 144599348
10442 144599348 157999765 140405001 105864095 73549022 50881157 36607645 27740293
10435 27740293 22086432 18301805 15541093 13301079 11350015 9646855 8241810 7181239
10427 7181239 6441919 5949111 5600113 5266427 4878024 4481529 4148837 3908898 3757215
10418C757215p7890q105N8698J24726K06081L32566N14049P73410J134426J615807
10408H430983K157608K646268K873258K606849J735118L82826j092562k282895
10400A7457453k920436k974114k604004k062141j532272j098714p76562n47450
10392B941760l97437k99197k29334j93780j74188j66040j49937j33731j13790
10383A084326r7673q5510p9052o9224m9903l4466k8048k4925k7845l0558k9505
10372E27617k8716k0842j9466j3014o669p254j3405j3337r146o969p504n616p422
10359C68257j4479j8144j8786j7020j5986l712Q094P872O700N943K818J209k508
10346C10258p125j0579j1588j0044r760n898k716j04j635O52Q249Q856N348n687
$$ plain form
10418 3757215 3679325 3671220 3729918 3854644 4060725 4393291 4907340 5680750 6815176 8430983
10408 8430983 10588591 13234859 16108117 18714966 20450084 20832910 19740348 17457453
10400 17457453 14537017 11562903 8958899 6896758 5364486 4265772 3489210 2941760
10392 2941760 2544323 2245126 2015792 1822012 1647824 1481784 1331847 1198116 1084326
10383 1084326 986653 901143 822091 752867 702964 668498 640450 615525 587680 557122 527617
10372 527617 498901 478059 458593 445579 438910 431656 418251 404914 395768 388799 381295 375679 368257
10359 368257 353778 335634 316848 299828 283842 280130 288224 296096 302796 308739 311557 312766 310258
10346 310258 303133 292554 280966 270922 261162 255264 252548 252444 250809 251461 259710 268566 273914 268227
10332B68227j3150j5631j5234m863j601k333n697o644m98O785O617j6l16L997
10318B19643J8097J4402m129k4485k0687l227J0745J3209O284j257q913r705j0165
10305A99812m577o86L527O361Q884k107j0502j3891j7248j3437R50Q201J2109
10292A77396J1255J3110O538p90l772m72M292Q43q48L67m434o019p936r701k443
10277A77386J3361K5729L8871O6660R4334P2484M398m1141m4787k9549k5796k1522
10265C30428j6834j2190o002l794l301m010k575K448K116m460r158j0564p381
10252B54723j627K014N369P148M663L936P345J0685P189p47l819k523m656J215
10238B90915j301o43M047P729J0769J8313J8212N094n746n103j527N598N810J1138
$$ plain form
10332 268227 255077 239446 224212 219349 217748 215415 209718 203074 202576 209361 215978 215962 215646 219643
10318 219643 237740 252142 248013 223528 202841 199614 210359 223568 229852 228595 219682 209977 199812
10305 199812 195235 194549 198076 204437 213321 211214 200712 186821 169573 156136 157086 165287 177396
10292 177396 188651 201761 208299 207509 203737 203265 207557 208400 207552 207919 203485 197466 189530 179829 177386
10277 177386 190747 216476 255347 322007 416341 488825 493223 452082 407295 377746 351950 330428
10265 330428 313594 301404 295402 291608 288307 284297 281722 284170 286286 281826 272668 262104 254723
10252 254723 253096 255110 260479 267627 272290 276226 283571 294256 301445 300698 296879 294356 289700 290915
10238 290915 289614 288971 293018 300747 311516 329829 348041 353135 347389 342286 340759 346357 352167 363305
10224C63305J0836O362L839O949J0241J5829K0415J9473J6378P382O082O126J0327
10211E03544J8549K4351K5468K6825J7732P567N412J0567J6361K3763K6591K4259
10199G30989K3786K7412L2185L8984M4098M1781L4334L3911K6881J6743Q606R305
10187A069015K1959M8666P6655R7827J10692J15000J18508J04225Q7451Q3044
10177A933042Q0263Q4702J02802J34045J75863K21266K73608L23479L69401M28087
10167D126558M95063N83094O99794Q41715R90191J110086J132862J015842Q64162
10158A1859367R01373J210924J746114K475947L462220M839859O880212J0089175
10150D3465191J5290485K3654752L6069620N1007355O0518937M9037347R530095
$$ plain form
10224 363305 374141 380503 384342 391291 401532 417361 437776 457249 473627 481009 487091 493217 503544
10211 503544 522093 546444 571912 598737 616469 624036 629448 640015 656376 680139 706730 730989
10199 730989 754775 782187 814372 853356 897454 939235 973569 1007480 1034361 1051104 1059710 1069015
10187 1069015 1090974 1139640 1216295 1314122 1424814 1539814 1658322 1762547 1849998 1933042
10177 1933042 2013305 2098007 2200809 2334854 2510717 2731983 3005591 3329070 3698471 4126558
10167 4126558 4621621 5204715 5904509 6746224 7736415 8846501 9979363 10995205 11859367
10158 11859367 12760740 13971664 15717778 18193725 21655945 26495804 33376016 43465191
10150 43465191 58755676 82410428 118480048 169487403 230006340 279043687 288573782
10143B88573782l6274448n9782179n6742615m1619962k7339059j7645416j1675470
10136C7494633q016677n692756m136704l042050k225810j566678j015225o37485
10128A1161248n38987p05157r08438r77944r33522q40446p29455o14129m96031
10119D417139l79927k83743k21718j86287j88052j96929j94131j73849j27574
10110B464929q3348m2060n18M3498O7432P5998Q2660R6509J17626J41848J83981
10099C148555K61180M09410O52189J029248J613233K484678L628127M708067M793629
10090B2728316K736352j077666m175467n006485m204590k996567k012990j349782
10082D641121r24276o45596m57964l33768k40236j84851j44077j13079r3678q9628
$$ plain form
10143 288573782 252299334 192517155 135774540 94154578 66815519 49170103 37494633
10136 37494633 29477956 23785200 19648496 16606446 14380636 12813958 11798733 11161248
10128 11161248 10622261 9917104 9008666 8030722 7097200 6256754 5527299 4913170 4417139
10119 4417139 4037212 3753469 3531751 3345464 3157412 2960483 2766352 2592503 2464929
10110 2464929 2381581 2339521 2339003 2382501 2449933 2525931 2608591 2705100 2822726 2964574 3148555
10099 3148555 3409735 3819145 4471334 5500582 7113815 9598493 13226620 17934687 22728316
10090 22728316 25464668 24387002 20211535 15205050 11000460 8003893 5990903 4641121
10082 4641121 3716845 3071249 2613285 2279517 2039281 1854430 1710353 1597274 1503596 1413968
10072A413968r0737r1316q7298q3630q4638p8887o9761n2650m4086l7146k7052
10061F66767k5072l0244k6753k5188k8072k9498j8221j3529k0306k2276k3418
10050D04190j6252j2188j1984j5123j9303j2342o181j284L62K69O049O706P467
10037C30386R728R323N102J967p950r582j2975j2642p452Q79K928J1904K0844
10024C42460K8199L7991O8506J14127J64612J81334J15705n0603j72101j74416
10014F55814j20619p6720n0177m4938l9639l6258l2983k0845j7060j0432l521
10003B02622l432j242l956p543l082o72j05N129L285K973M074k668j0903o966
9989A77514l210N877J2541J1312P303O362j764j0580j5484j7930j3384j1451q992
$$ plain form
10072 1413968 1323231 1231915 1144617 1060987 976349 897462 827701 775051 730965 693819 666767
10061 666767 641695 611451 584698 559510 531438 501940 483719 470190 449884 427608 404190
10050 404190 387938 375750 363766 348643 329340 316998 310817 309533 309895 310164 316213 322919 330386
10037 330386 340114 349437 354539 356506 348556 338974 325999 313357 305905 306784 309712 321616 342460
10024 342460 370659 408650 477156 591283 755895 937229 1052934 1002331 830230 655814
10014 655814 535195 458475 408298 363360 323721 287463 254480 233635 216575 206143 202622
10003 202622 199190 197948 193992 186449 183367 182695 182590 187719 191004 193977 198051 195383 184480 177514
9989 177514 174304 180181 192722 204034 211337 217699 215935 205355 189871 171941 158557 147106 138114
9976A38114q567n394q819j1759q313n970m052k314j208M051M296J656k061o598
9962H3062j2897q093k939k812n065q045j482M356J8464K8733K6581J8290R33j1017
9948A28069j7082k1127j9835j6665j1786q736k159Q22k18O944N661N526O704N564
9934F1682N221m269p821r020o727n449l868r8L592k00M712J031k238l031K579
9919C6096N181M357K510L948J160k236M7J649m82O90K074J182j358m395k811j959
9903D5653k653j066l076N245O549M700L520p95j098K194K148m79k401n549q754
9888D4138k525j084k072k458m50j858K339L336k929L60M594J210j16j464p99J991
9872D2213l89k1k098J452Q21M936J34R40l49O44j210m866l62M240J202O78l770
$$ plain form
9976 138114 129547 124153 115334 103575 95262 89292 85240 82926 81718 85769 90065 91721 89660 83062
9962 83062 70165 62072 59133 56321 51256 43211 41729 46085 64549 93282 119863 138153 139086 128069
9948 128069 110987 89860 70025 53360 41574 32838 30679 31501 31283 38227 43888 49414 56118 61682
9934 61682 66903 62634 54813 45793 39066 33617 29749 29651 33243 33043 37755 38786 36548 33517 36096
9919 36096 41277 45634 48144 52092 53252 51016 51063 52712 52230 52920 54994 56176 54818 50423 47612 45653
9903 45653 43000 41934 38858 44103 50652 55352 58872 58077 56979 59173 61321 60842 58441 52892 44138
9888 44138 41613 40529 38457 35999 35549 33691 36030 39366 36437 36797 41391 42601 42485 41021 40222 42213
9872 42213 41824 41803 39705 41157 41978 46914 47048 47988 47639 48283 47073 42207 41845 46085 47287 47965 44195
9855D4195J904P820j176j1227m991J3507K4469J9345M678q529k1236k0817p400
9842D0542Q845J3934Q367k898j0743r730m360n117k503L097P558P468J966M271
9828F0697M964L005j439j997k190m617o006o787l859k143L72K654P305J587k319
9813D9227K181L269P25j575p64j152n6K236K547P63k44M550O488M077M301N292
9797H1865L704Q67K623O015M465M754J683J421Q18O893J1447O769K109J974J033
9782A38440K465K257N975P994J1156J2762J1289Q237J0091J0866J1333J5693J9159
9769B67717J8592K6582L9448M1884M3508N0266N9208P5541J06056J41174J91890
9758A061866K61465L63518M99375O58902P78532P64878N74718K67617o3896m09097
$$ plain form
9855 44195 46099 53919 52743 41516 36525 50032 74501 93846 98524 89995 68759 47942 40542
9842 40542 49387 63321 71688 68790 58047 48317 43957 38840 36337 39434 46992 54460 56426 60697
9828 60697 65661 68666 67227 65230 63040 58423 52417 45630 41771 39628 40000 42654 49959 51546 49227
9813 49227 51408 54677 55402 53827 53063 51911 51855 54091 56638 57401 57157 61707 68195 72272 76573 81865
9797 81865 85569 86436 89059 95074 99539 104293 105976 107397 108215 115108 126555 133324 135433 137407 138440
9782 138440 140905 143162 149137 157131 168287 181049 192338 200575 210666 221532 232865 248558 267717
9769 267717 286309 312891 352339 394223 437731 487997 547205 622746 728802 869976 1061866
9758 1061866 1323331 1686849 2186224 2845126 3623658 4388536 4963254 5230871 5166975 4757878
9748D757878p00225p95900p03157n34127l77162k64139j82204j25852q2281n1608
9738I41223k3736r400l354J630O765J0423K0636L6945N7071R4937J39453J98969
9726A471562K66010L38789L94554M20560L80187K61624J29760Q6401J65645L69460
9716D284552O85833J118879J639567K124408K278446J766432O74223m51235j204205
9707A2916900j351327r80317m68697j99653l26650p19247j124058j309852j206852
9698E230247r43340o63022m40821k73254j51116p0009l6107o7790j37589j69247
9688B277952j33868n8362K3798J07645J96870K89551L56376L32580J64808n448
9678C551902l371J45885L73347O59512J014999J437555J833762J961238J482499
$$ plain form
9748 4757878 4057653 3261753 2558596 2024469 1647307 1383168 1200964 1075112 992831 941223
9738 941223 917487 908087 904733 906363 913128 923551 944187 981132 1038203 1133140 1272593 1471562
9726 1471562 1737572 2076361 2470915 2891475 3271662 3533286 3663046 3749447 3915092 4284552
9716 4284552 4970385 6089264 7728831 9853239 12131685 13898117 14572340 14121105 12916900
9707 12916900 11565573 10585256 10116559 9916906 9590256 8871009 7746951 6437099 5230247
9698 5230247 4286907 3623885 3183064 2909810 2758694 2688685 2652578 2584788 2447199 2277952
9688 2277952 2144084 2085722 2109520 2217165 2414035 2703586 3059962 3392542 3557350 3551902
9678 3551902 3548531 3694416 4067763 4727275 5742274 7179829 9013591 10974829 12457328
9669A2457328N23263j98953k49286K64223R98224J534148J517509R09640q7310
9660A7668786j238532k110698k378683k197161j840384j430621j028437o75652
9652D768618l87797k15960k22502l65197m50342m10413l05006k00933j12289m1545
9642B056634J6616O0406N5887k368o1215n7468K863Q6539J87989K94190M01804
9631C041877N06158N33183M25788K64432K35426M27419P65339J136311J433658
9622H769591J582896J531690J175081M16999n14899j217837j672596j887381j766584
9613F416960j403243j007930o72133m49457l36828l14491l12991k79157k21365
9604A419365j67263j34525j08623r2213q2723p1514n4436m0003l2810k1615j4126
$$ plain form
9669 12457328 12980591 12781638 12532352 12796575 13794799 15328947 16846456 17756096 17668786
9660 17668786 16430254 14319556 11940873 9743712 7903328 6472707 5444270 4768618
9652 4768618 4380821 4164861 3942359 3577162 3126820 2716407 2411401 2210468 2098179 2056634
9642 2056634 2073250 2133656 2189543 2187175 2125960 2068492 2071355 2157894 2345883 2640073 3041877
9631 3041877 3548035 4081218 4507006 4771438 5006864 5434283 6199622 7335933 8769591
9622 8769591 10352487 11884177 13059258 13476257 12961358 11743521 10070925 8183544 6416960
9613 6416960 5013717 4005787 3333654 2884197 2547369 2232878 1919887 1640730 1419365
9604 1419365 1252102 1117577 1008954 916741 834018 762504 708068 668065 635255 613640 599514
9593E99514l363M550J2638J7010K5913M0703O0102Q7584J27051J79853K56854
9582A408409L54525M68321N57886N49354M03588J69595o7493l13499n36978o29759
9572B363949n71335m39444l13536k20000j55643j14965q4807n7080m2872l5082
9562C29185l0319k4654k2103k3401k5080k5095k0633o802m877j3472j7835j5402
9550I9512j3733o273j556k717P898N261j179r075p986k573k127j290k618k317
9536E9227k834l135j144Q38k83k479k001j059k085j920m973m860n15l573J581
9521C0785K338l986l509j352J78K104l203o50j565P25J550Q78m08r26P0K143k393
9504B2779k228lJ225L253N025J354k690o774m283R50N21K151n025k162L80k399
$$ plain form
9593 599514 596151 600701 613339 630349 656262 696965 757067 844651 971702 1151555 1408409
9582 1408409 1762934 2231255 2789141 3338495 3742083 3911678 3844185 3530686 2993708 2363949
9572 2363949 1792614 1353170 1039634 819634 663991 549026 464219 407139 364267 329185
9562 329185 298866 274212 252109 228708 203628 178533 157900 151098 146221 132749 114914 99512
9550 99512 85779 79506 77950 75233 83131 88392 87213 78138 70152 67579 65452 64162 61544 59227
9536 59227 56393 53258 52114 52952 52669 50190 48189 47130 45045 43125 38152 33292 32777 29204 30785
9521 30785 33123 29137 25628 24276 24454 26558 23355 22705 21140 21865 23415 24293 23885 22959 23029 25172 22779
9504 22779 20551 20548 21773 25026 30051 31405 28715 21941 17658 18608 19129 21280 16255 14093 14473 12074
9488A2074L213K908n21O33J143Q70l705j241K042j939l145j304m23j546l914l580
9472A565K197M477J967k159k356J705L400L50k671k054j004L991O684k5k386J913
9456A5594Q6k010j146p56j464j296k4K098J00j970j426j155K317N634M033J188
9440A9803j381o001n911R61R03R85j386j400Mm51L19m458L80P72j445J062j489
9423A267m770N256O672N860j812m282L04j279J083J941m384j905R8K596m27K706
9407H924J1K66M44P11k222k622l350j99j5P67j333N43L166q06M24P04R14j131
9389E196K477j04l066l478k075K79J997J547L665L396J563l706k373r99J501l53
9373E467m08K5l429L98M97r74R77m9l33J687J214J252k08J228L111J003l490O37
$$ plain form
9488 12074 15287 18195 17674 18307 19450 20320 16615 15374 17416 15477 12332 11028 10605 9059 5145 1565
9472 1565 3762 8239 10206 8047 5691 7396 10796 11146 8475 6421 5417 9408 16092 16067 13681 15594
9456 15594 15680 13670 12524 11768 10304 9008 8984 11082 11182 9212 7786 6631 8948 14582 18615 19803
9440 19803 18422 12421 6510 7471 8374 9359 7973 6573 6577 6126 6445 1987 2367 3139 1694 2756 1267
9423 1267 -3503 1753 8425 14285 12473 8191 8495 7216 8299 10240 5856 3951 4049 6645 6218 8924
9407 8924 8935 9201 9645 10356 8134 5512 2162 1963 1948 2715 1382 1925 5091 4285 4709 5413 6327 5196
9389 5196 7673 7569 4503 1025 -1050 -771 1226 2773 6438 9834 11397 7691 5318 4319 5820 5467
9373 5467 5059 5084 1655 2053 2550 1576 2553 2504 2171 3858 5072 6324 6116 7344 10455 11458 7968 8605
9355H605J258J732M067J971O03M194M463M29J658k780n735o629m241j232p92j908
9339E663k807Q85K555J746J616M5m336o01J236J519n58k520r05K617L963k083
9323H035N78J646K294r93K674j465l369k351K415M087M818M835K724J1201J2751
9308D9880R530P842P282n69l871n157k085l566n962o494o579r112n475k36l072
9293B2356m741o32k823o01J05j230l304n56k051L37K463K201J041q93k133K869
9277A2408L485J040O96L209K171N93N324M768Q085R615N839R575O690J825j039
9262G4284N66P547J1386K661o688o613o289k372o491j0629p703n625p870q970
9248B7194o344p231j497J176L675k942m967N70L940n11m333R74l26k14O32L709
$$ plain form
9355 8605 9863 11595 15662 17633 18236 22430 26893 27322 28980 26200 20465 13836 9595 8363 7571 5663
9339 5663 2856 3741 6296 8042 9658 9703 5367 4766 6002 7521 6963 4443 3538 6155 10118 8035
9323 8035 8613 10259 12553 11560 14234 12769 9400 7049 9464 13551 18369 23204 25928 37129 49880
9308 49880 59410 67252 74534 73965 70094 64937 62852 59286 53324 46830 40251 31139 25664 25428 22356
9293 22356 17615 16983 14160 13559 13664 12434 9130 8574 6523 6860 9323 11524 12565 11672 9539 12408
9277 12408 15893 16933 17629 20838 23009 23602 28926 33694 41779 51394 57233 66808 73498 75323 74284
9262 74284 74850 82397 93783 96444 89756 83143 76854 74482 67991 57362 49659 44034 36164 27194
9248 27194 20850 13619 12122 13298 16973 14031 9064 9634 13574 13063 8730 9704 9378 9164 9796 13505
9232A3505K57j323L2p06K731N092L161K268j172N736P390M094N517O590Q245M966
9216F6383J057m59l058k884o527q406q362r622m947J82k922l243m326l584K164
9201A1446J814j805k176m44K61L186k166l690k563k103q22M073j191R84j600J649
9185D853K542J706J432R25j915N45J541J783L445K195M974K334k645m583j829
9170A7303J777l497m719k085k741k374r3l62J27K602M355l108j713J34NL646j916
9153G341k81k375j485J87J650J914J68J74n79P37j036L799K95k507l062k632o16
9136A692O88o13P23k1L789j175l56J15L062o93m65l347j636kJ329J567J450j574
9118D533J281r02k072N98J833J638J205J098o11K395O31l743n56O08j310l73m339
$$ plain form
9232 13505 13762 12439 12471 11765 14496 19588 22749 25017 23845 29581 36971 41065 46582 53172 61417 66383
9216 66383 67440 66981 63923 61039 54512 46106 37744 28122 23175 23357 20435 17192 12866 9282 11446
9201 11446 13260 11455 9279 8835 9096 12282 10116 6426 3863 1760 938 5011 3820 4804 3204 4853
9185 4853 7395 9101 10533 11458 9543 10088 11629 13412 16857 19052 24026 26360 23715 19132 17303
9170 17303 19080 15583 10864 8779 6038 3664 3571 3209 3336 5938 10293 7185 5472 5606 5611 9257 7341
9153 7341 7060 4685 3200 3387 5037 6951 7119 7293 6714 7451 6415 10214 10509 8002 4940 2308 1692
9136 1692 2380 1767 2490 2469 6258 5083 4727 4842 7904 7211 6746 3399 1763 1761 3090 4657 6107 4533
9118 4533 5814 4912 2840 3438 5271 6909 8114 9212 8601 10996 11627 7884 7328 7936 6626 6253 1914
9101A914R34q37k404L305J291k01J770k240N36k660M157J384O20k071K686L813
9085A1997j072j53k59K262o90j428L332J753n159K123J234L587j843k557J619
9070A4746K959K658k696l471j304K919q14k067J644M100j837l082n36J270K382
9055A6871M35l21k264p89K33j23O45L927j260l060k286P47k84k215j664K418N028
9038A6038K13k03m34l86L593O07J226r85l101J713j024k327K041K084l40j464
9022A7251k764j2m588N57M21l06j245O25M984M410M959L739k127l89n96k722l663
9005A8534j928k64NJ392N00J136m64L372K764k979k077j718j962Q77K845L215
8989B3248J209k805l031r3R60K22L30R39M348r57J8J81j063N45K562M76r52n40
$$ plain form
9101 1914 2848 2011 -393 2912 4203 4002 5772 3532 4068 1408 5565 6949 7569 5498 8184 11997
9085 11997 10925 10772 10513 12775 12085 10657 13989 15742 10583 12706 13940 17527 15684 13127 14746
9070 14746 17705 20363 17667 14196 12892 15811 14997 12930 14574 18674 16837 13755 13219 14489 16871
9055 16871 17306 16985 14721 13932 14165 14042 14687 18614 17354 14294 12008 12755 12471 10256 8592 11010 16038
9038 16038 16251 16048 15614 15228 18821 19428 20654 19669 16568 18281 17257 14930 16971 19055 18715 17251
9022 17251 14487 14475 9887 10444 10865 10559 9314 9939 14923 19333 24292 28031 25904 25515 24919 22197 18534
9005 18534 16606 16342 16347 17739 18239 19375 18911 22283 25047 22068 19991 18273 16311 17188 20033 23248
8989 23248 24457 21652 18621 18528 19488 19710 20040 20979 25327 24370 24388 24569 23506 24051 26613 27089 26137 25597
8971B5597j323m72k262N66j280k443K503K436j557J157J605l69J312j517j391
8956B2562J489K017L99K289k024k055J858L70l62l342j015L445K193M842J197
8941C3863m20q48j101j927J277R70j540j428k993j20L313J058j517k658j596J380
8925B5713L57N38j598k879J029K054J957J730K981K292o57M40k63k478j20L908
8909C5004m28l646J097l02K833L334n81l193j159R51J217J541R23K652J183K200
8893D3626l089k278K368j494j131J79K583o97K381L919l50j067J814n39k205l4
8877D3986P74l76k762K28J828p68R7M054p48j438o30K58m25J092p92K627j03Q38
8859D7740L645O61o96Q7J53K963J356Q99N28m51j264r2j055j008K198L915J264
$$ plain form
8971 25597 24274 23802 21540 22106 20826 18383 20886 23322 21765 22922 24527 24158 25470 23953 22562
8956 22562 24051 26068 26467 28756 26732 24677 26535 26905 26543 23201 22186 25631 27824 32666 33863
8941 33863 33443 32595 31494 29567 30844 31814 30274 28846 25853 25733 29046 30104 28587 25929 24333 25713
8925 25713 26070 26608 25010 22131 23160 25214 27171 28901 31882 34174 33517 33957 33694 31216 31096 35004
8909 35004 34576 30930 32027 31725 34558 37892 37311 34118 32959 33910 35127 36668 37591 40243 41426 43626
8893 43626 40537 38259 40627 39133 38002 38181 40764 40067 42448 46367 46017 44950 46764 46225 44020 43986
8877 43986 44760 44384 41622 41850 43678 42910 43007 47061 46313 44875 44245 44503 44078 45170 44378 47005 46902 47740
8859 47740 51385 52046 51350 51437 51590 54553 55909 56808 57336 56885 55621 55529 54474 53466 55664 59579 60843
8842F0843j291l211k819K255L286R50k012L34m01m87N39N539L395k690J704J044
8826F6978n49J837k736j033L088J632J631k43P07J748j649k376M97J338P85Q25
8810G2480J237J285J129P80k299k750R94K992K770l47r29J903J35K908K199J23
8794H4610j719L026L183Q17q63j573k590L312L326j87K010J620l009m33J570P74
8778I3874P387R39O1K31m609J679N193J885j388J866K173j67j157k119M163K252
8762A12263K61m85J583j450M08L564J043L497q78m703R54K997L549K427J617K87
8746A26934N33K571L014j579R27K152j589K009N463R24m38k235Q76L414R84j251
8730A42709K364J866N62K067M278J91J443K716j11q3J031j094J46J892O032J103
$$ plain form
8842 60843 59552 56341 53522 55777 59063 60013 58001 58335 57934 57447 57986 63525 66920 64230 65934 66978
8826 66978 66429 68266 65530 64497 67585 69217 70848 70605 71312 73060 71411 69035 69532 70870 71655 72480
8810 72480 73717 75002 76131 76911 74612 71862 72856 75848 78618 78271 77342 79245 79380 82288 84487 84610
8794 84610 82891 85917 89100 89917 89054 87481 84891 88203 91529 91342 93352 94972 91963 91530 93100 93874
8778 93874 101261 102200 102261 102492 97883 99562 104755 106640 105252 107118 109291 109124 107967 105848 110011 112263
8762 112263 112524 112039 113622 112172 112580 116144 117187 120684 119806 115103 116057 119054 122603 125030 126647 126934
8746 126934 127467 130038 133052 131473 132400 134552 132963 134972 140435 141359 140921 138686 139562 142976 143960 142709
8730 142709 145073 146939 147501 149568 153846 154037 155480 158196 158085 158002 159033 157939 158085 159977 166009 167112
8714A67112K701K057N954N338J956j460L621P42K254M036K572J246k470M58K985
8699A99102O166l33l52J801j548L055P295N323J695L540J227J49J717K650Q02
8684B32289K972O694P183M012K450M099J093J542K603K010L305L734J757J604
8670B77347N363N410L405O158P210P530M299L260J896N002P607N313N333K240
8656C47373M498L265M307N298M914N295L647N165P042R661O407K429K134K523
8642D13958O126R368P423N649P079Q004Q802P083Q064Q886J2218O970K691R513
8628E21834J0657Q214J0424J3665J0206Q634N949P208J1229J1050O071J3206J1889
8615F50236J3595J3276J0937Q595J2297J2300J6160J4288J3191J5595J8147J7702
$$ plain form
8714 167112 169813 171870 177824 183162 185118 183658 187279 188021 190275 194311 196883 198129 195659 196117 199102
8699 199102 205268 204935 204583 206384 204836 207891 215186 220509 222204 225744 226971 227120 228837 231487 232289
8684 232289 235261 241955 249138 253150 255600 259699 260792 262334 264937 266947 270252 273986 275743 277347
8670 277347 282710 288120 291525 297683 304893 312423 316722 319982 321878 326880 334487 339800 345133 347373
8656 347373 351871 355136 359443 364741 369655 374950 378597 383762 390804 400465 406872 409301 411435 413958
8642 413958 420084 429452 436875 442524 449603 457607 466409 473492 481556 490442 502660 509630 512321 521834
8628 521834 532491 540705 551129 564794 575000 583634 589583 596791 608020 619070 625141 638347 650236
8615 650236 663831 677107 688044 696639 708936 721236 737396 751684 764875 780470 798617 816319
8603H16319J7507J3825J5252J8440J8841J7605J5768J9183K3329K2798J7286K0370
8591A036523K0065K3781K1787J9503K3806K5271K7233K7584K7495K5556K9656
8580A308260K9052L0887K9633K9148K7597L2568L2385L3943L6376L1571L6426
8569A657846L6296L8066L9761M1491L7007L6174L8594L9050M1789M2364M2106
8558B090544M1002M4912M4949M2038M2051M3945L8357M1050M5333M3219L6879
8547B554279L8549M3017M1180M3910L6230L1235L3285L1766K8687K9211K3112
8536B934461K3709K0754J8252J8054J3835J2037Q832K975O48k836m725p018j0468
8523C028510j0113j3486j7528k1361k0168k5514k8824k8457l1998l3628l8557
$$ plain form
8603 816319 833826 847651 862903 881343 900184 917789 933557 952740 976069 998867 1016153 1036523
8591 1036523 1056588 1080369 1102156 1121659 1145465 1170736 1197969 1225553 1253048 1278604 1308260
8580 1308260 1337312 1368199 1397832 1426980 1454577 1487145 1519530 1553473 1589849 1621420 1657846
8569 1657846 1694142 1732208 1771969 1813460 1850467 1886641 1925235 1964285 2006074 2048438 2090544
8558 2090544 2131546 2176458 2221407 2263445 2305496 2349441 2387798 2428848 2474181 2517400 2554279
8547 2554279 2592828 2635845 2677025 2720935 2757165 2788400 2821685 2853451 2882138 2911349 2934461
8536 2934461 2958170 2978924 2997176 3015230 3029065 3041102 3049934 3052909 3053557 3050721 3045996 3038978 3028510
8523 3028510 3018397 3004911 2987383 2966022 2945854 2920340 2891516 2863059 2831061 2797433 2758876
8512B758876l7581l4799l6176m2499m1537m2226m0672m3681m1275l8640m4357
8501B315433m3698m3564m2044m3430m2446l7333m0934m3120m4038m5851l9965
8490A849010l7419l6960l9174m0416l9747l7204l1986l1782l3018l0096l4872
8479A456336l2416l4629l0893k5375k6266k9542k8274k9020k7340k5191k5613
8468A141777k2050k4073k0421k1169j9927k0686k5036k3116j8513k0530j9039
8457I07217j8817j4517j4815j8078j7017j4832j4812j7504j6866j4363j4921j6098
8445G14577j5484j1410j2169j1250j2384j2158j4387j1172j0366p618q407j0523
8433E77249j0336o889p336j0328j2383j3591q262r184o246m608j0592r656n969
$$ plain form
8512 2758876 2721295 2686496 2650320 2607821 2566284 2524058 2483386 2439705 2398430 2359790 2315433
8501 2315433 2271735 2228171 2186127 2142697 2100251 2062918 2021984 1978864 1934826 1888975 1849010
8490 1849010 1811591 1774631 1735457 1695041 1655294 1618090 1586104 1554322 1521304 1491208 1456336
8479 1456336 1423920 1389291 1358398 1333023 1306757 1277215 1248941 1219921 1192581 1167390 1141777
8468 1141777 1119727 1095654 1075233 1054064 1034137 1013451 988415 965299 946786 926256 907217
8457 907217 888400 873883 859068 840990 823973 809141 794329 776825 759959 745596 730675 714577
8445 714577 699093 687683 675514 664264 651880 639722 625335 614163 603797 596179 587772 577249
8433 577249 566913 560024 552688 542360 529977 516386 508124 498940 492694 488086 477494 467838 461869
8420D61869p959j0019q368p355m599p289m673p973p312n292n869n951l248m206
8406C71756p486m617k437p111o541j578n605o586n795j894j810m354r175m510
8392C02257m174n873p492k701m19k926k374j420o132o597l795k955r22l220o515
8377B44742o299m904N69p90l627m382l415l337k264m310l096p15n23j888l862
8362B01899l063J20J567K815q44k922r298k377k593j316k452l028k356m850k996
8347A68306K49P30j524k550k745k247L82l929m423j032P41o76l651m452l06J110
8331A43983K200k555p91n08m43m939j530j321m148j111J157J321j58k995m416
8316A23746j986j227o19K179j861k371r70k647R95m306k637l66P94l727J18k447
$$ plain form
8420 461869 453910 443891 435523 428168 423569 416280 411607 403634 396322 391030 385161 379210 375962 371756
8406 371756 364270 359653 357216 350105 343564 341986 336381 329795 324000 322106 320296 315942 306767 302257
8392 302257 298083 292210 284718 282017 281598 278672 276298 274878 268746 262149 258354 255399 254477 251257 244742
8377 244742 238443 233539 234108 233318 229691 225309 221894 218557 216293 211983 208887 208172 207649 205761 201899
8362 201899 198836 198956 200523 203338 202494 199572 190274 187897 185304 183988 181536 178508 176152 171302 168306
8347 168306 168555 169285 167761 165211 162466 160219 160601 156672 152249 151217 151958 151282 147631 143179 142873 143983
8331 143983 146183 143628 142837 142329 141886 136947 135417 134096 129948 128837 129994 131315 131157 128162 123746
8316 123746 121760 120533 119914 122093 120232 117861 116891 114244 115239 110933 108296 107930 108724 104997 105115 102668
8300A02668K456M069j904k625j682R88O94r84n226k005J119m91J621J434j36k274
8284I7722j54P29P97M017J536O51J0766J4693J9323K9548K8331J1718j8212k8927
8270A72538k4148j9953j5100q528l652n950l984j901l128k073R41M69o067l328
8256G6136n654k288K259k484j497J796N37O87j400k231K862m98r42L39J554J691
8240G0867M076r83N070R864J0312J3359K3148K6938K1565L193j8462l0778k6937
8227A11232j7918q904p688j442k56l976m146o369k166M43j45k792k627J442J548
8212E6236k041r35k785k311N19j545k912l61j250J764K974J497o79J8K604K312
8196E3105j023n294j872J490j633J358K748k815J278K048K098P36o233j227J153
$$ plain form
8300 102668 105124 109193 107289 104664 102982 103970 104664 103680 98454 96449 97568 97077 98698 100132 99996 97722
8284 97722 97568 98297 99094 103111 104647 105298 116064 130757 150080 179628 207959 219677 201465 172538
8270 172538 148390 128437 113337 104809 101157 95207 91223 89322 86194 84121 85062 85531 79464 76136
8256 76136 70482 68194 70453 67969 66472 68268 68805 69492 68092 65861 68723 68225 67283 67622 69176 70867
8240 70867 74943 73960 79030 88894 99206 112565 135713 162651 184216 187409 168947 138169 111232
8227 111232 93314 84410 76722 75280 75024 71048 66902 60533 58367 58810 58665 55873 53246 54688 56236
8212 56236 54195 53260 50475 48164 48683 47138 44226 43865 42615 44379 47353 48850 48171 48189 50793 53105
8196 53105 52082 46788 44916 46406 44773 46131 48879 46064 47342 49390 51488 52224 45991 44764 45917
8181D5917k240k982n91k414l856Q96M007N417j866n988j717q42O77K47P50l048
8165C2367K512K078J373j074j46l022J434N85P15l54k186k849k122M51k698j811
8149B5253J25n58K88J403O57J532K121J067j627n406k71L725J816k2l621l807
8133B2675L98m59p80M005N456L72K8l976k504L02o16J039j403P03l67j166L117
8116B6824j899l977l76j383k544N52L744J622J211J141J510j044m822j379j273
8101A7907l395j101J701N45O658K738l736j921j267J065K781n573m139J623J462
8086A5348K588Q08K814j95r68j426r56q28j267K105N244K425q81m800l432R44
8070A7523K548R15j556k731k296L102M183k910l528o91j006j708j199K071L153
$$ plain form
8181 45917 43677 40695 40104 37690 33834 34730 38737 44154 42288 36300 34583 33741 34418 34665 35415 32367
8165 32367 34879 36957 38330 37256 37110 34088 35522 36107 36822 36468 34282 31433 29311 29762 27064 25253
8149 25253 25378 24820 25108 26511 27168 28700 30821 31888 30261 24855 24584 28309 30125 30103 26482 22675
8133 22675 23073 22614 21834 25839 31295 31667 31695 27719 25215 25517 24901 25940 24537 25240 24873 23707 26824
8116 26824 24925 20948 20572 19189 16645 17197 20941 22563 23774 24915 26425 25381 20559 19180 17907
8101 17907 14512 13411 15112 15657 22315 25053 21317 19396 18129 19194 21975 16402 12263 13886 15348
8086 15348 17936 18744 21558 21363 20395 18969 18013 17185 15918 18023 23267 25692 24811 20011 16579 17523
8070 17523 20071 20986 19430 16699 14403 17505 21688 18778 15250 14559 13553 11845 10646 12717 15870
8055A5870K684M57j557r37J819J511O16j310j501j747j550r46o08J67P41L967
8039A7676l05l36l584J131K674j124n6J500L18n308K93R18l167J105L092j55k295
8022A2377j954R85K727M197k154J871K985k063m434j17R13L23j752j383k643J338
8006A1216J026J578j091l001P36J239l118J268L001k452o53m149L94J995L742
7991A1731K098k819j365J889J011k981l421J004K333R12M57m60l91K353J061J36
7975A3548j024n308k338L749J716L094o89l371l695l081K169j976j094K76P170
7960I146P194k420j894m00K68mL81K902J336k15k036p5J896m890l480K219L600
7943A3528j08l725k573j345r82J815J612P67k48m4j0J390J665j921j506l87K89
$$ plain form
8055 15870 18554 19011 17454 16517 18336 19847 20463 19153 17652 15905 14355 13409 12801 12968 13709 17676
8039 17676 17371 17035 13451 14582 17256 16132 16076 17576 17894 12586 12879 13797 10630 11735 14827 14672 12377
8022 12377 10423 11408 14135 18332 16178 18049 21034 18971 14537 14420 15333 15656 13904 12521 9878 11216
8006 11216 12242 13820 12729 9728 10464 11703 8585 9853 12854 10402 9749 5600 5994 7989 11731
7991 11731 13829 11010 9645 11534 12545 9564 6143 7147 9480 10392 10849 10389 9998 12351 13412 13548
7975 13548 12524 7216 4878 8627 10343 13437 12748 9377 5682 2601 4770 2794 1700 1976 9146
7960 9146 16340 13920 12026 11626 11894 11890 12271 15173 16509 16294 14258 14183 16079 11189 7709 9928 13528
7943 13528 13420 9695 7122 5777 4795 6610 8222 8989 8741 8697 8687 10077 11742 9821 8315 7928 8217
7926H217j341P35j296r60k536L718L114J601K184J39k990pM27l78p23J321j342
7909I883L957j065l66j964k6J259j742J892L647j379j131j79q46l03j010J805
7893A2432J751K02q05J939J21n80k827l682J340J882k534j374k158n47J071K563
7877H794R36J282J277Q43k329n948j545K849K229l17k049j452J410L202l016j038
7861E128M39j796K627J610j926j237j175j94J75o14j456n11J615J58j066J168
7845B945J295k964Q60K610J19k572j719J728K703L013k037l22J612j059j552K660
7829G320K101k07j306j89j552p68J352j539k786p99K93k797P20L048l52J295J120
7812D954k240n5o05j533K342O43N27k340p47p15k713j208m09P90L155K039K828
$$ plain form
7926 8217 6876 7611 6315 5355 2819 6537 9651 11252 13436 13575 10585 10578 11005 10627 9904 11225 9883
7909 9883 13840 12775 12409 10445 10419 11678 9936 11828 15475 14096 12965 12786 11940 11637 10627 12432
7893 12432 14183 14385 13580 15519 15640 15060 12233 8551 9891 11773 9239 7865 5707 5160 6231 8794
7877 8794 9730 11012 12289 13132 10803 4855 3310 6159 8388 8071 6022 4570 5980 9182 6166 5128
7861 5128 5567 3771 6398 8008 6082 4845 3670 3476 3651 3037 1581 1070 2685 2843 1777 2945
7845 2945 4240 1276 2136 4746 4865 2293 574 2302 5005 8018 5981 5659 7271 6212 4660 7320
7829 7320 9421 9214 7908 7719 6167 5399 6751 5212 2426 1627 1920 -877 -157 2891 2539 3834 4954
7812 4954 2714 2659 2054 521 2863 3506 4033 1693 946 231 -2482 -3690 -4099 -3309 -154 1885 4713
7795D713n17k05k08j317k76j853r47j739K175K616k042l063L527j59R0K242P6
7778C113J489l145j671K561j573K22J760j398k437o18J566R21n39K970J691j430
7762C482j517J478N900J683J59k235k310o17m898n145j086j58J226L230j012N41
7746a279J640K761l682m203L031o95l65n43k230N44N337Q38j83Q83Q15l405J211
7729D75J3j445O46J804j547K530r56j68O4K32J266p61l925M1J423R61j520M93
7711c74K607L136L835j230l185m042l591j399M104L906J27j427l045K86j68J48
7695c12J757q45p51o89K85K296k861k304N631K341k847O4K209j359r43j212m084
7678c624K858Q01R9l298k75K679N24O6K469M420K607k650j705J60j197j0j961
$$ plain form
7795 4713 4196 3991 3783 2466 2190 337 -610 -2349 -174 2442 400 -2663 864 705 795 3037 3113
7778 3113 4602 1457 -214 2347 774 996 2756 1358 -1079 -1697 -131 790 251 3221 4912 3482
7762 3482 1965 3443 9343 11026 11185 8950 6640 6023 1125 -4020 -5106 -5264 -4038 -808 -1820 -1279
7746 -1279 361 3122 -560 -4763 -1732 -2427 -2792 -3335 -5565 -5021 316 1154 971 1854 2669 -736 475
7729 475 488 -957 -311 1493 -54 2476 1520 1352 1416 1648 2914 2153 -1772 -1731 -308 653 -867 -374
7711 -374 2233 5369 9204 7974 4789 747 -2844 -4243 -139 3767 3894 2467 -578 -292 -460 -312
7695 -312 1445 600 -151 -840 -555 1741 -1120 -3424 2207 4548 1701 1765 3974 2615 1672 460 -3624
7678 -3624 -766 35 134 -3164 -3439 -760 -236 -170 2299 6719 9326 6676 4971 5131 3934 3924 1963
7661A963k891l86J148l882j384q04K003k011k606q74L803K406K091N95J001o55
7645d83M15K801j72j138k78L603k584j038j009k163J191R00n69k291j229k347
7629f391M022K213J563L05q97k518k450o89K537K135P74L44Q93m652l502J65K583
7612c565P29J797l5j263m244k98K456j145j666L169K813L651j184k23m241n66
7596c815P14j745m282k585l7J152J800J340K747J324k579J841M908k464l997O44
7580e034P68Q93K622N48L05r87j944J228M204j008j479k346j619P0J366L168M39
7563A194J31j436r02m58q02J728K555k043j752L165L394L75k120l490r07M122
7547B754K452k245r45j241p57J600k029o82M16L511K594N66l31k347k538j944
$$ plain form
7661 1963 -928 -1314 -166 -4048 -5432 -6236 -4233 -6244 -8850 -9724 -5921 -3515 -1424 -829 172 -483
7645 -483 -68 2733 2561 1423 1145 4748 2164 1126 117 -2046 -855 45 -524 -2815 -4044 -6391
7629 -6391 -2369 -156 1407 1712 815 -1703 -4153 -4842 -2305 -170 604 948 1841 -2811 -6313 -6148 -3565
7612 -3565 -2836 -1039 -1074 -2337 -6581 -6879 -4423 -5568 -7234 -4065 -1252 2399 1215 992 -3249 -3815
7596 -3815 -3101 -4846 -9128 -11713 -11750 -10598 -8798 -7458 -4711 -3387 -5966 -4125 783 -1681 -5678 -5034
7580 -5034 -4266 -3373 -751 -203 102 -885 -2829 -1601 2603 1595 116 -2230 -3849 -3779 -2413 755 1194
7563 1194 1325 -111 -1013 -1471 -2273 -545 2010 -33 -1785 1380 4774 5149 3029 -461 -1368 2754
7547 2754 5206 2961 2016 775 18 1618 -411 -1093 -677 2834 5428 5994 5663 3316 778 -1166
7531a166n47K342k728j044J729M16l07m214l549Q80Q10j329p28l40K309P33N30
7514f203M191Q6m39j296k565n36J396J510K238j611j260J111J462J944J323J917
7498C268k484n033j89N420K433n31k471M83l988j902l23M095J04j805l19q79j381
7481e502n537m0K20M626L211K633O90j131l177k76R81k47k739j180M193L675O77
7464A077k112M9k283j093J552j452Q31K261o80p93j537k87r04K410O90R22n61
7447a910K787N15n770p93J930L197j320R01R80P95k425j917J726m53m381J335
7431d803K042K708K749j377M77k634j702J243j466k507l478K129M59K02L146l404
7415f216J790M992N66j769m9J51j465k073j913j767N58M112J087k605j108L377
$$ plain form
7531 -1166 -1713 629 -2099 -3143 -1414 -998 -1305 -5519 -9068 -8188 -7378 -8707 -9435 -9775 -7466 -6733 -6203
7514 -6203 -2012 -1926 -2365 -3661 -6226 -6762 -5366 -3856 -1618 -3229 -4489 -3378 -1916 28 1351 3268
7498 3268 784 -4249 -4438 982 3415 2884 413 896 -3092 -4994 -5317 -1222 -1118 -2923 -3242 -4121 -5502
7481 -5502 -11039 -11079 -10859 -6233 -3022 -389 301 -830 -4007 -4283 -3302 -3549 -6288 -7468 -3275 400 1077
7464 1077 -1035 -986 -3269 -4362 -2810 -4262 -3431 -1170 -1850 -2643 -4180 -4467 -5371 -2961 -2271 -1349 -1910
7447 -1910 877 1392 -4378 -5171 -3241 -44 -1364 -463 517 1312 -1113 -3030 -1304 -1757 -6138 -4803
7431 -4803 -2761 -53 2696 1319 1796 -838 -2540 -1297 -2763 -5270 -8748 -6619 -6160 -5958 -2812 -6216
7415 -6216 -4426 566 1132 -637 -686 -535 -2000 -4073 -5986 -7753 -7195 -3083 -1996 -4601 -5709 -2332
7399b332K896r87m716J54J339r71L020J554j834O98k105o37L35n97J538l93k655
7382e693L20L07L81K852L269l827n304J441M618m48j773L930M733r23j808l267
7366a192m452J65j214L180J868J820J535j436j555j041j379j15N013J635P21j996
7350A557j642j243L13L503j826n17l66P57J213n66j822l048J904Q91K35L20M78
7333A41q27M1k75K157m338j094K72k829j567J775M19Q54kO30J818k962m422K260
7315g949M590K485J946O89k662n004J114K509k485j630m06j002Mm15J357J074
7299e785J413K033K237q33K269j591n979J972K820j686q26l085k79P86j298j761
7283i593j98J129J077k93r76N11J160K171R11K33j11kn3j163K803J650k215q25
$$ plain form
7399 -2332 564 -423 -5139 -4985 -3646 -4617 -1597 -43 -1877 -1179 -3284 -3921 -3586 -4183 -2645 -3038 -5693
7382 -5693 -5373 -5066 -4685 -1833 1436 -2391 -7695 -6254 -1636 -2084 -3857 73 4806 3883 2075 -1192
7366 -1192 -5644 -5479 -6693 -3513 -1645 175 1710 274 -1281 -2322 -3701 -3816 1197 2832 3553 1557
7350 1557 -85 -1328 -1015 2488 662 145 -221 536 1749 1183 -639 -3687 -1783 -892 -657 -337 141
7333 141 -686 -645 -920 1237 -3101 -4195 -3923 -6752 -8319 -6544 -6125 -5271 -5273 -4643 -2825 -5787 -10209 -7949
7315 -7949 -3359 -874 1072 1761 -901 -5905 -4791 -2282 -4767 -6397 -6803 -7805 -7801 -8216 -6859 -5785
7299 -5785 -4372 -2339 -102 -935 1334 -257 -6236 -4264 -1444 -3130 -3956 -7041 -7320 -6534 -7832 -9593
7283 -9593 -9791 -8662 -7585 -7878 -8854 -8343 -7183 -5012 -4101 -3868 -3979 -3981 -4034 -5197 -2394 -744 -2959 -3784
7265c784k072l067N87K030K796m79j774j099K859Q51q86j999m485J492M376J102
7249c552m71n65r23l902k33o36k454L383R89L627J662j118o77R14p5J949j095
7232c177j443j555Q66J32P2q09J709L630l19n95k621O95L75j234n72p97j26r96
7214f765K168J374J779j88R06j693j928j243l746o9L744M183K96J182j848J656
7198a92j904j000n02J9j954j713L392l044J383M209l367o10L344K775k704j189
7182c057l45j839K259K606q6j512J697K421K431l061j435j11q0j637j457q31K308
7165a729J733k368l402l35P1J951q29p10J660L034L47l573j379K132J382J8k022
7148d019j3J646O04n01k245J395M016J76j068p40J584R7k940m79P0j060j47J790
$$ plain form
7265 -3784 -5856 -8923 -8336 -6306 -3510 -3989 -5763 -6862 -4003 -3152 -4038 -6037 -10522 -9030 -4654 -3552
7249 -3552 -4023 -4588 -5511 -9413 -9646 -10282 -12736 -9353 -8364 -4737 -3075 -4193 -4870 -3956 -4031 -2082 -3177
7232 -3177 -4620 -6175 -5309 -5177 -5105 -5914 -4205 -575 -894 -1489 -4110 -3415 -3040 -4274 -4846 -5643 -5769 -6765
7214 -6765 -4597 -3223 -1444 -1632 -726 -2419 -4347 -5590 -9336 -9405 -5661 -1478 -1182 0 -1848 -192
7198 -192 -2096 -3096 -3598 -3579 -5533 -7246 -3854 -6898 -5515 -1306 -4673 -5283 -1939 836 -1868 -3057
7182 -3057 -3402 -5241 -2982 -376 -462 -1974 -277 2144 4575 1514 79 -32 -112 -1749 -3206 -4037 -1729
7165 -1729 4 -2364 -5766 -6101 -6030 -4079 -4908 -5618 -3958 -924 -577 -4150 -5529 -3397 -2015 -1997 -4019
7148 -4019 -4032 -2386 -1782 -2283 -4528 -3133 883 1059 -9 -749 835 932 -2008 -2487 -2417 -3477 -3624 -1834
7130a834L56J853l42P78J369p64k174j874r48r64j027K502K418k789l297j618
7114h355j328l29L886P31J063N54J288l070l322J829L666J712j626j093R11k058
7098e541o13k365J18j37L646J395o19N25k97%j464n33j013L998L053j106j696
7081b649J28P53P44Q25q25k926m717l294R93K398q20q07L168J883K010J061k034
7064d109j113o79R14j974q92M7L140M112m310j81L440l780K31J253K65k79o06
7047d521J20O58M211M205j025k154j108k272N32K17j332J388n90k915l412l106
7031a1104j452M08L597O528J489j692K28K61l65j922n315Q65M520K101K015k250
7015b088j422L7J93j93j053q3r51K434K538q62j144k479P98P0j90j187n16M552
$$ plain form
7130 -1834 -1478 375 33 811 2180 1416 -758 -2632 -3580 -4544 -5571 -3069 -651 -3440 -6737 -8355
7114 -8355 -9683 -10012 -6126 -5395 -4332 -3778 -2490 -5560 -8882 -7053 -3387 -1675 -3301 -4394 -3483 -5541
7098 -5541 -6154 -8519 -8401 -8538 -4892 -3497 -4116 -3591 -3888 -3888 -5352 -5885 -6898 -2900 153 -953 -2649
7081 -2649 -2521 -1768 -1024 -199 -1024 -3950 -8667 -11961 -10968 -8570 -9390 -10197 -7029 -5146 -3136 -2075 -4109
7064 -4109 -5222 -5901 -4987 -6961 -7853 -7806 -4666 -554 -4864 -5045 -1605 -5385 -5154 -3901 -3636 -3915 -4521
7047 -4521 -4401 -3743 468 4673 3648 1494 386 -1886 -1354 -1137 -2469 -1081 -1671 -4586 -7998 -11104
7031 -11104 -12556 -12148 -8551 -2023 -534 -2226 -1998 -1737 -2102 -4024 -9339 -8474 -3954 -1853 162 -2088
7015 -2088 -3510 -3473 -3280 -3473 -4526 -4609 -5560 -3126 -588 -1450 -2594 -5073 -4275 -4205 -4395 -5582 -6098 -1546
6997a546j481j938J194j399j196J870O27J493m99N50j132r32L03M47J78J378m78
6980b561q13l76j327n84J53J802L91K60J227J301o60Q76k903k059J573N86m715
6963g829o63LJ270L9P87L693J736k999o70Q62Q20k98j597K116r80j676p09K18
6945e877M42p07m319M91K342L74J69K604J138j446K005j571j787j363J96J717
6929e592L126J688j463j019J651j081M619M453k553n758o01J98j731j205m86j551
6913g305J20k120O06j305j924R09Q71J520J876O45N410J136j734J939L001j129
6897B516l529q89k490j526j3k221j162n56Q10N631K465j366k866r7M06L228J092
6880e67J441k669p47K065m70j596J361k816j271M87k888j422J827L378L62j358
$$ plain form
6997 -1546 -3027 -4965 -3771 -5170 -6366 -4496 -3869 -2376 -2875 -2325 -3457 -4389 -4086 -3639 -3461 -2083 -2561
6980 -2561 -3374 -3750 -5077 -5661 -5508 -3706 -3315 -3055 -1828 -527 -1187 -311 -3214 -5273 -3700 -3114 -7829
6963 -7829 -8492 -8489 -7219 -7180 -6393 -2700 -964 -3963 -4633 -3771 -2951 -3249 -4846 -2730 -3710 -5386 -6095 -5877
6945 -5877 -5435 -6142 -10461 -9970 -7628 -7254 -7085 -4481 -3343 -4789 -2784 -4355 -6142 -7505 -7309 -5592
6929 -5592 -2466 -778 -2241 -3260 -1609 -2690 1929 6382 3829 -1929 -2530 -2332 -4063 -5268 -5754 -7305
6913 -7305 -7185 -9305 -8699 -10004 -11928 -11019 -10148 -8628 -6752 -6107 -697 439 -1295 644 3645 2516
6897 2516 -1013 -1902 -4392 -5918 -5931 -8152 -9314 -9870 -9060 -3429 -964 -2330 -5196 -5293 -4887 -1659 -567
6880 -567 874 -1795 -2542 -477 -947 -2543 -1182 -3998 -5269 -4782 -7670 -9092 -7265 -3887 -3525 -4883
6864d883k000J738J54j314r60K933J756L499j936n15j035k087M093J895l293k236
6848d191J87J4m65j999j368J494R65R63j190P38L32n03K347J642j646n384J37
6831g927O071J523m625j868j226J403J326K646K212K58j762m20j939J401K786
6816a41j177k929P9q92O96k02j372k812M15M971J859j188J613O5j185o02K032
6799g70m344j522r92j028J3N63q50J323N13O75K21k454M78J594k327n99L491J430
6781d585k91J019N48n38K845o91K91J686K703m09m041j759j754O18R79J121j552
6764c810j073L566p19j710k03r08J868K08Q88m771j982Q93L251k53l14Q75J462
6747b732O37r96k481o363K123L515J604J36L806j085R66K425l223p56J191p57
$$ plain form
6864 -4883 -6883 -5145 -4991 -6305 -7265 -4332 -2576 923 -1013 -1528 -2563 -4650 -557 1338 -1955 -4191
6848 -4191 -4004 -3990 -4455 -6454 -7822 -6328 -5363 -4400 -5590 -4852 -4520 -5023 -2676 -1034 -2680 -8064 -7927
6831 -7927 -1856 -333 -4958 -6826 -8052 -6649 -5323 -2677 -465 -207 -1969 -2389 -4328 -2927 -141
6816 -141 -1318 -4247 -4168 -5060 -4364 -4566 -5938 -8750 -8335 -3364 -1505 -2693 -1080 -1015 -2200 -2802 -770
6799 -770 -5114 -6636 -7628 -8656 -8643 -8080 -8930 -7607 -7094 -6419 -6198 -8652 -8174 -6580 -8907 -9506 -6015 -4585
6781 -4585 -4876 -3857 -3309 -3847 -1002 -1693 -1402 284 2987 2578 -1463 -3222 -4976 -4358 -3379 -2258 -3810
6764 -3810 -4883 -1317 -2036 -3746 -3949 -4857 -2989 -2781 -1893 -6664 -8646 -7753 -4502 -4755 -5069 -4194 -2732
6747 -2732 -2095 -3091 -5572 -11935 -9812 -6297 -4693 -4557 -751 -1836 -870 1555 -1668 -2424 -1233 -1990
6731a990Q77n29p86J272n0j418n28j643K263K390n7r97k277k116L695j044k68
6714c206j568p05N084J334k573k976M4l371L459j479K745J382N47K082j078j94
6698d73l064J189j137P31J488k327J969J239l803K343K076l207J373k038l074
6683f715J291j150l921j93L342L430L08k414M170J897k433P47L591J289l067k977
6667b805J137r96J221j100j994k363K46M13L40K366K716N38k893j24N89J110j101
6650b700n03n38m68K605N9K472K926L180k172n029j172j977n47J218k25K117j142
6633a896k303L954J662n33j376j478k179J939J254k099k555K184k834L43j186
6618g103P85j760J176M021L723L279k084k196l487k998j608l109J347J873M107
$$ plain form
6731 -1990 -1113 -1642 -2428 -1156 -1206 -2624 -3152 -4795 -2532 -142 -199 -1196 -3473 -5589 -1894 -2938 -3206
6714 -3206 -4774 -5479 -395 939 -1634 -4610 -4566 -7937 -4478 -5957 -3212 -1830 -1283 799 -279 -473
6698 -473 -3537 -2348 -3485 -2754 -1266 -3593 -1624 -385 -4188 -1845 231 -2976 -1603 -3641 -6715
6683 -6715 -5424 -6574 -10495 -10688 -7346 -3916 -3608 -6022 -1852 45 -2388 -1641 1950 3239 172 -2805
6667 -2805 -1668 -2664 -1443 -2543 -4537 -6900 -6654 -6241 -5901 -3535 -819 -281 -3174 -3298 -2709 -1599 -2700
6650 -2700 -3203 -3741 -4209 -1604 -1545 927 3853 7033 4861 -168 -1340 -3317 -3864 -2646 -2871 -754 -1896
6633 -1896 -4199 -245 1417 884 -492 -1970 -4149 -2210 -956 -3055 -5610 -3426 -6260 -5917 -7103
6618 -7103 -6318 -8078 -6902 -2881 842 4121 2037 -159 -3646 -6644 -8252 -11361 -10014 -8141 -4034
6603d034K928o2K414O00l200p65P75k568K52J937J953k546j79j063p89j441J563
6586d225L98K338M358j497n451K42j354j144K687L0j98n19l240j954O28J688N236
6569a977J166k990j43N8J485J782Q7m360j535j795J881R24J147J8j193j661K883
6552d223L046q75K406M11o84R74k478j014J033n24L31M328M235o29m348k312k028
6535b351J98J859l760j284M32J314M359n69l833k541r71k247l376P12j746K380
6519a1424R14j129J026K959M386K714k892k218J569k747K36M07m11P63M560j499
6503b786r13J400K833J374J730j297k558j775M876L116j235r17k457j176Q55m08
6487F62m168l62m19j172J481L98P17N10K173J501J035k089j902J760J435J609
$$ plain form
6603 -4034 -1106 -1168 1246 1846 -1354 -2119 -1344 -3912 -3660 -1723 230 -2316 -2495 -3558 -4347 -5788 -4225
6586 -4225 -3827 -1489 2869 1372 -4079 -3837 -5191 -6335 -3648 -3618 -3816 -4335 -7575 -9529 -8901 -7213 -1977
6569 -1977 -811 -3801 -3944 -3886 -2401 -619 -532 -4892 -6427 -8222 -6341 -5417 -4270 -4252 -5445 -7106 -4223
6552 -4223 -1177 -2052 354 765 81 1055 -1423 -2437 -1404 -1928 -1597 2731 6966 6337 1989 -323 -2351
6535 -2351 -2153 -294 -4054 -5338 -4906 -3592 767 198 -3635 -6176 -7147 -9394 -12770 -12058 -13804 -11424
6519 -11424 -10510 -11639 -10613 -7654 -3268 -554 -3446 -5664 -4095 -6842 -6606 -6199 -6610 -5847 -1287 -2786
6503 -2786 -3699 -2299 534 1908 3638 2341 -217 -1992 2884 6000 4765 3848 1391 215 1070 662
6487 662 -3506 -3868 -4287 -5459 -3978 -3580 -2863 -2353 -180 1321 2356 267 -1635 125 1560 3169
6471C169j30k754k57l050k417r76M135K540q23j263n459Q74P68K028N00k522l315
6454h952J114J625M258r64r36k842O76L877q59j327q02J13P95J480L65k724k87
6437e390J556Q88m404o64L360J955n6j989M299K398m338j024P8k205K655O69j451
6420c663l557k850J743K069K482J497J344l216l5J103L943L95j103l332l419L593
6404c006J909m278O2L527L415L83p29j492J631k57n57q14l003n40J334K73p48
6387b890j688l139j505L181J095L024j109l142M34K887K005k108j986K471k883
6372e353l69k272k038j046P67J756L892K188J43l26j900k136J99L71M124L984
6356A984r98m981J163K371M80l840l672M4K310J091K155k425m68J451M70J190
$$ plain form
6471 3169 3039 285 28 -3022 -5439 -6415 -2280 260 -563 -1826 -7285 -6411 -5643 -3615 -3115 -5637 -8952
6454 -8952 -7838 -6213 -1955 -2919 -3855 -6697 -6021 -2144 -3003 -4330 -5132 -5019 -4224 -2744 -2379 -5103 -5390
6437 -5390 -3834 -2946 -7350 -8014 -4654 -2699 -2755 -4744 -445 1953 -2385 -3409 -3331 -5536 -2881 -2212 -3663
6420 -3663 -7220 -10070 -8327 -6258 -3776 -2279 -935 -4151 -4186 -3083 860 1255 152 -3180 -6599 -3006
6404 -3006 -1097 -5375 -5313 -1786 1629 2012 1283 -209 1422 1165 608 -206 -3209 -3749 -2415 -2142 -2890
6387 -2890 -4578 -7717 -9222 -6041 -4946 -1922 -3031 -6173 -5739 -2852 -847 -2955 -4941 -2470 -5353
6372 -5353 -5722 -7994 -10032 -11078 -10311 -8555 -4663 -2475 -2332 -2658 -4558 -6694 -6495 -6124 -2000 1984
6356 1984 986 -3995 -2832 -461 19 -3821 -7493 -7449 -5139 -4048 -1893 -4318 -4786 -3335 -2865 -1675
6340a675J511K220m389j874k16L706J850j940l22k532m027j154K422J534p76j941
6324g603Q84o74j165o13J366L880L391j616j159K039l468l528r34m70J128K124
6308f418J188R91j208Q60k194M309M458N70k583M61O40l674m181k38K72k02k31
6291g180L34L619J25q38m95N84J189J27J789L671k768k365k475j673p93K102J478
6274c569J135j072j394k20J064J565K814K039r77k184j079k61j226j754L719L076
6258A676j147l182l576m60O37M665K783O33K3l464o372K783M378L99o86m79J312
6241g7J227j093j858K696L553p19o640k252j789K55K312K424K340L30K4l044n347
6224g658j900L334l89L63M197Pl042J763J860j833q22N20J233M94J71l386q25
$$ plain form
6340 -1675 -164 2056 -2333 -4207 -4423 -717 1133 -807 -1129 -3661 -7688 -8842 -6420 -4886 -5662 -7603
6324 -7603 -6719 -7393 -8558 -9171 -7805 -3925 -534 -2150 -3309 -1270 -4738 -8266 -9200 -9670 -8542 -6418
6308 -6418 -5230 -4239 -5447 -4587 -6781 -2472 1986 2556 -27 434 1074 -2600 -6781 -7019 -6747 -6949 -7180
6291 -7180 -6846 -3227 -3102 -3940 -4435 -3851 -2662 -2535 -746 2925 157 -2208 -4683 -6356 -7149 -5047 -3569
6274 -3569 -2434 -3506 -4900 -5120 -4056 -2491 323 2362 1385 -799 -1878 -2139 -3365 -5119 -1400 1676
6258 1676 529 -2653 -6229 -6689 -6052 -1387 1396 2029 2052 -1412 -7784 -5001 -623 -224 -910 -1389 -77
6241 -77 1150 57 -1801 895 4448 3729 -2911 -5163 -6952 -6697 -4385 -1961 379 709 733 -2311 -7658
6224 -7658 -9558 -6224 -6613 -6250 -2053 -2046 -5088 -3325 -1465 -3298 -4120 -3600 -2367 -1873 -1702 -5088 -5913
6207e913M790O81J141L296k22r85R66K29l018k395o86j059m709k780K348L428
6191d888J219n80K087J829M10P45l207j392j352k578k602Q52L592N195J470M16
6175A216l548l243j114K85J948J579K48K86o24N925k182l803J245k96k94L655
6159A283Q74n75j426j203K393j651l407l699J4J008J312K630J042j97j569k70
6143c441j435j096n53J068j330k285K375L817K787l63K165j722j119R62j397l710
6127e277j022K493K604o8O6j560n562j625L392m34M980K576J765k390k979j669
6111d710j374N25q46M521L818l75j417k013K475K808r54l164j968k43J294j685
6095c308m011J124J945J311j126J39p01j194N65J747M71J528L503J495k121R30
$$ plain form
6207 -5913 -1123 -442 699 3995 3773 2788 3754 3983 965 -1430 -2116 -3175 -7884 -10664 -8316 -4888
6191 -4888 -3669 -4249 -2162 -333 77 822 -2385 -3777 -5129 -7707 -10309 -9457 -5865 -670 800 1216
6175 1216 -2332 -5575 -6689 -6404 -4456 -2877 -2629 -2343 -2967 2958 776 -3027 -1782 -2078 -2372 1283
6159 1283 2157 1582 156 -1047 1346 -305 -3712 -7411 -7397 -6389 -5077 -2447 -1405 -1602 -3171 -3441
6143 -3441 -4876 -5972 -6525 -5457 -6787 -9072 -6697 -2880 -93 -456 1709 -13 -1132 -170 -1567 -5277
6127 -5277 -6299 -3806 -1202 -1270 -1204 -2764 -8326 -9951 -6559 -6993 -2013 563 2328 -62 -3041 -4710
6111 -4710 -6084 -5559 -6405 -1884 1934 1559 142 -1871 604 3412 2458 -706 -2674 -2917 -1623 -3308
6095 -3308 -7319 -6195 -4250 -2939 -4065 -3926 -4627 -5821 -5256 -3509 -3038 -1510 1993 3488 1367 2297
6079B297M02m517j554L110j367l3J228r53O58K98J272R31j17J203k224j147J659
6062A146M29R42k085j504k407J9M44j726J253K917K089p30p68m495m527N624L239
6045a40j183m26l102J522M368j437j428N92J188K527j525l918j749k228j179j18
6029h236k678M225N512J74J546L033r65m150r31Q38j333r20M20J695K786J616
6013B632j66j272k317o28J186K078J098j985k51J546l642o88J099l779j385J972
5997d502K422Q85J66j714l562N6L592M086r69l002N30K018J064k64R21P27j15
5980B339K004p79l422n26k259K2J313K57J775k960l664k414Q80j457J321p1J346
5963f295J508J11j378o21L557K592L052p21j228j377M45j49k615l200n78N139
$$ plain form
6079 2297 2699 -1818 -3372 -262 -1629 -1662 -434 -1387 -729 -431 841 1772 1655 2858 634 -513 1146
6062 1146 1575 2517 432 -1072 -3479 -3460 -3016 -4742 -3489 -572 1517 787 19 -4476 -9003 -3379 -140
6045 -140 -1323 -1749 -4851 -3329 1039 -398 -1826 -1234 -46 2481 956 -2962 -4711 -6939 -8118 -8236
6029 -8236 -10914 -6689 -1177 -1003 543 3576 2611 -1539 -2470 -1632 -2965 -3885 -3465 -1770 1016 2632
6013 2632 2466 1194 -1123 -1751 -565 1513 2611 626 375 1921 -1721 -2409 -1310 -5089 -6474 -4502
5997 -4502 -2080 -1195 -1029 -2743 -6305 -6249 -2657 1429 460 -2542 -2012 6 1070 806 1727 2454 2339
5980 2339 4343 3564 142 -384 -2643 -2621 -1308 -1051 724 -2236 -5900 -8314 -7434 -8891 -7570 -7641 -6295
5963 -6295 -4787 -4676 -6054 -6675 -3118 -526 2526 1805 577 -800 -355 -504 -3119 -6319 -6897 -1758
5947a758P67J621K391j874k241j334K693k721m928J058L678M899J088k946k028
5932a635l570l232r6K509J718N993R51n120l346N146J876L95K87j109Q4j137J718
5915A432K054l955J451J111j697k930j46k052r5L653L295k918k875j216O34R01
5899c353K542k91k541m00j481N13j311M44k024J665k562j156J978K708J863L294
5883a12n84k108r33k899J149K995q73k178k53M387J955l07j757j262O96J860j030
5866a254L011K181m35j564k185r09K751p39L68K805l231j353j204j482K600M157
5850C517R17k384k017j018m801k190J712K171j885J978M562k392K078l60k1j045
5834a178n117J043N631p34o09j413M77J93L283l62j919k426j483J430N69n066
$$ plain form
5947 -1758 -991 630 3021 1147 -1094 -2428 265 -2456 -7384 -6326 -2648 2251 3339 393 -1635
5932 -1635 -5205 -8437 -8533 -6024 -4306 1687 2638 -2482 -5828 -682 1194 1589 1876 767 851 -286 1432
5915 1432 3486 -469 982 2093 396 -2534 -2680 -4732 -4827 -1174 2121 -797 -3672 -4888 -4254 -3353
5899 -3353 -811 -1102 -3643 -4043 -5524 -5011 -6322 -5878 -7902 -6237 -8799 -9955 -7977 -5269 -3406 -112
5883 -112 -696 -2804 -3737 -6636 -5487 -2492 -3365 -5543 -5796 -1409 546 239 -1518 -2780 -2084 -224 -1254
5866 -1254 1757 3938 3503 1939 -246 -1155 1596 857 1225 4030 799 -554 -1758 -3240 -640 3517
5850 3517 4434 2050 33 -985 -5786 -7976 -6264 -4093 -5978 -4000 562 -1830 248 -112 -133 -1178
5834 -1178 -6295 -5252 379 -355 -964 -2377 -1900 -1707 1576 1214 -705 -3131 -4614 -3184 -2615 -7681
5818g681k64K554J246L514o23J101q16j306k957j300o19J783J549J355j12N4j323
5801c845k287K172M646K153j359M02J249q94k794j196J758m38k751j175J728o99
5785c330r39l023L10L638n30j127J783p09j402K907l33j560j093K866K158j052
5769a436j586J143J370J384l247l549J479P48M02K830K204k941o52j16k73K617
5753C77K913M32k346l376M33L475k815l850K062N457j668p37l57m35j536K323
5737C52K899p29O97J436K951Q75k299l522j390k425J222k92j465J17m82n959J071
5720f943M018j48j841K361J918m53j187M41M142j099J202l5o266j352o0J67p18
5703e853r07j927J858K633L0K948N97j27K29k288j098k31J185j994J803j497q
$$ plain form
5818 -7681 -7945 -5391 -4145 -631 -1254 -153 -969 -2275 -5232 -6532 -7151 -5368 -3819 -2464 -2576 -2522 -3845
5801 -3845 -6132 -3960 686 2839 1480 1882 3131 2237 -557 -1753 5 -433 -3184 -4359 -2631 -3330
5785 -3330 -4269 -7292 -6982 -3344 -3874 -5001 -3218 -3927 -5329 -2422 -2755 -4315 -5408 -2542 -384 -1436
5769 -1436 -3022 -1879 -509 875 -2372 -5921 -4442 -3694 -3292 -462 1742 -1199 -1851 -1967 -2240 377
5753 377 3290 3722 1376 -2000 -1567 1908 -907 -4757 -2695 2762 1094 357 0 -435 -1971 352
5737 352 3251 2522 3219 4655 7606 8481 6182 2660 1270 -1155 67 -225 -1690 -1573 -2055 -8014 -6943
5720 -6943 -2925 -3073 -4914 -2553 -635 -1088 -2275 -1834 2308 1209 2411 2376 -3890 -5242 -5302 -5135 -5853
5703 -5853 -6760 -8687 -6829 -4196 -4166 -1218 -621 -748 -519 -2807 -3905 -4136 -2951 -4945 -3142 -4639 -4647
5686d647j759K463k78p52R73J029J928o9j821n9L256k089q98K031J89j297L24
5669a476o48Q16rQ30R41l57O9j8j126O8j382o78M6L907o00j910K701M33J301j775
5649A133j61L25j57L446J359l391l747K569J114P03k940k765j850m27J26O80J167
5632b816L097N516j278l718k826J148m335m812L610M224J970K401m05l058l603
5617d885J708M00j691l142J605K301P87k663j467J62O99K187J537L314O9l706
5601b785m462q65L14K539L983p72p32K851M79l054l5K539M092l26J764k37j293
5584D000j671j438J443K801l230r82l67m8j165J353K385l58j275r30m145M12k291
5567e506k76r55R48J11L196L640J11O52l06j871Q48j356j399P77M56J970k576
$$ plain form
5686 -4647 -6406 -3943 -4221 -4973 -4000 -2971 -1043 -1112 -2933 -2992 264 -1825 -2723 -692 -503 -1800 -1476
5669 -1476 -2124 -1308 -1317 -487 454 97 166 148 -978 -910 -2292 -2970 -2924 983 383 -1527 1174 1607 2908 1133
5649 1133 972 1297 1140 4586 5945 2554 -1193 1376 2490 3193 253 -2512 -4362 -4789 -4663 -3983 -2816
5632 -2816 281 5797 4519 801 -2025 -877 -5212 -10024 -6414 -2190 -220 2181 1776 -1282 -4885
5617 -4885 -3177 -2777 -4468 -7610 -6005 -3704 -2917 -5580 -7047 -6885 -6186 -3999 -2462 852 921 -2785
5601 -2785 -7247 -8112 -7798 -5259 -1276 -2048 -2780 71 550 -2504 -2539 0 4092 3766 5530 5293 4000
5584 4000 2329 891 2334 5135 1905 923 556 508 -657 696 3081 2723 1448 518 -3627 -3215 -5506
5567 -5506 -5782 -6737 -5789 -5678 -2482 1158 1269 1921 1615 -256 592 -764 -2163 -1386 -930 1040 -1536
5550a536j115j82l561J152K599r11j791J886M138J714j724J555j875m55n01K263
5534A656K34n01k446k630J451k0j524J852j342j8M751J230k218N95J379J223m303
5517f31j516J965L28J180j684j713k606l017J436J254L196m79n48J22Q07j586
5501c492Q12N976K996p00k13j10J803j67j091j459J719j439m522k521M170k684
5485i22l706J441N68j184j183L86o72Q76K951P08j172O22J97M42J775m360m134
5468g367L02J603J708L324L906j64l780l642%K324J362k92l181j021l53M71k219
5451g019K190L515Q33K527j831j322K734m17l948n13K925o56K303K73j87j07m444
5434c144j309J791j168p48J681j74J846q86k044K077L16R86J290J110k145N21
$$ plain form
5550 -1536 -2651 -2833 -6394 -5242 -2643 -3554 -5345 -3459 679 2393 669 2224 349 -106 -607 1656
5534 1656 1890 1389 -1057 -3687 -2236 -2256 -3780 -1928 -3270 -3288 1463 2693 475 1070 2449 3672 -631
5517 -631 -2147 -182 146 1326 -358 -2071 -4677 -7694 -6258 -5004 -1808 -2287 -2835 -2713 -1906 -3492
5501 -3492 -2680 3296 6292 5592 5379 5269 7072 6905 5814 4355 6074 4635 113 -2408 1762 -922
5485 -922 -4628 -3187 -2619 -3803 -4986 -4600 -5272 -4396 -1445 -737 -1909 -1287 -1090 -648 1127 -3233 -7367
5468 -7367 -7065 -5462 -3754 -430 3476 3312 -468 -4110 -4110 -1786 -424 -716 -3897 -4918 -5271 -4800 -7019
5451 -7019 -4829 -1314 -481 2046 215 -1107 1627 1210 -2738 -3251 -326 -982 1321 1594 1407 1300 -3144
5434 -3144 -4453 -2662 -3830 -4578 -2897 -3071 -1225 -2111 -4155 -2078 -1762 -776 514 1624 -521 0
5418@o83p0N81q38N58J316j695K51Q2J683k69L964k430l453j982L655P03l728
5400b355j619N00K565m11n56j383m46K177L939r10k288J569L013r47r46mj13j841
5382e6m042m07k3j322l61N24J493j59k528P46J24m440K323L773N489J719k458
5365C95L8k077l593J730K884k572l68J292k67k493j052k52L071L295N55r02j843
5348b159K803J984r55P3J496k02M187O79k042l031J583K20j265l75j29k342k971
5331b446j648P53N781L223k546k123o78J33j965j500N25j447J54L085P57J588
5315A646J339l020j909N31j236k571j839p5L101l67K353j402N78L652j034p45
5299i98J14j709J561J40K787K91j760k959m00j966L081O303J189k031L065k251
$$ plain form
5418 0 -683 -753 -172 -1010 -452 864 -831 -580 -498 1185 916 4880 2450 -1003 -2985 670 1373 -2355
5400 -2355 -3974 -3474 -909 -1320 -1876 -3259 -3705 -1528 2411 1501 -787 782 3795 2848 1902 1898 1785 -56
5382 -56 -4098 -4505 -4528 -5850 -6211 -5687 -4194 -4353 -6881 -6135 -6011 -10451 -8128 -4355 1134 2853 395
5365 395 433 -1644 -5237 -3507 -623 -3195 -3563 -2271 -2538 -5031 -6083 -6335 -3264 31 586 -316 -2159
5348 -2159 644 2628 1673 1746 3242 3040 7227 7906 5864 2833 4416 4636 3371 2996 2867 525 -2446
5331 -2446 -4094 -3341 2440 5663 3117 994 316 449 -1516 -3016 -2491 -3938 -3784 -699 58 1646
5315 1646 2985 -35 -1944 -1413 -2649 -5220 -7059 -7134 -4033 -4400 -2047 -3449 -2871 781 -253 -998
5299 -998 -884 -2593 -1032 -892 1895 2186 426 -2533 -2933 -4899 -1818 4485 5674 3643 6708 4457
5283D457m695k610p00K283j202J156J289L79J412R59J415p49m194j072k691M7
5267d516O46O58K117J742K97j727q64m39K248P41l99K015L835k103j395n23j474
5250H59J393J748J905j482k407j678J428N11k562j839M070L291j640j905k912
5235a220NJ681p70l20m46j16J821J560j003N59q69L25j958J301J168k82J458j928
5217I66n03J926l990p30R38J125j179j645J938J576l569k013L08L404k185J836
5201a797L509r83J12q41j383l25M297K762l664j570P08MQ41k281M9K237K517o63
5183C529n505j838q28M87J781M34K056K903k950r68k808k720K709K38j552J353
5167c679k8J374K840j368q26l640m56M042K557j389J434j013k9l353j70r63J880
$$ plain form
5283 4457 -238 -2848 -3548 -1265 -2467 -1311 -22 357 1769 2728 4143 3394 -800 -1872 -4563 -4516
5267 -4516 -3870 -3212 -1095 647 944 -783 -1647 -2086 162 903 504 2519 6354 4251 2856 2333 859
5250 859 2252 4000 5905 4423 2016 338 1766 2277 -285 -2124 1946 5237 3597 1692 -1220
5235 -1220 -1215 466 -304 -624 -1070 -1186 635 2195 1192 1751 882 1207 -751 550 1718 1436 2894 966
5217 966 463 2389 -1601 -2331 -1393 -268 -1447 -3092 -1154 422 -3147 -5160 -4852 -1448 -3633 -1797
5201 -1797 1712 729 841 0 -1383 -1708 2589 5351 1687 117 825 829 1670 -611 -562 1675 4192 3529
5183 3529 -1976 -3814 -4642 -4155 -2374 -1940 116 3019 69 -899 -3707 -6427 -3718 -3480 -5032 -3679
5167 -3679 -3707 -2333 507 -861 -1687 -5327 -5783 -1741 816 -573 861 -152 -181 -3534 -3704 -4667 -2787
5150b787j155K095L991K97j202j233j006M71J341J32J500j49O51j775k555J166
5134b18J293r57k536l023M03M257J993j061L79k145k602J905K042j685q26k076
5118d857l369o42J498L049P66N28J08R10r75K220J313J9k344m15P18k22k050r12
5100d657K495k916j568J016O047L270k518k762j351J783L440o40p76J288l54j309
5084D88m24L024J534m103k495Q43M14j43L156K864p20k690J85K739J730J106l86
5067G122p53m000k305J573r6m98J83j501L221o30N75j360l266K128j120o519K23
5050g023L402M84K345r15n184k289L690L648q90k99J007j289m734O50M149n2o38
5033c938O91j73J379k684j564J653L062J865K467j520L22J557L109j884l244r99
$$ plain form
5150 -2787 -3942 -1847 2144 2441 1239 6 -1000 -529 812 944 2444 2295 2946 1171 -1384 -218
5134 -218 1075 118 -2418 -5441 -5038 -781 1212 151 530 -1615 -4217 -2312 -270 -1955 -2781 -4857
5118 -4857 -8226 -8868 -7370 -4321 -3555 -3027 -2919 -2009 -2984 -764 549 568 -1776 -2191 -1473 -1695 -3745 -4657
5100 -4657 -2162 -5078 -6646 -5630 417 3687 1169 -1593 -2944 -1161 2279 1639 863 2151 1797 488
5084 488 64 3088 4622 519 -1976 -1133 -719 -862 2294 5158 4438 1748 1933 4672 6402 7508 7122
5067 7122 6369 2369 64 1637 1541 1043 1226 -275 2946 2316 2891 1531 -1735 393 -727 -7246 -7023
5050 -7023 -3621 -3137 -792 -1707 -6891 -9180 -5490 -1842 -2732 -3031 -2024 -3313 -8047 -7397 -3248 -3300 -3938
5033 -3938 -3247 -3420 -2041 -4725 -6289 -4636 -1574 291 2758 1238 1560 3117 6226 4342 1098 99
5017I9k423j868L62L340j778Q41N22j988N25L538k577j124q98Q56J063j082L258
5000F66K301q9n65j684J01N93L148k79k052l233O6J20K970M961j605l352j971
4983I6J335k069J74K33k474K580M069R86M281j196l194Q54r60m051k145j751n61
4966c793j110J179J008K370J235K039K067J132K87j573o59k508O95k052l26K320
4950B311R86m55k770k385J373k1J623l06p56j723K471j20l765L047o80L61p05
4933a514k639K697J33q94n19P04N65j453Q47M14j3J076J02k99n6j917k266k387
4915g419j535J130K268K151L66J52k051j214Q89p76K906L701p6J431j125n16M81
4898G63J79K558O25l335N14k674q00K670L304K073o24j623j567J93j044J372K934
$$ plain form
5017 99 -2324 -4192 -3830 -490 -2268 -1427 -905 -2893 -2368 1170 -1407 -2531 -3429 -2573 -1510 -2592 666
5000 666 2967 2878 2313 629 730 1323 4471 4192 2140 -1093 -1027 -907 2063 7024 5419 2067 96
4983 96 1431 -638 -464 -231 -2705 -125 3944 4930 9211 8015 4821 5675 4715 664 -1481 -3232 -3793
4966 -3793 -4903 -3724 -2716 -346 889 2928 4995 6127 6414 4841 4182 1674 2369 317 -9 2311
4950 2311 3297 2842 72 -2313 -940 -961 662 356 -400 -2123 348 228 -3537 -490 -1170 -809 -1514
4933 -1514 -4153 -1456 -1323 -2217 -2736 -2032 -1467 -2920 -2073 -1659 -1672 -596 -494 -793 -849 -2766 -5032 -7419
4915 -7419 -8954 -7824 -5556 -3405 -3039 -2887 -4938 -6152 -5263 -6039 -3133 568 492 1923 798 282 763
4898 763 942 3500 4125 790 1304 -1370 -2170 500 3804 5877 5253 3630 2063 2256 1212 2584 5518
4881E518r72j74L135K035k592j532M291k180j346j092r03j685J306M05l59n00
4865C355k95O35j362j127J078J104O58r13j785J638j236J331J787K311M08k050
4849E537j175n08m54Q08n279k029K056k46j444R02J093l5M50p92K528l05k506
4832a399r07k380p60P56J217r14O25M632M025l300j985j078l76N092R14k835k031
4815g04L257N83j606J651K627m189j507j127o38J092K164k546n006j240K652R6
4799d441K960L016k054k24j165R64P35k684j385O86j053m55L484J711l212K789
4783c28k24o65j473j315K157j308K274o13N34K56l705k9J026j169m70k430N76
4766f906K295k82m10j135K599L860k803l8P40l86P32J134j277n23J862K559j446
$$ plain form
4881 5518 4546 4372 7507 9542 6950 5418 9709 7529 6183 5091 4188 2503 3809 4214 3855 3355
4865 3355 3060 3695 2333 1206 2284 3388 4046 3133 1348 2986 1750 3081 4868 7179 7587 5537
4849 5537 4362 3854 3400 4208 -1071 -3100 -1044 -1290 -2734 -1832 -739 -774 -324 -1116 1412 1107 -1399
4832 -1399 -2306 -4686 -5446 -4690 -3473 -4387 -3762 870 4895 1595 -390 -1468 -1844 3248 4162 1327 -704
4815 -704 2553 3136 1530 3181 5808 1619 112 -1015 -1653 -561 1603 -943 -5949 -7189 -4537 -4441
4799 -4441 -1481 1535 -519 -743 -1908 -944 -209 -2893 -4278 -3592 -4645 -5100 -1616 95 -3117 -328
4783 -328 -552 -1217 -2690 -4005 -1848 -3156 -882 -1495 -961 -705 -4410 -4439 -3413 -4582 -5052 -7482 -6906
4766 -6906 -4611 -4893 -5303 -6438 -3839 21 -2782 -2820 -2080 -2466 -1734 -600 -1877 -2400 -538 2021 575
4749E75k314j011j260J310J158K430K893L35j090k559j357n2m86k487K67L78k330
4732e600N8j654m544K210K909L892L287r9j997j494j079p4J094J077k361K697
4716a678L511l44R52j158q95J430j825r74J288k684k90K66j991k449M206K018
4700f17l255J780N824L31k530L44K354N83k470p6q81k596j576O045K493j050Q04
4683E507L51k171k985k172k610J78K806M44j018J458M90J019N04j324k996l98
4667b917k048J853P19J215l83J402J310m295k516J250J919M191K366m943r66J128
4651g15l10K764K015m190k969n44j201j396J647K145j39L243R02m23j158M78K127
4634B276O84J898r94K458P77j386o286j83j55J423J143K082k699k950J932J062
$$ plain form
4749 575 -1739 -2750 -4010 -2700 -1542 888 3781 4116 3026 467 -890 -942 -1428 -3915 -3648 -3270 -5600
4732 -5600 -5542 -7196 -11740 -9530 -6621 -2729 558 459 -1538 -3032 -4111 -4185 -3091 -2014 -4375 -1678
4716 -1678 1833 1489 2441 1283 388 1818 -7 -981 307 -2377 -2667 -2401 -4392 -6841 -2635 -617
4700 -617 -3872 -2092 3732 4063 1533 1877 4231 4814 2344 2268 1387 -1209 -2785 3260 5753 4703 5507
4683 5507 5858 3687 702 -1470 -4080 -3902 -1096 -652 -1670 -212 278 1297 1801 477 -2519 -2917
4667 -2917 -4965 -3112 -2393 -1178 -1561 -159 1151 -3144 -5660 -4410 -2491 1700 4066 -877 -1843 -715
4651 -715 -1025 1739 3754 -436 -3405 -3949 -5150 -6546 -4899 -2754 -2893 350 1252 829 -329 149 2276
4634 2276 2960 4858 3864 6322 7099 5713 -573 -756 -911 512 1655 3737 1038 -1912 20 1082
4618A082j46R88K905k633l205J033J930j725k933K1j91M326m8l917J549O235J255
4601F526p36N67k02k460k208q16j469J87K583l75j090r10L323J459k656j239p40
4584b56K8j007k902j327k274O61J282K637J70M212j439L234q02j384K757j180
4568B410l416j592K352K591M24j363l647j894j743J26K905K099N22K531J114j285
4552B134j62P01l41j520Q72M509K753k329m277l777n136L327K974p63K9j027j575
4535c608J317J527k50R40L71k672k360j145M970L099M675K847l124n343k01J963
4519C006l68j650j900K904k250Q88J686K107K18J884k130n641N0R58n89k377J502
4502a702O42k140m35J618J706l750k117Q92K384J426k06O46j952J594N12J581
$$ plain form
4618 1082 936 1924 4829 2196 -1009 24 1954 229 -2704 -2683 -2874 1452 1404 -2513 -964 5271 6526
4601 6526 5790 6357 6155 3695 1487 671 -798 -611 1972 1597 507 -403 2920 4379 1723 484 -256
4584 -256 -228 -1235 -4137 -5464 -7738 -7077 -5795 -3158 -2988 1224 -215 3019 2217 833 3590 2410
4568 2410 -1006 -2598 -246 2345 2769 1406 -2241 -4135 -5878 -5752 -2847 -748 -226 2305 3419 2134
4552 2134 1972 2673 2332 812 1684 6193 8946 6617 2340 -1437 -6573 -3246 -272 -1035 -1006 -2033 -3608
4535 -3608 -2291 -764 -1014 -74 297 -2375 -4735 -5880 -910 2189 6864 9711 6587 1244 1043 3006
4519 3006 2638 988 -912 1992 -258 630 2316 4423 4641 6525 4395 -1246 -1196 -238 -827 -3204 -1702
4502 -1702 -1060 -3200 -3635 -2017 -311 -4061 -6178 -5286 -2902 -1476 -1682 -1036 -2988 -1394 -882 699
4486F99K955p37l871J281M345n51l079M20N87K16k662j875L150K502q85k967m085
4469d557k471J400O164K585m146k116L259M209J48k451k041M635l41j851J793
4454D219J656r78l301k755P18J358O7k709l444k493L589L797r56k8j000Q37R76
4437d47k13j582J018K539J691r73m216k079J825N71J604L075O34k624n234q2L046
4420a447k387r52K322J697j640K019P97l922K098N959R15l702K30M20J833k110
4404B130l660J21M042J145K038k135j265k126j740N36J13k57J047P54j628K06
4388f79P65J22N23J303J357K387n27J907k967l543r75j041p51O77N70L435L935
4371F498k4o018k945O39K283J69n10p26p0K136J703K30l991j947P73k96j046k281
$$ plain form
4486 699 3654 2917 -954 327 4672 4121 1042 1462 2049 2265 -397 -2272 878 3380 2495 -472 -4557
4469 -4557 -7028 -5628 536 3121 -1025 -3141 118 4327 4475 2024 -17 4618 4277 2426 4219
4454 4219 5875 4897 1596 -1159 -441 917 984 -1725 -5169 -7662 -4073 -276 -1232 -1260 -2260 -1423 -447
4437 -447 -660 -2242 -1224 1315 3006 2033 -2183 -4262 -2437 -1866 -262 2813 3447 823 -4411 -4493 -1447
4420 -1447 -3834 -4786 -2464 -767 -2407 -388 409 -3513 -1415 4544 5459 1757 1987 2407 4240 2130
4404 2130 -1530 -1409 2633 3778 5816 3681 2416 290 -1450 -914 -801 -1058 -11 743 -885 -679
4388 -679 86 208 731 2034 3391 5778 5251 7158 4191 648 -327 -1368 -2119 -1442 -872 2563 6498
4371 6498 6474 456 -2489 -1850 433 602 92 -634 -704 1432 3135 3365 -626 -2573 -1800 -2096 -3142 -5423
4353e423j712L882L521K822M9J297R12k900l752p72M21J109M087K275j604k364
4337A848j430K93J75K616m138o49k215P41M047K701O46j368k88j443l131J51j144
4320b588M93K182j380n37R70q72O08p38j521N66j297J258J610l614j007J838O73
4303c356r33L52j226l904k61L306M356M77L72r53p1K661P52k329j008J536J46
4286h3K938J283l987l408r71L628J952l243l158j881O56J914K398K95p06O07o81
4269b447o53m15K629J469J673Q01j555R79J629k02j748J469n73m031M05K898J54
4252B482o43j041J810K945j516j133k053p02j248r25j360M011L703M16k407j739
4236F00L32J87k508j521J443n07j799p11J722J330R85k27J00k24r19L462J385
$$ plain form
4353 -5423 -7135 -3253 268 3090 3139 4436 5348 2448 -1304 -2076 -1655 -546 3541 5816 4212 1848
4337 1848 418 711 886 3502 -636 -1285 -3500 -2759 1288 3989 4635 3267 2979 1536 -1595 -1444 -2588
4320 -2588 -2095 87 -1293 -1830 -860 -1732 -1124 -1862 -3383 -2817 -4114 -2856 -1246 -4860 -5867 -4029 -3356
4303 -3356 -4289 -3937 -5163 -9067 -9328 -6022 -1666 -1189 -817 -1770 -1841 820 1572 -757 -1765 -229 -83
4286 -83 2855 4138 151 -3257 -4228 -600 1352 -1891 -5049 -6930 -6274 -4360 -1962 -1667 -2373 -1766 -2447
4269 -2447 -3100 -3515 -886 583 2256 3057 1502 2481 4110 3908 2160 3629 3056 -975 -570 2328 2482
4252 2482 1839 798 2608 5553 4037 2904 851 149 -1099 -2024 -3384 627 4330 4746 2339 600
4236 600 932 1119 -1389 -2910 -1467 -1974 -3773 -4484 -2762 -1432 -447 -674 -574 -798 -1717 1745 3130
4219C130j202n646n003L260J085j497K10Q04o44J233K436J171N62n35j142j350
4203c128q22L086J960J298L160m60q21k452k06l50q37j36J800J218l036m666r12
4186e304J925j147o68J592K229k941J344M488p34j419K565j530n619L638N676
4171D095k864j704n75J783O46j55k518k300l9j562J856K608K049J49k391K844
4155A922n90j036k2N14o26K76J756q55q03O51J419K446j969j767j808l870j932
4138f294J039K982j66L342k63j751q98J223q80r67J051M39J986M306P68j718n089
4121h90l594K03L978k2M78K712q6K026O02k501k625n75P63o22K669m18j648J779
4103B229k709j529k164J030J633K01j568J230J750q76J357j086J210L040q67l216
$$ plain form
4219 3130 1928 -3718 -8721 -5461 -4376 -5873 -5663 -4859 -5503 -4270 -1834 -663 -101 -636 -1778 -3128
4203 -3128 -3950 -864 1096 2394 5554 5094 4273 1821 1615 1265 428 292 2092 3310 274 -4392 -5304
4186 -5304 -3379 -4526 -5194 -3602 -1373 -4314 -2970 1518 784 -635 1930 400 -5219 -1581 4095
4171 4095 1231 -473 -1048 735 1381 1226 -1292 -3592 -3631 -5193 -3337 -729 1320 1469 -922 1922
4155 1922 1332 296 274 788 162 438 2194 1339 536 1187 2606 5052 3083 1316 -492 -4362 -6294
4138 -6294 -5255 -2273 -2439 903 640 -1111 -2009 -786 -1666 -2633 -1582 -1143 843 5149 5917 4199 -890
4121 -890 -4484 -4281 -303 -325 153 2865 2779 4805 5407 2906 281 -294 469 -153 2516 2098 450 2229
4103 2229 -480 -2009 -4173 -3143 -1510 -1309 -2877 -1647 103 -773 584 -502 708 3748 2881 -335
4087c35k784L001J999k569k735N46j026J840l36J213M675M73j319K476j655N26
4071C990J644Q70L363L021j614k890m492p79O333m82n547l698j11j222O63K231
4055A280J633j321j270m7k951k89Q07M34M62K862M728q63m409j724J151m5k067
4038a629q99j21L249J308l982n925J034N853Q65L57j302j501n31J271K928K478
4022C453J408J051J527r45j505K28J596j855m487j241N87J855J705j36J514J57
4006D912l866j373K266j088k85k110J611M587J729p65j769j128O9J115j067J15
3990B953J03J376r55l94l83j459k740J58J889J020j354j711j129Q01m54J012K622
3973A355m68j338Q67L543J046k989j561K273r58J583K727p84n113q44Q33j221
$$ plain form
4087 -335 -3119 -118 1881 -688 -3423 -2877 -3903 -2063 -2399 -1186 3489 3962 2643 5119 3464 3990
4071 3990 5634 6504 9867 12888 11274 8384 3892 3113 9446 8964 3417 -281 -392 -1614 -951 1280
4055 1280 2913 1592 322 275 -2676 -2965 -2158 -1724 -1262 1600 6328 5465 1056 -668 483 438 -1629
4038 -1629 -2528 -2649 600 1908 -2074 -7999 -6965 -1112 -247 110 -1192 -2693 -3224 -1953 975 3453
4022 3453 4861 5912 7439 6494 4989 5217 6813 4958 471 -770 -183 1672 3377 3241 4755 4912
4006 4912 1046 -327 1939 851 566 -1544 67 4654 6383 5618 3849 2721 2790 3905 2838 2953
3990 2953 3056 4432 3477 3083 2700 1241 -1499 -1341 548 1568 214 -1497 -2626 -1825 -2279 -1267 1355
3973 1355 887 -451 416 3959 5005 2016 455 2728 1770 3353 6080 5296 183 -661 172 -1049
3957a049k844j580M239L73j691j7N267j58O13j1p91p85N31K249P01l263l90p53
3939F41k351J358P41K54r55P52J628k157K23n67L29k489j494l67J667J674K581
3922A468j959m548N85K967l61j379Q88M964n11l879J730K040o79j912J796J708
3906B918j200J061O94j759J26j032O38m68j918j321K471J266l492J800m69j147
3890a832q4k467N1L085M720J30j379J473L142K130k868k681k840k153J615R31
3874I73j972J394K963j169l224Q66j56J251n72n055l972J225k237j07J314J004
3858g474M422J463K117M757L36l810L88J856k844K93k257N54K436k103P99J108
3842B041k460l458n83M434N480j379k459n34n19J958J864k408K299M287l788l308
$$ plain form
3957 -1049 -3893 -5473 -1234 -861 -2552 -2569 2698 2540 3153 3142 2351 1566 2097 4346 5047 1784 1394 641
3939 641 -1710 -352 389 643 -312 440 2068 -89 134 -433 -104 -2593 -4087 -4454 -2787 -1113 1468
3922 1468 -491 -5039 -4454 -1487 -1848 -3227 -2339 2625 2114 -1765 -35 2005 1326 -586 1210 2918
3906 2918 1718 2779 3473 1714 1840 808 1446 978 -940 -2261 210 1476 -2016 -216 -685 -1832
3890 -1832 -1916 -4383 -4332 -1247 3473 3603 2224 3697 6839 8969 6101 3420 580 -1573 42 973
3874 973 -999 395 3358 2189 -1035 -169 -325 926 354 -4701 -8673 -7448 -9685 -9792 -8478 -7474
3858 -7474 -3052 -1589 528 5285 5621 1811 2199 4055 1211 1504 -753 -199 2237 134 933 2041
3842 2041 -419 -3877 -4460 -26 5454 4075 1616 1082 563 2521 4385 1977 4276 8563 4775 1467
3826A467n70J964J069J416j618q75m309K448L505K724J277J023k193l63r17m390
3810A658l331j355K834K26j440k183K93J637J628L112J961p67o9j28l825K630
3794B881k208j331k024K948K847j155L427k140l433m63M051R29O59R70r25l360
3778A673j750k168j043O70J509K905l98J795o8k461l012j775L523M460J963j226
3762D597K05r93J269Q31j872k908j921m1J410j914L50J246l743k37K310J616J414
3745A619j82j368j918J112J676O60J133p51l839j402P51k158M33M194P62P96J203
3728B721j029K453q75k05K785q20j329n63J884j17n06M00l648k134J593P35K073
3711C418L68K665m6J34N50j487j895N2j988P6O12p87L602K804n68l525k145J212
$$ plain form
3826 1467 897 2861 3930 5346 3728 2853 -1456 992 4497 7221 8498 9521 7328 6965 6048 1658
3810 1658 -1673 -3028 -194 32 -1408 -3591 -3298 -1661 -33 3079 5040 4273 4204 4076 251 2881
3794 2881 673 -658 -2682 266 3113 1958 5385 3245 -188 -651 3400 4329 4988 5958 5033 1673
3778 1673 -77 -2245 -3288 -2618 -1109 1796 1398 3193 3125 664 -2348 -4123 -600 3860 5823 4597
3762 4597 4802 3809 5078 5909 4037 1129 -792 -833 577 -1337 -987 259 -3484 -3721 -1411 205 1619
3745 1619 1437 69 -1849 -737 939 1599 2732 1981 -1858 -3260 -2509 -4667 -4234 -40 722 1518 2721
3728 2721 1692 4145 3270 3065 5850 5030 3701 3138 5022 4905 4399 4799 1151 -983 610 1345 3418
3711 3418 3786 6451 6405 6539 7089 5602 3707 3759 1771 1847 2459 1672 5274 8078 7510 3985 1840 3052
3693C052j668O60J118O68K550j0m430r97L324R84l70r18l107l240j342L258K900
3676B432L350K294K635J245j214j165k307j299n631j114J112j464L907J490J270
3661E541k31j125m7j395k121J522j400k095K54j462J435J587n00J382J517J188
3645D050K927q67l043r24j404j568j323q11L408K598k303k349J333k84K370K099
3629C909j605k62j393J653q9r53j776R32p27j729l33J989M02k78l610k168K029
3612d009J990k575l990R52M455L382j719q12L060J5j465Q45O2j24J469K203j361
3595B378n444l993J62J221J184O534J607k065j532K230l95j67j226m11N97K736
3579C416L726J818n076k452j284r11j132P94R75R97q07k606R3N613K675J051j326
$$ plain form
3693 3052 1384 2044 3162 3830 6380 6370 1940 943 4267 5251 4881 3963 856 -2384 -3726 -468 2432
3676 2432 5782 8076 10711 11956 10742 9577 7270 5971 340 -774 338 -1126 2781 4271 5541
3661 5541 5310 4185 4138 2743 622 2144 744 -1351 -1097 -2559 -1124 463 -37 1345 2862 4050
3645 4050 6977 6110 3067 2143 739 -829 -2152 -2963 445 3043 740 -1609 -276 -560 1810 3909
3629 3909 2304 2042 649 2302 2213 1260 -516 416 -311 -2040 -2373 -384 18 -260 -3870 -6038 -4009
3612 -4009 -2019 -4594 -8584 -7632 -3177 205 -1514 -2326 734 749 -716 129 191 67 1536 3739 2378
3595 2378 -3066 -7059 -6897 -5676 -4492 2042 3649 1584 52 2282 1887 1720 494 83 680 3416
3579 3416 7142 8960 3884 1432 148 -763 -1895 -1101 -126 871 64 -2542 -2449 3164 5839 6890 5564
3562E564k568n00o33j818L702nl171N85j64J7K267k307l596J530J562j8m523K412
3544a664M361O63J133j824J561K672np65j938l216M68j079M52o6J278N76j454
3527A153q43j784N00j459j54N4K074K166J032K8R48J260j150j47J413n1L6k192
3509B884k366R09o71k134k783L169K125R20J432r89l659k751J40K235J293J381
3493A135J888q66l01N83n76J31R76j281l138N12n83q89L458K165P75j089k432
3476D68j071j80o93M149L459j706k008l011N15K189k864k955j539j574L181J549
3460b091l516j51o56k04K800L321K675j411M33K94j842j281k321J137j577l143
3444g533K788M497K953j328Q84o04j202l816K156K270R33M17J699M32j746l482
$$ plain form
3562 5564 2996 2496 1863 45 3747 3742 571 1156 992 1009 3276 969 -2627 -1097 465 447 -4076 -1664
3544 -1664 2697 3360 4493 2669 4230 6902 6897 6132 4194 978 1446 367 819 753 2031 2607 1153
3527 1153 310 -1474 -974 -2433 -2587 -2533 -459 1707 2739 2767 3715 4975 3825 3678 5091 5040 5076 2884
3509 2884 518 1427 756 -1378 -4161 -992 1133 2053 3485 2496 -1163 -3914 -3774 -1539 -246 1135
3493 1135 3023 2157 1856 2439 1863 1994 2970 1689 -1449 -937 -1520 -2409 1049 3214 3989 2900 468
3476 468 -603 -783 -1476 2673 6132 4426 2418 -593 -78 2111 -753 -3708 -5247 -6821 -3640 -2091
3460 -2091 -5607 -5758 -6414 -6618 -3818 -497 2178 767 1200 1494 -348 -1629 -3950 -2813 -4390 -7533
3444 -7533 -4745 -248 2705 1377 2261 1657 455 -3361 -1205 1065 1998 2415 4114 4546 2800 -682
3428f82j081j484L28P56J006M76K815k065j431j94J899M44l797q66j442J974J066
3411b278l219j163J800J34J270J934J490Q46J486o3k310M4K420m76l727L66J604
3394A58k638k188M467q87n86N02n04K546M228K951l708q58L064l945j036J993
3378C559m4k129k027K997J445j157k502M91J15j058k949O98K871j009P62K202
3362B265J52l059o74o73q49L254K070j579j024k33L123R10K565q22k274P81r51
3345B982k62N5j749l472K72p53J103L601L320j658q53P5K333q38j226j892l602
3328b564J875J991m33Q21J936j97p58j889K515L42K541J44j744k743L930L817
3312I584j970k357N62l893l652J060l060j423J126K457L837J771k659j219m35
$$ plain form
3428 -682 -1763 -3247 -2919 -2163 -1157 -681 2134 69 -1362 -1556 343 787 -3010 -3876 -5318 -3344 -2278
3411 -2278 -5497 -6660 -4860 -4726 -3456 -1522 -32 814 2300 2237 -73 -29 2391 1915 -1812 -1446 158
3394 158 -2480 -4668 -201 -1088 -1674 -1172 -1676 870 5098 8049 4341 3483 6547 2602 1566 3559
3378 3559 3515 1386 -641 2356 3801 2644 142 633 748 -310 -3259 -2561 310 -699 63 2265
3362 2265 2417 -642 -1316 -1989 -2838 416 2486 907 -117 -350 2773 3683 6248 5426 3152 3933 2982
3345 2982 2720 2775 1026 -2446 -2174 -2927 -1824 1777 5097 3439 2586 2661 4994 4156 2930 1038 -2564
3328 -2564 -689 1302 869 1690 3626 3429 2671 782 3297 3639 6180 6324 4580 1837 5767 9584
3312 9584 7614 5257 5819 1926 -1726 -666 -3726 -5149 -4023 -1566 2271 4042 1383 164 -271
3297b71J281R50q41J907J775j836o16R35M596l832q9k134r87J038o54K565K914
3280F701K488R12j655p58J660J069j043j561j83N5l955n197K469K280J474J80
3264D936k418j034Q19Q86P76m807m38L142J140K362o52j847j470J471O63j865
3248A664N37J129P9L32j612j10o80p66L455J256P45o1k908j69l336L84n14k15
3230g90L59O13j20K6m023R98L220j240K125P48k244k99L99k773j202K811k96j117
3212b805L316M220M327o21k255j894j091J583R86m57o49J268k445k39n47J329
3196D026j358M48M02k014J391l012m067j318J444J817K548L132K57k04K657m61
3180E688j943K387k599m494j220k59q61J728K276J619k129J654L961J880J337
$$ plain form
3297 -271 1010 1960 1119 3026 4801 2965 2349 3284 7880 4048 3959 1825 838 1876 1222 3787 6701
3280 6701 9189 10101 8446 7688 9348 10417 9374 7813 7630 7685 3730 -1467 1002 3282 4756 4936
3264 4936 2518 1484 2303 3189 3965 -842 -1280 1862 3002 5364 4712 2865 1395 2866 3529 1664
3248 1664 2201 3330 3409 3741 2129 2019 1339 573 4028 5284 6029 5968 3060 2891 -445 -61 -575 -790
3230 -790 -431 182 62 88 -3935 -2937 283 -957 1168 1916 -328 -627 -228 -3001 -4203 -1392 -1688 -2805
3212 -2805 511 4731 9058 8437 6182 4288 3197 4780 5766 5309 4660 5928 3483 3244 2697 4026
3196 4026 2668 3116 3518 1504 2895 -117 -4184 -5502 -4058 -2241 307 3439 3696 3492 6149 5688
3180 5688 3745 6132 3533 -961 -2181 -2440 -3301 -1573 703 2322 193 1847 5808 7688 9025
3165I025n24j089j972P89j68n203L68M6j82p34o24O68m12j374J46J444Q30r77
3147E7j812j142j435J282P25K417o35p33Q4J087L782j395k201j694L955N88l676
3130g46J220J377J397j793k278J838M74j474R88K18J549J887Q94n17l642l772
3114b380j854o96J105J355k461j598J782K166j34K681L146P8J174J709P4k525
3098C622n052l761K376O133K736l73l051J4K526Q78J674j986q50k654l85J781
3082C628J022j549k260j4R71P79M550j890l951j1J641k184l215q11L201K350J904
3065D161j145j280J91m63K45l249k958K23K848J844N05M10J266P73J195J930j523
3048D973j963Q11J371K65P77o9l021m289J787Q84K176j553P89N847p33k216J243
$$ plain form
3165 9025 8501 7412 5440 6229 6061 858 1226 1272 1090 356 -268 400 -12 -1386 -1240 204 1034 57
3147 57 -1755 -2897 -4332 -3050 -2325 92 -543 -1276 -1192 -105 3677 2282 81 -1613 2342 2930 -746
3130 -746 474 1851 3248 1455 -823 1015 1489 15 1003 1221 2770 4657 5551 5034 1392 -2380
3114 -2380 -4234 -4930 -3825 -2470 -4931 -6529 -4747 -2581 -2715 -34 3112 3190 4364 6073 6147 3622
3098 3622 -1430 -5191 -2815 3318 6054 5681 2630 2644 5170 6048 7722 5736 4886 2232 1847 3628
3082 3628 4650 3101 841 827 1798 2577 7127 5237 1286 1275 2916 732 -2483 -3294 -93 2257 4161
3065 4161 3016 1736 1927 1464 1709 -1540 -4498 -4275 -1427 417 922 1332 2598 3371 4566 6496 4973
3048 4973 3010 3821 5192 5457 6234 6165 3144 -1145 642 1526 3702 2149 2938 8785 8052 5836 7079
3031G079M84q24k336k33Q25L174j657j618K13p44r47j67J385j417j350Q61k715
$$ plain form
3031 7079 7563 6739 4403 4170 4995 8169 6512 4894 5107 4363 3416 3249 4634 3217 1867 2728 13
$$ [...]
##END NTUPLES=NMR SPECTRUM
##END=
