##TITLE=Analysis number 326707
Compound Code cc 59609
Book Reference 521/23
Project Code adrs
Chemist Name evam
##JCAMPDX= 6.0         $$ Bruker NMR JCAMP-DX V2.0
##DATA TYPE= NMR SPECTRUM
##DATA CLASS= NTUPLES
##ORIGIN= Bruker BioSpin GmbH
##OWNER= nmr
$$ XWIN-NMR		Version 3.5
$$ Tue Feb 20 08:46:21 2007 GMT Standard Time (UT+0h)  MAYBRIDGE\nmr@NMR_250MHZ
##.OBSERVE FREQUENCY= 250.131544655141
##.OBSERVE NUCLEUS= ^1H
##.ACQUISITION MODE= SIMULTANEOUS (DQD)
##.ACQUISITION SCHEME= undefined
##.AVERAGES= 16
##.DIGITISER RES= 18
##SPECTROMETER/DATA SYSTEM= dpx250
##.PULSE SEQUENCE= zg30
##.SOLVENT NAME= CDCl3
##.SHIFT REFERENCE= (INTERNAL, CDCl3, 0, 16.522)
##AUDIT TRAIL= $$ (NUMBER, WHEN, WHO, WHERE, WHAT)
$$ ##TITLE= Audit trail, XWIN-NMR		Version 3.5
$$ ##JCAMPDX= 5.01
$$ ##ORIGIN= Bruker BioSpin GmbH
$$ ##OWNER= nmr
$$ C:\u/data/dgb/nmr/ADRS/1240/pdata/1/auditp.txt
$$ ##AUDIT TRAIL=  $$ (NUMBER, WHEN, WHO, WHERE, WHAT)
(   1,<2007-02-20 08:45:57.24 +000>,<MAYBRIDGE\nmr>,<NMR_250MHZ>,
      <created by zg, POWCHK disabled, PULCHK disabled
       configuration hash MD5:
       49 4B E0 1D 92 C2 6B 37 9F E6 65 BC 52 41 86 1D
       data hash MD5: 64K
       94 46 71 A6 C0 75 59 F4 18 BA 9C 15 BC 09 DD FF>)
(   2,<2007-02-20 08:46:11.19 +000>,<MAYBRIDGE\nmr>,<NMR_250MHZ>,
      <Start of raw data processing
       ef LB = 0.3 FT_mod = 6 PKNL = 1 SI = 32K 
       data hash MD5: 32K
       4C 7C BE D4 DC BF 09 BB 64 D9 C0 1E 6C 13 A6 D9>)
(   3,<2007-02-20 08:46:12.85 +000>,<MAYBRIDGE\nmr>,<NMR_250MHZ>,
      <apk 
       data hash MD5: 32K
       CD 26 5B 6D FA 4F C9 54 21 3C 46 FB 51 CD C8 7A>)
(   4,<2007-02-20 08:46:13.69 +000>,<MAYBRIDGE\nmr>,<NMR_250MHZ>,
      <abs ABSG = 5 
       data hash MD5: 32K
       9D A1 8D B4 D4 34 8B 86 4D 12 FA CC E8 49 FB 23>)
$$ ##END=
$$ 
$$ hash MD5
$$ A8 0A 4F 00 97 0C 72 DF D5 81 A1 8E 38 CB AE B9
##$RELAX= 
##$RELAX= 
##$RELAX= 
##$RELAX= 
##$RELAX= 
##$RELAX= 
##$RELAX= 
$$ Bruker specific parameters
$$ --------------------------
##$DU= <C:\u>
##$EXPNO= 1240
##$NAME= <ADRS>
##$PROCNO= 1
##$TYPE= <nmr>
##$USER= <dgb>
##$AMP= (0..31)
100 100 100 100 100 100 100 100 100 100 100 100 100 100 100 100 100 100 
100 100 100 100 100 100 100 100 100 100 100 100 100 100 
##$AQSEQ= 0
##$AQ_mod= 3
##$AUNM= <au_zg>
##$AUTOPOS= <22 >
##$BF1= 250.13
##$BF2= 250.13
##$BF3= 250.13
##$BF4= 250.13
##$BF5= 500.13
##$BF6= 500.13
##$BF7= 500.13
##$BF8= 500.13
##$BYTORDA= 1
##$CFDGTYP= 0
##$CFRGTYP= 5
##$CHEMSTR= <none>
##$CNST= (0..31)
1 1 145 1 1 1 1 1 1 1 1 1 1 1 1 1 1 1 1 1 1 1 1 1 1 1 1 1 1 1 1 1 
##$CPDPRG= <>
##$CPDPRG1= <>
##$CPDPRG2= <>
##$CPDPRG3= <>
##$CPDPRG4= <mlev>
##$CPDPRG5= <mlev>
##$CPDPRG6= <mlev>
##$CPDPRG7= <mlev>
##$CPDPRG8= <mlev>
##$CPDPRGB= <>
##$CPDPRGT= <>
##$D= (0..31)
0 1 0 0 0 0 0 0 0 0.06 0 0 0 0 0 0 0.0002 0 0 0 0 0 0 0 0 0 0 0 0 0 0 
0 
##$DATE= 1171961155
##$DBL= (0..7)
120 120 120 120 120 120 120 120 
##$DBP= (0..7)
150 150 150 150 150 150 150 150 
##$DBP07= 0
##$DBPNAM0= <>
##$DBPNAM1= <>
$$ [...]
##$SUBNAM7= <"">
##$SUBNAM8= <"">
##$SUBNAM9= <"">
##$SW= 20.6930455092707
##$SWIBOX= (0..15)
0 0 3 0 0 0 0 0 0 0 0 0 0 0 0 0 
##$SW_h= 5175.983436853
##$TD= 65536
##$TD0= 1
##$TE= 295.16
##$TE2= 300
##$TE3= 300
##$TEG= 300
##$TL= (0..7)
0 120 120 120 120 120 120 120 
##$TP= (0..7)
150 150 150 150 150 150 150 150 
##$TP07= 0
##$TPNAME0= <>
##$TPNAME1= <>
##$TPNAME2= <>
##$TPNAME3= <>
##$TPNAME4= <>
##$TPNAME5= <>
##$TPNAME6= <>
##$TPNAME7= <>
##$TPOAL= (0..7)
0.5 0.5 0.5 0.5 0.5 0.5 0.5 0.5 
##$TPOFFS= (0..7)
0 0 0 0 0 0 0 0 
##$TUNHIN= 0
##$TUNHOUT= 0
##$TUNXOUT= 0
##$USERA1= <user>
##$USERA2= <user>
##$USERA3= <user>
##$USERA4= <user>
##$USERA5= <user>
##$V9= 5
##$VALIST= <valist>
##$VCLIST= <CCCCCCCCCCCCCCC>
##$VD= 0
##$VDLIST= <DDDDDDDDDDDDDDD>
##$VPLIST= <PPPPPPPPPPPPPPP>
##$VTLIST= <TTTTTTTTTTTTTTT>
##$WBST= 1024
##$WBSW= 4
##$XGAIN= (0..3)
0 0 0 0 
##$XL= 0
##$YL= 0
##$YMAX_a= 365131
##$YMIN_a= -345532
##$ZGOPTNS= <>
##$ZL1= 120
##$ZL2= 120
##$ZL3= 120
##$ZL4= 120
##$ABSF1= 16.522
##$ABSF2= -4.171173
##$ABSG= 5
##$ABSL= 3
##$ALPHA= 0
##$AQORDER= 0
##$ASSFAC= 0
##$ASSFACI= 0
##$ASSFACX= 0
##$ASSWID= 0
##$AUNMP= <proc_1d>
##$AZFE= 0.1
##$AZFW= 0.1
##$BCFW= 0
##$BC_mod= 0
##$BYTORDP= 0
##$COROFFS= 0
##$CY= 12.5
##$DATMOD= 1
##$DC= 0
##$DFILT= <>
##$DTYPP= 0
##$F1P= 14.0000005364418
##$F2P= -0.99999901652339
##$FCOR= 0.5
##$FTSIZE= 32768
##$FT_mod= 6
##$GAMMA= 0
##$GB= 0
##$INTBC= 1
##$INTSCL= 1
##$ISEN= 128
##$LB= 0.3
##$LEV0= 0
##$LPBIN= 0
##$MAXI= 10000
##$MC2= 0
##$MEAN= 0
##$ME_mod= 0
##$MI= 0
##$NCOEF= 0
##$NC_proc= -3
##$NLEV= 6
##$NOISF1= 0
##$NOISF2= 0
##$NSP= 0
##$NTH_PI= 0
##$NZP= 0
##$OFFSET= 16.522
##$PC= 1
##$PHC0= 225.1534
##$PHC1= 7.226542
##$PH_mod= 1
##$PKNL= yes
##$PPARMOD= 0
##$PSCAL= 4
##$PSIGN= 0
##$REVERSE= no
##$SF= 250.13
##$SI= 32768
##$SIGF1= 0
##$SIGF2= 0
##$SINO= 400
##$SIOLD= 32768
##$SREGLST= <1H.CDCl3>
##$SSB= 0
##$STSI= 32768
##$STSR= 0
##$SW_p= 5175.98343685301
##$SYMM= 0
##$S_DEV= 0
##$TDeff= 65536
##$TDoff= 0
##$TI= <Analysis number 999999
Compound Code 99
Book Reference 9
Project Code 9>
##$TILT= no
##$TM1= 0
##$TM2= 0
##$TOPLEV= 0
##$USERP1= <user>
##$USERP2= <user>
##$USERP3= <user>
##$USERP4= <user>
##$USERP5= <user>
##$WDW= 1
##$XDIM= 32768
##$YMAX_p= 496719617
##$YMIN_p= -125048
$$ End of Bruker specific parameters
$$ ---------------------------------
##NTUPLES= NMR SPECTRUM
##VAR_NAME=  FREQUENCY,     SPECTRUM/REAL,   SPECTRUM/IMAG
##SYMBOL=    X,             R,               I
##VAR_TYPE=  INDEPENDENT,   DEPENDENT,       DEPENDENT
##VAR_FORM=  AFFN,          ASDF,            ASDF
##VAR_DIM=   32768,         32768,           32768
##UNITS=     HZ,            ARBITRARY UNITS, ARBITRARY UNITS
##FACTOR=    0.157963299565203, 1,           1
##FIRST=     4132.6476996994, 0,             0
##LAST=      -1043.33573715361, 0,           0
##MIN=       -1043.33573715361, -125048,     0
##MAX=       4132.6476996994, 496719617,     0
$$ Real data points
##PAGE= N=1
##DATA TABLE= (X++(R..R)), XYDATA
$$ [...]
$$ plain form
16328 -11616 -22054 -15237 -8939 -1160 4936 -3384 -15335 -13440 -5870 -2418 -1280 -8070 -13648 -7684
16314 -7684 3738 20414 24040 14804 7648 18867 19881 25973 20556 3581 -10346 -22520 -17988
16301 -17988 -18075 -24544 -28976 -30920 -32254 -39914 -34410 -26293 -21337 -28877 -22720 -19306 -45 3004 -6355
16286 -6355 -24091 -29213 -13277 -9131 -16464 -22106 -33579 -27837 -19055 -17981 -18129 -18825 -15138 -28728
16272 -28728 -29563 -20943 -8400 -1738 -4438 -7673 -8343 -2543 16698 11591 1513 -13157 -7946 3179
16258 3179 671 -3930 -2474 2636 7272 3654 -16858 -8975 10738 14127 3679 -17199 -10501 -352
16244 -352 2288 2269 2275 2098 -4986 -22970 -13656 -3143 472 599 3472 4066 -3081 839 -3452 -20221
16228 -20221 -29148 -16149 -4603 -7297 226 5502 7428 5184 -9932 -7497 -3017 -9076 -12267 -6787
$$ packed form
16328a1616j0438O817O298P779O096q320j1951J895P570L452J138o790n578N964
16314g684J1422J6676L626r236p156J1219J014O092n417j6975j3927j2174M532
16301a7988q7o469m432j944j334p660N504Q117M956p540O157L414J9261L049r359
16286f355j7736n122J5936M146p333n642j1473N742Q782J074j48o96L687j3590
16272b8728q35Q620J2543O662k700l235o70N800J9241n107j0078j4670N211J1125
16258C179k508m601J456N110M636l618k0512P883J9713L389j0448k0878O698J0149
16244c52K640j9Oj77p084j7984R314J0513L615J27K873N94p147L920m291j6769
16228b0221q927J2999J1546k694P523N276J926k244j5116K435M480o059l191N480
$$ plain form
16214 -6787 1080 -1627 -18831 -22420 -10700 -7464 -6583 -5720 777 1313 -5057 -10734 -3772 2149 8004
16199 8004 18455 17144 7815 12454 13070 -1711 3089 -5561 3309 7808 -16665 -25043 -16086 -5609
16185 -5609 -15608 -9331 -13070 -14961 -7186 -11216 -10435 -2412 3094 282 -15026 -21640 -25278 -22747 -1577
16170 -1577 3011 -19858 -28499 -22053 -16026 -5685 -9696 -13469 4241 11159 4886 -1582 -7707 -4548
16156 -4548 -2483 437 -5937 -16001 -27719 -24870 -12697 9396 -2629 -16409 -7794 -13008 -6238
16143 -6238 822 8841 -85 -3117 -320 5669 20303 14542 13993 1967 6620 2869 -16829 -26638
16129 -26638 -30814 -26453 -17662 2464 13631 6619 -5722 -12385 -1296 -6352 -9207 -6860 1438
16116 1438 3475 -307 -11938 -14758 -5044 -6617 -11866 -20358 -16717 1823 -4458 -6215 -7776 5652
$$ packed form
16214f787P867k707j7204l589J1720L236Q81Q63O497N36o370n677O962N921N855
16199H004J0451j311r329M639O16j4781M800q650Q870M499k4473q378Q957J0477
16185e609r999O277l739j891P775m030P81Q023N506k812j5308o614l638K531K1170
16170a577M588k2869q641O446O027J0341m011l773J7710O918o273o468o125L159
16156d548K065K920o374j0064j1718K849J2173K2093j2025j3780Q615n214O770
16143f238P060Q019q926l032K797N989J4634n761n49j2026M653l751j9698r809
16129b6638m176M361Q791K0126J1167p012j2341o663J1089n056k855K347Q298
16116A438K037l782j1631k820R714j573n249q492L641J8540o281j757j561J3428
$$ plain form
16102 5652 12882 23261 10551 -6937 -742 13771 8621 -5520 -10727 -19167 -32468 -27858 -10663
16089 -10663 -12597 -6447 1080 -2058 3218 3659 -2334 -7002 -15413 -24172 -25012 -23161 -21634 -14940 -4853
16074 -4853 11315 10234 4622 21535 29397 29293 12905 -12849 -19355 -9991 -4717 -214 7648 13072
16060 13072 741 -11213 -5171 4016 -8154 -9968 -2015 5683 15173 21778 11904 21101 13989 13781
16046 13781 5083 15125 26628 30618 33849 20133 16105 -12229 -27252 -15457 -2398 -1257 -4449
16033 -4449 -10607 -12799 -10934 -21250 -23875 -22400 -11026 -2653 3143 902 2530 11474 18749 26600
16019 26600 27754 16190 20266 28010 31390 17551 -5040 -4519 -18122 -14576 -2126 -9808 -22751
16006 -22751 -15238 11494 14387 8030 -11530 -17126 -22236 -21284 -12096 -5222 -9071 -14632 -24017 -24564
$$ packed form
16102E652P230J0379j2710j7488O195J4513n150j4141n207q440j3301M610J7195
16089a0663j934O150P527l138N276M41n993m668q411q759q40J851J527O694J0087
16074d853J6168j081n612J6913P862j04j6388k5754o506R364N274M503P862N424
16060A3072j2331j1954O042R187j2170j814P953P698R490O605r874R197p112k08
16046A3781q698J0042J1503L990L231j3716m028k8334j5023J1795J3059J141l192
16033d449o158k192J865j0316k625J475J1374Q373N796k241J628Q944P275P851
16019B6600J154j1564M076P744L380j3839k2591N21j3603L546J2450p682j2943
16006b2751P513K6732K893o357j9560n596n110R52R188O874l849n561r385n47
$$ plain form
15992 -24564 -8942 12172 7122 2731 4605 3690 2610 -9828 -9746 2493 5497 5082 10779 13063
15978 13063 8083 9120 6424 2462 675 1962 -2561 -371 -1585 -19401 -18333 -5440 10129 19558
15964 19558 15246 5337 2986 25901 17806 -1796 14052 17412 17047 8188 -702 1423 12493 22499
15950 22499 22883 13568 -2167 -6091 -7797 -17027 -18247 -14804 -26401 -34276 -27883 -31413 -24452 -21746
15936 -21746 -28658 -28138 -22743 -20295 -23821 -24361 -20353 -18472 -25025 -30830 -30006 -10396 -4382 -2963 -1266
15921 -1266 -1222 730 -10148 -7463 4651 16399 14999 1993 -1188 24734 19918 7745 6590 5630
15907 5630 -3181 -19486 -18814 54 4818 4505 10240 7290 10912 10615 4988 15219 17948 28293
15893 28293 30496 33972 31965 26161 17427 10200 8626 -9279 -11429 -12347 -2291 2392 -6932 -16848
$$ packed form
15992b4564J5622K1114n050m391J874r15j080j2438Q2J2239L004m15N697K284
15978A3063m980J037k696l962j787J287m523K190j214j7816J068J2893J5569R429
15964A9558m312r909k351K2915q095j9602J5848L360l65q859q890K125J1070J0006
15950B2499L84r315j5735l924j706r230j220L443j1597p875O393l530O961K706
15936b1746o912N20N395K448l526n40M008J881o553n805Q24J9610O014J419J697
15921a266M4J952j0878K685J2114J1748j400j3006l181K5922m816j2173j155r60
15907E630q811j6305O72J8868M764l13N735k950L622k97n627J0231K729J0345
15893B8293K203L476k007n804q734p227j574j7905k150r18J0056M683r324r916
$$ plain form
15879 -16848 -3064 7961 -1145 -2837 -6140 -9331 -6506 -6639 -12100 -13273 -8973 -9224 -921 7789
15865 7789 4400 2143 -2586 -604 1679 3014 -6663 -16017 -25773 -17685 -23450 -29132 -22304 -15794 -17614
15850 -17614 -16635 -15687 -17409 -20875 -26070 -20446 -9457 -5576 -19725 -28095 -19413 -13875 -9497 -10620
15836 -10620 -15860 -21779 -11596 2673 8938 8285 892 -7696 -8703 -16938 -17782 -6880 -17065 -15868
15822 -15868 -11185 -1230 -3185 -8913 -1292 -7358 -7493 1913 -4120 7861 14232 11991 9401 6535
15808 6535 -3314 -3974 -3012 -2556 -2846 2398 13312 5790 -5165 -6716 -6061 -8446 -11017 -8287 -8599 -4846
15792 -4846 7171 10247 20765 23554 18257 17644 16921 12065 9233 1770 5909 11420 -504 -8614
15778 -8614 -259 6595 18875 22222 2384 -15717 -6465 5518 18112 15977 7187 7810 2506 -2850
$$ packed form
15879a6848J3784J1025r106j692l303l191K825j33n461j173M300k51Q303Q710
15865G789l389k257m729J982K283J335r677r354r756Q088n765n682O828O510j820
15850a7614R79R48j722l466n195N624J0989L881j4149q370Q682N538M378j123
15836a0620n240n919J0183J4269O265o53p393q588j007q235q44J0902j0185J197
15822a5868M683R955j955n728P621o066j35R406o033J1981O371k241k590k866
15808F535r849o60R62M56k90N244J0914p522j0955j551O55k385k571K730l12L753
15792d846J2017L076J0518K789n297o13p23m856k832p463M139N511j1924q110
15778h614Q355O854J2280L347j9838j8101R252J1983J2594k135q790O23n304n356
$$ plain form
15764 -2850 -811 5381 7759 11234 16252 7610 11179 18346 8952 2692 3519 -769 -4548 -2139 1737
15749 1737 6461 4409 1094 8681 10048 -2626 -2400 7647 444 -2169 -3644 -10698 -1040 -3701
15735 -3701 -14828 -19205 -11144 -9774 -13860 -25237 -31589 -37860 -22324 -2597 513 988 5681 -5428
15721 -5428 -6595 -12796 -5988 358 -14422 -10141 -8354 -5320 -5529 -12860 -5108 1701 3971 1442 15074
15706 15074 14113 4961 -2693 3764 12386 9857 10390 8765 2181 1832 -1134 10506 12630 3200 8727
15691 8727 21560 6915 -7387 -2366 5098 4117 10913 19976 8990 -2201 -5703 -13709 -27816
15678 -27816 -29264 -9082 465 3055 18425 21843 23480 11300 -7647 -8495 1221 3696 9130 7824
15664 7824 6714 5929 -12697 -24935 -16985 -18696 -17120 -6682 -9739 -16384 -30026 -18276 3731
$$ packed form
15764b850K039O192K378L475N018q642L569P167r394o260Q27m288l779K409L876
15749A737M724k052l315P587J367j2674K26J0047p203k613j475p054R658k661
15735c701j1127m377Q061J370m086j1377o352o271J5536J9727L110M75M693j1109
15721e428j167o201O808O346j4780M281J787L034k09p331P752O809K270k529J3632
15706A5074r61r152p654O457Q622k529N33j625o584l49k966J1640K124r430N527
15691H727J2833j4645j4302N021P464r81O796R063j0986j1191l502q006j4107
15678b7816j448K0182R547K590J5370L418J637j2180j8947q48R716K475N434j306
15664G824j110p85j8626j2238P950j711J576J0438l057o645j3642J1750K2007
$$ plain form
15651 3731 5030 7809 7637 15621 12885 -2119 -3542 939 5052 2952 5356 12836 7056 10298 2646
15636 2646 5609 16267 8828 581 17277 27100 15463 15923 30573 43932 17946 -5698 -17141
15623 -17141 -10143 -6161 5006 13761 14525 11875 24312 34291 18465 5471 -6196 -20959 -16894
15610 -16894 -11134 -6897 -7346 885 4888 -6692 -19227 -13739 2104 11758 10443 14704 12059 6219
15596 6219 18758 28364 26596 15256 3737 -5442 -2061 7650 3818 13960 15574 -361 -1583
15583 -1583 -5046 -5241 -12615 -11498 -16028 -13662 4545 16859 9728 5073 -7112 -11322 -6343 -481
15569 -481 15228 23189 16465 20514 7412 -6565 2336 8626 -3988 -9792 -5518 -6184 -1692 -216
15555 -216 -723 -8236 -8274 -597 -1472 44 11445 915 688 8394 2999 -12698 -18307 -82 798
$$ packed form
15651C731J299K779j72P984k736j5004j423M481M113k100K404P480n780L242p652
15636B646K963J0658p439q247J6696R823j1637M60J4650J3359k5986k3644j1443
15623a7141O998L982J1167Q755P64k650J2437R979j5826j2994j1667j4763M065
15610a6894N760M237m49Q231M003j1580j2535N488J5843R654j315M261k645n840
15596F219J2539R606j768j1340j1519r179L381R711l832J0142J614j5935j222
15583a583l463j95p374J117m530K366J8207J2314p131m655j2185m210M979N862
15569d81J5709P961o724M049j3102j3977Q901O290j2614n804M274o66M492J476
15555b16n07p513l8P677q75J516J1401j0530k27P706n395j5697n609J8225Q80
$$ plain form
15540 798 11658 6592 2211 5145 8773 12075 -3417 -559 8384 5008 -12235 -6037 7959 10183
15526 10183 18512 32278 24278 10795 -2260 -9602 6393 26628 35835 18451 24083 19920 16432
15513 16432 11860 11868 8601 7092 -798 2017 10355 6903 -1905 2613 12731 9419 7517 -793 2819
15498 2819 8772 5102 5077 6492 -3212 -7767 -3770 4270 19694 24478 21776 17580 20878 22054 20490
15483 20490 12783 -3756 -10000 -12483 -11388 -6987 1177 13718 23677 17595 4892 -7354 -15456
15470 -15456 -12544 -4819 -2208 10364 20917 12940 -3140 -4732 4376 14839 19455 17083 29743
15457 29743 31692 22958 20103 6812 20832 34356 16030 1008 -3490 -14577 -10898 3959 5389
15444 5389 10131 13052 9739 16509 11343 13157 9183 6721 4208 2752 5030 9754 20634 14176
$$ packed form
15540G98J0860n066m381K934L628L302j5492K858Q943l376j7243O198J3996K224
15526A0183Q329J3766q000j3483j3055p342J5995K0235R207j7384N632m163l488
15513A6432m572Ql267j509p890K815Q338l452q808M518J0118l312j902q310L612
15498B819N953l670k5J415r704m555L997Q040J5424M784k702m196L298J176j564
15483B0490p707j6539o244k483J095M401Q164J2541R959o082j2703j2246q102
15470a5456K912P725K611J2572J0553p977j6080j592R108J0463M616k372J2660
15457B9743J949q734k855j3291J4020J3524j8326j5022m498j1087L679J4857J430
15444E389M742K921l313O770n166J814l974k462k513j456K278M724J0880o458
$$ plain form
15430 14176 -5474 277 2014 -14584 -9025 3369 4519 12046 21367 17548 6875 15241 32812
15417 32812 27607 15990 15781 13510 12448 17709 25652 22925 37161 32857 21742 23517 21116 19491
15403 19491 22272 31898 30762 20909 17320 15921 12537 8004 7932 21870 29628 25894 9589 4745
15389 4745 3895 19682 40297 29616 -3423 -11972 -10983 8308 22226 7544 -1017 9863 10210
15376 10210 3571 -3908 301 -1705 -5807 -4339 2706 14855 15674 18364 20089 31860 21467 13851
15362 13851 14603 25268 41728 38944 37012 30071 15738 11612 14249 26853 23493 23467 19713 15157
15348 15157 26275 33620 20012 6197 -4679 5776 4403 11125 26974 27006 19031 9509 16046
15335 16046 26709 17434 9838 526 3963 14213 8097 -10865 1453 13983 12368 4482 19143
$$ packed form
15430A4176j9650N751J737j6598N559J2394J150P527R321l819j0673Q366J7571
15417C2812n205j1617k09k271j062N261P943k727J4236m304j1115J775k401j625
15403A9491K781R626j136r853l589j399l384m533p2J3938P758l734j6305m844
15389D745q50J5787K0615j0681l3039q549R89J9291J3918j4682q561J0880L47
15376A0210o639p479M209k006m102J468P045J2149Q19K690J725J1771j0393p616
15362A3851P52J0665J6460k784j932o941j4333m126K637J2604l360k6l754m556
15348A5157J1118P345j3608j3815j0876J0455j373O722J5849L2p975r522O537
15335A6046J0663r275p596r312L437J0250o116j8962J2318J2530j615p886J4661
$$ plain form
15322 19143 18805 15571 27020 28170 33868 27318 20114 10855 -1391 11915 22585 9488 11271
15309 11271 13088 14939 7277 12440 17920 19375 16148 16800 9894 -1010 -5619 9771 10117 -1042
15295 -1042 -7891 -8638 -9709 1003 15140 16342 10042 10648 6963 3330 10740 20358 36209 27063
15281 27063 14847 9007 17206 9495 -2982 -9018 -6430 7689 22781 26242 24778 18836 18262 26026
15267 26026 21230 20224 1998 2662 5211 2357 9002 15767 19265 13572 10571 22744 24862 23799
15253 23799 36002 39497 31930 18363 8710 11957 18907 23962 17148 10937 15969 16403 10511 19217
15239 19217 14532 21589 24985 32469 35903 20949 2235 -3622 -8223 -8649 -409 4318 -1748 12635
15225 12635 38397 46379 31745 31521 38246 37023 26984 31330 29629 16228 27687 36859 25453
$$ packed form
15322A9143l38l234J1449J150N698o550p204r259j2246J3306J0670j3097J783
15309A1271J817J851p662N163N480J455l227O52o906j0904m609J5390L46j1159
15295a042o849p47j071J0712J4137J202o300O06l685l633P410R618J5851r146
15281B7063j2216n840Q199p711j2477o036K588J4119J5092L461j464n942n74P764
15267B6026m796j006j8226O64K549k854O645O765L498n693l001J2173K118j063
15253B3799J2203L495p567j3567r653L247O950N055o814o211N032M34n892Q706
15239A9217m685P057L396P484L434j4954j8714n857m601m26Q240M727o066J4383
15225A2635K5762P982j4634k24O725j223j0039M346j701j3401J1459R172j1406
$$ plain form
15212 25453 8463 16788 32916 26371 12915 2193 5893 14939 17660 17169 21994 13303 14967 20437
15198 20437 21550 11337 20619 22876 23338 23660 17828 11923 3922 860 20077 15767 13035 15555
15184 15555 10801 16919 15666 21666 25995 21784 22323 28068 38467 46270 28585 4473 20696 35970
15170 35970 40286 26416 21706 11171 16500 36145 48542 39029 12508 5587 12600 29871 42816
15157 42816 47235 47321 45729 25094 3216 3497 16758 10822 2913 9706 17771 12732 8404 2799
15143 2799 7602 22169 20394 21034 9479 -536 712 15648 34465 22938 27014 36931 36444 47236
15129 47236 41893 23458 18857 17884 18659 23957 22775 27714 25475 32372 46975 47802 49538 45924 54083
15114 54083 56219 55446 50565 42333 33267 23387 27840 29642 24323 27312 27795 43207 50199 40342 39886
$$ packed form
15212B5453j6990Q325J6128o545j3456j0722L700R046K721m91M825q691J664N470
15198B0437J113j0213R282K257M62L22n832n905q001l062J9217m310k732K520
15184A5555m754O118j253O000M329m211N39N745J0399P803j7685k4112J6223J5274
15170C5970M316j3870m710j0535N329J9645J2397r513k6521o921P013J7271J2945
15157D2816M419Q6j592k0635k1878K81J3261n936p909O793Q065n039m328n605
15143B799M803J4567j775O40j1555j0015J248J4936J8817j1527M076R917m87J0792
15129D7236n343j8435m601r73P75N298j182M939k239O897J4603Q27J736l614Q159
15114E4083K136p73m881q232r066r880M453J802n319K989M83J5412O992r857m56
$$ plain form
15099 39886 47095 37985 28268 10853 240 9706 26835 30622 32169 39537 48407 38817 22359
15086 22359 19734 14752 12457 17594 33148 45290 39118 32224 39076 41179 31050 21770 20499 25708
15072 25708 29100 29983 31868 33661 45527 38218 22905 17045 11077 18004 16416 21634 32011 38887
15058 38887 41004 36728 47811 49200 25188 12228 13954 14329 9241 20219 22959 25874 31679 28771
15044 28771 14807 4151 15222 25337 36224 39268 40000 35641 38467 32414 22234 19567 24846
15031 24846 29364 29918 42343 17743 -926 22515 25143 15309 11126 29993 40123 36079 42510
15018 42510 36488 15943 19634 34099 41390 45414 44878 31942 15067 19560 15431 6774 16197 29035
15004 29035 33093 36248 38643 32320 22827 24561 24647 23322 18543 20538 21751 23642 33392 45275 39438
$$ packed form
15099C9886P209r110r717j7415j0613R466J7129L787J547P368Q870r590j6458
15086B2359k625m982k295N137J5554J2142o172o894O852K103j0129r280j271N209
15072B5708L392Q83J885J793J1866p309j5313n860n968O927j588N218J0377O876
15058C8887K117m276J1083J389k4012j2960J726L75n088J0978K740K915N805k908
15044B8771j3964j0656J1071J0115J0887L044P32m359K826o053j0180k667N279
15031B4846M518N54J2425k4600j8669K3441K628r834m183J8867J0130m044O431
15018D2510o022k0545L691J4465P291M024n36j2936j6875M493m129q657R423J2838
15004B9035M058L155K395o323r493J734Q6j325m779J995J213J891R750J1883n837
$$ plain form
14989 39438 54903 65043 51828 43177 45832 41293 49801 55075 47201 27495 14532 11748 15620
14976 15620 18330 15836 25413 32500 34192 25612 34661 31285 23329 21286 13399 11496 23123 27203
14962 27203 30045 22655 29096 41107 42760 34552 24951 31029 48310 45832 41262 34870 21794 21512
14948 21512 19407 24386 21239 29651 46071 37381 26760 26923 46352 49923 52466 47263 32541 36083
14934 36083 55090 42559 26156 34565 37830 26753 20631 38838 41523 25448 31023 38399 42076
14921 42076 36928 28573 27670 27858 31901 24190 23748 38492 51680 60325 53043 41188 38427 45434
14907 45434 27222 22769 38009 37814 21526 24544 34412 29701 19538 12501 16833 40750 51714
14894 51714 42688 43793 45393 34306 28622 34017 43861 39820 31509 25099 29110 33655 45870 41264
$$ packed form
14989C9438J5465J0140j3215q651K655m539Q508N274p874j9706j2963k784L872
14976A5620K710k494R577P087J692q580R049l376p956k043p887j903J1627M080
14962B7203K842p390O441J2011J653q208r601O078J7281k478m570o392j3076k82
14948B1512k105M979l147Q412J6420q690j0621J63J9429L571K543n203j4722L542
14934C6083J9007j2531j6403Q409L265j1077o122J8207K685j6075N575P376L677
14921D2076n148q355r03J88M043p711m42J4744J3188Q645p282j1855k761P007
14907D5434j8212m453J5240j95j6288L018R868m711j0163p037M332K3917J0964
14894E1714r026J105J600j1087n684N395R844m041q311o410M011M545J2215m606
$$ plain form
14880 41264 34587 39370 45307 39681 45306 43938 43927 36622 40403 48196 42650 30115 38436 45598 56523
14865 56523 65222 48033 32479 28729 25442 33580 43237 54081 54241 57407 58039 53204 59965 65717
14851 65717 61429 56716 63200 45478 47404 52553 52627 47664 49300 49408 52071 62509 56855 55714 59297
14836 59297 55173 51524 39983 38167 47799 49458 63912 67245 77313 84301 74018 56985 72363
14823 72363 81162 82887 79814 71478 56998 49209 64735 79804 68861 54774 53571 59384 66381
14810 66381 82766 89429 80799 73359 77287 76233 49570 52317 65419 62694 64613 68549 67154 69270
14796 69270 66862 76889 83316 113315 132529 153000 173487 162062 165780 184545 188131 174835
14784 174835 159529 147027 130967 112610 100333 92456 76890 82406 77636 75195 78038 82601 85898
$$ packed form
14880D1264o677M783N937n626N625j368j1p305L781P793n546j2535Q321P162J0925
14865E6523Q699j7189j5554l750l287Q138R657J0844J60L166O32m835O761N752
14851F5717m288m713O484j7722J926N149P4m963J636J08K663J0438n654j141L583
14836E9297m124l649j1541j816R632J659J4454L333J0068O988j0283j7033J5378
14823G2363Q799J725l073q336j4480p789J5526J5069j0943j4087j203N813O997
14810F6381J6385O663q630p440L928j054k6663K747J3102k725J919L936j395K116
14796F9270k408J0027O427K9999J9214K0471K0487j1425L718J8765L586j3296
14784A74835j5306j2502j6060j8357j2277p877j5566N516m770k441K843M563L297
$$ plain form
14771 85898 88766 71194 53752 55223 82305 80167 74510 76593 68927 68064 84646 76996 61007
14758 61007 66739 75092 86473 88168 77841 73331 76161 71135 64673 79546 73301 67084 79419
14745 79419 85313 88990 80026 65087 74907 75115 70109 66547 75113 86211 88336 87195 90556 85814
14731 85814 96481 93532 95114 86984 85611 93054 94847 89519 82581 86759 74819 74426 72613 86056
14717 86056 79284 64870 66176 82585 79892 92618 103744 100842 99097 99285 98561 104793 101135 87402
14703 87402 83962 82145 73423 66991 72453 75038 85883 90554 77827 50749 51797 67058 82153
14690 82153 84406 79076 83883 81965 77710 80834 85804 100325 97756 97075 99451 92963 93040 88134 82127
14675 82127 78572 72020 72580 79569 85562 88032 81374 92684 104897 104500 110385 110519 116331 112527 109991
$$ packed form
14771H5898K868j7572j7442J471K7082k138n657K083p666q63J6582p650j5989
14758F1007N732Q353J1381J695j0327m510K830n026o462J4873o245o217J2335
14745G9419N894L677q964j4939R820K08n006l562Q566J1098K125j141L361m742
14731H5814J0667k949J582q130j373P443J793n328o938M178j1940l93j813J3443
14717H6056o772j4414J306J6409k693J2726J1126k902j745J88p24O232l658j3733
14703H7402l440j817q722o432N462K585J0845M671j2727k7078J048J5261J5095
14690H2153K253n330M807j918m255L124M970J4521k569o81K376o488P7m906o007
14675H2127l555o552N60O989N993K470o658J1310J2213l97N885J34N812l804k536
$$ plain form
14660 109991 104871 90535 88657 91014 91456 99049 93171 97702 98150 91609 84382 95547 99686 97297
14646 97297 98843 94984 95533 108054 115495 111855 100965 106089 114568 118448 122873 126189 118410 117912
14632 117912 109840 90753 95162 114410 113554 105339 100230 100083 98893 95584 94420 95410 101492 111001
14618 111001 113798 113795 116747 117728 120215 126399 128265 125973 120689 121208 121193 123602 111382 107787 107600 111301
14602 111301 123011 127457 134412 129318 133746 143007 129483 114031 110889 130619 134961 139815 154834
14589 154834 166874 153503 142349 144363 144299 132408 124356 132708 153029 147820 137876 140899 141006 148901
14575 148901 155805 161438 158666 152059 148116 152492 140567 129744 129489 130798 140203 141546 154523 158925
14561 158925 168691 177484 166340 161038 155632 149881 150723 155818 160849 161238 156544 154794 153145 155893
$$ packed form
14660A09991n120j4336j878K357M42P593n878M531M48o541p227J1165M139k389
14646I7297J546l859N49J2521P441l640j0890N124Q479L880M425L316p779m98
14632A17912q072j9087M409J9248q56q215n109j47j190l309j164R90O082R509
14618A11001K797lK952R81K487O184J866k292n284N19j5K409j2220l595j87L701
14602A11301J1710M446O955n094M428R261j3524j5452l142J9730M342M854J5019
14589A54834J2040j3371j1154K014o4j1891q052Q352K0321n209r944L023J07P895
14575A48901O904N633k772o607l943M376j1925j0823k55J309R405J343J2977M402
14561A58925R766Q793j1144n302n406n751Q42N095N031L89m694j750j649K748
$$ plain form
14547 155893 158241 152054 150920 144586 134767 138912 140896 141351 147400 161295 160546 158875 170038 174692
14533 174692 174219 171072 160565 159527 168999 179601 172806 161836 150112 139378 134016 139771 152688
14520 152688 164162 180414 185860 194935 207067 203095 201086 198431 178925 157237 160657 149899 155465
14507 155465 182667 217213 224721 209674 202054 191982 178705 167694 182345 209631 217042 193847
14495 193847 206831 231551 228385 212617 206116 213652 221161 208105 199256 200172 200778 214147 221062
14482 221062 221894 220835 219746 224207 225080 213154 208439 215048 226445 237282 244331 247657 244496 252288
14468 252288 241014 238058 247253 251717 236145 226874 230372 241939 254574 259917 272731 280223 279042
14455 279042 278044 252871 249284 256653 267809 270579 268295 259919 248198 238988 245295 251827 262221
$$ packed form
14547A55893K348o187j134o334r819M145J984M55O049J3895p49j671J1163M654
14533A74692m73l147j0507j038R472J0602o795j0970j1724j0734n362N755J2917
14520A52688J1474J6252N446R075J2132l972k009k655j9506k1688L420j0758N566
14507A55465K7202L4546P508j5047p620j0072j3277j1011J4651K7286P411k3195
14495A93847J2984K4720l166j5768o501P536P509j3056q849R16O06J3369O915
14482B21062Q32j059j089M461Q73j1926m715O609J1397J0837P049L326l161P792
14468B52288j1274k956R195M464j5572r271L498J1567J2635N343J2814P492j181
14455B79042r98k5173l587P369J1156K770k284q376j1721r210O307O532J0394
$$ plain form
14442 262221 260102 252434 244005 250913 266855 279328 285505 285779 289603 290718 273750 270200 271266 284383
14428 284383 304722 309184 311783 315005 307968 310057 317293 308373 306999 305126 307462 310149 316321 330793
14414 330793 341728 332436 315313 314777 313468 309817 324732 320397 313959 322111 309915 313756 323646
14401 323646 316621 312523 319108 318995 322356 313848 322429 350596 375700 370401 359628 368032 375737 364878
14387 364878 350448 353694 370988 370662 365951 355916 358466 385783 402841 402983 400043 414790 420623
14374 420623 418488 425296 433144 431781 443259 457533 474739 490298 511069 538286 562896 615409
14362 615409 688579 766517 840354 928638 1011455 1047617 1048257 1017279 950199 873022 792740 729672
14350 729672 662531 629386 608537 591779 566898 545193 531158 529427 531995 529958 526009 520898
$$ packed form
14442B62221k119p668q429O908J5942J2473O177K74L824J115j6968l550J066J3117
14428B84383K0339M462K599L222p037K089P236q920j374j873K336K687O172J4472
14414C30793J0935r292j7123n36j309l651J4915m335o438Q152j2196L841R890
14401C23646p025m098O585j13L361q508Q581K8167K5104n299j0773Q404P705j0859
14387C64878j4430L246J7294l26m711j0035K550K7317J7058J42k940J4747N833
14374D20623k135O808P848j363J1478J4274J7206J5559K0771K7217K4610N2513
14362F15409P3170P7938P3837Q8284Q2817L6162O40l0978o7080p7177q0282o3068
14350G29672o7141l3145k0849j6758k4881k1705j4035j731K568k037l949n111
$$ plain form
14338 520898 510325 506228 493752 481666 487862 497237 509581 525138 525960 521706 526741 532243 521558
14325 521558 523555 540304 543418 537839 537876 545461 555830 568104 574335 573348 569871 575646 579605 575033
14311 575033 587551 605217 599640 592863 598586 599937 594518 584819 595615 614369 618226 626743 630980
14298 630980 637687 646757 655762 654411 659950 671816 674662 688613 696376 691153 695276 684351 685559
14285 685559 694698 700687 707742 708747 709624 716602 731042 740057 745783 748405 746457 755249 769195 788520
14271 788520 790053 803235 806416 798077 791520 792069 808087 821809 819058 809202 802396 814823 830660
14258 830660 841460 837562 850641 862131 858949 863722 869440 882752 891627 905469 904694 917080 931569
14245 931569 938533 918653 912750 920809 924333 939372 940081 937912 961611 972008 971547 969656 981225
$$ packed form
14338E20898j0573m097j2476j2086O196R375J2344J5557Q22m254N035N502j0685
14325E21558J997J6749L114n579L7P585J0369J2274O231r87l477N775L959m572
14311E75033J2518J7666n577o777N723J351n419r699J0796J8754L857Q517M237
14298F30980O707R070R005j351N539J1866K846J3951P763n223M123j0925J208
14285F85559R139N989P055J005Q77O978J4440R015N726K622j948Q792J3946J9325
14271G88520J533J3182L181q339o557N49J6018J3722k751r856o806J2427J5837
14258H30660J0800l898J3079J1490l182M773N718J3312Q875J3842p75J2386J4489
14245I31569O964j9880n903Q059L524J5039P09k169K3699J0397m61j891J1569
$$ plain form
14232 981225 994065 1001184 1016313 1010161 1015705 1004236 1019530 1038316 1037205 1044956 1075362 1087380
14220 1087380 1093865 1088952 1107476 1113063 1118332 1122408 1117459 1131616 1150678 1164428 1169690 1159351 1160462
14207 1160462 1163270 1179196 1192411 1199345 1201492 1198756 1207783 1238080 1249964 1252217 1255540 1260991 1266054
14194 1266054 1281626 1305554 1322055 1328845 1342404 1344710 1353148 1345786 1352054 1358291 1366030 1369819 1372311
14181 1372311 1379397 1395879 1403942 1423484 1438029 1433268 1440216 1441039 1459109 1464590 1477280 1508326 1521629
14168 1521629 1524069 1546925 1566085 1579095 1603320 1626072 1636267 1649998 1657137 1660302 1659037 1650793
14156 1650793 1633186 1632662 1641942 1635678 1642300 1665188 1679832 1698234 1713631 1736533 1750158 1755679
14144 1755679 1756182 1746737 1740530 1746223 1735836 1725674 1719241 1721016 1723005 1720733 1715140 1715926 1726678 1726615
$$ packed form
14232I81225J2840P119J5129o152N544j1469J5294J8786j111P751L0406J2018
14220A087380O485m913J8524N587N269M076m949J4157J9062J3750N262j0339J111
14207A160462K808J5926J3215O934K147k736R027L0297J1884K253L323N451N063
14194A266054J5572K3928J6501O790J3559K306Q438p362O268O237P739L789K492
14181A372311P086J6482Q063J9542J4545m761O948Q23J8070N481J2690L1046J3303
14168A521629K440K2856J9160J3010K4225K2752J0195J3731P139L165j265q244
14156A650793j7607n24R280o264O622K2888J4644J8402J5397K2902J3625N521
14144A755679N03r445o207N693j0387j0162o433J775J989k272n593P86J0752o3
$$ plain form
14130 1726615 1724057 1726406 1733791 1755036 1752606 1759075 1771820 1763854 1749415 1746663 1746746 1745343 1749510 1745875
14116 1745875 1738381 1733375 1742094 1742993 1745708 1744018 1745012 1739387 1728480 1729205 1750386 1765783 1770768 1765201
14102 1765201 1756088 1751417 1759987 1774832 1778975 1780036 1776946 1773117 1780976 1776208 1772119 1780842 1780904 1768057
14088 1768057 1767189 1762553 1755344 1752666 1747680 1741797 1743750 1739422 1751114 1763464 1766202 1763415 1751841
14075 1751841 1735965 1731209 1724155 1722992 1738626 1759224 1744793 1730048 1722993 1713999 1740498 1748500
14063 1748500 1722250 1706677 1701877 1679384 1667006 1670560 1654519 1645888 1639695 1629263 1612818 1609928
14051 1609928 1607418 1613033 1613265 1607280 1593507 1579205 1558533 1556126 1557837 1551688 1559522 1571426 1580123
14038 1580123 1590734 1601197 1604176 1606744 1601017 1579518 1561425 1547674 1538453 1524301 1514855 1516150
$$ packed form
14130A726615k558K349P385K1245k430O469J2745p966j4439k752Q3j403M167l635
14116A745875p494n006Q719Q99K715j690R94n625j0907P25K1181J5397M985n567
14102A765201r113m671Q570J4845M143J061l090l829P859m768m089Q723O2j2847
14088A768057q68m636p209k678m986n883J953m328J1692J2350K738k787j1574
14075A751841j5876m756p054j163J5634K0598j4431j4745p055q994K6499Q002
14063A748500k6250j5573m800k2493j2378L554j6041q631o193j0432j6445k890
14051A609928k510N615K32n985j3773j4302k0672k407J711o149P834J1904Q697
14038A580123J0611J0463K979K568n727k1499j8093j3751r221j4152r446J295
$$ plain form
14026 1516150 1509726 1504371 1489428 1483284 1467866 1454056 1445120 1443018 1440244 1444756 1451914 1443104 1425336
14013 1425336 1416939 1417318 1409918 1400030 1393295 1393631 1376083 1365897 1354241 1341639 1330417 1328591 1322057
14000 1322057 1310947 1305283 1302965 1295589 1284161 1271138 1263159 1268513 1271452 1251070 1240395 1236476 1229459
13987 1229459 1238409 1250545 1246986 1244629 1239848 1251630 1264510 1254970 1250349 1237459 1237065 1244640 1248441
13974 1248441 1235887 1214925 1215590 1229339 1223851 1221281 1213282 1200079 1209623 1212382 1203937 1201486 1209994
13961 1209994 1224373 1243442 1260711 1268984 1274613 1288906 1295373 1308567 1354124 1399937 1431311 1455932
13949 1455932 1477828 1512126 1529719 1546407 1573068 1615723 1664344 1713887 1764566 1803469 1861988
13938 1861988 1921772 1980157 2063018 2151393 2268345 2419246 2598523 2803281 3051507 3366900
$$ packed form
14026A516150o424n355j4943o144j5418j3810q936k102k774M512P158q810j7768
14013A425336q397L79p400r888o735L36j7548j0186j1656j2602j1222j826o534
14000A322057j1110n664k318p376j1428j3023p979N354K939k0382j0675l919p017
13987A229459Q950J2136l559k357m781J1782J2880r540m621j2890l94P575L801
13974A248441j2554k0962O65J3749n488k570p999j3203R544K759q445k451Q508
13961A209994J4379J9069J7269Q273N629J4293O467J3194M5557M5813L1374K4621
13949A455932K1896L4298J7593J6688K6661M2655M8621M9543N0679L8903N8519
13938A861988N9784N8385Q2861Q8375J16952J50901J79277K04758K48226L15393
$$ plain form
13928 3366900 3763869 4237642 4809765 5476444 6255634 7159364 8223667 9517691 11172154
13919 11172154 13423375 16688850 21584211 29013575 39949973 54615805 72094890 90396153
13911 90396153 106553302 118141887 122977101 119779449 109144391 93436548 76204303
13904 76204303 60250104 47081210 37151741 29991072 24789830 20880338 17829891 15409169
13896 15409169 13451992 11806682 10372772 9099635 7933099 6900950 6013800 5278300
13888 5278300 4668673 4161601 3738138 3380467 3073429 2813267 2609827 2431123 2251256
13879 2251256 2091252 1948133 1833629 1733526 1648250 1578934 1486126 1414319 1352495 1308192
13869 1308192 1268615 1227582 1196040 1181501 1158657 1128218 1099633 1070104 1045594 1020300 997942
$$ packed form
13928C366900L96969M73773N72123O66679P79190R03730J064303J294024J654463
13919A1172154K251221L265475M895361P429364J0936398J4665832J7479085J8301263
13911I0396153J6157149J1588585M835214l197652j0635058j5707843j7232245
13904G6204303j5954199j3168894r929469p160669n201242l909492l050447k420722
13896A5409169j957177j645310j433910j273137j166536j032149q87150p35500
13888E278300o09627n07072m23463l57671l07038k60162k03440j78704j79867
13879B251256j60004j43119j14504j00103q5276o9316r2808p1807o1824m4303
13869A308192l9577m1033l1542j4539k2844l0439k8585k9529k4510k5294k2358
$$ plain form
13858 997942 971295 963256 946027 926591 902295 893106 885108 867073 840937 821945 809511 789290
13846 789290 775538 757812 744360 734370 721865 700575 692732 676615 656255 653192 653982 655847 671005
13833 671005 685881 691720 675394 657998 648117 637871 623033 609215 597552 587655 585417 601294
13821 601294 595956 591540 588017 580354 558485 554070 544658 520470 517092 506780 515945 532408 524729
13808 524729 509866 503283 498955 483403 457874 461167 462497 454414 455453 467301 456193 443436 436966
13795 436966 454369 463735 471544 468664 472736 472501 479741 479901 474272 479614 487378 495028 499328 495745
13781 495745 495821 487772 483789 488748 484421 467326 448046 438555 445092 448926 432902 413144 408474 405249
13767 405249 398517 408325 408450 400006 385782 375706 359244 352359 351524 351619 343664 344900 333242 315793
$$ packed form
13858I97942k6647q039j7229j9436k4296r189p998j8035k6136j8992j2434k0221
13846G89290j3752j7726j3452r990j2505k1290p843j6117k0360l063P90J865J5158
13833F71005J4876N839j6326j7396r881j0246j4838j3818j1663r897k238J5877
13821F01294n338m416l523p663k1869m415r412k4188l378j0312R165J6463p679
13808E24729j4863o583m328j5552k5529L293J330q083J039J1848j1108j2757o470
13795D36966J7403R366P809k880M072k35P240J60n629N342P764P650M300l583
13781D95745P6q049l983M959m327j7095j9280r491O537L834j6024j9758m670l225
13767D05249o732R808J25q444j4224j0076j6462o885q35R5p955J236j1658j7449
$$ plain form
13753 315793 321992 320650 319418 312715 331453 329065 334573 349506 350346 345611 331781 316399 329346
13740 329346 347163 350568 356508 353051 349990 336171 330359 321314 319336 306585 305448 313253 304730
13727 304730 307559 304325 293596 290973 292102 295003 294848 305275 299588 288623 290135 290667 289923 289012
13713 289012 297323 302504 303174 296333 293536 297866 297943 299883 303176 298344 296475 294961 273039 253569
13699 253569 252459 249884 248733 255769 261757 270720 272286 287859 289327 274752 271360 265532 269522 275197
13685 275197 280281 272535 259554 265469 257200 240234 243320 243884 238126 246394 256508 247759 240360 254287
13671 254287 246123 239190 245648 239754 224799 236955 241833 234006 222363 211110 198724 196621 211714
13658 211714 218970 219728 225541 228865 221431 216830 211359 206197 210326 219558 221386 213905 209876 200367
$$ packed form
13753C15793O199j342j232o703J8738k388N508J4933Q40m735j3830j5382J2947
13740C29346J7817L405N940l457l061j3819n812r045j978j2751j137P805q523
13727C04730K829l234j0729k623J129K901j55J0427n687j0965J512N32p44r11
13713B89012Q311N181O70o841k797M330P7J940L293m832j869j514k1922j9470
13699B53569j110k575j151P036N988Q963J566J5573J468j4575l392n828L990N675
13685B75197N084p746j2981N915q269j6966L086N64n758Q268J0114q749p399J3927
13671B54287q164o933O458n894j4955J2156M878p827j1643j1253j2386k103J5093
13658B11714P256P58N813L324p434m601n471n162M129R232J828p481m029r509
$$ plain form
13644 200367 189969 194563 203335 202725 207740 213247 211841 218923 231479 215345 189805 184616 194403
13631 194403 200662 208523 205038 178957 165200 174390 179421 181949 182517 183530 189524 194876 183349 173503
13617 173503 177788 187283 180699 172282 183952 181518 186670 195431 201675 193123 179512 182076 182606 168016
13603 168016 148824 146368 151666 157424 159537 162579 173811 184246 206179 189112 165727 171678 184838
13590 184838 185527 186647 210615 232978 263558 284015 304364 325592 332839 322649 298188 276134
13578 276134 254365 224370 204789 207907 199593 181653 165196 169748 179785 172714 161209 171941
13566 171941 179468 168565 159858 145803 149986 165683 178640 170794 151421 158009 185010 211321
13554 211321 219483 222435 245660 280921 314385 354525 403315 436210 446091 444438 420983 386896
$$ packed form
13644B00367j0398M594Q772o10N015N507j406P082J2556j6134k5540n189R787
13631A94403O259P861l485k6081j3757R190N031K528N68J013N994N352j1527r846
13617A73503M285R495o584q417J1670k434N152Q761O244q552j3611K564N30j4590
13603A68016j9192k456N298N758K113L042J1232J0435K1933j7067k3385N951J3160
13590A84838O89J120K3968K2363L0580K0457K0349K1228P247j0190k4461k2054
13578B76134k1769k9995j9581L118q314j7940j6457M552J0037p071j1505J0732
13566A71941P527j0903q707j4055M183J5697J2957p846j9373O588K7001K6311
13554B11321Q162K952K3225L5261L3464M0140M8790L2895R881j653k3455l4087
$$ plain form
13542 386896 354047 313079 266443 242826 223557 202820 192826 186391 190864 191579 190321 187336 182609
13529 182609 187379 183245 176871 158436 166769 174253 161003 157341 154215 153663 151629 150908 150599 155296
13515 155296 172502 208774 241450 255072 274595 281608 291910 274765 247071 218303 208261 211722
13503 211722 198335 174826 171563 170901 150900 129072 123115 123258 135778 139153 134657 144136 146811
13490 146811 143011 132458 136236 136947 125756 113805 129606 148398 151880 140726 131632 143078 141223
13477 141223 126559 133446 136238 161255 165815 165047 171848 168336 155304 144894 143555 154392 172017
13464 172017 187120 209491 240014 294035 358695 439910 529516 605715 672985 716266 734717
13453 734717 708286 633318 549104 477060 411602 359312 311202 261995 245462 240159 204459 180563
$$ packed form
13542C86896l2849m0968m6636k3617j9269k0737r994o435M473P15j258k985m727
13529A82609M770m134o374j8435Q333P484j3250l662l126n52k034p21l09M697
13515A55296J7206L6272L2676J3622J9523P013J0302j7145k7694k8768j0042L461
13503B11722j3387k3509l263o62k0001k1828n957J43J2520L375m496R479K675
13490A46811l800j0553L778P11j1191j1951J5801J8792L482j1154r094J1446j855
13477A41223j4664O887K792K5017M560p68O801l512j3032j0410j339J0837J7625
13464A72017J5103K2371L0523N4021O4660Q1215Q9606P6199O7270M3281J8451
13453G34717k6431p4968q4214p2044o5458n2290m8110m9207j6533n303l5700k3896
$$ plain form
13441 180563 166693 154743 140115 137870 144975 147218 142965 130512 121921 124807 127199 137977 146840
13428 146840 143554 135725 115431 109158 108293 95311 83759 94351 89706 91672 100751 99529 93186
13415 93186 100328 109204 124249 117169 102003 97369 109149 107297 108332 114928 115848 105201 89729
13402 89729 90113 86050 82132 86256 94373 99282 94494 84204 81092 92467 115488 112005 103234 91695
13388 91695 94476 103384 108427 116808 117333 114839 106646 98104 97123 104210 108054 106514 99632 109820 115444
13373 115444 104325 89510 86528 97081 99704 102959 100842 91949 88327 92467 104233 105534 102928
13360 102928 100159 99059 96157 93457 89368 87420 88234 105328 121989 131785 133080 145262 146155 134138
13346 134138 137366 137264 118893 105991 89424 96320 108366 111999 101184 90635 91499 96679 98721
$$ packed form
13441A80563j3870j1950j4628k245P105K243m253j2453q591K886K392J0778Q863
13428A46840l286p829k0294o273q65j2982j1552J0592m645J966R079j222o343
13415I3186P142Q876J5045p080j5166m634J1780j852J035O596R20j0647j5472
13402H9729L84m063l918M124Q117M909m788j0290l112J1375K3021l483q771j1539
13388I1695K781Q908N043Q381N25k494q193q542r81P087L844j540o882J0188N624
13373A15444j1119j4815k982J0553K623L255k117q893l622M140J1766J301k606
13360A02928k769j100k902k700m089j948Q14J7094J6661R796J295J2182Q93j2017
13346A34138L228j02j8371j2902j6567O896J2046L633j0815j0549Q64N180K042
$$ plain form
13333 98721 103281 97762 100128 86650 80095 80906 91855 91301 83596 63828 62193 69386 82471 95354
13319 95354 107335 113300 108019 112522 106779 97185 90017 90671 98499 99352 95168 88166 76776 74889
13305 74889 73954 65859 73919 82953 72413 69907 80840 86392 80682 68155 61184 60459 66380 88658
13291 88658 96842 114957 119995 113687 99377 98897 88870 83900 75689 66416 81271 82366 69148
13278 69148 66561 76110 84164 80096 79578 69647 63543 60030 57232 70387 69846 74413 76737 73244 72513
13263 72513 83508 78818 79711 86769 101331 113075 119820 132432 141112 139158 146020 141961 140762 147630
13249 147630 150053 138975 128239 139545 144268 131699 135678 135985 137250 146844 136742 125092 111951
13236 111951 103609 94071 91553 105915 115812 94234 90558 103925 112239 115423 115637 127611 141234
$$ packed form
13333I8721M560n519K366j3478o555Q11J0949n54p705j9768j635P193J3085J2883
13319I5354J1981N965n281M503n743r594p168O54P828Q53m184p002j1390j887
13305G4889r35q095Q060R034j0540k506J0933N552n710j2527o971p25N921K2278
13291H8658Q184J8115N038o308j4310m80j0027m970q211r273J4855J095j3218
13278F9148k587R549Q054m068n18r931o104l513k798J3155n41M567K324l493p31
13263G2513J0995m690Q93P058J4562J1744O745J2612Q680j954O862m059j199O868
13249A47630K423j1078j0736J1306M723j2569L979L07J265R594j0102j1650j3141
13236A11951q342r538k518J4362R897k1578l676J3367Q314L184K14J1974J3623
$$ plain form
13223 141234 158343 153689 148889 154653 151709 149668 150794 141881 140236 137524 138079 140206 136865 136903 131758
13208 131758 132722 148938 152843 163665 170452 159211 161518 161478 167069 173886 169486 153945 142980 142009
13194 142009 136370 144374 140612 139712 140691 143902 160556 171767 178022 175624 183539 193078 198592 210230
13180 210230 207642 212015 216101 229280 240019 243489 251018 260023 260386 275008 290849 298673 292659
13167 292659 303622 323071 331685 342437 354033 365558 392995 414660 432236 454252 475409 509283
13155 509283 572795 652747 749702 839245 909521 990919 1097389 1219952 1364366 1540162 1756157
13144 1756157 2044686 2434270 2949384 3626702 4563506 5889327 7834004 10695239 14817569
13135 14817569 20436469 27103730 32910749 35545342 34042684 29240909 23365649 18282473
$$ packed form
13223A41234J7109m654m800N764k944k041J126q913j645k712N55K127l341L8n145
13208A31758R64J6216L905J0822O787j1241K307m0N591O817m400j5541j0965r71
13194A42009n639Q004l762r00R79L211J6654J1211O255k398P915R539N514J1638
13180B10230k588M373M086J3179J0739L470P529R005L63J4622J5841P824o014
13167B92659J0963J9449Q614J0752J1596J1525K7437K1665J7576K2016K1157L3874
13155E09283O3512P9952R6955Q9543P0276Q1398J06470J22563J44414J75796K15995
13144A756157K88529L89584N15114O77318R36804J325821J944677K861235M122330
13135A4817569N618900O667261N807019K634593j502658m801775n875260n083176
$$ plain form
13127 18282473 14537733 11859920 9858425 8313049 7102114 6155452 5429328 4881591
13119 4881591 4487360 4222843 4069548 3985204 3937255 3893857 3881395 3881445 3932424 4079107 4338041
13108 4338041 4749854 5354174 6194219 7352399 9016913 11472076 15120016 20579333 28466919
13099 28466919 38654938 49463743 58372762 63122179 62690128 57612130 49617955 40577009
13091 40577009 32080365 25186152 20087048 16378944 13607996 11451219 9750552 8427134
13083 8427134 7409428 6615510 5985348 5499742 5132875 4821652 4542166 4287509 4074313
13074 4074313 3917714 3839701 3886859 4048069 4331463 4769351 5428941 6389785 7820058 9965747
13064 9965747 13183237 17854225 24077035 30922922 36052397 37386518 34439074 28618765
$$ packed form
13127A8282473l744740k677813k001495j545376j210935r46662p26124n47737
13119D881591l94231k64517j53295q4344m7949m3398j2462N0N0979J46683K58934
13108D338041M11813O04320Q40045J158180J664514K455163L647940N459317P887586
13099B8466919J0188019J0808805Q909019M749417m32051n077998p994175r040946
13091D0577009q496644o894213n099104l708104k770948k156777j700667j323418
13083H427134j017706p93918o30162m85606l66867l11223k79486k54657k13196
13074D074313j56599p8013M7158J61210K83394M37888O59590R60844J430273K145689
13064I965747L217490M670988O222810O845887N129475J334121k947444n820309
$$ plain form
13056 28618765 22417799 17413218 13764371 11108927 9093336 7538990 6301592 5310152
13048 5310152 4516810 3890645 3390292 2995558 2683510 2403898 2155901 1932327 1723859
13039 1723859 1521956 1345460 1220038 1100845 1000221 917246 846327 786381 717818 659938
13029 659938 625877 584413 552258 518225 476009 428954 389982 373531 386577 376400 362244
13018 362244 368943 365779 358536 365132 366570 368564 379110 378065 351096 335712 326280 320419 323632
13005 323632 307420 302360 306741 292249 276699 264725 246539 236079 220987 217850 219477 219485 215863
12992 215863 211692 209853 209105 211163 219542 202360 187599 179973 176495 174740 151379 139423 158068
12979 158068 178411 175770 165796 172534 174212 181557 193225 195617 199057 206380 196523 190096 181105 182801
$$ packed form
13056B8618765o200966n004581l648847k655444k015591j554346j237398r91440
13048E310152p93342o26165n00353l94734l12048k79612k47997k23574k08468
13039A723859k01903j76496j25422j19193j00624q2975p0919n9946o8563n7880
13029F59938l4061m1464l2155l4033m2216m7055l8972j6451J3046j0177j4156
13018C62244O699l164p243O596J438J994J0546j045k6969j5384r432n861L213
13005C23632j6212n060M381j4492j5550j1974j8186j0460j5092l137J627Ql622
12992B15863m171j839p48K058Q379j7182j4761p626l478j755k3361j1956J8645
12979A58068K0343k641r974O738J678P345J1668K392L440P323r857o427q991J696
$$ plain form
12965 182801 174566 166798 166654 166851 162225 163218 172207 174567 170157 156003 133673 132887 149158 155240
12951 155240 143471 132128 122593 128484 123513 136498 146623 154173 157373 142411 129198 124014 116799
12938 116799 126337 130279 133761 144571 146177 146990 148761 142310 138230 135160 145683 153765 148225 136087
12924 136087 130929 114415 112793 112717 104123 97020 89134 90759 83191 73029 66061 68512 74241 87096
12910 87096 85199 85221 90978 75080 69437 68993 66996 68337 72710 84306 70128 56332 63383 65128
12896 65128 61689 68893 73707 84339 88300 90739 82643 80991 74588 68441 72658 70618 79373 73142
12882 73142 62668 55259 61695 61819 59489 42644 43277 44524 37420 41834 51321 56369 58062 59557
12868 59557 63676 54045 44091 49928 65431 74279 72410 79561 79539 77162 73819 64430 45181 51325
$$ packed form
12965A82801q235p768j44J97m626R93Q989K360m410j4154k2330p86J6271O082
12951A55240j1769j1343r535N891m971J2985J0125P550L200j4962j3213n184p215
12938A16799R538L942L482J0810J606Q13J771o451m080l070J0523Q082n540j2138
12924A36087n158j6514j622p6q594p103p886J625p568j0162o968K451N729J2855
12910H7096j897K2N757j5898n643m44j997J341M373J1596j4178j3796P051J745
12896F5128l439P204M814J0632L961K439q096j652o403o147M217k040Q755o231
12882G3142j0474p409O436J24k330j6845O33J247p104M414R487N048J693J495
12868E9557M119r631r954N837J5503Q848j869P151k2k377l343r389j9249O144
$$ plain form
12854 51325 47883 46115 51779 56490 50245 39674 48124 49259 51790 59968 53283 41714 62543 72709
12840 72709 71851 76590 81457 66656 65785 71570 55720 53074 59906 69099 67575 64726 50915 44561
12826 44561 49315 49351 51118 35564 39331 42370 50986 60193 71105 61659 59350 58254 49941 48512
12812 48512 56121 50457 37689 21179 28161 44201 56518 55026 48637 52565 59690 53174 55191
12799 55191 67835 69269 65440 70886 62252 51185 49553 49921 56832 55988 52246 39591 34651 53826
12785 53826 61081 63962 71168 66617 48969 25950 11734 3208 7249 22372 33007 39728 48952
12772 48952 37627 30922 24988 16970 12919 27102 30690 25119 24317 37980 35480 26057 24369 22692
12758 22692 29828 35113 46226 46773 49994 50138 38268 46524 61447 61089 57452 36301 32540 37792
$$ packed form
12854E1325l442j768N664M711o245j0571Q450J135K531Q178o685j1569K0829J0166
12840G2709q58M739M867j4801q71N785j5850k646O832R193j524k849j3811o354
12826D4561M754L6J767j5554L767L039Q616R207J0912r446k309j096q313j429
12812D8512P609n664j2768j6510O982J6040J2317j492o389L928P125o516K017
12799E5191J2644J434l829N446q634j1067j632L68O911q44l742j2655m940J9175
12785E3826P255K881P206m551j7648k3019j4216q526M041J5123J0635O721R224
12772D8952j1325o705n934q018m051J4183L588n571q02J3663k500r423j688j677
12758B2692P136N285J1113N47L221J44j1870Q256J4923l58l637k1151l761N252
$$ plain form
12744 37792 34526 40690 46357 46756 40470 34188 23355 15993 33824 40653 36098 35914 34843 30183
12730 30183 18526 17842 23880 16584 -5098 -2692 13676 16785 11592 8006 19164 31400 29703
12717 29703 30441 31688 19312 17632 27930 28467 29059 29585 26450 35689 43447 41341 34560 39660 32963
12702 32963 18499 13701 9364 18432 35325 42447 49180 38416 22621 16269 13371 13272 20799 33668
12688 33668 30984 28166 25723 28191 32549 42137 42364 66157 79207 95670 98126 114243 148624
12675 148624 179920 194882 182061 161723 145596 133526 118762 98986 80354 62213 65942 60210
12663 60210 53899 46831 55388 67311 77853 66898 65105 57214 48985 46856 54464 45482 42293 47515
12649 47515 51748 60663 73224 88308 105418 117437 139597 165039 213183 254991 289375 312123
$$ packed form
12744C7792l266O164N667L99o286o282j0833p362J7831O829m555j84j071m660
12730C0183j1657o84O038p296k1682K406J6368L109n193l586J1158J2236j697
12717B9703P38J247j2376j680J0298N37N92N26l135R239P758k106o781N100o697
12702C2963j4464m798m337R068J6893P122O733j0764j5795o352k898r9P527J2869
12688C3668k684k818k443K468M358R588K27K3793J3050J6463K456J6117L4381
12675A48624L1296J4962j2821k0338j6127j2070j4764j9776j8632j8141L729n732
12663F0210o311p068Q557J1923J0542j0955j793p891q229k129P608q982l189N222
12649D7515M233Q915J2561J5084J7110J2019K2160K5442M8144M1808L4384K2748
$$ plain form
12637 312123 307623 288519 268069 250437 207044 160200 126279 105876 97298 88970 93129 82128
12625 82128 60536 47533 35246 34517 37697 33552 38348 47063 45156 49508 47649 43182 54309 57857
12611 57857 63076 65912 79079 84185 101617 120724 130734 146938 162407 196079 213420 194088
12599 194088 166893 138027 121474 105407 94046 77356 64656 54415 55860 41540 27841 38815
12587 38815 31134 26186 38374 40691 37041 34257 33420 27044 25299 27664 25881 16635 17428 12278 6749
12572 6749 2122 17260 20869 33353 28298 20852 12945 12014 21760 8692 4234 26784 29212 22902
12558 22902 14637 14536 28898 27066 30659 27717 14679 1696 2594 24285 18424 15957 10217 16701
12544 16701 23227 20712 15185 16272 10907 1338 -2030 14810 26792 19599 -4813 -17696 -1273
$$ packed form
12637C12123m500j9104k0450j7632m3393m6844l3921k0403q578q328M159j1001
12625H2128k1592j3003j2287p29L180m145M796Q715j907M352j859m467J1127L548
12611E7857N219K836J3167N106J7432J9107J0010J6204J5469L3672J7341j9332
12599A94088k7195k8866j6553j6067j1361j6690j2700j0241J445j4320j3699J0974
12587C8815p681m948J2188K317l650k784q37o376j745K365j783r246P93n150n529
12572F749m627J5138L609J2484n055p446p907r31R746j3068m458K2550K428o310
12558B2902q265j01J4362j832L593k942j3038j2983Q98K1691n861k467n740O484
12544A6701O526k515n527J087n365r569l368J6840J1982p193k4412j2883J6423
$$ plain form
12531 -1273 6694 5222 17586 27194 27505 26942 26874 16948 7373 5562 8740 11817 7268 4469 3325
12516 3325 9880 10729 16352 12647 7651 3833 16685 32920 26895 20603 19934 14370 23909 33497 31210
12501 31210 28673 17665 17954 20053 17876 22038 28832 30048 26537 31926 26506 17478 22739 18000
12487 18000 16191 17401 9589 11591 15522 13900 6791 -1483 -889 1871 18769 22742 8365 1670
12473 1670 4240 8174 18072 9885 5252 18339 16185 18699 11179 11360 8319 1493 -4173 8353
12459 8353 13217 15011 16905 16583 -2117 -6510 15836 24701 34479 23411 24564 17282 17164 -356
12445 -356 -1931 12540 26503 28558 16607 15612 19897 14121 12640 13137 21187 20596 12974 4472 3187
12430 3187 3551 7024 8593 1034 1780 13647 11963 6877 -917 11476 11806 11663 3687 -6981 -1221
$$ packed form
12531a273P967j472J2364R608L11n63o8r926r575j811L178L077m549k799j144
12516C325O555Q49N623l705m996l818J2852J6235o025o292o69n564R539R588k287
12501C1210k537j1008K89K099k177M162O794J216l511N389n420r028N261m739
12487A8000j809J210p812K002L931j622p109q274N94K760J6898L973j4377o695
12473A670K570L934R898q187m633J3087k154K514p520J81l041o826n666J2526
12459H353M864J794J894l22j8700m393K2346Q865R778j1068J153p282j18j7520
12445c56j575J4471J3963K055j1951r95M285n776j481M97Q050n91p622q502j285
12430C187L64L473J569p559P46J1867j684n086p794J2393L30j43p976j0668N760
$$ plain form
12415 -1221 11581 14187 11608 17951 24498 34386 36365 43810 39587 27379 26346 37549 34991 41951
12401 41951 41833 34854 33271 31791 39751 37592 22519 20813 11970 4840 -1840 7373 16273 15332 27059
12386 27059 25861 13118 15901 31632 48401 43115 36883 40158 28200 30850 35421 33262 32575 22393
12372 22393 24430 34671 31748 34927 36755 34732 30283 20268 13509 17991 9312 7975 12029 14877
12358 14877 5741 6884 6791 5769 14571 16846 18909 9509 -872 -14193 -21319 -8062 2177 5710
12344 5710 13009 8596 6265 15989 32944 37939 30346 37310 42758 24773 9829 11576 16269 20701
12330 20701 24086 20805 17257 13204 5398 -10591 -7666 1137 6830 3134 8110 -4993 -16341 -14746
12316 -14746 -10004 1123 2560 -269 9076 12224 20877 16347 1931 4375 4238 5269 7584 3944
$$ packed form
12415a221J2802K606k579O343O547R888J979P445m223j2208j033J1203k558O960
12401D1951j18o979j583j480P960k159j5073j706q843p130o680R213Q900r41J1727
12386B7059j198j2743K783J5731J6769n286o232L275j1958K650M571k159o87j0182
12372B2393K037J0241k923L179J828k023m449j0015o759M482q679j337M054K848
12358A4877r136J143r3j022Q802K275K063r400j0381j3321p126J3257J0239L533
12344E710P299m413k331R724J6955M995p593O964N448j7985j4944J747M693M432
12330B0701L385l281l548m053p806j5989K925Q803N693l696M976j3103j1348J595
12316a4746M742J1127J437k829R345L148Q653m530j4416K444j37J031K315l640
$$ plain form
12302 3944 -1603 1101 21 6063 16761 25861 21986 10534 -15880 -7128 -6955 -6887 6953 17345
12288 17345 25991 33528 22834 24095 34145 37853 38103 23303 10257 17719 16251 5250 -5236
12275 -5236 7765 12972 4232 561 -12172 -6954 15392 16425 8133 -4271 -11973 -6144 7777
12262 7777 19419 24927 19548 11040 8574 15122 28010 17584 21551 19852 15760 204 -6417 -5739
12248 -5739 -24649 -29103 -33147 -23644 -16144 -18838 -1000 12592 3388 4450 14036 2428 3778 6271
12234 6271 7946 12089 12126 2301 -7189 -7563 6113 11933 16488 22816 23163 22649 35560 28032 24469
12219 24469 26919 14605 3223 13966 16628 1751 6069 9295 18763 22169 21309 13042 7152 369
12205 369 3526 14595 12052 1206 -8421 -13011 -13501 -8386 -535 -10771 -9214 1839 13679 15130
$$ packed form
12302C944n547K704j080O042J0698R100l875j1452k6414Q752J73O8J3840J0392
12288A7345Q646P537j0694J261J0050L708K50j4800j3046P462j468j1001j0486
12275e236J3001N207q740l671j2733N218K2346J033q292j2404p702N829J3921
12262G777J1642N508n379q508k466O548J2888j0426L967j699m092j5556o621O78
12248e739j8910m454m044R503P500k694J7838J3592r204J062R586j1608J350K493
12234F271J675M143L7r825r490l74J3676N820M555O328L47n14J2911p528l563
12219B4469K450j2314j1382J0743K662j4877M318L226R468L406q60q267n890o783
12205C69L157J1069k543j0846r627m590m90N115P851j0236J557J1053J1840J451
$$ plain form
12191 15130 20000 17391 7275 -3137 -13830 -4120 14596 19383 28041 23507 30961 39129 30738
12178 30738 13205 12827 13086 19985 15222 300 -5030 -13461 -17535 -14743 -8786 5729 1634 2509
12164 2509 -1598 -4717 -3293 6334 6311 1977 -358 -365 12850 4590 11656 17888 12120 19493 25117 12981
12148 12981 2109 -11332 -16047 -5388 18472 23182 15835 10354 -196 7280 7868 9327 23125
12135 23125 16092 4529 9345 1221 -8132 -15932 -16757 -10568 234 3097 1088 -5000 4254 -60
12121 -60 -7830 -11415 -9285 -4712 -8059 -11849 -2567 5324 78 -2216 9069 14302 23586 32678 27709
12106 27709 32093 13552 17084 17763 4651 -5862 1614 6454 -3102 -4712 -18272 -14765 -5161 -1682
12092 -1682 9182 6210 -4833 -634 17430 21894 19255 6159 17391 27416 26411 18942 20227
$$ packed form
12191A5130M870k609j0116j0412j0693R710J8716M787Q658m534P454Q168q391
12178C0738j7533l78K59O899m763j4922n330q431m074K792N957J4515m095Q75
12164B509m107l119J424R627k3m334k335pJ3215q260P066O232n768P373N624j2136
12148A2981j0872j3441m715J0659K3860M710p347n481j0550P476N88J459J3798
12135B3125p033j1563M816q124r353p800q25O189J0802K863k009o088R254m314
12121f0p770l585K130M573l347l790R282P891n246k294J1285N233R284R092m969
12106B7709M384j8541L532O79j3112j0513P476M840r556j610j3560L507R604L479
12092a682J0864k972j1043M199J8064M464k639j3096J1232J0025j005p469J285
$$ plain form
12079 20227 22573 18280 17297 22041 14604 239 -296 7184 11707 5763 21838 23165 11713 10907
12065 10907 14807 19449 10837 13523 11529 2003 -5504 -2206 10725 10998 7539 -2270 -7183 -3482
12051 -3482 -5512 -14508 -16306 -8713 -10090 -7664 -8134 -5857 2373 9800 1966 -1584 -661 -13295 5904
12036 5904 13961 3263 9874 18470 7141 8431 10609 461 -12832 -2501 2213 9888 13177
12023 13177 21127 28469 29287 18338 -4263 -16016 -19232 -15060 2607 -3609 -7395 -20998 -19933
12010 -19933 -15703 -9085 2547 1231 -7651 -7024 -2064 7777 -1748 -5794 0 -3401 -1540 6967
11996 6967 16246 9874 -2715 -7378 -14082 -16076 -21575 -4271 9524 22659 22094 14979 7247 -3077
11982 -3077 -8470 -10326 -2893 -2604 5750 9346 3503 7021 10749 -91 -4951 -8681 1884 10171
$$ packed form
12079B0227K346m293r83M744p437j4365n35P480M523n944J6075J327j1452q06
12065A0907L900M642q612K686j994r526p507L298J2931K73l459r809m913L701
12051c482k030q996j798P593j377K426m70K277Q230P427p834l550R23j2634J9199
12036E904Q057j0698O611Q596j1329J290K178j0148j3293J0331M714P675L289
12023A3177P950P342Q18j0949k2601j1753l216M172J7667o216l786j3603J065
12010a9933M230O618J1632j316q882O27M960R841r525m046N794l401J861Q507
11996F967R279o372j2589m663o704j994n499J7304J3795J3135n65p115p732j0324
11982c077n393j856P433K89Q354L596n843L518L728j0840m860l730J0565Q287
$$ plain form
11968 10171 4228 1493 5722 288 3935 8803 13640 22922 23352 7913 -3490 -2682 12355 15241
11954 15241 10599 10983 16328 8981 9595 24016 24651 14668 10366 -3893 -2521 7081 6420 14231 29194
11939 29194 28708 9762 5811 19145 31094 18743 7147 8020 1839 664 -3488 -4076 307 -1347
11925 -1347 10618 11307 1632 -749 6913 13785 7415 3736 -2034 -2942 330 6175 9427 6238 1533
11910 1533 -6125 -5098 -2538 4566 78 2193 1991 6004 3529 5747 8327 4151 20151 18698 16685
11895 16685 14893 4022 4230 3786 -1101 1105 -643 8158 8998 -6030 -26113 -25610 -12362 4663
11881 4663 9450 9990 4652 -4109 -17675 -14832 -12735 -13165 -614 2551 2587 1046 -6862 -6974 -3736
11866 -3736 -4298 -4053 -12645 -10473 -6520 -8034 -14938 -6076 3613 -1443 -2755 -8507 10688 6313 3803
$$ packed form
11968A0171n943k735M229n434L647M868M837R282M30j5439j1403Q08J5037K886
11954A5241m642L84N345p347O14J4421O35r983m302j4259J372R602o61P811J4963
11939B9194m86j8946l951J3334J1949j2351j1596Q73o181j175m152n88M383j654
11925a347J1965O89r675k381P662O872o370l679n770r08L272N845L252l189m705
11910A533p658J027K560P104m488K115k02M013k475K218K580m176J6000j453k013
11895A6685j792j0871K08m44m887K206j748Q801Q40j5028k0083N03J3248J7025
11881D663M787N40n338q761j3566K843K097m30J2551L165L6j541p908j12L238
11866c736n62K45q592K172L953j514o904Q862R689n056j312n752J9195m375k510
$$ plain form
11851 3803 10197 7771 7903 14131 19303 12735 2869 -1996 -4329 214 8026 265 8996 3462 -4152
11836 -4152 -13402 -24802 -29154 -29229 -15276 -14762 -6654 -6677 -942 1748 2334 -5041 -159 -5267 -3064 7153
11820 7153 6813 13565 6774 -8284 -22021 -29063 -30067 -15137 -9526 -16228 -17526 -13230 -6452 -11329
11806 -11329 -13159 -8398 -11351 -12612 -21266 -31762 -36108 -28786 -17491 -14972 -20782 -18892 -16758 -20474
11792 -20474 -25973 -24716 -19090 -10743 -11672 -7909 13347 13469 334 -19281 -22094 -10390 -10156 -527
11778 -527 -3146 953 8666 -7546 -14348 -10611 -12948 -21122 -9898 -5547 5511 15145 4210 -1408
11764 -1408 -12 -11816 -23635 -25985 -18565 -4582 5681 7742 6768 4975 257 -8383 -8262 -5545
11750 -5545 -7929 -10086 318 -6095 -5659 -8280 -13126 -2021 1455 -1792 -3989 388 -9852 -18229
$$ packed form
11851C803O394k426J32O228N172o568r866m865k333M543P812p761Q731n534p614
11836d152r250j1400m352p5J3953N14Q108k3N735K690N86p375M882n108K203J0217
11820G153l40O752o791j5058j3737p042j004J4930N611o702j298M296O778m877
11806a1329j830M761k953j261q654j0496m346P322J1295K519n810J890K134l716
11792b0474n499J257N626Q347r29L763K1256J22j3135j9615k813J1704K34R629
11778e27k619M099P713j6212o802L737k337q174J1224M351J1058R634j0935n618
11764a408J396j1804j1819k350P420J3983J0263K061r74j793m718q640J21K717
11750e545k384k157J0404o413M36k621m846J1105L476l247k197M377j0240q377
$$ plain form
11736 -18229 -8276 -1905 187 9912 8045 8830 6165 2284 -10543 -6628 1844 2537 -5203 -2884 1033
11721 1033 896 140 9374 24340 36864 32516 15883 6113 -68 8511 3458 -9767 -11273 -7945
11707 -7945 -9771 -2854 -8920 -15922 -8834 -16756 -21873 -4950 6098 -6749 -13098 -2740 -3824 544
11693 544 -9595 -13955 1158 9615 2063 -9371 -10578 -19484 -21669 -6780 -15008 -2421 5061 -1759
11679 -1759 -802 366 -3717 -12531 -6386 -4970 -18869 -29758 -26087 -14965 -17868 -13126 5347 11876
11665 11876 13430 17929 5562 -1488 943 -2039 -7241 2483 9939 -3016 -6550 -7548 -5188 -7438
11651 -7438 -24509 -22618 -14252 954 2829 -3549 -13960 -3965 -9499 -6010 7261 10143 2089 -759
11637 -759 10803 17340 8934 5192 2374 1499 2731 13567 10385 4911 3093 -3878 -2265 -4662 -16152
$$ packed form
11736a8229R953O371K092R725j867P85k665l881j2827L915Q472O93p740K319L917
11721A033j37p56R234J4966J2524m348j6633r770o181Q579n053j3225j506L328
11707g945j826O917o066p002P088p922n117J6923J1048j2847o349J0358j084M368
11693E44j0139m360J5113Q457p552j1434j207q906k185J4889q228J2587P482o820
11679a759R57J168m083q814O145J416j3899j0889L671J1122k903M742J8473O529
11665A1876J554M499j2367p050K431k982n202R724P456j2955l534r98K360k250
11651g438j7071J891Q366J5206J875o378j0411R995n534L489J3271K882q054k848
11637g59J1562O537q406l742k818q75J232J0836l182n474j818o971J613k397j1490
$$ plain form
11622 -16152 -9778 -14037 -7850 2963 1214 -9227 -13163 -14172 -16582 -14709 -5429 -2742 579 17165
11608 17165 13735 5171 4799 -7316 -3245 11505 17789 15018 19897 27778 12462 -3932 -6255 -2344
11594 -2344 1366 2261 -7760 -15897 -11114 -11400 -10652 1650 2056 -9172 -21384 -24391 -20317 -14905 -4481
11579 -4481 -8188 -10378 -9399 -8496 -14345 -15918 -14387 -3469 3387 -1330 5487 5422 -13903 -18427 -13217
11564 -13217 -5515 -12140 -23837 -15908 -4828 -3473 2719 -5864 -10817 14652 22222 24642 12955
11551 12955 2859 4533 4913 -4310 -3065 -2476 -16118 -24415 -12212 -3261 -6145 -8226 -21718 -30429
11537 -30429 -25826 -17982 -2706 8207 1738 -2514 -22382 -39707 -31731 -10187 -9245 -11521 -7548
11524 -7548 1532 5132 9348 13670 7478 -5050 -9604 -5088 -6374 -6685 -12866 -16830 -20390 -10977 7284
$$ packed form
11622a6152O374m259O187J0813j749j0441l936j009k410J873R280K687L321J6586
11608A7165l430q564l72j2115M071J4750O284k771M879P881j5316j6394k323L911
11594b344L710Q95j0021q137M783k86P48J2302M06j1228j2212l007M074N412J0424
11579d481l707k190R79R03n849j573J531J0918O856m717O817o5j9325m524N210
11564a3217P702o625j1697P929J1080J355O192q583m953K5469P570K420j1687
11551A2955j0096J674L80r223J245N89j3642q297J2203Q951k884k081j3492q711
11537c0429M603P844J5276J0913o469m252j9868j7325P976K1544R42k276L973
11524g548R080L600M216M322o192j2528m554M516j286l11o181l964l560R413J8261
$$ plain form
11509 7284 6160 -2296 -9070 -5453 -2970 -7733 -11437 -10287 -72 9188 7795 18612 24410 12457
11495 12457 18636 29643 22038 4912 -5785 2138 5782 2503 5525 4627 2091 3047 -141 -25617
11481 -25617 -40565 -25404 -9868 1350 -5440 -6968 -13644 -8764 4039 3858 3716 3434 -14825 -20873
11467 -20873 -13935 -13288 -8670 -6108 1106 5293 2268 5642 2533 -8865 -14430 -18344 -16673 -21664
11453 -21664 -13209 -15403 -13289 -11947 -7306 -10583 -13884 -7821 -14665 -22433 -25023 -15454 -26867 -20149
11439 -20149 -1761 9574 23289 15161 2973 -7935 -8435 -4629 -2625 7558 4399 -727 2560
11426 2560 11922 10357 10966 -4138 -10260 -2943 16302 14689 12890 4460 385 -3476 -5610 -10537
11412 -10537 -19800 -26506 -20502 -3403 2272 -12018 -21837 -28678 -29195 -24733 -22736 -14812 -14561 -16887
$$ packed form
11509G284j124q456o774L617K483m763l704J150J0215R260j393J0817N798j1953
11495A2457O179J1007p605j7126j0697P923L644l279L022q98k536R56l188k5476
11481b5617j4948J5161J5536J1218o790j528o676M880J2803j81j42k82j8259o048
11467b0873O938O47M618K562P214M187l025L374l109j1398n565l914J671m991
11453b1664Q455k194K114J342M641l277l301O063o844p768k590R569j1413O718
11439b0149J8388J1335J3715q128j2188j0908n00L806K004J0183l159n126L287
11426B560R362j565O09j5104o122P317J9245j613j799q430m075l861k134m927
11412a0537r263o706O004J7099N675j4290r819o841n17M462J997P924K51k326
$$ plain form
11398 -16887 -27591 -33121 -30006 -24654 -12285 2676 12203 5679 -5915 -15480 -16869 -15352 -13097
11385 -13097 -10537 -7655 -12843 -22810 -28483 -38284 -30647 -16194 -21028 -25481 -22309 -11853 -10750 -11383
11371 -11383 -14841 -17052 -16887 -7645 -7084 -9509 -8216 -6690 -20700 -17464 -10398 -14258 -15895 -12542 -14587
11356 -14587 -9437 -4415 2267 -7507 -16799 -11797 -11196 -13390 -11432 -5507 -1559 1393 13769 2985
11342 2985 9459 1009 -12921 -1328 13455 14685 12785 8652 -2601 2579 16348 18182 18455 21053
11328 21053 17594 31204 41775 20560 -5398 -6495 -7310 -16920 -14735 -14927 -26620 -22843 -19779 -20397
11314 -20397 -20160 -17166 -17449 -11758 -8235 -19701 -20180 -5812 14065 14419 23993 6187 5874 12890 17346
11299 17346 8638 -2222 -6047 -5573 -5581 -12505 -5149 106 -19775 -21393 -19892 -16852 -18279 -32804 -23964
$$ packed form
11398a6887j0704n530L115N352J2369J4961R527o524j1594r565j389J517K255
11385a3097K560K882n188r967n673r801P637J4453m834m453L172J0456J103o33
11371a1383l458k211J65R242N61k425J293J526j4010L236P066l860j637L353k045
11356a4587N150N022O682r774r292N002O01k194J958N925L948K952J2376j0784
11342B985O474q450j3930J1593J4783J230j900m133j1253N180J3769J834K73K598
11328B1053l459J3610J0571k1215k5958j097q15r610K185j92j1693L777L064o18
11314b0397K37K994k83N691L523j1466m79J4368J9877L54R574j7806l13P016M456
11299A7346q708j0860l825M74qo924P356N255j9881j618J501L040j427j4525Q840
$$ plain form
11284 -23964 4515 13746 17200 16600 6662 -5094 -16335 -13907 -3297 4612 3651 -12243 -20169 -7983
11270 -7983 2719 267 -9390 -25430 -22075 -13996 -5493 -10428 -27164 -21687 -10802 6377 11181
11257 11181 19113 6498 12152 11437 7313 14717 21471 5011 3424 8740 20336 19524 -694 -9906
11243 -9906 -13143 3369 5933 881 4146 4997 -9178 -5215 8019 9245 -88 -12012 -6619 -5755
11229 -5755 -54 -3184 -9524 -2567 8261 14885 18012 17596 4910 -2405 -1853 2847 7781 9009 6350
11214 6350 -136 -9827 -16407 -8449 -2743 -3380 -5751 -9072 1000 8140 2182 2327 -373 -2126 1971
11199 1971 -750 -1045 -9074 -17866 -3499 -164 501 -6651 -9544 -1008 4149 -8984 -19727 -11815
11185 -11815 -14692 -25165 -25604 -6535 -7911 -16782 -24851 -24500 -17902 -23629 -20701 -11595 -10075 -7268
$$ packed form
11284b3964K8479R231L454o00r938j1756j1241K428J0610P909r61j5894p926J2186
11270g983J0702k452r657j6040L355Q079Q503m935j6736N477J0885J7179M804
11257A1181P932j2615N654p15m124P404O754j6460j587N316J1596q12k0218r212
11243i906l237J6512K564n052L265Q51j4175L963J3234J226r333j1924N393Q64
11229e755N701l130o340O957J0828O624L127m16j2686p315N52M700M934J228k659
11214F350o486r691o580P958N706o37k371l321J0072P140n958J45k700j753M097
11199A971k721k95q029q792J4367L335O65p152k893Q536N157j3133j0743P912
11185a1815k877j0473m39J9069j376q871q069L51O598n727K928R106J520K807
$$ plain form
11171 -7268 -1549 12080 5734 8144 3011 -991 3418 3908 -3743 -1560 -3170 -6910 1394 13695
11157 13695 16523 11629 6363 -11092 -7528 1074 12695 6146 -5407 -9920 -5956 -395 3132 6283
11143 6283 12347 150 -9918 -9183 -13279 -20325 -7725 3779 -2551 -14907 -26711 -37431 -30946
11130 -30946 -35690 -42187 -39263 -31936 -21505 -5821 -19152 -18297 -13938 -359 7248 15626 7703 14522
11116 14522 17312 22394 10541 -416 -3621 1529 -13474 -25488 -30690 -17209 -9955 -10459 -11944
11103 -11944 -16925 -19776 -39594 -30505 -28565 -26005 -15389 -8619 -3759 -2691 -1375 -9786 -12969 -16275
11089 -16275 -15163 -342 2719 1866 -7702 -11574 -18376 -15156 4973 -6268 -3378 1148 -8395 -6116
11075 -6116 -6208 -7611 -8 1161 -1213 -5856 -10363 -991 11859 4097 -15062 -16281 -1231 -4448
$$ packed form
11171g268N719J3629o346K410n133m002M409M90p651K183j610l740Q304J2301
11157A3695K828m894n266j7455L564Q602J1621o549j1553m513L964N561L527L151
11143F283O064j2197j0068P35m096p046J2600J1504o330j2356j1804j0720O485
11130c0946m744o497K924P327J0431J5684j3331Q55M359J3579P607Q378p923O819
11116A4522K790N082j1853j0957l205N150j5003j2014n202J3481P254n04j485
11103a1944m981k851j9818R089J940K560J0616O770M860J068J316q411l183l306
11089a6275J112J4821L061q53r568l872o802L220K0129j1241K890M526r543K279
11075f116r2j403P603J169k374m643m507R372J2850p762j9159j219J5050l217
$$ plain form
11061 -4448 -23605 -23399 -17872 -19358 -12739 -7419 -16026 -25769 -18796 -19367 -17210 -10841 -6198 -4609 740
11046 740 -1070 -11059 -16165 -34242 -30832 -19089 -14005 812 3164 -1096 -8869 -3914 -4129 -8059
11032 -8059 -6154 -1476 16451 43778 58903 89529 118917 138171 152446 162617 164435 143827
11020 143827 120027 100023 67924 42720 13075 -6138 407 18555 19372 8307 6056 14831
11008 14831 17227 28484 32754 35710 28683 12906 11773 12255 19990 30094 20371 15302 15748 38081
10994 38081 47312 46632 58880 68334 74521 94649 134073 176601 240962 299745 329201 317417 285951
10981 285951 246907 202566 159081 124855 101543 70957 64203 59608 53709 54291 59508 49605 37447
10968 37447 33881 38110 39306 32226 13072 6473 7255 -8504 -21994 -17505 6006 30324 43116
$$ packed form
11061d448j9157K06N527j486O619N320q607r743O973n71K157O369M643J589N349
11046G40j810r989n106j8077L410J1743N084J4817K352m260p773M955k15l930
11032h059J905M678J7927K7327J5125L0626K9388J9254J4275J0171J818k0608
11020A43827k3800k0004l2099k5204k9645j9213O545J8148Q17j1065k251Q775
11008A4831K396J1257M270K956p027j5777j133M82P735J0104r723n069M46K2333
10994C8081R231o80J2248R454O187K0128L9424M2528O4361N8783K9456j1784l1466
10981B85951l9044m4341m3485l4226k3312l0586o754m595n899N82N217r903j2158
10968C7447l566M229J196p080j9154o599P82j5759j3490M489K3511K4318J2792
$$ plain form
10955 43116 35887 25988 36563 45256 53403 69749 78573 94017 112882 129393 139825 172771 188816
10942 188816 175479 138571 123935 116100 87451 69554 56756 39618 32372 37783 29167 29298 22101
10929 22101 30820 24803 4057 -6426 2438 9904 6090 5632 4993 -963 -8875 -17698 -14292 -4089
10915 -4089 -3362 -854 2810 3371 61 15903 14711 21719 7378 -7359 -7499 -5555 -370 3061 9544
10900 9544 9409 1006 -1783 116 -9012 -22587 -15827 8143 15121 20023 26546 19693 16619 11154
10886 11154 8047 5206 15398 5059 7647 1432 4895 8348 12709 -6893 -18305 -19203 -26331 -18633
10872 -18633 -12896 -6425 -697 -4471 -3455 -2460 -9614 -9669 4320 12515 27277 30575 26212 25377 7131
10857 7131 6696 6669 10053 1142 -61 -1183 -4115 -3722 3443 8674 12304 21352 32105 16445 -3108
$$ packed form
10955D3116p229r899J0575Q693Q147J6346Q824J5444J8865J6511J0432L2946J6045
10942A88816j3337l6908j4636p835k8649j7897j2798j7138p246N411q616J31p197
10929B2101Q719o017k0746j0483Q864P466l814m58o39n956p912q823L406J0203
10915d089P27K508L664N61l310J5842j192P008j4341j4737j40J944N185L431O483
10900I544j35q403k789J899r128j3575O760K3970O978M902O523o853l074n465
10886A1154l107k841J0192j0339K588o215L463L453M361j9602j1412q98p128P698
10872a8633N737O471N728l774J016R95p154n5J3989Q195J4762L298m363q35j8246
10857G131m35k7L384q911j203j122k932L93P165N231L630R048J0753j5660j9553
$$ plain form
10842 -3108 -4095 -59 6108 -6660 -5001 -6490 -7471 -13016 -17691 -25239 -12777 -4588 -4714 -1982 9937
10827 9937 15581 13613 25206 35867 39946 39845 33621 33838 33867 15098 6450 4521 12157 12082 -8468
10812 -8468 -19404 -13375 -7561 9732 23634 22545 15377 6271 1098 5153 -4151 -1280 -3302 -7485
10798 -7485 -969 472 -5560 5657 15972 30111 29756 13832 12989 21177 14721 14835 20270 23443
10784 23443 26387 36252 57536 46163 45707 65546 61618 37595 26101 18515 5912 146 -5155
10771 -5155 -10202 -10615 -9856 -9348 -5922 3726 12683 24958 29860 21653 17223 11401 4510 6382 21202
10756 21202 22438 27144 29787 19142 15036 24217 33227 24248 16365 18477 8759 6651 7610 18457
10742 18457 31875 31071 32085 48198 58651 56578 55208 47311 50438 59557 55771 39863 36590 32431
$$ packed form
10842c108r87M036O167j2768J659j489r81n545m675p548J2462Q189j26K732J1919
10827I937N644j968J1593J0661M079j01o224K17K9j8769q648j929P636p5k0550
10812h468j0936O029N814J7293J3902j089p168r106n173M055r304K871k022m183
10798g485O516J441o032J1217J0315J4139l55j5924q43Q188o456J14N435L173
10784B3443K944R865K1284j1373m56J9839l928k4023j1494p586j2603n766n301
10771e155n047m13P59N08L426R648Q957J2275M902q207m430n822o891J872J4820
10756B1202J236M706K643j0645m106R181R010q979p883K112r718k108R59J0847
10742A8457J3418q04J014J6113J0453k073j370p897L127R119l786j5908l273m159
$$ plain form
10728 32431 37866 45903 53131 62266 56451 50166 43316 35484 23314 9127 19433 35569 42285
10715 42285 48938 39142 33563 48133 42026 39238 46932 39462 31953 35432 24890 8165 13679 20446
10701 20446 30407 51785 57404 64962 83265 86342 84597 92622 86154 83273 79190 73865 76096 85091
10687 85091 84187 88841 94938 86432 90197 108173 109629 104975 94978 90682 89326 102779 101489 107103
10673 107103 110086 101820 96139 86737 75701 82241 67215 57108 66160 76917 88956 94950 100694
10660 100694 116313 122122 136721 156816 164656 162639 178946 185584 192260 203468 224198 232535 237460
10647 237460 239283 251445 263827 269640 268601 280735 290360 302089 312176 319526 337868 358970
10635 358970 382498 428963 489178 554737 619739 695002 808260 932100 1058739 1192935 1354218
$$ packed form
10728C2431N435Q037P228R135n815o285o850p832j2170j4187J0306J6136O716
10715D2285O653r796n579J4570o107k788P694p470p509L479j0542j6725N514O767
10701B0446R961K1378N619P558J8303L077j745Q025o468k881m083n325K231Q995
10687H5091r04M654O097q506L765J7976J456m654r997m296j356J3453j290N614
10673A07103K983q266n681r402j1036O540j5026j0107R052J0757J2039N994N744
10660A00694J5619N809J4599K0095P840k017J6307O638O676J1208K0730Q337M925
10647B37460J823J2162J2382N813j039J2134R625J1729J0087P350J8342K1102
10635C58970K3528M6465O0215O5559O5002P5263J13258J23840J26639J34196J61283
$$ plain form
10624 1354218 1539712 1741317 1956427 2222365 2590876 3091502 3777809 4786538 6273713
10615 6273713 8486212 11659135 15962077 21131362 26130574 29428647 29906989 27556271
10607 27556271 23437867 18954274 15108834 12174496 10018670 8433873 7287872 6486238
10599 6486238 5966876 5678089 5571634 5568491 5602187 5610414 5572902 5506131 5444035 5417952 5427041
10588 5427041 5420541 5369426 5297884 5238649 5234317 5356728 5624360 6053733 6713204 7736874
10578 7736874 9248767 11499211 14905615 20020283 27310263 36822237 47455595 56396151
10570 56396151 60513842 59035677 53815056 46834160 39133808 31586647 25068403 19979416
10562 19979416 16199824 13412544 11336870 9772132 8586283 7701165 7046740 6540926
$$ packed form
10624A354218J85494K01605K15110K65938L68511N00626O86307J008729J487175
10615F273713K212499L172923M302942N169285M999212L298073M78342k350718
10607B7556271m118404m483593l845440k934338k155826j584797j146001q01634
10599F486238n19362k88787j06455l143L3696Q227l7512o6771o2096k6083R089
10588E427041o500n1115p1542n9235m332J22411K67632M29373O59471J023670
10578G736874J511893K250444L406404N114668P289980R511974J0633358Q940556
10570E6396151M117691j478165n220621o980896p700352p547161o518244n088987
10562A9979416l779592k787280k075674j564738j185849q85118o54425n05814
$$ plain form
10554 6540926 6152620 5895531 5740753 5660073 5537177 5330728 5024022 4682800 4378894 4179475
10544 4179475 4089320 4075960 4177777 4385642 4731847 5269805 6088132 7326285 9211613
10535 9211613 12024453 16087846 21525514 27869960 33705921 36999533 36418713 32369980
10527 32369980 26639029 21029430 16474741 13087494 10610670 8742450 7289940 6166123
10519 6166123 5285949 4611178 4073034 3639421 3271269 2930669 2600498 2303809 2030611
10510 2030611 1787353 1575299 1393694 1236289 1116873 1023424 933141 822788 735766 673090
10500 673090 639673 608109 582489 538265 514623 498214 488571 480263 479489 485073 469398 446191
10488 446191 428630 400138 383824 379860 368892 356901 344615 331896 319801 298748 279049 255529
$$ packed form
10554F540926l88306k57089j54778q0680j22896k06449l06706l41222l03906j99419
10544D179475r0155j3360J01817K07865L46205N37958Q18327J238153J885328
10535I211613K812840M063393N437668O344446N835961L293612n80820m048733
10527C2369980n730951n609599m554689l387247k476824j868220j452510j123817
10519F166123q80174o74771n38144m33613l68152l40600l30171k96689k73198
10510B030611k43258k12054j81605j57405j19416r3449r0283j10353q7022o2676
10500F73090l3417l1564k5620m4224k3642j6409r643q308p74N584j5675k3207
10488D46191j7561k8492j6314l964j0968j1991j2286j2719j2095k1053j9699k3520
$$ plain form
10476 255529 230636 229774 230082 232814 226831 212371 204657 198197 200395 211766 210229 197506 176699
10463 176699 180381 191934 192605 180962 173159 159877 144935 140927 153058 157276 156168 166851 176877
10450 176877 170011 171142 177449 185456 173483 190586 216169 237062 229969 224874 216962 196779 197375
10437 197375 207804 206341 207548 228257 251222 276865 338099 412244 490869 534551 529117 484906
10425 484906 408820 325083 270165 239575 210288 193814 179806 161354 146803 138402 127420 118628
10413 118628 117114 116003 110148 103912 106124 120451 123656 134768 148293 151643 141982 137252 127303
10400 127303 137813 157804 169549 161239 143074 127944 129687 135686 129374 112113 94922 89019
10388 89019 80988 72419 59188 54024 50705 53090 54525 55033 59305 55508 25442 2610 -14020 -7475
$$ packed form
10476B55529k4893q62L08K732n983j4460p714o460K198J1371j537j2723k0807
10463A76699L682J1553O71j1643p803j3282j4942m008J2131M218j108J0683J0026
10450A76877o866J131O307Q007j1973J7103K5583K0893p093n095p912k0183N96
10437A97375J0429j463J207K0709K2965K5643O1234P4145P8625M3682n434m4211
10425D84906p6086q3737n4918l0590k9287j6474j4008j8452j4551q401j0982q792
10413A18628j514j111n855o236K212J4327L205J1112J3525L350r661m730r949
10400A27303J0510J9991J1745q310j8165j5130J743N999o312j7261j7191n903
10388H9019q031q569j3231n164l319K385J435N08M272l797l0066k2832j6630O545
$$ plain form
10374 -7475 23043 52578 77050 107242 120159 102130 73810 67487 77815 85126 106651 102352
10362 102352 112662 128176 135332 146488 155089 142685 129701 122739 117877 130035 119079 95930
10350 95930 81160 58660 52722 58808 59513 79266 101909 114935 120189 112968 105919 105389 96807 102270
10336 102270 137489 170066 200078 226911 252000 270412 263012 249565 217738 183167 156239 135535
10324 135535 146314 150147 152998 148753 140812 143485 150784 142549 139751 131814 131776 141795 150145 150443
10310 150443 160140 164003 164439 184548 210800 252042 304207 367585 456780 498694 460482 376113
10298 376113 298985 249519 233915 251879 265124 275162 285517 285733 285939 287889 302667 310757 302532
10285 302532 296131 289760 284769 283214 285511 289989 295389 292362 276435 272748 265016 267464 267198 266685
$$ packed form
10374g475L0518K9535K4472L0192J2917j8029k8320o323J0328P311K1525m299
10362A02352J0310J5514P156J1156Q601j2404j2984o962m862J2158j0956k3149
10350I5930j4770k2500n938O086P05J9753K2643J3026N254p221p049n30q582N463
10336A02270L5219L2577L0012K6833K5089J8412p400j3447l1827l4571k6928k0704
10324A35535J0779L833K851m245p941K673P299q235k798p937l8J0019Q350K98
10310A50443R697L863M36K0109K6252M1242N2165O3378Q9195M1914l8212q4369
10298C76113p7128m9466j5604J7964J3245J0038J0355K16K06J950J4778Q090q225
10285C02532o401o371m991j555K297M478N400l027j5927l687p732K448k66n13
$$ plain form
10271 266685 254651 236777 221323 219953 229689 238792 247673 254026 251129 262160 270412 277962 283800
10258 283800 284284 279042 264221 263463 272385 292873 315899 332290 350578 387287 425641 443274 457519
10245 457519 466805 481247 488946 490778 490284 498985 495689 502961 527026 550225 563605 576364 608656
10232 608656 654350 687605 698880 704122 714256 752156 794926 845430 928748 1017278 1099965 1155002
10220 1155002 1213949 1293356 1381198 1476052 1570530 1679511 1783918 1879415 1978906 2056393 2142988
10209 2142988 2236372 2342950 2482372 2650909 2860261 3114306 3362783 3605413 3926222 4393729
10199 4393729 5011907 5759962 6650573 7669202 8830217 10191018 11711097 13256844 14610445
10190 14610445 15759989 17044499 18926819 21643355 25360136 30449723 37493883 47638518
$$ packed form
10271B66685j2034j7874j5454j370R736R103Q881O353k897J1031Q252P550N838
10258B83800M84n242j4821p58Q922K0488K3026J6391J8288L6709L8354J7633J4245
10245D57519R286J4442P699J832m94Q701l296P272K4065K3199J3380J2759L2292
10232F08656M5694L3255J1275N242J0134L7900M2770N0504Q3318Q8530Q2687N5037
10220A155002N8947P9407Q7842R4854R4478J08981J04407R5497R9491P7487Q6595
10209B142988R3384J06578J39422J68537K09352K54045K48477K42630L20809M67507
10199D393729O18178P48055Q90611J018629J161015J360801J520079J545747J353601
10190A4610445J149544J284510J882320K716536L716781N089587P044160J0144635
$$ plain form
10182 47638518 62910100 86674384 123940654 181064714 264227152 371532473 470249111
10175 470249111 496719617 432774186 330282370 241787223 181797921 142710680 115020566
10168 115020566 93481975 76252890 62657294 52119643 44042010 37925470 33355967
10161 33355967 29953054 27315436 25007976 22609677 20045267 17546322 15306776 13400167
10153 13400167 11821302 10533684 9439777 8464589 7578504 6827541 6201634 5691838 5267473
10144 5267473 4864422 4448059 4059219 3756206 3486772 3236805 3016044 2835414 2683728
10135 2683728 2557243 2444615 2350345 2262177 2169090 2077462 2003122 1943308 1900567 1859215 1824742
10124 1824742 1777297 1703190 1627662 1584837 1528254 1480812 1449557 1422888 1416103 1415649 1417420 1427770
$$ packed form
10182D7638518J5271582K3764284L7266270N7124060Q3162438J07305321R8716638
10175D70249111K6470506o3945431j02491816q8495147n9989302l9087241k7690114
10168A15020566k1538591j7229085j3595596j0537651q077633o116540m569503
10161C3355967l402913k637618k307460k398299k564410k498945k239546j906609
10153A3400167j578865j287618j093907r75188q86085p50963o25907n09796m24365
10144E267473m03051m16363l88840l03013k69434k49967k20761j80630j51686
10135B683728j26485j12628r4270q8168r3087r1628p4340n9814m2741m1352l4473
10124A824742m7445p4107p5528m2825n6583m7442l1255k6669o785m54J771J0350
$$ plain form
10112 1427770 1413756 1391706 1336518 1272193 1206401 1143596 1084442 1034566 982913 933995 906475
10101 906475 889824 874926 857280 844862 832853 810918 797161 774188 738932 707330 678758
10090 678758 672095 648793 639537 636901 625965 598294 599248 609617 600599 577990 564304 551620 540293
10077 540293 516816 497704 484913 480463 451202 432316 434979 438525 429592 415767 389233 370221
10065 370221 360056 346943 354464 358390 361176 357555 359216 374712 393145 402870 412046 411813 421566
10052 421566 462546 531276 568189 565220 565683 569192 554168 522863 496351 495331 476378 450369
10040 450369 434268 426478 423904 404861 383932 387831 386192 379309 354289 336299 331795 312953 304760
10027 304760 290094 293465 292603 277057 243433 197705 139688 105272 111551 137304 160988 179939
$$ packed form
10112A427770j4014k2050n5188o4325o5792o2805n9154m9876n1653m8918k7520
10101I06475j6651j4898j7646j2418j2009k1935j3757k2973l5256l1602k8572
10090F78758o663k3302r256k636j0936k7671R54J0369r018k2609j3686j2684j1327
10077E40293k3477j9112j2791m450k9261j8886K663L546q933j3825k6534j9012
10065C70221j0165j3113P521L926K786l621J661J5496J8433R725R176k33R753
10052D21566M0980O8730L6913k969M63L509j5024l1305k6512j020j8953k6009
10040D50369j6101p790k574j9043k0929L899j639o883k5020j7990m504j8842q193
10027C04760j4666L371q62j5546l3624m5728n8017l4416O279K5753K3684J8951
$$ plain form
10015 179939 179987 184226 194654 198452 199543 199548 197353 196872 213395 229315 219826 225172 242243 246675 251498
10000 251498 237656 207201 189100 156607 136476 125776 122590 125906 126421 142292 149915 147517 148633
9987 148633 173859 189006 200054 195942 201238 199885 186124 176747 193067 210535 243335 275024
9975 275024 281165 265200 248339 225719 211040 213338 204339 208924 215470 217474 205135 203228 189204
9962 189204 184472 184598 179139 165823 173794 177002 176669 163556 154217 154825 149639 155980 159630 153638 158284
9947 158284 155633 157674 179587 209984 247458 321478 407652 463874 440560 381474 318586 258132
9935 258132 224936 206466 183466 168144 161508 161027 155194 159196 164862 164699 150152 128559 122998
9922 122998 138653 133392 138810 142348 142416 138717 143995 142292 136459 148354 166869 168016 190849 218329
$$ packed form
10015A79939M8M239J0428L798J091Nk195m81J6523J5920r489N346J7071M432M823
10000B51498j3842l0455j8101l2493k0131j0700l186L316N15J5871P623k398J116
9987A48633K5226J5147J1048m112N296j353j3761r377J6320J7468L2800L1689
9975B75024O141j5965j6861k2620j4679K298q999M585O546K004j2339j907j4024
9962A89204m732J26n459j3316P971L208l33j3113r339O08n186O341L650n992M646
9947A58284k651K041K1913L0397L7474P4020Q6174N6222k3314n9086o2888o0454
9935B58132l3196j8470k3000j5322o636m81n833M002N666j63j4547k1593n561
9922A22998J5655n261N418L538O8l699N278j703n833J1895J8515J147K2833K7480
$$ plain form
9908 218329 218522 207193 197489 184746 177451 162580 165761 164911 165578 169626 154298 140296 140372 138283
9894 138283 131210 133225 145885 160978 164801 172282 170448 174611 169000 161690 159689 160394 172043 175791
9880 175791 180681 177307 175937 187739 204737 205412 198909 189276 180532 190935 193132 200783 218280 224909
9866 224909 239650 240998 221028 218592 222285 223135 218607 216911 216616 228234 247082 266104 268015 285209
9852 285209 308908 329647 356407 385830 415953 458467 512611 580607 660764 758740 870010
9841 870010 1008857 1189805 1420423 1724947 2175961 2819058 3732580 4956324 6450893
9832 6450893 7925660 9002217 9335028 8831655 7690746 6334601 5146073 4245270 3571364
9823 3571364 3060954 2659499 2349923 2115854 1945321 1833226 1752024 1701729 1680934 1695519
$$ packed form
9908B18329J93j1329r704j2743p295j4871L181q50O67M048j5328j4002P6k089
9894A38283p073K015J2660J5093L823P481j834M163n611p310k001P05J1649L748
9880A75791M890l374j370J1802J6998O75o503r633q744J0403K197P651J7497O629
9866B24909J4741J348j9970k436L693Q50m528j696k95J1618J8848J9022J911J7194
9852B85209K3699K0739K6760K9423L0123M2514N4144O7996Q0157R7976J11270
9841H70010J38847J80948K30618L04524M51014O43097R13522J223744J494569
9832F450893J474767J076557L32811n03373j140909j356145j188528r00803o73906
9823C571364n10410m01455l09576k34069j70533j12095q1202n0295k0795J4585
$$ plain form
9813 1695519 1743435 1826809 1968046 2116972 2253939 2353811 2473636 2651483 2884457 3213420
9803 3213420 3678787 4328594 5252592 6601755 8559057 11332506 15056850 19494722 23854482
9794 23854482 27058112 28235577 27616813 26230100 24544426 22127513 18933016 15614526
9786 15614526 12770670 10583704 8947779 7715736 6772252 6042236 5478889 5052728 4765151
9777 4765151 4608693 4564621 4605505 4625698 4557782 4432539 4317543 4289822 4383530 4593751 4952769
9766 4952769 5505002 6295221 7474587 9213660 11701655 15131547 19469845 24020417 27738899
9757 27738899 30144877 31586594 32789368 34318722 35910679 36349440 34441929 30385356
9749 30385356 25463054 20855864 17068739 14121763 11857880 10111712 8748997 7704083
$$ packed form
9813A695519M7916Q3374J41237J48926J36967R9872J19825J77847K32974L28963
9803C213420M65367O49807R23998J349163J957302K773449L724344M437872M359760
9794B3854482L203630J177465o18764j386713j685674k416913l194497l318490
9786A5614526k843856k186966j635925j232043r43484p30016n63347m26161k87577
9777D765151j56458m4072M0884K0193o7916j25243j14996k7721R3708K10221L59018
9766D952769N52233P90219J179366J739073K487995L429892M338298M550572L718482
9757B7738899K405978J441717J202774J529354J591957M38761j907511m056573
9749C0385356m922302m607190l787125k946976k263883j746168j362715j044914
$$ plain form
9741 7704083 6910679 6333303 5944790 5678028 5422355 5104914 4752951 4395082 4128444 3958999
9731 3958999 3871703 3899168 4032432 4266621 4641212 5220654 6085238 7321557 9045867 11267217
9721 11267217 13808542 16538967 19510607 22477365 24428469 24471704 22955611 20955593
9713 20955593 19101278 17277104 15067708 12552640 10217462 8360567 6971289 5933763
9705 5933763 5147850 4547106 4091171 3728271 3410418 3108272 2804805 2513188 2253051 2052862
9695 2052862 1889452 1763742 1680415 1626153 1609531 1605436 1640122 1706461 1801549 1962537 2225383
9684 2225383 2625601 3193538 3989175 4981076 6081182 6989260 7436395 7284232 6561707
9675 6561707 5498738 4413387 3542300 2891352 2415834 2051398 1767651 1528092 1347579
$$ packed form
9741G704083p93404n77376l88513k66762k55673l17441l51963l57869k66638j69445
9731C958999q7296K7465J33264K34189L74591N79442Q64584J236319J724310K221350
9721A1267217K541325K730425K971640K966758J951104M3235j516093k000018
9713B0955593j854315j824174k209396k515068k335178j856895j389278j037526
9705E933763p85913o00744m55935l62900l17853l02146l03467k91617k60137k00189
9695B052862j63410j25710q3327n4262j6622m095L4686O6339R5088J60988K62846
9684B225383M00218N67937P95637R91901J100106R08078M47135j52163p22525
9675F561707j062969j085351q71087o50948m75518l64436k83747k39559j80513
$$ plain form
9666 1347579 1201993 1071462 972207 875693 790534 716748 644171 587989 545137 495149 458117
9655 458117 423805 391094 371808 364437 351834 319413 299236 311531 318859 311070 292760 276632
9643 276632 260921 256354 261623 248171 237957 228513 215553 207593 210403 210928 198411 207884 210722
9630 210722 209960 197007 188206 193710 202405 208243 200617 184107 172246 168883 170830 174287 164691 152272
9616 152272 146571 138751 123172 115463 114381 122741 104167 101547 108864 113346 110828 118080 141334 141584
9602 141584 146498 145620 142438 132160 120300 114711 119339 133744 147940 136040 122766 129152 122838
9589 122838 118808 118094 116099 107147 101642 118023 119901 120976 117706 101352 105840 97115 93051 80500
9575 80500 75310 64945 74378 77110 73651 78473 81478 90761 97460 100718 98118 96504 78548 70737
$$ packed form
9666A347579j45586j30531r9255r6514q5159p3786p2577n6182m2852m9988l7032
9655D58117l4312l2711j9286p371j2603l2421k0177J2295P328p789j8310j6128
9643B76632j5711m567N269j3452j0214r444j2960p960K810N25j2517R473K838
9630B10722p62j2953q801N504Q695N838p626j6510j1861l363J947L457r596j2419
9616A52272n701p820j5579p709j082Q360j8574k620P317M482k518P252K3254K50
9602A41584M914q78l182j0278j1860n589M628J4405J4196j1900j3274O386o314
9589A22838m030p14j995q952n505J6381J878J075l270j6354M488q725m064j2551
9575H0500n190j0365R433K732l459M822L005R283O699L258k600j614j7956p811
$$ plain form
9561 70737 67814 87837 91270 93133 99118 94433 88454 110245 120064 115784 120947 114548 114459 114163 103656
9546 103656 105696 108315 114690 104717 99782 95773 88748 74856 73553 76354 88912 106063 105312 126334
9532 126334 151418 182021 227263 301220 420118 534164 513305 387574 271791 212813 187833
9521 187833 159664 146920 135547 118466 101670 85237 78791 80928 82437 85070 90144 92012 82414
9508 82414 79940 90430 93163 92394 81746 77538 68407 55990 52003 44837 56120 58281 55460 56319
9494 56319 65281 61552 69529 72081 58965 49670 56659 65844 60957 58126 56732 56418 47401 42688 46259
9479 46259 61020 61270 60024 62050 56630 51733 44964 50415 69257 69579 60330 47351 46696 45888 43393
9464 43393 36246 31322 31356 26247 29800 39294 41072 35721 38376 35419 47638 56936 64309 49348 36916
$$ packed form
9561G0737k923K0023L433J863N985m685n979K1791R819m280N163o399q9k96j0507
9546A03656K040K619O375r973m935m009p025j3892j303K801J2558J7151p51K1022
9532A26334K5084L0603M5242P3957J18898J14046k0859j25731j15783n8978k4980
9521A87833k8169j2744j1373j7081j6796j6433o446K137J509K633N074J868r598
9508H2414k474J0490K733p69j0648m208r131j2417l987p166J1283K161k821Q59
9494E6319Q962l729P977K552j3116r295O989R185m887k831j394l14r017m713L571
9479D6259J4761K50j246K026n420m897o769N451J8842L22r249j2979o55q08k495
9464D3393p147m924L4n109L553R494J778n351K655k957J2219R298P373j4961j2432
$$ plain form
9449 36916 31948 17182 9326 13342 28431 37897 41144 43839 38110 31879 47026 55565 65774 70989
9435 70989 72480 75287 76149 84541 100663 100956 108298 117077 98527 65218 54551 49653 29949 25043
9421 25043 26549 34480 33796 31931 32043 22896 19719 37580 43513 45229 52969 56888 56360 48120 50714
9406 50714 52124 47937 44382 44179 51254 71659 89395 109809 115538 129264 131262 144677 166687
9393 166687 176887 164540 151788 154230 158475 134468 111456 99497 92195 92251 83693 71116 65202
9380 65202 66182 55090 48037 41602 41862 65448 76690 85971 83709 72038 52902 44396 64437 78518
9366 78518 80691 84486 96184 92759 99546 111968 145235 181434 208634 211216 220754 219828 217603 222701
9352 222701 219427 203414 191278 169578 155848 133491 108001 101766 96782 93243 92482 89998 81393
$$ packed form
9449C6916m968j4766p856M016J5089R466L247K695n729o231J5147Q539J0209N215
9435G0989J491K807Q62Q392J6122K93P342Q779j8550l3309j0667m898j9704m906
9421B5043J506P931o84j865J12r147l177J7861N933J716P740L919n28q240K594
9406E0714J410m187l555k03P075K0405J7736K0414N729J3726J998J3415K2010
9393A66687J0200j2347j2752K442M245k4007k3012j1959p302N6q558j2577n914
9380F5202R80j1092p053o435K60K3586J1242R281k262j1671j9136q506K0041J4081
9366G8518K173L795J1698l425O787J2422L3267L6199K7200K582R538r26k225N098
9352B22701l274j6013j2136k1700j3730k2357k5490o235m984l539p61k484q605
$$ plain form
9339 81393 75226 65089 58807 63027 65281 76185 67161 68297 62299 56861 51032 58641 68336 61532
9325 61532 72434 82094 92246 97400 101432 116502 141722 156757 173869 178962 177694 166240 127126
9312 127126 112874 111920 95890 75055 82240 94484 76293 71349 58092 51297 31931 17232 13956
9299 13956 18118 16284 19717 14396 12944 19474 29305 49053 41496 32107 38327 45552 56511 52614
9285 52614 42319 38160 45697 47850 49558 53154 53968 54580 53614 66165 71814 70523 71237 66256 60881
9270 60881 61388 57289 35982 22461 24001 33585 46890 61471 65683 40885 30882 44226 59903
9257 59903 48250 41432 38707 31924 34859 44594 37894 25743 33969 32516 40846 49892 51478 55517
9243 55517 51575 39613 19138 16433 27044 25892 28636 34071 38819 38882 31819 32758 40353 24604
$$ packed form
9339H1393o167j0137o282M220K254J0904r024J136n998n438n829P609R695o804
9325F1532J0902R660J0152N154M032J5070K5220J5035J7112N093j268j1454l9114
9312A27126j4252r54j6030k0835P185J2244j8191m944j3257o795j9366j4699l276
9299A3956M162j834L433n321j452O530R831J9748p557r389O220P225J0959l897
9285E2614j0295m159P537K153J708L596Q14O12r66J2551N649j291P14m981n375
9270F0881N07m099k1307j3521J540R584J3305J4581M212k4798j0003J3344J5677
9257E9903j1653o818k725o783K935R735o700j2151Q226j453Q330R046J586M039
9243E5517l942j1962k0475k705J0611j152K744N435M748O3p063R39P595j5749
$$ plain form
9229 24604 15510 10500 7215 20123 37567 40821 43511 40558 36799 18202 18388 22259 23412 41890
9215 41890 59457 77268 75860 69723 48823 21924 9374 19456 20260 26968 23675 29230 26881
9202 26881 21902 19858 26027 34330 23054 25045 31879 44077 42585 38255 29771 22441 26753 28918
9188 28918 24072 10615 7715 19238 34869 39184 38179 35978 29634 26849 29446 29868 29317 31074
9174 31074 46791 38555 32223 30530 30846 24181 16526 15577 18881 21293 22282 30935 47796 40171 31134
9159 31134 36650 25642 32047 29659 21450 16301 16241 36463 40425 59346 59153 39000 23245 9854
9145 9854 12816 12623 18365 20339 17974 13618 11063 17405 13680 18415 18720 20383 22416 25220 32110
9130 32110 28153 23540 26923 33557 33291 36178 38707 34807 47681 20749 7737 15956 9091 2672
$$ packed form
9229B4604r094n010l285J2908J7444L254K690k953l759j8597J86L871J153J8478
9215D1890J7567J7811j408o137k0900k6899j2550J0082Q04O708l293N555k349
9202B6881m979k044O169Q303j1276J991O834J2198j492m330q484p330M312K165
9188B8918m846j3457k900J1523J5631M315j005k201o344k785K597M22n51J757
9174C1074J5717q236o332j693L16o665p655r49L304K412R89Q653J6861p625r037
9159C1134N516j1008O405k388q209n149o0K0222L962J8921j93k0153j5755j3391
9145I854K962j93N742J974k365m356k555O342l725M735L05J663K033K804O890
9130C2110l957m613L383O634k66K887K529l900J2874k6932j3012Q219o865o419
$$ plain form
9116 2672 10779 18404 20875 24756 23145 28783 23233 19907 12987 10468 17186 23597 15741 15252 23767
9101 23767 21431 14020 22158 21826 9469 3910 12797 24282 24422 15901 20549 20770 11651 11744 15387
9086 15387 20033 9021 -6160 -6871 9508 18695 22287 22209 18569 17720 20405 15613 16340 10109 -870
9071 -870 -5641 -2949 -4182 4856 14570 19078 14776 13812 19076 23166 34233 27727 14229 3464 -997
9056 -997 -6091 -3153 7149 23516 37316 49468 48248 39562 28884 15438 15372 12911 18481 17983
9042 17983 24865 21819 11183 18578 21767 25031 32619 35100 19086 22021 19124 -218 -4050 -2296
9028 -2296 5656 4315 -4121 -9499 -2615 1014 651 -1930 8860 6880 4409 7644 17219 15181 11859
9013 11859 11014 -1442 -8906 -5473 6065 10568 19474 18478 18049 29280 27303 23371 16004 18632 20976
$$ packed form
9116B672Q107P625K471L881j611N638n550l326o920k519O718O411p856m89Q515
9101B3767k336p411Q138l32j2357n559Q887J1485J40q521M648K21r119R3L643
9086A5387M646j1012j5181p11J6379R187L592p8l640q49K685m792P27o231j0979
9071h70m771K692j233R038R714M508m302r64N264M090J1067o506j3498j0765m461
9056i97n094K938J0302J6367J3800J2152j220q686j0678j3446o6k461N570m98
9042A7983O882l046j0636P395L189L264P588K481j6014K935k897j9342l832J754
9028b296P952j341q436n378O884L629l63k581J0790j980k471L235R575k038l322
9013A1859q45j2456p464L433J1538M503Q906r96m29J1231j977l932p367K628K344
$$ plain form
8998 20976 28190 17077 12582 14015 10105 13594 8011 537 650 -5164 -7301 -12543 1379 3314
8984 3314 -11841 -3582 9574 16651 25125 38548 38257 26583 20028 6613 9857 21131 26438 12384
8970 12384 7574 816 -12501 -11058 4846 8208 -3056 -11783 -12781 8483 30795 22781 12160
8957 12160 7841 17193 23668 19995 18624 714 -12775 -219 14486 27745 35704 35175 22321
8944 22321 6816 -353 7228 15751 16792 20072 14866 13322 18405 12315 10971 3995 14040 30011
8930 30011 42956 41981 25797 16352 8151 16973 22920 28682 18126 27964 23744 20349 18425 13018
8916 13018 11343 8919 9510 15588 16453 23371 31764 37566 34448 38416 49369 45510 41421 36315 32964
8901 32964 28420 23043 18464 17181 31686 29227 38758 47599 37221 20762 31574 33046 27915 31747
$$ packed form
8998B0976P214j1113m495J433l910L489n583p474J13n814k137n242J3922J935
8984C314j5155Q259J3156P077Q474J3423k91j1674o555j3415L244J1274N307j4054
8970A2384m810o758j3317J443J5904L362j1264q727r98K1264K2312q014j0621
8957A2160m319R352O475l673j371j7910j3489J2556J4705J3259P959n29j2854
8944B2321j5505p169P581Q523J041L280n206j544N083o090j344o976J0045J5971
8930C0011J2945r75j6184r445q201Q822N947N762j0556R838m220l395j924n407
8916A3018j675k424N91O078Q65O918Q393N802l118L968J0953l859m089n106l351
8901C2964m544n377m579j283J4505k459R531Q841j0378j6459J0812J472n131L832
$$ plain form
8887 31747 30224 27701 43321 54342 68571 64499 80083 118003 170026 225295 309779 379330
8875 379330 377391 303017 223288 164020 128328 110073 96385 87165 88495 79600 72023 60958 49333
8862 49333 36854 41145 47896 43220 47128 34762 24684 9272 -3982 -6166 5737 15454 6678
8849 6678 4880 18009 28047 35385 37956 41975 23516 -4071 -11137 -13207 -6417 15301 25914
8836 25914 33072 34847 14627 17492 17989 16544 22177 19415 25528 35430 30379 13853 -1788 -550
8822 -550 -3799 10788 18954 24590 29711 18224 12171 8998 4305 6552 23353 25367 10055 5980
8808 5980 15590 23031 19508 18004 10943 15102 23506 20146 10666 6743 9913 12228 14529 11770 4217
8793 4217 3406 -3662 -3629 -132 7176 5623 1486 4157 3387 10439 19945 6133 11402 35827 40801
$$ packed form
8887C1747j523k523J5620J1021J4229m072J5584L7920N2023N5269Q4484O9551
8875C79330j939p4374p9729n9268l5692j8255j3688r220J330q895p577j1065j1625
8862D9333j2479M291O751m676L908j2366j0078j5412j3254k184J1903R717q776
8849F678j798J3129J0038P338K571M019j8459k7587p066k070O790K1718J0613
8836B5914P158J775k0220K865M97j445N633k762O113R902n051j6526j5641J238
8822e50l249J4587Q166N636N121j1487o053l173m693K247J6801K014j5312m075
8808E980R610P441l523j504p061M159Q404l360r480l923L170K315K301k759p553
8793D217q11p068L3L497P308j553m137K671p70P052R506j3812N269K4425M974
$$ plain form
8778 40801 25603 18626 20325 18578 13361 14005 15290 16655 23012 23685 24511 23172 14804 14683 12637
8763 12637 12641 15096 21436 9410 12637 16400 21028 14407 15863 12594 10879 9064 21693 29264 26946
8748 26946 14108 10543 2757 7287 5291 22990 27536 22550 33250 29190 25717 19769 19579 30211
8734 30211 29107 24568 22398 15476 13248 20273 14253 13273 15213 30625 37576 9090 2139 -417
8720 -417 5847 -1261 -13343 -19329 -6490 6827 11340 14285 19162 12936 13328 16862 24757 -944
8706 -944 -11529 5504 8306 12240 25017 42829 34395 25534 31911 35546 28868 22113 9827 24056
8692 24056 33524 40005 33579 34671 41037 40928 34572 39670 34916 25412 16233 15619 13058 15741 27866
8677 27866 33919 40962 38686 27330 16181 21132 25850 23198 24371 26734 23458 33635 24990 11345
$$ packed form
8778D0801j5198o977J699j747n217O44J285J365O357O73Q26j339q368j21k046
8763A2637MK455O340j2026L227L763M628o621J456l269j715j815J2629P571k318
8748B6946j2838l565p786M530j996J7699M546m986J0700m060l473n948j90J0632
8734C0211j104m539k170o922k228P025o020r80J940J5412O951k8486o951k556
8720d17O264p108j2082n986J2839J3317M513K945M877o226L92L534P895k5701
8706i44j0585J7033K802L934J2777J7812q434q861O377L635o678o755j2286J4229
8692B4056R468O481o426J092O366j09o356N098m754r504r179o14k561K683J2125
8677B7866O053P043k276j1356j1149M951M718k652J173K363l276J0177q645j3645
$$ plain form
8663 11345 6561 1775 10984 22189 11436 20075 33813 29761 13264 14167 27408 34331 43790 56801
8649 56801 41720 27112 36669 29061 24697 40147 55050 56302 67026 76927 68706 53967 41087
8636 41087 22511 15479 31185 47629 72212 73054 76751 91854 90955 92890 91674 98146 98569 97814
8622 97814 91946 83924 90394 91699 96614 104716 104548 112746 103889 103105 101347 105759 96584 86067 85850
8607 85850 86435 88974 92310 82289 78519 80209 79228 77168 67125 68527 71073 73461 73431 74583 60621
8592 60621 46116 39986 33087 38080 32385 23992 22781 27778 27668 35391 43558 45401 54969 48800 44376
8577 44376 36396 24421 12355 12563 9736 21839 21873 18241 16269 30981 41779 40580 30782 27599
8563 27599 18942 5837 6986 11545 14953 17298 8505 2356 7596 16634 22172 17787 14996 1626
$$ packed form
8663A1345m784m786R209J1205j0753Q639J3738m052j6497R03J3241O923R459J3011
8649E6801j5081j4608R557p608m364J5450J4903J252J0724R901q221j4739j2880
8636D1087j8576p032J5706J6444K4583Q42L697J5103q99J935j216O472M23p55
8622I7814n868q022O470J305M915Q102j68Q198q857p84j758M412r175j0517k17
8607H5850N85K539L336j0021l770J690r81k060j0043J402K546K388l0J152j3962
8592F0621j4505o130o899M993n695q393j211M997j10P723Q167J843R568o169m424
8577D4376p980j1975j2066K08k827J2103L4l632j972J4712J0798j199r798l183
8563B7599q657j3105J149M559L408K345q793o149N240R038N538m385k791j3370
$$ plain form
8549 1626 5534 4875 8536 1529 -7408 9166 24840 21557 25160 26279 7025 2316 1417 11488
8535 11488 14046 9975 4687 3149 -1355 12444 20428 25616 34121 30059 25184 19484 4968 -11745
8521 -11745 -12568 -8345 -502 18821 24707 19433 573 -11135 -5160 5377 7604 13313 458 816
8507 816 -5103 -319 2319 -8421 -4598 -7254 -5609 -4935 2608 9866 3776 4710 1157 9230 12449
8492 12449 20916 31300 31657 19123 12978 6225 7954 9321 -842 -8811 -6152 4352 14127 16783
8478 16783 19486 9922 6170 9151 11624 22767 19015 18062 10754 13350 14519 14184 14827 12984 13005 21329
8462 21329 22458 19358 15096 6703 9819 -660 -3359 -6843 390 3034 2248 -1718 -12943 -12838 785
8447 785 10345 290 -3020 -5071 -13576 -2207 3545 7519 24532 17204 14107 12156 7185 -75
$$ packed form
8549A626L908o59L661p007q937J6574J5674l283L603J119j9254m709q99J0071
8535A1488K558m071n288j538m504J3799P984N188Q505m062m875n700j4516j6713
8521a1745q23M223P843J9323N886n274j8860j1708N975J0537K227N709j2855L58
8507H16n919M784K638j0740L823k656J645O74P543P258o090R34l553Q073L219
8492A2449Q467J0384L57j2534o145o753J729J367j0163p969K659J0504R775K656
8478A6783K703r564l752K981K473J1143l752r53p308K596J169l35O43j843K1Q324
8462B1329J129l100m262q393L116j0479k699l484P233K644p86l966j1225J05J3623
8447G85R560j0055l310k051q505J1369N752L974J7013p328l097j951m971p260
$$ plain form
8433 -75 2737 -1228 -6863 2429 9301 4637 3749 -9265 -9816 -342 11832 15595 14607 12167 1479
8418 1479 6080 12457 13313 16090 5181 14587 24541 24992 19364 30091 15202 -2877 -4167 11369
8404 11369 17813 10388 3728 -507 18869 21330 17668 21113 11905 10446 7125 13086 13422 2196
8390 2196 4881 6124 5823 8019 9172 7001 858 11104 12504 21296 24185 15501 5477 4729 1318
8375 1318 -6940 -17858 -9404 6114 16778 17560 8994 5893 8429 10872 6416 15640 22693 25707
8361 25707 23172 18916 16422 18858 18131 21981 19944 10487 5573 5324 -5061 -15090 -13547 4017
8347 4017 1912 7364 7670 8787 3208 7479 25247 30201 24498 11677 890 -2710 16013 37198
8333 37198 35094 19893 7467 -7239 -6747 2494 6715 -6233 -19146 -9064 14517 15950 16312
$$ packed form
8433g5K812l965n635R292O872m664q88j3014n51R474J2174L763r88k440j0688
8418A479M601O377Q56K777j0909R406R954M51n628J0727j4889j8079j290J5536
8404A1369O444p425o660m235J9376K461l662L445r208j459l321N961L36j1226
8390B196K685J243l01K196J153k171o143J0246J400Q792K889q684j0024p48l411
8375A318q258j0918Q454J5518J0664P82q566l101K536K443m456R224P053L014
8361B5707k535m256k494K436p27L850k037r457m914k49j0385j0029J543J7564
8347D017k105N452L06J117n579M271J7768M954n703j2821j0787l600J8723K1185
8333C7198k104j5201j2426j4706M92R241M221j2948j2913J0082K3581J433L62
$$ plain form
8320 16312 31907 29237 13760 20530 25465 22682 27125 34512 39220 41104 40055 29099 22985 36624
8306 36624 33102 19430 25240 31855 29879 24463 29903 32761 35295 51936 57140 69076 79539 70767
8292 70767 57246 41537 50478 40743 30777 23091 13711 17926 21864 12527 1991 -2621 -4899 -2585
8278 -2585 -2254 -2440 -1939 -3115 4771 15287 25455 26615 34439 27063 18764 10254 14889 10003 10283
8263 10283 5554 12649 3967 -8219 2185 4090 3430 -1603 -5048 8817 14628 17848 13346 16016
8249 16016 17021 8156 5436 -214 993 2855 -7537 -3065 13856 13063 12755 13696 13691 7800 8974 8412
8233 8412 9882 7791 9008 10018 3738 -4029 -9892 -8807 7000 -993 -16678 -13283 11266 24596
8219 24596 20838 15792 -1781 7114 -1154 -8250 -1 23381 32156 35038 25126 19796 22102 22620
$$ packed form
8320A6312J5595k670j5477O770M935k783M443P387M708J884j049j0956o114J3639
8306C6624l522j3672N810O615j976n416N440K858K534J6641N204J1936J0463q772
8292G0767j3521j5709Q941r735r966p686r380M215L938r337j0536m612k278K314
8278b585L31j86N01j176P886J0516J0168J160P824p376q299q510M635m886K80
8263A0283m729P095q682j2186J0404J905o60n033l445J3865N811L220m502K670
8249A6016J005q865k720n650J207J862j0392M472J6921p93l08R41nn891J174n62
8233H412J470k091J217J010o280p767n863J085J5807p993j5685L395K4549J3330
8219B4596l758n046j7573Q895q268p096Q249K3382Q775K882r912n330K306N18
$$ plain form
8205 22620 31194 28670 8083 -2319 -5774 -12632 -1990 346 -10656 -8406 -9747 -148 22189
8192 22189 22022 4212 8819 10327 2950 7173 13586 12683 6907 7314 8634 2477 348 -1369 -105
8177 -105 -888 -4110 -2291 710 -4249 -15527 -13565 -8835 -5024 -2226 12530 23490 29080 13344
8163 13344 6508 8853 13092 31246 45249 39898 35564 28269 28677 23293 32791 37374 31151 21420
8149 21420 21989 19645 12289 18593 16186 17546 18537 14730 17325 31964 31929 22787 11142 7776 -5017
8134 -5017 -9485 11790 15643 8313 6031 16863 28921 24423 7607 -1533 -1146 1934 6475 4473
8120 4473 -4216 9715 20395 21077 -941 -9174 -5166 -9804 -6451 7247 18321 25224 8858 -12727
8106 -12727 -7540 -4806 -8540 -26749 -27795 -3975 7738 11401 1216 1826 -2257 -616 -5648 -6783
$$ packed form
8205B2620Q574k524k0587j0402l455o858J0642K336j1002K250j341R599K2337
8192B2189j67j7810M607J508p377M223O413r03n776M07J320o157k129j717J264
8177a05p83l222J819L001m959j1278J962M730L811K798J4756J0960N590j5736
8163A3344o836K345M239J8154J4003n351m334p295M08n384R498M583o223r731
8149B1420N69k344p356O304k407J360R91l807K595J4639l5r142j1645l366j2793
8134e017m468K1275L853p330k282J0832J2058m498j6816r140L87L080M541k002
8120D473q689J3931J0680O82k2018q233M008m638L353J3698J1074O903j6366k1585
8106a2727N187K734l734j8209j046K3820J1713L663j0185O10m083J641n032j135
$$ plain form
8092 -6783 -24459 -22534 -5009 -7408 2829 2705 -10735 -11782 8390 15113 2920 -7576 -9595
8079 -9595 -187 -5625 6922 23360 10233 -7215 -7464 3640 4570 12553 15245 9011 3817 12508
8065 12508 9874 -7673 -5649 4848 24449 26766 20298 30002 39207 31649 26694 36027 52972 45687
8051 45687 41713 52591 52979 46501 34891 41123 40235 49904 53414 48482 49789 45260 42597 67798
8037 67798 70175 55936 47134 39244 30530 32373 29175 27437 21522 16488 12876 15902 21105 15641
8023 15641 11548 -2664 -1666 10621 24575 24391 26384 23226 39165 56120 68032 72839 101966
8010 101966 119480 142269 173956 173816 138428 118907 100525 92703 77977 84099 87032 102159 135036
7997 135036 164753 172821 169404 161609 133872 98355 56961 40021 36149 42318 42081 41195 41900 47113
$$ packed form
8092f783j7676J925J7525k399J0237j24j3440j047K0172O723j2193j0496k019
8079i595R408n438J2547J6438j3127j7448k49J1104R30P983K692o234n194Q691
8065A2508k634j7547K024J0497J9601K317o468R704R205p558m955R333J6945p285
8051D5687l974J0878L88o478j1610O232q88R669L510m932J307m529k663K5201
8037F7798K377j4239q802p890q714J843l198j738n915n034l612L026N203n464
8023A5641m093j4212R98J2287J3954j84J993l158J5939J6955J1912M807K9127
8010A01966J7514K2789L1687j40l5388j9521j8382p822j4726O122K933J5127L2877
7997A35036K9717Q068l417p795k7737l5517m1394j6940l872O169k37q86P05N213
$$ plain form
7983 47113 48793 61392 56638 42012 43370 53818 45653 27395 28666 32961 30593 29288 31027 37108
7969 37108 46895 64117 81334 84598 87486 94525 97039 99217 103520 90151 95781 94444 93305 102286
7955 102286 120108 131291 144209 134648 106184 73938 60112 53766 46249 26706 15146 17532
7943 17532 22932 29224 36400 43811 37628 37448 35223 28792 24885 26299 30467 16813 5448 4276
7929 4276 -2289 723 19859 33071 47175 69353 79014 75939 64773 63704 64411 53020 44477 37187
7915 37187 28843 40433 53159 48674 38312 34532 26291 18456 13086 9999 19754 13253 13716 20742
7901 20742 11878 8212 19132 18634 13789 22361 23530 6053 9356 5888 2986 6451 2637 1560
7887 1560 12622 17354 1964 3447 1380 884 14221 15700 5017 -5155 3092 1351 -8232 -21005
$$ packed form
7983D7113J680J2599m754j4626J358J0448q165j8258J271M295k368j305J739O081
7969C7108R787J7222J7217L264K888P039K514K178M303j3369N630j337j139Q981
7955A02286J7822J1183J2918r561k8464l2246j3826o346p517j9543j1560K386
7943A7532N400O292P176P411o183j80k225o431l907J414M168j3654j1365j172
7929D276o565L012J9136J3212J4104K2178R661l075j1166j069P07j1391q543p290
7915C7187q344J1590J2726m485j0362l780q241p835n370l087R755o501M63P026
7901B0742q864l666J0920m98m845Q572J169j7477L303l468k902L465l814j077
7887A560J1062M732j5390J483k067m96J3337J479j0683j0172Q247j741r583j2773
$$ plain form
7873 -21005 -12987 8423 17538 15305 8943 13086 13316 14194 25621 24530 11931 5162 1405 1787 1446
7858 1446 -129 577 6430 23471 28540 30827 19577 7457 1015 -10059 -16242 -7803 -837 -3583
7844 -3583 -692 -279 -3641 -2818 1812 8636 11547 10739 5086 3906 1466 -3366 1755 5184 -2606 -517
7828 -517 8604 7386 2965 1271 -10890 -15443 -3427 5437 5869 969 12714 19473 20280 19360 13575
7813 13575 -8564 -13653 -7742 -4897 -2831 -3168 -3392 7823 13544 4291 5671 5133 5496 -7631 -13258
7798 -13258 -16 8009 6312 12335 23547 12079 -3159 -9240 -741 -3221 15736 8816 9366 10432
7784 10432 6781 -3636 -13031 -14360 -5960 -5879 -6752 -1590 6336 5693 -2787 -9471 -10072 -13732 -11515 -2769
7768 -2769 -7035 -6851 -11606 -11940 -16286 -7614 -19432 -13199 -9650 8212 7743 6248 -4566 -9576 -5703
$$ packed form
7873b1005Q018K1410R115k233o362M143K30Q78J1427j091j2599o769l757L82l41
7858A446j575P06N853J7041N069K287j1250j2120o442j1074o183Q439O966k746
7844c583K891M13l362Q23M630O824K911q08n653j180k440m832N121L429p790K089
7828e17R121j218m421j694j2161m553J2016Q864M32m900J1745O759Q07r20n785
7813A3575k2139n089N911K845K066l37k24J1215N721r253J380n38L63j3127n627
7798a3258J3242Q025j697O023J1212j1468j5238o081Q499k480J8957o920N50J066
7784A0432l651j0417r395j329Q400Q1q73N162P926o43q480o684o01l660K217Q746
7768b769m266J84m755l34m346Q672j1818O233L549J7862m69j495j0814n010L873
$$ plain form
7753 -5703 361 1528 959 -12504 -18336 -27332 -29839 -14187 -7241 -14913 -14439 -20204 -21759 -19771 244
7738 244 2513 7289 2968 3473 19109 16423 4525 2147 482 -10071 -20285 -20528 -10285 -5655
7724 -5655 1291 -1452 -1793 -4367 -1953 10239 29028 31816 18685 15246 13657 11069 -3565 -10957
7710 -10957 -7701 -15719 -6123 -4172 -9517 -11057 -14275 -23622 -16244 -6924 -16304 -23826 -28210 -43130
7696 -43130 -46944 -24443 -1841 5165 25944 25054 5763 -4953 -2582 -2239 -558 -942 -3919 1690
7682 1690 -2915 -4871 3216 423 -1268 2748 2570 -4979 -1017 1095 6303 1504 6126 2511 6658
7667 6658 10720 7632 1066 4463 -7654 -10214 -3810 -3007 -16782 -17926 -13427 -11451 -10107 -15702 -17929
7652 -17929 -16010 -21352 -14250 5337 2038 -3993 -18376 -23644 -15264 -9810 -7788 -3117 -13376 -18206
$$ packed form
7753e703O064J167n69j3463n832q996k507J5652O946p672M74n765j555J988K0015
7738B44K269M776m321N05J5636k686j1898k378j665j0553j0214k43J0243M630
7724e655O946k743l41k574K414J2192J8789K788j3131l439j589k588j4634p392
7710a0957L256q018R596J951n345j540l218r347P378R320r380p522m384j4920
7696d3130l814K2501K2602P006K0779q90j9291j0716K371L43J681l84k977N609
7682A690m605j956Q087k793j691M016j78p549L962K112N208m799M622l615M147
7667F658M062l088o566L397j2117k560O404Q03j3775j144M499J976J344n595k227
7652a7929J919n342P102J9587l299o031j4383n268Q380N454K022M671j0259m830
$$ plain form
7638 -18206 -17263 -32879 -32483 -40527 -36295 -2889 9655 5380 3265 -2393 -10544 -6317 -5508 -11117 -8778
7623 -8778 -9340 -760 15285 13372 -2878 -6968 -8847 -16628 -3905 16987 17173 15484 16839 11934
7609 11934 5071 1713 6921 7227 231 -2946 -7573 -15684 -18829 -17801 -11621 -16312 -8779 -5155 -3712
7594 -3712 335 -5088 4817 19845 23836 25716 18559 12795 17917 8361 7048 11475 6144 -917 -8594
7579 -8594 -12524 -19432 -31524 -28784 -6777 -2604 1901 10056 8796 11928 16213 19702 17439 10447
7565 10447 9961 9634 -335 -9730 -11337 -27235 -12372 -5698 -16424 -19319 -10613 -7686 -12153 -5486
7551 -5486 -565 -7927 -3332 -5878 -20340 -10919 627 2089 3726 2713 -2103 343 8064 12612
7537 12612 7195 1210 -4527 -8848 -10669 -7828 7941 10290 -429 -13781 -20214 -15946 -16416 -15882
$$ packed form
7638a8206R43j5616L96q044M232L3406J2544m275k115n658q151M227Q09n609K339
7623h778n62Q580J6045j913j6250m090j879p781J2723K0892J86j689J355m905
7609A1934o863l358N208L06o996l177m627q111l145J028O180m691P533L624J443
7594c712M047n423R905J5028L991J880p157n764N122r556j313M427n331p061p677
7579h594l930o908j2092K740K2007M173M505Q155j260L132M285L489k263o992
7565A0447m86l27r969r395j607j5898J4863O674j0726k895Q706K927m467O667
7551e486M921p362M595k546j4462R421J1546J462J637j013m816K446P721M548
7537A2612n417n985n737m321j821K841J5769K349j0719j3352o433M268m70N34
$$ plain form
7523 -15882 1412 9329 9057 8914 5960 -5160 -16894 -15949 -13555 -16104 -24918 -28392 -19073 -18733 -7157
7508 -7157 -15998 -10206 -1102 -8075 -7316 3821 6325 3815 -520 285 4277 1013 -11157 -12920 -2788
7493 -2788 9325 10897 22659 20624 -3778 -2231 8537 11537 7856 7642 7524 11215 9652 4633
7479 4633 -1246 -4861 -16252 -6764 -3531 -14522 -20751 -22007 -10737 -13755 -17429 8632 14302 8818
7465 8818 21522 24846 7962 11329 19280 14727 -1040 -11692 -9634 -7948 -14891 -3270 16925
7452 16925 21344 5895 17708 32302 25665 15284 15186 29509 35997 18783 987 -10481 1577
7439 1577 11541 -2289 -11458 -9160 9090 22321 27811 29602 9836 2746 -7520 319 3993 -7078
7425 -7078 -4911 9621 9792 16269 14330 3266 5522 7832 -1387 -2494 -2284 -11823 -15033 -6792 -10879
$$ packed form
7523a5882J7294P917k72j43k954j1120j1734R45K394k549q814l474R319L40J1576
7508g157q841N792R104o973P59J1137K504k510m335Q05L992l264j2170j763J0132
7493b788J2113J572J1762k035k4402J547J0768L000l681k14j18L691j563n019
7479D633n879l615j1391R488L233j0991o229j256J1270l018l674K6061N670n484
7465H818J2704L324j6884L367P951m553j5767j0652K058J686o943J1621K0195
7452A6925M419j5449J1813J4594o637j0381r8J4323O488j7214j7796j1468J2058
7439A577R964j3830r169K298J8250J3231N490J791j9766p090j0266P839L674j1071
7425g078K167J4532J71O477j939j1064K256K310r219j107K10r539l210Q241m087
$$ plain form
7410 -10879 -23517 -26300 -24255 -27691 -29244 -27007 -14816 -1427 4019 13291 12216 -3884 -12470 -8593
7396 -8593 -2804 27370 37626 18921 7130 5552 7736 7652 -11653 -1471 -5182 -672 -8458 -13210
7382 -13210 -10170 -21669 -23738 -17366 -4953 -2213 -6994 5823 3180 -5651 -4036 -5989 -7250 -8865
7368 -8865 -29886 -33631 -29864 -24674 -24390 -19035 -11158 -5706 -7571 -12827 -10654 2760 8082 1644 -13906
7353 -13906 -4227 3418 902 10999 8739 -1689 -10881 -5118 7307 260 -2903 3600 4292 -1167
7339 -1167 3343 10251 -9141 -13990 -13577 -14011 -13301 -1183 -7062 1157 14548 10352 5964 -9494 -12602
7324 -12602 -6741 7319 2413 9004 12572 5604 17216 18814 5104 -6566 -5169 -17934 -22590
7311 -22590 -19260 -5120 8683 -455 -3287 4521 -5753 -4911 -4677 -6334 4245 8999 9837 3749
$$ packed form
7410a0879j2638k783K045l436j553K237J2191J3389N446R272j075j6100q586L877
7396h593N789L0174J0256j8705j1791j578K184q4j9305J0182l711M510p786m752
7382a3210L040j1499k069O372J2413K740m781J2817k643q831J615j953j261j615
7368h865k1021l745L767N190K84N355P877N452j865n256K173J3414N322o438j5550
7353a3906R679P645k516J0097k260j0428r192N763J2425p047l163O503O92n459
7339a167M510O908j9392m849M13m34P10J2118n879Q219J3391m196m388j5458l108
7324a2602N861J4060m906O591L568o968J1612J598j3710j1670J397j2765m656
7311b2590L330J4140J3803r138k832P808j0274Q42K34j657J0579M754Q38o088
$$ plain form
7297 3749 -8619 -21023 -11540 -1366 12417 12616 11805 7554 3293 4407 -1041 7509 14640 -2827
7283 -2827 -25634 -12473 4131 5532 269 13897 16771 13128 11636 6879 12069 20849 17656 8174
7269 8174 2770 -3955 -10283 -4008 -1638 1736 -1722 -7885 -11431 -13072 -17891 -10459 -1222 17379 21198
7254 21198 25052 9400 -3048 -8885 -12920 -1126 -1065 -1828 36 4697 5016 3431 -9352 -11439 -10774
7239 -10774 -11369 -16522 -34213 -33323 -27155 -19543 1394 3186 -1835 -2923 -1589 6978 6306 -5345 -12516
7224 -12516 -10420 -2149 -3914 -4516 -4109 5457 2543 -3213 -7448 -11731 -11460 -4073 -8350 -4200 416
7209 416 -10619 -13723 -13843 -1368 222 7231 17146 21284 10535 -8413 -5518 -2391 -636 -2449
7195 -2449 -9848 749 190 -13290 -10207 2620 9494 21461 16114 4202 -1253 -4781 -8524 -4182
$$ packed form
7297C749j2368j2404R483J0174J3783J99q11m251m261J114n448Q550P131j7467
7283b827k2807J3161J6604J401n263J3628K874l643j492m757N190Q780l193r482
7269H174n404o725o328O275K370L374l458o163l546j641m819P432R237J8601L819
7254B1198L854j5652j2448n837m035J1794O1p63J864M661L19j585j2783k087O65
7239a0774n95n153j7691Q90O168P612K0937J792n021j088J334Q567o72j1651p171
7224a2516K096Q271j765o02M07R566k914n756m235m283K71P387m277M150M616
7209D16j1035l104j20J2475J590P009R915M138j0749j8948K895L127J755j813
7195b449p399J0597n59j3480L083J2827O874J1967n347j1912n455l528l743M342
$$ plain form
7181 -4182 11493 8244 3856 -6361 -14915 -14583 -14974 -1949 5196 4209 18375 13485 -1252 -12697
7167 -12697 -6011 3112 -232 839 -3620 -9238 -1842 -9895 -8122 -6728 -17029 -11297 -3590 -16609
7153 -16609 -12727 -8221 -17684 -10171 3497 2320 -3367 -10453 -5120 -9757 -6024 -5108 -3211 -5026 12373
7138 12373 17021 3427 805 -4151 -7901 702 7901 7536 -1593 584 12687 23797 35051 15586
7124 15586 -8160 -12461 -7788 -3340 3098 5788 2521 -2485 7095 13976 24338 21060 13743 2949
7110 2949 -9083 -12464 53 1775 -6168 -17419 -12288 -9759 -1023 4092 6041 10972 4608 -2059
7096 -2059 17904 30715 26007 13578 6033 14124 16089 3303 7449 16296 11914 1325 -13271
7083 -13271 -17060 -15982 -6015 -8562 -11620 -7625 -12998 -3811 9479 11368 -835 2563 -487 -193
$$ packed form
7181d182J5675l249m388j0217q554L32l91J3025P145r87J4166m890j4737j1445
7167a2697O686R123l344J071m459n618P396q053J773J394j0301N732P707j3019
7153a6609L882M506r463P513J3668j177n687p086N333m637L733R16J897j815J7399
7138A2373M648j3594k622m956l750Q603P199l65r129K177J2103J1110J1254j9465
7124A5586k3746m301M673M448O438K690l267n006R580O881J0362l278p317j0794
7110B949j2032l381J2517J722p943j1251N131K529Q736N115J949M931o364o667
7096b059J9963J2811m708j2429p545Q091J965j2786M146Q847m382j0589j4596
7083a3271l789J078R967k547l058L995n373R187J3290J889j2203L398l050K94
$$ plain form
7069 -193 1587 -5364 -13645 -17922 -6872 3098 -9781 -4393 8035 12671 20454 9928 12431 24629
7055 24629 22446 -4898 2376 4283 -7028 -12314 -978 918 -2135 -611 690 6589 8779 -1514
7041 -1514 -7249 -10171 -15935 -14485 -12672 7025 8462 -3374 -5412 8903 4231 -634 -1404 -6833
7027 -6833 -7565 4338 19570 12823 5908 8401 7408 -1810 -5606 868 -5973 -11405 -2282 8899 3916
7012 3916 -14659 -27391 -32837 -38493 -35038 -8620 -790 -3046 -2537 -5896 -10442 -7759 1820 712
6998 712 -5435 -3623 -7112 -8226 15441 21726 15817 9213 2173 -4088 -10742 -8426 -4552 -4293 -1212
6983 -1212 -7304 -17707 -29118 -24595 -17989 -14062 -7609 7153 14725 27488 21744 7558 -6700
6970 -6700 -14766 -16573 -18764 -19972 -19652 -7424 6661 548 -12009 -8199 -10693 -17516 -22534 -26577
$$ packed form
7069a93J780o951q281m277J1050R970j2879N388J2428M636P783j0526K503J2198
7055B4629k183k7344P274J907j1311n286J1336J896l053J524J301N899K190j0293
7041a514n735k922n764J450J813J9697J437j1836k038J4315m672m865p70n429
7027f833p32J1903J5232o747o915K493r93r218l796O474o841n432R123J1181m983
7012C916j8575j2732n446n656L455K6418P830k256N09l359m546K683R579j108
6998G12o147J812l489j114K3667O285n909o604p040o261o654K316L874K59L081
6983a212o092j0403j1411M523O606L927O453J4762P572J2763n744j4186j4258
6970f700q066j807k191j208L20J2228J4085o113j2557L810k494o823n018m043
$$ plain form
6956 -26577 -20798 -14929 -8265 5388 12422 9516 13350 5321 582 -11128 -15281 -3362 -8664 -16751
6942 -16751 -8325 -2218 -3680 -7078 -13801 -15587 -13153 -17822 -21232 -28480 -31162 -13324 -6429 -15118
6928 -15118 -26583 -26069 -17160 -8358 2598 3066 366 7124 8199 1481 -4115 1223 7782 6825 -2455
6913 -2455 -9373 -10422 -800 3576 -2548 -11873 -18649 -9707 2541 3545 -15936 -26665 -23193 -14927
6899 -14927 -4590 -395 -9883 -14847 -15670 -11638 -8627 3272 1320 -545 -2816 -5301 7272 18272
6885 18272 14058 4878 2632 605 1845 994 710 15391 12783 9613 21248 16112 13242 4041 6488
6870 6488 18322 17502 13905 2445 3478 17635 6321 -3967 -15544 -11400 -10349 -25940 -13734
6857 -13734 -5141 -13515 -44 -3560 -2692 -7075 -9421 -17675 -9937 2672 13819 11985 -500 -5732
$$ packed form
6956b6577N779N869O664J3653P034k906L834q029m739j1710m153J1919n302q087
6942a6751Q426O107j462l398o723j786K434m669l410p248k682J7838O895q689
6928a5118j1465N14Q909Q802J0956M68k700O758J075o718n596N338O559r57r280
6913b455o918j049R622M376o124r325o776Q942J2248J004j9481j0729L472Q266
6899a4927J0337M195r488m964q23M032L011J1899j952j865k271k485J2573J1000
6885A8272m214r180k246k027J240q51k84J4681k608l170J1635n136k870r201K447
6870F488J1834q20l597j1460J033J4157j1314j0288j1577M144J051j5591J2206
6857a3734Q593q374J3471l516Q68m383k346q254P738J2609J1147j834j2485n232
$$ plain form
6843 -5732 -9047 -9275 7734 5828 -25 -2433 -2319 13106 29366 17592 6082 -396 605 6344
6829 6344 18648 22666 14734 20241 7342 -12420 -15162 -10251 -3984 4655 3622 -15632 -19216 466
6815 466 7606 1393 -4004 -8013 -8685 -3029 -7481 -2554 -5733 -908 420 12061 1030 -16638 -6514
6800 -6514 4695 -3580 -7968 1837 8000 4309 4389 9618 14169 9949 -5263 -1855 7553 16029 6351
6785 6351 -6897 -4229 -2715 -3337 2223 -1411 6922 3017 -8142 -14884 -24878 -11591 -17592 -11670
6771 -11670 8318 7999 1814 3206 1329 -16452 -26907 -19672 -8337 -12765 -14848 -13640 6445 26335
6757 26335 21428 9418 7953 2703 -5013 -11141 -14906 -17099 -13823 1528 5692 -1896 -10493 -18496
6743 -18496 -24185 -12352 10668 6022 -1809 -10068 -20818 -20292 -2391 7730 6724 1829 5719 7056
$$ packed form
6843e732l315k28J7009j906n853k408J14J5425J6260j1774j1510o478J001N739
6829F344J2304M018p932N507j2899j9762k742M911O267Q639j033j9254l584J9682
6815D66P140o213n397m009o72N656m452M927l179M825J328J1641j1031j7668J0124
6800f514J1209q275m388R805O163l691Q0N229M551m220j5212L408R408Q476r678
6785F351j3248K668J514o22N560l634Q333l905j1159o742r994J3287o001N922
6771a1670J9988l19o185J392j877j7781j0455P235J1335m428k083J208K0085J9890
6757B6335m907j2010j465n250p716o128l765k193L276J5351M164p588q597q003
6743a8496n689J1833K3020m646p831q259j0750N26J7901J0121j006m895L890J337
$$ plain form
6729 7056 -1505 5999 12563 10026 10119 34302 57284 62071 51540 48345 40157 17937 -9717 -10123
6715 -10123 126 24 8853 11544 9122 8105 2251 -6103 -7747 -660 5349 14316 17619 7257
6701 7257 17180 24576 15965 5870 -4765 -1975 6961 3788 8736 11421 205 -4599 -12571 -4736
6687 -4736 -1549 7249 11410 -1134 -1010 9595 7204 16883 26184 29558 10394 -9844 -25542 -23117
6673 -23117 -13597 -1569 2906 2600 -3097 -8467 -15469 -15569 -10758 -12686 -21787 -17734 -1048 -3496 -3214
6658 -3214 806 -9395 -15133 -13018 -5928 -580 1475 -2077 -7578 -10624 400 -6223 -16747 -9153
6644 -9153 -10599 -28644 -23527 -14511 -5311 1303 16887 12159 9311 13102 19916 12271 -7624 -29063
6630 -29063 -24030 -7767 -4643 -14343 -20374 -24651 -14027 -1463 11783 15834 13633 8884 6856 10214
$$ packed form
6729G056q561P504O564k537R3K4183K2982M787j0531l195q188k2220k7654m06
6715a0123J0249j02Q829K691k422j017n854q354j644P087O009Q967L303j0362
6701G257R923P396q611j0095j0635K790Q936l173M948K685j1216m804p972P835
6687d736L187Q798M161j2544J24J0605k391R679R301L374j9164k0238j5698K425
6673b3117R520J2028M475l06n697n370p002j00M811j928r101M053J6686k448K82
6658c214M020j0201n738K115P090N348K055l552n501l046J1024o623j0524P594
6644i153j446j8045N117R016R200O614J5584m728k848L791O814p645j9895k1439
6630b9063N033J6263L124r700o031m277J0624J2564J3246M051k201m749k028L358
$$ plain form
6616 10214 13393 9452 11822 17655 17283 7052 -3634 -10255 -5502 -4139 -2464 3475 -127 -6346
6602 -6346 -17991 -28306 -34567 -23185 -18286 -20501 -708 1975 554 -1374 -5738 -6696 -13719 -16215
6588 -16215 -22657 -26368 -20019 -7230 -10901 -12716 -9691 -18324 -14540 3311 3752 3960 1961 5608 -9281
6573 -9281 -14125 -11841 -5318 -15227 -13612 -9835 2355 -2608 -867 5728 -4523 -23611 -23815 -23283 -16479
6558 -16479 -11016 -5379 3509 15387 7602 3164 -4129 -10974 -22567 -31233 -24319 -5385 -4350 -3632
6544 -3632 4269 788 -2469 -6008 -1805 2688 7245 4587 22691 27454 16252 21558 12631 -6689
6530 -6689 -10561 -2419 -2086 -10936 -4105 -2435 -5936 6933 2779 1386 -1413 -11334 -3537 79 -919
6515 -919 -4537 -9566 -8451 -8880 -12404 -11171 -7288 -14676 -8173 3294 -2030 -18107 -24007 -19515 -8384
$$ packed form
6616A0214L179l941K370N833l72j0231j0686o621M753J363J675N939l602o219
6602f346j1645j0315o261J1382M899k215J9793K683j421j928m364r58p023k496
6588a6215o442l711O349J2789l671j815L025q633L784J7851M41K08j999L647j4889
6573i281m844K284O523r909J615L777J2190m963J741O595j0251j9088k04N32O804
6558a6479N463N637Q888J1878p785m438p293o845j1593q666O914J8934J035P18
6544c632P901l481l257l539M203M493M557k658J8104M763j1202N306q927j9320
6530f689l872Q142L33q850O831J670l501J2869m154j393k799r921P797L616r98
6515i19l618n029J115m29l524J233L883p388O503J1467n324j6077n900M492J1131
$$ plain form
6500 -8384 -348 23701 24270 14065 529 -7565 -19536 -35261 -28644 -13827 6316 18236 9523
6487 9523 2846 -8625 -14953 -23814 -25376 -20906 -29250 -24700 -7366 -8924 -7450 50 -11727 -9560
6473 -9560 888 7129 43 -6540 -902 3828 -14037 -8239 -2401 -9288 -17816 -7120 1512 2073
6459 2073 7145 3503 2050 -6726 -5467 11372 20937 22885 11267 11209 12932 8676 800 -1328 7341
6444 7341 26256 35028 27491 20383 8025 4750 9935 6353 -3311 -11939 -16205 -10382 -6609 1748
6430 1748 -1012 -6840 -2992 11946 12874 4441 126 -9388 4947 7954 6047 1471 -10765 -13575
6416 -13575 -8754 6265 23055 14489 8390 -2119 -10580 -19166 -22396 -19687 -16200 -16920 -17690 -17939 -10526
6401 -10526 1221 2970 -1737 -8651 4277 20164 32817 38772 33364 22810 11423 -1349 -18683
$$ packed form
6500h384Q036K4049N69j0205j3536q094j1971j5725O617J4817K0143J1920q713
6487I523o677j1471o328q861j562M470q344M550J7334j558J474P500j1777K167
6473i560J0448O241p086o583N638M730j7865N798N838o887q528J0696Q632N61
6459B073N072l642j453q776J259J6839R565J948j1618n8J723m256p876k128Q669
6444G341J8915Q772p537p108j2358l275N185l582r664q628m266N823L773Q357
6430A748k760n828L848J4938R28q433m315r514J4335L007j907m576j2236k810
6416a3575M821J5019J6790q566o099j0509q461q586l230K709L487p20p70k49P413
6401a0526J1747J749m707o914J2928J5887J2653N955n408j0554j1387j2772j7334
$$ plain form
6388 -18683 -2853 -13392 -23637 -10983 -4537 -5480 3817 17388 21691 17160 16773 8023 15519 18543
6374 18543 4833 881 14838 15774 1012 -12104 -17357 -14315 -12845 -2121 -6623 755 1525 2403
6360 2403 -1039 10424 6091 -7789 -8250 -2877 14569 16570 1927 -7715 -8320 -7890 -22609 -20697
6346 -20697 -5582 -8893 -12540 -6395 220 9844 11919 -1198 2367 9346 8093 11269 19180 9497
6332 9497 -3891 8359 23919 31471 16421 3900 1968 -3438 -27462 -29787 -22709 -16168 -15942 -15584
6318 -15584 -17946 -17029 -26104 -22279 439 6086 1807 5195 7721 -1168 -2663 1617 -1184 -825 1934
6303 1934 13364 3813 -3808 2539 6726 5240 -2853 4446 1859 2603 5727 -1768 -11474 -15881 -15464
6288 -15464 -16941 -13742 -7335 -13085 -18958 1604 -9978 -25447 -18962 -7645 -1860 -5652 -14348 -22636
$$ packed form
6388a8683J5830j0539j0245J2654O446r43R297J3571M303m531l87q750P496L024
6374A8543j3710l952J3957R36j4762j3116n253L042J470J0724m502P378P70Q78
6360B403l442J1463m333j3880m61N373J7446K001j4643r642o05M30j4719J912
6346b0697J5115l311l647O145O615R624K075j3117L565O979j253L176P911r683
6332I497j3388J2250J5560P552j5050j2521j932n406k4024k325P078O541K26L58
6318a5584k362R17r075L825K2718N647m279L388K526q889j495M280k801L59K759
6303A934J1430r551p621O347M187j486q093P299k587P44L124p495r706m407M17
6288a5464j477L199O407n750n873K0562j1582j5469O485J1317N785l792q696q288
$$ plain form
6274 -22636 -22166 -30682 -22163 -13415 849 10023 5490 8698 8700 -6317 -29352 -33361 -26749 -20216 -18812
6259 -18812 -14827 -27788 -25687 -28558 -19798 3488 3969 63 -1085 4312 4252 1398 3209 6748 13372
6244 13372 7825 -14878 -24116 -11651 -2873 -1419 629 17403 11437 9618 8171 13928 13518 7969
6230 7969 15077 14637 14030 10536 7896 8051 12422 -7158 -16946 -10526 -4421 -1753 7364 5096 -1289
6215 -1289 797 -1553 -13351 -25594 -14473 -2706 -5733 -3342 -450 4609 -12433 -20029 -15173 -15089
6201 -15089 -14558 -5960 14234 26147 23012 6389 -2068 -4811 -5691 -16097 -14526 -2955 761 4759
6187 4759 5025 2531 -4593 -4042 6156 17015 13797 11639 20095 12396 -7464 -3847 949 -142 -3823
6172 -3823 -661 -4204 -25100 -21616 -3663 3288 4029 1982 -2416 4166 3943 3558 896 5801 3041
$$ packed form
6274b2636M70q516Q519Q748J4264R174m533L208Kj5017k3035m009O612O533J404
6259a8812L985j2961K101k871Q760K3286M81l906j148N397o0k854J811L539O624
6244A3372n547k2703r238J2465Q778J454K048J6774n966j819j447N757m10n549
6230G969P108m40o07l494k640J55M371j9580r788O420O105K668R117k268o385
6215a289K086k350j1798j2243J1121J1767l027K391K892N059j7042p596M856Q4
6201a5089N31Q598K0194J1913l135j6623q457k743q80j0406J571J1571L716L998
6187D759K66k494p124N51J0198J0859l218k158Q456p699j9860L617M796j091l681
6172c823L162l543k0896L484J7953O951P41k047m398O582k23l85k662M905k760
$$ plain form
6157 3041 -7706 -20332 -20896 -20226 -15286 -9968 -20059 -36240 -21477 -5356 -11726 -17638 -15487 -12159
6143 -12159 -16194 -1707 -8448 -6639 -3406 -6124 -9041 -8480 -15412 -14612 -6442 -12182 -7276 8739 11458
6128 11458 152 -1146 10181 -66 -16483 -14744 -16717 -14775 5496 1207 830 2775 5322 7958
6114 7958 10921 -4153 -9918 -3779 -17217 -14071 -16820 -15135 -21087 -24250 -16170 -17783 -28706 -17573
6100 -17573 -10192 -2285 -3111 -11081 -15254 -10462 -13224 -16966 -24317 -29601 -32247 -33391 -23307 -21031 -25620
6085 -25620 -31888 -27100 -20241 -26063 -25588 -18405 -13998 5655 5865 4437 3747 -622 18571 27049 22566
6070 22566 5525 -17498 -14738 -22841 -33472 -31359 -21164 -24704 -13692 -22176 -17925 -7606 -4718
6057 -4718 -12481 -8707 -4602 -6172 -17074 -20653 -29957 -25183 2025 3283 -568 -11396 -3881 17449
$$ packed form
6157C041j0747j2626n64O70M940N318j0091j6181J4763J6121o370n912K151L328
6143a2159m035J4487o741J809L233k718k917N61o932Q00Q170n740M906J6015K719
6128A1458j1306j298J1327j0247j6417J739j973J942K0271m289l77J945K547K636
6114G958K963j5074n765O139j3438L146k749J685n952l163Q080j613j0923J1133
6100a7573P381P907q26p970m173M792k762l742p351n284k646j144J0084K276m589
6085b5620o268M788O859n822M75P183M407J9653K10j428o90m369J9193Q478m483
6070B2566j7041k3023K760q103j0631K113J0195l540J1012q484M251J0319K888
6057d718p763L774M105j570j0902l579r304M774K7208J258l851j0828P515K1330
$$ plain form
6043 17449 25113 19179 -3124 -12782 -20202 -15659 -16026 -22620 -23567 -15833 -15103 -25712 -15333 -4289
6029 -4289 -15371 -12476 -22413 -21123 -19210 -13683 -12827 -6188 2321 -2127 -5953 -9491 -9309 -1361 -4487
6014 -4487 -2928 -11340 -27137 -26681 -21800 -15686 -10209 -16636 -11998 581 10389 12383 7348 4046 6944
5999 6944 15404 13296 5741 3802 11789 10140 8259 13756 -5311 -19184 -21907 -13043 -424 -753
5985 -753 -13050 -11756 -3980 -5153 -5841 -1921 1232 4049 13271 8308 -9536 -11030 -7800 -5396 -6345
5970 -6345 -10841 170 -1788 -11070 -16961 -10492 -2478 -11049 -4035 -24999 -21480 -19182 -21125 -20754 -18207
5955 -18207 -8286 -10478 -6708 3091 14867 13251 1433 1255 2409 -7846 -4939 2168 -3336 -2832
5941 -2832 -11907 -13540 -12225 -17120 -17396 -14859 -19928 -12307 -17055 -19839 -14338 -2485 -852 8756 1531
$$ packed form
6043A7449P664n934k2303r658p420M543l67o594r47P734P30j0609J0379J1044
6029d289j1082K895r937J290J913N527Q56O639Q509m448l826l538J82P948l126
6014d487J559q412j5797M56M881O114N477o427M638J2579R808J994n035l302K898
5999F944Q460k108p555j939P987j649j881N497j9067j3873k723Q864J2619l29
5985g53j2297J294P776j173o88L920L153K817R222m963j7844j494L230K404r49
5970f345m496J1011j958r282n891O469Q014q571P014k0964L519K298j943L71K547
5955a8207R921k192L770R799J1776j616j1818j78J154j0255K907P107n504N04
5941b832r075j633J315m895k76K537n069P621m748k784N501J1853J633R608p225
$$ plain form
5926 1531 3854 7309 14457 17103 8924 -19884 -32067 -24881 -12313 -5143 2264 -10862 -15322 -17089
5912 -17089 -17312 -15125 -18586 -20426 -9459 -25131 -9635 -890 -19628 -31666 -18942 4883 5090
5899 5090 -5104 -13925 -15513 -7702 -2515 -5290 -7548 -2190 4557 6618 1048 -5244 -11477 -24049
5885 -24049 -20933 -4563 3440 852 -7031 -3217 -5656 -12332 -4308 -5469 -8474 4314 24124 27745
5871 27745 21257 15072 5100 1996 -9032 -18366 -8564 9547 16367 28000 28462 28107 28909 24806 24223
5856 24223 13297 14116 18568 8707 -1704 -191 -334 4691 3378 -10203 -11813 -17417 -11724 -11291 -6346
5841 -6346 -9686 -11048 -5289 -1050 -11379 -7689 4474 -192 615 10418 8025 2635 -5387 -19268
5827 -19268 -7872 2332 -7972 -14197 -18655 -12051 -2862 -2107 -15868 -20039 -19719 -24691 -29997 -14265
$$ packed form
5926A531K323L455P148K646q179k8808j2183P186J2568P170P407j3126m460j767
5912a7089k23K187l461j840J0967j5672J5496Q745j8738j2038J2724K3825K07
5899E090j0194q821j588P811N187k775k258N358O747K061n570o292o233j2572
5885b4049L116J6370Q003k588p883L814k439o676Q024j161l005J2788J9810L621
5871B7745o488o185r972l104j1028r334R802J8111O820J1633M62l55Q02m103n83
5856B4223j0926Q19M452r861j0411J513j43N025j313j3581j610n604N693M33M945
5841f346l340j362N759M239j0329L690J2163m666Q07R803k393n390q022j3881
5827a9268J1396J0204j0304o225m458O604R189P55j3761m171L20m972n306J5732
$$ plain form
5813 -14265 -13644 -18776 -16203 -20581 -11297 766 11325 8543 1663 4726 7225 6114 6955 4340 -2781
5798 -2781 -18554 -37143 -21432 -3445 -8956 -8098 -17928 -32872 -16285 -6686 -1702 3629 5361 9343
5784 9343 17497 10242 7709 -2482 -10096 -8980 -1794 250 -3068 3279 467 -13993 -23614 -24550 -20282
5769 -20282 -32760 -36745 -24224 -15484 -20510 -28281 -37333 -21380 -11004 -11962 1394 16859 17577 13727
5755 13727 7922 27 -6680 -8673 -22047 -21578 -3054 13017 16373 13623 6203 -4187 -3826 -2107
5741 -2107 -13712 -26303 -19496 -17767 -9210 -42 14342 11260 2428 -7098 -8904 -9591 6587 8174
5727 8174 8651 -2605 -3018 -3639 -10570 -8593 -5768 -2007 -5693 -9052 -9456 -2154 -1926 -252 3850 -5751
5711 -5751 -5211 5674 20741 19865 10320 -1008 -5068 -9454 -9967 -6616 5942 10030 1201 -1249 4281
$$ packed form
5813a4265O21n132K573m378R284J2063J0559k782o880L063K499j111Q41k615p121
5798b781j5773j8589J5711J7987n511Q58r830j4944J6587R599M984N331J732L982
5784I343Q154p255k533j0191p614J116P186K044l318O347k812j4460r621r36M268
5769b0282j2478l985J2521Q740n026p771r052J5953J0376r58J3356J5465P18l850
5755A3727n805p895o707j993j3374M69J8524J6071L356k750p420j0390L61J719
5741b107j1605j2591O807J729Q557R168J4384l082q832r526j806o87J6178J587
5727H174M77j1256m13o21o931J977K825L761l686l359m04P302K28J674M102r601
5711e751N40J0885J5067q76r545j1328m060m386n13L351J2558M088q829k450N530
$$ plain form
5696 4281 -5044 -10329 -13130 -14360 -8729 -17283 -18107 -15131 -2566 -10326 -18076 -13971 -9463 -16872 -17388
5681 -17388 -23851 -31393 -25566 -23535 -27869 -31695 -13492 -2287 -8312 3437 -709 -18847 -29366
5668 -29366 -25475 -2056 2150 -1402 -4565 -23689 -32007 -26489 -17173 -13962 -24411 -22661 -6737 3296
5654 3296 -454 -6084 4 7103 11540 2243 -11809 -29334 -28980 -19861 -20735 -10284 -6202 -12959 -25189
5639 -25189 -14433 4473 8881 6093 -1310 2814 -5841 -17622 -23205 -20893 -17118 -9245 1389 -3044
5625 -3044 -2839 -2372 3759 748 -17933 -11843 163 2221 14353 9526 1144 -264 272 -9705 -10377
5610 -10377 -1244 13219 13863 -987 -8851 -18961 -11454 -4049 11764 24505 14915 6837 -153 -9407
5596 -9407 -13819 -11056 -12173 -10717 -15962 -10395 270 -229 -4989 -10995 -10098 2455 12365 16872 20176
$$ packed form
5696D281r325n285k801j230N631q554q24K976J2565p760p750M105M508p409n16
5681a7388o463p542N827K031m334l826J8203J1205o025J1749m146j8138j0519
5668b9366L891K3419M206l552l163j9124q318N518R316L211j0449J750J5924J0033
5654C296l750n630O088P099M437r297j4052j7525L54R119q74J0451M082o757j2230
5639b5189J0756J8906M408k788p403M124q655j1781n583K312L775P873J0634m433
5625c044K05M67O131l011j8681O090J2006K058J2132m827q382j408N36r977o72
5610a0377R133J4463O44j4850p864j0110P507P405J5813J2741r590q078o990r254
5596i407m412K763j117J456n245N567J0665m99m760o006Q97J2553R910M507L304
$$ plain form
5581 20176 20411 8935 -11773 -23329 -12532 -4338 5889 4356 -703 -10064 -6091 -847 7175 6707
5567 6707 424 -9064 -15470 -14665 -7319 -4146 -8636 -13924 -20496 -4608 -5742 -6127 -12858 -14394 -3252
5552 -3252 -2974 4596 984 3980 -1419 7159 7523 -3401 -10196 -7618 -13862 -17460 -14628 -6870 -1862
5537 -1862 -11699 -16526 -10379 -13638 -25835 -33297 -25758 -11015 2576 -7113 -26988 -17077 -14209 -13794
5523 -13794 -23553 -18063 -9829 -10266 -18289 -18924 -14371 -20479 -19290 -8458 -415 -2575 15655 14690 11489
5508 11489 -3493 -1594 -11279 -21132 -7510 -3018 4800 780 9156 20276 20714 26777 26100 20147
5494 20147 19734 11955 7225 16634 13763 690 -3972 -3664 -10999 -15767 -16050 -15665 -1613 1902 3366
5479 3366 -4013 -12587 -14453 -19193 -29229 -23746 -19094 -8346 -4136 -4844 -1392 -715 630 -5282 1067
$$ packed form
5581B0176K35j1476k0708j1556J0797Q194J0227j533n059r361L973N244Q022m68
5567F707o283r488o406Q05P346L173m490n288o572J5888j134l85o731j536J1142
5552c252K78P570l612K996n399Q578L64j0924o795K578o244l598K832P758N008
5537a862r837m827O147l259j2197p462P539J4743J3591r689j9875R911K868M15
5523a3794r759N490Q234m37q023o35M553o108J189J0832Q043k160J8230r65l201
5508A1489j4982J899r685r853J3622M492P818m020Q376J1120M38O063o77n953
5494B0147m13p779m730R409k871j3073m662L08p335m768k83L85J4052L515J464
5479C366p379q574j866m740j0036N483M652J0748M210p08L452O77J345n912O349
$$ plain form
5464 1067 5086 2405 -7976 -13679 -9530 -14973 -9078 -6909 -2007 3732 13365 9996 -5363 -8934
5450 -8934 -11507 -24009 -22617 -18737 -27090 -35877 -37869 -30574 -21650 -24415 -16082 -10042 -4530 -25413
5436 -25413 -22691 -12900 -11313 -8699 -2268 1489 -15051 -24214 -16370 -17890 -5322 -2283 -18087 -16877
5422 -16877 -8660 -4664 373 -5931 -3808 4556 -14394 -31797 -38344 -18292 -7250 -10223 -18398 -17918
5408 -17918 -12632 6302 7698 3987 -1253 3834 -4763 -20568 -23125 -23755 -6303 -1815 -8071 -15589
5394 -15589 -6296 -15686 -30091 -25035 -23263 -31542 -33377 -23493 -12882 -10558 -12152 -20350 -17875 -13524
5380 -13524 -19560 -21913 -5626 -2854 -10992 -15573 -16170 -18528 -24041 -28989 -20889 -20497 -11110 -11720 -16384
5365 -16384 -15866 -16911 -4006 1683 19270 18751 19533 5151 -7905 -9590 26 -1770 3406 9070
$$ packed form
5464A067M019k681j0381n703M149n443N895K169M902N739R633l369j5359l571
5450h934k573j2502J392L880q353q787j992P295Q924k765Q333O040N512k0883
5436b5413K722R791J587K614O431L757j6540r163P844j520J2568L039j5804J210
5422a6877Q217L996N037o304K123Q364j8950j7403o547K0052J1042k973q175M80
5408a7918N286J8934J396l711n240N087q597j5805k557o30J7452M488o256p518
5394a5589R293r390j4405N056J772q279j835R884J0611K324j594q198K475M351
5380a3524o036k353J6287K772q138m581n97k358n513m948Q100L92R387o10m664
5365a6384N18j045J2905N689J7587n19P82j4382j3056j685R616j796N176N664
$$ plain form
5351 9070 10382 14454 9686 2285 575 176 2231 -3836 -4028 -4727 1401 2430 6950 1728 -15452
5336 -15452 -16488 -8185 4059 1211 -12210 -9945 -10479 -11526 -11650 -20817 -31801 -38252 -27437 -12821
5322 -12821 -17784 -18552 -6054 13288 7694 -5553 7431 821 4243 7130 8132 362 3335 -1989
5308 -1989 -3500 -4571 1781 1481 2030 134 -2012 10959 18368 2594 -7490 -13723 -13749 1019 -5107
5293 -5107 -8645 -119 6301 4346 6444 2131 -4366 -15133 -21320 -8672 -2139 -7506 385 -4840
5279 -4840 -16712 -15529 -3709 -17938 -12325 -18498 -24044 -19187 -14696 -19715 -15561 -26663 -34069 -11466
5265 -11466 -9576 -21147 -24943 -18442 -10242 4122 2267 12863 9070 -544 -10795 -16105 -12388 -8481
5251 -8481 -23590 -25821 -17508 -3780 10558 19486 13990 16819 17520 9623 319 -9766 -7456 -20720
$$ packed form
5351I070J312M072m768p401j710l99K055o067j92o99O128J029M520n222j7180
5336a5452j036Q303J2244k848j3421K265n34j047j24r167j0984o451J0815J4616
5322a2821m963p68J2498J9342n594j3247J2984o610L422K887J002p770K973n324
5308a989j511j071O352l00N49j896k146J2971P409j5774j0084o233k6J4768o126
5293e107l538Q526O420j955K098m313o497j0767o187J2648O533n367P891n225
5279d840j1872J183J1820j4229N613o173n546M857M491n019M154j1102p406K2603
5265a1466J890j1571l796O501Q200J4364j855J0596l793r614j0251n310L717L907
5251h481j5109k231Q313J3728J4338Q928n496K829P01p897r304j0085K310j3264
$$ plain form
5237 -20720 -23114 -4585 -12214 -22604 -27442 -17291 -1068 5751 5956 -4131 979 6202 8910 6271
5223 6271 -1741 -9625 -9759 -2303 2642 2730 5142 10611 7799 14689 14159 9309 -10671 -14117 -12702 -15775
5207 -15775 -18393 -24242 -18796 -21091 -19662 -20385 -5069 -15502 -22906 -18912 -11961 451 18683 27124
5193 27124 18676 22936 24394 32291 32774 24827 16488 8037 -1561 -4936 50 -7609 -23325 -17478 -3772
5178 -3772 -2835 -725 1764 -19164 -18370 -3141 -2895 -2457 -9895 -574 11017 10676 16385 14584 20060
5163 20060 25788 20754 9605 4047 10455 10109 6544 5095 -2661 -5121 -1492 8786 11170 4085
5149 4085 -2390 6216 14322 24637 23168 4327 -233 305 4704 7917 841 -3106 -3254 -860 7155
5134 7155 12011 5307 9794 9628 -5849 -2484 9249 14350 16442 12639 -1553 -14535 -28071 -29787
$$ packed form
5237b0720k394J8529p629j0390m838J0151J6223O819K05j0087N110N223K708k639
5223F271q012p884j34P456M945Q8K412N469k812O890n30m850j9980l446J415l073
5207a5775k618n849N446k295J429p23J5316j0433p404L994O951J2412J8232Q441
5193B7124q448M260J458P897M83p947q339q451r598l375M986p659j5716N847J3706
5178c772R37K110K489k0928P94J5229K46M38p438R321J1591l41N709j801N476
5163B0060N728n034j1149n558O408l46l565j449p756k460L629J0278K384p085
5149D085o475Q606Q106J0315j469j8841m560N38M399L213p076l947j48K394Q015
5134G155M856o704M487j66j5477L365J1733N101K092l803j4192j2982j3536j716
$$ plain form
5120 -29787 -12011 2381 19370 19079 5206 1924 2027 -3603 -11138 -9443 6834 19501 18873 -5392
5106 -5392 -6213 -1679 -6346 -2372 -5882 -9175 -15912 -13746 -14547 -4143 -941 -6629 -1995 19919 9199
5091 9199 9679 16901 9191 -3759 -9421 -5386 -2420 -16997 -31725 -25760 -19816 -6075 4418 244
5077 244 -26960 -27945 -13674 -18161 -31242 -37489 -24658 -12096 -6206 -724 3949 4207 -5140 -4097
5063 -4097 -3102 -11838 -19726 -12139 3546 3433 -3664 -6964 -1666 -12665 -11893 -2193 11767 13470 2376
5048 2376 -687 12341 19494 10796 -2247 -7598 -7087 -7599 -13941 -18667 -21707 -27088 -18756 -20195 -12411
5033 -12411 1057 7697 7840 10850 12640 23764 29023 16116 1826 -4817 4842 3711 2547 5543
5019 5543 8330 5196 2654 -4491 -14473 -19890 -11738 -2652 -5364 -10844 -5612 -3837 -3154 -4882 -8112
$$ packed form
5120b9787J7776J4392J6989k91j3873l282J03n630p535J695J6277J2667o28k4265
5106e392q21M534m667L974l510l293o737K166q01J0404L202n688M634K1914j0720
5091I199M80P222p710j2950n662M035K966j4577j4728N965N944J3741J0493m174
5077B44k7204r85J4271m487j3081o247J2831J2562N890N482M673K58r347J043
5063d097R95q736p888P587J5685j13p097l300N298j0999P72R700J3960J703j1094
5048B376l063J3028P153q698j3043n351N11n12o342m726l040n381Q332j439P784
5033a2411J3468O640J43L010J790J1124N259j2907j4290o643R659j131j164K996
5019E543K787l134k542p145r982n417Q152R086k712n480N232J775O83j728l230
$$ plain form
5004 -8112 -9085 8887 9172 1951 -6699 -14561 -17396 -3691 -7173 -1729 4706 -3785 -7257 -7262 -9361 -15150
4988 -15150 -16213 -28145 -28675 -7916 1427 -3665 -10602 -16108 -9106 8109 5132 -6009 -8280 -14132
4974 -14132 -15186 -1448 19863 23537 15967 9341 2116 -1848 -9289 -18841 -17868 -27547 -26218 -12946
4960 -12946 -13723 -10979 -3084 -324 3084 11096 6462 2029 -168 -842 -14704 -18765 -4816 -3296 7649
4945 7649 5816 -11760 -19841 -21201 -2416 2831 -2623 -14482 -23492 -21975 -24365 -17535 -8635 -847
4931 -847 -6268 -15918 -18762 -23892 -13145 -6644 -22830 -34037 -34053 -24004 -20862 -11069 7644 8085 -588
4916 -588 -11695 -16122 -13335 -8988 -11744 8128 6406 -4579 -7002 -10299 -1469 4494 12084 16670
4902 16670 5850 -4469 -20234 -19297 -21799 -10988 -9209 -5448 3531 9652 12334 21808 15793 22955
$$ packed form
5004h112r73J7972K85p221q650p862k835J3705l482N444O435q491l472nk099n789
4988a5150j063j1932n30K0759R343n092o937n506P002J7215k977j1141k271n852
4974a4132j054J3738K1311L674p570o626p225l964p441r552R73r679J329J3272
4960a2946p77K744P895K760L408Q012m634m433k197o74j3862m061J3949J520J0945
4945G649j833j7576q081j360J8785N247n454j1859r010J517k390O830Q900P788
4931h47n421r650k844n130J0747O501j6186j1207j6J0049L142R793J8713M41q673
4916e88j1107m427K787M347k756J9872j722j0985k423l297Q830N963P590M586
4902A6670j0820j0319j5765R37k502J0811J779L761Q979O121K682R474o015P162
$$ plain form
4888 22955 28340 3191 1953 15160 6370 1257 -9448 -5748 -2318 -9206 -13553 -6986 635 3058
4874 3058 -8974 -33065 -37307 -37059 -20765 -10475 -15416 -23527 -30739 -23554 -12149 -17960 -21608 -16608
4860 -16608 -10078 -9007 -2449 1809 -1654 -2570 -1897 -3271 9428 4985 6222 6154 -979 -8334 -8484 -9810
4844 -9810 -6872 -4087 8662 10425 -2310 -7516 -3811 -7085 2933 982 -2739 -8895 -255 9619
4830 9619 5304 13209 19153 15130 -956 4432 8520 8574 -3761 -10088 -6434 -78 3830 5360 12064
4815 12064 2185 -13027 -9474 -5355 2612 -1177 489 926 7685 14171 11227 15684 13887 3234
4801 3234 -8840 -5370 -1895 -6777 -690 4267 2896 728 8194 14380 20453 10642 8549 6660 2676
4786 2676 5051 5892 -7360 -5230 -13252 -16496 -20981 -28263 -17809 -4803 5309 6788 9409 12454
$$ packed form
4888B2955N385k5149j238J3207q790n113j0705L700L430o888m347O567P621K423
4874C058j2032k4091m242K48J6294J0290m941q111p212P185J1405n811l648N000
4860a6608O530J071O558M258l463r16O73j374J2699m443J237o8p133p355j50j326
4844i810K938K785J2749J763j2735n206L705l274J0018j951l721o156Q640R874
4830I619m315P905N944m023j6086N388M088N4j2335o327L654O356L908J530O704
4815A2064r879j5212L553M119P967l789J666M37O759O486k944M457j797j0653
4801C234j2074L470L475m882O087M957j371k168P466O186O073r811k093j889l984
4786B676K375Q41j3252K130q022l244m485p282J0454J3006J0112J479K621L045
$$ plain form
4772 12454 13298 16001 8402 6750 15241 5311 -5296 -7428 -3798 -10792 -14248 -25984 -22427 -6613
4758 -6613 7787 8981 13894 10639 5364 -6530 -9637 -13650 -8967 -1057 -11247 -24927 -13336 9256
4744 9256 16762 17509 14865 24722 20269 10851 8758 7218 11733 23373 30052 18094 6310 1426
4730 1426 308 -2296 -7276 -9350 4769 23012 11708 11250 3038 -3882 -2157 136 -1651 6348
4716 6348 2258 464 -1989 397 -2106 5720 -941 -6125 3752 12190 1232 5005 4430 -13594 -23667
4701 -23667 -20817 -18434 -12602 -9096 -11142 -6162 -4382 -7525 -7665 -5233 -15231 -2676 -4552 -6246 -2420
4686 -2420 -24723 -27090 -15279 -10254 -13994 -13267 -22701 -19516 -11461 -11705 3071 4324 3930 121 -6147
4671 -6147 -10597 -15419 -4628 -4014 -12842 -2856 6579 4500 669 -11072 -27773 -41385 -37899 -20358
$$ packed form
4772A2454Q44K703p599j652Q491r930j0607k132L630o994l456j1736L557J5814
4758f613J4400J194M913l255n275j1894l107m013M683P910j0190j3680J1591K2592
4744I256P506P47k644R857m453r418k093j540M515J1640O679j1958j1784m884
4730A426j118k604m980k074J4119J8243j1304m58q212o920J725K293j787P999
4716F348m090j794k453K386k503P826o661n184R877Q438j0958L773n75j8024j0073
4701b3667K850K383N832L506k046M980J780l143j40K432r998J2555j876j694L826
4686b420k2303k367J1811N025l740P27r434L185Q055k44J4776J253l94l809o268
4671f147m450m822J0791O14q828R986R435k079l831j1741j6701j3612L486J7541
$$ plain form
4657 -20358 -15240 -8358 9740 18854 9631 -8806 -8307 2210 2729 5112 -4139 -28313 -33738 -1828
4643 -1828 6048 2755 -12254 -21904 -4480 4967 -3548 -10745 -3164 -1638 -8648 -7888 4481 -5389
4629 -5389 -17652 -23648 -14509 -11726 -7848 -9792 -4559 6435 -6013 -3100 2270 95 -9628 -10231
4615 -10231 -6707 -26522 -32727 -18192 -21180 -20151 -10644 -4866 -5883 -4164 -2972 -18661 -23774 -9250
4601 -9250 -7759 -5076 13565 6081 -2468 -5783 -4114 -7068 -18375 -10205 -8475 -8526 -12030 -12440 -5342
4586 -5342 1079 -2004 4412 -1068 -12775 -16029 -16762 -14332 -8834 4726 17452 10400 -4545 -5219
4572 -5219 -1700 -9039 -23500 -13314 5853 10352 14604 10566 11295 4720 459 -449 16356 24073
4558 24073 1099 -2087 3780 1522 17177 29289 20844 -1811 -6479 -5003 7930 -2877 -1468
$$ packed form
4657b0358N118O882J8098R114r223j8437M99J0517N19K383r251k4174n425L1910
4643a828P876l293j5009r650J7424R447q515p197P581J526p010P60J2369r870
4629e389j2263n996R139K783L878j944N233J0994j2448K913N370k175r723o03
4615a0231L524j9815o205J4535k988J029R507N778j017J719J192j5689n113J4524
4601i250J491K683J8641p484q549l315J669k954j1307Q170J730n1l504m10P098
4586e342O421l083O416n480j1707l254p33K430N498J3560J2726p052j4945o74
4572e219L519p339j4461J0186J9167M499M252m038P29o575m261r08J6805P717
4558B4073k2974l186N867k258J5655J2112q445k2655m668J476J2933j0807J409
$$ plain form
4545 -1468 2670 8 -7118 -1207 288 2064 6817 -8342 -13232 -10000 2787 12043 6550 51
4531 51 -1211 -17650 -17382 -9755 -721 4582 7436 5694 15670 8319 -5469 -9606 -15903 -7836 8854
4516 8854 13294 15890 10069 -10511 -9850 9378 5815 3567 -7294 -14997 -4514 1437 -336 6529
4502 6529 20952 21792 1270 -22959 -21789 -19125 -1709 3787 19 4764 -9518 -8654 -14028 -22119
4488 -22119 -27327 -10761 -6624 -8762 4099 6695 4394 8540 -2749 -4052 -1013 4840 7205 10012
4474 10012 5708 -3703 -2455 -13557 -13171 722 3981 1421 1903 6392 185 -5984 -2852 2061 -1350
4459 -1350 -11990 -7511 6881 22183 26823 17756 2555 -10622 -852 7125 10384 5434 7039 12954
4445 12954 14855 18465 20339 12282 8257 6412 -7310 -7569 -11335 -10229 -5869 -7269 -17853 -15469
$$ packed form
4545a468M138k662p126N911J495J776M753j5159m890L232J2787R256n493o499
4531E1j262j6439K68P627R034N303K854j742R976p351j3788m137o297Q067J6690
4516H854M440K596n821k0580O61J9228l563k248j0861p703J0483N951j773O865
4502F529J4423Q40k0522k4229J170K664J7416N496l768M745j4282Q64n374q091
4488b2119n208J6566M137k138J2861K596k301M146j1289j303L039N853K365K807
4474A0012m304r411J248j1102L86J3893L259k560M82M489o207o169L132M913l411
4459a350j0640M479J4392J5302M640r067j5201j3177R770P977L259m950J605N915
4445A2954J901L610J874q057m025j845j3722k59l766J106M360j400j0584K384
$$ plain form
4431 -15469 -15665 -23493 -31023 -34073 -35417 -34181 -23288 -17765 -11182 -17807 -25576 -21506 -13616 -8180 -12370
4416 -12370 -17208 -13846 1950 -8875 -9113 -9528 2554 9075 12040 17134 27571 19489 6514 4782
4402 4782 351 -12036 -19744 -2600 7576 5523 4094 -6452 -9708 -4806 1081 7588 -6807 -8829
4388 -8829 -10133 -1273 16043 28204 18846 20751 15841 -3375 -7146 -13057 2552 13587 11587 1857
4374 1857 -13316 -2655 1703 3094 -3364 1197 6530 1747 -549 3980 4928 5833 182 -9872 -12200
4359 -12200 -12994 -25697 -29915 -23398 -24260 -16962 1849 8490 -5520 -5938 -6737 -5856 3503 14752 21151
4344 21151 21118 7492 -10464 -18620 -22804 -19904 -8074 -1350 -7681 -14693 -26043 -42272 -35830 -18634
4330 -18634 -14238 -6702 -8784 -18999 -18528 -9215 1618 7491 3379 11013 6270 -7751 -19109 -12077
$$ packed form
4431a5469j96p828p530l050j344J236J0893N523O583o625p769M070P890N436m190
4416a2370m838L362J5796j0825k38m15J2082O521K965N094J0437q082j2975j732
4402D782m431j2387p708J7144J0176k053j429j0546l256M902N887O507j4395k022
4388h829j304Q860J7316J2161r358J905m910j9216l771n911J5609J1035k000r730
4374A857j5173J0661M358J391o458M561N333m783k296M529R48R05n651j0054k328
4359a2200p94j2703m218O517q62P298J8811O641j4010m18p99Q81R359J1249O399
4344B1151l3j3626j7956q156m184K900J1830O724o331p012j1350j6229O442J7196
4330a8634M396P536k082j0215M71R313J0833N873m112P634m743j4021j1358P032
$$ plain form
4316 -12077 -6139 -6508 -13514 -15235 -5017 4715 8840 -2584 -15095 -17621 -10344 6788 8882 8080
4302 8080 7246 -4964 -8622 1503 150 -5720 -6844 3296 3518 -8783 -25147 -27399 -32093 -38943
4288 -38943 -34264 -24471 -24672 -23746 -15684 -8646 4197 11012 7699 9968 12202 15262 5577 1961 -6234
4273 -6234 -4369 2164 3499 -12189 -18186 -15690 -15898 -7347 7133 568 -20444 -10217 -8400 86
4259 86 -4195 -28806 -10085 11529 26557 22099 -161 -7085 -14208 -24840 -22973 -5646 -240 -467
4245 -467 1703 2144 6558 1507 -2477 -550 3002 11186 5535 -5636 -5016 -5254 2111 3132 -897 7857
4229 7857 12305 13346 18008 27541 16391 15958 27227 30986 16746 -2708 -3828 5646 9595 866
4215 866 -16086 -35862 -33087 -29303 -5022 -1616 -7804 -4426 5294 9115 -1489 -8924 -3931 5759
$$ packed form
4316a2077N938l69p006j721J0218R732M125j1424j2511k526P277J7132K094q02
4302H080q34j2210l658J0125j353n870j124J0140K22j2301j6364k252m694o850
4288c8943M679R793k01R26Q062P038J2843O815l313K269K234L060r685l616q195
4273f234J865O533J335j5688n997K496k08Q551J4480o565k1012J0227J817Q486
4259H6m281k4611J8721K1614J5028m458k2260o924p123j0632J867J7327N406k27
4245d67K170M41M414n051l984J927L552Q184n651j1171O20k38P365J021m029Q754
4229G857M448J041M662R533j1150m33J1269L759j4240j9454j120R474L949q729
4215H66j6952j9776K775L784K4281L406o188L378R720L821j0604p435M993R690
$$ plain form
4201 5759 17169 21036 16535 16229 19612 8760 9051 7690 -8838 -9680 -5909 -19689 -17337 -6182
4187 -6182 -17100 -17449 -22783 906 12888 -359 -25464 -43286 -42537 -21912 -25154 -24481 -12861 -11957
4173 -11957 -15602 -5378 -13357 -21004 -8817 447 -13002 -5778 4032 5903 -2727 -6577 -3656 4585
4159 4585 8944 6302 -4600 -7114 3406 -349 -17313 -20580 -11761 -13089 -26334 -27047 -21337 -14396
4145 -14396 -6440 -11005 -374 8394 11024 18063 28842 37905 24235 3726 -1934 -13511 -11989
4132 -11989 -10423 -7458 -18238 -15474 -7966 -15172 -3992 5302 -6908 -4423 1386 -6966 -6727 5141
4118 5141 -1805 -3805 606 -1369 -7578 -16413 -20720 -8286 -11765 -5466 -6323 -19572 -22749 -23981 -10046
4103 -10046 -2951 -3898 -18150 -21367 -6875 -9387 -7681 -8623 -7176 -11157 -13201 -14176 -2140 -1096 -12758
$$ packed form
4201E759J1410L867m501l06L383j0852K91j361j6528q42L771j3780K352J1155
4187f182j0918l49n334K3689J1982j3247k5105j7822P49K0625l242O73J1620R04
4173a1957l645J0224p979p647J2187R264j3449P224R810J871q630l850K921Q241
4159D585M359k642j0902k514J0520l755j6964l267Q819j328j3245p13N710O941
4145a4396P956m565J0631Q768K630P039J0779R063j3670k0509n660j1577J522
4132a1989J566K965j0780K764P508p206J1180R294j2210K485N809q352K39J1868
4118E141o946k000M411j975o209q835m307J2434l479O299q57j3249l177j232J3935
4103a0046P095r47j4252l217J4492k512J706r42J447l981k044r75J2036J044j1662
$$ plain form
4088 -12758 -6632 -4943 -11272 -21069 -444 6641 -7813 -14961 -18661 -19836 -12019 -12835 -10718 -5062
4074 -5062 6272 4257 -10754 -9549 -14805 2996 13765 112 -28078 -19182 -285 12243 9921
4061 9921 2662 -1899 -2766 -945 -10400 -8548 132 7149 16796 20296 18720 30672 29246 24063 7072
4046 7072 -8177 -6158 9298 10204 3800 3409 -2986 -13857 -19780 -7532 11195 15887 4559 -14379
4032 -14379 -20069 -17725 -6441 1695 -339 -9207 -5208 669 605 10888 20001 21875 21137 3911 6649
4017 6649 14438 10061 4307 -6130 -16229 -21237 -28309 -34372 -30666 -28458 -19816 -5345 -9170 -14083
4003 -14083 -17646 -20335 -11701 -12069 -13371 8201 10453 6006 7340 7239 264 -2383 -10501 -11935 -10196
3988 -10196 2442 2346 3029 10838 7287 9162 13552 7606 -15999 -26636 -5558 9705 -8763 -10131
$$ packed form
4088a2758O126J689o329r797K0625P085j4454p148l700j175P817q16K117N656
4074e062J1334k015j5011J205n256J7801J0769j3653k8190Q896J8897J2528k322
4061I921p259m561q67J821r455J852Q680P017R647L500j576J1952j426n183j6991
4046G072j5249K019J5456R06o404l91o395j0871n923J2248J8727M692j1328j8938
4032a4379n690K344J1284Q136k034q868L999N877o4J0283R113J874p38j7226K738
4017F649P789m377n754j0437j0099n008p072o063L706K208Q642J4471l825m913
4003a4083l563k689Q634l68j302K1572K252m447J334j01o975k647q118j434J739
3988a0196J2638r6O83P809l551J875M390n946k3605j0637K1078J5263j8468j368
$$ plain form
3974 -10131 900 -3953 -5700 -52 -3239 -1387 -14149 -18227 -1051 11944 13137 -5229 -13147
3961 -13147 -20901 -29609 -36775 -33672 -6993 577 -18024 -11147 -1912 -3866 -5206 -16332 -19765 -11811
3947 -11811 -6061 23819 33385 20048 30693 16148 6091 -1569 -429 17861 10375 -611 1439
3934 1439 9502 4005 16286 13932 8333 -482 -12751 -6249 13397 16777 -5873 -8976 -4104 -2176
3920 -2176 6733 6890 4799 4516 6450 -4135 -12470 -17943 -12227 1288 4921 11138 9830 11479 -1664
3905 -1664 1955 5569 -211 1854 1397 -5591 -5996 -11337 -21338 -38442 -31616 -18861 -15875 -5299
3891 -5299 -11124 -11433 -6515 1145 -1079 -19542 -29063 -33524 -19087 -4354 -656 -11765 -10019 -23772
3877 -23772 -32241 -32053 -30613 -15694 -1735 -8845 -14408 -10555 -3777 391 -3014 -7301 -8116 6425
$$ packed form
3974a0131J1031m853j747N648l187J852j2762m078J7176J2995J193j8366p918
3961a3147p754q708p166L103K6679P570j8601O877R235j954j340j1126l433P954
3947a1811N750K9880R566j3337J0645j4545j0057p660J140J8290p486j0986K050
3934A439Q063n497J2281k354n599q815j2269O502J9646L380k2650l103M872J928
3920b176Q909J57k091k83J934j0585q335n473N716J3515L633O217j308J649j3143
3905a664L619L614n780K065m57o988m05n341j0001j7104O826J2755K986J0576
3891e299n825l09M918P660k224j8463r521m461J4437J4733L698j1109J746j3753
3877b3772q469J88J440J4919J3959p110n563L853O778M168l405m287q15J4541
$$ plain form
3863 6425 3477 -748 9040 -2618 -3379 9066 -855 -6561 -14868 -14804 -1343 -3600 -9604 -3598 4169
3848 4169 3451 1164 -538 4174 7314 -3800 -9985 -7884 -9571 -10854 -11981 -5912 -4933 -9557 -13162
3833 -13162 440 18787 25300 16535 10624 23531 12780 19596 22284 21208 18172 9212 20160
3820 20160 21618 22912 15619 -892 -13490 -12062 -2388 4823 -12953 -19117 -8323 -2909 -12260 -33453
3806 -33453 -26859 -23810 -16571 -15415 -9701 -3313 -3674 -2711 7467 2169 -6477 -7177 -7084 3969 2900
3791 2900 9598 12923 15769 12040 11401 7166 8062 28002 27165 4529 -1719 -1140 -4734 -5475 -1177 -7897
3775 -7897 -16543 -8489 3810 9209 4463 11909 18246 12217 -7240 -10310 -6578 -5079 -3615 -3506 2217
3760 2217 6521 18711 23314 12436 -266 2279 6053 -14632 -22340 -13807 -19786 -11046 4843 8697
$$ packed form
3863F425k948m225R788j1658p61J2445r921n706q307O4J3461k257o004O006P767
3848D169p18k287j702M712L140j1114o185K101j687j283j127O069R79m624l605
3833a3162J3602J8347O513q765n911J2907j0751O816K688j076l036q960J0948
3820B0160J458J294p293j6511j2598J428R674P211j7776o164J0794N414r351k1193
3806c3453O594L049P239J156N714O388l61R63J0178n298q646p00R3J1053j069
3791B900O698L325K846l729o39m235Q96J9940q37k2636o248N79l594p41M298o720
3775g897q646Q054J2299N399m746P446O337o029j9457l070L732J499J464J09N723
3760B217M304J2190M603j0878j2702K545L774k0685p708Q533n979Q740J5889L854
$$ plain form
3746 8697 5774 10569 13352 2601 -6955 -6422 -9846 -17439 -21726 -7059 10372 16145 9658 3665
3732 3665 -4307 -5804 -6185 -8316 -9985 -6191 -4857 3039 6277 5912 2288 1210 -2298 -8730 -8451 -16071
3716 -16071 -4282 7030 9372 14616 9784 10784 15755 12909 -4107 -3630 -11217 -12445 -6919 -17103
$$ packed form
3746H697k923M795K783j0751r556N33l424p593m287J4667J7431N773o487n993
3732C665p972j497l81k131j669L794J334P896L238l65l624j078l508o432K79p620
3716a6071J1789J1312K342N244m832J000M971k846j7016M77p587j228N526j0184
$$ [...]
##END NTUPLES=NMR SPECTRUM
##END=
