##TITLE=Analysis number 326726
Compound Code cc 59613
Book Reference 521/21
Project Code adrs
Chemist Name evam
##JCAMPDX= 6.0         $$ Bruker NMR JCAMP-DX V2.0
##DATA TYPE= NMR SPECTRUM
##DATA CLASS= NTUPLES
##ORIGIN= Bruker BioSpin GmbH
##OWNER= nmr
$$ XWIN-NMR		Version 3.5
$$ Tue Feb 20 11:34:32 2007 GMT Standard Time (UT+0h)  MAYBRIDGE\nmr@NMR_250MHZ
##.OBSERVE FREQUENCY= 250.131544655141
##.OBSERVE NUCLEUS= ^1H
##.ACQUISITION MODE= SIMULTANEOUS (DQD)
##.ACQUISITION SCHEME= undefined
##.AVERAGES= 16
##.DIGITISER RES= 18
##SPECTROMETER/DATA SYSTEM= dpx250
##.PULSE SEQUENCE= zg30
##.SOLVENT NAME= CDCl3
##.SHIFT REFERENCE= (INTERNAL, CDCl3, 0, 16.522)
##AUDIT TRAIL= $$ (NUMBER, WHEN, WHO, WHERE, WHAT)
$$ ##TITLE= Audit trail, XWIN-NMR		Version 3.5
$$ ##JCAMPDX= 5.01
$$ ##ORIGIN= Bruker BioSpin GmbH
$$ ##OWNER= nmr
$$ C:\u/data/dgb/nmr/ADRS/1300/pdata/1/auditp.txt
$$ ##AUDIT TRAIL=  $$ (NUMBER, WHEN, WHO, WHERE, WHAT)
(   1,<2007-02-20 11:34:09.75 +000>,<MAYBRIDGE\nmr>,<NMR_250MHZ>,
      <created by zg, POWCHK disabled, PULCHK disabled
       configuration hash MD5:
       49 4B E0 1D 92 C2 6B 37 9F E6 65 BC 52 41 86 1D
       data hash MD5: 64K
       23 D6 AB DD 34 51 D7 D8 84 CA D6 3C CB 58 58 63>)
(   2,<2007-02-20 11:34:22.78 +000>,<MAYBRIDGE\nmr>,<NMR_250MHZ>,
      <Start of raw data processing
       ef LB = 0.3 FT_mod = 6 PKNL = 1 SI = 32K 
       data hash MD5: 32K
       B1 1B D1 EB 0A 81 24 DD 1F 1D ED 9E 7D 07 E7 C1>)
(   3,<2007-02-20 11:34:24.47 +000>,<MAYBRIDGE\nmr>,<NMR_250MHZ>,
      <apk 
       data hash MD5: 32K
       04 54 0F 82 17 96 D7 C9 24 BB 8B 11 2C 15 22 A2>)
(   4,<2007-02-20 11:34:25.39 +000>,<MAYBRIDGE\nmr>,<NMR_250MHZ>,
      <abs ABSG = 5 
       data hash MD5: 32K
       A7 38 D5 7F 52 75 B2 42 D5 4C FE A1 6F F8 45 8B>)
$$ ##END=
$$ 
$$ hash MD5
$$ 47 93 3B 16 5B A4 4F 6F 95 B0 AE 93 B6 D8 5C 71
##$RELAX= 
##$RELAX= 
##$RELAX= 
##$RELAX= 
##$RELAX= 
##$RELAX= 
##$RELAX= 
$$ Bruker specific parameters
$$ --------------------------
##$DU= <C:\u>
##$EXPNO= 1300
##$NAME= <ADRS>
##$PROCNO= 1
##$TYPE= <nmr>
##$USER= <dgb>
##$AMP= (0..31)
100 100 100 100 100 100 100 100 100 100 100 100 100 100 100 100 100 100 
100 100 100 100 100 100 100 100 100 100 100 100 100 100 
##$AQSEQ= 0
##$AQ_mod= 3
##$AUNM= <au_zg>
##$AUTOPOS= <43 >
##$BF1= 250.13
##$BF2= 250.13
##$BF3= 250.13
##$BF4= 250.13
##$BF5= 500.13
##$BF6= 500.13
##$BF7= 500.13
##$BF8= 500.13
##$BYTORDA= 1
##$CFDGTYP= 0
##$CFRGTYP= 5
##$CHEMSTR= <none>
##$CNST= (0..31)
1 1 145 1 1 1 1 1 1 1 1 1 1 1 1 1 1 1 1 1 1 1 1 1 1 1 1 1 1 1 1 1 
##$CPDPRG= <>
##$CPDPRG1= <>
##$CPDPRG2= <>
##$CPDPRG3= <>
##$CPDPRG4= <mlev>
##$CPDPRG5= <mlev>
##$CPDPRG6= <mlev>
##$CPDPRG7= <mlev>
##$CPDPRG8= <mlev>
##$CPDPRGB= <>
##$CPDPRGT= <>
##$D= (0..31)
0 1 0 0 0 0 0 0 0 0.06 0 0 0 0 0 0 0.0002 0 0 0 0 0 0 0 0 0 0 0 0 0 0 
0 
##$DATE= 1171971248
##$DBL= (0..7)
120 120 120 120 120 120 120 120 
##$DBP= (0..7)
150 150 150 150 150 150 150 150 
##$DBP07= 0
##$DBPNAM0= <>
##$DBPNAM1= <>
$$ [...]
##$SUBNAM7= <"">
##$SUBNAM8= <"">
##$SUBNAM9= <"">
##$SW= 20.6930455092707
##$SWIBOX= (0..15)
0 0 3 0 0 0 0 0 0 0 0 0 0 0 0 0 
##$SW_h= 5175.983436853
##$TD= 65536
##$TD0= 1
##$TE= 295.16
##$TE2= 300
##$TE3= 300
##$TEG= 300
##$TL= (0..7)
0 120 120 120 120 120 120 120 
##$TP= (0..7)
150 150 150 150 150 150 150 150 
##$TP07= 0
##$TPNAME0= <>
##$TPNAME1= <>
##$TPNAME2= <>
##$TPNAME3= <>
##$TPNAME4= <>
##$TPNAME5= <>
##$TPNAME6= <>
##$TPNAME7= <>
##$TPOAL= (0..7)
0.5 0.5 0.5 0.5 0.5 0.5 0.5 0.5 
##$TPOFFS= (0..7)
0 0 0 0 0 0 0 0 
##$TUNHIN= 0
##$TUNHOUT= 0
##$TUNXOUT= 0
##$USERA1= <user>
##$USERA2= <user>
##$USERA3= <user>
##$USERA4= <user>
##$USERA5= <user>
##$V9= 5
##$VALIST= <valist>
##$VCLIST= <CCCCCCCCCCCCCCC>
##$VD= 0
##$VDLIST= <DDDDDDDDDDDDDDD>
##$VPLIST= <PPPPPPPPPPPPPPP>
##$VTLIST= <TTTTTTTTTTTTTTT>
##$WBST= 1024
##$WBSW= 4
##$XGAIN= (0..3)
0 0 0 0 
##$XL= 0
##$YL= 0
##$YMAX_a= 470860
##$YMIN_a= -517599
##$ZGOPTNS= <>
##$ZL1= 120
##$ZL2= 120
##$ZL3= 120
##$ZL4= 120
##$ABSF1= 16.522
##$ABSF2= -4.171173
##$ABSG= 5
##$ABSL= 3
##$ALPHA= 0
##$AQORDER= 0
##$ASSFAC= 0
##$ASSFACI= 0
##$ASSFACX= 0
##$ASSWID= 0
##$AUNMP= <proc_1d>
##$AZFE= 0.1
##$AZFW= 0.1
##$BCFW= 0
##$BC_mod= 0
##$BYTORDP= 0
##$COROFFS= 0
##$CY= 12.5
##$DATMOD= 1
##$DC= 0
##$DFILT= <>
##$DTYPP= 0
##$F1P= 14.0000005364418
##$F2P= -0.99999901652339
##$FCOR= 0.5
##$FTSIZE= 32768
##$FT_mod= 6
##$GAMMA= 0
##$GB= 0
##$INTBC= 1
##$INTSCL= 1
##$ISEN= 128
##$LB= 0.3
##$LEV0= 0
##$LPBIN= 0
##$MAXI= 10000
##$MC2= 0
##$MEAN= 0
##$ME_mod= 0
##$MI= 0
##$NCOEF= 0
##$NC_proc= -2
##$NLEV= 6
##$NOISF1= 0
##$NOISF2= 0
##$NSP= 0
##$NTH_PI= 0
##$NZP= 0
##$OFFSET= 16.522
##$PC= 1
##$PHC0= 225.0386
##$PHC1= 6.708166
##$PH_mod= 1
##$PKNL= yes
##$PPARMOD= 0
##$PSCAL= 4
##$PSIGN= 0
##$REVERSE= no
##$SF= 250.13
##$SI= 32768
##$SIGF1= 0
##$SIGF2= 0
##$SINO= 400
##$SIOLD= 32768
##$SREGLST= <1H.CDCl3>
##$SSB= 0
##$STSI= 32768
##$STSR= 0
##$SW_p= 5175.98343685301
##$SYMM= 0
##$S_DEV= 0
##$TDeff= 65536
##$TDoff= 0
##$TI= <Analysis number 999999
Compound Code 99
Book Reference 9
Project Code 9>
##$TILT= no
##$TM1= 0
##$TM2= 0
##$TOPLEV= 0
##$USERP1= <user>
##$USERP2= <user>
##$USERP3= <user>
##$USERP4= <user>
##$USERP5= <user>
##$WDW= 1
##$XDIM= 32768
##$YMAX_p= 344438211
##$YMIN_p= -28891
$$ End of Bruker specific parameters
$$ ---------------------------------
##NTUPLES= NMR SPECTRUM
##VAR_NAME=  FREQUENCY,     SPECTRUM/REAL,   SPECTRUM/IMAG
##SYMBOL=    X,             R,               I
##VAR_TYPE=  INDEPENDENT,   DEPENDENT,       DEPENDENT
##VAR_FORM=  AFFN,          ASDF,            ASDF
##VAR_DIM=   32768,         32768,           32768
##UNITS=     HZ,            ARBITRARY UNITS, ARBITRARY UNITS
##FACTOR=    0.157963299565203, 1,           1
##FIRST=     4132.6476996994, 0,             0
##LAST=      -1043.33573715361, 0,           0
##MIN=       -1043.33573715361, -28891,      0
##MAX=       4132.6476996994, 344438211,     0
$$ Real data points
##PAGE= N=1
##DATA TABLE= (X++(R..R)), XYDATA
$$ [...]
16688a3884k47O103m48l735j435q2K026k267k791J567M324n136P260m884j697
$$ -13884 -14131 -8028 -8476 -12211 -13646 -13728 -11702 -13969 -16760 -15193 -10869 -16005 -8745 -13629 -15326
16673a5326O046M087J748o38M070k104m769k017K35K305k378k307k351K356K535
$$ -15326 -9280 -5193 -3445 -4083 -13 -2117 -6886 -8903 -8668 -6363 -8741 -11048 -13399 -11043 -8508
16658h508l86K874p277k239j17k032J955N428O839L287k078m901m126k251K405
$$ -8508 -8894 -6020 -13297 -15536 -15653 -17685 -15730 -10302 -3463 -176 -2254 -7155 -11281 -13532 -11127
16643a1127M865k378l759K663o60J059K347j131N15k830j182q69J698j949M869
$$ -11127 -6262 -8640 -12399 -9736 -10396 -9337 -6990 -8121 -7606 -10436 -11618 -12487 -10789 -12738 -7869
16628g869J529r459j497k953J427J999M249K396j0298J357J0618M080k244m312
$$ -7869 -6340 -15799 -17296 -20249 -18822 -16823 -12574 -10178 -20476 -19119 -8501 -4421 -6665 -10977
16614a0977k213K917l482k297K110l869q16L498J0963J0267n934j2429n301K391
$$ -10977 -13190 -10273 -13755 -16052 -13942 -17811 -18627 -15129 -4166 6101 167 -12262 -17563 -15172
16600a5172P007K206N290k237n45j033n137j322J626P356J080j442j731k835j546
$$ -15172 -8165 -5959 -669 -2906 -3451 -4484 -9621 -10943 -9317 -1961 -881 -2323 -4054 -6889 -8435
16585h435l178J124N276j455k15M225j383j628p733k623L00K451L560k49l199
$$ -8435 -11613 -10489 -5213 -6668 -6883 -2658 -4041 -5669 -13402 -16025 -15725 -13274 -9714 -9963 -13162
16570a3162J841k646M523L713o78l31l285k33J760M934j776m447K116J708K105
$$ -13162 -11321 -13967 -9444 -5731 -6409 -6740 -10025 -10258 -8498 -3564 -5340 -9787 -7671 -5963 -3858
16555c858m527k000l295m56q42P886M500j686m815N353J43k456J0k642l497j991
$$ -3858 -8385 -10385 -13680 -14136 -14978 -7092 -2592 -4278 -9093 -3740 -3597 -6053 -6043 -8685 -12182 -14173
16539a4173n01p100l993M958J1219N150M168m234m208j275L14L44L131J65K862
$$ -14173 -14674 -21774 -25767 -20809 -9590 -4440 -272 -4506 -8714 -9989 -9675 -9331 -6200 -6035 -3173
16524c173K899k132J257O001M805K913j251m753l925n961p609R14L487j956K696
$$ -3173 -274 -2406 -1149 4852 9657 12570 11319 6566 2641 -3320 -10929 -10015 -6528 -8484 -5788
16509e788J37P71j884K529m886L775M626j40j636m715m938L554L580m6L944p038
$$ -5788 -5651 -4880 -6764 -4235 -9121 -5346 -720 -860 -2496 -7211 -12149 -8595 -5015 -5061 -1117 -8155
16493h155p427N242L1J345M559p398j0586J088O002Q245K829N721j589l336l123
$$ -8155 -15582 -10340 -10309 -8964 -4405 -11803 -22389 -21301 -15299 -7054 -4225 1496 -93 -3429 -6552
16478f552K790l023m428L792L861m126l615j168j86M843M872n696l182J744Q141
$$ -6552 -3762 -6785 -11213 -7421 -3560 -7686 -11301 -12469 -12655 -7812 -2940 -8636 -11818 -10074 -1933
16463a933K3o122J065L497n663j4728J566Q841K926J297J618L104J831j401P789
$$ -1933 -1910 -8032 -6967 -3470 -9133 -23861 -22295 -13454 -10528 -9231 -7613 -4509 -2678 -4079 3710
16448C710m723l370p861k254j294L226k609k848L050j656j466P9O632K987J023
$$ 3710 -1013 -4383 -12244 -14498 -15792 -12566 -15175 -18023 -14973 -16629 -18095 -18016 -11384 -8397 -7374
16433g374J659j356m312p019p60J826M348L580m161o380M492O217O789Q33p260
$$ -7374 -5715 -7071 -11383 -18402 -19162 -17336 -12988 -9408 -13569 -19949 -15457 -9240 -2451 -1618 -8878
16418h878k639M627Q390l753j12K437n259n351m997Q032K971Q530L564l495r561
$$ -8878 -11517 -6890 1500 -2253 -2365 72 -5187 -10538 -15535 -7503 -4532 3998 7562 4067 -5494
16403e494k741j160j465N256l249m344L154J177m218J331J744j394k396K191O999
$$ -5494 -8235 -9395 -10860 -5604 -8853 -13197 -10043 -8866 -13084 -11753 -10009 -11403 -13799 -11608 -4609
16388d609l646j559O22k611j311N521r40o360R054O977J076l142k118N236n94
$$ -4609 -8255 -9814 -9192 -11803 -13114 -7593 -8533 -14893 -5839 1138 2214 -928 -3046 2190 1596
16373A596m242l415Q63j987j736k840m491l753P983N169j0569l815M87M616M859
$$ 1596 -2646 -6061 -5198 -7185 -8921 -11761 -16252 -20005 -12022 -6853 -17422 -21237 -20750 -16134 -11275
16358a1275j564J985N806J988J096p478n555Q496k494K295j943k35O208N457M949
$$ -11275 -12839 -10854 -5048 -3060 -1964 -9442 -14997 -6501 -8995 -6700 -8643 -8878 -2670 2787 7736
16343G736m980k173m46l437o403m271l240j455P028P932K316j86L969M647p588
$$ 7736 2756 583 137 -3300 -9703 -13974 -17214 -18669 -11641 -3709 -1393 -1579 2390 7037 -551
16328e51j882J844j21j091K629L370J112o335l979k395m723j521J304j305K020
$$ -551 -2433 -589 -710 -1801 828 4198 5310 -1025 -5004 -7399 -12122 -13643 -12339 -13644 -11624
16313a1624k058M939M605l042J326j832K70m793n691m05l40k420J643N027Q650
$$ -11624 -13682 -8743 -4138 -7180 -5854 -7686 -7416 -12209 -17900 -18305 -18645 -21065 -19422 -14395 -5745
16298e745O999l360m403R834J306r837R57M765L93J28q029j745M183j023m698
$$ -5745 1254 -2106 -6509 3325 4631 -5206 -4249 516 909 1037 -6992 -8737 -4554 -5577 -10275
16283a0275k070o779j132M597M301n217K93n68j362O600J481M456M73l905k024
$$ -10275 -12345 -19124 -20256 -15659 -11358 -16575 -16282 -16850 -18212 -11612 -10131 -5675 -5202 -9107 -11131
16268a1131j917N649R042k155J689L004J010q761l269N518k388l851J454R95L308
$$ -11131 -13048 -7399 1643 -512 1177 4181 5191 -3570 -6839 -1321 -3709 -7560 -6106 -5111 -1803
16253a803r16q026k576N296M913m930O937J1559k074o422k990j992M448j194j721
$$ -1803 -2719 -10745 -13321 -8025 -3112 -8042 -1105 10454 8380 1958 -1032 -3024 1424 230 -1491
16238a491r96l559j043p83J043l830j323J136j076l401J799P283k751M375j76
$$ -1491 -2487 -6046 -7089 -7872 -6829 -10659 -11982 -10846 -11922 -15323 -13524 -6241 -8992 -4617 -4793
16223d793P31k367K87m081n682J767M052K349K561q45J170l740m557l99J783R053
$$ -4793 -4062 -6429 -6142 -10223 -15905 -14138 -10086 -7737 -5176 -6021 -4851 -8591 -13148 -13547 -11764 -2711
16207b711K701K68l219j0141r10L670O302J074j915M34j997J075J045k545J41
$$ -2711 -10 258 -2961 -13102 -14012 -10342 -4040 -2966 -4881 -4447 -6444 -5369 -4324 -6869 -6728
16192f728M843K009n07k884L504K388l853j951J683J292l945K215L98m523Q35
$$ -6728 -1885 124 -383 -3267 237 2625 -1228 -3179 -1496 -204 -4149 -1934 -1536 -6059 -5224
16177e224J758m152N096N333n292l378J692L46m697p434j069o25l05m970J1567
$$ -5224 -3466 -7618 -2522 2811 -2481 -5859 -4167 -3821 -8518 -15952 -17021 -17646 -17951 -22921 -11354
16162a1354P77q526j454O759K721Q692n791k813N546Q782j154l481m939j128M59
$$ -11354 -10577 -19103 -20557 -13798 -11077 -2385 -8176 -10989 -5443 3339 2185 -1296 -6235 -7363 -6904
16147f904o785j0876K376M223O339L652n686N37n725J860K451J53M008J858l005
$$ -6904 -13689 -24565 -22189 -17966 -11627 -7975 -13661 -13124 -18849 -16989 -14538 -14385 -10377 -8519 -11524
16132a1524l001J385L290j288L454L000J760k179j2137k931L736J610N998R99
$$ -11524 -14525 -13140 -9850 -11138 -7684 -4684 -2924 -5103 -17240 -20171 -16435 -14825 -8827 -7828
16118g828o451q74K049M095J479j04K140M238j488r737M949Q147K7l26J487k014
$$ -7828 -14279 -15153 -13104 -9009 -7530 -7634 -5494 -1256 -2744 -12481 -7532 615 642 316 1803 -211
16102b11n487m77Q95K611n540L2O875l745l27L79q498j809N056O465M923k137
$$ -211 -5698 -6175 -5280 -2669 -8209 -8177 -1302 -5047 -5374 -4995 -13493 -15302 -10246 -3781 1142 -995
16086i95K294j327p751J482O051n595P07J028l879m592O35J922K165r50l197k499
$$ -995 1299 -28 -7779 -6297 -246 -5841 -5134 -4106 -7985 -12577 -11942 -10020 -7855 -8805 -12002 -14501
16070a4501L584L341l99k206K110l477k424k60j174l731L843O159M61N475N485
$$ -14501 -10917 -7576 -7975 -10181 -8071 -11548 -13972 -14232 -15406 -19137 -15294 -9135 -8674 -3199 2286
16055B286n122r600k564K763L082K4k011k497O8L320J856M285N614o499j086M567
$$ 2286 -2836 -12436 -15000 -12237 -9155 -9131 -11142 -13639 -13571 -10251 -8395 -4110 1504 -4995 -6081 -1514
16039a514K522J151J082o66m517p843n51n57n091P243J2899J1881j0j1281p155
$$ -1514 1008 2159 3241 2575 -1942 -9785 -10336 -10893 -15984 -8741 4158 16039 16029 4748 -2407
16024b407o314K357p117K293O092P835p45K648p42l972N083q44n227k964n459
$$ -2407 -8721 -6364 -13481 -11188 -5096 2739 1994 4642 3900 -72 5011 4167 -1060 -4024 -9483
16009i483n388J856j467J414j334P666L071l098L913M978p018J930M870M377k721
$$ -9483 -14871 -13015 -14482 -13068 -14402 -6736 -3665 -6763 -2850 2128 -4890 -2960 1910 6287 3566
15994C566q407L88J496k674N33K330j052Q09m20K000l966j842q75M027L737J51
$$ 3566 -4841 -4453 -2957 -5631 -5098 -2768 -3820 -3011 -3431 -1431 -5397 -7239 -8114 -4087 -350 -199
15978a99m083m332L311K785n187j168O58L244L429J028K000r649o110j017R104
$$ -199 -4282 -8614 -5303 -2518 -7705 -8873 -8215 -4971 -1542 -514 1486 -8163 -14273 -15290 -6186
15963f186R151L313n218j682K207l525J282K513p905q487O144Q142l773l843k904
$$ -6186 2965 6278 1060 -622 1585 -1940 -658 1855 -6050 -14537 -8393 -251 -4024 -7867 -10771
15948a0771M794O5M349j876K459K168k582n859j822j598L657L523K261n199j524
$$ -10771 -5977 -5912 -1563 -3439 -980 1188 -1394 -7253 -9075 -10673 -7016 -3493 -1232 -6431 -7955
15933g955M877M365m556j765J007j600m754L334J552M4J86l98L706k973l302k480
$$ -7955 -3078 1287 -3269 -5034 -4027 -5627 -10381 -7047 -5495 -5451 -5265 -5663 -1957 -4930 -8232 -10712
15917a0712L724O186K256k967k82K643q65J176k589r925p603j60N63R22j359j112
$$ -10712 -6988 -802 1454 -1513 -1795 848 -17 1159 -1430 -11355 -18958 -19118 -18555 -17633 -18992 -20104
15901b0104K386j615r265Q001M303o73O901K805l045n304j250j5P73K728K712
$$ -20104 -17718 -19333 -28598 -20597 -16294 -16967 -10066 -7261 -10306 -15610 -16860 -16875 -16102 -13374 -10662
15886a0662K783l257n990L879k85K527P045P799j944m311j982K335n113r713M9
$$ -10662 -7879 -11136 -17126 -13247 -13532 -11005 -3960 3839 1895 -2416 -4398 -2063 -7176 -16889 -16840
15871a6840N661L511o694P84Q651P401K585J934k469K310j108o419o51J376K567
$$ -16840 -11179 -7668 -14362 -13578 -4927 2474 5059 6993 4524 6834 5726 -693 -1344 32 2599
15856B599m665o790J49L238M963O87O356k899J093n077p423k194J2185L54k585
$$ 2599 -2066 -8856 -8707 -5469 -506 181 6537 3638 4731 -346 -7769 -9963 2222 2576 -9
15841iL17r34l476J403n78n616k067K137P630j063j043O5N246J297l93O952l78
$$ -9 308 -626 -4102 -2699 -3277 -8893 -10960 -8823 -1193 -2256 -3299 -3234 2012 3309 2916 9868 9490
15824I490n911l747J114K267r643n625k162k062j547L347L430P21k10j604o392
$$ 9490 3579 -168 946 3213 -6430 -12055 -14217 -16279 -17826 -14479 -11049 -10328 -10538 -12142 -18534
15809a8534k25J488L617J740q83K95N373R628j117j273J474o783m085j072j213
$$ -18534 -18759 -17271 -13654 -11914 -12797 -12502 -7129 2499 1382 109 1583 -5200 -9285 -10357 -11570
15794a1570n355K055M466o912K231R444J0049k835m330Q62L62j436L74l155o81
$$ -11570 -16925 -14870 -10404 -17316 -15085 -5641 4408 1573 -2757 -1895 -1533 -2969 -2595 -5750 -6431
15779f431J106k039n289R09P602j254m699M147P397j618m04p139J238N134r43
$$ -6431 -5325 -7364 -12653 -11744 -4142 -5396 -10095 -5948 1449 -169 -573 -7712 -6474 -1340 -2283
15764b283J689L189L759L143O043o773j0933k741J90j695n902M80J1150O53j832
$$ -2283 -594 2595 6354 9497 15540 8767 -2166 -4907 -4717 -6412 -12314 -11834 -684 -31 -1863
15749a863j772k130k845K172P294N25n302l033m143K594J531k070l765O682P773
$$ -1863 -3635 -5765 -8610 -6438 856 1381 -3921 -6954 -11097 -8503 -6972 -9042 -12807 -6125 1648
15734A648K011L72k967K440J694K554J523p353q74n735r570N01Q092m70n137r697
$$ 1648 3659 4031 1064 3504 5198 7752 9275 1922 1048 -4687 -14257 -13756 -5664 -6134 -11271 -20968
15718b0968K27L409M900n34L86J169J363K198l212m317K343J77L625K865K501
$$ -20968 -20741 -17332 -12432 -12966 -12580 -11411 -10048 -7850 -11062 -15379 -13036 -12859 -9234 -6369 -3868
15703c868j990k368j457K637J0410J619j3497J66P261k777K864K52n172j385M330
$$ -3868 -5858 -8226 -9683 -7046 3364 4983 -8514 -8348 -1087 -3864 -1000 -748 -5920 -7305 -2975
15688b975o926r155J738N084o591P429J2090p21m753k199O12J410Q47k587o472
$$ -2975 -9901 -19056 -17318 -12234 -18825 -11396 694 -27 -4780 -6979 -6367 -4957 -4110 -6697 -13169
15673a3169j861l366r60m87P73Q572O926k850J364l819M554P878k34m029m311
$$ -13169 -15030 -18396 -19356 -19843 -19070 -10498 -3572 -6422 -5058 -8877 -4323 3555 3321 -708 -5019
15658e019m175P341l983M28N196k102k415K57K99k944K538J922k008k678Q77k240
$$ -5019 -9194 -1853 -5836 -5408 -212 -2314 -4729 -4472 -4173 -7117 -4579 -2657 -4665 -7343 -6466 -8706
15642h706n32N338J176M525m475q415k061O800O325j602q469N006j743j829N73
$$ -8706 -9238 -3900 -2724 1801 -2674 -11089 -13150 -6350 -25 -1627 -10096 -5090 -6833 -8662 -8089
15627h089O275K588j696Q52m390L267K055K07l150j932k239n446N20N757Q641
$$ -8089 -1814 774 -922 -70 -4460 -1193 862 1069 -2081 -4013 -6252 -11698 -11178 -5421 3220
15612C220P00J600M443J620Q68j434j01Q17p599o669o496J769K836L029J452L452
$$ 3220 3920 5520 9963 11583 12451 11017 10916 11733 4134 -2535 -9031 -7262 -4426 -1397 55 3507
15596C507r657o018l660N808p67m784N695K744L697k135k200L897j298O62M933
$$ 3507 -6150 -12168 -15828 -10020 -10787 -15571 -9876 -7132 -3435 -5570 -7770 -3873 -5171 -4509 424
15581D24L778n01q369J843k172q04K496M343k054q4J366k364J559k672P01K321
$$ 424 4202 3701 -4668 -2825 -4997 -5801 -3305 1038 -1016 -1100 266 -2098 -539 -3211 -2510 -189
15565a89K519k709k192m887o705M746m96j910P030l69K328K820M998K689j881
$$ -189 2330 -379 -2571 -7458 -14163 -9417 -9913 -11823 -4793 -5162 -2834 -14 4984 7673 5792
15550E792p158j850j066l38p48j201O03L691J569J676j082J710p603j742K178
$$ 5792 -1366 -3216 -4282 -4620 -5368 -6569 -5966 -2275 -706 970 -112 1598 -6005 -7747 -5569
15535e569L515K380j806L489j938l722l294L254K324m161L293O599q675j810j066
$$ -5569 -2054 326 -1480 2009 71 -3651 -6945 -3691 -1367 -5528 -2235 4364 -4311 -6121 -7187
15520g187M22M118n138l554l318k692M585N716O922P283M214p077j999M169j454
$$ -7187 -6765 -2647 -7785 -11339 -14657 -17349 -12764 -7048 -126 7157 11371 4294 2295 6464 5010
15505E010j219k112q556k8J088n581l48M056m908j351k972R079O626m689q00J687
$$ 5010 3791 1679 -6877 -6905 -5817 -11398 -11746 -7690 -12598 -13949 -16921 -7842 -1216 -5905 -6705 -5018
15489e018k016m884J35L614J82k988k299m252M309M802J129M420n703q48N570
$$ -5018 -7034 -11918 -11783 -8169 -7987 -10975 -13274 -17526 -13217 -8415 -7286 -2866 -8569 -9417 -3847
15474c847K386k858m753j0635j651O96k455N11N566K416j085M971M110Q79r617
$$ -3847 -1461 -4319 -9072 -19707 -21358 -20662 -23117 -22606 -17040 -14624 -15709 -10738 -6628 -5749 -15366
15459a5366K039Q962j560j658P053N445J975m731j418K218M697M161m014p653
$$ -15366 -13327 -4365 -5925 -7583 -530 4915 6890 2159 741 2959 7656 11817 7803 150
15445A50K042O17k418r99M811O660j008n148l10m065m473P36j199l331l444J921
$$ 150 2192 2809 391 -608 4203 10863 9855 4707 4397 332 -4141 -3405 -4604 -7935 -11379 -9458
15429i458M024N701M012K275J669J252K748M895n21n384l560k773R9m023m779
$$ -9458 -5434 267 4279 6554 8223 9475 12223 17118 16597 11213 7653 4880 4979 956 -3823
15414c823J445k955l61l19l22Q77O108J33l605p109J608L765J970L328M21k596
$$ -3823 -2378 -5333 -5694 -6013 -6335 -5458 650 783 -2822 -9931 -8323 -4558 -2588 740 1161 -1435
15398a435M408l717k934k390k326p998m024N804J0595L830N16n206n73j993l654
$$ -1435 2973 -744 -3678 -6068 -8394 -16392 -20416 -14612 -4017 -187 329 -4877 -5450 -7443 -11097
15383a1097j993j97P934L236l499l088L321k368n841L240P714l264k928N549J0240
$$ -11097 -13090 -13287 -5353 -2117 -5616 -8704 -5383 -7751 -13592 -10352 -2638 -5902 -8830 -3281 6959
15368F959L796J173n463r531k436j207k951M426M001J876o3k980j822j297l179
$$ 6959 10755 11928 6465 -3066 -5502 -6709 -9660 -5234 -1233 643 580 -2400 -4222 -5519 -8698
15353h698K614R293M942q391o5Q166R68n015j558l846l412M037N436J455k52M963
$$ -8698 -6084 3209 8151 -240 -305 7861 8829 3814 2256 -1590 -5002 -965 4471 5926 5674 10637
15337A0637j47p639l533k283m621K937M610k850J427P83M39K910o792k615m730
$$ 10637 10490 2851 -682 -2965 -7586 -4649 -39 -2889 -1462 -679 -240 2670 -4122 -6737 -11467
15322a1467n17M434O823j14K167j16p38p505k277J889L334K683N244l448J450
$$ -11467 -11984 -7550 -727 -841 1326 1210 472 -7033 -9310 -7421 -4087 -1404 3840 392 1842
15307A842O114L20q234j0975K549K135k330P575J1057l154o334o688r978n802
$$ 1842 7956 8276 42 -10933 -8384 -6249 -8579 -1004 10053 6899 565 -6123 -16101 -21903
15293b1903J2289R796j769j709J810L335L793N617K356p812l773j328l70j632
$$ -21903 -9614 182 -1587 -3296 -1486 1849 5642 11259 13615 5803 2030 702 332 -1300
15279a300o054l782n953J063P267Q299m709M198L463J400N624L310k563J439o347
$$ -1300 -7354 -11136 -17089 -16026 -8759 -460 -5169 -971 2492 3892 9516 12826 10263 11702 5355
15264E355p414k580m530j012N684J1451J489l612l785K904L11j0768o769O937
$$ 5355 -2059 -4639 -9169 -10181 -4497 6954 8443 4831 1046 3950 4261 -6507 -13276 -6339
15250f339K158k124o057l264P985n49K372m22l676N823J0962r078l976j459M062
$$ -6339 -4181 -6305 -12362 -15626 -7641 -8190 -5818 -6240 -9916 -4093 6869 -2209 -6185 -7644 -3582
15235c582J366l581N20j301K562M638n395n902J010L506M115j497j880O474K515
$$ -3582 -2216 -5797 -5277 -6578 -4016 622 -4773 -10675 -9665 -6159 -2044 -3541 -5421 1053 3568
15220C568P9P765n90q327l444l209J768M695q151m680L118K642O116L681L724
$$ 3568 3647 11412 10822 2495 -949 -4158 -2390 2305 -5846 -10526 -7408 -4766 1350 5031 8755
15205H755l597l555N22k417J923N608J539J577o312o368o340Q55o48m232N358
$$ 8755 5158 1603 2125 -292 1631 7239 8778 10355 4043 -2325 -8665 -7810 -8458 -12690 -7332
15190g332N989k275L575L154M06l520m87L600M426k138m97j975p296q942M643
$$ -7332 -1343 -3618 -43 3111 3517 -3 -490 3110 7536 5398 4901 2926 -4370 -13312 -8669
15175h669R823O41k966m716Q16j885OJ751k870k498J542N419R379k542p553o047
$$ -8669 1154 1795 -1171 -5887 -5071 -6956 -6950 -5199 -8069 -10567 -9025 -3606 5773 3231 -4322 -10369
15159a0369L952M010j493J100k296n002o354K279P850L67p668K13M576k221k395
$$ -10369 -6417 -2407 -3900 -2800 -5096 -10098 -16452 -14173 -6323 -5956 -13624 -13411 -8835 -11056 -13451
15144a3451p294J0399J0944O167O72M37j77k266k820n34J647M01M188m003l303
$$ -13451 -20745 -10346 598 6765 7437 7874 7697 5431 2611 2077 3724 4125 8313 4310 1007
15129A007P315m004m439j440M085O7l049l683o64M93O83Q55k523j162N290N616
$$ 1007 8322 4318 -121 -1561 2524 2591 -458 -4141 -4805 -4312 -3629 -2774 -5297 -6459 -1169 4447
15113D447J54k921l159L884N408N228l474p169n8J832L064m662J023L485J532
$$ 4447 4601 1680 -1479 2405 7813 13041 9567 2398 2340 4172 7236 2574 3597 7082 8614
15098H614l582n170Q67k6n924n376N306M658l282k90N421l774q432J01k881Q839
$$ 8614 5032 -138 729 703 -5221 -10597 -5291 -633 -3915 -4205 1216 -2558 -10990 -10889 -13770 -4931
15082d931N664J497j843j624M765O94l628l20l220q114j35L373P333l16l103n440
$$ -4931 733 2230 387 -1237 3528 4222 594 274 -2946 -11060 -11195 -7822 -489 -805 -3908 -9348
15066i348M115J742p228q799O719M446n380k81L245O002M65r57J193j908p640
$$ -9348 -5233 -3491 -10719 -19518 -12799 -8353 -13733 -14014 -10769 -4767 -4302 -5259 -4066 -5974 -13614
15051a3614j3O863O908P78j813K006K626j0l523n287n535l611l963O207P320Q45
$$ -13614 -13627 -6764 144 922 -891 1115 3741 3731 208 -5079 -10614 -14225 -18188 -11981 -4661 -3816
15035c816k811J0184K71o575l515L396n0J865N328j446L401o9J570l605o376J822
$$ -3816 -6627 3557 3828 -2747 -6262 -2866 -2916 -1051 4277 2831 6232 6163 7733 4128 -2248 -426
15019d26O525j94m812M973N553L859N44o507j067Q46r61k552o413k62n045Q626
$$ -426 6099 5905 1093 6066 11619 15478 16022 9515 8448 9294 8333 5781 -632 -894 -5939 2687
15003B687m43m033M727O049J979q493j1489j795L703M019M6J196n53o14k678R04
$$ 2687 2244 -1789 2938 8987 10966 2473 -9016 -10811 -7108 -3089 -3043 -1847 -2400 -3014 -5692 -4788
14987d788J97L056L283J248N402L153n466m286k188q39q27K960K278k446l217
$$ -4788 -4591 -1535 1748 2996 8398 11551 6085 1799 -389 -1228 -2055 905 3183 737 -2480
14972b480j351L544K411l658Q38M626J400M747m889k753J265j598k347q963j227
$$ -2480 -3831 -287 2124 -1534 -696 3930 5330 10077 5188 2435 3700 2102 -245 -9208 -10435
14957a0435M405J019J386l614R69Q466M427m684m164j185k210K032l729K350M195
$$ -10435 -6030 -5011 -3625 -7239 -6270 2196 6623 1939 -2225 -3410 -5620 -3588 -7317 -4967 -772
14942g72k331o105M26M209L343J300p785L00m324l66n25J380L340N297M747l87
$$ -772 -3103 -9208 -8782 -4573 -1230 70 -7715 -7415 -11739 -12105 -12630 -11250 -7910 -2613 2134 1747
14926A747j739O99J245q282p2J414J850K099k553m45j122J308L794j637J96j485
$$ 1747 8 707 1952 -6330 -6402 -4988 -3138 -1039 -3592 -4037 -5159 -3851 -57 -1694 -1498 -2983
14910b983J009J200L888Q001l653l099m347J891K860P677K807l352k483j981l966
$$ -2983 -1974 -774 3114 11115 7462 4363 16 1907 4767 12444 15251 11899 9416 7435 3469
14895C469q197N293N937l102L60l589j938k500m014Q992K475k762M956R59j451
$$ 3469 -4728 565 6502 3400 3760 171 -1767 -4267 -8281 711 3186 424 5380 6339 4888
14880D888k63K804n98j939N41n465M018P709p316q901J053M743j050n530P50R558
$$ 4888 4625 7429 6831 4892 5433 -32 3986 11695 4379 -4522 -3469 1274 224 -5306 -4556 5002
14864E002L456k927r319O48N077n814j081M014L338q77L0Q05L824l114n672N823
$$ 5002 8458 5531 -3788 -3140 1937 -3877 -4958 -944 2394 1517 1547 2352 6176 3062 -2610 3213
14848C213M677l050r031J091L37M286m893M289L092n059j6J557m253j699N024
$$ 3213 7890 4840 -4191 -3100 -2763 1523 -3370 919 4011 -1048 -1064 493 -3760 -5459 -435
14833d35N939K072j583n111J153j670r90R39J5M497L925n12J761r465j555J338
$$ -435 5504 7576 5993 882 2035 365 -625 314 329 4826 8751 8239 10000 535 -1020 318
14817C18K282M058n362q17q59J372O103j581R48Q423l719k393M153J634k576K49
$$ 318 2600 6658 1296 479 -380 992 7095 5514 6462 14885 11166 8773 12926 14560 11984 12233
14801A2233o834k489j913q79J003n404M250M075j0092J040L890j150P863L80J409
$$ 12233 5399 2910 997 118 1121 -4283 -33 4042 -6050 -5010 -1120 -2270 5593 5973 7382
14786G382N52K507k150M49K79l80L975J988p98l704q455k474l801Q738N257l272
$$ 7382 7934 10441 8291 8740 9019 8639 12614 14602 13804 10100 1645 -829 -4630 4108 9365 6093
14770F093J204O291k783p156r82J469K233J761p568l976k728j746J1483Q552r58
$$ 6093 7297 13588 10805 3649 2667 4136 6369 8130 562 -3414 -6142 -7888 3595 12147 11189
14755A1189P91n70j532M789K623K841M107l244r188m011l015n46J0428r20n20
$$ 11189 11980 11410 9878 14667 17290 20131 24238 20994 11806 7795 4780 4234 14662 13742 13222
14740A3222M552r754o606J050P630K818p310j933N630M054P68M540K571m110K517
$$ 13222 17774 8020 1414 2464 10094 12912 5602 3669 9299 13353 14121 18661 21232 17122 19639
14725A9639q87J273J788j736p92k500p744k285P27N097P65M182K81m782L201O27
$$ 19639 18752 20025 21813 20077 19285 16785 9041 6756 7483 12580 13345 17527 17808 13026 16227 16854
14709A6854j280Q530k244Q236N875p255p037O177q15k563j244O041p24Q04j394
$$ 16854 15574 24104 21860 30096 35971 28716 21679 27856 27041 24478 23234 29275 28551 29355 27961
14694B7961L711l820o917k896K244Q84K016q55K047Q626O583m041m758o076K941
$$ 27961 31672 27852 20935 18039 20283 21167 23183 22328 24375 33001 39584 35543 30785 24709 27650
14679B7650K599o26J165N895k938l951j077l335l952P689k744n772J198O470l29
$$ 27650 30249 29623 30788 36683 33745 29794 28717 25382 21430 29119 26375 20603 21801 28271 27942
14664B7942N39p967j394L601P477R485L389K598R39l412l454j591n083p026q02
$$ 27942 28481 20514 19120 22721 30198 39683 43072 45670 46609 43197 39743 38152 33069 26043 25241
14649B5241R193K09o027l819K106O056L080j866j140N708N410n20o387N164M897
$$ 25241 34434 34643 28616 24797 26903 32959 36039 34173 33033 38741 44151 43631 37244 42408 47305
14634D7305K161m119q258l680m252n254N730N885L061o56J864J646j765k305l986
$$ 47305 49466 45347 37089 33409 29157 23903 29633 35518 38579 37923 39787 41433 39668 37363 33377
14619C3377o386J11L23l822O045K156O742K431q047j6409Q78K214J322m811K965
$$ 33377 26991 27102 27425 23603 29648 31804 38546 40977 32930 16521 17399 19613 20935 16124 19089
14604A9089M367R20l099J57N67k717k802L791Q728L511j625L48m139p005n545
$$ 19089 23456 24376 21277 21434 22001 19284 16482 20273 29001 32512 30887 31235 27096 20091 14546
14589A4546k613R923j669j999M57L96l699J689Q52M779M194o566n058m125k469
$$ 14546 11933 21856 20187 18188 18645 19041 15342 17031 17883 22662 26856 20290 15232 11107 8638
14574H638L669j948L407L053j594m001k76J0182k35L328L057m316K622n348l239
$$ 8638 12307 10359 13766 16819 15225 11224 10948 21130 20895 24223 27280 22964 25586 20238 16999
14559A6999J77p76m906l656M273J264l14J545M608j527l133j886p3M64Q67J384
$$ 16999 17176 16400 11494 7838 12111 13375 13061 14606 19214 17687 14554 12668 12595 13059 13926 15310
14543A5310O194m126j0248k930O110O020N346l481n964n143K438n16L716M041
$$ 15310 21504 17378 7130 4200 10310 16330 21676 18195 12231 7088 9526 9010 12726 16767
14529A6767k193J963N244k779m115m980J541K318P307j112j619p140m068K296
$$ 16767 14574 16537 21781 19002 14887 9907 11448 13766 21073 19961 18342 11202 7134 9430
14515I430k428j396j479N998R093J945m498k103J531K8m758m072m602l484l12
$$ 9430 7002 5606 4127 10125 19218 21163 16665 14562 16093 16121 11363 7291 2689 -795 -1107
14500a107J243J73K150Q7j818l14M774M122m794J092p93m572p018l66j762j720
$$ -1107 136 309 2459 2546 728 414 5188 9310 4516 5608 4815 243 -6775 -7141 -8903 -10623
14484a0623L314K873J660p18O767n10l057l066j533K426L295l628K351P135k347
$$ -10623 -7309 -4436 -2776 -3494 3273 2763 -294 -3360 -4893 -2467 828 -2800 -449 6686 4339
14469D339k531J007J489K326J850K221k026j8k452l947N546j728l755m196L012
$$ 4339 1808 2815 4304 6630 8480 10701 8675 8657 6205 2258 7804 6076 2321 -1875 1137
14454A137Q920L627J141K3n480o289j2838l980Q121Q542K233q222j767O317P586
$$ 1137 10057 13684 14825 14848 9368 3079 -9759 -13739 -5618 2924 5157 -3065 -4832 1485 9071
14439I071O89n880K165k035o364k939k061J687k073j380J4241N028m678j50J304
$$ 9071 9760 3880 6045 4010 -2354 -5293 -7354 -5667 -7740 -9120 5121 10149 5471 5321 6625
14424F625m511M095M757r44k620p716L396P203m73o993P27J01J950O638L357M451
$$ 6625 2114 6209 10966 10022 7402 -314 3082 10285 9812 2819 3546 3647 5597 12235 15592 20043
14408B0043O255l488n752j0445n680J307J28o964M331K123k25o740p526J571M000
$$ 20043 26298 22810 17058 6613 933 2240 2368 -4596 -265 1858 1633 -5107 -12633 -11062 -7062
14393g062J1259P960J856k263k042o51p845l539K14J241N496l745M095K779n985
$$ -7062 4197 12157 14013 11750 9708 9057 1212 -2327 -2113 -872 4624 879 4974 7753 1768
14378A768K730O685N665J692m954m878Q62J162j657J28P481K63o499r232n172
$$ 1768 4498 11183 16848 18540 13586 8708 9570 10732 9075 9203 16684 16947 10448 1216 -3956
14363c956j497N754K270J749K466J528J519K553L148m187Q59q69N47r519p830
$$ -3956 -5453 301 2571 4320 6786 8314 9833 12386 15534 11347 12206 11337 11884 2365 -5465
14348e465P226M818J103k401k695R10K274p94l58M10k285k752j065m59q540L740
$$ -5465 1761 6579 7682 5281 2586 3496 5770 4976 4618 5028 2743 -9 -1074 -1533 -10073 -6333
14332f333J0103L217k922M50M934M010n281PN314L722L328o634r328o163L996
$$ -6333 3770 6987 4065 4515 9449 13459 8178 8185 13499 17221 20549 13915 4587 -1576 2420
14317B420j676n267k942J352N098O794P04m360L519L971n222o78N969K538M855
$$ 2420 744 -4523 -7465 -6113 -1015 5779 6483 2123 5642 9613 4391 3713 9682 12220 17075
14302A7075l665j748p251N0J55J782p035l251M477r03o64J1086M786j914j996
$$ 17075 13410 11662 4411 4461 4616 6398 -637 -3888 589 -314 -978 10108 14894 12980 10984
14287A0984m90n936J0086m32k272K86m809j169l926J266P895R368l5m0m755j986
$$ 10984 10494 4558 14644 14212 11940 12226 7417 6248 2322 3588 11483 20851 20816 20776 16021 14035
14271A4035l95K771J817k32R23p467k82m50M447p57m636m444J380J420l861P46
$$ 14035 13640 16411 18228 17996 18919 11452 11170 10720 15167 14410 9774 5330 6710 8130 4269 5015
14255E015R24K256Q84o317M609L03K315k487n85o022m418k021N187J855l76O9
$$ 5015 5939 8195 9079 2762 7371 7674 9989 7502 6917 895 -3523 -5544 -357 1498 1122 1191
14239A191n39M434J262k58K672j694q365k16J373p204j9L339Q623K717m401k172
$$ 1191 652 5086 6348 6090 8762 7068 -1297 -1513 -140 -7344 -7363 -4024 4599 7316 2915 743
14223G43P99P15J626P84M377N66p369j567Q70m653m761o54N440O968K397L244
$$ 743 1542 2257 3883 4667 9044 9610 2241 674 1544 -3109 -7870 -8524 -3084 3884 6281 9525
14207I525j101p048n414l935Q106L607J793m943k164N200O562k971J71N37l851
$$ 9525 8424 1376 -4038 -7973 133 3740 5533 590 -1574 3626 10188 7217 7388 7925 4074
14192D074K826J97l063j673J501J813q54L012m451m925q70j359K729K490r71l187
$$ 4074 6900 7097 4034 2361 3862 5675 4821 7833 3382 -1543 -2413 -3772 -1043 1447 476 -2711
14176b711l429p5L256P083O197j003m579J784Q698P40n228j0329n452L628J414
$$ -2711 -6140 -6215 -2959 4124 10321 9318 4739 6523 15221 15961 10733 404 -5048 -1420 -6
14161fQ78K051m526m64j459k318M480N961l692J854M97j716l193k328M131L703
$$ -6 872 2923 -1603 -2067 -3526 -5844 -1364 4597 905 2759 3256 1540 -1653 -3981 150 3853
14145C853p62q74o143l975Q830K833m816J250M12q448K339M176K637J208O54P547
$$ 3853 3091 2217 -3926 -7901 929 3762 -1054 196 608 -7840 -5501 -1325 1312 2520 3174 10721
14129A0721J020n08k389m054K575J0844Q59l369m127k087j851J560j708q69j366
$$ 10721 11741 11233 8844 4790 7365 18209 19068 15699 11572 9485 7634 9194 7486 6617 5251
14114E251o794L540L649k154k041N393l783m319J269N564J659m279O15N029K21
$$ 5251 -1543 1997 5646 3492 1451 6844 3061 -1258 11 5575 7234 2955 3570 8599 8820
14099H820K247j275n799o149J051P046j613Q39K005j179J764l511q23j250n09
$$ 8820 11067 9792 3993 -2156 -1105 5941 4328 5167 7172 5993 7757 4246 3423 2173 1664
14084A664j75N585j082p773l944o527M728M455m982L30R438Q925k15l810l001
$$ 1664 1489 7074 5992 -1781 -5725 -12252 -7524 -3069 -8051 -7721 1717 10642 10427 6617 3616
14069C616l59N041P080N815P94j954j836p544q027m4R49N993l495l414P73m257
$$ 3616 3257 8298 15378 21193 21987 20033 18197 10653 2626 2582 3531 9524 6029 2615 3388 -869
14053h69N331L216l406m320j381M759n12l128l109k42N001K55N060M908j323m654
$$ -869 4462 7678 4272 -48 -1429 3330 2818 -310 -3419 -3661 1340 1595 6655 11563 10240 5586
14037E586m270J679K189n334q666n236R807J0285m946o619O950O501R6k354m88
$$ 5586 1316 2995 5184 -150 -8816 -14052 -4245 6040 1094 -5525 1425 7926 8022 5668 5180
14022E180j524n766O588L253p991l752P642P049k797o617K522J902n741p753R49
$$ 5180 3656 -2110 4478 7731 -260 -4012 3630 10679 7882 1265 3787 5689 -52 -7805 -6856
14007f856Q215Q412M13p883k767k172m85O367P498l209l77M38l672o737o704R416
$$ -6856 1359 9771 10184 2301 -466 -2638 -3123 3244 10742 7533 7156 7594 3922 -2815 -9519 -103
13991a03R964k571L096l109k558J311j552K479l091l143L657M100N208L240o259
$$ -103 9861 7290 10386 7277 4719 6030 4478 6957 3866 723 4380 8480 13688 16928 10669
13976A0669j304P52N70q91j229n78J209M646m43p406j650n700j459Q683J169n09
$$ 10669 9365 10117 10687 9796 8567 7989 9198 13844 13401 5995 4345 -1355 -2814 5869 7038 6529
13960F529l823j0808M291J0703p11n095L168M403K075k354k350N29J612J024m35
$$ 6529 2706 -8102 -3811 6892 6181 1086 4254 8657 10732 8378 6028 6557 8169 9193 8758
13945H758J738n719l897M216k220o10k295l434J816M655j734N762K053O365n22
$$ 8758 10496 4777 880 5096 2876 2266 -29 -3463 -1647 3008 1274 7036 9089 15454 14932
13930A4932m190l305k254L341R764n284l822k515j03M274L447j909k910K614j407
$$ 14932 10742 7437 5183 8524 18288 13004 9182 6667 6564 10838 14285 12376 9466 12080 10673
13915A0673l041N209P231J0668R112N679N946m828o30M259m498n513q117j167
$$ 10673 7632 12841 20072 30740 39852 45531 51477 46649 46019 50278 45780 40267 32150 30983
13901C0983M16k480j143m656r21M616k095n434j2431K152O949j376p375n718R551
$$ 30983 31399 28919 27776 23120 22199 26815 24720 19286 6855 9007 15956 14580 7205 1487 11038
13886A1038J4165J613o343p181m767n408m708L529P227J476N963j880K50k515
$$ 11038 25203 26816 20473 13292 8525 3117 -1591 1938 9165 10641 16604 14724 14974 12459
13872A2459j1028r2j381j054j867K295J0242L968Q45k428K258j018n097q12J288
$$ 12459 1431 1339 -42 -1096 -2963 -668 9574 13542 14387 11959 14217 13199 8102 7290 8578
13857H578M405O93k909K747M331K045L284K342l049l708k152m88m167R37R264
$$ 8578 12983 13676 10767 13514 17845 19890 23174 25516 22467 18759 16607 16119 11952 12889 22153
13842B2153R50j585k400k542J702Q104P884j042n096j0955j955j458L225m068
$$ 22153 23103 21518 19118 16576 18278 26382 34266 33224 28128 17173 15218 13760 16985 12917
13828A2917j691R85L207L958l718L83l135o233K550k399r19N964L564j67l516
$$ 12917 11226 12211 15418 19376 15658 16041 12906 6673 9223 6824 5905 11869 15433 15266 11750
13813A1750N72J137k840p36N761j974J003P79N4m39o421k217O554K743p119p144
$$ 11750 12322 13459 10619 9883 15644 13670 14673 15452 15506 15067 8646 6429 12983 15726 8607 1463
13797A463l534L282N302M335N06q64K993J781m174K69J474m841J48j292l482J413
$$ 1463 -2071 1211 6513 10848 11354 10490 13483 15264 11090 11359 12833 7992 8140 6848 3366 4779
13781D779l957r95l919R19j311P056L199j514j089O386K22l146R55j097r71K827
$$ 4779 822 -173 -4092 -3173 -4484 2572 5771 4257 3168 9554 9776 6630 7585 6488 5517 8344
13765H344O674o44p008l806J037J444P356M47n818q037K739L574n594M390O933
$$ 8344 15018 14374 7366 3560 4597 6041 13397 13844 8026 -11 2728 6302 708 5098 12031
13750A2031O337l431o167q51k401m161L022K390M110j714k429j633J842m97O425
$$ 12031 18368 14937 8770 7919 5518 1357 4379 6769 10879 9165 6736 5103 6945 6448 12873
13735A2873L433l777o994L068l224p22L853o29N750L252m079L086j964m331k379
$$ 12873 16306 12529 5535 8603 5379 4657 8510 7881 13631 16883 12804 15890 13926 9595 7216
13720G216L753j003j602J677M893k148o46J039L481k661n836j310n120K859O215
$$ 7216 10969 9966 8364 10041 14934 12786 12140 13179 16660 13999 8163 6853 1733 4592 10807
13705A0807P611l598o979K012M083J456M623q1m391j265L777L931n385L596J614
$$ 10807 18418 14820 7841 9853 13936 15392 20015 19934 15543 14278 18055 21986 16601 20197 21811
13690B1811j660l609k644n764K927Q348K560o346P01K641L299J703J013J110J0275
$$ 21811 20151 16542 13898 8134 11061 19409 21969 15623 16324 18965 22264 23967 24980 26090 36365
13675C6365P014J094Q1K781M448J662L482N090n536n529R99N567L510J958m015
$$ 36365 43379 44473 44554 47335 51783 53445 56927 62017 56481 50952 51951 57518 61028 62986 58971
13660E8971L238L387o48j117r92p169p530o112k544K195m886k841m135j584j63
$$ 58971 62209 65596 64948 63831 62839 55670 48140 42028 39484 41679 36793 33952 29817 28233 28070
13645B8070l873J0l294p368k74R562J641l310k512P045J656m103j613l441k119
$$ 28070 24197 24207 20913 13545 13271 22833 24474 21164 18652 25697 27353 23250 21637 18196 16077
13630A6077p136Q36M410K629m772k928P639L350k982J232O44Q63L052K765N68
$$ 16077 8941 9777 14187 16816 12044 9116 16755 20105 17123 18355 18999 19862 22914 25679 26247
13615B6247p211M191J2580J3513L322n162L075o96o540p570m081L84p525N26m988
$$ 26247 19036 23227 35807 49320 52642 47480 50555 49859 43319 35749 31668 32052 24527 25053 20065
13600B0065L26J279m063n620r0m992R097o82j196Q424k721l968l990k330k473
$$ 20065 20391 21670 17607 11987 11897 6905 16002 15320 14124 22548 19827 15859 11869 9539 7066
13585G066j241M272N986N936m877P007J1696R51r3K712Q682L485k809m916n518
$$ 7066 5825 10097 16083 22019 17142 24149 35845 36796 36703 39415 48097 51582 48773 43857 38339
13570C8339n277k313o485n181m62m089j298J636L861L413L193r248r34L039j952
$$ 38339 33062 30749 24264 19083 18621 14532 13234 14870 18731 22144 25337 16089 15155 18194 16242
13555A6242k643j929l101j047K366K481j722L542J546J65K248o634k40q81k88
$$ 16242 13599 11670 8569 7522 9888 12369 10647 14189 15735 15900 18148 11514 11274 10393 10105
13540A0105J088j54J209M279O365L31K581o542p858L496M231O80m382L754J194
$$ 10105 11193 11039 12248 16527 22892 23223 25804 19262 11404 14900 19131 19811 15429 19183 20377
13525B0377J49K757N455K221r52K217n14l943J587L73l956N299J1291M597Q416
$$ 20377 20526 23283 28738 30959 30007 32224 31710 27767 29354 29727 25771 31070 42361 46958 55374
13510E5374J2159R814J8497J4324R759L418m516q280j5456j3306j4299m596k668
$$ 55374 67533 77347 95844 110168 119927 123345 118829 110549 95093 81787 67488 62892 60224
13497F0224q359m346K732l48l749j140k192m230n72M556K275n459l131l634L987
$$ 60224 51865 47519 50251 49903 46154 45014 42822 38592 38020 42576 44851 39392 36261 32627 36614
13482C6614k776j710L674l211M550N136J506P106R046J1308Q575J7086J7906K8041
$$ 36614 33838 32128 35802 32591 37141 42277 43783 50889 59935 71243 79818 96904 114810 142851
13468A42851L7578L2771J6895j393j2802k0358k7900k2441k6195k1993p421p376
$$ 142851 180429 213200 230095 228702 215900 195542 167642 145201 119006 97013 89592 82216
13456H2216q981q072n423n402r058o572n000M887K485L412O809J05J272K626k743
$$ 82216 73235 65163 59740 54338 45280 38708 33708 38595 41080 44492 51301 51406 52678 55304 52561
13441E2561m474j665M681J400K963L12M51J207K585m17R193J0706R550J9705K0691
$$ 52561 48087 46422 51103 52503 55466 55778 56229 57436 60021 59604 68797 79503 89053 108758 129449
13426A29449O670l0j0025q186j2074j4075j0951r797n234n362m817r283p392k234
$$ 129449 136119 136089 126064 117878 105804 91729 80778 70981 65747 60385 55568 46285 38893 36659
13412C6659M64M997k945k589M342K614M79l349n418l687J910R36m524K096l454
$$ 36659 37123 42120 39175 36586 40928 43542 44021 40672 35254 31567 33477 34413 29889 31985 28531
13397B8531O75j321q06L978j134l780m950l250L04P733J696M183J794j807M44
$$ 28531 29206 27885 27079 31057 29923 26143 21193 17943 18247 25980 27676 31859 33653 31846 32290
13382C2290L607j94L53j805L42m303k826o080l63Q42M579J089o275j999P49J126
$$ 32290 35897 35703 36056 34251 34593 30290 27464 21384 21021 21863 26442 27531 21256 19257 20006 21132
13366B1132P22j222L379J020L211R622n592n513J844m884l025k519j29K364j448
$$ 21132 21854 20632 24011 25031 28242 37864 32272 26759 28603 23719 20694 18175 18046 20410 18962
13351A8962j94K249N611K101p659l692K203L322j700k752l53P73P921M719o433
$$ 18962 18768 21017 26628 28729 21070 17378 19581 22903 21203 18451 18098 18871 26792 31511 25078
13336B5078M091L859k166j672O110N213J59l773M81K750K814J010M67l018l034
$$ 25078 29169 33028 30862 29190 35300 40513 40672 36899 37380 40130 42944 43954 44421 41403 38369
13321C8369J493j558o697j043l660R713J52r808j476o1j959o53J53J766L690M329
$$ 38369 39862 38304 31607 30564 26904 36617 36769 26961 25485 25424 23465 22812 22965 24731 28421 32750
13305C2750k718n004L899N143J070k673o899L465N26M337l169j903L846Q244M991
$$ 32750 30032 25028 28927 34070 35140 32467 25568 29033 29559 33896 30727 28824 32670 40914 45905
13290D5905J820P53K779m00j383k842k324K030M786P00m390M94m078K114J360
$$ 45905 47725 48478 51257 50857 49474 46632 44308 46338 51124 51824 47434 47928 43850 45964 47324
13275D7324r72KL572L492M300M032j48K356j450l656l241q029M60n081j932O724
$$ 47324 46352 46354 49926 53418 57718 61750 61602 63958 62508 58852 55611 47582 48042 42961 41029 47753
13259D7753n290o787J636k473M385R519J033m171m141M822M276l331q947l363
$$ 47753 42463 35676 37312 34839 39224 48743 49776 45605 41464 46286 50562 47231 38284 34921
13245C4921J1149N62j395j392K666P47k110L632l20N870k8k708P938K080k764
$$ 34921 46070 46632 45237 43845 46511 47258 45148 48780 48460 54330 54302 51594 59532 61612 58848
13230E8848K14L358J24o945k254J849M509m836p694K649J0925k511j0746o67O212
$$ 58848 59062 62420 62544 55599 53345 55194 59703 54867 47173 49822 60747 58236 47490 46823 53035
13215E3035M57l624m55M984Q077k420J320L927J885r09l163l904k642N668L695
$$ 53035 53492 49868 49413 54397 62474 60054 61374 65301 67186 66277 63114 59210 56568 62236 65931
13200F5931P39l862k731n08N258M42j0929m877M452O441K627N809P409k267J412
$$ 65931 66670 62808 60077 59569 64827 65269 54340 49463 53915 60356 62983 68792 76201 73934 75346
13185G5346R967J499l172M737J692o174n790q068l990L964L215P566O31j389K033
$$ 75346 85313 86812 83640 88377 90069 83895 78105 70037 66047 70011 73226 80792 81423 80034 82067
13170H2067J258J228J0055j456n240l3n817n117L464M453K189L044K477J712N601
$$ 82067 83325 84553 94608 93152 87912 87879 82062 76945 80409 84862 87051 90095 92572 94284 99885
13155I9885M555j0410l47M44N394M351O502N162P205J6735K3280J0252k22j2037
$$ 99885 104440 94030 93683 94127 99521 103872 110374 115536 122741 139476 162756 173008 172786 160749
13141A60749q092p470j3982n720k222j0507k907N436J741K063N124m237m300n694
$$ 160749 152657 145187 131205 125485 123263 112756 109849 115285 117026 119089 124213 119976 115676 109982
13127A09982J0183J0042N284M397R728L447K87J880Q541J3932R097J767n275l144
$$ 109982 120165 130207 135491 139888 149616 153063 153350 155230 163771 177703 186800 188567 183292 180148
13113A80148r08K104l422O515J5992R365N240M762Q228J6814J3283R711N125R593
$$ 180148 179240 181344 177922 184437 200429 209794 215034 219796 228024 244838 258121 267832 272957 282550
13099B82550P636k802l275p279M375J2812J1518J4952J5842J1711J0875K3314
$$ 282550 290186 287384 284109 276830 281205 294017 305535 320487 336329 348040 358915 382229
13087C82229K1822J7110K0713L8109M3625M8281O3089O6413P4086Q0602R6070
$$ 382229 404051 421161 441874 479983 523608 571889 634978 701391 775477 856079 952149
13076I52149Q9016R0604R3182Q6805R2185R0955J02192J19496J56538K14952L10127
$$ 952149 1041165 1131769 1224951 1311756 1403941 1494896 1597088 1716584 1873122 2088074 2398201
13065B398201M21077N85900Q09922J137982J595977K208519K905873L449944L416164
$$ 2398201 2819278 3405178 4215100 5353082 6949059 9157578 12063451 15513395 18929559
13056A8929559K491763Q27739j014414k423199l008443k864367k360506j834261
$$ 18929559 21421322 22249061 21234647 18811448 15803005 12938638 10578132 8743871
13048H743871j417111j124306q86658o96047n51215m35736l39956k74085k20798
$$ 8743871 7326760 6202454 5315796 4619749 4068534 3632798 3292842 3018757 2797959
13039B797959j65099j25172p8679k4121L6196Q1583J36215J74362K01459K34608
$$ 2797959 2632860 2507688 2429009 2404888 2441084 2522667 2658882 2833244 3034703 3269311
13029C269311K72736L39125M56473O40354R11718J270480J781214K501820L516070
$$ 3269311 3542047 3881172 4337645 4977999 5889717 7160197 8941411 11443231 14959301
13020A4959301M890487O436808P506421P151103M737168Q32351l184233o024182
$$ 14959301 19849788 26286596 33793017 40944120 45681288 46513639 43329406 37305224
13012C7305224o855991o148008m850142l643925k772844k171490j721073j378876
$$ 37305224 30449233 24301225 19451083 15807158 13034314 10862824 9141751 7762875
13004G762875j098955q71860o97576n73591m74783l85771l25124k37796j56339
$$ 7762875 6663920 5792060 5094484 4520893 4046110 3660339 3335215 3097419 2941080
12995B941080q6567l5281l197J0409K1780M2336P1415J21301K06603L20076M88920
$$ 2941080 2854513 2819232 2816035 2826444 2848224 2890560 2961975 3083276 3289879 3609955 4098875
12984D098875P01410R73084J369939J920535K602018L262974L580864L117850
$$ 4098875 4800285 5773369 7143308 9063843 11665861 14928835 18509699 21627549
12976B1627549J727635j99826k017524l134810l335790k894815k275170j742586
$$ 21627549 23355184 23155358 21137834 18003024 14667234 11772419 9497249 7754663
12968G754663j348802j065753q48590o83458n45794m51783l60049k92397k38706
$$ 7754663 6405861 5340108 4491518 3808060 3262266 2810483 2450434 2158037 1919331
12959A919331j95692j50161r5364o5689m8813m4998o7075q2967r8077r9022r7308
$$ 1919331 1723639 1573478 1478114 1412425 1363612 1318614 1251539 1168572 1070495 971473 874165
12948H74165r4114q2619o2213n0787m3881l9355l0120k6532l0396k3834j9344
$$ 874165 780051 697432 635219 584432 540551 501196 471076 444544 414148 390314 370970
12937C70970k5297j9484j5567r452j7530j7940j2783j3683j2162k738n917j1325
$$ 370970 345673 326189 310622 301170 283640 265700 252917 239234 227072 224334 218417 207092
12925B07092p30j878m898k59M157R172P548J6705K1006K0915J1694P074o735r618
$$ 207092 206362 204484 199586 199327 203484 212656 220204 236909 257915 278830 290524 297598 290863 281245
12911B81245k0784j9585k2922k2324n393N408l681m052m171k572O081L527J314
$$ 281245 260461 240876 217954 195630 190237 195645 191964 187912 183741 181169 187250 190777 192091
12898A92091o951j6585j2430m710q954j2435n265q866r707k013N219L032J98J084
$$ 192091 185140 168555 156125 151415 142461 130026 124761 115895 106188 104175 109394 112426 112624 113708
12884A13708J809m040j245J418J412j269P80o451l408m090j970l029n081m482
$$ 113708 115517 111477 110232 111650 113062 111793 112573 106122 102714 98624 96654 93625 88544 84062
12870H4062J681m532n254j71L138N97q624j1181K253P93R113j802m306n670K688
$$ 84062 85743 81211 75957 75786 78924 79521 70897 59716 61969 62762 71875 70073 65767 60097 62785
12855F2785P244L934K690m169M479J890o621j031O000L385O155M634J858k171
$$ 62785 70029 73963 76653 72484 76963 78853 72232 71201 77201 80586 86741 91375 93233 91062
12841I1062J202N331N029l771n952k722M448j498q864j689m418j476k527j1792
$$ 91062 92264 97595 102624 98853 92901 90179 94627 93129 84265 82576 78158 76682 74155 62363
12827F2363j292p3j856o430l532J338N27O790N11p90K133L561j591L188K250k670
$$ 62363 61071 60998 59142 52712 49180 50518 51045 57835 58346 57556 59689 63250 61659 64847 67097 64427
12811F4427L199N352M996M398P827Q11J877K589l667j957O953P262j420p567k149
$$ 64427 67626 72978 77974 82372 90199 91010 92887 95476 91809 89852 96805 104067 102647 95080 92931
12796I2931l998j648K765R07o919l801J112K681k622M308L627K6L937M462J175
$$ 92931 88933 87285 90050 90957 84038 80237 81349 84030 81408 85716 89343 89369 93306 97768 98943
12781I8943L325J2903P075J1039J6278N025M605J814P686M512n659l036j2270
$$ 98943 102268 115171 122246 133285 149563 154588 159193 161007 168693 173205 167546 164510 152240
12768A52240l438j821K58l478q901q55J606j663k597j463M163J683R029J0218
$$ 152240 148802 146981 147239 143761 134860 134005 135611 133948 131351 129888 134051 135734 144763 154981
12754A54981K814l856j0804o848Q024M905L603J3380Q519M945M899N7J69N69J1909
$$ 154981 157795 153939 143135 136287 144311 149216 152819 166199 174718 179663 184562 184619 184788 185357 197266
12739A97266K5011L3376M3430N6547P4666R3214R8005P7028M8206J7451j4314
$$ 197266 222277 255653 299083 355630 430296 523510 621515 698543 746749 764200 749886
12728G49886n4264p3451o1026m8785n1120n0937m3081l0870k5864k417L592q011
$$ 749886 695622 622171 561145 512360 461240 410303 367222 336352 310488 308071 311663 303652
12716C03652j914k88O74N56M136k225k247N640M802R13J4533J9529J6085J3922
$$ 303652 301738 301450 302124 302680 306816 304591 302344 307984 312786 313699 328232 347761 363846 377768
12702C77768N466Q713J1742J5821J4526R864R965J6560L1222K4195K0732K1264
$$ 377768 383234 391947 403689 419510 434036 443900 453865 470425 501647 525842 546574 567838
12690E67838K1557K1812J5929K7134M4299L9411L9685L9732L6741M1368M2630
$$ 567838 589395 611207 627136 654270 698569 737980 777665 817397 854138 895506 938136
12679I38136N4834N7233O6592P3692Q8315J04353J16732J33751J54075J79816
$$ 938136 992970 1050203 1116795 1190487 1278802 1383155 1499887 1633638 1787713 1967529
12669A967529K03231K40361K88931L40601L99734M62012N28925O02311P01551
$$ 1967529 2170760 2411121 2700052 3040653 3440387 3902399 4431324 5033635 5735186
12660E735186Q28965R98836J246554J609516K134559K908914L989217N394065
$$ 5735186 6564151 7562987 8809541 10419057 12553616 15462530 19451747 24845812
12652B4845812O974239Q346488R092403Q848586P477826N134493K121623j132756
$$ 24845812 31820051 40166539 49258942 58107528 65585354 70719847 72841470 71708714
12644G1708714m142314o520251p968976q334315p761043o601316n294133m164184
$$ 71708714 67566400 61046149 53077173 44742858 36981815 30380499 25086366 20922182
12636B0922182l298765k646662k146847j761726j480724j271318j102288r80698
$$ 20922182 17623417 14976755 12829908 11068182 9587458 8316140 7213852 6233154
12628F233154q54226p30507o24004n17062m22734l45017k85796k37296j94210
$$ 6233154 5378928 4648421 4024417 3507355 3084621 2739604 2453808 2216512 2022302
12619B022302j60905j31557j14308j04341r9339q7034q0250q2688o8581o1115
$$ 2022302 1861397 1729840 1615532 1511191 1411852 1324818 1244568 1161880 1093299 1032184
12609A032184m8291l9380k4145j6808j8368k4636l0488k6648k1436k5277j9293
$$ 1032184 983893 944513 920368 903560 885192 860556 830068 803420 781984 756707 737414
12598G37414m106j1185j8444j8697j1915j5644j9978j4007k3543l6548l5419l7142
$$ 737414 733308 722123 703679 684982 673067 657423 637445 623438 599895 563347 527928 490786
12586D90786l6001k6735j8063r649P069K849J3454J4301J2847M252l768n257m758
$$ 490786 454785 428050 409987 400338 407407 410256 423710 438011 450858 455110 451342 446085 441327
12573D41327RQ6R30o726k4718k5322k9627l2155k5536l943P05R760K2264K6543
$$ 441327 441336 441422 442352 435626 410908 385586 355959 323804 298268 294325 295030 304790 327054 353597
12559C53597K3196K2618J2232j2940k7265k8567k5750j9185p473p034k952Q486
$$ 353597 376793 399411 411643 398703 371438 342871 317121 297936 290463 283429 280477 288963
12547B88963K1645K3335K7617M1208N0281N0576N0920K9789k939k3999k5826l5239
$$ 288963 310608 333943 361560 402768 453049 503625 554545 584334 581395 557396 531570 496331
12535D96331m7155n2199n2220m1124k4645k0460j5021j7264j0711q136j2012o068
$$ 496331 449176 396977 344757 303633 278988 258528 243507 226243 215532 207396 195384 189316
12523A89316l339O171L486J2392Q223J778q07p259j4683j1632j9610j3572p915
$$ 189316 185977 192148 195634 208026 216249 218027 217220 209961 195278 183646 164036 150464 142549
12510A42549j1624j0090r032r184n759J087l310q898p611n116J857q80j463K765
$$ 142549 130925 120835 111803 102619 96860 97947 94637 85739 78128 73012 74869 73989 72526 75291
12496G5291m874j0430n809p667J399K358n809k867o281q82N66L507N537j959P40
$$ 75291 70417 59987 54178 46511 47910 50268 44459 41592 35311 34429 34995 38502 44039 42080 42820
12481D2820N09K199J93m16j341k075j620j011J990N51k814k365R7l611N86k3J634
$$ 42820 43329 45528 45721 45305 43964 41889 40269 39258 41248 41799 38985 36620 36717 33106 33692 33669 35303
12464C5303M141K093m456k988J731J594l369n392j0397m8J317l130K05J2151L177
$$ 35303 39444 41537 37081 34093 35824 37418 34049 28657 18260 18212 19529 16399 16604 28755 31932
12449C1932l275M651j444m522k211J22m039N849j930k102O083m68l53j47n199
$$ 31932 28657 33308 31864 27342 25131 25253 21214 27063 25133 23031 29114 28646 28293 28146 22947
12434B2947L384P058j86k737m35j539L173R031J974K236k31K161k656r294p5o67
$$ 22947 26331 33389 33203 30466 30031 28492 31665 40696 42670 44906 44675 46836 44180 34886 34811 34144
12418C4144l503P024m39M31P772J675p514o767k159O60Q406Q894L646o31j731
$$ 34144 30641 37665 37226 37657 45429 47104 39590 32823 30664 31324 39730 48624 52270 51639 49908
12403D9908K664r2L224K917J059p01J1983K2756J6293J6242J7113K5784L6185
$$ 49908 52572 52480 55704 58621 59680 58979 70962 93718 110011 126253 143366 169150 205335
12390B05335K0689q474l0691l6401k2402r150o919m787J047P02j51O242O606P315
$$ 205335 226024 217550 186859 150458 128056 118906 111987 107200 108247 108949 108798 115040 121646 128961
12376A28961P706K62o069O609r44L403J0843J2712Q535J781R08m607j0355M432
$$ 128961 136667 136929 130860 137469 136525 139928 150771 163483 172018 173799 174707 170100 159745 164177
12362A64177M477J551Q595K7244L3227L9286N4275O8251N3969K2823j5794m4815
$$ 164177 168654 170205 178800 206044 239271 278557 332832 401083 455052 477875 462081 417266
12350D17266n7963n5980m3298k3863k3993j8324j5453j1910J182O381m03j1851
$$ 417266 359303 303323 260025 236162 212169 193845 178392 166482 167664 174045 173642 161791
12338A61791p584p152j2664r950p777q417n884L681l855q437r05j2669m26M918
$$ 161791 154207 147055 134391 124441 116664 108247 102363 106044 102189 93752 92847 80178 79752 84670
12324H4670M941J230N145J4666J8069J7133K8879L3453P271k1967m0404k5847
$$ 84670 89611 90841 95986 110652 128721 145854 174733 208186 215457 193490 153086 127239
12312A27239k9411j9595p382j0842j0373m158L400k220m580n054k162k514N411
$$ 127239 97828 78233 70851 60009 49636 45478 48878 46658 42078 37024 34862 32348 37759
12299C7759k253j061n125n0K785n731l581j999o108o400J219J157n948o67Q745
$$ 37759 35506 34445 29320 29270 32055 26324 22743 20744 14636 8236 9455 10612 4664 3997 12742
12284A2742L924l905q342Q23M324J091k297j037L854O278p851k637m86M43k534
$$ 12742 16666 12761 4419 5242 9566 10657 8360 7323 11177 17455 9604 6967 6481 6924 4390
12269D390l763J011J064K066K454j665K008N516P888K38o385K358k819M184m150
$$ 4390 627 1638 2702 4768 7222 5557 7565 13081 20969 21207 14822 17180 14361 18545 14395
12254A4395q85n573q441J0422L926k693n79o334l613L431L228Q463N295l597r228
$$ 14395 13510 7937 -504 9918 13844 11151 10572 4238 625 4056 7284 15747 21042 17445 8217
12239H217j947j220m326O193K420j47L984L387l987N043P165O703N264L608M614
$$ 8217 6270 5050 724 6917 9337 9190 13174 16561 12574 17617 24782 31485 36749 40357 44971
12224D4971L262M481J3953J4407J8756K6769L5764M3759M1159M6101M1807L0885
$$ 44971 48233 52714 66667 81074 99830 126599 162363 206122 247281 293382 335189 366074
12212C66074L797m574j4957k7183m0642m4843l3219l5619l3690j7948j5572j4762
$$ 366074 369871 365297 350340 323157 282515 237672 204453 168834 135144 117196 101624 86862
12200H6862j6886j4168j0192o993q347L615J655j5884q286p23J697m798J465J314
$$ 86862 69976 55808 45616 38623 30276 33891 35546 19662 11376 10653 12350 7552 9017 10331
12186A0331j476l88K713K266N069j086o938n47N521j693K040l943m575l58Q57
$$ 10331 8855 8467 11180 13446 18515 17429 10491 9944 15465 13772 15812 11869 7294 6936 7793
12171G793J31q08L196L093m320l811O670j363J50n76L486K847r48k738o69K06
$$ 7793 7924 7116 10312 13405 9085 5274 11944 10581 10731 10155 13641 16488 15540 12802 12133 12339
12155A2339q582K839L508n26Q65K375k062O68N543J45j0653q337J586M318j907
$$ 12339 3757 6596 10104 9578 10443 12818 10756 11424 16967 17112 6459 -1878 -292 4026 2119
12140B119j687K206L111l962o860K343L931o511m723M688O233k027q01p43M933
$$ 2119 432 2638 5749 1787 -5073 -2730 1201 -5310 -10033 -5345 888 -1139 -1940 -2683 2250
12125B250KO75J13k953p904q07J761P861M428j0771L592R251K68L055L425J437
$$ 2250 2252 2927 3040 87 -7817 -8624 -6863 998 5426 -5345 -1753 7498 7766 10821 14246 15683
12109A5683m304q938O20K554j876N736K817m560K0m29m24m266L183M665m548K21
$$ 15683 11379 2441 3061 5615 3739 9475 12292 7732 7752 7323 6899 2633 5816 10481 5933 6154
12093F154K415n89m529l452O298O493p154K746K809r36j90j738p473l901O880
$$ 6154 8569 7980 3451 -1 6297 12790 5636 8382 11191 10255 10065 8327 854 -3047 3833
12078C833r90Q816K106M15M980k54q868l946M255N179k244o832J510J233p270
$$ 3833 2843 11659 13765 14180 19160 18906 10038 6092 10347 15526 13282 6450 7960 9193 1923
12063A923j2306n16L259K643r33m217J3275N241k873k995K566n076p2P252n366
$$ 1923 -10383 -10899 -7640 -4997 -5930 -10147 3128 8369 5496 2501 5067 -9 -81 7171 1805
12048A805m609J73L893M030N131o275k029n18L637N364J870l080j384k519l855
$$ 1805 -2804 -2631 1262 5292 10423 4148 2119 1601 5238 10602 12472 9392 8008 5489 1634
12033A634M147P30n98k879m629o370O254M473L11r62q34J420K917l142n52Q919
$$ 1634 5781 6511 5913 3034 -1595 -7965 -1711 2762 3073 2111 1277 2697 5614 2472 1920 10839
12017A0839J044M065k398K996m31M8l648k632l423n658L23k234N654O435j249
$$ 10839 11883 15948 13550 16546 16115 16163 12515 9883 6460 802 1125 -1109 4545 10980 9731
12002I731j1784k03M935K696j023j646k566m926k408N285M261n887m292J89M36
$$ 9731 -2053 -2256 2679 5375 4352 2706 140 -4786 -7194 -1909 2352 -3535 -7827 -7638 -7202
11987g202L230k989j433K812L48j223K552L200P10K233r08j0O036M96o589K76
$$ -7202 -3972 -6961 -8394 -5582 -5234 -6457 -3905 -705 5 2238 1330 1320 7356 7852 1263 1539
11971A539l185j227J1557k682p232l128l127M258Q191j88k543R045J263n905m68
$$ 1539 -1646 -2873 8684 6002 -1230 -4358 -7485 -3227 4964 4776 2233 11278 12541 6636 6168
11956F168K485M8j79j773m518p015N512k375r43J160K206j732L16O7k502M7M413
$$ 6168 8653 8701 8522 6749 2231 -4784 728 -1647 -2590 -1430 776 -956 -640 -573 -3075 -3028 1385
11939A385L828n31J426M665L281n190J135n439q58K320l028P13P772P37j792m16
$$ 1385 5213 4682 6108 10773 14054 8864 9999 4560 3702 6022 2994 3707 11479 12216 10424 10008
11923A0008o919K264O999M364k113o168j829j727M635K117j234r96l746J222l267
$$ 10008 3089 5353 12352 16716 14603 8435 6606 4879 9514 11631 10397 9401 5655 6877 3610
11908C610n289L205k19m648l751N472P216n619k087l843q25n907O783P163Q636
$$ 3610 -1679 1526 1307 -3341 -7092 -1620 5596 -23 -2110 -5953 -6778 -12685 -5902 1261 9897
11893I897l498k037K537m593k893L98J315k992q281n836L010M053K952J952O122
$$ 9897 6399 4362 6899 2306 -587 -189 1126 -1866 -10147 -15983 -12973 -8920 -5968 -4016 2106
11878B106n299n119r89M065P641l013j550M952M219M341N891m084p03O989o5m351
$$ 2106 -3193 -8312 -9301 -5236 2405 -608 -2158 2794 7013 11354 17245 13161 12458 19447 19382 15031
11862A5031k713J616q137N465R90m612N96o687p768J627L03K450J0090O862M037
$$ 15031 12318 13934 5797 11262 12252 7640 8236 1549 -6219 -4592 -4289 -1839 8251 15113 19150
11847A9150o613r227k660O23J602J853M054l54j903P06L458J227k472k930j561
$$ 19150 12537 3310 650 1273 2875 4728 8782 8428 6525 7231 10689 11916 9444 6514 4953
11832D953l338l066J692N090J963o73j550K991L708o331m517O64K997j206j505
$$ 4953 1615 -1451 241 5331 7294 6621 5071 8062 11770 5439 922 1586 4583 3377 1872
11817A872O501N158r13n321k955J305J26l2q70k204m180j368J078L342K389q48
$$ 1872 8373 13531 12618 7297 4342 5647 5773 5741 4871 2667 -1513 -2881 -1803 1539 3928 3080
11801C080m857N82M346J632j861M03K542m714L779P80K523r419j0062M089M006
$$ 3080 -1777 -1195 3151 4783 2922 3325 5867 1153 4932 5712 8235 -1184 -11246 -7157 -3151
11786c151J707K958N597J274p860m858R229Q836K295l650j904m224L42M004j885
$$ -3151 -1444 1514 7111 8385 525 -4333 4896 13732 16027 12377 10473 6249 6591 10595 8710
11771H710M211m092o217l655l2J341j772j893l411L912Q794L643p19L334Q186
$$ 8710 12921 8829 2612 -1043 -1075 266 -1506 -3399 -6810 -2898 5896 9539 8820 12154 20340
11756B0340P15p221n059p135o273l600K583N446J200j10j37o111q22k053R382
$$ 20340 21055 13834 8775 1640 -4633 -8233 -5650 -204 996 886 749 -5362 -6184 -8237 1145
11741A145J0712j888j0410l874Q495k594M003N093k362k778J799n317k600n258
$$ 1145 11857 9969 -441 -4315 4180 1586 5589 10682 8320 5542 7341 2024 -576 -5834
11727e834O248K179R65k086J761l170K517J1558k795J589j1j134M952J923n069
$$ -5834 414 2593 3558 1472 3233 63 2580 14138 11343 12932 12921 11787 16739 18662 13593
11712A3593K45O43m006p330m313K64N15M29J621M404j646j779N50O821j635p166
$$ 13593 13838 14481 10475 3145 -1168 -904 -389 40 1661 6065 4419 2640 3190 10011 8376 1210
11696A210j497j350p26L606K119k61r80M345K826n478k770J75P062N847J236Q23
$$ 1210 -287 -1637 -2363 1243 3362 3101 2121 6466 9292 3814 1044 1219 8281 14128 15364 16187
11680A6187q34m481J727l485M263L24k004j969l972l042j383k603R015k356l415
$$ 16187 15353 10872 12599 9114 13377 13701 11697 9728 5756 2714 1331 -1272 7743 5387 1972
11665A972j79J181P085M39m729kP340L345K12M380p523o256n309o26O267N164
$$ 1972 1793 2974 10059 10498 5769 5767 13107 16452 16664 21044 13521 7265 1956 1330 7597 12761
11649A2761k350k864o908L7K722j840J2k437K936J43K904j10j395J263j389r877
$$ 12761 10411 7547 639 676 3398 1558 1570 -867 2069 2212 5116 5006 3611 4874 3485 -6392
11633f392k131N401o011J651R129L074k95j294M786M997m577q863L083N676J193
$$ -6392 -8523 -3122 -9133 -7482 1647 4721 4426 3132 7918 12915 8338 -525 2558 8234 9427
11618I427k429j998M283L008n29K678P420j797m974o405l973j5J436j170M574
$$ 9427 6998 5000 9283 12291 11762 14440 21860 20063 15089 8684 4711 4696 6132 4962 9536
11603I536k82o474m432k171O936M230J152j137K670N666K541k778n871m899r05
$$ 9536 9254 2780 -1652 -3823 3113 7343 8495 7358 10028 15694 18235 15457 9586 4687 3782
11588C782J955r62k980K909j076k033P247N059L263p975o044J568j868M823J030
$$ 3782 5737 4775 1795 4704 3628 1595 8842 13901 17164 9189 3145 4713 2845 7668 8698
11573H698m534J692j164Q67r47J0358l813q139J322K018K193M019J217n971J186
$$ 8698 4164 5856 4692 5559 4612 14970 11157 3018 4340 6358 8551 12570 13787 7816 9002
11558I002m615k958m243J695K576Q38K871J2959L138j952q035K070K215q70n315
$$ 9002 4387 1429 -2814 -1119 1457 2295 5166 18125 21263 19311 11276 13346 15561 14691 9376
11543I376J490j062K827N765J017L304L077l030Q669j512l861q309o148J529M716
$$ 9376 10866 9804 12631 18396 19413 22717 25794 22764 31433 29921 26060 17751 11603 13132 17848
11528A7848J857k826l467M309P097o368n454j779N84L087q29J31J66K903j14P81
$$ 17848 19705 16879 13412 17721 24818 18450 12996 11217 11801 14888 14059 14190 14356 17259 17145 17926
11512A7926j036L433p612o510k231p218M265R360K669M505J461k216m685k507
$$ 17926 16890 20323 12711 6201 3970 -3248 1017 10377 13046 17551 19012 16796 12111 9604
11498I604j573j155K65N098J780K467K502j307L014p002o995O970j029k626J953
$$ 9604 8031 6876 7141 12239 14019 16486 18988 17681 20695 13693 6698 13668 12639 10013 11966
11483A1966M186l157l067Q182n822K560J160o803p423l408J6476R437o407n944
$$ 11966 16152 12995 9928 18110 12288 14848 16008 9205 1782 -1626 14850 24287 17880 11936
11469A1936n903n545K492L502K365M03J781k89m864m430O465R333J493K925P453
$$ 11936 6033 488 2980 6482 8847 9250 11031 10742 5878 1448 7913 17246 18739 21664 29117
11454B9117n960K462K890k597j996o801n106K246M37K841n844N03j700m299M99
$$ 29117 23157 25619 28509 25912 23916 17115 12009 14255 14692 17533 11689 12192 10492 6193 6692
11439F692J372K268L171N327O157J84n365o982l558j942j923L613P546L4l094
$$ 6692 8064 10332 13503 18830 24987 25171 19806 12824 9266 7324 5401 9014 16560 16594 13500
11424A3500n174L658K762M247K033r489n675p31L03k226L76M186N708J412l263
$$ 13500 8326 11984 14746 18993 21026 11537 5862 5131 5434 3208 3584 7770 13478 14890 11627
11409A1627k227m177N230O798L392m369M285N090n209j0584o370k863N025J812
$$ 11627 9400 5223 10453 17251 20643 16274 20559 25649 20440 9856 3486 623 5648 7460
11395G460J918O585M778m97K715q979o077P439J3104m537j2480o301J782k764
$$ 7460 9378 15963 20741 20244 22959 13980 7903 15342 28446 23909 11429 5128 6910 4146
11381D146L607J222L411r68q72L260l644k506n10n527L707R987K831o94m34p504
$$ 4146 7753 8975 12386 11418 10546 13806 10162 7656 7146 1619 5326 15313 18144 17450 17016 9512
11365I512k344L357p61R85L437k958q174K698K839R28N979j960K750j199j841
$$ 9512 7168 10525 9764 10749 14186 11228 3054 5752 8591 9519 15498 13538 16288 15089 13248
11350A3248l930J06M500M324r43m547n83K860P397p281l846L903J097k361n506
$$ 13248 9318 9424 13924 18248 17305 12758 12175 15035 22432 15151 11305 15208 16305 13944 8438
11335H438J930Q106n998j3309k191J2938R499J835m660l621o70O267l88o933j127
$$ 8438 10368 18474 12476 -833 -3024 9914 19413 21248 16588 12967 12297 18564 18176 11243 10116
11320A0116K539P206J071r673K307Q077j40k48p075l524P174M247O991K046k319
$$ 10116 12655 19861 20932 11259 13566 21643 21503 21255 14180 10656 17830 22077 29068 31114 28795
11305B8795N732n836j4562n379M504N432J1925N35l712l108l420k465K011M772
$$ 28795 34527 28691 14129 8750 13254 18686 30611 31146 27434 24326 20906 18441 20452 25224
11291B5224N82m160q311L385k593n682N240O520l037r564o321L956N767p34l849
$$ 25224 25806 21646 13335 16720 14127 8445 13685 20205 17168 7604 1283 5239 11006 10272 6423
11276F423L461J3170L331K020l190n922n066J418J291m221l098j732L894j213
$$ 6423 9884 23054 26385 28405 25215 19293 14227 15645 16936 12715 9617 7885 11779 10566
11262A0566J150j015m909l034k526Q864n05L394N1K923m492n195k134k063M92
$$ 10566 11716 10701 5792 2758 232 9096 8591 11985 12036 14959 10467 5272 3138 1075 1567
11247A567M092P835k759J606K532n10k511n211k491N091L205O078N386j674J590
$$ 1567 5659 13494 10735 12341 14873 14363 11852 6641 4150 9241 12446 18524 23910 22236 23826
11232B3826m272K232q03k884k468m496L75K910j643l147K656p42N261K229j119
$$ 23826 19554 21786 20983 18099 15631 11135 11510 14420 12777 9630 12286 11544 16805 19034 17915
11217A7915J935J485L878q23n217J09M576j875j083k665j1783k367M082N025N156
$$ 17915 19850 21335 25213 24390 19173 19282 23858 21983 20900 18235 6452 4085 8167 13192 18348
11202A8348N628O644m63k07k320k563Q35l806j736R506M519l071p139m243j156
$$ 18348 23976 30620 30157 29950 27630 25067 25902 22096 20360 29866 34385 31314 24175 19932 18776
11187A8776K466r28m610L91L941M236P577k561l478K066l26p75Q75k255Q34q45
$$ 18776 21242 20314 15704 16095 20036 24272 31849 29288 25810 27876 27550 26775 27650 25395 26229 25384
11171B5384j297p710P8p33m288k763K710N764K991K07j983J963L332j682k045
$$ 25384 24087 16377 16455 15722 11434 8671 11381 17145 20136 20343 18360 20323 23655 21973 19928
11156A9928k545m348M516J0332k551L359m155j810k835J03k05K769n7o33M174
$$ 19928 17383 13035 17551 27883 25332 28691 24536 22726 19891 19994 19789 22558 22501 21868 26042
11141B6042M990O526l272O07n54o386l288r15k456l470p23o509L055j138O81N38
$$ 26042 31032 37558 34286 34893 34339 27953 24665 23750 21294 17824 17101 10592 13647 12509 13190 13728
11125A3728l624k90M070P97O631N644O234j41j402j238m551n412j81L325M211
$$ 13728 10104 9814 13884 14681 21312 26956 33190 33049 31647 30409 25858 20446 20265 23590 27801
11110B7801L504K43l192m337K285J866o059J243L709M807L837K351k537m637p333
$$ 27801 31305 31548 28356 24019 26304 28170 22111 23354 27063 31870 35707 38058 35521 30884 23551
11095B3551Q07M994n043R2j326n041o79Q487L947n109K090J337K22L151l650J872
$$ 23551 24358 29352 24309 24401 23075 18034 17355 25842 29789 24680 26770 28107 28329 31480 27830 29702
11079B9702M76n754m193Q849O84m690K879j86J507J208m42M892Q269m253k18O340
$$ 29702 30178 24424 20231 29080 29764 25074 27953 27767 29274 30482 30040 34932 43201 38948 38730 45070
11063D5070M587O596P69l413p21O960J60j2253n12j301m09p19K908n036p022K317
$$ 45070 49657 56253 57022 53609 52888 59848 60008 47755 47243 45942 45533 44814 47722 42686 35664 37981
11047C7981j828m367J567k17k583L002q00L887J120o72K812k847q32J990P468
$$ 37981 36153 31786 33353 33136 30553 33555 32755 36642 37762 37090 39902 37055 36223 38213 45681
11032D5681K414K296o0K006L551N943J516J951O453P901M294j897j020j0315m639
$$ 45681 48095 50391 50331 52337 55888 61831 63347 65298 71751 79652 83946 82049 81029 70714 66075
11017F6075m448q756l543n121o237k131j14o79l145m171L305K755K846K314L403
$$ 66075 61627 52871 49328 44207 37970 35839 35725 35046 31901 27730 31035 33790 36636 38950 42353
11002D2353j104O70m945o53l017p136q376J636O684N574k784o563M556R059J1549
$$ 42353 41249 41919 36974 36321 33304 26168 17792 19428 26112 31686 28902 22339 26895 35954 47503
10987D7503R178J288m99O284M756N639M944M8j819l097J746m876o938J150P104
$$ 47503 56681 57969 57470 63754 68510 74149 79093 79141 77322 74225 75971 71095 64157 65307 72411
10972G2411Q952J6242J0957L372R377K0043J0995l188j7112j5562j6078q655q302
$$ 72411 81363 97605 108562 111934 121311 141354 152349 149161 132049 116487 100409 91754 83452
10959H3452j281j0510m146m507n521J48O680l767k544O80L397m942j204M704j702
$$ 83452 82171 71661 67515 63008 57487 57635 64315 60548 58004 58684 62081 57139 55935 60639 58937
10944E8937k709l755L33M766m792k512n7K374M96O858Q637O565J566J68j70J2183
$$ 58937 56228 52473 52806 57572 52780 50268 50211 52585 53081 59939 68576 75141 76707 76875 76705 88888
10928H8888J5195J1146J4662K3328L2251K0391O946O69l024j6293o399q002j1380
$$ 88888 104083 115229 129891 153219 185470 205861 212807 213476 210452 194159 187760 179758 168378
10915A68378r360j4269p938j1173r920j2470p667m344j720K686j76l210r958m962
$$ 168378 159018 144749 136811 125638 115718 103248 95581 91237 89517 92203 92027 88817 78859 73897
10901G3897J599n079r290k204L273k58r081k250P95J131M532p88K329L501N33
$$ 73897 75496 70417 61127 58923 62196 61938 52857 50607 51402 52533 57065 56277 58606 62107 62640
10886F2640M83L22p92O632J1179L975O524J5567J5538J4628J5391J7892Q115q311
$$ 62640 63123 63445 62653 69285 80464 84439 90963 106530 122068 136696 152087 169979 178094 169783
10872A69783k0631q170l246j4883k0878j6896p820o335m456o156Q21l077n745
$$ 169783 149152 140982 137736 122853 101975 85079 77259 70924 66468 60312 61133 58056 52311
10859E2311k826m63N211o742p075M119L127k507O17K205j938k074k17j245N433
$$ 52311 49485 49022 54233 47491 40416 44535 47662 45155 45772 47977 46039 43965 43748 42503 47936
10844D7936j578J998P752J534j363k703L989M533j064j984p277M17j535R34K089
$$ 47936 46358 48356 56108 57642 56279 53576 57565 62098 61034 59050 51773 52190 50655 51589 53678
10829E3678j486M381K859J231n639q17K856N51N419N031l620p39L564P00j405
$$ 53678 52192 56573 59432 60663 55024 54207 57063 57614 63033 68064 64444 63705 67269 67969 66564
10814F6564K944J229o400m04J268P067j600r62l02l753l89J622k153p308r008
$$ 66564 69508 70737 64337 63933 65201 72268 70668 69706 69404 65651 65262 66884 64731 57423 48415
10799D8415Q24R84L698r07k607m459l899j141Q864N486K326k592j0138l48Q742
$$ 48415 49239 50223 53921 53014 50407 45948 42049 40908 49772 55258 57584 54992 44854 44506 53248
10784E3248P10k684n617j513n660M185R255M041J209k297K136J590j069M992J1619
$$ 53248 53958 51274 45657 44144 38484 42669 51924 55965 57174 54877 57013 58603 57534 62526 74145
10769G4145J2467K392M031l284j735K43p168K806N304n652l279m602r640k208
$$ 74145 86612 89004 93035 89751 88016 88259 81091 83897 89201 83549 80270 75668 66028 63820
10755F3820k351j211K201L065M641j741K489J418N870M94J290q217o853Q76N311
$$ 63820 61469 60258 62459 65524 70165 68424 70913 72331 78201 78695 79985 71768 64915 65791 71102
10740G1102o89l906K310M221p639j0716j124m43P008J551p374k198J036K424Q024
$$ 71102 70413 66507 68817 73038 65399 54683 53559 53116 60124 61675 54301 52103 53139 55563 63587
10725F3587O108K283K23M308J678L374l664R21M992m832j194J670O859M556L107
$$ 63587 69695 71978 72201 76509 78187 81561 77897 78818 83810 78978 77784 79454 86313 90869 93976
10710I3976K406l839J397N018M917p006J811j922j0471p900J160L983M251o532
$$ 93976 96382 92543 93940 98958 103875 96869 98680 96758 86287 78387 79547 83530 87781 81249
10696H1249m183l113m11k535j194O022K318j711J453k773L357J653P593P438O858
$$ 81249 77066 73953 73542 71007 69813 75835 78153 76442 77895 75122 78479 80132 87725 95163 102021
10681A02021J5083K921K093m243R55m7N82L467L090J555K756k270m204k288n814
$$ 102021 117104 120025 122118 117875 118830 118783 119365 122832 125922 127477 130233 127963 123759 121471 115657
10666A15657n75M244r487o311L001l137p558l973L349p17O331n57K85N472Q921
$$ 115657 115082 119326 109839 103528 106529 103392 95834 91861 95210 94493 100824 100267 100552 106024 114945
10651A14945O394L335n668n605M555O719N497Q414O690K0455K0970K2085J8684
$$ 114945 121339 124674 119006 113401 117956 124675 130172 138586 145276 165731 186701 208786 227470
10638B27470J1079O662p892j1466j2684r947r150j3992j0185R85J0726P754m445
$$ 227470 238549 245211 237319 225853 213169 203222 194072 180080 169895 170880 181606 189360 184915
10625A84915m225J3463J1235O07o257p487p57P697R213O932K689O480P432P185
$$ 184915 180690 194153 205388 205995 199738 192251 191494 199191 208404 215336 218025 224505 231937 239122
10611B39122R195J3676J0288J0398J8818J8156K0831K1784K0445K9701K4152L378
$$ 239122 248317 261993 272281 282679 301497 319653 340484 362268 382713 412414 436566 439944
10599D39944M391P913J3455K4307L4583M3291O3196Q3523J13036J55241J90824
$$ 439944 444335 452248 465703 490010 524593 567884 631080 714603 827639 982880 1173704
10588A173704J94491J82467J36195M4790m4743j16206j56096j50257j27949r9311
$$ 1173704 1368195 1550662 1686857 1731647 1686904 1570698 1414602 1264345 1136396 1037085
10578A037085p1022m5395k6157j2862J4173L9937O2303Q1345R8647J24170J43586
$$ 1037085 966063 920668 894511 881649 895822 935759 998062 1079407 1178054 1302224 1445810
10567A445810J68604J99431K36264K88180L69464N04873P11578J017632J428391
$$ 1445810 1614414 1813845 2050109 2338289 2707753 3212626 3924204 4941836 6370227
10558F370227J925530K427343K711652K564063J883081Q10267l80169j430725
$$ 6370227 8295757 10723100 13434752 15998815 17881896 18692163 18311994 16881269
10550A6881269k094321k316862k159426j819902j434114j111344q61708o71868
$$ 16881269 14786948 12470086 10310660 8490758 7056644 5945300 5083592 4411724
10542D411724n33782m42893l61430k87919k37971k00360j63447j28069q7502m9496
$$ 4411724 3877942 3435049 3073619 2785700 2547729 2347369 2183922 2055853 1968351 1918855
10532A918855m523K8621P9738J34578K07280K92182L98677N14174N93794O00561
$$ 1918855 1914332 1942953 2022691 2157269 2364549 2656731 3055408 3569582 4163376 4763937
10522D763937N08689L67593K76928K87565M58043P84976J272171J935315K772098
$$ 4763937 5272626 5640219 5917147 6204712 6662755 7447731 8719902 10655217 13427315
10513A3427315L734330M547854M779380L976654K146847j34519j969132k782096
$$ 13427315 17161645 21709499 26488879 30465533 32612380 32477861 30508729 27726633
10505B7726633k612504j958424j439992j425783j798291k217906k368770k184446
$$ 27726633 25114129 23155705 21715713 20289930 18491639 16273733 13904963 11720517
10497A1720517j790294j360762r65445o31735l73516j82161j45688k61938m69760
$$ 11720517 9930223 8569461 7604016 6972281 6598765 6416604 6270916 6008978 5539218
10488E539218o26356o51528n64417m40553l26924k40787j60715j05057n0470Q05
$$ 5539218 4912862 4261334 3696917 3256364 2929440 2688653 2527938 2422881 2372411 2373216
10478B373216L9182Q4469J17761J49133J89795K35717L22906M53323O53422R49429
$$ 2373216 2412398 2496867 2614628 2763761 2953556 3189273 3512179 3965502 4618924 5568353
10468E568353J374537J917071K569760L184041L507236L221331K196092O22251
$$ 5568353 6942890 8859961 11429721 14613762 18120998 21342329 23538421 24160672
10460B4160672j043973k356689l021392l070719k708866k194780j724395j334534
$$ 24160672 23116699 20760010 17738618 14667899 11959033 9764253 8039858 6705324
10452F705324j043578q30201o66854n59643m81672m12923l48271k96369k64595
$$ 6705324 5661746 4831545 4164691 3605048 3123376 2710453 2362182 2065813 1801218
10443A801218k39578j96241j56554j31619j03148p8620n5875m6183l4985k6667
$$ 1801218 1561640 1365399 1208845 1077226 974078 895458 839583 793400 758415 731748
10433G31748j7398j656L583J8276L1103M2930P6024J22291J77999K21475K12055
$$ 731748 714350 712694 716277 734553 765656 808586 884610 1006901 1184900 1406375 1618430
10422A618430P9593r5614k00192k20487j72528j20270p7494n5931l8311k3512
$$ 1618430 1698023 1602409 1402217 1181730 1009202 888932 811438 755507 717196 693684
10412F93684l4081l9088k9410l4981l0038k5905k3031j8359k2681l3209k7156
$$ 693684 659603 620515 591105 556124 526086 500181 477150 458791 436110 402901 375745
10401C75745l1218k4273j5629j7125j1499n858j857k611O833J172r089j4836j0993
$$ 375745 344527 320254 304625 287500 276001 270143 268286 265675 272508 273680 264591 249755 238762
10388B38762q432j070k097J248L538p36r949J64q602m411K172N318J826Q942R143
$$ 238762 230330 229260 227163 228411 231949 231213 221264 221428 212826 208415 210587 215905 217731 226673 235816
10373B35816J1835J1132Q986J7243J8526J7997K2067K1776J5267J874n366j2189
$$ 235816 247651 258783 267769 285012 303538 321535 343602 365378 380645 382519 377153 364964
10361C64964j7117j8629k8963j8633k1232k8219k0893j8950j8665j2379l825J172
$$ 364964 347847 329218 300255 281622 260390 232171 211278 192328 173663 161284 157459 158631
10349A58631L040O290l964J909J4975J8323J6558N689k484n153j3761m617N17
$$ 158631 161671 167961 163997 165906 180881 199204 215762 221451 218967 213814 200053 195436 195953
10336A95953K243L796O167L415k063J362O08J3591J2911J6100J8737J5890k825
$$ 195953 198196 201992 208159 211574 209511 210873 211481 225072 237983 254083 272820 288710 285885
10323B85885j1134j1825j5582k0557j3359l39p262M52N387q393j7435l399J0737
$$ 285885 274751 262926 247344 226787 213428 213089 205827 206279 211666 203273 185838 182439 193176
10310A93176J5907J9223O420m926L034L367M101O505L418P874K8563M1156O2847
$$ 193176 209083 228306 234726 229800 232834 236201 240302 246807 250225 258099 286662 327818 390665
10297C90665Q0670R6175O1926j8961r5759r8628n6155k9561p247j83N239j042
$$ 390665 471335 567510 629436 610475 514716 416088 359933 330372 323125 322942 328181 327139
10285C27139j1619k597j37K930M429J1322J5808J2181J001j954n121o258k918
$$ 327139 315520 312923 312786 315716 320145 331467 347275 359456 360457 358503 353382 347124 344206
10272C44206m72N090r775j5113n682l735O407J1767K3529J7145J5041J5070O568
$$ 344206 343734 348824 339049 323936 318254 314519 320926 332693 356222 373367 388408 403478 410046
10259D10046J765N775J0466N523J1391K3601J9233R251K931p537j4401j0142j3152
$$ 410046 411811 417586 428052 433575 444966 468567 487800 497051 499982 492445 478044 467902 454750
10246D54750N709M900M240J0147J6695J8685J9495K0634K1947L0785L7877K8151
$$ 454750 460459 465359 469599 479746 496441 515126 534621 555255 577202 607987 645864 674015
10234F74015J1577J0289J7880J9524K3777K8519L0850L3105L7455L0008K5592
$$ 674015 685592 695881 713761 733285 757062 785581 816431 849536 886991 916999 942591
10223I42591L3314L5183M6787N6267N5506N0247L7373L0121L5967M6810N6341
$$ 942591 975905 1011088 1057875 1114142 1169648 1219895 1257268 1287389 1323356 1370166 1426507
10212A426507O4284O2250N9835O6915R2749J32101J88287K35912L05794L71749
$$ 1426507 1490791 1553041 1612876 1679791 1772540 1904641 2092928 2328840 2634634 3006383
10202C006383L73660K74604K28612L47654M26297K29334K7300J18496K93663L14590
$$ 3006383 3380043 3654647 3883259 4230913 4657210 4886544 4913844 5032340 5326003 5640593
10192E640593K68360L44179N20432P13863Q79653J028813J168119J233613J114605
$$ 5640593 5908953 6253132 6773564 7487427 8367080 9395893 10564012 11797625 12912230
10183A2912230R46159J031625J453206K101529K996041M255508O124747Q903260
$$ 12912230 13858389 14890014 16343220 18444749 21440790 25696298 31821045 40724305
10175D0724305J2946029J8674356K6745719L8429400N4952945P0892703O4206483
$$ 40724305 53670334 72344690 99090409 137519809 192472754 263365457 327571940
10168C27571940J6866271m2307718o7418891n7976835m0189451k7659542k0668615
$$ 327571940 344438211 302130493 234711602 176734767 136545316 108885774 88217159
10161H8217159j6281527j2937011j0294464q197983o482768n090841l999001l132219
$$ 88217159 71935632 58998621 48704157 40506174 34023406 28932565 24933564 21801345
10153B1801345k442875k057573j997227k005015j850486j579652j303958j067715
$$ 21801345 19358470 17300897 15303670 13298655 11448169 9868517 8564559 7496844
10145G496844q67782o93880n51903m43141l89471l51376l18871k87120k65797
$$ 7496844 6629062 5935182 5383279 4940138 4550667 4199291 3880420 3593300 3327503
10136C327503k42120k20484j95050j64201j26514r6945q9731q8223q9823r3742
$$ 3327503 3085383 2864899 2669849 2505648 2379134 2282189 2192458 2104235 2014412 1920670
10126A920670q4758o9170n1406n3296n1878n8815n9296l8693p158L1776P8359
$$ 1920670 1835912 1766742 1715336 1662040 1610162 1551347 1492051 1453358 1446200 1477976 1556335
10115A556335J36083K01957L14934M57223O23698O19947K09149l71329o44954
$$ 1556335 1692418 1894375 2209309 2666532 3290230 3910177 4119326 3747997 3103043
10106C103043n74162m16737k99001k32504j78948j30625r2831o2652m9715k9936
$$ 3103043 2528881 2112144 1813143 1580639 1401691 1271066 1178235 1115583 1065868 1035932
10096A035932o678J0545o882l3616m7348m9314m0680n1037n6505o8387o4256m3435
$$ 1035932 1029254 1039799 1032917 999301 951953 902639 861959 810922 754417 686030 621774 578339
10084E78339k5365j3077j6493j4728k6754k3769k2658k7298j8681j872M597m242
$$ 578339 552974 539897 523404 508676 481922 458153 435495 408197 389516 387644 392241 387999
10072C87999p3Q68l408k2870k9462k3901j1274q626j0809j2605j191j102R912
$$ 387999 387926 388794 385386 362516 333054 309153 297879 289253 278444 265839 264648 263546 273458
10059B73458J1749R861J5655J9521N932N471J0870J0805J5993J3009J9555J9076
$$ 273458 285207 295068 310723 330244 336176 341647 352517 363322 379315 392324 411879 430955
10047D30955J0293l355j8303k4298l1391k2983j0825J1033O969J831N054l050
$$ 430955 441248 437893 419590 395292 363901 340918 330093 341126 348095 349926 354980 351930
10035C51930j2684r335j0578j1079l605j1633o846j4806k0354j2979o816r432
$$ 351930 339246 329911 319333 308254 304649 293016 286170 271364 251010 238031 231215 221783
10023B21783j7540q639j2758m490j114j1781j2617p267j2860j1376j1629p592
$$ 221783 204243 195604 182846 178356 177242 165461 152844 145577 132717 121341 109712 102120
10011A02120O23J3Q696R671P393L573M654K341l115n245j582J0833P599J1056
$$ 102120 102743 102756 111452 121123 128516 132089 136743 139084 135969 130724 129142 139975 147574 158630
9997A58630l656j1088o845K504Q717J3782O316K887Q45J864j799K491j3362q535
$$ 158630 154974 143886 137041 139545 148262 162044 168360 171247 172092 173956 172157 174648 161286 152751
9983A52751j0865j5181r599j1368r845j8345j0983j932L903J0087J785L00L297
$$ 152751 141886 126705 117106 105738 95893 77548 66565 64633 68536 78623 80408 80708 84005
9970H4005L664L406j97j1367m959N317J2607N170O777R946O48N00J918N325L605
$$ 84005 87669 91075 90878 79511 74552 79869 92476 97646 104423 114369 115017 115517 117435 122760 126365
9955A26365o66j510P17K6J0581Q761l80m528p658m035j939N938j287p714j637
$$ 126365 125699 124189 124906 124932 135513 144274 143894 139366 131708 127673 125734 131672 130385 122671 121034
9940A21034K994J869j2254k789M760L574K777P273J4442J6370N809P149K5n23
$$ 121034 124028 125897 113643 110854 115614 119188 121965 129238 143680 160050 165859 173008 173033 172510
9926A72510P309J1469K4272L8307K5281k925k4531j6554r067n865k509m56p98
$$ 172510 179819 191288 215560 253867 279148 276223 251692 235138 226071 220206 217697 217241 216443
9913B16443j0786j6345j5708j5812J964P992P923P244k868m802m934r102p182
$$ 216443 205657 189312 173604 157792 159756 167748 175671 182915 180047 175245 170311 161209 154027
9900A54027M84M732N170K688K788j603r155l856J267k581p609k904l915j0629
$$ 154027 154511 159243 164413 167101 169889 168286 159131 155275 156542 153961 146352 143448 139533 128904
9886A28904r883n103O56N007J5432J0318Q292J0673O195P239J438K116l051J0166
$$ 128904 119021 113918 114574 119581 135013 145331 153623 164296 170491 177730 179168 181284 178233 188399
9872A88399J0661O92K908J1615R387N052m538j3607j4169q222j742j5112j4977
$$ 188399 199060 199752 202660 214275 223662 228714 224176 210569 196400 188178 186436 171324 156347
9859A56347r081J912O895J0943J4533J4402J7638J3877J4480K7376K3630K0301
$$ 156347 147266 149178 156073 167016 181549 195951 213589 227466 241946 269322 292952 313253
9847C13253K0351K5841M8193N7414N3227N5731N0622M3180M8767P2013J15912
$$ 313253 333604 359445 407638 465052 518279 574010 624632 667812 716579 788592 904504
9836I04504J60309J72997K07211K80206L98378N65580P58160R08317Q81639O38264
$$ 904504 1064813 1237810 1445021 1725227 2123605 2689185 3447345 4355662 5237301 5875565
9826E875565L22803j4995m12923p45789q25302p14628n54806m23414l33765k53208
$$ 5875565 6198368 6183373 5770450 5024661 4199359 3484731 2929925 2506511 2172746 1919538
9816A919538j99552j55430j23450r8335o9842n1318m1492l5329k1979p911K3217
$$ 1919538 1719986 1564556 1441106 1342771 1272929 1221611 1180119 1144790 1122811 1114900 1138117
9805A138117M6851P1165J07907J46025J87656K26483K80180L02721K81720K45354
$$ 1138117 1184968 1256133 1364040 1510065 1697721 1924204 2204384 2507105 2788825 3034179
9795C034179K78537M23916O59062R75159J388563J916819K472215K716215K273119
$$ 3034179 3312716 3736632 4395694 5370853 6759416 8676235 11148450 13864665 16137784
9786A6137784J087695m15625j477468j584720j007717l13446J33917R6439m38697
$$ 16137784 17225479 16809854 15332386 13747666 12739949 12426503 12560420 12656859 12218162
9777A2218162j141771j546703j499878j204087q98342o90202n42643m35283l18160
$$ 12218162 11076391 9529688 8029810 6825723 5927381 5237179 4694536 4259253 3941093
9768C941093k08751j18820j04823j47080j49466q9135P942J08020K19729L26333
$$ 3941093 3732342 3613522 3508699 3361619 3212153 3123018 3130960 3238980 3458709 3785042
9758C785042L37097J79474K5270O4197K54913M99050P88447J144947J584009K079113
$$ 3785042 4122139 4301613 4326883 4391080 4645993 5145043 5933490 7078437 8662446 10741559
9748A0741559K454937K300214J332920Q3563m59027p5143P50368J515017J783178
$$ 10741559 13196496 15496710 16829630 16913193 16454166 16379023 17129391 18644408 20427586
9739B0427586J377981K80108j184393k126038k230522j994726j799802j687665
$$ 20427586 21805567 22085675 20901282 18775244 16544722 14549996 12750194 11062529
9731A1062529j526180j264543r52566o58796m53257m52772n61457n77796m87142
$$ 11062529 9536349 8271806 7319240 6660444 6207187 5754415 5192958 4615162 4128020
9722D128020l64783k56479j60540q2874p2318j17999j53676j14921m0548N1090
$$ 4128020 3763237 3506758 3346218 3263344 3191026 3073027 2919351 2804430 2763882 2814972
9712B814972J51123K50234L70583N26980O88041P37704N67938L55917L82222O75593
$$ 2814972 2966095 3216329 3586912 4113892 4801933 5539637 6107575 6463492 6845714 7521307
9702G521307J066910J388808J554750J515383J235689O68388j6053n34217q02883
$$ 7521307 8588217 9977025 11531775 13047158 14282847 14951235 14935182 14400965 13598082
9693A3598082j138852j597204j768330j547203j187746q77376o58758n63307n35215
$$ 13598082 12459230 10862026 9093696 7546493 6358747 5481371 4822613 4259306 3724091
9684C724091m95611m11562l28410k71689k34740j98695j68676j56577j33822j00446
$$ 3724091 3228480 2816918 2488508 2216819 1982079 1783384 1614708 1458131 1324309 1223863
9674A223863q0477n3209l0669p652J0424K0432L7983N1669P5618R9496J18919
$$ 1223863 1143386 1090177 1059508 1051856 1062280 1082712 1120695 1172364 1247982 1347478 1466397
9663A466397J37966J77478K67608L96200N20038O19124O19090M45536J97876k2678
$$ 1466397 1604363 1781841 2049449 2445649 2965687 3584811 4203901 4649437 4847313 4824635
9653D824635k93821n63044o70540o02771m73911l67757k86004k27739j77908j43013
$$ 4824635 4530814 3967770 3297230 2694459 2220548 1852791 1566787 1339048 1161140 1018127
9643A018127j16786q8052o6954n9559o3289n9581o0040n9386m2212k9675k6309
$$ 1018127 901341 813289 746335 686776 623487 563906 503866 444480 402268 372593 346284
9632C46284k1510k4037k1819r649L571o024o377p237j503M699k232R36J0698O177
$$ 346284 324774 300737 278918 269269 272840 266816 260439 253202 251699 256398 254166 255102 265800 271977
9618B71977J0171N894J715L64q039j2592j4307j7459j4296p315m825j1921q905
$$ 271977 282148 288042 289757 290121 282082 269490 255183 237724 223428 216113 211288 199367 190462
9605A90462m071l991L13m707j334n009p282o312q106q979k022l70o018o066k498
$$ 190462 186391 182400 182713 178006 176672 171663 164381 158069 149963 140984 138962 138592 132574 126508 124010
9590A24010M536J306o51j146k869p783k672M17J644k068J0476M058M204K843N686
$$ 124010 128546 129852 129201 128055 125186 117403 114731 115148 116792 114724 125200 129258 133462 136305 141991
9575A41991N636O365J4p27m115l646m213o647j0657m454j807m211K570j277j102
$$ 141991 147627 153992 154006 153279 149164 145518 141305 134658 124001 119547 117740 113529 116099 114822 113720
9560A13720k962k238N619M530r092j1301O831K563l777J407M874q721n78j816
$$ 113720 110758 108520 114139 118669 109577 98276 105107 107670 103893 105300 110174 101453 100875 99059
9546I9059R888l28l331k781L916K184N731k715j29J583J776K6o598J9k051l106
$$ 99059 108947 108619 105288 102507 106423 108607 114338 111623 111494 113077 114853 114879 108281 108300 106249 103143
9530A03143Q36K044J494N051O70l998j531M984J111o975l667j281L175N768N46
$$ 103143 103979 106023 107517 112568 113238 109240 107709 112693 113804 106829 103162 101881 105056 110824 111370
9515A11370K023k781n618n035q955K84j246j036M978j560N49P738N797j067j76
$$ 111370 113393 110612 104994 99959 91004 91288 90042 89006 93984 92424 92973 100711 106508 105441 105265
9500A05265R058K067l042j841J233P732j010k742N354k679Q62K236m029J115K337
$$ 105265 114323 116390 113348 111507 112740 120472 119462 116720 122074 119395 120257 122493 118464 119579 121916
9485A21916o42k655O125k651j1244j0770J824J0207O471k423M692j596O54j520
$$ 121916 121274 118619 124744 122093 110849 100079 101903 112110 118581 116158 120850 119254 119908 118388
9471A18388j120r43L746M707K509n114j066J1832R891j311m061n222p59J712N74
$$ 118388 117268 116325 120071 124778 127287 122173 121107 132939 142830 141519 137458 132236 131477 133189 133763
9456A33763j011j292J489J135l872j826P251k269m183q75O329R600K590R92l151
$$ 133763 132752 131460 132949 134084 130212 128386 135637 133368 129185 128310 134639 144239 146829 147821 144670
9441A44670j074n931n020k721Q852O713N180l28n963r07L655L949O166K407L433
$$ 144670 143596 137665 132645 129924 138776 145489 150669 150341 144378 143471 147126 151075 157241 159648 163081
9426A63081N978J3881Q995J587k660l834m089o507j1660l269J363N348n499m748
$$ 163081 169059 182940 191935 193522 190862 187028 182939 176432 164772 161503 162866 168214 162715 157967
9412A57967K753N06k632o274M778L861r75l396M486R18O445K137N99j522J131
$$ 157967 160720 161226 158594 152320 157098 160959 159984 156588 161074 161992 168437 170574 171173 169651 170782
9397A70782M771P79n139l492O234J5723Q212N128J1559k586L547J0661J1704P640
$$ 170782 175553 176332 171193 167701 173935 189658 197870 202998 214557 211971 215518 226179 237883 245523
9383B45523O858K748q95l171q056L345J350O92o572j1406l851l129p163l879k630
$$ 245523 252381 255129 254234 251063 243007 246352 247702 248394 241822 230416 226565 223436 216273 212394 209764
9368B09764j123o55J143k643Q2L718j558L03r32k095j550R83R282N335K919O589
$$ 209764 208641 207986 209129 206486 206568 210286 208728 209031 208099 206004 204454 205437 214719 220054 222973 229562
9352B29562k243m141J6O905Q307J3896J5751J1621J3359J5767R015P073O688o987
$$ 229562 227319 223178 223194 230099 238406 252302 268053 279674 293033 308800 317815 324888 331576 324589
9338C24589J2761J0131J70l077q713l441k519k914j0484j1539j0763o347j213
$$ 324589 337350 347481 347651 344574 335861 332420 329901 326987 316503 304964 294201 287854 286641
9325B86641m164m524K075N423r040n194M301L905l151J03M44K413J2215J1124
$$ 286641 282477 277953 280028 285451 276411 271217 275518 279423 276272 276375 276819 279232 291447 302571
9311C02571Q026J1365o08O676Q502J7342J2182J4460P534P035k321q079r719n299
$$ 302571 310597 321962 321354 328030 336532 353874 366056 380516 388050 395085 392764 384685 374966 369667
9297C69667J800L394m548Q323K757N965M368o071n595r460m336p373j415j4M260
$$ 369667 371467 374861 370313 378636 381393 387358 391726 385655 380060 370600 366264 358891 357476 357462 361722
9282C61722Q266k82N121P456K303J47J1172J6556J9305J0277J2924K811N485J5113
$$ 361722 369988 369706 374827 382283 384586 384733 395905 412461 431766 442043 454967 457778 463263 478376
9268D78376K5943L6498L5291L5255L6904J9215o917l2931l0922k7515k1742j8515
$$ 478376 504319 540817 576108 611363 648267 667482 660565 627634 596712 569197 547455 528940
9256E28940j1409n5M81L117R183J4736J9526K1873J1004M108Q579J271M396L087
$$ 528940 517531 517476 517957 521074 530257 544993 564519 586392 597396 601504 610083 611354 615750 618837
9242F18837M604j381k20O087L531J11M593Q284P959R333K7166L8198M5680O2591
$$ 618837 623441 622060 621840 627927 631458 631569 636162 644446 652405 661738 688904 727102 772782 835373
9228H35373O7042N4221J2062k7791n7734n7894m8658l8076k4483j2728o355n067
$$ 835373 902415 956636 968698 940907 883173 825279 776621 738545 714062 701334 694979 689912
9216F89912K583M840k429N692J4185J7459O924J2474J1948Q783N636M87m007q613
$$ 689912 692495 697335 694906 700598 714783 732242 739166 751640 763588 772371 778007 778494 774487 765874
9202G65874p199n779p584K258M337j477n31P901K1723L4775L2300K7350K8435
$$ 765874 758675 752896 745312 747570 751907 750430 749899 757800 779523 814298 846598 873948 902383
9189I02383N636k0141k0613j3416o300q148P360M399m333N413M734J371P760N482
$$ 902383 908019 887878 867265 853849 847549 839401 846761 851160 846827 852240 856974 858345 866105 871587
9175H71587J663O897M855R943J6116J5950Q501R413J0132J0180J2833J7310R725
$$ 871587 873250 880147 885002 894945 911061 927011 935512 944925 955057 965237 978070 995380 1005105
9162A005105R576J5062J3518O334N317J6445K2242K0037Q937J5301K2354K4835
$$ 1005105 1014681 1029743 1043261 1049595 1054912 1071357 1093599 1113636 1122573 1137874 1160228 1185063
9150A185063J8667R766J1830K1520K4900J2753J1597J4668J7136J5337K3515K7634
$$ 1185063 1203730 1213496 1225326 1246846 1271746 1284499 1296096 1310764 1327900 1343237 1366752 1394386
9138A394386K1677J6429J7908K2329J8133K3637L0164L0708K3481L0194L7364
$$ 1394386 1416063 1432492 1450400 1472729 1490862 1514499 1544663 1575371 1598852 1629046 1666410
9127A666410K2941K5183K2289K7878K7381K9869L5953L0606L3698L7456K5085
$$ 1666410 1689351 1714534 1736823 1764701 1792082 1821951 1857904 1888510 1922208 1959664 1984749
9116A984749L3807L5540L7066M2013L9604L1119L5525L5974M4889M8225M2712
$$ 1984749 2018556 2054096 2091162 2133175 2172779 2203898 2239423 2275397 2320286 2368511 2411223
9105B411223M7660M8766N7727N1717M3545M5980N2327M2121N3922N4615O0100
$$ 2411223 2458883 2507649 2565376 2617093 2660638 2706618 2758945 2801066 2854988 2909603 2969703
9094B969703O5329N9989O0325O8106O4603O1798O5355N9457P1772P2984P5480
$$ 2969703 3035032 3095021 3155346 3223452 3288055 3349853 3415208 3474665 3546437 3619421 3694901
9083C694901Q0503Q4478Q4136P8824Q3005Q9700R0312Q9208Q5229Q8219Q9532
$$ 3694901 3775404 3859882 3944018 4022842 4105847 4195547 4285859 4375067 4460296 4548515 4638047
9072D638047R6874R0842R9276J05471J07520J04370J03519R8963J08071J04693
$$ 4638047 4734921 4825763 4925039 5030510 5138030 5242400 5345919 5444882 5552953 5657646
9062E657646J04102J07429J05725J14236J10600J08313R4541R9261J00357J03270
$$ 5657646 5761748 5869177 5974902 6089138 6199738 6308051 6402592 6501853 6602210 6705480
9052F705480J06654J01259R7309R5033R2524Q7252Q7713Q6182P9592P1049P1234
$$ 6705480 6812134 6913393 7010702 7105735 7198259 7285511 7373224 7459406 7538998 7610047 7681281
9041G681281O3182O1765N4216M5949L7449M0193K5104K2570J6260J2184M608L08
$$ 7681281 7744463 7806228 7860444 7906393 7943842 7984035 8009139 8031709 8047969 8060153 8064761 8065069
9029H065069j6970k2805k5418k9924m0980m1660m3789m9587o1430p0095p6076
$$ 8065069 8048099 8025294 7999876 7969952 7928972 7887312 7843523 7793936 7732506 7662411 7586335
9018G586335p4988p7390q3127q8405r5989r7466r4791j06198j02691r5859j05501
$$ 7586335 7511347 7433957 7350830 7262425 7166436 7068970 6974179 6867981 6765290 6669431 6563930
9007F563930j09380j05801j07999j06335r9769j06674j09231j13576j07167r8094
$$ 6563930 6454550 6348749 6240750 6134415 6034646 5927972 5818741 5705165 5597998 5499904
8997E499904j02056j06914j02026j00435r3817r3792j02190r0907j01016r9152
$$ 5499904 5397848 5290934 5188908 5088473 4994656 4900864 4798674 4707767 4606751 4507599
8987D507599r3733q7067q4915q6213q1947q9574q5691p4046p9150p6288o9620
$$ 4507599 4413866 4326799 4241884 4155671 4073724 3984150 3898459 3824413 3745263 3668975 3599355
8976C599355p5181p3617p1516o7014o5160o4526o3902o5419o0281n7083o2659
$$ 3599355 3524174 3450557 3379041 3312027 3246867 3182341 3118439 3053020 2992739 2935656 2872997
8965B872997n9480n3711m8787n2953m5330m4884n3117n1223m5158m3529m5263
$$ 2872997 2813517 2759806 2711019 2658066 2612736 2567852 2514735 2463512 2418354 2374825 2329562
8954B329562n2569m7615l7547l8547l2089l0650m5554m1932l1990k6773l1007
$$ 2329562 2276993 2229378 2191831 2153284 2121195 2090545 2044991 2003059 1971069 1944296 1913289
8943A913289l1097l1455l6252l4737k9341k7048k0077k0428l3972k8054k4682
$$ 1913289 1882192 1850737 1814485 1779748 1750407 1723359 1703282 1682854 1648882 1620828 1596146
8932A596146k4988k4200k6183k1457k1338k2293j8362k2246j9319k2421k4328
$$ 1596146 1571158 1546958 1520775 1499318 1477980 1455687 1437325 1415079 1395760 1373339 1349011
8921A349011j6529j4933k2932k0905j7389j6823k2022j7984j0877l634r927k4439
$$ 1349011 1332482 1317549 1294617 1273712 1256323 1239500 1217478 1199494 1188617 1184983 1175056 1150617
8909A150617j6524j1328j7867j6926p134r386m800k059j1333r378j0599p592m132
$$ 1150617 1134093 1122765 1104898 1087972 1080838 1071452 1066652 1064593 1053260 1043882 1033283 1025691 1021559
8896A021559n670j0284k332j034N134J1585N031J5279J7549J2635L1345M3518
$$ 1021559 1015889 1005605 1003273 1002239 1007373 1018958 1023989 1039268 1056817 1069452 1100797 1144315
8884A144315M8285M7544N4930N8548N8714Q3777J13241J26453J23476J56184K61180
$$ 1144315 1192600 1240144 1295074 1353622 1412336 1496113 1609354 1735807 1859283 2015467 2276647
8873B276647M18272O27854R36419J389317K104048L177298M025078K470446j565102
$$ 2276647 2694919 3322773 4259192 5648509 7752557 10929855 14954933 17425379 15860277
8864A5860277l751886l137458k033478j322501r60434p55434n96580m62907l44179
$$ 15860277 12108391 8970933 6937455 5614954 4654520 3899086 3302506 2839599 2495420
8855B495420k58928k06544j98168j83084j59190j40243j25117j14694r9903q0120
$$ 2495420 2236492 2029948 1831780 1648696 1489506 1349263 1224146 1109452 1009549 929429
8845I29429n8127n1046l9769m2136k4765k1940k5118k8493j5993k2233j6108p461
$$ 929429 871302 820256 780487 738351 713586 691646 666528 638035 622042 599809 583701 576240
8833E76240j3391j3776r142n726q914j0865j4233o836o432j3810j1254r101j1708
$$ 576240 562849 549073 539931 534205 525291 514426 500193 493357 486925 473115 461861 452760 441052
8820D41052m097j150l259p405j4211m654L474n278J887o257k245q489n882j570
$$ 441052 436955 435805 432546 425141 410930 406276 409750 404472 406359 400102 397857 389368 383486 381916
8806C81916n205m477k044p106j798k860o385m854p708q605j096l66K442l911r179
$$ 381916 376711 372234 370190 363084 361286 358426 352041 347187 339479 330874 329778 329412 331854 327943 318764
8791C18764m847J367J260p803m881l060J375m193k658n323O48O114m644p637k948
$$ 318764 313917 315284 316544 308741 303860 300800 302175 297982 295324 290001 290649 296763 292119 284482 281534
8776B81534p416p61l6m48n746O07j858o941p28j733o385j007L525l149p56P675
$$ 281534 274118 273357 273321 272873 267127 267734 265876 258935 258207 256474 250089 249082 252607 249458 248702 256377
8760B56377J112q350l582M940N15j116l722r202o58j905r2q42R45k254j691l834
$$ 256377 257489 249139 245557 250497 251012 249896 246174 236972 236314 234409 234317 233475 234420 232166 230475 226641
8744B26641L109J567m700q976L50j227m76n188q764J531R241J863m69j584o431
$$ 226641 229750 231317 226617 217641 217991 216764 216288 211100 202336 203867 213108 214971 214502 212918 206487
8729B06487m448m07o670o249L585M825K260p312r466K845O593J036l698j237o010
$$ 206487 202039 201632 194962 188713 192298 197123 199383 192071 182605 185450 192043 193079 189381 188144 182134
8714A82134o126n346k903P41K363n92R81m465j278m845k309N316Q0m650o758J457
$$ 182134 176008 170662 167759 168500 170863 170271 171252 166787 165509 160664 158355 163671 163751 159101 152343 153800
8698A53800q55q00p95k081n012R262n4j774P105J802j056M288M8o701m554m052
$$ 153800 152945 152145 151350 149269 144257 153519 153465 151691 158796 160598 159542 163830 163878 157177 152623 148571
8682A48571l412P071J790j521r889o428n302L2K063J517n11K307L780Q12m732
$$ 148571 145159 152230 154020 152499 142610 136182 130880 130912 132975 134492 133981 136288 140068 140880 136148
8667A36148J216q30m812j999O37L823m2j939r22q43l215J752N906j858m857k377
$$ 136148 137364 136534 131722 129723 130360 134183 134141 132202 131280 130437 127222 128974 134880 133022 128165 125788
8651A25788k013l062o384n518M324R487L182Q278M062l975K029N691P905Q316
$$ 125788 123775 120713 114329 108811 113135 122622 125804 134082 138144 134169 136198 141889 149794 158110
8637A58110O876l797j2108j2204r551p212J254L75M628r7q225K253k341p651K645
$$ 158110 164986 161189 149081 136877 127326 120114 121368 121743 126371 126274 118049 120302 117961 110310 112955
8622A12955n418P79N758l610j791M132L770L926k814K528K87m284K063k988k169
$$ 112955 107537 108316 114074 110464 108673 112805 116575 120501 117687 120215 120502 116218 118281 115293 113124
8607A13124J535Q836J647m939k10M179O464R892O555M633M921P282J3999J0742
$$ 113124 114659 123495 125142 120203 119993 124172 130636 140528 147083 151716 156637 163919 177918 188660
8593A88660J8363K9485L0244Q034k320q109k964j1228j3237j1434k0256j4287
$$ 188660 207023 236508 266752 274786 272466 264357 261393 250165 236928 225494 205238 190951
8581A90951j8938j1640p907r722p191n020j3094m023L058n261n846n473M748n954
$$ 190951 172013 160373 152466 142744 135553 130533 117439 113416 116474 111213 105367 99894 104642 98688
8567I8688j509m282k921m076p21m112m529l708O478M632M955O42k955n961l731
$$ 98688 97179 92897 89976 85900 85179 81067 76538 72830 79308 83940 88895 89537 86582 80621 76890
8552G6890j225K129L942J0530n97K813J2643Jj0804m012j393R39Q313J1527r52
$$ 76890 75665 77794 81736 92266 91669 94482 107125 107126 96322 92310 90917 91856 100169 111696 110744
8537A10744r47j650K292J6143K0067P79j3914k2121j6970q817m393j029l26j758
$$ 110744 109797 108147 110439 126582 146649 147428 133514 111393 94423 85606 81213 80184 79858 78100
8523G8100p55j238n381l917K261P701m458l62J935L72p339l159p87L339k40k551
$$ 78100 77345 76107 70726 66809 69070 76771 72313 71951 73886 74258 66919 63760 62973 66312 66072 63521
8507F3521K95J740n905k283O253Q724M700j062r784n575l62N437K048M351l015
$$ 63521 63816 65556 59651 57368 63621 72345 77045 75983 66199 60624 60262 65699 67747 72098 69083
8492F9083m641J127p042p901n338M204R417N873r3n140m081l123o892J277N090
$$ 69083 64442 65569 58527 50626 45288 49492 58909 64782 64689 59549 55468 52345 45453 46730 51820
8477E1820j759K352O083j589M102N254P186J3522J1522M781K511M299N233K81
$$ 51820 50061 52413 58496 56907 61009 66263 73449 86971 98493 103274 105785 110084 115317 115598
8463A15598l171r10p173j3499j3370k668n109p926m179j06l05O13o6l369J108
$$ 115598 112427 111517 104344 90845 77475 74807 69698 61772 57593 57487 57182 57795 57729 54360 55468
8448E5468l06r881r840m771P69K563Q360J242k325O385j071K560K377J452O68
$$ 55468 55162 45281 35441 30670 31439 34002 42362 43604 41279 47664 46593 49153 51530 52982 53650
8433E3650k244j848n627l825m56k637M113P97j339o163M463Q216k076l776j378
$$ 53650 51406 49558 43931 40106 39650 37013 41126 41923 40584 34421 38884 47100 45024 41248 39870
8418C9870O556J180l575J553k730o618p265O663J245j737J424N592j4M44N50J682
$$ 39870 46426 47606 44031 45584 42854 36236 28971 35634 36879 35142 36566 42158 42144 42588 43138 44820
8402D4820m123m148O210L754j212m877K198L482M056r1n912k95M001N343j024
$$ 44820 40697 36549 42759 46513 45301 40424 42622 46104 50160 50069 44157 43862 47863 53206 52182
8387E2182n515k111K218K158n609m797P22l642p77P199M125K413O950M67k374
$$ 52182 46667 44556 46774 48932 43323 38526 39248 35606 34829 42028 46153 48566 55516 55983 53609
8372E3609p85K359Q79j216l756q16J22m705j100m33J360M429O05j310K245k862
$$ 53609 52824 55183 56062 54846 51090 50274 50396 45691 44591 44158 45518 49947 50552 49242 51487 48625
8356D8625r34l772J849K307L078L543j849N94m224k18j67m667j587K356J0275
$$ 48625 47691 43919 45768 48075 51153 54696 52847 53441 49217 48999 48832 44165 42578 44934 55209
8341E5209Q221q32n45N612J7013J7272L0597M9857O5143Q8878Q3296L6960m1876
$$ 55209 63430 62598 62053 67665 84678 101950 132547 182404 247547 336425 419721 456681 414805
8328D14805p9716n9674l6798l9654l4546k7007j8695j9825j4984q857k039k174
$$ 414805 335089 275415 238617 198963 164417 137410 118715 98890 83906 75049 73010 70836
8316G0836L769m521m632q359j751L40j293J083Q565q458n486M201N287j608J694
$$ 70836 74605 70084 65452 57093 55342 55682 54389 55472 64037 55579 50093 54294 59581 57973 59667
8301E9667M361N808M186M432J5021K0493L2061N8017P9601Q2294N9603j6217p3784
$$ 59667 64028 69836 74022 78454 93475 113968 146029 204046 283647 365941 425544 409327 335543
8288C35543p7317n1616l2571k0817k1366r704L959k285q340j6324o669j1749j4401
$$ 335543 258226 206610 174039 153222 131856 122152 126111 123826 115486 99162 92493 80744 66343
8275F6343l840q150o430J259M569l651j0209p551J92j301j399J382O70n27o880
$$ 66343 62503 54353 47923 49182 53751 50100 39891 32340 32532 31231 29832 31214 31884 31357 24477
8260B4477n923j137N277N094P680J060n275p366n692J518j366M343j08k693O228
$$ 24477 18554 17417 22694 27788 35468 36528 31253 23887 18195 19713 18347 22690 22582 19889 26117
8245B6117L50K734o069J364j558M752J75J613J2727N911N164k369r358o326o807
$$ 26117 26467 29201 23132 24496 22938 27690 27865 29478 42205 48116 53280 50911 41553 35227 28420
8230B8420k272n554L086k071J811P780M538j997l410o830r285r512k13R360M551
$$ 28420 26148 20594 23680 21609 23420 31200 35738 33741 30331 23501 14216 4704 4491 13851 18402
8215A8402N141j037o082r2j858L617M566L13j948M793j0406q036R346J1508l963
$$ 18402 23543 22506 16424 16332 14474 18091 22657 22970 21022 25815 15409 7373 16719 28227 24264
8200B4264n325n8n584k993N715N573Q31K641R04O188m82n406o740k768k375n367
$$ 24264 18939 18881 13297 10304 16019 21592 22423 25064 25968 32156 31674 26268 19528 16760 14385 9018
8184I018m0O198j486J298O21K677m644m685k684J69m117K948P879R47P38k647
$$ 9018 8978 15176 13690 14988 15609 18286 13642 8957 6273 6442 2325 5273 13152 14099 14837 12190
8168A2190K279K159K776P66k655j198N947j373n030n536l83N137P29K744n660
$$ 12190 14469 16628 19404 20170 17515 16317 22264 20891 15861 10325 9942 15079 15808 18552 12892
8153A2892k672L370J940O983K579l557M11n18L272N777l543p023L149L845N181
$$ 12892 10220 13590 15530 22513 25092 21535 21946 21428 24700 30477 26934 19911 23060 26905 32086
8138C2086N815l843m087k669R9J608j77n347k924k924P61O216L1m767k421N77
$$ 32086 37901 34058 29971 27302 27401 29009 28832 23485 20561 17637 18398 24614 24645 19878 17457 18034
8122A8034M751L039o32l235j3490k298L947k04k981J947j555N768L064L433k977
$$ 18034 22785 25824 25192 21957 8467 6169 10116 9912 6931 8878 7323 13091 16155 19588 16611
8107A6611j102n756j214J371l236l305k146P302K73J06Q462J169n264j26O209
$$ 16611 15509 9753 8539 9910 6674 3369 1223 8525 8798 8904 17366 18535 13271 13145 19354
8092A9354q41j782j11J060M006k934j0287p084R44m83J717J039J490j209J482
$$ 19354 18513 16731 16620 17680 21686 18752 8465 1381 2325 1842 3559 4598 6088 4879 6361
8077F361N240J0044N26m014o36o01j448m31K466j265j71M620L813l654l443m785
$$ 6361 11601 21645 22171 18157 17521 16920 15472 15041 17507 16242 16071 20691 24504 20850 17407 12622
8061A2622k004j724R91O258m758L850L734r12J530L260q65K303l08k932J151K524
$$ 12622 10618 8894 9885 16143 11385 15235 18969 18057 19587 22847 21982 24285 23977 21045 22196 24720
8045B4720j03J801K521m25j496k961m009K250K899J191J594J0594o727l171L769
$$ 24720 24617 26418 28939 28514 27018 24057 20048 22298 25197 26388 27982 38576 31849 28678 32447
8030C2447J898n574q579N816N100K162k997n653l63J206Q464J376j396L308m11
$$ 32447 34345 28771 20192 26008 31108 33270 30273 24620 24257 25463 33927 35303 33907 37215 36804
8015C6804k362k017N33k792K031O016K576J955M031Q402L113n796j1493o386O141
$$ 36804 34442 32425 32958 30166 32197 38213 40789 42744 46775 55177 58290 52494 41001 34615 40756
8000D0756O023o775n654l435m716L629Q93J209o79M478k48m209o865K300N815
$$ 40756 46779 40004 34350 30915 26199 29828 30721 31930 31251 35729 35481 31272 24407 26707 32522
7985C2522l769Q097P638k473j0281n762m519K4J074M89J885J093J646M138r145
$$ 32522 28753 36850 44488 42015 31734 25972 21453 21477 22551 23040 24925 26018 27664 31802 22657
7970B2657p914m57P904M955J882O029Q589L308l518p219l737k710q208l071k207
$$ 22657 14743 14286 22190 27145 29027 35056 43645 46953 43435 36216 32479 29769 21561 18490 16283
7955A6283L008P0K08J0477M1j1892N681O875q88n182l532L989L729j494m234J232
$$ 16283 19291 19361 19569 30046 30087 18195 23876 30751 29863 24681 21149 25138 28867 27373 23139 24371
7939B4371r5p170k099K342k716k103L32O05L883o76m625l472O91k930j962N35
$$ 24371 24276 17106 15007 17349 14633 12530 12862 13467 17350 16674 12049 8577 9268 6338 4376 4911
7923D911M964J722l333N904J0050j215k765K123n174l724J570K810j608j974p644
$$ 4911 9875 11597 8264 14168 24218 23003 20238 22361 17187 13463 15033 17843 16235 14261 6617
7908F617k854K072N217N564L6O70j372N85l84l221k512K326P807j683q604p433
$$ 6617 3763 5835 11052 16616 16652 17322 15950 16535 16151 12930 10418 12744 20551 18868 10264 2831
7892B831Q415N095R37m25K10o547k177l224j747K945M257L941R02l238m973J682
$$ 2831 11246 16341 17278 16853 17063 10516 8339 5115 3368 6313 10570 14511 15413 12175 7202 8884
7876H884j748L115n994n625j182m422K023Q321P591n185M36J363l01n234L855
$$ 8884 7136 10251 4257 -1368 -2550 -6972 -4949 3372 10963 5778 6214 7577 7276 2042 5897
7861E897n69j699L183K355p762n494N758l747L747J2552N202j011j943J350j480
$$ 5897 5328 3629 6812 9167 1405 -4089 1669 -2078 1669 14221 19423 18412 16469 17819 16339
7846A6339l82m271m385j1206j209P982O200m08k90O2M64j455R69M144l615p254
$$ 16339 15957 11686 7301 -3905 -5114 2868 9068 8660 8370 8432 8896 7441 8410 12554 8939 1685
7830A685M26L564o63k140K290J525l53J427m283O50L696o397M568N40R36J556
$$ 1685 2111 5675 5012 2872 5162 6687 6334 7761 3478 4128 7824 1427 5995 6535 7471 9027
7814I027l073l797j199J631r02J743n307r42N712NQ78o815j639Q321n432k444
$$ 9027 5954 2157 958 2589 1687 3430 -1877 -2819 2893 2898 3776 -3039 -4678 3643 -1789 -4233
7798d233j316K74J831M521K902n180k205L364j742J557J922m325P58K120J14k550
$$ -4233 -5549 -5275 -3444 1077 3979 -1201 -3406 -42 -1784 -227 1695 -2630 -1872 248 362 -2188
7782b188J0721P747k015r210l603K411M008m663K1M466j8M00m117L03l720k347
$$ -2188 8533 16280 14265 5055 1452 3863 7871 3208 3229 7695 7677 8077 3960 4263 543 -1804
7766a804o110j133P686L753L586k884o279M009Q212p93j379j155l094l280L665
$$ -1804 -7914 -9047 -1361 2392 5978 3094 -3185 824 9036 8243 6864 5709 2615 -665 3000
7751C000N032k942q114M349P030L232l317L576k090p933j794k849k747J759L403
$$ 3000 8032 5090 -3024 1325 8355 11587 8270 11846 9756 1823 29 -2820 -5567 -3808 -405
7736d05K414l237j62P165J087m969n171n04O505l203o726J480O862L253m027N809
$$ -405 2009 -1228 -1390 5775 6862 1893 -3278 -3782 2723 -480 -7206 -5726 1136 4389 362 6171
7720F171Q840n750p306k383j026k797m221j0621L898L824j941K043J558P383O274
$$ 6171 15011 9261 1955 -428 -1454 -4251 -8472 -19093 -15195 -11371 -13312 -11269 -9711 -2328 3946
7705C946K424m022j561m334l635J411n33K275K830N453K181P214K682l341N51
$$ 3946 6370 2348 787 -3547 -7182 -5771 -6304 -4029 -1199 4254 6435 13649 16331 12990 13541
7690A3541M640l864J920N510l408q478q272q067j04k69K539l565J962m64k188
$$ 13541 18181 14317 16237 21747 18339 9861 1589 -6478 -6582 -6851 -4312 -7877 -5915 -6379 -8567
7675h567L763L144M258K172j413q843m482k003N996N251K306pN25J089l681l273
$$ -8567 -4804 -1660 2598 4770 3357 -5486 -9968 -11971 -5975 -724 1582 1575 2100 3189 -492 -3765
7659c765j264L567L735m920p462K078l86l911K915N896J680Q91N936J00m828P70
$$ -3765 -5029 -1462 2273 -2647 -10109 -8031 -8417 -12328 -9413 -3517 -1837 -946 4990 5090 262 1032
7643A032L032m147O01M878l181n854j222L606L374J474K490k742j544m053p850
$$ 1032 4064 -83 518 5396 2215 -3639 -4861 -1255 2119 3593 6083 3341 1797 -2256 -10106
7628a0106Q671k212m518J659Q759J2650j932k914l360M523M707n197k174l517
$$ -10106 -1435 -3647 -8165 -6506 2253 14903 12971 10057 6697 11220 15927 10730 8556 5039
7614E039k827O110K65m57K372j2220p087M848K965o51K978O440J373k592L922
$$ 5039 2212 8322 8587 8130 10502 -1718 -8805 -3957 -992 -1643 1335 7775 9148 6556 10478
7599A0478r4k43k746r622j807j903J674l451N47K756l24m44l623n520J936N352
$$ 10478 10384 10141 7395 -2227 -4034 -5937 -4263 -7714 -7167 -4411 -4735 -5179 -8802 -14322 -12386 -7034
7583g034L622M099J208j927L728l0K344m778l050k353m436L780M144j470K43m206
$$ -7034 -3412 687 1895 -32 3696 3666 6010 1232 -1818 -4171 -8607 -4827 -683 -2153 -1910 -6116
7567f116L414J616k56j89M708j128o253R45K52L290J038K493p96L248K012r209
$$ -6116 -2702 -1086 -1342 -1531 3177 2049 -4204 -3259 -3007 283 1321 3814 3018 6266 8278 -931
7551i31K11j105K755K143k113m23k595o11j334O64N659l219l651Q760M107n104
$$ -931 -720 -1825 930 3073 960 537 -2058 -2669 -4003 -3339 2320 -899 -4550 4210 8317 3213
7535C213K162K261J205j967q610j689j082M030L366l147J648l541k250j173k688
$$ 3213 5375 7636 8841 6874 -1736 -3425 -4507 -477 2889 -258 1390 -2151 -4401 -5574 -8262
7520h262L292M204R028m306o388k430M842K560j221L459J265l097j745J486K78
$$ -8262 -4970 -766 8262 3956 -2432 -4862 -20 2540 1319 4778 6043 2946 1201 2687 2965
7505B965P607L902J184q386n483q572M792M269k575n94L289J483M211k991r972
$$ 2965 10572 14474 15658 7272 1789 -6783 -1991 2278 -297 -891 2398 3881 8092 5101 -4871
7490d871l689K505N587N950J098m53m629r46K250M367K219k265K65k304m101r26
$$ -4871 -8560 -6055 -468 5482 6580 6127 1498 552 2802 7169 9388 7123 7388 5084 983 57
7474E7J266o23J459N523J339o092N173r73j1234m01M917O509J973k479k747p222
$$ 57 1323 700 2159 7682 9021 2929 8102 7129 -4105 -4506 411 6920 8893 6414 3667 -3555
7458c555p79q56k735K371j080J488O806O970P19p113n850q64j711M458J2844n06
$$ -3555 -4334 -5190 -7925 -5554 -6634 -5146 1660 8630 9349 2236 -3614 -4478 -6189 -1731 11113 10607
7442A0607o442o183N600L380m696J223l083J355M211m43j280J521l706o690q7
$$ 10607 4165 -2018 3582 6962 2266 3489 406 1761 5972 5529 4249 5770 2064 -4626 -4713
7427d713L182n993j985P066O662j090j818J808L480m322o035l59K512m507m659
$$ -4713 -1531 -7524 -9509 -2443 4219 3129 1311 3119 6599 2277 -3758 -4117 -1605 -6112 -10771
7412a0771k971R1N747M474K187o884m253l886j273P690O774O3r720k893N981K463
$$ -10771 -13742 -13651 -7904 -3430 -1243 -8127 -12380 -16266 -17539 -9849 -3075 -3012 -12732 -15625 -9644 -7181
7396g181M549n773n737m159K130J0040M403J744K701k995k439j983o22P42L476
$$ -7181 -2632 -8405 -14142 -18301 -16171 -6131 -1728 16 2717 -278 -2717 -4700 -5322 -4580 -1104
7381a104L675p414p586o0J489J414L941O184p817l522o1J337M760L112M892J268
$$ -1104 2571 -4843 -12429 -12489 -11000 -9586 -5645 539 -7278 -10800 -10861 -9524 -4764 -1652 3240 4508
7365D508k158M04l610l153j253m593j448P1l616j144R13K571M729J196k82K271
$$ 4508 2350 2754 -856 -4009 -5262 -9855 -11303 -11232 -14848 -15992 -15079 -12508 -7779 -6583 -6865 -4594
7349d594O006P87n052n29M730L957m871k40n001p470N852k399k213M203O227l363
$$ -4594 1412 2199 -2853 -3382 1348 5305 434 194 -4807 -12277 -6425 -8824 -11037 -6834 -607 -3970
7333c970k569O017m362p475O489Q394O15l255N115j923J207L463l825j475O307
$$ -3970 -6539 -522 -4884 -12359 -5870 2524 3139 -116 4999 3076 4283 7746 3921 2446 8753
7318H753k224j67N781j024K573l597k961j340j0005m066L346M364O363N418L910
$$ 8753 6529 6362 12143 11119 13692 10095 7134 5794 -4211 -8277 -4931 -567 5796 11214 15124
7303A5124l369n063O3p744k812k147l032L78J373K515Q72l698J18J986Q171M465
$$ 15124 11755 6692 6755 -989 -3801 -5948 -8980 -8602 -7229 -4714 -3842 -7540 -7422 -5436 2735 7200
7287G200M906p70k057j595M632K719o274j1263j463r50k519n912j878L793J2420
$$ 7200 12106 11336 9279 7684 12316 15035 8761 -2502 -3965 -4915 -7434 -13346 -15224 -11431 989
7272I89K947j531m364m98L52O57L215j790l247m776L63R930L320m556m773k110
$$ 989 3936 2405 -1959 -2457 -2105 -1448 1767 -23 -3270 -8046 -7683 2247 5567 1011 -3762 -5872
7256e872q194K296K249P884O105l859K450l765p46J069M499j819m185l391N058
$$ -5872 -14066 -11770 -9521 -1637 4468 609 3059 -706 -1452 -383 4116 2297 -1888 -5279 -221
7241b21M95j236m328Q45n67m965N91K988J478k855p82P958L363n0N903k349J433
$$ -221 274 -962 -5290 -4445 -5012 -9977 -9386 -6398 -4920 -7775 -8557 -599 2764 2714 8617 6268 7701
7224G701N6k979n229m312m718K440J0565J746m661o904j504j718L341Q919K385
$$ 7701 7757 4778 -451 -4763 -9481 -7041 3524 5270 609 -6295 -7799 -9517 -6176 2743 5128
7209E128l481r64J940j977m876K115M841M053J102j503j900o684j415n214Q84
$$ 5128 1647 683 2623 646 -4230 -2115 2726 6779 7881 6378 4478 -2206 -3621 -8835 -7951
7194g951J603N35k352P166K639r265m654P640N79Q31J793J834L707j068j572K214
$$ -7951 -6348 -5813 -8165 -999 1640 -7625 -12279 -4639 -4060 -3229 -1436 398 4105 3037 1465 3679
7178C679m900m004m738M353R273P355R74M16o632j446j964l58L172p425o220k217
$$ 3679 -1221 -5225 -9963 -5610 3663 11018 11992 12408 5776 4330 2366 2008 5180 -2245 -8465 -10682
7162a0682Q71K519J513K265K617L271M105P045J001m722k742q337l310M390L058
$$ -10682 -9811 -7292 -5779 -3514 -897 2374 6479 13524 14525 9803 7061 -1276 -4586 -196 2862
7147B862N798L237l813m462l677J506L425j804p75P95M559r71n257J69L596j671
$$ 2862 8660 11897 8084 3622 -55 1451 4876 3072 2297 3092 7651 6680 1423 1592 5188 3517
7131C517N766p189n779m164n570L420J0380L291m605K413L240k408j804j584J683
$$ 3517 9283 2094 -3685 -7849 -13419 -9999 381 3672 -933 1480 4720 2312 508 -1076 607
7116F07L412M310O95k962l354m039J850k929K728J629L792K588n24q46j518p892
$$ 607 4019 8329 9024 6062 2708 -1331 519 -2410 318 1947 5739 8327 7803 6957 5439 -2453
7100b453q062L626N798L896k951J354k087j852J593j464j727j193L263K547O00
$$ -2453 -10515 -6889 -1091 2805 -146 1208 -879 -2731 -1138 -2602 -4329 -5522 -2259 288 888
7085H88P52K532M243n535p941n89p351q62R116P809J86l510J849N049l182j0929
$$ 888 1640 4172 8415 2880 -5061 -5650 -13001 -13863 -4747 3062 3248 -262 1587 6636 3454 -7475
7069g475l627O460J682K318j901K022M22o054j233Q41M47R956M871j175o956l156
$$ -7475 -11102 -4642 -2960 -642 -2543 -521 -99 -6153 -7386 -6545 -6098 3858 8729 7554 598 -2558
7053b558O321o86j1227K447j322l72j217m694K28K716M779L702l589j291J52J638
$$ -2558 3763 3077 -8150 -5703 -7025 -7397 -8614 -13308 -13080 -10364 -5585 -1883 -5472 -6763 -6611 -4973
7037d973M513j74l744r476n885R210O653J3052M771p071l856m30J515R01K423
$$ -4973 -460 -634 -4378 -13854 -19739 -10529 -3876 9176 13947 6876 3020 2590 4105 5006 7429
7022G429j036n882k084n991J280J4152J0113l452j0458p539J116J258j319P925
$$ 7429 6393 511 -1573 -7564 -6284 7868 17981 14529 4071 -3468 -2352 -1094 -2413 5512
7008E512L328o276q012L495P284N39k911m3N532N100k354l106l363o366j468j029
$$ 5512 8840 2564 -5448 -1953 5331 5870 2959 2916 8448 13548 11194 8088 4725 -1641 -3109 -4138
6992d138Q449k113m438L556j276m324J188N169q75m110o144r173O653J0212R634
$$ -4138 4311 2198 -2240 1316 40 -4284 -3096 2073 1198 -2912 -9056 -18229 -11576 -1364 8270
6977H270J516J988q550m725n146J023j736Q386N630o766j633R30K840J345l551
$$ 8270 9786 11774 3224 -1501 -6647 -5624 -7360 1026 6656 -110 -1743 -813 2027 3372 -179
6962a79l904R83j898O8n1L373m1M985j973k606k809l985l621j562P894P671O943
$$ -179 -4083 -3100 -4998 -4930 -4981 -1608 -1649 3336 1363 -1243 -4052 -8037 -11658 -13220 -5326 2345 9288
6945I288J237q440m53O817K134M379L931q330o277o29k920j425M142K529L96l698
$$ 9288 10525 2085 1632 8449 10583 14962 18893 10563 4286 3657 737 -688 3454 5983 6379 2681
6929B681k896j88L50k691j275O918Q128K853m250q477o161o529l094L612M907
$$ 2681 -215 -403 -53 -2744 -4019 2899 11027 13880 9630 1153 -5008 -11537 -14631 -11019 -6112
6914f112J851L672j214l125m700L224j37k238Q712J884M813k7p956Q38L887K997
$$ -6112 -4261 -589 -1803 -4928 -9628 -6404 -6541 -8779 -67 1817 6630 6603 -1353 -515 3372 6369
6898F369J730m893j967M704j414k752l534n864j425n092k914N849J44J646J356
$$ 6369 8099 3206 1239 5943 4529 1777 -1757 -7621 -9046 -14138 -17052 -11203 -11059 -9413 -8057
6883h057l719J335N766L70J553J0312R494K228J598J3942J8204R083j5211j9325
$$ -8057 -11776 -10441 -4675 -4305 -2752 7560 17054 19282 20880 34822 53026 62109 46898 27573
6869B7573j6548j0238j46J668m640M154j239P845L559j1622K332p39J123K827
$$ 27573 11025 787 641 2309 -2331 1823 584 8429 11988 366 2698 1959 3082 5909
6855E909L01N55o467o190o44P71K055J713L51L473N294N626o356k566j585k556
$$ 5909 6210 6765 298 -5892 -6536 -5765 -3710 -1997 -1646 1827 7121 12747 6391 3825 2240 -316
6839c16j0238o660K667J485o153n26j136J947R167Q606k664M254k666L450R463
$$ -316 -10554 -17214 -14547 -13062 -19215 -19741 -20877 -18930 -9763 -1157 -3821 433 -2233 1217 10680
6824A0680M382L71n53j2490o033L865r99o09J092m7J447K498Q66n13P5j307l327
$$ 10680 15062 15433 14880 2390 -3643 222 -777 -1386 -294 -341 1106 3604 4470 3957 4032 2725 -602
6807f02k324j843Q081R682J689J707k938l064J1112K303n369j163P601N324J3626
$$ -602 -2926 -4769 3312 12994 14683 16390 13452 10388 21500 23803 18434 17271 24872 30196 43822
6792D3822K3120J7283j2340j8912o581K134J0558Q740p122j7334j3694l43l585
$$ 43822 66942 84225 71885 52973 46392 48526 59084 67824 60702 43368 29674 29331 25746
6779B5746L467j6n899p364j2016j21L505M924L997l468m989p680k011M907M789
$$ 25746 29213 29197 23298 15934 3918 3797 7302 12226 16223 12755 7766 86 -1925 2982 7771
6764G771l60M74m809k33P621m97n384R624m145P229K985O382J1681J3113j858
$$ 7771 7411 7885 3076 2843 10464 9967 4583 14207 10062 17291 20276 26658 38339 51452 49594
6749D9594p930j4179m004p2n933q387j1242j654j68K180l90l28J985K930n39j2793
$$ 49594 41664 27485 23481 23409 17476 9089 -2153 -3807 -3975 -1795 -2185 -2513 -528 2402 1863 -10930
6733a0930p909m67O600R805J1526N685L945L659L419J685J548r13r002n032m247
$$ -10930 -18839 -19306 -12706 -2901 8625 14310 18255 21914 25333 27018 28566 27653 18651 13619 9372
6718I372p527M553M926J118j0337j1432m976k327M499Q989M391M093K760P147
$$ 9372 1845 6398 11324 12442 2105 -9327 -14303 -16630 -12131 -3142 1249 5342 8102 15249
6704A5249Q67p314o5j778O703N41o366n725o21m992n879L598l503p032P061P118
$$ 15249 16116 8802 8737 6959 13662 14203 7837 2112 1491 -3501 -9380 -5782 -9285 -16317 -9256 -2138
6688b138L241J778M483M858l586n378m057m792l23p30K213K789M317N275J086
$$ -2138 1103 2881 7364 12222 8636 3258 -799 -5591 -5914 -6644 -4431 -1642 2675 7950 9036
6673I036p799j2541K149M850L887p40M72n708n942O908j843m244k669O479J738
$$ 9036 1237 -11304 -9155 -4305 -418 -1158 -686 -6394 -12336 -5428 -7271 -11515 -14184 -7705 -5967
6658e967l527j107k384j844K534J759l859l33M902N609J943o029L424O700k804
$$ -5967 -9494 -10601 -12985 -14829 -12295 -10536 -14395 -14728 -9826 -4217 -2274 -8303 -4879 1821 -983
6643i83R25M300l145p022j605j334m571j349J256R18Q478L852L749K191j589k525
$$ -983 -58 4242 1097 -5925 -7530 -8864 -13435 -14784 -13528 -12610 -4132 -280 3469 5660 4071 1546
6627A546M219l040r472j759M264L449j113m212k91j324j848r91j919K310Q60L268
$$ 1546 5765 2725 -6747 -8506 -4242 -793 -1906 -6118 -6409 -7733 -9581 -10572 -12491 -10181 -9321 -6053
6611f053K986O559k101O222o70l10K213J560m506n039o768m29L999K838m568k378
$$ -6053 -3067 3492 1391 7613 6943 6633 8846 10406 5900 861 -5907 -6336 -2337 501 -4067 -6445
6595f445K519K765j542O467J577j90l184j933O76L251j1152j923P616L812k470
$$ -6445 -3926 -1161 -2703 3764 5341 5151 1967 34 710 3961 -7191 -9114 -1498 2314 -156
6580a56j17m937j890J472J474N278O161Q59k338j809R22M753j083M21n23j527
$$ -156 -273 -5210 -7100 -5628 -4154 1124 7285 8144 5806 3997 4919 9672 8589 9010 8487 6960
6564F960j0992q489N51J0398O322l820n55L287J40K552M355l203p741n02M440
$$ 6960 -4032 -12521 -11970 -1572 4750 930 375 3662 3802 6354 10709 7506 -235 -737 3703
6549C703m414k288K259N724N636j2550n885P067K355o530l60M41P45Q493P686
$$ 3703 -711 -2999 -740 4984 10620 -1930 -7815 -748 1607 -4923 -5283 -4842 -4097 4396 12082
6534A2082j345m846k338k840j342r034J682N659k185M889j663j026K723K060q14
$$ 12082 10737 5891 3553 713 -629 -9663 -7981 -2322 -4507 382 -1281 -2307 416 2476 1662
6519A662k471p120L437N486L532l742q815K469m70k486N456J929J752M699n269
$$ 1662 -809 -7929 -4492 994 4526 784 -8031 -5562 -6032 -8518 -3062 -1133 619 5318 49
6504D9P31r82n980r5j69L438q44k86j011l397L346L149M347L642l26j000n904
$$ 49 780 -202 -6182 -6277 -6446 -3008 -3852 -4138 -5149 -8546 -5200 -2051 2296 5938 5612 4612 -1292
6487a292j139J255J106l836l345L767K537k031m411Q82L107j126J745L980M392
$$ -1292 -2431 -1176 -70 -3906 -7251 -3484 -947 -2978 -7389 -6507 -3400 -4526 -2781 1199 5591
6472E591K1k713l035j0439J246j281M694P470j108O387j379n176o493L135O807
$$ 5591 5612 2899 -136 -10575 -9329 -10610 -5916 1554 446 6833 5454 278 -6215 -3080 3727
6457C727m167q59L429m096l142K718O072j798k04Q96O76l134n315j581P84n72
$$ 3727 -440 -1299 2130 -1966 -5108 -2390 3682 1884 1680 2576 3252 118 -5197 -6778 -5994 -6566
6441f566k338K871O314Q243P633p847o872j313k590r16N904J21q319m833L755
$$ -6566 -8904 -6033 281 8524 16157 8310 1438 125 -2465 -3381 2523 2644 -5675 -10508 -6753
6426f753L483J53m311M823O147N47p451k323q46K45J442Q409J1020J186o967l585
$$ -6753 -3270 -3117 -7428 -2605 3542 4089 -3362 -5685 -6531 -6286 -4844 3565 14585 15771 8804 5219
6410E219q5k359J443p72l912n585N128O260k839q592n341M38P510N473j077r842
$$ 5219 5134 2775 4218 3446 -466 -6051 -923 5337 2498 -6094 -11435 -10997 -3487 1986 909 -8933
6394h933N520M915n773j124K04n149O735O664P42K32j221m841l854n995R57K435
$$ -8933 -3413 1502 -4271 -5395 -5191 -10340 -3605 3059 3801 4033 2812 -2029 -5883 -11878 -10921 -8486
6378h486m972j549l818N752q63L700L74K84k699L382Q007Q38L021r544l37O471
$$ -8486 -13458 -15007 -18825 -13073 -13936 -10236 -9862 -9578 -12277 -8895 -888 -50 2971 -6573 -6910 -439
6362d39R59J728j429L62j991J344j500j0467j190N310K819j62O231O168r614o107
$$ -439 520 2248 819 1181 -810 534 -966 -11433 -12623 -7313 -4494 -4656 1575 7743 -1871 -7978
6346g978M375l61J827k094o101k372K713j2J462k50n74n71J790M472L03L336K39
$$ -7978 -3603 -3964 -2137 -4231 -10332 -12704 -9991 -10003 -8541 -8791 -9365 -9936 -8146 -3674 -3371 -35 204
6329B04n5N238L304O53l081l384m678m013j316k439L642K265o123K173N296O558
$$ 204 149 5387 8691 9344 6263 2879 -1799 -5812 -7128 -9567 -5925 -3660 -9783 -7610 -2314 4244
6313D244m173m287Q41K178k936J247j281k39L99q301m884K209P502J3371j247
$$ 4244 71 -4216 -3375 -1197 -4133 -2886 -4167 -4406 -4007 -12308 -17192 -14983 -7481 5890 4643
6298D643n597k671J89j508j129K17n918J669J2769L971l448M02k75l404M77K255
$$ 4643 -954 -3625 -3436 -4944 -6073 -5856 -11774 -10105 2664 6635 3187 3589 3314 -90 387 2642
6282B642p413q91M789j433j450k914L763N224J943R68n584J143L804N098n13j19
$$ 2642 -4771 -5662 -873 -2306 -3756 -6670 -2907 2317 4260 5228 -356 787 4591 9689 9176 9057
6266I057m058p183J379k442j848J96J95J775O20Q83p19j536M142K645k262p100
$$ 9057 4999 -2184 -805 -3247 -5095 -4899 -4704 -2929 -2309 -1426 -2145 -3681 461 3106 844 -6256
6250f256k104k315O136P888Q61n428L046J929l807j901J874J032P47k578Q68N133
$$ -6256 -8360 -10675 -4539 3349 4210 -1218 1828 3757 -50 -1951 -77 955 1702 -876 -8 5125
6234E125j530m269n013l277M632j421K468Q968q84p867r365K758L171K228N91
$$ 5125 3595 -674 -5687 -8964 -4332 -5753 -3285 5683 4799 -3068 -12433 -9675 -6504 -4276 -3685
6219c685L22N119q31m775o573K356P518k737K853M865n547k289J864R36r72l248
$$ -3685 -3363 1756 925 -3850 -10423 -8067 -549 -3286 -433 4432 -1115 -3404 -1540 -604 -1576 -4824
6203d824l931K000k65j051k855O734L540m578K869M48P88o33n976N740J893K165
$$ -4824 -8755 -6755 -7020 -8071 -10926 -4192 -652 -5230 -2361 -1913 -1125 -1758 -7734 -1994 -101 2064
6187B064j151n210k668L186n57J398N902K579k460k381Q615j581q341N152L652
$$ 2064 913 -4297 -6965 -3779 -4336 -2938 2964 5543 3083 702 9317 7736 -605 4547 8199
6172H199j1062p611K795N207K6l882l762L26K103J572J70l459m68J680P500O399
$$ 8199 -2863 -10474 -7679 -2472 -2446 -6328 -10090 -9764 -7661 -6089 -5919 -9378 -9846 -8166 -666 5733
6156E733k729n157L412q71n469O97Q74m518k204J39P747Q930L15m095q479l725
$$ 5733 3004 -2153 1259 388 -5081 -4384 -3510 -8028 -10232 -10093 -2346 6584 6899 2804 -5675 -9400
6140i400m472O804M873O31m687K409k298j572l242N189N281N077l280o095O128
$$ -9400 -13872 -7068 -2195 -1564 -6251 -3842 -6140 -7712 -10954 -5765 -484 4593 1313 -4782 1346
6125A346K854R723p177j1116m614l923Q241P941k846o549P509Q96n975K9K391
$$ 1346 4200 13923 6746 -4370 -8984 -12907 -4666 3275 429 -6120 1389 2285 -3690 -3661 -1270
6110a270m029k849J905k677k904k282M457O140M169L271k714lo051p490P305Q261
$$ -1270 -5299 -8148 -6243 -8920 -11824 -14106 -9649 -3509 660 3931 1217 1214 -4837 -12327 -5022 3239
6094C239k152L155k218q49N692O21K983o70k464J555j0608J039O325K516l937
$$ 3239 1087 4242 2024 1175 6867 7488 10471 9801 7337 8892 -1716 -677 5648 8164 4227
6079D227n732P68L815J090n198k828k102j865l820K242K899J14N216M415J882
$$ 4227 -1505 -737 3078 4168 -1030 -3858 -5960 -7825 -11645 -9403 -6504 -6390 -1174 3241 5123
6064E123J412n878j3397o863J0285J2576p32j188o875L242N229l237L3n745Q382
$$ 5123 6535 657 -12740 -19603 -9318 3258 2526 1338 -5537 -2295 2934 -303 -270 -6015 2367
6049B367L215K084k12q976k784O162m724O191K576m954q902j295l389l772O292
$$ 2367 5582 7666 7454 -1522 -4306 1856 -2868 3323 5899 945 -7957 -9252 -12641 -16413 -10121
6034a0121j495M535P131J114Q72J740P969O256m394l836o27J986k954m527k335
$$ -10121 -11616 -7081 50 1164 2036 3776 11745 18001 13607 9771 9144 11130 8176 3649 1314
6019A314L5l427k482m003P39M878N86n432o944N287N843O632J183J866j85p401
$$ 1314 1349 -2078 -4560 -8563 -7824 -2946 -2360 -7792 -14736 -9449 -3606 3026 4209 6075 5890 -1511
6003a511o79k405M73J3557M024r931o965m558k350M309j275L779L60M575O498
$$ -1511 -2190 -4595 -4122 9435 13459 3528 -3437 -7995 -10345 -6036 -7311 -3532 -3172 1403 7901
5988G901J079o223K098o368n803l245M339K116m33N110M68r67M518J767q66L239
$$ 7901 8980 2757 4855 -1513 -7316 -10561 -6222 -4106 -4539 571 1039 72 4590 6357 5491 8730
5972H730m062k113l01J133o86k210n422q12R23l831l363M341L710k427M571J709
$$ 8730 4668 2555 2254 3387 2701 491 -4931 -5743 -4820 -8651 -12014 -7673 -3963 -6390 -1819 -110
5956a10J492j055p127N69K331J557K69j460Q36Q2n250l344o239j148Q172J171
$$ -110 1382 327 -6800 -6231 -3900 -2343 -2074 -3534 -2698 -2616 -7866 -11210 -17449 -18597 -10425 -9254
5940i254o440Q44O322K189K676j9q08j127J495j15j069j01Q138O160m393p787
$$ -9254 -15694 -14850 -8528 -6339 -3663 -3682 -4490 -5617 -4122 -4237 -5306 -5407 2731 8891 4498 -3289
5924c289k091J888q80J832k397N079Q107R098R91j076o337n339j824j64l297n29
$$ -3289 -5380 -3492 -4372 -2540 -4937 142 8249 17347 18338 17262 10925 5586 3762 3598 301 -228
5908b28P09j226k824Q88O456J346q112K998m283k074N652J700l812K519M493O57
$$ -228 481 -745 -3569 -2681 3775 5121 -2991 7 -4276 -6350 -698 1002 -2810 -291 4202 4859
5892D859l323r25P78K744o44r243j599K975N896k893k511k221l445l552K056J191
$$ 4859 1536 611 1389 4133 3489 -5754 -7353 -4378 1518 -1375 -3886 -6107 -9552 -13104 -11048 -9857
5876i857O49J538L345j265k061o9l668M574O902J438p470M119j245k788O63K729
$$ -9857 -9208 -7670 -4325 -5590 -7651 -7720 -11388 -6814 88 1526 -5944 -1825 -3070 -5858 -5195 -2466
5860b466O214N448o734j827J54l468k665j681K202j262j214k919r53M28j862j738
$$ -2466 3748 9196 2462 635 789 -2679 -5344 -7025 -4823 -6085 -7299 -10218 -11171 -10743 -12605 -14343
5844a4343L318l890k263P843L634K729n871K32r32m780n956j022R598M767j111
$$ -14343 -11025 -14915 -17178 -9335 -5701 -2972 -8843 -8611 -9543 -14323 -20279 -21301 -11703 -6936 -8047
5829h047m82n96p055J343O359L81m795Q65J70Q136J741m566j351K038k099Q15
$$ -8047 -8529 -9125 -16180 -14837 -8478 -8097 -12892 -12027 -11857 -3721 -1980 -6546 -7897 -5859 -7958 -7143
5813g143m759o30O765M514N241O001J780r859r644l070K900N529j959k241l323
$$ -7143 -11902 -12532 -5767 -1253 3988 9989 11769 1910 -7734 -10804 -7904 -2375 -4334 -6575 -9898
5798i898j18N995L053R76p027j830j938m765J808P927K473m77K212k578l695K796
$$ -9898 -10016 -4021 -968 8 -7019 -8849 -10787 -15552 -13744 -5817 -3344 -3821 -1609 -4187 -7882 -5086
5782e086q1l795K525k348K962L762Q982k45m504j1632k920Q60M320l852m19J579
$$ -5086 -5167 -8962 -6437 -8785 -5823 -2061 6921 6676 2172 -9460 -12380 -11520 -7200 -11052 -11471 -9892
5766i892K669K741o528k811l965k337l780m43P709M295M121M095P142l191R07
$$ -9892 -7223 -4482 -11010 -13821 -17786 -20123 -23903 -24346 -16637 -12342 -8221 -4126 3016 -175 732
5751G32N195l289l236n401K031J455O775K559n777k768L878j348Q59j177K84J667
$$ 732 5927 2638 -598 -5999 -3968 -2513 4262 6821 1044 -1724 2154 806 1665 488 772 2439
5735B439K083ko223L250l250o797r4L030Q020k831j857n740k519k61K944L204
$$ 2439 4522 4520 -1703 1547 -1703 -8500 -8594 -5564 2456 -375 -2232 -7972 -10491 -10752 -7808 -4604
5719d604j327l663j0432j520O922M996L620M846j61Q14l567j228m86l527O979
$$ -4604 -5931 -9594 -20026 -21546 -14624 -9628 -6008 -1162 -1323 -509 -4076 -5304 -5790 -9317 -2338
5704b338k730l629p54P47J311J83J502K387l203J102o561m969J770Q5M706M432
$$ -2338 -5068 -8697 -9451 -8704 -7393 -7210 -5708 -3321 -6524 -5422 -11983 -16952 -15182 -15097 -10391 -5959
5688e959k167N24M055L340N239j06n566p572L336r59o129P78l62M788Q24M00M505
$$ -5959 -8126 -7602 -3547 -207 5032 4926 -640 -8212 -4876 -5835 -11964 -11186 -11548 -6760 -5936 -5536 -1031
5671a031O064n071n378K295K989L874K92m467M44j016K747L329q45j470p64j691
$$ -1031 5033 -38 -5416 -3121 -132 3742 4034 -433 11 -1005 1742 5071 4226 2756 1992 301
5655C01J20J454q58n861k015J695K883l517l466M187J999K707J025J330M74o27
$$ 301 421 1875 1017 -4844 -6859 -5164 -2281 -5798 -9264 -5077 -3078 -371 654 1984 2458 1831
5639A831K731L489l53r75j3424p691L341N244L356K019L98m387k42N381N04m141
$$ 1831 4562 8051 7698 6723 -6701 -14392 -11051 -5807 -2451 -432 -34 -4421 -4663 718 1222 -2919
5623b919R06p7k531Q082L428k719q12K750K273j774j927j066l718k366r65o706
$$ -2919 -2013 -2090 -4621 3461 6889 4170 3358 6108 8381 6607 4680 3614 -104 -2470 -3435 -10141
5607a0141L263j078m053K83M115j265n171P306Q167P34L134L141L171l973p365
$$ -10141 -6878 -7956 -12009 -11726 -7611 -8876 -14047 -6741 1426 2160 5294 8435 11606 7633 268
5592B68o818j464k906m080Q73P428K060O18N29J631k940J014j652o795L719N179
$$ 268 -6550 -8014 -10920 -15000 -14127 -6699 -4639 -4021 -3492 -1861 -4801 -3787 -5439 -12234 -8515 -3336
5576c336K100O231Q55j487Q087o218q435o225n431J043Q248L406r443m467n476
$$ -3336 -1236 4995 5850 4363 12450 6232 -2203 -8428 -13859 -12816 -4568 -1162 -10605 -15072 -20548
5561b0548j0O807P680J44j822m356j886O431P054O454J429n640n516J792K918
$$ -20548 -20558 -13751 -6071 -5927 -7749 -12105 -13991 -7560 -506 5948 7377 1737 -3779 -1987 931
5546I31k636m423k966k567k685l522K868Q994K900l806L095l290k916Q320N544
$$ 931 -1705 -6128 -9094 -11661 -14346 -17868 -15000 -6006 -3106 -6912 -3817 -7107 -10023 -1703 3841
5531C841O482j81k822l623k593l289K06N16l1N89J428k114q604n318J06O446o60
$$ 3841 10323 10142 7320 3697 1104 -2185 -1979 -1463 -1494 -905 523 -1591 -10195 -15513 -15407 -8961 -9621
5514i621L314O556Q31j273n30N64K365Q56k714q328K603L342j411K6m098J033
$$ -9621 -6307 249 1080 -193 -723 -159 2206 3062 348 -7980 -5377 -2035 -3446 -3420 -7518 -6485
5498f485O976K136J415m513o116K142q4p87j43q33k169l595j441M726M828m337
$$ -6485 491 2627 4042 -471 -6587 -4445 -4529 -5316 -5459 -6292 -8461 -12056 -13497 -8771 -3943 -8280
5482h280m348N666K43K505M472J173j879L215p110l866M402J5026K625j793r716
$$ -8280 -12628 -6962 -6719 -4214 258 1431 -448 2767 -4343 -8209 -3807 11219 13844 12051 2335
5467B335p76J129l612j675l244N45P987L514K58n858n66O370n562o724k337O954
$$ 2335 1559 2688 -924 -2599 -5843 -5298 2689 6203 6461 603 37 6407 845 -5879 -8216 -1262
5451a262M179O508p84K9m365r359j986K236r83K98L481m568K602j244L532M595
$$ -1262 2917 9425 8641 8670 4305 -5054 -7040 -4804 -5787 -5489 -2008 -6576 -3974 -5218 -1686 2909
5435B909q094k046N864r80o414l993m874q20K469j3p19N65M844k20K920l267M964
$$ 2909 -5185 -7231 -1367 -2347 -8761 -12754 -17628 -18448 -15979 -15992 -16711 -16146 -11302 -11522 -8602 -11869 -6905
5418f905J962l733P826N46n281L806K215m901r96O15K651O81Q457O355J53j581
$$ -6905 -4943 -8676 -850 -304 -5585 -1779 436 -4465 -5461 -4846 -2195 -1514 6943 13298 13451 11870
5402A1870j807l101l264j39k880p716K285N176K847L16l457j1975K894n22N14
$$ 11870 10063 6962 3698 3559 679 -7037 -4752 424 3271 3587 130 -11845 -8951 -9473 -8959
5387h959K005m297Q926Q079j940l437l506P64p63k469r91L466M466l636l374k926
$$ -8959 -6954 -11251 -2325 5754 3814 377 -3129 -2365 -3128 -5597 -6588 -3122 1344 -2292 -5666 -8592
5371h592M152j198K579M609n174j594J415R94K04m727N0P542m451J0978O456o214
$$ -8592 -4440 -5638 -3059 1550 -3624 -5218 -3803 -2809 -2605 -7332 -7282 260 -4191 6787 13243 7029
5355G029m508P18O88j262L81o314m498M278O084J164m331l696K979M331K141l250
$$ 7029 2521 3239 3927 2665 3046 -3268 -7766 -3488 2596 3760 -571 -4267 -1288 3043 5184 1934
5339A934J632n824n664k348n449r96O261L612M087J959L676P15m397k443O855
$$ 1934 3566 -2258 -7922 -10270 -15719 -16715 -10454 -6842 -2755 -796 2880 3595 -802 -3245 3610
5324C610m265m745r00k394j26K274K40J286P94K328R280k510j606p242m687K600
$$ 3610 -655 -5400 -6300 -8694 -8820 -6546 -6306 -5020 -4226 -1898 7382 4872 3266 -3976 -8663 -6063
5308f063J875L009Q11k902j942M850r20n084m091j538m355o20M124K923M122k03
$$ -6063 -4188 -1179 -368 -3270 -5212 -362 -1282 -6366 -10457 -11995 -16350 -16970 -12846 -9923 -5801 -6004
5292f004j151k299K886k549J159q1k401Q54M533%Q609K144o737p072k87N805j470
$$ -6004 -7155 -9454 -6568 -9117 -7958 -8039 -10440 -9586 -5053 -5053 3556 5700 -1037 -8109 -8396 -2591 -4061
5275d061j10J524P38m612m99m526j671J0548Q086n146q710J411J1261J742O787
$$ -4061 -4171 -2647 -1909 -6521 -7020 -11546 -13217 -2669 5417 271 -8439 -7028 4233 5975 12762
5260A2762k019p718m567J141k857J235l27j717K017j92r91k088N31L359L594J054
$$ 12762 10743 3025 -1542 -401 -3258 -2023 -2350 -4067 -2050 -2242 -3233 -5321 -4790 -1431 2163 3217
5244C217O181q045m228k421j541R084J681m939m659J90P764L588m365J475M573
$$ 3217 9398 1353 -2875 -5296 -6837 2247 3928 -1011 -5670 -5480 2284 5872 1507 2982 7555
5229G555n803p158o42k018P841O257L00o907P86k720K968L681m950k325k764o978
$$ 7555 1752 -5406 -6048 -8066 -225 6032 6332 -575 211 -2509 459 4140 -810 -3135 -5899 -12877
5213a2877j607J124l27N463P437K390M287K390q904o756K537P59k810J410N87
$$ -12877 -14484 -13360 -13687 -8224 -787 1603 5890 8280 -624 -7380 -4843 -4084 -6894 -5484 -4897
5198d897M814j124k88K992J08J846L93n474k914k717M764O690N558n555n606N51
$$ -4897 -83 -1207 -1495 1497 1605 3451 3844 -1630 -4544 -7261 -2497 4193 9751 4196 -1410 -859
5182h59k775k404J101K175R68q059J557L099M660k892m358L179M256m473l762
$$ -859 -3634 -6038 -4937 -2762 -1794 -9853 -8296 -5197 -537 -3429 -7787 -4608 -352 -4825 -8587
5167h587J519K567J114M98M953O237j316n240j370o195J335m71n53J080O849J650
$$ -8587 -7068 -4501 -3387 -2889 2064 8301 6985 1745 375 -5820 -4485 -4956 -5509 -4429 2420 4070
5151D070l142r425l837L880L668j162k025N813K322j013M164O05l069O599l105
$$ 4070 928 -8497 -12334 -8454 -4786 -5948 -7973 -2160 162 -851 3313 3918 849 7448 4343
5136D343p058l038k700Q43l123M993L526M569k301o868M673Q48o522K117M625
$$ 4343 -2715 -5753 -8453 -7610 -10733 -5740 -2214 2355 54 -6814 -2141 -1293 -7815 -5698 -1073
5121a073j677J325o31j550k374L764R237k279j860l869n596l53N635O985Q15J717
$$ -1073 -2750 -1425 -2056 -3606 -5980 -2216 7021 4742 2882 -987 -6583 -6936 -1301 5684 6499 8216
5105H216J028k38j532k141R95l262L323O172J792k750q526p703m598N47K768M628
$$ 8216 9244 9006 7474 5333 6328 3066 6389 12561 14353 11603 3077 -4626 -9224 -8677 -5909 -1281
5089a281l46k548O518L94k125K495K866m791O359N206k151l875N370J689m71M637
$$ -1281 -1627 -4175 2343 2737 612 3107 5973 1182 7541 12747 10596 6721 12091 13780 13309 17946
5073A7946k129j888L458l748j1898j1971J288J2545P863K680j25o953p860k860
$$ 17946 15817 13929 17387 13639 1741 -10230 -8942 3603 11466 14146 14021 7068 -792 -3652
5059c652l922O525N335m163l974L13r20k571l905N860L948K65q65j288O082M005
$$ -3652 -7574 -1049 4286 123 -3851 -3538 -4458 -7029 -10934 -5074 -1126 -861 -1726 -3014 3068 7073
5043G073m902J745q16J007L61L978m46l353O58M731q645p378j022J035j87k944
$$ 7073 2171 3916 3100 4107 4468 8446 8000 4647 5305 10036 1391 -5987 -7009 -5974 -6161 -9105
5027i105j551L399M691n37P271L488l200Q43l724K82k548o333L558N234L799n966
$$ -9105 -10656 -7257 -2566 -3103 4168 7656 4456 5299 1575 1857 -691 -7024 -3466 1768 5567 -399
5011c99j086K441p355M175L122m013P404J152j547k72p055m121J373j468o070
$$ -399 -1485 956 -6399 -2224 898 -3115 4289 5441 3894 3622 -3433 -7554 -6181 -7649 -13719
4996a3719j470N161M673M802m082p933k940o28L174J240N1J468N481J11P41N339
$$ -13719 -15189 -10028 -5355 -553 -4635 -12568 -15508 -16136 -12962 -11722 -11671 -10203 -4722 -4611 -3870 1469
4980A469K580P63N30p310j1206k787M017M824L398M653L416L988n677p39J067
$$ 1469 4049 4812 5342 -1968 -13174 -15961 -11944 -7120 -3722 931 4347 8335 2658 1919 2986
4965B986m7M79M205k114l420k460o063o389K339M066l700k571k349M308Q525K194
$$ 2986 2939 3418 7623 5509 2089 -371 -6434 -12823 -10484 -6418 -10118 -12689 -15038 -10730 -2205 -11
4949a1P57k063n206J075L608L980p601K320o904m119N891P04J019k047k857O710
$$ -11 746 -1317 -6523 -5448 -1840 2140 -5461 -3141 -10045 -14164 -8273 -7569 -6550 -8597 -11454 -4744
4933d744M858k318m325o356L695j058q34L736M328k75J634N196m525j539k424
$$ -4744 114 -2204 -6529 -12885 -9190 -10248 -11082 -7346 -3018 -3293 -1659 3537 -988 -2527 -4951
4918d951J935r46m010p026R520R189J137K356l078l423l466O2n50L046M940K128
$$ -4951 -3016 -3962 -7972 -14998 -5478 3711 4848 7204 4126 703 -2763 -2701 -3251 -205 4735 6863
4902F863M608J631j803m643m174j646q35m495M861J246j262j85N980r59L96k354
$$ 6863 11471 13102 11299 6656 2482 836 1 -4494 367 1613 351 166 6146 5187 5583 3229
4886C229k547n05J179P10l486R6n368k552K510j501L638J86K19p39l690Q80K528
$$ 3229 682 177 1356 2066 -1420 -1324 -6692 -9244 -6734 -8235 -4597 -4411 -4192 -4931 -8621 -7741 -5213
4869e213L841M428M271k46n361L010K494m857l920n06L504k353j014N05M597O178
$$ -5213 -1372 3056 7327 7081 1720 4730 7224 2367 -1553 -2059 1445 -908 -1922 -1417 3180 9358
4853I358J720p437r224k300O89j293m90n64J946O934R19o649k591j549j404p64
$$ 9358 11078 3641 -5583 -7883 -7194 -8487 -8977 -9541 -7595 -661 258 -6391 -8982 -10531 -11935 -12699
4837a2699M498n330J945P924N960j043P71k390M43q76J241J526q60m062o419J31
$$ -12699 -8201 -13531 -11586 -3662 2298 1255 2026 -364 79 -797 444 1970 1110 -2952 -9371 -9240
4821i240J136L473L19K687J803n003p046l50O544J0447m215l298q089k310N236
$$ -9240 -8104 -4631 -4312 -1625 178 -4825 -11871 -12221 -5677 4770 555 -2743 -10832 -13142 -7906
4806g906j16k856k92K911K956O426M071J764L668K732j346L335K122j655q541
$$ -7906 -8022 -10878 -11170 -8259 -5303 1123 5194 6958 10626 13358 12012 15347 17469 15814 7273
4791G273l05j173l613j698n924K646K095o534j593J789K770j372j014n338P78
$$ 7273 6968 5795 2182 484 -5440 -2794 -699 -7233 -8826 -7037 -4267 -5639 -6653 -11991 -11213
4776a1213J580L218L384l681k38k64M010K016k63j349r48N897L75p177O645L66
$$ -11213 -9633 -6415 -3031 -6712 -6950 -7214 -3204 -1188 -1451 -2800 -3748 2149 2524 -4653 1992 2358
4760B358m337l24N142J623m489m316N350L032M26j397l459q44J176J361K408K193
$$ 2358 -1979 -2303 2839 4462 -27 -4343 1007 4039 4465 3068 -391 -1235 -59 1302 3710 5903
4744E903j622P20L252j488o138J325L277r559n949P46M332j37j1m19j469L926
$$ 5903 4281 5001 8253 6765 627 1952 5229 -4330 -10279 -9533 -5201 -5338 -5349 -5768 -7237 -3311
4728c311Q006K610J807J858q20k465l976K069K604j070l016p458o975J137J884
$$ -3311 4695 7305 9112 10970 10150 7685 3709 5778 8382 7312 4296 -3162 -10137 -9000 -7116
4713g116K793m95J655L999k353j556J467Q56O851O542n339p381k882l688n5l376
$$ -7116 -4323 -4818 -3163 836 -1517 -3073 -1606 -750 6101 12643 7304 -77 -2959 -6647 -6702 -10078
4697a0078L473k385r17J840l453P03L210J818M892R820J623m388m280M359l627
$$ -10078 -6605 -8990 -9907 -8067 -11520 -10817 -7607 -5789 -897 8923 10546 6158 1878 6237 2610
4682B610m877k696k911K533k916k065J0559K840M074N773n078q701j0057N854
$$ 2610 -2267 -4963 -7874 -5341 -8257 -10322 237 3077 7151 12924 7846 -855 -10912 -5058
4668e058k926m810O891j973J15M132K150k003j605K773J546P73o222L17L638j397
$$ -5058 -7984 -12794 -5903 -7876 -7761 -3629 -1479 -3482 -5087 -2314 -768 5 -6217 -5900 -2262 -3659
4652c659k400L668m13k445J87L305m40m736j688M989M653j494k76j207l58K115
$$ -3659 -6059 -2391 -2804 -5249 -5062 -1757 -2197 -6933 -8621 -3632 1021 -473 -749 -1956 -2314 -199
4636a99j142m501k802O62K832j327N31J809J135l553r24K43M338m576r618l512
$$ -199 -1341 -5842 -8644 -7982 -5150 -6477 -5946 -4137 -3002 -6555 -7479 -7236 -2898 -7474 -17092 -20604
4620b0604R453P015j600j620N526L084J864j342J336j641p70m007M47J0673J353
$$ -20604 -11151 -4136 -5736 -7356 -1830 1254 3118 1776 3112 1471 701 -3306 -2859 7814 9167
4605I167p835o771M539L087R24Q44J588l282n126j217K659J166j614K589J747
$$ 9167 1332 -5439 -900 2187 3111 3955 5543 2261 -2865 -4082 -1423 -257 -1871 718 2465
4590B465M867l11q684m39M011L285K228o993o152Q207M135m191r780L054J062
$$ 2465 7332 7021 -1663 -2102 1909 5194 7422 429 -5723 2484 6619 2428 -7352 -4298 -3236
4575c236O54O757J370k049J788j14L634l709p661R51j008J70k909N437n006n717
$$ -3236 -2582 4175 5545 3496 5284 5170 8804 5095 -2566 -1615 -2623 -2453 -5362 75 -4931 -10648
4559a0648O203L985P840r010N82Q850P604r432q177n23K426j749j573k076J927
$$ -10648 -4445 -460 7380 -1630 -1048 7802 15406 5974 -2203 -2726 -300 -2049 -3622 -5698 -3771
4544c771K654K413N06j690J743N79j230K225K35k281J922n731o921l476L548O145
$$ -3771 -1117 1296 1802 112 1855 2434 1204 3429 3664 1383 3305 -2426 -9347 -12823 -9275 -3130
4528c130Q545j520r095p052J800N700L612j096N0j353j412k629l161K311P34j417
$$ -3130 5415 3895 -5200 -12252 -10452 -4752 -1140 -2236 -2186 -3539 -4951 -7580 -10741 -8430 -7696 -9113
4512i113k138J483q18M701p01O26N57m67j777K288Q982j745m780O711M426m250
$$ -9113 -11251 -9768 -10586 -5885 -6586 -5960 -5403 -5870 -7647 -5359 3623 1878 -2902 3809 8235 3985
4496C985q340J96O908n46k776j080J865R324M221N317l942r998n716j563m703
$$ 3985 -4355 -4159 2749 2203 -573 -1653 212 9536 13757 19074 15132 5134 -582 -2145 -6848
4481f848m138O605Q654L956J455p18n076p756J573L884K470j203m419m69k877
$$ -6848 -10986 -4381 4273 8229 9684 8966 3890 -3866 -2293 1591 4061 2858 -1561 -2030 -4907
4466d907j587k509J332r68j097J367L63M364J554J87o552n559K384O132O280j174
$$ -4907 -6494 -9003 -7671 -8639 -9736 -8369 -8006 -3642 -2088 -1901 -8453 -14012 -11628 -5496 784 -390
4450c90r00J696k332M213M838m121J732l412m61j636N75N716N516r040q941R39
$$ -390 -1290 406 -1926 2287 7125 3004 4736 1324 863 -773 -198 5518 11034 1994 -6947 -6008
4434f008m159K381R231L440M704J929k314m502p90L191K120k362m889j73J719
$$ -6008 -10167 -7786 1445 4885 9589 11518 9204 4702 3912 7103 9223 6861 1972 1799 3518
4419C518j278J598m311j664J226M363n430k14o214L51J3881k714j954L309l834
$$ 3518 2240 3838 -473 -2137 -911 3452 -1978 -2192 -8406 -8055 5826 3112 1158 4467 633
4404F33m969l05J55J323j894K599Q430k100k940k351L783J902M038K959k335l536
$$ 633 -4336 -4641 -4486 -3163 -5057 -2458 5972 3872 932 -1419 2364 4266 8304 11263 8928 5392
4388E392j182n76K563k443k201m69O54K903m268K074j989k068L801L118k684p811
$$ 5392 4210 3634 6197 3754 1553 1084 1738 4641 373 2447 458 -1610 2191 5309 2625 -5186
4372e186n555R374O334L618R94n157n811o998L017o770M119M640p058R85J0370
$$ -5186 -10741 -1367 4967 8585 9579 4422 -1389 -8387 -5370 -12140 -8021 -3381 -10439 -9454 916
4357I16L047k84J638K315o258o594k464N264L848L16n069r61J590O223M03L413
$$ 916 3963 3679 5317 7632 1374 -5220 -7684 -2420 1428 1744 -3325 -4286 -2696 3527 3930 7343
4341G343K113m392o756r683r56N919J734Q27J144J257P50j657j495J478P152l159
$$ 7343 9456 5064 -1692 -11375 -12331 -6412 -4678 -3851 -2707 -1450 -700 -2357 -3852 -2374 4778 1619
4325A619m933L049M983l293r910m617m54l076L529J0049N186k534l241N539N669
$$ 1619 -3314 -265 4718 1425 -8485 -13102 -13556 -16632 -13103 -3054 2132 -402 -3643 1896 7565
4310G565K678j1552m048r86N40j426l129q25J19M460R568N851r608l949Q664j145
$$ 7565 10243 -1309 -5357 -6343 -5803 -7229 -10358 -11183 -11064 -6604 2964 8815 -793 -4742 3922 2777
4294B777l673N265L265n168o195J54l312j011k848p438O291J3021N247l200j786
$$ 2777 -896 4369 7634 2466 -3729 -3575 -6887 -7898 -10746 -18184 -11893 1128 6375 3175 1389
4279A389l686J002j568J481k778l123l431m345K308J945J083j764n16J202l105
$$ 1389 -2297 -1295 -2863 -1382 -4160 -7283 -10714 -15059 -12751 -10806 -9723 -11487 -12003 -10801 -13906
4264a3906J78R994J1741L605p686m099l218L004m913q678M02O999L000J046j088
$$ -13906 -13728 -3734 8007 11612 3926 -173 -3391 -387 -5300 -13978 -13576 -6577 -3577 -2531 -3619
4249c619L684o884J128Q158Q13l288K602M316q514m381P73q668m619J722K767
$$ -3619 65 -6819 -5691 2467 3280 -8 2594 6910 -1604 -5985 -5212 -13880 -18499 -16777 -14010
4234a4010J558K223K885O124L618p42j304o112K798L657l017j805l393J876M042
$$ -14010 -12452 -10229 -7344 -1220 2398 1656 352 -5760 -2962 695 -2322 -4127 -7520 -5644 -1602
4219a602M257M779k379m914m286K749R8m559K408k242m89O968Q371m908L263K418
$$ -1602 2655 7434 5055 141 -4145 -1396 -1298 -5857 -3449 -5691 -6180 788 9159 4251 7514 9932
4203I932p63k275k951j4134L052J0490K052k495Q5O26K849l400n590k107L982
$$ 9932 9169 6894 3943 -10191 -7139 3351 5403 2908 2993 3619 6468 3068 -2522 -4629 -647
4188f47o876J0L270M638P108J231o160K017l636o623J791L587L566L763n08j0235
$$ -647 -7523 -7513 -4243 395 7503 8734 2574 4591 955 -5668 -3877 -290 3276 7039 6531 -3704
4172c704m692N518M622j038M44n453K166j30l786j818L974N82L493L837j941N692
$$ -3704 -8396 -2878 1744 706 1150 -4303 -2137 -2267 -6053 -7871 -3897 -3315 178 4015 2074 7766
4156G766L746K56p041o920n482N579K318k537k150j082M512J958o933l952N195
$$ 7766 11512 11768 4727 -2193 -7675 -2096 222 -2315 -4465 -5547 -1035 923 -6010 -9962 -4767
4141d767P546Q861P59l616l831m747m768J44L509j607k734N660M710M675O120
$$ -4767 2779 11640 12399 8783 4952 205 -4563 -4419 -910 -2517 -5251 409 5119 9794 15914
4126A5914m056o459k996L858O067O69o661q380n039P325o99L784j382m135n99
$$ 15914 11858 5399 2403 6261 12328 12997 6336 -2044 -7083 242 -457 3327 1945 -2190 -2789
4111b789L229O628m209m435j780Q424K125l926m344Q22M764j136k239m340m107
$$ -2789 440 7068 2859 -1576 -3356 5068 7193 3267 -1077 -255 4509 3373 1134 -3206 -7313
4096g313O964J0337R382m849j7980r202K224L853O668L881o347m716m175N761
$$ -7313 -349 9988 19370 14521 -3459 -12661 -10437 -6584 84 3965 -2382 -7098 -11273 -5512
4082e512Q285R36j654k311k283j842O32l700K984L809P391p93n102L37j024L574
$$ -5512 2773 3709 2055 -256 -2539 -4381 -3749 -7449 -4465 -656 6735 5942 840 1177 153 3727
4066C727k725j329j279k097P61j430J291k294q22l625m099l301L053O659L842
$$ 3727 1002 -327 -1606 -3703 -2942 -4372 -3081 -5375 -6197 -9822 -13921 -17222 -14169 -7510 -3668
4051c668q17j406K772K58j455M148K155l660o327M427j785K577J0981L739k396
$$ -3668 -4485 -5891 -3119 -2861 -4316 -168 1987 -1673 -8000 -3573 -5358 -2781 8200 11939 9543
4036I543j587l329o47K000M190j355m416m642j273O077j438l944N95P59j889m373
$$ 9543 7956 4627 3980 5980 10170 8815 4399 -243 -1516 4561 3123 -821 -226 533 -1356 -5729
4020e729L414K387m953p73k803m473N70M827L323p69M99J052j270K135N552M964
$$ -5729 -2315 72 -4881 -5654 -8457 -12930 -12360 -7533 -4210 -4979 -4480 -3428 -4698 -2563 2989 7953
4004G953l951m621L61P059M081O099j0418j1648n019m18k04M428j404R52n841
$$ 7953 4002 -619 -258 6801 10882 16981 6563 -5085 -10104 -10522 -10726 -6298 -7702 -6750 -12591
3989a2591j034R023L03K355K657j283j205n317M924K660n39N601l714J52J963
$$ -12591 -13625 -4602 -4299 -1944 713 -570 -1775 -7092 -2168 492 -47 5554 1840 1992 3955
3974C955M889l941n255o787l508L921L384L330O469M24m140o61K714J784o482
$$ 3955 8844 4903 -352 -7139 -10647 -6726 -3342 -12 6457 6881 2741 2080 4794 6578 96
3959I6n124Q588n450o212L632j876J556O046J721m923L042K410p644j685M160
$$ 96 -5028 3560 -1890 -8102 -4470 -6346 -4790 1256 2977 -1946 1096 3506 -4138 -5823 -1663
3944a663P015M09n24p70k997l561r26L390m704N18O505O256k308k6o964j0888
$$ -1663 5352 5761 5237 4467 1470 -2091 -3017 373 -4331 -3813 2692 8948 6640 6614 -350 -11238
3928a1238L423N369N334n67K782p830n036J937j34n84K264J431l951N394J8279
$$ -11238 -7815 -2446 2888 2321 5103 -2727 -7763 -5826 -5960 -6544 -4280 -2849 -6800 -1406 16873
3913A6873K724o733p018k663K522K343j45K053k332j2380k459K808m161K656l380
$$ 16873 19597 12864 5846 3183 5705 8048 7903 9956 7624 -4756 -7215 -4407 -8568 -5912 -9292
3898i292o33N090p23l881n76N131O770M004k326k287M250k051m885N632k3o696
$$ -9292 -9925 -4835 -5558 -9439 -10015 -4884 1886 5890 3564 1277 5527 3476 -1409 4223 4200 -2496
3882b496m582M279Q43K020L183m169k688o764o768N249P021L551l248q077k369
$$ -2496 -7078 -2799 -1956 64 3247 -922 -3610 -10374 -17142 -11893 -4872 -1321 -4569 -12646 -15015
3867a5015J0546N455M43L485l117m879k359K778m127R10N723J555o679K319R280
$$ -15015 -4469 986 1429 4914 1797 -3082 -5441 -2663 -6790 -5880 -157 1398 -5281 -2962 6318
3852F318P061o399O69o119j105L814J915l223L541k700q096J505K050M52o256
$$ 6318 13379 6980 7649 1530 425 4239 6154 2931 6472 3772 -4324 -2819 -769 -317 -6573
3837f573l567L747L268L963K238j928J415o900o196R23P610j813o419n79J746
$$ -6573 -10140 -6393 -3125 838 3076 1148 2563 -4337 -10533 -9610 -2000 -3813 -10232 -10811 -9065
3822i065k928M965K799l377O454k10M83L217J657K337O306Q36k810k733n50M044
$$ -9065 -11993 -7028 -4229 -7606 -1152 -1362 -879 2338 3995 6332 12638 13474 10664 7931 7381 11425
3806A1425j008J052M2l653n291m881n775j220Q598M233J490q306L463l081M836
$$ 11425 10417 11469 11511 7858 2567 -2314 -8089 -9309 -711 3522 5012 -3294 169 -2912 1924
3791A924L851k304m204m838J136L621l585K15o390m244K978K375L730M103l109
$$ 1924 5775 3471 -733 -5571 -4435 -814 -4399 -4184 -10574 -14818 -11840 -9465 -5735 -1632 -4741
3776d741m879l57l670J537J250K48L777O183K505L253J818j369P23k537j27J64
$$ -4741 -9620 -9977 -13647 -12110 -10860 -10612 -6835 -652 1853 5106 6924 5555 6278 3741 3614 3778
3760C778q10n3O46r844l394M198p46K909Q871n43K01R19n972k433L62P86L15J978
$$ 3778 2968 2915 3561 -6283 -9677 -5479 -6225 -3316 5555 5012 5213 6132 160 -2273 -1911 -1125 -810 1168
3742A168L994O674j150j4399m786o83n391p37N014R212N223K854m131p290K096
$$ 1168 5162 11836 10686 -3713 -8499 -9182 -14573 -15310 -10296 -1084 4139 6993 2862 -4428 -2332
3727b332R183r48q276N09K645M553k800l486k373k814k264o025M050J3662L436
$$ -2332 6851 5903 -2373 -1864 781 5334 2534 -952 -3325 -6139 -8403 -14428 -10378 3284 6720
3712F720k433k294o907N803L751q97K177j993q34j749n98N14p893l391K961J311
$$ 6720 4287 1993 -4914 889 4640 3743 5920 3927 3093 1344 746 1260 -6633 -10024 -7063 -5752
3696e752j0087J513J2657M659q558r08N46N251J043K039m024r989P133l607l009
$$ -5752 -15839 -14326 -1669 2990 -5568 -6476 -5930 -679 364 2403 -1621 -11610 -4477 -8084 -11093
3681a1093J997N945M386k364J0737K322m82K22K995k134m088K53j822r62Q353
$$ -11093 -9096 -3151 1235 -1129 9608 11930 11448 11670 14665 12531 8443 8696 6874 5912 14265
3666A4265j782j866n112J684K648m328J284m001j990J545N402O090n370J854M462
$$ 14265 12483 10617 5505 7189 9837 5509 6793 2792 802 2347 7749 13839 8469 10323 14785
3651A4785j790q726n33q146r163P475N277P164n884n278J093J042J96J395J142
$$ 14785 12995 4269 3736 -4410 -13573 -6098 -821 6343 459 -4819 -3726 -2684 -2488 -1093 49
3636D9q256L293J567j601k977j049J664N23n13j765o62J505O692N110N632N331
$$ 49 -8207 -4914 -3347 -4948 -7925 -8974 -7310 -6787 -7300 -9065 -9727 -8222 -1530 3580 9212 14543
3620A4543J235j528j887O61m479j991k260q91M297L90k441l11K025m587n433P463
$$ 14543 15778 14250 12363 13024 8545 6554 4294 3403 7700 8090 5649 5338 7363 2776 -2657 4806
3604D806M079m102L055J213j315j0223k617p76O008j758k634Q43m737o667M924
$$ 4806 8885 4783 7838 9051 7736 -2487 -5104 -5880 128 -1630 -4264 -3421 -8158 -14825 -9901
3589i901J2371Q385l254O19K842j0459j182N848O532L673m713k303l687k96j978
$$ -9901 2470 10855 7601 8220 11062 603 -579 5269 11801 15474 10761 8458 4771 4475 2497
3574B497N52L049J263k046J25M299l135k373L028Q4j553J921P162M20l8N09P82
$$ 2497 3049 6098 7361 5315 5440 9739 6604 4231 7259 7343 5790 7711 14873 15293 15255 15764 16546
3557A6546q751p233l369J547L029K170N104o059M087L435l307J91j094q353J981
$$ 16546 7795 562 -2807 -1260 1769 3939 9043 2984 7071 10506 7199 7390 6296 -2057 -76
3542g6j581L316L401n75l914M020q36n179M04K401o393k35P262J246k081j850
$$ -76 -1657 1659 5060 4485 571 4591 3755 -1424 -1020 1381 -5012 -5247 2015 3261 1180 -670
3526f70j440k496K937j420m975k924J2N448K515k751J521K006L52M45m671j478
$$ -670 -2110 -4606 -1669 -3089 -8064 -10988 -10976 -5528 -3013 -5764 -4243 -2237 -1885 -1440 -6111 -7589
3510g589P122m07l651n828K875N571J565o343l748k062l684k406j470K500L673
$$ -7589 -467 -874 -4525 -10353 -7478 -1907 -342 -6685 -10433 -12495 -16179 -18585 -20055 -17555 -13882
3495a3882L8q40K276N092Q68k654r70K321P454M290L792j04L152J47p294o514
$$ -13882 -13844 -14684 -12408 -7316 -6448 -9102 -10072 -7751 -297 3993 7785 7681 10833 10980 3686 -2828
3479b828l780p815Q89K9k069K836R904Q681L420O963j431n56j922p347m130k286
$$ -2828 -6608 -14423 -13534 -13505 -15574 -12738 -2834 5847 9267 16230 14799 14243 12321 4974 844 -1442
$$ [...]
##END NTUPLES=NMR SPECTRUM
##END=
