##TITLE=Analysis number 326621
Compound Code cc 59646
Book Reference 521/17
Project Code adrs
Chemist Name evam
##JCAMPDX= 6.0         $$ Bruker NMR JCAMP-DX V2.0
##DATA TYPE= NMR SPECTRUM
##DATA CLASS= NTUPLES
##ORIGIN= Bruker BioSpin GmbH
##OWNER= nmr
$$ XWIN-NMR		Version 3.5
$$ Thu Feb 15 12:27:09 2007 GMT Standard Time (UT+0h)  MAYBRIDGE\nmr@NMR_250MHZ
##.OBSERVE FREQUENCY= 250.131544655141
##.OBSERVE NUCLEUS= ^1H
##.ACQUISITION MODE= SIMULTANEOUS (DQD)
##.ACQUISITION SCHEME= undefined
##.AVERAGES= 16
##.DIGITISER RES= 18
##SPECTROMETER/DATA SYSTEM= dpx250
##.PULSE SEQUENCE= zg30
##.SOLVENT NAME= CDCl3
##.SHIFT REFERENCE= (INTERNAL, CDCl3, 0, 16.522)
##AUDIT TRAIL= $$ (NUMBER, WHEN, WHO, WHERE, WHAT)
$$ ##TITLE= Audit trail, XWIN-NMR		Version 3.5
$$ ##JCAMPDX= 5.01
$$ ##ORIGIN= Bruker BioSpin GmbH
$$ ##OWNER= nmr
$$ C:\u/data/dgb/nmr/ADRS/990/pdata/1/auditp.txt
$$ ##AUDIT TRAIL=  $$ (NUMBER, WHEN, WHO, WHERE, WHAT)
(   1,<2007-02-15 12:26:49.85 +000>,<MAYBRIDGE\nmr>,<NMR_250MHZ>,
      <created by zg, POWCHK disabled, PULCHK disabled
       configuration hash MD5:
       49 4B E0 1D 92 C2 6B 37 9F E6 65 BC 52 41 86 1D
       data hash MD5: 64K
       5C 20 6E 0F 87 C8 9D 11 2A AC 64 59 BD 00 CA 66>)
(   2,<2007-02-15 12:27:01.96 +000>,<MAYBRIDGE\nmr>,<NMR_250MHZ>,
      <Start of raw data processing
       ef LB = 0.3 FT_mod = 6 PKNL = 1 SI = 32K 
       data hash MD5: 32K
       D8 D8 3B 66 08 50 B1 43 4C 53 FE 6B A1 49 28 9A>)
(   3,<2007-02-15 12:27:03.60 +000>,<MAYBRIDGE\nmr>,<NMR_250MHZ>,
      <apk 
       data hash MD5: 32K
       FD 75 49 60 7B 2C 54 C1 CD 0B 7C 9F 2E 61 9C F8>)
(   4,<2007-02-15 12:27:04.35 +000>,<MAYBRIDGE\nmr>,<NMR_250MHZ>,
      <abs ABSG = 5 
       data hash MD5: 32K
       FA AF 7D 70 41 38 2D D4 04 39 2E F2 86 DA 54 A4>)
$$ ##END=
$$ 
$$ hash MD5
$$ EE DE 67 2E 4C 0C 10 2E 12 7B 30 A7 7D FC 04 8C
##$RELAX= 
##$RELAX= 
##$RELAX= 
##$RELAX= 
##$RELAX= 
##$RELAX= 
##$RELAX= 
$$ Bruker specific parameters
$$ --------------------------
##$DU= <C:\u>
##$EXPNO= 990
##$NAME= <ADRS>
##$PROCNO= 1
##$TYPE= <nmr>
##$USER= <dgb>
##$AMP= (0..31)
100 100 100 100 100 100 100 100 100 100 100 100 100 100 100 100 100 100 
100 100 100 100 100 100 100 100 100 100 100 100 100 100 
##$AQSEQ= 0
##$AQ_mod= 3
##$AUNM= <au_zg>
##$AUTOPOS= <36 >
##$BF1= 250.13
##$BF2= 250.13
##$BF3= 250.13
##$BF4= 250.13
##$BF5= 500.13
##$BF6= 500.13
##$BF7= 500.13
##$BF8= 500.13
##$BYTORDA= 1
##$CFDGTYP= 0
##$CFRGTYP= 5
##$CHEMSTR= <none>
##$CNST= (0..31)
1 1 145 1 1 1 1 1 1 1 1 1 1 1 1 1 1 1 1 1 1 1 1 1 1 1 1 1 1 1 1 1 
##$CPDPRG= <>
##$CPDPRG1= <>
##$CPDPRG2= <>
##$CPDPRG3= <>
##$CPDPRG4= <mlev>
##$CPDPRG5= <mlev>
##$CPDPRG6= <mlev>
##$CPDPRG7= <mlev>
##$CPDPRG8= <mlev>
##$CPDPRGB= <>
##$CPDPRGT= <>
##$D= (0..31)
0 1 0 0 0 0 0 0 0 0.06 0 0 0 0 0 0 0.0002 0 0 0 0 0 0 0 0 0 0 0 0 0 0 
0 
##$DATE= 1171542409
##$DBL= (0..7)
120 120 120 120 120 120 120 120 
##$DBP= (0..7)
150 150 150 150 150 150 150 150 
##$DBP07= 0
##$DBPNAM0= <>
##$DBPNAM1= <>
$$ [...]
##$SUBNAM6= <"">
##$SUBNAM7= <"">
##$SUBNAM8= <"">
##$SUBNAM9= <"">
##$SW= 20.6930455092707
##$SWIBOX= (0..15)
0 0 3 0 0 0 0 0 0 0 0 0 0 0 0 0 
##$SW_h= 5175.983436853
##$TD= 65536
##$TD0= 1
##$TE= 295.16
##$TE2= 300
##$TE3= 300
##$TEG= 300
##$TL= (0..7)
0 120 120 120 120 120 120 120 
##$TP= (0..7)
150 150 150 150 150 150 150 150 
##$TP07= 0
##$TPNAME0= <>
##$TPNAME1= <>
##$TPNAME2= <>
##$TPNAME3= <>
##$TPNAME4= <>
##$TPNAME5= <>
##$TPNAME6= <>
##$TPNAME7= <>
##$TPOAL= (0..7)
0.5 0.5 0.5 0.5 0.5 0.5 0.5 0.5 
##$TPOFFS= (0..7)
0 0 0 0 0 0 0 0 
##$TUNHIN= 0
##$TUNHOUT= 0
##$TUNXOUT= 0
##$USERA1= <user>
##$USERA2= <user>
##$USERA3= <user>
##$USERA4= <user>
##$USERA5= <user>
##$V9= 5
##$VALIST= <valist>
##$VCLIST= <CCCCCCCCCCCCCCC>
##$VD= 0
##$VDLIST= <DDDDDDDDDDDDDDD>
##$VPLIST= <PPPPPPPPPPPPPPP>
##$VTLIST= <TTTTTTTTTTTTTTT>
##$WBST= 1024
##$WBSW= 4
##$XGAIN= (0..3)
0 0 0 0 
##$XL= 0
##$YL= 0
##$YMAX_a= 545175
##$YMIN_a= -544492
##$ZGOPTNS= <>
##$ZL1= 120
##$ZL2= 120
##$ZL3= 120
##$ZL4= 120
##$ABSF1= 16.522
##$ABSF2= -4.171173
##$ABSG= 5
##$ABSL= 3
##$ALPHA= 0
##$AQORDER= 0
##$ASSFAC= 0
##$ASSFACI= 0
##$ASSFACX= 0
##$ASSWID= 0
##$AUNMP= <proc_1d>
##$AZFE= 0.1
##$AZFW= 0.1
##$BCFW= 0
##$BC_mod= 0
##$BYTORDP= 0
##$COROFFS= 0
##$CY= 12.5
##$DATMOD= 1
##$DC= 0
##$DFILT= <>
##$DTYPP= 0
##$F1P= 14.0000005364418
##$F2P= -0.99999901652339
##$FCOR= 0.5
##$FTSIZE= 32768
##$FT_mod= 6
##$GAMMA= 0
##$GB= 0
##$INTBC= 1
##$INTSCL= 1
##$ISEN= 128
##$LB= 0.3
##$LEV0= 0
##$LPBIN= 0
##$MAXI= 10000
##$MC2= 0
##$MEAN= 0
##$ME_mod= 0
##$MI= 0
##$NCOEF= 0
##$NC_proc= -2
##$NLEV= 6
##$NOISF1= 0
##$NOISF2= 0
##$NSP= 0
##$NTH_PI= 0
##$NZP= 0
##$OFFSET= 16.522
##$PC= 1
##$PHC0= 226.7362
##$PHC1= 6.07026
##$PH_mod= 1
##$PKNL= yes
##$PPARMOD= 0
##$PSCAL= 4
##$PSIGN= 0
##$REVERSE= no
##$SF= 250.13
##$SI= 32768
##$SIGF1= 0
##$SIGF2= 0
##$SINO= 400
##$SIOLD= 32768
##$SREGLST= <1H.CDCl3>
##$SSB= 0
##$STSI= 32768
##$STSR= 0
##$SW_p= 5175.98343685301
##$SYMM= 0
##$S_DEV= 0
##$TDeff= 65536
##$TDoff= 0
##$TI= <Analysis number 999999
Compound Code 99
Book Reference 9
Project Code 9>
##$TILT= no
##$TM1= 0
##$TM2= 0
##$TOPLEV= 0
##$USERP1= <user>
##$USERP2= <user>
##$USERP3= <user>
##$USERP4= <user>
##$USERP5= <user>
##$WDW= 1
##$XDIM= 32768
##$YMAX_p= 386295340
##$YMIN_p= -26303
$$ End of Bruker specific parameters
$$ ---------------------------------
##NTUPLES= NMR SPECTRUM
##VAR_NAME=  FREQUENCY,     SPECTRUM/REAL,   SPECTRUM/IMAG
##SYMBOL=    X,             R,               I
##VAR_TYPE=  INDEPENDENT,   DEPENDENT,       DEPENDENT
##VAR_FORM=  AFFN,          ASDF,            ASDF
##VAR_DIM=   32768,         32768,           32768
##UNITS=     HZ,            ARBITRARY UNITS, ARBITRARY UNITS
##FACTOR=    0.157963299565203, 1,           1
##FIRST=     4132.6476996994, 0,             0
##LAST=      -1043.33573715361, 0,           0
##MIN=       -1043.33573715361, -26303,      0
##MAX=       4132.6476996994, 386295340,     0
$$ Real data points
##PAGE= N=1
##DATA TABLE= (X++(R..R)), XYDATA
$$ [...]
##PAGE= N=2
##DATA TABLE= (X++(I..I)), XYDATA
18139 5393982 5465380 5537025 5613856 5698621 5791613 5889414 5990029 6094812 6205232 6325686
18129 6325686 6448464 6587786 6748222 6914860 7078121 7255749 7454473 7670554 7909763
18120 7909763 8167968 8464081 8817795 9243342 9769900 10411491 11236210 12323852 13714188
18111 13714188 15198222 15596188 11314172 2168664 -3025778 -3382421 -2076820 -714003
18103 -714003 400127 1284280 1994084 2592040 3098350 3545974 3946542 4309934 4645159
18094 4645159 4945349 5221718 5475117 5715243 5939572 6167715 6426354 6709759 7004947
18085 7004947 7314335 7639571 7963594 8301006 8667600 9078622 9542942 10054188 10611496
18076 10611496 11236762 11940915 12740468 13666307 14731664 15933667 17220025 18450879 19451606
18067 19451606 20026683 19846304 18416736 15243538 10861064 6457949 2056731 -1815278
18059 -1815278 -4134903 -5118258 -5204225 -4637393 -3960387 -3868093 -4333961 -4557690 -4377904 -4123008
18049 -4123008 -3817247 -3273820 -2514805 -1680877 -885853 -155779 529649 1191483 1829999
18040 1829999 2447092 3050189 3625177 4142390 4599900 5069880 5620932 6261190 6979098
18031 6979098 7789641 8692742 9698947 10818461 12080393 13503572 15085509 16777296
18023 16777296 18527253 20353986 22150453 23133590 22138118 18937745 13831110 6849618
18015 6849618 -1025879 -7698851 -11766898 -13707102 -14264228 -13699174 -12789044 -12748232 -13793865
18006 -13793865 -15148499 -16411029 -17308730 -17575501 -17041841 -15940462 -14655825 -13425233
17998 -13425233 -12324571 -11358070 -10489308 -9681432 -8944200 -8273196 -7655621 -7099678 -6593473
17989 -6593473 -6135260 -5719256 -5334978 -4973029 -4623889 -4272034 -3903465 -3516387 -3081175
17980 -3081175 -2617577 -2115561 -1569625 -959465 -283522 462005 1252130 1941412 2204454
17971 2204454 1659827 87437 -2469720 -5135176 -6935034 -7693404 -7552498 -6855092 -5954420
17962 -5954420 -5094350 -4462958 -4275271 -4671077 -5710855 -7136837 -8288433 -8876321 -8927685
17953 -8927685 -8607916 -8134873 -7664094 -7252716 -6890625 -6551564 -6236502 -5957697 -5700109
17944 -5700109 -5461264 -5250360 -5065205 -4895440 -4742355 -4607824 -4472328 -4338772 -4220684
17935 -4220684 -4109834 -3998850 -3896861 -3810118 -3728737 -3645277 -3574974 -3516248 -3453926 -3387017 -3322735
17924 -3322735 -3248956 -3174804 -3108996 -3039514 -2978164 -2909511 -2848876 -2790946 -2735472 -2684978 -2636726
17913 -2636726 -2587721 -2535840 -2484104 -2429267 -2385689 -2337814 -2295916 -2257372 -2219043 -2183559 -2145657
17902 -2145657 -2099588 -2056425 -2014242 -1979501 -1946117 -1910520 -1868007 -1832901 -1799532 -1763971 -1736804
17891 -1736804 -1709418 -1681300 -1654043 -1626852 -1598236 -1571459 -1551661 -1527194 -1503499 -1480808 -1454403
17880 -1454403 -1423393 -1392200 -1365449 -1337888 -1315699 -1295384 -1273298 -1253054 -1230915 -1205537 -1184489
17869 -1184489 -1167883 -1138407 -1103480 -1079423 -1064581 -1040613 -1014063 -998478 -975742 -952087 -926342
17858 -926342 -915935 -906940 -891317 -877560 -858135 -836463 -829904 -818713 -800344 -776703 -758664 -743463
17846 -743463 -727215 -709995 -684690 -664491 -650427 -639229 -625812 -611096 -590649 -571067 -557294
17835 -557294 -543944 -522231 -515611 -509312 -504611 -489697 -474864 -457030 -443839 -426426 -405422 -384368
17823 -384368 -359005 -349073 -340606 -328558 -312248 -298336 -289127 -281530 -265065 -250261 -238259 -219274
17811 -219274 -199289 -187180 -185048 -173931 -163266 -143330 -124402 -105238 -94081 -83600 -71706 -64330
17799 -64330 -53241 -42900 -31133 -13842 -2011 14580 28909 40472 52967 62694 72258 81194
17787 81194 89042 99617 107768 119345 132842 144862 162174 179934 193248 201442 216362 231597
17775 231597 242604 256288 261544 276642 290080 299853 305744 313440 320440 331231 345354 358465
17763 358465 370917 381626 395924 404720 418768 436754 448221 456399 464151 465962 480013 501880
17751 501880 521663 532307 550350 565394 578328 587678 593597 593918 590249 602181 614676 626296
17739 626296 640722 649687 664732 678451 691002 703654 718622 725485 731703 741306 752165 771581
17727 771581 780456 797645 816935 832566 847301 860246 867544 878043 890036 914447 932740 942550
17715 942550 958364 969343 978225 990742 1004529 1016021 1024104 1034792 1044719 1054612 1069561 1080355
17703 1080355 1092239 1109426 1126276 1140768 1152003 1167865 1184919 1196996 1212063 1227127 1240868
17692 1240868 1256060 1272935 1285656 1296040 1310238 1328551 1335652 1348386 1362688 1371535 1386830 1407799
17680 1407799 1429634 1448230 1465269 1485180 1504122 1518679 1530101 1549737 1578598 1592072 1611350
17669 1611350 1638294 1662229 1674633 1690674 1713579 1734564 1753951 1774059 1791386 1809160 1832994
17658 1832994 1855791 1870865 1890943 1913934 1936829 1962587 1988387 2011163 2031990 2052901 2079879
17647 2079879 2096325 2114556 2143024 2170380 2195230 2209822 2236063 2262162 2293630 2327705 2362540
17636 2362540 2385794 2406163 2430158 2460313 2493246 2531274 2573799 2602011 2635346 2672160 2705638
17625 2705638 2742847 2785187 2828388 2866917 2907503 2942345 2976857 3021894 3074471 3124236 3171117
17614 3171117 3225485 3269161 3313887 3367860 3432915 3492041 3546945 3611155 3680513 3751258 3823054
17603 3823054 3898070 3973152 4052781 4123628 4203237 4287804 4380693 4469737 4550235 4616631 4674307
17592 4674307 4735485 4815120 4929854 5067986 5224559 5391747 5553420 5712288 5881278 6074374
17582 6074374 6320067 6623869 6985908 7406168 7899525 8471383 9111358 9819776 10508284
17573 10508284 10887154 10505272 9090729 7056191 5472353 4917323 5177943 5507300 5036474
17564 5036474 3219303 410050 -2053845 -3254991 -3257471 -2607077 -1783307 -987078 -279108
17555 -279108 322852 844117 1310501 1738618 2135682 2506866 2853533 3166995 3429011 3658282
17545 3658282 3868119 4077854 4316428 4591745 4900565 5216746 5517623 5794626 6074555
17536 6074555 6425980 6901223 7503118 8213552 9024840 9942767 10943861 11930530 12617672
17527 12617672 12632176 11831511 10684983 9823716 9281033 8740429 8101930 7393412 6155360
17518 6155360 3808728 416125 -3149232 -5999420 -7437489 -7444693 -6511721 -5205455 -3858219
17509 -3858219 -2600777 -1464761 -444411 498134 1437315 2428551 3466878 4550366 5675774
17500 5675774 6840708 7992846 8987840 9556508 9429160 8411034 6582977 4358563 2302184
17491 2302184 787246 -136001 -675062 -1247576 -2187335 -3533521 -4987590 -6038891 -6359820
17482 -6359820 -5947732 -5036113 -4027194 -3429105 -3723329 -5013564 -6642074 -7633382 -7663015
17473 -7663015 -7021252 -6361631 -6359696 -7333468 -8862678 -9966035 -10183013 -9680916 -8864956
17464 -8864956 -8005504 -7198161 -6468609 -5802208 -5184383 -4598769 -4030260 -3474118 -2913647
17455 -2913647 -2363792 -1802058 -1218095 -614259 -8047 566850 1061312 1444553 1720570
17446 1720570 1926237 2119613 2297779 2322331 1964812 996890 -635962 -2765303 -4978749
17437 -4978749 -6835010 -8079085 -8741088 -9084171 -9411345 -9885898 -10450198 -10947260 -11271802
17428 -11271802 -11402909 -11379704 -11231273 -10970813 -10616864 -10202429 -9763174 -9322597 -8905440
17419 -8905440 -8520332 -8159093 -7842311 -7562078 -7309143 -7084115 -6888787 -6704669 -6525939
17410 -6525939 -6357300 -6205258 -6056975 -5915230 -5780020 -5660991 -5548557 -5436900 -5326672
17401 -5326672 -5221211 -5121185 -5025488 -4938683 -4851367 -4760963 -4683205 -4609414 -4539968 -4478291 -4411064
17390 -4411064 -4344123 -4277327 -4220572 -4168463 -4114186 -4058770 -4008186 -3953546 -3900204 -3852201 -3803277
17379 -3803277 -3758776 -3721112 -3679986 -3627981 -3576572 -3531908 -3490081 -3448858 -3412679 -3376988 -3346782
17368 -3346782 -3316225 -3283817 -3249699 -3216976 -3183750 -3156808 -3124011 -3087110 -3058583 -3031089 -3007184
17357 -3007184 -2991071 -2964623 -2928287 -2895683 -2866192 -2846600 -2827601 -2802521 -2768818 -2743052 -2728850
17346 -2728850 -2711350 -2692377 -2667700 -2641521 -2613858 -2592017 -2576849 -2559008 -2539401 -2516375 -2502697
17335 -2502697 -2485764 -2467776 -2451013 -2429134 -2410436 -2395643 -2382146 -2367097 -2342931 -2322318 -2306675
17324 -2306675 -2285194 -2262528 -2244610 -2233996 -2231077 -2216782 -2201442 -2181514 -2164255 -2159187 -2150564 -2140140
17312 -2140140 -2131195 -2112997 -2099860 -2089056 -2080208 -2072802 -2053969 -2042780 -2039979 -2031859 -2022247 -2002503
17300 -2002503 -1979781 -1963449 -1950149 -1935227 -1925582 -1918227 -1904554 -1890698 -1876445 -1866581 -1854325 -1848885
17288 -1848885 -1837332 -1820782 -1805893 -1795372 -1786684 -1778563 -1766537 -1761338 -1746971 -1737235 -1727525 -1712232
17276 -1712232 -1711049 -1710432 -1703271 -1695505 -1682699 -1670662 -1657632 -1652641 -1649900 -1634575 -1623469 -1617755 -1609144
17263 -1609144 -1597658 -1589308 -1586086 -1578705 -1567453 -1557713 -1550921 -1536724 -1526172 -1522241 -1517674 -1507818 -1498510
17250 -1498510 -1493065 -1488474 -1481153 -1466316 -1462875 -1459851 -1458290 -1444289 -1436131 -1432461 -1430782 -1426705 -1417860
17237 -1417860 -1400908 -1389270 -1383253 -1382002 -1381590 -1369528 -1357865 -1352905 -1351324 -1345706 -1341017 -1339487 -1332841
17224 -1332841 -1323094 -1320236 -1313767 -1304610 -1297740 -1297919 -1287277 -1277425 -1265015 -1253613 -1252582 -1251810 -1242122 -1237595
17210 -1237595 -1228959 -1224882 -1225262 -1214081 -1204044 -1200885 -1196491 -1197200 -1192444 -1185323 -1180568 -1176651 -1173216 -1173124
17196 -1173124 -1171858 -1165496 -1158319 -1157960 -1151665 -1145828 -1140956 -1131143 -1116052 -1107564 -1102026 -1096305 -1094026 -1090428
17182 -1090428 -1087479 -1088192 -1092095 -1088971 -1082152 -1076104 -1074502 -1066691 -1060865 -1058369 -1048984 -1046310 -1040999 -1034461
17168 -1034461 -1033145 -1032157 -1030747 -1029867 -1028572 -1025281 -1024481 -1019052 -1014370 -1010336 -1005239 -994081 -987258 -984922
17154 -984922 -986076 -982932 -977133 -962750 -961217 -956466 -949165 -944777 -944327 -941665 -935295 -927776 -924314 -914174
17140 -914174 -910488 -909314 -902922 -902048 -905987 -898737 -891920 -885379 -877299 -878295 -876999 -877761 -881930 -881025 -877640
17125 -877640 -874942 -863150 -857378 -862375 -859111 -853387 -851523 -851456 -848806 -836358 -828744 -826239 -826371 -823945
17111 -823945 -822357 -813500 -803466 -805609 -806679 -797377 -793935 -799959 -799410 -794491 -793435 -792817 -792548 -787067 -777349
17096 -777349 -771085 -770596 -768219 -764474 -756971 -758070 -752937 -743762 -740884 -742004 -748614 -742677 -731062 -724499
17082 -724499 -723470 -719548 -722187 -710634 -704879 -706732 -702648 -699746 -697923 -698123 -690684 -690063 -687075 -684190
17068 -684190 -675438 -665807 -658042 -655800 -655619 -653589 -648577 -654770 -659148 -664059 -671218 -668586 -661684 -660053
17054 -660053 -655797 -662371 -671443 -668556 -670571 -666733 -663297 -661560 -657746 -654668 -649720 -645040 -641963 -638632
17040 -638632 -630143 -626089 -627172 -617467 -618214 -616314 -615447 -612904 -603588 -598231 -590438 -583336 -583508 -584365 -580678
17025 -580678 -578466 -573159 -566641 -567993 -559736 -543915 -533186 -528865 -521494 -521362 -529015 -531350 -536950 -543009
17011 -543009 -547385 -547301 -552193 -550076 -556741 -575659 -582013 -582362 -582025 -577795 -569413 -558425 -550136 -541991 -534882
16996 -534882 -526567 -525201 -525114 -530462 -536231 -535870 -535595 -538868 -545708 -549889 -553981 -562011 -563535 -564443 -569271
16981 -569271 -567967 -572852 -572050 -563142 -557548 -548901 -538662 -527791 -528591 -526289 -518195 -516331 -510716 -507634
16967 -507634 -509782 -514144 -522520 -520142 -520770 -517310 -514688 -514660 -518652 -521462 -518855 -511657 -505276 -501662 -497196
16952 -497196 -490585 -486528 -474843 -465191 -467221 -453828 -450656 -452390 -446574 -444268 -447360 -449171 -452107 -454554
16938 -454554 -459210 -478632 -477833 -477446 -492752 -503789 -503021 -501041 -499085 -497904 -495880 -496949 -492071 -480039
16924 -480039 -472381 -474045 -472922 -467093 -467409 -471566 -473189 -467080 -456921 -448171 -437340 -437211 -435475 -435138
16910 -435138 -435680 -434852 -431600 -422080 -420433 -416650 -419040 -419443 -414723 -407448 -403079 -405148 -406480 -401390 -405106
16895 -405106 -413639 -415319 -409991 -400682 -400978 -405441 -402878 -398283 -395488 -388191 -382011 -375328 -370196 -370539 -369283
16880 -369283 -364042 -361924 -365822 -370640 -369914 -372694 -371210 -369442 -365975 -362299 -363512 -364143 -362003 -361568 -362655
16865 -362655 -364109 -361843 -361842 -359207 -353399 -353381 -355723 -356674 -352416 -338982 -336853 -339362 -340614 -334244 -322759
16850 -322759 -318333 -315011 -322066 -332645 -332908 -333665 -330586 -326601 -328646 -324044 -324268 -328123 -324176 -313057
16836 -313057 -311960 -308221 -301691 -307931 -311698 -301357 -300645 -304470 -304251 -309743 -312475 -308057 -306069 -306652 -298313
16821 -298313 -305346 -306224 -304769 -301297 -300093 -294710 -281349 -277950 -283687 -281195 -273375 -278669 -277986 -281892
16807 -281892 -287793 -297600 -295162 -288526 -275426 -269323 -268783 -269335 -265111 -261025 -263254 -269936 -268699 -261388
16793 -261388 -267800 -271612 -273727 -264729 -253367 -255549 -258861 -257994 -251281 -243988 -243128 -239148 -233943 -236435
16779 -236435 -240620 -245928 -244705 -232884 -233967 -243410 -235807 -233659 -232968 -229599 -233309 -234961 -228818 -222976
16765 -222976 -225250 -217476 -214668 -218474 -220844 -218205 -214430 -214471 -220474 -219612 -221345 -221568 -217812 -212435 -212476 -218634
16749 -218634 -216606 -211893 -204060 -204829 -204301 -204328 -204279 -199971 -199225 -200354 -194087 -195546 -206048 -203017 -194466 -193294
16733 -193294 -192900 -195889 -196536 -191820 -192264 -195974 -195978 -195073 -192508 -192038 -190489 -191538 -188282 -183665 -180457 -179901
16717 -179901 -179764 -177808 -179381 -184837 -182427 -177319 -176518 -177526 -174994 -169350 -171887 -172838 -170482 -165905 -162647
16702 -162647 -162680 -162510 -163846 -168285 -167097 -155536 -157880 -162021 -160815 -164869 -165232 -156287 -152821 -150557 -151702
16687 -151702 -153934 -154096 -152026 -147408 -147149 -147009 -147236 -151341 -147187 -140389 -138975 -138055 -132689 -132705 -125823 -120586
16671 -120586 -120804 -127977 -132517 -135772 -133079 -134741 -139682 -136608 -132313 -134191 -131511 -128314 -125188 -126532
16657 -126532 -128759 -132000 -134041 -130945 -126941 -124345 -122144 -117553 -117325 -122563 -120525 -113182 -107444 -106187
16643 -106187 -103059 -96085 -96657 -98860 -102046 -111541 -115831 -116356 -113015 -110426 -109799 -109697 -105767 -102123 -106173
16628 -106173 -107531 -102294 -103509 -101650 -96547 -91086 -95977 -100220 -97910 -93935 -91342 -92821 -94020 -91035
16614 -91035 -86612 -78428 -80007 -87062 -82297 -73560 -79409 -83465 -84660 -80583 -83264 -80604 -75377 -71099
16600 -71099 -64690 -61285 -63462 -62431 -64845 -70025 -69226 -69487 -72730 -74384 -70330 -73574 -74325 -72154 -72875
16585 -72875 -75187 -77205 -74418 -75190 -71782 -69644 -70320 -67699 -66789 -67749 -63923 -55129 -47246 -40792 -38796
16570 -38796 -46439 -61472 -59633 -47666 -45812 -60423 -63605 -53888 -51545 -50622 -48158 -40755 -37733 -50267
16556 -50267 -53839 -48085 -40203 -39562 -37530 -36281 -36718 -39694 -42730 -38916 -39925 -38643 -35557 -37529 -38730
16541 -38730 -33234 -30112 -31256 -25311 -24709 -30830 -28453 -25876 -24628 -26047 -26062 -28903 -37692 -37833 -29174
16526 -29174 -31883 -31066 -24332 -21081 -20399 -15919 -15825 -13492 -5218 -4592 -8332 -8245 -6769 -7911 -7756 -4091
16510 -4091 -5260 -567 -3882 -17262 -22480 -22677 -15742 -9107 -13506 -14366 -4890 -3796 -9144 -10065 -6954
16495 -6954 1027 -124 -51 -2204 -86 898 5822 11224 10373 2643 -4111 913 1393 2352 9524 5855
16479 5855 5114 3079 152 11035 13811 16423 13082 3283 1318 4279 7850 11689 10479 11909 16390
16464 16390 8775 10375 16417 20019 23081 29779 31938 24922 21892 22000 24437 23007 25538 33690 39418
16449 39418 37311 33476 25236 20715 27991 26780 23517 25639 28844 32084 34728 38105 37935 33096 32089
16434 32089 38829 35062 31099 31097 32966 29002 29866 38507 45667 47624 47423 46246 45252 46327 49752 52337
16418 52337 57180 58598 59213 58940 58471 55620 50921 50903 50665 50174 49043 49490 51892 56379 52526 48837
16402 48837 58870 64356 66343 69927 67977 58793 61884 70781 67707 57221 56609 53122 50383 51457
16388 51457 54159 61604 72884 76964 64371 61316 67056 66504 62735 56313 48706 49080 52717 58413
16374 58413 63346 67545 76081 81584 81688 78770 80249 79371 74632 80722 80096 84351 86287 82477 81736
16359 81736 75598 74165 80333 83841 88379 96724 100717 94682 86210 85035 80363 79346 81973 81719 82884
16344 82884 82224 84176 89509 88705 86600 90805 86498 84017 79757 80489 89346 91058 92691 99604 99771
16329 99771 96227 93910 95707 102432 104332 102698 106326 109078 102536 97405 101020 101353 104825 104097 112280
16314 112280 111766 112940 116207 114737 109376 104710 106521 107527 109343 113570 118462 118984 115173 116329 113894
16299 113894 109695 110355 113979 119136 114657 118604 121982 118540 112254 101428 95753 100600 114466 122085
16285 122085 122795 126698 129132 127571 116735 117948 128695 133123 131266 124201 126583 130207 123615 119446
16271 119446 115615 113458 119223 124816 130390 128106 125448 127284 131722 129477 125353 127157 129832 136400
16257 136400 140436 137633 134363 134404 134917 133514 129245 128607 132776 137032 136300 141038 139741 134234 133044
16242 133044 134154 139426 140374 140635 140734 139490 146499 147730 143663 148357 152236 154600 149724 149855 147858
16227 147858 145581 147080 148228 146678 144313 150552 149600 153131 152794 149444 156919 160737 155136 154701 156767
16212 156767 156061 152136 152422 147397 150593 159541 167875 176907 177567 169973 160906 166181 161554 154935 157789
16197 157789 166441 172337 166300 164185 165620 163954 158961 165770 170015 166642 168371 170783 172246 171162
16183 171162 170071 173359 171350 168877 170939 173676 170865 174652 177353 179910 174010 167682 168375 175252
16169 175252 179146 178170 177242 179891 184690 186092 185283 180543 177079 181991 187207 190564 193148 187799 182746
16154 182746 189470 191493 195174 187263 182468 181041 181171 188856 187816 184744 186004 186979 183737 179331 181532
16139 181532 187897 192960 193883 197715 201481 192255 186025 188007 191577 190997 189003 188585 192424 187822 187784
16124 187784 186063 188070 192033 199258 201407 201245 205935 207931 197877 188770 196142 197735 198128 197889 205024
16109 205024 210641 212903 209981 213776 216891 212938 209744 209904 209636 207345 199758 194820 196853 192870 200841
16094 200841 201928 207346 214174 214121 216392 212601 207545 209037 212338 214640 215730 210095 208941 212607 212764
16079 212764 214125 215358 218829 218562 218067 214175 217478 222750 229609 226641 223083 220025 219984 224042 222655
16064 222655 220504 221226 226720 228627 222164 215283 213974 215618 222486 225165 227523 227015 226250 230288 224469
16049 224469 225858 222980 227570 233618 234254 230966 233883 239252 237072 246981 251207 245603 242501 244850
16035 244850 240113 238351 239688 239348 241836 239759 244402 244603 244607 239545 237863 237082 239325 248597 253371 250335
16019 250335 245382 247931 253757 253298 249638 245156 236801 236484 239161 240750 242911 245209 247987 247439 242648
16004 242648 237042 243510 248116 245014 247057 246123 253175 253741 248810 249855 255338 253557 256446 259637 260446
15989 260446 260271 259716 256367 253084 254906 255363 256144 260880 258697 259253 263361 263718 257845 263392 268009 262356
15973 262356 257318 256714 262937 263161 263613 262596 264668 257075 255170 259141 261072 267959 273705 271459 263974
15958 263974 259959 258175 263423 266336 265981 262118 262313 266172 269998 269564 266209 268619 269365 268806 274227
15943 274227 275203 271266 271668 274579 273941 270692 269166 267418 271637 266435 268756 277317 280731 281678 276933
15928 276933 280220 283807 283525 276255 271392 272683 284025 284916 278726 273093 278415 281220 282413 280940
15914 280940 284001 287977 291258 284792 287338 290947 291099 291797 296215 297700 299062 300699 301671 298150 293722
15899 293722 293197 293320 283320 287198 295335 301062 301054 296987 290351 286860 291363 296100 303686 307926 311838
15884 311838 307560 307417 306431 297554 302054 304393 306512 302934 300370 298856 299880 296017 294959 304374 306732
15869 306732 299107 299489 299392 303495 307415 310769 311339 311123 317086 313958 306452 303666 304186 308360 306995 299202
15853 299202 302904 312170 312209 310986 309394 312887 310870 301149 303771 312623 317573 314998 315936 317413 313505
15838 313505 307762 303257 307413 314218 318982 316876 313292 311947 313428 314718 312570 315541 316784 321994
15824 321994 322510 325850 338111 338744 323292 321949 318465 319611 317175 317234 327511 329402 327911 338932
15810 338932 339655 330993 328160 325043 326270 329538 329110 330040 329993 325571 328315 334947 332825 337615 344433
15795 344433 339758 338060 336513 342589 335202 334509 335861 336238 337481 338143 334025 324786 321838 328616 333556
15780 333556 335258 332315 332858 333396 329846 325160 326300 332304 343331 349965 351785 350436 342630 340498
15766 340498 334735 336374 345698 345388 346101 344470 339975 338903 340353 340325 344944 348228 346511 342346 343472
15751 343472 342030 345877 352701 358912 361480 357733 359988 353242 340937 342524 346564 349915 356902 358250
15737 358250 351580 352423 356999 355893 357706 356431 357348 361118 362253 350213 348494 357931 362887 371504
15723 371504 372874 369641 367515 366008 360492 363948 368941 365709 363980 369610 367942 364598 364424 358288
15709 358288 357621 364854 366144 363918 357044 356761 360203 367056 365699 361223 367097 370064 367130 363302 364122
15694 364122 365300 365131 360898 358688 361167 366561 369688 377945 378589 378663 383894 387453 382111 379416 379986
15679 379986 379030 375577 375159 384329 387187 377798 375352 378026 383282 382481 382260 382009 383273 387226 385727
15664 385727 389136 390625 391552 386295 382250 385845 387927 390137 382227 373109 376261 381801 387059 386920 387192
15649 387192 384209 385567 387069 388729 391700 386695 392108 387216 388265 397440 397623 391217 393986 392722
15635 392722 389634 390411 389651 393224 395493 396833 392652 394113 393837 384240 382474 386354 385617 389822 389946
15620 389946 385768 391847 400621 400307 397769 397594 390861 394775 404785 409972 406512 404147 412379 412650 408929
15605 408929 399048 393494 393053 398573 402007 399233 398082 396718 400076 408268 412700 411206 415331 415305 409110
15590 409110 404396 400318 398236 402931 411904 413149 418075 416162 411175 413117 411722 398870 394974 394420
15576 394420 397829 400880 405998 403608 405504 412097 409151 403186 399420 405089 412571 412928 412970 413504 416486
15561 416486 414907 410065 411425 412978 421051 423061 417000 413927 412257 411838 414626 417821 419447 419529 418022
15546 418022 420271 428473 429980 431101 426711 422892 423573 417365 411899 410728 415870 424164 424865 427860 431803
15531 431803 430618 428302 437563 432709 418201 421833 431846 432917 429363 426974 426129 431568 437130 440233
15517 440233 432340 426481 426942 428212 425934 416388 416768 420285 427709 433727 434904 436511 439866 434977 432892
15502 432892 436979 426641 426432 438346 445831 440409 433571 434160 434972 433921 431294 439930 440444 443034 437966
15487 437966 444643 446997 448754 452406 452578 453832 454637 457430 447263 442106 438701 439285 437553 439262 436460
15472 436460 437786 437422 438074 444328 449744 452845 457251 453182 450976 445843 439573 446972 459435 456066
15458 456066 453782 454033 455004 463915 468448 465202 458576 457624 463161 455127 453186 450501 448035 450921 447920
15443 447920 451854 454883 456946 458942 456937 457023 455516 456713 456147 457279 456618 458369 457104 455890 451340
15428 451340 459367 459703 460525 456995 449266 452460 458373 461597 457332 457448 467552 471400 466749 463511 462520
15413 462520 458194 458254 459666 468317 470858 468361 463190 466790 465245 460992 460383 459153 465741 472161 472141
15398 472141 473623 475365 481866 480649 471890 466768 473331 474484 477755 476754 466426 467074 461928 465566
15384 465566 474363 473943 474061 477712 478208 470530 470835 485051 490621 491287 488527 489743 481264 475206 472945
15369 472945 475178 477430 472502 475629 476371 483543 486385 481732 480851 482502 479787 486238 487747 483903 483796
15354 483796 483502 481016 490422 499233 503581 497956 498022 497220 494454 495890 491822 488832 489582 492238 485899
15339 485899 482897 484485 488230 488755 484616 487459 499521 504153 504408 500888 503570 506491 501989 501695 502305
15324 502305 499145 490589 501474 501487 501188 503842 499888 500393 506436 513551 510593 507463 509300 510684 510192
15309 510192 509622 505680 504296 508602 507124 506307 502877 499747 501767 502303 506507 507173 510949 506739 503270
15294 503270 503574 504910 505017 507090 511078 510837 512292 512719 512104 510948 516683 520630 527813 526934 520183 514074
15278 514074 518582 519471 518232 517457 514743 514217 512349 506992 508119 515812 520472 520221 521307 523239 514129
15263 514129 508672 513351 514395 520873 525254 530369 533636 537802 536250 528234 525034 526498 520491 513853
15249 513853 516810 522263 526502 520348 517734 523400 526077 526353 518890 516774 520967 528671 534131 536891
15235 536891 529640 520158 516364 520850 526579 532028 534005 533582 527620 525920 530581 534559 541636 541625 539559
15220 539559 536634 535918 532650 527527 531153 534006 532625 537803 538908 544962 542767 530971 537964 540272
15206 540272 540935 536122 528062 524060 526083 539455 544934 539291 533058 535728 538533 541841 545459 553964
15192 553964 552555 548993 549522 552088 557200 555183 554423 558083 554788 551719 550774 548781 550793 552534 544474
15177 544474 538949 547132 551718 550535 550326 562549 566451 560534 553172 545841 542015 546085 551255 554842
15163 554842 557569 559494 557678 563061 561293 561355 561234 560373 553262 554049 554751 555477 551346 550421 553830 556733
15147 556733 556354 555306 553617 557426 561180 556421 556425 560601 561678 559977 551641 553968 557409 566238 575088
15132 575088 574057 572387 571633 570369 572129 568252 566595 565496 561468 565023 572445 570932 563821 558323
15118 558323 561702 569204 573673 572276 574139 569271 564181 562387 567552 568256 568389 575816 579165 578479 574643
15103 574643 570321 574808 573017 572398 579393 585259 587333 586890 582121 579564 576577 568936 573352 570973 567549
15088 567549 576744 577494 584598 588052 584202 585362 583378 578709 577217 584006 587237 579467 579624 585662 585222
15073 585222 585472 583855 591859 588781 584665 587530 588192 584810 587487 588562 589984 596320 600108 598023 592067
15058 592067 591791 592916 589928 597389 596642 594947 592143 589023 587657 591697 591501 593966 597863 602335 603065
15043 603065 599980 596351 594539 588798 587214 588775 592330 594465 600073 605032 601588 597135 600263 599901
15029 599901 600551 602402 608319 613022 610898 604638 607607 611239 613189 610731 609436 608792 606419 610889 611288
15014 611288 608865 603648 600184 601393 603769 605973 607138 607552 611944 622151 621468 619857 621792 626284
15000 626284 627003 627970 622515 619447 612524 604459 605635 618475 619199 618088 620980 621265 625202 628431 628291
14985 628291 629282 628555 621536 615955 613408 610150 612022 620247 618964 617247 611060 615462 612779 618590 620298
14970 620298 620562 626286 627710 626583 625621 624195 625892 623876 629663 633849 630233 634457 638558 636140 631709
14955 631709 631498 620305 619345 621528 621373 624176 630582 633247 628467 622104 626736 626308 626072 625278 626122 625432
14939 625432 623310 620558 622516 629655 631766 629904 627637 631270 631301 633855 638038 640340 643903 645163 642940
14924 642940 639644 636047 629070 633436 637724 642151 644148 635570 630922 626517 626877 626003 633560 640223 647496
14909 647496 650207 651012 649680 655197 659206 649721 634938 632181 638458 643118 648979 646841 648019 649464
14895 649464 655216 653255 651693 650831 644784 641263 641100 647842 655609 655695 659341 658616 658685 665401 663154 660598
14879 660598 655266 647853 645035 648569 656954 664369 667186 666736 661500 660574 665976 664507 665095 671738 673974
14864 673974 673459 673394 673679 668841 667331 661859 661861 669885 677098 678350 673581 674406 678377 681037 684432 687161
14848 687161 681171 676150 672938 674536 676362 677990 673076 670916 668685 669156 667330 670000 665914 661934
14834 661934 666064 675656 680555 681140 680938 679729 676065 675136 672569 674189 676829 683560 682759 671255 667940
14819 667940 681066 687057 687363 689690 689580 686537 687335 691800 693146 692569 681709 675355 678775 683535 685494
14804 685494 690691 690029 695839 694657 688199 680920 677330 681950 686311 697562 703813 695337 688335 689191
14790 689191 690368 690478 697080 696430 693098 685777 685840 697889 704364 700286 694884 696901 697345 697978 695803
14775 695803 695800 692796 695916 701333 698855 701011 703391 709899 712087 709097 701334 696092 696718 701823 700818
14760 700818 697482 697041 701372 704255 701411 704906 707215 707864 710803 713123 708942 700323 702427 705884 713914
14745 713914 716360 714093 710792 711822 718286 719904 718321 711784 713859 715617 718502 712936 711578 713652
14731 713652 713093 708399 710183 711209 718219 722479 720158 727716 724148 723071 725585 729505 720797 720185 722686
14716 722686 719995 723040 720143 718213 715804 717054 721754 721563 721745 720931 731551 740155 740645 733170 729375
14701 729375 727224 728786 726577 727353 725833 729212 728281 728890 720958 721814 730184 732316 729729 731056 726222
14686 726222 725291 733003 735986 736139 736212 738993 737005 733672 734062 737408 743356 740597 738926 742657 754088
14671 754088 747933 741328 740900 746621 748611 750238 747095 737695 730854 724354 731645 738394 736806 739921
14657 739921 749622 752050 745544 747497 747668 746284 744742 744016 747449 746460 744841 752967 757915 755948 743201
14642 743201 741822 741420 736712 739036 744890 750021 754923 757457 756989 760081 754794 749609 755473 756528 755242
14627 755242 756356 760792 764781 762745 764008 760779 752200 752114 761733 766283 762179 754122 753947 754691 754540
14612 754540 748907 747830 749341 756511 761621 756768 756606 762285 764381 765284 773554 775525 770557 766908 771636
14597 771636 774274 778445 774085 769846 775200 782425 779040 780270 778204 774332 778413 780586 782924 779386
14583 779386 779815 776256 774833 779573 784520 790776 789302 786160 785981 783028 779978 777054 780585 782531 783321
14568 783321 784102 789256 796775 793350 791141 792413 789910 787648 784755 784127 786680 787512 794356 803177 796901
14553 796901 788888 793965 797065 800526 800342 798851 794384 794702 798966 807107 817891 809615 805141 799327
14539 799327 800731 803351 804974 809409 804248 803424 804022 803922 808996 804328 798703 799575 800534 796262 794839
14524 794839 805677 808443 809686 804390 807213 809128 807375 807707 806409 807800 811117 811003 810611 811367 814484
14509 814484 817638 815734 818584 819591 821106 811956 809664 808422 806620 806644 815352 821489 824163 818644 824016
14494 824016 832737 830388 827879 824604 826542 825560 818499 814912 816915 814677 815130 820188 821493 815840 820771
14479 820771 831539 831091 826236 826324 822574 825010 823831 819759 822622 832646 835549 831124 834807 833232
14465 833232 831541 840678 845162 845081 843616 837007 834273 834284 840034 845637 839561 835086 834402 841581 843687
14450 843687 842876 848552 853103 850596 839097 833253 843055 850763 850971 852662 844762 840237 840322 838911 840123
14435 840123 843271 846261 847809 843895 847796 851916 849675 847098 846386 844704 843807 844861 850163 850719 847664
14420 847664 848144 849646 853895 859325 860939 858594 858631 865140 863667 856687 854803 863522 862904 858496 859866
14405 859866 856109 858552 860324 868647 873762 868134 864463 867801 870537 865296 869654 867526 861531 860831
14391 860831 866343 869800 874178 872827 876784 873275 866749 868239 868814 868243 870665 874186 870403 876733 884575
14376 884575 883752 876652 876516 880494 890679 892140 886901 884617 890617 899063 901217 900482 891066 886793 891032
14361 891032 884959 884919 887687 889091 889051 884507 884450 880776 881406 885518 894810 898651 895220 887802 883530 887574
14345 887574 888819 887554 886274 894040 898368 905383 906385 900003 897024 893688 898471 906583 902825 898135
14331 898135 897455 902907 901879 900754 905463 909618 912104 908444 911105 909164 904961 912240 913406 917807
14317 917807 922950 925006 922086 920696 925984 928035 932372 932086 924428 921682 916514 910691 912247 919285
14303 919285 924495 922495 926913 920418 924157 921427 918864 921774 923844 927608 927020 932786 935253 929693
14289 929693 930140 924616 919436 926234 932636 935645 935548 931155 927482 921725 922512 932165 937323 941645 941237
14274 941237 943467 936483 934282 934879 940641 942241 943623 941354 938177 939855 940497 941200 948706 952761 952122
14259 952122 953243 950527 945025 944103 946281 950035 947339 939116 937336 943434 951072 950583 952083 955183 949273
14244 949273 947108 949782 952305 954961 957932 962061 963174 958529 956678 958490 959095 960145 962546 958024
14230 958024 952118 956014 960577 967528 963914 964622 969783 977041 969560 964467 971125 972555 967434 966407
14216 966407 967374 967011 961870 962309 968074 973631 978397 979120 974475 975548 973749 974721 979125 982319 983712
14201 983712 979882 981604 987886 987158 983854 980780 981635 984534 982883 984576 985166 987255 992165 993749 988987
14186 988987 988703 994782 989553 989460 997349 999590 1001439 997351 995485 995099 995541 996521 997715 1001900 1006351 1007182
14170 1007182 1001473 993613 1000583 1007028 1007191 1005770 1002835 1006556 1012249 1011903 1013842 1016567 1016512 1014761 1003787
14155 1003787 1004685 1010270 1016020 1017507 1012588 1008988 1006087 1007522 1009971 1006061 1006349 1008733 1012868 1015461
14141 1015461 1018386 1020963 1020620 1019692 1025654 1022677 1014753 1019141 1027794 1033952 1035115 1026957 1025761 1032105
14127 1032105 1031904 1028097 1026348 1033457 1033745 1034329 1037617 1036220 1033519 1031064 1028530 1023374 1023529 1033131 1042041
14112 1042041 1039901 1043221 1046074 1045517 1047533 1045672 1048511 1054555 1045354 1041009 1043209 1045722 1050407 1046335
14098 1046335 1049601 1056238 1053143 1049840 1054310 1057488 1054789 1056277 1052813 1058445 1064060 1059150 1056009 1054715
14084 1054715 1056642 1055597 1063952 1061948 1063204 1063144 1063762 1061284 1062190 1066387 1069743 1073199 1080446 1081602 1085733
14069 1085733 1084926 1082318 1080559 1070909 1068860 1073178 1074740 1079878 1079897 1076997 1074932 1085261 1086690 1078574
14055 1078574 1080622 1087616 1084641 1087801 1091744 1088483 1089726 1090393 1091440 1094705 1094246 1099163 1102851 1104474
14041 1104474 1103003 1098272 1096763 1098508 1107898 1111448 1106359 1106154 1105815 1101303 1100119 1096484 1098072 1105432
14027 1105432 1108089 1111632 1111843 1118771 1122713 1118106 1115059 1115144 1111850 1114485 1115331 1121004 1123514 1112603 1109595
14012 1109595 1108773 1111661 1113236 1111078 1112247 1119972 1119010 1121842 1126256 1135756 1135128 1131383 1132929 1137130 1140145
13997 1140145 1138883 1139280 1145554 1147711 1143013 1143888 1150241 1149119 1141322 1142037 1144271 1143739 1149862 1154202 1150574
13982 1150574 1151720 1160750 1163779 1173160 1168149 1166354 1163031 1163632 1167790 1169822 1172328 1171090 1172832 1173967
13968 1173967 1176755 1172815 1170309 1172860 1176588 1184167 1184813 1182928 1186815 1186414 1184546 1190611 1195688 1201731
13954 1201731 1203549 1204748 1209543 1213055 1218711 1217379 1212384 1210756 1218938 1222984 1221826 1217667 1215988 1224081
13940 1224081 1231274 1231829 1235040 1240526 1242959 1248182 1251786 1252843 1255865 1258971 1260669 1270926 1279782 1286829
13926 1286829 1289958 1292631 1294734 1300892 1320531 1329321 1337889 1357995 1365106 1379457 1397556 1406493 1416573
13913 1416573 1430411 1441331 1470506 1507094 1530899 1554859 1571384 1556217 1503988 1427741 1321675
13902 1321675 1193881 1068471 962619 883187 836746 822060 829345 852237 874486 898586 928327
13891 928327 949678 964483 984711 1002179 1011481 1016037 1028569 1041963 1048459 1053955 1059311 1068723 1077149
13878 1077149 1086406 1090498 1088770 1100560 1114401 1120614 1122643 1116843 1117548 1119000 1126755 1135563 1139792 1144207
13864 1144207 1150322 1157113 1165181 1160466 1151748 1162900 1171240 1177049 1177020 1178594 1174569 1175794 1182694 1180673
13850 1180673 1184460 1182267 1181991 1189730 1193378 1190734 1186683 1187865 1188626 1191925 1194682 1201885 1213709 1216423
13836 1216423 1213248 1217020 1218719 1222961 1221865 1218680 1211491 1209289 1204283 1203122 1203724 1206375 1215161 1222086
13822 1222086 1229687 1233803 1232513 1235268 1239375 1235814 1231800 1234337 1239793 1238280 1239518 1238930 1240334 1239354
13808 1239354 1237630 1240597 1239382 1234456 1229738 1235823 1243849 1251477 1254845 1258773 1251874 1249814 1249987 1253096
13794 1253096 1257438 1263701 1265766 1267661 1274613 1273085 1270080 1271105 1272412 1282554 1279682 1276316 1278504 1284307
13780 1284307 1287911 1289978 1290307 1292002 1299622 1307611 1307747 1303820 1302010 1305758 1310084 1308813 1303351 1297944
13766 1297944 1303848 1313861 1315001 1313764 1312691 1311218 1311049 1314569 1313665 1317319 1323209 1313139 1307115 1307970
13752 1307970 1313019 1317011 1314799 1317880 1316626 1318776 1326470 1329038 1332024 1337321 1333432 1329973 1328411 1332850
13738 1332850 1335057 1332699 1335820 1340437 1346718 1349597 1349148 1356949 1353555 1353945 1360708 1357136 1346327 1347318
13724 1347318 1351144 1353556 1355234 1353346 1356284 1353818 1357757 1361400 1358249 1362584 1370610 1374918 1375326 1368985
13710 1368985 1370317 1373912 1372224 1379453 1380233 1379033 1381762 1386358 1386660 1383203 1390003 1396016 1398411 1396851
13696 1396851 1392043 1389163 1395549 1395760 1394813 1402264 1404046 1399685 1401236 1410528 1418556 1411040 1405654 1402183
13682 1402183 1400676 1413010 1421358 1422353 1414648 1422537 1424810 1427350 1426399 1422724 1425999 1431694 1429803 1432788
13668 1432788 1431772 1433792 1438418 1439132 1433745 1437019 1439869 1439995 1436417 1437382 1442849 1448035 1444500 1449582 1458191
13653 1458191 1459940 1461696 1466140 1461678 1461410 1453990 1450602 1453099 1457378 1463672 1467968 1468987 1476685 1480405
13639 1480405 1485491 1485214 1488917 1489354 1484660 1480944 1480544 1480360 1487177 1487855 1484356 1482836 1484168 1487751 1490736
13624 1490736 1496018 1500182 1500653 1502043 1509250 1516567 1520401 1520840 1520822 1518521 1522112 1516170 1513314 1519325 1523842
13609 1523842 1524798 1531527 1534820 1536670 1538597 1533810 1529238 1535742 1541655 1541162 1545658 1546584 1547102 1547878 1542470
13594 1542470 1547003 1545287 1546863 1557007 1567859 1567432 1570447 1573910 1565817 1553690 1551688 1560163 1563337
13581 1563337 1569264 1580217 1586689 1589446 1587047 1590340 1582726 1578962 1581327 1588972 1595075 1591435 1586951 1583835
13567 1583835 1588846 1598688 1602457 1603771 1600910 1604232 1610994 1617385 1614512 1614238 1619093 1624587 1632331 1633613
13553 1633613 1628959 1633721 1636128 1631581 1631605 1633738 1636318 1639083 1642941 1645741 1643872 1652172 1652516 1649879 1649550
13538 1649550 1645674 1657570 1660549 1653891 1646332 1650444 1662037 1671821 1668078 1668483 1669247 1672885 1680577 1681453
13524 1681453 1675604 1677351 1687416 1691802 1690717 1690100 1689559 1693139 1696788 1702400 1708571 1711534 1713612 1711883
13510 1711883 1724265 1736140 1738346 1737208 1735127 1734789 1738776 1747430 1747020 1742386 1745165 1750966 1755790 1756588
13496 1756588 1758510 1768489 1773942 1777160 1785932 1794424 1804937 1814834 1822869 1831308 1837594 1837119 1827798 1814132
13482 1814132 1798255 1777747 1758605 1745147 1742712 1734743 1737121 1748064 1760027 1762298 1763514 1771494
13470 1771494 1773251 1772849 1782059 1792286 1800932 1811610 1813643 1813820 1819475 1832452 1842187 1851207 1850277 1848299
13456 1848299 1853244 1859650 1867403 1880435 1886376 1897579 1911921 1932352 1943985 1961029 1969080 1971798
13444 1971798 1961048 1932002 1890519 1838922 1802241 1772360 1753473 1749276 1751795 1763897 1779152 1786366
13432 1786366 1797824 1804472 1810147 1815529 1821638 1831788 1838009 1838028 1849106 1858247 1860273 1864570 1873317 1882453
13418 1882453 1894252 1902487 1905963 1913674 1918676 1918028 1927165 1938815 1946000 1959101 1962086 1964931 1972288
13405 1972288 1983870 1976634 1963993 1946935 1926870 1905665 1892340 1886728 1890048 1893666 1900442 1907296
13393 1907296 1916173 1922114 1931621 1926406 1926175 1926562 1928598 1935171 1940697 1948169 1966359 1977015 1974151 1975319
13379 1975319 1985847 1998390 1999051 2004573 2005342 2011771 2024560 2029985 2028660 2025740 2028003 2034049 2037353 2043271
13365 2043271 2049110 2051309 2050823 2060672 2061228 2062753 2073777 2079762 2077692 2072819 2074856 2077887 2090577 2098179
13351 2098179 2102870 2114816 2117850 2113336 2120099 2125213 2122722 2125995 2142448 2144642 2144051 2150623 2155869 2167895
13337 2167895 2170499 2170430 2172506 2175620 2176573 2173623 2175847 2178508 2176071 2185086 2196539 2205866 2209142 2211314
13323 2211314 2220084 2225535 2233648 2242360 2247092 2251488 2258787 2263729 2266981 2268843 2271896 2274411 2280666 2285339
13309 2285339 2287858 2291025 2299906 2307546 2316905 2309152 2307820 2318183 2328108 2330406 2336099 2345107 2353020 2364192
13295 2364192 2366703 2373524 2380416 2384470 2389517 2388460 2390110 2394247 2404521 2408699 2417366 2422729 2424179 2428986
13281 2428986 2433523 2433994 2430839 2432627 2441033 2454081 2464496 2468543 2473402 2470808 2475640 2483293 2496661
13268 2496661 2505666 2518064 2529793 2534876 2542321 2545270 2549155 2561082 2567567 2578032 2588885 2596370 2599852
13255 2599852 2603901 2608358 2615001 2615863 2623093 2634651 2632841 2639636 2648073 2658706 2668485 2666544 2666150 2671728
13241 2671728 2669325 2673852 2680959 2685253 2692452 2699951 2705290 2717623 2724945 2730834 2736626 2742725 2755475
13228 2755475 2767440 2777749 2780592 2786651 2798866 2811812 2819623 2825562 2836401 2846317 2857484 2870837
13216 2870837 2882170 2886293 2885402 2889518 2889603 2901661 2912031 2928082 2944892 2957889 2967406 2972746 2987410
13203 2987410 2999325 3004340 3012968 3011495 3015847 3026981 3040439 3046857 3053492 3066353 3076812 3093745
13191 3093745 3108533 3124655 3138639 3148698 3163028 3172557 3178895 3193807 3215139 3231111 3235448 3238352
13179 3238352 3244054 3261850 3285820 3309001 3326991 3334589 3337860 3346325 3360079 3380507 3393307 3406454
13167 3406454 3427214 3454704 3474722 3489252 3497721 3508757 3519390 3533678 3552937 3572814 3578113 3591824
13155 3591824 3613556 3630426 3645881 3664547 3682899 3694437 3709812 3730102 3754824 3778257 3803091
13144 3803091 3820074 3834656 3847621 3869545 3887896 3902806 3926431 3954828 3980868 4004910 4026931
13133 4026931 4048502 4070524 4092542 4115456 4138960 4169289 4201258 4232625 4272929 4308905 4347020
13122 4347020 4384536 4418060 4449390 4481435 4506773 4503318 4483506 4455757 4428415 4422153 4440735 4485307
13110 4485307 4525619 4561868 4599859 4652796 4697617 4733803 4776310 4814611 4858800 4914719 4957102
13099 4957102 4994485 5045145 5093682 5138079 5187822 5237771 5286045 5344769 5405495 5462928 5524912
13088 5524912 5586122 5657356 5737023 5811209 5889639 5969861 6023414 6047759 6051648 6030560 6001972
13077 6001972 5996561 6017871 6072356 6148033 6245540 6346292 6453001 6565321 6671857 6784185
13067 6784185 6889829 7008633 7137378 7269718 7398720 7537961 7681870 7829597 7988042
13058 7988042 8161974 8345383 8537336 8737324 8961796 9197869 9442661 9712352 10006559
13049 10006559 10321045 10662320 11027860 11428414 11852389 12322860 12842191 13431776 14121803
13040 14121803 14928029 15869346 16940849 18079521 19096766 19630458 19094750 16902536 12927204
13031 12927204 7778027 2606348 -1452805 -3785565 -4502072 -4129722 -3219595 -2138898
13023 -2138898 -1061034 -61631 848388 1681873 2458304 3177241 3850861 4494945 5114906
13014 5114906 5738890 6382233 7042414 7727211 8444861 9192839 9964890 10738178 11535954
13005 11535954 12390956 13329090 14415604 15687029 17186790 18931589 20942302 23203672
12997 23203672 25592148 27672639 28512768 26713083 21041583 11469774 -257684 -11492561
12989 -11492561 -19750672 -23910741 -24598871 -23203269 -20978943 -18660911 -16541908 -14682296
12981 -14682296 -13070964 -11662727 -10428277 -9335991 -8372163 -7497634 -6684987 -5899959 -5127210
12972 -5127210 -4369662 -3619520 -2884443 -2181891 -1506057 -874325 -304042 202842 695554
12963 695554 1223297 1854302 2642880 3596080 4703942 5919228 7106785 7988225 8037798
12954 8037798 6623856 3329670 -1600336 -7196153 -12198403 -15586725 -17065247 -17060124 -16227037
12945 -16227037 -15089992 -13946950 -12901400 -11977975 -11173835 -10468494 -9856158 -9315606 -8835687
12936 -8835687 -8403177 -8007734 -7631336 -7273801 -6946640 -6641952 -6347725 -6068666 -5825348
12927 -5825348 -5611573 -5440577 -5311018 -5215762 -5129520 -5042623 -4939304 -4808264 -4663232 -4516840
12917 -4516840 -4376931 -4243637 -4110351 -3987664 -3869876 -3758389 -3645052 -3546870 -3462701 -3373388
12907 -3373388 -3287687 -3206217 -3125018 -3041958 -2962575 -2887682 -2818091 -2750392 -2689727 -2627656 -2555014
12896 -2555014 -2490502 -2432175 -2374148 -2315437 -2261648 -2211048 -2166230 -2118878 -2070296 -2015709 -1961734
12885 -1961734 -1908142 -1862969 -1818033 -1772360 -1729141 -1680375 -1642824 -1600054 -1553289 -1513626 -1479473
12874 -1479473 -1438578 -1392615 -1352546 -1318092 -1284249 -1256299 -1223930 -1200480 -1180890 -1158127 -1132201
12863 -1132201 -1118143 -1094374 -1071415 -1044517 -1018390 -987285 -955984 -927095 -902202 -876729 -846745
12852 -846745 -822942 -799525 -768680 -731631 -698876 -678019 -650084 -619727 -601813 -581096 -550214
12841 -550214 -522351 -498426 -470041 -440214 -415202 -395146 -381811 -365540 -345857 -322462 -297738
12830 -297738 -268961 -254120 -244441 -228540 -205916 -180804 -167797 -150228 -125809 -106341 -98162 -80065
12818 -80065 -58009 -37661 -19433 549 18723 38098 54398 74695 93093 111423 129760 153987
12806 153987 178737 191434 196197 210754 231074 252413 269265 292725 314723 334892 349815 359985
12794 359985 366399 368895 377657 384726 390640 404774 414401 421381 439598 461445 476718 501401 524125
12781 524125 540513 554336 561479 574545 587653 603327 622272 633715 649065 660197 671169 688639
12769 688639 712622 731258 748732 763381 773762 787592 801471 808282 821883 842791 859195 874045
12757 874045 895052 916900 934713 947393 963637 980646 990142 1002133 1017243 1035563 1047928 1060382
12745 1060382 1080507 1094647 1107675 1122659 1142364 1152126 1165694 1179964 1194443 1203779 1222378 1238562
12733 1238562 1252666 1269925 1290409 1308933 1326735 1348989 1369160 1387287 1406215 1424593 1441442
12722 1441442 1452475 1461328 1479866 1494186 1506200 1520975 1539458 1558237 1586178 1604769 1621678
12711 1621678 1639825 1659176 1677872 1702845 1727634 1749686 1765084 1778766 1790290 1811603 1831275
12700 1831275 1851017 1865453 1884365 1913975 1941109 1969903 1996560 2021302 2036432 2046073 2060299
12689 2060299 2084418 2097368 2106384 2120524 2138905 2158886 2184273 2202642 2210144 2222886 2247047 2279935
12677 2279935 2306044 2335922 2363316 2382288 2415051 2441632 2460600 2482748 2503804 2527365 2547611
12666 2547611 2571063 2587792 2604686 2626199 2652852 2680983 2707496 2737803 2771143 2803456 2832680
12655 2832680 2861073 2882263 2909454 2943904 2979329 3015967 3053420 3082470 3104726 3132305 3171273
12644 3171273 3212332 3248806 3286279 3323190 3355359 3396250 3444244 3485580 3526775 3566575 3608755
12633 3608755 3656143 3708720 3756429 3805480 3862876 3906867 3951194 4007294 4061482 4107303 4160978
12622 4160978 4211823 4264611 4318282 4383209 4449335 4513725 4579095 4646895 4703931 4762835 4836184
12611 4836184 4916701 4987868 5064378 5145451 5226172 5311439 5390186 5470491 5558938 5653512 5748178
12600 5748178 5840253 5930516 6030829 6138318 6251413 6364856 6489757 6612305 6737748 6863750
12590 6863750 6988790 7121106 7263814 7409669 7560566 7729976 7906415 8087534 8281911
12581 8281911 8492928 8717639 8950422 9183760 9427871 9679986 9942817 10215652 10498463
12572 10498463 10791909 11110524 11458562 11844347 12258448 12706727 13191631 13711662 14280233
12563 14280233 14892792 15545570 16248586 17014873 17833804 18697155 19606619 20574327 21612174
12554 21612174 22743429 24015904 25477919 27187337 29183060 31478248 34041409 36715125
12546 36715125 39140971 40702262 40603364 38078111 32586723 24069713 13126303 903904
12538 903904 -11217954 -21992285 -30520420 -36268496 -39172751 -39640486 -38384726 -36183078
12530 -36183078 -33664156 -31188654 -28932719 -26959566 -25276732 -23835120 -22602841 -21531866
12522 -21531866 -20562208 -19651430 -18780831 -17935965 -17121947 -16344678 -15628684 -14965455 -14333622
12513 -14333622 -13749066 -13210569 -12716004 -12257120 -11828341 -11425726 -11038409 -10686097 -10358056
12504 -10358056 -10044267 -9747622 -9464911 -9196573 -8946870 -8715801 -8492591 -8282739 -8088813
12495 -8088813 -7908891 -7750594 -7598208 -7449682 -7300041 -7145130 -6989458 -6837549 -6681424
12486 -6681424 -6544752 -6411041 -6279918 -6156994 -6035124 -5919408 -5809216 -5706732 -5608275 -5504922
12476 -5504922 -5402168 -5311987 -5219034 -5125515 -5035128 -4954538 -4881540 -4808591 -4732664 -4658025 -4578215
12465 -4578215 -4508997 -4440633 -4376291 -4314841 -4246380 -4180776 -4123409 -4064461 -4010771 -3960092 -3908868
12454 -3908868 -3856249 -3809109 -3758039 -3708649 -3659335 -3605901 -3559383 -3520973 -3483169 -3440212 -3393941
12443 -3393941 -3354840 -3316399 -3278814 -3246157 -3215759 -3180699 -3135140 -3093832 -3052991 -3015660 -2984351
12432 -2984351 -2955518 -2928781 -2899927 -2867179 -2834835 -2799245 -2769302 -2732300 -2694629 -2657423 -2626551
12421 -2626551 -2595959 -2567894 -2544706 -2523396 -2496744 -2476442 -2458270 -2438616 -2427619 -2407161 -2390176
12410 -2390176 -2379511 -2361538 -2336035 -2308244 -2287487 -2270175 -2244388 -2219785 -2191335 -2167914 -2148609
12399 -2148609 -2128995 -2112711 -2094526 -2070988 -2050093 -2025884 -1996205 -1973404 -1952151 -1927195 -1906469
12388 -1906469 -1879870 -1860180 -1844569 -1834593 -1825306 -1805877 -1781808 -1771981 -1766581 -1754596 -1737231 -1726968
12376 -1726968 -1710844 -1695196 -1681363 -1667886 -1657051 -1644044 -1621303 -1608231 -1595368 -1583898 -1571139
12365 -1571139 -1553440 -1544018 -1537939 -1525324 -1511983 -1497547 -1481889 -1466619 -1455877 -1449764 -1440434 -1432935
12353 -1432935 -1424488 -1416814 -1402957 -1382271 -1365597 -1346712 -1344487 -1342611 -1335324 -1318261 -1305761 -1297590
12341 -1297590 -1291471 -1277654 -1258238 -1247688 -1242024 -1234017 -1228718 -1221568 -1208378 -1195293 -1183775 -1162575
12329 -1162575 -1147763 -1134750 -1119645 -1112907 -1110959 -1103944 -1096021 -1085125 -1070974 -1060856 -1055261 -1043185
12317 -1043185 -1035119 -1029835 -1022477 -1017360 -998948 -984010 -980043 -975027 -971345 -966746 -959449 -945684 -928384
12304 -928384 -923309 -912055 -900857 -893440 -884478 -871499 -869759 -858354 -847069 -842989 -837454 -827963 -819529
12291 -819529 -819026 -816501 -812818 -804966 -798941 -796163 -796174 -791629 -780088 -767837 -755700 -748581 -742708 -733925
12277 -733925 -724407 -725550 -719828 -717350 -711237 -702769 -693591 -686140 -678019 -665249 -659935 -659114 -642890 -632678
12263 -632678 -630223 -630914 -628486 -623499 -612379 -604924 -604086 -598183 -592902 -578674 -573216 -573363 -567840 -558667
12249 -558667 -551421 -543953 -539438 -529935 -521247 -514243 -508284 -499469 -494618 -492772 -478408 -464250 -462644 -467546
12235 -467546 -463386 -461804 -463073 -456668 -451104 -448600 -447876 -442659 -430829 -423630 -415087 -416225 -418391 -412449
12221 -412449 -408357 -402025 -397205 -388201 -385551 -379494 -372004 -372705 -375271 -370257 -355818 -352259 -351927 -337716
12207 -337716 -326331 -324964 -322137 -313218 -300406 -294400 -288825 -287380 -279288 -270445 -266321 -264744 -269142 -270644
12193 -270644 -267643 -263615 -256581 -252683 -236903 -224019 -213657 -211816 -210567 -201603 -194732 -195033 -188862 -181418
12179 -181418 -173758 -167624 -167379 -168858 -160725 -157548 -161787 -162775 -161533 -156106 -149576 -141763 -137053 -121717
12165 -121717 -114828 -113194 -106929 -108976 -104367 -96624 -91727 -85580 -72962 -66527 -65173 -57743 -48154 -43983
12151 -43983 -30738 -18502 -19062 -20903 -17085 -13652 -6546 -2281 4804 11135 21663 27880 36890 44303
12137 44303 43653 48816 52423 59200 73475 91745 100375 115743 127032 134670 137791 148311 164502
12124 164502 180260 192672 207925 231320 250806 261759 273240 283224 298499 318455 332618 344880
12112 344880 343033 329855 298716 252475 203375 153588 103241 67742 48970 43431 55633 78681
12100 78681 109302 142055 170488 198084 222090 250629 281934 315460 355148 397163 443594 498035
12088 498035 558413 619432 680882 734026 752833 726079 646602 505430 314188 86495 -152601
12077 -152601 -371083 -552415 -675973 -733645 -746744 -715627 -665190 -601645 -533057 -474120 -420863
12066 -420863 -380976 -353415 -327350 -305235 -288327 -260131 -240433 -235091 -228095 -213881 -196440 -177520
12054 -177520 -159545 -141199 -127006 -111546 -102285 -94144 -83737 -62796 -57451 -53596 -45704 -34151
12042 -34151 -27950 -21443 -12977 -5733 -884 7994 16409 22699 20126 24867 33017 45998 48974 62518
12028 62518 68472 62896 58505 66872 73496 81900 83558 84268 95602 112046 117342 122879 126194 129307
12014 129307 141035 141342 143826 150053 149509 149723 145434 143943 147435 151306 159151 159844 163002 169767 172240
11999 172240 176762 186797 193455 192927 195743 202287 205206 214443 216788 222179 229119 224454 219950 226868
11985 226868 234417 237719 243981 251183 245086 239372 235557 241917 250712 261068 266527 269919 275241 279040
11971 279040 272002 269989 271969 275096 282034 287580 296042 299190 296370 302205 305352 302496 304781 311588
11957 311588 314632 322947 328300 326526 324294 325323 322332 321858 328399 335556 339612 347215 347127 352880 360585
11942 360585 365331 370234 371418 377112 381495 381234 374621 373978 376080 382699 389846 394596 400260 408860 413039
11927 413039 411924 406654 406626 408793 410501 409513 405797 406318 409553 418027 420575 425343 424494 419308 422348
11912 422348 431978 434422 438945 440259 443314 444710 442328 444178 449957 459619 464493 458535 457289 459157
11898 459157 466047 461153 460852 475400 476411 481229 481835 478563 477005 481495 481867 481542 482151 482793 492171
11883 492171 497358 504829 512018 511030 506519 510437 525488 533061 538752 536347 536641 534220 526103 523012
11869 523012 521202 518972 521236 530167 539306 546598 551274 547066 549835 560184 556127 553134 559927 569390
11855 569390 569664 572147 569399 577114 585213 589303 593672 594670 594880 594675 597058 595527 597654 601779 607223
11840 607223 603616 598923 598944 599326 600378 601578 602273 609409 621656 629228 633414 627328 626308 628863 624852
11825 624852 624611 630392 635409 645852 648752 648245 649738 653564 646651 647245 649073 648253 652579 656942 654951
11810 654951 661189 672732 677591 678322 682262 680460 680462 683125 680637 677702 679784 668334 665653 675554 686201
11795 686201 692596 695764 695194 703640 707408 702964 698034 699007 704015 707063 704258 700991 701510 709458 726865
11780 726865 728524 727674 723530 715939 719261 733415 741069 740924 738287 739931 741570 739855 752361 765265
11766 765265 771837 767545 763835 762454 762064 771776 775911 779013 775522 770851 769282 771582 775429 775229 781491
11751 781491 788078 795169 802659 803445 798849 800338 797167 797592 795837 801281 814372 814810 813888 811414 816514
11736 816514 822940 827299 827645 824763 821502 823759 816477 811453 814318 825247 833935 835386 833242 833501
11722 833501 834309 834631 838351 843946 843599 851666 856120 854147 853566 863723 868851 871918 866283 859692 861142
11707 861142 865709 866271 861060 865402 867480 874744 877375 887734 890294 887440 893663 899473 904396 901622
11693 901622 899611 899621 896107 895487 903343 907511 907416 911049 913817 917455 921590 921878 923983 928989 930703 929692
11677 929692 933226 932354 931221 936820 940864 941212 944737 952558 957558 959734 961843 958553 956421 963374 961577
11662 961577 955725 957840 960349 963599 972073 977123 977653 979179 984310 984096 984593 979768 979460 986825 995298
11647 995298 995779 993863 998378 1002690 1007085 1001275 1000263 1006305 1005484 1007422 1011955 1009910 1005541 1006971 1019546
11632 1019546 1025026 1020599 1022829 1022404 1025136 1030805 1031902 1033261 1038095 1041313 1041525 1039610 1032527 1030792
11618 1030792 1034148 1037711 1046219 1053747 1055523 1062094 1068975 1071540 1066503 1061832 1064465 1063526 1060258 1058080
11604 1058080 1057814 1062903 1071472 1079233 1081807 1079049 1086909 1092207 1098493 1100862 1105793 1107687 1107585 1106611 1116797
11589 1116797 1120970 1114926 1112074 1117552 1126528 1129014 1128318 1130002 1132176 1125341 1124287 1128797 1130220 1135569
11575 1135569 1140652 1138334 1138423 1135298 1139583 1147137 1149927 1150404 1147242 1145460 1148503 1150437 1163859 1170280
11561 1170280 1175331 1172696 1168107 1177188 1184241 1186776 1182990 1184657 1178855 1178664 1182744 1182198 1185675 1189298
11547 1189298 1191482 1198309 1201971 1201189 1208036 1208076 1216088 1218431 1215346 1207769 1204845 1210936 1214042 1217673 1220135
11532 1220135 1225277 1232069 1237037 1240521 1248952 1258639 1260173 1257823 1252090 1244759 1253724 1257108 1257735 1256305
11518 1256305 1256548 1259271 1258324 1261531 1257588 1256783 1256314 1264892 1270195 1272078 1274897 1272517 1270618 1273196 1276183
11503 1276183 1278057 1283716 1285400 1291376 1294395 1302140 1309923 1316537 1308470 1298713 1294827 1306497 1322626
11490 1322626 1331066 1330982 1325595 1329101 1328421 1327940 1333978 1342394 1352004 1349555 1343981 1339698 1346276 1350435 1346395
11475 1346395 1348292 1349441 1354211 1355633 1357740 1361579 1362266 1360403 1369811 1375802 1382162 1380346 1376128 1378454
11461 1378454 1385547 1393978 1393279 1388992 1389154 1396414 1405550 1408244 1408020 1407067 1408850 1413209 1414581 1418475 1415063
11446 1415063 1415092 1414370 1420048 1421938 1418357 1419610 1423578 1425911 1433538 1430504 1425650 1427571 1436144 1438502 1441801
11431 1441801 1444844 1446866 1451009 1449704 1447408 1452847 1461324 1460032 1461333 1467376 1473747 1479749 1480118 1486412
11417 1486412 1486028 1480592 1481318 1478571 1478714 1489617 1498369 1507336 1512373 1513490 1508371 1510943 1520438 1521601
11403 1521601 1523738 1526884 1536210 1532464 1532286 1533793 1526251 1530772 1540522 1546521 1549015 1546629 1539623 1543080
11389 1543080 1546141 1549028 1551812 1556776 1559915 1562509 1556836 1558179 1567396 1574839 1573986 1572788 1574620 1571472
11375 1571472 1579441 1585806 1588213 1589093 1590403 1591286 1598829 1606395 1602853 1608970 1610892 1615641 1617135 1614771
11361 1614771 1613738 1610477 1604304 1607920 1618712 1617243 1623870 1636334 1643113 1644326 1648531 1649833 1657595
11348 1657595 1657171 1653617 1654775 1661721 1662662 1665726 1665145 1667237 1669889 1674243 1681594 1686778 1684044 1691657 1698251
11333 1698251 1704665 1707694 1702187 1696194 1699218 1702149 1703757 1706743 1709996 1710316 1711976 1711025 1713250 1719692
11319 1719692 1722738 1727375 1728353 1741370 1747957 1746841 1747737 1750345 1750105 1752607 1755568 1761176 1765657 1769260
11305 1769260 1770351 1766888 1769954 1769806 1766304 1770628 1772446 1772936 1777637 1781555 1781592 1792419 1806065 1808115
11291 1808115 1812261 1811499 1808724 1802439 1810271 1821417 1823092 1813572 1819502 1821092 1818457 1825249 1831235 1834833
11277 1834833 1832998 1837413 1841409 1841952 1852463 1861935 1857825 1857508 1858744 1865278 1874804 1875193 1879069 1882234
11263 1882234 1887377 1893936 1898251 1897124 1895119 1901174 1905972 1904105 1910075 1909933 1906257 1908413 1921965 1937203
11249 1937203 1936951 1939287 1937196 1932812 1934876 1942522 1942610 1941051 1943679 1956015 1964719 1966159 1971504 1973885
11235 1973885 1977895 1987740 1988907 1989472 1993224 1999723 1999978 1998955 1999259 1999965 2010291 2011946 2007594 2012188 2021578
11220 2021578 2026444 2031122 2024011 2017744 2017912 2021939 2031430 2044612 2052981 2059050 2054614 2054953 2062681 2062777 2065976
11205 2065976 2064613 2060773 2067806 2080751 2088069 2081818 2085078 2091835 2096566 2101351 2099487 2101530 2105881 2112092
11191 2112092 2111377 2119420 2129143 2125027 2127133 2129309 2126992 2131934 2133268 2136036 2144932 2148828 2154151 2157180
11177 2157180 2165175 2166382 2166261 2166930 2172747 2178108 2185522 2188575 2186860 2185023 2187944 2194795 2201187 2202397
11163 2202397 2208643 2213457 2211587 2212289 2217604 2220592 2221446 2224270 2227927 2231323 2235853 2239686 2245536 2249521
11149 2249521 2256577 2264127 2267424 2277824 2284737 2289163 2289574 2291206 2292589 2291900 2290590 2295989 2310410 2314360
11135 2314360 2316926 2323474 2331737 2330203 2323581 2328267 2331541 2338577 2347370 2349492 2341362 2348506 2352838 2356202
11121 2356202 2363853 2363544 2371216 2375622 2379992 2383345 2390303 2397456 2396739 2395874 2400230 2403604 2404317 2407587 2411065
11106 2411065 2413054 2414667 2420163 2425799 2429270 2430701 2440869 2452965 2456198 2461944 2470069 2467059 2472562
11093 2472562 2480280 2486035 2485267 2492868 2501933 2514048 2519612 2521251 2529309 2528076 2525044 2528879 2537400 2547680
11079 2547680 2558094 2562605 2571010 2577255 2582783 2584312 2587975 2592060 2590693 2596044 2598569 2601670 2609880 2614970
11065 2614970 2614381 2613021 2620430 2631826 2638414 2641282 2641257 2633421 2629382 2629155 2633065 2632904 2635704 2644208 2656722
11050 2656722 2664824 2668342 2671352 2680151 2680380 2690543 2694144 2698523 2702958 2711586 2721435 2726345 2736465 2744251
11036 2744251 2759222 2767473 2770269 2762704 2759638 2767611 2776006 2779427 2781264 2782616 2792533 2803223 2810490
11023 2810490 2817025 2823729 2836151 2837799 2842797 2849248 2854997 2857792 2849944 2843434 2839711 2839085 2836213 2836126
11009 2836126 2839423 2848224 2852203 2855846 2856760 2867453 2881590 2882153 2897191 2913734 2926490 2932643 2934415
10996 2934415 2937173 2944892 2955810 2959810 2968320 2976889 2989029 2994862 2997165 2999797 3014033 3021234 3026096
10983 3026096 3028606 3034047 3048587 3058017 3064398 3065576 3066478 3075683 3088819 3092699 3093236 3098527 3105081 3104699
10969 3104699 3105687 3109420 3113361 3123380 3138516 3158572 3167075 3173619 3182166 3186406 3192271 3186007 3175464
10956 3175464 3163309 3150646 3138364 3125113 3120283 3143199 3166267 3178536 3185823 3191872 3201960 3215841
10944 3215841 3227772 3239136 3254309 3265527 3273782 3281214 3278130 3282976 3291994 3299661 3311852 3326926
10932 3326926 3338074 3345513 3352722 3360319 3364726 3365811 3372632 3386375 3393553 3396569 3413135 3430458 3452128
10919 3452128 3468279 3479110 3494680 3507329 3514488 3510150 3498336 3478701 3461673 3445005 3432381 3419309
10907 3419309 3413452 3415382 3424951 3437862 3438379 3441512 3445760 3459859 3472456 3479881 3491548 3506947 3520115
10894 3520115 3528327 3534554 3539287 3539938 3545489 3564334 3574409 3582574 3594182 3607489 3628727 3649792 3673248
10881 3673248 3696893 3720340 3739164 3756070 3766101 3776139 3788583 3804881 3819111 3843052 3866240
10870 3866240 3882362 3904745 3916244 3920772 3915592 3902462 3884171 3864854 3859192 3863793 3868940 3880525
10858 3880525 3903144 3926106 3947423 3977064 3999726 4023476 4052388 4078018 4107320 4149436 4193678
10847 4193678 4237802 4285532 4335856 4366832 4340289 4217950 4007241 3771547 3610253 3549761
10837 3549761 3552239 3581437 3619843 3668903 3719437 3757120 3789093 3822162 3858408 3889316 3908101
10826 3908101 3926955 3949235 3966472 3985573 4003989 4013164 4026043 4039785 4058738 4068942 4084283
10815 4084283 4105963 4122373 4142058 4155588 4166897 4177331 4194095 4209003 4223296 4230358 4241366
10804 4241366 4262977 4279558 4292138 4308546 4327845 4341368 4359019 4374846 4382831 4390830 4400956 4413141
10792 4413141 4421562 4435502 4448709 4456529 4467350 4482504 4500498 4520914 4537776 4545866 4560762 4573774
10780 4573774 4591300 4603361 4619610 4639851 4652663 4659820 4664455 4675255 4685550 4699005 4722954 4739819
10768 4739819 4752354 4769270 4784469 4794969 4800317 4813119 4832670 4850386 4860789 4868499 4887604 4912077
10756 4912077 4927991 4945643 4964283 4977295 4990219 4998892 5006549 5021375 5044948 5054721 5072918 5092936
10744 5092936 5106982 5120511 5142348 5160329 5178911 5193988 5199620 5208449 5215989 5229073 5251835 5280716
10732 5280716 5315340 5343538 5359743 5375924 5396557 5413597 5430781 5441096 5455433 5474022 5490151
10721 5490151 5505502 5528830 5550733 5570132 5581386 5604058 5626584 5650311 5677227 5696371 5709157
10710 5709157 5718398 5735076 5757253 5787106 5809831 5824206 5845410 5868956 5887161 5905947 5926978
10699 5926978 5950012 5974317 6001099 6028474 6047824 6070274 6089050 6108631 6138211 6160789 6183281
10688 6183281 6207694 6240416 6271760 6303606 6341290 6369689 6399295 6428101 6450598 6476967 6490824
10677 6490824 6496599 6491781 6495791 6501006 6524576 6558083 6586721 6617975 6649937 6677933 6707276 6739304
10665 6739304 6770859 6806574 6832385 6852276 6877991 6901283 6925799 6953114 6990926 7028410 7063747
10654 7063747 7103502 7149813 7192474 7224756 7256968 7286186 7311891 7344040 7377826 7411727 7447448
10643 7447448 7480334 7509662 7548177 7595365 7633729 7667090 7707038 7737376 7765242 7798023 7856676
10632 7856676 7920183 7988287 8066193 8136750 8191355 8237605 8291222 8347225 8404933 8464691 8521393
10621 8521393 8588017 8655431 8706954 8756946 8805992 8859821 8906798 8954202 9003375 9061248 9126080
10610 9126080 9197915 9279501 9362721 9444168 9525566 9610557 9702311 9792731 9884156 9989388 10107506
10599 10107506 10228847 10367582 10509013 10649379 10781982 10882498 10955659 10987171 10957340 10854035
10589 10854035 10681503 10480324 10282083 10140615 10087671 10122414 10231450 10389335 10574498 10772169
10579 10772169 10976220 11180772 11381800 11568821 11753318 11936354 12124063 12307585 12502350
10570 12502350 12702491 12902028 13102533 13305975 13508895 13710349 13914061 14145151 14416681
10561 14416681 14727885 15073989 15447824 15850268 16287987 16753304 17248472 17781334 18378355
10552 18378355 19089632 19926757 20856295 21804904 22548777 22738273 21958928 19949225 16801146
10543 16801146 12987065 9166032 5959878 3802815 2794556 2753945 3335630 4231478 5224330
10534 5224330 6183096 7061436 7859177 8587162 9247897 9862028 10446873 11020783 11596515
10525 11596515 12174383 12753382 13318145 13876088 14440953 15018542 15620358 16250415 16920561
10516 16920561 17618860 18267047 18769343 19086567 19255333 19434164 19824771 20558682 21679837
10507 21679837 23165933 24941026 26830354 28544420 29573448 29218171 26861614 22364349
10499 22364349 16363606 10136725 5000424 1734226 344980 161871 256514 -53653 -877788
10490 -877788 -1820722 -2345349 -2178277 -1381765 -176928 1196066 2552217 3777923 4754652
10481 4754652 5388627 5678398 5766662 5890986 6235262 6824458 7582735 8412426 9242921 10046113
10471 10046113 10834899 11621778 12420353 13244733 14095095 14980343 15913466 16893077 17932427
10462 17932427 19051637 20281665 21636628 23144462 24775874 26463295 27987025 28970507
10454 28970507 28880182 27252179 23984123 19565195 14918169 11046231 8653106 7942331
10446 7942331 8648353 10282403 12397999 14686439 16965554 19188816 21426426 23783416
10438 23783416 26331397 29100934 32138761 35507405 39295845 43578032 48430410 53945573
10430 53945573 60244675 67340004 74835414 81276114 82922800 72634640 42586516 -4458257
10422 -4458257 -49587400 -76555869 -85261684 -83424158 -77444237 -70547900 -63980093 -58119043
10414 -58119043 -53033067 -48633931 -44803365 -41463289 -38534986 -35940800 -33659050 -31682445
10406 -31682445 -30005281 -28589407 -27323122 -26090971 -24852472 -23652688 -22530996 -21491924
10398 -21491924 -20539270 -19662252 -18836435 -18057170 -17321679 -16618800 -15962437 -15347035 -14766396
10389 -14766396 -14222231 -13703452 -13215994 -12742510 -12284073 -11855387 -11450824 -11063741 -10698361
10380 -10698361 -10350396 -10018408 -9700426 -9388532 -9076594 -8772702 -8469132 -8169836 -7877999
10371 -7877999 -7600745 -7332391 -7084709 -6844418 -6612666 -6394093 -6188485 -5985912 -5787763
10362 -5787763 -5584947 -5387141 -5194106 -4995552 -4791694 -4591637 -4387683 -4200199 -4020910
10353 -4020910 -3848361 -3696305 -3548777 -3388776 -3224879 -3061528 -2896647 -2739916 -2578031
10344 -2578031 -2410877 -2256998 -2121391 -1990614 -1869777 -1738462 -1615322 -1494114 -1366720
10335 -1366720 -1236066 -1111913 -1004616 -897994 -781349 -654521 -525673 -384073 -224097
10326 -224097 -58548 90539 207817 306126 389061 480134 580354 680288 781816 885970
10316 885970 991761 1092560 1200903 1312805 1418045 1529790 1639458 1758217 1875450 1999969
10306 1999969 2126075 2249683 2384846 2517470 2652870 2791620 2905505 2976137 3007895 3035863
10296 3035863 3093893 3186042 3290818 3403259 3523972 3652144 3774980 3894254 4021949 4151305
10286 4151305 4271771 4402954 4532682 4665474 4802589 4936568 5069488 5201267 5338282
10277 5338282 5475594 5614930 5767875 5923005 6077547 6242414 6411976 6564314 6696667
10268 6696667 6828804 6966023 7117357 7275318 7432483 7593237 7755908 7925096 8105590
10259 8105590 8287597 8472360 8657865 8841990 9030283 9231392 9432476 9634817 9841310
10250 9841310 10052523 10249764 10448945 10655635 10868273 11095550 11327372 11567392 11818241
10241 11818241 12081779 12352416 12616476 12883156 13143724 13408015 13691798 13993777 14304215
10232 14304215 14619704 14942599 15284157 15645088 16011575 16392214 16785707 17189517 17614954
10223 17614954 18042812 18486787 18938954 19401790 19894442 20406233 20948155 21537368 22172830
10214 22172830 22841867 23544575 24286523 25052645 25858029 26713565 27624603 28599210 29655908
10205 29655908 30807499 32051175 33379258 34777880 36217792 37587262 38638574 39087320
10197 39087320 39019902 39097518 39953863 41642469 43879437 46396430 49089502 51922075 54846717
10188 54846717 57778019 60806205 64311229 68698018 74170678 80752107 88497676 97585529
10180 97585529 108280625 120915914 135864422 153367806 172852711 191516507 200956937
10173 200956937 181587276 109110570 -10321180 -124189480 -187653914 -201755987 -190186732
10166 -190186732 -171377785 -153297736 -137807985 -124576991 -113174489 -103360268 -94907188
10159 -94907188 -87624365 -81337711 -75957491 -71491848 -67968941 -65213888 -62809945 -60433886
10151 -60433886 -58005223 -55556522 -53179011 -50942900 -48888763 -47015339 -45285458 -43659282
10143 -43659282 -42115888 -40652844 -39277312 -38005019 -36843428 -35768541 -34751768 -33793968
10135 -33793968 -32883870 -32009823 -31176213 -30405659 -29682814 -29003570 -28391925 -27836938 -27300818
10126 -27300818 -26769122 -26229406 -25692195 -25166021 -24655817 -24171532 -23709062 -23270012 -22856654
10117 -22856654 -22465137 -22089784 -21728763 -21375150 -21025545 -20681338 -20343883 -20013559 -19696811
10108 -19696811 -19394351 -19098978 -18800536 -18515509 -18234046 -17967848 -17724567 -17485771 -17252280
10099 -17252280 -17024997 -16801270 -16591097 -16373235 -16155690 -15941298 -15727410 -15529425 -15345629
10090 -15345629 -15167172 -14982184 -14802339 -14637095 -14472312 -14312096 -14159887 -14025549 -13897722
10081 -13897722 -13771243 -13657267 -13558110 -13446590 -13332674 -13217617 -13082860 -12953596 -12823495
10072 -12823495 -12702838 -12587649 -12482806 -12376391 -12268683 -12160895 -12040245 -11920655 -11799940
10063 -11799940 -11677955 -11559534 -11445923 -11336745 -11235228 -11128340 -11025745 -10912026 -10800027
10054 -10800027 -10697464 -10590426 -10480464 -10370226 -10261318 -10153910 -10067553 -10008030 -9972440 -9944284
10044 -9944284 -9915264 -9864136 -9786316 -9696299 -9604105 -9519420 -9431872 -9350207 -9273455 -9205778 -9164025
10033 -9164025 -9157053 -9149641 -9098780 -9022398 -8955725 -8889237 -8815528 -8727997 -8642707 -8553522 -8457155 -8363009
10021 -8363009 -8274652 -8180058 -8074253 -7978581 -7922764 -7898256 -7873622 -7844327 -7799338 -7740583 -7668683
10010 -7668683 -7598718 -7528164 -7443403 -7358562 -7276446 -7192036 -7095291 -7007955 -6949452 -6952638 -7042356
9999 -7042356 -7215218 -7393665 -7499456 -7520446 -7496143 -7434911 -7360950 -7280598 -7195955 -7116905 -7041198
9988 -7041198 -6977255 -6917521 -6873180 -6843856 -6806959 -6759815 -6708687 -6661072 -6603257 -6543509 -6480987
9977 -6480987 -6420430 -6364372 -6313518 -6270775 -6231908 -6194208 -6161426 -6130446 -6097178 -6058221 -6017380
9966 -6017380 -5974402 -5937437 -5900813 -5863880 -5829762 -5797997 -5758161 -5714896 -5670170 -5627476 -5583539
9955 -5583539 -5545544 -5517460 -5485303 -5447490 -5401978 -5367158 -5329608 -5284138 -5238100 -5185204 -5132037
9944 -5132037 -5088188 -5047714 -5009696 -4980647 -4952553 -4922980 -4893979 -4859493 -4819558 -4785556 -4751288
9933 -4751288 -4712713 -4670964 -4637906 -4603045 -4565256 -4535770 -4505900 -4465174 -4418582 -4383762 -4346271
9922 -4346271 -4298171 -4265586 -4253376 -4249853 -4250239 -4234852 -4202496 -4160941 -4123531 -4090611 -4058350 -4021094
9910 -4021094 -3985181 -3935539 -3890622 -3849361 -3810872 -3769607 -3735644 -3703708 -3667518 -3632721 -3594717
9899 -3594717 -3566936 -3530513 -3497656 -3462354 -3426365 -3391655 -3353391 -3318673 -3285330 -3253434 -3225422
9888 -3225422 -3207666 -3180149 -3137264 -3093109 -3041398 -2999208 -2959427 -2923758 -2881289 -2836193 -2790317
9877 -2790317 -2747551 -2713872 -2680190 -2642223 -2597572 -2549160 -2507931 -2466947 -2426603 -2374686 -2318837
9866 -2318837 -2264169 -2220350 -2191766 -2167368 -2138564 -2103834 -2059463 -2011875 -1961849 -1901923 -1841244
9855 -1841244 -1788837 -1731837 -1671866 -1612933 -1556378 -1499056 -1444259 -1384885 -1324154 -1268289 -1205144
9844 -1205144 -1147246 -1089866 -1023810 -948484 -869651 -786492 -702349 -613901 -524629 -425889 -324326
9833 -324326 -221219 -111219 12044 136972 272026 406640 551847 709463 873812 1048994
9823 1048994 1237491 1438250 1659903 1910479 2183556 2484961 2805952 3109029 3309870 3262930
9813 3262930 2818909 1972114 879851 -322954 -1491132 -2361110 -2759596 -2741460 -2487688
9804 -2487688 -2142906 -1774291 -1415851 -1081019 -769868 -477054 -197026 86332 360564 626885
9794 626885 904497 1195126 1493798 1808954 2138513 2495585 2876226 3279441 3703875 4133307
9784 4133307 4537581 4876749 5153589 5436153 5847818 6434482 7197262 8101177 9050489 9850986
9774 9850986 10108099 9233285 6845485 3283964 -433448 -3122442 -4264946 -4230821 -3740935
9765 -3740935 -3452668 -3779515 -4750614 -6013409 -7059971 -7509781 -7323445 -6730892 -5974548
9756 -5974548 -5182179 -4397735 -3647443 -2947439 -2365518 -1955053 -1722399 -1576587 -1398906 -1139694
9746 -1139694 -801057 -412232 -59039 139330 224343 439366 952744 1718071 2641564 3649151
9736 3649151 4687270 5640984 6227827 6005563 4566778 2166915 -50535 -1107690 -989199
9727 -989199 -339941 32897 -539235 -2274671 -5043798 -8437642 -11624007 -13798020 -14888621
9718 -14888621 -15283501 -15275840 -14943570 -14308859 -13456623 -12571149 -11828855 -11357100 -11113804 -10849822
9708 -10849822 -10401907 -9832618 -9224165 -8644838 -8159113 -7807122 -7538752 -7210827 -6772613
9699 -6772613 -6250434 -5683045 -5100477 -4510620 -3922530 -3397448 -3043207 -2952480 -3057505 -3081702
9689 -3081702 -2814142 -2309920 -1803276 -1534133 -1678441 -2307363 -3469971 -5214410 -7416165
9680 -7416165 -9676983 -11649287 -13374514 -14874385 -15819382 -16001570 -15596258 -14932956 -14261577
9671 -14261577 -13702925 -13257854 -12858544 -12446047 -12019424 -11598515 -11211244 -10868281 -10542836
9662 -10542836 -10244651 -9964178 -9691407 -9418223 -9155879 -8898439 -8653967 -8418413 -8188523
9653 -8188523 -7957371 -7719044 -7478753 -7233651 -6991132 -6744434 -6491428 -6236013 -5983834 -5760930
9643 -5760930 -5658203 -5793476 -6247738 -6958884 -7783863 -8645609 -9448146 -9984605 -10162204 -10072740
9633 -10072740 -9844439 -9575416 -9314575 -9074139 -8858668 -8662749 -8485166 -8327859 -8178223
9624 -8178223 -8056214 -7947625 -7839837 -7738110 -7642860 -7555447 -7462925 -7367061 -7282183 -7207156 -7140006
9613 -7140006 -7069405 -6995440 -6922983 -6863186 -6802778 -6745926 -6689381 -6639721 -6590078 -6539165 -6492002
9602 -6492002 -6444959 -6391721 -6344164 -6300007 -6259336 -6224940 -6191545 -6157303 -6124968 -6100633 -6067018
9591 -6067018 -6021910 -5972733 -5937159 -5898408 -5860479 -5834614 -5804338 -5769533 -5740390 -5713773 -5683621
9580 -5683621 -5646913 -5606868 -5569579 -5544257 -5523164 -5502785 -5480388 -5461496 -5433741 -5395279 -5367877
9569 -5367877 -5341779 -5318609 -5292445 -5269844 -5250191 -5223263 -5202557 -5179417 -5153510 -5133099 -5111196
9558 -5111196 -5096435 -5077012 -5058501 -5040597 -5023724 -5002271 -4976574 -4963492 -4949859 -4925828 -4910509
9547 -4910509 -4886674 -4864176 -4846845 -4833816 -4815351 -4797570 -4777988 -4756045 -4743743 -4725547 -4710607
9536 -4710607 -4696030 -4682751 -4665036 -4642733 -4621645 -4601945 -4584114 -4571063 -4562696 -4546449 -4524904 -4508538
9524 -4508538 -4498154 -4486812 -4471589 -4462169 -4447316 -4423966 -4408144 -4385457 -4373412 -4359722 -4354644 -4350787
9512 -4350787 -4339736 -4325752 -4311356 -4296649 -4286954 -4267888 -4244097 -4230020 -4220859 -4209743 -4206581 -4198316
9500 -4198316 -4178521 -4164273 -4150327 -4136245 -4130896 -4129385 -4110000 -4083709 -4068137 -4055817 -4044079 -4033308
9488 -4033308 -4029301 -4025771 -4012696 -3994619 -3985312 -3968590 -3953888 -3944684 -3933053 -3920494 -3907271 -3898881
9476 -3898881 -3893204 -3889139 -3878383 -3863830 -3853687 -3845489 -3840640 -3833226 -3817769 -3806291 -3791368 -3782976 -3769896
9463 -3769896 -3754187 -3744462 -3743133 -3739668 -3723060 -3708931 -3693731 -3679843 -3668116 -3662787 -3651046 -3640190
9451 -3640190 -3635931 -3624511 -3613911 -3610959 -3603458 -3593518 -3584338 -3572429 -3562312 -3546363 -3540669 -3535624 -3527191
9438 -3527191 -3519814 -3508285 -3500573 -3482587 -3471082 -3459948 -3453303 -3450687 -3442164 -3428927 -3414098 -3398650
9426 -3398650 -3395498 -3396643 -3387353 -3375733 -3362393 -3349870 -3345245 -3340247 -3331957 -3320751 -3309898 -3308971 -3296513
9413 -3296513 -3283148 -3269769 -3255286 -3247785 -3253664 -3259313 -3257717 -3251561 -3245117 -3240949 -3228658 -3217347 -3207944
9400 -3207944 -3199649 -3197485 -3189440 -3180854 -3166531 -3150287 -3147788 -3142483 -3135186 -3121978 -3109553 -3098683 -3095917
9387 -3095917 -3087605 -3079020 -3075211 -3065033 -3054384 -3041868 -3025517 -3017521 -3012733 -3004260 -2994307 -2977854 -2970367
9374 -2970367 -2953577 -2940965 -2930118 -2918927 -2909643 -2901465 -2914089 -2928574 -2935084 -2936242 -2931343 -2920772
9362 -2920772 -2923460 -2925327 -2920545 -2910818 -2914538 -2912232 -2901359 -2888199 -2882606 -2875784 -2860591 -2848969 -2841153
9349 -2841153 -2836340 -2834059 -2820558 -2811274 -2800004 -2784220 -2778976 -2770104 -2755693 -2743255 -2741948 -2735934 -2728787
9336 -2728787 -2712947 -2699784 -2687545 -2674773 -2666561 -2656882 -2651062 -2643090 -2638289 -2642833 -2651897 -2654470 -2648367
9323 -2648367 -2641157 -2630866 -2633484 -2636662 -2635338 -2639186 -2645424 -2647334 -2643280 -2642229 -2633552 -2627431 -2616366 -2601699
9309 -2601699 -2589705 -2581126 -2582415 -2571990 -2558066 -2550922 -2539653 -2539544 -2532626 -2527138 -2521014 -2514165 -2502753
9296 -2502753 -2492735 -2487677 -2477668 -2464254 -2449054 -2438243 -2424495 -2412675 -2401774 -2395108 -2389554 -2387308
9284 -2387308 -2376614 -2368642 -2359368 -2357443 -2357092 -2342250 -2336356 -2346491 -2363354 -2372315 -2373839 -2369141 -2357881
9271 -2357881 -2346581 -2335686 -2325302 -2317108 -2315435 -2304949 -2287623 -2278008 -2273514 -2261894 -2252091 -2241793
9259 -2241793 -2236319 -2232008 -2225905 -2219669 -2211672 -2207174 -2199860 -2189520 -2182814 -2171092 -2157676 -2149279 -2137081
9246 -2137081 -2123715 -2116960 -2108733 -2097335 -2088455 -2086146 -2082968 -2072516 -2067644 -2059375 -2055390 -2055202 -2046003 -2042200
9232 -2042200 -2031365 -2025376 -2026189 -2016945 -2006544 -2000938 -1992610 -1984673 -1979695 -1967879 -1954840 -1939911 -1934233
9219 -1934233 -1927709 -1919961 -1909262 -1903292 -1894266 -1878981 -1870758 -1866110 -1856883 -1840590 -1834234 -1831604 -1819375
9206 -1819375 -1804482 -1794185 -1790190 -1791664 -1781797 -1772207 -1764937 -1756132 -1745639 -1734548 -1730271 -1722593 -1706813
9193 -1706813 -1693314 -1684257 -1675943 -1670222 -1666300 -1655018 -1642185 -1629432 -1628708 -1623955 -1615851 -1604147 -1596827
9180 -1596827 -1585099 -1573717 -1560286 -1548625 -1545014 -1541466 -1537798 -1525312 -1506563 -1491394 -1488827 -1481429
9168 -1481429 -1476693 -1473118 -1465203 -1456993 -1441623 -1425195 -1420302 -1420499 -1409348 -1398514 -1389452 -1381228 -1378196
9155 -1378196 -1361351 -1347490 -1339552 -1332448 -1321180 -1307921 -1297559 -1294927 -1295483 -1288618 -1282752 -1274378 -1264883
9142 -1264883 -1262338 -1251925 -1237827 -1230909 -1221318 -1216284 -1212089 -1207617 -1200923 -1191150 -1184088 -1173408 -1168166
9129 -1168166 -1163810 -1159148 -1157089 -1151650 -1145981 -1146001 -1144510 -1140098 -1134770 -1134776 -1128542 -1120013 -1115738 -1122021 -1117625
9114 -1117625 -1109018 -1111583 -1118594 -1119893 -1123655 -1124211 -1121924 -1122252 -1128455 -1126785 -1132366 -1136504 -1134107 -1137073 -1150437
9099 -1150437 -1163768 -1174278 -1187177 -1201613 -1215324 -1224742 -1236530 -1250565 -1265691 -1287245 -1303986 -1316938
9087 -1316938 -1332320 -1348736 -1369574 -1392513 -1426039 -1465493 -1495663 -1517523 -1542539 -1573533 -1600386
9076 -1600386 -1632958 -1664922 -1702777 -1734569 -1770950 -1806686 -1833128 -1871796 -1918077 -1959185 -2000132
9065 -2000132 -2048014 -2087227 -2131013 -2170700 -2219602 -2270303 -2313149 -2358622 -2403632 -2448151 -2492069
9054 -2492069 -2528866 -2572393 -2622456 -2670765 -2716139 -2753969 -2797042 -2846211 -2893740 -2937739 -2982770
9043 -2982770 -3026435 -3068774 -3108617 -3148977 -3190408 -3226166 -3261434 -3295904 -3327581 -3356577 -3391463
9032 -3391463 -3431484 -3456636 -3474809 -3496561 -3526151 -3560271 -3587804 -3606558 -3630601 -3655790 -3683193
9021 -3683193 -3699895 -3719816 -3733739 -3747690 -3775798 -3793460 -3804137 -3811578 -3821075 -3831652 -3842622 -3847660
9009 -3847660 -3858368 -3875166 -3883371 -3885847 -3892109 -3893989 -3894937 -3902777 -3905892 -3906262 -3906782 -3907578 -3916679 -3928161
8995 -3928161 -3922850 -3919017 -3915865 -3912389 -3915147 -3911106 -3902696 -3903113 -3905688 -3898293 -3893049 -3889309 -3892854 -3882277
8981 -3882277 -3871231 -3861136 -3858038 -3863464 -3854378 -3851370 -3858265 -3852913 -3838493 -3835633 -3827411 -3817135 -3814672
8968 -3814672 -3808652 -3804059 -3794319 -3785598 -3775773 -3769192 -3757911 -3744137 -3731763 -3722274 -3715569 -3710575 -3705740
8955 -3705740 -3698291 -3695404 -3694754 -3690267 -3681961 -3672722 -3656314 -3643553 -3629712 -3616420 -3612106 -3603352 -3600651
8942 -3600651 -3602418 -3597318 -3588481 -3579640 -3567102 -3558834 -3552153 -3541068 -3539581 -3533812 -3523075 -3514851 -3505103
8929 -3505103 -3495592 -3479327 -3469089 -3471119 -3465559 -3454128 -3449484 -3450178 -3443017 -3425045 -3416010 -3415133 -3405425 -3400122
8915 -3400122 -3394723 -3391624 -3385439 -3373042 -3365600 -3357146 -3347352 -3343075 -3331265 -3323192 -3318530 -3310316 -3298135
8902 -3298135 -3291865 -3291406 -3299256 -3293853 -3278855 -3273142 -3267877 -3262770 -3255694 -3242422 -3236483 -3228635 -3218015 -3208945
8888 -3208945 -3200272 -3194933 -3185391 -3178469 -3176466 -3168185 -3163778 -3162567 -3160841 -3152988 -3147726 -3135529 -3132632 -3133334
8874 -3133334 -3128894 -3126697 -3120421 -3110524 -3099377 -3095469 -3096520 -3094121 -3089021 -3080427 -3065320 -3066346 -3061623 -3053380
8860 -3053380 -3049651 -3046039 -3038880 -3033831 -3023539 -3011848 -3010816 -3006004 -2997016 -2989679 -2987492 -2987980 -2986642 -2980222
8846 -2980222 -2974807 -2963317 -2954723 -2953068 -2956220 -2943494 -2931629 -2929213 -2928465 -2929457 -2927678 -2914320 -2909459 -2904309
8832 -2904309 -2901742 -2893511 -2887119 -2884896 -2887985 -2884570 -2878992 -2874812 -2868902 -2867532 -2863414 -2857265 -2849778 -2837189
8818 -2837189 -2837003 -2831152 -2824553 -2821282 -2816462 -2813932 -2809272 -2802377 -2800325 -2802366 -2800142 -2802199 -2800074 -2792876
8804 -2792876 -2789818 -2783240 -2775667 -2770157 -2769523 -2766638 -2764563 -2759968 -2758635 -2749565 -2741526 -2741982 -2733292 -2725291 -2723079
8789 -2723079 -2718913 -2714573 -2709948 -2702710 -2700322 -2707147 -2705923 -2696000 -2688787 -2683301 -2683926 -2684273 -2679740 -2673391 -2666953
8774 -2666953 -2661176 -2661595 -2661808 -2659615 -2654860 -2651893 -2648262 -2646445 -2652472 -2645243 -2638136 -2636163 -2633477 -2624365 -2621117
8759 -2621117 -2616742 -2616038 -2616250 -2618595 -2611891 -2604087 -2599975 -2594271 -2592581 -2590701 -2582518 -2577423 -2575597 -2577558 -2577837
8744 -2577837 -2567576 -2564550 -2568544 -2564011 -2556255 -2551731 -2547287 -2544348 -2540214 -2538614 -2536805 -2527401 -2528719 -2531157
8730 -2531157 -2529291 -2520881 -2520756 -2516385 -2508216 -2502391 -2497185 -2502064 -2499768 -2495208 -2493110 -2484291 -2478489 -2481776
8716 -2481776 -2477777 -2469971 -2465130 -2473975 -2479722 -2481424 -2482337 -2473510 -2466140 -2465307 -2462613 -2451497 -2450517 -2444620 -2440031
8701 -2440031 -2444676 -2442030 -2438168 -2430243 -2428211 -2424752 -2422935 -2421445 -2420913 -2426918 -2424259 -2416250 -2414758 -2404276
8687 -2404276 -2405995 -2402255 -2404319 -2413168 -2408116 -2406307 -2395167 -2388061 -2391416 -2393530 -2390647 -2386199 -2385557 -2391293
8673 -2391293 -2386367 -2374294 -2367328 -2368796 -2365222 -2361665 -2368360 -2372870 -2363998 -2349815 -2348508 -2347187 -2345872 -2340230
8659 -2340230 -2335757 -2333376 -2337715 -2337361 -2339679 -2338201 -2329726 -2319054 -2319813 -2320788 -2317925 -2318460 -2320377 -2320501 -2312931
8644 -2312931 -2300227 -2293880 -2295084 -2291472 -2290231 -2292840 -2293079 -2284050 -2271820 -2267984 -2268660 -2273615 -2268538 -2267599
8630 -2267599 -2277526 -2282973 -2272320 -2264922 -2261986 -2259643 -2257874 -2257427 -2257371 -2253423 -2252809 -2246616 -2245348 -2242478 -2237567
8615 -2237567 -2239897 -2241922 -2238223 -2224969 -2220416 -2220125 -2224842 -2223747 -2219624 -2222725 -2223550 -2223674 -2230936 -2226338 -2217877
8600 -2217877 -2213186 -2209399 -2214658 -2208661 -2201081 -2203476 -2202358 -2200981 -2199759 -2202018 -2194848 -2197410 -2196838 -2194131
8586 -2194131 -2194695 -2186092 -2184523 -2187102 -2186585 -2190753 -2186748 -2183437 -2183041 -2180771 -2180003 -2182819 -2184356 -2180274 -2172231
8571 -2172231 -2168758 -2169052 -2168320 -2165552 -2162471 -2155809 -2157051 -2155688 -2153038 -2146868 -2143183 -2142975 -2140767 -2140128 -2139744
8556 -2139744 -2144846 -2146097 -2143016 -2131406 -2123280 -2122731 -2126146 -2126382 -2123269 -2122350 -2120329 -2120881 -2124342 -2120885 -2114627
8541 -2114627 -2115395 -2109388 -2108716 -2108112 -2104091 -2103793 -2099984 -2100098 -2100785 -2097923 -2092473 -2090349 -2084771 -2083259 -2078822 -2071955
8525 -2071955 -2074794 -2076725 -2077945 -2080973 -2085861 -2082858 -2080867 -2075344 -2066883 -2063600 -2066835 -2063664 -2051325 -2048740
8511 -2048740 -2048188 -2050400 -2050112 -2053213 -2054884 -2056895 -2060643 -2053335 -2045929 -2040749 -2037897 -2036655 -2034973 -2030945 -2032476
8496 -2032476 -2039391 -2039566 -2037359 -2036771 -2031408 -2033266 -2026544 -2021492 -2021231 -2022513 -2021787 -2014690 -2011799 -2016302 -2015380
8481 -2015380 -2008265 -2008629 -2004922 -2005875 -2010674 -2012255 -2009237 -2002812 -1997760 -2000887 -2001500 -1999232 -1994377 -1991578 -1987944
8466 -1987944 -1990085 -1993179 -1994111 -1994593 -2003237 -1997141 -1980704 -1974433 -1975277 -1980724 -1980035 -1972269 -1980819 -1974463 -1964913
8451 -1964913 -1963180 -1961716 -1960456 -1960822 -1961796 -1964749 -1962419 -1956690 -1950907 -1947315 -1945430 -1940897 -1946480 -1950393 -1954410
8436 -1954410 -1953533 -1952864 -1949763 -1948940 -1945106 -1941251 -1942203 -1936303 -1929225 -1931187 -1926132 -1919584 -1919379 -1920196 -1923833 -1926399
8420 -1926399 -1923820 -1918683 -1917624 -1921881 -1921345 -1916216 -1913133 -1915202 -1918228 -1917540 -1909686 -1910219 -1908261 -1897949 -1892233
8405 -1892233 -1891850 -1889589 -1889597 -1892575 -1891962 -1892798 -1901513 -1908622 -1905047 -1904455 -1903331 -1901187 -1888635 -1874554 -1874580 -1876658
8389 -1876658 -1881287 -1887598 -1885866 -1876505 -1872111 -1874882 -1873412 -1869508 -1862497 -1859663 -1858744 -1853826 -1852893 -1853588 -1860584
8374 -1860584 -1866744 -1859947 -1854778 -1852261 -1851386 -1847371 -1847610 -1855080 -1855339 -1857199 -1848923 -1840209 -1846093 -1848657 -1842876
8359 -1842876 -1836508 -1828859 -1825528 -1831289 -1834661 -1830376 -1829769 -1826488 -1824945 -1820159 -1811573 -1809630 -1806025 -1807637
8345 -1807637 -1821813 -1832717 -1836239 -1834972 -1832134 -1829174 -1820652 -1817901 -1812474 -1813955 -1809483 -1800202 -1802941 -1807901
8331 -1807901 -1813933 -1813270 -1811437 -1814867 -1812381 -1814497 -1809704 -1804742 -1807116 -1806068 -1802645 -1799356 -1797751 -1799456
8317 -1799456 -1797942 -1797783 -1797552 -1794680 -1795623 -1793957 -1788994 -1786350 -1782506 -1781591 -1774543 -1772118 -1775519 -1773174 -1779475
8302 -1779475 -1786151 -1785976 -1780753 -1779832 -1780107 -1783709 -1777135 -1773003 -1766695 -1765135 -1763007 -1758979 -1760522 -1759244 -1757977
8287 -1757977 -1762262 -1775204 -1788759 -1792289 -1793241 -1786034 -1779917 -1778974 -1781864 -1782588 -1791585 -1792829 -1780129 -1776542
8273 -1776542 -1775259 -1769182 -1764962 -1765112 -1766423 -1761199 -1749607 -1745422 -1748455 -1759483 -1764662 -1758925 -1758009 -1754501
8259 -1754501 -1756540 -1745923 -1734512 -1732845 -1737586 -1740354 -1745584 -1738220 -1736482 -1734147 -1733814 -1729067 -1718953 -1717761
8245 -1717761 -1715573 -1712409 -1711804 -1714553 -1722067 -1724843 -1730741 -1735722 -1732265 -1730923 -1722605 -1720192 -1722967 -1725631
8231 -1725631 -1722623 -1722907 -1722812 -1719056 -1714232 -1714677 -1722236 -1716991 -1709074 -1703423 -1702004 -1701110 -1703937 -1703591 -1703411 -1697341
8215 -1697341 -1691748 -1696678 -1708436 -1715549 -1709897 -1698366 -1695355 -1692583 -1696663 -1697268 -1689990 -1691842 -1692855 -1695022
8201 -1695022 -1695172 -1686364 -1682271 -1680618 -1678229 -1684867 -1687651 -1687362 -1684491 -1681492 -1671656 -1666426 -1664508 -1662430 -1664038
8186 -1664038 -1668136 -1668856 -1669125 -1675265 -1675061 -1672084 -1668015 -1667563 -1666819 -1668170 -1668121 -1667087 -1663091 -1664769 -1656945 -1653319
8170 -1653319 -1649190 -1648744 -1647483 -1646829 -1646828 -1649437 -1645778 -1645896 -1650161 -1642410 -1642119 -1640499 -1632770 -1634701 -1642567 -1647136
8154 -1647136 -1647709 -1641287 -1638152 -1636847 -1632950 -1635868 -1647434 -1643849 -1639067 -1630104 -1625373 -1629927 -1630991 -1630070
8140 -1630070 -1631764 -1631175 -1630690 -1630971 -1627835 -1625299 -1628386 -1626811 -1631979 -1625036 -1618238 -1616756 -1622245 -1620830 -1615315
8125 -1615315 -1614051 -1611922 -1615604 -1610922 -1607995 -1604561 -1602345 -1601072 -1604792 -1609176 -1608735 -1608956 -1605562 -1604440 -1605122
8110 -1605122 -1603753 -1605181 -1599920 -1595569 -1596446 -1605580 -1609140 -1608032 -1605139 -1599475 -1600606 -1593441 -1583992 -1580337
8096 -1580337 -1584864 -1589484 -1589947 -1592635 -1596094 -1594230 -1584105 -1580625 -1579518 -1571225 -1569164 -1568225 -1573533 -1582302
8082 -1582302 -1579963 -1565336 -1563617 -1566161 -1565607 -1567623 -1570415 -1577214 -1574568 -1566473 -1565443 -1567814 -1569313 -1565572
8068 -1565572 -1553602 -1545689 -1545582 -1551587 -1555806 -1552434 -1553471 -1557371 -1546133 -1538656 -1546513 -1552279 -1549206 -1545611
8054 -1545611 -1538445 -1542853 -1546604 -1543319 -1538100 -1535129 -1535951 -1542695 -1545440 -1548538 -1545583 -1543279 -1537967 -1530238
8040 -1530238 -1529771 -1526223 -1525183 -1524609 -1533304 -1537067 -1531772 -1529309 -1522130 -1519027 -1518727 -1523139 -1522870 -1522995 -1523812 -1522216
8024 -1522216 -1522066 -1514498 -1509353 -1512740 -1512998 -1506003 -1508019 -1505927 -1503855 -1509153 -1511305 -1511546 -1506841 -1504833 -1506468
8009 -1506468 -1517137 -1531685 -1534331 -1531848 -1530017 -1531193 -1536512 -1533763 -1537816 -1530123 -1525511 -1520899 -1519288 -1520866
7995 -1520866 -1513374 -1513360 -1515572 -1511962 -1509478 -1510246 -1508974 -1504173 -1501404 -1502389 -1503826 -1494898 -1487242 -1490762 -1499469
7980 -1499469 -1499305 -1502568 -1504921 -1504731 -1509574 -1509324 -1507839 -1497347 -1496658 -1495966 -1489805 -1489706 -1498443 -1502681 -1506876 -1504356
7964 -1504356 -1504673 -1503016 -1504919 -1509566 -1507101 -1505567 -1499321 -1493918 -1491191 -1493722 -1492212 -1488448 -1486491 -1486854 -1489948
7949 -1489948 -1495399 -1499681 -1495376 -1496772 -1499020 -1499952 -1499068 -1494247 -1487932 -1483292 -1481391 -1482220 -1486431 -1489618 -1489467
7934 -1489467 -1482560 -1472010 -1472415 -1475680 -1474472 -1480426 -1489487 -1489030 -1491358 -1487668 -1481448 -1477378 -1469410 -1467795
7920 -1467795 -1466725 -1468100 -1468220 -1466635 -1465743 -1466855 -1470752 -1479096 -1471290 -1463339 -1462511 -1463112 -1457551 -1456760 -1453342
7905 -1453342 -1445896 -1449659 -1452730 -1463040 -1466856 -1460275 -1456841 -1452049 -1455656 -1450567 -1444474 -1448293 -1450910 -1452277
7891 -1452277 -1453544 -1449535 -1445328 -1444898 -1449263 -1447025 -1443379 -1445109 -1444671 -1446386 -1452870 -1452131 -1447460 -1448182 -1448657
7876 -1448657 -1443414 -1441825 -1439965 -1441860 -1443363 -1439472 -1440512 -1438543 -1438744 -1439363 -1436559 -1435194 -1432112 -1433669 -1432084
7861 -1432084 -1434828 -1436513 -1436791 -1432912 -1420985 -1418908 -1416399 -1415072 -1415653 -1417171 -1419896 -1419984 -1417198 -1417337 -1407931
7846 -1407931 -1405795 -1412562 -1418492 -1417376 -1418572 -1416431 -1414905 -1416556 -1417614 -1416365 -1417300 -1418672 -1422555 -1421355
7832 -1421355 -1415091 -1411002 -1414663 -1411279 -1413263 -1412523 -1408943 -1410495 -1413468 -1413923 -1405526 -1402466 -1399242 -1400093 -1406681
7817 -1406681 -1402968 -1401962 -1394819 -1389309 -1388743 -1395878 -1398007 -1394873 -1392840 -1387410 -1386857 -1381804 -1386670 -1393827 -1396017
7802 -1396017 -1393273 -1389946 -1389536 -1387853 -1383308 -1379206 -1382921 -1387948 -1394500 -1390238 -1395252 -1398209 -1390201 -1389115
7788 -1389115 -1392328 -1394969 -1390523 -1380699 -1379412 -1387188 -1395893 -1392285 -1382555 -1372672 -1372346 -1373499 -1376354 -1368716
7774 -1368716 -1363925 -1370948 -1375079 -1376649 -1371709 -1364976 -1365482 -1362607 -1356597 -1359770 -1369892 -1376003 -1370557 -1367075
7760 -1367075 -1368113 -1363530 -1362632 -1364537 -1359341 -1357158 -1356626 -1362699 -1365069 -1365544 -1370028 -1369114 -1357964 -1350886 -1352302
7745 -1352302 -1348746 -1349869 -1345885 -1349498 -1351233 -1346071 -1338996 -1340157 -1348282 -1350026 -1348058 -1343773 -1341329 -1341676
7731 -1341676 -1340516 -1345246 -1345314 -1345403 -1347224 -1351200 -1354971 -1356244 -1342901 -1342096 -1339254 -1337154 -1339871 -1338219 -1336488
7716 -1336488 -1341147 -1343346 -1338244 -1336534 -1338940 -1342382 -1337519 -1333613 -1335858 -1336506 -1337194 -1335564 -1340856 -1344980 -1340806
7701 -1340806 -1330057 -1325898 -1332282 -1332204 -1330852 -1330847 -1335964 -1335205 -1330147 -1329459 -1327785 -1330634 -1323108 -1320690 -1322131 -1315962
7685 -1315962 -1309267 -1308474 -1308223 -1309793 -1320087 -1324173 -1321492 -1324842 -1319432 -1311964 -1305787 -1308822 -1304520 -1300899
7671 -1300899 -1296460 -1298004 -1298616 -1300616 -1305142 -1306287 -1307663 -1309660 -1307546 -1308205 -1315822 -1321408 -1323760 -1318655 -1320119
7656 -1320119 -1311357 -1311271 -1311096 -1307939 -1305136 -1302806 -1303493 -1302952 -1299664 -1299990 -1297640 -1300221 -1301378 -1302840 -1302644 -1299630
7640 -1299630 -1295099 -1293641 -1299401 -1297797 -1294178 -1298530 -1304564 -1302772 -1304592 -1308435 -1305579 -1296990 -1293764 -1285047
7626 -1285047 -1278042 -1283604 -1285140 -1288639 -1293406 -1292875 -1288879 -1282852 -1287375 -1293286 -1289961 -1279354 -1271189 -1274100
7612 -1274100 -1281534 -1284465 -1278749 -1273879 -1274498 -1273265 -1279373 -1289973 -1287217 -1280520 -1282806 -1286454 -1286135 -1282762
7598 -1282762 -1289497 -1289044 -1283179 -1277050 -1270097 -1274152 -1276844 -1274302 -1271677 -1271356 -1272692 -1276162 -1279597 -1278292 -1274245
7583 -1274245 -1270271 -1269940 -1267905 -1274280 -1272912 -1271485 -1269793 -1272374 -1274107 -1267606 -1272015 -1267447 -1262737 -1265734
7569 -1265734 -1268912 -1277215 -1274530 -1269081 -1259600 -1260874 -1270900 -1274234 -1267691 -1261590 -1261584 -1266857 -1267030 -1264165 -1258573
7554 -1258573 -1259054 -1261335 -1255758 -1252074 -1250179 -1253714 -1252354 -1247384 -1244488 -1246036 -1253481 -1252886 -1257368 -1255368 -1253527
7539 -1253527 -1247640 -1244856 -1244766 -1243097 -1244087 -1242385 -1236401 -1233350 -1237547 -1244918 -1244227 -1244831 -1246126 -1246827 -1250985 -1253733
7523 -1253733 -1251814 -1248617 -1245554 -1246280 -1247993 -1250107 -1251837 -1250379 -1248885 -1239394 -1231885 -1235984 -1237438 -1232843
7509 -1232843 -1224068 -1233047 -1246588 -1249150 -1247606 -1242421 -1236288 -1230882 -1230507 -1231861 -1232938 -1233728 -1236748 -1236513 -1229969
7494 -1229969 -1230812 -1233571 -1239943 -1231286 -1221693 -1220888 -1220003 -1222767 -1228271 -1224363 -1229617 -1231429 -1226345 -1230137 -1227310
7479 -1227310 -1229517 -1232393 -1232324 -1236764 -1235451 -1228969 -1222833 -1217900 -1213626 -1210233 -1213407 -1213840 -1209999 -1207795 -1204748
7464 -1204748 -1203147 -1212562 -1217719 -1218844 -1214167 -1211512 -1209056 -1208788 -1210456 -1213906 -1217455 -1214059 -1210212 -1205313
7450 -1205313 -1208746 -1212389 -1206197 -1206709 -1210168 -1207115 -1211340 -1220213 -1219756 -1212019 -1205150 -1203399 -1197574 -1194975 -1195948
7435 -1195948 -1194666 -1194341 -1203475 -1200583 -1200477 -1199567 -1199554 -1203325 -1200229 -1200452 -1205536 -1204667 -1203089 -1193940 -1188240 -1191499
7419 -1191499 -1193524 -1197724 -1200236 -1201518 -1196108 -1192095 -1187497 -1190980 -1199260 -1201232 -1197804 -1194958 -1194941 -1194757 -1191768
7404 -1191768 -1192374 -1195272 -1201110 -1196923 -1192181 -1186573 -1185465 -1179801 -1177174 -1184253 -1186338 -1186909 -1184702 -1188338 -1196731
7389 -1196731 -1197802 -1196574 -1197529 -1195592 -1188563 -1185805 -1192236 -1192905 -1181284 -1173935 -1170474 -1177275 -1184319 -1184324 -1181047
7374 -1181047 -1176820 -1175546 -1173533 -1180805 -1180119 -1175604 -1174345 -1179000 -1179666 -1175099 -1173228 -1182356 -1187566 -1183723 -1176721
7359 -1176721 -1171742 -1171288 -1171253 -1165248 -1165504 -1158458 -1158768 -1161003 -1168162 -1174164 -1174897 -1176278 -1179066 -1173357 -1167984 -1167176
7343 -1167176 -1167933 -1168354 -1167823 -1164600 -1161087 -1167176 -1170108 -1168229 -1168469 -1168693 -1167813 -1161465 -1163654 -1161522 -1160743 -1163013
7327 -1163013 -1162854 -1165883 -1165091 -1156484 -1154013 -1149833 -1150383 -1147963 -1147252 -1139477 -1136799 -1138979 -1136946 -1137433 -1139822
7312 -1139822 -1141559 -1144973 -1153518 -1157076 -1152761 -1151962 -1145439 -1141022 -1151219 -1154076 -1155982 -1151007 -1145873 -1146941
7298 -1146941 -1150301 -1150689 -1147163 -1144857 -1146822 -1149778 -1151164 -1156683 -1155349 -1151897 -1160574 -1159046 -1156032 -1151779
7284 -1151779 -1147117 -1148965 -1149341 -1140304 -1138887 -1144758 -1136223 -1134178 -1136504 -1136950 -1134289 -1129903 -1127109 -1131313 -1134875
7269 -1134875 -1140254 -1140027 -1135625 -1134188 -1132804 -1135164 -1138974 -1141999 -1137958 -1134624 -1134082 -1131454 -1130200 -1131122 -1131391
7254 -1131391 -1131824 -1128605 -1128705 -1136084 -1128285 -1116958 -1110610 -1116878 -1125225 -1119231 -1120978 -1131580 -1129979 -1128686
7240 -1128686 -1125643 -1126677 -1122157 -1121512 -1122437 -1125479 -1123427 -1123209 -1121817 -1121038 -1115937 -1115588 -1118717 -1119028 -1116873 -1120436
7224 -1120436 -1123350 -1131423 -1128833 -1121422 -1121998 -1122056 -1121697 -1121925 -1123701 -1119008 -1110658 -1109462 -1109908 -1109916 -1106066 -1112245
7208 -1112245 -1107929 -1106345 -1110110 -1113892 -1110963 -1107288 -1108190 -1108434 -1102538 -1102226 -1106234 -1101431 -1096277 -1101516 -1107703
7193 -1107703 -1110670 -1112854 -1111555 -1109313 -1102095 -1104412 -1104861 -1103249 -1102528 -1104544 -1107323 -1108838 -1116436 -1115912 -1112825
7178 -1112825 -1113146 -1112923 -1110861 -1102013 -1099852 -1099910 -1099146 -1106118 -1107410 -1101242 -1093698 -1095203 -1098752 -1102604 -1101366
7163 -1101366 -1104116 -1105001 -1107546 -1106869 -1104529 -1098801 -1097174 -1098718 -1099638 -1097947 -1093851 -1086971 -1085797 -1088802 -1089961
7148 -1089961 -1090549 -1094998 -1102802 -1101777 -1102167 -1099703 -1097952 -1096774 -1092148 -1092202 -1080160 -1077815 -1085438 -1088465 -1091138
7133 -1091138 -1082708 -1086708 -1091240 -1093263 -1094673 -1098260 -1096614 -1091822 -1084699 -1083394 -1084279 -1084028 -1084690 -1087769 -1087891
7118 -1087891 -1090630 -1086777 -1087999 -1085175 -1081540 -1081620 -1082901 -1084467 -1080506 -1079780 -1079519 -1074677 -1076952 -1080224 -1085263
7103 -1085263 -1083765 -1078296 -1075291 -1074572 -1070138 -1068775 -1066423 -1068341 -1069891 -1069041 -1070189 -1078259 -1073855 -1067085 -1070565
7088 -1070565 -1063827 -1064027 -1068515 -1068134 -1059974 -1062085 -1062113 -1057818 -1056625 -1061643 -1067069 -1071959 -1071904 -1076108 -1070014 -1065160
7072 -1065160 -1061255 -1058244 -1058911 -1063085 -1064989 -1069149 -1065346 -1061820 -1056917 -1061145 -1063415 -1051819 -1052537 -1056752
7058 -1056752 -1058913 -1060280 -1059238 -1052044 -1049827 -1057223 -1059355 -1061360 -1066526 -1064613 -1056916 -1046138 -1044934 -1049860
7044 -1049860 -1053684 -1057631 -1054162 -1055054 -1050112 -1052940 -1053357 -1052985 -1048647 -1045217 -1042169 -1042308 -1040472 -1041236 -1046209
7029 -1046209 -1046556 -1047478 -1043324 -1040099 -1045041 -1046649 -1042099 -1041868 -1047970 -1046713 -1040050 -1045084 -1047055 -1043777 -1041839
7014 -1041839 -1047745 -1044265 -1036119 -1043962 -1052763 -1055517 -1050816 -1050355 -1051559 -1053899 -1047426 -1042853 -1039281 -1043831
7000 -1043831 -1052548 -1048479 -1042838 -1041235 -1048157 -1056793 -1056232 -1049383 -1042685 -1045164 -1046788 -1043177 -1041991 -1046025
6986 -1046025 -1048461 -1047174 -1048266 -1041599 -1038066 -1035927 -1037292 -1040844 -1046083 -1036338 -1041104 -1045301 -1044700 -1046472
6972 -1046472 -1040845 -1033986 -1035041 -1035578 -1035319 -1040357 -1036334 -1034309 -1029258 -1033819 -1037815 -1037507 -1030719 -1030595 -1028736
6957 -1028736 -1022658 -1023692 -1032721 -1034905 -1033804 -1031732 -1029491 -1027262 -1029297 -1028531 -1032895 -1037639 -1037413 -1025637
6943 -1025637 -1021351 -1021519 -1025772 -1027014 -1026298 -1024893 -1024853 -1023435 -1026576 -1029486 -1031642 -1030038 -1030198 -1028318 -1028605 -1025629
6927 -1025629 -1024486 -1023150 -1017134 -1013944 -1010773 -1012593 -1016027 -1017078 -1017713 -1013760 -1016373 -1024492 -1028774 -1028867 -1025982
6912 -1025982 -1015028 -1008373 -1006389 -1011057 -1015666 -1019380 -1014921 -1011370 -1015943 -1022173 -1025462 -1026317 -1020613 -1018178
6898 -1018178 -1016875 -1016182 -1014429 -1010531 -1008340 -1015369 -1016868 -1011538 -1008655 -1012135 -1015427 -1011605 -1004300 -1001702
6884 -1001702 -1005687 -1005318 -1000969 -996098 -994572 -1001637 -1010373 -1007742 -1009811 -1010643 -1011050 -1015198 -1008568 -1000406 -996916
6869 -996916 -997190 -1003005 -1005267 -1006877 -999747 -997934 -1003274 -1005469 -1010390 -1005860 -1006501 -1008422 -1012492 -1010043 -1002162
6854 -1002162 -998112 -1000953 -1001236 -1001358 -995383 -996707 -1001282 -1003721 -1005124 -1005192 -1005783 -997660 -987791 -982168 -985492
6839 -985492 -989728 -996333 -997575 -994956 -1000101 -1005620 -1002237 -996404 -992832 -988966 -992991 -995902 -994582 -990663
6825 -990663 -993023 -994095 -1000038 -995740 -985270 -981271 -986049 -993258 -999163 -990123 -986058 -983763 -983046 -982525 -982280
6810 -982280 -985324 -995252 -995064 -991290 -989728 -988450 -988285 -990632 -986088 -987989 -994914 -997116 -990797 -987024 -986079
6795 -986079 -978666 -970663 -973742 -980515 -982283 -979749 -981785 -986129 -988748 -978536 -976634 -978600 -981482 -989301
6781 -989301 -986491 -983412 -981253 -984206 -984638 -981973 -983131 -985293 -982569 -974771 -969613 -970477 -976487 -978583 -978567
6766 -978567 -984087 -989872 -983507 -984227 -982941 -982374 -984773 -981357 -973559 -972008 -967326 -965625 -965208 -965123 -964403 -962632
6750 -962632 -964603 -966764 -963740 -958885 -960253 -963976 -970849 -970677 -962074 -961819 -970959 -975703 -970766 -965532 -961556
6735 -961556 -957616 -953834 -959644 -966379 -964048 -963973 -962352 -966633 -969481 -968587 -966823 -969434 -966911 -962644 -963436
6720 -963436 -971454 -973264 -974105 -971089 -968115 -967529 -968610 -963913 -962460 -965739 -964959 -959002 -953761 -954032 -958023
6705 -958023 -957271 -964857 -970231 -964359 -959533 -957215 -960819 -955998 -952579 -955390 -961974 -961460 -962969 -959493 -957159
6690 -957159 -952339 -962916 -968710 -965312 -968185 -971975 -970290 -966188 -962743 -960774 -960121 -958302 -953796 -956942
6676 -956942 -954366 -951355 -948222 -945774 -949653 -954434 -948010 -941080 -939296 -942208 -945133 -944429 -946220 -947656 -949922
6661 -949922 -944864 -943634 -947507 -949357 -950419 -947973 -942750 -946385 -948131 -951874 -954791 -958798 -955834 -950859
6647 -950859 -950754 -951983 -951950 -944783 -940543 -938968 -942653 -942942 -942397 -939778 -936209 -936178 -934142 -929897 -935808 -936637
6631 -936637 -938084 -936452 -930876 -925438 -929991 -937569 -942555 -934521 -933589 -938272 -947288 -945555 -944381 -941894 -940509
6616 -940509 -946814 -941214 -938350 -945913 -946217 -943613 -939603 -938352 -935719 -935771 -933139 -934097 -936646 -943635 -942094
6601 -942094 -944244 -944431 -943632 -942049 -940698 -942576 -933865 -920183 -919330 -924836 -932873 -939388 -936236 -933135 -931749
6586 -931749 -934817 -932984 -928931 -929739 -932705 -935329 -938863 -940161 -933345 -931418 -925764 -920778 -925368 -929537 -932886
6571 -932886 -926871 -927317 -929368 -929495 -922014 -923418 -931680 -935867 -934507 -936661 -928463 -920853 -921849 -929633 -927728
6556 -927728 -920862 -915486 -914994 -912790 -906607 -904130 -908778 -909349 -908327 -916482 -921825 -921171 -917847 -921205 -916627
6541 -916627 -914637 -917293 -920948 -921274 -921862 -919641 -915471 -920741 -923509 -922741 -917099 -916519 -920226 -918744 -917488
6526 -917488 -920837 -917272 -910870 -910231 -909845 -912952 -922141 -924163 -921506 -921028 -916138 -911133 -913019 -915899 -912189
6511 -912189 -906580 -900399 -899548 -903209 -905362 -905593 -911336 -914846 -913227 -911083 -914071 -912047 -901161 -900910 -907008
6496 -907008 -910197 -914483 -911182 -906040 -906664 -905467 -903674 -909634 -913040 -910843 -908150 -901172 -899342 -900668 -900421
6481 -900421 -899706 -899889 -897117 -899169 -897440 -895081 -900536 -906286 -903519 -901051 -900640 -899879 -893229 -897457 -900275
6466 -900275 -900500 -890924 -893701 -900119 -902670 -898107 -898575 -907977 -907544 -901424 -900799 -898098 -894679 -892270 -899192
6451 -899192 -896743 -900014 -903654 -903478 -896218 -895096 -903400 -902264 -903172 -901530 -907087 -912453 -903549 -893810 -896051
6436 -896051 -897683 -893226 -891997 -892321 -892574 -893570 -889229 -890801 -885561 -885306 -891779 -891078 -893582 -892531 -895152 -896091
6420 -896091 -896575 -893055 -893201 -891333 -891278 -893018 -895173 -892633 -894174 -898984 -903578 -902972 -888354 -888813 -893896 -895789
6404 -895789 -890401 -889091 -889131 -889385 -887121 -884666 -881324 -881471 -884623 -894346 -897559 -898706 -903289 -901452 -900966 -894520
6388 -894520 -893499 -890831 -888611 -887156 -891234 -892557 -884565 -881546 -882415 -872084 -871953 -875443 -881389 -884190 -883156
6373 -883156 -878575 -876161 -874038 -884871 -891152 -893052 -889491 -886262 -888514 -887482 -887020 -895807 -893773 -886410
6359 -886410 -877394 -868432 -868104 -876721 -878748 -872512 -866514 -870529 -873155 -878209 -872339 -871739 -882906 -880848 -881657
6344 -881657 -880897 -879884 -880968 -879567 -874424 -867685 -866440 -873428 -868107 -863501 -873319 -878809 -877404 -879036 -878829
6329 -878829 -876250 -876192 -872205 -865633 -856606 -859576 -863078 -861978 -858667 -861415 -867325 -869804 -865762 -872770 -878845
6314 -878845 -876437 -877090 -869019 -866246 -866177 -867059 -871757 -866255 -859582 -858011 -857509 -865485 -870327 -875874 -870060 -862335
6298 -862335 -867838 -871408 -865523 -859630 -861619 -857402 -854533 -856454 -862346 -867164 -866094 -867073 -868066 -872751 -861468
6283 -861468 -862152 -868074 -865000 -867466 -864148 -860562 -863463 -870542 -867419 -861301 -859864 -862948 -864247 -863357 -864327
6268 -864327 -863477 -861082 -861285 -859106 -848126 -848460 -856239 -856746 -856185 -859638 -856630 -854685 -853594 -860682 -865666
6253 -865666 -857019 -855903 -856547 -846879 -846329 -845085 -844813 -851952 -851324 -852056 -854270 -858452 -859102 -852693 -846038 -846428
6237 -846428 -854339 -854706 -853130 -860556 -860440 -848674 -843704 -850596 -851979 -848382 -846475 -850009 -853551 -847536 -839650
6222 -839650 -841031 -849180 -848271 -847314 -848394 -849537 -856553 -856904 -858328 -859139 -857165 -848457 -842430 -842337 -842072 -839989
6206 -839989 -843679 -847773 -849282 -846348 -842841 -843418 -846534 -840756 -835040 -839448 -834024 -833854 -838363 -835586 -834244
6191 -834244 -834234 -835470 -829975 -830350 -834246 -834460 -833673 -839767 -837872 -828985 -826445 -831341 -833461 -831616 -828108 -838944
6175 -838944 -841309 -838086 -831574 -831159 -833638 -837351 -834442 -835158 -845824 -849540 -846797 -845858 -842589 -839521 -834661
6160 -834661 -837003 -841274 -848087 -853133 -851471 -846893 -845513 -841441 -842572 -843368 -843685 -841233 -831109 -827989 -832936
6145 -832936 -833997 -830602 -830073 -836526 -836363 -836628 -835702 -835245 -834097 -831460 -835665 -830608 -827282 -824021 -819566 -819722
6129 -819722 -828171 -835928 -830157 -830392 -830391 -834481 -837014 -837820 -834485 -832217 -832585 -833665 -825400 -819068 -820679 -820157
6113 -820157 -820678 -820989 -824984 -821866 -823499 -824668 -827246 -829082 -828526 -825709 -821763 -814973 -809690 -808512 -811958
6098 -811958 -819726 -823654 -825964 -828402 -829798 -826930 -826285 -827044 -830268 -831659 -829904 -825668 -827890 -823455 -820184
6083 -820184 -819515 -820440 -826101 -829326 -825905 -824457 -821910 -818058 -815042 -814163 -812818 -812399 -809880 -810964 -818086
6068 -818086 -823553 -828872 -831052 -827515 -818929 -817486 -821117 -820592 -819398 -817714 -817132 -815979 -819214 -818101 -820490
6053 -820490 -820333 -819294 -826493 -832941 -831739 -829215 -832631 -828760 -821068 -815408 -817618 -812865 -809883 -808217 -804069
6038 -804069 -803836 -804828 -812199 -816442 -821785 -827307 -826836 -818622 -815248 -806175 -806524 -809818 -804544 -796997 -799988
6023 -799988 -806989 -811213 -812594 -813482 -815627 -814520 -811176 -808209 -808997 -813373 -805778 -804866 -810222 -821988 -824600
6008 -824600 -818680 -817950 -813891 -811564 -808854 -809149 -809973 -808874 -803625 -799538 -801366 -797640 -797185 -802121 -800478
5993 -800478 -808657 -816147 -807404 -798577 -794280 -791579 -799126 -801683 -803960 -803590 -801785 -802018 -798936 -799779 -804082
5978 -804082 -802863 -801065 -801053 -800365 -802559 -809232 -806816 -805676 -805391 -802369 -805520 -805963 -799688 -795708 -800585 -806233
5962 -806233 -800089 -798517 -799154 -803685 -801941 -800349 -801790 -805186 -807362 -799960 -793635 -794284 -798929 -801387 -798030
5947 -798030 -797774 -798889 -794932 -798261 -798811 -790642 -793236 -793878 -795583 -794081 -799275 -801586 -796522 -791467 -792852
5932 -792852 -783986 -778830 -783654 -790825 -791670 -793116 -789332 -792924 -799788 -800455 -800485 -798781 -802370 -801305 -789456
5917 -789456 -779339 -783244 -787170 -795079 -801146 -791316 -790716 -792658 -800128 -801158 -802774 -798826 -796807 -800081
5903 -800081 -798212 -797270 -794638 -793873 -792515 -783961 -773903 -776404 -782858 -786223 -786649 -787941 -784515 -782123 -781819
5888 -781819 -782092 -786247 -785992 -783651 -781695 -782629 -786194 -785836 -790295 -790290 -789881 -789115 -791966 -793130 -793912 -790540 -786563
5871 -786563 -787669 -784794 -778048 -781838 -783424 -784633 -789135 -789012 -788270 -781976 -783875 -791547 -786843 -789679 -793937
5856 -793937 -790236 -789502 -785669 -781660 -776870 -768906 -767731 -775027 -774766 -778011 -778802 -778330 -786127 -790052 -784315
5841 -784315 -782798 -787852 -789612 -789656 -789613 -782010 -779081 -780189 -779084 -779995 -778212 -772952 -777693 -770688 -769038 -773992
5825 -773992 -769948 -770549 -779297 -776670 -773594 -775773 -771022 -772137 -768285 -771502 -778900 -782007 -782723 -775979 -768654
5810 -768654 -767693 -770791 -767977 -769085 -772804 -772450 -766444 -763018 -764163 -765318 -763956 -768446 -768324 -763382 -766519
5795 -766519 -771248 -770651 -769488 -775091 -775570 -773959 -767285 -772295 -774580 -773278 -768784 -765125 -762679 -765888 -773334
5780 -773334 -773543 -765206 -769582 -780657 -779649 -780076 -777108 -774234 -771944 -775544 -777629 -772588 -764729 -759281 -761870
5765 -761870 -771574 -772743 -778023 -781232 -775961 -772323 -774105 -780654 -777306 -772917 -776058 -776589 -769568 -770381 -762854
5750 -762854 -759656 -760079 -761561 -770021 -774639 -777291 -777315 -772330 -766500 -765111 -768754 -768670 -769103 -768512 -765013 -759799
5734 -759799 -762841 -761244 -760458 -755231 -753106 -754655 -751014 -756886 -763305 -760468 -758356 -764000 -772305 -766714 -763297
5719 -763297 -762721 -765062 -763625 -767875 -764363 -761602 -761286 -763544 -755726 -756126 -761878 -760796 -762646 -761103 -763406
5704 -763406 -769796 -773568 -767088 -765511 -760825 -756518 -751209 -756839 -755293 -752083 -759493 -764434 -759082 -754954
5690 -754954 -749096 -747304 -743353 -744654 -756524 -756972 -757832 -766842 -761731 -762888 -761763 -762334 -755225 -750021 -746677
5675 -746677 -741272 -745524 -755468 -753385 -750074 -753594 -751519 -748704 -754208 -763166 -765445 -763413 -755942 -756776 -756807
5660 -756807 -754286 -753022 -748707 -742903 -738078 -743302 -746222 -750700 -752990 -750113 -745286 -747642 -749658 -745203
5646 -745203 -741793 -744908 -741684 -746287 -750906 -749159 -742476 -741338 -742862 -744526 -742776 -742562 -746433 -755180 -757771
5631 -757771 -758358 -753057 -747189 -749231 -744392 -739541 -737788 -734642 -735580 -740981 -743009 -741932 -740309 -739780 -739488
5616 -739488 -737180 -734764 -738131 -737483 -739198 -738261 -741775 -750446 -748756 -738400 -733964 -736048 -734593 -736013 -740724
5601 -740724 -741773 -741187 -748806 -751951 -749487 -746965 -748956 -747211 -741264 -738263 -739550 -743198 -747677 -744965 -747112
5586 -747112 -745210 -744185 -738903 -742337 -752349 -747000 -738854 -740173 -743014 -739769 -737211 -738531 -740688 -741403
5572 -741403 -735440 -730426 -728958 -729296 -735517 -737269 -742125 -740683 -732229 -731427 -728967 -730642 -734947 -732914 -731784
5557 -731784 -733243 -734924 -737054 -736079 -736814 -740372 -737606 -730389 -723686 -725187 -726404 -721773 -727007 -732093 -730886
5542 -730886 -728573 -724318 -728059 -727905 -728117 -725822 -733033 -740351 -744362 -736849 -728727 -729264 -736490 -736577 -732742 -730491
5526 -730491 -731191 -737734 -742514 -742610 -734099 -729257 -728511 -727120 -726165 -734546 -734782 -734960 -738047 -737535 -727211 -728101
5510 -728101 -727702 -726764 -725383 -729336 -726190 -728997 -729581 -721380 -718955 -726400 -727883 -728484 -736542 -737257 -735691 -729010
5494 -729010 -726584 -726458 -723917 -721430 -721689 -723943 -727192 -724013 -718037 -720886 -719889 -723828 -722001 -719568 -720826
5479 -720826 -724861 -725930 -724379 -721978 -719040 -720589 -719597 -727097 -731192 -731934 -737219 -736326 -731698 -722509 -719435
5464 -719435 -714001 -715542 -721011 -720510 -724497 -730125 -732712 -729624 -725503 -728598 -728913 -723538 -715184 -714494 -713633
5449 -713633 -712168 -713084 -724966 -729512 -722315 -719898 -718687 -721585 -727677 -726064 -716268 -714417 -716278 -718952
5435 -718952 -720234 -715159 -715602 -711579 -712548 -716262 -718017 -714903 -716911 -715208 -719247 -723741 -721758 -720064 -720087
5420 -720087 -715415 -719397 -726153 -719803 -719485 -724005 -727277 -717570 -711291 -711548 -717359 -717220 -718438 -717960 -716039
5405 -716039 -712256 -717279 -717584 -715229 -710261 -711032 -708182 -709264 -701048 -699873 -700700 -698558 -701401 -699756 -701628
5390 -701628 -705205 -703803 -709456 -714559 -721284 -720978 -719325 -718779 -713997 -708934 -712879 -713691 -716267 -718552 -714213
5375 -714213 -711202 -710395 -708556 -702793 -696695 -690568 -697086 -703621 -706883 -711831 -714280 -715672 -715392 -715878 -716650
5360 -716650 -711331 -704802 -700261 -696859 -700436 -710099 -709265 -706613 -700164 -700739 -706898 -714216 -707040 -702037 -698002
5345 -698002 -699007 -695052 -696873 -696538 -690018 -701637 -705190 -704756 -700182 -698101 -697974 -699649 -703985 -707538 -699985
5330 -699985 -700419 -699128 -697447 -693622 -692449 -690772 -692658 -704638 -710105 -708449 -708777 -710095 -709679 -706444 -705161
5315 -705161 -711480 -712378 -706527 -703602 -706090 -705260 -702471 -698738 -700972 -701849 -701836 -703018 -702040 -704927 -705342 -706504
5299 -706504 -700742 -690108 -688683 -692267 -692910 -694297 -697310 -703406 -707487 -712211 -711381 -704028 -700753 -702882 -697855
5284 -697855 -693795 -698454 -701806 -701218 -699828 -700361 -707748 -703891 -695786 -695634 -695760 -693811 -691877 -696267 -699647
5269 -699647 -701612 -702075 -695076 -690522 -689720 -687998 -689901 -698119 -695779 -694307 -695402 -700909 -700356 -694412 -686538
5254 -686538 -685537 -682893 -685224 -688792 -690723 -688684 -690328 -688550 -686765 -684273 -683882 -688519 -692597 -691956 -686307
5239 -686307 -681735 -682804 -684023 -682975 -683575 -692994 -692146 -692276 -693844 -695203 -690010 -687013 -685659 -681956 -677661
5224 -677661 -680438 -682532 -683563 -685387 -689932 -691461 -686152 -684728 -690204 -691499 -698651 -701053 -695644 -696789
5210 -696789 -695028 -693029 -688504 -682472 -680496 -685702 -691956 -685323 -680299 -678121 -682214 -685513 -679722 -683089
5196 -683089 -684989 -684509 -677749 -677966 -683563 -688016 -690095 -685255 -678863 -674216 -676394 -683197 -684773 -685152 -686609
5181 -686609 -684744 -682433 -681097 -682306 -686748 -688518 -684479 -685263 -684596 -689787 -691860 -682299 -679839 -673602 -672968
5166 -672968 -682054 -691449 -694112 -696033 -688430 -680015 -680641 -682346 -680337 -679944 -680332 -676647 -669646 -672156 -676548
5151 -676548 -678939 -680819 -681642 -685512 -691772 -692316 -689976 -686766 -682192 -682738 -677314 -683418 -684859 -688364 -686826
5136 -686826 -679962 -677266 -674665 -668489 -675099 -675313 -672935 -670029 -672367 -671747 -674673 -673777 -676603 -677275 -666234
5121 -666234 -664560 -663693 -665227 -676182 -685092 -681107 -676328 -681877 -684950 -676008 -665233 -667100 -672418 -679486
5107 -679486 -679368 -677007 -677672 -679991 -674386 -672944 -675968 -673509 -672686 -671090 -673501 -678213 -684921 -685271 -678954
5092 -678954 -672940 -673928 -676657 -677453 -675416 -671565 -670402 -668236 -665626 -670188 -670133 -676763 -687503 -681431 -677294
5077 -677294 -675129 -677223 -675734 -673922 -676255 -672593 -660552 -659745 -667503 -666583 -668700 -665663 -668736 -669807 -671883
5062 -671883 -675075 -673767 -667734 -668517 -670806 -667369 -665303 -659792 -661929 -665148 -665930 -659283 -656582 -659416 -662118
5047 -662118 -664037 -655343 -653596 -659620 -664759 -668980 -670418 -674947 -668367 -664289 -669075 -674422 -671059 -668378
5033 -668378 -666127 -660764 -663305 -667485 -670613 -670986 -668435 -668479 -673295 -673165 -675056 -679951 -672796 -668498 -667537 -665808
5017 -665808 -661686 -657475 -654563 -657577 -665404 -668106 -676358 -677166 -671902 -665169 -674433 -668436 -664266 -668690 -667219
5002 -667219 -663114 -663820 -665179 -668717 -668556 -665976 -654827 -649631 -650666 -649583 -638263 -644244 -653873 -656642
4988 -656642 -653093 -648930 -654497 -658981 -666536 -665438 -662583 -660566 -660469 -657240 -653804 -649609 -654073 -659419 -659956
4973 -659956 -651917 -648344 -654115 -664346 -663959 -659660 -653387 -654334 -664310 -669958 -675426 -667120 -654972 -652615
4959 -652615 -656194 -663713 -665933 -666235 -667141 -665180 -665817 -669464 -664886 -656126 -648199 -654383 -662697 -659094 -656596
4944 -656596 -665226 -668863 -665369 -662171 -662693 -663641 -661190 -662175 -657142 -655171 -653778 -656272 -657824 -657097 -656908 -659526
4928 -659526 -662608 -658528 -655033 -658752 -659480 -651908 -654512 -655372 -650491 -641823 -646867 -657139 -659792 -665029 -660351
4913 -660351 -656631 -650919 -655157 -663448 -660759 -652894 -651115 -648817 -651889 -648833 -648351 -651622 -650363 -652242 -659114
4898 -659114 -652126 -654812 -659470 -652982 -645452 -647760 -643425 -633331 -636055 -647072 -649123 -646003 -646551 -640161
4884 -640161 -636948 -640796 -648525 -645397 -641911 -638751 -642940 -647092 -650555 -654145 -646375 -639847 -645567 -652041
4870 -652041 -654420 -655845 -650469 -642645 -635512 -638501 -640329 -643935 -645948 -650231 -652964 -651269 -645901 -642034
4856 -642034 -638229 -642561 -650025 -653947 -653455 -655902 -655804 -647032 -646099 -643718 -639327 -642479 -648390 -649968 -648714
4841 -648714 -646213 -647099 -647128 -638710 -636472 -640921 -646970 -640934 -637164 -648523 -650602 -650194 -648156 -644333 -642413
4826 -642413 -646564 -649494 -652475 -644816 -641256 -644139 -642638 -639926 -634195 -634995 -631758 -633376 -641385 -641384 -641460 -645748
4810 -645748 -636592 -633959 -634653 -635072 -630540 -637290 -641938 -648940 -643901 -637886 -633773 -640623 -644021 -639845 -641688
4795 -641688 -641931 -640457 -647550 -651198 -646634 -637649 -636525 -647216 -652240 -644182 -635652 -630345 -626634 -626415 -629043
4780 -629043 -642497 -649072 -640016 -636974 -635699 -634954 -638290 -643253 -643708 -638097 -631517 -632272 -632562 -626983 -631051
4765 -631051 -633601 -638097 -642156 -642692 -643781 -638773 -645995 -651716 -652212 -652131 -650645 -640678 -632226 -628265 -628530 -628157
4749 -628157 -630781 -624915 -620294 -628836 -643454 -644710 -637544 -631422 -629493 -632653 -626599 -624578 -629916 -630565
4735 -630565 -622318 -621040 -622837 -624366 -629469 -634325 -632203 -635046 -634532 -629999 -621579 -625204 -631399 -630861 -629661
4720 -629661 -625900 -633541 -630454 -635900 -637991 -639557 -641924 -638864 -635779 -633544 -634853 -630020 -631440 -634648
4706 -634648 -630001 -628210 -631005 -634485 -626894 -623181 -624475 -630390 -634426 -638121 -630550 -626766 -626683 -627986 -635052
4691 -635052 -633531 -626790 -632539 -631929 -627468 -624727 -628167 -631884 -627809 -626956 -632953 -634417 -634428 -631648 -631565 -635862
4675 -635862 -632850 -626553 -621434 -628027 -629568 -634053 -631940 -625206 -621324 -619873 -614825 -619534 -620077 -617429 -615399
4660 -615399 -621713 -622612 -620462 -617971 -621799 -616026 -611729 -620809 -630228 -633307 -625569 -626052 -630702 -632284 -625601
4645 -625601 -620798 -621495 -624439 -622924 -616885 -614220 -614646 -621043 -626671 -629564 -627169 -626731 -627803 -626916 -624097
4630 -624097 -619485 -613094 -619215 -624510 -618673 -619184 -617103 -623478 -632285 -624885 -615533 -613366 -617805 -622351 -622874
4615 -622874 -619274 -617213 -618152 -613530 -613251 -623116 -624087 -625567 -631351 -633179 -626834 -623437 -623675 -623578 -625300 -623752
4599 -623752 -623595 -626690 -620835 -616006 -617685 -613586 -613327 -617719 -622146 -621010 -611565 -609775 -611488 -615981 -616710
4584 -616710 -616562 -618080 -621067 -621221 -624005 -619406 -610699 -609610 -608686 -610139 -617218 -623978 -621093 -614015 -616425
4569 -616425 -613434 -613069 -610290 -608494 -605879 -600791 -599725 -600269 -604207 -609640 -604117 -604231 -608025 -611324 -612814
4554 -612814 -608440 -606804 -604059 -603604 -613622 -612332 -613315 -618080 -618862 -620009 -616987 -611798 -619468 -622888 -623999
4539 -623999 -622459 -621264 -615354 -622774 -628077 -622587 -619071 -613268 -606920 -610315 -613079 -613295 -612637 -612399 -615519
4524 -615519 -617122 -621585 -621140 -622673 -626236 -623306 -616343 -615961 -610852 -603687 -605525 -611232 -614381 -610357 -609775
4509 -609775 -619593 -617069 -613140 -617353 -618805 -613538 -604451 -600046 -602436 -607780 -609924 -606505 -609154 -612133
4495 -612133 -613372 -617737 -613257 -606813 -605770 -614325 -614056 -609995 -617072 -615787 -606296 -605623 -603667 -599808 -599741
4480 -599741 -597570 -603947 -601636 -591844 -593374 -597460 -601829 -611012 -613931 -611914 -611023 -616028 -610157 -604205 -605912
4465 -605912 -602593 -608853 -609429 -606090 -601894 -590178 -596910 -603203 -602584 -605406 -601966 -609303 -611160 -604221 -601068
4450 -601068 -599060 -602856 -608707 -605195 -604153 -601774 -598294 -601557 -607566 -611645 -606975 -600908 -602056 -595425
4436 -595425 -590751 -591292 -593003 -595967 -598966 -599647 -596703 -599136 -596169 -597333 -602121 -609413 -604718 -602560 -599300
4421 -599300 -603788 -607515 -611300 -608957 -612128 -613372 -612059 -607438 -606844 -605008 -602941 -600750 -601930 -599271 -595447
4406 -595447 -593255 -599897 -600487 -597834 -600564 -608473 -616522 -616316 -610038 -602299 -599981 -600469 -600706 -596722 -592553
4391 -592553 -591089 -597787 -597988 -596101 -596008 -593126 -601219 -601992 -605525 -597842 -593733 -593235 -597282 -598874 -597555 -590049
4375 -590049 -588002 -593168 -595724 -598793 -600636 -599223 -598878 -597712 -591045 -587458 -589367 -593871 -598241 -597054 -598599
4360 -598599 -599065 -593759 -595032 -595144 -593153 -588954 -584914 -589290 -592480 -595793 -597096 -600518 -604497 -596408 -589643
4345 -589643 -582218 -582630 -590107 -590038 -586438 -589953 -589080 -590768 -594443 -592126 -590906 -589751 -588366 -589989 -589720 -590411
4329 -590411 -585200 -583248 -588612 -585207 -581535 -582864 -585788 -581434 -579045 -583296 -589618 -589432 -585381 -587587 -586171
4314 -586171 -588968 -587727 -595375 -598536 -592913 -600461 -594896 -596514 -594000 -594403 -593544 -593158 -596229 -594178 -586983
4299 -586983 -590410 -588174 -581365 -581123 -586861 -584491 -586029 -591845 -587819 -579369 -577643 -581275 -579309 -580296 -581933
4284 -581933 -582599 -584546 -584674 -589046 -584461 -575038 -572663 -581806 -587574 -581706 -585252 -590342 -587173 -588445 -594839
4269 -594839 -596489 -594839 -593464 -588935 -589670 -587111 -591626 -595640 -591311 -595468 -592374 -591637 -590996 -590422 -587811
4254 -587811 -588868 -589203 -591057 -591449 -588324 -580828 -586702 -591751 -591670 -591467 -590822 -584272 -576275 -580907 -582280 -582898
4238 -582898 -582954 -580898 -581860 -584992 -578086 -574425 -574837 -580852 -579326 -585508 -585938 -588483 -588061 -587197 -583861 -582046
4222 -582046 -575766 -566277 -564350 -569271 -575306 -578256 -580654 -576760 -572624 -567319 -575764 -580185 -579305 -582610 -582243
4207 -582243 -576535 -576734 -578401 -578519 -579467 -580369 -578437 -577680 -582964 -580728 -577770 -569818 -568393 -571546 -572335 -573543
4191 -573543 -573651 -574844 -574324 -578742 -585217 -587738 -590004 -587969 -581624 -576559 -572624 -567565 -563610 -568274 -575913
4176 -575913 -577641 -580031 -587443 -595274 -590251 -583300 -582252 -577972 -577075 -577966 -580385 -579604 -577607 -575832 -572287
4161 -572287 -572056 -570859 -569316 -567181 -568016 -576345 -579137 -573981 -585290 -591576 -592544 -585618 -580766 -579083 -578359
4146 -578359 -576892 -575794 -574818 -569199 -567828 -575545 -576353 -576150 -576057 -577881 -574978 -573820 -571877 -575025 -580721 -582587
4130 -582587 -582560 -588940 -587839 -580136 -580468 -583178 -583562 -583103 -579828 -577424 -574827 -574665 -575593 -576654 -578497 -576998
4114 -576998 -577172 -580386 -573950 -569449 -571764 -577236 -574586 -572794 -576714 -582068 -584650 -577326 -565915 -567734
4100 -567734 -567385 -567582 -565548 -571169 -571692 -572170 -571314 -576474 -584127 -582927 -579595 -576309 -569413 -565175 -564470 -560562
4084 -560562 -560803 -564484 -570262 -570371 -574189 -572293 -567443 -564209 -570018 -572099 -571837 -567410 -571211 -573406 -576565
4069 -576565 -580219 -582336 -577647 -570584 -569210 -566175 -567385 -570505 -567591 -568482 -570334 -569751 -565509 -557405 -568447
4054 -568447 -565540 -563437 -565341 -570098 -569887 -569966 -574044 -573529 -566188 -563088 -567191 -568910 -564948 -564532 -567317 -565452
4038 -565452 -564902 -565426 -576172 -583038 -583648 -586107 -585390 -572887 -563710 -565495 -562263 -558706 -557797 -551667 -555036
4023 -555036 -562037 -566089 -565847 -561145 -558693 -559407 -557546 -561509 -562864 -561882 -563113 -570133 -568979 -571416 -571560
4008 -571560 -574181 -575042 -573299 -570317 -564260 -560726 -558447 -561349 -560628 -566642 -568263 -572650 -575467 -573180 -566177
3993 -566177 -564708 -569397 -566459 -566675 -564944 -560746 -566160 -569539 -566410 -568516 -559650 -554717 -560037 -566103 -560085
3978 -560085 -561255 -568999 -573429 -577605 -573217 -572168 -572114 -574415 -576583 -573008 -566009 -561702 -562410 -560580 -563344
3963 -563344 -563643 -558359 -556700 -552834 -550422 -553419 -557903 -553433 -547348 -544433 -549189 -556079 -554623 -553426 -555744
3948 -555744 -561877 -562706 -564429 -565781 -567946 -569285 -574192 -576122 -568482 -559967 -557522 -560832 -558537 -559536 -561424
3933 -561424 -558934 -548418 -546991 -549365 -551933 -555443 -554781 -551485 -545638 -541085 -544895 -553287 -560622 -555477
3919 -555477 -549308 -551401 -555249 -551978 -555123 -559573 -561252 -556556 -552746 -555949 -560353 -562027 -563875 -562026
3905 -562026 -557498 -553321 -552920 -554971 -557724 -562689 -563327 -564684 -562557 -558423 -557659 -555236 -550662 -553524 -550344
3890 -550344 -546902 -550969 -553312 -557620 -563873 -559571 -553993 -555787 -558398 -558348 -560633 -555633 -555049 -554835 -558656
3875 -558656 -557783 -559158 -549117 -546907 -550332 -552646 -556896 -561314 -556882 -555440 -562852 -560518 -555304 -556709
3861 -556709 -560200 -554025 -548101 -547496 -545090 -547258 -555828 -553081 -549719 -539544 -535144 -537632 -545044 -548383
3847 -548383 -544973 -549230 -553556 -552051 -561567 -562615 -556829 -554088 -553725 -551370 -549297 -548804 -548826 -550373 -549671 -548858
3831 -548858 -550687 -553683 -557488 -559844 -552141 -555885 -553557 -549604 -553331 -551714 -548594 -549979 -549216 -544210 -540863
3816 -540863 -542094 -550543 -547318 -546326 -546313 -553026 -553219 -553976 -558008 -556878 -558186 -560467 -550351 -545443 -546062 -550943
3800 -550943 -550021 -544270 -542631 -540492 -541824 -548498 -549013 -543557 -551254 -553283 -549668 -541531 -541240 -543602 -551178
3785 -551178 -554737 -553965 -549406 -543960 -546029 -551201 -553321 -552978 -547489 -549657 -553195 -545066 -543308 -546333 -541975
3770 -541975 -541520 -537497 -541644 -548938 -546801 -544118 -545511 -544783 -549528 -551792 -549094 -550036 -548497 -549617 -549095
3755 -549095 -551438 -556174 -552633 -546682 -544661 -539008 -539385 -539720 -541279 -542338 -531948 -534321 -538652 -538603 -540489
3740 -540489 -545732 -542386 -529559 -526525 -534117 -542209 -545683 -548927 -549217 -546226 -541271 -535913 -536787 -534348 -531379
3725 -531379 -535459 -535018 -539833 -542872 -549753 -544107 -538034 -538421 -539222 -538608 -544526 -550003 -541446 -540190 -541803
3710 -541803 -542364 -540609 -545592 -544569 -550452 -549510 -542732 -535480 -538176 -545779 -547753 -540439 -539164 -534366 -527078
3695 -527078 -524178 -525534 -532740 -539210 -535672 -537977 -535932 -536891 -536415 -537603 -541250 -540107 -541922 -543683 -543191
3680 -543191 -543475 -540271 -534618 -536814 -532505 -534446 -533598 -534141 -538473 -532218 -529799 -530100 -536931 -531665 -522486
3665 -522486 -528271 -533977 -535817 -532634 -524430 -527331 -529656 -534010 -532750 -531333 -535438 -538553 -539670 -534079
3651 -534079 -527980 -529147 -535465 -539410 -536249 -535648 -535748 -536247 -533668 -534154 -524534 -523430 -528345 -531840 -534994
3636 -534994 -534202 -528505 -527406 -533924 -539536 -533480 -533712 -534128 -528861 -530148 -530323 -532710 -533422 -534569 -534606 -535140
3620 -535140 -538285 -548353 -547056 -545841 -539497 -537854 -537429 -539327 -530090 -532953 -529113 -528671 -533817 -537002 -537825
3605 -537825 -541118 -541497 -539915 -540263 -538763 -535230 -525303 -518604 -526592 -532956 -539936 -541980 -541255 -537842 -542300
3590 -542300 -536501 -532864 -534086 -527583 -524023 -532315 -536963 -541165 -534263 -523983 -525913 -532468 -528776 -528139
3576 -528139 -528795 -532800 -523517 -523374 -523323 -523766 -526400 -528146 -533917 -535747 -530972 -523719 -519066 -524444 -529401 -525845
3560 -525845 -521041 -528451 -530432 -532158 -523941 -531094 -535245 -525881 -526879 -529021 -525345 -528306 -530815 -527541 -531589
3545 -531589 -538569 -543583 -543286 -539376 -538037 -536425 -541105 -537352 -534833 -534011 -525280 -520136 -520780 -525445 -534004
3530 -534004 -533299 -529822 -525430 -522383 -527015 -529254 -526316 -520778 -524551 -524336 -522606 -521345 -521291 -524475 -527305
3515 -527305 -524341 -522549 -516482 -518481 -515616 -517077 -523195 -529183 -534444 -535293 -534304 -533666 -527578 -521150 -523449
3500 -523449 -526012 -526908 -532070 -534913 -527608 -522349 -518643 -520706 -518101 -522942 -522656 -512725 -506948 -507920 -517846
3485 -517846 -516027 -508901 -508995 -508274 -509806 -521992 -524851 -518261 -527655 -522596 -519017 -520344 -515425 -516196 -518475
3470 -518475 -523854 -525131 -524182 -524057 -528741 -531978 -530016 -533303 -538084 -536636 -532409 -525981 -520321 -513087 -508155
3455 -508155 -506345 -507332 -508711 -510069 -512938 -515096 -519499 -524591 -526834 -524632 -515608 -515682 -513255 -510505 -512155
3440 -512155 -511524 -510763 -517351 -516354 -514438 -514963 -519943 -526245 -526099 -528223 -527214 -523536 -525066 -525950 -524785 -519214
3424 -519214 -519977 -524869 -527943 -526847 -521148 -514778 -521030 -527387 -525982 -524421 -525940 -524531 -519194 -517151 -517060
3409 -517060 -515888 -507222 -504421 -511728 -514925 -516317 -522210 -524832 -521298 -519635 -515096 -513140 -509787 -509967 -515488
3394 -515488 -520522 -523125 -524319 -521374 -514953 -515017 -515246 -520143 -520176 -515942 -512418 -509833 -509356 -510434 -505538 -510421
3378 -510421 -517847 -522851 -529760 -522524 -512392 -514646 -521305 -522024 -522359 -524138 -523068 -522731 -525177 -522694 -517034
3363 -517034 -517023 -517796 -516259 -510547 -508181 -511505 -515574 -529349 -527042 -520569 -515600 -512715 -519799 -528307 -527555
3348 -527555 -517763 -508017 -507794 -507428 -505780 -513203 -506006 -504213 -511905 -518518 -516343 -519816 -515957 -518345 -512998
3333 -512998 -512866 -507573 -510747 -513948 -521115 -526851 -525604 -522936 -511898 -506048 -505762 -507841 -511439 -507740 -511086
3318 -511086 -511888 -517461 -516077 -507895 -511829 -514760 -511646 -514176 -510365 -500493 -500868 -508366 -512028 -506684 -506770
3303 -506770 -507869 -514814 -517946 -516079 -511229 -508019 -507367 -512206 -509854 -503842 -503341 -505664 -505870 -507073 -509067
3288 -509067 -505747 -505069 -510607 -513472 -512226 -506771 -509598 -502825 -497384 -502398 -504596 -509022 -514414 -521833 -522895
3273 -522895 -518902 -514257 -509354 -507909 -505556 -501058 -507602 -515420 -509561 -506903 -507742 -506752 -511300 -508201 -504057
3258 -504057 -513100 -500595 -495953 -494984 -496566 -505466 -510034 -514038 -516796 -513502 -512776 -506665 -506542 -511691 -508914
3243 -508914 -501840 -498289 -496917 -499043 -499921 -502721 -505481 -504895 -502025 -501894 -502865 -503945 -505436 -505563 -508083 -510854
3227 -510854 -510404 -507343 -504480 -505135 -506462 -500461 -501136 -507720 -510910 -504602 -502226 -509446 -508689 -505638 -512032
3212 -512032 -513364 -513781 -512834 -508400 -505439 -504631 -508128 -508920 -514584 -517593 -520638 -517868 -509990 -507994 -504156
3197 -504156 -507805 -505340 -508683 -508606 -507428 -502674 -501231 -509235 -513526 -509994 -507220 -501807 -497799 -493565 -491705
3182 -491705 -491959 -497658 -502279 -498328 -501401 -503510 -499475 -498832 -500969 -507512 -505829 -505111 -506472 -506728 -508375
3167 -508375 -507163 -507709 -508461 -506509 -507311 -509090 -508722 -508969 -506323 -501820 -492886 -485985 -486784 -501407 -504284 -509810
3151 -509810 -510206 -512905 -511648 -509957 -503980 -499201 -500371 -499618 -498100 -496893 -501691 -505327 -502264 -496136 -492163
3136 -492163 -492151 -496134 -508919 -512640 -504389 -496427 -493621 -493851 -489965 -493839 -497422 -500273 -495681 -500435 -504335
3121 -504335 -501634 -496174 -492531 -500622 -501360 -500006 -506491 -502927 -498767 -504747 -507666 -504943 -502277 -500700 -502367
3106 -502367 -500457 -503318 -502859 -502444 -504098 -502333 -500997 -497654 -495272 -493622 -492423 -493846 -494936 -500412 -500209
3091 -500209 -494052 -494624 -494468 -495300 -500072 -503482 -503071 -499560 -498546 -491894 -498475 -501280 -497417 -498324 -491033 -482614
3075 -482614 -478433 -483068 -489695 -498718 -502973 -497765 -491163 -496427 -503278 -499696 -497152 -502172 -507787 -503959
3061 -503959 -498459 -497079 -496780 -504284 -505177 -502981 -501855 -499864 -502187 -500568 -499251 -491525 -485864 -486979 -487771
3046 -487771 -489066 -496316 -495318 -495670 -491410 -497037 -505019 -501948 -493995 -489927 -490780 -492468 -487439 -483344 -489086
3031 -489086 -493251 -488704 -486839 -489560 -492828 -485135 -485211 -484955 -493957 -501411 -500783 -493266 -488329 -483868 -480942
3016 -480942 -487500 -494012 -496190 -495014 -482832 -484042 -490685 -489109 -490539 -492183 -487230 -483373 -487097 -493855
3002 -493855 -495788 -492339 -486631 -490282 -486914 -488217 -490823 -490924 -488533 -485678 -491390 -494321 -495166 -490269 -487621
2987 -487621 -489936 -489763 -484795 -486674 -487247 -483737 -481746 -480980 -485871 -489126 -487421 -492404 -499969 -498651 -493958
2972 -493958 -489453 -483951 -488059 -492731 -484520 -473251 -474570 -476823 -479165 -480468 -478703 -479089 -480066 -478923 -482423
2957 -482423 -484519 -487906 -492058 -489533 -491423 -488527 -482647 -481044 -484674 -486145 -488441 -486420 -484052 -486519
2943 -486519 -495259 -497297 -487707 -480053 -484966 -490400 -488008 -482381 -473064 -469873 -480228 -482223 -481084 -477970
2929 -477970 -479423 -484463 -490117 -493599 -498355 -500631 -493189 -490334 -491166 -495588 -496789 -495875 -492483 -485553 -481788
2914 -481788 -483797 -482179 -486702 -494307 -490312 -491740 -495650 -495373 -493108 -491588 -490994 -493307 -486542 -483111 -484120
2899 -484120 -477906 -476620 -483198 -492818 -487943 -491382 -501021 -507414 -507294 -503044 -497659 -492766 -491129 -489578 -487425
2884 -487425 -479548 -476175 -478501 -474473 -476351 -480425 -484585 -478029 -481619 -483316 -482191 -483683 -482502 -478890
2870 -478890 -483640 -490016 -488097 -493344 -492283 -491913 -490799 -482653 -480624 -483681 -484953 -480902 -488182 -492752 -492770
2855 -492770 -491334 -488574 -492884 -495563 -492477 -490282 -489798 -493717 -491423 -485200 -481582 -481855 -482269 -481990 -484543
2840 -484543 -487256 -492945 -491399 -490401 -484253 -486654 -485636 -480914 -480526 -481962 -479879 -477336 -481421 -478939 -479430
2825 -479430 -485666 -485753 -488751 -484213 -480320 -482194 -484638 -490904 -493698 -489326 -482315 -477904 -478859 -481661 -478068
2810 -478068 -474185 -473968 -475089 -473107 -468507 -468092 -475054 -476960 -473922 -471287 -473063 -470904 -472733 -473148 -471742
2795 -471742 -479851 -488200 -484377 -471512 -463022 -466008 -470332 -476851 -478740 -481707 -482264 -475005 -466220 -469211
2781 -469211 -476330 -477135 -481919 -485303 -479759 -479721 -482187 -480652 -477761 -481081 -486927 -488641 -479140 -467961 -470397
2766 -470397 -470129 -470081 -472178 -471926 -477914 -476924 -477710 -475735 -481920 -482116 -475382 -474833 -477319 -481163 -485124 -480778
2750 -480778 -474290 -468703 -472056 -474115 -477601 -475492 -473649 -473025 -479279 -471047 -472042 -478407 -475743 -471447 -474530
2735 -474530 -477612 -478243 -475946 -472727 -476820 -475299 -473288 -465398 -467049 -474210 -476203 -473620 -479170 -480569 -479837
2720 -479837 -478292 -480402 -477979 -477575 -483003 -484598 -480092 -483837 -485194 -478208 -473963 -476276 -481402 -478301 -478945
2705 -478945 -478707 -476991 -471331 -469246 -472598 -468469 -468506 -469195 -466181 -467868 -471056 -468263 -469262 -468004 -459606 -454840
2689 -454840 -460911 -466406 -474154 -476476 -476112 -472603 -468523 -478972 -481551 -478318 -476644 -480099 -486057 -482002
2675 -482002 -476143 -473589 -476018 -476049 -471727 -468558 -469067 -468922 -467754 -465073 -464477 -463855 -464339 -463037 -467833 -473113
2659 -473113 -469491 -469609 -474716 -474054 -471997 -478977 -477701 -478217 -476374 -478252 -476547 -474699 -468740 -462805 -459630
2644 -459630 -463066 -471651 -468584 -467102 -474489 -481731 -477051 -471684 -472272 -476835 -476895 -473652 -473204 -467777 -467141 -470539
2628 -470539 -475599 -476637 -478135 -475239 -469391 -462824 -463378 -469377 -474164 -474760 -469555 -475032 -473707 -476245 -481797
2613 -481797 -481961 -482144 -486765 -490028 -483192 -480464 -474476 -476152 -476316 -474895 -471408 -471163 -474128 -471534 -472304 -476332
2597 -476332 -473724 -475274 -477463 -472021 -470641 -476883 -482565 -483303 -479515 -482438 -476308 -468555 -473866 -473672 -468993
2582 -468993 -466377 -465477 -465527 -464264 -468190 -465417 -469606 -467999 -463268 -459282 -455840 -453057 -455695 -461032 -464321
2567 -464321 -461585 -461182 -467096 -469292 -464464 -464800 -463619 -469243 -469430 -465354 -469633 -469335 -466605 -464086 -463353 -464935
2551 -464935 -464099 -463275 -463251 -470053 -471307 -467762 -465164 -458357 -458818 -460486 -461061 -466346 -466651 -461762 -460451 -460941
2535 -460941 -457755 -455190 -455398 -461363 -469360 -470194 -465897 -466246 -465436 -468751 -470542 -465609 -465331 -467872 -465500 -460614
2519 -460614 -458206 -458449 -466032 -471947 -471137 -472664 -474008 -474865 -468190 -460407 -456014 -463672 -463787 -459142 -457152
2504 -457152 -460795 -465745 -471248 -470033 -465929 -466314 -463205 -455771 -454613 -462597 -466986 -463926 -460654 -457102 -457363
2489 -457363 -452362 -448800 -449462 -451642 -454432 -458876 -466622 -465339 -463424 -453641 -451576 -460274 -461965 -462816 -465308
2474 -465308 -458163 -461565 -464526 -462066 -466807 -471812 -470395 -471748 -468904 -452647 -446063 -450041 -454383 -456106
2460 -456106 -460982 -461515 -456156 -456540 -460218 -460547 -456051 -447553 -447935 -454675 -458835 -462013 -458126 -457645 -458747 -459869
2444 -459869 -460751 -448256 -447025 -452596 -455547 -456172 -454429 -458307 -463086 -464022 -455437 -454422 -452780 -453742 -458558
2429 -458558 -461700 -459269 -463398 -464974 -460642 -464624 -468847 -467671 -467367 -467029 -466200 -461557 -454990 -450826 -451173
2414 -451173 -451311 -454729 -451661 -450889 -453810 -455976 -450000 -454019 -461030 -467385 -469409 -465873 -464248 -461610 -457262
2399 -457262 -458076 -458200 -459725 -463256 -459987 -458584 -456967 -458274 -459960 -456778 -452129 -455662 -449946 -447808 -449478
2384 -449478 -454137 -458200 -463866 -457014 -450338 -450280 -450574 -446614 -454226 -459321 -458745 -460720 -461600 -460971 -459356 -463102
2368 -463102 -457869 -452139 -447858 -447258 -456365 -456597 -447939 -450813 -445156 -446743 -452647 -460911 -459833 -452125 -449051
2353 -449051 -456134 -458011 -456531 -459177 -464412 -464995 -457108 -454763 -453307 -452815 -451059 -445327 -447306 -448561 -449307
2338 -449307 -448647 -452381 -450073 -452562 -452311 -456198 -457922 -453977 -450499 -451277 -454201 -452054 -454019 -459659 -466794
2323 -466794 -473005 -469688 -465569 -464863 -459157 -452149 -453614 -453073 -453978 -454158 -449260 -443365 -450146 -458082 -460821
2308 -460821 -456524 -458501 -454767 -450727 -449191 -445930 -449872 -455337 -457604 -455604 -452068 -450618 -451231 -450304 -448228
2293 -448228 -444148 -440387 -433439 -432982 -444203 -442315 -440357 -444426 -443319 -439944 -440485 -440895 -449495 -449924 -442645
2278 -442645 -445615 -455281 -457074 -448199 -444833 -454041 -452595 -453026 -446634 -441929 -449462 -457972 -462738 -458884 -456978
2263 -456978 -453801 -453920 -456590 -460519 -461652 -459699 -454009 -449725 -445350 -448630 -450392 -453331 -444582 -435027 -438022
2248 -438022 -445648 -441778 -446375 -448435 -445310 -448613 -457216 -455503 -458138 -459062 -455890 -446588 -442085 -449975 -459726
2233 -459726 -460035 -459438 -456473 -450803 -455326 -456579 -447622 -445897 -449625 -452027 -452164 -450788 -446866 -452574 -462130
2218 -462130 -467188 -462579 -454069 -449772 -449804 -442701 -443323 -445202 -445949 -446020 -444291 -442691 -451181 -452242 -448171 -445867
2202 -445867 -446091 -446925 -446609 -448510 -445028 -445366 -447133 -448682 -452198 -450233 -443503 -434342 -427967 -434513 -443131
2187 -443131 -440148 -435437 -436240 -441307 -439996 -443248 -441601 -437253 -440398 -437366 -435372 -436167 -440190 -444067 -446445
2172 -446445 -444261 -439506 -444737 -451627 -450129 -441557 -435133 -434852 -438414 -439729 -436936 -433795 -432380 -438899 -441313
2157 -441313 -440839 -439538 -436731 -434917 -436056 -432523 -432300 -440861 -445355 -443776 -440337 -438999 -441758 -444174 -437949
2142 -437949 -439318 -443485 -447370 -457208 -453354 -449468 -450429 -448603 -444227 -441615 -441409 -442727 -439690 -434919 -434417
2127 -434417 -441902 -446002 -449370 -451923 -442488 -443666 -441817 -438386 -438251 -440245 -443522 -443990 -434839 -431082 -432082
2112 -432082 -438549 -440961 -440487 -437657 -439616 -442782 -444266 -441394 -436647 -442022 -442110 -438389 -439191 -435282 -440160
2097 -440160 -443300 -447486 -448560 -438574 -431348 -437915 -450082 -445809 -445478 -443954 -442585 -442902 -438824 -432928 -432548
2082 -432548 -434470 -446053 -455541 -457519 -464262 -455489 -447095 -447085 -445030 -442337 -435354 -424787 -423497 -432866
2068 -432866 -438931 -441078 -440612 -437439 -434009 -431423 -430830 -437498 -443994 -438254 -433642 -432455 -432240 -432420 -438271
2053 -438271 -444013 -448560 -447765 -443427 -434893 -435896 -442865 -448393 -442057 -429769 -424611 -430429 -429135 -429366 -438999
2038 -438999 -441559 -435730 -436457 -437913 -437634 -432192 -426776 -429266 -434683 -430014 -430071 -436835 -442381 -435822 -434702
2023 -434702 -434270 -437341 -440751 -442463 -446804 -446845 -449613 -451695 -446829 -441845 -434944 -428458 -429962 -434406 -431998
2008 -431998 -432756 -438028 -438803 -440138 -438926 -443035 -441307 -436555 -437482 -437944 -444298 -441628 -434397 -435264 -438362 -438176
1992 -438176 -442840 -441452 -440095 -439534 -436365 -442962 -442556 -439830 -439687 -441282 -438517 -434901 -436071 -434139 -435052
1977 -435052 -437271 -435842 -431752 -433266 -433263 -429262 -428756 -432537 -432026 -433402 -433490 -434102 -433432 -436516 -434861 -434523 -435500
1960 -435500 -436550 -431134 -428154 -433390 -436201 -434777 -427216 -429617 -426355 -426372 -426302 -428006 -431924 -439115 -447148
1945 -447148 -451833 -444741 -438037 -440717 -443209 -447280 -445631 -442863 -448295 -446280 -441170 -439733 -433930 -425862
1931 -425862 -428284 -436394 -440073 -437164 -432078 -436301 -442015 -441914 -434661 -433830 -436041 -440213 -435847 -436622 -437024
1916 -437024 -435710 -430112 -429127 -431418 -432859 -430952 -434524 -435444 -435939 -434631 -434723 -429556 -423606 -424462 -422156 -421441
1900 -421441 -424680 -432739 -434268 -433773 -435375 -429834 -425452 -431640 -437720 -438099 -435104 -424655 -426718 -430494 -432939
1885 -432939 -433780 -436040 -441435 -440060 -431822 -429403 -423896 -425367 -428605 -425898 -424972 -420938 -426653 -432875 -435072
1870 -435072 -434048 -430119 -426157 -430757 -436226 -439425 -440595 -432115 -423885 -428716 -435710 -434309 -430304 -428630
1856 -428630 -430596 -434860 -435287 -439754 -440826 -435853 -432333 -430308 -431154 -431836 -428668 -428620 -424103 -431411 -437479 -434530
1840 -434530 -429207 -424893 -423390 -423977 -422726 -421900 -422179 -425430 -427292 -423852 -421926 -425284 -427606 -428173 -431700
1825 -431700 -429921 -431823 -425483 -430637 -434151 -428456 -428991 -427762 -427756 -428513 -429327 -428271 -424284 -420154 -417507 -417217
1809 -417217 -416035 -414872 -416540 -428143 -428359 -422198 -417438 -416339 -416717 -431673 -434538 -433620 -429255 -426279 -426463
1794 -426463 -424128 -431079 -434467 -431772 -424183 -415955 -424296 -428997 -431840 -433601 -433263 -434077 -427763 -420906 -422553
1779 -422553 -421806 -420441 -415764 -418645 -422121 -423987 -420947 -422414 -425831 -423917 -425032 -424091 -418890 -424421 -428383
1764 -428383 -427065 -425018 -421772 -420189 -419536 -425040 -422521 -418827 -417857 -421285 -423777 -423354 -420496 -417709 -412614
1749 -412614 -408402 -411917 -419410 -424853 -427262 -422485 -415467 -419867 -420662 -427065 -428186 -425233 -417207 -419332 -421812
1734 -421812 -421057 -423695 -423569 -426061 -427500 -431715 -437506 -435986 -434832 -423199 -416999 -420131 -422934 -426396 -428331
1719 -428331 -427076 -422331 -422543 -421619 -423406 -426043 -422913 -424519 -429966 -437643 -432861 -428256 -421037 -420600 -422792
1704 -422792 -426143 -425216 -423974 -430298 -428384 -434452 -436453 -432551 -428898 -433348 -426486 -431312 -435616 -429383 -418671
1689 -418671 -409987 -413860 -415959 -413973 -413026 -408464 -411112 -409575 -410031 -412041 -417006 -421675 -424797 -425185 -426088
1674 -426088 -423681 -418561 -414376 -414944 -414618 -417192 -415943 -420014 -423742 -435415 -439668 -434029 -427265 -421598 -424054
1659 -424054 -430391 -426564 -420724 -415956 -421717 -421454 -417237 -415071 -411050 -414970 -418129 -420110 -417733 -415304 -416273
1644 -416273 -414827 -413769 -409126 -415705 -422489 -430789 -427874 -420650 -412861 -411662 -412805 -416302 -412147 -411617 -412160
1629 -412160 -413336 -415013 -414518 -414740 -415227 -411530 -410139 -421808 -425610 -424429 -417889 -421721 -420493 -416530 -410194
1614 -410194 -413441 -412946 -418335 -421348 -418761 -419525 -422868 -425450 -418502 -414027 -409919 -411440 -418390 -416872 -410730
1599 -410730 -413190 -414568 -415693 -415751 -418396 -412801 -407408 -412784 -415753 -411737 -412814 -417369 -414819 -414250 -412837
1584 -412837 -409308 -404042 -404589 -412823 -414242 -418624 -416565 -414608 -410751 -411092 -410051 -411905 -414898 -409173 -412007
1569 -412007 -414184 -409592 -408275 -410511 -414992 -415326 -415775 -415248 -415403 -416024 -413274 -419592 -424617 -423881 -429818 -430519
1553 -430519 -427974 -425183 -423263 -423779 -422884 -424092 -429257 -427602 -420635 -420019 -421275 -417584 -418356 -419077 -413007 -411398
1537 -411398 -416393 -412566 -410660 -413461 -414693 -410266 -406211 -404068 -408431 -412822 -414389 -414359 -415387 -413869 -419443
1522 -419443 -419416 -415519 -411782 -413142 -415352 -410477 -413605 -418503 -417746 -412540 -413600 -409973 -404132 -408430 -415504
1507 -415504 -418347 -417875 -416091 -420707 -427349 -428801 -425004 -418664 -420609 -427687 -427173 -418276 -415992 -418966 -412598
1492 -412598 -405620 -408491 -415495 -418766 -418905 -413249 -413526 -415072 -417957 -419082 -414655 -416657 -421756 -424322 -427723
1477 -427723 -424162 -409478 -407490 -413093 -418058 -419982 -415987 -413787 -413996 -418903 -422116 -424466 -424226 -418130 -415442
1462 -415442 -409189 -410742 -415705 -420144 -418876 -419598 -418074 -410981 -407055 -418520 -424869 -415071 -412087 -412468 -414810
1447 -414810 -409785 -405770 -404422 -401934 -403342 -405810 -410587 -412859 -417270 -425400 -423394 -420657 -418435 -413572
1433 -413572 -410608 -414900 -416205 -413168 -409347 -404259 -402838 -403364 -404706 -402238 -400383 -405037 -411398 -412675 -417025
1418 -417025 -414027 -410957 -409581 -409608 -409414 -414730 -413674 -414098 -421614 -424042 -423755 -418238 -412304 -412328 -411739 -415504
1402 -415504 -418452 -417397 -415744 -405633 -408750 -413140 -412541 -405390 -404263 -405820 -404901 -402766 -401788 -408886 -414328
1387 -414328 -413421 -413768 -410571 -405346 -400984 -401461 -403865 -405233 -415034 -419730 -408158 -398605 -402012 -407347 -406788
1372 -406788 -411041 -409081 -406822 -407851 -407042 -410607 -411200 -410666 -407643 -411753 -411266 -409255 -408236 -409511 -410978
1357 -410978 -407850 -401188 -387881 -389157 -397985 -405796 -404538 -401673 -396462 -403645 -410878 -412264 -417540 -416600
1343 -416600 -406281 -401168 -402615 -403065 -406329 -409090 -408908 -409482 -413897 -412006 -407698 -400441 -405385 -402934 -405393
1328 -405393 -402435 -397226 -398656 -396938 -406710 -418678 -419511 -411761 -408244 -409320 -410152 -407687 -406003 -404419 -403925
1313 -403925 -403946 -405453 -399286 -400697 -403349 -402489 -402376 -401086 -406178 -413042 -408184 -407051 -413781 -410444 -403522
1298 -403522 -401608 -406078 -408595 -405836 -402335 -398133 -398610 -405904 -413112 -413620 -411893 -416866 -412248 -407681 -407544
1283 -407544 -410609 -419117 -419186 -419571 -415973 -407869 -401733 -397086 -403910 -404276 -406681 -404045 -396582 -396068 -403256 -405760
1267 -405760 -400838 -393389 -393709 -397443 -402785 -399800 -398775 -401827 -405954 -406180 -405032 -403353 -405524 -407077 -406416
1252 -406416 -407745 -404106 -405834 -409529 -403075 -395640 -388181 -386546 -393715 -394184 -398034 -402254 -407869 -405398 -398860
1237 -398860 -398240 -397777 -401345 -405019 -408428 -412427 -404807 -406170 -402919 -394733 -398179 -401637 -403494 -406464 -407116
1222 -407116 -406006 -407453 -412320 -409345 -403733 -399035 -404479 -403541 -397268 -394303 -391706 -390450 -394640 -393661 -388704
1207 -388704 -395724 -401190 -401329 -399542 -400880 -400771 -393038 -396267 -401219 -404346 -404147 -398680 -395775 -401163 -405706
$$ [...]
##END NTUPLES=NMR SPECTRUM
##END=
