##TITLE=Analysis number 326842
Compound Code cc 60624
Book Reference 486/100
Project Code adrs
Chemist Name simons
##JCAMPDX= 6.0         $$ Bruker NMR JCAMP-DX V2.0
##DATA TYPE= NMR SPECTRUM
##DATA CLASS= NTUPLES
##ORIGIN= Bruker BioSpin GmbH
##OWNER= nmr
$$ XWIN-NMR		Version 3.5
$$ Fri Feb 23 13:17:48 2007 GMT Standard Time (UT+0h)  MAYBRIDGE\nmr@NMR_250MHZ
##.OBSERVE FREQUENCY= 250.131544655141
##.OBSERVE NUCLEUS= ^1H
##.ACQUISITION MODE= SIMULTANEOUS (DQD)
##.ACQUISITION SCHEME= undefined
##.AVERAGES= 16
##.DIGITISER RES= 18
##SPECTROMETER/DATA SYSTEM= dpx250
##.PULSE SEQUENCE= zg30
##.SOLVENT NAME= CDCl3
##.SHIFT REFERENCE= (INTERNAL, CDCl3, 0, 16.522)
##AUDIT TRAIL= $$ (NUMBER, WHEN, WHO, WHERE, WHAT)
$$ ##TITLE= Audit trail, XWIN-NMR		Version 3.5
$$ ##JCAMPDX= 5.01
$$ ##ORIGIN= Bruker BioSpin GmbH
$$ ##OWNER= nmr
$$ C:\u/data/dgb/nmr/ADRS/1920/pdata/1/auditp.txt
$$ ##AUDIT TRAIL=  $$ (NUMBER, WHEN, WHO, WHERE, WHAT)
(   1,<2007-02-23 13:17:19.93 +000>,<MAYBRIDGE\nmr>,<NMR_250MHZ>,
      <created by zg, POWCHK disabled, PULCHK disabled
       configuration hash MD5:
       49 4B E0 1D 92 C2 6B 37 9F E6 65 BC 52 41 86 1D
       data hash MD5: 64K
       80 6C 1A F8 0B 56 3D 24 FC A7 C6 04 D0 BC A3 AF>)
(   2,<2007-02-23 13:17:37.08 +000>,<MAYBRIDGE\nmr>,<NMR_250MHZ>,
      <Start of raw data processing
       ef LB = 0.3 FT_mod = 6 PKNL = 1 SI = 32K 
       data hash MD5: 32K
       21 00 57 63 49 47 A0 11 69 A1 7B 46 9D 63 5E DA>)
(   3,<2007-02-23 13:17:38.71 +000>,<MAYBRIDGE\nmr>,<NMR_250MHZ>,
      <apk 
       data hash MD5: 32K
       A9 B1 1C 69 84 37 C8 EC B0 A6 5A AD 73 1C 8A B9>)
(   4,<2007-02-23 13:17:39.43 +000>,<MAYBRIDGE\nmr>,<NMR_250MHZ>,
      <abs ABSG = 5 
       data hash MD5: 32K
       5B 1B D7 75 7C 6D 5D 1F A6 3C 3D F5 FF 66 CC D1>)
$$ ##END=
$$ 
$$ hash MD5
$$ 30 D7 F7 1F AB 47 F1 C8 76 DB CC BD 24 A1 56 86
##$RELAX= 
##$RELAX= 
##$RELAX= 
##$RELAX= 
##$RELAX= 
##$RELAX= 
##$RELAX= 
$$ Bruker specific parameters
$$ --------------------------
##$DU= <C:\u>
##$EXPNO= 1920
##$NAME= <ADRS>
##$PROCNO= 1
##$TYPE= <nmr>
##$USER= <dgb>
##$AMP= (0..31)
100 100 100 100 100 100 100 100 100 100 100 100 100 100 100 100 100 100 
100 100 100 100 100 100 100 100 100 100 100 100 100 100 
##$AQSEQ= 0
##$AQ_mod= 3
##$AUNM= <au_zg>
##$AUTOPOS= <14 >
##$BF1= 250.13
##$BF2= 250.13
##$BF3= 250.13
##$BF4= 250.13
##$BF5= 500.13
##$BF6= 500.13
##$BF7= 500.13
##$BF8= 500.13
##$BYTORDA= 1
##$CFDGTYP= 0
##$CFRGTYP= 5
##$CHEMSTR= <none>
##$CNST= (0..31)
1 1 145 1 1 1 1 1 1 1 1 1 1 1 1 1 1 1 1 1 1 1 1 1 1 1 1 1 1 1 1 1 
##$CPDPRG= <>
##$CPDPRG1= <>
##$CPDPRG2= <>
##$CPDPRG3= <>
##$CPDPRG4= <mlev>
##$CPDPRG5= <mlev>
##$CPDPRG6= <mlev>
##$CPDPRG7= <mlev>
##$CPDPRG8= <mlev>
##$CPDPRGB= <>
##$CPDPRGT= <>
##$D= (0..31)
0 1 0 0 0 0 0 0 0 0.06 0 0 0 0 0 0 0.0002 0 0 0 0 0 0 0 0 0 0 0 0 0 0 
0 
##$DATE= 1172236638
##$DBL= (0..7)
120 120 120 120 120 120 120 120 
##$DBP= (0..7)
150 150 150 150 150 150 150 150 
##$DBP07= 0
##$DBPNAM0= <>
##$DBPNAM1= <>
$$ [...]
##$SUBNAM6= <"">
##$SUBNAM7= <"">
##$SUBNAM8= <"">
##$SUBNAM9= <"">
##$SW= 20.6930455092707
##$SWIBOX= (0..15)
0 0 3 0 0 0 0 0 0 0 0 0 0 0 0 0 
##$SW_h= 5175.983436853
##$TD= 65536
##$TD0= 1
##$TE= 295.16
##$TE2= 300
##$TE3= 300
##$TEG= 300
##$TL= (0..7)
0 120 120 120 120 120 120 120 
##$TP= (0..7)
150 150 150 150 150 150 150 150 
##$TP07= 0
##$TPNAME0= <>
##$TPNAME1= <>
##$TPNAME2= <>
##$TPNAME3= <>
##$TPNAME4= <>
##$TPNAME5= <>
##$TPNAME6= <>
##$TPNAME7= <>
##$TPOAL= (0..7)
0.5 0.5 0.5 0.5 0.5 0.5 0.5 0.5 
##$TPOFFS= (0..7)
0 0 0 0 0 0 0 0 
##$TUNHIN= 0
##$TUNHOUT= 0
##$TUNXOUT= 0
##$USERA1= <user>
##$USERA2= <user>
##$USERA3= <user>
##$USERA4= <user>
##$USERA5= <user>
##$V9= 5
##$VALIST= <valist>
##$VCLIST= <CCCCCCCCCCCCCCC>
##$VD= 0
##$VDLIST= <DDDDDDDDDDDDDDD>
##$VPLIST= <PPPPPPPPPPPPPPP>
##$VTLIST= <TTTTTTTTTTTTTTT>
##$WBST= 1024
##$WBSW= 4
##$XGAIN= (0..3)
0 0 0 0 
##$XL= 0
##$YL= 0
##$YMAX_a= 251721
##$YMIN_a= -423735
##$ZGOPTNS= <>
##$ZL1= 120
##$ZL2= 120
##$ZL3= 120
##$ZL4= 120
##$ABSF1= 16.522
##$ABSF2= -4.171173
##$ABSG= 5
##$ABSL= 3
##$ALPHA= 0
##$AQORDER= 0
##$ASSFAC= 0
##$ASSFACI= 0
##$ASSFACX= 0
##$ASSWID= 0
##$AUNMP= <proc_1d>
##$AZFE= 0.1
##$AZFW= 0.1
##$BCFW= 0
##$BC_mod= 0
##$BYTORDP= 0
##$COROFFS= 0
##$CY= 12.5
##$DATMOD= 1
##$DC= 0
##$DFILT= <>
##$DTYPP= 0
##$F1P= 14.0000005364418
##$F2P= -0.99999901652339
##$FCOR= 0.5
##$FTSIZE= 32768
##$FT_mod= 6
##$GAMMA= 0
##$GB= 0
##$INTBC= 1
##$INTSCL= 1
##$ISEN= 128
##$LB= 0.3
##$LEV0= 0
##$LPBIN= 0
##$MAXI= 10000
##$MC2= 0
##$MEAN= 0
##$ME_mod= 0
##$MI= 0
##$NCOEF= 0
##$NC_proc= -3
##$NLEV= 6
##$NOISF1= 0
##$NOISF2= 0
##$NSP= 0
##$NTH_PI= 0
##$NZP= 0
##$OFFSET= 16.522
##$PC= 1
##$PHC0= 223.603
##$PHC1= 10.05648
##$PH_mod= 1
##$PKNL= yes
##$PPARMOD= 0
##$PSCAL= 4
##$PSIGN= 0
##$REVERSE= no
##$SF= 250.13
##$SI= 32768
##$SIGF1= 0
##$SIGF2= 0
##$SINO= 400
##$SIOLD= 32768
##$SREGLST= <1H.CDCl3>
##$SSB= 0
##$STSI= 32768
##$STSR= 0
##$SW_p= 5175.98343685301
##$SYMM= 0
##$S_DEV= 0
##$TDeff= 65536
##$TDoff= 0
##$TI= <Analysis number 999999
Compound Code 99
Book Reference 9
Project Code 9>
##$TILT= no
##$TM1= 0
##$TM2= 0
##$TOPLEV= 0
##$USERP1= <user>
##$USERP2= <user>
##$USERP3= <user>
##$USERP4= <user>
##$USERP5= <user>
##$WDW= 1
##$XDIM= 32768
##$YMAX_p= 378650530
##$YMIN_p= -91497
$$ End of Bruker specific parameters
$$ ---------------------------------
##NTUPLES= NMR SPECTRUM
##VAR_NAME=  FREQUENCY,     SPECTRUM/REAL,   SPECTRUM/IMAG
##SYMBOL=    X,             R,               I
##VAR_TYPE=  INDEPENDENT,   DEPENDENT,       DEPENDENT
##VAR_FORM=  AFFN,          ASDF,            ASDF
##VAR_DIM=   32768,         32768,           32768
##UNITS=     HZ,            ARBITRARY UNITS, ARBITRARY UNITS
##FACTOR=    0.157963299565203, 1,           1
##FIRST=     4132.6476996994, 0,             0
##LAST=      -1043.33573715361, 0,           0
##MIN=       -1043.33573715361, -91497,      0
##MAX=       4132.6476996994, 378650530,     0
$$ Real data points
##PAGE= N=1
##DATA TABLE= (X++(R..R)), XYDATA
$$ [...]
18848C246849M18755O56697J041688J633052K440506L072340K995100K424435
$$ 3246849 3665604 4322301 5363989 6997041 9437547 12509887 15504987 17929422
18840A7929422Q87671j143305j948879j908879j033250O32202K571433M248610
$$ 17929422 18817093 17673788 15724909 13816030 12782780 13414982 15986415 20235025
18832B0235025N023756M344697J945923r92843l752346m968508m533522l254490
$$ 20235025 25258781 29603478 31549401 30556558 26804212 21835704 17302182 14047692
18824A4047692j451216L12180J527344J804629J144928o12588k352890l096545
$$ 14047692 12596476 12908656 14436000 16240629 17385557 16772969 14420079 11323534
18816A1323534l027903k332662j547309r78691o16355m26103k78166j82518j38754
$$ 11323534 8295631 5962969 4415660 3436969 2820614 2394511 2116345 1933827 1795073
18807A795073j06180j13354j38779j20731p7781n1876n4705n8899n4290o5425
$$ 1795073 1688893 1575539 1436760 1316029 1238248 1186372 1131667 1072768 1018478 953053
18797I53053o3990o1243o6754n6275n8974o8709n3618m5644j7837M714r265j0867
$$ 953053 889063 827820 761066 704791 645817 577108 523490 477846 460009 464723 455458 444591
18785D44591n813m981k6820m8799k7244j5806q976k1375j0130Q749R756m379m81
$$ 444591 438778 433797 406977 358178 330934 315128 306152 284777 274647 283396 293152 288773 288292
18772B88292J2173r199K6811M3235M9547N1357L9939j1204m0752n832K384n624
$$ 288292 300465 291266 318077 361312 410859 462216 502155 490951 450199 444367 446751 441127
18760D41127m565J0097L8776P4792M8071M066j3482k0707j7266j6922j7282k1276
$$ 441127 436562 446659 485435 560227 608298 612364 598882 578175 560909 543987 526705 505429
18748E05429k4095k5409J630R821J3588n350q043j1662L906N656j392L720n743
$$ 505429 481334 455925 457555 467376 480964 475614 467571 455909 459815 465471 464079 467799 462056
18735D62056r26K3825N9364J09440J14506P6688J2959l0621p2083j21206j33094
$$ 462056 461130 484955 544319 653759 768265 844953 857912 827291 755208 634002 500908
18724E00908j07200p1595n0757k7078k0146k0718l2576j9751O00j1289j4171j8130
$$ 500908 393708 322113 271356 244278 224132 203414 170838 151087 151687 140398 126227 108097
18712A08097j2727N595P77J5760K2423N289m741J680J5913J2198R789J3529P454
$$ 108097 95370 100965 101742 117502 139925 145214 140473 142153 158066 170264 180053 193582 201036
18699B01036J2212M096J5423J6630M589N954O028O028L009Q323J6536l416q457
$$ 201036 213248 217344 232767 249397 253986 259940 265968 271996 275005 283328 299864 296448 287991
18686B87991j6553j3837r984j0391j2269j67L948j926o088o985l945j9416k3941
$$ 287991 271438 257601 247617 237226 224957 224790 228738 226812 220724 213739 209794 190378 166437
18673A66437j3697l786O181o39j3115l7J1552L772j4115j438K2232J0648q072
$$ 166437 152740 148954 155135 154496 141381 141344 152896 156668 142553 141115 163347 173995 165923
18660A65923k2288j7113k93L702O005J5637n400L81P408J0251p045p815J573K952
$$ 165923 143635 126522 126229 129931 135936 151573 146173 146554 153962 164213 157168 149353 150926 153878
18646A53878k642K124l495j0798J1841J3298J5535j2895j4006l618P03L704n467
$$ 153878 151236 153360 149865 139067 150908 164206 179741 166846 152840 149222 149925 153629 148162
18633A48162L565N894O470K600P664k205j4194m311n029J858K937o813J037J7351
$$ 148162 151727 157621 164091 166691 174355 172150 157956 153645 148616 150474 153411 146598 147635 164986
18619A64986J951o121J2508M439k335j958j871J3127J9353J3495K071P143L699
$$ 164986 166937 160816 173324 177763 175428 173470 171599 184726 204079 217574 219645 226788 230487
18606B30487J6718J1672Q037j3270k1883q422j405J4923Q322J3947K5658K4877
$$ 230487 247205 258877 266914 253644 231761 223339 221934 236857 245179 259126 284784 309661
18594C09661J1458j0892m3784l2967k5657k1062j929J8782J9282J2626J264q657
$$ 309661 321119 310227 266443 233476 207819 186757 184828 203610 222892 235518 236782 228125
18582B28125j8392q896j6439j4236K10N296K184o84K2881K3891M534r939m612
$$ 228125 209733 200837 184398 170162 170372 175668 177852 177168 200049 223940 228474 218535 213923
18569B13923j809j0290m505K5761L1845K0271L8430K1921k0624p472j4869M01
$$ 213923 212114 201824 197319 223080 254925 275196 313626 335547 314923 307451 292582 292983
18557B92983l552K1570N6878N8120J9544J3094j0536j698j3660k8095k7985k3822
$$ 292983 289431 311001 367879 425999 445543 458637 448101 446403 432743 404648 376663 352841
18545C52841j0212J4832K5307J1968R341K9467N1355O5667R6440J26197J26886
$$ 352841 342629 357461 382768 394736 404077 433544 484899 550566 647006 773203 900089
18534I00089N6412p1450j37025j01677o0067m1310R325L0059N7556R4975J24993
$$ 900089 956501 885051 748026 646349 586282 544972 554297 584356 641912 736887 861880
18523H61880J36257O3253n7803j02778j03683p6911p4087m0073m6772m9177m2192
$$ 861880 998137 1061390 1003587 900809 797126 720215 646128 606055 559283 510106 467914
18512D67914l3548k5728j5426q849j8759j1831M293j0097j5913k8578j8391q119
$$ 467914 434366 408638 393212 384363 365604 353773 358066 347969 332056 303478 285087 276968
18500B76968m115O652j645K0529L0459j2775j4793N114O528k0171k3231j1550
$$ 276968 272853 279505 277860 298389 328848 316073 301280 306394 312922 292751 269520 257970
18488B57970j3101r567j2839k6552j9781J2506P582r014J0052J8076R055L930
$$ 257970 244869 235302 222463 195911 176130 188636 196218 187204 197256 215332 224387 228317
18476B28317j0060R195K183J745J4145J3948O735r537k2518n901M243K3005L654
$$ 228317 218257 227452 229635 231380 245525 259473 266208 256671 234153 228252 232495 255500 259154
18463B59154j1834l284K410j5982j3606j6994o463J2363J6130J8867O677K0739
$$ 259154 247320 244036 246446 230464 216858 199864 193401 205764 221894 240761 247438 268177
18451B68177K3330J0548J0479K7453M1091J4518J3307J4191j1007k3288j7007
$$ 268177 291507 302055 312534 339987 381078 395596 408903 423094 412087 388799 371792
18440C71792l652L068N96P580N478K0931K3001L4637N6072O5077O8606Q9581J00085
$$ 371792 368140 371208 371804 379384 384862 405793 428794 463431 519503 584580 653186 742767 842852
18427H42852J16080J43938J20557O1286L4033j8024n5422j17498j28790q2884
$$ 842852 958932 1102870 1223427 1284713 1318746 1300722 1245300 1127802 999012 916128
18417I16128n5632k4003O124J4963J1879L8270L9618L1635j211K333K8575L3534
$$ 916128 860496 836493 842617 857580 869459 907729 947347 978982 977771 980104 1008679 1042213
18405A042213N0653O4055M6127K6685J2021o092J41J3288L838K2209K1673k65
$$ 1042213 1092866 1156921 1203048 1229733 1241754 1235662 1235803 1249091 1252929 1275138 1296811 1296546
18393A296546P204L8200R6718J77332K26359J63890K9968L4336J34803J91605
$$ 1296546 1303750 1341950 1438668 1616000 1842359 2006249 2036217 2070553 2205356 2396961
18383B396961J74209J55184K02570L42708N87517R05871J133421J188440J145977
$$ 2396961 2571170 2726354 2928924 3271632 3859149 4765020 5898441 7086881 8232858
18374H232858Q38811R7330o25926j172528j196095q81890l79875K30994R24674
$$ 8232858 9071669 9168999 8543073 7370545 6174450 5292560 4912685 5143679 6068353
18365F068353J718014K529656K928211K472784J279272L47468j33417q80052k174563
$$ 6068353 7786367 10316023 13244234 15717018 16996290 17343758 17210341 16330289 14155726
18356A4155726l019764k880223k144051j403634q91449n66588l72901k56103j52691
$$ 14155726 11135962 8255739 6111688 4708054 3816605 3250017 2877116 2621013 2468322
18347B468322p1311j881Q3296J38820K02976K55943L36850M21940M73763M25530
$$ 2468322 2397011 2395130 2478426 2617246 2820222 3076165 3413015 3834955 4308718 4734248
18337D734248L89012L42381K47471J89014r105k35296j21478J94684M41553M33021
$$ 4734248 5123260 5465641 5713112 5902126 5893021 5657725 5536247 5730931 6172484 6605505
18327F605505J95281J12639K81000L99778M36879N01420P62463J305777K197104
$$ 6605505 6800786 6913425 7194425 7594203 8031082 8532502 9294965 10600742 12797846
18318A2797846L609028N540073P484122Q269688O983768M272639J924586P89987
$$ 12797846 16406874 21946947 29431069 37700757 44684525 48957164 50881750 51671737
18310E1671737n43444k370916k764388l22960L336493O053503N410283J275447
$$ 51671737 51128293 48757377 45992989 45670029 49006522 55060025 60470308 61745755
18302F1745755k823145p553626r818451q989582o648224l696063j024791J027532
$$ 61745755 58922610 51368984 41550533 32560951 25912727 22216664 21191873 22219405
18294B2219405K890645N420877Q192633R871371R264664M621676j011425o054149
$$ 22219405 25110050 30530927 38723560 48594931 57859595 62481271 61469846 55415697
18286E5415697j0151027j0558778q891142o404354m093683k629060j854089j345052
$$ 55415697 45264670 34705892 25814750 19410396 15316713 12687653 10833564 9488512
18278I488512r32908n58602k55853l946K86504O58998J215179K167625L659225
$$ 9488512 8555604 7997002 7741149 7737203 8023707 8682705 9897884 12065509 15724734
18269A5724734N516458O853667O044023K782978Q900k31977n9883k218387n423221
$$ 15724734 21241192 28094859 34138882 36921860 36930760 36698783 36638900 34420513 28997292
18260B8997292o368226m997467l139653j989558j681088j738200j529992j075635
$$ 28997292 22629066 17631599 14491946 12502388 10821300 9083100 7553108 6477473
18252F477473o64456l65141j44314Q5221L47738O56777J100130J712597K488503
$$ 6477473 5813017 5447876 5303562 5388783 5736521 6393298 7493428 9206025 11694528
18243A1694528L116804L043659K722851K178576K53090j392931j407980j037734
$$ 11694528 14811332 17854991 20577842 22756418 23009508 21616577 20208597 19170863
18235A9170863k0918J982822M046163N070528M998477L476547O77259j927947
$$ 19170863 19149945 21132767 25178930 30249458 35247935 38724482 39401741 37473794
18227C7473794m275768n076943m342715l085237j213759N95762J336912J387208
$$ 37473794 33198026 28121083 23778368 20693131 19479372 20075134 21412046 22799254
18219B2799254O37151j560769l041097l331830l449248l003969k173279j445854
$$ 22799254 23436405 21875636 18834539 15502709 12053461 9049492 6876213 5430359
18211E430359r56374o42623m47934l17220k23934j49688j20225p3843m6669j3800
$$ 5430359 4473985 3831362 3383428 3066208 2842274 2692586 2572361 2498518 2451849 2438049
18201B438049J1060M2781J50392L14736N59500Q68446J217090J355843J245263
$$ 2438049 2449109 2491890 2642282 2957018 3516518 4384964 5602054 6957897 8203160
18192H203160J143463N09228m49049p15679o62807n23125O4294R21266J611599
$$ 8203160 9346623 9855851 9406802 8691123 8028316 7505191 7569485 8490751 10102350
18183A0102350J901242J688599R58473N8032j088119j846121j780387j507728
$$ 10102350 12003592 13692191 14650664 14708696 13620577 11774456 9994069 8486341
18175H486341j012496k67428K23431L56203L21858k35248r04976j080453j171852
$$ 8486341 7473845 7206417 7429848 7786051 8107909 7872661 6967685 5887232 4715380
18166D715380j106461q46247n57037l50808k49983j87577j58212j21619j05739
$$ 4715380 3608919 2762672 2205635 1854827 1604844 1417267 1259055 1137436 1031697
18157A031697r0558o9627n0269m6851l5873k6541j1562J4316K5573L0384K0599
$$ 1031697 941139 871512 821243 774392 738519 711978 700416 714732 740305 770689 791288
18146G91288l028j3672r330j7210l7274o4613n9128m2574k8610k1548l0617O622
$$ 791288 788260 774588 765258 748048 710774 646161 587033 544459 515849 494301 463684 470306
18134D70306O571N420k740L925J4572J0451J0414P762K9389L7779O0064Q1546
$$ 470306 476877 482297 479557 483482 498054 508505 518919 526681 556070 593849 653913 735459
18122G35459R2139Q8486Q4887J08043J34590K13193L17360M67489O84239J048336
$$ 735459 827598 916084 1000971 1109014 1243604 1456797 1774157 2241646 2925885 3974221
18112C974221J792018L325578N736502Q886406Q808372j210088r668327q456954
$$ 3974221 5766239 9091817 14828319 23714725 32523097 31313009 21644682 13187728
18104A3187728m956371k703386j551284r63356n89781m03475l04870k38416j72110
$$ 13187728 8231357 5527971 3976687 3013331 2423550 2020075 1715205 1476789 1304679
18095A304679j41639j42655j09172o4777n5844m2952l5502k7775k9761k3771j6253
$$ 1304679 1163040 1020385 911213 846436 790592 747640 712138 684363 654602 630831 614578
18084F14578q782L788n790J5282K9788L2289P0209J31068J82969K71002M21706
$$ 614578 605796 609584 603794 619076 648864 681153 751362 882430 1065399 1336401 1758107
18073A758107P15768J054223J386937J495258J024298K03769m64555j237885j504626
$$ 1758107 2473875 3528098 4915035 6410293 7434591 7638360 7173805 5935920 4431294
18064D431294j291241r57522o31728m07572k50519j75491j19744p0823o4559m9551
$$ 4431294 3140053 2182531 1550803 1143231 892712 717221 597477 526654 462095 412544
18054D12544l9161l1592k838J183J2504K0640N414k4291j9959l2392m4956l2866
$$ 412544 373383 341791 338953 340136 352640 373280 378694 354403 334444 302052 257096 224230
18042B24230k6988j2266K916K171K062j2039l192j9549p220m991r854L792L148
$$ 224230 197242 184976 187892 190063 192125 180086 176894 157345 150125 145134 135280 139072 142220
18029A42220p72n759k1647j1692r536L425k630j101j8053j427n837l916P788J0479
$$ 142220 141448 135689 114042 102350 92814 96239 93609 92508 74455 73028 67191 63275 71063 81542
18015H1542K972j869m792n547K954N288J3770n699K73j7223j4550M8P117n685
$$ 81542 84514 82645 77853 72306 75260 80548 94318 88619 88892 71669 57119 57167 64284 58599
18001E8599K708k152j0997j1939m216l977j6284k369K0171J5498J5905j30K216
$$ 58599 61307 59155 48158 36219 32003 28026 11742 9373 29544 45042 60947 60817 63033
17988F3033N256L737J7374M271K5938K4887J9108J5265J0586j3659k7876k4507
$$ 63033 68289 72026 89400 93671 119609 144496 163604 178869 189455 175796 147920 123413
17976A23413j5902j7396J828J0683n875k2604j4744o90j1346q469O352J2234j0766
$$ 123413 107511 90115 91943 102626 96751 74147 59403 58713 47367 38898 45250 57484 46718
17963D6718j2958N467J6407P373j316k507L869m817j5936o098M431k800J8479
$$ 46718 33760 39227 55634 63007 61691 59184 63053 58236 42300 36202 40633 37833 56312
17950E6312R983L477j4698k2850L980J3160J4043M044p349N147J3165o510J274
$$ 56312 66295 69772 55074 32224 36204 49364 63407 67451 60102 65249 78414 71904 73178
17937G3178R70j8804j350N869P490O680K139l809k004P592j1807P675K3924j2536
$$ 73178 74148 55344 53994 59863 67353 74033 76172 72363 70359 77951 66144 73819 97743 85207
17923H5207j9136p252m280q288K960J1313l144k777M445k535k263p347n47j1617
$$ 85207 66071 58819 54539 46251 49211 60524 57380 54603 59048 56513 54250 46903 46356 34739
17909C4739k365O694J1612P285J993p567M375R608m080k0397q095r379J7450J6573
$$ 34739 32374 39068 50680 57965 59958 52391 56766 66374 62294 41897 33802 24423 41873 58446
17895E8446m670j2368j0757l924J9796P308j6411J4179m092k1116L876l66n993
$$ 58446 53776 41408 30651 26727 46523 53831 37420 51599 47507 26391 30267 29901 23908
17882B3908l003M36J522J6530k988j4230J0946L293m719o347l920L683p341l996
$$ 23908 20905 21341 22863 39393 36405 22175 33121 36414 31695 25348 21428 25111 17770 13774
17868A3774j637M228J8041N426J6041J5491j2208n966N533Q458R899K890P657
$$ 13774 12137 16365 34406 39832 55873 71364 59156 53190 58723 67181 77080 79970 87627
17855H7627K813J4038K1136J3649J2321J1655J8348J3361K5505K7366J466r068
$$ 87627 90440 104478 125614 139263 151584 163239 181587 194948 220453 247819 249285 240217
17843B40217j1440l27j0938l3839l8172k7742j5766j2868k5201o868j741j0899
$$ 240217 228777 228450 217512 183673 145501 117759 101993 89125 63924 57056 55315 44416
17831D4416j8233o909J6246p711M513J2165K645k233p78o730j1131J535K159k286
$$ 44416 26183 19274 35520 27809 32322 44487 47132 44899 44121 37391 26260 27795 29954 27668
17817B7668m477P41J5219O718Q118L355r63j2896j7089l701J6025q941q827M341
$$ 27668 23191 23932 39151 45869 53987 57342 56379 43483 26394 22693 38718 29777 20950 25291
17803B5291K4877L5808J8927K0866K4032M0229M6207K5908J6005J791k4878l8498
$$ 25291 50168 85976 104903 125769 149801 190030 236237 262145 278150 279941 255063 216565
17791B16565m5705m6861m6410j7612j7874R382R817r024j9709n076l437J356j4812
$$ 216565 170860 123999 77589 59977 42103 51485 61302 52278 32569 27493 24056 25412 10600
17778A0600J39N166m67l756J1363N040M993m302J1589P548N603O744j564l456
$$ 10600 10739 15905 15438 11682 23045 28085 33078 28776 40365 47913 53516 60260 58696 55240
17764E5240j2588k597K536J201n973o866O019L716n792J0934Q848l5P089O412
$$ 55240 42652 40055 42591 43792 37819 30953 36972 40688 34896 45830 54678 54643 61732 68144
17750F8144K0502K6789J8683M479k852j7415j2600q166q433r98J0400J8549J7142
$$ 68144 88646 115435 134118 138597 135745 118330 105730 97564 89131 88133 98533 117082 134224
17737A34224N809m847r135j693O180K49J840N554P518r411n608j1886J16J2571
$$ 134224 140033 135186 126051 124358 130538 130787 132627 138181 145699 136288 130680 118794 118910 131481
17723A31481n128P31O211R491J8112K8462K4564K2610L2215K2509J0683l215j9601
$$ 131481 126353 127084 133295 142786 160898 189360 213924 236534 268749 291258 301941 298726 279125
17710B79125q552l5783m4171l5802k9989j2046J4754J6645K2004L3640L6015M8576
$$ 279125 270573 234790 190619 154817 124828 112782 127536 144181 166185 199825 235840 284416
17698B84416M3958j0593l2521m0874m9261m2600l1026j2346m097K578l249n694
$$ 284416 328374 317781 285260 244386 195125 152525 121499 109153 105056 107634 104385 98691
17686I8691o481J537M433M07K505J4317P944M36M020q347q490j019n878j873P07
$$ 98691 92210 93747 98180 98587 101092 115409 123353 123789 127809 119462 110972 109953 104075 102202 102909
17671A02909M87n563j8091j5559j1910j6477n861l849l503R401j864m883n92L745
$$ 102909 103396 97833 79742 64183 52273 35796 29935 26086 22583 31984 30120 25237 24645 28390
17657B8390j742j3670p420j1957j2144p490K604M369P354q099j524l145P809O841
$$ 28390 26648 12978 5558 -6399 -18543 -26033 -23429 -19060 -11706 -19805 -21329 -24474 -16665 -9824
17643i824P632j398l094J88m738N448J138o165p006N628J578J2085K426j0917
$$ -9824 -2192 -3590 -6684 -6496 -11234 -5786 -4648 -10813 -17819 -12191 -10613 1472 3898 -7019
17629g019l983J114q627j0859L54J5024J3460N75j9769L416J8922J2164Q878l195
$$ -7019 -11002 -9888 -18515 -29374 -29020 -13996 -536 39 -19730 -16314 2608 14772 23650 20455
17615B0455j1578j3284k251L101p087j1373r609M610J0425l356l702P932J7850
$$ 20455 8877 -4407 -6658 -3557 -10644 -22017 -31626 -27016 -16591 -19947 -23649 -15717 2133
17602B133R848J853j8470j7681KO232P980o150j0143j458N917J8842p356n213
$$ 2133 11981 13834 -4636 -22317 -22315 -16083 -8103 -14253 -24396 -25854 -19937 -1095 -8451 -13664
17588a3664n051P507O382N133J1955j8536p483J5357r064N18K892J1127N371p276
$$ -13664 -18715 -11208 -4826 307 12262 -6274 -13757 1600 -7464 -6946 -4054 7073 12444 5168
17574E168j4150m338J0040m098m650Q842N993m887L563Q360j0843J330r829j1858
$$ 5168 -8982 -13320 -3280 -7378 -12028 -3186 2807 -2080 1483 9843 -1000 330 -9499 -21357
17560b1357J0146M333M47P272Q602r72P300L827Q058j021J443R437m451P588K3726
$$ -21357 -11211 -6878 -6431 841 9443 8471 15771 19598 27656 26635 28078 37515 33064 40652 64378
17545F4378L1776M4713P1513Q9507O5966o689o2537q0895p2496n1650l0788j2939
$$ 64378 96154 140867 212380 301887 367853 361164 298627 217732 145236 93586 62798 49859
17533D9859r89J3956K5388L8455N9703Q1189O8825J7796n6589q4717n8162l0216
$$ 49859 48870 62826 88214 126669 186372 267561 336386 354182 297593 212876 154714 124498
17521A24498k5037l2125k3800j709Q84j4247j1869P774j5774o333j0443l771l887
$$ 124498 99461 67336 43536 41827 42711 28464 16595 24369 8595 2262 -8181 -11952 -15839
17508a5839l376R778K390o220m404M436K343N76O739M14J2550K059L089M222l465
$$ -15839 -19215 -9437 -7047 -13267 -17671 -13235 -10892 -10316 -3577 -3163 9387 11446 14535 18757 15292
17493A5292o678j1489K778k63P161L477o402n399Q778k720K75J1284J5714l408
$$ 15292 8614 -2875 -97 -360 6801 10278 3876 -1523 7255 4535 4810 16094 31808 28400
17479B8400j6609j3077R314N302J249j4724O725J6471J030Q13J3392K472m064
$$ 28400 11791 -1286 8028 13330 14579 -145 6580 23051 24081 24894 38286 40758 36694
17466C6694O958Q749L865j0672m182j1266k7470l829O279m389q416K447M527o137
$$ 36694 43652 52401 56266 45594 41412 30146 2676 -1153 5126 737 -7679 -5232 -705 -6842
17452f842l191r016J1131J0442P428K124m800L638K8430O0923N6393J6963l5792
$$ -6842 -10033 -19049 -7918 2524 9952 12076 7276 10914 39344 100267 156660 173623 137831
17439A37831n8269m9123j3911K758j860j4321j2105O847J100j0173o167P801J2760
$$ 137831 79562 30439 16528 19286 17426 3105 -9000 -2153 -1053 -11226 -17393 -9592 3168
17426C168q462j0286m423K800N175k361J4532O550j610L986O773r201o439R606
$$ 3168 -5294 -15580 -20003 -17203 -12028 -14389 143 6693 5083 9069 15842 6641 202 9808
17412I808P552o718J133L818J3112N175j1622o816K505J6833k874r819j4272K679
$$ 9808 17360 10642 11775 15593 28705 33880 22258 15442 17947 34780 31906 22087 7815 10494
17398A0494n317m246k684Q568O377p37r316q430j1742j228Q531J4874N375m703
$$ 10494 5177 931 -1753 6815 13192 12455 3139 -5291 -17033 -18261 -9730 5144 10519 5816
17384E816N06M04K4432K565j2784q671j5925K156m346p374J382O056O283Q610
$$ 5816 6322 6726 31158 33723 20939 12268 -3657 -1501 -5847 -13221 -11839 -5783 500 9110
17370I110r820o409J0960n910r916J4290N673p368p485P82Q225O120R27q653J0971
$$ 9110 -710 -7119 3841 -2069 -11985 2305 7978 610 -6875 -6093 2132 8252 9179 526 11497
17355A1497N396j7549j435J4760K610j0611J0003R581J77n290m632j0926j344
$$ 11497 16893 -656 -2091 12669 15279 4668 14671 24252 24429 19139 14507 3581 2237
17342B237M86J2559p95j929O080k252M902N484O077j2674r183k548n45N040n307
$$ 2237 2723 15282 14487 12558 18638 16386 21288 26772 32849 20175 10992 8444 7899 12939 7632
17327G632j5788Q782M194o169J0599j4384m474J843j745M034m431N902o68m241
$$ 7632 -8156 626 4820 -1349 9250 -5134 -9608 -7765 -9510 -5476 -9907 -4005 -4673 -8914
17313h914m369J4156R563j880o419M450K08m733r312M958J2388K2502l023j8001
$$ -8914 -13283 873 10436 8556 2137 6587 6795 2062 -7250 -2292 10096 32598 29575 11574
17299A1574J041R605m425L36Q515Q914J513K52j3028l639r919m406j0145q133
$$ 11574 12615 22220 17795 18131 26646 35560 37073 37325 24297 20658 10739 6333 -3812 -11945
17285a1945J0449q569Q816P186J028J0067k758M943m694O598r017p106O564M657
$$ -11945 -1496 -10065 -1249 5937 6965 17032 14274 19217 14523 21121 12104 4998 11562 16219
17271A6219k992M108P506j7785o543M767P292J327Q246k242j1445J949j073j990
$$ 16219 13227 17335 24841 7056 513 5280 12572 13899 22145 19903 8458 10407 9334 7344
17257G344L015K203K498k944K770R384J1830n784L304L492n672L257J1036J2173
$$ 7344 10359 12562 15060 12116 14886 24270 36100 30316 33620 37112 31440 34697 45733 57906
17243E7906J7244j634n957o347r177p951J4145r959j3480o206j966j918l330L81
$$ 57906 75150 73516 67559 61212 52035 44084 58229 48270 34790 28584 26618 24700 21370 21751
17229B1751j881J762k799p013R623R505k635J2814n235k114m361j0077K978R219
$$ 21751 19870 21632 18833 11820 21443 30948 28313 41127 35892 33778 29417 19340 22318 31537
17215C1537n44N68p279j2889J6570l254k7239o73K413o073q883j0732M677J4901
$$ 31537 30993 31561 24282 11393 27963 24709 -2530 -3203 -790 -6863 -15746 -26478 -21801 -6900
17201f900J0817J3071R515n885O102J7901m129j0135j0698M141J3299L448R81
$$ -6900 3917 16988 26503 20618 26720 44621 40492 30357 19659 23800 37099 40547 41528
17188D1528k643n312j254M863l829L183J958K042K370o016L644j33q119j984L375
$$ 41528 38885 33573 32319 37182 33353 36536 38494 40536 42906 36890 40534 40401 32282 30298 33673
17173C3673n142J210Q351R379J3007n638j4866j2528k699K194k766j3734r69m163
$$ 33673 28531 29741 38092 47471 60478 54840 39974 27446 24747 26941 24175 10441 9472 5309
17159E309K20O612j043j639L075J2297P411R763P214j6263j6153m871j0480n713
$$ 5309 5529 12141 11098 9459 12534 24831 32242 42005 49219 32956 16803 11932 1452 -4261
17145d261K202q653j2027O108J8364L3680k122r137j1070Q52P214n859j9328j2267
$$ -4261 -2059 -10712 -22739 -16631 1733 35413 33291 24154 13084 13936 21150 15291 -4037 -16304
17131a6304L824K573j048M953J074J997L2054K3495j019o862J057q498j3600J2207
$$ -16304 -12480 -9907 -10955 -6002 -4928 -2931 29123 52618 51599 44737 45794 37296 23696 35903
17117C5903j170j1959k6411n660J5057J1053Q623O193J6861J4962L445m235j527
$$ 35903 34733 22774 -3637 -9297 5760 16813 25436 31629 48490 63452 66897 62662 61135
17104F1135J3500Q114j6744j098N014L575l335j1401n245P055N195M431N105K0649
$$ 61135 74635 82749 66005 64907 69921 73496 70161 58760 53515 60570 65765 70196 75301 95950
17090I5950K4695J3732N741j059l605j605p448p906j5816j3484m20P938K9677
$$ 95950 120645 134377 140118 139059 135454 133849 126401 118495 102679 89195 88775 96713 126390
17077A26390O058K447K1795J5904j133j0111j8397L184n847o059R664J724j1286
$$ 126390 132448 134895 156690 172594 171461 161350 142953 146137 140290 134231 143895 145619 134333
17064A34333k978P492P740Q080J275n694J0150M680L936q961q38K891J1907L206
$$ 134333 131355 138847 146587 154667 155942 150248 160398 165078 169014 160053 159215 162106 174013 177219
17050A77219p61K445R44q344J3042J1280m592J783J2896l931J488R740K197R667
$$ 177219 176458 178903 179847 171503 184545 195825 191233 193016 205912 201981 203469 213209 215406 225073
17036B25073J6212J6261K665J0852J3794J5376J4300P303m662J1914L9332L2074
$$ 225073 241285 257546 260211 271063 284857 300233 314533 321836 317174 329088 368420 400494
17024D00494J7240L2405K8494L1356N1412P6487Q6925R7394J18961J22185P9091
$$ 400494 417734 450139 478633 509989 561401 637888 724813 822207 941168 1063353 1142444
17013A142444J8892p510L9812Q4304R2331J01558J38153J92579K65331L41746
$$ 1142444 1161336 1153826 1193638 1277942 1370273 1471831 1609984 1802563 2067894 2409640
17003B409640L96302L46614L36611M17281N28639P23067J082862J667960K460241
$$ 2409640 2805942 3152556 3489167 3906448 4435087 5158154 6241016 7908976 10369217
16994A0369217L806540O280138J0376824J5647785J8526412R486325r534416j8317053
$$ 10369217 14175757 20455895 30832719 46480504 65006916 74493241 64958825 46641772
16986D6641772j4950748r292518n208622k701202r89372M23626J846963L889751
$$ 46641772 31691024 22398506 17189884 14488682 13499310 13922936 15769899 19659650
16978A9659650P274578J2090992J6914521J4900677r76118j6327005j7583741
$$ 19659650 26934228 39025220 55939741 70840418 69864300 53537295 35953554
16971C5953554j2220069p440410m562478k948115j921984j326513r78081o98641
$$ 35953554 23733485 16293075 11730597 8782482 6860498 5533985 4555904 3857263
16963C857263m77463l21496k11252j90790j83903k11525k49497k12158j81230
$$ 3857263 3379800 3058304 2847052 2656262 2472359 2260834 2011337 1799179 1617949
16954A617949j95794j60918j30499p8210n1699k1996m154l415k4202q2686r7769
$$ 1617949 1422155 1261237 1130738 1052528 1000829 978833 974679 971264 947062 864376 766607
16943G66607o1772m0913l1569n7518n3005n2629m1238l5743q735N55j5824r393
$$ 766607 704835 663922 632353 574835 521830 469201 427963 392220 383485 384040 368216 358823
16931C58823j2880r181J606k1559p824n71k2261j8972j0856L6m243k3509k5223
$$ 358823 345943 336762 338368 316809 308985 308414 286153 267181 256325 256361 252118 228609 203386
16918B03386j1583j3270N80O830m926j6015j810M991j5069j1003J0098J4931J5918
$$ 203386 191803 178533 179113 185943 181017 165002 163192 168183 153114 142111 152209 167140 183058
16905A83058Q159j2969j7227k1209k8535j7096K583J057m534N67m846l482M977
$$ 183058 191217 178248 161021 139812 111277 94181 96764 97821 93287 93854 89008 85526 90503
16892I0503L44L819n126j0220m910o162M37J491j4858L337Q406j0848l317N339
$$ 90503 90847 94666 89540 79320 74410 68248 68685 70176 55318 58655 67061 56213 52896 58235
16878E8235l432K395j6376k6271P506J3295p543l915Q769M615N403J1383O847
$$ 58235 54803 57198 40822 14551 22057 35352 27809 23894 32663 37278 42681 54064 60911
16865F0911l544r964k0967l430p633l029J3447Q752k63K7015P075R007L109M359
$$ 60911 57367 47403 26436 23006 15373 12344 25791 34543 34280 61295 68370 77377 80486 84845
16851H4845K579n463L034n252j1099j8816j6981l544m138n549j1320M317L0858
$$ 84845 87424 81961 84995 79743 68644 49828 32847 29303 25165 19616 8296 12613 43471
16838D3471K9306P008J400p223q107J5233J849q254j3937k1419n690N296j6545
$$ 43471 72777 79785 81185 73962 65855 81088 82937 74683 60746 39327 33637 38933 22388
16825B2388J7107p7N856K842l622j563o104N908M413l997p887k3851r068L393
$$ 22388 39495 39418 45274 48116 44494 42931 36827 42735 47148 43151 35264 11413 2345 5738
16811E738M822O367P045M56J498j721k738N11k845L192J186K263J0246n936n148
$$ 5738 10560 16927 23972 24428 25926 24205 21467 21978 19133 22325 23511 25774 36020 30084 24936
16796B4936J0646k626o379j810j740M639j582j933j4458n710p70K570J1323q303
$$ 24936 35582 32956 26577 24767 23027 27666 26084 24151 9693 3983 3213 5783 17106 8803
16782H803q948r465j2160O481k29M96L575j417J0705l159P582J2379N837p506
$$ 8803 -145 -9610 -21770 -15289 -15518 -15022 -11447 -12864 -2159 -5318 2264 14643 20480 12974
16768A2974j0502J1865K771m354O235m535j5129k320N557P982K043K994k522j3457
$$ 12974 2472 14337 17108 12754 18989 14454 -675 -2995 2562 10544 12587 15581 13059 -398
16754c98m433q339R43j798K20j7161m116J0139J0695j0262n534Q425M66L60J2564
$$ -398 -4831 -13170 -12227 -14025 -13805 -30966 -35082 -24943 -14248 -24510 -30044 -21619 -21153 -20793 -8229
16739h229O59N4R188j607R289J3860M780n441j3061j1148o641j0292M413m261
$$ -8229 -7570 -7516 1672 65 9354 23214 27994 22553 9492 -1656 -8297 -18589 -14176 -18437
16725a8437j0823k082J1570k578J2416N853J0047N533o451p097L851M961J2943
$$ -18437 -29260 -31342 -19772 -22350 -9934 -4081 5966 11499 5048 -2049 1802 6763 19706
16712A9706q18l150l989K505l406k11j337M032j4843q839j0770k373J2621J0995
$$ 19706 18888 15738 11749 14254 10848 10637 9300 13332 -1511 -10350 -21120 -23493 -10872 123
16698A23j238O714M601q422L26JO311J1791j0844P17J2754j7687j4341j0286q38
$$ 123 -1115 5599 10200 1778 2104 2105 8416 20207 9363 10080 22834 5147 -9194 -19480 -20318
16683b0318P190n213j289J0414q84r704N911J0237N683l949j7457j4716m026l54
$$ -20318 -13128 -18341 -19630 -9216 -10100 -19804 -13893 -3656 2027 -1922 -19379 -34095 -38121 -38475
16669c8475J7540J0280L600L869p23K670N931n727M132Q598j158j2884N261L784
$$ -38475 -20935 -10655 -7055 -3186 -3909 -1239 4692 -1035 3097 11695 10537 -2347 2914 6698
16655F698q480P622N56j21l131k145Q210N869P860r307J9941J5589J1514K235
$$ 6698 -1782 5840 6396 6275 3144 999 9209 15078 22938 13631 33572 49161 60675 62910
16641F2910R363K0107L8920R0942J41187J94363J84558N1727j32292j88951j50167
$$ 62910 72273 92380 131300 222242 363429 557792 742350 794077 661785 472834 322667
16630C22667r4838m2387l736L5494N9549J10809J65220J90423N6748j37480j95572
$$ 322667 227829 185442 181706 217200 276749 387558 552778 743201 799949 662469 466897
16619D66897j47679j06927o6500l5535k5668k2122j5304j2733O14N381p042J073
$$ 466897 319218 212291 145791 110256 84588 62466 47162 34429 35043 40424 33382 34455
16607C4455k83j7092o349p981j1357M452p469Q530n682n495L184J5253r088k951
$$ 34455 34172 17080 10731 2750 -8607 -4155 -11624 -3094 -8776 -14271 -11087 4166 -4922 -7873
16593g873J079r53K718o870q373N65k80j349J4282J0239N878j3766j604n844M189
$$ -7873 -6794 -7747 -5029 -11899 -20272 -19707 -19987 -21336 -7054 3185 9063 -4703 -6307 -12151 -7962
16578g962l268R114n624m19O994O905j7460j676R482L828J817j0072j1089m450
$$ -7962 -11230 -2116 -7740 -8159 -1165 5740 -11720 -13396 -3914 -86 1731 -8341 -19430 -23880
16564b3880m80P001J734q796K803N47o128J0791J6797R055n136O09j1792l188
$$ -23880 -24360 -17359 -15625 -24421 -21618 -21071 -27199 -16408 389 9444 4308 4917 -6875 -10063
16550a0063n62O954n971p251p51O389J719j1884p544l619n028K688J285K235m0
$$ -10063 -10625 -3671 -9642 -16893 -17644 -11255 -9536 -21420 -28964 -32583 -37611 -34923 -33638 -31403 -31443
16535c1443m760j163J4662j151K577O286q2k454n88K2329J4733M881m374j3601
$$ -31443 -36203 -37366 -22704 -23855 -21278 -14992 -15074 -17528 -18116 4213 18946 23827 19453 5852
16521E852r303j459K0168N900j120n606m603r786L25P355j309j321p7O502j170
$$ 5852 -3451 -4910 15258 21158 20038 14432 9829 43 368 7723 6414 5093 5016 11518 10348
16506A0348j3905L71J3950O839m085j4210O718J0923J905M412Q076j5558l691
$$ 10348 -3557 -3186 10764 17603 13518 -692 6026 16949 18854 23266 31342 15784 12093
16493A2093J5021J0710M055j4071p925L249Q416j0502p682l733J012J859m552
$$ 12093 27114 37824 41879 27808 19883 23132 31548 21046 13364 9631 10643 12502 7950
16480G950k582M717j700q883l715N377P549n026o018m799l301J0916J5531L854
$$ 7950 5368 10085 8385 -498 -4213 1164 8713 3687 -2331 -7130 -10431 485 16016 19870
16466A9870L538j5455p696P407J7784k316j7307j2169J730J1928N424n610j6179
$$ 19870 23408 7953 257 7664 25448 23132 5825 -6344 -4614 7314 12738 7128 -9051
16453i051n490O076n210Q114K417K0279K851k6182j6768K5833J8577M675m801
$$ -9051 -14541 -8465 -13675 -5561 -3144 17135 19986 -6196 -22964 2869 21446 26121 21320
16440B1320J2984J1011K879r07O611L1661M3947Q8748R6879M8401k8585p3003
$$ 21320 34304 45315 48194 47287 53898 85559 129506 218254 315133 363534 334949 261946
16428B61946q2880o8730l2872j5071j184P203J0577J6383K7511O9067P4860P0261
$$ 261946 179066 110336 77464 62393 61209 68412 78989 95372 122883 191950 266810 337071
16416C37071N017o2055p9864o1530k7770k8378k5991k5394l095l405o290l981
$$ 337071 342088 280033 200169 138639 110869 82491 56500 31106 28011 24606 18316 14335
16404A4335j8162o474J3395m72R706J2338j2769j9695n197k796n36r429N185j1087
$$ 14335 -3827 -10301 3094 2622 12328 24666 11897 -7798 -12995 -15791 -16327 -25756 -20571 -31658
16390c1658k6J8434J8050j159j8410m063J1901n81Q33j815l420j945n399j5225
$$ -31658 -31684 -13250 4800 3641 -14769 -18832 -6931 -7512 -6679 -8494 -11914 -13859 -19258 -34483
16376c4483L277J2396N129N021M520q922k412N391k570j879o799l319J2849l567
$$ -34483 -31206 -18810 -13681 -8660 -4140 -13062 -15474 -10083 -12653 -14532 -21331 -24650 -11801 -15368
16362a5368j126J2527J0980J1393r138L82q449k741O311P162n302m819k529k15
$$ -15368 -16494 -3967 7013 18406 9268 9650 1201 -1540 4771 11933 6631 1812 -717 -932
16348i32n33k213L005r491M81R180j162q828J0995O933j4340j3943J0055N648
$$ -932 -1465 -3678 -673 -10164 -9683 -503 -1665 -10493 502 7435 -6905 -20848 -10793 -5145
16334e145j191j53J347J1273l377L438j098k461m369k633m146J066J580L124J53
$$ -5145 -6336 -6489 -5142 6131 2754 6192 5094 2633 -1736 -4369 -8515 -7449 -5869 -2745 -2592
16319b592j08o146q690N42L025k067J899l099J680n719j779N76O281J1370p594
$$ -2592 -2700 -8846 -17536 -16994 -13969 -16036 -14137 -17236 -15556 -21275 -23054 -22478 -16197 -4827 -12421
16304a2421p618l962J711R532J1898Q028L219j7755q119j0990P842p835j0460
$$ -12421 -20039 -24001 -22290 -12758 -860 7168 10387 -7368 -15487 -26477 -18635 -26470 -36930
16291c6930R446J1203m441n388j21J3041k031j2229k556R41J1748M233k1137r696
$$ -36930 -27484 -16281 -20722 -26110 -26231 -13190 -15221 -27450 -30006 -29065 -17317 -13084 -34221 -43917
16277d3917N223K0894J3811m051j291r807n708Q371J9509K756k123J683O135J1669
$$ -43917 -38694 -17800 -3989 -8040 -9331 -19138 -24846 -16475 3034 5790 3667 5350 11485 23154
16263B3154q292o891j3212P413J110k791p735J0607L442l441j1001j2044r839
$$ 23154 14862 7971 -5241 2172 3282 491 -7244 3363 6805 3364 -7637 -19681 -29520
16250b9520l242O901P490k042J827J9557J635j8421j2633O97M024k348m100O194
$$ -29520 -32762 -25861 -18371 -20413 -18586 971 2606 -15815 -28448 -27751 -23727 -26075 -30175 -23981
16236b3981O76M98J1093o038P8j0407J007R715J0067P094o320r465J66L13O93
$$ -23981 -23305 -22807 -11714 -17752 -17674 -28081 -27074 -17359 -7292 -198 -6518 -15983 -15817 -15504 -14811
16221a4811N790n571m92O394N055R095k3288M469R009R127k590j2353Q873n710
$$ -14811 -9021 -14592 -15084 -8690 -3635 5460 -17828 -13359 -4350 4777 2187 -10166 -1293 -7003
16207g003K654L228O8n019J8972n856j4749r754M41N37L880l427J5129J1882p098
$$ -7003 -4349 -1121 -1053 -6072 12900 7044 -7705 -17459 -17018 -16481 -12601 -16028 -899 10983 3885
16192C885j0068n131J507m077K94l883P118j0953j9540L283O480O504J1848M323
$$ 3885 -6183 -11314 -9807 -13884 -13590 -17473 -10355 -21308 -40848 -37565 -31085 -24581 -12733 -8410
16178h410l683n431N441O467n178m696l250l067n411O046L089N27k274l791P513
$$ -8410 -12093 -17524 -12083 -5616 -10794 -15490 -18740 -21807 -27218 -21172 -18083 -17556 -19830 -23621 -16108
16163a6108P70O519L097J1112M820p956j1428m843j3839n549K667K344k657J1299
$$ -16108 -15338 -8819 -5722 5390 10210 2254 -9174 -14017 -27856 -33405 -30738 -28394 -31051 -19752
16149a9752L907n051k84J5459J774q885j2134R454j633n107P591k157r023j899
$$ -19752 -15845 -20896 -21180 -5721 -3947 -12832 -24966 -15512 -17145 -22252 -14661 -16818 -25841 -27740
16135b7740O728J1855l405j2184L5J1138k828K868J0048o53L469j0297j3519J3044
$$ -27740 -21012 -9157 -12562 -24746 -24711 -13573 -16401 -13533 -3485 -4138 -669 -10966 -24485 -11441
16121a1441K677L474r304N24k16m262o162J3727N221M463l701j6095J0146l165
$$ -11441 -8764 -5290 -14594 -14070 -14286 -18548 -24710 -10983 -5762 -1299 -5000 -21095 -10949 -14114
16107a4114m094J1060M099k393J432k432j1967L949O124o640p455j535Q10q72
$$ -14114 -18208 -7148 -3049 -5442 -4010 -6442 -18409 -14460 -8336 -14976 -22431 -23966 -23156 -24028
16093b4028R486j293n048n630j0139J2609K0612q306j5010k886K805J9929l946
$$ -24028 -14542 -15835 -20883 -26513 -36652 -24043 -3431 -11737 -26747 -29633 -26828 -6899 -10845
16080a0845j612J4689M608j4322q997p184J892Q666N230R461N081j2116l418j0789
$$ -10845 -12457 2232 6840 -7482 -16479 -23663 -21771 -13105 -7875 1586 6667 -5449 -8867 -19656
16066a9656n51J8284q599N186m781o737P487J6030m887j1104M198k733j0375j1593
$$ -19656 -20207 -1923 -10522 -5336 -10117 -16854 -9367 6663 1776 -9328 -5130 -7863 -18238 -29831
16052b9831P953J8538J853L925N350j1254j6057M978J2545k919N605k528j317
$$ -29831 -21878 -3340 -1487 2438 7788 -3466 -19523 -14545 -2000 -4919 686 -1842 -3159
16039c159K832R209O577K011m309j2864n091r744M388J856J60J3226O765L80k847
$$ -3159 -327 8882 15459 17470 13161 297 -4794 -14538 -10150 -8294 -8134 5092 11857 12237 9390
16024I390j5920n838P741K544O236Q645j1141q541k100P564o28N339O218k826
$$ 9390 -6530 -12368 -4627 -2083 4153 12798 1657 -6884 -8984 -1420 -2048 3291 9509 6683
16010F683J2641L72k460m140J0418l807j4339J395J521j1463n134J3235J0277
$$ 6683 19324 19696 17236 13096 23514 19707 5368 6763 8284 -3179 -8313 4922 15199
15997A5199m352q912j1448O807j624q668q295o627J30N229K2956N803P923O63
$$ 15199 10847 1935 -9513 -2706 -4330 -12998 -21293 -27920 -27790 -22561 395 6198 14121 14784
15983A4784j1642l911o18O962J160k0882P626N344l759k790O197j5867J61m750
$$ 14784 3142 -769 -1387 5575 6735 -14147 -6521 -1177 -4936 -7726 -1529 -17396 -17235 -21985
15969b1985K066K2328k415n467O226k282j4309j0345J3150K993l234J71k523o599
$$ -21985 -19919 2409 -6 -5473 753 -1529 -15838 -26183 -13033 -10040 -13274 -13103 -15626 -22225
15955b2225N018P572J1227J8821l073k0309j0956k586J125K2402r706j3689n91
$$ -22225 -17207 -9635 1592 20413 17340 -2969 -13925 -16511 -15386 7016 -2690 -16379 -16970
15942a6970p11L341q311q92J3919L100q89N55n092J0448n630k810l393L727J3905
$$ -16970 -17681 -14340 -22651 -23543 -9624 -6524 -7413 -6858 -11950 -1502 -7132 -9942 -13335 -9608 4297
15927D297k66R71m598N708O737j2055q987P611n206R871K1162j31j3953M1o538
$$ 4297 4031 5002 404 6112 12849 794 -8193 -582 -5788 4083 25245 25114 11161 11202 4664
15912D664j4607n196O192Q547J021j5075p542j609m766J586J0663J8204m995j1228
$$ 4664 -9943 -15139 -8947 -400 621 -14454 -21996 -23605 -28371 -26785 -16122 2082 -2913 -14141
15898a4141Q781N074J531j878J3352J1976j4877j8350p050q205p368N05M192Q15
$$ -14141 -5360 -286 1245 -633 12719 24695 9818 -8532 -15582 -23787 -31155 -30650 -26458 -25643
15884b5643K951J0002O312L518m663n417J5418P831l602r591j1241m344j541m750
$$ -25643 -22692 -12690 -6378 -2860 -7523 -12940 2478 10309 6707 -2884 -14125 -18469 -20010 -24760
15870b4760L627N868R434L906k367l307j248J763q670r567o469J4153J1894K010
$$ -24760 -21133 -15265 -5831 -1925 -4292 -7599 -8847 -7084 -15754 -25321 -31790 -17637 -5743 -3733
15856c733q0Q995j0506j0685J285n16J3023r207J7830J7762j0686k0760j2450
$$ -3733 -3813 5182 -5324 -16009 -14724 -15240 -2217 -11424 6406 24168 13482 -7278 -19728
15843a9728j468m096r419Q669J560M578j3425J0204Q050J928O09J077L099n614
$$ -19728 -21196 -25292 -34711 -26042 -24482 -19904 -33329 -23125 -15075 -13147 -12538 -11461 -8362 -13976
15829a3976j033R849l435j587J4396L448q750n732j86j6284q940l963m322M613
$$ -13976 -15009 -5160 -8595 -10182 4214 7662 -1088 -6820 -7006 -23290 -32230 -36193 -40515 -35902
15815c5902N53J691J3216K1300J2827o950k911q044o507j4909Q1J4035J1144n040
$$ -35902 -35349 -33658 -20442 858 13685 6735 3824 -4220 -10727 -25636 -25555 -11520 -376 -5416
15801e416k821J383P223Q088m378j4709j0863M668J0732Q776L428o880j2114J064
$$ -5416 -8237 -6854 369 8457 4079 -10630 -21493 -16825 -6093 2683 6111 -769 -12883 -11819
15787a1819J4111p107j2943N177O52l167O981k381j127p631o878j3757J1799J5650
$$ -11819 2292 -4815 -17758 -12581 -11929 -15096 -8115 -10496 -11623 -19254 -26132 -39889 -28090 -12440
15773a2440M8j0342P52N009p735j5725J063J0083J5940J4508l574j585m44Q183
$$ -12440 -12392 -22734 -21982 -16973 -24708 -40433 -39370 -29287 -13347 1161 -2413 -3998 -4442 3741
15759C741P274r672p106K263j374j0839L40n503n887K02J6722J1040K373l427
$$ 3741 11015 1343 -5763 -3500 -4874 -15713 -15373 -20876 -26763 -26561 -9839 1201 3574 147
15745A47l073j0170j6731r899k847K1788R244k220L748R325j3372j6609o41L191
$$ 147 -2926 -13096 -29827 -39726 -42573 -20785 -11541 -13761 -10013 -688 -14060 -30669 -31310 -28119
15731b8119R259k623J3646P201j2480o94P524n127m041n580l106j367O060J4141
$$ -28119 -18860 -21483 -7837 -636 -13116 -13810 -6286 -11413 -15454 -21034 -24140 -25507 -19447 -5306
15717e306N856k0948o699J2266J6366r435m202l525j2159J000J6603J8303P76
$$ -5306 550 -20398 -27097 -14831 1535 -7900 -12102 -15627 -27786 -26786 -10183 8120 8896
15704H896p647L286j1699p09J69Q254J0750q024j5258k10O242J806j1697p796
$$ 8896 1249 4535 -7164 -7873 -7704 550 11300 3276 -11982 -12192 -5950 -4144 -15841 -23637
15690b3637p617Q678L777J8338J257q689N982o429j1987R479J0092Q075N720q950
$$ -23637 -31254 -22576 -18799 -461 796 -7893 -1911 -8340 -20327 -10848 -756 7319 13039 4089
15676D089k112n97k384J2121L877m241r36L284L919j3320j9840l407J0618J913
$$ 4089 1977 1380 -1004 11117 14994 10753 9817 13101 17020 3700 -16140 -19547 -8929 -7016
15662g016Q000l83j8000m388R403N746R309J2679j193k283p872q949o556L150
$$ -7016 984 601 -17399 -21787 -12384 -6638 2671 15350 14157 11874 4002 -4947 -11503 -8353
15648h353k370k660r535M401L856m48p275n968j3344j493o224m931K177J4358
$$ -8353 -10723 -13383 -22918 -18517 -14661 -15109 -22384 -28352 -41696 -43189 -49413 -54344 -52167 -37809
15634c7809J2044O974J0655K789j033p299l136o807M191K2217j147m329q750n364
$$ -37809 -25765 -18791 -8136 -5347 -6380 -13679 -16815 -23622 -19431 2786 1639 -2690 -11440 -16804
15620a6804k728j0453p147J3509P590L725J4219J449q170k0044n036K138k668
$$ -16804 -19532 -29985 -37132 -23623 -16033 -12308 1911 3360 -4810 -24854 -29890 -27752 -30420
15607c0420j476J0257J3333l704j1656o860J5564J4570O182q250R3k868P448Q92
$$ -30420 -31896 -21639 -8306 -12010 -23666 -30526 -14962 -392 5790 -2460 -2367 -5235 2213 3105
15593C105j667q104j7377N302J181l683q481J864K139j107o324M809J5998p38
$$ 3105 1438 -6666 -24043 -18741 -17560 -21243 -29724 -27860 -25721 -26828 -33152 -28343 -12345 -13083
15579a3083P751o486p567j203k532N464Q459J8088R663k343j2801j8016j756K991
$$ -13083 -5332 -11818 -19385 -20588 -23120 -17656 -9197 8891 18554 16211 3410 -14606 -16362 -13371
15565a3371J2001K749J016n314m285n321L192p224O300J0241j12q125j4074j4504
$$ -13371 -1370 1379 2395 -2919 -7204 -12525 -9333 -16557 -10257 -16 -128 -8253 -22327 -36831
15551c6831Q946Q367J7109N311k0591O179J1944k536j4598J839J6900M234r731
$$ -36831 -27885 -19518 -2409 2902 -17689 -11510 434 -2102 -16700 -14861 2039 6273 -3458
15538c458j3236L026m11p780k784j2344o882O873k970%k689M10M836j606K3632
$$ -3458 -16694 -13668 -14079 -21859 -24643 -36987 -43869 -36996 -39966 -39966 -42655 -42245 -37409 -39015 -15383
15523a5383n225J809P272l525L195J8140O313p954k5713q354J94m592J1545J8739
$$ -15383 -20608 -18799 -11527 -15052 -11857 6283 12596 4642 -21071 -29425 -29231 -33823 -22278 -3539
15509c539J4632j2656m920M571L014r451k1118q217O647O746J14K608P000M821
$$ -3539 11093 -1563 -6483 -1912 1102 -8349 -29467 -37684 -31037 -24291 -24177 -21569 -14569 -9748
15495i748k714j0967r32k915L703L284R109l969m731m014j2042M82J5176J1858
$$ -9748 -12462 -23429 -24361 -27276 -23573 -20289 -11180 -15149 -19880 -23894 -35936 -35454 -20278 -8420
15481h420K47k788N120j0477L192L495j291J006J0781j4615l192L030p14k0671
$$ -8420 -8173 -10961 -5841 -16318 -13126 -9631 -10922 -9916 865 -13750 -16942 -13912 -14626 -35297
15467c5297k389J1443o060M192J2840o71P624P263J4966N320j3781q543l110l851
$$ -35297 -37686 -26243 -32303 -28111 -15271 -15942 -8318 -1055 13911 19231 5450 -3093 -6203 -10054
15453a0054j638P247o73j206j4824j0674k073J4000N860K64R263J1775J5348m397
$$ -10054 -11692 -4445 -5118 -6324 -21148 -31822 -33895 -19895 -14035 -13771 -4508 7267 22615 18218
15439A8218j2171j1099k924q182j3207J3421P117n907J2720n835o437N485L419
$$ 18218 6047 -5052 -7976 -16158 -29365 -15944 -8827 -14734 -2014 -7849 -14286 -8801 -5382
15426e382K421N044q217k368R01l715k803J517j5416r301K0609L0236n171p926
$$ -5382 -2961 2083 -6134 -8502 -7601 -11316 -14119 -12602 -28018 -37319 -16710 13526 8355 429
15412D29o482K129l192L050j3970J692m016O265k962J0607J2440l001L286j1094
$$ 429 -6053 -3924 -7116 -4066 -18036 -16344 -20360 -14095 -17057 -6450 5990 2989 6275 -4819
15398d819j1809n02k294p430O823J8107j6586m776o628l812K2383J5558N512n187
$$ -4819 -16628 -17130 -19424 -26854 -20031 -1924 -18510 -23286 -29914 -33726 -11343 4215 9727 4540
15384D540n201j5983q921K55K72j001o51j78m6J0286J890N927o634q250m66P222
$$ 4540 -661 -16644 -25565 -25310 -25038 -26039 -26690 -26868 -26914 -16628 -14738 -8811 -15445 -23695 -24161 -16939
15368a6939L489p372M973l823q444N040J5350l71p767j8657J1069O656M200O956
$$ -16939 -13450 -20822 -15849 -19672 -28116 -23076 -7726 -8097 -15864 -34521 -23452 -16796 -12596 -5640
15354e640j123j952K347n655r775J6173J8308L260r565K643k319j2366j0593q778
$$ -5640 -6763 -8715 -6368 -12023 -21798 -5625 12683 15943 6378 9021 6702 -5664 -16257 -25035
15340b5035J4296J484o009j736o215p037L903P502O929L491K806j1516j6679R733
$$ -25035 -10739 -9255 -15264 -17000 -23215 -30252 -26349 -18847 -11918 -8427 -5621 -17137 -33816 -24083
15326b4083J0275M46n281N077o968L598O086j4274k410R627M831O908j047M125
$$ -24083 -13808 -13362 -18643 -13566 -20534 -16936 -10850 -25124 -27534 -17907 -13076 -6168 -7215 -3090
15312c090L411J475l17P648K0989M51j6587j9164o507o767P131J2598N950p368
$$ -3090 321 1796 1479 9127 30116 30567 13980 -5184 -11691 -18458 -11327 1271 7221 -147
15298a47o551K245m922O857N169J5643l336j059n373l588r209j9391n282O726
$$ -147 -6698 -4453 -9375 -2518 2651 18294 14958 13899 8526 4938 -4271 -23662 -28944 -22218
15284b2218M556J2384N515j3880q624J4487K565J3921R863j9146k5435r623j041
$$ -22218 -17662 -5278 237 -13643 -22267 -7780 -5215 8706 18569 -577 -26012 -35635 -36676
15271c6676M629J3050O076P214k0519L082K424J441j235J3405J0355j4342l98
$$ -36676 -32047 -18997 -12921 -5707 -26226 -23144 -20720 -19279 -20514 -7109 3246 -11096 -11494
15258a1494K229P385N321l696j8236p98L794p066o922J1285n100m865M438L052
$$ -11494 -9265 -1880 3441 -255 -18491 -19289 -15495 -22561 -29483 -18198 -23298 -28163 -23725 -20673
15244b0673j4086o664k197J9238N773P963K768r154Q417J0152J563o256J800J2189
$$ -20673 -34759 -41423 -43620 -24382 -18609 -10646 -7878 -17032 -8615 1537 3100 -3156 -1356 10833
15230A0833k490p661n627m584q904J1819m770p813m779J0541R428k384k44N748
$$ 10833 8343 682 -4945 -9529 -18433 -6614 -11384 -19197 -23976 -13435 -4007 -6391 -6635 -887
15216h87M420n858q617p315p782J0970O751J4337L776L620k540j6689j5677J703
$$ -887 3533 -2325 -10942 -18257 -26039 -15069 -8318 6019 9795 13415 10875 -5814 -21491 -19788
15202a9788j2665o916l65m765J2819M91K783K09M136Q768J5837P487k474k497
$$ -19788 -32453 -39369 -39734 -44499 -31680 -31189 -28406 -28197 -24061 -15293 544 8031 5557 3060
15188C060J837k785N583o7j1947o687J0601Q875j23j8054r227j457n122M824j770
$$ 3060 4897 2112 7695 7628 -4319 -11006 -405 8470 8347 -9707 -18934 -20391 -25513 -20689 -22459
15173b2459j353R464K281j0406j2369M120O172J1416M718P15j742p831N918L414
$$ -22459 -23812 -14348 -12067 -22473 -34842 -30722 -24550 -13134 -8416 -7701 -9443 -17274 -11356 -7942
15159g942p513J2041m345j492J5989r767o15p358o957R123K367j1516r168J0590
$$ -7942 -15455 -3414 -7759 -9251 6738 -3029 -3644 -11002 -17959 -8836 -6469 -17985 -27153 -16563
15145a6563r86N155l827m336j7696L670J6444P321r269n594q94K050J984O378
$$ -16563 -17549 -12394 -16221 -20557 -38253 -34583 -18139 -10818 -20087 -25681 -26575 -24525 -22541 -16163
15131a6163k031m635j2483J4567J3073R506M717q119L722M506j703j4172o59L319
$$ -16163 -18194 -22829 -35312 -20745 -7672 1834 6551 -1568 2154 6660 4957 -9215 -9874 -6555
15117f555P823L902J473j683k747j3048N74j660Q262J6343N385m612r172Q26m328
$$ -6555 1268 5170 6643 4960 2213 -10835 -10261 -11921 -3659 12684 18069 13457 4285 5111 783
15102G83j359m692q917k857l113L187P030R879Q405M889m146j1638q015J1547
$$ 783 -576 -5268 -14185 -17042 -20155 -16968 -9938 -59 8346 13235 9089 -2549 -10564 983
15088I83J67q235j8955j5016J2133J0569j416K364j056J1482m9o91r149n72J2043
$$ 983 1150 -7085 -26040 -41056 -28923 -18354 -19770 -17406 -18462 -6980 -7029 -7720 -16869 -17441 -5398
15073e398k010m960O384N26P269L862k473k4068j3759r731J2843J1888l721l331
$$ -5398 -7408 -12368 -5984 -5458 1811 5673 3200 -20868 -34627 -44358 -31515 -19627 -23348 -26679
15059b6679j1537L569K1279J111j7371M46Q289J0104P76Q8J3291K723p882r708
$$ -26679 -38216 -34647 -13368 -12257 -29628 -29182 -20893 -10789 -10013 -9925 3366 6089 -1793 -11501
15045a1501m624R169J4926J274j6865q203m908J1038J297p158K100m141R721l305
$$ -11501 -16125 -6956 7970 9244 -7621 -15824 -20732 -9694 -8397 -15555 -13455 -17596 -7875 -11180
15031a1180m295J0716P716K819j6612j4411Q965K1819P379j3228j4429K468J5320
$$ -11180 -15475 -4759 2957 5776 -10836 -25247 -16282 5537 12916 -312 -14741 -12273 3047
15018C047o028J2362J1447J1845J52j3788j2975j5588R290R737j0412L47O127
$$ 3047 -2981 9381 20828 32673 32825 19037 6062 -9526 -236 9501 -911 -564 5563
15005E563Q387p845n916L566n052J135P194n583j0931O241j263O162l784J6630
$$ 5563 13950 6105 189 3755 -1297 -162 7032 1449 -9482 -3241 -4504 1658 -2126 14504
14991A4504N516n755l127j1565j7319j977K304o951M499J5432J1657j0548l818
$$ 14504 20020 14265 11138 -427 -17746 -19723 -17419 -24370 -19871 -4439 7218 -3330 -7148
14978g148j07K852k27j255j780k880J0510J0943P94j3538j5039j2121o012R501
$$ -7148 -7255 -4403 -4630 -5885 -7665 -10545 -35 10908 11702 -1836 -16875 -28996 -35008 -25507
14964b5507k549R267J3843J644j0111q708P133O77R126J1690J0048n457j0260
$$ -25507 -28056 -18789 -4946 -3302 -13413 -22121 -14988 -14311 -5185 6505 16553 11096 836
14951H36k4645l981P425N737o771J68m00N417l042o526q825L976J0235P216R618
$$ 836 -23809 -27790 -20365 -14628 -21399 -21231 -21631 -16214 -19256 -25782 -34607 -30631 -20396 -13180 -3562
14936c562M727J401q54j396k587L852J439m3p14M73J0446O487k905N238l91j6436
$$ -3562 1165 2566 1712 316 -2271 1581 3020 2977 2263 2736 13182 19669 16764 22002 21611 5175
14920E175m368P412K1341O007K242P647Q173P035k0018j8759n990P812R202n066
$$ 5175 807 8219 29560 35567 37809 45456 53629 60664 40646 21887 15897 23709 32911 27845
14906B7845l374p140M931j4628j1223O380J022n902o13Q322J1024J3249k319k2139
$$ 27845 24471 17331 22262 7634 -3589 2791 3813 -2089 -2702 5620 16644 29893 27574 5435
14892E435l4083n546J1162O687J2590J450L874M82j0676p967m58M10J1896R242
$$ 5435 -28648 -34194 -23032 -16345 -3755 -2305 1569 2051 -8625 -16592 -17050 -16640 -4744 4498
14878D498j2685j1526p685J6916J2905M455J755J517J0102k945r418O668P487
$$ 4498 -8187 -19713 -27398 -10482 2423 6878 8633 10150 20252 17307 7889 14557 22044
14865B2044p331k231j162J65j1173J705o504p944k784R848R38m841k054k294P231
$$ 22044 14713 12482 11320 11485 312 2017 -4487 -12431 -15215 -5367 -4429 -9270 -11324 -13618 -6387
14850f387N459J5487k234n888q25j6462p51N190o085j4907k273J0452J3454J5417
$$ -6387 -928 14559 12325 6437 5612 -10850 -11601 -6411 -12496 -27403 -29676 -19224 -5770 9647
14836I647J055j4507o909p049j2658k372J1560o846j3011O612K3474J6997R087
$$ 9647 10702 -3805 -10714 -17763 -30421 -32793 -21233 -28079 -41090 -34478 -11004 5993 15080
14823A5080p913j2645L075J1139L58j4275k311l98O304m514r092N13P484M13k307
$$ 15080 7167 -5478 -2403 8736 9094 -5181 -7492 -7890 -1586 -6100 -15192 -14679 -7195 -6782 -9089
14808i089J4030J3894J350q059M108j0544p590k14K328o517J993O081l697n179
$$ -9089 4941 18835 20185 12126 16234 5690 -1900 -2114 214 -6303 -4310 1771 -1926 -7105
14794g105J9957Q530j4143j3126O050p982P293J7138m284j6739j1113k569l82
$$ -7105 12852 21382 7239 -5887 163 -7819 -526 16612 12328 -4411 -15524 -18093 -18475
14781a8475P546K0532J1734l74k844j2165n368J701J2848k0669l619Q120Q182
$$ -18475 -10929 9603 21337 20963 18119 5954 586 2287 15135 -5534 -9153 -1033 7149
14768G149q621m358j525o153J5966o21j228J082k730L642L697J32j1111k236P180
$$ 7149 -1472 -5830 -7355 -13508 2458 1837 609 1691 -1039 2603 6300 6432 -4679 -6915 265
14753B65J0109L426n772O546n5p942P234K094n916j5210j2203J383m183p267J6863
$$ 265 10374 13800 8028 14574 14519 6577 13811 15905 9989 -5221 -17424 -16041 -20224 -27491 -10628
14738a0628j074o397j4312J3924J4069m699L351J1646k729m260j0188m112Q713
$$ -10628 -11702 -18099 -32411 -18487 -4418 -9117 -5766 5880 3151 -1109 -11297 -15409 -6696
14725f696J0556J0001Q536j2286m639l497J433J7569K838r437j894j0313j674
$$ -6696 3860 13861 22397 10111 5472 1975 3408 20977 23815 14378 12484 2171 497
14712D97l361J6155J0429j1552k1262j0592K426j839J1403N119N541o606k314
$$ 497 -2864 13291 23720 12168 -9094 -19686 -17260 -19099 -7696 -2577 2964 -3642 -5956
14699e956R250j0354j1212N477J033o822J3207J8201J436j1447j3964Q258N800
$$ -5956 3294 -7060 -18272 -12795 -11762 -18584 -5377 12824 14260 2813 -11151 -2893 2907
14686B907N473m739r406k374K412j635m837N568M564j251K554r980j1461K794
$$ 2907 8380 3641 -5765 -8139 -5727 -7362 -12199 -6631 -2067 -3318 -764 -10744 -22205 -19411
14672a9411J9461m708l968P724M189l446n242L900J0641m75p868K021n43j0938
$$ -19411 50 -4658 -8626 -902 3287 -159 -5401 -1501 9140 8665 797 2818 2275 -8663
14658h663o26j4725Q036P232J2225L255q527n322Q273Q727r94N230M814j189k854
$$ -8663 -9289 -24014 -15978 -8746 3479 6734 -1793 -7115 1158 9885 8891 14121 18935 17746 14892
14643A4892L689j120L636l740j2999j5870m691N22J2834j3459j0577r9J8067R882
$$ 14892 18581 17461 21097 17357 4358 -11512 -16203 -15681 -2847 -16306 -26883 -26982 -8915 967
14629I67k681l478j0196o451o242K088K930J252J8078K2275r396j7984n813J1121
$$ 967 -1714 -5192 -15388 -21839 -28081 -25993 -23063 -21811 -3733 18542 9146 -8838 -14651 -3530
14615c530L968m473L10j9549q017J9292R462m334j6991k365O607J5434k61J3227
$$ -3530 438 -4035 -3725 -23274 -31291 -11999 -2537 -6871 -23862 -26227 -19620 -4186 -4447 8780
14601H780p046o832K873r67j0552N121k302M126l540k0832k748J1205J1302J4567
$$ 8780 1734 -5098 -2225 -3192 -13744 -8623 -10925 -6799 -10339 -31171 -33919 -22714 -11412 3155
14587C155m962p964j3845q53j430j089J0673J3053n160J286q931o305J657P396
$$ 3155 -1807 -9771 -23616 -24469 -25899 -26988 -16315 -3262 -8422 -7136 -16067 -22372 -20715 -13319
14573a3319Q052j766r5P508J646j6338p88j266l528o223K419L231J1615q34n07
$$ -13319 -5267 -7033 -7128 380 2026 -14312 -15100 -16366 -19894 -26117 -23698 -20467 -8852 -9686 -10193
14558a0193K489N416m150O376L583m159k687L584k502P881M794n450K141J5053
$$ -10193 -7704 -2288 -6438 -62 3521 -638 -3325 259 -2243 5638 10432 4982 7123 22176
14544B2176p679j7237k435K524R766J4761M465l353j7096j8566n234m815m986
$$ 22176 14497 -2740 -5175 -2651 7115 21876 26341 22988 5892 -12674 -17908 -22723 -27709
14531b7709J4469K0453J4904n569J2013O427m587L474j4641j0162k729m583p000
$$ -27709 -13240 7213 22117 16548 28561 34988 30401 33875 19234 9072 6343 1760 -5240
14518e240m480Q475m853J117q40k488m178j752K1248J3920j6453J72k311j0279
$$ -5240 -9720 -1245 -6098 -4981 -5821 -8309 -12487 -14239 7009 20929 4476 4648 2337 -7942
14504g942O908N312m380j0444k948L376J1406j374j10j1767K950J7369J5205P808
$$ -7942 -1034 4278 -102 -10546 -13494 -10118 1288 -86 -196 -11963 -9013 8356 23561 31369
14490C1369q844n436j4418n756N883N60o25K064O93J322J3443J527l691j803L706
$$ 31369 22525 17089 2671 -3085 2798 3358 2733 4797 5490 6812 20255 21782 18091 16288 19994
14475A9994m828j6116m609O986m597p432J8048J2297k0839p281J6574k015M971
$$ 19994 15166 -950 -5559 1427 -3170 -10602 7446 19743 -1096 -8377 8197 6182 11153
14462A1153R399M26M728R83o634l305M60m118j4372P80Q771n828m494R542O048
$$ 11153 20552 20978 25706 26689 20055 16750 17210 13092 -1280 -500 8271 2443 -2051 7491 13539
14447A3539l548J8235K772o460Q925m869P513O349q389J1909J1136L294J714J6690
$$ 13539 9991 28226 30998 24538 33463 28594 36107 42456 34067 45976 57112 60406 62120 78810
14433G8810J0955J1300J8538O043n004j1879N656J3244O234l110J8190M9543Q3193
$$ 78810 89765 101065 119603 125646 120642 108763 114419 127663 133897 130787 148977 198520 281713
14420B81713R9117J37161J81269J54149J07542N7989j0040p7024j41752j50395
$$ 281713 380830 517991 699260 853409 960951 1018940 1008900 931876 790124 639729
14410F39729j37565j31967r8409q3495o3238l3030j7401p801j3177k72J120j0653
$$ 639729 502164 370197 271788 188293 125055 92025 74624 66823 53646 53374 54494 43841
14398D3841q792R464Q136n252j1918j2508n890m067k384r250L281L538m321o824
$$ 43841 35049 44513 52649 47397 35479 22971 17081 13014 10630 1380 4661 8199 3878 -2946
14384b946J1194J9994l853O087Q053j5775j7308M17J1213J938n7l978P99m292
$$ -2946 8248 28242 24389 30476 38529 22754 5446 5863 17076 19014 18957 14979 15778 11486
14370A1486O967L076K702J2427P76O767M283J334R278k306m370J3237J7343J2320
$$ 11486 18453 21529 24231 36658 37434 44201 48484 49818 59096 56790 52420 65657 83000 95320
14356I5320J744j279k0207k2270q796q197j3985q82n053j4544j1717j0084L881
$$ 95320 97064 95785 75578 53308 44512 36315 22330 21448 16395 1851 -9866 -19950 -16069
14343a6069Q760m003N825k265J1767J3213P846l029l055o837n276K432j148J596
$$ -16069 -7309 -11312 -5487 -7752 4015 17228 25074 22045 18990 12153 6877 9309 8161 9757
14329I757P51j781N214Q24N344Q756m018N56M57j560O19p453J1616q13O678J1716
$$ 9757 10508 8727 13941 14765 20109 28865 24847 25403 25860 24300 24919 17466 29082 28269 34947 46663
14313D6663j7867k3805K103J8397O286l190N467j0752r135L442Q733L487k1236
$$ 46663 28796 4991 7094 25491 31777 28587 34054 23302 14167 17609 26342 29829 8593
14300H593k257J1269O405k273n774J1311L401j2607Q73O909M510N666o938p623
$$ 8593 6336 17605 24010 21737 15963 27274 30675 18068 18941 25850 30360 36026 29088 21465
14286B1465O765Q55P759l720j1624j5903k232l518q712R50J7290N152o328m832
$$ 21465 28230 29085 36844 33124 21500 5597 3365 -153 -8865 -7915 9375 14527 8199 3367
14272C367k06K441n876M89P613R956J0527m205j2237P737O116j4042l197N014
$$ 3367 3161 5602 -274 215 7828 17784 28311 24106 11869 19606 25722 11680 8483 13497
14258A3497r9J1936P880K948M029P371J6248M018k204N634K007j4483r232o694
$$ 13497 13398 25334 33214 36162 40191 47562 63810 67828 65624 71258 73265 58782 49550 42856
14244D2856J77J868j0361j5732K563J1487J239J7223l739j497O454k483r091j0322
$$ 42856 43033 44901 34540 18808 21371 32858 34097 51320 47581 46084 52538 50055 40964 30642
14230C0642j89J0P716j0885j2855j3376m617J589p52o15J0774j279q411r44N334
$$ 30642 30453 30463 38179 27294 14439 1063 -3554 -1965 -2717 -3332 7442 6163 -2248 -3192 2142
14215B142J4155J4566N30j154q107M487J6181j0739q294J1511J4880O562j6233
$$ 2142 16297 30863 31393 30239 22132 26619 42800 32061 23767 35278 50158 56720 40487
14202D0487k1955k0155r995q869N239J2065J3089N474j0234M499J544k013J1660
$$ 40487 18532 -1623 -11618 -20487 -15248 -3183 9906 15380 5146 9645 11189 9176 20836
14189B0836N367k066R12J3914K733j2866j2872k003J784j97q165L848J6320M795
$$ 20836 26203 24137 25049 38963 41696 28830 15958 13955 15739 15542 7377 11225 27545 32340
14175C2340N049P266r034j1045p747r362J336K3053J230k148N8J4492l238j331
$$ 32340 37389 44655 35621 24576 16829 7467 8803 31856 33086 30938 30996 45488 42250 40919
14161D0919j2726o191J0589M14n08P605o220j7159N162m56j189N478R941P374
$$ 40919 28193 22002 32591 33005 32497 40102 33882 16723 21885 21429 20240 25718 35659 43033
14147D3033k0496r101m476K1611J2296M669Q637J1063N550J0427K2q701k0401
$$ 43033 22537 13436 8960 30571 42867 47536 56173 67236 72786 83213 83235 74534 54133
14134E4133P211m235o10j4498K135N884l048j7139j8552J557O76j1554M607K3009
$$ 54133 61344 57109 56499 42001 44136 50020 46972 29833 11281 12838 13514 1960 6567 29576
14120B9576K2382J0994l008j209j3044j1008p954L784M877m922k991K183l815
$$ 29576 51958 62952 59944 58735 45691 34683 26729 30513 35390 30468 27477 29660 25845
14107B5845N546J9840J6359J994j1895k551j0813J466n060p140j5819r415L699
$$ 25845 31391 51231 67590 69584 57689 55138 44325 45791 40731 33591 17772 8357 12056
14094A2056L346n531m616J3682L689o139j3548j2858j1681r290k99r985r356J0586
$$ 12056 15402 9871 5255 18937 22626 16487 2939 -9919 -21600 -30890 -31189 -41174 -50530 -39944
14080c9944J2580N288J9845M2581J7780K8849K9958L2416J1075J1500k8713k5607
$$ -39944 -27364 -22076 -2231 40350 58130 86979 116937 149353 160428 171928 143215 117608
14068A17608q326j1662q536j9264j3423n132P558J6712J7732R931N323J3408J2364
$$ 117608 109282 97620 89084 69820 56397 51265 58823 75535 93267 103198 108521 121929 134293
14055A34293k803L614K2312N19j1070j7012K081l003q531j897M849N128L096P680
$$ 134293 131490 135104 157416 157935 146865 129853 131934 128931 120400 118503 123352 128480 131576 139256
14041A39256J2646N807J6216N113Q530J664j7306m313n80J7340L624o891M414
$$ 139256 151902 157709 173925 179038 187568 189232 171926 167613 167033 184373 187997 181106 185520
14028A85520M979o532L605K1375J5008M392Q430k306l562N951J2154J5536K8755
$$ 185520 190499 183967 187572 208947 223955 228347 236777 234471 230909 236860 249014 264550 293305
14015B93305K457j758j5078k243P883J3013J9860L625J0382K6982J0340J8994
$$ 293305 295762 294004 278926 276683 284566 297579 317439 321064 331446 358428 368768 387762
14003C87762K4890P086J0932K2536K2399J4652J4589J3788j0013k011N682K2735
$$ 387762 412652 419738 430670 453206 475605 490257 504846 518634 508621 506610 512292 535027
13991E35027K4689K062L9748M0623J6782J3183J6290M0498N6745O5917P1863P5659
$$ 535027 559716 561778 601526 642149 658931 672114 688404 728902 785647 851564 923427 999086
13979I99086P5099Q7830J05978J20573J23379J50916J63951J84656J90426K15440
$$ 999086 1074185 1162015 1267993 1388566 1511945 1662861 1826812 2011468 2201894 2417334
13969B417334K22777K56930L05996L87616N15234P03846R99276J388303J866351
$$ 2417334 2640111 2897041 3203037 3590653 4105887 4809733 5809009 7197312 9063663
13960I063663K243260K362581K336287K029316J240947L29199k90771m21767K4754
$$ 9063663 11306923 13669504 16005791 18035107 19276054 19605253 19314482 18892715 18917469
13951A8917469Q97169K287364M556014Q126236J3352960K0170527K6551356L0013047
$$ 18917469 19814638 22102002 26658016 34784252 48137212 68307739 94859095 124872142
13943A24872142K9399173K3999786J3542524l00827j3438804k4074085k9957323
$$ 124872142 154271315 178271101 191813625 191512798 178073994 153999909 124042586
13936A24042586k9302063k5458950k0058883j3845184q860225n634872l673662
$$ 124042586 94740523 69281573 49222690 35377506 26517281 20882409 17208747
13929A7208747k483621j750142j345866j109404j013696r78975r54615r16479
$$ 17208747 14725126 12974984 11629118 10519714 9506018 8527043 7572428 6655949
13921F655949q45403p45980o32912n05372m12728l48229k81247k38305j90494
$$ 6655949 5810546 5064566 4431654 3926282 3513554 3165325 2884078 2645773 2455279
13912B455279j63681j32772j12120j13434r7340p6514o3039m6951m1463j9120
$$ 2455279 2291598 2158826 2046706 1933272 1835932 1759418 1696379 1649428 1607965 1588845
13902A588845p263Q327J2789J1250J9512M0221N2753O1887P0290R2865J49952
$$ 1588845 1581582 1589909 1602698 1613948 1633460 1673681 1726434 1788321 1858611 1951476 2101428
13891B101428K28360L50186N76866R28439J428696J996996K334909K098769J334463
$$ 2101428 2329788 2679974 3256840 4185279 5613975 7610971 9945880 12044649 13379112
13882A3379112M17801n06077j420953k080977k262058j979874j451565r62965
$$ 13379112 13796913 13290836 11869883 9788906 7526848 5546974 4095409 3132444
13874C132444o15439m03265k65195j72269j28019j25475j07292p9712m2371m6164
$$ 3132444 2517005 2113740 1848545 1676276 1548257 1422782 1315490 1235778 1193407 1147243
13864A147243m3876n1295o2017n9664n7545n2941m8911o5213p3173m8975l7949
$$ 1147243 1103367 1052072 990055 930391 872846 819905 770994 705781 632608 583633 545684
13853E45684l4903l7132k7119k6097j5916r000j4803j3025j8843k0249q220j0624
$$ 545684 510781 473649 446530 420433 404517 395517 380714 367689 348846 328597 320377 309753
13841C09753j748O878j09J725L767m386j7451r249l331r426k3117k5347k5707
$$ 309753 308005 314883 314774 316499 320266 315880 298429 289180 285849 276423 253306 227959 202252
13828B02252q788M728j2477Q543J5180J3696J7337K039r891K1881J2471j951j886
$$ 202252 193464 198192 185715 194258 209438 223134 240471 242510 232619 254500 266971 265020 263134
13815B63134j8059l3926k9318J1283J5879j0582J543J1318J5015J6817J3125K3677
$$ 263134 245075 211149 181831 193114 208993 198411 199954 211272 226287 243104 256229 279906
13803B79906K3454K2383M022j1725k0114o357o077j2346j4934q097j4591N609
$$ 279906 303360 325743 329765 318040 297926 291569 285492 273146 258212 250115 235524 241133
13791B41133l454p988n346j2031j6126n335k633N946m658n694K798J3716J1273
$$ 241133 237679 229691 224345 212314 196188 190853 188220 194166 189508 183814 186612 200328 211601
13778B11601J6128K1429L3393L9586K6080J7928O596j0770l6046m3251j5853l1243
$$ 211601 227729 249158 282551 322137 348217 366145 372741 361971 325925 282674 266821 235578
13766B35578l3160j9771k0682j7552Q249J4484r382O309N616J912q967J006k056
$$ 235578 202418 182647 161965 144413 152662 167146 157764 164073 169689 171601 162634 163640 161584
13753A61584o751j8234j0442l739n874R65o585j3338j239J268j4612J0015J8679
$$ 161584 154833 136599 126157 122418 116544 117509 110924 97586 96347 97615 83003 93018 111697
13740A11697M602M272K673o239j8631j3367j808J769j2449K29O405P427O943R116
$$ 111697 116299 120571 123244 117005 98374 85007 83199 84968 72519 72748 79153 86580 93523 102639
13726A02639j3790K805p137j435O721M8m051o101J992l633j689o029r873l188
$$ 102639 88849 91654 84517 83082 89803 89851 85800 79699 81691 78058 76369 70340 60467 57279
13712E7279O408J7852J2744n789r799L215k978q206O691R57M772K191P141J4066
$$ 57279 63687 81539 94283 88494 78695 81910 78932 70726 77417 78374 83146 85337 92478 106544
13698A06544O601P682j2233n734l967J228J6286K6094K3386K6262L7351M0375
$$ 106544 113145 120827 108594 102860 98893 100121 116407 142501 165887 192149 229500 269875
13686B69875P8579R1231J06556J43840J54645J31697Q9239K1351n9969j12808
$$ 269875 348454 439685 546241 690081 844726 976423 1065662 1087013 1027044 914236
13676I14236j34139j64997j38850j24023p3521o5648m6545k1429L577K410l34
$$ 914236 780097 615100 476250 352227 278706 213058 166513 145084 148661 151071 150737
13665A50737o577r550k8491o378p55J374j8278p758p449r813Q254J2046j0673
$$ 150737 144160 134610 106119 99741 98986 100360 82082 74324 66875 57062 65316 77362 66689
13652F6689j7071n211J5004M552q184j0885o49m155J4129N379m794j6520j0842
$$ 66689 49618 44407 59411 63963 55779 44894 44245 40090 54219 59598 54804 38284 27442
13639B7442k0940k383N289n993R30m686o804p682J497J9371P720n216J044j0991
$$ 27442 6502 4119 9408 3415 4345 -341 -7145 -14827 -13330 6041 13761 8545 9589 -1402
13625a402r683J0515J4309R372N40K635q226O589L178K814J451J5185Q457O440
$$ -1402 -11085 -570 13739 23111 23651 26286 18060 24649 27827 30641 32092 47277 55734 62174
13611F2174o968j7474r593M434J008M273n480p508J546N553R017p635p965J0424
$$ 62174 55206 37732 28139 32573 33581 37854 32374 24866 26412 31965 40982 33347 25382 35806
13597C5806J2422J1206l579J513k000K102p629j9886j7656P312j43M970M647J7648
$$ 35806 48228 59434 55855 57368 55368 57470 49841 29955 12299 19611 19468 24438 29085 46733
13583D6733J3033j7873j0545J2563J126K44R585j2906l220J6005Q856K411k5816
$$ 46733 59766 41893 31348 43911 45037 45281 54866 41960 38740 54745 63601 66012 40196
13570D0196j4729n398M188K4472M578j0615L578n752q279l02l617p549o9K214
$$ 40196 25467 20069 24257 48729 53307 42692 46270 40518 32239 31937 28320 20771 20702 22916
13556B2916k212O538j637J0730O618P988k311l309j4280p582l540j0767l331m811
$$ 22916 20704 27242 25605 36335 42953 50941 48630 45321 31041 23459 19919 9152 5821 1010
13542A010J543O859M586J3663J9730R23q547Q907J206j0953Q19K729j5347j2063
$$ 1010 2553 9412 13998 27661 47391 48314 39767 48674 49880 38927 39746 42475 27128 15065
13528A5065j0569J1286Q255O94j138M240q734M585R211m678l185r254o669Q772
$$ 15065 4496 15782 24037 24731 23593 27833 19099 23684 32895 28217 25032 15778 9109 17881
13514A7881J3056R388j7315K811L475j882J3200O908o967j0585p327o982j0011
$$ 17881 30937 40325 23010 25821 29296 27414 40614 47522 40555 29970 22643 15661 5650
13501E650n03k616j669l00n517m441J6606J4025K232P183J532j2467Q333m258
$$ 5650 5147 2531 862 562 -4955 -9396 7210 21235 23467 30650 32182 19715 28048 23790
13487B3790m679j1116q192j5482J3423K8114M2887K6364M866J3611J5685J9875
$$ 23790 19111 7995 -197 -15679 -2256 25858 68745 95109 99975 113586 129271 149146
13475A49146n394j2844k549J2708J0773J2387N240L235L2821O3488J14926J38247
$$ 149146 143752 130908 128359 141067 151840 164227 169467 172702 205523 269011 383937 522184
13463E22184J41230J41277J38175Q3402J5869n2391j09274j53914j63298j30753
$$ 522184 663414 804691 942866 1026268 1042137 989746 880472 726558 563260 432507
13453D32507j09765p4847n3057k9644j5087l2327k0291j1877n067l261P468m408
$$ 432507 322742 247895 194838 165194 150107 117780 97489 85612 80545 77284 84752 80344
13441H0344P389O878M58j7840j2278M760L395k0738j9276j0915Q826K160o644
$$ 80344 87733 94611 95069 77229 64951 69711 73106 52368 33092 22177 31003 33163 26519
13428B6519j3610J498J3647m062J11O77q79R319j9296K31J1377Q965J1358j0852
$$ 26519 12909 14407 28054 23992 24103 24780 23901 33220 13924 14155 25532 34497 45855 35003
13414C5003P67M686J2750m118K351J677k6057j0776N077J6340J2973K448O394
$$ 35003 35770 40456 53206 49088 51439 53116 27059 16283 21360 37700 50673 53121 59515
13401E9515L270J7200M916o097j4564j4145l063o688l396p645o874j156p241P584
$$ 59515 62785 79985 84901 78804 64240 50095 47032 40344 36948 29303 22429 21273 14032 21616
13387B1616J2173P243n848o806p937O294l959j3301m281j0744o191R009P449n492
$$ 21616 33789 41032 35184 28378 20441 26735 22776 9475 5194 -5550 -11741 -2732 4717 -775
13373g75L576J3481R352p873m242L081P812p602J0879o605n672P884J636k604
$$ -775 2801 16282 25634 17761 13519 16600 24412 16810 27689 21084 15412 23296 24932 22328
13359B2328J3223R626k2119j5573J4618J6099P572J907J2011K3974J0886j871
$$ 22328 35551 45177 23058 7485 22103 38202 45774 47681 59692 83666 94552 92681
13347I2681q666n975J4080p788r629j1124L104J5551R346j0990m165r237o260
$$ 92681 84015 78040 92120 84332 74703 63579 66683 82234 91580 80590 76425 67188 60928
13334F0928k0233k3095n79K197Q553j54L795k283J4352J4469J3425O257L240k275
$$ 60928 40695 17600 17021 19218 27771 27617 31412 29129 43481 57950 71375 77632 80872 78597
13320G8597J0298J457p150J729L4313M1495N6326O4761O5546J04683J85882K89471
$$ 78597 88895 90352 83202 84931 119244 160739 217065 281826 347372 452055 637937 927408
13308I27408M15221M34246K54327j0755k88826m72681m20538k66841j57377r2444
$$ 927408 1342629 1776875 2031202 2020447 1731621 1258940 838402 571561 414184 321740
13298C21740o3203l6062m1051m4466k0995j6704j7535L742N145n898j3059O009
$$ 321740 258537 222475 181424 136958 115963 99259 81724 85466 90611 84713 71654 77663
13286G7663o678p587M12K258n881r53J3436K643l139p296o541m773j6561k0372
$$ 77663 70985 63398 63810 66068 60187 59234 72670 75313 72174 64878 58337 53564 37003 16631
13272A6631J7199Q825L531p064j1753n446k636J0732l076j7672K137J101k875
$$ 16631 33830 42655 46186 39122 27369 21923 19287 30019 26943 9271 11408 12509 9634
13259I634l957O165J4543K067N738J3104J3353L960O64j7202k6121j0416j3635
$$ 9634 5677 11842 26385 28452 34190 47294 60647 64607 65271 48069 21948 11532 -2103
13246b103p814J9223J4839K1185L1662L8212K5561J157j6597n633R883R322N083
$$ -2103 -9917 9306 24145 45330 76992 115204 140765 141922 125325 119692 129575 138897 143980
13233A43980k2273k2064j6593j0755N580J024j6929j232m00Q087m844J560Q63
$$ 143980 121707 99643 83050 72295 77875 78899 61970 60738 60338 68425 63581 65141 66004
13220F6004j936k265p606Q425K352L714m001l813M606k845L995j6965k0157j5390
$$ 66004 64068 61803 54197 62622 64974 68688 64687 60874 65480 62635 66630 49665 29508 14118
13206A4118l03N857M767M888R692j5121r787O770o145P74J5694j461k442m895
$$ 14118 13815 19672 24439 29327 39019 23898 14111 20881 14736 15510 31204 29743 27301 22406
13192B2406r979J2870m069O633N085j876n540K314k69j135o45P345J341Q098K6790
$$ 22406 12427 25297 21228 27861 32946 31070 25530 27844 27575 26440 25795 33140 34481 42579 69369
13177F9369O171k2041O024J5997K0499J7058L835k1418l7599k9532q538j5127
$$ 69369 75540 53499 59523 75520 96019 113077 116912 95494 57895 28363 19825 4698
13165D698j54K069J9146O891l150O515M368l529J2266k062o237o161j2846j2257
$$ 4698 4544 6613 25759 32650 29500 36015 40383 36854 49120 47058 40821 34660 21814 9557
13151I557k835J3373J6412l660l196r55L838j2309m430O181O092J083J0126K996
$$ 9557 6722 20095 36507 32847 29651 28696 32534 20225 15795 21976 28068 29151 39277 42273
13137D2273q093j332P928k398j582k062N936N221Q994p674j7524k7869j3281q692
$$ 42273 34180 32848 40776 38378 36796 34734 40670 45891 54885 47211 29687 1818 -11463 -20155
13123b0155J6006J7118J0276J9393O373M765k245r517K251L047j320p29n743j0346
$$ -20155 -4149 12969 23245 42638 49011 53776 51531 42014 44265 47312 45992 45263 39520 29174
13109B9174j0070M517O335N325J1166J982j736Q926J3010j5488o64k461k0482
$$ 29174 19104 23621 29956 35281 46447 48429 46693 55619 68629 53141 52477 50016 29534
13096B9534k796J512K4383K6654J3432L3256L2695J7365j064j8989k9875l2318
$$ 29534 26738 28250 52633 79287 92719 125975 158670 176035 174971 155982 126107 93789
13084I3789k5204j0969j0208J305J5080J550p445q481m836J352L358q32P487P763
$$ 93789 68585 57616 47408 48713 63793 65343 57898 49417 44581 45933 49291 48459 55946 63709
13070F3709L833P150j0606l185J8003K243P911K527O890j6896k7962j2973L958
$$ 63709 67542 74692 64086 60901 78904 81147 89058 91585 98475 81579 53617 40644 44602
13057D4602O48o526j9780j5919K221K054M303J9925N612R978q82J4744K0387K0092
$$ 44602 45250 38724 18944 3025 5246 7300 11603 31528 37140 47118 46236 60980 81367 101459
13043A01459R180m544j4798k7702l2596k2934p317J0033K1938L4419Q992O960
$$ 101459 110639 106095 91297 63595 30999 8065 748 10781 32719 67138 76130 83090
13031H3090J905P193o46q411j5649j2173o90k794r843p208k8267k0868r891K6852
$$ 83090 84995 92188 91542 83131 67482 55309 54619 51825 41982 34774 6507 -14361 -24252 2600
13017B600M2850J2626j1109j9851k9713k1743j7711k5496k0405l545R639J9316
$$ 2600 45450 58076 46967 27116 -2597 -24340 -42051 -67547 -87952 -91497 -81858 -62542
13005f2542K9314L4039M8320N2058N6001M8237K4845J3409j6226k4665k5957l2629
$$ -62542 -33228 811 49131 101189 157190 205427 230272 243681 227455 202790 176833 144204
12993A44204l6420j5800l616n882K1514J8067L6984K6794J3489J839J8352K1166
$$ 144204 107784 91984 88368 82486 104000 122067 159051 185845 199334 201173 219525 240691
12981B40691J0207j1259l0361k9239o935K761j4668j4793M974J9759L847K829
$$ 240691 250898 239639 209278 180039 173104 175865 161197 146404 151378 171137 174984 177813
12969A77813L982J2125l506l077K497J053N690K216o659j2554M782K0736M907
$$ 177813 181795 193920 190414 187337 189834 190887 196577 198793 192134 179580 184362 205098 210005
12956B10005l481m885Q390K5596O574P451J4019J1394J7932J3641Q513l160K2903
$$ 210005 206524 201639 210029 235625 242199 249650 263669 275063 292995 306636 315149 311989 334892
12943C34892K4427K2886M711p294p428q86p562K811J1193L5307K9580K1938L2822
$$ 334892 359319 382205 386916 379622 372194 371308 363746 366557 377750 413057 442637 464575 497397
12930D97397K2622J9593J5885L0613L1895K2050L3426L0362J8430l530L748K2594
$$ 497397 520019 539612 555497 586110 618005 640055 673481 703843 722273 718743 722491 745085
12918G45085Q970J1180L0119K4095O631K9810N3431N8988O0431O4020O1240N5846
$$ 745085 754055 765235 795354 819449 826080 855890 909321 968309 1028740 1092760 1154000 1209846
12906A209846L8658P0869Q0938R8642J01352O9953O9263J05431J62801J90176
$$ 1209846 1248504 1319373 1400311 1498953 1600305 1670258 1739521 1844952 2007753 2197929
12896B197929K03943K47826K42349K07289J90958J75472K00315K68846L22856
$$ 2197929 2401872 2649698 2892047 3099336 3290294 3465766 3666081 3934927 4257783
12887D257783M38056N69564P11394Q81060J047072J250166J484552J763599K199554
$$ 4257783 4695839 5265403 5976797 6857857 7904929 9155095 10639647 12403246 14602800
12878A4602800K871438L893543N262370P085865R607337J3921975K2187600L7119273
$$ 14602800 17474238 21367781 26630151 33716016 43323353 57245328 79432928 116552201
12870A16552201N9892334Q4461635Q1442334L6302026j3477915o3504716q8092226
$$ 116552201 176444535 260906170 342348504 378650530 365172615 301667899 213575673
12863B13575673p1780190m5836167k7546553j6949783j1213289p887378n908925
$$ 213575673 141795483 95959316 68412763 51462980 40249691 32362313 26453388
12856B6453388m683774l713219k856716k169928j681782j291382j006904q32831
$$ 26453388 21769614 18056395 15199679 13029751 11347969 10056587 9049683 8216852
12848H216852p52023o40594n35135m69222m29942m04747l80078l55993l43143
$$ 8216852 7464829 6824235 6289100 5819878 5389936 4985189 4605111 4249118 3905975
12839C905975l35067k92827k49339j88882j27792j42719j55262j39964j05934
$$ 3905975 3570908 3278081 3028742 2839860 2712068 2569349 2414087 2274123 2168189
12830B168189o6596p5098o3873n7396m9874k5086k2900k2250l0856n7720q7896
$$ 2168189 2101593 2026495 1962622 1905226 1855352 1830266 1807366 1785116 1754260 1696540 1608644
12819A608644q2662p7993o7859m5569m3760l5283k8085k5673l4252r008M5421
$$ 1608644 1525982 1447989 1380130 1334561 1290801 1255518 1227433 1201760 1167508 1158500 1203921
12808A203921M8133N5628P2506R6990J47531J65435K36036L34831M88393P56913
$$ 1203921 1252054 1307682 1380188 1477178 1624709 1790144 2026180 2361011 2849404 3606317
12798C606317J234384K103891L369755M685612M297503J499283j665965m292233
$$ 3606317 4840701 6944592 10314347 14999959 19297462 20796745 19130780 14838547
12790A4838547m468850l004756j618288o12712J82989Q08580Q07661l94673j485709
$$ 14838547 10369697 7364941 5746653 5133941 5316930 6125510 6933171 6538498 5052789
12781E052789j446500r66057n76828l39349k42176j91199j44700j02434q0027
$$ 5052789 3606289 2640232 2063404 1724055 1481879 1290680 1145980 1043546 963519
12772I63519p5755o4487n8606m2641l7874m1694m0830m6023k8967r290j0840j5412
$$ 963519 887764 823277 764671 722030 684156 642462 601632 555609 526642 517352 506512 491100
12760D91100L426r088k9101l2354k3420j4799m349l378n396l359l253L779K7274
$$ 491100 494526 485438 456337 423983 400563 385764 381415 378037 372641 369282 366029 369808 397082
12747C97082N0220N0543M0909J0580l882k2744m5239m7762p053o67L1289N7096
$$ 397082 447302 497845 538754 549334 545452 522708 477469 429707 422654 421987 453276 510372
12735E10372Q6696J21062J89188K78436L41003L78398K82590J10591k6599k13059
$$ 510372 597068 718130 907318 1185754 1526757 1905155 2187745 2298336 2271737 2058678
12725B058678l15816k95420j84080q8626o747k9248j50960j87025j32354p5226
$$ 2058678 1742862 1447442 1263362 1174736 1167989 1138741 987781 800756 668402 593176
12715E93176l9985l0645m1752n6795l6584k0219q37j296p468j4511j1328J855
$$ 593176 553191 522546 480794 423999 387415 367196 366359 365063 357595 343084 331756 333611
12703C33611P254j2861M44m396J022L140l240O067J1159j8187k0723j5622p559
$$ 333611 340865 328004 328448 324052 325074 328214 324974 331041 342200 324013 303290 287668 280109
12690B80109R305K9401L5321J0890K2155J7404J1935n078o762O255r957p634L1991
$$ 280109 289414 318815 354136 365026 387181 404585 416520 411442 404680 410935 400978 393344 425335
12677D25335J7031L867j4721k0745j5950o704J6143K1363L7120L2602M2664N8706
$$ 425335 442366 446233 431512 410767 394817 388113 404256 425619 462739 495341 538005 596711
12665E96711N6708Q2033R0871J14532J45237J72463K17037L12671M15624N57056
$$ 596711 653419 735452 826323 940855 1086092 1258555 1475592 1788263 2203887 2760943
12655B760943P41235R85255J438926K285608L516394M744483M637585K302855
$$ 2760943 3502178 4487433 5926359 8211967 11728361 16472844 21110429 23413284
12647B3413284o30271l465708m938170m297538k969380j895007j214994q14418
$$ 23413284 22783013 19317305 14379135 10081597 7112217 5217210 4002216 3187798
12639C187798n78972m41768l39915k75674k15061j71502j46750j12466q7874p3935
$$ 3187798 2608826 2167058 1827143 1551469 1336408 1164906 1018156 905690 817816 743881
12629G43881o8296n1451l8498m2536l3131k5615k0900k2477k2223k3858j7159
$$ 743881 675585 624134 585636 543100 509969 484354 463454 440977 418754 394896 377737
12618C77737k038M981j7625j2486r068K102J9408J4038K2143L4389N1145P6802
$$ 377737 375699 380680 363055 350569 341501 343603 363011 377049 399192 433581 484726 561528
12606E61528P8123M6570R569k7943q0502j08765j01713n9958n0082k0643K006
$$ 561528 639651 686221 695790 667847 587345 478580 376867 316909 266827 246184 248190
12595B48190p647j4027j8643k6013j9329J404l489L892m374l393J007j0342j635
$$ 248190 240543 226516 207873 181860 162531 163935 160446 164338 159964 156571 157578 147236 145601
12582A45601J0126M1m665K720M836M29J6081J0049j8446k5183q635j259J2732
$$ 145601 155727 155768 151103 153823 158659 159088 175169 185218 166772 141589 132954 131695 144427
12569A44427m713q544j5092k4555k0692k0430j3188o102m142J4314J7953M895
$$ 144427 139714 131170 116078 91523 70831 50401 37213 31111 26969 41283 59236 64131
12557F4131K936Q578O877Q638J2162Q731p374k699L625j524j9354j8234J712k313
$$ 64131 67067 75645 82522 91160 103322 112053 104679 101980 105605 104081 84727 66493 68205 65892
12543F5892j2235J4747J9086J3080Q807J6656Q172K9412k984k6874k9943j7402
$$ 65892 53657 68404 87490 100570 109377 126033 134205 163617 160633 133759 103816 86414
12531H6414K089p293M862p5m94n066o724J996P79j121N535K653j6379O854P924
$$ 86414 88503 81210 86072 85997 85503 80437 73713 75709 76488 75367 80902 83555 67176 74030 81954
12516H1954j8197J922J6221n842N793k902q759n687o107M124J0536J7813o627
$$ 81954 63757 65679 81900 76058 81851 78949 70190 64503 58396 62520 73056 90869 84242
12503H4242j3768L215J1192J251L286o929O436l886j3506k484r04r521o058P861
$$ 84242 70474 73689 84881 86132 89418 82489 88925 85039 71533 69049 68145 58624 52566 60427
12489F0427m049n24J1649k130j4913r950q989R433p720L268J4795J5264J05q105
$$ 60427 56378 55854 67503 65373 50460 40510 31521 40954 33234 36502 51297 66561 66666 58561
12475E8561J303q806r5q053l445K1343J8598m556l254R812j6283j5103N784Q169
$$ 58561 59864 51058 50963 42910 39465 60808 79406 74850 71596 81408 65125 50022 55806 63975
12461F3975N048P217M833r45R91j1048j3528m7k01J0552K467j63J980M652L402
$$ 63975 69023 76240 81073 80128 81119 70071 56543 56496 56295 66847 69314 69151 71131 75783 79185
12446G9185L898J8575m511o10j2888K88Q325O293Q491J904J5123J1933K2329L705
$$ 79185 83083 101658 97147 96537 83649 83937 92262 98555 107046 108950 124073 136006 158335 162040
12432A62040R611L2475K0168L0173M5936P2754J42594K40457L81372M81519L79146
$$ 162040 171651 204126 224294 254467 300403 373157 515751 756208 1137580 1619099 1998245
12421A998245J01942j77401m04124m29857l20921k08781j32901p4871m6398m2540
$$ 1998245 2100187 1922786 1518662 1088805 767884 559103 426202 351331 304933 262393
12411B62393k1290j7752j5203O103J5820K0581J5694L9611N2395N7997R3859J58909
$$ 262393 241103 223351 208148 214251 230071 250652 266346 305957 358352 416349 510208 669117
12399F69117K47133L31325L67536K34599N1978o9593k54755l73789l24896k35644
$$ 669117 916250 1247575 1615111 1849710 1901688 1832095 1577340 1203551 878655 643011
12389F43011j52746j16940q4775m2486l5748l3902j7489j9712j3222r478k1346
$$ 643011 490265 373325 288550 246064 210316 176414 158925 139213 125991 116513 95167
12378I5167o62N500k822j3666n362R53j7124j9927q517P026J0245O431j925L262
$$ 95167 94505 100005 97183 83517 78155 79108 61984 42057 33540 40566 50811 57242 55317 58579
12364E8579M189N496M990j48o425N681p105K341L695p02j6092j0729Q515O467
$$ 58579 62768 68264 73254 73106 66681 72362 65257 67598 71293 70591 54499 43770 52285 58752
12350E8752J7569J5288J3849J3899K2277j898k4775k2435k340j3931l329m968
$$ 58752 76321 91609 105458 119357 141634 139736 114961 92526 90186 76255 72926 67958
12338F7958O300l069j6215n772r382O581j326P066M91j3614K968J1324K352j941
$$ 67958 74258 71189 54974 49202 39820 46401 45075 52141 52632 39018 41986 53310 55662 53721
12324E3721L400j1455k2673J1699O596o592j0686l065M340L990j2072o640j375
$$ 53721 57121 45666 22993 34692 41288 34696 24010 20945 25285 29275 17203 10563 9188
12311I188R897J2907M498k1209q719J3390K1450K0262R747n166q337j5341r527
$$ 9188 19085 31992 36490 15281 6562 19952 41402 61664 71411 66245 57908 42567 33040
12298C3040j8163n218K3514K1789k137j1367l465l208Q135j5719j2936J0229M732
$$ 33040 14877 9659 33173 54962 52825 41458 37993 34785 42920 27201 14265 24494 29226
12285B9226j424K3200Q935j6200o66N740j5554j277O719l220j1942l437K4198
$$ 29226 27802 51002 59937 43737 43071 48811 33257 31980 38699 35479 23537 20100 44298
12272D4298J1685k3556J010n390l00N27j0615l745O356L2M613J475k602j3451
$$ 44298 55983 32427 33437 28047 27747 28274 17659 13914 20270 20302 24915 26390 23788 10337
12258A0337J286J6356R81J28r148K95N489J8271J8704O274J486J1596K1599L991
$$ 10337 11623 27979 28960 29088 19940 20235 25724 43995 62699 68973 70459 82055 103654 107645
12244A07645k6448k6444q746j1657l978j399q731Q016Q092j871n712J823L561
$$ 107645 81197 54753 46007 34350 30372 28973 20242 28258 36350 34479 28767 30590 34151
12231C4151j660j1435M080O380r883o868J3533J5427K557k0586n847N065R366
$$ 34151 32491 21056 25136 31516 21633 14765 28298 43725 46282 25696 19849 24914 34280
12218C4280k2725o035L170P626l737J6543J3249O511K763L625n054k711J356M456
$$ 34280 11555 5520 8690 16316 12579 29122 42371 48882 51645 55270 50216 47505 48861 53317
12204E3317K8562L6207K9437O316m919r337k3111l3168j8855q904j0571j073j4191
$$ 53317 81879 118086 147523 153839 148920 139583 116472 83304 64449 55545 44974 43901 29710
12191B9710J3240R187j2187k2049j936J268j2368O859J660l90k48J992O702J8969
$$ 29710 42950 52137 39950 17901 15965 17233 4865 11724 13384 12994 12746 14738 21440 40409
12177D0409O822j0701j3332N215O834r02k2164j4993q52Q972k212k834O512J8791
$$ 40409 47231 36530 23198 28413 35247 34345 12181 -2812 -3664 5308 3096 262 6774 25565
12163B5565J1366P301m091K485J5194k608k980m34N508p225k552n757j2466j4403
$$ 25565 36931 44232 40141 42626 57820 55212 52232 51798 57306 50081 47529 41772 29306 14903
12149A4903m254O197J5838Q980j001j6869o347m34N968m957O50L314J2967j2856
$$ 14903 10649 16846 32684 41664 40663 23794 17447 17013 22981 18024 18674 21988 34955 22099
12135B2099k461O482l103L507P32j4157K169O910n645J999Q254P821O943Q788
$$ 22099 19638 26120 23017 26524 27256 13099 15268 22178 16533 18532 26786 34607 41550 50338
12121E0338j837n107P267o411N054L25K433m586j2283J000K352N481j919j3487
$$ 50338 48501 43394 50661 44250 49304 49629 52062 47476 35193 36193 38545 44026 42107 28620
12107B8620l516O48K502N838N03J309l294P365j491K902j5355j4248K12J735N301
$$ 28620 25104 25752 28254 34092 34595 35904 32610 39975 38484 41386 26031 11783 11995 13730 19031
12092A9031O236k067j2088j6757P61J3499O839K374N83L805j078j2175l632J3504
$$ 19031 25267 23200 11112 -5645 -4884 8615 15454 17828 18411 22216 21138 8963 5331 18835
12078A8835k840l666J1195J0467j5322L091j0399k0566J616J3074m466r926k730
$$ 18835 15995 12329 23524 33991 18669 21760 11361 -9205 -7589 5485 1019 -8907 -11637
12065a1637N940L326N284M715J940j3724m991K1486J1948Q697m053j2434m221
$$ -11637 -5697 -2371 2913 7628 9568 -4156 -9147 12339 24287 32984 28931 16497 12276
12052A2276j5945R18j2559J643j675Q145J9733j179n992J1505N101j3438q502
$$ 12276 -3669 -2751 -15310 -13667 -15342 -7197 12536 11357 5365 16870 21971 8533 31
12039C1Q39J0742O854q986J758J4455K819j1430k878R510O11K704j1419L591K643
$$ 31 870 11612 18466 9480 11238 25693 28512 17082 14204 23714 24325 27029 15610 19201 21844
12024B1844j2251j912N672r846q535N857R894J411K081p566J956M329Q496L022
$$ 21844 9593 7681 13353 3507 -5028 829 10723 12134 14215 6649 8605 12934 21430 24452
12010B4452j0676o688P967k313j7740J6478O14j1294Q287J8141L058j5607l357
$$ 24452 13776 7088 15055 12742 -4998 11480 12094 800 9087 27228 30286 14679 11322
11997A1322K016j5932J633j165K691P327N134o242J1046J1751p690o398O902k14
$$ 11322 13338 -2594 -961 -2126 565 7892 13026 6784 17830 29581 21891 15493 22395 22181
11983B2181r119q939L893j5548M658J3042J691j0584r834J3939M396o94Q232K175
$$ 22181 13062 4123 8016 -7532 -2874 10168 11859 1275 -8559 5380 9776 9082 17314 19489
11969A9489r741J805J3356N252N955n322q737j1909m987p612L114J1595M089N465
$$ 19489 9748 11553 24909 30161 36116 30794 22057 10148 5161 -2451 663 12258 16347 21812
11955B1812j0718p356L247P279o710k230M91j065K1008P640J318K60j0661j1424
$$ 21812 11094 3738 6985 14264 7554 5324 5815 4750 25758 33398 34716 34976 24315 12891
11941A2891j3351m648J2257q47j1851P502N616j1100M092R374j693K574J576R364
$$ 12891 -460 -5108 7149 6302 -5549 1953 7569 -3531 561 9935 8242 10816 12392 21756
11927B1756o466J234Q167L447j1352r823J252J494l280n44j117K129J023r813
$$ 21756 15290 16524 24691 28138 16786 6963 8215 9709 6429 5885 4768 6897 7920 -1893
11913a893n881J1392Q844k575N028P695k339M595j6855k398l228K952J1440M108
$$ -1893 -7774 3618 12462 9887 14915 22610 20271 24866 8011 5613 2385 5337 16777 20885
11899B0885j2512o284M192J4402j413O398k079j2635n117k672j4604j3649J3650
$$ 20885 8373 2089 6281 20683 19270 25668 23589 10954 5837 3165 -11439 -25088 -11438
11886a1438J5918Q748K647J1989j3791o468k917M764J4386k800N301j3381K246
$$ -11438 4480 13228 15875 27864 14073 7605 4688 9452 23838 21038 26339 12958 15204
11873A5204O955m183j0936p660l106N041J325j0139R439k66o73R645P6J4554K1602
$$ 15204 22159 17976 7040 -620 -3726 1315 2640 -7499 1940 1674 1001 10646 10722 25276 46878
11858D6878p530n215M360M018O751q555k2977k365L780Q34K329j474L50J572j0985
$$ 46878 39348 34133 38493 42511 49262 40707 17730 15365 19145 19979 22308 20834 21184 22756 11771
11843A1771j7605J056J5913L548j0017o699j474J925q195n104r595J686K727J4981
$$ 11771 -5834 -4778 11135 14683 4666 -2033 -3507 -1582 -9777 -14881 -24476 -22790 -20063 -5082
11829e082L233R95r36L590k905N934O859m675J081R24r1j87n291j4378q168j74
$$ -5082 -1849 -854 -1790 1800 -1105 4829 11688 7013 8094 9018 8927 8740 3449 -10929 -19097 -19271
11813a9271o739k582J1296J1158M852l481J499j6J0035m899q542J1006J1540k167
$$ -19271 -26010 -28592 -17296 -6138 -1286 -4767 -3268 -3284 6751 1852 -6690 4316 15856 13689
11799A3689o465N933K6027J9276J5214J6733Q680j9885l0627j2990l4144k5689
$$ 13689 7224 13157 39184 58460 73674 90407 99087 79202 48575 35585 1441 -24248
11787b4248O947j926m278L591O338O23P333K187k870q947N506J3691R806P129
$$ -24248 -17301 -19227 -23505 -19914 -13576 -12953 -5620 -3433 -6303 -15250 -9744 3947 13753 20882
11773B0882j2980k99l071m542q507M141N130L921r473K73K68j0553K469J0241
$$ 20882 7902 7603 4532 -10 -8517 -4376 754 4675 -4798 -4525 -4257 -14810 -12341 -2100
11759b100o72L053J2361J024n407j7635n949J3008l323K099J0836k151l699J842
$$ -2100 -2772 281 12642 13666 8259 -9376 -15325 -2317 -5640 -3541 7295 5144 1445 3287
11745C287r361o042J0337L1681k347j8844r09J0038k74r88j2027k391M570L240
$$ 3287 -6074 -12116 -1779 29902 27555 8711 7802 17840 17566 16578 4551 2160 6730 9970
11731I970R408J5451j649r389k142m645m789j689K300j223j788O634Q85r821o156
$$ 9970 19378 34829 33180 23791 21649 17004 12215 10526 12826 11603 9815 16449 17334 7513 1357
11716A357R266J788l636J0139p26q202J953p073k589P540j105P77j4356k338P737
$$ 1357 10623 12411 8775 18914 18188 9986 11939 4866 2277 9817 8712 9489 -4867 -7205 532
11701E32J2256J5293q203r462j876r15p680O727J620j5762j842M205L09M298O200
$$ 532 12788 28081 19878 10416 8540 7625 -55 6672 8292 -7470 -9312 -5107 -4798 -500 5700
11686E700L216p312K357J2153m823k262M193j4448Q831O897k218Q575O700n230
$$ 5700 8916 1604 3961 16114 11291 9029 13222 -1226 7605 14502 12284 20859 27559 22329
11672B2329p790K32o562n632j801M292R297J0035r479o144N029N298q991P576
$$ 22329 14539 14771 8209 2577 776 5068 14365 24400 14921 8777 13806 19104 10113 17689
11658A7689l881q451P750J2775J6194j4855j8180J0573n931p07O043m839o933
$$ 17689 13808 5357 13107 25882 42076 27221 9041 19614 13683 12976 19019 14180 7247
11645G247o204N161J6660m081n895m797m278o610j364k085L034L60p086j3709
$$ 7247 1043 6204 22864 18783 12888 8091 3813 -2797 -4161 -6246 -3212 -2852 -9938 -23647
11631b3647N891l072j0956Q030J0735Q039N067N597K795o859n575O856Q993j0230
$$ -23647 -17756 -20828 -31784 -23754 -13019 -4980 87 5684 8479 1620 -3955 2901 11894 1664
11617A664L488J017K588P016k959j2094Q341R379l241L31m701j0060J1865O411
$$ 1664 5152 6169 8757 15773 12814 720 9061 18440 15199 15530 10829 769 12634 19045
11603A9045K686j1999o989M385o606J628m974o402j193P652l840m675K126K655
$$ 19045 21731 9732 2743 7128 522 2150 -2824 -9226 -10419 -2767 -6607 -11282 -9156 -6501
11589f501M550J814q338K901m729M543m795m050m606J7494j728o05Q593o41r876
$$ -6501 -1951 -137 -8475 -5574 -10303 -5760 -10555 -14605 -19211 -1717 -3445 -4050 4543 3902 -5974
11574e974J719J4872M993j2561q212J3148J3727N049j1084j2932j2705q679J380
$$ -5974 -4255 10617 15610 3049 -5163 7985 21712 26761 15677 2745 -9960 -18639 -17259
11561a7259M120J4143r734j9850J1556J4296J0694L448M056R512r442k2385q750
$$ -17259 -13139 1004 -8730 -28580 -17024 -2728 7966 11414 15470 24982 15540 -6845 -15595
11548a5595L297K5061O908P002J0146l622p999m166o483j0088L738R803J7420
$$ -15595 -12298 12763 19671 26673 36819 33197 25198 21032 14549 4461 8199 18002 35422
11535C5422J5664r681j7524m936j1742m933J905J3808J0903k493j992j3394N352
$$ 35422 51086 41405 23881 18945 7203 2270 4175 17983 28886 26393 24401 11007 16359
11522A6359j543k105m413r76j0093M369k111O904J0396N22q424j2154o718R969
$$ 16359 14816 12711 8298 7322 -2771 1598 -513 6391 16787 17309 8885 -3269 -9987 -18
11508a8J0571m320l807o187K591K807M123J145Q368L276n240m597r140r320R731
$$ -18 10553 6233 2426 -3761 -1170 1637 5760 6905 15273 18549 13309 8712 -428 -9748 -17
11493a7J0975J8165J2699j906J25L163n249N121R699N351j2234j6551j5254j6336
$$ -17 10958 29123 41822 39916 40041 43204 37955 43076 52775 58126 45892 29341 14087 -2249
11479b249n42P036j1002J973J6440J4716J914j8400K874J7543J758j3443j2708
$$ -2249 -2791 4245 -6757 -4784 11656 26372 28286 9886 12760 30303 32061 18618 5910
11466E910j5237L761l479O31l333l365J657Q743O333J1163M709R399j1178k852
$$ 5910 -9327 -5566 -9045 -8414 -11747 -15112 -13455 -4712 1621 12784 17493 26892 15714 12862
11452A2862k047j253N536l253m414m256L533o599j953r33Q275J3246q263l997
$$ 12862 10815 9562 15098 11845 7431 3175 6708 109 -1844 -2777 5498 18744 10481 6484
11438F484M909O236o599l933M407r612j2114p543J4924k954m606J4361J7129j0836
$$ 6484 11393 17629 11030 7097 11504 1892 -10222 -17765 -2841 -5795 -10401 3960 21089 10253
11424A0253o718q742m936J1333N792J4890j6965k1115m643L292r261J1720J3595
$$ 10253 3535 -5207 -10143 1190 6982 21872 4907 -16208 -20851 -17559 -26820 -15100 -1505
11411a505J1322K574j5073L891K863M16j2870j0311M458O49J5549J6167K197P88
$$ -1505 9817 12391 -2682 1209 4072 4488 -8382 -18693 -14235 -13586 1963 18130 20327 21115
11397B1115m025J092j5849j357K615L132K226n514J2496J1844L798j418o97p159
$$ 21115 17090 18182 2333 976 3591 6723 8949 3435 15931 27775 31573 30155 29458 22299
11383B2299k0937J368L762l110J0308P012J177l584j6964j3432J0031Q526J665
$$ 22299 1362 2730 6492 3382 13690 20702 21879 18295 1331 -12101 -2070 6456 8121
11370H121k0361j6795J3638J3384Q29J503J0890N733j0120j2475n161l64N783
$$ 8121 -12240 -29035 -15397 -2013 -1184 319 11209 16942 6822 -5653 -10814 -11178 -5395
11357e395n299R574m571J6076N469n010n408k749j182Q427O901o486k489o629
$$ -5395 -10694 -1120 -5691 10385 15854 10844 5436 2687 1505 9932 16833 10347 7858 1229
11343A229j893P488j0744Q89K890K039N935n395m97Q128N216m956j1478m750q653
$$ 1229 -664 6824 -3920 -3031 -141 1898 7833 2438 1941 10069 15285 10329 -1149 -5899 -14552
11328a4552M85M900l031p413J1586J7737R511q763j7567J3553M357q195P983m419
$$ -14552 -14067 -9167 -12198 -19611 -8025 9712 19223 10460 -7107 6446 10803 2608 10591 6172
11314F172j5576K436m821j970l698k304m749J502J2705L617m126R224J2716p269
$$ 6172 -9404 -6968 -11789 -13759 -17457 -19761 -24510 -23008 -10303 -6686 -10812 -1588 11128 3859
11300C859K675o133j1248L292M858r820K892O478J9686M724j7200j4177J0141
$$ 3859 6534 401 -10847 -7555 -2697 -12517 -9625 -3147 16539 21263 4063 -10114 27
11287B7R566n165o454K05M642K107N201j378p437N64R367N94k985Q228R947J133
$$ 27 9593 4428 -2026 -1821 2821 4928 10129 8751 1314 1878 11245 11839 8854 17082 27029 28162
11271B8162J2411L0685J2780J7987k657j0583j0883r901j7719j7295j5678j3215
$$ 28162 40573 71258 84038 102025 99368 88785 77902 68001 50282 32987 17309 4094
11259D094q834L294J2072l115l598n774L601l469J0953K5703J0826r988j9227
$$ 4094 -4740 -1446 10626 7511 3913 -1861 1740 -1729 9224 34927 45753 35765 16538
11246A6538k533J040k242k719M20Q437q62J1962j3226r752O690j4075J638Q74
$$ 16538 14005 15045 12803 10084 10504 18941 18079 30041 16815 7063 13753 -322 1316 2190
11232B190m484R962L122j114j8503K174J2872P273j931m909N26O292k757M713
$$ 2190 -2294 7668 10790 9676 -8827 -6653 6219 13492 11561 6652 7178 13470 10713 15426
11218A5426n812J162r352k852m634o34L445L251O852L489l60o116j3745r763k935
$$ 15426 9614 10776 1424 -1428 -6062 -6696 -3251 0 6852 10341 9981 3865 -9880 -19643 -22578
11203b2578o345L740j600l251J2659P988K127N77J111N391P597K905q12j4607
$$ -22578 -28923 -25183 -26783 -30034 -17375 -9387 -7260 -6683 -5572 -181 7416 10321 9509 -5098
11189e098o676l808j675j0984q241K529O400R148J2364J3233j395l289n783R359
$$ -5098 -11774 -15582 -17257 -28241 -36482 -33953 -27553 -18405 -6041 7192 5797 2508 -3275 6084
11175F084m217K983M540J676J6844K2434J6395J3755K0948K961p193J733J4207
$$ 6084 1867 4850 9390 11066 27910 50344 66739 80494 101442 104403 97210 98943 113150
11162A13150r271l5196l1093M236l780p865l386p52m382m364p264j2787J718r68
$$ 113150 103879 68683 37590 41826 38046 30181 26795 26043 21661 17297 10033 -2754 -1036 -2004
11148b004j3172k935m297L547J0633J1199k207j4839J837J9466J2586L070m463
$$ -2004 -15176 -18111 -22408 -18861 -8228 2971 764 -14075 -12238 7228 19814 22884 18421
11135A8421k207o494J1582m482j5836j165R309P387n220r163Q720j7800k889J496
$$ 18421 16214 9720 21302 16820 984 -181 9128 16515 11295 2132 10852 -6948 -9837 -8341
11121h341Q080p736L022P139k916l799o437j8091Q347J2948J2471Q222p424j7125
$$ -8341 -261 -7997 -4975 2164 -752 -4551 -10988 -29079 -20732 -7784 4687 12909 5485 -11640
11107a1640m231L096J5103Q673n339l981J6892j008J4704j5411k1763L462r331
$$ -11640 -15871 -12775 2328 11001 5662 1681 18573 17565 32269 16858 -4905 -1443 -10774
11094a0774N950M369J030J2146J8129k08j0611m385j0262J262n48m276N583R32
$$ -10774 -4824 -455 575 12721 30850 30642 20031 15646 5384 6646 6098 1822 7405 8337
11080H337L498m813j3741n569n340o894P302Q922Q205o023j4497M839K3552K350
$$ 8337 11835 7022 -6719 -12288 -17628 -24522 -17220 -8298 -93 -6116 -20613 -15774 7778 10128
11066A0128n738n95o15j244P066q062j415L319o30J2957q97q34m751p599j2055
$$ 10128 4390 3795 3180 1936 9002 940 -475 2844 2214 15171 14274 13440 8689 1090 -10965
11051a0965n590n84n31R033O367J1603P241O249o627J4215o553k0950m463L826
$$ -10965 -16555 -17139 -17670 -8637 -2270 9333 16574 22823 16196 30411 23858 2908 -1555 2271
11037B271P266K797j5750J212Q642m091o909j5526m987J2300n346p608Q633R010
$$ 2271 9537 12334 -3416 -2204 6438 2347 -4562 -20088 -25075 -12775 -18121 -25729 -17096 -8086
11023h086Q758J77J445L430j1252K917K015M123m3J2252J1508l40k979p039k407
$$ -8086 672 849 2294 5724 -5528 -2611 -596 3527 3484 15736 27244 26904 23925 16886 14479
11008A4479q363J900K90k419j2773j6961l38P626P844r231R102J5435l666j2921
$$ 14479 6116 8016 8306 5887 -6886 -23847 -24185 -16559 -8715 -17946 -8844 6591 2925 -9996
10994i996K78Q523n825P35O996m544n226J0686J3601o546P02R065N600q815k0773
$$ -9996 -9718 -1195 -7020 -6285 711 -3833 -9059 1627 15228 8682 9384 18449 24049 15234 -5539
10979e539p626J3436L351l984l67l452K2356R332j904o942P278N468j2104q667
$$ -5539 -13165 271 3622 -362 -729 -4181 18175 27507 25603 18661 25939 31407 19303 10636
10965A0636r500j7692J6898j931k746L300j696r209M916n58O707J3324k584j8664
$$ 10636 1136 -16556 342 -1589 -4335 -1035 -2731 -11940 -7024 -7582 -875 12449 9865 -8799
10951h799j0364P559J1288O928j31j566Q7P425l7N693m08n590l565M710m015p521
$$ -8799 -19163 -11604 -316 6612 6481 4915 5002 12427 12390 18083 17675 12085 8520 13230 9215 1694
10935A694j989jp412Q290O73M789k908j1015J415J0915K093n085J6272l751j5247
$$ 1694 -295 -296 -7708 582 1255 6044 3136 -7879 -6464 4451 6544 1459 17731 13980 -1267
10920a267l70O064O522O118L964l912j9038m885n778J762K406j1196p962J5389
$$ -1267 -1637 4427 10949 17067 21031 17119 -1919 -6804 -12582 -10820 -8414 -19610 -27572 -12183
10906a2183P613P765J3369L845M59l890J822j5583j3331l275J2972J2341J1458
$$ -12183 -4570 3195 16564 20409 20868 16978 18800 3217 -10114 -13389 -417 11924 23382
10893B3382N46q383r134j8868L435J8581n284r374k661J6268O575j167j4175J526
$$ 23382 23928 15545 6411 -12457 -9022 9559 4275 -5099 -7760 8508 15083 13916 -259 1267
10879A267J662P381J0185M367j8757k0225R44N159J1319L929o634M920M667m704
$$ 1267 2929 10310 20495 24862 6105 -14120 -13176 -8017 3302 7231 597 5517 10184 5480
10865E480K083J3749P159j2027l819j528J593K505k2999r268J6107K679Q662K746
$$ 5480 7563 21312 28471 16444 12625 11097 12690 15195 -7804 -17072 -965 1714 10376 13122
10851A3122n952m782K095j9649p332K0119J3262N379M183j4084m159Q57O479J356
$$ 13122 7170 2388 4483 -15166 -22498 -2379 10883 16262 20445 6361 2202 3059 9538 10894
10837A0894J2870Q048j7300k2138J75Q41n492P252N94m063m249J3113L49j1031
$$ 10894 23764 31812 14512 -7626 -7451 -6610 -12102 -4850 -4256 -8319 -12568 545 894 -10137
10823a0137L103J878o989K174q67J2268K9619N574q867J584N60p649j3927j9944
$$ -10137 -7034 -5156 -12145 -9971 -10838 1430 31049 36623 27756 29340 29900 22251 8324 -11620
10809a1620P752J1712N735k662n772j1017j1514M429j1946k437K5087N44j3822
$$ -11620 -3868 7844 13579 10917 5145 -5872 -17386 -12957 -24903 -27340 -2253 -1709 -15531
10796a5531N824J518r860K175N997q137Q499J0623J373m101r227P010J0635r040
$$ -15531 -9707 -8189 -18049 -15874 -9877 -18014 -9515 1108 2481 -1620 -10847 -3837 6798 -2242
10782b242J300J1880j6658j0122r13M038O172J3258J6696j336k10j0406N203m60
$$ -2242 -942 10938 -5720 -15842 -16755 -12717 -6545 6713 23409 22073 21863 11457 16660 16200
10768A6200p978Q094p580j0077j402K092p567j0933p271Q413Q113M978P740N465
$$ 16200 8222 16316 8736 -1341 -2743 -651 -8218 -19151 -26422 -18009 -9896 -4918 2822 8287
10754H287m842L168m135M032M572k007J296n010j0157K63p771J8q6R634J9591
$$ 8287 3445 6613 2478 6510 11082 9075 10371 5361 -4796 -4533 -12304 -12286 -12372 -2738 16853
10739A6853l066j1146j0835o787J8044J7506J454K333k772o293J102j862k655
$$ 16853 13787 2641 -8194 -14981 3063 20569 22023 24356 21584 15291 16393 14531 11876
10726A1876J199K544k887j0249l827M02j1161p274k144j066J3070P303M993k552
$$ 11876 13075 15619 12732 2483 -1344 -942 -12103 -19377 -21521 -22587 -9517 -2214 2779 227
10712B27j1716O638J246M426j189k338j2051m053q802P636n056L813k971R248
$$ 227 -11489 -4851 -3605 821 -368 -2706 -14757 -18810 -27612 -19976 -25032 -21219 -24190 -14942
10698a4942J6157L813L763j343J530J287o363n426R884j20m870j1007K580k500
$$ -14942 1215 5028 8791 7448 8978 10265 3902 -1524 8360 8240 3370 -7637 -5057 -7557
10684g557q922k183O77l988Q684J9917N803j614m936j405M183n512J0236k692
$$ -7557 -16479 -18662 -17985 -21973 -13289 6628 12431 10817 5881 4476 8659 3147 13383 10691
10670A0691j1399q086j2229j697J4893J6290l100j6047p707J826J8859J8843m428
$$ 10691 -708 -8794 -21023 -22720 -7827 8463 5363 -10684 -18391 -16565 2294 21137 16709
10657A6709j0480J895q632J2333M586r399p043N267J5494j652n886J5605n298
$$ 16709 6229 8124 -508 11825 16411 7012 -31 5236 20730 19078 13192 28797 23499
10644B3499j6205j0172n50j3394O73J8551M515P455j0843j1616j4463O238J3578
$$ 23499 7294 -2878 -3428 -16822 -16149 2402 6917 14372 3529 -8087 -22550 -16312 -2734
10631b734O794q836j084K255j830q74o583q215R018M909J0194K835k042j2991
$$ -2734 4060 -4776 -5860 -3605 -5435 -6309 -12892 -21107 -12089 -7180 3014 5849 3807 -9184
10617i184r796J5920K17k696o08J857k016N564N703m022j2535j494N338L263J7037
$$ -9184 -18980 -3060 -2843 -5539 -6147 -4290 -6306 -742 4961 939 -11596 -13090 -7752 -4489 12548
10602A2548p429Q29L779k60n293p232J2164o889l370K782j652J1199M214o73L086
$$ 12548 5119 5948 9727 9467 4174 -3058 9106 2217 -1153 1629 -23 11176 15390 14717 17803
10587A7803P648L852m691M756j0117j2154l076M44L099Q081O234j0686M450N139
$$ 17803 25451 29303 24612 29368 19251 7097 4021 4465 7564 15645 21879 11193 15643 20782
10573B0782j4997l223M351J1420J0108R219J8650N390k2029j1697q000N19j883
$$ 20782 5785 2562 6913 18333 28441 37660 56310 61700 39671 27974 19974 20493 18610
10560A8610m721n687P46j7241r349N778J91O362P016j3201j2189J3336K0769J1645
$$ 18610 13889 8202 8948 -8293 -17642 -11864 -11673 -5311 1705 -11496 -23685 -10349 10420 22065
10546B2065l801j0227O068m825R09L594K762J379k105j1229Q032j710r55l342
$$ 22065 18264 8037 14105 9280 10189 13783 16545 17924 15819 4590 12622 10912 9957 6615
10532F615K908O08l518n938p925M895M600l10m546j1588J2273K0565p525j1245
$$ 6615 9523 10131 6613 675 -7250 -2355 2245 1935 -2611 -14199 -1926 18639 11114 -131
10518a31p361J314J5292n647o725J711l814j663k23n325M236K383K1771J5265
$$ -131 -7492 -6178 9114 3467 -3258 -1547 -5361 -7024 -7247 -12572 -8336 -5953 15818 31083
10504C1083m494q293o047j385m910j2692o641N23J6893L241p161j1564r559Q571
$$ 31083 26589 18296 12249 10864 5954 -6738 -13379 -12856 4037 7278 117 -11447 -21006 -12435
10490a2435J5641J0372R403o931J9633P433n742r477k39n176j3659J0624M081
$$ -12435 3206 13578 22981 16050 35683 43116 37374 27897 27658 22482 8823 19447 23528
10477B3528L51j1422q80m022K0016l899o613m348m649q546k858O046J775P332
$$ 23528 23879 12457 11577 7555 27571 23672 17059 12711 8062 -484 -3342 2704 4479 11811
10463A1811m768J3273M212m655m273r38j8928j3394J152O073m560l70O04M299
$$ 11811 7043 20316 24528 19873 15600 14662 -4266 -17660 -16508 -10435 -14995 -15365 -14761 -10462
10449a0462L697J6153K0841O982o885k23j6259p124l589J96L768p418K945P098
$$ -10462 -6765 9388 30229 37211 30326 30103 13844 6720 3131 3327 7095 -323 2622 9720
10435I720m918l154L61l289o636R872P359N646J275o113l287J0649N632j7087
$$ 9720 4802 1648 2009 -1280 -7916 1956 9315 14961 16236 10123 6836 17485 23117 6030
10421F030j4614L239Q003m57M087J6755N241k0365j0620k108m93j1235J552o538
$$ 6030 -8584 -5345 2658 2201 6288 23043 28284 7919 -2701 -4809 -5302 -16537 -14985 -21523
10407b1523M373O60m411J3864O256o92J886J888Q765j702K159k274O013J3635
$$ -21523 -17150 -16490 -20901 -7037 -781 -1473 413 2301 11066 9364 11523 9249 15262 28897
10393B8897L171k3045j7821k546O106j116J5858L018j3122p602j40N771R533M043
$$ 28897 32068 9023 -8798 -11344 -5238 -6354 9504 12522 -600 -8202 -8342 -2571 6962 11005
10379A1005j2539j2119R75N974n676l490J463l180J8532M304n955m499K995M252
$$ 11005 -1534 -13653 -12678 -6704 -12380 -15870 -14407 -17587 945 5249 -706 -5205 -2210 2042
10365B042j080J1157r1K665l786j1860j4335J0570M084J857R337j2207l377J0448
$$ 2042 962 12119 12028 14693 10907 -953 -15288 -4718 -634 1223 10560 -1647 -5024 5424
10351E424q44j3895j1235R014J7177Q601J4190J558p840j2334n483Q528O624M336
$$ 5424 4580 -9315 -20550 -11536 5641 14242 28432 29990 22150 9816 4333 12861 19485 23821
10337B3821r79k257r953O837m725m177L614P891j4553n69K7797K4780K8298J8389
$$ 23821 22842 20585 10632 17469 12744 8567 12181 20072 5519 4950 32747 57527 85825 104214
10323A04214K052k8356j6555k0367n381j0731j882J4022O174L300R622N54j7347
$$ 104214 106266 77910 61355 40988 35607 24876 22994 37016 43190 46490 56112 56666 39319
10310C9319j0676p372j8902r22m150J570P303J0690J2552L384q780m110n7k374
$$ 39319 28643 21271 2369 1447 -2703 -1133 6170 16860 29412 32796 24016 19906 19849 17475
10296A7475n079j5959j4257N143J9257J0711O134N207j1335q36j0870L889j059
$$ 17475 12396 -3563 -17820 -12677 6580 17291 23425 28632 17297 16461 5591 9480 8421
10283H421J6717j4029o54N695N29q299p726J6954P258O069M044n168r930J4064
$$ 8421 25138 11109 10455 16150 16679 8380 654 17608 24866 30935 34979 29811 19881 33945
10269C3945J2703O329R722J7655L6437M0515J6461P169J9793j621k5622l1383
$$ 33945 46648 52977 62699 80354 116791 157306 173767 180936 200729 199108 173486 142103
10257A42103l549k0733j4722j9428r820r566j4549n45j0243j6265N797J816o004
$$ 142103 138554 117821 103099 83671 73851 64285 49736 49191 38948 22683 28480 30296 24292
10244B4292o335q294j0504N982J3361M356J0840O129J0523n122q125q720j1465
$$ 24292 17957 9663 -841 5141 18502 22858 33698 39827 50350 45228 37103 28383 16918
10231A6918p483n407n750J1344K628j843j739L255Q354R223q991j4301j2645q699
$$ 16918 9435 4028 -1722 9622 12250 10407 8668 11923 20277 29500 20509 6208 -6437 -15136
10217a5136L018p75N928P799M844n514J0444J4591J0493l783j055p549p791N971
$$ -15136 -12118 -12893 -6965 834 5678 164 10608 25199 35692 31909 30854 23305 15514 21485
10203B1485L628J5491J5010P872O056J7917P237J7766K3381N057o775J411k3715
$$ 21485 25113 40604 55614 63486 69542 87459 94696 112462 135843 140900 134125 135536 111821
10190A11821k2120j2371j6918l608j986M007j786p957p416n610k226K732j83o291
$$ 111821 89701 77330 60412 56804 54818 58825 57039 49082 41666 36056 33830 36562 36379 30088
10176C0088j1788j235q132m115J4061R979J045m453L534K708j0321m092j999k572
$$ 30088 18300 17065 8933 4818 18879 28858 29903 25450 28984 31692 21371 17279 15280 12708
10162A2708J279k2561r354k923R0R113J21k116K96L597k69j84R910J2992P194
$$ 12708 13987 -8574 -17928 -20851 -20761 -11648 -11527 -13643 -13347 -9750 -10019 -10203 -293 12699 19893
10147A9893p767p729o855j5086l667J132K074L029J0993J164k449K589R733J1946
$$ 19893 12126 4397 -2458 -17544 -21211 -20079 -18005 -14976 -3983 -2819 -5268 -2679 7054 19000
10133A9000j3709p849Q881q39l750R086j393j0162r154o080Q7q273r609N654J3467
$$ 19000 5291 -2558 6323 5484 1734 10820 9427 -735 -9889 -15969 -15882 -24155 -33764 -28110 -14643
10118a4643N555P628O178K215N216Q79j3318p931N689R564j3722j0549P520Q640
$$ -14643 -9088 -1460 4718 6933 12149 13028 -290 -8221 -2532 7032 -6690 -17239 -9719 -1079
10104a079O254M49p14L484j7437j4161K859J5809P196N207K911l262n716j7488
$$ -1079 5175 5624 4910 8394 -9043 -23204 -20345 -4536 2660 7867 10778 7516 1800 -15688
10090a5688L63R02K118P7K333J6678Q583o265J158R005K47J449r187r071m106
$$ -15688 -15325 -14423 -12305 -12228 -9895 6783 15366 9101 10259 19264 19511 20960 11773 2702 -1404
10075a404l876l231o801L064n511J0902J7134k731O511K15K696j1979N20k059
$$ -1404 -5280 -8511 -15312 -12248 -17759 -6857 10277 7546 14057 14272 16968 4989 5509 3450
10061C450j0109J7083J0611j1171j2892q75J4936L950r801n182Q377P891J56J817
$$ 3450 -6659 10424 21035 9864 -3028 -3903 11033 14983 5182 0 8377 16268 16424 18241
10047A8241M662m3M453p093l062J0307P897k728j1776j6766k507j1833J8502J8886
$$ 18241 22903 22860 27313 20220 17158 27465 35362 32634 20858 4092 1585 -10248 8254 27140
10033B7140p253j5757k280O003J642j201j1799j2465j830L935J2229O206r131
$$ 27140 19887 4130 1850 7853 9495 8294 -3505 -15970 -17800 -13865 -1636 4570 -4561
10020d561l016J747J211J6007k326O217j0081k772M286P599L708j1952p479j3784
$$ -4561 -7577 -5830 -4619 11388 9062 15279 5198 2426 6712 14311 18019 6067 -1412 -15196
10006a5196J1754L5109J1518k3521k6414p304M626L956N061M020r81j1710j116
$$ -15196 -3442 31667 43185 19664 -6750 -14054 -9428 -5472 -411 3609 2628 -9082 -10198
9993a0198J5865N883m173r35j0264p57j6939l718K943N303o10r243l7J7322J9652
$$ -10198 5667 11550 7377 6442 -3822 -4579 -21518 -25236 -22293 -16990 -17600 -26843 -26880 -9558 10094
9978A0094K152j0015m577N892P925J1199k601q618n446j4475r148k796M544J348
$$ 10094 12246 2231 -2346 3546 11471 22670 20069 11451 6005 -8470 -17618 -20414 -15870 -14522
9964a4522P917m42P651o88p446J7404K4810l873l591L403m25j6931Q25O406J971
$$ -14522 -6605 -7047 604 -84 -7530 9874 34684 30811 27220 30623 30198 13267 14092 20498 22469
9949B2469j2379j3572J4004L831j1985o566j0628R261O143j3716M411J2745J434
$$ 22469 10090 -3482 10522 14353 2368 -4198 -14826 -5565 578 -13138 -8727 4018 5452
9936E452j985k0425n217m54P672R944O672k89j189k73k676k02l827j886J98J1751
$$ 5452 3467 -16958 -22175 -22629 -14957 -5013 1659 1370 181 -92 -2768 -2970 -6797 -8683 -8485 3266
9920C266R60J0316O659j2293j4952k906j95J6340L378K651j1510Q889J3999J1188
$$ 3266 4226 14542 21201 8908 -6044 -8950 -9145 7195 10573 13224 1714 10603 24602 35790
9906C5790j3840j4770o58q791P336K796o556q335J0229P72L765p536j7500j1404
$$ 35790 21950 7180 6522 -2269 5067 7863 1307 -7028 3201 3973 7738 202 -17298 -28702
9892b8702J6223K1944J0032j581O304M052k012j3267m139j2959O446J5901P508
$$ -28702 -12479 9465 19497 17916 24220 28272 26260 12993 8854 -4105 2341 18242 25750
9879B5750L4M08j925r907p908q568p454q152k618j013J2072P260K931q997k938
$$ 25750 25784 26192 24267 14360 6452 -2116 -9570 -17722 -20340 -21353 -9281 -2021 910 -8087 -11025
9864a1025J214n577Q443O815K524o091q324k19J2926n41j0915L298P035M512J459
$$ -11025 -9811 -15388 -6945 -130 2394 -3697 -12021 -12240 686 145 -10770 -7472 -437 4075 5534
9849E534J2717l646r771j6692O841j873R199O427M510K290Q707r386J3880J935
$$ 5534 18251 14605 4834 -11858 -5017 -6890 2309 8736 13246 15536 24243 14857 28737 30672
9835C0672j6706n15J4383q006r212j1947l531P626J880J1174J751j945j1217Q40
$$ 30672 13966 13451 27834 19828 10616 -1331 -4862 2764 4644 15818 17569 15624 4407 5247
9821E247J7505J4106K554M760q188m825j0611q694p464p653K845N404J3290O907
$$ 5247 22752 36858 39412 44172 35984 31159 20548 11854 4390 -3263 -418 4986 18276 25183
9807B5183j4522m904j4058R731J7837p891J225N418P79J1219O167j0287m505N83
$$ 25183 10661 5757 -8301 1430 19267 11376 12601 18019 18798 30017 36184 25897 21392 21975
9793B1975j1108o698N735J8295r307r924K830P629P594m774L076l671j0934M437
$$ 21975 10867 4169 9904 28199 18892 8968 11798 19427 27021 22247 25323 21652 10718 15155
9779A5155k853L683R052O746p124q683o567R49j4450p082Q905n020J0204P397
$$ 15155 12302 15985 25037 31783 24659 15976 9409 10358 -4092 -11174 -2269 -7289 2915 10312
9765A0312K845J0935J448r119M962m060q110j983j4654K361J9842O432Q423K691
$$ 10312 13157 24092 25540 16421 21383 17323 9213 7230 -7424 -5063 14779 21211 29634 32325
9751C2325j2620j046J929L187n314N794O796L434K10j6171r843L249O571l700
$$ 32325 19705 18659 20588 23775 18461 24255 31051 34485 34695 18524 8681 11930 18501 14801
9737A4801k403R893m331j3160K406J6596P471P486o810l097M915n028J572m652
$$ 14801 12398 22291 17960 4800 7206 23802 31273 38759 31949 28852 33767 28739 30311 25659
9723B5659L803L378o224L011O444J2526R477j1599k0165j5346K452J3037N153
$$ 25659 29462 32840 26616 29627 36071 48597 58074 46475 26310 10964 13416 26453 31606
9710C1606Q036Q87K625L731j027j0220j6216r283l429L102P626m730q519n435
$$ 31606 39642 40529 43154 46885 45858 35638 19422 10139 6710 9812 17438 12708 4189 -1246
9696a246r271l288q24J3579J0787J5715k485k020R06k971m645q057n05O711j811
$$ -1246 -10517 -13805 -14629 -1050 9737 25452 22967 20947 21853 18882 14237 6180 5675 12386 10575
9681A0575P49M524R809n738p383j3061k265K0951J616q051M532J3189P059L044
$$ 10575 11324 15848 25657 19919 12536 -525 -2790 18161 19777 11726 16258 29447 36506 39550
9667C9550j194o729q822r483m9l902p533L965J403j758O151J4608L823j504O03
$$ 39550 38356 31627 22805 13322 13273 9371 1838 5803 7206 5448 11599 26207 30030 28526 29129
9652B9129m259j0923l970K750J4097K243m067o317J213O073j1902j231N244L930
$$ 29129 24870 13947 9977 12727 26824 29067 25000 18683 19896 25969 14067 12836 18080 22010
9638B2010J514q860j0700L834P168J130P675k769n719N883O642L632L212j83j2115
$$ 22010 23524 14664 3964 7798 14966 16096 23771 21002 15283 21166 27808 31440 34652 34469 22354
9623B2354j0256k302K459o807p791M52J0543K265K547J2022J2161K56N195p027
$$ 22354 12098 9796 12255 5448 -2343 -1891 8652 10917 13464 25486 37647 37903 43098 36071
9609C6071n290p498P459n67j1213L87N234K981j046o448R335Q326o562q413l513
$$ 36071 30781 23283 30742 30175 18962 19349 24583 27564 26518 20070 29405 37731 31169 22756 19243
9594A9243J6832J6840o065j4988j4566N318J1846K361o299q400l254J7436N377
$$ 19243 36075 52915 46850 31862 17296 22614 34460 36821 30522 22122 18868 36304 41681
9581D1681p444j3592j079j2303l916R575J1682J1276N011L088m095m332q319k935
$$ 41681 34237 20645 19566 7263 3347 12922 24604 35880 40891 43979 39884 35552 27233 24298
9567B4298J3171K089P566j049l046J5947L056j9768n185L450J0688J809j1282
$$ 24298 37469 39558 47124 46075 43029 58976 62032 42264 37079 40529 51217 53026 41744
9554D1744P585J0456l764l625P828M010j0165j1341j6571o276Q246M870M780P094
$$ 41744 49329 59785 56021 52396 60224 64234 54069 42728 26157 19881 28127 32997 37777 44871
9540D4871K427n39o896J2262n3k2133M051J4382l822j6236n614J383r94L159J7583
$$ 44871 47298 46759 39863 52125 52072 29939 33990 48372 44550 28314 22700 24083 23089 26248 43831
9525D3831j151K223K060L044Q792k313k856j1282j2641J3008J0403J5717m738
$$ 43831 42680 44903 46963 50007 58799 56486 53630 42348 29707 42715 53118 68835 64097
9512F4097k0760K257O633q358j652n968L38R944J2433O341J986P041J964r721
$$ 64097 43337 45594 52227 43869 42217 36249 36587 46531 58964 65305 67291 74332 76296 66575
9498F6575j4959m272N105J1043Q205p656m305K371J0069q087j0462j0635M320
$$ 66575 51616 47344 52449 63492 71697 64041 59736 62107 72176 64089 53627 42992 47312
9485D7312l966Q425J3594P399N872K67p957j7181J363K0585O300K376J469j4485
$$ 47312 43346 51771 65365 72764 78636 78903 70946 53765 55128 75713 82013 84389 85858 71373
9471G1373n216J2108J0710j398k487Q08n046k991L386J5645J0141j614q774M122
$$ 71373 66157 78265 88975 87577 85090 85898 80852 77861 81247 96892 107033 105419 96645 100767
9457A00767j243K44J5641K046m250J803r589n409P478N787M130J4157J666m926
$$ 100767 99524 99768 115409 117455 113205 115008 105419 100010 107488 113275 117405 131562 133228 128302
9443A28302m695M645J8161M097r351j5446M141L455Q096J2586K962J400N830j407
$$ 128302 123607 128252 146413 150510 141159 125713 129854 133309 141405 153991 156953 158353 164183 162776
9429A62776R807Q916P172J821R10O777O512J4144K5277J4628Q679K334P467N277
$$ 162776 172583 181499 188671 190492 191402 198179 204691 218835 244112 258740 267419 269753 277220 282497
9415B82497J2231P677J0437J3377K5213K4249J0425L4064J8738P926L1465L0804
$$ 282497 294728 302405 312842 326219 351432 375681 386106 420170 438908 446834 478299 509103
9403E09103K5276R695J9243L5144J8759K0781M1202K6246K2534L9308M8933M5742
$$ 509103 534379 544074 563317 598461 617220 638001 679203 705449 727983 767291 816224 861966
9391H61966L8581L5321M6572O6162O0972N3820N1680N5414M8463N0135M9700N4347
$$ 861966 900547 935868 982440 1048602 1109574 1163394 1215074 1270488 1318951 1369086 1418786 1473133
9379A473133L6796K4837K5046J6068N354j2595j6099j7557k0684k5563k5926k8695
$$ 1473133 1509929 1534766 1559812 1575880 1581234 1568639 1552540 1534983 1514299 1488736 1462810 1434115
9367A434115l2857m1966m3791o5850o4903n5996l9129n0405n7243n5929n4846
$$ 1434115 1401258 1359292 1315501 1249651 1184748 1128752 1089623 1039218 981975 926046 871200
9356H71200l7492l3160m9409m1915l5122j7981j9473k5637k7156k4512j8993k1919
$$ 871200 833708 800548 751139 709224 674102 656121 636648 611011 583855 559343 540350 518431
9344E18431k3785j6348j8445j1119j0914j5095j9415j7088k3018r357j3293j7626
$$ 518431 494646 478298 459853 448734 437820 422725 403310 386222 363204 353847 340554 322928
9332C22928j4661j2279L008K222j5586o674j7696j3426l688k2778r880J184J1956
$$ 322928 308267 295988 298996 301218 285632 278958 261262 247836 244148 221370 211490 212674 224630
9319B24630j397n885L597p490o508K109o00o43k840O526k134K263r769p5k933
$$ 224630 223233 217348 220945 213455 206947 209056 208456 207813 204973 211499 209365 211628 201859 201784 198851
9304A98851k0413j2938k700o638l601k804L316Q782q917j0042n047r570J6563
$$ 198851 178438 165500 162800 156162 152561 149757 153073 161855 152938 142896 137849 128279 144842
9291A44842P566o385N367K041J1386j2932j5035q093l526j5064o278O230p627
$$ 144842 152408 146023 151390 153431 164817 151885 136850 128757 125231 110167 103889 110119 102492
9278A02492N278J3650O006P147j989j5586r967p532NJ3918o82J936j0959k220
$$ 102492 107770 121420 127426 134573 132584 116998 107031 99499 99504 113422 112740 114676 103717 101497
9264A01497L460N353L947k187k2475n400N015P5Q835K877m12o06p342J086J4570
$$ 101497 104957 110310 114257 112070 89595 84195 89210 89285 98120 100997 100585 99979 92637 93723 108293
9249A08293p229j3731m221J229Q339R083j1566p145Q321N088m381K124J836k049
$$ 108293 101064 87333 83112 84341 92680 101763 90197 83052 91373 96461 92080 94204 96040 93991
9235I3991P57o288p051j1545J6069Q443M41p666j191j093j1756j416R1l558J2394
$$ 93991 94748 88460 81409 69864 85933 94376 94817 87151 85960 84867 73111 71695 71786 68228 80622
9220H0622J2203p034N483O770q902p693j4968M897J1827M222j2585J1178P505
$$ 80622 92825 85791 91274 98044 89142 81449 66481 71378 83205 87427 74842 86020 93525
9207I3525r07j5484j5171o457m327j424m040l282J2385J1979m08M50O107k330
$$ 93525 92618 77134 61963 55506 51179 49755 45715 42433 54818 66797 66389 66839 72946 70616
9193G0616Q43O011n08j1876j0221N23q85P348J5782n451j5301Q283Q781k445q548
$$ 70616 71459 77470 76962 65086 54865 55388 54503 61851 77633 72182 56881 65164 73945 71500 62952
9178F2952k394L248M914M092k165k284o3N763j173J92m122N96j2953j5122J2610
$$ 62952 60558 63806 68720 72812 70647 68363 68300 74063 72890 73082 68960 69556 56603 41481 54091
9163E4091J9702J2484r125R83O441m317o792Q536M230L146j1516q563k345p82
$$ 54091 73793 86277 77152 78135 84576 80259 73467 82003 86233 89379 77863 69300 66955 66173
9149F6173K28k0090p827o350J423P807L652o145J5261K940J4794J9918M085p556
$$ 66173 66401 46311 38484 32134 33557 41364 45016 38871 54132 57072 71866 91784 95869 88313
9135H8313j7662J815k996l179l09R608K388L186j39p927j5935k315j897J628J1538
$$ 88313 70651 72466 69470 66291 65982 75590 77978 81164 81025 73098 57163 54848 52951 54579 66117
9120F6117K965J0405J3716J0136l024k9083l585o147p010P877O580m67L307J17
$$ 66117 69082 79487 93203 103339 100315 71232 67647 61500 54490 62367 68947 68480 71787 71904
9106G1904j1234r859k07M004J2179J615r476l225J0123j5987l085J2406O17R724
$$ 71904 60670 50811 50604 54608 66787 68402 58926 55701 65824 49837 46752 59158 59775 69499
9092F9499n551r795N245k585J212L245L810K827K100Q043r34n116k549M174q934
$$ 69499 63948 54153 59398 56813 58025 61270 65080 67907 70007 78050 77116 72000 69451 73625 64691
9077F4691r831o130K090J9537J4752j0492o294l084Q367M745n876j6265k876O187
$$ 64691 54860 48730 50820 70357 85109 74617 68323 65239 73606 78351 72475 56210 53334 59521
9063E9521J463J2623J452K51j3219j4408j0097p493N464L808J1950J2988o261
$$ 59521 60984 73607 75059 75310 62091 47683 37586 30093 35557 39365 51315 64303 58042
9050E8042o582n203o036L330L1315P467j413O357p029J045P355r299m739p735
$$ 58042 51460 46257 40221 43551 74866 82333 80920 87277 80248 81293 88648 79349 74610 66875
9036F6875r448L7Q299k56N176Q34k0144J09J957J755Q533j1006N50K1002J1824
$$ 66875 57427 57464 65763 65507 70683 71517 51373 51482 53439 55194 63727 52721 53271 74273 86097
9021H6097N660m613j2458K761P726L788M062l942J109j2998k6276L869Q408O040
$$ 86097 91757 87144 74686 77447 85173 88961 93023 89081 90190 77192 50916 54785 63193 69233
9007F9233k688K842P578J689j4875r423J032n987l253J5972J7058Q946J864J3370
$$ 69233 66545 69387 76965 78654 63779 54356 55388 49401 46148 62120 79178 88124 89988 103358
8993A03358J2667r803j838P89L158m330j5649o843R058N25o373q717l058k833
$$ 103358 116025 106222 104384 105173 108331 104001 88352 81509 90567 91092 84719 76002 72944 70111
8979G0111P184J2410P383J9558N73j5563o143N648q811M360k241n256n856n051
$$ 70111 77295 89705 97088 116646 117219 101656 95513 101161 92350 96710 94469 89213 83357 78306
8965G8306q096l979l733M408j073Q751O447k614o887M880O448j393J0798J410
$$ 78306 70210 66231 62498 66906 65833 74584 81031 78417 71530 76410 82858 81465 92263 93673
8951I3673q157P502J0189n832j4401j2197j633J21N571l450j2972O605M546J956
$$ 93673 85516 93018 103207 97375 82974 70777 69144 69265 74836 71386 58414 65019 69565 71521
8937G1521K148m158n184j6876j4277K431J5818R759K8j5888n138J1223J3007o195
$$ 71521 73669 69511 64327 47451 33174 35605 51423 61182 61210 45322 40184 51407 64414 58219
8923E8219p284N254M347m81K562N726o824j4806M799l364J796K336K691J5856
$$ 58219 50935 56189 60536 60055 62617 68343 61519 46713 51512 48148 49944 52280 54971 70827
8909G0827M610o633R977p88j1063O16J3440J2349r748l013m22j556j3425j7990
$$ 70827 75437 68804 78781 77993 66930 67546 80986 93335 83587 80574 80152 78596 65171 47181
8895D7181P167K2917J00q988m726k471M450P08K54K0453J8044j089k864r640n901
$$ 47181 54348 77265 77365 68377 63651 61180 65630 66338 66592 87045 105089 104000 101136 91496 85595
8880H5595L396j531m210J7277P466j8572p618Q570Q268j0768m176M966j3870m604
$$ 85595 88991 87460 83250 100527 107993 89421 81803 90373 98641 87873 83697 88663 74793 70189
8866G0189Q159O218M15O414O94n268J023r995j1998M332N521J0613j6373j5920
$$ 70189 78348 84566 84981 91395 92089 86821 87844 77849 65851 70183 75704 86317 69944 54024
8852E4024l88O07n88N642J9735Q497j2070j6435l230r02O160n683R101K374R984
$$ 54024 53636 54243 53655 59297 79032 87529 75459 59024 55794 54892 61052 55369 64470 66844 76828
8837G6828K176K917O437m428q214N718k075j2478J9137P460p043j6612L96J9240
$$ 76828 79004 81921 88358 83930 75716 81434 79359 66881 86018 93478 86435 69823 70219 89459
8823H9459J6482k757j2065j5168k232j983R101L285P598J227q763J9426Q066K248
$$ 89459 105941 103184 91119 75951 73719 71736 80837 84122 91720 92947 84184 103610 111676 113924
8809A13924p420L180k735j0479j3921J991O817O240L678n898j229M945J336p12
$$ 113924 106504 109684 106949 96470 82549 84540 91357 97597 101275 95377 94148 99093 100429 99717
8795I9717p705j2672N836K140J0199M288r027r902L499N518l21m709o457o753
$$ 99717 92012 79340 85176 87316 97515 101803 92776 82874 86373 91891 91570 86861 80404 73651
8781G3651N954J0732M215j3751j4727J277K408R376K0682k467k2108j0454N863
$$ 73651 79605 90337 94552 80801 66074 67351 69759 79135 99817 97350 75242 64788 70651
8768G0651J8865J754m405n822j4520K542J5090J3463J1358K576j868k5947j2994
$$ 70651 89516 91270 86865 81043 66523 69065 84155 97618 108976 111552 109684 83737 70743
8755G0743O828L1639O276o645L658M342q815Q494O641Q895Q202j40j9068j1690
$$ 70743 77571 109210 115486 108841 112499 116841 108026 116520 123161 132056 140258 140118 121050 109360
8741A09360p729O014P619J9169N944K058j8324j5500K7285J3940O337P611l509
$$ 109360 101631 107645 115264 134433 140377 142435 124111 108611 135896 149836 156173 163784 160275
8728A60275j693n363P869j5024m213N369J127M861J371k567p166j2411q822R425
$$ 160275 158582 153219 161088 146064 141851 147220 148347 153208 154579 152012 144846 132435 123613 133038
8714A33038n216k006K2137J708k571j85J2208K739j871j1820N330l730m690J6275
$$ 133038 127822 125816 147953 149661 147090 146905 159113 161852 159981 148161 153491 149761 145071 161346
8700A61346l911q179L680k718r680J0271M876N323J0993K567K018J468J540N521
$$ 161346 157435 149256 152936 150218 140538 150809 155685 161008 172001 174568 176586 178054 179594 185115
8686A85115L214Q142r938K560J3850L388J624M528n015M823O984O465O690j518
$$ 185115 188329 196471 186533 189093 202943 206331 207955 212483 207468 212291 219275 225740 232430 230912
8672B30912j2224q046l534L135R86O828j1295l1O897J4918r24P974J146m87P585
$$ 230912 218688 210642 207108 210243 211229 218057 206762 206731 213628 228546 227622 235596 236742 236255 243840
8657B43840O723J4704J916r86N992K5047J1995O362J981o983j796L841J4334M328
$$ 243840 250563 265267 267183 266197 272189 297236 309231 315593 317574 310591 308795 312636 326970 331298
8643C31298m032R873N317J9328O663M885K038n051K224J1229Q290J5149K771J3522
$$ 331298 327266 337139 342456 361784 368447 373332 375370 370319 372543 383772 392062 407211 409982 423504
8629D23504K0280K0268K7803L4094L6002L3540L1384M8295L5205L2086L7838M1315
$$ 423504 443784 464052 491855 525949 561951 595491 626875 675170 710375 742461 780299 821614
8617H21614M0408M0697M4915N3847O8134P9838O9819Q7437Q4539P7180O8548O0010
$$ 821614 862022 902719 947634 1001481 1069615 1149453 1219272 1306709 1391248 1468428 1536976 1596986
8605A596986K5996j8296n7806q6938j09236j18588j06772p9704q2514p1747o6846
$$ 1596986 1622982 1604686 1546880 1459942 1350706 1232118 1125346 1045642 963128 891381 824535
8594H24535o8759n3015n5472n8277k8074l4623k4683k929k4137k7188n088K139
$$ 824535 755776 702761 647289 589012 560938 526315 501632 498703 474566 447378 442290 444429
8582D44429N254m696k7320j1488l153m329j8691k3547j6920O02j2497j6207p546
$$ 444429 449683 444987 417667 406179 403026 398697 380006 356459 339539 340141 327644 311437 303891
8569C03891Q089J270r625m598r48L918j7910q676m749o405j2916Q11J3972n137
$$ 303891 311980 313250 303625 299027 298079 301997 284087 275411 270662 264257 251341 252152 266124 260987
8555B60987k3899j0310K388l887L932P258J287k0412k078M826M503r338o800o112
$$ 260987 237088 226778 229166 225279 229211 236469 237756 217344 215266 220092 224595 215257 208457 202345
8541B02345j1871p331K358J1424k361j7530J842j573l932l896J2527J0833Q376
$$ 202345 190474 183143 185501 196925 194564 177034 178876 177303 173371 169475 182002 192835 201211
8528B01211j27k1809q969q97j5471j2183J3180N576L945N256p257q433k718Q275
$$ 201211 201084 179275 170306 169409 153938 141755 154935 160511 164456 169712 162455 154022 151304 159579
8514A59579L818j5562k0528Q608Q66L739Q864R975R368N187q319j3568j828j0325
$$ 159579 163397 147835 127307 135915 136781 140520 149384 159359 168727 173914 165595 152027 150199 139874
8500A39874j5266P207N155l025R421N119j0248P105N648l862l303m850j3890j0746
$$ 139874 124608 131815 136970 133945 143366 148485 138237 145342 150990 147128 143825 138975 125085 114339
8486A14339o70m615J1579K729O341Q335j5927o652j164J919l034K471L5J3353
$$ 114339 113669 109054 120633 123362 129703 138038 122111 115459 114295 116214 113180 115651 115686 129039
8472A29039M41o356k349l75P410Q145k116m291M461j1122l452M087k39j4075r07
$$ 129039 129480 123124 120775 120400 127810 135955 133839 129548 134009 122887 119435 123522 123283 109208 108301
8457A08301q162q377k347K519m374N583P541J490l348J0843N694j081j5304p696
$$ 108301 100139 91762 89415 91934 87560 93143 100684 102174 98826 109669 115363 114282 98978 91282
8443I1282J8705r332R56J357m917Q565J3516L761K086K94q348K243j24J0350P095
$$ 91282 109987 100655 101611 102968 98051 106616 120132 123893 125979 126273 117925 120168 120044 130394 137489
8428A37489Q707m534j4562p949n305N066J0472j819K409n03j4483p815N893R801
$$ 137489 146196 141662 127100 119151 113846 118912 129384 127565 129974 129471 114988 107173 113066 122867
8414A22867p510j607R95p049j3489n64K168q420P348J2329M110q505j0510j0819
$$ 122867 115357 113750 114745 107696 94207 93643 95811 87391 94739 107068 111178 102673 92163 81344
8400H1344r177p33L452J2041J7733P25k319P184j3792l5R899m396j6998n026J3593
$$ 81344 72167 71434 74886 86927 104660 105385 103066 110250 96458 96423 106322 101926 84928 79902 93495
8385I3495J0386q5j0514p778K173o242j1366N72Q146L679k691J2813L699l608
$$ 93495 103881 103796 93282 85504 87677 81435 70069 70641 78787 82466 79775 92588 96287 92679
8371I2679m8j3643j0765M914J0928L825J4871L715q173j2587p209j548J755k716
$$ 92679 92631 78988 68223 73137 84065 87890 102761 106476 98303 85716 78507 76959 78714 75998
8357G5998M273L869J015n188J9523P288q350r210k107q494p944m885J6614J1132
$$ 75998 80271 84140 85155 79967 99490 106778 98428 89218 87111 78617 70673 65788 82402 93534
8343I3534j302j833N360L628M607P232O185k0909j4690J0211l248K271P330m589
$$ 93534 92232 90399 95759 99387 103994 111226 117411 96502 81812 92023 88775 91046 98376 93787
8329I3787K296k165j845o881p845p746J1102J412l733R431J783N27K829j540l97
$$ 93787 96083 93918 92073 85192 77347 69601 80703 82115 78382 87813 89596 90123 92952 91412 91015
8314I1015K076J874j2330j8571k951L358O219Q645K705L061j282q888l346J952
$$ 91015 93091 94965 82635 64064 61113 64471 70690 79335 82040 85101 83819 74931 71585 73537
8300G3537L853r189o701K818N756N653l56m524J520K917J0828O619q386j1116
$$ 73537 77390 68201 61500 64318 70074 75727 75371 70847 72367 75284 86112 92731 84345 73229
8286G3229K500N980j144j947r958r120n602M908K875l009Q828Q069k632L532N034
$$ 73229 75729 81709 80565 78618 68660 59540 53938 58846 61721 58712 67540 75609 72977 76509 81543
8271H1543Q28k64j956O477p200J349J3068j8122j5259J0553n516O85P242M162
$$ 81543 82371 82107 80151 86628 79428 80777 93845 75723 60464 71017 65501 66186 73428 77590
8257G7590m052j921J417l501L904n621o443K547J3772O094P426n178j0448q678
$$ 77590 73538 71617 73034 69533 73437 67816 61373 63920 77692 83786 91212 86034 75586 66908
8243F6908N276J41p942k731K18k642J0873K016m774j4753n646J0347O857n265
$$ 66908 72184 72325 64383 61652 61870 59228 70101 72117 67343 52590 46944 57291 64148 58883
8229E8883N141J7408M772j8526l361J1065M246K631k742o758j1132M408J3957
$$ 58883 64024 81432 86204 67678 64317 75382 79628 82259 79517 72759 61627 66035 79992
8216G9992M527r702o440o31q30j719m26K578M195k991k067k980L749n457R914
$$ 79992 84519 74817 68377 67746 66916 65197 64771 67349 71544 68553 66486 63506 67255 61798 71712
8201G1712O456P360j390q189l3135k059q828m736K4897P278J1873J0225P410j3966
$$ 71712 78168 85528 84138 75949 42814 40755 31927 27191 52088 59366 71239 81464 88874 74908
8187G4908j0932N918J9343j2546j8964J321Q216n205j0461N508J6216O137j0096
$$ 74908 63976 69894 89237 76691 57727 59048 67264 62059 51598 57106 73322 79459 69363
8174F9363p008l445q924k307p398m295J2011K2056O222J991O663k566n268Q808
$$ 69363 62355 58910 49986 47679 40281 35986 47997 70053 76275 78266 84929 82363 77095 85903
8160H5903L027j7424Q90L467O683k38m95k010j2819n596J001L769J2602K257l485
$$ 85903 88930 71506 72396 75863 82546 82308 81813 79803 66984 61388 62389 66158 78760 81017 77532
8145G7532k97N856N678L390k571o443R296l030O113L132o971m557J177K285J1864
$$ 77532 77235 83091 88769 92159 89588 83145 92441 89411 95524 98656 91685 87128 88305 90590 102454
8130A02454J347J4989j007j6531M878R477k38J670o224j1241j733N025R176J8180
$$ 102454 103801 118790 117783 101252 106130 115607 115369 117039 110815 99574 97841 102866 112042 130222
8116A30222q126j8106p270q197O080M638N351Rl312L909J0712Q93J20j0690m252
$$ 130222 122096 103990 96720 88523 94603 99241 104592 104601 101289 105198 115910 116803 116923 106233 101981
8101A01981j3592m173m169k390J3533K7010J8360l795k4762K468N605O586m375
$$ 101981 88389 84216 80047 77657 91190 118200 136560 132765 108003 110471 116076 122662 118287
8088A18287l404k941L843q032J346m268N415m259q604P370J3036K875q800N445
$$ 118287 114883 111942 115785 107753 109099 104831 110246 105987 97383 104753 117789 120664 111864 117309
8074A17309p49o193o526K0938J7633N916P184j578m245j3500o991K866j821m469
$$ 117309 116560 110367 103841 124779 142412 148328 155512 153934 149689 136189 129198 132064 130243 125774
8060A25774r540J5281K4270J9518K2181R873m936k613J5969q57o684L127N189
$$ 125774 116234 131515 155785 175303 197484 207357 202421 199808 215777 214920 208236 211363 216552
8047B16552J4494l477P525J1160p763j7291q152n632j269N965j895j601O928K648
$$ 216552 231046 227569 235094 246254 238491 221200 213048 207416 206147 212112 210217 208616 215544 218192
8033B18192j6630p281J5029R129K664L562J3934O68k482J2250J5683J4688J0180
$$ 218192 201562 194281 209310 218439 221103 224665 238599 239267 236785 249035 264718 279406 289586
8020B89586J5181K8091o495N915K5429J1819J4390K7132L4238K4546J9314j792
$$ 289586 304767 332858 326363 332278 357707 369526 383916 411048 445286 469832 489146 487354
8008D87354k2305l3683k4376j8596j4135l0513J684q896j3555k8181m785K966
$$ 487354 465049 431366 406990 388394 374259 343746 345430 336534 322979 294798 290013 292979
7996B92979j0183j3200L762q446J046O952j200O848O449R137J2326K486l588M052
$$ 292979 282796 269596 273358 264912 265958 272910 271710 278558 285007 294144 306470 308956 305368 309420
7982C09420m29Q381J6825O944R820L948J5071J4968J0687K1189J2754m106N080
$$ 309420 308991 317372 334197 341141 350961 354909 369980 384948 395635 416824 429578 425472 430552
7969D30552J2072J5518l606o421q170l057j3713q435l627J779k7701l6704k9010
$$ 430552 442624 458142 454536 448115 439945 436888 423175 414740 411113 412892 385191 348487 319477
7956C19477j5799j1982j6594j2820J3346J9561q960k3674O748Q327j1147j3611
$$ 319477 303678 291696 275102 262282 275628 295189 286229 262555 269303 277630 266483 252872
7944B52872K043K925N427N99j3623m288k873j538J5867J6134J0635k789M668J3829
$$ 252872 254915 257840 263267 263866 250243 245955 243082 241544 257411 273545 284180 281391 286059 299888
7930B99888P898l253j9740j5814J396j2032j569N561r8r817j3980k3746k5919
$$ 299888 307786 304533 284793 268979 270375 258343 256774 262335 262237 252420 238440 214694 188775
7917A88775j8313j391K015N167J0892J1898q419j3817k494L308O230j0716o789
$$ 188775 170462 169071 171086 176253 187145 199043 190624 176807 174313 177621 183851 173135 166346
7904A66346j2664j0843l291k3061J7501M793j607n016q682k847L208P456L854
$$ 166346 153682 142839 139548 116487 133988 138781 137174 132158 123476 120629 123837 131293 135147
7891A35147J1410N55j1776L129J3321L913j0186j3247n601n029r834J0528l511
$$ 135147 146557 147112 135336 138465 151786 155699 145513 132266 126665 121636 111802 122330 118819
7878A18819j9861L836N635j0589n393k225r78P134k224R293m842p312k678M706
$$ 118819 98958 102794 108429 97840 92447 90222 89244 96378 94154 103447 98605 91293 88615 93321
7864I3321l520R37l335r011j2166N256M732Q102k409j1563j3182K93M659K62j3543
$$ 93321 89801 90738 87403 78392 66226 71482 76214 84316 81907 70344 57162 57455 62114 62376 48833
7849D8833j1744k96j76K862O996J1121J396k94J1933n34j9745r407K0113R282
$$ 48833 37089 36793 36617 39479 46475 57596 58992 58698 70631 70097 50352 40945 61058 70340
7835G0340q02m086r398j2167j5213J821J3017N973O640j456m173m219j3310n945
$$ 70340 69538 65452 56054 43887 28674 30495 43512 49485 56125 54669 50496 46277 32967 27022
7821B7022L678J2441J5111l420q26M421K059J2497N33j3638K477o530P100Q976
$$ 27022 30700 43141 58252 54832 54006 58427 60486 72983 73516 59878 62355 55825 62925 71901
7807G1901O212m335r123j4100m214j507J5107J0032j6427j1381M935o985j3926
$$ 71901 78113 73778 64655 50555 46341 44834 59941 69973 53546 42165 47100 40115 26189
7794B6189N340K061q818R905J3754L783o93M538J3356O448J391j1495k7236p500
$$ 26189 31529 33590 24772 34677 48431 52214 51521 56059 69415 75863 77254 65759 38523 31023
7780C1023j0907L831K606r561J28K584K906L797Q183M285J824P893j033o15j8137
$$ 31023 20116 23947 26553 16992 17120 19704 22610 26407 34590 38875 40699 48592 47559 46944 28807
7765B8807j4746r194Q983p233Q055P247K647P944o184r010j065n538P016Q493
$$ 28807 14061 4867 13850 6617 14672 21919 24566 32510 26326 17316 16251 10713 17729 26222
7751B6222R617P536j1291q945n659p496n474N376q692l992J0770O382P059r47
$$ 26222 35839 43375 32084 23139 17480 9984 4510 9886 1194 -2798 7972 14354 21413 20466
7737B0466q615J903R583l462N537J0342l853j5965R50J045K745J034K515J916
$$ 20466 11851 13754 23337 19875 25412 35754 31901 15936 16886 17931 20676 21710 24225 26141
7723B6141j603n503J3120k326K177J322j1292N099J1375j2706r16J204o266p734
$$ 26141 24538 19035 32155 29829 32006 33328 22036 27135 38510 25804 24888 26092 19826 12092
7709A2092l079J1455m087j2453o271J0021R165M928m220K554J0719K403M071L231
$$ 12092 9013 20468 16381 3928 -2343 7678 16843 21771 17551 20105 30824 33227 37298 40529
7695D0529l332j2085j6703k802N706j199l490r736j5050o237Q716k430L980K8055
$$ 40529 37197 25112 8409 5607 11313 10114 6624 -3112 -18162 -24399 -15683 -18113 -14133 13922
7681A3922L797J0326J84P527L233j0528n769M829p455j913O850o539m005R742
$$ 13922 17719 28045 28229 35756 38989 28461 22692 27521 20066 18153 25003 18464 14459 24201
7667B4201J1712j9190j1682J4311J0689o889r296N482M567o83J3100o74o404j4113
$$ 24201 35913 16723 5041 19352 30041 23152 13856 19338 23905 23222 36322 35648 29244 15131
7653A5131m724j784j5690j1863N628J7029J0332l262J111P560O945q408o611k823
$$ 15131 10407 8623 -7067 -18930 -13302 3727 14059 10797 11908 19468 26413 18005 11394 8571
7639H571N375M160L87j963R412r034j0859j4656J0448k620L961J8129M725r404
$$ 8571 13946 18106 18493 16530 25942 16908 6049 -8607 1841 -779 3182 21311 26036 16632
7625A6632J05J3000j9981n545j4676q114O743K7025J6839j3002o558j3027N691
$$ 16632 16737 29737 9756 4211 -10465 -18579 -11836 15189 32028 19026 12468 -559 5132
7612E132j4737j1128J3007J3365L616Q278R879j0684j6114k862M902j2300J618
$$ 5132 -9605 -20733 -7726 5639 9255 17533 27412 16728 614 -2248 2654 -9646 -8028
7599h028J0886P890q053j895M5R359o069R0n540k423P928J5509k768p555L838
$$ -8028 2858 10748 2695 800 845 10204 4135 4225 -1315 -3738 4190 19699 16931 9376 13214
7584A3214l295P918J732J174m952r528k94L435J262n039o39k09k53n926r899l299
$$ 13214 9919 17837 19569 20743 15791 6263 5969 9404 10666 5627 4988 4779 4526 -1400 -11299 -14598
7568a4598M440J8013K010j2132Q085n062J897R420j0141o633M716MO656R538q376
$$ -14598 -10158 7855 9865 -2267 5818 756 2653 12073 1932 -4701 15 19 6675 16213 7837
7553G837J3962J1868j6126j0855P313K471q623m188k261p739n31K451K2448J8382
$$ 7837 21799 33667 17541 6686 13999 16470 7847 3659 1398 -6341 -6872 -4421 18027 36409
7539C6409N607q447j5604k100l663p816j3197n377J1197j847K425j227q55J4802
$$ 36409 42016 33569 17965 15865 12202 4386 -8811 -14188 -2991 -4838 -2413 -3640 -4495 10307
7525A0307l070J3055k869r94j4087m554m632O844k416p535j173m398P29O788k010
$$ 10307 7237 20292 17423 16429 2342 -2212 -6844 0 -2416 -9951 -11124 -15522 -14793 -8005 -10015
7510a0015J5882R434k782L821q91m03j2168j2424j1495M129P187N115R255O321
$$ -10015 5867 15301 12519 16340 15449 15046 2878 -9546 -21041 -16912 -9725 -4610 4645 10966
7496A0966k901n330N759o172n680j1922o825J7132Q507J172o611j1961Q750j988
$$ 10966 8065 2735 8494 2322 -3358 -15280 -22105 -4973 3534 4706 -1905 -13866 -5116 -7104
7482g104L472J6170j93k851m015n217M66J4792J3915q304p229m76O769J917o548
$$ -7104 -3632 12538 12345 9494 5479 262 728 15520 29435 21131 13902 13426 20195 22112 15564
7467A5564j0430p455j0967Q678j408m81k572o971L438J3724K668j8167j0084K792
$$ 15564 5134 -2321 -13288 -4610 -6018 -6499 -9071 -16042 -12604 1120 3788 -14379 -24463 -21671
7453b1671P967N513J9929J4466l940j1582l431O902R349o00j5282o735R808p670
$$ -21671 -13704 -8191 11738 26204 22264 10682 7251 14153 23502 22902 7620 885 10693 3023
7439C023j965J2039j8989l155J3559N032R914m842n895K255m078q484p351O279
$$ 3023 1058 13097 -5892 -9047 4512 9544 19458 14616 8721 10976 6898 -1586 -8937 -2658
7425b658K577k8o076K031R880L828j0643j4342n714P668R682N678p195J73j210
$$ -2658 -81 -109 -6185 -4154 5726 9554 -1089 -15431 -21145 -13477 -3795 1883 -5312 -5139 -6349
7410f349l673N589n677K932Q299l631q593k806O783J1213q674m042j372L576L634
$$ -6349 -10022 -4433 -10110 -7178 1121 -2510 -11103 -13909 -7126 4087 -4587 -8629 -10001 -6425 -2791
7395b791K610m945j6224O862L504O659o102j525l727n31o73J8913O799k224l900
$$ -2791 -181 -5126 -21350 -14488 -10984 -4325 -10427 -11952 -15679 -16210 -16883 2030 8829 6605 2705
7380B705n209l943Q527N114n914o065k120M86N17N748N242J0088o871j3693l411
$$ 2705 -2504 -6447 2080 7194 1280 -4785 -6905 -6419 -5902 -154 5088 15176 8305 -5388 -8799
7365h799R659L853j5897j61P579m4J6948k945j058j4524r275Q729J8834J0676
$$ -8799 860 4713 -11184 -11345 -3766 -3810 13138 10193 9135 -5389 -14664 -5935 12899 23575
7351B3575r440l666l169J0873N749j6714j4065l603l70j2502j142J2898J380P800
$$ 23575 14135 10469 7300 18173 23922 7208 -6857 -10460 -10830 -23332 -24474 -11576 -10196 -2396
7337b396O974J1591j717l131m091j6513q260N931O245q506O797K730K528P909
$$ -2396 4578 16169 14452 11321 7230 -9283 -17543 -11612 -5367 -13873 -7076 -4346 -1818 6091
7323F091o39R36o238m785o568O292p040j5728K957Q941P845L829m190r6q185j645
$$ 6091 5452 6388 150 -4635 -11203 -4911 -11951 -27679 -24722 -15781 -7936 -4107 -8297 -8393 -16578 -18223
7307a8223Q576n29n888l888P842L018r421m293P459Q770J3537K291Q201P289P63
$$ -18223 -9647 -10176 -16064 -19952 -12110 -9092 -18513 -22806 -15347 -6577 6960 9251 17452 24741 25504
7292B5504j6889j5623p710L605J5795O932Q96j1450m457M031L255N095R742n141
$$ 25504 8615 -7008 -14718 -11113 4682 11614 12510 1060 -3397 634 3889 8984 18726 13585
7278A3585j7415m349N428O510R01k590k703O70L654O565m746j8785q676R034j863
$$ 13585 -3830 -8179 -2751 3759 4660 2070 -633 37 3691 10256 5510 -13275 -21951 -12917 -14780
7263a4780k272K938J4431J7228K73q340K384P700m890J3612Q338j2418j7347Q94
$$ -14780 -17052 -14114 317 17545 17818 9478 11862 19562 14672 28284 36622 24204 6857 7751
7249G751R299q798j6452j165k263R927N822m19K788l240J0626J0706j1764n993
$$ 7751 17050 8252 -8200 -9365 -11628 -1701 4121 3702 6490 3250 13876 24582 12818 6825
7235F825j1228o371O622k783L52J5149K509k0178n750j221J2709J3430j2823r912
$$ 6825 -4403 -10774 -4152 -6935 -6583 8566 11075 -9103 -14853 -16074 -3365 10065 -2758 -12670
7221a2670M74k727N868J2992O627J84K922k213P202l036k859j9804l742J3182
$$ -12670 -12196 -14923 -9055 3937 10564 10748 13670 11457 18659 15623 12764 -7040 -10782 2400
7207B400L269m183M300Q861q649j7636K413J8610k0276o214K54j4464p522O399
$$ 2400 5669 1486 5786 14647 5998 -11638 -9225 9385 -10891 -17105 -16851 -31315 -38837 -32438
7193c2438J2137k390J0070J2396L17j4260q759j073J1081P075L109q322J31J4340
$$ -32438 -20301 -22691 -12621 -225 92 -14168 -22927 -24000 -12919 -5844 -2735 -11057 -10926 3414
7179C414R375l478j2287m451J344K96M898Q3k536L44o995r035P554J7920j6829
$$ 3414 12789 9311 -2976 -7427 -6083 -5787 -889 -806 -3342 -2998 -9993 -19028 -11474 6446 -10383
7164a0383k1053O451J6465j148j1256j0829N219N556R871J880M737J0919m121
$$ -10383 -31436 -24985 -8520 -9668 -20924 -31753 -26534 -20978 -11107 -9227 -4490 6429 2308
7151B308j284J796j0043r647r438J357J9879M906J3074n183M315J615K745o404
$$ 2308 1024 2820 -7223 -16870 -26308 -24951 -5072 -166 12908 7725 12040 13655 16400 9996
7137I996l629q067p861j389N173J7043N93j3834k176k25L109k220J665R91N641
$$ 9996 6367 -1700 -9561 -10950 -5777 11266 11859 -1975 -4151 -4376 -1267 -3487 -1822 -831 4810
7122D810k593m37m229o296o336m893p586o558o339J6033l081J466j992J6440J101
$$ 4810 2217 1780 -2449 -8745 -15081 -19974 -27560 -34118 -40457 -24424 -27505 -26039 -28031 -11591 -10490
7107a0490l817J0177M444K074J1376p944j1604r660J1139N315j1108r698N211
$$ -10490 -14307 -4130 314 2388 13764 5820 -5784 -15444 -4305 1010 -10098 -19796 -14585
7094a4585n360N102J4539Q45l255R386J2k900k996m664o311j598J2966N476n268
$$ -14585 -19945 -14843 -304 541 -2714 6672 6684 3784 788 -3876 -10187 -11785 1181 6657 1389
7079A389K166j658N920n691R337J23J417k4959l020J2029N027l335k862J2498
$$ 1389 3555 1897 7817 2126 11463 11586 13003 -11956 -14976 -2947 2080 -1255 -4117 8381
7065H381n973p696M784m444j500J6332Q694J406j620O86j1053n028l45o503K314
$$ 8381 2408 -5288 -504 -4948 -6448 9884 18578 19984 18364 19050 7997 2969 2624 -3879 -1565
7050a565O772n449J448J1106K694l878K130J051O249q567M027m948K104k126O618
$$ -1565 5207 -242 1206 12312 15006 11128 13258 14309 20558 11991 16018 11070 13174 11048 17666
7035A7666m394j3036J0347R916o600j3753J3796J1953J730q348L168r796j1569
$$ 17666 13272 236 10583 20499 13899 146 13942 25895 27625 19277 22445 12649 1080
7022A080n76K255j73J5451J338p798p339j139p447r918J1205N034K1l333j7071
$$ 1080 504 2759 2586 18037 19375 11577 4238 3099 -4348 -14266 -3061 1973 1994 -1339 -18410
7007a8410r125J5490J7584M989Q418K362k735j4454q241j4509j597J7514J2215
$$ -18410 -27535 -12045 5539 10528 18946 21308 18573 4119 -4122 -18631 -20228 -2714 9501
6994I501j596J613n07L598q85p798j453k173j8170m654J8281N188M944k646q45
$$ 9501 7905 9518 9011 12609 11724 3926 2473 300 -17870 -22524 -4243 945 5889 3243 2398
6979B398k924j0302N06k172k878l562J1052o348k702N676O421N03L137O771k54
$$ 2398 -526 -10828 -10322 -12494 -15372 -18934 -7882 -14230 -16932 -11256 -4835 -4332 -1195 5576 5322
6964E322n625L781j348j5014R54M183N060Q992M477r930n081N73r62J4612R521
$$ 5322 -303 3478 2130 -12884 -11930 -7747 -2687 6305 10782 852 -4229 -3656 -4618 9994 19515
6949A9515k538k3769j1417L014M955P522l304j3036q229J6454J3265l60o594Q364
$$ 19515 16977 -6792 -18209 -15195 -10240 -2718 -6022 -19058 -27287 -10833 2432 2072 -4522 3842
6935C842n440j2128J0021O458O172j546r552k70r348k0111J4120R361M512k932
$$ 3842 -1598 -13726 -3705 2753 8925 7379 -2173 -2443 -11791 -31902 -17782 -8421 -3909 -6841
6921f841o02l069J1938J2697K705m225j1560j847L063j758q667j6639M078o191
$$ -6841 -7443 -10512 1426 14123 16828 12603 1043 -804 2259 501 -8166 -24805 -20727 -26918
6907b6918J3419P559j415p745N845Q879j7939j082R467J4803K518J791J4800k2853
$$ -26918 -13499 -5940 -7355 -15100 -9255 -376 -18315 -19397 -9930 4873 7391 9182 23982 1129
6893A129j2607J9711m45n305L337N972J335k74l455N127q399j1115O07L96l236
$$ 1129 -11478 8233 7788 2483 5820 11792 13127 12853 9398 14525 6126 -4989 -4382 -3986 -7222
6878g222L599N129O794m708j3998j1440l155O489j743k79J3278P320l17k586m669
$$ -7222 -3623 1506 8300 3592 -10406 -21846 -25001 -18512 -20255 -20534 -7256 64 -253 -2839 -7508
6863g508j4479l355m97K008J6528N892K721J4842r565j4317j4880n175j0417J2246
$$ -7508 -21987 -25342 -25839 -23831 -7303 -1411 1310 16152 6587 -7730 -22610 -27785 -38202 -25956
6849b5956J1749J4229J7594L260n289j965k700j5592n331M110q663n505O888O235
$$ -25956 -14207 22 17616 20876 15587 13622 10922 -4670 -10001 -5891 -14554 -20059 -13171 -6936
6835f936m213j2796m488j3611K942N887J3694J6534k828m028k684k532K008P550
$$ -6936 -11149 -23945 -28433 -42044 -39102 -33215 -19521 -2987 -5815 -9843 -12527 -15059 -13051 -5501
6821e501J106j0583r253n994K379Q433J416p545O637O140R394m794J1175N688
$$ -5501 -4395 -14978 -24231 -30225 -27846 -19413 -17997 -25542 -18905 -12765 -3371 -8165 3010 8698
6807H698M689p39j3347r098L96N25J3727j328m605l175J587j1060j377j3696J376
$$ 8698 13387 12648 -699 -9797 -9401 -8876 4851 3523 -1082 -4257 -2670 -13730 -15107 -28803 -27427
6792b7427N511q926O122Q517R386P444J046N325J0345K145j0007o063M024o276
$$ -27427 -21916 -30842 -24720 -16203 -6817 627 1673 6998 17343 19488 9481 3418 7442 1166
6778A166Q88m959j516R584q353n482O097J1616l633N48J4118p028L445O281k3893
$$ 1166 2054 -2905 -4421 5163 -3190 -8672 -2575 9041 5408 5956 20074 13046 16491 22772 -1121
6763a121j2599K637L973j44K801k850O635N439J3366J205q186m462N051J0055
$$ -1121 -13720 -11083 -7110 -7254 -4453 -7303 -668 4771 18137 19342 11156 6694 11745 21800
6749B1800l231j1751q324J1399o163P629J0919P629O970j0564n197L96J162J508
$$ 21800 18569 6818 -1506 9893 3730 11359 22278 29907 36877 26313 21116 21512 22674 24182
6735B4182n136j0952J02j082m615P294k455j5158N55J951J0453J059o268o416
$$ 24182 19046 8094 8196 7114 2499 9793 7338 -7820 -7265 -5314 5139 6198 -70 -6486
6721f486P087r107j2907R675P058N89K4956M527j8604K000N298p032p612o990
$$ -6486 601 -8506 -21413 -11738 -4680 -4091 20865 25392 6788 8788 14086 7054 -558 -7548
6707g548o289J146n755M712j786J5775J747J879r637p233k53J325n071j212L189
$$ -7548 -13837 -12691 -18446 -13734 -15520 255 2002 3881 -5756 -12989 -13242 -11917 -16988 -18200 -15011
6692a5011k973o645L260J2356q385k833L089N745R003L158Q26r773m783k037J7247
$$ -15011 -17984 -24629 -21369 -9013 -17398 -20231 -17142 -11397 -2394 764 1590 -8183 -12966 -15003 2244
6677B244O927k044j0501q19J0850O841j3903j405L442K966m104q770q912j556
$$ 2244 9171 7127 -3374 -4193 6657 13498 -405 -1810 1632 4598 494 -8276 -17188 -18744
6663a8744l743L845j651P191Q440n707n28P052n751j006J5248l229k013j0782
$$ -18744 -22487 -18642 -20293 -13102 -4662 -10369 -10897 -3845 -9596 -10602 4646 1417 -596 -11378
6649a1378j3714M867M870L602M541j043j1626J011J0789R792P059k176p41k356
$$ -11378 -25092 -20225 -15355 -11753 -7212 -8255 -19881 -18870 -8081 1711 8770 6594 5853 3497
6635C497M230O557j1345l831j0920J0581N07q941J096j071M201o034M390K620
$$ 3497 7727 14284 2939 -892 -11812 -1231 -724 -9665 -8569 -9640 -5439 -11473 -7083 -4463
6621d463J2031R901n442O84O412L516n374m387q271P835Q0R386r451o176j952
$$ -4463 7568 17469 12027 12711 19123 22639 17265 12878 4607 12442 12522 21908 12457 6281 4329
6606D329R975L192p42L279m190n880j4944l120J804R92M864P39R997J2960j8127
$$ 4329 14304 17496 16754 20033 15843 9963 -4981 -8101 -6297 -5305 -441 298 10295 23255 5128
6591E128j0541N450o204l741r078m740p494p166Q342J2736j799n950J1630O698
$$ 5128 -5413 37 -6167 -9908 -18986 -23726 -31220 -38386 -30044 -17308 -19107 -25057 -13427 -6729
6577f729o693q967K933J5336Q721J942p317L70k239M610O30m10q694J040P415
$$ -6729 -13422 -22389 -19456 -4120 4601 6543 -774 -404 -2643 1967 2597 2187 -6507 -5467 1948
6562A948J0378J29o11o444k2398o447J5584J0289m207r317O98j929J0254N973
$$ 1948 12326 12455 11844 5400 -16998 -23445 -7861 2428 -1779 -11096 -10398 -12327 -2073 3900
6548C900l20l596j688M520k171j4398r757J7754m298j484Q508J1651J2592p003
$$ 3900 3580 -16 -1704 2816 645 -13753 -23510 -5756 -10054 -11538 -3030 8621 21213 14210
6534A4210n478j819k897M985j0691m327M965P697R238M506p672M011j514j9305
$$ 14210 8732 6913 4016 9001 -1690 -6017 -1052 6645 15883 20389 12717 16728 15214 -4091
6520d091Q103K252k543j0856o111p015j0580Q029O230o878K365o182M195r47P621
$$ -4091 4012 6264 3721 -7135 -13246 -20261 -30841 -22812 -16582 -23460 -21095 -27277 -23082 -24029 -16408
6505a6408K726j646l313N220N063O107j0091j562J1347p33J0316m592j2093O348
$$ -16408 -13682 -15328 -18641 -13421 -8358 -2251 -12342 -13904 -2557 -3290 7026 2434 -9659 -3311
6491c311q154n071J3508M522r461j1808R152O330k059J9768k191j1371P80p358
$$ -3311 -11465 -16536 -3028 1494 -7967 -19775 -10623 -4293 -6352 13416 11225 -146 634 -6724
6477f724p21J3591n537q370k629J706O92o900R935J5140o381j8050k808m505l76
$$ -6724 -7445 6146 609 -7761 -10390 -8684 -7992 -14892 -4957 10183 3802 -14248 -17056 -21561 -21937
6462b1937J5713M904L978J862n714j4477J624K2314J694j618l120n670l209m842
$$ -21937 -6224 -1320 2658 4520 -1194 -15671 -14047 8267 9961 8343 5223 -447 -3656 -8498
6448h498o905j2814P011K0311n772j3523j0612K601J1508J240K387K827Q059K08
$$ -8498 -15403 -28217 -21206 -895 -6667 -20190 -30802 -28201 -16693 -15453 -13066 -10239 -2180 -1972
$$ [...]
##END NTUPLES=NMR SPECTRUM
##END=
