##TITLE=Analysis number 326833
Compound Code cc 61201
Book Reference 483/108/5
Project Code adrs
Chemist Name mattw
##JCAMPDX= 6.0         $$ Bruker NMR JCAMP-DX V2.0
##DATA TYPE= NMR SPECTRUM
##DATA CLASS= NTUPLES
##ORIGIN= Bruker BioSpin GmbH
##OWNER= nmr
$$ XWIN-NMR		Version 3.5
$$ Fri Feb 23 11:08:02 2007 GMT Standard Time (UT+0h)  MAYBRIDGE\nmr@NMR_250MHZ
##.OBSERVE FREQUENCY= 250.131544655141
##.OBSERVE NUCLEUS= ^1H
##.ACQUISITION MODE= SIMULTANEOUS (DQD)
##.ACQUISITION SCHEME= undefined
##.AVERAGES= 16
##.DIGITISER RES= 18
##SPECTROMETER/DATA SYSTEM= dpx250
##.PULSE SEQUENCE= zg30
##.SOLVENT NAME= DMSO
##.SHIFT REFERENCE= (INTERNAL, DMSO, 0, 16.522)
##AUDIT TRAIL= $$ (NUMBER, WHEN, WHO, WHERE, WHAT)
$$ ##TITLE= Audit trail, XWIN-NMR		Version 3.5
$$ ##JCAMPDX= 5.01
$$ ##ORIGIN= Bruker BioSpin GmbH
$$ ##OWNER= nmr
$$ C:\u/data/dgb/nmr/ADRS/1910/pdata/1/auditp.txt
$$ ##AUDIT TRAIL=  $$ (NUMBER, WHEN, WHO, WHERE, WHAT)
(   1,<2007-02-23 11:07:26.47 +000>,<MAYBRIDGE\nmr>,<NMR_250MHZ>,
      <created by zg, POWCHK disabled, PULCHK disabled
       configuration hash MD5:
       49 4B E0 1D 92 C2 6B 37 9F E6 65 BC 52 41 86 1D
       data hash MD5: 64K
       D7 85 84 3B EA AD CC B3 AB 7C D1 87 19 8F 3E 84>)
(   2,<2007-02-23 11:07:47.83 +000>,<MAYBRIDGE\nmr>,<NMR_250MHZ>,
      <Start of raw data processing
       ef LB = 0.3 FT_mod = 6 PKNL = 1 SI = 32K 
       data hash MD5: 32K
       3C FF 34 25 E2 5E 60 3D 20 E8 6B 75 B7 B9 E4 9F>)
(   3,<2007-02-23 11:07:50.32 +000>,<MAYBRIDGE\nmr>,<NMR_250MHZ>,
      <apk 
       data hash MD5: 32K
       D4 F2 49 7B 71 AC 71 FB 4C 27 72 07 27 C7 EE 54>)
(   4,<2007-02-23 11:07:51.50 +000>,<MAYBRIDGE\nmr>,<NMR_250MHZ>,
      <abs ABSG = 5 
       data hash MD5: 32K
       2E 95 B2 21 E8 57 9A 78 23 B1 24 6A C1 25 BA 0A>)
$$ ##END=
$$ 
$$ hash MD5
$$ 21 A7 1D 41 52 AD 0F 4E F6 B7 D8 D3 98 7D 0A 08
##$RELAX= 
##$RELAX= 
##$RELAX= 
##$RELAX= 
##$RELAX= 
##$RELAX= 
##$RELAX= 
$$ Bruker specific parameters
$$ --------------------------
##$DU= <C:\u>
##$EXPNO= 1910
##$NAME= <ADRS>
##$PROCNO= 1
##$TYPE= <nmr>
##$USER= <dgb>
##$AMP= (0..31)
100 100 100 100 100 100 100 100 100 100 100 100 100 100 100 100 100 100 
100 100 100 100 100 100 100 100 100 100 100 100 100 100 
##$AQSEQ= 0
##$AQ_mod= 3
##$AUNM= <au_zg>
##$AUTOPOS= <56 >
##$BF1= 250.13
##$BF2= 250.13
##$BF3= 250.13
##$BF4= 250.13
##$BF5= 500.13
##$BF6= 500.13
##$BF7= 500.13
##$BF8= 500.13
##$BYTORDA= 1
##$CFDGTYP= 0
##$CFRGTYP= 5
##$CHEMSTR= <none>
##$CNST= (0..31)
1 1 145 1 1 1 1 1 1 1 1 1 1 1 1 1 1 1 1 1 1 1 1 1 1 1 1 1 1 1 1 1 
##$CPDPRG= <>
##$CPDPRG1= <>
##$CPDPRG2= <>
##$CPDPRG3= <>
##$CPDPRG4= <mlev>
##$CPDPRG5= <mlev>
##$CPDPRG6= <mlev>
##$CPDPRG7= <mlev>
##$CPDPRG8= <mlev>
##$CPDPRGB= <>
##$CPDPRGT= <>
##$D= (0..31)
0 1 0 0 0 0 0 0 0 0.06 0 0 0 0 0 0 0.0002 0 0 0 0 0 0 0 0 0 0 0 0 0 0 
0 
##$DATE= 1172228845
##$DBL= (0..7)
120 120 120 120 120 120 120 120 
##$DBP= (0..7)
150 150 150 150 150 150 150 150 
##$DBP07= 0
##$DBPNAM0= <>
##$DBPNAM1= <>
$$ [...]
##$SUBNAM7= <"">
##$SUBNAM8= <"">
##$SUBNAM9= <"">
##$SW= 20.6930455092707
##$SWIBOX= (0..15)
0 0 3 0 0 0 0 0 0 0 0 0 0 0 0 0 
##$SW_h= 5175.983436853
##$TD= 65536
##$TD0= 1
##$TE= 295.16
##$TE2= 300
##$TE3= 300
##$TEG= 300
##$TL= (0..7)
0 120 120 120 120 120 120 120 
##$TP= (0..7)
150 150 150 150 150 150 150 150 
##$TP07= 0
##$TPNAME0= <>
##$TPNAME1= <>
##$TPNAME2= <>
##$TPNAME3= <>
##$TPNAME4= <>
##$TPNAME5= <>
##$TPNAME6= <>
##$TPNAME7= <>
##$TPOAL= (0..7)
0.5 0.5 0.5 0.5 0.5 0.5 0.5 0.5 
##$TPOFFS= (0..7)
0 0 0 0 0 0 0 0 
##$TUNHIN= 0
##$TUNHOUT= 0
##$TUNXOUT= 0
##$USERA1= <user>
##$USERA2= <user>
##$USERA3= <user>
##$USERA4= <user>
##$USERA5= <user>
##$V9= 5
##$VALIST= <valist>
##$VCLIST= <CCCCCCCCCCCCCCC>
##$VD= 0
##$VDLIST= <DDDDDDDDDDDDDDD>
##$VPLIST= <PPPPPPPPPPPPPPP>
##$VTLIST= <TTTTTTTTTTTTTTT>
##$WBST= 1024
##$WBSW= 4
##$XGAIN= (0..3)
0 0 0 0 
##$XL= 0
##$YL= 0
##$YMAX_a= 301386
##$YMIN_a= -297901
##$ZGOPTNS= <>
##$ZL1= 120
##$ZL2= 120
##$ZL3= 120
##$ZL4= 120
##$ABSF1= 16.522
##$ABSF2= -4.171173
##$ABSG= 5
##$ABSL= 3
##$ALPHA= 0
##$AQORDER= 0
##$ASSFAC= 0
##$ASSFACI= 0
##$ASSFACX= 0
##$ASSWID= 0
##$AUNMP= <proc_1d>
##$AZFE= 0.1
##$AZFW= 0.1
##$BCFW= 0
##$BC_mod= 0
##$BYTORDP= 0
##$COROFFS= 0
##$CY= 12.5
##$DATMOD= 1
##$DC= 0
##$DFILT= <>
##$DTYPP= 0
##$F1P= 14.0000005364418
##$F2P= -0.99999901652339
##$FCOR= 0.5
##$FTSIZE= 32768
##$FT_mod= 6
##$GAMMA= 0
##$GB= 0
##$INTBC= 1
##$INTSCL= 1
##$ISEN= 128
##$LB= 0.3
##$LEV0= 0
##$LPBIN= 0
##$MAXI= 10000
##$MC2= 0
##$MEAN= 0
##$ME_mod= 0
##$MI= 0
##$NCOEF= 0
##$NC_proc= -4
##$NLEV= 6
##$NOISF1= 0
##$NOISF2= 0
##$NSP= 0
##$NTH_PI= 0
##$NZP= 0
##$OFFSET= 16.522
##$PC= 1
##$PHC0= 197.0345
##$PHC1= 30.93398
##$PH_mod= 1
##$PKNL= yes
##$PPARMOD= 0
##$PSCAL= 4
##$PSIGN= 0
##$REVERSE= no
##$SF= 250.13
##$SI= 32768
##$SIGF1= 0
##$SIGF2= 0
##$SINO= 400
##$SIOLD= 32768
##$SREGLST= <1H.DMSO>
##$SSB= 0
##$STSI= 32768
##$STSR= 0
##$SW_p= 5175.98343685301
##$SYMM= 0
##$S_DEV= 0
##$TDeff= 65536
##$TDoff= 0
##$TI= <Analysis number 999999
Compound Code 99
Book Reference 9
Project Code 9>
##$TILT= no
##$TM1= 0
##$TM2= 0
##$TOPLEV= 0
##$USERP1= <user>
##$USERP2= <user>
##$USERP3= <user>
##$USERP4= <user>
##$USERP5= <user>
##$WDW= 1
##$XDIM= 32768
##$YMAX_p= 523325454
##$YMIN_p= -373368
$$ End of Bruker specific parameters
$$ ---------------------------------
##NTUPLES= NMR SPECTRUM
##VAR_NAME=  FREQUENCY,     SPECTRUM/REAL,   SPECTRUM/IMAG
##SYMBOL=    X,             R,               I
##VAR_TYPE=  INDEPENDENT,   DEPENDENT,       DEPENDENT
##VAR_FORM=  AFFN,          ASDF,            ASDF
##VAR_DIM=   32768,         32768,           32768
##UNITS=     HZ,            ARBITRARY UNITS, ARBITRARY UNITS
##FACTOR=    0.157963299565203, 1,           1
##FIRST=     4132.6476996994, 0,             0
##LAST=      -1043.33573715361, 0,           0
##MIN=       -1043.33573715361, -373368,     0
##MAX=       4132.6476996994, 523325454,     0
$$ Real data points
##PAGE= N=1
##DATA TABLE= (X++(R..R)), XYDATA
$$ [...]
19707 955285 900092 871294 841754 813054 861971 891554 844823 842330 869346 879807 813332 737213
19695 737213 706116 746575 780897 729238 737173 810733 791401 780421 774756 763787 792137 833880
19683 833880 901642 937710 928223 920865 950984 1039516 1034736 1043529 1019222 950924 947517 998258
19671 998258 988229 941375 948027 979695 1025205 1049280 1051664 1073563 1091571 1017708 982346 1056393
19659 1056393 1102869 1106517 1061198 1036688 960062 940752 913988 905309 927731 918827 926892 900728
19647 900728 906101 932541 908749 847994 830238 868964 876431 918400 899300 849264 822706 868017
19635 868017 968449 948183 926636 894144 907301 883679 884884 876070 874991 896438 893435 936841
19623 936841 846881 783113 795689 894635 1005862 992835 928641 887546 889321 911020 946999
19612 946999 951586 911803 878699 870276 904555 909503 962196 945173 909215 843783 814156 869203
19600 869203 924206 893231 900576 896686 872614 941214 963217 936030 900559 921059 912421 901922
19588 901922 870077 855586 869123 861157 934265 957448 924430 883717 859333 910577 930926 896570
19576 896570 941954 961266 917900 901017 920859 916438 950433 945271 944319 938260 911630 942696
19564 942696 887523 873422 903962 880392 900073 947718 962303 957785 922780 965429 963043 933343
19552 933343 930190 926021 953967 938307 990723 1011495 1046623 1029535 979439 961773 955053 945747
19540 945747 984515 1023760 974394 974334 965692 963611 999193 978388 980907 972237 983583 1036346 1078270
19527 1078270 1105825 1054616 1020267 1061695 1045299 1049796 1074460 1063552 1095895 1015005 916863
19516 916863 904366 953456 1009041 982144 933789 947338 1019663 983641 912315 920000 972586 1027767
19504 1027767 1056459 1051854 1041852 979538 1032425 1043748 997571 957852 997135 1047890 1005455
19493 1005455 956154 941824 922670 1013538 1017518 1026219 1025944 1048667 1030480 1012048 999667 957408
19481 957408 1019934 1035188 1038057 1039253 1025148 981066 939559 948837 969668 1004308 1003772 1037805
19469 1037805 1045583 1008836 975734 965160 992850 1040537 1079870 1081839 1066941 1086618 1096286 1131330
19457 1131330 1103408 1106772 1100509 1128327 1118755 1098631 1128710 1165964 1246153 1277933 1239415 1229357
19445 1229357 1159932 1053505 1062367 1114174 1101606 1125023 1114376 1064873 1024011 1033442 1057515
19434 1057515 1094315 1157676 1114743 1044752 1085909 1134055 1115656 1077426 1121362 1172267 1158178
19423 1158178 1159817 1148911 1132854 1132999 1080115 1073700 1085455 1108863 1128332 1170601 1207197 1241385
19411 1241385 1241120 1272000 1256704 1199401 1143095 1168701 1142158 1178269 1257547 1312625 1293903 1275007
19399 1275007 1266240 1234494 1209580 1206981 1216141 1262050 1264933 1210324 1272000 1304450 1342886 1371191
19387 1371191 1347694 1298177 1283336 1321444 1349802 1354125 1382911 1381425 1409545 1438893 1452538 1452379
19375 1452379 1414757 1417510 1392746 1344346 1285110 1295122 1382049 1404678 1425303 1417125 1379587 1340846
19363 1340846 1377933 1441708 1423985 1395192 1350205 1371875 1393600 1361276 1353984 1380794 1406797
19352 1406797 1419789 1412203 1423433 1416888 1378693 1423198 1442824 1448597 1443834 1452099 1452212 1520332 1575781
19339 1575781 1666963 1724081 1664504 1657432 1671769 1694759 1681896 1641432 1670544 1668109 1661097 1648039
19327 1648039 1718421 1691374 1594301 1570215 1619072 1625713 1602946 1578893 1560274 1522359 1573016
19316 1573016 1641039 1686254 1655104 1609113 1583161 1549920 1547296 1545380 1518759 1518383 1583074 1597546
19304 1597546 1644384 1662247 1625049 1667783 1664161 1668110 1641867 1609076 1569217 1611432 1631274 1677785
19292 1677785 1694383 1758460 1789319 1798148 1809635 1828940 1795253 1833975 1895804 1938673 1962066
19281 1962066 1992985 2008776 1978954 1946186 1878584 1863032 1865645 1889752 1883435 1872385 1952054 1992918
19269 1992918 2027141 1978209 1975297 2014830 2050609 2050960 2087825 2076325 2076094 2075750 2077548 2090258 2105096
19256 2105096 2188328 2217159 2209151 2253071 2251646 2244121 2313874 2366244 2370971 2396531 2473316 2527545
19244 2527545 2588319 2660552 2674271 2701853 2709999 2711015 2778388 2896877 3050846 3134172 3260293
19233 3260293 3381772 3528020 3660942 3780195 3837317 3888480 4004687 4078325 4171669 4358417
19223 4358417 4558629 4829941 5104176 5313072 5630050 6016584 6395266 6810628 7302860
19214 7302860 7925335 8800180 9987555 11634999 13966321 17324523 22067668 28271561
19206 28271561 34778953 39410973 41620392 41476592 38029970 32768518 28146873 25337265
19198 25337265 24944907 27258757 32199954 37960913 40721717 40385784 39736754 37658594
19190 37658594 32309017 25461252 19281084 14540636 11257361 9176164 7876791 7013962
19182 7013962 6425306 6134049 5969260 5854503 5722927 5681374 5715879 5792921 5946997 6209857
19172 6209857 6490468 6729551 7084588 7435212 7852141 8329154 8965138 9828240 11127136
19163 11127136 12921454 15459989 19245212 24814715 32662917 41854904 49382600 52714918
19155 52714918 50906630 44243575 36554084 30636276 27389930 27039501 29664070 35142079
19147 35142079 42135744 47312700 48785624 47449224 42522292 34330826 25849074 18716044
19139 18716044 13415305 9821346 7407506 5750385 4647484 3949053 3429126 3020845
19131 3020845 2676844 2429860 2189059 1919417 1661396 1466811 1356936 1234942 1136705 1070923
19121 1070923 1113624 1094057 1007994 1027759 1064839 1032372 902525 778385 724751 705700 603400
19110 603400 545603 551629 493722 461378 427889 426853 519037 546372 518763 497168 498499 523282
19098 523282 576049 615359 612239 613076 627061 588782 613148 633999 714499 717844 620385 609008
19086 609008 591193 611773 605739 631746 667427 652019 660228 761147 748865 732632 762632 740063
19074 740063 745116 769020 804142 826722 805505 728971 706048 722787 748130 781113 753942 753751
19062 753751 784706 790871 780845 777595 795970 832873 819350 761330 730599 791886 787162 750123
19050 750123 726476 762538 825419 860846 987774 1109782 1089651 1044630 1000675 952802 944592
19039 944592 934213 889726 888422 908012 946703 979614 972811 980939 1016337 999809 1016954 1049814
19027 1049814 1034987 1044005 1074470 1112011 1115543 1088941 1029313 1047365 1073748 1082381 1092296 1109482
19015 1109482 1087561 1052582 1106189 1112620 1083989 1076653 1105732 1169079 1142873 1124227 1144962 1143539
19003 1143539 1165699 1190057 1216857 1164410 1149939 1155454 1189461 1196842 1162816 1178125 1221555 1206332
18991 1206332 1133866 1138213 1205255 1248578 1273495 1255903 1209191 1223933 1296428 1390528 1354267
18980 1354267 1345651 1322029 1366752 1397657 1369511 1357600 1350364 1318749 1302639 1356732 1387904 1371884
18968 1371884 1369809 1337833 1359418 1359481 1375100 1365227 1413431 1443049 1416566 1470731 1483605 1461895
18956 1461895 1466119 1460860 1440522 1421060 1384417 1400095 1447852 1465222 1537178 1543971 1582220 1632755
18944 1632755 1607174 1579313 1602568 1613249 1663862 1662540 1667931 1708048 1745177 1795126 1810419 1784982
18932 1784982 1791807 1816592 1817502 1849339 1891356 1897966 1930859 1909645 1867378 1830253 1805569 1802017
18920 1802017 1775079 1841870 1877879 1845273 1857661 1876768 1865760 1915916 1986059 2067769 2103140
18909 2103140 2127156 2129204 2167328 2183055 2205350 2279699 2387384 2479156 2485762 2490597 2501156 2563216
18897 2563216 2628904 2658218 2708966 2823019 2944488 3029795 3082985 3236716 3371855 3471386
18887 3471386 3569765 3642112 3773193 3864535 4064864 4382497 4740747 5205739 5838395 6751386
18877 6751386 8046341 9917546 12470253 15585727 17981858 17968493 15892115 13386068
18869 13386068 11354376 10188164 9886766 10318067 11550769 13733236 16854261 19567579
18861 19567579 19436308 16504586 13077069 10294181 8323588 7014080 6208065 5649273
18853 5649273 5273413 5039661 4842264 4771029 4749695 4726166 4750738 4882172 5044313 5179455
18843 5179455 5327492 5475978 5689718 5978189 6200573 6526499 6997638 7584476 8274834
18834 8274834 9109500 10229377 11812261 13909929 16878267 21249385 27529680 36032266
18826 36032266 45123736 49956035 47228912 40024186 32615951 27039814 23867626 22985909
18818 22985909 24224923 27636882 33250536 40061331 45000734 44933876 39296203 31046161
18810 31046161 23365562 17509284 13453383 10770560 8951473 7690312 6779350 6097575
18802 6097575 5584456 5297232 5130133 4975527 4813846 4818219 4929884 4989649 5084901 5182587
18792 5182587 5312071 5477863 5737014 6102826 6587605 7197288 7985983 8979680 10324263
18783 10324263 12095818 14674330 18496465 24150578 31838073 39983263 43906142 40602746
18775 40602746 33597909 26742106 21636517 18604762 17473047 18017016 20141493 24062321
18767 24062321 29800003 35390984 36533874 31950125 25134800 18780375 13953880 10620943
18759 10620943 8320779 6745844 5666717 4979965 4523942 4208673 3980407 3775834 3701983
18750 3701983 3668249 3689185 3690952 3712936 3668562 3586761 3565506 3667952 3814434 4016674 4296322
18739 4296322 4549583 4865022 5196377 5497787 5902228 6412008 7015714 7843757 8944010
18730 8944010 10462500 12541620 15541269 19852520 25765458 32644598 37438192 37045940
18722 37045940 32936424 28309116 24994762 23769494 24944907 28592090 34467622 40497950
18714 40497950 42035931 37220135 29610463 22236297 16429802 12332771 9577263 7729128
18706 7729128 6515904 5682278 5136151 4803196 4678050 4570960 4506869 4415297 4259829 4186758
18696 4186758 4204839 4300283 4386822 4555017 4838621 5198386 5560867 5877978 6230732 6744417
18686 6744417 7422218 8327223 9505658 11020015 13111801 15994751 20146970 26200018
18678 26200018 34465178 43483222 48933313 47652560 41914545 35763488 31465211 30089214
18670 30089214 31881312 36866033 44087778 49347901 47152119 38934639 29615781 21581014
18662 21581014 15588143 11455644 8698833 6841367 5577348 4684840 4033087 3601164
18654 3601164 3328161 3236069 3128689 2980765 2816628 2672225 2613517 2585729 2594072 2661974
18644 2661974 2767914 2825560 2845288 2879662 2939106 3087667 3271125 3564427 3964057 4451599
18634 4451599 5201095 6284490 7801065 10148355 13574965 17448157 19396664 17976294
18626 17976294 15182020 12661705 11098784 10708484 11520201 13552270 15838482 16401425
18618 16401425 14294581 11131652 8212351 5933660 4336982 3262045 2499558 1995998
18610 1995998 1700181 1473923 1285220 1169887 1114132 1090819 1055035 948983 861793 771459
18600 771459 678465 631370 598963 634143 629330 623241 601346 567660 592548 529310 518313 516645
18588 516645 510746 403492 306832 269089 330256 368188 383677 408845 396853 481066 493174
18577 493174 474935 473958 515073 570673 574375 510238 463427 434176 470300 532793 556616 558673
18565 558673 625766 665850 617201 539814 507658 476583 483130 545510 533151 521672 561388 590157
18553 590157 578061 574600 583948 606957 641124 582841 613545 698452 729630 708662 667544 765278
18541 765278 885015 948224 1023384 1073513 1125573 1162018 1135187 1109544 1195680 1207373 1143125
18530 1143125 1172903 1197246 1178662 1196560 1157079 1138140 1099369 981634 1011204 1003662 985113
18519 985113 952698 902348 925977 960326 925589 925794 968192 1075465 1059352 1040526 1044105 1018789
18507 1018789 894246 845491 883060 962159 982371 992891 1003234 1018336 1036454 1028086 983983
18496 983983 978445 1020295 1107408 1090322 1063997 1057320 1075077 1087232 1100940 1106611 1155369 1172846
18484 1172846 1151961 1160326 1169549 1168506 1144580 1210179 1282259 1315285 1326568 1398735 1422712 1389986
18472 1389986 1399431 1371790 1352865 1440633 1463585 1486740 1501583 1470382 1454581 1506907 1566369
18461 1566369 1608668 1585910 1626952 1668583 1649354 1664851 1795066 1865850 1906449 1953124 1961074
18450 1961074 2001804 2039040 2061144 2121066 2156609 2206323 2263647 2273502 2350170 2503547 2582987
18439 2582987 2636732 2762323 2964188 3126552 3294891 3462477 3670871 3783522 3968596 4250554
18429 4250554 4520374 4762496 5024953 5240655 5488159 5773011 6159370 6671538 7289546
18420 7289546 8053476 9086286 10470585 12269841 14593734 17822560 22369146 28768151
18412 28768151 36933761 45083672 50842527 53934231 54107913 50292717 44875625 40927471
18404 40927471 39997532 42815897 48220594 52679885 53124680 49184142 41216075 31883026
18396 31883026 23813742 17721344 13443436 10535441 8502483 7078095 6134091 5491047
18388 5491047 5001415 4612181 4376350 4238126 4212156 4184626 4137680 4157783 4196172 4222719
18378 4222719 4320117 4447355 4556339 4805342 5133448 5536082 6045089 6739037 7666628 8943667
18368 8943667 10588292 12814479 16000283 20726311 27075539 33626745 37689047 39703362
18360 39703362 41675624 42050892 38830516 34662223 32276067 32645153 35555941 38504279
18352 38504279 39185883 37915016 34516250 28452251 21715855 15933272 11619366 8604195
18344 8604195 6521278 5043194 4052095 3330531 2764254 2348529 2034907 1761830 1569753
18335 1569753 1475665 1364600 1198661 1026412 884999 716099 629535 623973 649434 598939
18325 598939 590963 539226 451127 336246 226921 199484 112650 103290 134237 148766 154321 144661
18313 144661 89796 82129 100064 93042 61255 70197 62878 71414 108789 149052 181487 174753 179413
18300 179413 208657 260511 235334 233775 216314 221893 286455 387468 393341 349874 302992 218461
18288 218461 156944 208857 262481 299445 329316 314928 288137 341290 422131 422958 396120 291399
18276 291399 335798 325741 329898 333187 312254 349077 386896 370300 285196 210996 173343 212463
18264 212463 206805 166100 202869 301305 334533 324091 277599 286317 276763 291278 332570 415580
18252 415580 382997 319967 316731 293048 282271 287712 274097 231633 148209 221687 244925 290380
18240 290380 315204 334854 357534 363045 406069 420356 421028 399946 393523 380329 394944 416679
18228 416679 471471 508861 551065 463005 430768 479653 468615 464709 462090 429781 395486 415272
18216 415272 437547 436208 487932 549990 449952 427386 431732 492845 479124 447626 489512 483902
18204 483902 514530 563420 602923 600518 548553 536043 582208 626079 591967 577414 516028 472156
18192 472156 522696 540611 585478 579275 574440 515278 500264 519729 505801 490275 500582 521690
18180 521690 568639 547511 557892 577857 621358 584921 558716 562380 526239 535908 550921 572730
18168 572730 638875 624873 611389 663577 733993 747454 640181 651211 684813 742608 736734
18157 736734 715188 720645 789399 820533 836854 860147 859427 837929 889281 897778 862550 797504
18145 797504 760711 729933 703861 725000 742920 780256 781932 869829 888698 891821 972589 1102015
18133 1102015 1155491 1148322 1113045 1007846 966034 951692 981725 1016440 981248 946389 968336
18122 968336 936722 918300 864874 813970 793896 793332 792178 746214 735456 773996 807559 772040
18110 772040 771903 813344 805964 845610 800790 769386 809900 826106 814549 746501 727689 819385
18098 819385 790286 786514 810733 806029 832520 823211 821802 850970 848791 848805 834898 789626 762225
18085 762225 762424 827291 849257 864688 853267 823593 766426 704783 667606 694172 766440 837515
18073 837515 819745 781490 757297 770209 824824 840059 809830 834606 880092 921274 929873 926018
18061 926018 924547 996711 1065372 1019860 986939 1016783 988813 969372 950178 954000 1023809 1022707
18049 1022707 996491 1058450 1077230 1094963 1099300 1018324 1025648 1089980 1080577 1105927 1151211 1134743
18037 1134743 1082442 1089379 1124647 1102187 1055252 1052391 1131522 1132472 1141695 1145031 1181323 1192425
18025 1192425 1204056 1299013 1335581 1325291 1235826 1170899 1181980 1206196 1236490 1274352 1318517
18014 1318517 1335822 1348414 1410066 1460679 1459491 1426145 1385119 1394813 1411973 1407648 1380498 1450273
18002 1450273 1537817 1543240 1530895 1505263 1553258 1628875 1671143 1608555 1575076 1606313 1671021
17991 1671021 1732735 1760800 1710662 1709873 1797285 1890169 1934480 2016787 2022967 1994956 2019113 2068240
17979 2068240 2148239 2214724 2284508 2331561 2353367 2447271 2512218 2586031 2666113 2727173 2883421
17968 2883421 3017472 3119932 3286034 3433504 3636717 3846323 4056702 4231152 4419790
17959 4419790 4591870 4761664 5001257 5419751 5853696 6212990 6487878 6693113 6882632
17950 6882632 7224911 7681316 8260856 8956944 9785722 10812720 11971881 13383779 15198957
17941 15198957 17590784 20953587 25838760 33174894 44336462 61637959 85257180 106832740
17933 106832740 112011254 100506675 84848219 70646219 61876992 62063321 72251617
17926 72251617 91297684 109589620 111350510 95405641 74359868 53685947 36466809
17919 36466809 24746238 17336123 12617801 9576102 7579235 6196791 5143623 4196268
17911 4196268 3436101 2870101 2406763 2012448 1799500 1684850 1675496 1634412 1592106 1482932
17901 1482932 1307966 1031369 839829 710979 634888 615013 597962 600351 524439 425949 363402
17890 363402 382936 347729 309181 273932 223442 190722 126749 142401 213128 219638 205784 299828
17878 299828 281590 187530 105497 125100 147217 136002 107064 72928 125831 147764 202885
17867 202885 269861 214542 120696 87061 157294 164048 120792 86061 129354 153153 143685 183478
17855 183478 133612 89995 39378 82485 141646 191472 211333 178992 65102 55989 107682
17844 107682 131849 171593 220931 244344 216722 217779 209173 226534 180398 176085 165689 163267
17832 163267 193273 202816 254112 269671 257980 189537 121550 160312 206421 200949 160297 104948
17820 104948 109980 113540 152059 159475 82643 60736 84040 118221 150728 136635 114941 132179
17808 132179 82374 61832 135381 232945 240006 219906 186793 157789 161399 214271 299346 334302
17796 334302 365044 367554 330235 330162 338989 360916 340556 314481 308527 328830 317488 276549 284621
17783 284621 318982 316639 281871 221603 172500 186024 171097 134624 139750 139236 167429 204590
17771 204590 238519 272334 289754 263863 317649 343727 329127 356836 417550 450021 483870
17760 483870 406407 393262 399970 358866 418187 384411 372841 440304 437703 441960 415597 417515
17748 417515 433622 474731 445470 395984 368540 308080 315361 324344 408595 444493 433850 385598
17736 385598 399543 410955 390320 392991 382178 359925 379492 398437 361220 391171 419852 470424
17724 470424 459186 437241 449579 434098 436943 484860 533712 542588 510549 511415 498001 490461
17712 490461 499684 496450 488379 565406 586424 538301 566578 576222 504361 449372 456474 462042 478553
17699 478553 481314 506660 559253 542303 506088 485027 498779 501756 481838 468690 500411 555500
17687 555500 573404 566143 560999 516205 499344 498752 545718 597027 630637 597638 590612 561412
17675 561412 506475 512375 556073 589566 614311 598742 589784 615372 672452 692701 701337 721971
17663 721971 751018 742261 681956 659698 698899 728629 730274 730646 785500 784033 778834 800121 835830
17650 835830 822970 781036 774999 804740 812126 797906 760763 790557 724367 701743 727175 745450
17638 745450 788807 800067 808157 901194 927743 930101 918865 915338 925907 977448 987540 933033
17626 933033 919393 935977 956106 982988 978769 990790 1052181 1081422 1096188 1097916 1100421 1143362
17614 1143362 1172047 1185516 1187143 1124136 1120711 1081866 1138581 1228935 1275588 1308295 1315397 1345700
17602 1345700 1361219 1380758 1462281 1507271 1557035 1615137 1656121 1756330 1877048 1956035 2040929
17591 2040929 2146719 2227979 2167604 2242052 2281480 2301283 2406192 2486999 2589743 2672362 2703231
17580 2703231 2772915 2799255 2790456 2839790 3058171 3332082 3521460 3615283 3679847 3704182 3752064
17569 3752064 3813817 3943856 4176411 4399237 4588355 4730891 4924457 5062793 5170370 5395155
17559 5395155 5654654 6009255 6434001 6953377 7610245 8326599 9210292 10238991 11502386
17550 11502386 13062103 15102267 17920951 21847680 27405068 35648035 48070504 66075218
17542 66075218 87933584 105217159 108321263 98754273 84743022 71738493 63756434
17535 63756434 64015319 73198065 88409321 100637628 99926911 86745860 68728435 50540123
17527 50540123 35100796 24109059 16889851 12230257 9165292 7087105 5598548 4427762
17519 4427762 3605757 2947417 2346805 1878040 1511021 1207841 1057517 986226 951565 935670
17509 935670 948698 956542 891457 799160 676876 561848 510817 502598 498894 496519 613960 674488
17497 674488 566163 406717 253110 158477 139965 191796 306119 373160 455028 466317 457489
17486 457489 390691 311842 303542 292102 288317 387383 496643 491331 335788 224495 111258
17475 111258 17581 -83887 -142254 -186594 -213630 -223464 -203355 -260447 -373368 -356449 -266144
17464 -266144 -271499 -303922 -306289 -254223 -226744 -258976 -322918 -297881 -252699 -229605 -260968 -208115
17452 -208115 -177146 -164197 -149491 -178172 -156623 -210389 -275408 -262956 -325525 -362503 -362953 -348291
17440 -348291 -318407 -233774 -181492 -183433 -267008 -266085 -212864 -175028 -193441 -193076 -183352 -202972 -228393
17427 -228393 -200763 -89670 -36636 -129780 -134433 -161269 -258733 -235461 -191118 -245048 -249681 -176051
17415 -176051 -167946 -137836 -90770 -94010 -72336 -50209 -7891 -43724 -60918 -104290 -100526 -86123
17403 -86123 -110325 -110352 -85925 -76583 -67889 -41619 -71139 -49576 -105805 -106311 -95094 -64031 -78149
17390 -78149 -103797 -84723 -51205 -116492 -131096 -66802 -107244 -123882 -72284 -55629 -43394 -66062
17378 -66062 -107862 -81982 -62906 -72010 -27302 -13085 31341 69601 -20927 -39652 -72224 -108257
17366 -108257 -98386 -87005 -129245 -105751 -42529 -27912 -45329 -67229 -76403 -109637 -92022 -79819
17354 -79819 -22467 17918 28172 -25306 -96555 -134420 -103981 -121415 -121603 -107388 -25791 6792
17342 6792 11794 -13740 -53265 -81962 -80232 7238 51079 15197 -15663 24946 95707 136530
17330 136530 118692 136748 167720 251103 269150 301885 433583 473096 486661 432786 377405
17319 377405 306220 289342 329065 385743 395805 376332 356288 311879 305402 225885 110868
17308 110868 133597 150416 185954 192938 167225 136956 85234 12419 -38314 -25853 43880 75489
17296 75489 108567 78108 59514 113435 97428 88300 13312 -76044 -74428 -52878 -1450 46837
17284 46837 25750 -35142 -49768 -16997 -28970 22641 112988 84442 -1591 -18141 -24418 22522
17272 22522 59635 79096 59113 13244 5780 23066 17466 8497 50336 95601 128663 128007 88847
17259 88847 54148 93187 105793 115997 73409 10498 -2803 -36995 -35821 46132 82939 17197
17247 17197 27485 23400 -16340 -36446 -84636 -26508 26228 61710 29394 54038 47047 -1109
17235 -1109 17660 67046 71820 37543 50157 69527 84595 38098 22022 7794 46410 133263
17223 133263 169894 144137 91687 73399 65166 50150 58985 -10298 -30686 -17744 -6876 -15769
17211 -15769 15146 52077 77314 96711 87094 116734 122203 76520 35360 41068 37865 56930
17199 56930 69856 104430 88206 46726 44016 58395 136359 101343 68017 107156 103320 135616
17187 135616 107072 94417 118707 110563 115982 126387 135806 97988 55267 73178 72734 72762 95921
17174 95921 81854 96248 63754 85695 89670 73792 78583 47019 36856 77998 75860 80696
17162 80696 97539 141862 137128 156309 122446 118275 70711 11916 9049 33643 9281 72244
17150 72244 15929 -14699 -17875 -35721 -56711 -86928 -71791 -17336 2887 41389 46390 53174
17138 53174 90957 112363 54152 50620 48020 90985 113004 137494 129079 142802 71078 52378
17126 52378 65924 78106 94073 100686 108359 130172 113358 94016 75868 77246 117298 96497
17114 96497 100576 99080 23191 -27978 -22820 -13522 -30087 -24204 -17500 13465 56839 124074 114899
17101 114899 57855 27247 4484 35758 34291 63717 130037 153562 107187 86840 91777 144878
17089 144878 178117 132823 92998 144018 130032 120117 101991 71977 33070 17022 52768 78202
17077 78202 76210 58193 63160 87633 100899 154148 152324 70049 60276 117479 142448 72380
17065 72380 85839 63242 -35160 -75640 -52918 -15240 9827 39373 39638 13350 27849 92088
17053 92088 119623 126322 67673 76599 100721 73995 114026 128137 142937 103779 66222 3564
17041 3564 -30984 -2047 11571 -23044 -54430 -16339 39183 -11191 18244 71904 95405 110164
17029 110164 117772 242091 225054 117199 97624 71556 21601 13946 -12887 32365 144120
17018 144120 179488 153908 145197 209702 221066 194341 125271 111621 113530 115357 88429 40352
17006 40352 11002 57276 114175 171398 179651 146974 101180 77243 66238 73827 54816 13103
16994 13103 58089 95298 65651 17853 71501 104813 96991 91928 33261 26511 43734 110012
16982 110012 122874 159191 149900 93730 70187 93585 121793 167323 149641 115783 88644 62086
16970 62086 54602 64369 76048 99675 98760 89229 119094 179804 138360 76403 72820 111977 137223
16957 137223 127740 149479 150222 150290 130674 158073 177000 113086 119427 159324 249215 310406 384355
16944 384355 467084 505799 497547 567068 629779 563310 477786 384600 364545 390161 450474 562883
16932 562883 613677 576462 475935 393914 341624 261480 111884 76951 99417 94190 99036
16921 99036 130595 176582 105632 104461 137772 78844 71743 72910 132254 173703 160242 88748
16909 88748 60186 75404 64237 61900 49917 11220 47574 84343 115909 134324 135954 92425
16897 92425 106703 143665 79026 85638 72876 37304 41434 36014 13062 16530 60601 93491
16885 93491 77000 25140 97413 143206 208494 144890 47128 7488 7017 -11195 14501 54469
16873 54469 87699 133025 142430 97607 54600 58462 100137 171396 188049 134267 96850 60789
16861 60789 109419 152262 194458 172562 188401 184167 164535 170040 164321 105323 100167 128812
16849 128812 145902 96009 83892 132737 52417 9114 4472 50557 81916 169178 206276 177094
16837 177094 172311 191441 188312 150252 142334 78746 85007 129442 135621 103602 81292 96071
16825 96071 117156 103692 87366 54357 4548 -6814 17710 -16204 22383 -14309 -9417 28896
16813 28896 65774 68572 85422 107574 83358 85911 56387 59606 55618 38824 3183 53271
16801 53271 76597 58956 47132 81431 96849 105384 124840 129273 131996 185524 214125 222175
16789 222175 189843 133569 106640 129306 114725 118333 114830 106012 165054 153219 93083 90859
16777 90859 79767 51424 18136 23224 106359 140267 130196 122394 71140 44316 14072 -14710
16765 -14710 -4131 39496 51307 58451 68312 63862 -1825 -15515 -18093 28897 14906 15242 1495
16752 1495 -5848 12156 40833 133057 106920 95357 125230 161993 173455 107222 68855 71502
16740 71502 43602 43039 75616 147769 148636 125542 57842 50632 35727 39666 58003 73966 96031
16727 96031 97585 106039 116490 121095 161387 126049 95912 90260 64062 35511 30124 38896 9721
16714 9721 6148 20707 35078 46969 129009 89116 62318 45119 82890 -2070 -21693 -27317
16702 -27317 21253 -4586 -41340 -16064 -19934 -11763 -11594 -5409 7523 68489 25556 47701 132632
16689 132632 150695 115007 89963 82152 94942 102155 100004 108187 70172 40763 43150 44231 113476
16676 113476 131557 89613 123247 140252 73000 40487 108 -24469 -13429 -23403 -30967 2095
16664 2095 9205 18137 27885 29161 52095 47509 71631 103788 78813 33320 69992 89537 49714
16651 49714 40214 71827 59592 -14107 -18625 17551 13094 -279 -25552 -38059 24906 109235
16639 109235 99178 120518 180021 109842 52547 29471 63526 81586 63197 34496 61390
16628 61390 38496 28784 28393 49834 41375 9654 -35781 -4134 -949 -24573 4841 37303 36594
16615 36594 43923 80651 89881 110630 90997 11846 27520 25727 30478 38213 55906 96730 100597
16602 100597 164535 159840 106742 73145 85116 101514 95374 69338 93173 85503 53353 46996
16590 46996 90870 125964 161515 145633 111081 123214 116926 109117 33041 29453 78886 61159
16578 61159 11144 9233 11120 67412 118801 139441 136099 102178 75619 61595 31502 64051
16566 64051 86732 63605 -18404 -43232 -22912 68696 97669 22520 49204 28105 -22304 -75227
16554 -75227 2984 107809 191205 173489 99340 102539 75635 76955 69008 5652 36730 67774
16542 67774 58279 86305 83445 74727 57998 57084 89616 96988 151226 192680 147992 147152 91703
16529 91703 61634 104237 101406 118210 128741 92319 60450 5787 15938 27642 56286 52145
16517 52145 106555 179839 202885 154980 59646 35251 63635 41694 48032 96325 60950 31142
16505 31142 -5005 4919 28376 13157 33105 25745 43516 37059 -22410 25221 50676 55802
16493 55802 99414 60797 18586 15915 29784 83832 121490 105738 67221 36274 49295 34792
16481 34792 47378 -12985 -33425 -9847 44102 22689 50503 70847 82066 98142 45536 40708
16469 40708 73479 64618 141515 154308 69112 54386 61200 34204 -10008 13870 31946 29563
16457 29563 94723 73939 82766 99116 106783 79195 49406 52644 77460 77306 68249 94024 75291
16444 75291 82681 89085 57376 20680 68861 77876 54400 39330 46943 41986 1273 22208 49810
16431 49810 57878 93048 101431 96269 84023 108906 122454 153033 134228 89553 112548 70810
16419 70810 9984 20486 79454 51808 59773 53679 50651 19069 -21333 1894 19704 25530
16407 25530 -1716 -16920 -3478 27547 32805 9564 12932 37795 55036 40351 17610 27566
16395 27566 39899 94339 107435 116500 73015 40314 45305 74495 92195 21767 44462 62914
16383 62914 -31953 -95817 -80786 -49212 -30440 11854 -14528 -23105 26967 21975 1664 7517
16371 7517 -4220 26016 33997 22846 9694 50898 31767 45788 106086 119475 32820 -11641
16359 -11641 17386 67640 78313 104072 70239 70247 94050 72133 95967 88830 43887 13977 -15932
16346 -15932 22509 108452 131294 142536 119480 13781 4841 25449 68542 85786 94990 82761
16334 82761 98730 110667 129737 83061 83651 75246 72164 47724 25503 42874 2068 -29916
16322 -29916 -23866 -949 -6962 7325 27713 3996 30167 1900 13000 -34302 -56451 -5751
16310 -5751 10095 -24938 8740 -1373 30827 74887 19826 -52372 -13793 4444 -41482 -8919
16298 -8919 28228 69913 85609 56885 60178 37880 -785 -7530 -17493 25518 80018 79537 119329
16285 119329 141091 156808 127286 72873 74929 58470 16818 27506 -16024 44841 41996 -1364
16273 -1364 10284 28100 31289 26707 47874 104944 109850 102204 81716 86237 109728 90532 31937
16260 31937 50677 46293 -8430 -9841 38401 53184 34545 71820 93214 108377 29017 6250
16248 6250 6291 1054 27247 88935 139297 141028 94195 80306 31437 -18246 -6380 15445 42643
16235 42643 20141 -26204 -6838 39420 30873 6262 -32082 68174 57270 -16829 29813 117136
16223 117136 77890 77735 39774 6859 -11996 31840 61719 87441 161664 116147 100048 101120
16211 101120 70306 50260 44150 59146 41969 36104 -17813 9784 31106 49510 148824 193487
16199 193487 131535 62826 22712 -25754 -117996 -35947 11004 20177 7971 14601 32390 48485
16187 48485 36541 28898 17124 6811 5899 39012 47909 30320 52557 78390 70821 30517 -56134
16174 -56134 -15726 -35034 -616 22302 34670 48673 65165 36275 29516 15237 12160 23409
16162 23409 33719 60105 29757 -2849 -44945 -27006 -4344 47111 67139 113998 152096 80623
16150 80623 2964 40654 769 2823 49617 32089 12281 25750 87323 62311 -8233 -46668
16138 -46668 -48172 -18728 3965 30577 23526 45532 97739 74350 39928 4862 -15200 -22529
16126 -22529 31029 59202 107242 62085 67565 110130 98243 46078 -7071 -12576 24641 60398
16114 60398 58107 28648 33276 29879 45877 -8548 23535 55756 42904 84024 97851 42983
16102 42983 62920 43996 42503 21002 -27460 -66639 -40516 -15758 27571 72327 92087 44923
16090 44923 -9109 -33211 -32446 -55320 -19148 15248 23514 -18861 6207 -3338 44287 20717
16078 20717 -17569 23915 69119 68389 69057 30391 -14707 -27451 -5958 42208 92347 93242 85370
16065 85370 92810 32753 -1355 17988 29107 15770 6990 43159 27413 -2226 11124 49875
16053 49875 26880 29613 80354 41625 -33216 -64257 -59575 -80408 -59841 -44912 -70603 -31539
16041 -31539 -42016 -37102 -33891 14854 3304 25060 -15086 -56543 -106050 -175959 -168905 -155225
16029 -155225 -118032 -49938 -50802 -83673 -63961 -13660 -8379 -51920 -7980 3861 -52239 -79901
16017 -79901 -67855 -10407 -40726 -25623 -38016 -70792 -53454 -27356 14495 3638 17896 47986
16005 47986 64990 26990 52623 21415 -2569 -56856 -36993 -19618 55589 41460 -14303 30946
15993 30946 60472 67165 39543 35930 13452 -4 -39 -40550 -13776 -42128 -47856 -93991 -97755
15980 -97755 -69603 -55515 -51341 -8938 19834 -16055 -1895 -67901 -12418 45713 16788 -6376
15968 -6376 15413 62031 35531 -3600 -37070 -61260 -25721 -42596 -15100 -2378 23560 42978
15956 42978 -37769 -53013 -7982 42773 82766 125894 94377 -13668 -7794 -43973 -88058 -62589
15944 -62589 -33617 22290 76758 66579 62627 38845 7195 -70246 -75761 -35870 -54958 -65785
15932 -65785 24397 93088 50910 53452 99058 61587 5435 5378 84715 98572 87813 103330
15920 103330 115831 80864 92924 61855 -6774 -41005 -63295 -58755 -57741 -20048 -4393 -46008
15908 -46008 -32097 51515 89675 88230 103949 45801 4600 30727 2415 11973 3931 27303
15896 27303 61948 136048 122685 82325 94670 58759 87343 44592 43641 30158 1545 -12564
15884 -12564 -44902 26631 43178 -15525 -47287 -68734 -26002 25922 27327 6664 -7062 -688
15872 -688 -15360 43287 63108 35649 28539 38425 37434 -28471 -17436 10561 -25261 -43042 -48419
15859 -48419 -78730 -60042 -63289 -61538 -63483 -29401 5936 66519 127667 92543 6875 -19070
15847 -19070 -52215 -88291 -83927 -34751 -536 -17276 57596 44213 3872 10765 26734 70528
15835 70528 81216 78323 130790 93851 -1106 -102383 -192432 -150962 -89084 -96586 -87924 -53685
15823 -53685 -83445 -114256 -112266 -84109 -10269 36298 3100 -20994 -35506 -43958 -13917 -18
15811 -18 12344 -20424 -17081 -44728 -16274 31587 39860 4442 18818 30142 18222 23479 -3335
15798 -3335 -36504 -18107 -51426 -38508 10300 11891 1039 -22456 -56015 -21030 6437 32076
15786 32076 -18807 -88018 -82428 -6759 -37963 -86215 -34203 -25960 9695 65421 32520 67320
15774 67320 51635 -31967 -70750 -20975 5683 -23801 -33648 -10602 -7255 -25080 -13166 -30534
15762 -30534 -23663 -21093 -14538 -1604 36671 12453 15484 22222 -32454 -32521 -52304 -113492 -93137
15749 -93137 -4475 28986 4531 951 55649 11568 -68874 -114836 -95394 -79724 -7867 -52001
15737 -52001 -46391 -25817 -31538 -25807 5779 24517 -1282 24017 28871 -13973 4529 86155
15725 86155 45731 20072 35162 15783 -20284 -49858 -46353 -47649 -51097 -13301 35445 27043
15713 27043 41443 99076 54398 -8511 -32405 -27814 -69095 -48389 -13317 -22701 -47476 -105310
15701 -105310 -139083 -157608 -150909 -86310 -39826 28520 133923 138620 53693 -1838 -31385 -31193
15689 -31193 46286 83211 131715 116692 99774 95813 85841 129046 124561 86883 64784 37135
15677 37135 13354 40006 76134 29923 903 -42735 -77842 -97192 -56415 16597 33132 14454
15665 14454 1135 -8633 -27832 -39869 -38863 -22189 17758 120997 196418 164607 161532 127951
15653 127951 87994 78046 114272 72096 41490 52947 15357 11200 51458 88314 73333 31270
15641 31270 36067 8716 -43727 -40768 -23489 -72384 -165411 -178708 -94559 -9247 23825 6578
15629 6578 20301 38490 48295 48168 -5765 -16920 -10801 -11524 13680 -2145 59532 59495 31132 83840
15615 83840 87756 56531 57931 30481 34827 34171 54428 55892 34379 13047 -6178 4694 29522
15602 29522 30383 -9885 -36893 -28459 -18095 -41443 -21590 -572 -25964 2532 16109 -13398
15590 -13398 -46955 -30641 -10779 -15390 -46990 -30724 -7906 -26500 -39446 -55203 -55912 -75292
15578 -75292 -9006 19136 -36677 -65794 -12295 51999 32922 39331 65169 22228 38024 61781
15566 61781 26872 -54458 -63582 -13725 -14508 -16432 -15321 -88867 -85445 -64700 -45629 -25109 9670
15553 9670 -37807 22202 56385 8917 -20852 -43630 -58741 4594 38577 87428 99381 98827
15541 98827 136142 106844 35633 -610 37867 65967 47296 30574 74088 20160 -62283 -54986
15529 -54986 -68165 -41382 -54866 -106102 -97356 -71741 -29695 -9713 -27088 -41427 -18090 -48938
15517 -48938 -71575 12735 29610 4026 -413 -27350 -71526 -114119 -140177 -79214 -32288 -45160
15505 -45160 -112151 -136548 -124200 -101400 -76952 -26524 59831 28291 -14642 -58382 -46174 -12000
15493 -12000 -31940 -122401 -187693 -156520 -103772 -79333 -44714 -22864 -31918 -77032 -80917 -75699
15481 -75699 -55708 -41528 -4690 42773 58157 52803 19932 42100 40178 35373 -44104 -52733
15469 -52733 465 33876 56673 40403 9947 -6419 39707 70409 14445 -15554 -19509 11609
15457 11609 13460 18091 63965 10619 -26018 9799 16114 20604 20964 -6071 -15487 -17573 -44392
15444 -44392 -82788 -82544 -37856 -83190 -115499 -109832 -59896 -4991 -22196 -33330 -45924 -57612
15432 -57612 -37942 -37122 -30250 15449 11508 19429 -38887 10948 -601 28735 39143 6648 32573
15419 32573 61369 16709 -26819 -58529 -9781 -1962 37928 75486 19243 -1964 -43669 -58733
15407 -58733 -90034 -119467 -85803 -48752 23392 28137 3080 4728 -16514 5701 4762 -2403 -88
15394 -88 28760 71382 113630 68035 30127 5242 17266 -41876 -107276 -105013 -48816 24494
15382 24494 12487 -58906 -65513 -60956 -70211 -33530 -12229 -1555 7381 -62505 -73510 -22987
15370 -22987 -11182 4539 4970 40508 62544 16782 -40405 -107706 -104441 -93681 -69345 -47361
15358 -47361 -70107 -58143 -35256 -20319 -81092 -84425 -80468 -108445 -53658 -12951 -14293 -75870
15346 -75870 -89384 -140779 -131451 -110318 -112280 -61727 -11625 -22794 -22337 4076 47624 97128
15334 97128 52093 -1108 -71859 -81034 -38843 -3682 -26050 -38913 -13157 8707 67334 75746
15322 75746 39780 -8780 -38082 -68071 -57584 -24185 -40522 -39734 -65597 -90761 -59504 -10114
15310 -10114 -20341 -10654 -7099 7947 22666 10996 -15062 -29521 -42906 -32015 61370 105407
15298 105407 68774 45651 52497 27507 -23874 -58807 -111770 -140327 -131285 -69400 -24115 38081
15286 38081 52375 -5998 -14848 25399 24852 -43830 -36373 34973 49150 -21660 -72178 -42391
15274 -42391 -14965 -6326 -2813 -14715 -52934 -57154 -33730 6569 11701 -16218 -36661 -50837
15262 -50837 -32552 -25180 -3911 9899 33486 2972 -25119 60373 92063 101551 73026 15023
15250 15023 -26683 -13203 8959 -20507 15732 50051 45842 9316 -34634 -85371 -107859 -146603
15238 -146603 -129417 -62159 -28680 -921 -34280 -59520 -34715 -19533 11442 22163 -33530
15227 -33530 -22184 7813 9967 51983 80664 17022 -47062 -57320 -26948 -43951 -20023 -10403
15215 -10403 70837 51045 -19125 -29938 -20686 -33658 9518 31071 95173 55974 4736 18780
15203 18780 41039 12891 -11387 -54013 -25094 -35252 -99685 -126895 -91408 -31704 -16628 -26287
15191 -26287 -64984 -41070 -47905 -32582 -6753 -15739 -5206 3660 -5765 -34042 -58497 -60578 -10942
15178 -10942 -23398 -48283 -8106 11511 -9190 -19174 -11265 -6648 -91994 -91102 -31790 -22043 -13773
15165 -13773 17133 1334 358 5651 8145 -5512 -43411 -42957 -51915 -5187 26952 64573 9341
15152 9341 -24173 -48631 -33964 -15238 -43533 -46882 -28163 -17819 -7877 -24062 -49910 -27075
15140 -27075 16292 64690 25435 -37013 -92332 -86508 -38619 8745 53695 70847 54840 35437
15128 35437 -4572 -30972 -8412 -53021 -99290 -49341 17630 -9430 7291 80961 78238 24286
15116 24286 4595 2131 -32817 -83763 -95845 -90708 -57199 -72619 -98971 -74568 -2820 -310
15104 -310 -1032 -17829 -48144 -31117 284 11684 -38 22374 11921 252 23730 17043 23556
15091 23556 32729 9786 22846 5768 -3238 -43100 -70361 -97279 -101232 -76996 -31636 -21278
15079 -21278 47030 55672 16902 14672 -24368 -31326 -28460 -13439 -24871 -49574 -76658 -67587 -60555
15066 -60555 -51153 -57396 -20219 14368 6553 -21562 -27067 -39409 -47054 -50045 -64143 -93964 -40441
15053 -40441 -26240 -30059 -108905 -149451 -159853 -167834 -141513 -114806 -92937 -62368 -48130 -23251
15041 -23251 -65193 -69354 -77261 -90704 -109333 -90705 -5551 9286 -68726 -130817 -106217 -86810
15029 -86810 -76146 -39525 -18167 -52061 -53616 -23619 -24350 -60995 -72651 -78454 -73859 -58018 -27255
15016 -27255 -74780 -71476 -42646 -11295 39 -23159 -26641 -2249 -7622 -55459 -28392 -69604
15004 -69604 -122213 -57150 -29073 -21761 -42757 -101786 -134140 -97453 -75805 -79659 -126404 -180398
14992 -180398 -181433 -120051 -94072 -97423 -83720 -35595 -107719 -185683 -107197 -59692 -21126 1463
14980 1463 12563 19036 37395 88980 41931 -25945 -9195 3293 -5193 3084 48519 23882
14968 23882 -41616 -15793 17780 10986 13527 10542 25434 21762 42825 -51751 -70180 -65460 -29274
14955 -29274 -28132 -27866 -3953 24456 19089 -28626 -75767 -102470 -100887 -69776 -48687 20709 20521
14942 20521 -37771 -48350 -35356 -19652 -18890 -32445 -65202 -64179 -48307 -36448 -13846 6628
14930 6628 92471 97897 69130 88085 39122 29683 -24155 -90647 -29411 33048 3194 -27340
14918 -27340 -50962 -58261 -16415 -12443 -47651 -9662 15288 -7289 -95127 -74265 -90477 -41387
14906 -41387 33765 72025 68014 48299 -3564 -77503 -70078 -95576 -47790 -25095 -69383 -47674
14894 -47674 -31894 -61782 -75874 -65256 -40839 -42527 -116463 -126612 -52939 -36304 -37542 6287
14882 6287 -53758 -107894 -74024 -34806 -46256 -22787 -59249 -42716 -3913 -33245 -44961 -52045
14870 -52045 -101378 -81480 -61149 -78736 -96339 -172801 -183111 -144709 -85800 -46242 -66864 -79952
14858 -79952 -122295 -179896 -182640 -125540 -59241 -44264 -31926 -46782 -3646 -3406 -67043 -47492
14846 -47492 -71551 -51616 -6883 -16091 -66912 -82836 -28103 -63906 -74668 -66883 -45766 -58841
14834 -58841 -64077 -71885 -104097 -53992 -54087 -97238 -77370 -73473 -92840 -92083 -72298 -62098 -57660
14821 -57660 -71559 -121862 -64527 -38954 -1750 32272 44868 35584 68175 72621 75460 53437
14809 53437 5530 -24210 -37589 -20103 -7403 -10060 -13897 -14141 1196 -38837 -82495 11573
14797 11573 30533 40851 10377 15911 -14714 -94754 -84326 -94819 -84313 -79270 -43504 -13201
14785 -13201 9203 -3104 6372 -26420 -96545 -67169 -109195 -117079 -105454 -77998 -4684 24673
14773 24673 57080 41795 9722 77131 20132 -64252 -108201 -83841 -26328 36165 17973 11578
14761 11578 26033 55506 49299 49344 54128 66979 244 -21113 -3744 -20234 -79826 -100173 -48676
14748 -48676 -40074 -51069 -115707 -137360 -154983 -150058 -108023 -56177 -70565 -68020 -82873 -92419
14736 -92419 -73198 -64254 -37542 -66132 -41693 -11755 -15404 -2045 11280 7651 -26501 -52351
14724 -52351 -60561 -94329 -12233 61885 83004 78111 135472 97684 -10564 -44311 -58150 -58604
14712 -58604 -20360 -9901 -7664 60426 46454 1523 12368 12546 49897 2678 7996 -50395
14700 -50395 -62538 -30002 -9911 -16569 20241 39369 55615 75093 57611 89983 93187 72096
14688 72096 79932 76751 96871 85877 84569 53644 30019 -9259 -6697 12309 39614 19892
14676 19892 23215 8461 -44214 -32204 25426 23426 -1061 -50655 -94629 -100653 -41362 12961
14664 12961 -8139 -56232 -44870 -32383 -41952 -66703 -53792 -24499 7302 -25403 -33386 10847
14652 10847 12654 -7151 71086 120449 99602 61096 -62506 -102712 -70974 11555 43508 38025
14640 38025 65898 57596 89265 42435 -61610 -119882 -78806 -25020 20954 41446 10484 -35483
14628 -35483 -8260 21150 -3847 28073 14625 -26612 -41289 14050 15944 -17125 -39405 -67286
14616 -67286 -83061 -80853 -76529 -100464 -156679 -112940 -69243 -79611 -55510 -18343 32644 23542
14604 23542 22940 4254 -27557 -125219 -129915 -102618 -81360 -38813 -26968 -33007 -33347 -56342 -60103
14591 -60103 -95044 -47346 37519 12644 -33893 -53420 -44027 -53383 -32657 -54222 -1391 47510
14579 47510 10009 -17858 7279 -4233 13457 -18979 -32214 -38958 -26511 25027 27223 -33432
14567 -33432 -59831 13825 1898 -50539 -31209 -53066 -52325 -48255 -32552 20793 33593 -18945
14555 -18945 -30458 -31326 -28078 -23216 -2873 -11611 -10298 8691 -13196 -37848 -14026 5696 -7567
14542 -7567 21639 43023 4086 -56005 -66733 -89525 -45475 -25516 -7054 19701 28420 -27527
14530 -27527 -75430 -65462 -11160 -35671 -38802 -42875 -87968 -66059 -79575 -74392 -57981 -15358
14518 -15358 71085 29352 -22797 -37334 -39820 -60522 -67233 -59064 -31621 -34004 -25470 1532 -68963
14505 -68963 -39951 -35497 -43105 -75125 -115964 -108816 -101672 -39255 -17992 -84725 -71717 -81809
14493 -81809 -136228 -100060 -37662 -49827 -78452 -77628 -75681 -69219 -53723 -47082 -2734 21516 -5356
14480 -5356 -24147 -7304 -2180 6379 -1832 -42287 -81710 -1340 38836 24012 -4842 -33221
14468 -33221 -14521 13493 11778 -8126 -49643 -70529 -105122 -130711 -93167 -70871 -60949 -27771
14456 -27771 -9271 -2182 -34435 -48620 -68540 -116753 -92158 -1345 18586 13444 -14685 14763
14444 14763 29108 17302 10556 -5094 -3527 -61892 -87150 -108197 -80339 -101407 -118511 -104771
14432 -104771 -54398 -60329 -94610 -69187 -35817 -27754 -3169 -34136 -72653 -65195 -56602 -68074
14420 -68074 -40697 -15324 -55780 -103737 -83090 -57633 -41407 -12180 49865 -14961 -45123 -49675
14408 -49675 -47538 -38838 -16601 20995 -46542 -69156 -40138 -31942 -27530 19742 -22728 -84755
14396 -84755 -80621 -74892 -86356 -39728 -29418 -27347 -6653 28669 45980 7480 10008 -47269
14384 -47269 -81604 -60044 -11315 -991 -5499 -37313 -15545 -14466 -12159 -27854 -49011 -7725
14372 -7725 6897 -13888 -22826 -21636 -19361 -66033 -16042 10106 61120 33663 39069 37338 30095
14359 30095 12864 17091 12007 33924 69431 44444 10237 -77472 -118337 -80816 -36531 -25767
14347 -25767 -28512 -68351 -96266 -30894 10328 26105 -10003 -45097 -45156 -24304 -81552 -107042
14335 -107042 -124806 -110731 -105866 -148495 -148445 -63340 -14593 -57895 -71228 -69168 -9359 -20875
14323 -20875 -62763 -94734 -47883 38546 100107 95938 55079 -5070 -48712 -31943 -36497 -76814
14311 -76814 -50640 -24087 -27682 -30399 -64200 -92788 -55456 -41041 -5336 70760 51612 35163
14299 35163 34659 822 -1275 -30526 10645 8814 -34174 -50743 -43631 -44822 -57838 -80024 -54641
14286 -54641 -18784 -15640 36433 50856 74209 134571 145026 129429 48752 -5066 -5120 -60527
14274 -60527 -50844 -46722 -87285 -78330 -20147 -28849 -38403 11444 -22722 -97217 -92817 -43182 -38522
14261 -38522 -40526 7355 -32952 -104105 -113027 -64772 -31360 -52238 -17490 -2004 -12896 -15179
14249 -15179 -21201 -50061 -21964 47661 69093 57894 18135 -54031 -61878 -58832 -90408 -109189
14237 -109189 -114634 7463 92386 74182 -32007 -74438 -28371 -41150 -9836 -13242 -26157
14226 -26157 -3895 -31913 -75594 -66019 -23677 -51090 -53753 -21841 7036 -32709 -52501 20797
14214 20797 118936 101967 27421 -47988 -22350 -8853 -4427 29745 71993 65672 37080 -40275
14202 -40275 -29760 -26580 -32049 -32176 -73375 -96004 -76417 -52597 -29908 21694 12646 -27946 -26938
14189 -26938 -71711 -68491 14072 70650 3633 -56970 -61971 -73018 -84836 -30667 -38165 -40479
14177 -40479 -21610 -4848 -29241 53223 55282 15474 3030 -32243 -24850 -22199 -22228 -40985 -19676
14164 -19676 -1027 5944 928 5565 -18194 -75874 -29010 -52283 -20526 -8757 -29133 -1458
14152 -1458 21981 14178 -48124 -73352 -122575 -81145 -42951 -39563 -111154 -128157 -117875 -62838
14140 -62838 -32715 -16464 5974 11965 -29450 -52327 14804 20433 -34956 50236 52767 -16061
14128 -16061 -39063 -95099 -78416 -88497 -43994 -30162 -1479 -3001 -54640 -38148 -65724 -54671
14116 -54671 -33916 2801 -5820 7232 -36193 -46371 -4545 -16415 -48812 -41166 -72940 -139404
14104 -139404 -152089 -78163 -63071 -51863 -25006 -14014 -58130 -94999 -78837 -77505 -77980 -95095
14092 -95095 -151888 -119534 -140010 -151195 -57800 -52542 -58454 -57090 -102969 -102420 -15254 39779 40122
14079 40122 48684 -4084 -38996 -62005 -35859 24682 54183 38334 16925 -11503 -27110 -53156
14067 -53156 -114865 -73844 -55454 -34980 5408 86853 70877 67825 19793 -1334 2109 -14095
14055 -14095 -2377 -6527 -40440 -36425 -52914 -40539 8028 5397 -11395 -22663 -40708 18066
14043 18066 32852 -13095 -30739 -14970 -21603 23732 15827 57053 127836 123554 109463 9092
14031 9092 -97429 -106417 -70564 -58154 -43376 -25232 -38697 -71031 -62435 -66652 -49417 1523
14019 1523 44849 40576 32624 16480 -6787 -33173 -56155 -25004 6194 -2478 8352 23609
14007 23609 28650 -26534 -1627 -14565 -16528 -24383 -35403 -32674 -14694 -69687 -51060 -40780
13995 -40780 -86061 -96102 -78854 -71907 -45582 -75614 -64530 -41801 -63799 -34869 -30422 -42217
13983 -42217 -90916 -26755 -71944 -141153 -137770 -69341 -286 2949 -16393 -29978 -23043 -26534
13971 -26534 -62932 -55517 -41698 -46794 -4151 18523 15679 -37970 -67568 -40924 -40900 -22747 -58112
13958 -58112 -27279 -30458 -80919 -114298 -139320 -127876 -131752 -107238 -44739 7994 44065 30477
13946 30477 -3804 -49886 -59021 -21444 -26796 -49269 -67341 -31405 -21543 -25059 -24686 -16714 -25775
13933 -25775 -41433 -70934 -75604 -87971 -75678 -54084 -35620 -12301 -17085 -86982 -123440 -115285
13921 -115285 -61585 -12171 -3064 6834 28849 25655 -15274 -32371 -80990 -84356 -67494 -3142
13909 -3142 9004 -39997 -29789 -21555 -87822 -107843 -103236 -92924 -154914 -169539 -193246 -186116
13897 -186116 -183222 -145829 -112768 -106470 -114145 -36957 3434 -3136 -687 -25110 10528 -8236
13885 -8236 -58240 -58090 -51187 -31483 -31141 31796 7875 -50687 -27298 -29488 -38864 -64457 -60940
13872 -60940 -26228 -84151 -105629 -104438 -124734 -59089 -17730 18143 47625 64615 53463 -23148
13860 -23148 -83222 -64417 -2901 -19656 -46726 -52543 -66609 -77247 -72778 -64834 -91091 -107779
13848 -107779 -105948 -82309 -116937 -160649 -115637 -75061 -76389 -156591 -174847 -124314 -74197 -64807
13836 -64807 -51583 -32415 -48642 -99192 -47357 702 14930 17955 -8301 3680 -29814 -66551
13824 -66551 -42772 -12129 -20903 -9337 -62688 -82998 -41641 -39214 -54030 -30639 9772 6494
13812 6494 -32349 -39787 2000 -16943 -34545 11848 -1731 -48035 -59135 -46591 -41931 -55476
13800 -55476 -46350 -39762 -15265 -16158 -72894 -90173 -157752 -158660 -125599 -83424 -49498 -30605 -27044
13787 -27044 -14472 -22384 -36599 -32717 -47674 -69060 -66930 -67825 -105104 -88943 -70316 -53601 -37328
13774 -37328 -25847 -99384 -80601 -84532 -88134 -63331 -127913 -134164 -128523 -107497 -60533 -30672
13762 -30672 -12676 8448 -21 16429 31221 53611 33092 -7537 2236 2973 -19621 -50237
13750 -50237 -58491 -89811 -97353 -120489 -153741 -111276 -81341 -34232 -37643 -12807 -11162 -68172
13738 -68172 -87273 -72253 -61837 -1321 -19303 -43624 2556 -30713 -68359 -38599 -97225 -165223
13726 -165223 -153141 -93632 -1632 -658 -48839 -21467 -15873 -5943 -34800 -59304 -85652 -42758
13714 -42758 -65335 -71635 -15809 25692 21604 24615 -3661 -65756 -106883 -127946 -46966 -13164
13702 -13164 -72938 -109944 -101123 -109116 -100251 -90030 -67974 -51292 -36547 16099 17571 19424 20920
13689 20920 37999 41637 -51126 -63436 -18484 17382 8265 -42228 -84003 -106920 -112843 -60972
13677 -60972 10318 -19361 -18161 11994 -31728 -23177 58609 72584 65958 93741 109700 52896
13665 52896 71306 98492 143228 126909 71868 119474 101271 17583 -30711 -27468 -8410 2968
13653 2968 24328 45028 41547 54472 78350 79933 2594 -20740 -13579 -49585 -70826 -24979
13641 -24979 -32344 948 38509 19387 30214 18763 -9868 -9976 -37518 -102406 -103907 -47023
13629 -47023 10572 5716 -10656 -58875 -75507 -8160 39528 57264 60695 35549 10942 -1492
13617 -1492 -24993 -13271 28326 17937 2129 -4020 -32994 -48603 -57230 -20190 10814 74965
13605 74965 50409 -49805 -132533 -115296 -45075 30695 74927 129857 104524 107068 58553 50802
13593 50802 66425 89009 27741 -9971 -28969 -50243 -101083 -135454 -60629 22120 9815 -39089
13581 -39089 -18832 -62206 -14569 -9473 12301 -26057 -43717 -50696 -30557 7388 34445 54522
13569 54522 47456 -30251 -72902 -21582 -11433 21592 -2071 -33034 -90485 -70571 -49800 -47161
13557 -47161 -33183 -87655 -100343 -98129 -112334 -69507 -51801 -10809 -20239 -30723 -75735 -46347
13545 -46347 -1443 -32104 -83316 -59345 -40660 -64588 -23056 -61295 -60054 -4878 8310 19072
13533 19072 -25032 4807 -9810 -53286 -67724 -64117 12469 4822 -31400 -92398 -60961 -26483
13521 -26483 -42496 -48978 25494 8641 -56765 -57849 -26894 2857 -40364 -70378 -43348 -30906
13509 -30906 -31449 -5919 -37691 -69880 -87832 -45805 -14419 8821 4324 -23771 -41133 26782
13497 26782 -13668 -31567 -105032 -108551 -53325 -43755 40739 62236 11172 -30109 -61479 -87557
13485 -87557 -67128 -110741 -92508 -111959 -150331 -119566 -73502 -390 -36341 -80892 -48819 1613
13473 1613 23564 27594 -18007 -55711 -53292 -9251 -23109 6341 -17004 -85704 -94265 -63985
13461 -63985 -8172 35508 21055 47605 -13465 -28137 -34623 -55813 -54651 -35217 12217 -6109
13449 -6109 -2139 -9316 -59047 -103556 -4432 29005 -1534 -43040 -23464 -58398 -154064 -114787
13437 -114787 -92038 -76423 -120491 -164284 -167038 -138423 -39481 -876 -35337 -59722 -27559 -50455
13425 -50455 -74455 -39601 15242 3926 35122 47439 19796 -22226 -52498 -34996 -40645 -81954
13413 -81954 -97959 -71367 -77745 -75018 -55125 -40993 -50217 -93322 -53031 12696 6933 13426 2784
13400 2784 -35486 -76297 -72961 -64457 -59045 -85174 -83040 -30781 -43124 -70669 -67039 -39551 -69411
13387 -69411 -68090 -66647 -54925 -101333 -100035 -104218 -140782 -126355 -116378 -84881 -75962 -41521 -51216
13374 -51216 -100535 -78660 -38916 -21661 87968 89853 7930 -19166 -43373 -97440 -141003 -115380
13362 -115380 -92136 -51753 32026 21917 12872 2963 -69797 -102903 -62020 -11134 -42893 -37073
13350 -37073 -26998 -27621 -31898 -14225 -24740 -4864 3304 -46662 -78250 -95844 -72966 -94780
13338 -94780 -141950 -127019 -87207 -85953 -112533 -134972 -108987 -33079 -45245 -42666 -48953 -70225
13326 -70225 -70367 -42804 -17192 17360 38140 45931 71243 18887 -14278 -52726 -65790 -28887
13314 -28887 -19447 -16307 1999 -36772 -38254 -34218 -54473 -95916 -73940 -40182 20534 25032 -13584
13301 -13584 -55785 -58541 -28635 10556 -27089 -111965 -84906 -97062 -132848 -150294 -106132 -69181
13289 -69181 -55754 -44691 -125934 -88708 -76029 -76411 -44481 851 34136 53496 9912 -21654
13277 -21654 -27454 -9494 -903 3044 37125 57086 3604 -25811 -20305 -76665 -81923 -108880 -90239
13264 -90239 -74206 -67807 -54334 -57968 -78785 -108611 -111340 -55562 -3586 -34281 -70778 -67032
13252 -67032 -37842 -43544 -82417 -96662 -84850 -88791 -82960 -18206 -8541 -44207 -47087 29106 71614
13239 71614 98531 96132 69061 -16354 -98112 -91281 -60246 -69807 -8136 4383 45060 76940
13227 76940 113106 69063 -23600 -58563 -11895 1316 29497 20684 16529 -27853 -61536 -114909
13215 -114909 -69362 14448 5680 -51358 -39405 -27993 -46465 -3571 56594 43727 4067 -29953
13203 -29953 -63707 -48437 -43855 13746 -4471 -54467 -66058 -48703 12732 41140 87280 42915
13191 42915 -32830 -90175 -113313 -92998 -31153 32951 47821 44995 52144 67980 73796 35553
13179 35553 52727 58222 71471 74779 29090 -28086 -33481 6847 -24469 -26335 46750 68167
13167 68167 44579 29804 -5056 -22099 -42774 -62871 -84983 -71196 -48695 5530 149 -5873
13155 -5873 -9366 -6455 -41343 -84551 -96555 -83764 -44230 -19352 20152 17873 -10373 14850
13143 14850 3483 13535 -20582 -34108 36110 79465 77407 17449 -59976 -74967 -43082 10452
13131 10452 10817 26029 12076 -21237 -23598 6655 79731 68777 -60865 -65458 -51388 -50118
13119 -50118 -87755 -127827 -138041 -158936 -100932 -70611 -39425 -12827 -50921 -19287 -48330 -47901
13107 -47901 -94627 -143899 -111960 -134885 -149734 -123145 -54066 19776 15211 41702 13650 -17931
13095 -17931 8565 -64810 -102569 -84444 -57483 -81052 -118546 -152249 -91611 -43076 -28777 -10538
13083 -10538 -72247 -115446 -99981 -40948 -58076 -69176 -81122 -102670 -122232 -88193 -46642 -81672
13071 -81672 -60430 -2226 12966 32914 74221 46167 21036 43679 49670 67626 8225 -43183
13059 -43183 -36524 -35614 -31856 -62499 -62178 -38738 -16791 -7953 31014 44027 7549 -20491 -79876
13046 -79876 -41532 -33411 -44174 -25867 -31720 -56882 -32003 -84014 -85795 -46733 -22234 -48986
13034 -48986 -24659 -56719 -26318 8708 -1869 -77065 -88902 -68475 -30604 -54364 -64389 -30244
13022 -30244 -9669 -53330 -29632 -25051 17927 2589 -65219 -41132 -32244 -91223 -125360 -109727
13010 -109727 -75733 -39305 -44061 -852 -2437 -3922 31889 93192 78135 16205 -25543 1962
12998 1962 53037 41075 19764 -29810 -79683 -52315 -50245 -67612 -87013 -130297 -128028 -142782
12986 -142782 -130729 -104981 -50954 -89722 -95456 -130012 -71031 6420 5732 -9218 -53119 -60357
12974 -60357 -54430 -55378 -50308 -18518 -42496 -21206 -52746 -57612 -46949 -73180 -64975 -7984 -61254
12961 -61254 -74060 -60818 -34240 -22081 -83430 -95734 -63674 -85592 -109188 -59650 -2594 -48
12949 -48 -31148 -5658 -29249 -72311 -93728 -55293 -55382 -62956 -79210 -59126 -56839 -58901 -79982
12936 -79982 -39078 -15624 -51089 -68697 -36485 -25793 -71907 -133687 -213250 -185021 -132562 -77989
12924 -77989 -60833 -79777 -75047 -49018 -88313 -114095 -124209 -129209 -127670 -133056 -103219 -38385
12912 -38385 3941 -85 42441 -414 -53456 -91831 -15003 15079 30437 -13869 -33227 -50068
12900 -50068 -21849 21853 -633 -39067 -48655 -16377 -15143 -58207 -76087 -89516 -91671 -47485
12888 -47485 -67750 -51789 -69869 -97023 -86040 -80290 -50721 14801 -1896 -41419 -32583 -61782
12876 -61782 -52659 -73974 -62639 -31412 38679 71664 82486 79360 23311 -12565 -19277 -34627
12864 -34627 -63289 -115782 -139593 -87623 -83665 -80789 -45506 14611 10740 32605 76936 55218
12852 55218 3561 -49659 -48035 -39231 -53579 -25847 10978 4806 58406 80750 25256 -23004
12840 -23004 -41465 -10803 -6574 -19338 43522 24 -74786 -65472 -74638 10795 15217 7624 -45941
12827 -45941 -63289 -40721 -24492 -23087 -85405 -108361 -151883 -92586 -2872 5813 5297 -27397
12815 -27397 -39391 -10042 -49979 -94897 -125543 -84745 -61269 -63970 -71053 -18353 -83193 -119682
12803 -119682 -151665 -104497 -37048 -2902 27891 16640 -54665 -37789 -19238 -44392 -114749
12792 -114749 -102445 -70345 -49196 -44354 -13534 65944 82160 65381 20756 22622 -21754 -99151
12780 -99151 -92179 -46703 -30727 -29588 -31784 155 -11747 -7520 -12800 41704 69000 67465 69537
12767 69537 53788 1867 -21774 -44284 -89505 -56404 14261 33488 4094 -53782 -53835 -70627
12755 -70627 -88361 -29844 -47894 -59827 -43462 -27499 21543 59936 29953 15006 -94474
12744 -94474 -105203 -63401 -55797 -33138 -60921 -47256 16526 64043 50634 21327 8052 16634
12732 16634 -19529 -46719 -59251 -103704 -92279 -86633 -92374 -111236 -106568 -86148 -130420 -146075
12720 -146075 -83661 -57516 -61514 -51821 -18800 -44958 -54696 -87070 -130513 -128949 -60193 -31936
12708 -31936 -53070 -95283 -101383 -91869 -65526 -69905 -57802 -10311 -15743 -71104 -56448 -680
12696 -680 -36034 -47995 -44988 5982 41423 99236 82909 37380 -12974 -32717 -10703 -31442
12684 -31442 -8853 17337 69253 55752 52490 24754 25015 3323 -49186 -61413 -67677 -90077
12672 -90077 -71926 -18553 45836 51529 25707 11824 32224 45160 -729 -32739 41130 91837
12660 91837 81134 52005 -8226 -38651 -81613 -62958 -84347 -97784 -107927 -35259 -26858 5554
12648 5554 -10040 -82128 -68667 -24335 380 1392 24101 55214 43778 -12590 -75432 -172584
12636 -172584 -210545 -192592 -114850 -48969 -25996 -18270 -28023 -14417 -20912 -45393 -31292 -50374
12624 -50374 -83197 -58944 -21229 -17726 -48835 -73469 -109769 -86526 -57550 -32861 53240 75491
12612 75491 40845 -4544 -27840 -48564 -37583 -66594 -89174 -106189 -69966 -23071 -43041 -68329
12600 -68329 -83714 -102551 -54018 -47159 -73443 -75246 -86475 -129951 -75858 -57365 -78659 -132325
12588 -132325 -135839 -163370 -144083 -50693 -16833 -12966 -28507 -55631 -28529 -31984 -85353 -52630
12576 -52630 -16451 -43818 -40079 -14033 -9303 -51733 -40116 -29319 -88769 -68277 -50913 -49077
12564 -49077 -21437 24814 54857 22079 30414 40022 -36240 -46481 -76211 -134034 -189295 -199919
12552 -199919 -134709 -68461 -51097 -84069 -76240 -53544 8778 52611 42980 39505 13827 2051
12540 2051 -5748 24168 61099 91866 69710 34681 -9031 -62703 -43534 -46752 -71947 -79052
12528 -79052 -97423 -21004 36690 -32263 -58680 -30609 -8191 17262 -18506 52357 101315 75392
12516 75392 35966 2917 40660 14331 19710 99661 63602 -3120 -9763 4580 -13479 -93476
12504 -93476 -122412 -71379 -15258 4804 4597 49453 92065 76794 56230 -8615 -25411 -9377
12492 -9377 11358 90367 138783 101701 52113 69981 51600 -26381 -55911 -75298 -125471 -105467
12480 -105467 -32451 -10574 -16898 -14524 14544 -25466 -64662 -14841 4741 -27286 -25123 -1111
12468 -1111 -7355 20894 78941 52932 -1420 26295 36956 -26341 -75788 -65815 -33535 -12431
12456 -12431 -14139 -10782 -4435 -11704 -26740 19674 21638 63825 49630 8276 -14776 -37956 -20023
12443 -20023 57718 113837 46998 24693 -20625 -74995 -104744 -102152 -48233 29076 -12244 -79078
12431 -79078 -98274 -96034 -29169 -55084 -31107 -78853 -101819 -22285 59050 81112 16144 10754
12419 10754 32390 35905 -31110 5570 3098 22773 7484 -8759 21060 -36194 -31173 -41684
12407 -41684 -105142 -67396 -58288 -109903 -113602 -132372 -92560 -59017 -55259 -63005 -69385 -18994 -13051
12394 -13051 -77021 -121430 -91704 -50581 -69660 -636 10612 -40099 -69957 -66811 -103306 -82410
12382 -82410 -76343 -51577 -41698 -9671 -18773 -29301 25311 35228 -54019 -117677 -96460 -57346
12370 -57346 -63912 -76372 -128968 -65973 -86894 -143833 -153972 -111188 -64938 -65514 -110307 -100989
12358 -100989 -85267 -45521 -58150 -71299 -56197 -51019 -52513 -106368 -62248 26978 5093 -17526
12346 -17526 -37437 -59915 -73775 -79910 -74536 -30307 -65444 -92937 -101223 -127082 -153452 -86883
12334 -86883 -51251 -57134 -27751 -37220 21880 28548 22199 42125 54422 9279 18461 57801 41618
12321 41618 -22503 -76628 -93068 -51708 20831 48839 19862 41026 9173 32843 57237 16723
12309 16723 -57172 -44055 6710 24511 3088 -11106 -27640 -13467 -34988 -62447 -78657 -88311
12297 -88311 -74967 -57349 -82183 -185551 -187573 -127346 -64629 -2324 -702 2728 -10179 -1823
12285 -1823 29905 -3934 -375 -47353 -1839 -4072 52915 98809 101344 69959 9424 -58387
12273 -58387 -68726 -55432 -64183 -40890 -54469 -72907 -68281 -60495 -101053 -87808 -110754 -108066
12261 -108066 -63429 -45175 -57130 62836 33323 12345 -10448 -67537 -33274 10970 -39795
12250 -39795 -70398 -29374 -67301 -65894 -77662 -52389 -67211 -67318 -35116 -34357 -38325 -47551 -14943
12237 -14943 -14862 18143 34784 13599 -20572 3003 33783 17059 42999 17761 -6632 22257
12225 22257 53405 63369 71824 86991 28042 38413 85430 32828 -20079 -46144 -9896 7423
12213 7423 15951 -20216 -4703 13503 -50807 -66458 -117127 -119986 -90092 -59819 -83024 -58073
12201 -58073 -18300 -27903 -44080 3342 46842 27182 -2688 -31857 -58373 11628 -16819 -40872
12189 -40872 -46032 -48066 -102027 -93006 -11112 22099 39051 -4709 -27208 -44330 43467 103431
12177 103431 29677 -22028 -14997 -62387 -75041 -48504 -29931 -61178 -85000 -58001 14269 -64693
12165 -64693 -131396 -71669 -18285 -673 32325 -568 -48101 -65291 -22393 -28252 -50121 -35981
12153 -35981 -28866 13192 45207 50449 -47873 -77031 -54036 -57759 -59949 -120565 -143688 -134123 -55750
12140 -55750 -19898 -41757 5087 59539 -34098 -74563 -37374 -43081 -17941 -83559 -134904 -156049
12128 -156049 -107760 -105646 -177593 -158340 -130968 -95131 -62693 -39593 -32032 22678 57153 48802
12116 48802 8703 -10825 -43380 -57963 -59424 -67495 -93135 -57074 -58796 -42717 8244 44786
12104 44786 43841 58765 50475 13240 51275 99555 50097 -28655 -95580 -178462 -54247 38064
12092 38064 14728 -21910 -28832 9445 -11635 -64215 -24142 -4912 10534 -14804 -13507 -6890
12080 -6890 21506 66951 57474 76126 56637 -19665 -10269 21579 18659 -16461 -73119 -83057 18052
12067 18052 62338 60766 7534 -39353 -30109 -25164 -36408 -34362 7734 70021 35484 340
12055 340 11492 44571 40971 47733 66805 56992 24151 -32430 -58367 -126760 -167166 -137501 -104031
12042 -104031 -63058 -80604 -128916 -93070 -41299 -10507 38740 71861 74149 56111 58035 44414
12030 44414 51325 86106 59375 27401 40317 108567 81694 54639 10613 -61151 -70606 -123870
12018 -123870 -99144 -88919 -86668 -75302 -62714 -32251 44916 54065 41894 37299 21628 -26523
12006 -26523 12077 20978 -14905 -13201 -42979 -40152 -20195 -18026 70089 108426 9410 -23701
11994 -23701 -12467 -45517 -58287 -71889 -51794 -73116 -129592 -149294 -128369 -51951 -2415 57297
11982 57297 99895 95992 90581 10941 -36612 1580 6818 -35560 6 -8861 1092 30718 38993
11969 38993 -32012 -21250 10061 4640 -5816 15253 18559 -7936 -1271 4946 54679 63144 15855
11956 15855 5828 -14858 -38613 -29422 -38433 -26229 -78427 -95457 -128038 -101153 -66809 -87129
11944 -87129 -114053 -120272 -86992 -86210 -150939 -127194 -76111 -55298 -50421 -46068 -26046 -20733 -64372
11931 -64372 -89011 -67168 -67302 -93123 -88513 -87453 -72592 -22665 23866 -7371 -32830 -17701
11919 -17701 -15181 -8171 -2666 -4874 -35752 -48616 -20653 -27281 -14546 5774 14239 -5288 -46153
11906 -46153 -22353 7457 27935 19704 31778 -6016 -70088 -20872 -40547 -102611 -78918 -19097
11894 -19097 27624 -35958 -111991 -66401 -50427 -28850 -30461 -57859 -64029 -23179 -33027 -42442
11882 -42442 -9602 -13445 -56631 -79004 -58565 55128 86926 45365 7964 8082 -7674 -46810
11870 -46810 -43475 12166 34255 4578 12629 83300 90418 105590 44880 -13803 20051 65865
11858 65865 83295 62433 39196 7402 -862 20456 54440 75093 78950 34986 29438 21094
11846 21094 -12644 3416 7248 -13459 8131 57865 28807 -1581 11334 35839 77330 53315
11834 53315 39114 64457 62503 45635 77378 114564 38183 1538 14220 -37109 9952 6600
11822 6600 33784 99627 30203 26104 50874 36173 96372 42267 -3404 -32823 -46248 -87809
11810 -87809 -94720 -40149 -13630 -5768 83073 111069 88331 58649 72535 39380 10955 7080
11798 7080 -24048 -95870 -152622 -57929 -36780 -66882 -77967 -83087 -77328 -30316 250 -56950
11786 -56950 -58103 -17377 -18910 -5430 41137 15771 9721 79081 105405 88123 11486 -41377
11774 -41377 -65720 -60558 -70465 -70568 -71747 -39440 -32705 -84790 -145296 -84412 -24982 -22195 -10361
11761 -10361 -30062 -729 15594 52944 38792 -4773 -85937 -110777 -66191 -55287 -42223 -60160
11749 -60160 -68993 -10693 -14947 -38309 -15667 -3786 9084 19564 64424 79785 43603 35114
11737 35114 100301 105037 99266 26614 -55054 -46516 -74375 -69663 -31300 -32867 -79154 -139108 -101179
11724 -101179 -52077 -39134 -17790 44660 111640 161895 144807 110651 60235 50005 -10832
11713 -10832 9021 14068 42162 12922 -34536 -31445 -42535 6539 -22504 -16631 -7467 47723
11701 47723 36341 -33719 -31784 -24430 -70251 -86242 -16814 -707 -21262 -33638 -39869 -38991 -43657
11688 -43657 -46260 -27580 3059 -38378 -80022 -99264 -40545 -3474 -16058 -81134 -97174 -84804
11676 -84804 -56716 -20552 -3570 -19667 29324 60040 40788 58818 104272 98124 57247 31678
11664 31678 44495 81133 78357 80692 118801 171745 229479 190234 218530 291534 410111 511207
11652 511207 635290 662887 744663 1030233 1410121 2007231 3005327 4721842 7514609 10282398
11642 10282398 10002945 7649569 5464621 3664976 2422168 1641539 1220808 1013370 825474
11633 825474 618705 472657 409565 278112 214361 180430 120696 116684 72771 37144 9029
11622 9029 49333 18136 30308 35117 25141 42919 89156 82437 22226 11069 60111 99440
11610 99440 57584 -1449 -15131 -60787 -89214 -78148 -28763 -13403 -20981 9232 -21820 -26267
11598 -26267 48777 84858 49847 918 -9790 7298 -3145 -25560 -57392 -65358 -41399 -50174
11586 -50174 -89415 -79175 -46386 -9653 -25166 -13596 23625 30893 23090 51366 59585 60652
11574 60652 48331 49715 43392 -486 5036 82500 42446 48461 39475 67609 41565 23688 54939
11561 54939 55524 50391 22656 -8163 -33955 -34589 -60885 -51097 13008 8669 848 -28321 -42285
11548 -42285 -61921 -62735 -17035 51589 70762 12372 26307 29003 -4979 -64454 -35643 -6318
11536 -6318 16854 -19120 219 26519 31620 62634 73067 43428 31859 26488 31827 -39329
11524 -39329 -66568 -29785 -3345 -21822 25803 22229 56781 74925 76875 62739 28773 53095
11512 53095 81038 65331 67227 64623 -12733 -71689 -21155 25331 24212 59683 80725 16968
11500 16968 12436 2174 -44815 -100477 -82845 -39285 -58047 -44038 -72732 -46490 13319 -591
11488 -591 -18552 5043 80063 70547 38693 -22504 -123582 -82031 -61171 -40448 -72612 -54267
11476 -54267 22181 8968 -60937 -62205 -46923 -35939 -30981 -22992 -41635 -54960 7014 -18679
11464 -18679 -49126 -51077 -78861 -135153 -121144 -36266 -41337 -112769 -195442 -234843 -166105 -26743
11452 -26743 50751 32588 36117 -13989 -130494 -112022 -31275 30041 32426 -11373 -19136 -19511
11440 -19511 -39420 -13980 -45878 -90118 -70588 -37848 -17450 32033 31483 -46027 -100672 -58889
11428 -58889 20151 -19041 20626 18508 -7377 25914 24725 17836 13437 -36638 -104912 -71367
11416 -71367 -82375 -91195 -101129 -56137 -36691 -34900 5887 -16386 -39977 -30287 -50748 -33483
11404 -33483 9164 -8557 -49207 -94512 -105887 -12442 38485 20939 -4687 16594 3019 -43984
11392 -43984 57817 121034 103212 86486 16210 -43569 -37146 4286 -28502 -41258 -46989 -69444
11380 -69444 -73767 -56419 -31845 -49229 -42808 -47573 -54560 -49055 -42703 -58148 -17132 -3883 -37521
11367 -37521 5358 61124 54766 26530 9292 -37551 -123910 -128124 -108241 -80365 -72345 -33516
11355 -33516 -11293 16926 -11106 -41605 -55922 -45827 -29542 -52976 -18282 -10802 -50136 -34772
11343 -34772 -55939 -38405 -1417 6270 -12225 -29292 -58910 -75865 -63070 -41615 -45763 -75634
11331 -75634 -114148 -113984 -85193 -68546 -87908 -87820 -61659 -53420 -62204 -20966 20631 27257 32655
11318 32655 27200 -14729 -13991 5153 18748 10749 46289 66268 28488 -1717 -57310 -143901
11306 -143901 -148703 -77256 -47783 -44848 -94061 -43418 -49163 -19371 41542 67535 23565 9753
11294 9753 3618 4393 -16729 -27399 -3062 -39357 -37338 -34934 -19200 -36047 -40655 -39695 -38170 -20215
11280 -20215 19519 -4963 20960 53982 22921 -63711 -121761 -94071 224 15218 3654 -39972
11268 -39972 12202 32568 65722 74049 44050 10229 98 31159 -40661 -58925 -75769 -68284
11256 -68284 -75447 -84395 -38761 -864 591 40610 67324 88636 56962 26533 28184 -24685
11244 -24685 -40837 -47274 -50886 -34258 -46644 -71392 -85149 -77881 -80554 -115917 -95374 -25821
11232 -25821 -5392 -75528 -90057 -67668 -91588 -107233 -109952 -76708 -21908 36955 40557 24449
11220 24449 -19467 -22199 -23312 -59374 -64976 -33787 -29800 21548 43787 47019 -10281 -27819 69671
11207 69671 -1309 -20543 52501 122659 93687 61084 111708 126930 85248 119821 133408 66939
11195 66939 14998 -66592 -27579 -16610 -20485 -9425 -9111 -18572 -37083 -65150 -67608 -43081 -48655
11182 -48655 -42627 -115917 -159935 -118950 -82347 -17857 43314 11402 -10956 -77140 -40835 -25884
11170 -25884 -36912 21326 104444 124096 54378 3837 -19548 -52934 -69958 -87686 -66404 -56800
11158 -56800 -38652 -11316 -10363 -62988 -55965 -57224 -25065 66525 44181 -3928 54203 109066
11146 109066 25380 -42563 -55025 -77259 -98279 -74096 -13308 -10184 -41390 -35145 11973 21608
11134 21608 -8238 -32174 -14025 -29822 22808 105468 106091 87949 -1416 -62263 -27685 -51575
11122 -51575 -39978 10645 -32852 -47156 -12873 -19760 -60135 -67625 -90496 -64132 -38427 -4617
11110 -4617 -12520 -20814 -17884 -25770 29725 67913 20368 1581 -16016 -72096 -50309 -43452 -43112
11097 -43112 21463 16873 2436 -3762 -25757 -65062 -11593 10265 -30540 -1077 31870 45555
11085 45555 54836 32500 46419 13572 -20112 33126 71479 32930 1365 -52290 -61904 -32994
11073 -32994 -30393 -25321 -2904 -5033 13987 4289 -58519 -45327 -76584 -65085 -25438 32292
11061 32292 88531 90883 100838 98098 116470 100260 63849 37133 52515 27924 24232 30616 38295
11048 38295 83354 124562 110705 126283 149193 109092 140879 116758 133035 150515 160000 212389
11036 212389 210030 212259 321621 415847 456396 440859 354243 325804 330784 355307 362483 311714
11024 311714 336621 444337 524527 566333 560731 528565 452519 411547 368454 352644 359136 387200
11012 387200 450605 489073 526412 484590 466108 405620 372805 325185 289178 266269 272835 219402
11000 219402 220404 200112 235992 292641 261095 177367 102479 74982 22061 -52030 9931 110866
10988 110866 128392 113222 65109 58318 58397 70697 14869 14640 6520 -33133 -14917 24721 -4406
10975 -4406 -44001 -50661 9232 5246 -54486 -79610 -26378 37294 5035 -66616 -106192 -98230
10963 -98230 -65169 16139 70277 66718 49925 -1363 -25621 37511 69536 15072 56156 68503
10951 68503 43535 -5797 -7618 -36269 -47348 -1916 -2655 6088 8422 516 -44513 -31565 22814
10938 22814 34893 -1936 13678 -35795 -45851 -2716 12027 -33394 -66105 -59491 -29089 -43324
10926 -43324 -15962 -27049 -6987 -30917 -66496 -62969 -11295 4228 -59068 -93635 -20727 -22339
10914 -22339 -65376 -36135 17028 76974 43592 -2545 -8890 -48879 -13661 40387 73404 -8396
10902 -8396 -106749 -152122 -116880 -62577 -56145 -58285 -32321 -40139 -8541 -9125 -18704 6303 -4658
10889 -4658 -35903 -8149 -31546 -34846 -14422 58205 48926 -64638 -69717 12790 81982 48994
10877 48994 -20298 -31887 -5333 21671 36572 108497 123049 130441 127787 78001 15127 30269
10865 30269 50370 61966 90229 97555 174921 131172 80579 23795 49222 129162 128087 138462
10853 138462 171428 198129 164237 77573 82291 109224 26094 19688 27090 54149 88258 62554
10841 62554 -14477 -53453 4582 21867 15723 -8036 -39498 -68095 -59868 -13918 38830 99175
10829 99175 64209 112148 149561 90417 50135 35580 35757 56201 79277 34366 -1785 51149
10817 51149 90986 107812 77573 50726 97984 109024 22453 7973 -3502 -34107 -10944 61373
10805 61373 140950 104396 -54996 -127589 -90121 -15729 29505 64881 7659 -2656 2084 16133
10793 16133 22954 32283 32213 57091 85895 115984 109960 73139 37042 -2990 65367 57865 6121
10780 6121 -27253 -11762 -5444 25058 66861 95966 81745 37910 49594 63585 70177 72507
10768 72507 55973 6243 -7607 38689 92695 99538 97924 93912 80420 49918 65684 140027
10756 140027 145733 107138 83587 74892 77187 86040 80860 134522 102767 112414 71866 54823 46224
10743 46224 28222 16512 109715 185921 162537 202823 196456 153246 123967 89745 56336 58535
10731 58535 94115 140249 129851 159618 221606 208994 144171 81212 33975 56280 92038 105135
10719 105135 138459 117678 72248 138837 179504 233885 173883 176902 206942 272035 273355 235396
10707 235396 224397 318237 402524 343877 335294 304425 295045 294937 264760 247608 222364 276363
10695 276363 281038 249178 256457 272952 351255 405985 362070 384371 367102 353925 315359 301595
10683 301595 308021 321794 281164 248541 296529 263414 217599 276790 313566 313367 332910 409107
10671 409107 471624 463889 494346 461431 494414 548112 547206 578276 573862 549003 593605 617997
10659 617997 580317 609842 752036 840118 869972 948087 966217 898019 898586 1021475 1096894
10648 1096894 1197939 1246755 1264473 1297989 1360563 1423959 1486891 1529370 1595384 1678117 1826349
10637 1826349 2007492 2201796 2436969 2757364 3182726 3649776 4087238 4362015 4521839
10628 4521839 4738274 5022557 5463528 6050469 6832118 7849749 9180622 11074646 13535928
10619 13535928 16592490 20372022 24996211 30217782 35063359 38346860 39436895 38895084
10611 38895084 37788403 37111215 37638973 39802934 43930359 50362337 59210105 69551534
10603 69551534 78679525 83141477 81967543 76979695 71014467 66297119 64066928 64932161
10595 64932161 69330763 77415125 88870817 101713948 111729492 114266309 108382994 97434406
10587 97434406 85601006 75467035 68426444 64827033 64603651 67562320 73030175 79323158
10579 79323158 83260754 81816578 75005191 65462436 55767122 47692170 41864781 38296066
10571 38296066 36702985 36665999 37704480 38856160 38844083 36725399 32691923 27659908 22617588
10562 22617588 18202427 14621952 11869795 9774905 8183015 6932867 5964577 5207197
10554 5207197 4606932 4103702 3721871 3331213 3003849 2724017 2436889 2232722 2061944
10545 2061944 1901799 1705632 1573376 1489558 1350710 1326329 1336330 1304615 1264003 1187437
10535 1187437 1116209 1089103 1008174 993223 985219 977976 899500 819488 728189 689260 716441 696101
10523 696101 713177 695229 597850 562596 499607 473516 515422 496172 503438 536808 469294 462433
10511 462433 450633 448299 482915 468336 460501 429079 424290 442728 375099 269456 281946 293954
10499 293954 294579 226382 221889 203526 253885 296114 272553 234240 287847 294580 287588 308914
10487 308914 279224 282129 265171 248852 216672 221231 261266 258823 255163 239321 281058 318329
10475 318329 284765 244172 158216 139323 179020 159711 153489 139047 102783 143388 184202 246095
10463 246095 273079 273631 284361 244530 181793 141036 152411 192226 170614 127467 89144 128437
10451 128437 150400 133728 142961 193425 149608 140444 155892 168773 190900 169950 154908 166291
10439 166291 172928 143565 129789 106132 71860 115516 144577 115714 81427 27845 68797 45184
10427 45184 10144 50860 79933 85224 75612 66587 70422 53224 50811 87239 88529 60689 96513
10414 96513 46140 9497 -76871 -57490 -8088 50346 87234 54922 43026 74294 110028 47900
10402 47900 18396 33316 11419 -29000 -42542 -30120 -20226 -16045 14968 32110 125439 107766
10390 107766 30061 26059 43325 74731 42872 46673 92976 150888 174043 183728 144060 114903
10378 114903 88177 143489 122490 17794 32254 53103 34325 10372 -33054 -11236 7657
10367 7657 28858 -4526 -60407 6444 21577 -6761 -46031 -21771 -2628 45852 74057 68516
10355 68516 100782 76210 48351 25046 15308 41311 69075 100022 85688 -4011 4691 46063
10343 46063 57091 106545 120332 101571 76654 78475 179620 240068 299490 289780 297018 359729
10331 359729 364678 382663 372961 469481 623384 735246 943501 1311097 1762047 2346118 2763939
10320 2763939 2858046 2557774 2124456 1728388 1347838 1037306 798903 651137 506476 424169
10310 424169 376320 308262 217482 187353 92985 43984 58551 21887 -31404 -50353 -14054
10299 -14054 -506 57328 68111 65505 54963 138732 178345 134681 134714 90230 42352 79235
10287 79235 59327 56735 86671 90057 82827 81049 131210 165134 155069 70285 25565 25333 27693
10274 27693 94655 106210 46396 7629 -45685 -61783 -55470 -50356 -45777 -40132 -3761 -13256 -14801
10261 -14801 41126 129928 125834 146547 146086 139086 139952 95925 57335 -26466 -10362 89110 101205
10248 101205 57420 20562 14971 -38303 -63874 -68338 -51480 -76251 -22294 31904 3671 -7690
10236 -7690 -37816 -10341 -1658 -11634 27194 97492 178651 218433 92383 4027 -17275 -26217
10224 -26217 -46631 -52347 -108367 -50549 21349 49949 110566 99389 39713 40201 24756 67183
10212 67183 86008 78127 54477 10481 14896 79988 105628 137270 116651 85797 137007 157836
10200 157836 127403 127302 121938 117052 172093 192548 191758 143127 118762 132174 121154 104219 83864
10187 83864 81404 116554 113669 154267 156021 152171 184981 234865 285381 345152 394313 447543
10175 447543 456378 456329 463195 503846 549123 583317 627755 668279 661176 619072 640101 565628 481049
10162 481049 483566 436048 432870 461038 488556 483586 527631 579125 598232 642435 665026 591217
10150 591217 456165 408464 392878 420351 457152 472740 496630 488683 465049 484509 425812
10139 425812 347984 295779 248839 222826 216793 216797 267656 272751 284568 289353 282721 217043 226391
10126 226391 232573 187059 154269 155225 161445 88718 30682 -3575 19491 72834 53107 26116
10114 26116 13212 82585 172869 157037 162391 172974 194273 130230 90440 71863 61246 44988
10102 44988 2946 33305 62323 104737 105261 143493 178834 198205 180580 160818 224053 310338
10090 310338 305083 312716 283188 257524 204585 184925 147924 83207 57125 67049 99134 67116
10078 67116 41784 79376 191310 235728 213125 128124 97245 119179 137198 195749 228359
10067 228359 260677 266832 232986 200611 232196 188497 188833 184758 125078 60899 24641 59637
10055 59637 77548 74446 112074 130055 86413 27621 7198 -21489 14032 52072 114151 263183
10043 263183 455666 589688 659092 646715 599785 611588 641843 603950 499073 438724 430577
10032 430577 381203 336121 351413 373548 359548 393085 415542 396930 438898 490064 488628 499863
10020 499863 552039 535015 514865 490079 532072 561478 592720 596804 525370 512438 545273 555630
10008 555630 564263 530518 512146 500773 558956 599955 653852 685777 746440 820214 757421 742526
9996 742526 771062 833976 897078 927120 849792 874533 916751 941175 1019661 1064365 1124408 1122192
9984 1122192 1207627 1343685 1499234 1613771 1805304 2022272 2227197 2435244 2539206 2445398
9974 2445398 2303482 2175746 2091792 2020134 1961189 2054693 2160434 2223026 2216517 2214132 2268592
9963 2268592 2358591 2385457 2446682 2547181 2723527 2952058 3229664 3472062 3655496 3832712
9953 3832712 4083367 4323225 4526964 4722392 4985070 5277249 5693008 6169750 6712658 7372715
9943 7372715 8150821 9086668 10218313 11528319 12780738 13828588 14599349 15294153 16138893
9934 16138893 17395042 19078051 21133047 23652332 26726519 30555264 35419023 41766986
9926 41766986 49983987 60731254 75090250 94713353 122243450 162314827 221069980
9919 221069980 304370866 408187740 498731826 523325454 473774774 389808525 302269509
9912 302269509 227234532 170888674 130917691 102644206 82187674 67100210 55812018
9905 55812018 47107747 40233066 34649447 30025811 26246001 23226858 20785724 18800246
9897 18800246 17276748 16134560 15317292 14733121 13971398 12959923 11839002 10716201 9629159
9888 9629159 8702044 7983397 7364400 6794494 6301857 5909982 5506523 5111268 4780892 4513480
9878 4513480 4333536 4196968 4060286 3926249 3771221 3625588 3450217 3237355 3034529 2917329
9868 2917329 2853632 2735438 2588317 2466208 2377104 2293362 2291265 2235783 2160714 2109395 2028601
9857 2028601 1934987 1929533 1885533 1778847 1724523 1721707 1692020 1660978 1631425 1619647 1585413 1505514
9845 1505514 1456958 1466951 1437461 1394060 1372111 1287553 1260640 1243057 1151166 1096716 1089138 1102123
9833 1102123 1094467 1120137 1069858 1031929 992680 936897 928405 899440 881113 821157 771507 763370
9821 763370 807953 814373 753807 748695 783727 814889 777609 763134 727904 708738 734503 716085
9809 716085 662205 625599 598847 618910 557154 518609 541784 569744 535368 520203 485704 462607
9797 462607 430057 433311 403393 388282 430352 472496 520688 590813 645762 716038 798990 771866
9785 771866 715850 703320 712973 680334 610839 551365 541180 557863 556048 518369 485726 458250
9773 458250 452844 453425 447810 367021 285838 259922 309255 353179 349913 348147 365184 358482 291282
9760 291282 278187 308024 344992 332854 332116 307460 314775 285938 275238 281306 268851 272396 272607
9747 272607 243896 245017 203758 221205 281174 236404 215979 225264 175229 169191 200946 258342
9735 258342 231419 225594 260440 264679 278244 300937 313424 329190 313542 286671 216559 215286
9723 215286 295504 274046 234377 198536 177965 149536 213357 280033 285814 260560 223209 236391
9711 236391 240196 239242 259156 272880 269174 193652 167829 218213 199279 198584 217890 268509 262782
9698 262782 211750 232955 226436 208050 186096 161527 147149 152773 105218 96326 94549 128358
9686 128358 159064 132628 151515 203379 210270 204010 199199 185552 201999 124655 140083 150980
9674 150980 59580 19955 92878 112586 111442 144412 207699 224268 197324 176017 196925 214465
9662 214465 210893 129816 97178 122385 162789 180853 168106 118195 117610 87051 147119 216510
9650 216510 223366 250667 246034 166254 65798 50917 113524 117680 141931 143357 140047 91357
9638 91357 84424 98345 131880 116063 129647 103037 93944 99066 82305 124293 105574 70217
9626 70217 50136 -8845 6346 20712 41129 44294 55633 80122 106238 132547 72944 52226
9614 52226 61883 40999 29783 6590 9788 91397 145275 145124 186208 162172 74194 114818 168577
9601 168577 154276 168343 100120 85443 81646 92207 141671 151360 146234 111862 60055 98228
9589 98228 111919 88519 67284 66710 83349 117961 83125 98310 139924 66578 64813 90594
9577 90594 76739 81045 67717 41198 32466 68054 114401 102472 57897 61813 43058 -36579
9565 -36579 -30218 24533 83618 114987 142670 163754 135559 140379 115926 78368 81371 131675
9553 131675 181484 144717 140652 138913 119464 130118 19440 -13520 -14931 58388 142730 131215
9541 131215 141761 156284 135842 117548 128447 147918 147411 141759 168525 195230 203345 285587
9529 285587 276689 184591 125511 134892 141127 187295 264500 261663 302627 310005 275692 325496 393152
9516 393152 427496 402912 459408 608119 795010 1086791 1438257 1883222 2363876 2663710
9506 2663710 2658264 2433922 2050795 1606730 1200348 926859 721628 626129 541888 460002
9496 460002 461010 422945 327004 289873 286697 266468 273617 198236 129773 80920 127808 161719
9484 161719 130100 98318 58856 54755 63348 81947 76387 112923 147169 142470 116457 69933
9472 69933 24241 32764 10686 -14385 37246 81915 78832 101223 69958 74433 87993 103101
9460 103101 57265 3624 28743 38322 -16515 -25793 16144 -6512 22524 24848 -32305 -120323
9448 -120323 -104755 -21057 108499 161675 117188 97716 125592 138241 119568 111166 104606 80604
9436 80604 63519 81480 131291 151888 166115 117527 78399 53745 50948 9510 47220 65246
9424 65246 24682 14947 35545 90427 106669 93046 54276 26146 34857 66939 107756 137922
9412 137922 123135 174666 172684 147569 66197 18550 27866 129745 161325 142648 76539 49740
9400 49740 33339 -4558 -15667 37464 34279 10139 1946 11391 55612 39091 12568 80080
9388 80080 127710 161583 95556 41372 19250 46639 49386 61991 32323 89485 96614 86537
9376 86537 87239 72046 94907 91201 31189 35988 53936 44327 55021 114223 183291 145857 54290
9363 54290 67809 86568 73490 95504 75846 31531 -31833 -58867 -36075 -28650 4546 64789
9351 64789 21617 19499 65048 81423 34430 -6613 17381 104573 98036 62721 -18018 1239
9339 1239 -577 14770 57030 112583 100350 67053 33804 83450 124250 116125 128264 128973 73333
9326 73333 83974 16521 -40882 -14430 11448 2851 -15168 42567 56595 59808 4623 -17400
9314 -17400 -56527 -77848 -29768 30267 7005 3490 15154 -27807 -41509 3789 73344 36240
9302 36240 -19883 -14524 -2738 3622 -2814 24738 5147 14484 12878 21995 19735 -20502 -41223
9289 -41223 22829 29195 4224 -74466 -65120 -12496 40230 61761 49126 73615 38817 45383
9277 45383 50233 -35894 -62689 -16746 5104 -32876 817 65220 44106 28307 59732 23726
9265 23726 -12138 -51737 -7858 44014 38635 30881 6212 24921 83190 51030 4879 -2695
9253 -2695 9117 8833 -5433 -6338 8909 79481 99464 104205 93437 134531 167546 160013 193365
9240 193365 164501 127955 67427 50066 75190 144843 218281 152765 71024 15757 31710 8798
9228 8798 -6003 68975 27978 -2166 -29466 4317 77248 63963 -27833 -18811 28204 57782
9216 57782 51730 36483 17030 -6377 27865 13630 -35949 -38202 -42646 -35355 -17893 -6420 -12532
9203 -12532 -2021 25081 -5067 -5644 -19089 -31416 -54644 -50019 -48048 -33264 -19891 -23121 4230
9190 4230 88816 72415 44138 19178 -10683 -10940 -69453 -56031 -15812 3012 51159 88975
9178 88975 88625 35324 42619 53803 36625 40817 81932 109426 32384 29217 24105 26189 -7565
9165 -7565 -72252 -68852 -18756 -365 32127 28670 77877 96894 36920 -1353 -18574 -24293 7670
9152 7670 -5042 -23795 12687 7961 10829 27697 -17777 3123 62816 72990 56183 67005
9140 67005 40990 -11237 -8813 -22241 -21678 -6 27197 2828 10089 11501 -25191 15087 43967
9127 43967 84677 104589 116648 82711 81180 50736 21735 48725 89861 110689 125403 50544
9115 50544 -20435 -11790 41268 68264 54951 92369 55096 -19675 -40982 -25260 -1151 44525
9103 44525 21886 -34904 -32792 -36732 12152 50740 33604 46302 16937 18633 -25629 -13428
9091 -13428 -11296 11749 32510 41599 41899 35709 24657 41320 41264 1577 -10661 14287 -29121
9078 -29121 -71856 -18037 34420 86667 97847 91880 17211 -257 32398 46647 60758 147
9066 147 -73281 -81268 -57462 -7388 21988 12738 28287 19679 24311 2300 -23270 -37178 -78841
9053 -78841 -88309 -60843 -84455 -27146 30928 6971 71434 193042 186661 92115 87396 127188
9041 127188 78020 39399 24375 -12939 -36316 -40115 -42251 -13345 16849 374 5780 3160
9029 3160 -24847 -17028 -10253 -3888 12791 9869 -51823 -18481 43584 39123 -26756 -91548 -62919
9016 -62919 -59209 -62667 -47316 31123 23963 -3323 -55274 -105298 -71172 -62109 -50814 49114 73421
9003 73421 78275 -9724 -55301 -21530 14955 65223 48817 62964 52572 21006 47244 38126
8991 38126 70156 21483 46826 78118 -14860 -61667 -67059 -64457 -42346 26120 18603 9580 34432
8978 34432 116883 107317 91838 33422 -9620 -46114 -130196 -136565 -72688 -84264 -82196 8637
8966 8637 24314 2530 515 -16067 -37439 14750 50192 35632 46321 62780 74156 -7236
8954 -7236 -65186 -77099 -9451 -2963 -94682 -81757 -62225 -35291 -2798 98332 89173 32408
8942 32408 -38059 -98689 -36693 60263 35304 12833 -32039 -69759 -51602 -22510 -57833 -30579
8930 -30579 8794 -4364 28076 6439 52151 67962 61550 41424 74671 81005 11977 7523
8918 7523 11543 51329 92841 98611 36996 -40760 -74095 -89573 -33643 50112 59287 44676 16595
8905 16595 -34816 -12237 -18809 -6290 -22206 8205 88994 79998 52069 15051 -2852 13571
8893 13571 -7953 -34916 10331 24910 12872 76963 51560 -27616 -17765 -21436 -1598 44214
8881 44214 17608 45092 32701 -12322 -9315 25393 50175 -3478 -20378 -75883 -137836 -114581
8869 -114581 -11711 44632 39498 68391 68703 61964 90806 60312 26615 -26021 -18211 -23381 5069
8856 5069 37268 22541 -693 -2469 -1867 1049 10494 41415 109407 67162 -5853 1992 8072
8843 8072 321 -1373 -53213 -91732 -160648 -159888 -33618 21098 32185 65915 40818 6007 -32376
8830 -32376 -30672 5940 -2911 7021 -22673 9159 36645 55453 46986 -6462 -30400 -31223 47518
8817 47518 22078 -13109 663 -45319 -57883 -42219 -51728 -13563 -28106 -19501 36755 51047
8805 51047 21786 778 7487 26184 62110 28447 -56506 -98473 -31417 16883 29708 -37133
8793 -37133 -23598 1704 8401 64382 125438 125645 42172 -13478 -46150 7315 53319 76727
8781 76727 20706 5480 16844 21368 10074 -13146 16559 49489 29269 10986 -37741 11333
8769 11333 74674 84027 38218 23955 24664 17745 19843 54338 39168 15015 26546 50279 17176
8756 17176 13368 31152 24152 -9672 -43133 -47573 -87348 -61996 -26101 -23277 -3339 46467 71510
8743 71510 1984 -24857 21951 -11399 -11106 -8266 -23431 -54342 -12085 23851 4962 4756 -26989
8730 -26989 -7108 -20678 -36043 24762 33125 14152 -3363 -28097 -39633 15570 25381 13848
8718 13848 -23985 -36565 -53225 -48121 -47894 -8955 37828 42012 -8593 5713 -1569 2348 20652
8705 20652 23642 45865 88647 53996 -58684 -72765 -84803 -47353 4587 -45376 -48344 -15924
8693 -15924 22239 -9463 -17947 -28663 -31334 521 -38064 -52611 -3018 51250 12314 12407 22186
8680 22186 -2668 545 -20177 12565 74604 40324 10017 11963 27159 82362 59385 13963
8668 13963 77417 103016 71789 39315 39245 31559 12525 -34259 -10982 -3928 -25884 -18580 -19522
8655 -19522 -48079 -77001 -82753 -10498 13074 25831 4893 -48204 -55720 18222 15126 -4873
8643 -4873 -25143 -21615 49358 -266 29118 103283 138717 119261 110641 56499 2146 -6714 -11551
8630 -11551 -44745 -97703 -55204 -18851 530 14284 29380 54976 67162 67831 64382 53198
8618 53198 73408 94117 106021 123206 85400 43490 3443 -53882 -15838 -3145 -60715 -52639
8606 -52639 -76349 -33862 13419 17097 7050 9113 29864 8267 13386 6401 -20942 33803 27501
8593 27501 -11314 -15286 26050 43307 83806 103752 58949 76065 78198 2268 -27057 19075
8581 19075 58074 1479 -61091 -84609 -66828 -27676 -21814 -12569 -17015 -41989 -37649 -70141 -81049
8568 -81049 -16103 24217 -9351 -21407 -41355 -43316 -23806 5941 27518 12595 39180 22466
8556 22466 -79146 -67042 -59410 -9211 -22290 -74750 -52180 -46508 -68307 -62492 -28994 -3099
8544 -3099 178 8154 54702 -5950 -8437 -27970 989 30431 50153 104445 99650 2435 -21381
8531 -21381 11903 19894 10701 5219 2365 51832 81181 47658 27431 34275 12174 37170 45982
8518 45982 57683 105496 72442 102697 66437 44193 33177 48978 58566 62018 -10038 -68351
8506 -68351 -15485 21045 -24419 -69940 -88342 -93643 -103110 -156958 -125574 -95468 -85540 -65636
8494 -65636 -72655 -18919 5930 19455 50104 78577 84039 103443 82816 40789 -35253 -49109
8482 -49109 -40956 -67878 -31979 -8714 4705 29938 15723 22318 -13931 14102 73000 84422
8470 84422 22253 15623 4357 624 -21318 -53407 37 -3606 -19245 -15632 378 65331 85306
8457 85306 59978 30172 -17939 -37504 34125 54702 52310 45041 2360 51917 97303 69169
8445 69169 -12112 -50429 -79942 -52094 -8943 -9183 6266 35614 105208 106452 73493 66198 104827
8432 104827 56536 -26557 -46212 -34547 -13212 44601 -837 -61194 -27710 -48503 -110151 -45932
8420 -45932 -1033 3451 18375 14506 -11362 -18280 -19227 16415 36378 19802 -37636 -31207 -52139
8407 -52139 -60094 -33387 -11079 -6112 1042 -24312 -9648 -51372 -121244 -146593 -117436 -79679
8395 -79679 -109864 -101883 -78261 -32907 -40466 -37517 -9148 44094 46235 20589 32169 39593 30380
8382 30380 -39671 1748 30067 7475 22402 69482 25823 23592 1085 -39889 -65342 -19239
8370 -19239 58373 47776 30709 109747 154726 114948 107989 87374 11656 -52456 -3776 12248
8358 12248 -13942 -21644 1717 40417 45840 57253 39438 -11789 -55458 -87539 -88651 1610
8346 1610 87191 80527 99720 73666 49872 14402 -9336 -29961 -41147 -41676 -221 59440 58526
8333 58526 81604 91421 75663 80430 66688 77702 45200 1036 23344 42441 62890 46760
8321 46760 22115 6482 13415 -6626 21095 79891 142862 121280 124297 98107 28127 18301
8309 18301 34210 -12272 6769 43876 51267 4325 -66344 -37312 35592 28261 62168 68394
8297 68394 49157 -8360 -24370 26072 54329 106646 90974 56058 2811 -49248 -32393 -6641
8285 -6641 -8153 -57935 -47230 -64940 -125739 -106649 -85572 -57719 -25662 -32290 15263 41106
8273 41106 45358 52230 57210 61728 -14311 -35194 -47660 -41205 -48537 -25535 -28010 -7286 3078
8260 3078 6697 38993 98952 140655 138521 77710 56809 10579 -30281 -31337 -16272 -46312 -57284
8247 -57284 -74113 -55444 -7611 -5873 -24346 -68055 -44444 -27208 -292 -15934 -38611 -22963
8235 -22963 -56396 -73591 -25696 -2415 -29369 -2197 1882 -42510 -25775 -34320 -11325 -70336
8223 -70336 -30346 -42708 -108539 -104440 -50964 35596 83473 33021 -15920 -63518 -85500 -70201
8211 -70201 -54733 -54311 -13205 -19917 -76917 -95762 -46573 4788 -46041 -74374 -89518 -79547 301
8198 301 91860 92031 73146 65250 -17278 -65874 -58831 15401 9180 28598 2292 -38887 -22007
8185 -22007 -65330 -50289 2007 9048 -17632 22301 1825 193 87180 81292 71730 97870 95676
8172 95676 65281 54144 -35609 -56723 -36975 -38093 -23141 1915 21680 41659 59842 45687
8160 45687 43454 65828 21252 18724 50181 29442 36627 -21151 -74292 -47987 -29159 -21498 -45112
8147 -45112 -76444 -63370 -36553 -25344 -64057 -67081 151 -4938 -16512 -58558 5622 47255
8135 47255 -669 -14067 7309 -3924 7315 2446 -16136 12799 12117 -12658 350 13369
8123 13369 -5569 17848 62481 44031 -48756 -141652 -80703 -47457 -83117 -91944 -80728 -51772
8111 -51772 -29163 -1066 -1208 32002 95776 100655 47207 43412 6514 24519 19686 7399 35287
8098 35287 43821 -5827 -29078 -21535 43442 86899 89773 46664 -16480 8759 18422 21123 91199
8085 91199 105591 47753 -93469 -143802 -73041 25228 26446 -44956 1064 -22100 -94534 -120107
8073 -120107 -144224 -64222 31643 9996 8119 1055 -65480 -64101 -41500 -26346 35808 50021
8061 50021 -18530 -28958 -20390 -32494 -55248 -46658 13670 51547 79574 24219 14676 58558
8049 58558 80335 87827 38015 12860 998 -7679 -1309 -20111 25908 54558 71860 90758
8037 90758 64083 57980 53585 57189 77807 132632 161195 122556 76804 100287 86485 72496
8025 72496 67381 45628 18277 9656 30085 1641 -18717 -20742 37711 56355 5276 -70744
8013 -70744 -105651 -37178 32227 17981 2994 19064 -37488 -115452 -125492 -53133 27355 68745
8001 68745 1678 -83668 -39538 -38164 -1082 44303 49458 50096 69049 -8496 -6562 223 -3134
7988 -3134 39446 62285 25407 5032 3836 -20707 -48939 -2330 5425 -15569 -53171 -71096
7976 -71096 -56852 -333 -38497 -29210 -12293 -29348 -25183 13996 28916 14976 -28090 2738
7964 2738 11346 -7584 22804 60995 100897 66097 25771 12724 66311 84405 40155 47996
7952 47996 41200 29963 13983 -11703 -41025 -80545 -56863 -30600 5811 16690 -13769 4601
7940 4601 11117 72312 13213 53132 102577 21051 -21890 -7241 -5320 -30061 42696 67249
7928 67249 54284 62334 75211 60819 43334 31696 71393 75544 44531 1460 19074 -66194
7916 -66194 -97491 -56240 -78084 -44510 -14405 13306 2164 -28521 -3624 -33921 -14535 1687
7904 1687 19342 58344 81377 67955 40716 -4256 -9123 -42925 -51926 38236 80575 84713 41523
7891 41523 31176 35666 13234 -53199 -49042 22832 46036 27374 33561 71701 42057 1967
7879 1967 -18240 -7716 -66389 -12452 76067 69700 43726 3870 -6390 408 -32776 -18774
7867 -18774 43884 10819 -54101 -24339 17531 -31560 -42566 21273 34782 21523 -3296 7644
7855 7644 24945 11740 -21007 -49765 4599 9154 49834 38500 41379 58928 50486 7058 -33478
7842 -33478 -40161 -7541 10189 -25097 -22437 -42474 -23396 -32106 -102327 -91493 -53476 1232
7830 1232 -3548 -38162 -60592 -40822 -22995 11992 -303 13090 7105 48950 69461 49762
7818 49762 34056 -13054 20763 77369 47931 2812 -19526 -38691 -82080 -29372 1694 24927
7806 24927 73702 45667 -12895 -47326 6010 -7962 -47833 -43062 1554 -11211 -12159 -30644
7794 -30644 -44810 -77913 -150737 -196147 -159161 -46474 -5480 -92303 -63044 55989 62783 83985
7782 83985 35340 -35770 -61816 -101337 -95366 -28509 -45867 -140376 -71375 -67229 -112535 -76473
7770 -76473 -39271 5462 710 -32145 -28512 -26883 58258 92257 44573 2895 13923 25383
7758 25383 20078 12609 23538 53247 24320 34898 67655 63658 22828 68211 73337 -18400 -99191
7745 -99191 -116173 -105976 -35245 10654 -17124 -50157 -74915 -23012 -6380 -54350 -38623 39302
7733 39302 67558 47303 52232 80216 136985 127369 115516 165221 144877 64810 27548 119065
7721 119065 153392 99083 16199 -24303 -22329 8697 -37550 -3318 81190 95069 119008 174619
7709 174619 94424 5123 42755 -39480 -84019 6604 14569 20561 49914 43504 -7480 -26045
7697 -26045 42764 82965 44195 -24821 -94392 -83585 -70573 -90676 -34854 7462 -26385 -39216
7685 -39216 -16985 -17239 -21316 -51464 -4146 -70 31582 -17825 -54377 -67740 -90305 -61781 -80030
7672 -80030 -109359 -104421 -59222 -69695 -49095 -76117 -155932 -163078 -171066 -149958 -103571 -54294
7660 -54294 -64920 418 35814 42761 42397 9981 28768 17040 -3726 -49818 -71005 -25853
7648 -25853 -25391 -28497 -8118 -30161 -67088 -13102 54599 60980 47054 -37956 -28652 8805 4602
7635 4602 15517 1208 13219 5256 2264 -3966 5937 20065 -28673 2344 7720 9099 -11455
7622 -11455 -34486 -1144 24690 47708 47014 43027 61779 82919 47391 61763 92558 74241
7610 74241 33636 47448 76619 39830 -10465 -35659 -29157 4269 89348 90873 30427 -59154
7598 -59154 -41710 -46818 -44365 -19774 -3332 9198 33829 77995 62521 7766 -21371 -36437
7586 -36437 -16749 -20536 -75282 -113349 -79647 -22117 6556 -60663 -119872 -106734 -43633 7865
7574 7865 16287 -36634 -84635 -75890 -59548 -75226 -44410 13036 -33550 -41482 -25910 -47028 -89834
7561 -89834 -72502 -45206 -36614 -81014 -105455 -121093 -182439 -192692 -180180 -102259 -120291 -134080
7549 -134080 -85798 -55397 -35415 -11531 14190 -58637 -85810 -60451 14786 57652 14690 34667
7537 34667 74917 93606 122784 58948 65196 108056 78875 16171 43399 52446 39607 25367
7525 25367 38844 49482 10240 -17114 -57722 -19434 54197 68525 31677 29359 13971 -8078
7513 -8078 -19201 12248 11145 30848 43120 29467 -11800 -31279 32435 81030 103075 75412
7501 75412 39706 96850 76818 36450 34004 18525 21367 922 17578 70095 13800 -55251
7489 -55251 -2788 33369 32363 11157 -43066 -52791 -38084 -39296 -27719 -5496 29674 57778
7477 57778 33375 74567 87698 61594 98866 54847 -5442 38994 7727 -2449 4859 -49110
7465 -49110 -39552 -6512 11466 -65807 -85206 -66682 -119774 -68782 1944 31128 -14816 -18692
7453 -18692 30799 38058 1316 4830 24770 2179 -56822 -69009 -6262 -16041 -31952 -31414 20725
7440 20725 51242 95356 118104 124347 94193 25481 -1516 5565 47807 109744 108032 48638
7428 48638 77315 79497 76813 50331 15825 47208 -2271 -40468 -19524 -21274 24575 43171
7416 43171 35334 6944 29345 43657 41102 34288 18949 34341 20376 78110 102135 89038
7404 89038 53574 40594 -6704 -12063 -51161 -59140 -92275 -118500 -92402 10058 97128 107084
7392 107084 33694 22245 -5332 -39730 -19425 -56061 -47559 -10857 18058 17389 -40278 -61147
7380 -61147 -55470 -7272 -34880 4611 44113 49640 45805 100900 128616 40484 -6605 -1884 40334
7367 40334 12200 -88401 -125524 -105333 -84912 -40895 -48763 -25598 22535 12767 -23909 -31933
7355 -31933 14657 2880 -17925 -29793 -71847 -92981 -76553 -75859 -23449 52608 71908 92287
7343 92287 50549 54317 -31901 -40661 2492 -37972 -53621 -43870 -55752 -46275 -16560 28735 4118
7330 4118 -36576 -1837 -2352 -17152 -5756 27462 -6711 -64624 -29233 38556 2136 -65799
7318 -65799 -47378 31785 14794 24504 32885 -4369 -28548 4730 40152 45147 51214 -15093 -73155
7305 -73155 -12438 13718 20532 3526 -55588 -82488 -101725 -101791 -24599 41753 96061 56466 60095
7292 60095 62210 15561 -55183 -131726 -85828 -58883 -48909 -28633 8751 -27719 10375 102893
7280 102893 89716 31199 -24937 10839 78028 88058 4336 -110312 -117127 -92113 -61676 -79074
7268 -79074 -127928 -153084 -109345 -100261 -70753 -89549 -77384 -89523 -49688 -13333 -11344 35866
7256 35866 112999 117821 39479 -45723 6112 54569 64042 53861 53973 7810 -4108 32812 32077
7243 32077 19008 29930 42379 56447 19307 -25607 -5820 -42449 -115384 -93108 -58353 -42315
7231 -42315 -2022 93445 110467 76377 37189 88888 81790 50842 -27268 -15623 21130 25619
7219 25619 -22195 26942 4059 -39050 -1159 -8697 4569 -17880 -22708 -3456 -18427 -21634
7207 -21634 -22895 -25538 -49025 -32487 -10971 8532 31084 72272 108419 93923 19819 -20814
7195 -20814 31773 103893 95453 95776 74006 111123 101546 49149 101839 88794 46867 37904 79723
7182 79723 87669 111970 109898 70126 10980 -20906 -57999 -45540 -12387 6123 18392 42866
7170 42866 -5146 -24937 -46563 -24655 -23302 -17632 -35563 -71450 -64776 -63327 -65767 672 62196
7157 62196 71530 78141 68572 7000 39657 49065 45444 -27001 -96894 -100180 -45998 28497 17477
7144 17477 -24861 -47410 21234 44842 25453 -13692 8451 -1034 30831 59291 31332 24171
7132 24171 -12697 -34146 4008 55388 74805 66656 78319 99204 89745 73041 28454 -7302
7120 -7302 37178 49600 -7014 -84005 -94414 -87049 -10658 9824 -24192 -36386 -35016 -45503
7108 -45503 -17531 12369 -4515 -35766 -23749 -37044 -22583 30903 -26495 -38072 31115 53384
7096 53384 54416 67193 84401 47333 86927 81147 99544 64086 -20499 -62785 -30767 -60508
7084 -60508 -92481 -97703 -75214 -54978 -46082 -24876 1980 22874 -12677 -30548 -87593 -105252
7072 -105252 -46768 -26269 -20754 28833 -18564 -56522 -63163 -71193 -78250 -63927 -69242 -122628 -111740
7059 -111740 -25136 21365 11871 9960 -9757 4963 -17740 -1967 36247 82279 104612 89373
7047 89373 57483 27394 -889 -21220 722 29845 10576 21929 22161 35913 57892 7536
7035 7536 5426 -26374 335 -3007 32104 10398 -10662 -10593 -9630 -46225 -75697 -82385 -62382 -37403
7021 -37403 23117 47427 54800 49266 -27811 -32682 1703 -19374 -68718 -83344 -15509 53412
7009 53412 59498 16922 -26570 -50940 -124143 -70525 -24953 35550 76811 26297 -22665 -59457
6997 -59457 -42479 31159 59873 49462 16829 31182 53022 56472 52126 16476 -24669 -67593
6985 -67593 -76913 -26124 19029 48456 22790 -35605 -69374 -79409 -28672 -32929 8696 34416
6973 34416 14498 -6012 -33620 -86786 -31458 5354 15293 65118 59811 -80487 -83271 -54505
6961 -54505 -24783 -39235 -2921 1642 30434 41892 39305 23832 45630 80415 60164 6853
6949 6853 31959 44864 52697 4332 4847 28000 32275 11246 -20032 -18219 -23620 997 18942
6936 18942 752 66993 61601 11195 -4734 12461 9095 20556 -32045 -53288 -13246 8192
6924 8192 46062 30575 -12331 10494 60441 52349 77058 89846 65734 18201 16499 44763
6912 44763 93507 72558 13405 24077 -1283 -5526 -47025 -17234 54046 24597 -46009 -43365
6900 -43365 -25442 -40507 -20509 -48579 1295 6523 -39239 -15979 65989 43177 72393 83149
6888 83149 36440 -25893 -22570 -33637 -14386 15211 18218 75712 84481 88519 77440 83317 15985
6875 15985 -12198 -17284 -25292 -2282 -13164 -30689 -60978 -61312 -81757 -71868 -70096 -19016 -59207
6862 -59207 -109500 -67786 -76484 -71138 -61775 -91139 -116563 -69849 -6783 -25288 -62559 -113716
6850 -113716 -147346 -84958 -1273 -2555 6721 -25438 -36582 12373 30810 -34702 -71548 -102027
6838 -102027 -116740 -100556 -43856 19582 -10648 -94763 -51874 -346 13548 -49707 -52412 22877
6826 22877 82073 79079 50833 37004 69192 46118 -10004 21965 40531 43713 -4804 -12095
6814 -12095 -7486 -34236 -28051 -46911 -30103 -8224 -21272 -22771 62 -17862 -36468 -24372
6802 -24372 -762 -8567 8169 21373 -30144 -90005 -85437 -56365 -81942 -56049 7693 20258
6790 20258 23929 29558 11772 -17606 1447 89377 92595 75572 46515 -12210 -9940 71279 118589
6777 118589 111542 46924 40372 41357 29598 45919 86884 122840 116203 66764 22527 7880 442
6764 442 -4270 -50092 -58360 -45584 -48841 -6332 -39033 -98699 -77618 -86510 -31639 38104 35562
6751 35562 -46669 -19480 6444 26841 38388 -10307 -70273 -84700 -87387 -14071 28908 59747
6739 59747 -4097 -84756 -47269 -135065 -99369 -27255 -27140 13304 36103 74938 48494 655
6727 655 -60660 -66848 -34441 -55808 2702 -21080 -25568 -9398 -33915 -38347 -81890 -150054 -79664
6714 -79664 11546 35642 27801 74302 60186 103438 143803 148638 21735 -31149 22244 4483
6702 4483 -37497 -117430 -133213 -71090 -28160 -7961 -30215 9231 7724 -6603 -20225 64378
6690 64378 45111 -790 28714 -44932 -61570 -62467 -97953 -90822 -103992 -74992 -18670 1866
6678 1866 -1925 -40344 -19209 -62417 -56500 -105663 -57275 -42280 -61795 23619 87428 21459
6666 21459 -35581 -11224 3537 26275 43185 25531 20494 44925 52046 96845 78071 29464
6654 29464 2234 49942 110360 50230 2348 69115 79238 81354 53781 18671 36932 19587
6642 19587 -13861 -19796 -20175 -19554 -38492 -56267 6430 50419 14365 -33504 -52744 -290 75381
6629 75381 123955 98884 15717 -9746 2461 -17699 -43606 -109522 -108670 -56996 -49708 -72027
6617 -72027 -55933 -85754 -74301 -69527 -21192 44886 43033 59675 25854 663 -7623 -84488
6605 -84488 -71770 -35880 -32734 -38796 -8043 -27972 -57733 -67990 -116820 -144339 -95384 -117404
6593 -117404 -82475 -73769 -82834 -68925 -67238 -66026 -70199 -86681 -3756 -5595 -44326 -71994 10151
6580 10151 74258 83187 58944 20545 -73289 -119959 -99131 -36013 -2303 54660 58807 19053
6568 19053 -4419 36413 113435 104054 131516 129317 112466 69999 47300 48926 84015 -2187
6556 -2187 -12567 43216 23678 -37216 -53658 -62111 -87994 -98493 -57170 -76597 -52365 12111
6544 12111 75862 104912 91989 95633 56282 26234 29064 14479 30960 51155 87343 77668
6532 77668 49418 2107 -43431 -54573 -30253 -21248 -24229 37311 74259 66824 35958 12601
6520 12601 -9234 23917 37269 -11812 -22675 -52729 -80834 -68695 -72881 -86527 -94471 -35831
6508 -35831 -40591 -25199 6605 38679 -8040 -36659 -21103 37118 40093 13721 19976 591
6496 591 -35788 -2695 29982 16572 50705 16827 -3704 36062 30459 28881 1921 2782 52157
6483 52157 55614 46195 23590 -27269 -27992 -5581 -14164 20686 59351 74412 76101 43189 10810
6470 10810 14248 29575 20696 91500 64777 52182 56675 51469 10817 -22078 8240 51201 41055
6457 41055 67661 53665 53632 21565 28436 -3180 -500 -6921 -45664 -11521 -12721 -55158 -39216
6444 -39216 10636 -10629 -53699 -62762 -11887 -28891 17485 25392 18845 47504 13492 -86020
6432 -86020 -108692 -89904 -22947 -47841 -109890 -75079 -26203 2802 -21565 -30478 -32218 -19938
6420 -19938 -19808 -6862 24042 38092 21961 -9208 -5066 -16901 -34229 17211 -6497 7728
6408 7728 -10558 -55116 -33631 -27523 -25180 -70407 -112074 -101704 -141369 -126183 -84436 -58908
6396 -58908 -33280 -63196 -76113 -64815 -4605 34323 -61765 -74258 -72026 -75444 -48439 32864
6384 32864 75504 68923 94485 65183 -3371 -63286 -79416 -113999 -51415 2240 -4260 -46821
6372 -46821 -68184 -64315 -5758 41751 52841 48664 28455 25620 16140 68095 97162 76764 121590
6359 121590 149965 99731 58490 -17430 -46052 11311 27487 -18456 -52044 -102814 -74707 -13985
6347 -13985 76435 -810 -57186 -65152 -51324 -49223 -18638 14320 29816 22268 16572 -32026 -38311
6334 -38311 -50259 -41500 -35749 -24396 -55897 -74122 -76158 -83471 -99294 -53102 -45506 -28941 -32541
6321 -32541 -9899 -4117 34055 59552 49561 38220 37870 29141 18282 -6545 -6211 48224 45235
6308 45235 -5700 -14740 -20511 -79427 -99639 -142142 -93395 -65896 8367 81341 54669 13739
6296 13739 -15157 -44962 -58316 -21718 -20045 -27847 -14749 4712 38638 -9685 6369 80720
6284 80720 115915 29427 1461 -21572 -50186 -29896 -38836 -106678 -94016 -62206 -32550 15784
6272 15784 48186 -7237 -60450 -68362 -74307 -125351 -127747 -87135 -2835 -4722 -13893 -1796 28900
6259 28900 24528 -21576 -10273 34052 105096 65003 21234 52669 27004 28811 44901 46916
6247 46916 46089 -9486 -75812 -144903 -90413 -75561 -81068 -62288 -27128 -7388 -36350 27046
6235 27046 14111 16633 28702 73111 89975 18346 3890 -27188 -4716 7128 54885 65209
6223 65209 23243 3398 37333 -7648 -64680 -121477 -102447 -52203 13284 -16936 -40754 -58903
6211 -58903 -27492 9602 35366 26328 43510 57763 91646 124174 129068 95118 50515 29928
6199 29928 -8835 -4205 4036 36046 12166 -5673 -8595 -13514 -14805 -24303 -55338 -46662 -51786
6186 -51786 -68137 -104802 -105737 -117331 -143684 -126801 -91544 13779 39245 13550 -26703 -3377
6174 -3377 42751 82328 48339 -32917 -88390 -62915 -114072 -70327 -60744 -61003 8774 46615 9136
6161 9136 5708 50719 50709 89956 119452 35640 19848 -4000 -35151 7080 7959 23782 -1660
6148 -1660 -59827 -19793 4973 61070 59829 82376 42458 58931 64660 65425 24782 -71354 -70953
6135 -70953 -19381 19310 45652 49080 76422 76691 34384 28212 3225 -608 12037 46241 -2327
6122 -2327 -37512 -50731 -33493 -27131 -960 8003 58252 32752 -26991 -29277 -6848 3020 -8049
6109 -8049 -28587 -55464 -20626 -6685 -34602 -50374 -71197 -77651 -58107 -15263 30419 13154
6097 13154 -2811 48380 98079 89895 33811 4559 22075 24627 45907 61334 92432 132639
6085 132639 85129 48764 28564 13225 12043 25713 -11029 -33575 -90944 -27420 40387 80194
6073 80194 72763 30131 44471 68049 26343 12675 -16156 36638 86197 97901 84771 52800
6061 52800 24584 4638 16318 18973 -28282 -18323 3745 19087 1471 -57455 -82638 -101374
6049 -101374 -66679 -8777 -60476 -15611 57365 40405 12725 -17196 -31756 -109076 -141434 -80571
6037 -80571 -33323 -40465 -16281 23233 72709 51202 30619 50327 71622 38170 -16081 -16213
6025 -16213 5542 1714 17352 91350 103852 34716 -43960 6378 75248 120708 105759 30980
6013 30980 -4572 -4108 -58022 -99754 -29227 23067 52940 62954 92772 117907 94749 28771
6001 28771 25353 38676 -425 5476 11008 -16348 -40133 -8973 -55612 -90917 -57894 -30866
5989 -30866 5330 -58764 -69544 -98571 -26627 35353 34465 31495 47999 42252 -12821 -28599 -2668
5976 -2668 -17141 -81482 -103295 -88033 -47795 24793 97957 78887 46240 68099 45937 3590
5964 3590 12643 -13090 -36441 -19017 -6073 34748 85368 120254 88400 55631 80250 81350
5952 81350 14713 -20235 -7534 12647 68748 57707 -14144 -7802 -4767 8298 -1348 -1056 48249
5939 48249 20769 -11460 -69779 -95182 -117063 -146676 -92450 -53847 -70224 -97466 -77895 -87182
5927 -87182 -112963 -62261 -2759 97586 115886 55674 21850 -876 26083 8098 44783 43882
5915 43882 8200 -14214 -43140 -98639 -84561 -71151 -82196 -57829 -16978 7100 -13220 -30247
5903 -30247 -38108 7502 28673 28424 49836 7591 -12472 9618 5024 5401 -62168 -93551 -65575
5890 -65575 -62027 282 20874 69865 68742 85492 139428 180365 148966 126567 89798 13999
5878 13999 -33327 -38960 -3079 26834 71939 83477 70003 95809 78411 62754 83729 93705
5866 93705 119249 67446 29738 -59896 -105724 -78349 -83871 -82973 -53738 34589 79299 85133 72356
5853 72356 55897 43342 30269 492 -20541 -39041 -27166 -51832 -17980 -23628 -19868 -20006 -59598
5840 -59598 -96999 -58306 -9494 22868 60782 71970 31690 63883 47560 35214 67649 86355
5828 86355 79234 76049 42802 9645 -21461 -36395 -34350 -30798 -3005 -2364 -18328 37497 70984
5815 70984 20693 34688 20579 61229 84214 74773 36367 15773 19085 10200 6652 17648 -22939
5802 -22939 -44996 -25821 -32932 7213 39695 14387 22760 41591 41598 30345 14441 -69460 -88316
5789 -88316 -82650 -85764 -96943 -89209 -56001 -52972 -82530 -37091 -21160 16777 75554 46790 71961
5776 71961 91653 21626 -11343 -29996 -27144 1220 24549 22348 12979 -38405 -115926 -124833 -69912
5763 -69912 -24737 5539 -20781 -28924 -9524 29661 -46491 -90536 9721 29206 -4943 -27680
5751 -27680 2265 58355 122771 92291 36887 35461 38200 34861 53745 43218 52250 64297 76123
5738 76123 65359 74077 18005 9460 5418 140 -51275 -3641 47629 64254 85099 77209 74775
5725 74775 67723 14274 -53865 -73470 -73073 -45779 -31259 26553 70132 51126 73835 88918
5713 88918 54020 8895 27783 24866 -60137 -61502 -26360 -69283 -69371 33379 122955 106869 72834
5700 72834 4748 -44246 -31878 -19892 -10922 27971 23279 33006 60377 1908 -1384 44592 52220
5687 52220 19659 -5812 -7627 24264 110392 104432 36907 -49671 -49322 -58369 -49988 27745 61401
5674 61401 45414 -15323 -54929 -51782 -28986 22147 75470 67051 44249 -8013 -11260 -15513 -46245
5661 -46245 -69883 -42279 -72942 -28659 50970 39993 11029 54803 96585 119213 95178 77030
5649 77030 75578 105858 67953 -17636 -69691 -68709 -41141 -2059 -32734 -67737 -149605 -87641
5637 -87641 -68767 -86144 -37005 22233 5718 15404 5032 50598 56130 28181 23486 75763
5625 75763 61024 6472 24562 5348 3940 7745 2056 2501 -9808 20974 30104 31052 -27919
5612 -27919 -69638 -44660 -22075 -23164 -11615 40102 89177 43706 17392 44942 54624 47017
5600 47017 39090 39163 60271 62463 29045 -39329 -53962 -24566 19424 13005 3594 63278 61742
5587 61742 48257 13912 13697 63437 65794 26138 44616 53059 84066 82341 57490 69159 25988
5574 25988 44892 77173 72928 31678 -45891 -23132 29693 41991 45465 3451 -69727 -35566
5562 -35566 54642 61425 20109 14130 30982 6727 20251 52828 59709 64943 114671 118831 76436
5549 76436 101089 119976 82430 69065 45803 -6819 -19927 8631 58054 72483 45899 53458
5537 53458 20020 8049 8008 89055 61953 57299 -271 -23607 37617 20153 35523 32638 54312
5524 54312 44830 11302 5023 9584 5028 -9957 -8529 -67258 -95975 -42524 -31339 -20079 -26823
5511 -26823 21399 70944 17242 -47379 -18109 21955 -348 -32339 -26511 20234 74243 57060
5499 57060 20118 -31698 -46789 -53478 -84799 -47344 -22917 -39367 -6068 48416 82320 38064
5487 38064 9425 -29751 -23525 2150 18053 41670 24223 -26301 59652 56016 60677 76806
5475 76806 80016 66479 -2064 37163 99940 139503 148725 119825 105029 126248 62704 -17780
5463 -17780 -53708 -23659 -42707 -45906 -18274 -33824 -28701 -6077 -36360 41658 92886 68454
5451 68454 41070 -44079 -83182 -48414 -36849 -10109 28758 35849 24504 -9753 -38505 -55095
5439 -55095 -81917 -66003 -23067 -11835 -4565 -25593 13004 31043 3006 22466 27010 25502
5427 25502 61921 112332 95792 53344 1578 6857 8618 -61202 -23059 42044 70734 69077
5415 69077 28700 91659 101158 -22964 -96815 -62429 -39111 7584 -56269 -67643 -52981 -44369
5403 -44369 16917 67707 83386 63106 60823 38923 67917 91106 53674 19395 -5108 -11214
5391 -11214 2746 -1023 28615 2128 -64622 -59464 -32331 -32905 -16361 -18276 -19545 23700 -2524
5378 -2524 52 15788 -12185 -17252 40806 85362 62765 57253 67683 32709 19766 32098 34689
5365 34689 -19172 -36887 -21048 -28075 -24366 -33094 -43127 -74065 -56036 -15574 -5834 33 8460
5352 8460 3343 23297 -12103 33357 54766 6921 12038 -6701 -83305 -41910 -16961 3132
5340 3132 34869 31708 14402 4235 -23198 16178 18325 -27227 -106147 -157027 -120219 -141052
5328 -141052 -114731 -110109 -128976 -73852 -7025 -26597 -28438 21538 1388 86138 125391 136132
5316 136132 158924 149788 108131 66851 50261 49862 23092 -24882 -85808 -111943 -98916 -39709
5304 -39709 -25504 -28115 -30775 -57635 6072 33237 -42610 -41319 -63007 -102473 -144228 -74853
5292 -74853 12015 -5948 -35226 -20808 -10550 -33413 -79335 -46688 -20701 -34905 -13070 -12069
5280 -12069 -21753 -82029 -81143 -41008 -40316 -52385 -69282 -24113 -18472 -33225 925 -309 -27206
5267 -27206 -49254 -3077 29760 34380 78249 93517 44805 30101 32391 26475 29628 64098 48985
5254 48985 15966 -25052 -97846 -49340 -11611 -27644 -35687 -10665 -4023 -24324 15852 39253
5242 39253 66591 64648 14038 2605 50575 15277 -25450 -44219 -19130 20501 35891 33394
5230 33394 37153 47961 8791 -38591 -54892 -6631 12393 35750 5213 -12157 -17126 -93
5218 -93 55421 102021 26432 -24992 -41079 -40915 -40824 -15764 -85400 -68581 -37332 -37879 563 1546
5204 1546 -24767 -9261 42959 5819 -39035 -94893 -100408 -42053 -28759 -33889 -56900 28190
5192 28190 98841 48669 9278 63056 73057 23158 -15157 -64762 -62029 -8649 22621 18267
5180 18267 10479 -3938 -28375 -10932 -13362 -18275 9921 -14157 -72138 -27537 29851 33153 11286
5167 11286 19457 -28199 -7974 7724 41933 97259 9133 -42492 -47695 -48269 -67038 -54680 -14378
5154 -14378 2998 22666 68191 19282 -7611 2133 -6071 -6143 -29250 1246 -12100 -17221 -20328
5141 -20328 -58477 -43487 32934 59346 45372 15584 22384 35210 41694 28560 -31456 -22691
5129 -22691 5885 36383 60521 42858 -25062 -6470 33969 58879 -2020 25496 19970 -10686
5117 -10686 -38812 27153 91111 67175 20157 -29167 -60086 -45360 -45808 -55305 -44720 -29453
5105 -29453 -28437 33323 66487 54987 54408 91698 53584 58812 37266 68729 33513 29668 25027
5092 25027 22915 -6198 16 31291 83703 82545 70064 9211 49601 45077 14634 -10631 -45282
5079 -45282 -43655 -13120 26657 6900 -37640 -3701 6214 -76733 -119930 -117480 -86940 -56784
5067 -56784 -32181 15516 24548 7465 27061 63739 86084 88270 93093 80033 61467 74211
5055 74211 100398 121795 91179 67478 37770 44807 45968 42474 32059 -28951 -37017 -18867 -20968
5042 -20968 -60479 -69176 -65354 -20973 31411 -26848 10220 65026 84429 59755 37379 -1000
5030 -1000 -39066 -72290 -105241 -57730 -28823 -42307 -48943 -57059 -33817 -14261 22506 6721
5018 6721 25533 -13622 -28397 17614 11980 -32370 -21208 36542 17051 9121 7540 -15346 -47739
5005 -47739 156 32009 18719 24502 26389 2340 -37747 -53901 -41107 -13106 -21990 -29197 -43290
4992 -43290 -7868 -4133 -9221 -2855 -10837 -66473 -80899 -23549 29227 43614 72492 -16199 -29573
4979 -29573 -50289 -16076 28215 39548 62360 64414 10185 62845 99572 30834 -19915 -42363
4967 -42363 -38049 -30601 -9094 -24202 -39086 -36048 -23806 -58981 -76208 -6512 -1103 11142 33100
4954 33100 -16614 -80133 -85357 -69765 -52603 -53686 -74670 -61806 5545 27642 21238 -29561
4942 -29561 -20762 -50633 -80663 -13068 8811 39465 53541 84713 38543 -6195 -18973 -37808
4930 -37808 -51774 -61548 -63922 -41130 -27665 -3033 -31163 42257 54622 73525 41235 44086
4918 44086 73727 69661 16021 -3233 2475 14596 40228 30946 27098 36459 64549 99474 118812
4905 118812 101279 24869 -67780 -82463 -45276 -28905 23015 19355 48 58726 21838 -99604
4893 -99604 -143008 -144657 -126324 -75300 -44475 1406 65743 78117 25625 -14284 -24436 -77039
4881 -77039 -52505 -24715 53859 75266 77607 29183 -15056 21541 68096 109176 105947 101987
4869 101987 57098 21906 99146 118471 81225 87496 50293 30407 58668 66122 52103 10161
4857 10161 -6963 27713 19154 26198 -40769 -66852 -29297 28398 34748 61060 47931 85340
4845 85340 109551 93584 67744 24247 1049 25381 47285 -14845 -20659 505 1198 5657 19276
4832 19276 9358 58129 4452 -22202 -36194 -42428 -47453 -33814 -52305 -73233 -108768 -91872
4820 -91872 -28934 29489 40449 56286 16718 -14501 -73976 -57044 17457 -28167 -26355 -37598
4808 -37598 -31202 -10514 5953 43240 74020 37596 -40984 -40339 -28316 -20296 -35307 12398 52701
4795 52701 41874 62665 79417 2172 -62570 -44269 -22675 -15187 -37740 -47061 -9747 20828
4783 20828 21899 -3899 20741 2986 9568 32408 53403 22490 10652 55431 52976 57533 57088
4770 57088 42858 79465 80311 69885 41778 67983 66149 15752 5709 13031 11505 43811 3520
4757 3520 -31443 34818 15428 42916 79646 107447 98781 100619 70124 -30042 -12583 -16148
4745 -16148 -63347 -63409 -36226 6514 8741 -21382 -52734 -83712 -68277 44678 -1963 14479
4733 14479 32794 15664 45458 33691 7121 15434 68356 63672 10475 -38256 -19620 -36426
4721 -36426 -70989 -14081 -23215 -69783 -94768 -42041 -23580 -36180 -32287 -15738 -15888 7165 23216
4708 23216 -40149 -96677 -86170 6296 -10907 -14927 9481 648 -8757 -46288 -83809 -119574
4696 -119574 -122876 -80637 -48551 16911 2720 -17730 -31746 -34721 -57830 6697 47047 47162
4684 47162 1624 -18678 -35717 -69963 -46214 2743 -24165 8476 -1679 -67784 -54819 -26282
4672 -26282 -22247 -52812 -56852 -93892 -109567 -90401 -60107 -8880 -3698 -54499 12285 50521
4660 50521 13451 -6234 -42001 19008 -13945 -50734 -21603 14073 30949 -10476 -72290 -36800
4648 -36800 -22386 12825 51991 35321 3300 -18378 -27796 -46902 16011 38029 -46257 -65189
4636 -65189 -61432 -31293 -5257 14727 20661 20800 28200 38981 87561 27343 37947 48517 -17421
4623 -17421 -43577 -51329 -5823 -1664 -60502 -31282 508 -6916 -21183 -37995 6162 6038 -11589
4610 -11589 -46893 -31222 2901 16688 18661 -7925 -47937 -1061 -24704 -46078 -52093 -22113
4598 -22113 35443 67130 66214 57467 12424 26502 8099 -18923 -5403 -35087 -36727 65 71936
4585 71936 61546 -5705 -13329 -4351 -2301 20072 66078 37303 -18539 -15645 37130 81203 91831
4572 91831 80667 41417 -10885 15431 29583 20594 -45968 -41185 -14070 -19772 -26820 -92330 -96580
4559 -96580 -25460 -9755 -14238 41405 25833 -16694 -14180 24311 58496 41226 82258 55870
4547 55870 -39554 -23281 25206 23880 11790 17756 66654 99485 55580 20175 74038 51098
4535 51098 18427 62335 93945 132463 117059 95983 84332 147548 174244 15601 -109828
4524 -109828 -69864 -11748 2927 42344 -21840 21398 70221 55872 35918 63666 93141 43653
4512 43653 -49846 -109129 -67484 -81815 -53039 -63900 -46944 -9521 16556 49504 105233 81829
4500 81829 68968 74336 52625 65182 105920 25064 -418 57354 60350 38133 25210 73491
4488 73491 86766 106142 159047 161882 89178 59784 39782 53908 75500 41548 28618 36785
4476 36785 51461 51911 16224 26829 12930 -31796 -18526 -8483 -6507 -9617 36113 6684 -60314
4463 -60314 -27858 27222 6669 -21527 -36565 -55578 -32684 -1058 -2131 -53622 -81372 -18767
4451 -18767 3681 4169 -4285 -30650 -53351 -76276 -85977 -100646 -71607 -51469 -58411 -82646 -76287
4438 -76287 -31095 -20984 44251 53207 41210 5452 13252 -2996 -14546 -54907 -65227 -42534
4426 -42534 -1364 -37215 -63163 -21921 -42061 -44197 -61485 -83922 -71493 -118431 -51831 -8389
4414 -8389 -13495 18434 19885 39999 74134 96408 115770 137421 58058 74995 64511 1745
4402 1745 -23705 -5412 -51271 -6155 16686 -18176 -17214 5261 -6096 -29871 12622 38273
4390 38273 58917 6225 79699 121177 67950 80335 36862 -35168 -87622 -91333 18319 61851
4378 61851 43696 55978 71519 41827 -28218 11159 81060 80236 77407 88797 46275 38180 231
4365 231 -36328 -19771 99810 83087 -12523 -77662 -110472 -145512 -130631 -57090 1959 67373
4353 67373 74104 80507 60092 8651 16195 19046 34478 4962 -22869 -38539 13072 -11428 -32193
4340 -32193 -41706 -5322 15163 60812 89909 53622 277 -28982 -42473 -53591 -68414 -81679
4328 -81679 -112553 -56127 39850 70820 55687 71622 73771 90872 37003 -58582 -66463 -102482
4316 -102482 -76191 11128 45801 72640 8558 -19771 -5405 -36159 -30329 -37406 13193 1793
4304 1793 -9109 6743 -22572 -63138 -77893 -39451 5653 43027 71683 23053 33973 46560
4292 46560 84928 127005 65631 -20645 -72591 -94136 -20623 39788 53948 4469 30023 59190
4280 59190 41033 -34644 -75489 -45097 -63574 -94288 -102333 -63138 -39255 -49368 -35952 -11053
4268 -11053 14745 61056 101673 108081 101585 133599 109027 54444 39280 -19808 1354 14404
4256 14404 23081 33541 -13818 -20296 -17185 -21314 -270 45468 79649 76672 64177 10932 10572
4243 10572 17277 33093 26301 -4072 -15293 2315 35277 -11230 -20713 503 -32794 -9828
4231 -9828 10871 37230 21181 51699 63670 7036 14404 1651 -24574 -23460 32159 74211
4219 74211 34942 22758 57115 104676 120544 108525 82930 17640 -25052 611 53477 63154
4207 63154 -3807 -52764 -7680 34591 69937 67982 113511 107715 50375 11522 -27932 -90751
4195 -90751 -135679 -147209 -115257 -91077 6229 -15030 -29561 -10850 -82085 -94209 -116035 -69537
4183 -69537 -45762 -76095 -93054 -49030 603 3436 -13759 -2707 -32404 -35043 1519 6771
4171 6771 -20642 -31829 39403 102716 111834 61435 32857 68215 50057 -52599 -127804 -108531
4159 -108531 -115253 -67715 36558 13810 -23012 -9619 -29384 -64607 -90406 -87995 -68153 -47231
4147 -47231 27933 4782 -50103 -3778 15113 40625 86646 91891 79419 32430 -38618 -61552
4135 -61552 -17744 -16769 -61690 -49658 -11686 -15308 42442 38829 -3859 -22496 -64453 -114872 -82194
4122 -82194 -59972 -138250 -72856 -20654 -31179 -37450 -29939 11251 39093 -14188 34638 42810
4110 42810 40254 32897 21240 15279 -16849 -54390 -36127 -21719 -9899 23925 7609 19819
4098 19819 -30831 -58972 -43541 27236 54013 38972 -74140 -50499 15718 -6103 -43662 -60175
4086 -60175 -8699 29605 -14060 -67948 -68091 -46988 -49178 19508 86795 65462 53311 58278 -2169
4073 -2169 -80707 -36632 42807 27618 -10191 -7732 45769 77883 -37157 -85636 -113282 -65907
4061 -65907 -29369 -66289 -23684 26746 27828 -12415 -98479 -97178 -65072 -13204 -10933 -66027
4049 -66027 -73995 -49208 -26544 -89476 -95080 -38033 2515 -15429 -61373 -75589 -41273 -70968
4037 -70968 -112016 -101280 -88515 -80568 -86849 -50546 -54738 -44846 -6737 8203 -15818 -15304 10299
4024 10299 5878 -47885 -41316 16630 25964 5404 3204 -4141 24518 14404 64034 147301 164603
4011 164603 90364 40238 51168 52648 23138 108340 152351 154522 162982 126370 76005 7940
3999 7940 18785 -16244 -44750 -85936 -23881 27971 11733 17718 44204 22163 29595 66417
3987 66417 100632 107827 98800 120129 67860 50818 5802 -57419 -59262 -73452 -84806 -59444
3975 -59444 -34577 7024 6687 26610 13290 3059 64315 59408 9011 -11490 -20795 -6192 -33757
3962 -33757 -46749 -57739 -24342 -15363 -84692 -24727 67913 62365 43737 2275 -2439 10149
3950 10149 11492 -4736 -15252 42351 11114 3966 103721 97639 35555 19958 18168 80356 105026
3937 105026 83112 37051 45397 -1672 18572 56864 32599 24944 51176 65892 57863 68494
3925 68494 7041 -8051 25869 62564 107531 122854 58795 88416 82065 70408 47091 81054
3913 81054 48833 30764 -22714 -3330 -18099 14009 67555 30868 -30475 -46887 -12517 9704
3901 9704 -4724 -44142 -69575 -16644 -8817 44403 69325 -19519 -20634 -9221 -16525 -81971 -75409
3888 -75409 -62860 -45971 -90459 -97373 -83294 -33006 1121 -20939 -83052 -61134 -57441 -28881
3876 -28881 -25095 -8015 66223 54337 27144 41466 10153 4262 27609 45869 53108 80315
3864 80315 65789 50270 41061 50477 60516 82329 112649 97636 88775 77726 2398 -76418
3852 -76418 -44954 -14253 -69125 -56792 -42242 -5061 36321 27285 -5234 -3888 -16985 -35059
3840 -35059 -15538 1894 16469 13889 4166 4438 -4882 24578 58684 50990 65292 75237 50300
3827 50300 86586 48806 58179 60630 24530 33875 37353 34871 43960 95368 116095 92234 58055
3814 58055 62321 29315 -23541 -43454 -76195 -73026 -12294 -28162 -71509 -45929 -47444 4783
3802 4783 -7736 24392 -24728 -25602 -8642 -14011 -5110 -3494 -16390 -47869 -109415 -19663 17150
3789 17150 28840 30498 7051 -30792 -21020 26178 49883 21906 88146 97692 61997 21079
3777 21079 78430 121510 83062 59949 52972 59265 17794 27337 15619 50397 60406 42384
3765 42384 11477 -7579 -222 16290 -14431 -21519 -50051 -101466 -117638 -117336 -80274 -68268 -111173
3752 -111173 -103013 -85560 -63956 -52524 -47052 -36779 5007 31008 28294 6874 27915 5817
3740 5817 -33823 32658 24753 38070 82801 90116 35969 -2613 -48108 -69535 -26383 -11330
3728 -11330 11450 3490 35501 118488 82327 41235 35932 5083 36874 52033 38148 8787
3716 8787 26521 83382 24619 -18132 -39093 33099 82014 51422 5939 -21637 3338 51766
3704 51766 98801 106585 110497 116655 56055 64265 60159 92657 70802 36398 30418 46803 74656
3691 74656 61825 -8238 -93507 -80709 19439 18203 -8443 7828 13858 43090 25227 3767
3679 3767 42249 120508 72410 24535 39955 18048 33082 68213 38434 -25937 -26342 -89956
3667 -89956 -108272 -69262 -87358 -69944 -39566 -56211 -21073 82082 51062 -23000 -109668 -71822
3655 -71822 -86605 -60877 -48483 -64071 -57804 -116400 -94041 -5169 12253 33184 27300 52969
3643 52969 32016 -43820 -154528 -149017 -141422 -106506 -18800 45511 59829 59591 44449 49748 90728
3630 90728 142169 102987 -15461 -76964 -68362 -15216 -21999 -40216 -129571 -148177 -78819 -11993
3618 -11993 29266 10735 -6682 58170 101337 116165 90959 34761 26755 47367 45045 50548
3606 50548 54597 38323 19315 17442 12296 34421 -7764 -40450 -8372 45749 115406 82242
3594 82242 45312 60131 59393 35754 -121 14665 14666 15390 16448 20926 -29354 -83872 -78575 -55212
3580 -55212 -26029 10260 -17969 -22324 -4131 38641 51436 32250 -6035 9689 -10640 -17216
3568 -17216 -7767 -23520 -18849 54166 31508 7344 -58958 -102536 -43949 -18609 -14821 -56852
3556 -56852 -86948 -43556 -21089 25113 37001 70290 67314 19198 49491 66123 42309 -20061
3544 -20061 -76086 -116654 -74373 -52107 -103491 -126087 -149659 -96823 -27565 -60292 -61908 2437
3532 2437 32649 -11003 -22607 17711 43437 69537 64684 64010 119268 80927 21729 -2036 6905
3519 6905 41307 41539 10065 -57575 -39618 13931 89735 86760 45786 50732 31089 17319 33839
3506 33839 22039 47215 18724 -14795 -15248 -18213 29458 29593 26185 18931 -3827 35398 13397
3493 13397 -5560 12609 -19321 -28363 -12274 36463 68134 99599 22810 -37542 2681 -32610
3481 -32610 -29920 -24777 20864 62341 -2214 -21224 8176 -33268 -74839 -51046 -114708 -107477
3469 -107477 -24635 -29274 -41641 15374 44082 26326 -20278 -23792 -29318 -18127 -24831 30242
3457 30242 94331 123240 115213 73650 46891 14581 72429 131581 71272 16826 8061 56863
3445 56863 71193 60127 30429 -14602 -49080 -45633 -31294 -13236 -30425 -27836 19574 40722
3433 40722 12400 -38427 -41645 -13536 34544 51670 38710 21223 58603 105376 69532 64684
3421 64684 46748 26166 20383 34440 38601 20678 21649 18967 48213 59950 44371 24517 -54118
3408 -54118 -34468 40537 25615 -28514 -26602 4195 -55789 -15980 21194 56457 21457 -7566
3396 -7566 57334 83150 54453 28273 43836 72908 38846 5948 26123 -14957 -4198 -1590
3384 -1590 47723 45267 -34071 -74109 -33619 25268 10605 14378 -57010 -73286 -39143 -42124 -5814
3371 -5814 73148 91864 66704 40864 9628 -10521 -9192 -25925 -76381 -42528 -11542 31901
3359 31901 41233 84143 62132 475 8767 45567 82912 24785 -4336 -1903 -13238 -27668
3347 -27668 26658 30355 28412 47970 82042 76303 128136 91301 9774 -15235 32535 88352
3335 88352 77530 60219 63982 64217 10350 -10071 33559 -19877 -63900 -93058 -94643 -75282 -52581
3322 -52581 -51018 -102198 -107700 -56164 -58150 -47135 -12106 2027 -61442 -48052 -51879 -92145 -97736
3309 -97736 8273 45086 36165 24479 12157 28212 27760 9974 -51107 -59910 -92937 -4046
3297 -4046 21318 52667 109229 83679 27875 7284 -18991 -108889 -140685 -108396 -138597 -125098
3285 -125098 -104076 -116027 -77745 -56845 -97232 -96675 -68249 29858 23471 42946 39889 -13199
3273 -13199 -31332 12113 -25440 -75481 -83421 -65715 -54967 -98739 -127846 -84317 -52792 -40438
3261 -40438 -43598 -83939 -61158 -57835 -45929 8418 -13943 -48130 -81069 -122532 -134679 -82582
3249 -82582 -5637 21292 44155 141005 124417 122647 109197 74487 103217 69888 -20142 -10031
3237 -10031 25597 43547 -15727 -59321 -41618 -52049 -10102 -24946 -122316 -123100 -84806 -13081
3225 -13081 -23191 -37194 -39512 -50768 -20822 14259 9457 24997 35769 -25285 -57047 -27072
3213 -27072 1578 -27428 -12443 -25348 -12134 -5543 -7166 -34088 -1782 17428 4086 37479
3201 37479 64705 72412 44792 56360 55313 41770 29934 12701 -988 12946 29496 24606
3189 24606 -20187 -16787 32773 88095 87480 45494 44581 52952 30767 -44486 -51720 -70804 -20532
3176 -20532 26941 42360 93148 66509 44376 48568 64340 19993 33705 5083 16167 37629
3164 37629 47481 -8551 -35965 -29540 -6100 16704 58084 79074 84410 93503 19434 -40715 -48731
3151 -48731 -35817 -27252 -3198 -28538 -24112 21194 57222 110500 41291 -10601 61667 60419
3139 60419 -16898 1345 34943 62804 47765 -8037 -12063 19755 -37958 -62751 -43622 36064
3127 36064 25903 5007 -31618 -6203 18052 23458 32158 61073 13619 -18792 -15366 465
3115 465 52450 49816 32669 14638 -30546 25747 49810 46513 23550 -28129 3329 17574 -10451
3102 -10451 -21070 5730 -16386 -44045 -14676 -32971 -69580 -39839 -27488 -32887 -33029 -75308
3090 -75308 -62875 -57701 -66227 1684 28991 11202 -8735 -6795 -43724 -54876 -54978 -26485 -3568
3077 -3568 -50899 -72193 -21705 13485 7776 16158 55818 58827 1830 -28614 -9650 -24787 -18782
3064 -18782 -8285 -31846 -21609 -26451 -14739 -12783 343 2014 -18995 -50568 -37790 -22455
3052 -22455 -19313 -31026 -45465 -70900 -46068 -28477 -49334 -37135 7912 -33591 -70028 -73616
3040 -73616 -80416 -58639 -3852 -12475 -32070 -64016 -63986 -51736 -37031 -26633 -79162 -92520 -56171
3027 -56171 -47333 -101662 -102019 -43904 -14076 -26359 -33639 -5574 21772 -26086 -83940 -52804 -45067
3014 -45067 -28599 29441 3747 -47812 -63454 -58115 15282 21928 13881 -3927 -32640 -26955 -45202
3001 -45202 -44923 -2551 20010 35965 28049 23445 14078 16155 -3777 -32121 8879 13812 32037
2988 32037 72359 45105 23066 61871 47621 -18857 7418 -26013 -80205 -86804 -77938 -23354
2976 -23354 -34129 -67528 -108939 -116978 -68242 -52067 -37547 -33446 -74366 -100120 -75336 -74075
2964 -74075 -82851 -64868 -33552 -29689 -48145 -8842 20993 34285 35451 28475 19472 1956 -25329
2951 -25329 -48963 -24630 77322 107760 91710 76659 61272 32053 -2116 45593 63093 15278
2939 15278 -10153 -92380 -93671 -82538 -99557 -51267 38528 62814 28770 34763 54960 90955
2927 90955 93092 52984 32361 -7973 -40402 -8348 -9613 37909 119178 80813 49813 41033
2915 41033 25096 -23337 -46550 -39214 -15169 42256 35120 25514 27595 1288 -3577 19024 55783
2902 55783 76976 103683 9962 -77090 -9442 33192 21053 36699 53139 48720 62263 39274
2890 39274 -15546 -61180 -77408 -16480 26175 46773 14707 1653 -18779 -42350 -65335 -89923
2878 -89923 -55015 -2996 3255 24499 7778 -38133 -17002 -36182 -59911 -16012 50499 82323
2866 82323 108572 61031 -27193 -36051 13356 -52085 -87010 -86872 -21445 -14587 -49817 -80772 -97570
2853 -97570 -63978 -19661 -49735 -40816 -6717 11482 7418 43558 17737 -34843 -45288 -60141
2841 -60141 -6438 60139 22380 2249 25135 37534 12918 11590 40807 68768 62798 33153
2829 33153 27302 31299 105178 159568 115574 74126 20100 -16338 -27147 -15004 27678 13519
2817 13519 -9513 -21706 -8079 -6848 28792 80593 77946 111183 54733 21808 53571 44014
2805 44014 38258 61936 103786 130525 108061 71116 11662 -26953 -20504 -8708 27207 35604
2793 35604 14357 22809 65647 71470 20146 -9814 -2968 -17176 -3453 45974 101747 59820
2781 59820 24549 20869 63044 51737 24488 -27558 -25037 -18219 -19884 -38546 -19787 -25095 -1480
2768 -1480 25947 68996 52382 -1210 -23325 -32381 -22867 -6892 18053 -4838 -30843 24516
2756 24516 -18990 -112873 -178347 -159759 -83722 -42181 -32314 648 -23694 -21493 -5205 -7960
2744 -7960 -8624 6252 -1517 19664 55180 18259 6865 -2455 24401 58597 118280 84269 36644
2731 36644 20031 34178 20464 84457 96642 43595 -4573 -40197 -404 84480 55668 -16900
2719 -16900 -9643 -51864 -36004 -12620 26440 67147 16290 -21653 -13813 53669 76918 54881
2707 54881 42870 13399 -45888 -36384 -39898 -16765 -15215 15362 -6267 -49528 -86154 -94659 -68650
2694 -68650 -45896 -75164 -138602 -128488 -58823 -55458 -39800 2193 -30566 -17559 27777 6578
2682 6578 12183 44700 -28277 -45193 -10884 45515 60378 39755 69824 36112 -53683 -102616
2670 -102616 -118653 -141335 -100819 -59384 29800 52647 7010 -23756 -6899 25839 44881 15159
2658 15159 -48683 -75923 -95971 -71140 -50737 -18798 4962 40733 46354 65317 125798 108167
2646 108167 39851 5460 -31572 -51259 -35384 -26311 10593 17055 11128 5335 31827 42845
2634 42845 5018 38166 42497 -7627 -55485 -35003 19154 5861 -34926 -40648 16592 52546
2622 52546 -744 -22620 -41955 -20488 9440 122476 207964 188878 137942 73870 9960 23092
2610 23092 69295 53235 61353 49997 -8508 -106167 -77608 -68433 -11104 70974 97534 83264
2598 83264 31382 48353 31701 -21547 -17953 -54418 -114368 -121337 -102370 -99271 -100819 -30449 -17083
2585 -17083 4885 44191 33908 -6217 -15964 -18724 -69276 -95035 -20452 13060 -34874 -50587
2573 -50587 -36183 -16400 -10181 -3783 -13308 12483 1008 -50264 -45479 -12501 16396 69253 40848
2560 40848 45250 56903 100664 122218 163505 193052 145491 162648 142840 73970 -10696 -10879
2548 -10879 -22133 -2185 8215 61190 18385 -26992 -96276 -107837 -71591 -9122 79726 100592
2536 100592 131638 130164 137868 107090 76789 67327 54634 39911 16291 1785 19175 67221
2524 67221 23616 11003 6864 -36713 -47826 -79262 -45994 11945 18268 -3313 4903 6779 -99799
2511 -99799 -128312 -95212 -51237 15198 40105 42721 -2441 -32302 -48835 -5393 33843 -906
2499 -906 -46907 -49923 -61048 -33276 50971 -2580 -26650 -37754 -42459 -49908 -30649 -15489 -5561
2486 -5561 19247 15557 -20170 -43887 -120019 -104137 -84168 -105634 -139285 -143097 -73720 -28513
2474 -28513 -34169 -47830 21147 27010 8838 -26847 -29261 16521 -7022 -47436 -11184 -8518 -64207
2461 -64207 -57553 -23073 -22388 -96696 -123805 -108553 -79329 -72175 -2190 -20172 -51737 -79616 -85191
2448 -85191 -64679 -19357 -1378 -8673 -66012 -90008 -49673 -40545 -8285 40677 53396 8502
2436 8502 -35372 -83362 -83810 7818 -27452 -46553 14748 4763 24923 94617 87805 81709 9451
2423 9451 -54322 -46527 -74242 -103368 -132572 -65120 -19142 72136 105384 65816 19513 12223
2411 12223 32194 3873 -48615 -49836 -22593 -40633 -2923 24479 50067 80529 87860 51079
2399 51079 46664 6481 -15806 -28249 7786 -2761 -36582 5951 34529 26170 -1762 -13909
2387 -13909 -42348 2395 18278 -36626 -47956 21048 67810 73222 63386 4160 -51727 -71065
2375 -71065 -61031 -138438 -90507 -26209 -1098 17715 -32521 -23296 -26389 -3670 -33373 -30048
2363 -30048 -24559 -62996 -62147 -18246 -27266 -15113 75137 105872 40468 29775 -43916 -58178 -27971
2350 -27971 -42324 13479 8832 -16095 -16288 -14266 -42929 -76987 -80771 10871 34088 64834 17882
2337 17882 -14575 63956 61184 34941 13920 50689 73785 31854 -21086 -39522 -46138 -14012
2325 -14012 49789 56417 35971 10647 -38584 -61730 -17264 253 7063 -9300 22581 59564
2313 59564 36126 43344 43144 116839 126153 30441 -22399 -38258 -25316 37961 109945 104447 83316
2300 83316 71724 37218 -44644 -7975 15848 44124 73814 73927 14580 -22455 -29545 -42553
2288 -42553 -16020 -26396 -50590 -74790 -59103 9188 -26927 -98879 -79322 -7776 4672 68182
2276 68182 49810 44549 73754 18503 49183 87267 1998 -19064 19932 -10023 -48386 -31300
2264 -31300 14874 25742 -12692 -51508 -69931 -62265 -72942 -3329 34956 59643 50470 45185
2252 45185 41934 -21382 -93629 -133630 -95482 -60205 -66659 -91289 -82825 -43733 17271 7873 -55751
2239 -55751 -109904 -84748 -104270 -87764 -81997 -76013 -25252 -60213 -76143 -67647 -10491 54009
2227 54009 73920 39516 -23856 -51291 -68543 -24331 -68848 -74328 -47539 -29578 16531 36535
2215 36535 -9184 -2254 12034 -14822 -19296 -33582 -10542 11935 24353 -10686 -49702 -57263
2203 -57263 -48788 24283 33641 81407 101665 72072 62382 80647 92661 31379 35611 63183 106808
2190 106808 107643 75212 19331 -17475 13856 90664 36632 -8649 -26074 -59902 -72488 -68255
2178 -68255 -75912 -16134 -14759 -50696 -47411 -12022 23654 73075 44530 23380 56001 71591
2166 71591 63308 41586 23490 -28015 -53827 1164 -3768 -75685 -75835 -72448 -105714 -116998 -75880
2153 -75880 30228 98813 97493 46763 -23354 -60274 -76673 -115562 -99586 -41639 28840 1840
2141 1840 -8038 40397 41054 24447 -8050 -21164 21737 16049 -33300 -39299 -29551 -22182 9166
2128 9166 -1292 -6439 4099 3724 4291 16008 12133 -22043 -89957 -81762 -41560 -7963 32918
2115 32918 17598 -14483 -57432 -49012 -72862 -102188 -72345 -16357 -19602 -19773 7799 -4948 -29905
2102 -29905 -50434 -85317 -79976 -98993 -117049 -95170 -52528 -42635 -40050 -33948 -46694 -69050 -80074
2089 -80074 -63094 -24226 63085 110401 112604 105178 54316 -16590 -35029 -31206 16579 5514
2077 5514 -22029 -29476 -12774 36072 23174 58827 12296 11662 40086 56447 119988 76449 29747
2064 29747 -5061 2415 12322 40531 35017 -27387 -21906 -25068 -17454 -30021 981 7079 41019
2051 41019 73474 77337 58729 -7085 -18318 6379 -4800 -18686 1679 39498 17994 -24577
2039 -24577 -63631 -78136 -87372 -76136 -39819 -2394 9147 -52434 -61452 -39369 12748 34634
2027 34634 -5872 57322 93919 52190 30250 7018 14167 -10245 50939 95157 85263 43784
2015 43784 14003 35391 40560 15993 20569 35970 40380 71379 53566 39796 -2892 11522
2003 11522 82300 66915 37344 -28752 -54071 -39415 -27235 2109 1949 -19237 -15735 -56269
1991 -56269 -84173 -81455 -108718 -102662 -85252 -56764 -83610 -103501 -79106 -31719 21551 -68746
1979 -68746 -110511 -86907 -63680 -43303 79479 111479 99393 49431 14213 9793 22049 58265
1967 58265 96984 85541 87807 62524 32152 22483 30127 37273 48341 67100 45717 23492 40011
1954 40011 13717 44531 31026 18007 8513 11115 -71706 -130769 -139369 -125064 -111913 -94645
1942 -94645 -40938 -22291 -9512 30027 69570 74515 8129 -59073 11586 66549 42981 34439
1930 34439 24684 33363 68250 -34891 -114799 -122422 -70879 -56429 -67696 -57246 -92024 -73097
1918 -73097 -39155 -23923 -48582 -73322 -36533 19143 -6234 4549 50529 50686 46465 36926 -80071
1905 -80071 -86240 -12786 14020 -4382 46447 93552 54799 -4382 -39165 -68429 -75824 -63931
1893 -63931 -12389 60540 19069 -7733 5775 12831 -15999 14082 -20719 -98102 -113241 -71809
1881 -71809 -23325 -38957 -26087 67690 114889 51091 13503 -3530 30632 45016 64055 84564
1869 84564 29274 20432 46622 44400 -53938 22216 100297 126289 98285 88525 54777 39144
1857 39144 49289 6855 -77345 -92973 -58036 -54869 -5987 -11075 8627 23870 -61189 -90175
1845 -90175 -56096 13041 86401 99877 48619 39937 51367 50999 -7823 -50838 -42494 -14981 -4839
1832 -4839 -3162 -13924 -37636 4949 -12848 -22433 -10706 -48834 -98724 -73251 -52510 -12027
1820 -12027 12159 -17684 -17463 -18553 -11864 -2500 2897 25191 14991 29980 12355 19294 -21728
1807 -21728 -8472 -37517 -50886 -13657 -54810 -78663 -11853 50307 55699 -28574 -57630 -40087
1795 -40087 -1488 -1172 -28169 -18400 6246 28824 34512 30892 51202 46732 19075 -18925 -40413
1782 -40413 -10649 -34510 -49167 -48093 -37892 -21116 16731 -2401 -14585 -6491 51783 68467
1770 68467 44358 -11863 -36011 -26063 -21546 -17424 23466 47700 46488 73344 44478 11834 46140
1757 46140 107984 60806 38436 31823 50903 61043 75898 33388 8015 21769 11059 -49708
1745 -49708 -100479 -109225 -98468 -21732 9 28186 -34280 -48110 4469 45519 2041 44170
1733 44170 103995 130754 79665 85448 66040 93712 72646 12137 -40129 -77244 -92590 -109867
1721 -109867 -138038 -106754 -41051 -11743 36049 25201 65663 62495 -29569 -12400 31977 -12576
1709 -12576 -56139 -72413 -39030 -25203 22275 32705 -398 -26388 -46485 -28240 -96860 -92293
1697 -92293 -123076 -121131 -72258 -64490 -65130 -39213 -9781 -2337 -2221 9841 -3658 -2039 -18827
1684 -18827 30071 23810 -49045 -56034 -46800 -104184 -57338 -21609 -4864 64171 107069 53400
1672 53400 46401 32515 -8488 -57549 -33188 4732 23675 68118 87584 70140 129069 94914
1660 94914 56911 52999 72555 29369 32095 -20506 -38528 -41822 -79563 -56247 -55956 -40175 -23140
1647 -23140 16447 79326 76334 -47993 -81324 -124856 -120388 -71638 -28904 37532 41523 41695 30239
1634 30239 15522 635 11256 -16136 -57141 44774 60102 104210 163925 96761 -570 -44306
1622 -44306 5539 20804 6502 10948 -11844 -13767 -40469 -55387 -4178 9064 41853 43014
1610 43014 71724 101808 100516 30842 -36537 -28048 50679 46546 69562 110263 80128 83851 17452
1597 17452 -6496 11746 48059 96957 21199 2196 -14338 -66717 -17555 46754 67352 81742
1585 81742 24939 30072 52228 63412 52516 86310 152763 154528 92084 104633 93142 91168
1573 91168 76299 38488 -14518 -37719 528 36941 44828 30205 18149 7852 -24539 -38335
1561 -38335 -34764 -7382 45346 42445 13381 46666 21338 17143 -44708 -54141 -75409 -52766 -49703
1548 -49703 -62095 -27899 -22365 16587 8218 -19575 9971 41814 15806 -16757 -9311 0 -16505
1535 -16505 -24649 -19280 -17690 14474 85776 66143 36171 6457 -15674 23024 6510 -49536
1523 -49536 -67322 -94291 -29155 14803 8156 18219 47757 58789 36382 27794 -20137 -22807
1511 -22807 18965 -23734 -89841 -88821 -54433 -47885 -8437 35156 21693 -10554 2045 130
1499 130 -22158 -10296 55470 92781 61614 40915 44726 15003 -22995 -13189 -19730 -67385 -111254
1486 -111254 -129611 -109653 -82159 -45420 349 3430 -26938 -25243 -64829 -64070 -62490 -24830 -21614
1473 -21614 -23308 -15169 -29840 -67332 -114046 -133287 -94757 -87808 -99722 -77700 -45085 -18292
1461 -18292 -41380 -117381 -49065 -14979 -32744 -7307 -76954 -113003 -101442 -30183 -14034 -89024
1449 -89024 -133702 -89003 -129015 -149040 -94217 -80119 -77003 -11428 10367 -15306 -42821 -60395
1437 -60395 -100885 -26912 73127 72972 42210 52846 85685 71817 12081 15749 10180 2981 19291
1424 19291 60655 24841 20163 18163 -7333 -57467 -76884 -56062 -43608 -61683 -106121 -35524
1412 -35524 18297 36085 -34386 -59500 -26486 -12780 1711 6992 -21959 -67254 -37769 -11048
1400 -11048 -14748 -45509 -14195 -27919 -21545 8657 24840 -37428 -39684 13399 65541 106066
1388 106066 74670 52460 49018 21862 5196 -22944 -7893 39685 50327 37270 72733 108599
1376 108599 55008 28317 55725 90182 93362 -1871 -7731 47844 88737 67993 -6795 12974
1364 12974 73464 36174 23412 60194 31254 51943 49063 31872 25819 6067 23643 8062
1352 8062 337 -30035 -34852 -19511 -51748 -30623 -13842 1554 45281 40106 -1236 -32041 -48393
1339 -48393 -106461 -100015 -52876 -20846 9489 40612 2620 -64255 -85134 -38080 43819 28056
1327 28056 -18701 -45704 -32337 -7545 -38312 -73317 -57640 -73906 -43652 -75256 -75902 -16028
1315 -16028 -1365 -69222 -75786 -48769 -74728 -116381 -53141 12751 14039 88902 125104 85268
1303 85268 49354 67788 109349 119897 76173 16382 -11270 -32844 -12442 9923 -18960 -25826
1291 -25826 -65478 -44278 11817 44658 56639 9673 24732 33637 38998 29667 34158 93431 87591
1278 87591 49618 -7550 -70613 -69600 -32543 56790 51236 -21932 -76505 -114814 -126649 -62469
1266 -62469 3194 4778 19955 -31198 -118981 -129718 -61498 -25525 -74073 -107667 -62954 -53494
1254 -53494 2658 -26810 -75644 -83456 -92904 -96377 -49742 11315 29706 24235 37303 2263 -13166
1241 -13166 -29507 -74139 -73734 -74653 -25359 -2324 -19343 -21605 -55497 -43682 -3497 -77800 -97973
1228 -97973 -108906 -94785 -53924 -81984 -93395 -8437 -11904 -33955 -7348 10635 -7410 -8201
1216 -8201 14812 -36719 -55472 -11953 1112 -9184 -45837 -74561 -98097 -106402 -108636 -65764
1204 -65764 -46086 -24783 -155 10483 24725 8505 -54968 -65497 -70935 -50556 -11917 44904
1192 44904 70124 29947 43820 -6035 -817 -19363 -51545 -31888 46445 52119 61056 61235 66286
1179 66286 71748 13469 21907 91097 63597 10237 -43534 -69626 -87517 -75696 -24267 46241
1167 46241 52374 42223 25843 65174 42509 -3937 -15589 63668 110284 139507 134298 93286
1155 93286 50005 9634 36453 7943 20296 62810 50943 48007 39636 49458 16743 34053
1143 34053 -43422 -43034 24588 11934 -46044 -30909 14747 36345 -34906 -57302 -41560 -25666
1131 -25666 -52577 -60122 -83289 -29005 -8640 -25729 -797 47474 39930 19272 35662 21666
1119 21666 40190 4336 2707 43460 54742 -19755 -90343 -34598 10835 -61431 -124437 -30670
1107 -30670 46532 -24353 -71729 -19353 38699 -6282 -49768 34 -15122 -56142 -30943 3097
1095 3097 32247 45258 45151 43521 61299 1657 -5493 -15162 -9969 -4810 36708 67180 79975
1082 79975 57688 33267 14264 -27299 -49216 -33161 -61359 -38870 -15052 68132 65076 37835
1070 37835 21100 11643 5786 17526 22550 27378 80060 53244 29144 14670 36933 23501 -19852
1057 -19852 -80016 -90065 -76247 -15057 21342 -7516 -49247 -27317 -39364 -32913 4994 4128
1045 4128 -22275 -76557 -49630 -15060 -27883 -39697 5049 590 4055 -4055 12324 32896 11348
1032 11348 1328 -7495 -67775 -83632 -91326 -60995 -48725 -41438 -94084 -96232 -77513 -57415 -12146
1019 -12146 -5272 -51215 -40208 -23843 -16143 19845 69215 50409 -25502 -72810 -60660 -5993
1007 -5993 54907 66316 53185 13510 -39833 -94405 -69736 -6664 -20354 -107099 -110443 -121609
995 -121609 -28147 49722 80634 45913 -20900 -65890 -39096 13258 -17559 -36928 -41867 -85058
983 -85058 -71985 -40775 29451 24920 -8368 -18614 35441 10078 -28431 -18427 -4513 -7806
971 -7806 57694 91632 44798 14081 -31200 -55400 -55229 -65496 2483 57046 68674 -13530 -67591
958 -67591 -3384 85109 61302 62642 44183 -3311 24703 49794 58708 71113 26195 -31850
946 -31850 -37508 25660 49281 -6626 -75272 -94275 -54479 -16115 -30478 -130770 -139942 -169093
934 -169093 -181257 -122612 -95677 -65626 -41443 -18315 36933 25421 -30527 -34628 -11570 75515
922 75515 30766 -22251 48525 107883 97096 58046 54850 34554 -7234 -63465 -72975 -36890
910 -36890 -29230 -18302 12646 59829 67437 56452 16716 4990 -22525 24629 56978 57219 23493
897 23493 19345 62027 112349 74833 25757 35276 51729 40503 21586 -50829 -87232 -102067
885 -102067 -137835 -89496 -58470 -27101 27800 18387 4766 3846 -20010 -97986 -119575 -83437
873 -83437 -11712 1352 18302 1147 -59426 -13605 965 -29799 -38375 -44512 -45871 17821 58772
860 58772 62631 49889 36104 33564 21396 -7338 -36906 -92896 -132729 -149974 -109843 -36069
848 -36069 -1065 -12756 32136 18719 16836 48127 854 29687 24568 1616 46705 46761 -4761
835 -4761 -2540 11768 106425 187351 176437 90505 10377 -31038 -54110 -46359 -42874 -93506 -107261
822 -107261 26710 875 8792 16327 17058 82000 127782 112005 107655 88774 94997 96062 64652
809 64652 13083 -19989 -8569 -25600 -31862 -17702 9428 73170 79490 7889 -33265 -26936 12022
796 12022 25493 -2845 54057 52433 27685 -22295 -23247 -54720 6342 23968 33805 27257 12019
783 12019 41317 41499 53387 84663 78730 -10139 -31755 12038 52818 57466 9688 -6367 -69888
770 -69888 -64567 -87320 -29509 12610 70870 43306 -2002 36426 70080 59831 67214 86703
758 86703 74355 63477 35392 87025 122878 93100 89559 125931 128053 86159 65247 30305
746 30305 30511 34784 60288 82928 58210 29959 36041 44093 106380 138594 113195 82022 10722
733 10722 -8055 21571 24182 42228 22995 -13769 17250 101278 124114 114212 91659 75621
721 75621 44159 -6617 7223 -14713 -33811 9952 63724 35662 25639 41220 -26955 -55463
709 -55463 -3256 40073 67828 62717 49231 26606 38303 50400 71799 69990 90862 106649
697 106649 117217 69191 14554 -29400 -34127 32214 78740 94852 78896 19031 -22593 15442
685 15442 38420 29030 75224 84916 59418 37009 72523 92756 111625 95028 114821 113255 124490
672 124490 57931 72777 85615 52968 35824 19879 91412 152248 126341 25641 12762 -20069
660 -20069 -55512 -83681 -102455 -76507 -60645 1743 50059 99589 106937 38593 7525 -379
648 -379 24835 4952 -33058 -32230 71004 95987 54868 37740 -16509 -6099 70114 92411 70739
635 70739 48988 40938 61729 65722 -4482 -2338 10111 49016 39914 47238 38748 42635 -16270
622 -16270 -67493 -30495 -75689 -97338 -69580 -13719 8040 4811 19282 65647 110662 70657
610 70657 29672 15940 -9379 -21746 42443 68400 18126 -19010 -36977 44299 88101 61422
598 61422 22072 47602 98947 74544 31546 25381 34531 66698 86179 90609 68883 79678 67796
585 67796 55640 44223 57744 16995 38166 79773 44271 -14671 29093 19472 27201 82020
573 82020 100205 71462 20864 26444 72922 64837 27545 -5803 6727 2247 30417 5263 45122
560 45122 95071 97024 81700 96336 118103 35290 7009 -41462 -90758 -43513 24962 32316
548 32316 -11307 -27377 -2007 52873 55901 7098 -43986 -43724 -12671 4546 35305 72691 65575
535 65575 68405 34171 12881 23318 49492 47363 39867 37708 20531 -11396 -46849 -32880 -47449
522 -47449 -37830 -76843 -73200 -54346 -9762 33577 28845 30693 79120 82743 103242 92677 63821
509 63821 65586 78390 80578 26271 45297 64300 59900 91234 153282 130668 79437 68176 46388
496 46388 20549 13890 -10649 -18534 24550 12327 -45358 3197 53608 41357 35931 -14942 18508
483 18508 51527 67312 76478 79649 65808 30113 -6022 24709 74711 89519 78257 42617
471 42617 55768 81200 56366 -12264 -8314 -36374 -63640 -68276 -50668 -41016 -41433 -63415 -30251
458 -30251 -15091 31665 6422 11172 16595 10046 39990 17706 15657 31062 13091 8924 72184
445 72184 56316 -24217 9995 -16010 -13089 -52289 -74505 -18779 16907 -14236 -4499 19275
433 19275 57804 78336 44178 16860 76257 80252 45383 -17429 -35368 -15876 -1198 -47430
421 -47430 -1196 51807 80847 46286 -2422 -2178 31003 13253 632 51290 80166 26972
409 26972 -18652 17925 72155 76661 78051 87922 126048 167825 135106 85810 77803 127600 121728
396 121728 98811 129530 113621 90540 122863 140568 147336 179556 136376 114992 85813 66989
384 66989 79036 91199 103509 128290 69837 40757 29632 81808 40705 -17120 21951 764
372 764 15586 -31122 -60708 -28373 -18235 -11393 35129 70072 32649 67842 68405 61749 90558
359 90558 119547 100520 102227 110302 162536 145819 121784 38253 23365 41300 -7462 -10403 29906
346 29906 57982 69321 42318 38092 75970 121301 62969 -1687 -5572 53743 23005 23420 31325
333 31325 20853 33361 22125 51685 63128 53437 -9980 -31434 12767 82220 54415 35245
321 35245 39870 30351 14026 11543 49179 47030 49830 42925 60676 92124 -10398 -69670 -71995
308 -71995 -25258 -2703 -1627 1650 12663 -8580 3971 17323 -10033 -30821 20420 40681
296 40681 -11726 -17718 -3597 -14898 30255 55079 37093 22434 -26196 -60032 -24591 33017
284 33017 93160 78196 49312 15652 12657 23879 52968 65396 91489 62191 20218 45811
272 45811 58985 140149 123977 31397 -12085 -370 -18674 -59455 -73882 -62114 -68856 -29521
260 -29521 -5152 -24255 10904 26303 36547 32265 66358 89325 80963 100488 94485 94302 65634
247 65634 14253 10062 -38502 -43524 -17403 22568 66843 42513 45958 118596 158002 118242 88703
234 88703 90720 80419 54483 51465 28407 25187 30875 20888 16596 28220 36828 54193 44545 -9622
220 -9622 -98746 -105626 -60371 3298 3723 10795 23135 55935 49012 21127 811 -16405 -30188
207 -30188 3379 10294 42723 51332 83469 62414 11572 -27084 14362 27538 8994 44586
195 44586 88339 96615 70214 45623 16339 30917 38687 9951 4045 29190 15147 4906 -16464
182 -16464 12386 43760 33515 57326 33191 1431 -10072 25863 32519 20654 -32583 -22537
170 -22537 -7373 -4654 -20527 -17709 -20619 21392 29358 15091 -10826 25900 32150 -6509 28552
157 28552 27179 24038 23474 16237 -4997 -1439 32096 13712 14981 24634 -2438 18373 28379 4483
143 4483 26393 27988 26552 11035 -12418 -52624 -21178 10134 73532 88052 73554 50426 31678
130 31678 51469 40412 46409 25582 43372 104385 151058 137658 65921 1332 -12193 28584
118 28584 38782 51041 54786 28673 8608 14256 8838 13035 46536 86627 82484 61140 33387
105 33387 38550 65088 49556 29559 43084 17629 28579 28796 59802 43528 64355 101640 110475
92 110475 90844 39818 18068 49169 61253 53689 68890 42284 37566 31469 55888 40048 16390
79 16390 28206 43985 39106 58762 26052 -9225 824 31521 44549 27582 11769 8137 24647
66 24647 78972 83865 55122 29853 22952 15311 46810 30064 13292 28646 40100 42771 18958
53 18958 -44829 -46226 -31228 -4351 -22570 -48990 -30604 21928 30471 17176 43717 60313 53876
40 53876 39147 30244 49245 15183 -8425 -9512 -43339 -42981 -25935 -23291 -24349 15888 43471
27 43471 80226 58211 58055 93308 142536 150785 91300 42674 42869 56658 99007 101504 71251
14 71251 75989 35141 -15745 -48365 -40194 -15795 18754 3830 2710 -4661 -10593 3056 27180
1 27180 54895
0 54895
$$ Imaginary data points
##PAGE= N=2
##DATA TABLE= (X++(I..I)), XYDATA
32767 159922 147435 171963 163567 158636 172555 192684 209196 237727 246619 231439 191814 200311
32755 200311 209878 225805 247011 259026 275871 269625 249585 248069 239162 197500 193590 233961
32743 233961 217028 216009 203669 226107 217188 193973 188301 202115 200988 221203 231413 191993
32731 191993 191821 202712 179833 172135 208279 189271 200465 239834 248998 250579 233202 214912
32719 214912 230438 261058 225799 201696 211946 241019 262514 284548 255456 223677 256860
32708 256860 289456 317796 303577 275151 296401 276319 268791 263850 289462 264255 248582 295237
32696 295237 329015 294892 273792 254554 289272 323883 315333 323810 303578 259706 252833 247560
32684 247560 239512 259246 261941 278501 253267 240856 274813 332741 332619 329571 290318 269285
32672 269285 239585 231639 256111 245007 262042 280567 293388 323249 322199 294185 245881 241883
32660 241883 248068 303254 337130 314351 308516 362485 381986 334469 328046 357428 376551 357929
32648 357929 330249 303778 292897 322690 356272 328989 317443 299046 330203 375341 360370
32637 360370 339406 338118 362902 366613 353748 340201 308197 296423 288268 308219 270549 313538
32625 313538 369890 381805 360665 308242 287222 330296 368849 439425 445914 455656 441611 411708
32613 411708 416249 420276 403263 372216 347323 352016 348059 371395 374500 370433 385296 415259 455284
32600 455284 454135 412121 384549 359791 351637 354915 352795 359023 395355 374174 386622 410794
32588 410794 420241 416231 416628 378341 334299 341317 377711 430225 461000 452542 358133 325178 302560
32575 302560 297819 316983 347524 335236 388445 419426 456057 480573 463303 444713 409662 361492
32563 361492 367683 393919 397463 368309 380909 412607 444331 398844 389709 375853 416829 375366
32551 375366 380465 444969 467236 479903 443141 388522 409890 419077 407762 411915 430793 461603
32539 461603 449155 419774 455041 458890 500766 491850 441100 416437 415708 415710 448309 443926 402980
32526 402980 388413 391269 404226 355782 376968 383267 418341 446854 470165 515087 486726 476246
32514 476246 451390 421019 421858 446754 464642 464714 479131 456202 430273 441142 433192 408524 388276
32501 388276 412422 451660 519193 497644 475211 495139 463139 420270 395361 426669 435463 475739
32489 475739 483673 455338 366892 370096 429970 497468 537283 496941 481036 477367 429817 408726
32477 408726 421076 483766 533525 504801 502615 554286 515192 485280 457390 488891 504043 494194
32465 494194 495834 506333 516517 520141 456439 450751 447591 442978 504331 494057 489833 482763 474160
32452 474160 444677 441877 448486 455517 471523 461236 416140 402463 454717 522699 528750 517338
32440 517338 434948 439002 473960 424035 416543 414858 455878 442848 421769 418294 469258 465220
32428 465220 428524 394546 412480 452442 461833 474058 493866 518579 512040 493418 512727 510273
32416 510273 510549 548644 583852 523303 482785 493673 505167 490696 506247 518009 536102 547233
$$ [...]
##END NTUPLES=NMR SPECTRUM
##END=
