##TITLE=Analysis number 326684
Compound Code cc 61213
Book Reference 483/112/2
Project Code adrs
Chemist Name mattw
##JCAMPDX= 6.0         $$ Bruker NMR JCAMP-DX V2.0
##DATA TYPE= NMR SPECTRUM
##DATA CLASS= NTUPLES
##ORIGIN= Bruker BioSpin GmbH
##OWNER= nmr
$$ XWIN-NMR		Version 3.5
$$ Mon Feb 19 09:16:27 2007 GMT Standard Time (UT+0h)  MAYBRIDGE\nmr@NMR_250MHZ
##.OBSERVE FREQUENCY= 250.131544655141
##.OBSERVE NUCLEUS= ^1H
##.ACQUISITION MODE= SIMULTANEOUS (DQD)
##.ACQUISITION SCHEME= undefined
##.AVERAGES= 16
##.DIGITISER RES= 18
##SPECTROMETER/DATA SYSTEM= dpx250
##.PULSE SEQUENCE= zg30
##.SOLVENT NAME= CDCl3
##.SHIFT REFERENCE= (INTERNAL, CDCl3, 0, 16.469)
##AUDIT TRAIL= $$ (NUMBER, WHEN, WHO, WHERE, WHAT)
$$ ##TITLE= Audit trail, XWIN-NMR		Version 3.5
$$ ##JCAMPDX= 5.01
$$ ##ORIGIN= Bruker BioSpin GmbH
$$ ##OWNER= nmr
$$ C:\u/data/dgb/nmr/ADRS/1140/pdata/1/auditp.txt
$$ ##AUDIT TRAIL=  $$ (NUMBER, WHEN, WHO, WHERE, WHAT)
(   1,<2007-02-19 09:16:02.43 +000>,<MAYBRIDGE\nmr>,<NMR_250MHZ>,
      <created by zg, POWCHK disabled, PULCHK disabled
       configuration hash MD5:
       49 4B E0 1D 92 C2 6B 37 9F E6 65 BC 52 41 86 1D
       data hash MD5: 64K
       09 81 D9 03 FA 60 BA A2 3C 0F 91 A7 4C FC 16 C8>)
(   2,<2007-02-19 09:16:17.45 +000>,<MAYBRIDGE\nmr>,<NMR_250MHZ>,
      <Start of raw data processing
       ef LB = 0.3 FT_mod = 6 PKNL = 1 SI = 32K 
       data hash MD5: 32K
       21 24 C9 5E 62 A0 CA 79 DB C6 E1 F5 7F 12 D5 91>)
(   3,<2007-02-19 09:16:19.32 +000>,<MAYBRIDGE\nmr>,<NMR_250MHZ>,
      <apk 
       data hash MD5: 32K
       79 D8 6E 9E 7E 15 57 77 F7 0E 0E C2 C0 80 38 55>)
(   4,<2007-02-19 09:16:20.11 +000>,<MAYBRIDGE\nmr>,<NMR_250MHZ>,
      <abs ABSG = 5 
       data hash MD5: 32K
       A2 8E 3B 88 B4 42 F9 A1 63 8D AF 68 22 26 50 98>)
$$ ##END=
$$ 
$$ hash MD5
$$ 66 46 44 5E A8 C7 E0 7C 09 09 CA AB 27 CB 9C DE
##$RELAX= 
##$RELAX= 
##$RELAX= 
##$RELAX= 
##$RELAX= 
##$RELAX= 
##$RELAX= 
$$ Bruker specific parameters
$$ --------------------------
##$DU= <C:\u>
##$EXPNO= 1140
##$NAME= <ADRS>
##$PROCNO= 1
##$TYPE= <nmr>
##$USER= <dgb>
##$AMP= (0..31)
100 100 100 100 100 100 100 100 100 100 100 100 100 100 100 100 100 100 
100 100 100 100 100 100 100 100 100 100 100 100 100 100 
##$AQSEQ= 0
##$AQ_mod= 3
##$AUNM= <au_zg>
##$AUTOPOS= <32 >
##$BF1= 250.13
##$BF2= 250.13
##$BF3= 250.13
##$BF4= 250.13
##$BF5= 500.13
##$BF6= 500.13
##$BF7= 500.13
##$BF8= 500.13
##$BYTORDA= 1
##$CFDGTYP= 0
##$CFRGTYP= 5
##$CHEMSTR= <none>
##$CNST= (0..31)
1 1 145 1 1 1 1 1 1 1 1 1 1 1 1 1 1 1 1 1 1 1 1 1 1 1 1 1 1 1 1 1 
##$CPDPRG= <>
##$CPDPRG1= <>
##$CPDPRG2= <>
##$CPDPRG3= <>
##$CPDPRG4= <mlev>
##$CPDPRG5= <mlev>
##$CPDPRG6= <mlev>
##$CPDPRG7= <mlev>
##$CPDPRG8= <mlev>
##$CPDPRGB= <>
##$CPDPRGT= <>
##$D= (0..31)
0 1 0 0 0 0 0 0 0 0.06 0 0 0 0 0 0 0.0002 0 0 0 0 0 0 0 0 0 0 0 0 0 0 
0 
##$DATE= 1171876561
##$DBL= (0..7)
120 120 120 120 120 120 120 120 
##$DBP= (0..7)
150 150 150 150 150 150 150 150 
##$DBP07= 0
##$DBPNAM0= <>
##$DBPNAM1= <>
$$ [...]
##$SUBNAM7= <"">
##$SUBNAM8= <"">
##$SUBNAM9= <"">
##$SW= 20.6930455092707
##$SWIBOX= (0..15)
0 0 3 0 0 0 0 0 0 0 0 0 0 0 0 0 
##$SW_h= 5175.983436853
##$TD= 65536
##$TD0= 1
##$TE= 295.16
##$TE2= 300
##$TE3= 300
##$TEG= 300
##$TL= (0..7)
0 120 120 120 120 120 120 120 
##$TP= (0..7)
150 150 150 150 150 150 150 150 
##$TP07= 0
##$TPNAME0= <>
##$TPNAME1= <>
##$TPNAME2= <>
##$TPNAME3= <>
##$TPNAME4= <>
##$TPNAME5= <>
##$TPNAME6= <>
##$TPNAME7= <>
##$TPOAL= (0..7)
0.5 0.5 0.5 0.5 0.5 0.5 0.5 0.5 
##$TPOFFS= (0..7)
0 0 0 0 0 0 0 0 
##$TUNHIN= 0
##$TUNHOUT= 0
##$TUNXOUT= 0
##$USERA1= <user>
##$USERA2= <user>
##$USERA3= <user>
##$USERA4= <user>
##$USERA5= <user>
##$V9= 5
##$VALIST= <valist>
##$VCLIST= <CCCCCCCCCCCCCCC>
##$VD= 0
##$VDLIST= <DDDDDDDDDDDDDDD>
##$VPLIST= <PPPPPPPPPPPPPPP>
##$VTLIST= <TTTTTTTTTTTTTTT>
##$WBST= 1024
##$WBSW= 4
##$XGAIN= (0..3)
0 0 0 0 
##$XL= 0
##$YL= 0
##$YMAX_a= 348806
##$YMIN_a= -379826
##$ZGOPTNS= <>
##$ZL1= 120
##$ZL2= 120
##$ZL3= 120
##$ZL4= 120
##$ABSF1= 16.46901
##$ABSF2= -4.224163
##$ABSG= 5
##$ABSL= 3
##$ALPHA= 0
##$AQORDER= 0
##$ASSFAC= 0
##$ASSFACI= 0
##$ASSFACX= 0
##$ASSWID= 0
##$AUNMP= <proc_1d>
##$AZFE= 0.1
##$AZFW= 0.1
##$BCFW= 0
##$BC_mod= 0
##$BYTORDP= 0
##$COROFFS= 0
##$CY= 12.5
##$DATMOD= 1
##$DC= 0
##$DFILT= <>
##$DTYPP= 0
##$F1P= 14.0000005364418
##$F2P= -0.99999901652339
##$FCOR= 0.5
##$FTSIZE= 32768
##$FT_mod= 6
##$GAMMA= 0
##$GB= 0
##$INTBC= 1
##$INTSCL= 1
##$ISEN= 128
##$LB= 0.3
##$LEV0= 0
##$LPBIN= 0
##$MAXI= 10000
##$MC2= 0
##$MEAN= 0
##$ME_mod= 0
##$MI= 0
##$NCOEF= 0
##$NC_proc= -3
##$NLEV= 6
##$NOISF1= 0
##$NOISF2= 0
##$NSP= 0
##$NTH_PI= 0
##$NZP= 0
##$OFFSET= 16.46901
##$PC= 1
##$PHC0= 224.9847
##$PHC1= 6.748828
##$PH_mod= 1
##$PKNL= yes
##$PPARMOD= 0
##$PSCAL= 4
##$PSIGN= 0
##$REVERSE= no
##$SF= 250.130013254361
##$SI= 32768
##$SIGF1= 0
##$SIGF2= 0
##$SINO= 400
##$SIOLD= 32768
##$SREGLST= <1H.CDCl3>
##$SSB= 0
##$STSI= 32768
##$STSR= 0
##$SW_p= 5175.98343685301
##$SYMM= 0
##$S_DEV= 0
##$TDeff= 65536
##$TDoff= 0
##$TI= <Analysis number 999999
Compound Code 99
Book Reference 9
Project Code 9>
##$TILT= no
##$TM1= 0
##$TM2= 0
##$TOPLEV= 0
##$USERP1= <user>
##$USERP2= <user>
##$USERP3= <user>
##$USERP4= <user>
##$USERP5= <user>
##$WDW= 1
##$XDIM= 32768
##$YMAX_p= 397240084
##$YMIN_p= -57588
$$ End of Bruker specific parameters
$$ ---------------------------------
##NTUPLES= NMR SPECTRUM
##VAR_NAME=  FREQUENCY,     SPECTRUM/REAL,   SPECTRUM/IMAG
##SYMBOL=    X,             R,               I
##VAR_TYPE=  INDEPENDENT,   DEPENDENT,       DEPENDENT
##VAR_FORM=  AFFN,          ASDF,            ASDF
##VAR_DIM=   32768,         32768,           32768
##UNITS=     HZ,            ARBITRARY UNITS, ARBITRARY UNITS
##FACTOR=    0.157963299565203, 1,           1
##FIRST=     4119.39353936163, 0,            0
##LAST=      -1056.58989749138, 0,           0
##MIN=       -1056.58989749138, -57588,      0
##MAX=       4119.39353936163, 397240084,    0
$$ Real data points
##PAGE= N=1
##DATA TABLE= (X++(R..R)), XYDATA
$$ [...]
$$ plain form
16276 -39961 -33916 -20752 -21102 -15773 -7845 -3488 -10242 -14746 -13567 -15309 -23397 -19270 -11985 -15935
16262 -15935 -15502 -11762 -9174 -5679 2308 3634 -4450 -2097 -7462 -8847 -22113 -27519 -9867 13138
16248 13138 11078 8140 5768 -8390 -24726 -21210 -10266 -1564 4438 6089 5267 -10171 -21992
16235 -21992 -22986 -33916 -25147 -13426 -7465 1125 -936 -20759 -28011 -2257 -2229 -11354 -5016 8793
16221 8793 8685 6688 4019 9481 3629 -6540 -18411 -17844 -16098 -7424 -5871 -10940 -10205 -25373 -21930
16206 -21930 -23133 -13359 -9242 -3102 -3355 -9586 -5158 -10096 -9901 7273 1048 -9895 -10386 -11533 -11747
16191 -11747 -6873 -8121 -6497 7647 1303 -3998 372 -7945 -5874 -6830 -8197 -7476 3377 10818
16177 10818 1453 -10914 -17359 -18168 -23850 -11533 -5479 -4334 -10271 -14836 -5353 -9821 -15149 -16964
$$ packed form
16276c9961O045J3164l50N329P928M357o754m504J179j742q088M127P285l950
16262a5935M33L740K588L495P987J326q084K353n365j385j3266n406J7652K3005
16248A3138k060k938k372j4158j6336L516J0944Q702O002J651q22j5438j1821
16235b1992r94j0930Q769J1721N961Q590k061j9823p252K5754K8r125O338J3809
16221H793j08j997k669N462n852j0169j1871N67J746Q674J553n069P35j5168L443
16206b1930j203R774M117O140k53o231M428m938J95J7174o225j0943m91j147k14
16191a1747M874j248J624J4144o344n301M370q317K071r56j367P21J0853P441
16177A0818r365j2367o445q09n682J2317O054J145n937m565R483m468n328j815
$$ plain form
16163 -16964 -7220 6132 6411 -884 -5489 -14039 -18024 -18675 -22958 -31353 -29999 -24507 -21300 -16550 -4326
16148 -4326 -5885 -15837 -20007 -30532 -25889 -23668 -10092 -8102 -26543 -19785 5257 -12219 -22570
16135 -22570 -22625 -11347 -1329 -15136 -21411 -24396 -17278 -17560 -19265 -9846 -16350 -23575 -29550 -36184
16121 -36184 -18889 -5114 -12605 13980 24545 22818 11101 9353 10687 1896 1440 -8122 -7825 -16390
16107 -16390 -25472 -4526 -8761 -34833 -37243 -24982 -4998 2944 12023 14737 10886 20680 16866
16094 16866 -5566 -15578 -10715 -6781 -2496 1710 -345 4929 353 -12234 -9242 -2189 354 -4319
16080 -4319 -7541 -9228 -13659 -6693 -313 -14421 -20701 -21722 -20005 -26010 -30347 -29216 -15928 -11759
16066 -11759 -8692 -15663 -15575 -16553 -26453 -21801 -14007 -3502 -5477 -3585 2485 -6068 -7800 -22552 -23565
$$ packed form
16163a6964R744J3352K79p295m605q550l985o51m283q395J354N492L207M750J2224
16148d326j559r952m170j0525M643K221J3576J990j8441O758K5042j7476j0351
16135b2570n5J1278J0018j3807o275k985P118k82j705R419o504p225n975o634
16121c6184J7295J3775p491K6585J0565j727j1717j748J334q791m56r562K97q565
16107a6390r082K0946m235k6072k410J2261J9984P942R079K714l851R794l814
16094A6866k2432j0012M863L934M285M206k055N274m576j2587K992P053K543m673
16080d319l222j687m431O966O380j4108o280j021J717o005m337J131J3288M169
16066a1759L067o971Q8r78r900M652P794J0505j975J892O070q553j732j4752j013
$$ plain form
16051 -23565 -14737 -21628 -19216 -13792 -5117 4888 52 -764 -2634 -4691 -15852 -19559 -4567 9222
16037 9222 -4086 -14666 -22680 -10480 -14082 -28768 -34537 -28314 -16195 -9823 -7452 10625 -2617
16024 -2617 -15200 -9466 -14774 -9436 -4175 -4846 -17147 -17867 -10566 -7219 10867 9638 4844 4982 -3207
16009 -3207 -6573 3685 1913 -2708 -20561 -13173 -7562 -1729 -13098 -17060 -18757 -11549 -1021 2134
15995 2134 -17754 -16790 1683 -7373 -13092 -12800 -13636 -13368 -16641 -17012 -23682 -16998 2709 2074 -8838
15980 -8838 -12359 -20430 -25042 -26826 -25333 -25225 -28990 -20873 -13029 -9845 -14199 -21849 -24675 -17039 -17081
15965 -17081 -21165 -10744 -10008 -26063 -24213 -16233 -15400 -28462 -27329 -25889 -10863 -16476 -19927 -23737
15951 -23737 -27308 -20729 -12278 -11209 -4380 -3230 -3735 -7820 -12189 -20047 -25369 -19711 -6070 14541
$$ packed form
16051b3565Q828o891K412N424Q675J0005m836q16j870k057j1161l707J4992J3789
16037I222j3308j0580q014J2200l602j4686n769O223J2119O372K371J8077j3242
16024b617j2583N734n308N338N261o71j2301p20P301L347J8086j229m794J38q189
16009c207l366J0258j772m621j7853P388N611N833j1369l962j697P208J0528L155
15995B134j9888R64J8473r056n719K92q36K68l273l71o670O684J9707o35j0912
15980h838l521q071m612j784J493J08l765Q117P844L184m354p650k826P636m2
15965a7081m084J0421P36j6055J850P980Q33j3062J133J440J5026n613l451l810
15951b3737l571O579Q451J069O829J150n05m085m369p858n322N658J3641K0611
$$ plain form
15937 14541 16209 20849 10299 -3624 -16302 -26199 -28928 -34671 -36529 -28319 -10291 -3767 3550
15924 3550 7043 11391 9697 -8259 -21952 -17407 4608 6313 7 1715 -5078 -579 15277 9597
15910 9597 3264 -5666 -20945 -25970 -14549 -6868 -9478 2007 -2972 -5610 -3653 -3610 -1576 -7246
15896 -7246 -11321 -8341 -8351 -4707 -11105 -24958 -18580 -9738 -5370 -10118 -10985 -18084 -22637 -18079 -25905
15881 -25905 -8326 5982 8316 8088 3162 2976 7510 -6399 -10416 -12105 -28833 -27624 -23616 -4236
15867 -4236 728 -7585 -16929 -16414 -10646 -13226 -2797 -3970 -9495 2730 14282 11568 19354 19572
15853 19572 11407 3997 921 17620 13807 13241 7519 3637 14458 24755 8443 -3619 -16973
15840 -16973 -21444 -19491 2857 17993 8161 4167 -9320 -15976 -23044 -25050 -18685 -21072 -2902
$$ packed form
15937A4541J668M640j0550j3923j2678r897k729n743j858Q210J8028O524P317
15924C550L493M348j694j7956j3693M545K2015J705o306J708o793M499J5856n680
15910I597o333q930j5279n025J1421P681k610J1485m979k638J957M3K034n670
15896g246m075K980j0L644o398j3853O378Q842M368m748q67p099m553M558p826
15881b5905J7579J4308K334k28m926j86M534j3909m017j689j6728J209M008J9380
15867d236M964q313r344N15N768k580J0429j173n525J2225J1552k714P786K18
15853A9572q165p410l076J6699l813n66n722l882J0821J0297j6312j2062j3354
15840a6973m471J953K2348J5136r832l994j3487o656p068k006O365k387J8170
$$ plain form
15827 -2902 20000 35376 25369 3702 -6918 -6876 -8179 -15893 -16667 -8462 2312 18146 23419 24076
15813 24076 1316 -3016 -22760 -34453 -25091 -4484 -1018 -14524 -21867 -18032 -6692 -17710 -21396
15800 -21396 -19919 -22046 -29728 -26081 -27338 -31022 -25450 -22845 -21225 -17967 -10898 -13758 -22279 -15177
15786 -15177 -16350 -25695 -33908 -38034 -36281 -36803 -35327 -22968 -6383 -11226 -9154 -11970 -6969 -6438
15772 -6438 8324 7544 5775 14195 21974 24363 19712 8046 -7666 -4998 -7205 -20244 -33921 -34043
15758 -34043 -20209 -7190 518 2685 -6025 -11509 -11644 -149 8073 14673 8716 -9348 -21334
15745 -21334 -22245 -13803 -17149 -9 12874 11437 4141 -1513 -2084 -9542 -2311 3849 -492 -12413
15731 -12413 -20641 -22883 -11354 -11437 -8834 -8130 -13402 -25822 -42501 -45937 -36324 -22285 -26683 -11241
$$ packed form
15827b902K2902J5376j0007k1667j0620M2j303p714p74Q205J0774J5834N273O57
15813B4076k2760m332j9744j1693R362K0607L466j3506p343L835J1340j1018l686
15800b1396J477k127p682L647j257l684N572K605J620L258P069k860q521P102
15786a5177j173r345q213m126J753n22J476J2359J6585m843K072k816N001N31
15772f438J4762p80j769Q420P779K389m651j1666j5712K668k207j3039j3677j22
15758c4043J3834J3019P708K167q710n484j35J1495Q222O600n957j8064j1986
15745b1334r11Q442l346J7140J2883j437p296n654n71p458P231O160m341j1921
15731a2413q228k242J1529q3K603P04n272j2420j6679l436R613J4039m398J5442
$$ plain form
15717 -11241 901 733 -1529 3139 -6390 -24284 -15467 -9104 9603 19817 4403 -15285 -13908
15704 -13908 -101 8392 5339 -8412 -10288 -4692 -19217 -20645 -7335 2592 -13286 -19516 -21468
15691 -21468 -17781 -21128 -19074 -24745 -22251 -13721 -8802 -16942 -20916 -15757 -6323 5566 10121 6810
15677 6810 -2965 -29615 -34099 -18080 -847 -2568 -3354 -5737 -10222 -2199 9646 9682 17085 22884
15663 22884 3019 -5617 -1905 -12925 -13896 -16354 -17368 -31681 -39534 -26345 -22549 -31755 -32350 -25204
15649 -25204 -18779 -6808 1279 14854 29046 30903 11522 -9596 -21996 -17024 -14782 -8832 -17631
15636 -17631 -19305 -10436 -5444 -7224 -7094 -2178 2948 -1922 2417 -13498 -17943 -13777 -20802 -23367
15622 -23367 -11797 -11357 -11460 -14990 -22055 -32427 -35303 -42303 -16877 -3366 -18608 -22756 -25242 -26050
$$ packed form
15717a1241J2142j68k262M668r529j7894Q817O363J8707J0214j5414j9688J377
15704a3908J3807Q493l053j3751j876N596j4525j428J3310R927j5878o230j952
15691b1468L687l347K054n671K494Q530M919q140l974N159R434J1889M555l311
15677F810r775k6650m484J6019J7233j721p86k383m485Q023J1845L6P403N799
15663B2884j9865q636L712j1020r71k458j014j4313p853J3189L796r206n95P146
15649b5204O425J1971Q087J3575J4192J857j9381k1118j2400M972K242N950q799
15636a7631j674Q869M992j780J30M916N126m870M339j5915m445M166p025k565
15622b3367J1570M40j03l530p065j0372k876p000K5426J3511j5242m148k486q08
$$ plain form
15608 -26050 -23596 -21285 -10335 -8999 -10027 -7438 -5419 -8580 -7858 -6235 -3430 -15458 -17017 -10482
15594 -10482 -13755 -22684 -11480 -3695 -6862 -4063 -14863 -31344 -12805 3638 9856 9321 3100
15581 3100 -1999 -17318 -22054 -27653 -32573 -18331 -21682 -17182 -21911 -18557 -25302 -21389 -25229 -22342
15567 -22342 -8091 111 11485 14818 10695 12150 -2749 -13920 -25734 -15995 -11112 -27281 -24486
15554 -24486 -15844 -14236 -8712 -13787 -24416 -17274 -17733 -17904 -11534 -5421 2718 3031 8061 -6593 -23882
15539 -23882 -19586 -13592 -12358 -13376 -10694 7203 17293 21095 6104 -14777 -20736 -17713 -3183
15526 -3183 2883 -3833 -14140 -21138 -7225 -1665 -721 -452 -2777 -436 -2809 -14387 -19813 -21641
15512 -21641 -22653 -14835 2454 2931 5566 10912 10894 -14307 -21701 -13840 -19334 -12581 -11491 -4934 3598
$$ packed form
15608b6050K454K311J0950J336j028K589K019l161P22J623K805j2028j559O535
15594a0482l273q929J1204P785l167K799j0800j6481J8539J6443O218n35o221
15581C100n099j5319m736n599m920J4242l351M500m729L354o745L913l840K887
15567b2342J4251Q202J1374L333m123J455j4899j1171j1814R739M883j6169K795
15554b4486Q642J608N524n075j0629P142m59j71O370O113Q139L13N030j4654j7289
15539b3882M296N994J234j018K682J7897J0090L802j4991k0881n959L023J4530
15526c183O066o716j0307o998J3913N560R44K69k325K341k373j1578n426j828
15512b1641j012P818J7289M77K635N346j8k5201p394P861n494O753J090O557Q532
$$ plain form
15497 3598 7353 7076 16822 18238 6540 -2787 -4330 -6410 -10421 -7907 -14460 -13920 -5968 -17551 -25293
15482 -25293 -38731 -50426 -44163 -35217 -19077 -10234 -193 17768 10133 -6112 -14816 -8488 -12718
15469 -12718 -16135 -9846 -439 7940 5867 -278 1295 -345 -1715 -20137 -18167 -15105 -18818 -17325
15455 -17325 -28899 -25324 -12267 -9001 -17907 -8729 -9841 -12815 -10484 1505 6692 9942 22202
15442 22202 27460 11362 49 -9617 -23398 -30502 -19797 -17741 -17778 -26683 -26118 -8050 2583 3711
15428 3711 9933 2003 833 -862 6529 14371 13619 9447 5005 4999 -3408 -15704 -14787 -323 -1423
15413 -1423 -317 -1185 -10598 -11790 -12551 -15135 -14562 -12227 -13090 -7102 1548 9598 7620 -6773 -14820
15398 -14820 -11170 -12978 -12204 -17658 -22660 -9177 6590 2287 -3542 -14403 -1979 487 5518 3861
$$ packed form
15497C598L755k77R746J416j1698r327j543k080m011K514o553N40P952j1583p742
15482b5293j3438j1695O263Q946J6140Q843J0041J7961p635j6245q704O328m230
15469a2718l417O289R407Q379k073o145J573j640j370j8422J970L062l713J493
15455a7325j1574L575J3057L266q906R178j112k974K331J1989N187L250J2260
15442B2202N258j6098j1313r666j3781p104J0705K056l7q905N65J8068J0633J128
15428C711O222p930j170j695P391P842p52m172m442oq407j2296R17J4464j100
15413a423J106q68r413j192p61k584N73K335q63N988Q650Q050j978j4393q047
15398a4820L650j808P74n454n002J3483J5767m303n829j0861J2424K466N031j657
$$ plain form
15384 3861 4498 9324 13681 20648 -4879 -6222 10415 9355 5153 11943 4755 5067 -6092 -18975
15370 -18975 -34588 -24935 -8915 -14720 -17284 -21910 -12740 -15843 -9185 79 6764 10384 1858 -6174
15356 -6174 -15709 -28886 -24459 -20241 -17544 -13754 -9915 -4647 1150 12611 1273 -9980 -9699 -17329
15342 -17329 -22792 -26363 -29915 -22186 -8378 -7452 -12700 -17626 -7986 -9432 -10369 -1656 8586 4975
15328 4975 12558 11011 22433 27502 8339 -808 -2513 2967 8230 6710 15786 21594 7392 6672
15314 6672 5275 10420 11681 11311 6627 -7039 -6066 3428 -2403 -1566 10389 19005 28043 31498 26888
15299 26888 20600 16168 9194 5859 525 -11956 -16708 -15057 -19977 -19438 -7874 1819 5176 8712
15285 8712 8867 -9316 -19720 -13218 -28267 -31906 -37975 -29439 -21623 -10178 1435 4228 24938
$$ packed form
15384C861O37M826M357O967k5527j343J6637j060m202O790p188L12j1159j2883
15370a8975j5613R653J6020n805k564m626R170l103O658R264O685L620q526q032
15356f174r535j3177M427M218K697L790L839N268N797J1461j1338j1253K81p630
15342a7329n463l571l552P729J3808R26n248m926R640j446r37Q713J0242l611
15328D975P583j547J1422N069j9163r147j705N480N263j520R076N808j4202p20
15314F672j397N145J261l70m684j3666R73R494n831Q37J1955Q616R038L455m610
15299B6888o288m432o974l335n334j2481m752J651m920N39J1564R693L357L536
15285H712J55j8183j0404O502j5049l639o069Q536P816J1445J1613K793K0710
$$ plain form
15272 24938 15644 1733 -3432 1125 -6512 -2445 5635 -1585 -8862 -20833 -16280 -4501 -13282 -18285
15258 -18285 -21149 -36059 -28463 -13756 -14477 -19747 -19237 -6782 -1131 -145 1455 -69 2418 -6430
15244 -6430 -16713 -17282 -10031 -7048 -18441 -25462 -6811 -3709 3310 5458 8329 10361 13702 25928
15230 25928 21885 17607 6113 -5005 -13484 -12774 -16937 -23365 -22707 -12411 3133 407 -7198 -11107
15216 -11107 -9436 -16135 -15931 2342 -1412 -13232 -27140 -23971 -23997 -29242 -19938 1536 10408 5943
15202 5943 -8475 -10024 -9919 -14697 -15442 -10452 -22192 -21455 -12965 -956 3186 -23007 -22914 -15016 1776
15187 1776 10864 4976 -2823 -11289 -21075 -12594 -12294 -6980 -19331 -24318 -9105 5719 1271 -2045
15173 -2045 4972 -5143 -18487 -14551 -7482 -10292 -15487 -4800 3938 -5012 -25011 -32119 -35414 -42088
$$ packed form
15272B4938r294j3911n165M557p637M067Q080p220p277j1971M553J1779q781n003
15258a8285k864j4910P596J4707p21n270N10J2455N651R86J600j524K487q848
15244f430j0283n69P251K983j1393p021J8651L102P019K148K871K032L341J2226
15230B5928m043m278j1494j1118q479P10m163o428O58J0296J5544k726p605l909
15216a1107J671o699K04J8273l754j1820j3908L169k6n245R304K1474Q872m465
15202E943j4418j549J05m778p45M990j1740P37Q490J2009M142k6193R3P898J6792
15187A776R088n888p799q466r786Q481L00N314j2351m987J5213J4824m448l316
15173b045P017j0115j3344L936P069k810n195J0687Q738q950j9999p108l295o674
$$ plain form
15159 -42088 -48816 -41069 -33754 -28577 -18477 -11221 -10293 -1048 5520 3329 6996 6699 -14608 -16234
15145 -16234 -18946 -13716 -11241 -7216 -8686 -7692 -11159 -6937 -10524 -14629 -19713 -19191 -6468 4313
15131 4313 558 11267 18369 17202 1883 3433 -1119 -2480 -5688 5710 10270 13882 4572 -12341
15117 -12341 -1535 13384 21453 7125 -11225 -9730 -14773 -24238 -29903 -15977 -7182 -8657 -2272
15104 -2272 1367 -550 -17122 -16194 -23680 -22287 -13220 3511 5851 -3888 -17738 -25483 -28957 -33990
15090 -33990 -43628 -38698 -30015 -24741 -4969 4847 9895 5457 3230 -8812 -13637 -11862 -13593 -8108
15076 -8108 -6589 -10604 -2101 8325 19971 15300 11364 8043 12152 15556 6220 -8783 -18617 -13247
15062 -13247 -17776 -18798 -14252 -16683 -9413 -16375 -21700 -29144 -28712 2953 15439 1653 -6627 16254
$$ packed form
15159d2088o728P747P315N177J0100P256R28R245O568k191L667k97k1307j626
15145a6234k712N230K475M025j470R94l467M222l587m105n084N22J2723J0781
15131D313l755J0709P102j167j5319J550m552j361l208J1398M560L612r310j6913
15117a2341J0806J4919Q069j4328j8350J495n043r465n665J3926Q795j475O385
15104b272L639j917j6572R28p486J393R067J6731K340r739j3850p745l474n033
15090c3990r638M930Q683N274J9772R816N048m438k227j2042m825J775j731N485
15076h108J519m015Q503J0426J1646m671l936l321M109L404r336j5003r834N370
15062a3247m529j022M546k431P270o962n325p444M32L1665J2486j3786q280K2881
$$ plain form
15048 16254 18414 1741 -14787 -4580 2810 1273 -10129 -7148 -2661 -6221 -654 10808 12563
15035 12563 10066 18915 13122 -554 10521 25963 26284 17890 4374 -8039 -10374 -3280 5332
15022 5332 4941 3342 1253 -14811 -10406 -6210 -8432 -15229 -10661 -16142 -21411 -17122 1350 3535
15008 3535 -4586 -9938 -3284 8358 3766 6155 3291 -2811 -5487 -933 -1951 -18276 -14861 -5718
14994 -5718 -11790 -12556 -4629 -4716 -7328 -5763 4340 14356 5309 2967 -206 -8659 -10366 -1879 -9102
14979 -9102 -12460 -20548 -20954 -26735 -30890 -38736 -38731 -31463 -27598 -23490 -27226 -29983 -27051 -6538 -2283
14964 -2283 -8903 -15938 -14876 -11986 -10397 -15290 -20886 -27690 -22466 -19724 -13621 -14438 -10132 5172 9619
14949 9619 -6332 -24960 -20664 -13158 -8459 799 5032 8072 5018 10136 3227 -1918 10858 12409
$$ packed form
15048A6254K160j6673j6528J0207P390j537j1402K981M487l560N567J1462J755
15035A2563k497Q849n793j3676J1075J5442L21q394j3516j2413k335P094Q612
15022E332l91j599k089j6064M405M196k222o797M568n481n269M289J8472K185
15008C535q121n352O654J1642m592K389k864o102k676M554j018j6325L415R143
14994e718o072p66P927q7k612J565J0103J0016r047k342l173q453j707Q487p223
14979i102l358q088m06n781m155p846NP268L865M108l736k757K932K0513M255
14964b283o620p035J062K890J589m893n596o804N224K742O103q17M306J5304M447
14949I619j5951j8628M296P506M699R258M233L040l054N118o909n145J2776J551
$$ plain form
14935 12409 1902 1786 -1948 5291 -9825 -17140 -5434 -10389 -15114 -19553 -18261 -10663 -3714 -3212
14921 -3212 -2868 -1335 -1758 7093 -862 -3957 -7996 -8852 8587 20882 25579 22499 14946 7908 -761
14906 -761 -981 -8421 -5987 -3430 2707 23556 22260 13938 5229 -2953 -12141 -12024 128 2968 9200
14891 9200 3505 -5176 -12596 8881 20482 20231 9559 13837 20247 14533 8264 625 -3431 -557
14877 -557 -4403 -8321 -5941 3360 -3467 -20149 -13284 -9419 -14886 -22829 -27696 -25903 -24358 -27197 -21277
14862 -21277 -22801 -20138 -24622 -21507 -13654 -8922 -12784 -6200 -2259 -307 -1949 -24934 -29764 -11523
14848 -11523 943 -273 7375 7854 -9011 -7167 7983 13696 -420 -9193 -13138 -6850 52 -5834
14834 -5834 -4449 -6990 6051 15660 6793 2022 -1340 11673 3734 -1728 15154 14202 12641 7488
$$ packed form
14935A2409j0507j16l734P239j5116p315J1706m955m725m439J292P598O949N02
14921c212L44J533m23Q851p955l095m039q56J7439J2295M697l080p553p038q669
14906g61k20p440K434K557O137K0849j296q322q709q182r188J17J2152K840O232
14891I200n695q681p420K1477J1601k51j0672M278O410n714o269p639m056K874
14877e57l846l918K380R301o827j6682O865L865n467p943m867J793J545k839N920
14862b1277j524K663m484L115P853M732l862O584L941J952j642k2985m830J8241
14848a1523J2466j216P648M79j6865J844J5150N713j4116q773l945O288O902n886
14834e834J385k541J3041R609q867m771l362J3013p939n462J6882r52j561n153
$$ plain form
14820 7488 -17808 -15898 -6100 -18193 -18720 -14371 -14581 -26989 -24540 -23718 -7173 -1760 -5081 -11267
14806 -11267 -25886 -30870 -23306 -18941 -25346 -37972 -44291 -18989 -7806 -16935 -8245 -12003 -20074
14793 -20074 -13747 -14967 -21490 -16564 -12433 -16848 -22604 -19886 -15671 -2135 -1693 -4710 -7722 -9189
14779 -9189 -4335 -10043 -3945 -10 -5293 -8786 -6377 -6936 -20184 -13290 -7514 6443 4193 2542
14765 2542 -1480 -6162 -12192 -15924 -15347 -13032 -16311 -14411 -8351 2736 6711 3181 -3330 -6571 15080
14750 15080 5730 -7458 -2289 3160 14072 17106 15851 5396 2151 8084 19290 7336 -4412
14737 -4412 -9565 9188 14692 10563 11411 11101 18422 8817 9020 8710 -1040 2768 16002 11679 -1118
14722 -1118 -2000 6718 9629 15049 19588 11441 10737 1771 -10164 858 13634 22911 15622 2836
$$ packed form
14820G488k5296J910R798j2093n27M349k10j2408K449Q22J6545N413l321o186
14806a1267j4619m984P564M365o405j2626o319K5302J1183r129Q690l758q071
14793b0074O327j220o523M926M131m415n756K718M215J3536M42l017l012j467
14779i189M854n708O098L935n283l493K409n59j3248O894N776J3957k250j651
14765B542m022m682o030l732N77K315l279J900O060J1087L975l530o511l241K1651
14750A5080r350j3188N169N449J0912L034j255j0455l245N933J1206j1954j1748
14737d412n153J8753N504m129Q48l10P321r605K03l10r750L808J3234m323j2797
14722a118q82Q718K911N420M539q147p04q966j1935J1022J2776R277p289j2786
$$ plain form
14708 2836 127 7185 6027 17538 17043 4269 -3780 -9042 -2378 -6621 -17600 -9487 -4148 -20345
14694 -20345 -17216 -25153 -25901 -8290 14230 12101 -2986 -19248 -11515 -869 13621 18170 11435
14681 11435 4292 5564 2451 1933 19993 23609 28132 27954 19422 21875 13062 17180 19104 3586
14667 3586 -1460 11489 15625 19519 17761 10660 2580 2437 17861 26050 16018 19533 19346 18683 14118
14652 14118 11375 11379 16693 30983 26701 26852 24838 15492 15313 14312 13614 7639 1604 21 11064
14637 11064 19907 6068 -11753 -21374 -19258 -8968 -140 19257 34560 32479 20400 7206 2057
14624 2057 -2672 219 -4637 -1862 -5096 -9717 -890 -4456 -13602 -23182 -26179 -11821 -3125 -2276 458
14609 458 11276 10750 1616 -8401 -14566 -12707 933 -3563 5165 3125 -3287 -308 5269 -420
$$ packed form
14708B836k709P058j158J1511m95j2774q049n262O664m243j0979Q113N339j6197
14694b0345L129p937p48J7611K2520k129j5087j6262P733J0646J4490M549o735
14681A1435p143J272l113n18J8060L616M523j78q532K453q813M118J924j5518
14667C586n046J2949M136L894j758p101q080j43J5424Q189j0032L515j87o63m565
14652A4118k743MN314J4290m282J51k014r346j79j001o98n975o035j583J1043
14637A1064Q843j3839j7821r621K116J0290Q828J9397J5303k081j2079j3194n149
14624B057m729K891m856K775l234m621Q827l566r146r580k997J4358Q696Q49K734
14609D58J0818n26r134j0017o165J859J3640m496Q728k040o412K979N577n689
$$ plain form
14595 -420 -3856 -10529 2034 -2447 -3214 -6011 -6032 8971 13119 5866 -6166 -17886 -14968 -4329
14581 -4329 -8690 -16949 -6115 -904 994 -13513 -16862 -15432 -19997 -15921 -18897 -23440 -19040 -11457
14567 -11457 -9538 381 -625 -2799 -3993 -12389 -13860 -11556 -8625 -8773 -16524 -24343 -22762 -8744
14553 -8744 1570 12368 14736 1968 10171 -1110 -9001 -12000 -12871 -12826 -12381 -9374 1904 22215
14539 22215 11676 -25942 -20903 -1980 6350 -915 -15720 -10731 -470 -12646 -4166 6535 4043
14526 4043 -3639 -12126 -9390 6662 19630 26613 27275 14549 3424 -1637 -3396 14891 15697 2769
14512 2769 7400 5434 12553 24435 23150 2650 -4780 7402 16948 13271 13825 22799 20503 6896
14498 6896 12171 16867 12134 9508 -1149 8997 11527 -6042 -11415 -17335 -22003 -12257 -4825 -13682
$$ packed form
14595d20l436o673J2563m481p67k797k1J5003M148p253j2032j1720K918J0639
14581d329m361q259J0834N211J898j4507l349J430m565M076k976m543M400P583
14567a1457J919R919j006k174j194q396j471K304K931j48p751p819J581J4018
14553h744J0314J0798K368j2768Q203j1281p891k999q71M5M45L007J1278K0311
14539B2215j0539l7618N039J8923Q330p265j4805M989J0261j2176Q480J0701k492
14526D043p682q487K736J6052J2968O983O62j2726j1125n061j759J8287Q06j2928
14512B769M631j966P119J1882j285k0500p430J2182R546l677N54Q974k296j3607
14498F896N275M696m733k626j0657J0146K530j7569n373n920m668R746P432q857
$$ plain form
14484 -13682 -3820 3113 12142 24721 10883 -5461 -21595 -34612 -34286 -26475 -20626 -24740 -30686
14471 -30686 -28057 -17370 -17244 -25513 -22848 -22273 -17086 -691 4134 10248 9394 9127 -2759 -5693 1272
14456 1272 -44 -7249 -9866 -15645 -5809 -12969 -14773 -3162 6577 8526 -7107 -31941 -25673 -18206
14442 -18206 -11353 -7006 2395 14346 11834 -3391 -13623 -22477 -20782 -8204 -587 515 -16839
14429 -16839 -8565 4536 9519 -487 -1033 10918 18060 18645 20290 19868 14672 16363 20197 17948
14415 17948 8341 -186 10427 -1594 -878 9627 6780 -6564 -8207 -10365 -17651 -15377 -14175 -9804
14401 -9804 -296 2112 -1780 -7454 -14907 -21877 -8580 2566 17067 -1804 -8692 -12814 -10358 -9595
14387 -9595 -7698 -3021 -354 -3865 -8188 -15086 1354 7264 -5963 -13035 -14864 -19901 -23451 -20485
$$ packed form
14484a3682R862O933R029J2579j3838j6344j6134j3017L26P811N849m114n946
14471c0686K629J0687J26q269K665N75N187J6395M825O114q54k67j1886k934O965
14456A272j316p205k617n779R836p160j804J1611R739J949j5633k4834O268P467
14442a8206O853M347R401J1951k512j5225j0232q854J695J2578P617J102j7354
14429a6839Q274J3101M983j0006n46J1951P142N85J645m22n196J691L834k249
14415A7948r607q527J0613j2021P16J0505k847j3344j643k158p286K274J202M371
14401i804R508K408l892n674p453o970J3297J1146J4501j8871o888m122K456P63
14387i595J897M677K667l511m323o898J6440N910j3227p072j829n037l550K966
$$ plain form
14373 -20485 -10835 -14368 -24185 -36016 -31073 -18908 -6547 -6313 -7917 -9801 -8966 3439 9291 10122
14359 10122 -3618 -9127 -13966 -5513 756 1836 -7622 -16388 -13639 -7385 4333 15121 25159
14346 25159 27508 20609 1930 -8232 -18154 -20363 -12141 -2961 -6420 9344 24454 23031 12489
14333 12489 13362 13403 18297 12623 15287 15336 12822 9975 9719 19741 20501 9488 -287 5309 -3716 -5686
14317 -5686 843 11034 12545 -1346 -9605 -2600 -4363 -4348 -591 -7268 -10986 -9267 4091 -1966
14303 -1966 -6015 -19086 -20310 -7238 3105 -8020 -18763 -28523 -34100 -8864 139 -5702 -11902
14290 -11902 -15100 -15566 -2542 14499 15742 22655 31093 23064 3814 -1313 -11009 -15038 -18292 -17084
14276 -17084 -22358 -29316 -24797 -25123 -34542 -26926 -12014 -17131 -20894 -31529 -26272 -5039 14130 9661
$$ packed form
14373b0485R650l533r817j1831M943J2165J2361K34j604j884Q35J2405N852Q31
14359A0122j3740n509m839Q453O269J080r458q766K749O254J1718J0788J0038
14346B5159K349o899j8679j0162r922k209Q222R180l459J5764J5110j423j0542
14333A2489Q73M1M894n674K664M9k514k847k56J0022P60j1013r775N596r025j970
14317e686O529J0191J511j3891q259P005j763J5L757o677l718J719J3358o057
14303a966m049j3071j224J3072J0343j1125j0743r760n577K5236R003n841o200
14290a1902l198m66J3024J7041J243O913Q438q029j9250n127r696m029l254J208
14276a7084n274o958M519l26r419P616J4912n117l763j0635N257K1233J9169m469
$$ plain form
14262 9661 17025 12583 148 -8093 -19434 -22382 -25406 -18993 -1343 -7843 -12873 -14387 -17598 -22899
14248 -22899 -21202 -30314 -21034 -11172 -6357 -3314 -1772 -4695 -1129 848 -2359 -4159 -5049 -8187 -10977
14233 -10977 -3431 3043 -12662 -17972 -6861 -13154 -4683 9489 9255 3280 8734 4753 -2046 -7255
14219 -7255 -9856 -6417 -1431 13945 25732 30714 32144 31324 34568 14067 10405 20719 17983 18742
14205 18742 9728 -4933 -12694 -23135 -32370 -30004 -7948 -335 16169 18362 21362 23732 2549
14192 2549 -4174 -3228 -6551 -6277 1110 -7095 -10944 -12655 -1555 5853 10127 3134 -6239 2446 9478
14177 9478 10371 -840 -7689 1201 -3779 -9196 -7458 7424 16123 14224 12316 3562 -7625 -18006
14163 -18006 -24134 -21705 -3724 -8274 -7795 -6 -7403 -4924 -3145 -11442 -16121 -9808 -8133 -10545
$$ packed form
14262I661P364m442j2435q241j1341k948l024O413J7650o500n030j514l211n301
14248b2899J697r112R280R862M815L043J542k923L566J977l207j800q90l138k790
14233a0977P546O474j5705n310J1111o293Q471J4172k34n975N454l981o799n209
14219g255k601L439M986J5376J1787M982J430q20L244k0501l662J0314k736P59
14205A8742r014j4661p761j0441r235K366K2056P613J6504K193L000K370k1183
14192B549o723R46l323K74P387q205l849j711J1100P408M274o993r373Q685P032
14177I478Q93j1211o849Q890m980n417J738J4882Q699j899j908q754j1187j0381
14163a8006o128K429J7981m550M79P789p397K479J779q297m679O313J675k412
$$ plain form
14149 -10545 -9695 -19617 -26343 -13159 8132 13028 3896 4158 14591 -13154 -31822 -29483 -17803
14136 -17803 -19781 -32536 -12080 -1696 -6175 5674 16923 14637 6420 -1369 -21341 -39387 -38868
14123 -38868 -40911 -27679 -10313 -11099 -8804 3495 24470 16822 7903 -11623 -7436 15336 12368
14110 12368 856 -5891 -1071 18420 28034 27983 13153 5629 -5230 -2832 -13358 -5728 3839 -5543
14096 -5543 -10911 -10353 -1553 -4629 678 -3934 -20314 -11731 -20824 -15605 -6426 -8771 -22952 -20006
14082 -20006 -18644 -21197 -15400 -8156 -14905 -13021 -5074 -7029 -10342 -13312 -10944 -7860 -4284 -11576
14068 -11576 -4127 9995 15073 -7428 -12643 -3050 4146 1860 1665 -3973 -11179 -7142 7005 -4746
14054 -4746 -10949 -3577 -6797 -1572 -689 -7362 -13473 -11377 -12323 4334 4924 -11887 -19429 -28745 -30567
$$ packed form
14149a0545Q50r922o726J3184K1291M896r132K62J0433k7745j8668K339J1680
14136a7803j978j2755K0456J0384m479J1849J1249k286q217p789j9972j8046N19
14123c8868k043J3232J7366p86K295J2299K0975p648q919j9526M187K2772k968
14110A2368j1512o747M820J9491R614n1j4830p524j0859K398j0526P630R567r382
14096e543n368N58Q800l076N307m612j6380Q583r093N219R179k345j4181K946
14082b0006J362k553N797P244o749J884P947j955l313k970K368L084L576p292
14068a1576P449J4122N078k2501n215R593P196k286j95n638p206M037J4147j1751
14054d746o203P372l220N225Q83o673o111K096r46J6657N90j6811p542r316j822
$$ plain form
14039 -30567 -18065 -11093 -3394 22483 25166 9361 -6695 8024 14128 -988 -12949 -20243 -27076
14026 -27076 -24215 -29159 -17456 -1908 -1556 -8511 -7300 -701 -2485 4519 1707 -4999 -19088 -13185
14012 -13185 -8040 -7346 465 -6092 -6296 -7159 -12160 -23053 -16649 -2795 2398 5758 -549 -12692
13998 -12692 -17353 -9827 -9964 -9458 -163 -756 -5981 -8601 -5656 -2925 -9928 2253 -441 -12585 -11192
13983 -11192 -11254 109 2445 1228 -2772 -6232 -9088 -5957 -19402 -26822 -32772 -14088 -11101 -13991
13969 -13991 -6911 -16999 -21554 -18062 -19111 -30762 -27182 -18161 -13608 -8892 -555 -2151 -9353 -28339
13955 -28339 -34785 -19658 -652 -3860 -3019 -4996 8655 17416 16596 19646 10818 7024 13224 16796
13941 16796 17901 6895 -7288 -5469 -608 -7532 -5114 -967 -3295 -6699 -4624 12417 14161 10114
$$ packed form
14039c0567J2502O972P699K5877K683j5805j6056J4719O104j5116j1961p294o833
14026b7076K861m944J1703J5548L52o955J211O599j784P004k812o706j4089N903
14012a3185N145O94P811o557k04q63n001j0893O404J3854N193L360o307j2143
13998a2692m661P526j37N06R295n93n225k620K945K731p003J2181k694j2144J393
13983a1192o2J1363K336j217m000l460k856L131j3445p420n950J8684K987k890
13969a3991P080j0088m555L492j049j1651L580R021M553M716Q337j596p202j8986
13955b8339o446J5127J9006l208Q41j977J3651Q761q20L050q828l794O200L572
13941A6796J105j1006j4183J819M861o924K418M147k328l404K075J7041J744m047
$$ plain form
13927 10114 9074 10636 24759 26746 21815 22109 19734 18966 20531 17405 23911 29089 33765 36086 38797
13912 38797 18566 9437 6798 9794 9397 6077 978 11632 11191 19956 23564 771 -6974 -16681
13898 -16681 -17557 -13734 2196 15156 5586 -5471 -14064 -30002 -23229 -10785 -948 -4262 -22458
13885 -22458 -24584 -24289 -20131 -18093 -15698 -18633 -9239 1679 5402 7645 5777 561 13342 12387
13871 12387 10581 8127 -1599 -1179 4481 1807 -4126 -14837 -15006 -16561 -13774 3552 -7154 -8143
13857 -8143 6087 10413 4556 14080 20999 12649 14186 17600 13971 9798 13629 7234 1007 4454
13843 4454 2345 -4447 -10149 -6311 -15293 -9290 -7592 -13912 -5680 5358 7786 -1435 -1717 -11253 -7982
13828 -7982 -8037 -10299 -15821 -7853 1130 2715 12971 13699 7016 13387 22657 24326 8369 -10038 -20801
$$ packed form
13927A0114j040J562J4123J987m931K94k375p68J565l126O506N178M676K321K711
13912C8797k0231r129k639K996l97l320n099J0654m41Q765L608k2793p745r707
13898a6681q76L823J5930J2960r570j1057q593j5938O773J2444R837l314j8196
13885b2458k126K95M158K038K395k935R394J0918L723K243j868n216J2781r55
13871A2387j806k454r726M20N660k674n933j0711j69j555K787J7326j0706r89
13857h143J4230M326n857R524O919q350J537L414l629m173L831o395o227L447
13843D454k109o792n702L838q982O003J698o320Q232J1038K428r221k82r536L271
13828g982n5k262n522P968Q983J585J0256P28o683O371R270J669j5957j8407j0763
$$ plain form
13813 -20801 -34916 -30017 -15417 -10958 -9282 -4260 -6953 1076 136 -6347 -12514 -8755 -7652 -5059
13799 -5059 8362 10111 10193 10528 665 -2827 422 11951 13034 1958 3653 11494 19432 3733
13785 3733 2059 -78 -11287 -13170 -11920 -7970 -3724 2040 736 2101 -3262 -5125 -5430 -10494 -1150
13770 -1150 1572 8063 -238 -3279 -5008 -16994 -17171 -5097 -6659 13705 18931 11575 -4235 547
13756 547 9637 20472 28776 14642 8230 -4247 -4044 366 4729 955 3316 242 7866 14362
13742 14362 15390 20628 25577 16317 -8010 -7327 -15850 -24806 -27184 -23443 -14554 -10447 -18389 -15415
13728 -15415 -8403 -6639 -6836 4651 1654 -6714 13414 16956 14883 8310 -980 -720 6449 14019
13714 14019 10784 1824 -7296 12733 17768 370 2413 10939 19923 36518 28815 16764 7673
$$ packed form
13813b0801j4115M899J4600M459J676N022k693Q029r40o483o167L759J103K593
13799e059J3421J749Q2L35r863l492L249J1529J083j1076J695P841P938j5699
13785C733j674k137j1209j883J250L950M246N764j304J365n363j863l05n064R344
13770a150K722O491q301l041j729j1986j77J2074j562K0364N226p356j5810M782
13756E47R090J0835Q304j4134o412j2477K03M410M363l774K361l074P624O496
13742A4362J028N238M949r260k4327O83q523q956k378L741Q889M107p942K974
13728a5415P012J764j97J1487k997q368K0128L542k073o573r290K60P169P570
13714A4019l235q960r120K0029N035j7398K043Q526Q984J6595p703j2051r091
$$ plain form
13701 7673 6975 15169 21374 17582 8765 10824 20390 32246 34283 22965 18006 11974 2077 -893
13687 -893 16266 13892 10658 2869 2757 11989 21974 16084 982 -19200 -20410 10441 14459 -4172
13673 -4172 -11084 -8497 -14721 -19365 -12125 -5680 -9249 -7023 -11373 -15799 -11964 -339 9753 -394
13659 -394 -9456 -14928 -17124 -11902 -17700 -24088 -14375 951 5696 16324 30347 29773 19935 8854
13645 8854 4312 3091 964 6047 16410 10946 -12945 -23317 -14925 -12655 -3954 229 8635 22209
13631 22209 26264 15668 11807 16156 -834 -1441 5960 18944 10934 -391 230 -2597 648 12647
13617 12647 191 -14938 -8872 -9120 -4006 -18266 -8982 4771 12549 11230 12308 9987 -2277
13604 -2277 11411 19140 13755 14114 32098 27115 13822 18970 17934 10257 3838 7548 13298 16482
$$ packed form
13701G673o98Q194O205l792q817K059R566J1856K037j1318m959o032r897k970
13687h93J7159k374l234p789j12R232R985n890j5102k0182j210L0851M018j8631
13673d172o912K587o224m644P240O445l569K226m350m426L835J1625J0092j0147
13659c94r062n472k196N222n798o388R713J5326M745J0628J4023n74r838j1081
13645H854m542j221k127N083J0363n464k3891j0372Q392K270Q701M183Q406J3574
13631B2209M055j0596l861M349j6990o07P401J2984q010j1325O21k827L245J1999
13617A2647j2456j5129O066k48N114j4260R284J3753P778j319J078k321j2264
13604b277J3688P729n385L59J7984m983j3293N148j036p677o419L710N750L184
$$ plain form
13590 16482 9429 -1165 -5404 -607 4624 14938 13747 6800 -1215 -9230 -9193 -10272 -12543 -11798 -5141
13575 -5141 -10611 -19756 748 6289 -2098 5757 4272 -3645 3326 3006 9009 17934 22475 22468 37420
13560 37420 47496 19848 11021 28410 38278 37193 32255 21145 10744 16153 21886 18989 11665
13547 11665 20518 21985 19817 34012 57499 54418 41960 47199 53052 48174 57488 56962 48990 44854
13533 44854 51822 41634 37124 42892 47085 37042 38278 31413 28384 24758 11891 11523 12741 14794
13519 14794 22432 25624 8966 -4795 6891 22618 40459 34249 13086 -2581 -978 -2657 -1787
13506 -1787 -7771 -10554 -8011 -12073 -17135 -15417 -8815 2507 -7774 -5243 6681 100 3304 4198
13492 4198 -386 18090 23402 4935 -6147 -7873 -5294 731 6064 22562 32926 22287 -513
$$ packed form
13590A6482p053j0594m239M797N231J0314j191o947q015q015L7j079k271P45O657
13575e141n470r145K0504N541q387P855j485p917O971l20O003Q925M541pJ4952
13560C7420J0076k7648q827J7389R868j085m938j1110j0401N409N733k897p324
13547A1665Q853J467k168J4195K3487l081j2458N239N853m878R314n26p972m136
13533D4854O968j0188m510N768M193j0043J236o865l029l626j2867l68J218K053
13519A4794P638L192j6658j3761J1686J5727J7841o210k1163j5667J603j679Q70
13506a787n984k783K543m062n062J718O602J1322j0281K531J1924o581L204Q94
13492D198m584J8476N312j8467j1082j726K579O025N333J6498J0364j0639k2800
$$ plain form
13479 -513 -12296 -10557 -5086 -3655 -18556 -13232 -7438 -9877 -24757 -29352 -24279 -13467 -10349 -14753
13465 -14753 3529 3253 -12150 -23781 -19462 -12016 -18077 -13699 -21041 -14346 -5685 -16182 -24392 -19019
13451 -19019 -12714 -15080 -7998 3100 19745 12098 251 -10640 -23003 -1681 3225 7552 11163
13438 11163 14354 15665 12845 12622 7047 1639 -12466 -4324 721 8538 -13644 -33702 -39542 -26969
13424 -26969 -5483 10867 1825 -8283 1776 -1412 -5726 -4313 3630 16005 15785 15280 17971 21342
13410 21342 10038 -3170 -760 15123 18037 13891 3905 14061 8201 -5351 743 -394 -7622
13397 -7622 -7779 -5372 -671 -3410 19 14018 20474 30326 30153 33441 37603 23733 9644 18774
13383 18774 16946 21075 22850 15658 20002 27706 36283 32272 24416 21464 19015 22158 5360 -7998
$$ packed form
13479e13j1783J739N471J431j4901N324N794k439j4880m595N073J0812L118m404
13465a4753J8282k76j5403j1631M319P446o061M378p342O695Q661j0497q210N373
13451a9019O305k366P082J1098J6645p647j1847j0891j2363K1322M906M327L611
13438A1163L191J311k820k23n575n408j4105Q142N045P817k2182k0058n840J2573
13424b6969K1486J6350r042j0108J0059l188m314J413P943J2375k20n05K691L371
13410B1342j1304j3208K410J5883K914m146r986J0156n860j3552O094j137p228
13397g622j57K407M701k739L429J3999O456R852j73L288M162j3870j4089R130
13383A8774j828M129J775p192M344P704Q577m011p856k952k449L143j6798j3358
$$ plain form
13369 -7998 -3342 3120 19817 10105 3008 7886 5188 9714 19477 27690 27600 26829 15472 15478 25888
13354 25888 35963 39511 37465 40322 35396 31343 27682 25279 27918 19116 17217 32827 32747 37109
13340 37109 46377 42848 37613 21886 29010 28645 20003 17812 24600 30414 28438 11371 8245 -1203
13326 -1203 -14387 -1103 6573 8726 9413 14994 16188 13265 20576 13676 14249 27912 34529 27528
13312 27528 28480 38436 41216 30005 21617 10825 25142 34534 27575 30521 32748 12373 20096 21099
13298 21099 21150 41665 24489 7559 -5689 -11934 -9666 -8723 -6584 -15137 4958 23439 18994 4959
13284 4959 7512 4072 4733 8390 9084 3770 -631 7962 15965 35652 43532 33447 20851 18157
13270 18157 29386 33294 34600 20105 13626 9672 2044 499 -4123 -559 3129 16381 12455 6927
$$ packed form
13369g998M656O462J6697r712p097M878k698M526R763Q213r0p71j1357OJ0410
13354B5888J0075L548k046K857m926m053l661k403K639q802j899J5610q0M362
13340C7109R268l529n235j5727P124l65q642k191O788N814j976j7067l126r448
13326a203j3184J3284P676K153O87N581J194k923P311o900N73J3663O617p001
13312B7528R52R956K780j1211q388j0792J4317R392o959K946K227k0375P723J003
13298B1099N1K0515j7176j6930j3248o245K268R43K139q553K0095J8481m445j4035
13284D959K553l440O61L657O94n314m401Q593Q003J9687P880j0085j2596k694
13270A8157J1229L908J306j4495o479l954p628j545m622L564L688J3252l926n528
$$ plain form
13256 6927 7380 6344 -174 -2865 -2263 10063 14274 13281 15326 16007 14767 10980 10762 6357 13609 9601
13240 9601 -4994 -7894 -2856 8475 8736 -477 5895 18293 19836 10257 -7915 -5458 10039 8027
13226 8027 9894 17215 14315 6482 -493 6367 4689 -1656 6663 20592 18496 10624 10681 10024 -5286
13211 -5286 -18377 -14735 -10117 1966 8125 -6272 4075 7686 2942 -12205 -19342 -13325 -11058
13198 -11058 -1806 4980 1102 5642 16999 17369 7309 -39 5418 12013 11547 -2070 -15272 -8528
13184 -8528 4592 23266 39768 41394 38112 36859 34081 21783 6132 -2961 -2630 8865 7208
13171 7208 17476 35325 49710 56477 43657 41813 41384 40470 27049 11475 -3306 -13984 -22241
13158 -22241 -31424 -16929 -988 3161 4835 12613 11855 1512 3833 7424 8734 3334 10106 24991
$$ packed form
13256F927M53j036o518k691O02J2326M211r93K045O81j240l787k18m405P252m008
13240I601j4595k900N038J1331K61r213O372J2398J543r579j8172K457J5497k012
13226H027J867P321k900p833o975O860j678o345Q319J3929k096p872N7o57j5310
13211e286j3091L642M618J2083O159j4397J0347L611m744j5147p137O017K267
13198a1058R252O786l878M540J1357L70j0060p348N457O595m66j3617j3202O744
13184h528J3120J8674J6502J626l282j253k778j2298j5651r093L31J1495j657
13171G208J0268J7849J4385O767j2820j844m29r14j3421j5574j4781j0678q257
13158b2241r183J4495J5941M149J674P778p58j0343K321L591J310n400O772J4885
$$ plain form
13144 24991 28070 29201 29387 43367 36803 19734 9760 2282 12087 18153 24278 19754 9669 -871
13130 -871 10158 13769 13072 11205 11010 7806 2247 9983 24629 28978 42459 34560 21637 39231
13116 39231 36807 23483 22609 42679 48964 58582 47730 28282 23769 15992 6410 3338 12375 16155
13102 16155 11362 14993 22652 32032 27551 24452 22315 15639 8097 13080 11183 16873 20333 23217
13088 23217 23600 9675 2786 19513 31720 38034 32269 36512 35701 37829 57606 63510 46813 52054
13074 52054 57006 51915 50684 47168 53760 35430 24449 17150 18457 14260 10560 30369 54194
13061 54194 60557 62005 63532 54909 32037 21416 27651 42462 33649 35791 33947 30055 44695
13048 44695 38442 27575 31202 26583 13729 20853 12375 13955 23182 30590 34951 43162 50728 48144
$$ packed form
13144B4991L079J131J86J3980o564j7069r974p478R805O066O125m524j0085j0540
13130h71J1029L611o97j867j95l204n559P736J4646M349J3481p899j2923J7594
13116C9231k424j3324q74K0070O285R618j0852j9448m513p777r582l072R037L780
13102A6155m793L631P659R380m481l099k137o676p542M983j897N690L460K884
13088B3217L83j3925o889J6727J2207O314n765M243q11K128J9777N904j6697N241
13074E2054M952n091j231l516O592j8330j0981p299J307m197l700J9809K3825
13061E4194O363J448J527q623k2872j0621O235J4811q813K142j844l892J4640
13048D4695o253j0867L627m619j2854P124q478J580R227P408M361Q211P566k584
$$ plain form
13034 48144 47744 47809 59924 58291 54059 49847 49135 47583 32545 14442 17239 36135 37702 41393
13020 41393 47198 38069 28948 32903 42270 49030 46888 28633 19091 18685 8690 5689 -5615 -9758
13006 -9758 4228 8671 19034 29082 20787 25896 34196 24582 9617 2061 15476 30569 24974
12993 24974 20939 26616 19144 9536 11121 11412 8796 3757 6804 10281 19861 21992 19846 18378 11313
12978 11313 -8409 -12239 3721 12039 16391 22571 17379 -9193 -13551 2983 1320 -16647 -19455
12965 -19455 13895 23378 19472 8037 19256 29839 27286 27667 18725 23737 25204 8050 -4167
12952 -4167 -622 2067 12108 13965 8865 5794 -4273 -1647 3280 4874 1758 569 4814 6828
12938 6828 7374 3784 -902 4803 14623 29555 30993 17105 7297 14292 35024 44764 42442 37204
$$ packed form
13034D8144m00O5J2115j633m232m212p12j552j5038j8103K797J8896J567L691
13020D1393N805r129r121L955R367O760k142j8255r542m06r995l001j1304m143
13006i758J3986M443J0363J0048q295N109Q300r614j4965p556J3415J5093n595
12993B4974m035N677p472r608J585K91k616n039L047L477R580K131k146j468p065
12978A1313j9722l830J5960Q318M352O180n192k6572m358J6534j663j7967k808
12965a9455L3350R483l906j1435J1219J0583k553L81q942N012J467j7154j2217
12952d167L545K689J0041J857n100l071j0067K626M927J594l116j189M245K014
12938F828N46l590m686N705R820J4932J438j3888r808O995K0732R740k322n238
$$ plain form
12924 37204 26222 18831 19448 33454 43340 48169 45687 32193 7171 10376 13861 30089 34790
12911 34790 22755 15029 11859 10973 30678 21997 22045 27538 30827 30281 17955 19568 18475 13205 9618
12896 9618 -133 11071 32443 32286 27752 27447 18348 28880 28309 22300 18966 13072 19663 42823
12882 42823 55027 47993 35227 22897 15795 15701 26022 20219 6673 15430 20504 24656 18268 20114
12868 20114 25528 28714 29075 35443 33047 28886 27880 32936 39432 49019 37747 25198 25903 10020
12854 10020 4139 -4909 -5016 -12944 -7938 -7913 9842 34194 29312 29431 32235 40063 39378 35776 14416
12839 14416 3530 -4349 2229 17506 24954 25519 20649 20176 20880 11764 20529 25670 17439 21105 32104
12824 32104 20763 8573 5226 13397 22484 24215 20880 24781 16387 -5350 -6869 8779 18603
$$ packed form
12924C7204j0982p391O17J4006R886M829k482j3494k5022L205L485J6228M701
12911C4790j2035p726l170q86J9705q681M8N493L289n46j2326J613j093n270l587
12896I618r751J1204K1372j57m534l05r099J0532n71o009l334n894O591K3160
12882D2823J2204p034j2766j2330p102r4J0321n803j3546Q757N074M152o388J846
12868B0114N414L186L61O368k396m161j006N056O496R587j1272j2549P05j5883
12854A0020n881r048j07p928N006K5J7755K4352m882J19K804P828o85l602k1360
12839A4416j0886p879O578J5277P448N65m870m73P04r116Q765N141q231L666J0999
12824C2104j1341j2190l347Q171R087J731l335L901q394k1737j519J5648R824
$$ plain form
12811 18603 23845 27434 31614 36441 29899 38421 50185 44829 38758 32987 30081 32155 30690 28028
12797 28028 12785 1970 15356 36978 35651 37223 18851 5955 12593 19534 11517 4523 14210
12784 14210 26741 19158 19477 18109 12307 15547 11082 6411 25486 23470 19365 24421 27211 23625
12770 23625 17537 18987 19506 23054 28670 4104 1268 5026 2420 16396 33046 44109 30469
12757 30469 7423 8357 16429 14773 16478 24571 26100 21514 24070 41900 63394 59916 56978 53798
12743 53798 54843 52038 55745 56385 52155 58744 69100 81523 81826 81814 86367 88654 87121 101030 107604
12728 107604 107480 112851 112008 108598 120546 143156 173326 227670 257819 260170 235777 221256 216397
12715 216397 214898 231516 259166 291274 329617 391605 471540 565661 658416 746745 815732 846106
$$ packed form
12811A8603N242L589M180M827o542Q522J1764n356o071n771k906K074j465k662
12797B8028j5243j0815J3386K1622j327J572j8372j2896O638O941q017o994R687
12784A4210J2531p583L19j368n802L240m465m671J9075k016m105N056K790l586
12770B3625o088J450N19L548N616k4566k836L758k606J3976J6650J1063j3640
12757C0469k3046R34Q072j656J705Q093J529m586K556J7830K1494l478k938l180
12743E3798J045k805L707O40m230O589J0356J2423L03j2M553K287j533J3909O574
12728A07604j24N371q43l410J1948K2610L0170N4344L0149K351k4393j4521m859
12715B16397j499J6618K7650L2108L8343O1988P9935R4121R2755Q8329O8987L0374
$$ plain form
12703 846106 842429 809837 754431 700229 631577 550383 483784 432382 376884 323855 276796 268860
12691 268860 258772 258820 263826 252152 258585 279733 291916 285083 261827 229393 206165 182956 162001
12678 162001 140229 119442 104467 95613 86260 88722 98923 92521 82745 72621 72268 82093 86436
12665 86436 83304 74070 57890 56751 63615 64262 62250 63609 70230 82998 87668 88315 98648 109049
12651 109049 130276 149514 174287 197430 189904 153237 114397 91055 63820 69602 71831 69371
12639 69371 72659 66436 55964 57411 58368 36769 28718 36280 36942 42768 55054 51598 46298 46164
12625 46164 43419 53658 67015 65535 64086 71420 82339 80521 53970 47109 63844 70111 69391
12612 69391 75515 69898 59313 49832 46202 46380 54027 49674 59749 46277 38883 40362 56817 68386
$$ packed form
12703H46106l677l2592n5406n4202o8652q1194o6599n1402n5498n3029m7059p936
12691B68860j0088M8N006j1674O433K1148J2183o833k3256l2434k3228k3209k0955
12678A62001k1772k0787j4975q854r353K462J0201o402r776j0124l53R825M343
12665H6436l132r234j6180j139O864O47k012J359O621J2768M670O47J0333J0401
12651A09049K1227J9238K4773K3143p526l6667l8840k3342k7235N782K229k460
12639F9371L288o223j0472J447R57k1599q051P562O62N826J2286l456n300j34
12625D6164k745J0239J3357j480j449P334J0919j818k6551o861J6735O267p20
12612F9391O124n617j0585r481l630J78P647m353J0075j3472p394J479J6455J1569
$$ plain form
12598 68386 67157 51946 40689 43953 50760 34475 21905 30460 34910 25287 24094 22050 29032
12585 29032 34012 25664 22152 26912 27994 36892 49278 38607 28502 38374 43972 46831 52909 61981
12571 61981 55408 40197 41153 36715 36445 37193 41896 31747 32698 40519 42831 36214 34205 36790 55396
12556 55396 54382 53598 55015 46657 43427 49357 55630 68188 78983 84151 90275 80429 65472 62825
12542 62825 76375 98782 114774 108579 110297 129079 129076 108415 105746 103287 101621 94343 97785 113919
12528 113919 111606 109031 119926 118725 100960 100841 104751 97497 78063 68595 81249 78753 66369
12515 66369 69331 68010 64605 77792 91324 77011 71310 82516 70118 75017 73031 66568 82419
12502 82419 84731 85349 93181 116798 124495 116002 125516 143486 156507 174464 185641 203751 203900
$$ packed form
12598F8386j229j5211j1257L264O807j6285j2570Q555M450r623j193k044O982
12585B9032M980q348l512M760J082Q898J2386j0671j0105R872N598K859O078R072
12571F1981o573j5211R56m438k70P48M703j0149R51P821K312o617k009K585J8606
12556E5396j014p84J417q358l230N930O273J2558J0795N168O124r846j4957k647
12542F2825J3550K2407J5992o195J718J8782lk0661k669k459j666p278L442J6134
12528A13919k313k575J0895j201j7765j19L910p254j9434r468J2654k496j2384
12515F6369K962j321l405J3187J3532j4313n701J1206j2398M899j986o463J5851
12502H2419K312O18P832K3617P697q493R514J7970J3021J7957J1177J8110J49
$$ plain form
12489 203900 218645 273642 335536 405128 488445 602335 741923 878508 986406 1055130 1076960
12478 1076960 1057243 992658 898427 771546 643978 510213 403906 327541 275311 239195
12468 239195 204356 179837 166582 173973 182384 192130 198212 183829 166397 165211 179865 187513 190812
12455 190812 188977 191764 203054 205948 208616 217858 229330 224583 240666 292346 350490 428856 511776
12442 511776 616385 743974 881827 968075 963065 878758 749354 656392 593960 546517 517948
12431 517948 526011 528608 552240 583751 632304 667735 687841 705540 713653 721636 736329 773201
12419 773201 834109 877699 893451 893647 889873 875151 858649 875219 913313 974235 1049640 1143134
12407 1143134 1300727 1502705 1759735 2029696 2237588 2301503 2214970 2037769 1812164 1577374
$$ packed form
12489B03900J4745N4997O1894O9592Q3317J13890J39588J36585J07898O8724K1830
12478A076960j9717o4585r4231j26881j27568j33765j06307p6365n2230l6116
12468B39195l4839k4519j3255P391Q411R746O082j4383j7432j186J4654P648L299
12455A90812j835K787J1290K894K668R242J1472m747J6083N1680N8144P8366Q2920
12442E11776J04609J27589J37853Q6248n010q4307j29404r2962o2432m7443k8569
12431E17948Q063K597K3632L1511M8553L5431K0106J7699Q113P983J4693L6872
12419G73201O0908M3590J5752J96l774j4722j6502J6570L8094O0922P5405R3494
12407A143134J57593K01978K57030K69961K07892O3915q6533j77201k25605k34790
$$ plain form
12397 1577374 1371230 1216743 1101420 1010579 967665 962955 964367 988055 999111 994580 975075
12386 975075 922986 878555 838212 808658 789183 785216 789817 779675 754698 721256 699153 691559
12374 691559 704248 708479 737213 774433 822740 909832 1020330 1147408 1236118 1215984 1115936
12363 1115936 972090 832670 724566 653102 611267 586085 573619 572197 573541 566524 552761
12352 552761 542077 551360 571130 588655 603344 622366 632286 635946 631120 636693 648874 668769
12340 668769 692508 703714 721221 740509 764452 790906 820440 856739 898835 933606 955877
12329 955877 977644 997104 1032211 1060404 1098145 1137745 1183247 1225231 1280212 1347002 1405463
12318 1405463 1479618 1548140 1616007 1694966 1780344 1869200 1989988 2132812 2275656 2410561
$$ packed form
12397A577374k06144j54487j15323r0841m2914m710J412K3688J1056m531j9505
12386I75075n2089m4431m0343k9554j9475l967M601j0142k4977l3442k2103p594
12374F91559J2689M231K8734L7220M8307Q7092J10498J27078Q8710k0134j00048
12363A115936j43846j39420j08104p1464m1835k5182j2466j422J344p017j3763
12352E52761j0684R283J9770J7525J4689J9022R920L660m826N573J2181J9895
12340F68769K3739J1206J7507J9288K3943K6454K9534L6299M2096L4771K2271
12329I55877K1767J9460L5107K8193L7741L9600M5502M1984N4981O6790N8461
12318A405463P4155O8522O7867P8959Q5378Q8856J20788J42824J42844J34905
$$ plain form
12308 2410561 2569423 2745171 2940219 3172180 3427307 3728765 4079688 4478040 4959544
12299 4959544 5535911 6217172 7030782 7978497 9079234 10348200 11782505 13434023 15382608
12290 15382608 17732550 20662485 24399492 29310634 35859715 44585687 55931963 69954668
12282 69954668 86021724 102927129 119048795 132644150 142168812 146457274 145001041
12275 145001041 137982723 126233750 111107507 94329261 77669322 62577267 49971947
12268 49971947 40119504 32684881 27130755 22931502 19699742 17127978 15010961 13218312
12260 13218312 11657926 10280559 9090181 8069431 7186305 6431207 5800702 5255935 4792687
12251 4792687 4394763 4045866 3739062 3445120 3180009 2943011 2755033 2591192 2442710
$$ packed form
12308B410561J58862J75748J95048K31961K55127L01458L50923L98352M81504
12299D959544N76367O81261Q13610R47715J100737J268966J434305J651518J948585
12290A5382608K349942K929935L737007M911142O549081Q725972J1346276J4022705
12282F9954668J6067056J6905405J6121666J3595355R524662M288462j456233
12275A45001041p018318j1748973j5126243j6778246j6659939j5092055j2605320
12268D9971947r852443p434623n554126m199253l231760k571764k117017j792649
12260A3218312j560386j377367j190378j020750q83126p55098o30505n44767m63248
12251D792687l97924l48897l06804k93942k65111k36998j87978j63841j48482
$$ plain form
12242 2442710 2292522 2160402 2046254 1939756 1837891 1738152 1643572 1556015 1472418 1395816
12232 1395816 1323466 1274735 1229460 1167305 1109130 1045268 991105 949342 914555 880077 839158
12221 839158 813784 803188 780116 743707 722008 700528 676813 663812 670137 676421 648452 623064
12209 623064 606172 579284 566194 555937 529822 494883 466821 443973 429401 414077 413588 417441
12197 417441 416818 419671 420038 417862 422822 415232 393649 379026 357015 347380 343225 342420 341663 331700
12183 331700 313739 294269 283877 286543 298513 291721 293015 292391 283726 284008 279590 263340 249654
12170 249654 254138 255950 262944 279905 268447 258685 258168 249166 225528 208876 206498 207398 196252
12157 196252 177589 166858 171302 169705 176565 188022 190626 189542 199011 190651 190112 202439 211133
$$ packed form
12242B442710j50188j32120j14148j06498j01865r9739r4580q7557q3597p6602
12232A395816p2350m8731m5275o2155n8175o3862n4163m1763l4787l4478m0919
12221H39158k5374j0596k3072l6409k1699k1480k3715j3001O325O284k7969k5388
12209F23064j6892k6888j3090j0257k6115l4939k8062k2848j4572j5324m89L853
12197D17441o23K853L67k176M960p590k1583j4623k2011r635m155q05p57r963
12183C31700j7961j9470j0392K666J1970o792J294o24q665K82m418j6250j3686
12170B49654M484J812O994J6961j1458r762n17r002k3638j6652k378R00j1146
12157A96252j8663j0731M444j597O860J1457K604j084R469q360n39J2327Q694
$$ plain form
12144 211133 211932 222382 214668 201016 180372 162591 165274 167692 164606 164149 154974 143427 150105
12131 150105 162973 166745 153285 148096 157878 166901 162080 157263 164197 166844 171189 163424 162758 168905
12117 168905 172734 150520 131934 120365 108284 110080 125758 136266 136035 114846 118222 121267 118589
12104 118589 114871 110106 96874 94264 107094 102073 103761 102825 98176 101329 105165 102101 106007 104690
12090 104690 97591 91750 92938 96705 106826 116125 127575 140030 128635 107733 96297 93327 97295
12077 97295 108227 96884 69869 61762 67075 65735 72177 78970 70337 65587 71548 82172 98131
12064 98131 110344 121370 131659 127589 133576 147501 142252 153352 185105 200242 215657 219253
12052 219253 228559 239973 238935 244014 241384 241381 248420 244282 248290 239254 243079 234084 225409 216445 190381
$$ packed form
12144B11133P99J0450p714j3652k0644j7781K683K418l086m57r175j1547O678
12131A50105J2868L772j3460n189R782R023m821m817O934K647M345p765o66O147
12117A68905L829k2214j8586j1569j2081J796J5678J0508k31k1189L376L045k678
12104A18589l718m765j3232k610J2830n021J688r36m649L153L836l064L906j317
12090A04690p099n841J188L767J0121R299J1450J2455j1395k0902j1436k970L968
12077I7295J0932j1343k7015q107N313j340O442O793q633m750N961J0624J5959
12064I8131J2213J1026J0289m070N987J3925n249J1100L1753J5137J5415L596
12052B19253R306J1414j038N079k630lP039m138M008r036L825q995q675q964k6064
$$ plain form
12037 190381 173525 187846 188922 179984 160585 145600 131464 113253 110569 99324 87412 96861
12025 96861 95901 100793 99810 92773 79183 66735 62938 63354 68338 68453 61672 48426 33028 43080
12011 43080 42261 41887 19468 19227 40452 51432 50491 55399 50345 40099 40827 48000 47760 41671 41831
11996 41831 43117 37375 38559 50248 50556 45048 37417 44891 58387 66589 66615 57047 48856 32310
11982 32310 41763 44402 41006 52042 56212 51833 58756 54888 50169 45882 53156 58921 53262 53514
11968 53514 48742 45331 36090 27137 24254 24072 17223 20237 32814 45704 25202 8942 6004 17379
11954 17379 25937 15352 11329 -86 -6727 -17089 -5065 16386 16733 28156 32633 23046 25232
11941 25232 34236 37728 30805 16549 3804 -7001 -6039 -1622 -3332 9074 13902 15672 19227 10985
$$ packed form
12037A90381j6856J4321J076q938j9399j4985j4136j8211k684j1245j1912R449
12025I6861r60M892r83p037j3590j2448l797M16M984J15o781j3246j5398J0052
12011D3080q19l74k2419k41K1225J0980r41M908n054j0246P28P173k40o089J60
11996D1831J286n742J184J1689L08n508p631P474J3496Q202K6r568q191j6546
11982C2310R453K639l396J1036M170m379O923l868m719m287P274N765n659K52
11968E3514m772l411r241q953k883j82o849L014J2577J2890k0502j6260k938J1375
11954A7379Q558j0585m023j1415o641j0362J2024K1451L47J1423M477r587K186
11941B5232R004L492o923j4256j2745j0805R62M417j710J2406M828J770L555q242
$$ plain form
11927 10985 8907 -576 7573 19984 26404 28257 20120 5645 0 -7265 2773 7763 -1621 13931
11913 13931 29988 34099 26844 12276 9555 16786 23267 13146 15080 19080 13986 13493 12309 9128
11899 9128 15682 2323 -6028 -8827 -289 11492 16693 16533 18400 17137 7722 15243 28312 32304
11885 32304 26482 16316 1323 11524 16412 -2312 -2526 3556 8945 11190 19126 13687 12417 23787
11871 23787 29797 33908 35349 29626 31138 38187 39926 59185 68225 69368 77148 82905 90045 108602
11857 108602 110982 120982 135678 160235 199490 260028 318172 400949 490394 581827 660721 725006
11845 725006 768680 793522 778686 736841 678944 591230 507158 428552 364148 300035 226699
11834 226699 179411 144893 118911 106283 87155 63107 65890 75859 66852 74563 71414 53321
$$ packed form
11927A0985k078r483Q149J2411O420J853q137j4475n645p265J0038M990r384J5552
11913A3931J6057M111p255j4568k721P231O481j0121J934M000n094m93j184l181
11899I128O554j3359q351k799Q538J1781N201j60J867j263r415P521J3069L992
11885C2304n822j0166j4993J0201M888j8724k14O082N389K245P936n439j270J1370
11871B3787O010M111J441n723J512P049J739J9259R040J143P780N757P140J8557
11857A08602K380J0000J4696K4557L9255O0538N8144Q2777Q9445R1433P8894O4285
11845G25006M3674K4842j4836m1845n7897q7714q4072p8606o4404o4113p3336
11834B26699m7288l4518k5982j2628j9128k4048K783R969r007P711l149j8093
$$ plain form
11822 53321 39071 28219 26805 27807 36278 34575 39554 35953 32700 36814 25537 21240 27313 36692
11808 36692 45307 35469 26660 16518 15748 7618 10507 11798 21812 21110 23987 30320 27581 15839
11794 15839 10317 10098 9443 17819 16220 22360 27148 31125 35626 37616 46985 40083 28776 33785 34039
11779 34039 18863 26750 16752 -6384 -493 2208 4850 5574 8324 9826 11254 19580 32912 40864
11765 40864 27475 20119 23141 24441 21119 21069 22431 20618 17219 9978 5595 22429 20236 384
11751 384 9523 15709 17623 14967 11536 4581 -11426 -35078 -19220 794 -7967 -9212 -13332 8497
11737 8497 19281 24650 26756 8612 7039 14199 5393 5673 3536 5463 9802 18368 7119 -337
11723 -337 13453 29616 39408 36906 32179 36336 44965 59990 69904 68069 52474 32225 22969 33108
$$ packed form
11822E3321j4250j0852j414J002Q471j703M979l601l253M114j1277m297O073R379
11808C6692Q615r838q809j0142p70q130K889J291J0014p02K877O333k739j1742
11794A5839n522k19o55Q376j599O140M788L977M501J990R369o902j1307N009K54
11779C4039j5176P887r998k3136N891K701K642P24K750J502J428Q326J3332P952
11765D0864j3389p356L022J300l322n0J362j813l399p241m383J6834k193j9852
11751C84R139O186J914k656l431o955j6007k3652J5858K0014q761j245m120K1829
11737H497J0784N369K106j8144j573P160q806K80k137J927M339Q566j1249p456
11723c37J3790J6163R792k502m727M157Q629J5025R914j835j5595k0249r256J0139
$$ plain form
11709 33108 42792 45693 27806 24421 35427 30342 22025 18752 25692 37093 30573 26100 21662 24384
11695 24384 16695 11849 23013 31970 30978 31313 35698 20644 22652 38570 35743 22568 33542 46672
11681 46672 37874 28915 21420 1836 -18066 -18666 -3993 5792 17367 34755 35970 16520 10630
11668 10630 6650 -5939 -9460 -3532 -7389 -10154 -8142 -3121 4831 17332 20859 24678 14823 5984
11654 5984 -3625 727 3272 1035 -8267 -14538 -5074 -1416 12448 15506 1937 -12092 -13807 -1089
11640 -1089 8379 5152 -471 5918 1146 14377 33587 34404 24626 16126 13777 13095 8773 -2537
11626 -2537 -14118 -1730 1816 -4417 -10484 -10807 953 7290 2636 5992 12520 28588 42460 27815
11612 27815 -976 -3749 -15800 -3953 1834 -972 -2839 17611 11172 26641 26392 20845 4697
$$ packed form
11709C3108R684K901j7887l385J1006n085q317l273O940J1401o520m473m438K722
11695B4384p689m846J1164Q957r92L35M385j5054K008J5918k827j3175J0974J3130
11681D6672q798q959p495j9584j9902o00J4673R785J1575J7388J215j9450n890
11668A0630l980j2589l521N928l857k765K012N021P952J2501L527L819r855q839
11654E984r609M352K545k237r302o271R464L658J3864L058j3569j4029j715J2718
11640a089R468l227n623O389m772J3231J9210Q17r778q500k349o82m322j1310
11626b537j1581J2388L546o233o067l23J1760O337m654L356O528J6068J3872j4645
11612B7815k8791k773j2051J1847N787k806j867K0450o439J5469k49n547j6148
$$ plain form
11599 4697 3914 9087 5258 994 -13541 -24181 -17712 7161 16471 12783 18673 24965 26964 29486
11585 29486 21094 14982 -1245 -7448 -759 3557 2441 2295 22235 25011 15490 -1462 -15499 -16492
11571 -16492 -17183 -11150 -9932 -5980 -3455 -5684 -7186 -13896 -11600 -17692 -1408 27943 24678 11702
11557 11702 1476 -1745 6405 15326 17908 3415 -3316 2790 3249 6877 7873 -4018 3140 -8687
11543 -8687 -10593 -14922 -15553 843 -722 -981 4201 15628 19125 9348 1610 19340 23657 17411
11529 17411 7284 1034 4976 7445 15778 13755 9482 12771 10273 2970 6954 6292 -441 6465
11515 6465 12443 10762 10014 20380 35813 37689 35836 27956 19734 12511 17355 18057 25606 18836 12715
11500 12715 23271 25817 20013 34 5080 16920 12373 7194 8304 5497 14046 25811 25255 5877
$$ packed form
11599D697p83N173l829m264j4535j0640O469K4873R310l688N890O292J999K522
11585B9486q392o112j6227o203O689M316j116j46J9940K776r521j6952j4037r93
11571a6492o91O033J218L952K525k229j502o710K296o092J6284K9351l265j2976
11557A1702j0226l221Q150Q921K582j4493o731O106M59L628R96j1891P158j1827
11543h687j906m329o31J6396j565k59N182J1427L497r777p738J7730M317o246
11529A7411j0127o250L942K469Q333k023m273L289k498p303L984o62o733O906
11515F465N978j681p48J0366J5433J876j853p880q222p223M844P02P549o770o121
11500A2715J0556K546n804j9979N046J1840m547n179J110k807Q549J1765n56j9378
$$ plain form
11486 5877 -8822 -15882 -1757 13559 23847 31845 54092 61566 57913 47812 38469 25590 10470
11473 10470 19090 21291 26023 39746 36975 30146 22627 33945 37351 29720 17833 29465 35240
11460 35240 16460 7752 17615 29153 21837 7148 -2410 2795 19912 25165 27038 27920 28251 16660
11446 16660 -911 16360 16074 17642 6894 5713 11435 19432 19233 29962 44292 68194 83899
11433 83899 68605 49506 47653 29943 29265 23216 4196 9056 16987 28554 32499 24394 9476
11420 9476 2203 -5751 -912 10462 4734 29529 42072 25421 24029 5870 6661 16756 25137
11407 25137 29869 19039 15134 16448 18696 7102 1053 4302 5619 12384 2740 641 12395 20365
11393 20365 24654 25173 26397 28715 22323 12165 18810 31532 29280 33800 39745 30695 30735 27352 43860
$$ packed form
11486E877j4699p060J4125J5316J0288P998K2247P474l653j0101r343j2879j5120
11473A0470Q620K201M732J3723k771o829p519J1318L406p631j1887J1632N775
11460C5240j8780q708R863J1538p316j4689r558N205J7117N253J873Q82L31j1591
11446A6660j7571J7271k86J568j0748j181N722P997j99J0729J4330K3902J5705
11433H3899j5294j9099j853j7710o78o049j9020M860P931J1567L945q105j4918
11420I476p273p954M839J1374n728K4795J2543j6651j392j8159P91J0095Q381
11407B5137M732j0830l905J314K248j1594o049L249J317O765r644k099J1754P970
11393B0365M289N19J224K318o392j0158O645J2722k252M520N945r050M0l383J6508
$$ plain form
11378 43860 70242 63204 73689 65840 40077 29133 30623 48553 44035 35489 31081 30484 16146
11365 16146 13818 10484 11117 13941 27855 46842 41731 22663 5876 -434 -1731 17147 27631
11352 27631 25140 10510 3071 3061 -1510 -270 8905 529 -3310 -3218 -4108 3107 1918 6799 20636
11337 20636 22854 16197 12782 14852 22500 29790 31392 23799 25568 19638 18926 34192 43181 33878
11323 33878 39621 43031 34739 32461 26307 14916 13028 17557 5083 -1697 6200 14416 12256 15538
11309 15538 21251 30418 25574 16411 1712 -10230 10239 18106 15903 9827 -1038 3533 15696
11296 15696 9395 5888 6632 12840 8868 8725 13288 10429 12955 20298 15718 27165 26893 32877 30831
11281 30831 29493 38110 43669 28191 13618 4818 5661 2699 16309 22001 16041 17785 27356 27848
$$ packed form
11378D3860K6382p038J0485p849k5763j0944J490J7930m518q546m408n97j4338
11365A6146k328l334O33K824J3914J8987n111j9068j6787o310j297J8878J0484
11352B7631k491j4630p439j0m571J240R175q376l839R2q90P215j189M881J3837
11337B0636K218o657l415K070P648P290J602p593J769n930p12J5266Q989r303
11323C3878N743L410q292k278o154j1391j888M529j2474o780P897Q216k160L282
11309A5538N713R167m844r163j4699j1942K0469P867k203o076j0865M571J2163
11296A5696o301l507P44O208l972j43M563k859K526P343m580J1447k72N984k046
11281C0831j338Q617N559j5478j4573q800Q43k962J3610N692n960J744R571M92
$$ plain form
11267 27848 32150 25700 17756 36572 44679 39556 19842 11618 5756 4484 11225 25658 33479 44627
11253 44627 47740 35876 14502 249 1022 1853 5508 11202 15264 18294 19579 12873 11770 10570
11239 10570 19832 47466 57721 44493 35086 21990 10729 21997 36003 32249 22301 26420 34268
11226 34268 35397 25952 23911 25181 30804 23841 27187 21187 16779 19485 32698 29393 23014 14461
11212 14461 19677 23779 22721 16444 7365 13601 12392 2861 -3129 4022 12757 770 1788 11232
11198 11232 14199 2182 16800 37081 24234 7750 20027 21835 27222 49543 78138 94883
11186 94883 105818 111112 92929 64439 49862 51387 41275 33547 31743 18921 22737 15437 2693
11173 2693 17084 24416 17477 13898 5837 11099 15430 17872 40812 36805 33142 35842 31010 37916
$$ packed form
11267B7848M302o450p944J8816Q107n123j9714q224n862j272O741J4433P821J1148
11253D4627L113j1864k1374j4253P73Q31L655N694M062L030J285o706j103j200
11239A0570R262K7634J0255j3228r407j3096j1261J1268J4006l754r948M119P848
11226C4268J129r445k041J270N623o963L346o000m408K706J3213l305o379q553
11212A4461N216M102j058o277r079O236j209r531n990P151Q735j1987J018R444
11198A1232K967j2017J4618K0281j2847j6484J2277J808N387K2321K8595J6745
11186I4883J0935N294j8183k8490j4577J525j0112p728j804j2822L816p300j2744
11173B693J4391P332o939l579q061N262M331K442K2940m007l663K700m832O906
$$ plain form
11159 37916 56396 52437 53055 41348 33771 28568 22232 20659 13338 13488 12270 14871 476 -11627
11145 -11627 -4908 5482 24600 37067 20402 18845 32747 36427 25229 20854 27258 37277 33072
11132 33072 25904 21705 30124 25096 27868 20708 7185 9346 7368 8618 17544 30517 19635 17971
11118 17971 23409 24963 28971 22978 18510 15739 10029 15487 11667 11355 27619 37154 38093 20413
11104 20413 15375 18573 29760 26105 17441 8004 13864 23826 24683 16744 6267 7901 4447 -11613
11090 -11613 -219 12257 23377 32150 17912 15674 18697 16049 8921 9356 14318 20132 25459 18109
11076 18109 13369 11897 19264 24280 23940 13675 562 5213 11943 6823 2638 4059 15586 28684
11062 28684 45447 50225 36779 17912 4814 5969 11317 5255 4834 14343 16468 10570 10343 6476
$$ packed form
11159C7916J8480l959O18j1707p577n203o336j573p321J50j218K601j4395j2103
11145a1627O719J0390J9118J2467j6665j557J3902L680j1198m375O404J0019m205
11132C3072p168m199Q419n028K772p160j3523K161j978J250Q926J2973j0882j664
11118A7971N438J554M008n993m468k771n710N458l820l12J6264R535R39j7680
11104B0413n038L198J1187l655q664r437N860R962Q57p939j0477J634l454j6060
11090a1613J1394J2476J1120Q773j4238k238L023k648p128M35M962N814N327p350
11076A8109m740j472P367N016l40j0265j3113M651O730n120m185J421J1527J3098
11062B8684J6763M778j3446j8867j3098J155N348o062m21R509K125n898k27l867
$$ plain form
11048 6476 9351 17346 23678 23214 25414 15506 15883 21181 22953 20526 14512 31126 33896 18310 985
11033 985 -2169 -817 4540 20320 28569 26980 10556 6257 -860 7722 15973 3922 10547 11870
11019 11870 18995 17159 14201 12876 12630 9325 14435 27242 13033 2311 4809 7307 560 -2149
11005 -2149 -2732 2394 48 9183 15382 18230 12208 19930 26747 20073 19976 30556 29667 25027 25890 15528
10989 15528 2930 7632 -3549 -5058 -543 7441 14785 15163 19280 13889 9676 3849 12460 22768
10975 22768 24768 15236 11008 -569 -974 -550 2656 -3294 8412 25193 26778 19967 13803 13463
10961 13463 4350 654 10981 16298 9144 18611 14671 7490 17465 21063 6444 4744 11630 4750
10947 4750 14326 26976 28944 24979 16021 6798 2592 14522 31204 27562 26268 9881 20282
$$ packed form
11048F476K875P995O332m64K200r908L77N298J772k427o014J6614K770j5586j7325
11033I85l154J352N357J5780Q249j589j6424m299p117Q582Q251j2051O625J323
11019A1870P125j836k958j325k46l305N110J2807j4209j0722K498K498o747k709
11005b149n83N126k346R135O199K848o022P722O817o674r7J0580q89m640Q63j0362
10989A5528j2598M702j1181j509M515P984P344L78M117n391m213n827Q611J0308
10975B2768K000r532m228j1577m05M24L206n950J1706J6781J585o811o164l40
10961A3463r113l696J0327N317p154R467l940p181R975L598j4619j700O886o880
10947D750R576J2650J968l965q958r223m206J1930J6682l642j294j6387J0401
$$ plain form
10934 20282 29161 22317 17980 25323 6723 2952 20907 25060 19490 16046 16314 12255 11393 7040
10920 7040 6247 3095 -10850 3242 5629 -655 6217 14061 16689 9123 16557 40085 35855 29689
10906 29689 32182 32873 30703 35915 41449 29184 22110 31299 30564 23785 5639 -2494 -13784 -8180
10892 -8180 13916 17556 26509 27720 25529 24773 18421 7981 10956 -3189 -5840 1787 4 7601
10878 7601 10948 22524 23549 23656 21866 31735 37457 31303 19633 18723 18818 17222 27258 39972 38281
10863 38281 27415 8278 4861 11105 10844 14156 10785 18330 27473 23206 26131 39910 37111 23861
10849 23861 31815 36772 29722 10077 13975 21509 28932 37323 36793 40751 35022 26296 26056 29742 33969
10834 33969 30007 24342 13810 1170 11842 34445 47657 43171 27874 30896 22392 18391 18294
$$ packed form
10934B0282Q879o844m337P343j8600l771J7955M153n570l444K68m059q62m353
10920G040p93l152j3945J4092K387o284O872P844K628p566P434K3528m230o166
10906B9689K493O91k170N212N534j2265p074R189p35o779j8146q133j1290N604
10892h180K2096L640Q953J211k191p56o352j0440K975j4145k651P627j783P597
10878G601L347J1576J025J07j790R869N722o154j1670r10R5j596J0036J2714j691
10863C8281j0866j9137l417O244k61L312l371P545R143m267K925J3779k799j3250
10849B3861P954M957p050j9645L898P534P423Q391n30L958n729q726k40L686M227
10834C3969l962n665j0532j2640J0672K2603J3212m486j5297L022q504m001r7
$$ plain form
10821 18294 21375 30401 36675 38542 33121 31186 40596 44138 36197 40391 49756 62568 66917 63451
10807 63451 58372 55572 49536 45664 50419 50745 43522 43506 36429 32098 28147 31260 44415 45687 47172
10792 47172 37496 40937 45525 47894 44610 31924 23535 31489 37407 35157 31666 15478 15705 17383
10778 17383 26690 28086 25075 31784 42703 42896 42628 48097 47522 30265 26930 33968 39317 32121 43983
10763 43983 46166 28055 16500 22087 30667 27129 21116 13466 18205 28378 30706 28557 34051 49092
10749 49092 46533 22264 16577 20942 17741 8888 21450 26734 24112 32115 23718 27773 37477 51477
10735 51477 49596 42350 24656 16419 16720 29885 32228 16774 24838 31542 31130 23790 26965 22125
10721 22125 29263 35739 34295 38375 36667 35933 53359 53930 49895 40593 37195 43926 49971 35077
$$ packed form
10821A8294L081R026O274J867n421j935R410L542p941M194R365J2812M349l466
10807F3451n079k800o036l872M755L26p223j6p077m331l951L113J3155J272J485
10792D7172r676L441M588K369l284j2686q389P954N918k250l491j6188K27J678
10778A7383R307J396l011O709J0919J93k68N469n75j7257l335P038N349p196J1862
10763D3983K183j8111j1555N587Q580l538o013p650M739J0173K328k149N494J5041
10749D9092k559k4269n687M365l201q853J2562N284k622Q003q397M055R704J4000
10735E1477j881p246j7694q237L01J3165K343j5454Q064O704m12p340L175m840
10721B2125P138O476j444M080j708p34J7426N71m035r302l398O731O045j4894
$$ plain form
10707 35077 41160 49494 49499 35185 33858 37844 47885 45322 40901 44708 49319 54520 57095 58085 69911
10692 69911 81894 69168 46421 33093 33415 36855 31865 41006 61547 59496 34449 18806 20344
10679 20344 27694 23845 17234 24729 35343 34700 30873 29608 35110 38363 34984 23646 28665 28543
10665 28543 35228 47086 47092 36136 32989 34246 32346 26702 40132 42899 40167 45444 46837 40334
10651 40334 38761 45232 66750 63008 46789 37602 32834 28386 20095 23660 34053 39929 40834 28282
10637 28282 3782 2978 17406 22093 29730 22192 22504 20112 20744 15575 10583 4002 9705 20928
10623 20928 17471 8451 1463 17214 24126 32744 31239 14556 -5618 1068 17253 14015 22700
10610 22700 40618 58460 66962 55858 53808 50421 41038 40150 38538 47607 59505 63352 59945 61031
$$ packed form
10707C5077O083Q334Nj4314j327L986J0041k563m421L807M611N201K575R90J1826
10692F9911J1983j2726k2747j3328L22L440m990R141K0541k051k5047j5643J538
10679B0344P350l849o611P495J0614o43l827j265N502L253l379j1338N019j22
10665B8543O685J1858Oj0956l147J257j900n644J3430K767k732N277J393o503
10651D0334j573O471K1518l742j6219r187m768m448q291L565J0393N876R05j2552
10637B8282k4500q04J4428M687P637p538L12k392O32n169m992o581N703J1223
10623B0928l457r020o988J5751O912Q618j505j6683k0174O686J6185l238Q685
10610B2700J7918J7842Q502j1104k050l387r383q88j612R069J1898L847l407J086
$$ plain form
10596 61031 47085 29252 17969 20611 28349 46973 56476 59947 64201 66267 73358 61092 55260
10583 55260 52900 47635 49875 52942 45225 38432 40212 56042 56348 49635 47407 52142 50415 46877
10569 46877 38124 31124 42904 47737 59842 52522 52033 59633 67558 56319 50438 33962 26147 21723
10555 21723 14062 27850 34195 32090 41529 56922 67035 51887 42250 40377 38635 47363 65616
10542 65616 63005 68924 74896 73376 77695 85765 73798 58383 64160 75891 63198 58085 54177
10529 54177 62549 69853 60774 57325 39919 38749 34826 36561 40706 35436 34297 45812 49328 57872
10515 57872 64258 67079 63671 58974 57795 57821 54230 59144 52193 49436 35667 39703 59512 69086
10501 69086 79317 80333 70208 78667 88420 82740 71588 85403 85725 74462 75829 75388 86506
$$ packed form
10596F1031j3946j7833j1283K642P738J8624R503L471M254K066P091j2266n832
10583E5260k360n265K240L067p717o793J780J5830L06o713k228M735j727l538
10569D6877q753p000J1780M833J2105p320m89P600P925j1239n881j6476p815m424
10555B1723p661J3788O345k105R439J5393J0113j5148r637j873j742Q728J8253
10542F5616k611N919N972j520M319Q070j1967j5415N777J1731j2693n113l908
10529E4177Q372P304r079l449j7406j170l923J735M145n270j139J1515L516Q544
10515E7872O386K821l408m697j179K6l591M914o951k757j3769M036J9809R574
10501F9086J0231J016j0125Q459R753n680j1152J3815L22j1263J367m41J1118
$$ plain form
10488 86506 80231 72525 72382 65917 67964 80244 84821 67639 73070 82528 62733 62816 75961 95555
10474 95555 102847 96742 89767 93164 97950 95347 98369 100398 101485 98124 105504 124460 123301 121100
10460 121100 137183 146122 160196 165855 171307 181934 199662 237689 276907 337057 426821 556586
10448 556586 744634 1014897 1378145 1843130 2188588 2163276 1784971 1318083 957774 710918
10438 710918 554472 450732 370813 314992 262159 230890 208498 190366 184701 177796 167470
10427 167470 162226 160951 173998 186928 202739 256269 309875 390066 486683 515778 450272 345686
10415 345686 257926 209045 186576 176798 168752 155534 153676 152942 123817 113206 94359 88240 85717
10402 85717 91763 89169 84068 74925 87640 99647 97625 77659 86934 92490 85220 97416 99057
$$ packed form
10488H6506o275p706j43o465K047J2280M577j7182N431R458j9795Q3J3145J9594
10474I5555P292o105o975L397M786k603L022K029J087l361P380J8956j159k201
10460A21100J6083Q939J4074N659N452J0627J7728L8027L9218O0150Q9764J29765
10448E56586J88048K70263L63248M64985L45458k5312l78305m66888l60309k46856
10438G10918j56446j03740p9919n5821n2833l1269k2392j8132n665o905j0326
10427A67470n244j275J3047J2930J5811N3530N3606Q0191R6617K9095o5506j04586
10415C45686q7760m8881k2469r778q046j3218j858p34k9125j0611j8847o119k523
10402H5717O046k594n101r143J2715J2007k022j9966R275N556p270J2196J641
$$ plain form
10389 99057 113010 110165 105300 104075 106446 109917 101792 107608 98649 83518 86544 85322 101158 108520
10375 108520 97232 87956 80831 77520 82753 101832 114602 104770 102018 102650 115182 118802 118570 123872
10361 123872 131837 127869 113019 104074 106103 110526 117415 119158 124174 115819 106996 85716 74194
10348 74194 72292 67865 70625 55016 43207 46405 49551 56660 61369 73757 82289 72838 55534
10335 55534 59611 61833 60077 73864 78625 85778 100153 87601 92991 118570 166096 203398 239964
10322 239964 279466 272249 226533 179188 160043 154087 161518 149874 133266 114681 110899 128756
10310 128756 134667 142694 141532 138744 150445 158149 162307 156524 163972 175265 177907 191505 209706
10297 209706 232299 234813 226225 218241 225788 240772 268214 267662 261880 278900 301326 313592 333383
$$ packed form
10389I9057J3953k845m865j225K371L471q125N816q959j5131L026j222J5836P362
10375A08520j1288r276p125l311N233J9079J2770r832k752O32J2532L620k32N302
10361A23872P965l968j4850q945K029M423O889J743N016q355q823k1280j1522
10348G4194j902m427K760j5609j1809L198L146P109M709J2388Q532r451j7304
10335E5534M077K222j756J3787M761P153J4375j2552N390K5579M7526L7302L6566
10322B39964L9502p217m5716m7345j9145n956P431j1644j6608j8585l782J7857
10310A28756N911Q027j162k788J1701P704M158n783P448J1293K642J3598J8201
10297B09706K2593K514q588p984P547J4984K7442n52n782J7020K2426J2266J9791
$$ plain form
10284 333383 373224 452986 564039 724478 881268 953931 873466 693936 512654 390335
10274 390335 316262 271323 246759 208125 175387 160633 163817 162184 160344 172210 173048 163517 171488
10261 171488 167831 168656 182408 187974 183717 165633 170735 168078 167514 184255 200413 185242 184299 178523
10247 178523 165596 152837 152004 161135 158059 155025 145196 124254 106267 115308 123347 143841 144616
10234 144616 110986 87945 89260 108493 124036 146377 140511 133676 127264 136479 143517 143413 135448
10221 135448 117999 104697 95708 103963 116739 118511 132368 148560 155068 149346 159295 162966 167854
10208 167854 168805 163427 155039 149484 148544 142108 136574 151835 161410 141371 128643 105566 95048
10195 95048 109621 123288 129427 165183 216872 232985 238231 228777 221851 228855 241262 252460 262593
$$ packed form
10284C33383L9841P9762J11053J60439J56790P2663q0465j79530j81282j22319
10274C90335p4073m4939k4564l8634l2738j4754L184j633j840J1866Q38r531P971
10261A71488l657Q25J3752N566m257j8084N102k657n64J6741J6158j5171r43n776
10247A78523j2927j2759q33R131l076l034r829k0942j7987R041Q039K0494P75
10234A44616l3630k3041J315J9233J5543K2341n866o835o412R215P038j04p965
10221A35448j7449j3302q989Q255J2776J772J3857J6192O508n722R949L671M888
10208A67854R51n378q388n555r40o436n534J5261R575k0039j2728k3077j0518
10195I5048J4573J3667O139L5756N1689J6113N246r454o926P004J2407J1198J0133
$$ plain form
10182 262593 273747 280256 294844 312991 355146 409984 470264 525112 549082 567624 619367 650445
10170 650445 652339 645218 649109 647687 642882 637843 612339 556487 515960 492145 457561 428967 401524
10157 401524 368953 348287 343376 320941 288767 284172 280987 271294 285674 306286 304624 308609 318211
10144 318211 322442 329834 328811 319470 337293 350992 360892 385671 398853 405938 407175 402413 407578
10131 407578 415307 423872 442915 479971 519705 541310 538037 527684 503320 494645 499195 514403
10119 514403 510650 500556 528367 567714 585486 592778 593367 609226 619003 631470 624330 628907 628368
10106 628368 643854 658087 668343 682796 706713 735370 778593 820129 858741 885013 915027
10095 915027 939452 973317 1023575 1096380 1140767 1166429 1189610 1197986 1206283 1246956 1302678 1383395
$$ packed form
10182B62593J1154O509J4588J8147M2155N4838O0280N4848K3970J8542N1743L1078
10170F50445J894p121L891j422m805n039k5504n5852m0527k3815l4584k8594k7443
10157D01524l2571k0666m911k2435l2174m595l185r693J4380K0612j662L985R602
10144C18211M231P392j023r341J7823J3699R900K4779J3182P085J237m762N165
10131D07578P729Q565J9043L7056L9734K1605l273j0353k4364q675M550J5208
10119E14403l753j0094K7811L9347J7772P292N89J5859R777J2467p140M577n39
10106F28368J5486J4233J0256J4453K3917K8657M3223M1536L8612K6272L0014
10095I15027K4425L3865N0258P2805M4387K5662K3181Q376Q297M0673N5722Q0717
$$ plain form
10083 1383395 1487166 1588658 1667172 1742881 1803805 1848768 1904588 1976785 2085878 2222102
10073 2222102 2373767 2555008 2747602 2933574 3140580 3380063 3660313 4006923 4453341
10064 4453341 5068502 5869470 6796489 7625477 8125295 8393825 8758687 9317514 10099300
10055 10099300 11161468 12574766 14376658 16616675 19428351 23044282 27887790 34478877
10047 34478877 43519197 55972740 73554870 99129431 137019594 192749298 269491828
10040 269491828 353340511 397240084 362410468 278762241 198763980 140440492 101504340
10033 101504340 75956512 58742907 46590222 37612593 30794147 25531213 21422719
10026 21422719 18254664 15817786 13881495 12305559 11016271 9973787 9189936 8658958
$$ packed form
10083A383395J03771J01492P8514P5709O0924M4963N5820P2197J09093J36224
10073B222102J51665J81241J92594J85972K07006K39483K80250L46610M46418
10064D453341O15161Q00968R27019Q28988M99818K68530L64862N58827P81786
10055A0099300J062168J413298J801892K240017K811676L615931M843508O591087
10047C4478877R040320J2453543J7582130K5574561L7890163N5729704P6742530
10040B69491828Q3848683M3899573l4829616q3648227p9998261n8323488l8936152
10033A01504340k5547828j7213605j2152685q977629o818446n262934m108494
10026B1422719l168055k436878j936291j575936j289288j042484p83851n30978
$$ plain form
10018 8658958 8380735 8289849 8195103 7770995 6963664 6123983 5412597 4829755 4381207 4000376
10008 4000376 3652514 3375773 3175513 3026891 2908035 2800207 2663912 2496908 2316781
9999 2316781 2136160 1998825 1901663 1832079 1779007 1725286 1661789 1584411 1500227 1411031 1326678
9988 1326678 1242001 1178880 1144307 1129950 1110659 1077252 1037994 1006710 961724 939346 939621 929067
9976 929067 928626 922620 907247 895363 867557 838698 816538 778139 740029 694685 655225 634346
9964 634346 621771 617032 611375 585518 565216 562441 571949 565698 550979 542060 533498 527087 527834 530770
9950 530770 528903 522790 512311 487070 461680 445073 432197 421281 412105 411276 428855 434083 430864
9937 430864 421405 407404 378780 379362 382735 387411 387195 377679 384955 387240 394514 392784 375965 364316
$$ packed form
10018H658958k78223r0886r4746m24108q07331q39681p11386n82842m48548l80831
10008D000376l47862k76741k00260j48622j18856j07828j36295j67004j80127
9999B316781j80621j37335r7162o9584n3072n3721o3497p7378q4184q9196q4353
9988A326678q4677o3121l4573j4357j9291l3407l9258l1284m4986k2378K75j0554
9976I29067m41o006j5373j1884k7806k8859k2160l8399l8110m5344l9460k0879
9964F34346j2575m739n657k5857k0302k775R508o251j4719q919q562o411P47K936
9950E30770j867o113j0479k5241k5390j6607j2876j0916r176q29J7579N228l219
9937D30864r459j4001k8624N82L373M676k16r516P276K285P274j730j6819j1649
$$ plain form
9923 364316 346105 331686 328072 328073 320879 321759 334497 326189 282521 262842 252830 272977 324028
9910 324028 372493 409437 433763 427898 404586 370938 355068 341729 309391 287193 282357 263301
9898 263301 253633 254208 242189 246617 248047 232517 231636 227917 225875 221052 226216 241759 271878 306129
9884 306129 344321 342482 312193 302963 283420 266300 264447 259265 244547 235743 240266 255979 256450
9871 256450 249090 205803 177552 171928 184017 189253 194725 189815 211408 238918 265191 265890 259675
9858 259675 254105 235631 213238 215145 234855 240138 241773 236610 212244 194427 195699 218094 250424
9845 250424 264366 231828 198152 185046 202664 227897 231608 239852 238176 226708 228071 265286
9833 265286 336116 374221 405384 403981 381189 378152 375182 371734 370595 367483 351621 344691 347918
$$ packed form
9923C64316j8211j4419l614Jp194Q80J2738q308m3668j9679j0012K0147N1051
9910C24028M8465L6944K4326n865k3312l3648j5870j3339l2338k2198m836j9056
9898B63301r668N75j2019M428J430j5530q81l719k042m823N164J5543L0119L4251
9884C06129L8192j839l0289r230j9543j7120j853n182j4718q804M523J5713M71
9871B56450p360m3287k8251n624J2089N236N472m910K1593K7510K6273O99o215
9858B59675n570j8474k2393J907J9710N283J635n163k4366j7817J272K2395L2330
9845B50424J3942l2538l3676j3106J7618K5233L711Q244j676j1468J363L7215
9833B65286P0830L8105L1163j403k2792l037k970l448j139l112j5862o930L227
$$ plain form
9820 347918 355609 355714 337652 310894 284386 262644 251667 248595 262055 258709 257593 255225 233421
9807 233421 206110 182918 185698 190105 212871 214526 213443 207568 199829 186499 186317 181315 184011 173363
9793 173363 164890 151900 130215 132879 131891 155920 183765 194633 196302 205705 195532 188007 185581
9780 185581 189349 203605 204425 196696 190693 195006 197966 218382 227536 222666 208073 209839 199275 193890
9766 193890 220809 240081 232603 219821 196952 165950 161125 176845 181263 194018 200308 196049 187587
9753 187587 166286 161553 183740 182630 173626 165600 160915 153338 174246 192529 195328 187773 187916 181422
9739 181422 181305 184771 194615 207379 213450 226430 227635 216512 218215 206955 188411 171546 161925
9726 161925 151159 135026 130607 146557 171720 180001 175928 169673 155155 144973 137647 127392 117450
$$ packed form
9820C47918P691J05j8062k6758k6508k1742j0977l072J3460l346j116k368k1804
9807B33421k7311k3192K780M407K2766J655j083n875p739j3330j82n002K696j0648
9793A73363q473j2990k1685K664r88K4029K7845J0868J669R403j0173p525k426
9780A85581L768J4256Q20p729o003M313K960K0416R154m870j4593J766j0564n385
9766A93890K6919J9272p478j2782k2869l1002m825J5720M418J2755O290m259q462
9753A87587k1301m733K2187j110r004q026m685p577K0908J8283K799p555J43o494
9739A81422j17L466R844J2764O071J2980J205j1123J703j1260j8544j6865r621
9726A61925j0766j6133m419J5950K5163Q281m073o255j4518j0182p326j0255r942
$$ plain form
9713 117450 113984 104213 94956 100173 118435 126560 139127 137154 146051 162554 165614 163027 174029
9700 174029 206059 216900 225763 233047 216999 187406 168617 160467 151818 149053 162229 164960 161568
9687 161568 151109 161151 168514 159821 150424 152144 148626 146289 149024 173170 170998 185019 185020 166147
9673 166147 169972 163551 154508 162875 160688 154334 151314 155519 155238 149680 160928 164140 157598 155480
9659 155480 162724 168930 166402 157647 152387 158012 175766 191407 191501 179347 183615 185246 195994 211154
9645 211154 216437 227291 227454 238041 257399 272164 298904 340476 376005 436133 533582 664503
9633 664503 857253 1145756 1534855 1988444 2290225 2201664 1788707 1324249 972727 759101
9623 759101 609556 506751 435982 377606 331831 298975 271195 255788 241686 215543 211440
$$ packed form
9713A17450l466r771r257N217J8262Q125J2567j973Q897J6503L060k587J1002
9700A74029L2030J0841Q863P284j6048k9593j8789q150q649k765J3176K731l392
9687A61568j0459J0042P363q693r397J720l518k337K735K4146k172J4021Jj8873
9673A66147L825o421r043Q367k187o354l020M205k81n558J1248L212o542k118
9659A55480P244O206k528q755n260N625J7754J5641R4j2154M268J631J0748J5160
9645B11154N283J0854J63J0587J9358J4765K6740M1572L5529O0128R7449J30921
9633F64503J92750K88503L89099M53589L01781q8561m12957m64458l51522k13626
9623G59101j49545j02805p0769n8376m5775l2856k7780j5407j4102k6143m103
$$ plain form
9612 211440 211913 222082 223197 222090 209078 201201 208702 214617 212667 209812 212830 218342 200734 188153
9598 188153 189281 189976 175974 165919 155573 146351 140035 150575 160370 167538 168441 162280 157195 144711
9584 144711 127623 126879 144321 161843 174519 176013 183710 190116 184473 176880 187690 183876 192323
9571 192323 195505 178871 171101 166840 148909 154041 162456 165687 161354 167485 179627 179930 172605 179768
9557 179768 192105 199895 200860 203410 201123 197749 195517 188086 186554 179807 177266 170243 173790 189473
9543 189473 194196 189922 189433 187571 187858 196074 196260 174981 181318 189176 190123 202104 213023 205045 204629
9528 204629 196940 192059 198748 190715 188578 191334 197202 196688 192712 184246 189325 206998 219927 207571
9514 207571 212761 205711 180469 169714 174717 185495 191987 178539 184054 184515 192280 190402 183778 186120
$$ packed form
9612B11440M73J0169J115j107j3012p877P501N915j950k855L018N512j7608j2581
9598A88153J128O95j4002j0055j0346r222o316J0540R795P168R03o161n085j2484
9584A44711j7088p44J7442J7522J2676J494P697O406n643p593J0810l814Q447
9571A92323L182j6634p770m261j7931N132Q415L231m333O131J2142L03p325P163
9557A79768J2337P790R65K550k287l374k232p431j532o747k541p023L547J5683
9543A89473M723m274m89j862K87Q216J86k1279O337P858R47J1981J0919p978m16
9528B04629p689m881O689q033k137K756N868n14l976q466N079J7673J2929j2356
9514B07571N190p050k5242j0755N003J0778O492j3448N515M61P765j878o624K342
$$ plain form
9500 186120 196856 211714 216413 229086 231832 229032 235056 238651 245843 248219 250824 258595 236687
9487 236687 224293 210257 205536 197736 189343 193195 182235 192811 194582 187530 188305 196533 207410
9474 207410 206537 203509 204009 203930 202297 204846 217487 223253 220867 217956 218217 228382 223881 230068 242664
9459 242664 245305 239443 243184 243313 256809 265837 272251 277615 280346 272321 268522 247994 240262 235963
9445 235963 235944 243176 247578 238739 240810 225708 223805 229096 229216 218806 215871 240679 236366 230827
9431 230827 225374 217391 212356 229549 234806 230945 239865 260629 268272 273453 283225 289267 291521 286956
9417 286956 284464 279466 283394 290971 300695 290958 279849 277155 268740 255280 245703 243286 228662 225702
9403 225702 244417 259519 255069 245971 239413 243748 252143 262411 243313 218390 222316 236635 234550
$$ packed form
9500A86120J0736J4858M699J2673K746k800O024L595P192K376K605P771k1908
9487B36687j2394j4036m721p800q393L852j0960J0576J771p052P75Q228J0877
9474B07410q73l028N00p9j633K549J2641N766k386k911K61J0165m501O187J2596
9459B42664K641n862L741J29J3496R028O414N364K731q025l799k0528p732m299
9445B35963j9P232M402q839K071j5102j903N291J20j0410k935K4808m313n539
9431B30827n453p983n035J7193N257l861Q920K0764P643N181R772O042K254m565
9417B86956k492m998L928P577R724r737j1109k694q415j3460r577k417j4624k960
9403B25702J8715J5102m450r098o558M335Q395J0268j9098k4923L926J4319k085
$$ plain form
9390 234550 242596 262668 262122 255239 268520 283653 298944 307033 299365 305208 302327 283465 273082
9377 273082 266486 253562 258131 268217 273676 272748 292087 291477 282772 279588 282697 286919 292938 305129
9363 305129 320332 317011 313678 318561 309173 301698 290806 296016 308939 308994 309169 317958 324380 322450
9349 322450 313173 318788 328108 349433 332415 313911 326359 331831 331300 327245 330408 338244 361359
9336 361359 368415 379512 393487 401049 401026 386815 381490 372777 358258 358593 365778 362280 348876 341172
9322 341172 359872 371973 362482 354286 358673 352379 356519 358273 360710 358296 366144 377085 388964
9309 388964 386821 381504 383893 393593 400023 429606 467040 497089 524899 566354 629071 717829 816690
9296 816690 909110 1033398 1159444 1230065 1200642 1102006 987866 875586 794930 747198 730731
$$ packed form
9390B34550Q046K0072n46o883J3281J5133J5291Q089p668N843k881j8862j0383
9377B73082o596j2924M569J0086N459r28J9339o10q705l184L109M222O019J2191
9363C05129J5203l321l333M883r388p475j0892N210J2923N5J75Q789O422j930
9349C22450r277N615R320K1325j7018j8504J2448N472n31m055L163P836K3115
9336C61359P056J1097J3975P562k3j4211n325q713j4519L35P185l498j3404p704
9322C41172J8700J2101r491q196M387o294M140J754K437k414P848J0941J1879
9309C88964k143n317K389R700O430K9583L7434L0049K7810M1455O2717Q8758R8861
9296H16690R2420J24288J26046P0621k9423r8636j14140j12280q0656m7732j6467
$$ plain form
9285 730731 728883 746228 790002 865487 967102 1060569 1146989 1247951 1308826 1312730 1290732 1256495
9273 1256495 1216740 1191946 1164099 1120025 1079152 1055814 1049119 1056064 1077310 1121539 1217729 1337870
9261 1337870 1519733 1770893 2059522 2341734 2530001 2542938 2377759 2099339 1803446 1549454
9251 1549454 1353325 1220561 1142364 1091793 1078826 1058570 1044650 1053954 1077173 1124064 1167430
9240 1167430 1206712 1239409 1274844 1299086 1282646 1230664 1142598 1039353 944542 872336 822681
9229 822681 785572 775510 793742 818939 869613 948968 1056684 1171054 1270500 1306636 1240284
9218 1240284 1125245 1011698 901305 794579 727521 675745 634597 591039 566297 562847 551863
9207 551863 539281 538661 539680 527130 521713 518777 520515 525740 514140 516127 525934 522989 521575 514671
$$ packed form
9285G30731j848J7345M3774P5485J01615R3467Q6420J00962O0875L904k1998l4237
9273A256495l9755k4794k7847m4074m0873k3338o695O945K1246M4229R6190J20141
9261A337870J81863K51160K88629K82212J88267J2937j65179k78420k95893k53992
9251A549454j96129j32764p8197n0571j2967k0256j3920R304K3219M6891M3366
9240A167430L9282L2697L5435K4242j6440n1982q8066j03245r4811p2206m9655
9229H22681l7109j0062J8232K5197N0674P9355J07716J14370R9446L6136o6352
9218A240284j15039j13547j10393j06726o7058n1776m1148m3558k4742l450j0984
9207E51863j2582o20J019j2550n417k936J738N225j1600J987R807k945j414o904
$$ plain form
9193 514671 521017 517879 510299 518798 525906 544909 543740 530197 529689 552568 565572 580207 591109
9180 591109 591646 579191 572296 568430 573479 584387 574260 571735 566085 556222 543558 541723 539255 538716
9166 538716 558270 551643 560832 568156 564840 548832 563244 565423 572329 581095 585045 604323 596229
9153 596229 585535 583146 590407 608265 618013 627825 620320 623183 630820 611373 602111 602868 615631 619945
9139 619945 619143 616383 625572 627740 631212 624961 612439 593164 610884 630855 635881 637799 638173 640795
9125 640795 652061 668144 674176 679192 678669 664050 659196 656875 673437 673908 665680 675431 684903 677826
9111 677826 680156 693960 685122 677188 694483 700036 699874 690554 693781 707157 714915 703291 705647 721249
9097 721249 723095 728337 721840 726996 736801 734437 725895 735016 739191 737380 733724 739446 744539 746375
$$ packed form
9193E14671O346l138p580Q499P108J9003j169j3543n08K2879J3004J4635J0902
9180E91109N37j2455o895l866N049J0908j0127k525n650r863j2664j835k468n39
9166E38716J9554o627R189P324l316j6008J4412K179O906Q766L950J9278q094
9153E96229j0694k389P261J7858R748R812p505K863P637j9447r262P57J2763M314
9139F19945q02k760R189K168L472o251j2522j9275J7720J9971N026J918L74K622
9125F40795J1266J6083O032N016n23j4619m854k321J6562M71q228R751R472p077
9111F77826K330J3804q838p934J7295N553j62r320L227J3376P758j1624K356J5602
9097G21249J846N242o497N156R805k364q542R121M175j811l656N722N093J836
$$ plain form
9083 746375 753136 751984 759623 770549 778433 784021 787244 785675 797431 810761 809487 819926 840510
9070 840510 844056 837614 841804 860656 864857 865588 854998 849837 865366 855323 861079 872908 879558
9057 879558 893720 895752 890341 892137 902055 913419 908833 928366 941649 949505 954206 936070 922341
9044 922341 927434 929189 935901 958252 973379 976936 978708 956752 953651 966601 972157 983175 1000952
9031 1000952 1010818 1024084 1029472 1031181 1031209 1027918 1032572 1043986 1054071 1071915 1085496 1100367 1100015
9018 1100015 1104955 1106700 1085886 1086055 1098242 1115989 1127373 1134217 1147208 1150824 1159040 1162196 1169946
9005 1169946 1167161 1171878 1186171 1185224 1189237 1202190 1203968 1213680 1232438 1244024 1244755 1245157 1250328 1260988
8991 1260988 1277458 1300086 1326039 1332605 1329643 1333950 1330307 1342504 1339044 1356578 1364145 1361965 1369021
$$ packed form
9083G46375O761j152P639J0926P884N588L223j569J1756J3330j274J0439K0584
9070H40510L546o442M190J8852M201P31j0590n161J5529j0043N756J1829O650
9057H79558J4162K032n411J796R918J1364m586J9533J3283P856M701j8136j3729
9044I22341N093J755O712K2351J5127L557J772k1956l101J2950N556J1018J7777
9031A000952R866J3266N388J709K8l291M654J1414J0085J7844J3581J4871l52
9018A100015M940J745k0814J69J2187J7747J1384O844J2991L616Q216L156P750
9005A169946k785M717J4293r47M013J2953J778R712J8758J1586P31M02N171J0660
8991A260988J6470K2628K5953O566k962M307l643J2197l460J7534P567k180P056
$$ plain form
8978 1369021 1369643 1369486 1379143 1387847 1405259 1408807 1406455 1421463 1445363 1466946 1473209 1476011 1481107 1504035
8964 1504035 1510446 1511371 1520450 1527878 1536944 1557956 1574507 1588750 1599161 1597858 1611077 1630612 1643451
8951 1643451 1664693 1686172 1685380 1693783 1719064 1724797 1734258 1741955 1737891 1732540 1747933 1766583 1766766
8938 1766766 1794547 1815747 1822898 1833384 1848192 1857858 1863210 1863537 1876076 1886771 1907593 1935278
8926 1935278 1958388 1967027 1974531 1990379 2000910 2011235 2033643 2059236 2074274 2068839 2078510 2101640
8914 2101640 2122952 2130019 2142280 2163184 2178268 2188646 2210293 2228851 2238615 2257142 2265016 2280672
8902 2280672 2305188 2325865 2347368 2362744 2374559 2385734 2410783 2431051 2460767 2480221 2502645
8891 2502645 2520288 2532401 2565893 2590332 2606125 2618633 2633316 2645744 2663288 2690501 2706530
$$ packed form
8978A369021O22j57R657Q704J7412L548k352J5008K3900K1583O263K802N096K2928
8964A504035O411R25R079P428R066K1012J6551J4243J0411j303J3219J9535J2839
8951A643451K1242K1479p92Q403K5281N733R461P697m064n351J5393J8650J83
8938A766766K7781K1200P151J0486J4808R666N352L27J2539J0695K0822K7685
8926A935278K3110Q639P504J5848J0531J0325K2408K5593J5038n435R671K3130
8914B101640K1312P067J2261K0904J5084J0378K1647J8558R764J8527P874J5656
8902B280672K4516K0677K1503J5376J1815J1175K5049K0268K9716J9454K2424
8891B502645J7643J2113L3492K4439J5793J2508J4683J2428J7544K7213J6029
$$ plain form
8880 2706530 2724725 2754948 2775853 2796935 2827540 2847938 2861915 2884910 2911308 2922405 2959745
8869 2959745 2995586 3021598 3046352 3065749 3100045 3129279 3154926 3188423 3240916 3294489 3334237
8858 3334237 3371802 3414958 3476440 3530148 3581751 3630727 3680687 3756912 3828896 3929761 4063158
8847 4063158 4248011 4498937 4866331 5376797 6059785 6805533 7263434 7075949 6423201 5743253
8837 5743253 5224650 4889574 4682087 4543706 4438037 4361464 4340867 4342153 4336158 4338824 4355245
8826 4355245 4376508 4403984 4419299 4416872 4429190 4456779 4490574 4514643 4546076 4563074 4579796 4622705
8814 4622705 4666637 4679432 4703529 4748339 4789842 4822039 4847439 4882088 4931712 4981023 5022697
8803 5022697 5043535 5085515 5115794 5138404 5175765 5198138 5227308 5272917 5321434 5377840 5431824
$$ packed form
8880B706530J8195L0223K0905K1082L0605K0398J3977K2995K6398J1097L7340
8869B959745L5841K6012K4754J9397L4296K9234K5647L3497N2493N3573L9748
8858C334237L7565M3156O1482N3708N1603M8976M9960P6225P1984J00865J33397
8847D063158J84853K50926L67394N10466O82988P45748M57901j87485o52748o79948
8837E743253n18603l35076k07487j38381j05669p6573k0597J286n995K666J6421
8826D355245K1263K7476J5315k427J2318K7589L3795K4069L1433J6998J6722M2909
8814D622705M3932J2795K4097M4810M1503L2197K5400L4649M9624M9311M1674
8803E022697K0838M1980L0279K2610L7361K2373K9170M5609M8517N6406N3984
$$ plain form
8792 5431824 5456549 5469238 5508253 5559597 5592699 5626234 5655591 5695111 5725336 5758583 5799176
8781 5799176 5839140 5873879 5912152 5959428 5992101 6035011 6068926 6105301 6145347 6187385 6230801
8770 6230801 6271163 6314500 6353867 6391577 6419157 6462714 6520462 6580267 6621771 6673116 6718427
8759 6718427 6729867 6731479 6736839 6756220 6783068 6800143 6809754 6846651 6871512 6894657 6927777 6945669
8747 6945669 6962373 6984123 7001911 7023832 7036488 7065975 7095333 7104057 7112400 7130672 7147482 7166031
8735 7166031 7181417 7206554 7225396 7255061 7272472 7272408 7268192 7272835 7262825 7264104 7264503 7287814 7306651
8722 7306651 7297617 7287002 7281576 7268386 7276974 7288706 7294053 7293652 7283583 7269170 7260762 7248963 7237854
8709 7237854 7235337 7233267 7219288 7194754 7179546 7164758 7140025 7112339 7099158 7093228 7083762 7065560
$$ packed form
8792E431824K4725J2689L9015N1344L3102L3535K9357L9520L0225L3247M0593
8781E799176L9964L4739L8273M7276L2673M2910L3915L6375M0046M2038M3416
8770F230801M0362M3337L9367L7710K7580M3557N7748N9805M1504N1345M5311
8759F718427J1440J612N360J9381K6848J7075R611L6897K4861K3145L3120J7892
8747F945669J6704K1750J7788K1921J2656K9487K9358Q724Q343J8272J6810J8549
8735G166031J5386K5137J8842K9665J7411o4m216M643j0010J279L99K3311J8837
8722G306651r034j0615n426j3190Q588J1732N347m01j0069j4413q408j1799j1109
8709G237854k517k070j3979k4534j5208j4788k4733k7686j3181n930r466j8202
$$ plain form
8697 7065560 7031975 7005526 6985980 6957949 6939668 6905663 6866728 6835233 6817575 6787402 6760927
8686 6760927 6742757 6722294 6704604 6669562 6623574 6587499 6571337 6544947 6508669 6471771 6434140
8675 6434140 6405716 6361617 6310454 6279523 6258536 6211846 6154895 6117187 6071457 6027777 6001806
8664 6001806 5972869 5941917 5910310 5869054 5823124 5781243 5746025 5712591 5674273 5641669 5610606
8653 5610606 5575120 5535787 5506684 5489155 5464103 5419640 5379243 5340825 5329621 5310261 5256834
8642 5256834 5183752 5119521 5080497 5039219 5003843 4962805 4920941 4896440 4857823 4826312 4783028
8631 4783028 4747901 4702349 4650807 4616157 4577995 4545977 4495165 4463726 4441977 4413110 4375719
8620 4375719 4329295 4312087 4281932 4236270 4180864 4137424 4108436 4089682 4060758 4024030 3989808
$$ packed form
8697G065560l3585k6449j9546k8031j8281l4005l8935l1495j7658l0173k6475
8686F760927j8170k0463j7690l5042m5988l6075j6162k6390l6278l6898l7631
8675F434140k8424m4099n1163l0931k0987m6690n6951l7708m5730m3680k5971
8664F001806k8937l0952l1607m1256m5930m1881l5218l3434l8318l2604l1063
8653E610606l5486l9333k9103j7529k5052m4463m0397l8418j1204j9360n3427
8642E256834p3082o4231l9024m1278l5376m1038m1864k4501l8617l1511m3284
8631D783028l5127m5552n1542l4650l8162l2018n0812l1439k1749k8867l7391
8620D375719m6424j7208l0155m5662n5406m3440k8988j8754k8924l6728l4222
$$ plain form
8609 3989808 3948786 3906999 3876607 3840738 3807767 3790710 3772660 3743743 3703605 3665037 3635541
8598 3635541 3608171 3569340 3550254 3515413 3493322 3464626 3431248 3405573 3377949 3352276 3336753
8587 3336753 3326471 3304406 3273522 3236549 3196425 3176006 3161779 3145469 3126923 3094595 3075218
8576 3075218 3074804 3060579 3035374 3009055 2976272 2943303 2934926 2931463 2918070 2921727 2904951 2889948
8564 2889948 2863987 2856992 2845862 2816587 2780924 2742594 2719363 2698823 2668446 2616012 2577294 2543578
8552 2543578 2508011 2491569 2469506 2452930 2437386 2415823 2401354 2375206 2354122 2334952 2305721
8541 2305721 2281364 2265204 2249656 2231475 2213902 2198643 2173788 2157497 2137528 2113997 2096690
8530 2096690 2082892 2072315 2053178 2036805 2021426 2010178 2011310 1992068 1979076 1972823 1948795 1931295
$$ packed form
8609C989808m1022m1787l0392l5869l2971j7057j8050k8917m0138l8568k9496
8598C635541k7370l8831j9086l4841k2091k8696l3378k5675k7624k5673j5523
8587C336753j0282k2065l0884l6973m0124k0419j4227j6310j8546l2328j9377
8576C075218m14j4225k5205k6319l2783l2969q377l463j3393L657j6776j5003
8564B889948k5961o995j1130k9275l5663l8330k3231k0540l0377n2434l8718l3716
8552B543578l5567j6442k2063j6576j5544k1563j4469k6148k1084j9170k9231
8541B305721k4357j6160j5548j8181j7573j5259k4855j6291j9969k3531j7307
8530B096690j3798j0577j9137j6373j5379j1248J132j9242j2992o253k4028j7500
$$ plain form
8518 1931295 1923244 1902592 1877438 1870355 1868719 1861672 1852115 1836095 1821879 1807185 1789025 1777622
8506 1777622 1751593 1731262 1718740 1707266 1711807 1712180 1697590 1686889 1686797 1675960 1653700 1634896 1617597
8493 1617597 1612758 1597592 1577295 1566528 1555098 1549109 1523914 1506110 1497322 1476715 1456648 1446632
8481 1446632 1437680 1443870 1446277 1435635 1420752 1412749 1396758 1393168 1390329 1372983 1357239 1350891 1349916
8468 1349916 1341447 1315803 1303442 1306807 1310388 1310190 1303062 1288553 1264865 1247486 1230538 1221937 1226779
8455 1226779 1225877 1212147 1197128 1195657 1190590 1182465 1184832 1181196 1151952 1133483 1140594 1152523 1162932
8442 1162932 1160785 1150306 1151643 1159804 1149320 1121482 1105904 1112250 1092575 1091394 1078937 1065166
8430 1065166 1055042 1050696 1045772 1025595 1019331 1001654 995304 992182 993174 997848 998581 996063 984563 976678
$$ packed form
8518A931295q051k0652k5154p083j636p047r557j6020j4216j4694j8160j1403
8506A777622k6029k0331j2522j1474M541L73j4590j0701r2j0837k2260j8804j7299
8493A617597m839j5166k0297j0767j1430n989k5195j7804q788k0607k0067j0016
8481A446632q952O190K407j0642j4883q003j5991l590k839j7346j5744o348r75
8468A349916q469k5644j2361L365L581j98p128j4509k3688j7379j6948q601M842
8455A226779r02j3730j5019j471n067q125K367l636k9244j8469P111J1929J0409
8442A162932k147j0479J337Q161j0484k7838j5578O346j9675j181j2457j3771
8430A065166j0124m346m924k0177o264j7677o350l122R92M674P33k518j1500p885
$$ plain form
8416 976678 963433 960480 957143 944721 943340 924797 927720 933427 949751 948138 927067 917474 920117
8403 920117 907428 886717 886143 887157 895754 892023 866187 857967 857044 855157 857011 842398 822216 826710
8389 826710 840144 838115 842595 838447 839973 842233 835784 824486 804325 794440 788370 787244 774314
8376 774314 758078 756539 748760 749404 750002 752557 761419 759639 745274 734427 726484 719053 729171 733414
8362 733414 724234 705544 700824 703195 699695 689717 687920 690449 684854 677993 684342 695734 688329 697205
8348 697205 700311 686245 674719 667125 667093 666557 653286 660912 667532 673927 671242 665409 646066 638259
8334 638259 630078 631746 634216 628899 614671 625595 624922 623599 610346 577638 566706 563534 559234
8321 559234 573940 570740 560184 553189 563535 568732 560214 564929 576819 580954 566488 554439 553121
$$ packed form
8416I76678j3245k953l337j2422j381j8543K923N707J6324j613k1071r593K643
8403I20117j2689k0711n74J014Q597l731k5836q220r23j887J854j4613k0182M494
8389H26710J3434k029M480m148J526K260o449j1298k0161r885o070j126j2930
8376G74314j6236j539p779O44N98K555Q862j780j4365j0847p943p431J0118M243
8362G33414r180j8690m720K371l500r978j797K529n595o861O349J1392p405Q876
8348F97205L106j4066j1526p594l2n36j3271P626O620O395k685n833j9343p807
8334F38259q181J668K470n317j4228J0924o73j323j3253l2708j0932l172m300
8321E59234J4706l200j0556o995J0346N197q518M715J1890M135j4466j2049j318
$$ plain form
8308 553121 558994 564246 555248 554833 544669 536795 545128 555775 557443 557086 547933 529444 507926 498296
8294 498296 486884 485295 493904 511976 507702 493860 493447 497190 496733 477232 463943 465500 468689 467685
8280 467685 473529 486216 483121 478307 469622 463095 470763 463733 448747 443152 438220 430053 446045 452540
8266 452540 459117 467000 455904 429589 420038 422655 411255 414382 421512 430601 429624 429850 437862 433102
8252 433102 426531 407873 400153 404841 397220 393206 395830 410943 403265 397166 399890 393532 386744 365576
8238 365576 361931 376885 368992 376776 404081 409007 406398 407992 397064 390961 377384 378494 375604
8225 375604 373119 369873 368158 370897 367261 365272 366433 362980 355407 359885 352751 337651 323821 327968
8211 327968 345768 352957 360262 358447 341315 342698 349731 351617 350356 342035 329691 325760 332348 332966
$$ packed form
8308E53121N873N252q998m15j0164p874Q333J0647J668l57r153j8489k1518r630
8294D98296j1412j589Q609J8072m274j3842m13L743m57j9501j3289J557L189j004
8280D67685N844J2687l095m814q685o527P668p030j4986n595m932q167J5992O495
8266D52540O577P883j1096k6315r551K617j1400L127P130R089r77K26Q012m760
8252D33102o571j8658p720M688p621m014K624J5113p678o099K724o358o788k1168
8238C65576l645J4954p893P784K7305M926k609J594j0928o103j3577J110k890
8225C75604k485l246j715K739l636j989J161l453p573M478p134j5100j3830M147
8211C27968J7800P189P305j815j7132J383P033J886j261q321j2344l931O588O18
$$ plain form
8197 332966 314584 307007 316545 323309 323436 339125 340036 334035 324341 322240 330283 321734 315227 319506
8183 319506 315767 336728 340432 335583 317305 317320 315785 313538 314676 322175 317605 312346 326750 321522
8169 321522 309275 303493 290671 292370 297026 283533 280888 287128 298581 289818 275112 278336 286076
8156 286076 281938 270849 268571 276188 277727 272519 263931 273682 279705 283625 278682 290224 285942 278605
8142 278605 282232 278173 281732 284212 276370 265307 270857 275287 279305 275020 268549 275777 275509 282201
8128 282201 286907 277728 277116 284859 281816 267075 270970 269558 258077 255601 254570 265548 275765 272296
8114 272296 270303 262595 262101 251665 232362 233431 238784 246037 243910 248894 258168 269096 262674 250256
8100 250256 233141 237964 245360 245180 240256 238641 233749 255080 262635 264679 260525 246461 235820 231856
$$ packed form
8197C32966j8382p577R538O764J27J5689R11o001r694k101Q043q549o507M279
8183C19506l739K0961L704m849j8278J5j535k247J138P499m570n259J4404n228
8169C21522j2247n782j2822J699M656j3493k645O240J1453q763j4706L224P740
8156B86076m138j1089k278P617J539n208q588R751O023L920m943J1542m282p337
8142B78605L627m059L559K480p842j1063N550M430M018m285o471P228k68O692
8128B82201M706r179o12P743l043j4741L895j412j1481k476j031J0978J0217l469
8114B72296j993p708m94j0436j9303J069N353P253k127M984R274J0928o422j2418
8100B50256j7115M823P396j80m924j615m892K1331P555K044m154j4064j0641l964
$$ plain form
8086 231856 233369 237406 225158 218501 222095 216122 209009 202868 207116 213630 216303 220950 219844 220271
8072 220271 216855 215936 210878 193374 184313 187582 204557 210381 205394 209758 223329 220589 213355 219570
8058 219570 227331 221834 221429 223494 222871 225214 223975 218482 219176 223236 232591 225351 215896 198708 187013
8043 187013 187483 186118 200403 192377 188319 202652 195714 179246 172797 164031 163854 168053 169991 179971
8029 179971 179048 172730 166832 169003 177916 178730 169421 176986 191073 182720 187729 196490 198442 204659 208536
8014 208536 206828 200415 198933 206795 213506 205304 211721 212397 205025 210484 210903 189800 182366 186572 188409
7999 188409 186712 181726 184999 184736 186838 183413 185653 202433 207807 191609 181300 181590 172136 173432
7985 173432 167999 160475 151487 144381 146931 165916 160314 157628 149423 140762 140748 166824 192823 190453
$$ packed form
8086B31856J513M037j2248o657L594n973p113o141M248O514K673M647j106M27
8072B20271l416r19n058j7504r061L269J6975N824m987M364J3571k740p234O215
8058B19570P761n497m05K065o23K343j239n493O94M060R355p240r455j7188j1695
8043A87013M70j365J4285q026m058J4333o938j6468o449q766j77M199J938R980
8029A79971r23o318n898K171Q913Q14r309P565J4087q353N009Q761J952O217L877
8014B08536j708o413j482P862O711q202O417O76p372N459M19k1103p434M206J837
7999A88409j697m986L273k63K102l425K240J6780N374j6198j0309K90r454J296
7985A73432n433p524q988p106K550J8985n602k686q205q661j4K6076K5999k370
$$ plain form
7971 190453 189987 203937 211494 202614 210770 219968 210728 199530 199341 192087 191634 195310 199414 197312 179832
7956 179832 171483 166105 164412 176676 180438 154004 150411 162321 165630 172922 174961 171309 162222 164396
7942 164396 162690 166591 169516 188738 186298 168113 170693 171706 166112 178907 180817 173296 169007 150665
7928 150665 155952 140993 138149 144850 165191 176950 170160 157402 160628 169603 175859 178421 184000
7915 184000 184112 174553 165529 153694 161458 166960 159036 163131 160413 137133 116152 126043 135305 147638
7901 147638 149505 143022 139304 133160 133386 141809 149202 154584 172148 153412 131931 132257 122798 127018
7887 127018 147167 148055 144211 140434 138054 126808 132635 138748 139054 150507 145880 131783 120785 113920
7873 113920 117562 118313 104802 102219 119497 117563 112160 122885 124501 118810 127354 129241 124724 127835
$$ packed form
7971A90453m66J3950P557q880Q156R198r240j1198j89p254m53L676M104k102j7480
7956A79832q349n378j693J2264L762k6434l593J1910L309P292K039l652r087K174
7942A64396j706L901K925J9222k440j8185K580J013n594J2795J910p521m289j8342
7928A50665N287j4959k844O701K0341J1759o790j2758L226Q975O256K562N579
7915A84000J12r559r024j1835P764N502p924M095k718k3280k0981R891R262J2333
7901A47638J867o483l718o144K26Q423P393N382J7564j8736k1481L26r459M220
7887A27018K0149Q88l844l777k380j1246N827O113L06J1453m627j4097j0998o865
7873A13920L642P51j3511k583J7278j934n403J0725J616n691Q544J887m517L111
$$ plain form
7859 127835 136865 120372 109537 88198 85606 96669 95889 105197 120477 120367 123639 125066 110615
7846 110615 103989 111853 115141 123929 128303 129031 122628 114448 111839 120653 115598 120327 109210 100228
7832 100228 102251 109365 114283 113117 107451 97069 83241 92463 101089 105359 109685 113289 106587 124840
7818 124840 132800 118886 112226 117169 124747 123535 119744 110485 113754 105679 103167 114183 122808 132438
7804 132438 151456 169761 170308 166366 158434 145589 126696 119377 127862 120421 106723 103648 102681 90405
7790 90405 94366 95077 87573 94324 97361 102275 103837 92554 79928 89550 89854 93967 89868 88001 95671
7775 95671 111194 113870 107163 104883 97535 99053 102263 90087 84926 92612 101637 100818 94616 80327
7761 80327 73582 79385 93386 91092 81362 88636 75870 70509 81374 79716 77992 82484 72278 63480
$$ packed form
7859A27835R030j6493j0835k1339k592J1063p80R308J5280j10L272J427j4451
7846A10615o626P864L288Q788M374P28o403q180k609Q814n055M729j1117q982
7832A00228K023P114M918j166n666j0382j3828R222Q626M270M326L604o702J8253
7818A24840P960j3914o660M943P578j212l791r259L269q075k512J1016Q625R630
7804A32438J9018J8305N47l942p932j2845j8893p319Q485p441j3698l075r67j2276
7790I0405L961P11p504O751L037M914J562j1283j2626R622L04M113m099j867P670
7775I5671J5523K676o707k280p348J518L210j2176n161P686R025q19o202j4289
7761H0327o745N803J4001k294r730P274j2766n361J0865j658j724M492j0206q798
$$ plain form
7747 63480 79883 85563 84581 77695 76451 92194 98457 99375 82904 71692 51536 47259 43545 53928
7733 53928 77517 77065 79039 70919 75273 83443 76871 75736 93232 101872 97145 84665 77705 68466
7719 68466 67653 64038 72206 78725 70512 62480 58691 49733 49141 53418 61310 66857 61945 56766 62652
7704 62652 65488 70409 71459 64113 72959 79102 69655 70093 79698 83756 79779 84944 81516 71750 65699
7689 65699 73420 75326 77054 82167 75532 72512 76152 76943 62088 58721 64967 64925 59477 62281 71880
7674 71880 89312 77921 79169 78778 68006 66493 75277 76136 76680 88001 82775 85259 87172 77836
7660 77836 71353 70323 74378 84234 76296 78252 85641 89469 83970 69050 65099 67131 65337 60578
7646 60578 69347 73617 72508 63168 62229 59100 45546 48025 61581 50748 49868 51997 62887 61409
$$ packed form
7747F3480J6403N680r82o886j244J5743O263R18j6471j1212k0156m277l714J0383
7733E3928K3589m52J974q120M354Q170o572j135J7496Q640m727j2480o960r239
7719F8466q13l615Q168O519q213q032l789q958n92M277P892N547m912n179N886
7704F2652K836M921J050p346Q846O143r447M38R605M058l977N165l428r766o051
7689F5699P721J906J728N113o635l020L640P91j4855l367O246m2n448K804R599
7674G1880J7432j1391J248l91j0772j513Q784Q59N44J1321n226K484J913r336
7660G7836o483j030M055R856p938J956P389L828n499j4920l951K032j794m759
7646F0578Q769M270j109r340r39l129j3554K479J3556j0833q80K129J0890j478
$$ plain form
7632 61409 49342 50085 50159 45557 47514 58630 53177 35489 37185 45668 50249 51931 48887 49820 47242
7617 47242 47647 53352 50721 54020 43282 43417 38947 52530 50609 44300 50569 52657 40110 48140
7603 48140 47307 60428 60777 64250 50458 40587 40756 40751 41054 30870 40512 43461 45311 46646 39070 33033
7587 33033 41825 52786 42095 22833 30708 41146 53242 52310 41811 23757 27400 30486 42875
7574 42875 55159 63641 61300 51857 31575 29314 29962 40762 39201 35963 43256 47368 45781 60921
7560 60921 48665 42416 47122 62266 60670 49842 51456 48731 48965 54797 53445 44980 51804 44656
7546 44656 36176 30871 34780 39877 38249 21326 32614 47159 54904 48321 25755 27667 30471 33245
7532 33245 43950 56303 49397 31284 30412 43442 45921 45191 45705 43438 35389 36150 35235 42383 37970
$$ packed form
7632F1409j2067P43P4m602J957J1116n453j7688J696Q483M581J682l044R33k578
7617D7242M05N705k631L299j0738J35m470J3583j921o309O269K088j2547Q030
7603D8140q33J3121L49L473j3792r871J69nL03j0184R642K949J850J335p576o037
7587C3033Q792J0961j0691j9262P875J0438J2096r32j0499j8054L643L086J2389
7574D2875J2284Q482k341r443k0282k261O48J0800j561l238P293M112j587J5140
7560F0921j2256o249M706J5144j596j0828J614k725K34N832j352q465O824p148
7546D4656q480n305L909N097j628j6923J1288J4545P745o583k2566J912K804K774
7532C3245J0705J2353o906j8113q72J3030K479p30N14k267q049P61r15P148m413
$$ plain form
7517 37970 40835 42962 47725 39815 40908 40948 45004 51320 37071 16454 24111 31392 26188 16396 25743
7502 25743 37295 33715 42898 47658 49733 43311 37186 40986 29614 22555 32910 35886 44515 59953
7488 59953 53834 39789 30370 32183 46886 52879 39528 29312 30761 35794 41008 34094 33507 38905
7474 38905 43154 42423 54666 56048 54440 56727 53839 41169 36487 41662 44250 52352 58948 47487
7460 47487 53170 49605 46893 51055 47196 44255 49454 51650 36612 47902 44585 29834 34360 52038
7446 52038 59362 50872 53497 60855 57451 54485 50753 52049 60212 62457 55855 37582 28014 37423
7432 37423 43716 38616 32084 45405 49720 62911 64088 57594 59215 62374 56829 49835 50803 57816
7418 57816 54762 40489 37770 37524 32812 29144 14910 11516 27586 37327 27965 28441 27226 30076
$$ packed form
7517C7970K865K127M763p910J093M0M056O316j4249k0617P657P281n204r792R347
7502B5743J1552l580R183M760K075o422o125L800j1372p059J0355K976Q629J5438
7488E9953o119j4045r419J813J4703N993j3351j0216J449N033N214o914n87N398
7474C8905M249p31J2243J382j608K287k888j2670m682N175K588Q102O596j1461
7460D7487N683l565k712M162l859k941N199K196j5038J1290l317j4751M526J7678
7446E2038P324q490K625P358l404k966l732J296Q163K245o602j8273r568R409
7432C7423O293n100o532J3321M315J3191J177o494J621L159n545o994R68P013
7418E7816l054j4273k719k46m712l668j4234l394J6070R741r362M76j215K850
$$ plain form
7404 30076 27268 33794 36857 46431 46693 51998 39954 27035 20191 27431 37577 42876 46509 55057
7390 55057 46492 44229 45724 44560 37445 37027 40315 48515 38184 32084 37192 37117 30690 33987 33318
7375 33318 35645 42242 39006 38691 40702 27684 36988 46684 32710 33973 36724 51520 42912 17317
7361 17317 2873 21834 28520 19131 16298 16375 7519 16173 26948 33290 42791 38875 37786 46050
7347 46050 48560 45690 37834 22697 12496 2928 6428 17045 29013 33110 28661 13725 11773
7334 11773 18121 17774 8463 9297 12453 16108 35139 49552 48850 44450 24598 17256 11865 6235 12509
7319 12509 12978 22985 36644 43300 21222 3682 -13589 -461 16582 24067 47128 55087 53768
7306 53768 46363 48577 41818 40724 44179 50360 41929 31525 29858 22693 22279 35726 32845 20371
$$ packed form
7404C0076k808O526L063R574K62N305j2044j2919o844P240J0146N299L633Q548
7390E5057q565k263J495j164p115m18L288Q200j0331o100N108p5o427L297o69
7375C3318K327O597l236l15K011j3018R304R696j3974J263K751J4796q608k5595
7361A7317j4444J8961O686r389k833P7q856Q654J0775O342R501l916j089Q264
7347D6050K510k870p856j5137j0201r568L500J0617J1968M097m449j4936j952
7334A1773O348l47r311Q34L156L655J9031J4413p02m400j9852p342n391n630O274
7319A2509M69J0007J3659O656k2078j7540j7271J3128J7043P485K3061P959j319
7306E3768p405K214o759j094L455O181q431j0404j667p165m14J3447k881j2474
$$ plain form
7292 20371 12383 13036 16170 19468 25828 40614 42444 48036 40315 30140 36597 44728 36394 37697
7278 37697 35970 26316 20360 24298 23675 19046 17376 18299 26768 41400 36446 25860 12367 15069
7264 15069 26957 33523 38388 37920 27463 28983 20589 11122 1178 1403 12282 17397 14685 16135
7250 16135 23757 46446 43006 39373 34074 31341 36682 34373 20124 17833 16312 8093 12825 23506
7236 23506 27938 33730 30821 40597 38337 26391 27211 24967 33927 31888 25193 18078 14829 12495 2217
7221 2217 13349 30549 27494 5804 2866 8167 19626 31705 33320 14787 10905 26199 32737
7208 32737 41010 32155 11098 2270 15451 22623 21136 31660 27691 14008 13937 14777 19304 28298
7194 28298 23130 11377 9291 9102 17207 28216 29803 28900 24991 27984 44595 42851 21427 13206
$$ packed form
7292B0371p988O53L134L298O360J4786J830N592p721j0175O457Q131q334J303
7278C7697j727r654n956L938o23m629j670R23Q469J4632m954j0586j3493K702
7264A5069J1888O566M865m68j0457J520q394r467r944K25J0879N115k712J450
7250A6135P622K2689l440l633n299k733N341k309j4249k291j521q219M732J0681
7236B3506M432N792k909R776k260j1946Q20k244Q960k039o695p115l249k334j0278
7221B217J1132J7200l055k1690k938N301J1459J2079J615j8533l882J5294O538
7208C2737Q273q855k1057q828J3181P172j487J0524l969j3683p1Q40M527Q994
7194B8298n168j1753k086j89Q105J1009J587r03l909K993J6611j744k1424q221
$$ plain form
7180 13206 8495 18661 22537 25590 22860 19585 6714 -2461 -4701 14641 32391 23655 7242
7167 7242 -1252 -1238 1447 2489 13678 19893 14792 21354 16048 17140 17497 12409 20203 26968 23387
7152 23387 14869 14256 12783 1290 -2502 3794 9905 11563 13081 17201 6641 -199 7503 7955 14184
7137 14184 1425 -1364 -1433 15108 26343 15510 7749 4335 -7470 -1357 9981 17099 15436 6904
7123 6904 6833 9857 8182 3958 9000 1443 -1268 748 14919 19619 12442 10650 8795 -186 -452
7108 -452 12281 21799 14358 225 -8037 -6316 9986 21785 23362 25447 4605 12097 17645 4409
7094 4409 -447 -4127 -2296 -10314 -12403 -10709 -3455 805 3381 18373 29852 30760 25248 17848 13064
7079 13064 5343 -2002 -2171 3090 3289 -639 1309 4004 -3727 664 6834 -3085 -5340 1533 1882
$$ packed form
7180A3206m711J0166L876L053k730l275j2871r175k240J9342J7750q736j6413
7167G242q494J4K685J042J1189O215n101O562n306J092L57n088P794O765l581
7152B3387q518o13j473j1493l792O296O111J658J518M120j0560o840P702M52O229
7137A4184j2759k789o9J6541J1235j0833p761l414j1805O113J1338P118j663q532
7123F904p1L024j675m224N042p557k711K016J4171M700p177j792j855q981k66
7108d52J2733R518p441j4133q262J721J6302J1799J577K085k0842P492N548j3236
7094D409m856l680J831q018k089J694P254M260K576J4992J1479R08n512p400m784
7079A3064p721p345j69N261J99l928J948K695p731M391O170r919k255O873L49
$$ plain form
7064 1882 13710 9591 2860 4847 11501 12649 26735 27211 23214 14088 8876 22136 21918 15735 15388
7049 15388 -1713 8051 25092 20769 21366 18394 18996 8458 8087 8482 5644 12959 29855 25522 317
7034 317 -12168 -12627 -10698 10807 16927 20696 27553 14636 12663 19061 29313 23636 11197 7829
7020 7829 7610 1455 4036 15695 14842 12516 9591 8870 26466 21537 15671 13142 22950 27398 25804
7005 25804 29535 27886 27977 16851 14352 27339 16531 6842 4802 4468 -4 2383 -1749 -8991 -1057
6990 -1057 -44 1942 14909 19014 18134 17218 15618 16403 17638 21300 20025 9651 -1855 8815 26147
6975 26147 25895 33903 34650 38058 28909 9957 10687 15572 9605 5082 22174 29652 32283 35444 9748
6960 9748 -6091 -2370 5435 3468 3791 -2821 6663 17002 13381 5672 148 3309 10314 7202 21027
$$ packed form
7064A882J1828m119o731J987O654J148J4086M76l997r126n212J3260k18o183l47
7049A5388j7101R764J7041m323N97k972O02j0538l71L95k838P315J6896m333k5205
7034C17j2485m59J929K1505O120L769O857j2917j973O398J0252n677j2439l368
7020G829k19o155K581J1659q53k326k925p21J7596m929n866k529R808M448j594
7005B5804L731j649R1j1126k499J2987j0808r689k040l34m472K387m132p242P934
6990a057J013J986J2967M105q80r16j600P85J235L662j275j0374j1506J0670J7332
6975B6147k52Q008P47L408r149j8952P30M885n967m523J7092P478K631L161k5696
6960I748j5839L721P805j967L23o612R484J0339l621p709n524L161P005l112J3825
$$ plain form
6945 21027 28048 31648 25395 33103 35043 27750 6932 1166 5796 14421 6353 26881 26801 5061
6931 5061 7760 13620 15891 19877 25877 12883 6952 11575 10299 2068 5546 11788 3578 2630 5597
6916 5597 14773 20757 19521 18243 13681 16547 14985 6439 8519 33 -379 -3412 -6526 6790 15199
6901 15199 36151 37436 18922 24975 23360 17042 12647 3332 -601 6139 20950 19043 13041 1420
6887 1420 -11416 -16570 -7186 -4123 -5487 -10701 -9496 2173 -5065 -13058 3728 -2670 -6813 -6688
6873 -6688 -5555 -151 -4180 -2107 885 -3405 6718 -1864 13734 22338 20453 26372 25239 13969
6859 13969 -2842 -4667 -12940 -14548 4332 19065 37599 38476 37418 17803 7859 1804 19977
6846 19977 8346 3166 5622 15412 10084 9660 26558 31937 35561 31120 17007 21869 31922 35294
$$ packed form
6945B1027P021L600o253P708J940p293k0818n766M630Q625q068K0528q0k1740
6931E061K699N860K271L986O000j2994n931M623j276q231L478O242q210r48K967
6916E597R176N984j236j278m562K866j562q546K080q486m12l033l114J3316Q409
6901A5199K0952J285j8514O053j615o318m395r315l933O740J4811j907o002j1621
6887A420j2836n154R384L063j364n214J205J1669p238p993J6786o398m143J25
6873f688J133N404m029K073K992m290J0123q582J5598Q604j885N919j133j1270
6859A3969j6811j825q273j608J8880J4733J8534Q77j058j9615r944o055J8173
6846A9977j1631n180K456R790n328m24J6898N379L624m441j4113M862J0053L372
$$ plain form
6832 35294 40372 42755 27614 7492 2477 11244 20218 27719 25567 18650 12019 7871 10702 13457
6818 13457 20050 11185 4360 5614 11988 29965 30467 16570 20764 27975 41507 50831 32910 27250
6804 27250 20453 10222 -5640 -8784 2362 15457 13202 26581 25314 13216 9164 9995 1355
6791 1355 586 4066 24442 31833 22056 25781 28928 26965 31584 35857 35995 25351 19097 12643 8393
6776 8393 11717 3195 8148 21183 13962 4761 -8459 -12936 -3062 -8467 -14449 -21923 -36241 -29885
6762 -29885 -21495 -7738 -9112 -9084 -1622 -1713 -476 924 -6310 -5431 -3817 8840 11306 7201 3140
6747 3140 1377 -1087 11321 9256 -13634 -21895 -8564 -6016 -718 -7699 -8294 -3929 9813 24571
6733 24571 15972 -797 -12590 -16114 501 7442 -6835 -3304 6652 20835 28081 35125 42013
$$ packed form
6832C5294N078K383j5141k0122n015Q767Q974P501k152o917o631m148K831K755
6818A3457O593q865o825J254O374J7977N02j3897M194P211J3532R324j7921n660
6804B7250o797j0231j5862l144J1146J3095k255J3379j267j2098m052Q31q640
6791A355p69L480K0376P391r777L725L147j963M619M273J38j0644o254o454m250
6776H393L324q522M953J3035p221r201j3220m477R874n405n982p474j4318O356
6762b9885Q390J3757j374K8P462r1J237J400p234Q79J614J2657K466m105m061
6747C140j763k464J2408k065k2890q261J3331K548N298o981n95M365J3742J4758
6733B4571q599j6769j1793l524J6615O941j4277L531R956J4183P246P044O888
$$ plain form
6720 42013 29525 19281 18574 16342 21491 8631 -4525 -8327 -777 19502 28102 22298 16170 24820
6706 24820 44585 44608 35696 22344 27235 18604 26003 33051 38054 39171 30608 39953 50468 84502
6692 84502 122674 143139 158209 173963 155194 114301 81439 56411 35438 30510 13115 -3877
6680 -3877 536 7496 -3890 -9524 -1443 -15450 -13414 -1778 8956 17755 2847 -2310 2366 21097
6666 21097 33756 34226 34402 34392 31728 19276 7579 3382 -2398 8658 4129 8181 12623 9783 -1126
6651 -1126 -4200 2513 13379 15538 8519 3694 1752 17556 16234 16048 34130 44422 50477 22857
6637 22857 14042 12588 6288 1392 151 11060 29724 30877 26467 829 -25912 -28263 -4974
6624 -4974 -7377 -15083 -2066 -7839 -13697 -13454 -4034 7781 3569 2891 3483 -4875 -6450 -12493 -9110
$$ packed form
6720D2013j2488j0244p07k232N149j2860j3156l802P550K0279Q600n804o128Q650
6706B4820J9765K3q912j3352M891q631P399P048N003J117q563R345J0515L4034
6692H4502L8172K0465J5070J5754j8769m0893l2862k5028k0973m928j7395j6992
6680c877M413O960j1386n634Q081j4007K036J1636J0734Q799j4908n157M676J8731
6666B1097J2659M70J76j0k664j2452j1697m197n780J1056m529M052M442k840j0909
6651a126l074O713J0866K159p019m825j942J5804j322j86J8082J0292O055k7620
6637B2857q815j454o300m896j241J0909J8664J153m410k5638k6741k351K3289
6624d974k403p706J3017n773n858K43R420J1815m212o78N92q358j575o043L383
$$ plain form
6609 -9110 -5065 -12511 -17972 -10176 7106 11397 1053 -5946 8929 15352 19677 21351 10402 -3808
6595 -3808 -10774 -12739 -4057 3753 16836 25022 21979 23249 27194 18349 15779 1304 -1621 -173
6581 -173 -7981 -5934 6138 625 -6466 -13441 -19165 -13163 -5258 3601 3315 7426 11602 5733 -8186
6566 -8186 -13558 -4466 -15614 -12370 6805 8285 -4794 -5522 145 7608 20590 18052 9858 6650
6552 6650 7649 15897 12513 9206 3302 13327 11715 8155 10466 9076 12780 11640 14834 28886 26134
6537 26134 17913 14989 10858 14903 14930 9816 2806 -354 -1100 -3968 -9257 3351 16118 7874 9276
6522 9276 10302 10707 2406 -333 7462 3839 4305 7228 6227 -14380 -11689 5742 726 -5774 1793
6507 1793 -8371 -14323 -10888 -8546 -7102 1579 558 3978 19478 24128 8394 -9109 -7978 1798
$$ packed form
6609i110M045p446n461P796J7282M291j0344o999J4875O423M325J674j0949j4210
6595c808o966j965Q682P810J3083Q186l043J270L945q845k570j4475k925J448
6581a73p808K047J2072n513p091o975n724O002P905Q859k86M111M176n869j3919
6566h186n372R092j1148L244J9175J480j3079p28N667P463J2982k538q194l208
6552F650R99Q248l384l307n904J0025j612l560K311j390L704j140L194J4052k752
6537B6134q221k924m131M045K7n114p010l160p46k868n289J2608J2767q244J402
6522I276J026M05q301k739P795l623M66K923j001k0607K691J7431n016o500P567
6507A793j0164n952L435K342J444Q681j021L420J5500M650j5734j7503J131R776
$$ plain form
6493 1798 -9542 -19928 -19983 -22640 -22359 -7368 -228 817 -4024 -11758 -1311 15492 28964 31455
6479 31455 15403 3977 2272 3554 22491 30263 21380 9852 6046 4153 -2172 -1400 1536 7642
6465 7642 6248 13328 7337 -9785 -7192 9715 28806 24269 10296 13743 30372 10466 847
6452 847 -1277 435 3739 12996 11325 -2020 -8739 -21161 -7916 9587 -5928 -13164 -4525 -3829
6438 -3829 5540 24077 31258 24664 11705 16836 20721 12027 5223 3737 1509 -1274 4663 732
6424 732 -4828 -21968 -28205 -12592 -1239 74 -8742 -10441 -11589 -12220 -10144 -11477 -1500 6766 9143
6409 9143 2906 1900 4601 8917 11545 29010 38581 37056 37250 31155 17025 22340 20414 18315 17250
6394 17250 7788 1472 8645 18698 20907 13591 9730 13425 13126 7135 726 -7833 -2904 2304 7564
$$ packed form
6493A798j1340j0386n5k657K81J4991P140J045m841p734J0447J6803J3472K491
6479C1455j6052j1426j705J282J8937P772q883j1528l806j893o325P72K936O106
6465G642j394P080n991j7122K593J6907J9091m537j3973L447J6629j9906r619
6452H47k124J712L304R257j671j3345o719j2422J3245J7503j5515p236Q639O96
6438c829R369J8537P181o594j2959N131L885q694o804j486k228k783N937l931
6424G32n560j7140o237J5613J1353J313q816j699j148o31K076j333R977Q266K377
6409I143o237j006K701M316K628J7465R571j525J94o095j4130N315j926k099j065
6394A7250r462o316P173J0053K209p316l861L695k99n991o409q559M929N208N260
$$ plain form
6379 7564 3419 3760 6715 5988 864 -758 1302 -8615 -2883 2083 -3665 -11675 -9520 57 -1078
6364 -1078 2236 5487 9430 12773 11082 5221 -13398 -4471 -6628 -16222 2583 14366 20712 25236
6350 25236 15906 15109 21287 13841 5272 12880 6952 -7352 7174 16411 20850 21259 8628 24808
6336 24808 22210 13200 17470 22133 4711 -2440 14685 5401 -2479 -1350 2442 2645 4815 -4357
6322 -4357 -9811 13075 26047 23435 22228 13949 5869 6389 1797 1004 1559 2181 -625 6131 4682
6307 4682 494 -2688 1080 4285 -1286 -19793 -32040 -40782 -33383 -15435 -3423 -2225 356 9078
6293 9078 18278 6997 8203 6367 -2697 12601 18025 13185 5253 -1966 1838 9888 10831 9513 10543
6278 10543 6635 7523 9972 9989 11966 16414 3319 6388 9139 4966 619 -16853 -18296 -22712 -9113
$$ packed form
6379G564m145L41K955p27n124j622K060r917N732M966n748q010K155R577j135
6364a078L314L251L943L343j691n861j8619Q927k157r594J8805J1783O346M524
6350B5236r330p97O178p446q569P608n928j4304J4526R237M439M09j2631J6180
6336B4808k598r010M270M663j7422p151J7125r284p880J129L792K03K170r172
6322d357n454K2886J2972k612j207q279q080N20m592p93N55O22k806O756j449
6307D682m188l182L768L205n571j8507j2247q742P399J7948J2012J198K581Q722
6293I078R200j1281J206j836r064J5298N424m840p932p219L804Q050R43j318J030
6278A0543l908Q88K449J7J977M448j3095L069K751m173m347j7472j443m416J3599
$$ plain form
6263 -9113 8425 286 -6158 1939 -7764 -8358 -11633 -10264 -3289 8574 15110 11540 16141 10100 6053
6248 6053 3890 10092 1234 7280 10071 5978 -1150 -8975 -9107 -66 -10221 -6690 -3129 -13839 -12858
6233 -12858 6594 12261 -4762 -22600 -19577 -12766 -9060 -13774 -10370 -24493 -22140 -16104 -6358 6702
6219 6702 13551 17650 10496 7486 7169 -11647 -28312 -28158 -20845 -22056 -28571 -29581 -23628 -15774 -4121
6204 -4121 -2625 -10390 -11232 -6386 -5647 -9715 1521 4648 3759 -2061 -14053 -5892 -4493 -1829 -5275
6189 -5275 -1155 8229 12094 2970 -592 -8850 -17972 -10958 -8804 -10806 -12459 -3116 -897 -1065 -6054
6174 -6054 -14396 -7902 -463 -1793 1740 9010 3474 2945 -13111 -15251 -6240 -7274 -17208 -25247 -26983
6159 -26983 -20112 -12896 -2424 -2690 -2214 6244 11075 14719 12337 2428 7531 5806 6828 9394 -975
$$ packed form
6263i113J7538q139o444Q097r703n94l275J369O975J1863O536l570M601o041m047
6248F053k163O202q858O046K791m093p128p825j32R041j0155L531L561j0710R81
6233a2858J9452N667j7023j7838L023O811L706m714L404j4123K353O036R746J3060
6219F702O849M099p154l010l17j8816j6665J54P313j211o515j010N953P854J1653
6204d121J496p765q42M846P39m068J1236L127q89n820j1992Q161J399K664l446
6189e275M120R384L865r124l562q258r122P014K154k002j653R343K219j68m989
6174f054q342O494P439j330L533P270n536n29j6056k140R011j034r934q039j736
6159b6983O871P216J0472k66M76Q458M831L644k382r909N103j725J022K566j0369
$$ plain form
6144 -975 -7512 -3531 -9073 -11071 -7624 -2961 -134 -7909 -15273 -8361 6453 12694 -2697 -9189 -18849
6129 -18849 -29068 -24531 -15586 -7579 11910 9379 -13579 -17756 -8549 203 3331 -9095 -7376 -7132
6115 -7132 -12697 2331 13210 5591 -4232 -14469 -13190 -13101 -15210 -14926 -1836 14015 6973 -829
6101 -829 -5445 -25600 -30146 -17949 -9884 -1295 -5535 -5100 11715 9346 14526 20515 15678 14591 19030
6086 19030 18704 28849 25797 17056 14869 18957 10851 2322 14100 31199 28412 19094 13111 1207
6072 1207 -10196 -11925 204 726 2970 -682 -12428 -24985 -20582 -26468 -22960 -19312 -12195 -8716
6058 -8716 -7254 -6061 -1741 -4325 -17791 -22693 -12801 -12329 -9192 -1515 8118 17383 22115 18679 729
6043 729 -16891 -11904 2190 2841 -16 5859 4995 13612 14307 13350 18455 9731 -249 -4210 4970 223
$$ packed form
6144i75o537L981n542j998L447M663K827p775p364O912J4814O241j5391o492r660
6129a8849j0219M537Q945Q007J9489k531k2958m177R207Q752L128j2426J719K44
6115g132n565J5028J0879p619r823j0237J279Q9k109K84J3090J5851p042p802
6101h29m616k0155m546J2197Q065Q589m240M35J6815k369N180N989m837j087M439
6086A9030l26J0145l052q741k187M088q106q529J1778J7099k787r318n983j1904
6072A207j1403j729J2129N22K244l652j1746j2557M403n886L508L648P117L479
6058h716J462J193M320k584j3466m902R892M72L137P677R633R265M732l436j7950
6043G29j7620M987J4094O51k857N875q64Q617O95r57N105q724r980l961R180m747
$$ plain form
6027 223 7509 19529 12442 -5266 -4575 -2537 16605 23716 20555 2117 -9498 -9517 -700 -11195
6013 -11195 -25325 -17770 -14464 -496 12453 4483 -5300 1908 9862 -6585 -5031 359 -1790 -3036
5999 -3036 -8119 -14089 -28013 -29412 -29643 -23289 -16106 -7078 5698 11941 7188 1592 8209 -1594 -21560
5984 -21560 -21814 -15837 -15781 -2968 11354 13063 -12092 -24811 -12938 -6311 -5795 4149 -2792 5357
5970 5357 9005 2416 -7173 2299 3098 -5062 -10454 -6905 -28660 -28946 -13026 -16968 -15428 -17326 -15713
5955 -15713 -12417 -393 5769 9256 3192 -5801 -4984 -7308 -870 -1834 -4175 8867 2543 5259 7390
5940 7390 2434 -261 7457 10564 1591 -5483 -4420 -4001 -1236 -882 6710 5010 2931 -1894 -12437
5925 -12437 -13576 -5015 9528 14915 12049 -662 2896 9748 44 -3626 6411 4529 -3247 -5927
$$ packed form
6027B23P286J2020p087j7708O91K038J9142P111l161j8438j1615j9Q817j0495
6013a1195j4130P555L306J3968J2949p970r783P208P954j6447J554N390k149j246
5999c036n083n970j3924j399k31O354P183R028J2776O243m753n596O617r803j9966
5984b1560k54N977N6J2813J4322J709k5155j2719J1873O627N16R944o941Q149
5970E357L648o589r589R472P99q160n392L549k1755k86J5920l942J540j898J613
5955a5713L296J2024O162L487o064q993Q17k324O438r64k341J3042o324K716K131
5940G390m956k695P718L107q973p074J063M19K765L54P592j700k079m825j0543
5925a2437j139Q561J4543N387k866j2711L558O852r704l670J0037j882p776k680
$$ plain form
5911 -5927 -12473 -4796 2189 7338 12622 6437 -3545 -13299 -4564 -3215 3249 7085 12029 14534 27798
5896 27798 14802 3972 -2077 -11439 -11528 -14256 -2951 -2969 7016 5490 1967 -3083 7359 12924 5956
5881 5956 10019 18696 11748 4617 3992 -9989 -7115 8319 13326 3055 465 1076 -6835 -12749 -11594
5866 -11594 -14791 -11565 -6037 973 -3853 -4003 -1293 5524 2272 1172 -2699 2933 10282 5717 -1494
5851 -1494 -3832 -8693 -13573 -14253 -12382 -6965 1065 -1627 3071 12567 3574 -6895 2275 -4261 -20823
5836 -20823 -21998 -16460 -17247 -15797 -17046 -17166 -19691 -13599 792 13168 9244 -2094 4495 1428
5822 1428 3746 8489 8292 6082 1663 -6564 -3338 -8866 -5037 -4503 -6987 -15346 -10293 -14491 -28471
5807 -28471 -29973 -30791 -16703 410 8377 3979 4742 -4830 -3938 -1789 2457 1494 4149 -221 3966
$$ packed form
5911e927o546P677O985N149N284o185r982r754Q735J349O464L836M944K505J3264
5896B7798j2996j0830o049r362q9k728J1305j8R985j526l523n050J0442N565o968
5881E956M063Q677o948p131o25j3981K874J5434N007j0271k590O11p911n914J155
5866a1594l197L226N528P010m826j50K710O817l252j100l871N632P349m565p211
5851a494k338m861m880o80J871N417Q030k692M698R496q993j0469R170o536j6562
5836b0823j175N538p87J450j249j20k525O092J4391J2376l924j1338O589l067
5822A428K318M743j97k210m419q227L226n528L829N34k484q359N053m198j3980
5807b8471j502q18J4088J7113P967m398P63r572Q92K149M246r63K655m370M187
$$ plain form
5792 3966 14838 31551 23114 12859 17797 24931 29570 17884 3747 -11463 -17995 -17839 -21089 -24413
5778 -24413 -21588 -5763 -6027 -15946 -15417 -12967 -22594 -11125 6442 3784 7289 4124 1613 7170
5764 7170 3743 -885 -3855 -19493 -25834 -22512 -18488 -21365 -6957 3629 2359 -2940 11744 30692
5750 30692 36813 31606 27234 16145 13893 10259 8771 12974 8899 3637 2841 11165 8141 4564 -2729
5735 -2729 -3323 7676 13542 6948 -6393 -16315 -17947 -5825 2034 -6075 -1519 -5193 2536 8072
5721 8072 1091 -7346 -19373 -16525 -8241 207 682 -2443 -7242 -17735 -16463 -13832 -12958 -12512 -20112
5706 -20112 -8250 -4708 -9124 -15427 -6732 -5038 -9489 -12892 -14790 -8480 -1183 -7451 -485 10105
5692 10105 4166 -6075 -5653 -7768 -21624 -12153 -10396 -14711 -22236 -17513 -2475 -4208 -16958 -4857
$$ packed form
5792C966J0872J6713q437j0255M938P134M639j1686j4137j5210o532J56l250l324
5778b4413K825J5825k64r919N29K450r627J1469J7567k658L505l165k511N557
5764G170l427m628k970j5638o341L322M024k877J4408J0586j270n299J4684J8948
5750C0692O121n207m372j1089k252l634j488M203m075n262p96Q324l024l577p293
5735b729n94J0999N866o594j3341r922j632J2122P859q109M556l674P729N536
5721H072o981q437j2027K848Q284Q448M75l125m799j0493J272K631Q74M46p600
5706b0112J1862L542m416o303Q695J694m451l403j898O310P297o268O966J0590
5692A0105n939j0241M22k115j3856R471J757m315p525M723J5038j733j2750J2101
$$ plain form
5678 -4857 -8371 -15084 -5028 8737 23217 34598 27836 13114 4674 4472 2014 -2194 -13985 -4366
5664 -4366 -8991 -24902 -23466 -20761 -19413 -21671 -13689 7198 10634 -3169 -3283 -8049 -2379 -11476
5650 -11476 -16978 -1259 19152 21666 22399 10226 -1237 -9207 -2289 8540 1506 6289 15354 -8773
5636 -8773 -13301 -5294 -11777 -13190 -21308 -22324 -18242 -16102 -12740 -8750 -900 12446 -8738 -13457
5622 -13457 -1613 3376 -4477 -3078 5744 4785 616 1421 11307 9040 7777 4157 10336 17896 22406
5607 22406 18140 11797 17271 13110 16819 26096 12018 7101 -3734 -10925 -8817 -7443 -1685 6063
5593 6063 4779 5749 14825 21905 16985 9715 12179 9242 -8744 -18862 -18760 -7644 -3379 5276 11054
5578 11054 10242 7373 -1293 1009 6071 3149 -266 3383 1415 4540 9372 21746 12646 7572 -2912
$$ packed form
5678d857l514o713J0056J3765J4480J1381o762j4722q440k02k458m208j1791R619
5664d366m625j5911J436K705J348k258P982K0887L436j3803j14m766N670r097
5650a1476n502J5719K0411K514P33j2173j1463p970O918J0829p034M783R065k4127
5636h773m528Q007o483j413q118j016M082K140L362L990P850J3346k1184m719
5622a3457J1844M989p853J399Q822r59m169Q05R886k267j263l620O179P560M510
5607B2406m266o343N474m161L709R277j4078m917j0835p191K108J374N758P748
5593F063j284R70R076P080m920p270K464k937j7986j0118J02J1116M265Q655N778
5578A1054q12k869q666K302N062k922l415L649j968L125M832J2374r100n074j0484
$$ plain form
5563 -2912 -1527 4430 -2280 -8938 -5182 19819 29427 15715 3918 -5971 -4350 1844 -2392 7178
5549 7178 20668 27651 31040 24739 13505 11763 10991 -1685 -984 -13641 -15380 -6474 8530 14516
5535 14516 11302 2263 -11518 -16430 -14390 -6504 -7723 -5601 -3866 2116 16888 26522 17899 -4898
5521 -4898 -6234 -9453 -13506 -2991 -2099 -3917 -12377 -13571 -16995 -6810 -10137 -4578 6791 2742
5507 2742 1934 -8351 -10009 -15730 -15776 -3787 7383 -2100 -12033 -12523 -18192 -29663 -25405 -16710 -5460
5492 -5460 2756 -19226 -26780 -26093 -27523 -24829 -23156 -17297 -18479 -9269 -4175 -15571 -7872 -7151 -12861
5477 -12861 -6816 -15039 -10556 -136 -10869 -18152 -21002 -17721 -13463 -2513 -9010 -18154 -21617 -20300
5463 -20300 -8252 -10642 -13021 -7066 -1856 -810 -5849 -7653 1633 -6488 -21448 -29825 -19876 -16970
$$ packed form
5563b912J385N957o710o658L756K5001R608j3712j1797r889J621O194m236R570
5549G178J3490O983L389o301j1234j742p72j2676P01j2657j739Q906J5004N986
5535A4516l214r039j3781m912K040P886j219K122J735N982J4772R634q623k2797
5521d898j336l219m053J0515Q92j818q460j194l424J0185l327N559J1369m049
5507B742q08j0285j658n721m6J1989J1170r483r933m90n669j1471M258Q695J1250
5492e460Q216k1982p554O87j430K694J673N859j182R210N094j1396P699P21n710
5477a2861O045q223M483J0420j0733p283k850L281M258J0950o497r144l463J317
5463b0300J2048k390k379N955N210J046n039j804R286q121j4960q377R949K906
$$ plain form
5449 -16970 -20079 -20104 -19531 -10240 -12537 -22950 -18257 -5226 -7396 -11716 -3481 -621 -10444 -10667 1237
5434 1237 2020 -2116 -9546 -14412 -9726 -3201 -4818 -721 8126 11893 8747 8275 -4745 -2309 -2347 8027
5418 8027 8707 7447 2920 -3160 -5275 3542 -13985 -23702 -15602 -6386 5605 5061 1167 8727 3222
5403 3222 -6354 -13897 -3013 12076 10481 -647 -6453 -2320 2405 -10751 -10508 -4055 1 -5236
5389 -5236 4316 10056 7911 3910 6905 5121 3019 4310 16756 17770 -3746 -17214 -23896 -14986
5375 -14986 -3967 -3344 -15893 -18590 -33399 -34205 -18461 -4165 -9684 -18970 -26754 -28470 -17472 -12593
5361 -12593 -20073 -13509 -5518 -6533 -1428 -1776 2755 -13743 -38654 -23326 3234 774 -12600 -16129
5347 -16129 -18425 -15966 -16792 -26205 -20677 -150 -438 1344 -1162 -26941 -24950 1856 4487 584
$$ packed form
5449a6970l109k5N73R291k297j0413M693J3031k170m320Q235K860r823k23J1904
5434A237P83m136p430m866M686O525j617M097Q847L767l146m72j3020K436l8J0374
5418H027O80j260m527o080k115Q817j7527r717Q100R216J1991n44l894P560n505
5403C222r576p543J0884J5089j595j1128n806M133M725j3156K43O453M056n237
5389e236R552N740k145m001K995j784k102J291J2446J014k1516j3468o682Q910
5375a4986J1019O23j2549k697j4809q06J5744J4296n519r286p784j716J0998M879
5361a2593p480O564P991j015N105l48M531j6498k4911J5328K6560k460j3374l529
5347a6129k296K459q26r413N528K0527k88J782k506k5779J991K6806K631l903
$$ plain form
5333 584 -6739 -16225 -15862 -17231 -11126 -6995 -10351 -17514 -3265 14436 2313 764 -5798 -13842 -14457
5318 -14457 -10705 -10684 -9946 -9083 -7079 -7892 -14367 -19321 -5806 -5326 3020 -1604 293 7955 13177 -1121
5302 -1121 -22778 -31791 -23304 -22210 -23600 -11019 -12766 -28498 -19605 -9446 -913 4173 -8541 -1433
5288 -1433 3985 -8193 -16227 -19356 -4011 8306 -12595 -30490 -22199 -10742 -7628 -2722 -15093
5275 -15093 -19684 -17695 -23760 -33739 -29103 -25827 -21965 -835 9966 9458 9620 -6036 -20118 -28143
5261 -28143 -29823 -19817 -21553 -33595 -33673 -23646 -23410 -28398 -29025 -30310 -27813 -11972 -14681 -24484 -19795
5246 -19795 -11999 -17733 -13460 -6751 -2272 -3822 -8831 -3879 17747 16462 6495 -5084 -12343 -21654
5232 -21654 -17722 -11552 -17238 -7224 -236 -2734 4053 906 6616 9838 -2098 -10280 2826 7841
$$ packed form
5333E84p323r486L63j369O105M131l356p163J4249J7701j2123j549o562q044o15
5318a4457L752K1P38Q63K004q13o475m954J3515M80Q346m624J897P662N222j4298
5302a121k1657r013Q487J094j390J2581j747j5732Q893J0159Q533N086j2714P108
5288a433N418j2178q034l129J5345J2317k0901j7895Q291J1457L114M906j2371
5275a5093m591J989o065r979M636L276L862K1130J0801n08J62j5656j4082q025
5261b8143j680J0006j736j2042p8J0027K36m988o27j285K497J5841k709r803M689
5246a9795P796n734M273O709M479j550n009M952K1626j285r967j1579p259r311
5232b1654L932O170n686J0014O988k498O787l147N710L222j1936q182J3106N015
$$ plain form
5218 7841 788 4456 8775 9353 -472 -2775 -9174 -11222 -28062 -36832 -29054 -16178 -3654 -4771
5204 -4771 6588 17468 4926 -6085 -22476 -25414 -24834 -23765 -15660 -9423 9855 9057 5571 3050
5190 3050 15717 23528 10604 3597 -1261 -11158 -7143 -2820 -8170 7608 9343 -10835 -19163 -10844
5176 -10844 -9805 -13892 -7018 7177 1843 15014 15053 9668 11175 25003 12685 -14093 -19874 -11193
5162 -11193 11106 11320 16270 25430 16368 6242 -16544 -12843 -4702 -4405 -8349 -5619 5993 11508
5148 11508 12502 11372 21573 10140 -7666 -9275 -21332 -14688 -19072 -28931 -21463 -21971 -23549 -15599
5134 -15599 -4521 -1269 12783 17403 10144 9247 15181 17416 9755 3813 -8546 -6164 -12295 -16150
5120 -16150 -25985 -40909 -39402 -19303 -30362 -30169 -33984 -30312 -27411 -18432 -10839 -3709 -2737 -1064
$$ packed form
5218G841p053L668M319N78r825k303o399k048j6840q770P778J2876J2524j117
5204d771J1359J0880j2542j1011j6391k938N80J069Q105O237J9278p98l486k521
5190C050J2667P811j2924p007m858r897M015M323n350J5778J735k0178q328Q319
5176a0844J039m087O874J4195n334J3171L9n385J507J3828j2318k6778n781Q681
5162a1193K2299K14M950R160r062j0126k2786L701Q141K97l944K730J1612N515
5148A1508R94j130J0201j1433j7806j609j2057O644m384r859P468n08j578P950
5134a5599J1078L252J4052M620p259q97N934K235p661n942j2359K382o131l855
5120a6150r835j4924J507K0099j1059J93l815L672K901Q979P593P130R72J673
$$ plain form
5106 -1064 -1192 6049 3180 -124 4109 6525 -5142 -980 -2020 547 1853 -5064 -3666 3294 -1130
5091 -1130 -11822 -14842 -6276 -153 -9228 -20608 -4071 1966 -1347 7216 13953 10610 6460 3380
5077 3380 -6043 -15137 -3828 -1665 -568 5343 10683 3794 -1193 3610 6135 1324 -14209 -13573 5153
5062 5153 -2203 -9082 -13349 -18039 -3057 6435 159 2447 -2159 -15466 -26209 -28062 -2019 10671
5048 10671 7588 11181 11003 -115 -1694 -3937 -12589 -7750 -12986 -27800 -26926 -25478 -24394 -26022 -21082
5033 -21082 -15372 -3316 1807 -2294 -7256 9869 538 123 -6241 -15585 -18066 -20805 -32250 -35065
5019 -35065 -30789 -18151 -24088 -33569 -23651 -17152 -11349 -9784 -17522 -21801 -13005 -6554 -5492 -17113
5005 -17113 -11909 -1341 -3902 -3897 2390 -6801 -7800 7436 14389 17569 20451 9287 -2709 -10446 -14182
$$ packed form
5106a064j28P241k869l304M233K416j1667M162j040K567J306o917J398O960m424
5091a130j0692l020Q566O123r075j1380J6537O037l313Q563O737l343m150l080
5077C380r423r094J1309K163J097N911N340o889m987M803K525m811j5533O36J8726
5062E153p356o879m267m690J4982R492o276K288m606j3307j0743j853K6043J2690
5048A0671l083L593j78j1118j579k243q652M839n236j4814Q74J448J084j628M940
5033b1082N710J2056N123m101m962J7125r331m15o364r344k481k739j1445k815
5019c5065M276J2638n937r481R918O499N803J565p738m279Q796O451J062j1621
5005a7113N204J0568k561NO287r191r99J5236O953L180K882j1164j1996p737l736
$$ plain form
4990 -14182 -11342 -11314 -4367 2169 -2932 -13441 -19703 -21765 -17611 -17947 -9184 -8795 -4851 -11314 -6536
4975 -6536 -4110 -6034 -7852 -4571 24 -7670 -5475 -11172 -16672 -19142 -11685 -7453 -10260 -17657 -3406
4960 -3406 2176 1258 -10428 -12494 -7618 -7883 4728 -6705 -17041 -18302 -23899 -18225 -7335 -233
4946 -233 2161 10 -12754 -7361 2179 7501 3893 -5429 -5822 -10848 -18438 -28089 -24088 -16694 4533
4931 4533 -3180 -15040 -9644 -1409 -18930 -25379 -7673 -10860 -7717 -1131 3891 -2616 442 -3670
4917 -3670 4703 12254 15052 12865 8165 16596 10792 71 -4416 -9410 -5170 -255 -9006 -9015 -11050
4902 -11050 -20497 -24606 -38839 -46489 -36059 -25072 -16460 -19347 -22139 -7611 -1805 -5551 -8978 -1936
4888 -1936 -1383 -12126 -33540 -30259 -25671 -28870 -37370 -36129 -44528 -44174 -17392 6762 -520 6384
$$ packed form
4990a4182K840K8O947O536n101j0509o262k062M154l36Q763L89L944o463M778
4975f536K426j924j818L281M595p694K195n697n500k470P457M232k807p397J4251
4960c406N582r18j1686k066M876k65J2611j1433j0336j261n597N674J0890P102
4946b33K394k151j2764N393R540N322l608r322l93n026p590r651M001P394K1227
4931D533p713j1860N396Q235j7521o449J7706l187L143O586N022o507L058m112
4917c670Q373P551K798k187m700Q431n804j0721m487m994M240M915q751rk035
4902a1050r447m109j4233p650J0430J0987Q612k887k792J4528N806l746l427P042
4888a936N53j0743k1414L281M588l199q500J241q399L54K6782K4154p282O904
$$ plain form
4874 6384 6071 -1430 -4868 -12009 -13437 2071 -3784 -14282 -24264 -24321 -18651 -17448 -13041 -13688 10146
4859 10146 19832 9423 -187 -11739 -22751 -21418 -23517 -17382 -21067 -20170 -10795 -5433 -12165 -32548
4845 -32548 -27156 -10019 -16008 -21788 -24975 -23093 -2341 10167 8527 9180 724 -18102 -26205 -10744
4831 -10744 3016 -3269 -2173 -10397 -26049 -30992 -20432 -11399 -12142 -10875 -7504 -13253 -29270 -20990
4817 -20990 -28341 -23380 -26511 -25465 -24749 -17142 -16202 -9134 -14354 -15389 -437 -164 4757 -559 920
4802 920 4108 9991 18271 15683 1425 -9691 -3892 -3259 -4204 -4521 -9674 -15099 -9896 -21986 -10593
4787 -10593 -1643 -6336 3385 3470 -3355 3635 3042 -9251 -11335 7147 17960 18398 6095 -2786 -6468
4772 -6468 -5322 1405 8251 8740 9884 17497 18276 4569 3169 7435 1402 1499 -3415 -12940 -13743 -12758
$$ packed form
4874F384l13p501l438p141j428J5508n855j0498r982n7N670J203M407o47K3834
4859A0146R686j0409r610j1552j1012J333k099O135l685Q97R375N362o732k0383
4845c2548N392J7137n989n780l187J882K0752J2508j640O53q456j8826q103J5461
4831a0744J3760o285J096q224j5652m943J0560R033p43J267L371n749j6017Q280
4817b0990p351M961l131J046P16P607R40P068n220j035J4952K73M921n316J479
4802I20L188N883Q280k588j4258j1116N799O33r45l17n153n425N203j2090J1393
4787a0593Q950m693R721Q5o825O990n93j2293k084J8482J0813M38j2303q881l682
4772f468J146O727O846M89J144P613P79j3707j400M266o033R7m914r525q03R85
$$ plain form
4756 -12758 -16273 -15199 -16743 -23502 -20970 -19661 -1931 1120 -6372 -5383 838 -5727 -24786 -16614
4742 -16614 -955 4685 -5515 -19123 -22358 -12134 -15734 -14686 -3437 5237 -1109 -6471 -16372
4729 -16372 -19543 -23742 -21512 -20067 -17376 -18088 -12817 -16027 -17542 -17531 -14567 -16565 -20845 -8904 8690
4714 8690 4147 -2445 6255 9431 13609 10088 17395 5732 6909 8903 5460 -3194 9497 9426 -165
4699 -165 7475 1965 -736 -4718 -12768 -22202 -20559 2969 8466 923 -1158 -6319 -15206 -23072 -16227
4684 -16227 -5079 -3830 -10519 -7030 -2132 2487 -1516 -14387 -19191 -19585 -19321 -17485 -3523 7561
4670 7561 -3532 -27641 -24738 -14755 -10109 -18304 -21213 -6046 16385 14509 1379 8199 8977 1471
4656 1471 -2205 421 -683 -4030 -6956 -14365 -26776 -27330 -23055 -4658 -4362 -8304 -5899 -12473 -22322
$$ packed form
4756a2758l515J074j544o759K532J309J7730L051p492R89O221o565j9059Q172
4742a6614J5659N640j0200j3608l235J0224l600J048J1249Q674o346n362r901
4729a6372l171m199K230J445K691p12N271l210j515J1K964j998m280J1941J7594
4714H690m543o592Q700L176M178l521P307j1663J177J994l443q654J2691p1r591
4699a65P640n510k701l982q050r434J643K3528N497p543k081n161q887p866O845
4684a6227J1148J249o689L489M898M619m003j2871m804l94K64J836J3962J1084
4670G561j1093k4109K903R983M646q195k909J5167K2431j876j3130O820P78p506
4656A471l676K626j104l347k926p409j2411n54M275J8397K96l942K405o574r849
$$ plain form
4641 -22322 -16946 9152 23712 18645 10459 -2086 -16534 -27352 -35134 -16601 -13069 -24981 -17094
4628 -17094 -14123 -11545 7944 14750 -784 -13223 -10649 -12264 -1716 2878 7322 10877 -8278
4615 -8278 -30856 -33675 -28880 -32994 -35379 -28240 -21570 -19976 -11876 -2968 -21178 -23310 -13622 -13661 -10298
4600 -10298 -3769 196 3464 10671 17180 6579 1720 -3239 -11603 -7605 790 -3123 -4261 976
4586 976 6312 5857 -8660 -19467 -15058 -18398 -14916 -21308 -18646 -11585 -6868 -511 -3208 -2399 -2467 -7281
4570 -7281 -18166 -24604 -22242 -25854 -21455 -20629 -29328 -25016 -14007 -5135 -10234 -6021 12411 13269 5565
4555 5565 9151 16024 8607 -1829 -2894 2354 -935 -19387 -29038 -20700 -1475 3945 3629 4461 5808
4540 5808 -11137 -23502 -19452 -9048 7710 6214 2164 -808 4036 5306 -993 -5882 1435 10793
$$ packed form
4641b2322N376K6098J4560n067q186j2545j4448j0818p782J8533L532j1912P887
4628a7094K971K578J9489O806j5534j2439K574j615J0548M594M444L555j9155
4615h278k2578k819M795m114k385P139O670J594Q100Q908j8210k132R688l9L363
4600a0298O529L965L268P207O509j0601m859m959q364L998Q395l913j138N237
4586I76N336m55j4517j0807M409l340L482o392K662P061M717O357k697Q09o8m814
4570g281j0885o438K362l612M399Q26q699M312J1009Q872n099M213J8432Q58p704
4555E565L586O873p417j0436j065N248l289j8452r651Q338J9225N420l16Q32J347
4540E808j6945j2365M050J0404J6758j496m050k972M844J270o299m889P317R358
$$ plain form
4526 10793 19752 8068 106 -3182 -18798 -28552 -25581 -12360 -6833 -8894 -12244 -8886 8120 9153
4512 9153 -4672 -16414 -15799 -8010 5951 4189 2418 -672 8376 5922 -12471 -11161 1755 -8859
4498 -8859 -10430 -12539 -1100 6947 -8510 -17235 -16376 -9172 -626 -4367 -12556 -9835 -3889 -4141 -10686
4483 -10686 -16914 -19912 -12321 8263 15028 1698 -714 -6226 -11554 -6156 -8504 -9856 151 3001
4469 3001 -3221 2023 -10813 -25598 -33495 -28145 -20646 -1649 -10987 -21591 -21671 -32450 -32226 -25276
4455 -25276 -22421 -9052 -14029 -8801 863 -4962 -4967 -16544 -21530 -11410 -1528 -3782 -12393 -13149 -7978
4440 -7978 -6791 -627 4818 2975 3656 5062 -2983 -14442 -12330 72 850 -1996 7873 8651 -12014
4425 -12014 -15046 -4372 8227 9431 11370 18758 3165 -4862 -2107 -6835 -5187 -6463 -11315 -9965
$$ packed form
4526A0793Q959j1684p962l288j5616r754K971J3221N527k061l350L358J7006J033
4512I153j3825j1742O15P789J3961j762j771l090R048k454j8393J310J2916j0614
4498h859j571k109J1439Q047j5457q725Q59P204Q546l741q189K721N946k52o545
4483a0686o228k998P591K0584O765j3330k412n512n328N398k348j352J0007K850
4469C001o222N244j2836j4785p897N350P499J8997r338j0604q0j0779K24O950
4455b5276K855J3369m977N228R664n825nj1577m986J0120R882k254q611p56N171
4440g978J187O164N445j843O81J406q045j1459K112J2402P78k846R869P78k0665
4425a2014l032J0674J2599J204J939P388j5593q027K755m728J648j276m852J350
$$ plain form
4411 -9965 -6063 -6471 -18124 -17986 -19823 -17414 -26143 -17392 -13003 2229 7999 6390 -6097 -24008
4397 -24008 -29092 -30282 -36499 -20568 -8971 -8239 -10913 -3123 7542 10915 -1256 -26187 -32228 -23407
4383 -23407 -9065 6830 6107 -4681 2731 6394 21763 26859 12442 11732 8587 13734 24320 23321
4369 23321 6037 -6996 -10360 2674 999 123 1023 2088 -2839 -1159 4305 9249 7431 -3049
4355 -3049 -12891 -21385 -14992 -9844 -15873 -16895 -5708 -9059 -9516 -5754 -1390 12884 19288 26778 22911
4340 22911 19782 5249 -6529 -12828 -6154 1773 15423 25194 14989 -5852 -17341 -8853 -5965
4327 -5965 -12055 -4065 -11719 -8612 -5432 -10648 -5573 1240 -259 12515 12195 -4975 -21682 -14837
4313 -14837 2851 814 6058 -5479 -17711 -4392 5691 8414 320 8243 5326 2094 -10571
$$ packed form
4411i965L902m08j1653J38j837K409q729Q751M389J5232N770j609j2487j7911
4397b4008n084j190o217J5931J1597P32k674P790J0665L373j2171k4931o041Q821
4383b3407J4342J5895p23j0788P412L663J5369N096j4417p10l145N147J0586r99
4369B3321j7284j3033l364J3034j675q76R00J065m927J680N464M944j818j0480
4355c049r842q494O393N148o029j022J1187l351m57L762M364J4274O404P490l867
4340B2911l129j4533j1778o299O674P927J3650R771j0205k0841j1489Q488K888
4327e965o090P990p654L107L180n216N075O813j499J2774l20j7170j6707O845
4313a4837J7688k037N244j1537j2232J3319J0083K723q094P923k917l232j2665
$$ plain form
4300 -10571 3580 10171 -952 -14242 -30107 -24445 -23401 -11853 -7681 -15326 -12293 18 -4734
4287 -4734 -10946 -9641 -13594 -5032 -2008 -13204 -17679 -4575 5061 -4111 -2549 189 -1212 4588
4273 4588 14895 4932 -5753 184 10789 11962 -596 -3725 -14699 -18593 -23299 -17823 -11268 -7156
4259 -7156 -12118 -13489 -22834 -24624 -21049 -20617 -14914 1019 -6311 -12257 -18863 -25722 -26879 -30710 -12187
4244 -12187 -360 -4975 -10652 -5549 -16316 -22375 -14390 -20945 -26916 -22723 -28864 -27485 -25595 -17418
4230 -17418 -5825 11778 12937 2162 -25 1897 -6392 -7843 -5549 -8682 -11371 -10957 -1441 2229
4216 2229 6367 3445 395 -3262 -7444 -15006 -1358 -4809 -8812 2393 17434 6115 -1906 4540
4202 4540 -8259 -13253 585 -1264 413 1261 -2887 4380 1026 -3466 -9914 -7351 -3566 -1769 -8792
$$ packed form
4300a0571J4151O591j1123j3290j5865N662J044J1548M172p645L033J2311m752
4287d734o212J305l953Q562L024j1196m475J3104R636r172J562K738j401N800
4273D588J0307r963j0685N937J0605J173j2558l129j0974l894m706N476O555M112
4259g156m962j371r345j790L575M32N703J5933p330n946o606o859j157l831J8523
4244a2187J1827m615n677N103j0767o059P985o555n971M193o141J379J890Q177
4230a7418J1593J7603J159j0775k187J922q289j451K294l133k689M14R516L670
4216B229M138k922l050l657m182p562J3648l451m003J1205J5041j1319q021O446
4202D540j2799m994J3838j849J677Q48m148P267l354m492o448K563L785J797p023
$$ plain form
4187 -8792 -7012 -9476 -13892 -11182 -8763 -25152 -28058 -33850 -22404 -3786 -8148 -12649 -16058 -4888
4173 -4888 7026 15337 14530 9128 2691 9569 2579 5915 -589 2741 4097 1023 -8429 -26300 -8462
4158 -8462 10379 11499 -4890 -13756 -7278 -13717 -16772 -14140 -7996 -16585 -20930 -20296 -18806 -17728 -13049
4143 -13049 -2036 4880 8562 12146 15316 12203 4533 -4446 -1613 -7571 1248 13540 3000 -5914
4129 -5914 -2941 1447 14394 17620 9907 12393 14440 14743 10775 6942 -1194 -15786 -10532 -10192 -10227
4114 -10227 -10618 2782 541 -22 56 9270 13392 -7949 -5477 7329 2603 3836 451 -8596 141
4099 141 7412 -2479 -17865 -25925 -22947 -14185 -9953 -14253 -12229 -7375 -5502 -14421 -19334 -15772 -8299
4084 -8299 -7455 -16259 -18674 -8381 -6887 7826 22146 18591 13295 -2540 2885 -164 -13492 -17479
$$ packed form
4187h792J780k464m416K710K419j6389k906n792J1446J8618m362m501l409J1170
4173d888J1914Q311q07n402o437O878o990L336o504L330J356l074r452j7871J7838
4158h462J8841J120j6389q866O478o439l055K632O144q589m345O34J490J078M679
4143a3049J1013O916L682L584L170l113p670q979K833n958Q819J2292j0540q914
4129e914K973M388J2947L226p713K486K047L03l968l833q136j4592N254L40l5
4114a0227l91J3400k241n63P8R214M122k1341K472J2806m726J233l385r047Q737
4099A41P271r891j5386q060K978Q762M232m300K024M854J873q919m913L562P473
4084h299Q44q804k415J0293J494J4713J4320l555n296j5835N425l049j3328l987
$$ plain form
4070 -17479 -280 11702 15123 7899 7323 -2553 -10529 -5623 -13752 -15240 -30410 -38555 -40479 -34127
4056 -34127 -30351 -27514 -20560 -21187 -23311 -16891 -11832 4556 10130 -4723 -19795 -16390 -9245 -7919
4042 -7919 -10032 -16339 -7266 -472 11077 14916 13657 10126 5727 -8396 -1210 11426 20718 18588
4028 18588 4161 1660 -14385 -18642 -7508 -6378 -6336 -2661 -9103 -15141 -9243 9602 17254 22814
4014 22814 18423 -707 -5929 284 5503 -15649 -18374 -9504 1138 646 -3607 -9998 -9648 -13783
4000 -13783 -12962 -3685 -4098 9070 12633 13324 -4744 -15081 -15515 -10129 -11181 -10851 -10747 -19503 -20583
3985 -20583 -21315 -11398 684 -14119 -20501 -19629 -28376 -33182 -20465 -19095 -26540 -14201 -13399 -18390
3971 -18390 -9854 -3812 6874 3015 1398 -6310 -10825 -14186 -8279 -10421 -11646 -8502 -669 -4253
$$ packed form
4070a7479J7199J1982L421p224n76r876p976M906q129j488j5170q145j924O352
4056c4127L776K837O954o27k124O420N059J6388N574j4853j5072L405P145J326
4042g919k113o307R073O794J1549L839j259l531m399j4123P186J2636R292k130
4028A8588j4427k501j6045m257J1134J130M2L675o442o038N898J8845P652N560
4014B2814m391j9130n222O213N219k1152k725Q870J0642m92m253o391L50m135
4000a3783Q21R277m13J3168L563O91j8068j0337m34N386j052L30J04q756j080
3985b0583p32R917J2082j4803o382Q72q747m806J2717J370p445J2339Q02m991
3971a8390Q536O042J0686l859j617p708m515l361N907k142j225L144P833l584
$$ plain form
3957 -4253 -6629 973 4151 -1233 -13539 -13813 -5190 -584 -4040 -5318 -4827 -12250 -16490 -22687 -13021
3942 -13021 -8175 -11418 -11891 -2090 -14836 -22922 -24773 -13883 -10429 -6434 5776 24516 28233 26628
3928 26628 19042 14594 12293 15029 3856 145 -3611 -4909 -9014 6373 10472 8354 19264 18221
3914 18221 12378 930 -5909 -18271 -10738 -6760 -17129 -19969 -19969 -14373 -19704 -25243 -10426 -5097
3900 -5097 -4061 1178 316 -3518 -2640 -1416 1822 4183 6740 2619 15585 4972 -7124 -6787 3508
3885 3508 12130 3174 8359 5250 -409 -5582 1929 5185 -3645 -17287 -12271 -9248 -11849 -11238 -12635
3870 -12635 -20562 -26171 -24231 -17107 -13817 -13808 -9667 -10606 -11162 -6542 6459 4263 3679 12960 23289 11094
3854 11094 -5971 -8431 -6234 -13302 226 3269 2804 10456 11799 7404 -3578 -8401 -4312 1721
$$ packed form
3957d253k376P602L178n384j2306k74Q623M606l456j278M91p423m240o197R666
3942a3021M846l243m73R801j2746q086j851J0890L454L995J2210J8740L717j605
3928B6628p586m448k301K736j1173l711l756j298m105J5387M099k118J0910j043
3914A8221n843j1448o839j2362P533L978j0369k840%N596n331n539J4817N329
3900e097J036N239q62l834Q78J224L238K361K557m121J2966j0613j2096L37J0295
3885C508Q622q956N185l109n659n173P511L256q830j3642N016L023k601O11j397
3870a2635p927n609J940P124L290RM141r39n56M620J3001k196n84R281J0329j2195
3854A1094j7065k460K197p068J3528L043m65P652J343m395j0982m823M089O033
$$ plain form
3840 1721 15514 9872 -10879 -8772 -7607 -8410 -4974 5455 13469 15196 17513 11223 4751 5021 6136
3825 6136 2655 10091 16935 -3781 -14786 -3150 -3244 -7264 -3395 -9759 -8121 -790 540 6613 9911
3810 9911 9688 -2536 -11907 -19754 -21492 -12666 -16943 -24484 -3947 8446 4578 3152 6837 -2493
3796 -2493 -13348 -18319 -14409 -11433 -20065 -35168 -34126 -29967 -15319 -7831 -4119 -2078 1837 -2112
3782 -2112 -14084 -19146 -16462 -22401 -16511 -13147 -20121 -12274 -2666 5165 5162 9315 9416 -4368 -5188 9474
3766 9474 7843 -2239 -8246 -13719 -6693 6846 8911 6938 12312 10857 -4970 -3074 9255 6636
3752 6636 -7672 -11978 -4112 893 9891 20833 11140 6774 8510 1781 -914 -6937 -5954 -2082 1164
3737 1164 1156 1353 -1737 -13910 -16322 -20155 3336 5914 2744 1916 4767 1240 958 5875 11589 6867
$$ packed form
3840A721J3793n642k0751K107J165q03L436J0429Q014J727K317o290o472K70J115
3825F136l481P436O844k0716j1005J1636r4m020L869o364J638P331J330O073L298
3810I911k23j2224r371p847j738Q826m277p541K0537J2393l868j426L685r330
3796b493j0855m971L910K976q632j5103J042M159J4648P488L712K041L915l949
3782b112j1972n062K684n939N890L364o974P847R608P831lM153J01j3784q20J4662
3766I474j631j0082o007n473P026J3539K065j973N374j455j5827J896J2329k619
3752F636j4308m306P866N005Q998J0942r693m366J736o729k695o023R83L872L246
3737A164qJ97l090j2173k412l833K3491K578l170q28K851l527k82M917N714m722
$$ plain form
3721 6867 3105 8220 5998 15064 7143 1377 -907 -16911 -30075 -41931 -31104 -23877 -11996 5809
3707 5809 10540 8490 2686 -7180 -6810 1437 6933 -3003 -15616 -2150 6734 3240 867 -7630 -6106
3692 -6106 -12385 -12271 2995 9770 6986 12515 6743 7344 4781 3256 -1729 1954 -4781 -14315 -10753
3677 -10753 7477 14573 5478 8072 3290 -2373 -1940 -8967 -11808 -17215 -11195 -6357 -3931 2247 454
$$ packed form
3721F867l762N115k222R066p921n766k284j6004j3164j1856J0827P227J1881J7805
3707E809M731k050n804r866L70Q247N496r936j2613J3466Q884l494k373q497J524
3692f106o279J14J5266O775k784N529n772O01k563j525m985L683o735r534L562
3677a0753J8230P096r095K594m782n663M33p027k841n407O020M838K426O178j793
$$ [...]
##END NTUPLES=NMR SPECTRUM
##END=
