##TITLE=Analysis number 326599
Compound Code cc 61214
Book Reference 483/116
Project Code adrs
Chemist Name mattw
##JCAMPDX= 6.0         $$ Bruker NMR JCAMP-DX V2.0
##DATA TYPE= NMR SPECTRUM
##DATA CLASS= NTUPLES
##ORIGIN= Bruker BioSpin GmbH
##OWNER= nmr
$$ XWIN-NMR		Version 3.5
$$ Wed Feb 14 12:38:32 2007 GMT Standard Time (UT+0h)  MAYBRIDGE\nmr@NMR_250MHZ
##.OBSERVE FREQUENCY= 250.131544655141
##.OBSERVE NUCLEUS= ^1H
##.ACQUISITION MODE= SIMULTANEOUS (DQD)
##.ACQUISITION SCHEME= undefined
##.AVERAGES= 16
##.DIGITISER RES= 18
##SPECTROMETER/DATA SYSTEM= dpx250
##.PULSE SEQUENCE= zg30
##.SOLVENT NAME= CDCl3
##.SHIFT REFERENCE= (INTERNAL, CDCl3, 0, 16.522)
##AUDIT TRAIL= $$ (NUMBER, WHEN, WHO, WHERE, WHAT)
$$ ##TITLE= Audit trail, XWIN-NMR		Version 3.5
$$ ##JCAMPDX= 5.01
$$ ##ORIGIN= Bruker BioSpin GmbH
$$ ##OWNER= nmr
$$ C:\u/data/dgb/nmr/ADRS/890/pdata/1/auditp.txt
$$ ##AUDIT TRAIL=  $$ (NUMBER, WHEN, WHO, WHERE, WHAT)
(   1,<2007-02-14 12:37:53.86 +000>,<MAYBRIDGE\nmr>,<NMR_250MHZ>,
      <created by zg, POWCHK disabled, PULCHK disabled
       configuration hash MD5:
       49 4B E0 1D 92 C2 6B 37 9F E6 65 BC 52 41 86 1D
       data hash MD5: 64K
       80 58 5C 84 41 29 BC 2E 2B ED 66 48 33 47 3B BD>)
(   2,<2007-02-14 12:38:13.59 +000>,<MAYBRIDGE\nmr>,<NMR_250MHZ>,
      <Start of raw data processing
       ef LB = 0.3 FT_mod = 6 PKNL = 1 SI = 32K 
       data hash MD5: 32K
       E7 D1 9F B0 EE C1 FC 7D F0 E8 91 BF FE AD E5 F3>)
(   3,<2007-02-14 12:38:18.79 +000>,<MAYBRIDGE\nmr>,<NMR_250MHZ>,
      <apk 
       data hash MD5: 32K
       D3 36 40 13 21 96 1C 5F B3 89 B1 6F A9 66 E2 FD>)
(   4,<2007-02-14 12:38:21.04 +000>,<MAYBRIDGE\nmr>,<NMR_250MHZ>,
      <abs ABSG = 5 
       data hash MD5: 32K
       97 0D 12 6E 26 13 76 B7 12 19 D4 FA BE E4 F4 14>)
$$ ##END=
$$ 
$$ hash MD5
$$ EE B0 4B A5 80 65 0E 0E 02 1E 65 44 27 96 2E DC
##$RELAX= 
##$RELAX= 
##$RELAX= 
##$RELAX= 
##$RELAX= 
##$RELAX= 
##$RELAX= 
$$ Bruker specific parameters
$$ --------------------------
##$DU= <C:\u>
##$EXPNO= 890
##$NAME= <ADRS>
##$PROCNO= 1
##$TYPE= <nmr>
##$USER= <dgb>
##$AMP= (0..31)
100 100 100 100 100 100 100 100 100 100 100 100 100 100 100 100 100 100 
100 100 100 100 100 100 100 100 100 100 100 100 100 100 
##$AQSEQ= 0
##$AQ_mod= 3
##$AUNM= <au_zg>
##$AUTOPOS= <55 >
##$BF1= 250.13
##$BF2= 250.13
##$BF3= 250.13
##$BF4= 250.13
##$BF5= 500.13
##$BF6= 500.13
##$BF7= 500.13
##$BF8= 500.13
##$BYTORDA= 1
##$CFDGTYP= 0
##$CFRGTYP= 5
##$CHEMSTR= <none>
##$CNST= (0..31)
1 1 145 1 1 1 1 1 1 1 1 1 1 1 1 1 1 1 1 1 1 1 1 1 1 1 1 1 1 1 1 1 
##$CPDPRG= <>
##$CPDPRG1= <>
##$CPDPRG2= <>
##$CPDPRG3= <>
##$CPDPRG4= <mlev>
##$CPDPRG5= <mlev>
##$CPDPRG6= <mlev>
##$CPDPRG7= <mlev>
##$CPDPRG8= <mlev>
##$CPDPRGB= <>
##$CPDPRGT= <>
##$D= (0..31)
0 1 0 0 0 0 0 0 0 0.06 0 0 0 0 0 0 0.0002 0 0 0 0 0 0 0 0 0 0 0 0 0 0 
0 
##$DATE= 1171456672
##$DBL= (0..7)
120 120 120 120 120 120 120 120 
##$DBP= (0..7)
150 150 150 150 150 150 150 150 
##$DBP07= 0
##$DBPNAM0= <>
##$DBPNAM1= <>
$$ [...]
##$SUBNAM7= <"">
##$SUBNAM8= <"">
##$SUBNAM9= <"">
##$SW= 20.6930455092707
##$SWIBOX= (0..15)
0 0 3 0 0 0 0 0 0 0 0 0 0 0 0 0 
##$SW_h= 5175.983436853
##$TD= 65536
##$TD0= 1
##$TE= 295.16
##$TE2= 300
##$TE3= 300
##$TEG= 300
##$TL= (0..7)
0 120 120 120 120 120 120 120 
##$TP= (0..7)
150 150 150 150 150 150 150 150 
##$TP07= 0
##$TPNAME0= <>
##$TPNAME1= <>
##$TPNAME2= <>
##$TPNAME3= <>
##$TPNAME4= <>
##$TPNAME5= <>
##$TPNAME6= <>
##$TPNAME7= <>
##$TPOAL= (0..7)
0.5 0.5 0.5 0.5 0.5 0.5 0.5 0.5 
##$TPOFFS= (0..7)
0 0 0 0 0 0 0 0 
##$TUNHIN= 0
##$TUNHOUT= 0
##$TUNXOUT= 0
##$USERA1= <user>
##$USERA2= <user>
##$USERA3= <user>
##$USERA4= <user>
##$USERA5= <user>
##$V9= 5
##$VALIST= <valist>
##$VCLIST= <CCCCCCCCCCCCCCC>
##$VD= 0
##$VDLIST= <DDDDDDDDDDDDDDD>
##$VPLIST= <PPPPPPPPPPPPPPP>
##$VTLIST= <TTTTTTTTTTTTTTT>
##$WBST= 1024
##$WBSW= 4
##$XGAIN= (0..3)
0 0 0 0 
##$XL= 0
##$YL= 0
##$YMAX_a= 297971
##$YMIN_a= -359753
##$ZGOPTNS= <>
##$ZL1= 120
##$ZL2= 120
##$ZL3= 120
##$ZL4= 120
##$ABSF1= 16.522
##$ABSF2= -4.171173
##$ABSG= 5
##$ABSL= 3
##$ALPHA= 0
##$AQORDER= 0
##$ASSFAC= 0
##$ASSFACI= 0
##$ASSFACX= 0
##$ASSWID= 0
##$AUNMP= <proc_1d>
##$AZFE= 0.1
##$AZFW= 0.1
##$BCFW= 0
##$BC_mod= 0
##$BYTORDP= 0
##$COROFFS= 0
##$CY= 12.5
##$DATMOD= 1
##$DC= 0
##$DFILT= <>
##$DTYPP= 0
##$F1P= 14.0000005364418
##$F2P= -0.99999901652339
##$FCOR= 0.5
##$FTSIZE= 32768
##$FT_mod= 6
##$GAMMA= 0
##$GB= 0
##$INTBC= 1
##$INTSCL= 1
##$ISEN= 128
##$LB= 0.3
##$LEV0= 0
##$LPBIN= 0
##$MAXI= 10000
##$MC2= 0
##$MEAN= 0
##$ME_mod= 0
##$MI= 0
##$NCOEF= 0
##$NC_proc= -3
##$NLEV= 6
##$NOISF1= 0
##$NOISF2= 0
##$NSP= 0
##$NTH_PI= 0
##$NZP= 0
##$OFFSET= 16.522
##$PC= 1
##$PHC0= 232.137
##$PHC1= 6.159949
##$PH_mod= 1
##$PKNL= yes
##$PPARMOD= 0
##$PSCAL= 4
##$PSIGN= 0
##$REVERSE= no
##$SF= 250.13
##$SI= 32768
##$SIGF1= 0
##$SIGF2= 0
##$SINO= 400
##$SIOLD= 32768
##$SREGLST= <1H.CDCl3>
##$SSB= 0
##$STSI= 32768
##$STSR= 0
##$SW_p= 5175.98343685301
##$SYMM= 0
##$S_DEV= 0
##$TDeff= 65536
##$TDoff= 0
##$TI= <Analysis number 999999
Compound Code 99
Book Reference 9
Project Code 9>
##$TILT= no
##$TM1= 0
##$TM2= 0
##$TOPLEV= 0
##$USERP1= <user>
##$USERP2= <user>
##$USERP3= <user>
##$USERP4= <user>
##$USERP5= <user>
##$WDW= 1
##$XDIM= 32768
##$YMAX_p= 458942133
##$YMIN_p= -167319
$$ End of Bruker specific parameters
$$ ---------------------------------
##NTUPLES= NMR SPECTRUM
##VAR_NAME=  FREQUENCY,     SPECTRUM/REAL,   SPECTRUM/IMAG
##SYMBOL=    X,             R,               I
##VAR_TYPE=  INDEPENDENT,   DEPENDENT,       DEPENDENT
##VAR_FORM=  AFFN,          ASDF,            ASDF
##VAR_DIM=   32768,         32768,           32768
##UNITS=     HZ,            ARBITRARY UNITS, ARBITRARY UNITS
##FACTOR=    0.157963299565203, 1,           1
##FIRST=     4132.6476996994, 0,             0
##LAST=      -1043.33573715361, 0,           0
##MIN=       -1043.33573715361, -167319,     0
##MAX=       4132.6476996994, 458942133,     0
$$ Real data points
##PAGE= N=1
##DATA TABLE= (X++(R..R)), XYDATA
$$ [...]
15998a3949k9707L5780o218j9642j582P119J2791L2703l675j5701m263J0020J3020
15985A6696k2613j8954q201k778M525o078j6263r923L0697L0197o794o675m1880
15972e8044j323K1017L5558J2106k488l1644l4000K476m172L2369L7847J6396
15960B6098K5005q445q557k2429p382j1016r24n3017J3054M6788p948J4851J5324
15947B1402P023l7831m2658K6381M9126N1379L7764l6863n2457k4234L6912k4766
15935A1178J8792j541o122k7487k5683k1672k3128P8724J3987J2480J3214l6125
15923F617n9224J5079L6283j6515l058M4833L0574j6181m3867n8299J5865M0942
15911f951M3627m9659n6977J5499J6664p235j1980M0305K840m4199J3089J4771
$$ plain form
15998 -13949 -43656 -7876 -14094 -33736 -35318 -28199 -15408 17295 13620 -2081 -6344 3676 16696
15985 16696 -5917 -24871 -33072 -35850 -31325 -37403 -53666 -63589 -32892 -2695 -9489 -16164 -58044
15972 -58044 -59367 -38350 -2792 9314 6826 -24818 -58818 -56342 -60514 -28145 9702 26098
15960 26098 51103 42658 34101 11672 4290 -6726 -7650 -60667 -47613 -825 -8773 6078 21402
15947 21402 28425 -9406 -52064 -25683 23443 74822 112586 75723 23266 -968 35944 11178
15935 11178 29970 28429 22307 -5180 -30863 -52535 -75663 3061 17048 29528 42742 6617
15923 6617 -52607 -37528 -1245 -17760 -20818 24015 54589 38408 -5459 -63758 -47893 -6951
15911 -6951 36676 -12983 -69960 -54461 -37797 -45032 -57012 -16707 -13867 -58066 -44977 -30206
15899c0206L2152k8090n043P170j1533L3962K7697P278k7081k7942m1641q457
15887g1734j2725k2128R194N8012L2488J1145o06j5712K547R3j4856J9820m5041
15874d9503l5974J7270L2771K2360k7131P204J2222j3471N663m665o3450p011
15862a03715M3831J1903J4660N890P2516j7912M7817N082P551k9749o4063l4708
15850d0897K2539j3972m1231K558j7119K7083k4399K1197o073K1329N0236K8484
15838B9735j4642k5401k4104o836j6248j4942q741J1390L7659q204l4066k4204
15826i8604O967N9774K7143M28M669K6308N088m2331j0115j87q859j832K5797
15813e754K4875P841j4765m8436J091M1311k0425j0631M4384J7335k3103k9776
$$ plain form
15899 -30206 1946 -26144 -31187 -24017 -35550 -1588 26109 33387 6306 -21636 -63277 -71734
15887 -71734 -84459 -106587 -97393 -39381 -6893 4252 3646 -12066 -9519 -9426 -24282 -4462 -49503
15874 -49503 -85477 -68207 -35436 -13076 -40207 -33003 -20781 -34252 -28589 -33254 -96704 -103715
15862 -103715 -59884 -47981 -33321 -27431 45085 27173 74990 80072 87623 57874 -6189 -40897
15850 -40897 -18358 -32330 -73561 -71003 -88122 -61039 -85438 -64241 -70314 -48985 1251 29735
15838 29735 15093 -10308 -34412 -41248 -57496 -72438 -81179 -69789 -32130 -40334 -74400 -98604
15826 -98604 -91637 -31863 -4720 -4292 377 26685 31773 -10558 -20673 -20860 -29719 -31551 -5754
15813 -5754 19121 26962 12197 -36239 -35148 6163 -14262 -24893 19491 36826 13723 -16053
15801a6053k691L4389J1294l8561k337K6204k5026q212N514J6019l5589k4191
15789e9240N4902J8706J1275j8381n254N21k2786J6292K3303K6647m06J737m2373
15776D943l7050r815N815q19K185N3398K0661j6419k8425p284Q016J046M054k0286
15762a9980j4502R953Q409k5901j3434k1490M6641K9386J6780K4422M6887j9610
15750F7561l9863q318k335l1840J2324K2220J3312L954k6731J1008r232J3330
15738B5390L0605m3572p4389L289Q839K2971J2320n6729M403M6623O0592K0970
15726F1312k9508j2589N190J1198p3523p7039J7315j4688k0334J00760L5394P309
15714A0797J8664m121k8017J1175k0585J8377n0114l0727R343L9914j2314m3514
$$ plain form
15801 -16053 -18744 15645 26939 -11622 -13959 12245 -12781 -20993 -15479 540 -35049 -59240
15789 -59240 -4338 14368 25643 7262 2008 2529 -20257 -3965 19338 45985 45579 47316 4943
15776 4943 -32107 -41922 -36107 -36926 -34741 18657 39318 22899 -5526 -12810 -4794 -3748 306 -19980
15762 -19980 -34482 -24529 -16120 -42021 -55455 -76945 -30304 -918 15862 40284 87171 67561
15750 67561 27698 19380 17045 -14795 -2471 19749 33061 37015 10284 21292 12060 25390
15738 25390 55995 12423 -61966 -58677 -49838 -26867 -14547 -71276 -66873 -20250 40342 61312
15726 61312 31804 19215 24405 35603 -37920 -114959 -97644 -112332 -132666 -31906 3488 10797
15714 10797 29461 25340 -2677 8498 -12087 6290 -43824 -74551 -65208 -25294 -37608 -81122
15702h1122l829K2768M8524m807n066J6034J2857J1286J0606P613j00q126M360
15689C0998J6554j4112j9761r756n8273P281J4846J8682Q473N730M1019K6152
15677F7833k4412l8874l2343M094K5655m8829n4193J5098J6638j315K6529K7147
15665a6972k3181m0534L3331L4449k5111M6479K488j7168K6889P34l5559j6952
15653c1107j9998J7472L8382K2621k6085l7305J5742J5742j395m274k99J9144
15641H640j7634j5171J8607J695l5425K957M4983k2222l0887j4748P591P3372
15629B1758N0892j9191q835n0405j0524L2884k958k5879J510k295J8736J2231
15617A7924J6124L919m6455j4559J2719j1302j568l0352J8934M440p745L8573
$$ plain form
15702 -81122 -84951 -62183 -13659 -18466 -23532 -7498 5359 16645 27251 34864 34764 26638 30998
15689 30998 47552 33440 13679 3923 -54350 -47069 -32223 -13541 -5068 662 41681 67833
15677 67833 43421 4547 -27796 -23702 1953 -46876 -101069 -85971 -69333 -70648 -44119 -16972
15665 -16972 -40153 -80687 -47356 -12907 -38018 8461 10949 -6219 20670 21404 -14155 -31107
15653 -31107 -51105 -33633 4749 27370 1285 -36020 -20278 -4536 -5931 -10205 -10504 8640
15641 8640 -8994 -24165 -5558 -3863 -39288 -36331 8652 -13570 -44457 -59205 -51614 21758
15629 21758 72650 53459 44624 -5781 -16305 16579 13621 -12258 -10748 -13043 5693 17924
15617 17924 34048 37967 -8488 -23047 -10328 -21630 -23198 -53550 -34616 -30176 -37921 652
15605F52j8509k9927k091j7483k8270M2307N4160j4948R023j5490l318J6411K1062
15592A3579j1803l9219K0665K6336l6473q936M1646L3244J8810l0291l3018m1511
15580d6971P541N2129K5326J6187j0194k7726j8143q436K5308K5759J3947l7985
15568A6742n285q315J4750j8304j1733m1247k6531n655J2492M7192M1028P047
15556B2181n562N3101j7908k0396J8979k1145L948J3586J342j4795k6406m0661
15544c3736k2090j4793N8631J3623k3053j3220j2080k1807J9524Q485J2539k0287
15532d8264K238J9037m96K2141M44M120q051R302K2581M382j1395L0869K6282
15519G3190m3316l9602L5851M68l3229l5050O0144K5462l4318O4320M1461o345
$$ plain form
15605 652 -17857 -47784 -49875 -67358 -95628 -53321 839 -14109 -5086 -20576 -23894 -7483 13579
15592 13579 1776 -37443 -16778 9558 -26915 -35851 5795 39039 57849 27558 -5460 -46971
15580 -46971 -39430 12699 38025 54212 44018 16292 -1851 -10287 15021 40780 54727 16742
15568 16742 11457 3142 17892 -412 -12145 -53392 -79923 -85578 -73086 -25894 15134 22181
15556 22181 16619 69720 51812 31416 50395 29250 33198 46784 48126 33331 6925 -33736
15544 -33736 -55826 -70619 -11988 1635 -21418 -34638 -46718 -68525 -49001 -40516 -27977 -48264
15532 -48264 -46026 -26989 -27485 -5344 -4900 -780 -8831 471 23052 27434 16039 46908 73190
15519 73190 29874 -9728 26123 26591 -6638 -41688 18456 43918 9600 73920 115381 109036
15507A09036m6163k8603k5551m5303j2890j2842R647P325Q357J6452j7238j8687
15495e6460K3971L9855M0198j7551o4627m1547P105M8583M6389J2490l2382N343
15483A1367j1496j3884L6618M5126p287n1124j8613q947P993R823K2705l4675
15471a2394j6879N5852K0161P321n0557n267L8026j7365m3979L0422Q056j5613
15459b216P287J9255k6038j9568K8936K9260m3063j5235L1289J1956J180J9421
15447D2464j4272m4935Q862J1706L2640L0486J9773j8906j4339j5217J41r879
15435B8524j1168j2654o820l0102K7836L2165K679k1206j5374N549k406l2098
15423c5075L398N1368K3973M4673j2450k5986P215n564n8501l9243j0461k790
$$ plain form
15507 109036 62873 34270 8719 -36584 -49474 -62316 -52669 -45344 -36987 -20535 -37773 -56460
15495 -56460 -32489 7366 47564 30013 -34614 -76161 -69056 -20473 25916 38406 6024 11367
15483 11367 -129 -14013 22605 67731 60444 9320 -9293 -18240 -10247 -424 22281 -12394
15471 -12394 -29273 26579 46740 54061 3504 -1763 36263 18898 -25081 5341 13397 -2216
15459 -2216 5071 24326 -1712 -21280 7656 36916 -6147 -21382 9907 21863 23043 42464
15447 42464 28192 -16743 -7881 3825 36465 66951 86724 67818 53479 38262 38403 28524
15435 28524 17356 4702 -2118 -32220 -4384 27781 30460 9254 -6120 -571 -2977 -35075
15423 -35075 -31677 19691 43664 88337 75887 49901 57116 51552 -6949 -46192 -56653 -59443
15411e9443k8656L5995O1456M572j9257J3174K4077J3412o739q5315l0524L0912
15399d6336K5121j908j9160p535L6090K6332k7039n1719J6627K5252M3030m2369
15387b3614j4240J5515K4506K7265o564j0429J9332j8216M993p657k0637J9925
15375A0179M7498m4782k6595k0450K4210M227j1202K7235R548l8751l2047J4422
15363c6508l99J0N823m54K774K6031r298O367j2447R014O897r120r973J4582Q657
15348A956K1063M373M0832l559m6371l5486m7306M246K6575J4970j8836k4614
15336f2157K6110j027K518J6980O7187J7709m5255n1326J936k7662J409Q510M2092
15323b976j1382r416R044M94P1300J2637m7172m8401J327J6351j983N516l3300
$$ plain form
15411 -59443 -88099 -52104 9352 13924 -5333 7841 31918 45330 38591 -46724 -77248 -46336
15399 -46336 -21215 -23123 -42283 -49818 -13728 12604 -14435 -66154 -49527 -24275 18755 -23614
15387 -23614 -37854 -22339 2167 29432 22868 12439 31771 13555 18548 10891 -9746 10179
15375 10179 57677 12895 -13700 -34150 -9940 -5713 -16915 10320 19868 -18883 -50930 -36508
15363 -36508 -36907 -36897 -31074 -31528 -28754 -2723 -12021 -5654 -18101 -9087 -2190 -11310 -21283 -6701 1956
15348 1956 23019 27392 68224 64665 18294 -17192 -64498 -60252 -33677 -18707 -37543 -62157
15336 -62157 -36047 -37074 -34556 -17576 49611 67320 22065 -29261 -27325 -54987 -53578 -45068 -2976
15323 -2976 -14358 -23774 -14730 -14236 57064 69701 22529 -25872 -24545 -8194 -10177 -4661 -37961
15310c7961j4754o629K3851N8130m844k043k6602l0256P787K0384R189Q349n1607
15297d7006k4071rN0368Q9839q26o67L1100k7787k4329l2271J9754J6188j8495
15284C1788J1612j0867j0711k578R707k5995n9703O077K6963L7429L4433l6338
15272A1817l8156O589L911k0777j8235J6067K3785K0676M796m3551J4667L3575
15260A5164K3798l6939l2311o66l9064K74L768J6603O9880J1428m8149l7366L6106
15247a7474J5049K1723J1784k2489n154K8198k177k1055j0060l080j6159M904
15235a5990J916K8578k6080J3872l2610J2525J5274j9551k9766J8311J9880L5521
15223B1880j5745k8646o415K9461j820l0691p927Q426j2379N347K4314K4986M5895
$$ plain form
15310 -37961 -52715 -59344 -35493 22637 17793 15750 -10852 -41108 -33321 -12937 -3748 4601 -47006
15297 -47006 -71077 -71086 -20718 69121 68295 67628 98728 70941 46612 14341 34095 50283 31788
15284 31788 43400 32533 21822 19244 28951 2956 -56747 -50670 -23707 13722 48155 11817
15272 11817 -26339 -19750 -15839 -36616 -54851 -38784 -14999 5677 10473 -33078 -18411 15164
15260 15164 38962 2023 -30288 -30954 -70018 -69744 -65976 -49373 20507 31935 -16214 -53580 -17474
15247 -17474 -2425 19298 31082 8593 3439 31637 29460 8405 -1655 -4735 -20894 -15990
15235 -15990 -14074 14504 -11576 2296 -30314 -17789 -2515 -22066 -51832 -33521 -13641 21880
15223 21880 6135 -22511 -28926 535 -1285 -31976 -39903 -31477 -43856 -38509 -14195 10791 56686
15210E6686J9955J2435l1823J9371l9251j3729j8246n9962K1466M3526n027M412
15198I813j2601K146L753J8921l0355J4698K0245J4191O560k1474k0844P411K6853
15185C9317k1699r048k7259j920k6568J1183R977l5385M442N6198M923Q568J4361
15172B7090m8366k5503m518K9682N9717J3626j1149k8152j8197J2338k0762p514
15160b1708O060M0955L6543l7783j2826N413J7735l0349J4367R819k3443j1460
15148f677J0013J1196L3259m543m212j3818m4987k0586j3168K0189n92J112L415
15135b9399J710j2714l985K3814m32j194M5765j0209l892K2611K0773J5717m3093
15122B5472n5371M4656M1186J8663J1436n6400l5464l947K5788P387p216j6790
$$ plain form
15210 56686 76641 89076 57253 76624 37373 23644 5398 -54564 -33098 10428 5401 9813
15198 9813 -2788 -642 3111 22032 -8323 6375 26620 40811 47371 25897 5053 12464 39317
15185 39317 17618 8570 -18689 -20609 -47177 -35994 -26017 -61402 -56960 -762 4161 12729 27090
15172 27090 -21276 -46779 -51297 -21615 38102 51728 40579 12427 -5770 6568 -14194 -21708
15160 -21708 -15648 25307 61850 24067 11241 16654 34389 4040 18407 28226 4783 -6677
15148 -6677 3336 14532 47791 43248 39036 25218 -19769 -40355 -53523 -33334 -33926 -32814 -29399
15135 -29399 -27689 -40403 -44388 -20574 -21006 -22200 23565 13356 9464 32075 52848 68565 25472
15122 25472 -29899 14757 55943 74606 86042 29642 -5822 -9769 16019 23406 16190 -600
15110f00k7666kJ0226J8956J8231J5090j1615k5043j5741j4918l683M691j143
15097c3217l3591K4j3693P721J6740L8848j2034k4298L0400J6899L341K7899j9077
15084E962j2325L518J5932K6550J0421k3588j002j9484j6331j9489j0169l902
15072d3907k0372J5179L3910P208k2980J3980q499l2455J1478K8663K1632L4302
15060C8139m3983K1749k1199j5427j7786K241K0126J2038j0278l6820l013K4213
15048c0000O440K2983L5342J7338l8372l3698m0472K2657L666K1589o790q970
15036b8287j2604J0320K4529p511k162K5341p661l7138L5074L2469j1145j0065
15024A1160J0365k1519l2684q613M5491K9971j5625k141n509r416l2403k4282
$$ plain form
15110 -600 -28266 -28268 -18042 914 19145 34235 22620 -2423 -18164 -33082 -36765 -32074 -33217
15097 -33217 -66808 -66784 -80477 -72756 -56016 -17168 -29202 -53500 -23100 -6201 -2860 25039 5962
15084 5962 -6363 -2845 13087 39637 50058 26470 25468 5984 -10347 -29836 -40005 -43907
15072 -43907 -64279 -49100 -15190 -7982 -30962 -16982 -25481 -57936 -46458 -17795 3837 38139
15060 38139 -5844 15905 -5294 -20721 -38507 -36266 -16140 -4102 -14380 -51200 -54213 -30000
15048 -30000 -23560 -577 34765 52103 13731 -19967 -60439 -37782 -34116 -12527 -19317 -28287
15036 -28287 -40891 -30571 -6042 -13553 -15715 9626 1965 -35173 -99 32370 21225 11160
15024 11160 21525 6 -32678 -41291 4200 34171 18546 16405 10896 1480 -30923 -55205
15012e5205Q405K9263L9280K520m282n594J2425J5088l1575o1420p709K5954n907
14999c8757O319k1032l0357K4983N2879J5051o966m8007n770L0362J8591J5249
14987A2545M3282J4418R12k9655l485K7426p878j5060J8006M188j4689k5883p158
14974A6969l1353l819l0884J671K3230O618J1466l0714k6159L106L9049o552q504
14961c5876J4340J1812m0827m3550M9962N8594k6824l3808k3808J9392J5800J378
14949c3415l4594l0652l452j9185K9940L6274O206R238N1725J396k1869j3846
14937b2234L4191n0161n0966M4330k2115q465J2863R222J609L648K625K8011l626
14924b1068K5808L4490K5473k8216k4207j0432J0272k4080k7763n5985p425L6073
$$ plain form
15012 -55205 -46800 -17537 21743 24263 19981 14387 26812 41900 10325 -51095 -58804 -32850 -38757
14999 -38757 -32438 -53470 -83827 -58844 -5965 9086 2120 -45887 -51657 -21295 -2704 12545
14987 12545 55827 70245 71157 41502 38017 65443 57565 42505 60511 64699 50010 24127 16969
14974 16969 -14384 -18203 -49087 -47416 -24186 -17568 -6102 -36816 -62975 -59869 -20820 -27372 -35876
14961 -35876 -21536 -9724 -50551 -94101 -44139 14455 -12369 -46177 -69985 -50593 -34793 -33415
14949 -33415 -68009 -98661 -102113 -121298 -91358 -55084 -48878 -39640 12085 13481 -8388 -22234
14937 -22234 11957 -38204 -89170 -44840 -66955 -75420 -62557 -53335 -51726 -48078 -45453 -17442 -21068
14924 -21068 4740 39230 64703 36487 12280 1848 12120 -11960 -39723 -95708 -103133 -67060
14912f7060N7111J2686k6275p720j1982K1071M2448J6567o772l9206m625J8909
14900E152l9575l7297K8802J6154R35J6276j1209J8548N997l8454R961M4498j171
14887A8617L3507J1831r576n6493m699K611m4669j8543j6926L4243J6079l9793
14875g3811j2689M9605O2422J5942k8935j4245K7391o903K6691j4057l6970k1709
14863b7268l1076p34M7285o585n6145m8855M2879P0917N110l952K0709k7441p2067
14850h7223k313q426j8284J8413N5171L1689M1328l1212n3874L0643Q185Q274
14838g629l8358l9186K2462N0295M4188j605j0464J1573P10k082j6669j1589n00
14825A146J203j3419j5465J9255m275J075j4363j846K0365m646L7312L5852J1589
$$ plain form
14912 -67060 -9949 2737 -23538 -31258 -43240 -22169 20279 36846 30074 -9132 -13757 5152
14900 5152 -34423 -71720 -42918 -26764 -25829 -9553 -20762 -2214 3783 -34671 -24710 19788 18617
14887 18617 52124 63955 54379 -2114 -6813 -4202 -48871 -67414 -84340 -50097 -34018 -73811
14875 -73811 -86500 -36895 25527 41469 12534 -1711 25680 18777 45468 31411 -5559 -27268
14863 -27268 -58344 -59078 -11793 -18378 -74523 -123378 -80499 -9582 -4472 -8424 12285 -15156 -87223
14850 -87223 -89536 -97962 -116246 -97833 -42662 -10973 30355 -857 -54731 -24088 -15903 -7629
14838 -7629 -45987 -85173 -62711 -12416 31772 30167 19703 31276 31986 29904 13235 1646 1146
14825 1146 2349 -11070 -26535 -7280 -11555 -10480 -24843 -26689 -6324 -10970 26342 62194 73783
14812G3783j0689n2704K0909k29l6992l7501n121q833J2653K498J5909q922L3586
14799a653J4572O963O266J2798J0618R312l1960j7917j5662J633l955M0584L6674
14786F8273j7640q232K508k3602k8008J246j1256M508N2945k3543p4087l584K8915
14773c1557M436N190j7360j866L861j2159J1722O51K4459L0868k1258j4015Q653
14760h375L0032l3359J5453N2595p589k9046q197L44j780K7443N4830l0493m1335
14747B0523k397M970o3556l3696M3572L7846N060L0664j0975l0612k6888O094
14735a9395J9882J9163k6715m3148K6386J5851n435J1303P159M476k2437o947
14723a9857J8167M4303q992m482p1846J310n814p97J1280M9L0562j4187j9224
$$ plain form
14812 73783 63094 10390 31299 31070 -5922 -43423 -48544 -57377 -44724 -42226 -26317 -35239 -1653
14799 -1653 12919 19882 26148 38946 49564 58876 26916 8999 -6663 -5030 -8985 31599 68273
14786 68273 50633 42401 44909 21307 -6701 -5455 -16711 -12203 40742 17199 -56888 -60472 -31557
14773 -31557 -27121 -21931 -39291 -41157 -37296 -49455 -37733 -37082 -12623 18245 -3013 -17028 -8375
14760 -8375 21657 -11702 3751 56346 48757 19711 11514 11858 10078 37521 92351 61858 20523
14747 20523 18126 23096 -40460 -74156 -30584 7262 12322 42986 32011 1399 -25489 -19395
14735 -19395 487 19650 -7065 -50213 -23827 -7976 -13411 -2108 5051 9527 -12910 -19857
14723 -19857 -1690 42613 33621 29139 -42707 -41397 -47211 -48008 -36728 -36679 -6117 -20304 -39528
14710c9528J2290k4039L2641J9938R931K483m507K0738J0571j2319k5577J5340
14698A7962q226L105J8963K0979L0393k1004K4705L71R57j5691l6591K1031K3725
14685H0679l1876n2834j8634J3992P029J3718J0880j7582j0223k455L6429Q955
14673C8078m4710J3027M5336j6069l8538o373j1652J6819q530j135k5631l9479
14661g8857j3324k119N9562J1025j7407j5538P0698J8917m8234j9248K3720M6843
14649C6038j8481k9524j6926J6266K7891L4891k2137l9206K47j0424P14J3841
14637f810m0088n818J4846J734n705J0537j6744j9967K1652K0985P200R16J460
14624a5802P341K2557J9119R771L330l5799k8676O071M3000o328m4648j302L0074
$$ plain form
14710 -39528 -27238 -51277 -18636 1302 11233 13716 9209 29947 40518 28199 2622 17962
14698 17962 9736 12841 31804 52783 83176 62172 86877 87248 88205 72514 35923 56954 80679
14685 80679 48803 -4031 -22665 -8673 -1644 12074 22954 5372 -4851 -7306 29123 38078
14673 38078 -6632 6395 51731 35662 -2876 -9249 -20901 -4082 -12612 -13747 -39378 -78857
14661 -78857 -92181 -94300 -34738 -23713 -41120 -56658 14040 32957 -15277 -34525 -10805 36038
14649 36038 17557 -11967 -28893 -12627 15264 50155 28018 -11188 -10941 -21365 -20651 -6810
14637 -6810 -46898 -52716 -37870 -36136 -41841 -31304 -48048 -68015 -46363 -25378 -18178 -17262 -15802
14624 -15802 -8461 14096 33215 42986 46316 10517 -18159 -12088 30912 24584 -20064 -21366 8708
14611H708j7647k0990j4666M2255J9277k7912Q344L5414n626l0857J1685k6102
14599a8117k3735M3145K6978k3258k4447J1298k0722j0014J8896O828l080k3493
14587c9721m839K2487M2494n487l83J1277J8650N872j7333J982j7982p252K9537
14574C9302J8241l9785j7527R787m871K787j7080k5869P125J4646K4031n533n3617
14561d8363L0520L9343l9856m1641Q545M6455K0884r026m1044j5232L7939M2314
14549C0838L325R225l4195r132L3077N4820r632q9087l7647J5807M740l437J0602
14536b0696K4242J6180q830K2013J3480k7623j5429k771K5676L6310P925k3997
14524D6480j3069K0081J89k4343j6696J7805p092J1917k3702q28L8374m6516j8345
$$ plain form
14611 8708 -8939 -29929 -44595 -2340 16937 -10975 -2631 32783 27157 -3700 7985 -18117
14599 -18117 -41852 1293 28271 5013 -19434 -8136 -28858 -38872 -19976 -13148 -16228 -39721
14587 -39721 -44560 -22073 20421 14934 14551 25828 44478 50350 33017 34999 17017 9765 39302
14574 39302 57543 17758 231 10018 5147 7934 -9146 -35015 -27890 -13244 10787 5254 -48363
14561 -48363 -17843 21500 -18356 -59997 -51452 -4997 15887 6861 -34183 -49415 -11476 30838
14549 30838 34163 43388 9193 61 33138 87958 78326 -10761 -48408 -32601 -27861 -31298 -20696
14536 -20696 3546 19726 10896 32909 46389 18766 3337 566 26242 62552 70477 46480
14524 46480 33411 53492 53681 29338 12642 30447 23355 35272 11570 10742 49116 2600 -15745
14511a5745n644j4596L4741L386J5932K1344k1205K8501j2677m2746n5979L0793
14499c3895K3687L3259K1564K607k1166l4059k5604J8663K8319K6075m6459k7357
14487c4366J4490r148K1517K3167j499j4283k724j9019K2612J7834l3929m3487
14475e8835k4453K247J7322N137J7042J8671j1370j1162R451N3575j5164j5165
14463a2704k8733j5524k416m625K0513K2303K4726j1829k3570p264N820L4112
14451H09J0252p641M0754r89l0521k5652k3158K3478n198k284p181Q596J0913
14438g822K6020L9939o986r728l5604M261L8483j4923K4008n546k0513j6077r750
14425E762L9171l1461j9739K3917K5184K151l8352k4293k1559j227J8098L3567
$$ plain form
14511 -15745 -21389 -35985 -1244 2142 18074 39418 18213 46714 34037 -8709 -64688 -33895
14499 -33895 -10208 23051 44615 47222 26056 -8003 -33607 -14944 13375 39450 -7009 -34366
14487 -34366 -19876 -29024 -7507 15660 14161 -122 -2846 -21865 747 18581 -15348 -58835
14475 -58835 -83288 -81041 -63719 -58582 -41540 -22869 -34239 -45401 -35950 17625 2461 -12704
14463 -12704 -41437 -56961 -59377 -64002 -43489 -21186 3540 -8289 -31859 -39123 -33303 809
14451 809 11061 3420 44174 43185 12664 -12988 -36146 -12668 -17866 -20150 -27331 -18735 -7822
14438 -7822 18198 58137 51151 41423 5819 10080 48563 33640 57648 52102 31589 15512 5762
14425 5762 44933 13472 -6267 17650 42834 44985 6633 -17660 -39219 -40446 -22348 11219
14413A1219k4564p0892r096N4943K7200K700o570m135l8509l185J9730m044L0745
14400a4458K9164N233P299K4384Q439l4455k2245o410j2943M1270O192K4916N472
14387F1858m0490n1344J178j659M2103P582q654j2767l3765r76J5118K5709K6712
14374C0605l2653K6177l7215m0333J1562O5560M5838J3199j5087k9687r57R994
14362D7003K0049p447n651k4844j8017k2825l768l8506j7745J4598M9965N4477
14350D7289r003J9323k8839j3785K7079J5636N09n6137K3962R646L2684j9049
14338D9315o8707q120K75j9801k3857l366J8339L4262M688K3197J0183m607n1580
14325c9779K2054K0427N804K7819K807P977l0269l2527M2336J7260n0694o7651
$$ plain form
14413 11219 -13345 -84237 -93333 -38390 -11190 -8490 -15060 -19195 -57704 -60889 -41159 -45203 -14458
14400 -14458 14706 19939 27238 51622 60061 25606 3361 -3049 -15992 25278 31470 56386 61858
14387 61858 21368 -29976 -28798 -30457 11646 19228 10574 -2193 -35958 -36934 -21816 3893 30605
14374 30605 -2048 24129 -13086 -53419 -41857 23703 69541 82740 67653 37966 37009 47003
14362 47003 67052 59605 53954 29110 11093 -11732 -15500 -54006 -71751 -57153 -7188 47289
14350 47289 38286 57609 28770 14985 42064 57700 58209 2072 26034 35680 68364 49315
14338 49315 -19392 -27512 -27237 -47038 -70895 -74261 -55922 -21660 -16972 6225 16408 11801 -39779
14325 -39779 -17725 2702 8506 36325 39132 47109 16840 -15687 26649 43909 -6785 -74436
14313g4436K3062j913N0671M267k5725q476M1391K1715J0380J1574r161k8322
14301A5027j0165j389J0228j8062k3195k1061k4289J3551L8614J7045J2219K0064
14289B8587k4492J9791j7002l0221n749J375J0048K0712N479j9973K866j4980
14277b3559l2258K2287J7485N2335L7264m1152m5591p818J1506J2136o199j3473
14265a7037O725r430o793n108K1724l440j3523m6329Q833R00K3182M08k279J1725
14251c0442J9231O8705M4833n3621m6539J1488J0888N822j3245j5652L8098k985
14239C6581l0395N197n135k8620M6793K849j6165J2940k2686j0779j1763j334
14227b2517P879j0288l4182J6229L6619J9987J0974k4116l5739j8949j4983P186
$$ plain form
14313 -74436 -51374 -53287 -2616 1651 -24074 -32550 8841 30556 40936 52510 43349 15027
14301 15027 4862 3473 13701 -4361 -27556 -48617 -72906 -59355 -20741 -3696 8523 28587
14289 28587 4095 23886 6884 -23337 -29086 -27711 -17663 3049 8528 -11445 -8579 -23559
14277 -23559 -55817 -33530 -16045 36290 73554 32402 -13189 -21007 -9501 2635 -3564 -17037
14265 -17037 -10312 -19742 -26535 -31643 -9919 -13359 -26882 -73211 -64378 -63478 -40296 -39888 -42167 -30442
14251 -30442 -11211 57494 102327 48706 2167 13655 24543 30365 17120 1468 39566 36581
14239 36581 6186 11383 6248 -22372 24421 27270 11105 24045 1359 -9420 -21183 -22517
14227 -22517 -14638 -24926 -59108 -42879 -6260 13727 24701 585 -35154 -54103 -69086 -61900
14215f1900M1923K6592M2746j4581j9861L3068j4550n2227k3480J4306R428K6904
14203H368J7381p506m1080o945j3311k8092o2245p241L1727L2042K7188K6231
14191b3483J6849l502j7183j0208Q500J0915K8071M4847J3074j598j0907l8576
14179A6799j709j1611k215j1683K0601L7187j9940n0530l0710J6267M4782O7403
14167G4641K9014o6416p6365l892M0332M8945L126j8678j6101j2824M033K7567
14155C3382Q034j6428K2141K2175l5103k9348k2018N225J0160k082L3941O472
14143C6551k7653m591J1990K1513J4079q736j7789j7892m780j1281M4354L7388
14131G3153m792n9046m0302M0037Q422m3801n3940j9641L8506K5030K0926J3887
$$ plain form
14215 -61900 -19977 6615 49361 34780 14919 47987 33437 -18790 -42270 -27964 -18536 8368
14203 8368 25749 18243 -22837 -29782 -43093 -71185 -133430 -140671 -108944 -76902 -49714 -23483
14191 -23483 -6634 -10136 -27319 -37527 -29027 -18112 9959 54806 67880 66282 55375 16799
14179 16799 15090 3479 1264 -10419 10182 47369 27429 -23101 -53811 -37544 7238 74641
14167 74641 103655 37239 -39126 -43018 -2686 46259 49385 30707 14606 1782 5815 33382
14155 33382 41416 24988 47129 69304 34201 4853 -17165 -11940 -1780 -3862 30079 36551
14143 36551 8898 4307 16297 37810 51889 43153 25364 7472 2692 -8589 35765 73153
14131 73153 68361 9315 -30987 9050 17472 -26329 -80269 -99910 -61404 -36374 -15448 -1561
14119a561K5095Q636m829R890n5676n9150L7364L9714m5581J1458J3808n379L2500
14106F289j0561k9514J7399O0476L937n0387k0427K5432J7596k5158L1338K4785
14094E1205k8758j8873K907J2135L28j5800J3667O215N80l9161j6935k2759j484
14081e6733J7337J6487k8367J2018L3990J3581j1411j1536J6628j3968K0857k086
14069F797o8540j0541N3330L305L6193j444m710J5080p024k2885r266M5339l6874
14056a240J5222P764K746k2826n5661M0368J415k9622l7581j6002K5311J2828
14044e7278N243r665L2360M7205j8558m3793J7947L5302l306J4915n46L7015j5657
14031D1184n8254q808K2683r946L9341q05j595j59l8442r23J902J842j8435j0473
$$ plain form
14119 -1561 23534 32170 27341 37231 -18445 -77595 -40231 -517 -46098 -34640 -20832 -26211 6289
14106 6289 -4272 -33786 -16387 44089 48026 -2361 -22788 2644 20240 -4918 26420 51205
14094 51205 22447 3574 6481 18616 18944 3144 16811 23026 23606 -15555 -32490 -55249 -56733
14081 -56733 -39396 -22909 -51276 -39258 -5268 8313 -3098 -14634 1994 -11974 8883 6797
14069 6797 -61743 -72284 -18954 -15649 20544 19100 14390 29470 22446 -439 -9705 35634 -1240
14056 -1240 13982 21746 24492 1666 -53995 -13627 -12212 -41834 -79415 -95417 -70106 -57278
14044 -57278 -52035 -61700 -29340 17865 -693 -44486 -26539 8763 5457 20372 19826 56841 41184
14031 41184 -17070 -25878 -3195 -13141 26200 25395 23800 23641 -14801 -15724 -13822 -11980 -30415 -40888
14017d0888j92J0479o797j7903K4953J2171J2584j7310l4754Q049Q4035J4297
14005D8724l0428K8412J5041K3910k6647m8925j008j7082J0709k0669j453K6468
13993G052M427m524K7652K4753K26l9425j8168M72L865K3767k6846j5731L769
13980h711K3994j4606l627k2605P126L3125j7722J8256K4510K1931O115k2736
13968D5050P408j9031k827L5158L2244k7336m5040q85j3651J3102j2528J891k8844
13955a5289q109j2693J6353N832j504l3687N151J62m7230p983L9796M5383J3240
13942e78m3798k5677n929K0143M277N8286K027J0439J4892m0572j8879J7511r324
13929a7182n075M3223q328p991j7473K5049N0950j898k3872L073J1301O367L955
$$ plain form
14017 -40888 -41080 -30601 -37398 -55301 -30348 -18177 -5593 -22903 -57657 -49608 34427 48724
14005 48724 18296 46708 61749 85659 59012 10087 9079 -8003 2706 -17963 -19416 7052
13993 7052 11479 6955 34607 59360 59586 20161 1993 2465 6330 30097 3251 -12480 -8711
13980 -8711 15283 677 -2950 -25555 -18429 14696 -3026 15230 39740 61671 67786 45050
13968 45050 52458 33427 30600 65758 98002 70666 25626 24741 11090 24192 11664 13555 -15289
13955 -15289 -23398 -36091 -19738 -13906 -15410 -49097 -43946 -43784 -91014 -98997 -59201 -13818 -578
13942 -578 -44376 -70053 -75982 -55839 -51562 6724 8751 19190 34082 -6490 -25369 -7858 -17182
13929 -17182 -22257 20966 12638 4647 -12826 12223 63173 61275 37403 40476 51777 58144 62099
13916F2099L204k4529m3234M105j1460J110j2996J1674K786n0661n152O4255P211
13903H412k0109J0579N362J9525R31j8161o58n0442J6262K3525J3780r888p399
13890h281J1752L9143K0620m0071j3038k0242J7725P519j8957j4814r437p057
13878c5138J3497M7575j762J2347J7126j2229n3552j7323L933P343j2992j4723
13866d5898J2998L3454K351P977J1590j3834L0285k3285j4104m2013K8715M2423
13854C0659p918j0105j9829M4230L961k1035k7834l514m2456M0765P8042L0622
13842I5588J4977n2302r5778k9137J3514J3604L7341K2810K334K1801J0695l6982
13830A8465m5380m42j5736k2548K9425K3374L983q485j3248K3064m458k013L1395
$$ plain form
13916 62099 65303 40774 -2460 1645 -9815 -8705 -21701 -10027 -7241 -57902 -63054 1201 8412
13903 8412 -11697 -1118 4244 23769 24700 6539 5881 -44561 -28299 -4774 9006 -882 -8281
13890 -8281 3471 42614 63234 23163 10125 -10117 7608 15127 -3830 -18644 -28081 -35138
13878 -35138 -21641 25934 24172 36519 53645 41416 -12136 -29459 -25526 -18183 -31175 -45898
13866 -45898 -32900 554 2905 10882 22472 8638 38923 15638 1534 -40479 -11764 30659
13854 30659 22741 12636 -7193 37037 40998 19963 -7871 -11385 -53841 -13076 64966 95588
13842 95588 110565 58263 -37515 -66652 -53138 -39534 -2193 20617 22951 44752 55447 18465
13830 18465 -26915 -27357 -43093 -65641 -36216 -12842 -8859 -17344 -30592 -7528 -11986 -13999 17396
13817A7396r623J1734l3933l145R580k9118K7126k196r111J6790M631p145j5915
13804b2929l659K2631l0260j6428k9911N5027j4931l5484L4036K5301M5556j6184
13792A2765j6319j8495o138L14m6014q682L8692O1779K7805j529k0677l2590K84
13779h805N319M0086n930m7264l1926r648K2817L4704j4054K3572L7115m298J0801
13766E2489K176J3960m652k6366l481j0437j6663l0779K0551l4048J9451J7483
13754c16j5657L5084M0103R274J200j6908m7324k3362R11k2609l0731l0055K4431
13741g5959M3574J6328j0058N837L427J3768k3804K0123J0422k0733j097K7006
13729H834L5160O258k7863m5853K5690N8036j6796l348k1632L191L7286K049M384
$$ plain form
13817 17396 7773 19507 -14426 -17571 -7991 -37109 -9983 -12179 -21290 -4500 131 -7014 -22929
13804 -22929 -26588 -3957 -34217 -50645 -80556 -25529 -40460 -75944 -41908 -16607 28949 12765
13792 12765 -3554 -22049 -28187 -27873 -73887 -82569 -43877 17902 45707 44178 23501 -9089 -8805
13779 -8805 -3486 36600 30670 -16594 -48520 -58168 -35351 -647 -14701 8871 45986 41688 52489
13766 52489 54665 68625 63973 37607 34126 23689 7026 -23753 -3202 -37250 -17799 -316
13754 -316 -15973 19111 59214 68488 69688 52780 5456 -17906 -16995 -39604 -70335 -100390 -75959
13741 -75959 -32385 -16057 -26115 -20278 -16851 -3083 -26887 -6764 3658 -17075 -18172 8834
13729 8834 43994 50252 22389 -23464 2226 60262 43466 40118 18486 21677 58963 61012 65396
13716F5396k8397j9231m2489k3791j7569J3661p857K0694L3228J8791L241j3552
13704B125K6989J0528j2795k4320k1300N747j0459j6722K7880K3675p173L2019
13692C6194L9050j5720j5667j4772j752K0714R10q630J409j5645N956k9242M665
13679G470K2517L0930L1208J656k3417q064k9181L9397J58n3907q024K6408M0350
13666G7501J4317o134n8511l7064K458j5834j001M2522R699k0118j222j0341j5569
13653a9297K902o02k174M2475L6053k2531j8522j9050j6686J3154j3314k1997
13641c9589L7235L4784J7971R92K558q182k8618j3057K359J347j277J9812J1106
13628C7441n678r200k0931O095N017q695K3826J0407m928k3574k1108L3645j3389
$$ plain form
13716 65396 36999 17768 -24721 -48512 -66081 -52420 -60277 -39583 -6355 12436 15677 2125
13704 2125 29114 39642 26847 2527 -18773 -13026 -23485 -40207 -12327 11348 4175 36194
13692 36194 75244 59524 43857 29085 27333 48047 48957 40327 41736 26091 32047 2805 7470
13679 7470 29987 60917 92125 93781 70364 62300 33119 72516 72674 18767 10743 37151 77501
13666 77501 91818 85684 27173 -9891 -7433 -23267 -24268 18254 27953 7835 6613 -3728 -19297
13653 -19297 -16395 -16997 -19171 23304 59357 36826 18304 -746 -17432 -4278 -17592 -39589
13641 -39589 -2354 32430 50401 51393 53951 45769 17151 4094 6453 7800 6523 26335 37441
13628 37441 31763 22563 1632 7727 12744 4049 27875 38282 33354 9780 -11328 22317 8928
13615H928j0588k7377j5659n303L1718J0682K930K7011J7923M1191J7738j8927
13603H0267o085q0542k2674J9280k0543k1462J337K6328j2476k801K4773L2944
13591A8346J6294j6182K0667k2803q409K820J0641L1173j5578j7255J2698J9171
13579E1583n198m3603l5879k8049K3901M1441K3481O582k7418K0527M6675R730
13567H3773k6791m4923k7955j2405l991K6052q909p862j2282K8316k274j3139
13555b2390J1358k548k111Q507j554n862K0088l7521Q739L3907M5265k5849m2384
13542a2355N990L1632O2166j8990l2431k0524J588K4395k9065l5665k0262M232
13530c9289N2223j0636K5287J663j8510j5131k8123L14J2917L3475L0054l4586
$$ plain form
13615 8928 -1660 -29037 -44696 -49999 -18281 -7599 -4669 22342 40265 81456 99194 80267
13603 80267 74182 -6360 -29034 -9754 -30297 -51759 -50422 -24094 -36570 -39371 -14598 18346
13591 18346 34640 18458 39125 16322 7913 10733 21374 52547 36969 19714 32412 51583
13579 51583 46385 2782 -33097 -61146 -37245 4196 27677 34259 6841 27368 74043 83773
13567 83773 56982 12059 -15896 -28301 -32292 -6240 -15149 -23011 -35293 -6977 -9251 -22390
13555 -22390 -11032 -13580 -15691 -7184 -8738 -14600 5488 -32033 -23294 10613 55878 30029 -12355
13542 -12355 -6365 25267 87433 68443 36012 15488 17076 41471 12406 -23259 -43521 -39289
13530 -39289 12934 2298 27585 29248 10738 -4393 -32516 -32202 -19285 14190 44244 9658
13518I658l1235j372J9694M146J032J6163l2855N068J7290K368L8773j7542j3596
13505A7592J2738J7497m7370l1946J5677J9606L669j1943K5120R582j3711n3587
13493c7076k3332K2784K4732M4616K1509J2704M547l3348k7653l2530L6766J0671
13481B4390Q728J9711l5757m0551m1340o2641K8351N7015J8069k278K44j8400
13469d4459o652L8329R10k496M0173K3561k1411o0688k9206M6804K8596K260O613
13456B2334J6917J8877J2968J4075j1222k8254l0325L3535o136o1670m0754N135
13444e4520J362K0861k4402p803K2016N7118J5531o4458k063P505J1737k7912
13432d5028J3417O0428L269k4665j2150m471J5121l587K6877r40l9111K6227L6126
$$ plain form
13518 9658 -21577 -22949 -3255 891 1923 18086 -14769 -9701 7589 9957 48730 31188 17592
13505 17592 30330 47827 457 -31489 -15812 3794 7463 -4480 20640 30222 16511 -37076
13493 -37076 -60408 -37624 -12892 31724 53233 65937 70484 37136 9483 -23047 13719 24390
13481 24390 33118 52829 17072 -23479 -64819 -127460 -99109 -42094 -24025 -26303 -26059 -44459
13469 -44459 -51111 -12782 -11872 -14368 25805 49366 27955 -32733 -61939 -15135 13461 15721 22334
13456 22334 39251 58128 71096 85171 73949 45695 15370 48905 42769 -18901 -59655 -54520
13444 -54520 -53158 -32297 -56699 -64502 -42486 14632 30163 -34295 -36358 -28853 -17116 -45028
13432 -45028 -31611 28817 32086 7421 -4729 -9200 5921 2334 29211 28271 -10840 15387 51513
13419E1513k0798j9886J9840j3752n4078J7590j3983j1272O7787N6976j7184k0115
13407D2638j2647K9854j5285j649k3623l3576K3989J0880L9234K2759l14m4056
13395C8204k4653j3371M8816N7787k7015k2606J3065r689k243J0500m0853k520
13383B5422L5265o724L201j9878L3771J2573l8463j5790J7091p731m0252r273
13371a0788k6174L6936N1047j9852N80k7498L968J6056K0297p442j5141k6715
13359d726K3764K4620N355k9150K8717L3857q174n3408j4925L0779j186k1784
13347A3739l0831j6836M3592R891j2167j5899L0784J9431K8614k0769k2083m1555
13335a4089l8877O346j7681K1808K9505J6556j2028N4250J3032j7807o5494J0070
$$ plain form
13419 51513 30715 10829 30669 16917 -37161 -19571 -33554 -44826 22961 79937 62753 42638
13407 42638 29991 59845 44560 42911 19288 -14288 9701 20581 59815 82574 82260 38204
13395 38204 13551 180 48996 106783 79768 57162 70227 60538 58295 68795 27942 25422
13383 25422 60687 53963 57164 37286 71057 83630 45167 29377 46468 38737 -1515 -10788
13371 -10788 -36962 -26 51021 31169 31749 4251 8219 24275 44572 37130 21989 -4726
13359 -4726 19038 43658 49013 19863 48580 82437 74263 20855 5930 36709 35523 13739
13347 13739 -17092 -33928 9664 19555 7388 -8511 22273 41704 70318 49549 27466 -14089
13335 -14089 -52966 -46620 -64301 -42493 -12988 3568 -8460 45790 58822 41015 -24479 -14409
13323a4409N4827n6478p16N286K3418J8001j4704R79k2124m126k5862J4536M5445
13310B4073k1388o705j8670L431N4947N2585O401J568r161k2893j5713J3032o12
13297F0895k2193k1047Q617j102J494J104R120K5159K901j6511k5326K1661k299
13284D2473M856K078L1130m0881n2517j8204Q359K8461L0483J8950J3795K2694
13272I1677M0142k5073j3889l9175m5706l1230K4852l6922m6638j1713M4907L8954
13260i814K5029Q247j0292j2106Q703K0477L1769K3203j927m7089k1015n1359
13248c6174k3617K8827k6084K713L8735N371k833K0125O354Q692j0634j0614k564
13235a703J7299j2845O133K2429R059o978O633N853j1855m7849k2090L046Q448
$$ plain form
13323 -14409 40418 -16060 -16776 -11490 11928 29929 15225 16204 -5920 -10046 -35908 -21372 24073
13310 24073 2685 -4020 -22690 -19259 35688 88273 94674 96242 87081 64188 48475 61507 60895
13297 60895 38702 17655 26272 25170 26664 27768 36888 62047 64948 48437 23111 44772 42473
13284 42473 47329 49407 80537 39656 -12861 -31065 -22706 5755 36238 55188 68983 91677
13272 91677 131819 106746 92857 53682 7976 -23254 1598 -35324 -81962 -93675 -48768 -9814
13260 -9814 15215 23462 13170 1064 9767 30244 62013 85216 83289 36200 15185 -36174
13248 -36174 -59791 -30964 -57048 -54335 -15600 -10229 -13062 7063 13417 22109 11475 861 -1703
13235 -1703 15596 2751 8884 31313 40372 33394 40027 45880 34025 -13824 -35914 -32868 -24420
13222b4420M2584k475N839l0531m9473Q322L2876L2385j1119L7883P854K41l9898
13209A0068J000Q877K21m031q821k2039k8849j1549L590P2692N7165j3740n633
13196E8951K823n9942n1368M133M8022O667k085K9057J5286J6012j4752j2419
13184D0385j8417L1054J8924J1104j3679k4855k692k593k6381j2783N535K0611
13172B6213J1855K4361m47k1292m1767l0381L3813L3920K085j080j1765j8901
13160F614J1385q04j8462j2307r504J752N9946O623j4086j6249j9659K7346O94
13147B3289K3022J6660J5481k8106l0970m237L395l767j6224l1838r856j1116
13135e4267J768J9145n0589N5K1748M0645N4304j336J7688j297O722j9662p446
$$ plain form
13222 -24420 18164 15689 21528 -9003 -58476 -50154 -17278 15107 3988 41871 49725 49966 10068
13209 10068 11068 19945 20166 16135 7314 -14725 -43574 -55123 -51533 21159 78324 64584 58951
13196 58951 61774 1832 -49536 -45403 2619 9286 7201 36258 51544 67556 52804 40385
13184 40385 21968 53022 71946 83050 69371 44516 41824 39231 12850 67 5602 26213
13172 26213 38068 62429 61982 40690 -1077 -31458 2355 36275 38360 37280 25515 6614
13160 6614 17999 17195 -1267 -13574 -23078 -21326 38620 45243 31157 14908 -4751 22595 23289
13147 23289 46311 62971 78452 50346 19376 15139 18534 14767 -1457 -33295 -43151 -54267
13135 -54267 -52499 -33354 -83943 -83888 -62140 -21495 32809 31473 49161 47864 54586 34924 27478
13122B7478j0406k1356P378r270o2565K3378J1665L6230M300r492K0409L3924
13110E1673K7047J740m9828m0560j4706j2442k0658q06j3336L6797N3772k332
13098A6361j8707K7691L1939K0734k252k7685k5513J7868j3279j9864M713L2842
13086D4848J4506k0270j6708j459J6644r2R713M0204J1728l2188O556r787r835
13073E3860k2795Q475m957L6064K8822k6342L3900k861m6997l9934M6524M75k3904
13060D0330J3901N575j0601j1690l0600k2617o552j6900k897O2001J0988R582
13048D0520j4174k6506K1043K748J3550N2132j7584m1538m8858l0060K9182K0500
13036I55K911j3690j936N346j9931J0708J0132L460K5743L553L3288k646Q51J3925
$$ plain form
13122 27478 17072 -4284 3094 -6176 -68741 -45363 -33698 2532 6832 -2660 17749 51673
13110 51673 78720 80460 30632 -9928 -24634 -37076 -57734 -58540 -71876 -35079 18693 16361
13098 16361 -2346 25345 57284 78018 75766 48081 22568 40436 27157 7293 12006 44848
13086 44848 59354 39084 22376 20917 37561 37469 47182 87386 99114 66926 73482 63695 53860
13073 53860 31065 39540 34583 70647 99469 73127 107027 104166 57169 17235 63759 64234 40330
13060 40330 54231 59806 49205 37515 6915 -15702 -22254 -39154 -42051 19950 30938 40520
13048 40520 26346 -160 20883 23631 37181 89313 71729 30191 -18667 -48727 -19545 955
13036 955 3866 -9824 -11760 -6414 -26345 -15637 -5505 -2045 23698 27251 60539 57893 58744 72669
13022G2669k9350l4812j146L5617L6389n528k9369j3012J3894k5196J0129L1648
13010F1933m4686k2839J3365j2349m252K4350N202L892P619m9591L0679R420L474
12997B6217K3062k9386k9197M2574K7894Q502p79l2034N72R27M5910L059k4585
12984F2736k4471j8303J590p109k053N4706K6264l746j2015m198r584j3820j2661
12971C7336q081J8534l4594j8797M7277o680r587k7740K387j0772J5639M1631
12959D6553M9495J4783n948k8387l2757j5535o908K3508p626l2430L7168j2608
12947B9308L785M122m425R47L6913k2464L547J3014M76l819J2374K465k2010k9963
12933B4270n074M2440n1815j5864L3330l3760k8881K2635O063L2085P528J5812
$$ plain form
13022 72669 43319 8507 7361 42978 79367 73839 44470 31458 45352 20156 30285 61933
13010 61933 17247 -5592 7773 -4576 -8828 15522 20724 24616 32235 -17356 13323 22743 26217
12997 26217 49279 19893 -9304 33270 61164 69666 68887 36853 37425 38352 84262 87321 62736
12984 62736 38265 19962 21552 14443 12390 67096 93360 89614 77599 73401 63817 49997 37336
12971 37336 29255 47789 13195 -5602 41675 34995 25408 -2332 55 -10717 4922 46553
12959 46553 96048 110831 104883 76496 43739 28204 21296 44804 37178 4748 41916 29308
12947 29308 33093 37215 32790 33737 70650 48186 51733 64747 65223 61404 73778 76243 54233 24270
12933 24270 19196 61636 9821 -6043 27287 -6473 -35354 -12719 -6656 25429 32957 48769
12921D8769J7341n3235J9667J6446o579k7371J9628P6999M5624q4354p9794L76
12909f483J0583M6068J8834k7473k2584K383j2765j1034o205k2656M0232j6295
12897g395j042J7455o128J5687J9743J007K5085k672l7348j3485j6358l2365J0767
12884b7049K4694L2609J1141j7346J2155K5448k3695m1170L015J6642j1704L8855
12872D3595m973m3948r283L8609N6891k3045j0092m7376m6337L516J9869K9744
12860G170O545J7523J5344k6186j4292L6472J3733J9933r419n0794j747J886r005
12847G163J575K1410L1218K543K5080J2968o276J2141j688l4138k7099J054N2876
12834I8827j8745n6049j7256K8259J8505J2375J0960k3403J4707j1670J964R683
$$ plain form
12921 48769 66110 12875 32542 48988 42409 15038 34666 111665 157289 72935 -6859 -6483
12909 -6483 4100 50168 69002 41529 18945 21328 8563 -2471 -8676 -31332 8900 -7395
12897 -7395 -8437 9018 2890 18577 38320 39327 64412 61740 24392 10907 -5451 -37816 -27049
12884 -27049 -2355 30254 41395 24049 36204 61652 37957 -3213 -198 16444 4740 43595
12872 43595 38622 -5326 -14609 24000 80891 57846 47754 378 -45959 -42443 -22574 7170
12860 7170 13715 31238 46582 20396 6104 42576 56309 76242 66823 16029 14282 16168 7163
12847 7163 8738 30148 61366 63909 88989 101957 95681 107822 106134 71996 44897 45951 98827
12834 98827 80082 24033 6777 35036 53541 65916 76876 53473 68180 56510 58474 68157
12822F8157k2440k7124K2337J6000J129M0451M778k6927l4889j6473N653K1120
12810E1772L5175l0845o6428L2072P264k3293K3678K1551K8565M5046m2808l1787
12798D9962j8541j6347J1161K7555o268M8044M3264k4496m5180M645k1282l7556
12786A4961j6146K0273K0822L8433O365J7079K4620K7160k3082k7295O289p658
12774A01821l732K3836k0055m1759R283j897j1463j1123O82M7373Q96n7959m0264
12761d361R411N9338J2590J243M8715J82j0734m3794n3976K1650K9859J3891r686
12748G4328l0407k2162L0752L7728L6083l5214L91j5701q241O366O2369k853m5631
12735H7808Q295m283k1844m3110j2469L9056L0133q689j3459n8885P496M6619
$$ plain form
12822 68157 45717 18593 40930 56930 58059 98510 103288 76361 41472 24999 30652 51772
12810 51772 86947 56102 -10326 21746 29010 5717 29395 50946 79511 124557 81749 49962
12798 49962 31421 15074 26235 53790 47522 95566 138830 114334 69154 73799 52517 14961
12786 14961 -1185 19088 39910 78343 84708 101787 126407 153567 130485 103190 109479 101821
12774 101821 98089 121925 101870 60111 69394 67497 56034 44911 45593 92966 93862 35903 -4361
12761 -4361 5050 64388 76978 78221 126936 127118 116384 72590 18614 40264 70123 84014 74328
12748 74328 43921 21759 52511 90239 126322 91108 91499 75798 67557 73923 136292 133439 87808
12735 87808 96103 91820 69976 26866 14397 53453 83586 74897 61438 2553 10049 56668
12723E6668J2676j2213m557R660j376k7937N349k842l310L2232L7284R568m7982
12710F3220l7316L634j2482m312J8867O3594J5383k4323k4186r476l655j5340
12698C3608N409j4655M1393M4732N3826M8173K2265l6687j6667m5828o2230K922
12686G6261K5740j0966J5070L8771j5671m3674r542k2985j254J5856j0556k5011
12674C2039L9079O9172K6430m2883J1975K1048k5963p918L2913J7403k3796o4989
12662H4510n3426J8522K0438L3520K3979m0L712J4995M3428j7169q4521j7060
12650G0888P5749N5842k8713J0391j6783k2286M242O883k0199k9759k2156k131
12638H1968K8810R584J0535p121M2483K4841o6765l4117K1298K8703K3696J5766
$$ plain form
12723 56668 69344 57131 52574 62234 60858 32921 38270 35428 32118 64350 101634 111202 63220
12710 63220 25904 29538 17056 12744 31611 95205 110588 86265 62079 52603 48948 33608
12698 33608 39017 24362 65755 110487 164313 212486 234751 198064 181397 135569 73339 76261
12686 76261 102001 91035 106105 144876 129205 85531 75989 53004 51750 67606 57050 32039
12674 32039 71118 140290 166720 123837 135812 156860 130897 122979 155892 173295 149499 84510
12662 84510 31084 49606 70044 103564 127543 127503 131215 146210 189638 172469 87948 70888
12650 70888 146637 202479 173766 184157 167374 145088 149330 156213 136014 106255 84099 81968
12638 81968 110778 120362 130897 123776 166259 191100 124335 90218 111516 140219 163915 179681
12626A79681p584J093r322K8243J8737l2896m6778j9431J043M8203p001k9032
12614A24956O913L261L3718K9895J7648L845J7245j3728n3611k2589K3537O695
12602A77785j2800J5064m230m0241K84J3588R790J9642J3j0342m4635J9157L6088
12589A79163l354k8623j9560L5J2079O3067O389l348n4593j4188K450K6428p275
12576A58670M726K2226N719n4757j265J9171K4552K6481j4623J953j0837J1418
12564A93434J2741j5239l0678N716N4083j019J8147K9837P483N647L4818J1446
12552C26416o171M6804o860N1535M5005n7742j11636m8332k3928J1708J2900K1454
12540B61153K2614k0013j6724J3121J8958K8038L4116L2615N306N2647J24690
$$ plain form
12626 179681 172097 173190 163868 192111 210848 177952 131174 111743 112786 160989 153988 124956
12614 124956 131869 135130 168848 198743 216391 220236 237481 223753 170142 147553 171090 177785
12602 177785 164985 180049 175819 135578 135862 149450 159240 178882 178895 168553 123918 143075 179163
12589 179163 175809 147186 127626 127661 139740 202807 209196 205848 151255 137067 139517 165945 158670
12576 158670 163396 185622 191341 136584 135319 154490 179042 205523 190900 192853 182016 193434
12564 193434 206175 190936 160258 165974 220057 219038 237185 267022 274505 280152 314970 326416
12552 326416 320245 367049 360189 411724 456729 398987 287351 239019 215091 226799 239699 261153
12540 261153 283767 263754 247030 260151 279109 307147 341263 373878 379184 431831 556521
12529E56521M7729K4437J5616k5021l9936n6371n7353p9602o0603L0884L6055
12518C92356o395m0446j2094k645N767J237K6387L0371l3084j6509M6360r279
12506C82026k5035J7892k2256j8038M2135J5705J6217L985k64j1325K2357K9792
12494D53191J257j1749M477l3928j2893J2363M5p057m385J4198K1435J969M1244
12481D80167J2400k5616m1917j3009j6975J9036n616L9443j0173m7739L2698J8136
12469D40835N889o834L3363K3150q20n388j3267l314K5101q001J297q648J1988
12456D95351l7955L2728K5219N487o862k0421O696R441M6013J092l2939K8778
12444E52628J5448k5354k1273K6656N2597K934J0060J6266Q843K3193j3370M777
$$ plain form
12529 556521 604250 628687 644303 619282 579346 522975 465622 386020 325417 356301 392356
12518 392356 385961 345515 333421 330776 336543 337780 364167 394538 361454 344945 391305 382026
12506 382026 356991 374883 352627 334589 376724 392429 408646 412631 412367 401042 423399 453191
12494 453191 454448 442699 447176 413248 400355 412718 412763 405706 401321 415519 436954 438923 480167
12481 480167 492567 466951 425034 412025 395050 414086 408470 447913 437740 390001 422699 440835
12469 440835 446724 439890 473253 496403 495583 490195 476928 473614 498715 490714 492011 483363 495351
12456 495351 457396 490124 515343 520830 513968 493547 500243 509684 555697 556789 523850 552628
12444 552628 568076 542722 521449 548105 600702 603636 613696 629962 638805 661998 648628 653405
12432F53405K8111K7900L7717Q558k0658r759m0698K6340j7952P1P0526k905K7074
12419G87730K3811O460K4347J2371j7898j2679J5675K8369j4267m359k475j1335
12407H35750O4694K1191K5057L6311j1776j1823j7557M149K8229J718K4832N9494
12395A060269K0597K9654J4932j3224K3086L4648j9042K2596J8973O3109K0577
12384A276175J1570j6725J398L8348K6140J2470J0498N7988K6391L1302l7844
12373A437711J4464J02880O7201K8147J7244N8036K5810P1893L3119N3393J3234
12362A923132M338L5726L6284M6782O6164Q025N5881N1586J2697n143K9420J11127
12350B376019J14560Q4990L6066J5419L8182N5070K5319M9427Q7289N9965R6441
$$ plain form
12432 653405 681516 709416 747133 755691 735033 725274 684576 710916 692964 693035 763561 760656 787730
12419 787730 811541 818001 842348 854719 836821 824142 839817 868186 853919 849560 847085 835750
12407 835750 900444 921635 946692 983003 971227 959404 941847 945996 974225 975943 1000775 1060269
12395 1060269 1080866 1110520 1125452 1112228 1135314 1169962 1150920 1173516 1192489 1255598 1276175
12384 1276175 1287745 1271020 1272418 1310766 1336906 1349376 1359874 1417862 1444253 1475555 1437711
12373 1437711 1452175 1555055 1622256 1650403 1667647 1725683 1751493 1823386 1856505 1909898 1923132
12362 1923132 1927470 1963196 1999480 2046262 2112426 2120451 2176332 2227918 2240615 2235472 2264892 2376019
12350 2376019 2490579 2575569 2611635 2627054 2665236 2720306 2745625 2795052 2882341 2942306 3038747
12339C038747R9164Q2190J03787R9952J20398P9890M5878Q2349J15888J27343
12329C995586J13900P1518J31035J74250R7350N4541J15697J38636J58983K19799
12319E271295J68102J88021J67463K12615J80444J76761K20447K58635K33967
12310G077750K45940K15221K43525L15728L42097L03092L18579K96173L25453
12301I683558L06225L72138L70788M33301M36704M38995M56612M18016M63448
12292A3379785N01498M70979M74141M86428N76638O31592O02473N23975N35423
12283A8182932N93853N94897N34434N20578M68700M84639M57851M49855L89935
12274B2677674L47522K68238K21170J77136J35646Q9603K94q5213j55698j89297
$$ plain form
12339 3038747 3137911 3220101 3323888 3423840 3544238 3624128 3670006 3752355 3868243 3995586
12329 3995586 4109486 4181004 4312039 4486289 4583639 4638180 4753877 4892513 5051496 5271295
12319 5271295 5439397 5627418 5794881 6007496 6187940 6364701 6585148 6843783 7077750
12310 7077750 7323690 7538911 7782436 8098164 8440261 8743353 9061932 9358105 9683558
12301 9683558 9989783 10361921 10732709 11166010 11602714 12041709 12498321 12916337 13379785
12292 13379785 13881283 14352262 14826403 15312831 15889469 16521061 17123534 17647509 18182932
12283 18182932 18776785 19371682 19906116 20426694 20895394 21380033 21837884 22287739 22677674
12274 22677674 23025196 23293434 23514604 23691740 23827386 23916989 23917283 23832070 23676372 23487075
12264B3487075k28884k49773k61519l54048m20998m54947m87908n33082n21036
12255A9974880n41165n41935o09550n97933n79352n53417n18862m82189n00412
12246A5050065m97253m79283m54538m91814m83028m66384m14881l82195l87727
12237A0992962m56639m15053k99486l23696l63755l64037k96449k65292k52795
12228G955760k05788k91958k34126k00221k34943k13562k54151j91209j70205
12219E959597j17098j76102j99991j95502j55589j19816j15147j76626j73315
12210D530411j28580q8793q9910r6074j12446j01505n8705j09271j46775j29690
12200C468662j25733j03438n1303o8209p8247o9632m9961m5302m6035n5477m6398
$$ plain form
12264 23487075 23258191 23008418 22746899 22392851 21971853 21516906 21028998 20495916 19974880
12255 19974880 19433715 18891780 18282230 17684297 17104945 16551528 16032666 15550477 15050065
12246 15050065 14552812 14073529 13618991 13127177 12644149 12177765 11762884 11380689 10992962
12237 10992962 10536323 10121270 9821784 9498088 9134333 8770296 8473847 8208555 7955760
12228 7955760 7749972 7458014 7223888 7023667 6788724 6575162 6321011 6129802 5959597
12219 5959597 5842499 5666397 5466406 5270904 5115315 4995499 4880352 4703726 4530411
12210 4530411 4401831 4313038 4223128 4127054 4014608 3913103 3854398 3745127 3598352 3468662
12200 3468662 3342929 3239491 3188188 3119979 3041732 2972100 2922139 2876837 2830802 2775325 2728927
12189B728927p5067r5700p1622m0246j3607n7697m3884o0267p0045l9397k9039
12178B132356k0253o0327m8323l5502j6678p2980n2074K8915k7561n9411j0721
12167A757441K857n6462n2260m0122m1742l4074p012j1032l0828q6445j1850K6741
12155A415212N763m4528p5930j1180k4367n0340J002m8935j7314L1577Q255m3317
12143A145898k1324n664l9667j5438j083L764j1871l5729k4617J2487m3221M353
12131I67888P224m1817k4425l1344r599j8609k4399j8327L5587o158p260j7165
12119H11596l1541j3017j1223N1282J0732k2980o655j9964q772m7162m2019N829
12107F76106j277L0829o670m0838l4196p651L1537m770n9179k2104M772q987K0597
$$ plain form
12189 2728927 2653860 2558160 2486538 2446292 2432685 2374988 2331104 2270837 2200792 2161395 2132356
12178 2132356 2112103 2051776 2003453 1967951 1951273 1878293 1826219 1855134 1827573 1768162 1757441
12167 1757441 1760298 1703836 1651576 1611454 1569712 1535638 1528626 1517594 1486766 1400321 1388471 1415212
12155 1415212 1420975 1376447 1300517 1289337 1264970 1214630 1215632 1166697 1149383 1180960 1189215 1145898
12143 1145898 1124574 1118910 1079243 1063805 1062722 1066486 1054615 1018886 994269 1006756 963535 967888
12131 967888 975112 933295 908870 877526 867927 849318 824919 806592 842179 836021 828761 811596
12119 811596 780055 767038 755815 807097 817829 794849 788194 768230 759458 712296 670277 676106
12107 676106 674829 705658 698988 658150 623954 616303 647840 643070 583891 561787 566559 557572 578169
12094E78169J6598j9313l0346m7341o259M1457K0067M447K6953j80j4548Q476
12082E78180j9556l5618j348Q595J5135m1933k8045K9396K5362q3845l4809j238
12070D10276K530M3349J4686m1471o7864k9257P332N5412O6271J5421J4397K837
12058D93919j5361k3389k0423J8226Q930q163l2660m8466l9596R382K5336N1362
12046D19097k9241k541J2443j753j2455p870k6775M231j3667m8120J1056M8486
12034C52891J0820j4641l9204j0072m170j7558M088R658m3953o418N0507K2044
12022C13992k4395m875K6961J6079L41j1960j2175N3939L1175m5729O741P7805
12010D27899O1942L9449O122M7124M6364n6281j01469o3901q8472k7252J5110
$$ plain form
12094 578169 594767 575454 545108 497767 491508 532965 553032 557479 584432 584252 569704 578180
12082 578180 558624 523006 521658 530253 545388 503455 475410 504806 530168 446323 411514 410276
12070 410276 412806 456155 470841 429370 361506 332249 339581 394993 461264 476685 491082 493919
12058 493919 478558 455169 434746 452972 461902 453739 421079 372613 333017 342399 367735 419097
12046 419097 389856 387315 399758 398005 385550 377680 350905 355136 341469 293349 304405 352891
12034 352891 363711 349070 309866 299794 295624 278066 282154 291812 247859 241441 291948 313992
12022 313992 289597 284722 311683 327762 328103 316143 303968 357907 389082 343353 350094 427899
12010 427899 489841 529290 535412 582536 628900 572619 471150 407249 318777 291525 306635
11999C06635m0224M088K6183J7745k4929j5765k1098l7283J128L0289L0420J093
11987B78282k569n085j7343m9702K110K2707K3908K4662l0568q6293k741O6839
11975B24207J8637q220o1684N77N4550K353q914K8592J9069J7163r154n1828r069
11962B16279M9940K5153l8541K875j9608k6958K8391l5974k5034N1848P406l1944
11950B03833k7538k3868p222K265P86J5297M612J2168K3262l615o7744l5017L4939
11937A32158O16J7957J8624J0996J4223j0931Q5N995P142j9729j1218J8799J3197
11924A97914k8322K7522J4337R106k6622l7089r802L374M0532K2886J2404l351
11912B22889J888k1197p9520K034J4105k3701K248r544K2411M1344j0637l1158
$$ plain form
11999 306635 266411 270499 296682 314427 289498 273733 252635 215352 216480 246769 277189 278282
11987 278282 275713 270628 253285 203583 205693 228400 252308 276970 246402 160109 157368 224207
11975 224207 242844 234624 172940 173517 228067 230420 221506 250098 269167 286330 277176 225348 216279
11962 216279 266219 291372 252831 255706 236098 209140 237531 201557 176523 228371 235777 203833
11950 203833 176295 152427 145205 147470 148256 163553 168165 180333 203595 199980 132236 97219 132158
11937 132158 132774 150731 169355 180351 194574 183643 183728 189723 196865 177136 165918 184717 197914
11924 197914 169592 197114 211451 220557 193935 156846 147044 150418 190950 213836 226240 222889
11912 222889 224777 203580 124060 126094 140199 116498 118746 109202 131613 172957 162320 131162
11900A31162l1806n4383M4372M3058Q247K900j6932k9837k5328p419Q465O868
11888G9367R104J0984L3829J0950m116N5203R332m6972n1673k6795j4199M4613
11876A09627J0480l1071j0253J8540K8455O81m4850j555K9673J5810j7930M781
11864A12388j1449K349j7319o609J2885J7849J4728l0212j6250o713J0899p293
11852G5253k0914k2002J2163K8571L7320l3431K5257K4228m5262j8853K5458J8198
11840A05986k146m608j1747j049K6104n425j1790J7409k4851K7272K5878r07j045
11827A39081k7577J4225J0456J3914m1521p353R559K1237L1726j1690m0874L892
11815A15075K0380k1016N983k8685r089J0927J6712L914K4286J6253j8939k5335
$$ plain form
11900 131162 99356 44973 89345 132403 140650 143550 126618 96781 71453 64034 72499 79367
11888 79367 88471 99455 133284 144234 140118 195321 204653 157681 106008 79213 65014 109627
11876 109627 120107 89036 78783 97323 125778 126459 81609 80054 109727 125537 107607 112388
11864 112388 100939 103288 85969 79360 92245 110094 124822 94610 78360 71647 82546 75253
11852 75253 54339 32337 44500 73071 110391 76960 102217 126445 81183 62330 87788 105986
11840 105986 103840 99232 87485 86436 112540 107115 95325 112734 87883 115155 141033 140126 139081
11827 139081 111504 125729 136185 150099 108578 101225 110784 132021 163747 152057 111183 115075
11815 115075 135455 114439 120422 91737 82648 93575 110287 114201 138487 154740 135801 110466
11803A10466j489J1171j2710J5659j6886k2189k3479k6113J1645J5347J2977j0
11791G4389m8112k7975J3438J3187K4067J7975j7006K8847J7577J2234l4050l8108
11779C6463j987J085L0933J3985l174j5500P168N9066K3396J235k7157m9473l8502
11766C7538L804L8758L2909l9322l0286J9766j4006J1986K8593K3070k1164k3008
11754F8638Q33L4376L2148l7995k0149O678p430k1025J2913J4796O852k6903j7684
11741D6048M265o5292k1223J0212M4055K2533R115K443k7115R977k9741j8668
11729a3391O125K0061R006M1360O8047L4572p1470o1855O592J6484K4387n7204
11717B2714n018K9488K0511m2648q696L2770k0848l1601K7608M9197j3128j3834
$$ plain form
11803 110466 108977 120148 107438 123097 106211 84022 60543 34430 46075 61422 74399 74389
11791 74389 26277 -1698 11740 24927 48994 66969 49963 78810 96387 108621 74571 36463
11779 36463 34476 35561 66494 80479 77305 61805 68973 128039 151435 152670 125513 76040 37538
11766 37538 41342 80100 113009 73687 43401 63167 49161 61147 89740 112810 91646 68638
11754 68638 69471 103847 135995 98000 77851 84529 77099 56074 68987 83783 90635 63732 46048
11741 46048 50313 -14979 -36202 -25990 18065 40598 49713 52156 25041 35018 5277 -13391
11729 -13391 -7266 12795 21801 63161 131208 165780 94310 32455 39047 55531 79918 22714
11717 22714 17696 47184 67695 25047 16351 49121 28273 -3328 24280 73477 60349 46515
11705D6515j392j2809L8857k4774l7918k410K9653J003l0805j4761K2620O8212
11693H1991J2740p0553k8102L1524L1191J1136r29j9369m3442N068N5436Q073
11681G4764k3862l6441p4477L1909K0284J7344l7048J2831L865L0127K0610n0322
11669a0416l5377N9874M7675r397j1809K6087Q539k0331m2668J0097K4523N4477
11657A01274K5631j189k4740l5118L7292J1070N571r944j0400q926N10l2553l7087
11644B1391O182Q653L9907q435J4502k1178j4133J5771m1780k5666j6473M851
11632a6408K7990r435k6886P881N6840J9898J2925j2433n2871k8389n8385P367
11620g1906N8177L1119L7427l9745k2059K2447P89k5388J491M757J4548k9980
$$ plain form
11705 46515 45123 32314 71171 46397 8479 6069 35722 36725 5920 -8841 13779 81991
11693 81991 94731 24178 -3924 27600 58791 69927 68998 49629 6187 11255 66691 74764
11681 74764 50902 14461 -60016 -28107 -7823 9521 -27527 -14696 -10831 19296 39906 -10416
11669 -10416 -45793 14081 61756 52359 40550 66637 75176 54845 12177 22274 46797 101274
11657 101274 126905 125716 100976 65858 103150 114220 119791 109847 99447 90521 91031 58478 21391
11644 21391 27573 36226 76133 67698 82200 61022 46889 62660 20880 -4786 -21259 -16408
11632 -16408 11582 2147 -24739 -16858 39982 59880 72805 60372 7501 -20888 -79273 -71906
11620 -71906 -13729 17390 54817 15072 -6987 15460 16249 -9139 -7648 -2891 11657 -18323
11608a8323n9822K1992K0084J4169P9909J9488K7291j380n4844P098N843L203
11596F4708k4737q075j5612K613o239M821n549q63N634M1395Q4226k0538l4044
11583H7740m6560m7283j8023L1973K4767l3112k6004J3673J59Q1k7309L507J7941
11570a8450P546j2796J4264K3701j5841k0469N3074N4714j6489j1659l4626J8562
11558D1531K8990k7703m3052L3694K7760j9925n9333K9781O7338K647R350o2988
11546B8090o6078K0261j4550O895J8393l7821O801j1228K1117M5285L0936k2422
11534B5679l4215j8024p993Q061j2975K6269k8387k402J4038J9660J2781j9355
11522a6863m4588N184K0406K827q631L8557P298N627O26J1769J3486K3047j4759
$$ plain form
11608 -18323 -78145 -56153 -36069 -21900 58009 77497 104788 103408 48564 55662 61505 64708
11596 64708 39971 31896 16284 18897 12658 17479 11930 11067 16701 58096 142322 121784 87740
11583 87740 41180 -6103 -24126 7847 32614 -498 -26502 -12829 -12670 -12589 -39898 -36391 -18450
11570 -18450 -10904 -23700 -9436 14265 -1576 -22045 31029 85743 69254 57595 22969 41531
11558 41531 70521 42818 -234 33460 61220 41295 -18038 11743 79081 81728 91078 28090
11546 28090 -37988 -17727 -32277 -25382 -6989 -44810 -38009 -49237 -28120 17165 48101 25679
11534 25679 -8536 -26560 -34553 -26492 -39467 -13198 -41585 -43987 -29949 -10289 2492 -16863
11522 -16863 -61451 -56267 -35861 -33034 -41665 -3108 4190 9817 10443 22212 35698 58745 43986
11509D3986k850m6951k9372O7222K9175j5368m8786l5547J6317J814k109J9102
11497c367O2529P214q417j8081j8174j7728L2333N340K588l810P564k1691q537
11484A7763j5535J0434l050k6013j1496K1384L6937N3971K0811p4327n3717J209
11472b1629j6331K538K6986M4167N6482j4392l4670l3163j8435k9017l8346L2713
11460d3097L5403N4879k669J6433K021n4126M192K0718j9961k1033K2383N8543
11448G3686o413o2781n6340k0014M8413K8985M2387Q684j5014K26J2073m8702
11436E190m5575L690q139L7310K1138l2500k6862j4424J520p529M8L4845j9349
11423e0637O4895L5699Q840j1947l8203l1935k4937J4025L0576M3633j9501l863
$$ plain form
11509 43986 41136 -5815 -35187 32035 61210 45842 -2944 -38491 -22174 -20360 -22469 -3367
11497 -3367 59162 66376 57959 39878 21704 3976 36309 41649 44237 40427 47991 26300 17763
11484 17763 2228 12662 9612 -16401 -27897 -6513 30424 84395 105206 30879 -22838 -21629
11472 -21629 -37960 -35422 -8436 35731 92213 77821 43151 9988 -8447 -37464 -75810 -43097
11460 -43097 -7694 47185 44516 60949 62970 8844 13036 33754 13793 -7240 15143 73686
11448 73686 67273 4492 -51848 -71862 -23449 5536 47923 56607 41593 41819 53892 5190
11436 5190 -40385 -36695 -44834 -7524 13614 -18886 -45748 -60172 -58652 -66181 -66133 -31288 -50637
11423 -50637 14258 49957 58797 46850 8647 -23288 -48225 -34200 -3624 40009 20508 16645
11411A6645r693J3942K7052K5049l5989o1272n437J7365m596J9412L8261J4279
11399E5018j0719j0050k361l6556J1466J7031q179j8193l0199m3994j2883K8845
11387f0774N1583L3868j3664k7635j8709J2470k1997n0261K8606Q8791L2970Q347
11375F3595k377l204K7504q195Q44j2959J7561k737l9021k8281l9092K250L0763
11362F651K547j0291K6379j005R279j173l6447j0921L6387K718N821n7970m952
11349c2977L4839L0512l5234n3023j280L8231k59J1477k5274r65L5276J4188j7502
11336a991k1273K0959K7264p023j6673N985N941J8767k2099l3714J7424J9686
11324A3253K3197L6413J4577j1972m0759l8489L2521M5392L3714J7089m9472m8974
$$ plain form
11411 16645 6952 20894 47946 72995 37006 -24266 -29703 -12338 -16934 2478 40739 55018
11399 55018 44299 34249 31888 -4668 6798 23829 15650 -2543 -32742 -76736 -89619 -60774
11387 -60774 -9191 24677 11013 -16622 -35331 -22861 -44858 -95119 -66513 22278 55248 63595
11375 63595 61218 58014 85518 77323 78167 65208 82769 80032 41011 12730 -26362 -24112 6651
11362 6651 9198 -1093 25286 24281 33560 32387 -4060 -14981 21406 24124 29945 -28025 -32977
11349 -32977 1862 32374 -2860 -55883 -57163 -18932 -19191 -7714 -32988 -33953 1323 15511 -1991
11336 -1991 -23264 -2305 24959 17936 1263 7248 13189 31956 9857 -23857 -6433 13253
11324 13253 36450 72863 87440 75468 34709 -3780 28741 74133 107847 124936 75464 26490
11312B6490j9291J834l286N874k6642r05K7795k3160l1368J1364j1746j5295J6998
11299d1338K2594K0066l8698j426j8493L071M6441M2486k3748o0099N916N4604
11287A1376K1382J7686j3272p3731R549o321k120L8112K9748M473l6039l8115
11275c7272j6092j8933K4451L7879K2132P110m5833j9926Q401L1253j1187k655
11263b0672J0278L1849J5243k6201k7543L977j1332J0409J1531R436L2564k4267
11251A5272l7518N129j8945J3076J7979P416q313M3104K2810k1100K9495L9358
11239A07763m5032m1927J9753N1381k4572l0027j1973l0204k9993j8750K5699
11228b7882J4384K4787j5964j9032m9604J5410O3606L0450q216l13n12J1798K7894
$$ plain form
11312 26490 7199 9033 5747 11621 -15021 -15926 11869 -11291 -42659 -31295 -43041 -58336 -41338
11299 -41338 -18744 1322 -37376 -38802 -57295 -54224 -7783 34703 10955 -49144 -43228 11376
11287 11376 32758 50444 37172 -36559 -27010 -33331 -35451 2661 32409 36882 843 -37272
11275 -37272 -53364 -72297 -47846 -9967 12165 19275 -26558 -46484 -38083 -6830 -18017 -20672
11263 -20672 -10394 21455 36698 10497 -17046 -13069 -24401 -13992 -2461 6975 39539 15272
11251 15272 -22246 -17117 -36062 -22986 -5007 2409 -5904 37200 60010 38910 68405 107763
11239 107763 62731 20804 40557 91938 67366 37339 25366 -4838 -34831 -53581 -27882
11228 -27882 -13498 11289 -4675 -23707 -73311 -57901 5705 36155 27939 27626 27114 38912 66806
11215F6806K403l5969m4657l3556l9486K6269L5766O781K5462j4422J5588l5085
11203b4100R678M6405J453m4280J8198J7487j7305m0902m922p234O482N4388L7742
11190E3090J1897o951j4185l7548P268N175k172j8138o589j5414j7951K9257L8823
11177B6562K2992k2472J0956m552l8434j8750k764k050K7589n6676k2220O228
11165g3591M9047j8142n3605L3779k1215R962J3402K3527N5892M7758L0558j1689
11153H5683k1412o476k7712p788J4295j5177k1754k3500m958j5283j6138J4075
11141d6145M1594o950o192K6607o606j4864J0728L024l5664k2562K3197K4243
11129i590n403k8115l6324o88o60j756K7113M6319K6534J2615j665l4216J0062
$$ plain form
11215 66806 69209 33240 -11417 -44973 -84459 -58190 -22424 -15643 9819 -4603 10985 -24100
11203 -24100 -14422 31983 33436 -10844 7354 24841 7536 -33366 -38288 -45522 -39040 15348 53090
11190 53090 64987 58036 43851 6303 13571 18746 16574 -1564 -8153 -23567 -41518 -12261 26562
11177 26562 49554 27082 38038 33486 -4948 -23698 -26462 -28512 -923 -57599 -79819 -73591
11165 -73591 -24544 -42686 -96291 -62512 -83727 -73765 -60363 -36836 19056 66814 97372 85683
11153 85683 64271 57795 30083 22295 36590 21413 -341 -23841 -28799 -44082 -60220 -46145
11141 -46145 -4551 -11501 -17693 8914 2308 -12556 -1828 1196 -34468 -57030 -33833 -9590
11129 -9590 -14993 -43108 -79432 -80120 -80780 -82536 -55423 -9104 17430 30045 28380 -5836 4226
11116D226m4523J0128J7209K750J7592L3479r663l3020l849j3012p320K454J9064
11103d485j0803M504L2368Q893K273j0005k7791k3285P747k4792J782N6914j9336
11090f016j7452k2072M4159j9331j3699M5071J1401K433k1472J7460R296n3422
11078b3644n5299J3946L1643Q4049p035m7708K767O824o575j0034j9774k573q23
11065c4236N8052J8843k1322k655N3329J647q891j5552l0542J8758J0245k9695
11053A7981k0463j3697k130J3137L8269Q851k0419J0711m0390m661L556L0998
11041B1743k65p462L1736J4258l9675j9281J7457Q142j6972j9425K8713K151j7030
11028D090j0177k2224J126j4013q311K2477K0611M6498J3836j3013j8340J0619
$$ plain form
11116 4226 -40297 -30169 -12960 -10210 7382 40861 31198 -1822 -5671 -18683 -26003 -23549 -4485
11103 -4485 -15288 -10784 21584 30477 32750 22745 -5046 -28331 -20584 -45376 -43594 13320 -6016
11090 -6016 -23468 -45540 -1381 -20712 -34411 10660 22061 24494 3022 20482 29778 -23644
11078 -23644 -78943 -64997 -33354 50695 43660 -4048 -1281 5543 -1032 -11066 -30840 -33413 -34236
11065 -34236 23816 42659 21337 18682 72011 73658 64767 49215 18673 37431 47676 17981
11053 17981 -2482 -16179 -18309 -5172 33097 41948 21529 32240 -8150 -12811 -9255 21743
11041 21743 21478 14016 45752 60010 20335 1054 18511 26653 9681 -9744 18969 21120 4090
11028 4090 -6087 -28311 -27185 -41198 -49509 -27032 -6421 40077 53913 40900 22560 33179
11016C3179K852K6282l027l0030J0906l6057j272j1836m574L5822j3822k5736
11004a7313j1892K0578K3549K459K098l7144n099K7730K4489j4148j6330J583
10992E60k9624j5423j881O7220L4008j2916m5581j8174j4353N77L5969M8426j8125
10979C0683Q535m036K6776j700j3757l4360r72l5424l371r828m5202N699J4928
10966f2029L5721P8516j4293k7669l4311j7701l540j0959O703K2937L6907K3539
10954C3821k0116L964M5012J2845l0684p710r922j7587p4608k1540L0524L0154
10942b5847k380M9085k6731k5978L210k6195M2385J5807o943K233j5881J0728
10930f507N168j9923l6180K9761N1753Q804j0613n5436k6537k0583P0752K6869
$$ plain form
11016 33179 36031 62313 59286 29256 40162 4105 2833 -9003 -13577 22245 8423 -17313
11004 -17313 -29205 -8627 14922 17381 19479 -17665 -22764 4966 29455 15307 -1023 560
10992 560 -29064 -44487 -46368 20852 54860 41944 -3637 -21811 -36164 -35587 382 48808 30683
10979 30683 39218 35182 61958 60258 46501 12141 11169 -24255 -27626 -37454 -82656 -76957 -62029
10966 -62029 -26308 52208 37915 10246 -24065 -41766 -45306 -56265 -49562 -26625 10282 33821
10954 33821 13705 17669 62681 75526 44842 37132 27210 9623 -64985 -86525 -56001 -25847
10942 -25847 -28227 20858 -5873 -31851 -28641 -54836 -12451 3356 -3587 -1354 -17235 -6507
10930 -6507 -1339 -21262 -57442 -27681 24072 32876 22263 -33173 -59710 -80293 -9541 17328
10918A7328k4635M942k9377K6925j5233M614O2566l1537k0288K4187j4071K3005
10906B8426J0504l1295l0417K6906K1264q451j3066r452j7399l0320O335M7458
10894D93L0459o9626l7276K924L5447L6021P379j8871k2697N0905L0218n2199
10882f823j5147K9120j9150n691Q275R443J0410j0522j4269l2128j0913M570L7457
10869a5368O931N17K3649m738r232j5833N64J8770L8803j6738n6092n9378j8340
10856a06485K1995M2342L3296l8299N7822K9965j7789k3786r375J6479K7585J8447
10844E2197j4805k119K560J0069l4343j8912M1668N5382o084j7437J2043n2049
10832B8170j3427R443j4809k5543J5532l4458L1969R574n8606j7980O6411j7113
$$ plain form
10918 17328 -7307 -2365 -31742 -4817 -20050 -15436 47130 15593 -4695 19492 5421 28426
10906 28426 38930 7635 -22782 4124 25388 16937 3871 -5581 -22980 -53300 -46965 493
10894 493 30952 -38674 -75950 -73026 -37579 -1558 5821 -13050 -35747 15158 45376 -6823
10882 -6823 -21970 7150 -12000 -17691 -9416 27 10437 -85 -14354 -46482 -57395 -52825 -15368
10869 -15368 -8437 -7920 15729 10991 1759 -14074 -13510 5260 44063 27325 -28767 -88145 -106485
10856 -106485 -84490 -42148 -8852 -47151 10671 40636 22847 -939 -10314 6165 33750 52197
10844 52197 37392 35273 37833 47902 13559 -5353 36315 91697 85613 68176 80219 28170
10832 28170 14743 24186 9377 -16166 -634 -35092 -3123 6451 -52155 -70135 -3724 -20837
10820b0837n30l8550P39l1655m879j2016K3260k8252k9526K8452K0837N4374L9182
10807E99L5366L3154k127l1360p208N517O417l7488M4954P677l3658J3898m880
10794C0861j7422l4153k1650l8619K5168M372O0327J2154j663R105N978l6419
10782a961k371J7566K464q067J5194K4019k5195j9949p944L747n886k0845K2582
10769f646m798m838j334R387J9990K3270R41r964m2939k7721J6534M557Q089j351
10755a6823K3158M912J3871m91n376l5971m7083O207P337K8286j1938j2861o276
10742e3048J1915J1545N1864j8231o168R800l3359m6791J5790O2146M3495k1774
10730B7184k1502K128k7539J8135J8890j0246r875M2981O157J3808n2765j8700
$$ plain form
10820 -20837 -21367 -59917 -59178 -90833 -95712 -107728 -84468 -112720 -142246 -113794 -92957 -38583 599
10807 599 35965 69119 66992 35632 28424 33941 40358 2870 47824 55501 21843 35741 30861
10794 30861 13439 -20714 -42364 -80983 -55815 -51443 8884 21038 19375 28480 34458 -1961
10782 -1961 -4332 13234 15698 7631 22825 46844 21649 1700 -6244 -2497 -8383 -29228 -6646
10769 -6646 -11444 -16282 -17616 -8229 11761 35031 35972 26008 -16931 -44652 -28118 -23561 -15472 -16823
10755 -16823 6335 11247 25118 24627 19251 -16720 -63803 -57596 -50259 -21973 -33911 -46772 -53048
10742 -53048 -41133 -29588 22276 4045 -2123 7677 -25682 -72473 -56683 5463 48958 27184
10730 27184 5682 7810 -19729 -1594 17296 7050 -2825 40156 46313 60121 7356 -11344
10718a1344J9397J5738l2629n299K5638l4768r041J9833l554k0866P4273N439
10706D2817j3468O7030j1284m1851j0796j0219J2583o770K564J230q199J1559
10694C5196l2278o9866J3989j165k0691J8620p06r677j3449q160N336J8790K0129
10681d3932j199K8426M2220k7291j2000L007k4022K1128O905J767K5181j4514
10669E676k8038k9804R52K3322K7569M9370m416N658k6569m6044K0493L8427R687
10656D6283n5658n51L3211L2510k3701q317n2008j0553M6476j9097m4582k473
10644e8460L4536J2744l3263q925n6553k2205O6779R7470L4538m2721O992K6410
10632E7342o453k7360P097K4728k5249k2496k8734k5650L7975o284j6968j93j6929
$$ plain form
10718 -11344 8053 23791 -8838 -14137 11501 -23267 -32308 -12475 -16029 -36895 37378 42817
10706 42817 29349 96379 85095 43244 32448 22229 34812 28042 30606 31836 23637 35196
10694 35196 2918 -66948 -52959 -54124 -74815 -56195 -56901 -66578 -80027 -88187 -82851 -64061 -43932
10681 -43932 -45131 -16705 25515 -1776 -13776 -10769 -34791 -13663 -6758 -4991 20190 5676
10669 5676 -22362 -52166 -51214 -27892 -323 49047 44631 50289 23720 -22324 -1831 36596 46283
10656 46283 -9375 -9926 23285 55795 32094 23777 -28231 -38784 7692 -11405 -55987 -58460
10644 -58460 -23924 -11180 -44443 -53368 -109921 -132126 -65347 32123 66661 23940 30932 57342
10632 57342 50889 23529 30626 55354 30105 7609 -21125 -46775 -8800 -15084 -32052 -32245 -49174
10619d9174l0474m3937J2865N122L0052J5032k4732L2548J1143K107K857J3674
10607b2917O773P423L3897M770j1879q073K7261K8251k4536l2781J0761j2765
10595F185m1152K7441R2890j0705o1682k3454M944k7491j5325n815O2047R7389
10583A05272N999j8438k6311j0030J4965k9292m3398N2734L1022j5165q644J7162
10571G5876L3806J4120M5670N2870O2018J00157J61873K96245N29038O72172M64187
10560B508032k67555p31692n81036l66067j93695j05923o7036j9607m4219l2740
10550I8462k5165M6872L7924L9203N614o8323m6748K0257Q939l7788l4500l18
10538D4429J9774K4189J4915L637l9323K2924j9918J9711l5929m6644k63M3632
$$ plain form
10619 -49174 -79648 -123585 -110720 -105598 -75546 -60514 -85246 -52698 -41555 -39448 -36591 -22917
10607 -22917 -16144 -8721 25176 29946 18067 9994 37255 65506 40970 8189 18950 6185
10595 6185 -34967 -7526 85364 74659 12977 -10477 -5533 -33024 -48349 -54164 7883 105272
10583 105272 111271 92833 66522 56492 71457 42165 -1233 51501 82523 67358 58714 75876
10571 75876 109682 123802 169472 222342 284360 384517 546390 842635 1371673 2043845 2508032
10560 2508032 2240477 1508785 927749 561682 367987 262064 195028 175421 131202 98462
10550 98462 73297 120169 158093 197296 202910 134587 87839 108096 117035 79247 44747 44429
10538 44429 64203 88392 103307 106944 67621 90545 70627 90338 54409 7765 7502 51134
10526E1134J7186M503O870j1948o5378m6813n274M6942K89M040m577K2224J7057
10513C6255l6626j4719j0091j665j5991K0074O440m218q328l268R887K3618J9767
10500B1135J7762M7303K8380K2141J9440k1981k5494k2794j9756p629o9010n8002
10488f8505K7269L2722L1074N221K8924J8516J0501j2267l2954k9408q179L8015
10476D0929K0603k6713j4838J3914m464j6934k4799j4068K3577N0958j9022r137
10464B0006r960p181k8101J4462j1199j9392k7019j0273Q7476L4986Q28r111j6349
10451A9173K8774j1955l7689q869J7886m002o234P340J2044N918N8153n986P743
10438H2296l4064k9172j6442O769n727l6145J1491j2414O2186M3408j9535m0883
$$ plain form
10526 51134 68320 72823 79693 67745 2367 -44446 -49720 -2778 -2489 1551 -3026 19198 36255
10513 36255 -371 -15090 -25181 -26846 -42837 -22763 -16323 -20541 -28869 -32137 -22250 1368 21135
10500 21135 38897 86200 114580 136721 156161 134180 108686 85892 66136 58507 -10503 -68505
10488 -68505 -41236 -8514 22560 27781 56705 75221 85722 73455 40501 11093 2914 40929
10476 40929 61532 34819 19981 33895 29431 12497 -12302 -26370 -2793 48165 29143 20006
10464 20006 10046 2865 -25236 -10774 -21973 -41365 -68384 -78657 8819 43805 44633 35522 19173
10451 19173 47947 35992 -1697 -10566 7320 3318 -2916 4424 16468 22386 80539 74553 82296
10438 82296 48232 19060 2618 9387 3660 -32485 -20994 -33408 28778 72186 52651 11768
10426A1768n820J0696m2849J9751R237J0398j1418j7420l9781J0046O1205O7352
10414H3165M5711J8122K8984J12034P7631j0641m1451q4482r7912k6770l8092
10403F6299k1293L5051L390K6814l863j608l4579k8772J2037l1379j7340J3103
10391A7860k5049j3812k6916L3050L4745M2470m6036R210M190m0162M491L4025
10379B8066l7760n5510R416L1676K2844j3563k2723j544L1731L5300N9868M9033
10367A36834R580n3635k1446L4331J5375j2594R591n6009k9195l0356J0564n161
10355G879J1614j6210N0733O0393O3175N335l6546j2218R926k1425k3414l5582
10343F3660l4791k0348J0734M8268L8917K7066J0148K7443j7634l3615l909k2629
$$ plain form
10426 11768 5948 16644 -26205 -6454 2783 13181 1763 -15657 -55438 -45392 15813 83165
10414 83165 128876 146998 175982 288016 365647 355006 313555 229073 131161 104391 66299
10403 66299 45006 80057 83447 110261 106398 104790 70211 41439 53476 22097 4757 17860
10391 17860 -7189 -21001 -47917 -14867 19878 62348 16312 25522 29712 -10450 -5959 28066
10379 28066 -9694 -65204 -55788 -24112 -1268 -14831 -37554 -39098 -7367 27933 87801 136834
10367 136834 146414 92779 71333 105664 121039 108445 118036 62027 32832 2476 13040 7879
10355 7879 19493 3283 54016 114409 177584 182919 146373 134155 144081 122656 99242 63660
10343 63660 28869 8521 19255 67523 106440 133506 143654 171097 153463 119848 115939 93310
10331I3310O823k119J1197k268k4759L7442J9131k0659J7322p194n4626m0604
10319C2996K2299L5735P144L7928K6544k6444l0471J0366L2079j0566K0833l2360
10307A26083l2070m3498j7771K5888K8366O743J6330l1871k3090j6609K4483R897
10295G2881K1565K1913J3695K5098k391j4440O7917P3260R8089N7584M9274J30032
10283F14477R6447q6160k57737k10251r7965j6446l728n6067J8383L6674K084
10272C9711L3349J584k3354j398L0509j1082L6550K2986l0879k9736J326O9398
10260A38964j0360k8491R254R010P811o959J2295M2662j2435o6530j1256p410
10248G6555l1658L2272L8326M6192M8745J7890l4516J9242K573l4601k6036R124
$$ plain form
10331 93310 100133 98014 109211 106943 82184 119626 138757 118098 135420 128226 73600 32996
10319 32996 55295 91030 98174 136102 162646 136202 105731 116097 148176 137610 158443 126083
10307 126083 94013 50515 32744 58632 86998 93741 110071 78200 55110 38501 62984 72881
10295 72881 94446 116359 130054 155152 152761 138321 206238 279498 377587 435171 484445 614477
10283 614477 710924 624764 367027 156776 58811 42365 38637 -17430 953 37627 39711
10272 39711 73060 74644 51290 49892 80401 69319 105869 128855 97976 68240 69566 138964
10260 138964 128604 100113 109367 118377 126188 119229 131524 174186 161751 95221 83965 76555
10248 76555 44897 77169 115495 161687 210432 228322 193806 213048 215621 181020 154984 164108
10236A64108L4331L6023n539j370J5359J7782J4092l9340J7107M3225p979p976
10224B79823p0794L3306P7925K882j5526J2373K1660J0150p008O0999P3768L560
10212D83118K084O515P0333O5287M0081K8640J5022J6440J9228j2337k9321k5096
10200F79994L0099O9721K7135O3038K3860K9651K0115O2282J06152J72431J92686
10189A477164J76037J78325J24304J56631J48541J82073J75183K59801M06586
10180C284645O57263R32123Q12330R8587k91414r2347J76448M17760O89408R15654
10170G600457J137582J410271J708324K185223L001768M150323N600646P890602
10162C4685196J2069485J9402410L1830481N3300293Q8548398J27443215R1662655
$$ plain form
10236 164108 198439 234462 228923 227553 242912 260694 274786 235446 252553 295778 287799 279823
10224 279823 209029 242335 320260 323142 307616 319989 341649 351799 344791 405790 479558 483118
10212 483118 485202 491717 562050 627337 667418 696058 711080 727520 746748 734411 705090 679994
10200 679994 710093 779814 806949 869987 893847 923498 943613 1005895 1112047 1284478 1477164
10189 1477164 1653201 1831526 1955830 2112461 2261002 2443075 2618258 2878059 3284645
10180 3284645 3941908 4874031 5686361 5784948 5493534 5401187 5577635 5995395 6684803 7600457
10170 7600457 8738039 10148310 11856634 14041857 17043625 21193948 26794594 34685196
10162 34685196 46754681 66157091 97987572 151287865 239836263 367279478 458942133
10155D58942133n3320372j37942632j06773750n9938566l2494295j8768529j2023896
10148C7680093q392139n984426m161270k847151j824664p86586L22821J513414
10140A5520092J653503p89994l276204l206164j878660q61296j94389J54995l11286
10131F810597j085997j149557q12766o05329l93347j44361k075Q9308K57615M12729
10121C376817L58808j35534n13747n19239l91869k82052k22913j67435j45328
10112A357508j24132k2962o1257j33990j13085o2911l228K0803L996J7609N850
10101H84201j8123l9373j322n555m2202o8693p7809m9583K0216L1373j8976J4814
10089F28968k5793o2622l1410p24J1082J8747K2497l9942q2287m9074M4597L2589
$$ plain form
10155 458942133 405621761 267679129 160905379 100966813 68472518 49703989 37680093
10148 37680093 29287954 23303528 19142258 16295107 14470443 13683857 14006678 15520092
10140 15520092 17173595 16383601 13107397 9901233 8022573 7161277 6966888 7121883 6810597
10131 6810597 5724600 4575043 3762277 3156948 2763601 2619240 2617165 2706473 2964088 3376817
10121 3376817 3735625 3600091 3086344 2567105 2175236 1893184 1670271 1502836 1357508
10112 1357508 1233376 1210414 1149157 1015167 902082 839171 835943 856746 860742 878351 884201
10101 884201 866078 826705 825383 819828 777626 708933 631124 581541 601757 633130 614154 628968
10089 628968 603175 540553 509143 508419 519501 538248 560745 520803 438516 389442 434039 466628
10077D66628Q378k5783k7774n2031o4953l6470l4139J0726K9202L0668j0195K0857
10065C15114p846K651j7744M3764J8736n9757l2329k9228l9951L3437O2360J7289
10053C06496J8697J3057o26p564k1308l5292O3705J5439o0992J4786m182O062
10041C08278m747L870n181j1353j0402M595M0026J0387L6059N2617l3376j92923
10029A97850j83162n4713K957r731J2149M0908P1364L3441j6534k6718J724K5501
10017I5036Q347J3579k778o235o025p706k9332M2508L5387J7631J3966M86k8262
10004A46602p9903n0454q128m426K8814O2237N9721q161j863J4284k6080m6163
9992H6480j9472N0312O364L205j3007o9104j9390L0716J8073j0816r3m616n3837
$$ plain form
10077 466628 475006 449223 421449 369418 304465 267995 233856 244582 273784 304452 294257 315114
10065 315114 307268 309919 292175 335939 354675 294918 262589 233361 193410 226847 289207 306496
10053 306496 325193 338250 337624 330060 308752 273460 337165 352604 291612 306398 302216 308278
10041 308278 303531 307401 302220 290867 280465 285060 325086 335473 371532 424149 390773 197850
10029 197850 14688 -40025 -37068 -46799 -34650 6258 77622 111063 94529 67811 69535 95036
10017 95036 103383 116962 114184 107949 101924 94218 64886 107394 142781 160412 174378 174864 146602
10004 146602 66699 16245 8117 3691 32505 94742 154463 146302 144439 158723 132643 86480
9992 86480 67008 117320 123684 126889 113882 44778 25388 56104 74177 63361 63268 58652 4815
9979D815j5315j9259n3351n1791L3810J9037K2290O0800K4400J1861K5656j1087
9967E1866O792L657M605J0183q509N602L3575N536K3692j832k715J1868j9616
9954A24704N742j4307l2785r484l5382j2721j5205q121O794j4463N4807N312K48
9941E5139j796j2479j0454K0889l302J1645k2560m3581K2351K7972M0599J6433
9929A00856m6137N132j6379j4171O5424K0668J328m958j9280J9372j2363L6368
9917A35860j9857m4711m5304L6345M2666k8881l199Q346N5500j9150k6428j9025
9905G2162O701J7928L6524r181m381j0965j7163j8142l3108j5954J8500N373k2534
9892B5760j7223N742n970L9802K9464K7010R143L991j9548m5217j5488K5084Q075
$$ plain form
9979 4815 -10500 -29759 -83110 -134901 -101091 -82054 -59764 1036 25436 37297 62953 51866
9967 51866 58658 62315 66920 77103 68594 74196 107771 113307 136999 135167 132452 144320 124704
9954 124704 130446 116139 83354 73870 38488 25767 10562 2441 9235 -5228 49579 54891 55139
9941 55139 53343 40864 30410 51299 47997 59642 37082 -6499 15852 43824 84423 100856
9929 100856 54719 59851 43472 29301 94725 115393 116721 111763 92483 111855 99492 135860
9917 135860 116003 71292 25988 62333 104999 76118 72919 81265 136765 117615 91187 72162
9905 72162 78863 96791 133315 124134 119753 108788 91625 73483 40375 24421 42921 48294 25760
9892 25760 8537 14279 8309 48111 77575 104585 113728 117719 98171 52954 37466 62550 70625
9879G0625l167j8626o692O159J9061j1038K246L3011L1155J6758k6231l8179l752
9866G1330R063J7301Q083L8208m118l5062j5046l2888J5879m4640l119L1617N0596
9853A07204K7821n1686k0718n778P717J5722l9537k4359n6293j435K2050J3641
9841e651J9917L9l616M4809N85j9872J2252l563J9262r527j9214l0517L950L6050
9827D4904K9384K478j6499k7905M1142L6651K3916k6601m4604j6775l929O510
9815D8672O332L6653O666p526m5875J161J5451l184O08n515j502j0615k8724n100
9801G502J1995K2017p701j1279J2806L5129j3923m2452O4489M282N714l3897J11
9788E4793J7594L6665j2978j562J3150k0258m0909j1K5354L1933O531J0752K430
$$ plain form
9879 70625 67458 48832 42140 48299 67360 56322 58568 91579 122734 139492 113261 75082 71330
9866 71330 80393 97694 105777 143985 139867 104805 89759 56871 72750 28110 24991 56608 107204
9853 107204 135025 83339 62621 56843 64560 80282 40745 16386 -39907 -41342 -19292 -5651
9841 -5651 14266 14305 10689 55498 56083 36211 48463 44900 64162 54635 35421 4904 8854 44904
9827 44904 74288 76766 60267 32362 73504 110155 134071 107470 62866 46091 42162 48672
9815 48672 55004 91657 98323 90797 44922 46083 61534 58350 58958 53443 51941 41326 12602 7502
9801 7502 19497 41514 33813 22534 35340 70469 56546 14094 78583 82865 88579 54682 54793
9788 54793 72387 109052 96074 94512 107662 87404 46495 46484 71838 103771 110302 121054 123484
9775A23484N378m5301M321L482n199J5685L3229j5887j9163k1604j1043m7167
9763B0215k7826Q066O1904l810J2295r457P985K0551N3760Q0774L2191M9282P8908
9750C84838R4570K05072L86595N76936O55810K38911n10716o85495m86227k92455
9740E67839r7653j07548q1046p5086m6730k5287O77l8561n5100L6614M6992L8018
9728A63129j6628l3813R454k3306m3832k1196k79L297J838L2083M5765K6967j3411
9715A30068m1787P190K416j3357M716L5380j0269k365K172k228m9071O530J0386
9702G9781K3293K8701K5487K706R57k670J08k4971k3451k0982N247K0826L4424
9689A49456m056k6900j0763p14j2447j6381L7086M6688P134l0778K1260J8193
$$ plain form
9775 123484 128862 83561 87882 91364 86165 101850 135079 119192 100029 78425 67382 20215
9763 20215 -7611 455 62359 58549 70844 61387 69372 89923 143683 224457 256648 305930 384838
9750 384838 479408 684480 1071075 1648011 2303821 2542732 2032016 1346521 860294 567839
9740 567839 470186 362638 281592 206506 159776 134489 135166 96605 41505 78119 125111 163129
9728 163129 146501 112688 122142 98836 55004 33808 33529 36826 38664 70747 116512 143479 130068
9715 130068 88281 95471 97887 84530 89246 124626 114357 111992 114164 111936 62865 69395 79781
9702 79781 103074 131775 157262 159968 160925 158255 158363 133392 109941 88959 94206 115032 149456
9689 149456 145400 118500 107737 107023 94576 78195 115281 161969 169103 138325 159585 177778
9677A77778O467J4865K2655L1037l1271J5169k9333K5222j3514n9710L8676O7309
9665B65350K7515j233m2577l1494k2421J4185R991L6478k5335n2704n657M6174
9653B18272M6417k6376P778J4981M9595K6153j9439J591O029L2440j663L230J0079
9640C69087J146l5590R703P0575K8630J3192m1533k0746K893J5577P61k3460J7777
9627D08012L8432J883r764j2225Q358Q4959O4013l653k8639J0192O762j1591O5578
9614F22317N3336L1310J3734J5237j341j0817L1822K3576L6565L6056M5400P1719
9602I68914K1792K1992N8222L2537L6000L7369N5688M4028J0991L8899N8173L5897
9590A420502K3114o876O7797N9579O7467L0419N4037P5841P4429J7285K8364N8416
$$ plain form
9677 177778 184245 199110 221765 252802 221531 236700 207367 232589 219075 159365 198041 265350
9665 265350 292865 291632 249055 217561 195140 209325 219316 255794 230459 177755 172098 218272
9653 218272 264689 238313 246091 261072 310667 336820 317381 318972 325001 357441 355778 359008 369087
9640 369087 370233 334643 344346 414921 443551 456743 415210 394464 397357 412934 413695 390235 408012
9627 408012 446444 448327 438563 426338 434696 519655 583668 580015 551376 561568 568330 556739 622317
9614 622317 675653 706963 720697 735934 734593 723776 755598 779174 815739 851795 897195 968914
9602 968914 990706 1012698 1070920 1103457 1139457 1176826 1232514 1276542 1287533 1326432 1384605 1420502
9590 1420502 1443616 1436740 1504537 1564116 1631583 1662002 1716039 1791880 1866309 1883594 1911958 1970374
9578A970374L2996J3778k4157K113P8218N9294J0594L4494j7855j8820l249M2644
9566B180424K8965j5594q223l4083M832j0344N851R836n7902m3003m5630o3409
9554A951720q3711o2091l0957l5643m4034k4795j457l7315j5536l9562n3754j6560
9542A506305k9693o3076o3054o0743r1081l3221m7738m0587M071J7325n1589j8848
9530A028071n2980o0599q2439j3819L9255J0817o2783l5695Q192j5995k0925j9783
9518G21317n4374l4333P609j4878k7815O263l2747j9971j5782m0558k0721l8607
9506D35403j4146K8654L4704j2320o2341J1267K5458j5125n3420q37r083k3553
9494C44661j4468j0818J2183K6446k830L7455O722k0284n1081j7251j6329l413
$$ plain form
9578 1970374 2003370 2017148 1992991 1995104 2073322 2132616 2143210 2177704 2159849 2141029 2137780 2180424
9566 2180424 2209389 2193795 2185572 2151489 2156321 2145977 2151828 2161664 2103762 2060759 2015129 1951720
9554 1951720 1868009 1805918 1774961 1739318 1695284 1670489 1669032 1631717 1616181 1576619 1522865 1506305
9542 1506305 1476612 1413536 1350482 1289739 1198658 1165437 1117699 1077112 1081183 1098508 1046919 1028071
9530 1028071 975091 914492 832053 818234 857489 868306 805523 769828 778020 762025 741100 721317
9518 721317 666943 632610 640219 625341 597526 603789 571042 551071 535289 494731 474010 435403
9506 435403 421257 449911 484615 472295 409954 421221 446679 431554 378134 377297 368214 344661
9494 344661 330193 319375 331558 358004 355174 392629 399351 379067 327986 310735 294406 290993
9482B90993J5651J873K5844k6532k5832j8989j4904m021M2121J4541J6147j6088
9470C00804m2882k5560j6600n0301k6365K1959L5488K6595j8607j0661j0503J6413
9458A99780J5577Q951q846j0785K230r499k8256j0540n596J7668J7919m877R258
9445A92984m1047n3329k1518n483J0686K2680J3815J6691J268j207R142m4154
9433A00528n9448l520J3886M9996J3710j2204k4284q545J8893J0454J0256k108
9421A07614K1306m3110j6676N5151J7605J0112m0795n5644O022J4875L7563K1241
9409A35264J6417j8266l4293M900K2898K103K1418j054n2498l5601m6033J4900
9397C0155K2353O802k4544m706R754L4719N008n1267n2219j0736M3240Q3909O643
$$ plain form
9482 290993 306644 308517 334361 307829 281997 263008 248104 244083 286204 300745 316892 300804
9470 300804 257922 232362 215762 165461 139096 161055 196543 223138 204531 193870 183367 199780
9458 199780 215357 224308 215462 204677 206907 197408 169152 158612 153016 170684 188603 183726 192984
9445 192984 151937 98608 77090 71607 82293 104973 118788 135479 136747 135540 144682 100528
9433 100528 41080 37560 51446 101442 115152 102948 78664 70119 89012 99466 109722 107614
9421 107614 128920 85810 69134 124285 141890 152002 111207 55563 61585 76460 114023 135264
9409 135264 151681 133415 99122 104022 126920 129023 150441 149387 96889 61288 15255 30155
9397 30155 52508 59310 34766 30060 39814 74533 79541 28274 -23945 -34681 8559 92468 99111
9384I9111k4770j8527k1521m0219L2364j6801K5905j5163j1398K1867p928n9973
9372c7053j6322p641M1485J9602K8186J2245m4222J719J6249Q506Q107k2639m387
9359C835R62J1559K0400q815l8099L8546K7549j4359K1990k7437l605L8876j8562
9346E2840k2958J3636L8666j3132M574j2503j5163k3927L7495J8063j0132n7452
9334A0007O010K5026l437k175Q058K346j4774m3323k0445L7276J8638n848J1678
9321B9037m657j8143J739M5684j8120p052O055L9853L7771j0243m8734m3857M207
9308A3540o42J158O327k5367l8624J3784j4677k442J3531K6192K3981K8861k4247
9295B1375k8252k6561k394J7831R98K5044m4420K1699N2192K3746J8293J6996
$$ plain form
9384 99111 74341 55814 34293 -5926 26438 9637 35542 20379 8981 30848 22920 -37053
9372 -37053 -53375 -61016 -19531 71 28257 40502 -3720 -2001 14248 22754 30861 8222 3835
9359 3835 4797 16356 36756 27941 -10158 28388 55937 41578 63568 36131 32526 71402 52840
9346 52840 29882 43518 82184 69052 73626 61123 45960 22033 59528 77591 67459 10007
9334 10007 16017 41043 37606 35431 43489 45835 31061 -12262 -32707 4569 23207 17359 29037
9321 29037 24380 6237 7976 53660 35540 28488 34543 74396 112167 101924 53190 9333 13540
9308 13540 12898 14056 20383 -4984 -43608 -29824 -44501 -46943 -33412 -7220 16761 45622 21375
9295 21375 -6877 -33438 -35832 -18001 -17003 8041 -36379 -14680 37512 61258 79551 96547
9283I6547J0639J0590j2149k1978j1983k5159l869m9722J46L1502j4232J4029
9271B4361j4065m3922K7391P302j2208P425q934K5854L7271p697m3421m82K9150
9258B8025m937K7170J2484j2077l0238m634R259j6747M055J9705K9604J8540q2145
9245a936l6599P315J7289J6973l6813k2996K2692L9650K5324r788k8590p682M298
9232a0863K5087M6559L457p447j76n0314k2657k9904j1921N8035N226R167m86
9219A3763j3046k5434m692k4694J2362M3351L2731L7562M7823l1120k2278n787
9207F0541k4536j1903k7183m0923j8399R162K5632R866p187j978K7484L3636l7085
9194b873L3106m846l3274l4436J7760M5720j155l2987K9171k0117K9331J8504
$$ plain form
9283 96547 107186 117776 105627 83649 71666 46507 42638 -7084 -6938 24564 10332 24361
9271 24361 10296 -33626 -6235 1067 -11141 -3716 -12650 13204 50475 42778 -643 -1125 28025
9258 28025 23088 50258 62742 50665 20427 15793 25052 8305 12360 32065 61669 80209 -1936
9245 -1936 -38535 -31220 -13931 3042 -33771 -56767 -34075 5575 30899 21111 -7479 -15161 -10863
9232 -10863 14224 60783 64240 56793 56617 6303 -16354 -46258 -58179 -144 5082 14249 13763
9219 13763 717 -24717 -29409 -54103 -41741 1610 34341 71903 119726 88606 66328 60541
9207 60541 36005 24102 -3081 -44004 -62403 -53241 -27609 -17743 -24930 -26908 576 34212 -2873
9194 -2873 30233 25387 -7887 -42323 -24563 21157 20002 -12985 16186 -3931 25400 43904
9182D3904N13k6025k1930j8449l810j8793N581k6142P035m329j4777R39K2530
9169e3753L9350L6811J2171L7722m6183q72j0174J4918M2652J4937j6048k0717
9157E0814L701O558m6714J5551L5686k8347l2239J3898L4030J0029k0638m10l0639
9144A1280l1128k98J5477j0356j7105l7797L1104k5480p237m195o231J0630J331
9131g0005K2657M8021r637J8025K6217l0057m476j595l748L2008L7741j2494j6524
9118C6133r0j9264L593N679j1035r342l6667K3302l8012k7446p814J8968o654
9105f8649J9328k372K9849N036L4144J5687k4173l5917o868J4377R295k0336K868
9092b7731j4348M8783M5713q902q314n1161k3652k7587M0477L5456k5466n7578
$$ plain form
9182 43904 44417 18392 -3538 -21987 -25797 -44590 -39009 -65151 -58116 -62445 -77222 -76283 -53753
9169 -53753 -14403 22408 34579 72301 26118 25246 15072 29990 72642 87579 71531 50814
9157 50814 54515 61073 14359 29910 65596 37249 5010 18908 52938 62967 42329 41919 11280
9144 11280 -19848 -20146 -4669 -15025 -32130 -69927 -38823 -64303 -71540 -75735 -81966 -71336 -70005
9131 -70005 -47348 673 -8964 9061 35278 5221 745 -850 -4598 27410 65151 52657 36133
9118 36133 36043 16779 20372 26051 15016 5674 -30993 -7691 -45703 -73149 -80963 -61995 -68649
9105 -68649 -49321 -51693 -21844 -16808 17336 33023 8850 -27067 -33935 -19558 -10263 -30599 -27731
9092 -27731 -42079 6704 52417 43515 35201 -15960 -39612 -67199 -26722 8734 -16732 -74310
9080g4310l1553L4546M9587l01M51k194k0895k2772K487l412O0300M7485J8281
9067E7700k2151L5J957r585k6178J9404k1989j4024j4844J0385j056p213p91P101
9053b1249l3209k9939l864L6877J6246J1119J819m3004K009L4915L3751j3100
9041g629p845M3750N98Q962j203m6763K3667k969k8331j0047o036r027L0506L5121
9027B2754m4981n381L8152j9646k0824j3585j4962m0847k1770L4041K31M2662
9015d4156O2294K4438m966O7910k8878l5491l9452j4779O062J6996P995J1045
9003B9018M2345N3146m5053r7078o9664K6566l6588p904N460O1960L5132J069
8991a591J7464J0119L512R671J824j6775k1242m5367j123J0840n2702K6027L5178
$$ plain form
9080 -74310 -105863 -71317 -21730 -22031 -21580 -23774 -44669 -67441 -64954 -68366 -8066 39419 57700
9067 57700 35549 35584 37541 27956 1778 21182 -807 -14831 -29675 -19290 -20346 -27559 -28350 -21249
9053 -21249 -54458 -84397 -88261 -51384 -35138 -24019 -22200 -65204 -63195 -28280 5471 -7629
9041 -7629 -15474 28276 28874 37836 36633 -10130 13537 10568 -17763 -27810 -33846 -42873 -12367 22754
9027 22754 -22227 -27608 10544 -9102 -29926 -43511 -58473 -99320 -121090 -87049 -86818 -44156
9015 -44156 18138 42576 37610 105520 76642 41151 1699 -13080 -7018 9978 17973 29018
9003 29018 71363 124509 79456 -17622 -87286 -60720 -97308 -105212 -99752 -37792 -2660 -1591
8991 -1591 15873 25992 29504 39175 40999 24224 2982 -42385 -43508 -32668 -85370 -59343 -24165
8978b4165O49K7997J1267j9344l9180K1440J4296P546j526k2966k0886j3916K1321
8965c7467J5139L4763R85k1354L677J4304K116k0688m1307l4259J0164J2146J9414
8952d2367K2078J2615N0177J0939M01J909M1200J36j2522m5882l9835O372K7379
8939C2600J3439l4470j6295m2336K5410L4862p2534j1595K0448J9797M7097K2631
8927C9054m9949l6300K6028O8695J1986J2160k2703o4637k0033m116L0706j2642
8915b1751l4664N6394M256J8991J002j5949J2348P638l325J5142l4901k4835k6386
8902d6040K329M1388J3779k3546j8908K8475l576m1986K2746K7344J9728P729
8890B9462m5475K7418K3802l3141k5234k5780J9623J0168N268J6857J8741n671
$$ plain form
8978 -24165 -23516 4481 15748 -3596 -42776 -21336 -7040 506 -1020 -23986 -44872 -58788 -37467
8965 -37467 -22328 12435 13420 -7934 -4257 10047 12163 -8525 -49832 -84091 -73927 -61781 -42367
8952 -42367 -20289 -7674 42503 53442 53843 55752 96952 97088 84566 38684 -1151 5221 32600
8939 32600 46039 11569 -4726 -47062 -21652 13210 -59324 -70919 -50471 -30674 16423 39054
8927 39054 -10895 -47195 -21167 47528 59514 71674 48971 -15666 -35699 -39815 -9109 -21751
8915 -21751 -56415 -21 4235 23226 24228 8279 20627 28265 24940 40082 5181 -19654 -46040
8902 -46040 -43711 -2323 11456 -12090 -30998 -2523 -6099 -48085 -25339 2005 21733 29462
8890 29462 -16013 11405 35207 2066 -23168 -48948 -29325 -19157 -13889 2968 21709 16038
8878A6038l3872L420K0926j8783j5665l6313j1064l252j6036J1327L7237J0657
8866c5380L4937k3603l3458k8464K3097L1394r926L4869p394j4565J1729L1835
8854A5071L3569n847o471j6314m5047M2878J6810Q548k5350j3815l1681l5887
8842f3536j9259L6177L5204L5164J4791q6150l7264m739L1934l3875K7946N3137
8830a0470m40l8184J4710n003k4777o702M4626j945L1379l1069k646j0102j6178
8817e6801J5361p3681L0455O8841j071R267k4112J3843L5310k726J0881K0159
8805D5726p738k9750l7854l4439P822N0767O1589N262m3623l9320m5395j5582
8793h2535K8408O5922N572n7116L185Q574L1531O424n018P988J1786l5918j771
$$ plain form
8878 16038 -17834 -14414 6512 -12271 -27936 -64249 -75313 -78565 -94601 -83274 -46037 -35380
8866 -35380 -443 -24046 -57504 -85968 -62871 -31477 -41403 -6534 -13928 -28493 -16764 15071
8854 15071 48640 42793 36322 20008 -25039 17839 34649 43197 17847 4032 -27649 -63536
8842 -63536 -82795 -46618 -11414 23750 38541 -47609 -84873 -89612 -57678 -91553 -63607 -10470
8830 -10470 -10910 -49094 -34384 -39387 -64164 -70866 -26240 -28185 3194 -27875 -30521 -40623 -56801
8817 -56801 -41440 -115121 -84666 -15825 -16896 -7629 -31741 -17898 17412 14686 25567 45726
8805 45726 37988 8238 -29616 -64055 -56233 -5466 56123 61385 17762 -21558 -66953 -82535
8793 -82535 -54127 11795 17367 -39749 -36564 -27990 3541 9965 4947 12935 24721 -11197 -12968
8780a2968r769J6530O955j4796K0184N3515M905R848n214l6288j3658K0915L427
8767D3586K6902J899l3179r796k1772j2775J7406j2040j2155K4844j5700l0573
8755c3353j2690k051n90K8658k5901k4915k3398M7106N4068J3351Q541j6735l004
8742I087l6099J8309K3609k278q689K3592p137O49k0876k5501j9938O12Q863M2038
8728F241R924k3923n0657k4882K4799J8470Q1239M569k2195J7264l0133n624j070
8715D022j9529J0125Q279K1489o671l0100k929O0931J9331l2952l0295m3670r540
8702e1509J9448L718m74M501j5997j1618O712J7579k6702J170l376J4311r63m1394
8688h4594j7044j6640M4507K3539l5081k6198L5154l458j6776N6055K3696M517
$$ plain form
8780 -12968 -22737 -6207 748 -14048 6136 59651 64556 74404 69190 32902 19244 40159 43586
8767 43586 70488 72387 39208 29412 7640 -5135 12271 231 -11924 12920 -2780 -33353
8755 -33353 -46043 -48094 -48684 -20026 -45927 -70842 -94240 -47134 6934 20285 28826 12091 9087
8742 9087 -27012 -8703 14906 12628 3939 27531 20394 21043 167 -25334 -45272 -44660 -35797 6241
8728 6241 16165 -7758 -58415 -83297 -58498 -40028 41211 45780 23585 40849 10716 5092 4022
8715 4022 -15507 -5382 2897 24386 17715 -12385 -15314 45617 64948 31996 1701 -41969 -51509
8702 -51509 -32061 -28343 -28817 -24316 -40313 -51931 -45219 -27640 -54342 -53172 -56548 -42237 -43200 -84594
8688 -84594 -101638 -118278 -73771 -50232 -85313 -111511 -76357 -79815 -96591 -40536 -16840 -12323
8676a2323k245o693n381k0421q166L947J9241q094M2329M1474l5730k5508O0400
8663D2830K0050m7491l2539K104Q1919K5838k4172l5460m3500o058j177j3341
8651c0997J3187K2066L6435K6456k6065J4893j836k8035N10J6237K3624l041l0736
8638C2698o6030j2515M2186L53J2578K4230J5369l3159O594o316J4335K5583J4653
8625G0559j3504o4505l3829j6356k1065J0150L0696J219j7039j403R361J542l6706
8612h0880L6715K1597Q027L0684J7778n0259l800M219j4574K0011L7813L6908
8600F4239l7055k1175j8432K6634J5008j4212j5326L931K0485m234k0032J3430
8588A3261K8823k909O010J1546k3321L6119J4319k1751J9753P5284P460m9210
$$ plain form
8676 -12323 -14568 -21261 -26642 -47063 -55229 -51282 -32041 -40135 2194 43668 7938 -17570 42830
8663 42830 62880 15389 -17150 -15046 66873 92711 68539 33079 -10421 -16479 -17656 -30997
8651 -30997 -17810 4256 40691 67147 41082 55975 54139 26104 26614 42851 66475 63434 32698
8638 32698 -33332 -45847 -3661 -3308 9270 33500 48869 15710 22304 15988 30323 55906 70559
8625 70559 57055 -7450 -41279 -57635 -78700 -68550 -37854 -36635 -53674 -55077 -45716 -44174 -80880
8612 -80880 -44165 -22568 -14541 16143 33921 -16338 -20138 -15919 -30493 -10482 27331 64239
8600 64239 27184 6009 -12423 14211 29219 15007 -319 3612 24097 19863 -169 13261
8588 13261 42084 39175 45185 56731 33410 69529 83848 62097 81850 157134 164594 115384
8576A15384l6613l7227m4026p908q491n826j6020L4654J5990m5966m1423j18M0420
8563c7170J0888r252K9162J7928k8854k433L0428p489o8047k931M5548M7308l0868
8550e782j2894J6040Q27J1176L6638O494l2289k9399o785K5208n593K6464L2281
8537F2386l6714k8785J7969N1288J099k0207l4795n0052L4709n768J4465N419
8525A1014j6439j754k7700o4198Q909O7989L1560j0328m282N847M164K5357j669
8512B8470k1657k3778j0879j5954q549L1556L8169q203l2110j2380m8740P3989
8500a0066J5301j6695l685l5918k7831O526O7863K0544o537J8408n0887l7597
8488f0574j4507M152O1486L6778j3327j5875j5372K4253j769m8382k9595k4457
$$ plain form
8576 115384 78771 41544 -2482 -10390 -18881 -24707 -40727 -6073 9917 -36049 -77472 -77590 -37170
8563 -37170 -26282 -35534 -6372 11556 -17298 -19731 10697 3208 -64839 -67770 -22222 25086 -5782
8550 -5782 -18676 -2636 -1809 9367 46005 52499 20210 -9189 -15974 9234 3641 30105 62386
8537 62386 25672 -3113 14856 66144 67243 47036 12241 -37811 -3102 -8870 5595 11014
8525 11014 -5425 -7179 -34879 -99077 -90168 -22179 9381 -947 -5229 618 4782 30139 28470
8512 28470 6813 -16965 -27844 -43798 -52347 -20791 17378 9175 -22935 -35315 -84055 -10066
8500 -10066 5235 -11460 -15145 -51063 -78894 -72368 -4505 16039 9502 27910 -22977 -60574
8488 -60574 -75081 -70929 -9443 27335 14008 -1867 -17239 7014 5245 -43137 -72732 -97189
8476i7189J6940K1155q865R281L1193L2062L3664K7371r368j4357K0857k9347
8464C3397l1360k8717k4220O017M3437O556l8829K3926r288P35J2820n882L0973
8451A9565j6893o3471m993L9115Q0575m190l4024k76k350j1520l6976N89J1759
8438b3090R695L3165P866J0593O606j2609l1785l541L2051N169j103l3191l3089
8425c3263J7608k459K4015O042l5994J7076R854m031j2569k4390k771j3313K5849
8412b8346M0248J1654j8488m5617j408k4296L0767j2483J2764l115j335Q953Q404
8399b2298R403L0989R00l287j5764k0853J6887J1728P745l617J3508j34Q607Q082
8385D1896n4092n4493r534j2093J1579J8136j3025j7838M8518o422J2906k048
$$ plain form
8476 -97189 -80249 -59094 -67959 -58678 -27485 4577 38241 65612 56244 41887 62744 33397
8464 33397 2037 -26680 -50900 -44883 -1446 5110 -33719 -9793 -19081 -18346 -5526 -11408 19565
8451 19565 2672 -60799 -65792 -26677 53898 49708 15684 15408 13058 1538 -35438 -34849 -23090
8438 -23090 -13395 19770 27636 38229 44835 32226 441 -3100 28951 34120 33017 -174 -33263
8425 -33263 -15655 -18114 5901 11943 -24051 -6975 2879 -1152 -13721 -38111 -40882 -54195 -28346
8412 -28346 11902 23556 5068 -40549 -41957 -66253 -35486 -47969 -35205 -38320 -39655 -30702 -22298
8399 -22298 -12895 18094 18994 15707 -57 -20910 -4023 7705 15450 11833 25341 25207 33814 41896
8385 41896 -12196 -66689 -76223 -88316 -76737 -58601 -71626 -89464 -40946 -47368 -34462 -36510
8373c6510L7225L6315p032l4125k7415l3226K793J6263J7876K9847K5393j8476
8361H928l8983j5661J6557R14j138K6757L5031J1196l173n498j1529j8704j0325
8348e628O467L5772k797K769K3936n487j8527k2287r939k2405r597K8636J3560
8335A4473R648J5875J6852L985q240k5728o8364Q510N915J524n183K4581k5331
8322c1483K8847J9047l1261l3970J047L1333K0907K9683l6301l2779k8477j837
8310f5244k1150J3514L3866m831J1863o993J1130L3893l7048m6293q447K120P907
8297g5713K0781L1531K29j7868M437P4222L9809k7977k9504j8230L267K2504m998
8284B2490L1858K9712k4975o4893n8225j673J323p300M7417M8062o666m3420j9886
$$ plain form
8373 -36510 715 37030 29998 -4127 -31542 -64768 -61975 -45712 -27836 2011 27404 8928
8361 8928 -30055 -45716 -29159 -28245 -29383 -2626 32405 43601 40428 34930 23401 4697 -5628
8348 -5628 839 36611 33814 36583 60519 55032 36505 14218 4279 -18126 -27723 913 14473
8335 14473 24121 39996 56848 60833 52593 26865 -41499 -32989 -27074 -25550 -30733 -6152 -31483
8322 -31483 -2636 16411 -14850 -48820 -47773 -16440 4467 34150 -2151 -34930 -63407 -65244
8310 -65244 -86394 -72880 -39014 -43845 -31982 -38975 -27845 6048 -31000 -77293 -85740 -83620 -75713
8297 -75713 -54932 -23401 -23172 -41040 -36603 37619 77428 49451 19947 1717 4984 27488 22490
8284 22490 54348 84060 59085 -5808 -64033 -65706 -64383 -71683 -24266 23796 17130 -26290 -46176
8271d6176K652O4044P6101k4596r723J9314k9364r2628l3967R810K101k3122K0609
8258f4945K3354r92L4628k0288L4658n567m934k51j1344l53J3288R485o135m6231
8244d5627l8950Q557K3648N3429j4794l1377j456P061n3820j8750J7601O0202
8232c4276m568k8698J5792L9736K2267j0258K7616l4131o096L4909k2461k5370
8220b5538k7871n311k2567P229M6581K9080j2184k5061k467m4845l6733L8014
8208h1673M5912m538J8295N7524J9647j632L9254r957m0793n0748J0984n042l9999
8195d2766q599L5048J5771R013l0443j4013k9135k0636K843j222L4445J5537o657
8182d0814p496J0253R308K1569k8672M464K1260l1779j7208L6585J4072j29j0067
$$ plain form
8271 -46176 -43524 20520 96621 72025 62302 81616 52252 -40376 -74343 -64533 -62432 -85554 -64945
8258 -64945 -41591 -42583 -7955 -28243 6415 848 -4086 -4337 -15681 -16034 -2746 6739 604 -45627
8244 -45627 -84577 -76020 -52372 1057 -13737 -45114 -46570 -39509 -93329 -112079 -94478 -34276
8232 -34276 -38844 -67542 -51750 -12014 10253 -5 27611 -6520 -12616 22293 -168 -25538
8220 -25538 -53409 -58720 -81287 -74058 -27477 1603 -10581 -35642 -38109 -82954 -119687 -81673
8208 -81673 -35761 -40299 -22004 35520 55167 53535 92789 82832 42039 -8709 2275 -2767 -42766
8195 -42766 -51365 -16317 -546 8467 -21976 -35989 -65124 -85760 -82917 -84139 -49694 -34157 -40814
8182 -40814 -48310 -38057 -28749 -7180 -35852 -31388 -10128 -41907 -59115 -22530 -8458 -8587 -18654
8169a8654k2194Q1273l095l0585l5782j7778L1084M866n401j4082k1446N0945
8157h49j7073k3025k1255o809K2510j314J7872M7577J6257J5205l8217k3107l010
8144a5238L604L8868k0869k5583k7747J0186j834l0165L5488k392L0444K0440
8132A5202L0317q270l364J6067l722k7448m9199m7903J5851M1657M1763k3199
8120b248r627J8014Q565o502l3404m371K9352j5102P183M1296R665m6601m4432
8107d8212o555L8316K274j1316J6990P122j8258j0469j5566M0386M3619p673J3476
8094D4134k5400m0931k854M2587M3329j06L836k8302k6379l0368Q446J9085l12
8081F765n5822K0505J0632M319j266M603k7643Q162N2770M5291k6009n1050L079
$$ plain form
8169 -18654 -40848 40425 37330 6745 -29037 -46815 -15731 -10865 -16266 -30348 -51794 -849
8157 -849 -17922 -40947 -62202 -69011 -46501 -47815 -29943 17634 33891 49096 10879 -12228 -15238
8144 -15238 -11634 27234 6365 -19218 -46965 -36779 -38613 -68778 -33290 -35682 -5238 15202
8132 15202 45519 37249 33885 49952 46230 18782 -30417 -78320 -62469 -20812 20951 -2248
8120 -2248 -11875 6139 14704 8202 -25202 -29573 -221 -15323 -8140 33156 42821 -3780 -48212
8107 -48212 -54767 -16451 -14177 -25493 -8503 -1381 -19639 -30108 -45674 -5288 38331 30658 44134
8094 44134 18734 -22197 -25051 17536 60865 60759 64595 36293 9914 -20454 -12008 7077 6765
8081 6765 -49057 -28552 -17920 -13601 -14867 -10264 -37907 -29745 23025 68316 42307 -8743 -5664
8068e664N3834j3223l4861K1088N3579K1369j3604n5720l9143k4940k130M3446
8056D031j8880p886j2582L2711j4736l5915j9745K617J1156O2417l0947m8547
8044g6306q770N2418L1618K3865j1048O796M2626j1147r460o0039k7366m757k9562
8031h1132p216K8347J2902K1845r969K8285K8305K970j3738j2005j5228J1137
8019e497k5883k0577M2119j8047l009M063K7934M3240l5324l0070J2794J0240
8007A983J0860N2421n7935j0388J7319k1448j0545K7730L7225J3987n6739m6645
7995d2175K3964K4068K996L083J7482J4733l4704k8952l4336K0844N2294L394
7983B2691n374j6409J6951N099k9525r226j0797J7236M1190L6867j1397l7096
$$ plain form
8068 -5664 48170 34947 86 21174 74753 96122 82518 26798 -12345 -37285 -39415 4031
8056 4031 -14849 -22735 -35317 -2606 -17342 -53257 -73002 -70385 -59229 3188 -27759 -76306
8044 -76306 -85076 -32658 -1040 22825 11777 18573 61199 50052 40592 -19447 -46813 -51570 -81132
8031 -81132 -88348 -60001 -47099 -25254 -35223 -6938 21367 24337 10599 -1406 -16634 -5497
8019 -5497 -31380 -51957 -9838 -27885 -30894 -26831 1103 44343 9019 -21051 -8257 1983
8007 1983 12843 65264 7329 -3059 14260 -7188 -17733 9997 47222 61209 4470 -42175
7995 -42175 -18211 5857 8853 11936 29418 44151 9447 -19505 -53841 -32997 19297 22691
7983 22691 17317 908 17859 22958 -6567 -15793 -26590 -9354 31836 68703 57306 20210
7971B0210L5464J1292l5960j2807m9937j436o361j7802M8989J1735l848J1632
7959A1171J8161O462l7409m6981k0431j944M4629J0466j6079l3837M2862J8321
7947d609L7056J355m227N7552K3600n6341p9902k1278K0457l7674L4579N6361
7935B6929k340l7879l465R619J688J3114J3943N365K0194Q097J4733j3904k1271
7922C4823j1366k186J2323k5349j8907o555q532J136q193n233l6554K0277L7608
7909a6708J1703L9674j2227j2714k0629M14K181N322N304K1685n3615l9062J0893
7896e7779J7111J9223M5030L1133o447L727R397l7810p8409J3698M0191K5445
7884B4510n416K5466K2817o724j7657j0978J3319j1789k3007k3485l6517l1995
$$ plain form
7971 20210 55674 66966 31006 18199 -31738 -33174 -39535 -57337 -8348 3387 -461 11171
7959 11171 29332 35794 -1615 -48596 -69027 -70971 -26342 -15876 -31955 -65792 -22930 -4609
7947 -4609 32447 33802 29575 87127 110727 54386 -25516 -46794 -26337 -64011 -29432 26929
7935 26929 24589 -13290 -16755 -7136 -5448 7666 21609 26974 47168 55265 69998 56094 34823
7922 34823 23457 21271 33594 8245 -10662 -17217 -25749 -24613 -32806 -38039 -74593 -54316 -16708
7909 -16708 -5005 34669 22442 9728 -10901 -10487 -8306 -2984 2320 24005 -29610 -68672 -57779
7896 -57779 -40668 -21445 23585 54718 48271 51998 61395 23585 -54824 -41126 -935 24510
7884 24510 19094 44560 67377 60653 42996 32018 45337 33548 10541 -12944 -49461 -81456
7872h1456l6970j976J0743N0751j0183j1907J1497L5782R487m3985j9178M9768
7860c7627K0918K5325j1903j8154J8537L690k7898Q971K3134J9440L1686Q150
7848F4269j7926k9561l7212k8818m2127K9588J7504l5460L1965N1003L425K1598
7836B8248Q115j6904k8246k8826K2272P403j695J0229n7214k3987M4152K3311
7824a3142K7037K3584K195L1126k5097k3312R629l0057n5028P713K0530N1114
7812B6292K255k4165j2669P385N280l1170N89J9552L2762K7170k162p992q710
7799C4417J1349k4794K6528r578m5401J7906R296k946r292j289J9218P903k9537
7786C780j4646J1450J3801k4032o681J9331j741j7022q804J6778k5823J0272K4283
$$ plain form
7872 -81456 -118426 -120402 -109659 -58908 -69091 -80998 -69501 -33719 -24232 -68217 -87395 -37627
7860 -37627 -16709 8616 -3287 -21441 -2904 786 -27112 -18141 4993 24433 56119 64269
7848 64269 46343 16782 -20430 -49248 -91375 -61787 -44283 -79743 -47778 3225 6650 28248
7836 28248 36363 19459 -8787 -37613 -15341 -7938 -9633 596 -56618 -80605 -36453 -13142
7824 -13142 13895 37479 39674 70800 45703 22391 32020 1963 -53065 -45352 -24822 26292
7812 26292 28547 4382 -8287 -902 4378 -26792 -26203 -6651 26111 53281 51119 43127 34417
7799 34417 45766 20972 47500 37922 -7479 10427 19723 16777 7485 6196 25414 33317 3780
7786 3780 -10866 584 14385 -9647 -16328 3003 1262 -15760 -24564 -7786 -33609 -23337 946
7773I46K4235j0344o102L2600k4647l8279O8754j1052k5921l2555j1962j1778
7761d6105K2451L5907j93l4253P811k7298l3848k839L6275L5120j9570N708N4818
7748C3984N686l5197J3249k3962l3854m027M3071L2120L7289p748j1770M251j2265
7735D0827r286m7563P690J5187K310k904j5338n839j3464J2050j7887J8199J5654
7722c64K0133m6220k6152K9835R832K3518J8394k497l827j266R804r239K3354
7709D5305K4532l9109l9146j3243N6526R165J6630j9411m2949k4440l1097l3224
7697i0461j6897L6603L351R000L8974p186j587J07N4424o025n7765j6557J0940
7684d3079j9462K0164Q4006J9079k3844j0364o269l987M2478J3824k9296m3230
$$ plain form
7773 946 25181 14837 8735 41335 16688 -21591 47163 36111 10190 -22365 -34327 -46105
7761 -46105 -23654 12253 12060 -22193 -14382 -41680 -75528 -78367 -42092 -6972 -26542 -20834 33984
7748 33984 39670 4473 17722 -6240 -40094 -44121 -1050 31070 68359 60611 48841 53092 40827
7735 40827 31541 -16022 -8332 6855 9165 6261 -9077 -14916 -28380 -16330 -34217 -16018 -364
7722 -364 19769 -26451 -52603 -22768 -12936 10582 28976 26479 22652 21386 31190 21951 45305
7709 45305 69837 30728 -8418 -21661 34865 44030 60660 41249 -1700 -26140 -57237 -90461
7697 -90461 -107358 -70755 -67404 -58404 -19430 -26616 -28203 -28096 26328 20303 -37462 -54019 -43079
7684 -43079 -62541 -42377 41629 60708 36864 26500 20231 16244 58722 72546 43250 20
7672B0J2196M3231k7332j3546j6470k1441l1064l1633k549j6667o761l645o453
7659a22114Q2643Q5393K9961l8159l5075P244l878j2816M280L0127K8455k4568
7647C1493l7466l2536R409L7155L5671j1634k4674j1976j0867M7326J7655k8963
7635B0593m910P788J0776k2863k6651R425M0869J3350j4650p96j8811k0919K7426
7622B0627K1163l1080n7954J0409K6176n6729m3146O3791J1545n335M490M448
7610c1595J059j2663j7399J1309N2851M3404j977l596p350n5613k8417K0338M1406
7597A1757k6670j9955L1764O5666k3177K323K3328m0220l8880O107N5006l1755
7585A5294p406J2139J8320L276m076J1563m4337l4492J6071N8209K0975M403n911
$$ plain form
7672 20 12216 55447 28115 14569 -1901 -23342 -54406 -86039 -88588 -105255 -112016 -115661 -122114
7659 -122114 -39471 45922 75883 37724 2649 9893 6015 -6801 -2521 27606 56061 31493
7647 31493 -5973 -38509 -29100 8055 43726 32092 7418 -4558 -15425 31901 49556 20593
7635 20593 15683 23471 34247 11384 -15267 -5842 35027 48377 33727 32931 14120 -6799 20627
7622 20627 41790 10710 -47244 -36835 -10659 -67388 -110534 -46743 -35198 -40533 -36043 -31595
7610 -31595 -30536 -43199 -60598 -49289 3562 46966 44989 41393 34043 -21570 -49987 -29649 11757
7597 11757 -14913 -34868 -3104 62562 39385 41708 65036 24816 -14064 -7957 47049 15294
7585 15294 7888 20027 38347 41623 37547 49110 4773 -29719 -13648 44561 65536 69939 64028
7572F4028l5832l2550j7485k7651r490J7645n98J1335J3720M9687L1626j7062
7560D7373k0725P050j9825L4806k9089k6290P488j5138K5931l1276l8018K1077
7548c6636K3542j3185J6732K3342L7212n7363k077N4146N997j1488K072k8092
7536A4202l3468j0270N407J0429K0499J2501n3704J1108N4602K9553o6202n3387
7524e8730R086M3728R308n132r079k5099j991J8137J128l1024j8469K2352M9743
7511C958J2773j2070L5467L591p1461K7198N4585j8859j9862k5506k2590J2215
7499b0561j9491n7944O985M0409p859j0212K8278K9538L8588j3971L789J0217
7487B7766P833l4926k0269L052q5L4144J7541l5502m4051J0987K9050k1176k983
$$ plain form
7572 64028 28196 -4354 -21839 -49490 -58980 -41335 -41933 -30598 -16878 32809 64435 47373
7560 47373 26648 33698 13873 48679 19590 -6700 788 -14350 11581 -19695 -57713 -36636
7548 -36636 -13094 -26279 -9547 13795 51007 -6356 -8433 45713 51710 40222 42294 14202
7536 14202 -19266 -29536 -24129 -13700 6799 19300 -34404 -23296 31306 60859 -5343 -58730
7524 -58730 -49644 -5916 3392 -1740 -10819 -35918 -37909 -19772 -18644 -49668 -68137 -45785 3958
7511 3958 16731 4661 40128 43719 -27742 -544 54041 35182 15320 -10186 -32776 -20561
7499 -20561 -40052 -97996 -91011 -50602 -58461 -68673 -40395 -10857 27731 13760 17549 27766
7487 27766 35599 673 -19596 -16544 -16629 17515 35056 -446 -44497 -33510 -4460 -25636 -28619
7474b8619K1988L1095l233N579l9584j2518N324j3807L7361N491j7864r824M5431
7461B6820r623M534K8012l2711l9246J055K0365L3699r259k0144L4683Q040J241
7448D7466M1534m576l6042l4378J5799J7035k8801l8340M182K1373J2929j1296
7436F885l8552j1370j415J6926K5382J9000j5080j2076L3414L0624q286q6281
7424d0829l2164O367L2214L3713P373N8369m989j1817o6042n3626Q598R109J6502
7411c7222K6768L3379J8954l0951N395M746o620j6624j2884J0811j9686m285K6050
7398b169J8365J8634J4738o145o3423J2773M7932j5600J90q174Q623L5836K559
7385F4139m9346j4600r681J4434J1880j9180J6704J5531k2671l3265k0463j6872
$$ plain form
7474 -28619 -6631 24464 21231 26810 -12774 -25292 -19968 -33775 3586 9077 -8787 -18611 26820
7461 26820 17197 21731 49743 17032 -22214 -21159 -794 32905 23646 3502 38185 46225 47466
7448 47466 89000 84424 48382 14004 29803 46838 18037 -20303 -16121 5252 18181 6885
7436 6885 -31667 -43037 -44452 -27526 -2144 16856 1776 -10300 23114 53738 45452 -40829
7424 -40829 -72993 -66626 -34412 -699 6674 65043 60054 48237 -17805 -71431 -62833 -53724 -37222
7411 -37222 -10454 22925 41879 10928 16323 21069 14449 -2175 -15059 -4248 -23934 -28219 -2169
7398 -2169 16196 34830 49568 43423 -20000 -7227 40705 25105 25295 17121 25744 61580 64139
7385 64139 14793 193 -9488 4946 16826 -2354 14350 29881 7210 -26055 -46518 -63390
7373f3390j6604M7537L0823K8907j0471l4524K4855l7882P816N3152J9952l452
7361D6719l3375n7908j7108K1110K6721J2816o961l6944j6436j5117m7366J1501
7349a12348M8904L5308L2293K1924j7510k432n2085k7649l4121K6808N1466q928
7337c8370k4544J7121K4212J7040N0215K7497l5913n3779j0503k2806n5502j5559
7325a20891O082L0815n336m090N0556L6545k7796j0917L8976j8351m420J8153
7313a0674k482j9923j2132M210l5549J6200J3069O605m1987J2677O0737O742O804
7300D297j3048j169K0816K981O79j0890K5100N1752J9140k7443l7214k3478K0327
7287C1850k194k8543j0606j194M7157K1926n2805m0455J1867L1512J8787j8825
$$ plain form
7373 -63390 -79994 -32457 -1634 27273 16802 -17722 7133 -30749 -22933 30219 50171 46719
7361 46719 13344 -44564 -61672 -40562 -13841 -1025 -7986 -44930 -61366 -76483 -123849 -112348
7349 -112348 -63444 -28136 4157 26081 8571 6139 -45946 -73595 -107716 -80908 -29442 -38370
7337 -38370 -62914 -45793 -21581 -4541 45674 73171 37258 -16521 -27024 -49830 -105332 -120891
7325 -120891 -114809 -83994 -89330 -93420 -42864 -6319 -34115 -45032 -6056 -24407 -28827 -10674
7313 -10674 -13156 -33079 -45211 -41001 -76550 -60350 -47281 -40676 -82663 -69986 -9249 -2507 4297
7300 4297 -8751 -9920 10896 13877 14556 3666 28766 80518 99658 72215 35001 11523 31850
7287 31850 29656 1113 -9493 -10687 36470 58396 5591 -34864 -22997 8515 27302 8477
7275H477j0622L855k0606M182J3333m3292p72K0480o665Q718J6066k0590k8612
7262e6048p686K5099L1074p946k4534K2395L5397n8667n8861N5235K3697j1842
7250c2687O460j4182o699p259r443M521K0376k4445J4117k1002K2639L1537M642
7237a1425Q628M7224L4692k2181k9865k5860P950o176n0565o846J5736K3950M6509
7224C1771k2925o1917j7610O560J6873j0302n533Q166r407K177J7105L8109J0581
7211C648m020m1928j9611L9681L0504k1333m8132q494L1604l6774q179Q849O8700
7198e485L7445R678j5109K160k272o546o288j5945p714k5142j1309K8848M9356
7185C1677K9555J6215o2114m2289j2177k179j2698K1721M2494K0450k4467k23
$$ plain form
7275 8477 -2145 1710 -18896 -14714 -1381 -44673 -45445 -24965 -31630 -22912 -6846 -27436 -56048
7262 -56048 -63734 -38635 -7561 -15507 -40041 -17646 17751 -40916 -99777 -44542 -20845 -32687
7250 -32687 -26227 -40409 -47108 -54367 -63810 -59289 -38913 -63358 -49241 -70243 -47604 -16067 -11425
7237 -11425 -2797 44427 79119 56938 27073 1213 9163 2987 -47578 -54424 -38688 -14738 31771
7224 31771 8846 -53071 -70681 -64121 -47248 -57550 -63083 -54917 -64324 -62147 -45042 -6933 3648
7211 3648 -372 -42300 -61911 -22230 8274 -13059 -61191 -69685 -38081 -74855 -83034 -74185 -5485
7198 -5485 31960 41638 26529 28689 26417 19871 13583 -2362 -10076 -35218 -46527 -17679 31677
7185 31677 61232 77447 15333 -26956 -39133 -41312 -54010 -32289 10205 30655 6188 5965
7173E965k4212j4138q551J5438J1148k6538j2212J7273Q216j122K7474L064k2604
7160b0799O317l2242k1006J8574N4374J7713n680R044n3479J3889K239k7291l8135
7147g6482L0942J1100M647k8266M1808n03r753k0855n315L2403K6181l8143m093
7134c6329j1318j3463m527K7617K2168L0969j6859k7544K8565k6837r453J322
7122c5689J7312m337k0703m3177J089J1833M6094L465k767M816j691L9685K7491
7109D3421K6320r812m0608M715p936l5759R296O093L1800m352K5579j7035q0316
7096d8594l1494L7082N8088J0990R977m768j8865j4171j2616R778J0014l7678
7084c2257j7633J5089O9867K1428l816n9070l4734k1078K0958O349p870R727K0347
$$ plain form
7173 5965 -18247 -32385 -40936 -25498 -14350 -40888 -53100 -35827 -27611 -28733 -1259 1805 -20799
7160 -20799 -14482 -46724 -67730 -49156 5218 22931 17251 26295 -27184 -13295 -11056 -38347 -76482
7147 -76482 -45540 -34440 -29793 -58059 -16251 -16754 -26507 -47362 -52677 -20274 5907 -32236 -36329
7134 -36329 -47647 -61110 -65637 -38020 -15852 15117 -1742 -29286 -721 -27558 -37011 -35689
7122 -35689 -18377 -22714 -43417 -86594 -85505 -73672 -27578 -24113 -26880 -22064 -23755 15930 43421
7109 43421 69741 59929 19321 24036 16100 -19659 -10363 -4270 27530 23178 48757 31722 -48594
7096 -48594 -80088 -43006 15082 26072 36049 31281 12416 -1755 -14371 -4593 5421 -32257
7084 -32257 -49890 -34801 35066 56494 52678 -6392 -41126 -62204 -41246 -34897 -42767 -33040 -12693
7071a2693l0062Q895K9801l789l502Q981r985L8228k2352l5373m923K4789L7388
7058B5403o32j3444l3803k4516m581R150j9365J1243L1075L8553o222Q551o95
7045B0717k3680n0843r257J9286J7768j8821l6628n0949K3151O3053j1589M3486
7033a4306L6702k6270l7110m301j4952M5643O1647K7645j7051l5908j657J1788
7021C1870K6200L361K313k4267k0954J4829k0184l5147j5676j8212j2566P060
7009f1373J2910j9326q877L2349K3873K5375L167L6775p378m0537K1655K4982
6997D3595l9105J8268R100j3189Q012m1472j2672K8302j4265N00p367j8508L2394
6984f407L4409L9259J618j9846j6694K3526l8721m8250J8854J193k1723j522M0905
$$ plain form
7071 -12693 -42755 -33860 -4059 -7848 -11350 -2369 -12354 25874 3522 -31851 -36774 -11985 25403
7058 25403 24771 11327 -22476 -46992 -51573 -42423 -61788 -50545 -19470 19083 12861 21412 20717
7045 20717 -2963 -53806 -63063 -43777 -26009 -44830 -81458 -132407 -109256 -46203 -57792 -14306
7033 -14306 22396 -3874 -40984 -45285 -60237 -14594 47053 74698 57647 21739 20082 31870
7021 31870 58070 61431 63744 39477 18523 33352 13168 -21979 -37655 -55867 -68433 -61373
7009 -61373 -48463 -67789 -76666 -44317 -20444 4931 8098 44873 37495 -3042 18613 43595
6997 43595 4490 22758 31858 18669 26681 -14791 -27463 839 -13426 -12926 -20293 -38801 -6407
6984 -6407 28002 67261 68879 49033 32339 55865 17144 -31106 -12252 -11059 -32782 -34304 6601
6971F601K0646k1518k9505j480J0380K8570K9524k5937l4469j6429p039J6621
6959b4035j061o1958j0732J4084M6811M8378n134j2732r565J5705J4403m8881
6947c4717j6398j3065J2698L4632o29K6187m023l4329J2943k0521m807R0992N163
6934E4126k0795j7774R296k6040k790J0208L4704m6335j3292R478k1377j4444
6922d5035L8789j4555r399L4801J543J3488q767k6825o4940j3359n943j1222L5272
6909g6152K7557L3938j7825l4279L7512L303j7334j1353p811N0421M1105p082
6897B2000L977K0628J1926j6269j0544o089J6120j4809k294j4965J732Q552k7016
6884g051Q092k7945k2132J8247J6032J7197k8527N617O2510J6920k424k6377j2196
$$ plain form
6971 6601 27247 5729 -23776 -25256 -14876 13694 43218 17281 -17188 -33617 -40656 -24035
6959 -24035 -25096 -87054 -97786 -83702 -36891 11487 6353 -6379 -15944 -239 14164 -34717
6947 -34717 -51115 -64180 -51482 -16850 -17479 8708 4685 -29644 -16701 -37222 -42029 48963 54126
6934 54126 33331 15557 24853 -1187 -3977 6231 40935 -5400 -18692 -9214 -30591 -45035
6922 -45035 -6246 -20801 -30200 4601 6144 19632 10865 -15960 -80900 -94259 -100202 -111424 -76152
6909 -76152 -48595 -14657 -32482 -66761 -29249 -25946 -43280 -54633 -62444 -12023 29082 22000
6897 22000 25977 46605 58531 42262 31718 25629 41749 26940 24646 9681 11413 19965 -7051
6884 -7051 1041 -26904 -49036 -30789 -14757 2440 -26087 -20470 42040 58960 56536 30159 17963
6871A7963k1454r409j4746m852K8403K0352L7101O392l2806l866J0120k3411j9382
6858i595l9900j3744j0143L0366R887j928N205J5241N1408O720o039L04n407J1976
6844D4351l9587p3509j2606J9478J4786K1329q025j4168L614M2101L364L1820
6832C2948K6675j7654j3553L022r996k4473r794r389K5848K333K1046k181m775
6819B0057j6912j2086k4153k8403J6557O2163M8693J3670M610n6760n0748k1731
6807d5043J7753K2879L572M260j5110q313K5400j5991K952M633R835p550n4873
6794e5596R657P8716L4072J5059l8977R252J684Q840k4637j3305Q969j0146L0479
6781E4067j3656j0620O828m775p729K1508j8978k6362q390n9482m4295J5567K6030
$$ plain form
6871 17963 -3491 -12900 -27646 -32498 -4095 16257 53358 59750 26944 23078 33198 9787 -9595
6858 -9595 -49495 -63239 -73382 -43016 -33129 -35057 -29852 -14611 36797 43517 37478 37782 32375 44351
6844 44351 4764 -68745 -81351 -61873 -47087 -25758 -33783 -47951 -44337 -2236 1128 32948
6832 32948 59623 41969 28416 31438 21442 -3031 -12825 -22214 3634 5967 27013 24832 20057
6819 20057 3145 -8941 -33094 -61497 -44940 17223 65916 79586 84196 27436 -23312 -45043
6807 -45043 -27290 -4411 -839 3421 -11689 -20002 5398 -10593 -7641 -3008 6827 -723 -55596
6794 -55596 -45939 32777 66849 81908 42931 52183 53867 62707 38070 24765 33734 23588 54067
6781 54067 40411 29791 36619 31844 24115 45623 26645 283 -8107 -67589 -111884 -96317 -70287
6768g0287K7371J226k042k0407q712J7413K9893K4879K9660R064j4637k2420j2549
6755a1548j6506m2762N068J3179N9725L1438k7595m0747J160K0545M1285L8599
6743G1841l2181L170L7825L0045J4133k2204n2797q1269k2588L9842J6772j8579
6731a5990k2936l0774L3920J4164K5876L3673R139N6J3660j9005j0894L3890M278
6718F9057o5143l942O5950K7336m8795l8069m2484l368O3586K2182k0235k5141
6706I34J6258K8339K9303k1218k6696k7933R20K03P395P110k9706n556Q838K041
6692i768M7977K1584P652L4329J5465o5445k4122l6827n3166j0639N350L5354
6680c2256N1190J1512l4448P978k519j700J3989J7192J3598l2899M783K2140l4083
$$ plain form
6768 -70287 -42916 -41690 -43732 -64139 -72851 -55438 -25545 -666 28994 38058 23421 1001 -11548
6755 -11548 -28054 -70816 -65748 -52569 7156 38594 10999 -29748 -28588 -8043 33242 71841
6743 71841 39660 42830 80655 110700 124833 102629 49832 -31437 -54025 -14183 2589 -15990
6731 -15990 -38926 -69700 -35780 -21616 4260 37933 47072 47128 60788 41783 30889 64779 69057
6718 69057 3914 -28 65922 93258 44463 6394 -36090 -39458 24128 46310 26075 934
6706 934 17192 45531 74834 53616 26920 -1013 -93 110 7505 14615 -15091 -20647 -11809 -9768
6692 -9768 38209 59793 67445 101774 117239 51794 27672 -9155 -62321 -72960 -67610 -32256
6680 -32256 18934 30446 -4002 3976 1457 -243 13746 30938 44536 11637 16420 38560 4477
6667D477p697l2368J65L874M7676J0718m8958m4186k6502N0087K8935J1413n927
6654h293L2564k965j0399K548J525L460k5559j7806K9179P923m002k2921l5697
6641e0443J0981K7071M0027K4047o1115m2873L1320L8084M2974P977J4062j4246
6629F7866o2140k1066k796K2150Q864k2483k1523j0510n154j2004L0375J8827
6617i594K9489o669n7272K9015N7547m351k3000j2280m4523l7062J7823J9545
6605d1332j1997j9090J5272L7982O4276N974P977m417j6467J0536J2412k0824
6593D0302m997m3967m1619j6332J3704Q033k183q619J0787j7897j4962j5567L3727
6580e9590J7297l8195J8429L3213K6233K4116p241j7666k1362K7897r261j7413
$$ plain form
6667 4477 -3220 -35588 -35423 -31549 16127 26845 -22113 -66299 -92801 -42714 -13779 -2366 -8293
6654 -8293 24271 21306 10907 13455 14980 18440 -7119 -24925 4254 12177 8175 -14746 -50443
6641 -50443 -39462 -12391 27636 51683 -9432 -52305 -20985 17099 60073 68050 82112 67866
6629 67866 5726 -15340 -18136 4014 12878 -9605 -31128 -41638 -46792 -58796 -28421 -9594
6617 -9594 19895 13226 -44046 -15031 42516 38165 15165 2885 -41638 -78700 -60877 -41332
6605 -41332 -53329 -72419 -57147 -19165 45111 51085 59062 54645 38178 48714 61126 40302
6593 40302 35305 -8662 -50281 -66613 -52909 -44876 -47059 -55678 -44891 -62788 -77750 -93317 -59590
6580 -59590 -42293 -80488 -62059 -28846 -2613 21503 14262 -3404 -24766 3131 -6130 -23543
6568b3543J3632j10l4119J5673Q0J1524j0042j1449l7194k361J3061j0013L7983
6555c6878L6089J8718N872k5362K4255K2858m3221J9379Q238r124k9094j9008
6543b7278o525k7931L2820K3509M630J7784k757j431k3211M977K369j4962j8151
6530c6157L1069m56o192j648J4901J0953j8109l705j2110K0101m2865j1092L6713
6517a8597J5864K8217J2704m7734k2939k9474K8521M0363K4720L0124N902m7919
6505A9752R918J0039Q202o4248k9804p745J1931j8683j7397K9839O0896K468L304
6492A8472j8319j7997k3482K7530J7610K3910k4609k9417j9574J6119l4566M1548
6480b2775M7336K6794j1668m3536k1927l2090r105J2342K5076L6734L429j0784
$$ plain form
6568 -23543 -9911 -10021 -44140 -28467 -28387 -16863 -26905 -38354 -75548 -77909 -64848 -74861 -36878
6555 -36878 -789 17929 23801 -1561 22694 45552 2331 21710 29948 20824 -8270 -27278
6543 -27278 -33803 -61734 -28914 -5405 -775 17009 14252 12821 -10390 -5413 -3044 -18006 -36157
6530 -36157 -5088 -5544 -11736 -13384 1517 12470 -5639 -9344 -21454 -1353 -44218 -55310 -18597
6517 -18597 -2733 25484 38188 -9546 -32485 -61959 -33438 6925 31645 61769 67671 19752
6505 19752 29670 39709 47911 -16337 -46141 -53886 -41955 -60638 -78035 -48196 12700 15168 18472
6492 18472 153 -17844 -41326 -13796 3814 27724 3115 -26302 -45876 -29757 -64323 -22775
6480 -22775 24561 51355 39687 -3849 -25776 -57866 -66971 -54629 -29553 7181 10610 -174
6468a74R558j8216k9515k0061P862L1280J6339j7188o35k753K3039L396J9792
6455B2724l4488k8050K4621J157K0678j933q328J8115J8332Q619n9312n2869L4453
6442c6281J910q489K4219R145l2387j4102l6767k499J5606M9857M6237L1521Q13
6429D8783k3131J3845p561r414k5580l7367l6046j9689L5858J2770K7887N664
6417a3981L1506K0675l4877k0650L4833n578m1867m3394J2570J196q877j6493
6405h4937q348R537Q194Q320J4084m1682K998L1916Q2559K0839j4445k8467L87
6392I55L0777j8856o9332K8555L0555k6698j2862J328M548K7448L0111q907J8048
6379C5670K4053j2540N831K2518j4559l2249n7839R442K561K6913l4280J2523
$$ plain form
6468 -174 9384 -8832 -38347 -58408 -50546 -19266 -2927 -20115 -20750 -23503 -464 2932 22724
6455 22724 -11764 -39814 -15193 -14036 6642 4709 -3619 14496 32828 41447 -17865 -70734 -36281
6442 -36281 -34371 -42860 -18641 -9496 -41883 -55985 -92752 -95251 -79645 -29788 16449 47970 48783
6429 48783 25652 39497 31936 22522 -3058 -40425 -76471 -96160 -60302 -47532 -19645 -13981
6417 -13981 17525 38200 3323 -17327 17506 11928 -29939 -73333 -60763 -59567 -68444 -84937
6405 -84937 -93285 -83748 -75554 -67234 -53150 -94832 -91834 -59918 22641 43480 29035 568 955
6392 955 31732 12876 -56456 -27901 2654 -24044 -36906 -35578 -31030 -3582 26529 17622 35670
6379 35670 59723 47183 53014 75532 60973 28724 -29115 -19673 -17112 9801 -24479 -11956
6367a1956K0119l5264l7409K3955L2504K001p000N973r259J4667j1842m920J56
6354a8275J3234j4219m1692j1647K757N4174L1655l788L4361J6984M091M0409
6342A08044P728k2559p6360P858k9302n2215M7773N2381k0499N489J1398l5418
6330D318l563K2545n844j3222k4011J3002l410l5425O011K2637L9003l6716k8690
6317d3365J271j4882P450j5944L738N4058K2446L0632k1379k7725L0144K1884
6305D8328k0424J1315m3993m3906K9911M5583n0681N459L1855j2451L1827J6763
6293D9586n7568l2211J9169K4691Q959k9683j3847m4168p713J9273K1880L8041
6281c591L3533K6940l9458k6309k2421M4769J387j9292j9909J3819O1546Q657
$$ plain form
6367 -11956 8163 -27101 -64510 -40555 -8051 -6050 -13050 -7077 -16336 -1669 -13511 -18431 -18275
6354 -18275 -5041 -19260 -60952 -72599 -69842 -15668 15987 12199 46560 63544 67635 108044
6342 108044 115772 93213 16853 24711 -4591 -56806 -9033 43348 22849 28338 39736 4318
6330 4318 755 23300 17456 4234 -19777 -6775 -10185 -45610 -39599 -16962 22041 -14675 -43365
6317 -43365 -42094 -56976 -49526 -65470 -61732 -7674 14772 45404 24025 -3700 26444 48328
6305 48328 27904 39219 -4774 -48680 -18769 26814 -23867 -18408 13447 996 32823 49586
6293 49586 -7982 -40193 -21024 3667 12626 -17057 -30904 -75072 -82785 -63512 -41632 -3591
6281 -3591 29942 56882 17424 -8885 -31306 13463 14850 -4442 -24351 -10532 51014 59671
6269E9671J1015J4399K3746j3251m187j2629k9588P821J4387J0805n848m1615
6257C4726o2919j5926O3371R724m3511q13N805j5223J5106L6801L22n401K6222
6244D8284K5366J1270O241l6264j0758q698l2187J4855N387j6435n905K705j1728
6231g867J5579K433j2678l0245R738j7994J4417N2456l3157r589R59k8718K578
6218d2088O782J2481l961j2321K2103M409R43j3662J1988k5599K1494K5221l7767
6205b9977k1846M0761L5598l2913L1442M053n033K0039K3717m938m1051k6656
6193f804k469N366K514l3063M202K4642M263Q705M8912Q652J7045l5746k6236
6180A9983l6158j5662k7912M493K7005k2417l0727K5520K1788J5066Q1102N2987
$$ plain form
6269 59671 70686 85085 108831 95580 91393 78764 49176 56997 71384 82189 76341 34726
6257 34726 -28193 -44119 19252 28976 -14535 -15348 -9543 -24766 -9660 27141 27463 22062 48284
6244 48284 73650 84920 91161 54897 44139 35441 3254 18109 23496 7061 1156 3861 -7867
6231 -7867 7712 10145 -2533 -32778 -23040 -41034 -26617 25839 -7318 -16907 -15948 -44666 -42088
6218 -42088 -35306 -22825 -26786 -39107 -17004 -12595 -11652 -25314 -13326 -38925 -17431 7790 -29977
6205 -29977 -51823 -11062 24536 -8377 23065 27118 22085 42124 65841 60903 19852 -6804
6193 -6804 -9273 -3907 -1393 -34456 -30254 -5612 -1349 7356 56268 64920 81965 46219 19983
6180 19983 -16175 -31837 -59749 -55256 -28251 -50668 -81395 -55875 -34087 -19021 62081 115068
6168A15068j0023p1783n9025J5089j2267l651j4188J9772j0105J171J8056J625
6156a0261L53K236M4069r664k3777k6922n33p148J662J628K974j7294k4020M1725
6142b4972j5781p448O1737L2411j9013l7867j259O79K3309K305N8599J175j7214
6129E6661n455M016l7665q611j8453o0567k0294L1132K1778J4489L6100J4620
6117B7751k376J0741o443R618J628j3946J8481N5039n240l6013r2428k9987M5532
6104a7643O0931L4874K4153j5559k3511l2290j9519L1754L595j4621l0775q873
6092g484J3354J8902L8986P327j9934m6191J3058k234r987J2664j3684m0018k5036
6079f0277K6438J6794J5143K1094l737P017J045M14m305o791l80r787k9665Q315
$$ plain form
6168 115068 105045 33262 -25763 -10674 -22941 -26592 -40780 -21008 -31113 -29942 -11886 -10261
6156 -10261 -9908 -7672 36397 26733 2956 -23966 -24499 -31647 -29985 -28357 -25383 -42677 -66697 -24972
6142 -24972 -40753 -48201 13536 45947 26934 -10933 -12192 -11513 11796 14101 72700 73875 56661
6129 56661 51206 55222 17557 8946 -9507 -70074 -90368 -59236 -37458 -22969 13131 27751
6117 27751 25375 36116 29673 39291 40919 26973 45454 100493 95253 59240 -33188 -63175 -17643
6104 -17643 43288 78162 102315 86756 63245 30955 11436 43190 46785 32164 1389 -7484
6092 -7484 5870 24772 63758 71085 51151 4960 18018 15784 5797 18461 4777 -35241 -60277
6079 -60277 -33839 -17045 -1902 19192 15455 22472 23517 23931 19626 12835 12455 2668 -26997 -18682
6065a8682P007j1892J0466P530J67j5795l398j6608j470J8779q197R776J5431
6052f886J9686O103J7252J4806J9972n0480k6560j450k8982k2467l8387q337L8884
6039f6846k2006j7645J1010M0456M1694k5676m880l3008J2441M6428j2302j8856
6027d9190L0305K0196J7595k034j4893K0021J3354L4763j6010k3302m5118m7100
6015f1413o8317k5402K6592N9340L1463K430n6132k253J1203M2909K7311P723
6003d546J2511M254O772o20l883Q055n08j2307K982k72j6634m0668l1732r186
5989h5782K3308L373k7117K2337L8258O122l24k6171M314L9437K8373j607r725
5976A4796L719o132Q229L1091J2963o277k2381j4414q427j3201k5710J9640K30
$$ plain form
6065 -18682 -11675 -23567 -13101 -5571 -5404 -21199 -24597 -41205 -42675 -23896 -32093 -22317 -6886
6052 -6886 12800 18903 36155 50961 70933 20453 -6107 -7557 -36539 -59006 -97393 -105730 -66846
6039 -66846 -88852 -106497 -95487 -55031 -13337 -39013 -43893 -76901 -64460 -18032 -30334 -49190
6027 -49190 -18885 1311 18906 16872 1979 22000 35354 70117 54107 30805 -14313 -61413
6015 -61413 -129730 -155132 -128540 -69200 -37737 -35307 -91439 -93692 -82489 -39580 -12269 -4546
6003 -4546 7965 12219 18991 18371 14488 22543 22035 9728 12710 12438 -4196 -44864 -76596 -85782
5989 -85782 -62474 -59101 -86218 -63881 -25623 -19501 -19825 -45996 -41682 -2245 26128 24521 14796
5976 14796 18515 12383 20612 51703 64666 58389 36008 21594 13167 -34 -25744 -6104 -5874
5963e874N580l2932l9982K1830J0814K213N7992Q1207j146j776P113k1271q252
5950G5516N87n681N545P202l7722l3515j5021n140m3491l9882J8494J2537J2910
5937d7661o756o545j0944J6670j0252m744j9881K6682L3199K3483j3776J007J1660
5924g858j5178J7676K686K9806K340j2672j0292k5795j3869o626Q24j0287K5642
5911b3603J0774k4474J1886j4694l538q44L0292L2895O4965m0587m1641m9974
5899d8543m775K677j548L6090L4625P744Q398J7118J7654q630l1701k0589O4k4102
5885a5518j020k152J7292O761j1525r983O234M018l3057k8355l0658J1429N9407
5872b7127J6905l5336k9179N548q223M7364K4300M7011R159o891n3851m0122L1005
$$ plain form
5963 -5874 -294 -33226 -73208 -51378 -40564 -38351 19641 100848 99702 97926 105039 83768 75516
5950 75516 76103 70422 75967 83169 45447 11932 -3089 -8229 -51720 -91602 -73108 -60571 -47661
5937 -47661 -54417 -60962 -71906 -55236 -65488 -70232 -90113 -63431 -30232 -6749 -20525 -19518 -7858
5924 -7858 -23036 -5360 -2674 27132 29472 16800 6508 -19287 -33156 -39782 -38958 -49245 -23603
5911 -23603 -12829 -37303 -25417 -40111 -43649 -44493 -14201 18694 83659 43072 1431 -48543
5899 -48543 -53318 -50641 -52189 -16099 18526 26270 34668 51786 69440 60810 29109 8520 8584 -15518
5885 -15518 -16538 -18690 -1398 5363 -6162 -16145 -9911 -5893 -38950 -67305 -97963 -86534 -27127
5872 -27127 -10222 -45558 -74737 -69189 -77412 -30048 -5748 41263 50422 43531 -10320 -50442 -19437
5859a9437K7580m9570l3483L7935K5005P173k3681L044L1733n3803l2748J9729
5847f0523p187r640K8504J9868J3449j8743j993m630J0764j4041L8371J3059q695
5834a437j138j5962R376O400m1063j5240J1225k041n938N1336M6579K1530l3121
5821C0506n3725k4728l3040J2671L863M091M044n8173N229L4373N2090J9244q562
5808a2117l1946P496L1157J2004k7670q382L1529J1417j8231J1809j3039J2289
5796F316j1932q865m87L5791n7181m9157M1440L0826m832J8501j5689n322J6874
5783c717J9676k6702r202L7545K6673o9246q320Q6053M844m3690j0591j0466k893
5770a0036j1586J9710O0514Q584j603k6252n1671l1889N964j1871M0751K4580
$$ plain form
5859 -19437 8143 -41427 -74910 -36975 -11970 -4797 -28478 -25434 6299 -47504 -80252 -60523
5847 -60523 -67710 -77350 -48846 -28978 -15529 -34272 -36265 -40895 -30131 -44172 -5801 7258 -1437
5834 -1437 -2575 -18537 -9161 -2761 -43824 -59064 -47839 -49880 -55818 -4482 42097 63627 30506
5821 30506 -23219 -47947 -80987 -68316 -64453 -60362 -56318 -114491 -109262 -74889 -22799 -3555 -12117
5808 -12117 -44063 -36567 -5410 6594 -21076 -29458 2071 13488 -4743 7066 -5973 6316
5796 6316 -5616 -14481 -14968 20823 -36358 -85515 -44075 -13249 -18081 420 -15269 -20591 -3717
5783 -3717 15959 -10743 -19945 17600 44273 -24973 -33293 52760 57604 13914 3323 -7143 -10036
5770 -10036 -21622 -1912 58602 67186 65583 39331 -12340 -44229 -38265 -50136 -9385 15195
5758A5195K2401n560k6031l5124k0667m5416N18L0633O602O6911j4035m8062j1774
5745f4409M7840M0112P839k6858j9711Q161J0355J3037m4804k7651k8960J2517
5733g2532j2644K8938O7541N1991l216l4026p203p763l0795O289j6855k1717j9076
5720g1068K8110L9822k7451k9736k1493j97L6384K4663o493Q774J3965N710m7314
5707d6324k2985K8967M2471q177k3118j5157o74k566K9733J0111P635L6570k6535
5694I951o3072j4006J4601K9989Q891l510K3695n41J8697M5631K552K219k4346
5681E0751o5634m7641J6824l330J3004K8037k9611j2846K3267M9159J1690n2029
5669a8359J4800n921k9360m0799M703M1478M4318k9337K3093K6105l6037l31K9745
$$ plain form
5758 15195 37596 32036 6005 -29119 -49786 -95202 -94684 -64051 -57449 9462 -4573 -52635 -64409
5745 -64409 -16569 23543 31382 4524 -15187 -7026 3329 16366 -28438 -56089 -85049 -72532
5733 -72532 -85176 -56238 11303 63294 60078 26052 18849 11086 -19709 -13420 -30275 -51992 -71068
5720 -71068 -42958 -3136 -30587 -60323 -81816 -82013 -45629 -20966 -27459 -18685 -4720 990 -46324
5707 -46324 -69309 -40342 2129 -6048 -29166 -44323 -44997 -47563 -17830 -7719 -84 36486 9951
5694 9951 -53121 -67127 -52526 -22537 -13646 -17156 6539 5998 24695 70326 72878 75097 50751
5681 50751 -14883 -62524 -45700 -49030 -36026 -7989 -37600 -50446 -27179 21980 33670 -18359
5669 -18359 -3559 -9480 -38840 -79639 -74936 -33458 10860 -18477 4616 30721 -5316 -5647 24098
5656B4098J4276n5062J6218Q813m386K3338q500k100p518j723L686j1814N1696
5643E1022j5882l3862r176j1634J9786j6887k0384L0395O5427k0190k5552n749
5631G314k9005k6335K360K4659p216m1056Q987L0310l3883J791K9295N3213J2246
5618C2680J5207n845Q96q177j6938j9703j7286N910j1607r36p57n182J2113N2246
5604C2621j2242l0214K5084M67J9653K3479n160l5587j4109k7996j7219K3937
5592a7286L497j0628J8256j3490j2944K2332j2265m1656K1976O9863j4459K8651
5580D1847J2763o0571k3177m5717J9096M7141l8733q414M8834K0527l5464p692
5568b9560O207j9527L1665K0990k8915j6433J3658M098l1725k1569l4428L9703
$$ plain form
5656 24098 38374 -16688 -470 8343 3957 27295 18795 16695 9177 7454 11140 -674 51022
5643 51022 35140 1278 -7898 -19532 254 -16633 -37017 -6622 58805 38615 13063 7314
5631 7314 -21691 -48026 -45666 -21007 -28223 -69279 -60292 -29982 -63865 -62074 -32779 20434 32680
5618 32680 47887 42042 42938 34761 17823 -1880 -19166 -13256 -24863 -25799 -26556 -31738 -19625 32621
5604 32621 20379 -9835 15249 15716 35369 58848 53688 18101 3992 -24004 -41223 -17286
5592 -17286 -13789 -24417 -6161 -19651 -32595 -10263 -22528 -64184 -42208 27655 13196 41847
5580 41847 54610 -5961 -29138 -74855 -55759 -8618 -47351 -55765 -6931 13596 -21868 -29560
5568 -29560 -23353 -42880 -11215 9775 -19140 -35573 -21915 -17817 -49542 -71111 -105539 -65836
5556f5836J8998L6988L2213r9k4260j8212K0071M462j1743k0710J142r139J6777
5543a9348K8793O239j8015J4339J4496P874L2514m8885k5357q009j9866k0476
5531e5701O5601J2500k0802J015J352l1380J2674O6117K7392o0051l8924J2397
5519g810k4032L920K3072J6713j3415l2618M3260J2417N9085l7605k7807O692
5507B1872J1812K6304j8296k8537K1037M9376k5995n366P482k7665J1033j29j1561
5494C1367l3762L4094J1338p34n8060l1364k053j3000O185k3831l3743K484P247
5481a03832M0993M7731j9674N398J3112L5183K2536l368k6115j3719j9115p130
5469b8000K7708K8922l9308j8565l8662J7942M7678L6164j2597k2145L3901L6587
$$ plain form
5556 -65836 -46838 -9850 22363 22264 -1996 -20208 -137 4325 -7418 -28128 -26986 -36125 -19348
5543 -19348 9445 15684 -2331 12008 26504 34378 66892 18007 -7350 -15359 -35225 -55701
5531 -55701 9900 22400 1598 2613 3965 -27415 -14741 51376 78768 18717 -20207 -7810
5519 -7810 -31842 -27922 -4850 11863 -1552 -34170 9090 21507 80592 42987 15180 21872
5507 21872 33684 59988 41692 13155 34192 83568 57573 52207 59689 32024 43057 42928 31367
5494 31367 -2395 31699 43037 42303 -15757 -47121 -49174 -62174 -55989 -79820 -113563 -111079 -103832
5481 -103832 -62839 -15108 -34782 -29384 -16272 18911 41447 38079 11964 -1755 -20870 -28000
5469 -28000 -292 28630 -10678 -29243 -67905 -49963 -2285 33879 21282 -863 33038 69625
5457F9625M5841j0190o1739p3949m3121M6118N2182J7446N037k9949P434K0373
5445D5108N2857l6335l9907j0069k640L0564n0789m7026J8121l7020M3768l493
5433c6861k1165J9496K5935j1494K2984R507j2268P960K8807k3031k9217k6735
5421d6082N790J6241K284Q283p191l367J0858q166O369L3081L2969m0864l1674
5408b1469R493L0515K1204R158n138k0390k2600j7835k6887j6877K2315J2367
5396b6144J2612L021j1988J2994N103J8717k926R141m9651k9160K2015K4086J7281
5383E101L0071j0849l4887l4880j1065J2325M6875K3004l0683L481m416j3831
5371a9754P542J8999L5727J2232k7513l0844J322m5726L6527M2920r690n6850
$$ plain form
5457 69625 115466 105276 43537 -30412 -73533 -27415 24767 42213 47250 17301 24735 45108
5445 45108 97965 61630 21723 11654 9014 39578 -11211 -58237 -40116 -77136 -33368 -36861
5433 -36861 -58026 -38530 -12595 -24089 -1105 8402 -3866 4094 32901 9870 -19347 -46082
5421 -46082 -40292 -24051 -21767 -13484 -20675 -24042 -13184 -21350 -14981 18100 51069 10205 -21469
5408 -21469 -11976 18539 39743 48901 43763 23373 773 -17062 -43949 -60826 -38511 -26144
5396 -26144 -13532 -10511 -22499 -9505 -4402 14315 11389 20530 -29121 -58281 -36266 -12180 5101
5383 5101 35172 24323 -10564 -45444 -56509 -44184 2691 25695 -4988 -1507 -5923 -19754
5371 -19754 -12212 6787 42514 54746 27233 -3611 -2289 -48015 -11488 31432 21742 -35108
5359c5108m7017N1883M4999K0302M817q845p1379j5835N3231j757l4068j9456
5347e8233q306L9140M1457k963j9150J0177L6926j0676k639K583j7863J0839k3976
5334b684k4404Q300k8171K5360L927m0627N554L2573K9290K1581j689j3172o846
5321H992j0587N550j6326M637K1178k117j7096L0883j7425p798M2536j4891k2147
5308E389K3479L3996j8071k5227P458J8072l8651m3788l671k1837j7102L2798
5296d7155K5727K4024Q101L772J1439L6305j6267m3183m1557r83N4630K5195m927
5283C5121k2409l2046J4829J1979O881L4435J8270k5441j9236j587M035J1233
5271C6064L9885j7111l7336l0453M2460K3486J2079J1163K0637l76j413r111q6956
$$ plain form
5359 -35108 -82125 -30242 14757 35059 39876 31031 -40348 -56183 -2952 -4709 -38777 -58233
5347 -58233 -66539 -27399 14058 11095 -8055 2122 39048 28372 25733 28316 10453 21292 -2684
5334 -2684 -27088 -18788 -46959 -21599 -17672 -58299 -52745 -20172 9118 30699 29010 15838 8992
5321 8992 -1595 3955 -12371 -7734 13444 11327 -5769 25114 7689 -109 42427 27536 5389
5308 5389 28868 62864 44793 19566 27024 45096 6445 -37343 -41014 -62851 -79953 -47155
5296 -47155 -21428 2596 10697 14469 25908 62213 45946 2763 -38794 -39777 14853 40048 35121
5283 35121 12712 -19334 -4505 7474 14355 48790 67060 41619 22383 20796 24831 36064
5271 36064 75949 58838 21502 -8951 33509 56995 69074 80237 100874 100498 99085 89974 3018
5258C018K1284K465o888j8660K5455K2661J6508j2651K839j5085k3760n3336j4924
5245e1074O334j1953J1619K145M9156k1693m1464L3812L4429k650J6670L4571
5233E9902O583l5243j6950L6965k3055m790L0965l5221j9287L294m898k8078k5477
5220e5290J0268J2865M9959K5899o6240n264O056L545m922L3513P69p291j6291
5207a2424m308K2613r240m9308K3470N2996P41o912j1381o40k6843k0608K2325
5194a9519K8777l429n4254l8728p247M196J8577K7993L8185M55R667J6073J0853
5181C1599M2342J5063j8755l874l0773m2153o7228j0470M2954O6124j6855J183
5169I157j880K660o151j9562J1812M1181J6292K947j8430k3357k649J2763O232
$$ plain form
5258 3018 24302 26767 19879 1219 26674 49335 65843 53192 56031 40946 17186 -36150 -51074
5245 -51074 -44740 -56693 -45074 -42929 6227 -15466 -56930 -23118 11311 8661 25331 59902
5233 59902 66485 31242 14292 51257 28202 23412 54377 19156 -131 3163 -1735 -29813 -55290
5220 -55290 -45022 -32157 17802 43701 -22539 -27803 -21747 -18202 -23124 10389 11158 3867 -12424
5207 -12424 -16732 5881 -3359 -52667 -29197 23799 24540 17628 6247 5607 -21236 -41844 -19519
5194 -19519 9258 5829 -48425 -87153 -94400 -90204 -71627 -43634 -5449 -4994 4673 20746 31599
5181 31599 73941 89004 70249 66375 35602 -6551 -73779 -84249 -41295 24829 7974 9157
5169 9157 7277 9937 3786 -15776 -3964 37217 53509 56456 38026 14669 12020 24783 31015
5156C1015k1720o3737j1250K2330j5983M51L1793M1560j5161L399J885Q484j5933
5143b867L7508j0677n0949L5097Q110j3353l5179Q847j9471o734O520j6440K9208
5130c0380N5490q059K5655k9865l2104K0746K0112j7984j4182n752p266j7338
5118d0927O975L6342J9453p436p773R554J5061J9165M491k8265k9692j9392r691
5105c2135j1640n215J1997K7749J7428j3659j285M307L8708q858l7142q174J2612
5092e307p078r995k3613j4921M2020J1532K8603k4266l0362J4484K0639j5971
5080a4235j7568j1366K0269j665J2080L5992M626k1258K8725K9837k1393l7887
5068F157p11K6129P209k9772l8108o222j9688O2943K0714L2165k326m054l029
$$ plain form
5156 31015 9295 -54442 -65692 -43362 -59345 -58894 -27101 14459 -702 2697 4582 13066 -2867
5143 -2867 34641 23964 -26985 8112 16222 2869 -32310 -23463 -42934 -49668 -43148 -59588 -30380
5130 -30380 25110 17051 42706 12841 -19263 1483 21595 3611 -10571 -16323 -23589 -40927
5118 -40927 -33952 2390 21843 14407 6634 16188 31249 50414 54905 26640 -3052 -22444 -32135
5105 -32135 -43775 -48990 -36993 -9244 8184 -5475 -6760 -2453 36255 27397 -9745 -17919 -5307
5092 -5307 -12385 -22380 -45993 -60914 -18894 -7362 21241 -3025 -33387 -18903 1736 -14235
5080 -14235 -31803 -43169 -22900 -24565 -12485 23507 28133 6875 35600 65437 44044 6157
5068 6157 5446 31575 38784 9012 -29096 -35318 -55006 7937 28651 60816 58490 54436 51407
5055E1407j7543M103k0173r653k2832J4920j718N249k1328r176j3861L3543L5023
5042B7961J1497k8992m5430j1364K5219K7933k1185m6334N829P065j7323k316
5030f7440K3889j6017R402J3060l6649J4527K1797j3805K3725M150J6559o512
5018a3314O759L680j3912k6311M3987L6583j64k0491l554L154k020j1557L76k1551
5004a8335O661j0285L3941L2944l1874j8623n085j6995q469m599R274N3663J5756
4991C7974m3761l5044K503J7112J4141k3847K5742K7707J9426J4766m68l4431
4979B1820l0554M634P199j0128R385J3286j0662k1253L6421J1203k4948K2889
4967B9292l1324l031K5909k447l4275m2317p655M2741L1780j2023m828o03K1477
$$ plain form
5055 51407 33864 37967 17794 8141 -14691 229 -1489 3760 -17568 -26744 -40605 -7062 27961
5042 27961 39458 10466 -34964 -46328 -21109 6824 -14361 -60695 -54866 -47801 -65124 -67440
5030 -67440 -43551 -59568 -50166 -37106 -73755 -59228 -37431 -51236 -27511 -23361 -6802 -13314
5018 -13314 -6555 -2875 -16787 -43098 889 37472 37308 16817 13263 16417 14397 2840 3216 -18335
5004 -18335 -11674 -21959 11982 44926 13052 -5571 -10656 -27651 -36120 -40719 -31445 22218 37974
4991 37974 -5787 -40831 -38328 -21216 -7075 -30922 -5180 22527 41953 56719 56251 21820
4979 21820 -8734 -4100 3099 -7029 2356 15642 4980 -16273 20148 31351 6403 29292
4967 29292 -2032 -5063 20846 18399 -15876 -58193 -65848 -23107 8673 -3350 -8178 -8781 12696
4954A2696J3907l1760m7778k7010L2238K3804j9769R945N2514J1164l5796j4017
4942a9862m9940n818K6068L581L0183Q995j8521k664j7224L0698J9679k074j8883
4929a5782K9982M704J0194m2269o3760k7565R067N6580M5979j2593J278o578K6031
4916A5268P788n4796m3333J4701P0491l704R026j403M0377p893q87J3163L0243
4903H9041K6296j0205k0937K1480O17j8359l877l5800o8551k5880k492K0787O5234
4890C7354j9469k2205l929m694L5833l7390j1639J9762M4845j2060j815m0351
4878a5758n018m169l4649M0696p406j1431O402k214L3519j295k5881J753Q816
4865a6635K602M5523j7724N284J3041P0946j1602l6253p3018J1497j4792l6815
$$ plain form
4954 12696 26603 -5157 -52935 -79945 -47707 -23903 -43672 -33727 18787 29951 -5845 -19862
4942 -19862 -69802 -75620 -49552 -45971 -15788 -6793 -25314 -27978 -45202 -14504 5175 3101 -15782
4929 -15782 14200 18904 29098 -13171 -76931 -104496 -95429 -38849 7130 -5463 -4185 -10763 15268
4916 15268 23056 -31740 -75073 -60372 10119 6415 15441 14038 54415 46522 45635 58798 89041
4903 89041 115337 105132 84195 105675 106292 87933 84056 48256 -20295 -46175 -48667 -27880 37354
4890 37354 17885 -4320 -8249 -12943 22890 -14500 -26139 -6377 38468 26408 24593 -15758
4878 -15758 -20776 -24945 -59594 -18898 -26304 -37735 -31333 -33547 -28 -1323 -27204 -25451 -16635
4865 -16635 -14033 31490 13766 19050 32091 103037 91435 55182 -17836 -6339 -21131 -57946
4853e7946R784M3350R164K6719j2623Q742l6646J4355K1234l017k1674j6612J505
4840a3665K0870K04Q845J6919l7703J4352l16J6299K4466O893L1947J5704j8931
4827H5884n4634m0637m4353J2687J9434J9449O3519j2295m6818j9327l3415Q401
4815d2105M7926L5263l870j1684j9164K0833J4398l6253j904r005k5509J4101
4803a6973O633j2370o428m8270j1242L1750K8922L4114k2849k7835K3296J5278
4791e974J5841L0876L4274K7139p195n78k6580o1607l1436j8850p2J5657K4181
4778d324J113J5235r521j1257q664k545o676L412L922J6800j5047L1615j2838
4765A225j2415K0047j9625p363N0819M984q663o2691j8481J6137l7516j3131Q445
$$ plain form
4853 -57946 -48162 -4812 4352 31071 18448 27190 -9456 4899 26133 23116 1442 -15170 -13665
4840 -13665 7205 7409 16254 33173 -4530 9822 9506 25805 50271 57164 89111 104815 85884
4827 85884 31250 -9387 -53740 -41053 -21619 -2170 61349 49054 2236 -17091 -50506 -42105
4815 -42105 5821 41084 37214 25530 6366 27199 41597 5344 3440 -5565 -31074 -16973
4803 -16973 -10340 -22710 -29138 -77408 -88650 -56900 -27978 6136 -16713 -44548 -21252 -5974
4791 -5974 9867 40743 75017 102156 94961 94383 67803 6196 -25240 -44090 -44162 -28505 -4324
4778 -4324 -3211 12024 2503 -8754 -17418 -19963 -26639 -23227 -19305 -2505 -17552 14063 1225
4765 1225 -11190 8857 -10768 -18131 32688 37672 29009 -33682 -52163 -36026 -73542 -86673 -78228
4752g8228L1302J6788k3179k3482k6939J6399r019j3749P842N6966K5854j5564
4740c5009j5194l5349L0619L0181n059L201M8447K932J1092J9728J6484q632l7406
4727B6035p3410m3725N7758N1552l336l6021k6152m1M5068K5916P584j845K7386
4714E6769O575K081l7601L799j0123m3273M366J7845R787L5339L1644M700m2292
4701C9616o5840k4665j4744N5119l437K3967q523K7796j4407j9097j0070L9477
4689B5192K1533l733J4519k3771l6950k0160m792j150r618J2861J3675k911L5169
4676A9864K7428n5008m0765J4581M308j3974P351M0113M9553r435n4129l449J2603
4663i59J5973P180M284j6286J683j6371k385j6297k8159K9547P493j2645j0994
$$ plain form
4752 -78228 -46926 -30138 -53317 -76799 -103738 -87339 -96358 -110107 -102265 -45299 -19445 -35009
4740 -35009 -50203 -85552 -54933 -24752 -29811 -26610 21837 24769 35861 55589 72073 63441 26035
4727 26035 -47375 -91100 -33342 18210 14874 -21147 -47299 -47340 -2272 23644 31228 29383 56769
4714 56769 63344 65425 27824 31623 21500 -21773 -17407 438 10225 45564 77208 81908 39616
4701 39616 -26224 -50889 -65633 -10514 -13951 10016 1493 29289 14882 -4215 -14285 25192
4689 25192 46725 42992 57511 33740 -3210 -23370 -28162 -29312 -38930 -26069 -12394 -15305 19864
4676 19864 47292 -7716 -48481 -33900 -29592 -43566 -36215 3898 53451 44016 -10113 -13562 -959
4663 -959 15014 22194 26478 10192 11875 -4496 -6881 -23178 -51337 -21790 -14297 -26942 -37936
4650c7936J05j0444k2501p671L9792L4558L2058L1203j9810j456j7851J7616J7343
4637E5006j4739l730m1356o03K7112p250m0989k5848L4819N1180k0369O389L4970
4624E4592o044l4625l1211k2833j0557p202K1594L1395L4662r961K1821k33m8645
4611g247k3970N0058L1197K8449k6432l6070r454K1242L7132Q621j714j6207l9393
4598A6212J1149j1859O079N757k6249m7459j4950r953K9668M0905N321j1494K5807
4585A8934P988O500J2712j599q317j3641j3182J1305R238j6868n7899k1041l641
4572f9511n645P822rK8722l3617j8171L3613K8743J005K5819L2027j220l0857
4559a279M2460k6997k6926k6681j9511R543K4437m305N655J1173k1856p153M2268
$$ plain form
4650 -37936 -37831 -48275 -70776 -78447 -38655 -4097 27961 59164 39354 37898 20047 37663 55006
4637 55006 40267 36537 -4819 -5422 21690 14440 -26549 -52397 -17578 33602 13233 19622 54592
4624 54592 48548 13923 -17288 -40121 -50678 -57880 -36286 -4891 29771 19810 41631 41398 -7247
4611 -7247 -31217 18841 50038 78487 52055 15985 6531 27773 64905 73526 71812 55605 16212
4598 16212 27361 15502 21581 27338 1089 -46370 -61320 -71273 -41605 -700 4621 -6873 18934
4585 18934 26922 33422 46134 44535 36218 22577 9395 20700 29938 13070 -44829 -65870 -69511
4572 -69511 -75156 -67334 -67343 -38621 -72238 -90409 -56796 -28053 -27048 -1229 30798 29578 -1279
4559 -1279 41181 14184 -12742 -39423 -58934 -49391 -24954 -29259 -23604 -12431 -34287 -41440 828
4546H28P151j3633N166L2538j3095m3014p695J6408J1983m0218P298K6162j4298
4533b4419M0652K123J4357L9698l1925k6996l581l2259J8762o377O409j7198N4553
4520C3799o594m2247J2884J1191l4199N281l6965L9178L0353j5168N835J6170
4508A9518J780J8515n538k1241l8377n0016j0479Q949J6702L8058K3183L3779
4496C4833K7085K374k2372k1542o2237j2686M4146L0723p893M766l0650n813O123
4483a3143K514J3764j0934n917k3465q327Q0N7467Q933k6447j9110J972L4167
4470A1554J4332L73M479q23k0598n157R788J8171L0292L0140p6471m3916l0954
4457e8790j3952M5747M5323k2944n8685O839L5105J9798N5468j3839m1326L122
$$ plain form
4546 828 7979 -5654 -488 32050 18955 -24059 -31754 -15346 -3363 -43581 -36283 -10121 -24419
4533 -24419 16233 18356 32713 72411 40486 13490 9909 -22350 -3588 -9965 -3556 -20754 33799
4520 33799 27205 -15042 -2158 9033 -25166 -19885 -56850 -17672 12681 -2487 3348 19518
4508 19518 21298 39813 34275 13034 -25343 -75359 -85838 -76889 -60187 -22129 1054 34833
4496 34833 61918 64292 41920 20378 -41859 -54545 -10399 20324 12431 17197 -13453 -19266 -13143
4483 -13143 -10629 3135 -7799 -13716 -37181 -45508 -45428 12039 20972 -5475 -24585 -22613 11554
4470 11554 25886 26259 30738 29915 9317 4160 13948 32119 62411 92551 16080 -27836 -58790
4457 -58790 -72742 -26995 18328 -4616 -63301 -56462 -21357 -1559 53909 40070 -1256 1866
4445A866k049J6026l5942j0383J1175J1524J6056K9286j6657m1745L6025M3278
4433E8460O674j818o5230j866J9756M7099L7214L163n3510l4424k3579j1698k264
4420b2023M7402Q394k0803k1619l2390j1790J1621L5658P815j6234k6859M926
4408c5902M4361K7689k8990K3266L3194o454k7339k6777o52M693L1599j6392k001
4395B0295k8223o843J1663j9348j7366o522N0403M3237m3721j8187J8023P507
4383A0918K328j6046j3978N036m3662k4259L3212N5801o622j7309L0642O88M699
4370B1448j8545K080k2643l1832j2359k815Q000M5312Q289R58J2737J4247K8108
4357E2985j0641l1295n0979K9079L0639k0013k5319J0682L2008J3306J5125k288
$$ plain form
4445 1866 -183 15843 -20099 -30482 -19307 -7783 8273 37559 20902 -20843 15182 58460
4433 58460 65134 63316 -1914 -3780 15976 63075 100289 103452 49942 15518 -8061 -19759 -22023
4420 -22023 25379 33773 12970 -8649 -41039 -52829 -41208 -5550 2265 -13969 -40828 -35902
4408 -35902 8459 36148 7158 30424 63618 57164 29825 3048 2396 7089 38688 22296 20295
4395 20295 -7928 -14771 -3108 -22456 -39822 -46344 4059 47296 3575 -14612 3411 10918
4383 10918 13246 -2800 -16778 -11742 -55404 -79663 -46451 9350 2728 -14581 16061 16749 21448
4370 21448 2903 4983 -17660 -49492 -61851 -64666 -56666 -11354 -3065 -2107 10630 24877 52985
4357 52985 42344 11049 -39930 -10851 19788 -225 -25544 -14862 17146 30452 45577 43289
4345D3289l1699j1073l38J5716J5460k5916l7123k019J0292J8130K8251J5357
4333C8327j4863j3051K9391o313n3959m5924J0740M27J3695M2367M0181R570k1276
4320B9312j7567p445k236J515J8762j4266l5966R287P3798o822n6216J8628K0507
4307C1291m128j2642k4389j594L892N7062K0760O002j1395p226p442m7163q362
4294e334K4072M1613J8508p565l5266o3539o536J1692J9294L0912K3027N303k254
4281E3927j1698m5379j7941m2266o1018R829l277K3222R9710K9612J917K845J6236
4268E5719m7227l701N4409k9552l6540n918k6951j6353L3652N5996j6415L5575
4256E2694J4571M930k1733l6272k6289M8698K7689l4407k2544K4487l1867o5822
$$ plain form
4345 43289 11590 517 179 15895 31355 5439 -31684 -33703 -23411 -5281 22970 38327
4333 38327 23464 10413 39804 33491 -20468 -66392 -55652 -55225 -41530 837 41018 50588 29312
4320 29312 11745 4300 2064 3579 22341 8075 -27891 -18604 55194 48372 -7844 10784 31291
4307 31291 27163 14521 -9868 -11462 -7570 49492 70252 76254 64859 57633 50191 3028 -5334
4294 -5334 18738 60351 78859 71294 36028 -27511 -34047 -22355 -3061 27851 50878 56181 53927
4281 53927 42229 -3150 -21091 -63357 -124375 -114546 -117823 -94601 5109 34721 36638 39483 55719
4268 55719 8492 4791 59200 29648 -6892 -12810 -39761 -56114 -22462 33534 17119 52694
4256 52694 67265 72195 50462 14190 -12099 36599 64288 29881 7337 31824 -43 -65865
4244f5865M2234M2520J0951j5552l4666M5978J172m1405j7763j0719J0110j3200
4232d6205o596M8556J6515l3561m3078j4832K5340P3998K7283j4042p2618n7063
4220i6303L8168K579j4571p254K9145l598r300j2470L001j4593Q624J0418K5715
4207d0439L7361K6478j7548k1870M523j324J8075K8902j1164m4189J3191K2944
4195A4940k5943j1244l076K6277L6087l1703p95K0194L0784j1433m9591Q218P279
4182I994o695K842n2336n1388J9597J0108l689K5767K9018J6628L9630K0536n7321
4169B691j1396L7338j3941k4171K5891k942q879r208K7711n962k8566k63j8396
4156c0093J1743J2077o993J0918P987J7186l092J220k2032k4371j4684l3550m4165
$$ plain form
4244 -65865 -23631 18889 29840 14288 -20378 25600 26772 -14633 -32396 -43115 -33005 -46205
4232 -46205 -52801 -4245 12270 -21291 -64369 -79201 -53861 20137 47420 33378 -39240 -96303
4220 -96303 -58135 -55556 -70127 -77381 -48236 -51834 -61134 -73604 -70603 -85196 -76572 -66154 -40439
4207 -40439 -3078 23400 5852 -16018 -11495 -12819 5256 34158 22994 -21195 -8004 14940
4195 14940 -11003 -22247 -25323 954 37041 5338 4543 24737 55521 44088 -5503 2715 9994
4182 9994 3299 6141 -46195 -97583 -77986 -67878 -71567 -45800 -16782 -154 39476 60012 2691
4169 2691 -8705 28633 14692 -9479 16412 13470 4591 -4617 23094 17132 -11434 -11697 -30093
4156 -30093 -18350 -6273 -13266 -2348 5639 22825 19733 20953 -1079 -25450 -40134 -73684 -117849
4143a17849j0867M1052J5547J9425n097M8920K6224K3505j3770N237l4913j8863
$$ plain form
4143 -117849 -128716 -87664 -72117 -52692 -57789 -8869 17355 40860 27090 32327 -2586 -21449
$$ [...]
##END NTUPLES=NMR SPECTRUM
##END=
