##TITLE=Analysis number 327277
Compound Code cc 61314
Book Reference 494/138
Project Code adrs
Chemist Name craigr
##JCAMPDX= 6.0         $$ Bruker NMR JCAMP-DX V2.0
##DATA TYPE= NMR SPECTRUM
##DATA CLASS= NTUPLES
##ORIGIN= Bruker BioSpin GmbH
##OWNER= nmr
$$ XWIN-NMR		Version 3.5
$$ Mon Mar 19 10:52:00 2007 GMT Standard Time (UT+0h)  MAYBRIDGE\nmr@NMR_250MHZ
##.OBSERVE FREQUENCY= 250.131544655141
##.OBSERVE NUCLEUS= ^1H
##.ACQUISITION MODE= SIMULTANEOUS (DQD)
##.ACQUISITION SCHEME= undefined
##.AVERAGES= 16
##.DIGITISER RES= 18
##SPECTROMETER/DATA SYSTEM= dpx250
##.PULSE SEQUENCE= zg30
##.SOLVENT NAME= CDCl3
##.SHIFT REFERENCE= (INTERNAL, CDCl3, 0, 16.522)
##AUDIT TRAIL= $$ (NUMBER, WHEN, WHO, WHERE, WHAT)
$$ ##TITLE= Audit trail, XWIN-NMR		Version 3.5
$$ ##JCAMPDX= 5.01
$$ ##ORIGIN= Bruker BioSpin GmbH
$$ ##OWNER= nmr
$$ C:\u/data/dgb/nmr/ADRS/1170/pdata/1/auditp.txt
$$ ##AUDIT TRAIL=  $$ (NUMBER, WHEN, WHO, WHERE, WHAT)
(   1,<2007-03-19 10:51:38.95 +000>,<MAYBRIDGE\nmr>,<NMR_250MHZ>,
      <created by zg, POWCHK disabled, PULCHK disabled
       configuration hash MD5:
       49 4B E0 1D 92 C2 6B 37 9F E6 65 BC 52 41 86 1D
       data hash MD5: 64K
       1D 28 8F 10 80 1B 96 88 B9 44 AD AF DB 9B B0 92>)
(   2,<2007-03-19 10:51:52.00 +000>,<MAYBRIDGE\nmr>,<NMR_250MHZ>,
      <Start of raw data processing
       ef LB = 0.3 FT_mod = 6 PKNL = 1 SI = 32K 
       data hash MD5: 32K
       D8 40 FE 95 6E 3A FD 88 16 90 34 50 A8 E6 5A 45>)
(   3,<2007-03-19 10:51:53.68 +000>,<MAYBRIDGE\nmr>,<NMR_250MHZ>,
      <apk 
       data hash MD5: 32K
       10 C6 EF 3D 8B DB F8 2D 99 63 40 0B 79 0A FA A0>)
(   4,<2007-03-19 10:51:54.43 +000>,<MAYBRIDGE\nmr>,<NMR_250MHZ>,
      <abs ABSG = 5 
       data hash MD5: 32K
       CA 12 71 A2 BB B6 75 9F 80 78 7F 39 65 59 1C 99>)
$$ ##END=
$$ 
$$ hash MD5
$$ 77 74 17 67 47 4D 8B 55 B2 45 99 E8 EF 6B B1 64
##$RELAX= 
##$RELAX= 
##$RELAX= 
##$RELAX= 
##$RELAX= 
##$RELAX= 
##$RELAX= 
$$ Bruker specific parameters
$$ --------------------------
##$DU= <C:\u>
##$EXPNO= 1170
##$NAME= <ADRS>
##$PROCNO= 1
##$TYPE= <nmr>
##$USER= <dgb>
##$AMP= (0..31)
100 100 100 100 100 100 100 100 100 100 100 100 100 100 100 100 100 100 
100 100 100 100 100 100 100 100 100 100 100 100 100 100 
##$AQSEQ= 0
##$AQ_mod= 3
##$AUNM= <au_zg>
##$AUTOPOS= <11 >
##$BF1= 250.13
##$BF2= 250.13
##$BF3= 250.13
##$BF4= 250.13
##$BF5= 500.13
##$BF6= 500.13
##$BF7= 500.13
##$BF8= 500.13
##$BYTORDA= 1
##$CFDGTYP= 0
##$CFRGTYP= 5
##$CHEMSTR= <none>
##$CNST= (0..31)
1 1 145 1 1 1 1 1 1 1 1 1 1 1 1 1 1 1 1 1 1 1 1 1 1 1 1 1 1 1 1 1 
##$CPDPRG= <>
##$CPDPRG1= <>
##$CPDPRG2= <>
##$CPDPRG3= <>
##$CPDPRG4= <mlev>
##$CPDPRG5= <mlev>
##$CPDPRG6= <mlev>
##$CPDPRG7= <mlev>
##$CPDPRG8= <mlev>
##$CPDPRGB= <>
##$CPDPRGT= <>
##$D= (0..31)
0 1 0 0 0 0 0 0 0 0.06 0 0 0 0 0 0 0.0002 0 0 0 0 0 0 0 0 0 0 0 0 0 0 
0 
##$DATE= 1174301497
##$DBL= (0..7)
120 120 120 120 120 120 120 120 
##$DBP= (0..7)
150 150 150 150 150 150 150 150 
##$DBP07= 0
##$DBPNAM0= <>
##$DBPNAM1= <>
$$ [...]
##$SUBNAM7= <"">
##$SUBNAM8= <"">
##$SUBNAM9= <"">
##$SW= 20.6930455092707
##$SWIBOX= (0..15)
0 0 3 0 0 0 0 0 0 0 0 0 0 0 0 0 
##$SW_h= 5175.983436853
##$TD= 65536
##$TD0= 1
##$TE= 683.16
##$TE2= 300
##$TE3= 300
##$TEG= 300
##$TL= (0..7)
0 120 120 120 120 120 120 120 
##$TP= (0..7)
150 150 150 150 150 150 150 150 
##$TP07= 0
##$TPNAME0= <>
##$TPNAME1= <>
##$TPNAME2= <>
##$TPNAME3= <>
##$TPNAME4= <>
##$TPNAME5= <>
##$TPNAME6= <>
##$TPNAME7= <>
##$TPOAL= (0..7)
0.5 0.5 0.5 0.5 0.5 0.5 0.5 0.5 
##$TPOFFS= (0..7)
0 0 0 0 0 0 0 0 
##$TUNHIN= 0
##$TUNHOUT= 0
##$TUNXOUT= 0
##$USERA1= <user>
##$USERA2= <user>
##$USERA3= <user>
##$USERA4= <user>
##$USERA5= <user>
##$V9= 5
##$VALIST= <valist>
##$VCLIST= <CCCCCCCCCCCCCCC>
##$VD= 0
##$VDLIST= <DDDDDDDDDDDDDDD>
##$VPLIST= <PPPPPPPPPPPPPPP>
##$VTLIST= <TTTTTTTTTTTTTTT>
##$WBST= 1024
##$WBSW= 4
##$XGAIN= (0..3)
0 0 0 0 
##$XL= 0
##$YL= 0
##$YMAX_a= 210614
##$YMIN_a= -315542
##$ZGOPTNS= <>
##$ZL1= 120
##$ZL2= 120
##$ZL3= 120
##$ZL4= 120
##$ABSF1= 16.522
##$ABSF2= -4.171173
##$ABSG= 5
##$ABSL= 3
##$ALPHA= 0
##$AQORDER= 0
##$ASSFAC= 0
##$ASSFACI= 0
##$ASSFACX= 0
##$ASSWID= 0
##$AUNMP= <proc_1d>
##$AZFE= 0.1
##$AZFW= 0.1
##$BCFW= 0
##$BC_mod= 0
##$BYTORDP= 0
##$COROFFS= 0
##$CY= 12.5
##$DATMOD= 1
##$DC= 0
##$DFILT= <>
##$DTYPP= 0
##$F1P= 14.0000005364418
##$F2P= -0.99999901652339
##$FCOR= 0.5
##$FTSIZE= 32768
##$FT_mod= 6
##$GAMMA= 0
##$GB= 0
##$INTBC= 1
##$INTSCL= 1
##$ISEN= 128
##$LB= 0.3
##$LEV0= 0
##$LPBIN= 0
##$MAXI= 10000
##$MC2= 0
##$MEAN= 0
##$ME_mod= 0
##$MI= 0
##$NCOEF= 0
##$NC_proc= -3
##$NLEV= 6
##$NOISF1= 0
##$NOISF2= 0
##$NSP= 0
##$NTH_PI= 0
##$NZP= 0
##$OFFSET= 16.522
##$PC= 1
##$PHC0= 236.0501
##$PHC1= 9.057156
##$PH_mod= 1
##$PKNL= yes
##$PPARMOD= 0
##$PSCAL= 4
##$PSIGN= 0
##$REVERSE= no
##$SF= 250.13
##$SI= 32768
##$SIGF1= 0
##$SIGF2= 0
##$SINO= 400
##$SIOLD= 32768
##$SREGLST= <1H.CDCl3>
##$SSB= 0
##$STSI= 32768
##$STSR= 0
##$SW_p= 5175.98343685301
##$SYMM= 0
##$S_DEV= 0
##$TDeff= 65536
##$TDoff= 0
##$TI= <Analysis number 999999
Compound Code 99
Book Reference 9
Project Code 9>
##$TILT= no
##$TM1= 0
##$TM2= 0
##$TOPLEV= 0
##$USERP1= <user>
##$USERP2= <user>
##$USERP3= <user>
##$USERP4= <user>
##$USERP5= <user>
##$WDW= 1
##$XDIM= 32768
##$YMAX_p= 348249731
##$YMIN_p= -166457
$$ End of Bruker specific parameters
$$ ---------------------------------
##NTUPLES= NMR SPECTRUM
##VAR_NAME=  FREQUENCY,     SPECTRUM/REAL,   SPECTRUM/IMAG
##SYMBOL=    X,             R,               I
##VAR_TYPE=  INDEPENDENT,   DEPENDENT,       DEPENDENT
##VAR_FORM=  AFFN,          ASDF,            ASDF
##VAR_DIM=   32768,         32768,           32768
##UNITS=     HZ,            ARBITRARY UNITS, ARBITRARY UNITS
##FACTOR=    0.157963299565203, 1,           1
##FIRST=     4132.6476996994, 0,             0
##LAST=      -1043.33573715361, 0,           0
##MIN=       -1043.33573715361, -166457,     0
##MAX=       4132.6476996994, 348249731,     0
$$ Real data points
##PAGE= N=1
##DATA TABLE= (X++(R..R)), XYDATA
$$ [...]
##PAGE= N=2
##DATA TABLE= (X++(I..I)), XYDATA
15499e30242P4460K0747m0914J2929K2845n4463j8952K7808J1917m9706k1294
$$ -530242 -455782 -435035 -475949 -463020 -440175 -494638 -513590 -485782 -473865 -523571 -544865
15488e44865R94J404L9767Q8955L5502m6213n7623l2910j396l8064L031k875j8811
$$ -544865 -543871 -542467 -502700 -413745 -378243 -424456 -482079 -514989 -516385 -554449 -551418 -554293 -573104
15475e73104J6872M4219J7206k7627J4621r993j3649L1861l5605j018r692j698
$$ -573104 -556232 -512013 -494807 -522434 -507813 -517806 -531455 -499594 -535199 -536217 -545909 -547607
15463e47607J8462L6613j7527K444N197r47j7215J9732J4800k7263N587J9812
$$ -547607 -529145 -492532 -510059 -507615 -502418 -503365 -520580 -500848 -486048 -513311 -507724 -487912
15451d87912J8052N206j6753m8228N128N0581J1287l6159j0947K8491K8532M3497
$$ -487912 -469860 -464654 -481407 -529635 -524507 -473926 -462639 -498798 -509745 -481254 -452722 -409225
15439d09225p451l8497k6437Q191l1443q232m999j0302K0646L2750Q142o363P665
$$ -409225 -416676 -455173 -481610 -473419 -504862 -513094 -518093 -528395 -507749 -474999 -466857 -473220 -465555
15426d65555R00j8735K04J2438J7789r731j2261o489r879J2808K635k9437J1857
$$ -465555 -464655 -483390 -483186 -470748 -452959 -462690 -474951 -481440 -491319 -478511 -475876 -505313 -493456
15413d93456k7550m64k130K9412K139k6254p753K5062p988K353j0975K5894K1408
$$ -493456 -521006 -521470 -523600 -494188 -492049 -518303 -526056 -500994 -508982 -506629 -517604 -491710 -470302
15400d70302j1630k6345K0682J6003k9424p09N1643j5149j4918L8852K1699L106
$$ -470302 -481932 -508277 -487595 -471592 -501016 -501725 -450082 -465231 -480149 -441297 -419598 -416492
15388d16492k5726j2269l646j6761N0573K5896k0861L138k9540J9708j0952n950
$$ -416492 -442218 -454487 -458133 -474894 -424321 -398425 -419286 -416148 -445688 -425980 -436932 -442882
15376d42882N0463j6074l2407P918j6175k5793M024M2794N391l8319K6346L3898
$$ -442882 -392419 -408493 -440900 -432982 -449157 -474950 -470926 -428132 -422741 -461060 -434714 -400816
15364d00816l4650o1170j3412J6241L9183J3559r756L279L2905L1768K1490K5939
$$ -400816 -435466 -496636 -510048 -493807 -454624 -441065 -450821 -447542 -414637 -382869 -361379 -335440
15352c35440K689m5945m7180r760O376M2455M6821k21j5037L2477M9751m8832
$$ -335440 -332751 -378696 -425876 -435636 -429260 -386805 -339984 -340205 -355242 -322765 -273014 -321846
15340c21846j2570k2558k9452l7920k1723J5809L982m3937l1115j5847M9034o496
$$ -321846 -334416 -356974 -386426 -424346 -446069 -430260 -426278 -470215 -501330 -517177 -468143 -474639
15328d74639K7576K3613J9082M4252j4775m5464k6453R083N2771J4814l1392k3423
$$ -474639 -447063 -423450 -404368 -360116 -374891 -420355 -446808 -437725 -384954 -370140 -401532 -424955
15316d24955j1309k9319j7244K4986L1657O5864m2681k5118J9703J0788j7025
$$ -424955 -436264 -465583 -482827 -457841 -426184 -360320 -403001 -428119 -408416 -397628 -414653
15305d14653j5451Qk0390k4954Q017K3834M8497K0972J384j295o028l3131l8636
$$ -414653 -430104 -430096 -450486 -475440 -467423 -443589 -395092 -374120 -372736 -374031 -380059 -413190 -451826
15292d51826j1255N7816K2259l8818K2449J9781J483K2205m1496M049J4456l3666
$$ -451826 -463081 -405265 -383006 -421824 -399375 -379594 -378111 -355906 -397402 -393353 -378897 -412563
15280d12563j9737M2519J1984j0568r171M6898l950J7864j619p8763N546L1073
$$ -412563 -432300 -389781 -377797 -388365 -397536 -350638 -354588 -336724 -338343 -417106 -411560 -380487
15268c80487k2104r507Q362k6257m437K3016j7372J2457J3821k7991K072L5672
$$ -380487 -402591 -412098 -403736 -429993 -434430 -411414 -428786 -416329 -402508 -430499 -428427 -392755
15256c92755M1186j1459q982J0607K5034j9296r726Q63l3065k9532j235K7491
$$ -392755 -351569 -363028 -372010 -361403 -336369 -355665 -365391 -364528 -397593 -427125 -428360 -400869
15244d00869K0105r56R72j3866N466J0508r596j3007K459K7517j1455m7701K5497
$$ -400869 -380764 -381720 -380748 -394614 -389148 -378640 -388236 -401243 -398784 -371267 -382722 -430423 -404926
15231d04926L2891R94j1390J4152J0071p358l7307k1649K6297R834j553K1303
$$ -404926 -372035 -371041 -382431 -368279 -358208 -365566 -402873 -424522 -398225 -388391 -389944 -368641
15219c68641L0325k742n79J4461j1554l6496o723m3512q181O0294k9616O10K180
$$ -368641 -338316 -341058 -341637 -327176 -338730 -375226 -381949 -425461 -433642 -373348 -402964 -402354 -400174
15206d00174j9740k288K8261P342n2060J0535L6831K8964J5074l4877l5590L4445
$$ -400174 -419914 -422202 -393941 -386599 -438659 -428124 -391293 -362329 -347255 -382132 -417722 -383277
15194c83277L0353J9015l4727r325j0977M906K4978l1321O241Q88j0467j5288
$$ -383277 -352924 -333909 -368636 -377961 -388938 -384032 -359054 -390375 -384134 -383246 -393713 -409001
15182d09001L3271j4907k1903M7593q251j7765J8501J7634k7128l1057P918J7563
$$ -409001 -375730 -390637 -412540 -364947 -373198 -390963 -372462 -354828 -381956 -413013 -405095 -387532
15170c87532P130L2033M1201l027J5217k7745l4736J2040n957l6049K197M7550
$$ -387532 -380402 -348369 -307168 -310195 -294978 -322723 -357459 -345419 -351376 -387425 -385228 -337678
15158c37678L4230j90p092J6317J492k5287k392K4181k9298n4366J8160L7017
$$ -337678 -303448 -303638 -310730 -294413 -292921 -318208 -320600 -296419 -325717 -380083 -361923 -324906
15146c24906K2256K8747l8587j8835m1810j4259M5963P9453L8617k8334n028k1074
$$ -324906 -302650 -273903 -312490 -331325 -373135 -387394 -341431 -261978 -223361 -251695 -256723 -277797
15134b77797p903L5049n27k77k9025k8208l1860j5494O158K3281J2864j3257O770
$$ -277797 -285700 -250651 -251178 -251455 -280480 -308688 -340548 -356042 -349884 -326603 -313739 -326996 -320226
15121c20226J2999J6566P1674r760o2348k8380j4711J1130N383K9169K4017k0646
$$ -320226 -307227 -290661 -218987 -228747 -291095 -319475 -334186 -323056 -317673 -288504 -264487 -285133
15109b85133l2307n7484J713O2058M433l4163j3614M871L9255L2759J8564J2527
$$ -285133 -317440 -374924 -373211 -311153 -306720 -340883 -354497 -349626 -310371 -277612 -259048 -246521
15097b46521l7130K0102m4168j8507j3404j2875Q051P1951K2727k1820k1242R013
$$ -246521 -283651 -263549 -307717 -326224 -339628 -352503 -344452 -272501 -249774 -271594 -292836 -283823
15085b83823j6426R800k2138l2695j7490J5396N1922N081j7008j0110m11j8598
$$ -283823 -300249 -290449 -312587 -345282 -362772 -347376 -295454 -290373 -307381 -317491 -317902 -336500
15073c36500O5527J3622l5367k3718M9018K9655O157l894m5426n638N033k2795
$$ -336500 -270973 -257351 -292718 -316436 -267418 -237763 -231606 -235500 -280926 -286564 -281531 -304326
15061c04326r544j8526k6982K4913J3018m021n801M1770M1206J3500k0534l919
$$ -304326 -313870 -332396 -359378 -334465 -321447 -325468 -331269 -289499 -248293 -234793 -255327 -259246
15049b59246K2336J3584k7828j1361K4636J2388m7439k2428J5205M6228K8443
$$ -259246 -236910 -223326 -251154 -262515 -237879 -225491 -272930 -295358 -280153 -233925 -205482
15038b05482k2599m2639p460j2601m6696J6895L6551M391j3177l1043J904Q3381
$$ -205482 -228081 -270720 -278180 -290781 -337477 -320582 -284031 -279640 -292817 -323860 -321956 -238575
15026b38575J70j0506J6463j8894l6673l9654M8742M9851K5322P100n0423l9972
$$ -238575 -238405 -248911 -232448 -251342 -288015 -327669 -278927 -229076 -203754 -196654 -247077 -287049
15014b87049j3906p45J4140J3734m956j0998K678j1710J5502R987m2462j4104
$$ -287049 -300955 -301700 -287560 -273826 -278782 -289780 -287102 -298812 -283310 -273323 -315785 -329889
15002c29889M8175J8640L1786L557K5420l3248n7771j6119o985M5649Q9379K2795
$$ -329889 -281714 -263074 -231288 -227731 -202311 -235559 -293330 -309449 -316434 -270785 -181406 -158611
14990a58611l2194l979Oo3180k7398J9216k4555j4419M728N8238J5299j0509j0961
$$ -158611 -190805 -194784 -194778 -257958 -285356 -266140 -290695 -305114 -300386 -242148 -226849 -237358 -248319
14977b48319K891L6329J943j019j0270K066J3431j8766l4900l2285J1792l652
$$ -248319 -245428 -209099 -207156 -208175 -218445 -216379 -202948 -221714 -256614 -288899 -277107 -280759
14965b80759j8624N4430j3741j5177q928O6273n558k7178o1011m769L4763N0757
$$ -280759 -299383 -244953 -258694 -273871 -282799 -216526 -222084 -249262 -310273 -315042 -280279 -229522
14953b29522R941l54k6833J0333l3680K4916l2519k7198J6259L1018J9368Q416
$$ -229522 -219581 -219935 -246768 -236435 -270115 -245199 -277718 -304916 -288657 -257639 -238271 -229855
14941b29855O501L3085k6813j0410K265j689L0012j4942m4352O428N3053L629
$$ -229855 -223354 -190269 -217082 -227492 -225227 -226916 -196904 -211846 -256198 -249770 -196717 -193088
14929a93088k3127k5704j5348J5829K334J4037k6730m077K5512M9734O9447k5478
$$ -193088 -216215 -241919 -257267 -241438 -239104 -225067 -251797 -255874 -230362 -180628 -111181 -136659
14917a36659o0738L5830M49r175k0843P604p488l8488j5056O840p567J9966m163
$$ -136659 -197397 -161567 -161118 -170293 -191136 -183532 -191020 -229508 -244564 -237724 -245291 -225325 -229488
14904b29488J862Q632k1054L5490o163k6422J0942r110n213j3956J8017J1640
$$ -229488 -227626 -218994 -240048 -204558 -210721 -237143 -226201 -235311 -240524 -254480 -236463 -224823
14892b24823L475P865K4662K1369k796o886j1794Q004L1704m5784k5232j7986
$$ -224823 -221348 -213483 -188821 -167452 -170248 -177134 -188928 -180924 -149220 -195004 -220236 -238222
14880b38222K2597L2129p697j1653L4484J333l2288o950L7460p751k8217m858
$$ -238222 -215625 -183496 -191193 -202846 -168362 -167029 -199317 -206267 -168807 -176558 -204775 -209633
14868b09633l8183M852r074K0820K144l350J0098P000l78J1841q890n0738J8980
$$ -209633 -247816 -242964 -252038 -231218 -229074 -232424 -222326 -215326 -215704 -203863 -212753 -263491 -244511
14855b44511K9229o581J2099L495K5897j9333k388L0283J0791j2261J3976K3931
$$ -244511 -215282 -221863 -209764 -206269 -180372 -199705 -202093 -171810 -161019 -173280 -159304 -135373
14843a35373J3564l3692j0552J6833k502K1317m879j7584o5952n07K6613K815
$$ -135373 -121809 -155501 -166053 -149220 -151722 -130405 -135284 -152868 -218820 -219327 -192714 -189899
14831a89899L701K3276Q823j6270k6098L1490M17q654O205m8660k6747K1545l0286
$$ -189899 -186198 -162922 -154099 -170369 -196467 -164977 -164560 -173214 -167009 -215669 -242416 -220871 -251157
14818b51157k4766L3575N3907o406N966j3628k1948K4063j021l5782k5246J0033
$$ -251157 -275923 -242348 -188441 -194847 -188881 -202509 -224457 -200394 -201415 -237197 -262443 -252410
14806b52410K0869n277j136K0895J5053j7008l8840P572M3133j0652M6206L4303
$$ -252410 -231541 -236818 -237954 -217059 -202006 -219014 -257854 -250282 -207149 -217801 -171595 -137292
14794a37292q170o3727r158J0512L1231J2895R054K5556J6399j13m8755j2698
$$ -137292 -145462 -209189 -218347 -207835 -176604 -163709 -154655 -129099 -112700 -112813 -161568 -174266
14782a74266N146l6832q980j7275N6462K9868J5225j2983k1998k217j2739N187
$$ -174266 -169120 -205952 -214932 -232207 -175745 -145877 -130652 -143635 -165633 -167850 -180589 -175402
14770a75402L8851j9967q496J4964J1110j3455l544j3405j6530m2691K7599l831
$$ -175402 -136551 -156518 -165014 -150050 -138940 -152395 -155939 -169344 -185874 -228565 -200966 -204797
14758b04797M1949J8317K1788K82n2160j3562L0168M9897k088l0814j3454K6344
$$ -204797 -162848 -144531 -122743 -122461 -174621 -188183 -158015 -108118 -110206 -141020 -154474 -128130
14746a28130K810k0241k855k8872k08m159L0253M8483j709q338k5694n5613J6340
$$ -128130 -125320 -145561 -148416 -177288 -177496 -181655 -151402 -102919 -104628 -112966 -138660 -194273 -177933
14733a77933j879m8483J7078R6401M0050m7577l001k4869k4098k8506Q393L1525
$$ -177933 -179812 -228295 -211217 -114816 -74766 -122343 -125344 -150213 -174311 -202817 -194424 -162899
14721a62899J4140J3757j8468l7999j3346K0932J570M2437k947J7240L6830j0011
$$ -162899 -148759 -135002 -153470 -191469 -204815 -183883 -182313 -139876 -142823 -125583 -88753 -98764
14709i8764m1610o4400j3792K3729L8215N8029R948l0905m7920j4583K2205m231
$$ -98764 -140374 -204774 -218566 -194837 -156622 -98593 -88645 -119550 -167470 -182053 -159848 -164079
14697a64079J6691Q88j9139K2187J612k7363J5875M2060K4814m6246n5263n3425
$$ -164079 -147388 -146500 -165639 -143452 -141840 -169203 -153328 -111268 -86454 -132700 -187963 -241388
14685b41388J4321L1819M6570M7412J3305n7268r737N0084J0449q657k0667j9828
$$ -241388 -227067 -195248 -148678 -101266 -87961 -145229 -154966 -104882 -94433 -103090 -123757 -143585
14673a43585J3752J5729m960k114j5894m0896M624M1824K5252j1110k2037J5607
$$ -143585 -129833 -114104 -119064 -121178 -137072 -177968 -173344 -131520 -106268 -117378 -139415 -123808
14661a23808K6098L2965J131k3323K9868l2952m2806J0498M3359J0347k3330j90
$$ -123808 -97710 -64745 -63614 -86937 -57069 -90021 -132827 -122329 -78970 -68623 -91953 -92143
14649i2143J8462J0646m386m6029o3403m7498K8113K9607J5079J7027j4234L5934
$$ -92143 -73681 -63035 -67421 -113450 -176853 -224351 -196238 -166631 -151552 -134525 -148759 -112825
14637a12825K3123J7888j494n518j8077l647l2454J6636j5611n0o702m096L3181
$$ -112825 -89702 -71814 -73308 -78826 -96903 -100550 -133004 -116368 -131979 -132029 -138731 -142827 -109646
14624a09646M1804J2823J9113L5634n2139o8453j5673q4J5196N4709j8151j2150
$$ -109646 -67842 -55019 -35906 -272 -52411 -120864 -136537 -136621 -121425 -66716 -84867 -97017
14612i7017j9212p749K3425K1486p765k8237n043p224N833j1992q706M240q126
$$ -97017 -116229 -123978 -100553 -79067 -86832 -115069 -120112 -127336 -121503 -133495 -142201 -137961 -146087
14599a46087K5945K3471j4942j6844P2330M1850j1873p2315J7252q654m0085M941
$$ -146087 -120142 -96671 -111613 -128457 -56127 -14277 -26150 -98465 -81213 -89867 -129952 -125011
14587a25011K4435k0526l0776L1895N235J3259L4798J0446j4186K3692M0294j1181
$$ -125011 -100576 -121102 -151878 -119983 -114748 -101489 -66691 -56245 -70431 -46739 -6445 -17626
14575a7626l4293k4080J4070j7371k4184K3842N267j0467l747J1600K8404J8274
$$ -17626 -51919 -75999 -61929 -79300 -103484 -79642 -74375 -84842 -88589 -76989 -48585 -30311
14563c0311L816j1968m4528l5415l7816n7617j948M7618J5886r278Q3961r524
$$ -30311 -26495 -38463 -82991 -118406 -156222 -213839 -215787 -168169 -152283 -161561 -77600 -87124
14551h7124l850L0239J4723J7760J5375L818j9573m2293j8309K0962k7386l1820
$$ -87124 -90974 -60735 -46012 -28252 -12877 -9059 -28632 -70925 -89234 -68272 -95658 -127478
14539a27478K0444J440j9608J7885Q976J1049K1264L995M339r075J7327k6634
$$ -127478 -107034 -105594 -125202 -107317 -98341 -87292 -66028 -62033 -57694 -66769 -49442 -76076
14527g6076m3837N080M9060K6109P939L6146j8806j8665l176J1581j0214m3145
$$ -76076 -119913 -114833 -65773 -39664 -31725 4421 -14385 -33050 -36226 -24645 -34859 -78004
14515g8004M5693Q248l2902k3436N6540K8120j4733o911J5648P485J7623j8799
$$ -78004 -32311 -24063 -56965 -80401 -23861 4259 -10474 -17385 -1737 5748 23371 4572
14503D572r445o132k1511K6339r538m8863m0649k9711k1532J9743O9313L475o779
$$ 4572 -4873 -11005 -32516 -6177 -15715 -64578 -105227 -134938 -156470 -136727 -67414 -63939 -70718
14490g0718J8930O610k271J3132j3732j2239k0284M5172R475L165M0379p43n11
$$ -70718 -51788 -45178 -47449 -34317 -48049 -60288 -80572 -35400 -25925 -22760 17619 16876 16365
14477A6365l5387n5350j3138j5367K6768L7680N630k6473Q086k2201J541J0798
$$ 16365 -19022 -74372 -87510 -102877 -76109 -38429 -32799 -59272 -51186 -73387 -71846 -61048
14465f1048K829J8414l2874j8819j7499j1441K2741N1073P744k269l3810k9496
$$ -61048 -58219 -39805 -72679 -91498 -108997 -120438 -97697 -46624 -38880 -41149 -74959 -104455
14453a04455M148J3521N4000R488L1559K130R090P71p021k6152l0893R937l9211
$$ -104455 -100307 -86786 -32786 -23298 8261 10391 19481 20252 13231 -12921 -43814 -33877 -73088
14440g3088m6924o914J6242k873J1843K531l9821J5093J1232M0914J8936j9943
$$ -73088 -120012 -126926 -110684 -113557 -101714 -99183 -139004 -123911 -112679 -71765 -52829 -72772
14428g2772l460J9881N474j3401k0115p009N5350R080k2477J5645M4719O4350
$$ -72772 -76232 -56351 -50877 -64278 -84393 -91402 -36052 -26972 -49449 -33804 10915 75265
14416G5265K9592k7904q199r610k7001o3218q1218k4097J8049J1246M2136M2518
$$ 75265 104857 76953 68754 59144 32143 -31075 -112293 -136390 -118341 -107095 -64959 -22441
14404b2441L5028J0270J4623q996Q087N990k6687j9398k1205J6005K3597l2049
$$ -22441 12587 22857 37480 28484 36571 42561 15874 -3524 -24729 -8724 14873 -17176
14392a7176J450J9571j494l9423k0246l4879k898L0570M3315q265j5977K710L460
$$ -17176 -15726 3845 2351 -37072 -57318 -92197 -95095 -64525 -21210 -29475 -45452 -42742 -39282
14379c9282j6926k2642J1528M3955J9164K6845l1838n629L3347O062j6944k4490
$$ -39282 -56208 -78850 -67322 -23367 -4203 22642 -9196 -14825 18522 24584 7640 -16850
14367a6850l2912O195N4200O0118k7774m5815j4328n1534n983J2599L9089P511
$$ -16850 -49762 -43567 10633 70751 42977 -2838 -17166 -68700 -74683 -62084 -22995 -15484
14355a5484K8534j0895R102M541K398j6201K2914m2376l248L1477n85l7843j8792
$$ -15484 13050 2155 11257 15798 18196 1995 24909 -17467 -20715 10762 10177 -27666 -46458
14342d6458J4235R888L7931O1638R300m2428m0191k6684n321K151K2220L9573
$$ -46458 -32223 -22335 15596 77234 86534 44106 3915 -22769 -28090 -25939 -3719 35854
14330C5854J5486o697J469n736k0549K8969l5700j1500j680j1684j1979k535R616
$$ 35854 51340 44643 46112 40376 19827 48796 13096 1596 -84 -11768 -23747 -26282 -16666
14317a6666L1307M5050L763p703O567j7235m8356L633K6381K4774K214k9429j2717
$$ -16666 14641 59691 63454 55751 62318 45083 -3273 360 26741 51515 53729 24300 11583
14304A1583j955n157N656O46P602O001k2642r252M2400M1880P999k6283l39K3805
$$ 11583 9628 4471 10127 10773 18375 24376 1734 -7518 34882 76762 84761 58478 58139 81944
14290H1944p506M43j1463l8537k8152k4500J0027J0390k115k2427j9972N9102
$$ 81944 74438 74881 63418 24881 -3271 -27771 -17744 -7354 -9469 -31896 -51868 7234
14278G234J2939K3950M7972k972j0371K4960J8516j4086j2946l0629J1495K1619
$$ 7234 20173 44123 92095 89123 78752 103712 122228 108142 95196 64567 76062 97681
14266I7681k3554k0691o508M199K0092q750k1764k6994L5211M0009K1975j3972
$$ 97681 74127 53436 46928 51127 71219 62469 40705 13711 48922 88931 110906 96934
14254I6934j7300K3925K4306J2615n9894p5027M3455O0980J2848K3706k2055l4686
$$ 96934 79634 103559 127865 140480 80586 5559 49014 109994 122842 146548 124493 89807
14242H9807K7746K7361m2556j773j8945k5826L4194J2418l1831n8586P814Q398
$$ 89807 117553 144914 102358 100585 81640 55814 90008 102426 70595 12009 19823 28221
14230B8221j4599K3523Q131L5110O912k2857J5125R404N511M2346j2277o3052
$$ 28221 13622 37145 45276 80386 87298 64441 79566 88970 94481 136827 124550 61498
14218F1498L0516J5729N53K8954k0904m518l7668J0250P201l0605k1064K4474
$$ 61498 92014 107743 108296 137250 116346 111828 74160 84410 91611 61006 39942 64416
14206F4416K0428j2446K3853P911k7409l4105N819N0837K2455K09l0006j8497
$$ 64416 84844 72398 96251 104162 76753 42648 48467 99304 121759 121968 91962 73465
14194G3465L8493J5645k2898l1315j2118k4141o032L5741K9046Q654k9039K0857
$$ 73465 111958 127603 104705 73390 61272 37131 31099 66840 95886 104540 75501 96358
14182I6358m015J0541l1888K0009K5831K1670l7667M4576o0718P542K2015J6113
$$ 96358 92343 102884 70996 91005 116836 138506 100839 145415 84697 92239 114254 130367
14170A30367o647J6082l399n2194o903K3632K2939n093m951j6664r764L8657K7719
$$ 130367 123720 139802 136403 84209 77306 100938 123877 118784 113833 97169 87405 126062 153781
14157A53781P493j8960O467K928N317R531n0906k8339j2647K220M5093K287j7528
$$ 153781 161274 142314 148781 151709 157026 166557 115651 87312 74665 76885 121978 124265 106737
14144A06737J9929j3897J6453N4100p053j6186j8209k438O882K6111M228m4283
$$ 106737 126666 112769 129222 183322 176269 160083 141874 139436 146318 172429 176657 132374
14132A32374m460O937K585J565k1855j3030q779L8860n901k471l0863j5862j9622
$$ 132374 127914 134851 137436 139001 117146 104116 95337 134197 128296 125825 94962 79100 59478
14119E9478L6887L1036K0512j0584j1665j2065o681L571L2032l5569l5073L8919
$$ 59478 96365 127401 147913 137329 125664 113599 106918 110489 142521 106952 71879 110798
14107A10798j056J705O430J3917K869l810k679j3087j0932J1746j3295K097l3331
$$ 110798 109742 111447 117877 131794 134663 130853 128174 115087 104155 115901 102606 104703 71372
14094G1372J7747M3118J1444N5400J2739m3950l3889o4241L77N6191J5635p16
$$ 71372 89119 132237 143681 199081 211820 167870 133981 69740 70117 126308 141943 141227
14082A41227m793J987K1816k2911j8642j7802J0873L959k5767r65L2486K7981
$$ 141227 136434 138421 160237 137326 118684 100882 111755 115714 89947 88982 121468 149449
14070A49449J9978m091N976m6338q214K2799J3461j1922q329k4897L9228L2739
$$ 149449 169427 165336 171312 124974 116760 139559 153020 141098 132769 107872 147100 179839
14058A79839J757j2830r535Q668J5059P292j2383m5956m4143k996J65M1745L8830
$$ 179839 181596 168766 159231 167899 182958 190250 177867 131911 87768 84772 84937 126682 165512
14045A65512J1850o4508j9069K9915K2033k767j3460L9836J5402J7012R29l2320
$$ 165512 177362 112854 93785 123700 145733 142966 129506 169342 184744 201756 202685 170365
14033A70365l402L2541m859l9113m7825J6128m5605j1677M7847p836j624k052
$$ 170365 166963 199504 194645 155532 107707 123835 78230 66553 114400 106564 104940 102888
14021A02888J0169K1300N5503J4394n1224k4354o68N0985J1024l5488j1105k6748
$$ 102888 113057 134357 189860 204254 153030 128676 128008 178993 190017 154529 143424 116676
14009A16676k7709M2485O4776m591k7857M5937J4834m523j8959k2543k1499j2398
$$ 116676 88967 131452 196228 191637 163780 209717 224551 220028 201069 178526 157027 144629
13997A44629k512j1913L460L5586l644J3789l2514k8170p347K9448L0354N2019
$$ 144629 142117 130204 133664 169250 165606 179395 146881 118711 111364 140812 171166 223185
13985B23185J7369j0327J314R84j6906l096R312j4728n351Q931L815R677l5155
$$ 223185 240554 230227 231541 232525 215619 212523 221835 207107 201756 210687 214502 224179 189024
13972A89024J0832K4192J2995j3834m0267o137m992k3399j497K709J6370r532
$$ 189024 199856 224048 237043 223209 182942 176805 171813 148414 146917 149626 165996 156464
13960A56464K5558N7127O281o619O896k3473n5168j1447J6625K5843L3362K6340
$$ 156464 182022 239149 245430 238811 245707 222234 167066 155619 172244 198087 231449 257789
13948B57789j9462K2282m325n4751K082J1384P928J035J4320j4296M083j0651
$$ 257789 238327 260609 256284 201533 203615 214999 222927 223962 238282 223986 228069 217418
13936B17418k3297m6194K2729L5407K9660k4713K1532O7129J9786J8471k8882
$$ 217418 194121 147927 170656 206063 235723 211010 232542 299671 319457 337928 309046
13925C09046m6957l0165k9766K928j3358l4093L9151M412q901L985K5550k2951
$$ 309046 262089 231924 202158 205086 191728 157635 196786 201198 192297 196282 221832 198881
13913A98881K3379M4936l1839j59j0542R903k9515q302j5405O985O361n531J3114
$$ 198881 222260 267196 235357 235198 224656 234559 205044 196742 181337 188322 194683 189152 202266
13900B02266K6043M1825M827r268j8640n485k5519k1576j2054J7258q730R427
$$ 202266 228309 270134 274961 265693 247053 241568 216049 194473 182419 199677 190947 200374
13888B00374P556j8936K2764j8514K3933M7829p189K4941l2194l136J2261J1650
$$ 200374 207930 188994 211758 193244 217177 265006 257817 282758 250564 247428 259689 271339
13876B71339Q032l5223J1323P394K3908O961M152p628N708J4812l3346n8094n047
$$ 271339 279371 244148 255471 262865 286773 293734 297886 290258 295966 310778 277432 219338 214291
13863B14291M037J7739K0294k9804l9161j5806J9193J9986O541L297L0516K8831
$$ 214291 218328 236067 256361 226557 187396 171590 190783 210769 217310 220607 251123 279954
13851B79954O0867O277n1467m3123l67K3097M83m3138K8497j06k5299O98J3829
$$ 279954 340821 347098 295631 252508 252141 275238 275721 232583 261080 260974 235675 236373 250202
13838B50202K4727M8382p880l6059J902J4315J2731O347k8273j5836p926J5128
$$ 250202 274929 323311 315431 279372 281274 295589 308320 314667 286394 270558 262632 277760
13826B77760J5591J1172k4341k2026m760L4057J8205j1543J4078J1544k4531n329
$$ 277760 293351 304523 280182 258156 253396 287453 305658 294115 308193 319737 295206 289877
13814B89877m0701N683K3030R581j479l730m8652k1966K755L9336K4676k2857
$$ 289877 249176 254859 277889 287470 285991 282261 233609 211643 214398 253734 278410 255553
13802B55553j691N6589l0032k7887J7847K9947K9315M9308N915r411j9664n2678
$$ 255553 253862 310451 280419 252532 270379 300326 329641 378949 384864 375453 355789 303111
13790C03111l7697L0383k1431K0603q657j9713P996M1937q153J8745K138j3914
$$ 303111 265414 295797 274366 294969 286312 266599 274595 316532 308379 327124 329262 315348
13778C15348k9753l0322K4137L250k3904J9412M3629J2924m1619j2025N4518M3364
$$ 315348 285595 255273 279410 282660 258756 278168 321797 334721 293102 281077 335595 378959
13766C78959m544j7296L2697l095k5262Q368p163K4714L2943j1937O560q184m9803
$$ 378959 374415 357119 389816 386721 361459 369827 362664 387378 420321 408384 414944 406760 356957
13753C56957m2673j477j03N035P586l261k1889L494J7947J0666K0330M564l7012
$$ 356957 314284 312807 312704 317739 325325 322064 300175 303669 321616 332282 352612 357176 320164
13740C20164m432o513J7973J9222j354j4599N784L4337Q434j5553j2498Q991O963
$$ 320164 315732 309219 327192 346414 345060 330461 336245 370582 379016 363463 350965 359956 366919
13727C66919k3024j8256J4275k0358J1840K4932j7438l7518r644K0960L1554p608
$$ 366919 343895 325639 339914 319556 331396 356328 338890 301372 291728 312688 344242 336634
13715C36634Q916J1217J575l3714J5635K9632j6817O7002L5925j917k7062k7319
$$ 336634 345550 356767 358342 324628 340263 369895 353078 420080 456005 454088 427026 399707
13703C99707q295j1703j0394l9712m9786J7469L5512k1022M1415J9243K663N5520
$$ 399707 391412 379709 369315 329603 279817 297286 332798 311776 353191 372434 375097 430617
13691D30617j8175m5138r017M14M0022K5429K337n4486j0265M3800K7338j9405
$$ 430617 412442 367304 358287 358701 398723 424152 426489 372003 361738 405538 432876 413471
13679D13471l8521N222j9266K3776O260M867L3341j3577j4603r924R765j3560
$$ 413471 374950 380172 360906 384682 390942 395809 429150 415573 400970 391046 400811 387251
13667C87251o990N807N6015K4356l0967n5128K9978M7327j5345q905k1117j9601
$$ 387251 380261 386068 442083 466439 435472 380344 410322 457649 442304 433399 412282 392681
13655C92681q40L2170K0149K2267l6288k5286L1236K5399j3910J2101l0314l8615
$$ 392681 391841 424011 444160 466427 430139 404853 436089 461488 447578 459679 429365 390750
13643C90750l3434P904J4631l4426j883q768k0731k2905O0807O1431k689j7787
$$ 390750 357316 365220 379851 345425 343542 334774 314043 291138 351945 413376 410687 392900
13631C92900J7341K2957n352O546M325K047n6329k5001j594l792M4668P1906K8589
$$ 392900 410241 433198 427846 434392 438717 440764 384435 359434 357840 354048 398716 470622 499211
13618D99211J4733k90j5503j7857l1117K5802N1640j1882l1072j4025l5482n0084
$$ 499211 513944 513654 498151 480294 449177 474979 526619 514737 483665 469640 434158 384074
13606C84074M753L1960J8466K1974L3399l5398j4999J5108k3313Q09J4787K7200
$$ 384074 388827 420787 439253 461227 494626 459228 444229 459337 436024 436833 451620 478820
13594D78820J1993m6676k4311L5247M76k771j1553l3903J113K5001j1001L6161
$$ 478820 490813 444137 419826 455073 455549 452778 441225 407322 408435 433436 422435 458596
13582D58596K5376K2931K6611j0696k5522k2968k5397P531K6017k7720J3255O3714
$$ 458596 483972 506903 533514 522818 497296 474328 448931 456462 482479 454759 468014 531728
13570E31728L999j8053J8311K653l90L641J7091q11k2657j9315j9938J3834O299
$$ 531728 535727 517674 535985 538638 538248 541889 558980 558169 535512 516197 496259 510093 516392
13557E16392l0014M9280L533p588L4023p919m3790j8415J9757k8480k3543J3665
$$ 516392 486378 535658 539191 531603 565626 557707 513917 495502 515259 486779 463236 476901
13545D76901M3182J6867k0986j074j6845j7806K3856R48m1094Q74j2495J3397
$$ 476901 520083 536950 515964 514890 498045 480239 504095 505043 463949 464823 452328 465725
13533D65725L059L732L7975M448j2983k94j8863J0246M5722j3126k3002k2352
$$ 465725 468784 472516 510491 514939 501956 501662 482799 493045 538767 525641 502639 480287
13521D80287O3927m578J0847J4040K524l9924M5183J8805q386k8990k2246M602
$$ 480287 544214 539636 550483 564523 567047 527123 572306 591111 582725 553735 531489 536091
13509E36091j5050k8341J5796N2790J8051j8661l2569K4633P579p764M6866p827
$$ 536091 521041 492700 508496 561286 579337 560676 528107 552740 560319 552555 599421 591594
13497E91594r028o703M0811J3462k2446M019j9571k6116K9826K6703j0481n720
$$ 591594 582566 575863 616674 630136 607690 611709 592138 566022 595848 622551 612070 606350
13485F06350k4285K5242J8737j2206k532J5199p282J1126k5604k0039r083j548
$$ 606350 582065 607307 626044 613838 611306 626505 619223 630349 604745 584706 575623 574075
13473E74075J7828j618K9691j5442l7291o4657M2969L7010J7183J6163k5768J4087
$$ 574075 591903 590285 619976 604534 567243 502586 545555 582565 599748 615911 590143 604230
13461F04230L0344J17L6735l5037l1528o322j725j5741j6562R835k1378K1814
$$ 604230 634574 634691 671426 636389 604861 598539 596814 581073 564511 574346 552968 574782
13449E74782L7301k3392n3254p028K9198K4246k815l9694k1671L0146K8098K1767
$$ 574782 612083 588691 535437 528409 557607 581853 579038 539344 517673 547819 575917 597684
13437E97684J2306Q453K4892L648p228j515P665K8043j8233j4860j2405k9030
$$ 597684 609990 618443 643335 646983 639755 638240 645905 673948 655715 640855 628450 599420
13425E99420n0272P00M7523K8930k900J9889J9858J6616k7330k0441j8911L776
$$ 599420 549148 549848 597371 626301 623401 643290 663148 679764 652434 631993 613082 616858
13413F16858O580M1961L8330k2096m8288L091j982K251K9937R678J3502p057j55
$$ 616858 623438 665399 703729 681633 633345 636436 634454 636705 666642 676320 689822 682765 682610
13400F82610q637K7603M257j8391j7469K056J5686j692k022J595n51M0284O2371
$$ 682610 673973 701576 705833 687442 669973 672029 687715 686023 684001 685596 685045 725329 787700
13387G87700m09o0889j9182K0855K7228j3260k2556k5836L1363J3878p4308M1254
$$ 787700 787291 726402 707220 728075 755303 742043 719487 693651 725014 738892 664584 705838
13375G05838N3498j2428j0073p654m1436Q939J7425K126J0569L2866J0460J2523
$$ 705838 759336 746908 736835 729181 687745 696684 714109 716235 726804 759670 770130 782653
13363G82653j4652l8055j1825K8635N2946n936K3632J7706J0752l0120l8502j2537
$$ 782653 768001 729946 718121 746756 799702 793766 817398 835104 845856 815736 777234 764697
13351G64697K1731J9742q984j9710j60j7938j3796j7729J1948Q884L4629M846
$$ 764697 786428 806170 797186 777476 777316 759378 745582 727853 739801 748685 783314 788160
13339G88160J6874R108m2845m1493m8017K3931N6947L0799o839K1l2776M2672
$$ 788160 805034 814142 771297 729804 681787 705718 762665 793464 786625 786646 753870 796542
13327G96542M679j2780K6086j3019L0459J1463m3165m2631j6142M4999Q805K6269
$$ 796542 801221 788441 814527 801508 831967 843430 800265 757634 741492 786491 795296 821565
13315H21565J798m5395k272M2348L5901K1953j0982N71J0396l1689j9971n0298
$$ 821565 823363 777968 775696 818044 853945 875898 864916 865487 875883 844194 824223 773925
13303G73925J80N41L2029K0171o85K161J0403Q085J2186j6663o111j825Q87n988
$$ 773925 774105 774646 806675 826846 826161 828322 838725 846810 858996 842333 836222 834397 835284 829296
13289H29296K1530n181M877R254J4195J0260j3418N767R620j4123O617p905k307
$$ 829296 850826 845645 850522 859776 873971 884231 870813 876580 886200 872077 878694 870789 868482
13276H68482K8728M8779K2070P96p459l6705k5734j3414m8264K0080J4566J4109
$$ 868482 897210 945989 968059 968855 961396 924691 898957 885543 837279 857359 871925 886034
13264H86034k4078j770J4936L6172L468k0280K4805O362M982K2985R813j6629
$$ 886034 861956 860186 875122 911294 914762 894482 919287 925649 930631 953616 963429 946800
13252I46800j4056M8554O3140n5180o2592N505K6015k0499p0617N72O6668K1983
$$ 946800 932744 981298 1044438 989258 926666 932171 958186 937687 867070 867642 934310 956293
13240I56293Q049m1266p3736k6379K3313K9726n386J6490J5335L3487j9034K2038
$$ 956293 964342 923076 849340 822961 846274 876000 870614 887104 902439 935926 916892 938930
13228I38930k2389j4303K6284K2126L9974j4184j4037K5542K2279M3867j2453
$$ 938930 916541 902238 928522 950648 990622 976438 962401 987943 1010222 1054089 1041636
13217A041636K41P91K378M9830J9729M346l9693l9812l749K4304K3670o613K1766
$$ 1041636 1041877 1042668 1045046 1094876 1114605 1118951 1079258 1039446 1035697 1060001 1083671 1077058 1098824
13204A098824N5222N215j6297q774j6368m1624j8208L6805l9744k2132j5682M6449
$$ 1098824 1154046 1159261 1142964 1134190 1117822 1076198 1057990 1094795 1055051 1032919 1017237 1063686
13192A063686J2673k7843l524P0990l500L231J1954N717J0018l2804M807l3826
$$ 1063686 1076359 1048516 1044992 1115982 1112482 1115713 1127667 1133384 1143402 1110598 1115405 1081579
13180A081579k211k0571o570M6049L2885N4320K6586n0375o394K1617k3774j30
$$ 1081579 1079368 1058797 1052227 1098276 1131161 1185481 1212067 1161692 1155298 1176915 1153141 1153011
13168A153011M4609L2496q143j9006L0056m54m4621j5087J0204k4685l0413K2733
$$ 1153011 1197620 1230116 1221973 1202967 1233023 1232569 1187948 1172861 1183065 1158380 1127967 1150700
13156A150700J1149L5784M7095l4372j6292k6052l8127L0973J5239M4801N692
$$ 1150700 1161849 1197633 1244728 1210356 1194064 1168012 1129885 1160858 1176097 1220898 1226590
13145A226590l524k4788j9375M7956O9875K4724k0010j8684j4939o91J1258j7171
$$ 1226590 1223066 1198278 1178903 1226859 1296734 1321458 1301448 1282764 1267825 1267134 1278392 1261221
13133A261221L3416J3367n434j3367q122j983L0220q960j6015N4700J709k1950
$$ 1261221 1294637 1308004 1302570 1289203 1281081 1279098 1309318 1300358 1284343 1339043 1340752 1318802
13121A318802K4467M9131R616n3095l175J2613J3431m5722m6076o134K6687K4475
$$ 1318802 1343269 1392400 1402016 1348921 1345746 1358359 1371790 1326068 1279992 1273858 1300545 1325020
13109A325020n046R521L5948J6484j3991j4153p591o266J9102K9316K2363k5566
$$ 1325020 1319974 1329495 1365443 1381927 1367936 1353783 1346192 1339926 1359028 1388344 1410707 1385141
13097A385141n3428K5329L2219k3867L9184Q7022J834p0921p0504M9425K9321
$$ 1385141 1331713 1357042 1389261 1365394 1404578 1491600 1493434 1422513 1352009 1401434 1430755
13086A430755L7501r497j7255j2399k781P077J4284k7042j5344L4780L0527J587
$$ 1430755 1468256 1458759 1441504 1429105 1426324 1433401 1447685 1420643 1405299 1440079 1470606 1472193
13074A472193K4982J6713k122m353j2432O812L2976k5352k3751k6834J3635M8594
$$ 1472193 1497175 1513888 1511766 1507413 1494981 1501793 1534769 1509417 1485666 1458832 1472467 1521061
13062A521061L6158j7015p376j259l1168L5985J5614l1474j3718K4786M0226N9566
$$ 1521061 1557219 1540204 1532828 1531569 1500401 1536386 1552000 1520526 1506808 1531594 1571820 1631386
13050A631386J2932l5680K1727p861K4676K0214l8422j2671J9731L272M8641L2047
$$ 1631386 1644318 1608638 1630365 1622504 1647180 1667394 1628972 1616301 1636032 1639304 1687945 1719992
13038A719992k553j161k8466l5328L4441M0426M9876j9799k8079j515K1304J1486
$$ 1719992 1717439 1716278 1687812 1652484 1686925 1727351 1777227 1757428 1729349 1727834 1749138 1760624
13026A760624M7178K33r936j1677j4514j2382k8526j7350M663L2019M2657J9475
$$ 1760624 1807802 1808035 1798099 1786422 1771908 1759526 1731000 1713650 1718313 1750332 1792989 1812464
13014A812464l682L7726m029k9731K0711L7002J7707O592K7941l559M454m287
$$ 1812464 1808782 1846508 1842479 1812748 1833459 1870461 1888168 1894760 1922701 1919142 1923596 1919309
13002A919309M636l6502J3967M5213p880j3670l949M415M0546J3840k6331K9297
$$ 1919309 1923945 1887443 1901410 1946623 1938743 1925073 1921124 1925539 1966085 1979925 1953594 1982891
12990A982891o242Q111K9047K7157L8455L9277Q675j1638k6278J1974M9349R8599
$$ 1982891 1976649 1984760 2013807 2040964 2079419 2118696 2127371 2115733 2089455 2101429 2150778 2249377
12978B249377N360k1100r631l1924p8945k4091K7064k022j4505n0200j3015J2023
$$ 2249377 2254737 2233637 2224006 2192082 2113137 2089046 2116110 2114088 2099583 2049383 2036368 2048391
12966B048391M2667j0046q668K7657J8854O670q888j1653L6056J8786J2579J5424
$$ 2048391 2091058 2081012 2072344 2100001 2118855 2125525 2116637 2104984 2141040 2159826 2172405 2187829
12954B187829K2646k1755J0862L930M1071M3466j2012r81P1725M1504P166Q088
$$ 2187829 2210475 2188720 2199582 2203512 2244583 2288049 2276037 2275056 2346781 2388285 2395451 2403539
12942B403539J0188k723K6254J069k817j1135k3593n722K467j2769M4930K2953
$$ 2403539 2413727 2411004 2437258 2438327 2435510 2424375 2400782 2395060 2397527 2384758 2429688 2452641
12930B452641M6870L3643k9434j7724M1272N2390O3423R126q224J7065K9265L0806
$$ 2452641 2499511 2533154 2503720 2485996 2527268 2579658 2643081 2652207 2643983 2661048 2690313 2721119
12918B721119L5437K6412j0056j740q2391n0274R0713M986J947R591M1253J6217
$$ 2721119 2756556 2782968 2772912 2771172 2688781 2638507 2729220 2734206 2736153 2745744 2786997 2803214
12906B803214l649J0144O3955L2333k5283j4296j0355N0841J1147P088M2962L3891
$$ 2803214 2799565 2809709 2873664 2905997 2880714 2866418 2856063 2906904 2918051 2925139 2968101 3001992
12894C001992J1768L3784L1209l8644j4624Q082N6625N7125J0996L9235N9392
$$ 3001992 3013760 3047544 3078753 3040109 3025485 3033567 3090192 3147317 3158313 3197548 3256940
12883C256940M7054J2186m9212J1764K7733j3571j0648M9300L6046M2637Q3495
$$ 3256940 3303994 3316180 3266968 3278732 3306465 3292894 3282246 3331546 3367592 3410229 3493724
12872C493724M9180j7848j796J3114N127N3114K8136L368J9295K1275M689M4030
$$ 3493724 3542904 3525056 3523260 3536374 3541501 3594615 3622751 3626119 3645414 3666689 3671378 3715408
12860C715408Q5890J0159Q472R142j3041N9599L2600N704M9686j1794m011O727
$$ 3715408 3801298 3811457 3819929 3829071 3816030 3875629 3908229 3913933 3963619 3951825 3947814 3954541
12848C954541K0741P4630N4703P3176N1984L3625N7905M2045j4816l8712O0650
$$ 3954541 3975282 4049912 4104615 4177791 4229775 4263400 4321305 4363350 4348534 4309822 4370472
12837D370472Q1731K4028M3381P2520L7582j668J7542K1114M7605L5042L4835
$$ 4370472 4452203 4476231 4519612 4592132 4629714 4628046 4645588 4666702 4714307 4749349 4784184
12826D784184M8660O5582O7692p282J0314M3013L5484J09162O3895K6526L2755
$$ 4784184 4832844 4898426 4966118 4958836 4969150 5012163 5047647 5156809 5220704 5247230 5279985
12815E279985P9446K7719K1522M3099R1015P6635O2301N3549O8439M4321N6290
$$ 5279985 5359431 5387150 5408672 5451771 5542786 5619421 5681722 5735271 5803710 5848031 5904321
12804E904321N3597L7521L4155O0546N8147R7141R1596N5914L1120J7986J5984
$$ 5904321 5957918 5995439 6029594 6090140 6148287 6245428 6337024 6392938 6424058 6442044 6458028
12793F458028P0125J11527J35898L1620K8042R1282P3482J02431J31849O0956
$$ 6458028 6528153 6639680 6775578 6807198 6835240 6926522 7000004 7102435 7234284 7295240
12783G295240M7054Q5168R8176P7928Q2551N9762M4382J06068J17002Q4037P2734
$$ 7295240 7342294 7427462 7525638 7603566 7686117 7745879 7790261 7896329 8013331 8097368 8170102
12772H170102Q8605R2768M9589O1090R7008J38831J42586P2688L3476J02708J28696
$$ 8170102 8258707 8351475 8401064 8462154 8559162 8697993 8840579 8913267 8946743 9049451 9178147
12761I178147R5866J08861P1175P2799R7677L6871L0466P5171P8665M4471N3098
$$ 9178147 9274013 9382874 9454049 9526848 9624525 9661396 9691862 9767033 9845698 9890169 9943267
12750I943267N2637n388j0652J9877m0813j00666j03639r1565q2849j26895j61915
$$ 9943267 9995904 9990516 9979864 9999741 9958928 9858262 9754623 9663058 9580209 9453314 9291399
12739I291399j88693k09103k40951k79904l13895l38473l38741l99594m13994
$$ 9291399 9102706 8893603 8652652 8372748 8058853 7720380 7381639 6982045 6568051
12730F568051m72830n23131o38717o20077o01508o19948o80206p08197p12014
$$ 6568051 6095221 5572090 4933373 4313296 3711788 3091840 2411634 1703437 991423
12721I91423p19584p09558o71509o46040o80388o57963o77667o29296n93196n18137
$$ 991423 271839 -437719 -1109228 -1755268 -2435656 -3093619 -3771286 -4400582 -4993778 -5511915
12711e511915m96900m90454m15742l79590l97771l86028k94560k71652k62938
$$ -5511915 -6008815 -6499269 -6915011 -7294601 -7692372 -8078400 -8372960 -8644612 -8907550
12702h907550j69886j76363j96458j32558r2529p5954m9403m4183j2098L7652
$$ -8907550 -9077436 -9253799 -9450257 -9582815 -9675344 -9751298 -9800701 -9844884 -9856982 -9819330
12692i819330K0149l2975m1987j735M2610N8043P0862O7502J12368O9133J21749
$$ -9819330 -9799181 -9832156 -9874143 -9875878 -9833268 -9775225 -9704363 -9636861 -9524493 -9455360 -9333611
12681i333611R2277M4484O7406Q1579N9144Q2376J26302Q9931J15602Q1425P3862
$$ -9333611 -9241334 -9196850 -9129444 -9047865 -8988721 -8906345 -8780043 -8690112 -8574510 -8493085 -8419223
12670h419223Q6418J20874Q4902P4797O9140N7462Q5002R1061Q5507P6406O1274
$$ -8419223 -8332805 -8211931 -8127029 -8052232 -7983092 -7925630 -7840628 -7749567 -7664060 -7587654 -7526380
12659g526380Q4079J16759Q7234O0896Q0896Q2285N9751K9163P6790P1384N4684
$$ -7526380 -7442301 -7325542 -7238308 -7177412 -7096516 -7014231 -6954480 -6925317 -6848527 -6777143 -6722459
12648f722459P6030O7154O3584M7960M7701R6510J9523R1169N0189R5011R1610
$$ -6722459 -6646429 -6579275 -6515691 -6467731 -6420030 -6323520 -6303997 -6212828 -6162639 -6067628 -5976018
12637e976018P2417N1166N9136O6589O4575L4599K8931L6434L7048R920N1755
$$ -5976018 -5903601 -5852435 -5793299 -5726710 -5662135 -5627536 -5598605 -5562171 -5525123 -5515203 -5463448
12626e463448O7714L0185Q9146Q1946N639J4850O8984N6334O4576N2316O5069
$$ -5463448 -5395734 -5365549 -5276403 -5194457 -5188818 -5173968 -5104984 -5048650 -4984074 -4931758 -4866689
12615d866689M0766J5254K3757N3492P4042K5705J0607R165N5766R9069K0557
$$ -4866689 -4825923 -4810669 -4786912 -4733420 -4659378 -4633673 -4623066 -4613901 -4558135 -4459066 -4438509
12604d438509r018J5444N2446J7144K1165M8594N8481N063K8918K7310O6292M5726
$$ -4438509 -4447527 -4432083 -4379637 -4362493 -4341328 -4292734 -4234253 -4229190 -4200272 -4172962 -4106670 -4060944
12592d060944M4766K2212J3715K9375J1881O0075K6780R518K3433K2561O807J0961
$$ -4060944 -4016178 -3993966 -3980251 -3950876 -3938995 -3878920 -3852140 -3842622 -3819189 -3796628 -3789821 -3778860
12580c778860J6903l732O1001R1875L0135N956m059J402l7742J2851K6110L6193
$$ -3778860 -3761957 -3765689 -3704688 -3612813 -3582678 -3576722 -3580781 -3579379 -3617121 -3604270 -3578160 -3541967
12568c541967P5175J03191N1218K3993j2357l6884Q413l919J6587N1125M0732
$$ -3541967 -3466792 -3363601 -3312383 -3288390 -3300747 -3337631 -3329218 -3333137 -3316550 -3265425 -3224693
12557c224693J3675k4009P898M1408J6161L3850K0322L792K1221K6040P2475K8654
$$ -3224693 -3211018 -3235027 -3227129 -3185721 -3169560 -3135710 -3115388 -3111596 -3090375 -3064335 -2991860 -2963206
12545b963206l8542k1895N8172L6587L0262m842J4368K6425j4659K7153J0884
$$ -2963206 -3001748 -3023643 -2965471 -2928884 -2898622 -2903464 -2889096 -2862671 -2877330 -2850177 -2839293
12534b839293j1363K7482M703M333Q469J3160k3464j0152l571L8308J460R906
$$ -2839293 -2850656 -2823174 -2818471 -2814138 -2805669 -2792509 -2815973 -2826125 -2829696 -2791388 -2789928 -2780022
12522b780022M5848P9321K1207N959n839l6299J4493K7809K6554M4888K1811R459
$$ -2780022 -2734174 -2654853 -2633646 -2627687 -2633526 -2669825 -2655332 -2627523 -2600969 -2556081 -2534270 -2524811
12510b524811k7991k627J9341L8564L4794M8236l8883j6336K8305J5670J6346
$$ -2524811 -2552802 -2555429 -2536088 -2497524 -2462730 -2414494 -2453377 -2469713 -2441408 -2425738 -2409392
12499b409392n531K2244N2636j0488l232P132j2707k670L0824N8357J9148k3193
$$ -2409392 -2414923 -2392679 -2340043 -2350531 -2353763 -2346631 -2359338 -2362008 -2331184 -2272827 -2253679 -2276872
12487b276872K9004k3052J9476L9299k472R123J5983L7039K7310L1466L0213K1675
$$ -2276872 -2247868 -2270920 -2251444 -2212145 -2214617 -2205494 -2189511 -2152472 -2125162 -2093696 -2063483 -2041808
12475b041808M3006K9834m0123l4100j5484L8238J3012j420m0021k3209l9880
$$ -2041808 -1998802 -1968968 -2009091 -2043191 -2058675 -2020437 -2007425 -2008845 -2048866 -2072075 -2111955
12464b111955j139N353N791j3226l9402Q61J6696M3001L8884m3q263K7947k4519
$$ -2111955 -2113094 -2107741 -2101950 -2115176 -2154578 -2153717 -2137021 -2094020 -2055136 -2055179 -2063442 -2035495 -2060014
12451b060014m424L5138O2139M8816m7764m1117N558M4841K0504K1693P79r732
$$ -2060014 -2064438 -2029300 -1967161 -1918345 -1966109 -2007226 -2001668 -1956827 -1936323 -1914630 -1913851 -1923583
12439a923583j0622J757L3002o145l5998K5456N4150M2616J4853m663K0544j2068
$$ -1923583 -1934205 -1932448 -1899446 -1905591 -1941589 -1916133 -1861983 -1819367 -1804514 -1809177 -1788633 -1800701
12427a800701j455k3101p758N7714K57l2309L3667J5497m1219j9738J9252M8881
$$ -1800701 -1802156 -1825257 -1833015 -1775301 -1775044 -1807353 -1773686 -1758189 -1799408 -1819146 -1799894 -1751013
12415a751013P511n953j2754K4556K1278j3635K4996O0050K1838k8553n2084Q637
$$ -1751013 -1743502 -1749455 -1762209 -1737653 -1716375 -1730010 -1705014 -1644964 -1623126 -1651679 -1703763 -1695126
12403a695126K0798l893K3865K2794j2474K0449J1957k0006j0467K0737L7400
$$ -1695126 -1674328 -1678221 -1654356 -1631562 -1644036 -1623587 -1611630 -1631636 -1642103 -1621366 -1583966
12392a583966J7778K0872M7661k8828k5788m2394l671M0479J5403j909J3281J6572
$$ -1583966 -1566188 -1545316 -1497655 -1526483 -1552271 -1594665 -1598336 -1557857 -1542454 -1544363 -1531082 -1514510
12380a514510J0261K6274L145k5687l9472p946j5568P762M9243M3113j0736J845
$$ -1514510 -1504249 -1477975 -1474830 -1500517 -1539989 -1547935 -1563503 -1555741 -1506498 -1463385 -1474121 -1472276
12368a472276K3104k5498j7503J7658L5426J8642j738j0647m868j2936L1668K8762
$$ -1472276 -1449172 -1474670 -1492173 -1474515 -1439089 -1420447 -1422185 -1432832 -1437700 -1450636 -1418968 -1390206
12356a390206k467k4205p096j1505K974j1607m589L6086L8750J8216l664r196
$$ -1390206 -1392673 -1416878 -1423974 -1435479 -1432505 -1444112 -1448701 -1412615 -1373865 -1355649 -1359313 -1368509
12344a368509L49J0699l0190k5804n289K3738l132N918K1935j980M8317K185r174
$$ -1368509 -1368160 -1357461 -1387651 -1413455 -1418744 -1395006 -1398138 -1392220 -1370285 -1372265 -1323948 -1321763 -1330937
12331a330937n389K6580K9569j2928j719n349l1594L2867j0155k9869J310P8633
$$ -1330937 -1336326 -1309746 -1280177 -1293105 -1294824 -1300173 -1331767 -1298900 -1309055 -1338924 -1337614 -1258981
12319a258981j9300p7484k2948K0066L4610j0852L4592m495P788K1784j1086J7538
$$ -1258981 -1278281 -1355765 -1378713 -1358647 -1324037 -1334889 -1300297 -1304792 -1297004 -1275220 -1286306 -1268768
12307a268768K9857J6313K2839K2192l1045Q782J7068J6058O986m8009M1862J9017
$$ -1268768 -1238911 -1222598 -1199759 -1177567 -1208612 -1199830 -1182762 -1166704 -1159718 -1207727 -1165865 -1146848
12295a146848j012J3672j3080k295J3589N014J921l4103l2434j0976n277J6602
$$ -1146848 -1147860 -1134188 -1147268 -1149563 -1135974 -1130960 -1129039 -1163142 -1195576 -1206552 -1211829 -1195227
12283a195227k6731N389L0366K1103n085l1360M8008M4644k4358k6040M3042L1616
$$ -1195227 -1221958 -1216569 -1186203 -1165100 -1170185 -1201545 -1153537 -1108893 -1133251 -1159291 -1116249 -1084633
12271a084633j5250j9222M5150R501K0845k7014l1585j5079m1766J3080L1496
$$ -1084633 -1099883 -1119105 -1073955 -1064454 -1043609 -1070623 -1102208 -1117287 -1159053 -1145973 -1114477
12260a114477j0460K6661J9947K4567l7938M127J4184L0674l94J5943q829o890
$$ -1114477 -1124937 -1098276 -1078329 -1053762 -1091700 -1087573 -1073389 -1042715 -1043109 -1027166 -1035995 -1042885
12248a042885j5505J7788K2130k0716l3189J9948l752K8923L7438L6901m9588
$$ -1042885 -1058390 -1040602 -1018472 -1039188 -1072377 -1052429 -1056181 -1027258 -989820 -952919 -1002507
12237a002507m9515k5711M9532K6512L3885K8399N2j4802k3207n4650J615J4627
$$ -1002507 -1052022 -1077733 -1028201 -1001689 -967804 -939405 -939353 -954155 -977362 -1032012 -1030397 -1015770
12225a015770L3181j306L4858J8756m34N8l573J4093o282J539j1107l1321m246
$$ -1015770 -982589 -983895 -949037 -930281 -930715 -930657 -934230 -920137 -926419 -924880 -935987 -967308 -971554
12212i71554j933j2628O614k851P851J2083N9249p64l9836l9046j8627J6531L1857
$$ -971554 -973487 -986115 -979501 -982352 -974501 -962418 -903169 -903933 -943769 -982815 -1001442 -984911 -953054
12199i53054L8382K6668K3555N5260j1173m4828k0023J1358j2914l5281l0546
$$ -953054 -914672 -888004 -864449 -809189 -820362 -865190 -885213 -873855 -886769 -922050 -952596
12188i52596M470Q1860j3952k8318k500j4946K684R221m2221k7076J9231J9372
$$ -952596 -948126 -866266 -880218 -908536 -911036 -925982 -923298 -914077 -956298 -983374 -964143 -944771
12176i44771J2183l0549J1747K1103K1719K9292L2639p916J4611j0727l85K6150
$$ -944771 -932588 -963137 -951390 -930287 -908568 -879276 -846637 -854553 -839942 -850669 -851054 -824904
12164h24904J7045l1353j7906j2117K576K1233L2522L9923l1212l3851j0454L7512
$$ -824904 -807859 -839212 -857118 -869235 -866659 -845426 -812904 -772981 -804193 -838044 -848498 -810986
12152h10986n468k3107k9916m5105K7729P0437k733j0459M5378l1877l1917O766
$$ -810986 -816454 -839561 -869477 -914582 -886853 -816416 -819149 -829608 -784230 -816107 -848024 -841258
12140h41258L7943l558l2510j0345L6374L8131P945L882Q769j7003R457j9407
$$ -841258 -803315 -806873 -839383 -849728 -813354 -775223 -767278 -763396 -754627 -771630 -762173 -781580
12128g81580K605L2401K1459R781J591k8912p933K2276K1246K0237j5930k0601
$$ -781580 -778975 -746574 -725115 -715334 -713743 -742655 -750588 -728312 -707066 -686829 -702759 -723360
12116g23360j2038p862Q40L2661k7711k0187K5584K8947K0597j5282k3092j6712
$$ -723360 -735398 -743260 -742420 -709759 -737470 -757657 -732073 -703126 -682529 -697811 -720903 -737615
12104g37615j2547L0296j5408n181K4644K0641r423l8888l0768P536L2678M1772
$$ -737615 -750162 -719866 -735274 -740455 -715811 -695170 -704593 -743481 -774249 -766713 -734035 -692263
12092f92263m0537j4585l0967J3706o47L322L2686Q297o833K27L9798L9324j837
$$ -692263 -732800 -747385 -778352 -764646 -765293 -761971 -729285 -720988 -727821 -727594 -687796 -648472 -650309
12079f50309l3018j5825K5508j4606J3843n2008j6101L3443j9113R07K6822k333
$$ -650309 -683327 -699152 -673644 -688250 -674407 -726415 -742516 -709073 -728186 -727279 -700457 -702790
12067g02790K988K635L8872L1234K4244n5411P465J9099q15k3163l6902m282o914
$$ -702790 -699802 -697167 -658295 -627061 -602817 -658228 -650763 -631664 -632479 -655642 -692544 -696826 -703740
12054g03740L280l152K0317L2576M5650p780j9543J7383J9526j7387j0200l0345
$$ -703740 -700460 -703612 -683295 -650719 -605069 -612849 -632392 -615009 -595483 -612870 -623070 -653415
12042f53415M646M5116L6240l3838k448K4363k0991k2584k9819j8630J8759n799
$$ -653415 -648769 -603653 -567413 -601251 -603699 -579336 -600327 -622911 -652730 -671360 -652601 -658400
12030f58400K3269O884J7921O379m255J9867K1441J2833L684m363l2223Q147K464
$$ -658400 -635131 -628247 -610326 -603947 -608202 -588335 -566894 -554061 -550377 -554740 -586963 -578816 -576352
12017e76352K3535M2988L934J0914O435k7949k7884j4857p2598m9927J9773K1775
$$ -576352 -552817 -509829 -505895 -494981 -488546 -516495 -544379 -559236 -631834 -681761 -661988 -640213
12005f40213K6858j7475j2552J9581l848J2543O0720m4769J8444O1082J4608k9424
$$ -640213 -613355 -630830 -643382 -623801 -627649 -615106 -554386 -599155 -580711 -519629 -505021 -534445
11993e34445J5553K0229k6466n468k9591J4295J1478J1087p3874o650N0779J9025
$$ -534445 -518892 -498663 -525129 -530597 -560188 -545893 -534415 -523328 -597202 -603852 -553073 -534048
11981e34048k5206Q020L8915J8924k1478n1636p763J8736O374K4108J3761J2564
$$ -534048 -559254 -551234 -512319 -493395 -514873 -566509 -574272 -555536 -549162 -525054 -511293 -498729
11969d98729k3970l9976l467j6182j1822K7859L2377m844j4815J9242j2970k4261
$$ -498729 -522699 -562675 -566142 -582324 -594146 -566287 -533910 -538754 -553569 -534327 -547297 -571558
11957e71558r115J3944M0742K5691j3849N749j1158m016K3724j696J476L7913
$$ -571558 -580673 -566729 -525987 -500296 -514145 -508396 -519554 -523570 -499846 -501542 -500066 -462153
11945d62153L8960M2410k8470n1090n3708R940N4337K8098q76k9134n232j229
$$ -462153 -423193 -380783 -409253 -460343 -514051 -504111 -449774 -421676 -422552 -451686 -456918 -458147
11933d58147n164J575K6241L282r176K6856n183m1283p980j7057l515O367m274
$$ -458147 -463311 -461736 -435495 -432213 -441389 -414533 -419716 -460999 -468979 -486036 -489551 -483184 -487458
11920d87458q05j0329M0011J4988k2421l083K7565j9266k9915l1185j213K9440
$$ -487458 -488263 -498592 -458581 -443593 -466014 -469097 -441532 -460798 -490713 -521898 -523111 -493671
11908d93671M8479J4868R765r276J2769j1477p659K8928o04k7588o2001L2375
$$ -493671 -445192 -430324 -420559 -429835 -417066 -428543 -436202 -407274 -407878 -435466 -497467 -465092
11896d65092K0443r048K1745M5678j3267Q360M2674j7153l3009k0354J2257M0319
$$ -465092 -444649 -453697 -431952 -386274 -399541 -391181 -348507 -365660 -398669 -419023 -406766 -366447
11884c66447o860k9892j8923q045n122J4110J3079l914J9957l275j145m2093m104
$$ -366447 -373307 -403199 -422122 -430167 -435289 -421179 -408100 -412014 -392057 -395332 -396477 -438570 -442674
11871d42674L4403L0912j7575J0166K0810m6815j8339K4811N1199l9311j9994
$$ -442674 -408271 -377359 -394934 -384768 -363958 -410773 -429112 -404301 -353102 -392413 -412407
11860d12407M3592K3087k3847k6008k3477K5515P550j2170J8028Q816j0123q638
$$ -412407 -368815 -345728 -369575 -395583 -419060 -393545 -385995 -398165 -380137 -371321 -381444 -390082
11848c90082K0735K4923n3916l1378J0683L4240J4850q217j662K2530N4792J4860
$$ -390082 -369347 -344424 -398340 -429718 -419035 -384795 -369945 -378162 -379824 -357294 -302502 -287642
11836b87642n7961n1367q97J2493M9223L0003j3390M1412J4231n1726J024J3736
$$ -287642 -345603 -396970 -397867 -385374 -336151 -306148 -319538 -278126 -263895 -315621 -314597 -300861
11824c00861j6827j4276K2288J4637m0017j4418j2042l0726J7496P973k3321J9657
$$ -300861 -317688 -331964 -309676 -295039 -335056 -349474 -361516 -392242 -374746 -366773 -390094 -370437
11812c70437K6643K637L2339r112K900j1650l7368l549l582K5606N2836J563k3061
$$ -370437 -343794 -341157 -308818 -317930 -315030 -326680 -364048 -367597 -371179 -345573 -292737 -291174 -314235
11799c14235K8176j2411l0696L5478Q824J1064n7524j4199J0286l476J8291N258
$$ -314235 -286059 -298470 -329166 -293688 -284864 -273800 -331324 -345523 -335237 -338713 -320422 -315164
11787c15164L25M3521n151m5482j8808L2663l045J3456L1617k088J8355K8855
$$ -315164 -314839 -271318 -276469 -321951 -340759 -308096 -311141 -297685 -266068 -268156 -249801 -220946
11775b20946M006p167k5156m3229K647r807n3716J7038K3834J0180k0207j8871
$$ -220946 -216940 -224107 -249263 -292492 -289845 -299652 -353368 -336330 -312496 -302316 -322523 -341394
11763c41394J2373m3341P17K0829K6604L5507L5036M2363j3705l0110o4334l486
$$ -341394 -329021 -372362 -371645 -350816 -324212 -288705 -253669 -211306 -225011 -255121 -319455 -322941
11751c22941M3977K9603j7511j8164J8004L3780K7264n3380k0130L3871k8116
$$ -322941 -278964 -249361 -266872 -285036 -267032 -233252 -205988 -259368 -279498 -245627 -273743
11740b73743N156p296K3695k5109j8063L5501n5293k3470L1670K2714L1625L9748
$$ -273743 -268587 -275883 -252188 -277297 -295360 -259859 -315152 -338622 -306952 -284238 -252613 -212865
11728b12865L233K78m67l854J3804J8335K4483j6929m9030J6623K4007k824J938
$$ -212865 -209632 -209354 -209821 -213675 -199871 -181536 -157053 -173982 -223012 -206389 -182382 -185206 -183268
11715a83268q729M88k7153p5069M055j9070j7816L4505R344l3941L2880j6673
$$ -183268 -191997 -191509 -218662 -293731 -289676 -308746 -326562 -292057 -282713 -316654 -283774 -300447
11703c00447M980N549J9141O1441L5097J8360l1884o044J3034k1187J7951O325
$$ -300447 -295467 -289918 -270777 -209336 -174239 -155879 -187763 -193807 -180773 -201960 -184009 -177684
11691a77684k026L7950N12k4317n6725M055L92L1021N4981k1634J268k9699k1213
$$ -177684 -179710 -141760 -141248 -165565 -222290 -218235 -217843 -186822 -131841 -153475 -152207 -181906 -203119
11678b03119l1918L846L8229J6226K3892j5435j9162j8077K6271J4349k0137M942
$$ -203119 -235037 -231191 -192962 -176736 -152844 -168279 -187441 -205518 -179247 -164898 -185035 -180093
11666a80093N8866J6477l8768n1862L5634J7330m665M611q754o2118k2617L2516
$$ -180093 -121227 -104750 -143518 -195380 -159746 -142416 -147081 -142470 -151224 -213342 -235959 -203443
11654b03443j1620j6268L9113L2728r884j3482L4415k5567J7876N1585J1729k2036
$$ -203443 -215063 -231331 -192218 -159490 -169374 -182856 -148441 -174008 -156132 -104547 -92818 -114854
11642a14854l5278l147j6252J7132k330K0831J7570L6296L8316n4470n6075r917
$$ -114854 -150132 -153279 -169531 -152399 -154729 -133898 -116328 -80032 -41716 -96186 -152261 -162178
11630a62178j5510J9902J0904j2020k9014j0710K7553M5595J0286j2214o615k095
$$ -162178 -177688 -157786 -146882 -158902 -187916 -198626 -171073 -125478 -115192 -127406 -134021 -136116
11618a36116o328j1313Q538K81K5557L4196J2937M073j600j139o521J4494k2335
$$ -136116 -142444 -153757 -145219 -144938 -119381 -85185 -72248 -68175 -69775 -70914 -77435 -62941 -85276
11605h5276n0984j4413k208j4091J6322L8551L1213j44j8867l0867n560K6219
$$ -85276 -136260 -150673 -152881 -166972 -150650 -112099 -80886 -81030 -99897 -130764 -136324 -110105
11593a10105n263L0262M5507L8480L993m5446m4431k9366j5312K5064L258L0038
$$ -110105 -115368 -85106 -39599 -1119 2874 -42572 -87003 -116369 -131681 -106617 -103359 -73321
11581g3321j8167j5888j6475k0267L9470L4741N726m9813q19L7401L5287K82r86
$$ -73321 -91488 -107376 -123851 -144118 -104648 -69907 -64181 -113994 -114813 -77412 -42125 -41843 -42829
11568d2829j4505m6468k0658N964L6843M7892L4972k3726o0263k8040j0125j0148
$$ -42829 -57334 -103802 -124460 -118496 -81653 -33761 1211 -22515 -82778 -110818 -120943 -131091
11556a31091R43R21K8916J0441k6268j9572K3518K0799M1815L429L6403q201l3338
$$ -131091 -130148 -129227 -100311 -89870 -116138 -135710 -112192 -91393 -49578 -46149 -9746 -17947 -51285
11543e1285K439k548J0500j6881l7879l805K0684J5998K1750L0905K5170l547
$$ -51285 -48846 -51394 -40894 -57775 -95654 -99459 -78775 -62777 -41027 -10122 15048 11501
11531A1501K5809l5673j6217J4138l3536m9258Q021J1933J9881K2086l323L599
$$ 11501 37310 1637 -14580 -442 -33978 -83236 -75215 -63282 -43401 -21315 -24638 -21039
11519b1039J9937j5326k6335J2006J7723l4328l1307k0397l164J0900J1718L9822
$$ -21039 -1102 -16428 -42763 -30757 -13034 -47362 -78669 -99066 -102230 -91330 -79612 -39790
11507c9790K7824l3387K196l7049k9112N8866L0399K408j5206J0752J8322M461
$$ -39790 -11966 -45353 -43157 -80206 -109318 -50452 -20053 -17645 -32851 -22099 -3777 684
11495F84j0410K518l6895m635n146L7703L3556P706N812P997N087l750j2597L628
$$ 684 -9726 -7208 -44103 -48738 -53884 -16181 17375 25081 30893 38890 43977 40227 27630 31258
11481C1258L135j3746k9079K0910K4262Q96M945R343J005k2148J9006M3059J0958
$$ 31258 34393 20647 -8432 12478 36740 37636 42581 51924 52929 30781 49787 92846 103804
11468A03804k2696L0129K1688k3698m1183k3863j3375J5438K1930o467Q72k2303
$$ 103804 81108 111237 132925 109227 68044 44181 30806 46244 68174 61707 62579 40276
11456D0276Q504l0707j0009K0785N3472J0479j6658K0250j7877m3441k543M9877
$$ 40276 48780 18073 8064 28849 82321 92800 76142 96392 78515 35074 32531 82408
11444H2408m13k0460m6978k0865M4113N1338N4408j582l6859k1188o852R122L430
$$ 82408 81995 61535 14557 -6308 37805 89143 143551 141969 105110 83922 77070 86192 89622
11431H9622j6749j5879n638J3374K3662j0842R105J4753j6666j5464m5702j6018
$$ 89622 72873 56994 51356 64730 88392 77550 86655 101408 84742 69278 23576 7558
11419G558M4285L1793M0055K8103r736n236l4190l0604M687J3677k4951j3602
$$ 7558 51843 83636 123691 151794 142058 136822 102632 72028 76715 90392 65441 51839
11407E1839J5003K343o99M85J5806k4760j880R198j2370J7231M6479j4984m76
$$ 51839 66842 69185 68486 68971 84777 60017 58137 67335 54965 72196 118675 103691 103215
11394A03215J6312J8835o545j1991O362p433J9372L058j9757r629K3537k1021
$$ 103215 119527 138362 131817 119826 126188 118755 138127 141185 121428 111799 135336 114315
11382A14315k1715j0093L2700L6998N5313m2523n2947m2232k531L6772J3342M8154
$$ 114315 92600 82507 115207 152205 207518 164995 112048 69816 67285 104057 117399 165553
11370A65553N2833o209Q579L34l2864m2814o7640j4752R620L1509M651O593q051
$$ 165553 218386 212177 220756 221090 188226 145412 77772 63020 72640 104149 108800 115393 107342
11357A07342j53o759m0490O685P8313M6039q937l9884p191J7679k8093m486L2220
$$ 107342 107189 100430 59940 66625 144938 190977 182040 142156 134965 152644 124551 120065 152285
11344A52285q121l5716M5733M6723J4142l1208k1783k7024K6664o028M54l665
$$ 152285 144164 108448 154181 200904 215046 183838 162055 135031 161695 155667 156121 152456
11332A52456k8618K8846M2431m798J1755j0790O355M93Q593L5685k113k1827R931
$$ 152456 123838 152684 195115 190317 202072 191282 197637 198130 206723 242408 240295 218468 228399
11319B28399m4422O6289L7087j7558l3340k2634j1733L4569L9304K525J8286l257
$$ 228399 183977 250266 287353 269795 236455 213821 202088 236657 275961 278486 296772 293515
11307B93515l7328k8095l4900k9999J6428J7726J2535j0413R728K2087R348K1674
$$ 293515 256187 228092 193192 163193 179621 197347 209882 199469 209197 231284 240632 262306
11295B62306j5878r638J9521n152l9352J9574O16K428R512J7690K2397L3257k6630
$$ 262306 246428 236790 256311 251159 211807 231381 231997 234425 243937 261627 284024 317281 290651
11282B90651k2307k9197q875j8654m524M3961N9394L6451L0070J0684k7604m7387
$$ 290651 268344 239147 230272 211618 207094 251055 310449 346900 376970 387654 360050 312663
11270C12663n1432o8798j7899K8099M8949M2049J227j1886J0849N61j7584l9231
$$ 312663 261231 192433 174534 202633 251582 293631 294858 282972 293821 294382 276798 237567
11258B37567K5377J4707J4603M0622j146k4776J5318M6253r351j1522m9269j6914
$$ 237567 262944 277651 292254 332876 331730 306954 322272 368525 359174 347652 298383 281469
11246B81469L438J541J2206J5147K1798m5829j4276J2634J5010k0760L1500K4478
$$ 281469 284907 286448 298654 313801 335599 289770 275494 288128 303138 282378 313878 338356
11234C38356j3263k5695l262n440k7272j8866j1358L7535M1297L2339L9743o077
$$ 338356 325093 299398 296136 290696 263424 244558 233200 270735 312032 344371 384114 378037
11222C78037k6592N5053K595l5600k3542L671L4960Q495j5368k8054k4891k0893
$$ 378037 351445 406498 409093 373493 349951 353622 388582 397077 381709 353655 328764 307871
11210C07871j5976k5882L0543N3144L9544p045J6022Q985k1349m1614l3285o59
$$ 307871 291895 266013 296556 349700 389244 382199 398221 407206 385857 344243 310958 310299
11198C10299J1277K3185J6251J9042N79k0352K8418J7422j1834j5570L9601L2215
$$ 310299 321576 344761 361012 380054 380633 360281 388699 406121 394287 378717 418318 450533
11186D50533j9917j0450o3117l2799R370L8271L3044k1271m4083r523J9885K9808
$$ 450533 430616 420166 357049 324250 333620 371891 404935 383664 339581 330058 349943 379751
11174C79751J7819j0779j1505J9498l838k1577P902J223J1145Q723O108j854k4455
$$ 379751 397570 386791 375286 394784 390946 369369 377271 378494 389639 398362 404470 402616 378161
11161C78161n9336J7335o169J554P882j4828R951K1559j808k3123K0121K6135
$$ 378161 318825 336160 329991 331545 339427 324599 334550 356109 354301 331178 351299 377434
11149C77434o396N369K2816P896l9238k1640K1558O1052m165p716N971j1521R945
$$ 377434 371038 376407 399223 407119 367881 346241 367799 428851 424686 416970 422941 411420 421365
11136D21365L4933K8179J1680j2833o690K1210K1105p147o389k2207j0216Q467
$$ 421365 456298 484477 496157 483324 476634 497844 518949 511802 505413 483206 472990 481457
11124D81457N0240j1494l061l5995N058J8254O723k8262N550J7369M0072K4152
$$ 481457 531697 520203 517142 481147 486205 504459 511182 482920 488470 505839 545911 570063
11112E70063l4241k8721J0206P776j1417P920L7236k2150J4361L7538k260r491
$$ 570063 535822 507101 517307 525083 513666 521586 558822 536672 551033 588571 586311 576820
11100E76820k2017K606L8922K8669r654Q693j7651o6892m308N1323M8242k2345
$$ 576820 554803 557409 596331 625000 615346 624039 606388 539496 535188 586511 634753 612408
11088F12408k6150L8850L537n4420l0799n90K4264r31O604K5212p060l5725j0815
$$ 612408 586258 625108 628645 574225 543426 542836 567100 566169 572773 597985 590925 555200 544385
11075E44385r625J1623j4587j3615J6231K2055N7240M6942l4487k6569l053l372
$$ 544385 534760 546383 531796 518181 534412 556467 613707 660649 626162 599593 596540 593168
11063E93168K5852P031j4570L6848K2485j7435m3202n2195P573L1486L7013J444
$$ 593168 619020 626051 611481 648329 670814 653379 610177 557982 565555 597041 634054 635498
11051F35498k300j1296l1884P632K6370m820o842m5603j9445L5437m239K3621
$$ 635498 633198 621902 590018 597650 624020 619200 612358 566755 547310 582747 578508 602129
11039F02129K4275l4966j8980J8762L6526N3140J4074k8232k504J6843J9410n269
$$ 602129 626404 591438 572458 591220 627746 680886 694960 666728 664224 681067 700477 695208
11027F95208k1978L4890L6362J910j8821O262l0081j6630j214j7621j9387L5949
$$ 695208 673230 708120 744482 746392 727571 733833 703752 687122 685908 668287 648900 684849
11015F84849Q47J0159j1800J4570K7805j8427o8360l1607M3905M4713K401L3215
$$ 684849 685696 695855 684055 698625 726430 708003 639643 608036 651941 696654 699055 732270
11003G32270J8887k0292k5085n376N0016K6106n2432l2365j7610l6487L8749M3588
$$ 732270 751157 730865 705780 700404 750420 776526 724094 691729 674119 637632 676381 719969
10991G19969J2315K5448l882K4867j9616j0633P976k2322M3976M1683l5584j8188
$$ 719969 732284 757732 753850 778717 759101 748468 756444 734122 778098 819781 784197 766009
10979G66009K8929M318k1907J3400N107K2206K4447q061M92k530m5311j9966K9041
$$ 766009 794938 799256 777349 790749 795856 818062 842509 834448 834940 832410 787099 767133 796174
10966G96174R240k645l1387j1911J501L2584N9959J3108n6420k3316l057N3334
$$ 796174 805414 802769 771382 759471 760972 793556 853515 866623 810203 786887 783830 837164
10954H37164n5792n6065J0100J2723J983M9520R5207k6659l6242m708n289L1738
$$ 837164 781372 725307 735407 748130 750113 799633 894840 868181 831939 827231 821942 853680
10942H53680J8442K2130j2550j8761K1433Q993R007K2944L8540k3455o933L3092
$$ 853680 872122 894252 881702 862941 884374 893367 902374 925318 963858 940403 933470 966562
10930I66562M4124J8744n3048o1945k3714k9104L2898M4543J7830K216l6223j8571
$$ 966562 1010686 1029430 976382 914437 890723 861619 894517 939060 956890 959106 922883 904312
10918I04312J0436N4253L2206k0193M934k3258K0787k1582k0712l7024k8217Q28
$$ 904312 914748 969001 1001207 981014 985948 962690 983477 961895 941183 904159 875942 876770
10906H76770M2615L2265K6692J3111J6487J6126J7429J3472k2358l8793j3793
$$ 876770 919385 951650 978342 991453 1007940 1024066 1041495 1054967 1032609 993816 980023
10895I80023J1059n078L263K1319k21j9187q285j8091M9263L2434K5124m2311
$$ 980023 991082 986004 989267 1010586 1010365 991178 982893 964802 1014065 1046499 1071623 1029312
10883A029312l0921J0596L2585K9646j9306r481q95N0421J5362o279l5031J5634
$$ 1029312 998391 1008987 1041572 1071218 1051912 1042431 1041536 1091957 1107319 1101040 1066009 1081643
10871A081643K6461O57j1302m658J3251L3501N065l66L6048j3088j1164Q217m4642
$$ 1081643 1108104 1108761 1097459 1092801 1106052 1139553 1144618 1144252 1180300 1167212 1156048 1164265 1119623
10858A119623L42M3837n221l979k5122q940L6987L769m0709k44J6207K5385J7700
$$ 1119623 1119965 1163802 1158581 1154602 1129480 1120540 1157527 1161296 1120587 1120343 1136550 1161935 1179635
10845A179635O110J3867K0110K6013Q51j3641J7465k4187m1806k9426J9488J554
$$ 1179635 1185745 1199612 1219722 1245735 1246586 1232945 1250410 1226223 1184417 1154991 1174479 1176033
10833A176033J600K3588J9243N6640k732N364j8449L5747K6227K8211J6060k0021
$$ 1176033 1177633 1201221 1220464 1277104 1274372 1279736 1261287 1297034 1323261 1351472 1367532 1347511
10821A347511j5174l3531K6289J2906j2228L504Q467j4939k1601Q290q728n122
$$ 1347511 1332337 1298806 1325095 1338001 1325773 1329277 1337744 1322805 1301204 1309494 1300766 1295644
10809A295644J5326M9933K6871k818j7801J3058K9963M1043l8683j1951K7421
$$ 1295644 1310970 1360903 1387774 1384956 1367155 1380213 1410176 1451219 1412536 1400585 1428006
10798A428006P054J5576j2622K550j206J3317J8691l850r799j8095L5759J3130
$$ 1428006 1435060 1450636 1438014 1440564 1439358 1452675 1471366 1467516 1457717 1439622 1475381 1488511
10786A488511L1852L4393J4625L4974K2298j5708K6386J8860L939r419K0716K6905
$$ 1488511 1520363 1554756 1569381 1604355 1626653 1610945 1637331 1656191 1660130 1650711 1671427 1698332
10774A698332l5552k1406M8714N7201J3529N4622N4562M5640L2024J334J01280
$$ 1698332 1662780 1641374 1690088 1747289 1760818 1815440 1870002 1915642 1947666 1949000 2050280
10763B050280J03669J07769J06966J10173m5169m64362p73289n03695j13279O1899
$$ 2050280 2153949 2261718 2368684 2478857 2433688 1969326 1196037 692342 579063 640962
10753F40962J12653R2619Q5057N1969l398N7048P2617L1046M8306P6448M8954
$$ 640962 753615 846234 931291 983260 979862 1036910 1109527 1140573 1188879 1265327 1314281
10742A314281K6185J9055j239N4592q436o1506K6801O2724K6436K069K3703M5983
$$ 1314281 1340466 1359521 1358282 1412874 1404438 1342932 1369733 1432457 1458893 1460962 1484665 1530648
10730A530648q582n030m999N459N8867K9301J0429N0118P753Q459l8143l6613
$$ 1530648 1522066 1517036 1512037 1517496 1576363 1605664 1616093 1666211 1673964 1682423 1644280 1607667
10718A607667j6776Q023N7812J4990j3902j8440j5658J1738n054O892p068K5213
$$ 1607667 1590891 1598914 1656726 1671716 1657814 1639374 1623716 1635454 1630400 1637292 1630224 1655437
10706A655437N4306L0018K925k6155l1369j305M5569K6768M6167M5225J3819k9848
$$ 1655437 1709743 1739761 1742686 1716531 1685162 1683857 1729426 1756194 1802361 1847586 1861405 1831557
10694A831557o109K2569J7587J2394l4453J756K7344M4989K8501K2919k3931O318
$$ 1831557 1825448 1848017 1865604 1877998 1843545 1845301 1872645 1917634 1946135 1969054 1945123 1951441
10682A951441o96P612j4847K8841L9022M5041L8031j9703L799J1216k6974k4276
$$ 1951441 1950745 1958357 1943510 1972351 2011373 2056414 2094445 2074742 2078541 2089757 2062783 2038507
10670B038507O40J3842N9847K1280j7200J6401j2016o0504q644K6549J9348j6319
$$ 2038507 2039147 2052989 2112836 2134116 2116916 2133317 2121301 2060797 2052153 2078702 2098050 2081731
10658B081731j1351K9663N1075M5461J6699n731k1760k3841L4384N3579K8067
$$ 2081731 2070380 2100043 2151118 2196579 2213278 2207547 2185787 2161946 2196330 2249909 2277976
10647B277976o682J653J1798q196K3860J3097M3106J6164l9528l052l438R632
$$ 2277976 2271294 2272947 2284745 2276549 2300409 2313506 2356612 2372776 2333248 2330196 2326758 2336390
10635B336390o321p779L8400N0647Q038l8868M775k3257L9484Q7891L4617J71
$$ 2336390 2330069 2322290 2360690 2411337 2419375 2380507 2385282 2362025 2401509 2489400 2524017 2524188
10623B524188P326r693K0705R843L2479N0837j03j63L1782L4047J8524k3097M3040
$$ 2524188 2531514 2521821 2542526 2552369 2584848 2635685 2635582 2635419 2667201 2701248 2719772 2696675 2739715
10610B739715K1477m0369j3147J8651J7597o9806n4983n617L474N0966K6793O7705
$$ 2739715 2761192 2720823 2707676 2726327 2743924 2674118 2619135 2613518 2616992 2667958 2694751 2762456
10598B762456K6404j7996J3060K3792O6489K567L87J1138J1456M2353K955j3881
$$ 2762456 2788860 2770864 2783924 2807716 2874205 2876772 2877159 2888297 2899753 2942106 2945061 2931180
10586B931180M8572K5282k7675l6943M3811J3397L4603K5283M1215K4064N4872
$$ 2931180 2979752 3005034 2977359 2940416 2984227 2997624 3032227 3057510 3098725 3122789 3177661
10575C177661L0782N147L0510L9909k1179k9585J6761J393K0702K1812L3863L2161
$$ 3177661 3208443 3213590 3244100 3284009 3262830 3233245 3250006 3251399 3272101 3293913 3327776 3359937
10563C359937L9842O4743l64k6899K9857M3965j5294J2761J1857N0974J0891R00
$$ 3359937 3399779 3464522 3464158 3437259 3467116 3511081 3495787 3508548 3520405 3571379 3582270 3583170
10551C583170M3637N491l5991j81M3507N1220K4381K9066O8399L8570M9509J2791
$$ 3583170 3626807 3632298 3596307 3596126 3639633 3690853 3715234 3744300 3812699 3851269 3900778 3913569
10539C913569j6046k0839M0843N1874L4782j860J5636M0483J7293K6214R6134
$$ 3913569 3897523 3876684 3917527 3969401 4004183 4002323 4017959 4058442 4075735 4101949 4198083
10528D198083O0111m3124k9174K6010R4620M8657P0014N424O789N7827K3746L0867
$$ 4198083 4258194 4215070 4185896 4211906 4306526 4355183 4425197 4430621 4437410 4495237 4518983 4549850
10516D549850O497L8036N0265L6793L8479M7706N1400K5302k3375J459O5843N5556
$$ 4549850 4556347 4594383 4644648 4681441 4719920 4767626 4819026 4844328 4820953 4822412 4888255 4943811
10504D943811Q5557K4701O705K2445K4015M7229N2601M0264N4334N3069L5593
$$ 4943811 5029368 5054069 5060774 5083219 5107234 5154463 5207064 5247328 5301662 5354731 5390324
10493E390324O5803Q8932O8420L6681M6177O2391N4510O0513P3316Q9566J04178
$$ 5390324 5456127 5545059 5613479 5650160 5696337 5758728 5813238 5873751 5947067 6036633 6140811
10482F140811J02278L3689j08448q3627J3918Q9040R1795R1291J24635J76444
$$ 6140811 6243089 6276778 6168330 6084703 6098621 6187661 6279456 6370747 6495382 6671826
10472F671826J05655R1960P6081M1355j78388l34426j78732J04539J92402J08714
$$ 6671826 6777481 6869441 6945522 6986877 6808489 6474063 6295331 6399870 6592272 6700986
10462F700986J60246J34126J01566k6108k34124k06824n400J00224J56508J42671
$$ 6700986 6861232 6995358 7096924 7070816 6836692 6629868 6624468 6724692 6881200 7023871
10452G023871J38873J35708J14605R0366J25498J21221P4813Q5303R3701J23366
$$ 7023871 7162744 7298452 7413057 7503423 7628921 7750142 7824955 7910258 8003959 8127325
10442H127325J27567J17309J35964J77818J12611L3664O3808J22937J28168J43359
$$ 8127325 8254892 8372201 8508165 8685983 8798594 8832258 8896066 9019003 9147171 9290530
10432I290530J92996R7135J32034J47826J38179J34290J30727J65931J69172J44455
$$ 9290530 9483526 9580661 9712695 9860521 9998700 10132990 10263717 10429648 10598820 10743275
10422A0743275J98056J67413J44028K05431K04617K07495J74960J86787K05376
$$ 10743275 10941331 11108744 11252772 11458203 11662820 11870315 12045275 12232062 12437438
10413A2437438J61070J94570K44927L17524K99712K56011K92432K84001L12164
$$ 12437438 12598508 12793078 13038005 13355529 13655241 13911252 14203684 14487685 14799849
10404A4799849L35200L57427L20418L36101K83435K89951L84240L64875L88398
$$ 14799849 15135049 15492476 15812894 16148995 16432430 16722381 17106621 17471496 17859894
10395A7859894L97251M83232N62856N78305N80424N73727N46293N61940O43629
$$ 17859894 18257145 18740377 19303233 19881538 20461962 21035689 21581982 22143922 22787551
10386B2787551P16354P17240P99753Q59953R58370J038690J062859J150487J283451
$$ 22787551 23503905 24221145 25020898 25880851 26839221 27877911 28940770 30091257 31374708
10377C1374708J346241J304826R39470O87310J153219J852674K307551K603511
$$ 31374708 32720949 34025775 34965245 35652555 36805774 38658448 40965999 43569510
10369D3569510K815032L107399L453405L911502M386806N111979O022053P155320
$$ 43569510 46384542 49491941 52945346 56856848 61243654 66355633 72377686 79533006
10361G9533006Q547400J0309802J2844044J6295514K0107055K2770350J7656396
$$ 79533006 88080406 98390208 111234252 127529766 147636821 170407171 188063567
10354A88063567j3978419r2852235j51662959r6792133j3597756J8697568K1268695
$$ 188063567 174085148 81232913 -70430046 -167222179 -180819935 -162122367 -140853672
10347a40853672J7548833J4041359J1380404R321201P972064O857769N897778
$$ -140853672 -123304839 -109263480 -97883076 -88561875 -80589811 -73732042 -67834264
10340f7834264N077955M367728L763983L304599K924073K570154K311923K148817
$$ -67834264 -62756309 -58388581 -54624598 -51319999 -48395926 -45825772 -43513849 -41365032
10332d1365032K095200J925575J515374Q41526O34940R60181J223233J203511
$$ -41365032 -39269832 -37344257 -35828883 -34987357 -34352417 -33392236 -32169003 -30965492
10324c0965492J176598J090845R93358R32500Q82063Q22270P75666P15210O62054
$$ -30965492 -29788894 -28698049 -27704691 -26772191 -25890128 -25067858 -24292192 -23576982 -22914928
10315b2914928O51519N68942N17254M81379M32265M51862M81051M98602M48005
$$ -22914928 -22263409 -21694467 -21177213 -20695834 -20263569 -19811707 -19330656 -18832054 -18384049
10306a8384049M41493M01732L81506L38086L28314L20519K75362K48653K69223
$$ -18384049 -17942556 -17540824 -17159318 -16821232 -16492918 -16172399 -15897037 -15648384 -15379161
10297a5379161K78735K67000J93968J97311K53903K14570K22755K31382K18156
$$ -15379161 -15100426 -14833426 -14639458 -14442147 -14188244 -13973674 -13750919 -13519537 -13301381
10288a3301381K29080K02419J69308J87299J72888J51102J93137J65921J46316
$$ -13301381 -13072301 -12869882 -12700574 -12513275 -12340387 -12189285 -11996148 -11830227 -11683911
10279a1683911J46161J89069J47820Q6182J32921J35931J15210J24957J58424
$$ -11683911 -11537750 -11348681 -11200861 -11114679 -10981758 -10845827 -10730617 -10605660 -10447236
10270a0447236J14619P7643J35342J59658J54043J18569R8184P5009Q6725R3344
$$ -10447236 -10332617 -10254974 -10119632 -9959974 -9805931 -9687362 -9589178 -9514169 -9427444 -9334100
10260i334100P1517J08621J03117Q8464R3127J09271J02253R3796J18410Q5899
$$ -9334100 -9262583 -9153962 -9050845 -8962381 -8869254 -8759983 -8657730 -8563934 -8445524 -8359625
10250h359625N3454M7275J16249J18561O8949L8009O4384O8168J05651J3737L0541
$$ -8359625 -8306171 -8258896 -8142647 -8024086 -7955137 -7917128 -7852744 -7784576 -7678925 -7665188 -7634647
10239g634647P8261P7454K8275O3282P7314R9868N7092L7711O2858M0433M6723
$$ -7634647 -7556386 -7478932 -7450657 -7387375 -7310061 -7210193 -7153101 -7115390 -7052532 -7012099 -6965376
10228f965376L7373P7105M1746L6987N8445P9685L9482J6067M7228M4514K0813
$$ -6965376 -6928003 -6850898 -6809152 -6772165 -6713720 -6634035 -6594553 -6578486 -6531258 -6486744 -6465931
10217f465931N7347P0550L1586P0895P7103L8349M2942N3879O2799J6550j2972
$$ -6465931 -6408584 -6338034 -6306448 -6235553 -6158450 -6120101 -6077159 -6023280 -5960481 -5943931 -5956903
10206e956903J5624K7919O2619M1776L3827K4015O9046N2925J7580P1803P6267
$$ -5956903 -5941279 -5913360 -5850741 -5808965 -5775138 -5751123 -5682077 -5629152 -5611572 -5539769 -5463502
10195e463502K1083K9426N9449M0687N3045P6583o064K6038J2046m3965l7246
$$ -5463502 -5442419 -5412993 -5353544 -5312857 -5259812 -5183229 -5189293 -5163255 -5151209 -5195174 -5232420
10184e232420k4264p997L6908N1051K316N54P329K4836N4889O6766K437N2792
$$ -5232420 -5256684 -5264681 -5227773 -5176722 -5174406 -5173852 -5166523 -5141687 -5086798 -5020032 -5017595 -4964803
10172d964803J6734n1944L7309K8975M5112Q4365Q370M0920Q0022Q2060j4963
$$ -4964803 -4948069 -5000013 -4962704 -4933729 -4888617 -4804252 -4795882 -4754962 -4674940 -4592880 -4607843
10161d607843k902O649J7827j5697m4881l3252l83O6942J06462N6569J6292R651
$$ -4607843 -4610745 -4604096 -4586269 -4601966 -4646847 -4680099 -4680482 -4613540 -4507078 -4450509 -4434217 -4424566
10149d424566k0458r064L5217P3315K8196J0122N0819N3317o108N181R406J495
$$ -4424566 -4445024 -4454088 -4418871 -4345556 -4317360 -4307238 -4256419 -4203102 -4209210 -4204029 -4194623 -4193128
10137d193128K7909J9299L5616k3454J7863K1043L3963N1460p863J4219M5218
$$ -4193128 -4165219 -4145920 -4110304 -4133758 -4115895 -4094852 -4060889 -4009429 -4017292 -4003073 -3957855
10126c957855N0637k9594k3297p622L2630N1445o085m208n06J8986L2591M2534
$$ -3957855 -3907218 -3936812 -3960109 -3967731 -3935101 -3883656 -3889741 -3893949 -3894455 -3875469 -3842878 -3800344
10114c800344N894o698J0611K9430K8369M0456K2273J547R599J223N401L4537
$$ -3800344 -3794450 -3801148 -3790537 -3761107 -3732738 -3692282 -3670009 -3668462 -3658863 -3657640 -3652239 -3617702
10102c617702K0674k024l6834J8301O6316k742l6198o689N974K8881N065J1538
$$ -3617702 -3597028 -3599052 -3635886 -3617585 -3551269 -3554011 -3590209 -3596898 -3590924 -3562043 -3556978 -3545440
10090c545440L7738L2412K4427N8753M5542n631k0808j989J6516j0107k5062J9845
$$ -3545440 -3507702 -3475290 -3450863 -3392110 -3346568 -3352199 -3373007 -3374996 -3358480 -3368587 -3393649 -3373804
10078c373804J9191L7915L7907J259k4591R48L0246K3774j5827k0996O8239N8572
$$ -3373804 -3354613 -3316698 -3278791 -3277532 -3302123 -3301175 -3270929 -3247155 -3262982 -3283978 -3215739 -3157167
10066c157167J69K5758J0042N3246n284j5791l4759m8160K5942k5744j9002K6126
$$ -3157167 -3156998 -3131240 -3121198 -3067952 -3073236 -3089027 -3123786 -3171946 -3146004 -3171748 -3190750 -3164624
10054c164624M6050m471J1201M9606K7859K7557J4926m2248k9685K0211L4577
$$ -3164624 -3118574 -3123045 -3111844 -3062238 -3034379 -3006822 -2991896 -3034144 -3063829 -3043618 -3009041
10043c009041K0564J7870K366R014L6515K7649M7675r954m7706l0347N8446M3235
$$ -3009041 -2988477 -2970607 -2968241 -2959227 -2922712 -2895063 -2847388 -2857342 -2905048 -2935395 -2876949 -2833714
10031b833714L8174L1144j5667L530L514k5704k8821K3784J1401j6824J5094J4477
$$ -2833714 -2795540 -2764396 -2780063 -2776533 -2773019 -2798723 -2827544 -2803760 -2792359 -2809183 -2794089 -2779612
10019b779612N5016O2407j4087k0260K6605m654m1250j4525O0169J5384k1620
$$ -2779612 -2724596 -2662189 -2676276 -2696536 -2669931 -2674585 -2715835 -2730360 -2670191 -2654807 -2676427
10008b676427O1815j4831j3732k304M8903N5528k4861l8837m458L3727L8221K573
$$ -2676427 -2614612 -2629443 -2643175 -2645479 -2596576 -2541048 -2565909 -2604746 -2609204 -2575477 -2537256 -2534683
9996b534683r357k5017k1662M8964L1701j6934J4796p055N072J5595K651J4685
$$ -2534683 -2544040 -2569057 -2590719 -2541755 -2510054 -2526988 -2512192 -2519247 -2514175 -2498580 -2495929 -2481244
9984b481244J9765J6986R62L5636J1748n1260R445O9732K4451J9521l5686m987
$$ -2481244 -2461479 -2444493 -2443531 -2407895 -2396147 -2447407 -2437962 -2368230 -2343779 -2324258 -2359944 -2364931
9972b364931J5486J7880K3901K7939k2951j3176J9450K8490K408K3929q970r387
$$ -2364931 -2349445 -2331565 -2307664 -2279725 -2302676 -2315852 -2296402 -2267912 -2265504 -2241575 -2250545 -2259932
9960b259932K6921K9921J3563K428M6660N7973Q0669J2836l1052K1844N7203N7649
$$ -2259932 -2233011 -2203090 -2189527 -2187099 -2140439 -2082466 -2001797 -1988961 -2020013 -1998169 -1940966 -1883317
9948a883317R5099J52046J48556J45579O562l13300o99544o46431k37849J6597
$$ -1883317 -1788218 -1636172 -1487616 -1342037 -1335475 -1648775 -2348319 -2994750 -3232599 -3216002
9938c216002R9912Q9297J06886R1327N2998Q6009O8632J885l813L4854P2526J8503
$$ -3216002 -3116090 -3026793 -2919907 -2828580 -2775582 -2689573 -2620941 -2619056 -2622869 -2588015 -2515489 -2496986
9926b496986J5233o344J1292K0162l634j9079L2824L2001M9229j7914q62L7432
$$ -2496986 -2481753 -2488097 -2476805 -2456643 -2460277 -2479356 -2446532 -2414531 -2365302 -2383216 -2384078 -2346646
9914b346646K527K4501j0522P620p953J9045l857L4459J5072M2110L9247l360
$$ -2346646 -2344119 -2319618 -2330140 -2322520 -2330473 -2311428 -2315285 -2280826 -2265754 -2223644 -2184397 -2187757
9902b187757n9372M534M1117L6306M5277n37j9242m999J2023l194m6845k8660
$$ -2187757 -2247129 -2242595 -2201478 -2165172 -2119895 -2120432 -2139674 -2144673 -2132650 -2135844 -2182689 -2211349
9890b211349K6884L1728K6513m3274k7008J8345L430j5449K6239M4968J9161r231
$$ -2211349 -2184465 -2152737 -2126224 -2169498 -2196506 -2178161 -2174731 -2190180 -2163941 -2118973 -2099812 -2109043
9878b109043o4145J4027N1462j4190j7380J9310N4620P174K9633J5044m4608k9115
$$ -2109043 -2173188 -2159161 -2107699 -2121889 -2139269 -2119959 -2065339 -2058165 -2028532 -2013488 -2058096 -2087211
9866b087211J4401R273L279J5990M2273J0413Q131N6341M5093k5244m7724K1143
$$ -2087211 -2072810 -2063537 -2060258 -2044268 -2001995 -1991582 -1983451 -1927110 -1882017 -1907261 -1954985 -1933842
9854a933842k2872m9920l2715J4500K3796J6450M314n512k0230M8948O5091N7748
$$ -1933842 -1956714 -2006634 -2039349 -2024849 -2001053 -1984603 -1980289 -1985801 -2006031 -1957083 -1891992 -1834244
9842a834244m649k7491j2587J6048J4378k9485m0477q842r564J6630M4612J7740
$$ -1834244 -1838893 -1866384 -1878971 -1862923 -1848545 -1878030 -1918507 -1927349 -1936913 -1920283 -1875671 -1857931
9830a857931q079l0723o694n4071l9669N4621N7097M7814J4803j5690p908m3457
$$ -1857931 -1866010 -1896733 -1903427 -1957498 -1997167 -1942546 -1885449 -1837635 -1822832 -1838522 -1846430 -1889887
9818a889887l643L0170M1953j8120k809K0285j482M9439K3872K8123r802k5511
$$ -1889887 -1893530 -1863360 -1821407 -1839527 -1842336 -1822051 -1823533 -1774094 -1750222 -1722099 -1731901 -1757412
9806a757412J7808l5006j9017q557L5004J3970j6548k3665l3634m12n073P976
$$ -1757412 -1739604 -1774610 -1793627 -1802184 -1767180 -1753210 -1769758 -1793423 -1827057 -1827469 -1832542 -1824566
9794a824566J5442J7659K4873Q830m640L4272k618k8447n0915M917O4866K4947
$$ -1824566 -1809124 -1791465 -1766592 -1757762 -1762402 -1728130 -1730748 -1759195 -1810110 -1805193 -1740327 -1715380
9782a715380L287K4092J2843m4225m1186K5638l752R666O178m927M2855K043K7219
$$ -1715380 -1712093 -1688001 -1675158 -1719383 -1760569 -1734931 -1738683 -1729017 -1722839 -1727766 -1684911 -1682868 -1655649
9769a655649M4442L95o1079j9682n468j4142j2737J3732K6687N5318L7662J864
$$ -1655649 -1611207 -1610812 -1671891 -1691573 -1697041 -1711183 -1723920 -1710188 -1683501 -1628183 -1590521 -1588657
9757a588657J1646K623l8791K8017k3767j8121K1810J6778M6354j384K353O416
$$ -1588657 -1577011 -1574388 -1613179 -1585162 -1608929 -1627050 -1605240 -1588462 -1542108 -1543492 -1541139 -1534723
9745a534723k1077l5440l5541M947J4533q74N57L3292N840L1870m240L819L3922
$$ -1534723 -1555800 -1591240 -1626781 -1621834 -1607301 -1608175 -1607618 -1574326 -1568486 -1536616 -1540856 -1537037 -1503115
9732a503115m641n0195J557M8084J4441q601j6896J6169p478j639k7375n1613
$$ -1503115 -1507756 -1557951 -1556394 -1508310 -1493869 -1502470 -1519366 -1503197 -1510675 -1512314 -1539689 -1591302
9720a591302K0416L3319J0295K8690J1586N333K2022M9495J7365k2898o55J3002
$$ -1591302 -1570886 -1537567 -1527272 -1498582 -1486996 -1481663 -1459641 -1410146 -1392781 -1415679 -1416334 -1403332
9708a403332R4l4115Q10J2273M3784j0958l6237o2500L9593M7645K2480k1576
$$ -1403332 -1403238 -1437353 -1436543 -1424270 -1380486 -1391444 -1427681 -1490181 -1450588 -1402943 -1380463 -1402039
9696a402039l3954N354k6372K7201M7753K5926p960k861J5314L3575j0683k8996
$$ -1402039 -1435993 -1430639 -1457011 -1429810 -1382057 -1356131 -1364091 -1366952 -1351638 -1318063 -1328746 -1357742
9684a357742J260j5649L4834M4147K8008o0898j7533L3648L5432J4886m5804l1334
$$ -1357742 -1356482 -1372131 -1337297 -1293150 -1265142 -1326040 -1343573 -1309925 -1274493 -1259607 -1305411 -1336745
9672a336745K9253j7272L0509J5018J2376l0991l972J8212J2662j6912L019l9522
$$ -1336745 -1307492 -1324764 -1294255 -1279237 -1266861 -1297852 -1301824 -1283612 -1270950 -1287862 -1284843 -1324365
9660a324365j0995P925L5421M380K7295L3520m2716l2185J9845j2831j3882k2175
$$ -1324365 -1335360 -1327435 -1292014 -1287634 -1260339 -1226819 -1269535 -1301720 -1281875 -1294706 -1308588 -1330763
9648a330763L7305R412K7549M9656O882K3908m080K7314L3921O605n0549k755
$$ -1330763 -1293458 -1284046 -1256497 -1206841 -1199959 -1176051 -1180131 -1152817 -1118896 -1112291 -1162840 -1165595
9636a165595j8379L7626L5093j4573p39J8606R425j6782m1498k8336l1107J7116
$$ -1165595 -1183974 -1146348 -1111255 -1125828 -1126567 -1107961 -1098536 -1115318 -1156816 -1185152 -1216259 -1199143
9624a199143N5748L7249k0775k0664m354o416O190m0084O14N622L8869J2477j8664
$$ -1199143 -1143395 -1106146 -1126921 -1147585 -1151939 -1158355 -1152165 -1192249 -1191635 -1186013 -1147144 -1134667 -1153331
9611a153331j6755M2010M2601L6663k4723l6630k2412K7365M1108L6627M3109
$$ -1153331 -1170086 -1128076 -1085475 -1048812 -1073535 -1110165 -1132577 -1105212 -1064104 -1027477 -984368
9600i84368J8002j2117n0133k6360K136J014K2026j639k747j2032J0919M9066
$$ -984368 -966366 -978483 -1028616 -1054976 -1052840 -1051826 -1029800 -1031439 -1034186 -1046218 -1035299 -986233
9588i86233L1708j4195n6344n362k1299j5597N9525L8441m155K296j6098J3167
$$ -986233 -954525 -968720 -1025064 -1030426 -1051725 -1067322 -1007797 -969356 -973511 -971215 -987313 -974146
9576i74146M3546J4445k4255l7120j3205L9658P729J474K1113l357M0179J2938
$$ -974146 -930600 -916155 -940410 -977530 -990735 -951077 -943348 -941874 -920761 -924118 -883939 -871001
9564h71001q322j104K4516m7235m477J3514K2858l8326j9899K0008p178j4554
$$ -871001 -879323 -880427 -855911 -903146 -907623 -894109 -871251 -909577 -929476 -909468 -916646 -931200
9552i31200j9075M554J0145K3541J0281r102k1298J5Q5877j2934o7192j4619l4155
$$ -931200 -950275 -945721 -935576 -912035 -901754 -910856 -932154 -932139 -846262 -859196 -926388 -941007 -975162
9539i75162M258K7361K0251n1065q0798n1926L859j0943l7980n677k1874m0124
$$ -975162 -970904 -943543 -923292 -974357 -1055155 -1107081 -1103222 -1114165 -1152145 -1157822 -1179696 -1219820
9527a219820j2123j9935j1008o6284l8427j3438m692m7070K471k8189j0607j7159
$$ -1219820 -1231943 -1251878 -1262886 -1329170 -1367597 -1381035 -1385727 -1432797 -1430326 -1458515 -1469122 -1486281
9515a486281k9362o828J4224J653j4301o319n9071n4805m2377n4418l3861J4188
$$ -1486281 -1515643 -1522471 -1508247 -1506594 -1520895 -1527214 -1586285 -1641090 -1683467 -1737885 -1771746 -1757558
9503a757558l6540m388Q690j2958q062K5688m9356p4996j484N0758M1253K6098
$$ -1757558 -1794098 -1798486 -1789796 -1802754 -1810816 -1785128 -1834484 -1909480 -1910964 -1860206 -1818953 -1792855
9491a792855q01n4827O247j9702O228j0740o268j7127J2670p490l4075R841j3296
$$ -1792855 -1793656 -1848483 -1842236 -1861938 -1855710 -1866450 -1872718 -1889845 -1877175 -1884665 -1918740 -1908899 -1922195
9478a922195m7772Q849m259n0561M176M2473J2636L5409j2733p802P662k6205
$$ -1922195 -1969967 -1961118 -1965377 -2015938 -2011762 -1969289 -1956653 -1921244 -1933977 -1941779 -1934117 -1960322
9466a960322K998N4200K3699J9553j6910l0353R182K9768l5323M8357J1457j7731
$$ -1960322 -1957324 -1903124 -1879425 -1859872 -1876782 -1907135 -1897953 -1868185 -1903508 -1855151 -1843694 -1861425
9454a861425J5962J1106J860q349k993J1642N0108J780k2802J4611j6741J9136
$$ -1861425 -1845463 -1834357 -1832497 -1840846 -1843839 -1832197 -1782089 -1780309 -1803111 -1788500 -1805241 -1786105
9442a786105K2067J1709m4015m2474O141K6764j1738k1618m003N0289j0807k0765
$$ -1786105 -1764038 -1752329 -1796344 -1838818 -1832677 -1805913 -1817651 -1839269 -1843272 -1792983 -1803790 -1824555
9430a824555J4713L5454K6239p753L8278j0403j634o104L0385L4871m9511j4293
$$ -1824555 -1809842 -1774388 -1748149 -1755902 -1717624 -1728027 -1729661 -1735765 -1705380 -1670509 -1720020 -1734313
9418a734313k1608K3946K8885P536j7094j6449q873K2843J752j7627K2739K2806
$$ -1734313 -1755921 -1731975 -1703090 -1695554 -1712648 -1729097 -1737970 -1715127 -1713375 -1731002 -1708263 -1685457
9406a685457P278L4715J5460M231m2157J0648L5586k1359Q553j0156J014O9258
$$ -1685457 -1678179 -1643464 -1628004 -1623773 -1665930 -1655282 -1619696 -1641055 -1632502 -1642658 -1641644 -1572386
9394a572386J1479m023K243k4941j3201J4017L169J0135j8563L2576M1151n0220
$$ -1572386 -1560907 -1564930 -1562687 -1587628 -1600829 -1586812 -1583643 -1573508 -1592071 -1559495 -1518344 -1568564
9382a568564j2411l67J2885L4690k5934j8205Q479N3461J8303K2954l7345m3916
$$ -1568564 -1580975 -1581342 -1568457 -1533767 -1559701 -1577906 -1569427 -1515966 -1497663 -1474709 -1512054 -1555970
9370a555970J9604L5647o735O596J2008j8693m2220l1371Q556K5231M7779J2476
$$ -1555970 -1536366 -1500719 -1507454 -1500858 -1488850 -1507543 -1549763 -1581134 -1572578 -1547347 -1499568 -1487092
9358a487092J589K7998k6871J7354J3312k438l9357P086L0428K6307m7096L586
$$ -1487092 -1485503 -1457505 -1484376 -1467022 -1453710 -1456148 -1495505 -1488419 -1457991 -1431684 -1478780 -1475194
9346a475194P811J2825J8372K5731J2125m1548m8207M436L4867J6953j028k4810
$$ -1475194 -1467383 -1454558 -1436186 -1410455 -1398330 -1439878 -1488085 -1483649 -1448782 -1431829 -1432857 -1457667
9334a457667j4287K0547K1352Q112J6612J2116j2855J016K5006P48n790K7478
$$ -1457667 -1471954 -1451407 -1430055 -1421943 -1405331 -1393215 -1406070 -1405054 -1380048 -1379300 -1385090 -1357612
9322a357612K0493j2332k0658j2513k9915l562K4129m0302m1649M4585j586q510
$$ -1357612 -1337119 -1349451 -1370109 -1382622 -1412537 -1416099 -1391970 -1432272 -1473921 -1429336 -1430922 -1439432
9310a439432M160j1513J9843j610o4q88l5870r111L4770Q842j3177j0270j8935
$$ -1439432 -1435272 -1446785 -1426942 -1428552 -1428616 -1429504 -1465374 -1474485 -1439715 -1430873 -1444050 -1454320 -1473255
9297a473255n782M8268N4092K8876J31j7563j7220l7964J0775K28k9145L8812
$$ -1473255 -1479037 -1430769 -1376677 -1347801 -1347670 -1365233 -1382453 -1420417 -1409642 -1409414 -1438559 -1399747
9285a399747J7029O902L357r718l0278k5419L693J6680K4253M3665L2831N1142
$$ -1399747 -1382718 -1375816 -1372459 -1382177 -1412455 -1437874 -1434181 -1417501 -1393248 -1349583 -1316752 -1265610
9273a265610j3435l2750P65P914j5291j6586j147K6171L4664J555J6461J7160
$$ -1265610 -1279045 -1311795 -1311030 -1303116 -1318407 -1334993 -1336140 -1309969 -1275305 -1273750 -1257289 -1240129
9261a240129l5753m863j8194J4706L5392l237l2488j7914K5024L8347j7418n4743
$$ -1240129 -1275882 -1280745 -1298939 -1284233 -1248841 -1252078 -1284566 -1302480 -1277456 -1239109 -1256527 -1311270
9249a311270q335l2701j3208R74k3054j606K6404K9770N1810N538l9606J3034
$$ -1311270 -1319605 -1352306 -1365514 -1364540 -1387594 -1389200 -1362796 -1333026 -1281216 -1275678 -1315284 -1302250
9237a302250K2734r622M4258k2344j0250K6791k219k2238j7192j6793P200L5109
$$ -1302250 -1279516 -1289138 -1244880 -1267224 -1277474 -1250683 -1252902 -1275140 -1292332 -1309125 -1301925 -1266816
9225a266816J1419l870n4293l5451J0263L6262q870m048n274k7144j8786N2266
$$ -1266816 -1255397 -1259267 -1313560 -1349011 -1338748 -1302486 -1311356 -1315404 -1320678 -1347822 -1366608 -1314342
9213a314342M2659j895L0793J1530J0522k7502k7911n270O746M8827o968k346
$$ -1314342 -1271683 -1273578 -1242785 -1231255 -1220733 -1248235 -1276146 -1281416 -1274670 -1225843 -1232811 -1235157
9201a235157n6804K6015L7950n210n320J8243J3672l5186J302O817K1072j0303
$$ -1235157 -1291961 -1265946 -1227996 -1233206 -1238526 -1220283 -1206611 -1241797 -1240495 -1233678 -1212606 -1222909
9189a222909j5845M7417K7042k8484k4811k1392J6426J3748P225n794K9112l9079
$$ -1222909 -1238754 -1191337 -1164295 -1192779 -1217590 -1238982 -1222556 -1208808 -1201583 -1207377 -1178265 -1217344
9177a217344k2777J4520m04J9267L0100l833j5974J775l997K278j6986l1344M2269
$$ -1217344 -1240121 -1225601 -1226005 -1206738 -1176638 -1180471 -1196445 -1194670 -1198667 -1196389 -1213375 -1244719 -1202450
9164a202450M8652J0736k061k6795k9253o364j2935P485M798m878j0078q918k1008
$$ -1202450 -1153798 -1143062 -1145123 -1171918 -1201171 -1207535 -1220470 -1212985 -1208187 -1213065 -1223143 -1232061 -1253069
9151a253069j867k39K0892M1755K1012j1594j8097l193R818n216j2551J6551j9024
$$ -1253069 -1254936 -1255175 -1234283 -1192528 -1171516 -1183110 -1201207 -1204400 -1194582 -1199798 -1212349 -1195798 -1214822
9138a214822K4738L6838J3438k6672k6074L1389J4275k9543j4992m4285p250l632
$$ -1214822 -1190084 -1153246 -1139808 -1166480 -1192554 -1161165 -1146890 -1176433 -1191425 -1235710 -1242960 -1246592
9126a246592J2528K8384k5895J5569N5029j215k092l1573l6161L366N8158J3400
$$ -1246592 -1234064 -1205680 -1231575 -1216006 -1160977 -1162192 -1164284 -1195857 -1232018 -1228652 -1170494 -1157094
9114a157094M187n2138k5704r471p515K9904J9820j4016l064K017J1453L9398
$$ -1157094 -1152907 -1205045 -1230749 -1240220 -1247735 -1217831 -1198011 -1212027 -1215091 -1213074 -1201621 -1162223
9102a162223M049k4676R966K1921N3052N6954j8704m593N156j9336j7899m4759
$$ -1162223 -1158174 -1182850 -1172884 -1150963 -1097911 -1040957 -1059661 -1064254 -1059098 -1078434 -1096333 -1141092
9090a141092K883M0479L3705p703j8621k1512P059k6785m8263k1847l1P2354Q361
$$ -1141092 -1138209 -1097730 -1064025 -1071728 -1090349 -1111861 -1104802 -1131587 -1179850 -1201697 -1201728 -1129374 -1121013
9077a121013k7811j7356K3192Q095O827m2473j58K2373K6194o2802j3433L3724
$$ -1121013 -1148824 -1166180 -1142988 -1134893 -1128066 -1170539 -1170697 -1148324 -1122130 -1184932 -1198365 -1164641
9065a164641L0065N5121J0142j5098n762l4820k1822J4144L8167l24k8557o964
$$ -1164641 -1134576 -1079455 -1069313 -1084411 -1090173 -1124993 -1146815 -1132671 -1094504 -1094828 -1123385 -1130349
9053a130349j3413K020l4787m6652k0530N9446P0013j8764Q696j1492K2932J2345
$$ -1130349 -1143762 -1141742 -1176529 -1223181 -1243711 -1184265 -1114252 -1133016 -1124320 -1135812 -1112880 -1100535
9041a100535K8762r751k672J4910q095m7143J4010O1908o4216l9860J7136K6300
$$ -1100535 -1071773 -1081524 -1084196 -1069286 -1077381 -1124524 -1110514 -1048606 -1112822 -1152682 -1135546 -1109246
9029a109246K7274j3266n1647k4470p906M440J3013J2425K7894J698k5933N711
$$ -1109246 -1081972 -1095238 -1146885 -1171355 -1179261 -1174821 -1161808 -1149383 -1121489 -1119791 -1145724 -1140013
9017a140013K6269K5411o481l177m736K9376L458J1539k9530J6247Q352q920p608
$$ -1140013 -1113744 -1088333 -1094814 -1097991 -1102727 -1073351 -1069893 -1058354 -1087884 -1071637 -1063285 -1072205 -1079813
9004a079813J3454q333J4261O767L2107l5931l0597L412k1763J8559K7252j0871
$$ -1079813 -1066359 -1074692 -1060431 -1053664 -1021557 -1057488 -1088085 -1084673 -1106436 -1087877 -1060625 -1071496
8992a071496k5726L8035k064q0330j7151N0033O1005K7691J9539l248k1487k3848
$$ -1071496 -1097222 -1059187 -1061251 -1141581 -1158732 -1108699 -1047694 -1020003 -1000464 -1003712 -1025199 -1049047
8980a049047L6373M4098k3816q670n788k431M735j5024l6117l6320K0030R142
$$ -1049047 -1012674 -968576 -992392 -1001062 -1006850 -1009281 -1004546 -1019570 -1055687 -1092007 -1071977 -1062835
8968a062835Q421J817l1149K3519p972k3880K3865J4956J9593j1832Q531J4540
$$ -1062835 -1054414 -1052597 -1083746 -1060227 -1068199 -1092079 -1068214 -1053258 -1033665 -1045497 -1036966 -1022426
8956a022426M7509J2178l8023L884K0037k1539l5972L3794j393l6852n0750J4454
$$ -1022426 -974917 -962739 -1000762 -996878 -976841 -998380 -1034352 -1000558 -1001951 -1038803 -1089553 -1075099
8944a075099O66n143n839P3730R774k3167m8622j0218J6922k163J5163L0581K5039
$$ -1075099 -1074433 -1079576 -1085415 -1011685 -1001911 -1025078 -1073700 -1083918 -1066996 -1069159 -1053996 -1023415 -998376
8931i98376J0822j6213L898k0128K7766L8955M1913M790k8793n2745k8530L7876
$$ -998376 -987554 -1003767 -999869 -1019997 -992231 -953276 -911363 -906573 -935366 -988111 -1016641 -978765
8919i78765K3400K1391l3332j2651j0303l1664j4718j3793o6470L844P3394K3185
$$ -978765 -955365 -933974 -967306 -979957 -990260 -1021924 -1036642 -1050435 -1116905 -1113061 -1039667 -1016482
8907a016482L4146K6180n3379k1258j1202r481j2402J3469O6277N2087m231j1801
$$ -1016482 -982336 -956156 -1009535 -1030793 -1041995 -1051476 -1063878 -1050409 -984132 -932045 -936276 -948077
8895i48077k3579k0430l6878k2367p965p613J1990M0413K3246O377J1066O4278
$$ -948077 -971656 -992086 -1028964 -1051331 -1059296 -1066909 -1054919 -1014506 -991260 -984883 -973817 -909539
8883i09539J5291j8367O511j3110k4951p58k5152l9475r451N429O775m515K3211
$$ -909539 -894248 -912615 -906104 -919214 -944165 -944923 -970075 -1009550 -1019001 -1013572 -1006797 -1011312 -988101
8870i88101j8565k8642L2924O5523r268k7196l0974j1339O77M7064L40j5889l0566
$$ -988101 -1006666 -1035308 -1002384 -936861 -946129 -973325 -1004299 -1015638 -1014961 -967897 -967557 -983446 -1014012
8857a014012K586L342o809K9139l018k7624k0586N3J585K0312J9200J4802L0856
$$ -1014012 -1011426 -1008084 -1014893 -985754 -988772 -1016396 -1036982 -1036929 -1035344 -1015032 -995832 -981030 -950174
8844i50174K9615k4256k4484j0408J246j2181k070J8980j2994p760K498J5958
$$ -950174 -920559 -944815 -969299 -979707 -978461 -990642 -992712 -973732 -986726 -994486 -991988 -976030
8832i76030n7529K0092N0835j0842o792J2285J8331n296N66J139l174J5551j1316
$$ -976030 -1033559 -1013467 -962632 -973474 -980266 -967981 -949650 -954946 -954380 -953241 -956415 -940864 -952180
8819i52180M757l0430J5963M6741r174l0810j9599k2486k2503L5847M5859l6025
$$ -952180 -947423 -977853 -961890 -915149 -924323 -955133 -974732 -997218 -1019721 -983874 -938015 -974040
8807i74040p156J1337L0713M710j4524J3573J1274j2672k2862J96M9562r110k7821
$$ -974040 -981196 -969859 -939146 -934436 -948960 -935387 -924113 -936785 -959647 -959451 -909889 -918999 -946820
8794i46820J1082k5441j8312J1232l8050J7904L8475j5776k5168k3913J7988L1451
$$ -946820 -935738 -961179 -979491 -968259 -1006309 -988405 -949930 -965706 -990874 -1014787 -996799 -965348
8782i65348K1124j7002j8436p460J8111N85J6268K1303J5191K1354j5230k1640
$$ -965348 -944224 -961226 -979662 -987122 -969011 -968426 -952158 -930855 -915664 -894310 -909540 -931180
8770i31180L9785K8466j0315l7571k56j7218j4853N8157K8223l7408j8822k3812
$$ -931180 -891395 -862929 -873244 -910815 -911071 -928289 -943142 -884985 -856762 -894170 -912992 -936804
8758i36804k1033k6198J861k2115M2616L52N48K3645R779K191M284k8785K6763
$$ -936804 -957837 -984035 -982174 -1004289 -961673 -961321 -960773 -937128 -927349 -925158 -920874 -949659 -922896
8745i22896K1321l0120J2814J938K8329K9407K48j3293m2895j1590K6332l2221
$$ -922896 -901575 -931695 -918881 -916943 -888614 -859207 -858959 -872252 -915147 -926737 -900405 -932626
8733i32626J3002L920j9503L0103j6631P993k2456L196L104J8304J4447O272Q754
$$ -932626 -919624 -915704 -935207 -905104 -921735 -913742 -936198 -933002 -929898 -911594 -897147 -890875 -882121
8720h82121k0161j1309J9816K1977j1721o0996p8334O3460J4295J8453j5343p817
$$ -882121 -902282 -913591 -893775 -871798 -883519 -944515 -1022849 -959389 -945094 -926641 -941984 -949801
8708i49801L7671P5646j0050k7564J7866m7475m0020J744Q540k146K3851K3957
$$ -949801 -912130 -836484 -846534 -874098 -856232 -903707 -943727 -941983 -933443 -935589 -911738 -887781
8696h87781j1269K7710K8095m0308o2889j6324J0982O9969Q986j6046K2882l4353
$$ -887781 -899050 -871340 -843245 -883553 -946442 -962766 -951784 -881815 -872829 -888875 -865993 -900346
8684i00346j9781M1198L1295n1795p9173J9295N3520K7167l4835j0762l1507j9720
$$ -900346 -920127 -878929 -847634 -899429 -978602 -959307 -905787 -878620 -913455 -924217 -955724 -975444
8672i75444K8968J1482j8836p325K0401m140k7237J9295O568K854j0974R46M0040
$$ -975444 -946476 -934994 -953830 -961155 -940754 -944894 -972131 -952836 -946268 -943414 -954388 -953442 -913402
8659i13402r462p226R744J7098K4834L9802k1231J5913j0340l7868k7824K5485
$$ -913402 -922864 -930090 -920346 -903248 -878414 -838612 -859843 -843930 -854270 -892138 -919962 -894477
8647h94477K4277j365k3151j9189L6516N4327j4971J6517L167n7004k770K5842
$$ -894477 -870200 -871565 -894716 -913905 -877389 -823062 -838033 -821516 -818349 -875353 -878123 -852281
8635h52281l3311J5123J8234m0684j5434L4529R404l336l1678J5191J1380j7473
$$ -852281 -885592 -870469 -852235 -892919 -908353 -873824 -864420 -867756 -899434 -884243 -872863 -890336
8623h90336k2338O403j7433j2165L9108K5073k3727J4919K7784j4691Q056j4454
$$ -890336 -912674 -906271 -923704 -935869 -896761 -871688 -895415 -880496 -852712 -867403 -859347 -873801
8611h73801L526j9207L4853J1010j3709j3458J3420p583k2588j5648K050j3516
$$ -873801 -870275 -889482 -854629 -843619 -857328 -870786 -857366 -864949 -887537 -903185 -901135 -914651
8599i14651q902J5584M1205K6204j9455J9729j4173j6351p659j2021R798K0734
$$ -914651 -923553 -907969 -866764 -840560 -860015 -840286 -854459 -870810 -878469 -890490 -880692 -859958
8587h59958k279o909l3277J3847J3358j8259K7061J5595j9252l3648J1452L3952
$$ -859958 -862237 -869146 -902423 -888576 -875218 -893477 -866416 -850821 -870073 -903721 -892269 -858317
8575h58317L5175J473p076k9301j0788j9361k8520J2777L1439M1437J6710k074
$$ -858317 -823142 -821669 -828745 -858046 -868834 -888195 -916715 -903938 -872499 -831062 -814352 -816426
8563h16426N329K1538r08k5460n6622j4180L2592j7012L1028J8678k6169l1762
$$ -816426 -811097 -789559 -790467 -815927 -872549 -886729 -854137 -871149 -840121 -821443 -847612 -879374
8551h79374L4551M2328R502L297k7872n1266L0527L1264j9403j4229N2645l6909
$$ -879374 -844823 -802495 -792993 -789696 -817568 -868834 -838307 -807043 -826446 -840675 -788030 -824939
8539h24939k9055j7894m4841j1070J7002K6697K7355k8013k1391l165M4117L5501
$$ -824939 -853994 -871888 -916729 -927799 -910797 -884100 -856745 -884758 -906149 -909314 -865197 -829696
8527h29696k9298k9460K3864j5091Q606J4349j3683J8686M857j2692L5955K1410
$$ -829696 -858994 -888454 -864590 -879681 -871075 -856726 -870409 -851723 -846866 -859558 -823603 -802193
8515h02193Q592l2800k7749n626j4519o048J0281r354j542L124P934N3167L1499
$$ -802193 -793601 -826401 -854150 -859776 -874295 -880343 -870062 -879416 -880958 -877834 -869900 -816733 -785234
8502g85234q07K5352k6924k5525J8464k990q675k7229l3813j1017K466J7117K3924
$$ -785234 -786041 -760689 -787613 -813138 -794674 -797664 -806339 -833568 -867381 -878398 -875932 -858815 -834891
8489h34891J4589k8429K4373M1093l3115n8155N613L5200J0460j7239j6130Q889
$$ -834891 -820302 -848731 -824358 -783265 -816380 -874535 -868922 -833722 -823262 -840501 -856631 -847742
8477h47742K9119P772k3727K239o07l4944l2733j7929R557j4938M1944O3276L44
$$ -847742 -818623 -810851 -834578 -832339 -832946 -867890 -900623 -918552 -908995 -923933 -881989 -818713 -818369
8464h18369m327J9322J1316j7799K0115j2769k4957k831J5720n676O144M1126
$$ -818369 -822696 -803374 -792058 -809857 -789742 -802511 -827468 -830299 -814579 -820255 -814111 -772985
8452g72985j5330k8947q113L4053L4218j0468l4505l603J5855L0969p1207j1419
$$ -772985 -788315 -817262 -825375 -791322 -757104 -767572 -802077 -805680 -789825 -758856 -830063 -841482
8440h41482l907L5645N462n4668J829L2049O157N948K8672k0502n070J8677K3739
$$ -841482 -845389 -809744 -804282 -858950 -857121 -825072 -818915 -812967 -784295 -804797 -809867 -791190 -767451
8427g67451p991k1007k687J0114K0216l2546j7121j5857J2727j5291L2031J1507
$$ -767451 -775442 -796449 -799136 -789022 -768806 -801352 -818473 -834330 -821603 -836894 -804863 -793356
8415g93356l1159P405N558J0206j0045J8782K3664K1771k7352l1479k3455M4904
$$ -793356 -824515 -817110 -811552 -801346 -811391 -792609 -768945 -747174 -774526 -806005 -829460 -784556
8403g84556J0394m2208K2322J7392M6651m9720j9667K453P425r328k9189J1261
$$ -784556 -774162 -816370 -794048 -776656 -730005 -779725 -799392 -796939 -789514 -798842 -828031 -816770
8391h16770M110L5232J491J1534k4279k0252M503l1730k1162L9597M9562L863
$$ -816770 -812660 -777428 -775937 -764403 -788682 -808934 -804431 -836161 -857323 -817726 -768164 -764301
8379g64301R8R445K845o984K349q339k9876K7748L4782j3539m8637J75l627K919
$$ -764301 -764203 -754758 -751913 -758897 -756548 -764887 -794763 -767015 -732233 -745772 -794409 -794234 -797861 -794942
8365g94942j1697k8089K1388N192j9524o044J0811o273J2041p804M2779K7102
$$ -794942 -806639 -834728 -813340 -808148 -827672 -833716 -822905 -829178 -817137 -824941 -782162 -755060
8353g55060k0358L16k4919p1j4817l525L4128k2442l5402LK6022K8330J2832k6135
$$ -755060 -775418 -775102 -800021 -800092 -814909 -818434 -784306 -806748 -842150 -842147 -816125 -787795 -774963 -801098
8339h01098j4996M2090J3351m841N0572m387n5857k9422K9789K6252m603J873
$$ -801098 -816094 -774004 -760653 -765494 -714922 -719309 -775166 -804588 -774799 -748547 -753150 -751277
8327g51277j9985j9617R289K1642J1031l4908m508N28r621o3049j080K0647K3338
$$ -751277 -771262 -790879 -781590 -759948 -748917 -783825 -788333 -787805 -797426 -860475 -861555 -840908 -817570
8314h17570K9081k9237m7307L1613M6237M6920J9976k9966l463k0099j9483j5852
$$ -817570 -788489 -817726 -865033 -833420 -787183 -740263 -720287 -750253 -753716 -773815 -793298 -809150
8302h09150M4272P878j9903J2075K386k7820l145k7773J924L0324J7263O078Q209
$$ -809150 -764878 -757000 -776903 -764828 -762442 -790262 -793407 -821180 -819256 -788932 -771669 -765591 -757382
8289g57382n0319k2921q207M3131J5088q35J7053j2823p48L219K9481j9025l4199
$$ -757382 -807701 -830622 -838829 -795698 -780610 -781445 -764392 -777215 -777963 -774744 -745263 -764288 -798487
8276g98487J1334J5555m0401R622n007J3515J1121N4468K1304m2900l342j2270
$$ -798487 -787153 -771598 -811999 -802377 -807384 -793869 -782748 -728280 -706976 -749876 -753218 -765488
8264g65488j267k8767p728J9397N7024j6454L797l360J4680K0022l7346j3199
$$ -765488 -766755 -795522 -803250 -783853 -726829 -743283 -739486 -742846 -728166 -708144 -745490 -758689
8252g58689M974J6563L9412m599k5580N095o745q924k2959N650j3195L0001j7885
$$ -758689 -753715 -737152 -697740 -702339 -727919 -722824 -729569 -738493 -761452 -755802 -768997 -738996 -756881
8239g56881j2330k195m4218K778k483k4495K9563K2632L4475M0246K3740j8934
$$ -756881 -769211 -771406 -815624 -812846 -815329 -839824 -810261 -787629 -753154 -712908 -689168 -708102
8227g08102k5682n587K0030k5553q986k6908k4854l4656k3831j3726L2559L3148
$$ -708102 -733784 -739371 -719341 -744894 -753880 -780788 -805642 -840298 -864129 -877855 -845296 -812148
8215h12148j6732k2360K4835L2153K7450p737K3308K2119R355j8077m355K1912
$$ -812148 -828880 -851240 -826405 -794252 -766802 -774539 -751231 -729112 -719757 -737834 -742189 -720277
8203g20277J7702P78J509N7504p291m8488M430m8197j523r675K1005K0002K5397
$$ -720277 -702575 -701797 -700288 -642784 -650075 -698563 -694133 -742330 -743853 -753528 -732523 -712521 -687124
8190f87124J3470m6711m7932j0718O612K5443K0377k8668J4556L6956Q19j7029
$$ -687124 -673654 -720365 -768297 -779015 -772403 -746960 -726583 -755251 -740695 -703739 -702920 -719949
8178g19949k605o701o884j3375q282j4162n6016J5900P033L1656N5768j9902k9716
$$ -719949 -722554 -729255 -736139 -749514 -757796 -771958 -827974 -812074 -805041 -773385 -717617 -737519 -767235
8165g67235l6468J9110k0624j1845J4599K812k730J9319m6118Q431K6089L9130
$$ -767235 -803703 -784593 -805217 -817062 -802463 -799651 -802381 -783062 -829180 -820749 -794660 -755530
8153g55530q079R040N735l2038M688R312q713J5881M4168j0818m1777k7702o507
$$ -755530 -763609 -754569 -748834 -780872 -776184 -766872 -775585 -759704 -715536 -726354 -768131 -795833 -802340
8140h02340N0802q46r633k15L6882K1647k8257k0595L562j687r652J5835J6575
$$ -802340 -751538 -752384 -762017 -762232 -725350 -703703 -731960 -752555 -748993 -750680 -760332 -744497 -727922
8127g27922N712l92l5739K3929J9221N86m423k4447N213L6292J6507k1407k3707
$$ -727922 -722210 -722602 -758341 -734412 -715191 -714605 -719028 -743475 -738262 -701970 -685463 -706870 -730577
8114g30577P233k2094m0274r673L145L5707O3027N7975o2009K615J9904n4707
$$ -730577 -723344 -745438 -785712 -795385 -792240 -756533 -693506 -635531 -697540 -694925 -675021 -729728
8102g29728R558Q882m4273k1470M1996K134l107o522L0133l6428j7019p889L2097
$$ -729728 -720170 -711288 -755561 -777031 -735035 -732901 -736008 -742530 -712397 -748825 -765844 -773733 -741636
8089g41636k0144k8788J5203K2708J6511J1827K7339p02j6319J9224p691j838
$$ -741636 -761780 -790568 -775365 -752657 -736146 -724319 -696980 -697682 -714001 -694777 -702468 -704306
8077g04306L4273k3430m1677L346q485L095j5175P484o31L4765K0013Q479J8772
$$ -704306 -670033 -693463 -735140 -731794 -740279 -737184 -752359 -744875 -745506 -710741 -690728 -682249 -663477
8064f63477k8304j9662N4707Q453l9964K102j270n0662K9677R656k6567J6707
$$ -663477 -691781 -711443 -656736 -648283 -688247 -686145 -687415 -738077 -708400 -698744 -725311 -708604
8052g08604L6470K5740k9145k2490J1734q154J5818J5353o753k611J2l909j3444
$$ -708604 -672134 -646394 -675539 -698029 -686295 -694449 -678631 -663278 -670031 -672642 -672630 -676539 -689983
8039f89983l5180M8242K9212j2915k0314k9180n4014k049K4420L7376J337R149
$$ -689983 -725163 -676921 -647709 -660624 -680938 -710118 -764132 -766181 -741761 -704385 -703048 -693899
8027f93899l9043m6404J6785L7074j0452Q299M917J2879L7691j121j7645J935
$$ -693899 -732942 -779346 -762561 -725487 -735939 -727640 -722723 -709844 -672153 -673274 -690919 -688984
8015f88984M3348K0688j8406k3753j2170P724r353L6346J9106j2896m312m8643
$$ -688984 -645636 -624948 -643354 -667107 -679277 -671553 -680906 -644560 -625454 -638350 -642662 -691305
8003f91305l7714Q199l117o291l883m483N722M5923K097k4941k9672k1091K83
$$ -691305 -729019 -720820 -723937 -730228 -734111 -738594 -732872 -686949 -684852 -709793 -739465 -760556 -760273
7990g60273N1631J2634M5388K8838k9294k4759j419n2124j4301o083L350L9067
$$ -760273 -708642 -696008 -650620 -621782 -651076 -675835 -677254 -729378 -743679 -749762 -746412 -707345
7978g07345Q731O547R174L919J2477p649l1074k5076J0499j1215j1663N397l795
$$ -707345 -698614 -692067 -682893 -678974 -666497 -674146 -705220 -730296 -719797 -731012 -742675 -737278 -741073
7965g41073K4954J9123K783l8320l1865P562K3032r747M1646M6761k5948m2716
$$ -741073 -716119 -696996 -694213 -732533 -764398 -756836 -733804 -743551 -701905 -655144 -681092 -723808
7953g23808l839j0139J0110J2536k190R526k2712K2484l8575l579K6675L9911
$$ -723808 -727647 -737786 -727676 -715140 -717330 -707804 -730516 -708032 -746607 -750186 -723511 -683600
7941f83600L98r650P938M13M414K6855k9942l9199J627N735J12M984J3433J5182
$$ -683600 -683202 -692852 -684914 -684501 -680087 -653232 -683174 -722373 -720746 -715011 -714899 -709915 -696482 -681300
7927f81300Q220K9695l0872l6576k5285J089j3183k7122j2138K5102l3508l1557
$$ -681300 -673080 -643385 -674257 -710833 -736118 -735029 -748212 -775334 -787472 -762370 -795878 -827435
7915h27435K2808M4423M989J9594l3486M057J1243J8181K4759k1664k4675M1219
$$ -827435 -804627 -760204 -755215 -735621 -769107 -765050 -753807 -735626 -710867 -732531 -757206 -715987
7903g15987J5766J3810n166J4538R985j2841k8724q728L2175j3240l2559j8341
$$ -715987 -700221 -686411 -691577 -677039 -667054 -679895 -708619 -717347 -685172 -698412 -730971 -749312
7891g49312k942L36J7565K313k529m4132k5445L9579Q109k319N7522O2091j8733
$$ -749312 -752254 -751918 -734353 -732040 -734569 -778701 -804146 -764567 -756458 -758777 -701255 -639164 -657897
7878f57897j1339j3812l3988p725Q512L0385j8790J1684k093k3111K7941M4215
$$ -657897 -669236 -683048 -717036 -724761 -716249 -685864 -704654 -692970 -695063 -718174 -690233 -646018
7866f46018q182K2729k2993j0912j0272r952L0930J6638Q358k1805k623J3267
$$ -646018 -654200 -631471 -654464 -665376 -675648 -685600 -654670 -638032 -629674 -651479 -654102 -640835
7854f40835L2764j5622j6919k3433l4563M8912K212j5945K6120n288K4225p615
$$ -640835 -608071 -623693 -640612 -664045 -698608 -649696 -647484 -663429 -637309 -642597 -618372 -625987
7842f25987k0641k6018k2323M667m558O872K3439K5883M027K1719j5199m9699
$$ -625987 -646628 -672646 -694969 -690302 -694860 -687988 -664549 -638666 -634639 -612920 -628119 -677818
7830f77818K583K325N793L056Q798j995J4968j6287m3322M8317J1344l0261k2008
$$ -677818 -675235 -672910 -667117 -664061 -655263 -657258 -642290 -658577 -701899 -653582 -642238 -672499 -694507
7817f94507j788J0940L5485j0087j8751j0410L2808J7870L5832L4050l1039n9403
$$ -694507 -696295 -685355 -649870 -659957 -678708 -689118 -656310 -638440 -602608 -568558 -599597 -659000
7805f59000n7004l4396N137L9434L0599Q890j6022J9625L3821M364j6799k0834
$$ -659000 -716004 -750400 -745263 -705829 -675230 -666340 -682362 -662737 -628916 -624552 -641351 -662185
7793f62185J5371O235n353j2834k8682m5403Q797L5474Q386J0788J8410K250j5121
$$ -662185 -646814 -640579 -645932 -658766 -687448 -732851 -724054 -688580 -680194 -669406 -650996 -648746 -663867
7780f63867L7038r082k4569q72j6399n1013j5303O549l948j5075j5289J1102p515
$$ -663867 -626829 -635911 -660480 -661352 -677751 -728764 -744067 -737518 -741466 -756541 -771830 -760728 -768243
7767g68243K0352M4990K0960L1403n890q2218l5528K7779K2248K6179L0570N147
$$ -768243 -747891 -702901 -681941 -650538 -656428 -738646 -774174 -746395 -724147 -697968 -667398 -662251
7755f62251J1819j7832k6292N881q342L2840L1373l7039k9096K8163K3365Q980
$$ -662251 -650432 -668264 -694556 -688675 -697017 -664177 -632804 -669843 -698939 -670776 -647411 -638431
7743f38431j4998j0334R797P477j6726J3926K6220l1163J267K4821j5146n8861
$$ -638431 -653429 -663763 -653966 -646489 -663215 -649289 -623069 -654232 -652965 -628144 -643290 -702151
7731g02151j4697K4899K0834k2859J8303j7136J5989M6311k2443n7466n4348K2987
$$ -702151 -716848 -691949 -671115 -693974 -675671 -692807 -676818 -630507 -652950 -710416 -764764 -741777
7719g41777K1838L8553L1079j4326J2882J6406k4361k9012o872K3909L5779P137
$$ -741777 -719939 -681386 -650307 -664633 -651751 -635345 -659706 -688718 -695590 -671681 -635902 -628765
7707f28765K487K1225k038j2189j5486J966J9748m423j218L0306k3502l3681j118
$$ -628765 -626278 -605053 -607091 -619280 -634766 -632800 -613052 -617475 -618693 -588387 -611889 -645570 -646688
7694f46688k7975k2532k6589M6262j4983K6958K7582m5454l6674K928P44M1154
$$ -646688 -674663 -697195 -723784 -677522 -692505 -665547 -637965 -683419 -720093 -717165 -716421 -675267
7682f75267M1395q393P086k2588N731M2224j1737n3355l5667j4542K7463J5265
$$ -675267 -633872 -642265 -635179 -657767 -652036 -609812 -621549 -674904 -710571 -725113 -697650 -682385
7670f82385M7172O3111k696m852l3182k5038J3576k1987j485O897M5876M420j8362
$$ -682385 -635213 -572102 -574798 -579650 -612832 -637870 -624294 -646281 -647766 -640869 -594993 -590573 -608935
7657f08935j428j3003L37j5877k979n4245j3635J153K3401K1340L3958J5343k65
$$ -608935 -610363 -623366 -623029 -638906 -641885 -696130 -709765 -708612 -685211 -663871 -629913 -614570 -614835
7644f14835Q200L3416j1724l6964m6820j3105K9255J8356n889j361J6123m952
$$ -614835 -606635 -573219 -584943 -621907 -668727 -681832 -652577 -634221 -640110 -641471 -625348 -630300
7632f30300J3842j4954j1699J9199k985j7844k0054K8512O5991L4741k7010j0008
$$ -630300 -616458 -631412 -643111 -623912 -626897 -644741 -664795 -636283 -570292 -535551 -562561 -572569
7620e72569l2725J7283J5566K5316J4190n0826p0421l615M3352J3256k8921J7796
$$ -572569 -605294 -588011 -572445 -547129 -532939 -583765 -654186 -657801 -614449 -601193 -630114 -612318
7608f12318l5466m1682l18k0017L5110J5852L4896n662k2943k8880j8548M5014
$$ -612318 -647784 -689466 -689784 -709801 -674691 -658839 -623943 -629605 -652548 -681428 -699976 -654962
7596f54962J1627J7660M26l47O132j1469k3649o687M2355j2037j0377J9181K8308
$$ -654962 -643335 -625675 -625249 -625596 -619464 -630933 -654582 -661269 -618914 -630951 -641328 -622147 -593839
7583e93839J2075j5630R062k3624k6234m7386M67n282P651L763J7655L1491k923
$$ -593839 -581764 -597394 -588332 -611956 -638190 -685576 -685109 -690391 -682740 -678977 -661322 -629831 -632754
7570f32754l3825k9147j2472l5584j3594o653L5814N0602M1178n499k8074k2589
$$ -632754 -666579 -695726 -708198 -743782 -757376 -764029 -728215 -677613 -636435 -641934 -670008 -692597
7558f92597P110L3800Q712J0848J5065K1956j4098k5110j089m219K094M331o014
$$ -692597 -685487 -651687 -642975 -632127 -617062 -595106 -609204 -634314 -635403 -639622 -637528 -633197 -639211
7545f39211K337J5456j6244j3530Q774p858o831J1778k7313L489k631K4733l3742
$$ -639211 -636874 -621418 -637662 -651192 -642418 -650276 -657107 -645329 -672642 -669153 -671784 -647051 -680793
7532f80793l8595K9788N6753N3512k8o6656M62J5671K9634J2359l1197K5315J147
$$ -680793 -719388 -689600 -632847 -579335 -579363 -646019 -645557 -629886 -600252 -587893 -619090 -593775 -592628
7519e92628K35M050q908j9046l4537J442M2797J0652J8590p645j4922O576o48
$$ -592628 -592393 -588343 -597251 -616297 -650834 -649392 -606595 -595943 -577353 -584998 -599920 -593344 -593992
7506e93992j5570k3832l240P960J2166K4804K1708K0742j6273k0319J482J19n0041
$$ -593992 -609562 -633394 -636634 -628674 -616508 -591704 -569996 -549254 -565527 -585846 -584364 -584245 -634286
7493f34286j636J3407K1218L4864K1507q303m0665L868K4497k1457k0004K054
$$ -634286 -635922 -622515 -601297 -566433 -544926 -553229 -593894 -590026 -565529 -586986 -606990 -604936
7481f04936O473q810J8212J5163J7056R07J6998J4411k8777j2013k7453J284L472
$$ -604936 -598463 -607273 -589061 -573898 -556842 -555935 -538937 -524526 -553303 -565316 -592769 -591485 -588013
7468e88013r797K2528K1143j2450k1161m430J9969L273M58J6320j62p990K7447
$$ -588013 -597810 -575282 -554139 -566589 -587750 -592180 -572211 -568938 -568480 -552160 -552322 -560312 -532865
7455e32865J207r3231j9936K0191L5186M195o398N995J3777o189j0496j9279j1111
$$ -532865 -531658 -624889 -644825 -624634 -589448 -585253 -591651 -585656 -571879 -578068 -588564 -607843 -618954
7442f18954n128L2611j3642l6082j0179J341K4051N3450P672j8342n0015l4371
$$ -618954 -624082 -591471 -605113 -641195 -651374 -650033 -625982 -572532 -564860 -583202 -633217 -667588
7430f67588p673K8937N7859k4988K2265m453l1020M996k9512q506o545K4599K8774
$$ -667588 -675261 -646324 -588465 -613453 -591188 -595641 -626661 -621665 -651177 -659683 -666228 -641629 -612855
7417f12855J1926J5687M7952j2005o1653l298K6841j089j9232R514L8971j803
$$ -612855 -600929 -585242 -537290 -549295 -610948 -614246 -587405 -588494 -607726 -598212 -559241 -561044
7405e61044j4984j9537j1339L7417j059r782j3164n37J267J988O492l335k4456
$$ -561044 -576028 -595565 -606904 -569487 -570546 -580328 -593492 -594029 -592762 -590774 -584282 -587617 -612073
7392f12073j1458j5848l007R735L6969j0103J4687j9068k9982N2772K993l0231
$$ -612073 -623531 -639379 -642386 -632651 -595682 -605785 -591098 -610166 -640148 -587376 -584383 -614614
7380f14614K4925k01k22N243k4112k9332j2469K4739J2044J603j825l7774K5009
$$ -614614 -589689 -589890 -590112 -584869 -608981 -638313 -650782 -626043 -613999 -612396 -614221 -651995 -626986
7367f26986M5036L9134J3943J0196n795m7903j3556q179l8711j0902K3070o76
$$ -626986 -581950 -542816 -528873 -518677 -524472 -572375 -585931 -594110 -632821 -643723 -620653 -621329
7355f21329l3983Q476N903L9462L8273Q153J0401O115j8176l5341j4123J49j112
$$ -621329 -655312 -646836 -640933 -601471 -563198 -555045 -544644 -538529 -556705 -592046 -606169 -606020 -607132
7342f07132k75K6706k6111m8382j7647K1440K281n126k8912J1339M1064N1024
$$ -607132 -607407 -580701 -606812 -655194 -672841 -651401 -649120 -654246 -683158 -671819 -630755 -579731
7330e79731N315m0216j344r694p7J116O517L1399L0516q413n074J2352j9452J3433
$$ -579731 -574416 -614632 -615976 -625670 -625747 -624631 -618114 -586715 -556199 -564612 -569686 -557334 -576786 -563353
7316e63353j8843k9293N520l6993k0871k0721m0823j166j9413K5036K2991K1444
$$ -563353 -582196 -611489 -605969 -642962 -663833 -684554 -725377 -726543 -745956 -720920 -697929 -676485
7304f76485N0183K176O227j1010j4707J8430J1059o684L0072r842J4777j8216
$$ -676485 -626302 -624126 -617899 -628909 -643616 -625186 -614127 -620811 -590739 -600581 -585804 -604020
7292f04020l9918l0756N2076P3310J8659k0038k0193k0730j1946k2422k1482R049
$$ -604020 -643938 -674694 -622618 -549308 -530649 -550687 -570880 -591610 -603556 -625978 -647460 -638411
7280f38411O116L9598J0791j2845K7543j6628K0081J1622n2715k7421M3226K8001
$$ -638411 -632295 -592697 -581906 -594751 -567208 -583836 -563755 -552133 -604848 -632269 -589043 -561042
7268e61042j238J4298j864J9981P140j0476n965p0226J3471L4354J3492K6632
$$ -561042 -562280 -547982 -549846 -529865 -522725 -533201 -539166 -609392 -595921 -561567 -548075 -521443
7256e21443J3236o9722o09O4060K5092n5923k3910k1799j1304r293j4352J7352
$$ -521443 -508207 -577929 -578538 -514478 -489386 -545309 -569219 -591018 -602322 -611615 -625967 -608615
7244f08615J3454N475J2757N179J6020k1778j6259Q146K9547j7590m0279M502
$$ -608615 -595161 -589686 -576929 -571750 -555730 -577508 -593767 -585621 -556074 -573664 -613943 -609441
7232f09441q671J0375j5464l3723J7323N9334L1747J0990J6382j2284l6309j2683
$$ -609441 -618112 -607737 -623201 -656924 -639601 -580267 -548520 -537530 -521148 -533432 -569741 -582424
7220e82424m0991k2119Q629j9433l0316m362M8939M2800P09K9128p23p795j808
$$ -582424 -623415 -645534 -636905 -656338 -686654 -691016 -642077 -599277 -598568 -569440 -570163 -577958 -579766
7207e79766l8487J6016J9482k1381J1572J4159j2493J6450k6354p1800M0492O2710
$$ -579766 -618253 -602237 -582755 -604136 -592564 -578405 -590898 -574448 -600802 -672602 -632110 -569400
7195e69400L1841M0490k8325k6530J5514N39J4456L21p942l9986J1565q972m249
$$ -569400 -537559 -497069 -525394 -551924 -536410 -535871 -521415 -521094 -529036 -569022 -557457 -566429 -570678
7182e70678m6717M2491K3184j2316P597j7486o409j7651K5264L2472m522J827
$$ -570678 -617395 -574904 -551720 -564036 -556439 -573925 -580334 -597985 -572721 -540249 -544771 -542944
7170e42944l1486l3502j9520j0008J6376J9852j3031k9380r004J4734R153K6667
$$ -542944 -574430 -607932 -627452 -637460 -621084 -601232 -614263 -643643 -652647 -637913 -628760 -602093
7158f02093J2958p647J6957O455m9192m9837J4872K9256K6031k4741Q778K7583
$$ -602093 -589135 -596782 -579825 -573370 -622562 -672399 -657527 -628271 -602240 -626981 -618203 -590620
7146e90620K2988q140j6930J1119k749l7484k635n815k800M2632k834j6090j0881
$$ -590620 -567632 -575772 -592702 -581583 -584332 -621816 -624451 -630266 -633066 -590434 -593268 -609358 -620239
7133f20239k2270J9114K576l2107P729p799J3032L5489p389M7929K8655j419J0450
$$ -620239 -642509 -623395 -620819 -652926 -645197 -652996 -639964 -604475 -611864 -563935 -535280 -536699 -526249
7120e26249M6471J8543p760k2990k4532n64k1322l7923k9422L038J6623k8328
$$ -526249 -479778 -461235 -468995 -491985 -516517 -517081 -538403 -576326 -605748 -602710 -586087 -614415
7108f14415J3800M1413m2298K582j5634Q309M4814J5772m2517j0645k4892M3427
$$ -614415 -600615 -559202 -601500 -598918 -614552 -606243 -561429 -545657 -588174 -598819 -623711 -580284
7096e80284R686J8786P009k9817q404l680L378j635O620K042l414J2075N175K2760
$$ -580284 -570598 -551812 -544803 -574620 -583024 -586704 -583326 -584961 -578341 -576299 -579713 -567638 -562463 -539703
7082e39703K0945k3512J2472L0827K0596R427m8360o5054j7252L4536N132j9234
$$ -539703 -518758 -542270 -529798 -498971 -478375 -468948 -517308 -582362 -599614 -565078 -559946 -579180
7070e79180J1725p396K8878K9004K4937o701o6526n9611n0658N9765M6147q702
$$ -579180 -567455 -574851 -545973 -516969 -492032 -498733 -565259 -624870 -675528 -615763 -569616 -578318
7058e78318J9767m851j2745n855L6934J9483n6876K8641J83j9303K1829j0079
$$ -578318 -558551 -563402 -576147 -582002 -545068 -525585 -582461 -553820 -553637 -572940 -551111 -561190
7046e61190k8245m3561K7118L7622P3223k3725m3411J0439P119q253j0355k3294
$$ -561190 -589435 -632996 -605878 -568256 -495033 -518758 -562169 -551730 -544611 -552864 -563219 -586513
7034e86513N0991K2788m5191j5765K2162K7266J5474j0563j7823k6750J7608J3460
$$ -586513 -535522 -512734 -557925 -573690 -551528 -524262 -508788 -519351 -537174 -563924 -546316 -532856
7022e32856P321M34k5962l9993j3791R629m2839P217J0675L8408M8660j2401l1461
$$ -532856 -525535 -525101 -551063 -591056 -604847 -595218 -638057 -630840 -620165 -581757 -533097 -545498 -576959
7009e76959m927J6070L2524o653o890J125j3881k2869N406M25N79q470q848M124
$$ -576959 -581886 -565816 -533292 -539945 -546835 -545710 -559591 -582460 -577054 -576629 -576050 -584520 -593368 -589244
6995e89244L6845L2296j2109k5991J5398J7212K5906J2336m3931m8095J647J0548
$$ -589244 -552399 -520103 -532212 -558203 -542805 -525593 -499687 -487351 -531282 -579377 -577730 -567182
6983e67182L7150j1991J0558K0221J7615J1898K2378k9286k9652J9837l6801o485
$$ -567182 -530032 -542023 -531465 -511244 -493629 -481731 -459353 -488639 -518291 -498454 -535255 -541740
6971e41740L2833K3246J3167j7317l7983j2378N180l0437k0805J8189M0437m249
$$ -541740 -508907 -485661 -472494 -489811 -527794 -540172 -534992 -565429 -586234 -568045 -527608 -531857
6959e31857k1727m863K001J8061R171l7893l980J7196R486k8047J090J706O374
$$ -531857 -553584 -558447 -556446 -538385 -529214 -567107 -571087 -553891 -544405 -572452 -571362 -569656 -563282
6946e63282M030j1838l0057k2724L1974M6789j565o3936p992K8243JL0566M5833
$$ -563282 -559252 -571090 -601147 -623871 -591897 -545108 -546673 -610609 -618601 -590358 -590357 -559791 -513958
6933e13958K5472l5820J6979j4024p226m439J8806j5491j9040k6031L140K2735
$$ -513958 -488486 -524306 -507327 -521351 -528577 -533016 -514210 -529701 -548741 -574772 -571632 -548897
6921e48897K5944M439j2395P350J0907k9874J5842l639J3780L7878m54m0189k3900
$$ -548897 -522953 -518514 -530909 -523559 -512652 -542526 -526684 -530323 -516543 -478665 -479119 -519308 -543208
6908e43208k6246k9739M975K8154M4745R681J909O731k5678j2042J7441J548J939
$$ -543208 -569454 -599193 -594218 -566064 -521319 -511638 -509729 -502998 -528676 -540718 -523277 -521729 -519790
6895e19790J4715K468n1970k4301n3105j2058O5962M6382L2737j4868l4286j9449
$$ -519790 -505075 -502607 -554577 -578878 -631983 -644041 -578079 -531697 -498960 -513828 -548114 -567563
6883e67563J4603L4863J4173j4416m4007k8449L311J4001R473P229J0389J6767
$$ -567563 -552960 -518097 -503924 -518340 -562347 -590796 -587485 -573484 -564011 -556782 -546393 -529626
6871e29626N374m427J6116Q207l9575l8491J106p441L0165P020N055J2622l919
$$ -529626 -524252 -528679 -512563 -504356 -543931 -582422 -581316 -588757 -558592 -551572 -546517 -533895 -537814
6858e37814P258K4431m4906l0710L1436K7630j9389k4185p40K3530M2498o850
$$ -537814 -530556 -506125 -551031 -581741 -550305 -522675 -542064 -566249 -566989 -543459 -500961 -507811
6846e07811m834J3151K5093l0425k3201J8785K1353j7536l9363l4403k3588m020
$$ -507811 -512645 -499494 -474401 -504826 -528027 -509242 -487889 -505425 -544788 -579191 -602779 -606799
6834f06799L4083O36K4639j030j1948k6870n879L9782J6648m0136K8797l161j7834
$$ -606799 -572716 -572080 -547441 -548471 -560419 -587289 -593168 -553386 -536738 -576874 -548077 -551238 -569072
6821e69072P125j4739j6944N611J9817K6538P094r002L827l7025L930J0934m2060
$$ -569072 -561947 -576686 -593630 -588019 -568202 -541664 -534570 -543572 -539745 -576770 -572840 -561906 -603966
6808f03966K0719J6487J4253P637j6419J0127L1976J1584m193j9167M4596K4281
$$ -603966 -583247 -566760 -552507 -544870 -561289 -551162 -519186 -507602 -511795 -530962 -486366 -462085
6796d62085m5719j3803j8457n770J127j453k9943p746L9996J8309n2441n0212
$$ -462085 -507804 -521607 -540064 -545834 -544707 -546160 -576103 -583849 -543853 -525544 -577985 -628197
6784f28197k6805K1278Q4244N7859M6281j6632k7715L663q715J9804L2210j5229
$$ -628197 -655002 -633724 -549480 -491621 -445340 -461972 -489687 -486024 -494739 -474935 -442725 -457954
6772d57954k2026l2221j384J9600j9157N248J4436j6462k8796K077q251P477J7577
$$ -457954 -479980 -512201 -513585 -493985 -513142 -507894 -493458 -509920 -538716 -536639 -544890 -537413 -519836
6759e19836K4866j7236q931n2421j2588p057J8566K2900O522R58j7464m541k0939
$$ -519836 -494970 -512206 -521137 -573558 -586146 -593203 -574637 -551737 -545215 -544257 -561721 -566262 -587201
6746e87201k9600L9414N5014K842k3127M0872K9279k7229j1056j2555k1275o492
$$ -587201 -616801 -577387 -522373 -519531 -542658 -501786 -472507 -499736 -510792 -523347 -544622 -551114
6734e51114J7090m768j2292J7684M873J7089J614j8749j7724m217J0015K5576
$$ -551114 -534024 -538792 -551084 -533400 -528527 -511438 -509824 -528573 -546297 -550514 -540499 -514923
6722e14923k9753K2165J3096j0755o136l4841j8328m5789K0525J6355O037M6266
$$ -514923 -544676 -522511 -509415 -520170 -526306 -561147 -579475 -625264 -604739 -588384 -582347 -536081
6710e36081P150k5112M8446K9953J5732k4694M656m8505o9684k3948O413p133
$$ -536081 -528931 -554043 -505597 -475644 -459912 -484606 -479950 -528455 -598139 -622087 -615674 -622807
6698f22807j5307K7587L54j2535K9490K5949L2986p507l3198L9777J1513l7468
$$ -622807 -638114 -610527 -610173 -622708 -593218 -567269 -534283 -541790 -574988 -535211 -523698 -561166
6686e61166K8296j1761k764L2620K0357K6331N551r029j8830l7514j6662j169
$$ -561166 -532870 -544631 -547395 -514775 -494418 -468087 -462536 -471565 -490395 -527909 -544571 -545740
6674e45740K0684L4969k6263k6728J2735O154j273j7039k4269k3643J4456L6813
$$ -545740 -525056 -490087 -516350 -543078 -530343 -524189 -525462 -542501 -566770 -590413 -575957 -539144
6662e39144K3888J5359k326Q73L0554K2904k3132K2811k0811k4906J4233K8782
$$ -539144 -515256 -499897 -502223 -501350 -470796 -447892 -471024 -448213 -469024 -493930 -479697 -450915
6650d50915J9525J527l9044k2432P690r427N734l1539J0664J9148M755k927j7515
$$ -450915 -431390 -429863 -468907 -491339 -483649 -493076 -487342 -518881 -508217 -489069 -484314 -487241 -504756
6637e04756j5835p945j6001k1214K2415J2542M4045L1187L4480M6817j7629m7224
$$ -504756 -520591 -528536 -544537 -565751 -543336 -530794 -486749 -455562 -421082 -374265 -391894 -439118
6625d39118l2247k2875o2298p9273K1250M5074M5078P832L646o974O836j7827
$$ -439118 -471365 -494240 -556538 -635811 -614561 -569487 -524409 -516577 -512931 -519905 -513069 -530896
6613e30896l1396M236k1207P1459L6840o3638n3029j7857K3333N8864L3368l4112
$$ -530896 -562292 -558056 -579263 -507804 -470964 -534602 -587631 -605488 -582155 -523291 -489923 -524035
6601e24035p667j9802l979j25k7561j4718L9516L1804j0760r147L1069o650R930
$$ -524035 -531702 -551504 -555483 -555608 -583169 -597887 -558371 -526567 -537327 -546474 -515405 -522055 -512125
6588e12125j1710O67J3772k0521l2796K7283N0366l6208j105P057L0988J8694
$$ -512125 -523835 -523168 -509396 -529917 -562713 -535430 -485064 -521272 -522377 -515320 -484332 -465638
6576d65638n1513j1240L4085L9752k0787m0733n4538R427M6923K9520K2714m4756
$$ -465638 -517151 -528391 -494306 -454554 -475341 -516074 -570612 -561185 -514262 -484742 -462028 -506784
6564e06784O763J8064j5866k5486l471j0268L694l0295Q999K8166O251K2878L0105
$$ -506784 -500021 -481957 -497823 -523309 -526780 -537048 -533354 -563649 -554650 -526484 -520233 -497355 -467250
6551d67250n0997k9266k0631M2433L7238l2479k892k8431J3204K2671J4202P396
$$ -467250 -518247 -547513 -568144 -525711 -488473 -520952 -523844 -552275 -539071 -516400 -502198 -494802
6539d94802J5930P676j3430l3384J2773l34O286k1270l5800J5863J3316j1083
$$ -494802 -478872 -471196 -484626 -518010 -505237 -505571 -499285 -520555 -556355 -540492 -527176 -538259
6527e38259p936J0650J9693L9468j2323p9939k0269J4016K1882j0078l2161M2790
$$ -538259 -546195 -535545 -515852 -476384 -488707 -568646 -588915 -574899 -553017 -563095 -595256 -552466
6515e52466J9258j0226J7127K8030p910j2070j3784N183J4408k9806j5907R821
$$ -552466 -533208 -543434 -526307 -498277 -506187 -518257 -532041 -526858 -512450 -542256 -558163 -548342
6503e48342J2527J2287k622n119q611K1844O2919o085O346J5540k5018o414j3761
$$ -548342 -535815 -523528 -526150 -531269 -539880 -518036 -455117 -461202 -454856 -439316 -464334 -470748 -484509
6490d84509J718m7607l2056M2602K5865j3617m4977N844L5480K5838L991L4439
$$ -484509 -482791 -530398 -562454 -519852 -493987 -507604 -552581 -546737 -511257 -485419 -481428 -446989
6478d46989k1020n1132O7395J6651j9381j7463J5463n1693k8382k2083K6501K2808
$$ -446989 -468009 -519141 -451746 -435095 -454476 -471939 -456476 -508169 -536551 -558634 -532133 -509325
6466e09325J7312q425j6887Q734K7093m4886K0192M236k1709J5535Q43l5709k6861
$$ -509325 -492013 -500438 -517325 -508591 -481498 -526384 -506192 -501956 -523665 -508130 -507287 -542996 -569857
6453e69857J86J2730J0132K3745J294q077L496k819k1918m2097L1500M0560j2612
$$ -569857 -569671 -556941 -546809 -523064 -521770 -529847 -526351 -529170 -551088 -593185 -561685 -521125 -533737
6440e33737l3535J4900L2582M7416j8129L297j3897K9964J5614j3130j6551Q29
$$ -533737 -567272 -552372 -519790 -472374 -490503 -487206 -501103 -471139 -455525 -468655 -485206 -484377
6428d84377K4763m804k8776j6154m389K0738J5716j3713N334l2760p747M9116
$$ -484377 -459614 -464418 -493194 -509348 -513737 -492999 -477283 -490996 -485662 -518422 -526169 -477053
6416d77053O021l912N272j8970m1885j3500J7843L4791k8419K1339J5934q246
$$ -477053 -471032 -474944 -469672 -488642 -530527 -544027 -526184 -491393 -519812 -498473 -482539 -490785
6404d90785k2510r230k8981J0631K6820l825L543j0588j6250j9749P402L6868
$$ -490785 -513295 -522525 -551506 -540875 -514055 -517880 -514337 -524925 -541175 -560924 -553522 -516654
6392e16654M8625m1792n0202K5885P1083J3073j456q418M1798l698j516n6918
$$ -516654 -468029 -509821 -560023 -534138 -463055 -449982 -451438 -459856 -418058 -421756 -423272 -480190
6380d80190l2153j2787K9934j706Q483r45j0463j1259P56k3665J4063J8012R038
$$ -480190 -512343 -525130 -495196 -496902 -488419 -489364 -499827 -511086 -510330 -533995 -519932 -501920 -492882
6367d92882r301J6271K3214q736o693L5222J1901m8749j3515j9144q276J208l8593
$$ -492882 -502183 -485912 -462698 -471434 -478127 -442905 -431004 -479753 -493268 -512412 -520688 -519480 -558073
6354e58073k399M4180L9164r5j5682q080K6549K1952M208n7113k2967K6015K2465
$$ -558073 -560472 -516292 -477128 -477223 -492905 -500985 -474436 -452484 -448276 -505389 -528356 -502341 -479876
6341d79876K776n645M3790l1076n4186m5727M599J2063K1164Q045k0428j863M8434
$$ -479876 -477100 -482745 -438955 -470031 -524217 -569944 -565345 -553282 -532118 -524073 -544501 -546364 -497930
6328d97930L3040K8298L02J8712m1638n106j6948n421K1004J7651j573j101j720
$$ -497930 -464890 -436592 -436290 -417578 -459216 -464322 -481270 -486691 -465687 -448036 -449609 -450710 -452430
6315d52430K1871m7690p641q935P789K4065K5743n7959m4823j0279K3304K057
$$ -452430 -430559 -478249 -485890 -494825 -487036 -462971 -437228 -495187 -540010 -550289 -526985 -524928
6303e24928j5392K349N459Q942N3096L943L3839J9641Q417n0065m2059p857j1649
$$ -524928 -540320 -537971 -532512 -523570 -470474 -466531 -432692 -413051 -404634 -454699 -496758 -504615 -516264
6290e16264k9688J3323K8965J9270j5348L8873k0480n5219N833K4406P154m9983
$$ -516264 -545952 -532629 -503664 -484394 -499742 -460869 -481349 -536568 -530735 -506329 -499175 -549158
6278e49158J607K8501J287j6584P078j2958K77J9957K065K3763j3415Q441O435
$$ -549158 -547551 -519050 -517763 -534347 -527269 -540227 -539950 -519993 -517928 -494165 -507580 -499139 -492704
6265d92704L3092J7912j9690O112m156j9309j2260K645j9463L1811N8296j8383
$$ -492704 -459612 -441700 -461390 -455278 -459434 -478743 -491003 -488358 -507821 -476010 -417714 -436097
6253d36097q388k5345m445k4284J0127J0111j9035j3477l8935K0178K118j2949
$$ -436097 -444485 -469830 -474275 -498559 -488432 -478321 -497356 -510833 -549768 -529590 -527472 -540421
6241e40421j4907r089l226L0655M4074K3382M331q91M9781r753P532q101k2575
$$ -540421 -555328 -564417 -567643 -536988 -492914 -469532 -465201 -466092 -416311 -426064 -418532 -426633 -449208
6228d49208j897m4950l3994K4087K2135K3731R211L267k9713o608l347k7301J4936
$$ -449208 -451105 -496055 -530049 -505962 -483827 -460096 -450885 -447618 -477331 -483939 -487286 -514587 -499651
6215d99651N291j6978J2409J5173K3463q487j6199k9211j1670K522J0411k6439
$$ -499651 -494360 -511338 -498929 -483756 -460293 -468780 -484979 -514190 -525860 -523338 -512927 -539366
6203e39366K3198K1170j1499J683J2079K264k550j773Q426J0544K4626K1815p76
$$ -539366 -516168 -494998 -506497 -504814 -492735 -490471 -493021 -494794 -486368 -475824 -451198 -429383 -430159
6190d30159l1293j256J3526o576o1639k6673j608k4773N2340J6351l6998L0736
$$ -430159 -461452 -462708 -449182 -455758 -517397 -544070 -545678 -570451 -518111 -501760 -538758 -508022
6178e08022L3392l7092l4000L6193N2442J381q271J9458J5803k4514Q423j9638
$$ -508022 -474630 -511722 -545722 -509529 -457087 -455706 -463977 -444519 -428716 -453230 -444807 -464445
6166d64445j8476m5145o261K1040K3411L718K475l0425k4576Q651L4106R4701
$$ -464445 -482921 -528066 -534327 -513287 -489876 -486158 -483683 -514108 -538684 -530033 -495927 -401226
6154d01226k8568q3602J5529L5253K2472m1014j1812j42j2775j2822J2999Q487
$$ -401226 -429794 -513396 -497867 -462614 -440142 -481156 -492968 -493110 -505885 -518707 -505708 -497221
6142d97221M722k1273k7838M5242q394J4853o405m193l3349J1327Q22j0109j6108
$$ -497221 -492499 -513772 -541610 -496368 -504762 -489909 -496314 -500507 -533856 -522529 -521707 -531816 -547924
6129e47924J1186L2485j0736L7218M2683j8346l8104K0318M554K7511L8034j1748
$$ -547924 -536738 -504253 -514989 -477771 -435088 -453434 -491538 -471220 -466666 -439155 -401121 -412869
6117d12869l5505j3779J3060M5628l1904k5730J011l799J728j1644k4037o426
$$ -412869 -448374 -462153 -449093 -403465 -435369 -461099 -460088 -463887 -462159 -473803 -497840 -504266
6105e04266j7613J0942J8672J3734j3602o276j3942k9703J0335M2326J4447q855
$$ -504266 -521879 -510937 -492265 -478531 -492133 -498409 -512351 -542054 -531719 -489393 -474946 -483801
6093d83801J3088K2089j2564J1785j2806o8096k036j3724K868L7247J5938j479
$$ -483801 -470713 -448624 -461188 -449403 -462209 -530305 -532341 -546065 -543197 -505950 -490012 -491491
6081d91491L3073M8838M006m0435j9858m90l2692k8317Q197N1755K792K2229j3332
$$ -491491 -458418 -409580 -405574 -446009 -465867 -466357 -499049 -527366 -519169 -467414 -464622 -442393 -455725
6068d55725k4820L5717J0j1859k3597L008O862l1431j1064L200L0822K4401L1785
$$ -455725 -480545 -444828 -444818 -456677 -480274 -477266 -470404 -501835 -512899 -509699 -478877 -454476 -422691
6055d22691J5818j9262l7157m8507K8889K6527P979l01M7704J0570m5117l6300
$$ -422691 -406873 -426135 -463292 -511799 -482910 -456383 -448404 -448705 -401001 -390431 -435548 -471848
6043d71848J5557k8231n4148R978L5594M4816j4081m1887P632R710l0135Q915
$$ -471848 -456291 -484522 -538670 -528692 -493098 -448282 -462363 -504250 -496618 -486908 -517043 -508128
6031e08128L6364K4748l5335m8391K6323N7674Q017N0854q80p1827n9287j1959
$$ -508128 -471764 -447016 -482351 -530742 -504419 -446745 -438728 -387874 -388754 -460581 -519868 -531827
6019e31827M149K6529l4998l9200M0314L3960R268K1584J8181k127k9916l5160
$$ -531827 -527678 -501149 -536147 -575347 -535033 -501073 -491805 -470221 -452040 -454167 -484083 -519243
6007e19243k1876j4957l574M182N530K8275Q571j3032K363L1660K5509Q730J0978
$$ -519243 -541119 -556076 -559650 -555468 -549938 -521663 -513092 -526124 -523761 -492101 -466592 -457862 -446884
5994d46884M270J8925j3787k4177q142N1084J0591q363k8282m1987N599K8378
$$ -446884 -442614 -423689 -437476 -461653 -469795 -418711 -408120 -416483 -444765 -486752 -481153 -452775
5982d52775L8406J8828j298j8355k6180l9761K0368P459n0128n769k67J441q666
$$ -452775 -414369 -395541 -396839 -415194 -441374 -481135 -460767 -453308 -503436 -509205 -509472 -508031 -516697
5969e16697n060L2332J6741j4873K6104L0486M5734J2763k4880m0303l5342r161
$$ -516697 -521757 -489425 -472684 -487557 -461453 -430967 -385233 -372470 -397350 -437653 -472995 -482156
5957d82156J7394r509p293J3447j9329M8528K6234k8070n9665k1596K5643J2140
$$ -482156 -464762 -474271 -481564 -468117 -487446 -438918 -412684 -440754 -500419 -522015 -496372 -484232
5945d84232Q896J2692P286K5368l442r92J6167K4195m0960n8005J2775K0856j8115
$$ -484232 -475336 -462644 -455358 -429990 -433432 -434424 -418257 -394062 -435022 -493027 -480252 -459396 -477511
5932d77511R305K2973l4824J3704J2047j3685k7673r27j4826n1630N7793M7176
$$ -477511 -468206 -445233 -480057 -466353 -454306 -467991 -495664 -496591 -511417 -563047 -505254 -458078
5920d58078J9967l0255l1965L2282l1659K6013K4990L0469k9262l4179J3927O181
$$ -458078 -438111 -468366 -500331 -468049 -499708 -473695 -448705 -418236 -447498 -481677 -467750 -461569
5908d61569m281K209K3496m371J2493j8776l8911J5323k9321m488k9072K7054
$$ -461569 -465850 -463641 -440145 -444516 -432023 -450799 -489710 -474387 -503708 -508196 -537268 -510214
5896e10214J2923j9676J5538o181M700Q03O122l9801L2210L5625k2213j3516L1757
$$ -510214 -497291 -516967 -501429 -507610 -502910 -502107 -495985 -535786 -503576 -467951 -490164 -503680 -471923
5883d71923M2047k9784m13k5520Q131j6291k6802L7967M819R446L0243l594l7136
$$ -471923 -429876 -459660 -460073 -485593 -477462 -493753 -520555 -482588 -477769 -468323 -438080 -441674 -478810
5870d78810P043M7258N848k0169k4520j6451j8053J4675p531j2295m332K1506
$$ -478810 -471767 -424509 -418661 -438830 -463350 -479801 -497854 -483179 -490710 -503005 -507337 -485831
5858d85831J0906L3787L0760k1966j5705M379o724P987l3478j3728J6490O6368
$$ -485831 -474925 -441138 -410378 -432344 -448049 -443670 -450394 -442407 -475885 -489613 -473123 -406755
5846d06755Q07j5801M8475n465J364j3102k9113j5691L2961j1600J1270J1250
$$ -406755 -405948 -421749 -373274 -378739 -377375 -390477 -419590 -435281 -402320 -413920 -402650 -391400
5834c91400j8720o4523l7871j0348J6829L2906K9044N0063K6068l5043o2995O196
$$ -391400 -410120 -474643 -512514 -522862 -506033 -473127 -444083 -394020 -367952 -402995 -465990 -459794
5822d59794J3088j1175k8804l7816K2642M7829l8165j6258j7267o306J1801J1640
$$ -459794 -446706 -457881 -486685 -524501 -501859 -454030 -492195 -508453 -525720 -532026 -520225 -508585
5810e08585K0484O080K067J9247L005J0647N906K853K189m9191p970J2366J0685
$$ -508585 -488101 -482021 -479954 -460707 -457702 -447055 -441149 -438296 -436107 -485298 -493268 -480902 -470217
5797d70217j4598L9340N8468o11K163j5571K7556J1737P694p606l0219l3408k0981
$$ -470217 -484815 -445475 -387007 -387618 -385455 -401026 -373470 -361733 -354039 -361645 -391864 -425272 -446253
5784d46253K0494q862k9228j4029J4274J0319L1784l8739k1537J0210K8090j5024
$$ -446253 -425759 -434621 -463849 -477878 -463604 -453285 -421501 -460240 -481777 -471567 -443477 -458501
5772d58501m2654k441K1691j7974k1930K3400L3824l2917j0327K2763l41K3700
$$ -458501 -501155 -503596 -481905 -499879 -521809 -498409 -464585 -497502 -507829 -485066 -485407 -461707
5760d61707J00758L3044m1578p593K5745l810n4114n7992k987j2111M9840Q929
$$ -461707 -360949 -327905 -369483 -377076 -351331 -355141 -409255 -467247 -470234 -482345 -432505 -423576
5748d23576P756l9441k9455J0082K8037j3271n0594l0916o984K8761M1627L9547
$$ -423576 -415820 -455261 -484716 -474634 -446597 -459868 -510462 -541378 -548362 -519601 -477974 -438427
5736d38427l4467m8919o704Q778o099J6079k5569K5856J844K1904K619m550N0202
$$ -438427 -472894 -521813 -528517 -519739 -525838 -509759 -535328 -509472 -507628 -485724 -483105 -487655 -437453
5723d37453K1542L989L003k0314k0201J8985K5386p869k8770j0389k677Q231j7316
$$ -437453 -415911 -411922 -408919 -429233 -449434 -430449 -405063 -412932 -441702 -452091 -454768 -446537 -463853
5710d63853j0110Q247j8136J9617L7317L491n128k1718O371J5335K1496J3382
$$ -463853 -473963 -465716 -483852 -464235 -426918 -423427 -428555 -450273 -443902 -428567 -407071 -393689
5698c93689j0055j7774Q484K0196J0043l4001l9637o2408j9969J8904K8117K4022
$$ -393689 -403744 -421518 -413034 -392838 -382795 -416796 -456433 -518841 -538810 -519906 -491789 -467767
5686d67767r154K0473j0720j2273k7935n222K9104Q615p984O497K0034N0061J7288
$$ -467767 -476921 -456448 -467168 -479441 -507376 -512598 -483494 -474879 -482863 -476366 -456332 -406271 -388983
5673c88983j6944o5669j5861p451K0484L7769J6877J2957L2143n4361l5765K3778
$$ -388983 -405927 -471596 -487457 -494908 -474424 -436655 -419778 -406821 -374678 -429039 -464804 -441026
5661d41026J8648K5824l0357m0734P675k1752J2773O904K7811m014M534L8097
$$ -441026 -422378 -396554 -426911 -467645 -459970 -481722 -468949 -462045 -434234 -438248 -433714 -395617
5649c95617K937n864l1363l0180J8995q329Q719K8833j2637o8531o174J2224j4642
$$ -395617 -392680 -398544 -429907 -460087 -441092 -449421 -440702 -411869 -424506 -493037 -499211 -486987 -501629
5636e01629m3141J4012M7364O909j63M8365m488m0129k1108J1490L0142o7145
$$ -501629 -544770 -530758 -483394 -476485 -476648 -428283 -432771 -472900 -494008 -482518 -452376 -519521
5624e19521l8871N5109M5923O559n2861l1559K8520M3477L9218L0387m3175k2917
$$ -519521 -558392 -503283 -457360 -450801 -503662 -535221 -506701 -463224 -424006 -393619 -436794 -459711
5612d59711L5267L6492n6281n3576M030k5193L2949M5994J0914m5715o8297J2366
$$ -459711 -424444 -387952 -444233 -497809 -493779 -518972 -486023 -440029 -429115 -474830 -543127 -530761
5600e30761L6799K6750L264o5419K6712K7023K4611o910O870M446L7905l4835
$$ -530761 -493962 -467212 -463948 -529367 -502655 -475632 -451021 -457931 -451061 -446615 -408710 -443545
5588d43545k8123k6618K2970N0065k2451k7376K0051K0968N101j4821K3177l5120
$$ -443545 -471668 -498286 -475316 -425251 -447702 -475078 -455027 -434059 -428958 -443779 -420602 -455722
5576d55722j0163L7137r404J8777L4020N6578l7325o4924j8268J779J5356J0472
$$ -455722 -465885 -428748 -438152 -419375 -385355 -328777 -366102 -431026 -449294 -447515 -432159 -421687
5564d21687j12J6359p572l2331J0996l744J5819K8024p151j4232J8649j4807k0811
$$ -421687 -421799 -405440 -413012 -445343 -434347 -438091 -422272 -394248 -401399 -415631 -396982 -411789 -432600
5551d32600r483k9839k5872L1046O4135J7943l5154j1393L2405K2225m3664J6030
$$ -432600 -442083 -471922 -497794 -466748 -402613 -384670 -419824 -431217 -398812 -376587 -420251 -404221
5539d04221k8262j4921K7890L4310J0139j9190o4513l4824K0051K475L8260J0358
$$ -404221 -432483 -447404 -419514 -385204 -375065 -394255 -458768 -493592 -473541 -471066 -432806 -422448
5527d22448L143N74j796M2509k5440m8440l4407K880l1590k4786J2415N6644L4885
$$ -422448 -419305 -418731 -420527 -378018 -403458 -451898 -486305 -483425 -515015 -539801 -527386 -470742 -435857
5514d35857Q081k1400J497j756M506J7693J5744l3176l7611j0406J2297K014l8059
$$ -435857 -427776 -449176 -447679 -449435 -444929 -427236 -411492 -444668 -482279 -492685 -480388 -478374 -516433
5501e16433L5343J8326L3349K3971L668O708j1663j7267m4152M7501l904k0363
$$ -516433 -481090 -462764 -429415 -405444 -401776 -395068 -406731 -423998 -468150 -420649 -424553 -444916
5489d44916Q945j812m7542j6157K1871K4412L3277K4664L2581K421m7749l0311
$$ -444916 -435971 -437783 -485325 -501482 -479611 -455199 -421922 -397258 -364677 -362256 -410005 -440316
5477d40316l4549k0443L9582J147J9350J1568R439N656J0852l0489k8321j955
$$ -440316 -474865 -495308 -455726 -454579 -435229 -423661 -414222 -408566 -397714 -428203 -456524 -458479
5465d58479K7803K7654N597k2082k8379m5351j3533N768l9855J8950M6679j8027
$$ -458479 -430676 -403022 -397425 -419507 -447886 -493237 -506770 -501002 -540857 -521907 -475228 -493255
5453d93255P628L2670J2614k3427m27l2994K0412L1680j2479K6165J089J4999
$$ -493255 -485627 -452957 -440343 -463770 -464197 -497191 -476779 -445099 -457578 -431413 -430324 -415325
5441d15325J1443M720o0753j9836N061j3236j8003J7547M5522J1616k0267k8960
$$ -415325 -403882 -399162 -459915 -479751 -474690 -487926 -505929 -488382 -442860 -431244 -451511 -480471
5429d80471P175L0811O729n196J1969M972o6728J126L8791L8834m594l4294k8154
$$ -480471 -473296 -442485 -435756 -440952 -428983 -424011 -490739 -489613 -450822 -411988 -416582 -450876 -479030
5416d79030J5433N767K2610K719j5975j0365L951K8081p829j6383n302J7888j1945
$$ -479030 -463597 -457830 -435220 -432501 -448476 -458841 -454890 -426809 -434638 -451021 -456323 -438435 -450380
5403d50380l065J03J4497K0827Q594j3384k3539J1531k7749j9264k3679K0255
$$ -450380 -453445 -453342 -438845 -418018 -409424 -422808 -446347 -434816 -462565 -481829 -505508 -485253
5391d85253J4725P30k4688l2811M3613K4660K6444K7168J7830l2446M757P936
$$ -485253 -470528 -469798 -494486 -527297 -483684 -459024 -432580 -405412 -387582 -420028 -415271 -407335
5379d07335p798P999o395l5159j78K8980K858j1486J8161J6931Q417L547j8687
$$ -407335 -415133 -407134 -413529 -448688 -448866 -419886 -417028 -428514 -410353 -393422 -385005 -381458 -400145
5366d00145l9738n419P989l3664o3331J2621R5082K3161l275r940n226L660L4157
$$ -400145 -439883 -445302 -437313 -470977 -534308 -521687 -426605 -403444 -406719 -416659 -421885 -418225 -384068
5353c84068K9819k110l3464J92l3292n1649M841L7936N779k3619p10L1329N299
$$ -384068 -354249 -356359 -389823 -389631 -422923 -474572 -469731 -431795 -426016 -449635 -450345 -419016 -413717
5340d13717K5820L8258j4602j6796q98j1191j9981j9848k2338J6489R724M5103
$$ -413717 -387897 -349639 -364241 -381037 -381935 -393126 -413107 -432955 -455293 -438804 -429080 -383977
5328c83977J7099j2810k5266p036K150M4703j0490j6931K1360j5752K9234J3760
$$ -383977 -366878 -379688 -404954 -411990 -409840 -365137 -375627 -392558 -371198 -386950 -357716 -343956
5316c43956m893q1225k4057L4119M2091l8782j1411M147n1304j3563K3788J3374
$$ -343956 -348849 -430074 -454131 -420012 -377921 -416703 -428114 -423967 -475271 -488834 -465046 -451672
5304d51672K1187J8188l0277l9574j7544J7455K5843k1896k6172L9925R857j7184
$$ -451672 -430485 -412297 -442574 -482148 -499692 -482237 -456394 -478290 -504462 -464537 -454680 -471864
5292d71864M0827K2902j3485L978K6927o676l3367j7200K6305n877M3568K4628
$$ -471864 -431037 -408135 -421620 -417642 -390715 -397391 -430758 -447958 -421653 -427530 -383962 -359334
5280c59334Q51l7102j503n306l6416l3872L460M2452J868j6380P209L6301K1103
$$ -359334 -358483 -395585 -397088 -402394 -438810 -472682 -469222 -426770 -424902 -441282 -434073 -397772 -376669
5267c76669k1683j8284k4640P263M5927L5555m467j0105J6464k0697j2152K0336
$$ -376669 -398352 -416636 -441276 -434013 -388086 -352531 -356998 -367103 -350639 -371336 -383488 -363152
5255c63152k3181n6097n578M3275M591l0204K8884K4436k9513m1701J4202M1188
$$ -363152 -386333 -442430 -448008 -404733 -400142 -430346 -401462 -377026 -406539 -448240 -434038 -392850
5243c92850k1896j5693J198J6960K9497L452m3269p140L4077J2885j3268K1655
$$ -392850 -414746 -430439 -429241 -412281 -382784 -379332 -422601 -429741 -395664 -382779 -396047 -374392
5231c74392L757K750m088J4114j2906o3023j5037R46k7980p65J9260j6079M916
$$ -374392 -370635 -367885 -371973 -357859 -370765 -433788 -448825 -447879 -475859 -476624 -457364 -473443 -468527
5218d68527L8023K7616r038j7909R283J1118J250j1517k3349N433M6832k711k5958
$$ -468527 -430504 -402888 -411926 -429835 -420552 -409434 -408184 -419701 -443050 -437617 -390785 -393496 -419454
5205d19454K4276j8390R637j1427q46M8226P88k6083j8489j1976o566K654k713
$$ -419454 -395178 -413568 -403931 -415358 -416204 -367978 -367190 -393273 -411762 -423738 -430304 -427650 -430363
5192d30363K6728J9170K4919M665l3216k9108N454n2853k4161K7416M107r395
$$ -430363 -403635 -384465 -359546 -354881 -388097 -417205 -411751 -464604 -488765 -461349 -457242 -466637
5180d66637M575o498K3142J3976K4076l9783l7015L6456L3093k2240l2270O513
$$ -466637 -462062 -468560 -445418 -431442 -407366 -447149 -484164 -447708 -414615 -436855 -469125 -462612
5168d62612J9845J5907J186R208l0931j7454L3722L5324k0376k6058J441j0204
$$ -462612 -442767 -426860 -425674 -416466 -447397 -464851 -431129 -395805 -416181 -442239 -440798 -451002
5156d51002j213n833r445l464L643L0347R122r583M6946j4773R819q693j3740
$$ -451002 -452215 -458048 -467493 -470957 -467314 -436967 -427845 -437428 -390482 -405255 -395436 -404129 -417869
5143d17869l2531k5268N0574Q21l2126n860m3069k0535L614O9575N3151L8294
$$ -417869 -450400 -475668 -425094 -424273 -456399 -462259 -505328 -525863 -522249 -452674 -399523 -361229
5131c61229N4622N089m2868k7745r649m7219k6075K6890K6329o522j6245m951
$$ -361229 -306607 -301518 -344386 -372131 -381780 -428999 -455074 -428184 -401855 -408377 -424622 -429573
5119d29573M2247Q899J2100L5716J1468k0547l3069k6862o767r6l688O457q215
$$ -429573 -387326 -378427 -366327 -330611 -319143 -339690 -372759 -399621 -406388 -406484 -410172 -403715 -411930
5106d11930m88j0682q208J0288j9870n2700L5957K0762M4840k9773o1163K6166
$$ -411930 -412418 -423100 -431308 -421020 -440890 -493590 -457633 -436871 -392031 -421804 -482967 -456801
$$ [...]
##END NTUPLES=NMR SPECTRUM
##END=
