##TITLE=Analysis number 327186
Compound Code cc 61414
Book Reference 449/188
Project Code adrs
Chemist Name davee
##JCAMPDX= 6.0         $$ Bruker NMR JCAMP-DX V2.0
##DATA TYPE= NMR SPECTRUM
##DATA CLASS= NTUPLES
##ORIGIN= Bruker BioSpin GmbH
##OWNER= nmr
$$ XWIN-NMR		Version 3.5
$$ Wed Mar 14 11:48:56 2007 GMT Standard Time (UT+0h)  MAYBRIDGE\nmr@NMR_250MHZ
##.OBSERVE FREQUENCY= 250.131544655141
##.OBSERVE NUCLEUS= ^1H
##.ACQUISITION MODE= SIMULTANEOUS (DQD)
##.ACQUISITION SCHEME= undefined
##.AVERAGES= 16
##.DIGITISER RES= 18
##SPECTROMETER/DATA SYSTEM= dpx250
##.PULSE SEQUENCE= zg30
##.SOLVENT NAME= CDCl3
##.SHIFT REFERENCE= (INTERNAL, CDCl3, 0, 16.4575)
##AUDIT TRAIL= $$ (NUMBER, WHEN, WHO, WHERE, WHAT)
$$ ##TITLE= Audit trail, XWIN-NMR		Version 3.5
$$ ##JCAMPDX= 5.01
$$ ##ORIGIN= Bruker BioSpin GmbH
$$ ##OWNER= nmr
$$ C:\u/data/dgb/nmr/ADRS/880/pdata/1/auditp.txt
$$ ##AUDIT TRAIL=  $$ (NUMBER, WHEN, WHO, WHERE, WHAT)
(   1,<2007-03-14 11:48:36.15 +000>,<MAYBRIDGE\nmr>,<NMR_250MHZ>,
      <created by zg, POWCHK disabled, PULCHK disabled
       configuration hash MD5:
       49 4B E0 1D 92 C2 6B 37 9F E6 65 BC 52 41 86 1D
       data hash MD5: 64K
       81 59 7D 48 7B 93 56 E9 BC 92 55 3D D1 B4 65 A4>)
(   2,<2007-03-14 11:48:48.32 +000>,<MAYBRIDGE\nmr>,<NMR_250MHZ>,
      <Start of raw data processing
       ef LB = 0.3 FT_mod = 6 PKNL = 1 SI = 32K 
       data hash MD5: 32K
       94 70 5F 4B 21 03 E1 B2 53 DB BB 69 F7 FE C1 8A>)
(   3,<2007-03-14 11:48:50.10 +000>,<MAYBRIDGE\nmr>,<NMR_250MHZ>,
      <apk 
       data hash MD5: 32K
       2B EC 33 10 37 69 5A C7 0C 8A 5A B1 71 A8 C4 03>)
(   4,<2007-03-14 11:48:50.79 +000>,<MAYBRIDGE\nmr>,<NMR_250MHZ>,
      <abs ABSG = 5 
       data hash MD5: 32K
       5F AF D9 60 0B A3 24 1D 1A 8E 26 C4 ED FC 7C 0A>)
$$ ##END=
$$ 
$$ hash MD5
$$ BF F7 DB 3C A3 FC 28 63 28 00 57 00 C6 51 45 16
##$RELAX= 
##$RELAX= 
##$RELAX= 
##$RELAX= 
##$RELAX= 
##$RELAX= 
##$RELAX= 
$$ Bruker specific parameters
$$ --------------------------
##$DU= <C:\u>
##$EXPNO= 880
##$NAME= <ADRS>
##$PROCNO= 1
##$TYPE= <nmr>
##$USER= <dgb>
##$AMP= (0..31)
100 100 100 100 100 100 100 100 100 100 100 100 100 100 100 100 100 100 
100 100 100 100 100 100 100 100 100 100 100 100 100 100 
##$AQSEQ= 0
##$AQ_mod= 3
##$AUNM= <au_zg>
##$AUTOPOS= <28 >
##$BF1= 250.13
##$BF2= 250.13
##$BF3= 250.13
##$BF4= 250.13
##$BF5= 500.13
##$BF6= 500.13
##$BF7= 500.13
##$BF8= 500.13
##$BYTORDA= 1
##$CFDGTYP= 0
##$CFRGTYP= 5
##$CHEMSTR= <none>
##$CNST= (0..31)
1 1 145 1 1 1 1 1 1 1 1 1 1 1 1 1 1 1 1 1 1 1 1 1 1 1 1 1 1 1 1 1 
##$CPDPRG= <>
##$CPDPRG1= <>
##$CPDPRG2= <>
##$CPDPRG3= <>
##$CPDPRG4= <mlev>
##$CPDPRG5= <mlev>
##$CPDPRG6= <mlev>
##$CPDPRG7= <mlev>
##$CPDPRG8= <mlev>
##$CPDPRGB= <>
##$CPDPRGT= <>
##$D= (0..31)
0 1 0 0 0 0 0 0 0 0.06 0 0 0 0 0 0 0.0002 0 0 0 0 0 0 0 0 0 0 0 0 0 0 
0 
##$DATE= 1173872915
##$DBL= (0..7)
120 120 120 120 120 120 120 120 
##$DBP= (0..7)
150 150 150 150 150 150 150 150 
##$DBP07= 0
##$DBPNAM0= <>
##$DBPNAM1= <>
$$ [...]
##$SUBNAM7= <"">
##$SUBNAM8= <"">
##$SUBNAM9= <"">
##$SW= 20.6930455092707
##$SWIBOX= (0..15)
0 0 3 0 0 0 0 0 0 0 0 0 0 0 0 0 
##$SW_h= 5175.983436853
##$TD= 65536
##$TD0= 1
##$TE= 683.16
##$TE2= 300
##$TE3= 300
##$TEG= 300
##$TL= (0..7)
0 120 120 120 120 120 120 120 
##$TP= (0..7)
150 150 150 150 150 150 150 150 
##$TP07= 0
##$TPNAME0= <>
##$TPNAME1= <>
##$TPNAME2= <>
##$TPNAME3= <>
##$TPNAME4= <>
##$TPNAME5= <>
##$TPNAME6= <>
##$TPNAME7= <>
##$TPOAL= (0..7)
0.5 0.5 0.5 0.5 0.5 0.5 0.5 0.5 
##$TPOFFS= (0..7)
0 0 0 0 0 0 0 0 
##$TUNHIN= 0
##$TUNHOUT= 0
##$TUNXOUT= 0
##$USERA1= <user>
##$USERA2= <user>
##$USERA3= <user>
##$USERA4= <user>
##$USERA5= <user>
##$V9= 5
##$VALIST= <valist>
##$VCLIST= <CCCCCCCCCCCCCCC>
##$VD= 0
##$VDLIST= <DDDDDDDDDDDDDDD>
##$VPLIST= <PPPPPPPPPPPPPPP>
##$VTLIST= <TTTTTTTTTTTTTTT>
##$WBST= 1024
##$WBSW= 4
##$XGAIN= (0..3)
0 0 0 0 
##$XL= 0
##$YL= 0
##$YMAX_a= 474627
##$YMIN_a= -529997
##$ZGOPTNS= <>
##$ZL1= 120
##$ZL2= 120
##$ZL3= 120
##$ZL4= 120
##$ABSF1= 16.45752
##$ABSF2= -4.235653
##$ABSG= 5
##$ABSL= 3
##$ALPHA= 0
##$AQORDER= 0
##$ASSFAC= 0
##$ASSFACI= 0
##$ASSFACX= 0
##$ASSWID= 0
##$AUNMP= <proc_1d>
##$AZFE= 0.1
##$AZFW= 0.1
##$BCFW= 0
##$BC_mod= 0
##$BYTORDP= 0
##$COROFFS= 0
##$CY= 12.5
##$DATMOD= 1
##$DC= 0
##$DFILT= <>
##$DTYPP= 0
##$F1P= 14.0000005364418
##$F2P= -0.99999901652339
##$FCOR= 0.5
##$FTSIZE= 32768
##$FT_mod= 6
##$GAMMA= 0
##$GB= 0
##$INTBC= 1
##$INTSCL= 1
##$ISEN= 128
##$LB= 0.3
##$LEV0= 0
##$LPBIN= 0
##$MAXI= 10000
##$MC2= 0
##$MEAN= 0
##$ME_mod= 0
##$MI= 0
##$NCOEF= 0
##$NC_proc= -2
##$NLEV= 6
##$NOISF1= 0
##$NOISF2= 0
##$NSP= 0
##$NTH_PI= 0
##$NZP= 0
##$OFFSET= 16.45752
##$PC= 1
##$PHC0= 228.6962
##$PHC1= 8.876881
##$PH_mod= 1
##$PKNL= yes
##$PPARMOD= 0
##$PSCAL= 4
##$PSIGN= 0
##$REVERSE= no
##$SF= 250.130016126614
##$SI= 32768
##$SIGF1= 0
##$SIGF2= 0
##$SINO= 400
##$SIOLD= 32768
##$SREGLST= <1H.CDCl3>
##$SSB= 0
##$STSI= 32768
##$STSR= 0
##$SW_p= 5175.98343685301
##$SYMM= 0
##$S_DEV= 0
##$TDeff= 65536
##$TDoff= 0
##$TI= <Analysis number 999999
Compound Code 99
Book Reference 9
Project Code 9>
##$TILT= no
##$TM1= 0
##$TM2= 0
##$TOPLEV= 0
##$USERP1= <user>
##$USERP2= <user>
##$USERP3= <user>
##$USERP4= <user>
##$USERP5= <user>
##$WDW= 1
##$XDIM= 32768
##$YMAX_p= 347445345
##$YMIN_p= -53538
$$ End of Bruker specific parameters
$$ ---------------------------------
##NTUPLES= NMR SPECTRUM
##VAR_NAME=  FREQUENCY,     SPECTRUM/REAL,   SPECTRUM/IMAG
##SYMBOL=    X,             R,               I
##VAR_TYPE=  INDEPENDENT,   DEPENDENT,       DEPENDENT
##VAR_FORM=  AFFN,          ASDF,            ASDF
##VAR_DIM=   32768,         32768,           32768
##UNITS=     HZ,            ARBITRARY UNITS, ARBITRARY UNITS
##FACTOR=    0.157963299565203, 1,           1
##FIRST=     4116.51962575563, 0,            0
##LAST=      -1059.46381109738, 0,           0
##MIN=       -1059.46381109738, -53538,      0
##MAX=       4116.51962575563, 347445345,    0
$$ Real data points
##PAGE= N=1
##DATA TABLE= (X++(R..R)), XYDATA
$$ [...]
16734D2370o480j303n119K992r589N633O431J986p757M254L1905M2038K3237n758
16720A24840j6678j6530J6104K6218K9650K1013j0738k6208r736o572k7465l2090
16708G1808j0733m401j2553N85J1195j454j1240M814L2303L5867L3615R627j6750
16695A42683q621r338j5653k0643j7085k3124j1897L206N134P309j4507p754J1765
16682D1475L15p201K629p605j5611j3056M339K245k699K936L808P032M699j161
16668B2145j0511k147N032j3652o261L42Q54J1418N409l324k771K959J005p867
16654B631j0916R032J0452l224p500j0740o893o443J2079J9667J270L115O778
16641A9308n217k160o351n029R128k540o378R408j549l043J0315J6506R29k2933
$$ y = [42370, 35890, 34587, 29468, 32460, 22871, 28504, 34935, 36921, 29164, 33418, 65323, 107361, 130598, 124840, 108162, 91632, 107736, 133954, 163604, 184617, 173879, 147671, 137935, 131363, 103898, 71808, 61075, 56674, 44121, 44706, 55901, 54447, 43207, 48021, 80324, 116191, 149806, 159433, 142683, 134062, 124724, 109071, 88428, 71343, 48219, 36322, 39528, 44662, 51971, 37464, 29710, 41475, 41790, 34589, 37218, 29613, 14002, 946, 5285, 7530, 4831, 7767, 11575, 18607, 23306, 22145, 11634, 9487, 14519, 867, -5394, -5052, -4198, 7220, 12629, 9305, 6534, 9493, 10498, 2631, -8285, 747, 11199, 7975, 475, -10265, -17158, -23601, -11522, 8145, 9415, 12530, 19308, 14091, 11931, 5580, 551, 9679, 7139, 761, 10169, 8620, 5577, 15892, 32398, 33327, 10394]
16627A0394j1155j581k198P912L007j2746O81K0334J7385o821p641M633L282N756
16613C1242l573k931j124q562j250K56j0111n981o226R207L61M356r8m158M43
16598A851J356k215o823Q226J7j1685Q433M742m936J6246J7739o776p413j2397
16584F365m514P166k083M874J1864m5q050r933p460O113K290p8L651J221N56n687
16568F250J238N966M137O29k609o898N087k448k0340k663J2209P830K232P785
16554A8405L31l729o466l841m778j777J0760n173r421j0554j166L092P181J6521
16540I385j865K334L501q843m225M059j2749Q69N589J0523J0852m058r987k1034
16526a5649m096N449m09Q418K014K49M851N253M928J873m092j2036m653K107L426
$$ y = [10394, -761, -2342, -4540, 3372, 6379, -6367, -5686, 14648, 32033, 25212, 17571, 22204, 25486, 31242, 27669, 24738, 23614, 15052, 13802, 14058, 3947, -2034, -8260, 947, 1308, 5664, 5566, 1408, 1851, 3207, 992, -5831, 2395, 2412, -9273, -840, 3902, -1034, 15212, 32951, 26175, 18762, 6365, 1851, 9017, 6934, 11808, 23672, 23627, 15577, 5644, -1816, 4297, 6587, 6509, 10160, 11381, 11937, 6250, 7488, 13454, 17591, 18220, 15611, 8713, 13800, 11352, -8988, -11651, 558, 8388, 10620, 18405, 18736, 15007, 8541, 4700, -78, -1855, 8905, 3732, -5689, -16243, -17409, -14317, -7136, 9385, 7520, 9854, 13355, 4512, 287, 4346, -8403, -7534, -1945, 8578, 19430, 15372, 5385, -15649, -19745, -14296, -14705, -6287, -4273, -4024, 827, 6080, 11008, 12881, 8789, -3247, -7900, -5793, -2367]
16511b367k535N028J0602K046j0366r641J1858q368K79P992q309N167O835P087
16497A5308l982p351j3225k514M220K323j315Q50K060j108J719N18O308p0j109
16482B632N314m786j8025l576J302M707J4478M710n721P93o290r220r247N52L852
16467a8525K824P448N061O771m02m182M746j40P54M249j13j302R283N527R813
16452C1812L150j5737M771o460n435q680p52n842J519Q141N829k731o936N88P343
16437A0580r56M017K986K64o446K701j2276q548M364m820j885J3125l650L26M876
16422D658l171j2816o030Q445J0623n886m8N419o795P861N402l950j717l275M160
16407B880L742k683J7P856n032K156j801m784M63R835l979j5049o628M807K107
$$ y = [-2367, -4902, 126, 10728, 12774, 2408, -7233, 4625, -3743, -3464, 4528, -3781, 1386, 8221, 15308, 11326, 3975, -9250, -11764, -7544, -5221, -6536, -5686, -3626, -4734, -3015, -2497, 3811, 3741, 2632, 7946, 3160, -14865, -18441, -17139, -12432, 2046, 6756, 1035, 1828, -4462, -13682, -22929, -22377, -18525, -15701, -8253, -3192, 3579, 3177, -1005, 3741, 3601, 4355, 8604, 8491, 7189, 16472, 21999, 31812, 34962, 19225, 23996, 17536, 12101, 3421, 2669, -3173, -1654, 6487, 12316, 9585, 2649, 3237, 10580, 9624, 13641, 16627, 16891, 10445, 13146, 870, -7678, -3314, -8134, -10019, 3106, -544, -218, 4658, 1487, -11329, -17359, -8914, 1709, -4177, -4225, 1194, -5601, 2260, 7662, 3712, 1995, -1280, 2880, 6622, 3939, 3956, 11812, 6780, 8936, 7135, 2351, 2814, 12649, 8670, -6379, -13007, -8200, -6093]
16392f093k780O890M4Q520j632m292p242K208M604L836j5878j00m362l575k703
16377b2555N902J7833J1486o059P035J362L193l386r522r700k366Q24l872k148
16363a1973n934J0454J2241l968o085j696j126m667J62L085p417J4461M830o217
16349c850p680j335O830N883M187q379m253N861P639j51n649o23R562p156p490
16334f604K189M207K493O661P97m97K3k461N091Q179j3924q254j0111K432P940
16319a839N340M039j2060q660N075L848j074P712O951o37k299n8J448O48l779
16304D655M677O208l587o881j250J2494q482K79q02M46j2068m176K760M114r882
16289a1495p44J1996K165K010o125O362R103J740K186j7M05n85L31l491j1664
$$ y = [-6093, -8873, -1983, -1939, 6581, 4949, 657, -6585, -4377, 227, 4063, -11815, -11915, -16277, -19852, -22555, -16653, 1180, 12666, 6607, 13642, 15004, 18197, 14811, 5289, -4411, -6777, -5953, -9825, -11973, -17907, -7453, 4788, 820, -5265, -6961, -8087, -12754, -12592, -9507, -16924, -2463, 2367, -3850, -11530, -12865, -6035, -152, 4035, -4344, -8597, -2736, 4903, 4752, -897, -1520, 8042, 886, -6604, -4415, -208, 2285, 8946, 9743, 9246, 9269, 6808, 11899, 20078, 6154, -2100, -12211, -9779, -1839, 3501, 7540, -4520, -13180, -8105, -4257, -5331, 2381, 9332, 8695, 6396, 6338, 7786, 8434, 4655, 9332, 15540, 11953, 5072, 3822, 16316, 7834, 8113, 7311, 7757, -4311, -8487, -5727, -1613, -11495, -12239, -243, 1922, 3932, -2193, 4169, 13272, 15012, 17198, 17181, 17586, 17001, 17332, 13841, 2177]
16274B177j4349r757l580M852N336o521J4560Q308R79q594j1252P437J0412O934
16260F942j237R175q38J240R157q141r846M579k878J0387n945j1269j916M135
16246C545J26j3431P952K182N404K537M698j0549p907m186R517l146m160Q21N608
16231i89M327J507j673m142j69P252p44j0938j4114o39J1017M602p020R179Q205
16216E661K488n355j576M979l228O77k550k343k059L503m850j3162j352P749Q354
16201c064J0862N803N623j0270o847R697Q902Q6p241j2110l942L737K8N316p612
16186a032j6271O244Q019J1157m644j4591l322O894N581n684J1286P977o51P38
16172A1701R114q896r465L101Q268k776M246O340K987p754l946J988l245j5616
$$ y = [2177, -12172, -21929, -25509, -20657, -15321, -21842, -7282, 1026, 2005, -6589, -17841, -10404, 8, 6942, 5705, 14880, 14042, 15282, 24439, 16298, 6452, 11031, 8153, 18540, 12595, 1326, -590, 3545, 3671, -9760, -1808, 374, 5778, 8315, 13013, 2464, -5443, -9629, -112, -3258, -7418, -6597, -989, 3338, 4845, 3172, -970, -1139, 6113, 5369, -5569, -19683, -20322, -9305, -4703, -11723, -2544, 5661, 8149, 2794, 1218, 6197, 2969, 3646, 1096, -1247, -3306, 197, -4653, -17815, -19167, -11418, -3064, 7798, 13601, 19224, 8954, 2107, 11804, 20706, 20792, 13551, 1441, -2501, 1236, 1264, 6580, -1032, -17303, -11059, -3040, 8117, 3473, -11118, -14440, -7546, -1965, -7649, 3637, 11614, 10963, 11701, 20815, 11919, 2454, 5555, 13823, 11047, 15293, 21633, 24620, 16866, 12920, 14908, 11663, -3953]
16158c953j2425O285K805P974J082j014J098K414l203j16l751N03q972M307N426
16143a540J806p668m294p089K371J4294J275L617J689O82l782j3355N152J4269
16129G427k172k47J100l881j996k870K034J0733K27j780M19N087j924p3L542p411
16113H215n150n67J1430N557j1938n894m670j166o158j621l452J672M911N889
16099b942J012R627o554m638O439M95o406k014J336O052Q969L551r398l96l914
16084A219j3450q961J1241J632J801P343J0332n677j5268j4928kN365J7322L383
16070A352L073j86k613k962K642N98q076J77m235m069K226M169N720j638R06J501
16054a415j1422M216j301j859P063j067r099p705n803O191J2931M82q636J0797
$$ y = [-3953, -16378, -10093, -7288, 686, 1768, 754, 1852, 4266, 1063, 947, -2804, -2301, -11273, -6966, -1540, 266, -7402, -11696, -18785, -16414, -2120, -845, 2772, 4461, 5143, 1361, -11994, -6842, 7427, 5255, 5008, 6108, 2227, 231, -2639, -605, 10128, 10355, 8575, 8994, 14081, 12157, 12084, 15626, 8215, 3065, 2498, 13928, 19485, 7547, 1653, -3017, -4183, -10341, -11962, -15414, -13742, -8831, -2942, -1930, 7697, 1143, -3495, 2944, 3439, -2967, -4981, -3645, 2407, 11376, 14927, 5529, 5133, 1219, -12231, -21192, -9951, -8319, -6518, 825, 11157, 5480, -9788, -24716, -24718, -19353, -2031, 1352, 4425, 4239, 1626, -1336, 1306, 1904, -6172, -5995, -10230, -14299, -12073, -7904, -2184, -3822, -2916, -1415, -12837, -8621, -9922, -11781, -4718, -5785, -14884, -22589, -28392, -22201, -9270, -8788, -17424, -6627]
16040f627J1597j4346k056L541N922k497J1994P519l729p967J8P894L55L587j1981
16025C224j2963N853j485j0244J3687N415j2056j3525N675J8868Q609M887k426
16012A3519l692r217j3055P714J2446J051J97q725k536p619M116J3145m647J035
15998C732l06o19J6650l227j3825J264O642J5067q895j5926J497l145j630n93
15984c314p217O958L099k524j1154K560k647K367K364P711J0843n863j1303R395
15970A275P824p112q758j564m562l324M866K958j898O375N354J398Q677k332J146
15955A0323K115j903o620q682k0992J281J3689K987j250L564p365j3126L982L128
15941a8869M27k512P679J3426R429K534j0894j4195n14J1450N917N015j1376j43
$$ y = [-6627, 4970, -9376, -11432, -7891, -1969, -4466, 7528, 15047, 11318, 3351, 3369, 11263, 11618, 15205, 3224, -9739, -3886, -5371, -15615, -1928, 3487, -8569, -22094, -16419, 2449, 11058, 15945, 13519, 9827, 610, -12445, -4731, 7715, 8766, 8963, 238, -2298, -9917, -5801, 7344, 2697, 3732, 3426, 2807, 19457, 16230, 2405, 3669, 10311, 25378, 16483, 557, 2054, -1091, -2721, -3314, -10531, -3573, -474, -2998, -14152, -11592, -14239, -11872, -9508, -1797, 9046, 3183, -8120, 1275, 9099, 1987, -6771, -8335, -12897, -16221, -11355, -8397, -10295, -3920, 1434, 2832, 11509, 9177, 10323, 12438, 10535, 3915, -4767, -25759, -24478, -10789, -7802, -9052, -5488, -12853, -25979, -21997, -18869, -18442, -20954, -13275, 151, 9580, 12114, 1220, -12975, -13489, -2039, 3878, 8893, -2483, -2626]
15927b626k846Q745N254n804j487l00n763M694M878l941mL403J717m705r36Q275
15911H554m294N121L766j4025p769R013L546l381K187J5711n095N320m585k1286
15897g217k128Q225K607R607L75p524j3668n412J2134J2321l204l33k54m32n494
15882c97r052L268L196p605M95J0980J053K839n206j3517k75J0663J200P064m383
15867C23j5948L35J2597J5948J652j2223j2986j3624l966Q428L091o351Q533P187
15853g004M177J082L93m960N912P251j0484O736m446m853l68k980J0188J867N434
15838G945K541p688q278j091Q696k591m459Q560m726M555N658M611J925r583n204
15823H71j929K159p64j413q08n350j299Q399l931m053j2358J565J3568R85j3184
$$ y = [-2626, -5472, 3273, 8527, 2723, 1236, 936, -4827, -133, 4745, 804, 800, 4203, 5920, 1215, 279, 8554, 4260, 9381, 13147, -878, -8647, 366, 3912, 531, 2718, 18429, 13334, 18654, 14069, -7217, -9345, -1120, 1487, 11094, 11469, 3945, -9723, -15135, -3001, 9320, 6116, 5783, 5529, 5097, -397, -9449, -6181, -2985, -10590, -10095, 885, 1938, 4777, -429, -13946, -14221, -3558, -2358, 4706, 323, -15625, -15290, -2693, 13255, 14907, 2684, -10302, -23926, -27892, -19464, -16373, -22724, -14191, -7004, -2827, -1745, -1352, -6312, -400, 6851, -3633, 3103, -1343, -6196, -6564, -9544, 644, 2511, 7945, 10486, 2798, -5480, -6571, 2125, -466, -4925, 3635, -1091, 3464, 9122, 13733, 15658, 6075, 871, -1058, 1101, 337, -1076, -1884, -7234, -8533, -134, -4065, -8118, -20476, -18911, -5343, -4358, -17542]
15808a7542O90J2784M59P104j116m308o47N768J4239m90j223r691j453n49N454
15793I479k547n910P178Q916j0806K93l7m988m460j037N461l082o842p81J22J1037
15777A996J1371l557K151m085j179M228L20j2557k036k81j0645j830Q325m625
15763a2404P138J1184o519q479l087l007p751P898J8546j732K846P657M675m023
15749A2942m40k103n439r708q322R990J2760m615L685l85l659O832J84J1429o944
15734A6207N927p691q531l750P56L702n215o245N057J2985R72k661n321r717M4
15719c481N658m900J1327l303n433J0609M817p415q262l481N107r778j5378P34
15705b3179J0941R346P477p421J186N533r708M899m714j0133R72Q275n431J725
$$ y = [-17542, -16852, -4068, -3609, 3495, 2379, -1929, -2576, 3192, 17431, 16941, 15718, 6027, 4574, 4025, 9479, 6932, 1022, 8200, 17116, 6310, 6603, 6566, 1578, -2882, -3919, 1542, -1540, -8382, -9163, -9041, 1996, 13367, 9810, 11961, 7876, 6697, 10925, 11245, -1312, -3348, -3629, -14274, -16104, -7779, -12404, -5266, 5918, -601, -9080, -12167, -15174, -22925, -15027, 3519, 1787, 4633, 12290, 16965, 12942, 12502, 10399, 4960, -4748, -13070, -3080, 9680, 5065, 8750, 8365, 4706, 11538, 11722, 23151, 16207, 22134, 14443, 5912, 2162, 2918, 6620, 1405, -4840, 217, 13202, 14174, 11513, 6192, -3525, -3481, 2177, -2723, 8604, 5301, -132, 10477, 15294, 7879, -383, -3864, 1243, -8535, -23913, -23179, -12238, -2892, 4585, -2836, -1650, 3883, -5825, -926, -5640, -15773, -14801, -6526, -11957, -10232]
15691a0232l286j378n243Q233N808k209J1793J0556p730j5800j2496R358l831
15678a6457k878Q668M849P739J9166N458n366o050q831J3204k923m138j3936l584
15664e079m91J1157P518l186K186K758p483P84L771N01L489m136l781M50n232
15649C226p298L460J3099o532r922P624O968N295j0126n840M297N261r096j47
15635B69j5835o074L182J1401J1136l311R194j09l419j7582q268L661J0254O564
15621A063K710J715j2186J697j792Q056J0286O334n974l431j2474M080M741l296
15607A529k123P746l556N038k782m833m808K183J157o397M75M037QM820m741m457
15591f704J876K808O214J1447p659q555r758P471J296l418N382l500l230M032
$$ y = [-10232, -13518, -14896, -20139, -11906, -6098, -8307, 3486, 14042, 6312, -9488, -21984, -12626, -16457, -19335, -10667, -5818, 1921, 21087, 26545, 21179, 15129, 6298, 19502, 16579, 12441, -1495, -5079, -5570, 5587, 13105, 9919, 12105, 14863, 7380, 8164, 11935, 12436, 15925, 11789, 8008, 8458, 3226, -4072, -612, 12487, 5955, -3967, 3657, 10625, 15920, 5794, -46, 4251, 9512, 416, 269, -15566, -21640, -18458, -7057, 4079, 768, 9962, 9853, 6434, -11148, -19416, -15755, -5501, 1063, 3773, 5488, -6698, -5001, -6793, 1263, 11549, 17883, 11909, 8478, -3996, 84, 4825, 1529, -594, 7152, 3596, 8634, 5852, 1019, -3789, -1606, -449, -6846, -6371, -2334, -2326, 2494, -2247, -6704, -4828, -2020, 4194, 15641, 7982, -573, -10331, -2860, -1564, -4982, 400, -3100, -6330, -2298]
15577b298J244Q447J2070l727j2631J67l056j1969J210P668J2247P628j0484j6008
15563i492j3222m854J734J2807J1569K586m206M829J70q425P558Q125j0231j1897
15549a2949k586l069O314M945k975K445M134K547O700M823q626q399r031k665
15535a8392M888K583P408Q492l269O926l062j0153j0112K364R61m467M430J4964
15521C561L92j5317K107N161j1455l231J2471m164m447J453L276K138J57M341
15507c557r79M944P903m713j39n67r921M103K722r874j383n943J3093n914K474
15492g751R052N073j47m578n745L057L873n201m145K807N383j558L23L469j464
15477B448j254k740k023R361m95p037k688k209L774J500L526J973l46m157p239
$$ y = [-2298, -1054, 7393, 19463, 15736, 3105, 3272, 216, -11753, -10543, -2875, 9372, 17000, 6516, -9492, -22714, -27568, -25834, -13027, -1458, 1128, -3078, 1751, 1921, -6504, 1054, 9179, -1052, -12949, -15535, -18604, -12290, -7345, -10320, -7875, -3741, -1194, 5506, 10329, 1703, -6696, -15727, -18392, -13504, -10921, -3513, 4979, 1710, 8636, 5574, -4579, -14691, -12327, -11366, -15833, -11403, 3561, 3953, -11364, -9257, -4096, -15551, -18782, -6311, -10475, -14922, -13469, -10193, -8055, -7898, -3557, -4536, 408, 8311, 3598, 3459, 2892, -7029, -2926, -204, -10078, -11461, -17404, -4311, -10225, -7751, 1301, 6374, 6227, 1649, -4096, -1039, 2834, -2367, -6512, -3705, 1678, 120, 443, 3912, 2448, 1194, -1546, -3569, 5792, 5297, -1740, -4428, -6637, -2863, -1363, 2163, 4136, 3790, -367, -7606]
15462g606p480K946p673M168O964K976J4910M115J219j236K256O460l317n990
15448A2712j0206o544M561l319k587k568j568P27r804M908j007k272M230K233
15434a0504k502J256m623R658J765M255Q734m818j7109j1833j372R027P733K966
15420g367N605J0501J27L675p721n027Q358j2303k140m88j843q234n842P345J3948
15405a406Q920l59k0628l701Q107J3070j735K609M446J280m941q374o844l967
15391a3523p95r578P571J0184M096M754K884p746j675L633n982l809j6q111K244
15376a5869K242J1670Q172N544R199r778j6634l682Q30P842J4551K416n139q616
15362B748j4914o657R240J5712j828l644r7P404n824j0653n816P293k74M34Q085
$$ y = [-7606, -15086, -12140, -19813, -15645, -8681, -5705, 9205, 13320, 14539, 13303, 15559, 22019, 18702, 12712, 2506, -4038, 523, -2796, -5383, -7951, -9519, -8792, -18596, -13688, -14695, -16967, -12737, -10504, -13006, -11750, -16373, -6715, -4950, -695, 8039, 3221, -13888, -25721, -27093, -18066, -10333, -7367, -1762, 8739, 8866, 12541, 4820, -207, 8151, -4152, -6292, -6780, -8623, -16857, -22699, -15354, -1406, 7514, 7155, -13473, -17174, -9067, 4003, 2268, 4877, 9323, 10603, 5662, -2712, -9556, -13523, -14318, -23896, -16325, -6141, -2045, 2709, 5593, -2153, -3828, -195, -6177, -9986, -10002, -18113, -15869, -13627, -1957, 6215, 11759, 20958, 11180, -5454, -9136, -8306, -464, 14087, 16503, 11364, 2748, -12166, -18823, -9583, 6129, 4301, 657, 560, 7964, 2140, -8513, -14329, -7036, -7310, -6876, 1209]
15347A209p827m573N955M690k430k067L270j70J2j2394M548L530l475L239J7627
15332A1144j197j040M092k221m823j5401q02Q997O237l418j947q441J016Q686
15318H82L126j378o583K940P000n338n519P164M5j4185j327j897L4n185k345J2130
15302a0436J0129k508J969n785j028O836P812k694j643J28M645L392L108R566
15288B3491o244j4531l53K743J6830J323j4112n871m517K758K476O29J1893R897
15274B6412r750q541K793k753o228k333o419l908k653p62J0155R162J103K291
15260H569L766j6575J950P467k122l154L74j072j494K885l755o451k054M990N050
15245a626P156J442l317L188O954J1023k559n927n271p611k117m792P671J6830
$$ y = [1209, -6618, -11191, -5236, -546, -2976, -5043, -1773, -1943, -1931, -14325, -9777, -6247, -9722, -6483, 11144, 9947, 8907, 12999, 10778, 5955, -9446, -10248, -1251, 4986, 1568, -379, -8820, -7804, 882, 4008, 2630, -3953, -1013, 5987, 649, -4870, 2294, 2339, -11846, -13173, -15070, -15036, -20221, -22566, -10436, -307, -2815, -846, -6631, -7659, -823, 6989, 4295, 2652, 2780, 7425, 10817, 13925, 23491, 17247, 2716, 2363, 5106, 21936, 23259, 9147, 3276, -1241, 1517, 3993, 4622, 16515, 26412, 16662, 8121, 10914, 8161, 1933, -400, -6819, -10727, -13380, -14142, -3987, 5175, 6278, 8569, 12335, -4240, -2290, 5177, 3055, -99, 275, -797, -2291, 594, -3161, -9612, -11666, -6676, -1626, 5530, 6972, 3655, 6843, 13797, 24820, 22261, 16334, 11063, 3452, 1335, -3457, 4214, 21044]
15231B1044k248o946r820o599J2528L873j229m946l109k702O823l521J652R90
15217E790j9515o772K919m946n754M199Q902o258J0959K1427P511j7535p860K556
15203d377m996J1429l99m854r054p510J875P242L646N695q799j410J0102n362
15189f772j2980K749J1059L93K57l04M637N177J8p834J412J533R009n284j9293
15174a6223r162l490l877J4292L091J901O71O48M053n491J730L998O041P554m42
15159E294q203p5m294l536L022l471j341p203N760N129O889p783o728J1376Q328
15144C164p145j2226M829j710L676M178J5758J765o195M054P981J36j6534j3946
15130a2215j12N507O084O250O080P03K751k878L848k2977j0622K466J9359K101
$$ y = [21044, 18796, 11850, 2030, -4569, 7959, 11832, 10603, 5657, 2548, -154, 6669, 3148, 4800, 5790, -13725, -20497, -17578, -22524, -28278, -24079, -15177, -21435, -10476, 10951, 18462, 927, -6933, -4377, -9373, 2056, 1657, -3197, -12251, -19761, -17886, -10644, -6998, -1303, -10102, -11512, -1410, -6772, -19752, -17003, -5944, -5551, -5294, -5598, -961, 4216, 4234, -3600, -2188, -655, 8354, 3070, -16223, -25385, -28875, -32752, -18460, -15369, -13468, -12797, -12149, -8096, -13587, -11857, -7859, -1818, 5736, 5294, -2909, -2984, -7278, -10814, -7792, -11263, -12604, -19807, -14047, -8918, -2029, -9812, -16540, -5164, 3164, -3981, -16207, -11378, -13088, -9412, -5234, 10524, 12289, 6094, 10148, 18129, 18265, 1731, -12215, -12327, -6820, -736, 5514, 11594, 12297, 15048, 12170, 16018, -6959, -17581, -15115, 4244, 6345]
15116F345r482j2644o850O626n807J3106J2932r951j1386Q600Q256l959m355O998
15102a571n476k460l090P54J2573O650K649Q179M494q086k6996q896J4482r940
15088a6734k028K721J711J0220J8080M649k265j246L202P99j2398l969L716J1020
15074A7478M123j637j2735o092m105K712J084J0485J4435n360k051o868n329P072
15060A3212N255m545q272J374N935j034j4944r351Q706J4366K606l757o055q954
15046e458O943Q473M812O380kk409o479o659j0295m73P222p685j521k595j193
15031a0939N923J3184J2015P354r607j8757o384J0875R764j0590r106J663J431
15018c174l438k844j813n37R666K973j0834k754P964Q379K145l707r085J1117
$$ y = [6345, -3137, -15781, -22631, -16005, -21812, -8706, 4226, -5725, -17111, -8511, -255, -4214, -8569, -1571, -7047, -9507, -12597, -11843, 730, 7380, 10029, 18208, 22702, 14616, -12380, -21276, -6794, -16734, -18762, -16041, -14330, -4110, 13970, 18619, 16354, 15108, 18310, 19109, 6711, 2742, 6458, 17478, 21601, 19964, 7229, 1137, -2968, -256, 828, 11313, 25748, 20388, 18337, 11469, 6140, 13212, 18467, 13922, 5650, 7024, 12959, 11925, -3019, -12370, -3664, 10702, 13308, 9551, 3496, -5458, 1485, 9958, 14770, 21150, 21148, 18739, 12260, 5601, -4694, -5167, 2055, -5630, -7151, -9746, -10939, -5016, 8168, 20183, 27537, 17930, -827, -7211, 3664, 13428, 2838, -6268, -4605, -3174, -6612, -9456, -11269, -11806, -2140, 833, -10001, -12755, -4791, 3588, 5733, 2026, -7059, 4058]
15004D058Q743j4899n657J0429Q162O148L624j2317L177K790q78J3338J562j0279
14990A8001j4774P222o415q803N681J662m844O546P140L051J2268j4168k2873
14977a0306K136l64k363R728R957p394m76j784K972k741j91K026N333k132j0023
14962e622r849k467J1223L265r137n216n141K223J8517N006P98Q039J0683n607
14948A6715j1165J429M405M08P099L90j3824n189j880K548R633O707N074o658
14934A5692j5439n380M111J0919r577j6192P161J4844J4164L610o413j4682j1435
14921h617P89Q653M471O923Q90j696o108o885l268M0L14Q751J6565Q534p177j2994
14905I185j58p121o312M481n490q999Q027J1612o222Q961q97p118o873l409o705
$$ y = [4058, 12801, -2098, -7755, 2674, 10836, 16984, 20608, 8291, 11468, 14258, 13380, 26718, 28280, 18001, 3227, 10449, 4034, -4769, 912, 2574, -2270, 4276, 11416, 14467, 26735, 12567, -10306, -8170, -8534, -10897, -1169, 8788, 1394, 918, -866, 2106, -635, -826, 1200, 6533, 4401, -5622, -15471, -17938, -6715, -3450, -12587, -17803, -22944, -20721, -2204, 2802, 3600, 11639, 22322, 16715, 5550, 6979, 11384, 11792, 18891, 19281, 5457, 268, -1612, 936, 10569, 17276, 22350, 15692, 253, -5127, -1016, 9903, 326, -15866, -8705, 6139, 20303, 23913, 17500, 2818, -8617, -7828, 825, 5296, 12219, 13109, 11413, 5305, -1580, -4848, -4808, -4494, 4257, 20822, 29356, 22179, 9185, 9027, 1906, -4406, 75, -5415, -14414, -6387, 5225, -997, 7964, 7067, -51, -6924, -10333, -17038]
14890a7038p263p01J5970K539m4m140K010n757p313P554J5861o701m002M528N106
14875F09j491l069O662K101p089M087l809O444n006j0165M09j161R630Q018m997
14860A173j0521j015O235m67R3j592l616O66J3419M879M725k748j961q725O481
14845G026J0165k912n542L616R180O045n070p045j3138p344o833m756L294j0965
14831b4279J0435K3742q19j4764j6807n142J0030K638R665M495m372N070N296
14818E188P303M032q918j2245r220M572K229k105O692j562J459k564N123l332
14804c348O986k407r607Q506O893Q928o133j4163k478k248R170Q630n4j7646L99
14789h572j345J2629M986Mm026L710J2079R269l767j3451m09J540J528o986j5684
$$ y = [-17038, -24301, -25002, -9032, -6493, -6537, -10677, -8667, -14424, -21737, -14183, 1678, -5023, -9025, -4497, 609, -882, -3951, 2711, 4812, -2277, 1810, -1999, 4445, -561, -10726, -10317, -11478, -1848, 6170, 1173, -9348, -10363, -4128, -4595, -4502, -6094, -9710, -9044, 4375, 9254, 13979, 11231, 9270, 545, 7026, 17191, 14279, 8737, 12353, 21533, 27578, 22508, 15463, 2325, -5019, -11852, -16608, -13314, -24279, -13844, 9898, 9079, -5685, -22492, -27634, -17604, -14966, -5301, -806, -5178, -108, 5188, 12491, 16523, 7605, -4640, -13860, -9288, -7059, -9164, -2472, -4034, -2575, -5139, -16, -3348, 3638, 1231, -8376, 130, 7023, 15951, 9818, -4345, -6823, -9071, 99, 8729, 8675, -8971, -8572, -9917, 2712, 7698, 7702, 3676, 7386, 19465, 28734, 24967, 11516, 11107, 12647, 14175, 7189, -8495]
14774h495j0718J4988M017M329n701n64O142Q87k226L633O23R167o433j1683J782
14759b52J5574M921m456j0043K37q162p410q75r903Q234J0769K787O086J458O65
14744I630l092r055j958j571k164L297K810L571M536R348Q495J071k573j3571
14730H774p899j963n341P551J7464K936M813l484j7061j540k463q509m8K874o752
14715a0648m005M834R856J402N677M249M707p63j1158Q695Q284l708l430m164
14701I828n95L285k901j1050m834n118k291l266M717J6326K260j1836n248r985
14687b0708n224Q728J0962K78j0046l810N844J535L314J288k603K438m628j353
14673a3985O162K581r617P626N686J0228L501j0721j756l477o569N041J619J542
$$ y = [-8495, -19213, -4225, -208, 4121, -1580, -2144, 3998, 4885, 2659, 6292, 6915, 16082, 9649, -2034, -252, 15322, 20243, 15787, 5744, 5981, -2181, -9591, -10466, -20369, -12135, -1366, 1421, 7507, 8965, 9630, 6538, -2517, -4475, -6046, -8210, -4913, -2103, 1468, 6004, 15352, 23847, 24918, 22345, 8774, 875, -1088, -6429, 1122, 18586, 21522, 26335, 22851, 5790, 4250, 1787, -6722, -6770, -3896, -10648, -14653, -9819, 37, 1439, 7116, 11365, 16072, 15309, 4151, 12846, 21130, 17422, 13992, 9828, 9233, 12518, 9617, -1433, -6267, -11385, -13676, -16942, -12225, 4101, 6361, -5475, -10723, -20708, -25932, -17204, -6242, -5964, -16010, -19820, -13976, -12441, -9127, -7839, -10442, -8004, -12632, -13985, -7823, -5242, -14859, -7233, -1547, 8681, 12182, 1461, -295, -3772, -10341, -5300, -3681, -2139]
14659b139n649r282k556J2077R306p453m292O651M832K703P950J127j919j0528
14645H28J287o557L03L614j956m768J8493N784q305j256l995j862j796k478M029
14630A365L246j2255m07j072j5102R365M628k449R73L230R046M231K789N482L288
14615A6358j393j072j3698m440J006j0949j1907k124M589Q720L413L637J0520
14602B660K630J65K040j4230m767O466l264Q62M682M975O804n503M050J0058n72
14587A7056n546J048j154r699J360m630k314P354k002J063p664j4112O53P912
14573a0675Q533l617j0783k788J0069L215j491l563r6k837O469l252J360m79r863
14558a9798j0119J1859J2152K02j3900j822J7309k543r434J1875J2709p87n111
$$ y = [-2139, -7788, -17070, -19626, -7549, 1757, -5696, -9988, -3337, 1495, 4198, 12148, 13275, 11356, 828, 2115, -4442, -4139, -525, -2481, -7249, 11244, 17028, 8723, 7467, 3472, 1610, -186, -2664, 1365, 4611, -7644, -8051, -9123, -24225, -14860, -10232, -12681, -11708, -8478, 568, 4799, 7588, 13070, 16358, 14965, 13893, 195, -4245, -3239, -14188, -26095, -28219, -23630, -14910, -11497, -7860, 2660, 5290, 5455, 7495, -6735, -11502, -5036, -8300, -7438, -2756, 2219, 9023, 3520, 7570, 17628, 17056, 11510, 12558, 11404, 1705, 3065, -1565, -3879, 3475, 1473, 2536, -5128, -19240, -18587, -10675, -2142, -5759, -16542, -19330, -9261, -6046, -7537, -11100, -11196, -14033, -7564, -10816, -9456, -9935, -19798, -29917, -18058, -5906, -5704, -19604, -21426, -4117, -6660, -16094, -4219, 8490, 7703, 2592]
14545B592P592n204n677P487k253k646K40o368N565N284J94m114J0099j4289r498
14530a0996L131p423O012N252p26J05K44l188L287r59L692J9534J0305m233l518
14515B0519l224p657r288j0106n498P91P338j508j828p755J3913J6571k130j4037
14501c899j5310j619R290M872k071j922P171q84O538N588N907rr4m372j9606P388
14485c032J0142j2924J1541P38p459o774j1240j927J6253J0362o950K626r247
14472g891K369K817k816J1822L370j8894j7737J7577J8448k19j0703j2859P89
14459a3927j155J0593R042k970j344O797k157o944o603J3583J2178k520l161j0992
14445D20L884Q001N596n804n322n729K041k082o200O670k192l589K806k943m738
$$ y = [2592, 10184, 4980, -697, 6790, 4537, 1891, 2131, -4237, 1328, 6612, 6806, 2692, 12791, -1498, -10996, -7865, -15288, -9276, -4024, -4750, -4645, -4401, -7589, -4302, -5261, -1569, 17965, 28270, 24037, 20519, 17295, 9638, 350, -9756, -15254, -14463, -7125, -8633, -10461, -18216, -4303, 12268, 10138, -3899, -19209, -20828, -11538, -6666, -8737, -10659, -3488, -4372, 2166, 7754, 13661, 13652, 13558, 9186, -10420, -3032, 7110, -5814, 5727, 6465, -994, -7768, -19008, -20935, -4682, 5680, -1270, 1356, -7891, -5522, -2705, -5521, 6301, 9671, -9223, -26960, -9383, 9065, 8846, -1857, -14716, -13927, -15082, -4489, 4553, 1583, 239, 7036, 4879, -2065, -8668, 4915, 17093, 14573, 11412, 420, 4304, 12305, 17901, 12097, 6775, 1046, 3087, 1005, -5195, 1475, -717, -4306, -1500, -4443, -9181]
14430i181L525L125P366J2313N685M58p351j1539p673n460J712n32N102N839p332
14415c943j3870l755J2652J5534R388J0573J246o971q689K776l804o155J685j3709
14401g042r141J5054j665o908q235n901J5691J6714m668q957N006M51J788O195
14387H382J110k444j91o87j0522N189J0580M002P713m189q652r120m642J0527
14373G056j25l82J123l166o644q921k681J2496M585l914P39J315n20L826L245
14358H032k202j2623l69J3094O382j5159o505J1076J638l57R256j709p302L672
14344F924j662p93m144k110j0416k065M988M135j28j248L54K30q104j591j186
14329a6816m843m554K427P578K25k591P106o766J728O842j856k352R577R507K20
$$ y = [-9181, -5656, -2531, 4835, 17148, 22833, 23291, 15940, 4401, -3272, -8732, -7020, -7552, -2450, 3389, -3943, -17813, -21568, -8916, 6618, 16006, 26579, 27825, 20854, 12165, 14941, 11137, 4982, 6667, -7042, -16183, -1129, -2794, -9702, -17937, -23838, -8147, 8567, 3899, -5058, -52, 399, 2187, 8382, 9492, 7048, 6857, 6170, -4352, 837, 11417, 15419, 23132, 18943, 10291, 1171, -3471, 7056, 6931, 6549, 7672, 4506, -2138, -11059, -13740, -1244, 3341, -573, 166, 1481, 961, 4787, 8032, 5830, -6793, -7162, 5932, 12314, -2845, -9350, 1726, 3364, 3007, 12263, 10554, 3252, 6924, 5262, 4469, 325, -1785, -12201, -14266, -9278, -5143, -5271, -6519, -6165, -5935, -14039, -15630, -16816, -21659, -26213, -23786, -16208, -15983, -18574, -11468, -18234, -16506, -9664, -11520, -13872, -4295, 5212, 5432]
14314E432m85m800k025q433J152J270n655m104j737K934J6345K185M86l674j535
14299b644l972m268Q658L730l8J69r832K974J3881Q441k562o208L336j1412j5687
14284a5434n0j502L512j72p714k34J7120J1528j1992j0985n788L332m07J1521
14270g265K705J593J460J2997j1332K02J2076m531j638J689j315M353m265m922
14256A807L898L506j913K234q519p34m243r889J816L86K519L713K1059P759q433
14241A4966j6952n105n443P73j042J4164K565r398o770L794N151K213r666M624
14227f126L005N12j0567j305m460J974l678J2624J1392J212L308m567m243J36
14213g83l477J423M95k279m759p52m578l902R987R669K630o282K711J5476N317
$$ y = [5432, 4947, 147, -1878, -10311, -9159, -7889, -13544, -17648, -19385, -16451, -106, 2079, 2565, -1109, -2644, -6616, -10884, -2226, 1504, 1466, 1635, -8197, -5223, 8658, 17099, 14537, 8329, 11665, 253, -15434, -15484, -16986, -13474, -13646, -21360, -21594, -4474, 7054, -4938, -15923, -21711, -18379, -18786, -7265, -4560, -2967, -1507, 11490, 158, 360, 12436, 7905, 6267, 7956, 6641, 10994, 6729, 1807, 5705, 9211, 7298, 9532, 1013, 279, -3964, -13853, -12037, -11651, -9132, -5419, 15640, 23399, 14966, -1986, -7091, -12534, -11761, -12803, 1361, 3926, -5472, -12242, -8448, -3297, -1084, -10750, -6126, -3121, -2609, -13176, -14481, -18941, -16967, -20645, -8021, 3371, 4583, 7891, 3324, -919, -783, -4260, -2837, -2342, -4621, -9380, -10132, -14710, -18612, -8625, 1044, 3674, -2608, 103, 15579, 20896]
14198B0896j298q559j1039K671O314l080J38M23n706J455o345o070P323P501N641
14183A0265J1009j5105n936p53K888m479N523K099r354l720P529O949j7221j540
14169a1846J0645O380j708k009J280K473p658r400k945J3088M203l638k250r461
14155a2846o659M858J4571m434q106L793M55J4664Q314p100n321j1543n189L540
14141a1003J890J473R136j1849N500M931m573k839j528o017q737J492J6289j942
14127g777j4109q514J5698N640J0915k777j42j311k330p72N697P656k499l184
14113B191J0601k919O8M648r61j4144n469r70j008q2J6231J5986l904j0631J371
14098A1008k110o995N072l788l623R596M992o735n412P017O968P581o092j3514
$$ y = [20896, 19598, 11039, 0, 2671, 8985, 5905, 6043, 6466, 760, 2215, -4130, -10200, -2877, 4624, 10265, 21274, 6169, 233, -520, 2368, -2111, 3412, 5511, -3843, -7563, -34, 6915, -10306, -11846, -1201, 5179, 3471, 1462, 2742, 5215, -2443, -11843, -14788, -1700, 2503, -1135, -3385, -12846, -19505, -14647, -76, -4510, -12616, -8823, -8368, 6296, 14610, 7510, 2189, -9354, -14543, -11003, -9113, -7640, 1496, -10353, -4853, 78, -4495, -7334, -8862, -14879, -23616, -22124, -5835, -7777, -21886, -30400, -14702, -9062, 1853, -924, -1066, -2377, -4707, -5479, 218, 7874, 5375, 2191, 12792, 9873, 9941, 14589, 13628, -516, -5985, -6955, -7963, -8045, 8186, 24172, 20268, 9637, 11008, 8898, 1903, 6975, 3187, -436, 9160, 14152, 7417, 2005, 9022, 15990, 23571, 17479, 3965]
14084C965r474l897L725J0297m345J425M358o074j0571j2586L91J0259R234P895
14070D602J306j4372K318J290k0812K168O718k734K607j463L10K2541P423j231
14056A0671J0111N140q33l849N49K362j4897o817J2100J38n991n914k203J922
14042B489n451m947o609J0559K932p780L852R390q165Q740L576k509j7182j0435
14028b1540P185K624j702N239K360r0N995L484q79Q270n919k656Q035j740N516
14013A4182M235o007n150K21m126K011o18q36q673L910M828l686M530j6987m185
13998a6351j47K161J645Q555p20l908j457L984J3774N622l260Q715n74l241j5420
13983f22j0326q363M979O992P851P061j592J893j820m296N77j3000j0965K488
$$ y = [3965, -5509, -9406, -5681, 4616, 271, 1696, 6054, -20, -10591, -23177, -22786, -12527, -3293, 4602, 5908, -8464, -6146, -4856, -25668, -23500, -16782, -19516, -16909, -18372, -18062, 4479, 11902, 10671, 20782, 25922, 25089, 21240, 21789, 24151, 9254, 2437, 14537, 14675, 8684, 2770, 567, 2489, -2962, -7909, -14518, -3959, -1027, -8807, -4955, 4435, -3730, 5010, 8586, 6077, -11105, -21540, -14355, -11731, -13433, -8194, -5834, -5924, 71, 3555, 2676, 10946, 5027, 2371, 10406, 8666, 14182, 18417, 12410, 7260, 7481, 3355, 5366, 4748, 3912, -4761, -851, 3977, 291, 4821, -12166, -16351, -16498, -14337, -12692, -4137, -4857, -8765, -10222, -6238, 7536, 13158, 9898, 18613, 18039, 14798, -622, -10948, -19311, -14332, -7340, 511, 7572, 5980, 7873, 6053, 1757, 2334, -10666, -21631, -19143]
13969a9143Q103J169J0154N014j944q337p486k951k399O140K30l740Q011J4120
13955F941J1543j952J86k130k356J695N804j5325k236J483j0954N433K208Q65
13941A205Q308l933m164o445j0553j482J0548Q029R044o253K124k477J9870j4039
13927I782k709l485j2791J954O919J463o66l913q268O712K282j055p723m081L919
13912a1660J2826P196l77j3392l281P800N528M903m98K940R08j873o152j6907
13898a2039R261m140m01K7996J9680K71Q39j4607j7546j4476l011k48J1277M410
13884G266J2081J323j277M268k757l287L319m045j0250o105o785o477K160m641
13870a5207M174K2313J2053k154j1241q469R276k963J828N251J041n428q698J2450
$$ y = [-19143, -11040, -9871, 283, 5297, 3353, -4984, -12470, -15421, -17820, -11680, -11450, -15190, -7179, 6941, 18484, 16532, 16718, 14588, 12232, 13927, 19731, 4406, 2170, 3653, -7301, -1868, 340, 1205, 9513, 5580, 1416, -5029, -15582, -17064, -6516, 1513, 10557, 4304, 6428, 3951, 23821, 9782, 7073, 3588, -9203, -7249, -330, 1133, 467, -3446, -11714, -5002, -2720, -3775, -11498, -15579, -11660, 1166, 8362, 7985, -5407, -8688, -888, 4640, 9543, 9045, 11985, 12893, 11020, 4868, -12039, -2778, -6918, -7319, 20677, 40357, 40628, 41467, 26860, 9314, -5162, -8173, -8421, 2856, 7266, 19347, 20670, 19393, 23661, 20904, 17617, 20936, 16891, 6641, 536, -6249, -12726, -10566, -15207, -11033, 11280, 23333, 21179, 9938, 1469, 10745, 7782, 9610, 14861, 15902, 10474, 1776, 14226]
13856A4226P620k726k839O292r990m134k426J418r586j4708J1503R221L433M603
13842A1907o403j898j270O18k699R614M308q127J2113L522j518j857r135J934
13828A1109p853n709J586J347q409l91Q570M179L571m826N56m761r168j1556J710
13813b0045J9079P035j0572J055J3748j33m298R659M001n922m100j6590j0275
13800a7358J0883N609M97L312l573k786L098O179n149n032Q137Q048k47m454l157
13785D007m83j702N762P239O04l303j491o683k666K096q36r4j2702j1282j955
13770b3489J901P270J3319J1403J5673j516k05l820j949j018j2905q299k413n123
13756a1171M028J2122L371l915o728K480J493K94J2366p07j3190n525j1080q406
$$ y = [14226, 21846, 19120, 16281, 22573, 12583, 8449, 6023, 7441, -2145, -16853, -5350, 3871, 7304, 11907, 5504, 3606, 2336, 2954, 255, 9869, 14177, 6050, 18163, 21685, 20167, 18310, 9175, 11109, 3256, -2453, -867, 480, -7929, -8320, 250, 4429, 8000, 3174, 3730, -1031, -10199, -21755, -20045, -966, 6069, -4503, -3448, 10300, 10167, 5869, 15528, 19529, 13607, 9507, -7083, -17358, -6475, -866, -369, 2943, -630, -3416, -318, 5861, 712, -4320, 3817, 11865, 11618, 7164, 4007, 3524, 1822, 7584, 14823, 15427, 12124, 10633, 3950, 1284, 3380, 2544, 2450, -10252, -21534, -23489, -21588, -14318, -999, 10404, 26077, 24561, 24356, 20536, 18587, 17569, 4664, -3635, -6048, -11171, -7143, 4979, 8350, 4435, -2293, 187, 1680, 1974, 14340, 13633, 443, -5082, -16162, -24568]
13742b4568J1992J9800R644n880n318J147P067j2582j8919K281J2448L733P188
13729H033O547p377j097K863M232l158o822j0275M771J736N94j168J352J7782
13715A8013N905m843j0622n762J980J0070J2287o29l996p481j840N62K673r739
13701F578L197L730o869J1371Q442j74l608k384m822q440P38J1222M509j3724
13687I766o925Q679m362o755M087l071p503O48j3104j321J5880O815k488L143
13673C489Q314K34j4162O520J5546k865j940j5859p584m330l054N866M253L759
13659a813k856q296q044J972R121J4023Q695P703K146K900l057n23J064N791j791
13644B7035q527O464K603k574o610L255Q559l178r176q024o528j1765r441O00
$$ y = [-24568, -12576, 7224, 16868, 10988, 5670, 6817, 13884, 1302, -17617, -15336, -2888, 845, 8033, 14580, 7203, 6106, 8969, 13201, 10043, 3221, -7054, -2283, -547, 47, -1121, 231, 18013, 23918, 19075, 8453, 2691, 4671, 14741, 27028, 26399, 22403, 14922, 13082, 13644, 16317, 6578, 9775, 13505, 6636, 18007, 26449, 26275, 22667, 20283, 15461, 7021, 7759, 18981, 23490, 9766, 2841, 11520, 7158, 403, 4490, 1419, -6084, -5436, -18540, -19861, -3981, 2834, 346, 3489, 11803, 12037, -2125, 4395, 19941, 17076, 15136, -723, -8307, -12637, -15691, -9825, -5572, -1813, -4669, -12965, -21009, -19037, -9916, 4107, 12802, 20505, 22651, 25551, 22494, 21971, 23035, 28826, 27035, 18508, 24972, 27575, 25001, 18391, 21646, 30205, 27027, 17851, 9827, 3299, -8466, -17907, -17307]
13630a7307P102Q331j209J2308J481j515o117k229j477j1279K735R151L876j624
13616B227M108Q444j138l519j784q902K309k052J366K933L743j1024M395O455
13602G561N108p973J797J9935J397m938j3583n041R05n034N9r627o910J0525R840
13587D021K260N8o415O38J0418p1q448P707J153R31l804K54m40N04j99m973m68
13570C126o331O313o92P997J1521J374L484M644K294N98r219j1299j1572P69j594
13555A413L449O8m661k169K207L448q234l324R127N478J944k773Q19p719K523
13540A596J1947J3256K642q613j1223R57n1J816p90n526j994R259J3357N861l246
13525B9248M836j401j3090J293K081q661p979N621J2036R580j0455p813l071k285
$$ y = [-17307, -10205, -1874, -3083, 9225, 10706, 9191, 3074, 845, -632, -11911, -9176, -25, 3851, 2227, 6335, 14779, 13641, 10122, 8338, -564, 1745, -307, 1059, 3992, 7735, -3289, 1106, 7561, 12669, 4696, 6493, 26428, 27825, 22887, 9304, 4263, 5168, 134, 193, -9434, -16344, -5819, 4021, 6281, 6339, -76, 562, 10980, 10909, 2461, 10168, 11321, 12252, 8448, 8702, 8262, 8766, 8567, 3594, 3126, -3205, 3108, 2416, 10413, 21934, 23308, 26792, 31436, 33730, 34328, 25109, 13810, 2238, 3007, 1413, 4862, 4930, 269, -1900, 307, 3755, -4479, -7803, 1324, 6802, 8746, 5973, 6792, -927, 1596, 13543, 26799, 29441, 20828, 9605, 10562, 10511, 12327, 11537, 6011, 4017, 13276, 26633, 32494, 29248, 34084, 32683, 19593, 20886, 22967, 14306, 6327, 11948, 23984, 33564, 23109, 15296, 12225, 9940]
13511I940J5413J1380K963j120K473j053O613j3972j9508n726J8362K6828R82
13498E3575o889j1847j0653J644L672K988l208j990k337k817n599J485J880n475
13484A4429n215p99l47j912j515M72K034R7k58k780p975J3697J0317M678k155
13469B2768M087P125p918o787l84J2737J2536O114j6166j3990r911O081L19J474
13455A8085J0566J1207K421j0587k303L357j2515m528L926o509K867O978l535
13442A9430n357l872L462j540M401L684L77n59O807l3l008M455J1539m66j2206
13427B7114O091L888m754l940j5207q892Q262j035l61R965K846o387o498o57J1064
13412B1499J6741j151R35m596p359j3732q456L738J0304N395p65J672N872J37
$$ y = [9940, 25353, 36733, 39696, 38576, 41049, 39996, 46609, 32637, 13129, 7403, 25765, 52593, 53575, 46686, 34839, 24186, 25830, 29502, 32490, 29282, 27292, 24955, 22138, 16539, 18024, 19904, 14429, 9214, 8415, 8068, 6156, 4641, 5113, 7147, 7244, 6986, 4206, -3769, 9928, 20245, 24923, 22768, 26855, 33980, 26062, 19275, 18891, 31628, 44164, 50278, 34112, 20122, 10211, 16292, 16611, 18085, 28651, 39858, 42279, 31692, 29389, 32746, 20231, 15703, 19629, 13120, 15987, 22965, 19430, 14073, 10201, 13663, 12123, 16524, 20208, 20585, 20026, 26833, 26800, 23792, 28247, 39786, 39320, 27114, 33205, 37093, 32339, 28399, 13192, 4300, 12562, 11527, 11166, 21131, 23977, 17590, 11092, 10435, 21499, 38240, 37089, 38024, 33428, 26069, 12337, 3881, 7619, 17923, 23318, 22553, 24225, 30097, 30234]
13398C0234o72j0171k320N193J1390o156o143j4015j635Q457Q544J059l68k057
13384B1340Q810l915l845k032M90R819J2092r365r367k632L337n954o035o686
13370F057J1703R608j775k310O664K264N066o612M013J1832j9392j9187j1741
13357c810L308K0057J8985p954j4231p741m666J5119Q109p587l41K704k52J1740
13343C3440M149q665j0330N25m503L803L927o954N076Q874L00p454j0840O984
13329A8332k59j0020n467O969J4064k368L398r260n16J4907N720L147L437J71
13315D2255q010L404j766M869L904r475K339j662j390o538j328N267R952K654
13301D4475O558k221j4063P1k821r222o184M611P752j0807l960Q742K152J1162
$$ y = [30234, 29562, 19391, 17071, 22264, 33654, 27498, 21355, 7340, 5705, 14162, 22706, 23765, 23397, 21340, 30150, 26235, 22390, 20358, 20848, 30667, 42759, 33394, 24027, 21395, 24732, 18778, 12743, 6057, 17760, 27368, 25593, 23283, 29947, 32211, 37277, 30665, 34678, 46510, 27118, 7931, -3810, -502, 19555, 38540, 30586, 16355, 8614, 3948, 19067, 27176, 19589, 19248, 21952, 21700, 33440, 37589, 28924, 18594, 19119, 14616, 18419, 22346, 15392, 20468, 29342, 29642, 22188, 11348, 18332, 18073, 8053, 2586, 9555, 23619, 21251, 24649, 15389, 14873, 29780, 35500, 38647, 42084, 42255, 34245, 37649, 35883, 40752, 44656, 35181, 37520, 35858, 34468, 27930, 26602, 31869, 41821, 44475, 51033, 48812, 34749, 34820, 31999, 22777, 16593, 21204, 28956, 18149, 14189, 22931, 25083, 36245]
13287C6245J3621Q795r120q150j034n740j0971P480P557r224l922M314j785N18
13273B8584P910K283J3942k826j5942j9327Q49O518N486P441M835K289k201j410
13259C8431O938k637j998L895K639K339j918M893j0128q461j1296J037q344m724
13245A0666M499J4813J1355o417j2415r309L71N182R389P254l756O608J834n658
13231C4416j545J2116j590j0773K962Q47N760Q556m496k855J2445l525q902q96
13217D2520n86L178Q28O11J04q411M966J907p112L872J2747J535j782j3668k814
13202C7895k6n304p561L740J8668N599j2590N026J2662L282J5142l269p17R823
13188H2370M88N190M875L824j9217q817j0079P510l328q122j734j1036R82J0636
$$ y = [36245, 49866, 58661, 49541, 41391, 40357, 34617, 23646, 31126, 38683, 29459, 25537, 29851, 28066, 28584, 36494, 38777, 52719, 49893, 33951, 14624, 15473, 21991, 27477, 34918, 39753, 42042, 39841, 38431, 45369, 42732, 40734, 44629, 47268, 49607, 47689, 52582, 42454, 33993, 22697, 23734, 15390, 10666, 15165, 29978, 41333, 34916, 22501, 13192, 13563, 18745, 28134, 35388, 31632, 38240, 40074, 34416, 32871, 44987, 43397, 32624, 35586, 36433, 42193, 50749, 46253, 43398, 55843, 52318, 43416, 42520, 41934, 45112, 45940, 46551, 46655, 38244, 43210, 45117, 38005, 41877, 54624, 56159, 54377, 40709, 37895, 37869, 32565, 25004, 28744, 47412, 53011, 40421, 45447, 58109, 61391, 76533, 73264, 72547, 82370, 82858, 88048, 92923, 96747, 77530, 68713, 58634, 66144, 62816, 54694, 52960, 41924, 42906, 53542]
13174E3542J747P118P167l322k319M44L546p091q939J0884r22m227J0943M673
13160G3244p75L552j165j0033R235l948k0154J095Q276p298J141M948L794K0117
13146H2029J8513j976J4230M1887L5330K1981j5597k5091k7010l2696j0618k1449
13134G9533j5227Q983j090J134K220L878P329j1105j2071p245J3226J9041O975
13121I5581o546k55l779n150J021J30k0323L787J4969J4824l595q015O469L573
13107I2691J2567J43j8111q856L370R559J5465J6826K0642K3071L6467L1608k280
13094B33162k6420l3808j2482j0848p468n736j1159k295J030K828p047L598N399
13081A28754M134n899r988r374L995N098N184p067p844n227k825n460Q403J7256
$$ y = [53542, 55289, 62407, 69574, 66252, 63933, 64377, 67923, 60832, 51893, 62777, 61855, 57628, 68571, 73244, 72469, 76021, 74856, 64823, 74058, 70110, 49956, 51051, 59327, 52029, 53170, 58118, 61912, 82029, 100542, 98566, 112796, 154683, 190013, 211994, 196397, 171306, 144296, 111600, 100982, 79533, 64306, 73289, 72199, 73333, 75553, 79431, 86760, 75655, 63584, 56339, 69565, 88606, 95581, 89035, 88780, 85001, 79851, 80872, 81002, 60679, 64466, 79435, 94259, 90664, 82649, 89118, 92691, 105258, 105401, 87290, 78434, 81804, 91363, 106828, 123654, 144296, 167367, 203834, 235442, 233162, 206742, 172934, 160452, 149604, 142136, 136400, 125241, 122946, 123976, 126804, 119757, 123355, 128754, 132888, 126989, 117001, 107627, 111622, 116720, 121904, 114837, 106993, 101766, 98941, 93481, 101884, 119140]
13067A19140j825j2424o486M177J790n716l28k90M618J5869J4762j365q61j052
13053A30009L192J0355J0678J4651j5319k0967q067q693J2366J5597K338j8369
13041A27771r833M752j280K598O340K173J07j706l4O067k801M893J6098J3028
13027A68173o50M588L42k972k121l472l551M915J0960O969o299n269L729J845
13013A77187Q772K390m701J7655K2401M439K1607M0113M1798K8670L4287K3314
13001D17932o217j1746k4964k5500k5625k0642j9337j3257l847R089n785j0491
12989B59610r638K374Q873j0686j3754K277J1339K636j0952r36M382N807L227
12976B54559m236j5352k66m512R754k611k527M700n123J6824K238m412O392J4076
$$ y = [119140, 117315, 104891, 98405, 102582, 104372, 98656, 98328, 98038, 102656, 118525, 133287, 131922, 131061, 130009, 133201, 143556, 154234, 168885, 153566, 132599, 124532, 115839, 128205, 143802, 146140, 127771, 117938, 122690, 121410, 124008, 130348, 132521, 132628, 130922, 130888, 136955, 134154, 139047, 155145, 168173, 167523, 172111, 172453, 169481, 167360, 163888, 160337, 165252, 176212, 183181, 176882, 171613, 175342, 177187, 185959, 188349, 183648, 201303, 223704, 228143, 249750, 289863, 331661, 360331, 394618, 417932, 411715, 399969, 375005, 349505, 323880, 303238, 283901, 270644, 266797, 275886, 270101, 259610, 249972, 252346, 261219, 250533, 236779, 239056, 250395, 253031, 242079, 241143, 245525, 251332, 254559, 250323, 234971, 234705, 230193, 239947, 237336, 234809, 239509, 234386, 251210, 253448, 249036, 255428, 269504]
12962B69504N531r072m369n418J3169Q242k019L992K383R029n269l557m780m634
12948B72732J1844K0178J773J1525N411p135q046J1105l464k070K1824J1608J417
12935C48702j358m966K475L788K86L159P290q18j575Q684N876Q976J3016j034
12921C92501L353o097N678J3328J2204J4386l859K388J9313M400p181R936J3668
12908D74018k838J36J024J7383J4479O049k168J3782J2168J2067O24o926L187
12895E42985J6959J9617J5472K126J197R467R795J0451J2100J0968R57O767Q607
12882F67468M342J9089K7645P192O879R360K802J3507J0633R518J780J6926J3341
12869H10482J0931J5842J4784J4177O608Q357J2520K1083J3615K0376K9884L0005
$$ y = [269504, 275035, 265963, 261594, 256176, 269345, 277587, 275568, 279560, 281943, 290972, 285703, 282146, 277366, 272732, 284576, 304754, 306527, 318052, 323463, 316328, 308282, 319387, 315923, 313853, 335677, 347285, 348702, 347344, 342378, 344853, 348641, 348927, 352086, 359376, 358558, 356983, 365667, 371543, 380519, 393535, 392501, 395854, 389757, 395435, 408763, 420967, 435353, 431494, 433882, 453195, 457595, 450414, 460350, 474018, 471180, 471316, 472340, 489723, 504202, 510251, 508083, 521865, 534033, 546100, 546724, 539798, 542985, 559944, 579561, 595033, 597159, 598356, 607823, 617618, 628069, 640169, 651137, 652094, 658861, 667468, 671810, 690899, 718544, 725736, 732615, 741975, 744777, 758284, 768917, 778435, 780215, 797141, 810482, 821413, 837255, 852039, 866216, 872824, 881181, 893701, 914784, 928399, 948775, 978659, 1008664]
12857A008664J3545J7530J2446J7946J1468L3654K2024R901J6068K7684L2983
12846A223913K4912K0885J5566J0344P049K9119M0998L5346K9739L4301L3941
12835A506113L1699L2037L0126L7992M6917M1740K9258M1814M4501L5580L9122
12824A916899N3570N4388L7518M3016N3922O0232O7600N9356O4621P1719O8851
12813B551692P2802P4787O9975Q1277P8102Q9558R2469R1836R5082J11568J12568
12802C521716J10506J05776J14447J21305J27350J48907J56186J63634J57564
12793D727391J61725J75833J78941K04031K14712K28144K17122K34747K43402
12784F586048K56991K79743K99263L07557L12599L38375L48921L78409L85438
$$ y = [1008664, 1022209, 1039739, 1052185, 1070131, 1081599, 1115253, 1137277, 1147178, 1163246, 1190930, 1223913, 1248825, 1269710, 1285276, 1295620, 1302669, 1331788, 1372786, 1408132, 1437871, 1472172, 1506113, 1537812, 1569849, 1599975, 1637967, 1684884, 1726624, 1755882, 1797696, 1842197, 1877777, 1916899, 1970469, 2024857, 2062375, 2105391, 2159313, 2219545, 2287145, 2346501, 2411122, 2482841, 2551692, 2624494, 2699281, 2769256, 2850533, 2928635, 3018193, 3110662, 3202498, 3297580, 3409148, 3521716, 3632222, 3737998, 3852445, 3973750, 4101100, 4250007, 4406193, 4569827, 4727391, 4889116, 5064949, 5243890, 5447921, 5662633, 5890777, 6107899, 6342646, 6586048, 6843039, 7122782, 7422045, 7729602, 8042201, 8380576, 8729497, 9107906, 9493344]
12775I493344M02165M19427M35566M54189M67186M95564N08224N27936N45177
12766A3748778N66271N87772N86600N85420N84424N86548N79796N70433N56515
12757A8952557N19084M76133M55509M07496L44342K93165K30502J76481J14517
12748B1969786L4445n0661j16471j88084k37374l01557l49082m02232m34091m79611
12738A9445068n15086n25637n56997n53117n58253n60546n61818n64491n48885
12729A4500238n51542n14436n01253m85147m73060m63487m47862m39535m26915
12720A0197001l97781l74473l65348l50403l27985l08281l14655k93749k71536
12711G192790k54280k41369k31325k35682k32385k17266j99478j87263j82620
$$ y = [9493344, 9895509, 10314936, 10750502, 11204691, 11671877, 12167441, 12675665, 13203601, 13748778, 14315049, 14902821, 15489421, 16074841, 16659265, 17245813, 17825609, 18396042, 18952557, 19471641, 19947774, 20403283, 20810779, 21155121, 21448286, 21678788, 21855269, 21969786, 22004231, 21953570, 21837099, 21649015, 21411641, 21110084, 20761002, 20358770, 19924679, 19445068, 18929982, 18404345, 17847348, 17294231, 16735978, 16175432, 15613614, 15049123, 14500238, 13948696, 13434260, 12933007, 12447860, 11974800, 11511313, 11063451, 10623916, 10197001, 9799220, 9424747, 9059399, 8708996, 8381011, 8072730, 7758075, 7464326, 7192790, 6938510, 6697141, 6465816, 6230134, 5997749, 5780483, 5581005, 5393742, 5211122]
12702E211122j67459j66243j50955j60445j60975j45215j31876j27031j17718
12693C883205j13854j15279j05062r9481r7242q9527q5797q3618r3157p8898p6963
12682B844327q0300p3403p2614p3508o5941n6872n1650m8936o8952n4296n8772
12671B139083n9591m8141l9074l7791n0060m6752l5849l4046l1855m2101m4544
12660A669279k4058l1112l9058k8061l1775l2712l1491k6491k5328l5592k6555
12649A337046k0329k1378k2454l9985k5480k3342q608k0335k7546m964r415j0213
12637A102997k2415k2228k7553k3260r758j8216j4994j9419j1338M1j1754j6312
12625I05791m270m755j2606l3116k6601n047j0366j4503j7033j2666p804j3577
$$ y = [5211122, 5043663, 4877420, 4726465, 4566020, 4405045, 4259830, 4127954, 4000923, 3883205, 3769351, 3654072, 3549010, 3449529, 3352287, 3262760, 3176963, 3093345, 3000188, 2921290, 2844327, 2764027, 2690624, 2618010, 2544502, 2478561, 2421689, 2370039, 2321103, 2252151, 2197855, 2139083, 2079492, 2031351, 1992277, 1954486, 1904426, 1857674, 1821825, 1787779, 1755924, 1713823, 1669279, 1645221, 1614109, 1575051, 1546990, 1515215, 1482503, 1451012, 1424521, 1399193, 1363601, 1337046, 1316717, 1295339, 1272885, 1232900, 1207420, 1184078, 1175470, 1155135, 1127589, 1122625, 1113210, 1102997, 1080582, 1058354, 1030801, 1007541, 997783, 979567, 964573, 945154, 933816, 933857, 922103, 905791, 901521, 896766, 884160, 851044, 824443, 819396, 809030, 794527, 777494, 764828, 757024, 743447]
12613G43447r008r171j4638j4288m908j486o625o177p859n991j0873k0467j2426
12600F19530k473m772k781k401j2943q652j831R15j2506j3156n687j2484q063
12587E32696k653j2468l186q711j1244L868M6P126o162j1434k811p910j6061O036
12573D67132k542j5529O225j2956j3654n429q149N538p38m431n552m665J641q761
12559C98130q067L431p583n505j6314j4590K612l446q20L148r057L457J8184K315
12545C65895J00K752K524o188j8263p203J315K434l143o06k281o571k2878j9435
12531B88452M789J0618p66m087j2352k390o531mm41j3359M087j4962p771K0794
12517B66077O718O799o897j4167J105J3751J3074l920j2724q245K727K823J3745
$$ y = [743447, 734439, 725268, 710630, 696342, 691434, 689948, 683323, 677146, 669287, 663296, 652423, 631956, 619530, 617057, 612285, 609504, 607103, 594160, 585508, 583677, 584592, 572086, 558930, 553243, 540759, 532696, 530043, 517575, 514389, 505678, 494434, 498302, 498348, 505474, 499312, 487878, 485067, 477157, 461096, 467132, 464590, 449061, 455286, 442330, 428676, 423247, 415098, 420636, 419898, 415467, 409915, 405250, 406891, 398130, 390063, 393494, 385911, 380406, 364092, 349502, 352114, 348668, 347848, 350996, 341939, 345396, 363580, 365895, 365995, 368747, 371271, 365083, 346820, 339617, 340932, 343366, 340223, 339617, 337336, 330765, 307887, 288452, 293241, 303859, 303093, 299006, 286654, 284264, 277733, 277729, 277288, 263929, 268016, 253054, 245283, 266077, 272795, 279594, 272697, 258530, 259635, 273386, 286460, 282540, 269816, 261571, 264298, 267121, 280866]
12504B80866M247k618r081m37Q054K7260M0459K8926K6513J0855K817K201j1257
12491D08805k8948k9916k1595j1860k4454k3606j5917j4191k899N20j317k1563
12479B13059p949O054r689R75j280N070q50P934m818R12o968J693j9423j0685
12465A74035L724j5446n979L6J992K70L255J1643K39p012j96K179q347o730J0321
12450A63984N097Q936r352j8528k543L790J1199N215n033k495j1626o093N568
12437A48119M47k508n489m57p466M872J079r526L616k537r881P754J6593K326
12423A46942L037l209K323k368l79l784n353m981k146p772K46L174J541K996M770
12408A35037q073j4123J259J1989k374K997J5230K034j0529K189K378j0739n119
$$ y = [280866, 285113, 282495, 273414, 272977, 281031, 308291, 348750, 377676, 404189, 415044, 417861, 420062, 408805, 379857, 349941, 328346, 316486, 292032, 268426, 252509, 238318, 235419, 235939, 234622, 213059, 205110, 211164, 201475, 202450, 201170, 206240, 205390, 213324, 208506, 209418, 202450, 204143, 184720, 174035, 177759, 162313, 156334, 156370, 158362, 158632, 161887, 173530, 173769, 166757, 166561, 168740, 160393, 153663, 163984, 169081, 178017, 168665, 150137, 147594, 151384, 162583, 167798, 162765, 160270, 148644, 142551, 148119, 148566, 146058, 140569, 140112, 132646, 137518, 138597, 129071, 132687, 130150, 120269, 128023, 144616, 146942, 149979, 146770, 149093, 146725, 146346, 142562, 137209, 132228, 130082, 122310, 122556, 125730, 127271, 130267, 135037, 126964, 112841, 114100, 126089, 123715, 126712, 141942, 143976, 133447, 135636, 138014, 127275, 122156]
12395A22156o582o709L044m420R851k50J563J622j6088o196J1692O842m594L93
12381A12324L749k923K29o935n51p80J261o964l357q978J2360R945M908J667J712
12366A17667j3287p782J1223K698o500r04j066O76N370j1320k744J3098k766j5084
12352H9279n256J7556p690j4484k221J1058O443k482J240P004o276j0583q124
12339G5464M390o795j2006K370m970M538j126L182J0867N976j714k117n552N02
12325G3009O01N428L12M381M385p05p641j0033p10O475K027Q295o914M002J23
12310H3035K98r566k168O555k549j0085J562L283N44J457j320J837K304N406m764
12295G5829P151J1963K16l584j3228j5842l88L746K314M545j2590j6348K734J2135
$$ y = [122156, 115574, 108865, 111909, 107489, 117340, 117090, 118653, 120275, 104187, 97991, 109683, 116525, 111931, 112324, 116073, 113150, 113379, 106444, 105893, 105113, 106374, 99410, 96053, 87075, 99435, 109380, 114288, 115955, 117667, 104380, 96598, 107821, 110519, 104019, 103115, 102049, 102725, 108095, 96775, 94031, 107129, 104363, 89279, 84023, 101579, 93889, 79405, 77184, 88242, 94685, 92203, 93443, 100447, 94171, 83588, 75464, 79854, 73059, 61053, 63423, 58453, 62991, 61865, 65047, 75914, 81890, 80176, 78059, 72507, 73009, 73610, 79038, 79350, 83731, 88116, 87411, 79770, 69737, 69027, 75502, 77529, 85824, 78910, 82912, 83035, 83333, 73767, 71599, 78154, 75605, 65520, 67082, 70365, 70909, 72366, 71046, 72883, 75187, 80593, 75829, 82980, 94943, 95159, 91575, 78347, 62505, 62117, 65863, 68177, 72722, 60132, 43784, 46518, 58653]
12281E8653K935L494j6463n642P846J151J4266M871o272k781M616n731J2630M148
12267G7721l00o118k0316p289q18M497j538J3661Q710N278p150K505M155j536
12253G1462m228j2152j1323N984M27R748o922M212N676p776m594J1613n223j0802
12239D6102p240K373K522P104M546M624P973Q16m542j4748j1605p132Q245J182
12225D0220J1527J0955p609j4866j953P780J5367J2117K441j4482j7146p508L402
12212D0245J377L595L508m476j237N852K204o016o409o669o409O897O105n095
12198C3472l797L497J3112P189q673j992l448K558P900l718p313o511k539M064
12184C3801M86M825J529K27k246O092K859N211p419q93R9J259Q684l672j2379
$$ y = [58653, 61588, 65082, 48619, 42977, 50823, 51974, 66240, 71111, 64839, 62058, 66674, 60943, 73573, 77721, 77421, 71303, 50987, 43698, 42880, 47377, 45839, 59500, 68210, 73488, 66338, 68843, 72998, 71462, 67234, 55082, 43759, 49743, 50170, 59918, 52996, 57208, 62884, 55108, 50514, 62127, 56904, 46102, 38862, 41235, 43757, 50861, 55407, 60031, 68004, 68820, 64278, 49530, 37925, 30793, 39038, 40220, 51747, 62702, 55093, 40227, 38274, 46054, 61421, 73538, 75979, 61497, 44351, 36843, 40245, 41622, 45217, 48725, 44249, 43012, 48864, 51068, 45052, 38643, 31974, 25565, 32462, 38567, 33472, 29675, 33172, 46284, 53473, 44800, 42808, 39360, 41918, 49818, 46100, 38787, 32276, 29737, 33801, 34287, 39112, 40641, 40868, 38622, 44714, 47573, 52784, 45365, 44472, 44571, 45830, 54514, 50842, 38463]
12169C8463K7j707o393O795l414o148m549J443M199J1121q674j1607P337J1749
12155C8642L613Q214j2122p890K183J986P95M135k132n159M407m485L685N968
12141D1840l760r599j093K865k995n303P901J6126O422m201r151K223R60J0992
12127E3227n445o386q942O377j401j7083K469R123q51M978p443k060J3163O911
12113D6637J465j3171m687j866Q04J1694r08r522n063M933p007j115O296l62K325
12098C0453l021k086O253Q960K97p354L789l780K085L239n474k3890m486J5116
12084B0101N692n873l074J5179K15M781M967j3563q536P546j488j3746O06J3330
12070B6137P740J3480K0227J600m973o179k454j4061j5020K054P165o704j239
$$ y = [38463, 38490, 36783, 30390, 37185, 33771, 27623, 23074, 24517, 28716, 39837, 31163, 19556, 26893, 38642, 42255, 50469, 38347, 30457, 32640, 34626, 35421, 39556, 37424, 32265, 36672, 32187, 35872, 41840, 38080, 28481, 27388, 30253, 27258, 21955, 29856, 45982, 52404, 48203, 39052, 41275, 42235, 53227, 47782, 41396, 32454, 38831, 37430, 20347, 22816, 31939, 31088, 36066, 28623, 26563, 39726, 46637, 48102, 34931, 30244, 28378, 29182, 40876, 39968, 30446, 25383, 30316, 23309, 22194, 28490, 28128, 30453, 27432, 25346, 31599, 40559, 40856, 33502, 37291, 33511, 35596, 38835, 33361, 9471, 4985, 20101, 25793, 19920, 16846, 32025, 32240, 37021, 41988, 28425, 19889, 27435, 25947, 12201, 12807, 26137, 33877, 47357, 67584, 69184, 64211, 58032, 55578, 41517, 26497, 28551, 35716, 29012, 27773]
12057B7773L593m843p185J2825J4626k440J816j4072j7258l040J0568k21k535
12044A9607j089J4387o90q343l781k754J1258j008l620J0775j953n862p125k17
12030A9585L118J75j7336M403J8677l916n59O149r210j1385O681M522k244K689
12016B1349M48j876P889N853k756N570J2847N347p166k4117q927J0707J3681K989
12002D1838j2237L505K602k623L295k495j1519j973N822P656j162k932j8461j3303
11988a987J1292J4470J1189J0368n308j5111j4351j708K948j482J0357P169J053
11975B8899R080l989l752J545j227O85L417j2901O642R543N950M940q663j2480
11961B7689l976M217j053j861R80n400L905J308n362J981L411K676k543p375J3982
$$ y = [27773, 31366, 26523, 19338, 32163, 46789, 44349, 46165, 32093, 14835, 11795, 22363, 22142, 19607, 18518, 32905, 32215, 23872, 20091, 17337, 28595, 27587, 23967, 34742, 32789, 26927, 19802, 19585, 22703, 22878, 5542, 9945, 28622, 24706, 24147, 30296, 21086, 9701, 16382, 20904, 18660, 21349, 21797, 19921, 27810, 33663, 30907, 36477, 49324, 54671, 47505, 23388, 14461, 25168, 38849, 41838, 29601, 33106, 35708, 33085, 36380, 33885, 22366, 20393, 26215, 33871, 32709, 29777, 11316, -1987, 9305, 23775, 34964, 45332, 40024, 24913, 10562, 8854, 11802, 10320, 20677, 27846, 28899, 37979, 33990, 30238, 31783, 30556, 31241, 34658, 21757, 28399, 37942, 43892, 48832, 40169, 27689, 23713, 27930, 26877, 25016, 25996, 20596, 24501, 25809, 20447, 22428, 25839, 28515, 25972, 18597, 32579]
11946C2579q773j0060O762K827r094k859L710M358r910q53N722L134P628R186
11932C4357j5410j2031N981P964O705L417L108j3478j997k297o387m30k581J29
11918G050J171J120r401j0669q622P088J2488J0113K238J8328J360o932l765J999
11904B3566l049K433M981l883m63M425O671J309j0770l152o37J2356P437l733
11890C7491j97o498k894K354Q03L712N603j1262r586l38K449n109J0327O66q738
11875A8783Q32K050M453K523M346o589l87j8240k0004k351J0977J1167P85r729
11861a384L996J1436J8441m992o261k993L44L109L220K313J08n358J143q32K23
11846B2513j5574o804L1P303J4506R034p639j6160k865j312j667R253R128j777
$$ y = [32579, 23806, 13746, 20508, 23335, 14241, 11382, 15092, 19450, 9540, 8687, 14409, 17543, 25171, 34357, 18947, 6916, 12897, 20861, 27566, 30983, 34091, 20613, 18616, 16319, 9932, 9502, 6921, 7050, 8221, 9341, -60, -10729, -19351, -12263, 225, 10338, 12576, 30904, 32264, 25332, 21567, 23566, 20517, 22950, 27931, 24048, 23585, 28010, 34681, 35990, 25220, 22068, 21431, 33787, 41224, 37491, 37294, 30796, 27902, 30256, 31059, 34771, 40374, 29112, 19526, 19188, 21637, 16528, 26855, 27521, 18783, 19615, 21665, 26118, 28641, 32987, 26398, 26011, 7771, -12233, -14584, -3607, 7560, 8345, -1384, 2612, 14048, 32489, 27497, 21236, 18243, 18587, 21696, 24916, 27229, 27337, 21979, 23122, 22290, 22513, 6939, 135, 166, 7469, 21975, 31009, 23370, 7210, 4345, 3033, 1366, 10619, 19747, 17970]
11832A7970l960J2716q909k4270J835J7458l461n072m8K12k185J120k509j1237
11818a0340K452p012R05Q247O630K430k139j165K988j893j3932J1843q35J356
11804d65J968R643j0527j218R757m105J2431n298j2023R944M470j2750p13P101
11790H215K982L876o030o792o759n080N538J2197k139K554P76N0n992J981J1890
11775A7267J3678l959q401j56j559o070m423M17N74q944J2059K170j357L817K423
11760A7536p667j904m435N884o986j5849j239J3469q337K425J4407l036n799l898
11746e429J885M736j0138j2567J546j550M466R414J9465n385o344p551J7769J1866
11732B2183j2743m930j297J359K021M063m22O173J4198n694p770l391j1368k733
$$ y = [17970, 14010, 26726, 17817, -6453, -4618, 12840, 9379, 4307, 4259, 4471, 2286, 3406, 897, -10340, -7888, -14900, -13995, -5748, 882, 3312, 1173, 8, 2996, 1103, -12829, -986, -1821, -465, 1503, 11146, 619, -599, 9158, 5053, 17484, 12186, 163, 10107, 14577, 1827, 1114, 8215, 11197, 15073, 9043, 2251, -4508, -9588, -4050, 8147, 6008, 8562, 9338, 9388, 3396, 5377, 17267, 30945, 26986, 18585, 18429, 16870, 10800, 6377, 6794, 7368, -1576, 10483, 12653, 11296, 15113, 17536, 9869, 7965, 3530, 9414, 2428, -13421, -14660, -1191, -9528, -7103, 7304, 4268, -1531, -5429, -3544, 1192, -8946, -21513, -19967, -21517, -17051, -7637, 11828, 6443, 99, -7452, 10317, 22183, 9440, 4510, 3213, 4572, 6593, 10656, 10234, 16407, 30605, 24911, 17141, 13750, 2382, -351]
11718c51j844J6486O483l489j2372m493l057M88Q123K0632J0226n608n050o957
11704A9217p605l797j798n47j491j271M868R297R551j0188k774J079N98J48l633
11689A1654j432J915Q441j719j659R443k647p45j4538j7954m734N479P616J2477
11675A1597N911n336l140l695J682P872L353p180p780q645M059j407j3677O760
11661i626R553O121M75N023R0K783r978j644J27N59k06O177N843L426p609j5090
11645c976q299k649N140M927P382R825J7873P54j3927j5414o69J33o114P651N873
11630H510m649n61k737L493L661l793M081O699j3945k959j1813j5225N237J6217
11616g784J2460Q942K927J260K607n264K315P617M313j1136q168j0786j004J442
$$ y = [-351, -2195, 14291, 20774, 17285, 4913, 420, -2637, -2149, 5974, 26606, 36832, 31224, 26174, 19217, 11612, 7815, 6017, 5470, 3979, 2708, 7576, 16873, 26424, 16236, 13462, 14541, 15139, 15287, 11654, 10222, 12137, 20578, 18859, 17200, 26643, 23996, 23251, 8713, -9241, -13975, -8496, -880, 11597, 17508, 12172, 9032, 5337, 7019, 14891, 18244, 11064, 3284, -5361, -1302, -2709, -16386, -9626, -73, 6048, 6523, 11546, 11636, 14419, 4441, 2797, 2924, 3483, 3277, 9454, 15297, 18723, 11114, -3976, -12275, -14924, -9784, -4857, 2525, 12350, 30223, 30977, 17050, 1636, 967, 1100, -5014, 2637, 8510, 3861, 3300, 563, 4056, 7717, 3924, 8005, 14704, 759, -2200, -14013, -29238, -24001, -7784, 4676, 13618, 16545, 17805, 20412, 15148, 17463, 25080, 29393, 18257, 10089, -697, -1701, -259]
11602b59J861j1960k810K75J879N833J2058n240n973M34m239m622R650N093O724
11587H704l416j7703P19J3559n728o206k672N878L362K139K223K781k636R216
11573A0220R769n557K144R95r534j9027k744R631o367M140J6479k834j5087K685
11559e087p64O815R973j2201r879J4482j871Q820K331k097q658q464K361l64M368
11544b35j1653L155m902n945O445O324J2281J6455p452q374j589o391n72P257
11530D804L929J147k270p787o840O798J3115k423n849k749q52m218m77p125N616
11515e181J4887J2511k36j6645l875j101L280N567L414j4353m288K2348J4958
11502C1286r811o559n569L201N873l929j0081l89M046K0771n940j3895r760o018
$$ y = [-259, 1602, -10358, -13168, -12893, -11014, -5181, 6877, 1637, -4336, -3902, -8141, -12763, -3113, 1980, 8704, 5288, -12415, -11696, 1863, -3865, -10071, -12743, -6865, -3503, -1364, 859, 3640, 1004, 10220, 19989, 14432, 16576, 17571, 8037, -10990, -13734, -4103, -10470, -6330, 10149, 7315, -7772, -5087, -5851, 964, 10937, -1264, -11143, 3339, 1468, 10288, 12619, 10522, 1864, -6600, -4239, -4603, -235, -11888, -8733, -13635, -19580, -13135, -6811, 5470, 21925, 14473, 6099, 4510, -1881, -2453, 4804, 8733, 9880, 7610, -177, -7017, -219, 12896, 10473, 4624, 1875, 1023, -3195, -3672, -10797, -5181, 9706, 22217, 21981, 5336, 1461, 360, 3640, 9207, 12621, -1732, -6020, 16328, 31286, 21475, 14916, 9347, 12548, 18421, 14492, 4411, 4022, 8068, 28839, 22899, 9004, -756, -6774]
11488f774R94J5314L492p006r635j0004q418k339J0615J1501Q691O284O89K52
11474A3656p307O547P200M637j0230m784p86o674k833P775l550j2854O00N386
11460c217N77P875M286m726m902j5998J000P640r197J269l463j554J2784J1385
11446C759O527O236k777o34M68L932M932n984p939K824J334q519l704m194O731
11431B992N781J093M218q947M873K226Q346m584K326j1457m680P675L079q269
11417D672k24l103M104M043M634j981j0395j466J366J743n095q55J6638l407j4675
11402d001n802N513M800k177j0049m18J1498Q530L063n981K013J534l42j4223
11388f042p360M420j034O0o505m211M944J1263R461L226n684P085j5689q323N62
$$ y = [-6774, -5780, 9534, 13026, 6020, -3615, -13619, -22037, -24376, -13761, -2260, 6431, 12715, 13404, 13656, 6349, 12896, 20096, 24733, 14503, 9719, 8933, 2259, -574, 7201, 3651, -9203, -8603, -3217, -2640, 5235, 9521, 4795, -107, -16105, -15105, -7465, -16662, -15393, -18856, -20410, -7626, 3759, 10286, 16522, 13745, 13111, 13579, 17511, 22443, 16459, 8520, 11344, 12678, 4159, 455, -3739, 2992, 8773, 9866, 14084, 5137, 10010, 12236, 20582, 15998, 18324, 6867, 2187, 9862, 12941, 4672, 4448, 1345, 5449, 9492, 14126, 12145, 1750, 284, 1650, 3393, -1702, -2557, 14081, 10674, -4001, -9803, -4290, 510, -1667, -11716, -12134, -636, 7894, 10957, 4976, 6989, 8523, 8181, -6042, -13402, -8982, -10016, -9956, -16461, -20672, -15728, -4465, 4996, 8222, 2538, 9623, -6066, -14389, -13827]
11373a3827l675J400K181Q574R988j0901L695p600J110J3731K526l682l513R875
11359I882J534J115j429L814m156l366P045L23j2493r67j087j4147k734M41o8
11344a6293r11P384N356J2653P996j6718j1154l757M762k619k352M677p84q319
11330b0079J586J2086J850l585j844J397p412R273M329L395j30o605L470R606
11316G337J96M32K076J021q624J214M240r758j532P124o984j689K325L785l631
11301b468j3274K941M383J2224N236j540m708k808P709K471k77K537q02l528j1609
11286c513M858O555N569q872j1205o606n743O018j521k470Q183L537N175Q688
11272H653m275j0239n793L084O324j4807l798l60k627J0670l385N02J1244R687
$$ y = [-13827, -17502, -16102, -13921, -5347, 4641, -6260, -2565, -10165, -9055, 4676, 7202, 3520, 7, 9882, 11416, 12531, 11102, 14916, 10760, 7394, 14439, 14762, 2269, 1302, 215, -13932, -16666, -16225, -16293, -17204, -9820, -4464, 8189, 16185, -533, -11687, -15444, -10682, -13301, -15653, -10976, -11760, -20079, -18493, -6407, -4557, -8142, -9986, -8589, -16001, -6728, -2399, 996, 866, -5739, -2269, 7337, 7533, 7965, 10041, 11062, 2438, 3652, 7892, -1866, -3398, 3726, -3258, -4947, -2622, 1163, -2468, -15742, -12801, -8418, 3806, 9042, 7502, 2794, -14, 7695, 10166, 9889, 12426, 11624, 8096, -3513, 1345, 7900, 13469, 4597, -6608, -13214, -18957, -12939, -14460, -16930, -8747, -5210, -35, 8653, 4378, -5861, -11654, -8570, -2246, -17053, -20851, -21211, -23838, -13168, -16553, -16051, -4807, 4880]
11258D880l975K725p289N328N63R077J2722o840j6601j3293K957n90J579j36L912
11243d981r489K029M622N986Q803j6703m7J0945M311j475J028m792k487M749K840
11228E339J0061k907j088P87J908l706k1020m329J515M246K1036J0772k6958q444
11214a2788K765Q514L424j240o274Q204O517m351N87m788k023j1660n463J4357
11200d219L980j1880J2189M978N147l595L018N069p855j2969o716P12Q938J0028
11186F825l051q522l956p666q678O448Q225j0416K822J025o307R891L325k97J2657
11171B325Q332m073L991n227j1344r036k778J965L597J690O835M025j1382P433
11157c647m815o966p488O928M544M296K644O144n10o180j5711p831P96O812O950
$$ y = [4880, 905, 3630, -3659, 1669, 2232, 11309, 24031, 17191, 590, -12703, -9746, -10336, -8757, -8893, -4981, -14470, -12441, -7819, -1833, 6970, -9733, -9780, 1165, 5476, 4001, 5029, 237, -2250, 2499, 5339, 15400, 12493, 11405, 12192, 14100, 10394, -10626, -14955, -13440, -9194, 11842, 22614, -4344, -12788, -10023, -1509, 1915, 675, -5599, 2605, 9122, 4771, 5358, 570, -1453, -13113, -18576, -4219, -239, -12119, 70, 5048, 10195, 6600, 9618, 14687, 6832, -6137, -12853, -12141, -3203, 6825, 3774, -4748, -8704, -16370, -25048, -18600, -10375, -20791, -17969, -16944, -23251, -13360, -10035, -10332, 2325, 10657, 6584, 10575, 5348, -5996, -15032, -17810, -15845, -12248, -10558, -3723, 302, -11080, -3647, -8462, -15428, -22916, -15988, -11444, -7148, -4504, 1640, 1130, -5050, -20761, -28592, -27796, -20984, -14034]
11142a4034J0064J636m071J817j3478j280O304R223k876O776M815j7546l803p648
11128b4101q75l528K541J2680o80P344L975l140m55j0522k343m329O958Q651Q882
11113A058N917o102P563P5j734Q64o835j0461j0206j5043J3727O015P513J7374
11099I725j712l167J447j1015j3688j1129J7293J2967q734q614J2120P604j0333
11086g236j977O884o385R167M170p208j0217Q696O141m95j2945j2414R511P087
11072g221p696p372R432J717L88K676M83K520M778M730O55M236k20l608j479j444
11056B575N42l667K740J648p5L100j1685r079p414J0011K1660o507k218P382n44
11041H469l534j4457r326M509J2743p507k002J2448N310l431m768l639k542j0763
$$ y = [-14034, -3970, -2334, -6405, -4588, -18066, -19346, -13042, -3819, -6695, 81, 4896, -12650, -16453, -24101, -24976, -28504, -25963, -13283, -13963, -6619, -2644, -5784, -6239, -16761, -19104, -23433, -16475, -7824, 1058, 6975, 873, 8436, 8511, 6777, 7641, 806, -9655, -19861, -34904, -21177, -15162, -7649, 9725, 8013, 4846, 6293, -4722, -18410, -29539, -12246, 721, -8013, -16627, -4507, 3097, -7236, -9213, -2329, -8714, 453, 4623, -2585, -12802, -4106, 2035, 1540, -11405, -23819, -14308, -7221, -14917, -22289, -12857, -11140, -10752, -8076, -7593, -5073, -295, 4435, 5090, 9326, 9106, 5498, 4019, 2575, 3117, -550, 2190, 3838, 3763, 6863, -4822, -13901, -21315, -11304, 10356, 3849, 1631, 9013, 8469, 4935, -9522, -18848, -14339, -1596, -9103, -11105, 1343, 6653, 3222, -1546, -5185, -7727, -18490]
11027a8490R005k313O617J4k128l213m784k633j991K045O087P437j715k480P889
11012f53J744O72m529o737n232K507m172O192P425L754l516Q138j2911l273P388
10997c203r09o692K315N73K511L814r790n583N343M150K219j1425R490K689l990
10982h488n722j138J598k203p089Q649P810J921Q533K827j2336l312K048K972
10968c930m336k973R370j752j2764P339M977l643L663P247q692p804r93p227O488
10953a5030Q158J534L564L825N044n64n37N1l968P701L219j2116m324k179M871
10938g51K911j1460l893P17j9742L879L475L391J4651N083j1763n904N404k7k634
10923a6663P46K276K433N512l836m02L678O23K834m997l869J0445j700K063L502
$$ y = [-18490, -9485, -11798, -5181, -5167, -7295, -10508, -15292, -17925, -19916, -17871, -11784, -4347, -6062, -8542, -653, 1091, 1763, -2766, -9503, -14735, -12228, -16400, -10208, -2783, 971, -2545, 5593, -7318, -10591, -3203, -4112, -10804, -8489, -7916, -5405, -1591, -11381, -16964, -11621, -7471, -5252, -16677, -7187, -4498, -8488, -14210, -15348, -13750, -15953, -23042, -14393, -6583, -4662, 3871, 6698, -5638, -8950, -6902, -3930, -8266, -11239, -1869, -3621, -16385, -9046, -4069, -7712, -4049, 3198, -5494, -13298, -14291, -21518, -15030, -6872, -5338, -1774, 2051, 7095, 6531, 5994, 6045, 2077, 9778, 12997, 881, -3443, -5622, -751, 2160, -9300, -13193, -12476, -32218, -28339, -24864, -21473, -6822, -1739, -13502, -19406, -14002, -14029, -16663, -15917, -13641, -11208, -5696, -9532, -9934, -6256, -5633, -2799, -7796, -11665, -1220, -2920, -857, 2645]
10908B645O064P971q001r817m631j72k249Q903J7448L926j194r270j0382o402
10894e161Q47L602K649o357Q932j621p124J048j997n768k910J1719O439o474P38
10879a438o278j130J2634m324l438j3999J88O554J550L249k148k939k44m123K962
10864a2924P205M687N32j2017n648O510J3056L435j4437K816P084O068K504K686
10850A1557p58l064R035k856k157j1006j2858o362m845K742o42N747J2163M771
10836A467J222R815N874L207J020o551j945K846m233j0632p085P255p92o178N944
10821A234N280j012j3568J83Q159q41q8J374P2J874O61j2583Q631K488R235Q045
10805A9144q292r503Q83o942K175Q135K366n362p343p132l359R530O161K949j284
$$ y = [2645, 8709, 16680, 8679, -1138, -5769, -5941, -8190, 713, 18161, 22087, 20893, 11623, 1241, -5161, -4314, -712, 1937, -4420, 4512, 2891, -4233, -3185, -5182, -10950, -13860, -2141, 4298, -2176, -1438, -7716, -8846, 3788, -536, -3974, -17973, -17785, -11231, -9681, -6432, -8580, -11519, -11763, -15886, -12924, -5719, -1032, -500, -12517, -18165, -11655, 1401, 4836, -9601, -6785, 299, 6367, 8871, 11557, 10799, 7735, 16770, 13914, 11757, 751, -12107, -18469, -23314, -20572, -21214, -15467, -3304, 1467, 2689, 12504, 18378, 21585, 22605, 16054, 14109, 16955, 12722, 2090, -4995, 2260, 1468, -4710, 1234, 6514, 5502, -8066, -7883, 276, -565, -653, 721, 793, 2667, 3328, -9255, -624, 1864, 11099, 19144, 10852, 1349, 2232, -4710, -2535, 5600, 7966, 2604, -4739, -11871, -15230, -5700, 461, 3410, 2126]
10790B126p692m848Q73J2657Q34L333l649o136j0093N337O264R692K201J418O61
10775A2978o522j0276n60J2j0987J1358J2172l804q73q057o456L196J992k149
10761g976o15k765N542R927L241r269P617K028O841J440L018l24k782j1126K771
10746G568p381n135L879k236m008j148J9324L726r844o786Q44L528Q783O086q125
10731I075j240p589n334r151j2571m448Q961J3419N763J705o421o458K021J2186
10717h2J1022r391l394j0296k134J2091J2797o530j096J360J9419J946L214j1232
10703A7694r802J133j1366K302o99p209n619k310p816p38L365P306n60k1872n94
10688c6785L880J7000J4613j441j1467k32n163l883m667L609l487J5604J1169
$$ y = [2126, -5566, -10414, -9541, 3116, 3950, 7283, 3634, -2502, -12595, -7258, -994, 8698, 10899, 12317, 12978, 6456, -3820, -4380, -4368, -15355, -3997, 8175, 4371, 3498, -4559, -11015, -7819, -5827, -7976, -8591, -11356, -5814, 4113, 7354, -1915, 5702, 7730, 14571, 16011, 19029, 18705, 15923, 4797, 7568, 187, -4948, -1069, -3305, -7313, -8461, 10863, 14589, 4745, -2041, -1197, 2331, 11114, 17200, 9075, 7835, 246, -5088, -14239, -26810, -31258, -22297, -8878, -3115, -1410, -7831, -14289, -12268, -82, 10940, 1549, -1845, -12141, -14275, -2184, 10613, 4083, 2987, 4347, 23766, 25712, 28926, 17694, 7892, 9025, -2341, -39, -738, -7947, -13566, -15876, -23692, -24430, -21065, -13759, -14319, -36191, -36785, -32905, -15905, -1292, -2733, -14200, -14432, -19595, -23478, -28145, -24536, -28023, -12419, -1250]
10675a250K341P874J6974O519n687j1084k208L747K652r04j0165l020K0103Q976
10661C4868k609P531K5344L9106M9547O4603R1914J58517K95876M78939M96033
10650A739669P1381l95442m79558l22974j85174j06631o9956n8466k1478j2970
10640A58401j1197j7909l1865j1328m496j8696m901j4223j0436J1879K5916o535
10628F4610o550N313Q46J077m833n671j0778j1966j5995j6635p93L441q983k726
10614i643P089J2502N847j760l299j0999j5163p231J2325J5168Q142K352l785
10601A1545j2178K407K225P877k562l077M388q258q368k155l823N048O53j775
10587h053O518l70r727o258o330o8J4779K530j456L911O039R352O046K148j2859
$$ y = [-1250, 1091, 8965, 25939, 32458, 26771, 15687, 13479, 17226, 19878, 18974, 8809, 5789, 25892, 34868, 32259, 39790, 65134, 104240, 153787, 218390, 310304, 468821, 764697, 1243636, 1739669, 1811050, 1415608, 936050, 613076, 427902, 321271, 251315, 192849, 171371, 158401, 147204, 129295, 97430, 86102, 81606, 62910, 58009, 43786, 33350, 45229, 71145, 64610, 58060, 63373, 64219, 65296, 60463, 54792, 44014, 32048, 16053, -582, -1375, 2066, -6917, -9643, -2554, 9948, 15795, 14035, 10736, -263, -15426, -22657, -10332, 4836, 12978, 15330, 11545, -633, 1774, 3999, 11876, 9314, 6237, 10625, 2367, -6001, -8156, -11979, -6931, -6278, -8053, -1535, -1905, -11632, -17890, -24220, -24288, -9509, -6979, -8435, -4524, 1515, 10867, 16913, 19061, 6202]
10572F202o575N458K903k887L687n047N689P593l958L147N66l286n262L708J6679
10557B8617j106m00R437M023J9620K1335j5290j9075k5921j8311j7642O17P073
10544g023J660Q844Q348L315o108j2782P574P270o570L567J6169N642O979j5262
10530B1623j8769R460J6266M245j2210q017K793M900r312j4590O005Q808k33o531
10516D438L73L754N547M510L597p053J5018J1952K648J259J0903J1817J9040J6197
10502A04000L0217O5681N9874J2008l3166o0699n5479k6179N29P104J9809P962
10490A31661j2130j4472K5255K2312J2370O724J1476L4485N0852Q0016O3472L0075
10478D42096K5761Q1278J49702K59522M31427P13221J059371J084394N86508o5707
$$ y = [6202, -373, 5085, 7988, 5101, 8788, 3741, 9430, 17023, 13065, 16212, 16778, 13492, 8230, 11938, 28617, 27511, 27111, 36548, 40571, 60191, 81526, 66236, 47161, 21240, 2929, -14713, -14096, -7023, -5363, 3481, 11829, 15144, 9036, -3746, 3828, 11098, 4528, 8095, 24264, 29906, 36885, 21623, 2854, 12314, 28580, 32825, 20615, 12598, 15391, 20291, 10979, -3611, 2394, 11202, 10969, 4438, 4811, 8565, 14112, 18622, 22219, 15166, 30184, 42136, 44784, 46043, 56946, 68763, 87803, 104000, 134217, 199898, 259772, 271780, 238614, 177915, 122436, 96257, 96786, 103890, 123699, 131661, 119531, 105059, 130314, 152626, 164996, 171720, 183196, 217681, 268533, 348549, 412021, 442096, 467857, 549135, 698837, 958359, 1389786, 2103007, 3162378, 4246772, 4833280, 4767573]
10468D767573p88122j092050q84550n89195l60556k10243j47808j04323p3647
10459E17079n6106n6817o1395o2492k6834k3489q435j571K630J8484J6222N281
10447B62557p692k8974l1630j6740k2778o832l622j1760k1003k6940k5721r711
10435D9154j268L602J6938L2225J6810J8560l380O386N50j951o081r176k3219
10422I9150j7080k562N800k750O274J0005o430o520m613m53k431J5990J5654J1193
10408A21227j7559j1142l357q673j407m940r114j2026L621J3379Q833R609P454
10395I5905J3451K6360J7754P001m496K974R037o090l008L460J3787Q935k210
10382A82860j507J0213R370R402L723K859K7872O2643N7721L5106K2724k8719
$$ y = [4767573, 3979451, 2887401, 2002851, 1413656, 1053100, 842857, 695049, 590726, 517079, 460973, 404156, 342761, 280269, 253435, 229946, 221511, 219940, 222570, 241054, 257276, 262557, 254865, 225891, 194261, 177521, 154743, 147911, 144289, 132529, 111526, 84586, 58865, 49154, 47886, 51488, 68426, 100651, 117461, 136021, 132641, 139027, 139577, 137626, 131545, 122369, 99150, 82070, 79508, 85308, 82558, 88832, 98837, 92407, 85887, 81274, 80821, 78390, 94380, 110034, 121227, 103668, 92526, 89169, 80496, 79089, 74149, 65035, 53009, 56630, 70009, 78842, 88451, 95905, 109356, 135716, 153470, 160471, 155975, 158949, 167986, 161896, 158888, 162348, 176135, 185070, 182860, 181353, 191566, 200936, 210338, 214061, 216920, 244792, 307435, 365156, 400262, 422986, 394267]
10370C94267n1370k4946j9397k7772j7320M863J0363K916Q505o429j7071k277
10358B54332R466K442J0686N212J3293J0222K0029M013Q268R131J1373M970j4042
10345C49395j3367j0168j2572R51J4732O180P320L379M396M336j322Q612K678
10332C64550q004N00l586O875R263M303r531Q533K057j1178Q500J1483R442Q760
10318D01967Q248O301n276r686j7924k615N392n35J4878J3182K163j7755p260
10305C91080k098R101l965r497O261J6525J9614K0214K9181L4751L8938M3333
10293E93438L4909J433o619J2237L0195K6454J0751J5808L8246N1577K9535J5497
10281H53461K7741N8100P9914Q2616O5787N4648O4165J00546J80249K51821L59655
$$ y = [394267, 342897, 317951, 298554, 270782, 253462, 258325, 268688, 271604, 280109, 273680, 256609, 254332, 263798, 266240, 276926, 282138, 295431, 305653, 325682, 329695, 337963, 347094, 358467, 363437, 349395, 336028, 325860, 313288, 314239, 328971, 335151, 342471, 345850, 350246, 354582, 353260, 361872, 364550, 356546, 357046, 353460, 360335, 369598, 373901, 364370, 372903, 374960, 363782, 372282, 383765, 393207, 401967, 410215, 416516, 411240, 401554, 383630, 381015, 386407, 385872, 400750, 413932, 416095, 398340, 391080, 388982, 398083, 394118, 384621, 390882, 407407, 427021, 447235, 476416, 511167, 550105, 593438, 628347, 629780, 623161, 635398, 665593, 692047, 702798, 718606, 756852, 808429, 837964, 853461, 881202, 939302, 1019216, 1101832, 1167619, 1222267, 1286432, 1386978, 1567227, 1819048, 2178703]
10270B178703N80842Q15418O75684R5382k26925j65894m844J79544L32711M63376
10260D923997O20855Q62482J133983J465980J979918K753686L925302N734855
10252B3401058Q592315J3521393K2782681M0991739P3308515J03305133O1542511
10245C47445345m1343780r0004942p5956838m6703394k6229811j5365844r720043
10238D2120693o851004n395561m460769l741628l089559k557329k133282j757297
10230A2134264j473561j254536j064528q71988o32739l49431l0117J30702k55522
10221F332544p48741p96095n96359m33378l71395l30531k71842j99947j45854
10212B438402j21448j33494j46670j28877j14280j05497q8303q0751r3785p5199
$$ y = [2178703, 2759545, 3574963, 4250647, 4346029, 4119104, 3953210, 3948366, 4127910, 4460621, 4923997, 5544852, 6407334, 7541317, 9007297, 10987215, 13740901, 17666203, 23401058, 31993373, 45514766, 68297447, 109289186, 182597701, 285902834, 347445345, 306101565, 216096623, 140139785, 93436391, 67206580, 51840736, 42120693, 35269689, 29874128, 25413359, 21671731, 18582172, 16024843, 13891561, 12134264, 10660703, 9406167, 8341639, 7469651, 6836912, 6487481, 6457364, 6588066, 6332544, 5583803, 4787708, 4191349, 3757971, 3386576, 3056045, 2784203, 2584256, 2438402, 2316954, 2183460, 2036790, 1907913, 1793633, 1688136, 1599833, 1519082, 1425297, 1350098]
10202A350098n5879o7223p5081p2112m3916j9526k1570q423J1127k0006k5492
10191I51997j7119j5041k3974l7485l5959l5447k7368k8613l1330k3684j5766
10180F60211l697r710k5770l3934l5855l1984j1851k997l982j383p237J426q551
10167D84686k2273q171j3275j3160k1833j5137j4100m442j283j0048j1425m137
10155C45402j6792j6596k774N742M927j4295j0385j0897j4497k2841j8263l74
10143B28357p694K02J6747O245O794L56J172J3600R056k157j2460j1182q452j502
10129B39082l309j096O241N511j4140n889J972K2893L1867m539o610k320r335
10116B60328n987m279n288p865j6061j9298j76K380j1136j6238J2P696p762n874
$$ y = [1350098, 1294219, 1226996, 1151915, 1079803, 1035887, 1016361, 994791, 986368, 997495, 977489, 951997, 934878, 919837, 895863, 858378, 822419, 786972, 759604, 730991, 699661, 675977, 660211, 656514, 646804, 621034, 587100, 551245, 519261, 507410, 504413, 500431, 499048, 491811, 493237, 484686, 462413, 454242, 440967, 427807, 405974, 390837, 376737, 372295, 371012, 360964, 349539, 345402, 328610, 312014, 309240, 314982, 319909, 305614, 295229, 284332, 269835, 246994, 228731, 228357, 220663, 220865, 237612, 243857, 250651, 251007, 252179, 265779, 274835, 272678, 260218, 249036, 240584, 239082, 235773, 234677, 240918, 246429, 232289, 226400, 228372, 251265, 283132, 278593, 271983, 269663, 260328, 254341, 250062, 244774, 236909, 220848, 201550, 201374, 203754, 192618, 176380, 176392, 184088, 176326, 170452]
10102A70452M95j1131j7617q54J4126K1146r165j0557N514K6792L4104J786k2054
10089B03037k3659j7772j7618P430k311J905m606M024k50J2304R169n326r599
10076A56728q474L246J0603r814j0088M556k221j7253k596n502j3431k2217j51
10063H3386R629J0569J2527N513J6487K0191J6955O949j488k5876k6193k1501
10051A07148j5653J292K981j492j1371q974p01l262K512R436J0723J7233K3102
10038A32974J7318O809J8934M2880R2526J14123k7764j00603o7808l6222k0560
10027A72607j0417j3824j3774j6144n503J561j053J110j9927j2270J3966R040
10015A05372R428K848q946k2974O86J0594J373j2543j7442N120J1709L516j706
$$ y = [170452, 170947, 159816, 142199, 141345, 155471, 176617, 167452, 156895, 162409, 189201, 223305, 225091, 203037, 179378, 161606, 143988, 151418, 149107, 151012, 146406, 150430, 150180, 162484, 171653, 166327, 156728, 148254, 151500, 162103, 152289, 142201, 146757, 144536, 127283, 124687, 119185, 105754, 83537, 83386, 93015, 103584, 116111, 121624, 138111, 158302, 175257, 182206, 180718, 154842, 128649, 107148, 91495, 92787, 95768, 94276, 82905, 73931, 73230, 69968, 72480, 81916, 92639, 109872, 132974, 150292, 157101, 176035, 218915, 311441, 425564, 397800, 297197, 229389, 193167, 172607, 162190, 148366, 134592, 118448, 112945, 114506, 113453, 114563, 94636, 82366, 96332, 105372, 114800, 117648, 108702, 85728, 86414, 97008, 98381, 85838, 68396, 73516, 85225, 88741, 87035]
10002H7035O45j642j496J9414O301k58l310P301M853r81M858j6301j2992p563
9988H5864m569m478j1798L322l330j953O898N74R346j1843J629Q191r883j3400
9974E4570q017P265J6756K665p083k388r43O181j574k1223p937P736J1184k268
9960E4924k412L647K4591J6493p973n612k260p279j148K750p187N772K0603N070
9946I9979o299n066j1021k1826l0315k3792q701J421J7013K6549N356O17j31R717
9932E3501J0328J023N870Q833O418n265k2196j7978m869K396n73K564J7874J2678
9918G0604L767K720L205j642p748n590l254o71p938l478J2787L160n801r47j350
9903E7824p828P253O712j0318n622N858P806O904K403j85r696N63N577j655l958
$$ y = [87035, 87680, 86038, 84542, 103956, 110257, 109999, 106689, 113990, 118843, 117862, 122720, 106419, 93427, 85864, 81295, 76817, 65019, 68341, 65011, 63058, 69956, 70530, 79876, 68033, 69662, 77853, 67970, 54570, 46553, 53818, 70574, 73239, 66156, 63768, 62825, 69006, 67432, 46209, 38272, 46008, 57192, 54924, 52512, 56159, 80750, 97243, 89270, 83658, 81398, 74119, 72971, 75721, 68534, 74306, 94909, 99979, 93680, 88614, 77593, 55767, 25452, 1660, -7041, -5620, 11393, 37942, 43298, 43915, 43784, 53501, 63829, 64852, 70722, 79555, 85973, 80708, 58512, 40534, 35665, 38061, 37488, 40052, 57926, 70604, 74371, 77091, 80296, 78654, 70906, 65316, 62062, 61391, 53453, 49975, 62762, 65922, 60121, 59174, 57824, 49996, 57249, 63961, 53643, 48021, 53879, 61685, 68589, 70992, 70807, 61111, 61674, 67251, 65596, 61638]
9888F1638k467M322l635q720k859p681L089P686N255p470J0762J247l598j723
9874E5846j844l912j250j853P30q639O019Q100j8520J765J6907K9617J608r279
9860G5295O436R095N469j5438q036M969M739j701p006K619n925J817M855J6571
9846I3759K0719J6718K2445L9655M8798O6414J20848K41512M19967N63257L75853
9835B029945j33903l23222k11348j57726k16798k50522k09759j29925p6923n9453
9825B60366m8239l3731j6413j2389j6286j5479L610q700r169N023K67J137m000
9812A05997j7501p410j0315p658k279Q574K92P40j5142j5770R420P656K807l329
9798E6082MO053P25q560N197L684o519q161N273K848N325L047j8962n327j1314
$$ y = [61638, 59171, 63493, 59858, 51138, 48279, 40598, 43687, 51373, 56628, 49158, 59920, 61167, 57569, 55846, 54002, 50090, 48840, 46987, 47717, 39078, 45097, 53197, 34677, 36442, 53349, 82966, 84574, 75295, 81731, 90826, 96295, 80857, 72821, 77790, 82529, 80828, 73822, 76441, 70516, 72333, 77188, 93759, 114478, 131196, 153641, 193296, 242094, 308508, 429356, 670868, 1090835, 1654092, 2029945, 1896042, 1572820, 1361472, 1203746, 986948, 736426, 526667, 396742, 319819, 260366, 212127, 178396, 161983, 149594, 133308, 117829, 121439, 112739, 103570, 108593, 108860, 109997, 105997, 88496, 81086, 70771, 63113, 60834, 69408, 69700, 70440, 55298, 39528, 48948, 56604, 59411, 56082, 56086, 62139, 62864, 54304, 59501, 63185, 56666, 48505, 53778, 56626, 61951, 64998, 46036, 40709, 29395]
9783B9395m147L795K451o91p63L477m973P859L278m161N021O810o557p756p163
9768B5875L579J4051O98m837k575K524p325o169m917J97P610r250j847k786M992
9753A9820M382M166M536n791o334j399J5770l708p682r161j0081L286J7525K3786
9739D9115L885m322o598p08j546j862J636m776k159N998l835M49L400j8463j0981
9724I233L276J662P847J2129j365j404j473J0373r116j5527L123N753M026j222
9710B7315L133Pl492O696O147p979o981J112l750N736M591J916J351n477N802
9695C6127l504j776l403j0292o538n665o950Q407n371J4295L475p801L369J857
9681A6230N584J609L869N40p031q264r469n148J051N880O303M744n261Q000J1910
$$ y = [29395, 25248, 29043, 31494, 30803, 30040, 33517, 28544, 36403, 39681, 35520, 40541, 47351, 40794, 33038, 25875, 29454, 43505, 44203, 39366, 36791, 39315, 31990, 25821, 20904, 21101, 28711, 19461, 17614, 14828, 19820, 24202, 28368, 32904, 27113, 20779, 19380, 35150, 31442, 23760, 14599, 4518, 7804, 25329, 49115, 53000, 48678, 42080, 41372, 39826, 37964, 39600, 34824, 32665, 38663, 34828, 35277, 38677, 20214, 9233, 12509, 14171, 22018, 34147, 32782, 31378, 29905, 40278, 31162, 15635, 18758, 24511, 28537, 27315, 30448, 30455, 26963, 33659, 39806, 31827, 24846, 25958, 22208, 27944, 32535, 34451, 35802, 30325, 36127, 32623, 30847, 27444, 17152, 10614, 4949, -2001, 6406, 1035, 15330, 18805, 11004, 14373, 16230, 21814, 23423, 27292, 27832, 20801, 12537, 3068, -2080, -1029, 4851, 11154, 15898, 10637, 18637, 30547]
9666C0547o366r655j094q601l646K468Q278J0489J1718j2664j1821N128j086N440
9652A9135r883j0167J4974J0200J045o624n303O265J1752k230j2084O918n224
9639A8774l320K727o252N851J3953L553j5080p974N91L607J1274r615j320k265
9625A4504J2846L548r51m447r198p498J013j148j407p923L160J008M623O117o597
9610G650p994j699O704o54L427L269O924Q805n088j770k478k232J1642J725j0997
9595A7234K526O770Q581J593l638q782j1540M248Q060J446q329n162j280J089
9581A2816N656N640q205m761O156M63m963j2687m055J576k220J8377J4747J122
9567B9662m744n223l015O021J0442k622k549m612o197J0687o837r896M171N21
$$ y = [30547, 24181, 14526, 13432, 4831, 1185, 3653, 11931, 22420, 34138, 21474, 9653, 14781, 13695, 19135, 9252, -915, 14059, 24259, 25304, 18680, 13377, 19642, 31394, 29164, 17080, 23998, 18774, 15454, 18181, 11929, 17780, 31733, 35286, 20206, 12232, 12823, 16430, 27704, 18089, 16769, 14504, 27350, 30898, 29947, 25500, 16302, 8804, 9817, 8669, 7262, -661, 2499, 3507, 8130, 14247, 7650, -344, -2043, 4661, 4007, 7434, 10703, 17627, 26432, 21344, 19574, 17096, 14864, 26506, 28231, 17234, 19760, 26530, 35111, 36704, 33066, 24284, 12744, 16992, 25052, 26498, 18169, 13007, 11727, 12816, 18472, 24112, 15907, 11146, 17302, 17765, 12802, 115, -3940, -2364, -4584, 13793, 28540, 29662, 24918, 19695, 16680, 22701, 33143, 30521, 27972, 23360, 17163, 27850, 21013, 11117, 15288, 15809]
9553A5809M99m927k862j507Q331Q738K435p747O362k521L762k26l724J494k546
9538B1370P533J3146N877j2130j9998N019J670R945M428j0181r446j2198p993
9525b958L4J5210M659J0203M810J698j0273o155o978Q559N884r823N084j980m794
9510A3180j935K027L77J3652M022o419j1622N231k649L037N828j1533q136Q874
9496A3934J2857k118n439N677l42m237M581p745j9530m861n106N786J1086J6414
9482B0957O775j1417r076R98Q240j887j0794k706K042J1160k774J0283P870l941
9468B5730j2520q695r928J0982J4523K566o675o458K733q490O111J1587j3122
9455H344j0989J1778L015l256m895L543K028l666P81M130J189N702k183o413n479
$$ y = [15809, 16308, 11381, 8519, 7012, 15343, 24081, 26516, 18769, 25131, 22610, 26372, 26146, 22422, 23916, 21370, 28903, 42049, 47926, 35796, 15798, 20817, 22487, 32432, 36860, 26679, 17233, 5035, -2958, -2924, 12286, 16945, 27148, 31958, 33656, 23383, 17228, 10250, 18809, 24693, 14870, 19954, 17974, 13180, 11245, 13272, 13649, 27301, 31323, 24904, 13282, 18513, 15864, 18901, 24729, 13196, 5060, 13934, 26791, 24673, 19234, 24911, 24569, 20332, 24913, 17168, -2362, -7223, -12329, -6543, 4543, 20957, 27732, 16315, 7239, 8237, 16477, 14590, 3796, 1090, 3132, 14292, 11518, 21801, 29671, 25730, 13210, 4515, -5413, 5569, 20092, 22658, 15983, 9525, 12258, 3768, 9879, 21466, 8344, -2645, 9133, 12148, 8892, 3997, 7540, 9568, 5902, 6683, 10813, 12002, 17704, 15521, 9108, 3629]
9440C629m134j4133J2096O230M471N310L132n933r127M120Q674J464n616r716
9426D67l878Q69J0358J0466R232N379o081r763k337K090m265N68j0522J4752J4468
9411C1803r6j3006p172L30Q441j0634j619N301k235N386Q580o659n183m874j421
9396F942k014J7077J7541j1642p092o361j1773k310M120J4445K009l029J0628
9383B8541J0147N066p07r367j1062n832l781K581j0167j9804O10J2215J1464L391
9369A3295O014K991p907k933M997N115J56q362o614N907j820j902N396j7195N719
9354B857L01M013Q055m780n756l17K789q403j9753J1074Q083l810p26J4990J5761
9339B4378p058j8322n976K988Q888L923O116J1968o425L315K266q412o658N03
$$ y = [3629, -505, -14638, -2542, 3688, 8159, 13469, 16601, 10668, 1541, 5661, 14335, 15799, 10183, 467, -3411, -2542, 7816, 18282, 27514, 32893, 26812, 17049, 14712, 16802, 12537, 13105, 2583, 17335, 31803, 31707, 18701, 11529, 11859, 20300, 9666, 8047, 13348, 11113, 16499, 25079, 18420, 13237, 8363, 6942, 4928, 22005, 39546, 27904, 20812, 14451, 2678, 368, 4488, 18933, 20942, 17913, 28541, 38688, 43754, 43047, 33680, 22618, 16786, 13005, 15586, 5419, -14385, -13775, -1560, 9904, 13295, 19309, 22300, 14393, 11460, 16457, 21572, 21728, 13366, 6752, 12659, 10839, 8937, 14333, -2862, 2857, 3158, 7171, 15226, 10446, 4690, 4373, 7162, -1241, -20994, -9920, -1837, -5647, -6373, 8617, 24378, 17320, -1002, -6978, -3990, 4898, 8821, 14937, 26905, 20480, 23795, 26061, 17649, 10991, 11494]
9325A1494R963j5776n212Q346P768n009j4674n816J0183J3841J4204k982j7606
9312H724k2268K714L083M124p36n786m305m345M538J3990O5l831R984k776K366
9297E541J744n766p80K128J0548Q806q395m154l542M631N127n939J045R262j636
9282A8620n481o240J230o118p859Q03M125M327p13m016n34k727P635R650p93O515
9266A8424N362j5580m946N859N740l46j2764k81m506n525R993M146N067N560K574
9251A8777l77j1232r364J5509J2766M93p064q197l153J0660j1646j3468p563J4089
9237B30J8584m617n88J5866p619j7359j843P249J0923r565r67j3077q503Q156
9223c130K0103J861j2857l526P328K458K254j1224p181J4322J9323Q42k048o122
$$ y = [11494, 21457, 5681, 469, 8815, 16583, 11574, -3100, -8916, 1267, 15108, 29312, 26330, 8724, -13544, -10830, -7747, -3623, -4359, -10145, -14450, -18795, -14257, -267, -202, -4033, 5951, 3175, 5541, 7285, 1519, 739, 2867, 13415, 22221, 13826, 9672, 6130, 10761, 15888, 9949, 10994, 20256, 18620, 13139, 6899, 8129, 2011, -5848, -5045, -920, 3407, 2694, -1322, -1856, -4583, 3052, 12702, 11909, 18424, 23786, 8206, 3260, 9119, 14859, 14513, 1749, 1468, -3038, -8563, 1430, 5576, 10643, 16203, 18777, 18400, 7168, -2196, 13313, 26079, 26572, 19508, 11311, 8158, 18818, 7172, -6296, -13859, 230, 18814, 14197, 13609, 29475, 21856, 4497, 2654, 9903, 20826, 11261, 10294, -2783, -11286, -3130, 16973, 18834, 5977, 2451, 9779, 12237, 14491, 3267, -3914, 10408, 29731, 30573, 28525, 22403]
9209B2403L113l955j1031q627j023l840o86J1293M268p479j2865N739N981L423
9195F714P530j954N416q316R083J2023j894r381j4137m126L004r220m560R876
9181E8q622J725K3131O950j569k817j323j467M305j0819j15J5348m88j364R083
9166C2016J1817j5690k4860j4176K997J2150L097P2m704J0807O789j841m92L953
9152B1935M116r848j1116j521l341L878J692j860N340n212M304O109M685j0001
9138I160q423k654P70l28j097o924K778R082N252R927Q568o279q235M698p239
9123I056k0506O100K202O91k699M477J0853M933l907r62q277r781m574j54p61
9108a3309L515r015r56J6155R653o19J863q433K101O954K682n474q638l104Q662
$$ y = [22403, 25516, 21561, 10530, 1903, 880, -2960, -3646, 7647, 11915, 4436, -8429, -2690, 3291, 6714, 14244, 12290, 17706, 9390, 18473, 30496, 28602, 19221, 5084, 958, 3962, -5258, -9818, 58, -8564, -6839, 16292, 23242, 21673, 18856, 17533, 16066, 20371, 9552, 9437, 24785, 24297, 22933, 32016, 43833, 28143, 3283, -10893, -7896, 4254, 7351, 7423, 2719, 13526, 20315, 18474, 17982, 21935, 26051, 16203, 5087, 3566, 225, 4103, 5795, 3935, 9275, 4063, 8367, 14476, 19161, 9160, 737, -1917, -1147, -1475, -2572, -9496, -6718, 2364, 7616, 17543, 26111, 19832, 11597, 16295, 9056, -11450, -5350, -3148, -2457, -5156, -679, 10174, 15107, 11200, 10238, 1961, -7820, -12394, -12548, -13309, -9794, -18809, -19765, -3610, 6043, 5424, 7287, -1146, 955, 7909, 10591, 5117, -3521, -6625, 2037]
9093B037M032m7O60K732Q106j1360k5297k691P920n085m323J5460R963O085n734
9078B458o141Q02Q83N250p401k182j755j0475j571J3584J1832R237m338k421n288
9063B474o594J942Q388k874j3524L93l120R846N757M433L415q81j1892k369P675
9048C069k490n821J748k971J0275K0681n703o165k074K840l517j207p499m124
9034b958O523N479L521o696K566M524J935J396n917L247O731K221q492j0006O122
9019A0196N751k175r98M675m649l879k478J5782J396r108j2134L869R225o769
9005H704M793P404j207p355k414q125j6949m87j1450Q203J5208R686O64P091l022
8990A0744k0149L466J7161N620P413O961j873l050q491n470O89R79m411m897j550
$$ y = [2037, 6069, 6022, 6682, 9414, 17520, 6160, -19137, -21828, -13908, -18993, -23316, -7856, 2107, 8192, 2458, -3683, -2881, -1998, 3252, -4149, -6331, -8086, -18561, -20132, -6548, 5284, 14521, 10183, 7762, 2474, -4120, -2178, 6210, 3336, -10188, -9795, -12915, -3069, 2688, 7121, 10536, 9655, -2237, -4606, 3069, 579, -5242, -3494, -6465, 3810, 24491, 18788, 12623, 10549, 13389, 9872, 8665, 1166, -2958, 3565, 9044, 12565, 5869, 8435, 12959, 14894, 16290, 10373, 13620, 20351, 22572, 14080, 4074, 10196, 15947, 13772, 12774, 17449, 12800, 8921, 6443, 22225, 23621, 14513, 2379, 6248, 15473, 8704, 13497, 20901, 19694, 12339, 9925, 1800, -15149, -15636, -27086, -18883, -3675, 6011, 6675, 13766, 10744, -9405, -5939, 11222, 16842, 24255, 31216, 29343, 26293, 17802, 12332, 13021, 14000, 9589, 4692, 3142]
8975C142J1106J5019j272k8n874j1702o925K230L889J555q700m756m826l174L711
8960f605M194K763K622M351m293n613M131M8k381j640J238l4n902j901J017O01
8944g404L092j655j525o173J5892K182q418K907J894j1706Q061J0548l218M837
8930I314j682o768L958k019O516O423J35M104j664j583k160N539j91j5551j2746
8915h375p308J0276n510r03J5733K608J155j3445j7304M63O573O97P153L353R895
8900E061J3010k140j4931P78m541j3388K056J6835K209j4390J0674L756R70J364
8886G323p138q022N155R135P243n191j5033J223j913p38j6130L553R581N408J0369
8871D825k883j68j2955Q255M729m070l395K67M584J1528R388o363p328l32p536
$$ y = [3142, 14248, 29267, 27995, 27967, 22093, 10391, 3466, 5696, 9585, 11140, 2440, -2316, -7142, -10316, -6605, -2411, 352, 2974, 7325, 3032, -2581, 1550, 1598, -783, -2423, -1185, -1219, -7121, -9022, -8005, -7404, -4312, -5967, -7492, -13665, 2227, 4409, -4009, -1102, 792, -10914, -2853, 7695, 4477, 9314, 7632, 864, 4822, 2803, 9319, 15742, 15877, 19981, 18317, 16734, 14574, 20113, 19922, 4371, -8375, -15683, -5407, -10917, -11820, 3913, 6521, 7676, -5769, -23073, -22610, -16037, -15340, -8187, -4834, 5061, 18071, 15931, 1000, 1778, -2763, -16151, -14095, 2740, 4949, -9441, 1233, 4989, 5959, 7323, 185, -7837, -2682, 6453, 13696, 8505, -6528, -5305, -7218, -7956, -24086, -20533, -10952, -5544, 4825, 1942, 1774, -11181, -2926, 1803, -2267, -5662, -5395, -811, 10717, 20105, 13742, 6414, 6082, -1454]
8856a454k062m708J5525M51j274J236k488j0176p545k006Q683K378N836r303J158
8841e749q612m436m661p360K2592J4533N649L728q616j4023q421K407J4612K310
8827C953r873r174M348J7047L636j246J0106N117j799j989j3397q409r805p049
8813a8534K974L546J0121L729j567J0133P133k679M115l630k1215j0153N92R390
8799f045P619N569P003J180m42q588P780o640j1864j1386l962L267Q342M636J2453
8784H922R570p973p838P652R981O703j2008k865k62M461M072o78o803j3114l476
8769c656j847J1685m10l642Q964n49M864o500o89j0926J49J5342R768L135J078
8754B6766j2031L062M900K318L945p202L423J921l466k333l825j3827n733n907
$$ y = [-1454, -3516, -8224, 7301, 7752, 6478, 7714, 5226, -4950, -12495, -14501, -5818, -3440, 2396, -6907, -5749, -14361, -18797, -23458, -30818, -8226, 6307, 11956, 15684, 7068, -6955, -15376, -12969, 1643, 3953, -5920, -15094, -10746, 6301, 9937, 8691, 18797, 23914, 22115, 20126, 6729, -1680, -11485, -18534, -15560, -12014, -1893, 1836, 269, 10402, 17535, 14856, 18971, 15341, -5874, -16027, -15435, -6045, 1574, 7143, 14146, 15326, 14884, 6296, 14076, 7436, -4428, -15814, -19776, -16509, -8167, -3531, 8922, 18492, 10519, 2681, 10333, 20314, 27017, 15009, 12144, 11882, 16343, 20415, 19737, 12934, -180, -3656, -5503, 6182, 5772, 2130, 11094, 10545, 15409, 8909, 8220, -2706, -2557, 12785, 22553, 25688, 26766, 14735, 17797, 22697, 25015, 28960, 21758, 25181, 27102, 23636, 21303, 17478, 3651, -2082, -7989]
8740g989j620K710l916k200J0239J7593N073q704m240N62N606O921R41j085p572
8725A2319J990K594J555n900m192q54o1n346k819r19N777L705j904m062l923m026
8709f066L562l437L205P446J2626m34n612k184o081j3165P71j493q94L919l5r08
8693h780j041q54k950k620K63K329j872L234R027p176J091l835k286J2496Q488
8678E514r535L0N842J1280L29r776L605J7489P25r125j3594J937P99n713j290
8663a483n718p406Q736P730P011j843p034o567P372p94K487M225j2431n206N249
8648e672J059K322o406J986R10M734P186R82q690K453L879J452J0898J6040K1142
8633E4275M4007N9226K7791l8444m6385m2694k4856r360P99P098M34r48j3889
$$ y = [-7989, -9609, -6899, -10815, -13015, -2776, 14817, 19890, 11186, 6946, 7508, 13114, 20035, 20976, 19891, 12319, 14309, 16903, 18458, 12558, 8366, 7512, 7451, 2105, -714, -1633, 4144, 7849, 5945, 1883, -2040, -6066, -2504, -5941, -2736, 4710, 17336, 16902, 11290, 9106, 3025, -10140, -9369, -10862, -11756, -7837, -7872, -8780, -9821, -10675, -13625, -16245, -15982, -13653, -15525, -12291, -3264, -10440, -9349, -13184, -15470, -2974, 5514, -4021, -3991, 1851, 13131, 13460, 3684, 7289, 24778, 25503, 16378, 2784, 4721, 5520, -193, -1483, -7201, -14607, -5871, 1859, 8870, 7027, -7, -6574, 798, 4, 2491, 6716, -5715, -10921, -5672, -4613, -2291, -8697, -6711, -5801, -1067, 6119, 7101, -1589, 864, 4743, 6195, 17093, 33133, 54275, 98282, 157508, 185299, 146855, 100470, 57776, 32920, 23560, 24359, 31457, 31891, 30943, 17054]
8620A7054j3692l701j608l594o79P014M481O659p347o080L44M682O716M812j1165
8605C896j424m414K167R26L992J3682n031R917R166o778M936R102O080Q2o112
8590D0187K3151M2738Q0207J16614O3351o2858j08798o9586l8275l2749k2137
8579C1845n026J21R73J688l418q908n342O566O744o567j3920k942J407Q31N160
8564I212j921n583K610K551j475N069K312m089O737K524q374M075P2m561L926
8549A3085R332J4567J0519Q4N908J1660J7948M3232M3349o326n9714m6362k2347
8536C4935j6520m328L704J780M59K612M020L104M394j0898r023J328o791M217
8522A2993l796k996M721r491j483K045l846p036n957J1346J7678Q917o787q523
$$ y = [17054, 3362, -339, -1947, -5541, -6220, 794, 5275, 11934, 4587, -1493, -1149, 3533, 10249, 15061, 3896, 2472, -1942, 225, 1151, 5143, 18825, 13794, 23711, 32877, 26099, 31035, 40137, 46217, 46299, 40187, 63338, 106076, 186283, 302897, 366248, 303390, 194592, 125006, 86731, 53982, 31845, 26819, 26940, 27913, 29601, 26183, 17275, 11933, 18499, 25243, 18676, 4756, 1814, 3221, 4052, 9212, 7291, 1708, 4318, 6869, 5394, 10463, 12775, 8686, 15423, 17947, 9573, 13648, 13720, 9159, 13085, 22417, 36984, 47503, 47587, 53495, 65155, 83103, 126335, 169684, 163358, 103644, 57282, 34935, 18415, 14087, 17791, 19571, 20030, 22642, 26662, 29766, 34160, 23262, 14239, 15567, 8776, 12993, 9197, 6201, 10922, 1431, -52, 1993, -1853, -8889, -14846, -3500, 14178, 23095, 16308, 7785]
8508G785Q745R23J829l754o060K247p331n146J2469j850n284o641N10J950J95
8493E87m184Q674K628o453p026k186k161Q245j122P177J3214j109n890J89l942
8478F641r990P731J1559o035q477j363J250Q811k964L833J5623n641n347p543
8464H088N228k184O64r114L114L190L18k21j923K717j0876N507P184N411j2559
8449D544r799j749N917o664p305j370J785M049O848j54J0884P288q818o158L191
8434B489p478J792L64l11l684J204J09O235K0779O789q205m495j1634L456m770
8419B640r769l04j396J0349P668j0493J960l332p741O14L004n715R508Q734N883
8404A1610o874j0683m817J846N296O130M33P361J2369m581j1187q266j525m984
$$ y = [7785, 16530, 17453, 19282, 15528, 9468, 11715, 4384, -762, 11707, 9857, 4573, -2068, -1558, 392, 587, -3597, 5077, 7705, 1252, -5774, -7960, -10121, -1876, -2998, 4179, 17393, 16284, 10394, 10583, 6641, -3349, 4382, 15941, 9906, 1429, 66, 1316, 10127, 7163, 10996, 26619, 20978, 15631, 8088, 13316, 11132, 11796, 2682, 5796, 8986, 9304, 9083, 7160, 9877, -999, 4508, 11692, 17103, 4544, -5255, -7004, -1087, -7751, -15056, -16426, -14641, -10592, -3744, -3898, 6986, 14274, 5456, -702, 2489, -4989, -3197, -2833, -3144, -6828, -5624, -5515, 720, 21499, 28288, 20083, 15588, 3954, 7410, 2640, -7129, -7433, -8829, 1520, 9188, -1305, 655, -2677, -10418, -9804, -6800, -12515, -3007, 5727, 11610, 4736, -5947, -10764, -8918, -3622, 2508, 2941, 10302, 22671, 18090, 6903, -1363, -2888, -7872]
8390g872L951M740k581J1091k496k870M778K373l694k547N14P354j691k715M585
8375A2920k05j9139J827J2976P532L586o955J661j375n961q575K750K188Q0r919
8360f609j0833J2933J0731L465J137K66K759J802j7648n88O224n431P548k088
8346C668o892J081K213L62r651L141q13j2234L162K097o38N278O26n623O848M987
8330b388l23J1607k361j2301N5J1041J724j0506J084P020j42M065K673m125n203
8315A920l876m570m588O779K369l557M96n4K260J683J0722l872K234J1012j2001
8300F957L854k539K359R955q091j2343L350J444K126n709R496L990o982j0662
8286b795L692M775P841J215J110J2948m799P103n036o167k125j2005J041R839
$$ y = [-7872, -3921, 819, -1762, 9329, 6833, 3963, 8741, 11114, 7420, 4873, 5387, 12741, 11050, 8335, 12920, 12715, -6424, -4597, 8379, 15911, 19497, 12542, 14203, 12828, 6867, -1708, 1042, 3230, 3310, -6609, -17442, -4509, 6222, 9687, 10824, 11090, 13849, 15651, -1997, -2585, 3639, -1792, 5756, 3668, -3224, -2143, 70, 432, -9219, -6078, -6891, -19125, -15963, -13866, -14504, -9226, -8600, -14223, -7375, -2388, -2711, 8896, 6535, -5766, -5711, 5330, 7054, -3452, -2368, 4652, 4510, 8575, 11248, 7123, 1920, -1956, -6526, -11114, -4335, -1966, -5523, -5027, -5081, -2821, -1138, 9584, 5712, 7946, 18958, 6957, 10811, 8272, 10631, 20586, 12495, 152, 3502, 4946, 7072, 1363, 10859, 14849, 7867, -2795, 897, 5672, 13513, 14728, 15838, 28786, 23987, 31090, 26054, 19887, 17762, 5757, 6798, 16637]
8272A6637P923j232j2040q931o187n882N803J3777l693M764P656M78j326j539
8258A6208r160l513L238K495P362p411L278k37j9283m894N691m740L627Q670j0968
8243i637k963j274N333m46n928N183J108L372N726K764J1310p947N920l640n499
8228C382j1551q98k400K548m341m323R858N185o440o947J203O170R244j0013J233
8213h090P336J461R54L548j701n013m714M430k178M796j3412K789J7532N529j4396
8198a129J398J4522m283q777L503o050j002J505p543k247J3935K182r61O190o50
8183A0593r923m837P551R571r064J071k958K243P443L19o090j5675j327j0972
8169b2055N698J9484K001j4764k871O034Q324M373n528j514m452j0452P9O047
$$ y = [16637, 24560, 23328, 11288, 2357, -3830, -9712, -3909, 9868, 6175, 10939, 18595, 19073, 17747, 16208, 7048, 3535, 6773, 9268, 16630, 9219, 12497, 12260, -7023, -11917, -6226, -10966, -7339, 1331, -9637, -12600, -13874, -8541, -8987, -14915, -9732, -8624, -5252, 474, 3238, 14548, 6601, 12521, 8881, 3382, -8169, -9067, -11467, -8919, -13260, -17583, -7725, -2540, -8980, -15927, -14724, -8554, 690, -9323, -8090, -754, 707, 1661, 5209, 3508, -1505, -6219, -1789, -3967, 829, -12583, -9794, 7738, 13267, -1129, 269, 14791, 10508, 1731, 5234, -816, -1818, -313, -7856, -10103, 3832, 6014, 5053, 11243, 10593, 670, -4167, 3384, 12955, 3891, 4962, 2004, 4247, 11690, 12009, 5919, -9756, -11083, -22055, -16357, 3127, 5128, -9636, -12507, -6473, 1851, 6224, 696, -818, -5270, -15722, -15643, -9596]
8155i596N665R024J2446k556j4123K523K161m547Q096K358O16P354N764j762k180
8140B1243K619k865o765k1195j5711M311M869O391K124J2195m679j4691K26J507
8126a0421L28o5M742r62R819J0666K411j4713j1771O063J214L56Q515n974R798
8111A0006M102p488Q478r13m272j5510J383N254r571P494K466p126L907N039Q711
8096A1960j95o676J60M148j0314j599Q081Q666Q208r203J395k88n982M688P321
8081B0370j634k861J1982o034j2411j1966m662k984Q038k585O92K51j3440p560
8067b4804M957J6224R349j703l743J352j236q001N597L325l400R22J4177n740
8053G276j4557K098M979J0220N177j57J93K709R45q720j2240p566L578M580J0910
$$ y = [-9596, -3931, 5093, 17539, 14983, 860, 3383, 5544, 997, 9093, 11451, 12067, 19421, 25185, 23423, 21243, 23862, 20997, 14232, -6963, -22674, -18363, -13494, -7103, -4979, 7216, 2537, -12154, -11928, -10421, -10093, -10158, -5416, -6378, 3441, 14107, 16518, 1805, -9966, -3903, -2689, -2333, 6182, 208, 10006, 14108, 6620, 15098, 14185, 9913, -5597, -4214, 1040, -8531, -1037, 1429, -5697, -1790, 3249, 11960, 11765, 5089, 5249, 9397, -917, -2516, 5565, 14231, 22439, 13236, 14631, 14343, 8361, 13049, 20370, 18736, 15875, 27857, 21823, 9412, -2554, -7216, -10200, -2162, -4747, -4055, -3804, -17244, -24804, -19847, -3623, 5726, 4023, 280, 1632, 396, -7605, -2008, 1317, -2083, -1161, 13016, 7276, -7281, -5183, -204, 10016, 15193, 15036, 15229, 17938, 18883, 10163, -2077, -9643, -6065, -1485, 9425]
8038I425j416j554k724J880m091K76j465p386k792J8660N35N668n035m338Q522
8023A4165J828N596J0393j1152k2277J72J4972J277o137j515n037L340J1168l771
8009A3022R28k04j0177L041P70j538K883r814l061m087J079N548k528O861q80
7994A843j221M055n75M809O97K987k483l449j3273k842N42k31l340K43J6126P378
7978A1266q068q733o755P833m016n577Q551O6O247J099o086K303P96r279p744
7963a8097l710L770q71L151P821p509L612n810j482n715M777R771J762J122L226
7948d182K940J6364M391n671p255m432M365J6274P681k922M152j205n170j0185
7934A5145n159L082o299j2229K147K823r530m041N832j756Q744p3k515O521O972
$$ y = [9425, 8009, 6455, 3731, 5611, 1520, 1796, 331, -7055, -9847, 8813, 9348, 15016, 9981, 5643, 14165, 15993, 21589, 31982, 20830, -1447, -1275, 13697, 14974, 8837, 7322, 2285, 5625, 16793, 13022, 13950, 13746, 3569, 6610, 7380, 5842, 8725, -1089, -4150, -8237, -7158, -1610, -4138, 2723, 1843, 622, 4677, 4102, 8911, 9608, 12595, 10112, 6663, -6610, -9452, -8910, -9141, -12481, -12238, 3888, 11266, 3198, -5535, -12290, -4457, -8473, -14050, -5499, -5433, 814, 1913, -4173, -1870, -1074, -10353, -18097, -21807, -18037, -18908, -15757, -7936, -15445, -11833, -17643, -19125, -24840, -20063, -10292, -8530, -7408, -4182, -1242, 15122, 19513, 13842, 6587, 2155, 6520, 22794, 30475, 27553, 31705, 30500, 25330, 15145, 9986, 13068, 6769, -5460, -3313, -490, -10020, -14061, -8229, -9985, -1241, -1314, -3829, 2692, 9664]
7919I664J02o611n982N064M413j1188l129j234K859Q550J0011P016k129n050P553
7904A9909o652r234n289L70K966k35O59p165R080O594K401K319o149N453R231
7889B4258r502n244l421j2513n798N008M228j430l618N627N958o854K352k282
7875c231J2803K339q222p384K571L048m512j915o584l878n045J515Q769J147n468
7860a4047p47Q331O337J8138j97r155p565J095P093p01j045J382L334p010n657
7845d14L378J276k390O967M672n154K049p82j1763m616R269L794k019O25N441
7830A0333k116M329K55j0457N033j168j1808k547k267J348J748Q295j818j6543
7816a7383r914P067m584m787O322J2437J778P568n231m885k304l00J7305Q173
$$ y = [9664, 9766, 3155, -2827, 2237, 6650, -4538, -7667, -8901, -6042, 2508, 12519, 19535, 17406, 12356, 19909, 13257, 4023, -1266, -896, 2070, 1835, 2494, -4671, 4409, 11003, 13404, 15723, 9574, 15027, 24258, 14756, 9512, 6091, -6422, -12220, -7212, -2984, -4414, -8032, -2405, 3553, -3301, -949, -3231, 9572, 11911, 3689, -3695, -1124, 1924, -2588, -4503, -11087, -14965, -20010, -18495, -9726, -8579, -14047, -14794, -6463, -126, 18012, 17815, 8660, 1095, 2190, 9283, 8582, 7537, 8919, 12253, 5243, -414, 2964, 4240, 1850, 8817, 13489, 8335, 10384, 9602, -2161, -6777, 2492, 6286, 4267, 4892, 10333, 8217, 12546, 12801, 2344, 7377, 6209, -5599, -8146, -10413, -9065, -7317, 978, -840, -17383, -27297, -20230, -24814, -29601, -23279, -10842, -9064, -1496, -6727, -11612, -13916, -14216, 3089, 11262]
7802A1262j566j293Q667N360j2017k0752m49J1540P519l917r970j299R184K583
7788D852n855K396j455p578O326Q616K398r653q639o017O52N269j824Q482m725
7773f755j0005N939l947K203Q795K375m905J412P123j803q461p859p654j383J4243
7758a0682J6653J6967r118M065N478j1655j5850N602N84n837m91P531M00l751
7744a04q690r579k360K50Q966K0806Q372p801o228J6229K892q072j5197m711k22
7729e449l29k595J2713j129m097r481M791M417J0572J180P9j2611r401p408M977
7714a3771N083j251K493J690m766l134j551m449k756J0286O821l912N76M796P320
7699C475N531O772k97j1843j4745L070J0229Q078J795n445k796j1252j2985n169
$$ y = [11262, 9696, 8403, 17070, 22430, 10413, -10339, -10788, 752, 8271, 4354, -5616, -6915, 2269, 4852, -1003, 1393, -62, -7640, -1314, 7302, 9700, 47, -8592, -14609, -13957, -8688, -10512, -2030, -6755, -16760, -10821, -14768, -12565, -3770, -1395, -6300, -4888, 2235, 432, -8029, -15888, -23542, -24925, -10682, 5971, 22938, 13820, 17885, 23363, 11708, -4142, 1460, 2044, -3793, -4284, 3247, 3647, -104, -8794, -18373, -20733, -20483, -11517, 9289, 17661, 9860, 3632, 19861, 22753, 14681, -516, -5227, -5449, -5778, -8373, 4340, 3211, -886, -10367, -5576, -1159, 9413, 10593, 10672, -1939, -11340, -18748, -13771, -8688, -9939, -7446, -5756, -10522, -13656, -15207, -19656, -22412, -12126, -5305, -9217, -8641, -3845, 3475, 9006, 15778, 15481, 3638, -11107, -8037, 2192, 10270, 12065, 6620, 3824, -7428, -20413, -25582]
7685b5582R374P627j090J1246R669P49j3662k1635M348L100L453K072J23J1165
7671I57M194J1526m179J040P179q141j5551J937N277M518J1926l231j4861o627
7657d036n430L302M787j40J67n478J779n010K2860O897j7116p559Q140R76O857
7642A0996J1294j291n717K895r576k724J322o142o215J2886j997J426K0260K21
7628B7638k921L288m131k293j1481j2977j595R924q740j1216J1132L296k708p984
7614a0768J5728J0356m213m095m523k987O459N145M24J189l128q199j2097q677
7600a9386Q270L169K350j946P328K817Q416l7p381l162L340L812M07r69p358J62
7584a68j922l512Q536N853n965J280p264j320r544j2130N347R523Q866K869J2
$$ y = [-25582, -16208, -8581, -9671, 1575, 11244, 11993, -1669, -23304, -18956, -15856, -12403, -10331, -10208, 957, 5151, 16677, 12498, 13538, 20717, 12576, -2975, -1038, 4239, 8757, 20683, 17452, 2591, -4036, -9466, -6164, -1377, -1517, -1350, -6828, -5049, -10059, 12801, 19698, 2582, -4977, 3163, 4139, 10996, 22290, 20999, 15282, 18177, 8601, 5877, 7199, 1057, -5158, 7728, 5731, 7157, 27417, 27638, 24717, 28005, 23874, 21581, 10100, -2877, -4472, 5452, -3288, -14504, -3372, -76, -2784, -10768, 4960, 15316, 11103, 7008, 2485, -502, 5957, 11102, 11526, 12715, 9587, 1388, -10709, -19386, -11116, -7947, -5597, -7543, -215, 2602, 11018, 10981, 3600, 438, 3778, 7590, 7997, 7028, -330, -168, -2090, -5602, 2934, 8787, 2822, 4102, -3162, -4482, -14026, -26156, -20809, -11286, -2420, 449, 461]
7569D61m90l203n355k318M757P834r909j7466j038J7427K474J88N124R776k342
7554E920j0961k304K028m412m741l66J7044O985n512K86k478p056o780R452N414
7539B519p821J0979J3954N041q115j3482J625p313k5635J317J2541N575J1919
7526C104O660m680m034M750n085O552J469j606j005j6663m890N872q42Q904Q549
7511G055Q040J463j0847m445j197K225P271J942j2147n453N027J734j3178j6750
7497b9260N972K4295R699j5068n146P103j605j236r85n822N035K322r545K87K882
7482a1072m070Q400m229O318L708P948k272q221P41J0391p925O064K693q381J167
7467A260l75l029J5405n87L004r468k836J1468l802L291r331j0151N425M025o899
$$ y = [461, -29, -3232, -8587, -10905, -6148, 1686, -8223, -25689, -26727, -9300, -6826, -6638, -1514, 8262, 5920, -5041, -7345, -5317, -9729, -14470, -14836, 2208, 9193, 3681, 3967, 1489, -5567, -12347, -2895, 2519, -5302, 5677, 19631, 24672, 16557, 3075, 4700, -2613, -28248, -26931, -14390, -8815, 3104, 9764, 5084, 1050, 5800, 715, 7267, 8736, 7130, 6125, -10538, -15428, -9556, -10398, -1494, 7055, 15095, 16558, 5711, 1266, 69, 2294, 9565, 11507, -640, -6093, -1066, 668, -12510, -29260, -23288, 1007, 10706, -4362, -9508, -2405, -4010, -5246, -6231, -12053, -7018, -4696, -14241, -13954, -11072, -15142, -6742, -10971, -4653, -945, 7003, 4731, -3490, -2749, 7642, -283, 5781, 8474, 93, 1260, 885, -2144, 13261, 12674, 15678, 6210, 3374, 14842, 11040, 14331, 5000, -5151, 274, 4299, -2600]
7452b600k490O649n079K197L860J393P7n740j4361K979L361J0140P262q273m336
7437d961J912N423j1248n0L502K390K102r168p668K815L246O71N318P43o056n683
7421a6712n367J800n37O553M295K922N104L773O030O305O759J492l736r703l872
7406E106J508p472q462K480O049l40l503J0783O095k627j6307o519O583j96r038
7391a5860k279j279j514q05N706J0056J318J186q854n079J5152N877j28p894j2975
7376a7372o990o584N05Q014J4065M61l922r540J1631J3299M706l011n001J8740
7362A9001N668j8608P20P284j385J13Q332j9949j632Q468k251M374P108N973q29
7347B2387q556q911m106J529m045p430m919j000K910J309N226J0469j453l953
$$ y = [-2600, -5090, 1559, -3520, -1323, 2537, 3930, 4007, -1733, -16094, -13115, -9754, 386, 7648, -625, -4961, -3049, 2374, -8874, -8924, -5422, -3032, -930, -10098, -17766, -14951, -11705, -11034, -5716, -4973, -11029, -16712, -22079, -20279, -20816, -14263, -9968, -7046, -1942, 1831, 7861, 14166, 20925, 22417, 18681, 8978, 5106, 6614, -858, -9320, -6840, -791, -1131, -4634, 6149, 12244, 9617, -6690, -13209, -6626, -6822, -15860, -18139, -19418, -20932, -21737, -16031, -5975, -4657, -3471, -12325, -17404, -2252, 3625, 3497, -4397, -17372, -24362, -30946, -30441, -22427, -8362, -7901, -11823, -21363, -9732, 3567, 8273, 5262, 261, 19001, 24669, 6061, 6781, 14065, 12680, 12793, 21125, 1176, -456, 8012, 5761, 10135, 17243, 23216, 22387, 13831, 4920, 814, 2343, -1702, -9132, -14051, -15051, -12141, -10832, -5606, 4863, 3410, -543]
7333e43n151l229J43L824M596M397N692Q99j584n907j106p477q295O515J1307
7318D081p568r943J399J1646K990J076n345M714Q474M135j5305K090J16j4676
7304a2116m086N272J2731O83j2256Q35m249O03O909J5233L667R19j3170k1453
7290b0478K327O149O498l180n255J735O387L351P941K194N358L866r20O55o74
7275A5954K608K971j6576q325J2968j6086j4942M126K193m643p289J0884M991
7262a1166J4193O60m549O88J2428K443n268o817j531J6051n193j2165N794k173
7248C395m006m235o260K034K894L548M975M763j2188k540J855j491O552L541l446
7233f09J740J569k591J462P559N512Q67n727K757N705K996k3769p232n089k698
$$ y = [-543, -5694, -8923, -8780, -4956, -360, 4037, 9729, 10628, 9044, 3137, 2031, -5446, -13741, -7226, 4081, -3487, -13430, -12031, -385, 2605, 3681, -1664, 3050, 11524, 15659, 354, 2444, 2560, -12116, -16202, -10930, 1801, 2484, -9772, -8937, -13186, -12583, -5674, 9559, 13226, 14145, 975, -20478, -18151, -12002, -5504, -8684, -13939, -12204, -5817, -2466, 5475, 7669, 13027, 16893, 15973, 16628, 15954, 18562, 21533, 4957, -3368, 9600, -6486, -21428, -17302, -15109, -19752, -27041, -16157, -11166, 3027, 3687, -862, -174, 12254, 14697, 9429, 2612, 1081, 17132, 11939, -226, 5568, 3395, -611, -4846, -11106, -9072, -6178, -2630, 2345, 7108, -5080, -7620, -5765, -7256, -704, 2837, -609, 1131, 2700, 109, 1571, 9130, 14642, 15509, 9782, 12539, 18244, 21240, -2529, -9761, -14850, -17548]
7218a7548J2131K000j3716l546j0157J0152J284m398O279l54p941L228J2840o460
7204a6206m440J356J885J0193k518j2419L276R714L898k330j453j810P215n501
7190i140J491J5384j541q871N77n290J1618K649n790R010Q236j7478o795K825
7176c115o722J1649L020k389n371R870m997p591k644p439L850p17M882J14J0044
7161B444l466r341l889J1443K843n968q402q899P624J9245P94J509J294j3965
7147f734J269j23J882M356Q41n111J5837q85o196P993k346M625n142M167K350
7132A6783j0329l677k854j3629m313n008J0384M126n575J89o292l035K532j0203
7118c0901O39O068p51J1305L101N766P38o63p787p193N739L183p623j289N351
$$ y = [-17548, -5417, -3417, -17133, -20679, -30836, -20684, -19400, -23798, -17519, -17873, -25814, -22586, -9746, -16206, -20646, -19290, -17405, -7212, -9730, -22149, -18873, -9159, -5261, -7591, -9044, -10854, -3639, -9140, -7649, 7735, 6194, -2677, -2100, -7390, 4228, 6877, 1087, 10097, 18333, 855, -5940, -3115, -9837, 1812, 4832, 2443, -2928, 6942, 1945, -5646, -8290, -15729, -11879, -12596, -7714, -7600, 2444, -1022, -10363, -14252, -2809, 34, -5934, -14336, -23235, -15611, 3634, 4428, 5937, 7231, -6734, -5465, -5588, -3706, 650, 1491, -3620, 12217, 11332, 5136, 13129, 10783, 15408, 10266, 14433, 16783, 6454, 2777, -77, -13706, -18019, -23027, -12643, -8517, -14092, -13903, -20195, -23230, -20698, -30901, -30262, -24194, -24945, -13640, -10539, -4773, -4035, -4698, -12485, -19678, -13939, -10756, -18379, -19668, -14317]
7103a4317R107J0431M569K2305l518k1471j0265p312J8725J0544j2556j2766j6087
7090b2611M675J1158J869m991K192Q300n237j710J938N969K921P102L449l179
7076A1845j3917k859J384k168N088P462O653j1234j1705p705j472K001k359R069
7062i917j771Q0o551L854J2148N993M932L109Q06n211q213l907P237J904o731
7047b238K083O630p996q001m627P221J1008J658j88L956L048n197m158P762k576
7032H385j5557k609m432R615M969j1477M0J5313N929n930n52q568l926R66N885
7017a949N154L707k856r482O623n857l085j3091N412K855K2697J8163k831j8728
7003F732k02l305l157j310p072l009m782p499k769J190M399j712P452J1596q416
$$ y = [-14317, -5210, 5221, 9790, 32095, 28577, 7106, -3159, -10471, 8254, 18798, 6242, -6524, -22611, -17936, -6778, -4909, -9900, -7708, 592, -4645, -6355, -4417, 1552, 4473, 11575, 15024, 11845, -2072, -4931, -3547, -5715, -627, 6835, 13488, 2254, -9451, -17156, -18628, -16627, -18986, -9917, -11688, -11608, -18159, -14305, -2157, 3836, 8768, 11877, 12683, 7472, -741, -4648, 2589, 4493, -2238, -155, 6475, -1521, -9522, -14149, -6928, 4080, 5738, 5550, 9506, 12554, 7357, 3199, 10961, 8385, -7172, -9781, -14213, -4598, 371, -11106, -11066, 4247, 10176, 4246, 3694, -4874, -8800, -7834, -1949, 3205, 6912, 4056, -5426, 1197, -4660, -7745, -20836, -15424, -12569, 10128, 28291, 25460, 6732, 6530, 3225, 68, -1242, -8314, -11323, -16105, -23604, -26373, -25183, -20784, -22496, -15044, -3448, -11864]
6988a1864K931R704J0007j749q577m28m524o427J0057L248J88O229o857j5773
6974a3835j2955O555J3233J281n520j104p793n150Q957J257q788K3066J7664j4098
6960B770n167p576j2475n046J0072J3417R917R6j9916j9225P801J1491N740r16
6946i017l834j47J2868K210M182J169r11q231o878N600J1230J395l079j8024k0422
6931c1889L231P390Q004l25R314J4710K489N720J734k518j3968l848l054M484
6917A474L918J169o120K018j0909K221j114K221R945l344j423M874j2514M855
6903b729L037k110R511O60o328k66o208m838m037n36J0934L028J3770K517k102
6888A4303r775k654Q13J3597p130m055Q008J080o190m26l029N005K740l462n453
$$ y = [-11864, -8933, 771, 10778, 9029, 452, 24, -4500, -10927, -870, 2378, 2566, 8795, 1938, -13835, -26790, -20235, -7002, -5721, -11241, -12345, -20138, -25288, -16331, -15074, -23862, -796, 16868, 2770, -2397, -9973, -22448, -27494, -17422, -4005, 5912, 6008, -13908, -33133, -25332, -13841, -8101, -9017, -12851, -12998, -130, 2080, 6262, 7431, 6520, -1711, -8589, -2989, 8241, 9636, 6557, -11467, -31889, -28658, -21268, -13264, -13589, -4275, 10435, 12924, 18644, 20378, 17860, 3892, 44, -3010, 1474, 5392, 6561, 441, 2459, -8450, -6229, -7343, -5122, 4823, 1479, 56, 4930, -7584, -2729, 308, -1802, 7709, 8369, 2041, 1775, -4433, -9271, -13308, -13844, -2910, 118, 13888, 16405, 14303, 4528, 1874, 2687, 16284, 9154, 5099, 13107, 14187, 7997, 7571, 4542, 9547, 12287, 8825, 3372]
6873C372m451k955j1466m285J3821J6372r376n550J756J91N88J898J0188M634
6859A4737p244o866r254n43r26K141O834m152o216Q404P12L187J4823K091q691
6844I037j1321q41J873k548J49P758k538j6380Q195R924q398j272R248k499l690
6829c303K253N251K446j4048l921L298J202o85O887K070r199L576L401M015K254
6814E497J367J112N567J825q208P189N7q450p358l316q394J5389k348J738m008
6799b341L878j1211j352N439O233P53j2140O739P042j0898o515O211J816L424
6785b922J1593M748K61m819P05l187n802j669n452j948r858k977M686Q709n123
6770a3055J924n558O275R565J3934N060j0166J599K315m363o988p02l467K94o143
$$ y = [3372, -1079, -4034, -15500, -19785, -5964, 10408, 1032, -4518, -2762, -2571, -1983, -85, 10103, 14737, 7493, 627, -8627, -9170, -10096, -7955, -1121, -5273, -11489, -3085, -2373, 814, 15637, 17728, 9037, -2284, -3125, -1252, -3800, -3651, 4107, 1569, -14811, -6616, 3308, -5090, -6362, 2886, 387, -3303, -1050, 4201, 6647, -7401, -11322, -8024, -6822, -7507, -620, 1450, -7749, -4173, -772, 3243, 5497, 6864, 7976, 13543, 15368, 7160, 14349, 14406, 5956, -1402, -4718, -13112, 2277, -71, 1667, -2341, 1537, -9674, -11026, -5587, 646, 1399, -10741, -4002, 3040, -7858, -14373, -8162, -6346, -2922, 8671, 13419, 13680, 8861, 9566, 6379, 577, -1092, -6544, -8492, -18350, -21327, -16641, -7932, -13055, -11131, -16689, -10414, -849, 13085, 18145, 7979, 9578, 11893, 7530, 542, -160, -3627, -3333, -9476]
6755i476k978K913P000j897n833N318J567M457m28R51j222m01J326l094M982k316
6739H69o329l544N767R004K132J0272L275k115k61j779j1070m645p715o019J2934
6724G76J0346L847j2207l633J2325K008K89J1701J9480L359Q444K2616L7073N7541
6710A73965J06392J40428J39351M4104j17732j41041j19267p1698m6712k7692
6700H0098n124p034r735j3002j5853n011r697j0817Q188P583K307J07Q015M731
6686C4756n490p497J3606J070j1234j2047j726N530r626l58O760j2555p497Q980
6672B672q809O589J642p01N257n965q670M283K225J0181o266k502o168j150J0462
6657C080K23K119q41j1514L91R660O308k670j1722n173j3669O455P047L439L992
$$ y = [-9476, -12454, -9541, -2541, -4438, -10271, -4953, -3386, 1071, 643, 1594, 372, -29, 1297, -1797, 3185, 869, -5460, -9004, -3237, 5767, 7899, 18171, 21446, 19331, 19070, 17291, 6221, 1576, -6139, -12158, 776, 11122, 14969, 2762, -871, 11454, 13462, 13751, 25452, 44932, 48291, 56735, 79351, 116424, 173965, 280357, 420785, 560136, 604240, 486508, 345467, 226200, 154502, 107790, 80098, 74974, 67940, 58205, 45203, 29350, 24339, 14642, 3825, 12013, 19596, 21903, 22010, 30025, 34756, 29266, 21769, 35375, 36445, 25211, 13164, 11438, 16968, 7342, 6984, 13744, 1189, -6308, 2672, -6137, 452, 2094, 1393, 6650, 685, -7985, -3702, -1477, 8704, 2438, -64, -6232, -7382, 3080, 3303, 5422, 4581, -6933, -6542, 3118, 9426, 6756, -4966, -10139, -23808, -17353, -10306, -6867, -2875]
6642b875m128L021K6J933M001P495R533j3795q705K981k242p678r735L18P506
6627a2344k337N561J0283j497K294K353j693q14j5237l341L324R347J362j614
6613d353K213m947j363r699o79R307Q177L46j053k035m940p8Q574K014n837O323
6597A970M914J215N077K543m918n74n703j7233K770Q678J0663K874j0483Q41K041
6582D675o181j8307K067J0671J028l844N375l058K608L754Q401q946k595j2538
6568a6890l081K192n77p57M301O426J2385J845o537j3472M967M629J0141N020
6554A0592m560j3125o162k022k377K276J2679K678J102J0920Q52j0192Q220P909
6540A8790n755n391j2149M67K022R70o584j2993M4J1799J1167L782n394j2358
$$ y = [-2875, -7003, -3982, -3956, -2023, 1978, 9473, 19006, 5211, -3494, -513, -2755, -10433, -20168, -19850, -12344, -14681, -9120, 1163, -334, 1960, 4313, 2620, 1806, -13431, -16772, -13448, -4101, -2739, -4353, -2140, -7087, -8450, -18149, -18828, -9521, -1344, -998, -2051, -4086, -9026, -9104, -530, 1484, -4353, 1970, 6884, 8099, 13176, 15719, 10801, 10227, 4524, -12709, -9939, -1261, 9402, 12276, 1793, 2634, 4675, -1506, -19813, -17746, -7075, -6047, -9891, -4516, -7574, -4966, -1212, 7189, -1757, -4352, -16890, -19971, -17779, -18356, -19113, -14812, -8386, 3999, 5844, -693, -14165, -9198, -4569, 5572, 10592, 6032, -7093, -13255, -15277, -17654, -15378, -2699, -21, 1081, 12001, 12853, 2661, 10881, 18790, 13035, 7644, -4505, -4038, -2016, -1046, -7630, -20623, -20579, -8780, 2387, 6169, 775, -11583]
6526a1583n315l291M940P23n771j162J107Q2P614J3006L54p878m74L935n88M455
6510A54J625m828J23R82j386q395m182P181J3145j2157N12Q371J4643Q134j3015
6495A0907M96J503k244r006R751j696J711J1782n856r353k033L472P475p220k313
6480G376q456J32J559q6k148K262q53k15l606J0335J1916K935K868o989q235l672
6464E123nm995K589J2076N016m140n775K453k694m847r224r38q300M411J1433
6449B183m388L546J2274N590J809r531O604j699j2332j325q507j3860P817R953
6435a866k196j273M624J1772M720j0851p705k952m665J4038J878M799k714J879
6421I488p108j7131n595J7309R931j0123m20j577p638P176o406j551J2077P371
$$ y = [-11583, -16898, -20189, -15249, -14526, -20297, -21459, -20352, -20270, -12656, 350, 704, -7174, -7648, -3713, -4301, 154, 1779, -3049, -2926, -1944, -3330, -11725, -15907, -8726, 4419, -7738, -7226, 1145, 15788, 23922, 10907, 11403, 12906, 10662, 1656, 11407, 9711, 11422, 23204, 17348, 7995, 5962, 9434, 16909, 9689, 7376, -1080, -948, 611, 525, -1623, 639, -214, -429, -4035, 6300, 18216, 21151, 24019, 17030, 8795, 5123, 5118, 123, 2712, 14788, 19804, 15664, 9889, 12342, 9648, 4801, -4423, -5361, -13661, -9250, 2183, -2205, 1341, 13615, 19205, 21014, 11483, 18087, 16388, 4056, 2731, -5776, -19636, -11819, -1866, -4062, -5335, -711, 11061, 15781, 4930, -2775, -5727, -10392, 3646, 5524, 10323, 7609, 9488, 2380, -14751, -20346, -3037, 6894, -3229, -3649, -5226, -12864, -5688, -12094, -13645, -1568, 5803]
6407E803l258K37K623L591j7433j3686L030R465J1752P139r4Q34n761o097m800
6392f655P641J2973p029j2051k271J32r51J236J0479M68j3438K10J454N648L315
6377A161l043p222L081J1560O385k48k430j7232N38j037Q34q046M088L341j0259
6362a8529p261J4661J3334N424p568j7941o485J157J0975J8502P119l864j242
6349H282M853k282q865r581m162o23R188K046m042l059o927p344N015J0504J6718
6334I721n496j3394m453J0633R726j103j062J9k426m309j1199r348o760r72P429
6319b2994R111M235L498m738q204O469M036K094j254N954J735j98O224N084o452
6304D600n937q307j297J2325J1478J89j227p393O558J48r085j1453j899P449o64
$$ y = [5803, 2545, 2782, 5405, 8996, -8437, -22123, -19093, -9628, 2124, 9263, 9169, 10003, 4242, -1855, -6655, 986, 13959, 6930, -5121, -7392, -7260, -8211, -6975, 3504, 3972, -9466, -9256, -7802, -2154, 1161, -1882, -9104, -6023, 5537, 11922, 11674, 9244, -7988, -7450, -8487, -7653, -15699, -11611, -8270, -18529, -25790, -11129, 2205, 7629, 61, -17880, -24365, -23208, -12233, 6269, 13388, 9524, 8282, 13135, 10853, 1988, -7593, -11755, -12378, -3190, -1144, -5186, -8245, -15172, -22516, -17501, -6997, 9721, 4225, -9169, -13622, -2989, 6737, 5634, 4572, 4591, 2165, -2144, -13343, -22691, -29451, -30423, -22994, -13883, -9648, -6150, -10888, -19092, -12623, -8587, -6493, -7747, -1793, -58, -256, 5968, 11052, 4600, -1337, -9644, -10941, 1384, 12862, 13051, 11824, 4431, 10989, 11137, 2052, -9401, -11300, -3851, -4515]
6289d515p193n587J249p87J4104L049n576j378O573M627L140p319j1104j67L468
6274g416O814O728k53M223L154n702j990J042o82k210j0908k265P923Q13O25K59
6258A55j305o987j0160j1081J3438K0749J25p484k419L704K522N7p025j830L5
6243g506P936J68O911r131m295k285p322N160R345J099o16m643P483m822r640
6228a2158O936L669p891l393p835M044Q626O03o243l92J130M006J2119R4l9L586
6212F862M990k747L561k944j7602l667K665N899L492M622L005n657J555n078L068
6197B024n543J45R93l758N448N643N77l084o646j0007o752R999O691K129O568
6182D427P098p492r618J0Q436M033j4558j773M278L7L493l316l016l709j4O737
$$ y = [-4515, -11708, -17295, -16046, -16833, -2729, 320, -5256, -6634, -61, 4566, 7706, 387, -10717, -10884, -7416, -602, 6126, 5873, 10096, 13250, 7548, 5558, 6600, 5918, 3708, -7200, -9465, -1542, -729, -104, 155, -1150, -8137, -18297, -29378, -15940, 4809, 4934, -2550, -4969, -1265, 1257, 1314, -5711, -7541, -7506, 430, 598, 7509, -1622, -5917, -8202, -15524, -10364, -1019, 80, -536, -5179, 2304, -2518, -12158, -5222, -1553, -9444, -12837, -20672, -16628, -8002, -7399, -13642, -14034, -12904, -8898, 3221, 3315, 3276, 6862, 11852, 9105, 12666, 9722, -7880, -11547, -8882, -2983, 509, 5131, 8136, 2479, 4034, -1044, 2024, -3519, -3374, -2381, -6139, -691, 4952, 5529, 2445, -4201, -14208, -20960, -10961, -4270, -2141, 4427, 11525, 4033, -5585, -5575, 2861, 6894, -7664, -9437, -5159, -5122, -1629, -4945, -7961, -11670, -11684, -4947]
6166d947L574k917J2383j61k2506K529M430K953K521M455n123o989J3350J19j0017
6151f346M153N449K897n247P142j974j8366K031L32J026M447N338k190Q025M221
6136A0938o831o944R868L462r367p391J1821P050l063j669m252n295M88N667P130
6121A1612j510k0698K270k223k764o276P712M275O239Q492M741j3626R10N886
6107E040Q443N487k251J2650m639j2765p842L982k461K120N122O986o997j4429
6093a554n019P550l59j4964j1694J7289P214m411J442J392R90K897j695j6939
6079a7861k234M002J997O813J1567p865j593j162n278j885Q871O974k933j4658
6065a5245m242K285J0501L708m162m296q44m344M674J6014K223m096j2911j625
$$ y = [-4947, -1373, -4290, 8093, 7932, -14574, -12045, -7615, -4662, -2141, 2314, -2809, -9798, 3552, 3671, -6346, -2193, 3256, 6153, 906, 8048, 6074, -12292, -10261, -9929, -8903, -4456, 882, -1308, 6717, 10938, 4107, -2837, 7031, 10493, 1126, -6265, 5556, 12606, 9543, 7874, 3622, -1673, -1185, 4482, 11612, 10102, -10596, -8326, -10549, -13313, -19589, -11877, -7602, -1363, 7129, 11870, -1756, -846, 5040, 13483, 18970, 16719, 29369, 24730, 11965, 4123, 8105, 5644, 7764, 12886, 19872, 12875, -1554, -6573, 977, 618, -14346, -26040, -8751, -1537, -5948, -4506, -3114, -2124, 773, -922, -17861, -20095, -16093, -14096, -7283, 4284, -3581, -5174, -6336, -11614, -13499, -4628, 2346, -587, -15245, -19487, -17202, -6701, -2993, -7155, -11451, -12295, -16639, -11965, 4049, 6272, 2176, -10735, -12360]
6051a2360M873L667m361k791N159L716J0022J3338K706n261j461j0799l822J587
6037D213J58k293p431p3K974l865J442J1382l022j1753O508j126J553O77l8J373
6021F79j1154r055J801R183J2305j954p50J2513j0978j1778l436o577j162J1988
6007h375J2388o681k519o069o069Q683M842K458Q132n549j0005P736M953J081
5993E006L108j132L349O595m640n489M851M137J2033j952j3233m387r40m310j2666
5978i670n597L083N994J0163j404p978L842m374k151N747J635J377M554K723k028
5963E916r248k179k72K080J984P924r371n820O431J4159J1073l876O086m743j8111
5948B033P424J2848j911j5841k1009j622K996J8763r754j4961J2001o23n537L39
$$ y = [-12360, -7487, -3820, -8181, -10972, -5813, -2097, 7925, 21263, 23969, 18708, 17247, 6448, 2626, 4213, 4371, 2078, -5353, -5426, -2452, -6317, -4875, 6507, 3485, -8268, -1760, -2886, -1333, -656, -694, 679, -10475, -19530, -17729, -8546, 3759, 1805, 1055, 13568, 2590, -9188, -12624, -19201, -20363, -8375, 4013, -2668, -5187, -11256, -17325, -8642, -3800, -1342, 6790, 1241, -8764, -1028, 3925, 5006, 8114, 6982, 10331, 16926, 12286, 6797, 11648, 15785, 27818, 25866, 12633, 8246, 7306, 2996, -9670, -15267, -12184, -6190, 3973, 2569, -5409, -1567, -5941, -8092, -2345, -710, 667, 5221, 7944, 5916, -3332, -5511, -5783, -3703, -1719, 6205, -3166, -8986, -2555, 11604, 22677, 18801, 24887, 20144, 2033, 9457, 22305, 20394, 4553, -16456, -18078, -15082, 3681, -6073, -21034, -9033, -9656, -15193, -14854]
5934a4854j284k324q983P115O244P632k371l707o365L392K549J4833M824k607
5920D094l912n11o758p240r220N386O19N407J9361J320J609N828O2L4J236m951
5904A2364K884K400m987p174j1012l455P806j641K383n523j4089n72q949j239
5890c0804J1549O61j271L153l911Q330R590Q384l2l974J730n276m459l794p482
5875a7606k603Q239Q320n554K860J1799m653n285N682l589n958M888J037j2122
5861a4545n64Q447k321k218k650q21J1379J3871R110L599p774n771o976r890o411
5846a3535N172j854J2674O946p119j1889L850o396L798J0393M383q905n424K280
5832e626n63p035m727J0209P544M019R234N875q89j4734j0785l496J8712J4002
$$ y = [-14854, -16138, -18462, -27445, -20330, -14086, -6454, -8825, -12532, -18897, -15505, -12956, 1877, 6701, 4094, 182, -329, -7087, -14327, -23547, -18161, -17542, -12135, 7226, 8546, 10155, 15983, 16045, 16079, 17315, 12364, 15248, 17648, 12661, 5487, -5525, -8980, -1174, -2815, -432, -5955, -20044, -20616, -29565, -30804, -19255, -18594, -19865, -16712, -20623, -12293, -2703, 5681, 5649, 1675, 3405, -1871, -6330, -10124, -17606, -20209, -11970, -3650, -9204, -6344, 5455, 802, -4483, 1199, -2390, -8348, -3460, -2423, -14545, -15109, -6662, -8983, -11201, -13851, -14672, -3293, 10578, 19688, 23287, 15513, 9742, 2766, -7124, -13535, -8363, -10217, 2457, 9403, 2284, -9605, -5755, -12151, -8353, 2040, 6423, -2482, -7906, -5626, -6189, -13224, -17951, -7742, -198, 3821, 13055, 18930, 18041, 3307, -7478, -10974, 7738, 21740]
5818B1740K288q508n057N079m506n673n401J433N992p857r206l155q350Q764J8394
5803E977J5366J781p394L167o46j781j2204J774m756L84M950N268n052n417P626
5788I043r003O218J1429k129J5421j1164M36o887k0901j194O93j20k351l391M628
5773i272j812j2028k914Q202L301j973O823J2049N855P637j84j6382l012j939
5759e649l387L93P360Q114N577J0095p578K880N683q140j8074k855p23J2118M972
5744A0786K120O174j589k758j3484j6091j742N983Q873J8466K54o295j4525l482
5730g310Q092O662l694n74j0700p808N92L92p600J908J811M71J4794O895n153
5715a222J795L768O74n044p678o289j859P721J861J677n755o437P29m363Q952
$$ y = [21740, 24028, 15520, 10463, 15542, 11036, 5363, -38, 1395, 7387, -470, -9676, -12831, -21181, -12417, 5977, 21343, 23124, 15730, 18897, 18251, 16470, 4266, 6040, 1284, 1668, 6618, 11886, 6834, 1417, 9043, 40, 6258, 17687, 15558, 30979, 19815, 20251, 13364, -7537, -8731, -8038, -8158, -10509, -13900, -9272, -11084, -23112, -26026, -17824, -14523, -16496, -9673, 2376, 8231, 15868, 15684, -698, -3710, -5649, -9036, -8643, -1283, 6831, 12408, 22503, 14925, 17805, 23488, 15348, -2726, -5581, -6304, 5814, 10786, 12906, 19080, 17491, 14733, 1249, -14842, -16584, -10601, -1728, 16738, 16992, 10697, -3828, -7310, 782, 7444, 3750, 3176, -7524, -15332, -14740, -14348, -21948, -20040, -18229, -17758, -2964, 3931, -1222, 573, 4341, 5015, -29, -7707, -13996, -15855, -8134, -6273, -4596, -10351, -16788, -16059, -20422, -11470]
5700a1470Q347r16P041k845J1243N815m660m455l284J779p805L786K19l776r294
5685a0275j637O638J1292m044m762J2865N949P34m730o233m043n678j822j293
5671g039k703M362O680J5607k593n576j1196q695j416J0007o93P393N582n892
5657C828r605J2282J3198q715p785P451J174p849N03o347j1479M840J462l48Q26
5642f564r43O50m099J0103R482J2837O741j1086j6873r500m227m789K782N8J1447
5627c981m524o575N884j385l18O517n302k989K544k301r18j866m510L749N834
5612a0141J124J0233l04o958p508j338k956j4478N932J2447K0989P435O849o930
5598A4396j8795q189k423k323N742L434p575J0389L428n866J097Q648L778N515
$$ y = [-11470, -3123, -4039, 3002, 157, 11400, 17215, 12555, 8100, 4816, 6595, -1210, 2576, 2795, -981, -10275, -11912, -5274, 6018, 1974, -2788, 10077, 16026, 16760, 12030, 5797, 1754, -3924, -5746, -7039, -9742, -5380, 1300, 16907, 14314, 8738, -2458, -11153, -12569, -2562, -3255, 4138, 9720, 3828, -5777, 6505, 19703, 10988, 3203, 10654, 11828, 3979, 4482, -1865, -13344, -8504, -7042, -7390, -6564, -7507, -6857, -10956, -853, 8629, 21466, 28207, 17121, 248, -9252, -13479, -18268, -15486, -15428, -3981, -8505, -15080, -9196, -10581, -10899, -4382, -9684, -12673, -10129, -12430, -13348, -15214, -19724, -15975, -10141, -9017, 1216, 912, -6046, -13554, -14892, -17848, -32326, -26394, -13947, 7042, 14477, 21326, 14396, -4399, -12588, -15011, -17334, -11592, -8158, -15733, -5344, -1916, -7782, -6685, 1963, 5741, 11256]
5584A1256R903j6875m571p142N391J0156m2r498j795O449J8529J724m955j513
5570A7017k990l754k691j1749r020K257K699J44R828J552L56n270j230J113l240
5555d978p594o985J372O364Q963l893o686m538J1110l022j082M272Q166M897P979
5540A4345M221r819l298j0620j3017j0110J733M442k193j0941j617J5380J2653
5527h841P638N61n951l40P603J678m613k709J219R904J1872O33r381m530K317
5512G060k516K756J507J346J787o036j8443K725N469K627j1967P424n72k384o460
5497a5677K800N674q244N689Q937M75q332M58K598l065j1615k75J691o295n328
5482c0509L525l77J0760J4041R189N790q25j2737l606P915P300p655R55o836K330
$$ y = [11256, 21159, 4284, -287, -7429, -2038, 8118, 8076, -1422, -3217, 3232, 21761, 23485, 18530, 17017, 14027, 10273, 7582, -4167, -13187, -10930, -8231, -8087, 1741, 3293, 3649, -1621, -2851, -1738, -4978, -12572, -19557, -18185, -11821, -2858, -6751, -13437, -17975, -6865, -9887, -10969, -6697, 1469, 6366, 14345, 18566, 8747, 5449, -5171, -18188, -28298, -26565, -22123, -24316, -35257, -36874, -21494, -8841, -1203, -642, -6593, -6933, 670, 2348, -2265, -4974, -3755, 6149, 18021, 18654, 9273, 4743, 7060, 4544, 7300, 8807, 10153, 11940, 5904, -12539, -9814, -4345, -1718, -13685, -6261, -6833, -9217, -15677, -12877, -7203, -15447, -9758, -821, -346, -8678, -8220, -5622, -8687, -20302, -20577, -18886, -25181, -30509, -26984, -27361, -16601, -2560, 6629, 12419, 11594, -1143, -4749, 3166, 10466, 2811, 3766, -3070, -740]
5467g40O518M419n097j4424r258M700K010N623Q521L079M808K747J0124o49k1830
5452E51j2366K441L19p99J158J1070L805n381l705o258m672R155q265k136L427
5437a1656m070J0593k136j6526M583J0065L813J870l82j0509M337O81M884K547
5423a906n378Q21K312l007nk271M105j600p526n481M812J8144J751j564N171p360
5407A018j0669J859P563k238j4473r023p72P539J1432Q079K1184M380L232P68
5393B9879o857k794n004J367j6487o063n022Q086m870l686J138K310K522l165
5379h646n005K55J2796L985k074K17n864M25l331k625P85n46j079m317P10O047
5363h267N794J903K628R845j2319o625n54R05q007K882M517M962L616j687K33
$$ y = [-740, 5778, 10197, 5100, -9324, -18582, -13882, -11872, -6249, 2272, 5351, 10159, 12906, 23030, 22381, 551, -11815, -9374, -9055, -9854, -8696, 2374, 6179, 798, -2907, -9165, -13837, -4682, -12947, -15083, -11656, -15726, -5133, -7269, -23795, -19212, -9147, -5334, -3464, -3846, -14355, -10018, -9337, -4453, -1906, -7284, -6463, -4151, -7158, -7163, -9434, -5329, -6929, -14455, -19936, -15124, 3020, 4771, 3207, 8378, 1018, -9651, -7792, -229, -2467, -16940, -25963, -26735, -19196, -7764, 315, 21499, 25879, 29111, 29879, 23022, 20228, 15224, 16591, 104, -5959, -10981, -2895, -7765, -11451, -10313, -8003, -5481, -8646, -13651, -13396, -600, 3385, 1311, 1528, -4336, -3911, -7242, -9867, -9082, -9628, -10707, -15024, -14314, -8267, -2473, -570, 2058, 11903, -416, -7041, -7595, -6690, -14697, -11815, -7298, -2336, 1280, -407, -174]
5348a74N431n297r702r168J529k602N018J7345N770q278O238J2872m148j7563
5334b729j2122N575P298k648m070J0664j324J329M372K245L050n50L541n050j0601
5319a020m244O851P948j2287m936j2851M37N504j140Q291l964n503j55O948P413
5304b708l932M837N902p425j7086p902Q45P145J7850O90o932k934M136j441m450
5289a3405O442N164J44J511P488L540j6228p502J5653k844J772J700j2211R75
5275g801Q458m791j2176q068j848J5388N877K733j450o195j0780L992J5037K396
5261G72o565m275J2881J0767J61m316k910n594Q6j732j866j1768R383J0948j420
5246D552l675J65M231j3475j4890O259k694j014L218q098R96o584K739k988P649
$$ y = [-174, 5257, -40, -9742, -18910, -17381, -19983, -14965, 2380, 8150, -128, 6110, 18982, 14834, -2729, -14851, -9276, -1978, -4626, -8696, 1968, 644, 1973, 6345, 8590, 11640, 11090, 14631, 9581, -1020, -5264, 1587, 9535, -2752, -7688, -20539, -20102, -14598, -15738, -7447, -11411, -16914, -17069, -10121, -2708, -6640, -1803, 4099, -3326, -20412, -28314, -27469, -20324, -2474, -1784, -8716, -11650, -7514, -8955, -13405, -6963, -1799, -1655, -144, 7344, 10884, -5344, -12846, 2807, -37, 1735, 3435, -8776, -7801, 657, -4134, -16310, -24378, -26226, -10838, -4961, -2228, -3678, -9873, -20653, -16661, -1624, 772, -5793, -10068, 2813, 13580, 13741, 9425, 6515, 921, 1007, -725, -2591, -14359, -4976, 5972, 4552, 877, 1042, 5273, -8202, -23092, -16833, -19527, -20541, -17323, -25421, -24425, -31009, -28270, -31258, -23609]
5231b3609J304r600R823J8002J5721j508j2820j417J0692K209p696l757k553L26
5217d883m628l470L235N614N431j231r625N373J0113R509j363j2331j9437l120
5203b0813O03L941j786M292P212O88n907R517L245m690j17J1399M01q756k743
5188c514N435o87r974j736k996l75M300J2102M087N613J0159R13n02n047P47r182
5172I343j767m078j2508L808P649K006j6210j752K47K683N102J0133J498J1224
5158A7378r257j0173P894N929L262O176J17o530r571o623j646K404j230O654j329
5143C455P377m015J674r821m942K785P031J34o44l177m921q42J1002J5668K790
5128B3554p546r982n596j1125q516N987J2759J6272M064j9327j0240P147R220
$$ y = [-23609, -22305, -31905, -22082, -4080, 11641, 10133, -2687, -4104, 6588, 8797, 1101, -2656, -5209, -4883, -9511, -12981, -9746, -4132, 1299, 68, -9557, -4184, 5929, 15438, 14075, 1744, -17693, -20813, -20210, -16269, -18055, -13763, -6551, -5863, -11770, -2253, 992, -3698, -3815, 7584, 7985, -771, -3514, 1921, 1234, -8740, -10476, -13472, -13847, -9547, 2555, 6642, 12255, 22414, 23327, 22825, 17778, 18525, 9343, 7576, 3498, -9010, -5202, 2447, 4453, -11757, -13509, -13262, -10579, -5477, 4656, 6154, 17378, 8121, -2052, 5842, 11771, 15033, 21209, 21326, 14796, 5225, -1398, -3044, -640, -1870, 4784, 3455, 10832, 6817, 8491, -1330, -6272, -3487, 3544, 3678, 3034, -143, -5064, -5906, 5096, 20764, 23554, 16008, 6026, 430, -10695, -19211, -13224, -465, 15807, 19871, 544, -9696, -2549, 6671]
5115F671j1779l983L428O417J4826k725o914r08m782k271j253L592m96K058n662
5100c781M022o65l818j955j837j898L560R434N658N405j2184m284J3249M73j3870
5085b491r452o301o397P608l257r66Q758J6686Q207j1676r326Q321l069o281L246
5070f390J814O586k631p503j0247Q443J4120N236j5232j82J1981P159J1410m778
5056A9786O403l310j5701q806J220O223j335O604J764j925m913j0490l396o040
5042a3916Q46J2888J0440r232k836J443L457P654j3372m071K723M564n450k277
5028g139O318K205o414L940Q25P58j7331M36O4o57L797m264j020J2641N791o51
5012g01J39L731L228j0945j0327P392J0348K464j7680r776O56L737o6N353L869
$$ y = [6671, -5108, -9091, -5663, 754, 15580, 12855, 5941, 5033, 251, -2020, -3273, 319, -177, 1881, -3781, 241, -424, -4242, -6197, -8034, -9932, -6372, 3062, 8720, 14125, 1941, -2343, 10906, 11379, -2491, -11943, -18244, -24641, -17033, -20290, -21256, -12498, 4188, 12395, 719, -8607, -286, -3355, -9636, -6390, -4576, 2010, -621, -8124, -18371, -9928, 4192, 9428, -5804, -5986, 5995, 13154, 24564, 19786, 26189, 22879, 7178, -1628, -408, 5815, 4480, 11084, 12848, 10923, 6010, -4480, -7876, -13916, -13070, -182, 10258, 1026, -1810, -367, 3090, 10744, -2628, -6699, -3976, 588, -4862, -7139, -821, 1384, -5030, -1090, -265, 493, -16838, -16402, -16338, -16995, -13198, -17462, -18482, -5841, -50, -701, -562, 3169, 6397, -4548, -14875, -7483, 2865, 5329, -12351, -22127, -21471, -17734, -17800, -12447, -8578]
4997h578K799q989k58R609Q703j4078k335J2130K33j7348r281k813J2010J6995
4983a201r13K861M048K411j5395J309l542K623R236M888M964k554L489j408r429
4968A387N445m275p409K592O135K872M891Q611N773m087p531p496p48q018p728
4953i586L101q068k002k691n30n08N947R837N088j3187l701j432o619L199J2068
4938i084O132J0610J580p818m423M88M931m157N715p113j6248J0915L900N444
4924H72j760P08J032L963j607O85M862K135k6896q973P31L32J8164k323j822m301
4908a4198k3J857J2194j15k836r131J3810J719j0655k245J863Q797l19j1985K491
4893h776J844j1001N130K754J921j764L470K973j947j468j4537j684J5340k897
$$ y = [-8578, -5779, -14768, -15026, -5417, 3286, -10792, -13127, -997, -764, -18112, -27393, -30206, -18196, -1201, -2114, 747, 4795, 7206, -8189, -6880, -10422, -7799, 1437, 6325, 11289, 8735, 12224, 10816, 1387, 6832, 2557, -4852, -2260, 3875, 6747, 11638, 20249, 26022, 21935, 14404, 6908, 6160, -1858, -9586, -6485, -14553, -16555, -19246, -19776, -20284, -14337, -4500, 588, -12599, -16300, -17732, -24351, -21152, -9084, -2952, 7658, 9238, 1420, -3003, -2515, 2416, -1741, 3974, -3139, -19387, -8472, -4572, 872, -888, -180, 852, 4815, 3208, 3893, 8755, 10890, -16006, -24979, -24248, -23916, -5752, -8075, -9897, -14198, -14221, -12364, -170, -285, -3121, -12252, 1558, 3277, -7378, -9623, -7760, 1037, 718, -11267, -8776, -6932, -17933, -12803, -10049, -8128, -9892, -6422, -3449, -5396, -6864, -21401, -23085, -7745, -10642]
4879a0642j1606J847J946O983J4124J1145Q034j2842p722k664L045k518r233n820
4865a5923J044J8749K396o38k600J820L531m369n986m306K100P473R479K004k565
4850A2209j3621p782K006L150k851O270l273j1540q56J4722O109J10j0132j4739
4836b0218m92J3848N74k616l135J6851J0910j3281k3401j2956m094J3278J1286
4823a3446j202P492j996n386Q38j208O199J0785J0198l931o234R59M736q78o900
4808B6N533l941l442o099J28P600l814l758j407O794J0924j3976k76M480M318
4793C090l631l9P480m568m015j087N08l374O560M04l921M363M29m516L83O236
4777D302M940J424l925k3207M055O824j0388j587R222Q245l843m677p796j239
$$ y = [-10642, -22248, -20401, -18455, -11472, 2652, 13797, 21831, 8989, 1267, -1397, 1648, -870, -10103, -15923, -14879, 3870, 6266, 5628, 3028, 4848, 8379, 4010, -1976, -6282, -4182, 3291, 12770, 14774, 12209, -1412, -9194, -7188, -4038, -6889, -619, -3892, -15432, -16288, -1566, 4543, 4653, -5479, -20218, -20710, -6862, -6288, -8904, -12039, 4812, 15722, 2441, -20960, -33916, -38010, -24732, -13446, -14648, -7156, -9152, -14538, -13700, -14908, -8709, 2076, 12274, 8343, 2109, 3068, 7804, 6926, 26, 5559, 1618, -1824, -7923, -7795, -195, -4009, -7767, -9174, -2380, 8544, -5432, -5708, -1228, 3090, -541, -580, 6900, 2332, -1683, -2770, -2262, -5636, 924, 1328, -2593, 1770, 2199, -2317, -1934, 4302, 9242, 10666, 6741, -16466, -12411, -5587, -15975, -17562, -8340, -95, -3938, -8615, -16411, -17650]
4763a7650l3j379j368Q987Q733N930j843R579j742p061l752j572o693J4275M035
4748H446n652Q24N564r19j4499j4060p833J6047J1985M448M017J783J1556l787
4734A7920q043K613R162o603r711j7481J1928L649o313j145o763L970j432L278
4720d971J1732j180o712q739K793L684j63J0127n390n251r97J1892m685o415N682
4705A407k463o948N997J63N07P54j524N112j653m987L519J292L97m551j0184M257
4689h905M965J407L779P997M889j492q683k0883R5P598R390n614k396K45M981
4674b627j0251r088l542j154q00J252J6218Q546j135J193m554o208Q212l86k731
4659g055J783K266O331N631r327j6385Q61n661m473K809J2466j076O382J5106
$$ y = [-17650, -17683, -19062, -20430, -11443, -2710, 3220, 1377, 10956, 9214, 2153, -1599, -3171, -9864, 4411, 8446, 2794, 3618, 9182, 8263, -6236, -20296, -28129, -12082, -97, 4351, 8368, 10151, 21707, 17920, 9877, 12490, 21652, 15049, 5338, -12143, -215, 3434, -2879, -4024, -10787, -6817, -8249, -4971, 6761, 5581, -1131, -9870, -7077, -3393, -3556, 6571, 1181, -4070, -5067, 6825, 2140, -4275, 1407, -1056, -8004, -2007, -1844, -1337, -583, -2107, 3005, 1352, -3635, -116, 1176, 1573, -2978, -13162, -8905, -3940, -2533, 1246, 9243, 14132, 12640, 3957, -16926, -16831, -9233, 157, -5457, -7853, -7608, -2627, -12878, -21966, -25508, -26662, -27462, -26210, -9992, -1446, -2581, -1388, -5942, -12150, -3938, -4324, -7055, -5272, -3006, 3325, 8956, -371, -16756, -15895, -21556, -26029, -23220, -10754, -11830, -5448, 9658]
4645I658L981q009r166j891l009q241j3319K719J1091N541L408M43K686l088l58
4630g554Q925q108J112K615N433n121J113o875o479L856J980l178M03j108K800
4615a0186q494j1741Q38O830N3R435M825L26J733J450q243r143Q14J4929L920
4600b654N269L09N161L922O631j0040o775L68P005M125k546j6314j4921q004J4895
4585a3569R001N513n980j058O072O213M208P76j2871r609O576Q656m093p455J0663
4570C043K138l742N343L661J042m534m909m300m507m296j246r254j717M52m9J06
4554b2769J3450J2418L0l943Q435l336Q060m343j207r473J778M034k006P470M34
4539I032k182j0435m251N972m155o742r709m102N789O282m810P23L81N146N76
$$ y = [9658, 13639, 5630, -3536, -5427, -8436, -16677, -29996, -27277, -16186, -10645, -7237, -6794, -4108, -7196, -7554, 1371, -6737, -5625, -3010, 2423, -2698, -1585, -8460, -14939, -11083, -9103, -12281, -11878, -12986, -10186, -18680, -30421, -29583, -22753, -22700, -13265, -8440, -8114, -6381, -4931, -13174, -22317, -21503, -6574, -2654, 2615, 2924, 8085, 12007, 18638, 8598, 1823, 2191, 9196, 13321, 10775, -5539, -20460, -28464, -13569, -4568, 945, -5035, -6093, -21, 6192, 10400, 11176, -1695, -11304, -4728, 3928, -165, -7620, 3043, 5181, 1439, 6782, 10443, 11485, 6951, 2042, -2258, -6765, -11061, -12307, -21561, -23278, -22826, -22875, -22769, -9319, 3099, 3129, -814, 7621, 4285, 12345, 8002, 6795, -2678, -900, 3134, 1128, 8598, 9032, 6850, -3585, -7836, -1864, -6019, -12761, -22470, -26572, -20783, -14501, -19311, -18588, -18207, -13061, -12485]
4524a2485Q479J75J181J1983r963k541K567M006r609m196J214N765l233N549Q253
4509G145m935m794K952j692O273j2606j2423k863Q75L889N180P913l356Q485K2259
4494B2302k07r246j4143j2228q990L414M053J336r926L317J1649O71L695M633
4480C30J5970m977j0052j823L819o414M531r375k573M39P263J2259j1429j0324
4466a2356M762L069N765J697k302n517R894K453m154M398M942k677j32m144k487
4451C211K729j2695j6971K426R458K0321P448r125n885k0453j3012J0056J972
4438b0520J5237J5831j687k735l945K980j1390o51J1216L473L596J0428q707k639
4424A0487n433m596N668J2420P609J568j1903o083p748M683k996M01J853o598
$$ y = [-12485, -4006, -3831, -2650, 9333, -630, -3171, -604, 3402, -6207, -10403, -9189, -3424, -6657, -1108, 7145, 2210, -2584, 368, -1324, 4949, -7657, -20080, -22943, -22068, -18179, -12999, -5086, -8442, 43, 22302, 22095, 12849, -1294, -13522, -22512, -19098, -15045, -13709, -23635, -20318, -8669, -7998, -4303, 330, 16300, 11323, 1271, -552, 3267, -3147, 1384, -7991, -10564, -10125, -2862, 9397, -2032, -12356, -7594, -4525, 1240, 2937, 635, -4882, 5012, 7465, 3311, 7709, 12651, 9974, 9842, 5698, 3211, 5940, -6755, -23726, -21300, -11842, 8479, 15927, 6802, 917, -19536, -32548, -22492, -20520, -5283, 10548, 8861, 6126, 2181, 5161, -6229, -6880, 4336, 7809, 11405, 21833, 13126, 10487, 5054, 458, 6126, 18546, 26155, 27723, 15820, 9737, 1989, 6672, 3676, 4077, 5930, -668]
4410f68j5430R827R548j980j353o113j1436O763k158N330K08R148K623j1136r323
4395a6150p70N581r679j046k344p425O693J7000q82j1266Q55L372n459j600J4718
4380h402P073j551o017m492j4058o240R771J455l171P881K4119L595N130k794
4366A2299J368P551J0464k2547j1873j0801k884J8538J71M104j599j1058k885
4353i152N586Q518p236k002r07r345M586P980L192l775n428p52O163O832N418
4338I678J1123l318j0371j692l497r484O305P214j353o200n331Q584l253N438
4324C843j230k740o223J951k204J142M122M544J0306M690p048j8015J034k943
4310h771N509n42K61J3865J229J626K223p293k957j832N160j71k897N451L801
$$ y = [-668, -16098, -6271, 3277, 1297, -56, -6169, -17605, -10842, -13000, -7670, -7462, 1686, 4309, -6827, -16150, -16920, -11339, -21018, -22064, -24408, -31833, -25140, -8140, -9022, -20288, -19433, -16061, -21520, -23120, -8402, -1329, -2880, -8897, -13389, -27447, -33687, -23916, -22461, -25632, -17751, 6368, 9963, 15093, 12299, 13667, 21218, 31682, 9135, -2738, -13539, -16423, 2115, 2286, 6390, 4791, -6267, -9152, -3566, 4952, -2284, -4286, -5193, -14538, -9952, -1972, 1220, -2555, -7983, -8735, -2572, 4260, 9678, 20801, 17483, 7112, 5420, 1923, -7561, -1256, 5958, 4605, -1595, -6926, 1658, -1595, 3843, 2613, -127, -6350, -4399, -6603, -5461, -1339, 3205, 13511, 18201, 11153, -6862, -5828, -8771, -3262, -3804, -3543, 10322, 11551, 13177, 15400, 8107, 5150, 3318, 8478, 8307, 5410, 10861, 14662]
4295A4662L186L71j4537j1710o291J2886J0456l38l377m926m19L570j543l047
4281a057k166o764K969M981J1366k934k923Q962l739l749M335j1292L016l102
4267b097M769J0188m359o935j20L273k410M576r02L388J537p566q983m997M388
4252f250o25k086j222l006O199P481N35J16N517p065q118L26j0704N827R145L424
4236e06J116k465j377Q653j0874o057j158k13l728L302l485m492k14Q215j924
4221a5207r625j806J5392O331j026k159Q894N201N538L412j1139r854N750J1448
4207A1150l940l266L760p363q815m580J254J2985l322j512L625j744l603j959
4193g330j734j572k329P99k470L215l659J0277R485j1220p196J0523J0179J1586
$$ y = [14662, 17848, 18219, 3682, -8028, -14319, -1433, 9023, 8685, 5308, 382, -37, 3533, 1990, -1057, -3223, -9987, -7018, -2037, 9329, 6395, 3472, 12434, 8695, 4946, 9281, -2011, 1005, -2097, 2672, 12860, 8501, 1566, 1446, 4719, 2309, 6885, 5983, 9371, 10908, 3342, -5641, -10638, -6250, -6875, -8961, -10183, -13189, -6990, 491, 1026, 1142, 6659, -406, -8524, -8198, -18902, -13075, -3930, -506, 610, -1855, -3232, 5421, -5453, -11510, -12668, -12881, -16609, -13307, -16792, -21284, -21498, -13283, -15207, -24832, -26638, -11246, -4915, -5941, -8100, 794, 5995, 11533, 14945, 3806, -6048, -298, 11150, 7210, 3944, 7704, 341, -8474, -13054, -11800, 1185, -2137, -3649, -24, -1768, -5371, -7330, -9064, -10636, -12965, -12166, -14636, -11421, -15080, -4803, 4682, -6538, -13734, -3211, 6968, 18554]
4179A8554r459j4120j389p7n714N345l262j0246k832N408Q022m380R029J9114
4165A3993k542p819j52l114j140p200M490J0503N776j2978l863J1894r069o805
4151h026L051l40o948M086O482j035q695m327N489Q724L305L418j825j1830M401
4136d070J531r84n657j027J0392R665o682q06R559r558j67L350o999o518J234
4121f737Q708J2998k591m411m380k1637p967N040Q345J1453j776o803k096N753
4107f101n020L683j932O839K851R617m129l678O008M08o989M71j2717J4036O661
4092A0008r018q321O813k991J2555J1308q356j0121J056M496J3044M933j5057
4079A0349j428N489k462p056o92K955j1423K489K928l319q560R883r555K169M769
$$ y = [18554, 9095, -5025, -6414, -6491, -12205, -6860, -10122, -20368, -23200, -17792, -9770, -14150, -5121, 13993, 11451, 3632, 3480, 366, -774, -7974, -3484, 7019, 12795, -183, -4046, 7848, -1221, -8026, -4975, -5315, -12263, -8177, -1695, -2730, -11425, -15752, -10263, -1539, 1766, 5184, 3359, -8471, -4070, -2539, -3523, -9180, -10207, 185, 9850, 3168, 2362, 11921, 2363, 2196, 5546, -1453, -7971, -6737, 1971, 14969, 12378, 7967, 3587, -18050, -26017, -20977, -12632, -1179, -2955, -9758, -11854, -6101, -11121, -7438, -9370, -2531, 320, 9937, 5808, 2130, 8138, 8546, 1557, 2028, -10689, 3347, 10008, 990, -7331, -518, -3509, 9046, 20354, 11998, 1877, 2933, 7429, 20473, 25406, 10349, 8921, 14410, 11948, 4892, 4200, 7155, -4268, -1779, 1149, -2170, -10730, -847, -10402, -8233, -3464]
4064c464N43O502o929j382Q060j5918K368K499p529M107M624j395r100J3974j056
4049d096Q235L560q377j3847j476K63j1325l691J0638p261L721Q865M226J0241
4035c24O386k301N938R365L513j2567r780j0657n12j881j264R055J5692Q662L66
4020A9691j0610j0455J0445j1003q873R243J0572M175j853j228j5726K189K508
4007i25o077P731m164o105q530j377J5881P391k940l966J788J3869R264j9929
3993A911o425L099K327q419J0197O148r837N658K879j6663j9613K628J7937O709
3979a464K185Q119R223j362K570m595j3318l103N236q441K078n724j718M406k252
3964h160K189k235J877J4962l877p611k100m967q61O898N135j7784k122l547J4231
$$ y = [-3464, -2921, 3581, -3348, -4730, 3330, -12588, -10220, -7721, -15250, -11143, -6519, -7914, -17014, -3040, -4096, 4139, 7699, -678, -14525, -16001, -15738, -27063, -30754, -20116, -27377, -23656, -14791, -10565, -324, 6062, 3761, 9699, 19064, 22577, 10010, 230, -10427, -10939, -12820, -14084, -5029, 10663, 19325, 19691, 9081, -1374, 9071, -1932, -10805, -1562, 9010, 13185, 11332, 10104, -5622, -3433, -925, -7002, 729, -3435, -9540, -18070, -19447, -3566, 3825, 885, -3081, -1293, 12576, 21840, 1911, -4514, -1415, 912, -7507, 2690, 8838, -999, 4659, 7538, -9125, -28738, -26110, -8173, -1464, 721, 8840, 18063, 16701, 19271, 14676, 1358, -1745, 3491, -4950, -2872, -8596, -10314, -5908, -8160, -5971, -8206, -6329, 8633, 4756, -2855, -4955, -9922, -10783, -3885, 1250, -16534, -18656, -22203, -7972]
3949g972N391M4q565m315J3859J4314L637J428O092q913l01J46p546l946P201
3934A0554J2580j0149j1170J816L93l385r09k259n224j274K212l362m355J1229
3920c303Q483j86N461L020J39k838j8002p351N06J2118L621J378O083o105K603
3905E627O671j3465k265L029N161O127R712j7936j1503L290J0647J800j161j6905
3891a1171r459J4276k564q821L916M504O13m641N171R110J72m835L099p241j88
3876h059J4263Q318L352o001r888J647P265o113j0666m440k021O040M933n591
3862f961N587k170k299P680J852J0309o010j6255j0182M323l783N221r3P392N662
3847B73R423M285n066j5093p819M989N179J2547m5K555l783l032J6n46r483m158
$$ y = [-7972, -2581, -2537, -11102, -15417, -1558, 12756, 16393, 17821, 23913, 15000, 14699, 14845, 7299, 3353, 10554, 23134, 12985, 1815, 3631, 4024, 639, -270, -2529, -7753, -9027, -6815, -10177, -14532, -3303, 5180, 4994, 10455, 13475, 13614, 10776, -7226, -14577, -14071, -1953, 1668, 3046, 9129, 3024, 5627, 12298, -1167, -3432, -403, 4758, 10885, 20597, 2661, -8842, -5552, 5095, 6895, 5734, -11171, -20630, -6354, -8918, -17739, -13823, -9319, -8706, -13347, -8176, 934, 1106, -3729, -630, -7871, -8059, 6204, 14522, 17874, 11873, 1985, 3632, 10897, 4784, -5882, -10322, -12343, -6303, -1370, -6961, -1374, -3544, -5843, 1837, 3689, 13998, 7988, -8267, -18449, -14126, -17909, -12688, -12781, -5389, 273, 9696, 13981, 8915, -6178, -13997, -9008, -3829, 8718, 8673, 11228, 7445, 4413, 4429, 3883, -5600, -9758]
3831i758l353p150J012N804O018O826j009j5835r155o504M992M721N440N56k367
3816a9762r371r796J1572J5969o66o491J4647J3312l979n907m829O468N882j098
3802E951J922j5019j0786J1059O888r577NJ1043J3568k943l035K364O071K072
3788A9583L888j0042j7687Q035l739j2994K421J0521j041j0913n52P600J3862
3775H942R061m353l512q650q425j1014L561O457M137q072N566N994K406N417q547
3760a032k401R691q178p104k599J1468P578p389p814j995R328Q548O711n94j5825
3745a607l349K322N127L527J024J205M266J065l229p491k584q610k897M215J0585
3730C569P800R007o636j5211o960M435Q694P932J701N33p042q979q003J713N623
$$ y = [-9758, -13111, -20261, -19249, -13445, -7427, -601, -1610, -17445, -26600, -33104, -28112, -23391, -17951, -17395, -19762, -29133, -38929, -27357, -11388, -12054, -18545, -3898, 9414, 5435, -472, -5301, 1167, 7049, 5951, 7873, -7146, -17932, -6873, 15, -9562, -9557, 1486, 15054, 12111, 9076, 11440, 17511, 19583, 23471, 13429, -4258, 3777, 38, -12956, -10535, -14, -1055, -11968, -12520, -4920, 8942, 18003, 13650, 10138, 1488, -6937, -17951, -14390, -7933, -3796, -11868, -6302, -308, 2098, 7515, -1032, -3433, 6258, -1920, -9024, -11623, -155, 7423, 34, -7780, -9775, -447, 8101, 14812, 14218, -1607, -4956, -2634, 2493, 6020, 7044, 8249, 12515, 13580, 10351, 2860, 276, -8334, -11231, -7016, 3569, 11369, 20376, 13740, -1471, -8431, -3996, 4698, 12630, 14331, 14864, 7822, -1157, -9160, -7447, -1824]
3715a824L059j299j3665L956Q218Q104L494o175j1617n679L725o949j723R583
3701h792k83O587k017O837j658m761l642N520J113Q23J436r358k085l965j285
3686a5530l852j871J810J1068j947k39j737r460J0277J0277K293M905J54j236
3672D912l564J436j568l542j5641k706N353M395N456J3524j521j1133R614K524
3658G539j2877j7547O748Q497L078L719M555k185n002l349J0648l375J423J3788
3644A5660J598j1214N142o77n061m272R47K25L740n576K33k294L665L96Q90M686
3628H088j4396j0553N039O779K480O064K450n924q989k566N294J0862R417m510
3614I535m602L56o840q552M467J3039J4045o533j5109j0254j1607O615J5314n530
$$ y = [-1824, 1235, -64, -13729, -9773, -1555, 6549, 10043, 3868, -7749, -13428, -9703, -16652, -18375, -8792, -9075, -2488, -4505, 2332, 674, -4087, -7729, -2209, -1096, -273, 1163, -8195, -10280, -14245, -15530, -19382, -21253, -19443, -8375, -10322, -10561, -12298, -21758, -11481, -1204, 1089, 5994, 6148, 4912, 1348, 2784, 1216, -2326, -17967, -20673, -15320, -10925, -5469, 8055, 6534, -4599, 5015, 7539, -5338, -22885, -16137, -7640, -4562, -843, 3712, 1527, -3475, -6824, 3824, 449, 1872, 15660, 17258, 6044, 11186, 10509, 5448, 1176, 2123, 2348, 6088, 512, 745, -1549, 2116, 2512, 3402, 8088, -6308, -16861, -11822, -5043, -2563, 3501, 5951, 27, -8962, -11528, -6234, 4628, 14045, 9535, 4933, 5289, -1551, -10103, -5636, 7403, 21448, 14915, -194, -10448, -22055, -15440, -126, -5656]
3600e656o446l776K511N155l547J2288J4647R94l599j341M96m642j1522k691P137
3585Hr16k115r412p166L537M303L146Q481J364K326j900j2192l683L589k680P259
3569f051J357M104J1724p79k762o190m444M569k474N701M209n150N133l264N272
3554A0955J1003j2562j610k757q930o329J1743J4328k927r680j4555J790J6756
3541G225N770l266j160j1246l256R013Q817J91M835L573N742j3877r0L273n516
3526A0028m069n950o656n265o263o155r777L859J6248N396Q050Q986M714n3q441
3511D652O052n419K609m44m039k44N291r103R913O494r740N761k649j0461l429
3496d756p576l166J964N715M517M79K560l293j1391k004P153j0521r82J1829J2358
$$ y = [-5656, -12102, -15878, -13367, -8212, -11759, 529, 15176, 16170, 12571, 11230, 11726, 7084, -4438, -7129, 8, -908, -3023, -12435, -19601, -16064, -11761, -8615, -134, 1230, 3556, 1656, -10536, -14219, -10630, -13310, -6051, -4694, -590, 11134, 10355, 7593, 1403, -3041, 1528, -946, 4755, 8964, 3814, 8947, 5683, 10955, 21958, 9396, 7786, 5029, -3901, -10230, 1513, 15841, 12914, 3234, -11321, -9531, 7225, 12995, 9729, 8569, -2677, -5933, 3080, 11897, 12088, 16923, 20496, 26238, 12361, 12271, 15544, 10028, 5959, 9, -6647, -11912, -18175, -24330, -34107, -30248, -14000, -8604, -554, 8432, 13146, 13093, 4652, 10704, 5285, 7894, 7450, 3411, 3167, 8458, -645, 9268, 15762, 6022, 11783, 9134, -1327, -4756, -12332, -15498, -13534, -7819, -3302, -2823, -263, -3556, -14947, -16951, -9798, -20319, -21301, -9472, 2886]
$$ [...]
##END NTUPLES=NMR SPECTRUM
##END=
