##TITLE=Analysis number 326541
Compound Code cc 62013
Book Reference 411/70
Project Code adrs
Chemist Name stevem
##JCAMPDX= 6.0         $$ Bruker NMR JCAMP-DX V2.0
##DATA TYPE= NMR SPECTRUM
##DATA CLASS= NTUPLES
##ORIGIN= Bruker BioSpin GmbH
##OWNER= nmr
$$ XWIN-NMR		Version 3.5
$$ Mon Feb 12 11:01:26 2007 GMT Standard Time (UT+0h)  MAYBRIDGE\nmr@NMR_250MHZ
##.OBSERVE FREQUENCY= 250.131544655141
##.OBSERVE NUCLEUS= ^1H
##.ACQUISITION MODE= SIMULTANEOUS (DQD)
##.ACQUISITION SCHEME= undefined
##.AVERAGES= 16
##.DIGITISER RES= 18
##SPECTROMETER/DATA SYSTEM= dpx250
##.PULSE SEQUENCE= zg30
##.SOLVENT NAME= CDCl3
##.SHIFT REFERENCE= (INTERNAL, CDCl3, 0, 16.522)
##AUDIT TRAIL= $$ (NUMBER, WHEN, WHO, WHERE, WHAT)
$$ ##TITLE= Audit trail, XWIN-NMR		Version 3.5
$$ ##JCAMPDX= 5.01
$$ ##ORIGIN= Bruker BioSpin GmbH
$$ ##OWNER= nmr
$$ C:\u/data/dgb/nmr/ADRS/710/pdata/1/auditp.txt
$$ ##AUDIT TRAIL=  $$ (NUMBER, WHEN, WHO, WHERE, WHAT)
(   1,<2007-02-12 11:01:05.56 +000>,<MAYBRIDGE\nmr>,<NMR_250MHZ>,
      <created by zg, POWCHK disabled, PULCHK disabled
       configuration hash MD5:
       49 4B E0 1D 92 C2 6B 37 9F E6 65 BC 52 41 86 1D
       data hash MD5: 64K
       AD 53 06 9A 07 62 DB 51 CC C9 FA DD A7 E7 46 83>)
(   2,<2007-02-12 11:01:18.12 +000>,<MAYBRIDGE\nmr>,<NMR_250MHZ>,
      <Start of raw data processing
       ef LB = 0.3 FT_mod = 6 PKNL = 1 SI = 32K 
       data hash MD5: 32K
       9C E6 D5 F2 D1 E0 E5 4F 72 E7 44 03 6F 7F 6E 11>)
(   3,<2007-02-12 11:01:19.79 +000>,<MAYBRIDGE\nmr>,<NMR_250MHZ>,
      <apk 
       data hash MD5: 32K
       72 62 77 88 EC 1D 95 BB EB F6 EE 54 64 9A 55 F1>)
(   4,<2007-02-12 11:01:20.47 +000>,<MAYBRIDGE\nmr>,<NMR_250MHZ>,
      <abs ABSG = 5 
       data hash MD5: 32K
       05 97 0C F6 C5 B6 CD E5 DA 9D F9 EE BE 26 3E E3>)
$$ ##END=
$$ 
$$ hash MD5
$$ 5A FD 62 D1 70 2A A9 DD B0 EA 6D 3A 95 80 B1 CB
##$RELAX= 
##$RELAX= 
##$RELAX= 
##$RELAX= 
##$RELAX= 
##$RELAX= 
##$RELAX= 
$$ Bruker specific parameters
$$ --------------------------
##$DU= <C:\u>
##$EXPNO= 710
##$NAME= <ADRS>
##$PROCNO= 1
##$TYPE= <nmr>
##$USER= <dgb>
##$AMP= (0..31)
100 100 100 100 100 100 100 100 100 100 100 100 100 100 100 100 100 100 
100 100 100 100 100 100 100 100 100 100 100 100 100 100 
##$AQSEQ= 0
##$AQ_mod= 3
##$AUNM= <au_zg>
##$AUTOPOS= <35 >
##$BF1= 250.13
##$BF2= 250.13
##$BF3= 250.13
##$BF4= 250.13
##$BF5= 500.13
##$BF6= 500.13
##$BF7= 500.13
##$BF8= 500.13
##$BYTORDA= 1
##$CFDGTYP= 0
##$CFRGTYP= 5
##$CHEMSTR= <none>
##$CNST= (0..31)
1 1 145 1 1 1 1 1 1 1 1 1 1 1 1 1 1 1 1 1 1 1 1 1 1 1 1 1 1 1 1 1 
##$CPDPRG= <>
##$CPDPRG1= <>
##$CPDPRG2= <>
##$CPDPRG3= <>
##$CPDPRG4= <mlev>
##$CPDPRG5= <mlev>
##$CPDPRG6= <mlev>
##$CPDPRG7= <mlev>
##$CPDPRG8= <mlev>
##$CPDPRGB= <>
##$CPDPRGT= <>
##$D= (0..31)
0 1 0 0 0 0 0 0 0 0.06 0 0 0 0 0 0 0.0002 0 0 0 0 0 0 0 0 0 0 0 0 0 0 
0 
##$DATE= 1171278064
##$DBL= (0..7)
120 120 120 120 120 120 120 120 
##$DBP= (0..7)
150 150 150 150 150 150 150 150 
##$DBP07= 0
##$DBPNAM0= <>
##$DBPNAM1= <>
$$ [...]
##$SUBNAM7= <"">
##$SUBNAM8= <"">
##$SUBNAM9= <"">
##$SW= 20.6930455092707
##$SWIBOX= (0..15)
0 0 3 0 0 0 0 0 0 0 0 0 0 0 0 0 
##$SW_h= 5175.983436853
##$TD= 65536
##$TD0= 1
##$TE= 295.16
##$TE2= 300
##$TE3= 300
##$TEG= 300
##$TL= (0..7)
0 120 120 120 120 120 120 120 
##$TP= (0..7)
150 150 150 150 150 150 150 150 
##$TP07= 0
##$TPNAME0= <>
##$TPNAME1= <>
##$TPNAME2= <>
##$TPNAME3= <>
##$TPNAME4= <>
##$TPNAME5= <>
##$TPNAME6= <>
##$TPNAME7= <>
##$TPOAL= (0..7)
0.5 0.5 0.5 0.5 0.5 0.5 0.5 0.5 
##$TPOFFS= (0..7)
0 0 0 0 0 0 0 0 
##$TUNHIN= 0
##$TUNHOUT= 0
##$TUNXOUT= 0
##$USERA1= <user>
##$USERA2= <user>
##$USERA3= <user>
##$USERA4= <user>
##$USERA5= <user>
##$V9= 5
##$VALIST= <valist>
##$VCLIST= <CCCCCCCCCCCCCCC>
##$VD= 0
##$VDLIST= <DDDDDDDDDDDDDDD>
##$VPLIST= <PPPPPPPPPPPPPPP>
##$VTLIST= <TTTTTTTTTTTTTTT>
##$WBST= 1024
##$WBSW= 4
##$XGAIN= (0..3)
0 0 0 0 
##$XL= 0
##$YL= 0
##$YMAX_a= 359790
##$YMIN_a= -387283
##$ZGOPTNS= <>
##$ZL1= 120
##$ZL2= 120
##$ZL3= 120
##$ZL4= 120
##$ABSF1= 16.522
##$ABSF2= -4.171173
##$ABSG= 5
##$ABSL= 3
##$ALPHA= 0
##$AQORDER= 0
##$ASSFAC= 0
##$ASSFACI= 0
##$ASSFACX= 0
##$ASSWID= 0
##$AUNMP= <proc_1d>
##$AZFE= 0.1
##$AZFW= 0.1
##$BCFW= 0
##$BC_mod= 0
##$BYTORDP= 0
##$COROFFS= 0
##$CY= 12.5
##$DATMOD= 1
##$DC= 0
##$DFILT= <>
##$DTYPP= 0
##$F1P= 14.0000005364418
##$F2P= -0.99999901652339
##$FCOR= 0.5
##$FTSIZE= 32768
##$FT_mod= 6
##$GAMMA= 0
##$GB= 0
##$INTBC= 1
##$INTSCL= 1
##$ISEN= 128
##$LB= 0.3
##$LEV0= 0
##$LPBIN= 0
##$MAXI= 10000
##$MC2= 0
##$MEAN= 0
##$ME_mod= 0
##$MI= 0
##$NCOEF= 0
##$NC_proc= -3
##$NLEV= 6
##$NOISF1= 0
##$NOISF2= 0
##$NSP= 0
##$NTH_PI= 0
##$NZP= 0
##$OFFSET= 16.522
##$PC= 1
##$PHC0= 227.6057
##$PHC1= 7.102952
##$PH_mod= 1
##$PKNL= yes
##$PPARMOD= 0
##$PSCAL= 4
##$PSIGN= 0
##$REVERSE= no
##$SF= 250.13
##$SI= 32768
##$SIGF1= 0
##$SIGF2= 0
##$SINO= 400
##$SIOLD= 32768
##$SREGLST= <1H.CDCl3>
##$SSB= 0
##$STSI= 32768
##$STSR= 0
##$SW_p= 5175.98343685301
##$SYMM= 0
##$S_DEV= 0
##$TDeff= 65536
##$TDoff= 0
##$TI= <Analysis number 999999
Compound Code 99
Book Reference 9
Project Code 9>
##$TILT= no
##$TM1= 0
##$TM2= 0
##$TOPLEV= 0
##$USERP1= <user>
##$USERP2= <user>
##$USERP3= <user>
##$USERP4= <user>
##$USERP5= <user>
##$WDW= 1
##$XDIM= 32768
##$YMAX_p= 515481869
##$YMIN_p= -95394
$$ End of Bruker specific parameters
$$ ---------------------------------
##NTUPLES= NMR SPECTRUM
##VAR_NAME=  FREQUENCY,     SPECTRUM/REAL,   SPECTRUM/IMAG
##SYMBOL=    X,             R,               I
##VAR_TYPE=  INDEPENDENT,   DEPENDENT,       DEPENDENT
##VAR_FORM=  AFFN,          ASDF,            ASDF
##VAR_DIM=   32768,         32768,           32768
##UNITS=     HZ,            ARBITRARY UNITS, ARBITRARY UNITS
##FACTOR=    0.157963299565203, 1,           1
##FIRST=     4132.6476996994, 0,             0
##LAST=      -1043.33573715361, 0,           0
##MIN=       -1043.33573715361, -95394,      0
##MAX=       4132.6476996994, 515481869,     0
$$ Real data points
##PAGE= N=1
##DATA TABLE= (X++(R..R)), XYDATA
$$ [...]
17525D2148084Q889524R280974L916669o182669p840390q129314r027133o917930
17517B6137815k901771J488229N733445Q688889Q146767P680704P546674j391922
17509F1128830q382051q705169r864529j0047780p667208m886927k924739j812187
17501F838240j195387q22297n93635m42937l77319l50713l07948k39606k27715
17492B280683k25523j91292j47663j65973j62204j39982j35111j23787r4649p1177
17482H23322l7108j8178o2407q9075n6614l1744l2011l4162p695j02K1004K050
17470D77280l6450m5310l9522l7093l314j5072k3878k1822j5337m22P545k0771
17458B25834k0321j367k675o453p595r952M608R908j5354j7820l251R665J1251
$$ plain form
17525 42148084 51037608 60318582 64235251 58052582 50212192 42082878 33055745 26137815
17517 26137815 23236044 24724273 30457718 39146607 47293374 54974078 62520752 61128830
17509 61128830 52746779 44041610 34177081 24129301 16462093 11575166 8650427 6838240
17501 6838240 5642853 4820556 4226921 3783984 3406665 3055952 2748004 2508398 2280683
17492 2280683 2055160 1863868 1716205 1550232 1388028 1248046 1112935 989148 894499 823322
17482 823322 786214 768036 705629 616554 559940 528196 496185 462023 454328 454226 475230 477280
17470 477280 440830 395520 355998 318905 315591 300519 276641 254819 239482 239060 246605 225834
17458 225834 205513 204146 201471 195018 187423 177471 182079 191987 176633 158813 155562 165227 176478
17445A76478M977K4413M2176O3493K3512o3333o4694l2819k6271j3388q022O981
17433A33503n034n935J5250j5907m840N441l049j2690l842K645L678J0656j2370
17420A07506n318J718k595n030R489P791j330O277K3451P651j4327j6296j4351
17407A04636j6790O580J4782J9040J2402K148p887m409J8020j5583j1293k7109
17395I4537l7741m963Q778J0658L46k662j769J5475O712k1701l3739j0508q066
17382A5357n693j8794j0640K022m732J1277J5996j424l223k226N149K639n276
17369D32M240j976L369O563O135N301k404O783m36j692J458n351M279j3275j1322
17354B104j7729K661P404r990K790J6929J6650O712O297m553j3251M007M887j0554
$$ plain form
17445 176478 181455 205868 248044 311537 335049 271716 207022 174203 147932 134544 126522 133503
17433 133503 128469 122534 137784 121877 117037 122478 119429 106739 102897 105542 109220 119876 107506
17420 107506 102188 103906 101311 96281 105770 113561 112231 118508 141959 149610 135283 118987 104636
17407 104636 87846 94426 109208 128248 140650 142798 134911 130502 148522 132939 121646 94537
17395 94537 56796 51833 60611 71269 71615 68953 67184 82659 89371 67670 33931 23423 15357
17382 15357 9664 -9130 -19770 -17748 -22480 -11203 4793 3369 146 -2080 3069 5708 432
17369 432 4672 2696 6065 12628 18763 24064 21660 28443 28007 26315 27773 22422 26701 13426 2104
17354 2104 -15625 -12964 -5560 -15550 -12760 4169 20819 27531 33828 29275 16024 20031 24918 14364
17340A4364r485J122q71J0163L055L737J4951q129p713l128M395K167L721M240
17326C2589l68K16m501k3299L04N518Q982j0052R972l362N81R649q780r068M730
17311A3111L163n238O957M353j698p834j1356Q796K095R181K0852K729o250j3021
17297B5840m560M612k307j24K021J4075J4010L2465L1541L4938O2296P2674Q9315
17284C76796J11700J14958J24878K1463j9563N1902M2168q1451j01362n2372o136
17273E82981K38l236M3234J13465P4384l5193j8475L2015l8411j55912j19547
17262D75543q2401r2746q7845n7180n1745k4803r065l059j30m510L514p171p519
17249E0883n176j4774j8641L802Jp679l110K45r86j2870n561M764O936K1955P66
$$ plain form
17340 14364 4879 6001 5130 15293 18348 22085 37036 28907 21194 18066 22461 24628 28349 32589
17326 32589 32221 32437 27936 4637 4941 10459 19441 9389 19361 15999 16580 26229 17449 8381 13111
17311 13111 16274 11036 17993 22346 20648 12814 1458 10254 12349 21530 42382 45111 38861 25840
17297 25840 21280 25892 23585 23461 25482 39557 53567 86032 117573 152511 214807 287481 376796
17284 376796 488496 603454 728332 749795 730232 782134 824302 742851 641489 589117 582981
17273 582981 583219 579983 623217 736682 811066 775873 757398 789413 751002 595090 475543
17262 475543 393142 300396 212551 155371 103626 78823 69758 66699 66569 62059 65573 58402 50883
17249 50883 45707 30933 12292 16094 16095 8416 5306 5551 4565 -8305 -13866 -9102 -2166 19789 20555
17234B0555n250j1833j0762P259N509k103p990M843Q400j038p02J5163J403o603
17220A6851k80j0249O994j1596k4027j682J1321R544o839r265N666M52P564P564
17206B018k837R95p766j5001j0134J1831J6222l244q523j919l243L154K2722j0237
17192e962j169R11m740P379m287J816N656r023K620M577j723r661k224J0339M176
17177a315P473j860k756n315p509n633k55N653K0789J1140n007k8314r210N845
17163a6274Q821N51N4k339o025o08l64J4875J4078q40m860R429n76n84o005o184
17147C149j924m23P23M584Q657n652J866M21k1945l243p781K972M249Q482k323
17132h188L602P146n772O794Q368j5894k0261p380N184l633L919J1031j651k909
$$ plain form
17234 20555 15305 3472 -7290 -31 5478 3375 -4615 228 8628 7590 6888 22051 23454 16851
17220 16851 16571 6322 13316 1720 -22307 -23989 -12668 -3124 -9963 -19228 -13562 -13110 -5546 2018
17206 2018 -819 176 -7590 -22591 -32725 -20894 -4672 -7916 -16439 -18358 -21601 -18447 4275 -5962
17192 -5962 -7131 -6220 -10960 -3581 -7868 -6052 -396 -9419 -6799 -2222 -3945 -13606 -15830 -5491 -1315
17177 -1315 6158 4298 1542 -3773 -11282 -16915 -17170 -11517 9272 20412 15405 -12909 -22119 -16274
17163 -16274 -7453 -6902 -6848 -9187 -15212 -15820 -16184 -1309 12769 11929 7069 16498 15922 15338 9333 3149
17147 3149 1225 802 1525 6109 14766 9114 10980 11401 -10544 -13787 -21568 -18596 -14347 -5865 -8188
17132 -8188 -4586 2560 -3212 3582 11950 -3944 -24205 -31585 -26401 -30034 -26115 -15084 -16735 -19644
17118a9644J6550R049M334n809n544M94j5049K294J0943N388J3543O014j4818
17105G745l917o319j5305R080M803j3731n733Q590K634N881r667J0041K2532J7691
17091C4325p384j5390m080q00R536p808r144Q373P34m674r245j2536j5624O126
17077b7591k994m828L28L407Q300M744j670N038P172j130p910q195L22J5839J5236
17062F068K215j645k622j1750q461J4453R692o208m882j0754j383L396P377n226
17048i730j340J7742J222R580j1149M079n456j3468L931O396J0490m011q804j476
17034a994l058J7630K749J8463j010L429L8173M5666L5017O3169N8180M7045K4918
17021C48377j7979l8948m4202o0426m5103k1829O534L0527M9407M8442N4419M1290
$$ plain form
17118 -19644 -3094 5955 10289 4480 -1064 -570 -15619 -13325 -2382 3006 16549 22563 7745
17105 7745 3828 -2491 -17796 -8716 -3913 -17644 -23377 -14787 -12153 -6272 -15939 -5898 16634 34325
17091 34325 26941 11551 7471 6671 16207 8399 -745 7628 8362 3688 -5557 -18093 -33717 -27591
17077 -27591 -30585 -35413 -35085 -31678 -23378 -18634 -20304 -15266 -8094 -9224 -17134 -25329 -25007 -9168 6068
17062 6068 8283 6638 4016 -7734 -16195 -1742 7950 1742 -3140 -13894 -15277 -11881 -4504 -9730
17048 -9730 -11070 6672 7894 17474 6325 10404 4948 -8520 -4589 1807 12297 8286 -518 -1994
17034 -1994 -5052 12578 15327 33790 32780 36209 74382 120048 155065 218234 276414 323459 348377
17021 348377 330398 291450 247248 186822 141719 119890 126424 156951 206358 254800 309219 350509
17009C50509r968m8188m2827n3205o9068m5325k0930r679j9184m985o858J5147
16997C5439J042q985j3685r59N203Q421P925N301j0550l358L198r757p830j5961
16983d556M934k229o560O193J7814J9298o73q96p948j3050j281J925j546M700
16969A6125k26N887o130q757j3410j955N007Q976l192J2118O010j976m382K398
16955A6493r572k463p595n818L5R86l409n301Q120P720L675J689K277p60j2483
16940f406m652K633J970J2255M69j586m031k384J606O883k906K290J5055n084
16926A6112j0085L232J8255K921J837j0426p19N346J280J3480J2640Q061n793
16913E6141k4395k5721j2564L982J3358J1139L17M853j1042L053k3336j7290k01
$$ plain form
17009 350509 340541 292353 249526 196321 127253 81928 60998 51319 32135 27150 20292 35439
16997 35439 36481 27496 13811 12852 18055 26476 34401 39702 29152 25794 28992 19235 11405 -4556
16983 -4556 378 -1851 -8411 -2218 15596 34894 34221 33325 25377 12327 11046 12971 11425 16125
16969 16125 15899 21786 15656 6899 -6511 -8466 -3459 5517 2325 14443 20453 18477 14095 16493
16955 16493 6921 4458 -3137 -8955 -8920 -7934 -11343 -16644 -8524 -804 2871 4560 6837 6077 -6406
16940 -6406 -11058 -8425 -6455 5800 6269 4683 652 -1732 -126 6757 3851 6141 21196 16112
16926 16112 6027 9259 27514 30435 32272 21846 21127 26473 27753 41233 53873 61934 56141
16913 56141 31746 6025 -6539 -2557 10801 21940 22257 27110 16068 19121 -4215 -21505 -21706
16900b1706J4694J789m222K495O455M22J831J6338L454m050p674r588L717J3298
16886A7253J7279J5168M3198J7782j7569k9523k8070k7796p252o353k292P784
16874c91p270k190J3314J4909J4200R991K671J9783J4077j9980j7192j5755j9079
16861G088j1719q000j1308J703k072m73J0282J8527j7758k0427R806J6216J5343
16848G208Q347j3639p461K529l473m595L794M003p920R651K590M144K2321N600
16834C3099R718m857k1867j7445o138R409J3139j6950j8144P61N739J7190l344
16821C10j0075q25k705n847j853K4796J4341k508M501n906m339j8053j9498p189
16807c4850P877J3491J1093M166P40k594o826r91l943m07P53K47n998K925Q547
$$ plain form
16900 -21706 -7012 -5223 -9445 -6950 -495 -73 1758 18096 21550 17500 9826 238 3955 17253
16886 17253 34532 49700 92898 110680 93111 63588 35518 7722 470 -5883 -8175 -391
16874 -391 -7661 -9851 3463 18372 32572 42563 45234 65017 79094 59114 41922 26167 7088
16861 7088 -4631 -12631 -23939 -22236 -24308 -24781 -14499 4028 -13730 -34157 -24351 -8135 7208
16848 7208 15555 1916 -5545 -3016 -6489 -11084 -7290 -3287 -11207 -1556 1034 5178 27499 33099
16834 33099 42817 37960 16093 -1352 -7490 1919 15058 -1892 -20036 -19275 -13536 3654 310
16821 310 -9765 -10590 -13295 -19142 -20995 3801 18142 15634 20135 14229 9890 -8163 -27661 -34850
16807 -34850 -26973 -13482 -2389 1777 2517 -77 -6903 -7894 -11837 -12244 -11491 -11244 -17242 -14317 -5770
16792e770p0J1865k3387j1756K3456Q467n502q082j5488p206J0424k544J1079
16779a4514O502j337q172R970M546K054Q981J0589m130L362M534j2095j1555L973
16765B708Q141N011r979j8645k0039O21J0138R146o97o067q663K2930k554j6750
16751b4699J422Q872R201M832k953L860O136j1652r517J356r115p391k092r98
16737c2738J5262K107L0j1783j622M160J0093m054N351R192J5951r40k510o396
16723B103Q930p905p802j3n549J3088J5429q034l588m006P399J5915o008n994
16709A3965K815Q774O779o171J9399N046P434N752j815q819L198n604l008J6774
16695F4519n673j2777l018J942j4073q205J2518K7467k2997q885j0251m988l825
$$ plain form
16792 -5770 -5840 6025 -17362 -29118 -5662 2805 -2697 -10779 -26267 -33473 -23049 -25593 -14514
16779 -14514 -8012 -9349 -17521 -7551 -3005 -951 8030 18619 14489 17851 22385 10290 -1265 2708
16765 2708 10849 15860 5881 -12764 -32803 -32182 -22044 -12898 -13595 -19662 -28325 -5395 -7949 -24699
16751 -24699 -23277 -14405 -5204 -372 -3325 535 6671 -4981 -14498 -13142 -22257 -29648 -31740 -32738
16737 -32738 -17476 -15369 -15339 -27122 -28744 -24584 -14491 -18545 -13194 -4002 11949 11009 8499 2103
16723 2103 11033 3128 -4674 -4687 -10236 2852 18281 10247 6659 2653 10052 25967 19959 13965
16709 13965 16780 25554 32333 26162 45561 50607 58041 63793 61978 53159 56357 50753 47745 64519
16695 64519 58846 46069 43051 44993 30920 22715 35233 62700 39703 30818 20567 15579 11754
16682A1754Q69K271l948j8614p630k0M559q677M083Q096j154O262L311n260l091
16667g189J081l281n027R797n372k774p076o68j412Q752J852l000O855N550k126
16652d038j2900m380K905J2401N329l266L496O106O452j4179k248M236N077j1977
16638f986r270N677P689j07o169Q732l370j0234o878R559R254m480l411K847N391
16623a756k138j0824O18j992K651m022O038L432L181N341J3115j1851r199O303
16609a103q589p346J990n047k518R55Q278O240n080r341m342J6877n694j7563
16595c2283p606J4638N040k381P949O616j135M771p838j762O570J1772j9203r242
16581b4094K3602r702r587k959k074J5266J5031j2280p381j2305J987J2407l978
$$ plain form
16682 11754 12623 14894 10946 -7668 -15298 -15318 -10759 -19436 -15353 -7257 -8411 -2149 1162 -4098 -7189
16667 -7189 -6108 -9389 -14416 -4619 -9991 -12765 -19841 -20509 -21921 -13169 -11317 -14317 -7462 -1912 -4038
16652 -4038 -16938 -21318 -18413 -6012 -683 -3949 -453 5653 12105 -2074 -4322 -86 4991 -6986
16638 -6986 -16256 -10579 -2890 -2997 -9166 -434 -3804 -14038 -20916 -11357 -2103 -6583 -9994 -7147 -1756
16623 -1756 -3894 -14718 -14100 -16092 -13441 -17463 -11425 -7993 -4812 529 13644 1793 -7406 -1103
16609 -1103 -9692 -17038 -15048 -20095 -22613 -21658 -13380 -7140 -12220 -21561 -25903 -9026 -14720 -32283
16595 -32283 -39889 -25251 -20211 -22592 -14643 -8027 -9162 -4391 -12229 -13991 -7421 4351 -14852 -24094
16581 -24094 -492 -10194 -19781 -22740 -24814 -9548 5483 -6797 -14178 -26483 -24496 -12089 -16067
16568a6067J0568J1076q832o312k021K434K411O57R248l873l775o668j1644N923
16554a6875O697R87L650r877M340j3358k788O327J5208O315p333M692j026l750
16540f791J4238O437j5601j0363J1726J5122R060j1856n367J812j1883J466k690
16527d690j3474m369P887j438n26J6606J4587R705K932j9684j8562r383q45J9177
16513b077L576q363p953J916Q745R417P663K76m636J0376P657n319j310J368o028
16498A5308M288L855J742J5278J6490K6026O554j1858q915Q90r014O830j20O644
16484G3998J2381J3825J226j3423N234O710j5323l515q599O294J0800P789R251
16471A06648p520r036r972J603o042J0324k0188K59J1707N033J991j5033j6645
$$ plain form
16568 -16067 -5499 5577 -3255 -9567 -11588 -9154 -6743 -6086 3162 -711 -4486 -11154 -22798 -16875
16554 -16875 -10178 -9191 -5541 -15418 -11078 -24436 -27224 -20897 -5689 626 -6707 -2015 -3041 -6791
16540 -6791 7447 13884 -1717 -12080 -354 14768 23828 11972 6605 8417 -3466 -2000 -4690
16527 -4690 -18164 -22533 -14646 -16084 -16610 -4 14583 24288 27220 7536 -11026 -20409 -21254 -2077
16513 -2077 1499 -6864 -14817 -12901 -4156 5261 12924 13200 8564 18940 26597 21278 19968 21336 15308
16498 15308 19596 23451 25193 40471 56961 82987 89541 77683 68768 69658 60644 67474 67354 73998
16484 73998 86379 100204 101430 88007 93241 99951 84628 81113 72514 78808 89608 97397 106648
16471 106648 99128 90092 80120 81723 75681 86005 65817 66076 77783 82816 84807 69774 53129
16458E3129j7329j0949N614O95r08m071n183o819n859L214J3067L703r606o710
16444A1988L765p963q091m595Q295q150o249j1237l440m326J839J0428J1185P38
16430e813l440r466j4448j154J1531n404N46l707k238m661j711J2599K0686L503
16416c177r605q658k600r554P030J2944K777L572J0106O668j920o615m281J2410
16402I097p190k3993j0658j305L823J7349n12o726k844j588O748p45J1878J1040
16388D374P321q009p050p642j7825O089Q416j4320M33K113K029P048J5317K062
16374C56o330k773l702r390m052N272M556O923l599p056o089m390L040K4561L031
16359C58m610J135n411o551n843M963L820K135K9502N767P88J0435j8075k5003
$$ plain form
16458 53129 35800 24851 30465 31160 30252 26181 20998 14179 8320 11534 24601 28304 18698 11988
16444 11988 15753 7790 -301 -4896 3399 -4751 -11000 -22237 -25677 -30003 -28164 -17736 -6551 -5813
16430 -5813 -9253 -18719 -33167 -34321 -22790 -28194 -27648 -31355 -33593 -38254 -39965 -27366 -6680 -3177
16416 -3177 -12782 -21440 -24040 -33594 -26564 -13620 -10843 -7271 2835 9503 7583 968 -3313 9097
16402 9097 1907 -22086 -32744 -34049 -30226 -12877 -13389 -20115 -22959 -24547 -17799 -18544 -6666 4374
16388 4374 11695 3686 -3364 -11006 -28831 -22742 -14326 -28646 -28213 -26100 -24071 -17023 -1706 356
16374 356 -5974 -8747 -12449 -21839 -25891 -20619 -16063 -9140 -12739 -19795 -25884 -30274 -27234 -2673 358
16359 358 -4252 -3117 -8528 -15079 -20922 -15959 -12139 -10004 19498 25265 26053 36488 18413 -6590
16345f590p217J099O442J4596R71k3771m153K0422M295j995Q570m834Q38M167
16331A2840R698M15l244j4155j4156m027r065K0605K3825q415j3486O281n979
16318A137j3544P963L921m384J434j33K688J2679q332M823M061o645p072j1251
16304a2655j466o572k947J3352J3182l58L682l013J852r68M420j0080o034r19
16290h524q682N720OL760L547k328l694k3417p745N545Q665J4168M752q313Q74
16275a5666J6484J7169K930m457J001j5422k5K940J0342N696k3591q177J2033
16262A257P056j7081j0874J1988J3267K863J0204k73j5662j3898K158J0349j4378
16249a3024j221J077j0062l356M294J3915J1761K7j8059k5559l22J2370K2061
$$ plain form
16345 -6590 -13807 -12708 -6266 8330 9301 -14470 -18623 1799 6094 4099 12669 7835 8673 12840
16331 12840 22538 22953 19709 5554 -8602 -12629 -21694 -1089 22736 14321 835 7116 1137
16318 1137 -12407 -4444 -523 -4907 -3473 -3606 -918 11761 3429 8252 12313 5668 -1404 -12655
16304 -12655 -14121 -20693 -23640 -10288 2894 2536 6218 3205 5057 4089 8509 -1571 -7605 -8524
16290 -8524 -17206 -11486 -11480 -7720 -4173 -6501 -10195 -33612 -41357 -35812 -27147 -12979 -8227 -16540 -15666
16275 -15666 818 17987 20917 16460 17461 2039 2014 4954 15296 20992 -2599 -10776 1257
16262 1257 8313 -8768 -19642 -7654 5613 8476 18680 18407 2745 -11153 -8995 1354 -13024
16249 -13024 -14245 -13168 -23230 -26586 -22292 -8377 3384 3411 -14648 -40207 -40529 -28159 -6098
16236f098J0568K221m792n982j586n938j434j392J4400j0703K104K547o014l988
16222a6087o308O470P892P389r261m808j6461M262K0433J4606m171j3837L461
16209f420J309P232O325Q012r339k212o982q651q107K187M096J1804O735M528
16195A0517p764k0528m155J9218J9767J945k0876k075L131P429J2432n26Q214
16182B6729o133j4470K482K373j7454o859Q82Q285P155m180j7120l220J578N295
16168a4657R145O640o257l291o017m662N283n544K048l192j034P695O261M293
16154c289r609r001N226L098j0129K723J7533p224r316Rj0134M912J1134K308
16140a1759j2671k942O259L063k70j880O503l502m3k052m65R89N936J604Q566
$$ plain form
16236 -6098 4470 6691 1899 -4083 -5669 -11607 -13041 -14433 -33 -10736 -8632 -6085 -12099 -16087
16222 -16087 -22395 -15925 -8033 -644 -9905 -14713 -31174 -26912 -6479 8127 3956 -9881 -6420
16209 -6420 -5111 2121 8446 16458 7119 4907 -2075 -10726 -18833 -16646 -12550 -746 5989 10517
16195 10517 2753 -17775 -21930 -2712 17055 19000 -1876 -3951 -820 6609 19041 18515 26729
16182 26729 20596 6126 8608 10981 -6473 -13332 -12450 -4165 2990 -1190 -18310 -21530 -19952 -14657
16168 -14657 -5512 1128 -5129 -8420 -14437 -19099 -13816 -19360 -17312 -20504 -21538 -13843 -7582 -3289
16154 -3289 -12898 -21899 -16673 -13575 -23704 -20981 -3448 -10672 -19988 -19979 -30113 -25201 -14067 -11759
16140 -11759 -24430 -27372 -21113 -18050 -18320 -20200 -13697 -17199 -17242 -19294 -19759 -18770 -12834 -11230 -2664
16125b664r354p698K3171O437k2713q448k361O775R596M790N614l108p826o828
16111a4617J0147K56n274p267o590q792J0120K373k559j1898k530j09J183J1750
16097b3807N337J2192J1377R2q451j923j4762j951J7975K2926N819p971l676j66
16083A3011K97j52m384r173j4151P554k67r822O114j6621r689l646R027J4175
16069a7727J0346J0592p699M957j742J1741L113m357j336j3739j2175n375m603
16056b8004k399Q459J0393Q981O602j262n318Q824O333L956K540j3922r097o82
16042d596m456J4678k517j2803k0552J0105J3608L677J3518j677k1781p798O589
16029a4005M134q150m660K0354J6755N600m293j6030r480l827J0503r793r22L043
$$ plain form
16125 -2664 -12018 -19716 3455 9892 -12821 -21269 -23630 -16855 -7259 -2469 3145 37 -7789 -14617
16111 -14617 -4470 -4214 -9488 -16755 -23345 -32137 -22017 -19644 -22203 -34101 -36631 -36740 -35557 -23807
16097 -23807 -18470 -6278 5099 5191 -3260 -5183 -19945 -21896 -3921 19005 24824 16853 13177 13011
16083 13011 13308 13156 8772 -401 -14552 -6998 -7265 -17087 -10973 -27594 -37283 -40929 -31902 -17727
16069 -17727 -7381 3211 -4488 469 -1273 10468 13581 9224 7888 -5851 -18026 -23401 -28004
16056 -28004 -30403 -21944 -11551 -2570 4032 2770 -2548 6276 12609 16565 19105 5183 -3914 -4596
16042 -4596 -9052 5626 3109 -9694 -30246 -20141 -6533 -2856 10662 8985 -12796 -20594 -14005
16029 -14005 -9871 -18021 -22681 -2327 14428 20028 15735 -295 -9775 -13602 -3099 -12892 -13814 -10771
16015a0771N505Q27q989L062P690O047q956k6967J2626K0943J7654j0202j3645
16002e176p847M89J7027o097p519p205m500M855N142L19k547j689L771L60o204
15987a6821j0520K68Q018K1904P993L591m197O008k166j3859r642j4797j0213
15974c4433J3754R787R600j187r904N975o738L086M927L337K758o761o003K450
15960i352Q346J4933O346k716r795Q030M108M995R237l671m832j7917k538o716
15946a542N57J8854p10j4321j2013K6p9J442M534N165k052j695j4700n821J8193
15931d162J9436P774j2065j2750j782j1504P792R844J62o45L028n419j4426P46
15917a3971R394q539o827M005k239J218Q654l611k624L988Q744J0706p846k435
$$ plain form
16015 -10771 -5266 -4439 -13428 -10366 -2676 3371 -5585 -32552 -19926 1017 18671 8469 -5176
16002 -5176 -13023 -12534 4493 -1604 -9123 -16328 -20828 -15973 -10831 -10512 -13059 -14748 -10977 -10617 -16821
15987 -16821 -27341 -27073 -19055 2849 10842 14433 10236 16244 14078 219 -9423 -24220 -34433
15974 -34433 -20679 -10892 -1292 -2479 -12383 -6408 -13146 -10060 -5133 -1796 962 -5799 -11802 -9352
15960 -9352 -1006 13927 20273 17557 7762 15792 19900 24895 34132 30461 25629 7712 5174 -1542
15946 -1542 -985 17869 17159 2838 -9175 -9149 -9228 -7786 -3252 1913 -139 -1834 -16534 -22355 -4162
15931 -4162 15274 23048 10983 -1767 -3549 -15053 -7261 2583 2745 2100 5128 -291 -14717 -13971
15917 -13971 -4577 -13116 -19943 -15938 -18177 -16959 -8305 -11916 -14540 -10552 -1808 8898 1052 -1383
15903a383p983k208j299k944P328j923n647K069L391N78J2379M411l863J388j897
15888B397J965Q647L346o11j2971j0759l012m334M157k933j3096P88N613J936
15874a8867L643M259M603p347j362l402j2210J3284J6624R542q901p374N497J1536
15860I525n280r085l145r149O675J9327L353j0807p183k635l157j0354J1264o447
15846a7098l260J2451j877j3124P490K1455R220j23n23j3781o460r347k142o047
15832b3166O247Q226J798J04m436K831N755Q658n019r177N00j567j696j2771K877
15817b0836j378l82Q486Q349R078J1378n919r52n385R039J1755K603j2374R47
15803A4409M556j5179j3390K542J101o2j707N617K479j1118K536Q216k096J564
$$ plain form
15903 -1383 -9366 -11574 -12873 -15817 -8489 -10412 -16059 -13990 -10599 -10021 2358 6769 2906 4294 2397
15888 2397 4362 13009 16355 15744 2773 -7986 -10998 -15332 -11175 -14108 -27204 -26416 -20803 -18867
15874 -18867 -15224 -10965 -6362 -13709 -15071 -18473 -30683 -17399 -775 8767 -134 -7508 -2011 9525
15860 9525 4245 -4840 -7985 -17134 -10459 8868 12221 1414 -5769 -8404 -11561 -21915 -10651 -17098
15846 -17098 -20358 -7907 -9784 -22908 -15418 6037 15257 15134 14611 830 -5630 -14977 -17119 -23166
15832 -23166 -16919 -8693 -6895 -6791 -11227 -8396 -2641 6017 998 -8179 -7679 -9246 -10942 -23713 -20836
15817 -20836 -22214 -22596 -14110 -5761 3317 14695 8776 7824 2439 11478 23233 25836 13462 14409
15803 14409 18965 3786 -9604 -7062 -5961 -6023 -7730 -2113 366 -10752 -8216 0 -2096 -532
15789e32k090P659N787p906l585P34j116M877j098p023M744j808M499j1834K149
15774f543K950r218m837P766k697R96J33K111L827l923M817j840J4471N988j3508
15759D93n135j907K726O109j2177o638L885O544J5443j1988j1866P52M97P889
15745e373M95N645P46j231n010o599j3127P622j489k037N752r69R248m109m795
15730a5231o213M252L429P96J59l737J2329N238R530k901J62J2739n930j2492
15716B130q284j648J1099l594k0395P41n44P051J7872L322j2934j0954M602P440
15702d096k436j1587q185m341m261K700Q260J2914J484M491m566K318J211R524
15688C430q112n297K001K400Q295P665M183j2030L54J139j426K342K296l30p377
$$ plain form
15789 -532 -2622 5037 10824 2918 -667 67 -1049 3828 2730 -4293 451 -1357 3142 -8692 -6543
15774 -6543 -3593 -12811 -17648 -9882 -12579 -11583 -11450 -9339 -5512 -9435 -4618 -6458 8013 14001 493
15759 493 -4642 -6549 -3823 2286 -9891 -16529 -12644 -6100 9343 -2645 -14511 -13759 -13262 -5373
15745 -5373 -4878 767 1513 282 -4728 -11327 -24454 -16832 -18321 -20358 -14606 -15575 -6327 -10436 -15231
15730 -15231 -21444 -17192 -13763 -12967 -12808 -16545 -4216 1022 10552 7651 7813 20552 14622 2130
15716 2130 -6154 -7802 3297 -297 -20692 -19951 -20495 -13444 4428 7750 -5184 -16138 -11536 -4096
15702 -4096 -6532 -18119 -26304 -30645 -34906 -32206 -23946 -11032 -9548 -5057 -9623 -7305 -6094 3430
15688 3430 -4682 -9979 -7978 -5578 2717 10382 14565 2535 2889 4028 2602 4944 7240 6910 -467
15673d67j995j2848k795P183M691p34P84m249K179Q59r335k445n673l79p624p924
15657d0772Q542J6051J8239K125p986j788J5846p240k0540K21J4092J1189k248
15644E731j0873j3776l668R882J0065l587L59P586l432l93R671M961j2294o13
15630c81l835o874L284J300O506r640l735J118P086L674k421l542m806p308Q12
15615a8762k554J0865J6594R795p426j4437n157J0948m547j2333n753J6303L234
15602c230O87J364J8421J1200n001j1997o049O146P651j5373q401N89Q04l625
15588f814j767J252J247l069k8583J6654J6186r91j5128R416K2479p224n686j1009
15574a3037r528l626Q327p27q95L656P16l715K407R665l24L816Q776j2444k529
$$ plain form
15673 -467 -2462 -15310 -18105 -10922 -6231 -6965 -6181 -10430 -8251 -7392 -16727 -19172 -24845 -25224 -32848 -40772
15657 -40772 -32230 -16179 2060 4185 -3801 -5589 10257 3017 -17523 -17302 -3210 7979 5731
15644 5731 -5142 -18918 -22586 -12704 -2639 -6226 -5867 1719 -1713 -2106 7565 12526 232 -381
15630 -381 -4216 -11090 -7806 -6506 0 -9640 -13375 -12257 -5171 -1497 -3918 -7460 -12266 -19574 -18762
15615 -18762 -21316 -10451 6143 15938 8512 -5925 -11082 -134 -4681 -17014 -22767 -6464 -3230
15602 -3230 -2543 -1179 17242 28442 23441 11444 5395 11541 19192 3819 -4582 -3993 -3189 -6814
15588 -6814 -8581 -7329 -6082 -9151 -37734 -21080 -4894 -5885 -21013 -11597 10882 3658 -2028 -13037
15574 -13037 -22565 -26191 -17864 -18591 -19486 -15830 -15114 -18829 -16422 -6757 -7081 -3265 5511 -6933 -9462
15559i462M694l302q43q730j5680O40K1266K9872N874j7155o870R049o892k6478
15545b4017j3899M945K6890J782m406m69O671J6150j3197p625p128J685J4276
15532A658J413n975j2585p716K717O180Q599J0755j1792p169J1391j652l391J077
15518f490K0277K710j2825L918k100q653o762j60k786N445K144q56L869K874n852
15503e247O065N884n847K05K103j0590j432J755k026n355J5j0177M817J1263J0317
15488A750j333q96n659n81J1975q95J409j4297o432J4360P290m577r033j892J1218
15473B407L389r240o686J2957J6682J992l013o775j6109j0653R215O371Q474J0117
15459A9128l344j7492p050P133k315O241m530J838l701j151k563m646j1406K79
$$ plain form
15559 -9462 -4768 -8070 -8913 -17643 -33323 -32683 -11417 18455 24329 7174 304 9353 2461 -24017
15545 -24017 -37916 -32971 -6081 -4299 -8705 -9174 -2503 13647 450 -7175 -14303 -12618 1658
15532 1658 3071 -2904 -15489 -23205 -20488 -14308 -5709 5046 -6746 -13915 -2524 -4176 -7567 -6490
15518 -6490 13787 16497 3672 7590 5490 -3163 -9925 -10085 -12871 -7426 -5282 -6138 -2269 605 -5247
15503 -5247 818 6702 855 1060 3163 -7427 -8859 -7104 -9130 -14485 -14470 -24647 -19830 -8567 1750
15488 1750 417 -479 -6138 -6719 5256 4361 5770 -8527 -14959 -599 6691 2114 -6919 -8811 2407
15473 2407 5796 -3444 -10130 2827 19509 21501 18488 11713 -4396 -15049 -5834 537 9011 19128
15459 19128 15784 -1708 -8758 -1625 -3940 2301 -2229 -391 -4092 -5243 -7806 -12452 -23858 -23579
15445b3579j557Q276N641o196Q829J8068j962J274r409m113k252o373m907K2937
15431D677J5631j6748j5713M442l220l170j521p74N574K620M329j6719j3014M906
15417b8700L245L438M222O304R10J0611P304J011j0022o352Q649O992j3706r39
15403g033N551L763K343K160M363n116m859k558O707J055O321Q135j1905J47O732
15388A5806j3506j5401R648M80l666J3315p106j3675M757P92L454k227J0046J5060
15374A7777q086j0321j2022j0139j78k87j73J3443R623L270r765j5140J040J5238
15360e720K751l044J1955k328j4641r075k961M084n68R626O518J91n204J420j234
15345h230j9267j879K6563K843p180J3554J3927q728r709m413P37k343O857K333
$$ plain form
15445 -23579 -25136 -16860 -11219 -17415 -8586 9482 7520 8794 -615 -4728 -6980 -13353 -18260 4677
15431 4677 20308 3560 -12153 -7711 -10931 -14101 -15622 -16396 -10822 -8202 -3873 -20592 -33606 -28700
15417 -28700 -25455 -22017 -17795 -11491 -10581 30 7334 8345 -1677 -8029 620 7612 -6094 -7033
15403 -7033 -1482 2281 4624 6784 11147 6031 1172 -1386 5321 6376 12697 20832 8927 9074 15806
15388 15806 2300 -13101 -3453 -2973 -6639 6676 -430 -14105 -9348 -8556 -5102 -7329 2717 17777
15374 17777 9691 -630 -12652 -22791 -22969 -23256 -23429 -9986 -363 2907 -6858 -21998 -20958 -5720
15360 -5720 -2969 -6013 5942 3614 -11027 -20102 -23063 -18979 -19547 -9921 -3403 -3212 -8416 -6996 -8230
15345 -8230 -27497 -29376 -2813 30 -7150 6404 20331 11603 1894 -2519 -1782 -4125 2732 5065
15331E065j85R14R457O088j886k746k546r61k482P78j277j823n783j2919o65m633
15315a5604M449R104O531p381l046m901P186K0471p309J487O754o422j957J532
15301A0894j840n539r189j2350R603R469N672K484p377M322J2477j5491j6666
15288a3531J0672O425q179j760J2496p712q617k051p865k860L43j643J703J6829
15274e750j894J299M977J3066J212K382l304j7k5n20K433j4966j0141p895j4308
15259c3451Q078J2182n062J0425q38l130J0511k330o697N38P287j0702L941O002
15245c246O452p37J989j2005J0784J5832p925J247M720q19P269m560L00n541l037
15230A0723j0790J0321L15j0370l536J1062K29q175Q5j171O137k209L049N99O178
$$ plain form
15331 5065 4880 5794 15251 21339 19453 16707 14161 13200 10718 11496 10219 8396 2613 -10306 -10971 -15604
15315 -15604 -11155 -2051 4480 -2901 -5947 -10848 -3662 16809 9500 10987 17741 11319 9362 10894
15301 10894 9054 3515 -5674 -18024 -8421 1048 6720 9204 1827 6149 18626 3135 -13531
15288 -13531 -2859 3566 -4613 -6373 6123 -1589 -10206 -12257 -20122 -22982 -22639 -24282 -22579 -5750
15274 -5750 -7644 -6345 -1368 11698 12910 15292 11988 11971 11946 11426 13859 -1107 -11248 -19143 -33451
15259 -33451 -25373 -13191 -18253 -7828 -8666 -11796 -1285 -3615 -10312 -9774 -2487 -13189 -9248 -3246
15245 -3246 3206 2469 4458 -7547 3237 19069 11144 12391 17111 16292 23561 19001 19301 13760 10723
15230 10723 -67 10254 10569 199 -3337 7725 7954 -221 -136 -1307 4830 2621 5670 6269 12447
15215A2447j590l89J288J225L081r416j1437k289j3061l304J1319R944N996P952
15201A1766j568n165K905K260n376o934p477o935r007J0359J2494O445j011n107
15187b351m642j1120j549P959Q927J417m972K545L58k293J02L879o333m258j14
15172a2445M031J9616J475J512q469k1855j328m894k68O270J2764J0256j3347
15159f682N204j0526k709r933J3776K3311K1496l723j5770j4000p99q792j6942
15146b6089j753J2598J3720O598L763o374l945l330R31O11k899q597J0613P846
15132C693j479j493Q510M316l543l614L726M964k3K371q862j2183o712J739j906
15117a0496r104R818J0690N801p895m486j028j151l303j0402N537N053N20l381
$$ plain form
15215 12447 10857 10468 11756 12981 16062 6646 -4791 -7080 -20141 -23445 -12126 -2182 3814 11766
15201 11766 10198 5033 7938 10198 4822 -2112 -9589 -16524 -25531 -15172 -2678 3767 2756 -2351
15187 -2351 -6993 -18113 -19662 -11703 -2776 -1359 -6331 -3786 -3428 -5721 -5619 -1740 -8073 -12331 -12445
15172 -12445 -8414 11202 12677 14189 5720 -16135 -17463 -22357 -22625 -16355 -3591 6665 -6682
15159 -6682 -1478 -12004 -14713 -24646 -10870 12441 33937 30214 14444 444 -355 -9147 -26089
15146 -26089 -27842 -15244 -1524 5074 8837 2463 -1482 -4812 -3881 -3270 -6169 -14766 -4153 3693
15132 3693 2214 721 9231 13547 10004 6390 10116 15080 15057 17428 8566 -3617 -10329 -8590 -10496
15117 -10496 -19600 -9782 908 6709 -1186 -5672 -6700 -7851 -11154 -21556 -16019 -10966 -10446 -13827
15103a3827O895P423M10O94k05M666K884m55j2092o723j0K990J3149l246j1479
15088h926L247L616J89O806J3398J0349p9l855k669q049K427k0066J42K2723o886
15073A2367J937R319N37q574j2887j6903O978P815J891P021M411m919J01l580
15059E514n173o194k383J0725N417k442n346p595m272j0058j123J0059J0975p838
15045i734n867m62k285J846m761m858Q946J4141k691J08j047J022m628r54j1767
15030b2991Q887Q681J3704K526q206J127n971k947R960j3106J689R860P00m366
15016d53R971N286M027j1178j5755j0020J0069K951n71J0049P049r815k1870J6297
15002c963K0008K630o261j5602J1796o950j224L866m156L747l448j2110j245k855
$$ plain form
15103 -13827 -6932 491 901 1595 1390 6056 8940 8485 -3607 -10330 -10340 -7350 5799 2553 -8926
15088 -8926 -5679 -2063 -1874 4932 18330 28679 28600 24745 22076 14027 16454 -3612 -3470 19253 12367
15073 12367 14304 23623 24160 15586 2699 -14204 -7226 589 2480 9501 13912 8993 9094 5514
15059 5514 341 -5853 -8236 2489 7906 5464 118 -7477 -11749 -21807 -22930 -12871 -1896 -9734
15045 -9734 -15601 -16063 -18348 -16502 -21263 -26121 -17175 -3034 -5725 -5617 -6664 -5642 -10270 -11224 -22991
15030 -22991 -14104 -5423 8281 10807 2601 3728 -2243 -5190 4770 -8336 -6647 3213 3913 -453
15016 -453 9518 14804 18831 7653 -8102 -18122 -8053 -5102 -5673 4376 11425 1610 -20260 -3963
15002 -3963 16045 18675 12414 -3188 8608 1658 434 4300 144 3891 443 -11667 -12912 -15767
14988a5767l072O896m118L817O937l532k740q494J0067P905j2715M806Q405j0676
14974a2281r625O728K2137p219m967n19O265r056p669J2765J6241k674j1379j5448
14960a6701N824J1067j588N154M486j2343M052J1821m164k5082q141J1574J5468
14947A427j51K759J0958j0845j2360L995O051r007o257J8716L232j1734n870o500
14933a5586m18J0597j472j2890j104J5928Q883j9066k4627j056J4066m639k800
14920c4184O079J1145O670j836J7094J0153r079q360K427l629j1387J679j390
14907a4618m402j597l356J5548K2501N642L034j2211j1253r003m413p306l064
14894b4498J6103Q04o116J895K796K971R546j5620j9217M357J9082J0713L981
$$ plain form
14988 -15767 -18839 -11943 -16061 -12244 -5307 -8839 -11579 -20073 -10006 -2101 -14816 -10010 -1605 -12281
14974 -12281 -21906 -15178 6959 -260 -5227 -5746 519 -8537 -16206 -3441 12800 10126 -1253 -16701
14960 -16701 -10877 190 -1398 3756 8242 -4101 -49 11772 7608 -17474 -25615 -14041 1427
14947 1427 1276 4035 14993 4148 -8212 -4217 1834 -7173 -13430 5286 8518 -3216 -9086 -15586
14933 -15586 -16004 -5407 -6879 -19769 -20873 -4945 3938 -15128 -39755 -40811 -26745 -31384 -34184
14920 -34184 -28105 -16960 -10290 -12126 4968 15121 6042 -2318 109 -3520 -14907 -13228 -14618
14907 -14618 -19020 -20617 -23973 -8425 14076 19718 22752 10541 -712 -9715 -14128 -21434 -24498
14894 -24498 -8395 -7591 -13707 -11812 -9016 -6045 3501 -12119 -31336 -26979 -7897 2816 6797
14881F797q099j0111Q48Q278j528R971j510m830o025P345l177J3K312J039R092
14866A0415o033j388O639P099j3835j3661m2N585R78M54M090N668j3335j218j808
14851a0392q954J5459J3127j5026K422K890j2905n606K1775K329j699O058Q815
14838A8293j3046j301J0686N477K502O410o795k6307n604J2469J343L848R726
14825A7701j0457j0019J676m431m691J497N700J229j0933L877P296p901l195J5336
14811B685R366R314j5714q001k304j0943j0335R549J3404J6296O97j3480j0603
14798a0069J5195N389j257j7381o854R904J073J277r492n642J3209R629k117m74
14784B390K129K1854J4661j9256k6348J958J0820q578o800Q866j632n466M998
$$ plain form
14881 6797 -1302 -11413 -10565 -2287 -3815 6156 4646 -184 -6209 1136 -2041 -2028 284 1323 10415
14866 10415 4382 2994 9633 16732 2897 -10764 -10806 -5221 -4243 -3789 301 5969 -7366 -8584 -10392
14851 -10392 -19346 -3887 9240 -5786 -3364 -474 -13379 -18985 2790 5119 3420 9478 18293
14838 18293 5247 3946 14632 20109 22611 29021 22226 -4081 -9685 2784 4127 7975 17701
14825 17701 7244 -2775 -1099 -5530 -10221 -8724 -3024 -1795 -12728 -8851 -1555 -9456 -12651 2685
14811 2685 12051 21365 5651 -2350 -4654 -15597 -25932 -16383 -2979 13317 14014 534 -10069
14798 -10069 5126 10515 9258 -8123 -14977 -5073 -4000 -2723 -12215 -17857 -4648 4981 2864 2390
14784 2390 4519 26373 41034 21778 -4570 -2612 8208 -370 -7170 1696 64 -5402 -404
14771d04P007O60o666j70R6j1256p729O644J247J4855N04p376j4380J830J0754
14756d384K710l737o82k298o188J1625L174o917J1052M575P877L0n094p645k58
14741C840j167J0627k0O931J880l113J158j2581k6841m596J5326J2234J755j6758
14727a1325j77j1850k516J7945L044j5472m229M860J2810J5058m24j269j0945
14714d490K729P814P341m519P80n245J3835K913j5821k0179M848R251k971k012
14700e726L541O971P642m867K71N238O055q472j2670j72N999k872R052j296j196
14685G498J2168J397n549k627j21Q087o966k683N296O476J865k255j2877l813
14671E896J486J9609l002j5237p101J630q551N00l909p23R412J4648l506j441
$$ plain form
14771 -404 6603 7263 597 427 523 -10733 -18462 -11818 -10571 4284 4788 -2588 -16968 -15138 -4384
14756 -4384 -1674 -5411 -6093 -8391 -14579 -2954 220 -6697 4355 8930 16807 16837 11743 4098 3840
14741 3840 2673 13300 13280 20211 22091 18978 20136 7555 -19286 -23882 -8556 3678 5433 -11325
14727 -11325 -11502 -23352 -25868 -7923 -4879 -20351 -24580 -19720 -6910 8148 7724 6455 -4490
14714 -4490 -1761 6053 13394 8875 9655 4410 18245 21158 5337 -14842 -9994 -743 -3714 -5726
14700 -5726 -2185 4786 12428 7561 7832 13070 19125 10653 -2017 -2189 3810 938 9990 8694 7498
14685 7498 19666 21063 15514 12887 12766 20853 13887 11204 16500 22976 24841 22586 9709 5896
14671 5896 7382 26991 23989 8752 1651 3281 -5270 -4770 -8679 -9402 10 14658 11152 9711
14657I711p359M369L589K326k221l206L769o352j5412j13O304r99L276M943Q885
14642A1510k082j5591l986J6211Q291Q173n875L241N962n605p837n212K528R353
14628A9081J0717l6j2922j731q55j6490L235J0230M260j4691N557J0841n701k664
14614H831J0496q247J6097J1717m251L558n525q74P935J690l685j5276R98J063
14600B4527r28L671j6964N03J1542n323r255L518J859O026j378o804k490j6988
14586h484k561J1281P763N114K197J1896l579L004l228M117R663k0689o170l075
14572G249M290l655m535M229P599q363p929M226p93p236J6177J6908P75J219j595
14557B8566n718Po962j9271j0330J4639J2558J93J184P861k580K810Q527q795
$$ plain form
14657 9711 2352 6721 10310 12636 10415 7209 10978 4626 -10786 -10899 -4595 -5594 -2318 2625 11510
14642 11510 9428 -6163 -10149 6062 14353 22526 16651 19892 25854 20249 12412 7200 9728 19081
14628 19081 29798 29762 16840 15109 14254 -2236 999 11229 15489 798 6355 17196 11495 8831
14614 8831 19327 11080 27177 38894 34643 38201 32676 31802 39737 41427 37742 22466 23464 24527
14600 24527 23599 27270 10306 10809 22351 17028 7773 11291 13150 19176 17798 10994 8504 -8484
14586 -8484 -11045 236 7999 13113 15310 27206 23627 26631 23403 27520 37183 16494 10324 7249
14572 7249 11539 7884 3349 7578 15177 6814 -1115 3111 2318 -4918 11259 28167 28942 30161 28566
14557 28566 22848 22855 15893 -3378 -13708 931 13489 13682 14866 22727 20147 22957 31484 22689
14543B2689j0338p459j168K277O694J0590j549r72m240Q621j1831q687K582n690
14529A519j384J1818K398j2720o10K609j996m392J3166L239n032M797q607k365
14515B440k785q335r607N040J5283J0902k03P288J2548k524O598N207m705j8874
14501A8273j1881L076K255o456j0384j369k053q20R533J2327R929j785o481K902
14487A7066j0083j665J5836j46j2449j03q165j981Q065n661p495J4143l948r217
14473e803l332J501J5679j348L522p460m305O876J1823m470n732n801r602L014
14459e438k114J2907L480m358Q71J2743k740o921r699K62P305l60j7732L24M838
14444f632M780P914L508P774l810j0508j140O304j0400K043J3699L092q660j2010
$$ plain form
14543 22689 12351 4892 3724 6001 12695 23285 21736 20764 16524 25145 13314 4627 7209 1519
14529 1519 135 11953 14351 1631 1021 3630 1634 -2758 10408 13647 8615 13412 4805 2440
14515 2440 -345 -8680 -18287 -13247 2036 12938 12735 20023 32571 30047 36645 41852 37147 18273
14501 18273 6392 9468 11723 5267 -5117 -6486 -8539 -9359 174 12501 22430 20645 14164 17066
14487 17066 6983 5318 21154 21008 8559 8456 291 -1690 6375 714 -6781 7362 3414 -5803
14473 -5803 -9135 -7634 8045 6697 10219 2759 -1546 5330 17153 12683 6951 1150 -8452 -5438
14459 -5438 -7552 5355 8835 4477 5348 18091 15351 8430 -1269 -1007 6298 5938 -11794 -11470 -6632
14444 -6632 -1852 6062 9570 17344 13534 3026 1886 8190 -2210 -167 13532 16624 7964 -4046
14430d046Q560J3297J448n663p704j615O41J1491L204q811o179M795K504Q154
14416B0076j0616n897m957q091n332n947l842N055J7000j3230m554M592R729N35
14402e479m668K0688j817N310N436q989n847n485J4470o776j5820O228L675k103
14388a177J2710N690J86j0088j7782K811L262m653l300k263m037J9537K996k849
14374A043j238j0959j470R641L216q37n568j0648p877k233L562J4427L631J568
14360c742O107l792j706k116K567Q004j781l712J1694O123K12p693N240M754n281
14345A4878n883n773J3306J6802o347q16q255j1151L206q73j3373O552K185L832
14331H290O164J1019K337J172o617k959k856j463K828L32P948O817N98q75j2233
$$ plain form
14430 -4046 4514 17811 19259 13596 5892 4277 4918 16409 19613 10802 4623 9418 11922 20076
14416 20076 9460 3563 -1394 -9485 -14817 -20764 -24606 -19551 -2551 -15781 -20335 -15743 -6014 -5479
14402 -5479 -10147 10541 8724 14034 19470 10481 4634 -851 13619 6843 -8977 -2749 926 -1177
14388 -1177 11533 17223 17409 7321 -10461 -7650 -4388 -9041 -12341 -14604 -18641 896 3892 1043
14374 1043 -195 -11154 -12624 -2983 233 -604 -6172 -16820 -24697 -26930 -23368 -8941 -5310 -3742
14360 -3742 2365 -1427 -3133 -5249 -2682 5322 3541 -171 11523 17646 17858 10165 15405 20159 14878
14345 14878 8995 3222 16528 33330 26983 26167 17912 6761 9967 9094 -4279 2273 4458 8290
14331 8290 14454 25473 27810 28982 22365 19406 16550 15087 17915 18247 26195 33012 33610 32735 20502
14316B0502o795L020k983P132O25q518j4564k431N366k067r106O202j463L609
14302a471Q245O934Q770j0676j7677r069J0256J1687K820K137r596O167Q554r327
14288G754o952j558M845J3700P868l618p507n659M984P225J829k2506j216K574
14274A763Q558O65K624j920j6168J0594J1818N199N596j1551j3694q644K663J0134
14260G637Q524J2077K822m157n055o423l926j278Q197O528O828P929j0418j1007
14246A8278m92l891j101p333N061K8525K3662p363j5767j2797n82j500j1471P253
14232B0482K041p881J1081N752j224m266k64K3506p7l754j4619p429m681L390
14218B2057K219j0929P682Q807o585j1158J847K981o127m292k417m3O637l746
$$ plain form
14316 20502 13707 16727 13744 20876 21501 12983 -1581 -4012 1354 -713 -9819 -3617 -5080 -1471
14302 -1471 6774 13708 22478 11802 -5875 -14944 -4688 6999 9819 11956 2360 8527 17081 7754
14288 7754 802 -756 4089 17789 25657 22039 14532 8873 13857 21082 22911 405 -811 1763
14274 1763 10321 10986 13610 11690 -4478 6116 17934 23133 28729 17178 3484 -5160 -2497 7637
14260 7637 16161 28238 31060 26903 21848 15425 11499 10221 18418 24946 31774 39703 29285 18278
14246 18278 17786 13895 12794 5461 10522 39047 62709 55346 39579 26782 26200 24700 13229 20482
14232 20482 22523 14642 25723 31475 30251 25985 25721 49227 49150 45396 30777 23348 18667 22057
14218 22057 24276 13347 21029 29836 23251 12093 13940 16921 10794 6502 4085 4042 10679 6933
14204F933q269o478P796l649J4687J0693m249j4067n80M319J4675J3230m807N761
14190C5995j0502k4346p052J1126R871m557K864J1940j343Q471R033p810m295
14177B9395J691j1824J368r851l001P708k717J566Q669m261J569J0529l712q874
14163A8255j1543L25K1736O159p942k782P650o749j0103K703K947J549m939j5288
14149A978j5838N3J9579J2740n221N048R014k405l011N52j4911j1747r805L224
14135a0750J0130P594M819J0426m058K337Q219m952r322J4019M802j5611o575
14122A1078O983o544m580J6173K11M382P356j0693L700J784j0757J3541M561k051
14108C5144N437j364l392j175M141L544r18N443j4444j4687O137J6609K316n351
$$ plain form
14204 6933 -1336 -7814 -18 -3667 11020 21713 17464 3397 2817 7136 21811 35041 30234 35995
14190 35995 25493 1147 -5905 5221 15092 10535 13399 25339 23996 32467 41500 33690 29395
14177 29395 31086 19262 20630 10779 7778 15486 12769 14335 23004 18743 20312 30841 27129 18255
14163 18255 6712 7037 28773 34932 26990 24208 31858 25109 15006 17709 20656 22205 17266 1978
14149 1978 -13860 -13807 5772 18512 13291 18339 27353 24948 21937 22489 7578 -4169 -13974 -10750
14135 -10750 -620 6974 11793 22219 18161 20498 28717 23765 14443 28462 33264 17653 11078
14122 11078 18061 11517 6937 23110 23321 27703 35059 24366 28066 29850 19093 32634 37195 35144
14108 35144 40581 39217 35825 34650 38791 42335 41417 46860 32416 17729 23866 40475 42791 37440
14094C7440l349K872K277J858p351n163J0356M106j1231j3743K0073J7434k486
14081E3093q469l357J954j3444R082J2252O48j6555k1797J6069J0385j3874n782
14068B0205J6233J3428M445j4696j2165M348P881N609Q613o448o015o507q848
14055B6083r892r819j5962o261J315j279Q397J5954l76l503k141j318k761m65
14041b028k056m139Q65O219J0830N333L579j4771k708k815K202J1977L476p019
14027H945N775l968m446p130P437j5594K493m113Q432K0539P034j1466j3600n712
14013e374N760R49j328l296j9276P769J6763M172R799P384j0519p528M327J977
13999A1579J912L130j3269q044m715k6255j547K552J1291Q386n683O09J7122M668
$$ plain form
14094 37440 34091 36963 39240 41098 33747 28584 38940 43046 31815 18072 38145 55579 53093
14081 53093 44624 41267 43221 29777 38859 51111 51759 35204 13407 29476 39861 25987 20205
14068 20205 36438 49866 54311 39615 27450 31798 39679 45288 53901 47453 41438 34931 26083
14055 26083 16191 6372 -9590 -15851 -14536 -15815 -7418 8536 8160 4657 2516 1198 -1563 -2028
14041 -2028 -4084 -8223 -7358 -1139 9691 15024 18603 3832 1124 -1691 511 12488 15964 8945
14027 8945 14720 10752 6306 -824 6613 -8981 -6488 -10601 -2169 18370 25404 13938 338 -5374
14013 -5374 386 1335 7 -3289 -22565 -14796 1967 6139 15938 23322 12803 5275 9602 11579
13999 11579 13491 16621 3352 -4692 -9407 -35662 -37209 -34657 -23366 -14980 -20663 -20054 -2932 1736
13985A736P24Q029L961P053O87l478j2825K121P172J6227M770N513j4005k442
13971B5243J196N04P797q576j9319j5151k41J8692J4834j1176j0999r591q358
13958a5145P959P712o946J2033R269J625K787n800r00k318n754O269P180q482
13944I489o544N074k918n645R706J2297j012l330o082m753M94k491J3545M143
13930B1973l454j6414M360J3633l800k976P354O662J583p736N026o275l313N506
13916B2129N186M144N2m034j5842Q668M765n940p42m749j252M027o655L818J2485
13901B6060J1839L203l5l073M798j3311j1513k052N900k290k206p890q637j042
13887b49j4761p146P726J881n94J3357R755k420Q83j032L844P774o6j0627l685
$$ plain form
13985 1736 2460 10489 14450 21503 22190 18712 5887 8008 15180 31407 36177 41690 27685 25243
13971 25243 26439 26943 34740 26164 6845 -8306 -8547 10145 24979 13803 2804 -6787 -15145
13958 -15145 -7186 526 -6420 5613 14882 16507 19294 13494 12594 10276 4522 10791 17971 9489
13944 9489 2945 8019 5101 -544 9162 21459 20447 17117 11035 6282 6776 4285 17830 21973
13930 21973 18519 2105 6465 20098 16298 13322 20676 27338 28921 21185 26211 19936 16623 22129
13916 22129 27315 31459 31511 27477 11635 20303 25068 19128 18386 13637 12385 16412 9757 13575 26060
13901 26060 37899 41102 41067 37994 42792 29481 17968 15916 21816 19526 17320 9430 793 -249
13887 -249 -15010 -22156 -14430 -12549 -13143 214 9969 7549 8432 7400 11244 19018 18952 8325 4640
13872D640J1697O488o741m76j802o922P073N486P467m266p49j1152Q50J0185L735
13857B5513o540p267Q489m900j2427M737R907M768r971Q910M039j467R688Q228
13843D1707Q264J019N957J398j9301k953J3504L681K1560Q545j0188j4173k391
13830E6629Q665O79p823j0555k852n672m409j0719J1134J3360M565J2233o748
13817E8487o326k706J019j402r76k971J398M142J4481N411N156P24Q715L8615
13803A23767M7606O5593Q7683L7270j3959o0963q6245n3044m1484j9145R3n216
13791H1956J5660N949O657J0039R191N698O024J0350M521j0937o086K0260N3531
13778B12813K8128M982k7070j366L0620N5521O2923K1479l0441p0577n4904k0191
$$ plain form
13872 4640 16337 22825 16084 15608 13806 6884 13957 19443 26910 22644 21895 10743 11593 21778 25513
13857 25513 18973 11706 20195 15295 2868 7605 17512 22280 12309 21219 25258 23791 33479 41707
13843 41707 49971 50990 56947 58345 39044 36091 49595 53276 74836 83381 73193 59020 56629
13830 56629 65294 65973 58150 47595 44743 39071 34662 23943 35077 48437 53002 65235 58487
13817 58487 52161 49455 50474 49072 48096 45125 46523 50665 65146 70557 75713 76437 85152 123767
13803 123767 171373 236966 324649 361919 347960 286997 200752 147708 106224 87079 87172 81956
13791 81956 97616 103565 110222 120261 129452 135150 141174 151524 156045 145108 139022 159282 212813
13778 212813 240941 245923 218853 217487 248107 303628 366551 388030 357589 287012 232108 211917
13766B11917M339M356j128l0217l2802j4998k0931o428J7692J3199j9196j2836
13754A12967j0195o627K056p100L473K1756J6228J1446L6793O5254R4955N8303
13742C99309k682n7659p5802p7095m9518k2636j2285j8390o465m171m677J942
13730F9871r425k2957K097O007n856j5447M46o060M376L055l063k355L627Q178
13716C2494J2648J3609R904l524M105K831j4356n080n707o231J893r383j475R325
13702D1053j566p942J24J6855m576j8654j0427o597K133J1091J5268j7827k2135
13689c200j150K723j1352p033o08J5246J3197l908m515J9362J0167l367j0778
13676A4784n103j855m989r010R188N70J831J0619J0655m139r4J149l681q275M823
$$ plain form
13766 211917 216256 220612 219484 189267 156465 141467 120536 114108 131800 144999 125803 112967
13754 112967 102772 96145 98201 91101 94574 116330 132558 144004 180797 246051 341006 399309
13742 399309 396627 338968 263166 186071 136553 113917 101632 83242 76777 72606 67929 69871
13730 69871 60446 37489 39586 45593 39737 24290 24736 18676 23052 26107 23044 20689 24316 32494
13716 32494 45142 58751 68655 65131 69236 72067 57711 52631 46924 40693 42586 33203 31728 41053
13702 41053 39487 31545 31669 48524 43948 25294 14867 8270 10403 21494 36762 18935 -3200
13689 -3200 -4350 -1627 -12979 -20012 -20620 -5374 7823 3915 -600 18762 28929 25562 14784
13676 14784 9681 7826 2837 -6173 3015 3585 5416 16035 26690 22551 22457 23606 19925 11650 16473
13661A6473q573Q034p42O436m917o073K629j814M910N535o637Q951M094O09J5600
13646D4515Q985q067Q408L095o095p145M771J572k3683j280J1429m566j6018j3569
13632B352J1290K6676O820o452p290O907p877j7560o921R735L332O031o048j3002
13618G993M108Q076j938J235J7Q809R515J572R62p328l959l473Q441r87r263O602
13602C0382R332J1348j1788m913O058R715j2599r244J2895J6907J7135J1127O361
13589I2716k398Q105q898l734k0261M65j3313j0662Q92j328M587K084k378j904
13575D3973L311m617o467P96O300J1137R156M752J1345O182k63r432l433K831
13561G5571J4322J8861j144k6129m479M212n069j1312o354R189o177r845j2361
$$ plain form
13661 16473 7900 15934 15192 21628 16711 10638 13267 11453 16363 21898 15261 24212 28306 28915 44515
13646 44515 53500 45433 53841 56936 50841 43696 48467 50039 26356 25076 36505 31939 15921 2352
13632 2352 13642 40318 47138 40686 33396 40303 32426 14866 7945 17680 21012 27043 20995 7993
13618 7993 12101 20177 18239 19474 19491 28300 37815 39387 40349 33021 29062 25589 34030 33043 23780 30382
13602 30382 39714 51062 39274 34361 40419 50134 37535 28291 41186 58093 75228 86355 92716
13589 92716 90318 98423 89525 85791 65530 65995 52682 42020 42912 41584 46171 48255 45877 43973
13575 43973 47284 42667 36200 36996 43296 54433 63589 68341 79686 85868 85605 76173 72740 75571
13561 75571 89893 108754 107610 81481 77002 81214 76145 64833 58479 67668 61491 51646 39285
13548C9285k05O250J1838Q834l059R495p98J264k305r690n214K6042J3401k491
13534I2647j7244k326J8273K7133L631j287j9890Q54R56m005k0046K565J287j4347
13520F8201n052L60j193n440m613k695Q109K34k2188Q298J9408o373j5248p972
13506C3836p844j2111j274Q215j654Q303J1106l971O710J519K513k1556l263R698
13492C0227N001J3573N576N974l607n057m291k500O137J1114L211J8515r202k448
13478G2223J194N352p877Q511J1518q804l871K951K1621K1621K1970R956J1249
13465A67614J1766p457r60j0138l8735l1603p419J1300K6317K4350L1694O0477
13453B37206L3114j6206k6971k6831k3641k5747q246q992N421K4434K1990n3j238
$$ plain form
13548 39285 39080 45330 57168 66002 62943 72438 71640 72904 70599 60909 55695 81737 95138 92647
13534 92647 75403 73077 91350 118483 122114 120827 100937 101791 102747 98742 78696 81261 82548 68201
13520 68201 63149 63509 62316 56876 52263 49568 57677 57911 35723 44021 63429 57056 41808 33836
13506 33836 25992 13881 12607 20822 19168 27471 38577 34606 41316 42835 45348 23792 20529 30227
13492 30227 35228 48801 54377 60351 56744 51687 47396 44896 51033 62147 65358 83873 74671 72223
13478 72223 73417 78769 70892 79403 90921 82117 78246 81197 102818 124439 146409 156365 167614
13465 167614 179380 171923 170963 160825 122090 90487 83068 94368 120685 145035 176729 237206
13453 237206 270320 254114 227143 200312 176671 150924 142678 133686 139107 163541 185531 185478 184240
13440A84240p662j6720j2150O680K2919R913j425l2584k2704k2157R647J0349
13428A28346J3262J0270L543j3831N749l104J90J3428n915j693j536L630K2146
13415A74485K2707K9847J4491Q875J2245J8927K1473p786q462M374k5865l8878
13403B26433m3587k8414l978k300l775J0007R767R705J135M775J4040O331K045
13390B02184N581M092K790L861J0261J7900J7101J1837K5204Q566O175J1923j045
13377C26430M418K4637L4457K2224J3176K7921K0518K618N651L5427O0875N2219
13365F30571M5157L7509M1874M4354M7561N8898Q5600Q4484Q6269J08604J25013
13354A395894J48503J80241K11094K51674L17869L74868M10210M18984M85975
$$ plain form
13440 184240 176578 159858 147708 154388 177307 187220 185795 153211 130507 108350 117997 128346
13428 128346 141608 151878 155421 141590 147339 144235 144425 157853 151938 150245 148709 152339 174485
13415 174485 197192 227039 241530 250405 262650 281577 303050 295264 286802 291176 265311 226433
13403 226433 182846 154432 150454 148154 144379 154386 164153 173858 174993 179768 193808 200139 202184
13390 202184 207765 211857 214647 218508 228769 246669 263770 275607 300811 309377 315552 327475 326430
13377 326430 330848 355485 389942 412166 425342 453263 473781 476399 482050 517477 578352 630571
13365 630571 675728 713237 755111 799465 847026 905924 991524 1076008 1162277 1270881 1395894
13354 1395894 1544397 1724638 1935732 2187406 2505275 2880143 3290353 3709337 4195312
13345D195312O14128Q59656J265976J826697K716397M125351O481882J0197408
13337C2282807J4661936J6036727P932558o733631j5003075j4162928r914423
13330B5099971o143053l611983k014327r25746r3293M99155J144864K173096L127765
13321A9256449K289280n94698k100194j233812Q38489L466819O452244Q399680
13313C6774257N695201j26602j166642L048748Q789688J1919686Q440233q83131
13305G2491438r817756j2676446r758546m619994N53937L875330J708280m768071
13297C6988172p620100o095752l343903q50498J215721K164421M22770k535395
13289B0345436l428728k595898j329281k03465P91976J878140L338644N578658
$$ plain form
13345 4195312 4809440 5669096 6935072 8761769 11478166 15603517 22085399 32282807
13337 32282807 46944743 62981470 70914028 64180397 49177322 35014394 25099971
13330 25099971 18956918 15344935 13330608 12404862 12311569 12810724 13955588 16128684 19256449
13321 19256449 21545729 20951031 18850837 17617025 18455514 21922333 28374577 36774257
13313 36774257 42469458 42342856 41176214 44224962 53014650 64934336 73374569 72491438
13305 72491438 62673682 49997236 40238690 35618696 36172633 40047963 41756243 36988172
13297 36988172 29368072 23272320 19928417 19077919 20293640 22458061 22880831 20345436
13289 20345436 16916708 14320810 12991529 12788064 13580040 15458180 18796824 24375482
13281B4375482R054711J3677033J7121110J2773328k229707j5233699j7265603
13274D2272655j3044275q376066n166355l218026k026374j281456r40914r32725
13266G286464r61159q59133p48159o64444n48762m38300l29970k67519k05739
13257B263279j63033j60626j50315j32249j23319j07695q6148r3086q0247p7224
13247A089337n1922m1749l7002j6801o267j9864l9115l0941j4992k5711k6334
13236G78639l0463o0156m6738m2736k5793j9082j6943j6045j4299k8549k7912
13225D49923n493K625O760j5998j7912j0069o438r872j500J7331J6092o921k6013
13212C92515p232r785l0727k0003k1472k6262k9475j7837k1960J122K1983J8851
$$ plain form
13281 24375482 33430193 47107226 64228336 77001664 74771957 59538258 42272655
13274 42272655 29228380 20852314 15685959 12467933 10441559 9160103 8219189 7286464
13266 7286464 6325305 5466172 4718013 4053569 3504807 3066507 2736537 2469018 2263279
13257 2263279 2100246 1939620 1789305 1657056 1533737 1426042 1339894 1246808 1166561 1089337
13247 1089337 1037415 995666 958664 941863 935596 915732 876617 845676 830684 804973 778639
13236 778639 748176 688020 641282 598546 572753 553671 536728 520683 506384 477835 449923
13225 449923 444430 447055 453815 437817 419905 409836 403398 393526 392026 409357 425449 418528 392515
13212 392515 385283 375498 344771 324768 303296 277034 247559 229722 207762 208884 230867 249718
13200B49718q73O739N185j615J9292P67q747k8863l997J833m135N572J7771J902
13186B60549r227k511q037j1636J189j4959k1839r078j3382j7504K059J786N733
13173A63143j141k0439k6725n710K3374J0528J5053J5268J5415O547L2408P2249
13161B99970P4761L3578l6124n8692l4581j2109Q185J3566m85k8299m0179m0752
13149A78839m1898k3181k1422j3429j157J7223r608J0419J3304O75J5301J9083
13137A44149p126j0184N020j999j0572p244l822M00K458M404J2493J5627J1774
13124A55378K1070J8321J4264J6134m337m431j7850j6081r959k2043k4825j1445
13112A14196m370N815J2128J661l313k56N443K361j759j8076j3481N51P448j2630
$$ plain form
13200 249718 248845 255584 260769 259154 278446 279213 270466 241603 237606 239439 235304 240876 258647 260549
13186 260549 251322 248811 240774 229138 230327 215368 193529 184451 171069 153565 155624 157410 163143
13173 163143 162002 141563 114838 109128 132502 143030 158083 173351 188766 195313 227721 299970
13161 299970 374731 408309 372185 313493 278912 266803 274988 288554 288069 259770 219591 178839
13149 178839 136941 113760 92338 78909 77752 94975 85367 95786 109090 109765 125066 144149
13137 144149 137023 126839 131859 129860 119288 112044 108222 108622 111080 115484 127977 143604 155378
13124 155378 176448 194769 209033 225167 220830 216399 198549 182468 172509 150466 125641 114196
13112 114196 109826 115641 127769 129430 126117 125861 131304 133665 131906 113830 100349 100900 108348 95718
13098I5718r133K198K865J1391Q683Q65J5378K882M641Q791O326q727k788k518
13084A36572j6260r048k504j0796k134n136j0849l132J9268N241n777P56j3254
13071H2947N670q366L358p99p438K537o888q892N307l88n190M096L226m610K905
13056F7475j404o890Q105m208r828k975M098N972o768J8252N378Q76j477j1314
13042F5292j740N449J7o054L535r382J499j403m4o070p808P11o588J0420J991
13027D9825j6347P061J8468J8638L651K0997L975q77Q129l69k377m931j108j1598
13013I3137n122j7147j4761k957m692k372j78R60j803n400j1163k136L536J942
12999C1844O146J0186M472J7361J0609M520J0597J0253k742j3839O457n58r801
$$ plain form
13098 95718 86585 88783 91648 103039 111722 112587 127965 130847 135488 144279 150605 141878 139090 136572
13084 136572 120312 111264 108760 97964 95830 90694 79845 76713 95981 101222 95445 96201 82947
13071 82947 88617 80251 83609 82810 75372 77909 71021 62129 67436 67048 61858 65954 69180 64570 67475
13056 67475 66071 59181 67286 63078 53250 50275 54373 60345 53577 71829 77207 78083 76606 65292
13042 65292 63552 69001 69018 62964 66499 57117 58616 57213 57169 51099 43291 44002 37414 47834 49825
13027 49825 33478 40539 59007 77645 81296 102293 106268 105391 113520 113151 110774 105843 104735 93137
13013 93137 88015 70868 56107 53150 48458 46086 45908 46868 45065 39665 28502 26366 29902 31844
12999 31844 37990 48176 52648 70009 80618 85138 95735 105988 103246 89407 95864 95306 85505
12986H5505k030J0463J8888K750l429l215o48J3515L337r876j8913j7127n5J1227
12972I0392J6485p90j3092p008j0250r565R903r862j3344K3370P692n932p475
12959G0524q021N041n286K007n385M502N261J6930K3176L1153K0428J6101o310
12946A70121N433j64r473J3730J14L027R984K53j3422l3806k7803j8816j1858
12933H7320j9759j2065o520O711o452M581K3392R961m926j5132K46O946L1779
12920A06082Q394Q420K2842J1534Q151l067j343j012J0771R293q43j6674k8699
12907A33849k5676j0358r655j1005j8361o503Q664r974r639R770M589j0540j6794
12894B8367K71q296m17M396k7J2935J7157O338j158q264Q953J7427R915N105L611
$$ plain form
12986 85505 83475 93938 112826 115576 112147 108932 108284 121799 125136 115260 96347 79220 79165 90392
12972 90392 106877 106087 92995 85987 75737 66172 76075 66213 52869 76239 83931 77999 70524
12959 70524 62503 67544 62258 64265 58880 63382 68643 85573 108749 139902 160330 176431 170121
12946 170121 175554 175390 165917 179647 179761 182788 192772 193025 179603 145797 117994 99178 87320
12933 87320 67561 55496 48976 55687 49235 53816 77208 87169 82243 67111 67357 74303 106082
12920 106082 114476 122896 145738 157272 165423 162356 161013 160001 170772 180065 179222 162548 133849
12907 133849 108173 97815 88160 77155 58794 52291 60955 50981 41342 51112 55701 45161 28367
12894 28367 28638 20342 19925 24321 24294 37229 54386 60724 59566 51302 60255 77682 87597 92702 96313
12879I6313J7318J3156P616L169Q260O960P405Q695R12J8232M4210M7336O1418
12866C41000R4168J22859J52185J57792J05737M8844N7465M7698K2663m2138j00335
12855A007938j05518j05010j38744j32263r1284n3520l2574l0589m2919k6010
12845B49507r689o004J9727L4850M0710R763M02J3179M9656M8156J6707m7031
12833D19933n7810n4113m0122j8839J6145J2522L749l2430m6056l0983q913P900
12821A70983R195l158k5392j2571L55r090N03J1968J5779R527K3309L5794M1674
12808B68876N7127Q3197O5901n531o5097q7795p4059l5185k1566p753j358l500
12796A73257j1689j4753l1438k1822k0323j0381J4584L806n98J5065j198q525
$$ plain form
12879 96313 113631 126787 134403 137572 145832 152792 160197 168892 169804 188036 232246 279582 341000
12866 341000 435168 558027 710212 868004 973741 1022585 1080050 1127748 1150411 1108273 1007938
12855 1007938 902420 797410 658666 526403 435119 381599 349025 318436 275517 249507
12845 249507 239818 233814 253541 288391 329101 338864 339266 352445 402101 450257 466964 419933
12833 419933 362123 308010 267888 249049 265194 277716 281465 249035 202979 171996 163083 170983
12821 170983 180178 177020 151628 139057 139412 130322 130825 142793 158572 168099 191408 227202 268876
12808 268876 326003 409200 475101 469570 404473 316678 242619 207434 185868 178115 176757 173257
12796 173257 161568 146815 115377 93555 73232 62851 77435 81241 80643 95708 94510 85985
12784H5985k210N950L057K0951J0327O670J8522K1129q901k2740j1652k7411j4876
12771H4801j7668k1262j1358Q197J4178J0370p987l117Q861L426J3718J2976j291
12758I3844j3555p374J1135j4712q038J2920L0340J5892K1304K7743K3625K1966
12746B15090L5802K7934L622r43k526p504k5146k3670l2842k2375n055j4937q037
12733A39413J006j6474J186K797J0905K4730K9520K3244q640k4063k7595j2160
12721A43869p242k0910j1453L300o952q489J4424J7173K180M966N743M701J3318
12708A54628K1281J6146J8834J3691q195k0417l3273j8114j0574k2670N171J6210
12696A32718R953P767N640j434J5785L5246L0327J5048Q142L549o326l7336k3126
$$ plain form
12784 85985 83775 89725 92782 113733 124060 130730 149252 170381 161480 138740 127088 99677 84801
12771 84801 67133 45871 34513 42710 56888 67258 59271 56154 65015 68441 82159 95135 93844
12758 93844 80289 72915 84050 69338 61300 74220 104560 120452 141756 169499 193124 215090
12746 215090 250892 278826 282448 281505 278979 271475 246329 222659 189817 167442 162387 147450 139413
12733 139413 140419 123945 125131 127928 138833 163563 193083 216327 207687 183624 156029 143869
12721 143869 136627 115717 104264 107564 100612 92123 106547 123720 125900 130866 136609 141310 154628
12708 154628 175909 192055 210889 224580 216385 195968 162695 144581 134007 111337 116508 132718
12696 132718 142671 150438 156078 154644 170429 205675 236002 251050 259192 262741 256415 219079 195953
12683A95953j7627k7668j9541j1162K75J867j0404j1347l653J0783O594L286j3739
12670A03617j3124L133L840p578L514K3113J3160J5401L058P907J1731j7164k0152
12657A30456N266m923l340O382J0500P614m6j5520j5107j4445j0702o254J0913
12644A00794Q959M490J0028J3724l690j407j0474j1935k3876j6673K1604j478
12632I0066O816J5867p596j3314j2644r643j0593j7879L547n014R452o870j794
12619D0401K2005J0580L1782O869j6482p067K083j1089m435J0477L834Q835J6428
12606A14221J0300L805K974m977O501J777K315K09k538L755l526l846L276M264
12592A38510k13p751K2939K1281r832K762M270O88n750o537L164R165n333J2670
$$ plain form
12683 195953 178326 150658 131117 119955 120230 122097 111693 100346 96693 107476 114070 117356 103617
12670 103617 90493 93626 97466 89888 93402 116515 129675 145076 148134 156041 167772 150608 130456
12657 130456 135722 130799 127459 133841 144341 151955 151909 136389 121282 106837 96135 89881 100794
12644 100794 109753 114243 124271 137995 134305 132898 122424 110489 86613 69940 91544 90066
12632 90066 96882 112749 105153 91839 79195 69552 58959 41080 44627 39613 49065 42195 40401
12619 40401 62406 72986 104768 111637 95155 88088 90171 79082 74647 85124 88958 97793 114221
12606 114221 124521 128326 131300 126323 132824 134601 136916 137125 134587 138342 134816 130970 134246 138510
12592 138510 138297 130546 153485 174766 164934 167696 171966 172654 166904 160367 163531 172696 167363 180033
12578A80033Q073Q253O198Q839J0249J2497J3284J2156J9172L2715K3720K4417
12566C59606L2615K3237j5164l2611l2624m8739n9821o1274n6472n6425l3118
12555A9210k4678o791P446K1372K7604R751n545K19j271Q980J5428J7321J627
12542I0673J1720J0615Q511O230l394L053J3449J584L489j779m492J3712J2898
12529A66269K239j185j9087k865L770Q601J0113j413J1456J3166m515J444J552
12516A89545R658J9667J0943K51P036K5028J6582J1297J2402j902Q249K6788K4914
12503C60458J6200J6445J9523K620O587J4182J2066j157r486J1869K7456K6137
12491E02900J2963J6793K5656J6420K6519J8054R943O376J0866K2488J6953K4702
$$ plain form
12578 180033 188106 196359 202557 211396 221645 234142 247426 259582 278754 311469 335189 359606
12566 359606 392221 415458 400294 367683 335059 286320 226499 165225 108753 52328 19210
12555 19210 -5468 -12259 -4813 16559 44163 53914 48369 48588 47317 56297 71725 89046 90673
12542 90673 102393 113008 121519 127749 124355 127408 140857 142441 145930 144151 139659 153371 166269
12529 166269 168508 167323 148236 145371 149141 157742 167855 166442 177898 191064 186549 187993 189545
12516 189545 199203 218870 229813 230064 237100 262128 278710 290007 302409 300507 308756 335544 360458
12503 360458 376658 393103 412626 415246 421833 436015 448081 446924 437438 449307 476763 502900
12491 502900 515863 532656 558312 574732 601251 619305 629248 635624 646490 668978 685931 710633
12479G10633M9135M9434L1387N0284N5863O7004O0949P2848P6002P4524Q1532
12468A379595R5366J14998J17285J35882J62698J96523K59309L15548L50754L55691
12458C483649L34810L62899M22165N17652O63021P95087Q70849R38679R85742
12449I374553J073382J191531J366766J647353K180647L084651M534598O934339
12441C1387820J0783218J6493546K3455410K8043248K5347660J9679512J8337126
12434A73527540J3918936j59666j3912044j7898286j9480994k5207518k7567160
12427H3220808k3108035j6248269j0659771o947518m646605l252655k340396j740105
12419A4277454j366457j187960j126589j072735j020006r95424r43977q39467
$$ plain form
12479 710633 759768 809202 840589 890873 946736 1013740 1074689 1147537 1223539 1298063 1379595
12468 1379595 1474961 1589959 1707244 1843126 2005824 2202347 2461656 2777204 3127958 3483649
12458 3483649 3818459 4181358 4603523 5121175 5784196 6579283 7450132 8388811 9374553
12449 9374553 10447935 11639466 13006232 14653585 16834232 19918883 24453481 31387820
12441 31387820 42171038 58664584 82119994 110163242 135510902 155190414 173527540
12434 173527540 187446476 187286810 173374766 155476480 135995486 110787968 83220808
12427 83220808 60112773 43864504 33204733 26257215 21610610 18357955 16017559 14277454
12419 14277454 12910997 11723037 10596448 9523713 8503707 7508283 6564306 5724839
12411E724839o94356n48382m33576l42671k79154k38248j89665j53382j22851
12402B722554j12551j38125j84724j86238j63778j30835q3301m8379j9090m8292
12392A607241r1021r3613o9019n8904o0591n1567n1038l9865l6251m1865l2659
12381I80848j3517k3205k1298o084O982J3788K3041L6794L7697M5699N7567M9276
12369A187588L5428j719k9390n3601q4411q7813p5694m0250l9906o0260n2134
12358F97838l7557k6909r019n623j8609k9586k8151j4363j1587m645n070l834
12346E02885j4780j6900j9918j1067j7984j2421j0198j0119j3168j3326n025J751
12334C59730j341J6329J2324J4668L4576M7942N8756L7902j9959n5979m0262l1017
$$ plain form
12411 5724839 5030483 4482101 4048525 3705854 3426700 3188452 2998787 2845405 2722554
12402 2722554 2610003 2471878 2287154 2100916 1937138 1806303 1723002 1674623 1655533 1607241
12392 1607241 1516220 1422607 1353588 1294684 1234093 1182526 1131488 1091623 1055372 1013507 980848
12381 980848 967331 944126 922828 916744 923726 937514 960555 997349 1035046 1080745 1138312 1187588
12369 1187588 1223016 1221297 1191907 1138306 1053895 966082 890388 850138 810232 749972 697838
12358 697838 660281 633372 624353 618730 600121 570535 542384 528021 516434 511789 506719 502885
12346 502885 488105 471205 451287 440220 422236 409815 399617 389498 376330 363004 357979 359730
12334 359730 358389 374718 387042 401710 436286 484228 542984 580886 560927 504948 464686 433669
12322D33669l4794l362P257n648J645J1971J3648L149J7848R429o81j5382k4035
12309D14714k7893l7522k8333m0859n0603l4214k3709k1827q030Q23j63J2610
12297A54994N402L233J707Q506n376j419p48o425R77j4399r532j0673r164M970
12283A22053K1378J3176J4972J9674Q996K7726K1989L890j1267j8685j2256k024
12271B09622J127j6873j205o337p025j1467n459L620K597J9785J4530l412P688
12258B07191J7533M4164K5942J6068Q583K6110N1383O4346P2022P0898Q3132P0358
12246G57730N1931N7692M0712k6728o8282p9877q0618r8686q9308p2713m8292
12235C43561l0320j2412j630k3791k8302n023J2932J7297n14M29k545J1196J7067
$$ plain form
12322 433669 398875 395513 402770 397122 398767 410738 424386 427535 445383 454812 454131 438749 414714
12309 414714 386821 349299 320966 280107 229504 195290 171581 149754 141724 142547 142384 154994
12297 154994 160396 163629 165336 173842 168466 167047 166299 159874 160851 146452 136920 126247 117083 122053
12283 122053 143431 156607 171579 191253 200249 227975 249964 253854 242587 223902 211646 209622
12271 209622 210749 193876 192671 186334 179309 167842 162383 166003 168600 188385 202915 199503 207191
12258 207191 224724 268888 294830 310898 319481 345591 396974 461320 533342 604240 687372 757730
12246 757730 809661 867353 908065 881337 813055 733178 652560 553874 464566 391853 343561
12235 343561 313241 300829 299199 275408 247106 242083 255015 272312 271798 272227 269682 280878 297945
12222B97945K3593K5594N164l466k1102m4503m3669k0926j7147r141j1337K130
12210A83135P241m0R38K2604K4236Q588k1096k6059r24L030R799K069p75J9534
12196B32280O755J240o292K93Q657J2415j2897o622m367N402J6585N09L252m02
12182B56808Q047O363K300J0419J0694O77M80n064k3071k1383k2242J476J7140
12169B42644M496j4432R170K512o906j4987J4950P505p858j6804k999O154M324
12156B27769J9002J5059J5301K0829j323j6122j4997l15n382N675N67J5687L4532
12143C16282O0124N0205k7290o4784n5073m2516j7576j0806n289R98j1739j603
12131A90933o47p726n847K0456K206l627P965p88j1172j7127j2685j946L536P366
$$ plain form
12222 297945 321538 347132 352296 348830 327728 283225 239556 218630 201483 192342 181005 183135
12210 183135 190376 190336 191274 213878 238114 246702 225606 199547 198623 201653 211452 213521 212746 232280
12196 232280 239035 240275 233983 234276 242933 255348 242451 235829 231462 236864 253449 253958 257210 256808
12182 256808 264855 271218 273518 283937 294631 295308 295788 290724 267653 246270 224028 225504 242644
12169 242644 247140 232708 241878 244390 237484 222497 237447 244952 237094 220290 217291 223445 227769
12156 227769 246771 261830 277131 297960 296637 280515 265518 265203 259821 265496 266063 281750 316282
12143 316282 376406 426611 399321 334537 279464 236948 219372 208566 203277 204275 192536 190933
12131 190933 190286 182560 176713 197169 199375 195748 203713 202925 191753 174626 161941 159995 163531 170897
12117A70897N60p603j1736j6793l554R426Q518l05Q428p009j2976j9198j2276
12104A06379J2431R284J9827K8509K0210J4303K5378J9928j660j5627j9869m2862
12092A76231k1641j6206R162O675M307J3823K0000P7J6376N556J4112J9832O76
12079B48980N467J212J2633J9758M556O786J0412J8596J9426J765P424J7468K4531
12066C99014K2355K2398K2278K1313L1968L3929Q628L0099N3702O1307O9377M3447
12054H19815p467J0414L566K8044O1241P4597O0418P8747R1213J16261J59803
12043A496652J76143J81353K10295K57872L37186M29393N59523P24919Q75226
12034E248562R74768J139987J573474K391911L760645N962313R452538J4201301
$$ plain form
12117 170897 171457 163854 152118 135325 131771 141197 149715 149410 157838 150829 137853 118655 106379
12104 106379 118810 128094 147921 176430 196640 210943 236321 256249 254589 238962 219093 176231
12092 176231 154590 138384 147546 154221 158528 172351 192351 192428 208804 214360 228472 248304 248980
12079 248980 254447 255659 268292 288050 292606 299392 309804 328400 347826 349591 357015 374483 399014
12066 399014 421369 443767 466045 487358 519326 553255 561883 591982 645684 706991 776368 819815
12054 819815 812348 822762 826328 854372 915613 990210 1050628 1129375 1220588 1336849 1496652
12043 1496652 1672795 1854148 2064443 2322315 2659501 3088894 3648417 4373336 5248562
12034 5248562 6223330 7363317 8936791 11328702 15089347 21051660 30504198 44705499
12026D4705499J7831452J3671439j343921j4556000j6759123j2664709q101290
12019B2783347n000428l073059j735760o59502L03330J356540K570298L425705
12011A9970471K213315r38189k222894r42259J379374M028013O609731P306847
12003C7404409L093944k443220k917457P91574N926388J0746896J2658112Q240778
11995G3501424j175384r550664j1609949p895940k377329J246163o36614n933864
11987C5567843p699786n774851k982886n70598J358620J824583n10578l104970
11979A8107377l243323k088134r60649j70073N60560J486329K744880M542432
11971B0979399P144905J0768360J4503875J4001028L821662j0178561j6049249
$$ plain form
12026 44705499 62536951 76208390 74864469 60308469 43549346 30884637 22783347
12019 22783347 17782919 14709860 12974100 12314598 12617928 13974468 16544766 19970471
12011 19970471 22183786 21245597 19022703 18080444 19459818 23487831 30097562 37404409
12003 37404409 40498353 38055133 35137676 35929250 41855638 52602534 65260646 73501424
11995 73501424 72326040 62775376 51165427 43269487 40892158 42138321 41501707 35567843
11987 35567843 27868057 22093206 19110320 18539722 19898342 21722925 21212347 18107377
11979 18107377 14864054 12775920 11815271 11645198 12205758 13692087 16436967 20979399
11971 20979399 28124304 38892664 53396539 67397567 71219229 61040668 44991419
11964D4991419j3795862r344249n895920l781239k479516j640062j115907q36472
11956F102192p57441p14527o14391m66279l18669k12857j82548j96344k15925
11947B423211j75933p7299J8739Q1741J09482L1980j09655k17354k25607j68184
11937A691121q5038k0526k9025j09043j56308j17571p3725j7922K9298L5660N627
11926A152548j9752K4344J13724K27151M19533O96972O98932K5073n87256n64647
11916B186622k68572q799L1203j01972k46600l02663k42691j68630j15483q4112
11906F78303m6499l3233l3231k3658l5717l1851k3766j9219k6833k3815j4536
11895C65945k9221k3678l483L593j2721J185K939P221J652k2480J953J4197P12
$$ plain form
11964 44991419 31195557 21851308 15955388 12174149 9694633 8054571 6938664 6102192
11956 6102192 5344751 4630224 4015833 3549554 3230885 3018028 2835480 2639136 2423211
11947 2423211 2247278 2169979 2188718 2270459 2379941 2411921 2302266 2084912 1859305 1691121
11937 1691121 1606083 1585557 1556532 1447489 1291181 1173610 1099885 1081963 1111261 1146921 1152548
11926 1152548 1132796 1157140 1270864 1498015 1917548 2614520 3313452 3338525 2751269 2186622
11916 2186622 1918050 1909251 1940454 1838482 1591882 1289219 1046528 877898 762415 678303
11906 678303 631804 598571 565340 541682 505965 474114 450348 431129 404296 380481 365945
11895 365945 336724 313046 309563 313156 300435 301620 304559 311780 313432 290952 292905 307102 307814
11882C07814j1918j4575N422Q376K50J4234n966j7233j627R333M631J3745j710
11869C10776k4020j8661q549m285k1346k0198j7137o413l275n393J337J622j744
11856A82714L777L576J6961K4088K6881M0419K7399j2291k5394k1167k9332k5083
11844B12548j3924K858n498j2748k4766l0068j2436o260r590j0114R467p340k776
11831H9353K6239K6768Q961j2919j2303q708K452P772J5940m044k4359q170l418
11818A03564j2060n047j4978K257m28J6481J4735N84n021N884r111m303j1805
11805H0752n327Q689K0495Q437m800L232J5558J4923K780k727j5469j1856j2885
11792A01802N389J2126O14q050M934l15L408m219j0362J8224K7893J4098l255
$$ plain form
11882 307814 295896 281321 286743 295119 295369 309603 303637 286404 284777 294110 298741 312486 310776
11869 310776 286756 268095 259546 255261 233915 213717 196580 190167 186892 181499 182836 184458 182714
11856 182714 186491 190067 207028 231116 257997 298416 325815 313524 288130 266963 237631 212548
11844 212548 198624 201482 195984 183236 158470 128402 115966 109706 100116 90002 99469 92129 89353
11831 89353 115592 142360 151321 138402 126099 117391 119843 127615 143555 139511 115152 106982 103564
11818 103564 91504 86457 71479 73736 73308 89789 104524 105108 100087 105971 96860 92557 80752
11805 80752 75425 84114 104609 113046 108246 111478 127036 141959 144739 142012 126543 114687 101802
11792 101802 107191 119317 119931 111881 116815 116500 119908 115689 105327 123551 151444 165542 162287
11779A62287l512q817j537K4127J3533N495J0000N612K13L285j3355k2719j4080
11766A60532j0921m334R39P051n491n433J3073J1325N868j1173K681J3275N875
11753A83267L695k309P184O503J1981L2512N0744N0048N9675P9166Q5510K1812
11741E89788o9544j19041p7622m0785l2701j8823j4535k9648l2485j7816j2832
11730A23956p564n981J295p687L384k5361k458J0111P704J8025J8541n313l046
11717A25606K0545Q455r434j8119j8483n017L848J5631r64o453j8898j7271L950
11704H3396j1262M10J0727J3710K0904J1929L576j1103m730k206J6812q847l1605
11691I1711j8320k8246l7958l7533j5132m137k247R810J5877L1821M1634K1072
$$ plain form
11779 162287 158775 149958 148421 172548 186081 191576 201576 207188 207401 210686 197331 174612 160532
11766 160532 149611 145277 146216 153267 147776 142343 155416 166741 172609 161436 164117 177392 183267
11753 183267 186962 184653 191837 198340 210321 242833 293577 343625 403300 482466 567976 589788
11741 589788 520244 401203 323581 282796 250095 231272 216737 187089 154604 136788 123956
11730 123956 116392 110411 111706 104019 107403 82042 79584 89695 97399 115424 133965 128652 125606
11717 125606 146151 154606 145172 127053 108570 103553 107401 123032 122068 115615 96717 79446 83396
11704 83396 72134 72544 83271 96981 117885 129814 133390 122287 117557 115351 132163 123316 91711
11691 91711 73391 45145 7187 -30346 -45478 -49615 -51862 -42052 -26175 5646 47280 68352
11679F8352j7774j5323j8254j2963J5315K2279M266J5195J3839P297J5043m162
11667I3110q363K5169L3483J6521P130j2719j6894J362o132j659K440l333N054
11654A35169J3746k083j7228q211J374l696j961j567o560K8042L9688N8068N6183
11641B90964Q304P601n345j9802q040J3230M385j3526q656j0745Q832J497J334
11628B70033J0179K1564K2590L6537N0676O4801M7588O4532Q7208J04729M4544
11617H24981j21167k91927l04418j57824m5039J2936J6796n59N813R640L0864
11606a9904K7365J8794o507j1525j2710J5264K8687J2502J4069Q342M067N042
11594H3486K0341K4275K4845R453J8805J1275M2100O4773O8902P1871M8826k2683
$$ plain form
11679 68352 50578 35255 17001 4038 19353 41632 45898 61093 74932 82229 97272 93110
11667 93110 84747 109916 143399 159920 167050 154331 137437 138799 132667 131008 133448 130115 135169
11654 135169 148915 146832 129604 121393 122767 119071 117110 115543 108983 137025 176713 234781 290964
11641 290964 299268 306869 301524 281722 273682 286912 291297 277771 269115 258370 267202 268699 270033
11628 270033 280212 301776 324366 360903 411579 476380 523968 588500 675708 780437 824981
11617 824981 703814 411887 107469 -50355 -95394 -82458 -65662 -66221 -60408 -50768 -19904
11606 -19904 7461 26255 19748 8223 -4487 10777 39464 51966 66035 74377 78444 83486
11594 83486 103827 128102 152947 162400 181205 192480 234580 299353 368255 440126 488952 466269
11582D66269p9826o2408m0430l3062M73J8025Q751j7050j8952p225R172M0299
11570B84036K3509J1678K4479K8418L6605L6817N8539N9247K6078p49l901K7143
11558F11899O1595Q5351O8958J7974j2921m0105l8573k2199p074K0681J2820j5426
11546G42980k8055k4692j2473L121L0832M3807M5901K9001R533J0172K1044M3579
11534I14750M3334K8465N7562R1875J30587J48031J67367J59308P3749j7778n1333
11523A745917p474O7394J14201J27277J38700J43223J21288J75745K68116L45130
11513C239517M11713N00911O70649P45735N41058M47205N80537Q30560J159490
11504I127375J561729K093688K719701L129259L355781L867445M524549O390896
$$ plain form
11582 466269 386443 324035 283605 250543 251016 269041 277792 260742 241790 234565 243737 284036
11570 284036 307545 319223 343702 372120 408725 445542 504081 563328 589406 588657 584756 611899
11558 611899 673494 758845 827803 845777 832856 792751 754178 731979 724905 745586 758406 742980
11546 742980 714925 690233 677760 680881 711713 755520 801421 830422 839955 850127 871171 914750
11534 914750 958084 986549 1044111 1135986 1266573 1414604 1581971 1741279 1815028 1797250 1745917
11523 1745917 1738443 1805837 1920038 2047315 2186015 2329238 2450526 2626271 2894387 3239517
11513 3239517 3651230 4152141 4822790 5568525 6109583 6556788 7137325 7967885 9127375
11504 9127375 10689104 12782792 15502493 18631752 21987533 25854978 30379527 36770423
11496C6770423J0307914J7104535K9358851N1737467Q8848241J34643270J37210945
11489E05981646R500223j24917525j38247964r4770570n4197350l0778086j8278112
11482E4292262j1327362p371257n234366m413619l672951l157561k988931k633239
11474A3492976k078206j563241j182418q83155p24664n88353m88852m59987m52890
11465E071210m00507l30944l03829k90369k75993k18414j70377j48277j47270
11456B785230j51658j61848j62330j13309k9374K297K875J8451O7403J25814K22334
11445B605885M53972Q74771J564164K307532J954719l28287k219810k255507j492798
11436C464641q41953m81275k93144k04969j37950j04471j10112j17552j17583
$$ plain form
11496 36770423 47078337 64182872 93541723 145279190 234127431 368770701 505981646
11489 505981646 515481869 390564344 252316380 157545810 103348460 72570374 54292262
11482 54292262 42964900 35593643 30359277 25945658 22272707 19115146 16126215 13492976
11474 13492976 11414770 9851529 8669111 7785956 7061292 6472939 5984087 5524100 5071210
11465 5071210 4670703 4339759 4035930 3745561 3469568 3251154 3080777 2932500 2785230
11456 2785230 2633572 2471724 2309394 2196085 2166711 2169008 2171883 2190334 2257737 2383551 2605885
11445 2605885 3059857 3934628 5498792 7806324 9761043 9432756 7212946 4957439 3464641
11436 3464641 2622688 2141413 1848269 1643300 1505350 1400879 1290767 1173215 1055632
11427A055632j17112q2879n4013m9859l5931j7187j3114k932o543k3977k4245
11416F27840k2002o631n917K206N850j3070k509o684q76Q928m411m2168l9002
11403E01554l9639j0111P460l60J3195Q558j5741j1140O464k0441k7753k197k188
11390D07661j0404L931m571j1134N413J6344J7048Q551P467J1213N889M540M890
11377D66838K441P410M266k5K2818M3909M5385L3374L3761N3718O6629J2194j9207
11364G73511l4541l1500n4794l6278J7195L8782j918n9310q5106j13520r4159
11353C18362o3596l2867j4013n506l4921l3169K091o70R623J8332N512j4523l309
11340A51346P047m999j7076o841P048L0842M7800Q350n061O975J2645J6463Q421
$$ plain form
11427 1055632 938520 855641 801628 751769 715838 698651 685537 682605 676062 652085 627840
11416 627840 605838 599207 593290 595496 601346 588276 585767 579083 578207 587135 582724 540556 501554
11403 501554 461915 451804 459264 458904 472099 480657 464916 453776 460240 439799 412046 409849 407661
11390 407661 397257 401188 396617 385483 390896 407240 424288 432839 440306 451519 457408 461948 466838
11377 466838 469279 476689 480955 480930 503748 547657 593042 626416 660177 713895 780524 792718 773511
11364 773511 738970 707470 652676 616398 633593 672375 670457 611147 526041 412521 318362
11353 318362 254766 221899 207886 202380 167459 134290 136381 135711 145334 163666 169178 154655 151346
11340 151346 158393 153394 136318 129477 136525 167367 215167 223517 218456 225431 238076 254539 262960
11327B62960Q801k520K8059K0619J7109J7948P120J6723P6539J42116K12977K50199
11315A058650K42054J90363Q3818n6901j69539k46892k52312k05953j50063p3038
11305D20187l3002k1089k4115m5360l6898k7970p521J3186L3794N1762K5242O366
11293C54582l64k2018l1579n4327n6291l4834k4365l0528j03J4812q449j2441
11281I4095l796q86L103K3924J705R017Q881J8643j7012j4134j0117J882N101
11268A20406O332o748k344j4343l1855j1242j151P842P831k367L75K5759J6465
11255A14960j007j845l617K297M507j247K406L821O905o568j3094j6954J2810
11242A03374J0786O376J6907K542o506l1430m4113j5425J2976O108j218j3955
$$ plain form
11327 262960 271761 269241 297300 317919 335028 352976 360096 376819 453358 595474 808451 1058650
11315 1058650 1300704 1491067 1574885 1517984 1348445 1101553 849241 643288 493225 420187
11305 420187 387185 366096 341981 296621 259723 231753 224232 237418 271212 322974 348216 354582
11293 354582 354218 332200 300621 246294 190003 155169 130804 100276 100173 114985 106536 94095
11281 94095 90299 89413 92516 116440 118145 127162 136043 154686 137674 123540 113423 115305 120406
11268 120406 126738 119990 117646 103303 71448 60206 59055 66897 74728 72361 72736 98495 114960
11255 114960 113953 112108 108491 110788 115295 114048 116454 120275 127180 120612 107518 90564 103374
11242 103374 114160 120536 137443 139985 133479 102049 57936 42511 55487 61595 60377 46422
11230D6422P454J0882j1218k1794L9k941L132r028k781Q717J4150J5486J1265
11217F9785L989K349M428L860l538o925n396j0944j8124n830j1151j1225j8092
11204f814J0310J6730n676J5772J8368J3352K5j4627k4010j096J1405P954o386
11191C5307L779P073J1309P711J4085o305r002j0218l1180j423K6654J6007l336
11178F0461p082Q304K4318O076k474P953q916P749K9083M0301o765k4139k4149
11165A10720j6784j3778k290j1296j4637j3479J324j1562l643K2456Q575N016
11153F0622P078K497j0288j1932J084J835O278p653r723l41m835q370k168J4539
11139C8623N227j198j0788p247J479M638J596L990Q55J3378J3008K020k894m645
$$ plain form
11230 46422 53876 64758 53540 31746 31785 28844 31976 22948 20167 28884 43034 58520 69785
11217 69785 73774 76123 80551 84411 80873 73948 68552 57608 39484 33654 22503 11278 -6814
11204 -6814 3496 20226 14550 30322 48690 62042 62067 47440 23430 22334 33739 41693 35307
11191 35307 39086 46159 57468 65179 79264 72959 63957 53739 22559 21136 47790 63797 60461
11178 60461 53379 61683 86001 92077 89603 97556 88640 96389 125472 165773 159008 134869 110720
11165 110720 93936 80158 77868 66572 51935 38456 39780 28218 24575 47031 55606 60622
11153 60622 67700 70197 59909 47977 49061 50896 57174 49521 39798 39457 34622 26252 24084 38623
11139 38623 43850 42652 31864 24617 26096 30734 32330 36320 37175 50553 63561 65581 62687 58042
11125E8042p53p455J540M909L582n532j0824J837M736l613j2460p832m9J1977
11111C8105P33L987J1866n943Q58o020M051J1236k194l80q61j446J278P24J3253
11096F9247P153J1528J1865K4454L8048L6307K5015K6521J5695j1265k3336m1790
11084A89442m8168k3424j7189j3405L599m319o288j3886L545J2072O693L706m738
11071H7640k689l7r358J4116J1345l005K2161J3155J6339J4363J4279L5913N4298
11058B68520Q0351J49510K88942M58828O96687O75868m595o53085o75709m62146
11048H23171k81898j47876p8810o1924n7941m2379k0472l854o728J452k161j5142
11036A05438j0704k849q300m048j1448M992N900K227j269q100n967o825Q094P719
$$ plain form
11125 58042 57289 49834 51374 56283 59865 54333 43509 45346 50082 46469 34009 26177 26128 38105
11111 38105 38838 42825 54691 48748 49606 43586 47637 58873 56679 56299 55438 53992 55270 55994 69247
11096 69247 76400 87928 99793 124247 162295 198602 223617 250138 265833 254568 231232 189442
11084 189442 141274 117850 100661 87256 90855 86536 80248 66362 69907 81979 88672 92378 87640
11071 87640 84951 84914 75556 89672 101017 98012 120173 133328 149667 164030 178309 214222 268520
11058 268520 348871 498381 787323 1246151 1942838 2618706 2614111 1961026 1285317 823171
11048 823171 541273 393397 314587 252663 194722 152343 131871 128017 121289 122741 120580 105438
11036 105438 94734 91885 83585 79537 68089 73081 78981 81208 79939 71839 65872 59047 67141 74860
11022G4860R735l890j0007p226q28p62q780j7349O217J5725P013K361o447j4010
11008D6612Q616Q98p91J0216N536J0403K0074K9649K0508K923j8861j4606j3766
10995A07411k1457k0486j0515L882P597L16r364q316n858J3142J9703r220p362
10982E9473j5937p652Q687Q377j123Q33O873l887K268L189q417n389j162L673
10968D9806J12l196j5401N852J185O8J1641K768K0676K1432J5483J7727L3860
10955A62013N1103L3579k6136n0940l0295k9910m6205k0881j1995J0402P629j63
10943D8201J3522K0620m401q605j0147N387J0101j2705j6142p562J9303M194K679
10930F4445J3577J3096K5205K8788J2633j965j3924J1775K7945L7719K1556j4361
$$ plain form
11022 74860 84595 80705 70698 63472 62644 61882 53102 35753 41970 57695 64708 67069 60622 46612
11008 46612 55228 56126 55335 65551 71087 81490 101564 131213 151721 154644 135783 121177 107411
10995 107411 85954 65468 54953 58835 66432 66748 57384 49068 43210 56352 76055 66835 59473
10982 59473 43536 35884 44571 52948 51825 52658 59531 55644 57912 61101 52684 47295 46133 49806
10968 49806 49918 46722 31321 37173 38358 38426 50067 52835 73511 94943 110426 128153 162013
10955 162013 213116 246695 220559 169619 139324 109414 63209 42328 30333 40735 48364 48201
10943 48201 61723 82343 77942 69337 59190 64577 74678 61973 45831 38269 57572 61766 64445
10930 64445 78022 91118 116323 145111 157744 155779 141855 153630 181575 219294 240850 226489
10918B26489l7675m1434j0451J090k3580k7455r056j1036j6291j968J8482K4824
10906I1939J3335q706m634j3153j7333l647o162R453L045n839j2363j3662m119
10893B8154J4435Q431L3701L5361L0150L7276J4251k8340m9694m5980j8616m690
10881E4439j7538j1303k608J6053J7488J0740O756K099j5198q263j738j2211O7
10868C8783m16m24J496j9484j073J3567M798o523j82q337l153M166p891p528J4776
10853B2575J0208L55k5281Q976J6099O126J0869m133p039m678j0068K391j3021
10840A3379m433P626l599R470J0185O039l364q688m586O874K582R99O367O834
10826D5685J8283K0532J456o443k3645l822k627m093k829j0706K516k853J276
$$ plain form
10918 226489 188814 147380 136929 138019 114439 86984 77928 66892 50601 48633 67115 91939
10906 91939 105274 96568 91934 78781 61448 57801 51639 61092 64137 58298 45935 32273 28154
10893 28154 42589 51020 84721 120082 150232 187508 201759 173419 123725 77745 59129 54439
10881 54439 36901 25598 22990 39043 56531 67271 74027 76126 60928 52665 50927 38716 38783
10868 38783 38367 37943 39439 19955 18882 32449 37247 30724 30542 22205 19052 23218 15327 7799 22575
10853 22575 32783 33138 7857 16833 32932 39058 49927 45794 38755 34077 24009 26400 13379
10840 13379 8946 16572 12973 22443 32628 38667 35303 26615 22029 28903 31485 32484 38851 45685
10826 45685 63968 84500 85956 79513 55868 52046 49419 45326 42497 31791 34307 31454 32730
10813C2730J0294o537j107K853r690k425p333J316l177L568P701q36J1544j0983
10799B7918j0224k699o124j849Q554O245l548o474j0531P259M111N179q454m60
10785H903M08L179L718p326k659n714m341r434J352J2726Q310O217J1184M180
10771C0703o282m606J630j4262l562J2930m81l253L995J5876J3451M773j0958
10758C9954r746N146K225k593p534L956J0388j4170j1643O781N240J7966j2433
10745C3537j5237m718n423M395qK093k074j816P549Q98n661r986J0173o331O781
10730A4172o894l946o783r024Q188J527J985p442J3230J3528j187j466on226J6913
10715B7569J1167q353n307k24K226N774N654n373j8322p127q576P670L246M222
$$ plain form
10813 32730 43024 36487 35380 38233 28543 26118 18785 20101 16924 20492 28193 27357 38901 27918
10799 27918 17694 14995 8871 7022 15576 21821 18273 11799 1268 8527 12638 17817 9363 8903
10785 8903 9311 12490 16208 8882 6223 509 -3832 -13266 -11914 812 9122 15339 26523 30703
10771 30703 24421 19815 21445 7183 3621 16551 16070 12817 16812 32688 46139 50912 39954
10758 39954 30208 35354 37579 34986 27452 31408 41796 27626 15983 22764 28004 45970 33537
10745 33537 18300 13582 8159 12554 12546 14639 12565 10749 18298 19196 13535 3549 13722 7391 14172
10730 14172 7278 3332 -3451 -12475 -4287 -2760 -775 -8217 5013 18541 17354 15888 15882 10656 27569
10715 27569 38736 30383 25076 24852 27078 32852 38506 33133 14811 7684 -892 6778 10024 14246
10701A4246P12L020l626P81L456o291P599J0995J183K91M871j4269j0406O863
10687A9425O873Q97M844m529O810N471j2297r198j0091K749J0145M357J2825q74
10673C7407j870p176l013p845J4033p898j6932L016J1284L330M434l451k11O203
10659C1311q522j7576p891K304P666P331K195K744P512N184Q48Q841M187J227
10645D7361j3285Q141k795j3280j2691m10j4569M625L7385P333p585k230N931
10632D3931o206n330J6756J0805j5805o898M218O955p383p577j6577n19R418j82
10618B5606J010J7951J4827k3656j2905n082J0180J5488j0504q991K307q535j6967
10605G29N389J2835L863j3648m275k991J5397m557j3651j387J6049J252j3316
$$ plain form
10701 14246 14958 17978 14352 15133 18589 12298 19897 30892 32075 32366 37237 22968 12562 19425
10687 19425 26298 27195 32039 27510 34320 39791 27494 18296 8205 10954 21099 25456 38281 37407
10673 37407 35537 28361 25348 17503 31536 23638 6706 9722 21006 24336 28770 25319 25108 31311
10659 31311 22789 5213 -2678 -374 7292 14623 16818 19562 27074 32258 33106 41947 46134 47361
10645 47361 34076 42217 39422 26142 13451 13041 -1528 3097 40482 47815 40230 38000 43931
10632 43931 37725 32395 49151 59956 44151 37253 41471 48426 41043 33466 16889 16370 25788 25606
10618 25606 26616 44567 59394 35738 22833 17751 27931 43419 32915 23924 26231 17696 729
10605 729 6118 18953 22816 9168 4893 1902 17299 12742 -909 -2296 13753 15005 1689
10592A689L605N914o341J2379J4625j0991k654K2747J5283j0572m361k22J1194
10579E2295L87K1034R384n537L6331M7779N5553J04037J40783J68608R8962q8611
10567F41005j41411o1854P569R450n5059r3112r2342p5587l7594j5446r584L718
10555G9753j673p412r788J013L40l422R860J0105K944k529L301j008j0668j0310
10541F0506p069j2392j6616M393l156j2111m126L466K606J1808K616k87k869J3641
10527D0410R582p384q291N314n117j6507P979l811m78K075N343J0963J0567m699
10513D5946P192J2026l773p379R5q630j47p970J623K243N378l208J283J0249R080
10498F4008l6p780j2275j6479o689J0987R97j5227n101K293K756j179Q058J1335
$$ plain form
10592 1689 5294 11208 4867 17246 31871 20880 18226 40973 56256 45684 41323 41101 52295
10579 52295 52682 73716 83100 77563 113894 161673 217226 321263 462046 630654 729616 641005
10567 641005 499594 437740 445309 454759 399700 306588 214246 138659 101065 85619 76035 79753
10555 79753 78080 70668 60880 61893 62233 58811 68671 78776 81720 79191 82492 81484 70816 60506
10541 60506 53437 41045 24429 28822 25666 13555 9429 12895 15501 27309 29925 29638 26769 40410
10527 40410 49992 42608 34317 39631 34514 18007 25986 22175 21697 23772 29115 40078 50645 45946
10513 45946 53138 65164 61391 54012 54107 45477 45330 37360 38983 41226 46604 43396 44679 54928 64008
10498 64008 63972 56192 43917 27438 20749 31736 32733 17506 12405 14698 17454 16275 24333 35668
10484C5668j536j14R927K061M616N862L416J0021K233j792M971J9960J5299r551
10470A01041j4754M320P673Q74N052M475J5641K2132L1762O3134J10421K00072
10458E51843L27547L78364R4470l18393l69306k47737j33945p8821m8646k7629
10448A27747k2014j3222P851n932j1845m823j1935m666N170J0538n850Q515n75
10435G8959k828J769j3486J68J626R928O114J1651Q63q557K732O376n012j502
10421H8801P228p06J2152P736J3454Q06m120j587J8380K7478L2993N1655P7304
10408C31574J36632K23844L32268M12659K44361j81923m10838l68445k26545j32269
10398C61318q3953o3661m1555l0268j0605j8138o952j1509j8927l773N158n527
$$ plain form
10484 35668 34132 34018 43945 46006 50622 56484 59900 69921 72154 70362 75333 95293 110592 101041
10470 101041 86287 90607 98280 99154 104206 108681 124322 146454 178216 241350 351771 551843
10458 551843 879390 1257754 1352224 1033831 664525 416788 282843 204022 155376 127747
10448 127747 105733 92511 100362 94430 82585 77762 65827 61161 66331 76869 71019 79534 78959
10435 78959 76131 77900 64414 64582 66208 76136 82250 93901 94764 86207 88939 95315 90303 88801
10421 88801 96029 95323 107475 115211 128665 129471 125351 123764 142144 169622 202615 254270 331574
10408 331574 468206 692050 1024318 1436977 1681338 1499415 1088577 720132 493587 361318
10398 361318 277365 213704 172149 141881 131276 113138 106186 94677 75750 71977 77135 71608
10386G1608q80r048j1884r017j852M304K591Q953K655j522p700R657n699k469
10372D9697l884j1237j9695J4325J4808K756J20Q575k675N14N748j53q542p817
10358D2540m655R686K244J654k606M053N573k827n086r777j1877K341Q802K0277
10344F0342J1484l434J290k533K969J1311p17j1234q366N840q982K870K4241K9930
10330A15011L7915J9474j230j6362k9780j8394j4228j0534N445j0736j9804o413
10318E0364Q00j4636J0362O461K779M993J7155J5635J0743j4394j4350m96j2435
10305F2981p430J1460J8620o549L239K154M426q24M868N715N702K412L799J69
10291A10742m141m466p303J179j158K361o176j8832j3730J486j7322K164J449
$$ plain form
10386 71608 70728 61680 49796 40779 38927 43231 45822 54775 57430 55908 48208 57865 52166 49697
10372 49697 45813 34576 14881 29206 44014 46770 46890 55465 52790 53304 59052 58899 50357 42540
10358 42540 37885 47571 49815 51469 48863 52916 58489 55662 50576 40799 28922 31263 40065 60342
10344 60342 71826 68392 69682 67149 70118 81429 80712 69478 61112 66952 57970 60840 85081 115011
10330 115011 152926 172400 171170 154808 125028 106634 92406 81872 87317 76581 56777 50364
10318 50364 51164 36528 46890 53351 56130 61123 78278 93913 104656 90262 75912 75416 62981
10305 62981 55551 67011 85631 79082 82321 84475 88901 88077 92945 98660 104362 106774 110573 110742
10291 110742 106601 102135 94832 96011 94853 97214 91038 72206 58476 59962 42640 44804 46253
10278D6253L784j6880P215M088J0623P70K282m757o780L111L372N616J2983J0268
10264H1948J2211j4143l586k757J0538k622l966K0030J3606R035J5800Q960K1147
10251A66201L7970m339k537O353k511j9426k4440L726o951j8044o323P73j2052
10238A18400r878j0803k576O737J246J3338R35l793J6595j927M050J1168L026
10225A46518P934J0402Q090m566j1079k502q410N293Q39O739j432j5360j1125
10212A31341m243L07l626m488Q534L78L95r880j4441Q632o699l293M798m574K756
10197A05897K232M819P776P318L222m519J1951R446K2063K6149M8196Q5937J19280
10184D49767J43584J09574N0830P2479J49902J08019q1436j44140r3122n8791
$$ plain form
10278 46253 50037 33157 40372 44460 55083 55853 58135 53378 46598 49709 53081 58697 71680 81948
10264 81948 94159 80016 76430 73673 84211 81589 77623 97653 111259 120294 136094 145054 166201
10251 166201 204171 199832 197295 203648 201137 181711 157271 160997 154046 136002 129679 130452 118400
10238 118400 108522 97719 95143 101880 103126 116464 117399 113606 130201 128274 132324 143492 146518
10225 146518 154452 164854 172944 168378 157299 154797 146387 151680 152519 159258 157826 142466 131341
10212 131341 127098 127405 123779 119291 127825 128203 128598 118718 104277 112909 106210 102917 107715 103141 105897
10197 105897 108129 112948 120724 128042 131264 126745 138696 148142 170205 196354 244550 330487 449767
10184 449767 593351 702925 753755 826234 976136 1084155 1002719 858579 765457 706666
10174G06666j19546j52845j24364p1051m2677l2670j0692k5581j7550j3718q002
10163H7970O20j1054o848n05N362N883p428j65j024P080l022p879J1856L349k349
10148H1846L563m980J4410M008L567J2574M897k2648j8945o967j756J693P404
10135G8666J099q40R175j2836m350J1982l588j145R621J077m883P315O799n385
10121I2707r380m323r145J3081J2733q802m417K841k746N901O08j6605J2596J5733
10107A00782m655l0935j9557J1225K361Q015p723r676R884K29k5472p491P477
10094C4464J4045K2195M599l300N016K375j9971k3774j1399q334q42J2183L4639
10081F1896L4960L3167L8483O5014O2237L1896k1606m9585n6420o1568m3673j7795
$$ plain form
10174 706666 587120 434275 309911 238860 196183 163513 152821 127240 109690 95972 87970
10163 87970 88590 77536 70688 70183 75545 81428 74000 73835 72811 79891 76869 68990 80846 84195 81846
10148 81846 85409 80429 94839 98847 102414 114988 119885 97237 78292 71325 69569 71262 78666
10135 78666 79765 78925 88100 75264 70914 82896 79308 78163 87784 88861 83978 91293 98092 92707
10121 92707 83327 79004 69859 82940 95673 86871 82454 85295 82549 88450 89058 72453 85049 100782
10107 100782 96127 65192 45635 56860 59221 67236 59513 49837 59721 59950 34478 26987 34464
10094 34464 48509 70704 75303 72003 77019 79394 59423 35649 24250 15916 15074 27257 61896
10081 61896 96856 130023 168506 233520 295757 327653 306047 256462 200042 138474 94801 77006
10069G7006j646P89K307r571l662k63l240q47j4230r321j5201j4791M664J9042
10055C1036L184k479n967l620R892J1565J4069j084j1133j3323K663L302j199
10042C6906r093l21J6523l723j2544l835J5136K4155Q382O962j946k0897L137
10029E8842K5878K830o124J0003J0964J4974J0809R993J8466J1353K4156L4411
10017B26555P866J1798R888L378l210k566J43O199p2R695O680M723L5236L0291
10003C46604O8538J41972K03256L31888N04386O58704O01742L87457L16771M19719
9993C981037M10926R7757k97733m43830l35085l35767n52370o66709n61519l92728
9983I03979k36535j34742q1751o0298m3374k7724l6456k2227k2033j5993j1007
$$ plain form
10069 77006 75360 76149 78456 68885 65223 64960 61720 60873 46643 37322 22121 7330 11994 31036
10055 31036 34220 31741 25774 22154 32046 43611 57680 56596 45463 32140 34803 38105 36906
10042 36906 27813 27492 44015 40292 27748 23913 39049 63204 71586 78548 76602 55705 58842
10029 58842 84720 87550 81426 91429 102393 117367 128176 138169 156635 167988 192144 226555
10017 226555 234421 246219 256107 259485 256275 253709 253852 260051 259979 269674 276354 281077 316313 346604
10003 346604 415142 557114 760370 1092258 1596644 2255348 2857090 3244547 3561318 3981037
9993 3981037 4391963 4489720 4191987 3748157 3413072 3077305 2524935 1858226 1296707 903979
9983 903979 667444 532702 450951 390653 347279 319555 283099 260872 238839 222846 211839
9972B11839J3492k0239j990P131n928r663p78R646l827j4270r537o859m122j3786
9958A51109k2320n768O365j2105k5335j3964J5119J760j886j5107j6093k343q447
9945E0985o066o199j2111J8537R221K002O070O60K978K239O603O026j438L244
9931H2751r653n754o289j0147j5458N04M743j036l727P604K4500K9773J6776r701
9917A04886j8912P747Q317j1823j6055M155o499k284j67m610j4281j5256N843
9904D1061R312J359j1105l426J103J050n447J164q849J1224N708q810R45j4388
9890B0901j686J2693M81k0493J3006K8002Q57J580n019j7636R120n26m688p627
9876B8965J1177J8245J2312j015k307m983K79n199q540J1880K0461Q518o159P25
$$ plain form
9972 211839 225331 205092 203102 210233 204305 194642 193864 203510 199683 185413 175876 169017 164895 151109
9958 151109 128789 123021 129386 117281 91946 77982 93101 94861 92975 77868 61775 59432 50985
9945 50985 44919 38720 26609 45146 54367 56369 62439 63099 66077 68316 74919 80945 79507 82751
9931 82751 73098 67344 61055 50908 35450 35954 40697 39661 35934 43538 68038 97811 114587 104886
9917 104886 85974 93721 102038 90215 74160 78315 71816 69532 69365 64755 50474 35218 41061
9904 41061 50373 51732 40627 37201 38304 39354 33907 35071 26222 37446 43154 34344 35289 20901
9890 20901 19215 31908 32389 11896 24902 52904 53761 55341 50322 32686 41806 41280 36592 28965
9876 28965 40142 58387 70699 69684 67377 62394 62673 57474 48934 60814 81275 89793 83634 84359
9862H4359q058r254q724l013k1152j0445R491J3834R721q163q333p115k891L265
9848C3522R019J4527l755o728o808L785p691q556J2971J6328P933r014q664l362
9834D3507M04K909J1898O352p800o773n416j802o782K718J1362j809N875j1969
9820D2674k1075M767K173P475M650P997k92K443p188q701l128O6j1728j1664l627
9805D842J471N442L195q05Q475J8693J2628N960M70p565r955r964J6396K6l776
9790D5533N187l473N683J3342n004j1759J2049J2207j7329o711J4990N781K867
9777G3363J191j1371j2752L413P517O009o535m875p431q0p3j0215l286j787K946
9762C6034k210L479M481j90o324j823K0025M802l83k268k303l76L696M739l303
$$ plain form
9862 84359 76301 67047 58323 55310 34158 23713 33204 47038 56759 48596 40263 33148 30257 33522
9848 33522 42541 57068 53313 46585 39777 43562 35871 27315 40286 56614 64547 55533 46869 43507
9834 43507 43911 46820 58718 65070 57270 50497 45081 43279 36497 39215 50577 48768 54643 42674
9820 42674 21599 26366 28539 36014 40664 48661 48369 50812 43624 34923 31795 31861 20133 8469 4842
9805 4842 6313 11755 14950 14145 22620 41313 53941 59901 60371 52806 42851 32887 49283 49309 45533
9790 45533 50720 47247 52930 66272 61268 49509 61558 73765 56436 49725 64715 70496 73363
9777 73363 74554 63183 50431 53844 61361 67370 60835 55960 48529 48449 48376 38161 34875 33088 36034
9762 36034 33824 37303 41784 41594 35270 33447 53472 58274 57891 55623 53320 52944 56640 61379 58076
9747E8076l84J2357J0297j4527n929Q371N687q788Q23N699j0832m962J1464j6387
9733E0965j643k332Q430K0412L6214L9518Q591O044q851k8817k2940j6794r440
9720G9357l011o657o63L418J593J3831l34n33j0208r479k924k0854r445J4521
9706D8612J9212l040k689K2171J5593j1420j4639r145n224l184k0848k151J5892
9693D9140N923p027K609R252j6518p91N923p948j0114j235R255J838M750l20J2194
9678E6931o711j6959J756J733O271N514o56o547k6336l028J7769J1006J8579m373
9664E4949k1860J576K377J2677P082J4313J3j7163o626r046q337K319Q316J1729
9650E2319j077K390P052n121J811J3806k013j3363k1812l381J4037N572M572J547
$$ plain form
9747 58076 57692 70049 80346 65819 59890 68261 73948 65160 65983 71682 60850 55888 67352 50965
9733 50965 49322 46990 55420 75832 112046 151564 160155 166199 157348 128531 105591 88797 79357
9720 79357 76346 69689 69026 72444 74037 87868 87534 87001 76793 67314 64390 43536 34091 48612
9706 48612 67824 64784 62095 84266 99859 88439 73800 64655 59431 56247 35399 33248 49140
9693 49140 55063 48036 50645 59897 43379 42588 48511 40563 30449 29214 38469 40307 45057 44737 56931
9678 56931 50220 33261 35017 36750 43021 48535 47879 41332 14996 11968 29737 40743 59322 54949
9664 54949 33089 34665 37042 49719 56801 71114 71127 53964 47338 38292 29955 32274 40590 52319
9650 52319 51242 53632 60684 55563 57374 71180 69167 55804 33992 30611 44648 50220 54792 56339
9636E6339J3151l143p452j2051M450M125m791n596K492K1834q98j2048n160k93
9622E0959p564p047L183J0944p18L280l725r478k968K794J1942L543L964m904
9608E4205j0489r111K586P316j3559j1280O099J2165q010j5156L780P309J2263
9595C8118J5207O685k488N582K111l978J1985m947j3508n68j2576M816l549O004
9581D8894J4865R355m072L811J1448l650j3775m474m541J103q380Q554M098J187
9567F4423J0439j2809o093M160m736j8592K040J8248J1952N010k656P161P596
9554H6143j5402j2425m132J645k545k738o349J551J4657j196j5834j5525P967
9541C5817M990J2494J2263p504j5680o751J0633Q396J1070N285q786j0605J970
$$ plain form
9636 56339 69490 66347 58895 46844 51294 55419 50628 45032 47524 69358 68460 56412 51252 50959
9622 50959 43395 36348 39531 50475 49757 53037 49312 39834 36866 39660 51602 55145 59109 54205
9608 54205 43716 34605 37191 44507 30948 19668 25767 37932 29922 14766 18546 25855 38118
9595 38118 53325 60010 57522 63104 65215 61237 73222 68275 54767 54199 41623 46439 42890 48894
9581 48894 63759 73114 69042 72853 84301 80651 66876 62402 57861 58964 50584 59138 63236 64423
9567 64423 74862 62053 55960 60120 55384 36792 38832 57080 69032 74042 71386 78547 86143
9554 86143 70741 58316 54184 55829 53284 50546 44197 45748 60405 59209 43375 27850 35817
9541 35817 40807 53301 65564 58060 42380 35629 46262 54658 65728 71013 62227 51622 53592
9528E3592K979r063k663m83j1535k730J5798P380l396j2646Q746J3679J6908P672
9514H4238r207o993L721q574m28R91k0887o416l890K116J0805J1371P639L380
9500F7866K745m183j2094r957p31J303J4490L356J1368j0043j1090L461N138m518
9486E7111j8522J7578M12n581Q882M510O522R431r867J055M133m842q378N712
9472F8156m449m129l968j5691l377P901J957Q128K490n014Q01N841p159L067P637
9457F2191K0383J2360K947j1472q852K161N82J593k7j486k518J523J0551K776
9443I2712k753j1663l829J898K397M730k216l568K077J50K97K943M163m736K664
9428H5266n929O283J3815j8931p165q510O723J5224P249l256q761j1592N943K208
$$ plain form
9528 53592 56571 47508 44845 44362 32827 30097 45895 53275 49879 37233 45979 59658 76566 84238
9514 84238 75031 68038 71759 63185 62757 63748 42861 36445 32555 34671 45476 56847 64486 67866
9500 67866 70611 66428 54334 44377 43646 44949 59439 62795 74163 64120 53030 56491 61629 57111
9486 57111 38589 56167 56579 50998 59880 64390 70912 80343 70476 71531 75664 70822 62444 68156
9472 68156 63707 59578 55610 39919 36542 44443 46400 54528 57018 52004 52805 58646 51487 54554 62191
9457 62191 82574 94934 97881 86409 77557 79718 80300 81893 81866 80380 77862 79385 89936 92712
9443 92712 89959 78296 74467 76365 78762 83492 81276 77708 79785 79935 80232 83175 87338 82602 85266
9428 85266 79337 85620 99435 80504 73339 64829 71552 86776 94025 90769 82008 70416 76359 78567
9414G8567K816r453j3282O779k820J1865J0356K624m590n227j4502r190P171J1471
9400G2585J514m115J979K783J7732j284o007j615P936n867p281J417j7845N892
9386F7824J5577P959j168n010m831k218j762l23M380M90M035J7940K531p848j1777
9371H5799K678L706N461K445k909o884L498N816j0597J638m160j6236N381m083
9357G1553J5704K3232N199q388n219K251l800J05p482N666L722j527J6167k522
9343A14661K077k688O079K465j581j3707j0737J055J1146m474j003K966j0252
9330I6007M096Q187L839O633J1759J3008P908r255j3185n877P480J7670N673P965
9316A61908J4970J2772L5684O2186M7784L9086M6471L9228J8004k791m086M659
$$ plain form
9414 78567 81383 71930 58648 65427 62607 74472 84828 87452 82862 77635 63133 53943 61114 72585
9400 72585 74099 69984 71963 74746 92478 91194 85187 83572 91508 85641 78360 79777 61932 67824
9386 67824 83401 91360 90192 85182 80351 78133 76371 76048 80428 80918 84953 102893 105424 97576 85799
9371 85799 88477 92183 97644 100089 97180 90296 93794 99610 89013 90651 86491 70255 75636 71553
9357 71553 87257 110489 115688 107300 102081 104332 100532 100637 93155 98821 102543 101016 117183 114661
9343 114661 116738 114050 120129 122594 121013 107306 96569 97624 108770 104296 103293 106259 96007
9330 96007 100103 108290 112129 118762 130521 143529 151437 142182 128997 123120 130600 148270 153943 161908
9316 161908 176878 189650 225334 287520 335304 374390 420861 460089 478093 475302 471216 475875
9304D75875k3724n263Q4813Q4768Q3079N1558L3205j1309k9972o6688o5711p4309
9292E36322n0070L97R164J675p519m765q743k9118n3348n7294o1096n0143k9992
9279A95470k2846l452M024M350N082k738q83n574n735p219l917l33k234J5693
9265A69688j929J1893r941L798p331m648N081O053M804q043r993m993k318k277
9251A49844N184Q252j989q764r852o406J0538J6274J9844R131n881n527N539J5955
9237B02142L163k1406j201R24j2179j0622k597P26Q850o130j4950j158J2662k030
9223A56194m208J5989J1421j295j8479j93o184L327j845j1057R879J6038j146
9210A68441j6804j5550J7782O296k252J1322J6001M454P280L934N491J5861j3209
$$ plain form
9304 475875 452151 446888 531701 616469 699548 751106 784311 773002 743030 676342 610631 536322
9292 536322 486252 486649 495813 497488 489969 485204 476461 447343 393995 336701 275605 225462 195470
9279 195470 172624 169172 173196 177546 182628 179890 179007 173433 167698 160479 156562 156229 153995 169688
9265 169688 167759 179652 169711 173509 166178 161530 166611 172664 177468 169425 159432 154439 152121 149844
9251 149844 155028 163280 161291 152527 142675 136269 146807 163081 182925 192056 186175 180648 186187 202142
9237 202142 205305 183899 182698 183622 171443 160821 158224 158950 167800 161670 146720 145562 158224 156194
9223 156194 151986 167975 179396 178101 159622 159429 153245 156572 154727 143670 153549 169587 168441
9210 168441 151637 136087 153869 160165 157913 169235 185236 189690 196970 200904 206395 222256 209047
9197B09047k1549j9638j2749k0642J1204K0390J3684p646Q394J7129N808j6108
9185A87324j0957r345p40R34J0152l549j6212K686R08N164J237M021O057L227
9171A80907q794R088L171j7020k1484j288J5110J6934L822L405J3639O842q17
9158B03515j685n681j0104l981j993l037l379j10R08k511K469O824j0829L54m176
9143A66584P719j644M323O189O500N317P759j2634j9036J869N013J5375L285q636
9129A87983l847L225N564j1824J08J0457J908n388o982K623J0943J171L171p869
9115A91243K429J0110K023l160N436J6032M289J352n70n618o367J7892r884n340
9101B19867R559L771q872m517J0334R648m267j0371M65n098j8185J301J0854J499
$$ plain form
9197 209047 187498 167860 155111 134469 145673 166063 179747 172101 180495 197624 203432 187324
9185 187324 176367 167022 166282 167216 177368 173819 157607 160293 161201 166365 167602 171623 177680 180907
9171 180907 172113 181201 184372 167352 145868 144580 159690 176624 180446 183851 197490 204332 203515
9158 203515 201830 196149 186045 182064 180071 177034 173655 173545 174453 171942 174411 181235 170406 170760 166584
9143 166584 174303 172659 176982 183171 189671 194988 202747 190113 171077 172946 177959 193334 196619 187983
9129 187983 184136 187361 192925 181101 181209 191666 193574 188186 181204 183827 194770 195941 199112 191243
9115 191243 193672 203782 205805 202645 208081 224113 228402 229754 229184 223566 217199 235091 225207 219867
9101 219867 229426 233197 224325 219808 230142 239790 235523 225152 225617 220519 202334 203635 214489 215988
9087B15988l664K281K751J272N988N789R12J3660O286j3707r034J0780J062p30
9073B39634o360n225J9568J0558k970J295j307l8Q991J7178l697j5965m852J504
9059B58314M138o508O083M193m463P908q233J1379J4030L946j7994m496J0433
9046B78730o771q423N087N32J425O206K804P690Q928L207N678J0009j489p810
9032C05803m231N368O908P869J0270j0956k186m637J451n709M161M997M101N501
9018C28710j571q840o778J307J113J2459Q618q723R72N31J0314n247o152J3089
9004C39802J0620n834n14J2703K9917N553K856J690j3494k3361Q09J319M475Q171
8990C74712M074J3872R181j2660n393r566n03J1816N746J3446K4060J0260J1296
$$ plain form
9087 215988 212324 214605 217356 218628 224616 230405 231317 244977 251263 237556 228522 239302 240364 239634
9073 239634 233274 228049 247617 258175 255205 256500 255193 255155 264146 281324 277627 261662 256810 258314
9059 258314 262452 255944 262027 266220 261757 269665 261432 272811 286841 290787 272793 268297 278730
9046 278730 271959 263536 268623 269155 270580 276786 279590 287280 296208 299415 305093 315102 313613 305803
9032 305803 301572 306940 313848 321717 331987 321031 318845 314208 315659 309950 314111 319108 323209 328710
9018 328710 327139 318299 311521 312828 313941 326400 335018 326295 327267 327798 338112 332865 326713 339802
9004 339802 350422 344588 344074 356777 386694 392247 395103 396793 383299 359938 360747 362066 366541 374712
8990 374712 378786 392658 401839 389179 383786 374220 373717 385533 391279 404725 428785 439045 450341
8977D50341q792n930J0670J8j0448m925n717N073K730N19Q426R528k570L173L865
8962D55961j666j239K473M361O101O770q879j4132J705P466Q184L713O921J6697
8948D94436N927o19O912O604l010m385k972J4723K2753R459m737m851J4125J8489
8934E72854R831R848J130j832j6403j403P922J880Q465k370N979p29J5770Q617
8920F19559J3437P122n173j714M465J082J5004o223m125J0831J4123K63Q369o32
8906F76388J3269N79J35K764J0057K153J6438J4577J0360j436J955J6122n813
8893G57548Q1P441J7834P960n7J6735R132J2699J6828Q756M565Q510K141J134
8879H71307q567j148P022K9490K4588K5577J3868K5507J2739J0579J1495O626
$$ plain form
8977 450341 441549 435619 446289 446307 435859 430934 425217 430290 433020 433539 441965 451493 448923 452096 455961
8962 455961 454295 453056 455529 459890 465991 472761 463882 449750 451455 458921 467105 470818 477739 494436
8948 494436 500363 499744 506656 513260 510250 505865 502893 517616 540369 549828 545091 540240 554365 572854
8934 572854 582685 592533 593663 591831 575428 574025 581947 583827 592292 589922 595901 595172 610942 619559
8920 619559 632996 640118 634945 633231 637696 638778 653782 647559 643434 654265 668388 668651 677020 676388
8906 676388 689657 690236 690371 693135 703192 705345 721783 736360 746720 745284 747239 763361 757548
8893 757548 757629 765070 782904 790864 790807 807542 816674 829373 846201 854957 859522 868032 870173 871307
8879 871307 862740 861592 868614 898104 922692 948269 962137 987644 1000383 1010962 1022457 1029083
8867A029083L5572M2614L5562L7970M7595M7252O9510O3187O3052P1701O3199
8856A606297J03015J43788K31311L44934N38411Q92605J434687K114975K314999
8847I725022P08027j649783k302946j772711j109514o78129m16922k61415j68156
8838B073473j07800n9654k8116m3009o0517m9382l2195L11j651k8497j0170j6991
8826A635802p951J4678J4998j0134m505N115Q105P670J2064J3715J7611L2911
8814A740079J9228R377N628j870J8005L3184L0155L4243K6868J2641L4845K3505
8802A985888R717K0696J4766J8780L8227K7219L0169L3468M1269K5767K5617M2606
8790B314189K8339N4097M1124K7995L3341L5159K9219M1687M1580M9599O1652
$$ plain form
8867 1029083 1064655 1107269 1142831 1180801 1228396 1275648 1345158 1408345 1471397 1543098 1606297
8856 1606297 1709312 1853100 2084411 2429345 2967756 3860361 5295048 7410023 9725022
8847 9725022 10433049 8783266 6480320 4707609 3598095 2919966 2503044 2241629 2073473
8838 2073473 1965673 1906019 1877903 1834894 1774377 1724995 1692800 1693111 1691460 1662963 1652793 1635802
8826 1635802 1627851 1642529 1657527 1647393 1642888 1648003 1656108 1663778 1675842 1689557 1707168 1740079
8814 1740079 1759307 1768684 1774312 1772442 1790447 1823631 1853786 1888029 1914897 1927538 1962383 1985888
8802 1985888 1995605 2016301 2031067 2049847 2088074 2115293 2145462 2178930 2220199 2245966 2271583 2314189
8790 2314189 2342528 2396625 2437749 2465744 2499085 2534244 2563463 2605150 2646730 2696329 2757981
8779B757981M9713L1313L7884O0097M5671N9312M3676M5910O3322N1327M4755
8768C290961N0113N9527N8395M7629N2009O2476Q5674Q0233O4926O9846P7936
8757C999725Q2871Q1404Q6855R1154R5943J06128J02455R5609Q4596R6860J01223
8746E024823J11169J04828J06600J20921J12654J10533J27748J40892J29404J28961
8736F218533J38066J47682J42341J54617J50127J43228J67935J82454J76420J85668
8726G807071J97755K07404K09101K13810K02869K12921K19785K13648K16069K40547
8716I940980K52746K71877K69999K63707K51097K54668K87875L02616K91134K91276
8706A2677975K99475L11468L10155L13114L11990L13744L36875L27838L13999
$$ plain form
8779 2757981 2807694 2839007 2876891 2936988 2982659 3041971 3085647 3131557 3194879 3246206 3290961
8768 3290961 3341074 3400601 3458996 3506625 3558634 3621110 3706784 3787017 3851943 3921789 3999725
8757 3999725 4082596 4164000 4250855 4342009 4437952 4544080 4646535 4742144 4826740 4923600 5024823
8746 5024823 5135992 5240820 5347420 5468341 5580995 5691528 5819276 5960168 6089572 6218533
8736 6218533 6356599 6504281 6646622 6801239 6951366 7094594 7262529 7444983 7621403 7807071
8726 7807071 8004826 8212230 8421331 8635141 8838010 9050931 9270716 9484364 9700433 9940980
8716 9940980 10193726 10465603 10735602 10999309 11250406 11505074 11792949 12095565 12386699 12677975
8706 12677975 12977450 13288918 13599073 13912187 14224177 14537921 14874796 15202634 15516633
8697A5516633L01481L06120L25326L20864L22188L02970L04473K70198K53904
8688A8224157K61811K58411K32939K07081K02470J87402J58714J34109J28882
8679A9995976J26808R7403N7513J3816J3672P658m5188p3467r6199j14398j26752
8668A9856842j34304j76565k08300k03939k20073k31165k47486k51574k67569
8659A7915867k73869k81935l07111l06323l08046l22379l17097l14784l11488
8650A5172835l25481l32503l07466l23005l18915l15423l01171k90443k91216
8641A2367212k86029k65204k67674k75528k63191k62560k54961k57153k46298
8632I988614k33436k21075k26909k21701k15415k04270k08336j94757j85407j76293
$$ plain form
8697 15516633 15818114 16124234 16449560 16770424 17092612 17395582 17700055 17970253 18224157
8688 18224157 18485968 18744379 18977318 19184399 19386869 19574271 19732985 19867094 19995976
8679 19995976 20122784 20220187 20277700 20291516 20305188 20312846 20267658 20194191 20097992 19983594 19856842
8668 19856842 19722538 19545973 19337673 19133734 18913661 18682496 18435010 18183436 17915867
8659 17915867 17641998 17360063 17052952 16746629 16438583 16116204 15799107 15484323 15172835
8650 15172835 14847354 14514851 14207385 13884380 13565465 13250042 12948871 12658428 12367212
8641 12367212 12081183 11815979 11548305 11272777 11009586 10747026 10492065 10234912 9988614
8632 9988614 9755178 9534103 9307194 9085493 8870078 8665808 8457472 8262715 8077308 7901015
8622G901015j72095j68922j74353j70600j60955j56979j69829j62513j47521j31335
8612F285913j20426j30145j29208j35895j28798j07923j13195j09414r1697q8226
8602E130986j04576j07173j00090r5018r1090p2862p0770r3678q5850o5750p0071
8591D174058n5309n9318q2857o5895n6320n1643n0090m5197o0497m6035m1186
8580C559711l8071m2430l5542l2957k6967l2706r214p457r443j2473j6049j9462
8568C276940l4318n7784o8129p5376q4396q7038r8701p0954p0578p8393n4892
8557B496381l9054l6442n5881m5367m2877m2131l5404n0922m2442m3918m2149
8546B019794k2214j3020j2323l4949k3143l0281l5235k4424k4041l0739l0713
$$ plain form
8622 7901015 7728920 7559998 7385645 7215045 7054090 6897111 6727282 6564769 6417248 6285913
8612 6285913 6165487 6035342 5906134 5770239 5641441 5533518 5420323 5310909 5219212 5130986
8602 5130986 5026410 4919237 4819147 4724129 4633039 4560177 4489407 4395729 4309879 4244129 4174058
8591 4174058 4118749 4059431 3976574 3910679 3854359 3802716 3752626 3707429 3646932 3600897 3559711
8580 3559711 3521640 3479210 3443668 3410711 3383744 3351038 3341824 3334367 3324924 3312451 3296402 3276940
8568 3276940 3242622 3184838 3116709 3041333 2956937 2869899 2771198 2700244 2629666 2551273 2496381
8557 2496381 2457327 2420885 2365004 2319637 2276760 2234629 2199225 2148303 2105861 2061943 2019794
8546 2019794 1997580 1984560 1972237 1937288 1914145 1883864 1848629 1824205 1800164 1769425 1738712
8535A738712j3439k7830j7460j4971l2772l4506k8483q832k0991k7332j7034k0566
8523A474496l062m607k6524k3787k1805j8984k1631r862n869n518m356l0831k1906
8510A275754k3108k9800p366J16l0997j6541j474j1164j4509K88j3971l893k4234
8497A099101j3135j499j2303L682j5245j3689j2416j8934j4479j5528o92K629
8485I87492n598j9640j6252j4517n830j275j7631j7624P301p461k7236o933K321
8472H57117n27l354j1077j2685j6682r572o952k334K542n688r874o176o230q122
8458G60386k143j0223o699N287l394j5815j0711j2087j5617j0412Q924K028j0345
8445F79179N706m147j620R996P86p360k1092j1395l221j719j6171j3179K298j968
$$ plain form
8535 1738712 1725273 1697443 1679983 1665012 1632240 1597734 1569251 1560419 1539428 1512096 1495062 1474496
8523 1474496 1471434 1466827 1440303 1416516 1394711 1375727 1354096 1344234 1338365 1332847 1328491 1297660 1275754
8510 1275754 1252646 1222846 1215480 1215596 1184599 1168058 1166584 1155420 1140911 1141199 1127228 1123335 1099101
8497 1099101 1085966 1084467 1072164 1075846 1060601 1046912 1034496 1015562 1001083 985555 984863 987492
8485 987492 981894 962254 946002 931485 925655 924380 906749 889125 896426 888965 861729 854796 857117
8472 857117 856590 853236 842159 829474 812792 803220 796268 793934 796476 790788 780914 774738 768508 760386
8458 760386 758243 748020 741321 746608 743214 727399 716688 704601 688984 678572 687496 689524 679179
8445 679179 684885 680738 679118 689114 689900 682540 661448 650053 646832 645113 628942 615763 618061 616093
8431F16093m460J340m920J180j3261l774P274j784o953j4183K047j6804k3920
8418E37875j4421L777p021R489Q816r667j2318j447M315K31P364p961j8448l534
8404D97050j3289r611L269J3740q588q074j6182n544N916j2349j1083l88J866
8391D36733J020p126J7224J4627K908q013j3609k7637j3505q3J2011m29M834L772
8377D22727p710j2662L373M376o897j7910K181n532q420O380K589Q214n054j338
8363C84317p910k083L186k382n594j1641Q461J1627q755r893L146P127o220o990
8349C56396o43m06p537j9952L295o128p031R426R361o059r447J9730R706O904
8335C57615j130l806q01m722j1952m062n559j5118q148K578q62p731q146m221
$$ plain form
8431 616093 611633 612973 608053 609233 595972 592198 599472 597688 590735 576552 578599 561795 537875
8418 537875 523454 527231 520210 529699 538515 528848 516530 515083 519398 519629 526993 519032 500584 497050
8404 497050 483761 474150 477419 491159 482571 474497 458315 452771 458687 446338 435255 434867 436733
8391 436733 437753 430627 447851 462478 465386 457373 443764 416127 402622 402539 414550 414121 418955 422727
8377 422727 415017 402355 405728 410104 403207 385297 387478 381946 373526 379906 382495 390709 385655 384317
8363 384317 376407 374324 377510 375128 369534 357893 366354 377981 369226 359333 362479 369606 363386 356396
8349 356396 355753 355347 347810 327858 331153 325025 317994 327420 336781 330722 321275 341005 350711 357615
8335 357615 356485 352679 351878 347156 335204 331142 325583 310465 302317 304895 304033 296302 288156 283935
8321B83935M06o129j557L237K650j0099l805r139q784L496K2413J5412J180n408
8307B87808Q009j6851q466j5406L564O576j6023J3348J4422k926L476Q44j3729
8294B64646k0679J0397J1786j5629q103J633N063R805n759n407M04l69j2529k396
8280B32863P546m525p705j4824o025j065P779Q059J4287J1326l012p556r372p650
8266B20126K063Q5m823M107p338L565Q578q262L075M098p459m557o868P463m329
8251B09524j7441q196L001o125k23J337l097P341J984M977J1713J2683k8103j3172
8237A76203l375J316Q517J054J5023Q938N237r59j2773k727n952j0420N827J3454
8223A99363m052j3978K472kj117j0565M457N49m254l05k047O639j388J0777o29
$$ plain form
8321 283935 284341 278212 276655 279892 282542 272443 268638 259499 250715 254211 276624 292036 293216 287808
8307 287808 295817 278966 270500 255094 258658 265234 249211 262559 276981 274055 277531 278375 264646
8294 264646 243967 254364 266150 250521 242418 244051 249114 258919 253160 247753 248157 247788 235259 232863
8280 232863 240409 235884 228179 213355 207330 206265 214044 222103 236390 247716 244704 237148 227776 220126
8266 220126 222189 222274 217451 221558 214220 217785 226363 218101 221176 225274 217815 213258 206390 213853 209524
8251 209524 192083 183887 186888 180763 180540 181877 178780 186121 188105 193082 204795 217478 189375 176203
8237 176203 172828 174144 182661 183715 198738 207676 212913 211954 199181 196454 190502 180082 185909 199363
8223 199363 195311 181333 183805 183803 182686 172121 176578 177127 172873 172568 170521 177160 175772 186549 185920
8208A85920j4812k519J489O207P874j1338k528P294k297m738j3417q442k550J4501
8194A60644J1817p624o782n551j5045J5231J6610r913p351l952O543M958r35j1845
8180A46805L941M248j2689k626J0259p168r943N90J1011l648m937Q695p9M418
8166A48877j1913k362J0936n194J291K586l988N317N769k0564K778Q43j102r851
8152A23423j2654l737N672L224P145J1471J0794m169p139q160q1M911J9029k700
8138A47029K565Q477m913l952k682p426q979r038j790N604K0364R95j7509j0336
8124A18409J849j755K222R104l564N026k744n255l375o673J4530J3158j0796o482
8110A23654l540O536Q250o680N917N25q941o228R564m251M772O42m332r61k50
$$ plain form
8208 185920 171108 168589 170078 176285 184159 172821 170293 177587 175290 170552 157135 148693 146143 160644
8194 160644 172461 164837 158055 152504 137459 152690 169300 159387 152036 148084 154627 159585 158650 146805
8180 146805 150746 154994 142305 139679 149938 142770 132827 133417 144428 140780 135843 144538 144459 148877
8166 148877 136964 134602 145538 140344 141635 144221 140233 145550 151319 130755 133533 134376 133274 123423
8152 123423 110769 107032 112704 115928 123073 134544 145338 141169 134030 125870 125789 130700 149729 147029
8138 147029 149594 158071 153158 149206 146524 139098 130119 121081 119291 124895 145259 146254 128745 118409
8124 118409 120258 118503 120725 129829 126265 131291 128547 123292 119917 113244 127774 140932 130136 123654
8110 123654 120114 126650 134900 128220 134137 134662 125721 119493 129057 124806 129578 130220 125888 124927 124677
8095A24677J090m40q386L496p758j6829O04J792O066P818j853L856j4102N744
8081A05775P315o45j8673q034k394M068j460J2550J7341Q751r837Q525m981o159
8067A12142K35K744K262o603o551K833O758J0142M947K944p422k1794n789J6562
8053A13410P897j415J4l253n522n602k982P890O383l947Q896K2220J856j6806
8039A29039j7736K94m268L918O430P116n273N07r119J9239Q221j426j6204p739
8025A12999O077j2987K939J3533J167n136J5852K438L395k945K063q031o686k911
8011A21767k183j0197J490J2047J0175m1J0959J2871J306q493k164k3218m274
7998A20045R041M647J077O429J267o70m714m729L464o069p266J2036R544R182
$$ plain form
8095 124677 125767 125327 116941 120437 112679 95850 96454 98246 104312 112130 110277 114133 100031 105775
8081 105775 113090 112445 93772 85738 83344 87412 85952 98502 115843 124594 114757 123282 118301 112142
8067 112142 112377 115121 117383 110780 104229 107062 113820 123962 128909 131853 124431 102637 96848 113410
8053 113410 121307 119892 119906 116653 111131 105529 102547 110437 116820 112873 121769 143989 145845 129039
8039 129039 111303 111597 107329 111247 117677 124793 119520 120027 110908 130147 138368 136942 120738 112999
8025 112999 119076 106089 109028 122561 123728 118592 134444 136882 140277 137332 139395 131364 124678 121767
8011 121767 119584 109387 110877 122924 133099 133058 144017 156888 158194 149701 147537 124319 120045
7998 120045 129086 133733 134810 141239 142506 141836 137122 132393 135857 129788 122522 134558 144102 153284
7984A53284L248Q702L881J0973K3822L093j166O159O840L801J5693j1320k5873
7971B01137q407K049j505P073q706P648n355j807j392k6200j6846J1606r948j745
7957A47602N671o808k141m213m585P521J0395K634j1688j8384n195J3676J7514
7944A51999O514K522K859j070N075J0173M17J4797l504j166K638N554J3200M134
7930B14142L250j0348k967j2419k0305M402Q294J3799j0735j6664j9334j6906
7918A34209p36q182R958L007j6476k883j1242K180j535Q728J191p134O105m411
7904A12779j067P969k371l994M475K556o667L472N36r149K610J7520J233l918
7890A25984K463l891n006J0832m794m370o245o763j361p680l301j213m668k597
$$ plain form
7984 153284 156532 165234 169115 180088 203910 207003 205837 211996 218836 222637 238330 227010 201137
7971 201137 192730 194779 193274 200347 191641 199289 193934 192127 190735 164535 147689 159295 149347 147602
7957 147602 153273 146465 144324 140111 135526 143047 153442 156076 144388 126004 120809 134485 151999
7944 151999 158513 161035 163894 162824 167899 178072 178489 193286 189782 188616 191254 196808 210008 214142
7930 214142 217392 207044 204077 191658 171353 175755 184049 197848 187113 170449 151115 134209
7918 134209 133473 125291 135249 138256 121780 118897 107655 109835 108300 117028 118219 111085 117190 112779
7904 112779 111712 119681 117310 113316 117791 120347 113680 117152 117688 108539 111149 128669 129902 125984
7890 125984 128447 124556 119550 130382 125588 121218 114973 108210 106849 99169 95868 94655 89987 87390
7876H7390J850J8913n891j0007K554M19j4103m896K1120J620n011r267K258M349
7862I1298L108P505k400j1299o212p693J274J4703J2570J904j6184J651K555j6818
7848G5962k1846P047M071M731n031r334J0925J2406n935m016j3245n147q710J436
7834D3314R236R762j597j221L908j249l230J7167J0927j3143j0164o615j0192
7821D6903k137M685l061k933K020N065J3117O54k704j2191j3028R404Q143o024
7807D7913M90K966J2639o863l428J567o905L782J7560j6718P82r090p424k76L558
7792D0553J1731k089L764M45j5419k2764P921R175O792J948P282J997q852M464
7778D6948J3354Q753q803L896O073J829l065l834j5580p025l927L02m056J2609
$$ plain form
7876 87390 89240 108153 102262 92255 94809 95228 81125 76229 97349 98969 93958 84691 86949 91298
7862 91298 94406 101911 99511 88212 82000 74307 75581 90284 102854 104758 88574 90225 92780 75962
7848 75962 54116 61163 65234 69965 64934 55600 66525 78931 72996 68980 55735 50588 41878 43314
7834 43314 52550 62312 60715 59494 63402 62153 58923 76090 87017 73874 63710 57095 46903
7821 46903 44766 49451 46390 43457 45477 50542 63659 64313 61609 49418 36390 45794 53937 47913
7807 47913 48403 51369 64008 57145 53717 55284 48379 52161 69721 53003 53785 44695 37271 36995 40553
7792 40553 52284 50195 53959 54404 38985 16221 24142 33317 40109 42057 49339 51336 42484 46948
7778 46948 60302 69055 60252 64148 70221 72050 68985 65151 49571 42546 38619 38921 34865 47474
7764D7474L030p701M138J3637j696j1113l071Q177J6689P491o733l476o043j0832
7750D9971j7185j2257O772J2903j666P862R699j6049L939j2380j2649l505Q501
7737B3956J6407J8803L621j018j3637j3111P42k1206j663K4985l780j036J962
7724C5025j2891m778M569l102k845O363J8073M826m260k158o252o330q262p097
7710A0881L895K572O812J856n604J399k541Q62Q768O763J8147J4390q80l406o61
7695F3253p320j0434l389r84J3886N728k3534j0675n079P795K891J6094q601j1248
7681B8383R575J524o771p874J6576J2856q299j294K815l278j1418N283k389r284
7667B6405L594J6596j2881n200k376K013K825P821q824j828o625k781k731j329
$$ plain form
7764 47474 50504 42803 46941 60578 58882 47769 44698 52875 69564 77055 70322 66846 60803 49971
7750 49971 32786 20529 27301 40204 38538 46400 56099 40050 43989 31609 18960 15455 23956
7737 23956 40363 59166 62787 61769 48132 35021 35763 14557 12894 37879 34099 33063 35025
7724 35025 22134 17356 21925 18823 15978 22341 40414 45240 40980 38822 32570 26240 17978 10881
7710 10881 14776 17348 24160 26016 20412 21811 19270 20132 28900 35663 53810 68200 67320 63914 63253
7695 63253 55933 45499 42110 41126 55012 60740 37206 26531 21452 29247 32138 48232 39631 28383
7681 28383 37958 39482 32711 24837 41413 54269 45970 44676 47491 44213 32795 38078 35689 26405
7667 26405 29999 46595 33714 28514 26138 28151 30976 38797 29973 28145 21520 18739 16008 14679
7653A4679J0881J9425R59m629K150nM231j5433j879J1318p00K344j0857m879N886
7638C3491n095j0152M491J704j2499L406k004R445J4334J1754q040j4707L729
7625B9857R46M960L325K551K018j4088j0603O976R781O004r482n223K332r997
7611A9357q304l436P108J1413n054l953J4495K936r747p198J816L145O11J3625
7597C6814N588R9q01j632m954O408r138j4671M006J169l914K322k221p179p040
7582D856J6590J1180M446n273J2462J19M537Q102j1650j2195O74n824k150K526
7568B8400n501M274p850q658j3156J86l295J4719J6607K864L94o869r966M871
7554A7020R184J217j1763L020P782j1062p120J8773N186j4433n210O12J845m458
$$ plain form
7653 14679 25560 44985 45944 41315 43465 43460 47691 32258 30379 41697 40997 43341 32484 27605 33491
7638 33491 28396 18244 22735 24439 11940 15346 13342 22787 37121 48875 40835 26128 29857
7625 29857 30803 35763 39088 41639 43657 29569 18966 25942 35723 41727 32245 27022 29354 19357
7611 19357 11053 7617 14725 26138 21084 17131 31626 34562 24815 17617 19433 22578 23189 36814
7597 36814 42402 42501 41700 40068 35114 41522 32384 17713 21719 22888 18974 21296 19075 11896 4856
7582 4856 21446 32626 37072 31799 44261 44380 48917 57019 45369 33174 33848 28024 25874 28400
7568 28400 22899 27173 19323 10665 -2491 -2305 -5600 9119 25726 28590 28984 22115 12149 17020
7554 17020 26204 27421 15658 18678 26460 15398 8278 27051 32237 17804 12594 13206 15051 10593
7540A0593k487J5715O720J3729n028m880m425j5589j3399J3459k141L264m095
7527A1436P718m30K115O475k0M76r032R213R505J3116m210l957n482k627p547
7512B6749j9552Q108M095k1038j3114k907P322Q420J2217J1651m718M502Q125
7499B9860m653k787Q551Q75r450o336P234O734j832j8473n03k886J1302J1816
7485B9452J922q387N348M689Q419j5718j4455m53R843p153M593P383k634O634
7471B9483J9281p966q983n028M449l078L012l40j694j0302p945j2679j688J0607
7457G129O352m421k167j4197k270J3779J4532L261M473L204o643j2502K225P251
7443B0006j2683l707P132J0863k571L496O408N944j061j4982o624R783m639o302
$$ plain form
7540 10593 8106 23821 30541 44270 39242 34362 29937 14348 949 14408 12267 15531 11436
7527 11436 19154 18724 20839 27314 27294 27770 18738 27951 37456 50572 46362 42405 36923 34296 26749
7512 26749 7197 15305 19400 -1638 -14752 -17659 -10337 -1917 10300 21951 17233 21735 29860
7499 29860 25207 22420 30971 31846 22396 16060 23294 30028 28196 9723 9220 6334 17636 29452
7485 29452 31374 22987 28335 33024 41443 25725 11270 10817 20660 13507 18100 25483 22849 29483
7471 29483 48764 40798 31815 26787 31236 28158 31170 30830 29136 18834 10889 -1790 -3478 7129
7457 7129 13481 9060 6893 -7304 -9574 4205 18737 21998 26471 29675 23032 10530 12755 20006
7443 20006 7323 3616 10748 21611 19040 22536 28944 34888 33827 18845 12221 22004 17365 11063
7429A1063R598L948N800p598n087J3263p936r933K334P027n675q275J1921R011
7415B9461j2371J09K51M967J870r539N889J0420n731n103n654J0143q104K331
7401A8939J3062J0875j0050k1994m495O476J98j507R442L820l665n950J041J4130
7387C0322Q246N152p911P539M796k0317k276j654j5156p227j888r774J1553j791
7373c86j1789k987J4580J6550M525q026j1030J820J2231j0717j76q596r605L408
7359a0198R933R891k446N060Q24k500J3002o553n073j0504j053R482n021m540
7345C04j174J3466M716j1069k152n998l305J5049K952o416j677K459J1385J3798
7331C2338q43j4567l343m784m06J505M18p745k247J5336K517k4610o67R264j3862
$$ plain form
7429 11063 20661 24609 30409 22811 17724 30987 23051 13118 15452 22479 16804 8529 20450 29461
7415 29461 17090 17199 17450 22417 24287 14748 20637 31057 25326 20223 14569 24712 16608 18939
7401 18939 32001 42876 32826 10832 6337 12813 13011 11504 20946 24766 21101 15151 16192 30322
7387 30322 38568 43720 35809 43348 48144 27827 25551 23897 8741 1514 -374 -10148 1405 -386
7373 -386 -12175 -15162 -582 15968 20493 12467 1437 3257 15488 4771 4595 -4001 -13606 -10198
7359 -10198 -265 9626 7180 12240 13064 10564 23566 17013 11940 1436 383 9865 4844 304
7345 304 -870 12596 17312 6243 4091 -1907 -5212 9837 12789 6373 4696 7155 18540 32338
7331 32338 31495 16928 13585 8801 8395 9900 10318 2573 326 15662 18179 -6431 -7098 2166 -11696
7316a1696L761J6518N789n248r754j0783r43O941O370N760Q471N704j9279n968
7302d357k818j408K716J52J2173J2253K594j9292j891J4924j57j2156P457m207
7288E983n328o432L335l336n488j318Q752N34L326j616j891M919n570k238R712
7273C344k385l368O217k534j451n249M615J635J1100m252l584m941N431J1896
7259A6474J727N66J2910J0285j1671j082p35M095n695j4515p390k356M215J0288
7245A7116p370j969k990K545K641K238R36N790q350k839l043Q290J1259M466l780
7230B4940r727j6982k455p706R386n743K31L612M087M456R80O058m470J4685N311
7215B6663j3209o905n035L47J457l612L651l667K20l07J5854r325q114L316J0786
$$ plain form
7316 -11696 -7935 8583 14372 9124 -630 -11413 -12356 -5415 955 6715 15186 20890 1611 -4357
7302 -4357 -7175 -8583 -5867 -5715 6458 18711 21305 2013 122 15046 14889 2733 10190 5983
7288 5983 655 -5777 -2442 -5778 -11266 -12584 -3832 -3298 28 -1588 -3479 1440 -4130 -6368 3344
7273 3344 959 -2409 3808 1274 -177 -5426 -811 824 11924 7672 4088 -853 4578 16474
7259 16474 18201 18767 31677 41962 30291 29209 28474 32569 26874 12359 4969 2613 6828 17116
7245 17116 9746 7777 4787 7332 9973 12211 13147 18937 10587 7748 4705 12995 24254 28720 24940
7230 24940 15213 -1769 -4224 -11930 -2544 -8287 -8056 -4444 -357 4099 5079 11137 6667 21352 26663
7215 26663 13454 6549 1514 1861 3318 -294 3357 -310 -90 -397 15457 6132 -1982 1334 12120
7200A2120J8955Q834j528j3706l148j0116J4536P478l564J110J68k2225N58R688
7186A9160R479J5376j3610j6107kN378l002j9473j7748m883J3577J9L527l378
7172a1687k77J693J015o010k679J3612P182J587L738K4285l161j6796m503k412
7158E587m235N587J8974j2385j4697K072R284J2120K3557j0458k4635J731p20
7145A1782K308j3385R04K0065m928j7323M88k932L11J593r874q647R138q05Q554
7130b751J55l913J5556O289r908j253j8708k853N616M807J4506J3856o864j9528
7116d993j0115L903o866r938J4009R838R611M25N56O5k0335j537P723O544J0221
7101I111p903J190P033L847p296J894l060k919j271n719k1135L200J0986l231
$$ plain form
7200 12120 31075 39909 38381 24675 21527 11411 25947 33425 29861 30971 31139 8914 9472 19160
7186 19160 28639 44015 30405 14298 14296 19674 16672 -2801 -20549 -25432 -11855 -11836 -8309 -11687
7172 -11687 -11964 -10271 -9256 -15266 -17945 -4333 2849 4436 8174 32459 29298 12502 7999 5587
7158 5587 1352 6939 25913 13528 -1169 903 10187 22307 45864 35406 10771 12502 11782
7145 11782 14090 705 1609 21674 16746 -577 -89 -3021 -2710 -1117 -10991 -19638 -10500 -11305 -2751
7130 -2751 -2596 -6509 9047 15336 5428 4175 -14533 -17386 -11770 -6963 7543 21399 14535 -4993
7116 -4993 -15108 -11205 -18071 -28009 -14000 -4162 5449 5874 6430 6495 -13840 -15377 -7654 -1110 9111
7101 9111 1208 2398 9431 13278 5982 7876 4816 1897 626 -5093 -26228 -23028 -12042 -15273
7087a5273N601J0974L320O048N191o188l139l961n223q907K284N052J4908P371
7073A8058n874j3674L310m651k457n289P576K911m953n959n50J1160m49l981O810
7058A988J1544K126k1450j3904l512j961J1946N363P332j515j721O616J2013R540
7044B4405n135k0510q602M378J0182J1399O67j116M358O208J581r056j4279q300
7030c820R36j0323P912K8l829P20l256k268J473J9978j1555o640M47j537M639
7015g095K108J1066K219L37j1225m490J3411l868j4458O123Q267O140n399k114
7001A022l136N021o366M757J4141K516p186p38p662M166p325q677J203R444J0184
6986A1364J009j1889L494j732j128k886J0624J5683q653k725q868k427L84l884
$$ plain form
7087 -15273 -9672 1302 4622 10670 15861 9673 6534 2573 -2650 -11557 -9273 -4221 10687 18058
7073 18058 12184 -1490 1820 -2831 -5288 -10577 -3001 -90 -5043 -11002 -11552 -392 -841 -4822 1988
7058 1988 13532 15658 -5792 -19696 -23208 -25169 -13223 -7860 -528 -2043 -3764 2852 14865 24405
7044 24405 19270 -1240 -9842 -5464 4718 16117 16784 15668 20026 26234 27815 18759 4480 -3820
7030 -3820 -2884 -13207 -5295 -5267 -9096 -8376 -11632 -13900 -12427 7551 -4004 -10644 -10197 -11734 -7095
7015 -7095 -4987 6079 8298 8635 -2590 -7080 6331 2463 -11995 -5872 2395 8535 3136 1022
7001 1022 -2114 2907 -3459 1298 15439 17955 10769 10031 2369 6535 -790 -9467 -8264 1180 11364
6986 11364 12373 484 3978 2246 1118 -1768 8856 24539 15886 13161 4293 1866 2250 -1634
6972a634Q685J1453k183n622o697J9937q201k4270J071j168J2238J5015Q162O202
6958C2988j504m752j8850j8070j354J3107O057j203O920K172K493L50L015o657
6944A4712k115p903n596o206J0994N456p700n226l866N986J0518j0686p051m283
6930a2966K0801R14j946K893M161n866M35J472l003K321j396k948M055n394p131
6915c598q422P436j273l014J263l337j545K967R363J9042j1921j7113l597J3427
6901c22O621j3718J227J0363j572J589J124J411m616j1069o448O914J1425J620
6887D549N859Q706j5807L812k126K954k201Q681j829L175J7854P414p006j9112
6873A4923J13M6M124J2801j888q063q970M172p898R82q696k1499k889J1166K361
$$ plain form
6972 -1634 7051 18504 16321 10699 4002 23939 15738 -8532 -7461 -8629 3609 18624 26786 32988
6958 32988 31484 26732 7882 -10188 -11542 1565 7622 6419 13339 15511 18004 18354 21369 14712
6944 14712 12597 4694 -902 -7108 3886 9342 1642 -3584 -7450 -1464 9054 -1632 -8683 -12966
6930 -12966 7835 8749 6803 9696 13857 7991 8426 9898 6895 9216 7820 4872 8927 3533 -3598
6915 -3598 -12020 -4584 -5857 -8871 -7608 -10945 -12490 -9523 -160 18882 6961 -10152 -13749 -322
6901 -322 6299 -7419 -6192 4171 2599 4188 5312 6723 2107 -8962 -15410 -8496 2929 4549
6887 4549 10408 19114 3307 7119 4993 7947 5746 14427 12598 15773 33627 41041 34035 14923
6873 14923 15036 15082 19206 32007 30119 22056 13086 17258 9360 10342 1646 -19853 -22742 -11576 -9215
6858i215p442q59J8942J6021J010j452Q115J494q231q674j606m028l217M520j2467
6843g089j3278J1793J0881N072m82k39j0905j2837k71J0131P364j0414M028m11
6829f657j4623j820J4029l637J877q904j0131P875J0381O731N931R694J4298l109
6815B1935j6745r096j1886p472Q115J502J9109J0799l095J0429N03k4547K440
6802A991O694N484j216m654J2524o24m65l172p35j4345q203Q972Q427P365R283
6787B7326j8362k1409L027o877L067J249J668M874L828p421N055Q385J4266M763
6773B3439k542n348N110j182M233k198o186q806n394M738Q525k3725j1995J5082
6759f249J3960M835o598o481j96M967O386m97k353j2226P536R875k909j11q508
$$ plain form
6858 -9215 -16657 -17516 1426 17447 18457 17005 25120 26614 18383 9709 8103 4075 858 5378 -7089
6843 -7089 -20367 -8574 2307 7379 6897 6658 -4247 -17084 -17355 -7224 140 -10274 -6246 -6657
6829 -6657 -21280 -23100 -9071 -12708 -10831 -19735 -29866 -21991 -11610 -4879 1052 10746 25044 21935
6815 21935 5190 -3906 -15792 -23264 -15149 -13647 5462 16261 13166 23595 24098 -449 1991
6802 1991 8685 14169 12953 8299 20823 20199 19734 16562 15827 1482 -6721 2251 10678 18043 27326
6787 27326 8964 -12445 -9418 -16295 -13228 -11979 -10311 -5437 -1609 -9030 -3975 4410 18676 23439
6773 23439 20897 15549 20659 19477 23710 21512 15326 6520 1126 5864 14389 -9336 -21331 -6249
6759 -6249 7711 12546 5948 -533 -729 4238 10624 10127 7774 -4452 3084 12959 10050 9939 1431
6744A431p304N697R691q818j3342J780n288K563m682J972R63P437M705O098M180
6729G083N53q317l73K55Q409P571p976J3380o319q303O85J772J541o501o892O704
6713C272J5841K905j1758p547L390N349O635Q906p964j4830n955L854k230p114
6699g246p953P603k972M175J436J7686J1498o578j0550m390Q531O279k028r599
6685E892L716R236m254L02O452J6288J1823p253o577j5364j4503K403qj036j0102
6670b985M312K992n274r1R176k680j570N969R880n127J2193p485j5531Q410m955
6655G234P612J514k802p634p958n68l94L549k005K023P305Q58J1856N717k945
6640B3362j2665r545K010R814l890j3304O392k555K811o02J428o056O087P966
$$ plain form
6744 1431 -5873 -176 9515 697 -12645 -10865 -16153 -13590 -18272 -16300 -15337 -7900 -3195 2903 7083
6729 7083 7636 -681 -1054 -799 7610 15181 7205 20585 14266 5963 6648 8420 9961 3460 -3432 3272
6713 3272 19113 22018 10260 2713 6103 11452 18087 26993 19029 4199 -1756 2098 -132 -7246
6699 -7246 -15199 -7596 -10568 -6393 -4957 12729 24227 17649 7099 2709 11240 17519 15491 5892
6685 5892 9608 18844 14590 14892 21344 37632 49455 42202 35625 20261 5758 8161 8153 7117 -2985
6670 -2985 1327 4319 -955 -1046 8130 5450 3880 9849 19729 14602 26795 19310 3779 12189 7234
6655 7234 14846 16360 13558 5924 -2034 -2602 -2996 553 -1452 571 7876 8734 20590 26307 23362
6640 23362 10697 1152 3162 12976 9086 -4218 2174 -381 2430 1828 3256 -2800 3287 11253
6626A1253j5m873q95l177R738j070O5N035J95k5738l319J3339J7721R225J310
6611B8794m674r313j1942j1360N362J3403J0699j178j1358p80M763j860j5518
6598d962N136J2603j0665M14m572k488K396M923J6536k750J597J1920J5309j818
6584D3579m135j3088M64J0554n05l647j2930r739j2156j0726O914N480j24K026
6570A967n914P588o471M83o279K943J323M919J2896m256q65N308L411r597r482
6555b026J3873O351j1996k559O16J2454J1058P42R92j8075j6213q224j230R002
6541e235N260J293O543J3354j0417q87o482r610j929J7088N3m382K195K136k611
6526F369M683m465k419M757l917L058p915l366N413l570p576O781J891J761M469
$$ plain form
6626 11253 11238 6365 5470 2293 12031 10961 11026 16061 16256 -9482 -12801 538 18259 27484 28794
6611 28794 24120 14807 2865 -8495 -3133 10270 20969 19791 8433 7653 12416 10556 -4962
6598 -4962 174 12777 2112 2526 -2046 -4534 -2138 2785 19321 16571 18168 30088 45397 43579
6584 43579 39444 26356 26820 37374 36869 33222 20292 10553 -1603 -12329 -5415 65 -59 1967
6570 1967 -3947 3641 -2830 -2347 -8626 -5683 -4360 559 13455 9199 8334 13642 17053 7456 -2026
6555 -2026 11847 18198 6202 3643 4259 16713 27771 28513 29505 11430 -4783 -13007 -14237 -5235
6541 -5235 25 1318 7861 21215 10798 9911 3429 -6181 -8110 8978 9031 4649 6844 8980 6369
6526 6369 11052 6587 4168 8925 5008 8066 151 -3215 2198 -1372 -8948 -2167 -276 1485 5954
6511E954P028M054p620K253P417l467m73k258O701k808p944k521n597N331J706
6496G756O704J388J216j0937k979Q584L664L749j435n156K801j3693j9064L055
6482a4347N11J949j18O000n990J0692n591L715J479j4484q754P002K0109p337
6468e164k25n559l614p030J101L470O060P82J2808n444l774j5004J349P645J1925
6453f74m858JO626o658j5486r339J0606J1303O085q140l567J4031m588j8074J1225
6438a1507O009j0838L939M729N754M974l437L981Q653N658j2891j4966l681N057
6424h566J160O418k64m9j164M460N284j490P762k580l390R585L505o055j7453
6409b837r692l590N081J0215M208J4000k561O622j24n342j5536q103Q035L300
$$ plain form
6511 5954 12982 17036 9416 11669 19086 15619 15146 12888 19589 16781 8837 6316 719 6050 7756
6496 7756 14460 15848 17064 6127 3148 11732 15396 19145 17710 12554 15355 1662 -17402 -14347
6482 -14347 -13836 -11887 -12005 -6005 -11995 -1303 -6894 -3179 -1700 -16184 -24938 -17936 2173 -5164
6468 -5164 -5389 -10948 -14562 -21592 -20491 -17021 -10961 -10179 2629 -2815 -6589 -21593 -20244 -12599 -674
6453 -674 -5532 -5531 1095 -5563 -21049 -30388 -19782 -8479 -2394 -10534 -14101 -70 -4658 -22732 -11507
6438 -11507 -5498 -16336 -12397 -7668 -1914 3060 -377 3604 12257 17915 5024 -9942 -13623 -8566
6424 -8566 -7406 -988 -1252 -1301 -2465 1995 7279 5789 13551 10971 7581 17166 20671 14616 -2837
6409 -2837 -12529 -16119 -11038 -823 3385 17385 14824 21446 21322 15980 444 -7659 376 3676
6395C676q798n125R715n454N486n800M719R460O194K042j0946n226M640j1214
6381f631m087J2606M654o446o143o563J0782p306n888J0551Q743k81r450k4M579
6366i04J0026k702K52m222R73j208m062n648j1220J795J5117O091m617j0399M249
6351f479L635j4185j7250N419J5040P877N773L339l945j4176r124K655K452o486
6337b5455J456P677K617l65L749Q589K739j865l326q34P877R184M331j2142N897
6322A0129M935o092r0R5K415k426j4710j111K0951J0685j0832j2264J1803J866
6308A5354j2746j1751J4559m447j4870l700q273J2278l506K297N903J4296J8286
6295B3680k931J390j0097r971m673j0826j1561J1322J9096J542j135K897r427
$$ plain form
6395 3676 -5122 -10247 -532 -5986 -500 -6300 -1581 7879 14073 16115 5169 -57 4583 -6631
6381 -6631 -10718 1888 6542 96 -6047 -12610 -1828 -9134 -15022 -4471 4272 3991 -5459 -5483 -904
6366 -904 9122 6420 6672 2450 3423 2215 -1847 -7495 -18715 -16920 -1803 4288 -329 -10728 -6479
6351 -6479 -2844 -17029 -34279 -28860 -13820 -5943 -170 3169 -776 -14952 -24076 -21421 -18969 -25455
6337 -25455 -23999 -16322 -13705 -14070 -10321 -1732 1007 -858 -4184 -5018 2859 12043 16374 4232 10129
6322 10129 15064 8972 8882 8977 11392 8966 -5744 -6855 14096 24781 13949 1685 13488 15354
6308 15354 2608 -9143 5416 969 -13901 -17601 -25874 -13596 -17102 -14805 -8902 5394 23680
6295 23680 20749 22139 12042 2071 -2602 -13428 -24989 -13667 5429 6971 5836 8733 -694
6282f94N517n069N561J4526K945n874r795r695Q860q29l221Q567N454k123o398
6267G732J0189l442j1492j1071p708N702q93K629R837N872j0991M466M798k550
6253C078K164N057j2808r750J2712N861K09K832o338m585J555J4629K415k194
6239A4837N739N764n702j7163p671m54m163j80j1311j1870p62K2646J6884k128
6225D466k03L943N276n70r956j6325R172n82j5017l670J5462J040J2166o55P703
6210A2250P282m978j5249j0064q68r237J7139J5819j1583r015Q618m686p210m439
6196a6221M676J891q744R518J6778m669p505o07n754L771L394K417O794j4317
6182h578p897j670n077J423J3593N73Q047j2584j0019J0303J0303q008l956K502
$$ plain form
6282 -694 4823 -246 5315 19841 22786 16912 7117 -2578 6282 5453 2232 10799 16253 14130 7732
6267 7732 17921 14479 2987 -8084 -15792 -10090 -10983 -8354 1483 7355 -3636 830 5628 3078
6253 3078 5242 10299 -2509 -12259 453 6314 6523 9355 3017 -1568 -13 14616 17031 14837
6239 14837 20576 26340 20638 3475 -4196 -4650 -8813 -8993 -20304 -32174 -32936 -10290 6594 4466
6225 4466 4263 8206 13482 12912 2956 -13369 -4197 -4779 -19796 -23466 -8004 -6964 5202 4547 12250
6210 12250 19532 14554 -695 -10759 -11627 -20864 -3725 12094 511 -8504 114 -4572 -11782 -16221
6196 -16221 -11545 -9654 -18398 -8880 7898 3229 -4276 -4883 -10637 -6866 -3472 -1055 5739 -8578
6182 -8578 -16475 -18145 -23222 -21799 -8206 -7633 414 -12170 -22189 -11886 -1583 -9591 -13547 -11045
6168a1045R919P91l956r76N634J2035J1583j778j1347N994N035q388K701p578
6154H624j9815P294J3907L606k0122o473n018J5777j110k307j719l086P281J9744
6140A6583j5413k41Q364j1040j265m897o562Q801K833M235Q965j68K696q099j3303
6125h511%R432L218m549O640o465l212j3124k96P611N122l755Q93p315P779J9533
6109A3001K679M23O186j336P332J583j5934r896M705m727n378m3j0187o336r770
6094b7698M741J257O910N99R208P741M536j724j43L077r337j7257M877K5655M461
6079A6903K612P91j1980n01o672P808Q299l05j8672o700n46R551P142p163l056
6064b489q621q711j005J4984J4153q891l517R15N97k493J099p36L6k789K320J1710
$$ plain form
6168 -11045 -1126 -335 -4291 -5267 367 12402 23985 22207 10860 16854 21889 13501 16202 8624
6154 8624 -11191 -3897 10010 13616 -6506 -12979 -17997 -2220 -3330 -5637 -7356 -10442 -3161 16583
6140 16583 1170 929 9293 -1747 -3012 -7909 -14471 -5670 -2837 1398 10363 10195 12891 4792 -8511
6125 -8511 -8511 921 4139 -410 6230 -235 -3447 -16571 -16867 -9256 -4134 -7889 -6996 -14311 -6532 13001
6109 13001 15680 16103 22289 20953 28285 29868 13934 4038 8743 4016 -1362 -1405 -11592 -17928 -27698
6094 -27698 -22957 -21700 -14790 -14191 -4983 2758 7294 5570 5427 8504 -833 -18090 -13213 12442 16903
6079 16903 19515 20306 8326 7825 1153 8961 17260 16955 -1717 -8417 -8963 588 7730 567 -2489
6064 -2489 -11110 -19821 -20826 -5842 8311 -580 -4097 -3182 -2585 -5078 -3979 -4715 -4679 -7468 -5148 6562
6048F562k468o31J2091k993j3286j4941l379J2669J0620O845M496r78p071q339
6034h03K510N097l941J464p603j2614J373M183P874Q664K706o69p450K908j0050
6019f351J815o924N11J0057O565n149K601O788k119j0680q93p93m637q7k646J156
6003a0786r625J2050K081k317L94j786r258j1653P753J3472K3766l401k6744M704
5989a1350O496K629q074q032M783l747K689J1998J5316k220q583O943Q852j2327
5975E373j1797L879j009J1244K724r943j2822K939L356M288m051k718N375J908
5961a254M079j647j0093J3260R097L029p198l258L298q475R315k330m610M953
5947H166N934j0551j3801L978J1908q336k401J3459j016k685n781N264K059R150
$$ plain form
6048 6562 4094 3463 15554 12561 -725 -15666 -19045 -6376 4244 11089 15585 14607 7536 -803
6034 -803 1707 6804 2863 4327 -3276 -15890 -14517 -10334 -2460 6204 8910 8241 791 3699 -6351
6019 -6351 -4536 -11460 -10949 -892 5673 524 3125 9913 7794 -2886 -3779 -4572 -9209 -9296 -11942 -10786
6003 -10786 -20411 -8361 -6280 -8597 -8203 -9989 -19247 -30900 -23147 -9675 14091 10690 -16054 -11350
5989 -11350 -4854 -2225 -10299 -18331 -13548 -17295 -14606 -2608 12708 10488 1905 8848 17700 5373
5975 5373 -6424 -2545 -3554 7690 10414 471 -12351 -9412 -6056 -1768 -5819 -8537 -3162 -1254
5961 -1254 2825 1178 -8915 4345 13442 16471 9273 6015 9313 838 10153 7823 3213 8166
5947 8166 14100 3549 -10252 -6274 5634 -2702 -5103 8356 7340 4655 -1126 4138 6197 15347
5933A5347j0259NQ179M741p020j1292j3125Q399r86m820k25m568J244m597j4645
5918c3622q056J0104J4590J0642K4227o049j2815m797j3014j0005J464J9106R942
5905A717j0950j0826K482J6161n536j833N145m580j1718m66O902J0206J1330k369
5891E665j0545K05J5886j668p374k2900n6J3331p708k291L566J6655l703j3594
5877a4531l78O510K056Q197J095j0406k577r644Q705J850Q980l415K1255N186
5863B2883j4296r389n461p737J016J2579J3200M160j0416p082j1982k706M320
5850a0911Q284m319N008J5217l499j0162L281L486o360p776q264P623J0919J8841
5836B1368N307o302n993j264j593l380j283J5872k262j7779j613j1567j94L610
$$ plain form
5933 15347 5088 5093 13272 18013 10993 -299 -13424 -5025 -6011 -10831 -11056 -15624 -14380 -18977 -33622
5918 -33622 -41678 -31574 -16984 -6342 17885 11836 -979 -5776 -18790 -28795 -27331 -8225 1717
5905 1717 -9233 -20059 -17577 -1416 -6952 -8785 -3640 -8220 -19938 -20404 -13502 -3296 8034 5665
5891 5665 -4880 -4675 11211 9543 2169 -20731 -20787 -7456 -15164 -17455 -13889 2766 -937 -14531
5877 -14531 -14909 -8399 -6343 1854 2949 -7457 -10034 -19678 -10973 -9123 -143 -3558 17697 22883
5863 22883 8587 -802 -6263 -14000 -12984 -405 12795 16955 6539 -543 -12525 -15231 -10911
5850 -10911 -2627 -6946 -1938 13279 9780 -382 2899 6385 25 -7751 -16015 -8392 2527 21368
5836 21368 26675 20373 14380 13116 11523 8143 6860 22732 20470 2691 1078 -10489 -10683 -7073
5822g073l912J4083J2108o15L971O540j2126j0958L241J1999K878Q279J0571q852
5808C0134J958r212r018M785n750j0019q686l5Q485J0871P859j401j8807n671
5794d507l3J0972K886k5617K323J2129p757j2687O976l09p300J1295p881J1006
5780h504j0085n652J2269K0790p595j748j409n614P550O512n211j1497P195J5456
5766A2457m680m109P060O572k894J429j918j1342O016p236o139l85r81m472J2996
5751B374L333P393p804j0151j2725l741M019Q511R556p492O063m606j1913l747
5737b0930J167Q818P202O534J944j5573j6486J588j183K0J2208J938J4731n186
5723c208P843N552O30q364r803q489k046M152k078r201j214M553K2210m391n699
$$ plain form
5822 -7073 -10985 3098 15206 14591 18562 25102 12976 2018 5259 17258 20136 28415 38986 30134
5808 30134 32092 22880 13862 18647 12897 2878 -5808 -5843 2642 13513 21372 19971 1164 -4507
5794 -4507 -4540 6432 9318 -16299 -13976 -1847 -9604 -22291 -15315 -15624 -22924 -11629 -19510 -8504
5780 -8504 -18589 -24241 -11972 8818 1223 -525 -1934 -7548 2 6514 1303 -10194 -2999 12457
5766 12457 7777 3668 10728 17300 14406 15835 13917 2575 8591 1355 -4784 -5169 -6150 -10622 2374
5751 2374 5707 13100 5296 -4855 -17580 -21321 -17302 -8791 765 -6727 -664 -5270 -17183 -20930
5737 -20930 -19763 -10945 -3743 2791 4735 -10838 -27324 -25736 -26919 -26899 -14691 -12753 1978 -3208
5723 -3208 4635 10187 10817 2453 -7350 -15839 -17885 -13733 -15811 -25012 -26226 -21673 537 -3854 -9553
5708i553Q8j549K01J0016P206k30q097K105l060j8196j7119j79J321j2555J0160
5693c9441K0276N034Q771L01k116J7321o52r860M131J2683L806J907r611j1116
5679A434m945k38r924J250j632O423J2457K88n251l269L881k638l082J0452R104
5664A4310O991m7k313j0953M77n648j7038q19j657K0169Q075N544o684j2392m357
5649f342Q929K139r333P038m42l060P191Q83M132k143M818R189o153K789m16k1296
5633b077j4721o449p626M145R796J3257o279p760m36n218O034K0250J4290j4817
5619B389j7041J995J4251r082K390M075m777K123k724J3045O678j8553j0294J0079
5605e446J759m895j64L116Q380Q278l035J0545J763l35l60J2196M881j3166j0229
$$ plain form
5708 -9553 -9465 -11014 -10813 -797 6409 6179 -1918 187 -2873 -21069 -38188 -38367 -37046 -49601 -39441
5693 -39441 -19165 -14131 -5360 -5059 -7175 10146 9494 -366 3765 16448 20254 22161 12550 1434
5679 1434 -3511 -3749 -13673 -12423 -14055 -7632 4825 5113 -138 -3407 474 -2164 -5246 5206 14310
5664 14310 21301 21254 18941 7988 8465 2817 -14221 -15040 -16697 3472 11547 17091 10407 -1985 -6342
5649 -6342 2587 4726 -4607 2431 1989 -1071 6120 7003 11135 8992 13810 22999 16846 19635 19219 -2077
5633 -2077 -16798 -23247 -30873 -26728 -16932 -3675 -9954 -17714 -18150 -23368 -17334 2916 17206 2389
5619 2389 -14652 -12657 1594 -7488 -5098 -1023 -5800 -3677 -6401 6644 13322 -5231 -15525 -5446
5605 -5446 -3687 -8582 -8746 -5630 2750 11028 7993 18538 20301 19966 19606 31802 36683 23517 13288
5590A3288q07j3715K882j5799l309M417k660k350K34J5505J6690L565o988j779
5576I174N607J337J1510k199q997j3302q540j6217O94J73R829L071M499R516m252
5561A903n30j0521o499L838j793j1563J6073K959L315O286o672j5287M961j848
5547a5378m190K1663m715n383J4873o035j5306p520Q063L622K994L384M249P231
5533G552j2264j9690n776J7432J2387N542m740r186r748O154M550m233j278k405
5519a5703l100O394R803M618n447O487L25j1522R05J1868J0420K991o302J105
5505A2842j5793p866J196L091k410O914P196n38n004p771j7098L562q80N846J1531
5490e182J385q010j5019N469o207Q1J0378m084N558L962k450L228Q536P339r177
$$ plain form
5590 13288 12481 -1234 1648 -14151 -17460 -13043 -15703 -18053 -17819 -2314 14376 17941 10953 9174
5576 9174 14781 16118 27628 25429 16432 3130 -5410 -21627 -20933 -20760 -10931 -7860 -3361 6155 1903
5561 1903 1373 -9148 -15647 -11809 -13602 -25165 -9092 -6133 -2818 3468 -3204 -18491 -13530 -15378
5547 -15378 -19568 2095 -2620 -8003 6870 835 -14471 -21991 -13928 -10306 -7312 -3928 321 7552
5533 7552 -4712 -24402 -30178 -12746 -359 5183 443 -8743 -18491 -12337 -7787 -12020 -13298 -15703
5519 -15703 -18803 -12409 -2606 2012 -3435 3052 3377 -8145 -7240 4628 15048 18039 11737 12842
5505 12842 -2951 -10817 -9621 -6530 -8940 -2026 5170 4632 -372 -8143 -25241 -21679 -22559 -16713 -5182
5490 -5182 -3797 -11807 -26826 -21357 -27564 -27483 -17105 -21189 -15631 -11669 -14119 -10891 -2355 4984 -4193
5475d193m695P520m403m567j3868o26M677N882M729l735j794O414j2742P23K7361
5460F683R584q841L382m59j5949J3610L634j4440J705j0027n699J898O815J8991
5446A0887K1663m015j7959j5688J2045K1384J1577k794n667k4876j6028J0552
5434A081r105L408k299Q267P344O709l011j8228j4174L856J1750j3359M860N599
5420g302n869J657K1278M109K924L260j1458k7098k707J076O432J30K213J350
5406a0005o563J5185M637J603L665Q372q130j1763R304M916j0635j620j919J3821
5392A0868J6486r782L807p117j0969k338J8508M845j3491j6308M930R938O2j0446
5378a007J318r183q269J221J7556Q703J209q669M62k123m383l593p080J1619K0033
$$ plain form
5475 -4193 -8888 -1368 -5771 -10338 -24206 -24832 -20155 -14273 -9544 -13279 -15073 -8659 -21401 -20678 6683
5460 6683 16267 7426 10808 10349 -5600 8010 11644 -2796 -1091 -11118 -16817 -14919 -8104 10887
5446 10887 32550 28535 10576 -5112 6933 28317 39894 37100 31433 6557 -9471 1081
5434 1081 -8024 -4616 -6915 1352 8696 15405 12394 -5834 -20008 -16152 -4402 -17761 -12901 -7302
5420 -7302 -13171 -11514 9764 13873 16797 20057 8599 -18499 -21206 -20130 -13698 -13568 -11355 -10005
5406 -10005 -16568 -1383 3254 4857 8522 16894 8764 -2999 6305 11221 586 -1034 -2953 10868
5392 10868 27354 17572 21379 14262 3293 955 19463 24308 10817 -5491 -561 9377 9439 -1007
5378 -1007 311 -8872 -17141 -15920 1636 10339 11548 2879 3341 1218 -3165 -6758 -13838 -2219 17814
5363A7814O973j7281P56o56P619J5321O264o347j2645j9207l812O124j845n175
5349f097n18k891p272P753p18k091k625J0572O821R706j880l489p334K5k773l577
5333f388N12Q64j2656Q102K079R16J4965J649l872k200J0147q135R033L779j1955
5318F840n288j5498M648L189P734j780l221m12Q321M087J667j7857P32J0162j12
5303C212R412O746m478k0009M296R02R089L167k2823j3657R586R947J1519J4770
5289B1679l853k0734p599O726J0561r298P602N678q996j2067K18M308J1098M838
5275A0161q766k818j986N362J2060j683o942j1083m777J0710J1218o210j0346
5262e100J49j5427p555Q75j817l834N877J2594r086r114J3907R222R989J4565
$$ plain form
5363 17814 24787 7506 8262 7606 15225 30546 36810 30463 17818 -1389 -5201 923 -922 -6097
5349 -6097 -6615 -9506 -16778 -9025 -9743 -11834 -14459 -3887 2934 12640 10760 7271 -63 -38 -2811 -6388
5333 -6388 -5876 -5012 -17668 -9566 -7487 -6571 8394 10043 6171 3971 14118 5983 15016 18795 6840
5318 6840 1552 -13946 -9298 -6109 1625 -155 -3376 -3788 4533 8620 10287 -7570 -6838 3324 3212
5303 3212 12624 19370 14892 -5117 -821 81 9170 12337 -10486 -24143 -14557 -4610 6909 21679
5289 21679 17826 -2908 -10507 -3781 6780 -2518 5084 10762 1766 -10301 -10083 -5775 5323 10161
5275 10161 1395 -1423 -3409 1953 14013 12330 5388 -5695 -10472 238 11456 5246 -5100
5262 -5100 -4951 -20378 -27933 -27058 -28875 -32709 -26832 -14238 -23324 -32438 -18531 -9309 680 15245
5248A5245P852m413R204m228p317n563O604J3486J672j2407j4833l359l758k671
5234d486K840j534J9644K798m256r580M30m356m116P880R060k491j4818o085m185
5219a3255j4041L231J0681K3230k460K985j008q214Q624J5065n546m683o221j4466
5205f078N187O248j4763j2750l188n283J0628J7119J3688O672J160L277j1093
$$ plain form
5248 15245 23097 18684 27888 23660 16343 10780 17384 30870 32542 20135 5302 1943 -1815 -4486
5234 -4486 -1646 -3180 16464 19262 15006 5426 5856 1500 -2616 5264 14324 11833 -2985 -9070 -13255
5219 -13255 -27296 -24065 -13384 9846 7386 10371 9363 1149 9773 24838 19292 14609 8388 -6078
5205 -6078 -891 5357 -9406 -22156 -25344 -30627 -19999 -2880 10808 17480 18640 21917 10824
$$ [...]
##END NTUPLES=NMR SPECTRUM
##END=
