##TITLE=Analysis number 327268
Compound Code cc 62610
Book Reference 494/136
Project Code adrs
Chemist Name craigr
##JCAMPDX= 6.0         $$ Bruker NMR JCAMP-DX V2.0
##DATA TYPE= NMR SPECTRUM
##DATA CLASS= NTUPLES
##ORIGIN= Bruker BioSpin GmbH
##OWNER= nmr
$$ XWIN-NMR		Version 3.5
$$ Mon Mar 19 10:00:20 2007 GMT Standard Time (UT+0h)  MAYBRIDGE\nmr@NMR_250MHZ
##.OBSERVE FREQUENCY= 250.131544655141
##.OBSERVE NUCLEUS= ^1H
##.ACQUISITION MODE= SIMULTANEOUS (DQD)
##.ACQUISITION SCHEME= undefined
##.AVERAGES= 16
##.DIGITISER RES= 18
##SPECTROMETER/DATA SYSTEM= dpx250
##.PULSE SEQUENCE= zg30
##.SOLVENT NAME= CDCl3
##.SHIFT REFERENCE= (INTERNAL, CDCl3, 0, 16.522)
##AUDIT TRAIL= $$ (NUMBER, WHEN, WHO, WHERE, WHAT)
$$ ##TITLE= Audit trail, XWIN-NMR		Version 3.5
$$ ##JCAMPDX= 5.01
$$ ##ORIGIN= Bruker BioSpin GmbH
$$ ##OWNER= nmr
$$ C:\u/data/dgb/nmr/ADRS/1160/pdata/1/auditp.txt
$$ ##AUDIT TRAIL=  $$ (NUMBER, WHEN, WHO, WHERE, WHAT)
(   1,<2007-03-19 09:59:58.17 +000>,<MAYBRIDGE\nmr>,<NMR_250MHZ>,
      <created by zg, POWCHK disabled, PULCHK disabled
       configuration hash MD5:
       49 4B E0 1D 92 C2 6B 37 9F E6 65 BC 52 41 86 1D
       data hash MD5: 64K
       47 99 5F 1C A3 26 AC BA 2C 88 67 0E 68 A5 EB F1>)
(   2,<2007-03-19 10:00:10.89 +000>,<MAYBRIDGE\nmr>,<NMR_250MHZ>,
      <Start of raw data processing
       ef LB = 0.3 FT_mod = 6 PKNL = 1 SI = 32K 
       data hash MD5: 32K
       13 A6 D4 13 06 05 5E 0F BF 55 58 F7 DE C9 C8 A2>)
(   3,<2007-03-19 10:00:12.62 +000>,<MAYBRIDGE\nmr>,<NMR_250MHZ>,
      <apk 
       data hash MD5: 32K
       0A 18 FC 2E FF 26 77 26 49 6C 29 A4 54 C1 AB 92>)
(   4,<2007-03-19 10:00:13.42 +000>,<MAYBRIDGE\nmr>,<NMR_250MHZ>,
      <abs ABSG = 5 
       data hash MD5: 32K
       37 EC 2E 77 E7 94 6D FD 5F CD A2 11 87 C7 14 39>)
$$ ##END=
$$ 
$$ hash MD5
$$ EE 63 31 56 FD C2 A3 F8 65 B6 F2 CF 2E B8 97 6C
##$RELAX= 
##$RELAX= 
##$RELAX= 
##$RELAX= 
##$RELAX= 
##$RELAX= 
##$RELAX= 
$$ Bruker specific parameters
$$ --------------------------
##$DU= <C:\u>
##$EXPNO= 1160
##$NAME= <ADRS>
##$PROCNO= 1
##$TYPE= <nmr>
##$USER= <dgb>
##$AMP= (0..31)
100 100 100 100 100 100 100 100 100 100 100 100 100 100 100 100 100 100 
100 100 100 100 100 100 100 100 100 100 100 100 100 100 
##$AQSEQ= 0
##$AQ_mod= 3
##$AUNM= <au_zg>
##$AUTOPOS= <5 >
##$BF1= 250.13
##$BF2= 250.13
##$BF3= 250.13
##$BF4= 250.13
##$BF5= 500.13
##$BF6= 500.13
##$BF7= 500.13
##$BF8= 500.13
##$BYTORDA= 1
##$CFDGTYP= 0
##$CFRGTYP= 5
##$CHEMSTR= <none>
##$CNST= (0..31)
1 1 145 1 1 1 1 1 1 1 1 1 1 1 1 1 1 1 1 1 1 1 1 1 1 1 1 1 1 1 1 1 
##$CPDPRG= <>
##$CPDPRG1= <>
##$CPDPRG2= <>
##$CPDPRG3= <>
##$CPDPRG4= <mlev>
##$CPDPRG5= <mlev>
##$CPDPRG6= <mlev>
##$CPDPRG7= <mlev>
##$CPDPRG8= <mlev>
##$CPDPRGB= <>
##$CPDPRGT= <>
##$D= (0..31)
0 1 0 0 0 0 0 0 0 0.06 0 0 0 0 0 0 0.0002 0 0 0 0 0 0 0 0 0 0 0 0 0 0 
0 
##$DATE= 1174298397
##$DBL= (0..7)
120 120 120 120 120 120 120 120 
##$DBP= (0..7)
150 150 150 150 150 150 150 150 
##$DBP07= 0
##$DBPNAM0= <>
##$DBPNAM1= <>
$$ [...]
##$SUBNAM7= <"">
##$SUBNAM8= <"">
##$SUBNAM9= <"">
##$SW= 20.6930455092707
##$SWIBOX= (0..15)
0 0 3 0 0 0 0 0 0 0 0 0 0 0 0 0 
##$SW_h= 5175.983436853
##$TD= 65536
##$TD0= 1
##$TE= 683.16
##$TE2= 300
##$TE3= 300
##$TEG= 300
##$TL= (0..7)
0 120 120 120 120 120 120 120 
##$TP= (0..7)
150 150 150 150 150 150 150 150 
##$TP07= 0
##$TPNAME0= <>
##$TPNAME1= <>
##$TPNAME2= <>
##$TPNAME3= <>
##$TPNAME4= <>
##$TPNAME5= <>
##$TPNAME6= <>
##$TPNAME7= <>
##$TPOAL= (0..7)
0.5 0.5 0.5 0.5 0.5 0.5 0.5 0.5 
##$TPOFFS= (0..7)
0 0 0 0 0 0 0 0 
##$TUNHIN= 0
##$TUNHOUT= 0
##$TUNXOUT= 0
##$USERA1= <user>
##$USERA2= <user>
##$USERA3= <user>
##$USERA4= <user>
##$USERA5= <user>
##$V9= 5
##$VALIST= <valist>
##$VCLIST= <CCCCCCCCCCCCCCC>
##$VD= 0
##$VDLIST= <DDDDDDDDDDDDDDD>
##$VPLIST= <PPPPPPPPPPPPPPP>
##$VTLIST= <TTTTTTTTTTTTTTT>
##$WBST= 1024
##$WBSW= 4
##$XGAIN= (0..3)
0 0 0 0 
##$XL= 0
##$YL= 0
##$YMAX_a= 362213
##$YMIN_a= -391372
##$ZGOPTNS= <>
##$ZL1= 120
##$ZL2= 120
##$ZL3= 120
##$ZL4= 120
##$ABSF1= 16.522
##$ABSF2= -4.171173
##$ABSG= 5
##$ABSL= 3
##$ALPHA= 0
##$AQORDER= 0
##$ASSFAC= 0
##$ASSFACI= 0
##$ASSFACX= 0
##$ASSWID= 0
##$AUNMP= <proc_1d>
##$AZFE= 0.1
##$AZFW= 0.1
##$BCFW= 0
##$BC_mod= 0
##$BYTORDP= 0
##$COROFFS= 0
##$CY= 12.5
##$DATMOD= 1
##$DC= 0
##$DFILT= <>
##$DTYPP= 0
##$F1P= 14.0000005364418
##$F2P= -0.99999901652339
##$FCOR= 0.5
##$FTSIZE= 32768
##$FT_mod= 6
##$GAMMA= 0
##$GB= 0
##$INTBC= 1
##$INTSCL= 1
##$ISEN= 128
##$LB= 0.3
##$LEV0= 0
##$LPBIN= 0
##$MAXI= 10000
##$MC2= 0
##$MEAN= 0
##$ME_mod= 0
##$MI= 0
##$NCOEF= 0
##$NC_proc= -3
##$NLEV= 6
##$NOISF1= 0
##$NOISF2= 0
##$NSP= 0
##$NTH_PI= 0
##$NZP= 0
##$OFFSET= 16.522
##$PC= 1
##$PHC0= 237.6913
##$PHC1= 6.496353
##$PH_mod= 1
##$PKNL= yes
##$PPARMOD= 0
##$PSCAL= 4
##$PSIGN= 0
##$REVERSE= no
##$SF= 250.13
##$SI= 32768
##$SIGF1= 0
##$SIGF2= 0
##$SINO= 400
##$SIOLD= 32768
##$SREGLST= <1H.CDCl3>
##$SSB= 0
##$STSI= 32768
##$STSR= 0
##$SW_p= 5175.98343685301
##$SYMM= 0
##$S_DEV= 0
##$TDeff= 65536
##$TDoff= 0
##$TI= <Analysis number 999999
Compound Code 99
Book Reference 9
Project Code 9>
##$TILT= no
##$TM1= 0
##$TM2= 0
##$TOPLEV= 0
##$USERP1= <user>
##$USERP2= <user>
##$USERP3= <user>
##$USERP4= <user>
##$USERP5= <user>
##$WDW= 1
##$XDIM= 32768
##$YMAX_p= 323472075
##$YMIN_p= -166419
$$ End of Bruker specific parameters
$$ ---------------------------------
##NTUPLES= NMR SPECTRUM
##VAR_NAME=  FREQUENCY,     SPECTRUM/REAL,   SPECTRUM/IMAG
##SYMBOL=    X,             R,               I
##VAR_TYPE=  INDEPENDENT,   DEPENDENT,       DEPENDENT
##VAR_FORM=  AFFN,          ASDF,            ASDF
##VAR_DIM=   32768,         32768,           32768
##UNITS=     HZ,            ARBITRARY UNITS, ARBITRARY UNITS
##FACTOR=    0.157963299565203, 1,           1
##FIRST=     4132.6476996994, 0,             0
##LAST=      -1043.33573715361, 0,           0
##MIN=       -1043.33573715361, -166419,     0
##MAX=       4132.6476996994, 323472075,     0
$$ Real data points
##PAGE= N=1
##DATA TABLE= (X++(R..R)), XYDATA
$$ [...]
$$ plain form
16397 -29331 -25356 -21022 -36503 -23856 -81618 -84438 -43486 -8408 -5061 -9800 -16936 -27366 -30403
16384 -30403 -38038 -25232 1300 11228 31697 55659 70922 33561 42848 19090 33749 53508
16372 53508 27000 65032 46347 -12511 -4227 37202 43121 58722 107949 125062 109990 93498
16360 93498 62457 42236 30911 78148 61841 27040 42068 92331 84094 54204 13162 -27093
16348 -27093 -55585 -60806 -49314 -39016 -23668 -40122 -34411 -18145 -14304 -46724 -43121 -3826
16336 -3826 43390 39152 1142 -25795 -10746 -34482 -68118 -63376 -32601 -10432 48066 75808
16324 75808 16186 988 14543 -16503 5612 64244 57756 52559 56378 24463 35015 30179
16312 30179 32999 35024 41234 28527 19060 4133 -45423 -15575 42782 54712 16366 3637
$$ packed form
16397b9331L975M334j5481J2647n7762k820M0952L5078L347m739p136j0430l037
16384c0403p635J2806K6532R928K0469K3962J5263l7361R287k3758J4659J9759
16372E3508k6508L8032j8685n8858Q284M1429N919J5601M9227J7113j5072j6492
16360I3498l1041k0221j1325M7237j6307l4801J5028N0263q237k9890m1042m0255
16348b7093k8492n221J1492J0298J5348j6454N711J6266L841l2420L603L9295
16336c826M7216m238l8010k6937J5049k3736l3636M742L0775K2169N8498K7742
16324G5808n9622j5198J3555l1046K2115N8632o488n197L819l1915J0552m836
16312C0179K820K025O210j2707r467j4927m9556K9848N8357J1930l8346j2729
$$ plain form
16300 3637 -36027 -52820 -94570 -79269 -54868 13863 69732 83245 67739 59207 -18012 -42662
16288 -42662 9146 -15763 -57294 -40572 27379 43527 88247 76404 45040 6094 14290 5008
16276 5008 1569 23881 16571 15859 -16662 -13424 -2451 10002 18249 35623 19367 -4560 -42723
16263 -42723 -18720 -25693 -11750 -6345 24342 10179 34032 14111 -716 24830 69221 91341
16251 91341 70968 63345 105090 88771 51088 27843 44077 63049 24800 18614 -6232 45306
16239 45306 86285 72295 41666 61292 62608 56576 24210 29704 33043 20455 5234 -7759
16227 -7759 -9017 -25616 -9225 26647 -5776 -14914 37476 25872 6901 -23317 -5432 -12709
16215 -12709 -9033 23830 10355 -39244 -55311 -16158 32826 8397 -33389 -32771 -32201 23000 76261
$$ packed form
16300C637l9664j6793m1750J5301K4401O8731N5869J3513j5506q532p7219k4650
16288d2662N1808k4909m1531J6722O7951J6148M4720j1843l1364l8946Q196r282
16276E008l439K2312p310p12l2521L238J0973J2453Q247J7374j6256k3927l8163
16263d2723K4003o973J3943N405L0687j4163K3853j9921j4827K5546M4391K2120
16251I1341k0373p623M1745j6319l7683k3245J6234J8972l8249o186k4846N1538
16239D5306M0979j3990l0629J9626J316o032l2366N494L339j2588j5221j2993
16227g759j258j6599J6391L5872l2423r138N2390j1604j8971l0218J7885p277
16215a2709L676L2863j3475m9599j6067L9153M8984k4429m1786O18N70N5201N3261
$$ plain form
16202 76261 55360 11586 -26366 -5772 5942 20815 -23496 -39764 -51695 3404 -4708 -8237
16190 -8237 3977 -9238 -547 -7380 -21845 -19450 -17622 -34332 -24981 6654 22252 -33470 -34288
16177 -34288 16889 35107 -9554 -29644 -21103 -36441 -34720 -38756 -84039 -101839 -54565 -19700
16165 -19700 -58493 -85236 -64969 -53692 -58701 -35455 -24694 2921 25354 23395 39748 23733
16153 23733 12310 25406 32611 40606 -2537 -5771 -24638 -27819 -19846 -30186 -34044 -15757 10033
16140 10033 -32334 -18788 -36184 -21363 28793 10291 -73964 -79753 -48956 13881 48991 36972
16128 36972 -10249 -4850 -3270 -51742 -25413 18745 -4891 -33878 -37536 -55874 -51133 -7612
16116 -7612 33485 32061 -9443 -43685 -84212 -44803 -10944 7887 20692 -16322 -41748 -44962
$$ packed form
16202G6261k0901m3774l7952K0594J1714J4873m4311j6268j1931N5099q112l529
16190h237J2214j3215Q691o833j4465K395J828j6710R351L1635J5598n5722q18
16177c4288N1177J8218m4661k0090Q541j5338J721m036m5283j7800M7274L4865
16165a9700l8793k6743K0267J1277n009K3246J0761K7615K2433j959J6353j6015
16153B3733j1423J3096P205P995m3143l234j8867l181P973j0340l858J8287K5790
16140A0033m2367J3546j7396J4821N0156j8502q4255n789L0797O2837L5110j2019
16128C6972m7221N399J580m8472K6329M4158k3636k8987l658j8338M741M3521
16116g612M1097j424m1504l4242m0527L9409L3859J8831J2805l7014k5426l214
$$ plain form
16104 -44962 -24660 -9551 -43946 -30324 57063 97059 57440 15504 39811 29489 7365 24514
16092 24514 -16286 -38659 -38536 -18925 24437 9794 -21181 14259 16559 1520 12160 13067 -12032
16079 -12032 -21498 -332 -5909 -10073 -3645 47909 55490 19063 21504 41980 14634 -1545 28342
16066 28342 21773 28275 58243 39784 -1466 44179 90538 59525 19654 -10409 -5364 16031
16054 16031 37251 59686 38298 67940 82774 78335 50833 7085 -16493 6106 24200 25255
16042 25255 -665 -22341 -7518 11439 15178 25770 18668 3285 -8933 -22277 -21520 -5788
16030 -5788 -6911 -16059 24147 93756 73960 34155 26793 -1405 3772 -15411 -37202 -52020 -52876
16017 -52876 169 3920 -34201 -25840 8821 21989 48590 31292 10723 -3625 2198 -57209
$$ packed form
16104d4962K0302J5109l4395J3622Q7387L9996l9619m1936K4307j0322k2124J7149
16092B4514m0800k2373J23J9611M3362j4643l0975L5440K300j5039J0640R07k5099
16079a2032r466K1166n577m164O428N1554P581l6427K441K0476k7346j6179K9887
16066B8342o569O502K9968j8459m1250M5645M6359l1013l9871l0063N045K1395
16054A6031K1220K2435k1388K9642J4834m439k7502m3748k3578K2599J8094J055
16042B5255k5920k1676J4823J8957L739J0592p102j5383j2218j3344P57J5732
16030e788j123r148M0206O9609j9796l9805p362k8198N177j9183k1791j4818q56
16017e2876N3045L751l8121Q361L4661J3168K6601j7298k0569j4348N823n9407
$$ plain form
16005 -57209 -71637 -69324 -49657 -13535 -11811 -10859 -7573 -12811 19941 45193 36802 32959 4060
15992 4060 8720 5070 2706 37208 4561 20482 76789 94578 123112 94393 20416 -28309
15980 -28309 -23528 18455 -15911 -34847 -31568 -33281 -1259 11452 16451 18663 -9714 -11457 -24064
15967 -24064 -8833 51873 67450 82385 70491 36055 12850 43246 25660 21955 21401 -23922
15955 -23922 -59372 -67274 -59923 -62347 -18352 -5429 -8759 5498 30291 18137 -2026 -23800
15943 -23800 -41250 -40009 -40936 -21855 -44569 -27263 -4281 -9627 19789 38333 39773 35064 9309
15930 9309 -17831 -32998 -15613 10128 34432 41334 -9308 -1049 -21711 -32865 -47802 -12820
15918 -12820 22187 19558 23557 51804 39893 23596 27568 1471 168 -15708 -21282 20356 33322
$$ packed form
16005e7209j4428K313J9667L6122J724R52L286n238L2752K5252q391l843k8899
15992D060M660l650k364L4502l2647J5921N6307J7789K8534k8719p3977m8725
15980b8309M781M1983l4366j8936L279j713L2022J2711M999K212k8377j743j2607
15967b4064J5231O0706J5577J4935j1894l4436k3205L0396j7586l705n54m5323
15955b3922l5450p902P351k424M3995J2923l330J4257K4793j2154k0163k1774
15943b3800j7450J241r27J9081k2714J7306K2982n346K9416J8544J440m709k5755
15930I309k7140j5167J7385K5741K4304O902n0642Q259k0662j1154j4937L4982
15918a2820L5007k629L999K8247j1911j6297L972k6097j303j5876n574M1638J2966
$$ plain form
15905 33322 13541 38849 35425 -9366 -29110 -27337 -9366 4014 9096 24002 34026 24609
15893 24609 5940 -11756 -23394 503 6136 5062 -5666 13901 20702 11487 -59427 -94971
15881 -94971 -72939 -44053 -15951 35565 80806 47851 31020 39633 40114 45220 1574 -26837
15869 -26837 -34624 -31167 -27001 -4436 -21849 -43950 -13211 -22438 -62521 -48434 -39646 6428 33535
15856 33535 25852 29584 32611 21526 -18616 -62539 -30213 -20599 -27290 -14103 -4497 10826 39997
15843 39997 54993 46617 30535 -17001 -46650 -62550 -88035 -39784 -46708 -89517 -65239 -33661
15831 -33661 -31475 -37645 -11881 -40159 -90680 -106052 -80307 -34306 -44235 -36851 -33218 -31920 -57220
15818 -57220 -24355 3492 -29627 -29566 -23707 -27045 -30332 -3175 24182 26782 25569 15886 6974 -9297
$$ packed form
15905C3322j9781K5308l424m4791j9744J773J7971J3380N082J4906J0024r417
15893B4609j8669j7696j1638K3897N633j074j0728J9567O801r215p0914l5544
15881i4971K2032K8886K8102N1516M5241l2955j6831Q613M81N106m3646k8411
15869b6837p787L457M166K2565j7413k2101L0739r227m0083J4087Q788M6074K7107
15856C3535p683L732L027j1085m0142m3923L2326R614o691J3187R606J5323K9171
15843C9997J4996q376j6082m7536k9649j5900k5485M8251o924m2809K4278L1578
15831c3661K186o170K5764k8278n0521j5372K5745M6001r929P384L633J298k5300
15818e7220L2865K7847l3119O1N859l338l287K7157K7357K600j213r683q912j6271
$$ plain form
15804 -9297 -10031 -27172 -81675 -120266 -125988 -70176 -10915 -28574 -33042 -22975 1460 -24116 -6087
15791 -6087 -4262 -1587 -22299 -32801 -33808 -16566 -31612 -48084 -10078 6877 19710 19843 13816
15778 13816 -3822 -16379 9062 966 -44080 -54691 -15710 34871 8220 -77568 -75400 -32559
15766 -32559 -9857 9897 10542 -20148 -14643 26934 12463 1645 -3281 5160 -16502 -47424 -43153
15753 -43153 -41722 -14946 -46271 -62488 -14503 12713 -19830 -31902 -29979 -15 8055 -29099
15741 -29099 -29295 -1157 20438 16857 14504 9577 -4267 -22082 -12261 18607 15166 -3797 10865
15728 10865 32833 52035 15160 12724 44206 40332 50121 41782 2170 -27216 -58678 -79140
15716 -79140 -65036 2924 40976 22712 -5102 12804 4365 -9777 -17123 -20387 -10078 59331
$$ packed form
15804i297p34j7141n4503l8591n722N5812N9261j7659m468J0067K4435k5576J8029
15791f087J825K675k0712j0502j007J7242j5046j6472L8006J6955J2833J33o027
15778A3816j7638j2557K5441q096m5046j0611L8981N0581k6651q5788K168M2841
15766c2559K2702J9754O45l0690N505M1577j4471j0818m926Q441k1662l0922M271
15753d3153J431K6776l1325j6217M7985K7216l2543j2072J923K9964Q070l7154
15741b9099j96K8138K1595l581k353m927j3844j7815R821L0868l441j8963J4662
15728A0865K1968J9202l6875k436L1482l874R789q339l9612k9386l1462k0462
15716g9140J4104O7960L8052j8264k7814J7906q439j4142p346l264J0309O9409
$$ plain form
15704 59331 99939 102675 99319 69884 17166 -17928 -39187 -39635 -32917 23127 31810 19963 58099
15691 58099 103203 117378 71527 41537 38942 36473 42899 54446 21864 10960 32352 36439
15679 36439 -20306 -45200 -40576 2058 36893 52175 29913 -10610 -22925 12954 28554 30114
15667 30114 46784 18637 -3090 844 18688 15244 9411 1052 -19021 1997 14838 -12287
15655 -12287 61381 96675 77435 45608 61116 77574 55600 23372 4623 -35196 -42021 -23951
15643 -23951 -23398 -12036 6498 2572 3171 -11904 -21624 -56841 -104183 -113163 -74873 -54022 -1851
15630 -1851 7525 -15509 -33960 -59168 -43990 -33139 -13976 2952 41314 79618 62498 34598
15618 34598 14143 -13149 -29616 3176 13935 15125 51010 79770 76646 16480 -26818 -81244
$$ packed form
15704E9331M0608K736l356k9435n2718l5094k1259m48O718N6044Q683j1847L8136
15691E8099M5104J4175m5851k9990k595k469O426J1547l2582j0904K1392M087
15679C6439n6745k4894M624M2634L4835J5282k2262m0523j2315L5879J5600J560
15667C0114J6670k8147k1727L934J7844l444n833q359k0073K1018J2841k7125
15655a2287P3668L5294j9240l1827J5508J6458k1974l2228j8749l9819o825J8070
15643b3951N53J1362J8534l926N99j5075r720l5217m7342q980L8290K0851N2171
15630a851R376k3034j8451k5208J5178J0851J9163J6928L8362L8304j7120k7900
15618C4598k0455k7292j6467L2792J0759J190L5885K8760l124o0166m3298n4426
$$ plain form
15606 -81244 -17005 -5765 22828 2311 -16205 45505 57204 25753 8747 -53017 -25364 -13561
15594 -13561 -31314 -28833 15400 27115 40379 -8890 -52175 -49712 -44271 -47140 -50148 -5381 -178
15581 -178 -5961 9793 10159 3357 3254 -8684 -35614 -40815 -41567 -24436 -38808 -34791 -47318 -20399
15567 -20399 -37540 -4767 33087 31516 10120 -3811 9999 -8825 -25332 -38220 -53561 -32076
15555 -32076 -5532 -11044 -19293 21642 15670 -18965 -41742 2190 21035 4412 23945 13812
15543 13812 -2922 -9293 36935 -877 -29705 -18920 -31713 -37804 -6518 19365 -12207 -33337
15531 -33337 -2845 -40225 -80419 -91959 -100376 -64280 -42441 5149 46718 7224 -17149 6994
15519 6994 61528 47120 39787 13068 -3034 -12817 -26368 -11074 -22824 -19686 -21061 -14978 -1139
$$ packed form
15606h1244O4239J1240K8593k0517j8516O1710J1699l1451j7006o1764K7653J1803
15594a3561j7753K481M4233J1715J3264m9269m3285K463N441k869l008M4767N203
15581a78n783J5754L66o802j03j1938k6930n201p52J7131j4372M017j2527K6919
15567b0399j7141L2773L7854j571k1396j3931J3810j8824j6507j2888j5341K1485
15555c2076K6544n512q249M0935n972l4635k2777M3932J8845j6623J9533j0133
15543A3812j6734o371M6228l7812k8828J0785j2793o091L1286K5883l1572k1130
15531c3337L0492l7380m0194j1540q417L6096K1839M7590M1569l9494k4373K4143
15519F994N4534j4408p333k6719j6102r783j3551J5294j1750L138j375O083J3839
$$ plain form
15506 -1139 -13027 1712 -16065 -51337 -53661 -43343 -47371 -16376 47190 29959 7345 -43448
15494 -43448 -78173 -75781 -31258 -11043 11846 79498 80770 68462 57818 19739 13824 57348
15482 57348 41314 -12044 -33283 -18035 -39015 -31156 -16331 -10098 -37414 -36106 35359 58284
15470 58284 24337 -4885 -18005 -12002 -17613 -17449 -7246 54978 70067 81754 76710 62907 38680
15457 38680 10497 15478 2521 -30150 -42152 -16181 22514 46646 8692 13902 27233 -18263
15445 -18263 -47903 -52072 -18587 16690 38524 -26510 -72859 -68199 -10256 34712 38799 43429
15433 43429 39601 48726 50011 8972 -45427 -33787 -21461 2871 24945 55754 41130 18923
15421 18923 32021 49224 15794 23630 73245 45852 29243 44167 33520 39627 40396 -23986
$$ packed form
15506a139j1888J4739j7777l5272k324J0318m028L0995O3566j7231k2614n0793
15494d3448l4725K392M4523K0215K2889O7652J272j2308j0644l8079n915M3524
15482E7348j6034n3358k1239J5248k0980P859J4825O233k7316J308P1465K2925
15470E8284l3947k9222j3120O003n611J64J0203O2224J5089J1687n044j3803k4227
15457C8680k8183M981j2957l2671j2002K5971L8695K4132l7954N210J3331m5496
15445a8263k9640m169L3485L5277K1834o5034m6349M660N7943M4968M087M630
15433D3429l828R125J285m1039n4399J1640J2326K4332K2074L0809j4624k2207
15421A8923J3098J7203l3430P836M9615k7393j6609J4924j0647O107P69o4382
$$ plain form
15409 -23986 -16660 -4155 19817 30075 26281 34923 25708 36752 20148 7480 4714 10089 28840
15396 28840 60233 97573 67185 58856 878 -30180 -4802 24286 14153 -17391 14915 27752
15384 27752 39672 4013 -8436 -18288 -17827 -14413 41035 64455 70514 42847 77592 75473 40225
15371 40225 6929 -50222 -71717 -50466 2385 9906 -3715 -9341 -18954 12451 6898 9219 63672
15358 63672 63963 67108 66773 49380 17536 11416 6186 -15585 -14442 -10767 -19307 -25746 -54374 -33668
15344 -33668 -54209 -47537 -16129 -6192 24632 48389 54586 38735 19511 6406 2371 22285
15332 22285 25050 59981 70112 38400 40274 52004 101688 108015 43594 6970 -11794 12655
15320 12655 26036 14606 -717 -23569 -38832 7768 19350 2250 29564 3462 -33550 -22573
$$ packed form
15409b3986P326J2505K3972J0258l794Q642r215J1044j6604j2668k766N375J8751
15396B8840L1393L7340l0388q329n7978l1058K5378K9088j0133l1544L2306J2837
15384B7752J1920l5659j2449r852M61L414N5448K3420O059k7667L4745k119l5248
15371D0225l3296n7151k1495K1251N2851P521j3621n626r613L1405n553K321N4453
15358F3672K91L145l35j7393l1844o120n230k1771J143L675q540o439k8628K0706
15344c3668k0541O672L1408R937L0824K3757O197j5851j9224j3105m035J9914
15332B2285K765L4931J0131l1712J874J1730M9684O327o4421l6624j8764K4449
15320A2655J3381j1430j5323k2852j5263M6600J1582j7100K7314k6102l7012J0977
$$ plain form
15308 -22573 -18673 -23458 -28970 -31540 -3079 34070 34434 -3565 -26510 9959 53225 23616 48372
15295 48372 62827 61635 87434 116396 90848 15808 -16233 -45332 -32979 -19305 -15659 -53184
15283 -53184 -29107 4621 16616 15936 11031 33089 29969 19686 -2242 -19267 -42272 -30542
15271 -30542 -29651 -22142 -22043 -2109 22542 23443 53669 85737 92722 94767 84019 99390 47241 42570
15257 42570 36843 60156 63017 23947 40305 40635 10913 -5155 -23800 -16310 -828 -7100 926
15244 926 16067 -18122 844 44999 14803 -32376 -96652 -106858 -83730 -51559 -74304 -71221
15232 -71221 -75956 -47128 -9240 23090 25429 14831 60261 42247 22403 11299 28081 -10032
15220 -10032 -19990 -20027 -38231 -12752 -36204 -79148 -34021 10743 31967 36580 -26267 -67863 -84428
$$ packed form
15308b2573L900m785n512k570K8461L7149L64l7999k2945L6469M3266k9609K4756
15295D8372J4455j192K5799K8962k5548p5040l2041k9099J2353J3674L646l7525
15283e3184K4077L3728J1995o80m905K2058l120j0283k1928j7025k3005J1730
15271c0542Q91P509R9J9934K4651R01L0226L2068O985K045j0748J5371n2149m671
15257D2570n727K3313K861l9070J6358L30k9722j6068j8645P490J5482o272Q026
15244I26J5141l4189J8966M4155l0196m7179o4276j0206K3128L2171k2745L083
15232g1221m735K8828L7888L2330K339j0598M5430j8014j9844j1104J6782l8113
15220a0032r958l7j8204K5479k3452m2944M5127M4764K1224M613o2847m1596j6565
$$ plain form
15207 -84428 -54160 -31296 -10581 19870 20320 20078 -1723 -14082 12603 6911 -21281 -48086 -42335
15194 -42335 -47134 -33819 -49698 -33396 -10112 -29534 -8029 13650 53264 19044 4999 -7404
15182 -7404 -1100 12581 26873 5432 -17622 -64393 -50004 -3403 -35814 -33328 -8482 13633
15170 13633 -9117 30798 46643 -7791 -46160 -60489 -10825 73605 51638 56141 53872 16673
15158 16673 7912 24695 11161 14863 -5417 -33085 -9264 11326 11202 27100 12499 -21863
15146 -21863 -66891 -51288 -16728 -1494 25117 62023 52311 74262 59966 61790 59859 81689
15134 81689 59770 26446 11318 34020 49209 49617 22781 -10398 10094 18011 5191 44654
15122 44654 19343 -11580 -17213 5101 13422 -35923 -19639 -25454 -14845 14950 46237 64012
$$ packed form
15207h4428L0268K2864K0715L0451M50k42k1801j2359K6685n692k8192k6805N751
15194d2335m799J3315j5879J6302K3284j9422K1505K1679L9614l4220j4045j2403
15182g404O304J3681J4292k1441k3054m6771J4389M6601l2411K486K4846K2115
15170A3633k2750L9915J5845n4434l8369j4329M9664Q4430k1967M503k269l7199
15158A6673q761J6783j3534L702k0280k7668K3821K0590j24J5898j4601l4362
15146b1863m5028J5603L4560J5234K6611L6906r712K1951j4296J824j931K1830
15134H1689k1919l3324j5128K2702J5189M08k6836l3179K0492P917j2820L9463
15122D4654k5311l0923n633K2314Q321m9345J6284n815J0609K9795L1287J7775
$$ plain form
15110 64012 10802 2533 8888 16927 40098 46820 29170 11055 -6229 -28119 -22485 -32272 -44004
15097 -44004 -19772 -19347 -46111 -32610 -11148 28398 7894 -20478 -9479 -12320 2701 -8486
15085 -8486 -18461 -19194 -38333 -33250 -36294 4049 19523 16816 4304 -8537 11095 29969 14509
15072 14509 -25594 -26915 -24949 -72699 -26615 42822 27805 44175 50702 48288 -1935 -12524
15060 -12524 -7566 -4069 -16728 -10027 -5074 -18794 -39898 -38871 45492 60312 25042 4361 18018
15047 18018 17964 13019 32596 19322 10566 913 7295 41308 75493 45327 33940 27210 38112
15034 38112 46800 27605 -4660 -37928 -9977 -34391 -31916 6502 -11891 -19437 1301 22377
15022 22377 21098 8336 14314 53638 19120 -2619 -5006 -46220 -52663 -15572 -7402 -14521 42800
$$ packed form
15110F4012n3210q269O355Q039K3171O722j7650j8115j7284k1890N634r787j1732
15097d4004K4232M25k6764J3501K1462L9546k0504k8372J0999k841J5021j1187
15085h486r975p33j9139N083l044M0343J5474k707j2512j2841J9632J8874j5460
15072A4509m0103j321J966m7750M6084O9437j5017J6370O527k414n0223j0589
15060a2524M958L497j2659O701M953j3720k1104J027Q4363J4820l5270k0681J3657
15047A8018n4m945J9577j3274q756r653O382L4013L4185l0166j1387o730J0902
15034C8112Q688j9195l2265l3268K7951k4414K475L8418j8393p546K0738K1076
15022B2377j279j2762N978L9324l4518k1739k387m1214o443L7091Q170p119N7321
$$ plain form
15009 42800 84771 54867 -13904 -3040 8395 2827 11555 -7150 -29829 -18116 35680 45668
14997 45668 49300 -1199 -42081 -31153 -26359 -31049 18614 -10618 -29766 2824 16821 -2203
14985 -2203 -35169 -11245 26903 30521 21454 4312 -4432 53264 54761 35358 -5430 -24781 6391
14972 6391 56150 47695 28986 41720 64490 55190 34951 -6244 -55988 -32916 -40680 -46635 -55491
14959 -55491 -68489 -88104 -40295 13212 49440 72032 42748 11790 -15464 -93296 -94684 -73843
14947 -73843 -79206 -83313 -99561 -137898 -110125 -64461 -489 55066 41872 15247 -9973 14326
14935 14326 21419 27083 -1620 -55685 -56615 13541 53369 57060 54556 11209 26441 28234 -15339
14922 -15339 -46232 -46404 -8559 13022 -14374 1959 17027 28895 40142 32288 9059 10545
$$ packed form
15009D2800M1971k9904o8771J0864J1435n568Q728j8705k2679J1713N3796R988
14997D5668L632n0499m0882J0928M794m690M9663k9232j9148L2590J3997j9024
14985b203l2966K3924L8148L618r067j7142q744N7696J497j9403m0788j9351L1172
14972F391M9759q455j8709J2734K2770r300k0239m1195m9744K3072p764n955q856
14959e5491j2998j9615M7809N3507L6228K2592k9284l0958k7254p7832j388K0841
14947g3843n363m107j6248l8337K7773M5664O3972N5555j3194k6625k5220K4299
14935A4326P093N664k8703n4065r30P0156L9828L691k504m3347J5232J793m3573
14922a5339l0893j72L7845K1581k7396J6333J5068J1868J1247p854k3229J486
$$ plain form
14910 10545 -8837 -12187 6750 -17252 -22488 -30629 -23061 20020 35665 13774 6097 4947 -8683
14897 -8683 -3758 51581 71922 55250 30937 27839 9131 6283 -6093 33976 4249 -19191
14885 -19191 -20961 -42600 -56018 -48870 3807 35691 32827 17429 -12658 -54763 -61649 -56617 4986
14872 4986 -11601 -15013 22468 23979 -7926 8934 21518 25080 31320 43621 46531 73099 69454
14859 69454 55248 34945 34996 29499 43991 28494 29569 30292 73793 74801 64359 53262 22982
14846 22982 -6421 2072 52057 42457 10118 1944 10122 41103 63438 46211 1051 -205 -17344
14833 -17344 -8292 -2653 2069 9952 15387 36641 30648 -13506 -20448 8001 8656 -32060 -15512
14820 -15512 1714 -1218 -48660 -76815 -80508 -76936 -62108 -43650 -62871 -66146 -62232 -47242 -10644
$$ packed form
14910A0545j9382l350J8937k4002n236q141P568M3081J5645k1891p677j150j3630
14897h683M925N5339K0341j6672k4313l098j8708k848j2376M0069k9727k3440
14885a9191j770k1639j3418P148N2677L1884k864j5398l0087m2105o886N032O1603
14872D986j6587l412L7481J511l1905J6860J2584L562O240J2301K910K6568l645
14859F9454j4206k0303N1n497J4492j5497J075P23M3501J008j0442j1097l0280
14846B2982k9403Q493M9985r600l2339q174Q178L0981K2335j7227m5160j256j7139
14833a7344R052N639M722P883N435K1254n993m4154o942K8449O55m0716J6548
14820a5512J7226k932m7442k8155l693L572J4828J8458j9221l275L914J4990L6598
$$ plain form
14807 -10644 -60023 -102336 -12956 32296 10289 -1535 5425 -2901 -19044 -7759 3612 -17082
14795 -17082 -91578 -85649 -55442 -30646 -24028 -57336 -53405 -2815 31226 65655 84061 30506
14783 30506 23936 22903 -9121 -14055 -3622 -27743 -79564 -89296 -49106 -17560 -7446 53478
14771 53478 84445 84598 95432 73747 72502 40681 2276 -5371 -29493 -20589 -29123 -35366 -10978
14758 -10978 -20496 4791 29292 -16118 -52065 -17947 11986 8995 -9746 -26853 -37576 -44131
14746 -44131 -21074 -18942 -13272 -43719 -63612 -20604 -4791 35953 48406 39174 -7970 -24373
14734 -24373 -6038 -22420 -24252 6934 30398 22981 15418 -30402 -55525 -33563 -44445 -36822
14722 -36822 -31957 -31660 -51753 -48233 -7052 -4356 -16265 -24651 -37547 -43744 -53628 -17289 11015
$$ packed form
14807a0644m9379m2313Q9380M5252k2007j1824O960q326j6143J1285J1371k0694
14795a7082p4496N929L0207K4796O618l3308L931N0590L4041L4429J8406n3555
14783C0506o570j033l2024m934J0433k4121n1821r732M0190L1546J0114O0924
14771E3478L0967J53J0834k1685j245l1821l8405p647k4122Q904q534o243K4388
14758a0978r518K5287K4501m5410l5947L4118K9933k991j8741j7107j0723o555
14746d4131K3057K132N670l0447j9893M3008J5813M0744J2453r232m7144j6403
14734b4373J8335j6382j832L1186K3464p417p563m5820k5123K1962j0882P623
14722c6822M865K97k0093L520M1181K696j1909q386j2896o197r884L6339K8304
$$ plain form
14709 11015 -13519 -24238 -12970 14621 -657 -56694 -69461 -32215 -12751 -21669 -40642 -41279
14697 -41279 -56502 -51360 17540 8160 -33481 -37030 -60656 -51784 -49764 -23545 8384 20591 40302
14684 40302 51431 61595 76632 106179 106319 89921 88263 60439 19978 21160 -1065 -4098 -2226
14671 -2226 22780 10489 17469 3640 -22314 -12816 -2522 -38456 -13424 -7112 15238 47405
14659 47405 51860 40405 -8712 46320 40126 54928 52494 16141 -21529 -47266 -24369 32045
14647 32045 48133 34711 13682 17836 45017 24899 1661 -42791 -56463 -70642 -62061 -54352
14635 -54352 -38392 -42515 15121 44079 30346 25692 5444 -2946 -27206 -53949 -77578 -61649
14623 -61649 -13541 -33076 -29442 -9224 8205 17924 178 -25637 -19793 -37903 -60565 -53596
$$ packed form
14709A1015k4534j0719J1268K7591j5278n6037j2767L7246J9464q918j8973o37
14697d1279j5223N142O8900r380m1641l549k3626Q872K020K6219L1929J2207J9711
14684D0302J1129J0164J5037K9547J40j6398j658k7824m0461J182k2225l033J872
14671b226K5006j2291O980j3829k5954R498J0294l5934K5032O312K2350L2167
14659D7405M455j1455m9117N5032o194J4802k434l6353l7670k5737K2897N6414
14647C2045J6088j3422k1029M154K7181k0118k3238m4452j3672j4179Q581P709
14635e4352J5960m123N7636K8958j3733m654k0248q390k4260k6743k3629J5929
14623f1649M8108j9535L634K0218J7429R719j7746k5815N844j8110k2662O969
$$ plain form
14611 -53596 -3279 -9957 -8319 -25691 -32131 4956 17169 39409 50414 52206 49210 19711 51216
14598 51216 61460 67692 95087 33601 -28430 -5316 -589 -5744 26211 31252 -11638 -28747
14586 -28747 -36271 1849 346 -3032 7145 5720 51117 76597 79353 86771 69835 49296 32699
14573 32699 14475 -9053 -32248 -24575 13108 27658 23992 -4362 37571 43894 34733 51419
14561 51419 19289 -4693 -13361 -51134 -59360 -41762 -16673 13502 16603 -22433 -50951 1583
14549 1583 11413 22498 41555 27066 10719 24020 53810 15104 -5539 -1034 -31858 -53673
14537 -53673 -59390 -55399 -18632 -14389 -52855 -47178 -84900 -92460 -60025 -53032 -17415 21667 40241
14524 40241 -8375 -35477 -56828 -70315 -34039 -56073 -25322 -45287 -50094 -40052 -7960 -28938
$$ packed form
14611e3596N0317o678J638j7372o440L7087J2213K2240J1005J792k996k9499L1505
14598E1216J0244O232K7395o1486o2031K3114M727n155L1955N041m2890j7109
14586b8747p524L8120j503l378J0177j425M5397K5480K756P418j6936k0539j6597
14573C2699j8224k3528k3195P673L7683J4550l666k8354M1933O323r161J6686
14561E1419l2130k3982q668l7773q226J7598K5089L0175L101l9036k8518N2534
14549A583R830J1085J9057j4489j6347J3301K9790l8706k0643M505l0824k1815
14537e3673n717L991L6767M243l8466N677l7722p560L2435O993L5617L9082J8574
14524D0241m8616k7102k1351j3487L6276k2034L0751j9965m807J0042L2092k0978
$$ plain form
14512 -28938 -43677 -28897 -1259 28371 76838 108218 52695 -47461 -65645 -62531 -49879 -56533
14500 -56533 -68301 -27704 -25936 -48589 -30018 6454 -8044 -3591 -25467 -32170 -39705 -43605 -34356
14487 -34356 -16412 4576 -6812 -12320 -73648 -87178 -70947 -59101 -33722 -28689 -9217 -32257
14475 -32257 -49739 -28906 -34542 -19952 9999 -15502 -33087 -30669 -19080 -12253 -21507 -44594
14463 -44594 -33869 -3124 25582 -17064 -14693 12993 13080 4546 3708 -35372 -9227 953 -14006
14450 -14006 -967 34719 29110 15614 15318 6272 33676 38866 43477 11799 -3999 -18922 -30639
14437 -30639 35699 65889 47540 22045 -7103 -9615 12135 3589 -63982 -53546 -19771 -19220
14425 -19220 -24908 1349 2775 23011 942 -30560 -19266 -29988 -12904 16514 35730 57437
$$ packed form
14512b8938j4739J4780K7638K9630M8467L1380n5523j00156j8184L114J2652o654
14500e6533j1768M0597J768k2653J8571L6472j4498M453k1876o703p535l900R249
14487c4356J7944K0988j1388n508o1328j3530J6231J1846K5379N033J9472k3040
14475c2257j7482K0833n636J4590K9951k5501j7585K418J1589O827r254k3087
14463d4594J0725L0745K8706m2646K371K7686Q7q534q38l9080K6145J0180j4959
14450a4006J3039L5686n609j3496k96r046K7404N190M611l1678j5798j4923j1717
14437c0639O6338L0190j8349k5495k9148k512K1750q546o7571J0436L3775N51
14425a9220n688K6257J426K0236k2069l1502J1294j0722J7084K9418J9216K1707
$$ plain form
14413 57437 62148 30674 22152 41176 36522 26084 25880 -8797 -46977 -46359 -39018 -3908 -11234
14400 -11234 -24102 -15850 17976 -6895 -31492 -76861 -57705 -29918 -4876 -52045 -57816 -62936
14388 -62936 -62145 -9141 -9715 6759 41145 36341 35517 50360 9347 -20890 -634 -8123 -29471
14375 -29471 6265 43396 63506 66347 37729 13404 -6919 5417 15551 1426 28482 2486
14363 2486 -25907 -7918 -34917 -48155 -39055 -37341 -9926 1200 -1785 23599 65569 24064
14351 24064 24193 9896 -18772 -3074 40059 68124 35232 12211 27570 34208 -11640 -48601
14339 -48601 -21474 52890 49585 46977 10577 2562 31380 5034 8877 47610 26730 21045 18459
14326 18459 -13590 7016 16147 -738 -31006 -22437 -21017 -21013 7180 -32515 -40287 -28900 -8125
$$ packed form
14413E7437M711l1474q522J9024m654j0438k04l4677l8180O18P341L5110p326
14400a1234j2868Q252L3826k4871k4597m5369J9156K7787K5042m7169n771n120
14388f2936P91N3004n74J6474L4386m804q24J4843m1013l0237K0256p489k1348
14375b9471L5736L7131K0110K841k8618k4325k0323J2336J0134j4125K7056k5996
14363B486k8393J7989k6999j3238R100J714K7415J1126k985K5384M1970m1505
14351B4064J29j4297k8668J5698M3133K8065l2892k3021J5359O638m5848l6961
14339d8601K7127P4364l305k608l6400q015K8818k6346L843L8733k0880n685k586
14326A8459l2049K0606R131j6885l0268Q569J420MK8193l9695p772J1387K0775
$$ plain form
14313 -8125 27992 6353 22075 30818 14307 -5321 16723 26963 -1509 7751 51755 37490
14301 37490 -13706 -42608 -47954 -36304 -47514 -18444 27430 16883 18052 41688 -2453 -23968
14289 -23968 -55828 -79940 -65557 -52441 12697 36038 54233 21502 -21061 -23236 -43825 -25217
14277 -25217 -14919 14659 83335 57622 31323 49272 57618 46074 25460 12100 -16090 -38371
14265 -38371 -75694 -57694 -6843 26909 17025 27495 39720 58261 1959 -29481 -12690 -10810
14253 -10810 -36939 -28644 -50784 -78336 -21338 39498 29179 14352 -6418 -13765 -19676 7363
14241 7363 5811 15883 8146 -144 -30235 -2676 2796 -19568 -10158 5264 -4163 -21915 -29509
14228 -29509 62933 81754 95385 75829 64915 97281 54990 18294 50687 52310 6247 -261
$$ packed form
14313h125L6117k1639J5722Q743j6511j9628K2044J0240k8472R260M4004j4265
14301C7490n1196k8902n346J1650j1210K9070M5874j0547J169K3636m4141k1515
14289b3968l1860k4112J4383J3116O5138K3341J8195l2731m2563k175k0589J8608
14277b5217J0298K9578O8676k5713k6299J7949Q346j1544k0614j3360k8190k2281
14265c8371l7323J8000N0851L3752r884J0470J2225J8541n6302l1440J6791J880
14253a0810k6129Q295k2140k7552N6998O0836j0319j4827k0770p347n911K7039
14241G363j552J0072p737q290l0091K7559N472k2364R410J5422r427j7752p594
14228b9509R2442J8821J3631j9556j0914L2366m2291l6696L2393J623m6063o508
$$ plain form
14216 -261 14517 -10923 -13355 -28393 -58491 -49299 -63572 -41975 -28807 -29176 20342 83076 101010
14203 101010 83019 -12670 -29107 -1943 40801 26235 -17680 -29723 -34407 -3361 2271 -33006
14191 -33006 -54460 -50656 -24229 45669 31509 11414 26127 45379 58042 52839 57128 18658
14179 18658 -6559 -21718 -14543 -3065 -11822 11584 16737 17617 -4198 -6166 -1645 -4945 -5876 29088
14165 29088 46962 47877 57954 62948 35887 3907 5585 -5581 -11618 9591 21413 11833 10222
14152 10222 -3650 -35832 -31730 -9521 39975 32261 -6709 -37167 -23266 6945 1477 20737
14140 20737 58385 43486 28501 -18728 -21436 -40918 -36587 4977 6100 -26591 -36691 -3308
14128 -3308 -38759 -59260 -13383 -8299 11097 11945 19814 38853 52712 84053 54760 42360 65077
$$ packed form
14216b61J4778k5440k432j5038l0098R192j4273K1597J3168l69M9518O2734J7934
14203A01010j7991r5689j6437K7164M2744j4566m3915j2043m684L1046N632l5277
14191c3006k1454L804K6427O9898j4160k0095J4713J9252J2663n203M289l8470
14179A8658k5217j5159P175J1478q757K3406N153Q80k1815j968M521l300r31L4964
14165B9088J7874R15J0077M994k7061l1980J678j1166o037K1209J1822r580j611
14152A0222j3872l2182M102K2209M9496p714l8970l0458J3901L0211n468J9260
14140B0737L7648j4899j4985m7229k708j9482M331M1564J123l2691j0100L3383
14128c308l5451k0501M5877N084J9396Q48P869J9039J3859L1341k9293j2400K2717
$$ plain form
14115 65077 28964 21396 50384 56216 -4377 -53693 -18148 48178 19703 -12847 1228 -18501
14103 -18501 -34599 -14356 2362 27380 24283 17687 26920 30826 20162 34885 51907 61798 84969
14090 84969 49161 -13610 -32997 -44328 -11790 31929 29302 23845 13107 6960 4155 -11858
14078 -11858 35418 71339 95181 27594 -25240 -26111 -25269 -41892 -48610 -41659 -6325 12485 18278
14065 18278 69024 100600 111597 50665 33636 -5895 5078 30761 27998 13625 17977 6910
14053 6910 21725 23327 19766 20839 25375 52766 110504 113110 50302 49507 73047 86205 49424
14040 49424 22612 52233 61465 16864 15823 -25873 -17808 21664 10442 16758 38134 60593
14028 60593 54401 68333 61982 23675 -7727 1166 47154 84029 88947 43196 218 5941 19401
$$ packed form
14115F5077l6113p568K8988N832o0593m9316L5545O6326k8475l2550J4075j9729
14103a8501j6098K0243J6718K5018l097o596R233L906j0664J4723J7022R891K3171
14090H4969l5808o2771j9387j1331L2538M3719k627n457j0738o147k805j6013
14078a1858M7276L5921K3842o7587n2834q71Q42j6623o718O951L5334J8810N793
14065A8278N0746L1576J0997o0932j7029l9531J0973K5683k763j4373M352j1067
14053F910J4815J602l561J073M536K7391N7738K606o2808p95K3540J3158l6781
14040D9424k6812K9621R232m4601j041m1696Q065L9472j1222O316K1376K2459
14028F0593o192J3932o351l8307l1402Q893M5988L6875M918m5751m2978N723J3460
$$ plain form
14015 19401 13008 14626 -6727 13678 -10234 9834 50242 99546 78337 17025 -46616 -35967
14003 -35967 -41125 -56938 -16935 -28472 -32202 -49738 -34294 -53712 -54450 -42835 -27874 -34781 -48370
13990 -48370 -14926 12067 -18693 -11469 -22843 -19617 -25340 -41174 -77571 -97438 -81200 -77337
13978 -77337 -50244 -67894 -82906 -85402 -23602 -12332 -8848 -15263 -12516 11438 8478 19447 21555
13965 21555 -3022 32104 44535 46460 49616 67941 54861 -6216 -42426 -7714 17333 36101
13953 36101 36495 64720 57694 65020 47803 16233 -3055 4518 26462 44157 33237 45503 45206
13940 45206 38891 54292 43980 3359 29447 41655 52783 31117 5262 2285 -20473 -24090
13928 -24090 -2986 14249 -918 -41472 -83610 -89916 -36305 -28695 -26036 -39501 -55626 -100850
$$ packed form
14015A9401o393J618k1353K0405k3912K0068M0408M9304k1209o1312o3641J0649
14003c5967n158j5813M0003j1537l730j7536J5444j9418p38J1615J4961o907j3589
13990d8370L3444K6993l0760P224j1374L226n723j5834l6397j9867J6238L863
13978g7337K7093j7650j5012k496O1800J1270L484o415K747K3954k960J0969K108
13965B1555k4577L5126J2431J925L156J8325j3080o1077l6210L4712K5047J8768
13953C6101L94K8225p026P326j7217l1570j9288P573K1944J7695j0920J2266k97
13940D5206o315J5401j0312m0621K6088J2208J1128k1666k5855k977k2758l617
13928b4090K1104J7235j5167m0554m2138o306N3611P610K659j3465j6125m5224
$$ plain form
13916 -100850 -113055 -73841 -75039 -28787 18419 17116 10826 7230 -15124 -48066 -53329 -55957 -50134
13903 -50134 -52840 -52593 -85852 -76049 -24698 791 12216 -13114 -40561 -26015 2523 1136 -4506
13890 -4506 -28008 -39686 -27662 -7997 -606 6867 60495 55727 48886 85565 39379 44719 74003
13877 74003 34468 61220 25988 23352 22498 -8541 -33009 -64326 -35352 -9536 12233 30363
13865 30363 -14788 -29865 -29843 -4610 17910 11881 11802 22505 31869 51039 36575 11280 -19574
13852 -19574 -5631 753 -2105 -36443 -6523 36759 38316 -22694 -35073 -25242 -21740 -32120 -66085
13839 -66085 -63976 -42201 -15211 -18823 -44494 -64010 -51964 -48253 -42482 -35557 -4676 9747 -10554
13826 -10554 24076 -4710 -60941 -11578 22492 -23312 -58460 -76071 -52608 -51161 -26667 -23557
$$ packed form
13916a00850j2205L9214j198M6252M7206j303o290l596k2354l2942n263k628N823
13903e0134k706K47l3259R803N1351K5489J1425k5330k7447J4546K8538j387n642
13890d506k3502j1678J2024J9665P391P473N3628m768o841L6679m6186N340K9284
13877G4003l9535K6752l5232k636q54l1039k4468l1317K8974K5816K1769J8130
13865C0363m5151j5077K2K5233K2520o029p9J0703R364J9170j4464k5295l0854
13852a9574J3943O384k858l4338K9920M3282J557o1010j2379R831L502j0380l3965
13839f6085K109K1775K6990l612k5671j9516J2046L711N771O925L0881J4423k0301
13826a0554L4630k8786n6231M9363L4070m5804l5148j7611K3463J447K4494L110
$$ plain form
13814 -23557 -38428 -10108 11542 11612 -3578 -9433 -49686 -72301 -68291 -25836 10307 33947 43453
13801 43453 22689 22256 24704 46190 26264 2905 -4469 20822 15888 51652 16128 1391 28831
13788 28831 26394 11080 23443 60238 102373 129477 100706 121236 106443 95647 95971 41781
13776 41781 -39506 -19225 13014 33917 34141 -3538 -42985 -97103 -48416 -56065 -47420 -23650
13764 -23650 8935 10026 15287 9939 45099 27682 45940 26903 -3488 -31783 -50768 -27284
13752 -27284 -10033 -2797 -30593 -70810 -40771 -3827 8881 -16103 -50322 -45359 -9022 17950
13740 17950 6414 -17468 -10821 38107 29177 27775 29265 -19676 -73458 -82726 -80415 -36767 2395
13727 2395 -58178 -81934 -65267 -72437 -20236 11405 35095 17987 32485 42247 32426 13229
$$ packed form
13814b3557j4871K8320K1650P0j5190n855m0253k2615M010M2455L6143K3640R506
13801D3453k0764m33K448K1486j9926k3359p374K5291m934L5764l5524j4737K7440
13788B8831k437j5314J2363L6795M2135K7104k8771K0530j4793j0796L24n4190
13776D1781q1287K0281L2239K0903K24l7679l9447n4118M8687p649Q645K3770
13764b3650L2585J091N261n348L5160j7417J8258j9037l0391k8295j8985K3484
13752b7284J7251P236k7796m0217L0039L6944J2708k4984l4219M963L6337K6972
13740A7950j1536k3882O647M8928q930j402J490m8941n3782r268K311M3648L9162
13727B395o0573k3756J6667p170N2201L1641K3690j7108J4498R762r821j9197
$$ plain form
13715 13229 -12610 -4069 -2882 31988 60132 74581 52703 10156 -23617 -25470 -7445 16345
13703 16345 52961 39088 73173 70837 54746 48433 44698 47345 32917 32924 39279 17573 41832
13690 41832 33024 -3917 868 20254 74689 100763 78533 50360 -28401 -65201 -77403 -46898
13678 -46898 -26598 -11214 -20092 -45821 -73902 -74579 -49766 -51521 -36698 -16214 -30214 -7805
13666 -7805 -24884 12688 37749 20786 44601 27881 -738 -21986 -37621 -32877 13961 30522
13654 30522 1783 -35222 -10630 27173 58461 52428 47347 17463 -33287 -5370 -3321 -60153
13642 -60153 -70193 -54522 -23528 -31174 -30046 -16361 -6609 29765 55503 43754 5887 6367 -22870
13629 -22870 -34293 -29601 -70039 -67574 -26094 -4902 -21072 -74279 -138336 -83664 34173 69456
$$ packed form
13715A3229k5839Q541J187L4870K8144J4449k1878m2547l3773j853J8025K3790
13703A6345L6616j3873L4085k336j6091o313l735K647j4428PO355k1706K4259
13690D1832q808l6941M785J9386N4435K6074k2230k8173p8761l6800j2202L0505
13678d6898K0300J5384q878k5729k8081o77K4813j755J4823K0484j4000K2409
13666g805j7079L7572K5061j6963K3815j6720k8619k1248j5635M744M6838J6561
13654C0522k8739l7005K4592L7803L1288o033n081k9884n0750K7917K049n6832
13642f0153j0040J5671L0994p646J128J3685R752L6374K5738j1749l7867M80k9237
13629b2870j1423M692m0438K465M1480K1192j6170n3207o4057N4672J17837L5283
$$ plain form
13617 69456 62688 53206 42101 14696 44345 47474 45840 37317 23542 17866 3049 -18 27078
13604 27078 42190 23311 25312 20069 24097 42835 8935 -38336 -60776 -39604 -18246 -54907
13592 -54907 -11193 -2079 -24678 -78138 -112109 -54008 -25670 23315 35568 31290 3284 -13313
13580 -13313 -18196 383 3632 -4922 -10096 -11891 -8498 -30296 -35552 6161 27087 46814 71350
13567 71350 22986 15009 5927 -264 -37663 -63747 -30116 -34415 -26001 -1706 52 32640 76595
13554 76595 41712 -1815 -8237 -6514 45937 42106 52585 49988 25412 -16883 -20739 23507 56026
13541 56026 23811 2244 -30066 -25299 -9933 10216 12021 17248 3787 -7649 -27699 -32024
13529 -32024 -50695 -4803 -2432 18663 13686 -30819 -32564 -37166 -30706 -26572 4619 28178 7323
$$ packed form
13617F9456o768r482j1105k7405K9649L129j634q523j3775n676j4817l067K7096
13604B7078J5112j8879K001n243M028J8738l3900m7271k2440K1172K1358l6661
13592e4907M3714R114k2599n3460l3971N8101K8338M8985J2253m278k8006j6597
13580a3313m883J8579L249q554n174j795L393k1798n256M1713K0926J9727K4536
13567G1350m8364p977r082o191l7399k6084L3631m299Q414K4295J758L2588M3955
13554G6595l4883m3527o422J723N2451l831J0479k597k4576m2295l856M4246L2519
13541E6026l2215k1567l2310M767J5366K0149J805N227j3461j1436k0050m325
13529c2024j8671M5892K371K1095m977m4505j745m602O460M134L1191K3559k0855
$$ plain form
13516 7323 -20312 12115 29855 42983 27617 33177 4833 11396 25790 36329 11380 -16694
13504 -16694 -13730 -31544 -23659 -18773 -21717 -22942 -31018 -57354 -42411 456 16186 44632 28977
13491 28977 -8813 -1087 12267 -15290 2317 -43391 -19645 57303 58706 10806 6674 29085
13479 29085 24113 15649 17799 10525 -12044 -25916 -39983 -7928 21626 3444 -37273 -54760
13467 -54760 -35108 -4409 27253 46762 72090 95864 61002 24974 340 -6296 -185 12571
13455 12571 40668 60781 47576 35867 26595 23083 17317 38544 42455 70145 63206 49955 42480
13442 42480 -6210 -19360 -1401 21931 -12482 -77490 -95516 -53124 -24802 -8591 -7161 -7340
13430 -7340 24950 2886 22913 28443 6113 26133 20551 -1988 -31416 -1614 39244 44031
$$ packed form
13516G323k7635L2427J7740J3128j5366N560k8344O563J4394J0539k4949k8074
13504a6694K964j7814P885M886k944j225q076k6336J4943M2867J5730K8446j5655
13491B8977l7790P726J3354k7557J7607m5708K3746P6948J403m7900m132K2411
13479B9085m972q464K150p274k2569j3872j4067L2055K9554j8182m0717j7487
13467e4760J9652L0699L1662J9509K5328K3774l4862l6028k4634o636O111J2756
13455A2571K8097K0113j3205j1709r272l512n766K1227L911K7690o939j3251p475
13442D2480m8690j3150J7959K3332l4413o5008j8026M2392K8322J6211J430j79
13430g340L2290k2064K0027N530k2330K0020n582k2539k9428K9802M0858M787
$$ plain form
13418 44031 54312 65708 35488 -3760 -26455 -37375 -51665 -54719 -63422 -73994 -80733 -96626
13406 -96626 -76394 -34550 -1592 62875 69981 86367 51746 53892 36852 20499 29926 27969
13394 27969 -23096 -12889 17530 12742 -1386 -30607 -36624 -9531 7472 39320 49546 54938
13382 54938 21088 799 -4311 -38746 -54540 -19349 43791 43778 5229 19522 30151 50053
13370 50053 89407 81097 63419 62492 38024 55191 38657 1302 8379 -13297 -3924 -10088 -21125
13357 -21125 -24879 -36936 -6546 9347 -16388 -46248 -26514 14605 14779 383 -11844 13336
13345 13336 7851 384 -16631 19841 46549 9210 14045 36871 46656 38900 35839 -39981 -27210
13332 -27210 23345 33124 -11683 -36227 -18788 7464 12103 -551 -39467 -69509 -78858 -113661
$$ packed form
13418D4031J0281J1396l0220l9248k2695j0920j4290l054q703j0572o739j5893
13406i6626K0232M1844L2958O4467P106J6386l4621K146j7040j6353R427j957
13394B7969n1065J0207L0419m788j4128k9221o017K7093J7003L1848J0226N392
13382E4938l3850k0289n110l4435j5794L5191O3140j3l8549J4293J0629J9902
13370E0053L9354q310j7678r27k4468J7167j6534l7355P077k1676R373o164j1037
13357b1125l754j2057L0390J5893k5735k9860J9734M1119J74j4396j2227K5180
13345A3336n485p467j7015L6472K6708l7339M835K2826R785p756l061p5820J2771
13332b7210N0555R779m4807k4544J7439K6252M639j2654l8916l0042r349l4803
$$ plain form
13320 -113661 -143973 -122568 -101682 -84920 -99415 -130951 -118592 -74004 -19136 -5188 -13502 -44761
13308 -44761 -20205 1662 -36367 -40470 -26854 -6570 -57790 -53028 -21268 26757 59250 38063
13296 38063 27876 83837 89923 69404 62402 54057 36454 4621 -64934 -93690 -100249 -41378
13284 -41378 -29533 -63132 -101755 -66594 -27618 -29738 -18228 -37134 -37287 -15146 15825 -10164
13272 -10164 -29274 -53631 -51872 7745 361 6291 16939 -7807 -18731 -69985 -60133 -18207
13260 -18207 9665 10519 30145 24555 -6085 -24606 23455 -8253 -22490 6358 -4977 -7161
13248 -7161 11171 11348 52492 17037 -11531 23261 44738 -7340 -22190 -14924 9510 22020
13236 22020 -593 -2867 9958 -7239 -32540 -41326 -67550 -32142 -25666 -41298 3332 4595
$$ packed form
13320a13661l0312K1405K0886J6762j4495l1536J2359M4588N4868J3948q314l1259
13308d4761K4556K1867l8029m103J3616K0284n1220M762L1760M8025L2493k1187
13296C8063j0187N5961O086k0519p002q345j7603l1833o9555k8756o559N8871
13284d1378J1845l3599l8623L5161L8976k120J1510j8906j53K2141L0971k5989
13272a0164j9110k4357J759N9617p384N930J0648k4746j0924n1254R852M1926
13260a8207K7872Q54J9626n590l0640j8521M8061l1708j4237K8848j1335k184
13248g161J8332J77M1144l5455k8568L4792K1477n2078j4850P266K4434J2510
13236B2020k2613k274J2825j7197k5301q786k6224L5408O476j5632M4630J263
$$ plain form
13224 4595 -47117 -59417 -73266 -26834 35757 3250 13930 19771 8448 18780 -5710 -22968
13212 -22968 -19056 6441 55586 101460 82641 52054 9683 24245 28352 26244 40081 53063
13200 53063 70904 61143 36656 46456 46202 37854 19819 -29789 -48620 -70491 -37582 -7541 6242
13187 6242 5539 25511 10445 6523 -1796 -40827 -48575 -68283 -63604 -8731 34291 20672 46686
13174 46686 54064 48947 19236 -16745 -28658 -14123 -22668 -22478 -31482 -22618 -51459 -40874 -18563
13161 -18563 7220 -9878 -27246 -10046 32225 113860 134555 76533 39015 61437 30260 422
13149 422 -513 -23681 -17418 21991 15050 7026 30058 23817 25083 8648 -38378 -45225 -18150 420
13135 420 9276 -37220 -46162 -20190 17916 11659 31859 22600 38595 37481 20477 -4359 -23955
$$ packed form
13224D595n1712j2300j3849M6432O2591l2507J0680N841j1323J0332k4490j7258
13212b2968L912K5497M9145M5874j8819l0587m2371J4562M107k108J3837J2982
13200E3063J7841r761k4487R800k54q348j8035m9608j8831k1871L2909L0041J3783
13187F242p03J9972j5066l922q319l9031p748j9708M679N4873M3022j3619K6014
13174D6686P378n117k9711l5981j1913J4535q545J90r004Q864k8841J0585K2311
13161a8563K5783j7098j7368J7200M2271Q1635K0695n8022l7518K2422l1177k9838
13149D22r35k3168O263L9409o941q024K3032o241J266j6435m7026o847K7075J8570
13135D20Q856m6496q942K5972L8106o257K0200r259J5995j114j7004k4836j9596
$$ plain form
13122 -23955 5712 20870 -17456 -47212 -12001 -2971 21694 6088 -4976 3553 -9922 -34214
13110 -34214 -34282 -11898 -22375 -14721 -28556 -44854 -26234 -16519 20287 59974 34801 -50078 -54956
13097 -54956 -25126 464 47636 9865 5206 7104 32224 62008 83097 92577 32117 -40126
13085 -40126 -15580 23929 11331 18850 17722 -35283 -65163 -67746 -54360 -29327 -31867 -47862
13073 -47862 -96895 -97796 -53150 -37233 -16641 3492 46474 102553 53471 32833 58257 45526
13061 45526 -4588 2249 17360 9579 -7974 -8843 -18629 -25768 4707 69162 43885 -1706 -6929
13048 -6929 -11215 9211 42471 60108 11247 -26938 -28448 -3935 -22452 -45906 -21566 2147
13036 2147 25104 16658 42902 62106 42510 -9757 -10761 18523 -22040 -41036 -16524 -13568
$$ packed form
13122b3955K9667J5158l8326k9756L5211R030K4665j5606j1064Q529j3475k4292
13110c4214o8K2384j0477P654j3835j6298J8620R715L6806L9687k5173q4879m878
13097e4956K9830K5590M7172l7771m659J898K5120K9784K1089R480o0460p2243
13085d0126K4546L9509j2598P519j128n3005k9880k583J3386K5033k540j5995
13073d7862m9033r01M4646J5917K0592K0133M2982N6079m9082k0638K5424j2731
13061D5526n0114O837J5111p781j7553q69r786p139L0475O4455k5277m5591n223
13048f929m286K0426L3260J7637m8861l8185j510K4513j8517k3454K4340K3713
13036B147K2957q446K6244J9204j9596n2267j004K9284m0563j8996K4512K956
$$ plain form
13024 -13568 2951 436 3399 11117 -39034 -68089 -52606 -51402 -91831 -96098 -54085 -49789 -52513
13011 -52513 3195 25574 42736 33145 -32941 -69323 -54331 -32883 -1080 35583 32434 15049
12999 15049 5024 45351 27028 13734 29823 24272 -16061 -25571 -12525 3019 8410 21008
12987 21008 49344 31399 -6511 -31579 -42829 -28282 -61503 -65320 -56616 -13383 7532 -13707
12975 -13707 -31303 -26176 -55115 -26359 -22760 -16049 25402 55217 63908 45165 12618 21439 21709
12962 21709 25164 18446 -8711 -35379 -32080 -2423 -27411 -51364 -38078 -17150 37706 48996
12950 48996 9897 -422 -3774 14632 32450 36934 8255 -16776 -32876 -3765 -22015 -8879
12938 -8879 -17097 -1270 1711 35822 22993 -14015 -17462 5437 16930 41193 35829 23942 24034
$$ packed form
13024a3568J6519k515K963P718n0151k9055J5483J204m0429m267M2013M296k724
13011e2513N5708K2379J7162r591o6086l6382J4992K1448L1803L6663l149j7385
12999A5049j0025M0327j8323j3294J6089n551m0333r510J3046J5544N391J2598
12987B1008K8336j7945l7910k5068j1250J4547l3221l817Q704M3233K0915k1239
12975a3707j7596N127k8939K8756L599O711M1451K9815Q691j8743l2547Q821K70
12962B1709L455o718k7157k6668L299K9657k4988k3953J3286K0928N4856J1290
12950D8996l9099j0319l352J8406J7818M484k8679k5031j6100K9111j8250J3136
12938h879q218J5827K981L4111j2829l7008l447K2899J1493K4263n364j1887R2
$$ plain form
12925 24034 -43364 -26120 -15347 -39369 12151 21445 -4705 -8799 2990 9904 5055 15037 28509
12912 28509 34598 13846 15192 -2741 -37041 -38535 -12293 26236 33918 15212 -20596 -63752
12900 -63752 -37094 -22618 -9786 -30447 -61576 -98328 -66020 -57239 -70254 -40776 -43346 -32015
12888 -32015 -6853 17156 42267 3261 -39049 -42160 -33424 -38915 -68765 -101742 -64922 -80085
12876 -80085 -86508 -77757 -70697 -59476 -49970 -51970 -35043 -38953 -7213 10299 833 -71705 -96238
12863 -96238 -49982 -32701 -65182 -38899 -25645 -37346 -38316 -32671 -12269 10942 42759 15993
12851 15993 -8066 -6836 -21788 11776 14536 -8454 3310 30183 40090 23297 251 -50023
12839 -50023 -37616 -34574 -40158 -51954 -21967 4039 32457 39168 36490 8082 3166 18471 29014
$$ packed form
12925B4034o7398J7244J0773k4022N1520R294k6150m094J1789O914m849R982J3472
12912B8509O089k0752J346j7933l4300j494K6242L8529P682j8706l5808m3156
12900f3752K6658J4476J2832k0661l1129l6752L2308Q781j3015K9478k570J1331
12888c2015K5162K4009K5111l9006m2310l111Q736n491k9850l2977L6820j5163
12876h0085o423Q751P060J1221R506k000J6927l910L1740J7512r466p2538k4533
12863i6238M6256J7281l2481K6283J3254j1701r70N645K0402K3211L1817k6766
12851A5993k4059J230j4952L3564K760k2990J1764K6873R907j6793k3046n0274
12839e0023J2407L042n584j1796K9987K6006K8418O711k678k8408m916J5305J0543
$$ plain form
12826 29014 42697 33519 32777 36032 1490 -39852 -50933 -23558 -7726 -32015 1882 14157
12814 14157 9821 6582 -1490 8445 18927 39756 49558 -5409 -22928 -1044 40410 48153 79804
12801 79804 50029 12785 -29092 -67000 -62501 -64619 -53149 -4352 -1674 -20982 -36245 -29689
12789 -29689 -31138 -12998 47343 58010 48508 16447 -40342 -55862 -56749 -14862 -1438 -8197 7662
12776 7662 41872 78231 57376 4226 31953 59810 77096 37904 -44977 -57497 -16629 -6904
12764 -6904 -26720 -16720 -7672 -27372 -27220 -5952 -41348 -52211 -18916 13330 29665 42122
12752 42122 38843 49070 44365 56113 51633 59979 32168 6842 44790 95460 146700 143862 138019
12739 138019 71983 73419 103967 84576 77043 52375 27015 9103 17929 -1670 11345 24566
$$ packed form
12826B9014J3683r178p42L255l4542m1342j1081K7375J5832k4289L3897J2275
12814A4157m336l239q072R935J0482K0829R802n4967j7519K1884M1454P743L1651
12801G9804k9775l7244m1877l7908M499k118J1470M8797K678j9308j5263O556
12789b9689j449J8140O0341J0667r502l2061n6789j5520q87M1887J3424o759J5859
12776G662L4210L6359k0855n3150K7727K7857J7286l9192q2881j2520M0868R725
12764f904j9816J0000R048j9700J52K1268l5396j0863L3295L2246J6335J2457
12752D2122l279J0227m705J1748m480Q346k7811k5326L7948N0670N1240k838n843
12739A38019o6036J436L0548j9391p533k4668k5360j7912Q826j9599J3015J3221
$$ plain form
12727 24566 46202 28925 -12309 -58431 -39129 -23500 -10515 -24980 -12703 -45825 -51291 -34249
12715 -34249 -21341 -31653 -55710 -47481 -15367 -19126 -38514 -62361 -32570 -4515 20472 4508
12703 4508 -5215 -38297 -46353 -52471 -29376 -9291 -27474 24179 34775 26880 24329 28616 15992
12690 15992 18096 11784 34603 42683 -3893 -74804 -81554 -52379 -48109 -40077 2665 936 -10408
12677 -10408 25072 -2171 -19728 25178 68019 98375 114898 114461 96392 57933 50576 53378
12665 53378 75646 50060 38107 61978 63989 38497 24868 9948 4690 3799 -14838 -8562 -25487
12652 -25487 -36820 -38907 -30267 -19837 24009 -15570 -45047 -46083 23499 52109 35431 -5970
12640 -5970 -41435 -55002 -81400 -72194 -48413 -45731 -49790 -35852 -6455 11527 12582 -5484 -28198
$$ packed form
12727B4566K1636j7277m1234m6122J9302J5629J2985j4465J2277l3122n466J7042
12715c4249J2908j0312k4057Q229L2114l759j9388k3847K9791K8055K4987j5964
12703D508r723l3082q056o118K3095K0085j8183N1653J0596p895k551M287j2624
12690A5992K104o312K2819Q080m6576p0911o750K9175M270Q032M2742j729j1344
12677a0408L5480k7243j7557M4906M2841L0356J6523m37j8069l8459p357K802
12665E3378K2268k5586j1953K3871K011k5492j3629j4920n258q91j8637O276j6925
12652b5487j1333k087Q640J0430M3846l9579k9477j036O9582K8610j6678m1401
12640e970l5465j3567k6398R206K3781K682m059J3938K9397J7982J055j8066k2714
$$ plain form
12627 -28198 -38324 -22141 -22773 -39615 -19013 -13231 -2172 -8632 56368 68321 40544 11093
12615 11093 -22887 -39484 -23479 -17811 -24232 -21860 3998 29159 36267 28729 -22624 -48854 -15937
12602 -15937 -14100 -34359 -6362 -20833 -52757 -41515 -7596 -26676 -16501 -3812 -1687 54091
12590 54091 22688 4878 17681 3802 -28442 -18589 28318 55909 28594 -47312 -55544 -6850
12578 -6850 9042 18422 -12009 -48468 -32339 -5319 -21252 -11128 873 5286 4203 -6365
12566 -6365 -5537 -25658 -32959 -17003 58276 40266 -26412 -10252 13388 5129 993 -14783 -45593
12553 -45593 -66762 -51613 -4230 8282 13093 -16203 -4016 -18408 -74440 -87844 -42067 -440
12541 -440 28011 23165 -3146 -26465 -55079 -9901 16993 15557 -14594 -19159 21617 11503 -20854
$$ packed form
12627b8198j0126J6183o32j6842K0602N782J1059o460O5000J1953k7777k9451
12615A1093l3980j6597J6005N668o421K372K5858K5161P108p538n1353k6230L2917
12602a5937J837k0259K7997j4471l1924J1242L3919j9080J0175J2689K125N5778
12590E4091l1403j7810J2803j3879l2244R853M6907K7591k7315p5906q232M8694
12578f850J5892R380l0431l6459J6129K7020j5933J0124J2001M413j083j0568
12566f365Q28k0121p301J5956P5279j8010o6678J6160K3640q259m136j5776l0810
12553d5593k1169J5149M7383J2512M811k9296J2187j4392n6032j3404M5777M1627
12541d40K8451m846k6311k3319k8614M5178K6894j436l0151m565M0776j0114l2357
$$ plain form
12528 -20854 -49750 -24279 -3001 30072 53370 7886 -45424 -37384 -13665 -55444 -49654 -11345
12516 -11345 3378 19600 4045 17001 25902 -19478 -74734 -76493 -73670 -32026 -9400 11814
12504 11814 -6217 -19220 -11222 12393 30496 54714 35974 19583 24204 3898 -47012 -28823
12492 -28823 6093 43181 42565 34562 9973 -8261 -27691 -37598 -36327 -26223 10732 18159 19376
12479 19376 27677 42329 37344 58032 66873 26957 34125 115 3107 1848 8569 23743 24497
12466 24497 8947 4067 17694 6044 -15170 1457 12532 22977 35485 76562 75380 25178
12454 25178 17104 39343 82270 42930 -16397 -12959 5372 1929 -43445 -65922 -29385 -164
12442 -164 3509 32299 108746 91945 32474 -40011 -15319 28935 39433 22069 8312 -2332
$$ packed form
12528b0854k8896K5471K1278L3073K3298m5484n3310Q040K3719m1779N790L8309
12516a1345J4723J6222j5555J2956Q901m5380n5256j759K823M1644K2626K1214
12504A1814j8031j3003P998K3615J8103K4218j8740j6391M621k0306n0910J8189
12492b8823L4916L7088o16q003k4589j8234j9430r907J271J0104L6955P427J217
12479A9376Q301J4652m985K0688Q841l9916P168l4010K992j259O721J5174P54
12466B4497j5550m880J3627j1650k1214J6627J1075J0445J2508M1077j182n0202
12454B5178q074K2239M2927l9340n9327L438J8331l443m5374k2477L6537K9221
12442a64L673K8790P6447j6801n9471p2485K4692M4254J0498j7364j3757j0644
$$ plain form
12430 -2332 -21387 -71164 -49745 -29663 -11547 14011 22771 -19092 -43131 -22557 -5022 14591
12418 14591 -2734 14299 18152 -13122 -53405 -27227 -24588 -42581 -65470 -48996 -46921 -63866
12406 -63866 -34368 -10276 -26532 -5151 -8205 26371 23687 13179 40752 46890 47838 90001 64731
12393 64731 48710 4614 -4558 23409 38901 -7385 -28027 -43395 -35760 -46559 -35326 -82243
12381 -82243 -60975 -19296 -11782 -3901 -1748 -11574 -2939 -50274 -5360 -1722 -7005 -16443 -21716
12368 -21716 -29460 4628 17157 -1839 -63397 -71220 -43560 13175 25729 -14980 -12030 2728
12356 2728 53171 100290 98720 64778 817 257 43024 34548 3809 -24546 403 42379 57853
12343 57853 48859 13958 23142 40327 61690 97035 110224 127828 217024 323748 417081 537549
$$ packed form
12430b332j9055m9777K1419K0082J8116K5558Q760m1863k4039K0574J7535J9613
12418A4591j7325J7033L853l1274m0283K6178K639j7993k2889J6474K075j6945
12406f3866K9498K4092j6256K1381l054L4576k684j0508K7573O138R48M2163k5270
12393F4731j6021m4096r172K7967J5492m6286k0642j5368P635j0799J1233m6917
12381h2243K1268M1679P514P881K153r826Q635m7335M4914L638n283r438n273
12368b1716p744L4088J2529j8996o1558p823K7660N6735J2554m0709K950J4758
12356B728N0443M7119j570l3942o3961n60M2767q476l0739k8355K4949M1976J5474
12343E7853q994l4901R184J7185K1363L5345J3189J7604Q9196J06724R3333J20468
$$ plain form
12331 537549 691520 847406 935184 970769 927787 758721 612164 490418 350864 244874
12321 244874 153647 111191 75376 33685 50560 60241 58701 48775 43739 44650 35564 28481 6454
12308 6454 -4796 -35985 -26307 -17203 38827 33549 -5934 15905 18188 19764 56267 56873 22867
12295 22867 -24830 -44186 -36147 -14376 -11413 -2480 -22000 -33072 -8004 -9827 -42267 -21793
12283 -21793 -15372 16907 2594 -5632 -14959 35786 52797 14093 -49855 -44599 -8350 11602
12271 11602 35835 27109 38213 48693 52029 87951 62063 14068 3934 9090 12945 -19109
12259 -19109 -32599 -33947 -28031 -13367 -17583 -40416 -60511 -29295 -34847 -64283 -4319 45460
12247 45460 8241 -19564 8768 18390 11099 -1358 -16926 -29200 -11857 2587 6 18828
$$ packed form
12331E37549J53971J55886Q7778L5585m2982j69066j46557j21746j39554j05990
12321B44874r1227m2456l5815m1691J6875R681j540r926n036R11r086p083k2027
12308F454j1250l1189R678R104N6030n278l9483K1839K283J576L6503O06l4006
12295B2867m7697j9356Q039K1771K963Q933j9520j1072K5068j823l2440K0474
12283b1793O421L2279j4313q226r327N0745J7011l8704o3948N256L6249J9952
12271A1602K4233q726J1104J0480L336L5922k5888m7995j0134N156L855l2054
12259a9109j3490j348N916J4664m216k2833k0095L1216n552k9436N9964M9779
12247D5460l7219k7805K8332R622p291j2457j5568j2274J7343J4444k581J8822
$$ plain form
12235 18828 46752 41659 58196 29945 -17254 -68495 -43218 -67146 -53135 -55231 -55504 -27970
12223 -27970 -24227 -38238 2574 42945 47589 52004 46612 13653 3668 25419 35436 17102 27708
12210 27708 -4608 24376 43286 -18061 -62748 -58348 -67272 -65663 -31756 -17969 8050 -26341
12198 -26341 -57183 -33215 -20066 -35943 -48836 -39330 -39209 -19780 13169 54925 62594 70177 64276
12185 64276 53250 2462 -23814 -2971 15768 21600 23981 7550 -39115 -33681 -46040 -31957
12173 -31957 -9327 -8938 8182 26957 58095 38369 18718 59823 44154 24606 -9867 -31545
12161 -31545 -54477 -11169 6659 288 -18677 -19473 -36607 -13646 12375 -11069 -31710 -34102
12149 -34102 -24727 -10507 -71827 -73835 -68709 -50256 -23302 -51746 -79230 -68169 -29644 -10344
$$ packed form
12235A8828K7924n093J6537k8251m7199n1241K5277k3928J4011k096k73K7534
12223b7970L743j4011M0812M0371M644M415n392l2959r985K1751J0017j8334J0606
12210B7708l2316K8984J8910o1347m4687M400q924J609L3907J3787K6019l4391
12198b6341l0842K3968J3149j5877j2893R506J21J9429L2949M1756P669P583n901
12185F4276j1026n0788k6276K0843J8739N832K381j6431m6665N434j2359J4083
12173c1957K2630L89J7120J8775L1138j9726j9651M1105j5669j9548l4473k1678
12161c1545k2932M3308J7828o371j8965p96j7134K2961K6021k3444k0641k392
12149c4102R375J4220o1320k008N126J8453K6954k8444k7484J1061L8525J9300
$$ plain form
12137 -10344 17572 25920 41239 29930 -9489 -8663 -9518 -34546 -22153 9643 53306 44482 -41971
12124 -41971 -68658 -35381 27087 40354 44247 -1103 -5764 14984 37836 40209 5084 -32788
12112 -32788 -52515 -43075 -38174 -6163 45120 44409 13082 19331 29233 -4289 -39691 -45272 -58118
12099 -58118 -14127 15594 21305 24127 3019 -15509 2820 5597 82 3111 -60195 -77231 -65677
12086 -65677 -55148 -66214 -54413 -96704 -102775 -72483 -914 -18636 -6379 52327 59684 26978
12074 26978 22546 52349 70153 56610 14860 3579 24352 22046 3673 -4999 -2642 -7458 1916
12061 1916 -11152 -9898 -36203 -63804 -42025 -18580 -14734 -58834 -74016 -63959 -52545 -65059
12049 -65059 -65646 -78425 -44153 -6125 -3406 -32792 -49480 -39225 -39058 -45382 -13048 -8706 18094
$$ packed form
12137a0344K7916Q348J5319j1309l9419Q26q55k5028J2393L1796M3663q824q6453
12124d1971k6687L3277O2468J3267L893m5350m661K0748K2852K373l5125l7872
12112c2788j9727R440M901L2011N1283p11l1327O249R902l3522l5402n581j2846
12099e8118M3991K9721N711K822k1108j8528J8329K777n515L029o3306j7036J1554
12086f5677J0529j1066J1801m2291o071L0292P1569j7722J2257N8706P357l2706
12074B6978m432K9803J7804j3543m1750j1281K0773k306j8373q672K357m816R374
12061A916j3068J254k6305k7601K1779K3445L846m4100j5182J0057J1414j2514
12049f5059n87j2779L4272L8028K719k9386j6688J0255J67o324L2334M342K6800
$$ plain form
12036 18094 20136 21864 39782 53674 27480 20700 19340 24512 -6224 20834 44413 62593 58684
12023 58684 72656 83162 54018 34013 64809 58538 24799 -54647 -75775 -83760 -22100 -13827
12011 -13827 -27287 -28372 -49100 -66636 -30351 -2095 32874 17280 -40957 -121074 -109705 -65374
11999 -65374 -50646 -37929 -44630 -29993 -34620 -58442 -92456 -72747 -58119 -56761 -41869 -55567
11987 -55567 -65357 -21311 2260 30103 47119 70016 50128 9201 -12506 10350 2012 -11137
11975 -11137 -56568 -77688 -47917 -7088 21675 35567 24204 48467 60534 56752 14629 -1405
11963 -1405 6481 25367 4158 -21499 -7243 -2357 1110 4317 -28777 -76933 -89527 -37497 -22727
11950 -22727 -21217 -21031 -35446 -31999 -12379 5362 12566 15470 -11928 -76594 -60985 -26491 3812
$$ packed form
12036A8094K042J728J7918J3892k6194o780j360N172l0736K7058K3579J8180l909
12023E8684J3972J0506k9144k0005L0796o271l3739p9446k1128p985O1660Q273
12011a3827j3460j085k0728j7536L6285K8256L4969j5594n8237q0117J1369M4331
11999f5374J4728J2717o701J4637m627k3822l4014J9709J4628J358J4892j3698
11987e5567r790M4046K3571K7843J7016K2897j9888m0927k1707K2856q338j3149
11975a1137m5431k1120K9771M0829K8763J3892j1363K4263J2067l782m2123j6034
11963a405P886J8886k1209k5657J4256M886L467L207l3094m8156j2594N2030J4770
11950b2727J510J86j4415L447J9620J7741P204K904k7398o4666J5609L4494L0303
$$ plain form
11937 3812 -3174 -19622 6031 42208 53772 22587 -20573 -34666 -22155 -42432 -28136 -2976
11925 -2976 6573 7685 29517 26992 48037 29916 -8677 39043 86604 80557 36808 15329 -20684
11912 -20684 -34252 -47603 -32122 -8225 -16167 -31776 -10516 12949 -956 -15195 -11184 -23161
11900 -23161 -27112 16762 3760 36346 82646 97082 69587 18414 32794 45845 63056 65427
11888 65427 72396 35863 -9109 -64629 -38388 -33666 -16696 14133 29006 41747 28405 7262
11876 7262 4539 4616 25071 43903 55917 64695 120358 153034 100521 20100 9276 34011 66267
11863 66267 94868 65113 31963 38850 25432 -18559 -10971 -47770 -75171 -69074 -24265 -7962
11851 -7962 24679 8013 24616 32588 43315 39422 17998 -31369 -86576 -70620 -31221 -15763
$$ packed form
11937C812o986j6448K5653L6177J1564l1185m3160j4093J2511k0277J4296K5160
11925b976R549J112K1832k525K1045j8121l8593M7720M7561o047m3749k1479l6013
11912b0684j3568j3351J5481K3897p942j5609K1260K3465j3905j4239M011j1977
11900b3161l951M3874j3002L2586M6300J4436k7495n1173J4380J3051J7211K371
11888F5427O969l6533m4972n5520K6241M722J6970L0829J4873J2741j3342k1143
11876G262k723P7K0455J8832J2014Q778N5663L2676n2513q0421j0824K4735L2256
11863F6267K8601k9755l3150O887j3418m3991P588l6799k7401O097M4809J6303
11851g962L2641j6666J6603P972J0727l893k1424m9367n5207J5956L9399J5458
$$ plain form
11839 -15763 -1297 5664 46103 87859 53499 36734 871 -13137 4670 9655 17445 38276
11827 38276 46005 18990 17501 14901 -17870 -691 -7464 -21121 -60146 -59312 -45786 -24307 -41870
11814 -41870 -6096 1584 668 -19161 4755 -14214 -5480 -650 28388 34470 36384 24068 40165
11801 40165 37693 20749 8017 609 5766 -40153 -82223 -74075 -37066 12713 23013 447
11789 447 2 3866 -2786 -5116 17545 34269 24549 31053 -21914 -74817 -82688 -81433 -43171 -70641
11775 -70641 -48451 -3970 -34757 -43077 -22183 -27703 -540 48373 67482 74506 53138 26747
11763 26747 19939 -4165 -3402 3566 14777 9819 41445 17011 1501 21726 39356 28810 91378
11750 91378 99105 36318 42813 14199 -11677 8149 -43534 -51637 -73354 -54469 -11850 25106
$$ packed form
11839a5763J4466O961M0439M1756l4360j6765l5863j4008J7807M985P790K0831
11827C8276P729k7015j489k600l2771J7179o773j3657l9025Q34J3526K1479j7563
11814d1870L5774P680r16j9829K3916j8969Q734M830K9038O082J914j2316J6097
11801D0165k472j6944j2732p408N157m5919m2070Q148L7009M9779J0300k2566
11789D47m45L864o652k330K2661J6724r720O504n2967n2903p871J255L8262k7470
11775g0641K2190M4481l0787q320K0894n520K7163M8913J9109P024k1368k6391
11763B6747o808k4104P63O968J1211m958L1626k4434j5510K0225J7630j0546O2568
11750I1378P727o2787O495k8614k5876J9826n1683q103k1717J8885M2619L6956
$$ plain form
11738 25106 46511 43062 13695 -12034 -58993 -79603 -83307 -45624 14298 -1379 4909 6748
11726 6748 18720 17186 -39452 -43342 -74431 -56962 -33782 -37848 -24107 -11464 -8104 -8171 -41621
11713 -41621 -69197 -74992 -38046 22501 16944 11209 19006 24314 43898 63133 34185 16835 56455
11700 56455 23293 2990 -18385 -22128 23175 39160 67914 84123 56636 67731 53350 -60966
11688 -60966 -113556 -79004 -38409 -57816 -57450 -35670 -5856 -7677 -53830 -80152 -87657 -90489 -60132
11675 -60132 -30625 -32072 -69873 -56568 -27702 7661 17810 6385 -10272 -41161 -6464 -22861
11663 -22861 -31318 -42090 -71559 -74964 -34015 -17903 13163 -16933 -28669 -6245 37151 62704
11651 62704 31620 23680 50033 67516 72750 50013 26883 14288 -6981 18039 -20572 -20912
$$ packed form
11738B5106K1405l449k9367k5729m6959k0610l704L7683N9922j5677O288J839
11726F748J1972j534n6638l890l1089J7469K3180m066J3741J2643L360o7l3450
11713d1621k7576n795L6946O0547n557n735P797N308J9584J9235k8948j7350L9620
11700E6455l3162k0303k1375l743M5303J5985K8754J6209k7487J1095j4381j14316
11688f0966n2590L4552M0595j9407L66K1780K9814j821m6153k6322p505k832L0357
11675f0132K9507j447l7801J3305K8866L5363J0149j1425j6657l0889L4697j6397
11663b2861q457j0772k9469l405M0949J6112L1066l0096j1736K2424M3396K5553
11651F2704l1084p940K6353J7483N234k2737k3130j2595k1269K5020l8611l40
$$ plain form
11639 -20912 28740 32839 -34184 -17758 -28975 -37845 -34837 -34460 -15381 -34143 -21059 -29164 11188
11626 11188 23086 37350 4028 -40849 -67774 -47071 -37538 596 35165 -15325 -42410 -7522
11614 -7522 -3359 -30282 -1225 62910 50037 7164 -25020 -35943 -26226 -28159 1722 -29051
11602 -29051 -34872 3388 32126 34763 3351 -30412 -33601 -36811 -11310 18389 8105 8894 27595
11589 27595 31716 29952 18655 1973 -41135 -37828 -75849 -72012 -56025 -40883 -39466 -55283 -31852
11576 -31852 -32446 -52435 -73899 -64615 -71738 -50519 -33285 -53735 -40202 16850 8787 -16923 -47059
11563 -47059 -57846 -52566 -30027 -16240 241 36098 37059 2196 2361 -717 -18442 -11709 19185
11550 19185 21039 -6227 -4800 -32433 -68769 -92694 -82491 -14449 14133 23441 -16041 -9374
$$ packed form
11639b0912M9652M099o7023J6426j1217q870L008L77J9079j8762J3084q105M0352
11626A1188J1898J4264l3322m4877k6925K0703R533L8134L4569n0490k7085L4888
11614g522M163k6923K9057O4135j2873m2873l2184j0923R717j933K9881l0773
11602b9051n821L8260K8738K637l1412l3763l189l210K5501K9699j0284P89J8701
11589B7595M121j764j1297j6682m3108L307l8021L837J5987J5142J417j5817K3431
11576c1852n94j9989k1464R284p123K1219J7234k0450J3533N7052q063k5710l0136
11563d7059j0787N280K2539J3787J6481L5857R61l4863J65l078j7725O733L0894
11550A9185J854k7266J427k7633l6336k3925J0203O8042K8582R308l9482O667
$$ plain form
11538 -9374 -8232 -1436 10184 26808 10814 1025 -31302 -55732 -36946 9960 11604 -1408 -17113
11525 -17113 -22889 -9943 -28794 -32618 -9153 6295 -7187 -11821 34221 72518 29693 -9487
11513 -9487 -19611 16053 13498 -47305 -43887 626 -49075 -51195 -3970 -3302 -18775 -573 17182
11500 17182 74841 63440 18316 28399 27839 -16548 -99738 -133235 -104556 -90998 -62890 -45083
11488 -45083 -56754 -62204 -42846 -25029 9702 52093 52265 60154 40535 33636 49914 16763 -3757
11475 -3757 -17448 -26267 9352 50397 34815 47419 54195 40436 15904 19255 49033 29296
11463 29296 -33356 -67608 -53244 -29841 -3360 32804 88821 91727 16344 -36801 -54138 -36443
11451 -36443 22812 66911 46792 10588 8540 18079 -6398 -15722 8665 28110 39406 59841
$$ packed form
11538i374J142O796J1620J6624j5994r789l2327k4430J8786M6906J644j3012j5705
11525a7113n776J2946j8851l824K3465J5448j3482m634M6042L8297m2825l9180
11513i487j0124L5664k555o0803L418M4513m9701k120M7225O68j5473J8202J7755
11500A7182N7659j1401m5124J0083n60m4387q3190l3497K8679J3558K8108J7807
11488d5083j1671n450J9358J7817L4731M2391J72P889j9619o899J6278l3151k0520
11475c757j3691q819L5619M1045j5582J2604O776j3759k4532L351K9778j9737
11463B9296o2652l4252J4364K3403K6481L6164N6017K906p5383n3145j7337J7695
11451c6443N9255M4099k0119l6204k048R539k4477r324K4387J9445J1296K0435
$$ plain form
11439 59841 47132 47018 34470 3383 -23246 -25513 -74581 -107359 -127816 -119350 -97051 -86460
11427 -86460 -56750 -25352 -13281 -21896 26599 -6972 -3075 30224 42611 4260 -8324 -23987
11415 -23987 -34336 -47957 -62417 -56287 -56768 -17884 2821 9538 63088 92717 74784 55357
11403 55357 51290 44030 22624 39977 47629 20503 11414 15445 3463 -62714 -61693 -55950 -78550
11390 -78550 -26663 6450 33299 52340 35741 20782 1863 22167 32905 24668 49905 9519
11378 9519 -70172 -62591 -20826 2317 -1188 34995 21113 14174 1639 -29828 -13096 -32230
11366 -32230 -35269 -18121 11542 -20386 -41034 -52716 -31818 -48005 -24906 -33814 -15076 -26136
11354 -26136 -39788 -30969 28509 45534 71153 69566 16894 11096 17834 416 36739 64149
$$ packed form
11439E9841j2709j14j2548l1087k6629k267m9068l2778k0457Q466K2299J0591
11427h6460K9710L1398J2071q615M8495l3571L897L3299J2387l8351j2584j5663
11415b3987j0349j3621j4460O130m81L8884K0705O717N3550K9629j7933j9427
11403E5357m067p260k1406J7353P652k7126r089M031j1982o6177J021N743k2600
11390g8550N1887L3113K6849J9041j6599j4959j8919K0304J0738q237K5237m0386
11378I519p9691P581M1765K3143l505L6183j3882o939j2535l1467J6732j9134
11366c2230l039J7148K9663l1928k0648j1682K0898j6187K3099q908J8738j1060
11354b6136j3652Q819N9478J7025K5619j587n2672n798O738j7418L6323K7410
$$ plain form
11342 64149 94519 77602 24019 -2384 -17100 -9625 -2215 -27895 -46801 -33001 -5449 28782
11330 28782 9536 -13285 2681 10539 18662 38737 20730 -15617 16026 39254 36001 40368
11318 40368 49826 32413 20286 65678 86771 55125 60535 70656 89254 71224 51888 34655
11306 34655 31593 53639 19553 -31128 -75870 -58472 -34408 -8814 20539 80314 160316 255014
11294 255014 327319 441621 494396 490149 471816 433999 298155 208023 136725 115980 114175
11283 114175 92351 51836 48266 60038 28255 -2747 -15660 34925 76806 88913 67996 45425
11271 45425 3628 74 23435 43247 29167 33570 67524 69771 32853 -6452 15047 33272
11259 33272 43612 38978 57846 66885 81581 79180 46835 29441 48035 44698 -5465 -47443
$$ packed form
11342F4149L0370j6917n3583k6403j4716P475P410k5680j8906J3800K7552L4231
11330B8782j9246k2821J5966P858Q123K0075j8007l6347L1643K3228l253M367
11318D0368R458j7413j2127M5392K1093l1646N410J0121J8598j8030j9336j7233
11306C4655l062K2046l4086n0681m4742J7398K4064K5594K9353N9775Q0002R4698
11294B55014P2305J14302N2775m247j8333l7817j35844r0132p1298k0745j805
11283A14175k1824m0515l570J1772l1783l1002j2913N0585M1881J2107k0917k2571
11271D5425m1797l554K3361J9812j4080M403L3954K247l6918l9305K1499J8225
11259C3272J0340m634J8868R039J4696k401l2345j7394J8594l337n0163m1978
$$ plain form
11247 -47443 -55519 -45631 -45013 -62937 -84293 -111588 -82691 -55295 -77861 -45588 -47137 -26145 20397
11234 20397 25922 21056 28108 6607 -13543 -5323 37915 21480 5013 -10286 32438 3938
11222 3938 -28875 -21245 -19849 -59725 -83409 -79860 -30813 56307 36376 -6486 -44498 -31437
11210 -31437 -31167 -19602 -7456 10465 4633 2101 -27195 -70393 -9298 36611 -803 8615 -4877
11197 -4877 2607 21671 -16664 -37710 -27018 -22975 10037 45050 49032 59363 66418 42314 30023
11184 30023 42626 86613 148010 213292 349049 442289 473219 439090 420181 422820 426464 341756
11172 341756 214360 123506 83934 69661 56289 22040 15667 7703 -16999 -23165 -18048 -4698
11160 -4698 -2301 -29173 -59576 -56170 -60069 -63167 -52967 -52629 -49350 -37316 -34898 -26817 -19231 -35900
$$ packed form
11247d7443q076R888O18j7924k1356k7295K8897K7396k2566L2273j549K0992M6542
11234B0397N525m866P052k1501k0150Q220M3238j6435j6467j5299M2724k8500
11222C938l2813P630J396l9876k3684L549M9047Q7120j9931m2862l8012J3061
11210c1437K70J1565J2146J7921n832k532k9296m3198O1095M5909l7414R418j3492
11197d877P484J9064l8335k1046J0692M043L3012L5013L982J0331P055k4104j2291
11184C0023J2603M3987O1397O5282J35757R3240L0930l4129j8909K639L644q4708
11172C41756j27396r0854l9572j4273j3372l4249o373p964k4702o166N117J3350
11160d698K397k6872l0403L406l899l098J0200L38L279J2034K418Q081P586j6669
$$ plain form
11146 -35900 -40734 -16932 -16493 3195 -10021 -42470 -57875 -41361 10589 4067 -25813 -67943
11134 -67943 -51195 -30148 -64145 -67757 -42369 -5529 -2092 -51424 -27391 18714 17486 34743
11122 34743 50227 16032 1290 -2058 15277 -191 23836 58455 36567 -2990 -66946 -74687
11110 -74687 -19171 -1195 8502 54519 86427 62909 23782 -32656 -74814 -27540 -41095 -23510
11098 -23510 -7565 -45319 -28598 -30954 -61983 -40425 -32843 32179 28372 37608 40098 74479 32193
11085 32193 -26247 -50675 -36259 3976 31239 52569 42770 30942 24502 16223 -9120 -75255
11073 -75255 -57882 10117 21355 -29575 -55227 -60216 -50644 -21342 -43114 -53901 -32760 25016
11061 25016 37668 5690 -19445 -6305 -9469 -18737 -37763 -36356 -76539 -61121 -24105 -14530
$$ packed form
11146c5900m834K3802M39J9688j3216l2449j5405J6514N1950o522k9880m2130
11134f7943J6748K1047l3997l612K5388L6840L437m9332K4033M6105j228J7257
11122C4743J5484l4195j4742l348J7335j5468K4027L4619k1888l9557o3956p741
11110g4687N5516J7976R697M6017L1908k3518l9127n6438m2158M7274j3555J7585
11098b3510J5945l7754J6721k356l1029K1558P582O5022l807R236K490L4381m2286
11085C2193n8440k4428J4416M0235K7263K1330r799j1828o440q279k5343o6135
11073g5255J7373O7999J1238n0930k5652m989R572K9302k1772j0787K1141N7776
11061B5016J2652l1978k5135J3140l164r268j9026J407m0183J5418L7016R575
$$ plain form
11049 -14530 -20158 -1550 2466 25448 -6777 -22508 488 12626 3736 -14365 -2252 3601
11037 3601 8558 -8276 -62168 -85549 -45161 -34925 -29889 -64917 -67363 -36416 -53457 -69647
11025 -69647 -93919 -99831 -81599 -77924 -97312 -80662 -52517 -25895 1803 41187 25030 1084
11013 1084 21739 26535 29172 48132 24589 2952 -14712 -8229 -1010 11817 6890 -31485 -29364
11000 -29364 -19738 -18673 -18760 -12416 -25390 -26321 -17312 -7724 30482 43906 12352 -6304 -21368 13323
10986 13323 9741 24394 38514 -4403 -7187 -17657 -16482 5279 12891 52537 92027 88849 29855
10973 29855 -16756 -28046 -6288 -13102 48587 76472 69782 16872 -8374 -15375 -39477 1946
10961 1946 45963 27622 16823 18797 2972 -9848 30033 33112 29806 8316 -21630 -34452
$$ packed form
11049a4530n628J8608M016K2982l2225j5731K2996J2138q890j8101J2113N853
11037C601M957j6834n3892k3381M0388J0236N036l5028k446L0947j7041j6190
11025f9647k4272n912J8232L675j9388J6650K8145K6622K7698L9384j6157k3946
11013A084K0655M796K637J8960k3543k1637j7664O483P219J2827m927l8375K121
11000b9364R626J065q7O344j2974r31R009R588L8206J3424l1554j8656j5064L4691
10986A3323l582J4653J4120m2917k784j0470J175K1761P612L9646L9490l178n8994
10973B9855m6611j1290K1758o814O1689K7885o690n2910k5246p001k4102M1423
10961A946M4017j8341j0799J974j5825j2820L9881L079l306k1490k9946j2822
$$ plain form
10949 -34452 14922 60869 57242 32458 8687 -1911 41568 84031 100973 76175 114067 127286
10937 127286 75181 26697 -24913 -20437 2408 -991 -20058 -27858 -54112 -63648 -41197 -23693
10925 -23693 -14139 -20869 -44065 -28156 -33491 -43375 -45109 -52999 -7212 39839 28811 25767 36806
10912 36806 83615 49600 -3961 -667 6818 -25821 -27219 -34119 5510 31393 21391 -20336
10900 -20336 -3499 13528 44458 38526 45558 60597 47648 54993 71941 19268 29372 -9751
10888 -9751 -52608 -37180 -4811 -21298 -24353 -10475 43788 98237 157518 202041 242943 361096
10876 361096 524696 765143 1037445 1222534 1354588 1508560 1676858 1738468 1592396 1427226
10866 1427226 1253810 1082894 890958 688499 511633 402440 329077 214125 169454 161456
$$ packed form
10949c4452M9374M5947l627k4784k3771j0598M3479M2463J6942k4798L7892J3219
10937A27286n2105m8484n1610M476K2845l399j9067p800k6254r536K2451J7504
10925b3693R554o730k3196J5909n335r884j734p890M5787M7051j1028l044J1039
10912C6806M6809l4015n3561L294P485l2639j398o900L9629K5883j0002m1727
10900b0336J6837J7027L0930n932P032J5039j2949P345J6948n2673J0104l9123
10888i751m2857J5428L2369j6487l055J3878N4263N4449N9281M4523M0902J18153
10876C61096J63600K40447K72302J85089J32054J53972J68298O1610j46072j65170
10866A427226j73416j70916j91936k02459j76866j09193p3363j14952m4671p998
$$ plain form
10856 161456 118036 35861 -5011 30904 71316 73873 73615 98351 117285 120434 72377 58239
10844 58239 56270 85287 112964 71119 83621 116619 108185 41049 -31135 -52947 -33703 -10820
10832 -10820 12700 32957 37259 37294 52237 29099 8499 19256 -19676 -30691 -48242 -37392
10820 -37392 -25189 -31741 -2812 5644 -8737 -14954 -16226 -13300 -44336 -55578 -91763 -122569 -142757
10807 -142757 -98956 -43159 20736 35797 36263 59549 58604 45001 44449 17650 -1001 -40622 -40757
10794 -40757 -20379 -7750 19150 -10951 -16804 -15524 15257 -12146 -45097 -53590 -66622 -87326
10782 -87326 -118919 -128485 -130091 -166419 -124857 -32487 41428 -5481 -45779 -66948 -49253 -14532
10770 -14532 15035 44773 75785 66003 -1442 3461 25058 26366 25027 31079 27655 -9175 27042
$$ packed form
10856A61456m3420q2175m0872L5915M0412K557k58K4736J8934L149m8057j4138
10844E8239j969K9017K7677m1845J2502L2998q434o7136p2184k1812J9244K2883
10832a0820K3520K0257M302L5J4943k3138k0600J0757l8932j1015j7551J0850
10820c7392J2203o552K8929Q456j4381o217j272K926l1036j1242l6185l0806k0188
10807a42757M3801N5797O3895J5061M66K3286r45j3603n52k6799j8651l9621j35
10794d0757K0378J2629K6900l0101n853J280L0781k7403l2951q493j3032k0704
10782h7326l1593r566j606l6328M1562R2370P3915m6909m0298k1169J7695L4721
10770a4532K9567K9738L1012r782o7445M903K1597J308j339O052l424l6830L6217
$$ plain form
10757 27042 74633 90429 101589 113276 205380 323077 307314 242335 187658 121686 70099
10746 70099 41373 61551 24381 -2260 -5325 -25518 -23369 3990 30253 43381 35535 24414
10734 24414 35469 -11175 10689 43029 30005 67614 137023 148319 151860 197280 240272 240506
10722 240506 221146 247013 246989 245646 250536 224091 176932 203068 232324 242290 169645 114418 71294
10709 71294 64730 56953 35942 71099 58244 36067 25616 60116 67112 5332 -3189 9112
10697 9112 55156 59899 37638 27132 22745 21567 -7320 -24677 -14551 -407 -15984 -20278 -10913
10684 -10913 -9709 39275 69697 53059 84770 118796 105603 200759 353033 510431 675872
10673 675872 781464 730187 613854 442839 301178 188540 122301 112768 96238 98149 92955
$$ packed form
10757B7042M7591J5796J1160J1687R2104J17697j5763o4979n4677o5972n1587
10746G0099k8726K0178l7170k6641l065k0193K149K7359K6263J3128p846j1121
10734B4414J1055m6644K1864L2340j3024L7609O9409J1296L541M5420M2992K34
10722B40506j9360K5867k4j343M890k6445m7159K6136K9256R966p2645n5227m3124
10709G1294o564p777k1011L5157j2855k2177j0451L4500O996o1780q521J2301
10697I112M6044M743k2261j0506m387j178k8887j7357J0126J4144j5577m294R365
10684a0913J204M8984L0422j6638L1711L4026j3193R5156J52274J57398J65441
10673F75872J05592n1277j16333j71015j41661j12638o6239r533j6530J911n194
$$ plain form
10662 92955 108351 129053 148456 144059 133519 122482 113377 87500 52798 25778 45145 78410
10650 78410 94367 78667 33911 11237 53651 87339 71314 -18039 -65242 -55413 -48066 -24022
10638 -24022 18605 12694 14781 83283 120555 96848 59217 57138 46064 23039 52107 88005
10626 88005 89093 60059 6850 -5779 -14029 17960 59044 43211 82919 120485 123617 123714 191948
10613 191948 201742 255171 306060 317969 296182 323286 318060 290243 215459 121591 114201 153502
10601 153502 161290 163192 157204 197401 320627 336866 320539 308449 397069 447297 416232 367385
10589 367385 372832 383728 391344 368884 329177 325339 352688 315601 260362 290130 325460 333314
10577 333314 357993 390033 438210 454371 439058 456660 532901 634444 645673 604878 559671
$$ packed form
10662I2955J5396K0702J9403m397j0540j1037r105k5877l4702k7020J9367L3265
10650G8410J5957j5700m4756k2674M2414L3688j6025q9353m7203R829P347K4044
10638b4022M2627n911K087O8502L7272k3707l7631k079j1074k3025K9068L5898
10626H8005J088k9034n3209j2629q250L1989M1084j5833L9708L7566L132R7O8234
10613A91948R794N3429N0889J1909k1787K7104n226k7817p4784r3868p390L9301
10601A53502P788J902n988M0197J23226J6239j6327j2090Q8620N0228l1065m8847
10589C67385N447J0896P616k2460l9707l838K7349l7087n5239K9768L5330P854
10577C33314K4679L2040M8177J6161j5313J7602P6241J01543J1229m0795m5207
$$ plain form
10566 559671 524872 477929 399600 352789 327762 310619 263400 233657 256961 247302 273240 309821
10554 309821 321018 302315 334776 361294 372343 372854 371743 364059 366102 337142 298704 344003
10542 344003 408918 442593 472339 438295 426769 432104 452939 458047 463427 478166 440843 418305
10530 418305 425980 417652 408509 412116 410776 421537 442747 483130 508585 559575 587910 609396
10518 609396 615111 638500 705124 746006 741611 779572 861287 974557 1065329 1157289 1208216 1190245
10506 1190245 1225105 1345059 1466282 1540847 1594219 1672027 1815596 2012931 2184256 2348648
10496 2348648 2550127 2828857 3164074 3605071 4146387 4694692 5232917 5927092 6718367
10487 6718367 7565545 8393143 9241341 10210654 11402453 12900938 14720382 16838322 19738703
$$ packed form
10566E59671l4799m6943p8329m6811k5027j7143m7219k9743K3304r659K5938L6581
10554C09821J1197j8703L2461K6518J1049N11j111p684K043k8960l8438M5299
10542C44003O4915L3675K9746l4044j1526N335K0835N108N380J4739l7323k2538
10530D18305P675q328r143L607j340J0761K1210M0383K5455N0990K8335K1486
10518F09396N715K3389O6624M0882m395L7961Q1715J13270R0772R1960N0927j7971
10506A190245L4860J19954J21223P4565N3372P7808J43569J97335J71325J64392
10496B348648K01479K78730L35217M40997N41316N48305N38225O94175P91275
10487F718367Q47178Q27598Q48198R69313J191799J498485J819444K117940K900381
$$ plain form
10478 19738703 23986599 30223365 39446089 53706067 76565413 112756045 160549304
10471 160549304 198610694 219445090 248294656 292104628 323472075 312878857 282066059
10464 282066059 257047587 236770353 203718430 160499762 121151580 87506058 63212515
10457 63212515 47773696 37849501 31138141 26433836 22882880 20019597 17676721 15794346
10449 15794346 14182820 12837554 11775630 10931928 10092486 9292065 8605119 7954061 7438362
10440 7438362 7011748 6479733 5873855 5337445 4891246 4491540 4075617 3691558 3327098
10431 3327098 3043718 2836446 2562022 2317685 2161329 2038635 1950399 1864600 1765004 1638847
10421 1638847 1542100 1458254 1407208 1376522 1338565 1307440 1281053 1157923 1107994 1102825 1060020
$$ packed form
10478A9738703M247896O236766R222724J4259978K2859346L6190632M7793259
10471A60549304L8061390K0834396K8849566M3809972L1367447j0593218l0812798
10464B82066059k5018472k0277234l3051923m3218668l9348182l3645522k4293543
10457F3212515j5438819r924195o711360m704305l550956k863283k342876j882375
10449A5794346j611526j345266j061924q43702q39442q00421o86946o51058n15699
10440G438362m26614n32015o05878n36410m46199l99706m15923l84059l64460
10431C327098k83380k07272k74424k44337j56356j22694q8236q5799r9596j26157
10421A638847r6747q3846n1046l0686l7957l1125k6387j23130m9929n169m2805
$$ plain form
10410 1060020 1034693 1021569 1023708 946952 866420 822676 799150 773097 733774 695782 667277
10399 667277 647288 632496 585644 556508 482147 444804 459245 438748 427238 421449 402123 406426
10387 406426 406496 435470 444756 396897 364975 360506 369125 349263 328015 311397 262936 292684 274034
10374 274034 268646 302855 308496 260806 253437 241032 260020 286269 302422 256614 223624 249816
10362 249816 251053 268696 249228 236636 200851 181383 178239 182988 148885 154760 187254 217411
10350 217411 192096 193634 168440 166156 191037 230039 241573 280323 295624 355373 341372 312641
10338 312641 295013 310396 338807 329136 339070 391633 379084 357094 305905 277724 275062 251639
10326 251639 236013 218761 239244 228855 209584 231230 219960 187612 157089 133032 137619 179551
$$ packed form
10410A060020k5327j3124K139p6756q0532m3744k3526k6053l9323l7992k8505
10399F67277j9989j4792m6852k9136p4361l7343J4441k0497j1510n789j9326M303
10387D06426P0K8974R286m7859l1922m469Q619j9862k1248j6618m8461K9748j8650
10374B74034n388L4209N641m7690p369j2405J8988K6249J6153m5808l2990K6192
10362B49816J237J7643j9468j2592l5785j9468l144M749l4103N875L2494L0157
10350B17411k5315J538k5194k284K4881L9002J1534L8750J5301N9749j4001k8731
10338C12641j7628J5383K8411r671R934N2563j2549k1990n1189k8181k662k3423
10326B51639j5626j7252K0483j0389j9271K1646j1270l2348l0523k4057M587M1932
$$ plain form
10314 179551 177973 122472 115950 138469 173876 181057 195405 196772 152566 141457 140164 157434
10302 157434 171352 176956 158458 182616 166308 158030 104468 138991 175376 172148 157626 176372
10290 176372 171641 145385 153978 162745 153735 141071 175374 195528 208547 156858 114327 122548
10278 122548 106171 69462 71850 68841 65823 51958 63060 104526 160837 150199 79602 118994
10266 118994 111932 125155 109870 106162 123729 117354 107905 91435 102649 136984 126572 127137 89604
10253 89604 43836 35294 77699 97197 78974 87928 110666 110849 79994 51379 61845 68831 94395
10240 94395 123155 87701 41390 24413 67801 75863 64055 61001 76093 86474 54644 29097
10228 29097 50611 89017 81865 98497 96103 72686 73759 73712 67210 64916 69611 91452 102126
$$ packed form
10314A79551j578n5501o522K2519L5407P181J4348J367m4206j1109j293J7270
10302A57434J3918N604j8498K4158j6308q278n3562L4523L6385l228j4522J8746
10290A76372m731k6256Q593Q767r010j2664L4303K0154J3019n1689m2531Q221
10278A22548j6377l6709K388l009l018j3865J1102M1466N6311j0638p0597L9392
10266A18994p062J3223j5285l708J7567o375r449j6470J1214L4335j0412N65l7533
10253H9604m5768q542M2405J9498j8223Q954K2738J83l0855k8615J0466O986K5564
10240I4395K8760l5454m6311j6977M3388Q062j1808l054J5092J0381l1830k5547
10228B9097K1514L8406p152J6632k394k3417J073m7o502k294M695K1841J0674
$$ plain form
10215 102126 91081 115438 130383 148815 175429 152328 108690 117343 94428 87258 110153 123566
10203 123566 115395 70605 88424 113612 99508 71295 68130 38641 67418 82320 101966 77375
10191 77375 69397 52818 38785 86475 123092 116611 114261 78211 53199 38675 60408 95601
10179 95601 122165 75145 18390 69058 115729 53248 48205 71751 56522 1967 -30798 16584
10167 16584 60939 45267 16977 7714 -9428 -30366 -7171 28099 40072 16738 21935 52638
10155 52638 87138 113407 124402 116576 105686 135878 163413 153354 128459 129542 129212 123336 90615
10142 90615 58187 8181 21070 24406 66498 108080 140184 133070 107932 75445 111581 109364
10130 109364 84207 41328 13377 48129 48049 40940 39516 35923 -15904 -12435 -6939 13497 20291
$$ packed form
10215A02126j1045K4357J4945J8432K6614k3101m3638Q653k2915p170K2895J3413
10203A23566q171m4790J7819K5188j4104k8213l165k9489K8777J4902J9646k4591
10191G7375p978j6579j4033M7690L6617o481k350l6050k5012j4524K1733L5193
10179I5601K6564m7020n6755N0668M6671o2481n043K3546j5229n4555l2765M7382
10167A6584M4355j5672k8290r263j7142k0938K3195L5270J1973k3334N197L0703
10155E2638L4500K6269J0995p826j0890L0192K7535j0059k4895J083l30n876l2721
10142I0615l2428n0006J2889L336M2092M1582L2104p114k5138l2487L6136k217
10130A09364k5157m2879k7951L4752q0p109j424l593n1827L469N496K0436O794
$$ plain form
10117 20291 43133 63318 92611 104554 70173 54636 16984 12471 19816 45350 77561 66010
10105 66010 53928 50049 -3896 -57644 -58995 -27253 2575 25008 107189 93842 96380 122442
10093 122442 122346 93661 112404 80025 62045 78615 60516 55942 116891 106350 17505 -3173
10081 -3173 17593 37616 64296 34394 16631 -6874 -8622 27479 42209 40649 43962 52204 136811
10068 136811 234883 295973 401532 603499 900667 1098039 1188805 1324511 1538045 1724617
10058 1724617 1696268 1561489 1427616 1291010 1142762 924550 691270 512714 399353 330801
10048 330801 268866 181061 124105 125817 131163 171771 164679 135721 121343 102193 112618 133084
10036 133084 116208 86546 68446 55757 28235 38187 63615 59759 61834 66724 65248 49787
$$ packed form
10117B0291K2842K0185K9293J1943l4381j5537l7652m513P345K5534L2211j1551
10105F6010j2082l879n3945n3748j351L1742K9828K2433Q2181j3347K538K6062
10093A22442r6k8685J8743l2379j7980J6570j8099m574O0949j0541q8845k0678
10081c173K0766K0023K6680k9902j7763k3505j748L6101J4730j560L313Q242Q4607
10068A36811R8072O1090J05559K01967K97168J97372R0766J35706K13534J86572
10058A724617k8349j34779j33873j36606j48248k18212k33280j78556j13361o8552
10048C30801o1935q7805n6956J712N346M0608p092k8958j4378j9150J0425K0466
10036A33084j6876k9662j8100j2689k7522R952K5428l856K075M890j476j5461
$$ plain form
10024 49787 -3532 -35923 -80130 -54257 -9720 3238 1596 33856 87492 69998 15003 -42090
10012 -42090 -31120 -13956 -34509 -21415 -11636 -29434 -35497 -27785 -39131 -66664 -64496 -59605 -36179
9999 -36179 -14674 -15549 -24779 -66546 -21164 -9954 -13970 22735 39539 -5717 6193 14558 18825
9986 18825 8880 29884 65234 85442 88975 59475 80749 44145 13355 -19365 -39153 -40867
9974 -40867 -85914 -65703 -32507 -7113 -1838 -15369 -38951 -26035 -15083 -37048 -31870 934
9962 934 70689 96366 83554 36859 67707 59063 53483 55793 125131 162855 161519 210616 278125
9949 278125 238483 181190 94375 21440 18699 58399 97868 82859 1618 -13934 11417 49886
9937 49886 53393 20419 6328 34934 15207 1792 -11105 -10760 -19773 32179 79950 89963 51983
$$ packed form
10024D9787n3319l2391m4207K5873M4537J2958j642L2260N3636j7494n4995n7093
10012d2090J0970J7164k0553J3094R779j7798o063P712j1346k7533K168M891K3426
9999c6179K1505q75r230m1767M5382J1210m016L6705J6804m5256J1910Q365M267
9986A8825r945K1004L5350K0208L533k9500K1274l6604l0790l2720j9788j714
9974d0867m5047K0211L3196K5394N275j3531k3582J2916J0952k1965N178L2804
9962I34O9755K5677j2812m6695L0848q644n580K310O9338L7724j336M9097O7509
9949B78125l9642n7293q6815p2935k741L9700L9469j5009q1241j5552K5351L8469
9937D9886L507l2974j4091K8606j9727j3415j2897L45r013N1952M7771J0013l7980
$$ plain form
9924 51983 5216 -18198 3546 30718 18823 -22370 -33797 -17719 -30856 -7976 48109 -5247
9912 -5247 -42915 -51277 -14742 4201 9893 30452 37219 62921 69963 59388 39431 25909 42077
9899 42077 66823 32315 21696 6734 30019 54048 86131 73474 89765 95946 96166 76749
9887 76749 73387 84873 95892 87683 69624 50361 5054 44409 72732 75078 74349 65995 69465
9874 69465 52378 74682 39430 37668 57847 66217 61994 49988 30289 6265 27203 50283
9862 50283 61115 30588 -4026 36319 68126 105696 137931 94724 38977 54408 64748 54707
9850 54707 62742 84034 80898 61249 28335 9273 62232 28060 -22878 -15956 -4322 22165
9838 22165 28106 -2499 -53765 -74411 -47229 -39084 -25536 -46679 -48587 -41380 -74726 -109459 -82611
$$ packed form
9924E1983m6767k3414K1744K7172j1895m1193j1427J6078j3137K2880N6085n3356
9912e247l7668q362L6535J8943N692K0559O767K5702P042j0575j9957j3522J6168
9899D2077K4746l4508j0619j4962K3285K4029L2083j2657J6291O181K20j9417
9887G6749l362J1486J1019q209j8059j9263m5307L9355K8323K346p29q354L470
9874F9465j7087K2304l5252j762K0179Q370m223j2006j9699k4024K0938K3080
9862E0283J0832l0527l4614M0345L1807L7570L2235m3207n5747J5431J0340j0041
9850E4707Q035K1292l136j9649l2914j9062N2959l4172n0938O922J1634K6487
9838B2165N941l0605n1266k0646K7182Q145J3548k1143j908P207l3346l4733K6848
$$ plain form
9825 -82611 -58515 -77216 -71621 -57681 -67060 -33902 -8647 1808 -18979 -14007 560 -22963
9813 -22963 -11528 602 41048 49273 38968 12694 -19140 -17512 -3764 45975 63347 64577
9801 64577 2121 -41262 -34594 21616 39816 20275 35761 25333 -22495 -32486 7384 31599
9789 31599 58322 22647 -8209 6822 58197 95428 110804 45601 16024 22915 29269 43135
9777 43135 62085 71094 85564 130097 228422 344441 472691 783896 1278669 1817138 1891079
9766 1891079 1596083 1219568 893832 594656 440402 364300 287266 203209 145032 113819
9756 113819 52845 30035 27884 15488 34570 21029 33978 70252 41564 41415 71051 72460
9744 72460 49521 17381 -44341 -69649 -29639 3586 24853 8032 16858 37331 57543 41623
$$ packed form
9825h2611K4096j8701N595J3940r379L3158K5255J0455k0787M972J4567k3523
9813b2963J1435J2130M0446Q225j0305k6274l1834J628J3748M9739J7372J230
9801F4577o2456m3383O668N6210J8200j9541J5486j0428m7828r991L9870K4215
9789C1599K6723l5675l0856J5031N1375L7231J5376o5203k9577O891O354J3866
9777D3135J8950R009J4470M4533R8325J16019J28250L11205M94773N38469P3941
9766A891079k94996l76515l25736k99176j54254p6102p7034q4057n8177l1213
9756A13819o0974k2810k151j2396J9082j3541J2949L6274k8688j49K9636J409
9744G2460k2939l2140o1722k5308M0010L3225K1267j6821Q826K0473K0212j5920
$$ plain form
9732 41623 61662 23654 -9219 -49803 -55298 -48894 -44115 -29032 -21313 -2226 -22056 -46665 -55733
9719 -55733 -41246 -35809 -47715 -57126 -106289 -90624 -23341 9608 11334 10150 6444 -4382 -8958
9706 -8958 16474 37740 29556 22566 6534 40779 46427 16655 30065 66892 65826 54998 13601
9693 13601 -15818 -12529 -31085 -99038 -113427 -92433 -52861 -31914 -55026 -67645 -38517 -41339
9681 -41339 -18167 15973 31922 24245 -16321 -18474 -17917 -28964 -38792 -50024 -37571 -16042 -25447
9668 -25447 5590 43667 36714 -1710 -25318 13978 159 -43864 -22204 11916 -41 -21422
9656 -21422 -72648 -72156 -44965 -13316 -7328 -37544 -56183 -10845 31035 34195 31570 33947 30682
9643 30682 12019 -11064 -45886 -48392 -14844 -5857 5196 20148 -7226 9160 63442 88041
$$ packed form
9732D1623K0039l8008l2873m0584n495O404M779J5083P719J9087j9830k4609r068
9719e5733J4487N437j1906r411m9163J5665O7283L2949J726j184l706j0826m576
9706h958K5432K1266q184o990j6032L4245N648k9772J3410L6827j066j0828m1397
9693A3601k9419L289j8556o7953j4389K0994L9572K0947k3112j2619K9128k822
9681d1339K3172L4140J5949p677m0566k153N57j1047r828j1232J2453K1529r405
9668b5447L1037L8077o953l8424k3608L9296j3819m4023K1660L4120j1957k1381
9656b1422n1226M92K7191L1649N988l0216j8639M5338M1880L160k625K377l265
9643C0682j8663k3083l4822k506L3548Q987J1053J4952k7374J6386N4282K4599
$$ plain form
9631 88041 19039 26357 75040 76101 58077 49351 -1003 -14017 -25237 -33371 -47655 -47943 -28416
9618 -28416 2906 11502 23372 10760 -16918 -2888 -16015 3831 3225 -21021 -34009 15391
9606 15391 21061 -6698 -18773 12902 36752 51464 51013 56466 47951 -17883 -12365 -724 -888
9593 -888 28118 15655 24128 37333 40801 44889 41693 20262 -1963 20514 58748 41481 42522
9580 42522 6911 -42558 -19899 17720 23066 42271 3570 -23813 -9665 22886 18155 -22789
9568 -22789 -32950 -18726 -30403 -60339 -74208 -34175 -8001 12355 11961 -12499 -51890 -74243
9556 -74243 -58147 7243 57446 55697 24293 -13628 -13404 2235 52459 53615 42455 10436 -54259
9543 -54259 -52720 -15492 27934 56496 51509 49561 57907 10943 -2072 31524 38753 229 -14137
$$ packed form
9631H8041o9002P318M8683J061j8024q726n0354j3014j1220q134j4284k88J9527
9618b8416L1322Q596J1870j2612k7678J4030j3127J9846o06k4246j2988M9400
9606A5391N670k7759j2075L1675K3850J4712m51N453q515o5834N518J1641j64
9593h88K9006j2463Q473J3205L468M088l196k1431k2225K2477L8234j7267J041
9580D2522l5611m9469K2659L7619N346J9205l8701k7383J4148L2551m731m0944
9568b2789j0161J4224j1677k9936j3869M0033K6174K0356l94k4460l9391k2353
9556g4243J6096O5390N0203j749l1404l7921K24J5639N0224J156j1160l2019o4695
9543e4259J539L7228M3426K8562m987j948Q346m6964j3015L3596P229l8524j4366
$$ plain form
9530 -14137 -13488 -30180 -14565 -40977 -27840 -43088 -9444 29415 59812 41402 11678 -7467
9518 -7467 -34457 -69529 -76730 -31192 -27004 -4681 -13323 -45346 -47130 -14916 16764 23587 31124
9505 31124 2049 -30973 4309 47417 64468 55557 -1821 2679 58360 70684 25868 -21542
9493 -21542 19818 10046 -13595 -57002 -59527 -28691 -15813 -23578 -24635 -231 -16630 -11831 -15035
9480 -15035 -29931 -15407 -11858 9883 -2867 -24124 -14238 -10455 24382 68069 20458 -60285
9468 -60285 -112431 -91685 -69998 -91894 -68565 -37545 7004 14274 27915 36627 25274 -1966
9456 -1966 -13207 -35409 -83346 -94561 -74487 -29078 -32412 -37910 -7692 9034 -15156 1583
9444 1583 59328 37234 -53730 -60920 -61636 -61987 -20697 -18102 -25747 7437 -44981 -32834 817
$$ packed form
9530a4137O49j6692J5615k6412J3137j5248L3644L8859L0397j8410k9724j9145
9518g467k6990l5072p201M5538M188K2323q642l2023j784L2214L1680O823P537
9505C1124k9075l3022L5282M3108J7051q911n7378M500N5681J2324m4816m7410
9493b1542M1360r772k3641m3407k525L0836J2878p765j057K4404j6399M799l204
9480a5035j4896J4524L549K1741j2750k1257R886L783L4837M3687m7611q0743
9468f0285n2146K0746K1687k1896K3329L1020M4549P270J3641Q712j1353k7240
9456a966j1241k2202m7937j1215K0074M5409l334n498L0218J6726k4190J6739
9444A583N7745k2094r0964p190p16l51M1290K595p645L3184n2418J2147L3651
$$ plain form
9431 817 35845 82729 74752 51297 48435 52966 32861 -48226 -61848 -25710 -6637 18360 30036
9418 30036 -4211 -1812 -13864 18192 3204 -40005 -40193 -49917 -15215 -43791 -40130 -7705 17280
9405 17280 16988 24233 14785 20658 6066 11387 48672 38486 37589 9444 28286 48627 24241
9392 24241 -18015 -26188 5618 33346 37625 29400 79344 96501 79464 29106 11478 -778
9380 -778 12788 19402 11989 22170 37667 16868 12927 4517 20872 5710 -12776 -23800 -7565
9367 -7565 8318 10596 42112 45023 39082 43736 54878 12108 -5486 7025 30185 66833 70095
9354 70095 37223 35134 44300 38462 20153 6351 984 9987 39438 28548 -2858 6004 34601
9341 34601 63456 5835 -10231 -21346 -15884 -24939 -31310 -15509 6552 16912 469 37481
$$ packed form
9431H17L5028M6884p977k3455k862M531k0105q1087j3622L6138J9073K4997J1676
9418C0036l4247K399j2052L2056j4988m3209j88r724L4702k8576L661L2425K4985
9405A7280k92P245r448N873j4592N321L7285j0186q97k8145J8842K0341k4386
9392B4241m2256q173L1806K7728M279q225M9944J7157j7037n0358j7628j2256
9380g78J3566O614p413J0181J5497k0799l941q410J6355j5162j8486j1024J6235
9367g565J5883K278L1516K911n941M654J1142m2770j7594J2511K3160L6648L262
9354G0095l2872k089R166n838j8309j3802n367R003K9451j0890l1406Q862K8597
9341C4601K8855n7621j6066j1115N462r055o371J5801K2061J0360j6443L7012
$$ plain form
9329 37481 -3570 -23177 -29403 -39082 -38399 -22602 -29468 -24105 5541 19900 10263 -12687 12882
9316 12882 28409 8182 9167 9279 7451 -16808 12276 71050 66322 90329 149780 106267 66064
9303 66064 74351 70973 72284 54200 62731 75213 65066 20603 -7128 20394 61093 30947 -14373
9290 -14373 3908 15762 -61528 -86267 -57932 14863 38990 36170 33201 17508 5167 14761
9278 14761 -47702 -37699 -19070 -4972 45611 46014 36869 46368 53283 57529 40116 34130 21646
9265 21646 -14643 -7060 -10506 -22126 22334 67286 67019 45499 37350 19515 18362 9253 24547
9252 24547 50502 42976 19302 -5717 21373 18962 -7702 -27234 -44388 -26691 -17114 3473
9240 3473 14228 40329 41739 18262 34029 35485 96183 110392 68890 -2867 -14893 -14570 -6229
$$ packed form
9329C7481m1051j9607o226r679O83J5797o866N363K9646J4359r637k2950K5569
9316A2882J5527k0227R85J12j828k4259K9084N8774m728K4007N9451m3513m0203
9303F6064Q287l378J311j8084Q531J2482j0147m4463k7731K7522M0699l0146m5320
9290a4373J8281J1854p7290k4739K8335P2795K4127k820k969j5693j2341R594
9278A4761o2463J0003J8629J4098N0583M03r145R499O915M246j7413n986j2484
9265B1646l6289P583l446j1620M4460M4952k67k1520q149j7835j153r109J5294
9252B4547K5955p526k3674k5019K7090k411k6664j9532j7154J7697R577K0587
9240C473J0755K6101J410k3477J5767J456O0698J4209m1502p1757j2026L23Q341
$$ plain form
9227 -6229 -3026 -61676 -74509 -54995 -41854 -29599 -4281 19781 5214 -32394 -12992 14619
9215 14619 8662 53820 104570 69754 31843 -25788 -29529 -25707 13211 28951 9431 -26981
9203 -26981 -29149 4879 68390 108140 130144 110353 41219 21894 22966 36057 -1578 -30799
9191 -30799 -15516 -1259 51479 54889 69130 74662 63377 66435 95117 121305 124349 125146 141595
9178 141595 155808 149637 150450 121056 95105 55039 28474 48870 101613 159896 191606 231455
9166 231455 252625 307582 360473 379925 427881 508065 639852 748688 868425 1072264 1417020
9155 1417020 1883078 2567097 3607252 5285440 7941727 11616361 14715721 14634444 12203820
9146 12203820 9287319 6537688 4516621 3240308 2434174 1907009 1549664 1289887 1096004
$$ packed form
9227f229L203n8650j2833J9514J3141J2255K5318K4062j4567l7608J9402K7611
9215A4619n957M5158N0750l4816l7911n7631l741L822L8918J5740j9520l6412
9203b6981k168L4028O3511L9750K2004j9791o9134j9325J072J3091l7635k9221
9191c0799J5283J4257N2738L410J4241N532j1285L058K8682K6188L044P97J6449
9178A41595J4213o171Q13k9394k5951m0066k6565K0396N2743N8283L1710L9849
9166B31455K1170N4957N2891J9452M7956Q0184J31787J08836J19737K03839L44756
9155A417020M66058O84019J040155J678188K656287L674634L099360q1277k430624
9146A2203820k916501k749631k021067j276313q06134n27165l57345k59777j93883
$$ plain form
9137 1096004 931746 855731 752359 625754 556114 481504 409928 401487 390816 372563 381764
9126 381764 320181 262317 217849 203238 204987 202874 167660 146683 172217 162800 124798 152403
9114 152403 188201 135697 107526 140675 164728 157184 90753 68059 43243 24957 38298 47325
9102 47325 54027 41061 27232 7446 36299 50775 72881 77769 103094 64843 18362 32726
9090 32726 44821 38647 37432 12931 40820 30668 24696 21551 -2239 -31393 -35664 -42482 -22970
9077 -22970 8677 7576 18003 -26764 -52769 -17948 -31723 -49080 -51507 -50138 -25491 16522
9065 16522 17878 34197 27653 -11647 -12243 -29802 -23832 -52 7851 -31407 -53887 -28019 24442
9052 24442 1337 31190 38339 39261 46075 23121 23036 6407 -9507 27438 62773 43329 -25272
$$ packed form
9137A096004j64258p6015j03372j26605o9640p4610p1576q441j0671j8253R201
9126C81764o1583n7864m4468j4611J749k113l5214k0977K5534r417l8002K7605
9114A52403L5798n2504k8171L3149K4053p544o6431k2694k4816j8286J3341R027
9102D7325O702j2966j3829j9786K8853J4476K2106M888K5325l8251m6481J4364
9090C2726J2095o174j215k4501K7889j0152n972l145k3790k9154m271o818J9512
9077b2970L1647j101J0427m4767k6005L4821j3775j7357k427J369K4647M2013
9065A6522J356J6319o544l9300n96j7559N970K3780P903l9258k2480K5868N2461
9052B4442k3105K9853P149R22O814k2954q5j6629j5914L6945L5335j9444o8601
$$ plain form
9039 -25272 -16561 38503 48275 23145 14390 18396 -39310 -59584 -29355 10008 26010 38124 5176
9026 5176 -473 -5177 -22679 -23375 -46085 -1956 86666 52233 29063 9222 24438 14174 4728
9013 4728 -16788 9000 27577 37491 44624 44272 -31941 -67754 7102 18515 -20331 1441 1280
9000 1280 -19728 15645 -3773 -38043 -82206 -47863 -1040 11385 -25050 7508 62651 67579
8988 67579 82325 59816 45555 39573 48693 36768 48860 59405 57617 59919 95036 82438 56039
8975 56039 46434 -16473 -24973 30652 15832 3413 36926 14163 4657 -17475 -53603 -44857 -14826
8962 -14826 -28810 -9913 71338 62198 58803 -3428 -55890 -47122 -20326 -20654 -56240 -67260 -36938
8949 -36938 1809 12512 23810 1482 -18716 -22361 -6456 -6610 -5783 2879 15202 49131 21332
$$ packed form
9039b5272Q711N5064R772k5130q755M006n7706k0274L0229L9363J6002J2114l2948
9026E176n649m704j7502o96k2710M4129Q8622l4433k3170j9841J5216j0264r446
9013D728k1516K5788J8577R914P133l52p6213l5813P4856J1413l8846K1772j61
9000A280k1008L5373j9418l4270m4163L4343M6823J2425l6435L2558N5143M928
8988F7579J4746k2509j4261n982R120j1925J2092J0545j788K302L5117j2598k6399
8975E6039r605o2907q500N5625j4820j2419L3513k2763r506k2132l6128Q746L0031
8962a4826j3984J8897Q1251r140l395o2231n2462Q768K6796l28l5586j1020L0322
8949c6938L8747J0703J1298k2328k0198l645J5905j54Q27Q662J2323L3929k7799
$$ plain form
8936 21332 -43878 -71422 -16475 16868 4552 -18818 -14018 2019 26434 60462 62040 39127
8924 39127 -17010 5287 46290 73513 57454 37595 13058 -14576 6492 34066 53005 36935
8912 36935 5528 -20898 -26552 -26390 -8753 10109 45141 17931 13029 20338 3719 -5214 -15631
8899 -15631 409 54588 44547 39971 41984 23215 1847 -8190 -34141 -48974 -5515 57542
8887 57542 93759 85365 48224 21920 13968 -6480 -21007 -11225 9611 -23834 -32147 -41141 -42983
8874 -42983 -41173 -23622 17435 29251 24293 15954 -5124 -23440 -84387 -127821 -138102 -142068 -119229
8861 -119229 -126956 -119983 -104857 -71580 -59708 -3446 3991 7326 -7290 -20288 -56080 -62041 -37784
8848 -37784 -18193 -25866 -13802 -15006 13936 1439 18446 40350 29074 -12451 -10617 16374
$$ packed form
8936B1332o5210k7544N4947L3343j2316k3370M800J6037K4415L4028J578k2913
8924C9127n6137K2297M1003K7223j6059j9859k4537k7634K1068K7574J8939j6070
8912C6935l1407k6426n654J62J7637J8862L5032k7210m902P309j6619q933j0417
8899a5631J6040N4179j0041m576K013j8769k1368j0037k5951j4833M3459O3057
8887E7542L6217q394l7141k6304p952k0448j4527R782K0836l3445q313q994j842
8874d2983J810J7551M1057J1816m958q339k1078j8316o0947m3434j0281l966K2839
8861a19229p727O973J5126L3277J1872N6262P437L335j4616j2998l5792n961K4257
8848c7784J9591p673J2064j204K8942j2497J7007K1904j1276m1525J834K6991
$$ plain form
8836 16374 16496 4895 39346 45066 8740 579 -25991 -75967 -68713 -22343 -5431 -3092 2716
8823 2716 -8725 -11320 -15580 13945 36659 34695 8781 -9697 8304 41420 29891 -14749 -29249
8810 -29249 -5650 15919 39345 10756 26541 50120 10120 2581 11678 23052 -16524 -74194
8798 -74194 -77319 -71736 -78019 -51230 -30806 -15046 -19464 -20356 23836 -12495 -30961 -16336 -3616
8785 -3616 -1882 -23976 -59414 -62203 -40279 -24909 -25520 -20214 10007 20596 8380 54381 72765
8772 72765 51479 15135 -19409 -53497 -77005 -67041 -60886 -55078 -16805 -46726 -43647 -18296 -26028
8759 -26028 -67872 -46021 -13077 -2016 -30171 -32864 -33664 -23972 -5543 7795 -2525 -32219 -21376
8746 -21376 15709 27559 33956 -3410 -37752 2941 19765 1523 -12423 11337 28148 306
$$ packed form
8836A6374J22j1601L4451N720l6326q161k6570m9976P254M6370J6912K339N808
8823B716j1441k595m260K9525K2714j964k5914j8478J8001L3116j1529m4640j4500
8810b9249K3599K1569K3426k8589J5785K3579m0000p539R097J1374l9576n7670
8798g4194l125N583o283K6789K0424J5760m418q92M4192l6331j8466J4625J2720
8785c616J734k2094l5438k789K1924J5370o11N306L0221J0589j2216M6001J8384
8772G2765k1286l6344l4544l4088k3508R964O155N808L8273k9921L079K5351p732
8759b6028m1844K1851L2944J1061k8155k693q00R692J8429J3338j0320k9694J0843
8746b1376L7085J1850O397l7366l4342M0693J6824j8242j3946K3760J6811k7842
$$ plain form
8734 306 8185 30041 55302 34026 23004 36171 25583 31043 55850 38283 14240 15662 -5077
8721 -5077 -31726 -9429 10478 8159 -20343 -21429 -13160 -26527 -24704 -7659 4193 -22545 -33981
8708 -33981 -21278 2291 8389 -15638 -44966 -10218 6424 30733 40081 853 -24425 -15488
8696 -15488 -6129 43282 58109 17131 8416 44638 76198 36074 -34939 -35972 -1786 -9783 -10202
8683 -10202 26537 24923 38025 45384 26449 -880 12949 -9547 8421 46776 81830 77509
8671 77509 70791 24992 -7978 4644 44721 60468 4285 -19691 -39447 -32285 -51179 -66903
8659 -66903 -42940 -20757 -16733 -27818 -7910 36269 26796 26561 40505 61371 31208 -33630 -90469
8646 -90469 -105651 -88712 -19429 61397 60357 14158 -22440 4085 496 -8654 -6930 -12306 -32069
$$ packed form
8734C06P879K1856K5261k1276j1022J3167j0588N460K4807j7567k4043J422k0739
8721e077k6649K2297J9907k319k8502j086Q269j3367J823J7045J1852k6738j1436
8708c3981J2703K3569O098k4027k9328L4748J6642K4309R348l9228k5278Q937
8696a5488R359M9411J4827m0978q715L6222L1560m0124p1013j033L4186p997m19
8683a0202L6739j614J3102P359j8935k7329J3829k2496J7968L8355L5054m321
8671G7509o718m5799l2970J2622M0077J5747n6183k3976j9756P162j8894j5724
8659f6903K3963K2183M024j1085J9908M4179r473k35J3944K0866l0163o4838n6839
8646i0469j5182J6939O9283Q0826j040m6199l6598K6525l589r150J724n376j9763
$$ plain form
8633 -32069 -15096 14689 6266 -7178 -20874 -32565 -5729 -36878 -5491 21346 7407 -32947
8621 -32947 -56020 -53012 -48222 -39458 -35042 -66066 -50840 -29983 7510 44467 47715 53011 23564
8608 23564 26747 63030 50947 41315 62844 35231 58623 51783 5920 -9635 31717 63968
8596 63968 21035 11339 17943 46655 58604 38173 -7562 -46132 -33304 -18337 -15194 35414
8584 35414 69397 87630 91409 81187 77721 76972 23195 -1141 -11804 230 -33529 12487 59880
8571 59880 36748 52514 47109 11401 -6034 -48053 -43125 27615 36995 12230 -25688 -63621
8559 -63621 -47080 -31460 9623 54566 57366 33972 7320 -16958 -11825 -15093 -10959 14190 31486
8546 31486 21204 -24333 -32873 -12961 14183 38726 30245 15733 -3402 -3704 -19557 -6755 24941
$$ packed form
8633c2069J6973K9785q423j3444j3696j1691K6836l1149L1387K6837j3939m0354
8621c2947k3073L008M790Q764M416l1024J5226K0857L7493L6957L248N296k9447
8608B3564L183L6283j2083r632K1529k7613K3392o840m5863j5555M1352L2251
8596F3968m2933r696O604K8712J1949k0431m5735l8570J2828J4967L143N0608
8584C5414L3983J8233L779j0222l466p49n3777k4336j0663J2034l3759M6016M7393
8571E9880k3132J5766n405l5708j7435m2019M928P0740R380k4765l7918l7933
8559f3621J6541J5620M1083M4943K800k3394k6652k4278N133l268M134K5149J7296
8546C1486j0282m5537q540J9912K7144K4543q481j4512j9135l02j5853J2802L1696
$$ plain form
8533 24941 -20856 -12138 60155 32569 15635 10645 19180 18103 34438 26081 11657 23721 6516
8520 6516 -30832 -33883 -2910 -16222 14716 51424 16518 10962 18324 52659 25621 -44335 -92278
8507 -92278 -83880 -53979 -56789 -28266 -2545 -19498 -14543 15730 46278 66657 73632 53632 20907
8494 20907 8936 -5282 9519 7017 36419 41102 27612 -14574 -17564 -33305 -5674 10964
8482 10964 16147 42268 26977 2620 33283 60127 72080 32732 16114 18258 16109 51921
8470 51921 39248 16746 -23882 1496 -7620 -3621 3342 -314 48390 101258 104884 95365 45311
8457 45311 43866 -7303 -16297 -19386 -33219 -14248 -39264 -86681 -84778 -60461 -47485 -22416 -24761
8444 -24761 -4808 -2942 1109 -8105 13520 50513 22047 -28903 -47982 -26905 -1628 29093
$$ packed form
8533B4941m5797Q718P2293k7586j6934m990Q535j077J6335q357j4424J2064j7205
8520F516l7348l051L0973j3312L0938L6708l4906n556P362L4335k7038o9956m7943
8507i2278Q398K9901k810K8523K5721j6953M955L0273L0548K0379O975k0000l2725
8494B0907j1971j4218J4801k502K9402M683j3490m2186k990j5741K7631J6638
8482A0964N183K6121j5291k4357L0663K6844J1953l9348j6618K144k149L5812
8470E1921j2673k2502m0628K5378r116L999O963l656M8704N2868L626r519n0054
8457D5311j445n1169q994l089j3833J8971k5016m7417J903K4317J2976K5069k345
8444b4761J9953J866M051r214K1625L6993k8466n0950j9079K1077K5277L0721
$$ plain form
8432 29093 38963 22276 11674 7667 16653 -651 -1316 34421 37892 18078 -20281 -52890 -6177
8419 -6177 33221 30842 15199 -23982 -53581 -54403 -25874 1756 4263 -9372 -12486 39853 50902
8406 50902 22624 12208 8788 -16754 -36431 -18671 -35176 -11612 510 -19928 -32542 -53398
8394 -53398 -3611 14778 -2742 -3587 -3156 -3412 -18927 -10785 -3611 -6587 -10846 -17357 -23860 -1733
8380 -1733 20607 21213 14159 27650 -19055 -37405 -41639 -15430 4214 -15349 -59909 -108756 -100341
8367 -100341 -78709 -84196 -84926 -86651 -43347 -14776 18101 36517 58819 33804 59592 35220
8355 35220 -19834 -47824 -69882 -85194 -36226 34660 23577 31473 13897 -16586 -65587 -62286
8343 -62286 -53296 -100 8934 4128 16803 -3641 3398 20566 28939 50224 23531 10097 -452
$$ packed form
8432B9093R870j6687j0602m007Q986j7304o65L5737L471j9814l8359l2609M6713
8419f177L9398k379j5643l9181k9599q22K8529K7630K507j3635l114N2339J1049
8406E0902k8278j0416l420k5542j9677J7760j6505K3564J2122k0438j2614k0856
8394e3398M9787J8389j7520q45M31k56j5515Q142P174k976m259o511o503K2127
8380a733K2340O06p054J3491m6705j8350m234K6209J9644j9563m4560m8847Q415
8367a00341K1632n487p30j725M3304K8571L2877J8416K2302k5015K5788k4372
8355C5220n5054k7990k2058j5312M8968P0886j1083P896j7576l0483m9001L301
8343f2286Q990N3196R034m806J2675k0444P039J7168Q373K1285k6693j3434j0549
$$ plain form
8330 -452 18322 12327 -301 15151 11549 11596 24180 25429 4823 -19201 -6133 18658 32612
8317 32612 52648 47429 30859 13531 -18651 -15456 -16386 -17001 -21319 -15490 -35125 -25344 -46515 -2195
8303 -2195 47505 23841 19549 89106 119604 55612 6134 -13271 -30282 -49804 -27715 -30714
8291 -30714 -7633 -12456 -5000 -4477 22276 30958 64772 75516 42687 19804 12836 12063 17535 30794
8277 30794 -33957 -23888 23198 46028 50729 40671 65158 65751 63326 103226 92375 35346 29663
8264 29663 10477 8803 -45681 -5419 67640 59323 26553 914 4912 30391 29358 9961 -7868
8251 -7868 -26068 1880 31070 -37386 -44632 -7031 -20515 -4985 12718 22418 -3047 -56820
8239 -56820 -63188 -64911 -38345 -23769 -17744 -8749 -10233 31775 18502 -19453 -20989 4613 2286
$$ packed form
8330d52J8774n995j2628J5452l602M7J2584J249k0606k4024J3068K4791J3954
8317C2612K0036n219j6570j7328l2182L195r30o15m318N829j9635R781k1171M4320
8303b195M9700k3664m292O9557L0498o3992m9478j9405j7011j9522K2089k999
8291c0714K3081m823P456N23K6753Q682L3814J0744l2829k2883o968p73N472J3259
8277C0794o4751J0069M7086K2830M701j0058K4487N93k425L9900j0851n7029n683
8264B9663j9186j674n4484M0262P3059q317l2770k5639L998K5479j033j9397j7829
8251g868j8200K7948K9190o8456p246L7601j3484J5530J7703R700k5465n3773
8239e6820o368j723K6566J4576O025Q995j484M2008j3273l7955j536K5602k327
$$ plain form
8226 2286 -28200 -48558 -59436 -73638 -35513 -24739 -51431 -56848 -35694 -15709 -230 42676
8214 42676 17343 -18856 -5497 42944 18686 -2302 -1700 8596 -10290 10210 20707 30371
8202 30371 12572 -32653 -73083 -62063 -22274 12254 39596 21498 35618 55623 41304 1241
8190 1241 2148 4329 1003 3375 -53201 -47588 -12307 328 -54466 -102133 -89499 -8114 46795
8177 46795 70599 43540 25119 36598 48022 42793 3403 -5450 -15683 3032 17315 -6050
8165 -6050 -39037 -49931 -66429 -62496 -47495 -52922 -46874 -26672 21744 63626 33625 -46701 -73507
8152 -73507 -55110 -24135 -20391 -17972 -5728 -21993 -33227 -43176 -54593 -9066 12483 37751
8140 37751 56127 30257 33018 25678 4958 14923 18839 1147 22662 27152 29048 26611 19916
$$ packed form
8226B286l0486k0358j0878j4202L8125J0774k6692n417K1154J9985J5479M2906
8214D2676k5333l6199J3359M8441k4258k0988O02J0296j8886K0500J0497R664
8202C0371j7799m5225m0430J1020L9789L4528K7342j8098J4120K0005j4319m0063
8190A241R07K181l326K372n6576N613L5281J2635n4794m7667J2634Q1385N4909
8177D6795K3804k7059j8421J1479J1424n229l9390q853j0233J8715J4283k3365
8165f050l2987j0894j6498L933J5001n427O048K0202M8416M1882l0001q0326k6806
8152g3507J8397L0975L744K419J2244j6265j1234r949j1417M5527K1549K5268
8140C7751J8376k5870K761p340k0720R965L916j7692K1515M490J896k437o695
$$ plain form
8127 19916 14021 10314 38527 28098 27214 17151 -12563 -30634 -11766 25498 33814 36095 32285
8114 32285 31047 836 -55089 -59181 -69606 -67441 -17880 43274 81107 22252 -24456 -57081
8102 -57081 -30465 30234 -529 -7376 -10865 -14800 1395 8864 -10689 -20328 -15782 -64935 -74831
8089 -74831 -58401 -34485 -23619 -24586 -47385 -15642 -8626 -32532 -76350 -104193 -99543 -62224 -67135
8076 -67135 -85530 -57572 -85237 -92479 -48692 -10010 6081 -19307 -71591 -70317 -36478 -68976
8064 -68976 -67954 -56127 26620 64496 38311 29581 16028 7068 5762 18983 9512 11462 20737
8051 20737 -307 139 -16228 -49597 -26616 -61681 -72020 -27824 -22819 1815 34837 32998 -4310
8038 -4310 -18576 2257 39532 72507 63810 16810 43857 60259 50521 53517 59825 29503 25379
$$ packed form
8127A9916n895l707K8213j0429q84j0063k9714j8071J8868L7264Q316K281l810
8114C2285j238l0211n5925m092j0425K165M9561O1154L7833n8855m6708l2625
8102e7081K6616O0699l0763o847l489l935J6195P469j9553r639M546m9153r896
8089g4831J6430K3916J0866r67k2799L1743P016k3906m3818k7843M650L7319m911
8076f7135j8395K7958k7665p242M3787L8682J6091k5388n2284J274L3839l2498
8064f8976J022J1827Q2747L7876k6185q730j3553q960j306J3221r471J950R275
8051B0737k1044M46j6367l3369K2981l5065j0339M4196N005K4634L3022j839l7308
8038d310j4266K0833L7275L2975q697m7000K7047J6402r738K996O308l0322m124
$$ plain form
8025 25379 66897 58770 13211 2134 -18119 -33081 2895 26794 -12674 -9527 -16987 -28670
8013 -28670 -53187 -24979 40760 43368 -3573 -6762 21231 43093 51086 33041 -6203 -8535 -1833
8000 -1833 2482 45689 37163 12565 10241 -15795 -27779 -24872 23620 35241 36389 14814 -16219
7987 -16219 3657 24099 47065 35636 -8261 -13245 7356 12598 36379 59335 68031 34393
7975 34393 -14161 -27613 27306 59795 34329 14900 -12593 -8619 13596 33125 48635 6289
7963 6289 -5063 1263 23925 21472 125 -52011 -59417 -41027 -35249 -45211 -34592 -61245 -77688
7950 -77688 -63476 -26511 -35471 -19335 -7445 -2842 -6952 10844 37844 49598 74506 10922
7938 10922 -574 3882 -46007 -87013 -60404 -39195 -2502 -10584 -2288 -8570 5366 16873 -1454
$$ packed form
8025B5379M1518q127m5559j1077k0253j4962L5976K3899l9468L147p460j1683
8013b8670k4517K8208O5739K608m6941l189K7993K1862P993j8045l9244k332O702
8000a833M315M3207q526k4598k324k6036j1984K907M8492J1621J148k1575l1033
7987a6219J9876K0442K2966j1429m3897m984K0601N242K3781K2956Q696l3638
7975C4393m8554j3452N4919L2489k5466j9429k7493L974K2215J9529J5510m2346
7963F289j1352O326K2662k453k1347n2136p406J8390N778r962J0619k6653j6443
7950g7688J4212L6965q960J6136J1890M603m110J7796K7000J1754K4908o3584
7938A0922j1496M456m9889m1006K6609K1209L6693q082Q296o282J3936J1507j8327
$$ plain form
7925 -1454 -24408 -14922 5078 -4066 3612 -22153 -39433 -44888 -40746 -20474 -14900 14219 22895
7912 22895 20752 -16142 -46272 -54587 -18098 3756 26640 37225 20072 50125 69962 45960
7900 45960 -20181 -36563 13615 22244 -6287 -1921 -6363 -24922 -40236 -59440 -37987 -5183
7888 -5183 42469 62525 33515 -33346 -48584 -16354 -40497 -15283 -46584 -38015 20616 65959
7876 65959 30574 19269 14171 19691 5559 -22984 -8408 -4749 15600 2053 25347 31359 37919
7863 37919 13690 -26731 -61312 -85110 -70248 -64030 -38237 9950 -16050 -35417 239 14996
7851 14996 -15330 -25270 -16173 34886 54929 68670 97499 57181 16471 -11606 -2416 -5822 18983
7838 18983 24452 15773 46101 9386 22980 27265 -5216 26519 32817 14273 18741 42423 24223
$$ packed form
7925a454k2954R486K0000r144P678k5765j7280n455M142K0272N574K9119Q676
7912B2895k143l6894l0130q315L6489K1854K2884J0585j7153L0053J9837k4002
7900D5960o6141j6382N0178Q629k8531M366m442j8559j5314j9204K1453L2804
7888e183M7652K0056k9010o6861j5238L2230k4143K5214l1301Q569N8631M5343
7876F5959l5385j1305n098N520j4132k8543J4576L659K0349j3547K3294O012O560
7863C7919k4229m0421l4581k3798J4862O218K5793M8187k6000j9367L5656J4757
7851A4996l0326r940R097N1059K0043J3741K8829m0318m0710k8077R190l406K4805
7838A8983N469q679L0328l6715J3594M285l2481L1735O298j8544M468K3682j8200
$$ plain form
7825 24223 -5980 17804 23188 11435 -5623 6728 -14039 473 615 -37838 11326 27313
7813 27313 -4009 30744 34178 -13598 -27990 -46022 -61866 -88766 -77219 -48239 -62437 -49525
7801 -49525 -10070 27589 73195 49165 54909 55818 61750 52840 78019 91116 93222 85830 72845
7788 72845 72679 56973 16774 -19009 -33193 -15236 3279 -12734 5241 45906 37763 20288
7776 20288 3958 11686 -17595 -42292 -4617 22420 -5195 5585 61644 87669 59880 15826
7764 15826 13421 -9083 -25768 -21882 -64296 -83873 -73149 -95793 -72666 -25331 -21850 6510
7752 6510 -6512 -26009 451 7658 -8147 18603 132 12389 12409 -4727 20182 33608 -2996
7739 -2996 -13318 4221 13871 29493 98244 120047 153548 107700 45512 45364 22804 78959 102805
$$ packed form
7825B4223l0203K3784N384j1753j7058J2351k0767J4512J42l8453M9164J5987
7813B7313l1322L4753L434m7776j4392j8032j5844k6900J1547K8980j4198J2912
7801d9525L9455L7659M5606k4030N744R09N932q910K5179J3097K106p392j2985
7788G2845j66j5706m0199l5783j4184J7957J8515j6013J7975M0665q143j7475
7776B0288j6330P728k9281k4697L7675K7037k7615J0780N6059K6025k7789m4054
7764A5826k405k2504j6685L886m2414j9577J0724k2644K3127M7335L481K8360
7752F510j3022j9497K6460P207j5805K6750j8471J2257K0j7136K4909J3426l6604
7739b996j0322J7539R650J5622O8751K1803L3501m5848o2188j48k2560N6155K3846
$$ plain form
7726 102805 99934 45224 20126 5226 5946 12825 -818 -27737 -55516 -43431 -59713 -70522
7714 -70522 -81630 -54701 -10566 13517 -1508 -14710 -50585 -26492 -15555 -14442 -58140 -51767
7702 -51767 5142 9125 -4437 -11865 -18133 19451 -2809 -20220 -39221 -53991 -27686 -14960
7690 -14960 -19375 -55706 -102948 -100806 -77711 5328 47478 46902 56840 52318 13312 -52831 -95464
7677 -95464 -75775 -35041 15673 34186 -5730 -5524 30996 38089 25350 4630 25978 20829 24955
7664 24955 30095 -20697 -47567 -25185 28981 30292 1069 -5589 -37735 -82764 -79452 -67509 -24011
7651 -24011 37165 -20765 -72234 -44007 40380 69256 19643 -780 -15116 -39561 -18015 -50402
7639 -50402 -57857 -67925 -42573 -6664 3437 -4770 -53295 -60416 -31626 -4477 43490 16432
$$ packed form
7726A02805k871n4710k5098j4900P20O879j3643k6919k7779J2085j6282j0809
7714g0522j1108K6929M4135K4083j5025j3202l5875K4093J0937J113m3698O373
7702e1767N6909L983j3562p428o268L7584k2260j7411j9001j4770K6305J2726
7690a4960m415l6331m7242K142K3095Q3039M2150n76R938m522l9006o6143m2633
7677i5464J9689M0734N0714J8513l9916K06L6520P093j2739k0720K1348n149M126
7664B4955N140n0792k6870K2382N4166J311k9223o658l2146m5029L312J1943M3498
7651b4011O1176n7930n1469K8227Q4387K8876m9613k0423j4336k4445K1546l2387
7639e0402p455j0068K5352L5909J0101q207m8525p121K8790K7149M7967k7058
$$ plain form
7627 16432 -8427 -6211 30472 9533 -16577 8449 15789 17659 -4405 21238 -3012 -47080
7615 -47080 -55062 -59976 -73683 -26791 -35886 -54210 -60712 -55770 -24899 -36182 -16186 -41344 -17502
7602 -17502 -18265 -58024 -99922 -86928 -57210 -70483 -47680 -21102 -13759 -10433 -30713 -50099 -66192
7589 -66192 -72278 -78978 -41102 -28181 -7667 32406 43781 33975 66475 101995 103506 65278 73990
7576 73990 93029 112749 69496 29041 24343 -17615 -16738 60205 70524 23100 -11596 -20926 -45623
7563 -45623 -94825 -43035 16204 30788 6420 23017 26365 8946 645 4124 -14443 -14451 13291
7550 13291 25515 63553 38389 -18128 660 -4196 25252 47676 56225 60235 85615 65217
7538 65217 24627 -1023 -8979 -33984 -48247 -7247 26632 -22856 -3159 25274 9714 -44131
$$ packed form
7627A6432k4859K216L6683k0939k6110K5026P340J870k2064K5643k4250m4068
7615d7080p982m914j3707M6892r095j8324o502M942L0871j1283J9996k5158K3842
7602a7502p63l9759m1898J2994K9718j3273K2803K6578P343L326k0280j9386j6093
7589f6192o086o700L7876J2921K0514M0073J1375r806L2500L5520J511l8228Q712
7576G3990J9039J9720m3253m0455m698m1958Q77P6943J0319m7424l4696r330k4697
7563d5623m9202N1790N9239J4584k4368J6597L348j7419q301L479j8567qK7742
7550A3291J2224L8038k5164n6517J8788m856K9448K2424Q549M010K5380k0398
7538F5217m0590k5650p956k5005j4263M1000L3879m9488J9697K8433j5560n3845
$$ plain form
7526 -44131 -52873 -18868 -20613 -18620 -41492 -77522 -42951 5064 33806 20789 14766 -14670 -50667
7513 -50667 -54598 -32402 -3399 330 17800 5681 -19110 -1256 8655 -5288 21021 20140 -5847
7500 -5847 -34576 -10511 29812 21701 -455 21430 75189 53952 36993 42904 43037 6451 -17080
7487 -17080 13668 59145 87315 43425 17405 -12157 -25282 25456 32734 58712 62186 -1485
7475 -1485 12096 23854 1636 38706 49266 25578 27781 8281 -16335 1616 21284 2226
7463 2226 -34606 -59708 -25454 -1806 1342 11887 32521 30372 -22476 -31558 -39973 -26897 -20678
7450 -20678 -15486 -12975 -21023 -29409 -8489 -33838 9222 15490 -53320 -121279 -104249 -29852 -17969
7437 -17969 -34504 -60104 -50562 -97114 -153549 -122912 -34152 -17282 -34844 -41263 -49424 -5235
$$ packed form
7526d4131q742L4005j745J993k2872l6030L4571M8015K8742j3017o023k9436l5997
7513e0667l931K2196K9003L729J7470j2119k4791J7854R911j3943K6309q81k5987
7500e847k8729K4065M0323q111k2156K1885N3759k1237j6959N911J33l6586k3531
7487a7080L0748M5477K8170m3890k6020k9562j3125N0738P278K5978L474o3671
7475a485J3581J1758k2218L7070J0560k3688K203j9500k4616J7951J9668j9058
7463B226l6832k5102L4254K3648L148J0545K0634k149n2848r082q415J3076O219
7450b0678N192K511q048q386K0920k5349M3060O268o8810o7959J7030P4397J1883
7437a7969j6535k5600R542m6552n6435L0637Q8760J6870j7562o419q161M4189
$$ plain form
7425 -5235 43824 45948 -5935 3063 -11099 -39697 -18757 -37191 -69721 -41886 -10150 2530
7413 2530 -3224 -12139 -15554 38199 67789 39980 -33858 -19020 26889 17680 5169 -3480 -14209
7400 -14209 -3323 -15582 -14047 -7000 17833 37820 17412 -16093 -5975 37922 56518 30775
7388 30775 -15170 -28012 -20031 -52196 -35138 10096 2601 23564 67883 53066 39801 40378 -28420
7375 -28420 -71180 -76845 -84889 -66419 -96259 -99323 -77710 -46845 -47197 -32721 -814 46722 42880
7362 42880 6794 20903 31000 7560 -10098 -65123 -78543 -36127 -16061 -23161 -17931 -36085
7350 -36085 1679 23592 43838 63858 17500 -2566 -3128 -268 7268 -12493 -56938 -46516 -17358
7337 -17358 -13163 15473 42927 4238 -30390 -63625 -93596 -75141 -38744 -34072 -55172 -76555
$$ packed form
7425e235M9059K124n1883Q998j4162k8598K0940j8434l2530K7835L1736J2680
7413B530n754q915l415N3753K9590k7809p3838J4838M5909r209j2511q649j0729
7400a4209J0886j2259J535P047K4833J9987k0408l3505J0118M3897J8596k5743
7388C0775m5945j2842P981l2165J7058M5234p495K0963M4319j4817j3265N77o8798
7375b8420m2760n665q044J8470k9840l064K1613L0865l52J4476L1907M7536l842
7362D2880l6086J4109J0097k3440j7658n5025j3420M2416K0066p100N230j8154
7350c6085L7764K1913K0246K0020m6358k0066n62K860P536j9761m4445J0422K9158
7337a7358M195K8636K7454l8689l4628l3235k9971J8455L6397M672k1100k1383
$$ plain form
7325 -76555 -62710 -15981 -2599 2564 -1924 -34966 -53215 -40221 -12284 596 20813 20805 11041
7312 11041 2156 -7358 15723 18262 -7894 -41649 -50986 -48882 -35985 15741 9603 -40223 -50190
7299 -50190 -9033 44729 85912 60711 25159 7884 -12586 21565 12686 1744 4753 -62877
7287 -62877 -99475 -71935 -21633 -9916 -21229 -31998 33870 37066 17428 -8857 184 27388
7275 27388 33763 15389 11981 13662 7237 -29801 -31930 -36647 -30010 -15803 -9480 -6137 -29809 -17909
7261 -17909 -29869 -24644 -27964 -15847 6797 29986 33163 47256 68469 66284 70830 70185 77527
7248 77527 88851 91161 92366 93181 81152 54602 30183 38872 20237 -27998 -42219 -32100 5042
7235 5042 40002 48462 34596 13358 -544 -26764 -32305 -8289 -33674 -65996 -53412 -27569
$$ packed form
7325g6555J3845M6729J3382N163m488l3042j8249J2994K7937J2880K0217qr764
7312A1041q885r514K3081K539k6156l3755r337K104J2897N1726o138m9826r967
7299e0190M1157N3762M1183k5201l5552j7275k0470L4151q879j0942L009o7630
7287f2877l6598K7540N0302J1717j1313j0769O5868L196j9638k6285R041K7204
7275B7388O375j8374l408J681o425l7038k129m717O637J4207O323L343k3672J1900
7261a7909j1960N225l320J2117K2644K3189L177J4093K1213k185M546o45P342
7248G7527J1324K310J205Q15j2029k6550k4419Q689j8635m8235j4221J0119L7142
7235E042L4960Q460j3866k1238j3902k6220n541K4016k5385l2322J2584K5843
$$ plain form
7223 -27569 -5456 -19301 -25778 11081 7716 34636 5061 -9886 60584 109663 69445 9925
7211 9925 -11765 -48448 -57044 -51726 -51946 -68984 -72784 -92793 -77385 -37231 2613 20380 2058
7198 2058 -29869 -24152 1945 26831 -13142 -20844 10618 -208 -30664 -62665 -46175 23201
7186 23201 47118 30771 22864 45997 58363 58849 58696 66961 40589 18881 41347 26840 -31167
7173 -31167 -18607 14157 34861 -1322 23461 16779 -27890 -47853 17031 12843 -31209 -38536
7161 -38536 -78611 -74438 -64813 -25516 -8390 8791 42053 40349 -25555 -66005 -34678 -2869
7149 -2869 14707 64871 71470 39397 3197 -17118 -25264 -28768 -22614 1052 7885 10711 32969
7136 32969 60650 1115 -12348 4811 37901 63488 74331 18725 -29439 -20630 -34860 -14271
$$ packed form
7223b7569K2113j3845o477L6859l365K6920k9575j4947P0470M9079m0218n9520
7211I925k1690l6683q596N318k20j7038l800k0009J5408M0154L9844J7767j8322
7198B058l1927N717K6097K4886l9973p702L1462j0826l0456l2001J6490O9376
7186B3201K3917j6347p907K3133J2366M86j53Q265k6372k1708K2466j4507n8007
7173c1167J2560L2764K0704l6183K4783o682m4669j9963O4884m188m4052p327
7161c8536m0075M173R625L9297J7126J7181L3262j704o5904m0450L1327L1809
7149b869J7576N0164O599l2073l6200k0315q146l504O154K3666O833K826K2258
7136C2969K7681n9535j3463J7159L3090K5587J0843n5606m8164Q809j4230K0589
$$ plain form
7124 -14271 -8069 -6135 -17612 -14885 -5272 36289 85990 81896 57909 35480 -9894 -23023 -4445
7111 -4445 28023 38761 40475 70746 80872 49188 73371 87941 85484 39188 16288 8474 -8777
7098 -8777 -24896 -105199 -112478 -83556 -67202 -28545 18331 38883 59772 35683 -18283 -34910
7086 -34910 -23453 -19921 -34120 -23424 -6016 -3808 -12379 -15673 -18651 -34467 -5114 -11609 -10608
7073 -10608 -57849 -52736 -55563 -45565 -24305 -17419 -41692 -39270 -16404 36238 10844 -41918 -65702
7060 -65702 -29724 1117 -13174 -11193 18252 48919 41372 36856 43577 17719 34300 26940 -19125
7047 -19125 6644 -18749 -15992 17262 43491 82466 65911 -10112 -57700 -40956 18627 46553
7035 46553 54728 3228 14355 54000 52516 -11856 -13437 7171 5260 -21113 -29298 -3986 -1126
$$ packed form
7124a4271O202J934j1477K727R613M1561M9701m094k3987k2429m5374j3129J8578
7111d445L2468J0738J714L0271J0126l1684K4183J4570k457m6296k2900p814j7251
7098h777j6119q0303p279K8922J6354L8657M6876K0552K0889k4089n3966j6627
7086c4910J1457L532j4199J0696J7408K208q571l294k978j5816K9353o495J001
7073a0608m7241N113k827R998K1260O886k4273K422K2866N2642k5394n2762k3784
7060f5702L5978L0841j4291J981K9445L0667p547m516O721k5858J6581p360m6065
7047a9125K5769k5393K757L3254K6229L8975j6555p6023m7588J6744N9583K7926
7035D6553Q175n1500J1127L9645j484o4372j581K0608j911k6373q185K5312K860
$$ plain form
7022 -1126 -19351 -16061 -27163 9508 22543 42302 57216 67041 47435 7581 219 16938 27451
7009 27451 -20059 -46801 -41493 -34723 -25380 -7867 -11125 -135 10756 16612 30279 32200 13140
6996 13140 15204 -186 -13637 2151 9757 2245 30293 48020 55478 28718 -8801 9611 4345
6983 4345 -19594 -11883 -15457 -7163 -45876 -54974 -71227 -28430 18982 -31001 -58496 -51048 8978
6970 8978 64247 70829 58988 69251 94579 153817 127760 68989 6653 4306 29748 538
6958 538 -26012 -21182 5838 2718 -28682 -10078 3334 5592 -10441 -23701 -19393 28216 41290
6945 41290 35085 31848 38566 13772 22686 18158 2748 27429 26617 19526 -28930 5658 42312
6932 42312 26804 16336 -1558 41351 50959 76524 74979 24446 41004 38867 18398 5445
$$ packed form
7022a126j8225L290j1102L6671J3035J9759J4914R825j9606l9854p362J6719J0513
7009B7451m7510k6742N308O770R343J7513l258J0990J0891N856J3667J921j9060
6996A3140K064j5390j3451J5788P606p512K8048J7727P458k6760l7519J8412n266
6983D345k3939P711l574Q294l8713r098j6253M2797M7412m9983k7495P448O0026
6970H978N5269O582j1841J0263K5328N9238k6057n8771o2336k347K5442k9210
6958E38k6550M830K7020l120l1400J8604J3412K258j6033j3260M308M7609J3074
6945D1290o205l237O718k4794Q914m528j5410K4681q12p091m8456L4588L6654
6932D2312j5508j0468j7894M2909R608K5565j545n0533J6558k137k0469j2953
$$ plain form
6920 5445 20010 13391 21705 9978 29635 32796 -814 -11982 -12650 40285 54937 44487 37856
6907 37856 30781 60192 53179 -6322 -48757 -33138 -51978 -23009 -8643 -49132 -82167 -50079
6895 -50079 -57232 -13287 -3515 -59841 -77862 -45427 -35231 -30053 -21991 11915 -3195 -9339 8578
6882 8578 39064 92448 78332 45076 25242 -34253 -41142 -37402 -17037 -37687 -8742 2528
6870 2528 36953 64915 55555 8845 33671 10228 -41451 -29663 -1907 -5953 35252 66174
6858 66174 68117 37142 32878 23158 31637 -6168 10807 55164 73035 78741 36746 56370 24682
6845 24682 14004 -169 17217 6311 -7657 9860 20597 -890 17479 -4197 -12808 -25281
6833 -25281 -2583 -8411 -27084 -35355 -13477 -23801 -28652 -19094 9536 4810 -36676 -29787 -33805
$$ packed form
6920E445J4565o619Q314j1727J9657L161l3610j1168o68N2935J4652j0450o631
6907C7856p075K9411p013n9501m2435J5619j8840K8969J4366m0489l3035L2088
6895e0079p153M3945R772n6326j8021L2435J0196N178Q062L3906j5110o144J7917
6882H578L0486N3384j4116l3256j9834n9495o889L740K0365k0650K8945J1270
6870B528L4425K7962r360m6710K4826k3443n1679J1788K7756m046M1205L0922
6858F6174J943l0975m264r720Q479l7805J6975M4357J7871N706m1995J9624l1688
6845B4682j0678j4173J7386j0906j3968J7517J0737k1487J8369k1676q611j2473
6833b5281K2698n828j8673q271K1878j0324m851R558K8630m726m1486O889m018
$$ plain form
6820 -33805 -60602 -35915 14352 83793 65646 49103 43963 32530 4950 -40526 -48012 -29414
6808 -29414 -16337 -63601 -63369 -27702 -12642 -15319 -40711 -27686 -4929 -23554 6364 -26468
6796 -26468 -20433 28431 32869 1551 -7018 -21722 -6196 10746 33063 41205 37612 11748 3119
6783 3119 22777 -5211 -56576 25402 80665 50491 35065 -32030 -18759 -14241 -15911 -16004 4177
6770 4177 16408 3658 20868 18730 -1789 -6852 28197 115269 156239 140932 49356 6899
6758 6899 -15268 -53558 -52074 -35849 -21595 -8227 14473 8281 28336 8038 31643 21712 -13740
6745 -13740 -32952 -20063 -16046 18565 59030 40011 -13628 -862 27947 35861 27996 59176
6733 59176 62713 33640 1015 -35618 -5687 18700 -25107 -45772 -48518 -48612 4152 24127 37265
$$ packed form
6820c3805k6797K4687N0267O9441j8147j6543n140j1433k7580m5476p486J8598
6808b9414J3077m7264K32L5667J5060k677k5392J3025K2757j8625K9918l2832
6796b6468O035M8864M438l1318q569j4704J5526J6942K2317Q142l593k5864q629
6783C119J9658k7988n1365Q1978N5263l0174j5426o7095J3271M518j670r3K0181
6770D177J2231j2750J7210k138k0519n063L5049Q7072M0970j5307r1576m2457
6758F899k2167l8290J484J6225J4254J3368K2700o192K0055k0298K3605r931l5452
6745a3740j9212J2889M017L4611M0465j9019n3639J2766K8809P914p865L1180
6733E9176L537k9073l2625l6633K9931K4387m3807k0665k746r4N2764J9975J3138
$$ plain form
6720 37265 29651 -15500 8764 15823 -7301 -17034 -18189 -17516 -53210 -72794 -83466 -36635 -37920
6707 -37920 -64318 -64404 -69581 -65693 -66463 -52952 4951 21769 13590 47026 79847 87287 114411 67958
6693 67958 44531 72248 54015 28715 13172 34375 52612 5360 38615 62742 57987 16745
6681 16745 -39293 -33415 -9175 -7527 10465 59306 72322 37732 31891 39050 34221 43751 42104
6668 42104 10581 25093 44439 50204 56725 25339 13699 16414 8884 6203 15828 -1763 31642
6655 31642 30020 -11790 -28502 -35806 -39171 -25822 -13805 -163 7003 7298 7443 -47567 -43023 -19673
6641 -19673 -11729 -7481 1121 -4653 24109 37973 24356 -24697 3080 60969 8478 -27756 -30524
6628 -30524 -40745 -65058 -72829 -13392 -10323 -24638 -27146 -15164 -42135 -17814 -3729 53967
$$ packed form
6720C7265p614m5151K4264P059k3124r733j155O73l5694j9584j0672M6831j285
6707c7920k6398q6n177L888p70J3511N7903J6818q179L3436L2821P440K7124m6453
6693F7958k3427K7717j8233k5300j5543K1203J8237m7252L3255K4127m755m1242
6681A6745n6038N878K4240J648J7992M8841J3016l4590n841P159m829R530j647
6668D2104l1523J4512J9346N765O521l1386j1640K715p530k681R625j7591L3405
6655C1642j622m1810j6712p304l365J3349J2017J3642P166K95J45n5010M544K3350
6641a9673P944M248Q602n774K8762J3864j3617m9053K7777N7889n2491l6234k768
6628c0524j0221k4313p771N9437L069j4315k508J1982k6971K4321J4085N7696
$$ plain form
6616 53967 55289 64105 38782 22305 -12929 -17122 32317 54858 -4309 -29103 5127 -3476 -21645
6603 -21645 -14326 -13976 -898 -33673 -46099 -14415 -23904 -34331 -37756 -37967 -58693 -80239 -66430
6590 -66430 -29823 -34604 -64787 -80579 -53609 -30074 -9480 49910 38512 21088 37179 53035
6578 53035 38765 18468 26699 57965 39137 36256 54662 25305 -6842 -7817 25858 46331 12369
6565 12369 -19228 -20008 14860 -1823 -16255 -7830 -9693 -3969 -41880 -33411 -12537 -7982 16355
6552 16355 60782 79535 10139 -62041 -62165 -54360 -36614 -7778 -25863 -58507 -53406 -55527 -52509
6539 -52509 -36166 -13930 -29625 -25588 -41250 -39808 -79670 -96157 -81729 -43517 -13821 4886
6527 4886 29186 27713 25352 23788 8478 33480 61253 93423 74230 19553 -6040 23227 26919
$$ packed form
6616E3967J322Q816k5323j6477l5234m193M9439K2541n9167k4794L4230q603j8169
6603b1645P319L50J3078l2775j2426L1684r489j0427l425k11k0726k1546J3809
6590f6430L6607m781l0183j5792K6970K3535K0594N9390j1398j7424J6091J5856
6578E3035j4270k0297Q231L1266j8828k881J8406k9357l2147r75L3675K0473l3962
6565A2369l1597p80L4868j6683j4432Q425j863N724l7911Q469K0874M555K4337
6552A6355M4427J8753o9396p2180j24P805J7746K8836j8085l2644N101k121L018
6539e2509J6343K2236j5695M037j5662J442l9862j6487J4428L8212K9696J8707
6527D886K4300j473k361j564j5310K5002K7773L2170j9193n4677k5593K9267L692
$$ plain form
6514 26919 57883 45262 5260 -4708 45390 60129 29023 7818 -10511 12287 -19275 -29643
6502 -29643 -15306 -11891 -17723 -47228 -68709 -66181 -60434 -69423 -49538 -89774 -93725 -56087 -27434
6489 -27434 28238 -1889 -15661 -13233 9625 43395 81276 58991 9647 -23867 -81523 -60694
6477 -60694 -5742 -18828 3400 19097 1479 30031 47835 9130 -13655 -42302 -13858 -43638
6465 -43638 -94130 -39507 -31559 -48415 -91803 -90119 -44762 -55815 -51518 -61826 -70289 -58036 -57835
6452 -57835 -38321 22420 17148 -6415 -18663 -54091 -60031 -38120 1976 17766 60559 50139
6440 50139 57291 54551 18461 43121 25600 1827 -3797 4473 -20581 872 33687 4052 6113
6427 6113 -22315 -37441 -33180 -61878 -65844 -56232 -22794 -871 -229 -43963 -73921 2742 26967
$$ packed form
6514B6919L0964j2621m0002r968N0098J4739l1106k1205j8329K2798l1562j0368
6502b9643J4337L415n832k9505k1481K528N747q989J9885m0236l951L7638K8653
6489b7434N5672l0127j3772K428K2858L3770L7881k2285m9344l3514n7656K0829
6477f0694N4952j3086K2228J5697j7618K8552J7804l8705k2785k8647K8444k9780
6465d3638n0492N4623P948j6856m3388J684M5357j1053M297j0308q463J2253K01
6452e7835J9514O0741n272k3563j2248l5428n940K1911M0096J5790M2793j0420
6440E0139P152k740l6090K4660j7521k3773n624Q270k5054K1453L2815k9635K061
6427F113k8428j5126M261k8698l966R612L3438K1923O42m3734k9958P6663K4225
$$ plain form
6414 26967 -4284 -3853 -11445 -31887 -47722 -78946 -32669 -10350 9056 29386 16504 17808 37288
6401 37288 21645 13807 11293 10612 -5725 36762 63369 19842 -19575 -58542 -36270 1901 31201
6388 31201 27878 50427 53868 66246 79844 87229 64238 36033 -6475 -20604 -34430 -31032 -56742
6375 -56742 -41034 296 -3592 -21544 -47680 -75775 -76494 -74556 -66381 -23071 -1280 12076 50842
6362 50842 63482 -8976 -22530 43456 52623 17670 13593 -16501 -16495 -32448 -3196 19354 30074
6349 30074 25692 -3220 -9538 -4736 -37211 -17645 27491 27032 11886 -15808 -18870 4152 8105
6336 8105 -3304 -2389 -24220 -19967 3531 -16770 -49150 -31161 -5323 27260 12186 2319 29136
6323 29136 38750 3261 -34557 -46353 -42446 -45450 -5580 29863 38606 15934 7146 -31560 -34660
$$ packed form
6414B6967l1251M31p592k0442j5835l1224M6277K2319J9406K0330j2882J304J9480
6401C7288j5643p838k514o81j6337M2487K6607m3527l9417l8967K2272L8171K9300
6388C1201l323K2549L441J2378J3598P385k2991k8205m2508j4129j3826L398k5710
6375e6742J5708M1330l888j7952k6136k8095p19J938Q175M3310K1791J3356L8766
6362E0842J2640p2458j3554O5986R167l4953m077l0094Oj5953K9252K2550J0720
6349C0074m382k8912o318M802l2475J9566M5136m59j5146k7694l062K3022L953
6336H105j1409R15k1831M253K3498k0301l2380J7989K5838L2583j5074r867K6817
6323B9136R614l5489l7818j1796L907l004L9870L5443Q743k2672q788l8706l100
$$ plain form
6310 -34660 24377 -8692 -20580 13498 55051 95855 99856 95070 60318 50243 37517 28386
6298 28386 23960 23812 60978 119473 105171 91579 42587 -21652 28298 50510 28669 12417
6286 12417 30051 8979 -37769 -48347 39177 27729 9224 31031 14085 20425 57748 80536
6274 80536 87968 65635 31833 16540 -15200 -33990 -39133 -56748 -50409 -46415 -6471 33023 13298
6261 13298 10048 -27117 -60899 -58265 -61928 -65635 -48654 -30116 -33003 -78330 -85947 -56076 -39448
6248 -39448 -39256 -42493 -45945 -51078 -31064 -43832 -41592 4670 5065 7213 29230 22523 20315 -1925
6234 -1925 -16824 9844 58768 51986 36926 44726 71642 47791 42969 12535 -23144 -29616 -11356
6221 -11356 -16438 -1401 -8053 -23387 559 -1502 9240 -10089 4053 15813 -30617 -54899
$$ packed form
6310c4660N9037l3069j1888L4078M1553M0804M001m786l4752j0075j2726r131
6298B8386m426j48L7166N8495j4302j3592m8992o4239M9950K2212k1841j6252
6286A2417J7634k1072m6748j0578Q7524j1448j8505K1807j6946O340L7323K2788
6274H0536P432k2333l3802j5293l1740j8790n143j7615O339L994L9944L9494j9725
6261A3298l250l7165l3782K634l663l707J6981J8538k887m5327p617K9871J6628
6248c9448J92l237l452n133K0014j2768K240M6262L95K148K2017o707k208k2240
6234a925j4899K6668M8924o782j5060P800K6916k3851m822l0434l5679o472J8260
6221a1356n082J5037o652j5334K3946k061J0742j9329J4142J1760m6430k4282
$$ plain form
6209 -54899 -65696 -27206 -21679 -40351 -8865 -5678 27553 26384 -5083 12903 50637 56234 14098
6196 14098 54 23065 30928 50145 75810 51196 20214 2266 -16935 -10304 -20127 -7058
6184 -7058 21442 54038 17822 -5411 -48213 -83929 -41249 10687 28604 34843 23257 -49439
6172 -49439 -66863 -53148 -71702 -94225 -89307 -47394 -77871 -110643 -94396 -75756 -38624 -32540
6160 -32540 9501 12619 1922 -56747 -92779 -101083 -37977 -8444 -25344 -36285 -43603 -3081
6148 -3081 46296 -43162 -22090 -3085 -8365 -31497 -2072 13878 36455 36182 36017 -14543 -43524
6135 -43524 659 28464 5708 -22463 -36200 -48558 -6797 -6592 7469 30568 -10254 -34451
6123 -34451 -30477 -20501 -52708 -84656 -84176 -36163 -19310 2149 -19257 -639 1340 -12732 -46343
$$ packed form
6209e4899j0797L8490N527j8672L1486L187L3231j169l1467J7986L7734N597m2136
6196A4098j4044K3011P863J9217K5665k4614l0982j7948j9201O631r823J3069
6184g058K8500L2596l6216k3233m2802l5716M2680N1936J7917O239j1586p2696
6172d9439j7424J3715j8554k2523M918M1913l0477l2772J6247J8640L7132O084
6160c2540M2041L118j0697n8669l6032q304O3106K9533j6900j0941p318M0522
6148c081M9377q9458K1072J9005n280k3132K9425J5950K2577k73j65n0560k8981
6135d3524M4183K7805k2756k8171j3737j2358M1761K05J4061K3099m0822k4197
6123c4451L974R976l2207l1948M80M8013J6853K1459k1406J8618J979j4072l3611
$$ plain form
6110 -46343 -47366 -42539 -14003 38387 57206 50413 42040 15706 7439 -15656 -18632 -5782 -5578
6097 -5578 -6613 36089 45732 520 -35591 -35917 4314 25750 22829 12184 -11815 -88767 -79373
6084 -79373 -61382 -59206 -39786 -33233 -34224 -39530 -43373 6516 14183 845 9176 3392 -16969 1326
6070 1326 42199 47570 6118 -67929 -86758 -63757 -56383 -31920 -43424 -43481 -24341 9715 -22038
6057 -22038 2421 27261 -27594 -38153 -23757 -25628 -24432 25755 3736 -26331 -32624 -38467 -32960
6044 -32960 -2949 36142 32795 16322 12524 -33549 -68482 -21370 11849 -4968 43942 40352
6032 40352 12515 7155 9872 13533 -22709 -50735 -47640 -15778 46844 -11358 -54200 -77506 -70739
6019 -70739 -58021 -115225 -107923 -73816 -41292 -33702 -66401 -45160 -39972 -69568 -80954 -31787
$$ packed form
6110d6343j023M827K8536N2390J8819o793q373k6334q267k3095k976J2850K04
6097e578j035M2702R643m5212l6111l26M0231K1436k921j0645k3999p6952R394
6084g9373J7991K176J9420O553r91n306l843M9889P667j3338Q331n784k0361J8295
6070A326M0873N371m1452p4047j8829K3001P374K4463j1504n7J9140L4056l1753
6057b2038K4459K4840n4855j0559J4396j871J196N0187k2019l0067o293n843N507
6044c2960L0011L9091l347j6473l798m6073l4933M7112L3219j6817M8910l590
6032D0352k7837n360K717L661l6242k8026L095L1862O2622n8202m2842k3306O767
6019g0739J2718n7204P302L4107L2524P590l2699K1241N188k9596j1386M9167
$$ plain form
6007 -31787 -23284 2674 32884 21133 -61574 -134944 -124249 -92359 -62109 -76377 -97271 -32365
5995 -32365 339 -15699 -38126 -41435 -49141 -30704 -29298 -29271 -29641 -64562 -59909 -55271 -46368 -49589
5981 -49589 -57349 -5128 49040 36161 20850 23832 34717 19557 -19911 -80451 -42764 13791
5969 13791 12508 -16718 -32619 -37262 -56694 -53351 4187 -2090 -8273 -28083 -4622 5747 26610
5956 26610 48022 -34999 -51416 -6822 -15394 -3069 19889 53688 62830 21755 -13878 -31935
5944 -31935 -33471 -15506 27030 31033 45552 78890 30601 -23147 -64461 -60676 -35822 -82164
5932 -82164 -78483 -47982 -1064 -40575 -55981 -37130 -30169 -23605 -21075 9402 20343 1252 -25828
5919 -25828 -17802 -25947 -16692 -21693 -3800 -9160 1642 38307 30589 -19656 -13442 -9356 -30576
$$ packed form
6007c1787Q503K5958L0210j1751q2707p3370J0695L1890L0250j4268k0894O4906
5995c2365L2704j6038k2427l309p706J8437J406K7l70l4921M653M638Q903l221
5981d9589p760N2221N4168j2879j5311K982J0885j5160l9468o0540L7687N6555
5969A3791j283k9226j5901m643j9432L343N7538o277o183j9810K3461J0369K0863
5956B6610K1412q3021j6417M4594q572J2325K2958L3799R142m1075l5633j8057
5944c1935j536J7965M2536M003J4519L3338m8289n3748m1314L785K4854m6342
5932h2164L681L0501M6918l9511j5406J8851O961O564K530L0477J0941j9091k7080
5919b5828Q026q145R255n001J7893n360J0802L6665p718n0245O214M086k1220
$$ plain form
5906 -30576 -26889 -20878 -35885 -49801 -24707 15651 48861 27980 -24954 -14675 -2624 24925
5894 24925 28063 8280 11787 36380 38543 14779 566 -25507 -55675 -39445 -44991 -73023 -66080
5881 -66080 -21821 -7755 -10300 -26627 -54085 -35229 1376 6049 -24145 -37115 -40055 -22395
5869 -22395 8464 19953 -10049 -6496 18461 -186 -5338 34847 55557 41659 2527 -1011
5857 -1011 47347 18673 -36138 3245 47662 40775 -14219 -66871 -69999 -39865 14242 32446
5845 32446 -16145 -50106 -54524 -35447 -50800 -48801 -48869 -55608 -44780 -50363 -28395 4417 -17599
5832 -17599 10092 59383 18795 637 3332 17775 65148 59640 25008 14796 2460 -41774
5820 -41774 -59503 -37553 -115 8715 10149 43442 -25691 -53412 -18751 -28095 7990 54121
$$ packed form
5906c0576L687O011j5007j3916K5094M0358L3210k0881n2934J0279J2051K7549
5894B4925L138j9783L507K4593K163k3764j4213k6073l0168J6230n546k8032O943
5881f6080M4259J4066k545j6327k7458J8856L6605M673l0194j2970k940J7660
5869b2395L0859J1489l0002L553K4957j8647n152M0185K0710j3898l9132l538
5857a011M8358k8674n4811L9383M4417o887n4994n2652l128L0134N4107J8204
5845C2446m8591l3961m418J9077j5353J999o8o739J0828n583K1968L2812k2016
5832a7599K7691M9291m0588j8158K695J4443M7373n508l4632j0212j2336m4234
5820d1774j7729K1950L7438Q830J434L3293o9133k7721L4661r344L6085M6131
$$ plain form
5808 54121 18454 4144 23907 56966 39704 40323 24785 -2945 -30339 -55972 -56307 -44990 -80
5795 -80 26108 43129 29184 64483 46026 -14104 -36590 -33541 -48603 -51017 -33401 -40138 -50040
5782 -50040 -38569 -65749 -77980 -7927 14084 -15152 4762 2920 354 39048 -8866 -6602
5770 -6602 17071 28420 25269 55663 83628 62328 36571 32001 21738 44552 40526 30244 3693
5757 3693 -1415 50287 50844 -9712 -32773 -29667 -32473 -60296 -20802 -37439 -65303 -17923 19071
5744 19071 -5968 -34660 -34056 -19805 -34708 -31201 -20823 -10569 -6674 19263 23052 30375 34765
5731 34765 27270 -17683 -45669 -38962 -34561 11318 73360 1895 -7679 16704 -13324 -34950 -34961
5718 -34961 -25718 -4723 -26256 -49016 -11954 24983 6723 -31306 -22150 -1249 -5207 9906
$$ packed form
5808E4121l5667j4310J9763L3059j7262O19j5538k7730k7394k5633l35J1317M4910
5795h0K6188J7021j3945L5299j8457o0130k2486L049j5062k414J7616o737r902
5782e0040J1471k7180j2231P0053K2011k9236J9914j842k566L8694m7914K264
5770f602K3673J1349l151L0394K7965k1300k5757m570j0263K2814m026j0282k6551
5757C693n108N1702N57o0556k3061L106k806k7823L9494j6637k7864M7380L6994
5744A9071k5039k8692O04J4251j4903L507J0378J0254L895K5937L789P323M390
5731C4765p495m4953k7986O707M401M5879O2042p1465r574K4383l0028k1626j1
5718c4961R243K0995k1533k2760L7062L6937j8260l8029R156K0901l958J5113
$$ plain form
5706 9906 5734 44718 72683 81331 20632 17497 37931 -24144 -71500 -23915 5972 -1603 -9532
5693 -9532 -35272 -11356 -16240 -67236 -55586 -38701 -3301 15615 29636 44273 32608 -1104
5681 -1104 -20878 2665 10107 11608 48703 22130 -2105 -2399 1900 13271 36696 96373 82613
5668 82613 53028 32798 -38968 -27004 -3835 23268 51001 93791 61288 36322 7406 -14263
5656 -14263 5149 15346 21465 -13721 -24528 17747 -4362 -33446 7467 58004 64392 37538
5644 37538 -22728 -71143 -37518 -37853 -53059 -36807 11815 2751 -7442 24684 4619 -21899
5632 -21899 -58760 -52434 -4538 77454 96236 86308 45531 10716 29931 19766 19803 -12538 -42813
5619 -42813 -44826 -11918 -8782 -8651 -8861 5138 47311 22511 -3435 35971 16377 -3577 -26790
$$ packed form
5706I906m172L8984K7965Q648o0699l135K0434o2075m7356M7585K9887p575p929
5693i532k5740K3916m884n0996J1650J6885L5400J8916J4021J4637j1665l3712
5681a104j9774K3543P442J501L7095k6573k4235k94M299J1371K3425N9677j3760
5668H2613k9585k0230p1766J1964K3169K7103K7733M2790l2503k4966k8916k1669
5656a4263J9412J0197O119l5186j0807M2275k2109k9084M0913N0537O388k6854
5644C7538o0266m8415L3625l35j5206J6252M8622r064j0193L2126k0065k6518
5632b1899l6861O326M7896Q1992J8782r928m0777l4815J9215j0165L7l2341l0275
5619d2813k013L2908L136J31k10J3999M2173k4800k5946L9406j9594j9954k3213
$$ plain form
5606 -26790 -22802 -18160 -49149 -46485 -17891 -28110 -22663 -47028 -56793 -33566 -19619 -14987 -24759
5593 -24759 -16890 -7297 25964 -17616 -53574 -73050 -54330 -32459 -43659 -28060 5731 -11772
5581 -11772 -68708 -16705 17099 -7725 -6308 8211 13828 20070 29118 8378 7100 39166 55171
5568 55171 71119 60311 53012 70663 27921 -6115 -597 -16090 -45032 -20444 14741 48926
5556 48926 55363 34506 52707 83744 50981 44582 3877 -9335 4230 40118 26602 28517
5544 28517 20150 11709 17776 42444 26033 -9496 -79747 -98189 -101092 -94771 -93208 -81489 -77010
5531 -77010 -57231 -33624 -22305 -11760 17510 23120 -12136 -60080 -31020 -184 -5377 -16127
5519 -16127 28848 84106 121819 118898 83784 58099 42783 55289 58078 9373 -20436 -39320
$$ packed form
5606b6790L988M642l0989K664K8594j0219N447k4365r765K3227J3947M632r772
5593b4759P869R593L3261m3580l5958j9476J8720K1871j1200J5599L3791j7503
5581a1772n6936N2003L3804k4824J417J4519N617O242R048k0740j278L2066J6005
5568E5171J5948j0808p299J7651m2742l4036N518j5493k8942K4588L5185L4185
5556D8926O437k0857J8201L1037l2763o399m0705j3212J3565L5888j3516J915
5544B8517q367q441O067K4668j6411l5529p0251j8442k903O321J563J1719M479
5531g7010J9779K3607J1319J0545K9270N610l5256m7944K9060L0836n193j0750
5519a6127M4975N5258L7713k921l5114k5685j5316J2506K789m8705k9809j8884
$$ plain form
5507 -39320 -43055 -44786 -32412 -5316 15431 19810 41580 18380 -4069 -1849 14258 13745 -35414
5494 -35414 -59657 -24637 5710 38811 14197 -27181 -45404 -86553 -46018 -3428 -17574 -23345
5482 -23345 -40825 -11423 34157 50453 38929 54177 31180 23519 22153 3500 -40048 -58550
5470 -58550 -76681 -28765 31895 66611 86906 35616 6737 8391 15723 18840 22083 -3903 -18623
5457 -18623 14468 48549 32526 12335 -17457 -41243 2452 35352 32190 23037 20762 25370 -6983
5444 -6983 -44650 -15369 16253 60760 36130 12743 30979 42851 62470 55163 20248 -21426
5432 -21426 -9504 20718 -2588 -20114 -6476 89051 59133 17671 13616 29908 36690 23900
5420 23900 -4024 -8400 -24148 -61568 -75901 -30306 -29215 -4652 42875 52669 13198 35749
$$ packed form
5507c9320l735j731J2374K7096K0747M379K1770k3200k2449K220J6107n13m9159
5494c5414k4243L5020L0347L3101k4614m1378j8223m1149M0535M2590j4146n771
5482b3345j7480K9402M5580J6296j1524J5248k2997p661j366j8653m3548j8502
5470e8550j8131M7916O0660L4716K0295n1290k8879J654P332L117L243k5986j4720
5457a8623L3091L4081j6023k0191k9792k3786M3695L2900l162r153k275M608l2353
5444f983l7667K9281L1622M4507k4630k3387J8236J1872J9619p307l4915m1674
5432b1426J1922L0222k3306j7526J3638R5527k9918m1462m055J6292O782j2790
5420B3900k7924m376j5748l7420j4333M5595J091K4563M7527R794l9471K2551
$$ plain form
5408 35749 106165 106025 67386 24305 -9207 5351 47840 57650 50450 50913 51895 39785 20977
5395 20977 14995 29604 66934 45962 2341 -47553 -48677 -33574 18346 35371 17390 14001
5383 14001 35919 8019 -25467 -24400 -38179 -28120 -17328 -15025 -24708 -28259 -12271 -13623 11662
5370 11662 -2325 -6620 7662 -16669 -10517 -12506 -12845 -24862 -7004 -4874 -50459 -75674 -50164
5357 -50164 -5238 -3122 -23215 -3464 -3075 7265 21312 16646 9020 -23881 -32078 -1409 -3845
5344 -3845 -70890 -88077 -52055 -5500 -4470 -9299 -14342 -49418 -50934 -33121 5215 11240 74237
5331 74237 114260 100182 64671 1443 -45213 -24774 -44591 -34545 12433 11246 24140 26592
5319 26592 27822 72866 77808 41885 -8758 -28016 -31735 -30837 -23990 -32831 23803 28505 -13485
$$ packed form
5408C5749P0416j40l8639m3081l3512J4558M2489R810p200M63R82j2110j8808
5395B0977n982J4609L7330k0972m3621m9894j124J5103N1920J7025j7981l389
5383A4001K1918k7900l3486J067j3779J0059J0792K303r683l551J5988j352K5285
5370A1662j3987m295J4282k4331O152j989l39j2017J7858K130m5585k5215K5510
5357e0164M4926K116k0093J9751L89J0340J4047m666p626l2901q197L0669k436
5344c845o7045j7187L6022M6555J030m829n043l5076j516J7813L8336O025O2997
5331G4237M0023j4078l5511o3228m6656K0439j9817J0046M6978j187J2894K452
5319B6592J230M5044M942l5923n0643j9258l719Q98O847q841N6634M702m1990
$$ plain form
5306 -13485 -27819 -7914 -10532 -15819 -26531 -11216 -7361 7987 27061 63579 85136 30189
5294 30189 -9027 -24643 -46436 -4845 9105 -42648 -55348 -46751 -31995 -19774 -7279 20547
5282 20547 -24897 -89504 -109130 -92767 -34423 -11886 -22204 -44177 -46057 -80376 -68014 -17425
5270 -17425 -18253 -31364 -18945 1068 32044 -16989 -38783 -10495 34825 20118 -10978 9112
5258 9112 20135 -12385 -24114 -52356 -87061 -96539 -72426 -23726 -41510 -43758 -15637 -11989 59555
5245 59555 59657 10685 -14488 -13619 -6312 4543 27862 44792 7525 -6616 5930 3512 -1000
5232 -1000 -39511 -51943 -27537 -34841 -57556 -59371 -53497 -43718 -21884 -29372 -27089 9717 16354
5219 16354 -28337 -44106 -34999 -9686 17741 -25 25735 48945 98544 88791 79248 86922 44471
$$ packed form
5306a3485j4334J9905k618n287j0712J5315L855J5348J9074L6518K1557n4947
5294C0189l9216j5616k1793M1591J3950n1753j2700Q597J4756J2221J2495K7826
5282B0547m5444o4607j9626J6363N8344K2537j0318k1973j880l4319J2362N0589
5270a7425q28j3111J2419K0013L0976m9033k1794K8288M5320j4707l1096K0090
5258I112J1023l2520j1729k8242l4705r478K4113M8700j7784k248K8121L648P1544
5245E9555J02m8972k5173Q69P307J0855K3319J6930l7267j4141J2546k418m512
5232a000l8511j2432K4406p304k2715j815N874R779K1834p488K283L6806O637
5219A6354m4691j5769R107K5313K7427j7766K5760K3210M9599r753r543P674m2451
$$ plain form
5206 44471 36991 21180 11480 8684 20487 72220 59714 27358 40450 40078 13556 10970 27005
5193 27005 -4663 -17953 -27558 570 7791 7022 -23450 5307 -16225 -30466 -17808 -27301 -30599
5180 -30599 -43595 -36309 -54409 -31625 -17172 -25760 18260 36945 6631 -42792 -33617 -6060
5168 -6060 -1282 -773 4299 -20222 -18728 -26585 -44411 -42606 -31739 5123 21341 -20078 -3699
5155 -3699 17824 13241 77571 93120 65170 8266 -8862 -57160 -30275 36860 57437 52947
5143 52947 50275 83108 101297 41797 -11926 -19225 59 -29476 -45204 2507 56935 71128
5131 71128 80594 46731 1338 -7198 -6273 -27919 -19343 -36661 -27295 -9633 7484 31339 31464
5118 31464 -976 3155 28160 6233 -5636 -20096 -54848 -57192 -49334 -46597 -62580 -9362 28557
$$ packed form
5206D4471p480j5811r700k796J1803N1733j2506l2356J3092l72k6522k586J6035
5193B7005l1668j3290r605K8128P221p69l0472K8757k1532j4241J2658r493l298
5180c0599j2996P286j8100K2784J4453q588M4020J8685l0314m9423R175K7557
5168f060M778N09N072k4521J494p857j7826J805J0867L6862J6218m1419J6379
5155c699K1523m583O4330J5549k7950n6904j7128m8298K6885O7135K0577m490
5143E2947k672L2833J8189n9500n3723p299J9284k9535j5728M7711N4428J4193
5131G1128R466l3863m5393q536R25k1646Q576j7318R366J7662J7117K3855J25
5118C1464l2440M131K5005k1927j1869j4460l4752k344P858K737j5983N3218L7919
$$ plain form
5105 28557 33652 8457 25165 9551 -21084 -79412 -75358 -60187 -3992 44775 53078 18228
5093 18228 4833 1936 -22894 19409 20678 41626 62844 44313 50977 50873 64423 83705 94178
5080 94178 53242 24780 -7765 -9065 -4397 -9025 -5916 26320 42303 14305 14687 8937 -7872
5067 -7872 -35193 11582 12196 -20784 -22435 5342 22931 45435 32547 17987 4682 -31652 -54790
5054 -54790 -40882 14365 46575 30388 8994 42365 54015 29917 35668 30502 -23622 -47291
5042 -47291 -23716 -12667 21420 57242 55406 47460 72796 55424 39559 32092 45782 21121
5030 21121 12354 -42878 -47629 -28706 -30556 -32858 -15019 -28041 -42308 -44602 -35621 -28769 -25721
5017 -25721 -26461 -24961 -27691 -16931 -33819 -25056 -19325 -89058 -91829 -46035 -52514 -10179 839
$$ packed form
5105B8557N095k5195J6708j5614l0635n8328M054J5171N6195M8767Q303l4850
5093A8228j3395k897k4830M2303J269K0948K1218j8531O664j04J3550J9282J0473
5080I4178m0936k8462l2545j300M668m628L109L2236J5983k7998L82n750j6809
5067g872k7321M6775O14l2980j651K7777J7589K2504j2888j4560j3305l6334k3138
5054e4790J3908N5247L2210j6187k1394L3371J1650k4098N751n166n4124k3669
5042d7291K3575J1049L4087L5822j836p946K5336j7372j5865p467J3690k4661
5030B1121q767n5232m751J8923j850k302J7839j3022j4267k294Q981O852L048
5017b5721p40J500k730J0760j6888Q763N731o9733k771M5794o479M2335J1018
$$ plain form
5004 839 -14374 -24783 -39354 -20215 -39465 -72503 -67662 -36329 -54694 -30126 -38696 -31834 -12209
4991 -12209 -4034 192 4453 -1235 5041 47924 55666 44520 10517 23611 17393 54637 72564
4978 72564 69517 28161 -10214 -51619 -46630 9171 16915 -14336 -60330 -73936 -21947 14929
4966 14929 19885 18734 7795 32542 76625 68776 32305 -970 -12758 -28119 -45039 -10822
4954 -10822 -31563 -38008 -20903 662 14513 -25574 -54437 -112398 -112092 -61013 -8895 8103
4942 8103 5965 6325 20447 -1902 -6494 -23612 -37811 -4729 7511 16416 -9727 -24243 -14412
4929 -14412 -33183 7236 24000 -17117 -47818 -68118 -104348 -97309 -79892 -50035 2917 33919
4917 33919 77682 17023 -22383 -40248 -62952 -39625 -29435 -67392 -42563 -3460 -22577 -5944
$$ packed form
5004H39j5213j0409j4571J9139j9250l3038M841L1333j8365K4568q570O862J9625
4991a2209Q175M226M261n688O276M2883P742j1146l4003J3094o218L7244J7927
4978G2564l047m1356l8375m1405M989N5801P744l1251m5994j3606N1989L6876
4966A4929M956j151j0939K4747M4083p849l6471l3275j1788j5361j6920L4217
4954a0822k0741o445J7105K1565J3851m0087k8863n7961L06N1079N2118J6998
4942H103k138L60J4122k2349m592j7118j4199L3082J2240Q905k6143j4516R831
4929a4412j8771M0419J6764m1117l0701k0300l6230P039J7417K9857N2952L1002
4917C3919M3763o0659l9406j7865k2704K3327J0190l7957K4829L9103j9117J6633
$$ plain form
4905 -5944 3929 30 -56672 -57750 -55588 -69092 -68668 -44252 -14836 8099 -13142 -20584 -24752 10
4891 10 19583 37372 45014 21568 -16543 -6039 10341 305 10235 -41624 -61446 -25234 -22350
4878 -22350 -35962 -63500 -50691 -33818 -44307 -38017 -60175 -56419 -63246 -15908 11592 18539 11725
4865 11725 535 -37231 -26454 -54391 1179 17754 12297 -4846 -34407 -49411 -49927 -53128 -42819
4852 -42819 -33546 -38592 -45676 -46022 -84432 -73707 -48699 -5060 24232 18457 32723 30338 29346 71054
4838 71054 33981 -43436 -33397 -20420 1148 17289 8352 36803 49847 33268 33290 71048 92096
4825 92096 94592 46137 14386 -6617 -4331 -15801 3644 -23689 -41544 -21315 3174 -32051
4813 -32051 -44203 -24341 -21036 -22945 -34739 14554 27245 15188 -8704 -4353 -10046 -36736 -44057
$$ packed form
4905e944R873l899n6702j078K162j3504M24K4416K9416K2935k1241p442m168K4762
4891A0J9573J7789P642k3446l8111J0504J6380j0036R930n1859j9822L6212K884
4878b2350j3612k7538J2809J6873j0489O290k2158L756o827M7338K7500O947o814
4865A1725j1190l7766J0777k7937N5570J6575n457j7143k9561j5004n16l201J0309
4852d2819R273n046p084l46l8410J0725K5008M3639K9292n775J4266k385r92M1708
4838G1054l7073p7417J0039J2977K1568J6141q937K8451J3044j6579K2L7758K1048
4825I2096K496m8455l1751k1003K286j1470J9445k7333j7855K0229K4489l5225
4813c2051j2152J9862L305j909j1794M9293J2691j2057k3892M351n693k6690p321
$$ plain form
4800 -44057 -16400 -17874 -15233 1648 1838 -4369 -54601 -61106 -81052 -37829 10423 17068 7882
4787 7882 19176 43249 2779 -25477 -16114 5754 36061 20627 47392 54092 324 20316
4775 20316 -8155 -18983 -24617 -15475 27799 81409 79088 106483 127243 105908 80975 87653 84083
4762 84083 70866 38395 25491 43269 38974 35553 -6135 508 -2141 -20718 -15966 9713 36647
4749 36647 49056 15634 6989 -2337 8103 -1817 12494 46021 27715 59853 76589 44895
4737 44895 54884 70625 47583 6405 -22372 -19018 -29152 -19771 -17079 -41358 -40280 -41681 17487
4724 17487 21849 61892 71986 31688 -6868 -18933 -21078 -48315 -84341 -81249 -99261 -67952
4712 -67952 -48885 -23633 -38307 -66481 -76560 -44128 -28029 -37548 -24843 -33559 -7255 -16123
$$ packed form
4800d4057K7657j474K641J6881J90o207n0232o505j9946M3223M8252O645r186
4787G882J1294K4073m0470k8256R363K1868L0307j5434K6765O700n3768J9992
4775B0316k8471j0828n634R142M3274N3610k321K7395K0760k1335k4933O678l570
4762H4083j3217l2471j2904J7778m295l421m1688O643k649j8577M752K5679K6934
4749C6647J2409l3422q645r326J0440r920J4311L3527j8306L2138J6736l1694
4737D4895R989J5741k3042m1178k8777L354j0134R381K692k4279J078j401N9168
4724A7487M362M0043J0094m0298l8556j2065k145k7237l6026L092j8012L1309
4712f7952J9067K5252j4674k8174j0079L2432J6099r519J2705q716K6304q868
$$ plain form
4700 -16123 -72479 -64907 -12879 -25024 -22694 -14492 -22466 -44054 -41326 -64659 -129 42475 25290
4687 25290 7926 49621 86552 88657 79556 35032 42020 81481 91200 86276 64624 2123 -56571
4674 -56571 -68643 -66384 -68608 -20014 -4466 -35775 -27807 -27879 -19363 15659 15343 -12941 -11533 -25988
4660 -25988 -53769 -99811 -104017 -99095 -109460 -71653 -50922 -92591 -112691 -84683 -74561 -88811
4648 -88811 -46554 -3700 26208 43553 36837 24490 18511 10812 -39652 -77713 -68361 -46757 -17174
4635 -17174 -1571 -39011 -32993 -24644 -3717 -21844 -28379 -52631 -46941 -41483 -44843 -30815 7678
4622 7678 30806 17312 11703 5670 -15727 -19312 -72297 -114405 -101893 -47507 -80582 -90382 -58155
4609 -58155 -35182 -16924 22185 27589 -1271 -6712 -281 -7781 -55204 -69119 -71390 -87128 -59515
$$ packed form
4700a6123n6356P572N2028j2145K330Q202p974k1588K728k3333O4530M2604j7185
4687B5290j7364M1695L6931K105r101m4524O988L9461R719m924k1652o2501n8694
4674e6571j2072K259k224M8594J5548l1309P968p2Q516L5022l16k8284J408j4455
4660b5988k7781m6042m206M922j0365L7807K0731m1669k0100K8008J0122j4250
4648h8811M2257M2854K9908J7345o716j2347n979p699n0464l8061R352K1604K9583
4635a7174J5603l7440O018Q349K0927j8127o535k4252N690N458l360J4028L8493
4622G678K3128j3494n609o033k1397l585n2985m2108J2512N4386l3075r800L2227
4609e8155K2973J8258L9109N404k8860n441O431p500m7423j3915k271j5738K7613
$$ plain form
4596 -59515 -17818 -7841 31232 26686 9638 11667 2199 -25238 -47643 -13738 40873 81295 68734
4583 68734 39579 44020 11136 13054 50347 30750 32932 53987 29219 41196 60537 42212
4571 42212 -12627 -23972 -901 29872 83620 94446 68091 40103 66959 94680 78716 47305
4559 47305 46008 33878 17493 15503 10938 22829 14862 15423 15142 8884 24010 81949 99061 53523
4545 53523 54812 12196 7703 292 -18509 -37082 -11654 -3451 15074 17189 1451 -21017 -11537
4532 -11537 31093 3717 -36111 -41558 -35183 -18817 -18548 -6017 -41345 -35516 25867 30401 -10936
4519 -10936 -28212 25831 25852 26288 19439 21437 12128 -23501 -26318 -33149 -42328 -57972 -92041 -109288
4505 -109288 -82707 -57312 -74620 -60632 -44845 -41456 -26795 -37581 -33403 7934 4895 11579
$$ packed form
4596e9515M1697R977L9073m546j7048K029r468k7437k2405L3905N4611M0422j2561
4583F8734k9155M441l2884J918L7293j9597K182K1055k4768J1977J9341j8325
4571D2212n4839j1345K3071L0773N3748J0826k6355k7988K6856K7721j5964l1411
4559D7305j297j2130j6385j990m565J1891p967N61k81o258J5126N7939J7112m5538
4545E3523J289m2616m493p411j8801j8573K5428Q203J8525K115j5738k2468R480
4532a1537M2630k7376l9828n447O375J6366K69J2531l5328N829O1383M534m1337
4519a0936j7276N4043K1M36o849J998r309l5629k817o831r179j5644l4069j7247
4505a09288K6581K5395j7308J3988J5787L389J4661j0786M178M1337l039O684
$$ plain form
4493 11579 18654 7703 14667 -19 6795 -5939 -3202 17843 15098 9249 -5860 9031 29018
4480 29018 9773 -28504 -14467 -13776 19772 -84 -32299 2463 -1768 36674 37206 -29543 -13566
4467 -13566 -13103 -37418 -67420 -53763 -31013 -39135 -25045 -20715 3911 31211 40473 56091 37461
4454 37461 55034 60960 56829 54188 78948 67037 50359 18551 11714 22675 36859 25974 7999
4441 7999 15486 7214 38415 59854 27156 13538 3537 11449 49147 59767 52335 22109 13159
4428 13159 20496 35940 39830 16180 9703 -38123 -41328 -11251 -25455 -38820 -20420 3879 -29727
$$ packed form
4493A1579P075j0951O964j4686O814j2734K737K1045k745n849j5109J4891J9987
4480B9018j9245l8277J4037O91L3548j9856l2215L4762m231L8442N32o6749J5977
4467a3566M63k4315l0002J3657K2750q122J4090M330K4626K7300R262J5618j8630
4454C7461J7573N926m131k641K4760j1911j6678l1808o837J0961J4184j0885j7975
4441G999P487q272L1201K1439l2698j3618j0001P912L7698J0620p432l0226q950
4428A3159P337J5444L890k3650o477m7826l205L0077j4204j3365J8400K4299l3606
$$ [...]
##END NTUPLES=NMR SPECTRUM
##END=
