##TITLE=Analysis number 327262
Compound Code cc 62823
Book Reference 518/91
Project Code adrs
Chemist Name colinb
##JCAMPDX= 6.0         $$ Bruker NMR JCAMP-DX V2.0
##DATA TYPE= NMR SPECTRUM
##DATA CLASS= NTUPLES
##ORIGIN= Bruker BioSpin GmbH
##OWNER= nmr
$$ XWIN-NMR		Version 3.5
$$ Fri Mar 16 14:24:44 2007 GMT Standard Time (UT+0h)  MAYBRIDGE\nmr@NMR_250MHZ
##.OBSERVE FREQUENCY= 250.131544655141
##.OBSERVE NUCLEUS= ^1H
##.ACQUISITION MODE= SIMULTANEOUS (DQD)
##.ACQUISITION SCHEME= undefined
##.AVERAGES= 16
##.DIGITISER RES= 18
##SPECTROMETER/DATA SYSTEM= dpx250
##.PULSE SEQUENCE= zg30
##.SOLVENT NAME= CDCl3
##.SHIFT REFERENCE= (INTERNAL, CDCl3, 0, 16.522)
##AUDIT TRAIL= $$ (NUMBER, WHEN, WHO, WHERE, WHAT)
$$ ##TITLE= Audit trail, XWIN-NMR		Version 3.5
$$ ##JCAMPDX= 5.01
$$ ##ORIGIN= Bruker BioSpin GmbH
$$ ##OWNER= nmr
$$ C:\u/data/dgb/nmr/ADRS/1120/pdata/1/auditp.txt
$$ ##AUDIT TRAIL=  $$ (NUMBER, WHEN, WHO, WHERE, WHAT)
(   1,<2007-03-16 14:24:20.96 +000>,<MAYBRIDGE\nmr>,<NMR_250MHZ>,
      <created by zg, POWCHK disabled, PULCHK disabled
       configuration hash MD5:
       49 4B E0 1D 92 C2 6B 37 9F E6 65 BC 52 41 86 1D
       data hash MD5: 64K
       C5 E0 33 1D BA A5 B2 A4 AF 0D CA D4 6A 40 26 86>)
(   2,<2007-03-16 14:24:34.72 +000>,<MAYBRIDGE\nmr>,<NMR_250MHZ>,
      <Start of raw data processing
       ef LB = 0.3 FT_mod = 6 PKNL = 1 SI = 32K 
       data hash MD5: 32K
       63 F6 16 21 54 BA 89 8F 23 D6 9B 36 4B 1F E3 A2>)
(   3,<2007-03-16 14:24:36.32 +000>,<MAYBRIDGE\nmr>,<NMR_250MHZ>,
      <apk 
       data hash MD5: 32K
       73 ED 65 5B F4 B5 93 AE C4 68 48 2B 00 51 75 A7>)
(   4,<2007-03-16 14:24:37.02 +000>,<MAYBRIDGE\nmr>,<NMR_250MHZ>,
      <abs ABSG = 5 
       data hash MD5: 32K
       32 CE 44 C3 0D 4D F0 61 8D 99 5B 91 7E 8B 66 78>)
$$ ##END=
$$ 
$$ hash MD5
$$ 90 21 62 D5 8B B0 A5 E3 56 93 19 08 6E 8B E7 E7
##$RELAX= 
##$RELAX= 
##$RELAX= 
##$RELAX= 
##$RELAX= 
##$RELAX= 
##$RELAX= 
$$ Bruker specific parameters
$$ --------------------------
##$DU= <C:\u>
##$EXPNO= 1120
##$NAME= <ADRS>
##$PROCNO= 1
##$TYPE= <nmr>
##$USER= <dgb>
##$AMP= (0..31)
100 100 100 100 100 100 100 100 100 100 100 100 100 100 100 100 100 100 
100 100 100 100 100 100 100 100 100 100 100 100 100 100 
##$AQSEQ= 0
##$AQ_mod= 3
##$AUNM= <au_zg>
##$AUTOPOS= <42 >
##$BF1= 250.13
##$BF2= 250.13
##$BF3= 250.13
##$BF4= 250.13
##$BF5= 500.13
##$BF6= 500.13
##$BF7= 500.13
##$BF8= 500.13
##$BYTORDA= 1
##$CFDGTYP= 0
##$CFRGTYP= 5
##$CHEMSTR= <none>
##$CNST= (0..31)
1 1 145 1 1 1 1 1 1 1 1 1 1 1 1 1 1 1 1 1 1 1 1 1 1 1 1 1 1 1 1 1 
##$CPDPRG= <>
##$CPDPRG1= <>
##$CPDPRG2= <>
##$CPDPRG3= <>
##$CPDPRG4= <mlev>
##$CPDPRG5= <mlev>
##$CPDPRG6= <mlev>
##$CPDPRG7= <mlev>
##$CPDPRG8= <mlev>
##$CPDPRGB= <>
##$CPDPRGT= <>
##$D= (0..31)
0 1 0 0 0 0 0 0 0 0.06 0 0 0 0 0 0 0.0002 0 0 0 0 0 0 0 0 0 0 0 0 0 0 
0 
##$DATE= 1174055059
##$DBL= (0..7)
120 120 120 120 120 120 120 120 
##$DBP= (0..7)
150 150 150 150 150 150 150 150 
##$DBP07= 0
##$DBPNAM0= <>
##$DBPNAM1= <>
$$ [...]
##$SUBNAM7= <"">
##$SUBNAM8= <"">
##$SUBNAM9= <"">
##$SW= 20.6930455092707
##$SWIBOX= (0..15)
0 0 3 0 0 0 0 0 0 0 0 0 0 0 0 0 
##$SW_h= 5175.983436853
##$TD= 65536
##$TD0= 1
##$TE= 683.16
##$TE2= 300
##$TE3= 300
##$TEG= 300
##$TL= (0..7)
0 120 120 120 120 120 120 120 
##$TP= (0..7)
150 150 150 150 150 150 150 150 
##$TP07= 0
##$TPNAME0= <>
##$TPNAME1= <>
##$TPNAME2= <>
##$TPNAME3= <>
##$TPNAME4= <>
##$TPNAME5= <>
##$TPNAME6= <>
##$TPNAME7= <>
##$TPOAL= (0..7)
0.5 0.5 0.5 0.5 0.5 0.5 0.5 0.5 
##$TPOFFS= (0..7)
0 0 0 0 0 0 0 0 
##$TUNHIN= 0
##$TUNHOUT= 0
##$TUNXOUT= 0
##$USERA1= <user>
##$USERA2= <user>
##$USERA3= <user>
##$USERA4= <user>
##$USERA5= <user>
##$V9= 5
##$VALIST= <valist>
##$VCLIST= <CCCCCCCCCCCCCCC>
##$VD= 0
##$VDLIST= <DDDDDDDDDDDDDDD>
##$VPLIST= <PPPPPPPPPPPPPPP>
##$VTLIST= <TTTTTTTTTTTTTTT>
##$WBST= 1024
##$WBSW= 4
##$XGAIN= (0..3)
0 0 0 0 
##$XL= 0
##$YL= 0
##$YMAX_a= 190506
##$YMIN_a= -244730
##$ZGOPTNS= <>
##$ZL1= 120
##$ZL2= 120
##$ZL3= 120
##$ZL4= 120
##$ABSF1= 16.522
##$ABSF2= -4.171173
##$ABSG= 5
##$ABSL= 3
##$ALPHA= 0
##$AQORDER= 0
##$ASSFAC= 0
##$ASSFACI= 0
##$ASSFACX= 0
##$ASSWID= 0
##$AUNMP= <proc_1d>
##$AZFE= 0.1
##$AZFW= 0.1
##$BCFW= 0
##$BC_mod= 0
##$BYTORDP= 0
##$COROFFS= 0
##$CY= 12.5
##$DATMOD= 1
##$DC= 0
##$DFILT= <>
##$DTYPP= 0
##$F1P= 14.0000005364418
##$F2P= -0.99999901652339
##$FCOR= 0.5
##$FTSIZE= 32768
##$FT_mod= 6
##$GAMMA= 0
##$GB= 0
##$INTBC= 1
##$INTSCL= 1
##$ISEN= 128
##$LB= 0.3
##$LEV0= 0
##$LPBIN= 0
##$MAXI= 10000
##$MC2= 0
##$MEAN= 0
##$ME_mod= 0
##$MI= 0
##$NCOEF= 0
##$NC_proc= -5
##$NLEV= 6
##$NOISF1= 0
##$NOISF2= 0
##$NSP= 0
##$NTH_PI= 0
##$NZP= 0
##$OFFSET= 16.522
##$PC= 1
##$PHC0= 234.345
##$PHC1= 8.271668
##$PH_mod= 1
##$PKNL= yes
##$PPARMOD= 0
##$PSCAL= 4
##$PSIGN= 0
##$REVERSE= no
##$SF= 250.13
##$SI= 32768
##$SIGF1= 0
##$SIGF2= 0
##$SINO= 400
##$SIOLD= 32768
##$SREGLST= <1H.CDCl3>
##$SSB= 0
##$STSI= 32768
##$STSR= 0
##$SW_p= 5175.98343685301
##$SYMM= 0
##$S_DEV= 0
##$TDeff= 65536
##$TDoff= 0
##$TI= <Analysis number 999999
Compound Code 99
Book Reference 9
Project Code 9>
##$TILT= no
##$TM1= 0
##$TM2= 0
##$TOPLEV= 0
##$USERP1= <user>
##$USERP2= <user>
##$USERP3= <user>
##$USERP4= <user>
##$USERP5= <user>
##$WDW= 1
##$XDIM= 32768
##$YMAX_p= 463907420
##$YMIN_p= -575723
$$ End of Bruker specific parameters
$$ ---------------------------------
##NTUPLES= NMR SPECTRUM
##VAR_NAME=  FREQUENCY,     SPECTRUM/REAL,   SPECTRUM/IMAG
##SYMBOL=    X,             R,               I
##VAR_TYPE=  INDEPENDENT,   DEPENDENT,       DEPENDENT
##VAR_FORM=  AFFN,          ASDF,            ASDF
##VAR_DIM=   32768,         32768,           32768
##UNITS=     HZ,            ARBITRARY UNITS, ARBITRARY UNITS
##FACTOR=    0.157963299565203, 1,           1
##FIRST=     4132.6476996994, 0,             0
##LAST=      -1043.33573715361, 0,           0
##MIN=       -1043.33573715361, -575723,     0
##MAX=       4132.6476996994, 463907420,     0
$$ Real data points
##PAGE= N=1
##DATA TABLE= (X++(R..R)), XYDATA
$$ [...]
23399b2590o8401o362K66918N4359o6452o727l8052k003j41967j32566J3870J3376
23387a36597n4853Q9128o9651o0018K7668J58957J01518K9810J08475j62893k04246
23376a72702L9503n9751l703N4635J68542J03884O4348J17857o1156O2643J00345
23365D14445j86287j27903o7555M176j7639q6935o9528o9754N9034J12472J8543
23354a6931R9692m8021j86499k6336L1823O1918J47696l7456m9783l3072j2955
23343f9924J97685K48231r1173M1797j03530q9414p5658j03862J3673k263N6931
23332B2493J3607n3937k2229L772P3508Q4920R9709m6939j9123J20044L425J36300
23320D15550O2079j72719j18280k56372K757J52677p8190J8621k7617r3598o3250
$$ plain form
23399 -22590 -90991 -97353 169565 223924 157472 150745 112693 110690 -31277 -163843 -149973 -136597
23387 -136597 -191450 -102322 -171973 -231991 -204323 -45366 56152 85962 194437 31544 -172702
23376 -172702 -133199 -192950 -196653 -142018 26524 130408 194756 312613 251457 314100 414445
23365 414445 228158 100255 32700 36876 19237 -67698 -137226 -206980 -147946 -35474 -16931
23354 -16931 82761 34740 -151759 -178095 -146272 -84354 63342 25886 -23897 -56969 -69924
23343 -69924 127761 375992 284819 326616 223086 133672 58014 -45848 -32175 -34438 22493
23332 22493 36100 -17837 -40066 -36294 37214 122134 221843 174904 155781 275825 279250 415550
23320 415550 477629 304910 186630 -69742 -66985 85692 7502 26123 -1494 -95092 -158342
23309a58342N6913K3382R8274O628n6959o2014J97819J31888J41209n330j23169
23298B50299k15069q4083J81682O8588j06626n2174J3849m862K3217j4894m8056
23287A1871q540J32283J28148M6924r3259j69284M640P9132M3158n1947l1725
23276I1401L8943N6948J17045p4332k24579K2816P9791p675m0046j04004j05512
23265a49204K4731R7848J31078Q8232J16828J29269l2968j06971O8861k84178
23255H3526k64541J69725K3846K6525o1953J2300j15357L4466o4192j60854k8897
23244c45406K8012R0325J05377J05616J09585L1386o8118p789J87487J02066j19857
23233B18684k10012j33118O6564P0688L6438j4362j45985n2304N6053J60158N6987
$$ plain form
23309 -158342 -101429 -78047 20227 26855 -30104 -92118 105701 237589 378798 373468 250299
23298 250299 35230 -48853 132829 201417 94791 42617 56466 51604 74821 59927 11871
23287 11871 3331 135614 263762 310686 217427 48143 52783 131915 175073 123126 91401
23276 91401 130344 187292 304337 230005 5426 28242 108033 100358 60312 -43692 -149204
23265 -149204 -124473 -26625 104453 192685 309513 438782 405814 298843 367704 83526
23255 83526 -181015 -11290 12556 39081 -22872 -10572 -125929 -91463 -155655 -316509 -345406
23244 -345406 -317394 -227069 -121692 -16076 93509 124895 56777 48988 236475 338541 218684
23233 218684 8672 -124446 -57882 12806 49244 34882 -111103 -163407 -107354 52804 109791
23222A09791K337n9781j03522J61587n3684k9438m8708J40001J08881j4124j41030
23211G2310o4789Q3959R5301L9321N4322j27931L7887k3681K7051J02261j75929
23200A20082k67160o5300J08115O8724L9465m8345p8880m3029o9804J63770R4488
23189B2126j0616m1989K9323n752J45858J06443J27639p4399J2537l15499L0460
23178B6131R1748N9622k2373l658n5410l647M5486J43408j15174k58888l878J25846
23166B9213k192J35910p0688N500J31844J645r9165j54508r2008K03572R8466
23155A87589j3154M4050k00442j95932O3075J5832p4514J44053Q3606M226r3603
23144c5214j17176m8620n5022J60933N7496J302J27303n471r1710m9304K946j61069
$$ plain form
23222 109791 112128 52347 -51175 110412 56728 27290 -21418 118583 227464 213340 72310
23211 72310 7521 91480 186781 226102 280424 152493 190380 166699 193750 296011 120082
23200 120082 -147078 -212378 -104263 -35539 3926 -44419 -123299 -166328 -236132 -72362 22126
23189 22126 11510 -30479 -1156 -6908 138950 245393 373032 298633 311170 -4329 26131
23178 26131 117879 177501 155128 151470 96060 92413 137899 281307 166133 -92755 -96633 29213
23166 29213 27021 162931 92243 97743 229587 231232 132067 -22441 -114449 89123 187589
23155 187589 174435 218485 18043 -177889 -114814 -98982 -173496 -29443 54163 58389 -35214
23144 -35214 -152390 -201010 -256032 -95099 -37603 -36301 91002 85531 -6179 -55483 -52537 -213606
23132b13606o4220N8762J65848J45159j2243n8996j16535O7497J40746J09175
23122B21587r1619o1723o0023l9320j06162K03722J36834j88611o3598N8292j11629
23111a02250j36611J10450N9980J54908Q5797j11419q6319r7201j42081J78294
23101h6452R6459l2576N980j1816q3895j9315m4135p3788J12823J49247R863K4185
23089D6580L1835R563r7242j94283P9781O5236l5110O0299N2794J29775k9702
23078A19526p5943M7183K5797j56733k19926Q3473J48368J57534P888J00705j28936
23067A08936j4719J97047k6247m4091M8958R4059l5558j34769R8579K2514k8407
23056B86302l8651M970J27467j25466k49422J8348J586l6237K32100n8400j68929
$$ plain form
23132 -213606 -277826 -219064 -53216 91943 79700 20704 -95831 -28334 112412 221587
23122 221587 129968 68245 8222 -31098 -137260 66462 203296 14685 -48913 9379 -102250
23111 -102250 -238861 -128411 -68431 86477 172274 60855 -25464 -122665 -264746 -86452
23101 -86452 10007 -22569 -16589 -28405 -112300 -131615 -175750 -249538 -136715 12532 22395 46580
23089 46580 78415 87978 -9264 -203547 -123766 -58530 -93640 -33341 19453 149228 119526
23078 119526 43583 90766 116563 -40170 -260096 -176623 -28255 129279 137167 237872 108936
23067 108936 94217 291264 265017 220926 269884 363943 328385 193616 292195 314709 286302
23056 286302 247651 252621 380088 254622 5200 23548 25134 -11103 220997 162597 -6332
23045f332j15380R0149J15147n0071J58857m2112j06822m3987L1737j21885k29746
23034c20445J26211J70524j4415J18900j11588r985j8045k5071O6668m1827O5722
23023F649P2496m94k52188j91370p6393R5800q6265j25542K48093K15426j12683
23012b06471M4943j2558p678K07031K3221K8953J9088M878j46471k2098j66933
23001b34095o2637J97873R9689N9179l9823j14777O6276k0346j14927M0687J23732
22990H31M6181L6157j8814m59Q6546j1997l9759j85308p857k4042r2503o0307
22978b71331R4118p6879j36725J57561P2823j4068P7916l8057j04684J02724J14585
22967b2017p3572r7645j05183O9522j1338j5998J22213K2209N7228N5010J65149
$$ plain form
23045 -6332 -121712 -31563 83584 33513 192370 150258 43436 -551 31186 -90699 -320445
23034 -320445 -194234 -23710 -38125 80775 -30813 -40798 -58843 -83914 -17246 -59073 6649
23023 6649 79145 78651 -173537 -364907 -441300 -345500 -431765 -557307 -309214 -93788 -206471
23012 -206471 -161528 -174086 -181764 25267 48488 77441 96529 101407 -45064 -67162 -234095
23001 -234095 -296732 -98859 830 60009 20186 -94591 -28315 -48661 -163588 -122901 831
22990 831 47012 83169 64355 63896 150442 138445 98686 -86622 -94479 -118521 -211024 -271331
22978 -271331 -177213 -254092 -390817 -233256 -160433 -174501 -96585 -134642 -239326 -136602 -22017
22967 -22017 -95589 -193234 -298417 -228895 -240233 -256231 -134018 -111809 -54581 429 165578
22956A65578j1000n9547J5189K55733K8381j09011J9889o5775j10202j0535J9979
22945A38679J68129M3593J3578R315q3803j54655j34846j42681K5863L8227q6713
22934a65314K6133J27382K6761J9061j51435L9236k7037M1255N181L3209M8505
22923B2937r6427q951J0198p8309J61715J78372j3704O3728m0317j15581r1093
22912g432k83438O7186J25285O0834j7036n1847l9969P5523P8020M1879p8839
22901b9834r8300j12837K3128q0950K1856p745j70325n6150q681J44202J92546
22890a83090J87334J53184j97408n0499O3412p8234q7895L098l6337P6716L71
22879a49348J6991Q329J00103q093j56385j91342J61021K39576j67688k53564
$$ plain form
22956 165578 154578 95031 110220 365953 394334 285323 305212 239437 129235 118700 138679
22945 138679 306808 350401 363979 373294 289491 134836 -10 -142691 -116828 -78601 -165314
22934 -165314 -139181 -11799 14962 34023 -117412 -78176 -105213 -63958 -58777 -25568 22937
22923 22937 -73490 -82441 -72243 -150552 11163 189535 175831 239559 199242 83661 -7432
22912 -7432 -290870 -223684 -98399 -37565 -54601 -106448 -146417 -70894 7126 49005 -29834
22901 -29834 -128134 -240971 -217843 -298793 -276937 -284682 -455007 -511157 -519838 -375636 -183090
22890 -183090 4244 157428 -39980 -90479 -27067 -105301 -193196 -190098 -226435 -149719 -149348
22879 -149348 -132357 -124028 -23925 -32018 -188403 -379745 -218724 20852 -146836 -400400
22869d00400j8990M2136J5124K61786J11696J7748J31R4854m9789r3265J19763
22858A00794J6697J9319J64661K8360j05335r8317K3344P696L2007q98P488j0243
22846A85573j5787j17316k10970j20599K6308Q2367P5319O081R3120L205l1658
22835b4357J6476K3188j54341L6573K06368O9216j19717n7148j8969j96797j43870
22824c63378L4404N7179N8026J43794o6571l4640Q2059j8678K2399j50600R1016
22813a44990J63538o5320l4999J35179j43017o0482J26569P3053o3321J07695
22803I3905o2015J15O3637P3069m4751m0888n6607k17338j952J83791J13160J35689
22791B39815O4905j64910p1807n7075k3908j05874J00613K9801J5343n1101n37
$$ plain form
22869 -400400 -419390 -377254 -362130 -100344 11352 29100 29231 124085 74296 -18969 100794
22858 100794 117491 136810 301471 329831 224496 126179 149523 157219 189226 188328 195816 185573
22846 185573 169786 52470 -158500 -279099 -252791 -170424 -95105 -89024 4096 7301 -24357
22835 -24357 -7881 15307 -139034 -102461 103907 173123 53406 -3742 -22711 -219508 -363378
22824 -363378 -328974 -271795 -213769 -69975 -136546 -171186 -89127 -107805 -85406 -236006 -144990
22813 -144990 18548 -46772 -81771 53408 -89609 -150091 -23522 49531 -13790 93905
22803 93905 31890 32005 95642 168711 123960 83072 26465 -190873 -192825 -9034 104126 239815
22791 239815 304720 139810 68003 10928 -12980 -118854 -18241 11560 26903 -24198 -24735
22780b4735J16345N714j25230p7862J11022L5189J4020P2068m8145k16649j60608
22769b98871n9106R8363l7007o4566L1409L1050J5170L8546j5464J31095l804
22758a33185K9797K9534R1285Q86L6834Q350n4560l9823O162j84582k4789m5933
22746b80024J33496R7242J23888J62768J28264n5721m6367R4267j58626k72334
22736g3147j2199m1266R3734K37821J2864l1570k2237k2146r4045r5047J32444
22725H5206q2039M4822j1886l4789K1722M5216O2369K6554j15272n5381L9311
22714B5833m0583L6917Q6336j4404j95446n1355J03418J97901J5368K3173j16138
22703G1020p8395J44326J1626o7065k2251M2100M5198M2366q1782P2580J97j73706
$$ plain form
22780 -24735 91610 97324 -27906 -105768 5254 40443 54463 126531 78386 -138263 -298871
22769 -298871 -357977 -259614 -296621 -361187 -329778 -298728 -283558 -245012 -260476 -129381 -133185
22758 -133185 -103388 -73854 17431 18317 55151 63501 8941 -30882 -24720 -209302 -234091 -280024
22746 -280024 -146528 -49286 74602 237370 365634 309913 263546 357813 199187 -73147
22736 -73147 -85346 -126612 -32878 204943 217807 186237 164000 141854 47809 -47238 85206
22725 85206 3167 47989 36103 1314 23036 68252 130621 157175 41903 -13478 25833
22714 25833 -14750 22167 108503 94099 -101347 -152702 -49284 148617 163985 187158 71020
22703 71020 -7375 136951 148577 81512 59261 101361 146559 188925 107143 179723 179920 6214
22691F214j44713M1929O3410P4516J32462r3275k49692k8386J52248J94630L4782
22680A84125r4613m0155k4045O7998K48956N9405j36970k93916o3526p4178J33622
22669c3297J86335k0814o5041n1272J20115N0910p5568k2966J62573M4336m0954
22658B54357l3269j32369N0705n843P8468N3765l7823j13009j47564L2128L2806
22647C2352j71296j18319O925J62171K31620M5j1741j997k05309k5176m476P8131
22635b7070p0528j367Q892p301L1557P8671j85818j13532N1077J82562M3118m953
22623a4692J0294k3552j13798j01808J12393J46117O028J18403L1040Q705j09236
22612F9894q80j44520M8061m4073N8537L9214J35424r7793n5175J95505j94042
$$ plain form
22691 6214 -138499 -96570 -33160 41356 173818 80543 -169149 -197535 -45287 149343 184125
22680 184125 89512 49357 25312 93310 342266 401671 264701 -29215 -92741 -166919 -33297
22669 -33297 153038 132224 67183 15911 136026 186936 111368 88402 250975 295311 254357
22658 254357 221088 88719 139424 133581 212049 265814 227991 114982 -32582 -454 32352
22647 32352 -138944 -257263 -250338 -88167 143453 143498 131757 129760 -75549 -100725 -105201 -27070
22635 -27070 -97598 -98965 -90073 -97374 -65817 12854 -172964 -286496 -235419 -52857 -9739 -14692
22623 -14692 -4398 -27950 -141748 -243556 -131163 14954 20982 139385 170425 179130 69894
22612 69894 69014 -75506 -27445 -71518 -12981 26233 161657 63864 8689 204194 10152
22601A0152q1556p8520R6074l5484n9997K016k25662p9045J78126J64303j6076
22590a25669M3264J7864K17420M4940p2361j03592j5441K3260K7085n1760r9834
22579i4824j27833L7667J30163J20611L8790M7368m1941j08884m6037K8798J12017
22568I5895J81771r3308j42312L3231L8612p8177m5215J02913j3949j5847J54296
22557B17910m462k35396r5013L1397N1468J31782j30452k7770M7567o1326m819
22546g9114N7667R3832j7160O698R8077l5294j43292j52736r3239J18591J69953
22535B3983J15507M899m4145k05671k6183N3563K5165J01443Q120L9919O5766
22524A62366k7420o6979r7475J32295P2984j04001j3135J2116J69687j35954j63411
$$ plain form
22601 10152 -71404 -149924 -53850 -89334 -149331 -147315 -372977 -452022 -273896 -109593 -125669
22590 -125669 -82405 -64541 152879 197819 125458 21866 6425 29685 56770 5010 -94824
22579 -94824 -222657 -184990 -54827 65784 104574 151942 110001 1117 -44920 -16122 95895
22568 95895 277666 184358 42046 75277 113889 35712 -9503 93410 79461 63614 217910
22557 217910 213448 -21948 -116961 -85564 -34096 97686 -32766 -60536 -12969 -74295 -79114
22546 -79114 -21447 72385 55225 61923 160000 124706 -18586 -171322 -264561 -145970 23983
22535 23983 139490 144389 100244 -105427 -131610 -78047 -52882 48561 56681 96600 162366
22524 162366 134946 67967 -29508 102787 175771 71770 58635 70751 240438 104484 -58927
22513e8927K8624j5025l6853N8205M7308K18268L6946o9491j64562j04001O151
22502e3357J04337j9500l94o7797k94284j25095Q4705K39946J06066o6758J03085
22491A0954o0389R7856P0031p3468j5191k95J01906J73262O919k67666k06575
22480a62656P4164N5524j3153R8433J06424K2375r6063n3524o9152M0719k778
22469C13L8944p741J77011N3354k02421m6215q8035N2238l6029L2431M761M0811
22457A9422L9155L7428k6290L956R704Q0222n5155r0369k813l5869j77824p9455
22445b77888Q3727J23865n428R603N3765j13925r284n9628j45045j32639L2475
22434d40402J56378J94271Q4871p7100j32050R9479J12627n1301m8500L4017J2812
$$ plain form
22513 -58927 -30303 -45328 -82181 -23976 23332 241600 278546 209055 44493 -59508 -53357
22502 -53357 50980 31480 31086 -36711 -330995 -456090 -371385 -131439 -25373 -92131 10954
22491 10954 -49435 48421 118452 44984 29793 29498 131404 304666 311585 43919 -162656
22480 -162656 -88492 -32968 -46121 52312 158736 181111 85048 31524 -37628 3091 313
22469 313 39257 31516 208527 261881 59460 13245 -74790 -22552 -58581 -26150 -21389 19422
22457 19422 58577 96005 69715 73671 83375 163597 108442 18073 15260 -20609 -198433 -277888
22445 -277888 -194161 -70296 -75724 -66121 -12356 -126281 -135565 -195193 -340238 -472877 -440402
22434 -440402 -284024 -89753 -4882 -81982 -214032 -114553 -1926 -53227 -101727 -67710 -54898
22423e4898j25989J74585O990k5273K60737J54771j97051R708l257L4410m8773
22412A85960n8766O470j73507K1566p2319L0827L5117k0930N4387m7251J42118
22401A03672k2245R6925p863r4697j91253M3755k1575j2497J7667l2801K38P7159
22389d3515J15208L8647J64587J8541l5627J5581m1971L683J1946j70690j95574
22378a19184m3010j31221K890O6821j34701J57693J28478J60827J98171j10939
22368A75825n8652k760p3387j42574j10895O0291J13100L3656j40815l7230O1441
22357a22000O4471l1313j03041J05653Q9471j05373P202J03410j46013L4329k5978
22346a29182K7873m755Q8441K3457r592M7445L375K8456l8086Q9239N6816L6386
$$ plain form
22423 -54898 -180887 -6302 688 -24585 236152 390923 193872 203580 200323 234733 185960
22412 185960 127194 133664 -39843 -18277 -90596 -59769 -24652 -45582 8805 -38446 103672
22401 103672 81427 178352 170489 75792 -115461 -71706 -93281 -105778 -88111 -120912 -120674 -43515
22389 -43515 71693 110340 274927 293468 257841 273422 231451 235134 247080 76390 -119184
22378 -119184 -162194 -293415 -290525 -223704 -358405 -200712 -72234 88593 286764 175825
22368 175825 117173 114413 41026 -101548 -212443 -152152 -39052 -5396 -146211 -183441 -122000
22357 -122000 -57529 -88842 -191883 -86230 3241 -102132 -94930 8480 -137533 -103204 -129182
22346 -129182 -101309 -106064 -17623 5834 -3758 43687 47062 75518 37432 126671 183487 219873
22334B19873m6845k9755Q76J7972n8832j17346k7786J1768l260q8888N331j18636
22322b35528j61265j5089J22185J48869p6350J2218K17836K8173j61105m0624
22312a60680m7674R1416J23483Q3622J19819j46189n5031M3292j09734j43396
22302b01072n5487L1487m0494J9042J26816R5535N3408k8433l4657j23649l7461
22291a94965M0646j64329L9207J65046L1154N611p306n2014Q4983j25566k4929
22280b02462J2564p6198M0990k7250M3261J48702j6786j0627M6150J02974k6026
22269C5292j49193l2292J10855J57866k00069j03811J64056Q4931J4760j07782
22259b5387j03946O2266J32340m5667l2905J59202L1971j82821j84133q4730J65603
$$ plain form
22334 219873 173028 143273 144149 162121 103289 -14057 -41843 -30075 -33335 -122223 -116892 -235528
22322 -235528 -396793 -411882 -289697 -140828 -217178 -204960 12876 41049 -120056 -160680
22312 -160680 -208354 -116938 6545 90167 209986 63797 8766 52058 -57676 -201072
22302 -201072 -256559 -225072 -265566 -246524 -119708 -24173 29235 802 -33855 -157504 -194965
22291 -194965 -154319 -318648 -279441 -114395 -83241 -77630 -84936 -136950 -51967 -177533 -202462
22280 -202462 -189898 -266096 -225106 -252356 -209095 -60393 -77179 -87806 -41656 61318 35292
22269 35292 -113901 -146193 -35338 122528 -77541 -181352 -17296 67635 82395 -25387
22259 -25387 -129333 -67067 65273 19606 -13299 145903 177874 -4947 -189080 -273810 -108207
22248a08207R550N7515L6043j35653p1313J27052L4911q6324P3081J89557m9560
22237G6652j49019p1927Q5094R2231R5311k7965O4213M067j00944q0394M7241
22226C4560K3748o0714j75837l1222M222q4570Q5947J31219Q6226q798N7514L7577
22214I9872p9090K0769J28368N4215p5824j18884J65173k8929j1382M1030q1346
22203A13972K3570J1701k0854j6169l5377k0166j07722N9017j20454j40063O9169
22192a83376J17813k3681M3213N6526Q3072K2522j45761R7900k0308k54479j62626
22181c69185L28559Q1011j36328k4656j8578Q7073m9590r8504N103l2938P8864
22170a49169n5884J56410O5698j46192j43610J20694L24032J08091j68445j07603
$$ plain form
22248 -108207 -98657 -41142 -5099 -140752 -212065 -85013 -50102 -136426 -63345 126212 76652
22237 76652 -72367 -144294 -59200 33031 128342 100377 164590 168657 67713 -12681 34560
22226 34560 58308 -2406 -178243 -209465 -205243 -289813 -203866 -72647 13579 4781 62295 99872
22214 99872 20782 41551 169919 224134 148310 29426 194599 165670 154288 195318 113972
22203 113972 137542 149243 128389 112220 76843 56677 -51045 7972 -112482 -252545 -183376
22192 -183376 -65563 -89244 -46031 10495 93567 116089 -29672 68228 47920 -206559 -369185
22181 -369185 -40626 40385 -95943 -120599 -139177 -52104 -101694 -200198 -195095 -228033 -149169
22170 -149169 -205053 -48643 17055 -129137 -272747 -152053 171979 280070 111625 4022
22160D022N1358L0202n3336l464o1588P7703N1102k178l6435K1483K3459j06327
22148c999o1842N5587o450n202k1268P2048M7195N6862m5467M5570O7398o2737
22136A37695P5285M4402j59848j6123J05473k69543j58425o8452L2148J97981
22126g9407J54334J140J7008M864k19758r5859n0631J02286J29633J34416N4716
22115A52742j9197J9049o1552n1826K631k2064O0168j61574k70225J29679K56989
22104C4820O1725p7268j13648l4795P3536o0711O0844P117k2495J9525Q8676M607
22092D1933j4195K5696j22122r4144J29679N8646k16082n1680j46234k4034J04507
22081c08030J77024j41264P9130J92518J9161n1477O2566j4799L223N4593J7043
$$ plain form
22160 4022 55380 85582 32246 28782 -32806 44897 95999 93821 57386 78869 102328 -3999
22148 -3999 -65841 -10254 -16704 -21906 -43174 28874 76069 132931 87464 133034 200432 137695
22136 137695 212980 257382 97534 81411 186884 -82659 -241084 -309536 -277388 -79407
22126 -79407 74927 76067 93075 97939 -121819 -217678 -268309 -166023 -36390 98026 152742
22115 152742 133545 152594 91042 39216 41847 19783 79951 -81623 -351848 -222169 34820
22104 34820 96545 19277 -94371 -129166 -55630 -116341 -55497 -48380 -70875 -51350 37326 41933
22092 41933 27738 53434 -68688 -162832 -33153 25493 -190589 -242269 -388503 -412537 -308030
22081 -308030 -131006 -272270 -193140 -622 18539 -32938 29628 14829 18052 72645 89688
22070H9688q8704r9591m12J19783p1544j16966O6017j2730j09822r0776O8785
22059b46272o9652m6432K15839N4695o7424r3700O4553N696r1316K3901J20604
22048a29508K9010j00030l555o1066k27295K4812R7338J05566J3302o0603R7106
22037b14923K00258N5681J22916J3631q1286q7449j56707N4998N936j8240n7915
22026a63100k3538J8153J77565o4738k26928J61987J88084o38j75592m5192J01011
22015e2926M745r925J21660J5644j31247n7726k20037N7356J31629K4132O859
22004a09836J14945J06750m1876K5787m8541j14692j15309O6424J59918J44045
21994A87615M7510k28380j28738L640m0527J02814K39625j25052l9113j0628q3195
$$ plain form
22070 89688 984 -98607 -99019 20764 -50780 -167746 -101729 -114459 -224281 -315057 -246272
22059 -246272 -315924 -362356 -146517 -91822 -159246 -252946 -188393 -182697 -274013 -250112 -129508
22048 -129508 -100498 -200528 -204083 -265149 -492444 -467632 -370294 -264728 -251426 -312029 -214923
22037 -214923 -14665 41016 163932 177563 96277 8828 -147879 -92881 -86945 -105185 -163100
22026 -163100 -186638 -168485 9080 -55658 -282586 -120599 67485 66847 -108745 -153937 -52926
22015 -52926 -48181 -58106 63554 79198 -52049 -109775 -329812 -272456 -140827 -116695 -109836
22004 -109836 5109 111859 69983 95770 47229 -67463 -182772 -116348 43570 187615
21994 187615 235125 6745 -121993 -118353 -158880 -56066 183559 58507 19394 8766 -74429
21983g4429R065r6183K7881J07720L9057J46055q848j2308J0948M9573K16383
21972D14914K3398j74002j77060l7239J58918Q0797p2653m3347n4415n6451J09054
21961A71914k15631p6587N7260j1791N7884R0597j44364J17660o1990m7630J230
21950f1448k8662j86155j5405K09236J36426q615p2104m1192R7023K8804n1868
21939F040P7862K48417R3104k57570j27603J11080K1657j59837J22207J56317
21929B91674J1956p0328j47620J4699J0847j12366k03126j211J74818J18267O8989
21918A56599P5431o8451J1180J17399n0906k40999n0990r5394j4278K970j4303
21907a71742J1654N661N7519q8649k4637R6451j4501J17584K01478K7313K6195
$$ plain form
21983 -74429 -65364 -161547 -133666 -25946 13111 159166 150318 138010 148958 198531 414914
21972 414914 438312 264310 87250 50011 208929 289726 217073 173726 119311 62860 171914
21961 171914 -43717 -120304 -63044 -74835 -16951 73646 -70718 46942 -15048 -62678 -61448
21950 -61448 -90110 -276265 -291670 -82434 53992 45377 -26727 -67919 29104 57908 6040
21939 6040 83902 332319 425423 167853 40250 151330 172987 13150 135357 291674
21929 291674 303630 233302 85682 100381 111228 -1138 -204264 -205475 -30657 87610 156599
21918 156599 232030 163579 174759 292158 241252 253 -50737 -146131 -160409 -157439 -171742
21907 -171742 -160088 -154427 -96908 -185557 -210194 -113743 -128244 -10660 190818 218131 244326
21896B44326r7260q3607l0228L4711K39309Q4563k7317k24981j53991j06653J67233
21885D6105J62965k51829j62577L0341O5993K6832M8307r6904k4878J4938M5079
21874i5628P3275K3108j4030j0988O7876K6313R4419L6354l7707j08418r748p0408
21862b5582l8286J9810K53298R1831k32431j09005q3336L2022L1183J15229J51049
21851B05782p7627m0965Q8706l4710q1560P8101R3714j66122j42031N2597J1320
21840a2795j33589Q9722K4705l2728M1483j20032r7271m1519K25233K22370Q3849
21829B49428N2149m5268k22386m3733m6657n8837Q0032J55993j23256j41887J61334
21818A6912R3583K6670l8785J73531n6435j92037m7045o8265j37515j28572P1038
$$ plain form
21896 244326 147066 63459 33231 67942 307251 391814 364497 139516 -14475 -121128 46105
21885 46105 209070 -42759 -205336 -174995 -109002 -82170 -33863 -130767 -155645 -140707 -95628
21874 -95628 -22353 755 -13275 -24263 43613 69926 164345 200699 162992 54574 44826 -25582
21862 -25582 -63868 -44058 209240 301071 68640 -40365 -123701 -91679 -60496 54733 205782
21851 205782 128155 87190 175896 141186 59626 137727 231441 65319 -76712 -24115 -12795
21840 -12795 -146384 -56662 -31957 -64685 -23202 -143234 -240505 -282024 -56791 165579 249428
21829 249428 301577 256309 33923 -9810 -56467 -115304 -35272 120721 -2535 -144422 16912
21818 16912 110495 137165 98380 271911 215476 23439 -23606 -91871 -229386 -357958 -286920
21807b86920J96436P8231q8285n0583q8419Q5157J34850l3711l3351K2169n1076
21796a15502n6896p4316l450l9580n2882L7100l7025O7642J65046J60926J8768
21785F9831m299p7804o9892J39808R9693o5262k6619J7223L2369n7838n3636q5581
21773h2007l7365q13k15761n2547J58824J60088J0497J9450L4212J42899q7824
21762D9653m5012J24770k21874j12920j20178M4100O4493M0443K6754J86561P6477
21751A13267O1321L1581j83088m4613j6556K6062k055j61924j65013J57844J96663
21740A3489J36151r4590j38711O2596J79615R05j45398m3134m5750J22313n4930
21729g444p9950R9265J49109J23069O858j44362k66127j52340R8439K9142J30537
$$ plain form
21807 -286920 -90484 -12253 -100538 -151121 -239540 -154383 -19533 -53244 -86595 -64426 -115502
21796 -115502 -172398 -246714 -250164 -289744 -342626 -305526 -342551 -274909 -109863 51063 69831
21785 69831 65532 -12272 -82164 57644 157337 92075 65456 82679 115048 57210 3574 -82007
21773 -82007 -119372 -120185 -335946 -388493 -229669 -69581 -59084 -39634 -5422 137477 49653
21762 49653 4641 129411 -92463 -205383 -325561 -281461 -216968 -176525 -149771 36790 113267
21751 113267 174588 206169 23081 -21532 -38088 -12026 -14081 -176005 -341018 -183174 13489
21740 13489 149640 55050 -83661 -21065 158550 159455 14057 -29077 -74827 47486 -7444
21729 -7444 -87394 11871 160980 284049 290907 146545 -119582 -271922 -173483 -144341 -13804
21718a3804j23270J01146o8243j49232J04670L9285P9868J20175o9577M6165j23585
21707e6402k15131J18841O1278j09593P8188K76102J16557o0137q4009L3965M2550
21696B02209R3016j05833M3706q0984J7279j52397j04869q0271j22867J76847
21686a14164L2149j88966j78514R0130J91212J41150O7655J64557o8906k19425
21676h3122k5492j32979k2201J58315J22038m1459O1426J5718J21566J46907k7447
21665B93270j65737o5567J5264n6361n445p7921n010l7317k0263Q8805R9052j7430
21653D5340M6411J0010j89860p8566J85940J32425Q2951O8203k13304j43980j54873
21642b09303O4494K12182o2252q1056R1847r8350j62377P0272K15764M7404j60503
$$ plain form
21718 -13804 -137074 -35928 -104171 -253403 -148733 -109448 -29580 90595 21018 67183 -56402
21707 -56402 -271533 -152692 -91414 -201007 -122819 153283 269840 209703 125694 159659 202209
21696 202209 295225 189392 233098 152114 169393 16996 -87873 -168144 -291011 -114164
21686 -114164 -82015 -270981 -449495 -359365 -168153 -27003 40652 205209 136303 -83122
21676 -83122 -108614 -241593 -263794 -105479 16559 -24900 36526 52244 173810 320717 293270
21665 293270 127533 61966 77230 20869 15424 -62497 -67507 -104824 -125087 -36282 62770 45340
21653 45340 91751 101761 -88099 -166665 19275 151700 234651 302854 89550 -54430 -209303
21642 -209303 -144809 67373 5121 -75935 15912 -82438 -244815 -174543 41221 88625 -71878
21631g1878m0815m1533l9590J10349j45569r5238J84590N4113J26078J5026K7533
21620H3066O8725o7366j21307J7480P7364m9372q6320J93641j7135m5085l4770
21609A8921J10563Q2498j47119j70606k381J48906q174l1565J26962J06857L748
21598B38610m9798N4875P4243o2669j90364p8204M5669K04499j8518q1549r5518
21587D1276k2380q236j1941p9213j29306J8482n4714q439K57263O9125m9333j41020
21575a18436J21610P3299N5260n8413j49966M3091R550q5946l6197j06882J36735
21564a16295J4573n2445n6294J81723J26290r7831p9547L334P157L2196J11166
21553G4027J0517l2732P3111J5104j36631j47773P0044J35133j95200j19344k4380
$$ plain form
21631 -71878 -112693 -154226 -193816 -83467 -229036 -324274 -139684 -85571 40507 55533 83066
21620 83066 151791 84425 -36882 -19402 57962 8590 -77730 115911 98776 53691 18921
21609 18921 129484 211982 64863 -105743 -108124 40782 32608 1043 128005 234862 238610
21598 238610 188812 243687 317930 255261 64897 -13307 32362 236861 218343 136794 41276
21587 41276 18896 10660 -1281 -80494 -209800 -191318 -246032 -254471 2792 71917 22584 -118436
21575 -118436 3174 76473 131733 73320 -76646 -33555 -24005 -109951 -146148 -253030 -116295
21564 -116295 -101722 -154167 -210461 -28738 97552 -279 -79826 -76492 -69335 -37139 74027
21553 74027 84544 51812 124923 140027 3396 -144377 -74333 60800 -134400 -253744 -278124
21542b78124l2361J01622J7919J03325Q6115j03872o0255J49181J66548o9668
21532H0430l67807p8485K9874j4204J05994J51894R048Q0852n8406J33243n9368
21521A3065J2533P3028J1272q7211k5431J10788p4144n8202m3004R7785O6934
21510I7413O8126Q4278N0273n1278j82728P43J4421J60584M0615j57632r865n3552
21498F1398j87815p570K58308j17950n0738R6404j40083O4065L38716P604j28912
21487A93427j09645j68756j29610l3662L2047K38848N0205k9930j65534L4283
21477h8327k5467J6694N551M731m9293J2662L9038J2371m1025J11387j4305j2968
21465b8951j48207j50151J12238m2112l470K42356K41703k7345k10174j18947
$$ plain form
21542 -278124 -310485 -208863 -190944 -87619 -1504 -105376 -165631 -16450 150098 80430
21532 80430 -287377 -365862 -335988 -350192 -244198 -92304 -83256 -2404 -60810 72433 13065
21521 13065 25598 98626 109898 22687 -2744 108044 33900 -24302 -67306 30479 97413
21510 97413 165539 249817 300090 248812 66084 66827 81248 241832 282447 124815 114950 61398
21498 61398 -126417 -133987 124321 6371 -44367 52037 -88046 -23981 314735 322339 193427
21487 193427 83782 -84974 -214584 -248246 -216199 22649 72854 42924 -122610 -88327
21477 -88327 -113794 -97100 -91549 -86818 -136111 -123449 -84411 -72040 -113065 -1678 -15983 -28951
21465 -28951 -177158 -327309 -215071 -257183 -260653 -18297 223406 196061 -14113 -133060
21455a33060l4510O8473L08488K23292o9855j83471k13892j36298Q2926J28383
21445D0476k23506n7574K0989p2763N2695J47218J48626n756Q4394L5077j47217
21434B2659k18361J7300J02649J5173n2337n906j66626K9058K16028j02712j15004
21423b58079O1373Q7650K9394l530n4052l6005L4160L3937r41j00631m5103K9324
21411b22503J35727P1398J78208P1444p648j44274j33702j3262N6002K5136L7699
21400E4225O027L3457J9276j22134k52567j4422K00790J64950k014J00349n6015
21389A31922k9567j8276o6316n3519p4743n7829P6792P3723j8648J88982P1577
21378B24098j03853p1134q9462l0098k7908L2196J69116J0742J764n7895j84557
$$ plain form
21455 -133060 -167570 -99097 209391 432683 362828 179357 -34535 -170833 -87907 40476
21445 40476 -183030 -240604 -219615 -292378 -239683 -92465 56161 50405 134799 169876 22659
21434 22659 -195702 -178402 -75753 -60580 -112917 -118823 -285449 -256391 -40363 -143075 -258079
21423 -258079 -196706 -109056 -79662 -83192 -137244 -173249 -139089 -105152 -106093 -206724 -251827 -222503
21411 -222503 -86776 -15378 162830 234274 226626 82352 -51350 -64612 -8610 16526 54225
21400 54225 60252 93709 112985 -9149 -261716 -276138 -75348 89602 87588 187937 131922
21389 131922 102355 84079 17763 -35756 -110499 -168328 -91536 -17813 -36461 152521 224098
21378 224098 120245 49111 -40351 -70449 -98357 -66161 102955 113697 115461 57566 -126991
21367a26991q5927j01338Q9334L1103N7369J40853J02834j40462J02273O4143
21357A33191k5277j6660Q0848k9282o0786L43j63544J37211q2606j21108J48703
21346A033J20249l7582p9251Q8508J93844j71445m5492O6909k9245o1930k425
21335D3173J9353o2705R0986k1737p4964J7317N0366p4132J3196j8914O6037l281
21323D4695r259p6739j38975o7409J96439p893p6231j04452k7437J24348J5980
21312a26933P0534R6934O4273J01583J03090j18015Q781J45006j22029j92062
21302C1162j38125j07337J80197q8660q6181J35195J72222N6279o2207R1155N0726
21291B34426M0773j77700j45266j88456l9652J5612p0703N3002K37121l5192J3322
$$ plain form
21367 -126991 -212918 -314256 -224922 -193819 -136450 4403 107237 -33225 69048 133191
21357 133191 107914 91254 172102 142820 82034 82377 -81167 56044 -26562 -147670 1033
21346 1033 121282 83700 4449 92957 286801 115356 69864 136773 107528 45598 43173
21335 43173 62526 -179 90807 69070 -5894 11423 61789 -12343 853 -18061 47976 44695
21323 44695 35436 -41303 -180278 -247687 -51248 -59141 -135372 -239824 -267261 -142913 -126933
21312 -126933 -56399 40535 104808 206391 309481 191466 200247 345253 223224 31162
21302 31162 -106963 -214300 -34103 -122763 -208944 -73749 98473 154752 92545 183700 234426
21291 234426 275199 97499 -47767 -236223 -275875 -260263 -330966 -277964 -40843 -76035 -62713
21280f2713J29228J52631l5437j19084r9443j09923L1649J46545J94576M7190
21270B75219j17663N992j12954m1549N6136N6817O5169P4087p2138j26449o7151
21259d484J51175J05825j765j08512J3468j40365j89163j38066j67793L3155Q5210
21248c61315K75649K93968Q4616M4117j10273j12682j433p1973K8925Q4874j63444
21237h971j31850j1410J85789K47931M0007j00803m9276k24133k12064J2150O0858
21226a91772N6339K21526R9150n1384J4727P3168q6740q4201m3535L1534p2864
21215c4052q3310L535N8654N2348j9852j4546N7923N4890j9316j64269j09408
21204b17403J54243N1583j12353N3523J65248k3543j9700M6224j55980l2333p4540
$$ plain form
21280 -62713 66515 219146 183709 64625 -34818 -144741 -113092 33453 228029 275219
21270 275219 157556 163548 50594 9045 65181 121998 187167 261254 189116 62667 -4484
21259 -4484 146691 252516 250751 142239 155707 15342 -173821 -311887 -479680 -446525 -361315
21248 -361315 -85666 208302 292918 337035 226762 114080 112647 40674 69599 154473 -8971
21237 -8971 -140821 -152231 33558 281489 321496 220693 171417 -52716 -264780 -252630 -191772
21226 -191772 -135433 86093 185243 133859 148586 221754 135014 50813 7278 38812 -34052
21215 -34052 -117362 -113827 -55173 -2825 -22677 -37223 20700 75590 56274 -107995 -217403
21204 -217403 -63160 -11577 -123930 -70407 94841 71298 51598 97822 -58158 -90491 -165031
21193a65031J0462J00227L5796J24313N3670m6509j029O7007J51009O6289j47655
21182B48549k89820P7655k440O9440o0421o4567n1891m1041O9276J3343K5461
21171f456M2142k47005r1313L2303O1041J66055j448j76072J1729N8734K18705
21160F8415O2389j0345o6204l2844j05400J4889J39326p2745j03438K3606J84415
21149A02064q0144j35449Q7751J7822K9165J30125l4847j27799k9425q3924J41750
21138A7089O9377l5879k3409q0964l3508K02875Q2752n1484k71771j51991P7059
21127a99854J76610R6898M4847M0938o1788K871J96848j11764j92259r9802J9751
21116h6704l6220M7587l0677K19377K01048q4639j00886j72066r0437J6703J3690
$$ plain form
21193 -165031 -154569 -54342 -18546 105767 159437 112928 111899 178906 329915 396204 248549
21182 248549 -41271 36384 33944 103384 42963 -21604 -73495 -114536 -45260 -31917 -6456
21171 -6456 35686 -211319 -302632 -270329 -209288 -43233 -44681 -220753 -209024 -150290 68415
21160 68415 130804 120459 54255 21411 -83989 -69100 70226 -2519 -105957 -82351 102064
21149 102064 21920 -113529 -25778 -7956 21209 151334 116487 -11312 -40737 -124661 17089
21138 17089 86466 50587 27178 -53786 -87294 115581 198333 146849 -124922 -276913 -199854
21127 -199854 -23244 73654 118501 159439 97651 100522 297370 185606 -6653 -106455 -86704
21116 -86704 -122924 -75337 -106014 113363 314411 229772 128886 -43180 -133617 -116914 -103224
21105a03224Q3582J18266N4336R9380R9762O2674k07467j90684j69003j36588
21095b88966J0191J65013R3392j41805m8421O0220J2472K4566J67716j2919r3087
21084e1628Q7656K3113N1140r6465J40092m0117j32331j61732j17755K7014J66155
21073a04858R8635o319q2962n7778Q9797Q7535N6268j36434j9781r60M5990J01078
21061G0211m148r2476N2985l3795P8909L0468k0533j30046M9702Q0344m4687j12826
21049g5892k9033p4231Q433J02371l8303j01742n7480P1672O1024j24468J4519
21038b43130m7764K0984Q8726r0132j3333Q9749k0855L8294J61947k2051p4175
21027a11740n3731n7367j5000J08855r5237J3059J64236K06281n2432j85538j36026
$$ plain form
21105 -103224 -19642 98624 152960 252340 352102 414776 207309 16625 -152378 -288966
21095 -288966 -278775 -113762 -20370 -162175 -210596 -150376 -137904 -113338 54378 41459 -51628
21084 -51628 36028 59141 110281 13816 153908 113791 -18540 -180272 -298027 -271013 -104858
21073 -104858 -6223 -12542 -95504 -153282 -63485 24050 80318 -56116 -75897 -76857 -30867 70211
21061 70211 66063 -26413 26572 -7223 71686 102154 81621 -48425 1277 81621 36934 -75892
21049 -75892 -104925 -179156 -170723 -68352 -106655 -208397 -265877 -194205 -133181 -257649 -243130
21038 -243130 -290894 -269910 -181184 -271316 -284649 -194900 -215755 -177461 -15514 -37565 -111740
21027 -111740 -165471 -222838 -237838 -128983 -224220 -211161 -46925 159356 106924 -78614 -214640
21016b14640q5487l4965N527J07465K1253j6525M7490l3592O4305O0936O7670
21005a0563J84493j33517k28848J21161k6660n1293K00948r197R2359m6280o8521
20994B4082m7759R1157L5775j9159r5447k51171J462J15615J13679p937j7548
20983e7251j85452L6526J09546J17788J47258j260m2154j02930o7720l6219K20215
20972A38347O1564k6519K1369j0700k5184j06707k6017j21460j7275K2941p1067
20961a60708k29410j30674J63388K80013R8570m2384O6122o1234j47188j0287
20951a73792k634K27364Q5655r2598K3916j25899j315Q7373j22863N5665J21481
20940H2353j4026o4018n8834k4979p7440P8926K3545Q7222k1848n0183j20652
$$ plain form
21016 -214640 -300127 -335092 -329565 -222100 -200847 -217372 -169882 -203474 -139169 -78233 -10563
21005 -10563 173930 40413 -188435 -67274 -93934 -145227 55721 46524 138883 92603 24082
20994 24082 -23677 67480 103255 84096 -11351 -262522 -261060 -145445 -31766 -39703 -57251
20983 -57251 -242703 -206177 -96631 21157 168415 167155 125001 22071 -45649 -81868 138347
20972 138347 199911 173392 194761 184061 158877 52170 26153 -95307 -112582 -89641 -160708
20961 -160708 -390118 -520792 -357404 -77391 21179 -21205 44917 -16317 -163505 -173792
20951 -173792 -176426 50938 136593 43995 67911 -57988 -59303 28070 -94793 -39128 82353
20940 82353 68327 4309 -54525 -79504 -156944 -78018 -54473 32749 10901 -39282 -159934
20929a59934P9749K9021J11068Q3603m7902k7104K9539K3033J8455m1637L3264
20918A31155P7957p3891j46505j6240P1788Q5416K8890m7952L5917j23612j11801
20907h8878l7117j59981o317K04149J04287j10750l2581N5784k6549j59814j31208
20896c88975j7428Q9312K05816J1934r2337L1404r6774p6507J89402k007J5244
20885a30916J22551P9309K5151j75797L3974M9375r0911J5376L8147M8932j4924
20874B67k4093n9473Q6885k4479n6323J2796J1030J49202j3944o0196R9196o9577
20862E1291k03418R0257K2104K0200J0997m4754M2384K6676J06021n6823q7234
20851b2299l6627Q8147Q9007M4824j62384m8081j3739J02586j8903O5655M0476
$$ plain form
20929 -159934 -80185 -51164 59904 143507 95605 68501 98040 121073 139528 97891 131155
20918 131155 209112 135221 -11284 -27524 44264 129680 158570 110618 146535 22923 -88878
20907 -88878 -125995 -285976 -292293 -88144 16143 -94607 -127188 -71404 -97953 -257767 -388975
20896 -388975 -406403 -317091 -111275 -99341 -191678 -160274 -257048 -333555 -144153 -146160 -130916
20885 -130916 -8365 70944 96095 -79702 -45728 3647 -87264 -71888 -33741 15191 267
20874 267 -23826 -83299 3586 -20893 -77216 -64420 -53390 95812 81868 21672 120868 51291
20862 51291 -152127 -61870 -39766 -19566 -8569 -53323 -10939 15737 121758 64935 -22299
20851 -22299 -58926 29221 118228 163052 668 -47413 -61152 41434 22531 88186 128662
20840A28662j1306l1246j52665P618n3638Q1445O388o5514M9531K39396k3507
20829A75164o2313j43017J14589J31863j19525o7698Q3365P5801j19596k01949
20819a33316j9035q9819J5694J6009J4671J48207K7711J1506N7189n8184q9091
20808i8458J44897J5966K861K44310j2522j62870j35818k04057j01658K7969O0978
20797b18402M0008O8001J1233N7660M4613j02985k187q0729Q5781M6048J7975
20786c2984K25730J54907j99101j74352J38981L6517L0814L723M1936k3312j04241
20775I8618P0711j115J16237R7648O231j21150k22847O0763L0363J273L0177K7253
20763A94162J5263r7756j47532j63311l7197K35497K12221N5053j39242k08454
$$ plain form
20840 128662 117356 86110 -66555 -58937 -112575 -31130 -24742 -90256 -40725 198671 175164
20829 175164 112851 -30166 84423 216286 96761 29063 112428 188229 68633 -133316
20819 -133316 -152351 -242170 -226476 -210467 -195796 -47589 -19878 -8372 48817 -9367 -98458
20808 -98458 46439 62405 65266 309576 297054 134184 -1634 -205691 -307349 -279380 -218402
20797 -218402 -178394 -110393 -99160 -41500 3113 -99872 -102059 -182788 -97007 -50959 -32984
20786 -32984 192746 347653 148552 -25800 113181 149698 180512 184235 226171 202859 98618
20775 98618 169329 168214 284451 382099 388330 267180 44333 105096 135459 136732 166909 194162
20763 194162 209425 111669 -35863 -199174 -236371 -874 211347 266400 127158 -81296
20753h1296O4763J22403J77685q3915k70360q5553L4723j32164N076L10383R4805
20742A56550j70159k11987o3075K3033R6191M9889J69046j74717j02221o8173
20732b95623k7961O5451p1575J19595P6510k8624j9420R6223J9494K057j04310
20721a68183K3316J39111l2809M7786j10801r7856q3199p6471J09536J09903M7070
20710i2597P10J7095J11763L516j06667j2111K326P7831j0117j69452j34744J30112
20698a82335N7063J04410M6401o3026l0922p6794J7031o4583J80884J36166p4730
20687D9565n5581m7012j2825n628j525K4942P3557P1489O6991k9317M9981J05153
20675B89790K2612j73969j35085p664j31208j39639J9878N2671p5624k7343R2198
$$ plain form
20753 -81296 -16533 105870 283555 199640 -70720 -156273 -121550 -253714 -248638 61745 156550
20742 156550 -13609 -225596 -288671 -265638 -169447 -119558 49488 -125229 -227450 -295623
20732 -295623 -323584 -258133 -329708 -210113 -133603 -162227 -181647 -85424 -65930 -63873 -168183
20721 -168183 -144867 -5756 -38565 9221 -101580 -199436 -282635 -359106 -249570 -139667 -92597
20710 -92597 -91887 -74792 36971 40487 -66180 -78291 -75965 1866 -8251 -177703 -312447 -182335
20698 -182335 -125272 -20862 25539 -37487 -68409 -145203 -128172 -192755 -11871 124295 49565
20687 49565 -6016 -53028 -65853 -71481 -73006 -48064 25493 96982 163973 134656 184637 289790
20675 289790 312402 138433 3348 -4316 -135524 -275163 -255285 -202614 -278238 -305581 -213383
20664b13383K52335Q4517j29007K1962J05250J7225Q9852J37889l2614k83769
20654E0257j27590J20313j4748O1069L4675j74737n1952L0609M7961n2902j15187
20643a92232J14168J13155R135j5141p6643M0696k43244j02701J30113l7622M0479
20632b19837K59490M5872n689k610l838n2248j46530O9965J755n7698n4443J59240
20620f571M0774k09116K6800K9650j06087m2224k732J01523O4176Q8079P5776
20609F0048m3498p5463P5083N7074j26365k15894j4006K05796J69218j62576k02479
20598b73062o8725K57021J43065p0653j25905m5339L3206J88948M38j04845J31811
20587F5960k305M9982j44p091R163L4160O2068P9102r9438j63982j19371L5417
$$ plain form
20664 -213383 38952 123469 -5538 16424 121674 138899 228751 366640 334026 50257
20654 50257 -77333 42980 28232 89301 123976 -50761 -102713 -72104 -24143 -77045 -192232
20643 -192232 -78064 35091 44226 29085 -47558 -6862 -250106 -352807 -222694 -260316 -219837
20632 -219837 39653 85525 79836 77226 73388 21140 -125390 -55425 -53670 -111368 -165811 -6571
20620 -6571 34203 -174913 -148113 -118463 -224550 -266774 -269506 -167983 -103807 -15728 60048
20609 60048 16550 -58913 16170 73244 -53121 -269015 -283021 -77225 91993 -70583 -273062
20598 -273062 -341787 -84766 58299 -12354 -138259 -183598 -150392 38556 38994 -65851 65960
20587 65960 63655 113637 113493 106402 115565 149725 211793 290895 191457 27475 -91896 -56479
20575e6479k68287j07918N6060J84412R2212l7685N3087K11754O0879j00630j12188
20564b4783J25379M9823k5958p2235J6471Q2191Q4921O2443p7775j58403j31020
20553f8946l1384J12285J78329N1339n197p2557j1642L219p6171r5105k03894
20542b19724j4570J1861J37552O3373k4498m0623m4905L6720j9583M0214K9970
20531d4213M9681J05633N0981R8369R1743j30648j84609j14632o939j35762l6480
20520b56876P7913J43953n4114j29988q0854M521O3608k2865J07829O483n5412
20509a95802J04155N6735j00172N9101j1382r7019j14524O3564O7408J33710J05564
20498G1338J17089j18925k615r0635M3461l359o2354R3769M3939p4467R583L7212
$$ plain form
20575 -56479 -324766 -432684 -376624 -192212 -100000 -137685 -84598 127156 188035 87405 -24783
20564 -24783 100596 150419 124461 52226 68697 150888 235809 298252 220477 62074 -68946
20553 -68946 -100330 11955 190284 241623 236426 163869 152227 155446 79275 -15830 -219724
20542 -219724 -234294 -222433 -84881 -21508 -46006 -86629 -131534 -94814 -114397 -74183 -44213
20531 -44213 5468 111101 162082 260451 352194 221546 36937 -77695 -84634 -220396 -256876
20520 -256876 -178963 -35010 -89124 -219112 -299966 -295445 -231837 -254702 -146873 -140390 -195802
20509 -195802 -91647 -34912 -135084 -75983 -87365 -184384 -298908 -235344 -167936 -34226 71338
20498 71338 188427 69502 66887 -23748 19713 16354 -46000 47769 91708 17241 26824 64036
20486F4036r7736K982P2371K2661n2335m0219Q0734j8018l8866O7638p1464N9683
20474E1467m0966m4769K3665o3231p86Q1431J28966K930r5841j44165J27919J7400
20462D4020r6549J7643P6470n4945l6303K6398M5176K3687M850K24213L3425r3334
20450B14751J32771p7175r2261k10277k37559J06794L40342j9089p4070j27144
20440d2917M1660O1020N64k7037L8336L6920j26513m6093n7088n2773l0466K38992
20428C4605L6357l4666k34121j7152L3950J89035o6202p7569j02629o8180J00265
20417b06307K07571K04217p0654P0189P1721m5693n8913j34624k01756k7736J74421
20406a7564J8790r1587r7242p997J39516j50557J34149J55278j87p2089m2998
$$ plain form
20486 64036 -33700 -30718 41653 64314 11979 -28240 52494 34476 -4390 63248 -8216 51467
20474 51467 10501 -34268 -10603 -73834 -74620 6811 135777 138707 42866 -101299 26620 44020
20462 44020 -52529 -34886 41584 -13361 -49664 -23266 21910 45597 50447 274660 308085 214751
20450 214751 347522 270347 178086 -32191 -269750 -162956 177386 158297 84227 -42917
20440 -42917 -1257 59763 60327 33290 71626 108546 -17967 -64060 -121148 -173921 -204387 34605
20428 34605 70962 36296 -197825 -214977 -181027 8008 -58194 -135763 -238392 -306572 -206307
20417 -206307 1264 205481 134827 205016 276737 231044 172131 37507 -164249 -191985 -17564
20406 -17564 1226 -90361 -187603 -195600 -56084 -206641 -72492 82786 82599 10510 -32488
20395c2488J05890j15316O802P842J10895l8465o962P1335r2697m0609n6285J51637
20383G1579K9694l3340O0459M9111J26992j57072l891j42600R1387p2280o3015
20372d2976k7506K821J32579p0211o9185q567J3563k241m6105O2301m637J1977
20360d8187J91120J86718p628j59034m9367j02308o7455Q3182J24797R4519j370
20349B44987P98l8251j84462q8115J64387q9396j15577N3432J54622J9260L1904
20338A53589j4585O1498J1655m8405j94034J00396N0534Q120q8288j29454R3889
20327D915j38262k29197J38023K10884K7946K0492j19740j94764P0704R5785J8419
20316i4795r5811P0063J45044P3574M3722J9476j74714l41948K6673J89742Q3205
$$ plain form
20395 -32488 73402 -41914 -35112 -27270 83625 45160 38198 109533 16836 -23773 -80058 71579
20383 71579 101273 67933 128392 177503 304495 147423 143532 932 92319 20039 -42976
20372 -42976 -70482 -67661 64918 -5293 -74478 -83045 -69482 -71723 -117828 -55527 -60164 -48187
20360 -48187 142933 329651 322023 162989 113622 11314 -56141 27041 151838 246357 244987
20349 244987 245785 207534 23072 -65043 99344 9948 -105629 -52197 102425 121685 153589
20338 153589 139004 200502 212157 163752 -30282 70114 120648 128768 40480 -88974 4915
20327 4915 -133347 -362544 -224521 -13637 14309 34801 -84939 -279703 -208999 -113214 -94795
20316 -94795 -190606 -120543 24501 98075 141797 161273 -13441 -355389 -328716 -138974 -55769
20305e5769J8849M9125n6453j37967j092O166n367M8786L6198R9465K5586l0720
20293c193j45717j57048J44688K65171P7811j33872K368j07042Q7343N3439n3427
20282C0521j0922q6965Q1418N5855q2706L8907J3601j16409k5100p637R4262K32053
20270B16878j6137J24722o6629k61160m7850N0560R4207J01592L3737k31109R8618
20259I7429J35979j85567q6249L430Q014N5906J02360n2526k8162O4517J20705
20248B35836J01459j04750q7077j1781j17840N912m7633q6580j65598K3519J50925
20237a03608P5826m0024N8352K11494k7352j61604j21309j40580M7J86060L296
20226e9402P5978K2317M3K6687m8683N3880J35298r0401j01157j26370N7214k2598
$$ plain form
20305 -55769 -36920 12205 -44248 -182215 -183307 -177141 -182508 -133722 -97524 1941 27527 -3193
20293 -3193 -148910 -305958 -161270 103901 181712 47840 50208 -56834 30509 83948 30521
20282 30521 19599 -67366 14052 69907 -12799 26108 39709 -76700 -101800 -109437 -15175 216878
20270 216878 200741 325463 258834 -2326 -50176 384 94591 196183 229920 -1189 97429
20259 97429 233408 47841 -38408 -34978 -26964 28942 131302 78776 50614 115131 235836
20248 235836 337295 232545 145468 133687 15847 21759 -25874 -112454 -278052 -254533 -103608
20237 -103608 -27782 -67806 -9454 202040 174688 13084 -108225 -248805 -248758 -62698 -59402
20226 -59402 16576 38893 38936 65623 16940 70820 206118 115717 14560 -111810 -54596 -77194
20214g7194j39679O8736R8607Q011j61958j60670N0016L3074N8628K22650J63558
20203A63779R7852j24073O7626k16656p5612J9143j46350m0870J33574l4673Q6776
20192f9484J38365K21010q8780j00437P4905Q2868J8235N5241j58904p9188j06949
20181a3118N544Q1443J71535o718k79142k02155J13734K4309k18362O5308N0495
20170b07127j8160J87045n4285l9390J74360R7550j57379J46154Q7364L2595q0130
20159A68597j34295L5186K797q8754m8585O3180m85r4472o1044R2248J07665J04611
20147A46649Q314p8986M3139O2679k76128J6520K63381J9552j82683p490Q3787
20136I8734n1170L8634o6849q213q3767K6815j64984j00892J07137O3253O4677
$$ plain form
20214 -77194 -216873 -148137 -49530 -41519 -203477 -364147 -314131 -281057 -222429 221 163779
20203 163779 261631 137558 205184 -11472 -87084 -67941 -214291 -255161 -121587 -156260 -69484
20192 -69484 68881 289891 201111 100674 175579 258447 276682 331923 173019 93831 -13118
20181 -13118 -7574 73869 245404 238686 -40456 -242611 -128877 -104568 -322930 -257622 -207127
20170 -207127 -225287 -38242 -92527 -131917 42443 139993 -17386 128768 216132 248727 168597
20159 168597 34302 69488 72285 -16469 -65054 -1874 -2359 -96831 -157875 -65627 42038 146649
20147 146649 154963 75977 119116 181795 -94333 -77813 185568 205120 22437 14947 98734
20136 98734 47564 86198 19349 11136 -72631 -45816 -210800 -311692 -204555 -141302 -76625
20125g6625j2570j14376j22438j36737o6625J33441J02759L00186N6731n7494
20115F252j2514j63797j86362o757J18565Q7620L4167J60828J64176p9498q8731
20104C3949K7895j68032n4566L9198J05639o6045m3676m7314K04291K20271J236
20093B52846j34420K663Q1227j1269r8478j00902J04425R5756Q0912j06389p5562
20082I0809O3055k7497P6392M4524p9014m1681J3865j31192P7722o6293j9n9186
20070c8515K681k9246j07184K6512Q8996J57149M8458l9103j08503r3077R9077
20059G245Q1771J03812J6036M7682p5352j6326J06246m4694n0900j21388k2517
20048C1615J16645M9177k27359j85334J32985J87552l5987k579J3413j8931j0186
$$ plain form
20125 -76625 -89195 -203571 -326009 -462746 -529371 -395930 -293171 7015 63746 6252
20115 6252 -6262 -170059 -356421 -363178 -244613 -156993 -122826 38002 202178 122680 33949
20104 33949 61844 -106188 -160754 -121556 -15917 -81962 -125638 -172952 31339 251610 252846
20093 252846 118426 121089 202316 191047 92569 -8333 96092 191848 272760 166371 90809
20082 90809 153864 126367 202759 247283 168269 126588 140453 9261 86983 20690 20671 -38515
20070 -38515 -35834 -65080 -172264 -145752 -56756 100393 148851 109748 1245 -91832 7245
20059 7245 89016 192828 208864 256546 181194 164868 271114 226420 175520 54132 31615
20048 31615 148260 197437 -29922 -215256 -82271 105281 69294 66715 80128 61197 51011
20037E1011K8918k05506J7668J76921j16235q4843M0041O9347j09908Q8710Q1365
20026C7489J150j39474j20003J96129N4703j48371O5380J37182K3996L7370R5072
20015B40623K9825j03344j94624J5451j70282m6486J53230J27592r3879J46643
20005A04749K3395K2740J57013k40207j22300j11842P6916n755p0282j5273O4360
19994a16486K51941O7989j51888k50423p5803J64307K07219J35987K8450j27654
19984A33639R31j31653j7658j59406m9299J09370K8000n7776k8653P3663j8746
19973a17588P3594m324j10897K6362P3524j29833J75618J41836j74604o9215R9113
19962a6414R4767m9515k3484O3131k0168j54220j26029P9507j08743J0194J17908
$$ plain form
20037 51011 79929 -125577 -107909 69012 -47223 -132066 -92025 -22678 -132586 -43876 37489
20026 37489 38639 -100835 -220838 -24709 29994 -118377 -52997 84185 108181 145551 240623
20015 240623 270448 167104 -27520 -12069 -182351 -228837 -75607 51985 -41894 104749
20005 104749 128144 150884 307897 67690 -54610 -166452 -89536 -95291 -165573 -180846 -116486
19994 -116486 135455 203444 51556 -198867 -274670 -110363 96856 232843 261293 133639
19984 133639 134570 2917 -14741 -174147 -223446 -114076 -86076 -143852 -172505 -98842 -117588
19973 -117588 -43994 -48318 -159215 -132853 -59329 -189162 -13544 128292 -46312 -115527 -16414
19962 -16414 78353 28838 5354 68485 48317 -105903 -231932 -152425 -261168 -250974 -133066
19951a33066k6910j48700R2882P5804Q8051J0129j06706m3287j7747j1355O5170
19940a55735J07787j9371j02485Q5413L1201k1531Q1558m3873O0117m2946q5553
19929a05418q9615q1302o9056J33222J1591p136L40J38359O3846R9869j29346
19918c4646J9174J8855N821j00009L7598l6474M8530j3328J5054J68542m3129
19907H5988k40603p650J5800n02M7454Q8552Q7241o1228o5920j58417J32008J18157
19895D0880o8913j00217J08765J14550O3164j2621J20757j3224j16129j39103
19885b091r0999N3766j32441o8200j5986Q9172J7873N1538J69122k9786j61201
19874a19233q9328J64053J22148K5803k32449l0321J98267R2986M3356k3593j17206
$$ plain form
19951 -133066 -159976 -308676 -215794 -139990 -51939 -41810 -148516 -191803 -209550 -220905 -155735
19940 -155735 -47948 -67319 -169804 -84391 -53190 -74721 6837 -37036 23081 -19865 -105418
19929 -105418 -195033 -276335 -345391 -212169 -200578 -207714 -207374 -69015 -5169 94700 -34646
19918 -34646 -15472 3383 9204 -90805 -53207 -89681 -41151 -54479 -39425 129117 85988
19907 85988 -154615 -162265 -146465 -146967 -99513 -10961 76280 15052 -50868 -209285 -77277 40880
19895 40880 -28033 -128250 -19485 95065 158229 145608 266365 253141 137012 -2091
19885 -2091 -93090 -39324 -171765 -239965 -255951 -166779 -148906 -97368 71754 41968 -119233
19874 -119233 -208561 -44508 77640 103443 -129006 -159327 38940 131926 175282 151689 34483
19863C4483n4897R259j55578j4250O9680J15313P4801Q9914L8252o6174p8153
19852F2650l0582j47304q4186j7779m1047J81994o5444J02467L22m6585J15626
19841C0132K0336N1400Q446o8007j29015n2146j19284J7349N5419M7243Q5499
19830e2628P4931K3395p3200o2059J25165N0374J33261N0971p2225q9069Q4266
19819A93182j36241k64049l9506R8467J91815J87025l0407m1837r6873P7465k08807
19808f9766j25285J16266n7260J4313J57426M0630o5128j06035o1658J61201K06108
19797B10812N8616j70772k31388q1143j04823K2298J27365P5032Q5849R186K2529
19786B3561j74637n4343J04132P3826l9700n2769j66422L6133J30543k0132q0419
$$ plain form
19863 34483 -20414 -11155 -166733 -180983 -111303 4010 78811 168725 206977 140803 62650
19852 62650 32068 -115236 -199422 -217201 -258248 -76254 -141698 -39231 -38909 -85494 30132
19841 30132 50468 101868 110314 42307 -86708 -138854 -258138 -240789 -185370 -138127 -52628
19830 -52628 22303 45698 -27502 -89561 35604 85978 219239 270210 197985 108916 193182
19819 193182 56941 -207108 -246614 -148147 43668 230693 200286 158449 61576 139041 -69766
19808 -69766 -195051 -78785 -136045 -121732 35694 76324 11196 -94839 -156497 4704 210812
19797 210812 269428 98656 -132732 -213875 -318698 -296400 -169035 -94003 -8154 1032 23561
19786 23561 -151076 -205419 -101287 -27461 -67161 -119930 -286352 -250219 -119676 -139808 -220227
19775b20227Q8670M0543j11553O5389J7907o9267j36430j10752J96649P3068N961
19764a60042K13557l1162o8776r9059L8522l587k06141p6712R9401L4740L8338
19753b20921P5647q3835j81604R5444K14056J90851O5016o6566J13556k6605k22801
19742d7762r1706N1236J60474q5403m9851O5793r5828p7611p366Q9870j27895
19731b16049J8734J1925j00590J32994K16853K0538l1366P217L6442r3274K0490
19720B3914p4814J07273O5817n8583N9754J60233N6441o6049k05089K884M7080
19709A18861N0054o7491j52786p1504J44815o7191k8891q7267J06979m0988j26344
19698b21753l3737Q3957j05557j2925j1551J73105K22380N3380r8325k2367o9259
$$ plain form
19775 -220227 -131557 -91014 -202567 -137178 -119271 -188538 -324968 -435720 -239071 -166003 -160042
19764 -160042 53515 22353 -46423 -145482 -106960 -110547 -316688 -393400 -293999 -259259 -220921
19753 -220921 -145274 -229109 -410713 -315269 -101213 89638 154654 88088 201644 175039 -47762
19742 -47762 -139468 -88232 72242 -13161 -63012 2781 -93047 -170658 -178024 -88154 -216049
19731 -216049 -197315 -185390 -285980 -152986 63867 84405 53039 60256 96698 3424 23914
19720 23914 -50900 56373 122190 63607 123361 283594 340035 273986 68897 71781 118861
19709 118861 168915 101424 -51362 -122866 21949 -45242 -74133 -161400 -54421 -95409 -221753
19698 -221753 -255490 -171533 -277090 -290015 -301566 -128461 93919 147299 48974 26607 -42652
19687d2652J50587l1831j16006m3257L330O2395n8726l2403j31642m0095K40589
19676c9711P1011j576m3984p8906o666J86241L7067j83842k30864l2988P3488
19665b50730J41450J1687j58418J25872J34648p8640q6845J22087J1179L7506
19655I796l8982j78600J17095J47163J32353j23712o8304L5864n3824J1701r844
19644a9294p831j02472j30717k3002M5593m6349M1013N7473K710J7500j08321
19633b73697j02495N1736r3589J28007K31941L9854j55901j40922L6240N0080
19623b28746J15151j29526N85K6070J6057R5231N8718j13498p8488o5044P0167
19612b33323J85297k3341M232m5894j19260Q7398j183J51836R8340o0275O0825
$$ plain form
19687 -42652 107935 76104 -39902 -83159 -79829 -17434 -76160 -108563 -240205 -280300 -39711
19676 -39711 31300 29724 -14260 -93166 -99832 86409 123476 -60366 -291230 -324218 -250730
19665 -250730 -109280 -97593 -256011 -130139 4509 -74131 -160976 -38889 -27710 9796
19655 9796 -29186 -207786 -90691 56472 188825 65113 -3191 32673 -21151 -9450 -19294
19644 -19294 -27125 -129597 -260314 -283316 -237723 -284072 -243059 -185586 -182876 -165376 -273697
19633 -273697 -376192 -324456 -418045 -290038 -58097 -18243 -174144 -315066 -278826 -228746
19623 -228746 -113595 -243121 -242536 -216466 -200409 -105178 -46460 -159958 -238446 -303490 -233323
19612 -233323 -48026 -71367 -67135 -113029 -232289 -144891 -146074 5762 104102 43827 104652
19601A04652J0468n9853j39934k7060j00764J7300M2418M6724J61117L9242j19322
19590b5012j32951p4709j89000J72709L00948K98898j16471j86946j68186Q8J05426
19579a5206K4752o947o3739j01585J0607j56985j43401R0022n8758J82952K04017
19568c4271K79948j48454q1308o2570r3052R154K1652O4752J30159M2025j29589
19557a554j11295P2184L6795P3711j2547l3177j27512n7078k7576o7840K08734
19546d7155R7654q868n6364K4130j36445J26142K1501k25762J8941P2414J25658
19535A1846o4972q8684m8863K17781j0630J0415J16057q045j11094M5450N2281
19524A21542n9111m0787q3421O3916j69635j18993N6451J35149J64587J48123
$$ plain form
19601 104652 115120 55267 -84667 -111727 -212491 -195191 -152773 -106049 55068 94310 -25012
19590 -25012 -157963 -232672 -421672 -248963 51985 350883 234412 47466 -120720 -120632 -15206
19579 -15206 9546 2599 -61140 -162725 -152118 -309103 -452504 -362482 -421240 -238288 -34271
19568 -34271 245677 97223 15915 -46655 -139707 -130553 -108901 -44149 86010 128035 -1554
19557 -1554 -112849 -40665 -3870 69841 57294 24117 -103395 -160473 -188049 -255889 -47155
19546 -47155 50499 41631 -14733 9397 -127048 -906 20595 -205167 -186226 -113812 11846
19535 11846 -53126 -141810 -190673 27108 16478 26893 142950 134905 23811 69261 121542
19524 121542 62431 21644 -61777 2139 -167496 -286489 -230038 -94889 69698 217821
19514B17821L415j07354n1622j3497l79j0491P024R75p798L644r7042m9855j1243
19501a16402M2847K6865k9456k5737k1095K6938O9165l7950p4987j6664J8426
19490a38050J9313L742J84154J10803o4812j19871n9258j54746j23603R7249Q0102
19479a64977L8949K03158O4650j45123j84263L9275m2505j4840j3004m5801N2678
19468b11803J10592N2192p9714k0196m2744O1217J43825J48039n9058o2196m4171
19457d017q4275R9627N3897J17364j2617L1203J02938n8681j18504k59826K7088
19446a05803J48707Q6144l8330k53520k2012J18846p7011L622J37605k6962m6029
19435g4743j3333j38516j1143n971J30575J83912j1307M8297K5978K4431k25544
$$ plain form
19514 217821 221236 113882 62260 48763 48384 37893 44917 45892 38094 41738 -55304 -105159 -116402
19501 -116402 -73555 -46690 -76146 -101883 -122978 -96040 -26875 -64825 -139812 -156476 -138050
19490 -138050 -118737 -114995 69159 179962 115150 -4721 -63979 -218725 -342328 -245079 -164977
19479 -164977 -126028 77130 141780 -3343 -187606 -148331 -190836 -205676 -218680 -264481 -211803
19468 -211803 -101211 -49019 -128733 -148929 -191673 -130456 13369 161408 102350 40154 -4017
19457 -4017 -88292 11335 65232 182596 169979 201182 304120 245439 126935 -132891 -105803
19446 -105803 42904 129048 90718 -162802 -184814 -65968 -142979 -139357 -1752 -28714 -74743
19435 -74743 -88076 -226592 -237735 -243706 -113131 70781 59474 107771 133749 158180 -67364
19424f7364m9293J76118k6245Q8804Q2651j44005p3581j56176l5501j34129P9070
19413b59651P3965p37K04621O6299p0945j34098J12567j49000l0075J10044R4280
19402A7270j8224o3282M7192K38466J5818R4807P584j84761k39994k03746N2000
19391b36870L2665J95222J25416J07152m4461r1098r2140P8487J66312R1404j5811
19380C16278j87344j6986m8936j35590O420J45758K1137J20204r8794j57419O8401
19369C3129N3919l6609j77672j46340j1117Q7660J21496P3592M7197j19976j62090
19358b36811L4595l541Q1216M0826N825K4177J56041o5158j34294P8988O0943
19347D2807O2616J05926Q24j5611m3001p2852p0390J21144r2j28552r8720L3791
$$ plain form
19424 -67364 -116657 59461 33216 122020 204671 60666 -12915 -169091 -204592 -338721 -259651
19413 -259651 -185686 -186423 18198 84497 13552 -120546 -7979 -156979 -187054 -77010 17270
19402 17270 -954 -64236 -17044 221422 237240 332047 339631 154870 -85124 -288870 -236870
19391 -236870 -204205 -8983 116433 223585 179124 88026 -4114 74373 240685 332089 316278
19380 316278 128934 111948 63012 -72578 -66158 79600 100737 220941 122147 -35272 33129
19369 33129 87048 50439 -127233 -273573 -284690 -197030 -75534 -1942 45255 -74721 -236811
19358 -236811 -202216 -205757 -124541 -83715 -77890 -53713 102328 37170 -97124 -18136 42807
19347 42807 105423 211349 212173 196562 153561 80709 10319 131463 131371 2819 -95901 -62110
19335f2110n8393j74685O9716J72059k518L714l193Q1347J025r247j19620L4477
19323f7428K5431j10967l2408n4730m5143K1945M6313J06861o3169Q8838l0689
19312a15146k2027o8264l2183J46134N9766R2259q397j54683j45600L0920N6687
19301a60534M9670K43036J1264j27833j23847K6576O1596j680M5871K1872L8747
19290H4738j24102j54960O970n6456O3389m5827J18359J91m4073M8667K0175M1622
19278d1307L3672P4992J96777P8354j72993q8021K14124M2283m7261j55709q9940
19267D4971j48167K3913j59035Q3840J44136K2562l9572q1171j25414j32099l5394
19256d01430R9287J22596K06414J55526n5331k3215k1851j24619K3844L9872n750
$$ plain form
19335 -62110 -120503 -295188 -225472 -53413 -55931 -52217 -55410 25937 26962 17715 -101905 -67428
19323 -67428 -41997 -152964 -185372 -240102 -285245 -263300 -216987 -110126 -173295 -84457 -115146
19312 -115146 -137173 -205437 -237620 -91486 -31720 60539 52142 -102541 -248141 -217221 -160534
19301 -160534 -110864 132172 143436 15603 -108244 -81668 -20072 -21752 24119 45991 84738
19290 84738 -39364 -194324 -187354 -243810 -180421 -226248 -107889 -107698 -151771 -103104 -82929 -41307
19278 -41307 -7635 67357 264134 342488 169495 81474 295598 337881 290620 134911 44971
19267 44971 -103196 -79283 -238318 -154478 -10342 12220 -27352 -108523 -233937 -366036 -401430
19256 -401430 -302143 -179547 26867 182393 127062 103847 81996 -42623 -18779 21093 15343
19245A5343P6063m9592m3096o2973p9294M1621Q4170q7738j16131J8046R9495
19234a04086q1708j4546J9738J22120M0517P4288J67241P1518j1444j0923j13750
19223A58965r7332K42104k6397m5665q0432l8258J73332J41170r1106j13900J03432
19212C25913J06220j4261k43974k25175P9701p0402j53946O1987J86065Q0024
19202A32152R4815q3699j17604J64115O5539q8473k21045j60933J05197O0544
19192d9392r0746Q9656J45440q2151j80095L8046O1276m7098Q7107L4263j28841
19181a22535O0874J92872N677m1197j02856J77068K05560j2915j07123O2656n6602
19170B61479j61579L4945j55631n9154k0653m2293J6295J24505j27389o0745J00914
$$ plain form
19245 15343 91406 41814 -1282 -64255 -143549 -101928 -17758 -105496 -221627 -203581 -104086
19234 -104086 -185794 -200340 -180602 -58482 -17965 56323 223564 295082 283638 272715 158965
19223 158965 61633 303737 277340 231675 151243 112985 286317 427487 336381 222481 325913
19212 325913 432133 417872 173898 -51277 28424 -41978 -195924 -133937 52128 132152
19202 132152 226967 143268 25664 189779 255318 166845 -54200 -215133 -109936 -49392
19192 -49392 -140138 -50482 94958 12807 -167288 -129242 -67966 -115064 -27957 6306 -122535
19181 -122535 -61661 131211 136888 95691 -7165 169903 375463 362548 255425 318081 261479
19170 261479 99900 134845 -20786 -79940 -100593 -142886 -126591 -2086 -129475 -190220 -89306
19159h9306M6393J87115j8003m5572J13805P2137j9698K5228j27115k31404K7754
19148e8666J14135O8642m6266J5987k2589n9306J32410q6795r9917k3976j4906
19137h1247Q7233l2020q2499j73604O4429K02612J29501j01004p9152J08218Q5274
19126A27741k6694Q5739o1871j39574m67J2333j01769n9556J12901o976L95N6980
19114h18n8216N5799J31941R662j27843j8264k01553p9684J52002n2860l7172
19103b27006J64678M2199Q5992p2630j07737J01580J21534N4473k04449j8003
19093e9369m9290k08772j04895Q345N9095J15789o7042R5539o8690j7744J17467
19082a79567o1171M0457N4644J16517R0939N2915m8666M6799Q1207l4113O2583
$$ plain form
19159 -89306 -42913 144202 126199 80627 194432 266569 246871 272099 144984 -86420 -58666
19148 -58666 55469 124111 77845 93832 71243 11937 144347 57552 -42365 -66341 -81247
19137 -81247 5986 -26034 -108533 -282137 -217708 -15096 114405 13401 -65751 42467 127741
19126 127741 101047 186786 124915 -14659 -15126 -2793 -104562 -164118 -51217 -58193 -57798 -818
19114 -818 -59034 -3235 128706 138368 10525 -7739 -209292 -288976 -136974 -189834 -227006
19103 -227006 -62328 -20129 65863 -6767 -114504 -12924 108610 163083 -41366 -59369
19093 -59369 -108659 -317431 -422326 -413981 -354886 -239097 -306139 -210600 -279290 -297034 -179567
19082 -179567 -240738 -200281 -145637 -29120 61819 114734 66068 112867 194074 159961 222544
19071B22544K11890K81244J80760L68513K96101M7205j98600l05138k78097k64785
19061E61637j86495r6563J982j57397o0720k599k21448j12788J05810P9721j22988
19050b11848N3878n7949L8128P4247Q5428R2208r5128j30236j5321K00338L0518
19039F4263L743M2508l7622k3680r7904j77296Q9500L7457M9710R0912j22585
19028h0994j60378L8894l1102m0692K08245J20268Q203j35262O6197P4606P4637
19017A42622m7467j20796j43397L8780m8974R015k4911p9807J93888K46950j67813
19006a910p8374n183N6186n6289P6522L9256l3804r4702M8868p395o3547j7093
18994a37465J97022O3904R4980J27939p947j31750L8125m9034l9567j76264q1721
$$ plain form
19071 222544 434434 715678 896438 1264951 1561052 1608257 1409657 1104519 826422 561637
19061 561637 375142 278579 280561 123164 62444 59845 -161603 -274391 -168581 -88860 -211848
19050 -211848 -157970 -215919 -177791 -103544 -18116 74092 -21036 -151272 -166593 33745 64263
19039 64263 68006 110514 72892 49212 -48692 -225988 -136488 -99031 -49321 41591 -80994
19028 -80994 -241372 -202478 -233580 -274272 -66027 54241 62444 -72818 -6621 67985 142622
19017 142622 95155 -25641 -169038 -130258 -179232 -170217 -195128 -274935 -81047 165903 -1910
19006 -1910 -80284 -85467 -29281 -85570 -9048 30208 -3596 -98298 -49430 -56825 -120372 -137465
18994 -137465 59557 123461 218441 346380 338433 206683 244808 195774 156207 -20057 -101778
18983a01778R436O6209J28364j32131j31594J09357j6471o8861p9082Q6189n477
18972a35839j4094L2721q2907J9921J80520J31008k403K5848O1783k0643m8493
18961A47422L1324O4258k26700j34064o5723M1591J66980J62577m8130N8254n6281
18950A41508j55985o5344J69291M3544k72128r4734J80209J27282K19871J5408
18940C08922P027N5615j25166j75920k185k37503R4216J89851L1941O3322j62039
18929D8081k35138N9874j9551j44991J41466J52073J26486p8396p4669J24136
18919I9371k05315p02K82322J50569O2718q413j57091j10761p6421j41610N8637
18908d6696P2025N74j21289j20831J864Q8821J06546k3040j61739j24994j99508
$$ plain form
18983 -101778 -92342 -26133 102231 -29900 -161494 -52137 -68608 -137469 -216551 -130362 -135839
18972 -135839 -149933 -117212 -200119 -180198 322 131330 128927 154775 216558 195915 147422
18961 147422 178746 243004 16304 -117760 -183483 -141892 25088 187665 139535 197789 141508
18950 141508 -14477 -79821 89470 133014 -139114 -233848 -53639 73643 293514 308922
18940 308922 315949 371564 246398 70478 68293 -169210 -74994 114857 146798 210120 48081
18929 48081 -187057 -127183 -146734 -291725 -150259 1814 128300 49904 -24765 99371
18919 99371 -105944 -106646 175676 326245 388963 380550 223459 112698 36277 -105333 -46696
18908 -46696 25329 25903 -95386 -216217 -214353 -125532 -18986 -42026 -203765 -328759 -528267
18897e28267M5233J45686K33179O7034j45326k6117q0768R7015j09130K7969J85117
18886h8375J10450j55128O6453N8129j23035k4505r3604Q2917J32488m7306P1518
18875i998l6430M120l6504o6795k8040P745N0037R8524K10852j06292j71143r7350
18863a81274j0903J05341J53619j1657j28487o4645J15815K5103J8856N4396O3945
18852A40109J7475l9506q5533J8527J09618j91710k47102j0109J15115K15788
18842D2672J10368j2795n1331m6842n1560o8435R8047J25063j5628k20736Q5736
18831e441J51011j29319j31630Q6398K73629j67917N6918J36780M4125M1188p7580
18820B78162q4469j00205j6405J000n7593p9370j16629K77688N7022Q4983j58639
$$ plain form
18897 -528267 -483034 -337348 -104169 -37135 -182461 -208578 -289346 -192331 -301461 -273492 -88375
18886 -88375 22075 -133053 -66600 -8471 -131506 -156011 -249615 -166698 -34210 -81516 -9998
18875 -9998 -46428 -42308 -78812 -145607 -173647 -165902 -115865 -17341 193511 87219 -83924 -181274
18863 -181274 -192177 -86836 66783 55126 -73361 -138006 -22191 2912 21768 76164 140109
18852 140109 157584 118078 32545 51072 160690 -31020 -278122 -288231 -173116 42672
18842 42672 153040 140245 88914 42072 -9488 -77923 20124 145187 129559 -91177 -5441
18831 -5441 145570 16251 -115379 -28981 244648 76731 133649 270429 314554 355742 278162
18820 278162 193693 93488 77083 78083 20490 -58880 -175509 102179 159201 244184 85545
18809H5545p6418K00478L8178o4840n3035J2268K507N5404Q1777j27458J4253
18798A68659P089j46270k12776n0849K17277K05595p237n5844P533j32215q5676
18787h4714Q3378R4188K1963k502l2735o9627O6851J05973j128o3719r2951q4071
18775e9094K9923r460k1944J15552J54185R9924J66071M30956O30931K14260l86094
18764A365210n78984m26101l31341j32660n9614J22850J00993o3194r1261j19163
18754b13265Q3419P3930r086N2495m8593j0925M7393J75912J2850q5287m4456
18743C4387n6435n1380J31355o5159j17317L5060p655R9345M2019R0499j37901
18732c182L1488j08116j85299l3075J37038J30078k6025p0419K4718R9646N643
$$ plain form
18809 85545 9127 209605 247783 182943 129908 142176 144683 200087 281864 154406 168659
18798 168659 175748 29478 -183298 -234147 -16870 188725 181488 125644 133177 962 -84714
18787 -84714 -1336 92852 114815 112313 79578 9951 76802 182775 181647 117928 24977 -59094
18775 -59094 -29171 -38631 -60575 54977 209162 309086 475157 906113 1537044 1751304 1365210
18764 1365210 786226 360125 28784 -103876 -163490 -40640 60353 -2841 -94102 -213265
18754 -213265 -129846 -55916 -65002 -12507 -61100 -72025 -24632 151280 164130 78843 34387
18743 34387 -22048 -73428 57927 -7232 -124549 -89489 -97144 2201 44220 134719 -3182
18732 -3182 28306 -79810 -265109 -298184 -161146 -31068 -57093 -127512 -102794 -3148 2495
18721B495j10134J38459J30454L4670J36921p3369j71935j74191J95098J89792
18711B98260J6065o1057j83898j08958j18305J62290K62949O2407j83721j51347
18701e315o6178J24956P0919j874j72954j16569k8783P8432J1891L1226j40282
18690b14531N9445J57347p8673r8243Q1348J98131J04834J81637L7373j58500
18680B70168k01268o245j67260k8415m717N8795P3180m8132j57015m1798K01442
18669e1265K32986q0920j07298r0690O2906N1672J02445M9405j01638n3202j0033
18658D368L7040j8606m6723l3185K8896n762R4557r4206r484n6842j0694R2157
18646a8484J131J17876J13460j81761m7673j9473k71222k2701J41039r678M3230
$$ plain form
18721 2495 -107639 30820 161274 195944 332865 259496 87561 -86630 108468 298260
18711 298260 314325 253268 69370 -39588 -157893 4397 267346 329753 146032 -5315
18701 -5315 -71493 53463 124382 122508 -50446 -167015 -195798 -117366 -105475 -74249 -214531
18690 -214531 -155086 2261 -76412 -174655 -93307 104824 209658 391295 428668 270168
18680 270168 68900 62655 -104605 -133020 -137737 -78942 -5762 -53894 -210909 -252707 -51265
18669 -51265 181721 100801 -6497 -97187 -34281 17391 119836 169241 67603 14401 4368
18658 4368 41408 22802 -23921 -57106 -28210 -33972 60585 -33621 -43105 -99947 -110641 -18484
18646 -18484 -17353 100523 213983 32222 -15451 -34924 -306146 -328847 -187808 -197486 -154256
18635a54256j02308p7026J14928M78p7392k6712J07262O9001j9512J2470l2067
18624a85134o0806J43518J43606J41042O0272k65414m2258R2366J42872p4263
18614I5801l856n8157J63384R5418j54239M2091P2799n5997p1506j20743j00056
18603i5061k2124J37202m8317j31377L9218M9377q0536j36718L2709M3803K31223
18592A9399O6314j53756j08289k036K5776J65107J92466J7623J43604l1944j72605
18581A61659r4772j7319k023o8589j31028J03818J73118J43690M2046p7660j49196
18570H3744q7452J80324J5274p519j17385p7716Q3170O2882j7904M0338m9406
18559A08350j30263l4679J58793N1464q7136K4927N1310o4161M8824M6251J14828
$$ plain form
18635 -154256 -256564 -333590 -218662 -218184 -295576 -322288 -215026 -146025 -165537 -153067 -185134
18624 -185134 -245940 -102422 41184 182226 242498 -22916 -65174 27192 170064 95801
18614 95801 91945 33788 197172 292590 138351 180442 253241 197244 125738 4995 -95061
18603 -95061 -117185 20017 -28300 -159677 -120459 -71082 -151618 -288336 -255627 -211824 19399
18592 19399 85713 -68043 -176332 -178368 -152592 12515 204981 222604 366208 334264 161659
18581 161659 66887 49568 47545 -21044 -152072 -48254 124864 268554 310600 232940 83744
18570 83744 -3708 176616 191890 184371 66986 -10730 72440 135322 117418 157756 108350
18559 108350 -21913 -56592 102201 153665 66529 91456 142766 78605 127429 173680 288508
18548B88508j39487O0698j7060p2647k23578n1286J88148J25683J33150m2426
18538B49703j84572o6606Q9620L2402k3803j32141m3407K3782M6629K0699J45164
18527A57470O0161m5975p2211k04143J4051J92458P196q1737k91351N5994J02006
18516a06081N527Q9468M4253J81762J94958l0467Q2891n0424O991N2023L0246
18505E01147l2749j4538J58174R1917J01341j29974r0012l7951p0370p6327j07508
18494B93150J49199l0857J09385P0983j7102K64797J90242L29007Q12252K24052
18484B395108l09187m41632l97865q3569J56483l6225J50678K88332L29396J37572
18474B189091L61493N94573L96347N11895P93140J073591J542192J885883J913789
$$ plain form
18548 288508 149021 209719 192659 120012 -103566 -154852 33296 158979 292129 249703
18538 249703 65131 -1475 88145 120547 96744 -35397 -78804 -55022 -8393 12306 157470
18527 157470 217631 171656 99445 -104698 -90647 101811 109007 27270 -264081 -208087 -106081
18516 -106081 -100554 -11086 33167 214929 409887 379420 462311 411887 418878 470901 501147
18505 501147 468398 453860 612034 703951 805292 675318 585306 547355 476985 400658 293150
18494 293150 442349 411492 520877 591860 574758 839555 1029797 1358804 2171056 2395108
18484 2395108 2085921 1644289 1246424 1162855 1319338 1283113 1433791 1722123 2051519 2189091
18474 2189091 2550584 3145157 3541504 4053399 4846539 5920130 7462322 9348205 11261994
18465A1261994K247912L887553O515812J0500856J9301660L9247346P8087545
18458A71050678J10496412N5752549m3482809r1298398p9729156m7043205k4101520
18451E1644551j3211147q264559n737961m284626k991948j882691j448525j601337
18443A2221757j845420j764433j316103j035546q01557p44789l81251l80315j79431
18434C772912j04884l44591m12520P1158L80085M69780K05669m32909q16585m08175
18424B379940l37889k21441l12536k74083j23484j77408r4492l3665j18069k18962
18414D67911m6317J41887K6630q7501L5289N171j34980m3791j02519n3358J91522
18403C99944R2397o08j35353j5055L5793J58602J32109j51771l17213J8204Q5142
$$ plain form
18465 11261994 13509906 17397459 23913271 34414127 53715787 92963133 171050678
18458 171050678 281547090 337299639 293816830 202518432 122789276 75746071 51644551
18451 51644551 38433404 30168845 24430884 20146258 17154310 15271619 13823094 12221757
18443 12221757 10376337 8611904 7295801 6260255 5458698 4713909 4332658 3952343 3772912
18434 3772912 3668028 3323437 2910917 2982075 3362160 3831940 4037609 3604700 2788115 2379940
18424 2379940 2042051 1820610 1508074 1233991 1110507 933099 838607 804942 686873 467911
18414 467911 421594 563481 590111 502610 537899 543070 408090 364299 261780 208422 399944
18403 399944 492341 491733 356380 341325 377118 535720 667829 516058 198845 217049 302191
18392C02191r5689L6606M0892J8012j22318j22877l3212P2727J57967O4977l2878
18381B86398m5682j09487M1479J42586J43067j32657k08315K9812N7413r1964
18371A12650J14586k9396j65631m9080J18796Q426o9998N8859J00609R3076r6455
18360A96442n6473N8648m9256L7796l3999p1155r1770j8313k9799m3090l426L8680
18348f5715J28072l0578N782J34354J628q4327j22122M2890J29957Q3333m5075
18337A78199j79033k2985P4320j62810K5374J64139J64767m1458r9654n8734k4400
18326A7725P1927Q9149j5068m9168J88857J16614Q930j91023k16848k5965M7459
18315D2589n5591j35723k7133J45733M2466k5888j69739M0087J12698j8030p8647
$$ plain form
18392 302191 206502 243108 284000 302012 179694 56817 23605 96332 254299 319276 286398
18381 286398 240716 131229 172708 315294 458361 325704 117389 147201 204614 112650
18371 112650 227236 197840 32209 -16871 101925 110351 40353 99212 199821 292897 196442
18360 196442 139969 198617 149361 187157 153158 82003 -9767 -28080 -57879 -100969 -104395 -65715
18348 -65715 62357 31779 37561 171915 173543 89216 -32906 9984 139941 223274 178199
18337 178199 -834 -23819 50501 -112309 -86935 77204 241971 200513 100859 42125 17725
18326 17725 89652 178801 163733 114565 303422 420036 428966 237943 21095 -4870 42589
18315 42589 -13002 -148725 -175858 -30125 12341 -13547 -183286 -143199 -30501 -48531 -127178
18304a27178n1845K1512o1566K629M0520n4705j30219L0406j5844K73677K08364
18293A35751J2199Q7294O0866o1809j56260j6459P7503j12874L5072l2837j22227
18282i3781J3656M1186J14381N6479j05744n4104p4602n1302J12820M3079J48580
18271A50648J42261k8215j39067j56161j03754l045j11406j68226J47812J03119
18261a66034J78733M2693M2151J01732L4582j44522o5857m20j9953j61155J28793
18250b9257q126p6828O7988J63317o9327j5891M3607o2825M2337J12647J02524
18239B70166j22558n9675P9193L1133J83532O1267J2551k20435k63210J43303
18229A15267K02949J07034q7409j70128k2424o2867j34320J55239L9322k16602
$$ plain form
18304 -127178 -179023 -157511 -219077 -216448 -175928 -230633 -360852 -330446 -346290 -72613 135751
18293 135751 147950 235244 296110 234301 78041 61582 139085 26211 61283 28446 -93781
18282 -93781 -80125 -38939 75442 131921 26177 -27927 -102529 -153831 -41011 2068 150648
18271 150648 292909 264694 125627 -30534 -134288 -137333 -248739 -416965 -269153 -166034
18261 -166034 12699 55392 97543 199275 233857 89335 23478 23058 3105 -158050 -29257
18250 -29257 -37383 -114211 -46223 117094 47767 31876 75483 12658 54995 167642 270166
18239 270166 147608 87933 167126 198259 381791 443058 455609 235174 -28036 115267
18229 115267 318216 425250 337841 167713 145289 82422 -51898 103341 142663 -73939
18219g3939j2050J15806O6849L0340l4304J11763O069j77171K07647j40580L9641
18208A40071R9107r8996M4048J21989j12640p0482m498p7676k05969R4563K82425
18197B11942K52821r5218j8194J156p6108j05057M1241J5283j50556j21843R7835
18186E3302P0955j10890J32852k0415o243j1249o8365j3962M4022l5886q5191
18175e1070n1230J08676J17091K3429j48734r6880K35069J2472M1849J6851J41160
18164C48683M7194O8577p5257q5785p1623j64953J10018l0394k7738J43669J31130
18153C93521O2186L4997l5411J0163j03491j53013n7162M3978L5838K82194P2962
18142E86762m1336j76595J45144J3301j8548n9800l6007J55230J55294J86245
$$ plain form
18219 -73939 -85989 29817 96666 127006 92702 204465 210534 33363 241010 100430 140071
18208 140071 239178 140182 184230 306219 193579 123097 118599 40923 -165046 -70483 211942
18197 211942 464763 369545 351351 352507 276399 171342 212583 227866 77310 -44533 53302
18186 53302 124257 13367 146219 125804 119561 108312 39947 25985 70007 34121 -51070
18175 -51070 -102300 6376 123467 146896 -1838 -98718 136351 148823 190672 207523 348683
18164 348683 395877 464454 389197 303412 231789 66836 176854 146460 118722 262391 393521
18153 393521 455707 490704 455293 465456 361965 208952 151790 195768 231606 513800 586762
18142 586762 545426 368831 513975 527276 508728 448928 412921 568151 723445 909690
18132I09690K00743K25742M5076K8716K35055N01862M35976M96548M34651L36271
18122C850330N88350O99416Q96233J016800J415124K116190K782813M094362O715899
18113B4175517J1308913K0558573M1835837Q8388754J40638948O7008850o0539419
18106C33375973j12362058r1270791n0176288k5452948j3986832q459297n889547
18099B5778212m211982l075616k524381k335217k259912j911583j433733j031601
18091F994187q14311n90341n19173n40692l76771l97447k79836l1885k60519l61421
18081B821791j66382k28550j82805j84875j07259m7551j42624m9300l09725k47794
18071A154926J06838K3720k772M8362j26203o0240j93655k56879L8312J98183
$$ plain form
18132 909690 1110433 1336175 1381251 1409967 1645022 2146884 2582860 3079408 3514059 3850330
18122 3850330 4438680 5138096 6034329 7051129 8466253 10582443 13365256 17459618 24175517
18113 24175517 35484430 56043003 97878840 186267594 326906542 393915392 333375973
18106 333375973 221013915 129743124 79566836 54113888 40127056 31667759 25778212
18099 25778212 21566230 18490614 15966233 13631016 11371104 9459521 8025788 6994187
18091 6994187 6179876 5589535 5070362 4529670 4152899 3755452 3475616 3443731 3183212 2821791
18081 2821791 2655409 2426859 2244054 2059179 1951920 1904369 1761745 1712445 1402720 1154926
18071 1154926 1261764 1285484 1282712 1331074 1204871 1144631 950976 694097 732409 930592
18061I30592j01486o3371M0416J5139K8901k11772k78722J26479J44028J15894
18051G46098j2851j07076N1142j18023m0595J75132j88955j54689q3344J14579
18041C81418j9853k01962q7367j83427k919J71809K14901J6468n301m1186J49318
18030C91899M1235l1018j51562k01038L6333m5498j1918k7273M384k9949J2865
18019a1540K22250J39715r1362j56244O398j21226L9495j6998K43506M4344j34354
18008A63984o4233J00667P4959p651m8672j7176k3559j2935J18215P3606J60905
17997E18110j21114r0147n7495o6609K28733O5601n8330m0839j24065n5643o7024
17986A31178J51361K17693K20136j2660q8240k46865j22254j8170j09183q8774
$$ plain form
18061 930592 829106 765735 806151 821290 850191 638419 359697 486176 630204 746098
18051 746098 733247 626171 677313 559290 518695 693827 504872 350183 266839 381418
18041 381418 361565 159603 72236 -111191 -114110 57699 272600 289068 283767 242581 391899
18030 391899 433134 402116 250554 49516 85849 40351 28433 1160 5544 -24405 -11540
18019 -11540 210710 350425 259063 102819 109217 -12009 27486 10488 253994 298338 163984
18008 163984 99751 200418 275377 267726 219054 201878 178319 165384 283599 357205 518110
17997 518110 396996 306849 249354 182745 411478 477079 418749 377910 253845 198202 131178
17986 131178 282539 500232 720368 707708 619468 372603 250349 232179 122996 34222
17976C4222J48428J79026L8832o8538j3850M9458K1615j45243k19129p9217N7555
17965C159l9667j23861j21451L2179l7606L4792n0905J41401J64199J96240J1928
17954B10408r3237j05438K0910J04437k00897o6534K19638O7843R6407Q4652L1236
17943C69425p4496k54782r6135n3083p4241k1616K62474M0196j78522M6262K30728
17932A96210R358j98161j10757N7978J53627K40166N5211k01698j27475j7004
17922E7455N2804m3675O669J47098p2689l6131j27288N4496K41282J18034k54135
17911A43920o6664j49224j04677j6651K1458K07700Q8489J24901j21209j39805
17901a1762p7228N6689P0928j00506K7817q0834l4313Q3364q3795k12976Q5172
$$ plain form
17976 34222 182650 361676 400508 331970 318120 367578 389193 243950 24821 -54396 3159
17965 3159 -36508 -160369 -281820 -249641 -287247 -252455 -303360 -161959 2240 198480 210408
17954 210408 117171 11733 32643 137080 -63817 -130351 89287 157130 253537 338189 369425
17943 369425 294929 40147 -55988 -109071 -183312 -204928 57546 97742 -80780 -34518 196210
17932 196210 205568 7407 -103350 -45372 108255 348421 403632 201934 74459 57455
17922 57455 110259 66584 73253 220351 147662 111531 -15757 38739 280021 398055 143920
17911 143920 77256 -71968 -176645 -193296 -171838 35862 124351 249252 128043 -11762
17901 -11762 -88990 -32301 38627 -61879 -34062 -114896 -149209 -65845 -149640 -362616 -277444
17890b77444J21486r019O1579J77808J8672j03522k05254L9190k9850L5606Q6690
17879h4058M1067J22586q150j7397j42579K3458n5701o2887J06523J07343m8416
17868a8211M9472q2374j63137p7915J42107R9540j03861m9647K5288J05197M0854
17857c2687K1756M1102l6739j46032q4205O4491J00374J5993p8890J04872J3957
17846a6008J04414K58914K35503M13171M80332K30109k41670l38079k46801l35746
17836E44139k26404j10184o6176M007o4996l5617k63918m6326J43197p1604J3099
17825a80783l1361j1873J12762K13503m4768K5534Q8844N9173j07235o1307J23406
17814A85895J1808j92288j41919M5174P1451N6072O0476q4165k2818L1150N5916
$$ plain form
17890 -277444 -155958 -164977 -103398 74410 93082 -10440 -215694 -176504 -206354 -170748 -84058
17879 -84058 -42991 79595 71445 54048 -88531 -65073 -120774 -183661 -77138 30205 -18211
17868 -18211 31261 -51113 -214250 -292165 -150058 -50518 -154379 -204026 -178738 -73541 -32687
17857 -32687 -10931 30171 -6568 -152600 -236805 -172314 -71940 -55947 -134837 -29965 -16008
17846 -16008 88406 347320 582823 995994 1476326 1706435 1464765 1126686 879885 544139
17836 544139 317735 207551 141375 145382 80386 44769 -219149 -265475 -122278 -193882 -180783
17825 -180783 -212144 -224017 -111255 102248 57480 83014 171858 231031 123796 62489 185895
17814 185895 197703 5415 -136504 -91330 -19879 36193 96669 12504 -10314 20836 76752
17803G6752L1007j7826r401r4208j7673K4702k0206P6143J27539Q3531k06335
17792E4025p5055J42000L7467q6922m1888n2058o6320m5254K6786J9590Q6191
17781a438o5988N0036l4233J7985N9327j76005j5648J04839N9246J2601l4827
17770b4105P9685q9769K8833n603q7716K20377J60552k407j71778j408j21761
17759a5100k47554O6222J35314O0283o8517O0248J61518l4828j81749K5773K4552
17748a3838l0743j05822N5025m6654j9142J86204M0400j48492r2425j050N4577
17737a21960N1368J03538K8412m6919L6714p2162j69665j80029M8199K80833J57410
17726A15739Q9871K09108q4768k29904j34009l7609L8092r81l9513o7670M1886
$$ plain form
17803 76752 107759 89933 80532 -13676 -31349 -6647 -26853 49290 176829 260360 54025
17792 54025 -21030 120970 158437 71515 29627 -22431 -88751 -134005 -107219 -87629 -1438
17781 -1438 -67426 -17390 -51623 -33638 25689 -150316 -165964 -61125 -1879 10722 -24105
17770 -24105 55580 -34189 -5356 -10959 -98675 121702 282254 279847 108069 106661 -15100
17759 -15100 -262654 -196432 -61118 -835 -69352 -9104 152414 117586 -64163 -38390 -13838
17748 -13838 -44581 -150403 -95378 -142032 -161174 25030 65430 -83062 -175487 -176537 -121960
17737 -121960 -70592 32946 61358 14439 51153 -21009 -190674 -370703 -322504 -41671 115739
17726 115739 205610 414718 329950 100046 -33963 -71572 -33480 -34461 -73974 -141644 -99758
17715i9758K17058r0540m3515J38254m2212q7287J5551K3366O9246j16980k14490
17704b31307M5291R716M5183P2463J24741L8247j23369n5143M7935R074j10666
17693a27835l5644j8250Q7082K3260M4204k69660P5008P1314L162J61563L0767
17682D4971N0377l5491m5819n3295J11225J81405l5461m8987M5261n5759o1872
17671I6555m2170k19529q2706P907R5044L7501N2351N0707K6956j3342j1911m0060
17659d2697j36679r2545R4994n2171p5754l66K19095Q9983k5410n8532m2622N2012
17647g0692N603m3910Q4004L3825p7762N2925M9414N1056K15480O6147p7405j2545
17635B76140j63672j46707J38929l6764j15093l09529n1385J38739M8586N9846
$$ plain form
17715 -99758 117300 26760 -16755 121499 79287 -8000 7551 30917 100163 -16817 -231307
17704 -231307 -186016 -176300 -131117 -58654 66087 104334 -19035 -74178 -26243 -17169 -127835
17693 -127835 -163479 -181729 -94647 -71387 -27183 -296843 -221835 -150521 -147359 14204 44971
17682 44971 95348 59857 14038 -39257 71968 253373 217912 168925 214186 158427 96555
17671 96555 54385 -165144 -247850 -239943 -144899 -107398 -55047 -4340 22616 9274 -2637 -42697
17659 -42697 -179376 -271921 -176927 -229098 -304852 -305218 -86123 3860 -21550 -80082 -122704 -70692
17647 -70692 -65089 -108999 -24995 8830 -68932 -16007 33407 84463 299943 366090 288685 276140
17635 276140 112468 -34239 104690 67926 -47167 -356696 -408081 -269342 -220756 -160910
17625a60910J82962N0786k6480o4097L1860J22541J22595j74407j10883M5626
17615A9593n6317r4577M3649J77182M0831m7704j19014j16805K53758M7146o6478
17604H1264K7480R640j7314m4535J23629q0471j83143M6152p6908p7658j18396
17593c10260J60985J31354J8266n8164j94740M3558J14636J19588K2637j37155
17583h9295p5455r2816O6777K37875J17294q0945m1974m0346o4098k79014j22606
17572d64603J04778Q4208l2959L867K25045j1333K905J08550q9645j2445J46791
17561F5159R6089k06816k39660n0328J03303R1878K8862K5961n2985J09961p0975
17550i9551R3553J17151M2487O543k6560j6474m0307r9317j09940R529l2196K5326
$$ plain form
17625 -160910 22052 72838 46358 -17739 14121 136662 259257 84850 -26033 19593
17615 19593 -36724 -131301 -87652 89530 130361 82657 -36357 -153162 100596 147742 81264
17604 81264 108744 118384 101070 56535 180164 99693 -83450 -37298 -114206 -191864 -310260
17593 -310260 -149275 -17921 345 -57819 -252559 -209001 -94365 25223 47860 -89295
17583 -89295 -164750 -257566 -190789 47086 164380 83435 41461 1115 -62983 -341997 -464603
17572 -464603 -359825 -275617 -308576 -304709 -79664 -90997 -88092 20458 -69187 -81632 65159
17561 65159 161248 -45568 -285228 -335556 -232253 -140375 -111513 -85552 -138537 -28576 -99551
17550 -99551 -5998 111153 153640 160183 133623 117149 76842 -22475 -132415 -122886 -155082 -129756
17538a29756N6450J08312n50m1858n1884j7444M0899j0615M7951Q2796j61359
17527g7058n962L5517R8171K7010N6719J9500r8398J82795K27318j39556j60881
17516A65175o3084j65082J05582O5048j15650j45437q8825N0724K9585p1442J27775
17505a05631K73146j14888j53802J7787J24603j26252N9034k3649o6077j9106
17495a34835j18983J32860J11441j34238K5314l2808J60614l826J8494J78054
17485B02087J9228n2171r2055j66817j8534k6094j861J03987L0203M1709Q7251
17474A26933j2748j04329R4124J1392j66883l2791l433K3741J03762o4299m7954
17463g2485K1342R7615K2895M3601Q2268j41126j23042K0606M8618J69793L008
$$ plain form
17538 -129756 -73306 35006 34456 -7402 -59286 -76730 -35831 -46446 1505 84301 -77058
17527 -77058 -83020 -47503 50668 77678 134397 153897 55499 238294 465612 326056 165175
17516 165175 102091 -62991 42591 107639 -8011 -153448 -242273 -191549 -161964 -233406 -105631
17505 -105631 167515 52627 -101175 -83388 41215 -85037 -26003 -49652 -115729 -134835
17495 -134835 -253818 -120958 -9517 -143755 -118441 -151249 9365 5539 24033 202087
17485 202087 221315 169144 77089 -89728 -108262 -134356 -136217 -32230 -2027 39682 126933
17474 126933 114185 9856 103980 115372 -51511 -84302 -87735 -63994 39768 -24531 -72485
17463 -72485 -51143 46472 69367 112968 195236 54110 -68932 -48326 292 170085 173093
17452A73093k73763r8128P3830J31801L03895K16661j03761q1412K79107Q06845
17442A428168N37793k17875l73465n85649l89482j65445k579m8630p5722J64846
17432B71960Q2698n8629o8155p3431j234K2719n6289m3399l5811m7034k66130
17421b72735k6463p369q7034J17346K5823P4386M20J6161J24469O322J19352O4397
17409A55075P0872l5569j85401L5773r7908K3044Q705j49474R2374J8786j057
17398f4780k9171P4455p1962j02138Q4484P6845J35732M8457K12291q0107k84834
17387g28j44189p4503j00945J43716M5372J23915K02715r3182o8967J1948j00775
17376e5623n6562J07186k39710r0716O8955J12104J1392P7609q171j8681P6266
$$ plain form
17452 173093 -100670 -198798 -124968 6833 310728 527389 423628 342216 621323 1428168
17442 1428168 1965961 1748086 1374621 788972 399490 234045 231466 182836 107114 271960
17432 271960 354658 296029 227874 154443 153209 175928 119639 76240 40429 -6605 -272735
17421 -272735 -299198 -306567 -393601 -276255 -250432 -176046 -175626 -159465 -34996 -28674 90678 155075
17409 155075 225947 190378 4977 40750 -57158 -34114 -25409 -174883 -82509 -63723 -64780
17398 -64780 -93951 -19496 -91458 -193596 -109112 -32267 103465 151922 364213 284106 -728
17387 -728 -144917 -219420 -320365 -176649 -131277 -7362 195353 102171 33204 45152 -55623
17376 -55623 -112185 -4999 -244709 -335425 -266470 -154366 -142974 -65365 -73536 -92217 -15951
17365a5951P8339m5486n513R03k3093K265J59163J7034r6656J9542K37929k482
17353C25994k03052j55807r7005M6572O8333J48307m2070k23151J67315J99285
17343B34721n0860j2676n8499l3965M2394L3255K8710l7351n1338j14048j3457
17332c3114k6037o7262q9528Q0303J49188j03418k4976l6341R5533P5228j60281
17321a40705r1869M0602Q7715m8553o6062M4517P270K5540R2398N0911Q1093J23578
17309B06435q1004p4684j28973J10372j7452j86715K5146L4955q8278J64910J50346
17298A15058J07366r0433o579o5529J2975J27479k4907j71344j74222o9140j92731
17287d32007J05729J88035K680m4141K0664J18608o939p4353k3201J89749J48316
$$ plain form
17365 -15951 62388 16902 11389 12292 -10801 -8536 150627 167661 71005 90547 328476 325994
17353 325994 122942 -32865 -129870 -83298 -14965 133342 91272 -131879 35436 234721
17343 234721 183861 171185 112686 78721 121115 154370 183080 145729 94391 -19657 -33114
17332 -33114 -59151 -126413 -215941 -135638 13550 -89868 -114844 -151185 -55652 19576 -140705
17321 -140705 -232574 -191972 -104257 -152810 -218872 -174355 -167085 -141545 -49147 1764 82857 206435
17309 206435 125431 50747 -78226 32146 14694 -172021 -146875 -111920 -200198 -35288 115058
17298 115058 222424 131991 125412 59883 72858 200337 175430 4086 -170136 -239276 -432007
17287 -432007 -326278 -138243 -135563 -179704 -159040 -40432 -47371 -121724 -144925 44824 193140
17276A93140K8964o6863l484K35992r9628k02583k16025r4612J51458J16278J46239
17265A88876O3764j50519O3437R6277j77323k6213R162N6171J26152j40408j31429
17254b2053L891N2675M1098O2873J03460P8645k02103j72831r4105j96264L0111
17243c14603K09744J35786Q5622J4888N5987q2110j41214K8644n4672l2944o1809
17232a56681j4015m2857J5016N6110J86037p40j20618o7474o9364J23974P2864
17221a7748L4837J38040m6559j979n2168K2739L2071j22781J9708m196K7461K00621
17209B30046K3145r0940j66693n2892n7996k9702R2376L35Q6369k1060k6977P6829
17197F2840J3369N779j39593k436J01232K8390O642j99279j3849J45716L7823
$$ plain form
17276 193140 222104 155241 151757 387749 288121 85538 -130487 -225099 -73641 42637 188876
17265 188876 252640 102121 165558 261835 84512 58299 67461 123632 249784 109376 -22053
17254 -22053 -18162 34513 75611 138484 241944 320589 118486 -54345 -148450 -344714 -314603
17243 -314603 -104859 30927 116549 131437 187424 105314 -35900 -7256 -61928 -94872 -156681
17232 -156681 -170696 -213553 -198537 -142427 43610 42870 -77748 -145222 -214586 -90612 -17748
17221 -17748 17089 155129 108570 106591 54423 77162 109233 -13548 6160 1964 29425 230046
17209 230046 253191 162251 -4442 -57334 -115330 -145032 -52656 -52321 34048 12988 -13989 62840
17197 62840 76209 81988 -57605 -60041 41191 69581 76223 -123056 -136905 8811 46634
17186D6634j0265j3884j8074j00010l4225K25506j06974m0913R9850J4945j17111
17175e4521q2835J22966j3226m9701n4229m839J71549k3659q964k8083j6430J38004
17163I6032O847l3515j5585j11577j63187l955m8415M1350J53676O9130q7014
17152i6213p0969j30167J22518J14683R9261J04915m0416j08235J27695J7466
17142A40538j0995j06581q1374J09674q4150j23510L1593p224Q0660J17685M0180
17131A06496J909O4413K8034O744k5377j06252J6975p5950l7457m974k0480k52
17119d6171J14815M6655o9039l7264r4997q3346J40804K016j13966J3187J11910
17108a5396J59988l6068p4888p7802n3153K7143O59J13571J32584J12059l2168
$$ plain form
17186 46634 36369 22485 4411 -95599 -129824 95682 -11292 -52205 47645 62590 -54521
17175 -54521 -137356 -14390 -27616 -77317 -131546 -136385 35164 11505 2541 -25542 -41972 96032
17163 96032 102879 69364 53779 -57798 -220985 -224940 -273355 -232005 -78329 -9199 -96213
17152 -96213 -167182 -297349 -174831 -60148 39113 144028 103612 -4623 123072 140538
17142 140538 129543 22962 -58412 51262 -32888 -156398 -124805 -132029 -51369 66316 106496
17131 106496 108405 172818 200852 207596 182219 75967 92942 16992 -20465 -25439 -45919 -46171
17119 -46171 68644 115299 46260 8996 -86001 -169347 -28543 -26527 -140493 -127306 -15396
17108 -15396 144592 108524 33636 -44166 -97319 -70176 -69517 44054 176638 288697 256529
17097B56529j43716k07318j22226K00807P8546l4617J9175L8362P6460o2056m463
17086I5483L4535j36837j34061N6956L3178j22364j41628K8557j2184M4959J93370
17075f0036K3740k18288j0961K2566m5830K57369P6139m5883J3182k40276k53429
17064d81707J57174J99427L1517R4062j20898K0413J56268K9151j4076j73992
17054a02661J63229m9668J60354R1568R3459k8261j73540k94402o3610J24183
17044g9349J10389P0398J4767J50558j8119j9936n7832j44232l5160q4569n7952
17033a51037L8376J79314L8342Q917n3868n7177J1983o1602N3342O0863o7182
17022B71j06537N5601J63486J12953q3712k25115p4833M5779J9918o3930J8887
$$ plain form
17097 256529 112813 -94505 -216731 -15924 62622 28005 47180 85542 162002 99946 95483
17086 95483 130018 -6819 -140880 -83924 -50746 -173110 -314738 -286181 -298365 -253406 -60036
17075 -60036 -36296 -254584 -265545 -242979 -288809 -31440 44699 -1184 11998 -228278 -481707
17064 -481707 -324533 -125106 -93589 473 -120425 -100012 56256 85407 71331 -102661
17054 -102661 60568 10900 171254 262822 356281 328020 154480 -139922 -203532 -79349
17044 -79349 31040 101438 116205 266763 248644 228708 170876 26644 -8516 -93085 -151037
17033 -151037 -112661 66653 104995 113912 60044 2867 14850 -46752 6590 67453 271
17022 271 -106266 -50665 112821 225774 142062 -83053 -157886 -112107 -92189 -156119 -137232
17011a37232n3468j15688J1234K34844P5537q1373Q8507j73870L5961L7994N0878
17000b6676j2142P6456o8068j5347j28533J17323R416L4796r266N9600o3730j37189
16988a63360l6683J76620J39542P3487O9334k44110k47336J13211K95160J71808
16978C47673k10300j47583o5735k3022j13419K0187M9122L3257N5525n2194L600
16967a02889J41193J12981l4321j73162J02722M9519j59867N8987n4174l6276
16957i5287M6719P9894O9155l0321O1410J2841p7824o1404j38883N3342P7634
16946b724l0790R6573l6411M5974Q7695l2985j76040j55801j03856j00015m1316
16935d49696J84977K27170l0862O1331q846q877J1036J06498q1420Q118l5530
$$ plain form
17011 -137232 -190700 -306388 -295154 -60310 15227 -66146 22361 -151509 -115548 -77554 -26676
17000 -26676 -38818 37638 -30430 -45777 -174310 -56987 -47571 -12775 -22041 37559 -26171 -163360
16988 -163360 -200043 -23423 116119 189606 258940 14830 -232506 -119295 175865 347673
16978 347673 137373 -10210 -75945 -98967 -212386 -192199 -143077 -109820 -54295 -106489 -102889
16967 -102889 38304 151285 116964 -56198 46524 96043 -63824 -4837 -59011 -95287
16957 -95287 -48568 31326 100481 70160 131570 144411 66587 5183 -133700 -80358 -2724
16946 -2724 -33514 63059 26648 72622 160317 127332 -48708 -204509 -308365 -408380 -449696
16935 -449696 -264719 -37549 -68411 -7080 -15926 -24803 -13767 92731 11311 19429 -16101
16924a6101K2756j06399j18300K5591O3455N6771k9019j786J92753J18130k07115
16913G36M0488O9640m6888R6415q3673q0387P4583R8887o0313j75848O8039J05280
16901A06959M9995l9670k7311j7603j01991J85954o40q3744m4682j92702p7070
16890b42505J13806L17035N7456k1851j26628n4216n6000m8274J6382N4244L4214
16879D3663o0233J6544o5982N3633J73426m2058m4147n3844J14355M12q5577k34173
16867a83981O8194K3757j14939N6849m8698O0260Q6390J6253j12820j74459N5092
16856b68102Q7107K2844J0617J35802l0903r5495j6348O7911J82324Q2643j65882
16845A2518k19857j36200Q9048J35456R3331l125j52423n7452J88430r93k2147
$$ plain form
16924 -16101 6655 -99744 -218044 -192453 -128998 -72227 -101246 -103032 89721 207851 736
16913 736 41224 110864 63976 160391 76718 -3669 70914 169801 109488 -66360 1679 106959
16901 106959 156954 117284 89973 72370 -29621 156333 155693 71949 27267 -165435 -242505
16890 -242505 -128699 188336 245792 223941 97313 43097 -12903 -61177 -44795 9449 43663
16879 43663 -16570 -26 -66008 -12375 161051 118993 74846 21002 135357 135769 50192 -183981
16867 -183981 -115787 -92030 -206969 -150120 -198818 -138558 -52168 -35915 -148735 -323194 -268102
16856 -268102 -180995 -158151 -147534 -11732 -42635 -138130 -154478 -86567 95757 178400 12518
16845 12518 -207339 -343539 -254491 -119035 -25704 -28829 -181252 -238704 -50274 -51267 -73414
16834g3414j2969Q6391K20264j34290k25776n7483P6263M2482k1405q5137p5180
16823b60254j964J42261N7453Q6901K0810J25868j37387j79764L0650K43723N5176
16812A83473j03372n268j55031j6904p2156K4687r5874O4670L1102L6493L6189
16801g1991j0908p933J24788j65958p3325J08309l2996p3586q9328Q1456R1446
16790a20026M2305R7184l8115j77331M2864L8355J6526J11429Q3713Q4622j3947
16779A67579k7192R106L6199o4916p2922m4646j15436r5657q1633k45044K5169
16768e09393J39207J25573q064J56058O7538o0654M7043o8217j95343q5397M2262
16757c49387J74919P0125o2461l2018J88129Q3781q5189p6493Q8594J64403J87613
$$ plain form
16834 -73414 -86383 8 220272 85982 -139794 -197277 -121014 -78532 -99937 -185074 -260254
16823 -260254 -262218 -119957 -62504 24397 45207 171075 33688 -146076 -115426 128297 183473
16812 183473 80101 74833 -80198 -97102 -169258 -144571 -240445 -175775 -144673 -108180 -71991
16801 -71991 -82899 -90832 33956 -132002 -205327 -97018 -130014 -203600 -292928 -211472 -120026
16790 -120026 -77721 19463 -18652 -195983 -153119 -114764 -98238 13191 96904 181526 167579
16779 167579 140387 149493 185692 120776 47854 3208 -112228 -207885 -289518 -534562 -509393
16768 -509393 -370186 -244613 -252677 -96619 -29081 -89735 -42692 -110909 -306252 -391649 -349387
16757 -349387 -174468 -104343 -166804 -198822 -10693 73088 -12101 -88594 0 164403 352016
16746C52016k0616k16471p0471o1863M7550j04249j8471o4044Q0856J27493K0500
16735G2230Q6764l7634j04448m34p0210l7655r0338R4400J25678j40759L9333
16724f3073J13996j61946j86091k4146O0788J89515Q1083j43536j67301O970N5894
16713b37847O4836P8875J90818j38287o2431j24467j0562J27578p146L200P9728
16702c5705P4246r6081j94732m0218O6560P1778Q5998N4704K9341O5174J12535
16691A93600j27803j89005r282R7964J42018n1864J03053J23777N5222L8322j08664
16680B67338r3556J603K6347k04796j39430K42148J53712j1538j11210n3545R6123
16669A73196J06571O1461J7220k16880j28575R5825n1041P7892j24318o8286m1470
$$ plain form
16746 352016 331400 114929 44458 -17405 30145 -74104 -92575 -156619 -75763 51730 72230
16735 72230 158994 121360 16912 16478 -53732 -91387 -181725 -87325 38353 -102406 -63073
16724 -63073 50923 -111023 -297114 -321260 -260472 -70957 10126 -133410 -300711 -293741 -237847
16713 -237847 -173011 -94136 96682 -41605 -104036 -228503 -239065 -111487 -118633 -115433 -35705
16702 -35705 38541 -57540 -252272 -292490 -225930 -154152 -68154 -13450 15891 81065 193600
16691 193600 65797 -123208 -132490 -34526 107492 55628 158681 282458 337680 376002 267338
16680 267338 173782 175385 201732 -3064 -142494 99654 253366 241828 130618 77073 173196
16669 173196 279767 341228 358448 141568 12993 108818 57777 135669 11351 -56935 -98405
16658i8405R1229o1213j49958q5128R3987J19971J09828L1551R0594O4273L4454
16647B41183P5025J5457k26037l66767m7772J30303J15416N8357K6715K0458o2011
16636a9673K4366k00879P6056L7239O0731Q5742O986O4574m1897j25793j29477
16625a62025M4180O3187q3946j65548o2179j8060K0161Q5496J09978J42012N384
16614b1360O2702J55744p8851j90767J46701q3917j34638k07p3540M2707Q7297
16603h8129j29518l7450J52312Q733N8235j32885j20697r3861Q9971P4949J44699
16592g3641q2917Q6929K34838j55272k07819k46626J9416J68847J97447N4375
16582d423O287O5362j10998J1760p7064J39942O2151m4016m63j68674P3265N6352
$$ plain form
16658 -98405 -7176 -68389 -218347 -303475 -209488 -89517 20311 51862 142456 206729 241183
16647 241183 316208 331665 105628 -261139 -308911 -178608 -63192 -4835 21880 42338 -19673
16636 -19673 4693 -196186 -120130 -82891 -22160 63582 70568 135142 93245 -32548 -162025
16625 -162025 -117845 -54658 -138604 -304152 -366331 -384391 -364230 -278734 -168756 -26744 -21360
16614 -21360 41342 197086 118235 -72532 74169 -9748 -144386 -144593 -218133 -175426 -88129
16603 -88129 -217647 -255097 -102785 -94052 -35817 -168702 -289399 -383260 -293289 -218340 -73641
16592 -73641 -156558 -69629 165209 9937 -197882 -444508 -425092 -256245 -58798 -4423
16582 -4423 1864 67226 -43772 -32012 -109076 30866 93017 49001 48538 -120136 -46871 9481
16570I481N8929o6979J3827J5740J06684l17312L4579K09076J10857L7591o6140
16559A46333j26049m5008m5686K45425o6549j03928m427J36753P9550o2980j57733
16548d299q4345m3164L1330L7165j8620r6834l8314M7278J76162r2160L4045K29136
16536A77380p7988K6181J40581j41297j1267O3157o5378r3806j09799N841N131
16525h1264Q9721j9524J07571p0007l14452P733K98703K07584K94j59116j90919
16514a23676k6168j2623M7836M2341N0702R9031O7917m6847j24885O3664L4542
16503G1834K4546J030k2287j22869r345P3637L510l4251k2524O445M0237P9173
16491H9136K900N906j42993N88P2548j10303k1676k6472M1416K9153R0761j31097
$$ plain form
16570 9481 68410 1431 15258 30998 137682 -179630 -145051 64025 174882 212473 146333
16559 146333 20284 -24724 -70410 175015 108466 4538 111 136864 216414 153434 -4299
16548 -4299 -88644 -131808 -100478 -63313 -81933 -178767 -217081 -169803 6359 -85801 -51756 177380
16536 177380 99392 125573 266154 124857 113590 176747 111369 17563 -92236 -86395 -81264
16525 -81264 8457 -11067 96504 26497 -287955 -280222 18481 226065 226359 67243 -123676
16514 -123676 -149844 -162467 -114631 -72290 -21588 77443 145360 98513 -26372 37292 71834
16503 71834 96380 97410 75123 -47746 -57091 16546 20056 -14195 -36719 -30274 9963 89136
16491 89136 92036 97942 -45051 -44463 28085 -82218 -103894 -130366 -88950 -59797 30964 -100133
16479a00133J8976j1830O7901J67927R304m2485J82M7815n8546n9741j94733k2536
16467a77899M3831J22929K15977r080r5055m2999k0092j50237R3215R1042p5079
16456c447m5065p1347J97178K15266p7692j54750j4181m1336J32174M3789p1035
16445A09554M8103l418j57436j7360O3797J00653O7015Q8990j4274j03266k01149
16434a8791j00794K1998j10831J6419m1366R741O2568L6682J7017m3476J29144
16423b1689J10411j1435N2093R2811j27378o2933q9412j0794j4909p442J26318
16412C5641j13119j64058J02183J43256j18445M8154R4988j57231j10077K30278
16402h430l9631p5081L9998K7330j14042p2965J80352R4536k3093M8964O5368
$$ plain form
16479 -100133 -81157 -92987 -25086 142841 152145 109660 109842 157657 99111 39370 -155363 -177899
16467 -177899 -134068 -11139 204838 195758 100703 57704 37612 -112625 -19410 71632 -3447
16456 -3447 -48512 -119859 77319 292585 214893 60143 45962 4626 136800 180589 109554
16445 109554 157657 154239 -3197 -20557 43240 143893 210908 299898 285624 182358 -18791
16434 -18791 -119585 -97587 -208418 -191999 -233365 -223624 -161056 -124374 -107357 -150833 -21689
16423 -21689 88722 77287 129380 222191 94813 31880 -57532 -68326 -83235 -90677 35641
16412 35641 -77478 -241536 -139353 3903 -114542 -66388 28600 -128631 -238708 -8430
16402 -8430 -48061 -123142 -83144 -55814 -169856 -242821 -62469 32067 8974 57938 123306
16391A23306m4987l10r2072j3508l4820l2749p9284k7585o956q4393K6119O6108
16379b01131P5072n085j5389J13369J60605n3056n9718o2816J1910j07835O3693
16368h0381N6282O839n281R1475j356l1448j27648R1765R7671o0943J44646N92
16356A82213o0775p5655l2509J52246J26075K4076k23045p4594J79549N9583j24185
16345A32979j14130j32853j73245L8790J11699O4550l8706q9347J0741J9875L9795
16334a29852j15787J0611R8895k5113l00169Q8412L23873N6610J8656K19024K03626
16323D48786j22681k18695k27491N4756l0931J23922K08038N9817J27458j86330
16313B36649j75107r2193m8404n9380L9520J21982P8915J7115l2627P2491M8223
$$ plain form
16391 123306 78319 78009 -14063 -27571 -62391 -95140 -174424 -202009 -208965 -293358 -267239 -201131
16379 -201131 -126059 -131144 -146533 -33164 127441 74385 14667 -48149 -36239 -144074 -80381
16368 -80381 -24099 -17260 -22541 68934 67578 36130 -91518 247 97918 36975 181621 182213
16356 182213 121438 45783 13274 165520 291595 315671 92626 18032 197581 257164 132979
16345 132979 18849 -114004 -287249 -248459 -136760 -72210 -110916 -200263 -189522 -169647 -129852
16334 -129852 -245639 -235028 -136133 -161246 -461415 -373003 -49130 7480 26136 245160 448786
16323 448786 326105 107410 -120081 -65325 -96256 27666 235704 295521 422979 236649
16313 236649 61542 -30651 -79055 -138435 -98915 23067 101982 119097 86470 158961 207184
16302B07184L5350J4469j20489j47295K9005q1670o7274q3062J33922O3879o063
16291b2044L6140p2564r7022P5141J5157P7917J8015j22892j3401R1401N9592
16280D5440j10l9411J7627N1508m4754n3968j39918j00038k0353j13331j42132
16269e39440J03740J66051J22309N4692n9435K39950O4060r7625K3848r701J0047
16258G8496K1872N4139j17675j20162J43417J77312N0592q2040m6095j57284j15824
16247a13252p0816P9616L4235J25556n6302j84189j13218O4216q4645p6371J29890
16236b65280N6636M8580L26973L9964m0526n6109j15695o4145M8846J40095M8155
16225A67494k75859o9626J40766o6988r0963K09446K25321o7349o7829Q8716j65640
$$ plain form
16302 207184 242534 257003 136514 -10781 18224 -63446 -130720 -213782 -79860 -15981 -22044
16291 -22044 14096 -58468 -155490 -80349 -65192 12725 30740 -92152 -105553 -14152 45440
16280 45440 45330 5919 23546 75054 30300 -23668 -163586 -263624 -283977 -397308 -539440
16269 -539440 -435700 -269649 -147340 -92648 -152083 87867 151927 54302 78150 68449 78496
16258 78496 100368 154507 36832 -83330 60087 237399 287991 205951 159856 2572 -113252
16247 -113252 -184068 -104452 -70217 55339 -963 -185152 -298370 -234154 -318799 -395170 -265280
16236 -265280 -208644 -160064 166909 206873 166347 110238 -5457 -69602 -20756 119339 167494
16225 167494 -108365 -177991 -37225 -104213 -195176 14270 239591 172242 104413 193129 27489
16214B7489j6506P9615Q279r583L9421j17969j4237K2845j21021l4084l3881P5627
16202i4005L1525J43981l7497M6726j22728j10590k3822O2969J69683J98860j0414
16191B54688p711l3771l10741j64840J61360K17552Q2554m2829o766j23289k09090
16180a82883j59440n7044K50446J347O5237K1404j08218Q2631K9607r0272j18606
16169b65791M6936K8714J76198L4553q6663K2169J14245J89026j97674k78334
16159b16621q5696R0031J8829K2777n0479o2820L8461J05490K6962p8925N3277
16148a38714J20339o5002j89934L2060j1178N0435J73381K28111O4841k02461
16138F1878k7206j43443Q5632L7272l4811o8977K7118m8360m2126L8999j28963
$$ plain form
16214 27489 10983 90598 98877 89294 128715 10746 -3491 19354 -101667 -135751 -169632 -94005
16202 -94005 -62480 81501 44004 90730 -31998 -142588 -166410 -103441 66242 265102 254688
16191 254688 246977 213206 -97535 -262375 -101015 116537 199091 156262 149496 26207 -182883
16180 -182883 -342323 -399367 -148921 -147574 -82337 -60933 -169151 -86520 -56913 -147185 -265791
16169 -265791 -218855 -190141 -13943 20610 -66053 -43884 70361 259387 61713 -216621
16159 -216621 -302317 -212286 -193457 -170680 -221159 -283979 -245518 -140028 -113066 -191991 -138714
16148 -138714 -18375 -83377 -273311 -241251 -252429 -201994 -28613 199498 264339 61878
16138 61878 34672 -108771 -23139 14133 -20678 -89655 -62537 -110897 -153023 -114024 -242987
16127b42987o3176Q3531K6469J26703J44818J07889J33001j05049j6207j97017
16117b025j04249M1797n540o7874p9542J81148J86428O9255l0993j69879J45131
16106A63657L8128j15719O3204O1722j81099J3035R2923K2079p2606J23051J42066
16095C50441m468k18380k43887P1785K03730o848o8117p1439J0246r8624q9724
16084a65285l1930L9202K3041J53277J17660k0099j27823J660J30785k7460l7284
16073E5744j04939j1187J41283N6651O0447P435l7420j25461j44619n2707p5719
16062b30492R8637J0488j25243k5742J55134J08895n907n7744l6037j1475J64899
16051D5413K3398j67311j40693M8917j5038J69354q7903p3493N1252M3593P2282
$$ plain form
16127 -242987 -306163 -222632 -196163 -69460 75358 183247 316248 211199 194992 -2025
16117 -2025 -106274 -64477 -70017 -137891 -217433 -36285 150143 219398 188405 18526 163657
16106 163657 201785 86066 149270 210992 29893 42928 135851 157930 85324 208375 350441
16095 350441 345973 127593 -116294 -44509 159221 152373 84256 12817 23063 -75561 -165285
16084 -165285 -197215 -158013 -134972 18305 135965 115866 -11957 -10297 120488 93028 55744
16073 55744 -49195 -60382 80901 137552 197999 205434 168014 42553 -102066 -154773 -230492
16062 -230492 -131855 -121367 -246610 -272352 -117218 -8323 -14230 -71974 -108011 -119486 45413
16051 45413 68811 -98500 -239193 -190276 -205314 -35960 -123863 -197356 -146104 -102511 -30229
16040c0229P0927N0595o8324k7657p7236j48821N5222L37600J650O4534J0401
16029B38662K2853L3463n1478j13566j95488j44318l8739O2775J08116J03869
16019B6149J09567N0743k0826O1382j03257q3925j1153L5595n9792j0617P6976
16008G0842J20319j17622k74527J58460J24577Q4477j10216p1709K6572J09521
15998A20694q6269j05003j14869K27956J29553j57128O5263M9442o2343m7537
15988A9759n5128j49090o336Q5295J32954J25433o0353o3354k1460q9731j08446
15977a90457L1463O5349J8950N8831k01269j49399O4173K50494J09019j21183
15967f4029j34667m5346K02077K517O388k06974L5536R2639r9507j81070q2225
$$ plain form
16040 -30229 40698 91293 22969 -4688 -81924 -230745 -175523 162077 163727 228261 238662
16029 238662 261515 294978 243500 129934 -65554 -209872 -248611 -185836 -77720 26149
16019 26149 135716 186459 165633 227015 123758 39833 28680 64275 4483 -6134 70842
16008 70842 191161 73539 -200988 -42528 82049 166526 56310 -15399 11173 120694
15998 120694 34425 -70578 -185447 42509 172062 14934 80197 129639 67296 19759
15988 19759 -35369 -184459 -190795 -105500 27454 152887 92534 29180 7720 -82011 -190457
15977 -190457 -158994 -93645 -74695 -15864 -217133 -366532 -302359 -51865 57154 -64029
15967 -64029 -198696 -244042 -41965 -39448 -33060 -240034 -204498 -111859 -211366 -392436 -474661
15956d74661P8058J10485K4579K23188J44733j37024k33878L072J13489J91550
15946D3591L8155Q5806k12035j40527j2676r84m7838M6078n7140j36919J02704
15935b91785J61362J42259L5755J54230K2384R9714j04629m3015l0457o4737L4617
15924A15698J56779M6375j47780k10400o228O2946P50q0283K7478K52239j26317
15913I1257k98228p3350O2538k0363o1375L46313K20294k5942j08201p8456L2910
15902H7397j21767r6926o7679N3981R4460P6646P3328q1436q5158J5915M0202
15891a1037j01451j92177o2531J80189J87516L8243r0148q8499K0796J01167R627
15880h305o0475K7421n902L0081J92891n9316j91768j05083l486m6169n608O1959
$$ plain form
15956 -474661 -396603 -286118 -261539 -38351 106382 -30642 -264520 -261448 -147959 43591
15946 43591 81746 167552 -44483 -185010 -197686 -198670 -246508 -200430 -257570 -394489 -291785
15935 -291785 -130423 11836 47591 201821 224205 323919 219290 176275 145818 81081 115698
15924 115698 272477 318852 171072 -39328 -45556 17390 18140 -62143 -34665 217574 91257
15913 91257 -206971 -280321 -217783 -238146 -299521 46792 267086 241144 132943 54487 87397
15902 87397 -34370 -131296 -198975 -144994 -50534 26112 99440 18004 -67154 -51239 -11037
15891 -11037 -112488 -304665 -367196 -187007 509 38752 -51396 -139895 -119099 -17932 -8305
15880 -8305 -68780 -41359 -47261 -17180 175711 116395 -75373 -180456 -183942 -230111 -235719 -173760
15868a73760N550P5990m3302O3351P3922j806m6750p0106J47613R0022k07410
15857h6686k75292P8248J27670J03064r936j17637r1071p3791J17530J38883j8681
15846a07699K078l3911K6156j12264M3822P7426O0895J0390L6330l8490J0347
15835b4920K70282J62510M0580j24936j83126k46113j50912J09867R1448J72882
15825A17562k7742l167r3136Q9503J12397j18714j9903p9205n6551q0115o7433
15814b26504L0043J75320J34005Q2648o1861o5028J9102J32789N874j292j04354
15803A20742j32296p037R6392Q8577k9264k91704R9658k3083j67282j5940M4564
15792b16673N0348J13632k4094Q3268j48535J02125M8868o0717L5030J30740j00223
$$ plain form
15868 -173760 -168210 -92220 -135522 -72171 1751 -55 -46805 -116911 30702 120724 -86686
15857 -86686 -361978 -283730 -156060 -52996 -62932 -180569 -271640 -345431 -227901 -89018 -107699
15846 -107699 -105621 -139532 -113376 -225640 -181818 -104392 -43497 -33107 3223 -35267 -24920
15835 -24920 245362 407872 448452 323516 140390 -105723 -256635 -146768 -55320 117562
15825 117562 89820 86653 -6483 83020 195417 76703 56800 -22405 -78956 -159071 -226504
15814 -226504 -196461 -21141 112864 195512 133651 68623 87725 220514 226388 225096 120742
15803 120742 -11554 -18591 77801 166378 137114 -154590 -54932 -78015 -245297 -261237 -216673
15792 -216673 -166325 -52693 -76787 6481 -142054 -39929 8939 -51778 -16748 113992 13769
15781A3769l22765k23351O6735J94915P3810N1535R9232L8469J8381o257k42177
15770b37704j0951k9321R8773J09483J39616L9688n6879j20554j54383o876J54224
15759g4884r9974l8761N4243M6970J79737o4404Q9226n2939J34444R373o7659
15748A15372m4829j90360M4534R8488o4917o699O2465j17990j07998n205K19210
15737B071N5753j2971J62166k778k8386j05716j2366l5434j1106P6882j34231
15726d6116j17356Q1247J6166Q410j43587o8245k7072M6101J10022M4851m4343
15715a39922N9417J69308j9096j20229n9234J2362N8270k30011j38149K2919n5848
15704d40213R7982m0941J23741J19624J90394J09155M3463q8454o6105j15485
$$ plain form
15781 13769 -308996 -532347 -465612 -270697 -196887 -145352 -46120 -7651 10730 4473 -237704
15770 -237704 -248655 -277976 -179203 -69720 69896 109584 52705 -67849 -222232 -229108 -74884
15759 -74884 -174858 -213619 -159376 -112406 67331 2927 92153 39214 173658 183031 115372
15748 115372 70543 -119817 -75283 23205 -41712 -48411 14054 -103936 -211934 -217139 2071
15737 2071 57824 44853 207019 204241 175855 70139 57773 22339 11233 88115 -46116
15726 -46116 -163472 -82225 -66059 -57649 -201236 -269481 -296553 -250452 -140430 -95579 -139922
15715 -139922 -80505 88803 69707 -50522 -109756 -97394 -39124 -269135 -407284 -384365 -440213
15704 -440213 -342231 -383172 -259431 -139807 50587 159742 203205 114751 48646 -66839
15694f6839j64181l5253J53720J52346j91882j07528R9180n8433l2990j39394
15684c91254N6606O7659K35993J90988K9315m8348n7056r5646l3966R5431k6665
15673B3057n6595R6842j00008j50664l7718L8087O5457l8701j14873j52913J51538
15662b76491J62289M7827k6567J9527j8138r2639J63181Q5183M5918j11706n4264
15651e5880K23609Q9486j95037o8502L795j7737j49054l695P5785J06367O8006
15640G7143l2265o5528n2866j4762Q0764J43364L8559m7276j2513p2432q5794
15629d3606M7119l1473O6091O663J38964P838j6603l6004q2916k7344p0482p106
15617d8859j0394r9950j4000J70987l743j64366J59455J09644n2998L7746L6489
$$ plain form
15694 -66839 -231020 -266273 -112553 39793 -152089 -259617 -160437 -218870 -251860 -391254
15684 -391254 -334648 -266989 -30996 159992 189307 140959 83903 -11743 -45709 49722 23057
15673 23057 -33538 63304 -36704 -187368 -225086 -186999 -121542 -160243 -275116 -428029 -276491
15662 -276491 -114202 -66375 -92942 -73415 -91553 -184192 -21011 64172 110090 -1616 -55880
15651 -55880 167729 257215 62178 -6324 -2529 -20266 -169320 -173015 -97230 9137 77143
15640 77143 44878 -20650 -73516 -88278 -7514 135850 174409 127133 114620 42188 -43606
15629 -43606 3513 -27960 38131 44794 183758 191596 174993 138989 56073 28729 -41753 -48859
15617 -48859 -59253 -159203 -173203 -2216 -5959 -170325 -10870 98774 45776 83522 120011
15606A20011r3140O001m768q5095n9523N3377r811J3420j36123r8147N2119J86516
15594e5163L2050o0665r0791j1574J03978K45495J38569l4965k3005M8957q6787
15583B06099O750j22410l1512l2327r1845q9583N9258J80213j9148N0049p091
15572A08453N4412J35756r7762N54P6887j70163j0120M8854j62674j33384j31482
15561b80669J3689J85384K1146j74423m2400K2607J32386K07907N8567K3104Q3336
15550B50634K5742j29475j10143P7150N6677O5896J06625j87926j32327j14728
15540i1875K2935l058J30003J40009q7046k4432o1564P3607J48368q2367o881
15529A57699j97019j42872o328L7291k9042L0364K20471l1864o5660Q5479l945
$$ plain form
15606 120011 26871 32872 28104 -56991 -116514 -63137 -72948 -59528 -195651 -293798 -241679 -55163
15594 -55163 -23113 -83778 -174569 -186143 -82165 163330 301899 266934 243929 292886 206099
15583 206099 212849 90439 58927 26600 -65245 -154828 -95570 84643 65495 115544 108453
15572 108453 162865 298621 200859 201413 278300 108137 98017 146871 -15803 -149187 -280669
15561 -280669 -266980 -81596 -60450 -234873 -277273 -254666 -122280 85627 144194 167298 250634
15550 250634 276376 146901 36758 113908 170585 236481 343106 155180 22853 -91875
15540 -91875 -68940 -71998 58005 198014 110968 86536 24972 98579 246947 164580 157699
15529 157699 -39320 -182192 -188520 -151229 -180271 -149907 70564 38700 -26960 58519 54574
15518E4574M1066j06203j45732m9547P97J74279r7179N826k1748r0503l2297Q3455
15506a83212N8646p0936n519M4145J3339J03845P1099O470k00515j46894Q2828
15495b26704J95092n2819j4741Q1084q0910J76432J18810O9015N9287K077o2423
15484B64200j55173r3891j942K3424p903j03726l3264R901P7325j15748j46713
15473b83510Q6790P3401K6828L9644J37227J48855q1117m1122k6247j24605M1219
15462b637L2321j0161j44363M22Q1304L9363K9309k2678j3306j00566j07622N1281
15450a67333q0963M9293J17717J57542J12731j19764j86593K465Q522J08227p1241
15439f9397L9768P2358j81797P500P2445K8822L8685k3147q1926j56220k05904
$$ plain form
15518 54574 95640 -10563 -156295 -205842 -205045 -30766 -127945 -122119 -143867 -234370 -266667 -183212
15506 -183212 -124566 -195502 -201021 -156876 -143537 -39692 31407 37877 -162638 -309532 -226704
15495 -226704 -31612 -84431 -99172 -18088 -98998 77434 196244 265259 324546 326623 264200
15484 264200 109027 15136 13194 36618 28715 -75011 -108275 -98374 -21049 -136797 -283510
15473 -283510 -196720 -123319 -96491 -56847 80380 229235 148118 106996 80749 -43856 -2637
15462 -2637 29684 19523 -124840 -124418 -43114 -3751 25558 2880 -10426 -110992 -218614 -167333
15450 -167333 -248296 -199003 -81286 76256 188987 69223 -117370 -114905 -106383 1844 -69397
15439 -69397 -29629 42729 -139068 -131568 -59123 -30301 8384 -14763 -96689 -252909 -458813
15428d58813N6331J87821R9659M3209N0437R26j07882K8057m7498n0962K7081
15417a71634J09143J12303j61192j41460J89056M2465m6681n8185p0155N288O9481
15406a21571K1391j48416p1872N7090K0216J09588K7180J1255j1191J47697K36743
15395B78110k0794j65408p6075m6077P1815J30572j8736n0759j55266k9349J77677
15384I5710K6257Q3856p0343R1327j35338j38563q4498j04952J08364J99616J13021
15373A84457j03144L1706j26840m4603N4239J72715j14536j45602j72159k974
15363b66741J06555j21486j13148Q8027J17931J55050N3382M4293j09864j44575
15353a90576l465q7682l596P8978l3679O6117N5354n7656R2712L9916l9053Q8076
$$ plain form
15428 -458813 -402482 -214661 -115002 -71793 -21356 -20430 -128312 -100255 -147753 -198715 -171634
15417 -171634 -62491 49812 -111380 -252840 -63784 -21319 -68000 -126185 -196340 -191052 -121571
15406 -121571 -100180 -248596 -320468 -263378 -243162 -133574 -106394 -95139 -106330 41367 278110
15395 278110 257316 91908 15833 -30244 41571 172143 153407 102648 -52618 -81967 95710
15384 95710 121967 205823 135480 226807 91469 -47094 -131592 -236544 -128180 71436 184457
15373 184457 81313 113019 -13821 -58424 -4185 168530 53994 -91608 -263767 -266741
15363 -266741 -160186 -281672 -394820 -306793 -188862 -33812 19570 63863 -46001 -190576
15353 -190576 -194041 -281723 -285319 -206341 -240020 -173903 -118549 -176205 -83493 -43577 -82630 5446
15341E446P7956j7828R6349N4197o9609q4745O2222K2778j518j82266P3745R6846
15329A33573o7435j07591k810l3998k2694K18607J01753Q2170k00675n2579o3666
15318a5345o6968m9417Q7020O7332L427k6137o1275M663J61808R3664k6198J59329
15306C31903o1478j29148p0147p3204N1427n7361j45200k8228p344J2510N6953
15295a19317O9292m6207R0000m2172M6240n4489q2986N4720O0303m3302Q1160
15284A3242J87209L3180m6457L06R8156m5589o1273j24293J5127J42791q226n2173
15272A52000k7034o7202K8430J17377Q7529l2324k01745j49591j9667J96406L197
15261H7376J2204j53594L628K6268M0408R1686j7270L9754p1731j73241p1253
$$ plain form
15341 5446 83402 65574 161923 216120 146511 61766 123988 146766 145248 -37018 36727 133573
15329 133573 66138 -41453 -44263 -78261 -100955 117652 219405 301575 100900 48321 -15345
15318 -15345 -82313 -131730 -44710 22622 26049 -88 -61363 -56700 105108 198772 172574 331903
15306 331903 270425 141277 71130 -2074 49353 -8008 -153208 -181436 -188780 -176270 -119317
15295 -119317 -50025 -96232 -6232 -48404 -2164 -56653 -139639 -84919 -24616 -67918 13242
15284 13242 200451 233631 187174 187480 285636 240047 178774 54481 69608 212399 204173 152000
15272 152000 124966 57764 86194 203571 291100 258776 57031 -92560 -112227 84179 87376
15261 87376 99580 -54014 -50386 -24118 16290 107976 90706 130460 58729 -114512 -185765
15250a85765K6919J73281p7831n5743J32723N0771J95302Q7100K7000L3417n0850
15239C56324n1243p1111j90950j24837J84057l3967o2178r0586J75682j32880
15229d1689j62193K00148K50284M1991j12536k00193R7345L2313j68030P3164
15219A0604L1027j9745n7445M3867K8265Q8893J0991O9360M7537Q3413o5112L5193
15207C06848j40360l3826m3860q9560P0101j7498p2116r6475j5025k7456J21433
15196c7794l6370j70J35748J4083M0999Q6849N6294j30838r9984m1327j23229
15185a35739m8213m3787J063O7450P2812M3474m3837R2632J2103k9881l9918q2240
15173a34081r2838O5481J91952O3970Q031J6846j29686n7414Q8579K007P075l1588
$$ plain form
15250 -185765 -158846 14435 -63396 -119139 13584 64355 259657 346757 373757 407174 356324
15239 356324 305081 233970 43020 -81817 102240 68273 6095 -84491 91191 -41689
15229 -41689 -203882 -3734 246550 288541 176005 -24188 73157 105470 -62560 10604
15219 10604 41631 21886 -35559 8308 36573 125466 136457 205817 253354 336767 271655 306848
15207 306848 166488 132662 88802 -758 69343 51845 -20271 -116746 -131771 -159227 -37794
15196 -37794 -74164 -74334 61414 75497 116496 203345 259639 128801 28817 -12510 -135739
15185 -135739 -183952 -227739 -226676 -159226 -86414 -42940 -86777 5855 17958 -11923 -51841 -134081
15173 -134081 -226919 -161438 30514 94484 102515 119361 -10325 -67739 20840 22847 29922 -1666
15161a666L8014Q0105k4657k67882J8386L62353L00336O2186j27870j07737n3884
15150B77684j82654Q813j06033m6840K2948o0246j43822M3509Q8553m8935n9256
15139b06279J82395J54326r0782k31368N0672J05333J20902J35499Q601Q2797
15129C12096k03325k06902p4325L3201n9762O2442J13224p279J43918n7016j40613
15118h4341j01698j8983O0261m796M3805J1823J51405J78761O991n7230r6787
15107H9211K4855R530M5544j69636j75363J54089q41j0983Q0249N9479J37706
15096B43840k0249l19268k32042k0570J10151N9358J02130O2286j6687l6139J56177
15085H8987M7335j21738p9532o1355o1143o3464R1966K33378L3133J0831n037
$$ plain form
15161 -1666 36348 116453 91796 -176086 -157700 204653 504989 567175 439305 331568 277684
15150 277684 95030 103843 -2190 -49030 -26082 -86328 -230150 -186641 -98088 -147023 -206279
15139 -206279 -23884 130442 39660 -191708 -141036 -35703 85199 220698 229299 312096
15129 312096 108771 -98131 -172456 -139255 -199017 -136575 -23351 -30630 113288 56272 -84341
15118 -84341 -186039 -205022 -144761 -149557 -105752 -93929 57476 236237 243228 185998 89211
15107 89211 114066 123596 169140 -496 -175859 -21770 -22611 -33594 46655 106134 243840
15096 243840 223591 -95677 -327719 -348289 -238138 -178780 -76650 -14364 -31051 -67190 88987
15085 88987 136322 14584 -64948 -126303 -187446 -250910 -158944 74434 107567 118398 113361
15074A13361n7112J720J03702j6248j36630j47993r3800j17291k1146p3332J19047
15063c25722K29178J67037j57663R7001Q7170P8446N2956j13646K4278m0102k2920
15052G6013N0757j87786j59070m278K4857k0775O5000J82048J130j82145j64219
15041c18468n0955P5530R3950J90251N6882n6804o5509m4640K8841O9856n265
15030b6331J09065R830j77646k8852J22176K11127L9685j63291n7858N6216M2041
15019A36162P2687K3280j8350M7902L6800o9573m6806L9740P4374j04545j114
15008A90557L7431p9826j81298R4284M374k26630l9879Q1267J72262M6863p3820
14997B5585R2810j7468j80781j4178q5590J27669k6918J23504J38028k9593o581
$$ plain form
15074 113361 56249 57969 161671 145423 8793 -139200 -233000 -350291 -371437 -444769 -325722
15063 -325722 -96544 70493 -87170 9831 97001 175447 228403 114757 139035 98933 76013
15052 76013 126770 -61016 -220086 -224364 -199507 -220282 -155282 26766 27896 -154249 -318468
15041 -318468 -369423 -293893 -199943 -9692 47190 -9614 -75123 -119763 -90922 -21066 -26331
15030 -26331 82734 92564 -85082 -113934 8242 219369 259054 95763 37905 94121 136162
15019 136162 208849 232129 213779 261681 298481 228908 182102 221842 296216 191671 190557
15008 190557 227988 148162 -33136 61148 65522 -161108 -200987 -119720 52542 99405 25585
14997 25585 118395 100927 -79854 -94032 -179622 -51953 -78871 44633 182661 153068 146487
14986A46487k6313q1110p4545j72294p0934J70364J82800J26987J02139k05366
14976I8215k03170N6068J36277J61829P086K34j5808p8710J458P980j17822R7430
14964A51067j08016q4099k8990J46J6074Q6414K86614J53360j6578j92600j43665
14953A19727j13054j51211j1563l3508J31069J80123m2870j0381p1724j6055n5834
14942g5281R147J1188j81848l913K12929p071n1544m4253j6041l0135J29873Q418
14930c8531j43295R8185J75441K6364J57945j0806o9355O2659R513k16492j62675
14919a11047J24211J54185n8160q3682p4714J8193j5747l7116Q3365J47859r10
14908A46437m6166j31121l7859l5740j54015j29924K00624M3496J31504N0381
$$ plain form
14986 146487 120174 39064 -35481 -207775 -278709 -108345 74455 201442 303581 98215
14976 98215 -104955 -48887 87390 249219 256305 256539 240731 162021 163479 171459 53637 151067
14964 151067 43051 -41048 -70038 -69892 -53818 32596 319210 472570 455992 263392 119727
14953 119727 6673 -144538 -156101 -189609 -58540 121583 78713 68332 -3392 -19447 -75281
14942 -75281 -66134 -54946 -236794 -240707 -27778 -34849 -86393 -130646 -146687 -176822 -46949 -38531
14930 -38531 -181826 -83641 91800 118164 276109 265303 195948 258607 268120 51628 -111047
14919 -111047 13164 167349 109189 25507 -49207 -31014 -46761 -83877 -512 147347 146437
14908 146437 100271 -30850 -68709 -104449 -258464 -388388 -187764 -144268 -12764 37617
14898C7617p1784j09712L7363m3381j52793Q7185K48426l8852j24103M5220J95026
14887A10212L4578k13832l386N8241K7536j51945r7741O9285q2718N3952J67239
14876b8579P7920k8903k22567P1654R7288J13227Q0551j98087L9161j52713M5168
14865a05880P250j22694L3659P0560L9391J32748m0183J1880r4028o217Q0787
14854G273r224o7897o2821J19789J39535j6984k1828m9875j26592r6905K03295
14843A7766J70537N5424j16936O3402J75625l6561j34689p4297N9007L1581o3744
14832A47115J2373P5493J15114K7257o0539j15816n7927k8096P7941J9151j56255
14821E5811q7354Q0541k6208q4027J50895n7027k7406O2572l0322p7783R3873
$$ plain form
14898 37617 -34167 -143879 -106516 -149897 -302690 -215505 32921 -5931 -130034 -84814 110212
14887 110212 144790 -69042 -72428 -14187 13349 -138596 -236337 -167052 -249770 -195818 -28579
14876 -28579 49341 20438 -202129 -130475 -33187 80040 160591 -37496 1665 -151048 -105880
14865 -105880 -98630 -221324 -187665 -117105 -77714 55034 14851 26731 -67297 -73514 7273
14854 7273 -1951 -69848 -132669 -12880 126655 109671 87843 37968 -88624 -185529 17766
14843 17766 188303 243727 126791 190193 365818 329257 194568 120271 179278 210859 147115
14832 147115 159488 234981 350095 377352 316813 200997 143070 114974 192915 212066 55811
14821 55811 -31543 48998 22790 -61237 89658 32631 5225 67797 37475 -40308 53565
14810E3565N4521o7359Q958K08660N7300k33387k30989q0993j15941R8784J65441
14799h1440K2522l0003J84530q6148j01132j3244K01701J66335K4500K3659n8974
14788B52306J20955k02588k67678j6794L08961n7557k29608j12265J04993j1822
14778a11097r7776J7037P2516j751L4319R5356J53849Q8350K4957r3604J234k73521
14766i0131l26692j0235P3333K7859R507J10481J75675N0314j19784j72719Q3820
14755a88572Q1142R0956k1115k92R9534L6986L2424J4984q5570j14210j08485
14744a62218N2695J05220j04973L1952J98125N9279j35818M0710q5288k9222J09994
14733H0456J63955j3357l075j86065J7486N8563o2770j47177r8546N1063J01173
$$ plain form
14810 53565 108086 40727 49685 258345 315645 82258 -148731 -229724 -345665 -246881 -81440
14799 -81440 -58918 -88921 95609 9461 -91671 -104915 96786 263121 287621 311280 252306
14788 252306 373261 170673 -97005 -113799 195162 137605 -92003 -204268 -99275 -111097
14778 -111097 -208873 -191836 -119320 -121071 -86752 8604 162453 250803 275760 182156 183390 -90131
14766 -90131 -416823 -427058 -353725 -325866 -316359 -205878 -30203 20111 -99673 -272392 -188572
14755 -188572 -107430 -16474 -37589 -37881 61653 98639 131063 146047 60477 -53733 -162218
14744 -162218 -109523 -4303 -109276 -77324 120801 180080 44262 84972 -316 -29538 80456
14733 80456 244411 231054 227979 41914 59400 117963 55193 -91984 -190530 -139467 -38294
14722c8294j4942J9160K8691o8172K48116J1247j50579j31236j46800j41646M8986
14711c35469J75357N0493j0280J33103N8913J17767N9040k24022r059M4436L2934
14700I3213J037j19557M3263J17261J17606j58848P1739P7217o2455p0026j65020
14689e4570m0237J36207J89213Q9106k4873k16824q1188m2610n4523p3613J4995
14678a58917J6487M9822J63758M0880j43279k7797j39252o5520K67926n3391J1134
14667c8149J47983J02680k1769n7027o3463k54194P828J29374J00242J15649j70072
14656i18j76286J8626j8867o6570L0925J02307J24954M4105l8510n4335j61062
14645a95631o9817P151R2074J94083l095j32257o1279n9824R5507R7550j20986
$$ plain form
14722 -38294 -53236 -34076 -5385 -73557 174559 185806 35227 -96009 -242809 -384455 -335469
14711 -335469 -160112 -109619 -119899 13204 72117 189884 248924 24902 15843 60279 93213
14700 93213 94250 -25307 17956 135217 252823 93975 165714 242931 180476 110450 -54570
14689 -54570 -94807 41400 230613 319719 294846 78022 -3166 -45776 -100299 -173912 -158917
14678 -158917 -142430 -92608 71150 112030 -31249 -59046 -198298 -263818 4108 -49283 -38149
14667 -38149 109834 212514 190745 133718 70255 -183939 -176111 -46737 53505 169154 -918
14656 -918 -177204 -158578 -177445 -244015 -213090 -110783 14171 58276 19766 -34569 -195631
14645 -195631 -265448 -258297 -166223 27860 24765 -107492 -168771 -228595 -133088 -35538 -156524
14634a56524m1996K7915J72924K3978q1879O36k3355j43115J61461K08401l4473
14623A13973q4029J1621j21055j21623j40620q9161N6751J37536r168L3449K4755
14612a87571m7706N6718N0040l1719m9420j4763R9727J11901m4508j3885o7875
14601a39061j2013l5746k3272J5167J00067J2937j4406J331l190p2524n9313j17979
14589c48002o1989J18997J80682q6769j67121L4303L0210K1843O9290J12829K3178
14578g2549p7650J8209J43323N5960L7994j74889n793J06746r7234k15313n686
14567b86882J45405K1394N4781q7346R1000J54947Q2461j57702q1498Q1573M902
14556B3035j5328K8169J4359n9215l6076n9042K9496K15830J20950j50901j86568
$$ plain form
14634 -156524 -198520 -170605 2319 26297 -55582 -54946 -78301 -221416 -59955 148446 113973
14623 113973 29944 41565 -79490 -201113 -341733 -430894 -374143 -236607 -245775 -212326 -187571
14612 -187571 -235277 -178559 -128519 -160238 -209658 -224421 -124694 -12793 -57301 -71186 -139061
14601 -139061 -151074 -186820 -210092 -194925 -94858 -81921 -96327 -94996 -98186 -170710 -230023 -348002
14589 -348002 -409991 -290994 -110312 -197081 -364202 -329899 -299689 -277846 -208556 -95727 -72549
14578 -72549 -150199 -131990 11333 67293 105287 -69602 -75395 31351 -65883 -281196 -286882
14567 -286882 -141477 -120083 -65302 -152648 -61648 93299 175760 18058 -63440 18133 23035
14556 23035 7707 35876 50235 -8980 -45056 -104098 -74602 141228 262178 111277 -75291
14545g5291n8572j69201j38588K00589J49171P8140p07j93246k25047M1848O7864
14534c23040K52116J19357K4836j56659N9991Q3780o9289r0367l0372R9825J28605
14523I8783N6710L0367p3647R2699M2452j22006K2169m6308L9679P6126K1668
14512B38692J98472o241l25957j34782r295J12169J29908k7657o8565q3953n6556
14501c3765m4258n3038m6411J76319J33056q1855k51401n4500l9607p4255O7218
14490c02497J18008K37743R7092k02922R1952P967j03626j67194j817m9433J13832
14479a60895K1782P7938O4079L172L2247j9334Q9306k447j76051r0704r9766l6157
14467b96830N1370J86132J77265J06193l1798l0235J0529j8490r7516P5985n2308
$$ plain form
14545 -75291 -133863 -303064 -441652 -241063 -91892 -13752 -14459 -207705 -432752 -390904 -323040
14534 -323040 -70924 48433 73269 -83390 -23399 60381 -8908 -99275 -129647 -29822 98783
14523 98783 155493 185860 112213 204912 247364 125358 147527 101219 140898 217024 238692
14512 238692 437164 430923 104966 -29816 -39111 73058 202966 175309 106744 22791 -33765
14501 -33765 -78023 -131061 -177472 -1153 131903 50048 -201353 -255853 -295460 -369715 -302497
14490 -302497 -184489 53254 150346 -52576 39376 47343 -56283 -223477 -225294 -274727 -160895
14479 -160895 -139113 -61175 2904 6076 38323 18989 108295 105848 -70203 -160907 -260673 -296830
14467 -296830 -245460 -59328 117937 224130 192332 162097 172626 154136 56620 132605 80297
14456H0297j42360j84586N3631J74014J21273q995j20241l2585O6756N8800n0776
14445A5228q6514O0365R6483O4387J2309l6756R7872k46609k1620j8654Q6545
14434B3036r632J0381n097l62l4352K9211L9512J7141J52090n1470l37022J2410
14422a54154P999M964M5654N8032J160j4153J9791j36496j19103p9616j39993
14411e05915J81869P1631J6338J14816L9648J33383L9290M0977J58941m0551j02456
14400A47971o6301o0119M5844J31811r0486j5447J681j5643J812j00978j69984
14389a89839M0476J23221Q1491n9133j6461p4510q9022j10407m4112n6166K44868
14378a49594J3604k9896J74660Q9852j52016Q3630o9798r8790P011L2190Q589
$$ plain form
14456 80297 -62063 -246649 -193018 -19004 102269 93274 -26967 -59552 7204 66004 15228
14445 15228 -71286 -10921 85562 149949 162258 125502 223374 -23235 -44855 -63509 23036
14434 23036 13404 23785 18688 18326 -16026 13185 52697 69838 221928 170458 -166564 -154154
14422 -154154 -146155 -141191 -95537 -37505 -36345 -50498 -30707 -167203 -286306 -365922 -505915
14411 -505915 -324046 -252415 -236077 -121261 -81613 51770 91060 132037 290978 250427 147971
14400 147971 81670 21551 67395 199206 108720 93273 94954 79311 81123 -19855 -189839
14389 -189839 -149363 -26142 55349 -3784 -20245 -94755 -183777 -294184 -338296 -394462 -149594
14378 -149594 -135990 -165886 8774 98626 -53390 30240 -39558 -138348 -131337 -99147 -90558
14367i0558J02672m6797N8277m7307r1865J39398O2291O0060j7913j42139j30066
14356a43947M7719R2522o3635o4480N5967j6180P6642O4804Q3318J64822Q2550
14345C80102j65493K0968l8429j46659j8345p3579j04689m090o7354Q879k9283
14334b37972J20553J79712P0143j0645J2473O5883r7336q0432O9342P875J36153
14323B35749n877j25374k03276R8575M4586j02136J306K8292p1191L9092J90400
14312A30146L065r9240r7767J3794K468o6307J140O5879p8527r3177J31681O1776
14300b5069r8807o0881O0145N8981J6971j63225K479P4729j47775j77488J39941
14289c19999J66320J05774Q9491J80409K4174j11183O9593J22427J1375p8581
$$ plain form
14367 -90558 12114 -34683 23594 -23713 -115578 23820 86111 146171 128258 -13881 -143947
14356 -143947 -96228 -3706 -67341 -131821 -75854 -92034 -15392 49412 132730 297552 380102
14345 380102 214609 235577 197148 50489 32144 -41435 -146124 -150214 -217568 -208689 -237972
14334 -237972 -117419 62293 132436 121791 134264 200147 102811 22379 91721 99596 235749
14323 235749 229872 104498 -98778 -203 44383 -57753 -56447 -28155 -99346 -60254 130146
14312 130146 133211 33971 -63796 -50002 -47534 -113841 -112701 -46822 -125349 -218526 -86845 -25069
14300 -25069 -123876 -184757 -124612 -65631 -48660 -211885 -209406 -134677 -282452 -459940 -319999
14289 -319999 -153679 -47905 41586 221995 246169 134986 204579 327006 338381 259800
14279B59800P3411j40609j80174l0862Q7905L7725p7588J53020o2267p5542j56267
14268a11448k316N9472k4299q247J06566J95139J39469J05110n6420j42173j02976
14257A57877j28192M66J4134r4563l3288m0247k0384P2561Q1062j25365j22370
14246b38309J12227J84258n4198j13298j49125P8195K04724R951m780Q5279n0399
14235F4525j83678q2273j06287L0979J67246J36918N2270j06774j05112K67183
14225A34997J33208j33925m0955J32217r9292p008l4243j06085k07369k1060k6721
14214b76236J07907l3582M2618M6065n1236P1220O8099j54725n0455J88124K53475
14203B11274r283r7771M2081q7187K2273j83945O1356k4024L6852N3200M7700
$$ plain form
14279 259800 333211 192602 12428 -18434 69471 107196 29608 182628 120361 44819 -111448
14268 -111448 -113764 -54292 -78591 -86838 19728 214867 354336 459446 403026 260853 157877
14257 157877 29685 30151 44285 -50278 -83566 -123813 -144197 -71636 9426 -115939 -238309
14246 -238309 -126082 58176 3978 -109320 -258445 -180250 24474 34425 29645 114924 64525
14235 64525 -119153 -201426 -307713 -276734 -109488 27430 79700 -27074 -132186 134997
14225 134997 268205 134280 93325 225542 126250 119242 84999 -21086 -228455 -249515 -276236
14214 -276236 -168329 -201911 -159293 -113228 -164464 -93244 -25145 -179870 -230325 -42201 211274
14203 211274 201991 104220 146301 59114 81387 -102558 -41202 -65226 -28374 24826 72526
14192G2526j81288j30537P8855J80120o345r7422M4603R2428q8974l2481J94529
14181A26014J40998M9644m3639j28957q3036N0461J9970O1225j53562n7814N7579
14170C8883O1931J1914P1837p8040j40003j99689Q5063J41119l5193j1071q5958
14159a39207k02849P4040J03963P2416j20533N6981J52657j13436J48673L5933
14149F8638P696j06970J54550L0454j92035n7129L8107J2632o7867L576m5490
14138a53838m8591Q489J849n8857l4796k3973L5158J43090J96450J76212j45531
14127I5662j13106M9183J60192m1454j46152k40707P6186N7000L604J7877m9497
14116a31212M215J76010J00222m4032j1059Q8609n1344k24404m0008K29876J0697
$$ plain form
14192 72526 -108762 -239299 -160444 19676 13331 -84091 -39488 52940 -36034 -68515 126014
14181 126014 267012 316656 273017 144060 61024 111485 131455 192680 39118 -18696 38883
14170 38883 100814 112728 184565 106525 -33478 -233167 -148104 -6985 -42178 -53249 -139207
14159 -139207 -342056 -268016 -164053 -91637 -212170 -155189 -2532 -115968 32705 68638
14149 68638 76334 -30636 123914 154368 -37667 -94796 -56689 -44057 -111924 -108348 -153838
14138 -153838 -202429 -193940 -192091 -250948 -285744 -309717 -274559 -131469 64981 241193 95662
14127 95662 -17444 31739 191931 150477 4325 -236382 -160196 -103196 -99592 -81715 -131212
14116 -131212 -126997 49013 149235 105203 94144 182753 131409 -92995 -133003 96873 107570
14105A07570l08412j21476K96917O3246M3288K3102r1587P4678m3890q4228o5356
14094a06148r8324K3905o4986J75214J45498q66j49411j24467l3100M5497J81611
14083e577J553K19365j5442j22646r2943n5170m4318l5457L2518J58424J24364
14072A64671m3557r3349L9881k5587q0353J04673L550K3418p2710j18219J9043
14061g8539M7190l8910J15536k132J5119o6266k7281N9362q0043j95276P8421
14050a72819J00811L07874R5505r4771q6015j78850P758m3296K4884J28931M4702
14039A34714r1566J5309P555o117Q6479K358M8513q9102l14224p4192L6219K49824
14027E770Q8353q5327J1069r9248j36421J12616J37485J26200j2478j98505l8191
$$ plain form
14105 107570 -200842 -322318 -25401 37845 81133 104235 12648 87326 43436 -40792 -106148
14094 -106148 -204472 -180567 -245553 -70339 75159 74293 -75118 -199585 -232685 -187188 -5577
14083 -5577 -4024 215341 199899 77253 -15690 -70860 -115178 -150635 -118117 40307 164671
14072 164671 121114 27765 67646 42059 -38294 66379 69929 93347 20637 -97582 -78539
14061 -78539 -31349 -70259 45277 43145 58264 -8002 -35283 24079 -55964 -251240 -172819
14050 -172819 -72008 235866 331371 236600 150585 -28265 -20507 -63803 -38919 90012 134714
14039 134714 43148 58457 66012 59895 146374 148732 197245 108143 -206081 -280273 -244054 5770
14027 5770 94123 8796 19865 -79383 -215804 -103188 34297 160497 148019 -50486 -88677
14016h8677l4264J17736K7565m4963J10691L9354L8657J29640J11862r1453n6866
14005B59282r2832j27183m1467J75467j564p739p8047o7207K53133M47340M19258
13994A138441J06292k66861k38650r4735j71138k45033o8465K7570k9802M2382
13984B00001N6227o8475j33953l9152J22534k2716m4534p8106K0589q0185p3126
13973a40896P0759J26373P923j20686m6331o3579J32083L975k42983j18282J58878
13962b32766J03599L8211J18832q731n4953R7302K167R3207R6228J49780K58435
13951F61311L32117R8391m3891j82331j46437j75447r6205j46979j16251j76607
13941G671J2265J8859J9871N9162J88257l2523j50654r5253k8452r9532Q4779
$$ plain form
14016 -88677 -122941 -5205 22360 -22603 88088 127442 166099 295739 407601 316148 259282
14005 259282 166450 39267 -2200 173267 171703 163964 85917 18710 271843 719183 1138441
13994 1138441 1244733 977872 739222 644487 473349 228316 159851 187421 157619 200001
13984 200001 256228 187753 53800 14648 137182 114466 69932 -8174 12415 -67770 -140896
13973 -140896 -70137 56236 64159 -56527 -102858 -166437 -34354 -30379 -273362 -391644 -232766
13962 -232766 -129167 -90956 27876 19145 -35808 61494 63661 156868 253096 402876 661311
13951 661311 993428 1091819 1047928 865597 719160 543713 447508 300529 184278 7671
13941 7671 19936 38795 58666 117828 306085 273562 122908 27655 -797 -100329 -15550
13930a5550M6627q5566k41535L742J30604j49578p653J15047K08131J00533O669
13919A11471q1943j577K8637j68183m7544l5059O0126j1527p5406J10009P1622
13908c9374k6269J32620K44584k5515p1557j70851j58059j6139p5845K10893J39826
13897A44314J73342J8758k41377r3502j24785l9388l0709J35835q205p2581J30487
13886g811Q5226j97638J0868Q4276o9371K0163J03894j70191J1092k0401l1252
13875a81145P2708J48210J81301o4486r3214R5639K2928j99347m0835q0162r5854
13864b34257j20317p6292J4099J26973J42016N7386J4154m9390N4627K59855R5370
13853B84224m1475q0967k9411N8766j45092j06662J30582R5035p3804j58182p0971
$$ plain form
13930 -15550 31077 -54489 -296024 -292282 -161678 -311256 -318909 -203862 4269 104802 111471
13919 111471 29528 27951 56588 -111595 -159139 -194198 -134072 -145599 -221005 -110996 -39374
13908 -39374 -65643 66977 311561 286046 214489 43638 -114421 -130560 -206405 4488 144314
13897 144314 317656 336414 95037 1535 -123250 -162638 -193347 -57512 -65717 -138298 -7811
13886 -7811 77415 -120223 -109355 -25079 -94450 -74287 29607 -140584 -129492 -149893 -181145
13875 -181145 -108437 39773 221074 156588 63374 159013 181941 -17406 -58241 -138403 -234257
13864 -234257 -354574 -430866 -416767 -289794 -147778 -90392 -76238 -125628 -71001 188854 284224
13853 284224 242749 161782 132371 191137 46045 -60617 69965 165000 91196 -66986 -137957
13842a37957j01175j27732J04074Q13j5153J85876J23701n0368M9743j11512m1519
13831a21209K16955L8447q7676O8617J740j12586n3922j06706l8837n357J20162
13820h0372R3562n3534j79854p952Q7362P2794P5771J0968j39678j40416N7183
13809b04166M55M899n206M5881J65969O8258p8795O6218J22704j6111q5234m4795
13797D0077J1507L0376j30216M4781J09488L5412q1664M0118J15783j03721k38656
13786a26715O5227K24850L9888N9972P3064J34739o0171j37939k6555R41K0835
13775B68136k9356r4249n7443l710j47047k29821p5207Q8667J76185m584l9907
13764a48336j7101J68339K6477k3774j11843j06011O236L1759P7187J40173P188
$$ plain form
13842 -137957 -239132 -366864 -262790 -261977 -277130 -91254 32447 -17921 31822 -79690 -121209
13831 -121209 95746 134193 46517 115134 116874 4288 -49634 -156340 -195177 -200534 -80372
13820 -80372 13190 -40344 -220198 -228150 -140788 -67994 7777 18745 -120933 -261349 -204166
13809 -204166 -203711 -198812 -204018 -158137 7832 76090 -2705 63513 186217 170106 84872 40077
13797 40077 51584 81960 -48256 -3475 106013 141425 59761 99879 215662 111941 -126715
13786 -126715 -61488 163362 203250 263222 336286 471025 410854 272915 246360 247301 268136
13775 268136 238780 144531 87088 83378 -63669 -293490 -368697 -280030 -103845 -108429 -148336
13764 -148336 -165437 2902 29379 5605 -106238 -212249 -206013 -174254 -97067 43106 50294
13753E0294Q1541j30841j57638R6745J26982M2842o3371k3563J2357k18034j03969
13742b86655j7508N1616J1029J1929J23847J85884p484j33345j10918l4673N5688
13731a50590J18193r5483M7353Q8722K0507M4915q2145j62735p2676J53309K36032
13720A45402l007l3796P0498M7449m6934l9076p0930J8111M8676J34802j5754
13709B55441j91766r1016k9975m6730j26129l255J1576P9812j12610R8311P6750
13698g9591J78160J77105J4681k09192l07543j536J27487m8641j79255k6073J46429
13687b07969J72699J75867p3206k12137p4125J43330N9327P0153j11917J04436
13677D6458M0556m0115m5596j81135O362Q2085m3250L8009R769J03339k0590j15091
$$ plain form
13753 50294 131835 994 -156644 -59899 67083 109925 46554 22991 35348 -182686 -286655
13742 -286655 -304163 -252547 -241518 -229589 -105742 80142 72658 -60687 -171605 -206278 -150590
13731 -150590 -32397 -127880 -80527 8195 28702 73617 -8528 -171263 -243939 -90630 145402
13720 145402 142395 108599 179097 226546 179612 140536 69606 87717 136393 271195 255441
13709 255441 63675 -27341 -57316 -104046 -230175 -233430 -221854 -142042 -254652 -156341 -79591
13698 -79591 98569 275674 290355 81163 -226380 -227916 -100429 -149070 -328325 -354398 -207969
13687 -207969 -35270 140597 67391 -144746 -218871 -75541 -16214 53939 -57978 46458
13677 46458 87014 46899 1303 -179832 -173470 -91385 -134635 -96626 -86857 16482 -4108 -119199
13665a19199K47677L85303J12645l24155k70030R2475Q1789n6205O1597J03143
13655C15040j08208j44484K5971N7997q1150q2982n316M0580q451j55219j21687
13644b67909J22418J5952J56030O0724N9168j23136J2858n1889J18518O7691j41294
13633B9131k1986j38681L7748j0681j1252j12802R9806m4296J27315J59461n332
13622A08431p4303n2025P707O7627Q4544L3441L4733N4383M6812r7558Q6700J29060
13610D29552j16367q0757Q0806J63794m3727j21687M0722Q4117l4517R0520o4752
13599D27704j04954j850M0565J9718Q4716M0362J41138K11225K74977L30912M41161
13588A905674M63116N60745P40010O91605P64150J192990J792002K590175M702846
$$ plain form
13665 -119199 128478 513781 626426 302271 32241 124716 206505 150300 211897 315040
13655 315040 206832 62348 88319 146316 65166 -17816 -23132 17448 8997 -146222 -267909
13644 -267909 -145491 -129539 26491 87215 146383 23247 36105 -15784 102734 170425 29131
13633 29131 7145 -131536 -93788 -104469 -115721 -228523 -128717 -173013 -45698 113763 108431
13622 108431 34128 -17897 -10190 57437 141981 175422 210155 264538 311350 213792 300492 429552
13610 429552 313185 232428 313234 477028 433301 311614 352336 436453 401936 492456 427704
13599 427704 322750 320900 361465 381183 465899 506261 647399 858624 1133601 1464513 1905674
13588 1905674 2368790 2929535 3669545 4361150 5125300 6318290 8110292 10700467 15403313
13579A5403313Q215694J3348411J7133967J1599718k295405j2807605j4724663
13572C5873430j1147972o988772m403192k632293j633144j032233r42189q68741
13564F224894p67972o82165n82049l32793l56066l51904j92419P3790j01398n4038
13554B877880K1179j4591M7600K89902J76307L42369M04482K34302M36608N12957
13544E328995O68104J047976J571694J767319K102389K364459L434295N120312
13536B3405543P878393J3147759K2885182L9194182N6102169M5758123j762453
13529B06608898m1725091n0192052l7712003k3102542j3856537q553814n506512
13522B5960347l717749k825373k186382k087686k241039j782424j572052j175056
$$ plain form
13579 15403313 23619007 36967418 54101385 65701103 63405698 50598093 35873430
13572 35873430 24725458 17736686 13333494 10701201 9068057 8035824 7093635 6224894
13564 6224894 5456922 4774757 4192708 3859915 3503849 3151945 2959526 3033316 2931918 2877880
13554 2877880 2899059 2884468 2932068 3221970 3398277 3740646 4145128 4379430 4816038 5328995
13544 5328995 5997099 7045075 8616769 10384088 12486477 14850936 18285231 23405543
13536 23405543 31283936 44431695 67316877 106511059 162613228 208371351 206608898
13529 206608898 164883807 114691755 76979752 53877210 40020673 31466859 25960347
13522 25960347 22242598 19417225 17230843 15143157 12902118 11119694 9547642 8372586
13514H372586p41001m54083n03911m19901l21814k70263j15033k57713p5175K97043
13504E510735O7174J31545K24226L18458L21061O41171J121449J505172J703806
13495A1544797K052590K612131L304004M911990P683430J2745827K2169320L7806668
13487A04830757N5632772M9720131L230551m0084856n1911244m0456508k5160880
13480E5800723j4713313q897489n756234l894468k903779k347825k273504k247738
13472A2766373j944841j248871j133224j077886q00611n51040l80065l80516k94833
13463D954486l05973j59767q5302p3204m6188o5062j31424M8511J40274J64485
13453D440836P0693K31400N96236O15355P90402R91512J826447K677734M228216
$$ plain form
13514 8372586 7631585 7177502 6673591 6253690 5931876 5661613 5546580 5288867 5213692 5510735
13504 5510735 5577909 5709454 5933680 6252138 6573199 7214370 8335819 9840991 11544797
13495 11544797 13597387 16209518 19513522 24425512 32108942 44854769 67024089 104830757
13487 104830757 160463529 210183660 213414211 173329355 121418111 80961603 55800723
13480 55800723 41087410 32189921 26433687 22539219 19635440 17287615 15014111 12766373
13472 12766373 10821532 9572661 8439437 7361551 6560940 6009900 5629835 5249319 4954486
13463 4954486 4648513 4488746 4403444 4330240 4284052 4218990 4087566 4136077 4276351 4440836
13453 4440836 4511529 4742929 5339165 5954520 6744922 7736434 9562881 12240615 16468831
13444A6468831P146909J2100052J7279138J5058603J972547j1431471j5947851
13437D2646758j3345579q741884n382106l342157k082059j362635j042807q23265
13429F524266q50025q92779n82677n01588l81589m62594l96500j61913l67271
13420A927330j33266j02503j14093j92515l8891O5320r8532p2968j22101j69736
13410I48045J8041J34191j1004j80159j41204n0707q4870M5502k4251j73274M8441
13399E28751J69342q7515p3024N7924Q1358j5903l6944o4754j64708n6436k9811
13388C08280L6839K15814K2632q8693r4138n7896k0427J7113o9119L3093N5579
13377C59077J9701k3418j68232Q559k4900K6649J85260J10089o8460m5717R9951
$$ plain form
13444 16468831 23615740 35715792 52994930 68053533 70026080 58594609 42646758
13437 42646758 29301179 20559295 15177189 11835032 9752973 8390338 7347531 6524266
13429 6524266 5674241 4781462 4198785 3697197 3315608 2853014 2456514 2294601 1927330
13420 1927330 1794064 1691561 1577468 1384953 1346062 1411382 1312850 1239882 1117781 948045
13410 948045 966086 1100277 1089273 909114 767910 717203 632333 677835 653584 480310 528751
13399 528751 698093 610578 537554 595478 676836 660933 623989 559235 394527 338091 308280
13388 308280 345119 560933 583565 494872 400734 342838 322411 339524 270405 303498 359077
13377 359077 378778 355360 187128 195687 170787 197436 382696 492785 424325 378608 478559
13366D78559J41739j27997k91686j05945L9873J79296L9817j8252j45744l10077
13356a20417J8132J49149P7784o472J12313P6939o0823l9566j7325n0562j3370
13345A25782j22910P63J14965J7366J21094J8736M7989m7978j1470j05709p4757
13334H3871K2567J42981j04612J36531Q0585q9129o5204Q4564n6928J2144O0292
13323C07662M3558K6375n1473j27938n9725R5696K25821r3671n3136j19892n4307
13312A38970K8538n793M178J1527R998m5310p9710j64884Q1678N5216J42913O0405
13300B37726j76508j01796L29p1929O519m1029p4036N1172P1169N5806J16633
13289G4056l1829N0865J33661K8070j11151J02412r7145p1710p2229j10066p4170
$$ plain form
13366 478559 620298 492301 200615 94670 134543 313839 353656 335404 189660 -120417
13356 -120417 -102285 46864 124648 118176 230489 307428 246605 207039 189714 139152 125782
13345 125782 2872 3635 118600 135966 257060 275796 323785 275807 264337 158628 83871
13334 83871 106438 249419 144807 281338 361923 272794 207590 292154 235226 247370 307662
13323 307662 351220 377595 326122 198184 138459 234155 459976 366305 313169 193277 138970
13312 138970 167508 161715 165893 177420 187418 142108 62398 -102486 -20808 34408 177321 237726
13300 237726 61218 -40578 -40249 -112178 -105659 -146688 -220724 -169552 -98383 -42577 74056
13289 74056 42227 93092 226753 254823 143672 246084 148939 77229 5000 -105066 -179236
13278a79236L4884O9368J8675j2741n352R631j4129r257J70235q2930P0019J02349
13266A71516P2799n4588q0958o4280M8906J1799j97421O8882P2036k6090j5117
13255G484R0532R8128O668L3061n1678j8420j40568j76556q0733Q8926K41378
13244I8222J1020J2933q9177j66382J2254J78341J10133M7561o5284K5545r8326
13233G6840M1078o6507l621J37323J68470k72811j69686k8761J04665m3608j32950
13222a89568L609J45697j5487n5364L4361j0977J84483Q4062L4259J68464K10895
13211E94434k7849k10401k59538j09617j19513m333p4539Q0591J20470N0487q1124
13200d0932L6884R4532J23671k1679p2410m6831J12570n2176j37256O9079M8172
$$ plain form
13278 -179236 -144352 -74984 -56309 -69050 -74402 -64771 -78900 -88157 82078 -852 69167 171516
13266 171516 244315 189727 108769 44489 93395 105194 -92227 -23345 48691 22601 7484
13255 7484 98016 196144 202812 235873 184195 165775 25207 -151349 -232082 -143156 98222
13244 98222 109242 122175 32998 -133384 -121130 57211 167344 214905 149621 175166 76840
13233 76840 117918 51411 47790 185113 353583 80772 -88914 -117675 -13010 -56618 -189568
13222 -189568 -185959 -40262 -55749 -111113 -76752 -87729 96754 180816 215075 383539 594434
13211 594434 566585 356184 96646 -12971 -132484 -136817 -211356 -130765 -10295 40192 -40932
13200 -40932 -4048 90484 214155 192476 120066 73235 185805 133629 -3627 65452 113624
13189A13624k61224k0921J12124P5545J84245k2261P068R6608j66484j82430O2038
13178b068J15518M7062Q7858q7340k02706J1739K78164M1120p8406n3927K1134
13167A78148j10317k06092l2080J9688O7954O4523Q7996M7212J42547k1309j90502
13156D7768j14548J12042p5880P2085J28908K7708j78771p1209q9931q2525K49042
13145B4689J19362j23280p6574J7449P0283J01101J22791j09968n914J19605M5920
13134C05464P265J0573J15197K18554K4411M8938J53553p1615j7611L3284j21206
13123G06807j45150q0315j24138J3814p1825n9909j42094Q1041J53224o3688O1965
13112C29732J24737k4976n3536J6803J05547K34756P7218O4566J89244O1477k8949
$$ plain form
13189 113624 -147600 -168521 -56397 19148 203393 181132 188200 284808 118324 -64106 -2068
13178 -2068 113450 160512 248370 161030 -41676 -29937 248227 289347 210941 157014 178148
13167 178148 67831 -138261 -170341 -150653 -82699 -18176 69820 117032 259579 238270 47768
13156 47768 -66780 45262 -30618 41467 170375 198083 19312 -51897 -141828 -224353 24689
13145 24689 144051 20771 -55803 -38354 31929 133030 255821 145853 139939 259544 305464
13134 305464 312729 323302 438499 657053 681464 730402 883955 812340 794729 828013 706807
13123 706807 561657 481342 357204 371018 299193 239284 97190 178231 331455 267767 329732
13112 329732 454469 429493 375957 392760 498307 733063 810281 874847 1064091 1125568 1096619
13101A096619p1595N736L5470J50188K1916m2875J04645j3788O0562l35606r0846
13090I20426r0000j40008k14686j03045m5239J12679K20995j99526k93880J66794
13080C34510J71529P0015k14774q4267R4530L2501R752J32608Q6716r4411J42724
13069F81433K42659J3070J00160L01093R4110j73574j18838k3069J40874P2492
13059A330410J49341Q0976l01734k42570l63444k01975k5989j35776j49122j4136
13049A25981J8537M6612j1127R6128m2679j86992k2114o505J9562k4196j55149
13038a41942M7660n9659K329J27189l0828q6381R724J68267L0428J0279o2831
13027A4235Q9201J01621K3418n7327M2584M4898j52554o0384o0427J4788J01891
$$ plain form
13101 1096619 1025024 1030760 1066230 1216418 1238334 1195459 1300104 1286316 1346878 1011272 920426
13090 920426 830426 690418 475732 372687 327448 440127 661122 461596 167716 334510
13080 334510 506039 576054 361280 277013 371543 404044 413796 546404 633120 538709 681433
13069 681433 924092 937162 1037322 1338415 1432525 1258951 1140113 1117044 1257918 1330410
13059 1330410 1479751 1560727 1258993 1016423 652979 451004 425015 289239 140117 125981
13049 125981 144518 191130 180003 276131 233452 46460 24346 17841 37403 13207 -141942
13038 -141942 -94282 -153941 -151612 -24423 -55251 -141632 -131908 36359 66787 77066 14235
13027 14235 103436 205057 228475 171148 213732 258630 106076 45692 -14735 53 101944
13016A01944K20230L23558K94666J76760j58633j99356k84818l14743k08021k5112
13006g3525k081j1979j69465K0376N4749K3001O1986P6995R7007k0279q0945M4440
12994B0280q0707J7031Q4608j37124j52657J41845Q8664J25785P5642j08988J292
12983G5671n4074J46203j2896j48168L4413J51936J62584k9119k08157P4407N7271
12972B50071N939j95581l1502J77411J01406K7572N9486j49348j79339j95196
12962a29081J07857J46670k1701q8767J3976j58286N0132P3260J24668l052j53183
12951c7507p1304m0764P4046J75967p7770n8530m904N2023J47442K12099J64054
12940E34852K1325j02302k11122j67783j08775O913j00969p8416R4533J97176
$$ plain form
13016 101944 322174 645732 940398 1117158 958525 759169 474351 159608 -48413 -73525
13006 -73525 -75606 -87585 -257050 -236674 -181925 -158924 -96938 -19943 77064 56785 -24160 20280
12994 20280 -60427 -43396 41212 -95912 -248569 -106724 -18060 107725 183367 74379 75671
12983 75671 21597 167800 154904 6736 41149 193085 355669 326550 118393 192800 250071
12972 250071 256010 60429 28927 206338 307744 335316 394802 245454 66115 -129081
12962 -129081 -21224 125446 103745 14978 28954 -129332 -79200 -5940 118728 115676 -37507
12951 -37507 -108811 -149575 -75529 100438 22668 -35862 -40766 11257 158699 370798 534852
12940 534852 556177 453875 242753 74970 -33805 -26892 -127861 -206277 -111744 85432
12930H5432K4307J14898j5415L3926p4983M3845j55660j69123J30861P0204p3712
12919A4580j44827k9243J58968K0409r7917R1979J20093M0561j67312k2082n3038
12908f7829J6574J16282m7162J20805q0211j31497P3905J37982M3331j97741Q3553
12897F7992K14746N5547O2448O9813n6393p2688k75278k4372n4756n1457R1724
12886B7326J35403j00300j45965j01362p9897J16073N9780P0912k2164R9403j6906
12875D2303J9195M1045r3972j02598r2321O8061J32199Q8617K46347M3777j26265
12864B66388O4698q9836l3209j22765n4109J25023m3168r7297Q4121M6663Q0838
12853B27347r0158n3886K9112j834k38573N4269N8199K1252j9245J5494J1225
$$ plain form
12930 85432 109739 224637 209222 243148 168165 212010 56350 -112773 18088 88292 14580
12919 14580 -130247 -159490 -522 19887 -78030 13949 134042 174603 7291 -14791 -67829
12908 -67829 -51255 65027 17865 138670 58459 -73038 867 138849 182180 -15561 67992
12897 67992 282738 338285 400733 470546 414153 341465 66187 41815 -12941 -64398 27326
12886 27326 162729 62429 -83536 -184898 -264795 -148722 -88942 -18030 -40194 59209 42303
12875 42303 61498 102543 8571 -94027 -186348 -118287 13912 102529 348876 392653 266388
12864 266388 331086 241250 208041 85276 31167 156190 113022 15725 99846 146509 227347
12853 227347 137189 83303 112415 110581 -127992 -73723 -15524 5728 -13517 1977 13202
$$ [...]
##END NTUPLES=NMR SPECTRUM
##END=
