##TITLE=Analysis number 326807
Compound Code cc 63003
Book Reference 483/118
Project Code adrs
Chemist Name mattw
##JCAMPDX= 6.0         $$ Bruker NMR JCAMP-DX V2.0
##DATA TYPE= NMR SPECTRUM
##DATA CLASS= NTUPLES
##ORIGIN= Bruker BioSpin GmbH
##OWNER= nmr
$$ XWIN-NMR		Version 3.5
$$ Thu Feb 22 14:36:07 2007 GMT Standard Time (UT+0h)  MAYBRIDGE\nmr@NMR_250MHZ
##.OBSERVE FREQUENCY= 250.131544655141
##.OBSERVE NUCLEUS= ^1H
##.ACQUISITION MODE= SIMULTANEOUS (DQD)
##.ACQUISITION SCHEME= undefined
##.AVERAGES= 16
##.DIGITISER RES= 18
##SPECTROMETER/DATA SYSTEM= dpx250
##.PULSE SEQUENCE= zg30
##.SOLVENT NAME= CDCl3
##.SHIFT REFERENCE= (INTERNAL, CDCl3, 0, 16.522)
##AUDIT TRAIL= $$ (NUMBER, WHEN, WHO, WHERE, WHAT)
$$ ##TITLE= Audit trail, XWIN-NMR		Version 3.5
$$ ##JCAMPDX= 5.01
$$ ##ORIGIN= Bruker BioSpin GmbH
$$ ##OWNER= nmr
$$ C:\u/data/dgb/nmr/ADRS/1880/pdata/1/auditp.txt
$$ ##AUDIT TRAIL=  $$ (NUMBER, WHEN, WHO, WHERE, WHAT)
(   1,<2007-02-22 14:35:46.29 +000>,<MAYBRIDGE\nmr>,<NMR_250MHZ>,
      <created by zg, POWCHK disabled, PULCHK disabled
       configuration hash MD5:
       49 4B E0 1D 92 C2 6B 37 9F E6 65 BC 52 41 86 1D
       data hash MD5: 64K
       44 A0 9F CC C2 5F C3 7C E9 F2 A4 64 36 CA 9F 40>)
(   2,<2007-02-22 14:35:58.52 +000>,<MAYBRIDGE\nmr>,<NMR_250MHZ>,
      <Start of raw data processing
       ef LB = 0.3 FT_mod = 6 PKNL = 1 SI = 32K 
       data hash MD5: 32K
       93 00 94 39 D3 BA AA 6A 4C 24 55 9E 7C 21 E3 EA>)
(   3,<2007-02-22 14:36:00.18 +000>,<MAYBRIDGE\nmr>,<NMR_250MHZ>,
      <apk 
       data hash MD5: 32K
       1C 4F 77 C0 8E 08 92 3E 2D 0E 45 F6 5C 40 07 0A>)
(   4,<2007-02-22 14:36:00.96 +000>,<MAYBRIDGE\nmr>,<NMR_250MHZ>,
      <abs ABSG = 5 
       data hash MD5: 32K
       72 DD AF 64 51 4B 2B 71 41 97 15 BD 2A 11 D0 40>)
$$ ##END=
$$ 
$$ hash MD5
$$ 1C D8 07 75 00 AA 38 E6 45 7F 2B C7 A2 11 4E C2
##$RELAX= 
##$RELAX= 
##$RELAX= 
##$RELAX= 
##$RELAX= 
##$RELAX= 
##$RELAX= 
$$ Bruker specific parameters
$$ --------------------------
##$DU= <C:\u>
##$EXPNO= 1880
##$NAME= <ADRS>
##$PROCNO= 1
##$TYPE= <nmr>
##$USER= <dgb>
##$AMP= (0..31)
100 100 100 100 100 100 100 100 100 100 100 100 100 100 100 100 100 100 
100 100 100 100 100 100 100 100 100 100 100 100 100 100 
##$AQSEQ= 0
##$AQ_mod= 3
##$AUNM= <au_zg>
##$AUTOPOS= <24 >
##$BF1= 250.13
##$BF2= 250.13
##$BF3= 250.13
##$BF4= 250.13
##$BF5= 500.13
##$BF6= 500.13
##$BF7= 500.13
##$BF8= 500.13
##$BYTORDA= 1
##$CFDGTYP= 0
##$CFRGTYP= 5
##$CHEMSTR= <none>
##$CNST= (0..31)
1 1 145 1 1 1 1 1 1 1 1 1 1 1 1 1 1 1 1 1 1 1 1 1 1 1 1 1 1 1 1 1 
##$CPDPRG= <>
##$CPDPRG1= <>
##$CPDPRG2= <>
##$CPDPRG3= <>
##$CPDPRG4= <mlev>
##$CPDPRG5= <mlev>
##$CPDPRG6= <mlev>
##$CPDPRG7= <mlev>
##$CPDPRG8= <mlev>
##$CPDPRGB= <>
##$CPDPRGT= <>
##$D= (0..31)
0 1 0 0 0 0 0 0 0 0.06 0 0 0 0 0 0 0.0002 0 0 0 0 0 0 0 0 0 0 0 0 0 0 
0 
##$DATE= 1172154945
##$DBL= (0..7)
120 120 120 120 120 120 120 120 
##$DBP= (0..7)
150 150 150 150 150 150 150 150 
##$DBP07= 0
##$DBPNAM0= <>
##$DBPNAM1= <>
$$ [...]
##$SUBNAM7= <"">
##$SUBNAM8= <"">
##$SUBNAM9= <"">
##$SW= 20.6930455092707
##$SWIBOX= (0..15)
0 0 3 0 0 0 0 0 0 0 0 0 0 0 0 0 
##$SW_h= 5175.983436853
##$TD= 65536
##$TD0= 1
##$TE= 295.16
##$TE2= 300
##$TE3= 300
##$TEG= 300
##$TL= (0..7)
0 120 120 120 120 120 120 120 
##$TP= (0..7)
150 150 150 150 150 150 150 150 
##$TP07= 0
##$TPNAME0= <>
##$TPNAME1= <>
##$TPNAME2= <>
##$TPNAME3= <>
##$TPNAME4= <>
##$TPNAME5= <>
##$TPNAME6= <>
##$TPNAME7= <>
##$TPOAL= (0..7)
0.5 0.5 0.5 0.5 0.5 0.5 0.5 0.5 
##$TPOFFS= (0..7)
0 0 0 0 0 0 0 0 
##$TUNHIN= 0
##$TUNHOUT= 0
##$TUNXOUT= 0
##$USERA1= <user>
##$USERA2= <user>
##$USERA3= <user>
##$USERA4= <user>
##$USERA5= <user>
##$V9= 5
##$VALIST= <valist>
##$VCLIST= <CCCCCCCCCCCCCCC>
##$VD= 0
##$VDLIST= <DDDDDDDDDDDDDDD>
##$VPLIST= <PPPPPPPPPPPPPPP>
##$VTLIST= <TTTTTTTTTTTTTTT>
##$WBST= 1024
##$WBSW= 4
##$XGAIN= (0..3)
0 0 0 0 
##$XL= 0
##$YL= 0
##$YMAX_a= 245554
##$YMIN_a= -297760
##$ZGOPTNS= <>
##$ZL1= 120
##$ZL2= 120
##$ZL3= 120
##$ZL4= 120
##$ABSF1= 16.522
##$ABSF2= -4.171173
##$ABSG= 5
##$ABSL= 3
##$ALPHA= 0
##$AQORDER= 0
##$ASSFAC= 0
##$ASSFACI= 0
##$ASSFACX= 0
##$ASSWID= 0
##$AUNMP= <proc_1d>
##$AZFE= 0.1
##$AZFW= 0.1
##$BCFW= 0
##$BC_mod= 0
##$BYTORDP= 0
##$COROFFS= 0
##$CY= 12.5
##$DATMOD= 1
##$DC= 0
##$DFILT= <>
##$DTYPP= 0
##$F1P= 14.0000005364418
##$F2P= -0.99999901652339
##$FCOR= 0.5
##$FTSIZE= 32768
##$FT_mod= 6
##$GAMMA= 0
##$GB= 0
##$INTBC= 1
##$INTSCL= 1
##$ISEN= 128
##$LB= 0.3
##$LEV0= 0
##$LPBIN= 0
##$MAXI= 10000
##$MC2= 0
##$MEAN= 0
##$ME_mod= 0
##$MI= 0
##$NCOEF= 0
##$NC_proc= -3
##$NLEV= 6
##$NOISF1= 0
##$NOISF2= 0
##$NSP= 0
##$NTH_PI= 0
##$NZP= 0
##$OFFSET= 16.522
##$PC= 1
##$PHC0= 224.6634
##$PHC1= 10.21034
##$PH_mod= 1
##$PKNL= yes
##$PPARMOD= 0
##$PSCAL= 4
##$PSIGN= 0
##$REVERSE= no
##$SF= 250.13
##$SI= 32768
##$SIGF1= 0
##$SIGF2= 0
##$SINO= 400
##$SIOLD= 32768
##$SREGLST= <1H.CDCl3>
##$SSB= 0
##$STSI= 32768
##$STSR= 0
##$SW_p= 5175.98343685301
##$SYMM= 0
##$S_DEV= 0
##$TDeff= 65536
##$TDoff= 0
##$TI= <Analysis number 999999
Compound Code 99
Book Reference 9
Project Code 9>
##$TILT= no
##$TM1= 0
##$TM2= 0
##$TOPLEV= 0
##$USERP1= <user>
##$USERP2= <user>
##$USERP3= <user>
##$USERP4= <user>
##$USERP5= <user>
##$WDW= 1
##$XDIM= 32768
##$YMAX_p= 362625140
##$YMIN_p= -133322
$$ End of Bruker specific parameters
$$ ---------------------------------
##NTUPLES= NMR SPECTRUM
##VAR_NAME=  FREQUENCY,     SPECTRUM/REAL,   SPECTRUM/IMAG
##SYMBOL=    X,             R,               I
##VAR_TYPE=  INDEPENDENT,   DEPENDENT,       DEPENDENT
##VAR_FORM=  AFFN,          ASDF,            ASDF
##VAR_DIM=   32768,         32768,           32768
##UNITS=     HZ,            ARBITRARY UNITS, ARBITRARY UNITS
##FACTOR=    0.157963299565203, 1,           1
##FIRST=     4132.6476996994, 0,             0
##LAST=      -1043.33573715361, 0,           0
##MIN=       -1043.33573715361, -133322,     0
##MAX=       4132.6476996994, 362625140,     0
$$ Real data points
##PAGE= N=1
##DATA TABLE= (X++(R..R)), XYDATA
$$ [...]
##PAGE= N=2
##DATA TABLE= (X++(I..I)), XYDATA
16967f02710o112K6144J8510J7598Q709Q870n7114k7387P414N0617L0803L8276
16955d86382j7989n2R889q834k2777j4549l0544K405l333N852K2950j0031j7545
16942e70940M615J0821k6792k0519J6627K5936L2279K0401k4002k6917J3364N394
16930e39733k9432j8538K7454K7974M4341l441n1896o988K1498k5227j673J131
16918e54530M4140L0793k1655l0215k9896Q557J9138N005P308j3362r750O911
16906e37556K7162K9816j7913J7402j6802l8624j3782J4121J9744K949L8459J1132
16894d63892J0391l3578j1792j2177j6748j3911L0014J9719l6209K4634M2509
16883d61040l0104M116L3136J3399M778N978k6089j6095K7865J4323k539J6833
$$ y = [-602710, -608822, -582678, -564168, -546570, -537861, -528991, -586105, -613492, -606078, -555461, -524658, -486382, -504371, -504423, -494534, -503368, -526145, -540694, -571238, -568833, -572166, -566314, -543364, -553395, -570940, -566325, -555504, -582296, -602815, -586188, -560252, -527973, -507572, -531574, -558491, -545127, -539733, -569165, -587703, -560249, -532275, -487934, -491375, -543271, -550259, -528761, -553988, -555661, -554530, -510390, -479597, -501252, -531467, -561363, -552806, -533668, -528663, -521355, -534717, -544467, -537556, -510394, -480578, -498491, -481089, -497891, -536515, -550297, -536176, -516432, -513483, -475024, -463892, -453501, -487079, -498871, -511048, -527796, -541707, -511693, -491974, -528183, -503549, -461040, -491144, -487028, -453892, -440493, -435715, -429737, -455826, -471921, -444056, -429733, -432272, -415439]
16871d15439l7004K448j002K1902j2659k6028K147k125p103j0379l1471J3274
16859e03439N5346J9327k5634k6437q327L525P120Q036Q170L812l806j767J1345
16846d52729J125k7153m3094Q481J7406L9800L0004K202L0862j9118r978J0192
16834d12000j972k7324l8553k4724J9770N5891Q348k5045j2719q074n977J3059
16822d59320P266n303O968k4895k382L5735K1142J7050q145K392J3596K2599j3651
16809c86948j8710J2893J0812Q496j076j2732R42k9448J9130M2503K1671q29l6860
16796c70156j3122l5083j3443K9346k278m457r730j8123J912J8098r103j4457
16784d40596k66K1607L1682k232J3933m725O027M374k0732k1940R952J5185K1931
$$ y = [-415439, -452443, -449995, -450997, -429095, -441754, -467782, -465635, -467760, -474863, -485242, -516713, -503439, -448093, -428766, -454400, -480837, -489164, -485639, -478519, -470483, -462313, -458501, -462307, -464074, -452729, -451604, -478757, -521851, -513370, -495964, -456164, -426160, -423958, -393096, -412214, -422192, -412000, -413972, -441296, -479849, -504573, -484803, -428912, -420564, -445609, -458328, -466402, -472379, -459320, -452054, -457357, -450389, -475284, -477666, -441931, -420789, -403739, -411884, -409492, -395896, -373297, -386948, -405658, -392765, -381953, -373457, -374533, -387265, -386323, -415771, -396641, -354138, -332467, -333296, -370156, -383278, -418361, -431804, -402458, -404736, -409193, -418923, -437046, -435134, -417036, -426139, -440596, -440862, -419255, -387573, -389805, -375872, -380597, -374570, -370196, -390928, -412868, -402916, -387731, -365800]
16771c65800O115l3068l6233L300K431L6317L1505L4872k068k0214m0172k8449
16759d11464r616J5136P140J9187k0079n5493l5162q798J140L9485R178J5802
16747d33544M0750J5622k3640k8796L463J4193K2898j0972j7916l665M5524l5651
16735d11734J0600M9424L2346l255j2880r986K3159Q613m2364j0940K7796j727
16723c40948R437q142l9292j476O780l844j3946J1258M1011J1064k5250P824J7069
16710c28455K970L0910N3069k828l9862n584k206m613K2429J8562j0622l0898
16698b97128p410O592J3607p918J1904M556l3126j1862r387m5617J1094N0272
16686c14423q863j9209j3427k1976o256J9652Q701J8806K2011k419l8832j7236
$$ y = [-365800, -359685, -392753, -428986, -425686, -423255, -386938, -355433, -320561, -322629, -342843, -383015, -411464, -421080, -405944, -398804, -379617, -399696, -455189, -490351, -499149, -498009, -458524, -449346, -433544, -392794, -377172, -400812, -429608, -426145, -411952, -389054, -400026, -417942, -421607, -376083, -411734, -401134, -351710, -319364, -322619, -335499, -345485, -322326, -313713, -356077, -367017, -339221, -340948, -331511, -339653, -378945, -380421, -373641, -377485, -391431, -380173, -339162, -328098, -353348, -345524, -328455, -325485, -294575, -241506, -244334, -284196, -289780, -291986, -296599, -274170, -255608, -266230, -297128, -304538, -297946, -284339, -292257, -280353, -275797, -308923, -320785, -330172, -375789, -364695, -314423, -323286, -342495, -355922, -377898, -384154, -364502, -355801, -336995, -314984, -317403, -356235, -373471]
16674c73471k634K0573K9229K6975J0744j7614j4022r825k5669J352L1934M835
16662c17593k1513k0222M7762K0910n890n317j233J3446L3671M551j4451j4472
16650b80351l8068r767L3731J119M2070q990k6034k1207n440k53J1648O345m906
16637c00103k581J7374K2103L8043L9902l5667k8753k4399k3525K2749K9194j3217
16625b58880k2956k1254N1736K0519q459k2489J0227k2129j5214k2116L0906K0467
16613b59642p965j3692O932m519R526R915k5873M225J2620K0742J1194l9755O620
16600b69672L0792J5470k6785j4708j4307j3058P021K9684L1131K163k904l9425
16588b64598l811j2160J7867J414N94N100q611K089q03J9357L1246j7557k699
$$ y = [-373471, -376105, -355532, -326303, -299328, -288584, -306198, -320220, -330045, -355714, -354362, -322428, -317593, -339106, -359328, -311566, -290656, -296546, -301863, -303096, -289650, -255979, -251428, -265879, -280351, -318419, -328186, -294455, -293336, -251266, -260256, -286290, -307497, -312937, -313190, -301542, -295197, -300103, -302684, -285310, -263207, -225164, -185262, -220929, -249682, -274081, -297606, -274857, -245663, -258880, -281836, -303090, -251354, -230835, -239294, -261783, -251556, -273685, -288899, -311015, -280109, -259642, -267607, -281299, -274367, -278886, -269360, -259445, -285318, -281093, -268473, -247731, -236537, -276292, -269672, -238880, -223410, -250195, -264903, -279210, -292268, -285247, -255563, -224432, -222269, -225173, -264598, -268409, -280569, -262702, -261288, -260694, -255594, -264205, -262116, -262919, -243562, -212316, -229873, -232572]
16575b32572k3486m3610J4216R875N983N2758j631l9098O779N1399L7071l5758
16563a98074l7678J820L927m5663j6364K2720L2961L2952J2440k4018m5443J1927
16551b48493K9927j3851k190q17L2832K9335l2230k7233j8962R352M5556j3403
16539b10177k7775K3999L7201P025q242J464J7606j355j371j0428j6182n8282
16527b46517l2986r404M1807J0266L304L6150L1783J5635q128k9280j4909r50
16515b03229j4845K5948J8357m2773l6774M7507J5451p246j3386j4375Q67P476
16503b17022L3898K4465k0949j6420r741K5164R489j8572K5231j5699l5283l5
16491b15474K0563K049K1512N829L282p014J5357m638j7063M115J1262L0402K4624
$$ y = [-232572, -256058, -299668, -285452, -275577, -269594, -216836, -218467, -257565, -250786, -199387, -162316, -198074, -235752, -233932, -230005, -275668, -292032, -269312, -236351, -203399, -190959, -214977, -260420, -248493, -218566, -232417, -234607, -235424, -202592, -173257, -205487, -232720, -251682, -242330, -196774, -210177, -237952, -213953, -176752, -169727, -177969, -176505, -158899, -160254, -161625, -172053, -188235, -246517, -279503, -288907, -247100, -236834, -233530, -197380, -165597, -149962, -158090, -187370, -202279, -203229, -218074, -192126, -173769, -216542, -253316, -205809, -190358, -197604, -210990, -225365, -224498, -217022, -183124, -158659, -179608, -196028, -205769, -180605, -171116, -189688, -164457, -180156, -215439, -215474, -194911, -192862, -171350, -165521, -162239, -169253, -153896, -158534, -175597, -171482, -160220, -129818, -105194]
16478a05194J500j2947k4754K1798n553n3579j4957P694k4675q256J4548o505
16466b10880k9185k0017p423L4974L7223O7j1276k596K2586K6426q796k3121J2607
16453a79411j3484q472o748J688o975J531J1926k4313K5413K1352R114J3877J6407
16440a38095L2232M012j0695j1895l6958k9889J0906j2416j3380J1949J9937J194
16428a73098q033O48o478M718p220K3625q756R71J0914J5050K658k0333l7091
16415b02425j343K5682K6637J7714R477l950k6410P324L1858R333N388J421m9981
16402a49275l3296p90L9064R795j2973l3893J4004M0471q775j1187K5162K9294
16390i2399J5876p663m4344J7581K109J8264J2736j3332q370l2274K1006p085
$$ y = [-105194, -103694, -116641, -141395, -119597, -125150, -178729, -193686, -185992, -210667, -218923, -204375, -210880, -240065, -260082, -267505, -232531, -195308, -195241, -206517, -209113, -186527, -160101, -168897, -192018, -179411, -192895, -201367, -208115, -206427, -213402, -211871, -199945, -224258, -198845, -177493, -168379, -154502, -138095, -105863, -101851, -112546, -124441, -161399, -191288, -180382, -192798, -206178, -194229, -174292, -173098, -181131, -180483, -186961, -182243, -189463, -165838, -174594, -173623, -162709, -147659, -145001, -165334, -202425, -203768, -178086, -151449, -133735, -124258, -128208, -154618, -147294, -115436, -106103, -100715, -99294, -149275, -182571, -183361, -144297, -134502, -147475, -181368, -167364, -126893, -135668, -146855, -121693, -92399, -76523, -84186, -128530, -110949, -108840, -90576, -77840, -91172, -99542, -131816, -110810, -117895]
16378a17895L6831j1987l7625j5594k63J8448J6441m738J2140P48j4460j940p71
16365a20665N776J2620l528k2272P829J368n5237l4705K8256L7382K8027j103
16353a16252k2006M0201j8277k2495m978J2656J7759P251R942k148J8758J8820
16341f0769k5005j1098k2326J232Q789J6581n197j036J8792j413k2361J4539j5639
16328a04911j1114j0808K2446R590q181Q64L3159J7525j3410J3138K4581l4409
16316f1530j948l1640k0681K0161L1047L360k4223p257L316J9321K7026j7240
16304f0288k7213k5793j6870o854r907O284M4431L8182j3001j2062j2792j2740
16292a08623j0251q444n743J3640K6882q081j8825j7842p462K0594J2329k2366
$$ y = [-117895, -81064, -93051, -130676, -146270, -146533, -128085, -111644, -116382, -104242, -103494, -117954, -119894, -120665, -114889, -102269, -105797, -128069, -120240, -118872, -174109, -208814, -180558, -143176, -115149, -116252, -138258, -98057, -116334, -138829, -143807, -131151, -113392, -106141, -96199, -98347, -79589, -60769, -85774, -96872, -119198, -117966, -109177, -92596, -97793, -98829, -80037, -81450, -103811, -89272, -104911, -116025, -126833, -104387, -94797, -102978, -102114, -68955, -51430, -64840, -51702, -27121, -61530, -63478, -95118, -115799, -95638, -64591, -61231, -85454, -92711, -89395, -70074, -43048, -60288, -87501, -113294, -130164, -137018, -146925, -140641, -96210, -58028, -71029, -83091, -95883, -108623, -118874, -127318, -133061, -119421, -92539, -100620, -119445, -137287, -144749, -124155, -111826, -134192]
16280a34192J5704M2532J614J924k036J1505K115p112l4626m740N740k5699K9237
16267i8034j3840N569M0901J1055q146J9713L3993j2702R17J4460R333k8609k4357
16254d9747j837L2384j2598m4402j3725r2J3937O635J3644L384J1518k643J1665
16241c1877O003j7768k3861k1796j7347O829J1423K1063k0659m4219K4792J5069
16229i2348J4518J325j4732j2333J7291j0133Q889J2017o201L952J3946M054k5250
16216h5005N020M1381q561J4166k924k9634k0069j2445j3987J9349K8544O783
16204e7382m749k5562l0204n405K5244J3199j3896K2504J1161j4828R944j1213
16192h1187j1189m335p182J9027N2929M796K672k4076o1294m183J1370K7532L0847
$$ y = [-134192, -118488, -75956, -74342, -72418, -74454, -62949, -60834, -67946, -102572, -107312, -101572, -127271, -98034, -111874, -106305, -65404, -54349, -62495, -42782, -8789, -21491, -20574, -6114, 3219, -25390, -49747, -51584, -19200, -31798, -76200, -89925, -90017, -76080, -69445, -55801, -52417, -40899, -43542, -31877, -25874, -43642, -67503, -89299, -106646, -99817, -88394, -67331, -87990, -132209, -107417, -92348, -77830, -76505, -91237, -103570, -86279, -96412, -87523, -75506, -81707, -77755, -63809, -59755, -85005, -79985, -38604, -47165, -32999, -35923, -65557, -85626, -98071, -112058, -92709, -64165, -57382, -62131, -87693, -117897, -123302, -98058, -84859, -98755, -76251, -65090, -79918, -69974, -81187, -92376, -96711, -103893, -84866, -31937, -27141, -24469, -48545, -109839, -114022, -102652, -75120, -44273]
16179d4273j449L330R588r064j744J5337k5910k3864L9636K1105K6681R192k2067
16166c502k5781l6854j9811L3841L1132Q024l167k02R194M921M388j0198n5834
16153f3849j9159J1657J1397Q8N431n533M688J7649j142K980K6238J9699j1564
16140a420K755r107j9653O318L141l5094M58J6921j4288j6213p964J1620J1016
16127e1510O415K1091p864P406n306l4928k2303L8280K9493O552r27J0942L619
16114I60j1977J4244q366j7971p633M258J8023J2332R827Q466j1505l4667m7339
16101g1348o552K9974O137J484r988M157J8262J768M0267M13k0091K0460L4321
16088D9264M282j6373k4217j2228k4546j6633J697l888m765J4735j3690K0979
$$ y = [-44273, -45722, -42392, -32804, -41868, -43612, -28275, -54185, -78049, -38413, -17308, 9373, 18565, -3502, -29283, -66137, -85948, -52107, -20975, -12951, -16118, -16320, -7126, -2205, 2183, -8015, -63849, -83008, -71351, -59954, -59866, -54435, -59968, -55280, -37631, -38773, -35793, -9555, 10144, -1420, 1335, -7772, -27425, -21107, -17966, -53060, -52602, -35681, -49969, -66182, -74146, -62526, -51510, -45095, -24004, -31868, -24462, -29768, -64696, -86999, -48719, -19226, -12674, -13601, -2659, 960, -11017, 3227, -5139, -23110, -30743, -26485, -8462, 3870, 13697, 22163, 10658, -24009, -71348, -77900, -47926, -41789, -40305, -50293, -46136, -27874, -26106, 14161, 14574, -5517, 14943, 49264, 53546, 37173, 12956, 728, -23818, -40451, -38754, -42642, -47407, -32672, -46362, -25383]
16076b5383M3552K3032M851l9312j1729M2301N466J8250j0941k4392J254P680
16064C4629j6429n0419j0557Q120j746k2277l5339K356K6634K0868L1480K3894
16052A1214j2647l5984l2688Q586M1326l09n341k0435M398J3274o444j44j315
16039c6509R478K2714J4952j325J68m068k9447j0747n71J5528R965K2934j1916
16026A156k4941k949L2454L876p091L7696O3080L3702j6640l3023l1410j9231
16014C6679m6507j1745J1770K7462M990Q326K6814j4223N117l970j8609p424q116
16001A0564J4061K296j5414r062p950L5582L0331M257N804J5571l5319l3116j094
15988A6511N523K0339J8302k2413l8973K5844J2378q147J7748J86j1501n043M39
$$ y = [-25383, 18169, 41201, 46052, 6740, -4989, 37312, 42778, 61028, 50087, 25695, 26949, 34629, 18200, -32219, -42776, -34656, -36402, -58679, -94018, -91662, -65028, -44160, -12680, 11214, -1433, -37417, -70105, -61519, -20193, -20502, -25843, -46278, -41880, -28606, -35050, -35194, -36509, -27031, -4317, 10635, 9310, 9478, 5410, -24037, -34784, -35355, -19827, -9862, 13072, 1156, -23785, -26734, 5720, 9596, 2505, 40201, 103281, 136983, 120343, 87320, 55910, 36679, -9828, -21573, -9803, 17659, 22649, 30975, 57789, 43566, 48683, 44713, 26104, 18680, 10564, 24625, 26921, 11507, 2445, -5505, 30077, 60408, 64665, 70469, 86040, 50721, 17605, 16511, 22034, 42373, 60675, 38262, -711, 25133, 37511, 29364, 47112, 47298, 35797, 30754, 31193]
15975C1193L4590j1208l03r022J8207q552J6582J1433Q421N302k4910L349j9325
15962E5757o744p793J6116k2777m0361k5592K2740L9089L0805j549J1451L0935
15950A02077J8855r430m4058l895k963J0688j028k60k726j8500j770J896O001
15937E4887Q988m633R778l0024r668L887p353J6174K0632J1019l0620k8387N991
15924B0671J6820K5952J7317K7597N204m4818q736j9204l0748N91J9894M2964
15912G3504O619K4002j926k6558J1601L3458r955N99J783m5449l058L526J2168
15899H0314J5241Q782J8165j5430n3924K676K2588k5955k3022K4657L6104l416
15887H6780N883Q685k0262N021k585J8864q70j8070K949J761n644k6820J1161
$$ y = [31193, 65783, 54575, 54272, 45250, 63457, 54905, 71487, 82920, 91341, 96643, 71733, 75082, 55757, 49013, 41220, 57336, 34559, -5802, -31394, -8654, 30435, 61240, 59691, 71142, 102077, 120932, 111502, 67444, 63549, 60586, 71274, 70246, 69986, 67260, 48760, 46990, 48886, 54887, 63875, 59242, 69020, 38996, 29328, 33215, 25862, 42036, 62668, 73687, 43067, 14680, 20671, 37491, 63443, 80760, 108357, 113561, 68743, 60007, 40803, 10055, 10646, 30540, 73504, 80123, 104125, 102199, 75641, 87242, 120700, 110745, 111344, 113127, 67678, 64620, 68146, 80314, 95555, 104337, 122502, 107072, 53148, 55824, 78412, 52457, 29435, 54092, 90196, 86780, 92663, 101348, 81086, 86107, 83522, 102386, 101516, 83446, 86395, 88156, 82512, 55692, 66853]
15874F6853k295k0898K2850L7145L8792M154k8725r141J3661J1694r697m1543
15862H2850L487J6722l235J526j8920J005k3006K0116j4709k5907M93J8706n274
15849E3854M3202K8104l7891k2982P528J3330J412J390n175K9298q511j1774R503
15836A01288J7237m342q546J34j6282k5888j0727j5456J7429L3619J756O504O878
15823A03604m0193O774L5263O132k5125j4018o981L9484K4196L6538j7530o5717
15811H2427L0229J0333p398r034R842o276P012j2400j27o068K8097K8932n829
15798A49740K1775k0488k5826Q25n874K0628k0791p379L6K7411J153l4404K0771
15785A27577K4294j8182j5958M405K3059J2092j0538l350o7j2206k2347J3002
$$ y = [66853, 64558, 43660, 66510, 103655, 142447, 146601, 117876, 108735, 122396, 134090, 124393, 82850, 86337, 103059, 99824, 101350, 82430, 83435, 60429, 80545, 65836, 39929, 40422, 59128, 53854, 97056, 125160, 87269, 64287, 71815, 85145, 86557, 87947, 82772, 112070, 103559, 91785, 101288, 118525, 114183, 105637, 105771, 89489, 63601, 52874, 37418, 54847, 88466, 90222, 96726, 103604, 63411, 70185, 105448, 111580, 86455, 72437, 65456, 104940, 129136, 165674, 148144, 82427, 112656, 122989, 115591, 106557, 116399, 110123, 117135, 104735, 104608, 98540, 126637, 155569, 149740, 171515, 151027, 125201, 126026, 120152, 140780, 119989, 112610, 112646, 140057, 141210, 106806, 127577, 151871, 133689, 117731, 122136, 145195, 157287, 146749, 143399, 143332, 131126, 108779, 121781]
15773A21781l369j706l9416k2472l0243Q47M2904J5704Q88K5826J2O097j6032
15760A00821k0992j2308j953j4570J4117J9190L5735L2223k521r356q45P288l202
15747A43627p365K1132K957O198o84J911k7720p91n113o5283J6445K8201L0344
15734A43859K1504j7646j5569K0609L3507L614k7865n16J5528o859K3152k6673
15722A66645K3k2307l2678J415M868j7950K0288r7m596K8380K0588p192r074l1017
15708A17296l1036M5066L0557m324m6477J2277M217K6738L0682o365j600N16j2100
15695A65447r407J160L5212l044k022J3312j4722r13P233O42j1773j531j0426
15682A69168m902P702K6113N975k0234m516j2398j2201J8114m830J0170K4823
$$ y = [121781, 118412, 116706, 77290, 54818, 24575, 25422, 68326, 84030, 84918, 110744, 110756, 116853, 100821, 79829, 67521, 65568, 50998, 65115, 84305, 120040, 152263, 149742, 140386, 139541, 146829, 143627, 136262, 157394, 160351, 166549, 165865, 167776, 140056, 139265, 134152, 68869, 85314, 113515, 143859, 165363, 147717, 132148, 152757, 186264, 189878, 162013, 161497, 177025, 170166, 193318, 166645, 166668, 144361, 111683, 113098, 117966, 100016, 120304, 120207, 115611, 143991, 164579, 157387, 148313, 117296, 86260, 131326, 161883, 157559, 111082, 123359, 127576, 154314, 184996, 178631, 177031, 177547, 165447, 156040, 157200, 192412, 189368, 187346, 200658, 185936, 185023, 192256, 192898, 181125, 179594, 169168, 164266, 171968, 198081, 204056, 183822, 179306, 166908, 154707, 172821, 167991, 178161, 202984]
15670B02984q115l3819k136J1521j3246L6925l1826l4260M804K5916L4823j2143
15658A81428P446j0938m3609J22K0634N117j4391J5546J2974K3508N299j1328
15646A91808N135k9207J6653K7908Q463m0443q460k232J828R940J4067k1245l4869
15633A39346l038K0061j3372j8333M775L102k6328K5836K9825K4994j7524L539
15621A72883L7355L1397j8617m5181l6379j7113j4916L5984l1508m05J3798j4537
15609A12761J6751K8456J7l0149o468k4627M922P1563L8312R510o4k7738j0322
15596A82924l809l1864k4707R196J4444r08J9961L2437o93N756K0973k8999P093
15583B01804P36k0137j667m808n7203J0055M2090J0644O338J1471o021M29J5637
$$ y = [202984, 194869, 161050, 158914, 170435, 157189, 194114, 162288, 128028, 132832, 158748, 193571, 181428, 188874, 177936, 134327, 134449, 155083, 160200, 145809, 161355, 174329, 197837, 203136, 191808, 196943, 167736, 184389, 212297, 220760, 180317, 171857, 169625, 171453, 181393, 195460, 174215, 139346, 136308, 156369, 142997, 124664, 129439, 132541, 106213, 132049, 161874, 186868, 169344, 172883, 210238, 241635, 223018, 177837, 141458, 124345, 109429, 145413, 113905, 113500, 127298, 112761, 129512, 157968, 157985, 127836, 121368, 96741, 101663, 173226, 211538, 221048, 220984, 193246, 182924, 179115, 147251, 122544, 131740, 146184, 145276, 165237, 197674, 196981, 202737, 223710, 194711, 201804, 202540, 182403, 180736, 175928, 118725, 128780, 170870, 181514, 187852, 199323, 193302, 193731, 209368]
15570B09368J3914k7352j6130j3095J9570n1J9969J7338m62l5169l9995j8241
15558A29664r401J1803J1623L3164K052K8467R77l2545J3405m786J1839j5443
15546A80819j761m890j9126K9367l032k6197J1588L8315J7289k5146K089J2720
15534B12035K2003j2306n022K0922K0053O185m781O551j4029j0170r454k3720
15522B08267o682K6976Q056k3680k4853m239p469k241J7139M708K1868J1457k5185
15509B04122j8462J844L6865k337l8548l9406k382K7444L1447O692p499j4752
15497A85028K2183k7309M6726P353l800k4604j0023j74K0900K2484l450j0874
15485B24440l4442l076K2108N62k2860l1619k5374m719K1873J5482R293J8228
$$ y = [209368, 223282, 195930, 179800, 166705, 186275, 186224, 206193, 223531, 223069, 187900, 147905, 129664, 120263, 132066, 143689, 176853, 178905, 207372, 208349, 175804, 189209, 184423, 196262, 180819, 179058, 174168, 155042, 184409, 181377, 155180, 166768, 205083, 222372, 197226, 199315, 212035, 234038, 221732, 216710, 237632, 257685, 263870, 259089, 265640, 251611, 241441, 231987, 208267, 201585, 228561, 236617, 212937, 188084, 183845, 176376, 174135, 191274, 195982, 217850, 229307, 204122, 185660, 187504, 224369, 222032, 183484, 144078, 141696, 169140, 200587, 207279, 199780, 185028, 207211, 179902, 226628, 233981, 230181, 205577, 195554, 195380, 216280, 238764, 235314, 224440, 189998, 186922, 209030, 209592, 186732, 155113, 129739, 125020, 146893, 162375, 171668, 189896]
15473A89896K4678K8840K6860k5743l683l513l9089K2393l6731l9923K4653K9103
15461A97741J3426k646k352J7115l886l0856o461r979k083J461K9905j8566k4674
15448A58145J1362K1960R935L715j8991j0688K9255K3506J4147J4912o400j2798
15436B38060j4953R770j3627o08J2289L3027k0369j2183K027J9167k614j3989
15424B35997L766P756J3569j4583N378j5883j1674k7395O376L469K8693J7467
15412B52936L2489R992j5079M043k5185J2318L0018j1194k3192k7423m0553k8726
15400A70444M854K4013j7670N9876K7539l187r924J717r185K8472j9593k8569
15388B28787J4464o40M0508N570M509j1460k9804K3549J6090r125q829j7259k4743
$$ y = [189896, 214574, 243414, 270274, 244531, 240848, 237335, 198246, 220639, 183908, 143985, 168638, 197741, 211167, 208521, 206169, 223284, 219398, 188542, 182081, 172102, 170019, 171480, 201385, 182819, 158145, 169507, 191467, 201402, 205117, 186126, 175438, 204693, 228199, 242346, 257258, 250858, 238060, 223107, 232877, 219250, 218642, 230931, 263958, 243589, 231406, 233433, 252600, 249986, 235997, 239763, 247519, 261088, 246505, 251883, 236000, 224326, 196931, 203307, 206776, 235469, 252936, 285425, 295417, 280338, 284381, 259196, 271514, 301532, 290338, 267146, 239723, 199170, 170444, 175298, 199311, 181641, 241517, 269056, 265869, 255945, 257662, 248477, 276949, 257356, 228787, 243251, 242611, 283119, 288689, 293198, 281738, 251934, 275483, 291573, 282448, 273619, 256360, 231617]
15375B31617j6245J4538j2525k3073k71L2107M2772L3858J8342l4412r061j1614
15363B66033k6902J2719K1084J958j4969j2770J6236L6222L0174k2395o5977l6968
15351B04445j4545J0374K3834K2559K7335O791p08n787p805L613n745k9607k1988
15338B12766O037Q318K0907M320l4562K1484q162l1190l0060o105R527K0651L2861
15325B26792M2772p645K04o261N985P76j8103j0503M6523N191R200k7464l5266
15312B32201l6300k016L6695N5117n251k8866K8443p249K7616K9957K6849j58
15300C57038o5970m8848l237K8249M912O923n31j8538J0119l0481m1172M4926
15288B43390K3325l725j2251k2059J0054J4555k702j0318j7637J6637L9475j0396
$$ y = [231617, 215372, 229910, 217385, 194312, 194041, 226148, 268920, 302778, 321120, 286708, 277647, 266033, 239131, 251850, 272934, 274892, 259923, 247153, 263389, 299611, 329785, 307390, 241413, 204445, 189900, 200274, 224108, 246667, 274002, 280793, 280085, 274298, 266493, 270106, 264361, 234754, 212766, 218803, 227121, 248028, 252348, 217786, 239270, 231108, 199918, 169858, 163753, 173280, 193931, 226792, 269564, 261919, 262123, 255862, 261847, 262623, 244520, 234017, 280540, 285731, 294931, 267467, 232201, 195901, 193885, 230580, 285697, 280446, 251580, 280023, 272774, 300390, 330347, 357196, 357038, 291068, 242220, 238983, 267232, 272144, 279067, 278536, 259998, 270117, 239636, 198464, 243390, 266715, 262990, 250739, 228680, 238734, 253289, 250587, 240269, 222632, 239269, 278744, 268348]
15276B68348j2586m622N858K2299K7131L0981J7577j355k9201l5417j0610k3714
15264B54689J1347p262k3052J6072J6226Q860J6312R875j2723L100K5251j1561
15252C07134k6020r135m936J6867n991J7506j7j1428L1802n388l0375m0832M844
15239B44031k5J0248j4180Q248J4480n280k1859k0175Q249l31K6977L2854m377
15226B78860j0812N498j8512m07J2326L3767K2160Q32k6227j4557K3143M7595
15214C53666j3099l8462l0459K0158K0716J912J6302M247m3754k1105K1885L6456
15202C28463j8865j7340J863K1640K5114M669R419p009m205j9980m8821J8698
15190B93646m946q626l0845k0807q385K8813L4142J6635j0560k111J0337J6180
$$ y = [268348, 255762, 251140, 256998, 279297, 306428, 337409, 354986, 353631, 324430, 289013, 278403, 254689, 266036, 258774, 235722, 251794, 268020, 276880, 293192, 303067, 290344, 293444, 318695, 307134, 281114, 271979, 267043, 283910, 277919, 295425, 295408, 283980, 315782, 310394, 280019, 239187, 244031, 244006, 254254, 240074, 248322, 262802, 257522, 235663, 215488, 223737, 223406, 250383, 283237, 278860, 268048, 273546, 255034, 254627, 266953, 300720, 322880, 323712, 297485, 282928, 306071, 353666, 340567, 302105, 271646, 291804, 312520, 314432, 330734, 334981, 291227, 270122, 292007, 328463, 309598, 292258, 294121, 315761, 340875, 345544, 354963, 347954, 343749, 323769, 274948, 293646, 288700, 280074, 249229, 228422, 220037, 248850, 282992, 299627, 289067, 286956, 297293, 313473]
15178C13473J0036M869K3356j9551k0568l0166R302L0293J5102J4783J2607j5568
15166C47968k1417M53M540L417K604L7769q722j0581K936m8954j7479J3744q79
15153C05399O255M563n593p160k0427K4401N4962L9593L1072l7769j0114o0057
15141C25125m0064N923L9071K9131J6250Q777l6909k8481k2139j1491L4007M0902
15129C60102K5490k7842n9215l1065K0069M5454R481k4608J3354J8419j9586j1588
15117C18465k4770n447J5305K3660o34q44R052L9724j2140k2819p115J6728K559
15104C51724j411M5186L6550r496m2241l1988m2398k9929J1296M1719K2483k762
15092C48733l0922k3835J4731J9140J7969J2516L3656K4608j8088n611l2656M329
$$ y = [313473, 323509, 328378, 351734, 332183, 311615, 281449, 290751, 321044, 336146, 350929, 363536, 347968, 326551, 327004, 331544, 334961, 337565, 375334, 366612, 356031, 358967, 310013, 292534, 306278, 305399, 311654, 316217, 310624, 303464, 283037, 307438, 362400, 401993, 433065, 395296, 385182, 325125, 285061, 290984, 330055, 359186, 375436, 384213, 347304, 318823, 296684, 285193, 319200, 360102, 385592, 357750, 298535, 267470, 287539, 332993, 342474, 317866, 331220, 349639, 330053, 318465, 293695, 288248, 303553, 327213, 326579, 325735, 334787, 374511, 362371, 339552, 332437, 349165, 351724, 350313, 395499, 432049, 422553, 380312, 348324, 305926, 275997, 287293, 329012, 351495, 348733, 317811, 293976, 308707, 327847, 345816, 358332, 391988, 416596, 398508, 392897, 360241, 364570]
15080C64570k2617p449j1394j8800J3030J8300J7123q472j8745q891O105o375
15068C16385k72L0021K7520j785j4184j9260J5041L2097k527p480k6907j9645
15056C29004O649j650q498r142J6918J4492k262j3231j7113m215K2633R60J8455
15043C53000P425r070k0979J7574j5779J3924M0814j2980m780j5121q617j2060
15031C33351L3061K3187J6460l6646l7831j1377j137N9389K0934Q03m1500j6388
15019C42306j9713o020K9175L3438L6296j6399K8605j8747k3224j4808l9408K427
15007C33928P826p638q860J9951K0262k0573j6453k5586j2271L1398L3236O431
14995C61651j0977J74J3250p895K6048Q868k8873j8739J8989K0357Q761Q560j891
$$ y = [364570, 341953, 334504, 323110, 304310, 317340, 335640, 352763, 344291, 325546, 316655, 322760, 316385, 316113, 346134, 373654, 371869, 357685, 338425, 353466, 385563, 383036, 375556, 348649, 329004, 335653, 334003, 325505, 316363, 333281, 347773, 345511, 332280, 315167, 310952, 333585, 334545, 353000, 360425, 351355, 330376, 347950, 332171, 346095, 386909, 373929, 369149, 354028, 345411, 333351, 366412, 389599, 406059, 369413, 331582, 320205, 319068, 378457, 399391, 400194, 358694, 342306, 322593, 316573, 345748, 379186, 415482, 399083, 427688, 408941, 385717, 370909, 331501, 333928, 341754, 334116, 325256, 345207, 365469, 344896, 328443, 302857, 290586, 321984, 355220, 361651, 350674, 350848, 364098, 356203, 382251, 391119, 362246, 343507, 362496, 382853, 391614, 400174, 398283]
14982C98283j2729L982J3123J6958r961o7982l0595m356L3841O762O441K9614
14970C83381J8499n203K6374J882r597o169n0268j1312K0609o547Q563q664l8399
14957C23149o682M9500K2621q748K4028K2539m4828p058J0125O877J4982j3072
14945C93433n100m406N590J1057k0739K046O95K0363J7600r182k3802o516p331
14932C73708J625J5946N715m924J435L069o869K0094R165m6682j4772O693K0247
14919C84450K9029L7196J5551J2326K9558k7916l1804q643l2514m720J3280j16
14907D15677N0838p383l4427O075K746J4965K0289j6749k5057k4336J4229j6330
14895D00537r299p466k5843K180L7333K4407J3175J903l1679r384j7760P337O153
$$ y = [398283, 385554, 389536, 402659, 419617, 409656, 341674, 311079, 306723, 340564, 347326, 353767, 383381, 401880, 396677, 423051, 424933, 415336, 409167, 358899, 347587, 368196, 361649, 370212, 361548, 323149, 316467, 365967, 388588, 379840, 403868, 426407, 381579, 374521, 384646, 391523, 406505, 393433, 388333, 383927, 389517, 400574, 379835, 381881, 382576, 402939, 420539, 411357, 387555, 381039, 373708, 375333, 391279, 396994, 392070, 393505, 396574, 389705, 409799, 418964, 372282, 357510, 364203, 384450, 413479, 450675, 466226, 478552, 508110, 480194, 448390, 439747, 407233, 402513, 415793, 415677, 466515, 459132, 424705, 430780, 433526, 448491, 468780, 452031, 426974, 402638, 416867, 400537, 391238, 383772, 357929, 360109, 397442, 421849, 435024, 436927, 405248, 395864, 378104, 385441, 391594]
14882C91594L4537R452m502L4678K3682k0052k5947j6692j9534L5026j7511l949
14870D20782K485j3157J7109J3531J7990R262j4147Q055k613K193k4326l7491
14858C99673r446N716j0962K9522M1674j5307O006o645o934R468m462q964k3263
14845D06076j7802J2093K0156k2032j1854L7401N0797j0781k5281j3794o2858
14834C62121k3099K9025K4581J1276N1726l423J0416R726j0772l6193j0615k0447
14822C94322n694J4134M0516K4753r294j6284j5571K4887j0746l4089L3014L5587
14810D75535K2074Q91l2188j7546n518j3397j4189k2431J7306j3077P804K0979
14798D26243J3309K6193K6605m281k1200R527J5393o357n300k1919j5395p973
$$ y = [391594, 426131, 435583, 431081, 465759, 489441, 469389, 443442, 426750, 407216, 442242, 424731, 420782, 423267, 410110, 427219, 440750, 458740, 468002, 453855, 461910, 459297, 461490, 437164, 399673, 390227, 395943, 384981, 414503, 456177, 440870, 446876, 440231, 433297, 442765, 438303, 429339, 406076, 388274, 400367, 420523, 398491, 386637, 424038, 474835, 464054, 438773, 424979, 362121, 339022, 368047, 392628, 403904, 455630, 452207, 462623, 472349, 461577, 425384, 414769, 394322, 388628, 402762, 443278, 468031, 458737, 442453, 426882, 451769, 441023, 406934, 439948, 475535, 497609, 498500, 466312, 448766, 443248, 429851, 415662, 393231, 410537, 397460, 405264, 426243, 439552, 465745, 492350, 488069, 466869, 476396, 491789, 485432, 480132, 458213, 442818, 434845]
14786D34845J9594J5785j6658k9797q073N8578L8251j457k4455k4649q797P434
14774D60601j1372K9050J9694k3512N574j5516n246r620J9242J46J2915j3739
14762D68217m1381N789K0411j4425l4753M5967L9757q781m6491j1385J4236q905
14750D28256J3659J509J8401j0156k0939K968j9246r329J4321K3692P293j3754
14738D36675J0666J2431j0238J0399K2670K3251R868l4016k8282j7586J6147J4588
14726D66573Q251j27q767K0836j4498k4365J0715j2309j7681K3758N618p551M2804
14713D93257J8903j5090K9942K5222J2907l2962l4104n311J1957k7681K4845L1945
14701E33830J9450J6219k3627k9515N456p587Q738n345j2167k9599L0401K9840
$$ y = [434845, 454439, 470224, 453566, 423769, 415696, 474274, 512525, 511068, 486613, 461964, 453167, 460601, 449229, 478279, 497973, 474461, 480035, 464519, 459273, 449653, 468895, 469041, 481956, 468217, 426836, 432625, 453036, 438611, 403858, 449825, 489582, 480801, 434310, 422925, 437161, 428256, 441915, 443424, 461825, 451669, 430730, 433698, 414452, 405123, 419444, 443136, 450429, 436675, 447341, 459772, 449534, 459933, 482603, 505854, 515722, 481706, 453424, 435838, 451985, 466573, 474824, 474697, 465930, 486766, 472268, 447903, 458618, 446309, 428628, 452386, 458004, 450453, 493257, 512160, 497070, 527012, 552234, 565141, 532179, 498075, 492764, 504721, 477040, 501885, 533830, 553280, 569499, 545872, 516357, 521813, 514226, 522964, 517619, 505452, 475853, 506254, 536094]
14689E36094J0198m1819m8872J2090O23k0513l4015K837J5401o694J3476K4000
14677D62806l271K450K2732J0016j1451k478k7643k8634K8130J5526P045J7723
14665D92951J5306O574O774k8181l026m045K6676R005k7570j5644J5416j0089
14653D84147k2103J5514J1744L72L9577N4327L679m0006m2533P023J467l9426
14641D73782j462J8304N849K3783K1130j9870k4242N687L2291r167j5644K1924
14629E32365K2707L197j2497J6815m082O7l7825l1634J6829O0989M925m3358K2751
14616E51249J0533j6007K3163o419j5990Q181k7530J8744j4970j8496J0989M783
14604E28230j1361J2170p385j2252j1619k7294K2181K1309j1083k9583L7886J316
$$ y = [536094, 546292, 504473, 455601, 467691, 468314, 447801, 413786, 416623, 432024, 425330, 438806, 462806, 459535, 461985, 484717, 494733, 483282, 480804, 453161, 424527, 452657, 468183, 475228, 492951, 508257, 514831, 521605, 493424, 490398, 486353, 513029, 522034, 494464, 478820, 494236, 484147, 462044, 477558, 489302, 489674, 529251, 583578, 587257, 547251, 504718, 511741, 513208, 473782, 472320, 490624, 496473, 520256, 541386, 521516, 497274, 502961, 535252, 526085, 510441, 532365, 555072, 558269, 545772, 562587, 558505, 558572, 520747, 489113, 505942, 566931, 571856, 528498, 551249, 561782, 545775, 568938, 562519, 546529, 554710, 527180, 545924, 530954, 512458, 523447, 528230, 516869, 529039, 521654, 509402, 497783, 470489, 492670, 513979, 502896, 473313, 511199, 512515]
14592E12515Q971J1454R293J2627j7370l0709N8312J4281R684N109o769J801j7627
14579E71572R589j7087m2703k5201L0047L891j142J5754p5p601J5575J5455p945
14566E60129j1107Q764L97n1238m663L194K2442M149M288j0312p094L1494j5884
14553E34559j0101P492K549k7656j3175O6431O4133K838k7677j6165j517j5576
14541E66135m655j0549j863M0580K6373k9757k4326k0767j5131L1333K5026m7301
14529E35098m5517J4645L2231k764q031L664k2868O383J6479l876m125L2229K9047
14516E82595k5706k2572l3461K6381K1913j4206k1253L7797J7001j6661n415P705
14504E54118J2092k4298k8040Q288l270l6474j5355l298M4154N4392K8228J740
$$ y = [512515, 521486, 532940, 542233, 554860, 537490, 506781, 565093, 579374, 589058, 594167, 587398, 589199, 571572, 581161, 564074, 521371, 496170, 526217, 530108, 528966, 544720, 544645, 537044, 552619, 568074, 560129, 549022, 557786, 558183, 506945, 502282, 505476, 527918, 532067, 536355, 526043, 518949, 550443, 534559, 524458, 531950, 534499, 506843, 493668, 560099, 624232, 627070, 599393, 583228, 581711, 566135, 561480, 550931, 549068, 589648, 616021, 586264, 561938, 541171, 526040, 557373, 582399, 535098, 489581, 504226, 536457, 533693, 525662, 529326, 506458, 512841, 529320, 525444, 521319, 553548, 582595, 556889, 534317, 500856, 527237, 549150, 534944, 513691, 551488, 568489, 551828, 546413, 554118, 566210, 541912, 513872, 522160, 518890, 482416, 467061, 463763, 507917, 562309, 590537, 592277]
14492E92277N22k948r401l9395o303O9548k475k1400n1850M89L2466J8280q192
14479E71618Q911J4903N70j8330k1478N627k2023Q838J7649k806K9911K2765l713
14466F12442j8910P837l047k6061j918K3045L1505j1859J319k2545k2199k1315
14454E48294M398n69k103r829J9130j2139K4427Q137L3266N096L3648j9737k4966
14441F07053p717l8155j9440r679K3000K9959K0367n972m6733l7501O907L1335
14429E53424K254p506J5802m2553q578J5073J8036j1391k155J6395L2123J3564
14417E94488j1068l9178q343K5633J0112M7206J2072j8354R506O012j8753N925
14405F15258K6773Q347m9954k3762J5927J7749j4209Q064m5599J0071J4689r413
$$ y = [592277, 592799, 589851, 580450, 541055, 534752, 604300, 601825, 580425, 528575, 529064, 561530, 579810, 571618, 580529, 595432, 596002, 577672, 556194, 561821, 539798, 548636, 566285, 563479, 593390, 616155, 612442, 593532, 601369, 598322, 572261, 570343, 593388, 624893, 613034, 614353, 591808, 569609, 548294, 552692, 552123, 550020, 540191, 559321, 547182, 571609, 579746, 613012, 618108, 651756, 632019, 607053, 599336, 561181, 541741, 532062, 555062, 585021, 605388, 599416, 552683, 515182, 522089, 553424, 555678, 548172, 563974, 521421, 512843, 527916, 545952, 534561, 532406, 548801, 580924, 594488, 583420, 544242, 535899, 561532, 571644, 618850, 630922, 612568, 622074, 628086, 609333, 615258, 642031, 650378, 600424, 576662, 592589, 610338, 596129, 604193, 558594, 568665, 583354, 573941]
14393E73941Q765K4234L4028n553J8842K4478k656l804p578l8400o958k1613k2190
14380E75536Q679J9170O293m8386n2113J5627M7659j9475l6413j2080L1489K4620
14368E60606J5999N911j639K1359L3144j0192l1280Q404L4996M079k0366L550
14356F24571J0770J1092L1818r731m1283O237Q335p666l0104j4563k3736l488
14344E62252J3311K3653L1419K2566q127L377j2663j4684j5169J6491K6665J0880
14332F59971l1514l2829j1745K2719R635R465k8631K8694M1409K716J6547K4307
14320G10744P83O052J4904m7694m3560N340j6033k1195L3730M5478L2523p207
14308G13865j9286j2875k3335j2515k5646j7444J9919J1350k9121J5017K8485
$$ y = [573941, 582706, 606940, 640968, 635415, 654257, 678735, 676079, 672275, 664697, 626297, 619339, 597726, 575536, 584215, 603385, 609678, 561292, 509179, 524806, 572465, 552990, 516577, 504497, 535986, 560606, 576605, 582516, 580877, 602236, 635380, 625188, 593908, 602312, 637308, 641387, 621021, 624571, 635341, 646433, 678251, 668520, 627237, 633474, 641809, 634143, 604039, 589476, 565740, 562252, 575563, 599216, 630635, 653201, 645074, 648451, 635788, 621104, 605935, 622426, 649091, 659971, 628457, 595628, 583883, 606602, 616237, 625702, 597071, 625765, 667174, 669890, 686437, 710744, 711527, 717579, 732483, 684789, 641229, 646569, 630536, 609341, 643071, 688549, 721072, 713865, 694579, 681704, 658369, 645854, 620208, 602764, 622683, 634033, 604912, 619929, 648414]
14297F48414K732J7166K4600J4049k0855k8669j783N482K6889q814k3868k0314
14285F35029j253J4716R134O88L3330K099k3115j2379k9804l633K8854L9994J3976
14272G07636j1605j2347k4446K4472L8587J0799j262k8602r974k0154L74j5042
14260F58436j1771J6239j5949K410j2072J9449J0291K0712q99k0458J9822K3226
14248G09436K0613m38K583J027L7917m4286n0746J3686k3029m1456K3475J8048
14236F66830J3398j3899K0774J5902k0420Q791j0690K2395l143j3677J5088J9493
14224G20842J8067K593K0628j1071j8393p531j1019J4234m3812k4054K7686J0820
14212F98990R7J1646O559p633o615J2185J1175J3950m2510J9217m892l5798j6564
$$ y = [648414, 651146, 668312, 692912, 706961, 686106, 657437, 655654, 661136, 688025, 679211, 655343, 635029, 633776, 648492, 657626, 658314, 691644, 693743, 670628, 658249, 628445, 624812, 653666, 693660, 707636, 696031, 683684, 659238, 683710, 722297, 733096, 731834, 703232, 693258, 673104, 673478, 658436, 646665, 662904, 646955, 649365, 637293, 656742, 667033, 687745, 686846, 666388, 686210, 709436, 730049, 729611, 732194, 733221, 771138, 726852, 676106, 689792, 666763, 625307, 648782, 666830, 680228, 666329, 687103, 703005, 682585, 691376, 680686, 703081, 699938, 686261, 701349, 720842, 738909, 741502, 762130, 751059, 732666, 725135, 714116, 728350, 684538, 660484, 688170, 698990, 699087, 710733, 717292, 709659, 703044, 715229, 726404, 740354, 697844, 717061, 712169, 676371, 659807]
14199F59807o01P244M2018N0129l1832r970j0057l2265K1811J290K770J6274N960
14186G22578K6324j64K339q23m067J244l0130R53p890k2032q453N1157k9467N539
14172G07108J5857K305P502J3299L4102m6031k1937j2181J4083p4k0830j3413
14160F79790l496L4834M8280J4181J5414j8655k7707J1264j957l874P804J3683
14148G69561L230k6705N333J629k1157o115O095J5047o183j1443M678j9984K0227
14135G34213O1654K7167o391m0174j7065m6711J910L1152j7152q208k2515j3914
14123F83966j2420j369K0859L0847L8453Q348o956L1733K53K0115j4306l3862
14111G65661l690L764n552m748L503j999M061J8062k0158Q557J5729J3165J0076
$$ y = [659807, 659206, 666450, 708468, 758597, 726765, 716795, 706738, 674473, 696284, 697574, 700344, 716618, 722578, 748902, 748738, 751077, 750254, 746187, 747431, 717301, 718254, 710364, 688332, 679879, 731036, 701569, 707108, 722965, 725270, 732772, 746071, 780173, 734142, 712205, 700024, 714107, 714033, 693203, 679790, 676294, 711128, 759408, 773589, 789003, 770348, 742641, 753905, 751948, 748074, 755878, 769561, 772791, 746086, 751419, 753048, 731891, 725776, 731871, 746918, 740735, 729292, 733970, 713986, 734213, 795867, 823034, 816643, 776469, 759404, 712693, 714603, 745755, 728603, 720395, 697880, 683966, 671546, 670177, 691036, 721883, 760336, 768684, 761728, 793461, 793714, 813829, 799523, 765661, 761971, 765735, 760183, 755435, 758938, 756939, 761000, 779062, 758904, 767461, 783190, 796355, 806431]
14098H06431j6508j816J6142O314n0439j6984n003j2398K3795j6919K6079L0953
14086G89647J1891k4793r597k4598r52O2754L4686o910q226p628k2074O407K877
14073H03484m626N557j139q413k0459m2032k645n871L5983K3272j9395l4015J7998
14060G47699K5229Q63k901r849k9J318k1460L9059m376l1998K6380L959l3561
14047G40333J8502K5006L459k878K1266r023o059j0844L226M06J7421J9217J7559
14034H37591K7305L1314n4254p187L0301L4226k4884m3697r186J1436k245l0320
14022H00400n0266N447M0459J7354J7867m716l7258j5022K5086P074L7676k938
14010H41163J681r511n001o350J099k9134M572P619j7050J6242O1Q573P753L3138
$$ y = [806431, 789923, 788107, 804249, 810563, 760124, 743140, 738137, 725739, 749534, 732615, 758694, 789647, 801538, 776745, 767148, 742550, 741598, 804352, 839038, 832128, 823902, 816274, 794200, 800607, 803484, 798858, 804415, 803276, 794863, 774404, 732372, 729727, 723856, 759839, 783111, 763716, 729701, 747699, 772928, 773791, 770890, 761041, 761012, 762330, 740870, 779929, 775553, 743555, 769935, 773894, 740333, 758835, 783841, 787300, 784422, 805688, 796665, 790606, 779762, 782988, 783394, 800815, 820032, 837591, 864896, 896210, 841956, 834769, 865070, 899296, 874412, 830715, 821529, 832965, 830720, 800400, 750134, 755581, 796040, 813394, 831261, 826545, 789287, 774265, 799351, 806425, 844101, 841163, 842844, 833333, 828332, 821982, 823081, 793947, 798519, 806138, 789088, 805330, 805391, 813964, 821717, 854855]
13996H54855K4584l6567j8395nL0527L6j5237O238M3668q0l2367j5600j3816J2375
13982H40216l8271k5369K9172O4042K9498j0873k7187K5498J99k6900j7399R496
13970H52122K4445J354p179j3288K6204J2998K2876m67l6330O474L105j3655j1704
13957H66955M85n839j9550k7861k1199j3238N142L3724L4493L5746Q452k3910
13945H73400k3356j376K887R400l1433j7560K2164J9115M949Q506j9269J0456
13933H57883j0778l284J4913J9948l741J7501q021l2110p4j5935O529K6788M552
13920H74171J9634M9215M330m5588l5904J6678K405L7957J6341k1065J5188n271
13908I28091k1244J0093l33j6598j8780k212o735J5472p124K961k1615j5229K5711
$$ y = [854855, 879439, 842872, 824477, 824472, 854999, 855035, 839798, 846036, 889704, 889624, 857257, 841657, 827841, 840216, 801945, 776576, 805748, 869790, 899288, 888415, 861228, 886726, 886925, 860025, 842626, 852122, 876567, 877921, 870742, 857454, 883658, 896656, 919532, 919065, 882735, 889209, 892314, 878659, 866955, 867440, 861601, 842051, 814190, 792991, 779753, 784895, 818619, 853112, 888858, 897310, 873400, 850044, 848668, 851555, 860955, 829522, 811962, 834126, 853241, 858190, 866696, 847427, 857883, 847105, 843821, 858734, 878682, 874941, 892442, 884421, 852311, 852237, 836302, 842831, 869619, 874171, 893805, 943020, 947350, 901762, 865858, 882536, 884941, 922898, 939239, 918174, 933362, 928091, 906847, 916940, 916607, 900009, 881229, 879017, 872282, 887754, 880630, 883591, 861976, 846747, 872458]
13895H72458j0828J2229J8499q850k259K151l052J4277L934j1997P919j132j0883
13882H82466L3027L6583K1037k7486k2440k929m2704k1214N6023K6431j6377k8022
13870H94395J2705R511L5816J5466l0094k1090k9241j2507L2795P033L1011j1476
13858I34324k2194k4393m70J48m70M1195K460j8380K206N898l3828J7483K4714
13845I28693M919o201K5338K754k5389j6824m319J6107K913P798N1754L5113j9187
13832A003469j5588l9865k7686J6017K5377L1766J9236r456l6307n4560J163K439
13820I16005k7572K0276L4375J4492R338J937m299O58q901j9523j1898L8004L1158
13807I94050n480k3345J1568K0915J3696q142r797k2551J2679j9210L453J8372
$$ y = [872458, 861630, 873859, 892358, 883508, 881249, 883400, 880348, 894625, 898559, 886562, 894481, 893349, 882466, 915493, 952076, 973113, 945627, 923187, 920258, 877554, 856340, 912363, 938794, 922417, 894395, 907100, 916611, 952427, 967893, 937799, 916709, 887468, 874961, 907756, 914789, 945800, 934324, 912130, 887737, 887267, 887415, 886945, 928140, 930600, 912220, 914426, 920324, 886496, 903979, 928693, 933612, 927411, 952749, 955503, 930114, 913290, 908971, 925078, 927991, 935789, 987543, 1022656, 1003469, 987881, 948016, 920330, 936347, 961724, 993490, 1012726, 1003270, 966963, 912403, 913566, 916005, 888433, 908709, 943084, 957576, 966914, 968851, 964552, 965210, 956309, 936786, 924888, 962892, 994050, 988570, 965225, 976793, 997708, 1011404, 1003262, 993465, 970914, 983593, 964383, 967836, 986208]
13795I86208j5319j3214J7087o819o254J89j3773j2848J6371k795j0836o989J7223
13782I48231L4702M966j7451J6747k6713j2553J1750K0023q941J9320K5560J3836
13770A029477n934L129N931l9649m1658M6250J4590j0521p649J301M1490M5450
13758A082207q630l4687l6087p167j9598J4371L6390l657j4233J5831J0998J0953
13746A046691p501n415o870K7834P019R40l5988m3789p575n922M4664L3744k8271
13733A019561k7622J8833j7207J3269J4061L0092P35l120n2460l1796L3883M1609
13721A039838L8911N907k0456j2090J2053K63N78K2092J8173o740k0128j8164
13709A060237j1913K6938r228M108k3969k2493k1137r460o245K9231L0620J7133
$$ y = [986208, 970889, 957675, 974762, 967943, 961689, 961878, 948105, 935257, 951628, 948833, 937997, 931008, 948231, 982933, 987899, 970448, 987195, 960482, 947929, 959679, 979702, 970761, 990081, 1015641, 1029477, 1023543, 1026672, 1032603, 992954, 951296, 997546, 1012136, 1001615, 993966, 995267, 1036757, 1082207, 1073577, 1038890, 1002803, 995636, 976038, 990409, 1026799, 1023142, 1008909, 1024740, 1035738, 1046691, 1039190, 1033775, 1026905, 1054739, 1061758, 1062698, 1026710, 982921, 975346, 969424, 1014088, 1047832, 1019561, 991939, 1010772, 993565, 1006834, 1020895, 1050987, 1051722, 1048602, 996142, 964346, 998229, 1039838, 1078749, 1084656, 1064200, 1052110, 1064163, 1064426, 1065004, 1087096, 1105269, 1098529, 1078401, 1060237, 1048324, 1075262, 1066034, 1070142, 1046173, 1023680, 1002543, 993083, 986838, 1016069, 1046689, 1063822]
13697A063822K5637K806m5162K2093K6265r32l8067k627j1523k1503N5017K5286
13685A101112k6588k5413l010K2414J7589J2754J3362j3134l4007Q243J2958j9291
13673A066989m710K2318L9209K6905k3611n8100n6377P82K0371m14J0781K5549
13661A069692O377j2957J0557q457n51R525m645K1134j128l6859q774K4122L1573
13648A099609M934M873k4064o417k5066l2083K9560M3607K780j5512k2846J8965
13636A078340O7793k4883l6697K885K3905J307l3001l0467p183K9678K0027q736
13624A082968j1684L680K1829N1442J4336j3778j1871L951r400J2082L772j8993
13612A128334k0056N427L2452j1345j1812m3071k0070K5383M7733n688K6046Q539
$$ y = [1063822, 1089459, 1092265, 1047103, 1069196, 1095461, 1094529, 1056462, 1053835, 1042312, 1020809, 1075826, 1101112, 1074524, 1049111, 1046101, 1068515, 1086104, 1098858, 1112220, 1099086, 1065079, 1073322, 1086280, 1066989, 1062279, 1084597, 1123806, 1150711, 1127100, 1069000, 1012623, 1013405, 1033776, 1033362, 1044143, 1069692, 1076069, 1063112, 1073669, 1065212, 1064661, 1074186, 1069541, 1090675, 1089547, 1052688, 1043914, 1068036, 1099609, 1104543, 1109416, 1085352, 1078935, 1053869, 1021786, 1051346, 1094953, 1097733, 1082221, 1059375, 1078340, 1146133, 1121250, 1084553, 1087438, 1111343, 1112650, 1079649, 1049182, 1041999, 1071677, 1091704, 1082968, 1071284, 1074964, 1096793, 1148235, 1162571, 1148793, 1136922, 1140873, 1131473, 1143555, 1147327, 1128334, 1108278, 1113705, 1146157, 1134812, 1123000, 1079929, 1059859, 1085242, 1132975, 1127287, 1153333, 1161872]
13600A161872k281j1604L32l0879N959r6l163M557r357M221L689N890K5571K3414
13586A178125J045L303J2566l3174l1192j3828Q429L8099J842n6604K5527J913
13574A136051r918K3015j0736L3898J6079p059k7460j4853L6182K6359J8948r125
13562A211381O410j6591l3586j2760j0555O2995K7402j2333j6710j6832L289J310
13550A193420J2000j4471j2413j6811r61K9525p2K3442J8114n5646j6835j1956
13538A147336Q785L2269J4615m7009K298J6752M565L1323j2488K453J9384J5086
13526A235369j6959nk3008l490R997k8375J128L6699M079J344j0252J2274J677
13513A220478P644N844p463r569j8168k254K456K9261O337l9111k6823N123L3963
$$ y = [1161872, 1159591, 1147987, 1148319, 1117440, 1123399, 1123303, 1120140, 1124697, 1115340, 1119561, 1123250, 1129140, 1154711, 1178125, 1179170, 1182473, 1195039, 1161865, 1130673, 1116845, 1125274, 1163373, 1165215, 1108611, 1134138, 1136051, 1126133, 1149148, 1138412, 1172310, 1188389, 1181330, 1153870, 1139017, 1175199, 1201558, 1220506, 1211381, 1217791, 1201200, 1167614, 1154854, 1144299, 1207294, 1234696, 1222363, 1205653, 1188821, 1192110, 1193420, 1205420, 1190949, 1178536, 1161725, 1160764, 1190289, 1190217, 1213659, 1231773, 1176127, 1159292, 1147336, 1156121, 1188390, 1203005, 1155996, 1158294, 1175046, 1179611, 1210934, 1198446, 1200899, 1220283, 1235369, 1218410, 1218405, 1195397, 1191907, 1201904, 1173529, 1174657, 1211356, 1215435, 1216779, 1206527, 1218801, 1220478, 1228122, 1233966, 1226503, 1216934, 1198766, 1196512, 1198968, 1228229, 1234566, 1195455, 1168632, 1173755, 1207718]
13500A207718M3909K6423K5183j961J3054r187J4964m836m5169L194J380L0431
13488A305103n813j3149p345L749J0702R131m2333k3819P87K484L2444N349j3808
13475A263482j182J0677k332J3857J282K7747K6142J5488k0497j6656m484j8451
13463A295073j5014j3548L175n796J4075n81j8749j3118k6448K30K0906N4565
13451A294770L1268m312J7948N156j3012N762m751j6072k465J9732j068l724o745
13438A322487j2720q533K5608k3780Q602R86o214j5747L698N2069n146L1275P237
13425A379822j8214k9596M1722N856l1140j8601K7922M319M759j215M280P916
13413A377830k7300L268L2463j0472R605L181j1015k0774J6395L2019r175j5821
$$ y = [1207718, 1251627, 1278050, 1303233, 1301272, 1314326, 1305139, 1320103, 1315267, 1270098, 1273292, 1274672, 1305103, 1299290, 1286141, 1278796, 1282545, 1293247, 1302378, 1260045, 1236226, 1237013, 1239497, 1271941, 1277290, 1263482, 1262300, 1272977, 1270645, 1284502, 1285784, 1313531, 1339673, 1355161, 1334664, 1318008, 1313524, 1295073, 1280059, 1266511, 1269686, 1263890, 1277965, 1277384, 1258635, 1245517, 1219069, 1219299, 1240205, 1294770, 1326038, 1321726, 1339674, 1344830, 1331818, 1337580, 1332829, 1316757, 1314292, 1334024, 1332956, 1329232, 1322487, 1309767, 1301234, 1326842, 1303062, 1311664, 1312650, 1306436, 1290689, 1294387, 1346456, 1341310, 1372585, 1379822, 1361608, 1332012, 1373734, 1379590, 1348450, 1329849, 1357771, 1362090, 1366849, 1365634, 1369914, 1377830, 1350530, 1353798, 1386261, 1375789, 1385394, 1388575, 1377560, 1356786, 1373181, 1405200, 1396025, 1380204]
13401A380204n0877m0629K1428L5362N1347L6889J2995m9840l6900P389o234J8743
13389A379877K6219j8959J5793K2485K5262j3153l7480J6526n041j600j3988m088
13377A391853j7116K954j5149M1505K4468J545J4780k1O440L571m825n881j7166
13364A426958l6061K0574N1839J5909J3773l9371m2618P079L7139K2957m345k7241
13352A446592j7491j5486j0526J8650j2947r471P381K1435n17J7989k980l0261
13340A412368j6183J5652K380K03j2132K0150M2231M0090P005q901k6147k868
13328A473848l813K8789P989p149m142r589L5861K184k8021O596k675K2555J9943
13315A542376k2150j2266J5245M759k773K5734j2324q477K997j6457o401J8511
$$ y = [1380204, 1329327, 1288698, 1310126, 1345488, 1396835, 1433724, 1446719, 1396879, 1359979, 1367368, 1361134, 1379877, 1406096, 1387137, 1402930, 1425415, 1450677, 1437524, 1400044, 1416570, 1411529, 1409929, 1395941, 1391853, 1374737, 1377691, 1362542, 1404047, 1428515, 1430060, 1444840, 1444819, 1451259, 1454830, 1450005, 1444124, 1426958, 1390897, 1411471, 1463310, 1479219, 1492992, 1453621, 1411003, 1418082, 1455221, 1478178, 1473833, 1446592, 1429101, 1413615, 1403089, 1421739, 1408792, 1399321, 1406702, 1428137, 1427620, 1445609, 1442629, 1412368, 1396185, 1411837, 1414217, 1414420, 1402288, 1422438, 1464669, 1504759, 1511764, 1502863, 1476716, 1473848, 1470035, 1498824, 1506813, 1499664, 1495522, 1485933, 1521794, 1523978, 1495957, 1502553, 1499878, 1522433, 1542376, 1520226, 1507960, 1523205, 1527964, 1525191, 1550925, 1538601, 1530124, 1533121, 1516664, 1510263, 1528774]
13303A528774N98P936m938o464J7843L4764j1422J4529k2939k0712o205k5090
13291A506674k0535J3951J3427j5965J5881N1447K0382K0205R698l2517Q5k3603
13279A559130j6662K74J1356K9473j1438n738N15N676J5249M8093N946j9124J2212
13266A634962l592k3631L7292K1988j7832K7166L3519k2413k5629n201j9004L22
13254A637947J572k2812k1631n216j1165J5597M3724J9512L254L1022J8113l2434
13242A677483k6907o351j1667j9760j1822L1080K0300J5304K8922k538q903N641
13230A690782k7927J3480M485j074K1748o726L2506p515j728J6610j8345r938
13218A706358M0692o246j0488M842K9012K6413M1562K1394m1525j766J038o972
$$ y = [1528774, 1529372, 1537308, 1532370, 1525906, 1543749, 1578513, 1567091, 1581620, 1558681, 1537969, 1531764, 1506674, 1486139, 1500090, 1513517, 1497552, 1513433, 1564880, 1585262, 1605467, 1615165, 1582648, 1582733, 1559130, 1542468, 1542742, 1554098, 1583571, 1572133, 1566395, 1566910, 1572586, 1587835, 1635928, 1641874, 1622750, 1634962, 1631370, 1607739, 1645031, 1667019, 1649187, 1676353, 1709872, 1687459, 1661830, 1656629, 1637625, 1637947, 1639519, 1616707, 1595076, 1589860, 1578695, 1594292, 1638016, 1657528, 1660782, 1691804, 1709917, 1677483, 1650576, 1644225, 1632558, 1612798, 1600976, 1632056, 1652356, 1667660, 1696582, 1694044, 1685141, 1690782, 1662855, 1676335, 1680820, 1679746, 1701494, 1694768, 1727274, 1719759, 1718031, 1734641, 1716296, 1706358, 1747050, 1740804, 1730316, 1735158, 1764170, 1790583, 1832145, 1853539, 1812014, 1810248, 1811286, 1804314]
13206A804314J1462J4772K8401R423K6975J0614J7645K6844k0364p8078p1998
13195A780010p8226j2930l4347j8401m329L6248M3232K5035p575k1384K425j451
13183A708307L2519k3596P357J190J4916K7035J0232K7312O2399j2989o1992J2251
13171A804941P3517K3189K2669m725N708J6880j9409K7802O1113L3414M875L9346
13159B089320L5935K9330O2582N4554L3936r799n2121j72555k57376k53070j89088
13148A371648m9251N290M3044M6757N9281K2745J331J7743l035J433O1776N6013
13136A634775M604K1644J3014J1610J7384N063L2190J5660J4279l739K8675K6229
13124A821388L0477P921K0670M5938M172p004R066M6737N5288M9514J7613M7362
$$ y = [1804314, 1815776, 1830548, 1858949, 1868372, 1895347, 1905961, 1923606, 1950450, 1930086, 1852008, 1780010, 1701784, 1688854, 1654507, 1636106, 1631777, 1668025, 1711257, 1736292, 1728717, 1707333, 1709758, 1708307, 1740826, 1717230, 1724587, 1725777, 1740693, 1767728, 1777960, 1805272, 1867671, 1854682, 1792690, 1804941, 1878458, 1901647, 1924316, 1919591, 1925299, 1942179, 1922770, 1950572, 2011685, 2045099, 2049974, 2089320, 2125255, 2154585, 2217167, 2271721, 2305657, 2295858, 2243737, 2071182, 1813806, 1560736, 1371648, 1322397, 1327687, 1370731, 1417488, 1476769, 1499514, 1500845, 1518588, 1515553, 1516986, 1578762, 1634775, 1639379, 1661023, 1674037, 1685647, 1703031, 1708094, 1740284, 1755944, 1770223, 1766484, 1795159, 1821388, 1851865, 1859786, 1880456, 1926394, 1930566, 1923562, 1932628, 1979365, 2034653, 2084167, 2101780, 2149142]
13112B149142R3212O7886N9607j35r3668j87733k76397k78531k06864o2052N851
13101A270318N1174M0923O2299Q4770L6326%K0118J0128L8275O493J7694P240
13089A645758K8047J2684K914j4759M5873K7175P554K0734Q058K9554n621q660
13077A799311K1707K3274l075j5363K0092K0650L0251p904p552O1295L9946j3953
13065A968679N1021L0824n8425o7739p7120r8316m4689k6230j8874L5851L1442
13054A726424L3028K3862N5520M5900j5944P056j4707l3117j7259J0525K9805
13043A851093K9117k16L3619j6p534j4352m882J5138O690N213J9693L9779N140
13030A978482l3356j781J0736J2511l797j4958j0007J4535O589K2029l261j5751
$$ y = [2149142, 2242354, 2310240, 2369847, 2369712, 2276044, 2088311, 1811914, 1533383, 1326519, 1264467, 1270318, 1321492, 1362415, 1424714, 1509484, 1545810, 1545810, 1565928, 1576056, 1614331, 1620824, 1638518, 1645758, 1673805, 1686489, 1689403, 1674644, 1720517, 1747692, 1755246, 1775980, 1784038, 1813592, 1807971, 1799311, 1821018, 1844292, 1841217, 1825854, 1845946, 1866596, 1896847, 1888943, 1881391, 1942686, 1982632, 1968679, 2019700, 2050524, 1992099, 1924360, 1847240, 1748924, 1704235, 1678005, 1659131, 1694982, 1726424, 1759452, 1783314, 1838834, 1884734, 1868790, 1875846, 1861139, 1828022, 1810763, 1821288, 1851093, 1880210, 1879994, 1913613, 1913597, 1906063, 1891711, 1886829, 1901967, 1908657, 1913870, 1933563, 1973342, 1978482, 1945126, 1943345, 1954081, 1966592, 1962795, 1947837, 1937830, 1952365, 1958954, 1980983, 1977722, 1961971]
13018A961971J5921L6824J3509j8840J022j4702l753K2144O926j4198K361K2246
13006B031431n205k2561K0768q72j5231K5128K6909J9315k3370j5446K079o599
12994B036346O729L233M093m252J2584L0235J1742J1557j9689j2433M4305K6759
12982B151209k285k4533k2747L978K1217j9145K4592K1561J040J963k5644N81
12970B131787K0365j639L3630K9145k5583l792K4654M3209o767k4382r252m500
12958B206875J4519L1810j1249k6928N3379j6123j3543K9787R428k0989J4182
12947B271148k4147R466K1998J1543k0526L3148j0663j1471j8336k336L6007k6489
12935B269342m204K3402j1894J5328K0881j9703J4627N5808K8471L01l813j7485
$$ y = [1961971, 1977892, 2014716, 2028225, 2009385, 2010407, 1995705, 1991952, 2014096, 2021022, 2006824, 2009185, 2031431, 2026226, 2003665, 2024433, 2023561, 2008330, 2033458, 2060367, 2079682, 2056312, 2040866, 2042945, 2036346, 2043075, 2046308, 2050401, 2046149, 2058733, 2088968, 2100710, 2112267, 2092578, 2080145, 2124450, 2151209, 2148924, 2124391, 2101644, 2105622, 2126839, 2107694, 2132286, 2153847, 2154887, 2156850, 2131206, 2131787, 2152152, 2150513, 2184143, 2213288, 2187705, 2183913, 2208567, 2251776, 2245009, 2220627, 2211375, 2206875, 2221394, 2253204, 2241955, 2215027, 2268406, 2252283, 2238740, 2268527, 2277955, 2256966, 2271148, 2247001, 2256467, 2278465, 2290008, 2269482, 2302630, 2291967, 2280496, 2262160, 2259824, 2295831, 2269342, 2265138, 2288540, 2276646, 2291974, 2312855, 2293152, 2307779, 2363587, 2392058, 2392359, 2388546, 2371061]
12923B371061M835q704o710N221L3521J9252J158K100l5890m3344K465Q996R950
12910B363911r922K923R790M0981M552N021L7645J0722j0028K676k1739M640K4756
12897B465928J8384j6780K1400J5438R622J2416J6389m4763j2300L210q762K6534
12885B506716J1585K4421j798M54K4373J074K0997J5057k700j867J7096Q954r682
12872B614680L0790p188j3403j0193K0841J5379j4294r09L6477l212j5037J7028
12860B670959P497q14L9477N533m1697J7937O331K3534L6047K0240k6815k4036
12848B734193J4222K7644R746P325R647L1307K705k705K4049J7798K542k602J3820
12835B889691J6701l987K4058M3455K6134J3835K6122K424L6095N1564M7209M2379
$$ y = [2371061, 2375896, 2367192, 2360482, 2365703, 2399224, 2418476, 2419634, 2421734, 2385844, 2342500, 2344965, 2353961, 2363911, 2353989, 2356912, 2366702, 2407683, 2412235, 2417256, 2454901, 2465623, 2455595, 2458271, 2436532, 2441172, 2465928, 2484312, 2467532, 2488932, 2504370, 2513992, 2526408, 2542797, 2498034, 2485734, 2488944, 2480182, 2506716, 2518301, 2542722, 2540924, 2541378, 2565751, 2566825, 2587822, 2602879, 2600179, 2598312, 2615408, 2624362, 2614680, 2645470, 2638282, 2624879, 2614686, 2635527, 2650906, 2636612, 2635703, 2672180, 2668968, 2653931, 2670959, 2678456, 2677642, 2717119, 2722652, 2680955, 2698892, 2705223, 2728757, 2764804, 2785044, 2758229, 2734193, 2748415, 2776059, 2785805, 2793130, 2802777, 2834084, 2836789, 2834084, 2858133, 2875931, 2878473, 2875871, 2889691, 2906392, 2902405, 2926463, 2969918, 2996052, 3009887, 3036009, 3038433, 3074528, 3126092, 3173301, 3215680]
12823C215680K3964r57J9554L337n6926n9995p8397m7891l5075m6745n3334q3358
12811B799857q3484o7153k3677J1261l3081n6251j6020j9617l1981K0244K3260
12800B523358L3996O2920L6059Q860J7402M6041O308K5775k679J8359L5464K9528
12788B841391K86P174m25j4570J1197Q405Q309L547P116N5026O8164O599k1832
12775B980387j904M743N437j6579J6545K2996J2999J9745K617J1896Q767M369
12763C072018L9001K210j3833j897j7J8757j7489j8391L3470R531K8919J7723
12751C170002J2326L5949K2105j9841m546l610m5589k4902L5170K6878J8681M0062
12739C262685M8779K1850M7731k1583j4615o9406k7654J2010L8587K8466K4797
$$ y = [3215680, 3239644, 3238687, 3258241, 3261578, 3204652, 3144657, 3066260, 3018369, 2983294, 2936549, 2883215, 2799857, 2716373, 2649220, 2625543, 2636804, 2603723, 2547472, 2531452, 2511835, 2479854, 2500098, 2523358, 2557354, 2620274, 2656333, 2665193, 2682595, 2728636, 2734944, 2760719, 2758040, 2776399, 2811863, 2841391, 2841677, 2848851, 2848426, 2833856, 2845053, 2853458, 2861767, 2865314, 2872430, 2927456, 2995620, 3002219, 2980387, 2978483, 2983226, 2988663, 2972084, 2988629, 3011625, 3024624, 3044369, 3046986, 3058882, 3067649, 3072018, 3111019, 3113229, 3099396, 3097499, 3097482, 3116239, 3098750, 3080359, 3113829, 3123360, 3152279, 3170002, 3182328, 3218277, 3240382, 3220541, 3215995, 3212385, 3166796, 3141894, 3177064, 3203942, 3222623, 3262685, 3311464, 3333314, 3381045, 3359462, 3344847, 3275441, 3247787, 3259797, 3298384, 3326850, 3351647]
12728C351647r504l61J6458K9068j822j0183o354j7285M8658O0390K7038L0944
12716C518694J0855l5207k6138J9820K2057J7586O961j1546n209J3701j8032L4244
12704C547786M891L6106J2021L846N231J0544L5820K0715L4318L2000K1963n972
12692C759269N733O164r42K899R868J89L5348J3404J8664K1374k08j0086r959
12679C851717L9534M9880K005L404P708j762J3153L4622J6254K3429J4685l1126
12667D023503R832L3203Q710k1875j0614M8888j353M5770K4670L892K8651J2839
12655D206116j9149L3K7138K6975L0560M087N360j488r054k1067k2661N7682N4744
12642D339276N180j0631n520O783J3079L108J1471l1679J0124j6786J1L8655J4190
$$ y = [3351647, 3342143, 3341782, 3358240, 3387308, 3385486, 3375303, 3368949, 3351664, 3400322, 3460712, 3487750, 3518694, 3529549, 3494342, 3468204, 3488024, 3510081, 3527667, 3534628, 3523082, 3517873, 3531574, 3513542, 3547786, 3552677, 3588783, 3600804, 3604650, 3609881, 3620425, 3656245, 3676960, 3711278, 3743278, 3765241, 3759269, 3765002, 3771166, 3770224, 3773123, 3782991, 3783180, 3818528, 3831932, 3850596, 3871970, 3871762, 3861676, 3851717, 3891251, 3941131, 3943136, 3946540, 3954248, 3952486, 3965639, 4000261, 4016515, 4039944, 4054629, 4023503, 4033335, 4066538, 4075248, 4053373, 4042759, 4091647, 4090294, 4136064, 4160734, 4164626, 4193277, 4206116, 4186967, 4187000, 4214138, 4241113, 4271673, 4275760, 4281120, 4279632, 4270578, 4249511, 4226850, 4284532, 4339276, 4344456, 4333825, 4328305, 4335088, 4348167, 4351275, 4362746, 4331067, 4341191, 4324405, 4324416, 4363071, 4377261]
12629D377261L3156L7345N3859K8361J1961R679l428j1838K6664k1892l2618L4551
12617D543061N2375K6450O3955L2951P02J5460P635J1816R958N2551M0691J8514
12605D876119k881L433K1787K9764J1249J7467M7203L7516K6287K6735K0838Q959
12593E124476j7236j2714J363N1150K3079J8696K2031Q223M0951P7292M6355M411
12581E388077K5064K925K0916m2221k7008J7087J9483N9001M0918N1280M7933
12570E603455J2438p181M7572M8694J6271P365L885L4217M1843M9719M5850K3490
12558E927618K6266R076P4780O4325J1986m363L0259M7326k866L2738P1334J3715
12546F302194K8093L4839M0525N5512L3536N8082K8830K3965M3072J6524L9778
$$ y = [4377261, 4410417, 4447762, 4501621, 4529982, 4541943, 4551622, 4548194, 4536356, 4563020, 4541128, 4508510, 4543061, 4595436, 4621886, 4685841, 4718792, 4719494, 4734954, 4742589, 4754405, 4764363, 4816914, 4857605, 4876119, 4873238, 4876671, 4898458, 4928222, 4939471, 4956938, 5004141, 5041657, 5067944, 5094679, 5115517, 5124476, 5107240, 5094526, 5095889, 5147039, 5170118, 5188814, 5210845, 5219068, 5260019, 5337311, 5383666, 5388077, 5413141, 5416066, 5436982, 5394761, 5367753, 5384840, 5404323, 5463324, 5504242, 5555522, 5603455, 5615893, 5608712, 5656284, 5704978, 5721249, 5728614, 5732499, 5766716, 5808559, 5858278, 5904128, 5927618, 5953884, 5962960, 6037740, 6102065, 6114051, 6109688, 6139947, 6187273, 6184407, 6217145, 6288479, 6302194, 6330287, 6365126, 6405651, 6461163, 6494699, 6552781, 6581611, 6605576, 6648648, 6665172, 6704950]
12535F704950L8690N6218J6357L7043L7346L4872L0782O8504Q2437L7432L1232
12524G175863N7214O695K7955O5986O8347K5405L5183N8156P6545N1954J5591
12513G664894N5186L9099M8021L6434N2769M0197J4301O2845P4327O9144N4788
12502H212005N7814L0044L6748P0171R1352R2455P8215P8375O2984N9111J03216
12491H972490O3509O9265N5255J18295J37636Q5208Q3719Q1656J00856O0521N9221
12480I887631J09769J15768Q2154O3678Q2121Q5728R3000R2464J17565J26965
12470A0856843J14968J21046J49564J00387J23398J45196J46404J26527J26850
12461A2011183J67311J86504J53307J23677J49432J87806J64264J79397J67503
$$ y = [6704950, 6743640, 6799858, 6816215, 6853258, 6890604, 6925476, 6956258, 7024762, 7107199, 7144631, 7175863, 7233077, 7239772, 7267727, 7333713, 7402060, 7427465, 7462648, 7520804, 7597349, 7649303, 7664894, 7720080, 7759179, 7807200, 7843634, 7896403, 7936600, 7950901, 8013746, 8088073, 8157217, 8212005, 8269819, 8299863, 8336611, 8406782, 8498134, 8590589, 8668804, 8747179, 8810163, 8869274, 8972490, 9035999, 9105264, 9160519, 9278814, 9416450, 9501658, 9585377, 9667033, 9767889, 9828410, 9887631, 9997400, 10113168, 10195322, 10259000, 10341121, 10426849, 10519849, 10612313, 10729878, 10856843, 10971811, 11092857, 11242421, 11342808, 11466206, 11611402, 11757806, 11884333, 12011183, 12178494, 12364998, 12518305, 12641982, 12791414, 12979220, 13143484, 13322881, 13490384]
12452A3490384J90325K05170K38839J84868K15348K26905K06854K35755K45938
12443A5440386K54087K63446K76269K62723L13603L08823L20818L04705L60824
12434A8105684L89216L65591M00392M33728M34886M18817M46528M85731N34803
12425B2015376N60311N87562O17171O56204P19398P73029Q05600Q65413R35573
12416B8535637R79526J032307J102521J178341J280373J396272J528513J620320
12408C8653810J792536K023293K213031K458133K781904L187411L663256M120864
12400F0894238M458276M486373L719783J765144p71742k842201m127208n196133
12392F2386530o564408q277449r910328j1499179j2977235j3695766j3283437
$$ y = [13490384, 13680709, 13885879, 14124718, 14309586, 14524934, 14751839, 14958693, 15194448, 15440386, 15694473, 15957919, 16234188, 16496911, 16810514, 17119337, 17440155, 17744860, 18105684, 18494900, 18860491, 19260883, 19694611, 20129497, 20548314, 20994842, 21480573, 22015376, 22575687, 23163249, 23780420, 24436624, 25156022, 25929051, 26734651, 27600064, 28535637, 29515163, 30547470, 31649991, 32828332, 34108705, 35504977, 37033490, 38653810, 40446346, 42469639, 44682670, 47140803, 49922707, 53110118, 56773374, 60894238, 65352514, 69838887, 73558670, 75323814, 74552072, 71709871, 67582663, 62386530, 55822122, 47544673, 37634345, 26135166, 13157931, -537835, -13821272]
12385a3821272j2051837j0675820r191632p555476o087608n018548l838607j871150
12377g0111950O78492K846892L936079M138321L941994L547440L179217K864322
12369d4979193K553496K281254K056135J891747J676254J556282J450137J310505
12361c0203383J265317J165078J086973J041744R58827R33587R13684Q54455Q00614
12352b1183104P19990O40902O20362O01430N55013N54879N10058M68678M53881
12343a6057911M72134L99561L94165L89918L68041L48029L23386L20697L22546
12334a2719434K97509K67114K51968K57853K50743K21204K36543K79952J78456
12325a0478092K00337J93349J86359K07551K21306K17945J87091J54582J72899
$$ y = [-13821272, -25873109, -36548929, -45740561, -53296037, -59383645, -64402193, -68240800, -70111950, -69433458, -66586566, -62650487, -58512166, -54570172, -51022732, -47843515, -44979193, -42425697, -40144443, -38088308, -36196561, -34520307, -32964025, -31513888, -30203383, -28938066, -27772988, -26686015, -25644271, -24685444, -23751857, -22838173, -21983718, -21183104, -20463114, -19822212, -19201850, -18600420, -18045407, -17490528, -16980470, -16511792, -16057911, -15585777, -15186216, -14792051, -14402133, -14034092, -13686063, -13362677, -13041980, -12719434, -12421925, -12154811, -11902843, -11644990, -11394247, -11173043, -10936500, -10656548, -10478092, -10277755, -10084406, -9898047, -9690496, -9469190, -9251245, -9064154, -8909572, -8736673]
12316h736673J55693J66539J50664J64302J64942J56387J29643J09580J25735
12307g413188Q1321J44106J37654J21045J45878J17911R7650R6902P8984J43341
12297f248396J46094J18431J06081R3801P6793Q9416O7981J18225J17397J29054
12287e185123R0472R4221P4057M7337P1152M9749R2806P6106P9030J08513J39973
12276d261707R7185O4483R2770J10109J06714Q5197P4736J42599Q7226P4064J00833
12265c225791R4762J41212J29387J16826J41099J37843M0304r8125l73560m58111
12255c354154m50047k98664p9978P2764P4650Q1127J01756P8741J18651J38870
12245c516284P9148R8227P7277O6457J15399Q8650P7356N5188N1814Q4542N7119
$$ y = [-8736673, -8580980, -8414441, -8263777, -8099475, -7934533, -7778146, -7648503, -7538923, -7413188, -7331867, -7187761, -7050107, -6929062, -6783184, -6665273, -6567623, -6470721, -6391737, -6248396, -6102302, -5983871, -5877790, -5783989, -5707196, -5617780, -5549799, -5431574, -5314177, -5185123, -5094651, -5000430, -4926373, -4879036, -4807884, -4758135, -4665329, -4589223, -4510193, -4401680, -4261707, -4164522, -4100039, -4007269, -3897160, -3790446, -3705249, -3630513, -3487914, -3400688, -3326624, -3225791, -3131029, -2989817, -2860430, -2743604, -2602505, -2464662, -2424358, -2522483, -2896043, -3354154, -3804201, -4102865, -4182843, -4110079, -4035429, -3954302, -3852546, -3773805, -3655154, -3516284, -3437136, -3338909, -3261632, -3195175, -3079776, -2991126, -2913770, -2858582, -2806768, -2722226, -2665107]
12234b665107L2257K2234M1790P0760K7318K8206N4232N2951O5547K6208K2804
12223b220800M8475K4407P0391O4844K8239K8672L1878j4329K2926N2078M5986
12212a817233L4234J4064J3925L8165M5559L9774M8237M2857K9311L2948J3654
12201a464505q986j1800K4427N4251N8166L6712M5542N4618M7602L8193O464L5158
12189a084158P981L7537N6831N3586K9382O859J3432J5412K2146L6310N9471L3653
12177g11558N8133p834P079M2629P9563L4051J0745J2731R331k734K6635L8953
12165d02276K8342L2059K1642M8181L7183o86J7957J5280P5706N6999M2747K3955
12153b911J4230J8927J5123J531O143M7692J6987J5023K8315K8856M1582L648
$$ y = [-2665107, -2632850, -2610616, -2568826, -2498066, -2470748, -2442542, -2388310, -2335359, -2269812, -2243604, -2220800, -2172325, -2147918, -2077527, -2012683, -1984444, -1955772, -1923894, -1938223, -1915297, -1863219, -1817233, -1782999, -1768935, -1755010, -1716845, -1671286, -1631512, -1583275, -1540418, -1511107, -1478159, -1464505, -1473491, -1485291, -1460864, -1406613, -1348447, -1311735, -1266193, -1211575, -1163973, -1125780, -1119316, -1084158, -1076177, -1038640, -981809, -928223, -898841, -891982, -878550, -863138, -840992, -804682, -745211, -711558, -653425, -661259, -654180, -611551, -531988, -497937, -487192, -474461, -465130, -467864, -441229, -402276, -373934, -341875, -320233, -272052, -234869, -235555, -217598, -202318, -126612, -69613, -26866, -2911, 11319, 30246, 45369, 46900, 53043, 100735, 117722, 132745, 161060, 189916, 231498, 235146]
12141B35146L7632k4748R515L7368P5000J0353L0005K9897k9422q689J5811O3561
12129D81429N0136L4233K0699J8910M0454J6219L4554L0257N7171O1954j944R105
12117H53177L2200O931K2770J0235j8944J7790O6273M6859M5923Q973R262J7262
12105A118711K5943P673j897J4483K6932K9990M6999N5500L0183j0213M4772N3785
12093A442861O7651P947J0395J5507L764L3340N3842K7416J0197J4602L8575Q695
12081A734792M9268M0106K4669M7282M4121J7365K1436q428M1040M8787N0704
12070B111142L0637j1971l2791j3506k2445r625l378L950L8536L5754L1819O6143
12058B224265L6523M0269K6272M5968K4243K5677K0758j9616N8093J8497O1593
$$ y = [235146, 272778, 248030, 257545, 294913, 369913, 380266, 410271, 440168, 410746, 402057, 417868, 481429, 531565, 565798, 586497, 605407, 645861, 662080, 696634, 726891, 784062, 846016, 844072, 853177, 885377, 892308, 915078, 925313, 906369, 924159, 990432, 1037291, 1083214, 1092187, 1101449, 1118711, 1144654, 1152327, 1150430, 1164913, 1191845, 1221835, 1268834, 1324334, 1354517, 1344304, 1389076, 1442861, 1510512, 1518459, 1528854, 1544361, 1548125, 1581465, 1635307, 1662723, 1672920, 1687522, 1726097, 1734792, 1784060, 1824166, 1848835, 1896117, 1940238, 1957603, 1979039, 1970611, 2011651, 2060438, 2111142, 2141779, 2129808, 2097017, 2083511, 2061066, 2051441, 2048063, 2052013, 2090549, 2126303, 2158122, 2224265, 2260788, 2301057, 2327329, 2373297, 2397540, 2423217, 2443975, 2424359, 2482452, 2500949, 2562542]
12047B562542P4806K1363K0111L5869L0015L2151Q457K9429K1657K5265K7845
12036B889510N8075N9266K7373N5892J5933j31K9537M8415O0536K8826k6201K594
12024C249625Q270M4248M4542M2980N8529J7823J7475M0699K8527M9389M9679
12013C651786M9502L5977L9488N4423J4801J438l708J632M6631N2313N1459N6796
12001D052538O0510L6059P3392L8815J5618N3638M2229M3587O9324N1677L8747
11990D576134M2323P0043J1755O7823R6190P9657L2186q459L0426M0029M4652
11979E082759Q5712Q4450O6014N5771Q2381J08017O8043K9401P7117Q3511J00159
11968E923335Q0229J03716Q4991K5960J8366L6347k651N683K5172L4711N0058
$$ y = [2562542, 2637348, 2658711, 2678822, 2714691, 2744706, 2776857, 2785314, 2814743, 2836400, 2861665, 2889510, 2947585, 3006851, 3034224, 3090116, 3106049, 3105918, 3135455, 3183870, 3244406, 3273232, 3247031, 3249625, 3257895, 3302143, 3346685, 3389665, 3448194, 3466017, 3483492, 3524191, 3552718, 3602107, 3651786, 3701288, 3737265, 3776753, 3831176, 3845977, 3847415, 3843707, 3845339, 3891970, 3944283, 3995742, 4052538, 4113048, 4149107, 4222499, 4261314, 4276932, 4330570, 4372799, 4416386, 4485710, 4537387, 4576134, 4618457, 4688500, 4700255, 4768078, 4864268, 4943925, 4976111, 4967652, 4998078, 5038107, 5082759, 5168471, 5252921, 5318935, 5374706, 5457087, 5565104, 5633147, 5662548, 5739665, 5823176, 5923335, 6003564, 6107280, 6192271, 6218231, 6236597, 6272944, 6270293, 6275976, 6301148, 6335859, 6385917]
11957F385917k003j5972p760m679J8120M1808K3070j2906J0391M7530J16595J47876
11945F747987J00936J04010J07929Q0238L5550L6841N8553J8734L4576Q3416N7077
11934G465847P2336J12881P4938R0624R2509J01503J05806J43397J46245J28197
11924H534283J23170J28562Q6836Q0584J31424J40607J19202J22070J41368J34872
11914I742978J38035J31601J34082J20533J28727R9955J28464J22343J41583J68711
11904A1057012J69673J65259J26218J44434J69047J55005J20637J27001K14600
11895A2448886J99622K01118J95164J91628K36217K14590K37157K09364K29284
11886A4363030K31833K13364K54977K50132K42593K27167K75695L01574K94404
$$ y = [6385917, 6383914, 6367942, 6360182, 6355503, 6373623, 6415431, 6438501, 6425595, 6435986, 6483516, 6600111, 6747987, 6848923, 6952933, 7060862, 7141100, 7176650, 7213491, 7272044, 7290778, 7325354, 7408770, 7465847, 7538183, 7651064, 7726002, 7816626, 7909135, 8010638, 8116444, 8259841, 8406086, 8534283, 8657453, 8786015, 8872851, 8953435, 9084859, 9225466, 9344668, 9466738, 9608106, 9742978, 9881013, 10012614, 10146696, 10267229, 10395956, 10495911, 10624375, 10746718, 10888301, 11057012, 11226685, 11391944, 11518162, 11662596, 11831643, 11986648, 12107285, 12234286, 12448886, 12648508, 12849626, 13044790, 13236418, 13472635, 13687225, 13924382, 14133746, 14363030, 14594863, 14808227, 15063204, 15313336, 15555929, 15783096, 16058791, 16360365, 16654769]
11877A6654769L30533L38910L89546L53154L13363L28123L48467L42028L55163
11868A9754056M23277M20783L99144M27521M94422M86165N06146N40645O28786
11859B4080945O51801O18521O37224O81173O68422O90815P15736P97895Q77800
11850C0420332R49254J007629J033599J041465J085077J179442J310032J419304
11842C9446134J535152J695762J847555K001288K164718K319743K542573K740282
11834E6293207L005889L345210L829817M388592N004473N657338O377873P139555
11826I5041954P884506Q716509J0156582J2485229J5445840J8203827J8487067
11819A86421514J1629635r886813m8854825r0025201j05124707q2408649m1018563
$$ y = [16654769, 16985302, 17324212, 17713758, 18066912, 18380275, 18708398, 19056865, 19398893, 19754056, 20177333, 20598116, 20997260, 21424781, 21919203, 22405368, 22911514, 23452159, 24080945, 24732746, 25351267, 25988491, 26669664, 27338086, 28028901, 28744637, 29542532, 30420332, 31369586, 32377215, 33410814, 34452279, 35537356, 36716798, 38026830, 39446134, 40981286, 42677048, 44524603, 46525891, 48690609, 51010352, 53552925, 56293207, 59299096, 62644306, 66474123, 70862715, 75867188, 81524526, 87902399, 95041954, 102926460, 111642969, 121799551, 134284780, 149730620, 167934447, 186421514, 198051149, 188164336, 139309511, 49284310, -55840397, -138249046, -179267609]
11812a79267609p071200R996694J4979050J4721830J2845853J0692117R000736
11805a14102529P944763P252736O670441O012932N361297M806330M327092L900499
11797f7826439L532480L192799K899516K611529K418116K216456J956055J776603
11789d7222885J678509J589568J508303J430070J392332J313891J179766J112112
11781c6018334J029416Q97496Q59470Q93663Q45475P98719P47618P09684O71474
11772b8565319O76657O13686N41450M98914M85971N14415M79241M56702N01161
11763b3797122M54218M15114M05121M17565L97729L51587L14549L46983L49740
11754b0344516L24215K95640K47302K72907K48102K25912K53846K51354K83720
$$ y = [-179267609, -186338809, -176342115, -161363065, -146641235, -133795382, -123103265, -114102529, -106157766, -98905030, -92234589, -86221657, -80860360, -76054030, -71726938, -67826439, -64293959, -61101160, -58201644, -55590115, -53171999, -50955543, -48999488, -47222885, -45544376, -43954808, -42446505, -41016435, -39624103, -38310212, -37130446, -36018334, -34988918, -34091422, -33231952, -32338289, -31492814, -30694095, -29946477, -29236793, -28565319, -27888662, -27274976, -26733526, -26234612, -25748641, -25234226, -24754985, -24298283, -23797122, -23342904, -22927790, -22522669, -22105104, -21707375, -21355788, -21041239, -20694256, -20344516, -20020301, -19724661, -19477359, -19204452, -18956350, -18730438, -18476592, -18225238, -17941518]
11745a7941518K43198K23515K43707K27929J98718K08894K25199J57124J73549
11736a6039685J76832J59991J90419K13790J95674J35733J78294J41213J63574
11727a4484165J58753J56744J49454J52528J23953J50674J61530J45654J20302
11718a3164573J41587J65262J15223Q1352J13883R3290J48897J13746J07106J20934
11708a1963293J11683P9411Q0528R0254R3690O4326L6218O3594J20327J13306
11698a1109956J00443R6133P8123P0408P9438Q3473J14093J05850P6914R2798
11688a0212283N6118p334J9501L5178M2469N6671P7725O0990Q2895N0516K1812
11677i715742Q1551Q4148Q1070N6453K9403N1803O9079M1698M5845P1752P3171
$$ y = [-17941518, -17698320, -17474805, -17231098, -17003169, -16804451, -16595557, -16370358, -16213234, -16039685, -15862853, -15702862, -15512443, -15298653, -15102979, -14967246, -14788952, -14647739, -14484165, -14325412, -14168668, -14019214, -13866686, -13742733, -13592059, -13430529, -13284875, -13164573, -13022986, -12857724, -12742501, -12661149, -12547266, -12453976, -12305079, -12191333, -12084227, -11963293, -11851610, -11772199, -11691671, -11601417, -11507727, -11443401, -11407183, -11343589, -11223262, -11109956, -11009513, -10913380, -10835257, -10764849, -10685411, -10601938, -10487845, -10381995, -10305081, -10212283, -10156165, -10163499, -10143998, -10108820, -10066351, -10009680, -9931955, -9870965, -9788070, -9737554, -9715742, -9634191, -9550043, -9468973, -9412520, -9383117, -9331314, -9262235, -9220537, -9174692, -9102940, -9029769]
11666i029769M7444N9919N9326P3146Q4328P7968M4161N6296L0411K5239K5955
11655h445576M4023M8050M8483L1047R108K6084N2462Q2719P5436K2299M078L4755
11643g967032M550N4373Q2684M1655M4121L8960L3193K6513M0940N5542L8342
11632g506159L2923K7263J4874q360K2475K9244J9336N8275P3251L1491M3766
11621g161621Q8726M9288L0405K9045K5275K5640K8867M8737M7076L1614j108
11610f758056l390M5253N4389J6808J2394M9740O9181J8043R728K2865K0280M782
11598f437983R510M4588L0514J6341N8135M025j446K0067k760L9571O4158J6344
11586f138936K1084J2901M5676K1511M3083K5353k1669K2661J0290K0376L5056
$$ y = [-9029769, -8982325, -8922406, -8863080, -8789934, -8705606, -8627638, -8583477, -8527181, -8496770, -8471531, -8445576, -8401553, -8353503, -8305020, -8273973, -8264865, -8238781, -8186319, -8103600, -8028164, -8005865, -8001787, -7967032, -7962482, -7908109, -7825425, -7783770, -7739649, -7700689, -7667496, -7640983, -7600043, -7544501, -7506159, -7473236, -7445973, -7431099, -7439459, -7416984, -7387740, -7368404, -7310129, -7236878, -7205387, -7161621, -7072895, -7023607, -6993202, -6964157, -6938882, -6913242, -6884375, -6835638, -6788562, -6756948, -6758056, -6761446, -6716193, -6661804, -6644996, -6632602, -6582862, -6513681, -6495638, -6485910, -6463045, -6442765, -6437983, -6428473, -6383885, -6353371, -6337030, -6278895, -6274870, -6276316, -6256249, -6259009, -6219438, -6155280, -6138936, -6117852, -6104951, -6059275, -6037764, -5994681, -5969328, -5990997, -5968336, -5958046, -5937670, -5902614]
11575e902614L2369k254J4419M8317M9550J9968J83J7439M0398K5135J7123J4447
11563e625520N2945K4455n746k0117j0871P249Q889L0085K0908M9346M3161R881
11551e415335M0292N1277L4756K2610P398l9735R410M4135M143Q811K2587L292
11539e206359J3625L1477M1353J3100M424J7971L0097J2115K9480k1780L8647
11528d995850K7746R038k8847J3020K8827L2072K2222j6914N156K6780J3081J6445
11516d847224M1695L9913L3894J5981K2764j9738k280M1961N4325j0612l2089
11505d661410J5649O34k5023J7415J8400R720L1479N5091O533j2595K989L4470
11493d506648m962l810L7561J7364k5561j0953L6983K4884K7192J6625L4830j9246
$$ y = [-5902614, -5870245, -5872499, -5858080, -5809763, -5760213, -5740245, -5740062, -5722623, -5682225, -5657090, -5639967, -5625520, -5572575, -5548120, -5553866, -5573983, -5584854, -5577605, -5568716, -5538631, -5517723, -5468377, -5425216, -5415335, -5375043, -5323766, -5289010, -5266400, -5259002, -5298737, -5289327, -5245192, -5241049, -5232238, -5209651, -5206359, -5192734, -5161257, -5119904, -5106804, -5102380, -5084409, -5054312, -5042197, -5012717, -5034497, -4995850, -4968104, -4959066, -4987913, -4974893, -4946066, -4913994, -4891772, -4908686, -4903530, -4876750, -4863669, -4847224, -4805529, -4765616, -4731722, -4715741, -4692977, -4712715, -4714995, -4673034, -4618709, -4629321, -4661410, -4645761, -4645127, -4670150, -4652735, -4634335, -4624615, -4593136, -4538045, -4531512, -4544107, -4541118, -4506648, -4511610, -4515420, -4477859, -4460495, -4486056, -4497009, -4460026, -4435142, -4407950, -4391325, -4356495, -4375741]
11481d375741m03J3916m617L9786L9996R651j9530q593J8112K9061M5440J1077
11469d201845m904K9615J0834k5915j6731K0775J4857j5134k1624l75p491N3565
11457d164373K3286K5848M2938K2456p841Q95j0229r465L0115M6773L2290j4834
11445c982141k2923o022K3443M5640M9676r445L7256K7931p045p041j5082K818
11433c862935K8286J6040l5585L192J3074M1222K1247j2784j4924K4528K1326
11422c757313K1887K0845R593K1028J503R101J6025k0130K9505N0344K2244m9505
11410c624873Q301O0406R926j4819M45o138L9112N601Q610M551j163M5187K8907
11397c435947J5219K6696P881J0943K5480O125L459K7040R121L4900K9963K9544
$$ y = [-4375741, -4376144, -4362228, -4366845, -4327059, -4287063, -4277412, -4296942, -4305535, -4287423, -4258362, -4212922, -4201845, -4206749, -4177134, -4166300, -4192215, -4208946, -4188171, -4173314, -4188448, -4210072, -4210447, -4217938, -4164373, -4141087, -4115239, -4072301, -4049845, -4057686, -4056791, -4067020, -4076485, -4046370, -3999597, -3967307, -3982141, -4005064, -4011086, -3987643, -3942003, -3892327, -3901772, -3864516, -3836585, -3843630, -3850671, -3865753, -3862935, -3834649, -3818609, -3854194, -3851002, -3837928, -3796706, -3775459, -3788243, -3803167, -3778639, -3757313, -3735426, -3714581, -3704988, -3683960, -3682457, -3673356, -3657331, -3677461, -3647956, -3597612, -3575368, -3624873, -3616572, -3556166, -3546240, -3561059, -3560614, -3566752, -3527640, -3522039, -3513429, -3508878, -3510041, -3464854, -3435947, -3420728, -3394032, -3386151, -3375208, -3349728, -3343603, -3340144, -3313104, -3303983, -3269083, -3239120, -3209576]
11385c209576J2055J5798L3287N0859K6106M1752N6477L3317N5700R3226Q8089
11374b702910N9706R4250J03199M0215j10038l12050n28019n37595l10706r5084
11364d299032M1979O5447O2434K4706Q2716O1828M2467M3573K1118K3602M3300
11353c785862M8027M3557L73r219L0386L4398K4087L2128K9144K8744L6320j0646
11341c498563J6088L622J4491Q836j8812j2052J6046P4061M3617J7506J1532J6964
11329c306664l4851J0306M1831J6559K7421N607k3732j7341j4612J704J1610q456
11317c290618M6919o858J0341K777k9431O060K1439M7313M1977L5072J7561k4402
11305c121850N290K2228k7712m3615k1579M1818M1629k4718r491K3920L0700J6884
$$ y = [-3209576, -3197521, -3181723, -3148436, -3097577, -3071471, -3029719, -2973242, -2939925, -2884225, -2790999, -2702910, -2643204, -2548954, -2445755, -2405540, -2515578, -2827628, -3355647, -3893242, -4203948, -4299032, -4257053, -4191606, -4129172, -4104466, -4021750, -3959922, -3917455, -3873882, -3852764, -3829162, -3785862, -3737835, -3694278, -3693905, -3703124, -3672738, -3638340, -3614253, -3582125, -3552981, -3524237, -3487917, -3498563, -3482475, -3478853, -3464362, -3455526, -3474338, -3486390, -3470344, -3396283, -3352666, -3335160, -3323628, -3306664, -3341515, -3331209, -3289378, -3272819, -3245398, -3239791, -3263523, -3280864, -3295476, -3293772, -3282162, -3290618, -3243699, -3250557, -3240216, -3237439, -3266870, -3260810, -3239371, -3192058, -3150081, -3115009, -3097448, -3121850, -3116560, -3094332, -3122044, -3165659, -3187238, -3145420, -3103791, -3128509, -3138000, -3114080, -3083380, -3066496]
11293c066496K0960o362j1855K808K2769Q635J293J3763J5923k3456j1278J6413
11281c016883J0630K3047m389m105l1332J8016k2859J2754M0028J5360J2541K84
11269b946908j9367J4268K4198k2147k1413J7295K8963L7205O541k0727j6328
11258b918420j0669o80J8479M5656P177K6013n537Q27M248m291J9024L769k5093
11245b839497K0865K2342j0876o967n530j2009L053K1293J6455m322L5036j1864
11233b772021J5614j8691j1899n51K8824L6384M054k997r315J1115k4567m0060
11221b784110j7337M8024M0230k009K3039J2330r579J1376J6136j0678O511j3369
11209b679436O669k572k9315j5457k324L8841M2718n458m928K9429K8872K2781
$$ y = [-3066496, -3045536, -3051898, -3063753, -3060945, -3038176, -3029541, -3028248, -3014485, -2998562, -3022018, -3033296, -3016883, -3006253, -2983206, -2987595, -2991700, -3023032, -3005016, -3027875, -3015121, -2975093, -2959733, -2947192, -2946908, -2966275, -2952007, -2927809, -2949956, -2971369, -2954074, -2925111, -2887906, -2881365, -2902092, -2918420, -2929089, -2929769, -2911290, -2865634, -2858457, -2832444, -2837981, -2837154, -2832906, -2837197, -2818173, -2814404, -2839497, -2818632, -2796290, -2807166, -2814133, -2819663, -2831672, -2828619, -2807326, -2790871, -2795193, -2760157, -2772021, -2756407, -2775098, -2786997, -2787548, -2758724, -2722340, -2718286, -2721283, -2730598, -2719483, -2744050, -2784110, -2801447, -2753423, -2713193, -2715202, -2692163, -2679833, -2689412, -2678036, -2661900, -2672578, -2666067, -2679436, -2672767, -2675339, -2704654, -2720111, -2722435, -2683594, -2640876, -2646334, -2651262, -2621833, -2592961, -2570180]
11197b570180k3204l6417M963j3904J3925r201k1082J1454O593M0615J2832k0337
11185b603943j2005M409j6497j161J2383J6264L0435L8515j7734j1152k302J9
11173b562769M506n642k2462L586J4943K6623K563R455j1876K886K3612Q996k9902
11160b535481l521L9092K2271K6024k8316Q749J3673P149o441k334J9405N759
11148b433971r804R931M3862k533L754P18k7129k3577K6515L2485J4222j0140
11136b375667J921j7657J2952J7693J5298Q80j1890l3514K6992J5877J4981n117
11124b337251k4748K546J6788K8794J1530J924l2814m763J4611m337j2507q121
11112b348348J0018J3468j55p798K742o49K4448K7203Q769k8933k2840q807J1212
$$ y = [-2570180, -2593384, -2629801, -2624838, -2638742, -2624817, -2634018, -2655100, -2643646, -2637053, -2596438, -2583606, -2603943, -2615948, -2611539, -2628036, -2629197, -2616814, -2600550, -2570115, -2531600, -2549334, -2560486, -2562788, -2562769, -2558263, -2563905, -2586367, -2582781, -2567838, -2541215, -2538652, -2529197, -2541073, -2538187, -2514575, -2505579, -2535481, -2539002, -2499910, -2477639, -2451615, -2479931, -2471182, -2457509, -2450360, -2456801, -2459135, -2439730, -2433971, -2443775, -2433844, -2389982, -2392515, -2388761, -2388043, -2415172, -2438749, -2412234, -2379749, -2365527, -2375667, -2373746, -2391403, -2378451, -2360758, -2345460, -2344580, -2356470, -2389984, -2362992, -2347115, -2332134, -2337251, -2361999, -2359453, -2342665, -2313871, -2302341, -2300417, -2333231, -2337994, -2323383, -2327720, -2340227, -2348348, -2338330, -2324862, -2325017, -2332815, -2330073, -2330722, -2306274, -2279071, -2270302, -2299235, -2322075, -2330882, -2319670]
11099b319670J1011K3794K9226j355q632k2331N978K2590K7031m002L094j311
11087b234577J0980J2780j6292R99Q240O448L2919J0589j0717l8400j065N0195
11075b167901M2859l0912k7805P118l4025O253K1692K1550L810l534K007K856
11063b156032m045m1021L042n835Q929R998M3749P806J2365L664R91j5520M249
11050b127660L293r752k0361p334J9632m662k3215J3900K8506m1013P558j3175
11038b174283j8515L3278M8079K9847P130l3833j9089Q165N2621J2564J8392J6248
11026b019396o1740k9243L3283K1308l0813r18o117J6692K8359J4724J9474M047
11014b010340m9105j0998K7710K5791R04k5105K4255K3415k0461L6268L2040m2168
$$ y = [-2319670, -2308659, -2284865, -2255639, -2256994, -2265626, -2287957, -2281979, -2259389, -2232358, -2236360, -2233266, -2234577, -2223597, -2210817, -2227109, -2226110, -2217870, -2211422, -2178503, -2167914, -2178631, -2217031, -2218096, -2167901, -2125042, -2155954, -2183759, -2176641, -2210666, -2204413, -2182721, -2161171, -2157361, -2160895, -2158888, -2156032, -2160077, -2201098, -2198056, -2203891, -2194962, -2184964, -2141215, -2133409, -2121044, -2117380, -2116389, -2131909, -2127660, -2124367, -2134119, -2154480, -2161814, -2142182, -2146844, -2170059, -2156159, -2127653, -2168666, -2161108, -2174283, -2192798, -2159520, -2111441, -2081594, -2074464, -2108297, -2127386, -2119221, -2066600, -2054036, -2035644, -2019396, -2081136, -2110379, -2077096, -2055788, -2086601, -2087519, -2093636, -2076944, -2048585, -2033861, -2014387, -2010340, -2059445, -2070443, -2042733, -2016942, -2016038, -2041143, -2016888, -1993473, -2013934, -1977666, -1945626, -1987794]
11002a987794m6051j4754J0760M257L2540r224l1230l227J9270P216m192l2201
10990b054630j5768L3585N8682J3713J3974J0979p927J3688K503m109m4365m3510
10978b023185K9337L8253J624L517j1285m950P417P03k8330r881L4394M5786K5325
10965a891275J9083j450l6886P410J1715j8964j6622L1892J9019m265l3398K2251
10953a891490K7792l6798J4085j0936N049k0879J952J4475j8223j5474Q726L760
10941a917961J9343O9105J0089k3653m1589l9100O692k127M066J9250M2272j3242
10929a866855l3916L2336M1409j9073k0666k049J6368K0872K0210J7673M107L0687
10917a758897r642p659j9395k2258l3668Q496R156J2280J1734K5984K9208J6553
$$ y = [-1987794, -2033845, -2048599, -2037839, -2033582, -2001042, -2010266, -2041496, -2044723, -2025453, -2018237, -2022429, -2054630, -2070398, -2036813, -1978131, -1964418, -1950444, -1939465, -1947392, -1933704, -1931201, -1935310, -1979675, -2023185, -1993848, -1955595, -1953971, -1950454, -1961739, -1966689, -1959272, -1958569, -1986899, -1996780, -1962386, -1916600, -1891275, -1872192, -1873642, -1910528, -1903118, -1891403, -1910367, -1926989, -1895097, -1876078, -1880343, -1913741, -1891490, -1863698, -1900496, -1886411, -1897347, -1892298, -1913177, -1911225, -1896750, -1914973, -1930447, -1921721, -1917961, -1898618, -1829513, -1819424, -1843077, -1884666, -1923766, -1917074, -1919201, -1915135, -1895885, -1853613, -1866855, -1900771, -1868435, -1827026, -1846099, -1866765, -1868814, -1852446, -1831574, -1811364, -1793691, -1789584, -1758897, -1768539, -1776198, -1795593, -1817851, -1851519, -1843023, -1833867, -1821587, -1809853, -1783869, -1754661, -1738108]
10905a738108K4199j6248m6668m4565j454J0324Q716P164o096j3075k342j4770
10893a832923K6132M5100L0847m4865r420M1889J3699j2585q081o503K2886P060
10881a726764l1603k1942j1147K1673k5593J7564M264K6576k2154j1931K5748
10870a755309P272k8873m0244r326L4973o672L593N5838L2886L2258J0551k4085
10858a687138k2346Q652j3749k0819K999M76N067r020K7590L544j8032L672N7325
10845a661779N014j4801j3413L4247q422O356k4454O404l4918k0852J410J0042
10833a715166K3595J5563n2234k8088M0775M487J5520L3480j8422P653L0028N4649
10821a588160n311j7039L438J2001m5632l8434J4531M1564k3405l1887J4563N1284
$$ y = [-1738108, -1713909, -1730157, -1776825, -1821390, -1822844, -1812520, -1803804, -1796640, -1802736, -1815811, -1818153, -1832923, -1806791, -1761691, -1730844, -1775709, -1785129, -1743240, -1729541, -1742126, -1750207, -1756710, -1733824, -1726764, -1758367, -1780309, -1791456, -1769783, -1795376, -1777812, -1773548, -1746972, -1769126, -1781057, -1755309, -1748037, -1776910, -1817154, -1826480, -1791507, -1798179, -1794586, -1738748, -1705862, -1673604, -1663053, -1687138, -1709484, -1700832, -1714581, -1735400, -1732401, -1731925, -1726858, -1735878, -1708288, -1704744, -1722776, -1719104, -1661779, -1656765, -1671566, -1684979, -1650732, -1659154, -1652798, -1677252, -1670848, -1705766, -1726618, -1725208, -1715166, -1691571, -1676008, -1728242, -1756330, -1715555, -1711068, -1695548, -1662068, -1680490, -1672837, -1642809, -1588160, -1593471, -1610510, -1607072, -1595071, -1640703, -1679137, -1664606, -1623042, -1646447, -1678334, -1663771, -1612487]
10809a612487N299j2574q158p679K6642J9029J7788J996j2528J0503l8426k794
10797a613389k1935Q287l3392P5R413M506j0714j2841J7625N7070L3333j0956
10785a572918j5738L1208J3020N800j2053j9778k387l8601j4243M4442J2806k9229
10773a597671j1194n440L406N426J9119k0992j9865K6973L1505L0699j2465j7151
10761a567650M48J7237O0209K0569j5502l7683R861j2031j3796j2027P335N2019
10749a491011Q415p023j0454o041J1138j8538R562Q207J7585J9867q427k9758
10737a496478k4300J3796L9194J519j355K0750j0149K0145M013j1094m1527J0185
10725a475301o9R925J2526P219k051j9767k0951J9646K875J3381K8415M3464j233
$$ y = [-1612487, -1607188, -1619762, -1627920, -1635599, -1608957, -1589928, -1572140, -1570144, -1582672, -1572169, -1610595, -1613389, -1635324, -1627037, -1660429, -1660354, -1650941, -1646435, -1657149, -1669990, -1652365, -1595295, -1561962, -1572918, -1588656, -1557448, -1544428, -1538628, -1550681, -1570459, -1572846, -1611447, -1625690, -1581248, -1568442, -1597671, -1608865, -1614305, -1610899, -1605473, -1586354, -1607346, -1627211, -1600238, -1568733, -1538034, -1550499, -1567650, -1567202, -1549965, -1489756, -1469187, -1484689, -1522372, -1512511, -1524542, -1538338, -1550365, -1543030, -1491011, -1482596, -1489619, -1500073, -1506114, -1494976, -1513514, -1503952, -1495745, -1478160, -1458293, -1466720, -1496478, -1520778, -1506982, -1467788, -1466269, -1467624, -1446874, -1457023, -1436878, -1432865, -1443959, -1485486, -1475301, -1475370, -1465445, -1452919, -1445700, -1447751, -1467518, -1488469, -1468823, -1465948, -1452567, -1424152, -1380688, -1381921]
10712a381921m8832l9452K6032j4298J80j9803n170J5039J993R059L1100j8688
10700a444761m0369p032j4323k9856J4704M7594K2312L240k2965j132q204M5999
10688a434793L2295k2018m0966j7616K4697L7235P885J3032j4091j7489k6206
10677a458035J3694L240l5491P569K6428L4686l047m83l2942k86N9171M6728J9574
10664a319194j7096l2712m875k6853J0116n907J0415j2474O417J6537r807j7797
10652a403230M535J2695K5419J6556k2835K4651J4880k0758l3588k626K8755k953
10640a358499j8064o985J3244j7829l6841L7596M108k9003J012O0877n380m2731
10628a398495l0235Q693M0393J0848O700J1160K5841k1293j8291k5510j9208L6929
$$ y = [-1381921, -1430753, -1470205, -1444173, -1458471, -1458291, -1478094, -1483264, -1468225, -1466232, -1457173, -1426073, -1444761, -1485130, -1492162, -1506485, -1536341, -1521637, -1474043, -1451731, -1448491, -1471456, -1472588, -1480792, -1434793, -1402498, -1424516, -1465482, -1483098, -1458401, -1421166, -1413281, -1400249, -1414340, -1431829, -1458035, -1444341, -1441101, -1476592, -1469023, -1442595, -1407909, -1410956, -1411439, -1444381, -1444667, -1385496, -1338768, -1319194, -1336290, -1369002, -1373877, -1400730, -1390614, -1396521, -1386106, -1398580, -1392163, -1375626, -1385433, -1403230, -1398695, -1386000, -1360581, -1344025, -1366860, -1342209, -1327329, -1348087, -1381675, -1384301, -1355546, -1358499, -1376563, -1383548, -1370304, -1388133, -1424974, -1387378, -1383270, -1412273, -1411261, -1350384, -1355764, -1398495, -1428730, -1420037, -1379644, -1368796, -1362096, -1350936, -1325095, -1346388, -1364679, -1390189, -1409397, -1372468]
10616a372468N0752K9944o118k7700P55J1640J1413J8069N291p441N260j3686
10604a294289L452J4751O711k8434j7827o598O334K9187q734o157k376j9905L0203
10591a293682M990M938L4209K6922K3997j3196M096k6720j5740j9174L4266J9606
10579a215488l3520K929j6522l0049l813K5944K8573Q733p590P544j9667L685
10567a249241L9698K8135l2109m309k2099o285M273J810k4878J6799J2321J4434
10555a221451n566p912j7563j6431J3033K3700o080k9252L531J6380m680K3770
10543a228521r115K2882J3161O381N860l222j6974J0248J5192L0681K9495J1087
10531a112845j0264l9670l6352j6100J1525k510j2092j227K9425j8320l9975j8457
$$ y = [-1372468, -1321716, -1291772, -1297890, -1325590, -1324835, -1313195, -1301782, -1283713, -1278422, -1285863, -1280603, -1294289, -1290837, -1276086, -1269375, -1297809, -1315636, -1322234, -1315900, -1286713, -1295447, -1301604, -1303980, -1323885, -1293682, -1288692, -1283754, -1249545, -1222623, -1198626, -1211822, -1207726, -1234446, -1250186, -1269360, -1235094, -1215488, -1249008, -1246079, -1262601, -1292650, -1296463, -1270519, -1241946, -1233213, -1240803, -1233259, -1252926, -1249241, -1209543, -1181408, -1213517, -1217826, -1239925, -1246210, -1241937, -1240127, -1265005, -1248206, -1235885, -1221451, -1227017, -1234929, -1252492, -1268923, -1255890, -1232190, -1238270, -1267522, -1263991, -1247611, -1252291, -1228521, -1237636, -1214754, -1201593, -1195212, -1189352, -1192574, -1209548, -1199300, -1184108, -1153427, -1123932, -1112845, -1123109, -1162779, -1199131, -1215231, -1203706, -1206216, -1218308, -1219535, -1190110, -1208430, -1248405, -1266862]
10519a266862N923L6879K2977o405j4956K3704k339K0269J5396o308j8057J1721
10507a178058j5808J4661P518K0593p610R894K8147Q972Q909p627j7930n719J6044
10494a118014K1486K996l4394j5367K5544P348L6153R261k0080j7656j3183P859
10482a108047k5112R270j5486j708K0605J7645L376L626J8393r723J8420m771
10470a073512j6503R600j0638n719P822K4497j0288M400L639l5462N971J3873
10458a082320k90K3039M4877K0656K3523n570n603K1116J997m993n286l6940k5730
10445a031524l3626k0426j6642j2738k2008k6041L1483O5012K0996l182l4941
10434a083637K994j7103l3253Q337J6701R53p531J0028K4612J1890K3246r346
$$ y = [-1266862, -1260939, -1224060, -1201083, -1207488, -1222444, -1198740, -1201079, -1180810, -1165414, -1171722, -1189779, -1178058, -1193866, -1179205, -1171687, -1151094, -1158704, -1148810, -1120663, -1111691, -1102782, -1110409, -1128339, -1134058, -1118014, -1096528, -1093532, -1127926, -1143293, -1117749, -1110401, -1074248, -1064987, -1085067, -1102723, -1115906, -1108047, -1133159, -1123889, -1139375, -1141083, -1120478, -1102833, -1099457, -1095831, -1077438, -1087161, -1068741, -1073512, -1090015, -1080415, -1091053, -1096772, -1088950, -1064453, -1074741, -1070341, -1066702, -1102164, -1096193, -1082320, -1082610, -1059571, -1014694, -994038, -970515, -976085, -981688, -960572, -958575, -963568, -968854, -1005794, -1031524, -1065150, -1085576, -1102218, -1114956, -1136964, -1163005, -1131522, -1066510, -1045514, -1048696, -1083637, -1080643, -1097746, -1130999, -1122662, -1105961, -1105008, -1112539, -1102511, -1077899, -1066009, -1042763, -1052109]
10422a052109j0764j0927k8543N783K2857J5208o123P635J5210l1884m022K5163
10410a052516j1286q10l987k3270N311J5048L9406j4822K053M361r799J6669L6530
10397i97112M1775k0051j8940j9206R952M5717K0548l8397m5965J3734M8891K9535
10385i29519l0947j2417P888j8040l957k4006j7563K0317L7763K0334J1947k339
10373i40539N558m978K3525L327M6890K285m5109j5631M343J1550m917O771k0870
10360i27795J1277o142j1229n066J4130k3415J6006J4516M9244K3884N768j1347
10348h50169k661Q069K8470J6882m4014n4464K0407M9024j122k8234q201J3008
10336h53005j815K2436J7398j559j727J5299k6017k2729O335l099N436Q653j0788
$$ y = [-1052109, -1062873, -1073800, -1102343, -1096560, -1073703, -1058495, -1064618, -1056983, -1041773, -1073657, -1077679, -1052516, -1063802, -1064612, -1068599, -1091869, -1086558, -1071510, -1032104, -1046926, -1044873, -1040512, -1050311, -1033642, -997112, -955337, -975388, -994328, -1013534, -1003582, -957865, -937317, -975714, -1021679, -1007945, -959054, -929519, -960466, -972883, -964995, -983035, -986992, -1010998, -1028561, -1008244, -970481, -950147, -938200, -940539, -934981, -939959, -916434, -913107, -866217, -863932, -909041, -924672, -920329, -908779, -913696, -906925, -927795, -916518, -922660, -933889, -938955, -924825, -948240, -932234, -917718, -868474, -844590, -838822, -850169, -852830, -844761, -816291, -799409, -843423, -897887, -877480, -828456, -829578, -857812, -866013, -853005, -854820, -832384, -814986, -816545, -818272, -802973, -828990, -851719, -845384, -848483, -843047, -834394, -845182]
10323h45182j3130L3069k1873q041K4993L3272r328k4895k3330R987K3512J6929
10311h04017j9317k0401M8607j914k7577K954L6906M5797M356l4436O518q41o552
10298g69917n5720l5880J1432J5423K2552J8664L8103k700j2777J6532p683j0269
10286g72240O294P02K8545N523l3656J5627N2500n169P076K5821k0506k4815j6516
10273g30814M4411J3315k5174j4112O132j6921M5085m531j5193m536m857j2146
10261g19341j0187j6754k2553j006M1193N1745K609J5549J7063Q015r105K245
10249f40527K5575K0520K0855j5370j0352m1620M785N785N9677N6756k6916l5695
10237e76527o5675q690M3150J1158q73m565O497P118K8779k8890k0471J265j2075
$$ y = [-845182, -858312, -825243, -847116, -855157, -830164, -796892, -806220, -831115, -854445, -844458, -820946, -804017, -823334, -843735, -795128, -797042, -824619, -821665, -784759, -738962, -734606, -769042, -762524, -763365, -769917, -825637, -861517, -850085, -834662, -812110, -793446, -755343, -758043, -770820, -754288, -761971, -772240, -765946, -765244, -736699, -731176, -764832, -749205, -696705, -701874, -694798, -668977, -689483, -714298, -730814, -686403, -673088, -698262, -712374, -706242, -723163, -678078, -682609, -697802, -702338, -707195, -719341, -729528, -746282, -768835, -769841, -728648, -676903, -674294, -658745, -641682, -633667, -642772, -640527, -614952, -594432, -573577, -588947, -599299, -640919, -636134, -630349, -570672, -513916, -540832, -576527, -642202, -650892, -607742, -596584, -597457, -602022, -595525, -588407, -559628, -588518, -608989, -607724, -619799]
10224f19799J7857P1439M4939l4917m2337J1771K0638J7576J7355j4347n739l269
10212e18833k7726j0999M256N530M1424K6648r578k161J7257L0995K4780j0565
10200d28972j4165l381J4610K3525L692R834J9625K085j0729j3660M0083J2474
10188c44979N785J06n338L0274j2113J590K6447L0557K2442k6604j0560K3409
10176b58984J3565J2211j1599J1004K8967k1610l0123l8363J412M7601L6928N888
10164b03103O198J1274N913J9141K7961J9243R628l9563o599K3911J425K9423
10152i5148M1977K5987M864J2454K9322m2948l2143L8249N2638L5922K5478j4342
10140H2310m5670q267M1204K8266M5638K2037k1754o11L1002M849K1560K4800
$$ y = [-619799, -601942, -530503, -485564, -520481, -562818, -551047, -530409, -512833, -495478, -509825, -515564, -518833, -546559, -557558, -553302, -547772, -506348, -479700, -489278, -491439, -474182, -443187, -418407, -428972, -443137, -446518, -431908, -408383, -404691, -394857, -375232, -373147, -383876, -397536, -357453, -344979, -339194, -339088, -344426, -314152, -326265, -324675, -298228, -267671, -245229, -271833, -282393, -258984, -245419, -233208, -244807, -233803, -204836, -226446, -256569, -294932, -293520, -245919, -208991, -203103, -196905, -185631, -179718, -160577, -132616, -113373, -103745, -143308, -149907, -125996, -124571, -95148, -53171, -27184, -22320, -9866, 19456, -23492, -55635, -17386, 35252, 71174, 96652, 82310, 36640, 28373, 69577, 97843, 143481, 165518, 143764, 143153, 174155, 179004, 200564, 225364]
10128B25364q88J3750J4495J6049l848J0349L9821J6779p377J6500J7079O2770
10116D20843R856M6769L2847L0335l515R838L1741P1691L8961L28J0004M840L4375
10103G38913L3518R0060O7363K9729R719L7792L1929J6284M6656O5351O1335O0571
10091A289220O4308K8517P9020P0813N5478J4096O3528Q6045R6240Q3070O8046
10080A998381Q6228O7479J11709J22063R2344R1196J35301J70862J38129J67847
10070C181539K16144K15581K17250K06789J94182K46263K81222K60546L16878
10061E336394M11297M98114N50322O41221P54291Q44788R89734J170522J482566
10052A2679249J837499K330413K822471K689924K29311p518035j6421123j5285144
$$ y = [225364, 224476, 238226, 252721, 268770, 264922, 275271, 315092, 331871, 324494, 340994, 358073, 420843, 430699, 477468, 510315, 540650, 537135, 546973, 578714, 650405, 689366, 689694, 699698, 704538, 738913, 772431, 862491, 929854, 959583, 969302, 1007094, 1039023, 1055307, 1101963, 1167314, 1228649, 1289220, 1353528, 1382045, 1461065, 1531878, 1587356, 1601452, 1664980, 1751025, 1847265, 1930335, 1998381, 2084609, 2152088, 2263797, 2385860, 2478204, 2569400, 2704701, 2875563, 3013692, 3181539, 3397683, 3613264, 3830514, 4037303, 4231485, 4477748, 4758970, 5019516, 5336394, 5747691, 6245805, 6796127, 7437348, 8191639, 9036427, 10026161, 11196683, 12679249, 14516748, 16847161, 19669632, 22359556, 22588867, 15070832, -1350291, -16635435]
10044a6635435o278306L10638K266008K334492J980281J612889J298114J122987
10036a1988332R66118Q46410P01592N95231N22936M94924M41703L74028L34500
10027f710890K24048J72661J87640J56835J95536K26902J98854J83457J73485
10018d991472J79835J59651J39843J39262J07188Q7655P6429R5500N5001Q8813
10008c862295P5463N2761Q6842Q1744R6970M0879N7371R5176L3723K1212O9155
9997c150999N6260M4614M1162O3789M0722L6229N7878L9214P702K1129K3744O3417
9985b655139M1147Q205K9058K2572K3874J4304K1577J4870J3463L7885J9259J9947
9973b388978L6033J9075n1n709K5588M0590J6975J7708N2780J8638K9669M543
$$ y = [-16635435, -22913741, -22603103, -20337095, -18002603, -16022322, -14409433, -13111319, -11988332, -11022214, -10175804, -9474212, -8878981, -8356045, -7861121, -7419418, -7045390, -6710890, -6486842, -6314181, -6126541, -5969706, -5774170, -5547268, -5348414, -5164957, -4991472, -4811637, -4651986, -4512143, -4372881, -4265693, -4178038, -4101609, -4006109, -3951108, -3862295, -3786832, -3734071, -3647229, -3565485, -3468515, -3427636, -3370265, -3275089, -3241366, -3220154, -3150999, -3094739, -3050125, -3008963, -2945174, -2904452, -2868223, -2810345, -2771131, -2763429, -2742300, -2718556, -2655139, -2613992, -2605787, -2576729, -2554157, -2530283, -2515979, -2494402, -2479532, -2466069, -2428184, -2408925, -2388978, -2352945, -2333870, -2333921, -2339630, -2314042, -2273452, -2256477, -2238769, -2185989, -2167351, -2137682, -2133139]
9961b133139K026Q914K1996m383J2600M9648M5996K6584J4929L4499K4666q766
9949a904430m739O22L3126J1496L6855l891J91J4610R578l109M3621N3643K2316
9936a690111j0426L9818j1522m886q152j6833m7538o0695l5072L073m134M7790
9924a798688L1008J4587J8470J6330M4574K5230k3751l0394N013L2829M991K173
9912a657628r50R92M4270M1735O526j224N4995n379j578M3268k980J7239J2690
9899a448024M4552r688j9355J8552P370O049K5042K3345j8823j0702O486m6963
9887a422159K6585K2448P915K3578M5632L2859J5067j9186M517N2581N2260J5052
9875a142851o273o792R550J7186K2151j31M6888L6139J272J1183K7818M6362J2691
$$ y = [-2133139, -2131113, -2122199, -2100203, -2104586, -2091986, -2042338, -1996342, -1969758, -1954829, -1920330, -1895664, -1904430, -1909169, -1908547, -1875421, -1863925, -1827070, -1830961, -1830770, -1816160, -1806582, -1809691, -1766070, -1712427, -1690111, -1700537, -1660719, -1672241, -1677127, -1685279, -1702112, -1749650, -1810345, -1845417, -1842344, -1846478, -1798688, -1767680, -1753093, -1734623, -1718293, -1673719, -1648489, -1672240, -1702634, -1697621, -1664792, -1659801, -1657628, -1658578, -1657586, -1613316, -1571581, -1565055, -1566279, -1511284, -1516663, -1518241, -1474973, -1477953, -1460714, -1448024, -1403472, -1413160, -1432515, -1413963, -1406593, -1400544, -1375502, -1352157, -1370980, -1381682, -1375196, -1422159, -1395574, -1373126, -1365211, -1341633, -1296001, -1263142, -1248075, -1267261, -1262744, -1210163, -1157903, -1142851, -1149124, -1155916, -1146366, -1129180, -1107029, -1107160, -1060272, -1024133, -1022861, -1011678, -983860, -937498, -924807]
9862i24807j1591o865M8862Q0485N6234Q5162R1799J11344J20168J06160J37613
9851a05436K18978K51454K57345K39421J63451j24823p99989j366164j386546
9842b652309q68197k69868R3100K06939K17746J87529J79396J65279J29606J27530
9832b483249P4345N2566O9254O0931P447M2830O5313N2308P1682J5062O801O7664
9820a897046L0200j732m992J5628j757K3922O3708O4117K8252Q012j5004j8493
9808a705185j3097L488M5959k8754j2046L0702M9355p37K772J0547K5641q472
9796a599827Q755M3930N029l7998j3522N0198O541p412q707q428k8672R524L8932
9783a541657M2862K6044K9630J0556l3006k070M473m0502l1588K7505K3629Q75
$$ y = [-924807, -936398, -943263, -894401, -813916, -757682, -672520, -580721, -469377, -349209, -243049, -105436, 113542, 364996, 622341, 861762, 1025213, 900390, 100401, -1265763, -2652309, -3520506, -3790374, -3697274, -3490335, -3272589, -3085060, -2905664, -2740385, -2610779, -2483249, -2408904, -2356338, -2287084, -2226153, -2218706, -2175876, -2110563, -2058255, -1986573, -1971511, -1964710, -1897046, -1866846, -1868578, -1873570, -1857942, -1859699, -1835777, -1772069, -1707952, -1679700, -1671688, -1686692, -1705185, -1718282, -1714794, -1668835, -1697589, -1709635, -1678933, -1629578, -1630315, -1627543, -1616996, -1591355, -1599827, -1591072, -1547142, -1542113, -1580111, -1593633, -1543435, -1536894, -1544306, -1553013, -1561441, -1590113, -1580589, -1541657, -1498795, -1472751, -1443121, -1432565, -1465571, -1467641, -1463168, -1503670, -1535258, -1507753, -1484124, -1483249]
9771a483249M4373M6235K9349m3882m6487K4366M3117o946J4428Q07j6098J5990
9759a377997O7971o357p339j7826l0967j8225k231o627R152L9949L8637l4143
9747a346003j2448j3531J4827K7550K346J7180K6107k6035j0274p237j1145J4410
9735a324253L9686L3490j6037l6580j7956K4130j3534L3907Q468N25J7965k1419
9723a271608k026k10k9059N878j045j0038M9050L9553M848j8132k0448R444K7361
9710a216432P273j751j8868J143L7215k1183k4343j0460l7369J6732K2586l894
9698a249351n490k4877K4187J280J5191M530M6107N4387J648k5182j7779j1003
9686a186352k0568j5003p099k841J8409R390j2373K0533J1274K2393N4742j791
$$ y = [-1483249, -1438876, -1392641, -1363292, -1407174, -1453661, -1429295, -1386178, -1393124, -1378696, -1377889, -1393987, -1377997, -1310026, -1316383, -1323722, -1341548, -1372515, -1390740, -1392971, -1399598, -1390446, -1350497, -1311860, -1346003, -1358451, -1371982, -1357155, -1329605, -1327259, -1310079, -1283972, -1310007, -1320281, -1327518, -1338663, -1324253, -1284567, -1251077, -1267114, -1303694, -1321650, -1297520, -1311054, -1277147, -1268679, -1268154, -1250189, -1271608, -1273634, -1273844, -1302903, -1297025, -1298070, -1308108, -1259058, -1219505, -1214657, -1232789, -1253237, -1243793, -1216432, -1209159, -1210910, -1229778, -1228635, -1191420, -1212603, -1236946, -1247406, -1284775, -1268043, -1245457, -1249351, -1254841, -1279718, -1255531, -1254251, -1239060, -1234530, -1188423, -1134036, -1132388, -1157570, -1175349, -1186352, -1206920, -1221923, -1229022, -1231863, -1213454, -1204064, -1216437, -1195904, -1184630, -1162237, -1107495, -1109286]
9674a109286l2240l1872K0378l372k1633J4354q123K7181q848J1463L056l0730
9662a169672J3454J6684L0512N2684J6782j7305K694j8457n917J0231J3902J65
9650a054243j7373n618N838K3311J3584k3818k0347l4527k4245K1887K7893l3424
9638a121082j8458L583m683j7065q314J4362M797P857J6125j3062k6323L9087
9626a123176K4244L940K293j3311K5856N481j4461K0805J9527k5298k7428K3102
9614a078426J7922k1694l6305J6700K4565P041L7742k1008q837L1075j1909j1923
9602a055057J6856p533l004j2225P239r370j7379N686L0238o126O689J4727k004
9589a031263p456L1819J1926k233l322j8151J5309R676j9447J5372K9677j4466
$$ y = [-1109286, -1141526, -1173398, -1153020, -1156392, -1178025, -1163671, -1171794, -1144613, -1153461, -1141998, -1138942, -1169672, -1156218, -1139534, -1109022, -1056338, -1039556, -1056861, -1054167, -1072624, -1078541, -1068310, -1054408, -1054243, -1071616, -1077234, -1071396, -1048085, -1034501, -1058319, -1078666, -1113193, -1137438, -1115551, -1087658, -1121082, -1139540, -1135957, -1140640, -1157705, -1166019, -1151657, -1146860, -1139003, -1122878, -1135940, -1162263, -1123176, -1098932, -1094992, -1092699, -1106010, -1080154, -1074673, -1089134, -1068329, -1048802, -1074100, -1101528, -1078426, -1060504, -1082198, -1118503, -1101803, -1077238, -1070197, -1032455, -1053463, -1062300, -1031225, -1043134, -1055057, -1038201, -1045734, -1048738, -1060963, -1053724, -1063094, -1080473, -1074787, -1044549, -1050675, -1043986, -1029259, -1031263, -1038719, -1006900, -994974, -997207, -1000529, -1018680, -1003371, -993695, -1013142, -997770, -968093, -982559]
9577i82559j6205j8865J2161J9232K7755K1360N370j6551j7132k0953j5950j403
9565a003740J3501J8258R903K4591M575k5078o443J0458k1775k0047N293M2219
9553i48285M4450l9754k8416K7797J6570j9199j0476K3809r327m6710K0652K8140
9541i40749P294k088J0334l8169L961N6685K0412k3419k5516p244r875k0916k1768
9528i91058K4456L9894Q938M9440j352m2741k8493L1968J9417j7421j6034k0377
9516i43363J6398K555J6958L8314L4762m011j202k349n828k5377l465J0372K02
9503h66034P389n494k934j6361J0539P635p953j2419k2592p66Q131k2896J5032
9490i08723Q899j832K9590n893j9463J1044K0665k8597J0758J0193m5009j0784
$$ y = [-982559, -998764, -1017629, -1005468, -986236, -958481, -937121, -931751, -948302, -965434, -986387, -1002337, -1003740, -990239, -971981, -962078, -937487, -932912, -957990, -964433, -953975, -975750, -995797, -990504, -948285, -903835, -943589, -972005, -944208, -927638, -946837, -957313, -933504, -942831, -989541, -968889, -940749, -933455, -935543, -925209, -963378, -959417, -902732, -882320, -905739, -931255, -938499, -948374, -969290, -991058, -966602, -926708, -917770, -868330, -869682, -912423, -940916, -908948, -889531, -906952, -922986, -943363, -926965, -924410, -907452, -869138, -834376, -838387, -839589, -841938, -847766, -873143, -876608, -866236, -866034, -858645, -864139, -867073, -883434, -872895, -865260, -873213, -885632, -908224, -908990, -900859, -923755, -908723, -899824, -901656, -872066, -877959, -897422, -886378, -865713, -894310, -883552, -873359, -918368, -929152]
9478i29152L5116N340M7945K2791K1640K188l6696k2417J8636J4581j1356K262
9466h29122O503J97j708J5094p452k0099j3709J4534L3837P832j3102n68L4987
9453g72776k2381k4234k586l825J0402L812J4499k1873k3568K9560L7526J3372
9441g62072J3161K1969M503r589j1383J0384q979J2062M3641L147o6975j7254
9429g67385p693R715L2236q593k6075j7073L0653J6719J3435j010r809P302L0327
9416f97251L5363l4687o2114Q10J1547L0752O465m147J6700m686j9108N805P602
9403g06949M3599J2870J2582l552j561K0244l2067j2482j6160q397M030M0246
9391f47597K1123L5592p35k5103j5946k2825J3859M3450K3859J6791o119p860
$$ y = [-929152, -894036, -888696, -840751, -817960, -796320, -794132, -830828, -853245, -834609, -820028, -831384, -829122, -822619, -822422, -824130, -809036, -816488, -836587, -850296, -835762, -801925, -794093, -807195, -807763, -772776, -795157, -819391, -821977, -825802, -815400, -811588, -797089, -818962, -842530, -812970, -775444, -762072, -748911, -726942, -722439, -732028, -743411, -733027, -742006, -729944, -686303, -683156, -750131, -767385, -775078, -765363, -733127, -741720, -767795, -784868, -754215, -737496, -724061, -725071, -734880, -727578, -697251, -661888, -696575, -758689, -757879, -746332, -715580, -709115, -713262, -696562, -701248, -720356, -714551, -706949, -663350, -650480, -637898, -641450, -643011, -622767, -654834, -667316, -683476, -691873, -687843, -647597, -626474, -590882, -591617, -616720, -632666, -655491, -641632, -598182, -574323, -557532, -563651, -571511]
9379e71511J279j8959k0157O84k159M6176O1965P297k4668p1571j0681N8893M1917
9366e01495m4319l3203Q226L3075J0737p920J9463m64r683L469L1434j7643k4859
9353e33182r327J9102K7533j128j0149m488r237J2339K4733j0853l081n712J710
9340e01740M5639P7557n555n2191l6935p850m570K3368J1231J6916R292N520p291
9327d26609J1246J853K0390j171J6333M425L417j3269k929L9375J8518L692J0464
9314c14265k028J4247O237k0790k3958K3955K2047o041M288L9954L9330O303K1261
9301a89460L3257J2358k519q969j7453p855p735J4375M8808Q312j1150k2252r747
9288a60030r066L1347L2224L872k3702j8995L0935L7161M7439J0856p537l712
$$ y = [-571511, -570232, -589191, -609348, -608664, -610823, -564647, -502682, -495385, -520053, -591624, -602305, -543412, -501495, -545814, -579017, -570791, -537716, -526979, -534899, -515436, -515900, -525583, -522114, -490680, -508323, -533182, -542509, -523407, -495874, -497002, -507151, -511639, -520876, -508537, -483804, -494657, -497738, -503450, -501740, -456101, -378544, -384099, -436290, -473225, -481075, -485645, -462277, -451046, -434130, -424838, -419318, -426609, -415363, -413510, -393120, -394291, -377958, -373533, -370116, -383385, -386314, -346939, -328421, -324729, -314265, -316293, -302046, -295809, -316599, -340557, -316602, -294555, -300596, -296308, -256354, -217024, -210721, -189460, -156203, -143845, -146364, -155333, -172786, -180641, -188376, -174001, -125193, -116881, -128031, -150283, -160030, -169096, -137749, -105525, -101653, -125355, -144350, -113415, -76254, -28815, -17959, -25496, -29208]
9276b9208K1126J8286m147K4713R763n3723Q928M4929L9227K4193r881k5368K1180
9263I0018M9213J4075J0093J4584J0214j696J5892L237N0617M3522J2797M3933
9251C56499K3048p208K0324l855M030L4508o457l9090J6034K9776J0966K4230
9239D62805o463j7257N733j1733n019K3634k1012o0917l3383O344m4338p5467
9227B22927l4584k7131o6695o7418p0238n7627j03191r0925q5860j00686r6162
9216e77590r5153j14954j15264j38938j05468q6163j06128j42049q1145j11118
9206a673970j14846q4884r5368m9518m5809p1593o4423n9572l3257j5232O47l4346
9194b342171l2948j6284q527k2781l4713Q226J6730r774L493L1867M1558L5453
$$ y = [-29208, -8082, 10204, 6057, 30770, 40533, -13190, -4262, 40667, 79894, 104087, 94206, 68838, 90018, 139231, 153306, 163399, 177983, 188197, 186501, 202393, 205630, 256247, 299769, 312566, 356499, 379547, 372339, 392663, 388808, 392838, 427346, 420889, 381799, 397833, 427609, 438575, 462805, 456342, 439085, 444818, 433085, 428066, 451700, 430688, 369771, 336388, 342732, 298394, 222927, 188343, 161212, 94517, 27099, -43139, -100766, -203957, -294882, -380742, -481428, -577590, -672743, -787697, -902961, -1041899, -1147367, -1233530, -1339658, -1481707, -1562852, -1673970, -1788816, -1873700, -1969068, -2018586, -2064395, -2135988, -2200411, -2259983, -2293240, -2308472, -2307825, -2342171, -2375119, -2391403, -2399930, -2422711, -2457424, -2449198, -2432468, -2442242, -2438749, -2406882, -2365324, -2329871]
9182b329871J8587J864J7191N168k8736j14N6530R367l6259J7722K1739J8687
9170b228125J6533J902K3067J2460O6697N6399k9005j8515r542O651K9870L5434
9158b036174M4739K6559N079j3379k3292K7031J00906K8328j4416J6024j1382
9147a849977J1329L6644K2748L3164k8743k2417r17o844j8498N2934K1945j1881
9135a760513K4804K6583j0542m6953L140K4559K0730K741K0132M934o461J6261
9123a680585K0220K0449K3569K7935L9996J115k4365k4797R411Q496K9415M9962
9111a499179K9878K9672r342l5209l662M957K1027q142N51K7153L8905L7212P378
9098a358801N59M0759J3672J88L3254M1067k533m3523q4494j17016q7394m8043
$$ y = [-2329871, -2311284, -2309420, -2292229, -2287061, -2315797, -2315911, -2259381, -2250014, -2286273, -2268551, -2246812, -2228125, -2211592, -2209690, -2186623, -2174163, -2107466, -2051067, -2080072, -2098587, -2108129, -2101478, -2071608, -2036174, -1991435, -1964876, -1959797, -1973176, -1996468, -1969437, -1868531, -1840203, -1854619, -1838595, -1849977, -1838648, -1802004, -1779256, -1746092, -1774835, -1797252, -1798169, -1805013, -1823511, -1770577, -1748632, -1760513, -1735709, -1709126, -1719668, -1766621, -1763481, -1738922, -1718192, -1715451, -1695319, -1690385, -1696846, -1680585, -1660365, -1639916, -1616347, -1588412, -1548416, -1547301, -1571666, -1596463, -1587052, -1578556, -1549141, -1499179, -1469301, -1439629, -1448971, -1484180, -1487842, -1482885, -1461858, -1470000, -1469449, -1442296, -1403391, -1366179, -1358801, -1358242, -1317483, -1303811, -1303623, -1270369, -1229302, -1231835, -1275358, -1359852, -1476868, -1564262, -1612305]
9086a612305k116j2910J8432M0709K3936O568J5136J9184L6985L3651L9714O901
9074a386115m6589k2109J7408L5136K3244p531o027j3209J414J3617O7412L0478
9062a292871m379n0568K132M6710K8627O5r767j0651j5226K0724L7838L2079M0637
9049a174650q175n688n730K8483N7609K6451k8920r7188j01651j24066r2398j9992
9037a545915L862M371K315N8521L4446M0907K7151J8601K529k1996J084J3123
9025a361001r153J7284K5177k1997k878P968K5467k5853K9257M1198O650l8660
9013a306541L281K3771j5029j6124r574J9125J0305k351j0326k613L5743L0331
9001a240002P018K9943j0020M802m5737k9172R416L2601J2558o79J7612l3975
$$ y = [-1612305, -1614421, -1627331, -1608899, -1568190, -1544254, -1537686, -1522550, -1503366, -1466381, -1432730, -1393016, -1386115, -1432704, -1454813, -1437405, -1402269, -1379025, -1386556, -1392583, -1405792, -1404378, -1390761, -1323349, -1292871, -1297250, -1347818, -1345686, -1298976, -1270349, -1270284, -1280051, -1290702, -1305928, -1285204, -1247366, -1215287, -1174650, -1182825, -1188513, -1194243, -1165760, -1108151, -1081700, -1110620, -1207808, -1309459, -1433525, -1525923, -1545915, -1542053, -1537682, -1535367, -1476846, -1442400, -1401493, -1374342, -1355741, -1353212, -1375208, -1374124, -1361001, -1370154, -1352870, -1327693, -1349690, -1352568, -1344600, -1319133, -1344986, -1315729, -1274531, -1267881, -1306541, -1303260, -1279489, -1294518, -1310642, -1320216, -1301091, -1290786, -1293137, -1303463, -1306076, -1270333, -1240002, -1232984, -1203041, -1213061, -1208259, -1253996, -1283168, -1273752, -1241151, -1228593, -1229272, -1211660, -1245635]
8989a245635J4186L301J7966k978k665j6273j0029n132N171K9822K1236k5452
8977a216482l0604J9913K5398K4346J7638L063J1939J1790l3354j6724J767Q4
8965a181226n399p994k00n675Q23K8341L3875R307k6178k7407N418J4793O0055
8952a101467J5547M197J9556l7499k9784k371L1294j4162j7871o219j2107j6053
8940a166939K8204L8464K829l3834l1241q241K526L8403R84O614j2334P863j1195
8927a137897j3183j988O457K1109j2341l5724K4928J3615K7430L6019J1877j1142
8915a070840k7736J875J9340K794r003j6790J6619K61l505l1268k1290j3031K5123
8902a127451L2775k879l928L7527J2806M038j106m1244j1679J4017J9287K0789
$$ y = [-1245635, -1231449, -1228148, -1210182, -1213160, -1215825, -1232098, -1242127, -1247259, -1242088, -1212266, -1191030, -1216482, -1247086, -1227173, -1201775, -1177429, -1159791, -1156728, -1144789, -1132999, -1166353, -1183077, -1181310, -1181226, -1186625, -1194619, -1194819, -1200494, -1199671, -1171330, -1137455, -1128148, -1154326, -1181733, -1176315, -1161522, -1101467, -1085920, -1081723, -1062167, -1099666, -1129450, -1131821, -1100527, -1114689, -1132560, -1138779, -1150886, -1166939, -1138735, -1100271, -1097442, -1131276, -1162517, -1170758, -1168232, -1129829, -1128845, -1122231, -1134565, -1126702, -1137897, -1151080, -1153068, -1146611, -1125502, -1137843, -1173567, -1148639, -1135024, -1107594, -1071575, -1059698, -1070840, -1098576, -1096701, -1077361, -1074567, -1083570, -1100360, -1083741, -1083480, -1086985, -1118253, -1139543, -1152574, -1127451, -1094676, -1097555, -1101483, -1063956, -1051150, -1047112, -1048218, -1089462, -1101141, -1087124, -1067837, -1047048]
8890a047048m231j4962k5680J3606j2318k4128M949L5296M014j3251Q739k3319
8878a098333k5525j7016M7322M5641K779K654R155P983j0487K3422P200j8966
8866a024171O159J0410L8323m0722k7333J1315l045l10J4115N977j7950l4210
8854a061442K2212J2495j2482j9848L2288K941j3034L3843j656k0743n030L5055
8842i95401L6819j0474p946m156l1209J7186J2595j678j857K3730n284m6533j109
8829a015317j0334L1289M7942j3587j1431k2705L2816K3377l0238m0837m488k982
8817a016495j6941M5084J3023Q56j0839J4018K1053N776k4560j8988j4099L0889
8805i71223N6571O917l0758l879K1736K6878j8181j4420K4093o419j1290k8518
$$ y = [-1047048, -1051279, -1066241, -1091921, -1078315, -1090633, -1114761, -1109812, -1074516, -1070502, -1083753, -1075014, -1098333, -1123858, -1140874, -1093552, -1047911, -1045132, -1042478, -1033323, -1025340, -1035827, -1012405, -1005205, -1024171, -1018012, -1007602, -969279, -1010001, -1037334, -1026019, -1029064, -1029374, -1015259, -1009282, -1027232, -1061442, -1039230, -1026735, -1039217, -1059065, -1026777, -1023836, -1036870, -1003027, -1004683, -1025426, -1030456, -995401, -958582, -969056, -977002, -981158, -1012367, -995181, -982586, -984264, -986121, -962391, -967675, -1014208, -1015317, -1025651, -994362, -946420, -960007, -971438, -994143, -961327, -937950, -968188, -1009025, -1013513, -1016495, -1033436, -988352, -975329, -974473, -985312, -971294, -950241, -944465, -969025, -988013, -1002112, -971223, -914652, -907735, -938493, -942372, -920636, -893758, -911939, -926359, -902266, -908685, -919975, -948493]
8793i48493l8416O27j6273N169K2458K6970Q828r657m870L596j7431J2788L1265
8780i23439r031m051R930L7137J2334k4963J3233j2190m141k4121l12J0453J5127
8767i04034J891m017R275J9918k4797l7683m7120J6633J4708M8536M457r424K7579
8754h84078m2936P676J375n5692k2354N1603K5452R694J5758k0517q638j1457
8742i34114l5308K0877K6208m213Q85r985L3615K0357J8058j8358k1957n118J5037
8729h94016k332L8532l131j969J6179k2075Q646q361K8817k1510j9757J0592J3843
8716h56542l452l6853q761L4707K305O456j4561k2096J3623N7209O348j5394O069
8703h30942J173J0334j2117k3565l475j44L0901j3783J4308j213j5013K4554J9852
$$ y = [-948493, -986909, -986282, -1002555, -997386, -974928, -947958, -939130, -948787, -953657, -950061, -967492, -954704, -923439, -932470, -936521, -926591, -889454, -877120, -902083, -888850, -901040, -905181, -929302, -929614, -919161, -904034, -902143, -906160, -896885, -876967, -901764, -939447, -986567, -969934, -955226, -906690, -902233, -911657, -884078, -927014, -919338, -917963, -973655, -996009, -944406, -918954, -909260, -893502, -914019, -922657, -934114, -969422, -948545, -922337, -926550, -925665, -935650, -902035, -881678, -863620, -881978, -903935, -909053, -894016, -896348, -857816, -860947, -862916, -846737, -868812, -860166, -868527, -839710, -861220, -880977, -870385, -856542, -859994, -896847, -905608, -870901, -868596, -862140, -876701, -898797, -885174, -827965, -821617, -837011, -830942, -829769, -819435, -831552, -855117, -858592, -858736, -827835, -841618, -827310, -828523, -843536, -818982, -799130]
8690g99130J3745j4561R107K705k4873J0461R7J914k1786J7409K0713J1839K7654
8677g44706K4459K3553k8899j4633j292K657M02J6628O2262j8639k9806L3795
8665f74219J425k6720k1028K901M1428M1718K6960K8672j1523K2283M0309J3439
8653e14355O6166L6107L9362M7988M1710J4985N4102Q8706o8376k67275l64162
8642h25042l71050j64304K0485R8053P8987M7340L4768K5379K9129M1361K3372
8631i61522P574J4527N4487K5764K1093L0293k3180k4778K1472P7298L8596O2855
8619f55521j8274l69R650r154k5603L1268O2372O2039K4804J7990M7713Q2054
8607c71031R2316N6220Q6692J25924J32714J49998J03068l2557l95085p74323
$$ y = [-799130, -785385, -799946, -790839, -788134, -813007, -802546, -802449, -800535, -822321, -804912, -784199, -772360, -744706, -720247, -696694, -725593, -740226, -741518, -738861, -738459, -721831, -659569, -678208, -708014, -674219, -672794, -699514, -720542, -717641, -676213, -634495, -607535, -578863, -590386, -568103, -527794, -514355, -448189, -412082, -372720, -324732, -283022, -268037, -213935, -125229, -193605, -460880, -825042, -1196092, -1360396, -1339911, -1241858, -1162871, -1115531, -1080763, -1055384, -1026255, -984894, -961522, -953948, -939421, -884934, -859170, -838077, -807784, -830964, -855742, -834270, -756972, -718376, -655521, -673795, -674164, -664514, -673668, -699271, -668003, -605631, -543592, -518788, -500798, -453085, -371031, -278715, -222495, -135803, -9879, 122835, 272833, 375901, 343344, -51741, -826064]
8597h26064p47568l61540m7053O0575J36672R7248R6562R9414O0147Q4914K6828
8586a319865j3016n008K4575k0601l424K6961O1497M7785J4969j3645l682l3105
8574a236559j1045J3731L3725O5988K3727J7948J8434J5460L6292K1530J9156
8563i81613N5667M2612K2915L9466O3526Q5438O7318M4447J5328j35607l22192
8552a002695l86727k05729l0377L7727K3112M9250M0531M7316M1556L4521K8378
8541a323137M6991J5479k9406k4878L6411O9733K0891O532L871m152j3860k1777
8529a217302P316L2351L0777K0245R546K8663r530N93j3298Q985P849j2808j1674
8516a118287J9735j671J1015l345l202L3015m447l0111K141k975j219M8477O61
$$ y = [-826064, -1573632, -1935172, -1982225, -1921650, -1784978, -1687730, -1591168, -1491754, -1431607, -1346693, -1319865, -1332881, -1337889, -1313314, -1333915, -1337339, -1310378, -1248881, -1201096, -1186127, -1199772, -1203454, -1236559, -1247604, -1233873, -1200148, -1134160, -1110433, -1092485, -1074051, -1058591, -1022299, -1000769, -981613, -925946, -883334, -860419, -820953, -757427, -671989, -604671, -560224, -544896, -680503, -1002695, -1389422, -1595151, -1625528, -1587801, -1564689, -1515439, -1474908, -1427592, -1386036, -1351515, -1323137, -1276146, -1260667, -1290073, -1314951, -1278540, -1208807, -1187916, -1181384, -1177513, -1181665, -1195525, -1217302, -1209986, -1177635, -1146858, -1126613, -1117067, -1088404, -1097934, -1097341, -1110639, -1101654, -1093805, -1106613, -1118287, -1098552, -1100223, -1089208, -1092553, -1095755, -1062740, -1067187, -1097298, -1095157, -1098132, -1099351, -1050874, -1050213]
8503a050213q892j2301J2037K189P169J4172q046j7965L6610L1111l1449j5505
8491a041083j0121K812J1244j1574J6609J0387m007J1502L9733n25j2006r565
8479i96594J2181L0126L460k2253R72j689k6329J7571J4821J9388l724L0046O261
8466i15763j9389j7550L197J3901j2338j6245n610l5441j2445K8597K6629j485
8454i63942j7798K363P399J9494R172o97j5612L2936l650K66j0360r539M612R128
8440i36228l3058l758j6939K7127L1979J973j6879L6315l1691j2483J3504M0050
8428i00088K8112m3728j7951K0903k3042J832r200k1180m423L6990L7915n3675
8416i47535l5981K1679r249n3363K9794M0938K9923n076m397K3127J5601K221
$$ y = [-1050213, -1059105, -1071406, -1059369, -1057180, -1050011, -1035839, -1043885, -1061850, -1025240, -994129, -1025578, -1041083, -1051204, -1048392, -1037148, -1048722, -1032113, -1021726, -1025733, -1014231, -974498, -975023, -987029, -996594, -984413, -954287, -950827, -973080, -972108, -973797, -1000126, -982555, -967734, -948346, -952070, -922024, -915763, -935152, -952702, -949505, -935604, -947942, -964187, -969797, -1005238, -1017683, -989086, -962457, -963942, -981740, -979377, -971978, -952484, -943312, -944009, -959621, -926685, -930335, -930069, -940429, -949968, -945356, -936228, -969286, -973044, -989983, -962856, -930877, -928904, -945783, -909468, -941159, -953642, -940138, -900088, -871976, -915704, -933655, -912752, -935794, -933962, -943162, -964342, -968765, -931775, -893860, -947535, -983516, -961837, -971086, -1024449, -994655, -953717, -923794, -928870, -933267, -910140, -894539, -892318]
8404h92318k5796j5191K5483J6001m830j1864j7203J07J0282K3160J3054l1412
8392i10527l186N213K3422O281j2134J478j1071l4742p200L4106L2823K4449L484
8379h47604j2040k5020k8948j1117p523N586Q141J038O676j4445J7557K0590k5977
8366i13086p956K4557p253R035n711k3840P529J7355K365L5154K2726j0683k8628
8353h78436j7974J6546k1192m931j66Q293q714j4951K5716M0017n751n2378K3353
8340h90568q137j4735p936R624J2360K0491J9420l157j8322k1476k1602r635R673
8327i24000K1725K3582j6009k0483P000j1395R718J630n35Q280J8191J118L3302
8314h47876K168l5522m5104j3168K7655K6109p939k2151l3908P082L4127J4830
$$ y = [-892318, -918114, -933305, -907822, -891821, -896651, -908515, -925718, -925611, -915329, -892169, -879115, -910527, -913713, -908500, -885078, -878797, -890931, -889453, -900524, -935266, -942466, -908360, -875537, -851088, -847604, -859644, -884664, -913612, -924729, -932252, -926666, -918525, -917487, -910811, -925256, -907699, -887109, -913086, -921042, -896485, -903738, -894703, -900414, -924254, -916725, -899370, -897005, -861851, -839125, -849808, -878436, -896410, -879864, -901056, -905987, -906153, -897860, -906574, -921525, -895809, -855792, -861543, -913921, -890568, -898705, -913440, -921376, -911752, -899392, -878901, -859481, -862638, -880960, -902436, -924038, -933673, -924000, -902275, -878693, -894702, -915185, -908185, -919580, -909862, -908232, -908767, -900487, -882296, -881178, -847876, -845708, -881230, -926334, -939502, -911847, -885738, -893677, -915828, -949736, -942654, -908527, -893697]
8302h93697J7240j6394k7107r126L023J8061J2716J5290J3032j6274k4267k192
8290i09695K5495M170k7345J0232K4794J6727K0496J983M51r34p852J951J9590
8277h19937Q544q572k2457k0439P3j3866K0496L687o12k701J1641j5627j9664
8264h79434R469M2019j8274j9343o019k2152K6366M0090J6492k306j9251L1988
8252h00355j1559j8225k6726j73K9464M5808J491m9830j8724m2848o598R580j3942
8239i02637j911J2336K1000J2778q851O767O12j5451L1638J5370J3480K1493l4861
8226h28237l0612l260o607K7148L5613J0697m2246j3037j528J8596J0905O291
8214h16277L1127j1013j2369q063j4137j1003J8067l60k2778J4448R995J0859
$$ y = [-893697, -876457, -892851, -919958, -929084, -926061, -908000, -895284, -879994, -866962, -883236, -907503, -909695, -884200, -880030, -907375, -897143, -872349, -855622, -835126, -833143, -832692, -833626, -841478, -839527, -819937, -811393, -819965, -842422, -862861, -862788, -876654, -856158, -852471, -853083, -855784, -844143, -859770, -879434, -869965, -827946, -846220, -865563, -871582, -893734, -867368, -827278, -810786, -813092, -832343, -800355, -811914, -830139, -856865, -857038, -827574, -781766, -780275, -830105, -848829, -891677, -898275, -888695, -902637, -904548, -892212, -871212, -858434, -867285, -860518, -859906, -875357, -843719, -828349, -814869, -793376, -828237, -858849, -862109, -868716, -841568, -805955, -795258, -837504, -850541, -852069, -833473, -822568, -816277, -785150, -796163, -808532, -816595, -830732, -841735, -823668, -824028, -846806, -832358, -822363, -811504]
8202h11504m508k9551N665L0570J2740L3778L1078r249l8806m5206j0975q505
8190h44473m003l1668J0521M0750J8611l3552k1936M4884L7452j5349j4327k9949
8178h43039J06p141K0711l443M390r782l2328j1549N455M2907Q708k4741K982
8165h46764L7679k3210k597L7456j547K485j6024L00k2492k3428o985K1128N938
8152h38061J1332N559K3125q34k223J2141j8843m8901j0667R541L4557K2933K0486
8139g79855k1657j4270L6966l8853k7296M5854J5571J6723k2310M105K5629j6987
8127g76380k7664J990k381l448j0044k4568n543M2384J2179N33J0362r221J3455
8114g78346l1008k8287N828J9347n781P054M3609m0465k1957M0971M1486O820
$$ y = [-811504, -816012, -845563, -839898, -809328, -796588, -762810, -731732, -740981, -779787, -824993, -835968, -844473, -848476, -880144, -869623, -828873, -810262, -843814, -865750, -820866, -783414, -798763, -813090, -843039, -842933, -850074, -829363, -832806, -828416, -838198, -870526, -882075, -876620, -833713, -825005, -849746, -846764, -809085, -832295, -834892, -797436, -798983, -796498, -812522, -812222, -834714, -858142, -865127, -843999, -838061, -826729, -821170, -798045, -798879, -801102, -788961, -807804, -856705, -867372, -857831, -823274, -800341, -779855, -801512, -815782, -778816, -817669, -844965, -799111, -783540, -766817, -789127, -785022, -759393, -776380, -804044, -802054, -804435, -807883, -817927, -842495, -848038, -805654, -793475, -792942, -782580, -791801, -778346, -809354, -837641, -831813, -812466, -818247, -811193, -767584, -808049, -830006, -789035, -747549, -740729]
8102g40729m28K562j5892J1578l450m461K4560K0397m8065k5655j3203j1661q15
8089h05262J5029J0276J6890r841J5621Q088k9377j9499j0012j5595L0887J6035
8077g76760N3048K2982l4219m2875j2034j2131K5040K1157K4994r896O021k6937
8065g61610l6279j9645j1324j9852K6604L1327K5449Q349P953Q82J2025P869J9488
8052g08764l1318l6026J7760L5844k3224o3480N295K8422K0318K3220q582j9046
8040g59581k7971o56j2172K9804L0940k2485k927O405j2087j2485J7450O022L0060
8027g29683J9519J124K057n700j1672j7275M216m747j3343J0626K822p570N150
8014g44476K3093r015m1651J2534K0502M753j4911j6899J9991L9692j5740j0647
$$ y = [-740729, -741157, -738595, -754487, -742909, -746359, -750820, -726260, -705863, -753928, -779583, -792786, -804447, -805262, -790233, -779957, -763067, -772908, -757287, -749199, -778576, -798075, -808087, -823682, -792795, -776760, -723712, -700730, -734949, -777824, -789858, -801989, -776949, -755792, -730798, -740694, -734673, -761610, -797889, -817534, -828858, -848710, -822106, -790779, -765330, -756981, -749028, -748146, -736121, -728252, -708764, -740082, -776108, -758348, -722504, -745728, -809208, -803913, -775491, -755173, -731953, -740535, -759581, -787552, -788208, -800380, -770576, -739636, -762121, -765048, -758643, -770730, -783215, -765765, -759743, -729683, -710164, -709040, -706983, -712683, -724355, -741630, -737414, -742161, -755504, -744878, -742056, -749626, -744476, -721383, -730398, -772049, -759515, -739013, -734260, -749171, -766070, -746079, -706387, -722127, -732774]
8002g32774K001P130k2999K3972r213m0348l3894l755L0580M4956O863j6160Q435
7989g35206J253L0659m899j4961O130N962J5101j9533m3992J1050k7286N237p168
7976g77653K2196K1864j3889K6142k0391p765K0894M185j7078P33R544j9561k3876
7963g74655R492N3315l638m9675k0184r169N857P964l000l197J2289j5241P036
7950g82806J7580J2339J1726j2088j4280p644M853J2906j2579J9702M2692K5407
7938f82192J2440l4583l6335K0625L1792m990k846k1540j1888M193j6217k7460
7926g69001k5997Q056J1872J654k2011r934j4500M998J764j4118N4832M0632J9591
7913g12162n2697P981L8670p256j0798K0375k6810j5633q770k8167n224L0346
$$ y = [-732774, -730773, -723643, -746642, -722670, -731883, -772231, -806125, -809880, -779300, -734344, -727481, -743641, -735206, -733953, -703294, -708193, -723154, -717024, -711062, -695961, -715494, -759486, -748436, -775722, -770485, -777653, -755457, -733593, -747482, -721340, -741731, -749496, -728602, -724417, -741495, -740762, -731218, -750779, -774655, -765163, -711848, -715486, -765161, -785345, -794514, -788657, -780693, -783693, -786890, -774601, -789842, -782806, -765226, -752887, -741161, -753249, -767529, -775173, -770320, -757414, -769993, -750291, -707599, -682192, -669752, -704335, -740670, -720045, -688253, -693243, -696089, -717629, -729517, -725324, -741541, -769001, -794998, -786942, -775070, -773416, -795427, -805361, -819861, -814863, -813099, -827217, -772385, -731753, -712162, -764859, -756878, -718208, -725464, -736262, -715887, -742697, -758330, -767100, -795267, -800491, -770145]
7901g70145L5782M921J286k9273K384K052L5734L3428k4348p5822j1975R521J3899
7888g72556R655k3580n087L788J2899k490j242J7627J0780J2922Q603j1843J718
7875g38806j3289P86M861k1848j664n67j852K0410l707M058K0410O758m449k25
7861g29124k4573l0492J0898L417K3860J5897j3571j0319p149J7613j2801m428
7849g60772r539l9473n524J4783R427K8081Q19j1008K4521J4166l2178r163o94
7836g76554N982r275K0659J7056K8798k2719k2435J1827L0470p473J5200R811
7824f98653m2995j0364J3544K617n601r908j9608k6005J0282K6641K3997J8097
7812g17956n809L5557o607j1441j3653J9056m047k9339R599J1165k2127o960j5928
$$ y = [-770145, -734363, -729442, -728156, -757429, -755045, -752993, -717259, -683831, -708179, -784001, -795976, -786455, -772556, -762901, -786481, -791568, -787780, -774881, -777371, -778613, -760986, -750206, -737284, -728681, -740524, -738806, -752095, -751309, -746448, -768296, -769960, -770527, -772379, -751969, -755676, -751618, -731208, -724450, -728899, -729124, -753697, -784189, -773291, -769874, -746014, -730117, -743688, -754007, -761156, -743543, -756344, -760772, -770311, -809784, -815308, -800525, -791098, -763017, -762198, -773206, -748685, -734519, -766697, -775860, -776554, -770572, -779847, -759188, -742132, -713334, -736053, -758488, -746661, -716191, -723664, -708464, -698653, -741648, -752012, -738468, -735851, -741452, -751360, -770968, -796973, -786691, -760050, -736053, -717956, -723765, -688208, -694815, -706256, -719909, -700853, -704900, -734239, -724640, -713475, -735602, -742562, -758490]
7799g58490k7027K1660N245K3830K9878M580r029j4530L1076L354l5487k6034
7787g50974m189K4990K0495K0233o510j3970q755k0769j5786K986l869K9947K405
7774g23766j0787j2383O43L1811L0416m557r623k9007k9876j9605j3818P455J1945
7761g71152j6894l1894K2076L7621N1640K588j4109k2090J9805k2665L6535L6358
7749f72181k00k3209n403O057L0639m3585j7372J8327j4418k0921j7529P178K2222
7736g30395J2595k4729k3570J0865N5734j5871l7275J6096M4673L3044L0971k3189
7724f51051k6610j0898j3321j0097j0595j1732j142N076K3889o255N049j5661
7712g23348j5696j646j3481N5765K8510j5603l6384q414N468K633L0897k7147
$$ y = [-758490, -785517, -763857, -758612, -734782, -704904, -700324, -709353, -723883, -692807, -689453, -724940, -750974, -755163, -730173, -709678, -689445, -695955, -709925, -718680, -739449, -755235, -752249, -756118, -726171, -723766, -734553, -746936, -746293, -714482, -684066, -688623, -698246, -727253, -757129, -776734, -790552, -783097, -771152, -788046, -819940, -797864, -760243, -708603, -706015, -720124, -742214, -722409, -745074, -708539, -672181, -672381, -695590, -700993, -694936, -664297, -707882, -725254, -706927, -721345, -742266, -759795, -752617, -730395, -717800, -742529, -766099, -755234, -699500, -715371, -752646, -736550, -691877, -658833, -627862, -651051, -677661, -688559, -701880, -711977, -722572, -734304, -735446, -730370, -706481, -712736, -707687, -723348, -739044, -740690, -754171, -698406, -669896, -685499, -721883, -730297, -724829, -722196, -691299, -718446]
7700g18446j4764L729l3076J4350L8128M3028J3408Q632p55m6072m2454L04J1041
7687g22947L2498k4543J1780P598l4016j9132l915R480J3051J1800K0291k4970
7675g23025k1049K6567p436K5563J3694m9153j1805K0891r334K1645k5585J8782
7663g20245p6J5066M5010K344j5545k2659l0090L3444K6067m0312k6772L4307
7651f99461J3275j061l632k8336J2244q152j4433J2060K4405K9P776L065L65j2415
7637f94271k5871M6047M832j6335J1136M1792m149m2083n020l9835o345J058l975
7624g33019K2050L7450j244o380R209N10l2366O956J7129l9858j1060K9664K2393
7611f78566J4769L907p399l9151n7368J9898J9807J3298K0230R892J8167L134
$$ y = [-718446, -733210, -729481, -762557, -748207, -710079, -667051, -653643, -645011, -645766, -691838, -734292, -733988, -722947, -690449, -714992, -703212, -695614, -729630, -748762, -752677, -743197, -730146, -718346, -698055, -723025, -744074, -717507, -724943, -699380, -685686, -734839, -746644, -725753, -735087, -713442, -739027, -720245, -720321, -705255, -660245, -657901, -673446, -696105, -726195, -692751, -666684, -706996, -733768, -699461, -686186, -687247, -690879, -719215, -706971, -715123, -729556, -717496, -693091, -693062, -685286, -682221, -681856, -694271, -720142, -674095, -669263, -685598, -674462, -632670, -636819, -678902, -683922, -723757, -730102, -729044, -733019, -710969, -673519, -674763, -681143, -671934, -671424, -703790, -696834, -679705, -719563, -730623, -700959, -678566, -663797, -659890, -667289, -706440, -763808, -743910, -724103, -710805, -690575, -680683, -662516, -659382]
7599f59382l2299k2303K5424L175j7732K4556K444k4561K6959J3975j5148M275
7587f70617k9779K2766K5406o470j0652J2489J1149L3059J3509l8872m4650k209
7575f84871P111k1673n764J0131J6840K7144L7699p640j6422l3365k7550K4024
7563f74336Q689M210Q840J7539J1884l0461o784K1308j4224n3761j7511J9200
7551g05407M70O861j9846K6156K5231J7583l2505j2176p458m722J5776L692j8209
7538g04554k0234L0647o206J211l8524J5423J8248k0528l882p735L4566K9661
7526f71907p008m4667M594M7044J7983j9251J2242J9373p469l2436j6951o953
7514g05406J1021l0118N327L9036r107M4078M925j6703m4693m3258o36p160R529
$$ y = [-659382, -691681, -713984, -688560, -685385, -703117, -678561, -676117, -700678, -673719, -659744, -674892, -670617, -700396, -677630, -652224, -658694, -669346, -656857, -645708, -612649, -599140, -638012, -682662, -684871, -677760, -699433, -705197, -695066, -678226, -651082, -613383, -621023, -637445, -670810, -698360, -674336, -665647, -661437, -652597, -635058, -623174, -653635, -660419, -639111, -653335, -707096, -724607, -705407, -704937, -698076, -717922, -691766, -666535, -648952, -681457, -693633, -701091, -705813, -690037, -686345, -704554, -724788, -694141, -700347, -699136, -737660, -722237, -703989, -724517, -728399, -736134, -701568, -671907, -678915, -723582, -718988, -671944, -653961, -673212, -660970, -641597, -649066, -681502, -698453, -705406, -694385, -724503, -719176, -680140, -689247, -645169, -640244, -656947, -701640, -744898, -745534, -752694, -743165]
7501g43165N1408K0018R231J6810J1802j6822k1334j8332O168J2342K351j1623
7489f81146k920J2304P214o123o726l006J3401k5808k982J4459J0555L3672J6166
7476f20940k6967o629J9508o161k6099K3819j5267P336j1781j6883n638k335J597
7463f86440L69J5297J6772l1223K2170K6060j7023j8333K3900L0598k1726k6590
7451f66169L524P378k155L960p975M5051J39Q972j7482n416j4826k312M1637j3571
7437f19245n9850N270K8151p131j0470j3924q720J4567Q430J6926K214n2495l9735
7424g36012M2923K7281M444j4670J363j480j8527n686k602L0854K965M1963m398
7411f31582j0790j6850j2114j7614j4000M0557N0823J5751k9304k292L758k8896
$$ y = [-743165, -691757, -671739, -662508, -645698, -633896, -650718, -672052, -690384, -684216, -671874, -669523, -681146, -684066, -671762, -664548, -670671, -677397, -680403, -667002, -692810, -695792, -681333, -670778, -637106, -620940, -647907, -654536, -635028, -641189, -667288, -643469, -658736, -651400, -663181, -680064, -685702, -688037, -686440, -686071, -670774, -654002, -685225, -663055, -636995, -654018, -672351, -648451, -617853, -639579, -666169, -662645, -655267, -657422, -653462, -661437, -616386, -616247, -607275, -624757, -630173, -644999, -647311, -605674, -619245, -679095, -673825, -645674, -652805, -663275, -677199, -685919, -671352, -662922, -645996, -643782, -696277, -736012, -693089, -665808, -661364, -676034, -674671, -676151, -694678, -700364, -702966, -672112, -669147, -627184, -631582, -642372, -659222, -671336, -688950, -702950, -662393, -611570, -595819, -625123, -627415, -623657, -652553]
7399f52553K2309K3708o7838j40L4149p333j3964O870p381k2573l610L6863M857
7386f46636N279j0125m1289j3776M4159J9962l6415j8712M630J2466O673L4676
7374f39108r25k9866K2413J9191N56r192k5647j2061L5531J4811J364L3621K039
7361e87273j4495k4224j4641k1972M606j828K1135J534l6597l3134J9393L2721
7349f54775Q624n585k7134k9849J3458K3066M7698J7623j2102m0712j7091k0132
7337f96911J7844K4851m804j4988K5458k177k6096N679n263K2356M3208m6876
7325f57719M72q240Q97L5K1481M451l3801k6653j4743k1111K9280K3990R679L2639
7311f39343L1511j0279j406k6131k1401L1470p988j7875K1001L1717l8157l6639
$$ y = [-652553, -630244, -606536, -674374, -674514, -640365, -647698, -661662, -654792, -662173, -684746, -688356, -651493, -646636, -641357, -651482, -692771, -706547, -662388, -642426, -678841, -697553, -692923, -680457, -673784, -639108, -640033, -669899, -647486, -628295, -627739, -636931, -662578, -674639, -639108, -624297, -622933, -589312, -587273, -601768, -625992, -640633, -662605, -657999, -659827, -638692, -637158, -673755, -706889, -687496, -654775, -646151, -651736, -678870, -708719, -695261, -672195, -624497, -606874, -618976, -659688, -676779, -696911, -679067, -654216, -659020, -674008, -648550, -650727, -676823, -671144, -676407, -654051, -610843, -657719, -657247, -665487, -664590, -664555, -643074, -638623, -672424, -699077, -713820, -734931, -705651, -681661, -671982, -639343, -607832, -618111, -619517, -645648, -667049, -635579, -643567, -661442, -640441, -608724, -646881, -683520]
7299f83520k0477J0057K4437l2576o52J9764K9715L981J1988j8756m3989l158
7287g03186N9889K5890P033k6452Q673J9544P727k6978k7197K64p422L507P592
7274f51116l6859l1918K3370N4263K2017L0422K4523J2501k9934k9778J1269l6106
7262f37346J056n878N518L954k2260q863N2q553l036L3132L8013j6451n170k384
7248f28216m5601L946K3253J3456k1788J3904L2403P449j7758j842J341l4745
7236f54198J3864J8242N150J6041K4736R919j3617l865k1548j9542k2515k2607
7224f69940Q830M1297K1119m4678j1394R299J9335M0586j2381J9176l8669j6735
7212f34155j8439j9169J9922L1200J4398p370k2502Q356k0352j7291M141L087
$$ y = [-683520, -703997, -693940, -669503, -702079, -702731, -682967, -653252, -649271, -637283, -656039, -700028, -703186, -643297, -617407, -610374, -636826, -628153, -608609, -600882, -627860, -655057, -654793, -662215, -658708, -651116, -687975, -719893, -696523, -642260, -620243, -589821, -565298, -552797, -582731, -612509, -601240, -637346, -636290, -642168, -636650, -632696, -654956, -663819, -663767, -672320, -675356, -642224, -604211, -620662, -625832, -628216, -673817, -669871, -646618, -633162, -654950, -641046, -608643, -601194, -618952, -620794, -619453, -654198, -640334, -622092, -616942, -600901, -576165, -566246, -579863, -583728, -605276, -624818, -647333, -669940, -661110, -619813, -598694, -643372, -654766, -645467, -626132, -585546, -597927, -578751, -617420, -634155, -652594, -671763, -651841, -620641, -606243, -613613, -636115, -627759, -648111, -665402, -661261, -658174]
7200f58174j6926j2520j126J4773J5077L2782N6957J1438j7919j0869Q667M730
7188e73110l0977j2492L1486K9k6305J6069M904m2427L09K568L432m346J3914
7175f16946j4475l553l7390J5221R551Q218O757J0526m283J9635j5878l4597R160
7162f48054k5218l3342K1403J9586k3507j6955K4312N5327J252n13L1833J1941
7150e81935k1096j0483k0352N811K8728L832k7080k1563o519J7803M9277J5648
7138e67929N343k087K2031k1640j7591M532l0596r135m8591k4803k3154J5175
7126f98445O5437J4473j1417j1861l0184J0793J6684j371N571J3635J2004J2853
7114f01828k7517l8087j1019J3608J6599J7500o753K2874J0030O555M6836n0748
$$ y = [-658174, -675100, -687620, -688746, -673973, -658896, -626114, -569157, -557719, -575638, -586507, -577840, -573110, -604087, -616579, -585093, -585064, -611369, -595300, -590396, -632823, -632514, -629946, -626514, -630860, -616946, -631421, -634974, -672364, -657143, -647592, -639374, -632617, -622091, -626374, -606739, -622617, -657214, -648054, -673272, -706614, -685211, -665625, -689132, -706087, -681775, -626448, -625196, -625709, -593876, -581935, -603031, -613514, -633866, -628055, -599327, -595495, -622575, -644138, -650657, -632854, -583577, -567929, -562586, -564673, -542642, -564282, -581873, -577341, -607937, -617072, -665663, -690466, -713620, -698445, -633008, -618535, -629952, -641813, -671997, -661204, -644520, -645891, -640320, -626685, -614681, -601828, -629345, -667432, -678451, -664843, -648244, -630744, -637497, -614623, -604593, -598038, -551202, -601950]
7102f01950m2330p661L4825R073o389p65L8780j4716k5392Q717K4384m008N068
7089e82364k566j5655p258j4413K787k827o238L4003J9287m504k7417R915J8376
7076e78874o314j911K1595m7724l1056O752K4992K1749K9484J1324k3537k8544
7064f02064J0027k0886j3960J3312j7559l11K8996L5187l3364m742K8825J6351
7052e60188q641k8373l2092p222J9795J3322j6663k701N640O264j413j8942K891
7039f28323j862j8658K183K427M590K1663K7313j8101j7629L4322j8241l8178
7027f48494n597J0572M7854J7865O623l2859J0799L7735l3344l5108J8606o404
7015f11752q608P857M4087O037k5582R311n527J4592l206j4110K8231n3382l3138
$$ y = [-601950, -644280, -651941, -617116, -608043, -614432, -615197, -576417, -591133, -616525, -607808, -583424, -587432, -582364, -584930, -600585, -607843, -622256, -619469, -622296, -628534, -594531, -575244, -579748, -607165, -597250, -578874, -585188, -587099, -565504, -613228, -644284, -637532, -612540, -590791, -561307, -549983, -573520, -602064, -592037, -612923, -626883, -613571, -631130, -631441, -602445, -567258, -600622, -605364, -576539, -560188, -568829, -597202, -629294, -636516, -616721, -603399, -620062, -622763, -617123, -610859, -612272, -631214, -628323, -630185, -648843, -646660, -644233, -639643, -617980, -590667, -608768, -626397, -592075, -610316, -648494, -654091, -643519, -595665, -577800, -571177, -604036, -593237, -555502, -588846, -623954, -605348, -611752, -620360, -612503, -568416, -562379, -587961, -578650, -584177, -569585, -572791, -586901, -558670, -612052, -645190]
7002f45190N039K6581M273j7285k4655k8288J4487O516L427O7340M7834R72p822
6989e46771L747o655j6617j6244J981K1292k0162R186k7936k878K9556n011R499
6976e67013J755j1668j8601n0822R464mL41K1070K8376J8696k6004j1995M786
6963f01619m073j2070Q11J3032j234r111m285L5726K5316K417m0127l5560M6456
6950e84321J9272l1606L633J4565j3114n0032l485J9361k737M1251K773q957j0013
6937f03410j2527K5477L5171j6726n7399l2308Q963J226j4774M1528O6479L0408
6925e27892k5577j7166o297j1896o792j2592o025j0001L2714q407k0979j6352
6913f37262L7871J7536L347k3842k1569k848o861M800k7437q149n96o173K3865
$$ y = [-645190, -640151, -613570, -609297, -626582, -651237, -679525, -665038, -658522, -655095, -587755, -539921, -538949, -546771, -543024, -549679, -566296, -582540, -580559, -559267, -579429, -570243, -598179, -601057, -571501, -576512, -567013, -565258, -576926, -595527, -646349, -636885, -636889, -636548, -615478, -587102, -568406, -594410, -606405, -601619, -605692, -617762, -616951, -603919, -605153, -614264, -618549, -582823, -557507, -555090, -595217, -630777, -584321, -565049, -596655, -593022, -578457, -591571, -641603, -645088, -625727, -628464, -587213, -584440, -593397, -603410, -615937, -590460, -555289, -572015, -629414, -661722, -652759, -651533, -666307, -624779, -558300, -527892, -553469, -570635, -576932, -588828, -595620, -608212, -614237, -624238, -591524, -599931, -620910, -637262, -599391, -581855, -578508, -602350, -623919, -626767, -633628, -628828, -656265, -664414, -665010, -671183, -647318]
6900f47318M4826M4986j3126k8991J5864j1716J7030R571j8024n656k6856P475
6888f11935L80O877J7346J8460n351j3684n905L1309j12k0009j4184J2667L6532
6875e47609K1426O161j1518q65o892k5539o845P742K7921K6199m7328q676j2620
6862e78443j1865j1233n737k41j754O884j7674r996J623M0632N9539n3166k4588
6849f06019K656J8357O907J4397j624l8805K18j3218J5786J8339k640o230L6339
6836e55537K8501l5453j8797R817j4757m342J4956n89o66j3352J668J9683J5415
6823e53453r504j7396J4510J1541K6769L592j8724j915j1127j796K816k0653k5892
6810f01232J602K49r41J8470J5620j2010j0318K1129l012J8845k26j7374l980
$$ y = [-647318, -602492, -557506, -570632, -599623, -583759, -595475, -578445, -568874, -586898, -592554, -619410, -611935, -611555, -604678, -587332, -568872, -574223, -587907, -593812, -562503, -562615, -582624, -596808, -584141, -547609, -526183, -520022, -531540, -532405, -539297, -564836, -571681, -563939, -536018, -509819, -557147, -565823, -578443, -590308, -601541, -607278, -607519, -609273, -602389, -620063, -630059, -628436, -587804, -528265, -581431, -606019, -603363, -585006, -578099, -563702, -565326, -604131, -603913, -617131, -601345, -583006, -585646, -591876, -555537, -527036, -562489, -581286, -571469, -586226, -590568, -575612, -576201, -576867, -590219, -588551, -568868, -553453, -562957, -580353, -565843, -554302, -527533, -523941, -542665, -544580, -555707, -557503, -554687, -575340, -601232, -599630, -599381, -600322, -581852, -566232, -578242, -588560, -567431, -570443, -551598, -551824, -569198, -573178]
6797e73178k32j1551k3920k5786k924k0056K8367J7499L3246M20m044J0980p156
6784e78335k155k0592M976N1737K9995j9896q398q733J5542p741k4084m5584K1204
6771e92064N430R399n053m296K2321n986N184q712j9601j4121K846L3111K946
6758e68596R186k5131k364j3940J1317O399K3735q386k2244J3084L9186O187n4353
6745e85920k9931P453N1022M8747j0342l7304l9827n108J664J4174L2812K8434
6733e24126j8753o457k9773m378K2123K4643P2o325j3507K157J9232K2541n551
6720e18102N926J6234k5192J537O475o1192k0933R149J9252O721j375p533m4246
6707f13279o872M1374J0755j4822q030L1885L3669J5048J2367m5063l0705L2108
$$ y = [-573178, -573410, -584961, -608881, -634667, -637591, -657647, -629280, -611781, -578535, -578115, -582159, -571179, -578335, -580490, -601082, -596106, -544369, -514374, -534270, -542668, -551401, -535859, -543600, -567684, -613268, -592064, -586634, -577235, -582288, -586584, -564263, -570249, -565065, -573777, -593378, -607499, -604653, -571542, -568596, -559410, -584541, -586905, -600845, -589528, -583129, -559394, -567780, -590024, -576940, -537754, -531567, -585920, -615851, -608398, -557376, -508629, -518971, -556275, -596102, -601210, -599546, -585372, -552560, -524126, -542879, -549336, -579109, -583487, -561364, -536721, -536649, -542974, -556481, -554324, -535092, -512551, -518102, -512176, -495942, -521134, -519597, -513122, -574314, -595247, -586098, -566846, -560125, -561500, -569033, -613279, -620151, -578777, -568022, -582844, -590874, -558989, -525320, -510272, -497905, -542968, -573673, -541565]
6695e41565j9926j6520J4936k1566k0739j71K3751j5867J8871k738o862K8486
6683e59910L2716M4294m6768n3391l8098o704J1004L0827j5721k6665J9071K9001
6671e80344L7303j7601J361J405p703K3738Q740j8987m001m1703k1585J4199Q124
6658e97054k856p710k8257M8193J1263r836l143J3025j0911k637P599n840J9254
6645e68910K8437J0116k6528J2173N477j6449K0953M1130m639m5523l7106O529
6633e74340K9039n183K74j6654J1245K1308J1498j9921J904j8995o932M9832L6383
6620d80542k4787k8505n7762o128J8156k638J2874L9949K338n2605m987J5364
$$ y = [-541565, -561491, -578011, -563075, -584641, -605380, -605551, -581800, -597667, -578796, -581534, -588396, -559910, -527194, -482900, -529668, -583059, -621157, -627861, -616857, -586030, -601751, -628416, -609345, -580344, -543041, -560642, -559281, -557876, -565579, -541841, -533101, -552088, -556089, -597792, -619377, -605178, -597054, -599910, -607620, -635877, -587684, -576421, -586257, -589400, -576375, -587286, -589923, -582324, -588164, -568910, -540473, -530357, -556885, -544712, -539235, -555684, -534731, -493601, -498240, -543763, -580869, -574340, -545301, -550484, -550210, -566864, -555619, -534311, -522813, -542734, -540830, -559825, -566757, -516925, -480542, -505329, -533834, -591596, -597724, -579568, -582206, -569332, -529383, -527045, -579650, -584637, -569273]
$$ [...]
##END NTUPLES=NMR SPECTRUM
##END=
