##TITLE=Analysis number 326769
Compound Code cc 63809
Book Reference 511/80
Project Code adrs
Chemist Name stevem
##JCAMPDX= 6.0         $$ Bruker NMR JCAMP-DX V2.0
##DATA TYPE= NMR SPECTRUM
##DATA CLASS= NTUPLES
##ORIGIN= Bruker BioSpin GmbH
##OWNER= nmr
$$ XWIN-NMR		Version 3.5
$$ Wed Feb 21 14:36:37 2007 GMT Standard Time (UT+0h)  MAYBRIDGE\nmr@NMR_250MHZ
##.OBSERVE FREQUENCY= 250.131544655141
##.OBSERVE NUCLEUS= ^1H
##.ACQUISITION MODE= SIMULTANEOUS (DQD)
##.ACQUISITION SCHEME= undefined
##.AVERAGES= 16
##.DIGITISER RES= 18
##SPECTROMETER/DATA SYSTEM= dpx250
##.PULSE SEQUENCE= zg30
##.SOLVENT NAME= CDCl3
##.SHIFT REFERENCE= (INTERNAL, CDCl3, 0, 16.4568)
##AUDIT TRAIL= $$ (NUMBER, WHEN, WHO, WHERE, WHAT)
$$ ##TITLE= Audit trail, XWIN-NMR		Version 3.5
$$ ##JCAMPDX= 5.01
$$ ##ORIGIN= Bruker BioSpin GmbH
$$ ##OWNER= nmr
$$ C:\u/data/dgb/nmr/ADRS/1460/pdata/1/auditp.txt
$$ ##AUDIT TRAIL=  $$ (NUMBER, WHEN, WHO, WHERE, WHAT)
(   1,<2007-02-21 14:36:17.67 +000>,<MAYBRIDGE\nmr>,<NMR_250MHZ>,
      <created by zg, POWCHK disabled, PULCHK disabled
       configuration hash MD5:
       49 4B E0 1D 92 C2 6B 37 9F E6 65 BC 52 41 86 1D
       data hash MD5: 64K
       77 DE BB 55 0E 96 92 64 27 60 5D 48 BC A6 6E 27>)
(   2,<2007-02-21 14:36:29.40 +000>,<MAYBRIDGE\nmr>,<NMR_250MHZ>,
      <Start of raw data processing
       ef LB = 0.3 FT_mod = 6 PKNL = 1 SI = 32K 
       data hash MD5: 32K
       3B E8 0E 55 43 B0 76 69 18 CD 25 FE C5 9C F3 F5>)
(   3,<2007-02-21 14:36:31.04 +000>,<MAYBRIDGE\nmr>,<NMR_250MHZ>,
      <apk 
       data hash MD5: 32K
       B0 CE 43 85 E5 44 37 9C DF 1D 49 3D 0C 7B FA D2>)
(   4,<2007-02-21 14:36:31.75 +000>,<MAYBRIDGE\nmr>,<NMR_250MHZ>,
      <abs ABSG = 5 
       data hash MD5: 32K
       F4 A1 53 3E B7 95 5B 9B 50 85 CC 31 3B 20 FD E9>)
$$ ##END=
$$ 
$$ hash MD5
$$ FA 4D 91 01 E0 4C 06 5B 3E 36 52 04 33 40 0F B4
##$RELAX= 
##$RELAX= 
##$RELAX= 
##$RELAX= 
##$RELAX= 
##$RELAX= 
##$RELAX= 
$$ Bruker specific parameters
$$ --------------------------
##$DU= <C:\u>
##$EXPNO= 1460
##$NAME= <ADRS>
##$PROCNO= 1
##$TYPE= <nmr>
##$USER= <dgb>
##$AMP= (0..31)
100 100 100 100 100 100 100 100 100 100 100 100 100 100 100 100 100 100 
100 100 100 100 100 100 100 100 100 100 100 100 100 100 
##$AQSEQ= 0
##$AQ_mod= 3
##$AUNM= <au_zg>
##$AUTOPOS= <27 >
##$BF1= 250.13
##$BF2= 250.13
##$BF3= 250.13
##$BF4= 250.13
##$BF5= 500.13
##$BF6= 500.13
##$BF7= 500.13
##$BF8= 500.13
##$BYTORDA= 1
##$CFDGTYP= 0
##$CFRGTYP= 5
##$CHEMSTR= <none>
##$CNST= (0..31)
1 1 145 1 1 1 1 1 1 1 1 1 1 1 1 1 1 1 1 1 1 1 1 1 1 1 1 1 1 1 1 1 
##$CPDPRG= <>
##$CPDPRG1= <>
##$CPDPRG2= <>
##$CPDPRG3= <>
##$CPDPRG4= <mlev>
##$CPDPRG5= <mlev>
##$CPDPRG6= <mlev>
##$CPDPRG7= <mlev>
##$CPDPRG8= <mlev>
##$CPDPRGB= <>
##$CPDPRGT= <>
##$D= (0..31)
0 1 0 0 0 0 0 0 0 0.06 0 0 0 0 0 0 0.0002 0 0 0 0 0 0 0 0 0 0 0 0 0 0 
0 
##$DATE= 1172068576
##$DBL= (0..7)
120 120 120 120 120 120 120 120 
##$DBP= (0..7)
150 150 150 150 150 150 150 150 
##$DBP07= 0
##$DBPNAM0= <>
##$DBPNAM1= <>
$$ [...]
##$SUBNAM7= <"">
##$SUBNAM8= <"">
##$SUBNAM9= <"">
##$SW= 20.6930455092707
##$SWIBOX= (0..15)
0 0 3 0 0 0 0 0 0 0 0 0 0 0 0 0 
##$SW_h= 5175.983436853
##$TD= 65536
##$TD0= 1
##$TE= 295.16
##$TE2= 300
##$TE3= 300
##$TEG= 300
##$TL= (0..7)
0 120 120 120 120 120 120 120 
##$TP= (0..7)
150 150 150 150 150 150 150 150 
##$TP07= 0
##$TPNAME0= <>
##$TPNAME1= <>
##$TPNAME2= <>
##$TPNAME3= <>
##$TPNAME4= <>
##$TPNAME5= <>
##$TPNAME6= <>
##$TPNAME7= <>
##$TPOAL= (0..7)
0.5 0.5 0.5 0.5 0.5 0.5 0.5 0.5 
##$TPOFFS= (0..7)
0 0 0 0 0 0 0 0 
##$TUNHIN= 0
##$TUNHOUT= 0
##$TUNXOUT= 0
##$USERA1= <user>
##$USERA2= <user>
##$USERA3= <user>
##$USERA4= <user>
##$USERA5= <user>
##$V9= 5
##$VALIST= <valist>
##$VCLIST= <CCCCCCCCCCCCCCC>
##$VD= 0
##$VDLIST= <DDDDDDDDDDDDDDD>
##$VPLIST= <PPPPPPPPPPPPPPP>
##$VTLIST= <TTTTTTTTTTTTTTT>
##$WBST= 1024
##$WBSW= 4
##$XGAIN= (0..3)
0 0 0 0 
##$XL= 0
##$YL= 0
##$YMAX_a= 254537
##$YMIN_a= -381033
##$ZGOPTNS= <>
##$ZL1= 120
##$ZL2= 120
##$ZL3= 120
##$ZL4= 120
##$ABSF1= 16.45675
##$ABSF2= -4.236422
##$ABSG= 5
##$ABSL= 3
##$ALPHA= 0
##$AQORDER= 0
##$ASSFAC= 0
##$ASSFACI= 0
##$ASSFACX= 0
##$ASSWID= 0
##$AUNMP= <proc_1d>
##$AZFE= 0.1
##$AZFW= 0.1
##$BCFW= 0
##$BC_mod= 0
##$BYTORDP= 0
##$COROFFS= 0
##$CY= 12.5
##$DATMOD= 1
##$DC= 0
##$DFILT= <>
##$DTYPP= 0
##$F1P= 14.0000005364418
##$F2P= -0.99999901652339
##$FCOR= 0.5
##$FTSIZE= 32768
##$FT_mod= 6
##$GAMMA= 0
##$GB= 0
##$INTBC= 1
##$INTSCL= 1
##$ISEN= 128
##$LB= 0.3
##$LEV0= 0
##$LPBIN= 0
##$MAXI= 10000
##$MC2= 0
##$MEAN= 0
##$ME_mod= 0
##$MI= 0
##$NCOEF= 0
##$NC_proc= -5
##$NLEV= 6
##$NOISF1= 0
##$NOISF2= 0
##$NSP= 0
##$NTH_PI= 0
##$NZP= 0
##$OFFSET= 16.45675
##$PC= 1
##$PHC0= 226.1872
##$PHC1= 10.02617
##$PH_mod= 1
##$PKNL= yes
##$PPARMOD= 0
##$PSCAL= 4
##$PSIGN= 0
##$REVERSE= no
##$SF= 250.130016318201
##$SI= 32768
##$SIGF1= 0
##$SIGF2= 0
##$SINO= 400
##$SIOLD= 32768
##$SREGLST= <1H.CDCl3>
##$SSB= 0
##$STSI= 32768
##$STSR= 0
##$SW_p= 5175.98343685301
##$SYMM= 0
##$S_DEV= 0
##$TDeff= 65536
##$TDoff= 0
##$TI= <Analysis number 999999
Compound Code 99
Book Reference 9
Project Code 9>
##$TILT= no
##$TM1= 0
##$TM2= 0
##$TOPLEV= 0
##$USERP1= <user>
##$USERP2= <user>
##$USERP3= <user>
##$USERP4= <user>
##$USERP5= <user>
##$WDW= 1
##$XDIM= 32768
##$YMAX_p= 478792262
##$YMIN_p= -441270
$$ End of Bruker specific parameters
$$ ---------------------------------
##NTUPLES= NMR SPECTRUM
##VAR_NAME=  FREQUENCY,     SPECTRUM/REAL,   SPECTRUM/IMAG
##SYMBOL=    X,             R,               I
##VAR_TYPE=  INDEPENDENT,   DEPENDENT,       DEPENDENT
##VAR_FORM=  AFFN,          ASDF,            ASDF
##VAR_DIM=   32768,         32768,           32768
##UNITS=     HZ,            ARBITRARY UNITS, ARBITRARY UNITS
##FACTOR=    0.157963299565203, 1,           1
##FIRST=     4116.32736359538, 0,            0
##LAST=      -1059.65607325763, 0,           0
##MIN=       -1059.65607325763, -441270,     0
##MAX=       4116.32736359538, 478792262,    0
$$ Real data points
##PAGE= N=1
##DATA TABLE= (X++(R..R)), XYDATA
$$ [...]
28422 -34887 -35815 -116661 -110228 -69507 10878 8671 33129 91378 84298 -2515 -37877 36900 151446
28409 151446 64410 8764 70882 81032 135750 168133 171510 209259 185793 188115 97546 49253
28397 49253 4461 -37500 -58438 -186133 -166808 -77297 92943 111739 4383 -59784 -54525
28386 -54525 -169691 -128283 4277 -14280 15469 125247 182512 123723 49104 87599 70295
28375 70295 121354 167839 22536 -16530 8838 -62738 -28326 -6967 -95199 -105656 -80532
28364 -80532 38124 32821 57421 114936 117556 -7656 -59666 -33043 302 67841 64934 140750
28352 140750 40963 -16127 -75273 -82188 -1074 63627 40261 -35403 19544 112359 25323 51204
28340 51204 124686 90110 269862 353816 256333 109661 -106412 -102378 4713 120160 163116
28329 163116 102565 132601 105190 145745 292339 216019 215699 223691 130313 2432 -64149 -23758
28317 -23758 -97885 -139973 -117847 -120121 -176448 -98105 35403 19285 8852 44354 97120 171015
28305 171015 77789 4300 -39969 -68217 -51522 -29783 -143142 -196102 -158595 -107283 -100992
28294 -100992 -167453 -174117 -235672 -182551 -158407 -296098 -278623 -80015 -46112 9479 65778
28283 65778 -72187 -158318 -85768 78362 103400 172060 326662 356590 188935 32148 111333
28272 111333 87358 42333 25946 104836 161882 177559 135168 118681 163847 123351 110501
28261 110501 41230 -8413 -83420 38745 88695 -99879 -255284 -297849 -186425 -43518
28251 -43518 -23141 45362 62039 146470 110730 197802 206928 32923 60659 84754 90079 91249
28239 91249 77277 -38764 -11368 -546 -44684 6725 104080 31457 -64426 -184994 -288409
28228 -288409 -320682 -163188 -19483 -142872 -188625 -23691 97162 132896 171957 165362 27250
28217 27250 2240 72712 161359 242243 273062 188503 69482 14978 -44663 -29906 -37540 -6077
28205 -6077 71158 -56499 413 113234 109250 108615 -12181 -80476 -83326 -13694 -109493 -201867
28193 -201867 -139404 -55969 23262 96353 108601 44739 -76054 -30349 15710 -11884 45362
28182 45362 87861 69618 102444 36533 -101962 -20450 73666 47038 135270 228952 34194
28171 34194 -77176 126061 387011 272053 133292 79518 41298 42544 -770 -139871 -122709
28160 -122709 -101442 100113 167732 64358 80432 50766 29908 172224 104381 -22325 -142713
28149 -142713 -191957 -117866 -72255 63993 121904 104412 91616 12066 18004 68819 -5141
28138 -5141 -51618 -52720 -103520 -79028 25987 22235 28837 -12298 -27553 -132644 -87507 100423
28126 100423 106678 116795 24172 -70064 -196130 -134509 -58827 -75628 -106303 -54731 -65843
28115 -65843 -32887 -37971 19016 691 -109453 -77962 -40606 25965 110810 80421 121503 128728
28103 128728 8395 -66541 -77354 -61375 30257 16 -138206 -203259 -151372 -24891 95924
28092 95924 62828 -56461 -39087 -49379 -15794 115659 177899 117685 30557 -15950 -31402
28081 -31402 -35910 -94252 -88185 -25778 -22359 -7517 -66586 11154 106072 63340 -41841 10115
28069 10115 52006 88032 33233 8494 38687 -4312 44993 -6664 48172 135491 129510 64616
28057 64616 24132 68308 97555 -8670 -112824 -32877 7159 75870 116791 17839 16050
28046 16050 -42251 -38960 -14117 18608 -77209 -97707 -29690 -93702 -120697 -121719 -49132 -46965
28034 -46965 -112259 -137558 -94076 -27002 53334 28599 4029 4776 68187 144998 234704 208420
28022 208420 212208 235475 105292 -31033 -179073 -224813 23480 120432 59033 79716 195713
28011 195713 115829 29327 79357 175807 89564 -102194 -6660 107566 87307 100193 159165
28000 159165 123706 142705 81453 194963 171482 56709 -1145 -27561 13698 8240 -17016
27989 -17016 -74504 -103212 -18040 43712 14484 -13633 -45919 29981 10906 -2645 70475 87770
27977 87770 185923 188199 70597 81332 124939 95090 -29973 29850 78245 54782 -26151
27966 -26151 -31595 -61602 10757 104336 56894 45585 87383 42581 2853 51384 45560 14686
27954 14686 41185 102420 204955 221915 169099 174789 198155 174368 2920 -8576 -1210 -112496
27942 -112496 8063 -2806 -96907 -76425 -2324 4385 87615 189786 185857 121478 3316
27931 3316 -133804 -71590 146133 221865 28506 -83320 -41838 -67376 -10602 67532 -31137
27920 -31137 -190024 -178353 -124235 104264 219333 185591 95915 46144 105860 100148 -2434
27909 -2434 -18319 -14816 1065 -119271 -59006 10037 51822 87189 111743 81403 127909 251508
27897 251508 256035 213744 112074 67595 1601 95965 105373 83466 44053 -18136 -44108 -69257
27885 -69257 -7203 40282 -9792 -8870 -12217 -4701 -58851 -126278 -87522 -181892 -168533 -57001
27873 -57001 6166 106102 43586 -80948 -23539 120798 197254 164672 122497 123862 -53239
27862 -53239 -66800 -1917 -32160 -106148 -7357 49128 57230 104822 54537 25088 67761 99213
27850 99213 -9134 -20517 6996 -44683 -66503 -124317 -80751 -31475 -82352 1317 -12230
27839 -12230 78581 44626 -8694 25592 33677 29301 -113697 -152857 -103655 -74880 -123796 -112628
27827 -112628 -42190 37411 108242 178789 245422 125583 -91908 -24496 117178 172510 135722
27816 135722 -58504 -162075 -86177 -3876 103130 101773 147409 184958 124906 47486 55520
27805 55520 138668 116002 -15138 -68316 -81045 -20288 16444 4114 -120297 -175275 -51050
27794 -51050 25696 113464 154822 147240 38362 49864 99149 46730 117550 26186 -172921
27783 -172921 -195605 -201463 -222019 -101472 10052 54585 92695 38443 -90141 -40563 92141
27772 92141 87621 62822 34101 42041 72910 -6417 5102 -46955 -2806 151401 122363 27327
27760 27327 53387 85302 136930 83762 -72258 -31428 -22090 -61131 -89123 95 53104 75870
27748 75870 130443 94643 63368 112511 62264 -19586 -32853 -21316 77928 122267 115729 176006
27736 176006 101364 18825 -87030 -123991 -32567 -21595 -56474 51129 11793 -65880 -109700
27725 -109700 20515 103346 87987 68665 25029 -3760 -42656 -112193 -134002 -84607 -24282
27714 -24282 -61351 -22311 -67362 -73909 -22682 139103 165647 133331 77768 -5218 96555
27703 96555 116639 80855 46162 37572 13820 8431 56079 31147 -3683 -56663 -97340 -65902
27691 -65902 -135901 -111852 -201877 -116498 -71165 -32268 -166056 -267113 -127792 -30267 8148
27680 8148 8915 15643 93576 26680 -6135 -9892 -103471 -30527 12804 -20716 -74623 -88985 -81878
27667 -81878 -101036 29574 114645 175427 97149 71419 184392 62718 -36471 20435 65421
27656 65421 133797 127935 613 -4457 -60699 -85305 15114 105406 199625 174703 76860 110758
27644 110758 -13503 -125737 -105437 -117471 -3979 162608 206595 92800 43671 -126762
27634 -126762 -150994 -107777 -31971 -42848 -47274 -21867 -51313 -44177 -114107 -160484 -176625 -131743
27622 -131743 -118252 -39458 50640 55817 -26382 -89830 -4992 12529 -49474 -67435 -145202 -28353
27610 -28353 106078 153865 147877 94746 61467 51215 187874 276306 249532 234815 284160
27599 284160 262803 179122 162412 149304 150515 222932 207366 152060 56627 104421 185478 239399
27587 239399 238209 146160 112165 59594 38393 44585 -30299 -138690 -109833 -208159 -199077 -121661
27575 -121661 -39242 -46564 2896 60726 100353 297181 171755 20032 -14529 -37321 26383
27564 26383 5464 -71281 -56983 -67085 -85850 -25824 34204 15247 92767 127380 72907 51376
27552 51376 70740 110094 115004 98596 -90138 -75995 -54589 -14840 48940 28705 -178819
27541 -178819 -97248 -27516 -76762 -45798 107678 62945 69169 98534 17425 24211 31835 947
27529 947 92105 79552 -33231 -91592 -82657 -32500 -110146 -120979 -113326 -126257 -108231 -18142
27517 -18142 30169 -56629 -195491 -254461 -150870 -10443 -21669 20696 -20566 -47287 58787
27506 58787 181619 160605 62695 84184 190043 167727 180538 152780 160804 15095 -60580
27495 -60580 -82038 -121540 -176819 -255563 -231945 -167726 -257467 -255791 -271665 -145688 -18672
27484 -18672 15090 37037 -33241 8896 -11600 -101358 -34565 -8321 -2374 21728 17732 -126578
27472 -126578 -192359 -95024 99297 145287 84227 73274 6673 -13737 52248 -76662 -177208
27461 -177208 -136210 -11863 21553 -42111 7646 29721 -37909 -78470 -76150 -54176 -10807
27450 -10807 -21307 1844 49322 17527 -18952 16145 127793 127258 -3117 -77576 -20754 -41084
27438 -41084 -126264 -162421 -255217 -235902 -8862 193043 202988 264350 333117 396741 305130
27427 305130 194100 193239 223105 235742 229530 207261 169918 28084 -119038 -51643 25595
27416 25595 -17541 -74974 -81736 -206748 -130142 62815 10654 -90750 -14001 97154 67335
27405 67335 -15552 -47931 30961 115936 80600 12121 317 37935 17120 47615 53290 -2352
27393 -2352 77730 164834 185837 103184 40666 -40476 -3699 -43290 6951 124749 130489 107946
27381 107946 130850 153305 44802 -9891 -63469 -115206 -116425 -127636 -69147 25792 16747 -76533
27369 -76533 -68111 77296 34716 3544 92708 92782 40550 -48653 115490 144194 154254 65819
27357 65819 67202 45406 70257 138140 182697 186695 192785 258892 241512 204119 104315 -5113
27345 -5113 -60199 -211815 -299250 -419205 -280466 -115443 -57254 24528 37347 -71889 -79911
27334 -79911 -172761 -213387 -236114 -264165 -155728 -40768 -108347 -13847 -36121 -46867 -45800
27323 -45800 -74534 -109542 -204842 -183254 -77888 25610 113043 107763 66985 -34052 -79426
27312 -79426 -154458 -186352 -144591 -142886 1234 74066 -41355 -206134 -123913 -151233 -232873
27301 -232873 -230263 -238457 -192393 -144001 -37612 9627 10772 -37778 -47873 -12934 59388 40017
27289 40017 -75969 -221295 -263966 -102515 24185 22286 -68897 -78115 -84067 64981 76584
27278 76584 30460 -16630 -20401 50396 103885 86550 -44630 -127933 -37094 81410 -37087
27267 -37087 -32593 -15310 -2125 72216 112150 172584 102017 124086 223817 248760 192080 138261
27255 138261 201400 178081 143570 48772 89523 76226 69283 -8417 -83813 -95428 43578
27244 43578 107073 -8077 -63322 40408 36911 55844 89184 71680 -22139 37916 61276
27233 61276 26959 106445 113700 68109 19397 -19467 14505 -8738 -51439 -93558 -90898 -155155
27221 -155155 -80553 -27521 -63721 -49483 -109562 -179941 -141637 19407 204268 314967 232659
27210 232659 7249 -17360 -17204 -4983 -107455 -177403 -125146 -138044 -146540 -89514 -32380 -72236
27198 -72236 -131684 -136483 -28363 100883 65507 92311 43912 -34985 21010 81637 118455
27187 118455 28310 -904 63534 95376 47513 -287 -73405 -53991 -58369 32424 147553
27176 147553 108413 -2347 -18984 22746 -49599 -143006 -2717 84208 87931 24268 -24567
27165 -24567 39713 147204 106766 81412 -4746 -136555 -107189 -119736 9792 17292 36875
27154 36875 55179 54834 36074 -59556 -58732 -114564 -50622 -14289 77239 18271 14067 18217 88192
27141 88192 80923 -46061 -146981 -223541 -253687 -230318 -179350 -103219 -32680 42649 -36086
27130 -36086 -108481 -226499 -207725 -110133 -103590 -226585 -202674 -212828 -102266 -117059 -102941
27119 -102941 3524 71413 26734 4505 -49619 -38507 57634 65613 86270 126158 55951
27108 55951 9516 54013 59537 122008 176321 256267 200117 77575 -39073 -92745 -15135
27097 -15135 -146119 -201073 -103479 -66097 -73702 22711 112781 110423 75195 24597 -80166 -24421
27085 -24421 70036 101156 202531 200978 119062 58281 -11097 25895 86420 132182 87964 25292
27073 25292 1485 75795 226335 201812 98345 8167 62710 195575 90700 62822 121776
27062 121776 51573 100571 131451 168224 203417 49869 -180466 -207738 -109419 -87920 -119758
27051 -119758 -134084 -135963 -56059 -92452 -104797 -98476 -278 118707 55686 -71672 -44237
27040 -44237 40603 -22338 -142785 -190000 -94807 41541 172726 188226 188446 189542 162142 134317
27028 134317 193496 174728 177188 215539 195678 121916 19940 -53515 -98345 -74005 73152
27017 73152 103937 117666 96581 117890 14311 -66784 4646 42857 45976 52366 -21254 -52276
27005 -52276 -53320 -16449 122817 95759 26000 16565 -56790 -69793 -17323 65138 81052 75488
26993 75488 -23234 -19122 86530 179878 146921 79439 11573 -90228 -197653 -196456 3149
26982 3149 101112 1045 22386 52457 -2407 -56194 -123475 -88377 -57183 -33159 -47445 9671
26970 9671 7560 -95188 19779 153569 -45887 -16812 -33486 9516 -2003 -818 11379
26959 11379 -55353 -1662 91962 196911 94870 -64465 -99719 -78820 -189863 -52639 4182
26948 4182 -3550 82391 157158 192213 69679 27511 -51889 -176660 -168714 -143905 -93350 -30930
26936 -30930 -56961 -87166 -84253 -89438 -176874 -169847 -53439 -18525 -15832 -1625 70880 62357
26924 62357 -130661 -142156 -100527 -13956 57753 5266 18555 27762 -8917 -66019 -144174 -129726
26912 -129726 -13646 83718 239929 165017 9964 -182196 -216503 -240398 -157409 -66878 18945
26901 18945 118147 38269 -1861 89121 103207 23544 -99474 -90196 -7757 82520 204570
26890 204570 125942 78460 183229 161177 181975 219730 267366 222907 104539 13325 -37330
26879 -37330 -148548 -249921 -192006 22016 141312 108688 76357 63689 -44428 -75951 -43062
26868 -43062 -17128 -9952 -79881 -78490 -44712 -134746 -262141 -176636 -80949 -146666 -127904 -145443
26856 -145443 -154849 -135682 -10793 -57467 -121897 -21568 55685 78521 13472 -60619 24163
26845 24163 -1004 -85884 -179228 -137000 -88020 -35899 13137 6597 95557 91249 175105 191735
26833 191735 -34182 -123063 -41730 -39335 113894 76511 -87295 -142737 -38661 -22138 -48085
26822 -48085 86823 98101 501 9172 32908 30150 86997 99355 31388 47393 18849 109475
26810 109475 133618 138728 74838 54796 135498 76955 22699 -71734 584 93822 156750 109289
26798 109289 -58237 -53647 -75596 -76250 -78460 -75424 -46798 -96828 21437 19074 48513 83220
26786 83220 84524 108697 18631 -44658 -18804 17732 85935 80953 201421 217296 212451 60456
26774 60456 -51780 8613 81568 70657 -46342 -181023 -211957 -133171 -112506 19033 113349
26763 113349 210662 260676 175238 36314 29373 96957 74799 -1523 -100632 -139890 -142802 -184482
26751 -184482 -85256 -38846 -60588 -62502 -67719 -139240 -196615 -95589 -48954 -50771 -61528 -23957
26739 -23957 -8874 -101821 -48460 -21200 -90666 -145760 -78229 -2465 44179 72717 37322 -2350
26727 -2350 147585 214858 144356 18732 -37406 -28064 2213 -35829 -32638 -22564 -113259 -196759
26715 -196759 -147869 -11661 72307 124950 59089 -45050 -134676 -136011 -202193 -127769 -116947
26704 -116947 -62011 -48760 -69508 41732 100261 105657 -11221 -1426 31576 17146 69922
26693 69922 52456 -39072 -18515 49567 -16047 -48370 30451 35835 20642 21852 -84282 -178637
26681 -178637 -160038 -98912 -143970 -147191 -167696 -87336 -118860 -250974 -245302 -223550 -250191 -84829
26669 -84829 91075 48158 -26889 1445 41294 -104226 -84156 -17853 22604 102341 238027
26658 238027 172227 133809 166245 146558 -68712 -109379 -141606 -168755 -48173 -11657 5493
26647 5493 -77325 -136994 -31224 -30801 -8270 55770 74952 99811 -17635 -76388 46989 45939
26635 45939 148696 239325 185714 80238 100431 63365 -49159 -72243 -107910 -152605 -141215
26624 -141215 -40825 -46754 37070 29667 154949 95482 21842 -115546 -47589 -5841 5369
26613 5369 72527 20259 -103975 -186431 -107521 -118278 -69787 -8303 -129586 -83410 -58286
26602 -58286 -138859 -82224 -105330 -283010 -227814 45565 107480 43578 60282 64997 32892
26591 32892 70439 108201 205440 142411 52086 984 331 7161 31501 135418 111569 106635
26579 106635 89313 80247 235342 306700 237504 250792 220097 95990 -79976 -68917 -67205
26568 -67205 -127272 -92255 16517 117225 101857 29066 86624 166644 218704 138123 17171
26557 17171 146705 153931 85660 91819 212171 278747 333318 292290 210945 188184 21019
26546 21019 32889 82769 110661 15882 130516 38013 -162642 -161657 -67478 -107339 -90956 -26455
26534 -26455 16855 -222 -14268 -29659 -34313 -45167 -110426 -59445 48918 99571 131498 97360
26522 97360 54022 104399 191283 181665 -6403 -14049 88560 27721 -49302 -76991 -30837 -17931
26510 -17931 -36520 1854 63503 68847 115369 148910 27808 22927 45510 -32117 -31912 -72518
26498 -72518 -146321 -230016 -116356 -74975 26228 -8682 -148139 -209906 -177981 -72608 -35174
26487 -35174 -73302 -230390 -278657 -99455 -71289 -92202 -112761 -14072 -88763 -114831 6776
26476 6776 71549 207752 73115 -63233 -121432 -53016 -13534 -10392 -4552 29271 3995 37410
26464 37410 -36144 -80372 -77116 88732 202919 214147 337009 337089 177963 90237 64552 -33119
26452 -33119 -32937 69652 67042 102011 128400 64232 -105863 -123222 -153395 -70272 47809 37629
26440 37629 113993 114831 -18132 -147700 -180665 -144318 -31724 -9525 -137072 -168040 -80954
26429 -80954 -98995 -67377 -88682 -42064 -22095 -8177 -15161 -157533 -157607 -136756 -82727 -68694
26417 -68694 -61343 -81738 -55959 10906 38948 48079 112521 163980 154691 136665 80850 8113
26405 8113 16904 43742 -23389 3521 11993 -62420 -64111 -49570 55074 104510 79539 133159
26393 133159 66928 86041 13150 -71329 -32096 98593 199659 195672 175060 259786 190313
26382 190313 145159 137007 104227 146181 233176 196961 236654 232940 146845 81041 -44429 -89939
26370 -89939 -98352 -28288 -6379 -28482 -56248 -78497 -31909 -99597 -129933 -20316 95038
26359 95038 -40109 -111727 59819 117875 182808 173232 128279 104343 80531 51327 -3675
26348 -3675 -154618 -172365 -182188 -130070 -88194 -43562 5157 -7838 -19689 10127 -53512 -70961
26336 -70961 -35097 16420 -2128 15032 56209 119323 210304 179982 205784 151562 128080 134555
26324 134555 107861 50105 -63919 -106196 -72783 -29866 43114 64755 52359 108612 109860
26313 109860 131152 79359 112968 105322 31933 24721 49057 73761 78709 14063 -189 -25883
26301 -25883 59370 20791 64671 213136 243627 173640 73578 101252 29805 -29813 -54579
26290 -54579 -46036 -51336 17425 -34118 -131156 -10601 117478 178860 89682 9712 -25761 -98409
26278 -98409 -54647 113157 71294 97984 193372 176829 92835 87090 65708 58274 54858 45748
26266 45748 102672 114736 122364 185161 135026 127450 183847 291333 253130 112661 31861 105593
26254 105593 165661 165745 84015 -66316 -150269 -95162 5578 -18757 15964 55882 123573 74428
26242 74428 -40381 47598 35314 69463 209642 100592 70603 90974 26653 4430 14674
26231 14674 116004 108689 101382 79924 151550 167388 153599 56778 130176 167670 219072 179623
26219 179623 114940 37984 -28247 -7911 -806 67437 1195 -48317 11490 -8666 57143 41120
26207 41120 95656 85978 134736 7481 -11206 22598 -110949 -118803 -168479 -116417 -74115 -109150
26195 -109150 -144158 -201732 -170998 -50571 7192 -45953 -86889 -84368 -46412 -122345 -114617 -69220
26183 -69220 -71069 39651 135540 85889 109312 46455 23883 -48509 -132668 -114904 -84225 -36075
26171 -36075 -73023 -51795 -40741 -67777 61764 60332 14140 26659 7254 69758 95890 -17869
26159 -17869 -45006 98422 117080 122233 69436 28460 125445 121970 102668 -35018 -67294 -70026
26147 -70026 -12976 -62621 -176372 -186512 -115533 -48651 -63510 -117031 -84286 -124249 -42822
26136 -42822 -16542 -69269 -138536 -152767 -63453 -12490 16459 -63313 -155310 -50666 104988
26125 104988 58326 -24317 -26815 160038 218310 221837 149875 128812 24189 25885 25214 -16577
26113 -16577 29389 49070 30025 -61902 -71523 40640 118212 73323 33172 98855 123067 72281
26101 72281 62130 -3688 16764 -30574 -28344 110993 94971 -71919 -214410 -183706 -129357
26090 -129357 -105623 -45791 -177592 -244909 -155753 -89637 -99845 -152338 -255268 -206532 -157295
26079 -157295 -111453 -33712 40743 64612 23319 -27961 -18555 13351 14729 24187 47440 48533
26067 48533 -38450 6298 -29095 19356 70937 114487 105219 81635 8990 -56347 -31709 29891
26055 29891 -21266 -17826 25036 98019 73108 -13631 -149749 -230550 -183674 -102590 -79807 -104243
26043 -104243 -108805 -165187 -85944 74136 53858 193902 188155 43778 20306 -21429 -136342
26032 -136342 -125809 -58564 -61177 42828 -46859 -19879 31760 -5536 -141610 -119669 -116935
26021 -116935 -125536 -121876 -58646 -2410 49360 149946 31447 -100946 -73321 -23637 -62409
26010 -62409 -68018 -103247 -42652 -30467 -90906 -107002 -220726 -175258 -224083 -140266 -90718 -102987
25998 -102987 -164805 -265345 -259909 -166090 -136803 -122755 -95758 -194959 -185028 -153531 -224660 -297099
25986 -297099 -215498 -61329 -1621 26533 -21982 14173 -7292 -26070 -67705 -969 27755
25975 27755 83242 67726 16813 -51932 -89593 -140069 -190264 -221774 -119142 -60720 -1106
25964 -1106 148685 225388 58115 -82643 -16124 33562 41923 -15042 -125513 -214528 -164673
25953 -164673 -159955 -177712 -46275 30363 104593 182697 156687 64552 39591 -37760 -30355 -6164
25941 -6164 24166 10344 -42444 -92440 -112075 -116312 -137017 -77452 -65147 -94304 -91665 -66095
25929 -66095 -8165 3023 3352 -55052 -79585 -22273 -26050 -54056 -36696 24135 4676 -8614
25917 -8614 -11964 -79202 13340 52206 127551 41209 -34226 -124137 -140185 -73576 -45470 -69624
25905 -69624 -10385 14261 6643 10793 37850 128104 118035 87138 99996 139735 146528 200323
25893 200323 107373 113429 10629 -114715 -111978 -80947 -34680 107632 112021 172943 102917
25882 102917 69711 30373 41798 25247 -80253 -136792 -105296 -4301 -120691 -262887 -232250
25871 -232250 -150997 -67560 -12770 -5378 41305 -21036 -8339 -71756 -78941 -155820 -291110 -299871
25859 -299871 -157324 -110518 -108731 31620 -78654 -215685 -217817 -132523 -64813 -7615 -18116
25848 -18116 -18908 -89281 -58118 48323 -95765 -5190 -586 -90894 -3518 133636 118994 42362
25836 42362 -12836 -7662 -73912 -59352 -17587 -23608 -153887 -181491 -116531 -33359 27648 10603
25824 10603 -73808 -94516 -27341 -32608 -57484 -18827 36944 52021 -39973 -37547 -57374 -50859
25812 -50859 -96196 -47124 154345 159268 15675 -19912 65513 51151 115439 28546 -79522
25801 -79522 51103 17371 -4530 66617 69501 -35119 -66497 8270 130279 225528 189134
25790 189134 147910 131343 53965 -13333 -69394 -7683 143519 72641 4190 5925 -17519
25779 -17519 -68781 -74442 -51991 48453 206678 219105 67932 -794 43476 25388 30329
25768 30329 -13588 -113485 -90785 23058 105055 137227 89671 116838 114918 110558 42089 40143
25756 40143 -58102 -188361 -135823 -104537 -17794 111727 52625 8437 42329 -86913 -123798
25745 -123798 -109447 -72804 96258 138118 69103 -47110 -63947 -78353 -73260 3677 -8862
25734 -8862 -4306 -7345 16072 74855 7982 46477 103396 156604 104323 172071 158985 13657
25722 13657 -45690 -49016 5114 6348 -55599 -167092 -143159 -5385 25384 20607 -45055 -70323
25710 -70323 -86349 74107 -18649 -19997 35487 168645 130501 111287 32631 -9549 -62325
25699 -62325 -118076 -93771 -122318 -75265 128 126185 45794 -22969 -92817 -14265 15515
25688 15515 91675 97762 -62475 -185814 -113937 76315 28693 -89417 30323 27975 14750
25677 14750 18652 93121 33247 -100211 -86972 5550 30194 4688 47775 64645 3411 -77864
25665 -77864 -12720 113308 178978 156999 110143 7238 -19607 26415 -118276 -146884 -182169
25654 -182169 -236047 -215560 -106312 -77760 -40659 -19566 29677 133895 142534 65188 -43087
25643 -43087 -56788 -79483 -72358 -48487 27729 150563 117053 -6724 -141671 -159389 -44393
25632 -44393 -95697 -78713 -27739 -26071 -118974 -155733 -148457 -116405 195582 331313 208966
25621 208966 98249 70383 -17998 -109071 -163281 -10652 54602 -13079 -82413 -66119 -57999
25610 -57999 -78145 -84580 -22332 -81312 68531 140963 60424 1090 73003 -114554 -189433
25599 -189433 -115230 -102305 -144839 -189338 -142404 -152182 -110133 49272 127771 25095 -29601
25588 -29601 46212 77240 61567 -8040 22123 117458 66981 108293 57901 -99635 -132556
25577 -132556 -213102 -144504 -100324 -28657 -31229 69758 61453 16217 55270 88257 28851 -35876
25565 -35876 -44517 -68472 12706 60501 120715 169999 94286 -50106 -111254 -170433 -147602 8207
25553 8207 -71013 -113094 -22890 -43646 -101211 24119 69782 -27566 -35016 -71890 -10452 15302
25541 15302 -82904 -99834 -169980 -221907 -100271 21245 -22685 29077 20173 -61998 -119398
25530 -119398 -167753 -214015 -98602 -142450 -182531 -51577 76106 -2909 12884 -41792 -49030
25519 -49030 -119570 -189530 -145118 -181505 -194056 -113680 -45061 48819 55058 16162 -34164 1249
25507 1249 56944 145002 159630 96864 -81237 -16586 117399 11667 -106573 -162416 -101304
25496 -101304 -87072 -119307 -134927 -173405 -11785 92521 118398 102441 97254 113449 82860
25485 82860 81986 56130 -24326 -111474 -49083 11977 23930 69262 34842 -39068 -4044 -72393
25473 -72393 -169383 -79582 -141462 -128267 -1314 127718 37838 -20884 92992 194136 163002
25462 163002 166090 237996 225160 270976 253560 157037 69840 61437 111878 111119 197073 105414
25450 105414 70084 69801 109705 -4347 116844 209648 225937 117118 13798 65548 151075
25439 151075 174965 76667 -5069 -26927 -129756 -117294 -78007 -94900 -7012 135177 108081
25428 108081 37536 -20657 -83286 -181710 -249733 -178811 -160543 -209107 -148769 -55702 -115213
25417 -115213 -45509 -52187 -155738 -108229 -176370 -169225 -48019 47373 21681 -8439 58013
25406 58013 62940 87421 31757 36274 121512 157215 59679 33625 -144214 -268159 -230609 -65417
25394 -65417 1621 18357 78093 35604 -30244 -105813 -143037 -173368 -74757 -55452 3397 89729
25382 89729 36005 -43207 -25419 -54569 -94737 -105507 6556 19155 -144209 -221505 -173693
25371 -173693 -110524 -78370 16962 -45137 -244055 -314330 -218988 -150694 -80322 -97850 -56710
25360 -56710 35783 162426 101625 -23352 -89058 -180923 -123368 -170635 -113194 -6899 -65690
25349 -65690 -56966 -4086 121298 36334 -152568 -95480 34724 48725 10490 -117334 -233242
25338 -233242 -331352 -350996 -248738 -124076 47629 61194 112414 24558 -66236 -134637 -197240
25327 -197240 -199766 -46311 120618 66161 -65573 -18594 42569 -108496 -90892 -34335 57201
25316 57201 41896 40671 100555 156252 153447 109381 55697 -38529 -121387 -211397 -167904 -79806
25304 -79806 -164657 -344887 -311557 -167572 -102216 -167209 -183281 -94792 60192 92489 116838
25293 116838 103537 5759 -17389 19792 -81501 -118526 -33677 61284 1817 118998 155775
25282 155775 103392 84064 106562 237000 238784 178443 58568 8825 7596 -30016 37124
25271 37124 -20884 -38006 -94676 -149048 -19434 47358 64581 75893 -24314 -192253 -212670
25260 -212670 -123159 -18833 50667 50064 -23682 -53954 53912 111873 160824 81529 -15365
25249 -15365 32320 107281 177645 155049 232306 260364 283238 227641 212548 189091 147884 95476
25237 95476 30272 -81429 -79786 -173810 -98018 -35907 -86431 -113744 -146184 -145636 -204756 -97741
25225 -97741 -14887 -38041 -89574 -37501 -1043 -23723 15665 90704 147059 80893 -35449
25214 -35449 -52677 -175180 -143911 17153 127771 57305 29667 10949 81784 129125 86079
25203 86079 20876 -79711 -185259 -171967 -304504 -280216 -206779 -210344 -243141 -260366 -142628
25192 -142628 -193836 -269146 -118914 71429 63708 8125 32016 -21853 -112466 -169429 -107265
25181 -107265 81891 73543 45930 60068 147296 121522 68559 120878 149487 120173 149994
25170 149994 115051 107202 106816 144899 91702 44027 70812 40590 -4114 -102241 -90351 -100923
25158 -100923 -150295 -162959 -124143 -27393 -19904 -30884 -59027 -98207 -86559 -28151 23024 90448
25146 90448 89872 45721 -7952 -47530 -151959 -111391 -71769 16258 88343 77800 77165 137677
25134 137677 178827 199114 64359 28910 50428 75235 100515 39646 4388 8868 99936
25123 99936 158024 196790 215394 162503 45796 -41205 -92842 22850 74621 -9654 -28694
25112 -28694 -2544 10875 20798 31230 95226 136102 80843 -63146 -123728 -111157 -103023 -16314
25100 -16314 63501 70139 23330 6681 63399 44685 1843 -17841 5089 99925 180811 97106
25088 97106 35381 -36911 -102607 -179829 -290055 -143566 -8637 52364 42121 -111120 -90440
25077 -90440 -32168 17108 -68339 -69591 -296 70321 -21002 -42012 -36860 -11861 116370 182870
25065 182870 97771 -44130 -31635 -6523 9851 126927 138894 79599 68731 57853 77731
25054 77731 24388 21284 141758 119896 31249 20068 75668 101932 182683 142959 67363 84219
25042 84219 72705 46317 52522 11149 -122427 -92642 -54887 -80123 -124950 -35334 57399 52464
25030 52464 -31297 42637 -23064 -113803 -63719 -35633 -69167 -23709 -5423 -109160 -220575
25019 -220575 -315838 -293538 -201540 -106574 -104207 -151748 -118581 -68780 -34530 -56770 -35074 150855
25007 150855 189548 129147 60767 35877 -25421 -104867 -22090 133417 144637 65656 -35354
24996 -35354 -40259 -142437 -139338 -63074 -110967 -58085 -98752 -145673 -6726 40659 19577 103705
24984 103705 28729 -83246 -130291 -161450 -112796 -24086 25323 148658 99413 44642 -377
24973 -377 43068 149293 128860 27910 6861 -19832 -38218 34360 134956 70750 110926
24962 110926 156719 67948 2387 5562 57358 64265 28831 457 -20006 -28816 -50622 -40490
24950 -40490 -6998 -154231 -164158 -34537 -111607 -90022 -67017 -187093 -178948 -193517 -115587
24939 -115587 -176699 -177745 -6152 -43030 -16714 123701 169525 240791 295892 188901 37356
24928 37356 -46968 -105479 -191595 -193837 -175552 -94172 -37298 131597 94044 41757 -18752 -39030
24916 -39030 35208 36223 -38239 -44152 -80885 -183092 -136094 -154016 -176209 -78126 -88215 -132235
24904 -132235 -93545 -27718 5769 91547 176645 174390 153718 56581 11147 -76690 -36221 41355
24892 41355 192612 170219 89746 71140 -42297 -92389 -114556 -72412 -31713 -67338 -258855
24881 -258855 -215810 -117322 -83334 40060 107623 185736 155106 136319 75873 177550 248009
24870 248009 295324 285986 238299 203216 185818 215635 205457 205751 207455 44633 9091 64802
24858 64802 186554 166574 66780 21446 40026 30104 -96669 -48087 73113 55414 80774
24847 80774 44287 5480 61977 56523 51312 44740 -92353 -136992 -107173 -72155 -163796 -42607
24835 -42607 98624 141194 174878 65480 -83943 -156346 -41154 66895 57962 9496 -37864
24824 -37864 28413 74574 -81973 -100622 -100131 -151722 2483 69114 117 8048 79803 28146
24812 28146 16147 47640 93236 -26263 69231 67336 4622 49325 52727 68699 55978 -41006
24800 -41006 -152072 -146003 49086 153809 97053 107841 33828 -22829 -20984 63536 58973 84622
24788 84622 42756 8301 73927 23188 -63885 -82291 -41548 -50429 -74369 -63335 27532 52701
24776 52701 72413 14701 -33866 53444 66790 136798 43329 -21261 -117980 -23914 151979
24765 151979 163752 -21276 -102631 -27628 24257 63338 57364 46906 -21388 -32398 -13940
24754 -13940 -26033 -102827 -109695 -30881 13688 66977 9648 23966 10882 -114769 -144219 -110440
24742 -110440 -108385 -134280 -69706 -3730 32214 -46234 -129549 2964 92598 108463 55485
24731 55485 34417 35326 97003 108398 28450 27071 -10364 -14544 -71105 -16468 11701 25798
24719 25798 24144 -35903 -22162 112746 83489 -12208 53672 180398 133884 76873 109562
24708 109562 231294 280528 158184 106297 155284 150986 36712 -43533 2819 -110214 -29139
24697 -29139 153218 244706 221192 250646 296979 132729 -17718 74006 104863 -44026 -80352
24686 -80352 -58141 2141 35158 -22484 -58943 -31266 82560 66933 100759 51429 85977
24675 85977 48602 -8636 -63612 -83334 5289 118079 30757 -63759 -147373 -34549 37851
24664 37851 17389 45996 39701 -69114 -117593 -122253 -176953 -195675 -228315 -233078 -107977 -3570
24652 -3570 -33258 -65247 -156476 -104518 -53078 -41551 19015 67164 -78196 -77404 -98474 -56777
24640 -56777 -108089 -116469 -18166 -985 -30719 -9235 105939 65357 -109251 -135137 -26397
24629 -26397 121159 185490 122961 -60956 -70862 -180792 -142793 -86758 -78466 84448 216422
24618 216422 284850 178854 239309 254448 201190 122154 166932 203428 214751 114459 -18035
24607 -18035 -24768 30475 61504 11974 91179 65936 -53331 -110925 -118988 -119091 -21990 54908
24595 54908 73212 50660 51720 48440 -9723 -41184 -91045 -27237 -65753 -131949 -104767 -19518
24583 -19518 36981 120969 82832 21974 -1443 -46622 -59271 33673 113347 5530 -23890
24572 -23890 -28550 -84294 -12011 68483 47021 -102833 -44948 -45316 -12864 -19863 -26257 -98867
24560 -98867 -79405 -61035 -31292 12434 1554 -168309 -204229 -217136 -196800 -185516 -220055
24549 -220055 -280931 -270152 -300961 -243759 -57154 -67433 -107502 -45718 71531 42635 53679
24538 53679 41353 36931 41951 10017 116112 111959 137059 125176 65942 8371 -77170 -216862
24526 -216862 -145538 22938 190814 145168 25213 -8341 40215 8450 -41809 -94973 -146103
24515 -146103 -144929 -95609 -10220 39428 154023 98260 40390 -66778 -4106 51668 26530
24504 26530 14145 4427 7313 84348 107344 -51302 -180115 -228396 -108562 13299 -10367
24493 -10367 93287 140217 86186 -62154 -127311 -119460 -149193 -118988 -186482 -143403 -24318
24482 -24318 -116871 -172110 -123523 -209658 -253268 -108729 86201 145134 87789 107683 139689
24471 139689 245073 225150 188769 205135 203708 163135 146450 148003 5742 -113878 -144926
24460 -144926 -116779 -159409 -136973 -31534 -64464 -120366 -79979 -18050 62085 9424 12202
24449 12202 -21519 -26836 -6959 11327 33961 44218 45661 36997 27597 -52819 -157287 -130441
24437 -130441 18738 147007 163788 93299 54578 216160 171239 117121 15779 11042 -9583
24426 -9583 -107308 -153543 -176214 -11483 78546 26057 1247 24275 28527 22811 39856 -65251
24414 -65251 -151557 -115378 -62847 -27816 80679 125287 51069 117008 162583 -34367 -101490
24403 -101490 -81116 -11631 34397 -32329 -63392 -3354 60113 29471 9804 83713 117677
24392 117677 102561 77989 -32715 -79359 -84286 14358 160503 135470 65284 41665 -15897
24381 -15897 -26321 185262 89648 -683 -24162 22887 48613 85125 4882 -78499 11453
24370 11453 -44780 -199880 -243341 -142628 -80127 -39778 -99019 -64347 -68122 -7036 -4871 34644
24358 34644 36316 50507 135328 132079 28569 90585 21239 12865 -5510 -4789 160556 81621
24346 81621 -34744 -71222 -87260 6432 92490 27914 122784 175449 129896 39728 92493
24335 92493 128551 135881 187316 299116 305294 158984 80365 80624 116798 105835 192343 298990
24323 298990 253021 53795 -51773 -12651 -31141 20437 -58933 -154871 -96300 41527 54859
24312 54859 66454 51789 139817 227895 219712 140381 22266 29370 -39997 -200775 -199745 -116670
24300 -116670 47585 29917 -18027 -12820 30039 -94880 -183318 -104408 1295 -127990 -223844
24289 -223844 -273675 -231322 -120883 -90155 -74428 -93993 -95862 -97167 -112706 -175997 -231674 -127273
24277 -127273 -134790 -14172 88243 110028 134689 157250 150593 158063 219634 241413 196445 271486
24265 271486 216764 125397 106184 116681 123385 129728 114374 100944 119230 -28131 -85002 -138017
24253 -138017 -142166 -30041 18362 113923 184268 111661 70444 -46040 -152736 -144127 -20966
24242 -20966 11010 -24079 -34708 -169494 -272052 -273362 -110633 -120342 -158908 -10707 123099
24231 123099 19937 -91615 -123777 7167 9430 -77361 -7917 73557 153129 69902 120784
24220 120784 41069 -41446 -56512 -8101 -66883 -246340 -322248 -290053 -286587 -157757 -50611
24209 -50611 80070 201724 153898 61925 1249 -13629 -96379 -145407 -10695 67761 134930
24198 134930 74934 -15255 1668 118253 128441 76291 -104315 -160022 -16632 -46597 -162604
24187 -162604 -2987 -46077 -138064 -211326 -192841 -128125 -73348 -212261 -274406 -145978 -68830
24176 -68830 -20648 -6808 154382 143425 94561 97779 -12712 -142390 -90805 -105840 -93416
24165 -93416 -148853 -109243 -52446 -14008 -38149 -63460 -31106 -36538 -74726 -57790 -57022 -60842
24153 -60842 12656 30608 -35712 -86006 -40457 7006 -64192 -85870 -170732 -191433 -64158
24142 -64158 61506 167718 156382 -61888 -75474 16975 -18561 45261 9350 -70538 -112609
24131 -112609 -126132 -48965 -36426 63478 82163 -29095 26911 132346 -5363 -49412 -96165
24120 -96165 -160987 -137356 -158617 -72629 -10604 -109503 -116965 -97713 -11286 -59291 -79145 35583
24108 35583 82346 86021 82674 96636 88838 63254 102931 143953 3843 -50381 1478 19082
24096 19082 21946 -83832 -191301 -159269 -133249 -51124 -114156 -232086 -256111 -281646 -156506
24085 -156506 -7603 -47902 -876 174906 129726 82726 106930 149416 39595 -1768 -27881
24074 -27881 -60024 -129899 -32487 -54733 -88344 -3039 -62230 -177155 -191786 -154049 -163420 4137
24062 4137 -3295 -60415 -91660 -150390 -129010 -19023 56672 166815 59182 -51829 -72092
24051 -72092 -78884 -35203 52244 85464 2677 -52932 15148 120016 111032 33716 -76720 -78465
24039 -78465 40545 42399 86244 9861 -16797 47238 174153 102209 59186 106759 -216
24028 -216 -26877 70737 185942 167094 -2934 -23677 -94730 -43535 45778 85269 177438 177687
24016 177687 219680 176240 7963 -20544 77481 116186 83153 30881 -31418 9749 19493
24005 19493 -13346 -11051 120720 56374 20363 -96005 -57862 -63907 -83378 6306 -38141 -54782
23993 -54782 87091 155561 151735 75868 131337 156775 150090 70840 95606 136493 70185 -101490
23981 -101490 -205747 -148567 58897 162648 172347 202528 192562 53927 -36304 -127501 -196524
23970 -196524 -60573 33146 23056 -76651 -54577 19158 70835 89654 -34952 -78429 47175
23959 47175 178606 96053 9679 -31784 -73499 -112010 -138813 -120891 -89794 -129265 -74845
23948 -74845 -13816 -39724 -57737 -35301 -56318 -24682 7440 -20281 -83536 -156936 -98648 -22047
23936 -22047 -12502 -65985 -156979 -199784 -145277 -92021 -8276 -61877 -82276 -97425 -122049 -1930
23924 -1930 9162 -53037 -52499 -148285 -210823 -148717 -122306 -151454 -210679 -129549 -72070 -63239
23912 -63239 -147957 -241008 -137790 39949 101935 153569 127052 6690 -19851 32643 84204
23901 84204 184040 221694 246917 238292 173451 147792 105799 127415 71466 -12549 -22532 -134963
23889 -134963 -137628 1962 -40479 -90333 15947 108558 158029 35729 42702 122808 118414
23878 118414 115281 95038 -118836 -166951 -93359 -95170 -4644 40559 26395 79159 215070
23867 215070 215014 191959 -10799 -13527 -17618 -55942 -86357 -159005 -239549 -185927 62650 210686
23855 210686 196225 228394 85769 -69245 -50142 92831 139715 41161 -130330 -204851 -127207
23844 -127207 -73435 -23885 -27182 92 30993 -38617 -1431 -24601 35095 47269 -99999
23833 -99999 -1463 100343 142171 6387 -73505 -29649 8718 35521 -12143 -6408 67878
23822 67878 141526 53272 -112653 -58496 84214 80925 98207 32722 30609 61777 169359
23811 169359 253439 202035 179970 168339 114891 -24967 -154787 -99393 41702 22284 4594
23800 4594 62029 40503 -28509 -141767 -123418 -97517 -105935 -151241 -87149 -31048 76949 62164
23788 62164 -10189 3491 41854 -10058 -23830 -52147 -45466 -23182 -8970 -155 -45813 -119700
23776 -119700 -81561 -130934 -48115 -97506 -338969 -358454 -194794 -120262 -102198 -163859 -293308
23765 -293308 -286798 -119098 -161317 -157718 4140 216283 347663 243657 176097 69625 -7253
23754 -7253 -16209 63027 153960 22611 51552 20363 -76110 -100196 -114689 -125599 -147408 -98870
23742 -98870 -87856 -20963 27779 94103 133620 124903 170829 242239 261415 142468 63753 -43224
23730 -43224 -24319 -51764 -6880 53404 47216 72288 151743 198069 250560 210826 156780 142315
23718 142315 50927 -51272 -20360 -27267 -49671 9221 35151 -32232 -34871 42815 79706 -15658
23706 -15658 -78468 -98093 -88077 16612 2949 -43142 21854 111656 52174 -36117 -67684
23695 -67684 -15819 48913 174565 67534 -12519 52905 173548 44630 -35363 -88986 -73025
23684 -73025 14746 61261 12384 9452 40442 31812 48405 17665 -3742 13002 71958 149356
23672 149356 122906 37028 77037 134999 176057 136435 217025 235220 273858 263112 194945
23661 194945 68384 -54669 -41907 15604 -40640 -86734 -94356 -138022 -187242 -166010 -38817
23650 -38817 104668 153572 151019 233439 180524 82445 -62863 -144599 -28851 62003 37547
23639 37547 25444 -69207 11019 1030 72227 216883 210111 141809 103898 92577 117648 34665
23627 34665 -62535 -122479 -7132 -33545 -89959 -150995 -107021 14682 72807 122994 115243
23616 115243 5771 -95962 -12723 159206 165974 143489 184878 123520 31128 -45659 -16280
23605 -16280 -3055 -76457 -138615 -160296 -61883 -50901 -107379 55376 131425 107181 -38836
23594 -38836 -185717 -222608 -268177 -234073 -220747 -148511 8052 67509 103916 9749 -64551
23583 -64551 -47498 -7944 -236 -50588 -62277 -75253 -211355 -256799 -170524 -119597 113471
23572 113471 200545 41914 -54089 -37623 28113 71498 -10930 25427 102526 101878 13987 -132284
23560 -132284 -204731 -203996 -87114 18104 28162 -67866 -112510 -130412 -69369 -33588 -69283
23549 -69283 -27527 -5778 44542 -39557 15510 72183 38475 21563 73042 37669 42263 -22231
23537 -22231 53892 8315 96016 246035 211468 63709 7234 63995 201590 130085 29997
23526 29997 96975 97756 5135 84053 191454 172822 58591 82230 2669 -40053 75058
23515 75058 162750 100345 69817 56756 514 -140732 -97257 -93392 -82936 -148046 -133120 -111533
23503 -111533 -102693 -68344 -33241 -14213 73222 56750 -16946 -106289 -120592 -94502 29893
23492 29893 28558 -34429 -83457 -122082 -93148 -91102 -41003 40942 156271 182696 103172 -298
23480 -298 -103958 -77383 -109360 -67508 -38271 -78648 -49561 -123191 -119953 -119454 -174032 -195508
23468 -195508 -211712 -150478 15856 -12538 -69754 -94807 -18958 -55209 -47254 -149500 -196519
23457 -196519 -89756 10231 76719 22094 12319 15954 5135 9791 57236 56892 114288 170334
23445 170334 100148 -30323 -147773 -228845 -242199 -243929 -112546 34217 75864 8308 -99179
23434 -99179 -31444 101319 20678 -95780 -181036 -171722 -231601 -247074 -66818 41623 -19737
23423 -19737 -28009 -133346 -137050 -110959 25490 -71267 -112420 -78711 -17485 -30209 -46226 -49284
23411 -49284 -48043 12922 104720 208781 133447 -19276 -157410 -175218 -88651 54669 64057
23400 64057 81370 65647 12136 -16954 22361 108559 -35875 -21420 -100931 -106473 -38363 3540
23388 3540 -17208 9887 -79598 -61534 -85985 -157500 -230339 -179792 -175209 -172475 -217414 -64782
23376 -64782 -89970 -109148 -57150 -110648 -134893 58097 144737 106396 89872 88562 -15202
23365 -15202 -44099 42628 49157 89338 81025 50889 -101729 -370875 -298777 -104765 5252
23354 5252 12501 -129736 -164114 -99060 8057 59793 89242 80637 137359 138377 101189 116192
23342 116192 73072 -2378 69078 -43860 -101966 67326 65527 -6418 3561 -49650 -65765
23331 -65765 -133899 -52319 101001 40083 16326 60196 25616 -59489 -69348 18977 6333 -43440
23319 -43440 -21407 28288 60103 194404 128836 -5800 -63236 17737 22851 -114556 -89880
23308 -89880 27021 -71342 -218930 -47754 31778 83344 195783 215691 173887 157621 54245
23297 54245 102797 73002 -78824 -137313 -164642 -161136 -44279 -7330 -62409 -139807 -195274
23286 -195274 -35119 89035 79429 27461 24469 111865 141535 101282 22918 -62022 -74161
23275 -74161 -1336 4980 96750 121310 150854 49912 -81558 -96483 -143203 -207642 -140435
23264 -140435 -67455 -78147 -68610 -55035 2674 84445 74434 -127772 -270276 -354762 -272957
23253 -272957 -315806 -151304 49197 91862 174621 95458 22211 -15982 13012 22767 92155
23242 92155 21801 17325 38533 31663 -17515 31780 -19739 145570 132268 102012 142289 74190
23230 74190 103735 95101 129066 113653 110753 88554 -6635 10944 -82928 -118142 -241120 -206054
23218 -206054 -36865 18733 -31962 -102932 -153749 -109369 8271 14665 80380 101798 2170
23207 2170 17465 50855 34706 31431 86418 48519 -42042 -57558 -38529 55984 37624 114390
23195 114390 69258 106008 85148 -58432 -220793 -188141 -93268 -74324 -31722 -49934 -89344
23184 -89344 106453 154662 79525 137376 173458 31598 106054 161015 54004 -39824 -74869
23173 -74869 -52469 109597 254932 42549 -140612 -164586 -155197 -70008 -120440 -303956 -306650
23162 -306650 -192979 -119352 45264 210421 62372 -72670 58943 135354 70729 148602
23152 148602 128053 131970 102775 -87683 -247925 -221364 -115405 -102441 -20469 8457 51022
23141 51022 86189 54507 59211 46228 73871 80626 18234 35652 70153 76309 12586 -57910
23129 -57910 78028 108482 93862 24057 -100437 -96725 -98034 -188858 -275014 -319463 -239606 -206555
23117 -206555 -147248 -175655 -170561 -86250 -27579 -23721 -38274 -125368 -44700 -49050 -239456 -306086
23105 -306086 -237736 -231271 -137855 -101207 -53541 -168781 -244714 -83473 -48063 -104437 -270194
23094 -270194 -224356 -17676 -37192 -68777 -27926 -1479 -17232 -34203 -37454 -96454 -87144 -12515
23082 -12515 -40860 -123682 -213227 -185252 -130535 -7506 26833 -26428 -82491 -91470 -62910 86905
23070 86905 103757 182852 251261 104474 -74050 26551 461 -76437 -134686 -56014 7810
23059 7810 57063 76610 48527 9059 44189 -121315 -182330 12793 82132 95576 169364
23048 169364 161010 74487 16227 -13930 -120005 -65392 18246 82382 95 -106785 -172277
23037 -172277 -81922 -3581 108144 173164 140622 11506 25994 -71392 -104268 -89403 6719
23026 6719 38779 -23633 -146216 -111802 -94344 -104654 -153293 -72471 -51179 -124242 -31637 -53052
23014 -53052 -139229 -233756 -297602 -260213 -171662 -70944 21822 51349 -52607 -134295 -116654
23003 -116654 -68898 -109101 -174858 -257870 -208122 -176237 -131865 -101823 91101 243419 274335
22992 274335 232931 55882 -62377 -10261 36851 173201 135104 106913 75861 74550 78644
22981 78644 48357 8475 -29439 -119321 -89735 -184555 -136895 71159 137396 49953 35083
22970 35083 6920 -91947 -111879 -197359 -161189 -140851 -234378 -266851 -157706 -16226 55515
22959 55515 22982 78405 1904 -93268 -68618 18171 -71070 -120419 -8122 96273 88636
22948 88636 90190 99873 92348 -49821 9959 102464 134405 74840 -25601 -69625 -80897 -105281
22936 -105281 -97213 13893 48976 21753 -36840 -22719 -100599 -147092 -149550 -246225 -318178 -240976
22924 -240976 -104120 -43661 -147123 -122226 -58210 57245 75926 -11954 -47049 -4942 -14855
22913 -14855 -48872 -76113 -68712 -59289 -155911 -199359 -169976 -58896 106447 80509 72694 194679
22901 194679 241238 186992 191584 98506 41674 68036 152472 215281 85023 -25822 59497
22890 59497 31420 40126 -25353 36247 100745 108271 77987 10979 80376 219197 164597 23884
22878 23884 -77163 -160614 -73943 -16460 38559 73703 77624 -41245 -12012 -112539 -182769
22867 -182769 -131803 -143998 -167649 -132606 -150937 -196533 -140322 -153602 -195577 3662 -13332
22856 -13332 5091 72529 -61219 -58460 -86658 2437 49663 84802 54773 -21705 -87176 -101235
22844 -101235 -45700 -142901 -232184 -238149 -72957 -36716 -38944 49678 56367 -23115 -46009 129176
22832 129176 125997 -82138 -124912 -74380 -58904 -121350 -166718 -99628 -15404 56925 74830
22821 74830 67713 104603 189554 176777 91867 79329 138147 98474 93044 96433 105371 104824 19313
22808 19313 -27404 58024 110625 75098 -3513 18805 -79344 -106870 -51458 -49039 -30108 -16310
22796 -16310 52640 103383 115034 156029 156284 118272 -42552 -111564 -173470 -120557 -86467 -158365
22784 -158365 -123739 -107634 -163391 -160154 -105808 -106867 -153111 -121737 -95324 -111176 116736 194314
22772 194314 94842 35098 -23663 67912 54410 35153 119126 50028 -82120 -149440 -205709
22761 -205709 -157493 -81604 -79819 -35640 -18355 -107579 -174458 -115478 -76743 -106800 -117362 -73969
22749 -73969 -41259 -165569 -274849 -196863 -15039 60526 31415 167995 284446 185766 53979
22738 53979 34408 52756 113869 151581 169237 296515 292368 244105 266044 235258 189317 106668
22726 106668 -38629 -40840 -79703 -106537 -146783 -55960 -77313 -9773 96309 -29732 -86389
22715 -86389 12546 -32932 -157350 -144426 10780 50283 66506 -11812 -51535 -65480 -132564
22704 -132564 -94097 -48540 20224 -23354 -26211 -48192 20668 93139 71100 94922 106656 -2581
22692 -2581 -94173 -93698 -33973 52933 70029 32870 3860 -23959 -11320 -41552 -37216 69963
22680 69963 9334 -46854 -51180 -18383 -1785 -38825 -18167 106578 48603 -49620 10628 -65547
22668 -65547 -170805 -129237 -87943 -26192 15345 54758 115138 95259 39865 81267 139869
22657 139869 78222 -42391 -68323 -35172 -37928 18432 151156 207653 154294 92466 107842
22646 107842 142189 -54565 -89306 -39892 -19636 27635 16512 -213 -87396 -90772 -7304
22635 -7304 86077 77744 -27874 -732 23241 -58096 -143148 -169645 -64756 76812 -14469
22624 -14469 -104632 -68678 -21313 -30804 -63497 -51723 -134696 -126893 -98666 -104183 -113917 -47562
22612 -47562 51172 38509 -34411 36173 -95173 -126600 -189990 -189260 -173010 -121331 23809 72078
22600 72078 24390 -69781 -44978 -46913 -140622 -183792 -121852 -104932 16631 122987 55652
22589 55652 -31815 70385 99263 88584 17801 21608 -29936 32619 86545 101700 26166 -5163
22577 -5163 65779 53025 49310 -105968 -98344 1124 -5455 -38645 -6007 60239 21836 20052
22565 20052 105546 102842 32441 44477 37435 40628 2146 -86904 -113479 -54415 -3607 -3416 27079
22552 27079 -36582 -11860 32647 51248 -68048 -64915 -91643 -144138 -91695 -16486 48913 -6555
22540 -6555 112248 185740 230737 133864 18199 32113 13562 -103861 -150878 -198652 -200153
22529 -200153 -137767 -13747 -70613 17711 24788 24152 59526 42228 74668 55234 50500 56318
22517 56318 -42011 -104700 -112876 -141967 -196537 -185440 -87041 -13691 47968 127945 81541 56579
22505 56579 -33100 -42209 -72902 -190016 -178036 -154942 -168529 -90618 28448 4563 -74563
22494 -74563 -66117 9308 -30524 -4168 -102728 -240614 -288070 -239775 -177272 -74759 -93620
22483 -93620 -87793 9499 60357 -43936 -73706 -87333 -112104 96029 175705 95395 34810
22472 34810 -52491 -119179 23916 54646 42925 162845 164835 -8095 -165197 -97990 -124645
22461 -124645 -150149 -117532 -168404 -174659 -154050 -27437 -21950 -26537 -98265 -207386 -117841 -26424
22449 -26424 -72192 -90119 -54696 -96876 -110928 -44248 -34949 -102411 -5856 -50855 -59983 14893
22437 14893 -96794 -121764 -148972 -117297 -134328 -81478 -85000 -48432 158643 190689 82301
22426 82301 -31633 -9447 51064 -15512 -44685 -20662 68517 190576 194799 201953 163385 88639
22414 88639 8982 55391 155193 197722 180369 -47760 -76525 32519 99269 77585 672
22403 672 -86574 -210470 -170070 -127330 -161880 -127438 -12060 30889 147513 171009 72006
22392 72006 154402 137324 8014 14870 18999 98883 205082 173247 39900 3896 -69056
22381 -69056 -49081 41502 43796 -22710 -18698 -39480 25863 110093 59669 -40750 32925 -29717
22369 -29717 -54036 -23895 64030 124358 46732 -105951 -215403 -279625 -234648 -140967 13380
22358 13380 104573 138294 128936 23642 14943 23926 74091 73351 59977 1153 -67373 -68959 -11705
22345 -11705 59751 130399 142592 52264 -39130 -47852 105311 41355 29620 -87662 -55249
22334 -55249 -97769 -33609 -31950 -37674 -23766 61368 88903 47249 -100887 -210085 -286670 -218553
22322 -218553 -50642 77768 2281 -11472 132838 122044 5677 -121202 -66978 -156031
22312 -156031 -231331 -140646 -35727 -44241 -76646 -79628 -22809 -20174 -73772 -50560 -82103 -121868
22300 -121868 -61674 -102680 -232817 -313369 -385594 -239088 -101491 -217509 -184788 -128251 7661
22289 7661 122769 158837 151081 74097 136497 240876 172146 133257 232616 141218 73544 78450
22277 78450 40152 32825 -71115 -145708 -119834 -11089 -36218 -17107 -36788 -109631 -36446
22266 -36446 20627 -21126 -175716 -132267 -104370 -11160 127490 163308 137238 131765 127094 52615
22254 52615 53660 136134 52318 -34676 -102548 -115592 -110764 -57793 -32638 -98591 -58117 28091
22242 28091 60719 43829 -58577 -99135 -22758 74496 -101486 -173965 -30350 56217 11961
22231 11961 -24862 -111974 -180485 -184218 -102454 -83270 -19000 127555 156551 34996 -7306
22220 -7306 -26124 -89970 -81064 -89323 -108030 -113489 -43033 -36235 -63416 60559 125053 93439
22208 93439 -16574 -135216 -153110 -92341 34764 -18239 -66457 -131698 -80005 92657 80649
22197 80649 59158 136704 78806 81681 126409 52056 78652 107773 212522 58716 51210 58032
22185 58032 160055 187123 146528 -36539 -122394 -93673 84349 198067 232574 61188 58990
22174 58990 120541 107183 80903 100441 119648 232036 82438 -29313 18044 -5104 -38900
22163 -38900 -22525 17922 57967 110482 224455 279003 272160 220305 96305 65177 51009
22152 51009 -29328 -16935 44935 -63134 -115142 -40463 11881 101566 72741 -24195 -37270
22141 -37270 162962 149200 35378 90630 -19316 -52499 -40589 -33521 -22 98332 19253
22130 19253 1753 105533 -61872 -162641 -222746 -174352 -43961 -78446 2895 107511 151881
22119 151881 69936 -104789 -221280 -227684 -376061 -301843 -108083 -50372 53862 132369 142559
22108 142559 -28567 -51380 2478 -14496 -40651 -75069 -75925 -129483 71783 195102 83626
22097 83626 103518 88591 135538 115837 118814 70963 127993 164320 48045 28644 84310 1535
22085 1535 -71869 -9091 106872 199582 172332 99427 -20306 -4132 35970 10914 -102036
22074 -102036 -168549 -216597 -169283 -99193 -82658 -53231 67643 155164 159888 118191 171356
22063 171356 77281 28710 -26448 -175610 -122108 -24170 5783 46199 158853 166654 42744
22052 42744 37011 137047 96330 59849 168770 72469 82595 82937 9692 -47369 -150770 -97802
22040 -97802 -105224 -53678 -52872 -118301 -173839 -5282 149907 77879 74677 16362 104865 59464
22028 59464 97499 160872 63701 -56276 -51002 -17952 -117591 -168033 -76246 -168076 -144111 -31255
22016 -31255 8164 67826 112522 74588 74530 -5190 -159054 -129276 -169429 -147958 -147826 -194099
22004 -194099 -83814 19196 -4792 35351 22289 -47119 -76319 -78305 48599 28507 -99928
21993 -99928 -220200 -179277 -85014 -72998 -71530 -48650 -10877 8432 -5819 -116415 32437
21982 32437 154845 213682 239824 284220 193026 119474 18675 -89394 -113980 -162587 -155782
21971 -155782 -78850 73066 28545 -56720 11666 26400 9651 -48683 -21939 11724 56205
21960 56205 97788 241718 295094 149584 21635 3559 4879 31647 101991 13074 58359
21949 58359 -27116 -85279 -17540 -16773 48601 40568 76504 17641 -61009 -149506 -146004 -105843
21937 -105843 -111260 -126676 -106258 -200104 -218443 -199949 -185898 -137680 -69307 -26354 -32648 -38832
21925 -38832 135293 106502 30848 -72517 -53837 -133781 -238461 -260914 -272237 -157192 -41239
21914 -41239 51627 302 112503 120013 60282 145604 91056 37163 139436 47389 -103434
21903 -103434 -67833 54011 13629 -70929 -65295 -5311 -1657 40365 53038 57097 -102666 -153702
21891 -153702 -53855 -16217 99732 89882 115980 141808 91837 -72400 -131980 -72431 28326
21880 28326 105950 149727 217083 267081 200823 121193 90144 28995 -65154 -84319 -122704 -36871
21868 -36871 19026 156252 209898 85556 -69769 -100210 -37584 -2602 20642 -41506 -116566
21857 -116566 -25741 -90695 -53070 32128 -8206 -11865 6212 -78656 -1312 -112190 -84342
21846 -84342 -22018 -967 18370 -4314 -35806 51021 116438 10913 -131181 -226211 -154227
21835 -154227 6243 147235 128943 -84347 -106653 -23883 6443 123219 110428 20311 12528
21824 12528 41543 123267 172524 88401 -24154 -40398 -67923 17613 115851 139368 1396
21813 1396 -169839 -274047 -267920 -84934 -8244 49409 122780 105419 109565 84260 -68918
21802 -68918 -127618 -58900 29123 -111406 -286552 -290216 -210161 -110153 -79601 -244820 -373029
21791 -373029 -281818 -106668 10147 -34247 104934 226274 205783 142862 -1613 -71661
21781 -71661 -106961 -102562 -28930 194770 210304 141761 194471 221867 79232 -13299 -40194
21770 -40194 66096 126445 -49744 -67848 -87211 -108703 -37206 -30166 -74358 -36394 52530
21759 52530 137376 149317 98599 -22280 12417 -42773 -159342 -145970 -18270 -30125 -408
21748 -408 -72971 -160139 -152559 -38024 -50761 -84506 -40224 -75753 -77591 -115468 -154792 -145465
21736 -145465 -171915 -4016 12525 4589 -48838 -58192 -132177 -366842 -305358 -165492 -146284
21725 -146284 -205123 -155963 -69525 -43560 -397 195291 164672 110252 104583 91491 158911
21714 158911 54313 -165745 -202975 -51996 60129 62742 154711 169615 147397 52953 69590
21703 69590 98010 91325 -15135 -48798 34636 12059 -41024 37452 249193 220060 70516
21692 70516 -2280 -45792 -36545 112296 186908 148966 83824 188695 196855 123948 22981
21681 22981 -19105 -35862 -91046 -58268 -5254 -70593 -95884 -25411 81881 183902 189359
21670 189359 120036 65828 149160 88996 54317 -9469 -75680 -98805 -31892 41224 9817
21659 9817 -81587 -232290 -88322 30810 50358 6973 -37355 -44636 -108303 -127700 -28085
21648 -28085 76287 120658 127312 140409 137550 68775 60951 34098 -24946 -119398 -118703 -153443
21636 -153443 -74341 99993 274883 238361 91663 -10242 73387 74373 -51494 -55276 -22222
21625 -22222 35293 86120 52460 54436 40379 18910 -17348 -17337 -30892 -14356 10126 -75812
21613 -75812 -63904 -68611 -105575 -133509 -177225 -175854 -78370 13735 25933 -26249 17709 -83093
21601 -83093 -215729 -168802 -149264 -4642 36140 -13268 7078 -4613 44578 3795 -87037
21590 -87037 29102 27989 38467 -15154 -61425 -95605 -138879 -169518 -135807 50221 187287
21579 187287 213547 242250 114803 63287 92413 -30252 -75569 -66873 3234 114447 163197
21568 163197 225580 159678 190435 114456 17624 -4746 -106909 -153236 -105976 -119349 -36616
21557 -36616 126055 105083 35135 52760 120226 236254 237783 229777 164247 121573 173816 132237
21545 132237 -2207 -8352 -70231 -157007 -2283 117075 101590 66785 -142496 -251539 -171074
21534 -171074 -72686 -47897 -66555 55708 -950 -123989 -123153 -41458 16573 33682 48345
21523 48345 59660 22263 -71589 -141145 -130525 -65242 -36754 -70250 25321 122849 107969 155343
21511 155343 117479 122314 191371 194801 59155 -54027 -88686 -14656 56427 126857 139782
21500 139782 162483 151858 166256 40900 23852 145082 133370 179430 236905 316800 183271
21489 183271 10047 17947 63560 59382 12008 51161 105099 116884 37679 29483 9739 -18510
21477 -18510 -75786 -64811 -174666 -165261 -13903 -22160 -92053 -147114 -224424 -172091 -82915 -117928
21465 -117928 -148886 -117517 -47354 38874 117994 93232 84458 93753 -45209 -172837 -237232
21454 -237232 -244963 -201593 -179934 -197511 -167458 -221995 -215693 -75299 758 30338 -11943 -37545
21442 -37545 -39251 -63277 -503 -2490 -53723 -125143 -50006 -37062 -112270 -148267 -87602 29996
21430 29996 99022 -72233 -182229 -191882 -161401 -155892 -170004 -68777 -51662 -102318 -91962
21419 -91962 -16814 7245 19524 81832 18050 -88650 -4990 43263 57697 -37781 -112152
21408 -112152 -36788 -44523 -60524 11102 26176 -5477 -89705 -69589 -53553 1264 41197 -63357
21396 -63357 -224412 -164076 -135279 -149504 -175179 -114687 -17486 -26577 -23114 -41690 5642 43477
21384 43477 75039 -49460 -156207 -119960 -33324 -15151 333 -121008 -100104 -18190 22319
21373 22319 -4178 -74461 -102776 -121188 -64241 43224 74504 64922 18060 -25293 -77217 -43401
21361 -43401 85892 61502 -18182 -89894 7968 85819 23590 -41678 -96532 -111426 46251
21350 46251 150349 153963 144411 167146 132168 65226 -26063 -79053 -46648 22759 78175 175676
21338 175676 30130 -84198 -47772 -59730 -86780 -10473 -35637 -85857 -75015 -44069 -19130
21327 -19130 -46528 -34031 11999 108644 160189 89187 75493 63064 -13075 -130742 -84581
21316 -84581 -68261 -70129 -58480 58847 20142 -117567 -128410 -113551 -21134 18732 4757
21305 4757 -73991 -127874 -198916 -121278 -39414 9832 20924 12054 54253 206522 234656 109385
21293 109385 118853 161460 74271 -30080 -91784 -118177 -49667 -86557 -117702 -67664 -7965
21282 -7965 -20527 22706 2802 39074 139651 27103 -96505 -1230 -108167 -94307 -43418
21271 -43418 -6592 -114674 -164879 -254941 -168801 -84201 -9060 91249 81076 56897 67110
21260 67110 -4725 -89930 -87307 4233 52589 78580 -20852 -78273 -5587 43032 71904 144081
21248 144081 230718 153558 60309 -4083 -73479 -61384 -97736 -42735 19233 -18291 13205
21237 13205 70253 8671 -55011 -7731 109661 902 -108931 -170776 -166311 -87188 -35961
21226 -35961 -105989 -211534 -203828 -154996 -170120 -187988 -111069 -178737 -242037 -26589 14655
21215 14655 -89791 -41073 -11334 -6388 -113267 1789 49281 101130 81435 7589 -20618
21204 -20618 -354 20751 25657 -46121 -73427 -72245 54672 99454 -17114 -61062 -194676
21193 -194676 -173562 -49057 -41254 65859 77060 -70231 -126599 -88065 -57316 10414 -33130
21182 -33130 -73674 -68611 38966 20847 29445 -10654 10177 22870 17375 35307 -55523 -24346
21170 -24346 -13436 -12786 61475 81453 92060 53743 -99499 -71465 -17721 42155 22439 -38575
21158 -38575 -191139 -308479 -235790 -179252 -146458 -174899 -226116 -204593 -136017 -28524 -11582
21147 -11582 52368 -2205 -3082 648 100858 97191 15161 -51802 -140660 -157872 -147641 -81752
21135 -81752 -4892 -34292 -58288 -161791 -187079 -163898 -113668 -114039 71242 201735 236160
21124 236160 175423 71890 -71971 -172073 -260559 -311943 -291172 -237124 -159099 -137597 -45084
21113 -45084 110910 86029 10143 51974 96129 31525 -35009 -51902 -9277 95898 27104
21102 27104 6292 12265 61648 154609 108095 59315 45043 67704 -8420 -55544 -97631 -2799
21090 -2799 20232 -80094 -129670 -105847 -184419 -174724 -168917 -94897 -56539 -50540 51583 81656
21078 81656 156873 141593 -51561 -161501 -125044 31223 55572 -158606 -259477 -152651
21068 -152651 -128467 -169788 -70385 -25843 -67356 -83566 -31422 -52346 -28242 47724 3820
21057 3820 -25795 -52427 -54253 -137874 -75641 79303 148430 40675 63333 97695 73884 -3816
21045 -3816 -38221 -27428 -81726 -39672 18734 91949 77819 19411 24552 56750 102825 30363
21033 30363 -80452 -34189 4337 62121 64993 38106 12014 -71206 -49180 15240 25650 88966
21021 88966 89775 116996 32595 -34930 -30727 76529 35012 -68315 -181519 -202377 -132792 -73614
21009 -73614 29386 117667 163505 195816 199612 140777 -18140 -103909 -3151 197332 164968
20998 164968 -15476 -49441 -182365 -139641 -92300 -103512 -176559 -275674 -348344 -279867 -189233
20987 -189233 -31079 39408 101900 114855 -3816 -110741 -15296 50358 -6212 -79511 -35619
20976 -35619 -72816 -24297 -30361 -57329 -140254 -153882 -264860 -303384 -151224 -33748 45255
20965 45255 45502 123082 117252 67219 120635 166856 170937 60344 -31904 -18787 31019 -30108
20953 -30108 -154268 -188925 -101798 -59537 -28558 -46605 3 3408 -59381 -59089 -30079 -46433
20941 -46433 47 117999 191541 117030 128918 116932 22708 -30113 -46058 15004 -90837
20930 -90837 -110820 -148082 -174971 -121355 -137949 -111975 -123240 -101356 47146 260647 226387
20919 226387 2735 -118890 -1627 52166 49079 17575 -12156 -24000 -52457 -163988 -178574
20908 -178574 -121717 -45409 6636 46105 52832 -62349 -93147 -89605 -67522 18427 66388 7575
20896 7575 -18321 -14104 -64886 2511 207334 213449 45698 -11146 -1319 -26484 -134922 -209524
20884 -209524 -161012 -216688 -166731 -77651 240 86561 148750 73193 -6366 42357 111198
20873 111198 137189 145061 145387 139176 11140 52133 96685 147486 275183 325606 278064 169579
20861 169579 99931 26567 40029 88965 248543 196173 99969 -23708 -132365 -197954 -119131
20850 -119131 -47480 -121968 -41032 10931 49767 -4144 47208 132684 222544 239170 274473
20839 274473 240168 158574 37827 229 -48258 -102283 22173 201596 93440 50066 58212
20828 58212 97479 70578 -19604 11732 86126 117589 -11153 -74104 3902 -6847 79309
20817 79309 151090 143014 142506 171882 31135 -94528 -44397 37441 -53502 -104861 -104192 -143069
20805 -143069 -77197 -63481 -129132 -36595 82641 258870 243152 149457 111480 86836 -15315
20794 -15315 -16233 19498 7866 -51060 -41676 82256 217371 203838 292993 398684 342034 367622
20782 367622 455854 568757 640365 800423 1175525 1548628 2061760 2295543 2064385 1668501
20772 1668501 1249004 869944 617830 468658 361885 296320 241150 119364 19540 -65980
20762 -65980 -136121 -47236 93436 117869 70823 49334 -32104 33635 92192 111833 121034 83906
20750 83906 38820 59996 143530 97486 101531 205900 204342 190776 44090 59595 149383 153996
20738 153996 24551 -34710 -9316 47866 -28355 13834 86778 -37698 -77382 8050 -6889
20727 -6889 -3346 -4144 -92778 -50539 22850 68273 -10470 -49326 53967 74800 73457 -13908
20715 -13908 -76263 -138735 -198802 -225102 -176462 -35445 204291 138217 -57163 -136533 -188597
20704 -188597 -132081 89433 121639 93265 92340 -28907 -95969 -37478 -79290 68881 130708
20693 130708 54486 -44245 -118360 -153158 -172116 -92580 22329 94132 5260 5727 55761 60491
20681 60491 4597 -164411 -171579 -87378 104665 238130 230425 91548 6728 -49976 -102400
20670 -102400 -135883 -50386 -82804 -143165 -310536 -290948 -98635 11983 20865 45506 -13665
20659 -13665 10720 136321 224952 221971 71665 54288 58541 5214 45850 12734 -20207 35264
20647 35264 -27196 -70572 -79203 -11461 97334 114348 121337 133397 56182 -43948 -57816 -65574
20635 -65574 -108317 -70876 -28956 -109999 -62229 58984 75414 65718 174228 196208 160896
20624 160896 5358 -83618 -124361 -81192 46153 -10446 -96118 -197197 -220547 -202874 -74692
20613 -74692 846 65479 219811 260149 218560 205907 197969 144632 1778 -27507 32382
20602 32382 -67504 2140 100151 121525 196298 112198 38359 93884 -6553 -75921 87423
20591 87423 142424 125414 118268 108633 -13491 -19578 11953 77933 -14700 -126848 -26343 -19901
20579 -19901 -29719 6508 98368 61975 -38116 -63615 -72864 -62679 -127577 -194594 -226321 -219609
20567 -219609 -194966 -126393 3665 -12392 49493 79738 -13048 -93447 -31219 1338 -65407
20556 -65407 -48575 -73023 -70049 -4278 -90597 -123011 -12174 144843 214107 90113 49801
20545 49801 33318 -22708 -23744 -38431 -29752 16190 52246 -39356 -49899 -143162 -90394 -78868
20533 -78868 -124393 -74527 -41612 124051 196329 172118 181146 82684 74710 157884 77457 100793
20521 100793 37400 -50613 -104133 -144922 -192085 -241305 -166038 9783 158782 184616 82772
20510 82772 1764 145706 169755 163535 18966 38613 102158 137648 166944 131994 229716
20499 229716 158611 97045 107327 208166 160147 100281 3690 13751 -15134 37553 -18633
20488 -18633 -2741 -41260 19274 90772 42790 -50696 -39775 37060 -87039 5449 78853
20477 78853 162292 255271 171384 128887 45810 21092 -15746 -10884 7448 -191721 -326877
20466 -326877 -242734 -37749 86300 214459 251827 273180 341201 394244 320517 230772 176929
20455 176929 39716 32353 90307 21799 16162 38165 -48685 -133226 -46996 -611 40545 -58811
20443 -58811 -106183 -144323 -17724 134424 326127 348576 308616 190812 172681 156399 -27581
20432 -27581 -73459 -36307 34883 147095 166074 151631 127930 130655 26121 -40545 56492
20421 56492 115748 85814 42259 -42484 35480 96755 228345 246424 210422 273147 228258
20410 228258 115462 210133 257730 287721 263658 318626 193411 216297 107541 76157 215926
20399 215926 137006 27504 76383 91459 135060 803 46148 77874 140487 55400 -46523
20388 -46523 -57529 -140601 -164614 -127508 -94199 -123321 -45926 57727 -45618 -28406 138185
20377 138185 68298 -131445 -280029 -312275 -158376 25509 168346 149950 58788 48887 28559
20366 28559 -2211 18681 122191 133683 81643 52406 -60508 -90260 4311 51063 132027
20355 132027 180612 132353 98678 70072 79791 98599 141058 163630 90689 96576 110195 38565
20343 38565 8141 39849 43235 -74570 87414 45710 41046 20706 11628 55559 120999 273354
20331 273354 229411 194473 194592 183135 158571 178695 211420 254392 141375 32339 723
20320 723 122084 134595 32991 115164 183409 135629 169842 221474 205193 189887 182788 170416
20308 170416 90851 128441 210253 274018 309199 274728 176039 139417 183625 274459 372564
20297 372564 403129 398745 415057 333447 224812 143821 95496 113097 92261 167194 319585
20286 319585 383507 512109 550118 366104 294505 298126 280436 242027 223996 226319 254421
20275 254421 245195 128656 125216 141349 172716 164423 180980 274724 319706 273892 237327 344812
20263 344812 252017 155446 202545 172330 263548 227258 245425 238388 226121 198367 134725 134309
20251 134309 198389 191014 225721 253740 320991 351681 270360 299813 423029 491180 533458
20240 533458 477882 508019 492038 437995 373193 408995 460248 530156 553715 443735 375657
20229 375657 326086 438238 544599 583957 640939 522800 445635 511298 538619 526064 437060
20218 437060 435237 583816 625874 690269 755762 798579 824312 832546 980807 1032732 1020764
20207 1020764 967631 1011473 1130950 1364915 1542345 1977756 2246679 2344084 2330204 2231660
20197 2231660 2244800 2355707 2679119 2864515 2811217 2677587 2626659 2723684 2973012 3374407
20187 3374407 3985603 4973564 6326796 7371959 7704998 7087488 5990456 5165901 4663339
20178 4663339 4424185 4428302 4586101 4774323 5082339 5460533 5831188 6494646 7253781 8063921
20168 8063921 8841727 9846784 10944275 12381741 14056448 16020848 18443500 21551538
20160 21551538 25736096 31176477 38746019 49724960 65997959 90665901 129602349
20153 129602349 192451847 288456463 405554617 478792262 444711334 342791499 241642078
20146 241642078 167178597 117689750 85668344 64742352 50481760 40340775 32916362
20139 32916362 27453196 23674466 21198845 19509754 18184580 16325114 13857878 11512403
20131 11512403 9750507 8431795 7646540 6929367 6323563 5868878 5556179 5195339 4991912
20122 4991912 4835533 4830536 5002049 5443960 6308116 7376898 7868577 7341779 6016676
20113 6016676 4687164 3680537 3070030 2684311 2382120 2274196 2272084 2197101 2262747 2398495
20103 2398495 2491353 2459356 2307036 2193506 2210231 2254515 2188604 1987117 1807782 1539378
20093 1539378 1307289 1142562 1116084 1032567 972933 818181 774297 791993 851108 946298 823862
20082 823862 711425 661952 635516 643644 733311 823545 830191 707641 696838 680414 528723
20071 528723 488148 550459 551108 665263 812368 840693 757289 627446 505368 386218 459006
20060 459006 446124 365306 209586 257314 374312 344433 441847 442608 323049 219064 183736
20049 183736 66730 -63737 -225688 -165828 -7193 112796 190120 283666 326002 409685
20039 409685 256367 217910 273466 247651 265561 296784 235524 239209 230336 135470 109823 102673
20027 102673 211786 284402 476809 601627 539027 362862 191099 181483 129144 2335
20017 2335 -37339 97616 90773 61845 75880 113299 141969 249548 290901 185709 21296
20006 21296 2471 103307 149583 156799 234574 302987 240883 203930 60395 -30969 -14584
19995 -14584 -42551 -20463 -50640 13488 44832 44893 48795 89176 82304 -40882 -3632 38839
19983 38839 -100040 39470 257868 329195 159150 52293 -28168 60962 140833 69404 4904
19972 4904 36722 6358 -48276 -59917 -112702 -151155 -96573 -40908 -141653 -257536 -265387 -96308
19960 -96308 -52708 -66962 -67728 -64693 -42901 -116494 -59336 -77506 -37842 57347 61984 97612
19948 97612 64936 591 109561 67217 5519 15950 91331 153653 183000 174417 186177 217409
19936 217409 178708 110557 142597 148792 146591 87340 19590 72602 57580 64230 51485 -18425
19924 -18425 13206 -153919 -202139 -166672 -192525 -216851 -104972 -12266 57185 53787 8917
19913 8917 24357 74787 92603 114525 115416 63917 -31874 -143361 -157028 -120108 -94671 -3720
19901 -3720 47973 -6415 -1421 36447 -89820 2568 146644 180708 263538 169229 43243
19890 43243 -61939 -100483 -5169 62424 44507 89677 105246 175261 177460 201421 177771 160749
19878 160749 158955 197502 87349 14762 16321 6251 40412 56865 68297 179575 176605 72757
19866 72757 33736 38908 27597 -157 48660 5628 -41068 -11535 142570 143539 219845 114213
19854 114213 -10298 -48484 -5098 -74617 -133133 -262896 -391618 -285426 -194155 -234989 -190197
19843 -190197 -232628 -319448 -183854 -105111 -3696 67980 122940 198534 170598 71083 29384
19832 29384 -32341 -122581 -80067 -130262 -249404 -270908 -233080 -184815 -143193 -195179 -222506
19821 -222506 -191594 -162716 -224532 -188784 -132966 -45570 -8805 -24293 -81292 -168672 -82333
19810 -82333 50969 -6139 35756 87171 10655 -82342 -129438 -120155 -27154 -35550 -116038 -213454
19798 -213454 -296109 -185300 49170 100601 42441 88623 178210 109124 -45919 15370 33500
19787 33500 -75328 -79972 -150273 -213369 -112632 64268 -59539 -91101 72384 134558 126645
19776 126645 88902 137762 106134 -50818 -14782 111658 221257 200842 310750 373895 220683
19765 220683 156898 46339 50103 -35937 -26662 114601 71221 -79532 -171992 -179543 -194271
19754 -194271 -184772 -175710 -132876 19958 -2862 -44621 -23584 -63792 -64192 -122642 -66869 28636
19742 28636 125852 53373 79852 102699 147883 180374 157463 162218 277496 177442 94236
19731 94236 -50200 -63779 -27081 -15603 -87561 -60411 -72046 6474 47043 44329 -9323 -29350
19719 -29350 33659 1509 56170 -36316 -72222 -116113 -34635 143815 76883 16413 -9598
19708 -9598 -35215 -59542 -57412 -2960 81226 48821 45345 21971 -36104 -42433 2024 15307
19696 15307 7503 -6371 -37140 96671 62860 -58254 -31168 16515 -53045 36509 119053
19685 119053 22987 -38290 -66811 -126256 -174715 -218935 -284527 -240147 -195211 -158455 -103215
19674 -103215 -3228 110478 134959 -73965 -184458 -69717 85306 94071 -70641 -130029
19664 -130029 -145540 -127863 -62767 -3693 58993 51108 43860 16144 6990 37265 168009 137939
19652 137939 106729 79284 15212 -24272 -35565 45077 70246 83211 50572 1473 88973
19641 88973 108711 97824 57552 21875 -22839 114073 157153 99245 19564 17699 36492 -9295
19629 -9295 -70410 -22538 29452 -19694 -6667 99892 179085 83537 113672 10105 -48744
19618 -48744 53010 88825 95194 29519 -393 -49602 -90658 -98241 -88227 -31902 44303 11825
19606 11825 72497 160505 193627 124759 31223 -136443 -189596 -63030 90852 79772 13551
19595 13551 -50614 -73443 -48152 -67763 -96382 -46186 -3385 23654 80750 269224 270437 95131
19583 95131 8333 43302 -35386 8469 174220 56774 -35573 -109361 -229781 -132781 12590
19572 12590 142716 129039 114326 185004 249581 135819 -16639 -71614 -45368 2820 30955
19561 30955 -55399 -160906 -117831 -70931 -151955 -146646 -178402 -183078 -132352 -937 53049 149418
19549 149418 121250 50824 10418 -55043 -49686 -102216 -130027 -68103 4364 100005 50546 134728
19537 134728 101145 81890 5214 65798 274365 319567 239118 113449 13988 -48031 -92468
19526 -92468 -128079 -44402 82392 349163 698258 884876 1262810 1754816 2136353 2268926
19516 2268926 2120131 1723543 1331739 985573 786550 580546 451424 316520 307078 290142
19506 290142 297679 268918 160943 175446 152334 98416 195246 287285 269010 222641 233490
19495 233490 76906 -123883 -114606 -121301 -132219 58170 147730 54337 -35525 8112 9434
19484 9434 -11686 56794 158582 114465 17106 56915 -9222 -45787 -48711 -53438 -4763 59798
19472 59798 24305 -90049 68927 246697 317589 342542 316749 181295 -12327 14092 23454
19461 23454 -52066 -62369 34849 63765 3425 -72623 -157621 -108696 -9131 -33463 -132852 -174091
19449 -174091 -139679 -104202 -135853 -99404 -106677 -87914 -129669 -102791 -10201 -51791 -44865 -31078
19437 -31078 -36141 26835 132167 34081 -41243 -50255 66679 119976 166227 68169 -3023 37381
19425 37381 152862 121997 142753 185868 149660 67946 48502 12586 125983 337388 493711
19414 493711 623289 811128 1315003 1560892 1300228 876254 520880 324787 166148 213513
19404 213513 196124 149411 170132 162669 237011 168366 11507 -11339 26379 48971 94290
19393 94290 86041 80734 38886 47106 83951 197575 217410 230987 196331 193010 142663 183431
19381 183431 298443 433044 614196 812258 1119760 1505579 1541363 1257108 810004 459314
19371 459314 167731 99806 -22769 -131041 -169698 -157221 -107726 -32525 -97897 18001 32949
19360 32949 53290 160560 106619 152183 154712 148597 203935 99333 75469 193572 88635
19349 88635 68232 71230 90897 87096 124560 123903 26479 -39947 -29750 -41749 40057 -1111
19337 -1111 -39230 -55738 56058 80763 88450 -13044 -18500 -42671 -118617 -81052 -44252 -153008
19325 -153008 -103740 -10051 -69417 -76796 24839 -78367 -200622 -260409 -352866 -245904 -122046
19314 -122046 -56721 -28629 118834 279050 223331 70623 61894 85198 3308 -18291 17671
19303 17671 78064 120733 189595 181298 21368 40171 70072 114120 137969 184443 160624 64802
19291 64802 13287 70354 30054 -80589 -176747 -46785 -48171 -71373 -70252 -75992 -7505 -20606
19279 -20606 39574 6762 10547 42516 18123 32770 -44283 -100987 -49833 -50823 -110642 13475
19267 13475 121065 158617 34335 6487 -14573 -164153 -67264 40030 -68334 -148715 -53055
19256 -53055 -37626 -39784 29632 115064 125470 106468 52953 -65975 -192574 -161713 -200107
19245 -200107 -234859 -268146 -219105 -61578 -79387 -115270 -14039 -45637 -124090 -91630 2865
19234 2865 172667 242290 316660 232504 122242 73464 54020 -34794 93515 108213 78884
19223 78884 79719 15355 -105171 -100994 -77822 -148730 -222545 -215822 -139847 -201217 -99952 35421
19211 35421 41905 5964 -85821 -153401 -154522 -165687 -136782 -118607 -187603 -165250 -155224 -208665
19199 -208665 -116553 -135121 -229899 -202398 -198212 -227659 -246452 -202166 -109866 -154716 -238783 -171672
19187 -171672 -65229 54333 35587 19717 72221 131928 203992 59009 -31360 -92247 -95222
19176 -95222 147035 128907 55051 24995 20114 -20460 22114 -12668 -13489 -63031 -145297 -120579
19164 -120579 -7432 17449 4668 -45499 -72252 -83916 -110123 -50650 5764 39730 40453 46536
19152 46536 -27038 -65198 7290 -6279 -103668 -47509 -47288 29106 61592 85561 -19290 -7723
19140 -7723 92227 145589 141375 80170 24389 90837 123075 109658 -1142 68386 82779 -16826
19128 -16826 -104343 -146349 -98680 -127628 -219743 -154577 -53487 -95537 -59580 28434 57632
19117 57632 -15072 -4923 80947 115541 141596 100790 -67910 -198228 -37379 82392 846
19106 846 -186730 -147758 -10110 -38412 -39328 28045 -26618 -73985 -130863 -227961 -146247 70571
19094 70571 117873 109922 246422 211960 136774 147275 159866 108098 75165 28158 61817 69008
19082 69008 79646 105792 191856 205384 157067 61117 -1020 153333 155258 89228 -29240
19071 -29240 -9745 20472 28990 3276 3879 -102928 -17666 45779 4319 77654 47346 -10253
19059 -10253 -10001 76068 66585 -23982 -37870 -38702 -101504 -117332 -89322 -27045 -14425 95755
19047 95755 190851 188010 102537 116174 163058 243122 174739 198539 192151 215402 109289 -24673
19035 -24673 26438 40996 135212 227955 160092 238972 102261 62373 40893 -27226 -192738
19024 -192738 -104260 153697 251666 255890 276529 68872 -95109 -47913 -25373 62483 58612
19013 58612 73510 2588 -11582 79562 86616 113736 71442 83947 96128 -2581 -10937 134496
19001 134496 209787 247009 176816 48210 -31970 -21524 103439 124554 81999 190557 216764
18990 216764 202196 225334 239377 257148 195322 188448 38973 14137 81791 187062 271561
18979 271561 301012 304835 303709 263866 132297 221354 215830 163418 25368 130288 222026
18968 222026 265151 221735 209942 227488 249021 193381 136118 84365 82662 106894 303720
18957 303720 399504 297062 181692 114166 54824 93288 205672 307782 231197 87710
18947 87710 -14822 189053 279127 240608 263231 360156 351251 134437 22957 60062 172530
18936 172530 249733 246617 304476 391994 348505 204407 226709 312065 495228 472379 331451
18925 331451 236189 183499 89713 131102 266000 262217 206216 229230 148667 147118 221744 206518
18913 206518 166702 152297 -12291 -70597 11056 144115 229002 291917 369841 331928 414763
18902 414763 567384 711211 862338 984409 862106 722198 473116 384735 308689 362043
18892 362043 301183 227023 242046 264440 196270 249749 219021 169762 188293 328193 470706
18881 470706 428804 308695 446292 517667 539796 637457 673494 613788 644900 612158 708043
18870 708043 739579 932702 1107060 1401294 1841091 2560919 3125784 3246591 3159119 3319912
18860 3319912 3459523 3043137 2427459 1968802 1696773 1577195 1543158 1483783 1423063 1447162
18850 1447162 1641521 1789473 2045224 2248608 2576035 3202693 4030456 4963468 5346856
18841 5346856 5355751 5497231 5972108 6664885 7708997 9067804 10804840 13314991 17255252
18832 17255252 23480679 32581126 46922566 73588880 126474544 219953032 312145318
18825 312145318 282951817 190483253 117645452 73836439 49365812 35040272 26201039
18818 26201039 20435034 16393394 13580876 11835144 10860933 10646972 10830090 11154642 11860276
18809 11860276 12336898 12211643 11332102 10027581 9364097 9289128 9638367 10342513 11541387
18800 11541387 13108826 15404362 19094037 25069616 34272114 48720655 75024397 126616168
18792 126616168 221533141 340286444 347779716 245742825 152612289 94054671 60997262
18785 60997262 42221613 30775545 23482187 18436351 14804321 12290494 10750758 9949841
18777 9949841 9593831 9488038 9712180 9530140 8440206 6894805 5505215 4665178 4259829
18768 4259829 4191446 4484697 4385881 3626417 2990082 2518277 2235135 2086520 2007973 2119072
18758 2119072 2359584 2895022 3165188 2672561 1988248 1416270 1127541 1044125 938777 892752
18748 892752 911678 902585 969184 781039 634445 676736 744540 682320 660392 661712 648777
18737 648777 601995 558221 501343 528967 515626 451573 410492 601767 687395 614070 571846
18726 571846 445723 273848 264929 263167 270855 269002 273689 263005 345686 356367 371372 369711
18714 369711 302054 203928 200998 104812 126621 147728 100831 141626 100393 84220 41753 149184
18702 149184 251711 427180 447803 417149 359341 407136 396718 477230 359661 274510 328499
18691 328499 332821 201386 126772 48713 96564 181985 264941 370515 410711 252260 102160
18680 102160 149857 198586 204692 200949 155159 129541 32752 77176 89725 124840 100160 195654
18668 195654 252787 256447 160383 194182 198694 193886 71327 36911 121631 194659 342709 381783
18656 381783 273880 194032 154024 204669 213872 97518 -46141 -151950 -108553 -86124 -49747
18645 -49747 26313 54206 127098 201627 149646 125660 84005 58864 69050 116441 138181 -56031
18633 -56031 -193134 -164981 -124888 14709 140017 80532 33171 -27139 -25826 582 -52828
18622 -52828 -15224 60285 86930 162862 101764 -25655 -10671 -127456 -60807 27205 83078
18611 83078 -21546 46615 61296 28420 57797 42273 9601 -74414 -84070 -37709 63778
18600 63778 213411 173653 47864 70881 143659 69312 130288 170272 211579 276538 257236
18589 257236 294069 166533 163189 274989 304197 192075 141952 -5819 8317 59118 -41725
18578 -41725 -87437 8772 40410 20508 46804 140418 142534 52919 200407 278803 340469 329348
18566 329348 240601 134022 91686 110380 58973 43157 48127 -5227 109485 107084 91303
18555 91303 96783 161698 189459 191389 256115 184664 215988 235852 162902 56325 60957 176096
18543 176096 169944 144037 128936 130646 203806 177891 124932 171046 125875 127770 186682 370910
18531 370910 323841 242819 156647 248505 275922 132943 36950 27845 52561 142884 155003
18520 155003 213829 152874 121280 81898 -76206 -90662 -10021 -86887 -201233 -125176 -62476
18509 -62476 33943 -66690 -105546 -5263 98869 40549 5005 -31299 18134 147284 182114
18498 182114 77489 26053 96400 238716 278005 176431 137512 189425 98393 -34879 -97998
18487 -97998 -120103 -211995 -140404 52899 106145 163714 254870 341069 231657 227887 366999
18476 366999 309047 243819 174928 160265 149673 170068 191527 208914 221941 158719 66949
18465 66949 41480 58782 195666 227612 279898 321907 228688 156079 138120 -10033 16252
18454 16252 105401 24939 -10494 105273 145978 132929 154363 206123 237704 167620 79875
18443 79875 160020 274645 346650 361224 332182 418955 397766 285778 263007 178772 182283
18432 182283 242079 170139 216414 202038 11408 45748 150627 197472 186542 221273 300645
18421 300645 396820 444826 415645 348938 320261 212632 237924 361743 336155 345630 392869
18410 392869 460584 401110 398497 379280 398714 427482 379791 422798 436385 423792 478122 484011
18398 484011 498681 494342 472483 624594 677067 613940 524153 431871 520991 617303 684351
18387 684351 818630 817077 811175 852722 950110 923773 992916 1139233 1234051 1337712 1517452
18376 1517452 1800616 2168576 2861895 3491440 3603053 3652263 3924024 4278955 4360563 4295371
18366 4295371 4263429 4504865 4806189 5347215 6344039 7575129 9286659 11080515 12418181
18357 12418181 14340560 17683259 23047206 31558621 46435473 74506012 128807621 225571751
18349 225571751 337934704 342975134 245912316 154141578 95297932 61528565 42483455
18342 42483455 31411465 24625409 20198602 17659878 16430647 15723248 15279205 14702384
18334 14702384 13583276 11929279 10326145 9332856 8985049 8888166 8931864 9333959 10248426
18325 10248426 11888285 13233546 13792291 14369626 16337065 20144605 26355086 37076359
18317 37076359 57096710 96257741 169132484 271443435 310170769 237815388 151135288
18310 151135288 92331924 58132878 39056664 28140442 21486234 16962959 13713695
18303 13713695 11738097 10869420 10486307 10067173 9084795 7641049 6401702 5591482 5349329
18294 5349329 5387504 5125243 4718537 4343326 4289012 4382040 3747488 3146848 2693873 2246911
18284 2246911 1980879 1789457 1653206 1404317 1232553 1154622 1178478 1203869 1118117 1020746
18274 1020746 779937 641856 704097 771297 750952 640441 541316 462899 483141 528169 642987
18263 642987 674151 539793 362501 396631 479441 531837 477533 543776 529092 472590 341200
18252 341200 235705 328937 318205 308990 374080 342344 302127 301595 323875 273778 335143 295582
18240 295582 397374 476020 438703 591560 637919 680736 680977 740088 864246 1250788 1736596
18229 1736596 2269656 2384007 2007901 1502657 1166719 939538 738238 581054 489207 473647
18219 473647 470242 474271 358481 298267 272024 242338 152286 27172 97426 136327 133611 211743
18207 211743 300557 256089 245257 273056 246750 204877 184509 218165 355307 433243 357178
18196 357178 437425 657777 968731 1154809 1081842 817367 623415 426351 420811 444221
18186 444221 334664 141618 105422 212172 152088 24338 177767 240342 353569 420824
18176 420824 321514 379915 378537 222988 175829 192186 234498 198374 207072 138350 120393 163837
18164 163837 250764 310657 290882 350946 322548 303039 374019 258326 237593 359137 458138
18153 458138 585496 599866 643228 601150 513037 385855 388608 443196 610920 778021 943854
18142 943854 1212634 1297935 1244921 1017422 834880 786426 910876 986761 1031935 1141137
18132 1141137 1278801 1468898 1518475 1510477 1737692 2082214 2316296 2422884 2655582 2987345
18122 2987345 3509731 4085433 4899996 5885640 7023972 8590589 10944575 14574647 19874634
18113 19874634 28564554 44707820 77077625 141878906 251406122 327372669 259998174
18106 259998174 162695777 96423911 59066937 38802399 27294531 20353237 15934980
18099 15934980 12787158 10278607 8434575 7044007 6089985 5322212 4533704 3935289 3461860
18090 3461860 3031511 2647436 2356295 2005831 1778953 1666554 1628381 1513010 1357382 1258967
18080 1258967 1191758 1147106 1189520 1076803 903730 822099 763165 721173 717460 735387 614112
18069 614112 443877 360509 441595 401381 276846 305386 418054 434667 471699 465259 502411
18058 502411 424205 360516 353261 287686 232102 277373 284644 247530 265357 339294 242873 92598
18046 92598 129875 147371 214023 302307 430704 298521 53577 -8459 116848 179074 163543
18035 163543 174358 173200 235028 196117 198799 212881 318698 278036 299023 300494 286143 239443
18023 239443 140438 83564 193563 212245 64923 -39275 -82589 37688 75493 51861 98932
18012 98932 98609 118511 111682 140300 117579 11322 -9128 98222 202871 287438 142273
18001 142273 165068 137803 188053 137980 68087 95951 111373 69489 119103 180352 197379
17990 197379 8613 -117097 -61701 35515 151489 107954 30837 119030 232828 180579 42081
17979 42081 -21863 -108857 -129681 -165716 -183677 -125786 -105290 -100857 -99104 -27997 153145 94013
17967 94013 -56269 5983 -2116 -103115 -48205 -92857 -137974 -139168 -58930 -13343 -23210 -8866
17955 -8866 -31635 -100242 -134218 -85602 -66044 -104963 -95238 -117475 -138490 -116243 -49192 -94664
17943 -94664 -65394 29874 130189 171338 129394 3844 -36999 15222 -26588 86733 -1995
17932 -1995 -156934 -165589 4678 124398 73853 120070 -23754 -179196 -178964 -113863 -81198
17921 -81198 -106805 -43779 13012 -1912 -58720 -37729 -85838 -152996 -195129 -92459 6423
17910 6423 65612 50618 56803 112493 87222 -1981 -63470 -89277 -108674 -143059 -84772 -75141
17898 -75141 -16025 -549 -976 81640 153967 193212 146959 90421 12333 41996 57415 26068
17886 26068 34973 35061 -28534 2974 -6337 24410 -76361 -170216 -121084 133140 198700 111667
17874 111667 73790 84598 160718 197319 296712 227969 228411 233058 183672 168814 100343 58477
17862 58477 -7632 -43956 -150198 -216376 -130285 -46650 -64836 -56132 -33003 -156518 -168367
17851 -168367 -103479 -70968 -49807 -67527 -25050 72978 -9020 2868 -20869 -177411 -237805
17840 -237805 -161487 -180915 -142459 -36834 130411 132577 -48965 -147396 -118853 -32045 -26024
17829 -26024 17862 166611 113985 69564 179551 117902 27349 50767 151388 310603 353835
17818 353835 291483 306589 206499 138202 223949 193283 178236 310634 320123 268914 291396
17807 291396 251914 292805 310221 322146 333914 458551 649914 883068 1155437 1480183
17797 1480183 1559873 1407539 1128772 793041 722784 763777 695283 527261 376821 287161
17787 287161 151886 96853 102896 234599 256854 326841 305423 222955 189785 207229 293261
17776 293261 321231 355220 370105 372700 253212 47318 8792 112628 204107 272830 396659
17765 396659 636176 830140 1191635 1333200 1124136 855431 578948 349673 179783 182726
17755 182726 191352 131070 107966 -23562 -88231 -116328 -165301 -240326 -132733 -62442 -39534
17744 -39534 37373 -25214 -2960 117312 19340 -82024 30761 111861 10210 -21612 50755
17733 50755 90439 84600 58206 -41091 108272 108339 3256 108283 39950 -94713 -279782
17722 -279782 -233555 -123544 -72708 -110044 -61512 43410 75314 109148 143785 183425 118850
17711 118850 -2846 43258 19321 -147608 -205551 -68913 -11757 -38657 -79314 -56680 23395
17700 23395 -68646 -173005 -183366 -107348 -42752 2961 104455 110276 26321 -46990 -28943
17689 -28943 64389 -916 -171460 -248314 -157219 -122736 -148383 -238332 -250399 -167499 -88422
17678 -88422 -111865 -170384 -139859 -150563 -143662 -150821 -135300 -58328 -90718 -121033 39167 123590
17666 123590 222407 196564 108165 118458 207258 286437 202699 213996 302693 359948 542930
17655 542930 814261 990270 1035525 1049800 1127402 1078893 953486 876999 813769 784087 624101
17644 624101 678995 646786 506183 385681 337232 134386 39576 -34410 72672 49843 29195
17633 29195 -55997 -66147 -89948 -158079 -56394 327 -93445 -141034 -8863 144836 169763
17622 169763 95182 35203 8983 -65688 77450 229006 101406 -6099 -58074 -124960 -158927
17611 -158927 -98736 -69316 -32726 -89862 -147980 -201327 -177536 -126655 -5860 -29461 6241
17600 6241 54587 112032 154730 87556 78615 164832 57253 -22127 -75473 -1180 48406 114985
17588 114985 22336 78556 143587 128101 127816 144233 89267 22995 15570 -35481 -34220 -183986
17576 -183986 -216804 -96597 -134101 -79157 13200 63239 4607 -106556 -33518 -9270 10724
17565 10724 -43590 -131755 -104603 -79517 -54511 -56905 -36746 -66965 -98690 -46349 -109988 -1071
17553 -1071 127443 103212 100895 160965 172480 143372 28424 -122938 -65683 9290 45268
17542 45268 -11808 -35085 -101325 -118766 -112491 -73914 1805 -45028 -89640 -141633 -144676 -144742 -133225
17529 -133225 -109342 -127024 -94757 -75228 -4908 -5244 6538 -7128 -65977 -36891 -80520 -226277
17517 -226277 -228876 -101880 900 -15691 20787 65051 26805 -21617 -50477 -100083 -135026
17506 -135026 61300 164828 26630 11840 83006 72590 128691 11144 -81034 -166222 -233067
17495 -233067 -239713 -136451 -118188 -297877 -256827 -141549 -174036 -158942 -44855 -40532 -119249
17484 -119249 -27119 2789 -121187 -170022 -130015 -126742 -142885 -140424 -169371 -198483 -94994
17473 -94994 -31271 -141376 -97433 -34428 -20955 26724 72690 82332 110380 108887 48745 43977
17461 43977 25016 -57957 -139746 -235854 -97011 -121246 -165235 -202985 -182638 -130476 -161021
17450 -161021 -143541 -47500 110021 64481 96437 214747 470296 915011 1488226 1525892
17440 1525892 1010152 470152 285742 222220 125883 74645 18850 22098 7644 -25553 -36163
17429 -36163 -140179 -64070 124620 143658 229090 236069 125296 49231 -195179 -291895 -171755
17418 -171755 -148063 -76440 77602 131163 166828 54830 -25673 -118303 -190337 -165221 -113945
17407 -113945 -84420 -82004 -169997 -138522 -117728 -150611 -121203 -133330 -110627 1068 145254
17396 145254 341143 355947 298239 147867 99798 86868 93506 94981 -47314 -112660 -50179
17385 -50179 -31090 9540 93726 226763 219087 167922 119429 54899 -14030 -22756 -32232 -103624
17373 -103624 -117881 -23093 -86543 -148437 -110576 -78673 14305 -14110 51949 125642 102736
17362 102736 98922 187714 154823 19650 -66015 -32418 -52156 -252100 -220068 -57082 -2412
17351 -2412 -3201 -40569 -46104 -47987 129175 78103 -14246 -11123 -64690 -111516 -141613 -170989 -138847
17338 -138847 -137590 -106630 -71818 26283 -44164 -104349 -120115 -98217 -81258 -117598 -28848 32692
17326 32692 47993 -4963 -19030 -34512 -207532 -348768 -310313 -234509 -91 60197 -46032
17315 -46032 19274 3815 -10765 -2709 -100973 -155666 -236603 -208699 -71812 -95731 -77747 -18599
17303 -18599 -46784 -77744 -103440 -14865 68524 30260 -65739 -605 -13819 9237 21666 66448
17291 66448 -61299 -171474 -62773 -58000 -152982 -146060 -96733 -57155 -65637 -47041 6089 -11986
17279 -11986 9812 -14245 -99763 -155973 -47516 -146215 -193684 -202253 -149987 -40963 -69594
17268 -69594 -114619 -80231 -76280 -8280 -38960 -89306 -50014 -118961 -215683 -223103 -244062 -224000
17256 -224000 -133450 -64743 -108038 -174403 -220055 -149831 -24733 97582 97952 2914 -113136
17245 -113136 -91501 -83389 -200587 -130515 -101223 -115893 -87410 -128477 -279420 -121494 12532
17234 12532 17607 35031 -45578 -76452 -115390 -172797 -100533 -173873 -260393 -252822 -341687 -337748
17222 -337748 -145384 -25204 -55977 -126569 -140542 62852 -77747 -184001 -171206 -72824
17212 -72824 -68334 -45446 5183 -126049 -148064 -100032 -136656 -225586 -256603 -90445 -23640
17201 -23640 -82484 -36491 27862 -91129 -116489 -71024 -10053 -39237 -117906 -216934 -138043
17190 -138043 53144 3193 77475 -31381 -166502 -179881 -139519 -158661 -225321 -312912 -221338
17179 -221338 -283214 -287533 -163280 -171053 -128263 -105644 -47165 -14098 12853 84057 5993 -124040
17167 -124040 -117818 -24343 -36148 -40811 -68479 -101883 -170537 -246952 -143181 -48938 -64849 -162996
17155 -162996 -234821 -213139 -247217 -263497 -170196 -96258 -72833 77276 222138 233153 113614
17144 113614 -18355 -123753 -195691 -281279 -206932 -226105 -21137 149668 386353 624483
17134 624483 815458 869608 702855 443656 149438 -19061 -17168 46343 29126 -26382 -5086
17123 -5086 -107681 -85001 -77447 -77680 44661 68732 54944 -44032 -86148 3073 128914 100629
17111 100629 31945 90471 106270 -62281 -122513 -117956 -92718 -100611 -51941 -49296 19102 322621
17099 322621 530990 533174 396404 217046 71729 -71179 -144612 -112665 -155179 -185880 -89486
17088 -89486 -54558 -40854 -97726 -103265 -117769 -58687 10294 -6945 111746 46051 -77995
17077 -77995 -123522 -198160 -218169 -49948 111963 93780 -54605 -116632 -34188 -89286 -197951
17066 -197951 -210185 -248407 -259997 -189252 -205156 -150298 -183011 -155037 -68237 -49440 -86262
17055 -86262 -94169 -76498 15971 28190 -65551 -75478 -37757 37304 49955 -25897 -101374 -46453
17043 -46453 22960 17239 45864 34108 22194 -43005 -35011 -87378 -239079 -207370 -194113 -270278
17031 -270278 -159367 -119719 -137125 -143308 -84799 31089 81386 131435 -13391 -47969 60261
17020 60261 93671 -56756 -84150 -114092 -175841 -212453 -216213 -267193 -280641 -248250 -149816 -187946
17008 -187946 -194544 -301991 -387558 -378284 -253496 -107180 -77738 -53955 -85682 -47340 12795
16997 12795 -30668 -27608 -45543 -93048 -91835 -98539 -202143 -171254 27795 125848 40917 4363
16985 4363 -7478 -48768 -79955 -262956 -343217 -100198 6742 -77390 -121594 -205754 -198279
16974 -198279 -72930 19448 -18652 -33363 12463 135288 61173 70552 47449 -79708 -146044
16963 -146044 -112750 -130588 -112588 -112657 -152374 -137219 -91129 -5474 -10234 58949 -63410 -125182
16951 -125182 -140097 -22949 80643 69793 -2944 7485 33303 -9320 -20123 60728 69848
16940 69848 67341 101201 118368 23452 -10620 -107815 -83573 29950 2905 -55432 -113856 -65536
16928 -65536 59095 83127 113038 37235 26406 67376 127931 140076 159253 205298 157806
16917 157806 20204 -21468 143608 184975 220999 226112 170326 51030 -4893 38354 -12856
16906 -12856 -14731 78141 143532 53360 12390 106579 94244 43478 -137293 -149104 -163045 -89132
16894 -89132 -25464 -132129 -54182 -11305 -73517 -67488 -21370 -40689 48581 115913 161859 11353
16882 11353 -158324 -175574 -173404 -164508 -84832 -30208 -56476 -61497 -97853 -18707 22365 817
16870 817 -1916 56838 39371 38875 105694 58570 -81771 -60071 291 66043 38969 18565
16858 18565 30969 -34584 -86268 -95709 -126116 1740 41059 -8299 -46664 20088 -24560 -100745
16846 -100745 -30699 -100949 -91206 60800 76832 109866 132523 94071 9898 -159997 -175596
16835 -175596 -90889 27933 102220 65741 138589 163472 118960 75557 58432 -19963 -26860
16824 -26860 -19189 -116134 -93931 -50183 29513 -45408 -100371 -120497 -31459 41173 23198 -60233
16812 -60233 -120180 -144304 -68593 -2625 -13037 -17024 86004 -26435 -80892 55712 94151
16801 94151 -10597 73143 145878 143408 94654 68682 7874 -16820 26957 -14001 -33831 -30495
16789 -30495 -146764 -103242 61372 143626 129895 169703 172945 95371 27714 -160795 -211922
16778 -211922 -215700 -170318 -163035 -153054 -84585 -144027 -135611 -166746 -201719 -281145 -272240 -258182
16766 -258182 -171177 -75208 -73850 -157317 -202698 -258402 -225890 -199954 -87461 -38969 -25972
16755 -25972 -143874 -86236 -12174 137269 96480 184994 180206 45645 -81773 -96484 -143668
16744 -143668 -168851 -140893 -74851 -85477 -39454 -47350 -27402 17302 -163587 -244880 -213801
16733 -213801 -119884 63726 41861 47396 -44580 -94919 -74079 -24647 143908 164207 64668
16722 64668 36756 21671 20447 -2839 28624 47525 26968 -31476 -120616 -140016 -111580 -53398
16710 -53398 -65579 -152400 -132326 -173631 -199274 -195455 -158478 -29748 61871 88103 48058 -5403
16698 -5403 -66095 -54995 -131342 -134024 -34133 -33529 -100470 -38358 15124 -83479 -184069 -89554
16686 -89554 16955 -44941 -105901 -87518 -46304 -63208 -173027 -175836 -73075 77575 12004
16675 12004 -71450 -188104 -235723 -135951 -139628 -28332 13364 40448 20934 8273 100234
16664 100234 169538 57659 -91553 -205310 -352149 -338664 -251496 -185587 -101659 -100045 -24616
16653 -24616 37871 134265 131096 171830 134423 193610 165941 217661 194128 101915 -35834 -24682
16641 -24682 -71937 -104351 -101461 -176472 -145605 -71337 -49472 -112419 -162695 -144150 -64372 -115958
16629 -115958 -98133 -72665 -53364 -164491 -281881 -268060 -197040 -61320 9315 -15885 -70751
16618 -70751 -122278 -54116 75207 103194 43377 49934 13741 -74949 -39534 -34210 -41512 -105459
16606 -105459 39160 79092 114028 128280 21143 -69619 -39953 -21367 -101506 -116586 -124614
16595 -124614 -106609 -196898 -197329 -107776 -46025 -54066 64907 32083 77111 60923 79154 43604
16583 43604 -19770 5585 85717 77034 -39145 -112226 -79267 -204769 -211232 -130229 -80653 -280649
16571 -280649 -297291 -314261 -337149 -315712 -294708 -166211 -187171 -103776 -125460 -183813 -121392
16560 -121392 -47962 -22926 -14076 -131374 -129000 -59593 36191 94180 105321 125429 60429 -20532
16548 -20532 13860 -56603 -54898 -40083 -27388 -14227 -64247 -20401 9800 16968 74520 74374
16536 74374 8728 -25671 9067 19986 -82607 -51005 43395 22376 -31977 -169866 -127625
16525 -127625 71266 148122 70153 -74769 -59439 -81450 -90302 -46346 -123933 -24748 104664
16514 104664 67506 116031 131647 68378 51136 92042 49705 43917 150427 107340 92247
16503 92247 9694 -6840 106425 83085 -27175 -146414 -162482 -130036 -84029 -11783 6529
16492 6529 -51143 -102663 -117162 -196687 -264201 -379124 -388035 -273872 -242910 -165567 -117653 -131046
16480 -131046 -175645 -125165 -90263 -136360 -162956 -126824 19762 -38818 -101049 35887 17445
16469 17445 -90730 -128982 -60873 -179766 -186452 -80269 -52801 -50149 -7701 -14760 -50039 -142994
16457 -142994 -141532 -156171 -198873 -214876 -137312 -110394 -108396 -128916 -178772 -200302 -172736 -204252
16445 -204252 -188598 -146257 -132120 -204578 -186337 -221957 -279011 -140274 -93271 -174222 -140514
16434 -140514 -49269 -29541 -48611 12554 23349 -56749 -144258 -197672 -163093 -127115 -107297
16423 -107297 -175042 -254161 -169726 -157812 -37947 41230 -26389 21802 -89110 -218595 -181335
16412 -181335 -147948 6545 41316 125082 17348 -96159 44840 111312 2971 -55577
16402 -55577 26708 -57117 33006 52612 16372 5270 -8747 -57832 -105827 -1627 106770
16391 106770 41419 -45611 -97280 -135018 -54195 41046 59331 62529 -21084 -145018 -80907
16380 -80907 49314 27785 -117099 -4863 -57545 -25300 -33233 -85729 -193029 -116240 -119885
16369 -119885 -171347 -107412 7210 25411 -142465 -242827 -174098 -76337 -16406 95098 61431
16358 61431 50235 23141 -88996 -183726 -237467 -161329 -156817 -162876 -64839 -27368 -106088 -216688
16346 -216688 -247367 -146549 -71046 -201186 -304644 -296147 -299524 -279376 -175220 -56980 48692
16335 48692 44004 -40360 -44264 -189580 -160102 -202196 -184702 -26106 -86170 -179632 -110617 -55767
16323 -55767 11485 -35106 -100982 -114080 -55377 -46264 -64682 -23611 104242 35496 -44727 -21619
16311 -21619 -25447 49482 146848 63575 20841 120246 171676 175317 146257 77507 114378 57001
16299 57001 43750 -38778 -84491 -114959 -90241 -60917 -34599 -120888 -248237 -253124 -120405
16288 -120405 -124417 -61751 46539 -46519 -74292 -76869 -124738 -91387 -58790 -66162 -204010 -236137
16276 -236137 -234910 -175353 -129930 -133366 -102259 -92876 -144672 -170157 -108971 -220483 -259036 -261273
16264 -261273 -213370 -173078 -146304 -58938 -72971 -114986 -80118 -29246 -58820 -119847 -115163 -89000
16252 -89000 -54017 -117397 -173956 -99939 -153286 -196520 -228127 -161134 -58119 -43461 -9444
16241 -9444 9138 -99861 -120199 -129073 -79149 -26130 2249 -91752 31745 56721 16737 -26618
16229 -26618 -4112 75548 120167 20638 -120099 -112295 -129084 -71154 -21444 -43283 -121152 -154281
16217 -154281 -147004 -141862 -128397 -124709 -109253 -125627 -77589 -1761 -53995 -65847 -53499 -50156
16205 -50156 -13660 27507 63251 69026 53232 176260 204737 41564 -99746 -177708 -132137
16194 -132137 -66183 36598 33660 -14213 4192 -161612 -139718 -148457 -220423 -305223 -220500
16183 -220500 -171700 -161895 -62114 43390 83935 64407 23816 -41945 -93266 -127292 -155205
16172 -155205 -84901 -25832 -11376 -74281 -216127 -207143 -161955 -185359 -147244 845 140834
16161 140834 -2927 30965 133732 42313 -124095 -138860 -241407 -261738 -185293 -218047 -175582
16150 -175582 -137345 -50561 51077 134529 -8964 23004 -21780 -98498 -83485 -167959 -68604
16139 -68604 -55282 -46268 -81615 -84650 -125678 -81502 -1456 -236 88612 111748 8486 -29553
16127 -29553 -8734 -89349 -152734 -254725 -300724 -273374 -240102 -166408 -51634 -8134 45528
16116 45528 29253 21057 -40234 -119714 -84654 -159127 -63962 38814 98456 83886 123703 151400
16104 151400 7665 -68874 -69451 -71495 -82078 -99005 -6846 67597 103694 177362 194722 126801
16092 126801 60829 69636 72371 -29253 -134867 -29191 -6271 -46928 16622 -81838 -171914
16081 -171914 -216307 -155127 -115403 -52961 15343 -98179 -218262 -88906 -118953 -167460 -50997
16070 -50997 144491 153605 -35805 -82551 -99443 -106060 18823 73445 -18276 -67451 -120379
16059 -120379 74284 71401 -79805 -165979 -72077 -119709 -126206 -61315 -46103 -134896 -198869
16048 -198869 -160149 -129265 -22281 45433 -25326 -72568 10214 76224 74224 -32092 -52516
16037 -52516 -108663 -213585 -243117 -223251 -214418 -165286 -77947 -98188 -110605 4845 105407
16026 105407 11705 44166 49272 -36827 33893 -21930 -118983 -89904 -103836 -161420 -138260 -4095
16014 -4095 54916 24420 58296 -64766 -157705 -135593 -148547 -157170 -171504 -128254 -75931 -147525
16002 -147525 -184958 -236934 -204399 -174530 -184860 -130801 -179981 -289304 -138297 -132107 -188593
15991 -188593 -261659 -355376 -353791 -221362 -72228 42648 -4403 -156475 -119173 -187318 -192667
15980 -192667 -163172 -159520 -156794 -156449 -201135 -100077 -42970 5312 -1418 -36821 -44596 -4388
15968 -4388 27993 128975 68041 22653 -28595 -32892 -91987 -79964 -137078 -143409 -4540 -25031
15956 -25031 -17772 -71722 31783 -14629 -93703 -83533 -103975 -83827 -34849 -45159 -38315 33217
15944 33217 6100 -1743 -59717 -91688 1598 -38713 -97169 -99843 25494 92753 52676 -76696
15932 -76696 -121379 -96922 -78717 56853 182646 154261 132599 116033 1833 -84245 -123107
15921 -123107 -134103 -51134 -695 51641 -10813 -18404 -42322 -19958 -847 -5162 96330 38567
15909 38567 15730 -23455 -75620 -34388 -11395 4921 -17424 -67607 -100971 -135058 -214331 844
15897 844 71735 -20557 -41657 41123 150556 64538 87096 69698 -42738 -211158 -213438 -141676
15885 -141676 -108193 -131341 -151779 -39451 -193133 -200284 -177720 -102989 63224 100831 147158
15874 147158 24499 -134438 -40397 18347 -66656 -89082 -81737 -147082 -267232 -260872 -226399
15863 -226399 -98524 -49171 -51672 35925 70238 33545 -76290 -69627 -115301 -144208 -34792
15852 -34792 -5700 -65976 -81697 -48840 -186006 -220933 -155922 -16933 -42480 -82054 -19030
15841 -19030 41798 93247 95784 63703 136491 251307 207052 182996 124194 3144 17549
15830 17549 73378 110581 133652 138459 82801 88237 44046 -46039 -62389 -56239 5526 -10101
15818 -10101 -170187 -164717 -102307 -110724 -8042 14587 25040 -112683 -129265 -212802 -170959
15807 -170959 -131881 -211369 -54593 12015 32461 -84406 -255722 -287211 -201637 -188742 -282338
15796 -282338 -311884 -277553 -171431 12041 -3143 -53803 -27417 -30949 -94681 -71858 -49352
15785 -49352 -201464 -228346 -162035 -170772 -252928 -187780 37314 130741 46662 10800 -37421
15774 -37421 2699 22570 50080 90647 95607 54039 101366 133470 80670 -69331 -130832 -89656
15762 -89656 16554 -71046 -59272 -76732 -93346 -130614 -56198 -37922 -148640 -234810 -133666
15751 -133666 -28884 11138 60357 47752 -76811 -205718 -130235 -51736 -8116 -148684 -201989
15740 -201989 -197668 -277773 -296733 -333019 -172011 -43412 29231 112020 131689 -4613 12140
15729 12140 -48889 -101636 -85493 -110481 -98141 -127283 -121764 22696 132557 111992 96483
15718 96483 97461 147504 117893 205586 173492 78729 119172 94525 159576 51910 -8205 -35777
15706 -35777 -156883 -227699 -204079 -199923 -155566 -121213 -41833 -78317 -147142 -89482 -173559 -110778
15694 -110778 -30906 -9693 -41364 -35058 -138016 -159072 -31754 58994 -56500 -170765 -148366
15683 -148366 -136864 -195349 -140372 -47616 -92471 -103730 -15455 92332 141607 34043 -67623
15672 -67623 -107486 -88008 -47054 -69533 -78416 -57189 -28726 -52111 -54929 -76363 -96639 -105656
15660 -105656 -138697 -221807 -322348 -184431 -154510 -52479 22957 87635 -20916 -162704
15650 -162704 -176993 -141361 -116893 -53524 38910 50569 -56427 -63462 -19329 24637 7598
15639 7598 -113462 -158383 -63295 -72911 -64157 -149425 -155846 -33216 -37512 -1059 -11232 10061
15627 10061 -85612 -148182 -159554 -121364 -124177 -107988 -220116 -207375 -117063 -89900 -36222 -10572
15615 -10572 15830 42209 -88779 -156873 -43417 58674 83316 11146 39455 102297 27273
15604 27273 69524 20488 -59949 -113143 -27052 126305 192757 128494 66886 40762 56878
15593 56878 79030 47497 37756 119246 129970 -2052 -36549 -29207 -82622 -86883 16955 80087
15581 80087 59486 35884 26420 -6730 -12511 23409 146962 187618 119652 -6429 -28373 67821
15569 67821 118710 155362 156467 73614 -54252 -185800 -150086 -140522 -163238 -95197 -83359 -24129
15557 -24129 -73359 -93206 -31122 52932 75699 -32449 -98335 -5984 -26633 -150716 -300158
15546 -300158 -206077 -247813 -397638 -441270 -265035 -62203 -25697 -12350 -125899 -185167 -108925
15535 -108925 29242 145113 98602 -42994 -132673 -155136 -99902 -54683 -34178 124695 236199
15524 236199 150598 154490 130766 -4539 -168276 -205653 -165871 -259209 -345894 -248363 -104884
15513 -104884 19561 -26946 -98094 -77664 -231094 -309748 -138540 29894 37666 -28082 9079
15502 9079 47912 111608 55030 44158 23800 -139333 -231415 -66366 125352 143244 26314
15491 26314 -16610 75127 132567 77843 61156 -42795 -182604 -173448 37911 38015 -10739 -44895
15479 -44895 -7469 13904 -15073 16247 65672 65269 45464 29795 -11456 -129175 -221718 -128018
15467 -128018 -142219 -144920 -195489 -344676 -162242 -56515 -13111 -33403 -55697 -88569 -174184
15456 -174184 -237466 -294917 -242095 -190248 -228136 -110654 -72078 -187380 -138337 -22674 -15214
15445 -15214 -20335 30027 40597 66474 16544 -37345 -112344 -189185 -301121 -352329 -227692
15434 -227692 -246848 -285944 -236638 -136071 -75276 -65215 -82008 -72140 -74692 -7361 60807 -27039
15422 -27039 -48684 -26303 -11584 -32374 -108123 -87537 9903 17705 41843 165222 188198 239560
15410 239560 197634 127285 212749 86138 -13715 6403 -66487 -116835 -241373 -284794 -183084
15399 -183084 -59656 -103617 -70711 84445 238128 168140 -87726 -131131 4743 143369
15389 143369 15597 -183286 -179872 -166860 -129951 -95209 25281 107907 118340 194945 187026
15378 187026 59349 -15917 -36881 -1113 -61584 -36841 -94714 -189846 -203000 -142980 -126065
15367 -126065 -133068 -40683 -124692 -147518 -124113 -63239 -25537 59597 24556 12253 7099 128782
15355 128782 148755 155163 123193 51101 100998 188175 47286 -20756 -1837 -31025 -70545
15344 -70545 -56950 66682 58982 60713 61986 -68149 2161 18112 49684 171075 200497 119321
15332 119321 128155 121687 129572 56924 28112 -107068 -151184 -145978 -216417 -113065 14075 17410
15320 17410 56946 10164 12130 -100344 -69179 -8166 20280 8554 -37435 -25603 85793
15309 85793 58223 54129 3891 -42027 -50045 -1003 -39733 9178 -81898 -174725 -261086 -222916
15297 -222916 -162280 -157524 -113719 -95210 -138842 -172868 8136 -7803 -79258 -92869 -77666
15286 -77666 -19799 4644 147303 271595 166012 100249 67835 59741 80377 42916 2978
15275 2978 -49595 -154070 -101637 -71385 -81220 -4422 -79241 -247834 -217178 -121913 -117850 -41443
15263 -41443 -28155 -58430 -65863 -7270 -3066 -31336 -60180 -163718 -235569 -313815 -314839 -132845
15251 -132845 68268 74473 -20000 25576 88018 131765 92428 -44579 -65101 -43819 -83128
15240 -83128 8252 -60430 -171073 -233730 -157080 -205646 -138689 -118438 -217357 -292127 -228846
15229 -228846 -3385 35119 14924 -138770 -73248 -91279 -71238 -114634 -22103 85048 101694
15218 101694 68440 83934 49768 -117026 -146019 20197 93175 20595 52104 -8446 -136410
15207 -136410 -85877 -113236 -100598 -149234 -163085 -138475 -136207 -177482 -71573 -74676 -154376 -169466
15195 -169466 -176830 -306876 -314820 -255121 -200910 -182818 -88461 -51777 -133387 -232785 -212237 -139682
15183 -139682 -154661 -147049 -142286 -81117 -50549 -97134 -162615 -65786 -41799 85276 114498 74074
15171 74074 18023 -114598 50049 144995 251850 213539 37196 -30094 33028 123127 110491
15160 110491 73702 -7287 -45015 -15955 24026 15243 -7830 -14368 -24143 -46056 -36460 -78853
15148 -78853 -18696 42930 -65067 -197623 -160491 -171496 -285664 -239046 -109298 -18689 -4226
15137 -4226 -75241 -138938 -251168 -119305 -73969 -198526 -207829 -39512 32588 4781 -22320
15126 -22320 -59902 -52049 44065 26396 -44153 -171950 -123023 23803 76078 68812 45495 4416
15114 4416 67972 130740 142461 78391 -31804 -139946 -282948 -264389 -221320 -139551 -27519
15103 -27519 -77042 -54769 -42809 -71168 -123877 -170714 -82480 14102 42801 -8618 -67439 -38975
15091 -38975 -5575 -80472 -81015 -19037 -3141 76180 28964 -52871 70740 102515 -78301 -167327
15079 -167327 -216267 -243074 -257531 -266149 -210073 -192663 -213618 -105927 30440 -28588 59787
15068 59787 110836 100044 107196 158223 204742 123319 84446 48331 -3100 -67850 -122199 -45118
15056 -45118 -99338 -81727 -8467 -45136 -62530 -22896 78564 251798 240408 -8961 -53744
15045 -53744 -83041 -194344 -290019 -220734 -192296 -89199 -9051 -77613 -83774 -58924 -29838
15034 -29838 -124208 -172507 -49862 -18798 -146098 -145065 -76784 64253 88415 26141 74599
15023 74599 99631 16177 -9471 -2261 7731 -3011 -46595 -11442 197 65370 60881 71020
15011 71020 26745 -9222 -19037 12261 24528 41803 -44162 -67218 55630 113036 48311 -22693
14999 -22693 -48417 -57375 -116792 -108531 -10669 107419 60446 65622 125246 102655 -21565 -156658
14987 -156658 -133636 -97974 -120916 -164741 -218894 -355859 -265459 -54708 56094 10986 47060
14976 47060 25637 -46066 -69942 -42390 -19509 32284 31075 24393 -97830 -271684 -313472 -51912
14964 -51912 13066 -84274 -15569 67184 108058 8224 -53520 583 99420 -4474 -150682
14953 -150682 -205806 -195483 -199541 -96960 -110086 -130484 -117019 -11893 24096 221258 254530
14942 254530 198594 53017 -151931 -211710 -346435 -305011 -253395 -204777 -124949 2188 16941
14931 16941 -30084 -123901 -75055 -122345 -116211 -91171 66491 217875 264245 134420 74780
14920 74780 -20983 -136802 -92682 -192895 -259935 -108950 -69806 -199312 -109231 -64035 -119670
14909 -119670 -105386 -206154 -138214 16647 37348 -5371 -126560 -193337 -92909 -68636 -188242
14898 -188242 -191705 -49156 -105685 -197619 -256786 -199726 -108474 -137638 -190092 -251420 -194582
14887 -194582 -157051 -172027 -156666 -21715 -54925 -108705 -113397 -56963 -8533 -13004 33025 70441
14875 70441 69834 73141 -29165 -36213 -60080 -80598 -102200 -90200 -103042 73422 88856 -4742
14863 -4742 -119515 -157892 -129327 8275 85708 106231 238804 272071 223311 171354 125270
14852 125270 23111 -3687 -14428 -8911 -14696 -73182 -21905 -19950 18595 57561 -21944 33605
14840 33605 -69103 -66363 -85187 -87190 -22947 57344 130750 94391 126405 211231 227754 158053
14828 158053 124396 179021 110349 52082 53918 53782 131071 75682 -66686 41457 226206
14817 226206 250610 203071 149547 104142 185121 401315 456740 477683 486820 426533 360825
14806 360825 421677 445419 344844 244907 195401 228290 241184 229009 303209 512712 467249
14795 467249 449414 407290 396554 409344 406530 398395 373744 296452 321402 196347 106695 21069
14783 21069 173167 338202 339190 266717 350927 345969 384153 351265 199204 188894 254225 301374
14771 301374 160915 31233 -80443 -93059 -98989 -88872 -70004 122811 165394 127653 129930
14760 129930 83991 29205 -37268 -64765 26967 -44438 -15669 82736 154246 127552 199583
14749 199583 272477 168883 75266 66118 37991 24765 1834 52725 -30271 -88180 -44074
14738 -44074 93625 133572 75654 61762 136341 215319 167025 176075 249794 355697 373487
14727 373487 268461 308892 253898 341863 437715 493466 403491 315518 332180 366847 386365
14716 386365 381517 416901 361050 408091 366943 368877 331488 318314 367289 440105 465230 452557
14704 452557 329699 269665 271360 340797 313127 212841 214165 211457 306592 373772 398329 497679
14692 497679 655773 551545 351425 197713 259339 258592 397962 362042 336760 256994 232010
14681 232010 236093 198190 224366 166383 104285 37243 10170 77981 70343 55688 76941 51896
14669 51896 21474 -4479 -57475 -55325 8073 -31209 -47361 -67652 -61199 -80374 -75048 -58385
14657 -58385 -88790 -22448 -76853 -247541 -264791 -185018 -125283 -186542 -200235 -185106 -185498 -131953
14645 -131953 -33773 35795 32731 36586 105717 63762 33382 -88736 -117052 -78823 -87354 -70579
14633 -70579 -60542 4678 134851 97560 69564 91728 118536 222064 149219 123755 51556
14622 51556 -43678 -70751 -118784 -86925 -54544 -103817 -77829 -89623 -178097 -245949 -71143
14611 -71143 -65468 -28796 36708 163081 115111 66917 33549 -52182 1750 -28931 -49189 -44042
14599 -44042 -42581 -45824 -122893 -116728 30135 175425 163566 134957 46590 104533 158670 -34717
14587 -34717 -134937 -137551 -128905 -114679 -148496 -140551 -80554 -65110 -103314 7045 18596 -74335
14575 -74335 39849 174014 63323 64183 325477 447398 481775 574436 627305 590467 559392
14564 559392 560202 449216 351524 345778 272213 252568 272220 264622 196393 124673 225668 281626
14552 281626 182058 132606 94801 151361 166572 101533 -7661 -111142 -201805 -184236 -71961
14541 -71961 -24186 33168 17702 160769 69281 -79867 -236437 -112748 50232 171925
14531 171925 273533 195822 227412 236412 235425 171611 119530 120738 119848 91249 168320 219566
14519 219566 184017 180752 68101 14413 39222 110653 200778 303371 137413 19839 -51185
14508 -51185 -25953 164565 297508 195025 138502 71373 52629 -2076 -14448 82808 77306
14497 77306 169480 143907 88837 123190 202854 255465 138476 86312 -1619 25061 54836
14486 54836 76579 60356 103055 126162 65130 -5246 80808 167955 268403 272895 374290
14475 374290 361502 308326 225251 113672 115694 163835 110692 108324 51152 17643 50974 126959
14463 126959 153370 127700 177114 222422 229536 229326 192586 271467 342543 284156 159371 220930
14451 220930 256561 195656 237664 251591 221219 140108 60600 229878 236891 173642 231793
14440 231793 255527 326659 369049 301679 350459 439108 542509 627352 559319 382089 366452
14429 366452 468285 484943 493987 622570 723615 687949 641742 742523 830503 974565 1021896
14418 1021896 946714 890477 990778 1108296 1100966 1073703 1221292 1503922 1531326 1648499
14408 1648499 1762951 1934107 2121506 2389735 2573680 2790474 2874629 2918915 3118593 3468644
14398 3468644 3779699 4105456 4489426 4994251 5681828 6621478 7687314 9122687 10850148
14389 10850148 13171264 16071864 19326886 22752231 26186062 28984034 30999402 32465083
14381 32465083 33718145 35246569 36843341 38622910 40759016 43321741 46508534 50583474
14373 50583474 55261627 60137269 64278779 67129289 68333949 68118141 66738730 64751392
14365 64751392 63127024 62521663 63483311 66787031 72173998 78629854 84744402 89287846
14357 89287846 91676043 92013935 90910011 88412793 84429448 78983363 72894518 67302838
14349 67302838 62971622 60972411 61472327 63772874 66690232 68685975 69434745 69349067 68764987
14340 68764987 67309469 64539615 60704583 56560906 52797523 49902326 47981480 46903301
14332 46903301 46227709 45984390 45878114 45602006 44940884 43540137 40935030 37029106 32532844
14323 32532844 27976439 23901495 20540361 17866745 15764145 14055719 12789980 11719588
14315 11719588 11111269 10706644 10300305 10073248 10029254 10086086 10319697 10837585 11573570 12487716
14305 12487716 13705360 15321448 17700551 20753802 24473030 28917009 33578479 37736891
14297 37736891 41358913 44067719 45843353 47073681 47710899 47981797 48373899 49497583
14289 49497583 51920182 55635816 60386503 65646542 70773502 75215003 78299115 79777610
14281 79777610 79326706 77429614 74827891 72666773 72320846 74389196 78648907 84533047
14273 84533047 90570686 95141638 97458861 97817712 96633504 93757009 89136999 82874243
14265 82874243 75874725 69381351 64230456 61537201 61175577 62772137 65708909 68995041
14257 68995041 71817764 73634139 74030995 72824691 69831033 65485234 60552187 55905737
14249 55905737 51763769 48323435 45599153 43435064 41673588 40363821 39504859 38950544
14241 38950544 38376146 37004289 34533674 30954248 26634892 22407194 18702039 15623829
14233 15623829 13057699 11037728 9513887 8361405 7536539 6916197 6269930 5594182 5183076
14224 5183076 4783060 4410465 4113143 3900446 3635425 3459468 3222384 3061937 2981777 2702207
14214 2702207 2532641 2427367 2358490 2254183 2160827 2083637 2034404 1949479 1958773 1974314 1952704
14203 1952704 1966582 1886533 1834852 1874792 1893111 1770881 1657228 1596772 1578440 1539906 1580355
14192 1580355 1637547 1606008 1603067 1543747 1405942 1420239 1442770 1397793 1292247 1204241 1206421
14181 1206421 1206944 1129232 1099712 1113671 1088276 1072008 984004 966837 991201 1004052 919781 939353
14169 939353 910875 1015090 1031389 894081 886655 966902 914227 771904 748299 831080 775569
14158 775569 814936 930980 857037 819425 913793 877925 657824 598813 672731 567102 532626
14147 532626 552914 457735 326736 353658 327533 392232 318350 298612 332292 360075 436737
14136 436737 425500 367330 342138 306298 350299 431484 406023 249588 286479 533297 583440
14125 583440 561384 444302 324285 215151 52776 109400 216675 232328 255854 223406
14115 223406 169058 92158 238070 232177 142260 125558 200663 314920 348501 329049 334052
14104 334052 328760 342204 298431 283854 164248 220563 241448 193505 254798 347588 309485
14093 309485 273985 253290 183114 182199 272332 300128 208323 175605 269932 244924 113535 156965
14081 156965 234234 229635 120546 21537 61434 105870 187575 322101 178121 127884 178165
14070 178165 158718 187154 253932 337083 361707 343350 317920 250143 234827 200957 236748
14059 236748 116095 7494 21087 157453 251590 107329 43161 114380 250479 361986
14049 361986 289211 247151 226027 246789 227062 367925 502321 513596 438630 352199 230325
14038 230325 244145 303103 204497 256092 251609 228075 217500 295361 414776 438047 374114
14027 374114 307182 216825 224068 128228 73946 184745 264412 267115 277442 389831 277090
14016 277090 108111 153853 191324 114770 68164 93674 165007 245781 190249 196860 294506
14005 294506 394668 321660 262136 165864 131815 223842 343022 359091 310027 209602 182678
13994 182678 203881 331635 308242 350928 411743 429351 396051 437799 442970 447446 568709
13983 568709 633717 717416 862552 1014803 1129055 1161815 1168662 1070523 1082201 1047753 934346
13972 934346 766914 556397 396603 409176 387694 477920 506332 463868 502482 446290 298740
13961 298740 226182 228133 267838 189855 133165 54178 57394 70631 102211 136754 146018 256516
13949 256516 248627 230897 293467 273306 239074 307627 261162 181059 203498 245959 277318 330304
13937 330304 404399 390160 452655 532282 570216 452462 332241 288722 329547 414939 339342
13926 339342 338067 479607 472713 434241 509529 474880 447669 511029 552919 529967 559718 581416
13914 581416 615233 573833 456782 541709 582050 630393 520792 412492 357582 322057 362688
13903 362688 386759 390716 457027 455470 505802 443886 398193 364311 332024 372237 230266 242489
13891 242489 237284 242404 293064 254742 184772 166991 135708 268709 180816 302329 302874 140856
13879 140856 -9333 91247 253204 292142 303498 283564 281690 252712 199390 172386 143240
13868 143240 84454 192857 195222 85787 15108 39187 59197 55163 37808 117574 183696
13857 183696 202877 245556 212449 310719 274983 290940 421230 380465 334765 405872 484045
13846 484045 500722 336569 196455 283612 431484 437445 537576 641879 619839 567973 518786
13835 518786 544644 421270 441276 423555 491237 591135 544862 586568 607509 655613 589514
13824 589514 549130 663578 681012 530779 383488 327638 324848 483500 460250 450006 492749
13813 492749 627275 628489 565401 435904 357377 331666 288134 382261 365665 257723 197337
13802 197337 206913 10307 -28240 151603 249609 297075 396892 309442 272151 293183 207850
13791 207850 147565 28548 -3572 -53051 -135587 -108213 16504 179477 252275 264070 168177
13780 168177 63399 -158925 -238270 -51808 54773 20986 11918 81919 66610 -16212 23837
13769 23837 20293 -30075 -21266 -34438 -123573 -202345 -142106 -96780 -151343 -146925 -132751 -130755
13757 -130755 -105215 -36257 13056 -21691 34862 7274 -31708 -12960 -90093 -50891 30409
13746 30409 -25486 -78839 -15220 120908 126109 101213 -17780 -41675 -3594 -37408 -131518
13735 -131518 -138861 -53033 -10713 -67931 -22960 77184 117725 149851 191239 292462 193452
13724 193452 54995 -2367 3088 -76821 -106806 10780 41984 -109569 -153400 -172671 -154923
13713 -154923 -87346 -70834 31 -63084 -22729 -4194 -13395 936 -14674 -99264 -148106 -122735
13701 -122735 -201184 -116054 -134025 -190592 -166882 -84136 -32083 -78692 -104593 35862 -3617
13690 -3617 4688 -58210 -139295 -151052 -42090 -152447 -197737 -136682 17648 71503 7576
13679 7576 -123190 -154887 -76405 -65914 -100593 -40578 133536 223984 204326 202083 157794 87920
13667 87920 109988 96392 73811 -75898 -126537 -91872 -69160 -85267 -41594 47423 20407
13656 20407 -52530 -41532 17512 60467 52093 13442 80867 135362 99265 -25649 -152711
13645 -152711 37829 98126 58673 79793 -12182 -59305 -132778 -170893 -87166 -75348 -29545
13634 -29545 -38863 -50960 70188 146555 129880 110834 140195 49980 -51051 -102163 -37701
13623 -37701 40837 -32587 -174624 -134599 -43888 -27189 -4406 -29578 -58039 -39926 34082
13612 34082 26468 41942 -56403 -38110 -12697 -24928 -92328 -113902 -133465 -80577 69699 77536
13600 77536 -51128 -122621 -115460 -94559 -120127 39852 102456 65003 84244 -65745 22552
13589 22552 30900 56753 47798 -44693 -7531 5118 -54492 -30701 88865 122531 17273 -10938
13577 -10938 63715 -66281 -254731 -224270 -184355 -122605 -66037 -105918 -118976 -115371 -17017
13566 -17017 130874 153640 170684 115137 127659 160127 105240 41718 46446 26024 -41465 -36088
13554 -36088 -47038 2002 116597 99213 12816 33542 63973 -32746 -60933 -5361 62434
13543 62434 56789 -1465 -29045 48945 77488 -42193 -188953 -136110 -90001 -23354 -77081
13532 -77081 -195715 -313932 -195476 7967 34362 -39146 -98505 -102445 -196143 -234078 -166667
13521 -166667 -115109 59487 39172 -62394 -127992 -138588 -133168 -214211 -179711 -72415 -140565
13510 -140565 -185092 -121782 -166808 -154768 -107789 -98410 -53562 -94115 -198049 -150539 -282808
13499 -282808 -256598 -157181 -241366 -131497 -60921 -45067 -62353 -43170 -51057 -14015 11423
13488 11423 130342 277724 347904 282663 182467 177921 114848 -53570 -55852 -20028 -14654
13477 -14654 -33096 61568 151914 110101 -156922 -65745 67517 73347 4022 68470 -23034
13466 -23034 -103816 -184361 -33150 -9694 -180058 -257439 -174501 -71991 -148846 -127866 -146872
13455 -146872 -226648 -173073 -92991 -92473 -94251 -140122 -150070 -115971 -96638 -85580 -94011 -143833
13443 -143833 -30784 131704 181295 166827 99919 117522 165910 108187 91947 95779 -31083
13432 -31083 -125 -24077 -574 12950 -119319 -106920 15780 -10138 -95740 -178332 -241340
13421 -241340 -115922 -65358 -79992 -96779 -187490 -178980 -158335 -79609 -44359 22583 142755
13410 142755 122256 17470 -110171 -244501 -293754 -207946 -31729 54250 37300 29860 56737
13399 56737 -4535 -47552 29573 122723 17365 2082 37241 44768 47634 32951 26288 -35288
13387 -35288 -54079 -53761 -16932 19426 -59561 -114599 -146834 -230460 -168586 -51016 51046 35416
13375 35416 -29986 -58830 -25194 -78003 -135653 -154619 -151531 -37346 27015 -6085 -206131
13364 -206131 -132287 49205 8015 -102759 -156964 -200367 -205807 -146840 -43410 27945 -132899
13353 -132899 -196422 -100645 -32175 -106841 -106544 -30289 167207 146148 13578 32339 -15687
13342 -15687 -10767 27685 72656 137729 53669 -105667 -75177 -17306 -89752 -131884 -45183 -6561
13330 -6561 -113721 -188588 -253475 -176027 -152866 -179417 -142441 -136225 -131086 -89356 -122677 -58037
13318 -58037 -25017 -22174 -144155 -175101 -92740 -158353 -305174 -404135 -432025 -269367 -175988
13307 -175988 -222481 -200695 -142029 -266336 -305281 -26851 180338 42803 -80199 -117301
13297 -117301 -156770 -89540 -49216 -91580 -195454 -180722 -84585 -1725 -92344 -177606 -235179
13286 -235179 -144733 -278995 -371853 -273850 -341057 -355552 -102836 -31864 -197055 -281751 -225263
13275 -225263 -197398 -178498 -31763 11805 107062 135212 142871 39837 75247 -22686 1429
13264 1429 94019 114204 65692 56813 90911 90303 28452 -22413 -40014 -10590 -8521 1872 14561
13251 14561 -63410 -90588 -143603 -249126 -295116 -247659 -269126 -258240 -156974 -79412 -71124
13240 -71124 -102789 -234955 -299043 -190697 -63442 -82500 -111806 -135563 -86357 -53074 -64588
13229 -64588 -13753 -43649 6061 -28062 16151 75851 95273 33994 11756 -42018 -80241 20867
13217 20867 164032 113753 67925 47844 58876 49235 106926 209929 165087 -1880 -8663
13206 -8663 146425 137092 71612 98102 127139 69758 183282 266069 313767 338971 200582
13195 200582 218282 314276 416110 386849 349243 341681 258055 230322 279129 256850 259542 299755
13183 299755 299296 226921 187871 148784 9494 -6817 156629 252002 296584 247403 173814
13172 173814 142083 83845 -16854 153421 243858 265225 232068 156295 129849 140534 9915
13161 9915 -91978 -7798 121503 136106 199770 131762 146799 238087 133249 -26874 -60660
13150 -60660 -103386 10802 59835 120356 230955 229807 236419 187952 48566 -67631 -155540
13139 -155540 -176778 -24339 109252 215672 166503 181329 229587 186066 67314 -11709 906
13128 906 67976 162576 209648 219350 154115 6746 -48913 -50981 -51673 27635 206443 231269
13116 231269 177525 154369 258244 238539 328523 422027 449710 419629 287922 297680 326444
13105 326444 390902 390002 278724 237398 394264 421225 470965 382533 259644 212532 206760
13094 206760 145439 92241 26298 17794 -6360 -1517 95966 207795 97518 5902 30374
13083 30374 -9046 101123 112883 -11393 12174 -58903 -48356 -33514 35433 -96954 -106362
13072 -106362 -149985 -161960 -132278 -75027 -54611 30321 42949 -34809 -61269 -75796 -111609
13061 -111609 -128076 1545 127731 214147 176361 39512 -7185 -27079 -71180 -103214 -13492
13050 -13492 -49746 -46224 57372 176269 120619 201 -34377 -58089 -117336 -204561 -255409
13039 -255409 -284416 -287474 -437729 -377972 -193760 8403 14850 -26401 -68039 -174537 -115789
13028 -115789 22059 -46263 -42518 -72111 -70097 -78143 -96322 -63826 -92131 -105472 -54854 5871
13016 5871 126903 127521 69719 115241 223688 216025 146292 57177 -28386 28821 100771 -7106
13004 -7106 -114622 -117931 -139972 -113392 -126188 -58249 -108293 -106635 -22194 64826 130447 146440
12992 146440 27599 -32311 -2336 -20796 -6787 -15406 -91224 -197647 -92036 15700 222350
12981 222350 298545 77951 -155133 -109761 -56636 -50359 -141426 -160249 -99005 -42232 -47835
12970 -47835 -28994 6362 -67063 -157 -44956 17863 39599 70454 59761 66856 -56595 -179804
12958 -179804 -84983 9692 -8189 -29331 -79134 -133851 -74815 -149285 -222408 -183815 -116420
12947 -116420 -72406 -17024 -25151 -101533 -90626 -85046 -111444 -82195 51357 60453 -7612 -113211
12935 -113211 -170886 -160077 -100446 -164062 -219167 -133114 -62301 -111009 -144044 -82547 15255
12924 15255 4492 -75627 -6625 164752 202623 269665 442543 479447 476020 533251 518193
12913 518193 501100 499955 462607 332564 226985 172758 189867 118977 142375 321741 437766
12902 437766 376046 216806 152636 147016 144091 240292 166096 11830 -21034 86180 56344
12891 56344 99251 77970 90533 87295 -79 -19011 -28807 38820 52320 102710 51590 89916
12879 89916 187800 200187 322258 523366 447210 457270 450379 341946 147677 52870 149819
12868 149819 102580 -4691 -40164 24061 120185 223468 208361 121220 45205 105582 127171
12857 127171 95328 17737 62351 9774 -30607 -25672 44109 9132 -30188 -83013 -51766 32655
12845 32655 75600 126201 193229 109460 -27028 -171919 -296281 -174746 -184645 -258618 -172894
12834 -172894 -36707 -9418 3780 152193 153328 115414 134266 56352 -3452 -93140 -71298
12823 -71298 -49865 -35984 -109597 -44007 37008 38872 4362 34466 74693 71749 81180 252451
12811 252451 235331 181972 143434 -111728 -341671 -380554 -293255 -216949 -298093 -247250 -169596
12800 -169596 -116399 15148 -53739 -41582 48644 12042 -58015 55594 69535 68698 77374 130923
12788 130923 87081 68087 117811 40781 -104352 -95072 -67506 15644 46563 54415 233603
12777 233603 232873 174027 2088 -9758 -34299 972 59409 89387 30863 -148993 -277693
12766 -277693 -265691 -160430 -124923 -122198 -148104 -149787 -214010 -282895 -262221 -199274 -87403
12755 -87403 -9238 -108463 -211207 -170534 -112724 50457 99795 10906 -166919 -164309 -81743
12744 -81743 9200 -87416 -189168 -204086 -253960 -163201 -15718 -52494 -31993 -9410 -65463
12733 -65463 -80746 -171206 -215775 -152825 -102427 -134084 -174731 -123006 6809 204708 223423
12722 223423 211666 221317 265389 312371 287190 326305 193437 65807 60147 175349 330295
12711 330295 226928 160721 221022 201489 121322 81491 5878 -4629 102242 163135 159685
12700 159685 53485 -42174 -198078 -172336 -39693 103162 131753 262260 379083 652532
12690 652532 709017 702958 821801 1044904 1199544 1345353 1407418 1344059 1139536 960397
12680 960397 797281 776120 665166 617986 585367 513167 538754 543439 425204 354278 285067
12669 285067 253974 288308 352431 326734 216696 233899 204887 284498 369585 372195 335017
12658 335017 378113 453710 559006 640008 581135 592250 634143 783180 846054 986276 1134811
12647 1134811 1260291 1250047 1069268 907354 701793 533120 422783 362328 251132 114341
12637 114341 114887 185036 164960 131879 76840 17008 47293 197154 254117 151442 -66812
12626 -66812 -126301 8320 140860 209184 248183 213654 69977 -61884 -57912 -54174 -82463
12615 -82463 -217514 -148504 -8110 -39654 -84789 -49172 -78700 -22656 -13816 90985 71967
12604 71967 19589 -8633 52068 55843 136050 201494 197922 241924 257417 73956 9588 -9017
12592 -9017 -57009 -39221 -45939 -51481 16999 8946 -57701 -133404 -282250 -241625 -76570 174235
12580 174235 190454 167397 117641 78675 105651 129415 268543 497062 835681 1071298 819175
12569 819175 553994 495720 499502 516776 348668 314344 484166 529778 558605 591696 523150
12558 523150 411986 632867 694661 634921 451969 290212 362260 472121 434243 341980
12548 341980 405104 408715 403661 578187 678976 600938 575535 561563 656157 710251 811527
12537 811527 985414 1022795 986303 1018997 1102149 1212244 1508171 2004267 2322806 2110427
12527 2110427 1648140 1287457 1063200 987257 971112 834819 824769 836768 867183 904329
12517 904329 958135 969047 1007385 1126400 1078421 861125 689043 603225 615322 656245 680811
12506 680811 777759 736517 665581 588919 500201 475091 482478 442100 456345 498376 539567 593825
12494 593825 761758 841121 696055 716070 816248 846683 926539 925045 824864 576192 460208
12483 460208 370119 268460 187963 167776 225396 420341 497027 385941 170630 166709 222300
12472 222300 301590 255506 316990 371380 452180 509457 478577 442818 355594 313395 346114
12461 346114 383471 579608 537201 423063 301263 212126 232731 292526 196716 105627 125682
12450 125682 240877 223034 101291 46970 191130 207699 177127 143421 23370 6307 61468
12439 61468 131188 145056 207408 180794 230332 320320 312669 172260 82546 41447 47881 114808
12427 114808 64131 -48528 41038 53174 134167 371259 489810 453266 364899 197685 67384
12416 67384 13429 -63246 18141 132906 149835 177308 173140 195473 170376 142948 145442 83239
12404 83239 -30659 -12952 375 29479 78616 171375 239372 228243 255177 223369 266548
12393 266548 295814 283464 178750 153700 76519 -9758 -51799 -10007 3536 44903 25495
12382 25495 83066 43643 62057 157040 185083 269816 274098 171834 185572 234845 288777 338793
12370 338793 421176 459685 346280 344316 414722 349854 356273 418033 401158 289692 169662
12359 169662 172353 113833 160096 158104 259039 229553 269722 236284 273355 318879 348883 364570
12347 364570 365301 428311 498524 409349 284126 190141 234316 214944 218922 323317 224488 241206
12335 241206 407407 503363 475809 469573 502671 602512 758064 866851 723359 596436 615192
12324 615192 597031 449748 420994 535157 628826 680549 638891 617998 731472 894260 907609
12313 907609 879736 954776 974122 906847 985435 1099057 1164952 1180224 1166709 1118968 1231387
12302 1231387 1225536 1318744 1441595 1500665 1548164 1665584 1827198 1976668 2004637 2108340
12292 2108340 2266405 2335271 2518092 2663941 2802688 2930512 3088888 3291401 3531461 3812939
12282 3812939 4149752 4403545 4631265 4867429 5143355 5556961 5970366 6432027 6937009
12273 6937009 7580421 8317730 9133637 10182909 11329726 12503642 13930124 15546145 17148065
12264 17148065 18835921 20662238 22549125 24549001 26496458 28423710 30453908 32923989
12256 32923989 35885128 39384089 44251355 50848004 59872789 71754897 87155752 106761799
12248 106761799 130011797 155560881 180955489 202912878 218251083 224212142 219542444
12241 219542444 205440604 185599026 164113701 143879535 126381459 111892797 100193814
12234 100193814 90573302 82580772 75879038 70292538 65507401 61542575 58415687 56033360
12226 56033360 54483163 53624137 53454131 53689545 54538040 55986923 58136826 61176482 65153073
12217 65153073 70039803 76091387 83897394 93784308 106218943 122020359 142183917 166966121
12209 166966121 195069524 222939455 244375885 252704437 244628777 222518810 192779979
12202 192779979 161707817 133660324 110322896 91612584 77149222 66234285 57941655
12195 57941655 51636735 46803607 43063995 39921159 37163889 34691869 32268320 29886230
12187 29886230 27646010 25640598 23806894 21993766 20253071 18560254 17156183 15872608
12179 15872608 14626500 13553008 12697668 11941097 10942877 10272319 9807997 9319648 8892535
12170 8892535 8676193 8589950 8532191 8421225 8344508 8184802 7799373 7381278 6972727 6401913
12160 6401913 5845918 5312890 5123966 4941570 4661508 4515738 4357348 4204901 3932248
12151 3932248 3737646 3643478 3576002 3654480 3598243 3283826 3069583 2990558 3057480 3043417 3140358
12140 3140358 3222925 3443862 3547709 3484957 3344756 3345930 3292301 3340151 3283253 3257756 3489905
12129 3489905 3716232 3828367 3956598 4234833 4192217 4078984 3921392 3682034 3505834 3366592
12119 3366592 3252111 3043773 2831497 2582677 2441162 2325048 2323324 2399097 2247159 1964187
12109 1964187 1946323 1899106 1854718 1941749 1957293 1883343 1868686 1945054 2117030 2172885 2128653
12098 2128653 2182050 2228621 2124548 1898250 1861798 1796108 1622851 1497239 1372359 1417271
12088 1417271 1467986 1410609 1364934 1283527 1223321 1221577 1199408 1150668 1098989 1008727 952542
12077 952542 962870 957952 781447 633350 700354 754082 620005 626713 606843 755343 759762
12066 759762 607509 500380 523670 488387 394897 391046 453085 487984 571000 586785 550494
12055 550494 444670 425673 364002 458803 543308 567490 651531 570861 516732 479444 440075
12044 440075 375850 318877 178471 218649 266446 273718 280890 400996 455450 458585 431352 484898
12032 484898 484069 496750 635597 697063 772560 813821 802781 782256 753715 660985 599084 698861
12020 698861 765742 795786 876593 837433 708498 549029 490370 611836 871001 963700 968618
12009 968618 1033330 1153736 1148024 1165182 1170862 943215 716049 738822 664177 619559 531856
11998 531856 654012 555368 382445 360776 196263 133249 198077 267361 336479 382413 432952
11987 432952 412902 430775 289388 284070 276137 136814 113446 240000 343526 353618 270151
11976 270151 170368 129388 141697 194935 181230 206221 347196 318037 243865 214819 259582
11965 259582 277124 242280 299854 290130 227042 215520 283174 307412 266000 231141 244485 236749
11953 236749 194971 170620 115076 186474 180939 212896 302719 245064 231213 293383 405599
11942 405599 411706 445771 543649 617594 495256 391009 356019 339233 338440 335972 361983 346468
11930 346468 358121 471111 484655 448856 477835 528967 665695 544901 373207 348553 442958
11919 442958 383562 426505 340459 195468 232465 352607 346251 309408 207436 105255 111504
11908 111504 108118 178047 199131 130649 26058 3831 -23292 83120 171902 281316 349906
11897 349906 353497 200157 94217 183711 156580 43963 99442 155974 162232 157535 95331
11886 95331 36508 -14484 -89349 -86612 27876 66411 230576 268874 191977 192864 206900 186346
11874 186346 37713 16574 127443 139520 164873 148169 131740 74134 5395 -68299 -110417
11863 -110417 -105764 -52657 722 17592 -124679 -164533 91328 80021 42847 10205 61918
11852 61918 204433 309643 255442 115769 112502 107229 119937 74520 116826 245234 373069
11841 373069 410849 451802 402316 309444 312453 270694 185432 132537 135057 110648 222340 322252
11829 322252 349902 259774 283446 196352 140932 130877 309172 410194 376319 345490 382059
11818 382059 312317 241934 151555 154381 329660 395032 331365 323774 358808 446662 490879 533944
11806 533944 486822 521460 466031 541415 572595 626981 789177 896187 1032598 1078134 1144864
11795 1144864 1316382 1402826 1307577 1252640 1130215 1107239 1129181 989439 728422 527604
11785 527604 564056 566913 463552 502549 427010 368513 337003 320510 340293 296164 198417
11774 198417 270466 343402 435892 577903 699349 631989 572801 633650 759792 696967 720408
11763 720408 863985 994622 1099353 1258857 1466740 1435396 1431212 1471958 1427335 1330749 1065585
11752 1065585 752699 728200 809589 733728 639873 572897 417353 382886 543035 697553
11742 697553 752100 727148 675390 644874 615062 515115 413816 442352 351123 415767 337573
11731 337573 496315 625169 577515 618299 674446 632229 668364 607080 452138 489845 561824
11720 561824 565126 729234 826628 759425 784908 927345 908897 872889 865366 839492 897462
11709 897462 1085429 1354166 1483510 1738793 1889656 1867848 1879005 2150554 2446516 2576309
11699 2576309 2721687 2974192 3193260 3487725 3842860 4221894 4663077 5323135 6176247
11690 6176247 7140109 8390708 9822100 11738371 13916279 16386407 19102519 22253339
11682 22253339 26090056 30657136 35814789 41667933 48116591 54730239 60437259 64162589
11674 64162589 65378890 64563527 62789029 61151947 60001597 59382275 59308172 59618331 60400790
11665 60400790 61559759 62831495 64120887 65499376 66749204 66859733 64666276 60139462
11657 60139462 53861819 47190666 41024541 35472439 30492586 26167351 22714430 19874992
11649 19874992 17490143 15531078 13858309 12410137 11156760 10188938 9350415 8735526
11641 8735526 8223322 7816689 7472695 7341981 7314923 7181057 6905463 6574342 6481827 6230699
11631 6230699 6091660 5972487 5791157 5665867 5553010 5429811 5540877 5739238 5910794
11622 5910794 6223914 6444975 6716159 7183638 7657147 8079631 8652979 9270962 10013848
11613 10013848 10924827 12021356 13432705 15286013 17622986 20339536 23501750 27013114
11605 27013114 31064703 36059997 42408046 50539308 60643096 72403953 83967074 92881973
11597 92881973 97531673 98367066 97751763 98011450 100551629 105101226 110341228 114040890
11589 114040890 114887891 113463862 111859461 111742063 114199833 119264782 125981044 132085451
11581 132085451 134849326 133201232 128180768 121764283 115429163 109342309 102560637 94161877
11573 94161877 84241135 73794066 63459234 54001525 46061116 39479491 34095610 29885389
11565 29885389 26456791 23577031 21051363 18660359 16731411 15155806 13834921 12740256
11557 12740256 11739366 10940371 10422451 10040098 9617392 9065738 8731451 8488653 8206820
11548 8206820 8040595 7840795 7577860 7380027 7081964 6818799 6731999 6652590 6664590 6686673
11538 6686673 6901594 7004701 6974327 6962642 6873159 6908191 7117327 7255342 7553496 8130408
11528 8130408 8988023 9893867 10960266 12228023 13862933 15876884 18309358 21319996
11520 21319996 25088288 29553399 34832506 41213748 48533416 56189284 63153234 67851503
11512 67851503 69037930 67332987 64105628 60244674 56385791 52681022 49457014 47186043
11504 47186043 46216160 46576769 48162207 50770784 54414401 58783663 63329538 66691265
11496 66691265 67867355 66126819 61982773 56460175 50626776 44909650 39344478 34128403
11488 34128403 29482629 25544515 21907867 18445651 15545876 13102935 11201021 9794606
11480 9794606 8659973 7723269 6876768 6155817 5690543 5294844 4836506 4561332 4223967
11471 4223967 3935887 3690700 3508201 3400191 3179110 3012825 3012436 2951251 2904953 2844162
11461 2844162 2720500 2524867 2403390 2294328 2199620 2132131 1955983 1826151 1668218 1726691
11451 1726691 1807319 1789679 1709285 1518122 1331423 1282208 1285773 1233867 1207277 1287929 1303743
11440 1303743 1185801 1081754 1051562 950200 1014670 861101 767548 814204 900787 877284
11430 877284 877809 839825 758338 725167 716281 741575 675088 512819 474190 611561 624406 615256
11418 615256 614931 572371 564614 645895 772620 720005 596270 618933 642390 581730 532775 578617
11406 578617 579906 524583 444237 402504 439714 417893 431303 387483 345452 408015 549245
11395 549245 640365 588159 567804 608907 484042 481022 473137 372775 417304 538508 653932
11384 653932 780002 735613 711894 547110 566132 540479 528304 474706 393223 436366 546263
11373 546263 448055 406436 460581 450603 429807 356688 437957 424317 230621 150837 109442
11362 109442 99598 186669 208573 73753 61046 85568 216821 251975 247105 224592 280920
11351 280920 243089 253285 270004 223717 287229 351663 344305 336684 234563 4259 629 87137
11339 87137 209897 319538 322473 369302 340877 345880 276775 322761 347538 345634 353198 256923
11327 256923 215608 209575 287723 256356 207945 245395 212200 135917 25616 54986 195994
11316 195994 234042 151180 154870 179859 243677 327268 440948 502972 352301 169760 121993
11305 121993 137423 80341 -18994 108040 193309 131079 99383 132101 248712 387746 351692
11294 351692 320612 390428 383330 247291 138110 95404 118195 186544 202244 120552 12511
11283 12511 50434 119659 101738 121219 141460 46501 50103 122018 195975 170320 249789 359054
11271 359054 306967 239069 158719 166887 258505 249345 297590 358318 310977 188651 260504 245181
11259 245181 239487 327681 285479 274849 210079 125295 130733 90686 180810 236495 332770 455205
11247 455205 476900 416343 395104 415104 516043 588539 642416 639381 459228 500115 640779
11236 640779 755955 739776 819984 804674 759245 830369 843208 794650 885774 883012 874894 848336
11224 848336 932650 916627 861759 743576 696354 693783 572724 590466 801462 876039 824843
11213 824843 774557 810255 765749 826599 957123 1039227 1003976 898859 838105 903483 927392
11202 927392 970996 1020870 1044070 941038 804400 753965 778359 657075 561112 506789 455808
11191 455808 547504 587433 613536 698474 844274 885419 880846 926321 977857 852526 694406
11180 694406 604088 564434 664707 628191 578423 644080 656820 650393 646775 529821 629322
11169 629322 649719 632860 612137 598702 586632 659441 675713 639259 721071 932287 977853
11158 977853 965236 979061 1023532 1091678 1075660 1144265 1207563 1107517 1101643 1261588 1278547
11147 1278547 1333330 1340418 1351842 1379823 1487103 1542688 1511033 1500491 1434700 1328636 1250864
11136 1250864 1179856 1230827 1315168 1202586 1144270 1188095 1183122 1063217 939566 746039 638205
11125 638205 668059 670934 691424 665961 672894 707415 851576 754896 555533 535918 496658
11114 496658 492120 573813 567387 512905 503922 515000 521995 528691 512372 515647 584149 478059
11102 478059 423856 495174 333266 210754 160471 271353 261792 197278 339378 387464 334127
11091 334127 336890 175856 301137 259452 82325 5341 64075 209148 367275 509468
11081 509468 585794 702029 650496 591782 680290 706798 605867 415987 248061 339819 363557
11070 363557 329443 278876 171913 151282 212711 258339 358767 404209 543425 540832 476718
11059 476718 415503 391920 261416 196344 372894 397345 346466 319602 310828 252393 264380
11048 264380 172545 120294 162113 327752 462940 370243 251776 163981 150984 231658 368476
11037 368476 352361 307667 465663 427488 412796 259106 166579 219018 225281 224089 185686
11026 185686 147975 87753 52443 -32849 -53430 -1852 42480 123643 117711 27124 75105 -31683
11014 -31683 -161313 -79494 50002 128281 129054 84581 -19648 8619 14567 39418 30849 -22254
11002 -22254 49452 20713 -88004 -113925 -820 83997 -12008 -57010 -41311 25888 28825
10991 28825 -37262 -31157 27657 3364 -185213 -149983 4079 190000 154742 138352 135622
10980 135622 54149 16874 27802 -46640 -75907 -75746 2440 127153 186843 131974 153400 271386
10968 271386 232466 205266 282659 275811 125125 109467 59972 204470 405355 456178 377014
10957 377014 370374 346557 283463 239067 283203 224696 108080 23282 -25803 -23983 -106031 -122018
10945 -122018 -39360 30744 -36165 38283 92960 105754 151140 118009 92038 22914 52279
10934 52279 140368 108133 174267 131872 111775 161288 242459 138306 53019 44643 35627 -38374
10922 -38374 -7708 -17875 -62322 43254 146814 185022 174716 188640 109948 17899 -11573
10911 -11573 -66183 62108 159912 131444 114628 122661 207222 207573 208307 244185 259589 184840
10899 184840 50222 134304 201305 219146 162626 174984 233852 253834 199957 126860 286054
10888 286054 364191 335715 262506 222148 251918 241539 247403 285378 245279 161628 220908 304881
10876 304881 291037 175108 -5443 -21903 -10814 29006 28231 57197 21576 -23358 -85739
10865 -85739 8236 152972 194240 43463 81610 123076 39367 43289 -16685 -74679 -126517
10854 -126517 -176242 -64250 -7718 69161 142886 112197 166843 88815 8316 -90875 2262
10843 2262 51930 27186 -37310 76325 20764 55028 98761 109578 98370 26342 -7206 -119485
10831 -119485 -236724 -233605 -78115 -4104 138944 254360 296111 124376 -85221 -107494
10821 -107494 -124294 -60448 -122428 1749 55095 -9292 51421 42566 -108788 -12727 139695
10810 139695 147934 68072 57304 36900 67446 191916 211843 105956 92181 60711 -34254
10799 -34254 -121763 -13205 81481 66761 71372 -91025 -79461 122915 185255 234180 273588
10788 273588 254010 313081 325864 185970 114535 69091 -31560 -80283 -87222 60900 97249
10777 97249 81265 82972 -76888 -15590 47476 -28215 66276 84723 25491 -103276 -136986
10766 -136986 -152644 -157348 -203134 -146629 -128286 -107269 -65902 -62974 9861 57217 -22652 -73717
10754 -73717 -118614 -190333 -133751 -72278 -53775 -69524 -64643 -156529 -311197 -341084 -244144 2525
10742 2525 110473 -18222 77549 24271 -57226 24191 175151 268166 261085 244543 262776
10731 262776 204634 171606 159511 208370 223885 288983 342292 240713 200711 284339 402595
10720 402595 296541 139398 5242 60683 135207 93194 225314 261933 341056 374571 368652
10709 368652 301585 216824 173827 141861 179641 273013 247238 116616 -28597 -89221 -157735
10698 -157735 -90278 22101 -124921 -83579 -48208 -7270 -57324 -160916 -200451 -83936 -31552
10687 -31552 -70042 -42943 -37386 44636 140664 91368 -43361 -165600 -109345 -103481 -241585
10676 -241585 -153404 96711 232501 207668 167807 151981 282183 221233 60372 133664 193985
10665 193985 184372 102670 -19112 4931 45431 -6818 19429 -8802 62707 -45580 -148808
10654 -148808 -63746 46775 141505 242828 143059 -19855 -31973 -175330 -240965 -128429
10644 -128429 -28451 20532 25786 -27732 -39050 -22863 50154 163351 255197 238462 172010
10633 172010 143401 82850 -20166 8457 59216 65550 36621 12421 -32666 15353 120523
10622 120523 109408 104815 110258 187882 73897 31019 14292 -58026 -158493 -180153 -83587
10611 -83587 -87382 -84769 7118 83273 117137 3880 -111992 -49340 -45538 58327 67165 -59004
10599 -59004 -116294 -20768 8786 -5735 -79821 -135903 -60190 -49142 -91034 -72540 -30296 -62005
10587 -62005 -32618 -8948 -92064 -179179 -6585 -63605 -155775 -134347 -97186 18161 111314
10576 111314 78155 116226 20065 -112071 -18970 67563 119973 28139 46252 146448 69346
10565 69346 58639 136502 232021 207238 -48346 -38120 53856 126950 56166 25049 13289
10554 13289 8699 -30786 -48648 -107832 -364 57234 -1799 23172 -24305 -110429 -252668
10543 -252668 -302300 -341373 -171628 -34519 47848 22607 -56250 -12749 -13546 77810 -47149
10532 -47149 -125575 -259579 -292598 -164480 -107038 -82841 -51742 22643 11600 -30629 -68294
10521 -68294 -76603 55383 22044 1737 -37542 -69875 -107700 -53895 2673 91131 113362 34410
10509 34410 -59102 -61587 30953 65386 28729 -116627 -204910 -87291 58959 111568 70180
10498 70180 40258 -29833 -9295 38232 -34333 -184441 -132471 -87082 -80649 -110667 -239610
10487 -239610 -360417 -267863 -196389 -73260 -83817 -62475 -48584 -87886 -179054 -248160 -171563
10476 -171563 -79954 -96923 -54327 -49524 -105369 -162601 -207210 -182652 -108781 37096 25844
10465 25844 -50679 -165683 -124882 -40656 -90807 -89617 -116414 -92661 -84125 7190 16107 78250
10453 78250 9021 -50530 40648 30943 -23075 -7644 14493 105972 84540 132996 75429 18568
10441 18568 -19316 -20208 71773 136311 178949 291691 297734 128223 -51330 -67061 -211449
10430 -211449 -260437 -230668 -150835 -153854 -89546 -9545 -10057 15408 72455 178062 103633 -17813
10418 -17813 -122450 -219617 -237802 -141399 -11778 35004 45591 37412 -38896 -52635 35562
10407 35562 146307 181024 350255 266698 89244 -5431 11708 -12642 -11957 7431 -108782
10396 -108782 -131330 -101654 -152659 -164856 -89803 -18306 -58943 3950 44178 -9984 -92914
10385 -92914 4657 112060 148213 73467 35537 116726 151197 63392 19320 -82626 -12862
10374 -12862 94703 50217 -93447 -222963 -139097 -70961 -173161 -110755 12386 -68338 -37792
10363 -37792 -82615 -100102 -42406 -105985 -87033 27711 9030 -32542 -61053 -129833 -57706
10352 -57706 19334 49227 49998 147412 220096 108169 70786 87532 6701 -57305 -119818 -116377
10340 -116377 -23844 17290 -85474 -148311 -42871 19429 56057 22785 27200 -87230 -72980
10329 -72980 33125 187492 224275 258509 237703 62814 59158 33864 120618 119228 62266
10318 62266 105721 103472 17260 -75035 -42880 -24841 -25747 -16853 10384 1502 -116299 -237406
10306 -237406 -281728 -261714 -295400 -177292 -31213 -141957 -136298 -90723 -45114 -58827 -55041
10295 -55041 -82463 -112413 -66760 115876 104652 91088 16567 10788 72437 149060 33993
10284 33993 -85407 -158779 -119313 -18815 -4762 -43642 -32592 -27335 15279 -7870 -52961
10273 -52961 -85200 -112336 -47364 -26640 -94763 -116254 -5977 -2953 -98471 -142663 -95821 88659
10261 88659 189997 48965 -62075 -70108 -60545 -111034 -40717 -552 36628 32893 55328 64299
10249 64299 24367 6897 61920 98146 98360 221236 323952 199839 127120 76779 69490 40128
10237 40128 35321 -43242 -43148 84824 101468 111307 200074 222027 121304 -8036 -44967 -77731
10225 -77731 -89490 -120155 -81972 -88970 -137924 -159504 -174584 -70346 -17890 47183 273012
10214 273012 347468 341936 394474 399292 180385 127323 153594 200567 354275 415275 309844
10203 309844 212880 376269 559599 946930 1348243 1608046 1724681 2019262 2369112 2288846
10193 2288846 2011684 1706453 1550572 1329956 1148449 1041527 1068961 904981 713756 631277
10183 631277 603560 450856 325967 156052 183883 321941 239238 141714 181365 287366
10173 287366 348891 381211 253278 151422 77821 26621 29830 139029 139902 179 -22797
10162 -22797 -37108 1175 93075 221614 212726 94520 161608 219624 374392 316411 219690
10151 219690 68300 -104879 13259 176594 166680 174225 280797 367430 304114 249683 228588
10140 228588 339150 275242 232454 147087 59024 95852 153032 324255 412692 295529 247116
10129 247116 297091 348459 471277 425603 407832 367141 332186 380703 442775 531359 556428
10118 556428 578280 449170 386570 426750 391734 447741 540599 639137 637169 616893 732124
10107 732124 841484 929399 951068 888672 902957 812242 638333 619276 654934 684405 716462
10096 716462 795110 846388 860057 791401 754097 897198 1103330 1253510 1386991 1422438 1615133
10085 1615133 1880564 2051934 2171048 2273657 2317045 2169321 1964476 1758795 1525526 1342822
10075 1342822 1182833 1222211 1309236 1274232 1262132 1105514 965020 990777 930826 950879 1022591
10064 1022591 992585 932711 1110446 1207983 1333836 1450374 1529332 1542126 1792799 1842339
10054 1842339 1791742 1834630 1871536 1924537 2257028 2638682 3040553 3484057 4049356 4995642
10044 4995642 6405744 8564972 12471081 20477505 36568642 64162870 82150050 63506864
10036 63506864 40097867 24716491 16138530 11425026 8685329 6878452 5658411 4697885
10028 4697885 3988872 3588147 3338663 3137247 2976732 2802660 2679695 2597347 2645384 2713365
10018 2713365 2444625 2111193 1885419 1764521 1724364 1795663 1665461 1617408 1693835 1698111
10008 1698111 1649225 1656550 1594753 1447681 1398505 1511014 1542315 1397699 1265296 1222740 1156957
9997 1156957 1171620 1248003 1291937 1227366 1277914 1252641 1132386 1153195 1129618 1229631 1193669
9986 1193669 1178504 1267677 1340360 1235519 1292839 1337353 1372577 1415314 1377900 1248705 1230875
9975 1230875 1306397 1392817 1455447 1416423 1419188 1341176 1214438 1138641 1239418 1269617 1370058
9964 1370058 1413295 1290819 1462874 1531276 1449284 1490406 1591819 1689895 1688532 1514329 1513311
9953 1513311 1596111 1691406 1695867 1585789 1572124 1656550 1706142 1749401 1666760 1578417 1581928 1647128
9941 1647128 1747605 1755097 1678680 1684285 1664526 1640899 1646891 1716303 1711996 1845113 1833970 1854399
9929 1854399 1885822 1971045 1920491 1893327 1935642 2023216 2047165 2072123 2156836 2194779 2114983
9918 2114983 2164340 2236576 2346740 2382401 2286709 2335411 2416312 2565741 2617686 2607126 2532656
9907 2532656 2515407 2544322 2595954 2744303 2851155 2876078 2980205 3266417 3541014 3545220 3521625
9896 3521625 3583937 3524024 3435171 3397208 3408040 3423165 3439248 3407710 3500483 3647368 3673584
9885 3673584 3636497 3661113 3700807 3855327 3938551 4250307 4802669 5520950 6129207 6104960
9875 6104960 5595131 5098887 4831513 4685149 4544282 4462788 4308888 4379254 4429489 4371525
9865 4371525 4424609 4542101 4555364 4585412 4594597 4671989 4831307 4834062 4908402 4952113 4972572
9854 4972572 5079421 5102267 5202542 5252453 5249179 5264874 5394292 5437587 5539747 5728029 5864657
9843 5864657 5967221 6043055 6224024 6545163 6854897 7086552 7134378 6976580 6931204 6965378
9833 6965378 7077351 7138882 7247882 7245095 7301776 7414651 7555179 7653460 7758563 7923724
9823 7923724 7956549 8097363 8218463 8310595 8342340 8406711 8584707 8663109 8900072 9131516
9813 9131516 9325117 9405760 9426562 9536797 9803124 10070259 10221025 10310066 10414478 10544761
9803 10544761 10658126 10757898 10823333 10945131 11219489 11577275 11880484 12041765 12166864 12362978
9793 12362978 12593519 12697133 12908500 13198844 13443984 13695898 13862214 14082174 14408782
9784 14408782 14788414 15103953 15274326 15595237 15933774 16118718 16230894 16564081 16986757
9775 16986757 17293797 17605550 17913096 18141178 18413727 18865325 19265820 19646954 20067279
9766 20067279 20535133 21020297 21620635 22245401 22854156 23599395 24419598 25145105 25818061
9757 25818061 26373943 26786852 26947502 27154067 27439535 27796058 28366263 29075242 29955962
9748 29955962 30954718 32268838 33838115 35675256 37857939 40184546 42493977 44750533
9740 44750533 46897509 48787332 50593870 52408272 54048723 55617305 57144221 58479479
9732 58479479 59870766 61297999 63003762 65138974 67644866 70727454 74530248 78706058
9724 78706058 82837383 86620606 89936396 92811508 95030659 96494813 97022590 96686153
9716 96686153 96041550 95888958 96847505 98934971 102073035 105778854 109609282 113037628 115826030
9707 115826030 117867657 119171306 119927010 120258864 120197057 119846746 119238059 118400782 117657895
9698 117657895 117390999 117908383 119261708 121088517 122651493 123493630 123533990 123003198 122370559
9689 122370559 122070737 121633396 120622392 118642985 115588744 111840834 107544662 102942371
9681 102942371 98496650 94841611 92027873 90234595 89423560 89633720 90871171 93209855
9673 93209855 95770477 97354520 96581016 93367362 88880635 84300858 80152276 76794885
9665 76794885 74356197 73069345 73031148 74497473 77389697 81005933 83458105 83277791 80831524
9656 80831524 77509286 74502997 72534866 71793542 72153395 73271191 75228104 77713868
9648 77713868 80598977 83688856 87205472 91119908 95465823 100054764 104782832 109424084
9640 109424084 113509878 116760928 119531845 122535403 126381548 131538622 138095996 146247157
$$ [...]
##END NTUPLES=NMR SPECTRUM
##END=
