##TITLE=Analysis number 327199
Compound Code cc 65016
Book Reference 464/114/4
Project Code adrs
Chemist Name chrisr
##JCAMPDX= 6.0         $$ Bruker NMR JCAMP-DX V2.0
##DATA TYPE= NMR SPECTRUM
##DATA CLASS= NTUPLES
##ORIGIN= Bruker BioSpin GmbH
##OWNER= nmr
$$ XWIN-NMR		Version 3.5
$$ Thu Mar 15 09:30:40 2007 GMT Standard Time (UT+0h)  MAYBRIDGE\nmr@NMR_250MHZ
##.OBSERVE FREQUENCY= 250.131544655141
##.OBSERVE NUCLEUS= ^1H
##.ACQUISITION MODE= SIMULTANEOUS (DQD)
##.ACQUISITION SCHEME= undefined
##.AVERAGES= 16
##.DIGITISER RES= 18
##SPECTROMETER/DATA SYSTEM= dpx250
##.PULSE SEQUENCE= zg30
##.SOLVENT NAME= CDCl3
##.SHIFT REFERENCE= (INTERNAL, CDCl3, 0, 16.522)
##AUDIT TRAIL= $$ (NUMBER, WHEN, WHO, WHERE, WHAT)
$$ ##TITLE= Audit trail, XWIN-NMR		Version 3.5
$$ ##JCAMPDX= 5.01
$$ ##ORIGIN= Bruker BioSpin GmbH
$$ ##OWNER= nmr
$$ C:\u/data/dgb/nmr/ADRS/940/pdata/1/auditp.txt
$$ ##AUDIT TRAIL=  $$ (NUMBER, WHEN, WHO, WHERE, WHAT)
(   1,<2007-03-15 09:30:20.80 +000>,<MAYBRIDGE\nmr>,<NMR_250MHZ>,
      <created by zg, POWCHK disabled, PULCHK disabled
       configuration hash MD5:
       49 4B E0 1D 92 C2 6B 37 9F E6 65 BC 52 41 86 1D
       data hash MD5: 64K
       BA F3 0F 42 D6 0D B8 39 CF F1 E7 82 7D C6 EE 39>)
(   2,<2007-03-15 09:30:31.58 +000>,<MAYBRIDGE\nmr>,<NMR_250MHZ>,
      <Start of raw data processing
       ef LB = 0.3 FT_mod = 6 PKNL = 1 SI = 32K 
       data hash MD5: 32K
       22 BB C3 34 60 5A DE 86 09 8D 87 02 7E 69 AB 67>)
(   3,<2007-03-15 09:30:33.20 +000>,<MAYBRIDGE\nmr>,<NMR_250MHZ>,
      <apk 
       data hash MD5: 32K
       35 5A DC ED AA 1F 1E 65 98 C3 A2 B9 EA 86 7F 38>)
(   4,<2007-03-15 09:30:33.94 +000>,<MAYBRIDGE\nmr>,<NMR_250MHZ>,
      <abs ABSG = 5 
       data hash MD5: 32K
       F6 25 6D A8 BE 62 77 4A 81 32 18 77 9A AB F4 E9>)
$$ ##END=
$$ 
$$ hash MD5
$$ 66 FF C3 2E D1 8B 3F 9C A9 55 2B 71 0D AE 4B 26
##$RELAX= 
##$RELAX= 
##$RELAX= 
##$RELAX= 
##$RELAX= 
##$RELAX= 
##$RELAX= 
$$ Bruker specific parameters
$$ --------------------------
##$DU= <C:\u>
##$EXPNO= 940
##$NAME= <ADRS>
##$PROCNO= 1
##$TYPE= <nmr>
##$USER= <dgb>
##$AMP= (0..31)
100 100 100 100 100 100 100 100 100 100 100 100 100 100 100 100 100 100 
100 100 100 100 100 100 100 100 100 100 100 100 100 100 
##$AQSEQ= 0
##$AQ_mod= 3
##$AUNM= <au_zg>
##$AUTOPOS= <7 >
##$BF1= 250.13
##$BF2= 250.13
##$BF3= 250.13
##$BF4= 250.13
##$BF5= 500.13
##$BF6= 500.13
##$BF7= 500.13
##$BF8= 500.13
##$BYTORDA= 1
##$CFDGTYP= 0
##$CFRGTYP= 5
##$CHEMSTR= <none>
##$CNST= (0..31)
1 1 145 1 1 1 1 1 1 1 1 1 1 1 1 1 1 1 1 1 1 1 1 1 1 1 1 1 1 1 1 1 
##$CPDPRG= <>
##$CPDPRG1= <>
##$CPDPRG2= <>
##$CPDPRG3= <>
##$CPDPRG4= <mlev>
##$CPDPRG5= <mlev>
##$CPDPRG6= <mlev>
##$CPDPRG7= <mlev>
##$CPDPRG8= <mlev>
##$CPDPRGB= <>
##$CPDPRGT= <>
##$D= (0..31)
0 1 0 0 0 0 0 0 0 0.06 0 0 0 0 0 0 0.0002 0 0 0 0 0 0 0 0 0 0 0 0 0 0 
0 
##$DATE= 1173951019
##$DBL= (0..7)
120 120 120 120 120 120 120 120 
##$DBP= (0..7)
150 150 150 150 150 150 150 150 
##$DBP07= 0
##$DBPNAM0= <>
##$DBPNAM1= <>
$$ [...]
##$SUBNAM7= <"">
##$SUBNAM8= <"">
##$SUBNAM9= <"">
##$SW= 20.6930455092707
##$SWIBOX= (0..15)
0 0 3 0 0 0 0 0 0 0 0 0 0 0 0 0 
##$SW_h= 5175.983436853
##$TD= 65536
##$TD0= 1
##$TE= 683.16
##$TE2= 300
##$TE3= 300
##$TEG= 300
##$TL= (0..7)
0 120 120 120 120 120 120 120 
##$TP= (0..7)
150 150 150 150 150 150 150 150 
##$TP07= 0
##$TPNAME0= <>
##$TPNAME1= <>
##$TPNAME2= <>
##$TPNAME3= <>
##$TPNAME4= <>
##$TPNAME5= <>
##$TPNAME6= <>
##$TPNAME7= <>
##$TPOAL= (0..7)
0.5 0.5 0.5 0.5 0.5 0.5 0.5 0.5 
##$TPOFFS= (0..7)
0 0 0 0 0 0 0 0 
##$TUNHIN= 0
##$TUNHOUT= 0
##$TUNXOUT= 0
##$USERA1= <user>
##$USERA2= <user>
##$USERA3= <user>
##$USERA4= <user>
##$USERA5= <user>
##$V9= 5
##$VALIST= <valist>
##$VCLIST= <CCCCCCCCCCCCCCC>
##$VD= 0
##$VDLIST= <DDDDDDDDDDDDDDD>
##$VPLIST= <PPPPPPPPPPPPPPP>
##$VTLIST= <TTTTTTTTTTTTTTT>
##$WBST= 1024
##$WBSW= 4
##$XGAIN= (0..3)
0 0 0 0 
##$XL= 0
##$YL= 0
##$YMAX_a= 409639
##$YMIN_a= -423544
##$ZGOPTNS= <>
##$ZL1= 120
##$ZL2= 120
##$ZL3= 120
##$ZL4= 120
##$ABSF1= 16.522
##$ABSF2= -4.171173
##$ABSG= 5
##$ABSL= 3
##$ALPHA= 0
##$AQORDER= 0
##$ASSFAC= 0
##$ASSFACI= 0
##$ASSFACX= 0
##$ASSWID= 0
##$AUNMP= <proc_1d>
##$AZFE= 0.1
##$AZFW= 0.1
##$BCFW= 0
##$BC_mod= 0
##$BYTORDP= 0
##$COROFFS= 0
##$CY= 12.5
##$DATMOD= 1
##$DC= 0
##$DFILT= <>
##$DTYPP= 0
##$F1P= 14.0000005364418
##$F2P= -0.99999901652339
##$FCOR= 0.5
##$FTSIZE= 32768
##$FT_mod= 6
##$GAMMA= 0
##$GB= 0
##$INTBC= 1
##$INTSCL= 1
##$ISEN= 128
##$LB= 0.3
##$LEV0= 0
##$LPBIN= 0
##$MAXI= 10000
##$MC2= 0
##$MEAN= 0
##$ME_mod= 0
##$MI= 0
##$NCOEF= 0
##$NC_proc= -3
##$NLEV= 6
##$NOISF1= 0
##$NOISF2= 0
##$NSP= 0
##$NTH_PI= 0
##$NZP= 0
##$OFFSET= 16.522
##$PC= 1
##$PHC0= 230.2966
##$PHC1= 4.536407
##$PH_mod= 1
##$PKNL= yes
##$PPARMOD= 0
##$PSCAL= 4
##$PSIGN= 0
##$REVERSE= no
##$SF= 250.13
##$SI= 32768
##$SIGF1= 0
##$SIGF2= 0
##$SINO= 400
##$SIOLD= 32768
##$SREGLST= <1H.CDCl3>
##$SSB= 0
##$STSI= 32768
##$STSR= 0
##$SW_p= 5175.98343685301
##$SYMM= 0
##$S_DEV= 0
##$TDeff= 65536
##$TDoff= 0
##$TI= <Analysis number 999999
Compound Code 99
Book Reference 9
Project Code 9>
##$TILT= no
##$TM1= 0
##$TM2= 0
##$TOPLEV= 0
##$USERP1= <user>
##$USERP2= <user>
##$USERP3= <user>
##$USERP4= <user>
##$USERP5= <user>
##$WDW= 1
##$XDIM= 32768
##$YMAX_p= 527711046
##$YMIN_p= -118932
$$ End of Bruker specific parameters
$$ ---------------------------------
##NTUPLES= NMR SPECTRUM
##VAR_NAME=  FREQUENCY,     SPECTRUM/REAL,   SPECTRUM/IMAG
##SYMBOL=    X,             R,               I
##VAR_TYPE=  INDEPENDENT,   DEPENDENT,       DEPENDENT
##VAR_FORM=  AFFN,          ASDF,            ASDF
##VAR_DIM=   32768,         32768,           32768
##UNITS=     HZ,            ARBITRARY UNITS, ARBITRARY UNITS
##FACTOR=    0.157963299565203, 1,           1
##FIRST=     4132.6476996994, 0,             0
##LAST=      -1043.33573715361, 0,           0
##MIN=       -1043.33573715361, -118932,     0
##MAX=       4132.6476996994, 527711046,     0
$$ Real data points
##PAGE= N=1
##DATA TABLE= (X++(R..R)), XYDATA
$$ [...]
$$ plain form
17002 104393 106085 100028 100954 96666 94617 88627 86007 91307 83322 75687 77948 90760 91231 101296
16988 101296 92712 74189 78686 88255 112509 111127 101889 95771 87731 82650 87703 74976 68479
16975 68479 64026 64550 47222 52241 80445 94332 92565 84847 87786 82072 70282 61995 59822 62957
16961 62957 60656 68644 73832 84066 80689 84002 76654 69108 79085 73341 68343 79505 82684 91990
16947 91990 82618 81579 82773 74170 61711 55703 58176 45398 42776 48307 59016 61883 64697 69394
16933 69394 65935 78414 86401 78514 85540 86087 80694 77817 74547 82504 85805 101002 92441 86890
16919 86890 86759 90321 96415 102267 95862 97748 92518 91036 74511 62353 53437 61271 92763 99260
16905 99260 92551 81164 75058 80411 79238 83512 78657 68120 63719 65784 57405 50671 59313 70276
$$ packed form
17002A04393J692o057R26m288k049n990k620N300p985p635K261J2812M71J0065
16988A01296q584j8523M497R569K4254j382r238o118q040n081N053j2727o497
16975F8479m453N24j7328N019K8204J3887j767p718K939n714j1790q287k173L135
16961F2957k301P988N188J0234l377L313p348p546R977n744m998J1162L179R306
16947I1990r372j039J194q603j2459o008K473j2778k622N531J0709K867K814M697
16933F9394l459J2479P987p887P026N47n393k877l270P957L301J5197q561n551
16919H6890j31L562O094N852o405J886n230j482j6525j2158q916P834L1492O497
16905I9260o709j1387o106N353j173M274m855j0537m401K065q379o734Q642J0963
$$ plain form
16891 70276 64419 51001 47291 59735 65694 54538 48854 38501 41597 54931 54269 57653 46187
16878 46187 36892 43436 48475 48687 43128 43872 50506 50825 42242 35059 50411 60341 56403 57616 60354
16863 60354 52293 49467 60887 54569 38087 40631 56925 69999 70959 56385 47034 53623 60929
16850 60929 65007 73748 65386 66433 64930 61289 61092 44564 45878 56552 69404 61684 66269 67926
16836 67926 67373 87237 89501 83903 76028 71418 82948 82775 83876 94920 96383 118540 147621 152463
16822 152463 175889 220143 248145 250433 252113 280338 342001 426948 502117 507556 438421 386453
16810 386453 374424 406932 467080 496204 448112 343653 286006 272448 281860 296041 305800 288513
16798 288513 288107 305831 302770 282737 289131 326343 393122 461131 498556 449485 378269 354085
$$ packed form
16891G0276n857j3418l710J2444N959j1156n684j0353L096J3334o62L384j1466
16878D6187r295O544N039K12n559P44O634L19q583p183J5352R930l938J213K738
16863F0354q061k826J1420o318j6482K544J6294J3074R60j4574r351O589P306
16850F0929M078Q741q362J047j503l641j97j6528J314J0674J2852p720M585J657
16836F7926n53J9864K264n598p875m610J1530j73J101J1044J463K2157K9081M842
16822A52463K3426M4254K8002K288J680K8225O1663Q4947P5169N439o9135n1968
16810C86453j2029L2508O0148K9124m8092j04459n7647j3558R412J4181R759j7287
16798B88513m06J7724l061k0033O394L7212O6779O8009L7425m9071p1216k4184
$$ plain form
16786 354085 388094 439241 493271 495744 397242 289630 237270 220370 218524 229490 223814 184567
16774 184567 155671 143105 111116 88965 88692 95864 90193 87531 76187 71366 62545 66146 62270
16761 62270 62081 70834 75188 67783 43462 43569 44690 50528 55044 62477 57012 56558 54602 56638 47382
16746 47382 46815 39032 37797 51170 54678 63561 66531 64833 52453 41703 38534 37278 40689 42795
16732 42795 47626 58672 54461 48473 45332 37045 26588 25833 36635 34658 30237 20199 24239 31936
16718 31936 35154 35311 44567 38327 33201 43074 56104 52411 50200 48499 38647 45693 54609 40055
16704 40055 30015 26555 25213 49779 55018 47425 46544 46089 41359 41067 50046 48894 48883 45793 40017
16689 40017 23237 10490 7420 22108 23510 23733 20571 27707 34871 38020 38316 32932 28239 21365
$$ packed form
16786C54085L4009N1147N4030K473r8502j07612n2360j6900j846J0966n676l9247
16774A84567k8896j2566l1989k2151k73P172n671k662j1344m821q821L601l876
16761F2270j89Q753M354p405k4321J07J121N838M516P433n465m54j956K036r256
16746D7382n67p783j235J3373L508Q883K970j698j2380j0750l169j256L411K106
16732D2795M831J1046m211n988l141q287j0457p55J0802j977m421j0038M040P697
16718C1936L218J57R256o240n126R873J3030l693k211j701r852P046Q916j4554
16704D0055j0040l460j342K4566N239p593q81m55m730k92Q979j152j1l090n776
16689D0017j6780j2747l070J4688J402K23l162P136P164L149K96n384m693o874
$$ plain form
16675 21365 16954 42132 52945 49777 52156 46333 40349 29680 37143 34365 34967 37379 38663 24162
16661 24162 28173 37418 26389 24829 32033 29028 33752 25896 14873 21208 21159 19003 15774 23915
16647 23915 41127 36674 38145 32414 24422 23584 39626 44170 40907 35346 34106 32664 18058 10543
16633 10543 20423 23562 18840 25179 34201 43095 51851 51937 33232 29591 25014 20521 26805 26764 28105
16618 28105 25183 28275 20695 12573 7654 26314 46301 59085 42424 27947 33277 29151 18496
16605 18496 18784 7938 9046 24321 28865 43182 42354 37627 37998 36230 43382 60142 67262 48563
16591 48563 42991 47894 48838 26789 15866 12806 13890 11357 37268 39047 38111 37904 21452 25393
16577 25393 27741 25097 19188 18918 520 11018 20351 40974 45798 47900 50928 39527 30100 12740
$$ packed form
16675B1365m411K5178J0813l168K379n823n984j0669P463k778O02K412J284j4501
16661B4162M011R245j1029j560P204l005M724p856j1023O335m9k156l229Q141
16647B3915J7212m453J471n731p992q38J6042M544l263n561j240j442j4606p515
16633A0543R880L139m722O339R022Q894Q756Q6j8705l641m577m493O284m1J341
16618B8105k922L092p580q122m919J8660J9987J2784j6661j4477N330m126j0655
16605A8496K88j0846J108J5275M544J4317q28m727L71j768P152J6760P120j8699
16591D8563n572M903R44k2049j0923l060J084k533K5911J779r36k07j6452L941
16577B5393K348k644n909k70j8398J0498R333K0623M824K102L028j1401r427j7360
$$ plain form
16563 12740 13673 19174 15894 22017 24358 33412 52774 42180 24442 30326 40812 43008 37865 22634
16549 22634 24994 22855 14267 18820 14874 14308 18270 33571 36132 31354 11212 -296 3620 18717
16535 18717 21281 25945 29602 27657 23328 23941 24567 26231 38809 37922 49553 52031 41619 30505
16521 30505 27985 36526 51973 42732 18086 18409 23650 20406 14791 5423 4557 16827 30775 32632
16507 32632 24751 29925 40851 32739 9163 7282 6236 9890 10426 -3966 -13489 139 15681
16494 15681 13194 5335 6784 13488 25566 34848 33629 26890 14976 2899 1870 8039 6960 20613
16480 20613 32421 39772 42579 45716 41375 28307 17120 27917 22722 24629 30296 23771 25583
16467 25583 20425 9929 -4541 3943 2952 9735 14225 5483 14469 8894 12277 23529 12909 2852
$$ packed form
16563A2740R33N501l280O123K341R054J9362j0594j7738N884J0486K196n143j5231
16549B2634K360k139q588M553l946n66L962J5301K561m778k0142j1508L916J5097
16535A8717K564M664L657j945m329O13O26J664J2578q87J1631K478j0412j1114
16521C0505k520Q541J5447r241k4646L23N241l244n615r368q66J2270J3948J857
16507C2632p881N174J0926q112k3576j881j046L654N36j4392r523J3628J5542
16494A5681k487p859J449O704J2078R282j219o739j1914j2077j029O169j079J3653
16480B0613J1808P351K807L137m341j3068j1187J0797n195J907N667o525J812
16467B5583n158j0496j4470Q484r91O783M490q742Q986n575L383J1252j0620j0057
$$ plain form
16453 2852 12894 19249 22389 17944 19919 27964 29033 41413 45647 37450 31626 18376 5199 -5858
16439 -5858 1255 10759 25558 37630 31779 29397 36989 39216 30621 20437 19805 23986 15950 20632
16425 20632 27735 26704 30475 37000 26944 10714 28148 34978 26908 18200 24913 28902 27231 22527
16411 22527 34239 39005 33854 35931 38578 37018 35392 41142 49868 56812 45497 28349 23030 14220
16397 14220 10398 17946 34896 39885 32577 39613 40674 36800 23257 19915 27782 45731 45209 43265
16383 43265 28259 31542 40957 25786 17535 18074 15639 17247 23368 31529 32688 32016 19589 17992
16369 17992 17758 6185 1879 5764 8860 17231 26911 3394 3943 1661 -6440 12715 22408 25393
16355 25393 27867 20111 23417 30348 16932 -3133 -5209 7959 16305 16163 11896 4767 1824 12676
$$ packed form
16453B852J0042O355L140m445J975Q045J069J2380M234q197n824j3250j3177j1057
16439e858P113R504J4799J2072n851k382P592K227q595j0184o32M181q036M682
16425B0632P103j031L771O525j0056j6230J7434O830q070q708O713L989j671m704
16411B2527J1712M766n151K077K647j560j626N750Q726O944j1315j7148n319q810
16397A4220l822P548J6950M989p308P036J061l874j3543l342P867J7949n22j944
16383D3265j5006L283R415j5171q251N39k435J608O121Q161J159o72j2427j597
16369A7992k34j1573m306L885L096Q371R680k3517N49k282q101J9155R693K985
16355B5393K474p756L306O931j3416k0065k076J3168Q346j42m267p129k943J0852
$$ plain form
16341 12676 20581 15844 18368 33963 40941 51214 38479 31426 33664 49230 38625 28956 33318
16328 33318 25294 19980 11531 14964 15426 13816 6611 12865 10997 9526 7440 12919 30534 36207
16314 36207 23392 28356 29376 21367 15329 28212 42499 40781 46836 43553 26955 18339 15756
16301 15756 6524 818 -679 1908 15509 14305 25649 35712 25719 24935 40284 27898 5241
16288 5241 3027 5379 7870 21461 25969 40427 42242 31573 27618 35234 32612 28386 24643 23924
16274 23924 11892 7624 12405 25730 31809 31901 22084 24108 23173 31371 33194 29700 18896 31501
16260 31501 32017 36361 27590 26807 31013 29023 20867 22647 24021 12185 -1344 -4115 9823 9578
16246 9578 1543 10105 27328 40155 45622 40185 35326 35209 41368 41695 30795 32019 19714 24365
$$ packed form
16341A2676P905m737K524J5595O978J0273j2735p053K238J5566j0605r669M362
16328C3318q024n314q449L433M62j610p205O254j868j471k086N479J7615N673
16314C6207j2815M964J020q009o038J2883J4287j718O055l283j6598q616k583
16301A5756r232n706j497K587J3601j204J1344J0063r993p84J5349j2386k2657
16288E241k214K352K491J3591M508J4458J815j0669l955P616k622m226l743p19
16274B3924j2032m268M781J3325O079R2r817K024r35Q198J823l494j0804J2605
16260C1501N16M344q771p83M206j990q156J780J374j1836j3529k771J3938k45
16246I578q035Q562J7223J2827N467n437m859j17O159L27j0900J224j2305M651
$$ plain form
16232 24365 10211 7458 19988 27395 24750 12326 23126 28960 36968 27280 39027 42301 27194
16219 27194 29234 32411 21128 12291 14895 30359 29907 26633 15529 16892 13974 12754 14779 17075
16205 17075 6214 10210 23780 21873 24599 17475 4371 2650 9335 18046 23355 22569 18576 6329
16191 6329 12489 11885 24416 26170 22374 17612 27697 33123 29241 13206 22021 20925 19464 33386
16177 33386 42349 45539 44828 50325 36521 24394 12589 19610 10088 11677 11681 15286 2239 -153
16163 -153 20027 24540 19581 24500 21732 12501 5226 1158 -1010 -6763 -2754 -7620 -22064 -26892
16149 -26892 -15203 -7551 -6768 -9160 -7567 8825 9282 19503 13908 -302 -7739 -2977 -3258 7756
16135 7756 9549 1417 7555 6039 7132 3303 15745 19890 7318 -2451 -5790 -4545 9521 3059
$$ packed form
16232B4365j4154k753J2530P407k645j2424J0800N834Q008r688J1747L274j5107
16219B7194K040L177j1283q837K604J5464m52l274j1104J363k918j220K025K296
16205A7075j0861L996J3570j907K726p124j3104j721O685Q711N309p86l993j2247
16191F329O160o04J2531J754l796m762J0085N426l882j6035Q815j096j461J3922
16177C3386Q963L190p11N497j3804j2127j1805P021r522J589ML605j3047k392
16163a53K0180M513m959M919k768r231p275m068k168n753M009m866j4444m828
16149b6892J1689P652P83k392J593J6392M57J0221n595j4210p437M762k81J1014
16135G756J793q132O138j516J093l829J2442M145j2572r769l339J245J4066o462
$$ plain form
16121 3059 4396 3324 22858 25999 35340 35800 22746 7004 8905 8684 11282 -1740 -4442 4311
16107 4311 1863 -10544 -313 6980 10679 13930 19781 16585 18269 37901 52764 45348 37771 36369
16093 36369 38471 32794 27918 28099 22720 29116 32304 33358 25055 14184 23705 28170 27571 18538 10989
16078 10989 8453 14223 17100 12030 17619 12949 3301 23085 29972 34494 26842 22773 24531 29791
16064 29791 34694 23050 21027 23011 21768 34097 31619 24847 23983 19929 16983 12204 27774 33505
16050 33505 35498 34630 17334 12176 18237 18323 14650 14564 10630 8763 8034 4411 5862 6672 7726 12487
16034 12487 14834 17475 20859 21846 17749 10575 10167 26455 23219 14173 16586 6246 10933 17918
16020 17918 15240 8968 2117 -4954 1549 -952 -6964 5977 8089 11223 14239 19342 23373 12709
$$ packed form
16121C059J337j072J9534L141R341M60j3054j5742J901k21K598j3022k702Q753
16107D311k448j2407J0231P293L699L251N851l196J684J9632J4863p416p577j402
16093C6369K102n677m876J81n379O396L188J054q303j0871R521M465n99r033p549
16078A0989k536N770K877n070N589m670r648J9784O887M522p652m069J758N260
16064B9791M903j1644k023J984j243J2329k478o772q64m054k946m779J5570N731
16050C3505J993q68j7296n158O061Q6l673q6l934j867p29l623J451Q10J054M761
16034A2487K347K641L384R87m097p174m08J6288l236r046K413j0340M687O985
16020A7918k678o272o851p071O503k501o012J2941K112L134L016N103M031j0664
$$ plain form
16006 12709 4694 3188 6148 10621 9136 538 4428 1015 -3485 5754 8880 5820 10303 6454
15992 6454 11775 8925 9528 16616 27118 22178 18106 24181 3068 5854 12764 15517 17012 23408
15978 23408 17183 28810 25066 18474 11650 4778 -3140 -6625 -1885 6040 13848 7910 -7174 7884
15964 7884 18565 6640 -4321 7137 24003 18132 18465 24952 1601 -7466 10587 8894 11451
15951 11451 18173 25613 20456 15966 16982 23720 26738 30761 30947 22038 12222 9693 10402 19242 24919
15936 24919 24587 25564 28729 25358 17515 20987 29015 27054 20407 13815 24846 31372 21337 26276
15922 26276 31686 19911 15317 6181 -580 -3006 4233 14363 11210 -1506 1273 6009 10471 19187
15908 19187 28133 20037 19187 24668 25805 19515 23573 27937 34298 35873 27483 19117 16700 24799 35241
$$ packed form
16006A2709q015j506K960M473j485q598L890l413m500R239L126l060M483l849
15992F454N321k850O03P088J0502m940m072O075k1113K786O910K753J495O396
15978B3408o225J1627l744o592o824o872p918l485M740P925P808n938j5084J5058
15964G884J0681j1925j0961J1458J6866n871L33O487k3351r067J8053j693K557
15951A1451O722P440n157m490J016O738L018M023J86q909r816k529P09Q840N677
15936B4919l32R77L165l371p843L472Q028j961o647o592J1031O526j0035M939
15922B6276N410j1775m594r136o761k426P239J0130l153j2716K779M736M462Q716
15908A9187Q946q096q50N481J137o290M058M364O361J575q390q366k417Q099J0442
$$ plain form
15893 35241 28377 9070 4664 18403 9756 5574 4403 8283 18743 17839 12102 8870 -3006 186
15879 186 18817 18678 2138 723 22853 23105 6820 12518 16646 13472 14569 15205 10456 17843 21456
15864 21456 16021 10495 7944 7655 6813 19476 25990 13326 13710 15001 8378 15025 14628 10071 1901
15849 1901 -5885 -8031 2774 14820 18524 8205 -92 -2414 -10047 -16285 -2156 17205 23438
15836 23438 16173 10034 9333 8079 1035 -8900 -8886 5923 34135 18538 6430 -529 7024 11002
15822 11002 11937 12279 2918 -5195 -7818 2474 15711 -6544 -1279 -16954 -24037 -19376 -15197 1149
15808 1149 6658 -319 -3129 6521 18065 24573 28320 33155 29572 22231 27074 33161 34018 31888 38539
15793 38539 33572 28547 28289 29712 29215 24001 1864 1653 1574 -2947 3673 2526 10729 26404 16206
$$ packed form
15893C5241o864j9307m406J3739q647m182j171L880J0460r04n737l232j1876L192
15879A86J8631j39j6540j415K2130K52j6285N698M128l174J097O36m749P387L613
15864B1456n435n526k551k89q42J2663O514j2664L84J291o623O647l97m557q170
15849A901p786k146J0805J2046L704j0319q297k322p633o238J4129J9361O233
15836B3438p265o139p01j254p044r935J4J4809K8212j5597j2108o959P553L978
15822A1002R35L42r361q113k623J0292J3237k2255N265j5675p083M661M179J6346
15808A149N509o977k810R650J1544O508L747M835l583p341M843O087Q57k130O651
15793C8539m967n025k58J423m97n214k2137k11p9m521O620j147Q203J5675j0198
$$ plain form
15778 16206 6161 11308 4713 -2031 -933 5469 5337 4032 12114 21372 16352 4941 5310 14408
15764 14408 20308 24672 21469 29069 17977 18806 24661 29466 28255 26646 31847 26042 20864 22486
15750 22486 22574 26760 29467 7978 7675 2277 1535 17704 30534 38347 33100 29166 22389 28831 28767
15735 28767 19422 10433 25035 53869 47257 30933 24992 18018 18003 20943 27500 25853 22762 19762
15721 19762 741 9411 12750 1536 -374 890 10443 1582 9613 7315 11912 2245 1311 1776
15707 1776 973 4958 12982 17124 20094 16489 19969 32198 19861 6419 8435 11705 17744 19543
15693 19543 7091 6328 3518 20472 29196 16947 7465 -1251 3181 6383 -4771 -5196 5311 -2452
15679 -2452 -15674 -14456 1833 -3388 -6279 -5510 7386 10980 14977 17542 17233 21362 18298 19380
$$ packed form
15778A6206j0045N147o595o744J098O402j32j305Q082R258n020j1411L69R098
15764A4408N900M364l203P600j1092Q29N855M805j211j609N201n805n178J622
15750B2486Q8M186K707k1489l03n398p42J6169J2830P813n247l934o777O442o4
15735B8767r345q989J4602K8834o612j6324n941o974j5K940O557j647l091l000
15721A9762j9021Q670L339j1214j910J264R553q861Q031k298M597r667r34M65
15707A776q03L985Q024M142K970l605L480J2229j2337j3442K016L270O039J799
15693A9543j2452p63k810J6954Q724j2249r482q716M432L202j1154m25J0507p763
15679b452j3222J218J6289n221k891P69J2896L594L997K565l09M129l064J082
$$ plain form
15665 19380 24570 26682 27363 22878 18607 8260 12800 10788 26187 51797 38851 25503 15026
15652 15026 9796 -275 -6326 -4168 6144 9758 4438 11175 12447 7136 -10949 -24394 -17358
15639 -17358 -3577 12020 20210 25081 22567 27595 31746 29955 36001 34190 27691 22570 23709 18666
15625 18666 5926 -1425 4363 5966 9936 13849 14987 16413 12654 19843 22638 22955 18246 17345 18491
15610 18491 10160 13341 12217 14426 15440 12279 21121 14766 3341 17203 31081 27695 25574 39883
15596 39883 43584 42475 39029 28812 23137 15467 18112 19440 25737 27124 27546 34540 31648 17108
15582 17108 23616 27714 22160 23583 25098 10805 4798 7275 14280 22756 35817 25027 10187
15569 10187 12896 27938 26274 17554 19530 21127 646 1463 7628 10128 1369 -6450 -17142 -18820
$$ packed form
15665A9380N190K112O81m485m271j0347M540k012J5399K5610j2946j3348j0477
15652A5026n230j0071o051K158J0312L614n320O737J272n311j8085j3445P036
15639a7358J3781J5597Q190M871k514N028M151j791O046j811o499n121J139n043
15625A8666j2740p351N788J603L970L913J138J426l759P189K795L17m709r01J146
15610A8491q331L181j124K209J014l161Q842o355j1425J3862J3878l386k121J4309
15596C9883L701j109l446j0217n675p670K645J328O297J387M22O994k892j4540
15582A7108O508M098n554J423J515j4293o007K477P005Q476J3061j0790j4840
15569A0187K709J5042j664q720J976J597k0481Q17O165K500q759p819j0692j678
$$ plain form
15555 -18820 -6973 -3347 14404 13028 7814 3557 -4162 5085 -2155 -72 -17509 -20634 -13309 3757
15541 3757 315 6571 6483 11074 7483 -2257 -11903 -16328 379 9821 9307 9317 25555 32946 18342
15526 18342 10199 6325 7788 -874 -837 -3218 -6085 -10512 -15734 -10328 -10012 -9588 -633 -695 -12120 -21794
15510 -21794 -20187 -16939 -8716 6128 8078 -1143 -6714 2023 22230 24778 23810 16427 3421 -5044
15496 -5044 -8748 -7156 -1571 766 13223 13601 22680 29510 25009 28923 38938 37412 49407 59438
15482 59438 54951 43204 22652 21602 21493 25252 21694 17373 20424 23006 17728 13093 12152 18146
15468 18146 22099 13154 12711 8225 -5195 3015 8274 4994 426 1401 4777 -5319 1093 7408
15454 7408 14273 19511 20942 19427 31710 41943 30109 14291 5520 9186 23579 14479 1829
$$ packed form
15555a8820J1847L626J7751j376n214m257p719R247p240K083j7437l125P325J7066
15541C757l442O256q8M591l591r740r646m425J6707R442n14J0J6238P391j4604
15526A8342q143l874J463q662L7k381k867m427n222N406L16M24Q955o2j1425r674
15510b1794J607L248Q223J4844J950r221n571Q737K0207K548r68p383j3006q465
15496e044l704J592N585K337J2457L78R079O830m501L914J0015j526J1995J0031
15482E9438m487j1747k0552j050j09L759l558m321L051K582n278m635r41N994
15468A8146L953q945m43m486j3420Q210N259l280m568R75L376j0096O412O315
15454G408O865N238J431j515J2283J0233j1834j5818q771L666J4393r100j2650
$$ plain form
15441 1829 -6133 -10892 4264 23100 16471 10864 14800 17237 13880 1989 -1386 13096 12439 8298
15427 8298 12639 8336 13442 21688 19445 25813 18120 3087 -9879 -23335 -28211 -24157 -26484 -23448
15413 -23448 -6877 7124 19465 20848 12886 3877 1550 12788 22568 13285 15320 33904 28557
15400 28557 18118 1670 -7000 1606 7984 6816 3277 -4718 -5284 2846 3308 -14936 -18739 -7385
15386 -7385 -12669 -21275 -5904 14986 -310 -15209 -10005 4143 28748 29644 17937 5930 3202
15373 3202 14786 18692 15588 20768 20449 20969 25884 33791 22253 4161 -11763 -11157 -12265 1844
15359 1844 13474 21565 23452 23511 16242 9694 10957 10298 -4714 -1632 5568 1565 14693 22036 18865
15344 18865 12210 14756 19776 10596 4958 -976 -4077 -5213 549 9461 20130 17770 10833 11859
$$ packed form
15441A829p962m759J5156J8836o629n607L936K437l357j1891l375J4482o57m141
15427H298M341m303N106Q246k243O368p693j5033j2966j3456m876M054k327L036
15413b3448J6571J4001J2341J383p962r009k327J1238R780r283K035J8584n347
15400B8557j0439j6448q670Q606O378j168l539p995n66Q130M62j8244l803J1354
15386g385n284q606J5371K0890j5296j4899N204J4148K4605Q96j1707j2007k728
15373C202J1584L906l104N180l19N20M915P907j1538j8092j5924O06j108J4109
15359A844J1630Q091J887N9p269o548J263o59j5012L082P200m003J3128P343l171
15344A8865o655K546N020r180n638n934l101j136N762Q912J0669k360o937J026
$$ plain form
15330 11859 8072 -6789 -25948 -25500 -10062 3171 11112 15648 10413 14141 17730 26938 24061 23493
15316 23493 32775 20390 6201 13516 14227 19319 14754 7643 18835 21518 33465 27251 28471 21827
15302 21827 19239 16807 16229 21903 23927 19619 6668 9415 1538 7823 15749 20561 22543 20812
15288 20812 17443 17625 29648 32012 26276 14939 36401 37938 26259 22686 23070 21141 17725 22597
15274 22597 28952 23955 17880 19258 13727 9007 20469 8778 -9505 1443 9615 7038 13904
15261 13904 28580 14621 -2354 -7709 -9196 -10001 -3993 -2320 -1199 -4486 -145 5087 4715 2903
15247 2903 -5258 -6246 -10362 1553 559 -13569 -18234 -16036 -9957 -1410 -5916 8684 10188 5634
15233 5634 2563 7219 11683 10845 -427 -8783 -161 -3591 -8423 -7673 -11463 -12061 -3767 -1465 -463
$$ packed form
15330A1859l787j4861j9159M48J5438J3233P941M536n235L728L589R208k877n68
15316B3493R282j2385j4189P315P11N092m565p111J1192K683J1947o214J220o644
15302B1827k588k432n78N674K024m308j2951K747p877O285P926M812J982j731
15288B0812l369J82J2023K364n736j1337K1462J537j1679l573L84j929l416M872
15274B2597O355m997o075J378n531m720J1462j1691j8283J0948Q172k577O866
15261A3904J4676j3959j6975n355j487q05O008J673J121l287M341N232l72j812
15247B903q161r88m116J1915r94j4128m665K198O079Q547m506J4600J504m554
15233E634l071M656M464q38j1272q356Q622l430m832P50l790n98Q294K302J002
$$ plain form
15218 -463 15933 13088 9726 19249 20192 19087 18639 13837 9783 12566 3274 6628 13452 3598 6436
15203 6436 2137 -8406 -13736 -15071 1238 -1521 4377 -1224 665 12799 17499 7177 -12342
15190 -12342 -21924 -20335 -18769 -12295 -4092 -3082 456 6464 11833 12275 8840 -2313 -13969 -4847
15176 -4847 707 16284 22928 15114 8698 3594 1483 -1040 -281 -4154 -10021 -8530 683 -1597 8948
15161 8948 13563 -190 -19163 -10897 13986 22132 13538 11153 16251 15642 12186 22499 43901 37027
15147 37027 17321 2034 8959 26893 23559 10334 2625 8497 4218 -3763 1999 17416 25211
15134 25211 25369 25494 16856 -9060 -9968 -3701 -6599 -7985 1141 11241 -1494 8106 3554 1760
15120 1760 -750 -13633 -7373 -2102 -11673 -10616 9948 28425 19946 -5231 -24346 -24480 -4847
$$ packed form
15218d63J6396k845l362R523R43j105m48m802m054K783r292L354O824r854K838
15203F436m299j0543n330j335J6309k759N898n601J889J2134M700j0322j9519
15190a2342r582J589J566O474Q203J010L538O008N369M42l435j1153j1656R122
15176d847N554J5577O644p814o416n104k111k523P59l873n867J491R213k280J0545
15161H948M615j3753j8973Q266K4883Q146q594k385N098o09l456J0313K1402o874
15147C7027j9706j5287O925J7934l334j3225p709N872m279p981N762J5417P795
15134B5211J58J25q638k5916r08O267k898j386R126J0100j2735R600m552j794
15120A760k510j2883O260N271r571J057K0564J8477q479k5177j9115j34J9633
$$ plain form
15107 -4847 -3055 -178 9085 20176 23671 8594 2218 7089 7886 2696 -1980 -2010 -7906 -16814 -8519
15092 -8519 17091 21843 33661 29627 20373 20976 28925 27059 3288 -8173 -1632 -98 859 -7208
15078 -7208 -8964 -9242 -13624 8835 23463 22242 6262 11421 7333 8494 2963 12326 26713 21412
15064 21412 -1907 -12531 -5611 6077 11884 13720 16572 22461 24266 4480 1675 20141 32343
15051 32343 16958 7019 3702 -1636 10669 10847 5320 -629 -4678 -850 -3444 -457 12955 17657
15037 17657 26907 24972 13664 2354 -9881 -11824 -11945 -7581 13016 24247 14429 15921 23170
15024 23170 32516 41836 31879 26790 23044 18513 8646 -668 1474 9747 9959 6288 7249 447 1861
15009 1861 -826 6382 6697 55 -8964 -16061 -27191 -23059 -17239 -17529 -3891 10482 22255 20720
$$ packed form
15107d847J792K877R263J1091L495j5077o376M871P97n190m676l0n896q908Q295
15092h519K5610M752J1818m034r254O03P949j866k3771j1461O541J534R57q067
15078g208j756k78m382K2459J4628j221j5980N159m088J161n531R363J4387n301
15064B1412k3319j0624O920J1688N807J836K852N889J805j9786k805J8466J2202
15051C2343j5385r939l317n338J2305J78n527n949m049L828k594K987J3412M702
15037A7657R250j935j1308j1310j2235j943j21M364K0597J1231r818J492P249
15024B3170R346R320r957n089l746m531r867r314K142Q273K12l671R61o802J414
15009A861k687P208L15o642r019p097j1130M132N820k90J3638J4373J1773j535
$$ plain form
14995 20720 10723 6400 -1212 3528 -2028 -8347 -1128 14333 20247 4888 1700 6326 -2872 -9811
14981 -9811 -4546 -9957 -12723 -10076 -5676 -379 13729 25784 22072 11622 9299 10646 -367 3265
14967 3265 5376 7650 4816 8520 7770 4629 1491 9561 15143 22492 22624 13676 8430 4132 5120
14952 5120 2513 -2114 -1473 5377 -6765 -13596 258 7098 13664 17642 9717 -5657 -10883 2313
14938 2313 -636 -5721 7280 20077 25688 25602 17042 14807 10037 -2251 -7623 -6413 -15011 -8352
14924 -8352 -10021 -5756 -1504 -2748 -9532 -4826 -2565 -7670 -771 2033 -4333 -391 14998 12541
14910 12541 11336 10352 20353 24456 19131 9602 4599 21171 27854 23076 24932 24223 19587 21957
14896 21957 22597 14969 15690 965 -12222 -13331 -12943 -5032 1102 7680 16745 3850 -10926 -10232
$$ packed form
14995B0720r997m323p612M740n556o319P219J5461N914j5359l188M626r198o939
14981i811N265n411k766K647M400N297J4108J2055l712j0450k323J347j1013L632
14967C265K111K274k834L704p50l141l138Q070N582P349J32q948n246m298R88
14952E120k607m627O41O850j2142o831J3854O840O566L978p925j5374n226J3196
14938B313k949n085J3001J2797N611q6q560k235m770j2288n372J210q598O659
14924h352j669M265M252j244o784M706K261n105O899K804o366L942J5389k457
14910A2541j205r84J0001M103n325r529n003J6572O683m778J856p09m636K370
14896B1957O40p628P21j4725j3187j109L88P911O134O578R065j2895j4776O94
$$ plain form
14882 -10232 -1776 -6130 -9378 -3487 -2742 6668 1367 -14291 -13335 -10218 -16586 -8923 2583 18123
14868 18123 34901 23968 10163 -7262 -8914 -16042 -19823 -26597 -13986 -14800 -17886 -12821 390
14855 390 511 -1867 1783 17547 18029 3314 -2292 -7965 -8378 -7781 -8075 -7332 1019 -1047 -3668 -2768
14839 -2768 -18390 -14317 1938 10126 14023 10522 -2702 4433 -3904 -16220 -18583 -28858 -21782
14826 -21782 -7379 13611 21979 19493 16940 18792 14095 6080 -5739 -5811 -948 -1747 -6589 -2569
14812 -2569 -577 -7883 -6291 -6932 3184 9650 20443 30322 23878 25246 14620 9135 3554 -9021
14798 -9021 -12498 1638 13774 13754 3742 -9280 -11588 -7482 -4815 -5232 -4918 8434 19596 19497 20022
14783 20022 14250 10528 3491 -7906 -3966 17502 17910 17071 15103 6047 6171 7499 11335 12682 13536
$$ packed form
14882a0232Q456m354l248N891P45R410n301j5658R56L117o368P663J1506J5540
14868A8123J6778j0933j3805j7425j652p128l781o774J2611q14l086N065J3211
14855C90J21k378L650J5764M82j4715n606n673m13N97k94P43Q351k066k621R00
14839b768j5622M073J6255Q188L897l501j3224P135q337j2316k363j0275P076
14826b1782J4403K0990Q368k486k553J852m697q015j1819p2M863p99m842M020
14812b569J992p306J592o41J0116O466J0793R879o444J368j0626n485n581j2575
14798i021l477J4136J2136k0j0012j3022k308M106K667m17L14J3352J1162r9N25
14783B0022n772l722p037j1397L940K1468M08q39j968r056J24J328L836J347Q54
$$ plain form
14768 13536 8504 -9898 -13213 -648 -153 -14773 -15088 -23140 -26363 -24439 -21988 -16597 -18104 -14297
14754 -14297 1907 -5487 -7511 12256 19264 17845 16599 11950 6799 -6449 -4635 -4063 11409 26949
14740 26949 20099 14905 13856 10028 9674 4017 -2514 -5417 718 1165 2691 -10356 -10882 -10919 -8734
14725 -8734 -10361 -9924 -6736 -734 3490 7030 1917 2982 -921 -5828 1484 11659 3636 -1519 -10545
14710 -10545 -14384 -15142 -4892 -6345 -24970 -22400 -23454 -26281 -14790 -11288 -4840 -8412 -8782 -1012
14696 -1012 3249 5163 1640 -2567 2710 8439 2869 7584 10416 20839 21963 16715 16191 22774 20089
14681 20089 21696 28779 24095 8479 4005 11591 10306 458 3502 5714 11621 8077 1551 6851
14667 6851 3134 5939 7200 -1081 -11708 -5620 -16717 -22221 -15253 3082 5953 216 -4234 7476
$$ packed form
14768A3536n032j8402l315J2565M95j4620l15q052l223J924K451N391j507L807
14754a4297J6204p394k024J9767P008j419j246m649n151j3248J814N72J5472J5540
14740B6949o850n194j049l828l54n657o531k903O135M47J526j3047n26l7K185
14725h734j627M37L188O002M224L540n113J065l903m907P312J0175q023n155r026
14710a0545l839p58J0250j453j8625K570j054k827J1491L502O448l572l70P770
14696a012M261J914l523m207N277N729n570M715K832J0423J124n248n24O583k685
14681B0089J607P083m684j5616m474P586j285r848L044K212N907l544o526N300
14667F851l717K805J261q281j0627O088j1097n504O968J8335K871n737m450J1710
$$ plain form
14653 7476 -5350 -16104 -3256 -982 6416 10244 5013 11559 10267 3648 2342 15603 14793 14859
14639 14859 11599 7318 20798 27430 27503 25649 32130 35252 24382 8795 14999 15711 12523 15060
14625 15060 24986 18649 7922 8098 20151 30981 24573 21528 14427 15704 17260 15157 15103 16414
14611 16414 19272 9401 -2165 -553 -9375 -11015 -9753 -9843 1665 -13714 -16914 -3712 -118 2012
14597 2012 1481 1103 1422 3221 4556 -1405 -3112 2098 21378 22986 11230 -6707 -3752 -1421 2073
14582 2073 21925 12585 6139 4238 6426 16271 18635 9019 14656 4435 -6438 -7130 6535 14760
14568 14760 5733 -3110 -294 -3440 -2128 1394 -6092 -15133 -22595 -24921 -36556 -44558 -28528 -9188
14554 -9188 4378 -1743 -4890 -9320 -10171 -11461 3863 10037 414 2964 -168 -10102 -11679 -15298
$$ packed form
14653G476j2826j0754J2848K274P398L828n231O546j292o619j306J3261q10O6
14639A4859l260m281J3480O632P3j854O481L122j0870j5587O204P12l188K537
14625A5060R926o337j0727J76J2053J0830o408l045p101J277J556k103n4J311
14611A6414K858r871j1566J612q822j640J262r0J1508j5379l200J3202L594K130
14597B012n31l78L19J799J335n961j707N210J9280J608j1756j7937K955K331L494
14582B073J9852r340o446j901K188R845K364r616N637j0221j0873o92J3665Q225
14568A4760r027q843K816l146J312L522p486r041p462k326j1635q002J6030J9340
14554i188J3566o121l147m430q51j290J5324O174r623K550l132r934j577l619
$$ plain form
14540 -15298 -17496 -11037 -1333 1275 7461 13493 2155 -14006 -18364 -22008 -19876 -14707 -23530 -13528
14526 -13528 -359 4054 -1433 -1772 24755 31461 22032 6861 8200 940 -17294 -24454 -12064
14513 -12064 -12687 -8730 9911 -3956 -17313 -15390 -13703 -21773 -18096 -13114 -9664 -11244 -5209 662
14499 662 24231 18238 -2801 -2336 7628 2860 -4886 3236 -1138 71 -159 -1800 -681 -5781 -15399
14484 -15399 -18314 -13320 8145 18832 6507 -12481 -19577 -16314 -19034 -22536 -19814 -3359 2182
14471 2182 2234 -9583 -12786 -2591 -3886 -9793 -4186 12556 8200 3914 -6221 -9489 -2418 -6169
14457 -6169 9699 16904 5520 2636 -15878 -30821 -26378 -28363 -26727 -25588 -16310 760 1862
14444 1862 -2141 1253 3477 5335 -9507 -24037 -12320 6836 1528 -2787 176 -14102 -28120
$$ packed form
14540a5298k198O459R704K608O186O032j1338j6161m358l644K132N169q823J0002
14526a3528J3169M413n487l39K6527O706r429j5171J339p260j8234p160J2390
14513a2064o23L957J8641j3867j3357J923J687q070L677M982L450j580O035N871
14499F62K3569n993k1039M65R964m768p746Q122m374J209k30j641J119n100r618
14484a5399k915M994K1465J0687j2325j8988p096L263k720l502K722J6455N541
14471B182N2j1817l203J0195j295n907N607J6742m356m286j0135l268P071l751
14457f169J5868P205j1384k884j8514j4943M443j985J636J139R278J7070J102
14444A862m003L394K224J858j4842j4530J1717J9156n308m315K963j4278j4018
$$ plain form
14431 -28120 -44769 -37022 -31467 -23801 -15651 -11961 -5781 2612 14864 16470 4446 5176 317 -2316
14417 -2316 3332 4207 6032 13325 17552 8667 -8506 -13559 -4653 3657 2042 -1536 5799 1727 12819
14402 12819 19805 7672 -7257 -5061 5447 -5899 -13898 -6124 -4470 -3307 -7332 8933 17210
14389 17210 2738 -6150 -6158 -10400 -5789 -13735 -7931 -8097 -10597 -10397 6797 17568 12594 11527 6997
14374 6997 6906 7748 11860 8206 8104 -6633 -21166 -7810 17218 13359 -2665 559 4593 2672
14360 2672 11532 14907 754 -13946 -1925 6985 2272 -1094 3901 1210 -2085 -6871 -12987 -29570
14346 -29570 -24362 -15721 -12318 -7398 -274 342 3053 -5193 -11223 -20203 -7877 772 -17152 -2517
14332 -2517 23254 31060 30634 30262 17219 9442 14241 8618 5 -4920 -10944 -12275 -21754 -19775 -17466
$$ packed form
14431b8120j6649P747N555P666Q150L690O180Q393J2252J606j2024P30m859k633
14417b316N648Q75J825P293M227q885j7173n053Q906Q310j615l578P335m072J1092
14402A2819O986j2133j4929K196J0508j1346p999P774J654J163m025J6265Q277
14389A7210j4472q888qm242M611p946N804j66k500K00J7194J0771m974j067m530
14374F997r1Q42M112l654j02j4737j4533J3356K5028l859j6024L224M034j921
14360B672Q860L375j4153j4700J2021Q910m713l366M995k691l295m786o116j6583
14346b9570N208Q641L403M920P124O16K711q246o030q980J2326Q649j7924J4635
14332b517K5771P806m26l72j3043p777M799n623q613m925o024j331r479J979K309
$$ plain form
14317 -17466 -9866 4656 12018 14921 5176 -956 9371 20348 11500 -5920 -6998 4338 13591
14304 13591 22056 16889 15123 2065 1120 4710 9209 8207 10172 2812 -19437 -12392 709 -7347
14290 -7347 -14322 4828 20346 26553 19641 10862 5152 7502 8619 5768 2935 662 -232 -13002
14276 -13002 -16738 -23254 -32874 -34508 -20971 -20288 -23664 -19139 -11847 -10498 -7186 -11485 -10278 -8033
14262 -8033 -1121 -1379 -4368 -12521 -25131 -34647 -28965 -13798 -10885 -12327 -5609 13547 18741 14825
14248 14825 16795 15184 27516 29567 19286 -917 -11821 -17666 -2064 -4411 -5099 -1987 10855
14235 10855 8719 4033 7433 12093 13246 5304 5608 6185 -3808 -662 -658 -210 6515 2914 -2973 45
14219 45 -1417 3777 -2383 -20100 -15871 -12157 -12111 1880 1145 -5825 -14501 -12469 8335 3551 -13608
$$ packed form
14317a7466P600J4522P362K903r745o132J0327J0977q848j7420j078J1336R253
14304A3591Q465n167j766j3058r45L590M499j002J965p360k2249P045J3101q056
14290g347o975J9150J5518O207o912q779n710K350J117k851k833k273q94j2770
14276a3002l736o516r620j634J3537O83l376M525P292J349L312m299J207K245
14262h033O912k58k989q153j2610r516N682J5167K913j442O718J9156N194l916
14248A4825J970j611J2332K051j0281k0203j0904n845J5602k347o88L112J2842
14235A0855k136m686L400M660J153p942L04N77r993L146MM48O725l601n887L018
14219D5j462N194o160j7717M229L714M6J3991p35o970q676K032K0804m784j7159
$$ plain form
14204 -13608 -21538 -20524 -22236 -29316 -27969 -19332 -13678 -23555 -7775 -10223 -14252 -23977 -25434 -19867
14190 -19867 -15958 4117 12130 4219 -4091 2028 16441 18815 8728 6025 -7290 -15918 -13706
14177 -13706 -8501 -14234 -15801 -16123 -19968 -20751 -14989 -2448 -11047 -1751 -2371 -15484 -17927 -10165 -12323
14162 -12323 -8869 -12424 -12516 -6500 -15814 -16545 -17489 -14451 -6966 3654 15255 20479 5307 4695 14587
14147 14587 35742 45138 28410 15063 21244 27976 28441 33804 24889 27104 37113 32394 17504
14134 17504 6891 -12595 -7002 -9167 -8589 -9726 -4027 -678 -6150 -8258 -15289 -7831 -2271 -14874
14120 -14874 -18142 -25006 -26514 -11159 -14460 -29386 -21279 -18161 -11942 -17211 -8179 8376 11446 8250
14106 8250 949 -13748 -2906 15031 26207 13188 -355 7311 20635 29221 36275 20233 -6245
$$ packed form
14204a3608p930J014j712p080J347Q637N654r877J5780k448m029r725j457N567
14190a9867L909K0075Q013p911q310O119J4413K374j0087k703j3315q628K212
14177a3706N205n733j567l22l845p83N762J2541q599R296o20j3113k443P762k158
14162a2323L454l555r2O016r314p31r44L038P485J0620J1601N224j5172o12R892
14147A4587K1155R396j6728j3347O181O732M65N363q915K215J0009m719j4890
14134A7504j0613j9486N593k165N78j137N699L349n472k108p031P458N560j2603
14120a4874l268o864j508J5355l301j4926Q107L118O219n269R032J6555L070l196
14106H250p301j4697J0842J7937J1176j3019j3543P666J3324Q586P054j6042k6478
$$ plain form
14093 -6245 -2114 9631 7203 -4642 -12844 -23356 -18295 -15652 -8065 -16072 -23792 -7261 9243
14080 9243 11462 5049 16882 6197 4448 2037 -3035 -1630 10691 19607 4535 -4540 -445 11300
14066 11300 24361 16505 6923 9060 1666 -10477 -16439 -17762 -8332 -277 -14612 -19946 -11387 -23050
14052 -23050 -34633 -30072 -31745 -19313 -12736 -4341 -1109 -13128 -18277 -20762 -22845 -18282 -16102 -4367
14038 -4367 2706 -6582 -13670 -11466 -5811 -8001 474 3116 -1871 -4760 -10835 -4880 871 -670 6284
14023 6284 11523 15644 31070 32301 20271 14840 3436 -2874 1290 11583 8564 24502 26686
14010 26686 532 -15930 -16456 -15824 -13677 -4995 -4750 -792 -5763 -5157 7548 -348 667 4325 9877
13995 9877 12359 -2388 -5529 -15013 -11180 -10765 9391 16824 1383 -6808 -3695 -5675 -483 10125
$$ packed form
14093f245M131J1745k428j1845q202j0512N061K643P587q007p720J6531J6504
14080I243K219o413J1833j0685j749k411n072J405J2321Q916j5072r075M095J1745
14066A1300J3061p856r582K137p394j2143n962j323R430Q055j4335n334Q559j1663
14052b3050j1583M561j673J2432O577Q395L232j2019n149k485k083M563K180J1735
14038d367P073r288p088K204N655k190Q475K642m987k889o075N955N751j541O954
14023F284N239M121J5426J231j2030n431j1404o310M164J0293l019J5938K184
14010B6686k6154j6462n26O32K147Q682K45L958m971O06J2705p896J015L658N552
13995I877K482j4747l141r484L833M15K0156P433j5441q191L113j980N192J0608
$$ plain form
13981 10125 26178 22867 13902 7515 4151 11003 11972 7464 -132 1153 11688 10918 4969 -10817
13967 -10817 -16333 -20558 -14572 8549 28702 39682 32283 16978 5250 6196 9772 2198 2457 -483
13953 -483 -5260 8529 11885 1585 4962 -7132 -13243 -1248 2331 7608 164 6737 7199 -1387
13939 -1387 461 6188 -8264 -3080 1782 -5327 -62 11250 2225 -11055 -13824 -11737 -14109 -7051
13925 -7051 -1550 -7793 -6947 -1876 -8080 -13320 -14906 -7632 -1702 551 7010 15036 6840 -1901 159
13910 159 1724 11623 17946 11441 -6889 -12047 -15572 -6448 9952 16709 9412 7943 3210 -2889
13896 -2889 -5359 1077 5180 12803 11877 2910 -12946 -9769 -806 2879 -4374 -14089 -16622 -13166 -11285
13881 -11285 -16608 -8473 1538 9242 7843 15479 10264 14697 23609 14900 16971 11837 -2269 -9552
$$ packed form
13981A0125J6053l311q965o387l364O852R69m508p596J285J0535p70n949j5786
13967a0817n516m225N986K3121K0153J0980p399j5305j1728R46L576p574K59k940
13953d83m777J3789L356j0300L377j2094o111J1995L579N277p444O573M62q586
13939a387J848N727j4452N184M862p109N265J1312r025j3280k769K087k372P058
13925g051N501o243Q46N071o204n240j586P274N930K253O459Q026q196q741K060
13910A59J565R899O323o505j8330n158l525R124J6400O757p297j469m733o099
13896b889k470O436M103P623r26q967j5856L177Q963L685p253r715k533L456J881
13881a1285n323Q135J0011P704j399P636n215M433Q912q709K071n134j4106p283
$$ plain form
13867 -9552 -3294 2704 -3500 -13620 -8824 696 9861 13546 20779 7129 -1492 -7698 -6212 -859
13853 -859 3495 -7665 -2662 12032 19986 24553 19764 8840 -2076 2102 -6393 3563 4776 -5089
13839 -5089 -9049 -4720 -10832 -18090 -23927 -31418 -26601 -15448 -9688 102 9564 -1309 -5092 -6345
13825 -6345 -2317 -7368 -2077 193 7630 5227 -5647 -5557 954 2857 -1474 1904 3089 13176 20400
13810 20400 11337 12058 13466 -2108 -16894 -7248 3408 4689 3743 1479 -10087 -7725 2661 -2198
13796 -2198 -1935 13697 24293 17383 3585 -6386 -13167 -11714 -5411 -8078 12086 15575 185 -20483
13782 -20483 -20763 -7230 13884 10063 930 -2374 6592 1751 -203 383 -2889 -2351 -9170 -13096 -12684
13767 -12684 -17308 -19648 -10473 -4298 -2973 -8906 -19461 -12314 -2895 5043 1567 380 2036 -7657
$$ packed form
13867i552O258N998o204j0120M796R520R165L685P233j3650q621o206J486N353
13853h59M354j1160N003J4694P954M567m789j0924j0916M178q495R956J213r865
13839e089l960M329o112p258n837p491M817J1153N760R790R462j0873l783j253
13825f345M028n051N291K270P437k403j0874R0O511J903m331L378J185J0087P224
13810B0400r063P21J408j5574j4786R646J0656J281r46k264j1566K362J0386m859
13796b198K63J5632J0596o910j3798r971o781J453O303k667K0164L489j5390k0668
13782b0483k80J3533K1114l821r133l304Q966m841j954N86l272N38o819l926M12
13767a2684m624k340R175O175J325n933j0555P147R419P938l476j187J656r693
$$ plain form
13753 -7657 -11794 -9334 -15942 4303 1280 -2058 -2106 -3045 -4413 -19491 -10314 -4625 -6792 -10783 -5976
13738 -5976 4371 16332 8156 5618 13087 17064 17918 2228 -3264 -2556 -4545 994 -5418 -20687
13724 -20687 -18434 -23403 -9101 7160 3544 -5021 -2752 -8596 -9223 -8567 -2499 -1992 1051 4776 -5161
13709 -5161 3186 3158 2415 116 8248 11771 2491 -13842 -17192 -5387 537 -5977 -12134 2919 10549
13694 10549 9011 14239 12900 12581 1553 -7371 -15135 -17091 -4569 -5510 -19341 -13008 -9382 -5871
13680 -5871 -1573 351 732 -4774 831 5309 -11237 -27209 -21474 -11911 3877 -395 -1557 2976
13666 2976 3750 -2635 -6980 -8840 -2332 6135 9061 9286 7240 12066 6767 1922 6270 6953 2672
13651 2672 -11338 -17873 -18471 -25457 -23563 -12240 -5578 -874 7319 5887 -4218 -14092 -17469 -12608
$$ packed form
13753g657m137K460o608K0245l023l338m8r39j368j5078R177N689k167l991M807
13738e976J0347J1961q176k538P469L977Q54j5690n492P08j989N539o412j5269
13724b0687K253m969J4302J6261l616q565K269n844o27O56O068N07L043L725r937
13709e161Q347k8p43k299Q132L523r280j6333l350J1805N924o514o157J5053P630
13694A0549j538N228j339l19j1028q924p764j956J2522r41j3831O333L626L511
13680e871M298J924L81n506N605M478j6546j5972N735R563J5788m272j162M533
13666B976P74o385m345j860O508Q467K926K25k046M826n299m845M348O83m281
13651B672j4010o535n98o986J894J1323O662M704Q193j432j0105r874l377M861
$$ plain form
13637 -12608 -3919 -2750 -8846 -6627 -7984 -10998 -7358 -12752 -7939 -22280 -38959 -30662 -29554 -26728
13623 -26728 -7667 -14042 -5961 3394 -2454 -9393 -23700 -20196 -5559 2336 2676 6663 -474 -2245
13609 -2245 -6727 -2216 -1998 319 144 -7105 -10966 -3545 2039 5180 -709 -7408 -11009 -10146 3669
13594 3669 3804 7649 18196 20146 5100 -7466 -11100 1996 2410 2423 6727 14189 12385 3770 -8376
13579 -8376 -6555 -10006 -289 780 -2221 -9559 -7351 -985 -7807 -6631 -22 -4164 -7923 -12165 -10397
13564 -10397 -14854 -12376 -6925 -3660 -1352 1409 -3234 10120 15770 22114 12602 2215 8658 4924
13550 4924 1368 -7436 -6864 4852 -17 -13822 -6169 -2570 -8198 -471 11727 15924 6777 -2711
13536 -2711 -7974 -4434 -7586 962 8213 -6137 -25877 -21416 -10537 -14237 -15177 -17087 -16676 -25378
$$ packed form
13637a2608Q689J169o096K219j357l014L640n394M813j4341j6679Q297J108K826
13623b6728J9061o375Q081R355n848o939j4307L504J4637P895L40L987p137j771
13609b245m482M511K18K317j75p249l861P421N584L141n889o699l601Q63J3815
13594C669J35L845J0547J950j5046j2566l634J3096M14J3M304P462j804q615j2146
13579h376J821l451R717J069l001p338K208O366o822J176O609m142l759m242J768
13564a0397m457K478N451L265K308K761m643J3354N650O344r512j0387O443l734
13550D924l556q804N72J1716m869j3805P653L599n628P727J2198M197r147r488
13536b711n263L540l152Q548P251j4350j9740M461J0879l700r40j910M11q702
$$ plain form
13522 -25378 -31081 -32101 -26070 -20862 -16425 -27021 -24962 -27338 -15824 -3732 5459 9711 20700
13509 20700 20452 12525 3144 963 2022 11946 5812 5756 -7852 -1488 21596 32159 34904 26751
13495 26751 6112 -1958 -5727 1256 10130 3682 -257 -13049 -8448 -21800 -13044 -24420 -15499
13482 -15499 -5888 23 3095 3539 7340 -3567 -4265 -10519 -11693 -13210 -9985 3750 2256 -8675
13468 -8675 -6514 14408 10250 3384 -3577 -3470 -1854 -4417 12434 18016 23828 33789 32136 48050
13454 48050 67256 60868 51609 20165 -2371 -11446 -15219 -8578 -18271 -12009 -14012 -19378 -21428 -4553
13440 -4553 -2782 -10331 -18642 -13823 -22682 -23239 -8339 -1051 -3893 7768 8412 4654 -6003 -5830 -20422
13425 -20422 -28773 -22487 -706 8212 2771 12733 3345 -3376 -10520 -16842 -29398 -22404 -12632 -5549
$$ packed form
13522b5378n703j020O031N208M437j0596K059k376J1514J2092R191M252J0989
13509B0700k48p927r381k181J059R924o134n6j3608O364K3084J0563K745q153
13495B6751k0639q070l769O983Q874o448l939j2792M601j3352Q756j1376Q921
13482a5499R611N911L072M44L801j0907o98o254j174j517L225J3735j494j0931
13468h675K161K0922m158o866o961J07J616k563J6851N582N812R961j653J5914
13454D8050J9206o388r259l1444k2536r075l773O641r693O262k003n366k050J6875
13440d553J771p549q311M819q859n57J4900P288k842J1661O44l758j0657J73j4592
13425b0422q351O286K1781Q918n441R962r388o721p144o322j2556O994R772P083
$$ plain form
13411 -5549 -1356 14795 30649 37524 38913 30454 18115 12348 3886 2398 -11496 -8615 -10092 -9554
13397 -9554 -9573 -14033 -21474 -32436 -28593 -623 12033 -832 -4657 -13846 -10251 -16257 -13662 -4546
13383 -4546 -23274 -16842 -89 5340 2129 -8591 -11474 -20639 -27236 -19999 -12221 -7802 -6103 -19731
13369 -19731 -19925 -3675 12298 20298 24040 13512 22769 33368 22474 16376 16697 7042 -15341
13356 -15341 -17180 -6658 -7774 -10871 -12699 -10070 -10937 -9625 -24995 -13222 6701 18289 25964
13343 25964 20659 13300 7420 9145 -1053 -9706 -18472 -20431 -19411 -19396 -5757 -2379 -2402 -2993 6559
13328 6559 14605 13512 -456 2170 1104 -5812 -9328 -16832 -25266 -18929 -20582 -16040 -7248 -5367
13314 -5367 -7950 -12477 -2962 -1959 -11052 -1528 4826 -4275 4256 -1814 -20484 -26928 -9131 -10427
$$ packed form
13411e549M193J6151J5854O875J389q459j2339n767q462j488j3894K881j477N38
13397i554j9m460p441j0962L843K7970J2656j2865l825r189L595o006K595R116
13383d546j8728O432J6753N429l211j0720k883r165o597P237P778M419J699j3628
13369a9731j94J6250J5973Q000L742j0528R257J0599j0894o098L21r655k2383
13356a5341j839J0522j116l097j828K629q67J312j5370J1773J9923J1588P675
13343B5964n305p359n880J725j0198q653q766j959J020J5J3639L378k3n91R552
13328F559Q046j093j3968K626j066o916l516p504q434O337j653M542Q792J881
13314e367k583m527R515J003r093R524O354r101Q531o070j8670o444J7797j296
$$ plain form
13300 -10427 -7692 1622 3246 -2710 -8820 -5582 5874 8918 -6362 -13369 -13048 -13859 -8681 -13282
13286 -13282 -13946 -13689 -18480 -11753 3303 13594 20447 18811 2274 -20245 -33822 -25405 -19556 -27368
13272 -27368 -40630 -37647 -18357 -20253 -32654 -28070 -29790 -23155 -17246 -15016 -8094 -2473 1051 -295
13258 -295 -2142 13232 13102 16285 3385 -18930 -23480 -12688 -16132 -19829 -8421 -6326 -2874 -15819
13244 -15819 -35600 -29234 -9227 -1476 -9042 -14393 -20953 -18976 -11305 -8888 -12138 -12362 -3259 838
13230 838 -4294 -5277 -3690 -7872 -23802 -28091 -24924 -26967 -21869 -6662 -4051 -5318 8970 3023
13216 3023 -12764 -8341 5177 4930 14632 15549 2180 -9136 -1673 -40 11545 13993 17373 7916
13202 7916 -2972 -20795 -27195 -26734 -20085 -8238 -14948 -10460 3753 6997 7258 5716 11737 18506
$$ packed form
13300a0427K735R314J624n956o110L238J1456L044j5280p007L21q11N178m601
13286a3282o64K57m791O727J5056J0291O853j636j6537k2519j3577Q417N849p812
13272b7368j3262K983J9290j896j2401M584j720O635N909K230O922N621L524j346
13258b95j847J5374j30L183j2900k2315m550J0792l444l697J1408K095L452j2945
13244a5819j9781O366K0007P751p566n351o560J977P671K417l250k24R103M097
13230H38n132r83J587m182j5930m289L167k043N098J5207K611j267J4288n947
13216C023j5787M423J3518k47R702R17j3369j1316P463J633J1585K448L380r457
13202G916j0888j7823o400M61O649J1847o710M488J4213L244K61j542O021O769
$$ plain form
13188 18506 14744 13253 2183 -8741 -22098 -23352 -6484 1945 -4183 -9407 572 8754 -1653
13175 -1653 -2773 -9611 -11110 -13909 -11638 -4722 10654 12371 21378 25472 17392 7717 -2824 -15805
13161 -15805 -23040 -21693 -12302 -9220 -13578 -14443 -17563 -24842 -18673 5096 10014 9565 4867 -544 -7805
13146 -7805 -4954 -3337 2566 5639 4325 -220 -9167 -5764 4811 -3586 -141 1996 -14388 -17577
13132 -17577 -17483 -10791 -7237 -10551 -10454 -25831 -20336 -9264 -4491 -12200 -15711 -5054 12942 7314
13118 7314 -15833 -30038 -39086 -34034 -30651 -19865 -4640 -4616 4385 20205 20854 8198 5912 5393
13104 5393 4211 21583 21975 18465 22960 17778 15734 12188 16982 13643 4806 2021 -6201 -13422 -12007
13089 -12007 4608 12268 12442 -22754 -28988 -11835 -13347 -10323 -9116 4164 -4677 -1301 5123 6490
$$ packed form
13188A8506l762j491j1070j0924j3357j254J6868Q429o128n224R979Q182j0407
13175a653j120o838j499k799K271O916J5376J717R007M094q080r675j0541j2981
13161a5805p235J347R391L082m358q65l120p279O169K3769M918m49m698n411p261
13146g805K851J617N903L073j314m545q947L403J0575q397L445K137j6384l189
13132a7577R4O692L554l314R7j5377N495J1072M773p709l511J0657J7996n628
13118G314k3147j4205r048N052L383J0786J5225K4R001J5820O49j2656k286n19
13104E393j182J7372L92l510M495n182k044l546M794l339q837k785q222p221J415
13089a2007J6615P660J74l5196o234J7153j512L024J207J3280q841L376O424J367
$$ plain form
13075 6490 -3299 1650 1638 -5181 -12567 -10087 -14518 -17996 -18025 -24429 -33347 -21254 -9519 -15389 -31198
13060 -31198 -16104 15386 19287 13135 -3899 -21654 -16851 -10385 -2275 -1483 2596 -502 -9276 -9381
13046 -9381 -935 -4782 8870 20613 24397 20811 13166 8266 -2519 -2091 9742 22706 23375 24564
13032 24564 17541 21336 11977 2435 5279 3108 4855 12571 16114 6905 -7594 -6676 -9290 -23459
13018 -23459 -25008 -8919 -5931 -10624 -18362 -11488 1861 -5363 -10246 549 5136 -4098 -12252 -20914
13004 -20914 -15155 -10279 -7816 -13521 -21384 -19456 -2966 4669 1362 -6076 8703 17770 20073 6775
12990 6775 1777 6171 -10827 -20840 -16462 -13888 114 -739 -4627 1822 2322 8394 19136 25530
12976 25530 20896 28636 22310 19511 21576 17780 7120 15706 12650 2787 3854 12086 5160 9291
$$ packed form
13075F490r789M949j2o819p386K480m431l478k9o404q918J2093J1735n870j5809
13060c1198J5094L1490L901o152j7034j7755M803O466Q110P92M079l098q774j05
13046i381Q446l847J3652J1743L784l586p645m900j0785M28J1833J2964O69J189
13032B4564p023L795r359r542K844k171J747P716L543r209j4499R18k614j4169
13018b3459j549J6089K988m693p738O874J3349p224m883J0795M587r234q154q662
13004b0914N759M876K463n705p863J928J6490P635l307p438J4779R067K303j3298
12990F775m998M394j6998j0013M378K574J4002q53l888O449N00O072J0742O394
12976B5530m634P740o326k799K065l796j0660Q586l056r863J067Q232o926M131
$$ plain form
12962 9291 22979 35722 37947 24186 20023 18824 14462 24350 36188 34534 29881 25854 11279
12949 11279 -5820 -10541 950 1772 -3600 -6510 11425 20034 13036 23199 35333 31576 24760
12936 24760 23633 16447 8525 18932 28397 33165 29338 16843 22115 15329 13986 23282 37088 38978
12922 38978 34070 20708 10947 15032 20369 23780 31764 26982 26090 16323 9255 10729 19823 12651
12908 12651 7914 -657 6118 24525 27024 14046 16521 26353 20923 31702 33080 20874 21024 21965
12894 21965 19955 7408 18660 26242 23773 29594 31061 24975 21190 10360 10150 25587 35949
12881 35949 33686 27162 22773 18398 18223 20941 21034 12718 14457 20897 21706 14051 23032 39001 37957
12866 37957 31797 26552 32898 46858 55331 43717 25983 17070 28515 36825 32934 36698 52811
$$ packed form
12962I291J3688J2743K225j3761m163j199m362R888J1838j654m653m027j4575
12949A1279j7099m721J1491Q22n372k910J7935Q609o998J0163J2134l757o816
12936B4760j127p186p922J0407R465M768l827j2495N272o786j343R296J3806J890
12922C8978m908j3362r761M085N337L411P984m782q92r767p068J474R094p172
12908A2651m737q571O775J8407K499j2978K475R832n430J0779J378j2206J50R41
12894B1965k010j2547J1252P582k469N821J467o086l785j0830k10J5437J0362
12881C5949k263o524m389m375j75K718R3q316J739O440Q09p655Q981J5969j044
12866C7957o160n245O346J3960Q473j1614j7734q913J1445Q310l891L764J6113
$$ plain form
12853 52811 63567 65710 71052 66244 74478 76522 76210 65618 62706 64077 47482 52155 63643 69164
12839 69164 59203 45885 40296 46597 66740 75582 59495 54135 49645 62324 56724 53805 53035 57242
12825 57242 59656 60985 58134 66127 70222 68287 81450 82849 58908 46549 38469 46231 47851 65438
12811 65438 71729 74017 76353 80490 82836 89775 89827 73779 77991 90001 94326 88533 83621 80167
12797 80167 79166 83080 81574 79399 68051 65020 77825 91610 98403 90599 94575 106575 122204
12784 122204 123625 109168 108869 121360 121115 107635 96336 96146 98924 105461 121822 117446 116725 111763
12770 111763 106726 107349 118270 133221 139139 140076 127489 127965 142443 158182 159947 160750 158777 166566
12756 166566 166551 157052 156222 171013 166318 159385 172182 172396 180592 186672 187459 166955 169215 175399 182090
$$ packed form
12853E2811J0756K143N342m808Q234K044l12j0592k912J371j6595M673J1488N521
12839F9164r961j3318n589O301K0143Q842j6087n360m490J2679n600k919p70M207
12825E7242K414J329k851P993M095j935J3163J399k3941j2359q080P762J620J7587
12811F5438O291K288K336M137K346O939N2j6048M212J2010M325n793m912l454
12797H0167j001L914j506k175j1348l031J2805J3785O793p804L976J2000J5629
12784A22204J421j4457k99J2491k45j3480j1299j90K778O537J6361m376p21m962
12770A11763n037O23J0921J4951N918R37j2587M76J4478J5739J765Q03j973P789
12756A66566j5r499q30J4791m695o933J2797K14Q196O080P87k0504K260O184O691
$$ plain form
12741 182090 195888 190164 188769 203646 203916 197555 191906 196878 215746 232598 222543 222342 237178
12728 237178 243822 255340 246127 235511 239106 253059 258886 256782 262554 275075 279462 287424 290260
12715 290260 288418 285263 297840 313514 323046 315172 304329 309477 314139 325284 336712 343596 338599
12702 338599 338581 348834 343720 345779 340786 334574 346604 357826 352669 364834 368316 362371 388095
12689 388095 404121 400703 399926 385506 384580 393100 405183 418980 425925 425969 426414 435050 424405 425166
12675 425166 438357 439780 437616 433636 423618 417566 421528 422093 407397 399823 409617 422300 428311
12662 428311 421145 414556 416999 424935 427228 422128 421063 423055 415149 417919 420384 411144 404196 402636
12648 402636 400286 399855 403536 396549 389206 379455 377248 379642 388567 386190 366281 350718 345073 342449
$$ packed form
12741A82090J3798n724j395J4877K70o361n649M972J8868J6852j0055k01J4836
12728B37178O644J1518r213j0616L595J3953N827k104N772J2521M387P962K836
12715B90260j842l155J2577J5674R532p874j0843N148M662J1145J1428O884m997
12702C38599j8J0253n114K059m993o212J2030J1222n157J2165L482n945K5724
12689C88095J6026l418p77j4420r26Q520J2083J3797O945M4M45Q636j0645P61
12675D25166J3191J423k164l980j0018o052L962N65j4696p574R794J2683O011
12662D28311p166o589K443P936K293n100j065J992p906K770K465r240o948j560
12648D02636k350m31L681o987p343r751k207K394Q925k377j9909j5563n645k624
$$ plain form
12634 342449 333960 329090 332351 329408 334273 345116 329487 316516 307167 311913 304210 303356 303841 290352
12620 290352 290641 286733 281390 292051 292802 276914 277092 273466 259650 265582 260875 249337 249096 238284
12606 238284 234922 227568 220103 217467 215600 200943 206403 209468 224485 218637 205398 195712 186536
12593 186536 179668 177660 188013 189315 203505 194940 185782 184295 184352 177836 170119 170394 177912 180067
12579 180067 155898 140465 129207 128508 138324 151011 143538 126084 119471 128313 122653 115671 113041
12566 113041 116534 124005 126584 122959 114706 109816 110529 117591 112509 107108 114201 122663 115904 106412
12552 106412 93476 99485 101175 92707 91854 101501 103757 101007 85891 88050 92152 88547 91642 96657
12538 96657 99739 85686 78158 82615 89766 94429 85277 81717 84563 85492 70940 63270 64707 74794
$$ packed form
12634C42449q489m870L261k943M865J0843j5629j2971r349M746p703q54M85j3489
12620B90352K89l908n343J0661P51j5888J78l626j3816N932m707j1538k41j0812
12606B38284l362p354p465k636j867j4657N460L065J5017n848j3239r686r176
12593A86536o868k008J0353J302J4190q565r158j487N7o516p717K75P518K155
12579A80067k4169j5433j1258o99R816J2687p473j7454o613Q842n660o982k630
12566A13041L493P471K579l625q253m890P13P062n082n401P093Q462o759r492
12552A06412j2936O009J690q468q53R647K256k750j5116K159M102l605L095N015
12538I6657L082j4053p528M457P151M663r152l560K846R29j4552p670J437J0087
$$ plain form
12524 74794 74517 68951 55196 48794 63301 68874 57368 52958 34298 49084 60878 48362 46271
12511 46271 57897 63703 71263 72550 77885 65110 52914 63432 65323 63543 54622 45952 52770
12498 52770 61940 65379 58499 60732 63237 65474 59216 49811 37887 37814 28466 21632 19140 30209
12484 30209 37693 39589 33437 39354 41520 35254 17723 22672 33911 43446 37779 42078 43188 33390
12470 33390 27675 36005 35407 23061 21662 29571 40985 38185 22925 23760 23440 21721 26480 38115
12456 38115 47210 49241 35346 45439 59020 50299 39023 43504 33077 20743 28260 25772 22878
12443 22878 29625 20868 11588 8369 4902 -616 15385 16528 11874 12449 13275 17233 17426 18322 12649
12428 12649 25429 34300 40029 43796 38527 28094 27834 23656 13291 7285 919 10006 17927 11012
$$ packed form
12524G4794k77n566j3755o402J4507N573j1506m410j8660J4786J1794j2516k091
12511D6271J1626N806P560J287N335j2775j2196J0518J891j780q921q670O818
12498E2770R170L439o880K233K505K237o258r405j1924p3r348o834k492J1069
12484C0209P484J896o152N917K166o266j7531M949J1239R535n667M299J110r798
12470C3390n715Q330n98j2346j399P909J1414k800j5260Q35l20j719M759J1635
12456C8115R095K031j3895J0093J3581q721j1276M481j0427j2334P517k488k894
12443B2878O747q757r280l219l467n518J6001J143m654N75Q26L958J93Q96n673
12428A2649J2780Q871N729L767n269j0433k60m178j0365o006o366R087P921o915
$$ plain form
12414 11012 299 -7596 -13304 -11199 -1549 9517 20997 27956 6695 -9213 -4959 -5596 6188
12401 6188 866 12981 26098 17303 22412 28016 17217 11089 5988 5661 -1701 5204 15341 26833
12387 26833 27901 11738 6691 23242 16759 575 -1421 990 2866 5591 21626 14509 15409 28199
12373 28199 34146 29092 9880 951 -6849 -14168 -19326 -5742 -14588 -33908 -19041 -8570 3059
12360 3059 13575 12071 15493 13625 -1745 -8659 -11792 -9310 -12845 -12891 -12876 -7453 -7165 -9523 -5805
12345 -5805 -6964 -6769 -9454 -1464 -9896 223 19877 2172 -14486 -7202 -5367 -15052 -12415 -8288
12331 -8288 -11323 -5413 8602 -769 -8394 -15141 -13334 -16574 -17457 1592 8284 4768 2624 3257 9182
12316 9182 9881 17428 19728 20294 15295 8177 3385 -11373 -17454 -12766 -15557 -13150 -1735 8386
$$ packed form
12414A1012j0713p895n708K105R650J1066J1480O959k1261j5908M254o37J1784
12401F188n322J2115J3117q795N109N604j0799o128n101l27p362O905J0137J1492
12387B6833J068j6163n047J6551o483j6184j996K411J876K725J6035p117R00J2790
12373B8199N947n054j9212q929p800p319n158J3584q846j9320J4867J0471J1629
12360C059J0516j504L422j868j5370o914l133K482l535m6J5N423K88k358L718
12345e805j159J95k685P990q432J0119J9654j7705j6658P284J835r685K637M127
12331h288l035N910J4015r371p625o747J807l240q83J9049O692l516k144O33N925
12316I182O99P547K300N66m999p118m792j4758o081M688k791K407J1415J0121
$$ plain form
12302 8386 13115 15853 8353 -1060 -10522 -9401 -8235 -11324 -9266 -19757 -24777 -19814 -3241 -5218
12288 -5218 6073 18729 14924 6282 12728 13882 15641 -198 -5879 -12818 -13336 -2514 10281 15549
12274 15549 18965 13196 11747 20149 11649 4946 -9693 -9848 -12473 -15489 -8782 5602 -9182 -24294
12260 -24294 -29049 -19497 -9931 -9518 -7841 -15573 -4800 7895 13156 -4921 -17138 -19879 -27312 -23888
12246 -23888 -21944 -25812 -32668 -40404 -39537 -25017 -11410 -20708 -30958 -31374 -29199 -27658 -16331 -5561
12232 -5561 -2321 -4363 2819 10031 14742 8496 6102 14982 7036 6663 3705 -10761 -12409 -12744 -13165
12217 -13165 -22281 -27674 -20888 -11882 -20048 -4252 -9713 -26496 -17703 -9995 -23460 -23378 -13844 -17620
12203 -17620 -32631 -38457 -36116 -22512 -14659 -16551 -23773 -19134 -9291 -17884 -28538 -35616 -11808
$$ packed form
12302H386M729K738p500r413r462J121J166l089K058j0491n020M963J6573j977
12288e218J1291J2656l805q642O446J154J759j5839n681o939n18J0822J2795N268
12274A5549L416n769j449Q402q500o703j4639j55k625l016O707J4384j4784j5112
12260b4294m755R552R566M13J677p732J0773J2695N261j8077j2217k741p433L424
12246b3888J944l868o856p736Q67J4520J3607r298j0250m16K175J541J1327J0770
12232e561L240k042P182P212M711o246k394Q880p946l73k958j4466j648l35m21
12217a3165r116n393O786R006q166J5796n461j6783Q793P708j3465Q2R534l776
12203a7620j5011n826K341J3604P853j892p222M639R843q593j0654p078K3808
$$ plain form
12190 -11808 -9670 -30306 -18612 -9269 -7452 -15749 -21129 -27803 -26921 -23017 -13582 -13596 -22733 -24239 -19160
12175 -19160 -19395 -14967 -18976 -25567 -37917 -30827 -21111 -10468 -10703 -4476 -8661 -11170 -4074 -17258
12161 -17258 -15698 -19003 -11640 -1486 1228 -924 -13128 -5286 8454 5960 -7278 -382 4171
12148 4171 13876 7696 -5167 -12992 -13231 -24599 -15582 186 -9688 -23563 -25381 -8383 1662
12135 1662 2378 9073 676 638 -6124 -13370 -29460 -45618 -44497 -38761 -12651 772 -14771 -20520
12121 -20520 -11303 -3815 -21022 -25197 -28476 -21259 -11703 -10967 -8634 -10534 -7340 -13231 -19308 -7116
12107 -7116 7093 4304 5043 2344 -17436 -6498 -16508 -16426 -8057 -13285 -15207 -5139 -5130 -13496 -17685
12092 -17685 -8773 -18061 -30668 -20742 -12153 -7687 433 1570 5386 70 -5084 -11883 -19352 -29406
$$ packed form
12190a1808K138k0636J1694R343J817q297n380o674Q82L904R435j4r137j506N079
12175a9160k35M428m009o591j2350P090R716J0643k35O227m185k509P096j3184
12161a7258J560l305P363J0154K714k152j2204P842J3740k494j3238O896M553
12148D171R705o180j2863p825k39j1368R017J5768r874j3875j818J6998J0045
12135A662P16O695q397l8o762p246j6090j6158J121N736K6110J3423j5543n749
12121b0520R217P488j7207m175l279P217R556P36K333j900L194n891o077J2192
12107g116J4209k789P39k699j9780J0938j0010Q2Q369n228j922J0068Rq366m189
12092a7685Q912r288j2607R926Q589M466Q120J137L816n316n154o799p469j0054
$$ plain form
12078 -29406 -29107 -25240 -21062 -22389 -27120 -15799 -9357 -19708 -16641 -10190 -13786 -20846 -20971 -29951
12064 -29951 -32460 -29637 -23317 -14740 -5410 -1996 -15640 -10927 -4577 -7367 -21254 -33331 -24235 -18890
12050 -18890 -32611 -30756 -31501 -29597 -17651 -14024 -18546 -21770 -17666 -18980 -38112 -37046 -34892 -32941
12036 -32941 -37112 -27764 -40554 -49905 -46704 -35658 -13331 -9504 -22179 -27199 -31456 -35013 -29908
12023 -29908 -30482 -33488 -21472 -8034 -7380 -14331 -16684 -17235 -21926 -36870 -44085 -25477 -10009 -6309
12009 -6309 -14555 -23099 -24484 -28650 -36229 -27574 -22551 -16220 -15361 -7544 -13295 -21272 -28204 -27310 -20143
11994 -20143 -23152 -18641 -7844 -5991 -13757 -8132 -13265 -17339 -20137 -18354 -25874 -26691 -20990 -19031
11980 -19031 -17370 -23688 -29567 -30712 -15415 -6504 -7385 -17940 -15575 -27781 -35494 -40148 -26416 -5375
$$ packed form
12078b9406K99L867M178j327m731J1321O442j0351L067O451l596p060j25q980
12064b9951k509K823O320Q577R330L414j3644M713O350k790j3887j2077R096N345
12050a8890j3721J855p45J904J1946L627m522l224M104j314j9132J066K154J951
12036c2941m171R348j2790r351L201J1046K2327L827j2675n020m257l557N105
12023b9908n74l006J2016J3438O54o951k353n51m691j4944p215J8608J5468L700
12009f309q246q544j385m166p579Q655N023O331Q59P817n751p977o932Q94P167
11994b0143l009M511J0797J853p766N625n133m074k798J783p520q17N701J959
11980a9031J661o318n879j145J5297Q911q81j0555K365j2206p713m654J3732K1041
$$ plain form
11966 -5375 -3228 -1122 -9278 -16874 -21356 -24287 -29371 -31898 -29335 -13425 -531 -4541 -12849 -19980
11952 -19980 -34991 -42677 -46956 -45668 -53006 -49163 -35269 -23890 -28931 -29390 -25868 -11892 -14087 -9623
11938 -9623 -10830 -26647 -22856 -28015 -30268 -37810 -33148 -26692 -32043 -21624 -27178 -34008 -44724 -34410
11924 -34410 -30498 -32525 -33913 -40211 -40794 -24666 -10762 -18335 -21960 -20096 -16460 -11932 -10407 -22643
11910 -22643 -13769 -12381 -8704 -14754 -20592 -22532 -20726 -30123 -34433 -22828 -21372 -22923 -22926 -21635 -23219
11895 -23219 -30476 -37348 -31239 -13301 -9371 12708 16615 12962 -1867 -31915 -39701 -45770 -34738
11882 -34738 -23012 -4467 -1305 821 -17750 -20297 -24570 -27325 -32721 -35707 -33064 -41405 -41785 -28842
11868 -28842 -15521 -16389 -5855 -2095 -6325 -22598 -36610 -34417 -37224 -26458 300 674 -13579
$$ packed form
11966e375K147K106q156p596m482k931n084k527K563J5910J2894m010q308p131
11952a9980j5011p686m279J288p338L843J3894J1379n041m59L522J3976k195M464
11938i623j207j5817L791n159k253p542M662O456n351J0419n554o830j0716J0314
11924c4410L912k027j388o298n83J6128J3904p573l625J864L636M528J525j2236
11910b2643Q874J388L677o050n838j940J806r397m310J1605J456j551lJ291j584
11895b3219p257o872O109J7938L930K2079L907l653j4829l0048p786o069J1032
11882c4738J1726J8545L162K126j8571k547m273k755n396k986K643q341l80J2943
11868b8842J3321q68J0534L760m230j6273j4012K193k807J0766K6758L74j4253
$$ plain form
11855 -13579 -34041 -33490 -27936 -24038 -28720 -33952 -36956 -42631 -30604 -32392 -32093 -29622 -38262 -26375
11841 -26375 -3834 -633 -685 -6842 -7795 -10545 -29436 -24591 -29089 -46916 -58884 -40468 -23570 -19482
11827 -19482 -22856 -20456 -22949 -25441 -35719 -36272 -20830 -17391 -21372 -25938 -23945 -23166 -30394 -25825
11813 -25825 -38385 -33908 -18656 -23450 -30847 -37948 -31847 -23480 -26412 -25808 -40220 -55867 -54391 -44009
11799 -44009 -32410 -24704 -32443 -40641 -30538 -26476 -30093 -34804 -34180 -33345 -34052 -25655 -21107 -30372 -30111
11784 -30111 -26327 -35203 -46599 -55439 -59460 -37062 -52421 -71443 -64442 -36866 -27091 -31826 -33822
11771 -33822 -33020 -32626 -19865 -4476 -2197 -13113 -22361 -33224 -28746 -19076 -19692 -13775 -9946 -12874
11757 -12874 -708 21888 34875 37703 41687 47283 40962 39762 39251 32317 8894 -1868 3109
$$ packed form
11855a3579k0462N51N554L898m682n232l004n675J2027j788K99K471q640J1887
11841b6375K2541L201n2o157r53k750j8891M845m498j7827j1968J8416J6898M088
11827a9482l374K400k493k492j0278n53J5442L439l981m566J993P79p228M569
11813b5825j2560M477J5252m794p397p101O101Q367k932O04j4412j5647J476J0382
11799d4009J1599P706p739q198J0103M062l617m711O24Q35p07Q397M548r265K61
11784c0111L784q876j1396q840m021K2398j5359j9022P001K7576R775m735j996
11771c3822Q02L94J2761J5389K279j0916r248j0863M478R670o16N917L829k928
11757a2874J2166K2596J2987K828L984N596o321j200n11o934k3423j0762M977
$$ plain form
11744 3109 -4299 -19231 -22410 -28079 -20456 -20966 -19874 -14021 -19667 -19866 -17804 -25007 -24526 -12529 4130
11729 4130 18020 3659 -3512 -707 1599 2897 -17619 -27546 -22764 -28071 -31838 -23601 -15267 -22854
11715 -22854 -41255 -51201 -50238 -63097 -67897 -56883 -38515 -30279 -44639 -51908 -39949 -39826 -43725
11702 -43725 -43363 -39779 -43510 -39172 -40688 -39217 -37532 -35296 -36418 -22210 -10974 -23922 -37339 -33705
11688 -33705 -30135 -27371 -33576 -37021 -39634 -28914 -27247 -34253 -28808 -21716 -36049 -44377 -45338 -47896
11674 -47896 -48928 -39053 -34410 -33314 -36328 -45413 -39720 -21049 -22621 -26381 -35202 -36398 -24258 -30762
11660 -30762 -30165 -24249 -37231 -39315 -26775 -29846 -31019 -17926 -30857 -45294 -45034 -28657 -23985
11647 -23985 -34021 -30671 -33254 -36533 -19011 -10858 -18580 -26316 -20747 -14812 -18856 -13567 -9492 -10302
$$ packed form
11744C109p408j4932l179n669P623n10J092N853n646j99K062p203M81J1997J6659
11729D130J3890j4361p171K805K306J298k0516r927M782n307l767Q237Q334p587
11715b2854j8401r946R63j2859m800J1014J8368Q236j4360p269J1959J23l899
11702d3725L62L584l731M338j516J471J685K236j122J4208J1236j2948j3417L634
11688c3705L570K764o205l445k613J0720J667p006N445P092j4333q328r61k558
11674d7896j032R875M643J096l014r085N693J8671j572l760q821j196J2140o504
11660c0762N97N916j2982k084J2540l071j173J3093j2931j4437K60J6377M672
11647b3985j0036L350k583l279J7522Q153p722p736N569N935m044N289M075q10
$$ plain form
11633 -10302 3327 22518 36740 45280 41707 29302 15381 1195 12944 12138 -5663 -29957
11621 -29957 -37503 -32454 -25437 -14675 -14309 -20418 -33869 -42136 -48982 -52366 -45814 -34468 -36549 -36727
11607 -36727 -41012 -42432 -50881 -56100 -61588 -47941 -32355 -9293 -565 -5503 -4775 -8059 -20610 -37800
11593 -37800 -43790 -33571 -16354 -18479 -30457 -28204 -30462 -38183 -40105 -34494 -21998 -28259 -35460
11580 -35460 -37639 -48572 -41712 -34675 -31782 -25538 -23509 -19355 -11364 -19690 -18438 -38960 -43560 -37821
11566 -37821 -28283 -33567 -25671 -23193 -22604 -35780 -40788 -42663 -37538 -27481 -30384 -22065 -17180 -17121 -14659
11551 -14659 -14083 -13274 -12016 -5955 890 5423 6407 12515 11726 6595 7974 5913 -12264 -24336 -34078
11536 -34078 -27981 -17341 -9321 2529 -415 -11320 -19137 -17527 -35443 -33777 -28160 -44391 -54004
$$ packed form
11633a0302J3629J9191J4222Q540l573j2405j3921j4186J1749q06j7801k4294
11621b9957p546N049P017J0762L66o109j3451q267o846l384O552J1346k081j78
11607c6727m285j420q449n219n488J3647J5586K3062Q728m938P28l284j2551j7190
11593c7800n990J0219J7217k125j1978K253k258p721j922N611J2496o261p201
11580c5460k179j0933O860P037K893O244K029M154P991q326J252k0522m600N739
11566c7821R538n284P896K478N89j3176n008j875N125J0057k903Q319M885N9K462
11551a4659N76Q09J258O061O845M533R84O108p89n131J379k061j8177j2072r742
11536c4078O097J0640Q020J1850k944j0905p817J610j7916J666N617j6231r613
$$ plain form
11523 -54004 -55836 -49454 -36977 -30470 -31873 -29278 -38146 -41237 -37161 -38608 -31164 -14730 -7531 -10887
11509 -10887 -10213 -13084 -19790 -23800 -24263 -28914 -19828 -22002 -32465 -30346 -35443 -30432 -27328 -29640 -22684
11494 -22684 -47460 -49524 -34942 -29019 -26226 -18257 -34107 -31162 -38476 -37136 -27080 -19091 -14050
11481 -14050 -13542 -21508 -34734 -34925 -38091 -52843 -47720 -26526 -28967 -24938 -14947 -27309 -33288 -33215
11467 -33215 -37107 -47609 -47621 -39750 -28865 -22052 -14069 -5350 -716 -11919 -12341 -11056 -22285 -31173
11453 -31173 -31817 -30765 -24128 -8677 -3875 -6712 3753 15818 9681 -8199 -22834 -16414 -16585 -30388
11439 -30388 -31876 -27383 -20307 -24752 -23062 -10044 -10929 -23705 -39659 -33035 -40838 -38283 -32722 -27578
11425 -27578 -18829 -14545 -16759 -20075 -16381 -20668 -26115 -16755 -31908 -42972 -43455 -32873 -25143 -21925
$$ packed form
11523e4004j832O382J2477O507j403K595q868l091M076j447P444J6434P199l356
11509a0887O74k871o706m010m63m651R086k174j0463K119n097N011L104k312O956
11494b2684k4776k064J4582N923K793P969j5850K945p314J340J0056P989N041
11481a4050N08p966j3226j91l166j4752N123K1194k441M029R991j2362n979P3
11467c3215l892j0502j2P871J0885O813P983Q719M634j1203m22J285j1229q888
11453c1173o44J052O637J5451M802k837J0465J2065o137j7880j4635O420j71j3803
11439c0388j488M493P076m445J690J3018q85j2776j5954O624p803K555N561N144
11425b7578Q749M284k214l316L694m287n447R360j5153j1064m83J0582P730L218
$$ plain form
11411 -21925 -16359 -16855 -23596 -23754 -16477 -21154 -29378 -44229 -35936 -30558 -46600 -40166 -34230 -33315 -35312
11396 -35312 -25381 -10218 9374 17235 23409 15669 8638 -2393 -25050 -16660 -9984 3144 9246
11383 9246 4971 16092 28733 21400 22455 11712 13372 12654 17466 30071 29115 24463 23253 21319
11369 21319 12990 26413 44263 53022 47018 41364 49594 61152 86708 100034 106525 102123 104748
11356 104748 97965 97583 122336 136405 150408 166341 159762 166095 191510 210498 226315 259025
11344 259025 291435 316416 345437 383873 434077 492912 556463 627648 700731 795772 917373
11333 917373 1056875 1221990 1421968 1658213 1966577 2361441 2865453 3521715 4377660 5487153
11323 5487153 6846534 8455900 10170368 11749661 12844759 13116707 12414232 10955902
$$ packed form
11411b1925N566m96o741j58P277m677q224j4851Q293N378j6042O434N936R15j997
11396c5312R931J5163J9592P861O174p740p031j1031k2657Q390O676J3128O102
11383I246m275J1121J2641p333J055j0743J660p18M812J2605r56m652j210j934
11369B1319q329J3423J7850Q759o004n654Q230J1558K5556J3326O491m402K625
11356A04748o783l82K4753J4069J4003J5933o579O333K5415J8988J5817L2710
11344B59025L2410K4981K9021L8436N0204N8835O3551P1185P3083R5041J21601
11333I17373J39502J65115J99978K36245L08364L94864N04012O56262Q55945J109493
11323E487153J359381J609366J714468J579293J095098K71948p02475j458330
$$ plain form
11315 10955902 9187701 7464766 5992871 4820720 3908889 3223188 2705380 2310076 2002715
11306 2002715 1744188 1522999 1333436 1181618 1050853 942458 844553 759197 694348 622427
11296 622427 564321 516934 483563 442970 419598 396053 371590 346900 331075 312982 291270
11285 291270 270152 254374 241113 243795 218423 195114 179511 163983 161723 156761 167138 157592
11273 157592 137302 134692 141119 144512 142791 142114 135077 132573 136381 114293 101536 107264 118082
11260 118082 130372 132637 121253 108898 95050 90691 85779 91583 84744 83330 75332 71870 67211
11247 67211 77490 86317 73555 65095 67816 72375 73325 85813 90365 81910 90193 96757 111681 116878
11233 116878 109289 102345 116555 133946 152093 157607 157314 181361 200878 205288 202633 222202 248013
$$ packed form
11315A0955902j768201j722935j471895j172151r11831o85701n17808l95304l07361
11306B002715k58527k21189j89563j51818j30765j08395r7905q5356o4849p1921
11296F22427n8106m7387l3371m0593k3372k3545k4463k4690j5825j8093k1712
11285B91270k1118j5778j3261K682k5372k3309j5603j5528k260m962J0377r546
11273A57592k0290k610O427L393j721o77p037k504L808k2088j2757N728J0818
11260A18082J2290K265j1384j2355j3848m359m912N804o839j414p998l462m659
11247F7211J0279Q827j2762q460K721M559R50J2488M552q455Q283O564J4924N197
11233A16878p589o944J4210J7391J8147N514k93K4047J9517M410k655J9569K5811
$$ plain form
11220 248013 263155 279998 292577 329667 367552 404488 444699 486983 541206 611245 673552
11209 673552 766666 905467 1065478 1245534 1478723 1770440 2143087 2633822 3296771 4157548
11199 4157548 5299745 6809482 8675735 10766590 12825657 14403795 14993697 14350304
11191 14350304 12630934 10365116 8136145 6277580 4852043 3816094 3062095 2502785
11183 2502785 2072937 1746660 1490523 1254844 1049867 889512 767178 678469 575521 499154
11173 499154 443744 403056 376532 349778 319410 288568 278000 268240 244749 215037 204404 206203
11161 206203 198103 184225 158685 133930 123294 110521 104868 103329 100658 99507 101764 101673 91530
11148 91530 89113 84585 83230 79122 85585 84864 74498 72172 75702 80490 87115 86115 84131 65524
$$ packed form
11220B48013J5142J6843J2579L7090L7885L6936M0211M2284N4223P0039O2307
11209F73552R3114J38801J60011J80056K33189K91717L72647M90735O62949Q60777
11199D157548J142197J509737J866253K090855K059067J578138N89902o43393
11191A4350304j719370k265818k228971j858565j425537j035949p53999n59310
11183B502785m29848l26277k56137k35679k04977j60355j22334q8709j02948p6367
11173D99154n5410m0688k6524k6754l0368l0842j0568r760k3491k9712j0633J799
11161B06203q100j3878k5540k4755j0636j2773n653j539k671j151K257r1j0143
11148I1530k417m528j355m108O463p21j0366k326L530M788O625j000j984j8607
$$ plain form
11134 65524 54497 46820 37735 32746 31994 21435 12567 1643 8024 23732 17161 14478 18117 14653
11120 14653 9562 -10040 -11626 -7977 -8041 -16191 -14641 -3530 -967 -3000 -5450 -7457 -18900 -34683
11106 -34683 -27420 -25771 -40365 -40345 -34051 -20276 -22686 -15372 13 -3757 -12713 -9621 -401 -5247
11092 -5247 -9861 -3595 -9818 -5409 163 -1266 -12481 -12230 -459 13641 19302 21298 7359 1122
11078 1122 7690 10975 13200 15841 28484 28829 25630 25336 14768 12889 21390 20813 18093 26917 31063
11063 31063 32083 35534 26945 24299 28299 26907 39236 35552 26649 34339 44084 58629 83570 115426
11049 115426 156356 189773 232823 254691 276165 310856 377428 493144 698568 1007910 1409242
11038 1409242 1899866 2468671 2807886 2798066 2856342 2768489 2568217 2640072 2872785 2806514
$$ packed form
11134F5524j1027p677r085m989p52j0559q868j0924O381J5708o571k683L639l464
11120A4653n091j9602j586L649o4q150J550J1111K563k033k450k007j1443j5783
11106c4683P263J649j4594K0O294J3775k410P314J5385l770q956L092R220m846
11092e247m614O266o223M409N572j429j1215K51J1771J4100N661J996j3939o237
11078A122O568L285K225K641J2643L45l199k94j0568j879Q501n77k720Q824M146
11063C1063J020L451q589k646M000j392J2329l684q903P690R745J4545K4941L1856
11049A15426M0930L3417M3050K1868K1474L4691O6572J15716K05424L09342M01332
11038A409242M90624N68805L39215r820N8276q7853k00272P1855K32713o6271
$$ plain form
11028 2806514 2522977 2269391 1717060 1121274 756118 551136 441346 374026 319709 282973
11018 282973 232078 212211 196247 184480 173878 151668 135023 126889 99525 62256 38327 44560
11006 44560 48729 30333 26147 -1879 -469 13533 12623 5331 -8801 -9492 -12837 -10924 -21406 -22691
10992 -22691 -26582 -28375 -24197 -16578 -27131 -34407 -41087 -41298 -30866 -6303 -8587 -11653 -14193 -28186
10978 -28186 -32288 -28191 -11069 1719 -16012 -25080 -22758 -27879 -20276 -22363 -37072 -30114 -18541
10965 -18541 -22455 -29824 -38861 -36097 -33914 -43262 -37687 -47994 -53090 -44066 -36613 -25781 -14417 -22238
10951 -22238 -41165 -55793 -50799 -51942 -45055 -40716 -35601 -33914 -42007 -55128 -62961 -49823 -53429
10938 -53429 -64966 -75798 -77441 -71154 -54220 -51530 -62157 -62399 -43786 -24891 -34986 -30205 -22593
$$ packed form
11028B806514k83537k53586n52331n95786l65156k04982j09790o7320n4317l6736
11018B82973n0895j9867j5964j1767j0602k2210j6645q134k7364l7269k3929O233
11006D4560M169j8396m186k8026J410J4002r10p292j4132o91l345J913j0482j285
10992b2691l891j793M178P619j0553p276o680k11J0432K4563k284l066k540j3993
10978b8186m102M097J7122J2788j7731r068K322n121P603k087j4709O958J1573
10965a8541l914p369r037K764K183r348N575j0307n096R024P453J0832J1364p821
10951b2238j8927j4628M994j143O887M339N115J687q093j3121p833J3138l606
10938e3429j1537j0832j643O287J6934K690j0627k42J8613J8895j0095M781P612
$$ plain form
10925 -22593 -36575 -37724 -38856 -34525 -46752 -53104 -57055 -60470 -56891 -53061 -50014 -59957 -73092 -73313
10911 -73313 -72647 -70710 -51409 -47468 -49823 -46876 -44824 -53331 -43937 -32333 -37050 -40122 -34897 -26844
10897 -26844 -25168 -20975 -16080 -8431 -3501 -165 -14259 -12716 7689 20984 43233 82769 114026
10884 114026 153413 216068 307338 359676 381335 415339 394378 348440 353826 376595 338033 312795
10872 312795 305193 235556 143285 69724 24741 1424 -5483 -11258 -32503 -38903 -31639 -35979 -26916
10859 -26916 -23427 -39592 -40496 -46180 -48933 -40589 -52805 -71835 -55832 -46661 -51661 -60512 -59491 -60460
10845 -60460 -68654 -73500 -65828 -67621 -84521 -91545 -86927 -74334 -57599 -52553 -62954 -69422 -72982
10832 -72982 -98854 -117500 -118932 -105417 -87523 -82312 -77432 -85719 -88952 -98736 -88134 -60690 -50169
$$ packed form
10925b2593j3982j149j132M331j2227o352l951l415L579L830L047r943j3135k21
10911g3313O66J937J9301L941k355K947K052q507R394J1604m717l072N225Q053
10897b6844J676M193M895P649M930L336j4094J543K0405J3295K2249L9536L1257
10884A14026L9387O2655R1270N2338K1659L4004k0961m5938N386K2769l8562k5238
10872C12795p602o9637r2271p3561m4983k3317o907n775k1245o400P264m340R063
10859b6916L489j6165r04n684k753Q344j2216j9030J6003R171n000q851J021r69
10845f0460q194m846P672j793j6900p024M618J2593J6735N046j0401o468l560
10832g2982k5872j8646j432J3515J7894N211M880q287l233r784J0602K7444J0521
$$ plain form
10819 -50169 -27053 -3060 1677 -12686 -9248 2009 14808 18561 27790 30080 34340 56977 83862
10806 83862 92249 116579 124574 102562 73059 40552 26033 22431 37599 53351 56693 50025 42573
10793 42573 27563 36985 40392 49866 59252 66137 54661 49034 52354 45503 39366 60143 74075
10780 74075 77515 82913 88846 84850 82446 102889 104173 101920 102403 114208 112018 104052 108471 111448
10766 111448 126743 139155 150914 165315 187874 207063 247226 293787 358572 430575 484373
10755 484373 516085 566645 641686 688498 746964 793227 808184 809363 756667 687174 638005 618570
10743 618570 613425 656927 738752 877001 1099142 1427189 1940030 2694122 3707064 4943260
10733 4943260 6160306 6504255 6498642 6481113 5970218 5867032 6323456 6551833 5971668 5365105
$$ packed form
10819e0169K3116K3993M737j4363L438J1257J2799L753R229K290M260K2637K6885
10806H3862Q387K4330P995k2012k9503l2507j4519l602J5168J5752L342o668p452
10793D2573j5010R422L407R474R386O885j1476n627L320o851o137K0777J3932
10780G4075L440N398N933l996k404K0443J284k253M83J1805k190p966M419K977
10766A11448J5295J2412J1759J4401K2559J9189M0163M6561O4785P2003N3798
10755D84373L1712N0560P5041M6812N8466M6263J4957J179n2696o9493m9169j9435
10743F18570n145M3502Q1825J38249K22141L28047N12841P54092J012942J236196
10733D943260J217046L43949n613j7529n10895j03186M56424K28377n80165o06563
$$ plain form
10723 5365105 4212333 2776923 1861363 1357139 1067935 902478 804770 732707 679105 650456
10713 650456 627943 604808 595808 597407 588722 567319 538693 536719 548713 534290 541890 553883
10701 553883 546116 552225 572983 584814 594664 614779 631511 651297 674524 719391 743505 762264
10689 762264 797901 842080 874162 911940 953707 995644 1049431 1105154 1171960 1257917 1383480
10678 1383480 1542132 1771095 2121994 2588804 3150763 3818603 4289889 4387304 4599676 4733908
10668 4733908 4662627 4850280 5104125 4951548 4792989 4622290 4122811 3750153 3635687 3691383
10658 3691383 3826459 4008458 4319942 4709120 5151775 5774400 6567680 7514270 8638527
10649 8638527 9966157 11171461 12233576 13624995 15071726 16731994 18941122 21287367
$$ packed form
10723E365105j152772j435410r15560n04224k89204j65457r7708p2063n3602k8649
10713F50456k2513k3135r000J599q685k1403k8626j974J1994j4423P600J1993
10701E53883p767O109K0758J1831R850K0115J6732J9786K3227M4867K4114J8759
10689G62264L5637M4179L2082L7778M1767M1937N3787N5723O6806Q5957J25563
10678A383480J58652K28963L50899M66810N61959O67840M71286R7415K12372J34232
10668D733908p1281J87653K53845j52577j58559j70699m99479l72658j14466N5696
10658C691383J35076J81999L11484L89178M42655O22625P93280R46590J124257
10649H638527J327630J205304J062115J391419J446731J660268K209128K346245
$$ plain form
10641 21287367 23402078 25922192 29018042 32798202 38308356 46416588 57947037 75104811
10633 75104811 101748289 142740491 202498407 280819652 374606472 473970801 518239741
10626 518239741 510717549 521406278 498213091 466909697 486460399 527711046 508409182
10619 508409182 460403011 414801387 309127784 204038699 140617092 104021774 81035579
10612 81035579 65551960 54404682 46293201 40016891 34874057 31101524 28525888 26489250
10604 26489250 24164553 22048765 20127263 17947752 16267101 15212892 14370761 13297065
10596 13297065 12300242 11267637 10012430 8973675 8223570 7634378 7135048 6712117 6339824
10587 6339824 6001579 5712712 5463516 5229251 5014412 4812199 4593340 4410178 4250028
$$ packed form
10641B1287367K114711K520114L095850L780160N510154Q108232J1530449J7157774
10633G5104811K6643478M0992202N9757916P8321245R3786820R9364329M4268940
10626E18239741p522192J0688729k3193187l1303394J9550702M1250647j9301864
10619E08409182m8006171m5601624j05673603j05089085o3421607l6595318k2986195
10612H1035579j5483619j1147278q111481o276310n142834l772533k575636k036638
10604B6489250k324697k115788j921502k179511j680651j054209q42131j073696
10596A3297065r96823j032605j255207j038755p50105n89192m99330m22931l72293
10587F339824l38245k88867k49196k34265k14839k02213k18859j83162j60150
$$ plain form
10578 4250028 4114152 3975802 3843742 3727034 3550725 3393531 3269134 3147538 3025133
10569 3025133 2926438 2812939 2702976 2624112 2572391 2536122 2535920 2608622 2729503 2937529 3247205
10558 3247205 3644982 3927118 3963019 3861486 3665058 3507811 3566450 3777646 3932917 3826058
10548 3826058 3581144 3171908 2716351 2389939 2185322 2029672 1893014 1783002 1670851
10539 1670851 1581986 1530812 1479014 1416180 1367217 1329584 1293319 1264944 1246732 1247544 1253011 1245004
10527 1245004 1230981 1213587 1193244 1174456 1167606 1156080 1149445 1146681 1132374 1098430 1067784 1049963
10515 1049963 1032679 1015947 1012793 1004000 975765 963408 965964 968499 992164 1027205 1079831 1098591
10503 1098591 1120879 1120576 1098966 1096166 1123673 1126723 1130806 1155556 1158091 1134193 1146171 1185598
$$ packed form
10578D250028j35876j38350j32060j16708j76309j57194j24397j21596j22405
10569C025133r8695j13499j09963p8864n1721l6269k02P2702J20881K08026L09676
10558C247205L97777K82136L5901j01533j96428j57247N8639K11196J55271j06859
10548C826058k44914m09236m55557l26412k04617j55650j36658j10012j12151
10539A670851q8865n1174n1798o2834m8963l7633l6265k8375j8212Q12N467q007
10527A245004j4023j7394k0343j8788o850j1526o635k764j4307l3944l0646j7821
10515A049963j7284j6732l154q793k8235j2357K556K535K3665L5041N2626J8760
10503A098591K2288l03k1610k800K7507L050M083K4750K535k3898J1978L9427
$$ plain form
10491 1185598 1234190 1325723 1444693 1524518 1479974 1452631 1403313 1289974 1278666 1405688 1630452
10480 1630452 1956043 2326943 2530043 2670355 2740922 2389571 2013336 1726819 1323098 1016020
10470 1016020 858005 759318 688083 648269 634484 618303 592631 589729 593740 584691 555603 522024
10458 522024 505238 506097 505127 507653 493853 472630 468954 451745 429873 440680 457776 467061 476832
10445 476832 477602 460872 433168 430485 436793 442507 427398 412825 398107 376566 375459 385395 393862
10432 393862 371482 345930 365873 368496 385684 442932 478610 487771 494563 475153 449833 448013
10420 448013 441658 445741 463714 459716 451903 425848 401326 375644 356180 366291 369009 386193
10408 386193 425179 464871 501682 531574 543238 536630 510267 489826 477410 499183 526646 530332
$$ packed form
10491A185598M8592R1533J18970P9825m4544k7343m9318j13339j1308J27022K24764
10480A630452L25591L70900K03100J40312P0567l51351l76235k86517m03721l07078
10470A016020j58015r8687p1235l9814j3785j6181k5672k902M011r049k9088l3579
10458E22024j6786Q59r70K526j3800k1223l676j7209k1872J0807J7096R285R771
10445D76832P70j6730k7704k683O308N714j5109j4573j4718k1541j107R936Q467
10432C93862k2380k5552J9943K623J7188N7248L5678R161O792j9410k5320j820
10420D48013o355M083J7973l998p813k6055k4522k5682j9464J0111K718J7184
10408C86193L8986L9692L6811K9892J1664o608k6363k0441j2416K1773K7463L686
$$ plain form
10396 530332 511960 480101 428528 409549 404581 399912 388361 393892 396283 380261 377981 372600 372150
10383 372150 377632 395289 386918 374546 377588 368963 364941 364445 362814 359817 358719 342347 336923 325754
10369 325754 317668 320053 313190 310044 315933 307655 303654 292227 291881 270005 273537 289012 286965 286915
10355 286915 287136 276866 268335 263100 262862 266879 263368 269551 270684 271714 268179 276014 287729 286002
10341 286002 287521 293489 290819 288293 282356 273567 267225 268626 281389 292614 305258 313988 347395
10328 347395 397903 449770 519378 590860 665783 749264 805644 843972 851381 839574 810672 770576
10316 770576 712062 647718 568650 493986 429560 389055 359507 325752 297450 272009 250294
10305 250294 234572 228074 205736 194845 190081 186797 193310 201876 205650 195877 201785 202769 195739 191219
$$ packed form
10396E30332j8372l1859n1573j8979m968m669j1551N531K391j6022k280n381m50
10383C72150N482J7657q371j2372L042q625m022m96j631k997j098j6372n424j1169
10369C25754q086K385o863l146N889q278m001j1427l46k1876L532J5475k047n0
10355B86915K21j0270q531n235k38M017l511O183J133J030l535P835J1715j727
10341B86002J519N968k670k526n937q789o342J401J2763J1225J2644Q730L3407
10328C47395N0508N1867O9608P1482P4923Q3481N6380L8328P409j1807k8902m0096
10316G70576n8514o4344p9068p4664o4426m0505k9548l3755k8302k5441k1715
10305B50294j5722o498k2338j0891m764l284O513Q566L774r773N908R84p030m520
$$ plain form
10291 191219 196940 199107 200986 198368 195963 204818 217068 223548 212362 220873 222647 205371 188406
10278 188406 194441 204089 193782 181620 171332 168867 169933 165970 155908 155092 156152 163034 175126
10265 175126 167990 174710 185433 189773 197444 207744 213099 215539 209396 202771 214574 222335 234295
10252 234295 232889 221251 211113 198669 188832 180634 184831 196785 203335 205177 205587 204434 210642
10239 210642 221034 246094 249789 258746 285073 302055 274003 259557 281639 307055 313562 309632
10227 309632 304472 306220 317742 348917 364271 402027 447946 526474 626936 788183 1031881
10216 1031881 1386822 1866046 2422240 2915128 3000414 3027416 3050960 2835936 2777881 2968259
10206 2968259 3073134 2813467 2552118 2153249 1522623 1050784 774889 615921 513736
$$ packed form
10291A91219N721K167J879k618k405Q855J2250O480j1186Q511J774j7276j6965
10278A88406O035R648j0307j2162j0288k465J066l963j0062q16J060O882J2092
10265A75126p136O720J0723M340P671J0300N355K440o143o625J1803P761J1960
10252B34295j406j1638j0138j2444r837q198M197J1954O550J842M10j153O208
10239B10642J0392K5060L695Q957K6327J6982k8052j4446K2082K5416O507l930
10227C09632n160J748J1522L1175J5354L7756M5919P8528J00462J61247K43698
10216A031881L54941M79224N56194M92888Q5286K7002K3544k15024n8055J90378
10206B968259J04875k59667k61349l98869o30626m71839k75895j58968j02185
$$ plain form
10197 513736 458047 429996 402062 363319 330459 302002 280041 270633 267479 260250 247138 224724
10185 224724 205961 198613 193119 181200 169204 159230 147412 155347 155865 145361 153764 155909 158531
10172 158531 154097 146712 142868 134490 129290 137790 143229 140558 132146 131913 150629 163175 151304 149026
10158 149026 150514 144811 135678 118127 117946 122445 129524 142799 131225 117405 129734 134874 140203
10145 140203 136227 129663 121241 105846 108021 117305 137919 142030 140210 131838 116468 111181 119125
10132 119125 117102 129342 150013 155517 148511 139001 121887 112639 120358 128087 143243 137091 116355
10119 116355 105498 116665 125067 124475 119441 108507 107035 106966 102792 92976 90326 82910 82908 86069 90064
10104 90064 93246 96278 112998 114678 111749 117558 110463 98354 90315 83933 96741 114216 109679
$$ packed form
10197E13736n5689k8051k7934l8743l2860k8457k1961r408l154p229j3112k2414
10185B24724j8763p348n494j1919j1996r974j1818P935N18j0504Q403K145K622
10172A58531m434p385l844q378n200Q500N439k671q412k33J8716J2546j1871k278
10158A49026J488n703r133j7551j81M499P079J3275j1574j3820J2329N140N329
10145A40203l976o564q422j5395K175R284K0614M111j820q372j5370n287P944
10132A19125k023J2240K0671N504p006r510j7114r248P719P729J5156o152k0736
10119A16355j0857J1167Q402n92n034j0934j472o9m174r816k650p416kL161L995
10104I0064L182L032J6720J680k929N809p095j2109q039o382J2808J7475m537
$$ plain form
10091 109679 92803 85499 89916 105015 101080 98951 104642 101033 89198 77262 56391 54947 69282
10078 69282 82503 90629 100444 101938 102172 109316 100339 104133 123810 125778 114087 108836 96102 99595
10064 99595 110831 115509 109789 116257 120360 107526 98495 111968 121442 115000 111897 117727 115882 122082
10050 122082 130965 123954 124551 135438 157506 185327 217430 261321 303993 394131 566339 841826
10038 841826 1207131 1609092 2026298 2053579 1310292 769786 510835 385224 296710 248612
10028 248612 222147 205268 188717 170747 148706 147895 152716 148187 142430 140260 134683 133434 135904
10015 135904 139412 132276 125811 128208 136472 130623 103938 94244 90612 78101 86675 94104 87600 86535
10001 86535 79628 69133 77376 94365 95293 90654 86321 89919 89428 76682 65162 59788 67755 65578
$$ packed form
10091A09679j6876p304M417J5099l935k129N691l609j1835j1936k0871j444J4335
10078F9282J3221Q126R815J494K34P144q977L794J9677J968j1691n251j2734L493
10064I9595J1236M678n720O468M103j2834r031J3473R474o442l103N830j845O200
10050A22082Q883p011N97J0887K2068K7821L2103M3891M2672R0138J72208K75487
10038H41826L65305M01961M17206K7281p43287n40506k58951j25611q8514m8098
10028B48612k6465j6879j6551j7970k2041q11M821m529n757k170n577j249K470
10015A35904L508p136o465K397Q264n849k6685r694l632j2511Q574P429o504j065
10001H6535o907j0495Q243J6989R28m639m333L598m91j2746j1520n374P967k177
$$ plain form
9987 65578 63032 77452 77265 67055 69167 74746 63987 56507 68643 74345 79320 85944 96050 101781
9973 101781 93212 75962 62933 60298 74921 83834 86282 73964 68755 75119 60392 72400 88720
9960 88720 90145 93297 95489 78057 75373 82888 85179 81561 71181 69521 66779 74973 66875 56237
9946 56237 54118 52059 55788 63927 80019 91496 101903 92399 79548 74032 66604 71182 63908 65060
9932 65060 79882 89672 98155 106667 111965 103271 116205 143948 169734 213385 294674 411687 598683
9919 598683 823429 1044097 1175924 948946 586596 373191 262087 226487 204787 173212
9909 173212 145476 114864 91288 75809 72468 63916 57171 56701 71130 77022 72442 60364 58665
9896 58665 60179 56833 76631 84236 77211 71843 76488 70032 59980 55007 55275 64297 69162 65035
$$ packed form
9987F5578k546J4420j87j0210K112N579j0759p480J2136N702M975O624J0106N731
9973A01781q569j7250j3029k635J4623Q913K448j2318n209O364j4727J2008J6320
9960H8720J425L152K192j7432k684P515K291l618j0380j660k742Q194q098j0638
9946E6237k119k059L729Q139J6092J1477J0407r504j2851n516p428M578p274J152
9932F5060J4822R790Q483Q512N298q694J2934K7743K5786M3651Q1289J17013J86996
9919E98683K24746K20668J31827k26978l62350k13405j11104l5600k1700l1575
9909A73212k7736l0612k3576j5479l341q552o745m70J4429N892m580j2078j699
9896E8665J514l346J9798P605p025n368M645o456j0052m973K68R022M865m127
$$ plain form
9882 65035 64692 75374 66334 75184 87198 86872 70415 56679 54417 61995 54384 51352 37005 37702
9868 37702 39995 53893 67893 57121 48591 50556 57983 61995 49469 47089 53807 60611 62197 61921
9854 61921 63874 81995 84271 73981 58367 52082 51216 57427 58855 59625 68042 76424 80038 83798
9840 83798 69257 77637 85073 77046 56447 52537 48633 50500 62176 69111 75168 65390 51897 41783
9826 41783 42642 40736 43750 54759 46652 33744 21248 20224 34410 47148 52375 56008 54499 47528
9812 47528 48232 51592 49528 64865 66944 63681 62311 70663 69175 61624 54950 54288 54756 54186 53162
9797 53162 54126 48214 36794 36648 53602 63985 65248 61483 55169 52583 52677 44225 49231 64836 62296
9782 62296 53817 49983 60541 58245 52235 45265 36636 36095 49963 56415 54621 63992 64139 51650
$$ packed form
9882F5035l43J0682r040Q850J2014l26j6457j3736k262P578p611l032j4347O97
9868C7702K293J3898J4000j0772q530J965P427M012j2526k380O718O804J586k76
9854F1921J953J8121K276j0290j5614o285q66O211J428P70Q417Q382L614L760
9840H3798j4541Q380P436q027k0599l910l904J867J1676O935O057r778j3493j0114
9826D1783Q59j906L014J1009q107j2908j2496j024J4186J2738N227L633j509o971
9812D7528P04L360k064J5337K079l263j370Q352j488p551o674o62M68n70j024
9797E3162R64n912j1420j46J6954J0383J263l765o314k586R4q452N006J5605k540
9782F2296q479l834J0558k296o010o970q629n41J3868O452j794R371J47j2489
$$ plain form
9768 51650 26601 30011 37173 40019 50752 56559 54443 51113 44265 32200 33176 39007 51909 80448
9754 80448 74272 49878 32200 31932 28259 43794 52439 44995 42615 44661 43575 57604 69102 70826
9740 70826 59710 66060 55120 36706 28298 30518 32212 44571 53901 51823 53895 55004 62610 63630
9726 63630 56662 38000 37868 47400 48720 40855 41624 49110 50917 42858 39326 37073 36227 37024 34914
9711 34914 30832 41876 45013 38994 42412 46944 49669 52621 58612 65826 65405 63673 51022 43004
9697 43004 45273 56287 54090 42356 44472 46838 40130 40015 39581 43785 39597 31264 31972 31762 46497
9682 46497 54941 61892 54531 44557 33186 29308 44776 49787 53331 53854 42107 51659 65788 68782
9668 68782 51838 22789 13588 17041 21404 38680 48218 52185 53095 49488 47160 50635 57005 54079
$$ packed form
9768E1650k5049L410P162K846J0733N807k116l330o848j2065R76N831J2902K8539
9754H0448o176k4394j7678k68l673J5535Q645p444k380K046j086J4029J1498J724
9740G0826j1116O350j0940j8414q408K220J694J2359R330k078K072J109P606J020
9726F3630o968j8662j32R532J320p865P69P486J807q059l532k253q46P97k110
9711C4914m082J1044L137o019L418M532K725K952N991P214m21j732j2651q018
9697D3004K269J1014k197j1734K116K366o708j15m34M204m188q333P08k10J4735
9682D6497Q444O951p361r974j1371l878J5468N011L544N23j1747R552J4129K994
9668F8782j6944k9049r201L453M363J7276R538L967R10l607k328L475O370k926
$$ plain form
9654 54079 42058 52740 55211 49104 50733 50643 52734 59593 52793 46047 48067 56572 60828 72155
9640 72155 72634 57550 49000 45029 43626 49367 50929 64509 55217 50368 55852 46111 43641 41444
9626 41444 34320 24806 41681 48683 45400 42035 22197 32166 46560 36968 29965 36706 36232 38763
9612 38763 43471 32900 22715 15467 17603 15366 20489 21427 28105 31010 29514 24652 26342 28357
9598 28357 26954 29602 30684 24182 30278 38089 32297 22129 7575 5216 21943 27559 37006 38930
9584 38930 33481 26503 16492 17620 25326 27800 29214 20573 20155 34797 31768 24090 31457 32192 21535
9569 21535 23783 28113 23194 27605 30391 21752 10015 6226 19784 27929 37726 39568 29787 27742
9555 27742 21205 26938 31659 28872 29559 24754 14039 8838 -1774 12177 27065 32423 30288 20518
$$ packed form
9654E4079j2021J0682K471o107J629r0K091O859o800o746K020Q505M256J1327
9640G2155M79j5084q550l971j403N741J562J3580r292m849N484r741k470k197
9626D1444p124r514J6875P002l283l365j9838R969J4394r592p003O741m74K531
9612C8763M708j0571j0185p248K136k237N123R38O678K905j496m862J690K015
9598B8357j403K648J082o502O096P811n792j0168j4554k359J6727N616R447J924
9584C8930n449o978j0011J128P706K474J414q641m18J4642l029p678P367P35j0657
9569B1535K248M330m919M411K786q639j1737l789J3558Q145R797J842r781k045
9555B7742o537N733M721k787O87m805j0715n201j0612J3951J4888N358k135r770
$$ plain form
9541 20518 31731 29990 29390 29710 49044 59700 51524 34471 19186 17697 38007 34383 33245 32948
9527 32948 44462 48885 36964 26990 18961 31841 26633 11885 17216 31087 42152 47282 40081
9514 40081 27663 32695 48628 50290 43150 35266 25982 19654 34927 40992 39349 30036 16544 16138
9500 16138 19926 24554 23677 49118 59676 52383 37536 36475 31750 37186 40388 46001 47746 26761
9486 26761 11789 22534 35293 45379 44153 31572 21070 21549 27630 28895 26848 26141 21785 37514
9472 37514 20394 7937 5866 6517 13580 30628 31615 29851 36474 32288 28799 25651 36801 30711
9458 30711 34716 34450 28764 10190 5153 7508 19967 14669 1283 1428 14824 30907 35814 30992
9444 30992 35380 46038 52329 54306 43735 44402 12874 2542 27387 36841 54389 54574 40725
$$ packed form
9541B0518J1213j741o00L20J9334J0656q176j7053j5285j489K0310l624j138k97
9527C2948J1514M423j1921r974q029J2880n208j4748N331J3871J1065N130p201
9514D0081j2418N032J5933J662p140p884r284o328J5273O065j643r313j3492m06
9500A6138L788M628q77K5441J0558p293j4847j061m725N436L202N613J745k0985
9486B6761j4972J0745J2759J0086j226j2581j0502M79O081J265k047p07m356J5729
9472C7514j7120j2457k071O51P063J7048R87j764O623m186l489l148J1150o090
9458C0711M005k66n686j8574n037K355J2459n298j3386J45J3396J6083M907m822
9444C0992M388J0658O291J977j0571O67l1528j0332K4845R454J7548J85j3849
$$ plain form
9431 40725 21829 27657 25378 21313 25453 31365 22622 5530 9326 24448 42906 51094 53811 47986
9417 47986 33621 26254 37879 33067 44530 34384 28890 35660 37455 30819 9392 9836 20213
9404 20213 31917 22648 14832 19420 32244 24222 18494 17393 17000 24548 34454 40932 36529 45992
9390 45992 45093 35300 27412 18844 17028 9429 16088 4006 14521 24191 19368 11383 19061 30573
9376 30573 42854 48819 46347 37159 37060 28031 11615 2811 12930 14540 17176 32161 56439 56746
9362 56746 54581 55575 42458 34811 42662 50350 39938 27816 23380 19524 25150 28838 34031 42255
9348 42255 41760 30015 25619 34467 36314 34147 20125 28064 36606 31955 36769 44563 37146 27840
9334 27840 20151 13857 12203 6416 17883 24649 18630 1697 2218 17148 33570 30561 36333 28093
$$ packed form
9431D0725j8896N828k279m065M140N912q743j7092L796J5122J8458Q188K717n825
9417D7986j4365p367J1625m812J1463j0146n494O770J795o636k1427M44J0377
9404B0213J1704r269p816M588J2824q022n728j101l93P548R906O478m403R463
9390D5992q99r793p888q568j816p599O659j2082J0515R670m823p985P678J1512
9376C0573J2281N965k472r188r9r029j6416q804J0119J610K636J4985K4278L07
9362E6746k165R94j3117p647P851P688j0412j2122m436l856N626L688N193Q224
9348D2255m95j1745m396Q848J847k167j4022P939Q542m651M814P794p417r306
9334B7840p689o294j654n787J1467O766o019j6933N21J4930J6422l009N772q240
$$ plain form
9320 28093 14561 25193 22267 20458 30182 32055 27671 28989 26456 25031 27146 37015 39209 43388
9306 43388 41180 43278 35109 35243 46942 53620 55176 45116 36745 27424 20311 21826 20081 29284
9292 29284 42656 37492 32036 24407 32521 28468 33525 42288 30113 23279 33232 46403 42594 25743
9278 25743 31868 37444 30119 20266 12937 18948 30186 44756 32963 13919 24801 28189 25012
9265 25012 17150 27868 31101 39513 45886 47349 40333 35994 29124 27156 26166 28114 28884 29444 28501
9250 28501 34596 31995 37010 41046 47494 54564 42815 39441 24033 11472 11378 28209 41935 46765
9236 46765 36171 38981 39757 40878 28830 17804 15072 25464 26508 15507 22708 24080 18425 20045
9222 20045 23600 9534 5441 7801 -5021 2788 16228 22777 33800 41276 23333 9486 12276
$$ packed form
9320B8093j3532J0632k926j809R724J873m384J318k533j425K115R869K194M179
9306D3388k208K098q169J34J1699O678J556j0060q371r321p113J515j745R203
9292B9284J3372n164n456p629Q114m053N057Q763j2175o834R953J3171l809j6851
9278B5743O125N576p325r853p329O011J1238J4570j1793j9044J0882L388l177
9265B5012p862J0718L233Q412O373J463p016m339o870j968r90J948P70N60r43
9250B8501O095k601N015M036O448P070j1749l374j5408j2561r4J6831J3726M830
9236D6765j0594K810P76J121j2048j1026k732J0392J044j1001P201J372n655J620
9222B0045L555j4066m093K360j2822P809J3440O549J1023P476j7943j3847K790
$$ plain form
9209 12276 22292 21519 7510 7788 8905 21495 16293 14569 22842 33008 46121 45922 43899 37456
9195 37456 37761 21893 11958 4299 7938 17036 19431 21623 26141 18518 21108 25839 17288 8795 6957
9180 6957 7966 15593 31988 27356 22808 21485 15615 18159 15042 12336 20517 30788 31739 36599 37193
9165 37193 21623 21535 21237 28562 46955 44783 38197 38007 40199 31945 19374 29676 24618 12260
9151 12260 16780 21004 17367 27806 24299 33206 35411 23612 27908 16651 9334 9080 7086 18291
9137 18291 18103 38832 55799 46508 30075 34983 34547 33475 38124 37260 30496 21238 31305 27992
9123 27992 34038 32837 19937 17559 28470 32055 32366 38622 35820 36464 29586 10053 12848 22394
9109 22394 29047 28052 12656 14541 15505 10845 19572 33442 37717 31912 21255 16089 18615 14359
$$ packed form
9209A2276J0016p73j4009K78J117J2590n202j724Q273J0166J3113j99k023o443
9195C7456L05j5868r935p659L639R098K395K192M518p623K590M731q551q493j838
9180F957J009P627J6395m632m548j323n870K544l117k706Q181J0271R51M860N94
9165C7193j5570q8k98P325J8393k172o586j90K192q254j2571J0302n058j2358
9151A2260M520M224l637J0439l507Q907K205j1799M296j1257p317k54j994J1205
9137A8291j88K0729J6967r291j6433M908m36j072M649q64o764r258J0067l313
9123B7992O046j201j2900k378J0911L585L11O256k802O44o878j9533K795R546
9109B2394O653r95j5396J885R64m660Q727J3870M275n805j0657n166K526m256
$$ plain form
9095 14359 22532 13753 -491 -15586 -9495 595 9528 21136 24746 26525 23672 19043 27946 26279
9081 26279 23820 30147 27183 18125 19563 18094 21436 31516 35959 31818 32559 43059 37372 28497
9067 28497 24085 18031 29110 34379 48383 49882 43664 46933 34998 21182 17748 15768 14502 29192
9053 29192 44082 54347 44103 18920 7061 8223 6024 14897 23449 25506 27360 24608 17482
9040 17482 31635 38939 31075 29001 27319 40456 36979 43950 52893 66284 70360 53514 37947
9027 37947 43434 41233 36306 26571 25924 24033 15659 20734 26699 41513 40516 33999 17510 14089 4834
9012 4834 4426 8990 7277 10128 22333 33626 42782 53483 50364 33447 19374 5583 3549 18697
8998 18697 32452 32897 16396 15232 12190 7505 12891 31873 37377 37469 32124 9074 4776 9029
$$ packed form
9095A4359Q173q779j4244j5095O091J0090Q933J1608L610J779k853m629Q903j667
9081B6279k459O327k964r058J438j469L342J0080M443m141P41J0500n687q875
9067B8497m412o054J1079N269J4004J499o218L269j1935j3816l434j980j266J4690
9053B9192J4890J0265j0244k5183j1859J162k199Q873Q552K057J854k752p126
9040A7482J4153P304p864k074j682J3137l477O971Q943J3391M076j6846j5567
9027C7947N487k201m927r735o47j891q374N075N965J4814r97o517j6489l421r255
9012D834m08M564j713K851J2205J1293R156J0701l119j6917j4073j3791k034J5148
8998A8697J3755M45j6501j164l042m685N386J8982N504R2n345k3050m298M253
$$ plain form
8984 9029 18147 19661 9396 11790 4320 408 386 14359 19617 12515 23604 33800 34734 34447 26783
8969 26783 23318 16428 18592 33357 29383 24115 23568 24587 25124 27145 23471 22420 24138 23928 15473
8954 15473 21376 32957 42612 43594 34502 25954 20273 14538 12146 16511 8528 8543 19545 19353 16017
8939 16017 5341 5388 346 2971 20962 30217 32798 21297 33731 43306 39121 22767 12462 11957
8925 11957 11682 621 -8241 -900 5405 2956 -3568 6895 15636 8017 11676 19768 17270 15077
8911 15077 10911 16888 25394 32554 37018 25363 22390 28414 25140 17889 15885 24424 28089 17832
8897 17832 13619 6930 18173 26274 25198 37252 49882 42758 22210 9739 18462 35193 38568
8884 38568 39380 40183 28382 26116 37623 40360 39898 33512 33847 36269 36656 19712 8063 6773 16025
$$ packed form
8984I029R118J514j0265K394p470l912k2J3973N258p102J1089J0196R34k87p664
8969B6783l465o890K164J4765l974n268n47J019N37K021l674j051J718k10q455
8954A5473N903J1581R655R82r092q548n681n735k392M365p983J5J1002j92l336
8939A6017j0676M7n042K625J7991R255K581j1501J2434R575m185j6354j0305n05
8925A1957k75j1061q862P341O305k449o524J0463Q741p619L659Q092k498k193
8911A5077m166N977Q506P160M464j1655k973O024l274p251k004Q539L665j0257
8897A7832m213o689J1243Q101j076J2054J2630p124k0548j2471Q723J6731L375
8884C8568Q12Q03j1801k266J1507K737m62o386L35K422L87j6944j1649j290R252
$$ plain form
8869 16025 21795 19669 24625 14650 32269 41036 44707 42922 45562 40861 30824 25967 3056 -7180
8855 -7180 -11915 -22954 -7820 -4746 2899 14112 29833 36082 40770 36492 32944 37748 40580 23333
8841 23333 29265 38736 27310 16227 19360 32921 36484 30913 15094 5440 -1358 13229 30437
8828 30437 19541 15093 11666 5936 6379 15888 18603 14265 13940 18697 18262 15280 16606 20899 10343
8813 10343 4666 12415 19195 25356 23758 26249 30058 21892 14479 25742 22436 24875 19752 11502
8799 11502 13611 19991 31489 40863 35600 46401 52547 54470 63643 68536 75203 75964 62682 55207
8785 55207 49114 37979 18763 20534 26953 18013 16138 16919 19864 23511 19927 2060 4142 10360
8771 10360 19327 25124 30165 25875 14867 9923 29486 32820 24806 28962 27167 13458 7497 4494
$$ packed form
8869A6025N770k126M956r975J7619Q767L671j785K640m701j0037m857k2911j0236
8855g180m735j1039J5134L074P645J1213J5721O249M688m278l548M804K832j7247
8841B3333N932R471j1426j1083L133J3561L563n571j5819r654o798J4587J7208
8828C0437j0896m448l427n730M43R509K715m338l25M757m35k982J326M293j0556
8813A0343n677P749O780O161j598K491L809q166p413J1263l306K439n123q250
8799A1502K109O380J1498R374n263J0801O146J923R173M893O667P61j3282p475
8785E5207o093j1135j9216J771O419q940j875P81K945L647l584j7867K082O218
8771A0360Q967N797N041m290j1008m944J9563L334q014M156j795j3709n961l003
$$ plain form
8757 4494 494 1617 10969 25680 25799 23902 18112 24794 40692 42190 56167 67141 89070 117877
8743 117877 140106 151243 137370 94117 58100 37715 31237 19850 33107 22879 12165 23328
8731 23328 26890 22510 22159 21281 15456 19170 19423 26464 40752 48750 47570 40512 32377 36440 34577
8716 34577 33401 32098 37124 48065 39785 25282 30777 41036 38975 29472 36404 45230 34808 35287
8702 35287 43378 56113 71490 76413 76441 82178 77876 54578 32942 25129 17698 19416 16000 18666
8688 18666 26985 35879 37679 36344 32835 23267 28038 35911 40809 36092 20007 25517 29321 15103
8674 15103 9811 20477 26294 18693 20608 29606 25483 28634 30823 30686 20180 -6556 -20863 -16947
8660 -16947 -1943 12184 15936 16681 20831 -2969 -5835 21286 31094 23311 22312 27479 27999 44092
$$ packed form
8757D494m000J123R352J4711J19j897n790O682J5898J498J3977J0974K1929K8807
8743A17877K2229J1137j3873m3253l6017k0385o478j1387J3257j0228j0714J1163
8731B3328L562m380l51q78n825L714K53P041J4288P998j180p058q135M063j863
8716C4577j176j303N026J0941q280j4503N495J0259k061r503O932Q826j0422M79
8702C5287Q091J2735J5377M923K8N737m302k3298k1636p813p431J718l416K666
8688A8666Q319Q894J800j335l509r568M771P873M898m717j6085N510L804j4218
8674A5103n292J0666N817p601J915Q998m123L151K189j37j0506k6736j4307L916
8660a6947J5004J4127L752P45M150k3800k866K7121R808p783r99N167N20J6093
$$ plain form
8646 44092 37233 43035 45355 30028 8973 18259 10763 -1262 479 -5156 -2859 -7449 -10829 778
8632 778 2824 24340 34981 28578 20261 8561 12297 22504 30048 28667 41319 53762 35397
8619 35397 27472 26841 23525 16711 5313 6467 21914 26041 18779 21645 27373 30062 29404 32828 40145
8604 40145 50718 56440 41643 35971 34214 30447 39581 51359 57705 65080 62269 47234 53270 60731
8590 60731 67054 78653 87945 77493 61742 62489 73866 78438 93569 101691 92441 84567 84938 74973
8576 74973 60260 55365 48027 30151 29734 31612 30886 20481 27140 23235 24269 22077 13673 7085
8562 7085 11595 24879 23628 20604 21181 28944 30145 22545 21126 17313 24883 29031 23627 3547 -2091
8547 -2091 11640 27193 33024 33318 41849 37574 50144 56591 30794 13106 8585 11338 27049 27370
$$ packed form
8646D4092o859N802K320j5327k1055R286p496j2025J741n635K297m590l380J1607
8632G78K046K1516J0641o403q317j1700L736J0207P544j381J2652J2443j8365
8619C5397p925o31l316o814j1398J154J5447M127p262K866N728K689o58L424P317
8604D0145J0573N722j4797n672j757l767R134J1778O346P375k811j5035O036P461
8590F0731O323J1599R292j0452j5751P47J1377M572J5131Q122r250p874L71r965
8576G4973j4713m895p338j7876m17J878p26j0405O659l905J034k192q404o588
8562G085M510J3284j251l024N77P763J201p600j419l813P570M148n404k0080n638
8547b091J3731J5553N831K94Q531m275J2570O447k5797j7688m521K753J5711L21
$$ plain form
8533 27370 38153 42692 36391 29096 9998 11025 -523 11226 11483 11153 12796 14400 10738 23934
8519 23934 34779 29402 25776 15916 14521 18669 16817 11271 6610 10742 13598 3816 6087 4650
8505 4650 7678 9674 18844 16310 10895 19857 26102 28918 25794 17195 26996 34467 27177 23868 19159
8490 19159 15770 11018 17477 25315 16234 -524 -5289 -414 -4023 4149 15291 20195 22367 13582
8476 13582 12230 14170 21176 11498 -690 -8134 -8934 780 14136 24490 30870 31225 22124 2394
8462 2394 7323 9657 3567 1387 5520 14163 14910 7143 12422 8342 3658 3595 -1603 4789 4576 4708
8446 4708 11626 10887 8730 9185 16287 18594 20934 21767 26082 26726 25979 26481 26457 27516 14719 12800 14691
8429 14691 25633 24069 15253 11282 7695 18306 26628 24932 33562 27498 17726 16700 18988 20455
$$ packed form
8533B7370J0783M539o301p295j9098J027j1548J1749K57l30J643J604l662J3196
8519B3934J0845n377l626r860j395M148j852n546m661M132K856r782K271j437
8505D650L028J996R170k534n415Q962O245K816l124q599R801P471p290l309m709
8490A9159l389m752O459P838r081j6758m765M875l609Q172J1142M904K172q785
8476A3582j352J940P006r678j2188p444q00R714J3356J0354O380L55r101j9730
8462B394M929K334o090k180M133Q643P47p767N279m080m684o3n198O392k13J32
8446D708O918p39k157M55P102K307K340Q33M315O44p47N02k4J059j2797j919J891
8429A4691J0942j564q816l971l587J0611Q322j696Q630o064r772j026K288J467
$$ plain form
8415 20455 28441 37211 29364 34769 32387 22951 15801 6247 5162 -1052 1047 1 -7259 -1369 957
8400 957 4665 4204 7689 -6773 5524 26664 25484 17232 7606 12039 16621 18263 25566 22262 8846
8385 8846 7681 17590 27029 26123 17698 21097 33242 35401 25019 8766 8319 11299 101 -3477
8371 -3477 5548 23382 35353 38909 29737 21610 15859 27563 25653 22948 21814 13861 17124 24036
8357 24036 29555 28317 17160 10095 4353 19528 23039 18775 11254 3991 -2613 -18291 -25097 -29985
8343 -29985 -25550 -6457 2105 1241 22590 24894 30549 19514 16557 13676 14574 22860 19306 13212
8329 13212 32063 37719 39942 31852 17100 14488 14151 -793 -14157 -8922 -1392 4994 2439 6879
8315 6879 14664 -8329 -19138 -15084 -9457 -6743 526 13401 17290 27668 31874 33552 33573 32092
$$ packed form
8415B0455P986Q770p847N405k382r436p150r554j085o214K099j046p260N890K326
8400I57L708m61L485j4462J2297K1140j180q252r626M433M582J642P303l304j3416
8385H846j165R909R439r06q425L399J2145K159j0382j6253m47K980j1198l578
8371c477R025J7834J1971L556r172q127n751J1704j910k705j134p953L263O912
8357B4036N519j238j1157p065n742J5175L511m264p521p263o604j5678o806m888
8343b9985M435J9093Q562q64K1349K304N655j1035k957k881Q98Q286l554o094
8329A3212J8851N656K223q090j4752k612l37j4944j3364N235P530O386k555M440
8315F879P785k2993j0809M054N627K714P269J2875L889J0378M206J678K1j481
$$ plain form
8301 32092 41377 32791 10090 8809 13092 6235 10974 7134 -2697 -1780 7255 19784 13094 2556
8287 2556 -3015 -762 5078 9043 4061 -3680 -5642 -12520 -15360 -8240 2304 -3874 -1786 3601 7339
8272 7339 7162 13545 28672 41433 33039 18446 15998 18793 12586 16535 35675 22771 16595 20246
8258 20246 13794 11657 19879 18659 9934 12128 14572 8730 8745 16974 26640 26949 25186 18958 20028
8243 20028 21412 7746 2854 -196 2157 2841 21677 29725 20674 16702 22706 32862 25447 9573
8229 9573 15368 20103 8376 1429 -3002 -1130 14606 20212 29783 23243 15809 12436 8834 1653
8215 1653 11800 9851 11002 14420 10140 1500 9147 19052 20770 7668 6286 25517 26502 22429
8201 22429 14437 15180 391 -9592 229 6904 983 7270 12312 10739 7935 17616 21991 11763
$$ packed form
8301C2092R285q586k2701j281M283o857M739l840r831R17R035J2529o690j0538
8287B556n571K253N840L965m982p741j962o878k840P120J0544o178K088N387L738
8272G339j77O383J5127J2761q394j4593k448K795o207L949J9140j2904o176L651
8258B0246o452k137Q222j220q725K194K444n842J5Q229R666L09j763o228J070
8243B0028J384j3666m892l050K353O84J8836Q048r051l972O004J0156p415j5874
8229I573N795M735j1727o947m431J872J5736N606R571o540p434l373l602p181
8215A653J0147j949J151L418m280q640P647R905J718j3102j382J9231R85m073
8201B2429p992P43j4789r983R821O675n921O287N042j573k804R681M375j0228
$$ plain form
8187 11763 5989 13712 15773 8926 -7965 -371 24479 23798 15906 7490 12937 15797 12211 9900
8173 9900 11103 14028 13452 5560 8651 -3543 -1989 9092 11341 7349 -5338 -1703 10687 23045
8159 23045 17028 19627 18171 18711 8708 14121 19220 29823 25124 28621 27227 7455 -2263 -8520
8145 -8520 -4115 4545 -530 1422 6684 11703 13982 2528 -3851 -11281 -21884 -10265 4545 5220
8131 5220 -2290 -12551 -15012 -12624 402 11573 7615 9599 11168 14516 11662 7868 10151 18496
8117 18496 17679 14552 14068 13864 16383 18025 12416 9465 17983 24197 19412 14384 7722 9396 17586
8102 17586 19085 14589 10447 2545 15413 15680 15898 15753 11492 21374 27707 19525 6122 -5582 1698
8087 1698 7983 9085 5500 15727 11761 6027 6797 15503 8803 9350 15973 25557 19107 11752 24294
$$ packed form
8187A1763n774P723K061o847j6891P594K4850o81p892q416N447K860l586k311
8173I900J203K925n76p892L091j2194J554J1081K249l992j2687L635J2390J2358
8159B3045o017K599j456N40j0003N413N099J0603m699L497j394j9772r718o257
8145h520M405Q660n075J952N262N019K279j1454o379p430j0603J1619J4810O75
8131E220p510j0261k461K388J3026J1171l958J984J569L348k854l794K283Q345
8117A8496q17l127m84k04K519J642n609k951Q518O214m785n028o662J674Q190
8102A7586J499m496m142p902J2868K67K18j45m261R882O333q182j3403j1704P280
8087A698O285J102l585J0227l966n734P70Q706o700N47O623R584o450p355J2542
$$ plain form
8072 24294 29263 21851 1106 -12342 -7651 1535 -682 3407 8479 4879 7453 17146 28843 35339
8058 35339 28178 21277 13046 8535 4050 12091 15593 8738 -8649 -17915 -9772 7617 28415 32806
8044 32806 31096 20106 11526 9388 1695 -1103 4495 18133 30908 25839 31544 36820 33745 15278
8030 15278 17025 29773 39378 39967 30401 27159 32261 37936 36981 31478 39237 53498 48030 40016 42200
8015 42200 48911 42786 40089 39690 35927 33486 39585 25471 28846 44144 44034 24571 15980 24854
8001 24854 32566 36460 33499 23331 18375 21967 30686 37017 34370 34657 26393 32831 36297 33147 35681
7986 35681 33106 39954 32982 31756 30425 34640 40384 33571 25400 18825 25898 9425 10745 13655
7972 13655 12465 12145 7474 18538 26495 13070 2099 6465 893 18322 22597 24197 12377 4997
$$ packed form
8072B4294M969p412k0745j3448M691R186k217M089N072l600K574R693J1697O496
8058C5339p161o901q231m511m485Q041L502o855j7387r266Q143J7389K0798M391
8044C2806j710j0990q580k138p693k798N598J3638J2775n069N705N276l075j8467
8030A5278J747J2748R605N89r566l242N102N675r55n503P759J4261n468q014K184
8015D2200O711o125k697l99l763k441O099j4114L375J5298j10j9463q591Q874
8001B4854P712L894k961j0168m956L592Q719O331k647K87q264O438L466l150K534
7986C5681k575O848o972j226j331M215N744o813q171o575P073j6473J320K910
7972A3655j190l20m671J1064P957j3425j0971M366n572J7429M275J600j1820p380
$$ plain form
7958 4997 18257 20093 20337 35792 36351 30999 26011 27117 21845 14936 4135 10171 16760 23730 28311
7943 28311 34105 25110 13614 8188 17298 14683 9508 1009 11271 16421 27707 25811 18372 31114
7929 31114 43855 42557 37859 34171 26895 30888 29016 25118 19712 37747 30168 10813 1038 13606
7915 13606 31743 38850 29574 28647 34367 35873 27060 29394 18380 31195 43899 43852 43882 51184 42891
7900 42891 44927 51165 40594 34917 27417 31803 29867 22558 11528 10370 15984 31956 31877 26782
7886 26782 27331 23948 13813 2747 4479 10695 12275 9385 13427 10490 14021 13169 8403 18258 10431
7871 10431 -5118 6637 18315 18560 4685 6446 3885 -2888 7081 18131 22896 27852 43286
7858 43286 54599 41888 17173 9325 21183 20713 19817 7997 11232 10473 1204 -428 11797 1605
$$ packed form
7958D997J3260J836K44J5455N59n352m988J106n272o909j0801O036O589O970M581
7943B8311N794q995j1496n426R110k615n175q499J0262N150J1286j896p439J2742
7929C1114J2741j298m698l688p276L993j872l898n406J8035p579j9355r775J2568
7915A3606J8137P107r276r27N720J506q813K334j1014J2815J2704m7L0P302q293
7900D2891K036O238j0571n677p500M386j936p309j1030j158N614J5972p9n095
7886B6782N49l383j0135j1066J732O216J580k890M042k937L531q52m766R855p827
7871A0431j5549J1755J1678K45j3875J761k561o773R969J1050M765M956J5434
7858D3286J1313j2711k4715p848J1858m70q96j1820L235p59r269j632J2225j0192
$$ plain form
7844 1605 -12845 -15060 -2983 4299 12728 8049 1576 -410 -1623 3380 3838 3130 2497 -960 9868
7829 9868 11151 -316 -9815 -15222 -9463 1533 -10306 -2724 4635 5111 2311 -8355 -5404 12991
7815 12991 30363 42917 31349 11875 8164 21897 25254 20197 16280 8297 73 -11298 -5872
7802 -5872 -3545 -7060 -1156 5165 -7222 -22299 -26952 -19523 -14482 5060 13987 24734 26461 14275
7788 14275 10419 2994 -6722 -5948 -8417 -1096 1570 -9199 -10859 8447 8057 11040 28494 26606
7774 26606 12826 18037 13173 10325 6006 -6211 -16169 -8478 11267 15821 10415 12579 20298 22539
7760 22539 16184 18282 23173 29031 42862 41682 24794 16836 14639 28873 18874 10686 3443 -857
7746 -857 8107 -5282 -4149 5743 6227 2243 14378 11513 274 -9660 -2049 2369 -8441 -14631
$$ packed form
7844A605j4450k215J2077P282Q429m679o473j986j213N003M58p08o33l457J0828
7829I868J283j1467r499n407N759J0996j1839P582P359M76k800j0666K951J8395
7815A2991J7372J2554j1568j9474l711J3733L357n057l917p983q224j1371N426
7802e872K327l515N904O321j2387j5077m653P429N041J9542Q927J0747J727j2186
7788A4275l856p425r716P74k469P321K666j0769j660J9306l90K983J7454j888
7774B6606j3780N211m864k848m319j2217r958P691J9745M554n406K164P719K241
7760B2539o355K098M891N858J3831j180j6888p958k197J4234r999q188p243m300
7746h57Q964j3389J133R892M84l984J2135k865j1239r934P611M418j0810o190
$$ plain form
7732 -14631 460 9585 20003 23427 21843 13080 4130 8734 28119 30423 14782 -8629 -16084
7719 -16084 -5183 -19000 -11562 5447 6121 18843 19624 1575 -9345 -10813 -5700 9945 23396
7706 23396 31468 35736 24664 11668 14528 25521 33606 33315 16660 6654 16733 29693 40788
7693 40788 31689 20017 4826 712 12129 26859 21532 11654 24296 20256 18425 24026 24014 17207
7679 17207 20625 12540 134 -972 -3178 4890 6822 12857 12474 -1585 1199 -521 -12458 -17101
7665 -17101 -15279 -13206 -12710 -9175 1813 3086 134 3130 15830 9587 -706 -9541 2804 14009
7651 14009 15029 -5313 -12696 -12230 -7729 -9474 -16250 -21052 -7402 8712 5080 -10633 5 17431
7637 17431 34882 36663 26630 27256 35754 31984 24879 5813 -8070 -20444 -19872 -9596 -5848 2757
$$ packed form
7732a4631J5091R125J0418L424j584q763q950M604J9385K304j5641k3411p455
7719a6084J0901j3817P438J7009O74J2722P81j8049j0920j468N113J5645J3451
7706B3396Q072M268j1072j2996K860J0993Q085k91j6655j0006J0079J2960J1095
7693D0788r099j1672j5191m114J1417J4730n327r878J2642m040j831N601j2o807
7679A7207L418q085j2406j106k206Q068J932O035l83j4059K784j720j1937m643
7665a7101J822K073M96L535J0988J273k952K996J2700o243j0293q835J2345J1205
7651A4009J020k0342p383M66M501j745o776m802J3650J6114l632j5713J0638J7426
7637A7431J7451J781j0033O26Q498l770p105j9066j3883j2374N72J0276L748Q605
$$ plain form
7623 2757 2771 -4883 -8508 171 16291 22163 11259 8949 22960 26058 23540 17510 10023 8862 16050
7608 16050 21666 8578 -4727 5558 2943 -7898 288 -6166 -5641 2196 -8166 -11349 -6309 756
7594 756 7878 1277 1042 16633 15924 21007 8836 -943 -670 5284 5433 4344 -649 -5479 -17258
7579 -17258 -8673 -7763 -16249 -22833 -23472 -13080 -8368 -10305 -11285 -13191 -11390 -10368 -17121 -9523 -2037
7564 -2037 -16297 -30137 -34959 -36755 -32892 -18953 -6233 -12217 -7022 9653 13076 8758 -5258
7551 -5258 -17586 -6103 -2967 -3853 -10203 -9024 -16264 -24046 -16141 -8550 -1108 -4927 3340 5861 15984
7536 15984 31113 15150 -5513 -543 12083 -1474 -15450 -18607 -17901 -14388 -8013 -6137 -8778
7523 -8778 -3079 -20190 -14106 -12664 -19374 -2336 -1989 -13356 -9555 -5373 -16614 -24846 -29364 -26464
$$ packed form
7623B757J4p654l625Q679J6120N872j0904k310J4011L098k518o030p487j161P188
7608A6050N616j3088j3305J0285k615j0841Q186o454N25P837j0362l183N040P065
7594G56P122o601k35J5591p09N083j2171r779K73N954J49j089m993m830j1779
7579a7258Q585R10q486o584o39J0392M712j937r80j906J801J022o753P598P486
7564b037j4260j3840m822j796L863J3939J2720n984N195J6675L423m318j4016
7551e258j2328J1483L136q86o350J179p240p782P905P591P442l819Q267K521J0123
7536A5984J5129j5963k0663M970J2626j3557j3976l157P06L513O375J876k641
7523h778N699j7111O084J442o710J7038L47j1367L801M182j1241q232m518K900
$$ plain form
7509 -26464 -11153 -7744 -8607 -8719 -5296 7193 16001 6171 -3366 -14438 -14924 -9864 40 -2222 -13445
7494 -13445 -31495 -16505 3767 11918 10925 10457 -225 6476 13381 7099 1124 12193 14111 11670
7480 11670 15156 1689 -2322 -6030 -473 3405 42 2700 132 -6578 -5257 1187 1001 -3263 -4331
7465 -4331 -14768 -11419 -13572 -23295 -24015 -26234 -22274 -9483 -1790 -3410 -3659 -4173 -3596 -14966 -26977
7450 -26977 -28895 -11247 -4574 -9849 -7156 -4311 -2647 -8194 -1418 199 11963 9347 1658 -45
7436 -45 13816 16055 6037 1878 -10592 -4602 -16224 -13330 -6515 -3991 -8197 -7777 5061 13632
7422 13632 -2162 -5144 3890 11955 6638 634 -4039 3819 11626 4541 -2 3150 11503 -1556
7408 -1556 -20007 -24306 -17100 -6107 -3719 -7909 -11666 -17140 -23039 -11674 -2182 -13537 3369 14487
$$ packed form
7509b6464J5311L409q63j12L423J2489Q808r830r537j1072m86N060R904k262j1223
7494a3445j8050J4990K0272Q151r93m68j0682O701O905o282n975J1069J918k441
7480A1670L486j3467m011l708N557L878l363K658k568o710J321O444j86m264j068
7465d331j0437L349k153r723p20k219L960J2791P693j620k49n14N77j1370j2011
7450b6977j918J7648O673n275K693K845J664n547O776J617J1764k616p689j703
7436d5J3861K239j0018m159j2470N990j1622K894O815K524m206M20J2838Q571
7422A3632j5794k982R034Q065n317o004m673P858P807p085m543L152Q353j3059
7408a556j8451m299P206J0993K388m190l757n474n899J1365R492j1355J6906J1118
$$ plain form
7394 14487 1103 1775 11909 5388 -5807 -1958 -5908 -8271 3300 -605 -4584 -5381 -5232 7332
7380 7332 5392 -3206 -4933 -2506 -8901 3426 13024 9968 1508 2038 -94 -12771 -14008 -8638 -18700
7365 -18700 -17512 -7084 -14624 -24870 -16152 -877 -2814 -6351 -7503 -5114 5674 -4035 -18929
7352 -18929 -12116 -4953 7046 7421 -4677 -5941 -18562 -9304 -9721 -2976 -6962 -11555 -14593 -14625 -14350
7337 -14350 -14284 -6376 -586 3230 4197 17891 23973 18877 8924 5338 4559 9775 11629 3338 15866
7322 15866 26258 18236 6550 2020 -7227 -7649 -6830 -5176 -1016 7161 13821 18544 19316 16758 29903
7307 29903 41116 42724 34212 18446 7660 6923 5210 -3746 -6826 2277 5125 -5776 -15905 -20997
7293 -20997 -20575 -22299 -10724 -1402 1810 -8169 -4160 5077 -10442 -13117 -783 10929 26078 29909
$$ packed form
7394A4487j3384O72J0134o521j1195L849l950k363J1571l905l979p97J49J2564
7380G332j940q598j727K427o395J2327R598l056q460N30k132j2677j237N370j0062
7365a8700J188J0428p540j0246Q718J5275j937l537j152K389J0788r709j4894
7352a8929O813P163J1999L75j2098j264j2621R258m17O745l986m593l038l2K75
7337a4350O6P908N790L816R67J3694O082n096r953l586p79N216J854q291J2528
7322A5866J0392q022j1686m530r247m22Q19J654M160Q177O660M723P72k558J3145
7307B9903J1213J608q512j5766j0786p37j713q956l080R103K848j0901j0129n092
7293b0997M22j724J1575R322L212r979M009R237j5519k675J2334J1712J5149L831
$$ plain form
7279 29909 19512 15565 4520 -8777 -6903 1243 13842 22262 16836 10060 5499 16776 14672
7266 14672 4379 -8352 -15129 -15186 -25019 -18859 -15417 -11123 -11744 -8108 -1994 11629 21877 30035
7252 30035 17280 -3296 1717 4554 -7973 -20260 -14770 -9818 -10742 -2593 -8282 -18141 -16702 -19962
7238 -19962 -17422 -10731 -10646 -9433 -19965 -30284 -27770 -20493 -13161 -8540 -760 6924 12740 1606
7224 1606 -6690 -8994 2772 5731 14315 19075 13002 11937 18837 16485 12173 -1560 -12427 -14683
7210 -14683 -10089 -16779 -24860 -26107 -6312 -3223 -13016 -8886 -7468 -9403 -3113 8001 21373 15866
7196 15866 6710 -9960 -9019 -540 14126 20550 17229 -2487 -13782 -22284 -20545 352 4234 1364
7182 1364 322 -11285 -17887 -35192 -46274 -28790 -1592 13443 4847 -8621 -12185 -16770 -8896
$$ packed form
7279B9909j0397l947j1045j3297J874Q146J2599Q420n426o776m561J1277k104
7266A4672j0293j2731o777n7r833O160L442M294o21L636O114J3623J0248Q158
7252C0035j2755k0576N013K837j2527j2287N490M952r24Q149n689r859J439l260
7238a9962K540O691Q5J213j0532j0319K514P277P332M621P780P684N816j1134
7224A606q296k304J1766K959Q584M760o073j065O900k352m312j3733j0867k256
7210a4683M594o690q081j247J9795L089r793M130J418j935O290J1114J3372n507
7196A5866r156j6670R41Q479J4666O424l321j9716j1295q502J739K0897L882k870
7182A364j042j1607o602j7305j1082J7484K7198J5035q596j3468l564m585P874
$$ plain form
7169 -8896 1186 -2867 -17724 -34671 -24505 -14542 -15953 -4875 -4222 -3386 3633 1589 9717 13205
7155 13205 1098 6840 4843 -2250 351 -6451 -11929 -2098 -2213 -10820 -6592 -323 -4880 -846 -5605
7140 -5605 -7376 -3621 7659 6400 17589 25026 31374 21705 16600 17789 24839 19126 18655 14416 695
7125 695 2636 15342 -147 -10411 -7184 7744 3775 911 -2350 1696 6748 20391 29356 12637
7111 12637 -16631 -18965 514 6890 -4925 -17124 -16745 -19522 -11055 -18839 -10380 7055 17543
7098 17543 20528 24519 19504 12875 21343 14083 6646 11959 8373 4396 -1422 -13374 -19378 -27942
7084 -27942 -20632 -26246 -22289 -12177 796 7865 6351 4168 -1796 -6509 3972 4210 -5128 -6662
7070 -6662 920 -1299 -7932 -16985 -30331 -23267 -5026 -2597 12342 14653 18761 25889 21507 10055
$$ packed form
7169h896J0082m053j4857j6947J0166R963j411J1078O53Q36P019k044Q128L488
7155A3205j2107N742j997p093K601o802n478R831j15q607M228O269m557M034m759
7140e605j771L755J1280j259J1189P437O348r669n105J189P050n713m71m239j3721
7125F95J941J2706j5489j0264L227J4928l969k864l261M046N052J3643Q965j6719
7111A2637k9268k334J9479O376j1815j2199L79k777Q467p784Q459J7435J0488
7098A7543K985L991n015o629Q468p260p437N313l586l977n818j1952o004q564
7084b7942P310n614L957J0112J2973P069j514k183n964m713J0481K38r338j534
7070f662P582k219o633r053j3346P064J8241K429J4939K311M108P128m382j1452
$$ plain form
7056 10055 205 -3254 -5478 -6432 2399 8796 17782 13912 20920 27492 25419 20351 15206 596 -4100
7041 -4100 -2523 433 -1694 -2798 -3844 -3890 6026 -774 -19759 -18654 -10995 -9141 -13992 -14911 -13108
7026 -13108 -11480 -4972 1557 -1372 -5729 -3471 -5519 -9033 -14526 -5653 -5631 -9991 7828 13761 8154
7011 8154 4045 8663 15391 8224 -8852 -9357 -8052 -14126 -19444 -16360 -24666 -23522 -15371 -10164 -2456
6996 -2456 -1129 -24988 -27456 -22659 -22086 -12588 -9229 -30997 -31671 -24069 -15727 -7348 9065 3968 1925
6981 1925 -12804 -13071 6081 9609 4327 -2297 4181 19065 18314 -5660 -5487 1292 6104 -5812
6967 -5812 -7004 -8369 -14168 -15731 -4854 -2223 -2961 -267 -9189 -11099 -15228 832 -6193 -1757 -9578
6952 -9578 -12563 -9955 -4828 -11673 -22872 -8897 -4821 5484 18935 3905 -12788 -1372 14596
$$ packed form
7056A0055r850l459k224r54Q831O397Q986l870P008O572k073n068n145j4610m696
7041d100J577K956k127j104j046m6R916o800j8985J105P659J854m851r19J803
7026a3108J628O508O529k929m357K258k048l514n493Q873K2m360J7819N933n607
7011H154m109M618O728p167j7076n05J305o074n318L084q306J144Q151N207P708
6996b456J327k3859k468M797N73R498L359k1768o74P602Q342Q379J6413n097k043
6981A925j4729k67J9152L528n282o624O478J4884p51k3974J73O779M812j1916
6967e812j192j365n799j563J0877K631p38K694q922j910m129J6060p025M436p821
6952i578k985K608N127o845j1199J3975M076J0305J3451j5030j6693J1416J5968
$$ plain form
6939 14596 10378 -4232 1038 -150 -2411 7372 -5807 -20008 -16705 -11547 -14355 -11997 -6932 -1341
6925 -1341 15056 31527 12822 6539 11469 16761 25878 34769 24965 9403 -7437 -5189 4769 9292
6911 9292 16480 14420 -3428 -1163 10624 1649 -13439 -6375 616 7454 5049 10888 7675 8870
6897 8870 8925 -2489 -14216 -22954 -9117 212 1410 4692 -3214 3803 -493 -16051 -24966 -25223 -8818
6882 -8818 -6629 -7551 -11108 -23156 -34612 -16932 -13852 -14500 -18571 -21328 -30555 -29785 -20856 -13500 1682
6867 1682 -4860 -2478 -4144 -918 8046 10180 4821 -29 -2472 6704 6374 7759 5453 14215 15510
6852 15510 15254 15815 16224 23478 20343 11105 3917 -11553 -6172 -5162 -15588 -11187 9453 18483 19457
6837 19457 23057 19436 9060 -6527 -3760 -9362 3242 14757 -6762 -17769 -7366 -1460 -7023
$$ packed form
6939A4596m218j4610N270j188k261R783j3179j4201L303N158k808K358N065N591
6925a341J6397J6471j8705o283M930N292R117Q891r804j5562j6840K248R958M523
6911I292P188k060j7848K265J1787q975j5088P064O991O838k405N839l213J195
6897H870N5j1414j1727q738J3837R329J198L282p906P017m296j5558q915k57J6405
6882h818K189r22l557j2048j1456J7680L080o48m071k757r227P70Q929P356J5182
6867A682o542K382j666L226Q964K134n359m850k443R176l30J385k306Q762J295
6852A5510k56N61M09P254l135r238p188j5470N381J010j0426M401K0640R030R74
6837A9457L600l621j0376j5587K767n602J2604J1515k1519j1007J0403N906n563
$$ plain form
6824 -7023 -10830 -19532 -17066 -17385 -17618 -2865 -3226 -11580 -10017 3733 1323 -5145 -10678 -4206 4610
6809 4610 2400 -11255 -27363 -27147 -33612 -20681 -19157 -9713 -2452 3911 -3289 -4129 -811 6303 12495
6794 12495 7792 -5359 -12022 -22366 -22246 -11432 -12692 -9951 8620 20502 16813 25666 24966 7781
6780 7781 -3345 -3867 -19869 -24705 -22615 -32493 -25494 -8443 2233 14566 17610 5772 -689 5250
6766 5250 19187 24377 17394 1945 -10240 -14734 -9023 -617 -5549 -2404 -5114 309 12535 1318
6752 1318 6859 10391 12088 17025 -2810 -6304 -72 -4266 260 7715 7137 -3340 -4911 4373 16085
6737 16085 21115 18697 12828 1552 10358 12384 10559 24379 22486 3340 -10469 -4720 1632 13765
6723 13765 15685 20542 23683 17347 7101 -7341 -16681 -10664 -11376 -8912 -11802 -8576 -3954 -5126
$$ packed form
6824g023l807q702K466l19k33J4753l61q354J563J3750k410o468n533O472Q816
6809D610k210j3655j6108K16o465J2931J524R444P261O363p200q40L318P114O192
6794A2495m703j3151o663j0344J20J0814j260K741J8571J1882l689Q853p00j7185
6780G781j1126n22j6002m836K090r878O999J7051J0676J2333L044j1838o461N939
6766E250J3937N190o983j5449j2185m494N711Q406m932L145k710N423J2226j1217
6752A318N541L532J697M937j9835l494O232m194M526P455n78j0477j571R284J1712
6737A6085N030k418n869j1276Q806K026j825J3820j893j9146j3809N749O352J2133
6723A3765J920M857L141o336j0246j4442r340O017p12K464k890L226M622j172
$$ plain form
6709 -5126 -10165 -14496 -13120 -11897 -16314 -30674 -38575 -40222 -41965 -19289 -3962 5919 7523 1749
6695 1749 -10741 -25168 -9101 -9683 -8851 -10605 -14182 -11555 -11995 -1899 1003 -3452 415 2295 -1578
6680 -1578 -16502 -14026 -6046 -6982 9913 7372 10509 7902 3573 1820 -231 -7399 -9506 -3525 -10997
6665 -10997 -2887 -2913 208 13465 8027 -3279 -3721 -9402 7085 22140 28053 17157 10224 4195
6651 4195 427 -633 9144 8945 12676 20454 15185 842 898 2388 15789 18693 12232 -1597 1326
6636 1326 3565 13785 2973 -5921 -17683 -19047 -24378 -25047 -20687 -17367 -15858 -14480 -19904 -26061
6622 -26061 -10075 -1922 -4464 -3654 382 2457 1604 -3959 -3078 8587 18642 25216 24194 10295
6608 10295 -2997 -4180 -9724 -18544 -24116 -11343 -15 -2002 -3355 1648 4976 -10143 -13064 -3002
$$ packed form
6709e126n039m331J376J223m417j4360p901j647j743K2676J5327R881J604n774
6695A749j2490j4427J6067n82Q32j754l577K627m40J0096K902m455L867J880l873
6680a578j4924K476P980r36J6895k541L137k607m329j753k051p168k107N981p472
6665a0997Q110k6L121J3257n438j1306m42n681J6487J5055N913j0896o933o029
6651D195l768j060R777j99L731P778n269j4343N6J490J3401K904o461j3829K923
6636A326K239J0220j0812q894j1762j364n331o69M360L320J509J378n424o157
6622b6061J5986Q153k542Q10M036K075q53n563Q81J1665J0055O574j022j3899
6608A0295j3292j183n544q820n572J2773J1328j987j353N003L328j5119k921J0062
$$ plain form
6594 -3002 -9981 -287 1163 3563 5178 14363 16527 13439 15583 -1090 -17454 -6856 -1232 -3128
6580 -3128 -8117 -9926 6210 7562 952 4851 12063 11317 13160 -2843 -5993 1948 9845 5108 3240
6565 3240 6264 -1128 1025 -8872 -3539 6520 4570 8224 17919 14156 -1506 -9851 -11469 -623
6551 -623 7100 14119 15282 16844 13466 8106 -6799 -9202 -1573 -10869 -11599 -10012 -3776 1123 -9945
6536 -9945 0 -10423 -18840 -23651 -21962 -10123 2687 -3060 -9810 -13619 -11699 -10144 -6108 -8029
6522 -8029 -1932 3430 -3990 -15083 -7767 -19995 -20718 -16183 -3273 -8779 -3458 -6798 -8043 13216
6508 13216 18286 -1323 -11458 -11933 -12404 -8146 -11558 -7159 -3565 3192 3507 -7863 417 12395
6494 12395 -5185 -17806 -17892 -17659 -19735 -21680 -19593 -5614 -9034 1825 11135 9477 9732 4853 9839
$$ packed form
6594c002o979R694J450K400J615R185K164l088K144j6673j6364J0598N624j896
6580c128m989j809J6136J352o610L899P212p46J843j6003l150P941P897m737j868
6565C240L024p392K153r897N333J0059j950L654R695l763j5662q345j618J0846
6551f23P723P019J163J562l378n360j4905k403P629r296p30J587O236M899j1068
6536i945R945j0423q417m811J689J1839J2810n747o750l809J920J555M036j921
6522h029O097N362p420j1093P316j2228p23M535J2910n506N321l340j245K1259
6508A3216N070j9609j0135m75m71M258l412M399L594O757L15j1370Q280J1978
6494A2395j7580j2621q6K33k076j945K087J3979l420J0859R310j658K55m879M986
$$ plain form
6479 9839 9803 -1953 -7413 -3455 -1187 -1947 -7446 -13438 -16432 -6453 -10001 -19192 -7055 148 774
6464 774 4779 11460 4021 4752 -87 1655 4704 10113 15315 17702 5263 -9376 -7339 3221 507
6449 507 4418 12922 19531 22818 18614 13923 7851 -794 -727 -469 -5680 -13306 -2444 -10317 -13973 -4637
6433 -4637 -9792 -1596 -68 -1750 2083 624 7869 6602 11779 16963 7248 -12967 -17753 -20096 -14446
6418 -14446 -7468 -15433 -15747 -15737 -4059 10872 -2118 -12827 -1791 -1343 3847 10411 13791 7409
6404 7409 10310 13512 9136 13357 14076 24660 12390 1968 -1293 -13672 -8642 -12133 -10282 -2440
6390 -2440 9914 13506 8895 7427 -2069 -278 -6786 -8038 11217 8602 -665 -5585 -9945 -17721
6376 -17721 -10696 -7023 6881 -2677 -14406 -10224 -4736 -1097 -3031 -2000 -9102 -30288 -21805 9245
$$ packed form
6479I839l6j1756n460L958K268p60n499n992k994R979l548r191J2137P203O26
6464G74M005O681p439P31m839J742L049N409N202K387j2439j4639K037J0560k714
6449E07L911Q504O609L287m204m691o072q645O7K58n211p626J0862p873l656R336
6433d637n155Q196J528j682L833j459P245j267N177N184r715k0215m786k343N650
6418a4446O978p965l14J0J1678J4931j2990j0709J1036M48N190O564L380o382
6404G409K901L202m376M221P19J0584j2270j0422l261j2379N030l491J851P842
6390b440J2354L592m611j468r496J791o508j252J9255k615r267m920m360p776
6376a7721P025L673J3904r558j1729M182N488L639j934J031p102k1186Q483L1050
$$ plain form
6362 9245 11948 7049 2625 -10092 -4137 -8805 -14770 -9793 -5762 12723 16609 10712 14278 7264
6348 7264 5774 3098 -3091 -7403 1424 9223 4538 13276 3371 -20755 -33046 -13710 4191 13621
6334 13621 11815 14171 21800 -694 2837 11601 12047 7500 4681 2366 711 3729 -5094 -3903 2710
6319 2710 8882 14094 21905 41311 39254 15927 363 11441 15732 18837 3237 7891 -7263
6306 -7263 -32415 -21107 -26680 -22319 -3600 11719 7973 10949 15469 16880 12739 11262 8846 6248
6292 6248 -10938 -20003 -19184 -28953 -21153 -1724 3235 5334 1146 2240 9143 13760 4996 735 2901
6277 2901 -7757 -5530 -5389 -18262 -19118 -15398 -13251 -1840 -6190 -7592 -9923 -12193 176 2465
6263 2465 10689 18914 23250 16791 21467 21450 14152 11752 25197 26484 19265 17528 10910 8625 9842
$$ packed form
6362I245K703m899m424j2717N955m668n965M977M031J8485L886n897L566p014
6348G264j490k676o189m312Q827P799m685Q738r905k4126j2291J9336J7901R430
6334A3621j806K356P629k2494L531Q764M46m547k819k315j655L018q823J191O613
6319B710O172N212P811J9406k057k3327j5564J1078M291L105j5600M654j5154
6306g263k5152J1308n573M361J8719J5319l746K976M520J411m141j477k416k598
6292F248j7186r065Q19r769P800J9429M959K099m188J094O903M617q764m261K166
6277B901j0658K227J41j2873q56L720K147J1411m350j402k331k270J2369K289
6263B465Q224Q225M336o459M676j7p298k400J3445J287p219j737o618k285J217
$$ plain form
6248 9842 15051 -481 -7293 -10824 -7112 -6335 -12377 -13560 -24179 -23571 -13990 -18446 -7094 12762
6234 12762 12065 14819 4905 -9486 -10405 -8526 -8886 -9696 -7863 -6719 -4068 -890 1989 2000 15067 15239
6218 15239 14472 835 -5875 -6832 -15390 -15954 -8562 7901 4565 -4249 -5662 4548 925 -3434 -18147
6203 -18147 -23376 -23184 -18138 -13295 -21123 -15272 -11344 -8004 109 7337 -2469 -19432 -17139 -5487
6189 -5487 -3567 4838 15534 9773 4058 2498 11527 22715 23037 15370 11271 -807 -2987 -15950
6175 -15950 -17637 -20781 -25693 -17395 -8861 1432 5482 -10112 -16952 -8044 -1774 -9483 -3048 11867
6161 11867 1363 -3151 -2679 -12296 -21294 -17079 -828 14839 11321 12383 15037 17990 9492 -2861
6147 -2861 -10192 -4790 -6811 -5256 -3574 -17473 -22988 -11910 -8891 -12886 -15231 -4537 8482 9625
$$ packed form
6248I842N209j5532o812l531L712P77o042j183j0619O08R581m456J1352J9856
6234A2762o97K754r914j4391r19J879l60q10J833J144K651L178K879J1J3067J72
6218A5239p67j3637o710r57q558n64P392J6463l336q814j413J0210l623m359j4713
6203a8147n229J92N046M843p828N851L928L340Q113P228r806j6963K293J1652
6189e487J920Q405J0696n761n715j560R029J1188L22p667m099j2078k180j2963
6175a5950j687l144m912Q298Q534J0293M050j5594o840Q908O270p709O435J4915
6161A1867j0504m514M72r617q998M215J6251J5667l518J062K654K953q498j2353
6147b861p331N402k021J555J682j3899n515J1078L019l995k345J0694J3019J143
$$ plain form
6133 9625 -10037 -17787 -18552 -15646 -16414 -2869 -16010 -14567 -17345 -36296 -48797 -25525 -6541 -747
6119 -747 4025 -4823 -2145 9449 12238 11353 4016 9100 7367 12110 10422 -10658 -16828 -10027 -5330
6104 -5330 2969 -3258 -1885 1555 5518 1078 4597 -5068 -19129 -8693 -37 11710 4812 -302
6090 -302 -18993 -29660 -24211 -8156 -15725 -22287 -22781 -12823 -2985 6684 7651 -7468 -14814 -6543 4230
6075 4230 8651 15111 3261 3595 920 -3159 4132 6115 -13365 -25238 -28744 -41401 -40103 -41793
6061 -41793 -31376 -9065 -20020 -18134 -2747 -206 9078 -3339 -284 4997 12938 -1046 -19496
6048 -19496 -22019 -20666 -9572 -4581 -2536 -6581 -8382 2401 21833 18346 17167 8313 3635 -2996
6034 -2996 153 -9680 -23226 -26547 -8734 5746 9660 -2304 -8993 -8190 -12664 -11039 3040 1358
$$ packed form
6133I625j9662p750p65K906p68J3545j3141J443k778j8951j2501K3272J8984N794
6119g47M772q848K678J1594K789q85p337N084j733M743j688k1080o170O801M697
6104e330Q299o227J373L440L963m440L519r665j4061J0436Q656J1747o898n114
6090c02j8691j0667N449J6055p569o562m94R958R838R669R67j5119p346Q271J0773
6075D230M421O460j1850L34k675m079P291J983j9480j1873l506j2657J298j690
6061d1793J0417K2311j0955J886J5387K541R284j2417L055N281P941j3984j8450
6048a9496k523J353J1094M991K045m045j801J0783J9432l487j179q854m678o631
6034b996L149r833j3546l321J7813J4480L914j1964o689Q03m474J625J4079j682
$$ plain form
6020 1358 6457 2977 1125 -4855 -4623 3371 7696 -3419 -8714 -11832 -24190 -31518 -15107 -7786
6006 -7786 -5347 -18434 -24395 -27866 -16550 -3979 -5737 -12715 -8385 2047 10170 -5890 -12182 -9630
5992 -9630 -20317 -28971 -31736 -29515 -24982 -16404 -10844 -3831 -7260 -387 13160 21804 20556 16030
5978 16030 7546 6323 4333 312 -8858 -13115 -1490 -4750 -8473 -15840 -10354 2776 14182 7129
5964 7129 -694 4316 -5152 -6632 -3182 -1645 8954 -397 -10388 -10514 -19217 -21092 -15144 -310 933
5949 933 -10643 -15862 -19332 -21063 -9962 -12041 -3987 1496 -4575 -9689 -10436 -4904 -2342 -4884 -17904
5934 -17904 -16882 -6089 -6352 7024 10010 6235 583 6527 -5302 -14151 -19175 -18054 -15778 -35
5920 -35 -1764 -11960 -18302 -3033 -266 7832 4259 -8908 -16408 -12959 -20484 -26436 -11608 -10560
$$ packed form
6020A358N099l480j852n980K32P994M325j1115n295l118j2358p328J6411P321
6006g786K439j3087n961l471J1316J2571j758o978M330J0432Q123j6060o292K552
5992i630j0687q654k765K221M533Q578N560P013l429O873J3547Q644j248m526
5978A6030q484j223j990m021r170m257J1625l260l723p367N486J3130J1406p053
5964G129p823N010r468j480L450J537J0599r351r991j26q703j875N948J4834J243
5949I33j1576n219l470j731J1101k079Q054N483o071n114p47N532K562k542j3020
5934a7904J022J0793k63J3376K986l775n652N944j1829q849n024J121K276J5743
5920c5j729j0196o342J5269K767Q098l573j3167p500L449p525n952J4828J048
$$ plain form
5906 -10560 -696 11018 1161 -5327 6071 12852 15825 16392 13455 15610 3444 -11311 -21181 -32302
5892 -32302 -25544 -18106 -8602 248 4685 7048 7711 11085 -164 -7604 -7787 -1001 -4702 -4871 13535
5877 13535 12136 12737 4367 -6979 -1735 6363 11901 10531 769 -14994 -29966 -23511 -19520 -22126
5863 -22126 -24128 -33039 -25934 -11007 -662 12229 22572 23531 8349 -5599 -14016 -8121 14606
5850 14606 21247 4159 -5195 -17417 -6088 -4708 -7442 -3888 -16878 -22077 -7016 -2646 -6329
5837 -6329 -12824 -14382 -13345 -4162 -1907 1197 1950 -4327 -1217 -4675 -4763 -453 5943 16196 7874
5822 7874 -5818 -9206 -9798 -12852 -9402 1981 2161 1201 9413 13608 7609 689 -12087 -17827 -13083
5807 -13083 -10749 4522 16106 23060 24854 27236 13809 8064 4426 5452 1941 9870 10150 11525
$$ packed form
5906a0560R864J1714r857o488J1398O781K973N67k937K155j2166j4755r870j1121
5892c2302O758P438R504Q850M437K363O63L374j1249p440j83O786l701j69J8406
5877A3535j399O01q370j1346N244Q098N538j370r762j5763j4972O455L991k606
5863b2126k002q911P105J4927J0345J2891J0343R59j5182j3948q417N895K2727
5850A4606O641j7088r354j2222J1329J380k734L554j2990n199J5061M370l683
5837f329o495j558J037R183K255L104P53o277L110l458q8M310O396J0253q322
5822G874j3692l388n92l054L450J1383J80r60Q212M195n999o920j2776n740M744
5807a3083K334J5271J1584O954J794K382j3427n745l638J026l511P929K80J375
$$ plain form
5793 11525 9687 8314 -299 -3355 -16038 -19801 -5948 -2028 -7549 -18653 -10377 -16403 -15519 -5707
5779 -5707 -4140 5022 4382 3083 -9984 -11843 -720 103 -6109 -2078 1513 11452 5644 13182 6633
5764 6633 -1500 1760 -5435 -7360 1076 11301 30015 26657 34979 33435 18396 14502 4147 -15647
5750 -15647 -11688 -4728 -4017 -9203 -18063 -31091 -29276 -21522 -22625 -19981 -10760 -701 11125 121
5736 121 -18686 -43511 -25415 -1426 -4329 -6943 9708 17242 9996 6156 6963 -9753 -20503 -11942
5722 -11942 4457 19614 14198 1139 -6667 -16177 -22720 -6239 -9363 -17087 -28760 -38477 -36394
5709 -36394 -21339 -14339 -17847 -13445 -3425 11981 7345 -2108 -13253 -15358 1707 2582 10460 12711
5695 12711 6531 -111 -11101 -3551 -9540 -17039 -2414 19449 8120 179 20347 27350 16948
$$ packed form
5793A1525j838j373q613l056j2683l763J3853L920n521j1104Q276o026Q84R812
5779e707J567R162o40j299j3067j859J1123Q23o212M031L591R939n808P538o549
5764F633q133L260p195j925Q436J0225J8714l358Q322j544j5039l894j0355j9794
5750a5647L959O960P11n186q860j3028J815P754j103K644R221J0059J1826j1004
5736A21j8807k4825J8096K3989k903k614J6651P534p246l840Q07j6716j0750Q561
5722a1942J6399J5157n416j3059p806r510o543J6481l124p724j1673r717K083
5709c6394J5055P000l508M402J0020J5406m636r453j1145k105J7065Q75P878K251
5695A2711o180o642j0990P550n989p499J4625K1863j1329p941K0168P003j0402
$$ plain form
5682 16948 -1374 -16246 5643 13584 8289 4196 3908 -2806 -3271 11701 19475 8359 -18600 -20577
5668 -20577 -8749 -3951 605 -1200 -17682 -19245 -15417 8687 8134 2741 12775 6144 -7067 -1370
5654 -1370 8858 5188 -6946 -10284 -8122 -18723 -17464 -6519 19256 16935 6086 9997 10059 -681
5640 -681 13744 13858 8682 11261 9669 -2089 -13507 -15767 -9808 -5557 6341 11230 10008 2486
5626 2486 -2030 -4804 558 1622 -9801 -15904 2795 21671 9652 -8357 -16785 -9231 -10705 -7541
5612 -7541 -1588 -838 -4270 4654 14219 16330 9207 5510 668 -5811 -2696 3162 9732 -1913 -14087
5597 -14087 -19011 -28539 -10227 4271 18361 12576 6704 17292 22050 11424 -4140 2350 10284
5584 10284 13307 8728 -1424 4126 7409 7502 -1810 1137 -1622 -8981 -2010 -10164 -8182 7802 11642
$$ packed form
5682A6948j8322j4872K1889P941n295m093k88o714m65J4972P774j1116k6959j977
5668b0577J1828M798M556j805j6482j563L828K4104n53n393J0034o631j3211N697
5654a370J0228l670j2134l338K162j0601J259J0945K5775k321j0849L911O2j0740
5640f81J4425J14n176K579j592j1758j1418k260N959M251J1898M889j222p522
5626B486m516k774N362J064j1423o103J8699J8876j2019j8009q428P554j474L164
5612g541N953P50l432Q924R565K111p123l697m842o479L115N858O570j1645j2174
5597a4087m924r528J8312J4498J4090n785n872J0588M758j0626j5564O490P934
5584A0284L023m579j0152N550L283R3r312K947k759p359O971q154J982J5984L840
$$ plain form
5569 11642 12372 10253 8387 7041 3504 -5919 -24440 -15442 -8593 -11776 -9183 -4873 -8535 4429
5555 4429 2666 4302 1070 8383 2846 -13179 -23365 -25503 -23977 -22108 -19296 -24342 -36864 -33823
5541 -33823 -41601 -40614 -32314 -23585 -18992 -15359 -24138 -12157 -5927 -5212 -4742 -16794 -16915 -3369 -1600
5526 -1600 -1398 -98 -6897 -10094 -11663 -17076 -21874 -24233 -18529 -22231 -23341 -8842 -12350 -15040 1036
5511 1036 -3871 -4902 -6680 -11257 -14210 -2757 20868 15544 -987 -3872 -19228 -18745 -8619 -16341
5497 -16341 -23504 -8655 -3610 -13141 425 19989 22540 25411 30824 15971 4093 -7240 -13662
5484 -13662 -13737 -6836 -7494 -10726 -17299 -3954 16778 8750 -4582 -4560 -6640 -14765 -19706 -8051 -9716
5469 -9716 -12799 -12269 -11896 -19790 -26929 -33444 -33237 -19571 -24494 -37600 -46556 -37581 -27572 -22388 -9150
$$ packed form
5569A1642P30k119j866j346l537r423j8521Q998O849l183K593M310l662J2964
5555D429j763J636l232P313n537j6025j0186k138J526J869K812n046j2522L041
5541c3823p778R87Q300Q729M593L633q779J1981O230P15M70j2052j21J3546J769
5526a600K02J300o799l197j569n413m798k359N704l702j110J4499l508k690J6076
5511A036m907j031j778m577k953J1453K3625n324j6531k885j5356M83J0126p722
5497a6341p163J4849N045r531J3566J9564K551K871N413j4853j1878j1333o422
5484a3662p5O901o58l232o573J3345K0732q028j3332K2k080q125m941J1655j665
5469i716l083N30L73p894p139o515K07J3666m923j3106q956Q975J0009N184J3238
$$ plain form
5454 -9150 -9359 -18959 -19147 -31702 -19957 105 2668 6562 11827 9489 -4323 -15358 -15129 -279
5440 -279 773 1395 6026 -545 -1931 5964 2935 -3338 5848 8204 7520 -1515 -6790 -13804 -25834
5425 -25834 -10029 -3016 -3078 -14290 -13042 -2726 9326 3649 3018 -9230 -7916 -12246 -14451 -7681
5411 -7681 -17967 -19386 -18626 -23401 -19310 -25626 -23706 -21801 -35835 -38310 -21865 -17700 -5401 5782
5397 5782 -9146 -16712 -18610 -18271 -21299 -14093 -10806 -13728 -14409 -6577 3926 -2042 -17271 -27483
5383 -27483 -18299 -15345 1376 4198 -5435 -13874 -25981 -21160 -11585 -10023 -24214 -26736 -20842 -10906
5369 -10906 -5141 -4467 5592 10291 -6829 -3957 10242 24490 19081 5861 14326 1155 831 -1756
5355 -1756 -11920 -13982 -6640 -5808 -7056 -13563 -13953 -12717 -12179 -12583 -5245 -8446 -125 -5033 -13679 -10493
$$ packed form
5454i150k09r600j88j2555J1745K0062K563L894N265k338j3812j1035K29J4850
5440b79J052O22M631o571j386P895l029o273R186K356o84r035n275p014j2030
5425b5834J5805P013o2j1212J248J0316J2052n677o31j2248J314m330k205O770
5411g681j0286j419P60m775M091o316J920J905j4034k475J6445M165J2299J1183
5397E782j4928p566j898L39l028P206L287k922o81P832J0503n968j5229j0212
5383b7483R184K954J6721K822r633q439j2107M821R575J562j4191k522N894R936
5369a0906N765O74J0059M699j7120K872J4199J4248n409j3220Q465j3171l24k587
5355a756j0164k062P342Q32j248o507l90J236N38m04P338l201Q321m908q646L186
$$ plain form
5339 -10493 -4803 -3361 6429 9526 17477 18071 9337 1481 9522 4715 11443 17840 10019 9716 4912
5324 4912 237 6081 -1145 -6604 -2276 -8573 -11377 -8592 -17029 -21326 -10737 -4105 -17679 -30128
5310 -30128 -19650 -15609 -15371 -8954 -257 -11728 -24885 -30415 -25311 -22094 -32395 -26442 -11234 -5900
5296 -5900 -8682 -13177 -11353 -13228 -24174 -23248 -5375 2453 -3348 -9293 127 13796 16100 -8443
5282 -8443 -18777 -24124 -19673 -13776 -6923 -2511 -4801 -4412 -3693 -8729 -1849 -3307 -11072 -9290 -20841
5267 -20841 -28851 -23903 -13942 -14520 -20974 -8174 326 9627 -2344 -19081 -17783 -19392 -22080 -19038
5253 -19038 -4306 -4803 745 -1456 -11634 -19159 -34900 -10027 6350 -1893 -11499 -1322 -4568
5240 -4568 -11765 -9944 -18231 -26805 -11061 -6546 -8903 -6602 -5844 -11948 -19233 -22913 -2411 3081 -7875
$$ packed form
5339a0493N690J442R790L097P951N94q734p856Q041m807O728O397p821l03m804
5324D912m675N844p226n459M328o297k804K785q437m297J0589O632j3574j2449
5310c0128J0478M041K38O417Q697j1471j3157n530N104L217j0301N953J5208N334
5296e900k782m495J824j875j0946R26J7873P828n801n945R420J3669K304k4543
5282h443j0334n347M451N897O853M412k290L89P19n036O880j458p765J782j1551
5267b0841q010M948R961n78o454J2800Q500R301j1971j6737J298j609k688L042
5253a9038J4732m97N548k201j0178p525j5741K4873J6377q243r606J0177l246
5240d568p197J821q287q574J5744M515k357K301P58o104p285l680K0502N492j0956
$$ plain form
5225 -7875 -5944 964 359 -7069 -13275 -10654 -7963 -3132 -2641 -12457 -14560 -23030 -13945 -13377 -2909
5210 -2909 -3655 -8512 -10449 -5425 -9842 -9372 -2321 -4313 -1020 3808 5920 11590 12349 10779 10232 -5370
5194 -5370 -3916 -4593 -4866 3614 618 4886 15782 20571 31899 28783 7443 2370 -8423 -9828
5180 -9828 -11556 -20191 -22148 -18163 -9858 -5589 -11428 -28501 -31992 -28471 -18384 -3886 6021 120
5166 120 -4987 -3691 -8542 -7972 7118 25547 19871 13196 12472 2019 -4928 2303 17164 11246 -8041
5151 -8041 -18107 -10821 -4359 2669 7869 5703 12083 1213 -19732 -21076 -21479 -25237 -12447 -1440
5137 -1440 2130 6966 4833 11971 26046 20010 4905 -878 -4483 -8151 -10404 -17965 -30827 -21059
5123 -21059 12679 32991 26582 18899 4749 -15726 -26701 -30084 -25485 -15607 -8936 -6630 -9413
$$ packed form
5225g875J931O908o05p428o206K621K691M831M91r816k103q470R085N68J0468
5210b909p46m857j937N024m417M70P051j992L293M828K112N670P59j570n47j5602
5194e370J454o77k73Q480k996M268J0896M789J1328l116k1340n073j0793j405
5180i828j728q635j957L985Q305M269n839j7073l491L521J0087J4498R907n901
5166A20n107J296m851N70J5090J8429n676o675p24j0453o947P231J4861n918j9287
5151h041j0066P286O462P028N200k166O380j0870k0945j344m03l758J2790J1007
5137a440L570M836k133P138J4075o036j5105n783l605l668k253p561j2862R768
5123b1059L3738K0312o409p683j4150k0475j0975l383M599R878O671K306k783
$$ plain form
5110 -9413 -9266 -3398 -276 12050 7670 -13627 -21662 -11025 -5272 -1031 3029 7091 5075 -10466
5096 -10466 974 6030 3874 1926 6343 4267 -4443 -6566 -5784 -9262 -709 9135 331 -11071
5082 -11071 -3856 4865 10122 11003 3333 -6679 -719 144 -5491 -29051 -38354 -41032 -28467 -10486
5068 -10486 -6134 -15146 -1955 11098 -2087 -18779 -11809 11617 10214 -7188 -7195 -1239 -8994 -13658
5054 -13658 -12155 -22186 -29969 -30357 -18210 -10216 -4687 777 1876 1717 -8246 -7908 2850 10279 15740
5039 15740 14951 -508 -13316 -9395 -12058 -13893 -8963 -6851 -3508 -13615 -11482 1367 7845 5168
5025 5168 22356 20479 11426 2343 -2640 -3209 -8552 -11906 -26020 -22096 -16395 -15606 -9340 5370 -3064
5010 -3064 -8806 -2835 8122 7981 4015 4563 1324 -6000 -5632 6479 8238 4806 4025 2397 4293
$$ packed form
5110i413J47N868L122J2326m380k1297q035J0637N753M241M060M062k016j5541
5096a0466J1440N056k156j948M417k076q710k123P82l478Q553R844q804j1402
5082a1071P215Q721N257Q81p670j0012N960Q63n635k3560r303k678J2565J7981
5068a0486M352r012J3191J3053j3185j6692O970K3426j403j7402pN956p755m664
5054a3658J503j0031p783l88J2147P994N529N464J099j59r963L38J0758P429N461
5039A5740p89j5459j2808L921k663j835M930K112L343j0107K133J2849O478k677
5025E168J7188j877r053r083m983n69n343l354j4114L924N701P89O266J4710q434
5010c064n742N971J0957j41l966N48l239p324L68J2111J759l432p81j628J896
$$ plain form
4995 4293 2802 2567 2473 443 2664 275 -2962 -2274 -5465 -6685 -19753 -27693 -22064 -13950 -3708
4980 -3708 -13962 -19585 -20392 -15218 -10808 -9070 -8767 -17316 -33041 -23289 -9361 -12763 -8615 -390 384
4965 384 10540 20166 10550 -6961 -26572 -33520 -34780 -34237 -31641 -20080 -13489 -16784 -5294 4720
4951 4720 8128 41 -3302 -10150 -20347 -18838 -14053 -13139 -13670 -12294 -10284 -13383 -9969 -5305 -7076
4936 -7076 -19575 797 14563 4640 -6205 -4878 -12597 -17166 -11078 -7597 -17402 -17234 -18906 -26338
4922 -26338 -26275 -8762 15134 12421 -5624 -20518 -12614 10880 15366 3320 -5555 -11698 -4386 6033
4908 6033 12010 10769 887 7738 13383 18730 12695 -2063 -9333 -22870 -14931 8399 7116 5739
4894 5739 -744 3820 1474 -3460 -9962 -21253 -14726 -8070 4560 2841 3460 17344 10900 -888
$$ packed form
4995D293j491k35r4k030K221k389l237O88l191j220j3068p940N629Q114J0242
4980c708j0254n623q07N174M410J738L03q549j5725R752J3928l402M148Q225P74
4965C84J0156R626r616j7511j9611o948j260N43K596J1561O591l295J1490J0014
4951D720L408q087l343o848j0197J509M785R14n31J376K010l099L414M664j771
4936g076j2499K0372J3766r923j0845J327p719m569O088L481r805J68j672p432
4922b6338O3J7513K3896k713j8045j4894P904K3494M486j2046q875o143P312J0419
4908F033N977j241r882O851N645N347o035j4758p270j3537P939K3330j283j377
4894E739o483M564k346m934o502j1291O527O656J2630j719O19J3884o444j1788
$$ plain form
4880 -888 -6223 -9317 -6553 -1295 -1452 -13240 -8525 13714 21176 16869 6068 8841 15809 13281 8290
4865 8290 1380 -412 -7065 -1323 19344 15711 5777 12276 5458 -7162 -3624 -5598 -5283 -10250 -27035
4850 -27035 -18034 -24751 -20321 -19280 -9793 -7048 -7803 -17211 -24873 -24022 -16631 -23359 -23482 -5322 -3729
4835 -3729 -12126 -24310 -42846 -40480 -26566 -19015 -13883 -12746 -11551 -4249 -2938 1719 6011 3660
4821 3660 6887 -2430 -12391 -18517 -30962 -37186 -14426 -4929 -15417 -15136 -21155 -29749 -17189 -423
4807 -423 -3526 3926 -8546 -8780 -3242 5633 12167 15074 8432 10841 6712 6339 14156 10031 -250
4792 -250 -9837 -4310 -734 13687 14374 4351 218 -14930 -17284 -30768 -35532 -32053 -11175 -8763
4778 -8763 -25291 -29757 -15019 -10469 -196 1286 -2593 -10007 -11477 5121 10048 2683 -4 709
$$ packed form
4880h88n335l094K764N258j57j1788M715K2239P462m307j0801K773O968k528m991
4865H290o910j792o653N742K0667l633r934O499o818j2620L538j974L15m967j6785
4850b7035R001o717M430J041R487K745p55r408p662Q51P391o728j23J8160J593
4835c729q397j2184j8536K366J3914P551N132J137J195P302J311M657M292k351
4821C660L227r317r961o126j2445o224K2760R497j0488K81o019q594J2560J6766
4807d23l103P452j2472k34N538Q875O534K907o642K409m129l73P817m125j0281
4792b50r587N527L576J4421O87j0023m133j5148k354j3484m764L479K0878K412
4778h763j6528m466J4738M550J0273J482l879p414j470J6598M927p365k687P13
$$ plain form
4764 709 -30 -3982 -266 -5433 -13438 -22937 -23125 -22436 -10697 -6936 -11493 -5219 -7985 4894 24936
4749 24936 14729 -271 2160 13894 13052 10151 4489 6923 10220 326 2057 4950 5140 -3363
4735 -3363 2230 11034 14815 9036 2300 226 -10360 -13612 -9344 -9448 -20265 -39727 -34997 -24946
4721 -24946 -17717 -12018 -5815 -5483 8787 24387 21711 16627 11607 7724 10085 2663 543 -898
4707 -898 2115 6720 -4133 -10304 -9007 -18327 -18306 -13205 -18756 -28588 -22781 -15049 -23872 -28558 -19045
4692 -19045 -25473 -21802 -19872 -22910 -19548 -21384 -14359 -12904 -5130 3214 -2110 -3781 -8632 -14348 -11489
4677 -11489 798 10619 8688 2615 -2477 -3262 6723 22329 18828 11422 2293 -11222 -4736 -684
4663 -684 -2939 3184 20887 21367 1372 -1920 -6120 -13813 154 -14580 -22347 -15281 1982 2683
$$ packed form
4764G09p39l952L716n167q005r499j88O89J1739L761m557O274k766J2879K0042
4749B4936j0207j5000K431J1734q42k901n662K434L297r894J731K893J90q503
4735c363N593Q804L781n779o736k074j0586l252M268j04j0817j9462M730J0051
4721b4946P229N699O203L32J4270J5600k676n084n020l883K361p422k120j441
4707h98L013M605j0853o171J297r320K1N101n551r832N807P732q823m686R513
4692a9045o428L671J930l038L362j836P025J455P774Q344n324j671m851n716K859
4677a1489J2287R821j931o073n092p85R985J5606l501p406r129j3515O486M052
4663f84k255O123J7703M80j9995l292m200p693J3967j4734p767P066J7263P01
$$ plain form
4649 2683 -1897 13041 25849 22524 3139 6424 14161 14717 7836 7541 4683 -1921 -22297 -25922
4635 -25922 -20044 -16849 -5653 2969 7868 -854 -16562 -21213 -28244 -31033 -18803 -27648 -19583 -4247
4621 -4247 441 3642 -1208 16434 11421 35 -6762 -9924 -2826 -2774 8091 -3521 -9641 -14729
4607 -14729 -9801 -12792 -15804 -12758 -1372 954 -8246 4299 -2433 -13217 -9629 -206 2139 4123
4593 4123 -5190 -141 -19909 -16347 -12308 -14026 -12623 -8919 -10887 -18031 -13557 -13913 -14797 -13135 -21481
4578 -21481 -36179 -43084 -30515 -2483 8423 8741 21258 14272 -2077 -1846 2009 -3700 -7120 -8267
4564 -8267 -10252 -11430 -5704 -19485 -8605 -12223 -23358 -28394 -17021 -8393 -18922 -13002 789
4551 789 -1527 -12976 -23482 -13882 149 8724 26592 28402 25016 23849 4377 -11721 -29703
$$ packed form
4649B683m580J4938J2808l325j9385L285P737N56o881k95k858o604k0376l625
4635b5922N878L195J1196Q622M899q722j5708m651p031k789J2230q845Q065J5336
4621d247M688L201m850J7642n013j1386o797l162P098N2J0865j1612o120n088
4607a4729M928k991l012L046J1386K326r200J2545o732j0784L588R423K345J984
4593D123r313N049j9768L562M039j718J403L704j968p144M474l56q84J662q346
4578b1481j4698o905J2569K8032J0906L18J2517o986j6349K31L855n709l420j147
4564h267j985j178N726j3781J0880l618j1135n036J1373Q628j0529N920J3791
4551G89k316j1449j0506R600J4031Q575J7868J810l386j167j9472j6098j7982
$$ plain form
4538 -29703 -33234 -19789 -23908 -16756 -15504 -12285 713 8725 -10020 -10619 -2089 40 -8507 -102
4524 -102 -11872 -25829 -26669 -17106 -8838 -63 17840 15343 6304 -9367 -13878 -20076 -12416 -2366
4510 -2366 -74 3133 20472 9972 9406 13144 10447 5954 -670 -4433 -11472 -6986 -4370 1142 -1939
4495 -1939 -970 1065 2968 -10219 -20521 -14958 -18196 -14140 -11321 -11316 -7394 -1730 -3319 668 16446
4480 16446 1560 -6241 -13689 -14792 -5869 -3277 -10678 -2804 4426 -6322 -18327 -5703 -1842 -4328
4466 -4328 -10204 -17171 -19618 -20513 -29522 -29856 -28892 -8592 800 -6703 1218 -700 -3528 3169 -1106
4451 -1106 -989 -6497 -3639 -19308 -20170 -11991 -8532 -14701 -20293 -22380 -20445 -14893 -691 -254 3718
4436 3718 10593 1555 -14488 -22816 -17959 -1953 8123 29 -7085 -8219 1532 -1948 3024 7814
$$ packed form
4538b9703l531J3445m119P152J252L219J2998Q012j8745n99Q530K129q547Q405
4524a02j1770j3957q40R563Q268Q775J7903k497r039j5671m511o198P660J0050
4510b366K292L207J7339j0500n66L738k697m493o624l763p039M486K616N512l081
4495a939R69K035J903j3187j0302N563l238M056K819NL922N664j589L987J5778
4480A6446j4886p801p448j103Q923K592p401P874P230j0748j2005J2624L861k486
4466d328n876o967k447q95r009l34R64K0300R392p503P921j918k828O697m275
4451a106J17n508K858j5669q62Q179L459o169n592k087J935N552J4202M37L972
4436C718O875r038j6043q328M857J6006J0076q094p114j134R751l480M972M790
$$ plain form
4422 7814 3154 -2313 5526 19154 19326 8755 5066 -4009 -7340 -5209 -8307 -18019 -12882 -24190
4408 -24190 -34731 -30268 -17999 -6150 -11579 -13136 -10463 -2989 2 -7031 -21303 -25679 -27900 -24541
4394 -24541 -20921 -7282 1934 -1824 -9594 -15998 -13340 5227 11841 1092 -13957 -803 -7286
4381 -7286 6344 23124 15145 17319 19797 22245 -982 -19146 -14848 -13782 -8020 1065 7006 3198
4367 3198 -11620 -14589 -5528 12089 7546 2445 1724 -9387 -14840 -7900 -10447 -13071 -13366 -10748 -9486
4352 -9486 -597 -3805 -312 -12342 -19769 -16194 -16387 -639 18294 30087 26522 696 -13324 -20990
4338 -20990 -8775 462 11411 -2965 -25466 -20224 -4428 8773 17005 5525 -2845 -1502 4106
4325 4106 13029 17060 10312 1274 -5139 152 -701 -810 -5473 -6696 2757 1545 1937 -773 5628 7223
$$ packed form
4422G814m660n467P839J3628J72j0571l689r075l331K131l098r712N137j1308
4408b4190j0541M463J2269J1849n429j557K673P474K991p033j4272m376k221L359
4394b4541L620J3639R216l758p770o404K658J8567O614j0749j5049J3154o483
4381g286J3630J6780p979K174K478K448k3227j8164M298J066N762R085N941l808
4367C198j4818k969R061J7617m543n101p21j1111n453O940k547k624k95K618J262
4352i486Q889l208L493j2030p427L575j93J5748J8933J1793l565k5826j4020p666
4338b0990J2215R237J0949j4376k2501N242J5796J3201Q232j1480q370J343N608
4325D106Q923M031o748r038o413N291q53j09m663j223R453j212L92k710O401J595
$$ plain form
4309 7223 2464 4528 16721 12644 16976 12684 -1554 -3105 -25893 -30909 -33270 -35103 -36690 -36032
4295 -36032 -24931 -20720 -27790 -23841 -7178 -7657 3850 -4118 -13599 -7701 11898 23026 28371 26296
4281 26296 25424 27359 18589 7146 12752 17665 -2844 -9880 -12463 -22538 -11242 -7482 -9471 -5941
4267 -5941 2197 -7983 -18611 -22638 -14087 -7126 -6276 10720 4803 -8048 -7231 -7232 -23792 -16324 -10921
4252 -10921 -6515 8487 -2626 -9133 -6704 1038 -2718 -3048 6491 9836 4308 4197 8937 -2443
4238 -2443 -12117 -9335 -4512 2234 1016 5360 -3010 -109 -5102 -4274 9599 4035 -5331 -8098 -5385
4223 -5385 -283 11809 13364 12464 -1178 -15301 -23252 -33722 -23862 -3894 9600 8261 5061 -2063
4209 -2063 -3989 -9192 -20199 -14812 -16646 -20598 -12669 -7959 -2311 2072 4773 10404 8641 -4829
$$ packed form
4309G223m759K064J2193m077M332m292j4238j551k2788n016k361j833j587O58
4295c6032J1101M211p070L949J6663m79J1507p968r481N898J9599J1128N345k075
4281B6296q72J935q770j1443N606M913k0509p036k583j0075J1296L760j989L530
4267e941Q138j0180j0628m027Q551O961Q50J6996n917j2851Q17jj6560P468N403
4252a0921M406J5002j1113o507K429P742l756l30R539L345n528j11M740j1380
4238b443r674K782M823O746j218M344q370K901m993Q28J3873n564r366k767K713
4223e385N102J2092J555r00j3642j4123p951j0470R860J9968J3494j339l200p124
4209b063j926n203j1007N387j834l952P929M710N648M383K701N631j763j3470
$$ plain form
4195 -4829 -3343 7544 27491 31153 19753 8122 -3202 -1263 6148 22274 22014 2205 3265
4182 3265 -11198 -9276 1230 -534 -17659 -39613 -23557 -8053 -13077 -12531 -6262 4786 -3652
4169 -3652 -9322 -9152 -4723 -153 3973 2061 5063 -3033 -2493 -2406 -4214 -10872 -29454 -36593 -34638 -35062
4153 -35062 -19242 -5411 -1033 2819 1995 -8526 -10567 -11385 -12498 -7514 -12039 -7618 -15466 -18576
4139 -18576 -12699 -19190 -16263 -2707 4558 5760 -3449 -16459 -23978 -26687 -25763 -8469 -14264 -25409
$$ packed form
4195d829J486J0887J9947L662j1400j1631j1324J939P411J6126k60j9809J060
4182C265j4463J922J0506j764j7125k1954J6056J5504n024N46O269J1048q438
4169c652n670J70M429M570M126j912L002q096N40Q7j808o658j8582p139J955m24
4153c5062J5820J3831M378L852q24j0521k041q18j113M984m525M421p848l110
4139a8576N877o491K927J3556P265J202r209j3010p519k709R24J7294n795j1145
$$ [...]
##END NTUPLES=NMR SPECTRUM
##END=
