##TITLE=Analysis number 329911
Compound Code cc 62101
Book Reference 540/28/2
Project Code adrs
Chemist Name mikem
##JCAMPDX= 6.0         $$ Bruker NMR JCAMP-DX V2.0
##DATA TYPE= NMR SPECTRUM
##DATA CLASS= NTUPLES
##ORIGIN= Bruker BioSpin GmbH
##OWNER= nmr
$$ XWIN-NMR		Version 3.5
$$ Wed Oct 10 12:50:47 2007 GMT Daylight Time (UT+1h)  MAYBRIDGE\nmr@NMR_250MHZ
##.OBSERVE FREQUENCY= 250.131544655141
##.OBSERVE NUCLEUS= ^1H
##.ACQUISITION MODE= SIMULTANEOUS (DQD)
##.ACQUISITION SCHEME= undefined
##.AVERAGES= 16
##.DIGITISER RES= 18
##SPECTROMETER/DATA SYSTEM= dpx250
##.PULSE SEQUENCE= zg30
##.SOLVENT NAME= DMSO
##.SHIFT REFERENCE= (INTERNAL, DMSO, 0, 16.5076)
##AUDIT TRAIL= $$ (NUMBER, WHEN, WHO, WHERE, WHAT)
$$ ##TITLE= Audit trail, XWIN-NMR		Version 3.5
$$ ##JCAMPDX= 5.01
$$ ##ORIGIN= Bruker BioSpin GmbH
$$ ##OWNER= nmr
$$ C:\u/data/dgb/nmr/ADRS/620/pdata/1/auditp.txt
$$ ##AUDIT TRAIL=  $$ (NUMBER, WHEN, WHO, WHERE, WHAT)
(   1,<2007-10-10 12:50:27.39 +100>,<MAYBRIDGE\nmr>,<NMR_250MHZ>,
      <created by zg, POWCHK disabled, PULCHK disabled
       configuration hash MD5:
       76 6E 9A 78 1E 09 19 81 EC 84 63 8F B0 6A 59 2D
       data hash MD5: 64K
       38 96 52 03 C3 4F C2 64 75 53 70 D1 CA D6 F9 1C>)
(   2,<2007-10-10 12:50:38.62 +100>,<MAYBRIDGE\nmr>,<NMR_250MHZ>,
      <Start of raw data processing
       ef LB = 0.3 FT_mod = 6 PKNL = 1 SI = 32K 
       data hash MD5: 32K
       15 C8 A6 A5 8C AF 94 4A 26 04 93 55 C3 CC 51 C3>)
(   3,<2007-10-10 12:50:40.26 +100>,<MAYBRIDGE\nmr>,<NMR_250MHZ>,
      <apk 
       data hash MD5: 32K
       2A F4 AE 72 70 FF 95 DB B4 06 95 7A 90 C0 A2 A3>)
(   4,<2007-10-10 12:50:41.05 +100>,<MAYBRIDGE\nmr>,<NMR_250MHZ>,
      <abs ABSG = 5 
       data hash MD5: 32K
       2F 86 2B FD 6E 4A 50 64 9F EA 50 A7 96 D3 DF B6>)
$$ ##END=
$$ 
$$ hash MD5
$$ F5 81 CF 24 35 F6 3C C5 0D F9 6B 66 EC EE 26 B9
##$RELAX= 
##$RELAX= 
##$RELAX= 
##$RELAX= 
##$RELAX= 
##$RELAX= 
##$RELAX= 
$$ Bruker specific parameters
$$ --------------------------
##$DU= <C:\u>
##$EXPNO= 620
##$NAME= <ADRS>
##$PROCNO= 1
##$TYPE= <nmr>
##$USER= <dgb>
##$AMP= (0..31)
100 100 100 100 100 100 100 100 100 100 100 100 100 100 100 100 100 100 
100 100 100 100 100 100 100 100 100 100 100 100 100 100 
##$AQSEQ= 0
##$AQ_mod= 3
##$AUNM= <au_zg>
##$AUTOPOS= <18 >
##$BF1= 250.13
##$BF2= 250.13
##$BF3= 250.13
##$BF4= 250.13
##$BF5= 500.13
##$BF6= 500.13
##$BF7= 500.13
##$BF8= 500.13
##$BYTORDA= 1
##$CFDGTYP= 0
##$CFRGTYP= 5
##$CHEMSTR= <none>
##$CNST= (0..31)
1 1 145 1 1 1 1 1 1 1 1 1 1 1 1 1 1 1 1 1 1 1 1 1 1 1 1 1 1 1 1 1 
##$CPDPRG= <>
##$CPDPRG1= <>
##$CPDPRG2= <>
##$CPDPRG3= <>
##$CPDPRG4= <mlev>
##$CPDPRG5= <mlev>
##$CPDPRG6= <mlev>
##$CPDPRG7= <mlev>
##$CPDPRG8= <mlev>
##$CPDPRGB= <>
##$CPDPRGT= <>
##$D= (0..31)
0 1 0 0 0 0 0 0 0 0.06 0 0 0 0 0 0 0.0002 0 0 0 0 0 0 0 0 0 0 0 0 0 0 
0 
##$DATE= 1192017026
##$DBL= (0..7)
120 120 120 120 120 120 120 120 
##$DBP= (0..7)
150 150 150 150 150 150 150 150 
##$DBP07= 0
##$DBPNAM0= <>
##$DBPNAM1= <>
$$ [...]
##$SUBNAM7= <"">
##$SUBNAM8= <"">
##$SUBNAM9= <"">
##$SW= 20.6930455092707
##$SWIBOX= (0..15)
0 0 3 0 0 0 0 0 0 0 0 0 0 0 0 0 
##$SW_h= 5175.983436853
##$TD= 65536
##$TD0= 1
##$TE= 296.16
##$TE2= 300
##$TE3= 300
##$TEG= 300
##$TL= (0..7)
0 120 120 120 120 120 120 120 
##$TP= (0..7)
150 150 150 150 150 150 150 150 
##$TP07= 0
##$TPNAME0= <>
##$TPNAME1= <>
##$TPNAME2= <>
##$TPNAME3= <>
##$TPNAME4= <>
##$TPNAME5= <>
##$TPNAME6= <>
##$TPNAME7= <>
##$TPOAL= (0..7)
0.5 0.5 0.5 0.5 0.5 0.5 0.5 0.5 
##$TPOFFS= (0..7)
0 0 0 0 0 0 0 0 
##$TUNHIN= 0
##$TUNHOUT= 0
##$TUNXOUT= 0
##$USERA1= <user>
##$USERA2= <user>
##$USERA3= <user>
##$USERA4= <user>
##$USERA5= <user>
##$V9= 5
##$VALIST= <valist>
##$VCLIST= <CCCCCCCCCCCCCCC>
##$VD= 0
##$VDLIST= <DDDDDDDDDDDDDDD>
##$VPLIST= <PPPPPPPPPPPPPPP>
##$VTLIST= <TTTTTTTTTTTTTTT>
##$WBST= 1024
##$WBSW= 4
##$XGAIN= (0..3)
0 0 0 0 
##$XL= 0
##$YL= 0
##$YMAX_a= 281071
##$YMIN_a= -389619
##$ZGOPTNS= <>
##$ZL1= 120
##$ZL2= 120
##$ZL3= 120
##$ZL4= 120
##$ABSF1= 16.50763
##$ABSF2= -4.185543
##$ABSG= 5
##$ABSL= 3
##$ALPHA= 0
##$AQORDER= 0
##$ASSFAC= 0
##$ASSFACI= 0
##$ASSFACX= 0
##$ASSWID= 0
##$AUNMP= <proc_1d>
##$AZFE= 0.1
##$AZFW= 0.1
##$BCFW= 0
##$BC_mod= 0
##$BYTORDP= 0
##$COROFFS= 0
##$CY= 12.5
##$DATMOD= 1
##$DC= 0
##$DFILT= <>
##$DTYPP= 0
##$F1P= 14.0000005364418
##$F2P= -0.99999901652339
##$FCOR= 0.5
##$FTSIZE= 32768
##$FT_mod= 6
##$GAMMA= 0
##$GB= 0
##$INTBC= 1
##$INTSCL= 1
##$ISEN= 128
##$LB= 0.3
##$LEV0= 0
##$LPBIN= 0
##$MAXI= 10000
##$MC2= 0
##$MEAN= 0
##$ME_mod= 0
##$MI= 0
##$NCOEF= 0
##$NC_proc= -4
##$NLEV= 6
##$NOISF1= 0
##$NOISF2= 0
##$NSP= 0
##$NTH_PI= 0
##$NZP= 0
##$OFFSET= 16.50763
##$PC= 1
##$PHC0= 143.0675
##$PHC1= 8.139559
##$PH_mod= 1
##$PKNL= yes
##$PPARMOD= 0
##$PSCAL= 4
##$PSIGN= 0
##$REVERSE= no
##$SF= 250.130003593905
##$SI= 32768
##$SIGF1= 0
##$SIGF2= 0
##$SINO= 400
##$SIOLD= 32768
##$SREGLST= <1H.DMSO>
##$SSB= 0
##$STSI= 32768
##$STSR= 0
##$SW_p= 5175.98343685301
##$SYMM= 0
##$S_DEV= 0
##$TDeff= 65536
##$TDoff= 0
##$TI= <Analysis number 999999
Compound Code 99
Book Reference 9
Project Code 9>
##$TILT= no
##$TM1= 0
##$TM2= 0
##$TOPLEV= 0
##$USERP1= <user>
##$USERP2= <user>
##$USERP3= <user>
##$USERP4= <user>
##$USERP5= <user>
##$WDW= 1
##$XDIM= 32768
##$YMAX_p= 427813413
##$YMIN_p= -396661
$$ End of Bruker specific parameters
$$ ---------------------------------
##NTUPLES= NMR SPECTRUM
##VAR_NAME=  FREQUENCY,     SPECTRUM/REAL,   SPECTRUM/IMAG
##SYMBOL=    X,             R,               I
##VAR_TYPE=  INDEPENDENT,   DEPENDENT,       DEPENDENT
##VAR_FORM=  AFFN,          ASDF,            ASDF
##VAR_DIM=   32768,         32768,           32768
##UNITS=     HZ,            ARBITRARY UNITS, ARBITRARY UNITS
##FACTOR=    0.157963299565203, 1,           1
##FIRST=     4129.05339978095, 0,            0
##LAST=      -1046.93003707206, 0,           0
##MIN=       -1046.93003707206, -396661,     0
##MAX=       4129.05339978095, 427813413,    0
$$ Real data points
##PAGE= N=1
##DATA TABLE= (X++(R..R)), XYDATA
$$ [...]
17995A615j2096J9412n1327k0941L1751Q209L6399n56k4779O346l3125k1838K8016
17982c2914K1627O113R545K252J7322J0481L2564p4437J6867N8070o99O1659L7541
17969A65991O5722p209m1670K9713k2328k645j3360J4138M1428j5109M79j5862
17957A99288m6255K4083k9197o8169n0358O83n1247n2452M6211O3321r61n4748
17945a9801m3104m31N5077k7771l3478l5241P3572o9801j3992O2991M2871J0592
17933A484N0733J4907K2157p574m8837K3014N9785l0108O5519k1329l0413J9789
17921A19127L7996N962j785J5145l1045K5567K9146n0862l9979k1459K2682k1726
17909H8769n1047n0561M763k4122J5248J8044Q80K5816Q0863N9581M8529J6207
$$ y = [1615, -10481, 8931, -42396, -63337, -31586, -23377, 13022, 12466, -12313, -5967, -39092, -60930, -32914, -11287, -5174, 4371, 6623, 23945, 34426, 66990, -7447, 9420, 67490, 66791, 128450, 165991, 231713, 224504, 182834, 212547, 190219, 187574, 174214, 188352, 229780, 214671, 215150, 199288, 153033, 177116, 147919, 79750, 29392, 30075, -21172, -73624, -27413, 35908, 34947, -19801, -62905, -63336, -8259, -36030, -69508, -104749, -31177, -100978, -114970, -51979, -9108, 1484, 52217, 67124, 89281, 81707, 32870, 55884, 115669, 85561, 151080, 129751, 99338, 119127, 157123, 163085, 161300, 176445, 145400, 170967, 200113, 149251, 109272, 87813, 110495, 88769, 37722, -12839, -8076, -32198, -16950, 1094, 1974, 27790, 108653, 168234, 216763, 232970]
17897B32970k5230k3118m6125M9231J4192l8320m3086r3334k8810j5418M6870
17886B9822j1077o5011j926j2784o384l7775K678o308M3626K7723J2985J7863
17874f568p7561J8962L8416Q883q8949r1378O3933J2584K2232L0680P3995R575
17862A4804K5509K1681m1594j10471J4574O8474N1250k2622k2780l1748l2326
17851f5249J9185Q6517l7086p6808q22L0883L1799k2214J7232Q3085K1037L230
17839I0789K1470o8487k1709M3950K2486m4656j2944K8366J1605P0101J78653
17828C19624J79166O3890L4616N9835K2560J9508m3400n6438n5336M326n4457
17817D93894n8364r9925q5759r4021j47125k3121M8710N1659L0499J1866K9225
$$ y = [232970, 207740, 184622, 138497, 187728, 201920, 163600, 120514, 27180, -1630, -17048, 29822, 18745, -46266, -48192, -60976, -67360, -105135, -102457, -108765, -65139, -37416, -24431, -6568, -84129, -65167, -26751, -17868, -106817, -198195, -134262, -121678, -99446, -68766, 5229, 14804, 40313, 61994, 20400, -90071, -75497, -7023, 44227, 21605, -1175, -32923, -65249, -46064, 40453, 3367, -73441, -74263, -43380, -11581, -33795, -16563, 66522, 87559, 90789, 112259, 43772, 22063, 66013, 88499, 43843, 30899, 59265, 70870, 140971, 319624, 498790, 562680, 597296, 657131, 679691, 699199, 655799, 599361, 544025, 548351, 493894, 435530, 335605, 249846, 155825, 8700, -14421, 34289, 85948, 116447, 128313, 157538]
17806A57538J143n5383j654p8310m8665L417N0978R0299K7390j5381j6707P586
17794A22251j6029j14895J2360q533L6141K6988n7729p6928n8272O1198N7808
17783a5640l8852l2972m6133J3170j1045M7316o72k4658Q4914j6305m0215Q1335
17771B43K0080n4352m6969M4372J1535K4688M8310n7941m1774J7483j2141J2673
17759c3793k9568j5877K2543L3412l3227J4177J7577k2005M0379O795K4144L3069
17747E7626K8707p4974j7004n0432Q47N7741p2679q5644M8269N3393J3956l81
17735d0575N5042J10o2153k6205m5497J7049P6731K8512j6374J043J0506l5407
17723c7218n5779J358p589N7005M3537L9148l8495n8174k2046K3196N1300j6012
$$ y = [157538, 158681, 103298, 101644, 23334, -25331, -21914, 29064, 119363, 146753, 131372, 114665, 122251, 106222, -8673, 3687, -4846, 31295, 58283, 554, -76374, -134646, -73448, -15640, -54492, -87464, -133597, -120427, -131472, -84156, -84828, -109486, -24572, -40877, -81092, 243, 20323, -34029, -80998, -36626, -25091, -403, 47907, -10034, -51808, -34325, -46466, -33793, -63361, -79238, -56695, -23283, -56510, -42333, -24756, -46761, -6382, 413, 24557, 57626, 86333, 11359, -5645, -56077, -55230, 2511, -70168, -155812, -107543, -54150, -40194, -40575, 14467, 14577, -47576, -73781, -119278, -102229, -25498, 3014, -13360, -12317, -1811, -37218, -92997, -91639, -99228, -42223, 1314, 40462, 1967, -56207, -78253, -55057, -3757, -19769]
17711a9769n9645k2793l307O1178k645K3188k0817l2577K7075M1235J9581m0630
17699b9926j0310J158j4936j3635P7385L725k7996m7076j5924m36n990N4053O6533
17686C6625l489K9108M8569K3299r7606m7053j9332k0780K2846M2082k3935K9531
17674A9865m3473K170N2737l0109K876j7341j1983m5695j0277L1777N1165L2133
17662C3845l2872l0697j0640Q4713l2930N266L5247n9375l1082q562M756J7207
17650b5124n3064p1703J4514L9028K5457K428m625j3171l5858m5276K4517M6480
17638i6397k4542k2485K3944P5976m2091k7486L2771Q9940J6651o5424P0288K8716
17626E9861j09883o1890L5212P2285J3077J765L8185j8249m7650K7727R895k2566
$$ y = [-19769, -79414, -102207, -105514, -44336, -46981, -23793, -44610, -77187, -50112, -8877, 10704, -29926, -40236, -39078, -54014, -67649, 9736, 13461, -14535, -61611, -77535, -77971, -83961, -29908, 36625, 33136, 62244, 110813, 134112, 36506, -10547, -29879, -50659, -27813, 14269, -9666, 19865, -23608, -21438, 31299, 1190, 4066, -13275, -25258, -70953, -81230, -49453, 1712, 33845, 973, -29724, -40364, 44349, 11419, 16685, 51932, -7443, -38525, -47087, -42331, -25124, -78188, -149891, -135377, -96349, -70892, -68464, -73089, -86260, -122118, -167394, -142877, -96397, -120939, -143424, -119480, -43504, -85595, -113081, -80310, 9630, 26281, -39143, 31145, 59861, -50022, -111912, -76700, -4415, 8662, 10427, 48612, 30363, -17287, 10440, 20335, -2231]
17614b231j6040j9985J7284j5913o256O0497K2219k1693m3816k2594j8296k3644
17602i0468J1573L9681K110p7560j9845N5386P0637M1905m6328k7841N7503P020
17590B3773L1654K725J4717n7048o7715j6450o6636n2438K3379L2518N5788Q732
17578f7001M1178l0070K0113N1638j9298m7618L4975l8998k6947N492j1903p5401
17566a63840M4498K5360L8202N1584N5583P4433J7732r945k2871m0927j11549
17555d1740j2483N73L815J0415l2144K4326N3312o622J0216K1382M9732J1896
17543I2678m6369j7954R6q7404m4136J02038J9984j0364m6653m4481J6419K9650
17531c6496M0416p9258p4408J4070j745j1992O2274M130J0514K8552L1424Q6547
$$ y = [-2231, -18271, -38256, -20972, -36885, -43141, 17356, 39575, 17882, -25934, -48528, -66824, -90468, -78895, -39214, -37104, -114664, -134509, -79123, -8486, 33419, -12909, -40750, 16753, 23773, 55427, 58152, 72869, 15821, -51894, -68344, -134980, -187418, -164039, -131521, -75733, -67001, -25823, -55893, -35780, 15858, -3440, -51058, -16083, -55081, -82028, -76536, -88439, -163840, -119342, -93982, -55780, -4196, 51387, 125820, 143552, 133607, 110736, 69809, -41740, -54223, -53650, -49835, -39420, -71564, -47238, 6074, -548, 9668, 31050, 80782, 92678, 46309, 28355, 28451, -58953, -103089, -1051, 18933, 8569, -38084, -82565, -66146, -36496, 3920, -75338, -149746, -135676, -137421, -149413, -87139, -83009, -72495, -43943, -12519, 74028]
17519G4028k1595m2732J0527L809p8607N7721K0293J9468L6332L1698P0398k5538
17507A55802o6943o765k2995l0470P1710j3862o9608n9264M8677k8j9361j8424
17495c1531L5229L1148j4785l4684J2684J3491m3736j8962P0008O2787j5850m6777
17483A9022J8710m0848j4891m0919R285J22647Q3574j8820j7647J2932j7092p3365
17471D2588N884M6544L1354n5881q2635n1811j1600M0210K7172N7483M0855k0072
17459G0091k8320l699p173p562n2774j2789J0991o141l4887Q199P5989J6392K3860
17446E2177L6942j184m6139P302J1593r57J2966j5067k5916J3952L5904o5228
17434A6345r2539l5221J8669Q0532N059j2283m9068M6448J4168J7508j0158k8829
$$ y = [74028, 52433, 9701, 20228, 24037, -54570, 3151, 23444, 42912, 79244, 110942, 181340, 155802, 88859, 82094, 59099, 28629, 100339, 86477, 16869, -42395, 6282, 6254, -13107, -31531, 3698, 34846, 20061, -14623, -1939, 11552, -32184, -51146, 18862, 81649, 65799, 19022, 37732, -3116, -18007, -58926, -49641, 73006, 156580, 137760, 120113, 133045, 115953, 42588, 48472, 95016, 126370, 70489, -12146, -63957, -75557, -35347, -8175, 49308, 90163, 70091, 41771, 38072, 30899, 23337, -29437, -42226, -31235, -37376, -72263, -64064, 11925, 28317, 52177, 89119, 87935, 41796, 49098, 60691, 59734, 72700, 57633, 31717, 45669, 81573, 16345, -76194, -111415, -92746, -12214, -7155, -19438, -68506, -22058, -7890, 9618, -540, -29369]
17422b9369j8856n315K5611J0342k1098n1101M7060N6382j3241m9628n7017p881
17410a14111Q7700K6554l3810J6564J29136L4576l5768O925o346M721m3249M4402
17398A17294L6818l3733j4872j4961j5641J9039k9189m6324k7164L1088k2394
17387c9k4735J2701J7159J2958M9957N6128j1703R542L4278O551L7533P3858M0396
17374C14584J1477m5569k2061k9345L3321P897L7990l6911k8746l9676o2280M9828
17362A90509Q294l5091o3379k1255O7751j0514P489L1681J8970p544n7183P0689
17350B00417Q5390j4215n9582k7515n281l8765M1626J6563k8614Q702l1403o092
17338A41231r1604K7424P1015J9284L6774j0386M783J4612J5562r6539o9444K2703
$$ y = [-29369, -48225, -53540, -27929, -17587, -38685, -89786, -42726, 13656, 415, -49213, -106230, -114111, -26411, 143, -33667, -17103, 112033, 146609, 110841, 117766, 111420, 116141, 72892, 117294, 154112, 120379, 105507, 90546, 74905, 93944, 64755, 18431, -8733, 22355, -39, -24774, -12073, 5086, 18044, 68001, 124129, 112426, 121968, 156246, 162797, 200330, 274188, 314584, 326061, 280492, 258431, 229086, 262407, 270304, 308294, 271383, 242637, 202961, 140681, 190509, 198803, 163712, 100333, 79078, 146829, 136315, 143804, 175485, 194455, 186911, 129728, 200417, 285807, 271592, 212010, 184495, 179214, 140449, 182075, 198638, 170024, 178726, 147323, 141231, 49627, 77051, 148066, 167350, 204124, 193738, 198521, 213133, 228695, 132156, 62712, 85415]
17326H5415Q9483O5675J5063N1623k7523K773N0685l580m0849l2109K1034J4833
17314B92523j8022O2255K8347L8751o1783m0325O3710O3895L286J7898j7030L2745
17302D66250K2061k3468j0225m0619l005J8308L7270R3029Q4056n642P4505Q4996
17290G97516L128P6515L2439L9593N1413J11656J26204J33479J49143J27896J72228
17279A821210K35280K45988L06601K84651K48358K54479L09906M36513N01839
17270D644825L91705M21386O31041P96187R45829J299120J951503L030371M653985
17261A8765952P256879J1036720J4324648J4830608J4856021J9666751K6322807
17254A27060386K0368248L984964j302325L509051N35740j4484916k2808710k2326194
$$ y = [85415, 174898, 240573, 255636, 307259, 279736, 282509, 333194, 329614, 288765, 256656, 277690, 292523, 274501, 336756, 365103, 403854, 342071, 301746, 365456, 429351, 432637, 450535, 433505, 466250, 488311, 464843, 454618, 413999, 410994, 429302, 466572, 559601, 643657, 638015, 712520, 797516, 800644, 877159, 909598, 949191, 1000604, 1112260, 1238464, 1371943, 1521086, 1648982, 1821210, 2056490, 2302478, 2609079, 2893730, 3142088, 3396567, 3706473, 4142986, 4644825, 5036530, 5457916, 6088957, 6885144, 7830973, 9130093, 11081596, 14111967, 18765952, 26022831, 37059551, 51384199, 66214807, 81070828, 100737579, 127060386, 147428634, 151413598, 150111273, 153620324, 154156064, 139671148, 116862438, 94536244]
17246I4536244j9787131j7643949j5038453j1645444q268969n545127l721614
17239A2885557k572992j826543j319728q84650o74073o32059n78669m31712l19384
17230C645747k86928k67867l11491l02980j97594j89583k46845k98297k64970
17221A279192k38302j61079j13853p3048l6644n2070n0937l4733o2534O473j1923
17210D50542q700K9345j7903l9544m0386l3423N4634m7551j28153j0439M5313
17199B53735J1665J0918q308o2373k2257N8486Q5816K704q9748j09447O52Q2716
17187B14559Q7724m4719r3933K1418N8286l589q3098q3175l8340p8482J9611R480
17175a4258J0351M7507J47706N8405k7780j45532l5551R4989J2758j14938m3975
$$ y = [94536244, 74749113, 57105164, 42066711, 30421267, 22152298, 16607171, 12885557, 10312565, 8486022, 7166294, 6281644, 5607571, 4975512, 4396843, 3965131, 3645747, 3358819, 3090952, 2779461, 2476481, 2278887, 2089304, 1842459, 1544162, 1279192, 1040890, 879811, 765958, 692910, 656266, 604196, 553259, 518526, 455992, 462465, 450542, 441842, 471187, 453284, 413740, 373354, 339931, 394565, 347014, 218861, 208422, 253735, 265400, 276318, 268010, 205637, 183380, 241866, 327682, 330386, 240638, 131191, 131843, 214559, 302283, 257564, 163631, 185049, 243335, 239746, 156648, 73473, 35133, -43349, -23738, -14258, -3907, 43600, 191306, 249711, 221931, 76399, 40848, 135837, 148595, 33657, -10318]
17164a0318L0173J2453n5258r228J13322J0557o8625m1445Q793k7589L0000R57
17152f208L077n0129R250j1128m9701o7952J2503J0658J5416K0562J4604k9407
17140a28455l1650k0996J6661M5636m09o5026r6437k8238L3695J2097K5731J4369
17128b23022m4433J5010M8009J5037N7726m1729K8622l4326K2556N553J5505L6556
17116i8936N7425O1967l2832L9284k7887o0018K4730J0414n4452N1011J4465m7529
17104f2358o5268j1345o881m6225M607O0285P6008L3828l4017m5998P6115O6645
17092D5396m836Q086n7884J9441J6867J1367L7938L2608k6460m4885l0676l3854
17080b6892r47l0190J408k9544p94K2477K0853l4095o2010l1720o773M950L7816
$$ y = [-10318, 19855, 32308, -22950, -32178, 81144, 91701, 23076, -18369, -9576, -37165, -7165, -6208, -3131, -53260, -44010, -55138, -104839, -172791, -160288, -149630, -134214, -113652, -99048, -128455, -160105, -181101, -164440, -118804, -119213, -184239, -280676, -308914, -275219, -263122, -237391, -223022, -267455, -252445, -204436, -189399, -131673, -173402, -144780, -179106, -156550, -150997, -135492, -98936, -41511, 20456, -12376, 26908, -979, -60997, -36267, -25853, -80305, -29294, -14829, -62358, -127626, -138971, -145852, -192077, -187470, -127185, -51177, -17349, -51366, -97364, -21249, 45396, 40560, 48646, -9238, 10203, 27070, 38437, 76375, 108983, 82523, 37638, 6962, -26892, -27839, -58029, -56621, -86165, -86959, -64482, -43629, -77724, -139734, -171454, -178227, -173277, -135461]
17067a35461K1850Q3570O8457l5617o0396P3607j6235j1121n1565J3954Q222l35
17055d1070j2189m7931J084k4761K9237K7888P784l1128j4946k7964j4004j5212
17043a63212K4544N5590N4357l080o5021P793M7932L1191k7906m4035n0422j7448
17031a49717P8870J401j4239Q217J15281K1138p7740k9265m0457o794J7193k5668
17019a01780M617L0153k2437l4866k7831l137j7400K6411L7577j3881O0538M3557
17007a8479J0913j2445j6384r7390k5375L3557O9098p212j5452K0493L9317O914
16995a2445l9507k956o049p394K9205O335j1452n2019o790n2239k324J4587p0651
16982b13699J1536R3303K0746K9661P442o4393k0050L5991N2704J5837l9278J2770
$$ y = [-135461, -113611, -30041, 38416, 2799, -57597, 16010, -225, -11346, -62911, -48957, -40735, -41070, -53259, -101190, -100106, -124867, -95630, -67742, -59958, -91086, -106032, -133996, -148000, -163212, -138668, -83078, -28721, -31801, -96822, -89029, -41097, -9906, -37812, -81847, -132269, -149717, -70847, -69446, -83685, -75468, 39813, 60951, -16789, -46054, -86511, -93305, -76112, -101780, -97163, -67010, -89447, -124313, -152144, -155281, -172681, -146270, -108693, -122574, -62036, -18479, -7566, -20011, -36395, -133785, -159160, -125603, -56505, -63717, -79169, -58676, -19359, -12445, -51952, -54908, -60957, -68351, -39146, -32811, -44263, -96282, -103072, -155311, -157635, -143048, -213699, -202163, -108860, -88114, -58453, -51011, -115404, -135454, -99463, -46759, -30922, -70200, -57430]
16970e7430k4610j6053M3102k2635k2920K2330l9641k2498P2081N8739j7240j7201
16958d3976l1886k2578K461J1999J02538k7384j51374m8192O1808J35772K7435
16947A6623q1335o6697K2858K2838O124k974k0265K1811J8283K5426k5174l3340
16935i5822m3829j731L1883M8080O746J7111J03263J11587o9588o3142m6471l9284
16923d1197K2921K9912l5276M3283R1684j1789r202j3840l1927K4160k7420p5622
16911c4313J4108K058J8161K4141l8499q559j2723p733j7259K7553M0618L2251
16899C9804k1812K5526J201p2397j1743n9326j0122O6048J2099N7352L8558M1891
16887A07079J4464p0960k5121k1244j1781l0698k6289J57062k5732l2880K3310
$$ y = [-57430, -82040, -98093, -54991, -77626, -100546, -78216, -117857, -140355, -68274, -9535, -26775, -43976, -75862, -98440, -95979, -83980, 18558, -8826, -160200, -208392, -146584, -10812, 16623, -64712, -131409, -108551, -85713, -79589, -82563, -102828, -81017, -62734, -37308, -62482, -95822, -139651, -141382, -109499, -61419, -54673, -37562, 65701, 177288, 107700, 44558, -1913, -41197, -18276, 11636, -23640, 19643, 111327, 99538, 90336, 76496, 44569, 68729, 41309, -34313, -20205, -18147, 14, 24155, -14344, -22903, -35626, -43359, -60618, -33065, 7553, 39804, 17992, 43518, 44719, -27678, -39421, -98747, -108869, -42821, -30722, 26630, 65188, 107079, 121543, 50583, 25462, 4218, -7563, -38261, -64550, 92512, 66780, 33900, 57210]
16876E7210j06036n1483J3333l4096N5891L5296n2590p2962k2593l8108R9407
16865a16731P5195L5901l7765N975M1151j076N278M6799M971m3638l1698p53k1590
16852c7981L6657K902J7016j4146p5477k2334k7559L5881P4016j0547M3478m9813
16840b7907j1535m5271J2687k5178L1430J7333m7980L8893m146J1415L8853K7290
16828A5884K656k5667k8800k0811m2957m9890J2858o141O07j3859p6981L593M7288
16815a82220M9729N80K5880Q131m7249k4360P4670P8134m6246l655j1889q7682
16803a66177o3647J468N2423N5880O1725O8934K712O4106j583j6931m7814M4637
16791E5733M251n4484n2115o4768N3393k2028q5404J6038R173k9934l567p24j7210
$$ y = [57210, -48826, -100309, -86976, -121072, -65181, -29885, -82475, -155437, -178030, -216138, -116731, -41536, -5635, -43400, -37425, 3726, 2650, 7928, 54727, 59698, 16060, -15638, -16391, -37981, -1324, 1578, 18594, 4448, -71029, -93363, -120922, -85041, -11025, -21572, 21906, -27907, -39442, -84713, -72026, -97204, -65774, -48441, -96421, -57528, -61674, -50259, -11406, 15884, 18540, -7127, -35927, -56738, -99695, -149585, -136727, -142868, -142261, -156120, -233101, -229508, -182220, -132491, -131911, -106031, -97900, -145149, -169509, -94839, -16705, -62951, -66606, -78495, -166177, -229824, -228356, -175933, -120053, -58328, 10606, 13318, 77424, 75841, 58910, 11096, 55733, 59984, 5500, -46615, -111383, -57990, -80018, -165422, -149384, -140211, -170145, -173712, -174436, -191646]
16778a91646l0997N6541M6701J3800o3591J1704K8961r255l092L4181J2948l2430
16766a26175j3757o531J472N1551k3180l8167N0471N5381Q1200j5072j14981k4836
16754a22624m0984l6452M8356L3056L1214R7779L2075q449O3769J5646q3065p0803
16742d0482o1677j362K2288n8493j8282L5341R4403P574l5814K0884M6418J9572
16730C0370m3362p998M1412J2135j4215l6613K692L5535K2232J8118n5421n6936
16718e2051K5248j0802j7013N1859N7939j4559r2194p5084k5020M1734O1140J1215
16706c7588k5156m2210k2085k7426k346q8q315K495N0297M7183P7849p307q5851
16693h0548K5972K9294k8428k1599m3884L0574K6506J16687K9412k988K5324Q3595
$$ y = [-191646, -222643, -166102, -119401, -105601, -169192, -157488, -128527, -137782, -140874, -106693, -93745, -126175, -139932, -146463, -144991, -93440, -116620, -154787, -104316, -48935, 32265, 17193, -97788, -122624, -163608, -200060, -151704, -118648, -87434, 10345, 42420, 33971, 97740, 113386, 30321, -40482, -102159, -103521, -81233, -139726, -158008, -122667, -28264, -20690, -56504, -35620, 10798, 30370, -12992, -20990, 20422, 32557, 18342, -18271, -15579, 19956, 42188, 60306, 4885, -52051, -26803, -37605, -54618, -2759, 55180, 40621, -51573, -126657, -151677, -109943, -48803, -37588, -62744, -104954, -127039, -154465, -156811, -156899, -165214, -162719, -112422, -65239, 12610, 5303, -80548, -54576, -25282, -53710, -75309, -119193, -88619, -62113, 54574, 83986, 80998, 106322, 189917]
16681A89917J37775J87221P8522N6653j3929k7601J5096k2032O081k831r9725
16670E05147j47922r3479j8539l1215K2238o566l7275l8386j3504o832j9995Q715
16658A22387j5594r219k0952n8281l6937J1667j8188o0164j6172K1629L4711L4391
16646a0722n1073J3040n166k8677L1198j1997K4243L3481K3337L5762L3081o5618
16634B0889k7647k9356K0254L355K310K5225P6609K5638p6733l8571p4312J0015
16622f2324O7275J8842m5752Q278l0582k9095M1130j0855m4414o8337M1186J3679
16610a00969M1089o484k4320k8231q257j0318J8263k8328k541L9188K0242M9039
16598d1627J6640J1392O17N5514P149j04606j23179L7442L8955P981n2942k3227
$$ y = [189917, 327692, 514913, 593435, 650088, 636159, 608558, 623654, 601622, 607703, 604872, 505147, 357225, 263746, 245207, 213992, 236230, 229664, 192389, 154003, 140499, 133667, 113672, 122387, 106793, 97574, 76622, 18341, -18596, -6929, -25117, -85281, -101453, -79824, -45113, -10722, -61795, -48755, -53921, -82598, -51400, -63397, -39154, -5673, 17664, 53426, 86507, 20889, -6758, -36114, -15860, -12505, -10195, 15030, 91639, 117277, 40544, 1973, -72339, -62324, 4951, 23793, -21959, -13681, -44263, -73358, -32228, -43083, -87497, -155834, -114648, -100969, -59880, -66364, -90684, -118915, -127172, -137490, -119227, -147555, -150096, -110908, -90666, -41627, -24987, -13595, -12978, 42536, 49685, -54921, -178100, -140658, -101703, -93722, -146664, -169891]
16586a69891K4526Q3148N2868k2082l0248j6317R3042k1579o3590j4054m7315
16575a31492p7051L3630j0985O77j0648L7025J08443J3027n4785o6952k1072K4523
16563a55660J38654o5225p4619J2809M1947MJ4632N0694K9262J3602j7008l0814
16551d1722N1220M120Q254M4665J6573o312R232k5438j5162K0968J4585L1565
16539A12548n3680r7506j6007n4684k2776J2594j0454j4139M6795J2903N1023
16528c3383M4298k6108m1502m6294K8784J3693o8966j2155N1893K4147J7322k2814
16516g1085m9007O2353R0298L1472k4604o782n0915J8093o2577r3568p791R5187
16504f8926M5974K2366L774J1030l7259j8462n6995k136O3200Q78p4426k4226
$$ y = [-169891, -145365, -62217, -9349, -31431, -61679, -77996, 15046, -6533, -70123, -84177, -131492, -208543, -174913, -185898, -185221, -195869, -158844, -50401, -37374, -92159, -159111, -180183, -155660, -17006, -82231, -156850, -144041, -102094, -102090, -87458, -36764, -7502, 6100, -10908, -41722, 9498, 13618, 21872, 66537, 83110, 76798, 86030, 60592, 45430, 66398, 80983, 112548, 58868, -38638, -54645, -109329, -132105, -119511, -129965, -144104, -97309, -84406, -33383, 10915, -15193, -56695, -102989, -74205, -60512, -129478, -141633, -89740, -65593, -48271, -71085, -120092, -57739, 32559, 64031, 39427, 32645, -18270, -177, -62754, -156322, -164113, -68926, -22952, -586, 3188, 14218, -23041, -41503, -98498, -100634, -37434, -36556, -110982, -135208]
16492a35208l5986J8963K2131q144M3230J04070M3090m9698j3646N603k1107l4930
16480f1632m4653k4263N6699O6242J4316k3488m7736l273N8411J3636J5935O7433
16468H7627k9346M122p0633j9470L6204J7819j2650K2357j755M2571J9866J530
16456I8242l1743p6505j4458N3425K4550l8076p9639k6867Q2114K3652l8923J9812
16444d416l1177k9292P7802L9189N7238L4282k7163p2075o3412k2451N428j52
16432c6199K5033k4912r0249l9699R89J07547L4153k9653l5747k8235K7344M3880
16420d5748n457j4302Q477P1296k1371o9178K8117J8088J9595K1973k227l0864
16408b1601k5176N643q555p9471O0N4354J6288k5660Q22K2247j7540l6174j2623
$$ y = [-135208, -171194, -152231, -130100, -138244, -95014, 9056, 52146, 2448, -11198, -5595, -26702, -61632, -106285, -130548, -73849, -7607, 6709, -16779, -64515, -67788, -9377, 4259, 20194, 87627, 58281, 62403, -8230, -27700, 8504, 26323, 13673, 36030, 34275, 76846, 96712, 98242, 66499, -10006, -24464, 28961, 53511, 15435, -64204, -91071, -8957, 14695, -24228, -4416, -35593, -64885, 12917, 52106, 109344, 143626, 116463, 44388, -19024, -41475, -36047, -36199, -11166, -36078, -126327, -166026, -165037, -57490, -23337, -52990, -88737, -116972, -89628, -45748, -51205, -65507, -57030, 14266, -7105, -76283, -48166, -30078, -10483, 11490, 9263, -21601, -46777, -41134, -49689, -129160, -129100, -74746, -58458, -84118, -83296, -61049, -78589, -114763, -127386]
16395a27386L4278L454L1134M5359L8452o0640P45K2830o598q0046J8731j7572
16383i7259r5969K1142k623O1126j9839l0107L5151J4935R4019l4398j0769m1563
16371a06154m4721l1822L7865L6088N4991K520q552o849l8501m2293K0597N7557
16359f9274r808K5061K5942N4707K1004L9993j0493j699m1021L7745J8685j4849
16347G5993o0787k3149l8237m2897O199M285m3654M3894K4211r722N2900N2948
16335D1984m2503o4505m7110J9779J5892l4776q730P5842K3201j0175k9730l6754
16323i7585N0934j0372n8428l1926P7528l5826m1889j9822N2324M3432O0930L5405
16311B4705l2120N27j7970o52L2430l8492j2898o310k84K3735K0977r542l1695
$$ y = [-127386, -93108, -89654, -58520, -13161, 25291, -35349, -34604, -11774, -18372, -98418, -79687, -97259, -193228, -172086, -174709, -113583, -133422, -163529, -128378, -113443, -19424, -53822, -64591, -106154, -150875, -182697, -144832, -108744, -53753, -51233, -59785, -66634, -105135, -147428, -126831, -69274, -79082, -54021, -28079, 26628, 47632, 87625, 77132, 75433, 34412, 72157, 90842, 75993, 15206, -7943, -46180, -89077, -82878, -78593, -122247, -78353, -54142, -63864, -10964, 41984, -519, -65024, -112134, -92355, -76463, -111239, -119969, -44127, -20926, -31101, -60831, -97585, -46651, -57023, -115451, -147377, -69849, -105675, -147564, -167386, -115062, -71630, -10700, 24705, -7415, -6888, -24858, -25510, 6920, -31572, -44470, -50780, -51064, -27329, -6352, -15894, -47589]
16298d7589k116L8710J4660J9247m1559o1307l6103j4379M6109m4227L3527J903
16286i3124o031J2378P2514J3370o3675p418K5959L3990K3727m7565m1473k1711
16274i9059P6224L7458k8485l9728l4931P383O8521J2873k0796m8558J2880M1379
16262a4839J3010l4418o5291p6712n6330M4966J23793O4056r828J8115o788k1864
16250b2130l6871Q941j3555o2765l9664K2759M1210K6685J00428J6891l8150m6949
16238d3170m4485J8190o7430O180l9409k4826Q9552P7366M1574l8704j8371J9504
16226b4029k3900q726m5702J251N8705k4898j9087K0922R779J1586Q274J9107
16214a6718M6742j28j24663J3516M6519j1967j4128J7613N8300N6320o9634j0584
$$ y = [-47589, -49705, -10995, 3665, 22912, -18647, -79954, -116057, -130436, -84327, -128554, -95027, -93124, -99155, -86777, -14263, -893, -64568, -71986, -46027, -12037, 11690, -35875, -77348, -99059, -22835, 14623, -13862, -53590, -88521, -81138, -12617, 256, -20540, -69098, -56218, -14839, -1829, -36247, -101538, -178250, -234580, -189614, -65821, -1765, -11593, 6522, -266, -22130, -59001, -50060, -63615, -126380, -166044, -143285, -102075, -75390, 25038, 41929, 3779, -43170, -87655, -69465, -136895, -130715, -170124, -194950, -105398, -28032, 13542, -25162, -43533, -24029, -47929, -56655, -102357, -101106, -42401, -67299, -86386, -65464, -55685, -44099, -35825, -16718, 30024, 29896, -94767, -81251, -34732, -46699, -60827, -43214, 15086, 71406, 1772, -8812]
16202h812M1008K2560l6363l8114Q7559K8452R286o1864j00179l6823L8290j5530
16190g0530m8642p8168Q4k2894J08415P0976m272K9880J2519n1199m2528n8144
16178a54503n4150L3607R7237O6456L0895k7928k3393l3178q8644M6083O2971
16167d4547j3127m6390m905j410L5464j3918k586j3411j2794j6169P3540K5405
16155c4848o0410m0129M5944Q2992j3254n3010k8595J0909N5554P0202k60o9846
16143c4751l4400m606r052N0148l8163k582M9440l8680l1545k9188J4356O0346
16131d8677k3585j8232k402L173O112K6917N2797L8884o312p3319j1462n1813
16119a07919P320R082J4383J6265m5485m8528L2692R6844L0989k2375k1184N1930
$$ y = [-8812, 32196, 54756, 18393, -19721, 67838, 96290, 105576, 43712, -56467, -93290, -55000, -70530, -119172, -197340, -197256, -220150, -111735, -40759, -45031, -15151, -2632, -53831, -96359, -154503, -208653, -175046, -77809, -11353, 19542, -8386, -31779, -64957, -153601, -107518, -44547, -57674, -104064, -108969, -110379, -74915, -88833, -91419, -104830, -117624, -133793, -60253, -34848, -95258, -135387, -89443, -6451, -19705, -72715, -101310, -90401, -34847, 35355, 35095, -34751, -69151, -73757, -82809, -32661, -70824, -73406, -23966, -62646, -94191, -123379, -109023, -48677, -72262, -90494, -92896, -89723, -83611, -56694, -3897, 34987, 28675, -44644, -56106, -107919, -100599, -91517, -77134, -60869, -106354, -154882, -122190, -25346, 5643, -16732, -37916, 14014]
16107A4014K5829l0754K2051o503L9692j8306j01934p2972o416Q7254J0511K7511
16095a0023l358l9518N001M2950N8395L3558j2609r413n2704p6242M4984P5847
16083E6868M0065l50j01604l3845r9111J014J9223L2824K4691p227L3547R260
16071b4645j734K7860M3591J7760m8455p87K7932m2804m239J6179J5567Q139l183
16058C1181M8547j1328L8067k3339m8355l3961k37L6031k3426n8648N832o487
16046d6123P801K0246K9235l2414k9851m7325K5597k3547J3755O3280q461M6916
16034A9109l3391l9445l8548O9352J6678J0850m9657l290j8862L650L6078L865
16022b3611k6317J2279k4195m8688N414j5154k0734m90O925K0476L6700K0997
$$ y = [14014, 39843, 9089, 31140, 24637, 64329, 46023, -55911, -128883, -135299, -48045, -37534, -10023, -13381, -52899, -47898, -4948, 53447, 87005, 74396, 64983, 12279, -63963, -18979, 56868, 96933, 96583, -5021, -38866, -137977, -136963, -117740, -84916, -60225, -67452, -33905, -24645, -26379, 1481, 45072, 62832, 14377, 13590, 41522, -1282, -5521, 10658, 26225, 34364, 31181, 79728, 68400, 106467, 83128, 34773, 812, 575, 36606, 13180, -45468, -39636, -46123, -38322, -18076, 11159, -21255, -51106, -98431, -72834, -96381, -82626, -19346, -27807, 19109, -14282, -53727, -92275, -22923, -6245, 4605, -45052, -48342, -67204, -63554, -27476, -23611, -49928, -37649, -61844, -110532, -105118, -120272, -141006, -141496, -134571, -114095, -77395, -56398]
16010e6398q7461m5494K3738N1258k5976j970O3081J28997N8689l5739m0588l1491
15998F46j623l8320L0267K7229J3922n6028l2206k2604l7328L8767O8432l3553
15986d2399J5852j0790J0798K9456K4021M7146k5704M930k2468l2873k5403M6101
15974A8667n604m7363k0832o9890l7700k106m474M9356L2369K4503L900J9631
15962c9543m8605L7522O0992L6629l1184k1006n267J58j3967k3036m943K5273
15950b6977j1985N9860r312K587j4238J5963k758k1903o8889k5322o7686j2364
15938a83024N7602O6656O2890j265m4157K0560l3409P258k1934p604Q1927j5490
15926i990r886p162O1034k5697l283N6225j2194m3828j8098o7251o9751N3059
$$ y = [-56398, -143859, -189353, -165615, -114357, -140333, -142303, -79222, 49775, 108464, 72725, 32137, 646, -977, -39297, -9030, 18199, 32121, -23907, -56113, -78717, -116045, -77278, -8846, -42399, -26547, -37337, -26539, 2917, 26938, 74084, 48380, 53310, 30842, -2031, -27434, 18667, 13063, -34300, -55132, -125022, -162722, -164828, -169302, -119946, -87577, -63074, -59174, -39543, -88148, -50626, 10366, 46995, 15811, -5195, -10462, -10304, -24271, -47307, -52250, -26977, -38962, 20898, 11586, 14173, -65, 15898, 13140, -8763, -77652, -102974, -170660, -183024, -125422, -58766, 4124, 2859, -41298, -20738, -54147, -46889, -68823, -76427, 5500, -9990, -19876, -27038, 33996, 8299, 5016, 61241, 49047, 5219, -12879, -80130, -149881, -96822]
15914i6822K102q240j1281K6859N5502m8518M5832P9715j4510o6501j61670Q5615
15902a11917R1549L5694j3943m0715k1150J970M4428N5585M499j3609q9099k5200
15890h1908L98L5163J6661j1188k2966n2050L231L8302k799L8857l8992o5858
15878a43149J4141M8059k2900N9483O8139j8808j7973M282o9725p8370J3067M7594
15866i6160J319J1251R6J6396N4620k1658m6225Q164M7807r032o870k2111l7084
15853i9487l4026L9973K8789q203L4582M8636p399k8689K2267j8778n4985P308
15841g0012N0313M6994Q312j5516o6538K6049K2822k6247m034l3897J0007j5340
15829f7087M125M5392J0042J2395J1841j9690n5415n9714Q320P2034j485n5458
$$ y = [-96822, -94720, -102960, -114241, -87382, -31880, -80398, -34566, 45149, 30639, -35862, -197532, -111917, -20368, 15326, 1383, -39332, -60482, -58512, -14084, 41501, 46000, 32391, -56708, -81908, -81510, -46347, -29686, -40874, -63840, -115890, -112659, -74357, -77156, -38299, -77291, -143149, -129008, -80949, -103849, -44366, 23773, 4965, -13008, -8726, -78451, -156821, -143754, -96160, -94841, -83590, -83494, -67098, -12478, -34136, -80361, -72197, -24390, -33422, -40292, -62403, -99487, -133513, -93540, -64751, -72954, -38372, 10264, 2865, -25824, -3557, -22335, -77320, -70012, -19699, 27295, 35607, 20091, -46447, -20398, 2424, -23823, -27857, -61754, -51747, -67087, -62962, -17570, -7528, 4867, 16708, -2982, -58397, -118111, -109791, -37757, -39242, -94700]
15817i4700k8508K7911l0891o494j3972n8393l0416Q7431O0624L4808m181k9372
15805h6153J2065N0643N044K9255m5180o9194J0766J0440K5455J7481O910K4191
15793h277J0755n8188Q38L94l7025Q05M6457O035o0838L4288J16083l8558m0097
15780b7328m9459M686Q4203O213l642j8528m3131m7583L8505m875k4520L3712
15768e1747K3792J5347J5661P070n1249k4425K4534n334K3236N4298m9671n2316
15756g0804N658m3527o2689L492k1742n1718M5179O2668O163n469J6378L1568
15744h4843O6910J5810j01702k5298N5217l3884O789N7483j8467j2488P052k6468
15732i3889L5243P2363L4040j9300o634K816K0114k5052l1391K9796L8322n0852
$$ y = [-94700, -123208, -95297, -126188, -132682, -146654, -205047, -235463, -148032, -87408, -52600, -56781, -86153, -74088, -23445, -18401, 10854, -34326, -103520, -92754, -82314, -56859, -39378, -32468, -8277, 2478, -55710, -54872, -54478, -91503, -90698, -44241, -38206, -99044, -64756, 51327, 12769, -27328, -76787, -72101, 12102, 18315, 14673, -3855, -46986, -94569, -56064, -60939, -85459, -51747, -27955, -12608, 3053, 10123, -41126, -65551, -41017, -46351, -23115, 31183, -18488, -70804, -65146, -108673, -171362, -167870, -189612, -241330, -196151, -133483, -127320, -132789, -116411, -84843, -17933, -2123, -103825, -129123, -73906, -107790, -101001, -43518, -61985, -74473, -67421, -93889, -58646, 13717, 47757, 28457, 21823, 24639, 44753, 19701, -11690, 18106, 56428, 5576]
15720E576l8520l3509J0449l8390j978N946l603N7914R933k0976m6243m361P9838
15707a7924P7892K9147j1897j9110J4869R656n2017n3162l6606n1153o1993R720
15695a62578O9690L4636L810k4709K6385M4477R5226k7817r5338j257M8408j4657
15683c724o557l099j2703L4594Q7984n2790r0850O462K7452L3566J7255m615n7106
15670b4131j713L3966q768n1139p97n119j83P0031j4143P199K8150k5826n6965
15657d9438P0304O9699n8728j11796P906J4497O9163J382L9876O7753K9265k9365
15645A20518m9465l8063k0262m6485o146j5795k1560r630l496L6075R1195K3314
15633F0200j8234m1068k0342k6837n2623j6441K4228l267m4968N6429P0265n636
$$ y = [5576, -32944, -66453, -56004, -94394, -96372, -90426, -94029, -36115, -26182, -47158, -93401, -97762, -17924, 59968, 89115, 77218, 58108, 72977, 82633, 30616, -22546, -59152, -110305, -172298, -162578, -92888, -58252, -54442, -79151, -52766, -8289, 86937, 59120, -36218, -37475, 10933, -3724, -10281, -13380, -26083, 8511, 96495, 43705, -47145, -40683, -13231, 20335, 37590, 32975, -24131, -25844, 8122, -646, -51785, -52582, -57701, -57884, 12147, -1996, 5203, 33353, 7527, -49438, 20866, 90565, 31837, -79959, -72053, -57556, 11607, 12989, 52865, 120618, 149883, 120518, 71053, 32990, 12728, -33757, -39903, -55698, -77258, -86888, -90384, -54309, 36886, 60200, 41966, 898, -19444, -46281, -98904, -115345, -91117, -94384, -139352, -82923, -12658, -18294]
15621a8294k8259R298J8456J7253Q051L0855M0491m2959q570J9769n2100o4540
15609g0549k7840j7454n540J9726j4571l1198L9141Q3759L6878j8956O8830j0967
15597E1259l4155m5031j4431L8824J791j7856m611o713l8655R045N282L0627K5496
15584H72N2597k5047n1686K6590M0778J1687n8954o6516M189r748K0612K0377
15572c4249k0929O801P6673J7804k392l177o3165n9347K0787O4503K9775J9065
15560E2149m9451m5016L7317l112l5952K9429n0060m2092L5488l0719m7289N7977
15548i1331K1129k5417M9650Q5970j7054l3706J08j266n8165l350K6154N0457
15536C179O1678O600m6437K2624k1679m0895J1685L175p518l1034m0954j4301
$$ y = [-18294, -46553, -37255, -18799, -1546, 6505, 37360, 77851, 34892, 26322, 46091, -6009, -70549, -98389, -115843, -121383, -101657, -116228, -147426, -108285, -24526, 12352, -6604, 62226, 51259, 17104, -27927, -42358, -3534, -1743, -19599, -24210, -30923, -69578, -60533, -55251, -24624, 872, 53469, 28422, -23264, 3326, 44104, 55791, -3163, -69679, -65490, -75238, -54626, -34249, -55178, -48377, 28296, 46100, 43708, 40531, -22634, -81981, -61194, 3309, 33084, 52149, 2698, -42318, -5001, -8113, -44065, -14636, -64696, -106788, -71300, -102019, -149308, -91331, -70202, -95619, -45969, 40001, 22947, -10759, -10651, -11917, -70082, -73432, -47278, 3179, 64857, 71457, 25020, 47644, 25965, -14930, -3245, -70, -7588, -38622, -79576, -93877]
15524i3877K9368l2811Q742L5514j7782N5752L5537K4996K5068p233m5990k6580
15512i296O511n0846n2905O4638J7822q63m1320o1922k9643K7657M8273L5168
15500d6726K3671M6860j0672M096L9280r326M634m1780p9242k0152K9578J09981
15488E0202o4663m9985M4510K8449j5002K9966K7259m0104p8441K0776Q6621J0187
15476D9775l1993j3640k3718J0527m3855m0924M7385M528l3405j4064L1063L3895
15464b4426L2401k8118m8761p5513k1160K9798J8838K583L7866J8484O1519L1983
15452C5494L4253l1550k3875k4236K8543K1574M8223o5579J858N9528l5717l8749
15440I767k1134J4559l6462j4097j5142J580M8959Q2244L3462l7329r7438r7336
$$ y = [-93877, -64509, -97320, -88578, -53064, -70846, -15094, 20443, 45439, 70507, 63274, 17284, -9296, -2785, -53631, -106536, -41898, -24076, -24939, -66259, -128181, -157824, -130167, -81894, -46726, -23055, 23805, 13133, 17229, 56509, 47183, 51817, 10037, -69205, -89357, -59779, 50202, -14461, -64446, -19936, 8513, -6489, 23477, 50736, 10632, -67809, -47033, 39588, 49775, 17782, 4142, -19576, -9049, -52904, -93828, -46443, -41915, -75320, -89384, -58321, -24426, 7975, -20143, -68904, -144417, -165577, -135779, -116941, -114358, -76492, -58008, 3511, 35494, 69747, 38197, 14322, -9914, 18629, 40203, 88426, 22847, 24705, 84233, 48516, 9767, -11367, 3192, -33270, -47367, -62509, -60929, -11970, 70274, 103736, 66407, -31031, -128367]
15428a28367k0436M747P6331K9849K8701Q141l9391K359j1615j4858O7649J9419
15416B2529k1081J4553p7883m3111m16M5016J7413k0559n7928J5241Q6336P5415
15404E5525L656q0748n6792k6844M8880O7404Q0953P4518p2310q5884p9443m7235
15392a18320J1317K0778K6501m8806m8569n895J7318O2340O9153J0042r660P0779
15380E6978L3608m9642l4868K9533l9755r3845J2189M9770k5414l6190J7255m4011
15368a24392j0939j5424M4640P3631j2299k529J4211q615l9399m2573M2101R974
15356g1613P3411q922r857N2310j0650O189k217K286p6362r9160K9041M9990M5268
15343b0286J2622j6361k1616j0822P542l8579m1632o3503J7925K8874K6738L1780
$$ y = [-128367, -148803, -144056, -67725, -37876, -9175, -1034, -40425, -38066, -49681, -64539, 3110, 22529, 1448, 16001, -61882, -104993, -105409, -60393, -42980, -63539, -121467, -106226, -19890, 55525, 59181, -21567, -78359, -105203, -56323, 11081, 92034, 166552, 94242, 8358, -71085, -118320, -107003, -86225, -59724, -108530, -157099, -162994, -145676, -83336, -14183, -4141, -13801, 56978, 90586, 40944, 6076, 35609, -4146, -97991, -85802, -36032, -61446, -97636, -80381, -124392, -135331, -150755, -106115, -32484, -44783, -47312, -33101, -41716, -81115, -123688, -81587, -71613, 1798, -7124, -16981, 35329, 24679, 30868, 28651, 30937, -45425, -144585, -115544, -65554, -20286, -7664, -24025, -45641, -56463, -48921, -87500, -129132, -192635, -174710, -145836, -119098, -87318]
15331h7318j2465M6702J9590J3126M9155m0813p3993j6869L7239J1737N1284m308
15319f933m0458O5843P8965k8571j44271l534O277M124L0641r482L2300O0463
15307D5364q7257m9188K8684j8708J757Q6496K7709m8187q3006k3709M0791L6744
15295d2510l2334o9014L3342N1401J250k6036j6519j4115n5276M9432R5861J5992
15283h526m2249j5967N0673N4241L5936m1630l5922J9850L0259k4406P44O5735
15271H8738j5830k6822l1946N278m6803o0831o825J9205R8970L1811L2429j4584
15259G2790l2655k3141N1594N196p8646q4622K9161J9954L6038N7766J444J75
15247E5054n761k1888j0676N90n8542l3493R9882K8812o6661J9604j1477L3817
$$ y = [-87318, -99783, -53081, -33491, -20365, 28790, -12023, -86016, -102885, -65646, -53909, -2625, -6933, -47391, 18452, 97417, 68846, -75425, -78959, -72682, -68558, -37917, -47399, -15099, 45364, -41893, -91081, -62397, -81105, -79348, 7148, 34857, -13330, -96336, -120045, -79254, -42510, -74844, -143858, -110516, -59115, -57865, -83901, -100420, -114535, -169811, -120379, -24518, -8526, -50775, -66742, -16069, 38172, 74108, 32478, -3444, 16406, 46665, 22259, 23003, 88738, 72908, 46086, 14140, 19418, -27385, -88216, -95041, -75836, 23134, 54945, 87374, 72790, 40135, 16994, 68588, 73784, -4862, -89484, -60323, -40369, -4331, 53435, 54879, 55054, 49293, 27405, 16729, 17319, -41223, -74716, 25166, 53978, -12683, 6921, -4556, 29261]
15235B9261j9453m5203K4436R7550O956J7613N620k7312l0962j00018k4794K1421
15223d4885L2193r950j5132k8802k1506p3189L474O5231Q1021J7484N3526K5635
15211H5100Q220k0218k9374k0795l1166m1545O0800Q934o3360L8220M9808o0342
15199a5718m7288K0475R445K8569K0397L5395N6650k1879k2180J0978m2690m8026
15187a5872m3514L6479N1261j4926l2752K6293K8819j0746K2575L3123J6417j1422
15175H5735l2779l4556o1448l8638p884L2969Q3863N8840o1612N748m0751j2897
15163b3410J9922j9010P224l782n5437q832k3430j699P6491J4963K5977J7509
15151B6486J9946o0924j9271j2644M8197M4646K9679o0484n9483J1548j2044q443
$$ y = [29261, 9808, -35395, -10959, 86591, 93547, 111160, 116780, 89468, 58506, -41512, -66306, -44885, -12692, -22642, -37774, -66576, -88082, -161271, -157797, -92566, -11545, 5939, 59465, 85100, 93320, 73102, 43728, 22933, -8233, -49778, 11022, 19956, -43404, -5184, 44624, -15718, -63006, -42531, -33086, -4517, 15880, 51275, 107925, 86046, 63866, 74844, 32154, -15872, -59386, -22907, 28354, 13428, -19324, 6969, 35788, 25042, 47617, 80740, 97157, 85735, 52956, 18400, -43048, -81686, -89570, -56601, 27262, 86102, 24490, 30238, -10513, -23410, -3488, -22498, -15274, -19056, -74493, -83325, -106755, -108454, -31963, -17000, 8977, 26486, 46432, -14492, -33763, -46407, 1790, 46436, 76115, 15631, -43852, -32304, -44348, -52791]
15139e2791l4664L3818N8055K5414L261L2159N203O783m6864n1324K1218K5687
15127B5955J2764q655l8712l2083k0721K2416O0694O9217N7224L7779r7836j06013
15115a7971j7776j0877m7420k365R796K6454k141k7892m3132J0403M206O0358
15103e8357J02065L0072n7926l9472o7816N8153N5042J6911j6703K6596j8417
15092C0148n9847J4812K890m306K4040l4943l4107K4588r343m0464m660L3841
15080e7351Q0474K1421l9430n5233p514M5295j8824l3491J7946j6173N9790L8424
15068C5334o1840K6664M0544R194M4987o210r8204k4745L8569k314j4098J9309
15056G190J0103Q2085m158r0131o9313n7468O392J9691J9591m280L5884J1200
$$ y = [-52791, -87455, -53637, 4418, 29832, 33093, 65252, 70455, 77238, 30374, -20950, 268, 25955, 38719, 30064, -8648, -40731, -61452, -39036, 21658, 90875, 148099, 185878, 88042, -17971, -35747, -46624, -94044, -96409, -86613, -60159, -62300, -90192, -133324, -122921, -118715, -58357, 43708, 73780, 15854, -23618, -91434, -33281, 21761, 38672, 21969, 48565, 30148, -29699, -14887, -11997, -16303, 7737, -27206, -61313, -36725, -46068, -86532, -91192, -57351, 23123, 44544, 5114, -50119, -57633, -12338, -31162, -64653, -46707, -62880, -3090, 35334, -26506, 158, 40702, 49896, 94883, 88673, -9531, -34276, 4293, 1979, -12119, 7190, 17293, 99378, 95220, 5089, -64224, -121692, -115300, -95609, -76018, -80298, -44414, -33214]
15044c3214j8154K2091O0023q1040p1760L9678L3730K4983K077m5968O55k926
15032f9825J4698l63P6491K137m1718K2323k6188j7882o86N0655M2371o4786p6066
15019h8839k6880m7270p776J7067L3486j921N1411L2625Q8319O5587L4559o755
15007A43613n2899m1067K7312N2025p413j45108m3965J6059Q787K5573j2747J9132
14995a0698J7983Q028M178k0765O77n278P280k3575m3878P075p29O8278P6724
14982H5300M6932m6576l6325n4662j4883M6617j4018n1833J4647m9052K706q0203
14970a51350k1751J5542O7419j6473l1045P7256Q8707k3044k36K2767q933l4712
14958a5853k1699L4712L4070L2736L5421j0461l8238k4517r459j0194J7826k8522
$$ y = [-33214, -51368, -29277, 30746, -50294, -122054, -82376, -48646, -23663, -21586, -67554, -66899, -69825, -55127, -55490, 21001, 23138, -18580, 3743, -22445, -40327, -41013, 9642, 52013, -12773, -88839, -115719, -162989, -170765, -153698, -120212, -122133, -70722, -38097, 50222, 115809, 150368, 143613, 90714, 49647, 76959, 128984, 121571, -23537, -67502, -51443, -42656, -17083, -29830, -10698, 7285, 15313, 19491, -1274, -597, -5875, 1405, -22170, -66048, -58973, -59702, 8576, 85300, 132232, 85656, 49331, -5331, -20214, 26403, 12385, -39448, -24801, -73853, -71147, -151350, -173101, -157559, -90140, -106613, -137658, -60402, 28305, 5261, 5025, 27792, 18859, -15853, -37552, -2840, 31230, 63966, 99387, 88926, 50688, 26171, 16712, 6518, 24344, -4178]
14946d178K8664j1112q3209K0794K6087L6200P325n4097r801K2993m342N3573
14934B8897M9498k4550l7572k5786l5642K1475Q6258M4267j0667l4476k4725k3762
14922A3215m9153l3355L5189l8176m207K0868R9519K8411L9041J3821P325m3626
14910H8872k7037L4025r713o0990l9306Q137j1122L8102O567l7915n2047r2810
14898a55237N4397L5364o086N6151M0765K8539J246l599n7893Q035P0064L0337
14886A02083M169j19019n8673l3013N1096M3067J1023j3008K4841m181p71L2387
14874D0001n0206K406L8020o3631K3090l2423k0136P4467R0577N0226K4111m6291
14862A30211k9036K9743l0344q865N0001M9781j10837q0673l3208j27J2485K6773
$$ y = [-4178, 24486, 13374, -69835, -49041, -22954, 13246, 20571, -33526, -43327, -20334, -24676, 28897, 78395, 53845, 16273, -9513, -45155, -23680, 62578, 106845, 96178, 61702, 36977, 13215, -35938, -69293, -34104, -72280, -76487, -55619, 43900, 72311, 111352, 125173, 132498, 88872, 61835, 95860, 86147, 25157, -14149, -6012, -17134, 20968, 27535, -10380, -62427, -155237, -100840, -65476, -71562, -15411, 25354, 53893, 55139, 51540, -6353, 1682, 71746, 102083, 106252, -12767, -71440, -104453, -53357, -10290, 733, -12275, 12566, 8385, 7614, 40001, -10205, -7799, 30221, -33410, -10320, -42743, -62879, 11588, 102165, 152391, 176502, 130211, 101175, 130918, 100574, 91709, 141710, 191491, 80654, -19, -33227, -33354, -20869, 5904]
14850E904P2667l680q6788q1147O5349P2433J2123m1201j485k8849N6220j7682
14838B3864K477j7579n0720p2625k4015R7718J008N950L0839K3061k8390K5382
14826A6970P182P707L1019j3988k0526p1538j9639k6210k2586r461J0012P8988
14814c2070M0610K9978r070j3699J8145j9961p954j3142m4761n0091J9355M6875
14802c5785K2251Q7058L0026l2279m7991k7234q594M0845k8944k3677r902L9652
14790E426o3815l739k1880J5279P715M2481N8247j8285m3475k2739L1828L2197
14778A9240O520K2378n895n6540M68O0443M9746m2819l6967j6801j8184p7405
14766i5816K8572L5963R926r124l7528L815Q940K6581k7606L8948R448l5631K3945
$$ y = [5904, 78571, 74891, -11897, -93044, -27695, 44738, 56861, 15660, 14175, -14674, 41546, 23864, 26341, 8762, -41958, -114583, -138598, -40880, -39872, -33922, -3083, 19978, -8412, 16970, 24152, 31859, 62878, 48890, 28364, -43174, -62813, -89023, -111609, -121070, -111058, -32070, 8540, 38518, 29448, 15749, 33894, 13933, 5979, -7163, -51924, -102015, -82660, -35785, -13534, 73524, 103550, 71271, 23280, -3954, -12548, 28297, -647, -24324, -34226, 5426, -58389, -62128, -84008, -68729, -61014, -18533, 39714, 21429, -22046, -44785, -12957, 19240, 25760, 48138, 42243, -14297, -13829, 46614, 96360, 53541, 16574, -227, -18411, -95816, -67244, -31281, -21355, -30479, -68007, -64192, -55252, -28671, -56277, -17329, -7881, -43512, -19567]
14753a9567J44682l781k0836n3328r119J1309N6677Q938o2377n9911L4110J2285
14741C9082m3779l5393n2738M6495j2064k797k7794l6250O5920P0275M2716p8844
14729b5171l8031l9540q165M5820K6258m9603k5917j7409k8159Q4527P2768k4269
14717b6891R729K7886J1842q636J0980J6158j1366L5044L5521l9765n6591P934
14705A1845K5646o219R168k6755j900k4102R575k7927O659n42r562M7967k4047
14692a0194o885K8622m0552L5015K7888J6533M8959j8956M4192m0872r9587k0580
14680c6417j316m025J6400N5368M6377l1938j3636j4661k1919J7408k9993r6754
14668a15106q056M9606k0394L4595N3026Q1118K1135l2379k4277o711J8433j5766
$$ y = [-19567, 125115, 121334, 100498, 47170, 38051, 49360, 106037, 114975, 52598, -7313, 26797, 39082, -4697, -40090, -92828, -46333, -58397, -61194, -88988, -125238, -59318, 10957, 53673, -25171, -63202, -102742, -110907, -65087, -38829, -88432, -114349, -131758, -159917, -75390, -2622, -26891, -17162, 10724, 22566, 13930, 24910, 41068, 29702, 64746, 100267, 60502, 3911, 11845, 37491, 31272, 40440, 13685, 11785, -12317, -2742, -30669, -24010, -24552, -34114, 13853, -10194, -17079, 11543, -29009, 6006, 33894, 50427, 99386, 80430, 124622, 83750, -15837, -36417, -37733, -41758, -25358, 30010, 76387, 44449, 30813, 16152, -5767, 11641, -18352, -115106, -123162, -73556, -93950, -59355, -6329, 74789, 95924, 63545, 39268, 32557, 50990, 35224]
14656C5224L0670j5465M8368j5376m1712K3009K2196k6825m9791M4564N4394J3535
14644A22791L2706K3604l2690M5844k1154j17146k0505J9466n5287k2957L8099
14633A2771N4113n4787j27139J4919R8091k1342k7659L4837J2660L7062L1032
14622F4558n1081j1731Q298l212P8121k320k6658k173L9571m5783o6780M331L2594
14609A7735K1502n59J9605l5039o7236o5420J6115N9157P5893R9661k2054j36037
14597a6677l1323j2211M2955J6905N3894L1508M3253N8199j8472k8656r4369j08689
14585f3683N1207R6849P2492q3278m6481N1905N5105j1273n4976l5950m4111n0307
14573f2501J2734O2010O5459k3597j8260p3520n7273O2417K5367k826n3765L40
$$ y = [35224, 65894, 50429, 98797, 83421, 41709, 64718, 86914, 60089, 10298, 54862, 109256, 122791, 155497, 179101, 146411, 192255, 171101, 53955, 33450, 52916, -2371, -25328, 12771, 66884, 12097, -115042, -100123, -2032, -23374, -51033, -16196, -3536, 33526, 64558, 13477, 1746, 10044, 6832, 84953, 82633, 55975, 53802, 93373, 47590, -19190, -14859, 17735, 39237, 38678, 58283, 23244, -43992, -109412, -93297, -34140, 41753, 141414, 119360, -16677, -48000, -60211, -17256, -351, 53543, 85051, 128304, 186503, 168031, 139375, 45006, -63683, -12476, 84373, 156865, 73587, 27106, 79011, 134116, 122843, 67867, 31917, -12194, -62501, -49767, 12243, 77702, 54105, 35845, -37675, -94948, -32531, -7164, -9990, -63755, -63415]
14561f3415L8665N3602L7213k4880o2536n778k6480L0323J09389N923r4522K3932
14549B1436K1071o1730k0282j9302l1876K4796J00202K7468m3764j9233N4841
14538E3627k6362q2411J181R220j876k0129n4870j0793K7693M7341L6625J0648
14526a0106P21m4461m762k8810K3222O7405m4185O0251K5780m8789o5845j1440
14514h1019M0746P4349P282p7775j3047O4989k4953j9746L7389m2382o1009J014
14502i4162K9362Q6799K481k5041R648n493M7122k3321R059P783o1696m2868N0391
14489i936J0205j7535o7228K1602K8246j2861K673M0894k4373j2221m9786j5118
14477a05438M8959K8938O068j2637O1673M1417k2152l0551Q6675J2064J287q7511
$$ y = [-63415, -24750, 28852, 66065, 41185, -21351, -27129, -53609, -23286, 86103, 92026, -2496, 21436, 42507, -19223, -39505, -58807, -90683, -65887, 34315, 61783, 18019, -1214, 53627, 27265, -55146, -53965, -44745, -46621, -66750, -121620, -132413, -104720, -57379, -20754, -10106, -9385, -53846, -58608, -87418, -64196, 3209, -40976, 19275, 45055, -3734, -69579, -81019, -40273, 34076, 41358, -36417, -49464, 15525, -9428, -29174, 8215, -34167, -95176, -94162, -64800, 21999, 24480, -561, 9087, 3594, 50716, 27395, 36454, 44237, -17459, -60327, -9936, 269, -17266, -84494, -62892, -34646, -47507, -44834, -3940, -28313, -40534, -90320, -105438, -56479, -27541, -21473, -34110, 27563, 68980, 46828, 16277, 102952, 115016, 116303, 28792]
14465B8792J1387M2256L7889k6143k3460O4777K5401k1135p5273j02494j10708
14454a48711J5869M5206M5892M7274p3903J2170P0710M9150j7162j74J6595Q688
14442G1604O537k3550j0748M0134k6660j7286k530k2238k8951P2556n813l3851
14430A9204j5970Q7203K7162o5344o3153O2754r354L1450j2249n5684j7338M9460
14418C8141n3222J2450R399l2315n1096m6516J08088K0420n5677j9946j6926n2521
14406a39721M0866Q1480J4310l3976K0808K4862j3341n266Q299M850O6152j2525
14394E6798M5773j08n449o1692r9372k417N7466J6231L4948J0015o5055m5850
14382e8712k072k5459n1099J7364j3944K2276Q2061M1722o8456k1531L4797l3437
$$ y = [28792, 40179, 82435, 120324, 94181, 70721, 135498, 160899, 139764, 64491, -38003, -148711, -132842, -87636, -41744, 5530, -68373, -56203, 14507, 63657, 46495, 46321, 62916, 71604, 78141, 54591, 43843, 83977, 57317, 40031, 37501, 15263, -13688, 58868, 53055, 19204, 3234, 90437, 117599, 52255, -10898, 51856, 42502, 73952, 61703, 6019, -11319, 38141, -15081, -2631, 6768, -25547, -76643, -123159, -15071, 5349, -50328, -70274, -87200, -139721, -98855, -17375, -3065, -37041, -16233, 8629, -4712, -9978, -1679, 3171, 69323, 56798, 102571, 102463, 97014, 35322, -64050, -66467, -9001, 7230, 42178, 52193, -12862, -58712, -60784, -86243, -137342, -119978, -133922, -111646, -29585, 12137, -56319, -77850, -43053, -76490]
14370g6490j8327j2079R0906J0775p0136j0354L5278J1744M8850M5025L1379l6705
14358D9866M82O3088K5014n0373n3322N148m262J5782k3853K343n5972k3717K7678
14345b2098K6474j4882M402J3362O449j1589j628j291K2522L6432K1991m1976
14333C8168n2114k8951J6459M6553P978Q972j4353K6948m158n1816l3747O3652
14321B3591R557J1196L3275k0451j4186q038j0930k5886o3316L3788K7298q59
14309d961N9445k3112m8909M1160N5019k1553r4300K88m5577K613M5799M3845
14297I757J15441K1950k2261k9274o4628j1521m8424k3530j3401j3570L0532O909
14285d2020J4842Q479J6988m3139K5336M3906j3321K7438L695k8655j6023m3048
$$ y = [-76490, -94817, -106896, -15990, -5215, -75351, -85705, -50427, -38683, 10167, 55192, 86571, 49866, 50348, 113436, 138450, 88077, 34755, 39903, 35641, 51423, 27570, 29913, -26059, -49776, -22098, 4376, -10506, -6104, 7258, 13707, 2118, 490, -801, 21721, 58153, 80144, 38168, -13946, -42897, -26438, 20115, 28093, 37065, 22712, 49660, 45502, -6314, -40061, 23591, 33148, 44344, 77619, 57168, 42982, 34944, 24014, -1872, -65188, -31400, -4102, -4961, 54484, 31372, -17537, 23623, 78642, 57089, -37211, -36923, -82500, -79887, -34088, 9757, 125198, 147148, 124887, 95613, 30985, 19464, -28960, -52490, -65891, -79461, -48929, -42020, -27178, -18699, -1711, -44850, -19514, 24392, 11071, 38509, 42204, 13549, -2474, -45522]
14273d5522l8321K2582K9164L1921O006k7950l84J040k0261k8486L7595K6347
14261f269k680K0485L355K7905L636K9565K262r2220l2070K2784J7127J7253J1150
14248B2283N629p495j5934K1128r1j6446j0722K0780K3900m628J4129Q220k411
14235E8342M3700N3029J4421n2245j409l8827P590j2130j02512l8201q791M987
14223g2046P704p444M4324O5355k7479j7951j8314q8838n5391Q8109J043j7114
14211i8042K3590L6196K9225J0240j0994K2949P446N9394K132M357n811K72n4496
14198B6458o7267K851M7821L0553K3291j3433m3728m6880m994n1387K3294K5467
14186d7954m5089j3535O7015M5755K7558N2049L7733n6864L0932j2102p9978N4892
$$ y = [-45522, -83843, -61261, -32097, -176, 5830, -22120, -22504, -21464, -41725, -70211, -32616, -6269, -8949, 11536, 14891, 42796, 46432, 75997, 78259, -13961, -46031, -23247, -6120, 11133, 22283, 27912, 20417, 4483, 25611, 25520, 9074, -1648, 19132, 43032, 38404, 52533, 60753, 58342, 102042, 155071, 169492, 117247, 115838, 77011, 84601, 72471, -30041, -68242, -77033, -72046, -64342, -71786, -27462, 37893, 10414, -7537, -25851, -114689, -170080, -81971, -80928, -98042, -74452, -38256, -9031, 1209, -9785, 13164, 20610, 80004, 82136, 86493, 80682, 80954, 26458, -40809, -37958, 9863, 40416, 63707, 50274, 6546, -40334, -45328, -96715, -73421, -47954, -93043, -106578, -39563, 6192, 33750, 85799, 123532, 66668, 97600, 85498, 5520, 60412]
14174F0412K7529K4219o768j6256M7257m7156j38989m6447L5894N8759J2846L527
14162A4827L9610K6441k607L2493q7564r0009P572m7768k9052O498J5592N0396
14150f3571N1300j6558k0225k4093M9637M9568k4526M0491J9939k2627k4932J8204
14138C2607J621j1440J4744n1950j081M9258M2288L8519K3121L7980m17l6214
14126A39036m1791N7100M4417J131K6673k3047m4822m0149n289r6096j01589M6448
14114c7978R2708p6709l8540N137N1129M0373n8O206r602q412Q6967m496n0726
14101E5999l2573K0013J1775L339L5822k0713k3622l4378m3914K8858L1048k3074
14089H580J5873l7825k8871j5990j2580L5293R3046q04n9086r806Q757K9584J1623
$$ y = [60412, 87941, 112160, 105392, 89136, 136393, 89237, -49752, -96199, -60305, -1546, 11300, 14827, 54437, 80878, 78271, 110764, 23200, -66809, -59237, -107005, -136057, -129559, -113967, -63571, -12271, -28829, -49054, -73147, -23510, 26058, 1532, 42023, 61962, 39335, 14403, 32607, 34228, 22788, 37532, -14418, -15499, 33759, 76047, 114566, 137687, 175667, 175250, 139036, 97245, 154345, 198762, 199893, 226566, 203519, 158697, 118548, 113259, 17163, -84426, -37978, 54730, -21979, -60519, -55382, -4253, 36120, 36062, 42268, 32666, 24254, 111221, 106725, 55999, 23426, 43439, 55214, 58553, 94375, 73662, 50040, 15662, -28252, 606, 31654, 8580, 24453, -13372, -42243, -58233, -70813, -35520, 57526, 56722, -2364, -12170, -3413, 26171, 37794]
14076C7794l8614J4434O4472J1329j4312j61J1271p3523m2119J6401L1956K0111
14064C9039L555L6895L4180q3784J8332N5087K905q1217r0008j6928N9084O5569
14052D2709L3301j5818j01597k8256J920M16R789P5658N5906M3730m947k4956
14040H7855K2796n252j7651J0833l7398m2719j7619P864k4826M2463j2902m4131
14028c0687n9038j0954l638L2144J4648L5409M5943o6265l5505p150J6202K3239
14016d5652M913j6394o959P58k050P5155J4534k990J4884J136n8009n2797k9897
14003a03368J7409M5735J5442l3438r8266O599l043N8182K4090j9414L1506J3414
13991d5152R3630O3444r792j1651l9638K9100K4606j9082o7687k2988m5522k1359
$$ y = [37794, -820, 13614, 78086, 89415, 75103, 74942, 86213, 12690, -29429, -13028, 18928, 39039, 42594, 79489, 113669, 29885, 48217, 103304, 106209, 24992, -65016, -81944, -22860, 42709, 76010, 60192, -41405, -69661, -67741, -67325, -57536, 18122, 74028, 117758, 112811, 87855, 110651, 105399, 87748, 98581, 61183, 18464, 845, 8709, -16117, 26346, 13444, -30687, -89725, -100679, -104317, -72173, -57525, -22116, 23827, -42438, -77943, -85093, -68891, -45652, -40739, -57133, -64092, -63334, -65384, 9771, 24305, 21315, 36199, 37335, -20674, -73471, -103368, -85959, -40224, -24782, -58220, -156486, -149887, -152930, -94748, -70658, -90072, -58566, -45152, 48478, 111922, 102130, 90479, 50841, 79941, 104547, 85465, 17778, -5210, -50732, -72091]
13979g2091K8277Q6837J6587n0981K9653n7935o3790J0898K3965k248j9309k2416
13967i2553M5001K0488Q8915o7379J0023N5794J943j8702m2416r81o5611K6360
13955c9118M6044n5610m7315J1161J3327L2558K4280O1410N1270J0408m8073j567
13943E8775N2686l9502n214N9037K1526m4202l2236o0337k0147L6047p478o0307
13931d1352K7206O3591l3241L0039N5433M0680n2345o7463j8237K8021J0657j2414
13919C0575p2444j0641P5585p152m7950j218J20261L8619N3388j9390r4012R272
13907G4893l3452l6457K1742O646k7755n0911J2057r118L5925L7953j4688m4155
13895b7320l2421m7393L3071R0852P1144R501j2343k0680m7508j3066J155J0759
$$ y = [-72091, -43814, 43023, 59610, 8629, 38282, -19653, -83443, -72545, -48580, -50828, -70137, -92553, -47552, -27064, 61851, -5528, 4495, 60289, 62232, 43530, 1114, 133, -65478, -39118, 6926, -48684, -95999, -84838, -71511, -38953, -14673, 46737, 98007, 108415, 60342, 58775, 111461, 71959, 66745, 125782, 147308, 103106, 70870, 10533, -9614, 26433, 18955, -41352, -14146, 49445, 16204, 46243, 101676, 142356, 90011, 22548, 4311, 32332, 42989, 30575, -41869, -52510, 23075, 15923, -32027, -33245, 87016, 125635, 179023, 159633, 65621, 74893, 41441, 4984, 26726, 33372, 5617, -45294, -33237, -42355, -6430, 31523, 16835, -27320, -59741, -107134, -74063, 16789, 87933, 97434, 85091, 64411, 16903, 3837, 4992, 15751]
13883A5751j5754q192o2728l2756O6897K0500k4904l8715l9235L503Q5610P1431
13871D1408J6046l0406j17238k6914N7780J6572N3642M4682J1597j4901m4032
13860H236L9356p755n7667o8869M6334Q2531N4217p285J5175k4540l1983K1858
13848F9608M6969J4661o3472j7427J5587j6263J8087j1745J9679q0090o5683k3541
13836i3630J066n026q357Q7899L7034L8009J14261k753r3975m8079o8210k1125
13824f2886Q3983k3792J3072j2057k8443N6593J5636k1842m6470J2775J4877J3903
13812A5349j8476j6293k1596j2061N7552K9872O474K0162r886J1631J0912j922
13800G1718n427j15496j01624M8142P7731K8924q535P4854K9811O217m0231o7155
$$ y = [15751, -3, -8195, -70923, -103679, -36782, -16282, -41186, -79901, -119136, -115633, -30023, 41408, 57454, 27048, -90190, -117104, -59324, -42752, 10890, 55572, 67169, 52268, 8236, 47592, 39837, -17830, -86699, -40365, 42166, 96383, 89098, 104273, 79733, 47750, 69608, 116577, 131238, 67766, 50339, 65926, 49663, 67750, 56005, 75684, -4406, -70089, -93630, -92564, -97590, -105947, -18048, 18986, 56995, 171256, 168503, 74528, 26449, -41761, -62886, 21097, -2695, 10377, -1680, -30123, 26470, 42106, 20264, -26206, -13431, 1446, 15349, -3127, -19420, -41016, -53077, 4475, 34347, 40821, 60983, 51097, 62728, 73640, 71718, 66291, -49205, -150829, -102687, -24956, 3968, -4567, 70287, 100098, 106315, 66084, -1071]
13788a071m9341j8145M9310M9202J7496P763p5403N2410O2180l2000m6340n319
13776A0742j148J9448m14J7428m5975n806L3384O3488L475L6709L0898n5922k7232
13763G9075J3638L5771m01j47813o0336N7584O5311k3409M1979O2176q462q1994
13751C3119j0169n882o7988L2199O2294N8387O587J1568k0595m1815n5921M180
13739E964P8242Q2814J2854p6911q2796p5300N4256L1360N8908J7658m7604j9675
13727C9770N271J3045l7853M1035M3322k2625L868K6336j15l6205m1063j1848
13715B2938o246o94m0660J5973J8443n8241K4107O5612J4034r26K779k4815j1840
13702B0464J6012m0912O264J2746m6297K588M1798L2225Q061l0553p41l2863j5622
$$ y = [-1071, -50412, -68557, -19247, 29955, 47451, 55214, -20189, 32221, 94401, 62401, 16061, 10742, 9594, 29042, 28628, 46056, 81, -5725, 27659, 91147, 94622, 131331, 162229, 106307, 79075, 92713, 128484, 128083, -19730, -80066, -22482, 42829, 19420, 61399, 123575, 115113, 33119, 22950, 17068, -50920, -18721, 43573, 101960, 108547, 120115, 99520, 57705, 1784, 5964, 84206, 167020, 179874, 102963, 20167, -55133, -877, 30483, 89391, 107049, 59445, 39770, 45041, 58086, 20233, 61268, 104590, 81965, 85833, 112169, 112054, 75849, 34786, 22938, 16692, 15998, -24662, -8689, 9754, -48487, -24380, 41232, 55266, 54340, 57119, 32304, 20464, 36476, -4436, 1828, 14574, -31723, -29135, 12663, 44888, 52949, 22396, 21655, -11208, -26830]
13689b6830k6828L3073P1586K9833N6447M0045n9666l6628k4297l5750Q2505J7130
13677A20620r0700l9135n673n039J911K2025J9956j5071J461K8075P7299K52o2650
13664E3331P110j6167j6909N8689l0962r3566K0698K4826N9864k6652l7997L0216
13652C2481K1461l0629p8935M1238L721k1267M9667k0529j9597J061j4620K0059
13640a5889K933L5111m5865m04o2607j0151R0796K0594l1931j0552K3449M9719
13628D5203M4417K378j06816j28801M9296O0472N2901n8640j3846O0904Q00k2977
13616a4709K904K0536M0475o8449o2430Q3717K591o669N7699j3128k3441l5478
13604a6382J9028q860K064M0451j552j4709k9193k1444P1650k5809l3025L2703
$$ y = [-26830, -53658, -20585, 51001, 80834, 137281, 177326, 117660, 81032, 56735, 20985, 103490, 120620, 29920, -9215, -14888, -19927, -18016, 4009, 23965, 8894, 10355, 38430, 115729, 115981, 53331, 60441, 44274, 27365, 86054, 55092, -38474, -17776, 7050, 66914, 40262, 2265, 32481, 53942, 23313, -55622, -14384, -10663, -31930, 17737, -2792, -22389, -21328, -35948, -15889, -12956, 22155, -23710, -24114, -86721, -96872, -6076, 14518, -17413, -27965, -4516, 45203, 89620, 91998, -14818, -143619, -94323, -33851, 19050, -39590, -53436, 7468, 8268, -14709, -11805, 8731, 49206, -19243, -81673, 2044, 4635, -2034, 55665, 42537, 19096, -16382, 2646, -6214, -4150, 36301, 34749, 20040, -9153, -30597, 41053, 15244, -17781, 14922]
13592A4922K3426J242K4807P8965J7288k1456r5156m1124r603O8301O757j2114
13580E6255j5246J6126N6102j7872p7698m141K0080k4647n3483L4394P4763K3346
13568H7979q954P0091J8880o8125r6113k2339J8508N4619O4817R4362o0669n4038
13556I9018m7001n3325J0042J07765P6676m7581k1675p1631p3184n985r377m3631
13544g9889m9746P5862J21649N6978o8496P235K2934n0619r2524l0719L6725M5442
13532e168M8059J13838Q8392q5269p4705n9220n6667l722M8214Q0434O4993L272
13520A62451l8592k3602K1680M898L3072l5776J1367M623K960p1848o7144O5626
13508F9715K6263L3272l7990l6081P6851J1213p4958p8619J2485N848J7598N5566
$$ y = [14922, 38348, 39590, 64397, 143362, 160650, 139194, 44038, 2914, -6689, 61612, 68369, 56255, 41009, 57135, 113237, 95365, 17667, 13526, 33606, 8959, -44524, -10130, 64633, 87979, 79025, 149116, 167996, 99871, 3758, -18581, -73, 54546, 119363, 213725, 153056, 99018, 52017, -1308, 8734, 116499, 193175, 145594, 123919, 52288, -20896, -26881, -36258, -79889, -129635, -53773, 67876, 124854, 56358, 63593, 86527, 35908, -56616, -87335, -50610, -5168, 42891, 156729, 245121, 159852, 85147, 25927, -30740, -34462, 13752, 94186, 159179, 162451, 123859, 100257, 121937, 126835, 159907, 124131, 135498, 140121, 143081, 71233, 4089, 69715, 95978, 129250, 91260, 55179, 132030, 143243, 68285, -10334, 2151, 7999, 25597, 81163]
13496H1163q887j19433J3180J08980J5286j7111k5855J5751o145P0212j82p2366
13484E4593k3198K7725R963p9371l9060N1758L4598m2411M5801K8731K9825j8515
13472H0439q881m7685J2257k1269L0192L1128p4088o3071R2292O4207o143r4414
13460e036L0873M4361K6154j1082l1864M433o3889k4391j8297J4193M7857N8835
13448G2147O6204N0038N36j02530j039l8787j8454l9950M8970L4367j1708q101
13436E1693R616o288l3753j7790O5357M9767j2028o3852J1896K2215p7o8889L9048
13423D6915M7121j3268q7918r1920P929K4891n271M2309K7674N9297p304L2381
13411H2836J9843J4073L1092k4106n0255k8574k9841L2458l069j886R601o6654
$$ y = [81163, 72276, -47157, -33977, 75003, 90289, 73178, 47323, 63074, 56929, 127141, 126959, 54593, 31395, 59120, 69083, -10288, -49348, 2410, 37008, -5403, 40398, 69129, 98954, 80439, 71558, 23873, 36130, 14861, 45053, 76181, 2093, -60978, 31314, 95521, 89378, -5036, 25837, 70198, 96352, 85270, 53406, 57839, -6050, -30441, -48738, -34545, 13312, 72147, 138351, 188389, 188925, 86395, 85356, 46569, 28115, -11835, 37135, 71502, 59794, 51693, 61309, 55021, 21268, 3478, 68835, 118602, 106574, 42722, 54618, 76833, 76756, 7867, 46915, 94036, 80768, -7150, -99070, -91141, -66250, -71521, -29212, -1538, 57759, 50455, 82836, 102679, 116752, 147844, 123738, 73483, 44909, 15068, 47526, 44457, 42571, 52172, -14482]
13399a4482m0702L7364N4814M297L7142L7716n7064K1800K2451j5235p9242k0650
13387a1791o3947N801M8699Q6578O2539k8507k8706p3092j4325j8768K3200L8121
13375B5802L0424M2247m1070j8452r516j5400k0898M1661M4581j1621K723J4858
13363H5339o16l4702M804j0836P0066K6300r839k5970J7084K123k09j587k5166
13350I6791j7882n5158j6612R891N0475n156l071K6346l1191L3487k6241j1919
13338D9760L3646J1029J3219o1752k6342j979L0693J7007L944J8439K6580p3619
13326D0625m8659P807N212k8478K3443L2923M2026k4278p5530o8238L604O8923
13314b0620J36287L3524k5263r115j74j2932p1990L40N6797n8447K7142o7455
$$ y = [-14482, -55184, -17820, 36994, 41291, 78433, 116149, 59085, 80885, 103336, 88101, 8859, -11791, -75738, -69937, -21238, 65340, 127879, 99372, 70666, -2426, -16751, -35519, -12319, 25802, 56226, 98473, 57403, 38951, 29435, 14035, -6863, 34798, 79379, 67758, 70481, 85339, 84723, 50021, 54825, 43989, 114055, 140355, 130516, 104546, 121630, 123753, 123544, 121957, 96791, 78909, 23751, 7139, 17030, 67505, 62349, 59278, 85624, 54433, 87920, 61679, 49760, 83406, 94435, 107654, 45902, 19560, 17581, 48274, 65281, 69225, 87664, 114244, 40625, -8034, -227, 4985, -23493, -50, 32873, 74899, 50621, -24909, -93147, -89543, -20620, 115667, 149191, 123928, 114813, 114639, 101707, 29717, 30057, 86854, 28407, 55549, -11906]
13302a1906j918K990Q0961j6982q7644Q6070Q986k8074n6618J338P2369N3596
13290A03168K5638M5279n5955n0857O854n0481K438N3880j30L2954K2835K5003
13278A60626l7349k6335o2737p909J4053l4192l1606L8624O541K5679M0265L8003
13266A23663n7645m3451J5031N2742M0606J0132k6662n2785P479K0273q697q666
13254G2020L9237M9880n118n4017j4173N4317l9516l6547J8618q083j01449M1511
13242A6680N9028j3265l6198j077K5549o735o898L2990K6991J427l4795K196Q656
13229G4549m3968j8219K6278n0448j6488P9824Q9778j7936l6449N7119M4275J7931
13217B06246l213l1515r3718p0724j6908N5110k8637K0461L0022N1189K1329n2960
$$ y = [-11906, -13824, -10834, 70127, 53145, -34499, 51571, 60557, 32483, -24135, -22797, 49572, 103168, 128806, 174085, 118130, 67273, 74127, 23646, 26084, 79964, 79834, 112788, 135623, 160626, 123277, 96942, 34205, 26296, 40349, 6157, -25449, 13175, 19716, 45395, 85660, 123663, 66018, 22567, 37598, 90340, 130946, 141078, 114416, 61631, 69110, 89383, 80686, 72020, 111257, 161137, 156019, 102002, 87829, 142146, 102630, 66083, 84701, 76618, -24831, 16680, 75708, 62443, 26245, 25168, 50717, 43982, 37084, 70074, 97065, 98492, 63697, 65893, 74549, 30581, 12362, 38640, -11808, -28296, 51528, 141306, 123370, 86921, 144040, 188315, 206246, 203033, 171518, 77800, 7076, -9832, 45278, 16641, 37102, 67124, 118313, 139642, 86682]
13205H6682l4926o5K4090l7019k556K7836p3953j4474M8378K3387m7459l4869
13193c4948M0773N0971M5530L5708n3794r173j3229k1928K0693n4375q2996k1610
13181i8378L1646Q1710j1641N0291M0635K0234l7014n3704k4667P9751M9274K153
13169A30290J6890k312o7343n9714O6561P1290K5290p4329M6546j6338j8564k4447
13157I3820M4910K9363J1312o3888m4603J2088o8295K1891N7028j8605k8016m8866
13145a861M3836K5490K1017l3450r6286j1892L2524M4084l518m1592K8569K8031
13133C4952m4426j1455M9650J1975L2175P5804k5150m0141k6989o5234p983N9997
13121D3175N5988l5135p2335j103J01451O8224R808o0160j3699L8299Q582k3540
$$ y = [86682, 51756, 51691, 75781, 38762, 36206, 64042, -9911, -24385, 23993, 47380, -79, -34948, 5825, 56796, 102326, 138034, 84240, 75067, 61838, 39910, 60603, 6228, -76768, -98378, -66732, 14978, 3337, 53628, 94263, 114497, 77483, 23779, -888, 78863, 128137, 130290, 147180, 144868, 77525, 17811, 84372, 155662, 180952, 106623, 153169, 136831, 118267, 93820, 138730, 168093, 179405, 115517, 70914, 83002, 14707, 36598, 93626, 75021, 47005, -1861, 41975, 67465, 88482, 55032, -41254, -53146, -20622, 23462, 19944, -21648, 6921, 34952, -9474, -20929, 28721, 40696, 72871, 148675, 123525, 83384, 56395, -8839, -16822, 43175, 99163, 64028, -8307, -9410, 92041, 160265, 170073, 109913, 96214, 134513, 143095, 119555]
13109A19555p717m8072k6959M4962o547m5841n7425P223N1537J1165J7536M5276
13097A04693k5791n6184K7215L6590N5540O8524l5917l0213J0348J7524l1899
13086A40430j9181o003L3335k0031K3303O3492L5064J9862P0076J30397P697k8297
13074D50144j27653p7044j2142l3161j07739N34J515K9859j4344J90m0185K9326
13062I9300J0986j7008K5525N014R822k8110q9032m7254K73J15582P4777K873
13050A62748k1776M6702K4055L635q1442j2072l0662n0267J6516Q7189o1834m0746
13038D2046K331N7309Q4987J40526J57074J87148K93968K88564r377k08837k32109
13027H03630k58139j56808r6132p1269o6271J3563m083N1338j9373n5640k4123
$$ y = [119555, 111838, 63766, 36807, 81769, 75222, 29381, -28044, -20821, 30716, 41881, 59417, 104693, 78902, 22718, 49933, 86523, 142063, 210587, 174670, 144457, 154805, 172329, 140430, 121249, 115246, 148581, 128550, 151853, 215345, 250409, 270271, 340347, 470744, 478441, 450144, 322491, 245447, 233305, 200144, 92405, 92939, 94454, 124313, 109969, 110159, 69974, 99300, 110286, 93278, 118803, 123817, 133639, 105529, 16497, -30757, -30484, 85098, 159875, 162748, 140972, 187674, 211729, 215364, 133922, 121850, 91188, 40921, 57437, 144626, 82792, 42046, 44377, 101686, 186673, 327199, 484273, 671421, 965389, 1253953, 1244576, 1035739, 803630, 545491, 388683, 292551, 221282, 155011, 168574, 164491, 215829, 196456, 140816, 116693]
13016A16693k6296k7732k1828j7781N188L6282L8607R8021J993p6835j14032K1357
13004C3637P8872M5006n8187o548Q2079m1887J3277r911O1466J4081o3256Q4579
12992B33208Q2161J7566J10442J95455L51064L54336J97699o0780k77230l01486
12982I02435k12297j80427o1943l0449n7549J8612O3727m2947l6004K0879k6540
12971C57497p8314l3071K2278J7131K5711m30j9204k2613k7384J8635K9392K4462
12959C14090q583n3321m8634R571P1543J8687m2299j1223J0793K8849n5174R348
12947B43647K9866j9090l157O1568J30425J55538N4554k4853j28591r8151m7529
12936C54227o1108o6431k5663L1727M7040m4183m0915o6564l4412L7302J13957
$$ y = [116693, 90397, 62665, 40837, 23056, 28244, 64526, 103133, 201154, 203147, 126312, 12280, 33637, 112509, 157515, 99328, 92780, 174859, 132972, 146249, 136338, 197804, 211885, 148629, 233208, 315369, 332935, 443377, 638832, 989896, 1344232, 1541931, 1481151, 1203921, 902435, 690138, 509711, 447768, 417319, 359770, 378382, 442109, 399162, 363158, 384037, 357497, 279183, 246112, 268390, 285521, 311232, 310802, 291598, 268985, 241601, 260236, 289628, 314090, 305507, 252186, 203552, 213123, 284666, 303353, 261054, 249831, 260624, 289473, 234299, 243647, 273513, 254423, 251266, 312834, 443259, 598797, 653351, 628498, 499907, 401756, 354227, 293119, 226688, 201025, 232752, 279792, 235609, 194694, 128130, 93718, 131020, 244977]
12925B44977n584k1701K0726O270j30598r762M1840N2595K9158q0756J9180M7577
12913B13922L0128j8869k1467o986o0014m2857n1669L2149N8965m8040m6814L8957
12901G7405O0128j9545J6898l6188n4670J5371N7396N524n3422q386Q2855Q4005
12889B27371L5520q214j22361m012L2034l3352m0953O068O5619j6636l7884k6802
12877G6398m5954k6847K7399J04273Q674Q138K0819l5034k7403M3200M4639n340
12865A92962K4027Q3823j7413q9730n7794M376M5601O4655K7162k5793j6031k0499
12853B15346M703K0109p3852j08117N800J9084J1560Q3621K7998j634J052L4377
12841B40047J8710j8437n4328L8848n300j5083L0211N1572N2653q142J6065n9854
$$ y = [244977, 239393, 217692, 238418, 244688, 114090, 104328, 146168, 198763, 227921, 147165, 166345, 213922, 244050, 225181, 203714, 196728, 136714, 93857, 42188, 74337, 133302, 85262, 38448, 77405, 137533, 117988, 134886, 98698, 44028, 59399, 116795, 122319, 68897, 60511, 143366, 227371, 262891, 254677, 132316, 128304, 160338, 126986, 86033, 92101, 157720, 141084, 103200, 76398, 30444, 3597, 30996, 135269, 143943, 152081, 172900, 137866, 110463, 153663, 198302, 192962, 216989, 300812, 283399, 193669, 135875, 140251, 185852, 250507, 277669, 251876, 235845, 215346, 220049, 240158, 166306, 58189, 63989, 83073, 94633, 178254, 206252, 204618, 205670, 240047, 258757, 240320, 185992, 224840, 219540, 204457, 234668, 286240, 338893, 330751, 346816, 286962]
12829B86962o0069l5747K8732N2806m0747n0369k4178J1391k0648K3161O585Q499
12817A86378L7626P406l8118Q354M4596l3230k4636K4635P9118j1890k8557o38
12805B51044O222P3902J93761J29127R9044O7175J03406K02028K20569K40773
12795A587051K32325K12448J72840M1509l5675n2310j00674j74940k60835k26741
12785A394998j56187k10222j99981j97345p7576o3103n9911j18957m9057N241
12775B67900l0346K0823k5838J9909L6520j493P372k7738n0555M696m0664j8525
12763A62061K3605L2530N6561J2448n6J946n1913K9660j0642o469m2522o721O340
12750B06828l1318J0649o903O0744M1101p2249J5320O1111J968o1952k9634m2143
$$ y = [286962, 226893, 191146, 219878, 272684, 231937, 181568, 157390, 168781, 148133, 171294, 177879, 186378, 224004, 231410, 193292, 201646, 246242, 213012, 188376, 213011, 292129, 280239, 251682, 251044, 257266, 331168, 524929, 654056, 753100, 820275, 923681, 1125709, 1346278, 1587051, 1819376, 2031824, 2204664, 2246173, 2210498, 2158188, 2057514, 1882574, 1621739, 1394998, 1238811, 1028589, 828608, 631263, 553687, 490584, 430673, 311716, 262659, 267900, 237554, 258377, 232539, 252448, 288968, 287475, 294847, 267109, 216554, 221250, 180586, 162061, 185666, 218196, 274757, 287205, 287149, 289095, 237182, 266842, 256200, 249731, 207209, 200488, 206828, 175510, 186159, 179256, 240000, 281101, 208852, 224172, 285283, 287251, 225299, 195665, 153522]
12738A53522o6518P907l553j2160K1427O0493O7301J6600j6370l0908j2434K1932
12726B07239P780P0305N3364n6424k4252L7064K2680o027r0109k6878n607R713
12714A98848O7666P0820N641l7195O1854m1675q3983m7470K0396nj3035K6295
12702B28157M3806l4464k3503k8919K575M9959n8714O714l5200O5656k5903o9184
12690A20980M7150N2648R223M81p096r986N443Q9786j3212m325J8830k2262n2735
12677B34925j8545o6611R14L0960K2849K6268M645m666j779k5231l3108k4550
12665A46071M9536k6448p2268J8061M1299K4594J598p906l1864r23K4355P4649
12653B40754j9567p1311n548J7898J05129O8314p3831n9370M9992j4460N953N7693
$$ y = [153522, 87004, 94911, 91358, 79198, 100625, 161118, 228419, 245019, 228649, 197741, 185307, 207239, 215019, 285324, 338688, 282264, 258012, 295076, 317756, 311729, 221620, 194742, 189135, 198848, 266514, 337334, 342975, 305780, 367634, 325959, 241976, 194506, 214902, 214897, 201862, 228157, 271963, 237499, 213996, 185077, 187652, 237611, 178897, 185611, 150411, 216067, 190164, 120980, 168130, 220778, 230001, 230482, 223386, 213400, 218843, 308629, 295417, 291092, 309922, 287660, 234925, 216380, 149769, 150683, 181643, 204492, 230760, 235405, 230739, 228960, 203729, 170621, 146071, 195607, 169159, 96891, 114952, 156251, 180845, 182443, 174537, 142673, 141750, 166105, 240754, 221187, 149876, 144328, 162226, 267355, 335669, 261838, 202468, 252460, 238000, 243953, 301646]
12641C01646K6597p6217p115O917j9747r7396n6270P5789M8554L4767o009j11437
12629A20079k9994Q2870M0749L6654L3057k6511R347j2540j1844O9059M4272m1239
12617C13959n0972L3846J8658m4378r02O664R5897R2670j0621M9957O8009P894
12605E80681J7005q116n0668K9956N5230K487k6374j0171r4744l5392o3046k2781
12593C74067m161m9718n011k418j5533L8123K3506n7173K8915J7101M2289Q057
12581C98044M5311P518o4724o916K2424j7337M0117O52l1644J732k3656M2357
12569D13878O8901O480k1815j6428O831o753l1809p3368K5312l930o3937m9987
12557B53375K720L0846R9233j4643l3870O1399P3387M9052p3037k6593k4431N9951
$$ y = [301646, 328243, 252026, 244911, 251828, 232081, 134685, 78415, 154204, 202758, 237525, 231516, 120079, 90085, 172955, 213704, 250358, 283415, 256904, 266251, 253711, 241867, 310926, 355198, 313959, 262987, 296833, 315491, 271113, 270211, 276875, 372772, 465442, 454821, 504778, 572787, 580681, 597686, 589570, 538902, 568858, 624088, 626575, 600201, 590030, 495286, 459894, 396848, 374067, 369906, 320188, 315177, 312759, 297226, 335349, 358855, 301682, 330597, 347698, 389987, 398044, 443355, 450873, 386149, 379233, 401657, 384320, 424437, 425089, 393445, 395177, 371521, 413878, 482779, 489259, 467444, 451016, 457847, 451094, 419285, 345917, 371229, 367299, 303362, 253375, 256095, 286941, 386174, 371531, 337661, 399060, 472447, 521499, 448462, 421869, 397438, 457389]
12545D57389J06264q060l1388m8710k5047l7407m0356K37K2607N9888P616j3037
12533D49996k0443o442K6592J3243J7779P071K5189N5084N1683l1539p1594n9724
12521D56895n3758M56j9886j7513L064l3140l4822j2084J0034M7494L7029K0470
12509D04239M8048l7701j5755n9971K9949O2146L1295K3092P0748K6279N7505
12498F39874L7331j0795O561m3331k160K6709m4783p244k0823l4020j5526N7703
12486E89496O4532j2096k3182L4533R8760L2746J1814M6925J9227J1468Q5852
12475I60075R8937R6189J03766O0232Q178j00650k5468K0215o8635n5855J6138
12464A113122M0808Q4169l9449j9660J7902J8229j7532p7533k1894J0148J519
$$ y = [457389, 563653, 555593, 524205, 475495, 450448, 413041, 372685, 372922, 395529, 455417, 463033, 449996, 429553, 423111, 449703, 462946, 480725, 487796, 512985, 568069, 619752, 588213, 516619, 456895, 403137, 403593, 383707, 366194, 369258, 336118, 301296, 289212, 299246, 346740, 383769, 404239, 452287, 414586, 398831, 338860, 368809, 430955, 462250, 485342, 556090, 582369, 639874, 677205, 666410, 672971, 629640, 627480, 654189, 609406, 602162, 581339, 547319, 531793, 589496, 654028, 641932, 618750, 653283, 752043, 784789, 796603, 843528, 862755, 874223, 960075, 1059012, 1155201, 1258967, 1319199, 1327377, 1226727, 1201259, 1221474, 1152839, 1096984, 1113122, 1153930, 1238099, 1198650, 1178990, 1196892, 1215121, 1197589, 1120056, 1098162, 1108310, 1109829]
12453A109829p3618J4888n692l3863K250O6440l8707j1444n4373K4343P0049n5833
12441A014269r1057M7453R1429J744l3197k6944O039k7137j4393J1926J30749
12430A110881J04309O0314m4676l2118l2897L758Q8341L83K8112J01809J10221
12419A498437O6284o322L0060M7933J3505M240L0196k988K5559N8911Q4944Q7122
12407A937881M8149Q1398K1088m1885J1192J12813J05407m2736J7350J16620J33326
12396B500603J37470J06286k2027N9653J62972J82177J51246J70037J63073K62965
12386C874455K21854J93521K24874K57754L09599L26566L16392L63038L72342
12377F460395M05288N24303N01856N19970O82150P50365Q41448R37288J187473
$$ y = [1109829, 1036211, 1051099, 1045407, 1011544, 1013794, 1080234, 1041527, 1030083, 975710, 1000053, 1070102, 1014269, 923212, 970665, 1062094, 1063838, 1030641, 1003697, 1009736, 982599, 968206, 980132, 1110881, 1215190, 1275504, 1230828, 1198710, 1165813, 1169571, 1257912, 1258295, 1286407, 1388216, 1498437, 1564721, 1558399, 1588459, 1636392, 1649897, 1654137, 1684333, 1681345, 1706904, 1765815, 1850759, 1937881, 1986030, 2067428, 2088516, 2046631, 2057823, 2170636, 2276043, 2233307, 2250657, 2367277, 2500603, 2638073, 2744359, 2722332, 2781985, 2944957, 3127134, 3278380, 3448417, 3611490, 3874455, 4096309, 4289830, 4514704, 4772458, 5082057, 5408623, 5725015, 6088053, 6460395, 6865683, 7389986, 7891842, 8411812, 9093962, 9844327, 10685775, 11623063, 12810536]
12368A2810536J366961J673720K011358K403403K949302L767789M826623O203525
12360C8013217Q224408J1139091J5264991K0939368K8516037L7255453M5070013
12353B04422578N0550862N5100300N6188821M1378140J6123130M049582n42032
12346D27271381j8759052m3688393n2295808m9249369m5778582m3499755l8508969
12339A35491453l0996091k3360701j7123194j2515037r406998p086442n513231
12332B9489759m382563l490979k838162k326051j898569j584597j241172j119705
12324A0607961j045718q41150o76855o41608n32415n36776n43176m71187l19435
12315D999641k80029k37671k12239j55754j66437j37061n4247r3898j99769j48489
$$ y = [12810536, 14177497, 15851217, 17862575, 20265978, 23215280, 26983069, 31809692, 38013217, 46237625, 57376716, 72641707, 93581075, 122097112, 159352565, 204422578, 254973440, 310073740, 366262561, 407640701, 423763831, 427813413, 427271381, 408512329, 364823936, 312528128, 263278759, 217500177, 174000422, 135491453, 104495362, 81134661, 64011467, 51496430, 42089432, 35002990, 29489759, 25107196, 21616217, 18778055, 16452004, 14553435, 12968838, 11727666, 10607961, 9562243, 8721093, 8044238, 7402630, 6870215, 6333439, 5790263, 5319076, 4999641, 4719612, 4481941, 4269702, 4113948, 3947511, 3810450, 3756203, 3662305, 3462536, 3314047]
12305C314047o7173r9088j02683j16235m9239n9960j35478j72461o7078j10258
12295B334394p4768r5919j25375p0352j6615L978j9357o3847m9866l1578k8908
12284A761787p9637l6510o2067J0137N6052k8471p2986o8674J1766M3662m7906
12273A487153p8462r9647n4203j2362L3128j0880j29j7094l1240N795j3166j16310
12261A092583m666R0084N10m7539p1623n1563k6872k6257J5709J9778K7588M1350
12249A059082l9110n7166l4139M4051L7044l5454q0087n4835N8916O6145J0522
12238I74969r1796k2039N7657N8737k9190j13112m2473J7581J2032R300p5427
12227G56239q9632o9378k845m8228j0730M553J8702P9349R0258R2354O1979O699
$$ y = [3314047, 3246874, 3147786, 3045103, 2928868, 2879629, 2819669, 2684191, 2511730, 2444652, 2334394, 2259626, 2163707, 2038332, 1967980, 1951365, 1955343, 1935986, 1872139, 1822273, 1790695, 1761787, 1682150, 1645640, 1583573, 1593710, 1649762, 1621291, 1548305, 1479631, 1491397, 1535059, 1487153, 1408691, 1309044, 1254841, 1242479, 1275607, 1264727, 1264598, 1247504, 1216264, 1222059, 1208893, 1092583, 1087917, 1178001, 1178511, 1130972, 1059349, 1007786, 980914, 954657, 970366, 990144, 1017732, 1059082, 1019972, 962806, 928667, 972718, 1009762, 974308, 894221, 839386, 898302, 964447, 974969, 883173, 861134, 918791, 977528, 948338, 835226, 792753, 810334, 822366, 831666, 756239, 666607, 597229, 594384, 546156, 535426, 539979, 558681, 638030, 728288, 820642, 882621, 889320]
12215H89320l2603j5462M9675N6777J11841L3686l8900n5878k4793q5255m2413
12204H45995R6532Q1178N4406k1371q9020j7173j5027p8496m1453M3087R1311
12193I49969L0668Q4955M3449M1566L6161M5284M1262k2845J6729Q7196M4059
12182A398453K2991k403p8441m2005k6028k0244r914J5450m1539K1565J41456
12171A379341M0127l2514l2739n4771J5733j1243q3571k4977Q1424N1859J9213
12160A347882M2099o592m4256j6979k1572Q661P8893M3428p0458j0894Q1156M6700
12148A478068l0795J2171m8624k7189j3042n7488n7045P2576P3000P732K3330
12137A432694L4221J361m763L8438M0175R9070j5468o0835o6408j8099p72N8373
$$ y = [889320, 856717, 841255, 890930, 947707, 1059548, 1093234, 1054334, 998456, 973663, 888408, 845995, 942527, 1023705, 1078111, 1056740, 967720, 950547, 935520, 857024, 815571, 858658, 949969, 980637, 1065592, 1109041, 1150607, 1186768, 1232052, 1273314, 1250469, 1267198, 1354394, 1398453, 1421444, 1419041, 1340600, 1298595, 1272567, 1252323, 1242409, 1257859, 1216320, 1237885, 1379341, 1419468, 1386954, 1354215, 1299444, 1315177, 1303934, 1220363, 1195386, 1276810, 1328669, 1347882, 1389981, 1383389, 1339133, 1322154, 1300582, 1309243, 1388136, 1431564, 1361106, 1350212, 1431368, 1478068, 1447273, 1459444, 1410820, 1383631, 1370589, 1313101, 1256056, 1328632, 1401632, 1409364, 1432694, 1466915, 1468276, 1463513, 1501951, 1542126, 1641196, 1625728, 1564893, 1498485, 1480386, 1479614, 1537987]
12125A537987L4411P3362L211q75j6752J0467O5084J08250l0925k2700L9922Q2372
12113A883814j4081m500J2812L7374M6732L0366J06751J05498k7447P134m8418
12102B136035j21913j1346J23693M7113N4427M5643J9888k2336R3753P2755P974
12091B445686N3083j2670k2759j303P0071N6249m2283Q563k6936n8941k7012N9624
12079B501372P6763P6119Q0831P4262Q1094k84K3449M2851K5629P8533Q0044L2212
12067C172875j99N9086N2758L9307P746P4591M6002N4062j85M7300O5751Q9126
12055C708220K0575J2501J13696J51134K1948O465K7679P1839J34614P6150J00445
12044D445266J04152O6871k9662J6913Q5022K4567O2163J07988J39449N7209M4729
$$ y = [1537987, 1572398, 1645760, 1648971, 1648096, 1631344, 1641811, 1706895, 1815145, 1784220, 1761520, 1801442, 1883814, 1869733, 1865233, 1878045, 1915419, 1962151, 1992517, 2099268, 2204766, 2177319, 2184453, 2136035, 2014122, 2002776, 2126469, 2173582, 2228009, 2273652, 2293540, 2271204, 2364957, 2437712, 2445686, 2498769, 2486099, 2463340, 2462037, 2532108, 2588357, 2546074, 2554637, 2527701, 2468760, 2441748, 2501372, 2578135, 2654254, 2735085, 2809347, 2890441, 2890157, 2913606, 2956457, 2982086, 3060619, 3140663, 3172875, 3172676, 3231762, 3284520, 3323827, 3331573, 3406164, 3452166, 3506228, 3506043, 3553343, 3619094, 3708220, 3728795, 3741296, 3854992, 4006126, 4028074, 4034539, 4062218, 4134057, 4268671, 4344821, 4445266, 4549418, 4616289, 4586627, 4603540, 4688562, 4713129, 4775292, 4883280, 5022729, 5079938, 5124667]
12033E124667R1976M2219O4870J50629J16917P4888J06377J28920J47104L2561
12023F081128Q7674J85349J30387J0867m2479J47135J71394J52860J55715J57478
12013G237508J83268J03497J49939J74416J31685Q3166J07935K47715K08117K38089
12003H865335K44669J03257J72041K66454K73807J95430K87376K95887K32582
11994A0936838K15347J91216J46034K80805L11228K88849L10703K79501L40090
11985A3300611L13537L13919L48602L94646M32207M69152M09595M25784L95097
11976A6803150M14552M76204M74122M81304M94757M68490N18136N81841N98736
11967B1311292N83484O59616N96496O37009O71576O93861O30305O21951O71865
$$ y = [5124667, 5216643, 5258862, 5323732, 5474361, 5591278, 5666166, 5772543, 5901463, 6048567, 6081128, 6168802, 6354151, 6484538, 6495405, 6452926, 6600061, 6771455, 6924315, 7080030, 7237508, 7420776, 7524273, 7674212, 7848628, 7980313, 8063479, 8171414, 8419129, 8627246, 8865335, 9110004, 9213261, 9385302, 9651756, 9925563, 10120993, 10408369, 10704256, 10936838, 11152185, 11343401, 11489435, 11770240, 12081468, 12370317, 12681020, 12960521, 13300611, 13614148, 13928067, 14276669, 14671315, 15103522, 15572674, 15982269, 16408053, 16803150, 17217702, 17693906, 18168028, 18649332, 19144089, 19612579, 20130715, 20712556, 21311292, 21894776, 22554392, 23150888, 23787897, 24459473, 25153334, 25783639, 26405590, 27077455]
11958B7077455O87279P60572P94045Q15229Q44203Q43998P99743Q34149Q85375
11949C4342048Q45284Q26930Q39615Q55101Q80220P90247P83388Q09359Q55942
11940D1828134P32859O43729N77762N58495N96387N47103M38023M46110M49579
11931D6818181K92972R6591P0299M8437M6067n7495j66155k93275l15817k91345
11921D6248460m06212m73372n30224o46517n94916o39902o40441o17107p00831
11912D0998938p69494q12230q36670q43990p60662p79770p11287o86608o71932
11903C4126295o51348n39644n57311n75620o23560p33258q15941q18854r22701
11894B7888058r43947r21432r14669r03644p41134p63792p31492o89557o14346
$$ y = [27077455, 27764734, 28525306, 29319351, 30134580, 30978783, 31822781, 32622524, 33456673, 34342048, 35187332, 36014262, 36853877, 37708978, 38589198, 39379445, 40162833, 40972192, 41828134, 42560993, 43204722, 43782484, 44340979, 44937366, 45484469, 45922492, 46368602, 46818181, 47111153, 47207744, 47278043, 47326480, 47372547, 47315052, 47148897, 46855622, 46539805, 46248460, 45842248, 45368876, 44838652, 44192135, 43597219, 42957317, 42316876, 41699769, 40998938, 40229444, 39417214, 38580544, 37736554, 36975892, 36196122, 35484835, 34798227, 34126295, 33474947, 32935303, 32377992, 31802372, 31178812, 30445554, 29629613, 28810759, 27888058, 26944111, 26022679, 25108010, 24204366, 23463232, 22699440, 21967948, 21278391, 20664045]
11885B0664045n90999n56105n78368n11810n23742n28573m99988n80140m14675
11876A5879645l76153m02511l92470l82465l70776l50994m72524l10647k59937
11867A2561168l09544l21996k39361k80840k88124k22732j95710k60196k22336
11858A0220329j79120l14874l16541j57981j31161j23541j74836k52450j89833
11849H379992j32822j40637k07426j52055j21403j72930j78332k07517j75778
11840F891092j89896k04675j77033r8040j08669o9539j00912q9773r0310o4745
11830E697500j23619k01460j41591l3962r9008n6728m2251p5243j36294j18045
11820D669299p2238j14906j15789o2241j09024o1594l635K7043j20437j10013
$$ y = [20664045, 20073046, 19516941, 18938573, 18426763, 17903021, 17374448, 16874460, 16294320, 15879645, 15503492, 15100981, 14708511, 14326046, 13955270, 13604276, 13131752, 12821105, 12561168, 12251624, 11929628, 11690267, 11409427, 11121303, 10898571, 10702861, 10442665, 10220329, 10041209, 9726335, 9409794, 9251813, 9120652, 8997111, 8822275, 8569825, 8379992, 8247170, 8106533, 7899107, 7747052, 7625649, 7452719, 7274387, 7066870, 6891092, 6701196, 6496521, 6319488, 6221448, 6112779, 6043240, 5942328, 5852555, 5762245, 5697500, 5573881, 5372421, 5230830, 5196868, 5097860, 5041132, 4998881, 4923638, 4787344, 4669299, 4597061, 4482155, 4366366, 4304125, 4195101, 4133507, 4129872, 4156915, 4036478, 3926465]
11810C926465o6540n9226m3461r2418l3073j3533p004K1274l3595r3863n5350
11799C449676j06893j11034m464k7336r3312K2208q620j4764o7425n7772m0301
11788B939963n3327O79n3798l1506p0932j2595R106p1851j18438j18686o7463
11777B351152J5725M3682K1680p2449n2422r8351l9928p021m321m7769k7176o8452
11765B014350q0552O1018O2972n7104L6909J1459n4729l8330n8670J9874n3085
11754A864112k5395n4232n6748j7353j1613K3746k9429k272j8980L491k5113o0155
11742A590059l9914m361j1071m3112j2993l1118q372L6017K3097o8609K693l6671
11730A395645K6654L7024n6949p5891l1224K9223N1613j7957k6194r3277l0112
$$ y = [3926465, 3859925, 3800699, 3757238, 3664820, 3631747, 3618214, 3611210, 3632484, 3598889, 3505026, 3449676, 3342783, 3231749, 3227285, 3199949, 3106637, 3128845, 3120225, 3105461, 3038036, 2980264, 2939963, 2886636, 2887315, 2833517, 2802011, 2731079, 2718484, 2727590, 2655739, 2537301, 2418615, 2351152, 2366877, 2410559, 2432239, 2359790, 2307368, 2209017, 2169089, 2162068, 2157747, 2109978, 2082802, 2014350, 1933798, 1994816, 2057788, 2000684, 2037593, 2049052, 1994323, 1955993, 1897323, 1917197, 1864112, 1838717, 1784485, 1727737, 1710384, 1698771, 1722517, 1693088, 1690816, 1671836, 1675327, 1650214, 1590059, 1550145, 1545784, 1534713, 1491601, 1478608, 1447490, 1439118, 1475135, 1498232, 1429623, 1432316, 1395645, 1422299, 1459323, 1402374, 1326483, 1295259, 1324482, 1376095, 1358138, 1331944, 1238667, 1208555]
11719A208555J0864o996K830j5947K5706N1814m0882j1311q502n6161o3303K5698
11707A122365j5724M2149J4859n1198L1574L4048k7632o8708K8086j0510m7822
11696A051487J6735q469N2298j1128p0461n5683J6223J0454j8200k8901l2480
11685I21875O960m5849J1815P664m7322L9533N7302m9776r0844o2030L1464N1256
11673H32048K1892K0207K871N1088j11831k9083N2546L0635R515L4436j9621n4783
11661H39920j3767K266k3765p3098j3656j1734J02677m6980j8302m0775K7752
11650G30538m6576m5085J2331P4139O7210K8117q3210j03201l755O9635N0151
11639G50294n3964k8508j4686M3389J0523K8456L1546m3995l0095l9449n4604
$$ y = [1208555, 1219419, 1212423, 1215253, 1199306, 1225012, 1276826, 1235944, 1224633, 1216131, 1159970, 1096667, 1122365, 1106641, 1148790, 1163649, 1112451, 1144025, 1178073, 1150441, 1081733, 1109819, 1099309, 1051487, 1068222, 1059753, 1112051, 1100923, 1030462, 974779, 991002, 1001456, 983256, 954355, 921875, 928835, 882986, 894801, 902465, 855143, 894676, 951978, 902202, 811358, 749328, 780792, 832048, 853940, 874147, 877018, 928106, 816275, 787192, 839738, 870373, 879888, 914324, 894703, 839920, 826153, 828419, 804654, 731556, 717900, 706166, 808843, 761863, 743561, 702786, 730538, 683962, 638877, 651208, 725347, 792557, 820674, 737464, 634263, 630508, 700143, 750294, 696330, 667822, 653136, 696525, 707048, 735504, 767050, 723055, 692960, 653511, 598907]
11628E98907K9904O9200q3431m9065K003j041R063R653j9504l453J9461J7719
11616E99416K2995r748n3047l4461M181Q945K713K2479N4289n5750R500j8101
11604E53411K46K5691j1898k3638m6627J5502L6760m809p4253K8735P0316K0690
11592E90126m9722l4081j1793m6577M1603j5343k7386n3959q7365R007K6819L2445
11580C73774N6756q347q2296k5462J2477m4631k4345N9574N2578L7924K2689K3251
11568D53942m351p045j88j9366j6715o1521o8000j7530k1015P5162K3349O887
11556C43609L2815n057L3222J2868m0807j3612N0079N6419p3435p8072m0886P8735
11544C55878N7545j2631j8416L2431n942j6113m7277P773j2125J6381M2262m7482
$$ y = [598907, 628811, 698011, 614580, 565515, 567518, 566477, 575540, 585193, 565689, 562236, 581697, 599416, 622411, 612663, 559616, 525155, 529336, 538281, 540994, 563473, 617762, 562012, 571512, 553411, 553657, 579348, 567450, 543812, 497185, 512687, 549447, 544638, 470385, 499120, 569436, 590126, 540404, 506323, 494530, 447953, 489556, 474213, 446827, 392868, 305503, 314510, 341329, 373774, 430530, 422183, 339887, 314425, 326902, 282271, 257926, 317500, 370078, 408002, 430691, 453942, 449591, 442546, 442358, 422992, 406277, 344756, 276756, 259226, 238211, 313373, 336722, 343609, 376424, 371367, 404589, 417457, 376650, 363038, 413117, 469536, 396101, 318029, 277143, 355878, 413423, 400792, 382376, 414807, 408865, 392752, 345475, 353248, 341123, 357504, 399766, 352284]
11532C52284j4058O2170k5263o8578l3318J2384P1163J8158j0107l2132L4605
11521C67308k6322j3812M3798M7807j8513M0737J7382o1462q362k9495L4452n824
11509C87694O266K0891j0454m4929L011l9225K1494m8842m076l7664n711J6275
11497B64730p220J10044N7506l4899j5602p595q1912J2669n9388o6797J2082k3340
11485A60278O1264Q2664n2335k5391J4049M7596M6353p7047q6743N9834P7519
11474C08041O9029J0131l5810q4168o2338M0306M3746l8688J6653N1113o742J4487
11462C25760k328k6167k5645k0698J9196q302r7120k2694M5360q157L8220P641
11450B25066m4063j7774N2009m461j9854k0742l094J2647J43L5817k782p2092
$$ y = [352284, 338226, 400396, 375133, 306555, 273237, 285621, 356784, 374942, 364835, 332703, 367308, 340986, 327174, 370972, 418779, 400266, 441003, 458385, 396923, 388561, 359066, 393518, 387694, 393960, 414851, 404397, 359468, 362479, 323254, 344748, 295906, 291830, 254166, 248455, 264730, 257510, 367554, 425060, 390161, 374559, 366964, 285052, 297721, 238333, 171536, 183618, 160278, 221542, 304206, 251871, 226480, 240529, 288125, 334478, 257431, 170688, 230522, 308041, 377070, 387201, 351391, 267223, 204885, 245191, 288937, 250249, 266902, 318015, 311273, 325760, 323432, 297265, 271620, 250922, 270118, 261816, 164696, 142002, 187362, 179205, 217425, 225066, 181003, 163229, 215238, 210777, 190923, 170181, 167087, 179734, 179877, 215694, 212912, 140820]
11438A40820o3286j7003O8824M1450k0733m4208L9473O9321M1061m8862k8195
11427A78662k1449m2331k0997L8351K5832k4972l4625L7468K4740O2844R1718
11416C15241k1132n7384p0761n9547m2096K5517R1294m145o1739M5408M0617m5583
11404A55690k6824n7392J5610J25164L0888k7430p0069M0043P7317M9155m2735
11393B69417k3858N012k4475L8821l6311j2831K8316j3002o1145j9344m5251l2593
11381G2756P3472L3334k9614l1468o989j6087j227l8193j5730J4093k5385J3819
11369D2781M2119j6172j8788j3165N653N0462R1739o698K3581K3003p0867j4784
11357A38864l0738O8581L2793k2934j804K3213J4671j6536k8594o1270k7431M7911
$$ y = [140820, 77534, 60531, 129355, 170805, 150072, 105864, 145337, 214658, 255719, 206857, 178662, 157213, 114882, 93885, 132236, 158068, 133096, 98471, 135939, 160679, 223523, 315241, 294109, 236725, 165964, 106417, 64321, 89838, 181132, 176987, 115248, 160656, 201273, 155690, 128866, 71474, 87084, 212248, 243136, 215706, 145637, 185680, 262997, 312152, 269417, 245559, 250571, 226096, 264917, 228606, 215775, 244091, 231089, 169944, 150600, 105349, 72756, 146228, 179562, 149948, 118480, 111491, 95404, 94177, 55984, 40254, 54347, 28962, 42781, 84900, 68728, 49940, 36775, 42428, 92890, 184629, 177931, 201512, 224515, 153648, 138864, 108126, 176707, 209500, 186566, 184762, 207975, 222646, 206110, 177516, 116246, 88815, 136726]
11345A36726N126n8853P717j6885L4342O7056l9719K2732M5001j4650p5322r3842
11333A9429r457K2281j6672K7393J9207K2928R485k6111n7573P105R921N5096
11321H3032J2372j2149J90l1816j7403J3031L5412J465L067P2639K2421n2182
11309A30079m3574l3622K331Q2228N3112R606J0442p7385o3907o8864l032N3611
11297E1025N8663j0659l9528l4599K1423K5913k4157l20k5365j4970K1433L5318
11285F4177l615O463J6953L2610K1723r092l0466J3767O427r084M8841O5177K5373
11272B49254k0767j7004o6804k3905N1507o2482n0337m917Q2466M6025n1162k1686
11260A10188k802K5272O0510k4522l2903o044N4613j6268k0597n1697l7001R4232
$$ y = [136726, 141852, 82999, 90716, 73831, 108173, 175229, 135510, 158242, 203243, 188593, 113271, 19429, 9972, 32253, 15581, 42974, 62181, 85109, 94594, 68483, 10910, 18015, 27936, 83032, 95404, 83255, 83445, 51629, 34226, 47257, 82669, 84134, 87201, 159840, 182261, 130079, 86505, 52883, 55214, 137442, 190554, 200160, 210602, 133217, 69310, 446, -2586, 51025, 109688, 99029, 59501, 24902, 46325, 72238, 48081, 47761, 22396, 7426, 28859, 64177, 60562, 67025, 83978, 116588, 138311, 129219, 98753, 112520, 118947, 109863, 158704, 223881, 249254, 228487, 211483, 144679, 120774, 172281, 109799, 59462, 54545, 137011, 183036, 131874, 110188, 107386, 132658, 193168, 168646, 135743, 129699, 184312, 168044, 147447, 95750, 58749, 152981]
11248A52981N3007q418J9127J5474m4462l7723R5397l7114r7429n6669j635O0754
11236A13290L3035k5248K5982l6914j6617K3277n3395j3818j2648M7632J5909
11225A00485P2614Q844K5799r8676l4590M37n0016M7347K0929k0351J04606N2069
11213B29497m7274j8998O3740k6019p0175o4744O5776J8890m0111n8928n8913
11202g259j1008P7341L0232k9024m603P4480R567q237l9934n0647J690j3069M2609
11189G2138N9277l4281q2928L173L9450j6074P736K5709L8573k341L875m342j6054
11176I3911M8517j693n694Q986k6952o6854k2797J3992J73M0901N2450j903n5931
11163G7106m8536M9404R3404J0841q33j6489o5814o0055k0837N4815L8316J6513
$$ y = [152981, 205988, 197570, 216697, 232171, 187709, 149986, 245383, 208269, 110840, 54171, 52536, 113290, 146325, 121077, 147059, 110145, 93528, 116805, 63410, 49592, 36944, 84576, 100485, 173099, 181943, 207742, 109066, 74476, 74913, 24897, 72244, 93173, 72822, 177428, 229497, 182223, 163225, 226965, 200946, 130771, 66027, 131803, 150693, 110582, 51654, -7259, -18267, 59074, 89306, 60282, 55679, 130159, 139726, 131489, 91555, 40908, 42598, 29529, 72138, 131415, 97134, 14206, 17379, 56829, 40755, 48491, 74200, 112773, 110432, 114307, 109965, 93911, 142428, 140735, 135041, 144027, 117075, 50221, 27424, 41416, 41589, 82490, 134940, 133037, 77106, 28570, 77974, 171378, 182219, 181386, 164897, 99083, 39028, 18191, 73006, 111322, 127835]
11151A27835j3812j1897m7579m5885L9264O7860R3016l728n4901l46l3687o1300
11139E4840J204M9872K1716j9541p5618l5558K8524k2144m7303P8548L7293k287
11127F9546p6930j0608j1373M6411K9596N6394M4920j8020l0471o5785m0617K9841
11115B2904M7158M5713l6385q9605M8758k6042M0004n4047n9997N8377N753k4950
11103b2359N190m6088k0550J06941P5130L5867l0413m7198l0705N6414l13K2635
11091A04551o733k8170j8061L4627r00j966k2464j9164P305J7500n152m0150K0360
11078D1583m7889l1674L4510L7445O2915l5902L736M1860j5420m3554m8502m4417
11066d5309p0374J2884K3062j1788K6032O3503P4773M2922m2602m2782L2394M969
$$ y = [127835, 114023, 102126, 54547, 8662, 47926, 115786, 208802, 205074, 150173, 149827, 116140, 54840, 56044, 105916, 127632, 108091, 32473, -3085, 25439, 3295, -44008, 34540, 71833, 69546, -7384, -17992, -29365, 17046, 46642, 103036, 147956, 129936, 99465, 33680, -6937, 22904, 70062, 115775, 79390, -10215, 38543, 12501, 52505, -1542, -61539, -3162, 2591, -22359, -17169, -63257, -83807, 23134, 98264, 134131, 103718, 56520, 25815, 82229, 81916, 104551, 97818, 69648, 51587, 86214, 85314, 83348, 60884, 41720, 49025, 66525, 61373, 21223, 41583, -6306, -37980, -3470, 33975, 96890, 60988, 64724, 106584, 91164, 47610, -892, -45309, -115683, -102799, -79737, -91525, -65493, -1990, 72783, 115705, 73103, 30321, 62715, 67684]
11054F7684m9677N213j3600P364J40926J18772L7678l9569N6599O828l0885m1525
11042B65808L3739k1478Q873Q5960J22036P6428J9668N2087K5693q8359m6263
11031E34192m0990m1254M853J7259R9181J26759R4639P5284r114r123p5232j01174
11019F75280r6510p4410j3214K4295P0281J1413K4311q746N0792J6795l8490n4095
11007E87702r4801j35341q4743P211m7168k9019L1888M1126J460l8345N5808P7446
10995C73224o6603j04355k5003j721l3724l1847R5551j6082n7827l6942q018J5954
10983A02607l495q905o0356j9168l0720N372q259p822R8344J6422J1705k4946
10971G0779M1597K696l7842N0817L4182j3971n9781n9905J764k4897L5222O0372
$$ y = [67684, 18007, 23220, 9620, 16984, 157910, 276682, 314360, 274791, 331390, 338218, 307333, 265808, 299547, 278069, 286942, 372902, 494938, 571366, 591034, 643121, 668814, 580455, 534192, 493202, 451948, 456801, 474060, 573241, 700000, 794639, 869923, 860809, 851686, 776454, 675280, 578770, 504360, 491146, 515441, 585722, 597135, 621446, 612700, 663492, 680287, 641797, 587702, 492901, 357560, 272817, 280028, 232860, 203841, 235729, 276855, 278315, 239970, 295778, 373224, 306621, 202266, 177263, 175542, 141818, 109971, 205522, 189440, 131613, 94671, 86653, 102607, 99112, 90207, 29851, 10683, -20037, -14665, -22924, -30746, 67598, 84020, 95725, 70779, 112376, 115072, 77230, 128047, 162229, 148258, 88477, 28572, 30336, 5439, 40661, 101033]
10959A01033k0683o941K873r291M0092m9770q4422k1627K9546O1184M7577l380
10947H6191K1957o1766n1959J830K771K8387J902J8738j6779l1788M4673O9457
10935A13614K3711k417n0984J6693j8915L854j9693J6416O3931l9726n1210n7089
10923a815j654J4978M1797L4096k2184p7989O1123M6527m1451m8306J8263j8479
10911D906K1913J2384k5647l6734J9912J5541J525j9208m6229L12P2836Q6310
10899A07821m9012n4094K7871K9614k6743k5664j5117M875K2819K9625m53J7988
10887F9530r250K4762L7110K9801k9519m7523o5303j6814j5112O181j0578P682
10875a9033J6338N8351L6072J3999j6925o014k2452L4629j3378O552J7m9396n562
$$ y = [101033, 80350, 73409, 76282, 66991, 107083, 57313, -27109, -48736, -19190, 41994, 89571, 86191, 108148, 46382, -5577, -3747, -976, 27411, 29313, 48051, 31272, -516, 44157, 113614, 137325, 134908, 83924, 100617, 81702, 85556, 65863, 82279, 146210, 106484, 55274, -1815, -3469, 11509, 53306, 87402, 65218, -12771, 48352, 94879, 53428, 5122, 23385, 4906, 26819, 39203, 13556, -23178, -3266, 12275, 13800, -5408, -51637, -51325, 21511, 107821, 58809, 4715, 32586, 62200, 35457, 9793, -5324, -449, 22370, 51995, 51542, 69530, 60280, 85042, 122152, 151953, 122434, 74911, 9608, -7206, -22318, -16137, -26715, -19033, -2695, 55656, 91728, 105727, 88802, 82788, 60336, 94965, 81587, 88139, 88156, 38760, 33198]
10862C3198K7186Q0146O9936P205o4192k1091l3543j3364L4335J8286J1974k6378
10850A23698K7522m2141J7181J8790m0327k84J3848j9843J792K5896j4228o528
10838A05376J688K4923k8230j71K1994K1468L7838J808o2462l6877M8729N7090
10826A93174k0695o5253q737J9969L9529j6604J8767J8010o0043n6213J9705l5599
10814D6010r4762n4556L8954N3757J6228M6078K0899J9485j1329J9398M1259k429
10802A38992k0891n2106m5126k0873K7209P7649L8608O978l2894J3847j1005m8859
10790G1529M0058J15331n3681p1996k4031j2460l818o664M8262N307k7222j0679
10778F9936m4176K4899J12477l2431m4952o033J2901K578k0236k6020l4520l4666
$$ y = [33198, 60384, 140530, 210466, 217671, 153479, 132388, 98845, 85481, 119816, 138102, 150076, 123698, 151220, 109079, 126260, 145050, 104723, 104439, 118287, 98444, 100236, 126132, 111904, 105376, 107064, 131987, 103757, 103586, 125580, 147048, 184886, 186694, 124232, 87355, 136084, 193174, 172479, 107226, 98489, 118458, 157987, 141383, 160150, 178160, 118117, 61904, 81609, 46010, -48752, -103308, -64354, -10597, 5631, 51709, 72608, 92093, 80764, 100162, 141421, 138992, 118101, 65995, 20869, -4, 27205, 104854, 143462, 150440, 117546, 131393, 120388, 71529, 111587, 226918, 173237, 101241, 77210, 64750, 60932, 54268, 102530, 107837, 80615, 69936, 25760, 50659, 163136, 130705, 85753, 79720, 92621, 95199, 74963, 48943, 14423, -20243]
10766b0243L1361O583M5643L7611m164j0743l1368j131l2093p34k751L3071l213
10753D7829j1660N2963q814Q18J1921j0737M1746P6524J4291q1303m5527P0853
10741A58904L6538N1004j0394L536j0870N221k2251l1592m3027N37J5610o344
10729A46872Q7320O1259J793m009q4291k3022L2065j1742M2143O7857K2541k4530
10717C14256K4772R103J5904L3968m604K9551n5282m8741k028K5148L4065K5858
10705D01970l1234k9464n6107j0673o0977K0347j6384l4513L648N9392L0047O1765
10693C37817N9018o5989p6603m046M7692N9543l7531L4383K0339K4672P2677N6702
10681E28674k8434q5444l8769l2550K0648k6198k3055M1067M5800k6484q0611
$$ y = [-20243, 11118, 17701, 63344, 100955, 96791, 86048, 54680, 53549, 21456, 20722, 17971, 51042, 47829, 36169, 89132, 80318, 81136, 93057, 82320, 124066, 200590, 214881, 133578, 88051, 158904, 195442, 246446, 236052, 239588, 228718, 233939, 211688, 180096, 137069, 137606, 153216, 146872, 234192, 295451, 297244, 293235, 208944, 185922, 217987, 206245, 248388, 316245, 338786, 314256, 339028, 348131, 364035, 398003, 393399, 422950, 367668, 318927, 316899, 342047, 376112, 401970, 370736, 341272, 285165, 274492, 213515, 233862, 217478, 182965, 186613, 246005, 276052, 337817, 396835, 330846, 254243, 250197, 297889, 357432, 319901, 354284, 374623, 399295, 471972, 528674, 500240, 414796, 376027, 343477, 364125, 337927, 314872, 355939, 401739, 375255, 294644]
10670B94644M7987O6213J9848J6045j5913l4609m9322m692K1426K3000P8417J30667
10658E93711J07194K5797P2924r65k3632j3809K3474J11306j172m0381L4017K0234
10646I08698K9820J8668J5861O38P4062R8261J07541J55681J87477J27659K32988
10635A957354L45971L88184L83723K57363K01613K01888L27737M31762N95796
10626E091391Q45673J183259J718299K464733L413722M633666O151291P799186
10618C3301220Q295409O161784J945840j808879l522222l023869j269633J111555
10610D1191205M068182P738270J2146733J6307766J7196994J1044180k50522r215795
10602A00227013j2055823j0106582n875377r46207M331807J0198002J6417810
$$ y = [294644, 342631, 408844, 428692, 444737, 428824, 394215, 344893, 340201, 361627, 384627, 463044, 593711, 700905, 726702, 799626, 798661, 775029, 761220, 784694, 896000, 894828, 854447, 888464, 908698, 938518, 957186, 973047, 973685, 1047747, 1146008, 1253549, 1409230, 1596707, 1724366, 1957354, 2303325, 2691509, 3075232, 3332595, 3534208, 3736096, 4063833, 4495595, 5091391, 5937064, 7120323, 8838622, 11303355, 14717077, 19350743, 25502034, 33301220, 41596629, 47758413, 49704253, 47895374, 44373152, 41349283, 40079650, 41191205, 45259387, 52997657, 65144390, 81452156, 98649150, 109693330, 109442808, 100227013, 88171190, 78064608, 72189231, 71243024, 75574831, 85772833, 102190643]
10595A02190643K1661543K1387085J0547507o573711j8484137k1291849j7953506
10588I1483575j2221901o407398r92909M112224Q875551J2175269J0972295K831656
10580A10828362q428955j5639704j6556564j3356877r062956n205916k065415
10573D0511975N38461K600124L627742K510699j056976n287091p659642p902753
10565B7882539o735994n148831l739993k588560j921376j369347j062204p47207
10557D569027n79807n20409m04499l53520l39204k88249k04436j25925j35430
10548A617548j78811j07874j39287j82952O801l4515m6411l9816j10891n2895
10538G30897j5433k7709k1076m9941P4437k2139j7845n3047j37467n5925M2318
$$ y = [102190643, 123852186, 145239271, 155786778, 149213067, 130728930, 109437081, 91483575, 79261674, 72854276, 71861367, 75973591, 84849142, 97024411, 107996706, 110828362, 102399407, 86759703, 70203139, 56846262, 47783306, 42577390, 40511975, 41050436, 43650560, 47278302, 49789001, 48732025, 43444934, 35785292, 27882539, 21146545, 15997714, 12257721, 9669161, 7747785, 6378438, 5316234, 4569027, 3989220, 3468811, 3064312, 2710792, 2371588, 2083339, 1878903, 1752978, 1617548, 1438737, 1330863, 1191576, 1008624, 1015425, 980910, 934499, 894683, 783792, 730897, 715464, 687755, 666679, 616738, 691175, 669036, 651191, 598144, 460677, 404752, 447070]
10527D47070J6953l0393O308k9666k9588J2600n1382m4974o7461J5295n458P1044
10515C10348O5158k4252n9103m168N8558q906j13140l5978n9233j8762M8548J8377
10503A77447p309k0270j7297r692O997l1339L3698J0031n1601k5551n113k5335
10491C4666O015N480K7793m8344j00159N0850J2803M3621R126l6080q4782m9548
10479a28559J6625J9485k5478k0323O1280L9395N7614J8569J3858L5645k3954
10468F4157n0805m2899j4893j7272n1782r6339P3918N2636J2353R1100J4208j47651
10456a13269J7663J9815J6554Q588N3829N6423q306J9566j349k8096l6734l2950
10444b8266K4340k1148j9636n6147k1106L9381P0999M1193K5825J8960m2615n6175
$$ y = [447070, 464023, 433630, 439938, 410272, 380684, 393284, 341902, 296928, 229467, 244762, 239304, 310348, 375506, 351254, 292151, 287983, 346541, 337635, 224495, 188517, 129284, 110522, 159070, 177447, 170138, 149868, 132571, 122879, 129876, 98537, 132235, 142266, 90665, 65114, 60001, 34666, 40681, 46161, 73954, 25610, -74549, -23699, -10896, 32725, 41851, 5771, -79011, -128559, -111934, -92449, -117927, -138250, -76970, -37575, 20039, 38608, 52466, 88111, 64157, 13352, -29547, -44440, -61712, -113494, -209833, -135915, -83279, -70926, 20174, 34382, -113269, -95606, -75791, -59237, -50649, 3180, 59603, 51297, 70863, 69514, 41418, 4684, -28266, -3926, -25074, -44710, -100857, -121963, -82582, -11583, 29610, 55435, 74395, 31780, -24395]
10432b4395k7507q867L3006R352q1000O7564M8839k5423r317L8239j088P4239
10420I3642j1114m193J6358N2865k8306p7807J3131n2021k0938K1596J09687L3994
10408A46894m9617p7381k511K1553l0338n1389l8650K5302L3173J04q6387j621
10396a10868k5899Q5K344M6415M1460K5248L1260J281k4524L6992L5989k2773
10384C7010K4718o5488n2922Q3503q474n2541L1041K436l1697j8952R276l4O816
10371c5308l3331P3626J43648N2320j7456q7433m4851R483K6762j682N711o8608
10359B2881j5746m1375M3728K4548m2212q2241l8850Q9898M4805M5672J0272l2620
10347B8760n0721L7876q2480n5539L0745R0678O7648k3280L92J523n4227K9393
$$ y = [-24395, -51902, -60769, -27763, -18411, -99411, -31847, 16992, -8431, -17748, 20491, 19403, 93642, 82528, 78335, 94693, 147558, 119252, 41445, 54576, 2555, -18383, 3213, 112900, 146894, 97277, 19896, 17385, 38938, 8600, -42789, -81439, -56137, -22964, -22860, -109247, -110868, -136767, -136682, -134338, -87923, -46463, -21215, 10045, 11326, -13198, 23794, 59783, 37010, 61728, -3760, -56682, 26821, 18347, -34194, -3153, -717, -32414, -51366, -42090, -42124, -35308, -68639, 4987, 148635, 200955, 183499, 96066, 51215, 60698, 87460, 85778, 91489, 22881, 7135, -34240, 9488, 34036, -8176, -90417, -129267, -39369, 5436, 51108, 61380, 28760, -21961, 15915, -66565, -122104, -91359, -681, 66967, 43687, 44079, 45602, -8625, 20768]
10335B0768N2316l1601L8660j7373q106k4105K7533P045k5879l358J3127k421
10323D6606K3284k6175m533P2636Q8388N642m3214n1132j2702n2026m2952r813
10311e991j8403j9133L7591K4232K3674n692r7075m0038O0074O5092k4443j6166
10299a6278N2522m9349j4551M5705L7192o3528Q260n479l6763K061K0483k2359
10287d2084P941L8966L695j7781M680N7471L6258M576J8428P384k6716m0287o6097
10274a3566m851N332N8289O3126K7168l0248j05448o2523k8432K9015L5506L1184
10262D552r7581L823P5125k0702k7982j8171k175O390L1304L2071P4683K1598
10250H2935k1398r082J7026m8882p1294J1911l4723j9038l2518N4435Q2026J825
$$ y = [20768, 73084, 41483, 80143, 62770, 54664, 30559, 58092, 65137, 39258, 35900, 49027, 46606, 69890, 43715, 39182, 111818, 200206, 205848, 162634, 111502, 98800, 46774, 3822, -5991, -24394, -43527, -5936, 18296, 41970, 36278, -60797, -100835, -40761, 24331, -112, -16278, 36244, -13105, -27656, 18049, 55241, -8287, -27, -5506, -42269, -40208, -19725, -42084, -34143, 4823, 8518, -9263, -4583, 52888, 89146, 93722, 112150, 119534, 92818, 52531, -13566, -18417, -13085, 45204, 108330, 135498, 105250, -198, -62721, -91153, -62138, -26632, 4552, -93029, -89206, -14081, -34783, -62765, -80936, -83111, -76721, -45417, -13346, 61337, 82935, 61537, 52455, 69481, 20599, -50695, -38784, -73507, -92545, -125063, -70628, 11398, 13223]
10238A3223o2436n2390j8332M9305M6482J0100r165R481l2793p0659J0685l0544
10226a37043j1687O3211L7286M128l4321J9859L0886j411Q158k8005J3729k6653
10214f1863L0495M0600n6551k6856K0753J9788m1823r984L0856j6074j1154K9598
10202e2215n4543k598L541P1590J4006J8292q6781M8193O0906n1606k6917O4716
10190F584K2105l4207L4012k3389J7636M0625Q8589P3233R905m3680l8707O9329
10178B22035K1697k0356L1921J2807j7998J2060O1929N0750J37836J50258P1198
10167G34137p4593j84234j18611k6245L5345M8928O7101M8770J08121Q4314L1816
10156G54849L6704m4445j15715r3664p315l1516o1820q6781J6658O3537Q0215
$$ y = [13223, -49213, -101603, -119935, -70630, -24148, -14048, -23213, -13732, -46525, -117184, -106499, -137043, -148730, -85519, -48233, -44105, -78426, -58567, -27681, -29092, -20934, -48939, -35210, -61863, -31368, 9232, -47319, -74175, -53422, -33634, -75457, -85441, -54585, -70659, -81813, -52215, -106758, -109356, -105815, -34225, -20219, -1927, -88708, -40515, 20391, -31215, -58132, 6584, 28689, -5518, 28494, 5105, 22741, 63366, 151955, 225188, 235093, 191413, 152706, 222035, 243732, 223376, 255297, 268104, 250106, 262166, 324095, 374845, 512681, 662939, 734137, 659544, 475310, 356699, 330454, 365799, 414727, 481828, 530598, 638719, 723033, 754849, 791553, 747108, 631393, 537729, 530414, 498898, 437078, 350297, 366955, 430492, 510707]
10145E10707M6637l8627r4276n9463o0709n1910l2236n9514k8964M7737P8937
10134B58319O1170O3750k7235r2298r0875k7263n6230n4572m6796m6898L3767
10123b5161L7418j5910l3916o3991j5206m885k9802K5844J38958M9265l430l3336
10111B5848l2769K7123l9544l9025J5518l1670n410O3762L4841j6517l7999k7194
10099f3036L9739N1791j3486j2343k455K4o4041p5238l47P8409O1180o1623p502
10086f8928l246L6808o3068J6095O5710K4412m1105k0741l3518J0836Q9659L1653
10074D4567j9970o8124j0961j0417L4678J727m2397J5672K1286j5683J8057K0520
10062a1045k228j9526l9712o8103n492J7542R2768M2121n2585P639L9717r126
$$ y = [510707, 557344, 518717, 424441, 364978, 304269, 252359, 220123, 160609, 131645, 179382, 258319, 319489, 383239, 356004, 263706, 172831, 145568, 89338, 34766, -12030, -58928, -25161, 12257, -3653, -37569, -101560, -116766, -121651, -151453, -125609, 13349, 62614, 59184, 25848, -6921, 20202, -19342, -58367, -42849, -74519, -79929, -16167, 18674, 2157, -35842, -63036, -23297, 28494, 15008, 2665, 210, 234, -63807, -139045, -139392, -60983, 197, -61426, -68928, -72174, -35366, -98434, -82339, -16629, 7783, -33322, -54063, -87581, -76745, 12914, 44567, 24597, -43527, -54488, -64905, -30227, -28500, -70897, -55225, -33939, -49622, -31565, -11045, -13273, -32799, -72511, -140614, -146106, -128564, -35796, 6325, -46260, -38621, 1096, -8030]
10050h030J0514m487k8585l1206l7633k6307J5457P3360j0233l4090k1540J8382
10038h4398l827j973K0056q078q952O2546P6248J160l9300m1888k1534K9687L3854
10025A3601j0734k4838l8232j8065l2473k3484j7658M6643L4033M7690N613J9140
10013A236l5898n442J4815J6970j4611O519P1845L8676j5601n5721l5250q6714
10001i9176j1308l405r357J9848L5741O9861K020n6078j11794R94O5253Q2590
9989a4811j787l8664L935l7156l452J3985l6928L5207M9307o974J0440K3183o5593
9976f9308o719j6574M6140N1321p698J9880M200L268n351o7908m8732N1638r2600
9963a38443J9476L328O1540M1450J3898l4055m4205l7886J1191J7057K5274M1986
$$ y = [-8030, 2484, -2003, -30588, -61794, -99427, -125734, -110277, -36917, -47150, -81240, -102780, -84398, -88225, -90198, -70142, -78220, -87172, -24626, 51622, 52782, 13482, -28406, -49940, -20253, 13601, 2867, -21971, -60203, -78268, -110741, -134225, -151883, -105240, -71207, -23517, -17904, 1236, -34662, -40104, -25289, -8319, -22930, -16411, 55434, 94110, 78509, 22788, -12462, -99176, -110484, -113889, -123246, -103398, -67657, 2204, 4224, -51854, -163648, -162654, -97401, -14811, -16598, -55262, -51327, -88483, -91935, -77950, -114878, -79671, -30364, -37338, -26898, -3715, -69308, -76027, -92601, -46461, 4860, -2838, 17042, 21242, 24510, 19159, -48749, -97481, -45843, -138443, -118967, -115639, -54099, -12649, 1249, -32806, -77011, -114897, -103706, -86649, -61375, -19389]
9951a9389Q1722P6384l7633l6785l3771j1830n0837l6219K7432L0151J590j695
9939a0880k1388m4364l1622L2080N6675L1027j05101n4097O8085L3766J7861K8044
9927H6m3382k4112Q5500K8292k0717k6902m3719N1755L063k1848k4103l5361j9226
9914i0674m6164j8689M8490P7875L3821L9331L0343j018m6119q379l5682k0788
9902c7653m4948P701M9794L7229q329j8022O561k5771p9161k663M9271O0083k112
9889h020M468L4799k571r4360o1138N1660j5278m5398k5398p8783L0786L6767
9877a72466K2699L7018K2678K173j4296M089N3075O2777n0633o3164J7180Q3309
9865D439m4939o7787K7444P900p0454L1731P5249l315k2599k8504Q1317M5263
$$ y = [-19389, 62333, 138717, 101084, 64299, 30528, 18698, -32139, -68358, -40926, -10775, -9185, -10880, -32268, -76632, -108254, -76174, -19499, 11528, -93573, -147670, -79585, -45819, -27958, 86, -43296, -67408, 18092, 46384, 25667, -1235, -44954, 6801, 9864, -11984, -36087, -71448, -90674, -136838, -155527, -107037, -29162, 4659, 43990, 74333, 73315, 27196, 18817, -16865, -37653, -82601, -74900, -25106, 12123, 3794, -14228, -7667, -33438, -112599, -115262, -65991, -5908, -8020, -3552, 31247, 28676, -65684, -126822, -75162, -90440, -135838, -161236, -240019, -209233, -172466, -149767, -112749, -90071, -87898, -102194, -98105, -45030, 17747, -32886, -96050, -78870, 4439, -40500, -108287, -80843, -72943, -143397, -111666, -36417, -39732, -62331, -90835, -9518, 35745]
9853C5745m9238K1503l8515o5558M0805J4220L2578J6689j8272N0291L0579L453
9841G4280l2751L2907m6053m0012L4578Q8357k8834j7263L7320n9048n5870K271
9829a0118J9393k5863P195M0166J4186N867R2800J4965r6928j2230k2056N070
9817C2447J6664j7309M9198r151J0463l4962p3607j2140J5738K9628q637L026
9805A358J4262k3111Q0591N0208J7394m2711m2674p3962P338K7757L7827k8652
9793B5625o291J1286M4229J6567J5980J4979L7505J14668O2701N3647L18996N31589
9781A241481J004673J616702J614286M31320j041115j580718j306727q32873l82667
9772G64362k08889j09364q7681j35058p628k1370j12362o6628m0370q8236J4270
$$ y = [35745, -13493, 8010, -30505, -96063, -55258, -41038, -8460, 8229, -10043, 40248, 70827, 74280, 41529, 74436, 28383, -11629, 22949, 111306, 82472, 65209, 102529, 43481, -12389, -10118, 9275, -16588, -9393, 30773, 44959, 50826, 143626, 158591, 61663, 49433, 27377, 32447, 49111, 31802, 81000, 71849, 82312, 47350, -26257, -38397, -22659, 6969, -1668, 1358, 15620, -7491, 73100, 123308, 140702, 97991, 55317, -18645, -11307, 16450, 54277, 25625, 19334, 30620, 74849, 91416, 107396, 122375, 159880, 274548, 337249, 390896, 709892, 1241481, 2246154, 3862856, 5477142, 5908462, 4867347, 3286629, 1979902, 1147029, 764362, 555473, 446109, 358428, 223370, 215742, 194372, 82010, 15382, -24988, -113224, -98954]
9761i8954L5744M6075k7720J2767M4373N4444K5531J0262p0726o8231L1524p797
9749a2708j9423k7669k3224L4888P3709j7412m6260K8976j622K8153J347k7030
9737h275P4000N9112L8k4797J2595l0887j11417l8613O6572N9544m0924K0200
9725C7148N3663m7246k7063l9200k4213L415m3125j6204N1485N458j446k1873
9713f9201r060j0552M0345J3595n3894k2692M8648Q4295O8928m7022r9301l0799
9701h6710M0398L7636N9744K5408J1428p86k5179K7010J6653n7631o8716J2292
9689h453o7153R997K8438l601l619j0875L4330N6635k7748p766J5437j7118l5431
9676c6927O2759M801p1042Q860m202j281j3327M0872L7801n5087o0678K2010N8781
$$ y = [-98954, -63210, -17135, -44855, -32088, 12285, 66729, 92260, 102522, 31796, -36435, -4911, -12708, -32131, -59800, -83024, -48136, 25573, 8161, -38099, -9123, -10745, 17408, 18755, -8275, 65725, 124837, 124875, 100078, 112673, 81786, -29631, -68244, -1672, 57872, 16948, 37148, 90811, 43565, 16502, -22698, -46911, -43496, -86621, -102825, -51340, -45882, -47328, -69201, -78261, -88813, -48468, -34873, -88767, -111459, -62811, 21484, 90412, 43390, -55911, -86710, -46312, -8676, 51068, 76476, 87904, 87118, 61939, 88949, 105602, 47971, -20745, -8453, -75606, -65609, -37171, -40772, -44391, -55266, -20936, 35699, 7951, 185, 15622, -1496, -36927, 25832, 30633, -40409, -31549, -35751, -37032, -50359, -9487, 28314, -26773, -87451, -65441, -6660]
9663f660N5505K7578L6359k8142m6388R400L6856Q1668K66910L45410R3901j59218
9651G13179k08028j86893j31751j30897q5250J9482O741p6149L4146Q4370L1847
9640G0797M8251J716j6207l3756J0966j3421k1313m0929j0559q0853m7062P1416
9628f0954L1299M3632l4406J125Q8593M8607m0961m5161m2747m8462n149j5434
9616h0018J757L4673j7007m1125N1184K6319N4816p8724N172N1732K9025q7009
9604d9205R390J4267j3741k7006L9958J7688L6903l8755n167k2001J2342p170
9592c2497J5351K6996O8126N638L816O5086q045o46m2020m7310r7947K8323J9736
9579D607L3219m9322m2755k4097l0792J20578R616O24l8108Q934L1183J8458r701
$$ y = [-6660, 48845, 76423, 112782, 84640, 38252, 47652, 84508, 166176, 433086, 778496, 872397, 713179, 505151, 318258, 186507, 55610, -29640, -10158, -3417, -79566, -45420, 38950, 70797, 119048, 120764, 104557, 70801, 81767, 68346, 47033, 6104, -4455, -85308, -132370, -60954, -29655, 13977, -20429, -19304, 69289, 117896, 76935, 31774, -10973, -59435, -64584, -80018, -78261, -43588, -60595, -101720, -50536, -24217, 30599, -48125, -42953, 8779, 37804, -49205, -39815, -25548, -39289, -66295, -26337, -8649, 28254, -10501, -15668, -37669, -25327, -32497, -17146, 9850, 77976, 83614, 87430, 152516, 144471, 143825, 101805, 54495, -43452, -15129, 4607, 37826, -11496, -54251, -78348, -109140, 11438, 21054, 21678, -16430, -7496, 23687, 42145, 32444]
9566C2444o4889k9283l3448o6148J1897J06448N9534l929m6129O234o738J7164
9554a6843P0361K802k5636K7459l2782r0970J5077p485j1613l097J1583L4394
9542b6750n526J5256L6865m5201L0082J2334K5347r802K3883M754k9463k9103
9530B676L0573P6880J4873m9586j475l0087p8493N1308K5665r8331l7269j7720
9518a10986N8834K4935q5098o9218K9326N4056L4491K3010N3247N6886K2206j04909
9506a3220j02384L4927K2598o3579l5729o290K5483M5316O0723L9143q507J6712
9494A5193l1384m186K5970l532j3555Q219l5711k5224o1212L409L6011R252l2983
9481a09733q3434L82N7785l4506k2810M4182O7257M1933k0921K9639K2286l139
$$ y = [32444, -32445, -61728, -95176, -161324, -149427, -42979, 16555, 12626, -33503, -27269, -34007, -16843, 53518, 56320, 30684, 58143, 25361, -65609, -50532, -58017, -69630, -72727, -61144, -26750, -32276, -17020, 19845, -25356, 4726, 17060, 42407, 32605, 56488, 61242, 31779, 2676, 33249, 110129, 125002, 75416, 73941, 43854, -34639, 16669, 42334, -55997, -93266, -110986, -52152, -27217, -112315, -181533, -152207, -98151, -63660, -40650, 12597, 69483, 91689, -13220, -115604, -80677, -58079, -121658, -157387, -163677, -138194, -92878, -32155, 6988, -1519, 15193, -16191, -20377, 5593, 2061, -11494, -3275, -38986, -64210, -125422, -122013, -86002, -76750, -109733, -193167, -192785, -135000, -169506, -192316, -148134, -80877, -38944, -59865, -30226, -7940, -11079]
9469a1079l5891j1839M8541K0319K5963m3366n9763q918K0773Q8692L4853k8634
9457C9651O289K4065n6353j5558m4306j4516j0348k2629m2847K9862M3340J7901
9445d5449M6789r487k6898K6435N8284l3442j7531K3876L0596j8843j3715j7144
9433C471J8874k8140J3111P1756k0702n0480K6946k5111l593M0496M2801O825
9421I6254P2593l4222n1031r03j2973K8860K3829J5732R79r4574j01588k9189
9409h6233O6062P2084k0572l4668n8353K6439K1123J8792L1611L344n6978j0351
9397b7700J4103n9552n3095N0065j4570j6370N692J1060J6912O3614Q2930l5250
9385C7839k9388M3335l6042m5357K9624j6908l2547J1484K2136l3872l0273P5733
$$ y = [-11079, -46970, -58809, -10268, 10051, 36014, -7352, -67115, -76033, -55260, 33432, 68285, 39651, 45940, 70005, 13652, -1906, -46212, -60728, -71076, -93705, -136552, -106690, -63350, -45449, 1340, -8147, -35045, -8610, 49674, 16232, -1299, 22577, 53173, 34330, 20615, 3471, 22345, -5795, 7316, 79072, 58370, 7890, 34836, 9725, 6132, 46628, 89429, 96254, 168847, 134625, 83594, 82691, 69718, 98578, 122407, 138139, 139118, 44544, -57044, -86233, -20171, 51913, 31341, -3327, -61680, -35241, -14118, 4674, 36285, 39629, -17349, -27700, -13597, -73149, -126244, -76179, -90749, -107119, -101427, -90367, -73455, -9841, 73089, 37839, 8451, 51786, 15744, -29613, 11, -16897, -49444, -37960, -15824, -49696, -79969, -4236]
9373d236j3791j752J9158K0336k6040L2403o5720J0625K4223q1424K350M1572
9361d2296M6808Q6759j1344k5127q6327J3684L960K5908O4492L8905l8054q8487
9349a1119k1009j79r742J1662l3037q8384j1510M7756M4791O5912O654j05346
9337a03551o1630K6068K054l578K5038r011k254R2887O6134p702M2156k8960m7633
9324i982j8117k0397j12513j3531N6217N6224m0388J8773M0250O0239J1782j29756
9312a01199m6374O2787J2527M0669M8007J7128j8908l9217j8189M7643j83J6794
9300B1485k5022l1904J6286L641M6456M8983m5672q7870J101J3239q5801k5504
9288a50582M7314N7723m435k3064J7532L2869Q657m264j02436p133P1380R7255
$$ y = [-4236, -18027, -19779, -621, 19715, -6325, 26078, -39642, -29017, -4794, -86218, -83868, -42296, 4512, 91271, 79927, 54800, -31527, -17843, -13883, 12025, 76517, 115422, 77368, -11119, -32128, -32307, -42049, -30387, -63424, -151808, -163318, -115562, -70771, -4859, 1795, -103551, -165181, -139113, -137059, -140637, -115599, -124610, -126864, -33977, 32157, 24455, 66611, 37651, -9982, -28099, -48496, -161009, -174540, -118323, -62099, -102487, -83714, -43464, 16775, 28557, -101199, -147573, -84786, -72259, -31590, 16417, 33545, 14637, -24580, -42769, 4874, 4691, 21485, -3537, -35441, -19155, -15514, 30942, 79925, 34253, -53617, -52516, -39277, -125078, -150582, -103268, -45545, -49980, -73044, -55512, -22643, -13986, -18250, -120686, -127819, -56439, 40816]
9276D0816J2826k1781l9529K2462L8253r629l1028L5305k9698j5325k4766l8127
9264f0221j7304J2091L3812o3442m2329K2358n2691J6365N1039l0947r013N3390
9252h6892J7240K8887p232o9245l1309O2836M4179K5335O2236m3602l5941o0540
9240i4048J0149O0281M761K2462M946j5347P161J436J5545l641l072O6308Q6119
9227A63060J7339J5458q3594j19394K5019M8271j3057k6772j9461K8137J0480
9216D5486l5335n6602L7409J6596R441k9793j3658N0114p078o0870N400K7004
9204a1886m3667M8589O3866n89l6933j8343M5508O3588k3810j3268M3340O429
9192A22824m4716k2895J215j2684o2894m896J6373k9779k5997j3456j7512k9166
$$ y = [40816, 53642, 31861, -7668, 14794, 53047, 43418, 12390, 47695, 17997, 2672, -22094, -60221, -77525, -65434, -31622, -95064, -137393, -115035, -167726, -151361, -100322, -131269, -140282, -86892, -69652, -40765, -47997, -117242, -148551, -85715, -41536, -16201, 46035, 2433, -33508, -94048, -83899, -23618, -18857, 3605, 8551, -6796, 365, 1801, 17346, 13705, 10633, 76941, 163060, 180399, 195857, 112263, -7131, 17888, 66159, 53102, 26330, 6869, 35006, 45486, 10151, -46451, -9042, 7554, 16995, -12798, -26456, 23658, 16580, -44290, -38890, -11886, -55553, -6964, 56902, 56313, 19380, 1037, 46545, 110133, 86323, 73055, 116395, 122824, 78108, 55213, 56428, 43744, -19150, -24046, -7673, -37452, -63449, -76905, -94417, -123583]
9180a23583M8634N81l3034O2715L9031M7699r258m7832l8046M8129n2297l5400
9168i2661J421K5431P1025L64j2870P080K1156K5291k5865n0238j5044L8625l8404
9155d4689p5167L2805M76k3672M6784J18754K3551m0786n4252k6272L7742J884
9143b842J2159N7431M2639j6118m0951M6191L3557o6509k8396n1109L7250l3835
9131a0533m3415N3932J8430l1088l300O3821p477k3073L7396k7313o5920l9699
9119g8239L4388J7052k7219j4985P5471M9399k9376m6397M2259N2679j6823n4020
9107D189m3645r200n1929L0641J09416P5475j7668O065l4731k6251j9157L0734
9095E3939M8652j0027L4415n1369j9160k4698k66K5296J1496m4346k144N9785
$$ y = [-123583, -74949, -74368, -107402, -44687, -5656, 42043, 32785, -15047, -53093, -4964, -57261, -92661, -91240, -65809, 5216, 5580, -7290, -210, 20946, 46237, 20372, -29866, -44910, -6285, -44689, -119856, -87051, -86575, -110247, -63463, 55291, 78842, 38056, -16196, -42468, -4726, -2842, 9317, 66748, 109387, 93269, 52318, 98509, 132066, 65557, 37161, -13948, 23302, -10533, -53948, -16, 18414, -12674, -15974, 47847, 40370, 17297, 54693, 27380, -38540, -78239, -43851, -26799, -54018, -69003, 6468, 55867, 26491, -19906, 22353, 75032, 58209, 4189, -39456, -48656, -100585, -69944, 39472, 114947, 97279, 103344, 68613, 42362, 23205, 53939, 102591, 92564, 126979, 75610, 56450, 31752, 31486, 56782, 68278, 23932, 21788, 81573]
9083H1573l7695k9804l3899K3080J6405J996j7405m0505n606k8809Q9681K4644
9071D3656L262m0260k1854m0854M2974L3909K0631n7468q87l5975O2033J3998
9059B3165n1409m4737k2573M0206R9620M9179m8219j8315O2604L4894k8054j4146
9047H2215Q438l3615l5562K4356J10471l852n6260K2184j0331j7753o1238q1837
9035e2784O2359L6008k7676j2940K6302O4207j6766n2838j5829l7426N9799j6642
9023A5774Q726N2529q444m1692l367K7167P9658o559k3104K5708M2030j7169p6085
9010G5172l9538L3194m465Q630n665L9704l074J8647k9975P056l771K7787J3546
8997A37248k0146K5867N355j1053q2540k7540M1838j00684j03654K5382j744J1025
$$ y = [81573, 43878, 14074, -19825, 3255, 19660, 21656, 4251, -36254, -41860, -70669, 19012, 43656, 46918, 6658, -15196, -56050, -13076, 20833, 41464, -16004, -16891, -52866, 9167, 23165, -28244, -72981, -95554, -55348, 44272, 93451, 45232, 26917, 89521, 124415, 96361, 82215, 90653, 57038, 21476, 45832, 156303, 152451, 96191, 118375, 108044, 90291, 29053, -52784, 9575, 45583, 17907, 4967, 31269, 95476, 78710, 25872, 10043, -27383, 32416, 15774, 24500, 77029, 68585, 26893, 23526, 50693, 130351, 123792, 100688, 126396, 168426, 151257, 75172, 35634, 68828, 64363, 72993, 67328, 107032, 103958, 122605, 92630, 99686, 95915, 123702, 137248, 117102, 142969, 148324, 137271, 54731, 27191, 69029, -31655, -135309, -109927, -111671, -100646]
8985a00646L8360M2105l6460q664L9169j3932R373J7306l658M5480p4052k607
8973d8226M4122L7228l4755m0396K4088K2357R709M8831k1130j6175j08167k1228
8961a03742J430O0792N1965m5115l4486k1506j3720J0960n2882K7020O6773K3583
8949b8928j3410R135P1374J6221l7555k8193Q768J7785j0549K9282M8464p277
8937G5117k3387j3120J7902k3967N5817Q5254J8881k8616j02415k2921j054k1801
8925A5690l2659M6601L1248J7727m2877l166j0101l6438m0613L5702M9950L0397
8913F1461l2127l3925j1053O0185Q0372O950P158p4945j17511M4819N2034J8792
8901F2210m732N3280o378n4554j8317L3834m193O7965j3074J2983J277k6084l5170
$$ y = [-100646, -62286, -20181, -56641, -65305, -26136, -40068, -30695, -13389, -17047, 28433, -45619, -48226, -4104, 33124, -1631, -42027, -17939, 4418, 14127, 62958, 41828, 25653, -82514, -103742, -102312, -41520, 10445, -34670, -69156, -90662, -104382, -93422, -146304, -119284, -52511, -28928, -42338, -33203, 38171, 54392, 16837, -11356, -2588, 15197, 4648, 33930, 82394, 75117, 51730, 38610, 56512, 32545, 88362, 173616, 192497, 163881, 61466, 38545, 37491, 15690, -16969, 29632, 60880, 78607, 35730, 32564, 22463, -13975, -54588, -18886, 31064, 61461, 29334, -4591, -15644, 44541, 124913, 131863, 139021, 64076, -53435, -8616, 43418, 62210, 57478, 110758, 104380, 49826, 31509, 65343, 61150, 129115, 116041, 129024, 130301, 104217, 69047]
8888F9047N5886O1302k6214m944l216l8339q359K4434K7754P4161m3818q3067
8876A04627r3624l3643k2270M1690M4319K8931k5134o608K3746J852K8341j8829
8864G3398m3968O87J6228Q126k5434J4806L849l6189j3168l998l2298L4140P0067
8851F6246J178j3351m728j5187K6870l0239n2991m0084O5544N0560R4672m2668
8839A05822m3392j8269j5399Q017N1820K7330l9336r751J4730k2413K7352n586
8827H0925j02530J7604L9037k304J1952L0069n309L417l1467O526j457J5812n977
8814E6298K1439M1807q27l2330l4279n9204o3714L6233L7260N4777j1849q923
8802C6688K3254r4373J6558K3694K3491L5250N3934L223n1786M4051J9967j55
$$ y = [69047, 124933, 186235, 160021, 155077, 151861, 113522, 105163, 129597, 157351, 231512, 187694, 104627, 11003, -22640, -44910, -3220, 41099, 70030, 44896, 38288, 62034, 63886, 92227, 73398, 29430, 30117, 46345, 54471, 29037, 43843, 47692, 11503, -1665, -5663, -37961, -3821, 66246, 67424, 54073, 49345, 34158, 61028, 30789, -22202, -62286, 3258, 53818, 148490, 105822, 62430, 44161, 28762, 36779, 88599, 115929, 76593, 66842, 81572, 59159, 86511, 80925, -21605, -4001, 35036, 32732, 44684, 74753, 69444, 72861, 41394, 47920, 46463, 62275, 56298, 77737, 119544, 118717, 86387, 52108, -7096, -70810, -34577, 2683, 57460, 45611, 36688, 59942, -34431, -17873, 5821, 29312, 64562, 118496, 121719, 69933, 113984, 133951, 133796]
8790A33796l0536r5345J61P4616o05m8874M0528Q121m1626k6179j411K5183O1351
8777I9180k8906o0523k2166J7063k0916l929J4069K7456k0637R011K3416J1311
8765D4429J6551J0478k5593K3808J0419k8236o6232r310M0511K6816L4932K2277
8753A00850m7506n0597J8928J6020k3026L3906j6534J0141L1537J6985j6851m881
8741F8972k88p338l0671R0256L5128k9576l1406m951J8487n492m088q964l2183
8728E7886m1332N2833O9398n5568l8464k4808L6059J1169m0665K677O846L4750
8716G0781R3266L5363m6016M2093L0576p3141l4931n5686N8057M6422l5232k9076
8704A02476n196J3438l5212j9381m7429n887M8517J7858j07904K4773K9839O0812
$$ y = [133796, 103260, 7915, 8076, 82692, 82087, 33213, 73741, 81862, 40236, 14057, 12646, 37829, 99180, 70274, 9751, -12415, 4648, -16268, -20197, -6128, 21328, 691, 9702, 33118, 44429, 60980, 71458, 45865, 69673, 80092, 51856, -14376, -23686, 16825, 43641, 78573, 100850, 53344, 2747, 21675, 37695, 14669, 48575, 32041, 42182, 73719, 90704, 73853, 68972, 68684, 61346, 30675, 120931, 156059, 126483, 95077, 90126, 108613, 103121, 99033, 90069, 57886, 16554, 69387, 138785, 83217, 44753, 19945, 56004, 67173, 26508, 29185, 36031, 70781, 164047, 199410, 153394, 195487, 226063, 152922, 117991, 62305, 120362, 166784, 131552, 102476, 97280, 110718, 75506, 56125, 8696, 2809, 51326, 69184, -38720, -13947, 15892, 76704]
8692G6704J3224p7610M0063N3191K0077K3152J4216j6087j5091j4158K2473K0512
8680A60666J8238L974Q500l5290q046O2426o0476N2963J0369j9966k9488j3299
8668A50571j6536k6522j8228o364q090m6765O91k4552K244K079k2765J5148M4002
8655D4913j3753O5223O9213l5654j6574k9908K9645K6784r0337k9608Q6493J5303
8643A21740l9295M0150j9231o0782Q661K6552k046K697L5284L5200o0171m0054
8631D8705o612j8635P672O8535L8937K0709M9583p911k0219n1292j1459J0881
8619A28894n1018P4570N3908r219k0711j7442J3727n482j2029j5999l420o0919
8607G4860o1370K5271L9113K1299L9166K7388l9239m3539k9038M2946P1332N013
$$ y = [76704, 89928, 12318, 52381, 105572, 125649, 148801, 163017, 146930, 131839, 117681, 140154, 160666, 178904, 182878, 191378, 156088, 148042, 210468, 149992, 202955, 213324, 193358, 163870, 150571, 134035, 107513, 89285, 82921, 74831, 28066, 28757, 4205, 6449, 8528, -14237, 911, 44913, 31160, 96383, 165596, 129942, 113368, 83460, 113105, 139889, 49552, 19944, 106437, 121740, 82445, 122595, 103364, 42582, 51243, 77795, 75749, 78446, 113730, 148930, 88759, 48705, 42093, 23458, 31130, 99665, 138602, 159311, 208894, 200983, 180764, 129472, 118013, 128894, 77876, 152446, 206354, 197135, 176424, 158982, 172709, 167227, 155198, 139199, 135779, 74860, 13490, 38761, 77874, 99173, 138339, 165727, 126488, 82949, 53911, 96857, 168189, 173202]
8595A73202J3047M7632k4286q5386r473N2883M4427K9738p896k0882l6339J7953
8583A94620K4650K3790l0483j9061J7958M142J4521K4320q2489K7647N3724p816
8571B45523L0635j2704J282l0125Q416m4036k4931K2028J0775l6776j1690J3126
8559A71523q1606k617N1608n050r397K2492n2032n813L8974Q5609J609n1591Q53
8546A64562n487M5942q083n7884q5849R4777J61854j652m5169P5112J97310L51107
8534H86540N06992K56251k93707m02887l73739k29075j09171n6720j8723J2826
8524A78587n2816L9514m696m5671Q812J1826L6952o0903k104j1230l7928P86r945
8511E1184J418Q701q595J0524J5903O0570M9631L4193k5928p4626L8100J7295
$$ y = [173202, 186249, 233881, 209595, 124209, 114736, 167619, 212046, 241784, 233888, 213006, 176667, 194620, 219270, 243060, 212577, 193516, 211474, 215616, 230137, 254457, 171968, 199615, 253339, 245523, 276158, 263454, 264736, 234611, 243027, 198991, 174060, 196088, 206863, 170087, 158397, 171523, 89917, 87300, 138908, 133858, 124461, 146953, 94921, 89108, 128082, 213691, 215300, 163709, 164562, 159075, 205017, 196934, 139050, 53201, 147978, 309832, 308180, 263011, 338123, 535433, 886540, 1393532, 1649783, 1356076, 953189, 579450, 350375, 241204, 184484, 165761, 178587, 125771, 165285, 160589, 114918, 123730, 135556, 172508, 111605, 109501, 98271, 60343, 61129, 51184, 52602, 61303, 52708, 63232, 79135, 139705, 189336, 223529, 197601, 122975, 161075, 178370]
8499A78370J3044j502L8486O9389L1305M0269J02116J59371L10431O10624J079924
8488B631827P45365n74511q49489o81130m37943k78450j19799p3256j6793o8693
8478B77128n8490l9328M4862M3612j4619n3606R858N6132M0671p602j01486o6849
8466A30283l0943j9987J7301L6980K8507J4119l532j3378L8073l244J2382k5335
8454A81226K8441o3479J5317K2726J7134K8823R4243J00979J50412L00748M55042
8443A331612L37228k15888m20121l57011k13081j59575J6468m2998q8198l2286
8433A56150J4987J7692j4554n2580M622j2588O720J5965M759k5471q6473o0216
8421c0987N1373N0220q6j3723k6664L1123Q1676M24o9410j9672r827k2986M8742
$$ y = [178370, 191414, 189912, 228398, 297787, 329092, 369361, 471477, 630848, 941279, 1551903, 2631827, 3377192, 2802681, 1953192, 1272062, 834119, 555669, 435870, 362614, 345821, 277128, 218638, 179310, 224172, 267784, 253165, 199559, 209417, 265549, 306220, 298618, 197132, 130283, 99340, 79353, 96654, 133634, 162141, 176260, 172728, 159350, 197423, 194179, 206561, 181226, 209667, 146188, 161505, 184231, 201365, 230188, 324431, 425410, 575822, 876570, 1331612, 1668840, 1452952, 1032831, 675820, 462739, 303164, 319632, 276634, 188436, 156150, 171137, 188829, 174275, 121695, 126317, 113729, 120449, 136414, 141173, 115702, 29229, -30987, 20386, 70606, 70520, 56797, 30133, 61256, 142932, 143356, 73946, 54274, 44447, 21461, 70203]
8408G0203L8135J919j8649k7410L9178N9962Q3520k0104J764k5302m8574j4966
8396A39676k6077K5516r980J340k9681k8347J9598o4445j9102R1757J3928k0371
8384I3812J9004j5134l096L4003k839j7304j6427k5564R5509M7492k1595O65M4726
8371B33252M4308K9229q7346r8167q4450J8341M3427N8125P1473k3659L2236j5336
8359B21433l79n182k3022n2391o2131J0059n9659j1209L9730M6264O5682N1130
8347B20325K614l4572r76j2931q588n862n3069n8727q5520P3228J01772m2811
8335I4883j15716j2360N1386K7903L4361N0267N9915O0764o45j446l0683l5393
8323A83236J7335l1697j4116k6771K6331Q531o1452M316K6734O6415O6949M0952
$$ y = [70203, 108338, 110257, 91608, 64198, 103376, 163338, 246858, 226754, 228518, 203216, 154642, 139676, 113599, 139115, 129135, 130475, 100794, 72447, 92045, 27600, 8498, 100255, 114183, 93812, 112816, 97682, 94586, 128589, 125750, 108446, 92019, 66455, 161964, 209456, 187861, 188526, 233252, 277560, 306789, 219443, 121276, 36826, 55167, 98594, 156719, 228192, 204533, 236769, 221433, 221054, 215872, 192850, 140459, 78328, 88387, 28728, 17519, 57249, 103513, 169195, 220325, 222939, 188367, 187391, 174460, 165872, 160010, 106941, 48214, -37306, 35922, 137694, 94883, -20833, -33193, 18193, 46096, 80457, 130724, 190639, 251403, 250758, 249312, 218629, 183236, 200571, 168874, 154758, 127987, 154318, 162849, 101397, 105713, 132447, 198862, 265811, 306763]
8311C06763J382k2539o8618l7211M574N7741k4971o7138m85k7877k3302M0149
8299A38468L5144l5497m0484m127M4215M918n5354o0452n489L2186N0856J2902
8287A17286M0391J2311k8440K2860K4285m0884K4629P28k8303q314J1135J4899
8275A62583k62L6747O824k1289l4681k3113j4006O0841P4185k0424l7318J882
8263A91969j5633N3747k0637q1825n0131l4677m0139R6894L1613N5250M5732m8174
8251A83989q091K4674l8866j9259P381l9161M9201N2487j5346L263L2583m6843
8239A86012o4072j6626M1658L5252r3K6304n9707p112k5735J3008r577o5244L748
8226E7816N6672J6338n3506k428N4839N2888L5180n4020o8273j8454l180J1066
$$ y = [306763, 308145, 285606, 216988, 179777, 184351, 242092, 217121, 149983, 149498, 121621, 98319, 138468, 173612, 138115, 97631, 93504, 137719, 142637, 87283, 26831, 21342, 53528, 104384, 117286, 157677, 169988, 141548, 164408, 188693, 147809, 172438, 173166, 144863, 136549, 147684, 162583, 162321, 199068, 205892, 184603, 149922, 126809, 112803, 173644, 247829, 227405, 190087, 191969, 176336, 230083, 209446, 127621, 77490, 42813, 2674, 99568, 131181, 186431, 232163, 183989, 175898, 200572, 161706, 142447, 149828, 110667, 159868, 212355, 197009, 200272, 232855, 186012, 121940, 105314, 146972, 182224, 182131, 208435, 148728, 141616, 115881, 128889, 119312, 54068, 57816, 114488, 130826, 77320, 74892, 129731, 182619, 217799, 163779, 95506, 77052, 73872, 84938]
8214H4938N262K7145P819M7943l0317j9636q294l2720k76M0415L9268N3655j5062
8201B00140j26912l1201P2938Q6785K2278J9830l406n7924J4925N6873J0721m1186
8189B23861q821k2390k2011N898l0099L9506n606k5373N3893q6351o6748P5578
8177A31337j7804k1954l0379O288j6575L6184O3002k6561Q066j0894R122j9385
8165A10447N4870L5800k7603j4516j3993N3777P3865K3150j8027q2201l7077l6719
8153A21773q817N5745K3854O668n2595o5387M4347L9329m2011m9188m4075l1183
8141a540j7810M6038L419j8470Q2094K5335l9393o172K1590M3160K0374K5910
8129A84535p3191q4831K1164Q5591R2408o9849j15529n6051l1992O8744Q7402
$$ y = [84938, 90200, 117345, 125164, 173107, 142790, 123154, 114860, 82140, 81864, 122279, 161547, 215202, 200140, 73228, 42027, 114965, 201750, 224028, 243858, 240452, 182528, 197453, 254326, 265047, 223861, 215040, 192650, 170639, 176537, 146438, 185944, 180338, 154965, 208858, 122507, 55759, 131337, 113533, 91579, 61200, 67488, 50913, 87097, 150099, 123538, 131604, 120710, 129832, 110447, 165317, 201117, 173514, 158998, 145005, 198782, 272647, 295797, 277770, 195569, 158492, 121773, 112956, 168701, 192555, 199223, 146628, 81241, 125588, 164917, 122906, 73718, 29643, -1540, -19350, 26688, 30107, 11637, 93731, 119066, 79673, 73501, 95091, 138251, 158625, 184535, 111344, 26513, 47677, 133268, 225676, 155827, 40298, -15753, -47745, 20999, 108401]
8118A08401p8192m8545J4907J2310J5816k1337j9826k0806M9430L4137k0014N3529
8106G9810m5128p8667R163L9890M9534L4859L1853M0425p9296R341P1859J569
8094A65212r6156m8243K1762k3325L8692M5556l939m1258l2253O7057M5510N976
8082A44591j2183p7794n4736n0693M9885N7023M7116P6188k8178o837L8234n8623
8070A23993q0610k3081n658o1454n801j8170O6511M7092M4451M2410p187L8755
8058A61251j802l1821n2195j7752M8133k550j2946O6445P3916k0334m4601o090
8046A59654j4992p245l9389n6074J9232M1680N23k380l7727M8102R746L3923N472
8033A60525P960L3311N1552P128O9345j7960p2119p7841K1020k314k5318j5149
$$ y = [108401, 30209, -18336, -3429, 8881, 24697, 3360, -16466, -37272, 12158, 46295, 26281, 79810, 34682, -43985, -34822, 5068, 54602, 89461, 121314, 161739, 82443, 91784, 163643, 165212, 69056, 20813, 42575, 19250, 57942, 103498, 99559, 58301, 26048, 93105, 138615, 144591, 132408, 54614, -122, -50815, -930, 56093, 103209, 179397, 151219, 144382, 182616, 123993, 43383, 20302, 14644, -46810, -52611, -70781, -4270, 42822, 87273, 129683, 122496, 161251, 159449, 127628, 75433, 57681, 105814, 103264, 90318, 156763, 230679, 210345, 165744, 159654, 144662, 137417, 98028, 41954, 61186, 102866, 103389, 101009, 63282, 111384, 121130, 155053, 160525, 168485, 201796, 253348, 260476, 329821, 311861, 239742, 161901, 182921, 180607, 155289, 140140]
8021A40140l2262J3298O4014L9660M5160j9856j03517p965K4099l6016L7029M3756
8009B07540n8317R22L1361n9245l4858L1588j7138L1543k7279q1412K9078P3763
7997A27546m9825P0660M177M1032J5917j867j1624l6098l9809n6795R821o536
7985F6599P054K1403M3173k3919o4949m0810n449m342P0054P4162k4680q209O6338
7972A76425k8649n0226k3207M1918l1947n717K8426R051J04973J53454P2139M1362
7960D88002p1363k3332j00469j3540l3126m4986m4392p0234J4988J2877j2749
7949A01676r457j3940j6198R393K0768p55k0275m5265K8515K1178l3691j9031
7937B2918L9612k4442K5354J187k4986K1008j4424K1108k698K4475p886m443m998
$$ y = [140140, 107878, 121176, 185190, 224850, 270010, 250154, 146637, 138672, 162771, 126755, 163784, 207540, 149223, 150145, 181506, 122261, 87403, 118991, 101853, 133396, 106117, 24705, 53783, 127546, 77721, 148381, 152558, 193590, 209507, 207640, 196016, 159918, 120109, 63314, 73135, 66599, 73653, 95056, 138229, 114310, 49361, 8551, 3102, -1240, 68814, 142976, 118296, 110087, 176425, 147776, 97550, 74343, 116261, 84314, 78597, 107023, 116074, 221047, 374501, 446640, 488002, 416639, 393307, 292838, 279298, 246172, 201186, 156794, 86560, 101548, 114425, 101676, 92219, 78279, 62081, 71474, 92242, 91487, 71212, 25947, 54462, 75640, 41949, 22918, 62530, 38088, 63442, 64629, 39643, 60651, 46227, 67335, 64637, 89112, 81226, 76783, 71785]
7924G1785n3497k372Q0438L9341j7814L6884K2783O7203M1971m087l6466J2605
7912B58774K0104k8355l1948n3221k5190J931n2859k7829q986o7182P975O5559
7900E8773Q6648M9361o0883l5404J0675L6140K7196l5507N17j7518n1866o101
7888F2031J21366j3430p1758q8704L8837K7062J2981K413K3762j0879J8599j4059
7876A08221m0083O5120l2140J0842m0903m4160l4313J6651J5723R579j0578J3943
7864C7902O5981r4308p13N5409K2001M5075J271o8060j8493K3882K571j6611L5411
7851I1318k3440Q417N364Q2417M7219o8313m5032J668k539L6645M5555N894n5446
7838A29727j4665j6762k0879P115k8049l690m768K5600K4533o0692k4678k8898
$$ y = [71785, 18288, 15916, 96354, 135695, 117881, 154765, 177548, 244751, 286722, 282635, 246169, 258774, 278878, 250523, 218575, 165354, 140164, 142095, 89236, 61407, 52421, -14761, -6786, 58773, 145421, 194782, 133899, 98495, 109170, 145310, 172506, 136999, 137516, 119998, 68132, 62031, 183397, 169967, 98209, 9505, 48342, 75404, 88385, 90798, 114560, 103681, 122280, 108221, 68138, 133258, 101118, 111960, 71057, 26897, -7416, 9235, 24958, 34537, 23959, 37902, 103883, 9575, 8862, 64271, 86272, 131347, 132618, 64558, 46065, 69947, 72518, 55907, 91318, 67878, 76295, 81659, 164076, 211295, 142982, 97950, 99618, 97079, 133724, 179279, 185173, 129727, 115062, 98300, 77421, 84536, 56487, 52797, 48029, 73629, 98162, 37470, 12792, -16106]
7826a6106k6872l46L3920L7651N6439K0151L043k2316m3337K9581L6715l4235
7814G4288o2009Q801j9910J0825O4087J5764k1130m0005l3000k1453N204L9182
7802B0644K2414L9231m090p083o0902Q465K5095m3783L9829R650k4709k1731l3891
7789c0861j144O502J5529J1589k309q046K045J8532L4885R109k6831L5774P2177
7776A36951N993r9258N324j5098L7081l12j588n426j7651j9469M0483q201o2597
7763c768o875M5170N1690j2001k1420k0596L1441n0782o0445o0294j5685J3736
7751a09829Q9180M6728k3165L1055Q295l1129j5739J2504K3828M9688l3318o7002
7739a8904j9613n2804K1017L9674R4183J971k588p309j2420J7730N7195j1464
$$ y = [-16106, -42978, -43324, -9404, 28247, 84686, 104837, 107880, 85564, 42227, 71808, 108523, 74288, 12279, 21080, 1170, 11995, 76082, 91846, 70716, 30711, -2289, -23742, -18538, 20644, 43058, 82289, 78199, 71116, 10214, 18679, 43774, -9, 39820, 49470, 24761, 3030, -30861, -32005, -25503, -9974, 1615, -694, -8740, -6695, 11837, 46722, 55831, 29000, 64774, 136951, 142944, 43686, 49010, 33912, 70993, 70681, 69093, 63667, 46016, 26547, 67030, 58829, -3768, -10643, 34527, 86217, 74216, 52796, 32200, 63641, 12859, -47586, -107880, -123565, -109829, -20649, 26079, 2914, 33969, 42264, 11135, -4604, 7900, 31728, 81416, 48098, -18904, -38517, -91321, -70304, -30630, 63553, 65524, 62936, 55627, 43207, 60937, 118132, 106668]
7727A06668j01028l99L9328Q879Q1619k359n3508k857O373j458p612J4308k6153
7714F1801N707J1101l9614k0626N2650K3466j2319J0756L0347l7570l3652m7268
7702D779j3771N6433L276j6733q926j1542L0330j8856k6828K3940o3979k8847
7690g0724J5215L8371k3630o6397J5895O1976Q471J1970J5194r3656p1558P1829
7678h7044K3052k3251Q6044K9215j2257M4061j2537k254m5843j00209L477l884
7666a01430R4333M6298J366L7318q887k8899M2288o271m2746l0004n2419Q2300
7654C3247j4764m2505J951m2015m8090J4032N1834q875M4996K7884J5414m96J2143
7641D4756q675j4667j6230m3390l5125M4298K0396R5773N6015m9626l0118m6694
$$ y = [106668, 5640, 5241, 44569, 53448, 135067, 132708, 79200, 76343, 82716, 81258, 73646, 87954, 61801, 67508, 78609, 38995, 18369, 71019, 94485, 82166, 92922, 123269, 85699, 52047, 4779, -8992, 47441, 50717, 33984, 25058, 13516, 43846, 24990, -1838, 22102, -41877, -70724, -55509, -17138, -40768, -107165, -91270, -29294, -20823, -8853, 6341, -87315, -158873, -87044, -63992, -87243, -1199, 28016, 15759, 59820, 47283, 45029, -814, -101023, -97546, -101430, -7097, 39201, 40567, 77885, 68998, 40099, 82387, 76116, 33370, 3366, -49053, 33247, 18483, -24022, -22071, -64086, -112176, -98144, -46310, -55185, -10189, 17695, 33109, 32613, 44756, 36081, 21414, 5184, -38206, -73331, -29033, -8637, 87136, 143151, 93525, 63407, 16713]
7629A6713p6252P74K9668O7368j3794o8869n6065j8817P7375M5215m9725Q702
7617c7707Q338l104p222k8760K171M7098j315o6165N6977M5905m4759l9033N7076
7604a0500O0120J9932o4018n703k7231k3569M6387L6827k1870l2876K0228j5909
7592a8182J1552M3307k0882p6745j4302j9362R233m798q0N7638K9333k8748l2990
7579f5026K2919M5150K7735n6453K762N8907L1640N3541j6603m7144l5921K4573
7567D6080j7134j6660K226m3001j0818M5302p985L657L88M0214o761k6004q654
7554H50M7697J195k8925l0326l4480O553k771K4418l735K5151k4200n2304m4712
7541a15589N5502k962k744K5155o0334J0156K0230J0836k4184M472R225j6295
$$ y = [16713, -59539, -58765, -29097, 38271, 24477, -44392, -100457, -119274, -41899, 3316, -46409, -37707, -29369, -32473, -39695, -68455, -66284, -19186, -20501, -86666, -29689, 16216, -28543, -67576, -10500, 49620, 69552, 5534, -169, -27400, -50969, -4582, 32245, 10375, -22501, -2273, -18182, -6630, 36677, 15795, -60950, -75252, -94614, -85381, -90179, -90259, -32621, -3288, -32036, -65026, -42107, 3043, 30778, -25675, -22913, 35994, 67634, 121175, 104572, 57428, 21507, 46080, 28946, 12286, 14512, -28489, -39307, 5995, -1990, 1667, 2055, 42269, 35508, 9504, 850, 48547, 49742, 20817, -9509, -43989, -37436, -40207, -15789, -19524, 5627, -18573, -70877, -115589, -60087, -63049, -65793, -40638, -100972, -90816, -70586, -59750, -83934, -79462, -70237, -86532]
7529h6532J8941M0043Q706L6622j4849k2797O5412o975p3727j2222M1461J5109
7517I192j6561L9562M3600R053n12J203l2991k5608q928o8919n706J553j4971
7504g0033J1998Q5853O5455P1343m0562p770Q379j07357k345K3725m0781L3501
7492C1406m5789k7854j2040n9656K3164J1490n8468j9306M9803J4069O091K8247
7480e8843l654j1876l6805O7247j8395o8301q8569L8602J8249L4048m670K5710
7468a07257O127J387L576j6519p7407p493N7365M4824o1241j5565L3515j5370
7456a54058k3670M6632K1500l027N1934L796N179L4405M422m2551j0984O779m4264
7443a03907J2994O5253M8026n3216l6791j2275r206J2497O832n688K1237K3257
$$ y = [-86532, -67591, -27548, -18842, 17780, 2931, -19866, 45546, 38571, -35156, -47378, -5917, 9192, -7369, 32193, 75793, 84846, 84334, 85537, 52546, 26938, 18010, -50909, -56615, -55062, -70033, -58035, 27818, 93273, 164616, 124054, 116284, 124663, 17306, 14961, 38686, -2095, 31406, -14383, -42237, -54277, -113933, -90769, -79279, -137747, -157053, -107250, -93181, -87090, -58843, -62497, -74373, -111178, -43931, -62326, -130627, -219196, -180594, -162345, -128297, -132967, -107257, -101130, -99743, -96167, -112686, -190093, -197586, -140221, -95397, -156638, -172203, -138688, -154058, -177728, -131096, -109596, -112623, -60689, -56893, -51714, -17309, -12887, -55438, -66422, -59643, -103907, -90913, -25660, 22366, -30850, -67641, -79916, -89122, -76625, -69793, -75481, -54244, -30987]
7431c0987K9845j076N5332N0611o3462k3868k180m7874j0903k9018L5462J11635
7419G3517o4513j40150l8737N933L2309K5653l0954J6765P2274P4340K5277m3745
7407G969l9958r4294K1189R5757j5979l7367M6336K2892M9937L8137l4139m2226
7395A8254l6706j2109J8514q9428j5531K3530L2386M6685j2212m8727k7074k048
7383a04466m359K2746Q4015K1366R407k2814J2379l0265q4501m5255M4447P7626
7371a9674l2573o9765q922M1299N2733l5056p8160j077Q7765L198K9272J4128
7359a6832N9848m6159l146K6996P764m5181J4861J6436q897J0404N7592l6626
7347C7060j04894m2274j835N6579O1651M2830l4768r0110L9042P9785k2296O0149
$$ y = [-30987, -1142, -2218, 53114, 103725, 40263, 16395, 14215, -33659, -44562, -73580, -38118, 73517, 9004, -131146, -169883, -163950, -131641, -105988, -136942, -120177, -47903, 26437, 51714, 7969, -31989, -126283, -105094, -9337, -25316, -62683, -16347, 6545, 56482, 94619, 60480, 18254, -18452, -30561, -12047, -101475, -117006, -93476, -61090, -14405, -26617, -75344, -102418, -104466, -108825, -86079, -2064, 19302, 28709, 5895, 18274, -11991, -96492, -141747, -97300, -19674, -52247, -122012, -130934, -89635, -36902, -71958, -150118, -151195, -63430, -60232, -30960, -16832, 43016, -3143, -6289, 20707, 28471, -16710, -1849, 14587, 5690, 16094, 73686, 37060, -67834, -110108, -111943, -55364, 6287, 49117, 14349, -75761, -36719, 43066, 20770, 80919]
7335H0919j9655q6320n2876K2781M2756M9481j9277k7663o7519R08K4647N8676
7323F858N7952L2109n8568l3594J1377k4787n4109l0642L1190L1201J7340N140
7311h533m7819l7185m6886L9784N3019O4606M4651l3696m1516k8609k6121K3470
7299d4835N1363l6362J2376N0425M5362p8726r5980j4422K0456J04707j02k537
7287A1725l7234N263O618j6389j3284n8592k7184m410J6277o139J08880l6389
7275e0858m3562N4840k1426n4711N281r469R2711K3081l0554m3670j9717m9194
7263a47248K9999K1561P5618L4210n5616o2574k1443k6756M2413O5406M0474K0877
7251A6921K0346M915m106n5801j07531q235L4212Q684j3443j3729j3632M475J3210
$$ y = [80919, 61264, -25056, -77932, -55151, -12395, 37086, 17809, -9854, -77373, -76465, -51818, 6858, 64810, 96919, 38351, 4757, 16134, -8653, -62762, -93404, -62214, -31013, -13673, -8533, -56352, -93537, -140423, -100639, -47620, 16986, 61637, 27941, -13575, -42184, -68305, -44835, 6528, -29834, -17458, 32967, 78329, -397, -96377, -110799, -90343, 14364, 14262, 11725, -25509, -20246, -13628, -30017, -43301, -101893, -129077, -133487, -117210, -123349, -14469, -50858, -94420, -39580, -61006, -115717, -110436, -119905, -27194, -4113, -34667, -78337, -98054, -147248, -117249, -95688, -20070, 14140, -41476, -104050, -125493, -152249, -109836, -44430, -3956, 16921, 37267, 42182, 38076, -17725, -125256, -133491, -99279, -90595, -104038, -117767, -131399, -126924, -113714]
7238a13714N718l5666N2598O3229k7055m9630k0084J4497L0782Q5124O0382j3720
7226E2461k5557Q306p7896K855M424M6533J0901l8590J2305k8795o1794o6546
7214a61393K5988K8272J4602J0462L4019l7601q4717K152M4909K437K6318L3896
7202f0656q680M670n121J1403k5940K8101P2503J0703N139p8245l3985P5075P6716
7189G1683l1174n4409j4581M9184P5127j6925L4685l482l8253J2480l7567n8887
7177a2119L9501o3369J111K3992R067K4034l6298n7781j2789k0769L4990O9219
7165a211M9892j0755n3118L4915L4540N360o8591p4011L776Q0832P534J2225j6312
7152E076N342q669K216k2171j7308P470M5114M4320P794R526m5495n7816j6324
$$ y = [-113714, -107996, -143662, -91064, -27835, -54890, -104520, -124604, -110107, -79325, 5799, 66181, 52461, 26904, 35210, -42686, -39831, -35407, 11126, 22027, -16563, -4258, -33053, -94847, -161393, -135405, -107133, -92531, -82069, -48050, -85651, -170368, -168216, -123307, -120870, -94552, -60656, -69336, -64666, -69787, -58384, -84324, -56223, 16280, 26983, 32122, -46123, -80108, -5033, 71683, 40509, -13900, -28481, 20703, 95830, 78905, 113590, 110108, 71855, 84335, 46768, -12119, 27382, -35987, -34876, -10884, -1817, 22217, -14081, -71862, -84651, -105420, -70430, -1211, 48681, 37926, -15192, 19723, 54263, 59623, -8968, -82979, -79203, 1629, 9163, 21388, 5076, 10418, 1749, 3965, -18206, -35514, -28044, 17070, 61390, 69184, 78710, 33215, -24601, -40925]
7139d0925J376L6014M4848J2823j5860o4513k7488j0414l3889Q525K7934J7450
7127d4119K845K0331j2336j8351k6497J6865J9761N2709K5162N55p6708o2636
7115a02419L3986N02q9520J5496M3325M3432J9139k7594m2328o0529j2564N7362
7103a21712O6778O8095n1697p652N823J1174j1738p6577l9255N7486O1812k5975
7091f3438q908J801K3542J1517j5636j8543L8657l371o5233l6760J1827L8211
7079h6334O4407o892m1421l9748k5153l8086M2189M6150N8309L4728o5399l8201
7067i5451M8488Q3047j9278j853r7777j1996j7403m713k3335K5785Q0791K3759
7055i936m6918M388k1442K0235M4984L875n065J1104k090K2341Q321j8551J87
$$ y = [-40925, -39549, -3535, 41313, 54136, 38276, -26237, -53725, -64139, -98028, -89503, -61569, -44119, -41274, -20943, -33279, -51630, -78127, -61262, -41501, 11208, 36370, 36925, -39783, -102419, -68433, -67931, -157451, -141955, -98630, -55198, -36059, -63653, -105981, -166510, -179074, -121712, -54934, 13161, -38536, -46188, -40365, -29191, -40929, -117506, -156761, -99275, -37463, -63438, -72346, -70545, -47003, -35486, -51122, -69665, -31008, -34379, -99612, -136372, -124545, -86334, -21927, -28819, -70240, -109988, -135141, -173227, -131038, -84888, -26579, 8149, -57250, -95451, -46963, 36084, 16806, 14953, -82824, -94820, -112223, -116936, -140271, -114486, -33695, -9936, -56854, -52466, -73908, -53673, -8689, -4814, -9879, 1225, -865, 21476, 29797, 11246, 11433]
7042A1433J7989n3965l3177j2850J8376P266n1024L1988Q038n59L572M8088O3531
7029E8706J922j1734j4783k2788l7721m6274n0560P1661Q4650j4411n4973l0032
7017f6337K6253Q0503M8683L0890n9677q8179k382N6387L4222l9943m0278M423
7005a5435l4874L5202O7845P5240n659m0281n103O313o9650m2535j4884p930p8990
6992a30741l2996k7954k4941M9471R1647M5213K2815k6243o723m897K5142L2722
6980A2515J4554J3221k4469m0579P37j2850M128l776K5389m5563j4757k3907L9666
6967e5691J7608R600l9137O610Q732l0246J8884K0694L2677J1852R870m7422l8319
6954g4288L4855J26073l9810j7902l9944j26293j5310P3971M9308L1964p9107
$$ y = [11433, 29422, -24543, -57720, -70570, -52194, -44928, -95952, -63964, -55926, -56485, -52913, -4825, 58706, 60628, 48894, 34111, 11323, -26398, -72672, -123232, -51571, 33079, 18668, -36305, -66337, -40084, 40419, 89102, 119992, 60315, -27864, -30246, 26141, 60363, 20420, -19858, -15435, -50309, -15107, 52738, 127978, 122319, 82038, 76935, 83248, 13598, -28937, -43821, -51751, -130741, -163737, -191691, -216632, -167161, -75514, -30301, -7486, -33729, -40452, -45349, -20207, 12515, 27069, 40290, 15821, -24758, -24021, -36871, -32743, -36519, -11130, -56693, -71450, -95357, -55691, -38083, -28483, -67620, -61010, -52278, -82524, -63640, -42946, -10269, 1583, 11453, -35969, -74288, -39433, 86640, 46830, 28928, -11016, -137309, -152619, -78648, -29340, 2624, -76483]
6943g6483p2830M6911J8023P3387n5462r8756m7122P7975J01037L0352o2412J9594
6931d5786R6081L0241k3684j5163l6527o8241o022k7351r510R471j0734L0993
6919g6232L1894j7379k1731l3477m4329J3464P3776P9554M4032O56K9515l2524
6907D7219o3046K2966j2139n8076l0602R998P9098M4847k8533k7205J9790l3751
6895b9434P176M5627K3660p493n9319j9714k4511j148l3613l8960J9070k1986
6883a40645k544l1085Q3866R2874N0735p9654p2341j815j4495L987o768N7371
6871f0514N5151O0488r1730o6332N6108P3807J7881k8286M9935M7984L7438m5600
6859A06330n2271l3591j8572p630K7080M4936N3147j7782R331k3185q740k8259
$$ y = [-76483, -149313, -102402, -84379, -10992, -66454, -165210, -212332, -134357, -33320, -2968, -65380, -45786, 50295, 80536, 56852, 41689, 5162, -63079, -69101, -96452, -105962, -96491, -107225, -76232, -44338, -61717, -83448, -116925, -161254, -147790, -74014, 5540, 49572, 50228, 79743, 47219, -15827, 7139, -5000, -63076, -93678, -83680, -4582, 40265, 11732, -15473, 4317, -29434, -22258, 23369, 47029, 39536, -19783, -39497, -64008, -65156, -98769, -137729, -118659, -140645, -143189, -174274, -90408, 2466, 53201, -26453, -98794, -100609, -115104, -111117, -117885, -60514, -5363, 55125, -36605, -102937, -46829, 26978, 44859, 16573, 66508, 114492, 151930, 106330, 54059, 20468, 1896, -5734, 21346, 66282, 119429, 101647, 110978, 87793, 79053, 50794]
6847E0794J936J9725q9095j10415K2304O776M5251L307M0484M6627k6596o0009
6835d8911M8860J7373n2238j30777l6437J19689Q6031J8891k8072n4747n7976
6824a18314n3810m8675O4674M4142j9438j916J2322m5842M1244L559R044P6863
6812c6147L749m7441O89o6260K6330M6247k2054L3407M9176J2l7361K662J9029
6799b7962k7985j7300K1049l1079M0313M5962k6990K5137j5767o5744K6974Q370
6787d5022m9862l2954M7300N3289K1551q128j354r9455q1601J4148N8439O570
6775a17079L250Q608m9503J8724K406L9067m06m811O0434O9419p6612j1435o351
6762f4289O078K1344l0209k5526k0314M8492J8198N5182K0901m5454P961l4578
$$ y = [50794, 52730, 72455, -16640, -127055, -104751, -97975, -52724, -49417, -8933, 37694, 11098, -48911, -51, 17322, -34916, -165693, -202130, -82441, 3590, 22481, -5591, -60338, -118314, -172124, -220799, -156125, -111983, -131421, -133337, -121015, -166857, -125613, -122054, -113010, -36147, -32398, -79839, -79150, -145410, -119080, -72833, -94887, -61480, -12304, -12292, -49653, -46991, -27962, -55947, -73247, -52198, -83277, -42964, 2998, -23992, 1145, -14622, -80366, -53392, -45022, -94884, -127838, -80538, -27249, -5698, -13826, -15180, -114635, -196236, -182088, -123649, -117079, -113829, -105221, -154724, -136000, -133594, -94527, -94933, -99744, -39310, 30109, -46503, -57938, -64289, -58211, -36867, -67076, -92602, -112916, -64424, -46226, 8956, 29857, -15597, -7636, -42214]
$$ [...]
##END NTUPLES=NMR SPECTRUM
##END=
