##TITLE=Analysis number 329952
Compound Code cc 62102
Book Reference 370/30
Project Code adrs
Chemist Name mikem
##JCAMPDX= 6.0         $$ Bruker NMR JCAMP-DX V2.0
##DATA TYPE= NMR SPECTRUM
##DATA CLASS= NTUPLES
##ORIGIN= Bruker BioSpin GmbH
##OWNER= nmr
$$ XWIN-NMR		Version 3.5
$$ Tue Oct 16 08:44:26 2007 GMT Daylight Time (UT+1h)  MAYBRIDGE\nmr@NMR_250MHZ
##.OBSERVE FREQUENCY= 250.131544655141
##.OBSERVE NUCLEUS= ^1H
##.ACQUISITION MODE= SIMULTANEOUS (DQD)
##.ACQUISITION SCHEME= undefined
##.AVERAGES= 16
##.DIGITISER RES= 18
##SPECTROMETER/DATA SYSTEM= dpx250
##.PULSE SEQUENCE= zg30
##.SOLVENT NAME= CDCl3
##.SHIFT REFERENCE= (INTERNAL, CDCl3, 0, 16.522)
##AUDIT TRAIL= $$ (NUMBER, WHEN, WHO, WHERE, WHAT)
$$ ##TITLE= Audit trail, XWIN-NMR		Version 3.5
$$ ##JCAMPDX= 5.01
$$ ##ORIGIN= Bruker BioSpin GmbH
$$ ##OWNER= nmr
$$ C:\u/data/dgb/nmr/ADRS/750/pdata/1/auditp.txt
$$ ##AUDIT TRAIL=  $$ (NUMBER, WHEN, WHO, WHERE, WHAT)
(   1,<2007-10-16 08:43:56.13 +100>,<MAYBRIDGE\nmr>,<NMR_250MHZ>,
      <created by zg, POWCHK disabled, PULCHK disabled
       configuration hash MD5:
       76 6E 9A 78 1E 09 19 81 EC 84 63 8F B0 6A 59 2D
       data hash MD5: 64K
       10 90 C5 D3 A7 DD AE CC 2C 32 13 0E 8B 43 E6 94>)
(   2,<2007-10-16 08:44:15.15 +100>,<MAYBRIDGE\nmr>,<NMR_250MHZ>,
      <Start of raw data processing
       ef LB = 0.3 FT_mod = 6 PKNL = 1 SI = 32K 
       data hash MD5: 32K
       E5 99 13 85 B5 B6 18 A9 32 F9 E8 FB 38 67 8E 3F>)
(   3,<2007-10-16 08:44:16.76 +100>,<MAYBRIDGE\nmr>,<NMR_250MHZ>,
      <apk 
       data hash MD5: 32K
       98 04 A6 5B C7 FE 5D 16 22 CD 65 D8 08 C3 55 AA>)
(   4,<2007-10-16 08:44:17.51 +100>,<MAYBRIDGE\nmr>,<NMR_250MHZ>,
      <abs ABSG = 5 
       data hash MD5: 32K
       34 76 32 50 FB 0F 5C ED DF CD 53 A0 34 C9 EE CF>)
$$ ##END=
$$ 
$$ hash MD5
$$ 46 2C 58 8A E4 6A C2 A9 59 DF A7 FD 82 EE 46 0F
##$RELAX= 
##$RELAX= 
##$RELAX= 
##$RELAX= 
##$RELAX= 
##$RELAX= 
##$RELAX= 
$$ Bruker specific parameters
$$ --------------------------
##$DU= <C:\u>
##$EXPNO= 750
##$NAME= <ADRS>
##$PROCNO= 1
##$TYPE= <nmr>
##$USER= <dgb>
##$AMP= (0..31)
100 100 100 100 100 100 100 100 100 100 100 100 100 100 100 100 100 100 
100 100 100 100 100 100 100 100 100 100 100 100 100 100 
##$AQSEQ= 0
##$AQ_mod= 3
##$AUNM= <au_zg>
##$AUTOPOS= <3 >
##$BF1= 250.13
##$BF2= 250.13
##$BF3= 250.13
##$BF4= 250.13
##$BF5= 500.13
##$BF6= 500.13
##$BF7= 500.13
##$BF8= 500.13
##$BYTORDA= 1
##$CFDGTYP= 0
##$CFRGTYP= 5
##$CHEMSTR= <none>
##$CNST= (0..31)
1 1 145 1 1 1 1 1 1 1 1 1 1 1 1 1 1 1 1 1 1 1 1 1 1 1 1 1 1 1 1 1 
##$CPDPRG= <>
##$CPDPRG1= <>
##$CPDPRG2= <>
##$CPDPRG3= <>
##$CPDPRG4= <mlev>
##$CPDPRG5= <mlev>
##$CPDPRG6= <mlev>
##$CPDPRG7= <mlev>
##$CPDPRG8= <mlev>
##$CPDPRGB= <>
##$CPDPRGT= <>
##$D= (0..31)
0 1 0 0 0 0 0 0 0 0.06 0 0 0 0 0 0 0.0002 0 0 0 0 0 0 0 0 0 0 0 0 0 0 
0 
##$DATE= 1192520633
##$DBL= (0..7)
120 120 120 120 120 120 120 120 
##$DBP= (0..7)
150 150 150 150 150 150 150 150 
##$DBP07= 0
##$DBPNAM0= <>
##$DBPNAM1= <>
$$ [...]
##$SUBNAM7= <"">
##$SUBNAM8= <"">
##$SUBNAM9= <"">
##$SW= 20.6930455092707
##$SWIBOX= (0..15)
0 0 3 0 0 0 0 0 0 0 0 0 0 0 0 0 
##$SW_h= 5175.983436853
##$TD= 65536
##$TD0= 1
##$TE= 296.16
##$TE2= 300
##$TE3= 300
##$TEG= 300
##$TL= (0..7)
0 120 120 120 120 120 120 120 
##$TP= (0..7)
150 150 150 150 150 150 150 150 
##$TP07= 0
##$TPNAME0= <>
##$TPNAME1= <>
##$TPNAME2= <>
##$TPNAME3= <>
##$TPNAME4= <>
##$TPNAME5= <>
##$TPNAME6= <>
##$TPNAME7= <>
##$TPOAL= (0..7)
0.5 0.5 0.5 0.5 0.5 0.5 0.5 0.5 
##$TPOFFS= (0..7)
0 0 0 0 0 0 0 0 
##$TUNHIN= 0
##$TUNHOUT= 0
##$TUNXOUT= 0
##$USERA1= <user>
##$USERA2= <user>
##$USERA3= <user>
##$USERA4= <user>
##$USERA5= <user>
##$V9= 5
##$VALIST= <valist>
##$VCLIST= <CCCCCCCCCCCCCCC>
##$VD= 0
##$VDLIST= <DDDDDDDDDDDDDDD>
##$VPLIST= <PPPPPPPPPPPPPPP>
##$VTLIST= <TTTTTTTTTTTTTTT>
##$WBST= 1024
##$WBSW= 4
##$XGAIN= (0..3)
0 0 0 0 
##$XL= 0
##$YL= 0
##$YMAX_a= 327287
##$YMIN_a= -512897
##$ZGOPTNS= <>
##$ZL1= 120
##$ZL2= 120
##$ZL3= 120
##$ZL4= 120
##$ABSF1= 16.522
##$ABSF2= -4.171173
##$ABSG= 5
##$ABSL= 3
##$ALPHA= 0
##$AQORDER= 0
##$ASSFAC= 0
##$ASSFACI= 0
##$ASSFACX= 0
##$ASSWID= 0
##$AUNMP= <proc_1d>
##$AZFE= 0.1
##$AZFW= 0.1
##$BCFW= 0
##$BC_mod= 0
##$BYTORDP= 0
##$COROFFS= 0
##$CY= 12.5
##$DATMOD= 1
##$DC= 0
##$DFILT= <>
##$DTYPP= 0
##$F1P= 14.0000005364418
##$F2P= -0.99999901652339
##$FCOR= 0.5
##$FTSIZE= 32768
##$FT_mod= 6
##$GAMMA= 0
##$GB= 0
##$INTBC= 1
##$INTSCL= 1
##$ISEN= 128
##$LB= 0.3
##$LEV0= 0
##$LPBIN= 0
##$MAXI= 10000
##$MC2= 0
##$MEAN= 0
##$ME_mod= 0
##$MI= 0
##$NCOEF= 0
##$NC_proc= -3
##$NLEV= 6
##$NOISF1= 0
##$NOISF2= 0
##$NSP= 0
##$NTH_PI= 0
##$NZP= 0
##$OFFSET= 16.522
##$PC= 1
##$PHC0= 154.5322
##$PHC1= 6.064308
##$PH_mod= 1
##$PKNL= yes
##$PPARMOD= 0
##$PSCAL= 4
##$PSIGN= 0
##$REVERSE= no
##$SF= 250.13
##$SI= 32768
##$SIGF1= 0
##$SIGF2= 0
##$SINO= 400
##$SIOLD= 32768
##$SREGLST= <1H.CDCl3>
##$SSB= 0
##$STSI= 32768
##$STSR= 0
##$SW_p= 5175.98343685301
##$SYMM= 0
##$S_DEV= 0
##$TDeff= 65536
##$TDoff= 0
##$TI= <Analysis number 999999
Compound Code 99
Book Reference 9
Project Code 9>
##$TILT= no
##$TM1= 0
##$TM2= 0
##$TOPLEV= 0
##$USERP1= <user>
##$USERP2= <user>
##$USERP3= <user>
##$USERP4= <user>
##$USERP5= <user>
##$WDW= 1
##$XDIM= 32768
##$YMAX_p= 428704190
##$YMIN_p= -128962
$$ End of Bruker specific parameters
$$ ---------------------------------
##NTUPLES= NMR SPECTRUM
##VAR_NAME=  FREQUENCY,     SPECTRUM/REAL,   SPECTRUM/IMAG
##SYMBOL=    X,             R,               I
##VAR_TYPE=  INDEPENDENT,   DEPENDENT,       DEPENDENT
##VAR_FORM=  AFFN,          ASDF,            ASDF
##VAR_DIM=   32768,         32768,           32768
##UNITS=     HZ,            ARBITRARY UNITS, ARBITRARY UNITS
##FACTOR=    0.157963299565203, 1,           1
##FIRST=     4132.6476996994, 0,             0
##LAST=      -1043.33573715361, 0,           0
##MIN=       -1043.33573715361, -128962,     0
##MAX=       4132.6476996994, 428704190,     0
$$ Real data points
##PAGE= N=1
##DATA TABLE= (X++(R..R)), XYDATA
$$ [...]
22655 8413 -3760 -1705 -23013 -12538 -12836 -10000 -12823 -1741 -17100 -17539 -13464 -8770 -16162 -16954
22641 -16954 1701 -14029 -18514 -23725 -7071 -5627 -41073 -49606 1570 18988 3674 21341
22629 21341 22431 -1533 -11372 -27890 -25445 -14669 -14628 -24973 -38155 -35194 -7381 -15626 -38328
22616 -38328 -44896 -44635 -35463 -21585 -25214 -30622 -15942 7299 26822 26509 41224 49200 47159 33948
22602 33948 25089 62090 61104 53234 17071 18762 6830 -15932 -5834 15964 2956 5351 -4286
22589 -4286 -3564 4360 13565 -24843 -54305 -86848 -75137 -77326 -63429 -37392 -17004 -20132 2954
22576 2954 11736 37363 4392 -20475 -45367 -54878 -24780 -14191 -3638 -31434 -50581 -20938
22564 -20938 -28635 -40666 -41827 -3039 29479 -4409 10780 2543 -26719 -41223 -51954 -42764
22552 -42764 -31701 -42228 -25678 -16609 -19689 -41031 -27962 -41634 -53968 -30687 -18446 -8656
22540 -8656 -7727 -13247 -30939 -42316 -39570 -47446 -14812 -1939 -9972 -18139 -2062 7120 -9765
22527 -9765 -21752 -29712 -8973 23747 23457 45716 72771 50674 2244 -7240 15359 43904 62808
22514 62808 48529 1770 -13845 1654 -11012 -534 8417 15952 2733 -12590 -11601 9984
22502 9984 17385 1788 -4519 -11386 9450 1588 -9768 -2791 14355 -11263 2427 28289 11519
22489 11519 -33630 -53755 -41664 -14641 -10385 7100 3721 -4119 7598 6046 -3809 6025 32596
22476 32596 17895 -1203 4117 51995 46625 36844 54084 36240 34166 34640 20532 -16540 -41113
22463 -41113 -11707 -139 -2903 4381 20599 5134 -16366 -14616 4414 13658 -13972 -31195
22451 -31195 -29081 -24051 -31336 -19358 291 10767 24822 32306 26515 40278 34478 4147 -10821
22438 -10821 -1862 2475 -7565 -10278 -29981 -35421 -23382 10832 28874 3418 3956 10289 14912
22425 14912 29253 12023 -13993 -43161 -44977 -37073 -38057 -17939 9718 -18659 -58113 -44624
22413 -44624 -18204 -7109 -38082 -17562 7918 4810 -39161 -88400 -93531 -60821 -38190 -41232
22401 -41232 -48400 -47248 -39609 -16733 -14452 -30070 -25566 -21288 -2402 12935 22775 18297 -5075
22388 -5075 -25375 -46264 -16142 5622 3920 -1935 19445 19853 18297 -1090 -30897 -49542 -51588
22375 -51588 -76942 -74108 -49611 -44220 -64283 -56291 -17302 15810 20144 4740 -5218 2488 -26157
22362 -26157 -26758 15152 30998 17528 5761 -7279 -18908 -41027 -21524 102 -20739 -27900
22350 -27900 -29230 -40598 -8642 4662 40132 54130 42281 24050 6139 21249 5581 -21497
22338 -21497 -27510 -3370 29854 24171 -6356 -23531 -46152 -56277 -42966 -39862 -37239 -24013
22326 -24013 -13115 11232 12778 924 -18632 -39766 -75757 -67102 -50366 -43616 -7836 -4535
22314 -4535 -25018 3377 39341 11177 -24249 -56269 -80416 -62817 -29273 -23709 -6833 -41711
22302 -41711 -65473 -69570 -64923 -38596 -23338 -10581 8715 28821 41793 35526 53691 54566 52327
22289 52327 46012 21845 20205 8849 -2599 17661 8770 11247 -1787 -30398 -24547 -12280 -17687
22276 -17687 -15892 7306 14225 8072 -10915 -15409 -9231 8062 16503 22974 15304 -8279 -3403
22263 -3403 16967 52008 29741 11616 16894 1576 -36262 -33169 6996 2959 -15206 -7494 -23629
22250 -23629 -21526 -23683 -14771 -37369 -39677 -31044 -37382 -370 25496 19821 10012 31891 35863
22237 35863 20072 -28419 -38304 -29100 -5927 -9047 -11544 -17668 -36363 -37421 -9185 1901 -3796
22224 -3796 -4525 -13645 405 -5377 -39459 -64413 -81284 -37929 -26205 -42638 -38351 -27369 -9167
22211 -9167 13513 10298 -27557 -29674 -27042 -17500 -15142 -25382 -28380 -32286 -37935 -44707 -24384 -15599
22197 -15599 -879 -11238 -11972 -23286 -25456 -18675 -22060 -42383 -37190 -19060 -19928 -65755 -79585
22184 -79585 -68610 -56614 -49356 -45617 -28544 -17527 -24020 -10569 -22289 -20307 -13288 -17025 -37727
22171 -37727 -20433 -18676 1659 17354 42677 35011 17321 -8307 13808 18101 18676 4395 -4926
22158 -4926 2150 4081 -7828 27361 28936 13730 11659 -15743 -33091 -17755 -2885 -30236 -64563
22145 -64563 -51789 -11878 -14906 -39303 -33531 -25577 -28269 -39266 -46817 -62406 -35980 -4433 39690
22132 39690 27987 -8958 -19624 -35741 -34001 -10935 2327 11257 38695 47949 56937 47848 10133
22119 10133 2216 -13512 -26857 -20457 -27648 -27901 -9055 14119 4614 -24615 -30980 -9134 -5743
22106 -5743 -14434 20590 8496 -19255 -8958 -7068 -13564 2971 603 11876 -7314 1043 -22373
22093 -22373 -24586 -20015 -17254 -47984 -42625 -50388 -19341 5771 4726 23039 18611 20485 12382
22080 12382 31210 48405 56896 25767 11374 1733 -19966 -20365 -22489 -11638 426 7595 -10064
22067 -10064 -11520 9107 33290 32588 -3747 -7518 -11742 10951 7826 -14731 -16785 -12937 -40845
22054 -40845 -59237 -50834 -60542 -41480 -27774 -22255 -4018 -29813 -23010 -34723 -26975 -41879 -8658
22041 -8658 26098 33267 11368 -21241 -7051 21626 10427 17156 -15217 5814 13087 32232
22029 32232 -14587 -38623 -35807 -26428 -18397 -62012 -84426 -60783 -28325 17611 20955 1900
22017 1900 5029 158 -13273 -68 17181 27739 19740 12217 13809 32444 27969 29001 7639
22004 7639 -9043 -54974 -33937 -29087 -10164 -4068 21506 48560 44685 22704 18120 -3038 -8852
21991 -8852 4120 5863 24714 2953 -8800 16408 22053 -18751 -23863 -2343 -11838 -14300 1980
21978 1980 892 -4752 29531 12060 4331 15287 8042 -1561 11476 2908 3217 -10317 -29107
21965 -29107 -26647 -37476 -39451 -33478 -1808 1275 -13992 9661 5570 -25750 -49726 -59533 -35784
21952 -35784 -13673 -8826 -9801 11334 21320 15256 16647 2045 -21155 -51071 -28656 -5658 -25372
21939 -25372 -24381 -31448 -35048 -35252 -42744 -44120 -34500 -13252 30161 50031 50441 58337 46108 39523
21925 39523 45735 25795 16075 2880 -3187 -37594 -63392 -59846 -32251 -2068 6962 3497 10949
21912 10949 -21464 -39235 -16099 7013 -6850 -33539 -41991 -29144 -18100 -22924 -12243 -8993
21900 -8993 -22516 -33128 -47382 -49051 -50150 -52280 -42457 -38277 -36200 -24952 -22250 -7310 -13126
21887 -13126 -10391 -3207 -14335 -5371 2975 28025 13242 4673 -1276 -30813 -37885 -42628 -32282
21874 -32282 -23888 19031 -3913 -16737 -24965 -35214 -22995 -7526 31644 42965 32861 29303
21862 29303 45421 28103 17079 360 -20073 -13558 -22454 -29901 -16519 -6781 -7393 9073 19673
21849 19673 26524 17807 1320 19540 33635 23296 39953 -722 -5694 32561 74278 51386
21837 51386 843 -24848 -81 -6013 -3251 -6285 -8473 -22150 -36740 -37486 -20111 9458 17139
21824 17139 9825 -8304 -35085 -27484 -4587 -11596 -24874 -29341 -24005 -24077 -20109 -16465 10187 36958
21810 36958 745 -57102 -58148 -44841 -57721 -58274 -50163 -55092 -44767 -18794 -8961 -13425 3930
21797 3930 1981 -15355 -10306 -12506 -25512 -25285 -44152 -53047 -69651 -69407 -41020 -33761 -36647 -52660
21783 -52660 -50183 -8811 28770 22425 -3730 10180 17858 23825 -5070 -15702 -6899 -21994 -46277
21770 -46277 -36569 -22230 -2480 -6265 -2834 -8898 -20494 -22300 -25682 -38608 -44259 -44205 -60438 -58511
21756 -58511 -70787 -63448 -61579 -65551 -50552 -52479 -22463 -27732 -65887 -56449 -70814 -68925 -37166
21743 -37166 -23063 -22588 -4687 -2568 -22678 -7208 -27378 -13111 11421 -5503 -22603 -10381
21731 -10381 3342 9251 -9186 -4854 -6573 -26432 8447 11740 1547 -9737 18531 39800
21719 39800 56317 27483 6887 -7784 -32177 -47040 -38205 -29126 -29199 -33184 -30048 -22001 -1419
21706 -1419 4055 30605 36856 37771 33354 22404 2202 -2229 2417 -3557 -5087 -12464 -2394 -11168
21692 -11168 -13481 -10831 -8214 -11322 -2542 -2918 580 15536 30740 43815 31383 -8353 -34885
21679 -34885 -17642 15653 14560 -2519 -10088 -15065 -30142 -41330 -59848 -55731 -47009 3147 29388
21666 29388 9446 -12386 -23740 -19021 -37627 -54079 -35090 -27038 -43811 -35383 -18910 -3396
21654 -3396 2090 -34342 -54226 -55681 -45778 -26513 -12578 -18604 -13032 -417 -26156 -31440 -30653
21641 -30653 -22603 -4770 -2898 -5527 -39991 -44609 -40746 -9113 25003 13990 -16100 -52416 -36202
21628 -36202 -34480 -6788 -693 7255 27047 42357 38604 18004 4600 -26575 -58744 -65490 -34748
21615 -34748 -31184 -29958 -25846 -39553 -12233 28821 42361 -2774 -10824 -32468 -81213 -76228 -49381
21602 -49381 -62057 -71568 -30918 12588 20873 -28681 -38793 372 47584 20957 25863 25360 15189
21589 15189 20835 50741 32708 41172 40619 7695 12231 14844 21129 7428 -3139 -20818 -59034
21576 -59034 -52612 -20635 -33611 -20484 24262 44693 66872 65105 47383 31489 40251 38297
21564 38297 50971 22882 -21652 -44042 -32309 559 17449 11721 5538 -1942 -26220 -28777
21552 -28777 -14556 -4133 -16831 -16912 2824 -5775 -590 9225 16303 29596 7420 -14975 -40525
21539 -40525 -30234 -14944 -18749 -35128 -51360 -41635 -222 7575 -13023 -8541 -5416 2402 -21092
21526 -21092 -14227 -18370 -40536 -36386 -25233 -25482 -2152 7811 5987 15978 8747 -4176 14092
21513 14092 1756 -7652 -10611 10296 21612 22483 44677 51092 48029 45192 27815 21495 10759
21500 10759 -9021 -30873 -24165 9006 15102 13933 -1529 -31998 -29612 24994 47766 27459
21488 27459 -4497 -9085 -5628 8290 -166 -11879 -39584 -18309 -43387 -82236 -65030 -80046
21476 -80046 -53537 -47085 -49308 -25592 -29298 -26546 -42100 -48907 -52949 -31134 330 -9354 -32505
21463 -32505 -20949 -13992 -12267 -40007 -26469 -5929 7660 -17543 -43292 10820 18465 3039
21451 3039 2705 12636 -14095 -19223 -26531 -16154 -30587 -37954 -41193 -37401 -44916 -2224 21147 17073
21437 17073 3891 -16032 -20309 -27085 -29798 -44563 -27199 -9463 -2089 13194 25460 36303
21425 36303 47146 38278 49424 15117 -21021 -21803 -29770 -37833 -20224 -31495 -31326 -31649 -11578
21412 -11578 18049 19546 17132 -12589 -1939 17443 1764 -284 -895 9828 -6952 -16834 -1191
21399 -1191 10118 7951 9589 -16733 -450 20272 36469 36102 34774 39988 35829 16837 17344 -473
21385 -473 -29469 -22066 -12252 -17378 -45418 -75399 -68762 -55595 -52634 -57028 -42518 -45479 -27937
21372 -27937 6195 -11319 -6142 3126 -26148 -45334 -54869 -42407 -47395 -62438 -56839 -43112 -47225
21359 -47225 -51145 -49859 -43172 -21868 -28885 -21044 -29192 -34723 -61860 -58784 -42142 -44736 -68016
21346 -68016 -52972 -68155 -45616 -46687 -59462 -49086 -56533 -42442 -14108 2886 -8734 -15381
21334 -15381 -20655 -20510 -11545 -33393 -21805 -31181 -34215 -13271 -27433 -16332 -47528 -42861 -10040
21321 -10040 -21860 -35623 -38639 -35178 -29922 -37003 -34859 -42863 -15709 -5177 -2327 -22019 -57934
21308 -57934 -60208 -33152 -11295 -4354 -2545 6447 19980 35946 -6825 -8635 -21785 -29490 -36911
21295 -36911 -37323 -20177 -13287 -14799 -28810 -4960 17874 10915 -1255 10409 29089 42584 40839
21282 40839 41076 30052 7652 11360 33520 49441 22385 -5782 -7142 -16979 -21106 -10650 13396
21269 13396 -32403 -61977 -56792 -29174 2197 -22445 -36103 -35366 -28447 7878 19656 4319
21257 4319 -38326 -57045 -28890 -7541 -26742 -57351 -51465 -38933 -69447 -65659 -48933 -8636
21245 -8636 18157 7051 10853 -5696 -42357 -63234 -65860 -54636 -38424 -45216 -17308 10976
21233 10976 -11593 -36851 -56917 -30676 -12500 -23792 -18909 -16190 -35842 -61277 -49421 -1792
21221 -1792 30751 31044 15003 -11154 -10264 -14485 -25547 -34877 -42804 -35248 -38049 -46068 -53230 -52489
21207 -52489 -27397 -8676 1007 29913 29168 20704 12148 20899 -1855 -38042 -26281 -28337 -49747
21194 -49747 -31898 -7764 -16876 -34277 -37736 -29440 999 -8362 -3982 4922 -2357 -1977 -1834 21966
21180 21966 5674 -9733 -41020 -57789 -65581 -54982 -10224 2600 -25936 -15783 10819 11179
21168 11179 -12393 -18876 -28198 -64726 -49713 -25761 -31735 -11139 9514 -7531 -5021 31987
21156 31987 42685 10730 4126 -7226 -24434 -9802 -5057 -1382 -5213 -1143 10230 8737 -9240
21143 -9240 -5986 -13359 10745 60911 48552 15091 6580 2563 -19523 -2490 10613 -8195 662
21130 662 11354 5279 4084 -8966 -9313 -27257 -35554 -2417 20924 28184 23334 41467 31073
21117 31073 -10900 -11475 -4649 15432 -11673 -52642 -34221 -50901 -57591 -21689 12576 -8847
21105 -8847 -50154 -61272 -36786 -28170 -16487 -3447 -49861 -40864 -24527 -8345 -14596 -5398 -332
21092 -332 -7191 -9743 -33056 -56029 -61380 -45585 -36772 5868 5601 -33855 -22990 7468 -2996
21079 -2996 -27779 -65369 -72112 -68863 -36446 -27710 -18610 -29776 -43424 -17377 -5821 -34808 -53896
21066 -53896 -76682 -58566 -28460 5468 17318 24918 41503 48646 53289 40842 2766 6848
21054 6848 5246 5661 -24511 -14878 -4430 -41018 -34398 -40410 -24349 11321 40081 12198 -8198
21041 -8198 -24616 -68744 -66202 -31986 -19821 -36481 -20485 3949 -16769 792 3244 -9231
21029 -9231 -6501 -15782 697 30002 15296 4080 7094 -2162 -10798 -29405 -30809 -44834 -57643
21016 -57643 -49256 -44752 -38796 -23434 -10872 15418 24135 -1121 -41258 -70393 -62514 -24956 -14555
21003 -14555 -11983 9072 15633 16715 18957 48522 60066 42084 38597 40761 45228 41005 6101
20990 6101 -33244 -19672 -11919 -17406 -15031 -9738 -5687 13316 -2344 -24506 -9666 -14699 -23526
20977 -23526 -17858 16355 2490 -29111 -49008 -22485 -34050 -62136 -79555 -44263 -57217 -32251
20965 -32251 -31765 -56930 -64510 -38402 -9919 -9474 -27612 -16847 15931 23909 25328 21698 17037
20952 17037 -18736 -21989 12657 -18975 -31900 -23541 -3940 15339 21788 5078 -19183 -7066
20940 -7066 1826 29686 6408 -11181 -9884 10072 14646 -13448 -25863 -17789 -3543 -39932 -48057
20927 -48057 -31044 -14959 -8471 -14991 15346 48910 78558 58733 43766 9593 7441 -8360
20915 -8360 -34174 -25792 -44218 -28002 -14782 -1081 -17253 1146 6242 6205 -15523 -38555 -52780
20902 -52780 -27500 10355 11628 2867 -33329 -49860 -38247 -11619 -10450 -20253 -27567 -43365 -32618
20889 -32618 -4721 -9486 -23279 -19929 -8196 -14131 -20342 -16422 -1965 -10627 -14936 -1223 11147
20876 11147 38394 44309 22709 876 2049 -18631 -2637 -115 -12506 -42 14314 -8737
20864 -8737 -48262 -53755 -18097 7001 26268 12714 -15995 -12695 11435 23501 18842 5382
20852 5382 -16913 -27217 -55597 -21792 -306 -11505 -19029 -11005 18627 32799 10707 -25586
20840 -25586 2568 38505 20282 8996 27455 18656 260 23451 32167 30580 21746 -8043
20828 -8043 -22808 1836 -9461 -29018 -32193 -13444 13567 -1594 -28867 -46089 -82592 -64649
20816 -64649 -12117 10526 -23431 -37658 -50025 -34338 2075 -19985 -12741 -10421 -40823 -41441
20804 -41441 -30367 -20751 -20724 -34284 -51159 -46322 -9111 26322 26133 29303 21532 -19657 -32880
20791 -32880 -16066 -34232 -25583 15593 32207 12829 11971 4728 4254 7480 -6001 -7623 -13811
20778 -13811 -9447 -12013 -32173 -25604 14414 10126 2735 -2096 26228 51511 34003 34648 27436
20765 27436 19016 4863 19536 -17038 -56664 -58661 -35859 -29695 -43372 -31902 -59551 -59826 -36043
20752 -36043 -22522 -9764 23606 18219 -13826 -11892 -8436 3771 4099 20798 26541 28807 -6698
20739 -6698 -67288 -57634 -43909 -30858 -32766 -15885 -11941 -5607 15809 6588 1181 -9441 -36890
20726 -36890 -54441 -34111 -47917 -51605 -25279 -23477 -7674 893 -4494 13014 26626 -1788
20714 -1788 -20852 -19986 -13870 -35441 -49860 -23078 -18638 2707 2625 -39031 -57550 -38870 -16399
20701 -16399 7320 -7640 -4355 -12321 -12751 6965 35142 -6849 -59315 -76236 -53204 -12322
20689 -12322 8762 2683 10774 1234 29418 24453 17319 5129 -12556 -1315 12784 8709 -8263
20676 -8263 -47296 -40811 -38531 -28421 -39079 -51038 -39024 -35976 -62024 -70380 -68513 -41916 -29549
20663 -29549 381 -13888 -26166 -15190 -6710 -41177 -64067 -83992 -74609 -42875 -51200 -42932
20651 -42932 -22092 -17160 -37562 -29024 -33492 -47680 -39537 -25968 -14625 2619 -15850 -24584 -47122
20638 -47122 -57809 -48320 -51371 -40275 -23154 -40345 -65390 -62728 -27960 2892 23106 15978
20626 15978 10144 7369 5740 -3404 -13781 -20616 -19964 -7243 22866 21211 -3770 -26263 -48955
20613 -48955 -5859 7871 2700 -28581 -23591 -16835 -26850 -8923 -774 -11491 -22701 -15951 11779
20600 11779 7139 -10919 -12509 -7285 -10292 -11652 -21083 -30604 -17811 -4889 11070 -3218 -14425
20587 -14425 8085 35893 23019 2938 33477 41456 40545 66821 64547 70123 37395 948 -2147
20574 -2147 373 -29852 -25991 -31198 -32696 -43430 -31089 -24875 -33822 -20588 -28494 -41719 -13971
20561 -13971 7805 12643 16251 1515 -3053 10605 2502 -9653 -3603 23839 37641 49872 34572
20548 34572 28327 38483 44468 34303 1804 -20720 -59707 -47568 -11364 -16539 714 -14433
20536 -14433 -42927 -57900 -36100 795 4865 -1734 -24114 -33131 -13871 -28009 -21110 -24126 -62590
20523 -62590 -70695 -37346 -10527 -27979 -4713 1514 -3510 15435 342 -38533 -11347 -5354
20511 -5354 23589 27210 -11700 -45806 -33254 -37769 -17772 15773 27192 -1785 -9873 21927
20499 21927 34005 15565 -1566 -11309 -38320 -42481 -10927 -36871 -15668 -7496 -22828 -9895
20487 -9895 -6114 -5617 8184 -8888 -6070 -1173 1682 9921 9727 -2335 -38035 -49325 -43018 -29032
20473 -29032 -46019 -86945 -95728 -65530 -44383 -58109 -69774 -65185 -49333 -30596 -33514 -37964
20461 -37964 -44158 -54708 -42227 -44420 -37146 -40195 -55757 -60652 -59116 -41793 -26174 -42245 -40635
20448 -40635 -61992 -26556 10997 -9492 -44709 -37238 -6427 22014 36034 27356 19243 -13467
20436 -13467 -14044 -22308 -1453 33455 42815 27654 -3131 6115 12328 48650 35020 31654 34758
20423 34758 16804 -18686 -19683 4980 33746 37057 13217 -23820 -57410 -44634 -36722 -58438
20411 -58438 -70385 -50353 -11110 -5022 -13307 -4425 20366 17968 -6269 -23316 -6376 -789 11725
20398 11725 35594 32822 5851 10535 13677 -3826 13579 25866 -8778 -21863 -10347 -21105
20386 -21105 -43388 -77497 -72588 -44776 -40193 -52440 -58601 -60186 -43026 -22379 -29210 -46147 -50468
20373 -50468 -42645 -29219 -41704 -56021 -49218 -59148 -59848 -46804 -36932 -48491 -54379 -41249 487
20360 487 20982 18641 18018 18234 12436 21408 27983 28656 -21828 -38928 -75096 -65719 -20863 -6085
20346 -6085 -11185 -15636 -14518 -11300 -37338 -29934 1056 31032 33849 1622 -33307 -49558 -24697
20333 -24697 -25296 -11512 18817 20367 -14306 -42014 -33523 -57396 -67474 -45335 -26064 11747
20321 11747 30559 40499 11876 -24658 1514 15316 17165 23228 20940 -12784 -31845 -27416 -23026
20308 -23026 17846 36394 7342 32462 63368 42529 41764 31649 44039 79314 89944 116227
20296 116227 162793 155569 167500 187823 245304 253454 213830 175733 161181 142465 174029 184503
20284 184503 199099 208944 198802 223859 210603 185467 164478 132242 64650 40702 63167 31872
20272 31872 3383 16543 34545 59209 58262 47462 34759 51553 63999 68255 47864 49122
20260 49122 33286 22784 14198 9906 -686 -3885 7143 20784 47847 57503 39631 59090
20248 59090 100391 133849 197698 274215 319554 339435 290268 214767 141311 120944 165577 193434
20236 193434 214380 220025 217681 228517 213766 171252 133067 72144 34545 -8237 -9913 19528
20224 19528 18821 -6904 -14097 -18745 382 56338 47716 4619 364 16676 20048 9912 2036
20211 2036 -8407 -31592 -23816 -19414 -21120 -31417 -19928 -30091 -10642 -27168 2805 16479
20199 16479 8603 5924 27028 40774 44487 28564 13989 -21904 -352 40303 34007 6908
20187 6908 6624 34617 19612 10972 -11488 5793 2362 13302 22455 36557 28075 -3883 4494
20174 4494 -5799 -27283 -41662 -27730 -14630 -35380 -37207 -43119 -62390 -26530 -12676 8987
20162 8987 18739 2438 -16674 -18326 -32607 -53090 -35415 -29117 -48374 -35479 -23019 -41461
20150 -41461 -47193 -25086 -11564 981 -713 6184 -15442 -22723 -25451 -24225 -8423 1429 -3188
20137 -3188 18405 7740 -4982 17603 29743 33240 38846 52154 55695 40064 9211 -8695
20125 -8695 24107 18110 19356 20215 29558 22343 35878 20775 25066 22031 6261 -11527 -4962 1036
20111 1036 7878 8230 23381 43445 43740 34500 21748 -11334 -13112 2024 -27788 -55378 -34573
20098 -34573 -11062 -239 2519 16082 22688 11179 26658 70092 78258 59446 26376 27363 40864
20085 40864 42207 44183 69535 38476 28696 30891 13239 17258 -4026 -6388 16046 58693 61641
20072 61641 28220 -9471 -16518 10062 37167 -7087 -6883 20097 26424 9651 -18130 -41620
20060 -41620 -64392 -62303 -21643 7619 12791 8621 -13722 -8638 6327 22163 15006 21595 20092
20047 20092 1115 19576 -4430 -27845 -14391 -39043 -48359 -15707 -5524 941 -5466 29021
20035 29021 69452 62996 64593 59618 71765 78034 90290 66296 50406 34710 31326 29982 61944
20022 61944 62629 56553 39345 40502 52444 62157 43374 11637 -11943 6189 3121 3884 18897
20009 18897 -9104 -51137 -67896 -44008 -15241 6131 33149 27104 27888 31866 5518 -43873
19997 -43873 -47427 -40631 -44963 -51533 -56085 -20480 3570 6468 15177 -27988 -59259 -55042 -29788
19984 -29788 -10336 -21338 -25145 -39113 -36433 -33261 -19983 8710 15438 2868 12572 22277 15175
19971 15175 13936 -13578 -22643 20442 29842 45172 53405 37037 27834 -2931 -9375 -13392 4498
19958 4498 120 -1335 -6314 7004 35570 45746 42865 53842 54206 17545 -27312 -20988 7627
19945 7627 10716 4866 12219 11919 2799 6338 -20043 -49075 -59920 -63526 -44061 -49212 -57813 -32617
19931 -32617 -28296 -25738 2756 8696 -13955 -40505 -54804 -15303 -1332 -16941 -32685 -27283
19919 -27283 -9595 19609 53204 33710 22741 20750 70298 58839 21979 14765 18251 10769
19907 10769 23432 1735 27264 55361 66991 57706 53102 66694 38827 73915 67800 62916
19895 62916 70538 73396 64838 50432 52183 79058 90273 92822 81769 65430 52566 51436 54963
19882 54963 53096 40282 51505 61252 82765 89564 62753 47030 58238 85225 88716 97601 92306
19869 92306 34925 80118 114030 122990 119252 141930 171017 177036 166723 157435 121197 84613
19857 84613 85164 87733 80743 85130 98050 149623 167870 146258 125758 112125 119522 127133 138406
19844 138406 157453 163280 128436 166644 201527 200940 204750 201255 207874 193159 222889 212344 225116
19831 225116 250639 271733 321753 412440 516646 664664 741467 685634 569637 476854 405442
19820 405442 354471 348733 331479 330304 371375 362557 375511 411557 442209 460037 470493 472762
19808 472762 505364 532456 578398 627709 668220 712189 813603 919982 1042020 1170022 1325545
19797 1325545 1483206 1637102 1803592 2017338 2218883 2389990 2536421 2688533 2905331
19788 2905331 3172080 3491857 3896092 4342250 4865831 5569831 6488215 7712059 9355379
19779 9355379 11659203 15047696 20299260 28108477 36624467 41885790 45186139 46285703
19771 46285703 42666312 36815255 30972204 26973563 26571511 30239429 36180621 38167131
19763 38167131 36055079 32815261 31009782 32843898 34685906 31510969 25749256 19048318
19755 19048318 13612699 10216577 8228811 7014680 6231208 5679437 5267982 5005854 4912522
19746 4912522 4877154 4823870 4816529 4868454 4932136 5002292 5137358 5388292 5769404 6233664 6767408
19735 6767408 7469587 8405802 9603663 11186248 13461528 16823252 21959515 30149783
19727 30149783 42461635 55345673 59385134 54191595 44508982 34644378 28135342 25337597
19719 25337597 25576697 28831106 35541242 43840996 48430370 50235797 49967739 44678575
19711 44678575 36221167 27310322 19423147 13873242 10351119 8095173 6582400 5480095
19703 5480095 4629377 3983025 3484699 3134990 2869413 2623962 2448470 2340352 2298708 2282915
19693 2282915 2205137 2041266 1812354 1570371 1392013 1267960 1181827 1060910 917055 801803
19683 801803 729765 704330 692687 673756 634472 618885 609561 612053 623760 588177 547843 504784
19671 504784 463814 408708 413040 413563 398441 423585 447109 469341 527136 609089 715596 882889
19659 882889 1065298 1092598 992534 780442 610482 504830 426126 360684 307662 270591
19649 270591 248189 260710 285708 255033 213720 209869 220975 222346 223545 220077 219243 201172 195028
19636 195028 213017 205798 196239 202233 221492 243666 280266 349371 367482 355541 287389 257867
19624 257867 240939 219878 179007 153271 127533 123967 130090 91503 62563 67448 67996 97651
19612 97651 139452 176757 157815 157644 155572 148893 161704 145926 114258 126589 148083 137077
19600 137077 170401 191878 197504 242098 265256 243531 203330 205051 223645 216916 234482 211416
19588 211416 167585 148254 152668 116856 137203 180033 178587 182056 153537 130637 95582 73922
19576 73922 96057 103440 112357 119640 113686 95477 83305 84184 100163 85903 83957 97673 109515
19563 109515 109837 89086 81158 90218 96753 113028 120759 134033 179431 193185 230595 249370 229309
19550 229309 193139 185661 156098 133477 123964 123351 155866 178914 190041 207859 222506 218015
19538 218015 212141 218946 228793 202417 171604 104141 42348 50224 71234 54303 42652 39251
19526 39251 45675 53009 27796 18477 6775 7526 13768 3407 15805 13640 13550 27017 37888 68534
19512 68534 75250 71569 70769 61049 30247 50963 72886 62053 58099 69405 40111 14809 52845
19499 52845 53543 34843 36223 36332 73345 63366 62488 57036 42637 86016 111440 111907 134460 109306
19485 109306 73837 48075 36094 33924 37773 32122 41543 63246 69124 78073 72720 67235 90782
19472 90782 77167 66216 45834 41195 30607 31319 28911 68319 100276 82227 89025 90383 98830
19459 98830 135988 165773 146840 134536 98278 94002 96524 50848 90986 156999 209135 202473
19447 202473 131687 96538 57756 41950 33805 16517 41536 71383 71256 63679 45878 17696
19435 17696 4511 43364 61378 -1909 18363 26484 35798 77563 56942 48334 55970 63737 56730
19422 56730 25141 20501 42101 64105 95684 67851 78815 88828 121173 185194 235021 294950
19410 294950 307639 302855 277564 248566 210024 197412 197033 201816 246875 281172 289005 236179
19398 236179 169858 136262 81247 22869 18417 39353 73111 84772 71740 55300 38160 39314
19386 39314 76867 103058 97304 99156 110002 104631 86880 89818 131425 198930 219344 206733
19374 206733 175020 138648 130893 160422 178269 209386 214965 229263 216520 226187 243352 255960
19362 255960 273977 275425 258226 222329 184251 162434 167257 190044 180070 159734 163136 155184
19350 155184 101641 67556 77721 102130 101506 74295 51361 55858 60289 59742 69501 78243 89286
19337 89286 84032 81337 80452 94072 112297 168147 196403 217259 279420 317179 290093 281929 214018
19324 214018 200885 247040 301831 361203 356309 321360 262495 245101 213486 172125 147748 111379
19312 111379 99522 107143 108196 111594 95900 80274 97359 128383 107644 66597 20679 5984
19300 5984 2377 -28699 -11264 38200 39350 27577 18408 49499 57308 43056 57834 64266 47888
19287 47888 46523 70020 66949 65528 68849 62902 83229 96708 90539 101585 105362 126717 104045
19274 104045 80651 99762 109183 133781 152907 146679 129132 88160 70589 35204 40142 33818
19262 33818 22539 50293 98098 116028 76201 63652 72186 81619 84930 114520 135115 181637
19250 181637 211053 225161 217383 220951 179934 146032 124931 122487 113147 117668 144753 139125 108772
19237 108772 112502 120367 142924 139811 140888 189327 187899 153224 129145 82852 57055 62882 94866
19224 94866 80723 95546 85214 51871 33187 31873 48264 57878 60766 64482 104561 116300
19212 116300 90283 83141 102386 95172 92571 121431 147677 162164 238198 326156 357731 318383
19200 318383 271359 234526 228029 201520 181787 202309 241777 272521 316765 349431 363837 365664
19188 365664 321272 263625 207204 170232 144411 134316 153531 165999 114812 101191 95743 60219
19176 60219 88915 74808 66940 56254 47360 58770 66655 47865 36728 25132 25822 37458 38923
19163 38923 29248 20000 14382 31963 40676 46505 41060 36930 43047 66680 83312 86365 104033
19150 104033 113045 73625 42997 53388 79372 61424 53587 61784 56162 56070 60602 76532 88157
19137 88157 128349 156983 148780 149347 167442 145252 127601 102429 78947 87866 73135 51178
19125 51178 55203 37908 28253 44237 5890 -4488 -15833 30642 64457 103025 93599 82560
19113 82560 63490 40497 62582 72289 101708 78570 63162 42612 29270 18064 6739 -1250
19101 -1250 22814 46050 83080 99343 78089 68797 54570 61116 42577 36771 21883 30063 39321
19088 39321 51608 50815 52975 92581 91710 80895 85101 78209 75234 89907 97524 60824 36778
19075 36778 62560 47686 29988 41758 73627 83290 63042 40517 46744 52594 30013 7686
19063 7686 25906 60392 62801 53577 61972 71006 43945 23702 59599 63097 43408 47512 70759
19050 70759 79121 77156 54971 67220 91692 81054 88780 91918 113272 87593 57984 63335 69826
19037 69826 60018 38985 44799 70970 98519 114672 93311 88489 71880 38772 66418 130620
19025 130620 151971 157033 130457 128331 112588 77720 96436 110071 140388 150600 137892 98643
19013 98643 64993 70023 41710 52218 70517 79414 124676 135128 144057 125591 91206 91626 116759
19000 116759 135703 162847 177357 174117 177556 152606 146807 128578 151635 130041 131739 145035
18988 145035 146781 156921 150787 174062 219872 243049 269084 281573 296655 334522 362427 408779
18976 408779 468970 519831 563699 591621 609406 601618 601076 613465 664954 740514 860755 984046
18964 984046 1097512 1174676 1240563 1327798 1422029 1543565 1775251 2066352 2439095 2967974
18954 2967974 3716541 4777550 6394403 8880201 12093017 13956471 13352441 11533494
18946 11533494 9332154 7797598 7244802 7592038 8855196 11263998 14877680 17654954
18938 17654954 17053617 14420718 10867257 7757923 5748576 4523288 3775273 3313640
18930 3313640 3029650 2843055 2728542 2672060 2668175 2652009 2561804 2560663 2585603 2673438 2856479
18919 2856479 3080846 3392607 3780261 4100578 4384775 4735771 5156793 5759791 6586216
18910 6586216 7639432 9145594 11355106 14601186 18928759 23334754 27768802 33990499
18902 33990499 41703651 45604115 43012461 37145525 30476763 26084139 24973681 26986606
18894 26986606 32326419 40460932 47947991 50747849 45981802 37204342 27764634 20111549
18886 20111549 15071193 11972105 10010299 8716344 7849218 7309467 6995982 6821988 6637745
18877 6637745 6455365 6385457 6382421 6430210 6520626 6742435 7156476 7757484 8514321 9242424
18867 9242424 9961996 10798048 11873876 13378291 15549168 18755700 23597926 30894783
18859 30894783 41703735 54869571 63004115 62660424 58493464 54628985 55558460 60277502
18851 60277502 61263927 57246964 51416349 46807172 46723381 52074920 59647983 62046353
18843 62046353 59286818 55287552 53918326 58046911 62775489 59705534 50679641 38990077
18835 38990077 28281841 20732916 15881291 12706728 10595209 9194700 8259353 7622924
18827 7622924 7124650 6650495 6180588 5801051 5568995 5445379 5430045 5463240 5561377 5731244
18817 5731244 5959254 6175325 6412636 6700515 7169021 7855445 8754427 9999756 11710350
18808 11710350 14115913 17643551 23076595 31477001 42644380 51224719 51594907 45570484
18800 45570484 36968051 29366573 24812590 23255938 24301850 28199880 35480446 44729520
18792 44729520 49392596 46644528 38751131 28945561 20644463 14859755 11157948 8822077
18784 8822077 7318494 6247760 5461804 4903926 4524263 4202635 3905412 3591716 3266594
18775 3266594 3010346 2819652 2710117 2743078 2848169 3032099 3269732 3460132 3472277 3369621
18765 3369621 3280740 3295545 3501730 3860282 4360860 5059703 6096106 7665841 10189631
18756 10189631 14088381 18158372 18931795 16945797 13704845 10604353 8706374 7934760
18748 7934760 8060789 9157589 11378325 14166663 15038085 13419724 10685938 7722813
18740 7722813 5506307 4141433 3315107 2743782 2334132 2038865 1792961 1611149 1515230
18731 1515230 1433856 1324109 1213630 1094148 989093 921572 896213 896869 893601 872055 851139
18720 851139 816430 779932 743437 664035 610838 590689 555823 546169 574838 620101 646732 658607
18708 658607 692725 712159 698208 658671 601161 543820 502487 496809 501617 499704 510580 592293
18696 592293 685956 718311 732140 735830 732745 693512 618642 566499 524345 547249 546046 561883
18684 561883 577555 570743 520506 513195 483733 452681 430874 374748 363986 375855 378114 382423
18672 382423 376641 344876 344482 308972 283123 259466 228686 246906 320186 357926 391571 406189
18660 406189 391561 348872 311133 261993 209718 239894 287043 309170 342667 370994 336009
18649 336009 286613 265234 261379 275941 290440 268980 236888 217316 217278 206303 220599 253362
18637 253362 290674 306632 281240 270633 262589 279343 293933 286377 276411 254702 237035 252380
18625 252380 263094 243193 237484 245917 257196 262986 243518 228946 241329 267050 258878 239807
18613 239807 222399 195271 176144 178942 180153 207395 239210 256228 259023 269617 268906 255647
18601 255647 243981 223365 190029 169085 157058 163123 186006 194837 216062 250557 279960 276419
18589 276419 250375 251888 285292 309203 292287 245516 221394 239108 252357 267999 297233 318220
18577 318220 337062 326821 320974 317179 310477 284270 242732 194237 194605 194711 192201 215845 238034
18564 238034 245947 224003 231478 222580 217159 212908 237076 251089 244765 239556 242900 217851 176738
18551 176738 158491 173899 197587 194515 158021 155004 161623 216395 247375 270382 263989 222442
18539 222442 218114 236587 249716 241035 248098 255359 270761 281567 289649 279270 245789 217104
18527 217104 209066 204049 213445 213924 194851 191865 177573 171511 194257 192501 214237 205846 239609
18514 239609 234686 220810 194490 173364 181958 159701 146280 176098 239760 267357 238455 247533
18502 247533 229488 204507 199200 225880 222605 239368 254665 247193 206159 199181 234389 289614
18490 289614 305162 306942 308162 311314 283553 259165 252762 224431 217286 240768 271234 318683
18478 318683 364358 352132 327684 317105 329101 340754 365375 418556 452826 536039 584042
18467 584042 572545 525384 440605 397545 383388 346966 339069 347161 331653 336625 342152 335117
18455 335117 299776 279885 312696 333254 369735 407295 423372 459472 466271 474264 513846 509727
18443 509727 515261 544069 558924 608932 669739 772988 909163 1096604 1274973 1249998 1115425
18432 1115425 969945 832044 743880 647467 579333 590567 588962 581494 615088 635004 649713
18421 649713 667238 682299 678972 691536 699653 739019 754997 803382 817002 846470 874465 912449
18409 912449 996380 1090691 1227491 1390426 1553253 1700353 1849390 1974283 2120202 2292289
18399 2292289 2493548 2737417 3027298 3337225 3672869 4020032 4389056 4828652 5393568
18390 5393568 6136394 7090382 8346698 10020382 12274322 15430500 20130370 27271473
18382 27271473 36937898 45520602 50238459 53220547 52895229 47652158 40667240 33726561
18374 33726561 28788675 26894568 27958441 32271142 40538258 51831049 59118401 56415433
18366 56415433 46993819 35145258 24943671 18184965 14005126 11332150 9529961 8279599
18358 8279599 7417930 6804297 6340289 6026040 5819637 5653303 5582654 5584885 5704207 5939728
18348 5939728 6338405 6889793 7448905 7936291 8531717 9391464 10741919 12845343 16160564
18339 16160564 21444679 28851566 34378863 34831833 33092213 31522834 33073156 36975201
18331 36975201 37527235 34418589 30099310 26695133 26523626 30127593 36185145 40496517
18323 40496517 42207798 42524469 39249601 32642368 25275423 18351435 13212941 9889201
18315 9889201 7755169 6296084 5257822 4514093 3961372 3558523 3230543 2940396 2679463
18306 2679463 2466235 2276830 2086639 1941559 1849052 1799151 1770934 1716263 1670838 1577781
18296 1577781 1451274 1343995 1227117 1077046 961922 915458 898693 860648 837470 825501
18286 825501 819799 849238 905055 979248 1009950 961837 880759 816212 756969 761339 784812 779791
18274 779791 781765 835121 962198 1033150 1007415 878615 711978 599098 537221 461914 383988
18263 383988 355835 343666 339501 341561 349319 352244 374942 423157 450233 422835 386394 357552
18251 357552 297462 292844 345966 387015 371464 334662 300807 315449 318494 323402 382421 417832
18239 417832 433060 449523 433392 450923 465190 467650 467490 465694 439574 388735 312367 268030
18227 268030 230149 262340 292472 277012 284904 256187 217392 237516 215691 182984 187324 168922
18215 168922 151846 171851 168216 151086 127714 122539 123071 119540 90649 98479 130392 135576 135375
18202 135375 118181 131638 137986 126874 91347 78455 108839 102934 57176 48579 65776 63315
18190 63315 46656 73629 125020 98927 106255 146132 136809 127309 80000 32509 26473 49931
18178 49931 85018 83730 73299 85626 94844 89098 96785 93579 96898 103263 77156 76845 85152 108067
18164 108067 124239 130469 144524 149234 172873 171767 173672 154640 153987 170585 186785 217277 240010
18151 240010 234358 192625 190153 202171 240345 248160 251904 287107 300576 283766 282749 308826
18139 308826 329553 371033 409597 432384 462598 513610 524620 575228 655783 744635 865597
18128 865597 992274 1159318 1298493 1447557 1621388 1797059 2027963 2297336 2641892 3096947
18118 3096947 3644017 4311799 5223443 6539778 8424368 11286883 16073432 24714636 39374016
18109 39374016 50984564 47050652 37771604 25172356 15417359 9941448 6972687 5257651
18101 5257651 4179848 3373535 2769925 2323182 1992216 1742238 1529738 1313348 1133104
18092 1133104 988181 873184 775323 704457 654255 626831 566218 527524 522193 495087 450474
18081 450474 393745 364562 357409 329055 304051 316350 293001 264414 246059 241999 260626 237479
18069 237479 210483 200466 197865 202726 178957 178608 204099 164274 126310 124412 115819 125268 144579
18056 144579 181711 228348 228640 211833 219370 214023 242707 246161 226488 197408 195687 192818 170854
18043 170854 157204 137465 120171 94203 74782 73730 94193 116900 94897 71755 58048 70804
18031 70804 82588 111929 101645 74983 44713 30065 29402 38256 65323 88721 92164 76760
18019 76760 43901 15627 10683 26638 20647 25602 56667 50861 46045 62178 53252 19896 13734
18006 13734 11775 10214 13259 44315 55699 80928 77975 54552 81113 102345 109525 113894 121926
17993 121926 144738 165478 163453 196389 220189 224628 237057 217885 186429 174618 164270 162498
17981 162498 180450 200014 168757 175866 177712 151983 116184 73669 35636 43308 68648 78568
17969 78568 83543 114759 105730 91329 70844 77062 48063 34514 24430 22143 42307 73816
17957 73816 84018 81900 68507 41542 43848 64577 57260 66695 98808 117251 122127 130135 129129
17944 129129 141085 136756 95656 94096 113252 119413 100297 95835 107412 100869 113471 121094 129434
17931 129434 116434 115292 125999 130679 111489 91713 108494 90609 68523 48625 42262 47942
17919 47942 48350 62030 60888 22841 47762 45171 57310 78255 92062 84936 66079 88313 93875
17906 93875 60682 63862 42693 49290 48516 61637 71231 65606 57225 66160 29727 38398 49518
17893 49518 49788 54092 40758 51689 55547 48595 44853 62034 55243 44442 27162 4896 5689
17880 5689 -24166 -14875 30672 28422 25136 34721 44638 38377 40981 42836 35643 50998 100737 106050
17866 106050 91011 90165 78381 53176 72364 95389 147772 221018 255745 253306 238782 264060
17854 264060 248274 191422 122443 131069 187904 248703 252857 292354 292849 241864 191059 152723
17842 152723 131823 110519 71506 72168 89216 86096 64094 51958 57698 30536 15321 15413 13616
17829 13616 39294 77117 66346 53921 38315 36230 22234 18386 27627 53698 52630 53299 67157
17816 67157 91568 133616 182302 187359 165778 181126 213295 242683 277353 259307 229810 212162
17804 212162 182727 189753 163892 165617 189037 202471 176993 109036 81643 85120 60513 17077
17792 17077 -13585 -1774 31236 25176 23044 19700 15679 25216 26100 27788 27204 12014 10590 1023
17778 1023 -5100 -3675 13048 9030 21049 31450 42944 20330 -18007 -11459 -6345 -5499 10146
17765 10146 8447 26135 25286 20535 6048 -9348 -14172 -29657 -35401 -26627 -1496 9958 8306
17752 8306 12219 3671 -2447 16859 33174 23435 -13597 -34957 -13801 23566 41573 33069 33420
17739 33420 15597 4504 11294 51258 42447 14562 -8960 2086 -7658 -33282 -16130 6365
17727 6365 39758 42363 28669 -15545 -12119 7683 -24766 -37635 -15493 -13445 -13876 64 10687
17714 10687 -14808 -44911 -19446 -1261 9763 30015 36798 31196 19387 30869 40861 38134
17702 38134 28494 -10156 -26300 -34084 -8262 -3738 -3832 12066 5781 -7152 6757 -8013 -35576
17689 -35576 -33721 -6625 12528 -2805 -23654 -41794 -32906 -51855 -28368 18648 12256 -1470
17677 -1470 -15112 -13964 -9878 -12091 -18857 -20890 -29948 -32141 -21839 -26221 -31542 5224 15852 15448
17663 15448 5886 2499 -14519 -21226 9882 13830 -7083 -31175 -47124 -39126 -14710 -12003 17960
17650 17960 16424 -5346 5401 -13703 -17784 -23106 -21811 -18751 -7613 -27826 -26844 -23004 -15339
17637 -15339 -8404 23513 36805 11054 7718 15039 5277 10641 18749 20841 9636 651 14841
17624 14841 -28245 -26197 -41063 -54984 -29155 -8598 -5648 -53759 -52566 -29451 -23856 -30134 -53915
17611 -53915 -55435 -54391 -46576 -58784 -56004 -69670 -54854 -17267 5806 15236 18094 5784 -8902
17598 -8902 -34764 -51809 -40432 -22927 -33803 -11578 -6314 -10017 -19230 370 30860 14344
17586 14344 3209 -13308 -33582 -17317 -31711 -36194 -10474 6737 16171 19794 -703 -15609
17574 -15609 -15549 -28302 -26347 3047 24060 562 -14102 5526 28180 23810 4750 -7253 -11752
17561 -11752 -6055 -11461 -29743 -49032 -57545 -61379 -75235 -69083 -49055 -48743 -32435 -6746 -8795
17548 -8795 -28337 -29969 -37991 -42287 -52259 -42504 -62879 -59688 -18698 -1901 -271 8799 17397 5577
17534 5577 -8757 10417 20357 26821 30980 33633 22263 28192 29453 32506 57965 53385 13542
17521 13542 -12702 -10236 5108 9611 19181 30824 24 -18269 -22984 -30929 -42771 -35070 -7608
17508 -7608 -15459 -2649 13232 16841 12136 342 8552 -5018 -16804 -12733 -4120 -7815 4534
17495 4534 18802 -3767 -59318 -66587 -65382 -26297 11864 18968 32224 58511 53105 65988 13262
17482 13262 -41983 -66975 -73276 -56085 -37402 -13239 -19365 -12995 -27979 -43402 -10925 -8203
17470 -8203 -23590 -21140 22322 22064 25174 29182 670 -8368 20226 33777 30006 3646 -315
17457 -315 -2888 14783 59718 72631 59953 64620 49139 43121 69036 101018 138802 152991 180842
17444 180842 265933 345737 374573 324859 309468 277951 258718 276012 306748 366674 414144
17433 414144 471488 550330 643154 711201 721986 723701 694797 630258 537655 453150 354430 255384
17421 255384 223031 186851 150415 112143 66705 54227 45649 40527 20966 -14408 -15022 -24369
17409 -24369 -12028 -1073 -2025 -23109 18484 36494 54670 77009 64548 74913 26645 -8291
17397 -8291 -14477 3323 198 -18429 -37103 -60519 -57384 -8485 38770 31074 8717 15989 24764
17384 24764 3357 -16973 -18325 -6706 -13351 -37984 -47078 -56715 -55888 -35570 -18957 -48456 -23847
17371 -23847 6102 16221 13924 32518 69105 57068 60539 43103 15090 2930 25149 27949
17359 27949 44228 64057 50136 42997 23188 13696 8643 -156 -10633 17910 5143 -26005
17347 -26005 1745 2941 -2467 -11679 -23159 -22783 -23472 -9090 -13433 8647 44952 38733 14517
17334 14517 44638 29346 -2501 3938 23737 33465 37388 24358 33727 30534 21732 12440 32198
17321 32198 32055 26825 1124 -23548 -29348 -41889 -14692 -54 -22948 -10859 8693 4719 -5547
17308 -5547 4180 46 6324 -7295 -40302 -40670 -25313 -18357 12494 28123 36378 5630 -42386
17295 -42386 -48737 -19615 8446 2866 -18122 -18036 -18398 -22038 -72697 -82140 -63357 -52009 -21100
17282 -21100 34067 50131 41319 27794 28495 21312 37637 35703 17089 10394 -19715 7825 54664
17269 54664 67221 50398 12178 11927 10381 23020 32546 14003 14421 21340 22777 20958 6665
17256 6665 -11910 -16643 3238 42411 61274 67103 54479 47930 34993 3444 -13289 -18295 -22849
17243 -22849 -6093 -17993 -23365 -18020 -15221 -22409 1420 9464 629 -2880 2004 -28477 -14113
17230 -14113 12959 -578 -10017 -3008 21572 16816 -3818 -31064 -24927 14454 47135 45216 6975
17217 6975 -19558 -4955 -29352 -33684 -26490 -47424 -65997 -85761 -56099 -18569 3883 1121
17205 1121 -34455 -56125 -47085 -7360 -2430 13197 25602 7511 14773 7000 -20472 -24920 5874
17192 5874 22802 27456 6930 -24998 -22206 -753 18160 54236 55269 46165 15937 7200 -17937
17179 -17937 -9642 9265 30120 17336 -10009 -26257 -24088 -24097 16715 57610 59229 61853 38657
17166 38657 19886 13183 23644 20019 7475 1903 -11217 -4900 -23860 -27699 -35128 -30160 -41223
17153 -41223 -54505 -46181 -25533 -16947 -12123 -20329 -16993 -9574 28988 27437 10003 -15303 -38823
17140 -38823 -28584 -11486 12399 27335 20435 27490 46088 58359 30954 10788 16177 35410
17128 35410 24549 19762 22603 27277 15129 19015 39488 65775 52712 62930 78887 91867
17116 91867 59792 64907 62821 88452 72017 55051 71200 76746 38538 25748 12874 6611
17104 6611 20186 44534 47786 31027 8014 -20755 -5316 25867 32044 22174 -6635 -12346 -2085
17091 -2085 25434 49763 53126 45689 37290 36114 37769 20565 -36666 -51200 -20592 14949 40240
17078 40240 18968 -7242 -15172 -17755 -41514 -65339 -72383 -50030 -44841 -41749 -44192 -31062 -41793
17065 -41793 -49233 -32292 -33683 -36615 -15612 32058 25641 26277 47393 42764 51689 43909 30862
17052 30862 68674 100104 90820 85092 61503 36121 6295 3436 -5974 2072 7818 -9711 2122
17039 2122 656 -9786 5018 27769 66696 95887 76632 36646 27561 2315 18751 30203
17027 30203 19702 6561 2975 -16450 -9048 1289 25040 46600 57442 93403 83547 96861
17015 96861 124204 109476 46063 45312 44599 42512 38276 23737 1001 -11353 -19723 -25796 1555
17002 1555 36044 32692 38398 40785 42944 28543 27230 15550 34913 76332 120613 94078 74741
16989 74741 92031 101879 166177 198643 184171 192520 187702 170963 133005 90269 71372 82616
16977 82616 100306 106514 104781 130364 112932 62234 56452 63092 82002 119499 123378 148094 161636
16964 161636 127063 115364 145772 146106 178063 178709 170411 166918 142808 115265 111814 126564 123981
16951 123981 131256 100306 94353 114485 111069 102540 105924 81342 90247 106719 125779 112456 125255
16938 125255 140459 170536 182133 180210 167194 176866 189861 205377 234215 215480 200307 204123
16926 204123 199290 182927 171280 196886 211199 209793 227988 228372 223100 255395 270949 267064 297782
16913 297782 334261 378980 411148 458781 504122 556632 578766 595173 610652 653947 697503
16902 697503 762518 799071 821839 872576 944063 1006694 1094053 1171019 1231981 1303409 1467252
16891 1467252 1641883 1828092 2044805 2303557 2611765 2947816 3307529 3732127 4141337
16882 4141337 4599078 5100557 5671718 6294872 6970684 7734565 8600652 9616669 10837317
16873 10837317 12316010 14146312 16546773 19765330 24236692 30617928 39708959 51593324
16865 51593324 64827318 78823874 95298526 113188402 125831934 131315318 133657389
16858 133657389 132873241 125113782 111219639 94665121 77606163 61570409 47434443
16851 47434443 35704754 26716851 20373352 16088905 13166697 11084005 9566015 8418690
16843 8418690 7486160 6729849 6099103 5572087 5067880 4657940 4328034 4036423 3694498
16834 3694498 3378762 3103024 2865644 2618634 2329524 2070282 1853901 1645158 1445711
16825 1445711 1301533 1212888 1137308 1057997 1022854 942427 862012 831819 779203 730373 713333
16814 713333 683791 650970 620394 613184 593498 573179 545799 546744 528709 480915 463551 477843
16802 477843 492089 469129 418075 398265 417437 394173 380819 320739 311572 308026 289166 295988
16790 295988 281213 277356 276622 260536 244140 223394 212795 196503 189732 188381 186002 147113 142008
16777 142008 160691 183857 204283 206830 202669 218131 248912 212106 170188 159675 148938 161919
16765 161919 168628 163828 166837 170023 163233 162487 152871 130909 130854 147643 152911 142177 147867 143895
16751 143895 125189 143190 121157 105073 121124 124322 96228 100182 96360 104188 113506 133851
16739 133851 155480 140199 121624 80987 45589 8263 -27214 -28496 -13806 1678 46619 96093
16727 96093 117851 109968 92343 84324 97195 58312 72582 94314 91530 100041 82784 61347
16715 61347 56544 67783 64966 53063 26479 24153 46803 41110 50404 45401 43260 41440 68216
16702 68216 73863 32505 30506 41347 34851 29056 43813 19576 23111 28339 42886 64314 64547
16689 64547 69079 87598 86179 87376 91808 94913 78369 66029 55568 58739 78267 71972 73889
16676 73889 80894 66586 22964 17759 46024 38086 14296 16446 32534 27374 18753 -3912 -30692
16663 -30692 -29641 -17168 21314 54768 55533 59841 46856 72866 90311 67019 53438 54603 52221
16650 52221 68181 86562 106186 102731 74088 47114 42859 51402 38612 32311 49357 59114 27936
16637 27936 11205 42333 63900 48946 51778 66510 54095 45003 22574 68947 86283 63256
16625 63256 73810 73525 24521 21455 -3449 3517 16361 6094 3278 29440 35442 16507 -286
16612 -286 -27676 -1035 7206 3911 3273 8355 -2115 -15169 -28064 -6281 2100 1288 11952 25140
16598 25140 36611 36862 30821 27571 13633 37317 37611 28388 21663 23164 51246 66361 38031
16585 38031 42005 52536 67730 76007 48298 41200 47771 57175 28522 19829 30513 32765 35658
16572 35658 65698 111170 122079 62520 45330 65685 83171 67167 55393 59908 81460 79784
16560 79784 46702 32982 32941 63697 67598 27369 2340 -8131 -22882 -17857 -14544 -25856 -63336
16547 -63336 -81962 -65521 -52613 -68071 -62955 -19052 15394 4040 -13597 -43318 -43322 -7789 -20928
16534 -20928 -39633 -53792 -37383 -3723 -10351 12724 15570 -12936 13109 -3679 -19306 -4811
16522 -4811 -24923 -28270 -32001 -31826 -2409 -20650 -2282 5099 12066 20939 24603 20897 30545 32670
16508 32670 44593 42634 25118 19021 13144 -8101 -30100 -26224 -3921 -32972 -54623 -58176 -31769
16495 -31769 25763 53669 68968 16407 13942 33825 43597 45795 41427 50451 28566 34867 10833
16482 10833 -17222 -43530 -10088 34059 29668 11822 13774 42705 36025 1279 -21041 -15115
16470 -15115 -16656 -29886 -6700 9039 15408 24814 15610 9982 11018 4969 -210 -19504 14438
16457 14438 47842 45984 7741 19979 29307 9251 43818 45587 48230 59837 29128 20627 43678
16444 43678 1864 -23521 -22436 -22125 -20374 10475 17695 2207 -6555 19010 40366 -4416 -5421
16431 -5421 8121 1221 -4945 -5156 26459 47726 49274 45686 50821 55650 28590 3385 -10396
16418 -10396 -1084 23530 24557 9925 14780 18433 31079 18373 -19934 -27163 -28143 -29055 -20384 2511
16404 2511 25364 24239 11567 3568 709 -911 -6021 10497 -26513 -51305 -41750 -36407 -25474
16391 -25474 -19570 -17482 -9605 3490 6743 -9630 -1760 -37237 -27645 -28509 -35444 -8773 -8999 -5607
16377 -5607 7459 12513 -3549 -20371 -15777 -3631 -9608 -29417 -25127 -35015 -39347 -43713 -41552
16364 -41552 1605 -10918 -24035 -20197 -14072 -14360 -8296 16215 26138 882 -5316 11894 16758
16351 16758 -2805 -29656 -48047 -31228 -13617 -20802 16239 41805 27138 12380 16765 1257
16339 1257 -5249 14089 30032 28699 6411 25187 32455 13695 15377 -25031 -27523 -46686 -43434
16326 -43434 -20067 -2704 1644 32329 28791 8450 12235 -9891 -24677 -12875 -11069 -16511 -17854
16313 -17854 -11741 -2256 -8002 -6549 -7017 9877 20360 -5107 11083 28517 17755 21797 36384
16300 36384 35850 13216 37386 62751 87904 96418 90814 103920 86510 119148 207265 322134
16288 322134 438485 564790 628377 687577 722786 729437 715861 677579 606748 511192 414749
16277 414749 359026 296258 227267 167717 111683 64162 82271 76566 79490 66803 47677 63117
16265 63117 62096 30941 12197 35791 44916 44358 18331 -15772 -20975 -17096 -12092 1204 6884
16252 6884 7014 3451 -9841 -12077 -20599 -27949 -28759 -40413 -26864 -31288 -39859 -39877 -14421 -8656 9814
16237 9814 -7429 -11417 -42591 -44730 -14221 -11204 -37883 -32300 -2377 5961 -161 13081 20462
16224 20462 26855 37187 -7543 -36630 -30574 -31687 -30620 -7440 -6573 -20915 -32661 -27425 -2060
16211 -2060 5678 -19999 -46680 -64158 -86813 -60731 -68690 -68750 -34701 -1749 -1759 -27995 -64012
16198 -64012 -55087 -37031 -13072 5300 10831 4369 625 23875 7336 -11232 -35656 -39088 -6413
16185 -6413 -28821 -44423 -59453 -45191 -3300 9247 -11559 -10119 -51198 -79062 -53531 -20488
16173 -20488 -20834 -28493 -35893 -34226 -8245 3963 9197 -1486 -30269 -8523 16687 29301 30140
16160 30140 32889 16909 917 -27670 -26850 8455 28847 12077 -644 -2778 4455 -11081 -16141
16147 -16141 -18903 -50236 -44476 -33276 -36381 -13892 8748 26142 9152 -7375 -28435 -3952
16135 -3952 29860 1723 -16862 -13556 -88 4924 -8115 -19262 -31830 3678 13531 328
16123 328 -9978 -19545 -24019 -3861 3520 25855 23092 -9098 -24087 -12468 12282 23247 35256
16110 35256 31988 10203 -6186 -22799 -33854 -31609 -10390 9180 4575 -10385 1895 7337
16098 7337 35471 58183 23836 -20546 -24107 -7059 -12910 -16015 -17219 6840 33465 22751 7506
16085 7506 6692 2372 -832 -26591 -13340 -17096 -6722 -4841 -4683 -2549 -10612 14864 14953 776
16071 776 4411 -914 -2929 12006 -5011 -2220 6410 14192 16313 -13634 17051 21790 8412 -3403
16057 -3403 14151 12629 6149 12718 10736 21272 -12007 -19700 -12897 -9005 -26232 -39276 -23904
16044 -23904 -16398 8279 24962 8804 -12899 -9154 -15919 -21063 -6760 14783 -295 -7635 -4715
16031 -4715 17872 -254 4165 16098 28831 31759 2422 -11811 3237 25073 20646 21041 28395
16018 28395 19289 -8924 -17116 -7031 -165 1330 -699 -7755 -10287 10858 31837 27980 13810
16005 13810 -9595 15784 28734 12059 6899 21958 18810 -6682 -2873 13155 -4602 -46017
15993 -46017 -35881 -43121 -41089 -27205 -12537 5925 -5208 880 30890 50897 33856 25276
15981 25276 2231 -19826 2880 16391 31714 28617 -24689 -44884 -50959 -33365 -24921 -36891
15969 -36891 -19700 -17850 -12213 -13033 -8786 -214 12608 38659 29622 18152 -8156 -39670 -23016
15956 -23016 -16940 -20800 -27708 -32169 -2734 28032 37525 49298 40158 -3792 -43872 -49805 -23570
15943 -23570 -20420 -8446 -13177 2990 2886 18684 3338 -8376 12308 25382 11947 -1003
15931 -1003 -6610 1433 -4309 -2414 -5864 -14753 -13668 -13048 -12630 -36417 -42905 -17470 202 15014
15917 15014 17615 2772 -8289 -28984 -29071 -30797 -35379 -25291 -41672 -37572 -5693 -4110 -21918
15904 -21918 -5276 8811 24934 30936 18786 -13502 -20603 -28290 -16510 12143 -4107 -29613
15892 -29613 -17161 -2513 131 16070 9332 21775 24771 41076 41888 34663 51161 49560 27066
15879 27066 26207 14390 -10382 -22043 10112 46681 3301 -20691 8861 28434 25645 2432
15867 2432 -24846 -12819 -45899 -80109 -41075 -35124 -25272 -60908 -56971 -19159 25558 6159
15855 6159 -15931 -27009 -14549 4098 5354 3063 -11569 -19583 -5648 -15199 -25628 -21273 -6437
15842 -6437 1004 11162 26929 70502 70959 35638 19089 31854 36001 9841 -3028 4889 10072
15829 10072 26899 11017 -9056 -22838 -10738 2096 325 6096 36126 44704 8065 -18259
15817 -18259 -13040 -10242 -24746 -24050 -29421 -6208 11190 20601 4645 -20483 -31311 -14077 -18910
15804 -18910 -12635 2125 -10697 -18222 -24124 6667 39248 30104 27137 36184 40141 37877 27779
15791 27779 10836 45638 61735 57819 20673 -1356 -17486 -50734 -65307 -56217 -57816 -71611
15779 -71611 -64982 -46588 -63466 -60048 -42531 -43058 -62835 -51521 -58691 -40166 -17162 -18386 -25413
15766 -25413 -54622 -40073 -3170 2840 9301 34632 20641 13610 -10799 -10914 -39332 -49407 -29402
15753 -29402 -40898 -24974 8908 21397 23444 25578 15521 -7665 9990 43203 42673 32458
15741 32458 46763 54142 45266 32465 -15879 -44191 -20220 8329 21689 12000 -10631 -6939
15729 -6939 -4322 16955 3296 -8926 -17718 -15792 4367 13268 29832 21895 -4400 -63396 -61659
15716 -61659 -37241 -30188 -6857 -1671 -6491 -6211 -17572 -18727 -11959 -7895 -21273 -9879 -9169 1475
15702 1475 15768 9218 -8341 -5285 -3656 7102 22875 13032 22790 13796 -12836 -7518 5667
15689 5667 8728 21688 7121 11822 28422 6474 -39597 -37327 -9834 11988 23419 13710 10136
15676 10136 9123 7251 27673 38992 45686 26271 -23162 -10434 23145 28466 41089 56375
15664 56375 87152 68606 26662 29274 36091 32734 28995 20826 6038 17457 31548 25943 880
15651 880 -17230 -15109 5777 -6076 -412 19598 5796 -1702 6116 8869 17994 24411 -5777
15638 -5777 -21955 -36807 -35667 -11726 19633 725 -33406 -39575 -33301 -37408 -42051 -48483 -37915
15625 -37915 -14741 -19341 -31365 3804 21085 11765 -11302 -34466 -42354 -40865 -22925 -135
15613 -135 25683 -11682 -42527 -26507 -4929 -327 -21487 -14273 -6223 10625 14626 13205 32520
15600 32520 41008 32330 19630 -12938 21055 22569 14674 19245 39155 42814 34059 13600 3498
15587 3498 -34478 -11138 12283 1643 20765 35999 17768 829 -14363 -18234 -21005 -19033
15575 -19033 -1076 9215 9948 13261 -19191 -49045 -33123 -10779 -2206 -20685 -34806 -32848 -30547
15562 -30547 -55846 -39758 -24097 -8892 -23753 -29886 -48058 -50049 -27291 -18709 -20866 -10950 18022
15549 18022 13256 10230 -6058 -22366 -21766 -16704 7188 15088 5445 17989 46196 54345 52217
15536 52217 37500 28060 31056 30447 1595 -19007 -20610 -19644 -35689 -23646 -11615 -10134 245
15523 245 -14864 -20458 -8685 -1182 9145 19137 26179 19335 -11153 -8401 6616 11075 6963 17015
15509 17015 35185 1585 -8207 -7837 -19572 -14130 1523 487 -14298 -28618 -48679 -46699 -32086
15496 -32086 -27319 -25277 -25185 -30914 -45078 -57922 -43840 -13685 -482 8733 10546 19277 34993
15483 34993 -15826 -42668 -17469 7867 28027 57324 56763 47451 21767 -6002 -923 5043 14130
15470 14130 28847 18093 31896 42256 36432 14708 -2324 9077 12642 21929 28066 24214 30214
15457 30214 46651 22325 20580 41402 30129 7328 -7898 -4836 -9081 2136 5157 4191 -3129
15444 -3129 36243 61026 47640 11985 5676 2309 -407 -12543 -300 584 -11791 -22812 -35483
15431 -35483 -15934 19657 -17733 -48576 -50079 4225 40699 24305 8869 12301 5566 -31202
15419 -31202 -33501 -21396 -9529 -18464 -13055 -14182 -14891 -25808 -41344 -21060 11601 -4463 -14368
15406 -14368 -24708 -34803 -36128 -22733 -10280 -7194 -17143 -16207 -30394 -33864 -19570 -33059 -13215
15393 -13215 18331 -1881 24563 28962 33207 42942 34797 3452 -13960 -11055 19471 26224 3321
15380 3321 3349 -3173 -18518 -3841 7323 11175 3207 12812 48124 51298 45212 50883 47279 25177
15366 25177 23356 10553 -6932 -16434 16907 21782 2569 -4635 9319 4456 17606 25736 27844
15353 27844 23668 120 12547 38147 40936 30214 16687 -6117 -24954 -2970 10718 18552
15341 18552 19196 10006 -3229 -491 -14195 389 12485 1338 8230 -404 -1323 17621 20902
15328 20902 22977 18827 10560 11314 6555 -45564 -40354 -11832 38308 55248 30964 34008 10028
15315 10028 -17186 6300 17797 31509 40350 40978 33077 2353 -31149 -23206 -26169 -57622 -45089
15302 -45089 -46056 -46181 -20573 -21401 -33690 -28169 325 5806 -1547 -4713 -9550 3426 15482 -29695
15288 -29695 -59062 -38298 -19200 -6396 -24159 -36156 -25052 -9939 -8918 -18409 -21578 9713
15276 9713 19473 5890 -6627 -14430 -23234 -26098 -16493 -14918 20048 31334 36179 34781 22886
15263 22886 -665 -15836 -16120 -19674 -16585 -23839 -9874 -9388 -36722 -40508 -23864 -37995 -28371
15250 -28371 -25179 -23373 3244 -12489 -24648 -39486 -65302 -62008 -58129 -76021 -75572 -41869 11577
15237 11577 16234 -5166 -21559 -7339 -7903 -15791 -19200 -21885 -25272 -21562 -15812 -25834 -10565
15224 -10565 -14113 -10584 -10620 4608 20420 22321 17736 2597 23694 59309 44343 31668 30911
15211 30911 46350 33336 30269 16968 -10009 -40445 -22013 1692 20774 -3427 -35342 -52720
15199 -52720 -52557 -21640 -21745 -26621 -26016 -15584 -10702 -17275 -5413 -6291 -8651 -11649 -26949 -30130
15185 -30130 -17215 -23145 -29713 -27997 -58731 -41261 -14511 -43947 -42085 7535 19591 10862 6920
15172 6920 -13899 -18537 -3252 4588 -2009 -36437 -18404 1554 22816 16161 -21789 -2355 -7182
15159 -7182 2267 25755 24172 7147 16507 -574 -7306 -24766 -5348 9324 12199 3777 -20677
15146 -20677 23021 30804 9687 -22283 -19314 -31334 -23311 -11937 -35209 -53473 -49896 -29384
15134 -29384 -24315 15442 18543 -19841 -44817 -40219 -30746 -30831 -25370 -9670 -10670 -17534 -27577 -20197
15120 -20197 -9594 -8388 6860 14254 10883 10792 28711 9589 -16614 -43767 -29869 -6921 -12272
15107 -12272 -7136 -8936 -20140 2066 15474 -3901 -4397 -13329 -32734 -12093 14768 25018 -1286
15094 -1286 8054 24723 67373 70085 55008 57753 40868 24074 7337 17049 16614 -854 -7768
15081 -7768 -13612 -11670 -15688 -21103 -32523 -27765 -38586 -60994 -77018 -42742 -18319 1385 31932
15068 31932 25493 -14475 -52802 -71726 -43322 -8343 -3318 -22158 -25019 -2709 20202 31608
15056 31608 16922 -19645 -38600 -21715 1147 24970 30280 18317 13683 38265 58028 45206
15044 45206 23982 2879 -22473 -32258 -66741 -46388 -11086 -15817 -20472 -16125 -22843 -37472 -29004
15031 -29004 -16432 -7680 -10029 -7208 -35668 -33191 -7698 2014 18564 16314 -4024 -12294 -19723
15018 -19723 -30217 -4832 -35916 -34792 -28930 -25930 -22504 11211 -11321 -34476 -30495 -48024 -27542
15005 -27542 3762 -4449 3466 4259 276 -14542 -20030 -32828 -39680 -21821 -182 3677 -7237
14992 -7237 7773 2296 29419 20823 4984 336 -687 -24288 7105 2269 5656 -27493 -21215
14979 -21215 2011 -16556 -79 -2659 -23466 -24057 3723 43587 57577 43735 16891 140
14967 140 -3495 14742 16213 2683 -2987 -15124 -43668 -63299 -45259 -57582 -13308 15163 44100
14954 44100 53282 23490 8191 9239 3260 -16426 2433 5663 11987 -12010 -8693 -12819 -18577
14941 -18577 -13286 -19209 -40968 -21418 -2758 -2426 30237 36650 39306 28579 30362 36454 17482
14928 17482 19853 18421 11402 -31758 -38440 -30711 -51772 -75816 -68180 -57892 -30295 -29858 -14142
14915 -14142 -15081 1931 -14912 -37539 -3199 -852 -39302 -41388 -48760 -57888 -52283 -68606 -49043
14902 -49043 -9798 -12842 -8685 -22942 -14932 -21017 25192 47852 11190 15481 39955 13816 23471
14889 23471 35181 22125 -9496 -34925 -45582 -3026 27164 51708 43613 24442 19879 7148
14877 7148 24304 22707 2776 -13084 -6183 21787 19659 1317 -34185 -30527 -40694 -34164 -26166
14864 -26166 -12850 -19481 -15237 -5183 544 -6485 -20776 -32890 -35820 -41367 -19774 -30109 -36299
14851 -36299 -22208 -17525 -27447 -29914 -26201 -17781 -24821 -23962 -24650 -37374 -31197 -21767 -9830 -6123
14837 -6123 -7054 10992 6441 -14313 -16627 -32080 -28677 -32944 -38044 -54790 -41583 -40417 -54490
14824 -54490 -58940 -47229 -29996 -13349 22184 17203 419 -15148 -17098 -20355 -44344 -42722 -30488
14811 -30488 -50509 -48508 -32645 -11075 4908 30965 53736 37726 20460 -4822 -8925 -17659
14799 -17659 -21667 -9348 2155 26530 23327 -14967 -28800 -2276 -5544 -13218 3818 -11045
14787 -11045 -21184 -25529 -12237 -10053 -1919 5946 -20690 -24728 -38510 -36517 -40672 -17042 7794
14774 7794 15565 12364 -13874 -2656 16373 21075 14714 9385 -10502 -20826 -39900 -41505 -37509
14761 -37509 -6715 4726 -19158 -46187 -61295 -62413 -75307 -74360 -69874 -44423 -23181 -1211
14749 -1211 8282 25016 27350 17907 1688 19415 8519 -5669 -16359 -19489 -44481 -73104 -62094
14736 -62094 -60526 -73280 -59840 -22114 8922 11359 21364 44208 22510 5308 3187 -5027
14724 -5027 -33150 -44099 -27643 -34398 -46093 -48460 -34249 -11590 -26916 -27711 -24371 -38501 -27692
14711 -27692 -23952 -44887 -18478 -23839 -13943 -15288 -40174 -40509 -40020 -3999 8623 23437 1605
14698 1605 -20364 -19087 -52661 -72138 -41355 -10830 3315 25945 39835 42549 33609 5213
14686 5213 -11011 10291 37966 44196 50858 28976 14982 4504 -22602 -22377 -14403 -32441 -48224
14673 -48224 -56080 -44338 -39620 -31696 1831 21368 5507 -15177 -19422 -7715 -19042 4343
14661 4343 27348 4675 -1203 -3343 -14204 16586 9854 2369 -7471 -17844 3268 -15340 -17112
14648 -17112 -9663 18020 33114 14243 -15912 -10242 -9620 -3622 33527 54225 25895 20654 39469
14635 39469 37744 16632 28789 16026 6802 -605 -16840 -53537 -16892 35842 37983 -13817
14623 -13817 -29365 -36095 -4060 12846 23589 15290 15390 15531 -9225 -29461 13133 12926 7395
14610 7395 -15371 -23860 26619 43041 14859 26330 48568 65706 50932 33575 32078 13456
14598 13456 -4168 -22806 -41543 -55176 -33110 -22345 -21727 -5014 -12988 -28216 -41906 -24740
14586 -24740 -9722 -11842 -23898 -38909 -9040 10082 4347 20317 2049 7183 13575 11195 -19858
14573 -19858 -14371 6722 23680 14298 -3337 -3920 14895 10510 7601 28045 13385 2048 -24589
14560 -24589 -30574 15243 10137 -27434 -30353 -7609 15464 17267 44518 33739 25149 28865 45554
14547 45554 2583 -16755 -20630 -28725 -47640 -32293 -12066 7376 13441 16247 -4651 -42404
14535 -42404 -37006 -9579 -8950 345 -6881 -19750 -24771 -13825 22345 53834 60858 37504 39346
14522 39346 43809 53695 36711 11876 3584 -14209 -10189 -29224 -18439 -694 -15689 -17115 -18217
14509 -18217 -46297 -38573 -31545 -23774 -3008 21304 21676 17364 7706 -9755 -29213 -58117 -56310
14496 -56310 -53553 -28062 -20864 -18081 -39040 -53732 -46319 -31622 -28885 327 1220 -11454 -28878
14483 -28878 -58179 -64780 -24929 -5864 12787 15549 10162 -25185 -32407 -29782 -21019 -27244 -8766
14470 -8766 4436 3021 -34201 -21549 -2435 -54137 -79473 -48478 -8063 3240 31406 32188
14458 32188 -6911 -34435 -5717 -19275 -43773 -61302 -29514 -7141 -39138 -65853 -60836 -58259
14446 -58259 -63901 -56381 -33510 -18837 -1952 28773 29401 17799 6381 -16346 -13331 3705 10421
14433 10421 -22168 -9566 -3486 -14774 -14727 -14481 -42299 -57745 -71011 -95666 -75680 -64934 -52679
14420 -52679 -35395 -15913 28206 34327 17800 -8359 -9677 3707 -3095 -18143 8463 -2095
14408 -2095 -37478 -48200 -45484 -60524 -49884 -29836 -37646 -24607 -24853 -28944 -21725 -22112 -54822
14395 -54822 -57135 -12753 14571 -3803 -29914 -36067 -39641 -29365 -20287 -32971 -19605 -2709
14383 -2709 3679 12072 -15485 -61921 -64902 -74271 -75890 -55327 -22395 11828 -27278 -51202 -91164
14370 -91164 -111349 -48623 -1103 -9732 -4554 -22530 -1979 11658 21062 -11805 -14899 -3889
14358 -3889 15586 -8618 -13845 1526 -12460 1651 19298 6156 2200 11875 16156 44662 42702
14345 42702 19344 19337 15057 11828 13108 11504 3850 19029 32638 -9466 -16246 -3136 7674 -36268
14331 -36268 -45953 -17150 -5610 -4285 -2817 -26964 -37492 -29942 -27511 -38966 -64206 -37519 -33499
14318 -33499 -68128 -49569 -44389 -47432 -37877 -43868 -37272 -23655 -32735 -36090 -41762 -47131 -57151
14305 -57151 -62362 -60466 -50475 -44839 453 31914 11231 -25623 -43141 21678 50377 37163
14293 37163 56866 77655 77933 63747 47715 36404 62624 61468 35887 22731 28447 39062
14281 39062 60848 71514 63386 72138 60896 30513 12294 -6455 -13523 -55304 -41705 -7367
14269 -7367 11668 -2260 -19360 3927 3014 3644 6742 -4008 2030 51607 91514 82416 37220
14256 37220 663 -15435 9504 10213 18545 42944 36100 16847 19977 20462 2897 -27730 -30264
14243 -30264 -10949 -1752 -371 -4731 -8248 -18861 -33576 -13708 4510 -6494 -25764 -29634 7642
14230 7642 8643 14325 6378 -8720 -32471 -33288 -51064 -66817 -24955 9458 1136 -22933 -7630
14217 -7630 -13492 -23821 -1986 9913 14790 -2668 1112 18905 -12554 -14739 15881 7211 14880
14204 14880 13960 27822 38951 52879 53673 55621 25496 -10464 -19287 -7638 -19050 -23022 -8032
14191 -8032 15628 24193 31263 38224 47794 52431 25645 2527 212 7204 20983 37694 45860
14178 45860 17050 23746 5749 -25316 5943 12859 5936 14566 23755 -3627 -44239 -52216 -19393
14165 -19393 4773 18708 16541 11211 -4531 -6521 -13813 -20808 -21566 -19728 -15717 -11857 5918 34380
14151 34380 5631 -9622 26602 54311 49579 29978 22095 49506 47958 3988 -32282 -40941
14139 -40941 -29225 -41186 -18501 1349 2085 18399 42503 49818 41862 28283 6054 -10356
14127 -10356 964 3900 -14645 -2589 -9415 -34927 -58946 -53804 -22063 -4426 -5141 5036 35467
14114 35467 41707 52372 45940 59810 52264 37013 -12166 -30148 -27925 -12588 6919 19648
14102 19648 34630 18674 -12060 -40116 -21426 4039 22118 5293 -12664 -13074 -31494 -72909
14090 -72909 -51789 -27730 12656 38568 27169 32312 36537 39508 -2634 -17020 -11696 -3046 -1099
14077 -1099 -12166 -20481 -25707 -10390 3374 -18663 -28893 -15184 9282 33238 41724 9610
14065 9610 2006 -15149 -13863 -28595 -57940 -64970 -29005 -10967 -23701 -27154 -33026 -38782 -37465
14052 -37465 -21362 -20235 -3089 11009 4244 -35389 -45554 -53928 -36322 -7988 -15308 -29036
14040 -29036 -30079 -18465 -67595 -82616 -56772 -60422 -38686 -22138 -35790 -16904 -8343 -9630
14028 -9630 -7737 9688 12173 7901 -11390 -28960 -11749 30144 28541 -5626 4299 -4462 -33747
14015 -33747 -58412 -12081 29986 20481 -15304 -22465 -1242 -3910 4409 -2395 3695 -28467 -50848
14002 -50848 -48060 -26457 -17562 -45621 -57453 -37793 -23086 -20268 -24283 4446 11333 30538 30790
13989 30790 10182 -1861 -12754 -2003 9965 26961 34446 26913 17203 -18583 -24284 13439
13977 13439 11277 12269 17118 22292 18141 4021 -11769 -22136 -26790 -35356 -48223 -10100 493
13964 493 9641 18484 38128 33763 33415 30595 15202 19705 48189 34958 13726 -38093 -63177
13951 -63177 -66689 -38549 -26097 -4507 41537 51812 41095 27246 4450 -6949 -3287 -8860
13939 -8860 7400 23910 24352 5966 -18666 -45994 -72627 -78571 -64770 -28722 -17074 -12935 -10714
13926 -10714 -20601 -20020 3060 27257 40238 34611 15208 -18535 -46720 -36578 -6748 14470
13914 14470 11006 -17184 -25381 2545 46472 76226 68435 45266 38879 42412 58077 41432 39817
13901 39817 31368 22056 40816 24161 13612 3560 -24174 -15382 10196 -13978 -40160 -59143
13889 -59143 -58214 -29350 4368 11695 608 -8967 -16479 -872 16478 5765 -5424 -16191 -45106
13876 -45106 -46195 -50917 -46184 -23806 -16779 -22086 -35074 -18735 -2753 620 31797 35818 -14049
13863 -14049 -4616 13030 29457 -1850 -48904 -60373 -38497 -8091 6762 -9785 -8166 -9843
13851 -9843 -6981 15666 3653 -32271 -29937 -14382 -10266 -19456 -24188 16186 22315 4818 -24689
13838 -24689 -41605 -54945 -38303 -27233 -25590 4500 35258 25358 -8180 -13980 -16505 -345
13826 -345 27069 26170 22829 11197 35448 33356 32659 34133 37126 12212 121 6267 -4131 -39853
13812 -39853 -47249 -37429 -26730 -33190 -42158 -22670 -9597 -46527 -54230 -32726 -16242 -20759 -38816
13799 -38816 -65494 -73949 -59306 -46608 -31049 -30266 -25767 -26838 -42691 -34010 -28198 -2221 1288
13786 1288 -7171 6371 7510 -12240 6571 13336 18520 33850 13962 -18010 -36457 -14598 25752
13773 25752 31062 24862 -8946 -13408 3226 5074 -25507 -53545 -26622 3566 -17651 -24907 2309
13760 2309 4075 -9954 -3273 13005 13960 7752 52821 57263 34662 24133 16505 4766 -452
13747 -452 -4494 -4747 67 22723 31767 29847 29352 29608 25530 -5336 -10491 4242 -1779 5396 -18303
13732 -18303 -47574 -30989 -19374 2137 -26468 -27972 -1926 32906 11785 2806 2702 6187 1487
13719 1487 -10977 -8058 -22018 -38503 -47700 -43202 -46635 -48516 -60824 -33541 -26115 -39344 -12315
13706 -12315 1313 6994 9640 1511 -16399 -26185 -64197 -83378 -58494 -27356 3573 21690
13694 21690 -8038 -2700 -2870 -15715 -49229 -62587 -44872 -36490 -17676 -11135 -4030 1929 -3683
13681 -3683 -11387 -15382 -20166 -8837 9982 6913 -14162 -30004 -17676 -8773 4461 5474 -19081
13668 -19081 -35385 -7907 7128 8075 24288 25195 26856 15339 -3219 519 14592 10421 -16000
13655 -16000 -15838 -7063 -25625 -22524 -27997 -37126 -44168 -45268 -48732 -42716 -32882 -43651 -50237 -34973
13641 -34973 -47341 -48787 -30978 -24517 -35615 -3525 18116 19588 14808 29614 32720 19970 18855
13628 18855 23092 13695 -5219 -33876 -36961 -37077 -32356 2733 13900 -63 -4674 -2932 8247
13615 8247 -2115 -21727 -4915 -37642 -39891 -30621 -11236 -30973 -57771 -62100 -47551 -31193
13603 -31193 -840 -10035 -6060 -576 12354 10482 -2011 -21954 -43980 -56774 -36190 -10040
13591 -10040 -33173 -30686 6431 13152 -5101 -15304 -20456 -28038 -43788 -35151 -35623 -18546 -17770
13578 -17770 -8385 -19982 -8352 16424 14682 17015 12516 15929 9401 11305 22968 39540 20237
13565 20237 -9249 -65808 -78576 -57791 -61498 -64275 -39544 -21484 -17544 -2107 21170 15944
13553 15944 1533 -44238 -46939 -13287 -2572 -22639 -34113 -24778 -10595 8725 48797 51058
13541 51058 50503 46919 9825 -17511 -21953 -15048 -3495 2786 29728 30089 20724 15120 24128 21002
13527 21002 7861 -32480 -37082 -10854 -4987 10746 16821 34472 42979 47528 46339 25407 41195
13514 41195 53538 24377 18619 5679 15030 23080 12429 23094 -11586 -26287 5805 -2080
13502 -2080 -18812 -35623 -22701 6595 5027 -8507 -26138 -49472 -50926 -22634 -7053 -10929
13490 -10929 -22904 -37398 -62094 -15176 6735 -21532 -49958 -21774 -12251 -43974 -42073 -1621
13478 -1621 11489 15335 8593 11818 -5707 -4512 8326 24305 31366 8105 -20469 -40640 -36963
13465 -36963 -22086 -39939 -39790 -23747 -20533 -26609 -38093 -22865 -4967 -8035 -19801 -42964 -60502
13452 -60502 -41869 -29381 -23165 -24727 -24944 -15005 -22231 -7966 2414 -5771 -29509 -42698 -13932
13439 -13932 -17767 -25534 5460 19054 10505 21460 24351 22720 28581 11197 -6953 14310 51823
13426 51823 57539 26144 17161 27567 -199 -32383 -55215 -37163 -31294 -21574 -4000 114 10011
13413 10011 -1694 -3617 38786 60388 42598 12251 2696 -6853 -1514 14666 10915 -12071 -22299
13400 -22299 -934 5113 12459 35429 38538 35231 32302 41080 22210 14850 -750 -2097 -5068
13387 -5068 -15450 -10272 -4591 -14317 -34036 -36218 -29648 -4390 31451 39310 18061 1409 -26232
13374 -26232 -49770 -75898 -82510 -82903 -79689 -68483 -46608 -34688 -19278 732 -5209 -18847 -24930
13361 -24930 -12356 -25782 -14639 698 3307 -8291 -22030 -5325 -5550 10538 10620 20493 14355
13348 14355 1957 21730 567 -26229 -4099 17950 8821 4717 -10868 -33895 -27627 -24266
13336 -24266 -8428 -16219 10019 6939 -2633 -5644 4287 694 7284 11462 28626 27230 24094 24175
13322 24175 33636 -117 -27558 -27512 -5165 -5720 -35485 -16551 14041 1706 -15915 -12160 5203
13309 5203 -9588 -6359 17724 34360 21453 18740 4412 -10943 -11349 3070 15222 7114 -16316
13296 -16316 -17884 7358 11297 15674 -15992 -50960 -61743 -38386 -8713 16789 -12110 -8319
13284 -8319 17760 31676 27514 35639 31146 37470 35247 26336 31631 12636 -26011 -28269 -32076 -24119
13270 -24119 -22953 -12096 -19829 -20384 15367 5826 -23092 -43813 -27258 -10199 -8067 -49084 -58249
13257 -58249 -52801 -68469 -69268 -39005 -9514 10314 12117 15618 7496 -8015 -20247 -18139 -3108
13244 -3108 24610 9009 -10881 -7256 -1132 19014 21655 10520 -15721 -24137 29401 6745 -17688
13231 -17688 -40132 -41288 -22323 14328 17538 23758 24766 31880 29612 25781 13280 -20416 -5688
13218 -5688 18033 16300 -1929 -28630 -20981 -22073 -20151 -10492 4464 3862 19972 31684 45371
13205 45371 46638 39692 33728 51185 38156 29168 19750 36957 10194 11582 33144 28669 40700
13192 40700 38509 5314 -21107 -37807 -36003 -34037 -35949 -51352 -62901 -23995 8913 12255 36305
13179 36305 31045 19049 4439 -3268 4794 22195 18619 9385 1686 20798 39591 48606 22962
13166 22962 -7983 -7197 12967 11990 -5059 -2271 22956 23118 12516 6399 -348 -5396 6246 19127
13152 19127 51715 51279 -2157 -30222 -17576 -21978 -9035 11674 808 -42058 -51720 -42513 -20198
13139 -20198 -20900 -296 17833 12546 -1181 -6953 -12883 -50773 -50313 -28882 -20945 4846 -8374
13126 -8374 2453 22897 54171 32165 14557 -6459 -13706 -11313 14231 -7083 -31940 -11896
13114 -11896 -10668 -20110 -18654 -21757 -12959 -20451 -12853 -16758 -21113 -1714 15357 9723 -12418 -24311
13100 -24311 -22856 -16179 7310 -1212 -11050 -26777 -40503 -29130 -8817 -10624 -23494 -51998 -61352
13087 -61352 -67765 -79123 -82103 -86965 -65913 -46131 -27225 -7568 -17481 -1419 31348 51146
13075 51146 32251 14243 21546 13836 9679 46227 56004 30607 -406 1168 -7245 -20608 -6285
13062 -6285 -21028 -3070 5511 -25677 -52922 -40947 -15540 -19131 14135 -5877 -16783 5919
13050 5919 229 1297 6049 18584 23695 23344 15249 40582 41005 18234 28437 72780 76183 24292
13036 24292 16028 31714 49213 38330 26534 9490 -2359 11684 -5370 -8766 -15862 -8824
13024 -8824 -18355 -18339 -19065 -27450 -28390 -11244 6072 6567 4137 18733 29241 75521 84895 83207 82866
13009 82866 74870 99703 117556 99488 67660 61152 63790 71558 33875 12179 44706 74023
12997 74023 67582 -3751 -7493 24531 18219 -10922 -14812 6838 14463 18645 70730 74038 22462
12984 22462 29974 47646 51254 29480 -4174 -57745 -74422 -33036 -9647 -2681 13116 15077
12972 15077 7944 38942 63461 55504 48158 65019 97017 85309 59680 36837 22240 14056
12960 14056 -4646 -4018 23924 17915 49647 57325 46732 35438 35405 17203 40248 64601 72192
12947 72192 23268 13206 45131 56047 69927 71654 74971 102870 110006 76135 72209 50481
12935 50481 71460 44285 60969 61716 65858 44135 26180 58768 101329 100168 71015 33034
12923 33034 27595 23266 18389 20397 37777 38744 30382 13150 22053 85056 131091 133137 115380
12910 115380 112621 119194 145762 185695 181370 145331 128828 113596 120112 145421 155885 191545
12898 191545 200885 232510 270916 318308 402663 536060 728573 945591 1175275 1427941 1712560
12887 1712560 1965412 2107363 2146217 2136255 2037880 1825770 1543061 1254576 1007479 786481
12877 786481 614284 477200 356331 285348 247369 233490 199622 150758 139931 101816 79647
12866 79647 69530 60945 62297 83551 66054 52406 46566 40141 14559 879 19992 18086 13427
12853 13427 27003 15094 18661 17091 25997 58618 57797 49127 61406 54071 48055 39355 15497
12840 15497 -1866 23075 44160 48440 51452 66279 78986 71783 34569 10065 11243 31642
12828 31642 4592 7116 35862 62974 53281 10049 -12989 -19971 -11508 -5665 23411 33325 24727
12815 24727 12216 18099 42822 21754 19494 42183 46005 46508 35502 32394 38360 40380 44694
12802 44694 81607 107859 100824 83348 56021 38677 7498 -27589 -30956 -11560 23283 13353
12790 13353 10519 24663 44520 61731 50253 43257 69679 96692 88835 85451 68494 70141 78613
12777 78613 82251 83485 65212 43688 45852 33056 37798 58951 42877 14950 38925 34534 35499
12764 35499 63912 57523 76317 94038 78870 77660 83665 76636 76783 88297 116935 117220 122734
12751 122734 132056 120007 103932 109062 57848 7626 -29754 -95713 -115802 -83471 -95709 -93286
12739 -93286 -104083 -120829 -121202 -111210 -124776 -113338 -103081 -96361 -78248 -75420 -65894 -41855 -16872
12726 -16872 -31185 -29618 -2469 -3355 -1856 10240 5868 2245 -26137 -26033 17402 59863 57944
12713 57944 33382 37480 29971 10920 35654 70436 61657 69227 90276 101575 137315 197157
12701 197157 220002 247932 290629 333176 390663 418172 411653 373426 329392 303175 259507 234113
12689 234113 186253 132700 91417 104016 104279 90137 77533 69486 43798 53110 89061 89573 108250
12676 108250 118818 150905 187916 207214 255916 263428 246939 191171 150506 124522 89148 63189
12664 63189 51608 48558 28146 -14162 -44711 -24565 -27861 -2385 1122 -14729 -20094 -42566
12652 -42566 -18844 -5537 -18678 -41465 -39472 -21100 -9985 -41174 -42354 -8628 -10736 29697
12640 29697 38988 73839 66358 96339 143890 151273 144967 143244 134459 114435 104184 74378 72591
12627 72591 76708 82506 85094 68153 56650 60946 70238 99778 105287 78985 35932 23245 30162
12614 30162 39664 56597 48084 34869 31371 19947 13363 -2631 1549 25177 5601 -4518 21586
12601 21586 50931 77902 109913 106347 98901 126604 161497 157239 141672 136264 128660 78127 41577
12588 41577 68815 131582 135045 112025 108433 105656 109291 136500 136893 144503 150195 160174 158286 212985
12574 212985 261401 288282 343275 370542 388709 430673 463298 472741 499218 527915 498648 408043
12562 408043 343793 315585 304096 325300 321427 329460 358941 355613 359503 387193 369028 378935
12550 378935 402561 429708 412744 400682 378015 373303 352169 328549 341534 314385 320306 319276
12538 319276 299732 295268 292474 299644 289948 284602 322887 337670 316577 321096 339343 356892 389671
12525 389671 447102 512326 529748 539701 570361 572974 573364 615353 617063 624911 638965 634173 648991
12512 648991 661211 645504 627307 651924 667115 691182 739562 754808 775115 784963 791958 824772
12500 824772 897295 944223 989700 1051931 1092248 1181224 1261711 1334317 1419647 1505953 1612370
12489 1612370 1736987 1842791 1946933 2050578 2150272 2293937 2445876 2604345 2760448 2964494
12479 2964494 3190507 3422327 3663857 3927461 4199520 4560558 4927495 5359210 5886502
12470 5886502 6498569 7196263 7983489 8939187 10026785 11316385 12813864 14523604 16453667
12461 16453667 18669068 21219665 24082277 27436268 31464593 36277073 42189596 49630525
12453 49630525 59172808 71829024 89141140 113532841 147511677 190481302 238273554
12446 238273554 291680873 350524930 396609862 418442452 428704190 425108468 395098747
12439 395098747 347853917 294772993 239933682 188571045 144354908 108412636 81658391
12432 81658391 62988537 49957949 40580661 33619591 28180937 23904772 20514577 17791264
12424 17791264 15630191 13896451 12423835 11179629 10116768 9192454 8408681 7738632
12416 7738632 7143943 6611868 6119412 5677460 5310385 4976870 4677730 4377492 4101499
12407 4101499 3856204 3600907 3394557 3207318 3034475 2868785 2707578 2558965 2437525
12398 2437525 2378951 2306092 2249459 2210435 2193919 2180801 2203563 2227645 2265855 2306385 2278254
12387 2278254 2250589 2236513 2171116 2060681 1926149 1786587 1670801 1544512 1452850 1396972
12377 1396972 1315912 1232640 1169403 1117667 1075894 1046149 1007409 958163 914026 891654 876518
12366 876518 856443 823602 803627 786115 800375 793619 775554 780513 764190 749817 744670 756137
12354 756137 770045 771559 734453 677999 675552 654573 631091 621293 608852 598936 582423 571456
12342 571456 567290 556447 559913 526678 555410 551951 519698 497168 467800 481327 447869 427871
12330 427871 430482 403852 383089 385587 399233 421381 412263 411392 398265 353348 294319 240576
12318 240576 204095 148860 120594 110508 87180 108912 182987 231914 248349 278254 306360
12307 306360 333343 328094 311179 299025 286060 300711 299234 261195 258631 280803 290710 279564
12295 279564 225341 192694 205617 196903 180455 203118 200595 226723 234055 200086 196276 179977
12283 179977 189610 222199 228953 193145 152443 175196 199164 209790 222699 217505 213422 188694
12271 188694 204758 242214 263915 280642 279411 258123 226089 222536 236166 248522 231039 237128
12259 237128 254559 206180 139208 83306 70888 91867 67636 38310 56044 88265 74960
12248 74960 68352 104694 157481 172578 157650 150916 136343 139689 147185 158042 189359 239507
12236 239507 232435 197607 171546 193319 223679 234426 251391 260446 266745 265034 234068 237421
12224 237421 234734 210986 192723 193311 167294 130492 139018 154214 169498 153479 139978 116582
12212 116582 115311 82090 67137 79038 112399 116080 99406 87999 101078 98561 111956 109874
12200 109874 102483 100932 87927 94059 115076 107627 90864 79735 120906 129719 133125 113913 119151
12187 119151 126492 123871 111646 106167 120965 85201 57313 28629 22858 45260 47151 81609
12175 81609 107102 110129 123062 126420 146765 142929 155603 174339 193634 168170 142012 138234
12163 138234 134299 123531 141337 164878 154504 162968 185917 214583 219898 210720 219882 247753
12151 247753 240330 240732 247500 248294 259436 244730 247993 251195 260876 230505 187673 134700 110335
12138 110335 79448 33254 -25368 -53563 -51595 -61774 -50070 -55218 -35817 -21176 13796 7030
12126 7030 -12339 -18782 -30131 -8836 26797 46828 50527 57535 43439 37095 36439 29557 30276 13071
12112 13071 20959 33301 46586 44856 37610 27529 23501 32896 12895 3797 19429 59905 76019
12099 76019 55102 52200 38897 25127 35946 58609 79852 71434 61113 31455 19210 17618
12087 17618 25411 -14696 -47055 -63022 -62452 -48680 -37243 -36995 439 40412 66303 72213 54276
12074 54276 62612 74223 65545 57748 57797 51015 33532 -18052 -23890 -23264 7984 23600 34166 48259
12060 48259 35482 14674 14498 1756 10026 4612 -3814 21263 38476 32155 6641 -12674 8114
12047 8114 1201 -15391 -25979 14138 20249 41440 49529 22256 2729 8334 12253 16450 2554
12034 2554 -463 4534 5668 12386 31704 13030 -6448 36832 51285 47928 56660 61759 92972
12021 92972 82635 65992 58493 87744 85890 45979 61976 105412 126256 102048 115881 159271
12009 159271 206030 227193 260925 276402 286632 319401 360089 420554 528080 694962 882273
11998 882273 1099454 1345437 1596526 1878176 2048524 2159001 2224465 2182059 2016209 1787768
11988 1787768 1474647 1170731 930289 728475 555393 427417 356635 290525 203543 134974
11978 134974 81831 4971 -38367 -39582 -61159 -82866 -32774 25961 35544 10127 3409 9065
11966 9065 15867 18646 17593 42758 41081 47158 25296 -9456 -11330 4239 17445 39450 54827
11953 54827 28182 -17240 -13256 -24794 -30636 -36005 -41309 -48773 -44923 -26952 -16257 -13596 -24922
11940 -24922 -19382 3222 2009 8901 12898 -236 6884 9786 -16312 8424 18945 -5059 16211
11927 16211 16071 2505 -18318 -23357 -16312 -16323 -10680 -6861 1803 -11499 -27825 -30380 -15057 3847
11913 3847 41005 62713 43339 17695 -2422 8239 10651 -12317 -20587 -6711 -720 18355
11901 18355 16284 2178 1619 -11805 -1151 -14914 5106 1796 -23796 -17487 9786 30785 17327
11888 17327 2517 -7042 6513 23003 26589 37645 24914 23587 -8829 -21767 -27182 -31816 -10712
11875 -10712 -5026 -15911 -27892 -22545 -7424 7952 -14862 -29082 -40309 -27420 -22886 -12311
11863 -12311 -17598 -41462 -36734 -19228 -27518 -33792 -35318 12169 15513 3391 -8728 9125 -755
11850 -755 -16065 -24182 981 27898 14025 23053 52594 47977 14467 -16843 -14127 -6105 943
11837 943 7734 15519 27867 36780 18928 8102 23168 21987 18859 32424 17489 2879 36910
11824 36910 38828 22451 31086 43945 20550 12799 13034 11199 -9979 -28358 -17401 -8090 4280
11811 4280 -487 -2067 11441 3069 25542 14022 -10618 -39978 -31663 -20607 -39207 -34580 2406
11798 2406 34151 34686 39352 26711 -9329 -35395 -19733 16021 618 -12890 -11530 -17280 -5712
11785 -5712 -28815 -25388 -18469 -20578 1580 22773 32762 41619 36207 39579 11059 11399 -5295 -3194
11771 -3194 7727 32042 51024 40118 34354 23237 27433 38672 16205 1870 17757 8742
11759 8742 12319 -6 -18612 -24558 820 13854 8649 -2138 801 13821 -698 -7785 11772
11746 11772 11034 23182 29083 23004 -391 4601 -9412 33327 70752 61277 32272 12952 -6026
11733 -6026 -5778 10647 9829 -13976 -32021 -12799 -13283 -7553 2549 -15880 -32505 -57673 -25015
11720 -25015 -28996 -27003 -17319 -1093 -3237 -5974 4233 16883 5382 -29932 -28247 2615 25268
11707 25268 51774 75802 64185 22434 8447 13234 26754 3241 -29136 -38599 -50090 -26759
11695 -26759 -10713 -23771 -29784 -11907 -14852 -40123 -26905 -17731 -26688 -16128 -10281 -6294 -538
11682 -538 15540 -2235 -15213 978 -20813 -10719 26807 9003 -7634 7676 24562 7901
11670 7901 1103 -7537 -6436 -4547 -14139 -21178 -25848 -17926 -9038 9031 10902 1862 -14553 -7249
11656 -7249 15898 45198 51555 65486 73665 48314 -150 -16003 -13811 -30812 -37646 -13946 -4971
11643 -4971 -38757 -24939 -38575 -53347 -50233 -30810 -17795 -4824 -3025 16431 31344 28987
11631 28987 14992 -1497 -27501 -44100 -40810 -35190 -19875 -23158 -29593 21297 37357 47211 56283
11618 56283 68482 72594 91561 85421 100434 133719 124841 145478 161076 160735 193931 224779 260736
11605 260736 244176 168548 136380 107156 74338 15017 22577 38645 25790 -5936 26999 37401
11593 37401 26719 8404 24519 24601 38285 30952 37390 18075 41338 33890 8470 16659 15001
11580 15001 8715 40755 14300 -6181 7907 14608 -10228 238 7723 -4842 -7701 -969 -1037
11567 -1037 26063 48770 44448 43544 13734 -9235 -4734 5160 32688 36541 20873 3571 -12008
11554 -12008 -27515 -31316 -40466 -14412 25945 26632 -15757 -28260 -36816 -22685 11991 1019 2957
11541 2957 7463 -11141 -24259 -23310 -39659 -32725 -15700 -24584 -28753 -28912 -27696 9951 24449 334
11527 334 -23249 -12128 -4561 -38733 -42876 -25662 14227 36900 54141 59601 33815 9658 8518
11514 8518 12914 -15145 -4610 -6343 893 -20779 -11384 24163 29046 38150 22318 20196 45787
11501 45787 17743 111 17248 11715 17632 17968 -449 8614 42829 62954 50824 57662 49052
11488 49052 10087 -20143 -35911 -10880 -14066 -34736 -32441 -14500 -3351 -4574 -6836 22767
11476 22767 36751 54685 25763 -12696 23096 15692 414 16994 43587 50058 50548 40629 48041
11463 48041 105900 143234 161057 169224 174539 176477 171632 135130 122789 75437 41443 13712
11451 13712 -5251 10499 45073 52266 52074 30500 12349 23296 -3973 -41001 -30663 -35397
11439 -35397 -64544 -35979 7936 58368 67874 30184 16328 20181 16463 -20930 -61289 -61602 -35117
11426 -35117 -37420 -49400 -40895 -8850 9312 16046 15280 -9180 -13148 -3145 -17429 -4325 12009
11413 12009 6277 35740 35838 5571 4436 -3029 8809 25935 21017 29459 33008 15670 -5974
11400 -5974 -9471 -30770 -34936 -30259 1929 49764 57385 57362 42005 54148 20892 -14712 21969
11387 21969 52896 17964 -21885 -38054 -14746 -147 33184 26492 7478 8396 13283 -20621
11375 -20621 -13296 -13462 -29539 -15944 25932 60178 26577 34957 17287 22087 32910 33812 14672
11362 14672 30588 30177 67957 67583 60064 58260 51679 45408 17706 -20266 -33712 -22431 -42943
11349 -42943 -44388 -17794 14474 4486 -11055 1574 32684 37300 37517 1343 -14494 5893 18088
11336 18088 23500 3706 -12165 -9108 -15317 -21336 -25190 -3984 -8279 2779 5896 15791 3008
11323 3008 -1025 33421 52315 31086 44779 56436 53293 29390 114 -7397 -7170 -9749 -1471
11310 -1471 9411 -878 -11598 -792 -7527 -5855 19885 16560 23833 25509 4453 -16973 10132
11297 10132 22534 -7390 -11134 -14087 -19832 -9153 9849 22282 40788 28190 -6620 -28424
11285 -28424 -32865 -54852 -73469 -53789 -62837 -48730 -20535 -2847 5279 19835 2655 -5647
11273 -5647 -4103 -6755 -5627 -11031 -30980 -7862 36923 2122 -12053 -16590 -10859 -15314 -14011
11260 -14011 -20929 -51849 -45180 -43709 -44955 -26859 -33774 -34057 -21482 -10270 3741 52394 32889
11247 32889 7789 28738 20765 5909 -15187 -22034 -11888 16648 36394 30805 30561 45240 42762
11234 42762 78309 121925 139487 122670 104617 85606 64491 53393 51110 20240 17211 51565
11222 51565 48151 26151 2906 11190 15663 16613 -18630 -38183 -8035 22847 45901 57000 78579
11209 78579 53778 24866 25180 -6307 -5131 1463 16840 11676 1899 -4879 1055 -8680 -6303 -341
11195 -341 -1593 25162 24074 -18097 -55663 -70818 -59735 -55191 -36849 -21082 -25066 -23561 -20668
11182 -20668 -2711 17671 -836 -36382 -36081 -28476 -27236 5436 5663 17455 17600 17772 18642 12033
11168 12033 12679 6234 -12242 -22056 -8955 -18953 -8812 5606 2777 21657 48991 49875 13633
11155 13633 -8420 -19033 -10061 -17534 -15542 -23112 -8457 7504 1064 11611 -10895 -6446 19393
11142 19393 -10198 -29851 3796 40244 6453 -28027 -23370 -30080 -36983 -27413 -15769 -28538
11130 -28538 -2412 17931 30 -17769 -6509 8599 7006 20959 35995 19568 -8573 -22569
11118 -22569 -20883 -12587 727 -10574 -26634 -68647 -67276 -40938 -42 13901 30507 -590
11106 -590 -23706 -24299 -10109 -11948 -22506 12477 19731 2518 -841 17097 1163 -8157 2219
11093 2219 25486 16768 6026 14542 15737 45691 48643 55661 34027 11595 -19322 -24627 -2478
11080 -2478 16001 21891 22789 -6878 -39893 -51014 -21777 8424 8108 -4255 -21637 24556 81763
11067 81763 80516 85186 56231 51561 48134 42615 20444 2671 14822 22819 5910 -6482 -18858
11054 -18858 -37456 -32223 -13292 -25123 -4567 5698 15284 8178 -7856 -4954 21514 11010
11042 11010 34981 29244 35573 24762 14429 22901 25490 5865 -7386 -28381 -40780 -33966 -18707
11029 -18707 14948 20466 32194 39322 10318 -5370 -12325 -6085 -5580 -460 22593 5817 -16239
11016 -16239 -21883 -28449 -33961 -29969 -16553 -24354 -15097 11058 15341 36769 43815 31925 27755
11003 27755 24789 10692 -1198 6460 -15146 -34425 -40840 -29598 -3610 20777 46399 40272
10991 40272 35147 19437 11401 12034 24677 -3858 -11984 -21230 -12722 9930 43015 34740 37825
10978 37825 38821 54332 50259 55788 86652 63258 38849 1830 -19895 -30530 -1772 11343
10966 11343 9109 40923 39816 1544 -19592 -1866 -4256 -7630 19 1879 7540 21735 37027
10953 37027 47365 43114 36369 19064 10519 26165 33664 15389 -3945 14170 16448 6748 8826
10940 8826 5282 -9755 21093 53651 68600 48725 25478 32139 14032 -11059 -13399 -8486 7483
10927 7483 2841 -15819 25864 18418 11269 23147 38488 46630 40470 18056 -13961 -18712 -33009
10914 -33009 -29829 -32017 -26283 -18313 11758 17540 29487 48285 53302 47985 38315 48060 63621
10901 63621 52792 35773 1950 -25873 -14495 -662 17475 24049 31607 28382 22316 -26309
10889 -26309 -53543 -74281 -87282 -45274 -31544 -17178 10135 21513 -9510 -1697 -8513 -16301
10877 -16301 -13699 -24256 -53212 -46938 -11000 -1573 3150 -25981 -22536 -15791 -16765 -34860 -35501 -30241
10863 -30241 -18653 3407 -12338 -34281 -34237 -50906 -33907 -28846 -18586 -16744 -4936 -4474 -5924
10850 -5924 5747 23024 20273 7005 -1735 27021 23705 30841 54553 92685 129776 164941 197879
10837 197879 222453 179445 116540 61832 25105 29271 29055 37886 50327 28432 5433 -8907
10825 -8907 -8554 16086 22543 19225 28751 19385 28084 36625 19723 2970 10720 2923 -17888 -52544
10811 -52544 -60892 -63169 -21341 14535 26540 -4246 -29098 -24269 -19194 -7048 16637 9956 -26472
10798 -26472 -44114 -69665 -56930 -11169 20509 4357 4896 16429 12001 -9444 -40208 -36134
10786 -36134 10763 23679 18973 -26563 -29793 -3542 3880 6018 16225 28597 10110 -5941
10774 -5941 -15038 -22249 -22944 -3617 -23038 -43380 -38019 -57369 -82898 -107514 -105812 -75002 -63403
10761 -63403 -44831 -8755 21093 28507 -7621 6151 13942 18319 -5676 -50986 -56472 -45945
10749 -45945 -52488 -59016 -38873 -26488 -17741 -17658 -5474 -1835 -33285 -45593 -28134 -3361 6842
10736 6842 2192 16605 29545 12721 -18464 -22152 -9545 20549 43402 58267 47195 -2295
10724 -2295 -34400 -45797 -52587 -23057 -432 35427 9789 12896 46473 36000 36653 40239 -387
10711 -387 -32314 -24773 13910 58364 49048 20814 -14915 -45281 -69631 -33290 -4226 15712
10699 15712 17403 963 -19 14539 35922 29385 33803 36082 8233 -22414 -31227 -7921 14336
10686 14336 19157 19494 35252 38149 46165 50993 47224 11162 7134 6138 17427 15313 -660 -6762
10672 -6762 4411 14460 -16574 -5518 11169 30761 27639 32557 38523 6398 17612 27452 28698
10659 28698 30406 21528 33758 41204 44014 16030 13040 6208 16490 32571 42736 22507 31704
10646 31704 29408 -3849 16919 8609 -6215 -2788 3397 1606 38252 10724 13942 931 -8695
10633 -8695 -8579 8700 17995 12668 6532 1129 13041 37042 57917 32091 -4777 -7375 -3214
10620 -3214 -1706 665 -3624 3031 -1558 -13575 -20356 -13767 11209 30421 22436 21727 -6643 -36729
10606 -36729 -4354 -15394 -33238 -2255 24656 27367 2709 -5150 -5570 -25187 -6535 19298
10594 19298 6620 -780 10355 28600 14342 15138 51667 48837 30037 10559 21619 36329
10582 36329 38369 45963 62363 31301 9242 -7681 33264 46958 18456 -1473 11824 31406
10570 31406 36217 22619 903 5843 5111 13014 9716 -7370 -14985 -5021 -19453 -14193 -20338 -25066
10556 -25066 -23792 -40310 -39598 -24058 -4417 14132 33660 2064 4284 -3946 12884 26069 26548
10543 26548 11649 17285 7596 2686 7560 -11049 -5225 -15371 984 20746 5751 -4464 28622
10530 28622 26864 24137 42771 54637 66519 45656 37085 18273 -9029 -11975 -718 31708
10518 31708 35298 25977 31193 41415 62214 60945 50201 35609 29133 -5150 -11803 -14771 -3683
10505 -3683 24802 32093 36492 21661 6034 -12723 -12010 -350 -17404 -30620 -42141 -1068 2648
10492 2648 -14611 8249 22288 15774 4427 -2117 4987 1670 19018 16768 -11823 -23633 -23657
10479 -23657 -34709 350 19938 34957 71925 76882 76716 50642 43720 56906 41917 47495 31180
10466 31180 6226 -5182 13544 17171 5678 20548 42280 49506 42422 43060 47675 44028 24066
10453 24066 2018 -8483 -13847 -3876 13857 -8893 -17574 4845 27390 18256 29526 13931
10441 13931 -3023 7384 24781 28409 -2554 2328 27967 41172 64927 63231 36718 26771
10429 26771 5492 23826 9392 2249 14892 11446 36910 39911 40221 30439 32716 45508 56508
10416 56508 63390 82658 79560 55080 57445 49217 16268 -15264 -8350 13450 14942 25781 39827
10403 39827 41750 39577 31197 54671 58588 55014 59829 44671 20580 -6366 -15193 -21535 6038
10390 6038 20373 17730 21307 8701 27485 38619 40319 52750 30645 15933 16235 27672 23912
10377 23912 21829 16036 15556 828 -21487 -44672 -27028 -17844 -23809 -18723 -14532 -9556 -20366
10364 -20366 -14953 -6917 -13994 -15409 -4147 11101 792 3914 16826 2663 9915 19918 15212
10351 15212 55062 75818 108148 101091 100070 69751 81811 104077 141246 163350 208416 286758
10339 286758 365160 419804 487405 525857 549750 574029 532729 500149 471658 433317 353234
10328 353234 286293 243875 210977 161687 98440 63718 29701 32407 43263 10159 22297 55082
10316 55082 38844 26959 23528 38824 12820 24312 64664 38769 10862 -5342 -17976 16929
10304 16929 51216 50475 14662 -3761 8637 5808 24203 58377 96564 76670 25115 5844
10292 5844 5194 36471 41911 31441 20723 29626 765 -25235 2117 14837 20605 26092 28341
10279 28341 37906 55542 53330 57303 54643 58075 50805 -2211 -11091 4523 54949 85573 67831
10266 67831 63250 33238 33282 49775 39772 44004 41507 49370 51418 51859 42715 21133 27822 43617
10252 43617 66531 53697 37335 51639 55731 25503 -14005 -21187 9712 18758 24370 24839 27481
10239 27481 54914 94279 83175 39140 35456 25563 21752 43812 54972 63706 58118 54601 57220
10226 57220 42343 52771 63218 70312 64727 51762 53677 35097 37485 30881 26651 31467 54171
10213 54171 56592 55165 19318 -21716 -22463 -17683 -26144 -16598 -29579 1890 18017 27087 17804
10200 17804 6579 -5559 -8050 -5588 -421 10566 10752 25356 45587 58634 57053 32746 13268
10187 13268 24317 33142 33072 19909 29311 60308 60182 11957 12448 26760 28503 41632 77484 87108
10173 87108 69424 59055 65363 47081 27161 18036 31390 73209 76520 66147 77677 46619
10161 46619 21951 -164 9531 29884 12606 -18295 -23060 8968 -20263 -56530 -36085 -4307
10149 -4307 31967 29626 5143 -8317 -1145 15768 21950 1976 -26660 -32930 -16365 12728 22633
10136 22633 33975 32449 11897 8979 35358 37631 28611 25245 -185 -10672 -6297 -20678 -37965
10123 -37965 -28646 -27937 -33893 -28220 -20547 30232 31848 -8597 -14106 -7314 -13262 12947 30450 8779
10109 8779 12495 27723 24327 36543 35181 -3341 -13575 887 17285 23371 42175 41569 53250
10096 53250 59921 71152 102400 93327 85073 63429 51873 18004 -20116 -35081 10519 11045 2653
10083 2653 24607 28975 57404 71662 42509 24388 22700 12201 283 5531 6225 -7348 -7430
10070 -7430 25565 31531 33689 57039 21734 -15910 -5318 7999 -518 11174 4498 18867 9034
10057 9034 28136 32461 44520 51546 44796 45816 30969 14258 21513 39865 53783 75197 79518
10044 79518 63579 54121 39485 33505 30905 39506 56189 25471 9159 25171 44685 70808
10032 70808 68307 40574 16527 11020 30557 15105 247 32346 41076 14081 38180 45643
10020 45643 38012 17719 1184 18907 13146 -2242 -18480 -12789 -4965 11551 9694 13875 32942
10007 32942 24268 32031 44004 48922 27592 6142 -1958 3513 -14007 -27023 -35269 -17817 18806
9994 18806 48009 43002 60576 60766 71934 87326 86519 64987 25152 18412 32012 14276 2140
9981 2140 -4821 -14582 -14406 6147 5181 14725 7289 499 7080 16970 -13349 -19561 26526 52467
9967 52467 38648 16488 21932 14632 9235 13786 23344 38529 26994 56281 51022 12697 -9397
9954 -9397 -13186 -18716 -16781 1166 15018 25062 7600 15233 25635 15014 14618 24211 9173
9941 9173 19443 31454 32282 32905 33537 35448 47154 69813 78635 63186 49820 27098 24479 19289
9927 19289 -3728 -24795 -8032 30476 54779 21878 24308 30385 22680 32219 37362 19202 10914
9914 10914 18436 46732 53372 50138 45006 26669 28708 19245 11423 10627 28424 16100 17126 49961
9900 49961 45301 38762 75071 89207 90702 82220 82498 73045 62342 67611 94562 80751 82863 71467
9886 71467 55859 24950 33818 37428 49066 32215 -989 15770 15604 10283 9175 29406 85038
9873 85038 85440 55017 37820 45394 63489 54878 79782 111520 105128 78068 65704 81122 65368
9860 65368 91995 90906 49798 27728 34364 47218 76130 75528 41996 39531 36003 37631 60412
9847 60412 69478 89386 92718 72018 62450 70964 81547 58593 1395 5880 6212 9899 31988
9834 31988 40454 39229 48087 63055 58224 27300 -8825 -8877 5740 4872 20509 55767 83326 97760
9820 97760 89328 53766 56568 45219 42701 61136 86494 85729 82633 73066 59759 34060 45914
9807 45914 32755 30038 57406 54096 61383 84526 83451 64714 54372 20286 3174 27978 49815
9794 49815 40388 44625 57016 67582 63369 56506 17093 25843 45014 34795 42731 40922 24416
9781 24416 36718 46236 60078 46226 22777 43497 41396 82340 96511 80810 110377 139441
9769 139441 135054 96192 63448 53867 75113 62233 44684 53071 54999 80922 109964 98473
9757 98473 77946 101679 75390 59855 69380 83241 67998 69351 63436 60141 40562 7778 450
9744 450 16804 34442 54774 34461 38496 65167 65175 52573 34417 57162 72103 58094 34824
9731 34824 25742 44693 55379 22476 20956 47591 57802 69528 60139 44257 21520 25845 13085
9718 13085 22442 29022 31538 65631 85935 69555 95990 74492 62135 61002 63030 42326 58292
9705 58292 87387 114861 140659 160426 127813 120001 126461 128801 114774 84562 94225 80839 48266
9692 48266 34839 70988 112308 114502 100693 89090 81293 83503 71854 66718 52299 60125 88323
9679 88323 122669 131390 125069 97324 62570 38228 48879 84011 107871 123668 145941 116148
9667 116148 111439 105820 112402 108488 104303 101897 102448 113505 120658 120636 109874 119903 144181 114817
9653 114817 109746 118117 125002 105361 98592 119290 115097 71590 81021 118007 151630 156917 103327
9640 103327 79962 90531 82886 91079 82809 66581 66374 68336 59190 93378 116686 95020 90177
9627 90177 89303 91947 92563 101246 88355 95094 126564 115581 131706 112509 97673 99012 87819
9614 87819 76495 87599 109708 117468 100426 92097 90089 97763 96144 82387 59860 55032 72458
9601 72458 80692 73060 75206 100476 124078 120062 111486 105328 113468 120739 128844 144585 148933 136214
9587 136214 122177 113051 148532 138032 126955 106123 110753 116099 122582 143810 152960 154453 163742
9574 163742 171068 134702 105905 100424 108753 105666 102701 117028 129935 169973 165929 135208 119228
9561 119228 127949 137921 128764 131017 134250 116525 115895 108020 105647 105055 102788 116002 102734 101189
9547 101189 90423 83634 92838 68410 63099 92252 86985 88070 98229 106649 112731 124344 125300
9534 125300 123736 144022 113233 94323 76109 105489 103416 101774 78562 99147 109032 110084 113346
9521 113346 110938 108071 94175 121307 150470 130790 118136 113009 111972 111600 102569 88712 132538
9508 132538 150885 151168 162020 174701 170405 174528 165515 165902 139073 137220 146392 130704 114660
9495 114660 148284 115779 105506 96933 72807 66760 68886 85581 91452 84844 88138 113587 158152
9482 158152 141816 136204 134725 113331 107674 134714 150453 151855 166952 183248 143502 82248
9470 82248 68060 84091 97080 92577 77347 43228 68354 77645 86730 92589 64504 34580 41221
9457 41221 87310 124067 121800 112889 116743 129832 100232 91934 112618 129141 154541 174555 159737
9444 159737 143346 132750 116235 100433 95014 105603 112520 113583 131506 132699 110732 125716
9432 125716 126460 139976 143103 162036 142459 140664 138861 119799 116887 113673 114580 97703 112859
9419 112859 157782 186912 173815 156559 119630 148100 192640 168919 137862 131305 141373 135341
9407 135341 152936 134936 144496 157009 193960 200063 166767 131431 96753 108881 115099 124259
9395 124259 143390 139992 94621 73208 93580 106791 82328 90501 152147 149075 158941 180383
9383 180383 182865 185600 182305 158129 160411 189824 204997 195546 185113 204688 174072 167105 191109
9370 191109 165462 185691 206087 189724 225194 252373 248732 197016 159000 152331 149882 150146 150921
9357 150921 154896 140269 144726 144655 161777 182287 189117 181623 172050 154129 180204 187236 170763
9344 170763 146259 125158 137814 145798 144485 140558 142017 142336 134919 156780 170186 138760 137729
9331 137729 170498 203657 196918 183694 172073 163554 179554 183164 168455 173549 205234 201312 169817
9318 169817 161133 171639 199722 216122 203904 212556 184236 154394 147489 188217 184259 178988 175775
9305 175775 165992 171666 176231 143798 127538 112999 125997 170621 167331 186610 198458 155674
9293 155674 156703 165171 164890 169222 173702 177088 184246 200275 213409 195901 142018 119999 109978
9280 109978 114639 127156 149632 146293 157929 166201 147550 131810 107259 104774 109397 121653 134057
9267 134057 126566 114453 102218 109533 128983 143129 146484 133118 109845 106776 130691 150639
9255 150639 182370 202878 203155 204542 191323 191177 186791 163743 158588 137252 156622 174142 205806
9242 205806 204958 194057 221898 230520 199128 168628 162495 178414 174688 203639 223641 200907 159779
9229 159779 144767 172974 179419 181269 188696 200770 203623 193413 200038 143417 146135 166683 162066
9216 162066 164025 154394 177719 173687 171383 176038 189365 186902 149506 152229 178618 174778 179336
9203 179336 186715 180308 158177 133319 130811 168175 187692 160440 125391 129130 129026 159343 169103
9190 169103 142226 142486 153248 153871 177076 191548 193068 174498 155900 173375 184233 195663 182020
9177 182020 192576 180763 164848 185127 195732 204783 200163 191858 183501 165367 158407 124171 134139
9164 134139 147345 138821 136754 136484 154109 149659 159712 141059 167582 204993 203262 195073 196508
9151 196508 212837 218592 198552 184531 182023 183831 170490 152447 137170 177197 177610 154969 136117
9138 136117 124268 122113 113734 133986 157636 162375 155054 141694 120187 136599 132609 113374 144068
9125 144068 154466 143936 152116 161675 147386 142781 179624 186186 163306 157716 151764 150437 150472 131197
9111 131197 137414 164644 188814 175386 160321 158691 181529 193181 185650 163191 152854 143665
9099 143665 174118 211147 186190 163644 164237 162856 167476 155338 140967 151071 159510 134539 109115
9086 109115 111210 107579 132829 123520 130881 150870 173073 152577 138879 177457 172420 150148 153235
9073 153235 157862 132058 120669 129918 138447 122652 118724 110216 111112 139609 132220 107359 92194
9060 92194 117763 131528 162995 148344 155615 150184 142486 146910 157306 167899 162579 143446 150073
9047 150073 137205 151067 161240 181298 201034 181442 146480 132503 154502 173176 169432 172998
9035 172998 168948 152009 141700 173340 202461 194735 180661 171888 152114 160686 156248 157458 134034
9022 134034 105897 113011 113864 132773 144300 141697 145208 133625 122721 101801 90380 128343 157317
9009 157317 171276 180491 155249 139642 119858 123663 132399 134593 138463 130816 124946 97769 125084
8996 125084 121258 138071 112950 106380 105103 98543 74711 95318 118549 131362 115414 111851 122614
8983 122614 128759 126404 131525 164121 157189 132235 97852 97625 121597 130913 127098 120372 122122 129375
8969 129375 129461 114126 116659 124014 106799 108096 110216 93828 89200 77691 85709 107303 111823 113302
8955 113302 109877 103582 88280 106075 129730 134873 103606 111802 122026 114785 99135 97173 111161
8942 111161 113600 100239 103109 107294 125083 143680 160510 165091 153364 133669 104081 103795 104658
8929 104658 110842 109072 108430 124844 119122 92779 114556 123474 140336 140040 114305 114329 127798 110619
8915 110619 91263 65372 61245 57532 50074 42380 60960 78533 92889 76360 93061 118205
8903 118205 138329 120695 122598 89530 49040 54926 52727 44267 42863 76906 106496 96878 88376
8890 88376 84880 98602 72180 50725 63075 67967 92015 131617 139958 128021 114811 102000
8878 102000 92730 63723 64742 77057 90680 68876 65193 61427 54967 45525 59431 64973 78266
8865 78266 51503 29834 48559 48551 56343 80363 81699 90980 83546 56709 59616 83224 69619 54737
8851 54737 26244 13650 3652 36210 71311 92088 95068 86851 81880 74255 59385 80649 96238
8838 96238 68089 42795 49189 53853 84778 83508 60920 54311 53719 13861 6629 8650 -2226
8825 -2226 7950 48058 74678 94130 93447 78068 74024 85549 75482 95910 77565 68307 80914
8812 80914 115318 101229 89354 86611 54482 31949 52914 75530 81200 75054 68569 84915 89851
8799 89851 62608 34295 19087 52712 35319 15497 45486 46020 22213 26791 31583 40091 43570
8786 43570 47147 49242 43831 58013 63152 58242 34489 26480 40228 68185 115283 100727 84003
8773 84003 56596 59201 100612 100455 93497 97261 84027 54535 50356 71744 93375 92128 64021
8760 64021 49519 58788 84358 115089 101005 106421 106514 88039 76305 67502 61305 63044 57130 67778
8746 67778 58042 42689 34170 21362 19058 33552 49070 52477 59052 61833 20187 727 30883
8733 30883 57825 51276 50890 29595 36303 72513 75414 85690 80939 50345 26576 24420 46491
8720 46491 62957 66121 76412 83041 56382 44721 25685 51993 89585 85209 48755 24716
8708 24716 35599 63669 69000 39830 108 -13880 622 33770 65074 77269 69915 53069
8696 53069 19394 -24830 -26843 12002 65332 90432 84530 85847 90733 98919 71729 63879 66655
8683 66655 74192 64819 62175 58234 22923 15542 16064 26314 53313 83553 82290 67043 66091 60423
8669 60423 34904 38670 52631 47176 57856 88371 94293 53715 46098 45868 55264 78009 67130
8656 67130 31848 -6876 -12434 35105 35824 44040 77080 93218 93314 87322 60670 69465 103351 123798
8642 123798 95555 98159 122312 96988 90884 71441 76517 93556 105423 103801 107696 105464 88428
8629 88428 104283 108556 100668 142552 139599 157818 180059 164490 148415 133776 148623 154059 159132
8616 159132 137689 155203 154126 144156 136166 148618 145848 151014 139777 129932 115628 129524 121780
8603 121780 116196 125953 128929 130648 143679 169324 163542 133988 132886 141725 121921 117582 86246
8590 86246 75102 67426 71630 101672 128263 117624 80853 38555 42106 61460 75279 78652 72643
8577 72643 85388 95061 80265 85636 69621 46801 30299 48688 54319 64418 77500 45273
8565 45273 18226 -7878 16847 31461 38834 24014 49500 62225 70077 62048 45966 88853
8553 88853 91965 61928 40150 55023 48666 70668 55506 -5869 -51505 -31632 -7832 19899
8541 19899 52645 75742 89677 43209 -5105 -2502 1327 -13726 -37641 -54410 -51973 -34558
8529 -34558 -30398 -14818 208 -5823 11165 16849 12941 -8108 13816 24886 20216 25689 21086
8516 21086 26551 18208 14573 28463 34422 30927 25967 39822 25638 24290 15024 28533 33759 48517
8502 48517 38956 22004 14035 11403 18368 13096 28605 24811 39681 48597 46184 18555 16509 13019
8488 13019 1700 1345 35596 59907 45389 31035 19330 15092 -7495 -17773 -11524 9273 28004
8475 28004 47542 38968 29122 43382 47304 85999 83317 51910 47649 37393 -30494 -47284 -27235
8462 -27235 -18904 7557 48750 45544 42202 51825 65690 54028 49696 61705 67747 45853 10238
8449 10238 8777 7996 12133 31393 57272 67792 67144 59428 71717 64563 48408 33262 3850
8436 3850 2776 19887 48137 65654 54132 26651 38810 45604 47357 8024 21482 17880 18976
8423 18976 5522 -5856 -9578 7139 48262 46004 36790 27702 42891 9305 2334 19199 35379
8410 35379 37044 52451 64929 59908 71768 82680 69609 64094 75166 53499 58944 59764 43995
8397 43995 32261 22436 33873 35533 40302 47608 28955 -22254 -53464 -38120 -22593 -16144 -5540
8384 -5540 16980 42816 41661 60696 40209 39212 41938 22475 6592 1100 34302 54611 55636
8371 55636 62571 60113 50026 12884 27826 43559 40350 21105 -1018 -10267 -20081 -8888 -4487
8358 -4487 -6379 -12475 4444 32635 37776 5231 -14705 -12791 -35655 -19940 3764 8488 26560
8345 26560 24844 -2258 -23331 -18322 -16592 -2451 -12596 2040 50634 79513 53573 39027
8333 39027 32267 34531 51190 41446 53128 44738 49315 47976 34994 31179 46589 73169 72319 46396
8319 46396 26506 19265 12988 22954 20079 7641 -7117 944 -5878 5861 24374 10002 -2936
8306 -2936 -2325 16780 16041 28637 25213 40304 14034 20852 38471 56413 46341 7488 19816
8293 19816 47797 47678 29167 4849 5936 30076 43773 18732 12309 -1741 -8400 7141 -7507
8280 -7507 -9297 12318 24417 35082 24643 11864 9630 15154 23834 24525 -1825 -15903 -1231
8267 -1231 -19381 -14786 16588 -11968 -17672 20164 49340 34373 9584 11765 7770 -21297 -18909
8254 -18909 11068 29110 55274 62704 58928 47074 3445 -9000 6038 19140 12398 -438
8242 -438 -16669 -28569 -53758 -43921 -29566 -14935 -1235 -6551 -5472 36464 48496 45747 31613
8229 31613 18425 3120 5766 15874 41235 27412 13723 11934 31978 27996 8332 -13314
8217 -13314 4099 7616 3540 -2242 -14139 -24571 9768 34010 59073 49575 46873 37928 31968
8204 31968 31801 8565 -31585 -45482 -36052 8048 29852 26831 17167 9813 342 -8571 7307
8191 7307 6920 -6037 -29585 -30445 -28732 -35869 -33205 8448 34796 24005 12366 11541 13256 -21503
8177 -21503 10625 40419 52806 51823 33350 23446 33306 43133 35688 5901 -7186 19626 51003
8164 51003 72557 57551 27076 2988 -9446 509 -37947 -38243 -19898 11580 38180 76302
8152 76302 58777 45076 25117 6668 -9492 -11515 27274 51521 20625 2165 3837 -26186
8140 -26186 -13528 1774 -3510 878 5564 21278 17823 -4151 -21762 -5051 11139 33940 20216
8127 20216 16642 26248 51849 77203 98378 86749 110059 116282 105973 114787 116690 91308 83027
8114 83027 77625 72578 78235 57688 50691 39139 39217 37206 36893 27152 38943 28644 -8795 3526
8100 3526 44244 19413 19194 8689 558 -16399 -2891 -20442 -9665 14004 6956 -18010 12473
8087 12473 47197 56462 49603 45640 42347 61101 52755 47434 33311 16811 30197 36927 66744
8074 66744 76060 100259 113138 113833 114695 83278 62296 61546 49176 47300 46745 36562 36790 13722
8060 13722 -7128 2356 -4572 -173 15949 2739 6489 57345 56235 35020 7544 -12407 -8172
8047 -8172 49581 81460 101625 94117 68774 45512 46932 67668 87498 85982 80894 91499 113606
8034 113606 138248 154351 130682 113834 77300 75295 84042 98156 120158 98707 92774 91522
8022 91522 71934 29805 26079 18256 9577 -19473 -17399 18453 13834 1966 12700 27583 16804
8009 16804 30033 79330 111558 116811 99778 142211 167059 175099 192352 205799 192787 164974
7997 164974 141761 94748 71109 90620 94294 72054 73178 93570 69274 58744 88272 114152
7985 114152 87636 68188 67916 65443 29329 30143 32050 1507 -12569 -3635 15413 37217 17816
7972 17816 -16233 -19681 -36717 281 24690 40423 42252 39319 38008 15855 29324 59557 66661
7959 66661 78597 71177 60414 47030 38730 43177 26711 -3670 -7044 -16188 -28344 -39618 -32593
7946 -32593 -41034 -26286 -23279 -13468 -15287 -3657 -16009 -2539 -14293 -14320 1513 -2419 15098
7933 15098 34941 18014 13803 -7857 14702 46352 43950 9595 -9419 -33506 -34226 -24468 -11586
7920 -11586 4181 -841 13917 24048 13183 27087 -4539 -50370 -29814 -16327 -3590 -11863
7908 -11863 -23816 -6787 10735 7761 24962 19212 -11011 -1157 -19750 -46285 -46244 -26499 1103
7895 1103 45998 56786 44080 3700 -3595 19940 17335 31128 21826 8127 1942 2518 2572 -21450
7881 -21450 -14620 13419 8953 3414 39190 57517 59478 24778 29622 18022 -10935 -23071 -25055
7868 -25055 -39034 -38467 -22870 2025 5646 -9308 -12874 1675 317 1042 19403 9115 -21632
7855 -21632 -11811 28549 48570 28812 -5199 -9192 19617 13762 -15683 -44040 -52738 -42231 -28684
7842 -28684 -55793 -56246 -40931 -43311 -19320 3548 -3170 -13011 -4880 -20743 -15067 -27677 -37836
7829 -37836 4137 65231 41356 10057 28053 66898 74964 59212 35289 42822 29164 8413
7817 8413 -7718 -23747 -34727 -14457 -7813 -4785 -38558 -42625 -26249 -37468 -31167 -16304 -11338
7804 -11338 28110 28988 3930 -15962 -16283 -22370 -19785 -13510 -27821 -38464 -21308 -9671 19351
7791 19351 14858 1759 -16301 -940 21641 21860 12719 8313 -520 12832 10316 -8687 -23980
7778 -23980 -35820 -31897 4240 27746 21586 14940 -12615 -17457 -14964 -1971 256 1059 -3832 -25682
7764 -25682 -11649 -20360 -26254 -27137 -6121 54940 53579 24310 9475 24758 35731 12931 9069
7751 9069 6188 9175 -2013 -13073 -16792 -43954 -49813 -50249 -35090 -43202 -32671 -17790 -25793 -16750
7737 -16750 -4353 9345 28162 9104 17030 36969 10785 -10621 -12789 -33010 -27379 -13480
7725 -13480 -5745 -43281 -42116 -33159 -19572 -18030 -28716 -79335 -98588 -73192 -62644 -43184 -37448
7712 -37448 -24753 -4125 -12835 -39797 -57935 -34436 -18067 9068 6955 -4064 -8394 -10775 -3676
7699 -3676 12911 30524 24305 48623 15480 -5099 -17242 -12693 -344 -3821 18904 19148 8798
7686 8798 -27691 -15867 -24269 -30103 -22187 -27650 -25545 -23168 -17078 -35012 -30461 -27038 -26515 -20453
7672 -20453 3639 12954 10711 11429 9125 -7577 -33165 -37338 -39951 -33010 -37555 -35185 -27126 -21389
7658 -21389 -26457 -19523 -22478 -3205 -17608 -14709 13542 9786 -4006 -12538 5648 34399 39193
7645 39193 30532 4893 3453 -22425 -16103 -25006 -16586 -154 1902 -15605 -28449 -25440 -34224
7632 -34224 -35373 -19763 420 -965 -1170 823 -1963 -23261 -28464 -29174 -3261 -10995 -8761 -5026
7618 -5026 -37871 -54656 -35372 -42358 -14599 -20387 -28688 -35540 -24823 -35651 -16921 -12608 -17121
7605 -17121 -4831 -43434 -42907 -48224 -57387 -31671 -4752 7519 8091 18727 23642 14142 -4885
7592 -4885 -34731 -36495 -17889 -1730 1418 -7319 -30592 -34052 -25866 -35071 -18999 -56149 -44838
7579 -44838 -34619 -48394 -62158 -43788 -47815 -58696 -64170 -58893 -32246 2854 23514 25038 7074
7566 7074 8213 5803 20077 5034 -10860 -34242 -30405 -39194 -56660 -73610 -58989 -64494 -39716
7553 -39716 -34346 -15460 -3677 -25493 -42041 -21936 16415 1613 -51118 -41804 -12177 -33371
7541 -33371 -34696 13526 7824 -2205 -25543 -41805 -31554 -11616 -20226 -24326 2901 1814 -20330
7528 -20330 4216 7564 -10847 -22123 8429 -554 19258 49526 41036 37603 57419 49386 23457
7515 23457 -4127 4628 -915 10378 13640 49169 44275 54282 71406 56100 35425 33959 -433
7502 -433 -40671 -41145 -27014 -9798 -14793 16432 -3651 -14759 -11117 6052 5897 745 -18113 -6277
7488 -6277 4083 -28145 -29992 -23336 -29746 -22989 -24974 -28118 -17661 -12596 -18922 -7632 -3123 -16902
7474 -16902 -13814 -21086 -35046 -36370 -36119 -28493 -25119 -38187 -31691 -29175 -20629 -17853 -20979 -10466
7460 -10466 13048 11580 7179 8608 -22772 -19371 -13445 -31314 -37936 -40074 -11153 3969 -3383
7447 -3383 -15045 -30724 -32298 -9632 -6337 -5831 7915 39944 11050 -5900 -5405 15940 34517
7434 34517 44975 35184 -351 -20316 -5793 -3176 -31523 -59785 -48469 -33658 -25163 -26935 -16728
7421 -16728 -24719 -25097 -15304 2581 35374 52145 9503 -4247 -320 5202 -15011 -22508 -2156
7408 -2156 5191 -3612 -11452 4439 -2567 -7771 -17514 -36419 -18360 -4934 2504 -11780 -11213 -23813
7394 -23813 -32553 17072 29563 -1773 -19028 -10632 296 -4174 -31545 -39337 -25372 -22776 -18425
7381 -18425 -12252 -26271 -43730 -54152 -7777 11100 -10488 -17372 -17127 -20252 -34921 -15185 -22070
7368 -22070 -33185 -26725 -46949 -65913 -69217 -68473 -41236 -47748 -33215 -18453 16517 23214 2597
7355 2597 137 -1454 11757 1153 4093 1541 8270 -8705 -13774 -7817 -8957 11532 5664 -13773
7341 -13773 965 29246 27799 9856 3423 -26704 -19669 -17609 -26764 -29867 -20839 -34286 -48377
7328 -48377 -46727 7300 42653 31786 4543 -5054 10661 1616 -11781 -10818 15983 -14028 -24476
7315 -24476 6711 -13837 -53473 -14187 9123 9735 7289 -11644 -14830 -19307 21904 30300 15749
7302 15749 25255 29719 18167 -13483 -52256 -12834 32639 10962 19343 21320 47166 66922 70223
7289 70223 63201 45251 38934 16944 -21318 -29255 -23124 -15659 -34375 -33872 -4736 41695 65964
7276 65964 47850 31642 4932 -31619 -39408 -40947 -31092 -20124 -2849 -140 8550 7352 -9650
7263 -9650 -18428 -29820 -33351 -54626 -66794 -46742 -60302 -43634 -34935 -56607 -34830 -44526 -33165
7250 -33165 -14810 9938 -429 -25511 -19107 -20060 -35190 -42089 -33526 -28674 -4042 -28099 -62149
7237 -62149 -40876 -26269 -32407 -28792 -33398 -35650 -31693 -7781 -1668 8066 -233 -6868 -6228 5606
7223 5606 7694 -10674 -6673 -13749 5651 -137 -8642 -10123 -155 -45164 -46332 -759 22699 20200
7209 20200 5955 22192 20600 18029 6590 934 1733 23841 42468 39563 14761 14791 -18466 -40060
7195 -40060 -25072 22018 20472 -24796 -28542 -3866 -9452 -24440 -14798 -24706 -21475 938 -11411
7182 -11411 -13254 -16699 -9904 671 3246 -6930 -51120 -60009 -65472 -70970 -50702 -44311 -50558 -29465
7168 -29465 2436 -16694 -35318 -20378 -8571 8063 17418 17024 -9798 -18622 -29236 -30082 -46894
7155 -46894 -50108 -23589 19505 22851 -11896 -24306 -26519 -34908 -14381 -23292 -6153 26648 17764
7142 17764 -385 -23031 -28463 -5343 -2336 18916 -13080 -11492 -25073 -17931 -8685 -21262 -48667
7129 -48667 -39430 -31168 -17085 -2309 -42651 -76169 -57118 -34008 -19259 -18467 -6697 8477 18154
7116 18154 28445 -2474 -40943 -63974 -76751 -33879 -15129 -18472 -1169 6277 12361 -16860
7104 -16860 -35029 -42171 -19901 -25639 -50894 -50978 -36545 -5127 14824 9017 25041 37979 51612
7091 51612 37119 35161 20539 6458 3617 -11644 -33500 -24661 4363 15965 34540 22754
7079 22754 2998 -6564 -10506 -33537 -50894 -32293 -33150 -20915 -45327 -42509 -20682 -23332 -18608
7066 -18608 -21840 -40668 -50867 -25298 -11810 -22725 -18367 -16683 -17685 -33330 -24013 10532 -10728
7053 -10728 -40544 -38954 -25336 -8407 -12991 -34139 -41857 -14256 -2419 -6304 -36773 -17693 20219
7040 20219 22125 12236 -1504 -3443 -3716 -38533 -28966 2706 -5930 -13107 -44588 -35530 -21417 -14588
7026 -14588 -13329 -9961 -1569 -8358 -12445 -19288 -39271 -39762 -23056 -11690 -19135 -13282 -9368 -4620
7012 -4620 9059 26217 10703 10817 2177 11707 5498 2626 36014 31175 1449 6245 -2999 -15795
6998 -15795 -7869 6220 -4259 15964 32609 6389 -21959 -24370 7477 60482 35811 11622
6986 11622 -8029 -27320 -39179 -18606 -19307 12431 15583 -1483 -16285 -2268 -6388 -20914 -15413
6973 -15413 429 -416 -21442 -11271 12930 -10831 -18010 -18486 -3090 -7131 -25532 -18886 -15497
6960 -15497 -19142 -18551 -30122 -28443 -14969 -13827 -28523 -464 -9229 -5406 -753 -56344 -68381
6947 -68381 -38810 -3303 17547 -34028 -44493 -30627 -32884 -51319 -50280 -47199 -84997 -55114
6935 -55114 -45894 2280 11060 -9926 -19722 -2623 8038 -12253 -14124 -8606 -16973 -27179 -34966
6922 -34966 -14454 -4684 8761 13314 15267 -9096 -14058 15730 18010 -1564 -2333 -790 15713
6909 15713 21500 27032 41489 24501 -12178 -26911 -17167 -4880 -13397 -13590 7707 14742 32238
6896 32238 30956 11844 -883 -39908 -47363 -31266 -29322 -25611 -17428 -33545 -4967 6397 -10405
6883 -10405 -5696 -13471 -12888 -7843 3004 21464 20049 -2172 -25994 -38200 -64593 -62341 -47843
6870 -47843 -36648 -40633 -36668 -20777 -30517 -61103 -40006 -19102 -50613 -46432 -43713 -32910 -40536
6857 -40536 -40378 -27372 -19434 936 -21127 -36933 -28269 -21050 -6434 -14300 -3330 -9321 8751
6844 8751 1906 14928 7591 2165 20930 51026 48399 13730 -14456 -7945 26888 19606 19466 34320
6830 34320 -1207 -40604 -40209 -25998 -47561 -50777 -30611 -22401 -3834 -17233 -18785 1694 8788
6817 8788 -9478 3240 -8491 -12561 -18774 6330 -1932 -13150 -11694 -19975 -30799 -11713 -6415
6804 -6415 7606 19609 16428 12403 6258 12290 32146 -15224 -27558 -5125 5563 16102 8113
6791 8113 20157 -4376 -5894 2303 8115 9797 35080 6148 -27328 -22840 -12571 -32551 -20266
6778 -20266 -30925 -39538 -25251 -4112 14614 23334 11172 -4898 -8567 -5733 1984 -37764 -66194
6765 -66194 -73708 -68657 -39570 -2630 17870 13600 -17846 -12849 19378 23776 -816 -21208 -30928
6752 -30928 -41518 -35270 -36325 -68614 -59112 -15050 9136 16795 8138 -2286 -20087 -35640 -34195
6739 -34195 6813 16506 14274 17995 -21817 -31305 822 18195 60325 34669 26037 17355 13801
6726 13801 30147 29183 68190 99267 119685 113577 96713 44244 1181 -1049 20610 37495 34015
6713 34015 18269 -17406 -23138 -33040 -37221 -14616 -19239 -20699 -29320 -24025 2841 9275 -16769
6700 -16769 -18326 306 -1281 -16425 -43948 -50192 -33513 -27674 -5677 -6949 -20097 -20760 -7461
6687 -7461 -3942 -17254 -8961 -12209 -4839 21696 14750 16924 44073 56504 25646 19963 31790
6674 31790 28481 42614 47622 43462 36479 19374 3531 -45151 -50275 -71058 -68194 -41190 -28248
6661 -28248 5391 8422 -2025 7986 27629 29211 -1416 -44729 -71747 -53045 -50841 -36502
6649 -36502 -21450 -13402 -27584 -30152 -3316 -1060 18139 20214 -22886 -39402 -18402 2756 9795
6636 9795 -1800 -11533 -6032 -16599 -19688 21127 60126 41357 -3024 -24405 -21972 -19750 -4658
6623 -4658 -46738 -62274 -68711 -75902 -79126 -83966 -76359 -80693 -84993 -68898 -67242 -84780 -85996 -68197
6609 -68197 -73000 -61148 -33164 -38325 -39794 -26487 -7538 1500 6471 12543 -13891 -26642 8040
6596 8040 12878 -4695 -7308 -13529 -41331 -42269 -37014 -205 10403 6592 -15128 -1894 -28697
6583 -28697 -21529 -6600 -19670 -11158 -3591 -629 8353 -8975 -8149 2561 9318 3283 46260 43238
6569 43238 38743 23045 -29552 -7639 20993 27871 28438 37408 43405 21076 17710 7006 8492
6556 8492 13409 16348 -9660 -24568 -7146 -15723 -22291 -18047 11258 25752 8275 -5454 -1550
6543 -1550 -26 -1553 -15196 -19951 -40947 -28441 -35631 -13631 3696 18994 -2171 -18488 -4877
6530 -4877 -10583 -6641 -30093 -15523 -9621 -24269 -21384 -10661 -23784 -4657 29038 23880 -2568
6517 -2568 -17015 -28773 -41089 -76537 -70185 -47661 -20602 2948 5502 26289 46628 32210
6505 32210 2781 -11722 -9597 -1130 -12230 -3408 5458 31273 39841 32070 16132 -31028 -56647
6492 -56647 -54911 -56609 -24676 -19404 -21703 -32479 -43026 -50228 -57698 -58685 -44316 2002 14760
6479 14760 3831 -14112 -28568 -22291 -5634 10616 -326 -4484 -8517 -7987 -16605 -7562 4955
6466 4955 19039 29627 30151 38856 23688 9941 16934 30618 -20299 -38539 -9940 11591 27810
6453 27810 23030 14021 32114 18919 -4586 -8944 -45419 -70950 -65026 -43317 -19305 4319 7017
6440 7017 648 -12922 -24765 -18222 -19101 743 13872 18692 8042 19932 9828 -24090 -28771
6427 -28771 -44990 -27109 2730 9625 -13136 -28555 -25526 -9906 16558 27640 30358 -644
6415 -644 -34652 -28723 -37533 -30072 -41931 -29829 -25924 -27956 -2572 -12177 -18660 -15027 7569 4499
6401 4499 11210 432 -33272 -16528 7669 3485 -3674 12057 -14663 -44409 -35688 -39744 -27630
6388 -27630 -10493 22942 47206 33705 37660 40689 43113 10159 -4311 5445 -36326 -54332 -17092
6375 -17092 1050 12920 11823 -30824 -48919 -40100 -54925 -51679 -54535 -59021 -82966 -65605 -23278
6362 -23278 -22920 -41603 -29308 3812 14048 12476 19126 6644 12084 12491 -17116 -45584 -45058 -4770
6348 -4770 -5585 -25434 -48377 -74219 -61575 -44127 -45903 -47424 -43534 -716 -2532 -18408 9261
6335 9261 25980 8640 22961 23934 21332 4569 -17273 3681 17992 28651 15779 18416 16754
6322 16754 -4583 -2483 -7801 -22457 -14261 12364 53219 34640 23458 3927 28046 56527
6310 56527 76913 47225 42034 51160 30752 -2086 5441 7350 -20898 -3825 20483 40036 57492
6297 57492 26048 2046 -4819 -21557 -47924 -43785 -25818 -17995 -25469 -18598 -24459 -26624 -15745
6284 -15745 -2829 2082 -5014 -11744 -25722 -3965 40369 46989 50744 55183 23792 14298 27316
6271 27316 13560 1412 -11473 -10173 -16170 -13041 -30078 -10676 -99 484 -20136 -36781 -74298
6258 -74298 -60968 -49745 -65262 -52579 -20070 -30037 -52077 -66663 -59314 -55993 -59349 -38684 -27841
6245 -27841 -21513 -40051 -24937 -18845 -9970 -11328 3722 4493 -7037 -36450 -45077 -40165 -6507
6232 -6507 -10370 -25394 -31494 -34617 -33573 -27755 -28890 -18628 -44298 -45525 -24982 -2095 22911
6219 22911 6031 -16798 -17461 -43371 -32737 -23722 -26328 -19898 -26771 -14917 -1771 6593 -7587
6206 -7587 -15562 -26438 -30329 -21503 -11665 -29030 -47928 -57660 -32629 -15442 3473 19598 9459
6193 9459 2699 -24721 -26001 -10038 -23638 -28233 -30074 -43782 -61270 -32586 -26636 -28782 -34070
6180 -34070 -17219 -16372 -3167 -15192 -32010 21777 41132 30727 -9966 -29486 -37161 -38882 -34162
6167 -34162 -32242 7758 13468 -5458 -16059 -4491 21552 31865 29892 21341 7620 934 5061
6154 5061 -24030 -48729 -22504 23604 21843 -12700 -7529 -13885 -38525 -63394 -62969 -43252 -56133
6141 -56133 -58896 -44501 -44664 -24462 30034 23793 12683 17143 -36432 -55552 -41322 -1381 26695
6128 26695 17001 13258 30584 34363 40431 2378 -10161 -15891 14280 47805 39884 18837 -5328
6115 -5328 -15141 -18643 -18953 17073 7468 -33808 -27241 889 9089 -9214 -3912 -19607 -47617 -50483
6101 -50483 -41415 -29991 -36828 -49990 -2332 49016 35591 25766 15950 24408 25737 3131 -5060
6088 -5060 -23386 -8370 -5732 -9151 -14882 -35567 -36059 -16927 -15243 -7607 -15813 -25877 -12318 -17973
6074 -17973 -35176 -35159 -18797 -21512 -30415 -27835 -11517 -11077 -3068 -7942 14860 13860 -5936 121
6060 121 -2974 -19106 -43146 -63570 -39361 -15143 -20256 -57852 -64649 -39561 -31768 -26436 -28408
6047 -28408 -21278 -26108 -26907 -8489 -20992 -20958 -4007 12217 2121 7574 25579 9466 -29169
6034 -29169 -31824 -18526 8465 -8613 19679 29335 11942 11227 29622 19505 -1880 -19932 -12740
6021 -12740 -26798 -45185 -47957 -55653 -31962 -20856 -30437 -32951 -47734 -55231 -65769 -63090 -59781
6008 -59781 -50776 -20843 -15647 -33133 -43744 -28929 -16998 -44479 -49566 -39839 -3386 3231 7709
5995 7709 -714 13110 42689 42930 27697 7639 -18482 -27862 -34508 -25577 -19597 -32218 -53573
5982 -53573 -61500 -35045 -41178 -17066 -8337 -28063 -31469 -15151 -21296 -38297 -28484 -2196 2748
5969 2748 -22820 -33926 -37590 -51729 -51772 -12599 -2149 836 2528 -6624 -24612 -19321 -3017 535
5955 535 -4875 7972 25537 29568 4691 -6065 -35838 -19180 -23704 -14109 -16762 -24883 -51857
5942 -51857 -36308 1092 33622 36516 38510 21293 -7752 -9490 -21960 -18644 -28661 -19950 -17104
5929 -17104 -33922 -43709 -48883 -63186 -83247 -56294 -6698 -7036 -27024 -12310 4375 -31281 -46484
5916 -46484 -41208 -16589 -28292 -20613 -33812 -42900 -40492 -33830 -8877 32401 38131 49966 45070
5903 45070 1080 5221 -3651 -5948 -14579 -28460 -31882 -44171 -46413 -17279 3547 -4755 2212
5890 2212 30927 35225 17758 6848 27765 21673 -5797 -22791 -22777 -14043 6512 4624 -8986
5877 -8986 -6331 -25907 -3974 -381 -7499 5047 -27305 -56609 -58636 -14693 -21974 -31462 -11807
5864 -11807 -29545 -39615 -40352 3646 22854 34315 29481 35375 19373 -35681 -11899 -3664 -26320
5851 -26320 -35272 -43864 -25631 -17388 -17394 -28385 -63804 -45280 -23882 11114 -2809 -11023 -34859
5838 -34859 -41847 118 10273 17106 12673 8884 23318 27258 2918 -23977 -20984 -9650 -12410
5825 -12410 -36074 -49945 -37546 -50788 -36384 -16602 -19826 -16154 -949 13628 16549 -19759
5813 -19759 -67161 -76866 -33164 407 -7974 -12805 -5654 -13529 -21899 -19468 -29413 -11609 1991
5800 1991 5532 -2430 8791 1905 -15514 -30319 -17306 6151 -13116 -50146 -31765 -17774 -64698
5787 -64698 -91498 -69612 -49566 -85669 -82947 -53004 -4773 23820 -313 -10483 7802 56889
5775 56889 65851 21609 9797 -2820 -35967 -19329 4828 36196 52907 31034 2446 17901
5763 17901 18808 -7406 -16158 -16791 -9463 20898 16797 -10036 -28791 -40563 -30202 -35315 -37095 -38840
5749 -38840 -32571 -13743 -12182 -225 6997 14446 27900 41634 67598 35260 5948 1221 -8072
5736 -8072 -12941 -12564 -3001 -26615 -47567 -60253 -24274 -30906 -40478 -9597 20640 34949 15316
5723 15316 3116 -18028 205 -4182 -31776 -28417 -9393 -23451 -46257 -22526 6822 38711
5711 38711 47783 39364 35938 -5073 138 20770 42822 29489 11930 9654 -9989 -8728 22041
5698 22041 2351 -24846 -37103 -60015 -59821 -58420 -36838 -27236 -35754 -44497 -45750 -42215 -36787 -40608
5684 -40608 -30315 -21072 -46718 -42193 -13307 -16432 4444 -3270 -1392 14335 18739 11576 -15988
5671 -15988 -31186 -29676 -18422 -20825 -39049 -34727 -15670 -30409 -31209 -43371 -47756 -59433 -53681
5658 -53681 -58759 -41211 -51601 -66113 -53798 -36852 -8610 15463 -1988 9190 32502 49547
5646 49547 25404 6886 9419 -6995 -41112 -41409 -18746 3381 11478 -2846 -25408 -7994 3881
5633 3881 -2435 13175 12519 10478 4701 -8485 -22796 -29956 -21170 -49586 -39935 9306 48938 35727
5619 35727 37054 16836 8511 19969 45760 29929 28464 974 -31849 -33807 -21144 -7150 -13034
5606 -13034 -31731 -37809 -1042 -19468 -43497 -20753 -34038 -35550 -22113 5612 3891 -28154
5594 -28154 -31224 -28956 -45494 -55452 -34818 -19420 -255 -6175 -21203 -17587 11908 29972 684
5581 684 -30450 -22923 2360 4229 -12351 1586 11890 -5148 -4338 -8869 -4467 -9943 -29768 -24925
5567 -24925 -34506 -57192 -49601 -42434 -48930 -36903 -30747 -38173 -41739 -45418 -42370 -43510 -13162 8985
5553 8985 38362 30230 10479 9587 9362 -12263 -22709 -6622 4790 -16391 -13882 -34802 -16520
5540 -16520 8447 28585 12976 -28599 -17198 -6162 6182 -810 34291 40491 -4070 -33782
5528 -33782 -50379 -59913 -61509 -45943 -42182 -42245 -42798 -29428 -26587 -24652 -35213 -23159 -13470 -9643
5514 -9643 -20702 -17842 -12532 -35436 -13363 -708 14757 18091 -1018 -39280 -25880 -11913 -19837
5501 -19837 -8601 -28058 -17087 -12205 4614 -11261 -1383 -22349 -24530 -20600 -44408 -62610 -51987
5488 -51987 -29543 -3553 26907 34814 51247 52676 11765 -9658 9792 19615 43855 52537 -340
5475 -340 -12950 4973 -7232 -6713 -14710 -8961 9491 22237 41436 12785 5226 28608 39325
5462 39325 31729 2603 18296 23048 21515 28217 27526 17658 -15743 -38096 -26718 -6316 12444
5449 12444 29631 55603 44423 26137 30512 21785 16459 28462 36362 42725 35920 61617 31687
5436 31687 9471 18381 -1813 -22311 -8145 -13551 -42818 -48461 -19694 -23959 -5762 -7335 -3968
5423 -3968 -19207 -28662 2216 19212 4950 8552 2028 8698 -161 -11581 -24939 -45294 -51168
5410 -51168 -58541 -74278 -59843 -38550 -46947 -26485 -27628 -10018 13495 13419 -21385 -68337 -73062
5397 -73062 -16009 5856 14474 -15166 -48457 -55996 -43584 -26096 -30711 -43694 -29752 -7711
5385 -7711 641 -1148 20055 37211 40294 11502 -11261 -32618 -12240 15937 22826 26513 35185
5372 35185 40135 24056 -18752 -1619 27432 -7348 -18681 -21751 -32597 -24593 -28700 -50185 -67966
5359 -67966 -59928 -18012 -304 -1647 -26909 -56284 -58710 -37979 2988 3882 -14940 -18857 -26608
5346 -26608 -30559 5440 37860 37702 42554 -6154 -28197 -29600 -26321 -37024 -74195 -65478 -54925
5333 -54925 -44832 -14407 -7426 5275 11326 -883 -33789 -42294 -41797 -19138 -11130 -13169 12880
5320 12880 25312 14268 17256 14872 12132 -2622 -18811 -18434 4379 -14979 -50664 -52300 -18903
5307 -18903 521 7391 4470 -13730 -4943 -7723 -17133 -2136 12796 37218 18169 23638 -328
5294 -328 -4007 21331 -11065 -32655 -36941 -21417 -21830 -61191 -85218 -72147 -70898 -79004 -84062 -57225
5280 -57225 -23363 -13700 6448 18706 18122 14087 -3907 -589 9002 5141 -10199 -3180 -7779 -18602
5266 -18602 -31430 -47193 -41289 -7137 10564 21656 39216 24256 6898 11893 11631 -9776 8787
5253 8787 -4646 -1987 -19239 -17498 -38658 -19417 14689 9239 1661 3662 1351 19272 3544
5240 3544 13564 22042 5247 -6177 -16223 -39373 -42728 -22286 -13642 -28941 -24923 139 4799
5227 4799 -11347 -19939 3249 -860 -31994 -49454 -11342 12240 -680 -32474 -57277 -26932
5215 -26932 -14381 1475 -28602 -62135 -50691 -8116 -13623 -41059 -55856 -71482 -40294 -29542
5203 -29542 -33249 -34233 -30883 -13129 -10961 -33445 -39083 -25030 -16905 -4076 -3195 -3969 -37419 -58103
5189 -58103 -41503 -28688 -17495 12140 39787 32938 10383 5431 7836 -16918 -11087 -3845 25163
5176 25163 42871 32286 -106 -4625 4087 13927 -17651 -22078 -18254 -15706 -34037 -12612 18576
5163 18576 2377 -39048 -43903 -12651 -16248 7054 8142 4525 11792 -10504 -34698 -26530 -10983
5150 -10983 -18803 -34539 -44319 -33678 -28807 -12445 -20214 -20390 11593 18417 31711 18208 21972
5137 21972 23782 -10012 -44261 -28025 1594 8690 -6578 -15667 -22162 -31986 -5747 23088 10194
5124 10194 -23815 -32295 -32532 -32895 -30926 -5765 -6780 1847 17724 38490 13166 16717 47571 50716
5110 50716 40899 28243 11264 -2422 12170 -1755 -6896 -1985 -6321 -1298 15427 27197 32020
5097 32020 9389 -4591 -42697 -49461 -35479 -23810 10939 -6256 -21414 -36740 -25772 -2827
5085 -2827 14201 5727 10105 18615 22428 35615 65321 53899 28729 9601 6 24876 1957
5072 1957 -8546 -15731 -38834 -43596 -53409 -66332 -58666 -48778 -52288 -53142 -48080 -46963 -21872 -7428
5058 -7428 -24711 -12977 5202 8886 -5614 22810 4737 -19378 -17313 -3972 -6073 -31925 -41262
5045 -41262 -17977 30154 47137 40363 30853 6273 28916 14657 -28912 -15024 -4501 7025
5033 7025 -13536 -41883 -51934 -55328 -64476 -45830 -33087 -37008 -24363 7347 53891 84111 50441
5020 50441 -1357 -41192 -74604 -75631 -76756 -58978 -10098 -18103 -14276 -2824 -21267 -25006 -27042
5007 -27042 -50317 -30818 -13744 789 29574 26919 33637 31967 8397 -26382 -33049 -14241 5971
4994 5971 -12086 -45520 -59358 -35975 -16106 -6367 -20953 -12099 5381 7279 8691 -14034 -35600
4981 -35600 -56035 -88997 -99104 -100305 -69772 -32542 -9927 10681 16893 10727 -11588 -43707
4969 -43707 -7954 9790 6676 1482 -3393 -13007 -46881 -79791 -61085 -30136 -54349 -33977 -19257
4956 -19257 -28956 -27013 -2785 7040 21371 7099 -14499 -16214 -19643 -50819 -52825 -31189 -30231
4943 -30231 -32987 -14108 9416 -5384 -10770 -32074 -2878 19199 -4631 -4342 -557 -15297 -33377
4930 -33377 -46382 -39932 -21046 -32523 -51470 -44762 -26108 -36397 -36767 -53847 -68922 -67961 -44336
4917 -44336 -21663 12088 18275 15244 7699 -24624 -16077 6746 13727 11934 5749 18087 40745
4904 40745 61639 58144 58296 41339 28890 20045 1247 17743 30715 7291 11704 26306 25612
4891 25612 -7922 -18248 -11821 -32776 -72671 -73770 -42063 -14567 11222 -19437 -27434 -11288
4879 -11288 -26840 -33042 -9668 4140 1301 -6043 16369 29121 41606 25494 -3945 -18220
4867 -18220 -1379 -14724 -35874 -49955 -42222 -26727 8935 11686 17657 6506 116 -31981 -56673
4854 -56673 -51461 -25118 -1785 23404 7493 10169 22691 26412 42348 52014 38119 17414 3033
4841 3033 14056 16362 44676 22995 27542 47886 36654 26571 29346 37026 15630 -3138 10597
4828 10597 44693 54426 39454 -5343 -4603 23239 12121 -48683 -46391 -54722 -59755 -42844 -38269
4815 -38269 -25504 -6689 9877 -12158 -38571 -37160 -23673 -13339 30121 8601 -17615 -45618
4803 -45618 -59034 -23646 15413 -689 10612 -7383 -16528 -32476 -38113 -53231 -50278 -16684
4791 -16684 -7992 -21746 -40125 -54550 -52800 -53313 -52442 -48356 -40767 -52271 -48932 -53541 -78048 -89150
4777 -89150 -72237 -53209 -29144 -35194 -13333 31029 36717 17077 -28932 -26602 -11741 -33436
4765 -33436 -42403 -21736 -10217 -12636 12619 3011 8015 9839 -22487 -30744 -16551 -17282 4702
4752 4702 27476 21838 5560 22436 33845 14312 -71 -8620 -10950 19704 14849 -6317 9651
4739 9651 -5175 -8073 -11979 -27731 -18864 -24524 -12762 7844 -852 -8026 17771 21535 -5022
4726 -5022 -23110 -23370 -36847 -75676 -82394 -56848 -35279 -50404 -50315 -17217 -9823 -47865 -40436 -6927
4712 -6927 5458 16406 3409 1165 -27510 -50709 -63438 -58581 -68777 -31566 -27798 -47704 -40056
4699 -40056 -29104 -28847 -17677 -1449 14795 26859 -14290 -17441 -5574 12546 12250 17616 41563
4686 41563 30734 32239 27744 10974 12310 28003 10287 12963 6877 10172 -12737 -9147 -17299
4673 -17299 -8275 927 -17940 -16113 -21620 13492 22266 16209 12262 -5356 8666 19594 24882
4660 24882 35815 37323 13357 34925 26219 -23975 -57903 -70253 -59066 -44290 -26572 -10502
4648 -10502 -22185 -14709 -4372 8866 7582 40803 52710 5862 -17416 -25841 -26376 -45907 -64777
4635 -64777 -48587 -30796 -29170 -20207 -580 17506 -765 -736 -22292 -17051 -6647 5808 24270
4622 24270 10223 9301 35800 34326 10228 -3822 2992 -17074 -24544 22532 29908 21219 37186
4609 37186 29764 280 12122 22328 -1639 34 -2098 5747 5358 40231 31689 -1363 -2192 -1113
4595 -1113 -10264 -13950 -20985 4735 49533 22658 -8968 -12047 -28121 -35198 -19786 -8197 -9008
4582 -9008 -7739 923 15411 -1470 -11451 6308 8068 17406 4083 -15613 12354 24767 20104
4569 20104 20572 5038 -46332 -27184 12355 31239 13951 -3710 -156 -9883 -14249 -3226 16962
4556 16962 -2453 -32767 -54740 -37406 -6836 7610 19801 -9651 -32526 -29060 -12203 3136
4544 3136 13113 11024 1961 18928 46584 36031 47952 52457 38308 51165 35644 23434 52694
4531 52694 70238 66348 55895 8484 -8005 3440 27879 31568 40947 30796 6122 13014 15149
4518 15149 -11145 -14292 -19872 -16403 -12662 -13156 11973 55812 25396 53074 23425 7036 12608
4505 12608 -20247 -23894 -33109 -36710 -8904 -2355 -30511 -33168 -13530 -6022 -24422 -35626 -32508
4492 -32508 -3419 18770 27285 11014 3071 13803 -6069 -5280 1104 -4138 14380 34934 47164
4479 47164 45858 31056 11583 6603 -7006 2487 2581 -4104 -19926 -24129 -20768 -43792 -38247 -20567
4465 -20567 -8276 -17350 -14904 -22222 -2420 -2422 12251 42194 52873 23019 9347 2521 1703 13396
4451 13396 -12010 -57335 -82593 -60712 -36292 -23577 -15503 -25442 -23976 -23859 -13915 -16706 -24976
4438 -24976 -13314 -12344 -35003 597 26047 34545 8445 -34527 -54423 -65174 -53721 -33538
4426 -33538 -64992 -62526 -69070 -91059 -69861 -45909 -35831 -66217 -83037 -57098 -56947 -50184 -35060
4413 -35060 -1754 24143 1394 -4254 -32032 -38996 -55445 -44441 -40728 -22371 5348 51 -3508
4400 -3508 11821 -21121 -30995 4300 -16806 -47720 -40945 -34228 -58517 -54143 -45069 -48997 -43062
4387 -43062 -26018 -17546 -34218 -32993 -24388 -33710 -37306 -19322 -5642 17080 48224 17641 -12659
4374 -12659 -9762 -39376 -69663 -70740 -37354 7312 -1877 -18421 -30884 -52701 -16007 -18112 -27118
4361 -27118 -34586 -42073 -59937 -66728 -48978 -43355 -60012 -49987 -38389 -45587 -25653 25515 10080
4348 10080 -32 -27988 -22436 -2371 4925 -11468 7568 426 -18622 -19951 -1165 -6187 -7702
4335 -7702 -13452 -18633 -18714 4439 7283 -15794 -53190 -50274 -28903 6488 14557 26369 14781 -7305
4321 -7305 -3919 21983 -14798 -19534 -18151 -6926 28430 47042 -18409 -28908 -25445 -34812 -32474
4308 -32474 -13525 -22290 -18597 -20199 -19260 -8912 27942 55273 65080 25459 18683 6530 18046
4295 18046 759 -20021 5324 5423 88 13241 38724 43554 20409 5332 5839 4730 11795 -9532
4281 -9532 -30823 -15519 26501 43142 68275 50493 26174 -10028 -16287 -1523 46681 63339
4269 63339 46753 -5727 -30334 -34329 -19668 12912 10432 10609 29833 20618 14653 18945 39068
4256 39068 15585 6425 16036 21668 6459 -414 2528 7711 737 -4839 -8447 12060 -11035 10810
4242 10810 -1169 -8983 -27752 3941 6836 12851 23316 5319 -18615 -13340 18461 -23954 -48345
4229 -48345 -23059 23797 24270 16208 27362 49967 37402 6410 -33286 -38489 -23592 -39563 -46223
4216 -46223 -9112 9463 35662 32967 32598 46897 29161 -28178 -22338 -10345 -35295 -74313 -37564
4203 -37564 22662 60386 65022 39043 30824 27777 20313 12939 15704 21917 27250 22504 4443 28843
4189 28843 39768 21682 19653 22768 26459 3815 -20502 -48085 -20672 -24324 -32261 -34889 -26024
4176 -26024 -1500 8609 -1040 5186 31108 13614 15961 5209 -19128 -33853 -15546 2118
4164 2118 21728 69279 70413 36117 886 -3896 7214 -23400 -58006 -61136 -58225 -53567 -34646
4151 -34646 -29441 -34160 -15286 -9292 -23457 -31453 -9463 -19804 -27093 -18589 533 17209 26089
4138 26089 26085 16624 7385 15555 8552 -6298 6637 22197 27288 13833 -14779 -25509 -12382 8248
4124 8248 -16926 -42376 -54432 -18169 33210 50844 30792 11369 -17910 -6432 15010 12735
4112 12735 -3300 -876 16180 37193 29500 18700 5823 13866 -4548 -1238 12386 -5164 -9783
4099 -9783 -10116 -767 -18146 -28269 -16470 -10840 5535 17130 -7810 -39579 -52338 -38751 -28449
4086 -28449 -28179 -13794 6634 26874 11510 3361 12953 -7827 2430 25862 26145 22969 57475
4073 57475 41916 1288 -2024 22332 33608 22189 12826 2523 14308 -6893 -30286 -44403
4061 -44403 -32087 -15674 -24800 -1852 38948 40913 -3556 -37634 -24374 -7633 -33318 -46394
4049 -46394 -16412 -15582 -23419 -26724 -48669 -54212 -28746 -16848 -3945 -32062 -38811 -41851 -47910
4036 -47910 -51225 -52207 -12561 -16471 -30603 -15500 -11083 -5232 13451 25277 37992 -5834 -27731
4023 -27731 -44310 -26302 15715 14244 18737 13666 -24828 -23209 -26532 -14818 -16224 -9087 29947
4010 29947 48346 27074 29421 48937 43912 20687 7639 -11504 -3004 17646 7071 -2947
3998 -2947 15052 22643 27859 33197 27300 44570 25168 -6225 -1583 24560 33785 22877 9904
3985 9904 12400 -1674 -15265 -26194 -20937 22633 30787 18265 23901 27640 76838 85229 37584
3972 37584 10695 22428 28664 -9245 -21611 -19822 -29525 -49718 -68715 -82539 -104446 -88653
3960 -88653 -47246 -2920 10907 9966 -22624 -34122 -21753 8036 6849 12406 21479 7849 14808
3947 14808 5753 21642 26246 9596 4385 -7083 -13623 -41338 -25246 -13557 -7219 -12789 -43415
3934 -43415 -21937 14788 12751 -17037 -11808 11423 38604 49780 24168 -4672 12404 21865
3922 21865 21470 31841 40114 23559 9324 -2436 -44123 -92859 -95072 -66010 -55109 -58483 -35533
3909 -35533 17549 36063 50500 63381 54374 28372 -8038 -11294 -19487 -20749 -21023 -25698 -22176
3896 -22176 -4660 -5568 2504 -6492 -30332 -47983 -31875 -2168 32020 25135 14277 -5237 3151
3883 3151 3551 1396 777 15081 -19529 -41625 -28825 -14656 29593 67264 57532 39800 6445
3870 6445 -462 -1215 -423 266 5967 6000 -3976 -12181 -17719 -23642 -32921 -17769 -18881 7256 34307
3855 34307 10360 16708 30483 32999 29822 18263 8281 -4181 1731 -86 18207 1581 -464
3842 -464 3700 10130 38878 14184 1819 13470 11742 3606 6127 13718 15687 19099 29363 55436
3828 55436 52116 54943 16515 -8376 27118 45855 36939 19961 -23923 -40445 -51699 -51038 -34653
3815 -34653 -36447 -40282 -41279 -46414 -43764 -60488 -39347 -32242 -20253 -47192 -43227 -2206 7332 11291
3801 11291 27979 -7924 -41862 -14412 -12505 -14809 -25256 -31722 -6880 -16063 -32121 -3942 -1246
3788 -1246 -6436 -14300 -26694 -23540 -5993 -3445 13857 27528 5590 -16535 -14213 -36053 -40259
3775 -40259 -13193 -7296 2967 45116 43251 12373 24342 2910 -20904 -21763 -22662 -48085 -51631
3762 -51631 -47120 -24788 72 -2586 32636 40836 41806 29416 -13332 -23609 15991 16622 -18027
3749 -18027 -11487 11102 21073 -2237 2573 4538 5028 6282 -15492 -25317 -32633 -29090 -49562 -47569
3735 -47569 -45736 -58505 -43132 -12018 -28964 -26199 -32008 -71171 -77413 -85598 -76017 -63084 -28138
3722 -28138 -20145 -25131 -21685 3819 9004 3669 -35190 -43321 -74447 -64810 -31914 -16120 -6885
3709 -6885 -1721 12440 -4297 28139 29972 10753 -14930 -15165 -5632 -16869 -20955 -49974 -54051
3696 -54051 -26742 -3241 -5675 21741 14286 -6006 6388 -21322 -13151 -33501 -43818 -36172 -27058
3683 -27058 -25603 -53681 -71816 -65061 -49824 -17366 77 18569 42575 25505 -3611 2750
3671 2750 26841 11505 7330 -11352 -16439 4735 37437 34164 33856 8383 5158 -5404 -14346
3658 -14346 5676 38935 2467 2305 1022 -5004 -8268 -12576 -22101 5228 23187 17028 -16930
3645 -16930 -28910 -16808 -20731 -18663 -15281 -29162 -39600 -5888 12572 21542 11988 -22117 -43432
3632 -43432 8852 33916 27357 -15969 -25867 -27478 -16787 -17489 8388 30871 24837 -7501 -4302
3619 -4302 -14296 -15430 -34219 -10303 -514 9567 34145 37295 39178 20805 -29471 -49754 -29337
3606 -29337 14074 7418 -16099 19799 52286 19971 -3745 -12129 8682 28790 24001 -4580
3594 -4580 -10781 5589 347 -12715 -23691 -18975 9079 15295 29947 43469 38771 54429 53461
3581 53461 25602 22724 21805 14658 12671 12633 24924 -10571 -27189 -18901 -11362 3649 -4685 -9152
3567 -9152 -20101 -31480 -21648 -20950 -10813 6582 6433 17201 -8250 -31335 -20292 -5638 7254
3554 7254 2865 4014 40710 35419 19546 10515 -20396 -58816 -55254 -25381 -5279 16136 13804
3541 13804 -8165 -5487 -7572 -30362 -50970 -55015 -36198 -37788 -33227 -36113 -27464 -24931 -16992 -9815
3527 -9815 -46212 -56869 -33261 -17022 -12593 -14231 -8669 -4095 19505 62856 44656 -4985 -21811
3514 -21811 -42648 -41347 -23297 10104 16667 10397 -13764 -4558 32575 40648 11236 18684 33797
3501 33797 20547 -6950 -956 13638 20165 49269 48080 25736 -7950 -23979 -45897 -10497
3489 -10497 25745 18344 -3855 -24098 -19186 -37169 -26141 -22176 -21240 -14278 -20026 -36875 -15076
3476 -15076 -14886 -18898 -8542 -5028 -5107 -4054 -16651 -18979 -20207 -18682 -15117 -38917 -38713 -9158 14308
3461 14308 34288 20730 -7394 -449 -3891 -24881 -19713 -2029 26545 42728 54842 41774
3449 41774 15441 -959 -12492 -32386 -65063 -75713 -80745 -73218 -60026 -23114 3531 15699
3437 15699 6895 -1954 28640 46697 42436 7150 6974 -13657 -18943 13773 -7036 -35706 -37916
3424 -37916 -32111 -21805 -10932 13616 32041 36909 -8432 -16615 11297 -3413 -21540 -32938
3412 -32938 -19177 -25313 -7846 -10448 11250 -19854 -27454 -25380 -28711 -46871 -9020 30312 13438
3399 13438 15130 -6663 -27655 -28314 -19168 -26926 -34198 -17032 -883 -5725 7506 14324 11649 8093
3385 8093 16360 13002 25579 25296 10089 6575 14861 18730 23206 41759 56817 53742 1977 -1222
3371 -1222 -7766 -2578 13662 16605 7858 7887 9547 24750 13259 11940 31654 20864 14729 12280
3357 12280 -26728 -12008 20665 26291 26945 18673 -16130 -25002 -13840 9920 11973 11600 30761
3344 30761 2879 -28062 -34910 9806 27250 25154 36418 26469 23351 12451 -4499 17781 19137
3331 19137 -554 -16045 -28542 -16763 -11278 -15708 -16492 -14570 -15359 -36004 -36479 -11270 23178 8554
3317 8554 18782 10344 10722 19193 15667 6973 -2225 -14224 -26835 -20868 -22169 -2801 -6309 1343
3303 1343 -20514 -22952 -4726 10396 -2558 -11230 -8724 14068 23239 21610 -112 -22970 -40596
3290 -40596 -39136 -41011 -33608 -32187 -25593 -17285 16586 7392 11131 34223 24436 15965 18000 -4213
3276 -4213 -6570 8659 22422 14586 7463 2427 -4050 -14332 -10486 -8969 3471 -7811 -10686 8731
3262 8731 36195 40378 16507 3272 -22137 -20261 13033 20226 10948 15831 14505 23783 13754
3249 13754 9593 20874 26222 18075 -2746 -14570 10372 48825 24253 9995 -4517 -6474 -10881
3236 -10881 9791 -516 -4007 -24189 -18097 -15302 3280 33777 40521 26170 20542 -8148 -26331
3223 -26331 -19169 11490 -6221 7379 -7018 -42515 -52455 -29573 -12700 11075 -1067 -8480
3211 -8480 32480 65881 44939 16657 18620 -9070 -25865 -24687 5488 16017 19996 20481 28704
3198 28704 33337 39869 23808 -1914 -11570 -1747 -13073 -37086 -38888 -30163 -16447 46299 54669
3185 54669 36719 22055 -7712 -17082 -7895 23021 43004 36742 6751 -3397 9759 4622 5157
3172 5157 -1197 -9498 18501 34921 55313 46391 26576 8802 12015 7938 -17960 -19941 -25610
3159 -25610 -32912 -10740 11865 -10066 -24600 -15503 30310 27279 22981 32852 -9771 -26600 4314
3146 4314 10264 5147 22349 16153 10766 8494 43360 53656 24616 -6170 -13564 5145 -4276
3133 -4276 10554 -23511 -35290 -15157 -1948 8308 20243 21623 25120 39673 32862 21496 1854
3120 1854 17773 38155 40897 43025 34066 -4249 -32254 -17033 17078 16944 -8004 12181 30916
3107 30916 32612 33522 10397 -6860 -864 19445 10485 -17123 -27746 -17882 7877 40052 30956
3094 30956 27255 9104 9312 22068 5205 6807 -15987 -36790 -5963 18366 21109 12087 21269
3081 21269 29023 32710 -3484 -46418 -45596 -20971 158 15034 19425 22107 -10473 -37657 -48493
3068 -48493 -68222 -85581 -101256 -74954 -73548 -63589 -28367 9084 21366 4441 13696 24566
3056 24566 4536 -22756 -20751 -9299 -27636 -32749 -19588 -15388 -20803 -30979 -32992 -28693 -14319
3043 -14319 -2058 20211 13145 21088 3257 -11069 1957 15313 6504 11197 10633 18486 24068
3030 24068 34994 29748 -4045 -32721 -31714 -29677 -8192 19831 9103 22310 31638 14330 8704
3017 8704 -3679 -23629 16033 51217 33888 47695 61199 32008 14288 -25431 -28907 18580
3005 18580 21366 26240 48459 59082 85181 81408 65371 55467 50807 58315 15986 -13615 7469
2992 7469 11770 -7500 -23743 -36389 -15086 -1267 7198 3718 -3251 -21979 -22634 2199 1678 -4672
2978 -4672 330 -15701 -6325 1465 -2883 2433 9579 -14331 8227 42073 48774 35589 11233
2965 11233 11531 10003 -20840 -9351 -5729 -420 -20686 -15400 12502 27821 19749 1066 -28557
2952 -28557 -65556 -30539 -8305 -8774 -20552 -11690 -6968 21671 20072 2766 -4758 -3558 5361
2939 5361 2699 -26917 -16804 12928 31839 34900 27949 -5169 -6877 -37455 -74886 -63939 -25620
2926 -25620 11709 -11556 5357 22371 13973 9196 29971 25806 12255 25199 21489 34295 19510
2913 19510 10645 26224 50174 48581 33963 7645 -783 17080 29486 28946 39233 35330 24422
2900 24422 28651 18589 16756 -2409 9902 6755 -18135 -30003 -34500 -22694 -4274 23112 17188
2887 17188 7609 -32246 -30392 16773 30363 35300 8090 1717 1779 47224 59019 42436 27984
2874 27984 24905 1586 1600 -5338 -14361 -2674 20021 7307 7424 12177 30991 32316 38970 49407
2860 49407 47940 25133 -6553 -7557 5764 49910 50554 27616 19921 -2687 -20803 2924 25780
2847 25780 10229 -25206 -15173 -12772 20514 24693 -7328 1408 -16740 -18882 4822 1042 21011
2834 21011 10373 -3104 -3129 3980 18666 25515 55918 50095 25585 416 12098 25318 36406
2821 36406 64240 47102 22167 29804 9360 -17543 -19500 1076 -7883 -20821 -1509 5511 11468
2808 11468 37445 28803 19743 10899 -2465 12305 34194 27776 -2650 11466 20124 32712 33158
2795 33158 45467 46606 15769 7823 -1129 25393 48079 31344 22216 970 -19664 -18453 3390
2782 3390 23680 14167 -13309 -30822 -31312 -27448 -20189 -15910 12586 34415 24052 5212 -22355
2769 -22355 -15013 -10145 -28196 -555 29409 28706 14866 7371 15410 30584 44173 28888 17405
2756 17405 24599 46417 56980 29793 18324 -3303 -19885 -28490 4106 13082 -17872 -52543
2744 -52543 -52487 -25231 11699 52104 29256 4940 31649 50063 31556 22960 11356 5991 -6893
2731 -6893 -16107 4886 31740 25396 19256 42396 22717 28395 19456 17181 28107 30221 13322
2718 13322 -11352 13742 22646 7144 -7693 -11589 2575 -116 -13310 -14732 -12963 -7900 26534
2705 26534 33562 -5332 -30426 -19381 -35151 -31577 -26583 18700 41614 33034 33765 17774 21817
2692 21817 12940 25393 16785 12855 4182 6422 -19290 -13225 34861 55756 48361 52703 69741
2679 69741 36218 -665 -4265 -19131 -33386 -26975 -14786 -16416 -5501 25678 47699 -1504
2667 -1504 -28505 -25396 -20287 -1638 8550 27171 48184 60671 1435 -1705 4208 -31985 -34147
2654 -34147 5994 -1418 -10139 6662 -11833 -61131 -58217 -19242 16689 80296 69667 52655
2642 52655 58445 63528 60607 61028 62144 63041 47361 14564 27679 27478 23692 63666 49063 12612
2628 12612 1730 17825 19213 27425 19399 12635 25823 16994 -3784 9332 630 19526 48753
2615 48753 65088 46671 35409 39133 29078 27398 35550 27956 19763 12769 16295 4814 -30230
2602 -30230 -28254 -5940 13638 10522 26136 31216 30363 45230 -6746 -33223 -24570 -10744 -14595
2589 -14595 -11987 -5563 183 9919 -8129 7228 30296 40037 40462 57487 46270 51360 59991 61425
2575 61425 45962 16055 -8669 -21155 -5178 26829 15455 -7598 -35179 -57600 -36005 -8967
2563 -8967 -3731 16278 41231 53764 35434 33316 54177 35194 25665 11694 6088 5300 -30835
2550 -30835 -4975 10566 -8698 -4411 3446 5575 25183 18095 38137 34702 -7122 -12609 14006
2537 14006 7771 -12092 -13250 12604 9686 -10660 -7260 -29864 -47032 -45076 -18541 -24073 -49681
2524 -49681 -38402 -16841 -10150 -26647 -37926 -19513 4014 13316 10168 13998 10205 -13039 -48398
2511 -48398 -34213 -15687 -14697 -40756 -55685 -65209 -74882 -48139 1157 47031 29694 -4490 -6661
2498 -6661 2677 -17576 -56646 -59965 -48516 -43652 -40350 -19468 -3056 -24843 -34863 -22216 -10939
2485 -10939 -15130 242 37637 35061 28665 2625 -10388 837 -15134 -37253 -29632 -12931 -2473
2472 -2473 -4266 4854 18021 27469 19540 -5727 -15267 16712 13932 48553 63384 37941 26342
2459 26342 27244 40695 56316 50351 18283 -32447 -56261 -23433 -13415 -24966 -20463 -22347 -25921
2446 -25921 -22173 5131 16082 28906 33858 22220 8590 12579 30776 24919 33013 19490 -12552
2433 -12552 -4165 21214 39980 17264 -11530 2823 15909 22863 26590 26831 31451 21189 27174
2420 27174 41219 61398 40867 54992 37024 25916 64107 54293 24244 31356 23124 19152 23375
2407 23375 2829 1504 19971 27227 38475 42246 27453 11692 -7267 -14174 -15836 -15784 18233
2394 18233 18386 -22 -6163 -22779 -7939 -5121 23193 41132 39567 50588 51227 19076 -11581
2381 -11581 28894 60195 53956 25515 -9044 -23352 -934 23187 -20602 -54858 -48267 -36972
2369 -36972 -2177 23306 24088 -2590 -17403 -8212 -1034 -413 -16075 -39531 -19288 1393 -17563
2356 -17563 3815 33485 29994 37334 25687 24886 34643 53244 70944 49816 36298 11110 -9057
2343 -9057 -5049 -31735 -39850 -65367 -50794 -9299 -13519 -9764 -3795 -2960 2463 28185 22434 19915
2329 19915 19013 23069 20685 1341 -13655 -29161 -7046 19493 -2422 -18982 -24321 4820 48714
2316 48714 74588 56461 18874 -4330 10380 29848 55341 46143 36350 -18333 -30925 -7650
2304 -7650 9449 11675 19042 8013 -6639 -6383 29051 50227 55899 8810 9873 40556 58665
2291 58665 43918 46949 14165 29094 42970 50244 82185 87791 59045 33282 34943 32047 35094
2278 35094 14923 2345 11022 17082 25190 35061 47232 64749 64204 45639 9053 -12132 -10923
2265 -10923 20507 33076 51250 72929 53183 50847 40801 27560 9339 15067 10470 -21799
2253 -21799 -22813 -28594 -26374 -6093 10078 57786 82427 62474 29354 6149 16281 39996
2241 39996 5482 -25831 -29066 -24762 11245 -7575 -35986 -21911 3239 21708 -15345 -19022
2229 -19022 -34595 -43849 -21184 9213 -696 -10558 2046 34618 13884 -46936 -57852 -49634 -33550
2216 -33550 -14494 -2525 21551 21801 33943 38476 18631 20440 26378 21427 32529 36556 29260
2203 29260 37312 14112 27497 54437 57128 27596 11092 29645 19607 -33386 -39249 -29988 -21223
2190 -21223 777 13712 -244 8883 27221 30122 21405 17103 -11043 -27892 -29747 -36195 -5618
2177 -5618 22639 17145 -7517 -16070 -41371 -45191 -24285 -25981 -19195 -19033 -3987 -5418 -10339 -3112
2163 -3112 1615 20494 21756 28227 13778 -24349 -32450 -20752 -26331 -47199 -77792 -61553 -32198
2150 -32198 -46622 -19777 -1927 10268 16392 21971 37830 18124 -12993 -23717 -15376 -33171
2138 -33171 -22184 3460 31306 44109 37876 25580 13476 4475 4956 7521 -19538 -2827 8785
2125 8785 -6852 -11724 3556 13413 -3339 -35704 -37474 -23921 -6681 739 -21696 -56118 -50752
2112 -50752 -37886 -37002 -19053 32724 33208 22215 5369 11349 -5236 -35451 -40981 -37393 -20083
2099 -20083 6935 37825 9821 1709 18002 5820 10321 -15046 -21971 -35557 -18681 -6696
2087 -6696 403 24558 18852 7671 15027 13279 5160 2426 13928 22814 29105 28719 8359 2822
2073 2822 11610 31577 18209 -3497 -7358 -22251 -33650 -33390 -41436 -55442 -39533 -11811 -12526
2060 -12526 -16997 3846 14482 16241 -10041 4326 -9069 -20515 4094 21170 7713 -6157
2048 -6157 -41368 -35617 -53817 -39035 -3622 17292 43075 35940 642 -8951 -4867 -13531 -33905
2035 -33905 -31978 -21622 -18475 8475 7924 4642 5831 22832 25919 173 -15284 -21632 -23975 -16429
2021 -16429 -44641 -32517 -29917 -20955 -18456 6064 14489 21141 31542 19445 8787 20479 48972
2008 48972 35230 -3220 3169 1448 749 7025 8858 -10261 -2372 22757 11318 -11373 -2278
1995 -2278 -892 -10468 -24233 -7423 -10386 -14786 19021 36835 24533 8305 5513 -52176 -56013
1982 -56013 -47657 -50326 -44027 -33784 -57456 -64963 -31067 6935 21639 27582 27431 31695 29486 192
1968 192 -52866 -53333 -36526 -17363 2653 21229 39145 39382 26379 14315 -7829 -42456 -15817
1955 -15817 17999 -11999 -20436 -13879 -6919 6923 10945 18226 26484 3840 21848 40328 34965
1942 34965 13222 8237 22642 23089 -23927 -15312 -14325 -136 -38046 -64126 -33111 12958 17367
1929 17367 -17767 -35713 -10003 -14934 -39260 -1059 7918 8936 16438 23421 60965 71025 17362
1916 17362 15747 33387 46669 17513 -16770 14425 50483 48594 30265 -10471 15872 59891
1904 59891 47546 32675 19026 12152 8877 17585 25811 11312 -12234 12809 24796 34244 7654
1891 7654 -23637 -44001 -79908 -55370 -20835 -404 25713 15173 13274 7599 -25214 -40980
1879 -40980 -20376 -4485 10457 10552 -2129 -27146 -32681 -23080 -22189 -21454 -41036 -18941 -14908 -6582
1865 -6582 26385 28426 4916 -4225 11767 4404 -6502 -24304 -37052 -20915 12760 3372 -21851
1852 -21851 87 -17254 -55972 -86969 -78634 -58245 -50880 -15813 422 5975 32852 2833
1840 2833 -7085 9409 -12850 -21033 -13963 -9053 -25474 -28635 5725 -2629 23994 58282 41734
1827 41734 24890 38733 33640 12182 -5221 -18651 -22189 -19892 11993 11019 -10949 -17794 -27543
1814 -27543 -25681 -20987 -51608 -56263 -50507 -25914 -36978 -12460 2331 19656 3591 22642 37944
1801 37944 38030 44240 31613 46827 45597 23421 34788 22367 17444 25783 25711 8902 9582 10769
1787 10769 13206 1464 9992 18957 24887 13588 11863 36436 55597 42158 56696 43532 24273
1774 24273 43525 56464 9404 -21151 -18497 -8230 16863 19073 11580 18234 7293 31321 46472
1761 46472 4068 -19558 -8140 15450 30047 2031 7636 27650 35458 42072 25835 8983
1749 8983 1644 4184 -26378 -22382 -29904 -18311 31772 61344 42036 26109 6983 -7398 -5678
1736 -5678 1951 -8629 -34561 -39189 -56115 -50049 -63984 -61841 -55579 -58815 -18422 8425 -3145
$$ [...]
##END NTUPLES=NMR SPECTRUM
##END=
