##TITLE=Analysis number 329874
Compound Code cc 62122
Book Reference 540/24
Project Code adrs
Chemist Name mikem
##JCAMPDX= 6.0         $$ Bruker NMR JCAMP-DX V2.0
##DATA TYPE= NMR SPECTRUM
##DATA CLASS= NTUPLES
##ORIGIN= Bruker BioSpin GmbH
##OWNER= nmr
$$ XWIN-NMR		Version 3.5
$$ Mon Oct  8 11:49:09 2007 GMT Daylight Time (UT+1h)  MAYBRIDGE\nmr@NMR_250MHZ
##.OBSERVE FREQUENCY= 250.131544655141
##.OBSERVE NUCLEUS= ^1H
##.ACQUISITION MODE= SIMULTANEOUS (DQD)
##.ACQUISITION SCHEME= undefined
##.AVERAGES= 16
##.DIGITISER RES= 18
##SPECTROMETER/DATA SYSTEM= dpx250
##.PULSE SEQUENCE= zg30
##.SOLVENT NAME= DMSO
##.SHIFT REFERENCE= (INTERNAL, DMSO, 0, 16.5093)
##AUDIT TRAIL= $$ (NUMBER, WHEN, WHO, WHERE, WHAT)
$$ ##TITLE= Audit trail, XWIN-NMR		Version 3.5
$$ ##JCAMPDX= 5.01
$$ ##ORIGIN= Bruker BioSpin GmbH
$$ ##OWNER= nmr
$$ C:\u/data/dgb/nmr/ADRS/350/pdata/1/auditp.txt
$$ ##AUDIT TRAIL=  $$ (NUMBER, WHEN, WHO, WHERE, WHAT)
(   1,<2007-10-08 11:48:47.47 +100>,<MAYBRIDGE\nmr>,<NMR_250MHZ>,
      <created by zg, POWCHK disabled, PULCHK disabled
       configuration hash MD5:
       76 6E 9A 78 1E 09 19 81 EC 84 63 8F B0 6A 59 2D
       data hash MD5: 64K
       A2 A2 78 CB FE 69 1D 93 C1 2F 5A EA 5E 50 66 93>)
(   2,<2007-10-08 11:49:00.20 +100>,<MAYBRIDGE\nmr>,<NMR_250MHZ>,
      <Start of raw data processing
       ef LB = 0.3 FT_mod = 6 PKNL = 1 SI = 32K 
       data hash MD5: 32K
       26 86 BA 63 39 8E 95 6F E1 35 6C 6C 18 1C A1 D0>)
(   3,<2007-10-08 11:49:01.86 +100>,<MAYBRIDGE\nmr>,<NMR_250MHZ>,
      <apk 
       data hash MD5: 32K
       2E 8C F5 4E 5B B1 61 7E 38 50 80 26 D1 AE A4 E8>)
(   4,<2007-10-08 11:49:02.55 +100>,<MAYBRIDGE\nmr>,<NMR_250MHZ>,
      <abs ABSG = 5 
       data hash MD5: 32K
       9E 46 3A 25 7E D0 46 DB 61 E0 36 E0 2B 5F 17 50>)
$$ ##END=
$$ 
$$ hash MD5
$$ B7 88 3E E5 02 02 D9 2E D9 E3 36 76 14 03 25 C5
##$RELAX= 
##$RELAX= 
##$RELAX= 
##$RELAX= 
##$RELAX= 
##$RELAX= 
##$RELAX= 
$$ Bruker specific parameters
$$ --------------------------
##$DU= <C:\u>
##$EXPNO= 350
##$NAME= <ADRS>
##$PROCNO= 1
##$TYPE= <nmr>
##$USER= <dgb>
##$AMP= (0..31)
100 100 100 100 100 100 100 100 100 100 100 100 100 100 100 100 100 100 
100 100 100 100 100 100 100 100 100 100 100 100 100 100 
##$AQSEQ= 0
##$AQ_mod= 3
##$AUNM= <au_zg>
##$AUTOPOS= <55 >
##$BF1= 250.13
##$BF2= 250.13
##$BF3= 250.13
##$BF4= 250.13
##$BF5= 500.13
##$BF6= 500.13
##$BF7= 500.13
##$BF8= 500.13
##$BYTORDA= 1
##$CFDGTYP= 0
##$CFRGTYP= 5
##$CHEMSTR= <none>
##$CNST= (0..31)
1 1 145 1 1 1 1 1 1 1 1 1 1 1 1 1 1 1 1 1 1 1 1 1 1 1 1 1 1 1 1 1 
##$CPDPRG= <>
##$CPDPRG1= <>
##$CPDPRG2= <>
##$CPDPRG3= <>
##$CPDPRG4= <mlev>
##$CPDPRG5= <mlev>
##$CPDPRG6= <mlev>
##$CPDPRG7= <mlev>
##$CPDPRG8= <mlev>
##$CPDPRGB= <>
##$CPDPRGT= <>
##$D= (0..31)
0 1 0 0 0 0 0 0 0 0.06 0 0 0 0 0 0 0.0002 0 0 0 0 0 0 0 0 0 0 0 0 0 0 
0 
##$DATE= 1191840526
##$DBL= (0..7)
120 120 120 120 120 120 120 120 
##$DBP= (0..7)
150 150 150 150 150 150 150 150 
##$DBP07= 0
##$DBPNAM0= <>
##$DBPNAM1= <>
$$ [...]
##$SUBNAM7= <"">
##$SUBNAM8= <"">
##$SUBNAM9= <"">
##$SW= 20.6930455092707
##$SWIBOX= (0..15)
0 0 3 0 0 0 0 0 0 0 0 0 0 0 0 0 
##$SW_h= 5175.983436853
##$TD= 65536
##$TD0= 1
##$TE= 296.16
##$TE2= 300
##$TE3= 300
##$TEG= 300
##$TL= (0..7)
0 120 120 120 120 120 120 120 
##$TP= (0..7)
150 150 150 150 150 150 150 150 
##$TP07= 0
##$TPNAME0= <>
##$TPNAME1= <>
##$TPNAME2= <>
##$TPNAME3= <>
##$TPNAME4= <>
##$TPNAME5= <>
##$TPNAME6= <>
##$TPNAME7= <>
##$TPOAL= (0..7)
0.5 0.5 0.5 0.5 0.5 0.5 0.5 0.5 
##$TPOFFS= (0..7)
0 0 0 0 0 0 0 0 
##$TUNHIN= 0
##$TUNHOUT= 0
##$TUNXOUT= 0
##$USERA1= <user>
##$USERA2= <user>
##$USERA3= <user>
##$USERA4= <user>
##$USERA5= <user>
##$V9= 5
##$VALIST= <valist>
##$VCLIST= <CCCCCCCCCCCCCCC>
##$VD= 0
##$VDLIST= <DDDDDDDDDDDDDDD>
##$VPLIST= <PPPPPPPPPPPPPPP>
##$VTLIST= <TTTTTTTTTTTTTTT>
##$WBST= 1024
##$WBSW= 4
##$XGAIN= (0..3)
0 0 0 0 
##$XL= 0
##$YL= 0
##$YMAX_a= 365562
##$YMIN_a= -544674
##$ZGOPTNS= <>
##$ZL1= 120
##$ZL2= 120
##$ZL3= 120
##$ZL4= 120
##$ABSF1= 16.50934
##$ABSF2= -4.183832
##$ABSG= 5
##$ABSL= 3
##$ALPHA= 0
##$AQORDER= 0
##$ASSFAC= 0
##$ASSFACI= 0
##$ASSFACX= 0
##$ASSWID= 0
##$AUNMP= <proc_1d>
##$AZFE= 0.1
##$AZFW= 0.1
##$BCFW= 0
##$BC_mod= 0
##$BYTORDP= 0
##$COROFFS= 0
##$CY= 12.5
##$DATMOD= 1
##$DC= 0
##$DFILT= <>
##$DTYPP= 0
##$F1P= 14.0000005364418
##$F2P= -0.99999901652339
##$FCOR= 0.5
##$FTSIZE= 32768
##$FT_mod= 6
##$GAMMA= 0
##$GB= 0
##$INTBC= 1
##$INTSCL= 1
##$ISEN= 128
##$LB= 0.3
##$LEV0= 0
##$LPBIN= 0
##$MAXI= 10000
##$MC2= 0
##$MEAN= 0
##$ME_mod= 0
##$MI= 0
##$NCOEF= 0
##$NC_proc= -3
##$NLEV= 6
##$NOISF1= 0
##$NOISF2= 0
##$NSP= 0
##$NTH_PI= 0
##$NZP= 0
##$OFFSET= 16.50934
##$PC= 1
##$PHC0= 144.4176
##$PHC1= 5.408379
##$PH_mod= 1
##$PKNL= yes
##$PPARMOD= 0
##$PSCAL= 4
##$PSIGN= 0
##$REVERSE= no
##$SF= 250.130003164764
##$SI= 32768
##$SIGF1= 0
##$SIGF2= 0
##$SINO= 400
##$SIOLD= 32768
##$SREGLST= <1H.DMSO>
##$SSB= 0
##$STSI= 32768
##$STSR= 0
##$SW_p= 5175.98343685301
##$SYMM= 0
##$S_DEV= 0
##$TDeff= 65536
##$TDoff= 0
##$TI= <Analysis number 999999
Compound Code 99
Book Reference 9
Project Code 9>
##$TILT= no
##$TM1= 0
##$TM2= 0
##$TOPLEV= 0
##$USERP1= <user>
##$USERP2= <user>
##$USERP3= <user>
##$USERP4= <user>
##$USERP5= <user>
##$WDW= 1
##$XDIM= 32768
##$YMAX_p= 507133966
##$YMIN_p= -118615
$$ End of Bruker specific parameters
$$ ---------------------------------
##NTUPLES= NMR SPECTRUM
##VAR_NAME=  FREQUENCY,     SPECTRUM/REAL,   SPECTRUM/IMAG
##SYMBOL=    X,             R,               I
##VAR_TYPE=  INDEPENDENT,   DEPENDENT,       DEPENDENT
##VAR_FORM=  AFFN,          ASDF,            ASDF
##VAR_DIM=   32768,         32768,           32768
##UNITS=     HZ,            ARBITRARY UNITS, ARBITRARY UNITS
##FACTOR=    0.157963299565203, 1,           1
##FIRST=     4129.4813380491, 0,             0
##LAST=      -1046.50209880391, 0,           0
##MIN=       -1046.50209880391, -118615,     0
##MAX=       4129.4813380491, 507133966,     0
$$ Real data points
##PAGE= N=1
##DATA TABLE= (X++(R..R)), XYDATA
$$ [...]
18263A79205L336P60J6515K793J1901M1125O2296L6477K2707J3283K1851J0992
18251D23241j3721l0522L165K8475R321K2511O130j3558j5859P736J4517j4077
18239D27359k4881m6732r511R739k6088J6627k6422j9872j45O441j3854k27q648
18226B83786j877j9054j2321K2238K504p135j9739k8511r271p536j7735k6241
18214A59108L505N354J3024j5158k9312j1859j5453n220M4329M9774K7791l39
18202B25544J4626L1450M2711K5968J3427k3076m4818l305k6497l2208l3600K990
18190A93212R235m611J5064J2258k294j9624l3430j3482o208k5006l8480O697
18178I3331K6726J8651J4538n739k3414j4896j6962j3484J0468k832K3299K8572
$$ y = [179205, 182541, 183301, 199816, 202609, 214510, 255635, 317931, 354408, 377115, 390398, 412249, 423241, 409520, 378998, 382163, 410638, 419959, 442470, 448600, 435042, 419183, 426919, 441436, 427359, 402478, 355746, 346235, 355974, 329886, 346513, 320091, 300219, 300074, 306515, 292661, 292434, 283786, 281909, 262855, 250534, 272772, 275276, 268141, 248402, 219891, 210620, 203084, 185349, 159108, 162613, 167967, 180991, 165833, 136521, 124662, 109209, 103989, 148318, 198092, 225883, 225544, 240170, 271620, 314331, 340299, 353726, 330650, 285832, 282527, 256030, 223822, 190222, 193212, 202447, 197836, 212900, 225158, 222864, 203240, 169810, 156328, 150120, 125114, 86634, 93331, 120057, 138708, 153246, 147507, 124093, 109197, 92235, 78751, 89219, 86387, 109686, 138258]
18166A38258J3036j2419J2391K8801O946K3857L3681K1359K4492J9325K5304L7261
18154C72292N7815R7029J36462K13622L37392N01303O16304O64298O84852Q71007
18144D552376J118074Q69504J41730q0401J46909J1312o61151j046252r94915
18135D057186q55354p27687o25668m99854l60619k34846j59573j11229n8281n9148
18125C64927n0410m7813k2319k5401k2350k7808m990J92n838j2564Q140J6288
18113A70054r380l6639j6471q369j4869k5917k3856j991o769J8001O843o790R072
18100E2919K3084k318J9858k695n857L776l829k6189p709J657J3582K1065L924
18087I1268P54Q582m1497r874K3150J5777J4503J8437j1661l2703j7202m94j536
$$ y = [138258, 151294, 138875, 151266, 180067, 187013, 210870, 244551, 265910, 290402, 309727, 335031, 372292, 430107, 527136, 663598, 877220, 1214612, 1715915, 2332219, 2996517, 3681369, 4552376, 5670450, 6539954, 6681684, 6601283, 6748192, 6759504, 6098353, 5052101, 4057186, 3201832, 2474145, 1848477, 1348623, 988004, 753158, 593585, 482356, 424075, 364927, 314517, 266704, 244385, 218984, 196634, 168826, 163836, 164028, 158190, 145626, 153766, 170054, 160674, 124035, 107564, 99195, 84326, 58409, 34553, 32562, 25793, 43794, 50637, 43847, 52919, 76003, 73685, 93543, 90848, 84991, 88767, 84938, 58749, 51040, 52697, 66279, 87344, 91268, 92022, 100604, 59107, 49233, 72383, 88160, 102663, 121100, 109439, 76736, 59534, 59040, 57504]
18074E7504j3879J0876l429j7850j1102j420k5664r766J007N037L2803m95n270
18061A8352k477J3524O545r656p710J4665k976j816N604K359M997j407L4637M0917
18047A15558J0945L8161L5428J5160M5023J0649j3172o295j4225m17R22j0551
18035B27186K8558J2242k6699l5921k1174K882n6822n0313l2684J3111l1896k1335
18023G135J6150J5368J2698r496j0963l588J3274K1659j2985j4427P376N309j6979
18010C0531j5242K926M791r476p917j1832J7614J5405K9316K0276P643J4956r515
17997H9476J4190k679J379J1144J891j68j9678l060J7443K6022P557k607J1073
17984A51983k0424k6509j7814o342K54O081Q858j2720l5684k4633j5899q929o22
$$ y = [57504, 43625, 54501, 51072, 33222, 22120, 20700, -4964, -14730, -13723, -8686, 24117, 23622, 18352, 15875, 29399, 35944, 26288, 18578, 33243, 30267, 28451, 34055, 36414, 41411, 40004, 74641, 115558, 126503, 164664, 200092, 215252, 260275, 270924, 257752, 251457, 237232, 236815, 237737, 227186, 255744, 267986, 241287, 205366, 184192, 187074, 130252, 79939, 47255, 60366, 28470, 7135, 23285, 38653, 51351, 41855, 30892, 27304, 40578, 62237, 49252, 34825, 42201, 47510, 30531, 15289, 18215, 23006, 13530, 5613, -6219, 11395, 26800, 56116, 76392, 84035, 98991, 89476, 103666, 100987, 102366, 113510, 115401, 115233, 95555, 92495, 109938, 135960, 143517, 140910, 151983, 131559, 105050, 87236, 80894, 81148, 87229, 96087, 83367, 47683, 23050, 7151, -1778, -2400]
17971b400R486r314P053M285k5350l6013K2502K9535J3060J6648j5585J1380J9791
17958D5078P85j6604j8492p1p777o801J6634L682j0270k4604J3097L097k8885
17945c1131r674k9750J2363K6143o886J7371K6644m428k755J7516m953j0319m111
17932c970j4389R913N199m005j1300j890p620k355R068J6194R935J4249J8640
17919C7669j1610j5520j4955j6850j363L0819P266j3210r794Q798K6374Q580M482
17906D0686r187j20J762P68r092J2526n674n448N625K4652q349j6483p057q621
17892A5988o652J37Q842r855j0061m459J4774K2743J5491N247j5205j2056J0333
17879C5267j1354l4717l754j0512r858p076K998K034K7681J9002j8024k3250K977
$$ y = [-2400, 7086, -2228, 4825, 9110, -16240, -52253, -29751, -216, 12844, 29492, 13907, 25287, 45078, 45863, 29259, 10767, 10696, 2919, -3882, 12752, 16434, 6164, -18440, -5343, -2246, -31131, -40805, -70555, -58192, -32049, -38935, -21564, 5080, 652, -2103, 15413, 10460, 141, -3970, -18359, -8446, -3247, -7252, -18552, -20442, -28062, -30417, -21349, -5155, 4780, 19029, 37669, 26059, 10539, -4416, -21266, -22629, 8190, 15456, 2246, -7548, 1250, 27624, 36204, 40686, 31499, 31379, 33141, 33909, 24817, 37343, 31669, 26221, 31846, 56498, 48149, 31666, 24609, 15988, 9336, 9473, 18315, 8460, -1601, -6060, 8714, 31457, 46948, 52195, 36990, 24934, 35267, 23913, -10804, -14558, -25070, -34928, -42004, -39006, -36972, -9291, 9711, -8313, -31563, -28586]
17866b8586P554j643J427o697N198J3286J3047j9240L027J6308K1649l689j3789
17853G852k7322O826K954J0678K958j6600J7450R015n460j5537p589P927K5033
17840A8185K839m589J5277M9397M4828O136M2246L5049M8756L5206M6451O0289
17828D00070M4321N535j603J3522o83l8808l6593m1345l9238n9208m8249n4278
17816A43443m7487k4973l2341k1686K3153K3941Q148r42M961p273k0923k2809
17804B5212K603J5427o500j7827r72j0166O155j2526j1762k797M480j6940j8124
17791d3737J8635M060J5164J91o227M203l055K8664O129p195J1514J4001L777
17778D6124p233l2261j3536j5070j4085K3064K2626Q272Q498q403M497L5035J1234
$$ y = [-28586, -21032, -22675, -21248, -27945, -22747, -9461, 3586, -15654, -12627, 3681, 25330, 21641, 7852, -19470, -12644, -9690, 988, 3946, -12654, 4796, 13811, 8351, -7186, -14775, -6848, 18185, 21024, 16435, 31712, 81109, 125937, 132073, 174319, 209368, 258124, 293330, 339781, 400070, 444391, 449926, 448323, 461845, 461162, 422354, 385761, 344416, 305178, 245970, 197721, 143443, 95956, 70983, 38642, 16956, 40109, 64050, 72198, 71256, 76217, 68944, 48021, 25212, 27815, 43242, 36742, 18915, 17943, 7777, 13932, 1406, -10356, -13153, -8673, -25613, -43737, -25102, -21042, -5878, -5687, -11914, -7711, -10766, 17898, 24027, 16832, 28346, 42347, 46124, 38891, 6630, -6906, -21976, -36061, -12997, 9629, 17901, 26399, 17996, 22493, 57528, 68762]
17765F8762j4389k7394k8995J061J0457O905M540q380l383K4870k4566k081J6768
17752B4175L634j5653o187j4615k921j7283K4338L3026k8321l0513r681Q62J5445
17739b3694O24k7279r399K1792N055P893O721J0153j413k3195j063K3901L4331
17726B4427K2206k0892k8724j8781j9480J7063K2424o034j2944k0654L4692J4411
17714G714M178J8516j1978j0393P346k374j2146j1306J1469P794j7660j511k760
17701a3111k0365l891K8457K6295J7119J593q199k0942j7252r036Q221J0604q798
17688i305R440j3901K410N392K387J38j1035J4391k039j4054N409L6952L7147
17675F3332K7157n340m4462j3067r183Q665j0237j9876k01J2924J4657N969j669
$$ y = [68762, 54373, 26979, -2016, -955, 9502, 16407, 20947, 12567, 9184, 34054, 9488, 7407, 24175, 27809, 12156, 5969, -8646, -11567, -28850, -4512, 28514, 193, -30320, -40001, -39139, -23694, -23070, -50349, -59748, -37956, -32901, -25008, -18287, -8134, -9547, -32742, -33805, -9904, 24427, 46633, 25741, -2983, -21764, -41244, -24181, -1757, -7791, -20735, -41389, -6697, 7714, 11892, 30408, 18430, 8037, 15383, 13009, 863, -10443, 1026, 8820, -8840, -10351, -13111, -33476, -37367, -8910, 17385, 34504, 36097, 27898, 6956, -10296, -19332, -11111, -507, -9305, 135, -13766, -11356, -5964, -3577, -3439, -14474, -83, -2122, -16176, -10767, 26185, 63332, 90489, 85149, 40687, 27620, 18437, 27102, 16865, -3011, -3212, 9712, 24369, 30338, 28669]
17662B8669j0624L1294l548k8274l049j4345k308L1272J8688k4837o570R90J7299
17649C4657j086n249k3564J4093K2106k2294j100O943j1487K9249J084k1130L0304
17636E2526L2305J1409l3838o279P486o312P032N540j6738M923k094r687k359
17623D3914j3394j8858j7944Q671Q11m51q255j1466N366K341J4760K3411Q45k948
17609B6803j021j2786o515J514J8299J1702J5628j4712j4049R956M721L626k8965
17596A4201r279J1813L0773R06p77J6067j2424L173J0904Q499o203n030l905j1081
17582D7637k658k900N52L3968L8928L2470Q965K222J8842K403l700k8312k5887
17569A22530o767j7830j7761j339k7345k3702J95k791k065J1482j4220r019J8650
$$ y = [28669, 18045, 49339, 45791, 17517, 14468, 123, -2185, 29087, 47775, 22938, 16368, 17358, 34657, 33571, 28322, 4758, 18851, 40957, 18663, 17563, 24506, 13019, 42268, 43352, 22222, 52526, 84831, 96240, 62402, 56123, 63609, 57297, 64329, 69869, 53131, 58054, 55960, 46273, 43914, 30520, 11662, -6282, 2389, 3200, 2749, -5506, -16972, -11606, -9265, 5495, 28906, 29751, 26803, 25782, 12996, 6481, 7995, 26294, 37996, 53624, 38912, 24863, 34819, 39540, 43166, 14201, 4922, 16735, 47508, 48414, 47637, 63704, 51280, 54453, 65357, 73856, 67653, 62623, 58718, 47637, 44979, 42079, 42631, 76599, 115527, 147997, 156962, 159184, 178026, 180429, 176729, 148417, 122530, 115763, 97933, 80172, 78833, 51488, 27786, 27981, 25190, 23125, 34607, 20387, 11368, 30018]
17556C0018J2680N351j682k617J2956n963k905m72J1672J3139k4191j6773l011
17543B8202J4955j303j1097k828J4105J6391j610Q408k5803r685J5637j0526N321
17530D0167J2418l5182l1295j5683K3558j329L70K4248K3600J4507o042j5518
17518C3819j3176J0899J0289N863R973O505J0684J8058N761O176M88J4450R948
17505A29737q219j5151j1897j1407j2479j3534m146j1844m914R063j7390p969
17493A9850J9863P664K956n899O471J1421J2753n741o591J326l820k1092J978
17480D1139O723j3647L927J9875J0015j8947j4476m029l191O798L5089j5633m2687
17467A0956j5133q090o6j572L2631J9605J70J0914j5669j2914k5699j3874O644
$$ y = [30018, 42698, 48049, 46367, 43750, 56706, 50743, 47838, 47366, 59038, 72177, 47986, 31213, 28202, 43157, 41854, 30757, 27929, 42034, 58425, 56815, 65223, 39420, 29735, 45372, 34846, 40167, 52585, 17403, -13892, -29575, -6017, -7346, -6976, 17272, 40872, 55379, 49337, 33819, 20643, 31542, 41831, 47694, 57667, 64172, 74856, 92914, 98675, 104851, 105339, 119789, 129737, 121518, 106367, 94470, 83063, 70584, 57050, 52904, 41060, 36146, 45209, 27819, 19850, 39713, 47377, 50333, 44434, 50905, 62326, 75079, 69338, 62747, 64073, 60253, 39161, 41139, 47862, 34215, 38142, 58017, 68032, 49085, 34609, 30580, 27389, 34187, 69276, 53643, 10956, -4177, -12267, -12333, -13905, 18726, 38331, 38501, 49415, 33746, 20832, -4867, -18741, -12097]
17454a2097K9306O967L480k3500O950K9544K0100Q186n092j8237l6769j6327r071
17441a6560K0995L4457Q684n190J003j6138J3427M5769K9507n18j3537k2669m782
17428G4448M72l679J0217J4843L045q071j9576j9152R187J1621j8418j2485J6552
17415E9004J5341O333m260Q051R823j0933P73j009P547J911l854j0485J099m758
17401G4583J297J2410o203j38K205L49j8330K335N931K5134Q090k7887j7576J029
17387F3229l315K8847J1787k9096J5087K5506J2072J1650J80j0940o472j2339
17375A06196M328J1939J3436J308K4109j546k3266o352R570o606j3908k5702k9670
17362F3836r813K1185J3697R755O03J3429j0341k3579j4455N351O507j3436Q213
$$ y = [-12097, 17209, 24176, 27656, 4156, 11106, 40650, 60750, 68936, 63844, 45607, 8838, -7489, -16560, 4435, 38892, 47576, 42386, 43389, 27251, 40678, 86447, 115954, 115436, 101899, 79230, 74448, 74920, 71241, 81458, 96301, 99346, 91275, 71699, 52547, 61734, 73355, 54937, 42452, 59004, 74345, 80678, 76418, 84469, 94292, 83359, 84132, 83123, 90670, 92581, 88727, 78242, 79341, 74583, 75880, 88290, 82087, 81949, 84154, 84503, 66173, 68508, 74439, 99573, 107663, 79776, 62200, 63229, 59914, 88761, 100548, 71452, 86539, 112045, 124117, 135767, 135947, 125007, 118535, 106196, 110524, 122463, 135899, 137207, 161316, 159770, 136504, 130152, 139722, 133116, 119208, 93506, 63836, 54023, 75208, 88905, 98660, 99263, 112692, 102351, 78772, 64317, 69668, 76175, 62739, 70952]
17349G0952J5348J1478l4J0811N443L461o415K94J7082k228j1113j1941M266J4910
17335A22314L4906P982k6387J0315J5683k878l837N360m035L330O085O932j0186
17322A65584l277J2048J0660M743o143J4443J8775J4106J4232J3659K9576K1478
17310C09884j2975j0615K5163j170P415L1580K979N142j9766l836K1793M1781
17298C97375K8052O251K5717J9677m976K1921K7156L1608M062J3925M2447J6943
17286F30158M1067N6174O2997R8040J21788J10025J64457J75267K05434K27236
17276A892643J86905J72798K25029K33452K37145K73618L64274M60918N40161
17267D586943P39126J066689J684493K684852M233184O475213Q634651R314794
$$ y = [70952, 86300, 97778, 97744, 108555, 113998, 117459, 111044, 111338, 128420, 126192, 115079, 103138, 107404, 122314, 157220, 165202, 138815, 149130, 164813, 161935, 158098, 163458, 159423, 162753, 168838, 175770, 165584, 162307, 174355, 185015, 189758, 183615, 198058, 216833, 230939, 245171, 258830, 288406, 309884, 296909, 286294, 311457, 310287, 317702, 349282, 352261, 357403, 337637, 333801, 355594, 397375, 425427, 431678, 457395, 477072, 472096, 494017, 521173, 552781, 556843, 570768, 613215, 630158, 671225, 727399, 790396, 888436, 1010224, 1120249, 1284706, 1459973, 1665407, 1892643, 2079548, 2252346, 2477375, 2710827, 2947972, 3221590, 3585864, 4046782, 4586943, 5326069, 6392758, 8077251, 10762103, 14995287, 21470500, 30105151, 39419945]
17259C9419945R255134J1476206J5310110J3490236M374277q35680J105876Q90248
17251I4486352p037148j3633512j4027705j2142802j0797608r513746p569105
17244A9764726n435248l666234k398624j583481j134902q16022n40329l62243
17236C827643k91294k70709j78355q6742n6247j28558j69458j05237p7279j69503
17226B294261k53102k60752k05830j39427j08548q9682n6445P021O8338N9112
17216A314946n761m5497j7188o025q5237j51412j49779j27215j32981j05425j11577
17205C76849q9502m2751j9601k7041k2903j6867k5519q176n079l2706O318q27
17193I2195R791o564m426N413k0543k3349p946R930Q352j9780j1255j0654j430
$$ y = [39419945, 48675079, 60151285, 75461395, 88951631, 93325908, 92490228, 93596104, 94486352, 87449204, 73815692, 59787987, 47645185, 36847577, 27333831, 19764726, 14329478, 10663244, 8264620, 6681139, 5546237, 4730215, 4189886, 3827643, 3536349, 3265640, 3087285, 3000543, 2944296, 2815738, 2646280, 2541043, 2463764, 2294261, 2041159, 1780407, 1574577, 1435150, 1326602, 1236920, 1180475, 1187496, 1255834, 1314946, 1309185, 1263688, 1246500, 1240475, 1155238, 1003826, 854047, 726832, 593851, 488426, 376849, 287347, 244596, 224995, 197954, 175051, 158184, 132665, 124489, 119410, 86704, 93022, 92195, 101986, 95422, 90996, 96409, 75866, 52517, 44571, 54501, 62853, 43073, 31818, 21164, 19734]
17180A9734N258j7186M452k730j15l571J6888K4110K4425L257l2061O098p491
17167D1068M784M403j8975o007q23J9376K1954k5075l4278J3789j4602p018L114
17154A710k1231j5232j5493J9604J4428K1227l43k5490j322J6125J5883K330j4541
17141b345j0137N261L382j126m719r877k7807k216P571L2910M2819J6278j7478
17128C2516j8985k1383j935n047k246m463j1580N830K855K037M318J0945J1262
17115D124O039k0972q703n880p637J4549j3077k872L6870k097k5469j4981j7556
17102e7662o862L1259J7813j2527j6068r86M272P527J4317O228O71j4420o855
17089c3293Q015J4059m92J2306Q955j5094K271J3675k1549k7438J7941M306r248
$$ y = [19734, 24992, 7806, 12258, 9528, 9413, 5842, 22730, 46840, 71265, 74522, 42461, 48559, 41068, 45852, 50255, 31280, 25273, 24450, 43826, 65780, 40705, 6427, 20216, 5614, -1404, 1710, -19521, -34753, -50246, -30642, -16214, 5013, 4670, -20820, -22142, -6017, 9866, 12196, -2345, -12482, -7221, -3839, -4965, -9684, -19561, -47368, -49584, -42013, -9103, 33716, 49994, 32516, 13531, -7852, -9787, -14834, -17080, -21543, -33123, -27293, -24438, -22401, -18083, -7138, 4124, 10163, -10809, -19512, -25392, -33029, -18480, -31557, -34429, 2441, 344, -25125, -40106, -57662, -64524, -33265, -15452, -27979, -44047, -45033, -40761, -33234, -18917, -12689, -12018, -26438, -33293, -25278, -11219, -11711, 595, 9550, -5544, -3273, 10402, -11147, -38585, -20644, -16338, -25586]
17076b5586J6765j9532k2916k444K2748K6976k5069k0361P636j1009o664J9220
17064d0236M306j1963Q319K190J8521J0574k5372j825K4377J3628j9374K892O257
17051g706K007O657J0390L4791p686k3541j2986Q250m0248j3755j799j7214O480
17038e6360l099L042O789K9885J0155j1368k1506p136K1628J9421M285l239j4845
17025b2348j8108M125J7172j3638j6562q432R33n90n175K924J3185p690l623M373
17011e3454J2124M924j6064m2J0282j5195m067J4614Q622J965q187P052j6691
16998e4117r568K924J0831J1909R370k310j1747M328m321j926J0741K305j9919
16985e1500k3736j5205L4008M3854J9982n010J9428m983k060o619k730L9072L2946
$$ y = [-25586, -8821, -28353, -51269, -53713, -30965, -3989, -29058, -49419, -41783, -52792, -59456, -40236, -35930, -47893, -39574, -37384, -18863, -8289, -33661, -35486, -11109, 2519, -16855, -13963, -7706, -5699, 958, 11348, 46139, 38453, 14912, 1926, 10176, -30072, -43827, -45626, -62840, -56360, -59459, -56417, -49628, -19743, -9588, -20956, -42462, -49598, -27970, -8549, -4264, -7503, -22348, -40456, -36331, -19159, -32797, -49359, -57791, -56858, -57448, -62623, -59699, -46514, -54204, -57827, -53454, -41330, -36406, -52470, -52512, -42230, -57425, -61492, -46878, -38256, -36291, -44478, -37426, -54117, -63685, -60761, -49930, -38021, -28651, -30961, -42708, -38380, -42701, -44627, -33886, -31581, -51500, -75236, -90441, -56433, -12579, 7403, 2393, 21821, 16838, 14778, 8159, 5429, 44501, 77447]
16972G7447K8314M8354P0202N1105J8834N6496M6845L2988L1872L010p051n296
16960D53120k9369n4017o1912q0844o2496m9594l0210J812k1948j6092Q296K685
16948E9431L294j1559m567l3789j6180k3852j5837M480L5794O216q312j1570k798
16935a9249K658p074Q618j48j9658j4787M116R6l927l687k3313k408L0159J5010
16921c3594L534J0429J6226J7645J097l1464k0474L0824K1408J1836j0159j5733
16909A575j0694j4773P912n034p472k452j4186K0938K4707K3258j593k9863J835
16896e842R080R602m5145j2667K8017K0155l862k4448j3733J4057J308j3370l0276
16883f7124k885L3603J5467M804m24M536J6899k2240k2079j3253n861r573p17
$$ y = [77447, 105761, 154115, 224317, 275422, 294256, 350752, 397597, 430585, 462457, 465467, 458416, 453120, 423751, 369734, 307822, 226978, 164482, 114888, 84678, 86490, 64542, 48450, 56746, 59431, 62725, 51166, 46599, 12810, -3370, -27222, -43059, -38579, -2785, 3431, -4881, -16451, -19249, -16591, -23665, -15047, -15195, -34853, -49640, -45524, -45428, -49355, -53042, -76355, -78763, -48604, -33594, -30060, -19631, -3405, 14240, 15337, -16127, -36601, -5777, 15631, 27467, 17308, 1575, -9119, -23892, -15980, -21014, -28486, -30938, -45124, -24186, 521, 23779, 22186, -7677, -5842, 3238, 12840, -32305, -44972, -16955, 3200, -662, -25110, -38843, -24786, -23478, -36848, -67124, -70009, -36406, -20939, -16135, -16559, -12023, 4876, -17364, -39443, -52696, -58557, -68130, -68847]
16870f8847l318M377L5205K9900j7186k5395P428l457M067J31k269j807N074o015
16856d2112l429o644J7683M889K1673J8316j9954m984K1016n458o733k7781j5366
16843d8884K883j1514O768K0627K5899k366p512O474n57O931q150q892j3534j9412
16829e1239o135o114J609K0051K9507r85k46J2633J506l4012l4433r232J1623
16816f5467L3006J8190K0713M550P115k397L735j9506o641M717q111J070J1633
16803B607l853k812M404k35J886j639n791j6657O673K256M472R575K2893o068
16789A7711O654K3395J031j5635j9734j7386m179j6412J1269L963j7654L904J9884
16776c189L298j2893j7145k4387k846N399j3126J9O239O818R225O893J789j4332
$$ y = [-68847, -72165, -67788, -32583, -2683, -19869, -45264, -37836, -41293, -37226, -37095, -39364, -41171, -36097, -42112, -45541, -52185, -34502, -29613, -7940, 10376, -9578, -14562, 6454, 996, -5737, -33518, -48884, -46001, -57515, -50747, -30120, -4221, -6587, -14099, -7625, -8182, -1251, -9401, -18293, -31827, -51239, -57374, -63488, -61879, -41828, -12321, -13306, -13552, -919, 587, -33425, -67858, -77090, -65467, -32461, -14271, 6442, 10992, 18107, 15710, 19445, -61, -6702, -1985, -10096, -9026, 2607, -1246, -4058, 346, 111, 1997, 358, -5433, -22090, -15417, -13161, -8689, 886, 23779, 17711, 24365, 47760, 48791, 33156, 13422, -3964, -8143, -24555, -13286, -9323, -26977, -23073, -3189, 109, -12784, -29929, -54316, -57162, -51763, -64889, -64870, -58631, -51813, -42588, -35695, -33906, -48238]
16762d8238r361K2814L137R209Q818K4409k3874l5661j3504K5555R598p659j0794
16749d5551J123Q349j2312j5293M55L3698N1583j8316k2554J105k593R858n178
16736a5626p516q077j9895K6347K4942l449K016j6119Q12j262R219p05K2121l256
16722I552r202l9762j7057P026j7707J4972L4971j0715K019J7504k278L731k6959
16709c3905j1384N085O074K6249J3106j0562O2M182Q780Q130L388j0130k3135
16696a4060j0131n321n101L5164K5576J5307j7951R957j5887l471J4725J8099
16684D6906M0050K3993L4977N5941P4456N6046L5866M4122L3061K698k4326l5323
16672C88467l9514n6177m3873l7005m0270l0111l5579l3473j0626q071j4304l1961
$$ y = [-48238, -57599, -34785, -31648, -22439, -13621, 10788, -13086, -48747, -62251, -36696, -27098, -34757, -45551, -44428, -36079, -48391, -63684, -63229, -29531, 22052, 3736, -18818, -17713, -20306, -10448, -15626, -23142, -31219, -51114, -24767, 175, -3274, -1258, -17377, -16565, -17827, -8608, -9313, 12808, 9552, 350, -39412, -56469, -49443, -67150, -52178, -17207, -27922, -25903, -8399, -10677, -6946, -33905, -45289, -40204, -34130, -7881, 5225, -5337, -5275, -1093, 7687, 15817, 19205, 9075, -14060, -24191, -29512, -34613, 551, 26127, 41434, 23483, 33440, 17553, 14082, 28807, 46906, 86956, 110949, 145926, 201867, 276323, 332369, 368235, 412357, 445418, 448116, 423790, 388467, 348953, 292776, 248903, 211898, 171628, 141517, 105938, 72465, 61839, 53768, 39464, 7503]
16660G503q111j3385j603p012j3830O730L225k97m039M642K1101O861J77K612
16646D574l862J7921P265k3426j5839j0527K3325P767j0466o705k2460J0020J5837
16633f576J2994o863j600q333J546J099M705n835r193L562M203J2173o558P894
16619C218J758k1659r413j5042N104m907R337j650j0978L0846K8023j7370m740
16606g473R219M397j9875j5706K1544J4621r430k1594k6006n248R537l737o326
16593e6077K0147J9497p537q560K973R356l383j4292j660K2519l461k0308n14
16580d1300j0509j332J5774j3090j0596K2005K6457P359o193m723K635k565j0723
16567b6801p675Q1J7610m119J1224r021l782n661K5272J292q888Q404q040N208
$$ y = [7503, -608, -13993, -15596, -22608, -36438, -29708, -26483, -26780, -30819, -26177, -5076, 1785, 1962, 4574, 712, 18633, 25898, 2472, -13367, -23894, -569, 7198, -3268, -9973, -32433, -22413, -6576, 6418, -445, -2045, -10378, -8832, -7733, -3028, -8863, -18056, -14494, -10291, 1882, -4676, 3218, 4976, -16683, -26096, -41138, -36034, -40941, -31604, -33254, -44232, -13386, 14637, -2733, -7473, 1746, 6143, -13732, -29438, -7894, 6727, -2703, -24297, -50303, -55551, -46014, -49751, -56077, -35930, -16433, -23970, -32530, -29557, -20201, -23584, -37876, -39536, -17017, -20478, -40786, -41300, -51809, -53141, -37367, -50457, -61053, -39048, -12591, -5232, -11425, -16148, -13513, -16078, -26801, -34476, -34395, -16785, -20904, -9680, -18701, -22483, -28144, -2872, -1580, -10468, -2064, -10104, -4896]
16553d896L0429J8088k1841o352O948j2097k8275q461o863O624J2627L992j3911
16540b3988J3176K4726n490L13j7418j3007k4240P21K1460j4525K487Q539l637
16527c0883j2540O486J1379n27l045P110j0852k4784p05K9079J2216P357j3794
16514b3503J9408K3183o5k9214k8727J1241p057l67J8408K5009K069k9356j1723
16501c0694J4604J3718J1104J0395j2389j4244r864o433n406l903n245l207N529
16488c6035K8404K0011M24j2700j4254O784K561l7982l4841J9073L1233R957k9565
16475d6930o560M4l59q780J9567l06K4015K8271j2854j7142o960J4424l710J32
16461a7148J250L659M327Q775m540k6841k1918q170O319J971k1370l225K0452
$$ y = [-4896, 25533, 43621, 21780, 15428, 22376, 10279, -17996, -26457, -33320, -26696, -14069, -10077, -23988, -10812, 13914, 8424, 8737, -8681, -21688, -45928, -45207, -23747, -38272, -35785, -27246, -30883, -43423, -36937, -25558, -26085, -29130, -22020, -32872, -57656, -58361, -29282, -17066, -9709, -23503, -4095, 19088, 19023, -10191, -38918, -27677, -34734, -35101, -16693, 8316, 10385, -18971, -30694, -16090, -2372, 8732, 19127, 6738, -7506, -17370, -23803, -29209, -33112, -38357, -41564, -36035, -7631, 12380, 12804, 104, -14150, -7366, -4805, -42787, -77628, -58555, -27322, -17365, -46930, -53490, -53446, -53805, -62585, -43018, -43324, -19309, 8962, -3892, -21034, -27994, -13570, -17280, -17148, -15898, -12239, -7912, 863, -3677, -30518, -52436, -60606, -54287, -52316, -73686, -76911, -56459]
16448e6459K0798m477j1554j384l995J5066J1543o947k3878L845P515j884N479
16435d6332j1471K0186J3310L277j2455R673J6911J1025k5798j9694l0099J670
16423f9797P215J7546M6731L876j7553j5919j5207j9O877m157r463L7732K7131
16410A4993k5919j8970N095j27jJ1806J2539j5666o068n90J2725J4197R126n64
16396A2576j7653j2031j7157o776P861K2268O905m130j035m454k2662l361K6202
16383a3447J6635j5524j1439J2196L839j3667P674K3378K708j6777J820Q252j1005
16370e357k4180j034L669p934Q245j1073j5446J7823p99J1705K564n811q970j983
16356c8581O990j1181l750J2230M818N635K6849M590r727O030J5452k919j3135
$$ y = [-56459, -35661, -40138, -51692, -53076, -57071, -42005, -30462, -37409, -61287, -57442, -49927, -51811, -46332, -57803, -37617, -24307, -21030, -33485, -23812, -6901, 4124, -21674, -41368, -71467, -69797, -62582, -45036, 1695, 5571, -11982, -27901, -43108, -43127, -36250, -40407, -49870, -12138, 14993, -10926, -29896, -24801, -24928, -24929, -13123, -584, -16250, -22318, -22908, -10183, 4014, 13140, 12576, -5077, -17108, -34265, -41041, -33180, -10912, -4007, -8137, -9172, -13626, -36288, -39649, -13447, 3188, -12336, -23775, -11579, -7740, -21407, -13733, 9645, 12353, -4424, -2604, 5648, -5357, -29537, -30571, -26902, -34836, -26591, -37664, -53110, -35287, -36086, -24381, -21817, -27628, -36598, -38581, -31591, -42772, -46522, -34292, -29474, -23839, 3010, 7600, -2127, 3903, 19355, 16436, 3301]
16343C301J1748K225k4260J247k85j6657j6416J1542K5785J6996k4509k0049J3794
16330a5538J0555n864Q564K4063j9173j5815k1572j1279L681o60p048J6061L3138
16317h87p399J6194o477j467n48q98n103o808m461j6840n351k812j2131o54j7769
16302g3411p94K9791m228R808J0955J5092j4877l1446O473J8785R669K6110J3506
16289A5433J75j4396l6558m255J3222j0232P80l219J3523J9212j1749l3619J7811
16276c3872J6594j1089k2567k0553J1522L3387L5257O970j0541j0367j3284m381
16264b2924j5062k3917R861Q529L3985K4913r1j4548L86q639J2478O160k498k1848
16250a3215J6737O104j5109k980o0j2169r667J2622J3102Q923K0410J6789k178
$$ y = [3301, 15049, 17274, -6986, -5739, -6024, -22681, -39097, -27555, -1770, 15226, -9283, -29332, -15538, -4983, -10847, -2283, 21780, 2607, -13208, -34780, -46059, -42378, -43038, -50086, -34025, -887, -8286, 7908, 1431, -36, -584, -1482, -6585, -13393, -17854, -34694, -40045, -42857, -54988, -55642, -73411, -74205, -44414, -48642, -38834, -27879, -12787, -27664, -59110, -52637, -33852, -24183, 1927, 15433, 15608, 1212, -35346, -39601, -26379, -36611, -35831, -39050, -25527, -6315, -18064, -51683, -33872, -17278, -28367, -50934, -71487, -59965, -26578, 8679, 15649, 5108, -5259, -18543, -22924, -37986, -61903, -52042, -43513, -9528, 15385, 15294, 746, 1132, -7507, 4971, 11131, 8633, -13215, 3522, 9626, -5483, -8463, -8523, -20692, -30359, -17737, -4635, 4288, 24698, 41487, 39309]
16237C9309k3366l5006j3968J4380O586J1003R283N175l7567k26P53q233j5031
16224d6908j474J2312M700J5716n288j4285J982J929Q583j7277L02o570j2260
16211e8538J4244l067K0247m924n483P827J5242O847R216N141r759j5154K0622
16198B461k0579j3104O761R898o348j9838K1115J4119k6703n928p678j3204m236
16185f3264L0057K7855j6617r317J5360O047j2636m238j0334o204j1894o839L1805
16172c0219O284J6812N93l1756j9820j887k565J5396J5105J0815l835J8644N983
16159d50j687n180j0317j7557q319k905K3381R763p481R161J2970P379L926l996
16145H688k3264o286n306r662J1032k109j7351Q998L4256k0385n727J5327J1284
$$ y = [39309, 15943, -19063, -33031, -18651, -12065, -1062, 8221, 13396, -24171, -24397, -23644, -31877, -46908, -48382, -36070, -31370, -15654, -20942, -35227, -33245, -31316, -22733, -40010, -39708, -46278, -58538, -44294, -47361, -27114, -32038, -37521, -29694, -14452, -7605, 1611, 6752, -3007, -18161, 2461, -18118, -31222, -24461, -14563, -20911, -40749, -19634, -5515, -32218, -38146, -45824, -59028, -63264, -33207, -5352, -21969, -31286, -15926, -9879, -22515, -26753, -37087, -43291, -55185, -62024, -30219, -23935, -7123, -6530, -38286, -58106, -59993, -62558, -47162, -32057, -21242, -25077, -6433, -450, -2137, -7317, -17634, -35191, -43510, -46415, -23034, -13271, -20752, -11591, 1379, 8758, 12684, 8688, -14576, -20862, -26168, -35830, -24798, -26907, -44258, -35260, -1004, -21389, -27116, -11789, -505]
16132e05n792k9472N142K169n069q981Q158L10K2432J1289j5867j9761m288J6995
16118b3240L1307p411o746j3076Q226J373J1298K0888P738j2173j1j2887k0527
16105a5241J2212N796l0848r731J5526Q528J9514j4707k1093J0888J1779N623
16093a754L563j0495K322r454Q390L1923j4729l0251j4859O766K0837J6934M70
16080I663l0752k4072o562L507J2881J4202k1152j1183P671R089M041J7059J3052
16067b556R291J0890N910j9475k5618N808l524J1865J3173l784q544j6615j982
16054b5161R914j0145K990J100q519J4425M552O474j7463j9196M784J2343N070
16041a8832j4190j7605J6741L175J0610j0918N217k942K313R793J5116N264l285
$$ y = [-505, -6297, -35769, -30627, -28458, -33527, -42508, -34350, -34040, -11608, -319, -16186, -35947, -40235, -23240, 8067, 656, -6090, -19166, -10940, -9567, 1731, 22619, 30357, 18184, 18173, 5286, -15241, -3029, 2767, -28081, -37812, -22286, -13758, 5756, -8951, -30044, -19156, -7377, -1754, 1809, -8686, -6364, -15818, -7428, 24495, 9766, -20485, -35344, -28578, -7741, 9193, 9663, -21089, -45161, -51723, -48216, -35335, -21133, -42285, -53468, -45797, -36708, -32667, -15608, -2556, 6735, 17625, 23535, 4060, -21558, -15750, -19274, -7409, 5764, 1980, -6564, -23179, -25161, -15247, -25392, -22402, -21302, -29821, -15396, -10844, -4370, -21833, -41029, -36245, -23902, -18832, -33022, -50627, -33886, -30711, -20101, -31019, -25802, -28744, -26431, -16638, -1522, 3742, 457]
16028D57K455j132R369q297m751l07J2537M458J1835m216r493n800J9067R32j5625
16013A1489j7546k1427R280K6719k990k9421j4053L558P927N061j2274J3491J5287
16000d899j7912K411J3949K628L547j3619j4640J7316L1091J8221k1932m1524
15988b5363j2594J8931J9569j3779j2390j6234L535O523R956k2540K2727M5994
15976B4335j745j1337j801j5872j2152k2662q643K831P306K7640R585q856J722
15963i649P110K2829j4415l1029k546Q711K1865J2682j9668R812J8973m705l007
15950A6963l641m170q59p974m43O297j2372K727R992l6501j3354J7920J4187J047
15936a0181j964N922j0001K5j2011l1617M262K5686L5171R44M84J6011l674j2112
$$ y = [457, 2912, 1780, 11149, 2852, -1899, -2206, 10331, 14789, 26624, 22408, 12915, 7115, 26182, 27114, 11489, -6057, -27484, -18204, 8515, 5525, -23896, -37949, -34391, -26464, -21403, -33677, -20186, -4899, -22811, -20400, -6451, -3823, -276, -13895, -28535, -11219, 19872, 38093, 16161, -25363, -37957, -19026, 543, -13236, -25626, -41860, -38325, -31802, -21846, -44386, -21659, 24335, 22590, 11253, 9452, -6420, -18572, -41234, -49877, -47046, -39740, -12100, -2515, -11371, -9649, -2539, 20290, 5875, -25154, -27700, -18989, 2876, 15558, -4110, 5702, 24675, 19970, 16963, 13322, 9152, 8293, 319, -124, 6173, -6199, -3472, 6520, -29981, -43335, -25415, -11228, -10181, -12145, -6223, -16224, -16199, -28210, -59827, -55565, -29879, 5292, 6236, 6720, 22731, 19057, 6945]
15922F945J055Q364O045j7036k3002J3470M3995r651l2649J2251Q871k257j4603
15909A798p600K555J2640j8217J1184J7849l163P92K308j0772j3962j3435q888
15896b6911j8795p723J0758m754M683J3803J3859k1752J8655K272j4280k5872
15884e6057K708O86m12L014L600j5462j0548J5022J9365L8300L300k105m404K0153
15870A7160q051j6015K539M896J5034J1444j3165j4185j7267j6978j2863p746
15858e5197J828R722K1886L962l736j2511m79M648j8124j824M763K0452K6256
15845A646j4591k3679K0933J1266k4989j8327j5194l631k639J4840N547O515K7542
15832a4761J0884L506l614J5417p836q12J7824j815L304O993K243j8254l0244
$$ y = [6945, 8000, 16364, 22409, 5373, -17629, -4159, 39836, 30185, -2464, 9787, 18658, 16401, 1798, -5802, -3247, 9393, -8824, 2360, 20209, 17046, 17838, 20146, 9374, -4588, -18023, -26911, -45706, -53429, -42671, -47425, -42742, -28939, -15080, -36832, -18177, -15905, -30185, -56057, -53349, -52663, -53075, -50061, -46461, -61923, -72471, -57449, -38084, 216, 3516, 1411, -2993, 17160, 9109, -6906, -4367, 529, 15563, 27007, 13842, -343, -17610, -34588, -47451, -55197, -53369, -43647, -21761, -17799, -21535, -34046, -34525, -29877, -48001, -49825, -45062, -24610, 1646, -12945, -36624, -15691, -4425, -29414, -47741, -62935, -66566, -69205, -54365, -48818, -42303, -14761, -3877, -371, -3985, 11432, 3596, 2784, 20608, 18793, 22097, 29090, 31333, 13079, -17165]
15819a7165j108O080j4903Q515J197J2472Q974N594l9565L581j560J8246L2198
15806B2556M970k5107m1009k945K717Q32M783M7952j7533l4425j8567j694j8528
15793g5998K1271J5097N737K540K1694k6722j3729R675J8181J7284N008r767K807
15780f922l915m217R684m858j2366K174J291p097j5019j874J7318j1450P707K2689
15766f855K1244k2162m1290J9889J7326J3475J8471K6714j6909j3117J2466n502
15754B3750k3446j0863r240j8102K0147O927q78N013j3876j916L3814l434k0030
15741a2134J3198m724k559J1j2390L132m904R189K0452n447k3349k852K4625J4830
15727A7078j7550k8331k356k240J5988J7701J2303l6629p697q507n34L3765Q133
$$ y = [-17165, -18273, -12193, -27096, -18581, -17384, -4912, 4062, 9656, -29909, -26328, -27888, -9642, 22556, 27526, 2419, -38590, -41535, -38818, -37986, -33203, 14749, -2784, -37209, -55776, -57470, -75998, -54727, -39630, -33893, -31353, -9659, -36381, -50110, -40435, -22254, -4970, 38, -9729, -6922, -10837, -15054, -5370, -10228, -22594, -20420, -19129, -26226, -41245, -43119, -25801, -37251, -29544, -6855, 14389, -7773, -49063, -29174, -11848, 1627, 20098, 46812, 29903, 16786, 29252, 23750, 304, -10559, -19799, -37901, -17754, -10827, -11705, -6692, -20568, -22484, 11330, 7896, -12134, 1064, -3660, -6219, -6208, -18598, -15466, -20370, -11181, 9271, 3824, -19525, -22377, 2248, 17078, -472, -28803, -31159, -33399, -17411, 290, 12593, -24036, -31733, -40240, -40774, -7009, 1124]
15714A124j5935k1565n162j225p087L7624O277k6699K3012M1937k779j2443j4233
15701B846K560N376J0122K204K132p126k1063k3611p137O188J9636r316q93l78
15687a8460K878j0131O384l928k885p68J8068J9946M710m364l1730l071J3211
15674a0140J5802J960Q600k716K138o575j0483j1915K813M941j885r93j5556K569
15660b1440l60J4552q972j2799o59k2313K3373J6984L910o16K937L089J9699l5916
15646a8531l2602L381R744J5944J6148L892J0068Q497m4030L00J5912J8470K3195
15633C0388n211j2822j9134j0086j401j5298J4720k387J2057L2965Q545J053k556
15620C0833l694j3678m033M190n096L273J2767k0935l4727J5430J0024j5499k663
$$ y = [1124, -14811, -36376, -41538, -42763, -49850, -12226, -5949, -32648, -9636, 32301, 29522, 17079, 2846, 5406, 10782, 20904, 23108, 25240, 18114, -2949, -26560, -33697, -27509, -7873, -17189, -18082, -18460, -15582, -25713, -19329, -23257, -26142, -26910, -8842, 11104, 15814, 11450, -20280, -23351, -10140, 5662, 7622, 16222, 13506, 15644, 9069, -1414, -13329, -10516, -5575, -7460, -8453, -24009, -21440, -21800, -7248, -16220, -29019, -29678, -51991, -28618, -11634, -7724, -8340, -5403, -2314, 17385, -18531, -51133, -47752, -38008, -22064, -5916, -2024, 8044, 16541, -27489, -27189, -11277, 7193, 30388, 25177, 12355, -6779, -16865, -18266, -33564, -18844, -21231, -9174, 23791, 32336, 33389, 30833, 27139, 13461, 9428, 13618, 8522, 11795, 24562, 3627, -31100, -15670, -5646, -21145, -23808]
15607b3808J2144J0106p201j2195J6005J1551j701m414M205J700K362J0222j6287
15594B689j0458n507J1404m738l5887K8L9157k141k2394m335L1047K0932K528
15581B2325m76l923n641j6910K6762K2579m167j6044j4637P496J8121P794j440
15568D1839K410j0112j7211m613K374j0245P491m525J2904N040k1908n094j7413
15555a9063j6342N59P536L2261K1445q317j1046J0910n565n31k647J2369P858
15542B9427p442k0614k0040j1240j6878J0134K858j4205K1979J5610J465j4940
15530b3886J6284L7839k304l2036n039L4992L840Q992J9477m155k8595j1108k4771
15517a0470L039O144L748L3o24N013L723K1373J682j925M485K1982L916k6773
$$ y = [-23808, -11664, -1558, -8759, -20954, -4949, 6602, 4901, 487, 4692, 6392, 8754, 18976, 2689, -7769, -13276, -1872, -6610, -42497, -42469, -3312, -5453, -27847, -32182, -1135, 19797, 22325, 21849, 17926, 12285, -4625, 22137, 44716, 40549, 24505, 9868, 17364, 35485, 43279, 41839, 44249, 34137, 16926, 12313, 14687, 4442, 11933, 7408, 20312, 25352, 3444, -1650, -19063, -35405, -34846, -27310, 4951, 26396, 18079, 7033, 17943, 12378, 11847, 9200, 21569, 29427, 21985, 1371, -18669, -29909, -46787, -36653, -33795, -48000, -26021, -10411, -8946, -23886, -7602, 30237, 27933, -4103, -9142, 25850, 29690, 38682, 58159, 54004, 25409, 14301, -10470, -7431, -1287, 2461, 2494, 1870, 6883, 10606, 31979, 33661, 31736, 36221, 58203, 62119, 35346]
15503C5346n620l486k1806p334j0708O610M2057K3062m651k4357j2085j6928J439
15490A539l475j3384L192m092L0268R031r440j617M368o87k3194k8743j3841J4463
15476c5612l100j3304r205R752L736K0927J9976P5O770l32P340K2367r750j8063
15462A577l302R110J6030M277k576j8304j6790k2205m5005j5998L4974M6625J6460
15449D873r516j1905J2306J3318R476L900j9202j2262j6693N009J0730k172m295
15436a6433M64j6276J0518K1922J3284K4013q039m4667J2J0102J1815J3400j7372
15423B743k3239j3612p188J4481K223l848P315J3542l045m169R841p553k312O443
15409h378j590J0071j779K0600J1489r37j6986r240j5412J8787J6100j4264j2810
$$ y = [35346, 29726, 26240, 4434, -2900, -13608, -6998, 35059, 58121, 53470, 29113, 17028, 100, 1539, -1936, -15320, -12128, -16220, 14048, 23079, 13639, 12022, 16390, 15703, -7491, -36234, -50075, -35612, -38712, -52016, -61221, -51469, -47733, -26806, -6830, -6755, 15, -317, 7023, 29390, 19640, 1577, -1725, 7385, 23415, 27692, 25116, 6812, -9978, -32183, -77188, -93186, -58212, -11587, 4873, -4643, -16548, -4242, 9076, 18552, 22452, 3250, -9012, -25705, -20696, -9966, -12138, -16433, -15969, -32245, -21727, 195, 13479, 37492, 29453, -15214, -15202, -5100, 6715, 20115, 2743, -20496, -34108, -41296, -26815, -24592, -28440, -21125, -7583, -10628, -14797, -4956, -12509, -14821, -8378, -9968, 103, -1676, 18924, 30413, 29476, 12490, 3250, -12162, 6625, 22725, 8461, -4349]
15396d349J1738K3106j3268j8362O606j094Q424K1055j4252m385n317J6271J529
15383B7702l3397n546J6035K2852o178K357K3573J6804m030j7234k6958n990Q491
15370A8481Q787j4783N62N800L094k265k4370J7919q386j072P596J9555N6j0576
15356B0398n437l7826K528K2439J2074k0543o933k9749j5423J423K0437K1498
15344a5114L369n990J0865Q224K3278K2962j3585k0751j463P115p737j5254O933
15331B852J502j7742L1497K8114r485j3118m190l941j2384j9815P332K7787K4073
15318D2482j2590j8750n158J5831m777j5843p49j3174J92P494K764R979N70M4
15304H315o845O781J6907P479j0042K985k0978j6255K3748L3283k211l6416j8696
$$ y = [-4349, 7389, 30495, 17227, -1135, 5471, 4377, 12801, 33856, 19604, 15219, 9902, 26173, 27702, -5695, -11241, 4794, 27646, 21468, 23825, 47398, 64202, 60172, 42938, 15980, 9990, 18481, 27268, 12485, 13047, 18847, 21941, 19676, -4694, 13225, 4839, 3767, 11363, 30918, 30974, 20398, 14961, -22865, -20337, 2102, 14176, -6367, -13300, -43049, -58472, -57049, -36612, -15114, -11745, -17735, -6870, 1354, 24632, 47594, 34009, 13258, 11795, 18910, 11173, -4081, 2852, 4354, -13388, 18109, 46223, 36738, 23620, 19430, 15489, 3105, -16710, -9378, 18409, 42482, 29892, 11142, 5984, 21815, 17038, 1195, 446, -12728, -12536, -5042, -2278, 7701, 8271, 8315, 1470, 8251, 25158, 32637, 22595, 25580, 4602, -11653, 12095, 45378, 43167, 6751, -11945]
15291a1945j6933j0629L1267L3469j077J64P218q600M185J8682k493l2346k4739
15278a3777j6355j0800P305Q305J3392J0870o458J7662p97j4430r307R250K4728
15265A9588J561m165q690n183L6752J9431k3688k2932k3478l447R770r99m006
15252i486J4913m162k0451q673N810K4044J7806J0736o843k228q417k8091m01
15239a5443L1102R962P940j0891k10l850Q725M00j0226j2507m491n450o749J4554
15225B866L3095r862k5049R431l104j5995j6174R716R870L6213Q716J102k4234
15212A6591k2212R034J2801k5992k5331k3895p416o822K3584K9853N421Q778Q416
15199B810k843l816J3480P885p955r158o308L5928k1266m741k509J836J5122K0309
$$ y = [-11945, -28878, -39507, -8240, 25229, 24152, 24316, 31534, 22934, 27119, 45801, 43308, 10962, -13777, -30132, -40932, -33627, -25322, -11930, -1060, -7518, 10144, 9347, -5083, -14390, -5140, 19588, 21149, 16984, 8294, 3111, 39863, 59294, 35606, 12674, -10804, -14251, -4481, -5480, -9486, 5427, 1265, -19186, -27859, -22049, 1995, 19801, 30537, 23694, 21466, 13049, -15042, -15443, 15659, 25621, 33561, 22670, 22460, 18610, 27335, 27735, 17509, 5002, 511, -4939, -11688, 2866, 35961, 26099, 1050, 10481, 7377, -8618, -24792, -15076, -5206, 31007, 39723, 40825, 16591, -5621, 3413, 16214, -9778, -35109, -59004, -66420, -73242, -49658, -19805, -14384, -5606, 2810, -33, -3849, 9631, 17516, 9561, 403, -5905, 30023, 8757, 4016, 1507, 3343, 18465, 38774]
15185C8774L729l0284n269j7483j9278K6521J6942j9248j1189r719q480N48j5834
15172e0270J7260K5450N123O396j3107J1159j100k106R531n227q896r017K0300
15159E496K0224O120j5756j9499j7222k4224J1810K2224j4407r549k580m497j1274
15146e3134J7187N733m123J1641Q858p807R635J8887J3852k867J95r042K1279
15133C0294j023j010k2657J137N898K295M459m149K6710R355j9574p251N932J449
15119C1865j6343k7544m410J3244j604k4569J2392J48M855k656J8625m558m74
15106a029J381J3197k7131k6376J9995J4034j2705N897k656k5249Q044K4507J621
15093f470r268P696O218j3608r983M187j0853j4330L115K3855R344l463j329L3144
$$ y = [38774, 42503, 12219, 6950, -10533, -29811, -3290, 13652, -5596, -16785, -26504, -34984, -34436, -50270, -33010, -7560, -2437, 3959, -9148, 2011, 911, -1195, 8336, 3109, -5787, -14804, 5496, 25720, 31840, 16084, -3415, -20637, -44861, -33051, -10827, -25234, -34783, -37363, -41860, -53134, -35947, -30214, -34337, -22696, -13838, -21645, -12010, 6877, 20729, 17862, 18057, 9015, 30294, 29271, 28261, 5604, 6741, 12639, 14934, 19393, 15244, 41954, 51309, 31735, 24484, 30416, 31865, 15522, -12022, -16432, -3188, -4792, -29361, -16969, -16821, -11966, -14622, 4003, -555, -1029, 352, 13549, -13582, -39958, -19963, -5929, -18634, -12737, -15393, -40642, -32598, -8091, -6470, -15738, -8042, -1824, -15432, -25415, -21228, -32081, -46411, -43296, -19441, -10097, -13560, -14889, 18255]
15079A8255m210J80L1632M154k526J2893j5879j8271j6616l3881j9094K7652K0111
15066D400m160j8234J6609R796j4098L43n554n03J4522K560J2994j494j3337j4601
15052a0757R89r840J385M842J7242K3130K24j6433r286L5255o141k6424j1804
15039g618J071J4243j2468K043m21K3273K4625p158k420j48p684o677J9811J77
15025D0649j0473q296l2030j4483K0591L5926Q925k809j0692k0184r822J1171
15013H473J2190k9j8895j8346m244J2799L6843Q062l0574l2205l367n663K8973
15000e983L2440k1656r668J1669K1102R903k6418j1142K736k867J263P491m699
14987D171J4248K1396O861j7100k0584L76K785K0830j8766j0864k5074j6025J0989
$$ y = [18255, 14045, 14225, 45857, 50011, 47485, 60378, 44499, 26228, 9612, -24269, -43363, -15711, 4400, 240, -17994, -1385, 8411, -5687, -5344, -10898, -11401, 3121, 5681, 18675, 17181, 3844, -10757, -9768, -19608, -18223, -13381, 3861, 26991, 27215, 10782, 1496, 36751, 30610, 4186, -7618, -6547, 7696, -4772, -2729, -3150, 20123, 44748, 37590, 35170, 35022, 27338, 20661, 40472, 40649, 30176, 21880, -10150, -24633, -4042, 31884, 40809, 38000, 27308, 7124, -2698, 8473, 20663, 20634, 1739, -16607, -20851, -8052, 28791, 36853, 6279, -25926, -29293, -34956, -5983, 26457, 4801, -4867, 6802, 27904, 37807, 11389, 247, 2983, 116, 1379, 8870, 4171, 18419, 39815, 46676, 29576, 8992, 9368, 12153, 32983, 14217, 3353, -21721, -37746, -26757]
14974b6757m994n544j5962J8604P297J0757m46J2032J0725J3446M547p974j8012
14961b281k437r342j3750j6515M74K1859N32j0870N960K758R469j2423j4399J1284
14947b9681m827O494n36J897K0031m562p859J1881K412J2711K719j9103o815J0430
14933d808P441M22q658k1030p504n43O198L1196L9881K3893J1829k6709n2099
14920d91j3410O492J7151q299N249q21j4547j222o474J3030J6842P565j6737J0553
14906A4881n280L512j9194o729P777Q879J1678R482J803P705Q000O105k4108o580
14892A7931J2754j1329q21P118k0290j7339p780L5020K9785j1114L898J3909P53
14879E2495p1r447q650R950j7919j3265J0268j4390j7352K855K1299j7113O048
$$ y = [-26757, -31751, -37295, -53257, -34653, -27356, -16599, -17045, -5013, 5712, 19158, 23705, 15731, -2281, -4718, -14060, -27810, -44325, -43851, -21992, -21460, -32330, -26370, -23612, -14143, -26566, -40965, -29681, -34508, -28014, -28550, -26653, -6622, -11184, -19043, -7162, -4750, 7961, 10680, -8423, -15238, -4808, 2633, 3055, -5603, -26633, -34137, -34680, -28482, 2714, 42595, 66488, 78317, 51608, -491, -13901, -7409, 9742, 1443, 6692, 5871, -8676, -9898, -16372, -3342, 13500, 21065, 4328, 14881, 9601, 13113, -6081, -12810, -5033, 3846, 15524, 25006, 26809, 34514, 42514, 48619, 24511, 17931, 30685, 19356, 18535, 25653, 5363, -11976, -19756, 15264, 45049, 33935, 37833, 51742, 52495, 52424, 42977, 34327, 44277, 26358, 13093, 23361, 8971, -8381, -5526, 15773, -1340, 4708]
14866D708j052j1006N095M931j247P949j361O598K5453J2850r812j61j493j3659
14852B7793J2077r113k5354j3791J1162O020K8338J0718l3702R49k10j6388J0236
14839H735J1626Q475R64p275K2232L4900r720j6442o268L764j9636k710J3611
14826D2256o746j8123j0817r391L425M59l391J643j0137j7880J2091N296R793
14813a522K944K2707R179j8562o788Q10k833j1000J223r897m267n878J5043j5270
14799b4111J1504L0965J1401M474j4828j7939j2109j0328j4130M546K8603K4739
14787B2787J5726l263j6407J942K268j7143k0043N173k821m888j878R764J0366
14774A583K0429L5603o707m6243o737J0157M675R974L705j519l801j7411j3050
$$ y = [4708, 3656, -7350, -2255, 2676, 1429, 9378, 8017, 14615, 40068, 52918, 43106, 42945, 41452, 27793, 39870, 30757, 5403, -8388, 2774, 8794, 37132, 47850, 14148, 15097, 14887, -1501, 8735, 20361, 28836, 29800, 22525, 44757, 79657, 69937, 53495, 47227, 50991, 31355, 28645, 42256, 35510, 17387, 6570, -2821, 604, 1063, -2328, -685, -10822, -28702, -16611, -11315, -1522, 1422, 24129, 33308, 14746, 7958, 8768, 5935, -5065, -3842, -13739, -18006, -23884, -8841, -24111, -12607, 18358, 29759, 34233, 19405, 1466, -10643, -20971, -35101, -30555, -1952, 22787, 38513, 35250, 18843, 20785, 23053, 5910, -14133, -8960, -11781, -16669, -18547, -8783, 1583, 22012, 57615, 50908, 4665, -2072, 8085, 12760, 22734, 26439, 24920, 21119, 3708, -9342]
14761i342l799L621j4608K0395P54j4452J4397J5736l769Q926J5963K0124j6204
14748C7742j8676O464k0188j937j6582J0320K1714J5671L9253m33l3109l4861
14736E378K237Q155Q758p993J2320N071P284o487j5086j2427l813P145K741K4227
14722C7510m43k4462j2633L1694L1622j7836k2379k5096K0296J053j4017J3381
14710A8690p223J337K0582J4367k164n338M960K0462k1899k3801K7394r015r741
14697B8611k534j553K78O045J2431j2964r433K7665J8387k568m444m302j6762
14684C8857J2164J6426p634j6733J20j2737j0320j0855j235K0377P48j226n421
14671B2531p599p855k4448r176R05j985L0787J3067K908q943J0271q498L694K7280
$$ y = [-9342, -13141, -9520, -24128, -3733, -2979, -17431, -3034, 12702, 8933, 17859, 33822, 53946, 37742, 19066, 25530, 5342, 3405, -13177, -2857, 18857, 34528, 73781, 73348, 40239, 5378, 7615, 15770, 24528, 16535, 28855, 33926, 41210, 34723, 19637, 7210, 3397, 10542, 13283, 37510, 37067, 12605, -28, 31666, 63288, 45452, 23073, -2023, 18273, 19326, 5309, 18690, 11467, 12804, 33386, 47753, 45589, 40251, 45211, 65673, 43774, 19973, 47367, 38352, 28611, 26077, 24524, 24802, 30847, 43278, 30314, 20881, 48546, 66933, 64365, 59921, 55619, 38857, 51021, 67447, 59813, 43080, 43200, 30463, 20143, 9288, 8053, 28430, 29178, 27952, 22531, 14932, 7077, -17371, -26547, -25642, -27627, 3160, 16227, 19135, 10192, 20463, 11965, 15659, 42939]
14657D2939q647j4126K0874J0352n764j3250L42j5055j2186m776Q473j2631q638
14644a2093P818o474J7018J8877R833q099Q88q5k793O748K3015k6737j6808R935
14630B1043Q308J0919o916l910R724K9847j8163k7825o942O566P789J7614m205
14617D3849k1482J2144r157o224L119J9124P237j1579k1995k0876J2185l869j2847
14604a0371j5063K3253J9527R057K8593l0j2118k0970j1763m963j8929j3876K0753
14591f900J1005j4807J8469K5031N073p564j4199L515J2716J6419Q600l738o087
14578D7533l2026k1982K891R231R468J0307Q438r328n804j7913j9744J8320K6234
14565B5625m81K6172N049j8487k720l637j0864P55j8793j2094K5977j2217L460
$$ y = [42939, 34292, 20166, 41040, 51392, 45628, 32378, 32720, 17665, 5479, 703, 9176, -3455, -12093, -4275, -10749, 6269, 25146, 34979, 26880, 27768, 27683, 24890, 31638, 54653, 27916, 11108, 21043, 29351, 40270, 33354, 29444, 39168, 69015, 50852, 23027, 16085, 22651, 30440, 48054, 43849, 22367, 34511, 25354, 19130, 22249, 41373, 48610, 37031, 15036, -5840, 6345, 2476, -10371, -25434, -2181, 17346, 26403, 54996, 54966, 42848, 21878, 10115, 5152, -13777, -27653, -6900, 4105, -10702, 7767, 32798, 37871, 30307, 16108, 19623, 32339, 48758, 57358, 53620, 47533, 15507, -6475, -3584, 5647, 15115, 25422, 33860, 24532, 18728, 815, -18929, -609, 25625, 25144, 51316, 56365, 37878, 35158, 31521, 20657, 21412, 2619, -9475, 16502, 4285, 7745]
14552G745O578j8283k5738k808O133K7184J1138k159l876k1117o319J8240K6312
14539B3030P654k1711j9822J0726K2952M409k8908j9130k347J4129J5243j0097
14527c872R438N948k4420l179K7669J6839o400o49K337J5283L8213j8104j5792
14514D3311p055o511k8348o010Q371J0191J0178o184j1381o38J8158M626m605
14501B4103j0455O172J0014n099j5395l531j0669N644n180j3254l227j3250J0957
14488b3170K2551Q969k6427J9589L384R556J3917J9036j1608j3961M058j8523
14476G371j2857L707P997J1416J0513k2102r175j1109J1043K7164J828l093K18
14463B2921r346q904Q2J2288J0128j3385j5854K330o90J4896K4296L837j2932
$$ y = [7745, 14323, -3960, -29698, -32506, -26373, 811, 11949, 9790, 5914, -15203, -21522, -3282, 23030, 30684, 8973, -10849, -123, 22829, 27238, -1670, -20800, -23147, -9018, 6225, -3872, 5566, 11514, -12906, -16085, 11584, 28423, 22023, 21374, 23711, 38994, 77207, 59103, 43311, 36256, 29745, 1397, -4613, 3758, 13949, 24127, 17943, 6562, 5924, 24082, 28708, 24103, 13648, 19820, 29834, 24735, 9340, 5809, -4860, 784, -4396, -17650, -20877, -34127, -23170, -619, 8350, -18077, 1512, 4896, 14452, 28369, 47405, 35797, 21836, 25894, 7371, -5486, -1779, 6218, 17634, 28147, 6045, -3130, -14239, -3196, 23968, 25796, 22703, 22921, 13575, 4671, 4753, 17041, 27169, 13784, -2070, 260, -430, 14466, 38762, 42599, 29667]
14450B9667k930j5463j9957M6784J8190J1205k039r978K7047N786m1263l5443
14438A1606O406J0940K671k3368J3294j3302j055P546J8890P304q345K662k648
14425C2601P900M623J4385l097k2611m398O529r395o90L1537q843k6530j035l09
14411B0667K47j5788J2379N502K241j5699p622K8784j038j8161M963q893l466
14398D116n580J7590j471j4169l341J8975M317p682K2822J0311k2026j1361Q853
14385B1354K4046J1390J3325NR056J4056p838j1624m641k4458j9439K2137q88
14372D6481Q905o131r654q376J7785J7002j3866l726o205j3571R194j5530o294
14359A6014m470J2572J5853r692q550K1492j2877j866q780n525Q937N765K1501
$$ y = [29667, 26737, 11274, -8683, 38101, 56291, 67496, 65457, 55479, 82526, 88312, 47049, 11606, 18012, 28952, 31623, 8255, 21549, 8247, 7192, 14738, 33628, 40932, 32587, 35249, 32601, 40501, 45124, 59509, 56412, 33801, 29403, 35932, 26537, 25847, 57384, 48541, 22011, 20976, 20667, 20914, 5126, 17505, 23007, 25248, 9549, 1927, 30711, 29673, 11512, 16475, 7582, 4116, -1464, 16126, 14655, 486, -2855, 16120, 20437, 12755, 35577, 45888, 23862, 12501, 21354, 45400, 56790, 70115, 70120, 79176, 93232, 85394, 73770, 69129, 44671, 25232, 47369, 46481, 55386, 49255, 39601, 31225, 49010, 66012, 52146, 48420, 42215, 28644, 37838, 22308, 16014, 11544, 24116, 39969, 30277, 21727, 43219, 30342, 28476, 19696, 14171, 23108, 28873, 50374]
14346E0374J3781j9744k5493j8003J1649K1204l190m1029p439J9686J2997q758
14334F035N010K1179l265J71Q372O160j866m115k5612k2149Q271Q379K2054M251
14320C2875O870K9291n068m0768q836K143J6865M015j4780J1879J7887j0835k608
14307C8930R668j0908j1300M66R353J0198L2273l427j1150l2312r999K9726o651
14294D4867j5921q312J3442m543p985J2352J3127j4097r295p768N725J3724m652
14281C0664M747L018j1945J8436J964l6510k3872j382K1050J3705O854j6795J8188
14268B8122J1612M044J3454L2519l013p031P046j9776k7047r513K191R878l040
14255C9446j2902j08k2479J5631J7648k1422l169J8716R036j4958Q818L834j2227
$$ y = [50374, 64155, 44411, 18918, 915, 12564, 33768, 30578, -10451, -17890, 1796, 14793, 6035, 11045, 32224, 28959, 29130, 37502, 43662, 41796, 37681, 12069, -10080, -1809, 6570, 28624, 32875, 39745, 69036, 63968, 23200, 14364, 16507, 33372, 37387, 22607, 34486, 52373, 41538, 38930, 48598, 37690, 26390, 26856, 36209, 46407, 78680, 75253, 64103, 31791, 21792, 51518, 44867, 28946, 20634, 34076, 29533, 21548, 33900, 47027, 32930, 23635, 15867, 21592, 35316, 30664, 35411, 38429, 26484, 44920, 46884, 10374, -13498, -14880, 6170, 19875, 26729, 9934, 28122, 39734, 43778, 57232, 89751, 86738, 79707, 86753, 66977, 39930, 30417, 32608, 42486, 39446, 26544, 26436, 3957, 19588, 37236, 15814, 12645, 31361, 40397, 25439, 34257, 38091, 25864]
14242B5864m140J9245K848j2136j2958J562j5407J3881K6244J2906j4705j1643
14230C1561P199n996r031k4159k1249R461J3867k521N653O177n054Q333m88J7469
14216C1222K4248Q432L875l3791o629Q728K5850K4628Q985P364q025k5854j2583
14203E6450j1704k5856N296K1615J7665k432p336k5105r972L164M716J1544P761
14190D5806k5068k5873r032M3467J7995l824l724P67N762m165K4529K8876J0870
14177A06386r911j2486o941j5953j067l0930j724L574j0956q74O57k872p229r866
14163a92k627M118J5521k974J355j1220L762K7760Q446j3154j3964j799J6447
14150C1479J1329j2024P657n362r977k3831J2290L0822n240j9860j0621r555K656
$$ y = [25864, 21724, 40969, 43817, 31681, 18723, 20285, 4878, 18759, 45003, 57909, 43204, 31561, 38760, 32764, 23733, -426, -21675, -12214, 1653, -868, 4785, 10962, 5908, 14241, 13753, 31222, 55470, 63902, 67777, 33986, 27357, 36085, 61935, 86563, 95548, 102912, 94887, 69033, 56450, 44746, 18890, 24186, 45801, 63466, 61034, 53698, 28593, 18621, 21785, 26501, 38045, 45806, 20738, -5135, -14167, 29300, 47295, 43471, 39747, 40514, 46276, 42111, 66640, 95516, 106386, 96475, 83989, 77048, 61095, 60028, 29098, 27374, 30948, 19992, 19118, 19775, 16903, 9674, -192, -2819, 1299, 16820, 13846, 15201, 3981, 7743, 35503, 43949, 30795, 16831, 15032, 31479, 42808, 30784, 38441, 33079, 23102, -729, 11561, 42383, 37143, 17283, 6662, -2893, -237]
14137b37J1158l025J0371J011j0112J1889K0895p380m1396m376J0153J1129M763
14124A4843J1964n837J053j3406J1820K7011K353O592J2793K354P507k4194j8889
14111C5964L152N485K2793k025l439l486j3976N882K3311J2578k5093k0872J164
14098D1438J0644k685l192j2996J1807L2896j4062j9218j3814J258R701j4600
14086B7177N723j5870j668M564J4002q626j4188J8539K4179J5548j5227m1657
14074A2496o642J4330j2990j1021m807l236J4142J7667R187O160Q488l532J1496
14061E1738J2457j7489k1633p205k1839l790l018J312J8909J0393J99M622N672
14048C0328l874J0040R677l67k337j8169K1452J2303k1731J7363J7767k2469n845
$$ y = [-237, 10921, 7896, 18267, 19278, 9166, 21055, 41950, 34570, -6826, -11202, -1049, 10080, 14843, 26807, 20970, 22023, 8617, 20437, 47448, 49801, 56393, 69186, 71540, 79047, 54853, 35964, 39116, 44601, 67394, 65369, 61930, 58444, 44468, 50350, 73661, 86239, 61146, 40274, 41438, 52082, 49397, 46205, 33209, 45016, 77912, 63850, 44632, 30818, 32076, 41777, 27177, 32900, 17030, 15362, 19926, 33928, 25302, 11114, 29653, 53832, 69380, 54153, 12496, 5854, 20184, 7194, -3827, -8634, -11870, 2272, 19939, 29126, 35286, 43774, 40242, 51738, 64195, 46706, 25073, 17868, -3971, -7761, -10779, -9467, 9442, 19835, 20034, 24656, 30328, 26454, 36494, 46171, 45804, 43467, 25298, 46750, 59053, 37322, 54685, 72452, 49983, 44138]
14035D4138J4303j9196o83r236j3012k531L3088N600j6237j1884K990K132J4368
14022D3840k0274j7204R247K0280J4118j3750j7019r042P855p780j0195K247P891
14009A0214K5296N497j3304j0161K821P517o106J5022m6q357J5671K6115j948
13996F8231L008J45p707j5381J9971J0286N79J83n511j3386k6958k355L414j1066
13982B3453j152l032M955K2787P037k587o272J2955J1186p056m330l940j2699
13969D1305k2906j6119O969J8045p582Q402K4008r727J0677J0215q983j9914m200
13956C0190R024m618j0235p42j3219J3032M773K2930l552J134q204J1402j6933
13943C4982j9757R79O325J9398M015L058K6810j004J1848j5058n0153j7318J3267
$$ y = [44138, 58441, 39245, 38562, 29326, 16314, 13783, 46871, 52471, 36234, 24350, 27340, 29472, 43840, 23566, 6362, 15609, 35889, 50007, 36257, 19238, 10196, 18051, 10271, 76, 2323, 10214, 35510, 41007, 27703, 17542, 20363, 27880, 21774, 36796, 36750, 28393, 44064, 70179, 68231, 71239, 71384, 63677, 48296, 68267, 78553, 79132, 79315, 73804, 60418, 33460, 31105, 34519, 23453, 22301, 19269, 24224, 47011, 54048, 51461, 45189, 58144, 69330, 62274, 57944, 54004, 41305, 18399, 2280, 9249, 27294, 19712, 28114, 52122, 42395, 53072, 63287, 54304, 34390, 30190, 39214, 34596, 24361, 23619, 10400, 23432, 28205, 51135, 47583, 48717, 40513, 51915, 34982, 15225, 16204, 22529, 41927, 45942, 49000, 75810, 74806, 86654, 71596, 21443, 4125, 17392]
13930A7392J8994j2145k1636J2084J5875r656k0910N371P474L678J1694O555j4005
13917B0765k7769L681R225N57k221J0981O655j7759k3015J3775J0933R467L1906
13904D7181j6048o933R196n096l499J2465j5692l545q871m826K0164K5561j2050
13891C8007J7479k797L941j1239K591m280m364J1567L3094o506j0171j4444j1228
13878D1650j3510J0742J5169M903O353m023l182j4251j4056j1675J3723J6951
13866D8794j5937K0719L070n253P725m6q204J7102O920j5654p306j3161M565K0647
13852F3981j2264j7287j2011j5489l047J4804J0009j6258J4746K4136J7200j3862
13840E4658k1345j2622P540j0781K82K380R620J5525K0482O29m006j1850r430
$$ y = [17392, 36386, 24241, 2605, 14689, 30564, 20908, -2, 5369, 12843, 16521, 28215, 34770, 20765, -7004, -3323, 5902, 6459, 4238, 15219, 21874, 4115, -18900, -5125, 5808, 15275, 47181, 31133, 24200, 33396, 28300, 24801, 37266, 21574, 18029, 9158, 4332, 24496, 50057, 38007, 55486, 52689, 56630, 45391, 47982, 43702, 39338, 50905, 83999, 77493, 67322, 52878, 41650, 28140, 38882, 54051, 58954, 65307, 61284, 58102, 43851, 29795, 18120, 31843, 48794, 32857, 53576, 56646, 51393, 59118, 59072, 50868, 67970, 74890, 59236, 51930, 38769, 43334, 63981, 51717, 34430, 22419, 6930, 3883, 18687, 28696, 12438, 27184, 51320, 68520, 54658, 33313, 20691, 28231, 17450, 17732, 20112, 29732, 45257, 65739, 66368, 62362, 50512, 41082]
13827D1082r214J3409l927K986J2535Q439n790L300o785K016l0458k629N463J2280
13813D2707r821P152j1155J3272r838j1970j3430J964R128K7740O915N330O299
13800F4293Q749j7444l700O819k045j5310p148l608R605R059J5159j3962j4480
13787C5987O355O478j0129O328J1659L147q448j505L606N26N22o633Q511q151
13773D8253N490K748r384J8330p271J0059K105o919q662q000k472P618K5546j3416
13759F4025l2124l7330p460J1967K1484j9269j6774J1051L3078K4046j4325p874
13747C0495J656j5889o599K1024Q728J454j3723j6097J2233R224n770P264N882
13734C9882n285r485j262R402k992j455n484K0638J4964j3884k3078R697n250
$$ y = [41082, 31868, 45277, 41350, 44336, 56871, 65310, 59520, 62820, 56035, 58051, 27593, 24964, 30427, 42707, 32886, 40038, 28883, 42155, 32317, 20347, 6917, 8881, 18009, 45749, 52664, 57994, 64293, 73042, 55598, 51898, 58717, 56672, 41362, 34214, 30606, 40211, 49270, 64429, 50467, 35987, 42342, 48820, 38691, 45019, 56678, 59825, 51377, 49872, 53478, 54004, 54526, 47893, 56404, 48253, 53743, 56491, 47107, 65437, 58166, 68225, 70330, 63411, 54749, 46749, 44277, 51895, 77441, 64025, 31901, -5429, -12889, -922, 20562, 1293, -15481, -4430, 28648, 52694, 38369, 30495, 32151, 16262, 9663, 30687, 39415, 40869, 27146, 11049, 23282, 32506, 26736, 34000, 39882, 34597, 25112, 23850, 33252, 30260, 28805, 23321, 43959, 58923, 45039, 21961, 31658, 26408]
13721B6408l228O212R390J7846K171r523K1604j66k1j299K053m642j9065n642
13707D2098K888J08p251N948L608j8064J4315J2379m291N327J5681r039k4216
13694C9491j2828L0050P420O875J0728j0207j0737k4263K074J9436K737J2081
13682G2857k223J0423J9197r096m2088k243r778q556Q162J1759j0657r765j8815
13669I177L8195K7052l231j681o028J1693k1406m9018L031L4904M866r406r375
13656B8773p039K4864R569l627r119k2620K6150M5950K332q295J9036J4433O143
13643A26550j4347r461l62k5124r827L445j0597k294Q46R120N228J5363n869n984
13629G6687j1347j6909j0832J349r316K380J7732m690K003p70P621P826m648m500
$$ y = [26408, 23180, 29392, 38782, 56628, 58799, 49276, 70880, 70714, 70693, 69394, 71447, 66805, 47740, 42098, 44986, 45094, 37843, 43791, 47399, 29335, 43650, 56029, 51738, 57065, 72746, 63707, 39491, 26663, 56713, 64133, 71008, 81736, 71529, 60792, 36529, 38603, 58039, 60776, 72857, 70634, 81057, 100254, 91158, 49070, 46827, 37049, 28493, 36655, 48414, 37757, 27992, 9177, 47372, 74424, 71193, 69512, 63484, 75177, 53771, 4753, 7784, 42688, 47554, 38148, 28773, 21734, 46598, 56167, 52540, 43421, 20801, 46951, 92901, 95233, 86938, 105974, 120407, 126550, 112203, 102742, 102380, 77256, 67429, 70874, 60277, 57983, 58829, 67949, 73177, 88540, 82671, 76687, 65340, 48431, 37599, 38948, 29632, 32012, 49744, 45054, 47057, 46287, 53908, 61734, 57086, 52586]
13615E2586J2569K5593L2574j8328k0650p045o556O848L74j980j2840j539j4973
13602D6633j5516M148L3903M0240J8437l2643n652m796J3695N064M519J732k836
13589A06928j9338k3975m472L46k4973j0476M15o991Q298J7867J0852q92J0487
13576F4076O145L744k420Q444k289Q506J0464j358n39l538J4921k1584k0063M100
13562F8609j5695p55K2735J4536k0280K911P178J894k873K0327p864j0611J3802
13549I3914J411j5254j6615j6881r806J6377R327M120j1456R189K6337j3693n588
13536G1382R247j0078j1898j388n255o884J0617J4320k1515j4773n525J1269J6139
13523E5658p533R797M688J9276r912l7747k5760J1046J7783J3729N370j1210j3828
$$ y = [52586, 65155, 90748, 123322, 104994, 84344, 77299, 70743, 77591, 77965, 75985, 63145, 61606, 46633, 31117, 35265, 69168, 109408, 127845, 95202, 89550, 84754, 98449, 103513, 108032, 109764, 106928, 87590, 63615, 59143, 59489, 34516, 24040, 24455, 17464, 25762, 43629, 54481, 53589, 64076, 70221, 73965, 71545, 79989, 77700, 86206, 96670, 95312, 94773, 91235, 106156, 84572, 64509, 68609, 52914, 52159, 74894, 89430, 69150, 72061, 79239, 81133, 78260, 98587, 90723, 80112, 93914, 95325, 80071, 63456, 46575, 36769, 53146, 62473, 66593, 55137, 64326, 90663, 76970, 71382, 80629, 70551, 58653, 57265, 52010, 45126, 55743, 70063, 48548, 33775, 28250, 39519, 55658, 48125, 57922, 62610, 81886, 71974, 34227, 8467, 19513, 37296, 51025, 56395, 45185, 31357]
13510C1357Q942K3432Q067n455p647J5002K943j6419j5244K7901J6921j081j0324
13497G8395k6040q008Q193J2644J9880o939k2579j729J3305J8794R108r201j7357
13484F8466K0581K0165p871J9647K0795J932j5692l8084l7467L296J2502K682
13472G0952p411j5079p223N50J7460K2893j2338N723K0303J1424K4652q465j7911
13459A05530l966j5558k401m018N882M235j1035l0156k3272j925J4775k949o838
13446B8304J9588L3276K929k9856p407j2205J5918R21J1877R494J729j6295j9829
13433C8444J8105J3756k3143k92R869J5242k444j5477O371L911k050l713K580
13420F1159j372R831J2920N479J3835j2006k3938R640O077j5909J2505j704r880
$$ y = [31357, 40299, 63731, 71798, 66343, 58696, 73698, 76641, 60222, 44978, 72879, 89800, 88719, 78395, 52355, 44347, 52540, 65184, 85064, 78125, 55546, 53817, 67122, 85916, 95024, 85823, 68466, 89047, 109212, 101341, 120988, 141783, 143715, 128023, 89939, 52472, 55768, 68270, 70952, 63541, 48462, 41239, 41789, 59249, 82142, 69804, 75527, 95830, 107254, 131906, 123441, 105530, 101564, 86006, 83605, 79587, 85469, 89704, 78669, 48513, 25241, 23316, 38091, 35142, 28304, 47892, 81168, 84097, 54241, 46834, 34629, 50547, 51468, 63345, 72839, 74568, 58273, 38444, 56549, 70305, 47162, 46870, 56739, 71981, 69537, 54060, 60431, 64342, 62292, 58579, 61159, 59787, 69618, 82538, 88017, 101852, 89846, 65908, 75548, 81625, 65716, 78221, 76517, 66637]
13407F6637J2339k994l621J6034m296k1186j0010O146J6541p85Q177J3826m983
13394I1825P025M473l299o38k6247j4015J6163P781N108k44P576J0748j6752n1897
13380C7607k8747J0559M0688K6630J7974p597j5034j003q073J3138K0880j0238
13368I6784K676j5087l4636R354L291Q358K0935J7285k676j1518j816m332j7374
13355G1244o891R831k362l709o632q361q267k27K7702J1667M867J6885j45l5016
13341G0586J4670L6257J4895k7657k492j2880l0222M973l527L221R034L040k413
13328G7485m869j088J0316n701J6427K0210k381l1513n095J5175K0420j596l4186
13315G3604k4957R809J7756L0649K0334q086j1737j4840m747p043J3406K0874
$$ y = [66637, 78976, 75982, 72361, 88395, 84099, 62913, 52903, 59049, 75590, 74805, 82982, 96808, 91825, 98850, 103323, 100024, 99386, 73139, 59124, 75287, 83068, 88176, 87932, 95508, 106256, 89504, 37607, 8860, 19419, 60107, 86737, 104711, 97114, 82080, 81077, 73004, 86142, 107022, 96784, 99460, 84373, 49737, 59091, 62382, 70740, 91675, 108960, 106284, 94766, 92950, 88618, 71244, 64353, 74184, 71822, 68113, 61481, 53120, 44853, 44626, 72328, 83995, 88862, 105747, 105602, 70586, 85256, 121513, 136408, 108751, 106259, 93379, 63157, 68130, 64603, 67824, 76858, 79898, 77485, 72616, 71528, 81844, 76143, 92570, 112780, 110399, 78886, 73791, 88966, 109386, 107790, 73604, 48647, 58456, 76212, 106861, 127195, 119109, 107372, 92532, 87785, 80742, 94148, 115022]
13303A15022J6391j230N616k5082Q614j5598J4778J7435k063r395R818J1472j7087
13290A28691J7436m924k6242m570K109j103K054j0310n76R447P930J7236K5062
13277A62240N024M982O419j453P627L4740O848P529K634m3513l9529j0556j3823
13264A29169r676P835R881j4133j8577J9663J7222l324n045o762k0980m65J2152
13251A16960k5033p054L1008M362l913k1046j8026K0218q866j3750N775p204j0380
13238F3051J2633r107P457K3430J2763K487j2402P752K3425l54k9779k2114j404
13225G7838j3430j1015K3976L6095n423k1374o544m534j1524j3942K368K3769
13213G6260L0868J4830L165j0667l947M800J0357J4636k0248k4972Q531J2661
$$ y = [115022, 131413, 130183, 135799, 110717, 119331, 103733, 118511, 135946, 133883, 124488, 134306, 145778, 128691, 146127, 141203, 114961, 110391, 112500, 111397, 113451, 103141, 102565, 112012, 119942, 137178, 162240, 167264, 172246, 178665, 177212, 184839, 219579, 226427, 233956, 236590, 193077, 153548, 142992, 129169, 119493, 127328, 137209, 123076, 104499, 124162, 141384, 138060, 133015, 126253, 105273, 104808, 116960, 91927, 84873, 115881, 120243, 116330, 95284, 77258, 97476, 88610, 74860, 80635, 73431, 63051, 75684, 66577, 74034, 97464, 110227, 112714, 100312, 108064, 131489, 131135, 101356, 79242, 77838, 64408, 53393, 77369, 113464, 108041, 86667, 80123, 75589, 64065, 50123, 52491, 76260, 107128, 121958, 125123, 114456, 110509, 115309, 125666, 140302, 120054, 95082, 103613, 116274]
13201A16274L0557L8972R513j3283j8504j2619j3259j8241J0475j889k970j1763
13189A13263O045N265o298Q808O32K3137L3743Q853j7763k7220m614j2624K431
13176A33658J0786m069N418J8960o608l824n590M596R293m623m2273L143p02n041
13162A13124J0605o160j1415o233j6262K0582k15r929r109J2240L3476O879J967
13149A39550Q23l1369l074O253j1036q611r63n841K2980K2639J3087J365j0942
13136A34861K224j3453q39j8716M756o935M216O960L841Q378p202j2352j2537
13123I3202L2658N417p71j2119j3734J4155K8221J4356K4183p017j7503o162J3557
13110A68443j2370l5300k1069N61K5690J4374J2823r426j3669j0127k771J1629
$$ y = [116274, 146831, 185803, 195316, 182033, 163529, 150910, 137651, 119410, 129885, 127996, 125026, 113263, 119308, 124573, 118275, 127083, 127715, 150852, 184595, 193448, 175685, 148465, 143851, 131227, 133658, 144444, 140375, 145793, 164753, 158145, 154321, 148731, 153327, 162620, 157997, 115724, 118867, 118165, 113124, 123729, 117569, 106154, 99921, 83659, 104241, 104026, 94097, 84988, 97228, 130704, 137583, 139550, 140373, 109004, 105930, 112183, 101147, 92536, 91573, 85732, 108712, 131351, 144438, 145803, 134861, 137085, 123632, 122793, 104077, 108833, 101898, 106114, 113074, 116915, 125293, 118091, 105739, 93202, 125860, 131277, 130506, 118387, 104653, 118808, 147029, 161385, 185568, 178551, 161048, 154886, 168443, 156073, 120773, 99704, 100265, 125955, 140329, 153152, 143726, 130057, 119930, 117159, 128788]
13098A28788J3318p36j2476j3233J0450l394j7249K0118J6315r47K898p707J7809
13085A53954L3061k156k8249k0689J4695J3956j7868j9762K4252J5557j5011P68
13073A52508J0150r462k578m169k294j0432j1575j9062r442J3483J3018J4625
13061A34770K6529J313j2935L1055K7958J7155l2603l9827p626j82J5056J1466
13049A72129m368L068j3867k8742P752K0626Q342j2016k029L394R067J4685j126
13036A76915k1304q24j102L4300K8493r244l2733o478j5650k0087J4871K2075
13024A69232Q428L999J420J0049J3448K969R419k210k083n542j3405k6608l1420
13011A37696O375J7374J2455k5n240l594P105Q617j0621k913K9302J4265j4714
$$ y = [128788, 142106, 141370, 128894, 115661, 126111, 122717, 105468, 125586, 141901, 140954, 143852, 136145, 153954, 187015, 184859, 156610, 135921, 150616, 164572, 146704, 126942, 151194, 166751, 151740, 152508, 162658, 153196, 150618, 146449, 144155, 133723, 122148, 103086, 93644, 107127, 120145, 134770, 161299, 162612, 149677, 180732, 208690, 225845, 193242, 153415, 145789, 145607, 160663, 172129, 167761, 170829, 156962, 128220, 135972, 156598, 164940, 152924, 150895, 154289, 163356, 178041, 176915, 155611, 154787, 153685, 187985, 216478, 207234, 174501, 168023, 152373, 132286, 147157, 169232, 177660, 181659, 183079, 193128, 206576, 209545, 218964, 216754, 214671, 209129, 195724, 169116, 137696, 144071, 161445, 173900, 173875, 168635, 165041, 172146, 180763, 170142, 167229, 196531, 210796, 196082]
12998A96082N428j2351j057J7254K5992P638M251L699k3999K9802K5270J4257
12986B92266L2566J6834K8425m719k8486j6002M598J0160n075P022L4923N0483
12974D22995M6732N0322K8370j30q356m1485l3899m0745j8545m989n201O263O105
12961D07437l553L1486K2886L6738N5804O8948J13179J94007K95217M34826N38554
12950B195529M55887l5618m53284n09626m27257k53424j78955j18088p6769m9038
12940E49357m2986n3584m3954k9490q306J0751j9908k2589k2303l7280j4299k1288
12928B44121J915M9544l4599l5476r106K3814K7463o692l4856k1370N261K2205
12916B32224J1456K346Q339k031J3844R779k4146o008R614J2494J2619J5417Q316
$$ y = [196082, 201510, 189159, 188102, 205356, 231348, 238986, 243237, 246936, 222937, 252739, 278009, 292266, 324832, 341666, 370091, 365372, 336886, 320884, 325482, 335642, 330567, 337589, 372512, 422995, 469727, 520049, 548419, 548289, 539933, 498448, 464549, 423804, 405259, 400270, 395069, 401332, 407437, 403884, 435370, 458256, 494994, 550798, 619746, 732925, 926932, 1222149, 1656975, 2195529, 2651416, 2615798, 2162514, 1652888, 1225631, 972207, 793252, 675164, 598395, 549357, 506371, 452787, 408833, 379343, 371037, 381788, 361880, 339291, 316988, 279708, 265409, 244121, 246036, 295580, 260981, 225505, 216399, 240213, 267676, 260984, 226128, 204758, 210019, 232224, 243680, 246026, 254365, 252334, 266178, 275957, 251811, 245803, 255417, 267911, 280530, 295947, 304263]
12903C04263k2776k8261J1927K7516Q930j1578j3749j3291o801j7380n570M4143
12891B77373Q340k1410k155J8273J8431j1080J5822R024J746J0425j232n505K9028
12878C47080K5642j861j4293L855K8555m163N244N846K2717M6549M6877N3272
12866E65320N4142M6496M4212O7779J15198J28300J69389K71609M00470N27456
12856B390371O53361P31641Q79573R53301P90915N51582L98714J46565j81155
12847G314868l86721n56224p50949q12727p19792n64876m27315l19633j06434
12838B670197Q6515K00485L71596O25182R23720J387816J876311K310824K622233
12829A3074879K841147K636201J573078M65407k0412o87462j940601k654021k610772
$$ y = [304263, 281487, 253226, 265153, 292669, 301599, 290021, 276272, 262981, 256180, 238800, 233230, 277373, 285713, 264303, 262148, 280421, 298852, 287772, 303594, 312618, 314364, 324789, 323557, 318052, 347080, 372722, 370861, 356568, 360423, 388978, 384815, 390059, 395905, 418622, 465171, 512048, 565320, 619462, 665958, 710170, 777949, 893147, 1021447, 1190836, 1462445, 1862915, 2390371, 3043732, 3775373, 4654946, 5608247, 6399162, 6950744, 7349458, 7496023, 7314868, 6928147, 6371923, 5620974, 4808247, 4088455, 3523579, 3096264, 2776631, 2670197, 2756712, 2957197, 3328793, 3953975, 4877695, 6265511, 8141822, 10452646, 13074879, 15916026, 18552227, 20125305, 20590712, 20570300, 19882838, 17942237, 15288216, 12677444]
12820A2677444k362196k185180j881127j482009j092853p63834n24553l89641
12812A996051l14683k38870j69468j49473j31730r1627p3128o9444k9433n2256
12802F75939o0537l0221q486k394K3964M9649Q5719R5611N9999J4273k5447l3521
12790H44548l1123K4788J05072J16952Q8574J57791J93525J54012O4556K390j4296
12779A706789n1105r3357j51618j68716j47909j32001j16181j15912q0898n5351
12769E93741l2554k6516k2090l0827k1057O810o082J8567R506K371J5291o086
12757E01074o761L1872K3720J4731J0282n614K2075N7459O3318R4972J44670J24298
12745A076096J58813K48743L25066N31200Q83328J214383J380032K269612L999188
$$ y = [12677444, 10315248, 8130068, 6248941, 4766932, 3674079, 2910245, 2385692, 1996051, 1681368, 1442498, 1273030, 1123557, 991827, 900200, 827072, 757628, 728195, 675939, 615402, 585181, 576695, 574301, 598265, 647914, 733633, 829244, 889243, 903516, 878069, 844548, 813425, 838213, 943285, 1060237, 1148811, 1306602, 1500127, 1654139, 1718695, 1721085, 1706789, 1655684, 1562327, 1410709, 1241993, 1094084, 962083, 845902, 729990, 649092, 593741, 561187, 534671, 512581, 481754, 460697, 467507, 461425, 479992, 489498, 491869, 507160, 501074, 494313, 526185, 549905, 564636, 574918, 569304, 591379, 648838, 712156, 807128, 951798, 1076096, 1234909, 1483652, 1808718, 2339918, 3223246, 4437629, 5817661, 8087273, 12086461]
12736A2086461M824687M46245m132655m633962l252108j834358r91563n88086
12728A924661l63954k50491j83920j34877o2043j3988n6536r5190n8260n3677
12718F51725m1793k6128l0482l0339j7372j9927r915k8698k5752j0520J1501j8401
12706D03899j2984j2657K0779K85m040k0342k7202j7695j0225J4377J3165m6j7283
12693C30031r022Q622J937K8679M0686m010k4816l841L4643R7444J55937K49835
12681I06125L24630K73176m9585k46634k80209j95809j15274n3365l0615k4031
12671E08409k470O878j1440M154J0091q158l873j5654j0069Q381L029j5226l3233
12658D40819l6101m063j5321n87N248n259j8858J2635l424L2891M386j4442j628
$$ y = [12086461, 16911148, 17357393, 13224738, 8590776, 5338668, 3504310, 2512747, 1924661, 1560707, 1310216, 1126296, 991419, 929376, 915388, 858852, 763662, 705402, 651725, 609932, 583804, 553322, 522983, 505611, 485684, 475769, 447071, 421319, 410799, 422300, 403899, 390915, 378258, 399037, 399322, 395282, 374940, 347738, 330043, 319818, 334195, 347360, 347314, 330031, 321009, 329631, 331568, 360247, 400933, 396923, 372107, 368266, 402909, 500353, 656290, 906125, 1230755, 1503931, 1454346, 1207712, 927503, 731694, 616420, 563055, 532440, 508409, 505939, 512817, 501377, 505531, 515622, 507464, 503591, 487937, 477868, 486249, 489278, 474052, 440819, 404718, 400655, 385334, 384747, 389995, 384736, 365878, 378513, 375089, 407980, 412366, 397924, 396296]
12645C96296m312J0594K4028M9820M4389J1100Q895L1739K102p936j8387j8923
12633E29405L349o445k8045k8348j2059J0328Q91K0037J6732O161J2938p376K856
12620E20424J0462J0505k0421k1453K1098M9115R0848R8408M3874o159m7536l2850
12608G16315k2918k1406k2536l908L083n890P65J1441j8438p071L2229N4935K1630
12595G38231J2472L9448N0700L1700Q578l337K2646N588j1817k4972k0228m0214
12583H08795k2088j241l847J3877J1488Q153J5726L5442L4471k155j8665q249
12571H71707K0687J64J758m477k8799K357K2027K7341M0233M9388K9284L7095
12559A068765N144k800J5067J1817r047M59R567J9091J4705J4078P668L5066L4908
$$ y = [396296, 391984, 402578, 426606, 476426, 520815, 531915, 540810, 572549, 574651, 566715, 548328, 529405, 532754, 526309, 498264, 469916, 457857, 468185, 469076, 489113, 505845, 512006, 524944, 517568, 520424, 530886, 541391, 520970, 499517, 520615, 569730, 660578, 758986, 802860, 796701, 749165, 716315, 693397, 671991, 649455, 645547, 648630, 642740, 643505, 654946, 636508, 629437, 661666, 716601, 738231, 750703, 790151, 840851, 872551, 881129, 877792, 900438, 906026, 894209, 869237, 849009, 808795, 786707, 785466, 781619, 795496, 806984, 815137, 830863, 866305, 900776, 898621, 879956, 871707, 892394, 892558, 894316, 889839, 861040, 863397, 885424, 912765, 952998, 1002386, 1031670, 1068765, 1073909, 1071109, 1086176, 1097993, 1088946, 1089405, 1098972, 1118063, 1132768, 1146846, 1154514, 1189580, 1224488]
12546A224488L0194K6831N8421N4041J0171O300M0308N3109N5175O2329P6055
12535A697422J39587J07838N8345K1775N877K1736K1641J2378M1014O3285J25981
12524B316879J50479J24033J58909J50323J48341J51138J39720J89396K21366
12515C750584J91006J62606K19663K66123L37856L90290M21886M62171N18090
12506F720275O00549P23044Q27469R63153J187465J528989K038973K632130K996065
12497B0218112K955382L310500M547746O683946R978261J5205362K3873540L8688001
12489A25460850O3207657R7971489J27834721R2659249l3813305j12465047j14878290
12482B45977324q2558716n1218129l1256019j9912089j3455471r497931o800767
$$ y = [1224488, 1254682, 1281513, 1339934, 1393975, 1404146, 1410446, 1450754, 1503863, 1559038, 1621367, 1697422, 1837009, 1944847, 2003192, 2024967, 2030844, 2052580, 2074221, 2086599, 2127613, 2190898, 2316879, 2467358, 2591391, 2750300, 2900623, 3048964, 3200102, 3339822, 3529218, 3750584, 3941590, 4104196, 4323859, 4589982, 4927838, 5318128, 5740014, 6202185, 6720275, 7320824, 8043868, 8871337, 9834490, 11021955, 12550944, 14589917, 17222047, 20218112, 23173494, 26483994, 31031740, 37715686, 47693947, 62899309, 86772849, 125460850, 188668507, 286639996, 414474717, 507133966, 473320661, 360855614, 245977324, 163418608, 112200479, 80944460, 61032371, 47576900, 38078969, 31278202]
12475C1278202m840645l459743k798918k761913k633099k263395j805922j402867
12467I311700j175185r57949p63676o57484n30092m17252k89878k32269k29517
12458D058398k54440k69386k57817k23038j98469j91903j65643j43252j01089
12449B253361l7430m0402m8983p7505r6805p9247q9951j01886q1455m7919o0159
12438A491619p3627m3750l7841l3287m2223n5726m0721n6614l6258j5240J7187
12427A073519J5418O507K5420J886Q429K2355P416K1085J4032l2542l3823k2250
12415A107452l5567l3906o979Q376M0347K2054M6720M2053m882j3451m955k5913
12403A141349k4542L9204L7575O709Q433J7924K9829K3718L0514N5745M2143M0311
$$ y = [31278202, 26437557, 22977814, 20178896, 17416983, 14783884, 12520489, 10714567, 9311700, 8136515, 7178566, 6414890, 5757406, 5227314, 4810062, 4520184, 4287915, 4058398, 3803958, 3534572, 3276755, 3053717, 2855248, 2663345, 2497702, 2354450, 2253361, 2215931, 2175529, 2126546, 2049041, 1952236, 1872989, 1783038, 1681152, 1599697, 1551778, 1491619, 1417992, 1374242, 1336401, 1303114, 1260891, 1205165, 1164444, 1107830, 1071572, 1056332, 1073519, 1088937, 1095444, 1120864, 1122750, 1131179, 1153534, 1160950, 1182035, 1196067, 1163525, 1129702, 1107452, 1071885, 1037979, 1031000, 1039376, 1079723, 1101777, 1148497, 1190550, 1185668, 1172217, 1167262, 1141349, 1116807, 1156011, 1193586, 1200295, 1208728, 1226652, 1256481, 1280199, 1310713, 1366458, 1408601, 1448912]
12391A448912K0973K9327N4729M4499K129j1562L6791M6054L9106K8938L4061
12380A773957P9065R5817R7974R3413J06222J31364J31947J22978J51148J55933
12370B939818J30952J54398J78326J87533K31965K54749K97628L49389M02877
12361E127635M37932M90222N92887O79530P93155R36776J136414J357060J683614
12352A3235225K147772K805680L688707M941596O823490R596752J3572828J8844339
12344G5656389K4784452K9741616L3150609L6350574L6694182K5838641Q949344
12337B71165807J395021j219112j3633596l0155841l5438749l2189304k9389232
12330A30534994k7876711k4355556j9082675j3899993r914922p109491n242947
$$ y = [1448912, 1469885, 1499212, 1553941, 1598440, 1600569, 1589007, 1625798, 1671852, 1710958, 1739896, 1773957, 1853022, 1948839, 2046813, 2140226, 2246448, 2377812, 2509759, 2632737, 2783885, 2939818, 3070770, 3225168, 3403494, 3591027, 3822992, 4077741, 4375369, 4724758, 5127635, 5565567, 6055789, 6648676, 7328206, 8121361, 9058137, 10194551, 11551611, 13235225, 15382997, 18188677, 21877384, 26818980, 33642470, 43239222, 56812050, 75656389, 100440841, 130182457, 163333066, 199683640, 236377822, 262216463, 271165807, 272560828, 271341716, 257708120, 227552279, 192113530, 159924226, 130534994, 102658283, 78302727, 59220052, 45320059, 35405137, 28295646, 23052699]
12323B3052699l994213l087695k409714j934052j554166j268104j004979q29405
12315F970371o61826n33319m27526l04100k47216k16198j77712j40892j33977
12306D127605j71062k00219k21615k41038k23839k28970k20428k33143k17865
12297B169426k02069j62930j43661r6771r4464j35117j39668j04696m3604k5809
12287A020637l6837o2713p0564p1564p2869l9692j5213k0036n6702m6423j2723
12276E15301j59K491p433q327o000l352k1970l6666m2602m6010p372J6163N669
12263C59733j5310l5754l7762j9556j9877j5775j9704J6454K1224p854j5178j4106
12251A96535j1177j9530N177j7428j2151K6250L092J147l435q861k0691k3928
$$ y = [23052699, 19058486, 15970791, 13561077, 11627025, 10072859, 8804755, 7799776, 6970371, 6308545, 5775226, 5347700, 5043600, 4796384, 4580186, 4402474, 4261582, 4127605, 3956543, 3756324, 3534709, 3293671, 3069832, 2840862, 2620434, 2387291, 2169426, 1967357, 1804427, 1660766, 1563995, 1469531, 1334414, 1194746, 1090050, 1046446, 1020637, 983800, 921087, 850523, 778959, 706090, 666398, 651185, 631149, 574447, 528024, 515301, 515142, 517633, 510200, 501873, 495873, 492521, 470551, 433885, 391283, 345273, 337901, 354064, 359733, 344423, 308669, 270907, 251351, 231474, 215699, 195995, 212449, 233673, 225819, 210641, 196535, 185358, 165828, 171005, 153577, 141426, 167676, 170768, 171915, 168480, 159619, 138928, 115000]
12239A15000l6661j429J0397K3610J6392J5440o586k7706J6668j9308k0996l4472
12227E0349k0518K3591o610Q39K5616p899n704J5873O357Q414K458m166K4144
12214A12744K4231J5329M6247Q8058J47490J90187K77054K40010l2149k71780
12204H37421k86776k02708j27810q9114m3011j8583l8026k3665k4330j2066J1357
12193a7311J5826J4426N010j636j9524j4430k185O493O654K1249R993k982L12
12180B1895N955K694K5762M2784J5662k0248n390j6028k3233P11L717j1941n682
12167C6658k340k6147j8304k6022q985J9172k7822j0775O950P186L674j898J6920
12154c1733N372k6394J884L1936j0477j8118n50K058k186J581N021P173K319L8123
$$ y = [115000, 78339, 76910, 87307, 110917, 127309, 142749, 136163, 108457, 125125, 105817, 84821, 50349, 29831, 53422, 46812, 47651, 73267, 65368, 59664, 75537, 81894, 90308, 92766, 88600, 112744, 136975, 152304, 198551, 286609, 434099, 624286, 901340, 1141350, 1109201, 837421, 550645, 347937, 220127, 131013, 88002, 69419, 31393, 7728, -16602, -28668, -17311, -1485, 12941, 17951, 16315, -3209, -17639, -19824, -13331, -6677, 14572, 24565, 21583, 21895, 27850, 30544, 56306, 99090, 114752, 94504, 89114, 73086, 49853, 50564, 54281, 42340, 36658, 34318, 8171, -10133, -36155, -45140, -25968, -53790, -64565, -57615, -50429, -46755, -48653, -31733, -26361, -52755, -50871, -18935, -29412, -47530, -48080, -46022, -48208, -46627, -41606, -34433, -32114, 6009]
12140F009L0417J2621j9595Q253K3505J2851J1911j9973l6707k0973J884M327
12128A4530j1463N841K0949J256J328o491n5341l3069j2233P671j4004j8572P708
12115i1890J9943o433J6216R067J8619K081J6930L883j9592Q915j2368k0834j5957
12102g1420p048k1542P015K0569j499K5066K3773N870r560p019k6868n782j308
12089f9753Q956J855J8762J7524K2810K6429j6410j8135q871j9776l901J2793
12077b7717Q624r852j9505k0289J0506J7351K0290M179N786M642R180O209K4850
12064C4254j313k4572Q36p813L756n436L785J6017Q136J2502j4382O200J9644
12051E1614j3021N031M497j1567j6153p521J8171K2645k121J7136j0371p824L082
$$ y = [6009, 36426, 49047, 29452, 37705, 61210, 74061, 85972, 65999, 29292, 8319, 10203, 14530, 3067, 8908, 29857, 31113, 32441, 25950, -29391, -62460, -74693, -67022, -81026, -99598, -91890, -71947, -78380, -62164, -53097, -34478, -32397, -15467, -11584, -31176, -22261, -34629, -55463, -71420, -78468, -100010, -92995, -72426, -73925, -48859, -25086, -19216, -28776, -35795, -62663, -68445, -69753, -60797, -58942, -40180, -22656, 154, 26583, 10173, -7962, -16833, -36609, -40510, -27717, -19093, -28945, -48450, -68739, -58233, -40882, -20592, -16413, -10627, -5985, 3195, 9404, 34254, 32941, 8369, 9205, 1392, 5148, -288, 3497, 19514, 27650, 40152, 25770, 31970, 51614, 38593, 43624, 48121, 36554, 20401, 12880, 31051, 53696, 51575, 68711, 58340, 50516, 53598]
12038E3598L293k978k886J7072O0922Q0648Q9182O3871J7801n8347n0332r182
12026B62662K9066l159J1721L9754M8945L1330N9504J14204K02130L24923M60547
12015A581627N55190L55241j68478m75042n11641l94182k53594j52452r6770j00763
12005C39136p5377k1052M074j1619k1472k7754k2093l5907k6227J2452j3236p30
11993A00195J6243M968n966K0032J8272j1644k2750l151K478r131P406j303P081
11980A22730r278j9530o358M0415L0331J2356q700M889o009m919J9473L961j5723
11967A63638j177J6920J7233J6512q063j110K7334K9000j3860k0211K6646N1099
11955C03961K0857L8493K7596J1441M514K0303M543K0346M4019K1081K3807M5319
$$ y = [53598, 56891, 53913, 51027, 68099, 129021, 209669, 298851, 362722, 380523, 322176, 271844, 262662, 291728, 288569, 300290, 340044, 388989, 420319, 479823, 594027, 796157, 1121080, 1581627, 2136817, 2492058, 2323580, 1848538, 1336897, 942715, 689121, 536669, 439899, 339136, 263759, 242707, 246781, 235162, 213690, 185936, 163843, 127936, 101709, 114161, 100925, 100195, 116438, 121406, 115440, 135472, 153744, 142100, 119350, 116199, 118677, 109546, 116952, 115649, 122730, 113452, 93922, 87564, 127979, 158310, 170666, 161966, 166855, 160846, 155927, 175400, 179361, 163638, 162461, 179381, 196614, 213126, 205063, 203953, 231287, 260287, 246427, 226216, 252862, 303961, 324818, 363311, 390907, 402348, 406862, 427165, 431708, 452054, 496073, 517154, 540961, 586280]
11943E86280O5285P2643Q1054N4038P4354J05416J17960J31297J44926J47214
11933A580467J57898J91648K54113L29564M18841N40814O91954Q43124J019767
11924F028190J245145J580701K365857L831355O405374J0853576J7705047K5443142
11916G5458387K3899848J069949k0138172k4740096j9352998j2135482p167774
11909A6893662m432919k928503k057631j490350j089630q39009o29786m86072
11901B939762l90422l26732k68920k22364j78082j19125n2805p596J9306O1113
11891A454135J12729J37286J49076P6811K0253r253m7265o8553j21966j31725
11881A571528j27581r2203r1288o5186p4225r7592j07981j11179q7555o3043o4551
$$ y = [586280, 651565, 724208, 805262, 859300, 933654, 1039070, 1157030, 1288327, 1433253, 1580467, 1738365, 1930013, 2184126, 2513690, 2932531, 3473345, 4165299, 5008423, 6028190, 7273335, 8854036, 11219893, 15051248, 21456622, 32310198, 50015245, 75458387, 99358235, 100428184, 80290012, 55549916, 36196918, 24061436, 16893662, 12460743, 9532240, 7474609, 5984259, 4894629, 4055620, 3425834, 2939762, 2549340, 2222608, 1953688, 1731324, 1553242, 1434117, 1381312, 1373716, 1393022, 1454135, 1566864, 1704150, 1853226, 1930037, 1950290, 1941037, 1893772, 1825219, 1703253, 1571528, 1443947, 1351744, 1260456, 1195270, 1121045, 1023453, 915472, 804293, 716738, 653695, 589144]
11870E89144p6000q2417o9496n1860l0224m5561o1255l5876k195N078j7229q681
11858A13428j7040q24K229j1891j8049k2089j5207j9432k3794J1049J7618J733
11846A7731k224n091j4524o204P813j702J3540L495L909L67l659q510m679j3220
11832a2958J2551L257j2693M682L126o268n523l2608k9064R96J5147J1987K4247
11819b3121K3611L565R524Q961j9796k6143L741k7452k4839N319K0193J1912k4967
11806e9492m145J9138N04J9289L361M630L4515J061j6353o95r726r722K827Q921
11792e887k6945J866K2536K205j5046k1393J4948k5486M38n347L0604M408j8313
11779d1412j8457j1279J1707l466k917R031J9774J4812J174j4810q769n655m380
$$ y = [589144, 513144, 430727, 361231, 309371, 279147, 233586, 172331, 136455, 134260, 139338, 122109, 113428, 96388, 95564, 97793, 85902, 67853, 45764, 30557, 11125, -12669, -1620, 15998, 17731, 15507, 10416, -4108, -10312, -2499, -4201, 9339, 12834, 16743, 17110, 13451, 4941, 262, -12958, -407, 2850, -9843, -5161, -2035, -8303, -13826, -46434, -75498, -74502, -59355, -47368, -23121, 490, 4055, 13579, 22540, 2744, -23399, -19658, -47110, -71949, -66630, -46437, -34525, -59492, -63637, -44499, -43995, -24706, -21345, -16715, 17800, 18861, 2508, 1813, -7913, -17635, -14808, -5887, -32832, -30966, -8430, -6225, -21271, -42664, -27716, -53202, -52764, -58111, -27507, -23099, -41412, -59869, -71148, -59441, -62907, -65824, -56793, -37019, -22207, -21033, -35843, -44612, -50267, -54647]
11766e4647n972J6623J063J4389l148J3489R431j6201l2800k4297K0122J9088
11754d2860M107p099k3764j9891k436j6037j0635M5456K5511M932k2619k7043
11742i2378L069n544k27N417J0812m477Q321Q684j3399Q291P763l160k874j3445
11728h3147m47J9477L383m741N752m113J1131K3702P356J1445P043k884L507M292
11714A756k7973j0157j9996l972L9938L1102k1509l5627j6198n213N583k17l584
11701f6067l334M772J9696p480k563Q832J604J3788k868k6108l961p750P947j1240
11687g4732R110J3285K0239L578K37j8387l0400N614m733j951j586J0839j739
11674g0626K7950K6460P92j5675k3108l546J1978J6991p575j8690K0251Q270P312
$$ y = [-54647, -60619, -43996, -42933, -28544, -31692, -18203, -8772, -24973, -57773, -82070, -61948, -42860, -38753, -45852, -69616, -89507, -91943, -107980, -118615, -73159, -47648, -42716, -65335, -92378, -89309, -94853, -95080, -89663, -78851, -83328, -75007, -66323, -79722, -71431, -63668, -66828, -69702, -83147, -83594, -64117, -60734, -65475, -59723, -63836, -52705, -29003, -21647, -10202, -3159, -6043, -2536, 1756, -26217, -36374, -56370, -60342, -20404, 10698, -10811, -46438, -62636, -67849, -62266, -62483, -66067, -69401, -64629, -44933, -52413, -54976, -46144, -44540, -30752, -33620, -59728, -63689, -71439, -63492, -74732, -65622, -52337, -32098, -28520, -28283, -46670, -77070, -71456, -76189, -78140, -79726, -68887, -70626, -42676, -16216, -15424, -31099, -54207, -57753, -45775, -28784, -36359, -55049, -34798, -26528, -19216]
11661a9216N462r611j4719l365j2339j4717j0319J6687j0614j3364J0509P738
11649f7868j7059K1473k61m477m834j1060L092m077J5197M531J2555K8545J1937
11636a2306L384j152k9684j9337j0876L219J5080L241j5713m269Q87M162j4882
11623g8246o482p270K163q214K8414K1402J0332o24k0480J419K8208J1852K1291
11610C765J6542k5743n952K1855j6061l2397O072J8667n97L959Q014j1964J381
11597a2459J3204j2809l0972J2768K0461N399j618j0566q0K9774K9627j8006n0606
11584b5883m983K974J3146J6584j4204j1130n146L372p521p887M925R550N62J335
11570b4306Q003P140j8194l8478J7886J2436L073q01n144j2318l1487j5440L580
$$ y = [-19216, -13754, -23365, -38084, -41449, -53788, -68505, -78824, -62137, -72751, -86115, -75606, -67868, -84927, -63454, -63715, -68192, -73026, -84086, -80994, -85071, -69874, -65343, -52788, -24243, -12306, -8922, -10074, -39758, -59095, -69971, -66752, -51672, -48431, -64144, -68413, -67526, -63364, -78246, -84728, -91998, -89835, -98049, -69635, -48233, -37901, -38525, -59005, -57586, -29378, -17526, 3765, 20307, -5436, -11388, 10467, -5594, -37991, -31919, -13252, -13849, -9890, -1876, -13840, -12459, 745, -12064, -43036, -30268, -9807, -4408, -6026, -16592, -16672, 13102, 42729, 24723, -25883, -30866, -27892, -14746, 1838, -12366, -23496, -28642, -25270, -32791, -40678, -35753, -26203, -25641, -24306, -16303, -9163, -27357, -65835, -47949, -35513, -32440, -33241, -38385, -50703, -82190, -97630, -94050]
11557i4050k084K8929K3750J7900L974j679j936p323K149n660j0062p645j8997
11544g2734j4385K3518J0154k376j1784j9776J0348K8241J1687q803P482R647
11532b8781K1125j0515j0153m360q884l776j20J4283K4083L321r904l0457j8164
11519f2302K2407j5273j0561J1544R736N624j1988K0078J6938J81k4677P240K3699
11506g354n663j7251j0194J5617J4376j0704j0760j5564j9908n888R550R428J3353
11493d0962L52P298N91N788J8528J2064m415j3066l0428j3929J559k6609L036
11480h0193L8422R027Q04P514K1956q062j0182l193N517j0949j2328L951k0606
11467e8322L141P631R661j1798j420k039j75k378Q835K691N13j0974J3214M6120
$$ y = [-94050, -96134, -67205, -43455, -25555, -21581, -23260, -25196, -32519, -30370, -36030, -46092, -53737, -72734, -87119, -63601, -53447, -55823, -67607, -87383, -77035, -48794, -37107, -45910, -38428, -28781, -7656, -18171, -28324, -32684, -41568, -45344, -45464, -31181, -7098, -3777, -13681, -44138, -62302, -39895, -55168, -65729, -54185, -44449, -38825, -50813, -30735, -13797, -13616, -38293, -31053, -7354, -13017, -30268, -40462, -24845, -10469, -21173, -31933, -47497, -67405, -73293, -63743, -54315, -40962, -40610, -33312, -32721, -26933, -8405, 3659, -756, -13822, -44250, -58179, -56620, -83229, -80193, -41771, -32744, -31940, -24426, -2470, -10532, -20714, -23907, -18390, -29339, -41667, -37716, -58322, -55181, -47550, -37889, -49687, -51107, -53146, -53321, -55699, -46864, -44173, -43660, -54634, -41420, 4700]
11453D700J15k6526m002M465o407K5744j46l833n458j4026P407j1193k2050j6172
11439f7382J8249L3203J8640q290M009l798k0638j3092P709l951J9124O422l7915
11426d7710n481J6059J0283L701j5148J5172J0191k174J7765l2598k1967O733
11414d5174o41l950J2867m974j3349J2388Q931J4574J1060k7860k2024K6633J7792
11401a3727k2199k159K3483r154j1009J4189R204j3526k1178P010J0245j441o22
11388c0884L707J1765j1997l4406j7072k868L3371L5604j054m27L516J0751j597
11375a591P6j1444J5484j0827r165j2069j345L500j489N8k1429R166M347J5036
11361b1692j7143k798O585J7066J5120k9487l77q143j5143J0769J730L847j8387
$$ y = [4700, 4815, -21711, -25713, -21248, -27655, -1911, -2057, -5890, -11348, -25374, -17967, -29160, -51210, -67382, -49133, -15930, 2710, -5580, -1571, -5369, -26007, -39099, -31390, -35341, -16217, -9795, -47710, -53191, -37132, -26849, -23148, -38296, -23124, -12933, -15107, 2658, -29940, -51907, -45174, -45815, -49765, -36898, -41872, -55221, -42833, -33902, -19328, -8268, -36128, -58152, -31519, -13727, -35926, -38085, -14602, -23756, -34765, -20576, -11372, -24898, -46076, -39066, -28821, -30262, -30884, -27177, -15412, -27409, -61815, -78887, -81755, -48384, -12780, -13834, -14261, -10745, 6, -1591, -1515, -12959, 2525, -8302, -17467, -29536, -30881, -27381, -28870, -28812, -50241, -41075, -36728, -21692, -38835, -41633, -35048, -17982, -2862, -32349, -32726, -40869, -56012, -45243, -43513, -39666, -58053]
11348e8053O063N602K6366Q258j3563Q866J8921R368O551j2654j6632j862j5354
11335b8123K8212J2973k6683J294n844q679K9737k052k1349L911K493P207R472
11322B569r921r778p382L555J3906l859j8493K1501J8857J0583K0086q695l2660
11309B69k4153j4915l4941J1893K4508K8940K4240k1050k3020K791n744o524J7721
11296a9985P57J3319Q251O620q38j026j5055j456k655L697j579j42O94K7447P596
11281B5645k6389o916j3468N668L669J2133P511o203J1112R484M000j5266n737
11268E243j5326L0678K807n288j8827l5533l893K1900j0868l3699J0296J1641
11256d0869N630J8661J5229J1379o284k6167k4392J8487K0056J259K9226R270
$$ y = [-58053, -51990, -46388, -20022, -11764, -25327, -16461, 2460, 11828, 18379, 5725, -10907, -12769, -28123, 89, 13062, -13621, -12327, -18171, -26850, 2887, 835, -20514, -16603, -14110, -6903, 2569, -7352, -17130, -24512, -20957, -7051, -10910, -29403, -7902, 10955, 21538, 41624, 32929, 269, -23884, -38799, -73740, -61847, -37339, -8399, 15841, -5209, -28229, -25438, -31182, -37706, -19985, -19228, -5909, 2342, 8962, 8124, 7098, -7957, -9413, -12068, -8371, -9950, -10092, -9398, 18049, 25645, -744, -7660, -21128, -15460, -11791, 342, 7853, 1650, 12762, 22246, 26246, 10980, 5243, -10083, 20595, 23402, 18114, -713, -36246, -40139, -18239, -29107, -62806, -52510, -40869, -35239, -16578, -1349, 10030, 3746, -22421, -46813, -28326, -8270, -7011, 22215, 31485]
11244C1485l0466k3742k393r754n822P549Q853K6801K0534r507j4991R198j935
11231E810K76k740L737K0244O317n565l817o444Q71M412R559P498Q431J759O278
11216E6626J4394J1102k8361k4569j9049j831P763r090m10p998M444m70M09j0493
11202g533q205J0189J7465P274l0225J6342L4177j2447k0810j57m452j8363J5972
11189g73J3245m21k817J9588O572q319j4135N848J2061J594J5221p286J2340j923
11175E0795r532m160K456K1520J0948q747K445l681L0309j1008l9158L018J7811
11162F3016J6702k496j6377j5437J0776M18k3808j1430n273P619N400N238O779
11149D1127k292l0331L10n351K616j7038o884O144M523p456K2978n692r774J3967
$$ y = [31485, 1019, -22723, -25116, -34870, -40692, -33143, -24290, 2511, 23045, 13538, -1453, 7745, 5810, 6086, 3346, 7083, 27327, 33644, 28079, 24262, 17818, 18689, 23101, 32660, 40158, 48589, 50348, 56626, 71020, 82122, 53761, 29192, 10143, 8312, 16075, 6985, 6575, -1423, 3021, 2551, 2960, -7533, -15738, -5549, 11916, 19190, -11035, 5307, 39484, 27037, 6227, 6070, 1618, -16745, -773, 12472, 12051, 9234, 28822, 35394, 27075, 12940, 18788, 30849, 32443, 47664, 40378, 52718, 50795, 41263, 37103, 39559, 61079, 72027, 63280, 65725, 62044, 92353, 81345, 42187, 45205, 63016, 79718, 77222, 60845, 45408, 56184, 56602, 32794, 21364, 16091, 23710, 29110, 34348, 41127, 38835, 8504, 8814, 3463, 6079, -10959, -17843, -11699, -7176, -14632, 8346, 2654, -7120, 6847]
11135F847J8938j480j4815P826n463k0016r325p285J5597K5510R728q462O01P878
11121B6079K6103K5860m379j3852J287N11j0326k0901n498P13j2115J2710j3813
11108A2379o359j2271K4411K5336k1120m0929k5921Q070J1032k49P274J8459O186
11095F298J2702j0991j195j5254K6390O576r685k7774J628j1729J6502J9579J7936
11082C0983L905j5007R542J3941k0682n0478j5916j8413Q588K0878J4410j3387
11070c1636j8025J9836L9928K3189n477j8984r422j3967N417Q791Q545k6938o740
11057b5483Q117K3897J0002O031m561P927o158K4658L0069J0701J9305K3867j5460
11044A12912m4249P185k404o09K4558R493J3280K1968L0672L0069L0150o420k1887
$$ y = [6847, 25785, 24305, 9490, 17316, 11853, -8163, -17488, -24773, -9176, 16334, 26062, 17600, 18201, 26079, 52182, 78042, 73663, 59811, 61098, 61609, 51283, 30382, 24884, 25597, 13482, 26192, 12379, 6020, -6251, 18160, 43496, 22376, -18553, -44474, -36404, -25372, -25621, -18347, 112, 6298, 19000, 8009, 6814, -8440, 17950, 24526, 14841, -12933, -11305, -23034, -6532, 13047, 30983, 34888, 19881, 29423, 43364, 22682, -27796, -43712, -62125, -53537, -32659, -18249, -31636, -49661, -29825, 10103, 33292, 27815, 8831, -591, -14558, -9141, -350, 8195, -18743, -25483, -17366, 6531, 16533, 22564, 18003, 25930, 19772, 44430, 74499, 85200, 104505, 128372, 112912, 68663, 75848, 73444, 72835, 97393, 106886, 120166, 142134, 172806, 202875, 233025, 226605, 204718]
11031B04718j5507k1973j0833q526K4942O0993O8747K285n670r299l9340l7415
11019B13122k6059k5036n715j057K5402O234J1414j373o7j1002k4919l3544k2164
11006A05236k4100k8433Q680K0185J4801M237j6517k1128o655j5313M159j274
10994D3878k0876O463J5361O21j8675j7596j0222J3297p867M16J9345O235q694
10981B1686o965R412J1732j1192K649Q071J0610k0635k8849k0947M425J1859J5995
10968G851L07Q0J3373j401k330j9078r658R721p424J6655J8826Q396R972n435
10954C9855j0424J3616j057R40j0920j1983k255Q38o272M49J4936r218m619m506
10940I380K707O110j965j252j0488J4111j2182l80J4711K826o733M525j8697r757
$$ y = [204718, 189211, 167238, 156405, 147879, 172821, 233814, 302561, 304846, 299176, 289877, 250537, 213122, 187063, 162027, 156312, 155255, 180657, 186891, 198305, 196932, 196865, 185863, 160944, 127400, 105236, 81136, 52703, 61383, 81568, 96369, 100606, 84089, 62961, 56306, 40993, 45152, 43878, 23002, 29465, 44826, 45447, 26772, 9176, -1046, 12251, 4384, 4800, 24145, 30380, 21686, 14721, 24133, 35865, 24673, 27322, 35393, 46003, 25368, -3481, -24428, -20003, -8144, 7851, 8158, 8238, 21611, 20210, 17880, -1198, -10856, -1135, -8559, 8096, 26922, 35318, 45290, 39855, 29431, 43047, 41990, 42930, 32010, 20027, 17772, 18610, 12338, 12787, 27723, 18505, 13886, 9380, 12087, 18197, 16232, 14980, 4492, 18603, 6421, 6041, 20752, 23578, 16845, 21370, 2673, -7084]
10926g084M016J5109k824J5921q057j4876j4238j4370M864J245L659P911j1238
10913a9962J2758R205J5983J8034k6545M632J1525l873k5053Q40J2781J7085O946
10900C4356k879j3474J6065j156m165R007n670j9288j4562M903O877L126l013
10887A0127j8148J4588M859L74J1016o140l532M49j2348o490k1018K8647J2566
10874A4950k5833R308R50J0101O293P648l66j1220N669L4351j0193m816l524j971
10860C1347K4930Q115l251q628j527k2729K769O424n942r86m3J5260Q74k444J3539
10845E7708J3314j8380J1119j6895j0251L522k463J3559J0600q085j0391K985
10833D6342m256j7177J2946N516j342L318j2046q202J0800p46r295J3239J7392
$$ y = [-7084, -3068, 12041, 9217, 25138, 17081, 2205, -12033, -26403, -21539, -20294, -16635, -8724, -19962, -7204, 2001, 17984, 36018, 9473, 14105, 25630, 21757, -3296, -2456, 10325, 27410, 34356, 31477, 18003, 34068, 32912, 28747, 37754, 32084, 12796, -1766, 3137, 10014, 13140, 10127, -8021, 6567, 11426, 11800, 22816, 16676, 13144, 13593, 1245, -5245, -26263, 2384, 14950, -10883, -1575, -625, 9476, 15769, 23417, 23051, 11831, 17500, 51851, 41658, 36842, 33318, 31347, 56277, 64392, 61141, 52513, 50986, 28257, 31026, 37450, 31508, 30522, 30479, 45739, 46613, 44169, 57708, 71022, 52642, 63761, 46866, 36615, 40137, 37674, 51233, 61833, 53748, 43357, 46342, 42086, 24909, 37855, 43371, 42029, 45347, 33301, 25099, 35899, 35153, 25858, 39097, 56489]
10820E6489J2021K8120r35l3125j8650j3656j2559j0521J5406J4997k888N646
10808D0345l830L603Q318j1910j5052n194N702J1189J3245L682p68j871k4930
10795B2529j1363Q044j4496J1388J7132n270K5063L3248J5058k1595k722m592
10783G2424k0638k1202j3357O952m605J7274K3395M721K0147J7633k6123n872
10771G0749Q120R630J1775J1225R128j0805j9347o439k0791k2898N799K1231O380
10758G3757m554q457l197J10J3215J264K683j5715J0271j634l0161J290J3597
10745E2469n312K5493O482K0037J8321j2908j2377J1116J2597r091k3208J952
10733H5571Q762k2738l471K269K1266L887j2381N74N706J2120J1753j1030o349
$$ y = [56489, 68510, 96630, 95695, 62570, 43920, 30264, 17705, 7184, 22590, 37587, 34699, 40345, 36515, 40118, 48436, 36526, 21474, 16280, 21982, 33171, 46416, 50098, 49330, 47459, 22529, 11166, 19210, 4714, 16102, 33234, 27964, 53027, 86275, 101333, 79738, 77016, 72424, 51786, 30584, 17227, 24179, 19574, 36848, 60243, 64964, 85111, 102744, 76621, 70749, 78869, 88499, 100274, 111499, 120627, 109822, 90475, 84036, 63245, 40347, 46146, 67377, 73757, 69203, 60746, 57549, 57659, 70874, 72138, 74821, 59106, 69377, 67743, 37582, 38872, 52469, 47157, 72650, 79132, 99169, 117490, 104582, 92205, 103321, 115918, 106827, 83619, 85571, 94333, 71595, 68124, 70393, 91659, 95546, 83165, 83739, 89445, 101565, 113318, 102288, 95939]
10720I5939K520K4432J0552m120n982J5864j0826m287r134p881O437J5591J7954
10707A47059R925O002k3915k4617K5927J6169j2477k6124k1673j6794K0989J5192
10695A15663Q501K510J3977J471l265J2099j018j032j2255P80j5993J5739m520
10682A32657J1862L1017j646M247J2619K89Q053j7714L096J7247J4489J3599r634
10669B20181p569M050J9900j7005j6016r068N787R664P544O187J5770L0312M5723
10656C15460N3710M309j5698j830p237J5345N745J1871j470J5697j1186L1839
10644D16555J8803M0837M2873K2079K5936M0760P3123O6200R0509R2548Q7730
10633A017953Q9725P7033O5313R6621J41745J64208K26912L19552M16960N97862
$$ y = [95939, 98459, 122891, 133443, 129323, 123341, 139205, 128379, 124092, 114958, 107077, 113514, 129105, 147059, 156984, 162986, 139071, 114454, 140381, 156550, 144073, 117949, 96276, 79482, 100471, 115663, 124164, 126674, 140651, 142122, 138857, 150956, 149938, 148906, 136651, 137431, 121438, 137177, 132657, 144519, 175536, 173890, 178137, 190756, 191045, 199098, 181384, 184480, 201727, 216216, 229815, 220181, 212612, 216662, 236562, 219557, 203541, 194473, 200260, 209924, 217468, 223655, 239425, 269737, 315460, 369170, 373479, 357781, 355951, 348714, 364059, 369804, 381675, 380205, 395902, 384716, 416555, 435358, 476195, 519068, 541147, 567083, 607843, 680966, 747166, 837675, 930223, 1017953, 1107678, 1184711, 1250024, 1346645, 1488390, 1652598, 1879510, 2199062, 2616022, 3213884]
10623C213884Q29710J157090J592257K151039K689091K821221K122412P08541
10615A7285245n80238j179728j074117m74852L74396J427558K687069M180086
10607B2645419N536226N767453L750468K6208l091622m188229l512829j996850
10599B4936244k70365J546498L547580N645921P281868P079388L581382k074239
10591E1274277o292008p370026o190853m195076k170231l22822J444639L047334
10583B9225234M090304L625987R38776k808201n302113n683403m640844l159150
10575A6286590j783009o84404J95875Q90551J204139Q29414l16642j734949k653326
10566A2234239k750186k318510j759538j281846r18817o67606m81786l59970k76251
$$ y = [3213884, 4043594, 5200684, 6792941, 8943980, 11633071, 14454292, 16576704, 17285245, 16705007, 15525279, 14451162, 13976310, 14350706, 15778264, 18465333, 22645419, 28181645, 33949098, 37699566, 37725774, 34634152, 30445923, 26933094, 24936244, 24665879, 26212377, 29759957, 35405878, 42687746, 49767134, 53348516, 51274277, 44982269, 37612243, 31421390, 27226314, 25056083, 24733261, 26177900, 29225234, 33315538, 36941525, 37880301, 35072100, 29769987, 24086584, 19445740, 16286590, 14503581, 13819177, 14015052, 14905603, 16109742, 16939156, 16622514, 14887565, 12234239, 9484053, 7165543, 5406005, 4124159, 3205342, 2537736, 2055950, 1695980, 1419729]
10557A419729k03665j67902j36666j11346q7382q4317r4797q0624o9885m4121
10547C39024m8312l0653l6426o87k8122l8718k7838m1958j129K4121O818k2609
10535I3511k4824M789N317k3814k7216M580O36q563k616n44L094j2419j0654p840
10521f563n03J3418J2510q374N258J2851l1469L215M957j7297P723j4895M611
10508a4558k2657J4623K0222j7102k682r752p220j3712O279p706M057M12J5852
10495c3944P805j5904J5948K4139j8818J1353j5102j1730P18j226q31K4114J0432
10482c046q71k5308k0066j2391P915K4895J8295J6537l601j5454o308j9055j3402
10469e1860K140j6534m655J4595J356j447R612M97k9104L979P694J0618L360J2636
$$ y = [1419729, 1216064, 1048162, 911496, 800150, 712768, 628451, 533654, 453030, 383145, 339024, 290712, 260059, 223633, 222946, 194824, 156106, 128268, 86310, 85181, 109302, 116120, 93511, 68687, 73476, 78793, 54979, 27763, 32343, 32979, 24416, 21800, 21256, 24350, 11931, 1277, -6563, -7066, 6352, 18862, 10488, 15746, 28597, -2872, 343, 5300, -11997, -4274, -19169, -14558, -37215, -22592, -2370, -19472, -22154, -31906, -39126, -52838, -46559, -54265, -50208, -49796, -33944, -26139, -42043, -26095, -1956, -20774, -9421, -24523, -36253, -35535, -36761, -37592, -13478, -3046, -3917, -29225, -49291, -61682, -53767, -28872, -10577, 5960, 2359, -13095, -19403, -38458, -51860, -49720, -66254, -70909, -56314, -54958, -56405, -46793, -46296, -75400, -71421, -63727, -53109, -49749, -37113]
10455c7113J264j218r63j1003j0431M337J6692M147k85R139R58J3531J7718J6103
10441B2876n321l5565l3737o102r766J9542K7062K049j6767j2084k054J4101p800
10428d3566l0860j850K6143j2283p9L755k2619o427J2642J1223o5L807P950O343
10414d5886m743j6960j772J477q172J369J6960J7148M744k0911r171k0213n039
10401i1169J3235J1299M84J3256J0985l581P905K0339K144N983J8180r093j0486
10388a0519k454j0395j2022L2054N261l1449q103J6005n973L423J623j0418J8634
10375a4333k368j1463j092J5070R795J9038n627o329L50K824p747k4415k4206
10362e0503l143J7475q706m581k4656m109K6672K2875P465j1109j8581k1066j2049
$$ y = [-37113, -35849, -37067, -38030, -49033, -59464, -55127, -38435, -34288, -34573, -25434, -24476, -10945, 6773, 22876, 17555, -18010, -51747, -57849, -67615, -48073, -21011, -18962, -35729, -47813, -49867, -35766, -43566, -74426, -76276, -50133, -62416, -62495, -58740, -81359, -87786, -75144, -63921, -63986, -60179, -52229, -45886, -50629, -67589, -69361, -67884, -76056, -74687, -57727, -40579, -35835, -56746, -65917, -86130, -91169, -77934, -66635, -66151, -52895, -41910, -45491, -37586, -17247, -15103, -9120, 9060, -33, -10519, -12973, -23368, -35390, -3336, 1925, -29524, -37627, -21622, -27595, -24172, -22549, -32967, -14333, -16701, -28164, -29256, -14186, -4391, 14647, 9020, 2691, 3041, 5865, -1882, -26297, -50503, -53646, -36171, -44877, -49458, -74114, -78223, -51551, -28676, -21211, -32320, -50901, -71967, -84016]
10349h4016O94M566P251m449j6427J5035R877j6621M623K3415L0184Q129O522
10336a1217N101j3958O6J331P707K6932L623k7795l2184j4630J3943m71nM857
10322c6700N897l242j1445j1328j496n690O492L0008J6675j9476O349J1838O863
10309e255j6954j6972j0090R833R007J5404J5742j119k1300n02K1104J7084q454
10296G528k4199j0323j5643L280L0766N184j5990j1619j1362q730J0893J7672
10284b2543K2361J6591j0278k3724o613J855j4349m070J403K975J1959P215K527
10271a4691k405j1444k832J0769R769k4358p241O745K1237J616O441j723M108
10258d009j650j4228r892p335j159Q937r920J3633J0774p725N694P819M550k6746
$$ y = [-84016, -83322, -78756, -71505, -75954, -92381, -77346, -67469, -84090, -79467, -56052, -25868, -17739, -11217, -6116, -20074, -20008, -18677, -10970, 15962, 19585, -8210, -40394, -55024, -41081, -41552, -41557, -36700, -30803, -34045, -45490, -56818, -58314, -64004, -57512, -27504, -10829, -30305, -23956, -12118, -5255, -22209, -39181, -49271, -39438, -30431, -15027, 715, -404, -21704, -22206, -1102, 15982, 7528, -16671, -26994, -42637, -39357, -8591, -3407, -19397, -31016, -42378, -51108, -40215, -22543, -182, 16409, 6131, -17593, -24206, -22351, -36700, -40770, -39367, -36392, -24433, -17218, -14691, -17096, -28540, -31372, -20603, -10834, -35192, -42433, -35688, -14451, -12835, -6394, -8117, -4009, -5659, -19887, -29779, -37114, -38273, -29336, -39256, -25623, -14849, -22574, -16880, -9061, -4511, -31257]
10244c1257r791n685O359M998R690l1223L396q48l766R611K0181K777m875J2850
10230a7583j1925L425k060q619j51J2205J7354J416j4351k0777K2745j0504k0578
10217d9403j0674K2116K1705J1868J620j7425j6667j173r589L98K1949R295l80
10204a6360j4704j4901m072K7972j676l0722K456Q176J743K631p240J4139P99
10191c1759J374J62O945J0292K3826N957l1805K4516K8613L807L4321P141j9801
10178F3589m554O45p06o517J3733K7491J7694J0290L0497J3539P829j8462N395
10165A60463l2995k3206P891J1910j4619L4910M4133O9831M4501p446k5631n7687
10153B12055o1954k7031J1527K2488j2517N922L5574J8516J4443r038j8624k2011
$$ y = [-31257, -41048, -46733, -40374, -35376, -25686, -56909, -53513, -54361, -58127, -48516, -28335, -25558, -30433, -17583, -29508, -26083, -28143, -36762, -36913, -24708, -7354, -5938, -20289, -41066, -18321, -28825, -49403, -60077, -37961, -16256, -4388, -2768, -20193, -36860, -38033, -47622, -47224, -25275, -15980, -16360, -31064, -45965, -50037, -22065, -23741, -54463, -52007, -43831, -42088, -39457, -46697, -32558, -31759, -30385, -30223, -23278, -12986, 10840, 16797, -15008, 9508, 38121, 41928, 76249, 83390, 63589, 59035, 59680, 58974, 52457, 66190, 93681, 111375, 121665, 152162, 165701, 173530, 155068, 160463, 127468, 104262, 112153, 124063, 109444, 144354, 188487, 258318, 302819, 295373, 269742, 212055, 150101, 123070, 134597, 157085, 144568, 150490, 186064, 204580, 219023, 209985, 191361, 169350]
10141A69350k3750k4436k4720l9603P594o036p624K605L0445j379k8565n378j8064
10128C0439m1564l8114r434J8962L0835P424l6604n814M364J0507L0290L429k2199
10115a7479O782L6767J0002j2685j9891o84J7417N289o229j7024j5624j5705j1779
10102d0843k536j4289K841J5523K6386J4515j0000K5397P903P802o19l1722j0948
10089a0590m383J1707R565J73j5927j0003o783k623J0691p239J2179n504K5291
10076F554l167j472p307l2520j3096J90J4890K1239j3621j074J5104p627J152
10063b0755j5812J0354K2325N751J3138M135l037p533q836K533q071j7441N080
10050a8169N21O503K0783J824M871J225m972m161N59j0938K07o068O674K503J9591
$$ y = [169350, 145600, 121164, 96444, 56841, 64435, 58399, 50775, 53380, 83825, 82446, 53881, 48503, 30439, -11125, -49239, -58673, -39711, -8876, -1452, -38056, -43870, -39506, -28999, 1291, 4720, -17479, -10697, 26070, 36072, 23387, 3496, 2812, 20229, 25518, 19289, 2265, -13359, -29064, -40843, -43379, -57668, -54827, -39304, -12918, 1597, -8403, 16994, 24897, 32699, 32080, 358, -10590, -14973, -3266, 6299, 6472, -9455, -19458, -26241, -28864, -18173, -25412, -13233, -18737, 6554, 3387, 1915, -5392, -37912, -51008, -50818, -35928, -14689, -28310, -29384, -14280, -21907, -20755, -36567, -26213, -3888, 1863, 15001, 19136, 16099, 8566, -270, 2263, -5808, -23249, -18169, -17648, -11145, 9638, 11462, 16333, 17558, 12586, 8425, 8984, -1954, -1747, -7815, -1141, 1362, 20953]
10035B0953Q188j7043k1751r204J6872M334l004p950J3443J8558p922k3273l1534
10022c9333R962J6816j7178p970r21L991L994Q080r41j0832J8462K4412p940m983
10008d381j4722o139j1114o502o878J7774J2535J7387J0544l10O603o936N735
9995A3596k905j2080j9449k715K0470K6130j235j6522l7331J2980Q465P957J8136
9982A5497k246k8765k1264p309O825K5500P330J2254p093j1607J0891l306o277
9969i570J918J0072J931j0828R94n833L615o436j5198J3014J4132j3689K8798
9956A2920j3198j2435J3164p784m215O192n728k2966Q972K9692J8291k1674j7012
9943a5781j2184q53n178P714Q462j1093O284q604j2663M5138J8404r223k837P300
$$ y = [20953, 29141, 12098, -9653, -18857, -1985, 2349, -655, -8605, 4838, 23396, 15474, -7799, -39333, -29371, -12555, -29733, -37703, -38624, -34633, -30639, -22559, -23500, -34332, -15870, 8542, 602, -4381, -19103, -25242, -36356, -42858, -49736, -31962, -19427, -2040, 8504, 8194, 14797, 7861, 13596, 10691, -1389, -20838, -23553, -3083, 23047, 21812, 5290, -32041, -19061, -10596, -2639, 15497, 13251, -15514, -36778, -44087, -37262, -11762, -4432, 7822, 729, -10878, 13, -3293, -9570, -7652, 2420, 4351, -6477, -5483, -11316, -7701, -14137, -29335, -16321, -2189, -15878, 12920, -278, -12713, 451, -7333, -11548, -5356, -11084, -34050, -25078, 4614, 22905, 1231, -15781, -27965, -28818, -33996, -26282, -17820, -28913, -22629, -31233, -43896, 1242, 19646, 10423, 7586, 14886]
9929A4886Q680J6740J0461J0345N79K3399M2110N6447J00601J51500L07431N98408
9917A341587P48316J3605o01322o03302l85063k08819j10183q6716n8337k5215
9907B4551k0292l142R619J2480n70M405J9789j751pM104r546k8912l7358M052
9893b2578J6744J6338J1491j1515O891j8857M631L2406K4259j2861j4649j230
9881C1070j9377O373m866l102j9159k9218N927l027Q76M439j3764J4337J3470
9868a6021J1250O123k1071p091j6524J9316O824P26L607J8328R528r602l1165
9855b5772K263J2726Q185l78P049P799k9163j8374J6200J8509j2768p834O304
9842a5254K784m445K159O728Q826J2086l740P92Q279M063j9720k9601Q929J2549
$$ y = [14886, 23566, 40306, 50767, 61112, 61691, 85090, 127200, 183647, 284248, 435748, 743179, 1341587, 2089903, 2103508, 1502186, 898884, 513821, 305002, 194819, 108103, 49766, 24551, 4259, 1117, 10736, 23216, 22646, 27051, 46840, 45089, 45082, 49186, 39640, 10728, -26630, -22578, -5834, 10504, 21995, 10480, 17371, -1486, 3145, 35551, 59810, 46949, 32300, 31070, 11693, 18066, 13200, 10098, -9061, -38279, -32352, -35379, -34503, -30064, -43828, -29491, -16021, -4771, 1352, -19719, -26810, -43334, -24018, -17194, -16468, -12861, 5467, 14995, 5393, -25772, -23509, -10783, -2598, -2976, 4073, 11872, -17291, -35665, -19465, -956, -13724, -21558, -15254, -12470, -16915, -14756, -8028, 798, 12884, 9144, 9936, 18215, 22278, 2558, -27043, -18114, -5565]
9828e565j298k6997J7257J2143r347M733N129J3909L945J975k873j5421O778J0345
9814A4713r034L169j2204q371K581N304R95j4071Q453L30O414P099R566J8560
9800C3504J5995n247j9970n401J6010M891l768j1734j7208k955J5147o419j7732
9787d887p321K832j6100M009K1851K8409o145k8275q269l328J2927J6637J1293
9774B3633j4419k1879n677L245m606p0L0834J1988k668k310k4027k4230Q155J407
9760b0624L405o823l635K5865J0617o381k0937r945J774J5815L326m484Q769r525
9746a2783N707J5557j6245p369k7408o439P726J0309j2058J0564m609J031K5043
9733a0974K3516j7920j9087k4173P948K240K0254J561M798Q05r736J0856K1711
$$ y = [-5565, -6863, -33860, -16603, -4460, -13807, -9074, -3945, 9964, 13909, 15884, 13011, -2410, 4368, 14713, 5679, 8848, -3356, -11727, -9146, -3842, -2847, -16918, -8465, -8135, -1721, 5378, 14944, 33504, 49499, 44252, 24282, 18881, 34891, 39782, 36014, 24280, 7072, 4117, 19264, 12845, -4887, -12208, -9376, -25476, -21467, 384, 28793, 22648, -5627, -13896, -17224, -4297, 12340, 23633, 9214, -12665, -18342, -15097, -19703, -19773, 11061, 23049, 20381, 18071, -5956, -30186, -22031, -20624, -17219, -24042, -27677, -1812, 8805, 2424, -18513, -28458, -26684, -10869, -7543, -12027, -3258, -12783, -7076, 8481, -7764, -15133, -42541, -48980, -41254, -30945, -43003, -32439, -37048, -36017, -10974, 12542, -5378, -24465, -48638, -40690, -38450, -18196, -16635, -11837, -11032, -20768, -9912, 11799]
9720A1799j1385r771j3800M454J3924Q966J0849r81J3294L566n632j5165J833
9707A1951J2647k8262j577J1236L210k3K632q816m153N708p95L584J4705P78J277
9692B4102k330r749m338j459J2356P158L904R69j6528j8184M70J4691m607p314
9678h59m238k3437P529J7840O231K7931l428q282m34j4317M495j8112r580k5863
9664d4524j7318J3235M600L9739L4287L1905q627k4144O981q754j8333j1429J9473
9651A7091N82J1279M525l541j4879J0719q979q825m806k1581j2927p729J9049
9638b0022J5967J3589m612k1358J4817p586J1010K7128J731J485m982p012j3126
9625G029K2285L0197o614q765l1222r619n005J5557L924m963p972J1617K0643
$$ y = [11799, 414, -9357, -23157, -18703, -4779, 4187, 15036, 14055, 27349, 30915, 25283, 10118, 11951, 24598, -3664, -5241, 5995, 9205, 9182, 11814, 2998, -1155, 4553, 3758, 7342, 22047, 22825, 24102, 21772, 12023, 7685, 6226, 18582, 25740, 29644, 30613, 14085, -4099, -3629, 11062, 6455, -859, -5097, -28534, -21005, -3165, 3066, 30997, 27569, 19287, 18853, 4536, 9031, -9081, -18661, -44524, -61842, -48607, -44007, -4268, 30019, 61924, 53297, 29153, 36134, 27380, 9047, -2382, 17091, 17673, 28952, 33477, 29936, 15057, 25776, 16797, 7972, 3166, -18415, -31342, -39071, -20022, -4055, 9534, 4922, -16436, -1619, -9205, 1805, 28933, 30664, 32149, 27167, 20155, 7029, 29314, 59511, 52897, 44132, 12910, 3291, -1714, 13843, 17767, 12804, 4832, 16449, 37092]
9612C7092j1255k4536J1139K6485Q39q646M435j7004j850J7667j0515j7107J956
9599H700J698K3922j0227l2019m700J8576n890R898j9767o420J329J625Q170K330
9585b775p110J0678K0039P770k240Q190k762n093L573m164j2994K1064J8328J8507
9571G1011j8291k7075r138J699J5796k665l0569j2409q567k363K160j5314j3470
9558d9195J6326J1032L1610P948j266j8612J7194J2771k9707j0062R817L752n82
9545A026O343N900K6462J3917k0402k4577L570J4324r337k855j4636l766L6160
9532C2129r162k4157K0244J8059j8365r88K6316l836k6530P91P817j9335j8109
9519a5126M314k4367j5144N104K1158Q452j6229j45J5116j3784r570J1640R549
$$ y = [37092, 25837, 1301, 12440, 38925, 39764, 31118, 35553, 18549, 16699, 34366, 23851, 6744, 8700, 10398, 34320, 24093, -7926, -12626, 5950, 60, 9958, -9809, -16229, -14900, -13275, -5105, -2775, -9885, 793, 20832, 28602, 26362, 34552, 31790, 26697, 30270, 26106, 13112, 34176, 52504, 71011, 52720, 25645, 16507, 18206, 34002, 31337, 768, -11641, -20208, -22571, -20411, -35725, -49195, -32869, -21837, 9773, 17721, 16455, -2157, 15037, 27808, -1899, -11961, -2144, 1608, 1026, 7369, 13269, 39731, 53648, 33246, 8669, 12239, 26563, 17226, 14371, -265, -4031, 32129, 22967, -1190, 19054, 37113, 18748, 17760, 44076, 40240, 13710, 14501, 22318, 2983, -15126, -10812, -35179, -50323, -45219, -24061, -15609, -31838, -31983, -16867, -30651, -40221, -28581, -19032]
9506a9032R201K1747J1100J0444j1888l2770m479n627J376J5508J6740K1282n15
9493C3087k4518m4j0525n816J427N780j1250k2318j2806L5933L3070J0800o95
9480C2125J0596r162o682k984j1892J1920N977m84r964K01J1193o820N7j7601
9466F480k104o049K5413M124j3520m412J2537Q697J4277R945M011J844j7696r108
9452C4439k849j0036Q585L149k76k666J2611K500J1369K8665J2471L831M679K6851
9438A33323J3418k1360j4126l9736l1896o255L530K6322l934J0583k936k8435
9426C8498P106J1494j6326j3589J6850L4406J0866m085J1703J0510L414o323J4445
9413A18969J7662n807q164K046j3796m7845l2274j1696R952J2305j5914j5712
$$ y = [-19032, -9831, 11916, 23016, 33460, 21572, -11198, -15677, -21304, -19928, -4420, 12320, 33602, 33087, 8569, 8525, -2000, -7816, -6389, -609, -11859, -34177, -46983, -11050, 22020, 32820, 32125, 42721, 33559, 26877, 23893, 12001, 23921, 29898, 29414, 19450, 19651, 30844, 24024, 24081, 6480, 4376, -1673, 23740, 27864, 14344, 9932, 22469, 31166, 45443, 55388, 59399, 61243, 43547, 34439, 31590, 21554, 30139, 33288, 33012, 30346, 42957, 45457, 56826, 85491, 97962, 101793, 106472, 133323, 146741, 125381, 111255, 71519, 39623, 33368, 36898, 63220, 59286, 69869, 66933, 38498, 45604, 57098, 40772, 27183, 44033, 78439, 89305, 85220, 96923, 107433, 110847, 104524, 118969, 136631, 130824, 122660, 124706, 110910, 63065, 30791, 19095, 29047, 41352, 25438, 9726]
9401I726J7034K591k2063j1187J7793J1946P195j863Q046n525o050R92j2045P684
9387B4274K3224m322j2349J0194L5696M828j7715r938j2985J718k12j5853J3602
9374D0162K3807k773j0480J9649J3511j1371j3691m779j0753o852R206P640Q292
9361F1568j4237o124J9289N552k5230k4272J8056N2150J5684k4585j3178q480
9349E6193j5923l482J3333p695M686k2009P422K2370k279j3025o935r009J9318
9336D2965m842J3786J1734k4456p617Q360J023m747J395M493J7637J1919j4106
9323E7544k603K3202L995n867n828p454k8262J149O335p67q652J5368Q329L186
9309E9675J5885r707j871R466K3129J8144R610k0819j2534k4865p531J6529K1910
$$ y = [9726, 26760, 29351, 7288, -3899, 13894, 25840, 33035, 31172, 39218, 33693, 27643, 28635, 16590, 24274, 47498, 43176, 30827, 41021, 76717, 81545, 63830, 53892, 40907, 42625, 42413, 26560, 40162, 63969, 61196, 50716, 70365, 83876, 72505, 58814, 54035, 43282, 36430, 45636, 53276, 61568, 47331, 41207, 60496, 66048, 40818, 16546, 34602, 86752, 102436, 77851, 64673, 56193, 40270, 36788, 50121, 42426, 47112, 25103, 32525, 54895, 52616, 39591, 32656, 23647, 42965, 38123, 51909, 63643, 39187, 31570, 39930, 40953, 36206, 37601, 42094, 59731, 71650, 57544, 54941, 78143, 82138, 76271, 70443, 62989, 34727, 35876, 42211, 41444, 32792, 48160, 56489, 59675, 75560, 65853, 63982, 73448, 96577, 114721, 124331, 103512, 90978, 66113, 58582, 75111, 97021]
9296I7021j1790K5826O196l0600q563o435j0652j0320o823P314M6979J7649k1934
9283I3868l3385K4022Q735k5052r588P73P353J0643J3704r787r216j0582m1327
9270B0161J0911K0125Q567n860M474N809L226L6031J7164j8583n430Q07k666l686
9256I1050K1497K0203J0426l9700p785j1745m540j080l059L387K1613l133J7702
9243A14836J5099Q671q937J9539l2870l7533j1196j0355L8041M4910K6575j433
9231A65347k6322n111k8401j1252q699l304R580P324j6643j1842J7147K5096K1447
9218A34367Q008O71P53P70J4426k1851j0037j00o303L94p014l479J3990K5969
9204A50564n557j1900Q054L1559J6988K747k65q307k3851k1671N063L8397J6816
$$ y = [97021, 85231, 111057, 117253, 86653, 78090, 71655, 61003, 50683, 43860, 51174, 98153, 115802, 93868, 60483, 84505, 93240, 68188, 58600, 59373, 66726, 77369, 91073, 81286, 72070, 61488, 20161, 31072, 51197, 59764, 53904, 58378, 64187, 67413, 103444, 120608, 102025, 96595, 97402, 94736, 91050, 112547, 132750, 143176, 103476, 95691, 83946, 79406, 78326, 75267, 78654, 100267, 97134, 114836, 129935, 138606, 129669, 149208, 116338, 78805, 67609, 57254, 95295, 140205, 166780, 165347, 139025, 133914, 105513, 94261, 85562, 82258, 91838, 99162, 82519, 70677, 87824, 112920, 134367, 142375, 143046, 143799, 144569, 158995, 137144, 127107, 127007, 120704, 121098, 114084, 110605, 124595, 150564, 145007, 133107, 141161, 172720, 189708, 192455, 192190, 183883, 160032, 138361, 143424, 181821, 198637]
9191A98637l494o267P308J3103L2567Q911j4988O530Q213k9415j549P973j966
9178B25563k716J1664n544o252n530P873P986R659N123L162j7942j4923J4832
9165B32955Q717k2142k7606P796J7263O125M160P938N576O271J2037o649J7945
9152B70386J3662O896j3788l1234p96j2006J4850N2744K2537L477Q578J0356M134
9139C49796P776l213J0841r137j9865k6664j4049K3951k441j2943J0114J7746
9127C31912o349l255J645m583o313j7195j2989J3730L946n378J0516L537j4101
9114B95123m831j0505j7814K780k785M723N143j5570L8663K3406o577O922j1642
9101C07036j1281Q888L4186J6986j5552o377P005l237J3559K2694J8877j067L480
$$ y = [198637, 195143, 188876, 196184, 209287, 241854, 250765, 235777, 242307, 250520, 221105, 219556, 227529, 225563, 222847, 234511, 228967, 222715, 217185, 225058, 233044, 242703, 247826, 250988, 233046, 218123, 232955, 241672, 219530, 191924, 199720, 216983, 223108, 227268, 235206, 240782, 247053, 259090, 252441, 270386, 284048, 290944, 277156, 245922, 245126, 233120, 247970, 300714, 323251, 326728, 335306, 345662, 349796, 357572, 354359, 365200, 356063, 336198, 309534, 295485, 319436, 316995, 304052, 314166, 331912, 325563, 322308, 323953, 319370, 313057, 295862, 282873, 296603, 300549, 295171, 305687, 309224, 295123, 290292, 279787, 261973, 264753, 261968, 266691, 271834, 256264, 294927, 318333, 311756, 318678, 307036, 295755, 304643, 338829, 355815, 340263, 333886, 340891, 337654, 351213, 373907, 392784, 391717, 395197]
9088C95197R606J763J1342j4701r962j1970r739J3031J0035j6386j693p513P858
9075C76868K562P443J9628j5694l8588k468J450J1959J6377M13n219j2689M301
9062C66343j0471K347J9713k5662o929K6350J1707L266j5925m513j3025O543n123
9049C54621j1899P500L1380P293K874l053J2349L330j199M406J1769J0896k4318
9036D05949j4664J6437J9390k637J676P324J2329K857K6437L9429m887N239J1606
9023E26485J843Q49k36j6315j4067K73o448j0314m686P856j4268j2656o681L1248
9009D82883n00k0346K899j67o721J0755k339Q534o575J3889K25j0640M3J2284
8995D84224K2012J6469j2542k51J3093J1744J2050K047m305k0619k0967J1261
$$ y = [395197, 404803, 406566, 417908, 403207, 393245, 381275, 371536, 384567, 394602, 378216, 376523, 369010, 376868, 379430, 386873, 406501, 390807, 352219, 349751, 351201, 363160, 379537, 379950, 374731, 362042, 366343, 355872, 358219, 377932, 352270, 345341, 371691, 383398, 386664, 370739, 366226, 353201, 359744, 354621, 342722, 350222, 381602, 388895, 391769, 388716, 401065, 404395, 403196, 407602, 419371, 430267, 405949, 391285, 407722, 427112, 424475, 426151, 433475, 445804, 448661, 475098, 514527, 509640, 514879, 526485, 528328, 529177, 528941, 512626, 498559, 498832, 492384, 482070, 477384, 485240, 470972, 458316, 451635, 482883, 482383, 462037, 464936, 464769, 458048, 468803, 466464, 474998, 468423, 482312, 482537, 471897, 471940, 484224, 506236, 522705, 510163, 509912, 523005, 534749, 546799, 548846, 544541, 523922, 502955, 514216]
8983E14216j84k036J8159K7288m759k868J4110Q97p301m834J9926M5484J1548
8970F29646p53k9508K882o679j8112q700j7563q418J8242p185j1636j6800j2610
8957E12806P004P279J9501o100j4689p647J2129r124k2322j9143n881j2706m084
8944D57023K3066K243j0791j3660l1685j6807O468o84q31K977K1864L327l012
8931D39498r481M93k636Q187K7177K0915K955J0995M194O918K3337L447m027j9200
8917E12772j8579j3752k6303r657j6220j0412l2706j9441J947K198J4681J2568
8905C97096j7030j7084L697J2157J2164J4630j2228j5665j8701Q154j0295J664
8893C58559j3290k9094j0837M109n572k3397O117l2109n5066J183L8871J3531
$$ y = [514216, 514032, 511996, 530155, 557443, 552684, 549816, 563926, 564823, 557522, 552688, 572614, 618098, 629646, 628893, 599385, 602267, 595588, 577476, 568776, 551213, 542795, 561037, 553852, 542216, 525416, 512806, 519810, 527089, 546590, 540490, 525801, 518154, 530283, 521159, 498837, 479694, 473813, 461107, 457023, 480089, 482332, 471541, 457881, 426196, 409389, 415857, 415173, 414342, 417319, 439183, 442510, 439498, 430017, 430510, 427874, 436061, 463238, 484153, 487108, 498103, 502297, 509215, 532552, 535999, 531972, 512772, 494193, 480441, 454138, 444481, 428261, 417849, 385143, 365702, 367649, 369847, 384528, 397096, 380066, 362982, 366679, 378836, 391000, 405630, 393402, 377737, 359036, 367190, 356895, 358559, 345269, 316175, 305338, 309447, 303875, 280478, 286595, 254486, 199420, 200603, 239474, 253005]
8881B53005P560K85N99J6727N101J5175M2024j602j1978O966j1565k7365R195
8868C04127J5314J355O735n007L786m598N967m504k397j5307j0786j1559k9885
8855B53241q100M092j5757k5504j5004N162N091r13j147o509j901J2576M3835
8842B49162L406j0281l0249j767j1252J8256J2163p566J060r467P887o102J1264
8829B26514Q091m496r239J0608k47L1127K0025q707J0251J6173N32N640r041j2271
8815B84960O146J8872J2513k6283k5929p961j0874Q264M1751J3779k54k4721k0126
8802B70137j4379j4395J90n363J2707L6730J4872R142np952M098J5972K0996J6530
8788C59280p572n297k591j6400k6731J345K7619J1677q664J2355J268K2582L2135
$$ y = [253005, 260565, 260850, 261449, 278176, 283277, 298452, 340476, 338874, 326896, 333862, 322297, 294932, 304127, 319441, 320796, 327531, 322524, 326310, 321712, 327679, 323175, 320778, 305471, 294685, 283126, 253241, 245141, 249233, 233476, 207972, 192968, 198130, 203221, 202308, 201161, 194652, 192751, 205327, 249162, 252568, 242287, 212038, 210271, 199019, 217275, 229438, 221872, 222932, 213465, 221352, 215250, 226514, 234605, 230109, 220870, 231478, 231231, 262358, 282383, 273676, 283927, 300100, 300632, 306272, 297231, 284960, 291106, 309978, 322491, 296208, 270279, 262318, 251444, 259708, 301459, 315238, 314984, 290263, 270137, 255758, 241363, 241553, 236190, 248897, 285627, 300499, 309641, 309636, 301684, 305782, 321754, 342750, 359280, 351708, 346411, 343820, 327420, 300689, 302034, 329653, 341330, 332666, 345021, 346289, 368871, 401006]
8775D01006K2181J4133K5169j5202m8645o429K9371J1716j1445J8506j7572m705
8763D18084J2499K1129k6947l2006k6921q924J0542j261J0290j7412k3466J5384
8751C50991K7089J3855j8032K0937n896J1597J8741J2048K3909J6914j334k8476
8739D42343k2340J3335Q392L913L2191J7019J7942O677j889M7574J8927O518J8193
8726F08795K0074P564K3082N992m400L590k826j4879k0996K445K56k4025j7774
8713E86898J7629j0958j5495J6072j969j6827O348l738R77p706l901k423R203
8700E74110O796k791j4701J4008J6074m551p283M5490K2961K409J1897R868P787
8687F82074Q755K3005L1967M9437J9177K213L9448L4327K6235N5390K7863J9928
$$ y = [401006, 423187, 437320, 462489, 447287, 398642, 392213, 421584, 433300, 421855, 440361, 422789, 418084, 430583, 451712, 424765, 392759, 365838, 356914, 367456, 366195, 376485, 359073, 335607, 350991, 378080, 391935, 373903, 394840, 388944, 400541, 419282, 431330, 455239, 472153, 470819, 442343, 420003, 433338, 441730, 445643, 477834, 494853, 512795, 519472, 517583, 565157, 584084, 590602, 608795, 628869, 636433, 659515, 665507, 661107, 664697, 661871, 646992, 625996, 628441, 628697, 604672, 586898, 604527, 593569, 578074, 594146, 592177, 575350, 581698, 577960, 578937, 571231, 567330, 564907, 574110, 580906, 578115, 563414, 577422, 593496, 588945, 581662, 627152, 650113, 652522, 664419, 674287, 682074, 690829, 713834, 745801, 795238, 814415, 816628, 856076, 890403, 916638, 972028, 999891, 1019819]
8675A019819K5067M071m3416j6589k6897j6963l9678l6224m4641m3867j2678N789
8663G73793J3020p442l3646l3184k61r827M201j5815k2468J1835L582k93Q569
8650F92064Q780J3767o360K0586J8315J8666K5346L0252K5498J3652J1701K8078
8638I00345M9257N0877N0327K4067K4850L6089N5608q290K001J9249q44o425J12
8625A197223j2962j8638p923l3942m2218l5297m4684n7022m0037l7045k8943p925
8613H30587l9411m3050k9165j9655j542Q111k1474N79P342j2692P95J0639q84
8600F90180J4985J7689L5212J4962L8814K0462j9855J1092M1658N9213M2529K5470
8588I92411O204J3799J4812J7117J3872N908K4786J3291j1528j3184K6633k5643
$$ y = [1019819, 1044886, 1048957, 1005541, 988952, 962055, 945092, 905414, 869190, 824549, 780682, 768004, 773793, 786813, 779371, 745725, 712541, 712280, 702453, 706654, 690839, 668371, 680206, 683788, 683495, 692064, 700844, 714611, 708251, 728837, 747152, 765818, 791164, 821416, 846914, 860566, 872267, 900345, 949602, 1000479, 1050806, 1074873, 1099723, 1135812, 1191420, 1183130, 1185131, 1204380, 1203536, 1197111, 1197223, 1184261, 1165623, 1157700, 1123758, 1081540, 1046243, 1001559, 944537, 904500, 867455, 838512, 830587, 791176, 748126, 718961, 699306, 697764, 705875, 684401, 684980, 692322, 679630, 680425, 691064, 690180, 705165, 722854, 758066, 773028, 811842, 832304, 812449, 823541, 865199, 924412, 966941, 992411, 998615, 1012414, 1027226, 1044343, 1058215, 1064123, 1088909, 1102200, 1090672, 1077488, 1104121, 1078478]
8576A078478n7121l4049l3986n0479m5054m6932o1147l0582j5951m3100k2367
8565F37710j8548j5518m273r763J1196O708k5637j8450M273j607q703k0157M105
8552E41336J2392J0898r541P049N266J6218K9799k09Q780K5115K2263K1795L0475
8539G21636J0713K1865J4769k1366k5151j9099j8055k7803O169k1441k7326j2160
8527F02751k2272j5146j1783j6611n3446Q85J8669M005o54k0524k2295k2074J4504
8514D56009k0118j8129p345k301q320j8076K3175j181q133M943J6968J7717J4926
8501D50135j8548Q423J3181o825k619J1405P049O676j989p222n639Q678N726M157
8487D72588O930q378K739k7230k1870R622M081k0983K482m768n094m450M471o815
$$ y = [1078478, 1021357, 987308, 953322, 902843, 857789, 810857, 749710, 719128, 703177, 660077, 637710, 619162, 603644, 599371, 589608, 600804, 607512, 581875, 563425, 567698, 566091, 557388, 537231, 541336, 553728, 564626, 555085, 562134, 567400, 583618, 613417, 613208, 621988, 647103, 669366, 691161, 721636, 732349, 754214, 768983, 747617, 722466, 703367, 685312, 657509, 663678, 642237, 614911, 602751, 580479, 565333, 553550, 536939, 483493, 484378, 503047, 507052, 506398, 485874, 463579, 441505, 456009, 435891, 417762, 410417, 408116, 399796, 381720, 404895, 403714, 395581, 400524, 417492, 435209, 450135, 431587, 440010, 453191, 446366, 443747, 455152, 462201, 468877, 466888, 459666, 454027, 462705, 468431, 472588, 479518, 471140, 473879, 446649, 424779, 434401, 438482, 417499, 419981, 415213, 410119, 405669, 410140, 403325]
8473D03325k274r744j7402o640L952L9882k963k2411J4147L512k6842j2519J2899
8460C76922J4690J2757j0410j5393k305K221N531j0378J526j000j0250M841Q861
8447C77613J164K675Q140J6357O952Q083Q689q110O17j729k1191j6735M881J8745
8433D06151r74k1408q021K199K801J6289K406K8k4316R79j0982K574J6598J1402
8419C95726k329p374L467k033J9784J0747j9910N66J8482R122r155j5500k1607
8406C79986j8161J0379j2786j3159N842Q64p900l169q940n504K6333l715p446
8393C42624k0246j4409R931K1199M31j7764j3006j3394j2687j079n942J2009L7076
8380C24743Q508L719J3931q112j9727J916J8554k9835q228J2817N431j2635j5543
$$ y = [403325, 401051, 391307, 373905, 367265, 371217, 411099, 408136, 385725, 399872, 403384, 376542, 364023, 376922, 391612, 404369, 393959, 378566, 376261, 378482, 384013, 373635, 375161, 374161, 363911, 368752, 377613, 378777, 381452, 389592, 405949, 412901, 420984, 429673, 421563, 422180, 420451, 399260, 382525, 387406, 406151, 405177, 383769, 375748, 377947, 380748, 397037, 399443, 399471, 375155, 376134, 365152, 367726, 384324, 395726, 393397, 386023, 389490, 387457, 407241, 417988, 398078, 398644, 417126, 426248, 417093, 401593, 379986, 361825, 372204, 359418, 346259, 352101, 352965, 345065, 341896, 332956, 327452, 353785, 350070, 342624, 322378, 307969, 317900, 339099, 339530, 321766, 308760, 295366, 282679, 281600, 275658, 287667, 324743, 333251, 336970, 350901, 342789, 323062, 324978, 343532, 313697, 305469, 318286, 323717, 311082, 295539]
8367B95539k8512j7584K6444M2670q233l0014r946J0118j5423q298m335J8604
8355B71030Q586J4544l3966j9656O781j730N355J8280k224k9658j3159p007O325
8342B23501N723k16N197J1070m405J200N518P650j4512J506J210R293L812O686
8328B63233O537k7715k7209q623O192n484K1945P788r949J1913J4435O163o031
8315B53195p155M682r962P245q85j8799k5119k754l197J3749L4282J5552K3375
8302B84209M305J1728q669j4209j6366Q314r425j6244m621l7894o381M598J5290
8289B14635J1928L84L294r017k1757K099j523j5197J5480J7872J5036m020J6364
8276B45578p770r338P070N373j8869k3970o462L498J2374O483M050R845k1797
$$ y = [295539, 267027, 249443, 275887, 318557, 310324, 280310, 270364, 280482, 265059, 256761, 252426, 271030, 279616, 294160, 260194, 240538, 247319, 245589, 250944, 269224, 267000, 237342, 224183, 217176, 223501, 229224, 229008, 234205, 245275, 240870, 242070, 247588, 255238, 240726, 242232, 243442, 252735, 256547, 263233, 269770, 242055, 214846, 206223, 212415, 206931, 228876, 236664, 226715, 238628, 253063, 259226, 253195, 246040, 250722, 240760, 248005, 247120, 228321, 203202, 200448, 197251, 211000, 245282, 260834, 284209, 288514, 300242, 291573, 277364, 260998, 269312, 259887, 243643, 239022, 201128, 194747, 199345, 214635, 226563, 226947, 230241, 221224, 199467, 201566, 200043, 184846, 200326, 218198, 233234, 229214, 245578, 237808, 228470, 235540, 240913, 222044, 198074, 191612, 195110, 207484, 213967, 218017, 227862, 206065]
8263B06065R283K2706L5672k6098o346K3397J6630m282k1392j3642L280K6070
8251B71343m726o062l373o518M335j6560K5181N836j6023J4337K9601J4705k712
8238C09364p114M290J1837J3895K0013L2930L0164J7517L2607K6545M4702Q586
8226E45336l592K8051L4453L2365L6867J4696j4653k5086n5828k6103j9559n0290
8214D96657m0634o573j1651N495j2038l2691k2165l963Q169N78j4447j5202J8948
8201C70483J7833L348j9081n513M2054J4037P100R916m685q183P728L8530L7766
8188E11333L7278J8023P913j1322j3446M506J5754k0452k7404o203K5453J1746
8176E53179R171O825l528K1264K397r036L5153J5303k70K135J516r666k0910k4126
$$ y = [206065, 215348, 238054, 273726, 247628, 241282, 264679, 281309, 277027, 255635, 241993, 245273, 271343, 266617, 260555, 257182, 250664, 254999, 238439, 263620, 269456, 253433, 267770, 297371, 312076, 309364, 302250, 306540, 318377, 332272, 352285, 385215, 415379, 432896, 465503, 492048, 536750, 545336, 541744, 569795, 604248, 636613, 673480, 688176, 673523, 648437, 592609, 566506, 546947, 496657, 456023, 449450, 437799, 443294, 431256, 398565, 376400, 372437, 380606, 381184, 366737, 351535, 370483, 388316, 391664, 372583, 367070, 409124, 423161, 430261, 440177, 435492, 427309, 435037, 473567, 511333, 548611, 566634, 574547, 563225, 549779, 554285, 570039, 549587, 522183, 515980, 541433, 553179, 562350, 569175, 565647, 586911, 589308, 580272, 615425, 630728, 630458, 632593, 634109, 624443, 603533, 579407]
8162E79407j8393j408K5497K1758l2125l4761o033K234k2762l4784k4223m3054
8150D11353m4074L759j878R399k8809k2019j630J9465o417l2646K889J775m159
8137C07008l524k7750K135M775K585K2588L2568M107p402J9377K1954J466M9416
8124D29303L1871M0385K3985J8279J0330q280n394j5101k4463k7523l3619J1530
8112D51303k9067k1663j2044p394j4980k7338j5763l248j3770k4109k6413k2763
8100B32751P243M887j6631O925K7722j4148J8029q254l4224j6004J4574K7620
8088B50490n848K0621K9001J3519J0681L1531K1820K0952K5524J5176k5901l7969
8076C69597k2885q026m0588l5655l026J6987J1754J2567L749J1029J4336M26Q682
$$ y = [579407, 561014, 559606, 585103, 606861, 574736, 539975, 533942, 536176, 513414, 478630, 454407, 411353, 367279, 371038, 369160, 378559, 349750, 327731, 326101, 345566, 339149, 306503, 309392, 311167, 307008, 303484, 275734, 277869, 282644, 285229, 307817, 340385, 344492, 337090, 356467, 378421, 379887, 429303, 461174, 501559, 525544, 543823, 554153, 545873, 540479, 525378, 500915, 473392, 439773, 451303, 422236, 400573, 388529, 381135, 366155, 338817, 323054, 319806, 306036, 281927, 255514, 232751, 239994, 244881, 228250, 235175, 262897, 248749, 266778, 258524, 224300, 208296, 222870, 250490, 244642, 265263, 294264, 307783, 318464, 349995, 371815, 392767, 418291, 433467, 407566, 369597, 346712, 338686, 298098, 262443, 259417, 276404, 288158, 300725, 304474, 315503, 329839, 330265, 338947]
8063C38947J4232J429K4107M6339J7423J5215J2730L4059N3125M2099N1858O9347
8051G20910K3129K6634K7701L792J7598L226J3264j1170j6257l8702l0483k7578
8039G12064K4547M8930O5783Q1784P5535N6357J3490j7045l4700l3202m5934o9974
8027H77635m7236k1769j167p165j4177p943R440K2623K9176K1805K1715K9642
8015I12579K9585J2952O777J1595L3680L8763O1372Q0436J19369R7843J26094
8004A531045J36431J21851J22573Q7703O8240L6869n346K4539J3280k7685k3451
7993B086049n0347r4251j01775q5425o2962j3813k9912k6257j4484o2445o9730
7982A474648r5501j09227q2502n9035m0180m1470l1908l6772j327K1377M843J669
$$ y = [338947, 353179, 354608, 378715, 425054, 442477, 457692, 470422, 504481, 557606, 599705, 651563, 720910, 744039, 770673, 798374, 802166, 819764, 822990, 836254, 825084, 808827, 770125, 739642, 712064, 736611, 785541, 851324, 933108, 1008643, 1065000, 1078490, 1061445, 1026745, 993543, 947609, 877635, 830399, 808630, 807463, 800298, 786121, 778178, 787618, 810241, 839417, 861222, 882937, 912579, 942164, 955116, 961893, 973488, 1007168, 1045931, 1107303, 1187739, 1307108, 1404951, 1531045, 1667476, 1789327, 1911900, 1999603, 2067843, 2104712, 2099366, 2123905, 2137185, 2109500, 2086049, 2035702, 1941451, 1839676, 1754251, 1691289, 1677476, 1647564, 1621307, 1606823, 1544378, 1474648, 1379147, 1269920, 1187418, 1128383, 1088203, 1046733, 1014825, 978053, 976726, 998103, 1002946, 1004615]
7970A004615j5526p964J0668J4454J8032M3430K9214K4841N3000O1737P1491J00632
7958A408624J14331J19388J18395J42835J80191J75677J75553J34822R3832J6457
7948B680105l9249j17374j61067j61859j72887j74267j43486j30656j20827r0194
7938A368239m7810m6692o7387n9946m3763l8421m4629m8854m5973m0745k8814
7927H55205k8498j8300j7940j7801l9036l9122j4896N057k1747j7344L435K828
7915F51841r265k629K9952K7823M9704M4497L7424M3559P8006L8386O7433P7918
7903A134649J8038j1818l1905k410k5942m6294p2654n6628m4279l1643q472j203
7891H19439J923J3830N186k3896q497j2167k7665n6189q4033k4757k7351m0335
$$ y = [1004615, 989089, 981125, 991793, 1006247, 1024279, 1067709, 1096923, 1121764, 1174764, 1236501, 1307992, 1408624, 1522955, 1642343, 1760738, 1903573, 2083764, 2259441, 2434994, 2569816, 2663648, 2680105, 2640856, 2523482, 2362415, 2200556, 2027669, 1853402, 1709916, 1579260, 1458433, 1368239, 1320429, 1273737, 1206350, 1146404, 1102641, 1064220, 1019591, 970737, 924764, 884019, 855205, 826707, 808407, 790467, 772666, 733630, 694508, 679612, 684669, 662922, 645578, 649013, 651841, 642576, 639947, 669899, 697722, 747426, 791923, 829347, 872906, 950912, 989298, 1056731, 1134649, 1152687, 1140869, 1108964, 1106554, 1080612, 1034318, 961664, 905036, 860757, 829114, 820642, 819439, 821362, 835192, 840378, 816482, 807985, 795818, 768153, 711964, 627931, 603174, 575823, 535488]
7879E35488m2936n7674k3775k0010K784j4350m7272k0634k9978j7551q051n9467
7867A96574Q37K5154R194o577O308j9466k4160K6295Q069k1686J3528J5086Q955
7854B38111K5900Q558q533M005J6720R431k634K0877L0592L2770J4589J3317K708
7841D06411K5462Q224k466j3809j7498k4365l7545m3674k2781j8012l8859k9454
7829A91634k8067k4889l533J6726o469K645O822r261j2077j5022p186Q721J1202
7816A31246q47J919j7688L796N393P507J996q742L169j1561j2510L542J8111J6161
7802A41492j0576l58J4548K0188K7451P03K2442L5781M252P19k1196m8431q604
7789A78411j3012l2143l2011j6532q375J1202N849k3564M394R529k70j0062R569
$$ y = [535488, 492552, 434878, 411103, 391093, 393877, 379527, 332255, 311621, 281643, 264092, 256041, 196574, 197411, 222565, 231759, 225182, 231490, 212024, 187864, 214159, 222228, 200542, 214070, 229156, 238111, 264011, 272569, 264036, 268041, 284761, 294192, 291558, 312435, 343027, 375797, 390386, 403703, 406411, 431873, 440097, 437631, 423822, 406324, 381959, 344414, 300740, 277959, 259947, 221088, 191634, 163567, 138678, 135145, 151871, 145402, 148047, 154869, 145608, 133531, 118509, 111323, 120044, 131246, 130399, 132318, 114630, 118426, 123819, 131326, 133322, 124580, 127749, 116188, 103678, 107220, 125331, 141492, 130916, 130558, 145106, 165294, 192745, 193448, 215890, 251671, 255923, 256642, 235446, 187015, 178411, 165399, 133256, 101245, 84713, 76338, 87540, 93389, 69825, 74219, 83748, 83478, 73416, 82985]
7776H2985J6310m912j4822j2947q816L056J5498P356J8286L000l143j7416k2723
7763F1712q450J1010J8559J6694j793P837k6161l0643n270M91P557J570N013K3467
7749H1593N358J1390Q173o38q52p913O811m413j163j0371k0256k0002j11J1454
7735E9060j338j0729p364R750k70j1571j8947j7371K843J6932J0667q520o079
7722A7063J5426J7471K527j9535P627N643O09l050j978l3030K344K1905k314m474
7708B6234N690O371M629J4106j0728l806j8835r128O3Q051K3932j3147l603j6250
7694A3579j0345k7011l657K0659K5075J0661l216l079j2099J0602J6258N015j4047
7681B8395J7594J6560j4121k4805j8326k6418J454O163j370m845J2341o487K4770
$$ y = [82985, 99295, 94383, 79561, 66614, 57798, 60854, 76352, 83708, 101994, 104994, 101851, 84435, 61712, 53262, 64272, 82831, 99525, 97732, 105569, 79408, 48765, 43495, 43986, 51543, 53113, 58126, 81593, 86951, 98341, 106514, 105876, 105024, 97111, 103922, 99509, 98346, 87975, 67719, 47717, 47606, 59060, 57722, 46993, 39629, 49379, 49109, 37538, 18591, 1220, 4063, 20995, 31662, 23142, 17063, 32489, 49960, 52487, 32952, 40579, 46222, 46831, 43781, 41803, 8773, 11117, 33022, 30708, 26234, 31924, 38295, 42924, 57030, 46302, 42496, 23661, 14533, 14596, 22647, 46579, 33432, 29829, 13579, 3234, -23777, -27434, -6775, 18300, 28961, 25745, 22666, 10567, 21169, 37427, 42442, 28395, 45989, 62549, 48428, 23623, 5297, -21121, -19667, -13504, -14874, -19719, -7378, -13865, 10905]
7668A0905Q06j559o36J4645j782k8080k1435O938L0199M514p272j3743j891R282
7654H91J4294J5094K2499K2006k793j8560k8261p317J617j6064j420J3922l423
7641A2485j1151r10p446J7563m948Q606L2993K031O570J8105m974j6087L136R20
7627E6893n198k7566q193M942O10M491J5971j2345m218j4416n530P334J3048K569
7613B8392J2713J5959O933l814l2231j8576j3978P121J7867j420K509q23j1832
7600H820o597k1130Q837J0402K079M945j5600q419J0263J0465R108n233o497n247
7586c804j26J7804O525J2238K734j034q056m562K3185J5706K7757q806j0728k477
7572F6356j2257K691n024M752J446j1352j457k409j0941j1357q173L611k548o044
$$ y = [10905, 11711, 10152, 9516, 24161, 22379, -5701, -27136, -20198, 10001, 14515, 7243, -6500, -8391, 891, 15185, 30279, 52778, 74784, 71991, 53431, 25170, 17853, 19470, 3406, 1986, 15908, 12485, 1334, 424, -7022, 10541, 5593, 14199, 47192, 49223, 55793, 73898, 68924, 52837, 55973, 56893, 51695, 24129, 15936, 20878, 21488, 25979, 41950, 29605, 25387, 10971, 5441, 12775, 25823, 28392, 41105, 57064, 63997, 60183, 27952, 9376, -4602, 2519, 20386, 18966, 21475, 20652, 8820, 2223, -18907, -10070, 332, 2411, 7356, -8244, -16663, -6400, 4065, 13173, 7940, 1443, -3804, -3930, 13874, 20399, 32637, 35371, 34337, 26281, 21719, 44904, 60610, 88367, 79561, 68833, 66356, 54099, 56790, 51766, 56518, 57964, 46612, 45155, 42746, 31805, 20448, 12275, 15886, 13338, 7294]
7558G294j1677M348J5043k088j3921l538j1404N045O682M217J1351q043k614J6223
7544A6918j674n48j2396m845O117m35m769q101M52r712j7248j2546K1566J9974
7530g247L8667J0801l0543k961j1294j311j0797J986R003J8254M299j919P09r107
7516H540J9781J2904j0398l112K6596j4113r873L92K496j5514K380k8341j3636
7503b1898J8127R543j3009J466J5188K5595R848j9858k4875p113j3474m994n326
7490c0780J0961K2697J7974m479J0884J3187n32k5498q456L32J6082R55q057J877
7476A7147j2531q867j0537p868K3234J926J35M455N26K60R563J58p694O223P360
7461B3490q751k8229q809J878J4339J3038j5469j4563k2815J6396Q509m40J9684
$$ y = [7294, -4383, -35, 15008, 12920, -1001, -4539, -15943, -10898, -4216, 1, 11352, 3309, 695, 16918, 15244, 14696, 2300, -2545, 3572, 3137, -1632, -9733, -9281, -18993, -36241, -48787, -27221, -7247, 31420, 42221, 11678, 8717, -2577, -3888, -14685, -12699, -3696, 14558, 18857, 16938, 17647, 8540, 28321, 41225, 30827, 27715, 54311, 40198, 30325, 30717, 33213, 17699, 20079, -8262, -21898, -3771, 5772, -7237, -5771, 9417, 35012, 44860, 25002, 127, -6986, -20460, -25454, -30780, -19819, 2878, 20852, 16373, 27257, 40444, 39912, 14414, 5958, 6290, 22372, 23327, 15270, 17147, 4616, -4251, -14788, -22656, 578, 2504, 2639, 7094, 7620, 7880, 17443, 17601, 9907, 16130, 23490, 14739, -13490, -22299, -20421, -6082, 6956, -8513, -23076, -45891, -29495, -20986, -21426, -1742]
7448a742j4646J2448L7447P415k3547p790J8439K610j6559j6707J1577J6686K003
7435B7634J8074j006n761j0726j4251j7910n45J2368p522J9381P510k4432k0438
7422a7624k2383M03L2841O883l429n696O262m156k8921q671m995M641J1334j746
7408c5257J4951L1492n596j2233J50j4788L018J5232q331j5439j887J6356M4459
7395C2127J4981j8613j1720k3873Q76N424j0473J4222J5271M3m512Q639l645j3352
7381E395j4712P303J1233J2206q409q706o675m952K663O494o364K0224J3659R023
7367C8382j8702K3536q919k3662Q563q785j2292R100K897N129n141m545K709j7604
7353i334Q23J6129R583j2568j5497l5622m449J8213K8099J9088k0906P787n521
$$ y = [-1742, -16388, -3940, 33507, 40922, 17375, 9585, 28024, 30634, 14075, -2632, 8945, 25631, 27634, 45708, 44702, 38941, 28215, 13964, -3946, -4491, 7877, 355, 19736, 27246, 2814, -17624, -40007, -39604, -6763, 120, -3309, -9005, -2743, -6899, -35820, -44491, -49486, -44845, -33511, -35257, -20306, 11186, 5590, -6643, -6493, -21281, -18263, -3031, -11362, -26801, -28688, -12332, 32127, 47108, 28495, 16775, -7098, -6222, -798, -11271, 2951, 18222, 18265, 13753, 22392, 18747, 5395, -9317, -2014, 9219, 21425, 13016, 4310, -2365, -7317, -4654, 1840, -4524, 15700, 29359, 38382, 19680, 43216, 34297, 10635, 19198, 10413, -1879, 7221, 10118, 15247, 10106, 5561, 8270, -9334, -8511, 7618, 17201, 4633, -10864, -46486, -50935, -32722, -4623, 14465, -6441, 1346, -4175]
7340d175J6134J8630P178n801j8606j7617J4678R373o108k187P877n440l2295
7327a8359M402J9795n586o655j2545j4036K663J1703K0072j3849j7466J1892K4788
7314F819K6698l140q451j6213j936l6820j5354M196K6285K1621L3591q47j5999
7301B0450j2750J116j4947J3865O863m03k3177k9411J359J4587j2412j0330Q384
7288c6806J5357J0132J5787m404k4056L741L3688O505l638J8352n7j3375p55k5791
7274e320k3619J2375O726N355q075j4411j274J4601n699m171p924O660K1611O638
7260C473p352K583o276n806j3642k207r517K6909L1168J3429j5093l3991j1339
7247b7661l040J6528J8009j9463l199L2684J0581j3355M07J1952j651j0365j8678
$$ y = [-4175, 11959, 30589, 37767, 31966, 13360, -4257, 10421, 19794, 13686, 11499, 19376, 13936, -18359, -13957, 5838, 252, -6403, -18948, -32984, -30321, -18618, 1454, -12395, -29861, -17969, 6819, 33517, 30377, 21926, 5713, 3777, -33043, -48397, -44201, -17916, 3705, 37296, 36449, 20450, 7700, 8816, -6131, 7734, 14597, 14194, -8983, -38394, -37035, -22448, -34860, -45190, -36806, -21449, -11317, 4470, 66, -23990, -20249, 13439, 19944, 16306, 34658, 34601, 21226, 20471, -5320, -28939, -16564, -9838, -4483, -12558, -26969, -28243, -13642, -19341, -23512, -31436, -24776, -3165, 3473, -3879, -1296, -7572, -13378, -27020, -29227, -38744, -11835, 19333, 32762, 17669, -16322, -27661, -30701, -14173, 3836, -15627, -18826, 13858, 24439, 11084, 11491, 23443, 21792, 11427, -7251]
7234g251L237J7773K2999j0189j0202j9601j3344M496K8087K3348J7348j6394
7222D0307j7360M270k1006R302m353j6103m779j2664K2808l707p602J9012L856
7209A1981k0066j6408l511L395p81J0492L4961j185p146l2840j4218N65K9408
7196e353k069j3796j5034K1583K6252K041j2012R865k1150q920K5208m641J401
7183C375l202k500j4609j0679J8260K9742r680k1036l0645n55K8026J4306k276
7170a473J1655l796k79K836J3747o29j2497j0133J720l7302J8082K7634J5618
7157B5183J7335M734k3328j4745l411p350r31K1523k7118k14K4877j4967l5313
7144c3725m162r244K482n823j502M0398J1505q021K3455N775j8400J1119J4758
$$ y = [-7251, -4014, 13759, 36758, 26569, 16367, -3234, -16578, -12082, 16005, 39353, 56701, 40307, 22947, 27217, 6211, 15513, 11160, -4943, -9722, -22386, 422, -3285, -10887, 8125, 11981, -8085, -24493, -28004, -24609, -25390, -14898, 20063, 18878, 11732, -21108, -35326, -34761, -5353, -7422, -21218, -36252, -14669, 11583, 13624, 1612, 11477, -9673, -18593, 6615, 1974, 3375, 173, -2327, -16936, -27615, -9355, 20387, 10707, -10329, -40974, -41529, -13503, 803, -1473, 10182, 6386, 6107, 8943, 22690, 22061, 9564, -569, 1151, -36151, -18069, 9565, 25183, 42518, 47252, 23924, 9179, 5768, -1582, -2513, 19010, -8108, -8322, 16555, 1588, -33725, -37887, -47131, -44649, -50472, -51974, -11576, -71, -8092, 15363, 21138, 2738, 13857, 28615]
7131B8615k5886j6434k766q949n882K4111K1255J4328l1043m5428q143J4432J1995
7118b9795P300j1583j6145n721L1857K3995j1137L740J1604L808r771j7626k710
7105b2184p063P810J1891k551K1503J6529O082j7637o429k876J4805N63q985j2556
7091a098r479j0571L617O986J7344j1798p9M8233J9359J430m239r633k6986r573
7077A3513k2579j5199M15n742n035K2151L010P494k673l0223o679O278Q708R694
7063a6867J1426K277r637j2221N177o309j0139j090K1630J3747P778P091o211
7050F652O317M984j6910p117j2264p906J6991j459j1381M196J465J7241j5373
7037a4564J0353O610q076m502L126n776j2034P873J3876j7603O966J7905P41k3170
$$ y = [28615, 2729, -13705, -16471, -25420, -31302, -7191, 14064, 28392, -2651, -48079, -56222, -41790, -29795, -22495, -34078, -50223, -55944, -24087, -92, -11229, -7489, 4115, 7923, -1848, -19474, -22184, -29247, -21437, -9546, -12097, 9406, 25935, 32017, 14380, 7951, 5075, 19880, 20443, 11458, -1098, -10577, -21148, -17531, -10545, 6799, -4999, -5078, 43155, 62514, 63944, 59705, 50072, 23086, 13513, -9066, -24265, -23850, -29592, -34627, -12476, -9466, -1972, -4645, -34868, -41547, -35269, -26561, -16867, -5441, -3164, -12801, -25022, -19845, -26154, -36293, -37383, -15753, -2006, 5772, 12863, 6652, 12969, 17953, 1043, -6074, -18338, -26244, -9253, -10712, -22093, -17897, -16432, 809, -14564, -4211, 2399, -5677, -10179, -7053, -12829, -24863, -16990, -3114, -20717, -13751, 4154, 4895, -18275]
7023a8275M808L1984J493J6930o379q859k1166j0313l885q218J1543J4129l862
7010g0J6292o78j2194k334Q583R256j5052M0404J0918P594j656n15l88P455J2245
6995G9860n832k7532q019J3588j4431j7889p035k0346J2433J8203O734K639j4667
6982A7706q50k495m061j8488P648K2290n811k9862k2950j4526K7263K5467n692
6969d361p532k2952j2176K7700K4277K140n752p302m577J264J3258M783P333K8411
6955D4514p691k6741m037N196j2422J0651J1353m341k1576k6190J789J5473L621
6942a0401J2412J2269j7268k4895M272J5396J5089K1519r361l9267k0036J3090
6930b7181K3733J4308o128J7804k316r276N827K602j6341j6404j7932K481M1618
$$ y = [-18275, -13467, 18517, 20010, 36940, 30561, 21702, 536, -9777, -13662, -21880, -10337, 3792, -70, 16222, 15544, 3350, 1016, 9599, 18855, 3803, 44207, 55125, 62719, 61063, 60548, 60160, 67615, 79860, 74028, 46496, 38477, 52065, 37634, 19745, 12710, -7636, 4797, 23000, 29734, 32373, 17706, 16856, 14361, 10300, -8188, -540, 21750, 15939, -13923, -36873, -51399, -24136, 1331, -4361, -11893, -34845, -47021, -19321, 4956, 7096, 1344, -5958, -10535, -9271, 3987, 8770, 16103, 44514, 36823, 10082, 6045, 11241, -1181, 9470, 20823, 16482, -5094, -31284, -29495, -14022, -10401, 2011, 14280, -2988, -27883, -23611, -8215, 6874, 28393, 19032, -20235, -40271, -27181, -3448, 10860, 4732, 22536, 20220, 10944, 16771, 19373, 3032, -13372, -31304, -28823, 12795]
6917A2795o979j1497n6r529k834j4014J6593K2888J761P964j7620n077M875K655
6903A925m58k495J0138O947j9673l766K9642m129j2965j0805L708j9831l0295
6890e2057L4093l418k1935J6361P452J2134P558k814P406J6125p098K3464L7071
6877G4342j7800j3139m208j955L857k4202k4230K3525K7599j8783k1539J759r134
6864c908m600P123j5700j8358P305L2032K0563J0848j3506j007j2051M144k0819
6851g934j1212q615j363J9543R609j2554j1898J2377L0311R989o657l5940k7262
6838d1606K1494J4387N658j04q361q203J6488n392j2032l106k112p500K0801m480
6824a4068M544J1845j3622j7148R987R966j692o658Q479K1769J8767J7194N181
$$ y = [12795, 5816, -5681, -5737, -15266, -18100, -32114, -15521, 7367, 9128, 17092, -528, -5605, -730, 1925, 1467, -1028, 9110, 16057, -3616, -7382, 22260, 18131, 5166, -5639, -1931, -21762, -52057, -17964, -21382, -43317, -26956, -19504, -7370, 188, -2626, 4780, 20905, 13807, 37271, 74342, 56542, 43403, 39195, 37240, 41097, 16895, -7335, 16190, 43789, 25006, 3467, 5226, -3908, -8508, -1385, -17085, -35443, -28138, 3894, 24457, 35305, 21799, 20792, 8741, 12885, -7934, -19146, -27761, -29124, -9581, 28, -12526, -24424, -12047, 18264, 28253, 21596, -14344, -41606, -20112, -5725, -67, -171, -8532, -16735, -247, -5639, -17671, -20777, -22889, -30389, -9588, -14068, -9524, 2321, -11301, -28449, -18462, -8496, -10188, -16846, -8367, 13402, 32169, 49363, 54544]
6811E4544l0124k1436m781r325J2070P069Q805m602J573m598N430L895q410N165
6797A5275K3949l1390r271M101P073L914J9911j6001j6371q775O498K209j0301
6784i179N192P578j2751o073Q573J5410j3506J2342K5056n827R633M048K795k2040
6770B1251k1871j8106M7803K1163L494j8807j4014j3861J0059j0476J71J0674
6758A7480Q879j5502o310j304J5585J6451M805P574N370j555l355k3309K813K58
6744B7880m895j4541j5739j8769j1097K2343K4452K8151J6939O125k979k2882
6732C4988j5437K4180N689k2622j0478N179O553J0351j25o652J1612l170J0316
6719E0384K3317P205l0502j4549k4062l1501j6328R179N298K4500J5464k7358
$$ y = [54544, 24420, 2984, -1797, -11122, 948, 8017, 16822, 12220, 13793, 9195, 14625, 18520, 10110, 15275, 39224, 7834, -1437, 2664, 9737, 13651, 33562, 17561, 1190, -7585, -1087, 1122, -9179, -3987, 3591, -9160, -15233, -6660, 8750, -4756, 7586, 32642, 26815, 36448, 40496, 43291, 21251, -620, -18726, 29077, 50240, 53734, 34927, 20913, 7052, 17111, 6635, 6806, 17480, 26359, 10857, 4547, 3243, 18828, 35279, 40084, 47658, 53028, 51473, 48118, 24809, 27622, 27880, 22985, 8444, -7295, -26064, -37161, -14818, 9634, 37785, 54724, 60849, 57870, 34988, 19551, 43731, 49420, 26798, 16320, 21499, 28052, 38403, 38278, 31626, 43238, 40068, 50384, 73701, 80906, 50404, 35855, 11793, -19708, -36036, -26857, -21559, 2941, 18405, -8953]
6707h953P114J0989n22k0112J6102J0026m810R394O876k0815j0587J0632J0573
6694A5907k082r91M371j2706M549J4274J6762Q721m767m365p370q242j3352L615
6680A4324J8126M514K1246L344l0738j4898P707J9252Q993p897n589k4994K3783
6667C7173J2624L847j74k387r519R30K3510k534j4784k016k213R089J8741K2281
6653I4568J8447K1823J1200M9915Q2650J23177K31659J11207q4750j58860j34805
6642C66231q1959j4134K3086K9108M1967P9646J06191J41496J93126K57035L37014
6631A478807M29917P20636J427131K829870N372595P970398K700955n444467o718672
6622A0767170m671971k416927j159782n88711l80776l25642k90513k34840j48758
$$ y = [-8953, -1839, 9150, 8628, -11484, 4618, 14644, 9834, 19228, 26104, 5289, -5298, 5334, 15907, 13825, 12834, 17205, 4499, 9048, 23322, 40084, 48805, 44038, 39673, 32303, 24061, 10709, 14324, 32450, 36964, 58210, 61554, 30816, 15918, 23625, 42877, 51870, 43973, 38384, 13390, 37173, 49797, 53644, 53470, 51083, 41564, 42494, 66004, 63470, 48686, 46670, 44457, 53546, 72287, 94568, 113015, 134838, 146038, 195953, 278603, 401780, 633439, 744646, 659896, 501036, 366231, 284272, 270138, 293224, 322332, 364299, 443945, 550136, 691632, 884758, 1141793, 1478807, 1908724, 2629360, 4056491, 6886361, 12258956, 20229354, 22930309, 17485842, 10767170, 6095199, 3678272, 2518490, 1929779, 1549003, 1223361, 932848, 698008, 549250]
6613E49250r7448n9495m7058k9990l1403j1630K8190J01124J69956P4630j41218
6602E04908j75463j12526m5518l9346j0630m341J182k0155j6698j7378k985k3883
6590C7167j5759J3975j910l64J8917k7834k3622q271L043N479L1110K906j4130
6577B0707l333r917k677n615o291k3432M247p096J1236R587J2347j3914L090L0736
6563A9675K4266r24o476k0086l941l453N220K341j1464q079O962m608M463J2609
6549A6505k1506r412r448M920n477r714R999N167P325P202o866r93J5068L2335
6535C5105P724l8125k1313J4737j2150K4445J8982j7805k0989l0363J7975K2574
6523G97J691J620j159l8994j8053J8194J7827J8724K429J1486p30K001J0940m01
$$ y = [549250, 451802, 392307, 345249, 315259, 283856, 272226, 300416, 401540, 571496, 646126, 504908, 329445, 216919, 171401, 132055, 121425, 117084, 118266, 98111, 81413, 64035, 61050, 37167, 21408, 35383, 33473, 33109, 52026, 24192, 570, -7701, -4658, 821, 31931, 34837, 20707, 17374, 7457, 4780, -835, -7126, -30558, -26311, -33407, -22171, -12584, -237, -14151, -11061, 19675, 43941, 43017, 36541, 16455, 12514, 9061, 14281, 16622, 5158, -2921, 4041, -567, 3896, 16505, -5001, -14413, -23861, -18941, -24418, -34132, -24133, -18966, -11641, -4439, -11305, -12298, 2770, 35105, 42829, 4704, -16609, -1872, -14022, 10423, 29405, 11600, -9389, -39752, -21777, 797, 2488, 4108, 2949, -36045, -54098, -35904, -18077, 647, 3076, 14562, 13832, 15833, 26773, 26372]
6509B6372k1734j0724j2175J0046K8288O391K184k4408J1577L7222n052j3895
6497C4092l0055l0377j1083L655K1288K8591k1606p698Q927R204r670m515j0682
6484a9929L26J5298j1870m173J0169M661p252p765P313J0681K0407N727j1446
6471A2147K622k467r38k5563o718R957n791J595K4517o728j8877M152P664j2459
6457a6887n541n961J5510k408L203l766r837J6946q200o586r579l3640J0397R017
6443d7332K0159K5131j2954L243L963r192j349L5369R844k5940Q840M227p179
6430F830o144p406K344K7643j9998m1023l46J3777J861l239q410M020J3367k0301
6416c7025j9O636R276j3631j1576K3128J2603p782p428Q859J5683N07J1097p205
$$ y = [26372, 4638, -6086, -18261, -8215, 20073, 26464, 28648, 4240, 15817, 53039, 47987, 34092, 4037, -26340, -37423, -33768, -12480, 16111, -5495, -13193, -4266, 4938, -4732, -9247, -19929, -19603, -4305, -16175, -20348, -10179, -5518, -12770, -20535, -13222, -2541, 17866, 23593, 12147, 14769, 12302, 11364, -14199, -20917, -10960, -16751, -15156, 9361, 2633, -16244, -12092, -4428, -16887, -22428, -28389, -12879, -15287, -12084, -15850, -25687, -8741, -16941, -23527, -33106, -66746, -56349, -47332, -27173, -2042, -14996, -11753, -7790, -16982, -18331, 17038, 26882, 942, 9782, 14009, 6830, 686, -6720, -4376, 23267, 3269, -37754, -38100, -24323, -22462, -25701, -34111, -30091, -16724, -37025, -37044, -30408, -21132, -34763, -46339, -23211, -10608, -18390, -25818, -16959, -1276, -769, 10328, 3123]
6402C123M941j5575j1201L287J6734O759j8745j0023q810j5531J5227J1220j3693
6389c2287p754m475J0651K3641m339j6919j973K1133M126p413M162k4497K4749
6376a1195J6287p054P427q764l9044N504L6848M023k0952L938J679n514K0930
6363D113K2731j0426j4074J7851J0151j1000J3613J1296j0961r333K0304n426
6351C8839j4465j3372k7189k81j4606m698J5754K1954M723o157J3054R42N271
$$ y = [3123, 8064, -7511, -18712, -15425, 1309, 8068, -10677, -20700, -29510, -45041, -29814, -18594, -32287, -40041, -44516, -33865, -10224, -14563, -31482, -33455, -12322, -8196, -15609, -11447, -35944, -11195, 5092, -1962, 5465, -3299, -42343, -36839, 9, 4032, -16920, -12982, -11303, -16817, 4113, 26844, 16418, 2344, 20195, 30346, 19346, 32959, 44255, 33294, 23961, 44265, 38839, 24374, 11002, -16187, -16468, -31074, -35772, -20018, 1936, 6659, 502, 13556, 14498, 19769]
$$ [...]
##END NTUPLES=NMR SPECTRUM
##END=
