##TITLE=Analysis number 329814
Compound Code cc 62409
Book Reference 553/6
Project Code adrs
Chemist Name simons
##JCAMPDX= 6.0         $$ Bruker NMR JCAMP-DX V2.0
##DATA TYPE= NMR SPECTRUM
##DATA CLASS= NTUPLES
##ORIGIN= Bruker BioSpin GmbH
##OWNER= nmr
$$ XWIN-NMR		Version 3.5
$$ Tue Oct  2 09:29:30 2007 GMT Daylight Time (UT+1h)  MAYBRIDGE\nmr@NMR_250MHZ
##.OBSERVE FREQUENCY= 250.131544655141
##.OBSERVE NUCLEUS= ^1H
##.ACQUISITION MODE= SIMULTANEOUS (DQD)
##.ACQUISITION SCHEME= undefined
##.AVERAGES= 16
##.DIGITISER RES= 18
##SPECTROMETER/DATA SYSTEM= dpx250
##.PULSE SEQUENCE= zg30
##.SOLVENT NAME= CDCl3
##.SHIFT REFERENCE= (INTERNAL, CDCl3, 0, 16.522)
##AUDIT TRAIL= $$ (NUMBER, WHEN, WHO, WHERE, WHAT)
$$ ##TITLE= Audit trail, XWIN-NMR		Version 3.5
$$ ##JCAMPDX= 5.01
$$ ##ORIGIN= Bruker BioSpin GmbH
$$ ##OWNER= nmr
$$ C:\u/data/dgb/nmr/ADRS/80/pdata/1/auditp.txt
$$ ##AUDIT TRAIL=  $$ (NUMBER, WHEN, WHO, WHERE, WHAT)
(   1,<2007-10-02 09:29:09.42 +100>,<MAYBRIDGE\nmr>,<NMR_250MHZ>,
      <created by zg, POWCHK disabled, PULCHK disabled
       configuration hash MD5:
       76 6E 9A 78 1E 09 19 81 EC 84 63 8F B0 6A 59 2D
       data hash MD5: 64K
       88 E4 5A 60 B9 F7 D1 91 52 F3 10 49 0C 77 F3 25>)
(   2,<2007-10-02 09:29:22.37 +100>,<MAYBRIDGE\nmr>,<NMR_250MHZ>,
      <Start of raw data processing
       ef LB = 0.3 FT_mod = 6 PKNL = 1 SI = 32K 
       data hash MD5: 32K
       2B 18 7F 55 E4 6F C3 57 94 E9 B6 9C C1 AA 7E 23>)
(   3,<2007-10-02 09:29:23.90 +100>,<MAYBRIDGE\nmr>,<NMR_250MHZ>,
      <apk 
       data hash MD5: 32K
       52 E4 ED 66 5C CA AE E5 47 CF 9D B9 4A FF 1B 6D>)
(   4,<2007-10-02 09:29:24.79 +100>,<MAYBRIDGE\nmr>,<NMR_250MHZ>,
      <abs ABSG = 5 
       data hash MD5: 32K
       8E 6A 01 78 3C 49 AA 0A 1A 80 6A 4A FE 53 E4 0D>)
$$ ##END=
$$ 
$$ hash MD5
$$ 38 4A D2 67 CA C9 B7 A5 48 C3 2D C7 AF 58 0E 57
##$RELAX= 
##$RELAX= 
##$RELAX= 
##$RELAX= 
##$RELAX= 
##$RELAX= 
##$RELAX= 
$$ Bruker specific parameters
$$ --------------------------
##$DU= <C:\u>
##$EXPNO= 80
##$NAME= <ADRS>
##$PROCNO= 1
##$TYPE= <nmr>
##$USER= <dgb>
##$AMP= (0..31)
100 100 100 100 100 100 100 100 100 100 100 100 100 100 100 100 100 100 
100 100 100 100 100 100 100 100 100 100 100 100 100 100 
##$AQSEQ= 0
##$AQ_mod= 3
##$AUNM= <au_zg>
##$AUTOPOS= <16 >
##$BF1= 250.13
##$BF2= 250.13
##$BF3= 250.13
##$BF4= 250.13
##$BF5= 500.13
##$BF6= 500.13
##$BF7= 500.13
##$BF8= 500.13
##$BYTORDA= 1
##$CFDGTYP= 0
##$CFRGTYP= 5
##$CHEMSTR= <none>
##$CNST= (0..31)
1 1 145 1 1 1 1 1 1 1 1 1 1 1 1 1 1 1 1 1 1 1 1 1 1 1 1 1 1 1 1 1 
##$CPDPRG= <>
##$CPDPRG1= <>
##$CPDPRG2= <>
##$CPDPRG3= <>
##$CPDPRG4= <mlev>
##$CPDPRG5= <mlev>
##$CPDPRG6= <mlev>
##$CPDPRG7= <mlev>
##$CPDPRG8= <mlev>
##$CPDPRGB= <>
##$CPDPRGT= <>
##$D= (0..31)
0 1 0 0 0 0 0 0 0 0.06 0 0 0 0 0 0 0.0002 0 0 0 0 0 0 0 0 0 0 0 0 0 0 
0 
##$DATE= 1191313748
##$DBL= (0..7)
120 120 120 120 120 120 120 120 
##$DBP= (0..7)
150 150 150 150 150 150 150 150 
##$DBP07= 0
##$DBPNAM0= <>
##$DBPNAM1= <>
$$ [...]
##$SUBNAM7= <"">
##$SUBNAM8= <"">
##$SUBNAM9= <"">
##$SW= 20.6930455092707
##$SWIBOX= (0..15)
0 0 3 0 0 0 0 0 0 0 0 0 0 0 0 0 
##$SW_h= 5175.983436853
##$TD= 65536
##$TD0= 1
##$TE= 296.16
##$TE2= 300
##$TE3= 300
##$TEG= 300
##$TL= (0..7)
0 120 120 120 120 120 120 120 
##$TP= (0..7)
150 150 150 150 150 150 150 150 
##$TP07= 0
##$TPNAME0= <>
##$TPNAME1= <>
##$TPNAME2= <>
##$TPNAME3= <>
##$TPNAME4= <>
##$TPNAME5= <>
##$TPNAME6= <>
##$TPNAME7= <>
##$TPOAL= (0..7)
0.5 0.5 0.5 0.5 0.5 0.5 0.5 0.5 
##$TPOFFS= (0..7)
0 0 0 0 0 0 0 0 
##$TUNHIN= 0
##$TUNHOUT= 0
##$TUNXOUT= 0
##$USERA1= <user>
##$USERA2= <user>
##$USERA3= <user>
##$USERA4= <user>
##$USERA5= <user>
##$V9= 5
##$VALIST= <valist>
##$VCLIST= <CCCCCCCCCCCCCCC>
##$VD= 0
##$VDLIST= <DDDDDDDDDDDDDDD>
##$VPLIST= <PPPPPPPPPPPPPPP>
##$VTLIST= <TTTTTTTTTTTTTTT>
##$WBST= 1024
##$WBSW= 4
##$XGAIN= (0..3)
0 0 0 0 
##$XL= 0
##$YL= 0
##$YMAX_a= 360958
##$YMIN_a= -505713
##$ZGOPTNS= <>
##$ZL1= 120
##$ZL2= 120
##$ZL3= 120
##$ZL4= 120
##$ABSF1= 16.522
##$ABSF2= -4.171173
##$ABSG= 5
##$ABSL= 3
##$ALPHA= 0
##$AQORDER= 0
##$ASSFAC= 0
##$ASSFACI= 0
##$ASSFACX= 0
##$ASSWID= 0
##$AUNMP= <proc_1d>
##$AZFE= 0.1
##$AZFW= 0.1
##$BCFW= 0
##$BC_mod= 0
##$BYTORDP= 0
##$COROFFS= 0
##$CY= 12.5
##$DATMOD= 1
##$DC= 0
##$DFILT= <>
##$DTYPP= 0
##$F1P= 14.0000005364418
##$F2P= -0.99999901652339
##$FCOR= 0.5
##$FTSIZE= 32768
##$FT_mod= 6
##$GAMMA= 0
##$GB= 0
##$INTBC= 1
##$INTSCL= 1
##$ISEN= 128
##$LB= 0.3
##$LEV0= 0
##$LPBIN= 0
##$MAXI= 10000
##$MC2= 0
##$MEAN= 0
##$ME_mod= 0
##$MI= 0
##$NCOEF= 0
##$NC_proc= -5
##$NLEV= 6
##$NOISF1= 0
##$NOISF2= 0
##$NSP= 0
##$NTH_PI= 0
##$NZP= 0
##$OFFSET= 16.522
##$PC= 1
##$PHC0= 154.2246
##$PHC1= 13.62193
##$PH_mod= 1
##$PKNL= yes
##$PPARMOD= 0
##$PSCAL= 4
##$PSIGN= 0
##$REVERSE= no
##$SF= 250.13
##$SI= 32768
##$SIGF1= 0
##$SIGF2= 0
##$SINO= 400
##$SIOLD= 32768
##$SREGLST= <1H.CDCl3>
##$SSB= 0
##$STSI= 32768
##$STSR= 0
##$SW_p= 5175.98343685301
##$SYMM= 0
##$S_DEV= 0
##$TDeff= 65536
##$TDoff= 0
##$TI= <Analysis number 999999
Compound Code 99
Book Reference 9
Project Code 9>
##$TILT= no
##$TM1= 0
##$TM2= 0
##$TOPLEV= 0
##$USERP1= <user>
##$USERP2= <user>
##$USERP3= <user>
##$USERP4= <user>
##$USERP5= <user>
##$WDW= 1
##$XDIM= 32768
##$YMAX_p= 480699261
##$YMIN_p= -632605
$$ End of Bruker specific parameters
$$ ---------------------------------
##NTUPLES= NMR SPECTRUM
##VAR_NAME=  FREQUENCY,     SPECTRUM/REAL,   SPECTRUM/IMAG
##SYMBOL=    X,             R,               I
##VAR_TYPE=  INDEPENDENT,   DEPENDENT,       DEPENDENT
##VAR_FORM=  AFFN,          ASDF,            ASDF
##VAR_DIM=   32768,         32768,           32768
##UNITS=     HZ,            ARBITRARY UNITS, ARBITRARY UNITS
##FACTOR=    0.157963299565203, 1,           1
##FIRST=     4132.6476996994, 0,             0
##LAST=      -1043.33573715361, 0,           0
##MIN=       -1043.33573715361, -632605,     0
##MAX=       4132.6476996994, 480699261,     0
$$ Real data points
##PAGE= N=1
##DATA TABLE= (X++(R..R)), XYDATA
$$ [...]
17799H934680O46716R31240J241465J709146K288916K840275L600840M947176
17791B7140454O972743J0111523J4784601K1933740K9898286L2429040K6986554
17784A70256941K0865993K0422981K7861816L5423163K5194129K750986j5011567
17777B87764442k6360091k6869661k1271211k1320679k5301239k9562733l1029431
17770A06049397k6839897j9541679j3713466r655946p070995n490847m343664
17763A9392903l378594k879861k155856j661465j407886j151071p60294o77143
17755E320733m59556n75770n08902l92273k18686j13115j14333K2158l6082J83334
17745C107508J23362R9233j83935q0769n9465j03668p2343J76896K74508K35871
$$ plain form
17799 8934680 9581396 10512636 11754101 13463247 15752163 18592438 22193278 27140454
17791 27140454 34113197 44224720 59009321 80943061 110841347 143270387 170256941
17784 170256941 191122934 211545915 239407731 274830894 300025023 302776009 287764442
17777 287764442 261404351 234534690 213263479 191942800 166641561 137078828 106049397
17770 106049397 79209500 59667821 45954355 36298409 29227414 23736567 19392903
17763 19392903 16014309 13134448 10978592 9317127 7909241 6758170 5997876 5320733
17755 5320733 4861177 4285407 3776505 3384232 3165546 3052431 2938098 2960256 2924174 3107508
17745 3107508 3230870 3330103 3146168 3065399 3005934 2902266 2829923 3006819 3281327 3517198
17735C517198K17275O6900n0331j97506j4860R5529P0685J54708L08454J11798
17725D279850J26784L2935j4836l02319k92504k96744m58449p29703n86722m16917
17715A341375k12681j02407j71759l11103j53095j27745O3773j4063n6202j78509
17705G7584p5249k6456O5219L6652p8181p4710M7422Q7015o181J06345K43472
17694D02932P3650k10444J1972K1719k66413k1243K08766K1806k9186m5854r7327
17683G0378q1213k9004N3809O8648k03134j88737o4296J34679J15771P9580O9887
17672B6368n3409L9505J19428L8891Q622j02331q1934n706N5314P8060J18886
17661B41694K4664l5453o0241j47642J5156l8533J11170O795j43630o1953j96607
$$ plain form
17735 3517198 3734473 3801373 3751042 3553536 3538676 3634205 3704890 3859598 4168052 4279850
17725 4279850 4406634 4439569 4424733 4122414 3829910 3533166 3074717 2345014 1758292 1341375
17715 1341375 1128694 1026287 854528 543425 390330 262585 326358 312295 256093 77584
17705 77584 2335 -24121 41098 77750 -431 -75141 -27719 59296 53115 159460 402932
17694 402932 476582 266138 278110 299829 33416 12173 220939 242745 213559 167705 70378
17683 70378 -10835 -39839 13970 82618 -120516 -309253 -373549 -238870 -123099 -43519 26368
17672 26368 -27041 12464 131892 170783 179405 77074 -4860 -10566 44748 122808 241694
17661 241694 266358 230905 170664 23022 38178 -355 110815 117610 -26020 -87973 -284580
17650b84580Q551J97913J2822q3892k03557r5704P8070j1872P1534J02649R7017
17639a11049M2984M7041j46624P520n0772J5904L3031N8898N8669l1832J9072
17628e7158N3336q5533K4567q0724R6089Q2454J05862Q2829m8788j9174n2644
17617A01116l9707M6513O6941K3111N1925p7736p6007j33420l6424L7285J71688
17606A35285j27286P230p305K1548k09855l1259J11828p2586r0472j01711R2642
17595b71941J00463N3855l1050q4771q6761Q5438J7384Q8034J55905o0389j07305
17584a41138K0229j20046o102j08144n4881r1476N0035K75122J24418r9766k35989
17573c87738M2953J25922J06199R4231M5831o5908n1494p2279m4850j9303p8262
$$ plain form
17650 -284580 -276029 -78116 -65294 -149186 -352743 -448447 -370377 -382249 -310715 -208066 -111049
17639 -111049 -68065 -21024 -167648 -160128 -210900 -194996 -161965 -103067 -44398 -76230 -57158
17628 -57158 -3822 -89355 -64788 -145512 -49423 33031 138893 221722 172934 153760 101116
17617 101116 61409 107922 174863 197974 249899 172163 96156 -37264 -73688 -36403 135285
17606 135285 7999 15229 7924 29472 -180383 -211642 -99814 -172400 -262872 -364583 -271941
17595 -271941 -171478 -117623 -148673 -233444 -320205 -234767 -217383 -129349 26556 -33833 -141138
17584 -141138 -120909 -240955 -247057 -355201 -410082 -501558 -451523 -176401 -51983 -151749 -387738
17573 -387738 -344785 -218863 -112664 -18433 27398 -38510 -90004 -162283 -207133 -226436 -304698
17562c04698o8107p8556R5581K49545J2223j63603j67338m0188k2249K7264J72424
17551b87702Q3761l6173m4534P1302n754k5075m4766K45808n40N3052J8155l4955
17539g421J53915M5017j37926m5299R8483J93241L1565k78025j2282K1399r5861
17528c3194j81584Q2201K9577M1198J6348j35750P1315J08560J70k6564J05563
17517G7840k37448j97200O337J11828P9338N0676p3398j25805j2439m3285J925
17506c61631J08200J11761M8646o8622J0026O1319m9800p6793m8993j52358K13652
17495b04593n9811J03880m3769N7441J08995L1551k7726r0606j06341j14373J46026
17484a99326K0975O8634l2331O8186j19946Q668Q0211o9876O809N9092r0961N6142
$$ plain form
17562 -304698 -372805 -451361 -355780 -106235 -94012 -257615 -424953 -465141 -487390 -460126 -287702
17551 -287702 -203941 -240114 -284648 -213346 -219100 -244175 -288941 -43133 -43673 9379 27534 -7421
17539 -7421 146494 191511 53585 8286 106769 300010 331575 53550 41268 62667 -33194
17528 -33194 -214778 -132577 -103000 -61802 -45454 -181204 -109889 -1329 -1159 -27723 77840
17517 77840 -159608 -356808 -350471 -238643 -159305 -108629 -182027 -307832 -320271 -363556 -361631
17506 -361631 -253431 -141670 -93024 -161646 -151620 -90301 -140101 -216894 -265887 -418245 -204593
17495 -204593 -264404 -160524 -204293 -146852 -37857 -6306 -34032 -124638 -230979 -345352 -199326
17484 -199326 -178351 -109717 -142048 -73862 -193808 -185140 -104929 -174805 -167996 -108904 -199865 -143723
17472a43723O0632r3877q0802k2051Q5497p7310L3123O0810M3432J6758o9030
17461a86541l2642J64312j03123j19833K28290J82909n2703j26731M6640j6747
17451a6169k7258K06748j0649j00619P7723J58737K34591M34392L59264J78550
17441A495310p3438m32912k97096k28313j02779j40423j69992j57987j01363M7790
17431a61203L9165Q3632j21414j39995K69095J69142J43248j78470j71658j33112
17421b01570l1259J53911n044r6024r6844P2572j4452J00400q795p1557m0634
17410b39296L0448p6499M6230R2114P6783J47375l1737j4383L7278m1034j02429
17399g5150J04106M3413n9522m8856j33595j33109Q9732J09769k2445r713N7855
$$ plain form
17472 -143723 -83091 -176968 -257770 -279821 -194324 -271634 -238511 -177701 -134269 -117511 -186541
17461 -186541 -219183 -54871 -157994 -277827 -49537 133372 80669 -46062 578 -16169
17451 -16169 -43427 163321 152672 52053 129776 288513 523104 957496 1316760 1495310
17441 1495310 1421872 988960 691864 463551 360772 220349 50357 -107630 -208993 -161203
17431 -161203 -122038 -38406 -159820 -299815 -30720 138422 281670 103200 -68458 -201570
17421 -201570 -232829 -78918 -83962 -179986 -276830 -204258 -218710 -118310 -127105 -198662 -239296
17410 -239296 -208848 -285347 -239117 -147003 -70220 77155 45418 31035 68313 27279 -75150
17399 -75150 28956 72369 12847 -36009 -169604 -302713 -212981 -103212 -125657 -135370 -77515
17388g7515o3659N4519M8681L0224j07199j2511J59516L8184N711j22848J80331
17377A33434O7586j8490k71313j85114J09348Q8867r4048p4002l1015j51690l0658
17366d57095J50764K34082K79838N649j57438l24736j6147R2157q4817O4271n8591
17355b72063p6248n7310p3781R3896J46705P0948N7288M9331q395M735Q6071j04384
17343h3207Q5260n840O1029O717j65957o896P6839q1056j3448o3483p514L554
17331a94002m3094J0541O1631n2964N4315P1443j64521l787j4302n4063l1082
17320c59885k5697K4573J37982J25354Q313r2085o8876K08716J58906o5947r4298
17309d2944k30075k07926N1198J51701K03006N9863N1527M4748k9217j01799j67269
$$ plain form
17388 -77515 -141174 -86655 -37974 -7750 -114949 -127460 32056 70240 75951 -46897 133434
17377 133434 201020 182530 -88783 -273897 -164549 -75682 -169730 -243732 -274747 -426437 -457095
17366 -457095 -306331 -72249 207589 213238 55800 -268936 -285083 -192926 -277743 -213472 -272063
17355 -272063 -348311 -405621 -479402 -385506 -238801 -167853 -110565 -61234 -69629 -64894 21177 -83207
17343 -83207 2053 -3787 57242 63959 -101998 -108894 -32055 -113111 -126559 -190042 -197556 -194002
17331 -194002 -237096 -226555 -164924 -217888 -163573 -92130 -256651 -260438 -274740 -328803 -359885
17320 -359885 -385582 -361009 -223027 -97673 -89360 -181445 -250321 -41605 117301 51354 -42944
17309 -42944 -273019 -480945 -429747 -278046 -75040 -15177 36350 81098 51881 -49918 -217187
17298b17187Q1512j8762O802o8404l435l9251k0290J30675j43778j357R9567j02439
17286b96347J7387M1996O5551Q7060k4921l8512O2793P0136M9562l0038m8033
17275d3366o1355k54893j62601K40332K34392J46383o2045L1943j57624j04661
17265a93495j06148l3653R6929n8201O611N8228K3316M7518k09506l9380J39252
17254b68529J34302Q4311q8278r3270R131K0508P4029O8626n9537m2462k0919
17243a82088m2246J40746J08217O061n5202o3717J4457O4981m3110m4475p4073
17232a70449J2643O5492o4740j11636K54963K91090J16846j72138j85263n5176
17222a8368p2925j15137j8191K09879J93089Q1838j35027r5893J44054k2535j13651
$$ plain form
17298 -217187 -135675 -154437 -147635 -216039 -219474 -258725 -279015 -148340 -292118 -293475 -193908 -296347
17286 -296347 -278960 -236964 -171413 -84353 -109274 -147786 -84993 -14857 34705 4667 -43366
17275 -43366 -104721 -359614 -522215 -281883 -47491 98892 36847 68790 -88834 -193495
17265 -193495 -299643 -333296 -236367 -294568 -287957 -229729 -206413 -158895 -368401 -407781 -268529
17254 -268529 -134227 -49916 -138194 -231464 -222333 -201825 -127796 -59170 -118707 -161169 -182088
17243 -182088 -224334 -83588 24629 30690 -24512 -88229 -73772 -8791 -51901 -96376 -170449
17232 -170449 -157806 -92314 -157054 -268690 -13727 277363 394209 222071 36808 -18368
17222 -18368 -91293 -206430 -224621 -14742 178347 260185 125158 29265 173319 150784 37133
17211C7133L3079J55354P161P0271J49885K36671J42156K5099J70494J41982J06837
17200A276122R7564p080J34714j41044k85433j14075k42846m618q7152k15438
17190D10714k64322k9569J0370j33892l8262K2224O1598k150R9378n885M8716
17179A78920J08305Q1338j64763j60919j06911j85205j59348K33931K19911J98096
17169B43355o0962j57738r8437n4772j9265j07859k4076j456N4688j5121k7097
17158b68740k2394J1792J83866p2920k18751j92092o791J80628J51659Q0239j04345
17147b77849J35208K10871K4614j43709k41054n1606P1782k2538K4108Q6476J02290
17136h1407k3618r9432j04110J05743L4454J16631j62021J33591M9597J11031
$$ plain form
17211 37133 70212 225566 232727 302998 452883 689554 831710 856809 1027303 1169285 1276122
17200 1276122 1373686 1366606 1501320 1360276 1074843 960768 717922 713304 626152 410714
17190 410714 146392 116823 127193 -6699 -44961 -22737 38861 36711 136089 130204 178920
17179 178920 287225 368563 203800 42881 -64030 -249235 -408583 -174652 45259 243355
17169 243355 182393 24655 -73782 -128554 -147819 -255678 -279754 -281210 -226522 -241643 -268740
17158 -268740 -291134 -279342 -95476 -168396 -387147 -579239 -586030 -405402 -253743 -173504 -277849
17147 -277849 -142641 68230 92844 -50865 -291919 -343525 -271743 -294281 -270173 -183697 -81407
17136 -81407 -105025 -204457 -308567 -202824 -168370 -51739 -213760 -80169 -30572 80459
17126H0459j10400m9371J20241J87290N7063j40071q6316j05690j76808J97653
17116b5950Q737p2662p6543O75j4282N3484n7357p7829K9138J14001K9605J36619
17104D7636j0856k19653r5608J12619J09915q0655l9118J2452K27715j08624j90573
17093b34750M8407P4876J37993j06342j01481q3906J0961j716J04848J97382N6025
17082A02297L3309K7352M6406r6692r5520j25962J76910R5508k96102k31471l0372
17071c94337J04577q680p646J52080j8814o2048L3626J49017j47457m5398J07982
17060a37098l3919q2979K43585J54259m4096N15Q0315m9133j73697q4094j27791
17049b54133k9134k9109M9488l1398N0105k4015J29663J68889O3930m5174j35544
$$ plain form
17126 80459 -29941 -79312 40929 228219 285282 145211 58895 -46795 -223603 -25950
17116 -25950 -17213 -89875 -166418 -165743 -180025 -126541 -183898 -261727 -232589 -118588 -88983 47636
17104 47636 36780 -182873 -278481 -165862 -55947 -136602 -175720 -163268 64447 -44177 -234750
17093 -234750 -186343 -111467 26526 -79816 -181297 -265203 -254242 -255958 -151110 46272 102297
17082 102297 135606 162958 209364 112672 17152 -108810 68100 163608 -132494 -363965 -394337
17071 -394337 -289760 -298440 -306086 -154006 -172820 -234868 -201242 -52225 -199682 -245080 -137098
17060 -137098 -171017 -253996 -10411 143848 99752 100267 180582 131449 -42248 -126342 -254133
17049 -254133 -283267 -312376 -262888 -294286 -244181 -268196 -138533 30356 94286 49112 -86432
17038h6432m8801k676j4769K00899P2220Q5193Q94k2207R5693k51225r9361j11249
17026a81821R043J43955J11817o228p3527k03477k2527J56081L8246o9336K1995
17015g5779k4944N5641j64173J15494Q3184q6900R5916J06718L6363j59481j25362
17004a43323J7834J01798l1632N0505K8172r1797n3159K5171J80428k5414j70216
16993a11633M6979l2581K4596J01031k2576j48639J43713J25058r8678Q1449k2611
16982H6108m1847j91120j27500J26241P4016J5803q7327j66323K7016J62250R6916
16971b5767l0605l1791R9902J71117p7820j42612j9564J21688o2588J8655j5735
16960D880p4227M2142n8980o248l803J30795Q8339N588q9375n2521j97299j05927
$$ plain form
17038 -86432 -135233 -137909 -152678 48221 120441 205634 206528 184321 280014 28789 -70572 -181821
17026 -181821 -172778 -28823 82994 76766 3239 -200238 -222765 -66684 -28438 -97774 -75779
17015 -75779 -100723 -45082 -209255 -93761 -10577 -97477 -1561 105157 141520 -17961 -143323
17004 -143323 -125489 -23691 -55323 -4818 23354 -68443 -121602 -96431 83997 58583 -111633
16993 -111633 -64654 -97235 -72639 28392 5816 -142823 890 125948 27270 108719 86108
16982 86108 44261 -146859 -274359 -148118 -74102 -58299 -145626 -311949 -284933 -122683 -25767
16971 -25767 -56372 -88163 11739 182856 105036 -37576 -57140 64548 1960 20615 4880
16960 4880 -69347 -27205 -86185 -92433 -96236 34559 122898 128486 39111 -13410 -210709 -316636
16948c16636J96128K99498K3904q4816l4976j64986O6358J79594k63443k09643
16938c09018o4982N2349R0404O9839j14409j25988P6153J03386p1618j8911k8813
16927c41608K9821J57258J8979p8978j40484J37395P5618o7030j09111Q2432J14981
16916a20727J41780M4141k2031l5480n3033j43876L8621l9352M9291P3172m7184
16905a14678j8701L1186K6090J60604m9699j19724r3633n6744L9809k5927J46773
16894g4644L27627J4619j71594l9916j19988k08143L366J2712r3259J073N7526
16883b90621n1885Q6270J44376K19900R3960L4546j70066r1297Q6251k06787j92691
16872c38044n9826J44046J16288o9016q6370K7079q6464p3389p4831R8535L3752
$$ plain form
16948 -316636 -120508 178990 202894 118078 83102 -81884 -15526 164068 -99375 -309018
16938 -309018 -374000 -321651 -231247 -161408 -275817 -401805 -325652 -222266 -293884 -312795 -341608
16927 -341608 -311787 -154529 -135550 -214528 -355012 -217617 -141999 -209029 -318140 -235708 -120727
16916 -120727 21053 65194 43163 7683 -45350 -189226 -150605 -189957 -140666 -67494 -114678
16905 -114678 -133379 -102193 -76103 84501 34802 -84922 -178555 -235299 -195490 -221417 -74644
16894 -74644 252983 267602 96008 56092 -63896 -272039 -268673 -255961 -349220 -348147 -290621
16883 -290621 -342506 -256236 -111860 108040 202000 236546 66480 -24817 61434 -145353 -338044
16872 -338044 -397870 -253824 -137536 -206552 -292922 -265843 -352307 -425696 -500527 -401992 -368240
16861c68240J15442K40802N957k43945j1141K02638M3373L7887Q710j1957R5454
16850A14980n0926j10424j16181k6701P4931p465K2922Q6961n9855K6063J53661
16839A07966l4256j64789j55741p364J88693O9870p5564m7586O6862K4411j0051
16828c7549j5008N4120q8406n6875j27655n2841L00812N7856O5316R3475q0518
16817A12727j04905p182P8527j8611p9768M3057K05189j6486j81140p0502l9463
16806g8557k08262K1977J66188Q5456L3126j3375q1944J40817R3285R9559k2099
16795B36171j25076k39003j7586J39785J54462Q4603k6969m791n4003j62816k23048
16784b38271L8218J15344k6330M5581j41582j07023q5457j85915K4412L12997
$$ plain form
16861 -368240 -252798 -11996 -6039 -249984 -261125 -58487 -15114 22773 31483 19526 114980
16850 114980 64054 -46370 -162551 -189252 -114321 -121786 -98864 -11903 -71758 -45695 107966
16839 107966 73710 -91079 -246820 -254184 -65491 4379 -71185 -118771 -51909 -27498 -37549
16828 -37549 -52557 1563 -86843 -143718 -271373 -324214 -23402 34454 99770 193245 112727
16817 112727 7822 640 79167 60556 -19212 23845 229034 212548 31408 -39094 -78557
16806 -78557 -286819 -264842 -98654 -13198 19928 6553 -75391 65426 158711 258270 236171
16795 236171 111095 -127908 -145494 -5709 148753 233356 206387 201596 147593 -15223 -238271
16784 -238271 -200053 -84709 -111039 -65458 -207040 -314063 -399520 -585435 -561023 -248026
16774b48026O6607J26688N3666L3087J08130k6259j28765j42645j60452j51791
16764d69760Q8348P7606J6468J48310M0826J51495J08465M5758j041q2100k38883
16753a14508j6769P422n2483P7229N853q8436o9597r2171j317L20043j06123l4532
16741a65389L3032J22048p466l6400K9385R3718P5440J12620o3620k88552j23298
16730b18482N0041K4156O2016R1396M1651r4861J2101M5423R2138r0591p1738
16719e6750j00206r2866r326J0091m1867J12564P1429M3330k12326L8357M9639
16708a87931k2260r7120J024n1765K5922J24992J677j09458N9858P9152O5669
16697a10240K3866j168N2971J2075l3115j3127l5571p3247J45105l8331o4960
$$ plain form
16774 -248026 -181419 -54731 -1065 32022 140152 113893 -14872 -157517 -317969 -469760
16764 -469760 -381412 -303806 -287338 -139028 -98202 53293 161758 207516 206475 124375 -114508
16753 -114508 -131277 -123855 -176338 -99109 -93256 -181692 -251289 -343460 -344777 -24734 -130857 -165389
16741 -165389 -132357 -10309 -17775 -54175 -24790 68928 144368 256988 193368 -95184 -218482
16730 -218482 -168441 -144285 -82269 9127 50778 -44083 -31982 13441 105579 14988 -56750
16719 -56750 -156956 -249822 -259148 -249057 -290924 -178360 -106931 -63601 -275927 -237570 -187931
16708 -187931 -210191 -307311 -306287 -358052 -332130 -207138 -205461 -314919 -255061 -175909 -110240
16697 -110240 -86374 -87542 -34571 -22496 -55611 -68738 -104309 -177556 -32451 -70782 -135742
16686a35742J9536O5993m8772q8897n8831O6894J91607N6402j35104J2046q8276
16675a43144k05284k2575Q1952J19169j225M2031J6189k0162K33202N3683j06448
16664D7388j19336k9162J22091q2498O3998j35024K9989J00464J56471K5204j05621
16653G3964j87989j77987J10303J39652O8878J8250k138k1785r2540L4160M2348
16642E116J15789J54460j35451J4727j30121q9803L0317J13770j43111j6437l2121
16631a12865R8138J77035q1329l5421k33888j50667P3587Q4542K24999p1335m9460
16620g6664J30667J14613L924J4474j3547r2660P0349o5274j15142j61188o1041
16609b51489m4919J5876J97192J37110M3306Q0895j02714n4873k36476j27294
$$ plain form
16686 -135742 -116206 -50213 -98985 -187882 -246713 -179819 11788 68190 -66914 -54868 -143144
16675 -143144 -348428 -371003 -289051 -169882 -171107 -129076 -112887 -133049 100153 153836 47388
16664 47388 -71948 -101110 20981 -61517 2481 -132543 -102554 -2090 154381 179585 73964
16653 73964 -114025 -292012 -181709 -42057 26821 45071 42933 21148 -71392 -37232 5116
16642 5116 120905 275365 139914 154641 24520 -65283 -34966 78804 -64307 -80744 -112865
16631 -112865 -14727 162308 80979 45558 -188330 -338997 -265410 -180868 44131 -27204 -76664
16620 -76664 54003 168616 172540 187014 173467 80807 151156 85882 -29260 -190448 -251489
16609 -251489 -296408 -280532 -83340 53770 97076 177971 75257 20384 -216092 -343386
16599c43386J77093J37540Q5762R8026m6942o6123o8546r7761o4933R8152J03718
16588A2600L5019J84691n9578j49865j4919m38j40911l7526j26738P5318J24637
16577i7710j75548O8896Q9010l0156N8977n9214k62587k24273J81550L19876J02047
16566b9132N8940L6357j18793q0688L8680J27925j3337J12123o334n1446J1112
16555H5407K1166q4987l5907P7529k7231j28651j79823R8532j13191l0577K6146
16544b91587L8675N2508Q5504K05467P5633j13657R758N1379J999Q1910j91700
16533E889k80747J26328J52900j29485l5782J21177o3905o0864q8025q6733R0186
16522b49061O7554N0609l549p2663O5472N0401J00336K878j03051q9856l7943
$$ plain form
16599 -343386 -166293 -28753 57009 155035 108093 41970 -26576 -124337 -189270 -91118 12600
16588 12600 47619 232310 172732 22867 7948 7510 -133401 -170927 -297665 -222347 -97710
16577 -97710 -273258 -204362 -115352 -145508 -86531 -145745 -408332 -632605 -451055 -131179 -29132
16566 -29132 29808 66165 -52628 -133316 -94636 33289 19952 132075 125741 74295 85407
16555 85407 106573 21586 -14321 63208 35977 -92674 -272497 -173965 -287156 -317733 -291587
16544 -291587 -252912 -200404 -114900 90567 166200 52543 62301 113680 115679 197589 5889
16533 5889 -274858 -148530 4370 -125115 -160897 -39720 -103625 -164489 -252514 -339247 -249061
16522 -249061 -181507 -130898 -134447 -207110 -141638 -91237 9099 11977 -91074 -180930 -218873
16511b18873l8945n9776J07633P1568P9153R5680j35716n6846Q5358J65497P4685
16500A69418M2633m134m0401L2589R6126p4046J765j02495j14635M1446j7708
16489C0558j14331r2628J61387k5378J06356j02383j07874m1260q8849O4842P2143
16478a37417j4934k936L2839n2111M3772N39M1011J9788J27512J26400K6965j15126
16466I6302L7860Q2448r6432q757R3542m4107p3368L7017l4214q2789k37661n0239
16454b80398J62318p8520J30091P4727R0335J1008N9002j91938J2568j4918o8622
16443i4347j37264K3976M6650P9854Q4951j7889n2151k02290J3147Q245m8199
16432b95317q3638q9540j05137K25579K80691n9871O5842L9480o3163n6547Q2011
$$ plain form
16511 -218873 -257818 -317594 -209961 -138393 -59240 36440 -99276 -156122 -70764 94733 169418
16500 169418 212051 207917 167516 200105 296231 222185 223950 121455 6820 48266 30558
16489 30558 -83773 -176401 -15014 -40392 65964 -36419 -144293 -185553 -274402 -209560 -137417
16478 -137417 -152351 -155287 -122448 -174559 -130787 -130248 -89237 -69449 58063 184463 211428 96302
16466 96302 134162 216610 120178 111421 204963 160856 87488 124505 90291 7502 -230159 -280398
16454 -280398 -118080 -196600 -66509 8218 98553 109561 168563 -23375 -10807 -25725 -94347
16443 -94347 -231611 -207635 -160985 -81131 3820 -14069 -66220 -268510 -255363 -247118 -295317
16432 -295317 -378955 -468495 -573632 -348053 -67362 -127233 -61391 -21911 -85074 -141621 -59610
16421e9610J36154N1951j33609K7267n0806K5386J03506o1337P9356J73341j87365
16410A04234l428P0395j46252M993o6797p6986J05504O6719J42282Q1259j55464
16399A26459j49875o2861J89002N2386q5795n7955j66201L1349M6812j22096M0830
16388a57945O9549O5554j59580n2276n173K2896n1930P9840J53707J91457J1631
16377A67730l367m5452p7962m1889M7033o5045N533j46598j66281l9734O3843
16366c02189M6048R201n7857L5703J67903l2669M8983p3719q6092j4258O4183
16355a94763K21099N2316l0241O0588n4507j86226m040M0405L2961J6653n547
16344e1302l4381r744J1295p0917K5538J46714j37189l4378K4379n4058m6697
$$ plain form
16421 -59610 76544 128495 -5114 22153 -28653 -3267 100239 38902 118258 291599 104234
16410 104234 100806 171201 24949 29942 -36855 -113841 -8337 58382 200664 281923 126459
16399 126459 -23416 -86277 102725 155111 69316 11361 -154840 -123491 -76679 -198775 -157945
16388 -157945 -88396 -22842 -182422 -234698 -239871 -216975 -268905 -189065 -35358 156099 167730
16377 167730 164363 118911 40949 -940 46093 -18952 -13419 -160017 -326298 -366032 -302189
16366 -302189 -256141 -246940 -304797 -269094 -101191 -133860 -84877 -158596 -244688 -258946 -194763
16355 -194763 26336 78652 48411 108999 54492 -131734 -135774 -95369 -62408 -45755 -51302
16344 -51302 -85683 -95427 -84132 -155049 -129511 17203 -119986 -154364 -129985 -184043 -230740
16333b30740O1151L37J78257J56893j97048L5772R4944n2332j32496m6065J32662
16322A335K14258j729l5340j02818r9851J05924j64496m4745J32711K03139r370
16311A99018j79469l9790M195p9590q6616J06957J01505j81252j09801J31044
16301a33799J57753j50903r8070J66670J15279R293L8899k4949J33793k8183k49475
16290f3692j7117J51044j28011k6569q5005o0105l7527O9501Q9270L8480L2230
16279c7501k8806j39893k6938o052j8492N3051j25956N3896K1083l7839P6420
16268b17027P8220J20780l2580l0427j1335L7023j63987j6033j12747P6223K68887
16257c003Q4335j64394j97804P2145K0494j65605l7754N0771J2058j33313J47230
$$ plain form
16333 -230740 -169589 -169252 9005 165898 -31150 4622 99566 47234 -85262 -131327 1335
16322 1335 215593 213864 178524 75706 -24145 81779 -82717 -127462 5249 208388 199018
16311 199018 19549 -20241 -16046 -95636 -182252 -75295 26210 -155042 -264843 -133799
16301 -133799 23954 -126949 -225019 -58349 56930 66223 105122 80173 213966 185783 -63692
16290 -63692 -80809 70235 -57776 -84345 -169350 -229455 -266982 -197481 -108211 -69731 -37501
16279 -37501 -66307 -206200 -233138 -239190 -257682 -204631 -330587 -276691 -255608 -293447 -217027
16268 -217027 -138807 -18027 -50607 -81034 -92369 -55346 -219333 -235366 -348113 -271890 -3003
16257 -3003 81332 -83062 -280866 -208721 -188227 -353832 -391586 -340815 -328757 -462070 -314840
16246c14840M5413q8949n2105l1444J08578J26618M8486J79749j6074o0380J4827
16235d0121J0203O7517J1180j70919K9113r646Q2488l1622K8596j21343o8485
16224b13039j66007o3685M2713K04822O7911r6677n0491P7555n9335q998Q5636
16213a79595J09146m7030r011l8536o7457p7303L2831M7616J78456K9679l4753
16202e5957O9022k8789j29370j44085J33708L13761m899j45714J6453j09380o8774
16191a54024m7872K3099J3985k0061Q9974J75848N3087P4633j1928j1060o614
16180A79067L5583J11949P2849j47044m03000K3946P7558q5096m6152m2654r7436
16169c20430j60002N6550M27249L7273j75386j20102O3545M7063Q0988L2067r5776
$$ plain form
16246 -314840 -269427 -358376 -410481 -441925 -333347 -206729 -158243 21506 5432 -54948 -40121
16235 -40121 -29918 37599 48779 -122140 -93027 -102673 -20185 -51807 -23211 -144554 -213039
16224 -213039 -379046 -442731 -400018 -195196 -127285 -223962 -274453 -196898 -256233 -265231 -179595
16213 -179595 -70449 -117479 -126490 -165026 -232483 -309786 -276955 -229339 -50883 -21204 -55957
16202 -55957 13065 -15724 -145094 -289179 -155471 158290 153391 7677 24130 -85250 -154024
16191 -154024 -201896 -178797 -164812 -184873 -94899 80949 134036 208669 196741 185681 179067
16180 179067 214650 326599 399448 252404 -150596 -126650 -49092 -134188 -180340 -222994 -320430
16169 -320430 -480432 -423882 3367 40640 -134746 -254848 -191303 -144240 -63252 -31185 -126961
16158a26961o4696P7333Q7939J56873j86148K0481J78641j7675n3324j7445O6109
16147A21127K7677J93138J42800p0634j8750j89443j77086p1070o3185j5278j06444
16136b27148p4851J22970K11777J57645j09836r7597L470K6656n5043q3047m8059
16125a73063R1481J30296Q707p0768L0160Q0371l2683k4172J51173m5340p5460
16114G0702j80320p1146J03487o6814m3130J03901J32029J62728O7415j36525
16104A42327j71701m4209Q0359j08581r2008m3414L0070J10126p1408J7268Q0008
16093g1163O5597r922j89639m9845Q4957J1901J41873J49420P633L8569j72415
16082F966j31784m4041L1518j23498r8877P3746J2527K30595J65937n6594N0497
$$ plain form
16158 -126961 -191657 -114324 -26385 130488 -55660 -35179 143462 125787 72463 55018 121127
16147 121127 148804 341942 484742 414108 395358 205915 28829 -42241 -105426 -120704 -227148
16136 -227148 -301999 -179029 32748 190393 80557 -17040 -13570 13086 -41957 -125004 -173063
16125 -173063 -81582 48714 57421 -13347 16813 97184 64501 40329 191502 146162 70702
16114 70702 -109618 -180764 -77277 -144091 -187221 -83320 48709 211437 278852 142327
16104 142327 -29374 -73583 6776 -101805 -193813 -237227 -207157 -97031 -168439 -151171 -71163
16093 -71163 -5566 -15488 -205127 -254972 -170015 -158114 -16241 133179 140812 179381 6966
16082 6966 -124818 -168859 -137341 -260839 -359716 -285970 -273443 -42848 123089 66495 116992
16071A16992J24006J6051k72786k11858l7242k5677J22830K05452L4289O5770
16061A37827L1739K2942j04321j31701j2107n3515l5862P8875Q1061J26222r9342
16050D1818j69721J48200l1443J7679J55974M816j37888r1128m4726J4452Q3297
16039h670P1243J01323j83953j02073j8542j53078K2899R8630J47894m9975N6816
16028a7486N5752N2120p8286q9407K1697m0299q4629Q7905J20441o1458j70026
16017b03676J2362N0817j8524n4179J7477P7485N4063J8207O167K28679L0689
16006B19567j6567o7747o5790j06445l3126j37920O2424Q9520J31108M9062j00522
15995B3564P0392l8179J1927m0470j09053k9218N436O762M6396N0163k6563r4867
$$ plain form
16071 116992 240998 257049 -15737 -227595 -264837 -290514 -167684 37768 72057 137827
16061 137827 169566 192508 88187 -43514 -55621 -109136 -144998 -66123 14938 141160 41818
16050 41818 -127903 20297 -11146 6533 162507 167323 29435 -61693 -106419 -91967 -8670
16039 -8670 62573 163896 -20057 -122130 -140672 -293750 -270851 -172221 -24327 -74302 -17486
16028 -17486 38266 90386 12100 -77307 -55610 -95909 -180538 -92633 27808 -33650 -203676
16017 -203676 -191314 -140497 -159021 -213200 -195723 -118238 -64175 -45968 -39801 188878 219567
16006 219567 203000 135253 69463 -36982 -70108 -208028 -145604 -56084 75024 124086 23564
15995 23564 93956 55777 67704 27234 -81819 -111037 -105601 -98839 -52443 -2280 -28843 -123710
15983a23710j14434j98843J11476L03709R7828p5861K177j04143J68545O814r1417
15972a7859O4462l8525L3879O4879n1949j4778J04623L1867J00475q1195j16395
15961G9484N8516L0174p623j40839m7091p2430O8937k0334J35997J40016j18270
15950A06537j13618L1408n1135J5527n4619Q8565N2756n1066P5581m8894L3006
15939H4048p9770j02256N0047P0960L6468J36862R9334j00154p4715K7582k8106
15928A20300J07773L5047l917l4440k4088o9228k2496O642k410L1491q2516o3996
15916a838P0683p077k14259J30567J52204R0466n0002q9993l9626K1390J50733
15905B13248j14247n2502M4969r6654K5344j6152K7335K3131o1526k5257p3879
$$ plain form
15983 -123710 -238144 -436987 -325511 -21802 76026 165 2342 -101801 66744 73558 -17859
15972 -17859 46603 8078 41957 106836 54887 40109 144732 176599 277074 195879 79484
15961 79484 138000 168174 160551 19712 -27379 -99809 -30872 -51206 84791 224807 106537
15950 106537 -7081 24327 -26808 -11281 -65900 22665 75421 24355 99936 51042 84048
15939 84048 4278 -97978 -47931 23029 59497 196359 295693 195539 120824 148406 120300
15928 120300 228073 263120 259203 224763 200675 131447 108951 115593 113183 144674 62158 -1838
15916 -1838 68845 61768 -152491 -21924 130280 220746 170744 80751 41125 62515 213248
15905 213248 99001 46499 91468 -5186 20158 4006 31341 54472 -7054 -32311 -106190
15894a06190k23991O5858J54049j9264l688P682O5832J75849j01357j96451M5649
15883a36022N7826p4938j37250k02752J41112J73779K59388O957l7053J83507
15873B34554P9091n0174j25406j800R0965n9719j35370r7250j31305m5373Q0776
15862a61011M2244N2638J14654P7494j87037l7874k5030r6281j7269K0459k1507
15851b38520J73570L1738m8178j9118J70655J81267J28692J5509K6539l0652p4054
15840C17448K2099m0464m1354q5507k16395k4504J59651P5202J14r63L3184O7995
15828B66506k80399p8012L6618j7383j16335J33010J41723K23883O1261l55690
15818A5182j49501Q6634L5901Q053J84789P0492k17695j34094J26080K0787j56002
$$ plain form
15894 -106190 -330181 -264323 -110274 -129538 -133226 -125544 -59712 116137 14780 -181671 -136022
15883 -136022 -78196 -153134 -290384 -493136 -352024 -178245 81143 88100 51047 234554
15873 234554 313645 263471 138065 136265 227230 167511 32141 -65109 -196414 -241787 -161011
15862 -161011 -118767 -66129 48525 126019 -61018 -98892 -123922 -220203 -237472 -217013 -238520
15851 -238520 -64950 -33212 -81390 -100508 70147 251414 380106 395615 422154 391502 317448
15840 317448 339547 299083 257729 172222 -44173 -68677 90974 166176 166290 165327 198511 266506
15828 266506 -13893 -91905 -55287 -72670 -189005 -55995 85728 309611 370872 15182
15818 15182 -134319 -47685 -11784 -3731 181058 251550 33855 -100239 25841 46628 -109374
15807a09374j4418j24592J16666J15796r9625p2515J79178l2650m5954J3239J31970
15796E7721p3722L2154K1507j96638j29887J35145R1949o3972l248o8316K19956
15785B2649J16110m03j11329r828K9830r0207m4225l4977J46924O7960r9196j6845
15773b3537m1452N629q5163J07247K3828K9644j3048j9409j78910J21414k9201
15762a02958P5619O9317K8148J75829l9027j64464m109J19032J06009J0126p1737
15751B01785j37559j67038j03097M4513Q5365q2483K729p1562P2911J60325n982
15740i3Q2216q613j43213m8854M3436J37252l2832j59670l5542N9570L6050r8711
15728a69004m9834l6041J01122K79661Q8q0843j56376l8380M9380M97q7317K3317
$$ plain form
15807 -109374 -123792 -248384 -131718 -15922 -115547 -188062 -8884 -41534 -87488 -74249 57721
15796 57721 -16001 16153 37660 -158978 -288865 -153720 -61771 -125743 -128991 -197307 22649
15785 22649 138759 138356 27027 17199 47029 -43178 -87403 -122380 24544 92504 -6692 -23537
15773 -23537 -64989 -59360 -144523 -37276 -13448 16196 3148 -16261 -195171 -73757 -102958
15762 -102958 -27339 41978 70126 245955 206928 42464 38355 157387 263396 273522 201785
15751 201785 64226 -102812 -205909 -161396 -76031 -158514 -155785 -227347 -154436 5889 -93
15740 -93 82123 73510 -69703 -118557 -75121 62131 29299 -130371 -165913 -106343 -70293 -169004
15728 -169004 -218838 -254879 -153757 125904 125992 45149 -111227 -149607 -100227 -99730 -187047 -163730
15716a63730K6966N841j9986j54121J1130J99836K9968J48467j2923k2643L0714
15705G9519R0145J67662j60290j81378l033J2486J02995j11283l1400K4827K13930
15694B04180Q1204o3485j79877Q4743j41786N4293J87653q4719o2245M6575m3406
15683H3130O6083r2092j67012M3701K48702J33122n9603j12430j47445j43K0722
15672A6735J41331j26890j46853J50336M2040K1423n4018j54896K51185r216j55137
15661b3960p9712M5292q7558j70195O1146J04979J42046P9181J7507r3653j83362
15650a88289p9381M5713N6622K9528J34426O2433m853p5635k2238L3438j64384
15639a72620j02428Q5243R5174J28550L3026p0209J51p1836k6535L8364J34940
$$ plain form
15716 -163730 -136764 -130923 -150909 -305030 -293900 -94064 -64096 84371 71448 48805 79519
15705 79519 169664 337326 177036 -4342 -7375 5111 108106 -3177 -34577 -9750 204180
15694 204180 285384 221899 42022 126765 -15021 39272 226925 142206 79961 126536 83130
15683 83130 149213 57121 -109891 -66190 182512 315634 256031 143601 -3844 -3987 16735
15672 16735 158066 31176 -115677 34659 76699 98122 44104 -110792 140393 131177 -23960
15661 -23960 -103672 -58380 -145938 -316133 -254987 -150008 -7962 71219 88726 -4927 -188289
15650 -188289 -267670 -221957 -165335 -135807 -1381 61052 56199 -19436 -41674 -8236 -172620
15639 -172620 -275048 -189805 -94631 33919 66945 -3264 -3113 -74949 -101484 -63120 71820
15628G1820j46530k45853K0223J98401P3585L4602l8490l4907j65372j45815O9766
15617c08570l1623Q5307O1313k7969j3454J19941q8086K26197J00364J6830j46127
15606e877q6273l6203n5412m3444p4281P8655n0322Q1901M1162j01060k3319J73210
15594a01263N7383j3719m4862N3643k2508m2564m7141l2454J17884K4126K6353
15583b5122K5207m7549k05714J61249J02897J07003j3545q7985j92192r1348k8365
15572b95464K16590J28958Q626l2307j58109j3641N2315j3247K6490m3448J5144
15561a08093R6801J09820J70315r0043p0355j9817r1696J55128J11462m534j42976
15550A16012p7524p7039j4128K41538J06900K2290k0023O2973J63307j20765j50902
$$ plain form
15628 71820 -74710 -320563 -300340 -101939 -28354 6248 -32242 -67149 -232521 -378336 -308570
15617 -308570 -340193 -254886 -193573 -221542 -234996 -115055 -203141 23056 123420 140250 -5877
15606 -5877 -92150 -128353 -183765 -227209 -301490 -222835 -273157 -191256 -150094 -251154 -274473 -101263
15594 -101263 -43880 -57599 -102461 -48818 -71326 -113890 -161031 -193485 -75601 -51475 -25122
15583 -25122 85 -47464 -253178 -91929 10968 117971 104426 16441 -175751 -267099 -295464
15572 -295464 -78874 50084 58710 26403 -131706 -145347 -93032 -106279 -79789 -123237 -108093
15561 -108093 -11292 98528 268843 178800 108445 88628 -3068 152060 263522 258988 116012
15550 116012 38488 -38551 -52679 188859 295759 318049 298026 360999 524306 403541 252639
15539B52639p054j11539j2425J20856P6200l3962o4505j87220j19097J37931J2003
15528F3827O2671J14032j18878j33710k0996J74286j22031l8516p6601O090J60743
15517G0917J45224M8304k2846j70675k603j31076j27237l1592k3952R2441N5274
15506i7821n5197J65780J89756Q6440k8123l4473J8708n0281q6205l4124R2010
15495A66470r17n9812q7284j81650k5647q5822O5967J27662M4574K6372O8361
15484E8274q4402N513L939Q460R1450L8884q093j46266o3534K9392J8565J38558
15472I0740R4515j08126O7271Q5604O256j07727j47729J15538l8794K9250l4830
15461E1968j6687R5806j8807j04325n7323j74P622O2877J65028n8468j25536N1318
$$ plain form
15539 252639 245585 134046 121621 242477 318677 284715 220210 32990 -86107 51824 63827
15528 63827 126498 240530 121652 -12058 -33054 141232 19201 -19315 -95916 -89826 70917
15517 70917 216141 264445 241599 70924 68321 -62755 -189992 -221584 -245536 -153095 -97821
15506 -97821 -153018 12762 202518 288958 260835 226362 245070 194789 108584 74460 166470
15495 166470 165553 105741 18457 -163193 -188840 -274662 -208695 -81033 -36459 -10087 58274
15484 58274 -26128 -20615 -16676 -8216 83234 122118 114025 -32241 -95775 -66383 -47818 90740
15472 90740 185255 77129 144400 230004 236260 128533 -19196 96342 57548 86798 51968
15461 51968 35281 131087 112280 7955 -49368 -49542 -41920 20957 185985 127517 1981 53299
15449E3299N9030j33850l4896k6630k6464j00960o2709R6887M2651r5711K9590
15438a99763R5991P0853k8192L09731Q0612r0823j36765L2895m4812l2442J4382
15427G1667j32445L459M9318r4419q2638n6612J62359P6162n3303J59424L7344
15416A40316j22173j32010n1266Q0877o320l4225K4246M3098J00311J26728J04424
15405B74006j39823q2161J04717L5974j65390J3190M1270J3764p1775K0618n6776
15394a2386m5013J43545J98052j12189j78515j4702o4657m1483J82861P1760j1638
15383A15635k16784j83028n2644j9833J33700J63020O8468J11458L0773p4565
15373G6200k25243K3833m105J31418K8361l984J70812o160J2317J41996J12503
$$ plain form
15449 53299 112329 -21521 -56417 -83047 -109511 -210471 -273180 -176293 -133642 -229353 -199763
15438 -199763 -103772 -32919 -61111 248620 329232 238409 101644 134539 89727 57285 71667
15427 71667 -60778 -57319 -8001 -102420 -185058 -241670 -79311 -3149 -56452 102972 140316
15416 140316 18143 -113867 -165133 -84256 -90576 -124801 -100555 -57457 42854 169582 274006
15405 274006 134183 52022 156739 192713 27323 40513 81783 95547 23772 44390 -12386
15394 -12386 -57399 86146 284198 172009 -6506 -21208 -85865 -127348 55513 127273 115635
15383 115635 -101149 -284177 -336821 -356654 -222954 -59934 8534 119992 150765 76200
15373 76200 -149043 -125210 -129315 2103 30464 26480 197292 191132 203449 345445 457948
15362D57948k25370j98757M0768L5704k18245q0705K7644J00408O6219q2382O8673
15351h095O8957n8310j57233K0649J15874r299k8658J4947j089O0306L9974r1251
15339c3228l133o4622p906J68973K35082M6806j33706L0035l8902j00903j3620
15328H4876J19261j2991J5172j38698o5545m6587K04006R5242P401j43580o3757
15317E4800l0766k7929j46541o7757l38n9359O3081l198p1026J01878L5279K838
15305a49038P225N1047J15702P1103r491M0462o1200o0794M2743n1495P9648J38684
15293B14596Q7746j78902O3061O652j12396j45617j44143J01720K9350j3707M6255
15282d5385j45307j76785n84Q3995J65512J54846J26348O4708m6286Q2730K768
$$ plain form
15362 457948 232578 33821 74589 110293 -107952 -188657 -161013 -60605 5614 -76768 -8095
15351 -8095 60862 2552 -154681 -134032 -18158 -27457 -56115 -41168 -42257 18049 58023 -33228
15339 -33228 -36361 -100983 -108889 60084 295166 341972 208266 238301 199399 98496 84876
15328 84876 204137 191146 206318 67620 2075 -44512 159494 254736 262137 118557 54800
15317 54800 24034 -3895 -150436 -218193 -218531 -277890 -214809 -218007 -289033 -187155 -151876 -149038
15305 -149038 -141813 -90766 24936 96039 86548 127010 65810 5016 47759 -3736 75912 214596
15293 214596 302342 123440 186501 193153 80757 -64860 -209003 -107283 -77933 -91640 -45385
15282 -45385 -190692 -367477 -368061 -284066 -118554 36292 162640 227348 181062 263792 266560
15271B66560r9205j34971j82875J4593L482J81827l6419K6539R7249J2757o2529
15260H7008J085j34629m1272R6543j22580J59790M3483O1707P4499K8921r1629
15249A62926n2754O8984M9851J3338j51169j49209j11010j17843j23202J50103
15239b59985J85591l4332n6791J30130J59678N1583l0355N3580Q820j98081k08091
15228a98253P9571M7377M7147J77959j6240O6154p1495p9282q267p595R3831p1373
15216E9534m2529j76232o0703O8789J44500l2453j7087k2958J56936N3410q8795
15205D2412p514n8573M3569J63486n085R1027k650k3437j28492k48644j61715
15194b95616o0553N6905J34588J61666J4535Q317P53r5187n5305J15172n062r7134
$$ plain form
15271 266560 167355 32384 -150491 -135898 -132416 49411 12992 39531 136780 149537 87008
15260 87008 88093 -46536 -87808 8735 -113845 45945 89428 151135 225634 254555 162926
15249 162926 110172 179156 229007 242345 91176 -58033 -169043 -286886 -410088 -259985
15239 -259985 -74394 -108726 -165517 -35387 124291 175874 145519 199099 207919 9838 -198253
15228 -198253 -118682 -71305 -24158 153801 137561 203715 132220 52938 44671 37076 130907 59534
15216 59534 17005 -159227 -219930 -151141 -6641 -39094 -56181 -79139 77797 131207 42412
15205 42412 34898 -23675 19894 183380 178295 269322 266672 243235 114743 -133901 -295616
15194 -295616 -356169 -299264 -164676 -3010 11525 19842 20595 -74592 -129897 -14725 -19787 -116921
15182a16921j42444P755n3824O0304J33303N1913K1742o8238O989O7956j49208
15171a80673K6801R5055N414J1774j1174L1186J2140O5392P0497p4376k0844k8015
15159C177J30344m9674m6665J8538N6473J15610p4943o1667J9570j9421K6271
15148A17613J4073o5002Q4201J11087O0374N8275K6168k57621j87401Q0648K92082
15137C34497o8865k15435j04019k7548N3128J08498J4634O4848n7908l8897M2854
15126A05787R900N1561k2262k5139j2442k3222p4432l4303m3380j19764r8261
15115b85957J02365J76230J08417m7205m3827j11666J81392J83315N1492j99861
15105A14695j61802J6459J27370O4795j43689n179M8834J23729l7426O8270L4559
$$ plain form
15182 -116921 -259365 -251610 -305434 -245130 -111827 -59914 -38172 -106410 -99421 -31465 -180673
15171 -180673 -153872 -58817 -53403 -41629 -52803 -21617 -9477 55915 126412 52036 31192 3177
15159 3177 133521 83847 37182 55720 112193 227803 152860 91193 110763 91342 117613
15148 117613 131686 66684 150885 261972 322346 380621 406789 149168 -38233 42415 334497
15137 334497 265632 50197 -53822 -81370 -28242 80256 94890 159738 101830 62933 105787
15126 105787 115687 167248 144986 119847 107405 84183 9751 -24552 -67932 -187696 -285957
15115 -285957 -183592 -7362 101055 53850 10023 -101643 79749 263064 314556 114695
15105 114695 -47107 -30648 96722 161517 17828 12649 61483 185212 147786 216056 250615
15094B50615o4700J065j45845r4891P25O5133K23688J05402k1477J16351j25799
15083C10267k48948j87655N8700M9655n1166L8117m8014k1679O0554L2660j73529
15072a81038q825J09278J36222Q2306L6322p0179o3356L0162o7991j41580r783
15061a48462P2568J9855q629M6455N3672r9465J8512L8554M0595j41458p5154
15050a82957m652K13230J0238k60331j77955J5103K16754J87436M6461p0212K1086
15039A4201m200J79645O9572k17889P444o0850p0834N1244K13956l2098k45687
15028i5496j3513K65172K02342J008p8912j16664j32002K0519r9582l5039l3834
15017a16001J7691r5133q695R3384O9568n9849n5230j1234J41032O7928j23104
$$ plain form
15094 250615 185915 186980 41135 -53756 -53031 12102 235790 341192 319715 436066 310267
15083 310267 61319 -126336 -67636 -17981 -69147 -31030 -79044 -100723 -40169 -7509 -181038
15072 -181038 -189863 -80585 55637 137943 174265 104086 40730 70892 2901 -138679 -148462
15061 -148462 -75894 -56039 -64668 -18213 35459 -64006 -45494 -6940 33655 -107803 -182957
15050 -182957 -187609 25621 35859 -224472 -402427 -387324 -170570 16866 63327 -6885 14201
15039 14201 10001 189646 259218 41329 48773 -12077 -82911 -31667 182289 150191 -95496
15028 -95496 -109009 156163 358505 359513 280601 163937 31935 52454 -47128 -82167 -116001
15017 -116001 -98310 -193443 -202138 -108754 -39186 -99035 -154265 -165499 -24467 43461 -79643
15006g9643j89102m8532J76615J11526n2870k3791K58456k5409Q1120Q5663m0833
14995B53200k32448M7002j99334r6461Q3313J26692M7848N430R5647L7115K380
14984A70384M0261J2391r9431r4369j33496J10471l9938l4602J21947k3788j46656
14973a16826Q7745J1977K9293J25467N5324O9759j8086q8337l0829J11972O6707
14962C04166j04783k06143k03899O6421O9427m7605J56106O7217l9985K7318J8332
14951A06572J03499R5553L7044o3675j1473j36301k34507j65802J05976P1127
14941i1987m0800J12917J48841K27837l9669j39619K6030j4852k72895k5714J56183
14930D6272N884N863p8270k15241p8673K17871J34648L5717o3477K40010K7759
$$ plain form
15006 -79643 -268745 -317277 -140662 -29136 -82006 -105797 152659 127250 208370 294033 253200
14995 253200 20752 67754 -131580 -228041 -144728 -18036 29812 35242 130889 168004 170384
14984 170384 210645 223036 123605 29236 -104260 6211 -33727 -68329 53618 29830 -116826
14973 -116826 -29081 -17104 12189 137656 192980 262739 244653 156316 125487 237459 304166
14962 304166 199383 -6760 -210659 -144238 -74811 -122416 33690 100907 60922 88240 106572
14951 106572 210071 305624 342668 278993 267520 131219 -103288 -269090 -163114 -91987
14941 -91987 -132787 -19870 128971 356808 317139 177520 203550 188698 -84197 -109911 46272
14930 46272 52156 58019 -20251 -235492 -314165 -96294 38354 74071 10594 250604 278363
14919B78363j26980n4444J1387l221l7187j9567K42362j7536j41591k1083N9223
14908A69726m6517l4164o9710l8088P9791k4227j18363o5430R2512J07974o2853
14897i349j61353J6281P2111k9456J75789J09800j19675K84074O187k98069m1272
14886E068q3505L7643N3438J23954k7964r5767J46025m2747L656P0692k435o7874
14874A20184m3239N185m4696J06744q1782p8553Q3052l3053P179M6142N8570K6611
14862A72344l1191J8235m9343O742M4374j07958p7669J31721o057j12523n4136
14851f5461J41533n1534j01388J43558Q2511j9570k8125J67964J6412J25153M8688
14840D59741l0624r7095p738m8916j49115n3480l2628o7315j63422P7861J26494
$$ plain form
14919 278363 151383 96939 108326 105105 67918 48351 290713 273177 131586 110503 169726
14908 169726 123209 89045 19335 -18753 61038 36811 -81552 -146982 -54470 53504 -9349
14897 -9349 -170702 -154421 -82310 -111766 64023 173823 54148 338222 344409 46340 5068
14886 5068 -78437 -40794 12644 136598 108634 12867 158892 116145 119801 190493 188058 120184
14874 120184 76945 82130 37434 144178 62396 -16157 66895 33842 41021 87163 145733 172344
14862 172344 141153 159388 110045 116787 161161 53203 -24466 107255 101198 -11325 -65461
14851 -65461 76072 24538 -76850 66708 149219 129649 101524 269488 285900 411053 459741
14840 459741 429117 332022 324284 275368 126253 72773 40145 -27170 -190592 -112731 13763
14829A3763o6741k6428J0469O892J27833J12970j56131p3214q1101R5311j10414
14818a46791o8594J24943J67101O3038j16515j27461M3041l3251j02015O4677
14808a31827k8121N6418N1388j76069R583K293K2890J42144J42591n1612P626
14797D7304k626j48335P2196J19712j4430R7242L7166k5137O4794O4598l6520
14786B75964j36048l1483J62010j72373k05086k35350M9214R3577J14761p5158
14776a59972o8900Q4884J10399k8624P1762J05558Q931j12925j20840j32456l2589
14765b74772j9372r1279J0940J86796M9787M4861p7571N0729L5389m9783K07588
14754G3313R2437K4034j9662J40338p374j04626j93926j24030j38880R0350J23133
$$ plain form
14829 13763 -52978 -79406 -68937 -62045 65788 178758 22627 -50587 -131688 -36377 -146791
14818 -146791 -215385 -90442 76659 139697 23182 -104279 -61238 -94489 -196504 -131827
14808 -131827 -159948 -103530 -52142 -228211 -218628 -216335 -193445 -51301 91290 39678 47304
14797 47304 44678 -103657 -31461 88251 73821 171063 208229 183092 247886 312484 275964
14786 275964 139916 108433 270443 98070 -107016 -342366 -293152 -199575 -84814 -159972
14776 -159972 -228872 -143988 -33589 -62213 9549 115107 124038 11113 -109727 -242183 -274772
14765 -274772 -294144 -385423 -374483 -187687 -137900 -93039 -170610 -119881 -84492 -134275 73313
14754 73313 165750 189784 170122 310460 303086 198460 4534 -119496 -258376 -168026 -44893
14743d4893j97197J095j1994J12115R1539j40779j8792Q3059k9984q6428p883
14732b50142R4485O7946L5059N7824p2217q7222q2615J69939J51806O8978M0098
14721A93939l2363R9784r1692N221K19918L1874o5074j0016O8301p8995N2865
14710C93762K02554j11647j48455R5768J82897J90554K01675K03059P1469K0312
14700A301948M4418J39410K01486L1421j76779m03449l29249l00439j75611l1256
14690C01900P1541Q8111q9024m3965j7635j01239j59473L8452J7296N7995J38315
14679C02274r2961P2475r7570q738p8195j11315K21354J86405J21270j61285r2264
14668B61450m6210n5254r1702j83265L4539P9510J44781P0814K6244J1337J21488
$$ plain form
14743 -44893 -242090 -240995 -252989 -140874 -49335 -190114 -208906 -125847 -155831 -242259 -250142
14732 -250142 -155657 -87711 -52652 5172 -67045 -154267 -236882 -66943 84863 153841 193939
14721 193939 161576 261360 169668 174889 394807 426681 361607 351591 419892 340897 393762
14710 393762 596316 484669 336214 431982 614879 805433 1007108 1210167 1281636 1301948
14700 1301948 1346366 1485776 1687262 1718683 1541904 1138455 809206 508767 333156 301900
14690 301900 373441 461552 372528 328563 310928 209689 50216 88668 105964 163959 302274
14679 302274 209313 281788 184218 175480 97285 -14030 207324 393729 514999 353714 261450
14668 261450 215240 159986 68284 -114981 -80442 -932 143849 214663 240907 252244 373732
14657C73732L6938q2481o8042N6984j222k8008J41055q4330m5089N1495j9889
14646C31143J17916J7453j29199J0498N8708O959j04515j07921p1354j8226Q1669
14635A93131m2620K3779K3906l5776Q7982N511K2451o8985j6064n749p6559j43421
14623c2414o2793q7738J1218J76550K81701l341q833l6556N2172L0790l8409n0110
14611B32237j26445j0546n902q0652j04034M0439K09104j3235J91962L3517j85889
14600A80556j40013j68063l991J30392K32099j27719q2799J53562l5172k05448
14590f6596J4858K01192J98794J8106j48007M2739N4360j07490P3224L2984j39513
14579A74651j07323m18K9134j6089O070P4722L3013j10321j8186R9122J35326
$$ plain form
14657 373732 410670 328189 260147 317131 315909 287901 428956 344626 299537 351032 331143
14646 331143 449059 466512 337313 347811 406519 413478 308963 201042 129688 111462 193131
14635 193131 150511 174290 198196 162420 250402 255913 278364 209379 193315 187566 111007 -32414
14623 -32414 -95207 -182945 -171727 4823 286524 283183 274350 237794 289966 320756 282347 232237
14611 232237 105792 95246 89344 8692 -95342 -54903 154201 140966 332928 366445 180556
14600 180556 40543 -127520 -131511 -1119 230980 103261 20462 174024 138852 -66596
14590 -66596 -51738 149454 348248 366354 218347 261086 315446 207956 281180 314164 174651
14579 174651 67328 66910 96044 79955 86025 160747 193760 83439 65253 164375 299701
14568B99701j59134j52315L7578M1514Q5559J29641P3181o2418j39180K761O2923
14557B19811O9903K4727k5047o040O4921Q677r2483o9262j40980R2436K3377L9030
14545B09070K03161n6905k2231R791m8711r5942P5896n8001R4728Q7216l0568
14534C67504L6522j31350l9232J0406k6456k7263l8717q5108K2850O8052k8638
14523A28570o3563m4394r4029K20273k5017K712J46647Q0701m3837J26961m0257
14512C94767j03639k01213J18768K62741o6324L232J06784J96100K49949J67J7678
14501I79010M9170q2782k9299p7269m4505L21020M9592q1870J61056n4852k16774
14490I72497j33879j19513K7097M7588P3916K0592k45858j28299M5688M7355J9686
$$ plain form
14568 299701 140567 -11748 25830 67344 152903 282544 355725 293307 154127 156888 219811
14557 219811 289714 314441 289394 283354 348275 356952 264469 195207 54227 146663 170040 209070
14545 209070 412231 355326 333095 342886 294175 198233 274129 216128 310856 398072 367504
14534 367504 404026 272676 233444 243850 217394 190131 151414 66306 89156 157208 128570
14523 128570 65007 20613 -73416 146857 121840 124552 271199 351900 308063 435024 394767
14512 394767 291128 89915 208683 471424 405100 408332 515116 711216 961165 961332 979010
14501 979010 1028180 945398 916099 838830 794325 1115345 1164937 1083067 1244123 1189271 972497
14490 972497 838618 719105 746202 793790 867706 888298 642440 514141 559829 607184 626870
14479F26870J023L687L8182N3831O3637P3480J65179j60079j32531o537J28096
14468H54838J65154J42157J86768K3121r3702j41120j01053o3199o4457j84855
14458G23652p4901p4318N4904J54538p9747j46283r8396j20828j01723P8091R2413
14447D07402j9738j84074j0043J4141r2311m3265M1225o3157m968l1843N0601
14436F3970K5865M3762n7282J8122J3467j42612l2629J30292P25J03594J40825
14425C08099p3296k88200Q3408N5909N262Q2988j39973q7519j8864J66003j6805
14414G7012k02181p0605K8893j3881J09923J32409J16320K06720R1358J18419
14404E94387k18938j71635l0144O7016j5541k7432j57247J37251J28526Q8930
$$ plain form
14479 626870 627893 631580 669762 723593 787230 860710 1025889 865810 733279 726742 854838
14468 854838 1019992 1162149 1348917 1372038 1278336 1137216 1036163 972964 908507 723652
14458 723652 648751 574433 629337 783875 704128 557845 459449 338621 236898 314989 407402
14447 407402 387664 203590 193547 207688 115377 72112 113337 50180 45212 13369 63970
14436 63970 89835 133597 76315 94437 107904 -34708 -67337 62955 63680 167274 308099
14425 308099 234803 -53397 30011 85920 91182 174170 34197 -53322 -72186 93817 77012
14414 77012 -125169 -195774 -166881 -180762 -70839 61570 177890 384610 475968 594387
14404 594387 375449 203814 173670 240686 225145 197713 40466 177717 306243 395173
14394C95173p4604p3566N542J12396Q4942k2574O6603m9644m9778L6838j11868
14383C19460k49601Q5619J0732M4827k9303n4071q3941K58604p455M9947J92492
14372E37310J28430o4728l56905q0398P7867j03782j02480P705M0825J09511J3725
14361B07080k2330P8908l6114k6229k3276L7761M324P6074m5537q8284k03469
14350d1092j22367J0768J07362L7555k6092K12853p032Q7303l5j6487L5535n7246
14338B21025n7993K5520K04088k05593j30998K12727Q4743p7259p8004K6909p1772
14327A53393j23728J29339l8293m5148Q4976m8890q54J11614q7677j03581p5760
14316d4609L5519K45550K68469n0381j17059k5989q1589K8423J42345p8293q698
$$ plain form
14394 395173 320569 247003 252545 364941 449883 427309 493912 444268 394490 431328 319460
14383 319460 69859 155478 166210 211037 181734 127663 43722 302326 294871 344818 537310
14372 537310 665740 601012 244107 163709 241576 137794 35314 43019 83844 193355 207080
14361 207080 184750 263658 227544 201315 178039 215800 220124 296198 250661 162377 -41092
14350 -41092 -163459 -152691 -45329 -7774 -33866 178987 171955 259258 259223 242736 278271 221025
14338 221025 163032 188552 392640 187047 56049 268776 353519 276260 198256 225165 153393
14327 153393 29665 159004 120711 75563 160539 111649 110795 222409 134732 31151 -44609
14316 -44609 -9090 236460 504929 454548 337489 311500 229911 258334 400679 322386 313688
14305C13688O9824J64943n6170Q2537M5538j66477q2029j7290R18q820M2503K08884
14293E98049Q9514J04710j25155j21931o3412j31940J11979O7114j63606N1537
14283D16859J2240m471M3989P7385J0268k6607q4119K1110j31075o2401n0655
14272B22523J27219L2267N3845P7204n8676K2549q3863j08937p0163J3180r3376
14261A33772K21653N348J11615M8105j89955J29952o0769k6992R1651m0780O7816
14250D91416J06293o5331j11344j22768j08872r6276O2062J62466J41006P876
14240D66528n4441r9673J715K0123N8118p0636o9322k1326j49811N806Q8709o510
14228A69280M6839K8181J40936O4495J091N8876j9528J12113L8633j10313J22830
$$ plain form
14305 313688 383512 548455 492285 574822 620360 453883 371854 354564 355482 346662 389165 598049
14293 598049 687563 792273 667118 545187 481775 349835 461814 528928 365322 416859
14283 416859 429099 424628 468617 546002 556270 529663 445544 466654 335579 273178 222523
14272 222523 349742 382009 435854 513058 454382 476931 393068 284131 213968 227148 133772
14261 133772 355425 360773 472388 520493 330538 460490 399721 372729 464380 423600 491416
14250 491416 597709 532378 421034 298266 189394 93118 155180 317646 458652 466528
14240 466528 412087 312414 314129 334252 392370 321734 252412 231086 81275 87081 175790 169280
14228 169280 216119 244300 385236 449731 450822 509698 490170 602283 640916 530603 653433
14217F53433j48244r5407P9659o2899m0577O4214J24561l8062P169J15123j6910
14206F42060l2667j1756J72520k518q8165r7055q9243k4015K41077P6329J9950
14195H06517j18450j25092O4286r9164J53707K00404m8452L1011J06451k9246
14185I41972n7649J32263J25656j3418j43764M4110Q0289J7955j46271l5394K04733
14174A150482q5913k00538j86672j9935K29622N7693j16314j07612p0982J66263
14164H16094K19521l3538K37986J3483j83295R0598R7809j36955O1674K22231
14154A405608J28634k3673j58107k75379j35467O8025r1405l5427M6998P7106
14144A006913O74p5303J38445J77950J7060n1982o7422r7648J33188J56529L8391
$$ plain form
14217 653433 505189 409782 489441 426542 385965 450179 574740 536678 543847 658970 642060
14206 642060 609393 597637 770157 767639 679474 582419 493176 469161 710238 786567 806517
14195 806517 688067 562975 627261 528097 681804 882208 833756 864767 971218 941972
14185 941972 884323 1016586 1142242 1128824 985060 1029170 1109459 1127414 981143 945749 1150482
14174 1150482 1064569 864031 677359 657424 887046 944739 828425 720813 649831 816094
14164 816094 1035615 1002077 1240063 1253546 1070251 1160849 1258658 1121703 1183377 1405608
14154 1405608 1534242 1510569 1352462 1077083 941616 1009641 918236 882809 929807 1006913
14144 1006913 1007587 932284 1070729 1248679 1265739 1213757 1146335 1048687 1181875 1338404 1376795
14133A376795r1065K7259K4798j34776j17480K9723J86374K7408K3785j69578
14123A183243j64837o3951J69989K59799q5018K477M5957l1783K31570L04888
14113A852334J62352n7844R4267j33671k99575J61362R2043J19428M5497l11093
14103A725100Q71J66770m0789m731j04275l0251K22224K15306J78171L8813j44364
14092B222845J01298K43115R8775K980N8940J79176J50095K60746J43561k9451
14082C432080K75382M62335J74390m9441K87813K85157J65171L13548L74712L20149
14072F041296N29605O99917O71251P27075Q09445O78241P88337J285831J478846
14063A3709844J479555J569954J812978K179388K562578L026895L553494M356628
$$ plain form
14133 1376795 1285730 1312989 1337787 1203011 1085531 1115254 1301628 1329036 1352821 1183243
14123 1183243 1018406 954455 1124444 1384243 1299225 1301702 1347659 1315876 1547446 1852334
14113 1852334 2014686 1956842 2051109 1917438 1617863 1779225 1871268 1990696 2036193 1725100
14103 1725100 1725971 1892741 1851952 1847221 1742946 1712695 1934919 2150225 2328396 2367209 2222845
14092 2222845 2324143 2567258 2666033 2669013 2727953 2907129 3057224 3317970 3461531 3432080
14082 3432080 3707462 4169797 4344187 4294746 4582559 4867716 5032887 5346435 5721147 6041296
14072 6041296 6570901 7270818 7942069 8669144 9478589 10156830 10945167 12230998 13709844
14063 13709844 15189399 16759353 18572331 20751719 23314297 26341192 29894686 34251314
14055C4251314N138298O126823P281569Q617364J0256831J2108860J3947623J5163608
14047A12892290J6203052J6333970J5433810J3632331J1099821Q579253N778703
14040A99953230K414614r43037l943578o563076q778386j0104179j0269639r887850
14032A51878099r335320q249244o994019n928686n001736l885671k822811j845535
14024A07815077r08304p7191Q03406J927236K748800L914021N211579O373644
14016A27808268P810569Q854361R995541J0719341J0929145J0422561Q894638
14009A95434424O519502L634268K94198l181739o363583r339788j1869079j3878530
14001A61249673j5547365j6012699j5788485j4814418j3506144j1722168r833683
$$ plain form
14055 34251314 39389612 45516435 52798004 61415368 71672199 83781059 97728682 112892290
14047 112892290 129095342 145429312 160863122 174495453 185595274 194174527 199953230
14040 199953230 202367844 201424807 197481229 190918153 182139767 172035588 161765949 151878099
14032 151878099 142542779 134293535 127299516 121370830 116369094 112483423 109660612 107815077
14024 107815077 106906773 106829582 107632988 109560224 112309024 116223045 121434624 127808268
14016 127808268 135618837 144473198 154468739 165188080 176117225 186539786 195434424
14009 195434424 201953926 205588194 205882392 202700653 196337070 186997282 175128203 161249673
14001 161249673 145702308 129689609 113901124 99086706 85580562 73858394 64024711
13994F4024711q443879p452887o322512n335283m404787l838063l197831k860756
13986B2168713k684798k178243j718844j581265j489997j213154q98307q66514
13978I537591q54650q10302n34768o78491n60938m12645l34210j46617l16724
13969D888246m49054l02564k95617k80663j00055n3553k53440l52012j80043J8830
13959B640075k33606k05405m1477P3879o2170j19222k16626l8720r1922k02675
13949A502131j2572k0784m9567r6537m2774o4326k30027q2288J0249o6816R0135
13938I36824P6494J40228K3340O3702r1070j34461l0048J35601j9154p1104j60755
13927H69597J9466k7471M9847L9837q543j78402j42927R1189J18728K4097r4892
$$ plain form
13994 64024711 55580832 48127945 41805433 36470150 32065363 28227300 25029469 22168713
13986 22168713 19483915 17305672 15586828 14005563 12515566 11302412 10404105 9537591
13978 9537591 8682941 7872639 7337871 6659380 6098442 5685797 5351587 5204970 4888246
13969 4888246 4439192 4136628 3841011 3560348 3460293 3406740 3153300 2801288 2621245 2640075
13959 2640075 2406469 2201064 2159587 2233466 2171296 2052074 1835448 1796728 1704806 1502131
13949 1502131 1489559 1468775 1419208 1322671 1279897 1215571 985544 903256 913505 846689 936824
13938 936824 1013318 1153546 1176886 1240588 1149518 1015057 985009 1120610 1101456 1030352 869597
13927 869597 889063 861592 911439 951276 942733 764331 621404 712593 831321 855418 760526
13916G60526O54n2797q6481Q133n7017j08048p2921k46886p9311K35570J01001
13905D02423N742N8316j7119j30415M0296j29267j26046o3058n69P2857J00164
13894B13324K11610J38251L8471p5838k8156n1428p1189k4917k9969k7269J18589
13883D11479J3561o3201j96526r1196K7643r589l9120K004j51122N8725M7095
13872I753N053J06285K10759l9898l583q8267k1840J5128r9055n2720n3092j05954
13860a17431N4541J14685l8627N659o194L209n0519j45328n2773N9210J04765
13849f8803J2823P7377J16704N1711M0842j30986j31828J74106J83398o70r6508
13838B28166r1065k61412k7782J69542R3219Q4319j25409K7513j7533q6748R9298
$$ plain form
13916 760526 761180 708383 621902 630035 573018 464970 392049 145163 65852 301422 402423
13905 402423 408165 466481 449362 318947 359243 229976 103930 40872 40303 113160 213324
13894 213324 424934 563185 601656 525818 497662 446234 375045 350128 320159 292890 411479
13883 411479 425040 361839 165313 74117 101760 92171 53051 55055 -96067 -37342 9753
13872 9753 14806 121091 331850 291952 288369 200102 178262 193390 94335 41615 -11477 -117431
13860 -117431 -62890 51795 13168 18827 12633 15842 -34677 -180005 -232778 -173568 -68803
13849 -68803 -55980 21397 138101 189812 230654 99668 -32160 141946 325344 324674 228166
13838 228166 137101 -124311 -152093 17449 110668 194987 69578 97091 79558 -7190 92108
13827I2108J8378j11657j31991l798J66412R7799k6664j02364o7725j38000N4802
13816a52700L1378J41662m6890j1171J04783J72905J15530p734l7855k1140m2969
13805B45799k4730j36867j33010m1291O0143J40945K9558p3942L7853o93p2655
13794C1110J65807K55581o0188r5690j24493R0137j1101j09184p7494J95m5807
13783A8873R8276J78471j9163o4923j28401j18998k1845Q0189J39608P0876l2096
13772B00867K1670j4725j35602l7125M8119o9080L3525L6135P6661j42199O3835
13761H2081p74p2170k6401J05985Q4187q7421L0467o4298m2950q4533L0331N1091
13749E595j527l8880j35890M6543M5536q4118N0213J77452Q6096o8527O1445j05274
$$ plain form
13827 92108 110486 -1171 -133162 -136960 29452 127251 100587 -1777 -69502 -207502 -152700
13816 -152700 -121322 20340 -26550 -37721 67062 239967 355497 347763 309908 288768 245799
13805 245799 221069 84202 -48808 -90099 -29956 110989 140547 66605 104458 103765 31110
13794 31110 196917 452498 392310 296620 172127 262264 251163 141979 64485 64680 18873
13783 18873 117149 295620 276457 211534 83133 -35865 -57710 22479 162087 232963 200867
13772 200867 222537 207812 72210 35085 83204 14124 47649 83784 160445 18246 82081
13761 82081 81307 9137 -17264 88721 172908 85487 115954 51656 8706 -75827 -45496 5595
13749 5595 4068 -34812 -170702 -124159 -78623 -162741 -112528 64924 151020 82493 143938 38664
13737C8664j00010j6192n2674j14255J30170J0774K51188J32181r6538k44619
13727f1311J2993o1417R1074j2009J21269m188p940p6342P3128J01732J9360r0175
13715A06174m9527O831j21464j15352J25389J89915K6286n0891n3195n7222l0689
13704b3745J05951J19041J65353P6184Q3910j81785k13706J28442J11722Q3471
13694D54838N7660r1362k56267j02199J08518l5314J32343k1341r5815q6039j37785
13683g2763Q381K71616R6419j11184K4384L4031r085r6278L2409j22133j7902
13672C7895L366k9848M0537Q4635m376j86733m8254l7856M459J06787J56497J6906
13660A44015j99483j7333j9820j2767J7626R1723R3414o6121L9760N986r224Q7675
$$ plain form
13737 38664 -61346 -77538 -130212 -244467 -114297 -103523 147665 279846 183308 -61311
13727 -61311 -48318 -109735 -18661 -30670 90599 86411 78471 2129 75257 176989 196349 106174
13715 106174 56647 63478 -57986 -173338 -47949 141966 168252 117361 64166 6944 -23745
13704 -23745 82206 201247 366600 442784 526694 344909 131203 259645 371367 454838
13694 454838 512498 421136 164869 62670 171188 135874 268217 246876 151061 65022 -72763
13683 -72763 -64382 207234 303653 192469 216853 250884 241799 145521 177930 55797 37895
13672 37895 41261 11413 51950 136585 132209 -54524 -102778 -140634 -136175 -29388 127109 144015
13660 144015 -55468 -72801 -92621 -105388 -87762 3961 97375 31254 71014 77000 67776 155451
13648A55451m354j01596m297j14877r9723J39947J68828K9012r9642P3470J3218
13637A55437j55297O087J63603Q0546l4158j46280q2253P7445r0498L2114P832
13626A4578j0002J5733J11990O5878p9986m0231j00197j6367L0006N9994K07049
13615B58445J4636j02232O3616J2727O6743j3382k74573p619j2776J18536j8469
13604A05652N6313r6625J13870J13130J64929M3168j09386j2939J6609j28919
13594B65802J5104J73273Q3994q1902j42072l8429J79912J20649L1661K6103J34838
13583G68933J09449J22920J90532k7772N5737J90494k7088j71597l0109k07125
13573I74374k16367p5918J23514o6881O540O1213J17747M971o2475N1855P8112
$$ plain form
13648 155451 151097 49501 45204 -69673 -169396 -29449 139379 168391 68749 142219 155437
13637 155437 140 6227 169830 250376 216218 69938 -12315 65130 -25368 6746 14578
13626 14578 4576 20309 132299 198177 118191 77960 -22237 -38604 -8598 51396 258445
13615 258445 273081 170849 234465 247192 313935 300553 25980 18361 5585 124121 105652
13604 105652 161965 65340 179210 292340 457269 500437 391051 378112 394721 265802
13594 265802 280906 454179 538173 456271 314199 275770 455682 576331 607992 634095 768933
13583 768933 878382 1001302 1191834 1164062 1219799 1410293 1383205 1211608 1181499 974374
13573 974374 758007 682089 805603 738722 745262 806475 924222 929193 866718 918573 996685
13562I96685q8298j79436l0755m449o1917J6479J41323J21724J74801m7543j57927
13551H80687p3693J59329Q198k8591J11614R3508L4389Q6015M3173M5307j31636
13540A228300j69667o6764J49272n0276j68749j55753k09292j38689o9627k29704
13530A19051j53665j09431O5133K38923Q2828j3884n3531J59011J72421r7168
13520D09688j75276j67631j39065O8947J13592J01180l711N8372p0807j88577
13510F712M9184r4457K8599j41470k4955J00195J17833l2913J7081Q4360j01800
13499H369j72644m386R2664O7280M1170J00808o6605j13635o1486N6183o4779
13488a17061Q7233J96397J79279J55238m2742k47986l9582k5230N746n5791n0413
$$ plain form
13562 996685 908387 728951 698196 693747 631830 648309 789632 911356 1086157 1038614 880687
13551 880687 806994 966323 974521 945930 1057544 1151052 1185441 1271456 1314629 1359936 1228300
13540 1228300 1058633 991869 1141141 1090865 922116 766363 557071 418382 348755 119051
13530 119051 -34614 -144045 -78912 160011 242839 228955 175424 334435 506856 409688
13520 409688 234412 66781 -72284 -3337 110255 211435 207724 266096 195289 6712
13510 6712 55896 -38561 -9962 -151432 -176387 -76192 41641 8728 25809 110169 8369
13499 8369 -164275 -168661 -75997 -8717 32453 133261 66656 -46979 -108465 -52282 -117061
13488 -117061 -29828 166569 345848 501086 458344 210358 170776 145546 151292 95501 45088
13477D5088R5824n1092o5215q0918j8060J64860j6472q9728J51998P9589j21881
13466I3993J37791J12373J2325o6657j88966N0151J47196r0660p8563j9677m3014
13455F6292j19324l6613K18571K34469O5175o7049o6695J7561o062p1540K6008
13444B60793M778L2734k3255m778Q697k04402r0940O5159n2318o9435J13722l6595
13432D160O0342J43916j55235j70615K2263K3290J24206O6319N8931p8249n23
13421I8805r0613J8429p2996L2445k4079l3174J1773k2423q7451J10160O2919
13410C795j41431J5617N5235j766P2614J43091l5295p1933l3607J14641J61988
13399B82949j69869k50435O3674M8888r864J24942j42531j62762q8425L2101R9301
$$ plain form
13477 45088 140912 89820 24605 -56313 -74373 90487 74015 -15713 136285 215874 93993
13466 93993 231784 344157 356482 289825 100859 151010 298206 207546 128983 109306 66292
13455 66292 -53032 -89645 128926 363395 428570 361521 294826 312387 306325 234785 260793
13444 260793 265571 298305 275050 270272 278969 74567 -16373 48786 -3532 -72967 40755 4160
13432 4160 64502 208418 53183 -117432 -95169 -71879 52327 118646 177577 99328 98805
13421 98805 8192 26621 -46375 -13930 -38009 -71183 -59410 -81833 -169284 -59124 3795
13410 3795 -137636 -122019 -66784 -68550 4064 147155 111860 39927 6320 120961 282949
13399 282949 113080 -137355 -73681 -24793 -34657 90285 -52246 -215008 -303433 -271332 -172031
13388a72031M2847J0127M3147K21641P3390j76234j05825J46953J152q1333N6830
13377F0664J99990l976m7419P9378o2291O3098K4594j56964r8165j48769n3772
13366a43632P9377J57925J03060m2592j3264l7342K046j263j73610l757R9522
13355B6470L01870P599k08962k50075Q9334R6671j7733l1317J44386N6458J43641
13344C58342M8290j04376j42851P004N3484j59528j34358J40298J54586J47102
13334C67993j24908M3834Q532j86501L8966m4236R4633J0798j06701J7142Q5232
13323B04784M4132j43475O1348Q422q7876m8261k0347K01769J11951l9842O0624
13312C53229k3498p0793Q1940J9518O4793m6185j73610j08008r191P7163n6121
$$ plain form
13388 -172031 -129184 -119057 -75910 145731 219121 42887 -62938 84015 85167 3834 60664
13377 60664 260654 256678 209259 288637 226346 289444 314038 157074 58909 -89860 -143632
13366 -143632 -64255 93670 196730 154138 140874 103532 105578 104315 -69295 -73052 26470
13355 26470 328340 335939 126977 -123098 -33764 62907 45174 13857 158243 214701 358342
13344 358342 406632 302256 159405 166409 219893 60365 -73993 66305 220891 367993
13334 367993 243085 286919 295451 108950 147916 103680 198313 209111 102410 119552 204784
13323 204784 248916 105441 166789 175211 87335 39074 18727 220496 332447 292605 353229
13312 353229 329731 258938 340878 360396 425189 379004 205394 97386 88195 165358 109237
13301A09237j33964J1557J89383j40454q3102j536K48983J11718k5716j07026
13291A79080q5711j50576m2275Q9101J32059L1955q6554J14310L5779O7528M7994
13280C32690L9469Q9960N7516j95179j38216j02187L7835O0814q1618L4452J7086
13269A52622j38360r7568O6236K5397O1434L3376k3313Q8617r0866j40051k2388
13258h4864J19406J04646M0776N6887j03303j37941p0308K5368J10542O6116j9091
13247A08234J72407J36174J23102M543j50161P258J38042m6205k09308J5357N5744
13236C55187K6018L8619K7641j12546m3320j74302M7527N9257L371j2615L1505
13225B46342N6242J3941j59447k1312K0187J7683j55828J2536R2440m0825q3272
$$ plain form
13301 109237 -24727 -13170 176213 35759 -47343 -48879 200104 311822 286106 179080
13291 179080 93369 -57207 -99482 -10381 121678 153633 67079 181389 217168 284696 332690
13280 332690 372159 462119 519635 324456 186240 84053 121888 182702 101084 135536 152622
13269 152622 14262 -83306 -17070 8327 69761 103137 79824 168441 77575 -62476 -84864
13258 -84864 34542 139188 179964 236851 133548 -4393 -74701 -49333 61209 127325 108234
13247 108234 280641 416815 539917 544460 394299 401557 539599 493394 284086 299443 355187
13236 355187 381205 419824 447465 334919 291599 117297 164824 224081 227452 214837 246342
13225 246342 302584 316525 157078 135766 155953 173636 17808 30344 122784 81959 -1313
13214a313N9970O2602J3550j07357L0138L2466P0237R4406J80611Q1198m3197
13203D73311o041l4833j89508K95578L37116K42492M8188J58301K14875j4220
13193A525259k61053m94572l20330J00975j5916j27010m5995K1024J20428l9386
13183D63424q5658j01729k0406L0911N8240l8883M8947n4684j38726L0220J96981
13172C88637M9869J07403j01548j3231j07385m4068P5192J209j34000m5955J3646
13161A89769R8366N9547q8909P4100K59272J71328K08758M78986P55392O35384
13151B841993K86684J26293k38704m52380o06461o36971l59573k98621L0199K0428
13141G12887j01978j71385O038J55803o0304k77960L815K32125J68941M4128K4829
$$ plain form
13214 -1313 58657 121259 134809 27452 57590 90056 160293 254699 435310 516508 473311
13203 473311 467270 432437 242929 538507 875623 1118115 1166303 1324604 1539479 1525259
13193 1525259 1264206 769634 449304 550279 534363 407353 361358 382382 502810 463424
13183 463424 377766 276037 255631 286542 344782 305899 354846 300162 161436 191656 388637
13172 388637 438506 545909 444361 431130 323745 279677 354869 356078 222078 176123 189769
13161 189769 288135 347682 258773 332873 592145 763473 972231 1451217 2206609 2841993
13151 2841993 3128677 3254970 3016266 2563886 1957425 1320454 960881 662260 692459 712887
13141 712887 610909 439524 445562 601365 541061 263101 266916 499041 667982 712110 736939
13130G36939P2165n2068K7841l3164K5991J15201J60120K45251L68407N29323
13120B196006L24514J33085m3244k48954j74161j94116m88062l91567k9463K25332
13110A309370K44957M28615O56144O17010N02092j01396l38393m63014m62344
13101B393041l67170k43840k40611j41894J80119J52130m2390K5817Q4675k792
13091A797085L45843L38119K10287J65746j67545k53136j77046r9394j85295j12056
13081A862608r6315j89108j89221K9198j6948m2665r4076p3642j14295J6599l6004
13070A056131J7909j84409o5789k2235J01665R3262K33306K67450K62444M42541
13060B202275M63619K07931J30612J303j22606l11329m30083n80259n29753j61709
$$ plain form
13130 736939 809104 757036 784877 751713 777704 892905 1053025 1298276 1666683 2196006
13120 2196006 2520520 2653605 2610361 2361407 2187246 1993130 1505068 1113501 1084038 1309370
13110 1309370 1554327 1982942 2639086 3256096 3758188 3656792 3318399 2855385 2393041
13101 2393041 2025871 1782031 1541420 1399526 1579645 1731775 1689385 1715202 1799877 1797085
13091 1797085 2142928 2481047 2691334 2857080 2689535 2436399 2259353 2159959 1974664 1862608
13081 1862608 1766293 1577185 1387964 1417162 1400214 1357549 1263473 1189831 1075536 1092135 1056131
13070 1056131 1074040 889631 823842 801607 903272 996534 1229840 1497290 1759734 2202275
13060 2202275 2665894 2873825 3004437 3005740 2883134 2571805 2141722 1561463 1031710 870001
13050H70001l2246O2875j03677p1294j2481p8000p4254N4728m817r0732o1772
13039D58331k8800j0319m2631j29306r9982n5798N9690J28229Q7572j15309j64479
13028H7198l368J60253j50395o0550P5404P3140r6694r2069J22837m890K28190
13017C39056L1735L4422K1887j58834j32929p0538M3184J40606J39382l2781j20563
13006B34627M8753J57618p7099l5857J0850P8546M0820l417j9264N8618o8222
12995D25973j48347J9180J11668j5341Q848L9758R0143J75506o8824k63402K07395
12984E82557l4174k66864J5156K94573l7180l09348m7721N20L519J8049m7828
12973A71259J18156K50256R2865j69503r3154k9682j22213r5646n0924p5039J14394
$$ plain form
13050 870001 837755 900630 796953 725659 713178 635178 560924 615652 610835 520103 458331
13039 458331 429531 419212 376581 247275 147293 91495 151185 279414 366986 251677 87198
13028 87198 83830 244083 93688 33138 108542 181682 84988 -7081 115756 110866 339056
13017 339056 370791 405213 427100 268266 135337 64799 107983 248589 387971 355190 234627
13006 234627 283380 440998 363899 328042 338892 417438 458258 454841 435577 494195 425973
12995 425973 277626 296806 408474 393133 401981 441739 531882 707388 638564 375162 582557
12984 582557 548383 281519 296675 591248 554068 244720 196999 197519 201038 219087 171259
12973 171259 289415 539671 632536 463033 369879 340197 217984 122338 71414 -3625 110769
12962A10769k4538J09054P8520K4066J64297N7814n3618r0663Q8426p9451r2q6753
12950B97831l3812N3790O3440R3855J887Q4348q1567j53006P0572N7378R561r606
12938D54671j24494m9412k7575J95058o524m2996j53938M6365K03399j41503N4443
12927D07494j4002j24329N7062k5242k1382J16802J06519L8675j35418p1201O0074
12916C95052pR229Q791M4354l2238j03128p0334j80618k834J24997K55402J10470
12904E59136j1737L7138L0806M66p8663j46606m2323j7730K23659q3465m8251
12893D22430K11348K46181J98529j4721k4325j16379j56365m395P4847j29393
12883G07757j4903P2734L4687J7984O9229j1267j46595Q1906l1172J31424L1372
$$ plain form
12962 110769 86231 195285 273805 297871 462168 519982 466364 375701 464127 384676 384584 297831
12950 297831 264019 317809 381249 475104 476991 561339 479772 326766 397338 454716 464277 454671
12938 454671 330177 280765 253190 448248 441724 398728 244790 291155 494554 353051 407494
12927 407494 393492 269163 326225 300983 279601 396403 502922 541597 406179 334978 395052
12916 395052 395045 404274 413065 457419 425181 322053 251719 71101 68267 193264 448666 559136
12904 559136 547399 584537 615343 615809 537146 390540 348217 330487 554146 470681 422430
12893 422430 633778 879959 1078488 1063767 1039442 923063 766698 762303 837150 707757
12883 707757 692854 765588 800275 818259 887488 876221 729626 811532 780360 911784 943156
12872I43156j50324p1395l5370p4609j34234o4655o2807j51928J15698K20734
12862E34266M7091k15858L2007Q6244k6010L4583J12396Q1984J6498m2863L4987
12851F95325j58771j00240o0172J38339J43785J13834m7980j22169K7146k122
12841F26975j38054J34083K51112j3866o6605j07050j7704j56782j32939O515
12831C85685R5247J18253J14161L5400J3008q521J17628J61067j83717j59428
12821F88783J23573N4997j42500j63728O196J02026l5939J2627R9882k7000n1859
12810F67058M8597J69448K04517J8695k0457m643j2946J06922K2293j92047N7264
12799A064701J56308J12867J43902m3351j25833L7290R8118q1304P2849J01341
$$ plain form
12872 943156 792832 721437 686067 611458 477224 412569 349762 197834 313532 534266
12862 534266 581357 365499 397506 483750 457740 492323 604719 686703 703201 660338 695325
12851 695325 536554 436314 376142 514481 658266 772100 724120 601951 629097 626975
12841 626975 488921 623004 874116 860250 793645 686595 668891 512109 379170 385685
12831 385685 480932 599185 713346 748746 761754 753233 870861 1031928 848211 688783
12821 688783 812356 867353 724853 561125 567321 669347 633408 646035 745917 718917 667058
12810 667058 715655 885103 1089620 1108315 1087858 1083215 1070269 1177191 1199484 1007437 1064701
12799 1064701 1221009 1333876 1477778 1434427 1308594 1345884 1444002 1362698 1435547 1536888
12789A536888J5113m0392j42879j28653j24243l6055J21293J03056L3289q2694
12779A254723p1526K8488j5565N2872J11144J63984o555j60851j32467P7465k7856
12768A273856Q1433J14749K00964M5077o4260j36694k49630q0812p8005j13872
12758I92806J7595n8107J04965J75918K3690j92516j41227K02562J42822l1921
12748A236587L9342J04665k02204j490J41455J49572j14712l1186j32445l676
12738A185908K73408K08310j57344m7620P3486j2642o4909o5792m5139n6817J16307
12727A407156R3323J55405J29347O686P9888o566K8129K10665N3702j12598k76956
12716A768181J39625K99985K01230R315K77824J21068j22384R1021M5973K04547
$$ plain form
12789 1536888 1552001 1511609 1368730 1240077 1115834 1079779 1201072 1304128 1337417 1254723
12779 1254723 1183197 1211685 1196120 1248992 1360136 1524120 1517565 1356714 1224247 1301712 1273856
12768 1273856 1355289 1470038 1671002 1716079 1651819 1515125 1265495 1184683 1106678 992806
12758 992806 1010401 952294 1057259 1233177 1256867 1064351 923124 1125686 1268508 1236587
12748 1236587 1275929 1380594 1178390 1176900 1318355 1467927 1353215 1322029 1189584 1185908
12738 1185908 1459316 1667626 1510282 1462662 1536148 1523506 1458597 1392805 1347666 1290849 1407156
12727 1407156 1500479 1655884 1785231 1791917 1871805 1865239 1893368 2104033 2157735 2045137 1768181
12716 1768181 1907806 2207791 2409021 2418336 2696160 2817228 2694844 2785865 2831838 3036385
12706C036385J73246m6323M1926J83100L77670K17384J38130P9063J61880K20979
12696D583440M44398N16105K98490J06814M34848N33513N64529N15282O26345
12687H623764P55110R30029J249422J559945J773889J836913J885864J950746
12679B0565682K514656L816018M802332O010144Q359295J1839526J6975409K4554425
12671I9437487L5164002M8625312O1602020O5176941N0657071K1150009j2291619
12664C69521223l9884125n4342626n4096097m4898463l3558652k3682121j6528060
12657A02531079j0851234o341984k480335J212181N205042R125211J2466329J4355224
12649A25221513J4022203J2615312J2733066J4839717J8453124K1850324K3603143
$$ plain form
12706 3036385 3209631 3163308 3205234 3388334 3766004 3983388 4121518 4200581 4362461 4583440
12696 4583440 5027838 5543943 5842433 5949247 6384095 6917608 7482137 7997419 8623764
12687 8623764 9378874 10308903 11558325 13118270 14892159 16729072 18614936 20565682
12679 20565682 23080338 26896356 31698688 37708832 46068127 57907653 74883062 99437487
12671 99437487 134601489 183226801 244828821 310005762 360662833 381812842 369521223
12664 369521223 329637098 275294472 221198375 176299912 142741260 119059139 102531079
12657 102531079 91679845 85337861 82857526 84069707 89274749 98399960 110866289 125221513
12649 125221513 139243716 151859028 164592094 179431811 197884935 219735259 243338402
12642B43338402K4516614K6513740L1410238M0435385M8105628M3421352K1776903
12635D79518262q726468l5743248n1206980n1921545m1009084k6264136j3881587
12628B50765214o050631l086117m084440p783840j2025897j3271024j2218219
12621A92245046j0923804j1061610j2609715j4121582j4880180j3453445r688329
12614A05506381m812958N7894N861634J2816380K2094484L5114297N1080546O7593982
12606B95312640P7403073O9729058L8254490n850142m4614859o8942184p5474868
12599B85817208o6044474n0609914l7069857k7114203j9771603j5063872j1630409
12592E8512876r102559p194715n652772m489290l528797l162116k835340k469338
$$ plain form
12642 243338402 267855016 294368756 325778994 366214379 414320007 457741359 479518262
12635 479518262 470791794 435048546 383841566 331920021 290910937 264646801 250765214
12628 250765214 244714583 241628466 237544026 229760186 217734289 204463265 192245046
12621 192245046 181321242 170259632 157649917 143528335 128648155 115194710 105506381
12614 105506381 100693423 100751317 106612951 119429331 141523815 176638112 227718658 295312640
12606 295312640 372715713 442444771 480699261 474849119 430234260 361292076 285817208
12599 285817208 219772734 169162820 132092963 104978760 85207157 70143285 58512876
12592 58512876 49410317 42215602 36562830 32073540 28544743 25382627 22547287 20077949
12584B0077949k202617j870797j703583j619000j349806j007382q02976p05127
12576H816661n27520l60131l96698l06462l29894k91613l39177n65433j93767
12567E505966j57638m24172l43496k58578l07937j71086j88505J29234j04069
12558C679719k31840q2109j16011r4451L6761l579j13376Q8503j29788r160k6417
12547B998252l3441Q76k9357L5845J0963l9534j06220K5999L4531j02j9990K18049
12535C095871N16164K69686j8031J42798j895m9533J6806O6318j45835k65595
12525C626754k51134j61757j07458l35568k06599J31294Q8006n2556m3558j13243
12515B574181r7180j3980q649J4030J91168K2811j62348k07311k61475r0307R8142
$$ plain form
12584 20077949 17875332 16004535 14300952 12681952 11332146 10324764 9521788 8816661
12576 8816661 8289141 7929010 7532312 7225850 6895956 6604343 6265166 5699733 5505966
12567 5505966 5348328 4924156 4580660 4322082 4014145 3843059 3654554 3783788 3679719
12558 3679719 3447879 3365770 3249759 3155308 3192069 3188490 3075114 3163617 3033829 3024669 2998252
12547 2998252 2964811 2965687 2936330 2972175 2983138 2943604 2837384 2863383 2897914 2897812 2877822 3095871
12535 3095871 3612035 3881721 3863690 4006488 4004593 3955060 3971866 4038184 3892349 3626754
12525 3626754 3375620 3213863 3106405 2770837 2564238 2695532 2783538 2730982 2687424 2574181
12515 2574181 2477001 2463021 2454372 2468402 2659570 2682381 2520033 2312722 2051247 1960940 2059082
12504B059082M2895K23604J26234r1212J00999O4032j87548O9433j06962j324
12494B299233J07182N3928J16480k522L1529j01768n9473P9115J96832n4574J33788
12483B799750L31877K15858m7448k19769k96003k51612k68395k14568k38859l08077
12473A502754j01414J9323n8063J05282k4598k35567r6332L1532P8133J31784
12463A352834k3046p7880j61991k81081j67189j2146M789m2399o5511j54593M3407
12452D15194J50274j31949p9168j27452K8707J58857J14094l8210J3357p4931
12442D28773j34879O9858j25895K1850K26098K29972J6670J9524k7301J558K155
12431G28383o6586k35093p8008K7311N4174q4016j54544K10894J35810j81135
$$ plain form
12504 2059082 2101977 2325581 2451815 2360603 2461602 2525634 2338086 2407519 2300557 2299233
12494 2299233 2406415 2460343 2576823 2574301 2605830 2504062 2444589 2523704 2720536 2665962 2799750
12483 2799750 3131627 3347485 3300037 3080268 2784265 2532653 2264258 2049690 1810831 1502754
12473 1502754 1401340 1420663 1362600 1467882 1443284 1207717 1111385 1142917 1221050 1352834
12463 1352834 1329788 1251908 1089917 808836 641647 629501 634290 591891 526380 371787 415194
12452 415194 565468 433519 354351 226899 255606 414463 528557 490347 503704 428773
12442 428773 293894 363752 237857 259707 485805 715777 732447 751971 724670 726228 728383
12431 728383 661797 426704 348696 376007 430181 346165 191621 402515 538325 357190
12421C57190q9126K4129Q851J40615j39132q9704N3337M8249m6904N8798J07554
12410D33857N56j2977j27032M6296M1999q4206J47530J98521m0193j89662j67508
12399B47181l0125R2326o1610p4440K10687o1654j70513l8669q2538K7663J27875
12388A86183M4447j8122M2094J04708m3994j59171J05516J2387o5421Q7210J13332
12377D09169P9105r2129j0282n1911k5940Q6585L7737O5837j28460Q6563J10355
12366E66629q2352J6236o4617j17200J10262J48151P6145O1841N293r3462n113
12355F21813k28199M4616J56283J24842M2869p7959M267j81593o1038L554o0387
12344C89068n5102m9178r734J48890j8354j0038j44324q411L1451J00900p6962
$$ plain form
12421 357190 268064 292193 301044 441659 302527 212823 266160 314409 267505 326303 433857
12410 433857 434413 421436 294404 340700 382699 298493 446023 644544 604351 414689 247181
12399 247181 217056 309382 247772 173332 384019 322365 151852 113183 30645 58308 186183
12388 186183 230630 212508 254602 359310 315316 156145 261661 274048 208627 295837 409169
12377 409169 488274 396145 385863 333952 308012 394597 432334 498171 369711 456274 566629
12366 566629 484277 500513 435896 318696 428958 577109 653254 715095 720388 626926 621813
12355 621813 393614 438230 594513 719355 762224 684265 688532 506939 445901 449455 389068
12344 389068 333966 284788 275054 423944 405590 395552 251228 242817 274268 375168 298206
12333B98206J67247J21420J18037Q3646j70227j65666k5561J54459R341j05448
12323D85454l6019L7245Q7670m9789q3653J07505K1558J6836O4537k5195p3547
12312E52602m001r0316n0633N5690M1073J22536J2450j9032K4019L9976J7536
12301G01900j16810k11093J02718J24418J2571R5129n6049q2482j04897J69391
12291F34796K20956j8851j28030J7085R3511m4387j04761O8258L133o8691r6114
12280E76905k83448j28478O0152O9832K03903k4566m0293J21901P0591K65318
12270H91817J37056o6694p0650r3882k3544L3929J02297R1516m1612j04336j09989
12259G45908L3277l817J39845J8389M584J1204j32633J6383O0610L4204J81272
$$ plain form
12333 298206 465453 586873 704910 788556 618329 452663 427102 581561 590902 485454
12323 485454 449435 486680 574350 524561 440908 548413 569971 586807 651344 626149 552602
12312 552602 548601 458285 407652 463342 504415 626951 639401 620369 644388 684364 701900
12301 701900 585090 373997 476715 601133 613704 708833 652784 570302 465405 634796
12291 634796 855752 836901 708871 725956 819467 775080 670319 738577 741710 673019 576905
12280 576905 293457 164979 225131 294963 498866 474300 434007 555908 626499 891817
12270 891817 1028873 962179 891529 797647 774103 808032 910329 1001845 960233 855897 745908
12259 745908 779185 775368 915213 933602 938186 949390 816757 833140 893750 927954 1109226
12248A109226j8534q3049L152J9565Q2648n6812J6579Q1669O1025k4186R9955
12237A291238M0407K5924p627K5883J58264J47693J40089O8384J67085Q6484K47098
12226B390922J98525N5363O2215J38409J04602J49203m9111k44219j2806k6321
12216B766782k36856k76630j92267j33322j6647K52934j36325o6452N4290O0790
12206B076297n252N190R8575N526j19579l0092p1263P4800J2192n7640j9744M3379
12194B012389O8497J10073J38523R6159P3136j5131j93924R04J00466J5532k7559
12183B379065l8075L6589L0745O8075J64723L0178J36309K6344j18993n8322j47843
12172B508795N1319o870j19522M3217K09310K02382Q4610m9748j75291j61032
$$ plain form
12248 1109226 1090692 1007643 1010795 1030360 1113008 1056196 1072775 1154444 1215469 1191283 1291238
12237 1291238 1331645 1357569 1349942 1375825 1534089 1681782 1821871 1890255 2057340 2143824 2390922
12226 2390922 2589447 2644810 2707025 2845434 2950036 3099239 3050128 2805909 2793103 2766782
12216 2766782 2529926 2253296 2061029 1927707 1911060 2163994 2027669 1961217 2015507 2076297
12206 2076297 2071045 2076235 2174810 2180336 2060757 2030665 1959402 2034202 2046394 1988754 1969010 2012389
12194 2012389 2080886 2190959 2329482 2425641 2498777 2483646 2289722 2290626 2391092 2406624 2379065
12183 2379065 2340990 2377579 2408324 2476399 2641122 2671300 2807609 2833953 2714960 2656638 2508795
12172 2508795 2560114 2553244 2433722 2476939 2686249 2888631 2973241 2923493 2748202 2587170
12162B587170j52887O5370L351J22822J49728J52993J21237J56771L72061L43273
12152C921889J88866J18784K84925K27313J69090J72799J45233j42136k03454
12143D883309k91753k73456m4028N8702r6303k30869p5995N7624Q8062K8266K55919
12132D359478L70986K48723K40639L37480M56620L66386K20118L55622M63590
12123G419642M71019N84513N92276O89599R70110J344329J436305J774778J910836
12114A7193407K063573K645689L293093M231109N463601P373898J0045424J3298800
12106F5608594J8661557K6531876L7802865N3348746P0800294Q1860068P3547943
12099D28161943M2305027n99364m0064567o5402133p0950270o1447950m6136742
$$ plain form
12162 2587170 2434283 2499653 2503004 2625826 2775554 2928547 3049784 3206555 3578616 3921889
12152 3921889 4110755 4229539 4514464 4741777 4910867 5083666 5228899 5086763 4883309
12143 4883309 4591556 4318100 4274072 4332774 4236471 4005602 3929607 3987231 4075293 4103559 4359478
12132 4359478 4730464 4979187 5219826 5557306 6013926 6380312 6600430 6956052 7419642
12123 7419642 7890661 8475174 9067450 9757049 10727159 12071488 13507793 15282571 17193407
12114 17193407 19256980 21902669 25195762 29426871 34890472 42264370 52309794 65608594
12106 65608594 84270151 110802027 148604892 201953638 272753932 354614000 428161943
12099 428161943 470466970 469867606 429803039 364400906 293450636 232002686 185865944
12092A85865944l1861568k1285849j3611750p732076k505096L009162Q119812
12085A19998579J1451330J1061680Q337870O365160O814667J0577402J6293615
12078A90900303J9526009J6786790R769412J789899k293782J015892J1718099
12071B49212622K7586867M4067445N3570880M9970170L1644272N282831j8782719
12064D42552368l2520674l4592860l0554763k6304279k5547074k7691072k8371031
12057B36970615k5683488k0133285j4425969j1855432j2825945j4971848j6031084
12050A21043564j5328700j2324826p809955l409032P94803M577413Q856769J4696227
12042A11096263K2347612L2487165M4728696N6328320N9268481M3649076J1870495
$$ plain form
12092 185865944 154004376 132718527 119106777 111374701 108869605 111878767 119998579
12085 119998579 131449909 142511589 150849459 157214619 164029286 174606688 190900303
12078 190900303 210426312 227213102 236982514 238772413 236478631 237494523 249212622
12071 249212622 276799489 320866934 374437814 424407984 456052256 461335087 442552368
12064 442552368 410031694 375438834 344884071 318579792 293032718 265341646 236970615
12057 236970615 211287127 191153842 176727873 164872441 152046496 137074648 121043564
12050 121043564 105714864 93390038 85580083 82171051 82965854 87543267 96400036 111096263
12042 111096263 133443875 165931040 210659736 266988056 326256537 369905613 381776108
12035C81776108k2004100m7804462n9940415n6946312m5214539l2837988k3445823
12028I3582469j6882264j2703424r902446p938093o446575n636569m752401l699415
12020B5621282l105915k670500k364257j764431j438784j284628j264839j223402
12012A0504526j093182o64783n55134o95390m11598m57609k30294j43293j61357
12003F091886p6713j75370l50139m89796k42504k74683l97028j80793j5571r7109
11993C792180j63771n1432q0114j08206n4931M1527k8795k30779p235O3852k42404
11982B929892j69081j08230q4211q3598j68900J40124J11275K7265m3706J0795
11972B561625j86199r7673k76155m27872k45889N5930J7041L5396J54424p2971
$$ plain form
12035 381776108 359772008 311967546 252027131 195080819 149866280 117028292 93582469
12028 93582469 76700205 63996781 54094335 46156242 39709667 34073098 29320697 25621282
12020 25621282 22515367 19844867 17480610 15716179 14277395 12992767 11727928 10504526
12012 10504526 9411344 8746561 8191427 7496037 7084439 6626830 6396536 6253243 6091886
12003 6091886 6015173 5839803 5489664 4999868 4757364 4482681 4085653 3904860 3889289 3792180
11993 3792180 3628409 3576977 3496863 3388657 3333726 3375253 3346458 3115679 3108444 3172296 2929892
11982 2929892 2760811 2652581 2568370 2484772 2315872 2455996 2567271 2594536 2550830 2561625
11972 2561625 2375426 2277753 2001598 1573726 1327837 1383767 1400808 1436204 1590628 1517657
11962A517657L2655J23816k7659j52438K3913J41083K09401o8190k21800q8610
11952A489828j41867j78497p0712K9833j17279j33759L7996J62521P4499k2923
11942A129640P4935j77970j28703m4092p9124n1239j01696k06164R3582J02491
11932F11660J24635q2728j03842j43414j38896J95317Q7440K9139q9634r4271
11922C95406K6367Q5634J48593K2182O4064N0458R6412K06733J31310k7147m5628
11911A154384j14342R219n6770j68853l04169k32802k4242P6535r12l3139L7399
11900C42308P5848L9213k77006j04186P6o1257N9692J00307Q4404j8187o1354
11889A79858K3922J34634j33753j17748K2356J45607J63635N9726n2999m4450
$$ plain form
11962 1517657 1550312 1674128 1646469 1494031 1517944 1659027 1868428 1800238 1578438 1489828
11952 1489828 1347961 1169464 1098752 1128585 1011306 877547 915543 1078064 1152563 1129640
11942 1129640 1204575 1026605 897902 853810 774686 723447 621751 415587 509169 611660
11932 611660 736295 653567 549725 406311 267415 462732 550172 579311 489677 395406
11922 395406 421773 507407 656000 678182 742246 792704 889116 1095849 1227159 1200012 1154384
11911 1154384 1040042 1049261 992491 823638 519469 286667 262425 338960 338048 304909 342308
11900 342308 418156 457369 180363 76177 76253 14996 74688 174995 259399 241212 179858
11889 179858 203780 338414 204661 86913 109269 254876 418511 478237 425238 380788
11879C80788m4954j56085N1313R2717o6803J3707L1920O8204k4062J21146J01380
11868E69271j63697k41175n2880J63383p7855j45770j0014J24043L7229J47065
11858C49600P1465j02558j10187k6612K23492J02215p114K115n010r2345r7439
11847C07622k05932N0486K22354K7725j3209n5422j66508j28666J2488q6003j1219
11836d6284k1247K4738N7957J55056P5558R9360n0333o716M9444k19036o0819
11825E7678Q760j10158J38019J48861m0413j70972m2161r2971P6610k8202J17015
11814F2066Q5631j1331j31535N340J17568K24757L3074j40559k0734j16429n9988
11803D7860Q0983o8689K10314l5736J03957P9332o3227k48374l975P7412L7383
$$ plain form
11879 380788 335834 179749 231062 323779 256976 270683 302603 370807 346745 467891 569271
11868 569271 405574 164399 111519 274902 197047 51277 41263 165306 202535 349600
11858 349600 421065 318507 208320 181708 405200 507415 500301 502416 497406 405061 307622
11847 307622 101690 152176 374530 402255 389046 333624 167116 38450 50938 -35065 -46284
11836 -46284 -67531 -42793 15164 170220 245778 345138 294805 288089 337533 118497 57678
11825 57678 66438 -43720 94299 243160 202747 31775 -10386 -103357 -26747 -54949 62066
11814 62066 147697 136366 4831 10171 127739 352496 385570 245011 224277 107848 47860
11803 47860 128843 60154 270468 234732 338689 418021 354794 106420 102445 179857 217240
11792B17240K08441J41604j48174j75545J1066J9280N6822q5186n415k0367k3003
11781A96763l0225r6835j6948J7130M8889J95947J1148j96752p2546Q4369J03663
11770B44603p8927M1869L8147q3N440n1491j27201O6326J6157J02450J28162j0444
11758C75008j82340j37921J0201j06108O2446J6818N6783O1540J00027J4327j5465
11747B55316q8874o4346P2176m9328n8279J24347J63826n2965l7946m6155K8654
11736B46426R6364l9069j38836n3178j16676K1270L0427p7032o6284Q4960m9604
11725f1232m2529N4509R6559j65974p4973O9437J58738l4594P8934k6967j48169
11714i6261Q5608O0168J4613J16322M3332k08566J1272J10932j6916p5429m808
$$ plain form
11792 217240 425681 567285 419111 243566 254632 273912 330734 245548 240133 219766 196763
11781 196763 166538 69703 52755 69885 118774 314721 325869 129117 56571 140940 244603
11770 244603 165676 207545 245692 245609 251049 199558 72357 138683 154840 257290 385452 375008
11758 375008 192668 54747 64948 -41160 21286 38104 94887 156427 256454 270781 255316
11747 255316 166442 102096 174272 124944 66665 191012 354838 301873 263927 217772 246426
11736 246426 342790 303721 164885 111707 -4969 16301 46728 -30304 -96588 -11628 -61232
11725 -61232 -103761 -49252 47307 -118667 -193640 -124203 34535 -59 78875 51908 -96261
11714 -96261 -10653 49515 64128 180450 223782 15216 26488 137420 120504 45075 40267
11703D0267n6908N167R3303p834j56909M6462J86527L5204k6940M7046L9679j37463
11691A07601j28374j19864J4727R1506J38430K5108L5636r811r2941M6183K5324
11680A33525n6216j96768L6614J36239J29099j34450q3568Q1063o3093Q5948R1067
11669A59460L8020J31947J58255R8663J37662L34098L02921K11738J38813J36444
11659A848021J02947K29816n9731k12181k70054l12584k16610k01248p6814m2088
11649G89474o6428n1192j96185N6657J96410l6724K2350J05977p221j35040J65685
11638H43763K81846J33213l4762J57506J34108J68617N3517K4300J82462J80625
11628B125195P2950J55022L7787J5291k38182m01538j26584l8051j60980k24262
$$ plain form
11703 40267 -16641 -11474 81829 73995 -82914 -36452 150075 185279 158339 205385 245064 107601
11691 107601 -20773 -140637 -125910 -34404 104026 129134 164770 154959 62018 108201 133525
11680 133525 77309 -119459 -82845 53394 182493 48043 -35525 45538 -17555 68393 159460
11669 159460 197480 329427 487682 586345 724007 1058105 1361026 1572764 1711577 1848021
11659 1848021 1950968 2180784 2121053 1908872 1638818 1326234 1109624 908376 831562 789474
11649 789474 723046 671854 475669 532326 728736 692012 714362 820339 813118 678078 843763
11638 843763 1125609 1258822 1224060 1381566 1515674 1684291 1737808 1762108 1944570 2125195
11628 2125195 2198145 2353167 2390954 2406245 2168063 1766525 1639941 1601890 1440910 1216648
11618A216648r1926q4663J03108m3244m3102j13180L4280p6460q2806k49154o6656
11607E02845j63351J5540J5460p7473K38324J45671R3233L00675K83921K06609
11597A561454K37920M7643k38198j71669j97089k42922l41989j38299j47346q0073
11587B89432k6208j09247j00748O3090J11567l9459j40227m3315L8711J8815n8732
11576C679R6245J62473j01896j26274j53477j79480m913J1624j0621J46817o4542
11565b20365n5099n7814j218J62404J31659K8698j13507J29849L1221k10795L6762
11554a38205K2843M382J34330M7264R9262K3704K181q7927p5732K1246j45574
11543i2226m0111J48561j53584N829j1461J4647L2305k9946l5252O4645O0569
$$ plain form
11618 1216648 1124722 1040059 1143167 1099923 1056821 943641 977921 901461 818655 569501 502845
11607 502845 339494 355034 370494 293021 531345 677016 770249 1070924 1354845 1561454
11597 1561454 1799374 1847017 1608819 1437150 1240061 997139 655150 516851 369505 289432
11587 289432 263224 153977 53229 116319 227886 188427 48200 4885 43596 62411 3679
11576 3679 99924 262397 160501 34227 -119250 -298730 -303643 -292019 -302640 -155823 -220365
11565 -220365 -275464 -333278 -334496 -172092 -40433 -11735 -125242 4607 35828 -174967 -138205
11554 -138205 -115362 -110980 23350 70614 169876 193580 195761 107834 32102 53348 -92226
11543 -92226 -132337 16224 -137360 -131531 -142992 -128345 -96040 -125986 -161238 -96593 -36024
11532c6024P0313Q0738m9784j70850P8119j24447J05058j88462r1180K1954O2951
11521b41614Q2701K9229l9557k20578R0590J10161k18573o0814J51998J73964
11511a42493J81788J90219o277k00035k312j2069J9249n0720k1094J11032Q3045
11500A50333r8831l9643J34309j13038j41321M943p1356K6260k4103P4148j13825
11489b12124Q2289k764J7297J01673J3618o4615j13858m2693L2460K0597L0236
11478a37884J34719l8360N8274O640P0717o5724J2803m4576j03576K9266K7881
11467d9820n5456M0589J3312j0477j08777o3178j24739N7932K68347J02424k7946
11456D2211L1699j06794M3804L4282j27166j5182J97810o8695M1414K1208j53361
$$ plain form
11532 -36024 34289 115027 65243 -105607 -27488 -151935 -46877 -235339 -326519 -304565 -241614
11521 -241614 -158913 -129684 -169241 -389819 -299229 -189068 -407641 -468455 -316457 -142493
11511 -142493 39295 229514 223237 23202 20890 8821 28070 -22650 -43744 67288 150333
11500 150333 51502 11859 146168 33130 -108191 -103248 -174604 -148344 -172447 -98299 -212124
11489 -212124 -129835 -132599 -115302 -13629 -11 -64626 -178484 -221177 -188717 -168120 -137884
11478 -137884 -3165 -41525 16749 23389 94106 28382 41185 -3391 -106967 -77701 -49820
11467 -49820 -105276 -64687 -51375 -61852 -170629 -233807 -358546 -300614 -32267 70157 42211
11456 42211 73910 -32884 10920 45202 -81964 -97146 100664 31969 73383 94591 -58770
11445e8770M3539q4128K0422L1850O6009O2255j18487m5359l5795j33081P3827
11434a77718K2635J79324K4897j17960j66685l1542j32755O9532K02504j9096
11424a46864o1003J99272J00243j087L2671K3344O6028j1947k6056j2789Q8747
11413B50559o4107Q6396J5563j7684N9450j06924q9110l9092J6761Q858r9301
11402B1369j41163J25859J20996k6968j33023j19549R6921r9344Q467o65j17147
11391b64247n8224J3752j0130R2998R4482K2162o475j05407k2253j861L503J60254
11379h1446Q5627k4916r0207K8405j3562j32586M8527Q4070J57970q1935p6364
11368i6417J54182J23036j9828p2466q9640N8711J8316j68049N6466M711j97170
$$ plain form
11445 -58770 -15231 -99359 -78937 -47087 18922 81177 -37310 -82669 -118464 -251545 -177718
11434 -177718 -155083 24241 49138 -68822 -235507 -267049 -399804 -330272 -127768 -146864
11424 -146864 -207867 -8595 91648 90561 123232 146576 212604 200657 174601 161812 250559
11413 250559 186452 272848 288411 270727 330177 223253 134143 95051 111812 120670 21369
11402 21369 -119794 6065 127061 100093 -32930 -152479 -55558 -154902 -146435 -147100 -264247
11391 -264247 -322471 -308719 -318849 -225851 -131369 -109207 -115682 -221089 -243342 -245203 -241700 -81446
11379 -81446 4181 -20735 -110942 -82537 -96099 -228685 -180158 -96088 61882 -20053 -96417
11368 -96417 57765 180801 160973 88507 -1133 57578 75894 -92155 -35689 -30978 -228148
11357b28148L9734l1340k2581j9590R0049N0028J10448Q117K7198K1104J5357
11346F0376m3492m945r3281q7455m4103j27785J11181J11177m8220J67473J65308
11335A66234K0507k39386j40839l9427j0241K22057m8310M0351J07636K31082
11325C09664r8902j30935N1775K30210j8536j69471p5897j47984O5919J87353
11315B03196K5488j03672j88992k22335J02564J25424O4958j23126J2157P665
11305i6673j70186J71392K31230J915r3161l863O8713j62762k00193N7354J34456
11294f1778K02245N8091j41866l2047J31281J54631L9648J18593R1632n7025n5334
11283D48071j70731j12674j33522o5909P2904J09899q0207O6240p476n9538p4128
$$ plain form
11357 -228148 -188414 -219754 -242335 -261925 -171876 -121848 -11400 -3283 23915 45019 60376
11346 60376 16884 11939 -81342 -168797 -212900 -340685 -229504 -118327 -166547 926 166234
11335 166234 186741 -52645 -193484 -232911 -243152 -21095 -69405 -29054 78582 309664
11325 309664 210762 79827 131602 361812 343276 173805 97908 -50076 15843 203196
11315 203196 228684 125012 -63980 -286315 -183751 -58327 6631 -116495 -104338 -96673
11305 -96673 -266859 -95467 135763 137678 44517 40654 109367 -53395 -253588 -196234 -61778
11294 -61778 140467 198558 56692 24645 155926 310557 350205 468798 560430 503405 448071
11283 448071 277340 164666 31144 -34765 38139 148038 67831 134071 126595 67057 -7071
11272g071R9714J4702J2661m4099l0493j68083o629J14331j06334k81767j11760
11261e14828J94766N3824J39783N7735m0380j43959N8225J27335O0004j45084
11251a52579p8523m6325J2314l5676O2915R5352k7643p74M0210k3783K8226N0862
11239g5424L3196m0733P8286J31078P3640q8099n5955q4399J5718j8789q5402
11228a16883O3882J71225j74417j88024j44334O2633J55702Q1936n1253J33277
11218f256n546K482l657j25314k53891K7986J21066J49510J28134J0083k71435
11207b26838l6685J54353K53982J24259j03178j32123J23124N7622p7373j74895
11197c7752m8719O6501j55952P3707K16926k20960j74794q6751O7332L2883Q3020
$$ plain form
11272 -7071 92643 107345 120006 75907 45414 -122669 -129298 -14967 -121301 -403068 -514828
11261 -514828 -320062 -266238 -126455 -68720 -109100 -253059 -194834 -67499 -7495 -152579
11251 -152579 -231102 -277427 -265113 -300789 -237874 -142522 -170165 -170939 -130729 -154512 -126286 -75424
11239 -75424 -42228 -82961 -4675 126403 200043 111944 55989 -28410 -12692 -31481 -116883
11228 -116883 -53001 118224 -56193 -244217 -388551 -325918 -170216 -88280 -139533 -6256
11218 -6256 -11802 -9320 -12977 -138291 -392182 -364196 -243130 -93620 34514 44597 -226838
11207 -226838 -263523 -109170 144812 269071 165893 33770 156894 214516 137143 -37752
11197 -37752 -86471 -19970 -175922 -102215 114711 -106249 -281043 -367794 -300462 -267579 -184559
11186a84559J23866L8621J6739j3350j40194J31965Q4356J5391P4511J47468J30206
11175D25020N8444k0189j12123l5036J11413K25517J5925r4651n6924j11473j9263
11164C86660M9355j44717j77997J26820N8245j69572q6350M4963r2074r3099O4971
11153c2795L2044o1576Q6269L1251Q7027O8403p782m0099p3969l975P8499J4736
11141A78033K9703j48879k55456P1517J58886n4856k4856J06442j0545k2755P6988
11130A04222K1245M9143j5557j88521j68264N4421J40293p3017j25367m7501O9440
11119a79463j2338m4710J96656N2324K0639L0226r719j19834m5701J9862m6577
11108a38635j31643L0238M9344N1497J25748L5092k2970L1165J04965O7519l5684
$$ plain form
11186 -184559 -60693 -22072 -5333 -18683 -158877 -26912 57444 72835 147346 294814 425020
11175 425020 483464 463275 351152 316116 427529 653046 668971 574320 517396 405923 386660
11164 386660 436015 291298 113301 240121 298366 128794 42444 87407 -4667 -97766 -32795
11153 -32795 -751 -62327 23942 55193 142220 210623 202841 162742 88773 84798 163297 178033
11141 178033 207736 58857 -196599 -125082 33804 -21052 -45908 60534 49989 27234 104222
11130 104222 125467 174610 159053 -29468 -197732 -143311 -3018 -76035 -201402 -248903 -179463
11119 -179463 -191801 -236511 -39855 12469 33108 63334 53615 -66219 -111920 -92058 -138635
11108 -138635 -270278 -240040 -190696 -139199 -13451 21641 -1329 29836 134801 202320 166636
11097A66636r7282k4283p0056j16520Q6835J55665j5990j55577j05021k4711M3224
11086a57080J45408J47578k5140k81970j31276N9192K76813K4385k02298o5670
11076b10058p5066q7369N2334r4439J16223m9788j18611J36539J36956M171M9013
11065a40095J8748J4672K506M1544q1275j24650M7939J42181l8363P6011O3446
11054B2664L1017K8085O4747L6824m7609j22227k16953Q0883q5950k07152J22997
11043b92674J77134R9176o5298p2773K7514N7616P3214J51264j57303k5443N8094
11032C0521j61708K2142J59452k61964J99N8515n238K7555P8774O9746j64606
11021a46612k4531N3598J16411L3280J5692J12264J4958j79674j95931K130J87990
$$ plain form
11097 166636 69354 45071 -24985 -141505 -54670 100995 85005 -70572 -175593 -200304 -157080
11086 -157080 -11672 135906 110766 -171204 -302480 -243288 33525 57910 -144388 -210058
11076 -210058 -285124 -372493 -320159 -414598 -298375 -348163 -466774 -330235 -193279 -189108 -140095
11065 -140095 -121347 -106675 -104169 -62625 -143900 -268550 -220611 -78430 -116793 -40782 22664
11054 22664 53681 81766 146513 183337 135728 13501 -203452 -122569 -208519 -415671 -292674
11043 -292674 -115540 -16364 -81662 -154435 -126921 -69305 3909 155173 -2130 -27573 30521
11032 30521 -131187 -109045 50407 -211557 -211358 -152843 -158081 -130526 -51752 17994 -146612
11021 -146612 -171143 -117545 -1134 32146 47838 160102 175060 -4614 -200545 -198415 -10425
11010a0425r5572j06200L0156O0547J23503l3731j52965m4078O9307j07018j09281
10999c75757J20246j0991P3580q272J75894P9456j43031q8809k9628j16307O1652
10988b61967K6486j50356K0476K5192J12826J32880J7945j12371Q4718J17316
10978A3145j400j46362n2027K02837o2988j73493J07577J2295P45j77187L0775
10967b46083N5971J51389o5308k0876o7996o6923m474J56823p119r2535j32295
10956c39426n1042K58133J94438N6565j79523j65070R7844R9641L9891n8808l4452
10945h1809Q5452J26835o4644j37280k29506j27446P7599R6842J79740Q9224Q7757
10934A02764j12457j48610J39874K4790k02480j58465M4506J18542K9720Q6165
$$ plain form
11010 -10425 -105997 -212197 -182041 -121494 2009 -31722 -184687 -228765 -159458 -266476 -375757
10999 -375757 -255511 -266502 -192922 -201194 -25300 54156 -88875 -177684 -207312 -323619 -261967
10988 -261967 -235481 -385837 -365361 -340169 -227343 -94463 -76518 -188889 -104171 13145
10978 13145 11745 -134617 -186644 16193 -46795 -220288 -112711 -100416 -99671 -276858 -246083
10967 -246083 -190112 -38723 -104031 -124907 -192903 -259826 -264300 -107477 -114596 -207131 -339426
10956 -339426 -390468 -132335 62103 118668 -60855 -225925 -128081 -28440 11451 -47357 -81809
10945 -81809 3643 130478 65834 -71446 -300952 -428398 -350799 -253957 -74217 15007 102764
10934 102764 -9693 -158303 -18429 6361 -196119 -354584 -310078 -191536 -161816 -75651
10924g5651n9286j07150J43274j0426J07094P5380r1758j47414N9097Q214j46743
10913b45369O3130J96895J52768r0277r5271j90252j06421N8955K2711J7756L3604
10902a81771M6671J0501R6733q4280j09059q2667m7477J96111J39029k22147j12950
10891c51306P7063q7405O2224J00595K1164L4302K1804j0834J63360j33597q4489
10880a87119k3009P1197m3366n966J00556N6404p5814L7726o4791p3607J8971
10869a88818J00649n751J86239O9212r5085n026j40515j56782P7017O6128n5477
10858a48209j01130N5700R5956n3128j25440o5892j22186J8604J46276K33777
10848f5672J27523O1965P1529P5098n5771n072n2206j18555R4083J9814o5195
$$ plain form
10924 -75651 -134937 -242087 -98813 -109239 -2145 73235 -18523 -165937 -106840 -98626 -245369
10913 -245369 -182239 14656 167424 77147 -18124 -208376 -314797 -255842 -233131 -215375 -181771
10902 -181771 -135100 -124599 -27866 -112146 -221205 -303872 -351349 -155238 -16209 -238356 -351306
10891 -351306 -274243 -361648 -299424 -198829 -177665 -143363 -121559 -132393 30967 -102630 -187119
10880 -187119 -210128 -138931 -182297 -188263 -87707 -31303 -107117 -69391 -134182 -207789 -188818
10869 -188818 -88169 -93920 92319 161531 66446 61420 -79095 -235877 -158860 -92732 -148209
10858 -148209 -249339 -193639 -97683 -150811 -276251 -342143 -464329 -445725 -299449 -65672
10848 -65672 61851 123816 195345 270443 214672 209600 157394 38839 132922 152736 87541
10837H7541m4172n6614j44945l2802n4189J17090P8687K0970j74717p2954N0716
10826b25389J7333M9307N5926p8847P6011l0305j0403p9904J44410l120Q6303
10815A322K2765o6219k700Q336j07431k2863l7489q605J0653L9383J85369L4287
10803E6808j12349Q2816J92637R228j31103J3392j18327o4355o022o3430n6576
10792a97281P2582R5939q1989P3527L3440L1890L058m6629k4098j03796O1703
10781h1654J56443P6991O289o7984K4819J1681j44822o8092o5835J13308N1810
10770A2954J28314j24427K5706o5573j18278o7464J39340J46467P334j01895J18261
10759A00739Q7788j78461J9371M2120K9598R9090N1988j71492k01120j16955P1994
$$ plain form
10837 87541 43369 -13245 -158190 -190992 -245181 -128091 -49404 -28434 -203151 -276105 -225389
10826 -225389 -208056 -158749 -102823 -181670 -105659 -135964 -146367 -226271 -81861 -84981 1322
10815 1322 24087 -42132 -44832 -36496 -143927 -166790 -204279 -212884 -202231 -162848 22521 56808
10803 56808 -55541 27275 219912 229140 98037 111429 -6898 -71253 -77275 -140705 -197281
10792 -197281 -124699 -28760 -110749 -37222 -3782 28108 31166 -15463 -39561 -143357 -81654
10781 -81654 74789 151780 158069 90085 114904 126585 -18237 -86329 -152164 -38856 12954
10770 12954 141268 16841 42547 -23026 -141304 -208768 -69428 77039 84373 -17522 100739
10759 100739 188527 10066 29437 71557 101155 200245 252233 80741 -120379 -237334 -165340
10748a65340R5109n296K2482q5165K25362J30648j02924q4997N9265j00568j33720
10737a45144L9186J25316N4612j41659k1203L3484R8596O2296N5237L0461l1148
10726A60034j93573k09622O2905Q9644O5694K46799L6817l14390j16289K4398
10716a47583L9784J60761j52838j38898M1345O3472O5639r0531l4462R6187o5563
10705a62687j45599J8872m7345J20921N782L5817J77862Q2897r2164L021Q4964
10694H2341k9968l6918o298j18419k299j0184l2721O4761K49o7466O2191k4289
10682a19020n3297j58873M1378J23173J22482q7546J27790K809l4595J1318n4857
10671g9238n8958R6185L5218p6647q4488K4946j3703m3616P782J14941k1130J2402
$$ plain form
10748 -165340 -70231 -75527 -53045 -138210 87152 217800 114876 29879 89144 -11424 -145144
10737 -145144 -105958 19358 73970 -67689 -88892 -55408 43188 105484 160721 191182 160034
10726 160034 -33539 -243161 -180256 -90612 -24918 221881 258698 -55692 -171981 -147583
10716 -147583 -107799 52962 -99876 -238774 -197429 -133957 -68318 -158849 -193311 -97124 -162687
10705 -162687 -308286 -289414 -336759 -215838 -210056 -174239 3623 86520 -5644 -2623 82341
10694 82341 52373 15455 9157 -109262 -111561 -121745 -154466 -89705 -89456 -156922 -94731 -119020
10682 -119020 -172317 -331190 -289812 -166639 -44157 -131703 -3913 -1104 -35699 -24381 -79238
10671 -79238 -138196 -42011 -6793 -83440 -167928 -142982 -156685 -200301 -192519 -77578 -98708 -86306
10659h6306J40577M5900m8400K2663K03187n9845q8644n2939k8748R6253j32442
10648A1256k48830J2340J67820O8865k5460J09652m3300O2034M7124r1335J0050
10637H0216K1994j7049J0175l2598Q6304q9347j26188k3126M7730j409P0837Q878
10625C6417j03724k9924j01505j15050K27459J09412m094K7474J16311k3580r4583
10614D4613j24635j91486q8801N0864J7535P3574P8065P1986J90550J08048j4489
10603B15824L7081M4544j04694L5247p737k0156j02326k66401J3081O4959J02448
10592A1870J35056j14210K7373l4866r708k1090M7062m0658p3281n3847Q8210
10581c8089n893o888j18848j83310Q8345K47296P4282K1941O1712M8548q4052
$$ plain form
10659 -86306 54271 100171 51771 74434 277621 217776 129132 76193 47445 143698 11256
10648 11256 -237574 -225234 -57414 11451 -14009 95643 52343 114377 161501 70166 80216
10637 80216 102210 85161 95336 62738 149042 59695 -66493 -89619 -41889 -43298 27539 36417
10625 36417 -67307 -97231 -198736 -313786 -86327 23085 18991 46465 162776 139196 44613
10614 44613 -80022 -271508 -360309 -309445 -291910 -218336 -140271 -68285 122265 230313 215824
10603 215824 252905 297449 192755 228002 220265 200109 97783 -168618 -155537 -90578 11870
10592 11870 146926 32716 60089 25223 15515 -5575 41487 829 -72452 -126299 -38089
10581 -38089 -43982 -50870 -169718 -353028 -264683 -17387 56895 78836 140548 189096 105044
10570A05044o7533j00011j60320L8469l1472O6343R9554M1384J1928j21503O1709
10559e6408K54277J07124j86442j25970J07182Q2370M7019j3085M333N9890L3228
10548C13518j89394r0819j14975j16067q2952p3780L5670K7627J19115p6521k9776
10537b78354K22772J58515L2040o5430o6557K3778j5158J49737l4075p5951r8686
10526d7369q929J8079J32854P5801N4803l0068j23666q1811K1899J1705M9356
10515G2654j143j17152k7923N0807J08226j3551n5212p0113J86804J43959m5208
10504B32148k11111k07942j16808l7642J24881M7689O1478P8543j17873j1382
10494a58019L1042J52237j8355j07498n4583j22795m2511K34489K96536J5130
$$ plain form
10570 105044 37511 -62500 -222820 -184351 -215823 -149480 -49926 -8542 3386 -118117 -56408
10559 -56408 197869 304993 118551 -7419 99763 182133 229152 216067 220400 280290 313518
10548 313518 124124 33305 -81670 -197737 -280689 -354469 -318799 -291172 -172057 -248578 -278354
10537 -278354 -55582 102933 134973 69543 2986 26764 11606 161343 127268 51317 -47369
10526 -47369 -56298 -38219 94635 170436 225239 195171 71505 -10306 11593 23298 72654
10515 72654 71511 -45641 -73564 -22757 85469 71918 16706 -53407 133397 277356 232148
10504 232148 21037 -186905 -303713 -341355 -216474 -168785 -107307 -28764 -146637 -158019
10494 -158019 -126977 25260 6905 -100593 -155176 -277971 -320482 -85993 210543 225673
10484B25673k04336j00745J22628K9290j01344j35043J08038k4438p3949J33727
10474b0499n5196j84238Q7263J00602O3623j581R1914J08247m5955j4728M0318
10463A69770j11062m0978K222k6585J04159j00599m9712K8362J12202p3130n4605
10452c9956K3094r1132r547O4706J9346K9116J17405r391o7927l4754m6585P1746
10440B6121J08474j5535j05428j60413N2750k4550l7602J73040J21034N0017P1466
10429B59374M934j60127k20395O750J71976K7080j05711q7707Q5830j1976j20421
10418a50393L2833j5146L1462M7791l5286M0261L561m4738N3708K8811J12005
10407A04869m1447j3812K7125K3404k07690j70817J6401j35740J8454J67063J40645
$$ plain form
10484 225673 21337 -79408 43220 72510 -28834 -163877 -55839 -80277 -154226 -20499
10474 -20499 -75695 -259933 -172670 -72068 -8445 -10026 81888 190135 144180 129452 169770
10463 169770 58708 17730 19952 -6633 97526 -3073 -52785 -24423 87779 14649 -39956
10452 -39956 -16862 -107994 -117541 -52835 -33489 -4373 113032 103641 35714 960 -45625 26121
10440 26121 134595 119060 13632 -146781 -94031 -118581 -156183 16857 137891 187908 259374
10429 259374 264308 104181 -116214 -109464 62512 89592 -16119 -103826 -17996 -29972 -150393
10418 -150393 -117560 -132706 -101244 -53453 -88739 -48478 -44917 -89655 -35947 -7136 104869
10407 104869 63422 49610 76735 100139 -107551 -278368 -261967 -397707 -379253 -212190 -71545
10396g1545P1831q7417k45107Q3466J92062n989j22827j8653J48016R3874j57162
10385a19451n8739l5797l97l4084p1825J24474J59168J52258J7476K9985o8021
10374I5047p8289j16801J8635m599k47914o6053q3260R2139J33403J41335j5199
10363a31556j26210L3415J53900R1159Q5146P8899J15198N695q7029k4900k0403
10352A73314J5361n3704l9575J70286J01038o0735k447j6866M4154j81670q011
10341A41145j7663J40688J83964P3171q721k17346k30227M3074J29795O1738m1251
10330B58367K8639O6949j54062M25J84336j38796k45617o2190M7899O1228R7629
10319A44807j69737k2883J91439Q5838j31346n7048K9331J41616r8090p3983O7200
$$ plain form
10396 -71545 286 -87131 -332238 -248772 -56710 -62699 -185526 -204179 -56163 37711 -119451
10385 -119451 -178190 -213987 -214384 -248468 -320293 -195819 -36651 115607 133083 163068 95047
10374 95047 16758 -100043 -81408 -86007 -333921 -399974 -483234 -391095 -257692 -116357 -131556
10363 -131556 -257766 -224351 -70451 20708 105854 184753 299951 305646 218617 193717 173314
10352 173314 188675 134971 95396 265682 366720 305985 303538 286672 330826 149156 141145
10341 141145 123482 264170 448134 521305 512584 295238 65011 108085 237880 299618 258367
10330 258367 287006 353955 199893 200318 384654 245858 241 -61949 -14050 47178 144807
10319 144807 -24930 -47813 143626 229464 98118 41070 70401 212017 113927 39944 107144
10308A07144J27100J10811m0234p3509r5443n7192M9414L1135N6878q132l9543
10297A68429P422J04316R1727P1771j65315j57675j03789n4474K08487O4418K1183
10286B56500j99329r602N9582J90759O5345j01338K8360k6240J1568q5756N4286
10275B44135K3954M8233k65690j33127j0573P7360R4618l3275Q4065Q9769N275
10264B24744o151m2252j26102k8023n7905Q1057M7423L9618l705j3892r9146k6343
10252a0677N6495R8151J92443j37560k08184J10867O2339J94170q9396Q8976L1758
10241C89382q6950j15011m9081K1020o6612M0835R2677n1205p6611L6388Q5231
10230B20063k08115k7093R0512L4809J06338j3797o4978l3501Q0407Q0759L055
$$ plain form
10308 107144 234244 345055 304821 231312 135869 78677 128091 159226 216104 207972 168429
10297 168429 175851 280167 371894 443665 278350 120675 16886 -37588 170899 235317 256500
10286 256500 57171 47569 107151 297910 363255 261917 290277 264037 275605 189849 244135
10275 244135 268089 316322 50632 -82495 -93068 -15708 78910 45635 129700 219469 224744
10264 224744 218593 176341 50239 22216 -35689 45368 92791 132409 128704 114812 15666 -10677
10252 -10677 45818 143969 336412 198852 -9332 101535 163874 358044 268648 357624 389382
10241 389382 302432 187421 138340 159360 92748 133583 226260 175055 98444 134832 220063
10230 220063 11948 -15145 75367 110176 216514 202717 137739 104238 184645 265404 268459
10219B68459j45925J47292n9992o0715q5152j7270k1887n4497l3440J32656R3472
10208A63001k05274n6007j17616K5631L2324M3204N3385K8339J84826R2634p493
10197B36954m2248P8016j44044k3491L7542o9986J7440k3470P8605K00114q3459
10186B61973j00768q146k7696o0565l8634o8813N2204j47860R7389J63230Q8146
10175B10460O2707K5921o7091N0769p5170j10581j3106O1351J35208L5431l6455
10164B79444K5737k295M009j01954R5019o0015k4229J2367l3742m7784n2639q7392
10152F526J02309J1284N9913m6200j90362J22188K08697j25685K014J00771L0462
10141B81917j40488k21124m3662J39780J11106p0107r3167J38090P1305Q840l4047
$$ plain form
10219 268459 122534 269826 209834 149119 63967 46697 24810 -29687 -63127 69529 163001
10208 163001 -42273 -98280 -215896 -190265 -157941 -114737 -61352 -33013 151813 244447 236954
10197 236954 194706 272722 128678 105187 142729 72743 90183 66713 145318 345432 261973
10186 261973 161205 153059 125363 64798 26164 -42649 9555 -138305 -40916 122314 210460
10175 210460 273167 299088 231997 282766 207596 97015 83909 145260 280468 315899 279444
10164 279444 305181 302886 306895 204941 299960 239945 215716 228083 194341 146557 93918 6526
10152 6526 108835 120119 180032 133832 -56530 65658 274355 148670 150684 251455 281917
10141 281917 141429 -79695 -123357 16423 127529 57422 -35745 102345 173650 182490 148443
10130A48443k32590r081K20940l238k82662k08544J40346J02037Q6729J09568
10120G1948Q0141J0982k6015j40793m6923J44013J49386J12610m5134k26767k05423
10109a21975K07721J21451r6170q5107N7964j2860L0966J22541N7154p8890j9009
10098A83786R2792J43586K4015o3358r131m8744o7188l780O9030j76237N7691
10087B02462K54820j8917j59726j70253n1852O4932m4379j12683L9582J1007J27337
10076A42330J2287J32596J47529K814n2506j42226j04023j16825N9685J19550
10066B01211P545M0490m1170j24388J69441N4178j1049N5016N7653p5683j01331
10055B31913p3288n5577N3631R4680Q9600R9709L9290l6897r2276r724j28169
$$ plain form
10130 148443 -84147 -93228 127712 124474 -158188 -366732 -226386 -124349 -37620 71948
10120 71948 152089 163071 137056 -3737 -50660 93353 242739 355349 310215 83448 -121975
10109 -121975 85746 207197 111027 25920 83884 71024 101990 224531 281685 202795 183786
10098 183786 276578 420164 444179 380821 371690 322946 255758 251978 321008 144771 202462
10087 202462 457282 438365 278639 108386 56534 121466 77087 -35596 3986 14993 142330
10076 142330 154617 287213 434742 437556 385050 242824 138801 21976 81661 201211
10066 201211 208756 249246 208076 83688 253129 307307 296258 351274 408927 333244 231913
10055 231913 158625 103048 156679 251359 340959 440668 479958 443061 350785 341061 212892
10044B12892O0973l4848j6766J17313J99849J6130k1842p7235j71596o0788r8464
10033A25618n0927Q8221J79706Q14Q496K8841k82040J0953R1173J09879J09330
10022D20064P9904j07266M3940J6729J29964O4508J4906J10156P3878N1485j20421
10011G77847J11512Q3383l9944P5944j09921p4046r6258N9662J8792J23645n6414
10000H74202q6682r7781q3585o2247J17575N3434l1557o3661J63928K22393J54385
9989A160404P1139r749J34545o9974J3078l0705J43625k2647j78690K0704j45556
9978A086174j78099j71003j40649j30105j35774R9506M8750r3181J89914P4954
9968F50487N8612J8241J96641L3065l34057j81278l571J59793J14967o4926j42328
$$ plain form
10044 212892 273865 239017 222251 339564 539413 555543 533701 456466 284870 224082 125618
10033 125618 74691 162912 342618 343432 351928 380769 98729 109682 200855 310734 420064
10022 420064 499968 392702 436642 453371 583335 647843 662749 772905 846783 898268 777847
10011 777847 889359 972742 932798 1008742 898821 824775 728517 788179 806971 930616 874202
10000 874202 787520 689739 606154 543907 661482 714916 683359 619698 783626 1006019 1160404
9989 1160404 1231543 1221794 1356339 1286365 1299443 1268738 1412363 1389716 1211026 1231730 1086174
9978 1086174 908075 737072 596423 466318 330544 430050 478800 385619 575533 650487
9968 650487 709099 727340 923981 957046 622989 441711 438140 597933 712900 647974 505646
9957E05646K9259R5177J25578J09286k4183j51189K4195K08001M3358m0151L5948
9946I60925J22431k9717j07998L5564j48349j4292K446K27424n2112j07948r8566
9935G89808l8580k2884j90830j64884M357J36683J73018j10500J12486O3037k1383
9924G30328p925L4423R4382L8109M928P1945n6165J08361r0072q1446J81731P888
9912A036487j34606J37051j3881J18973J53510o586L0720O5245J30329N9291q9544
9901A486989J86670J5277K48568K34921n357k6382Q5068J41071K58339K04004
9891B829168K05913N3615M2417K02698L31873K92665K55752L32664K94864N61479
9881E403108Q24571J049669J239633P90216L74792N3845m0807k51593q8490L41641
$$ plain form
9957 505646 534905 630082 755660 864946 840763 689574 713769 921770 965128 924977 960925
9946 960925 1083356 1053639 945641 981205 832856 818564 821010 1048434 996322 888374 789808
9935 789808 751228 728344 537514 372630 376987 513670 686688 576188 688674 751711 730328
9924 730328 722403 756826 851208 889317 894245 966190 910025 1018386 928314 846868 1028599 1036487
9912 1036487 901881 1038932 1025051 1144024 1297534 1290948 1321668 1386913 1517242 1576533 1486989
9901 1486989 1673659 1688936 1937504 2172425 2167068 2140686 2225754 2366825 2625164 2829168
9891 2829168 3035081 3088696 3131113 3333811 3665684 3958349 4214101 4546765 4841629 5403108
9881 5403108 6227679 7277348 8516981 9307197 9681989 9735834 9695027 9443434 9354944 9696585
9871I696585M83894P91612P18504R13593J120635J171386J435817J793520J808131
9862A9933677J758703K113050K269662K394040K393808K360316K296678J919548
9854C7439482J684755J473501J037711M43089N2945k89590l93626n05082P1995
9845D1015180J361848K289177J705652j51966j755692k820264l349705k744315
9837C5549915j720299o66330n2478Q7112N92716Q90529J178910J718081J916056
9828C9494212K268093K694144L274808L645828L918492M566137M961449N102645
9820F9925808M791053M340582L863135K998601J464930j49887j378492k470735
9812H3384995l674731m356058m487593m657396m670950m249990m173343l868678
$$ plain form
9871 9696585 10180479 10972091 11690595 12604188 13724823 14896209 16332026 18125546 19933677
9862 19933677 21692380 23805430 26075092 28469132 30862940 33223256 35519934 37439482
9854 37439482 39124237 40597738 41635449 42078538 42131483 41841893 41448267 40943185 41015180
9845 41015180 42377028 44666205 46371857 46219891 44464199 41643935 38294230 35549915
9837 35549915 33829616 33163286 33110808 33197920 33790636 34681165 35860075 37578156 39494212
9828 39494212 41762305 44456449 47731257 51377085 55295577 59861714 64823163 69925808
9820 69925808 74716861 79057443 82920578 85919179 87384109 87234222 85855730 83384995
9812 83384995 79710264 75354206 70866613 66209217 61538267 57288277 53114934 49246256
9804D9246256l391311l087984k658269k012836j909984j571620j277881q58605
9796C2477766q09556o47227m53912K902M7631K24071M21498O07596P43603P22444
9786C3336816J018358J101231J171881J103611J027998P21906M33757j5487l70692
9777C9529379r35127j306861j597664j848709k328725k299194k076099k172648
9769B4964352j941967j689492j788015j486527j495964j243562j288530j048449
9761A2981846q30357q72854q33239p31988o00155o37724n80871m11916j52748
9752G329994m26548l65369l74881l71928k92417l85700j22691j96464j34299l30894
9742D328803j10740M0756k07618k50408j24962j19228j78946j25842n7041j38578
$$ plain form
9804 49246256 45854945 42766961 40108692 38095856 36185872 34614252 33336371 32477766
9796 32477766 31668210 31020983 30567071 30569973 30617604 30841675 31263173 31870769 32614372 33336816
9786 33336816 34355174 35456405 36628286 37731897 38759895 39481801 39915558 39900071 39529379
9777 39529379 38594252 37287391 35689727 33841018 31512293 29213099 27137000 24964352
9769 24964352 23022385 21332893 19544878 18058351 16562387 15318825 14030295 12981846
9761 12981846 12151489 11278635 10445396 9713408 9113253 8475529 7894658 7482742 7329994
9752 7329994 6903446 6538077 6163196 5791268 5498851 5113151 4990460 4793996 4659697 4328803
9742 4328803 4218063 4258819 4051201 3800793 3675831 3556603 3377657 3251815 3194774 3056196
9732C056196j54404k01155r9790J15321j35313j914n8636j00984o2587l4191l2637
9721B289906n3916q636l372p0448j94695n1294l5722K3053N070l7134n5167m0895
9709A766750J1019L6256o3504j27586l0585k2612k38727P7735L9818p429J9521
9698A460656j8838L9865J31489K3959j22024J5038j46938j96551n9448k5262O4725
9687A166671J11136j16881L9433k3666n7070j5856j0662k3512K3214j19107P7947
9676A051647L0130R6240J63263J5765k323j33692L7240q2955k09549j25212l0335
9665H10219n6029J24049M8308k9114j74896j9015P2559m9584q3568m1402K50764
9654H52291Q231p4553J28830M9027M2398L0723n1347j17988p2583R0523j8957
$$ plain form
9732 3056196 2901792 2700637 2600847 2716168 2580855 2578941 2520305 2419321 2356734 2322543 2289906
9721 2289906 2235990 2227354 2223982 2153534 1958839 1907545 1871823 1894876 1899946 1862812 1807645 1766750
9709 1766750 1777769 1814025 1750521 1622935 1592350 1569738 1331011 1408746 1448564 1441135 1460656
9698 1460656 1441818 1481683 1613172 1637131 1515107 1530145 1383207 1186656 1127208 1101946 1166671
9687 1166671 1277807 1160926 1200359 1176693 1119623 1103767 1093105 1069593 1092807 973700 1051647
9676 1051647 1081777 1178017 1341280 1357045 1354722 1221030 1258270 1175315 965766 840554 810219
9665 810219 754190 878239 926547 897433 722537 703522 776081 726497 642929 601527 852291
9654 852291 860522 785969 914799 963826 1006224 1036947 985600 867612 795029 885552 866595
9643H66595J05238R0693l9928P010J1435j35008M4865m3781o5131j28575j05480
9632F07933j52511M3292J23566N3648K7675m6602j88630M6569K75115K2610j0131
9621H02534j62619j30936J08936J1354m6416J59077j2706l2266j77466q5641K77647
9610G11498K5455P9547J8428J17270O2790n6703l3878j88380r6621k7514R6993
9599G08885N6340n6071j0647K6661P8982m6458K3052n1221k3939n9725n3867N4473
9587F46465J17043P9819o4007N7532J9198j22037m2994Q5759k2452j02992k04636
9576D46698K64224n4388j54424K3110Q87m496Q8825K57536k5657o6515J65190
9565I40990L0766J1455k85506j53447j7544Q8765N5681k6268p4499n6180N6105
$$ plain form
9643 866595 971833 1062526 1022598 1029608 1041043 906035 950900 907119 841988 713413 607933
9632 607933 455422 498714 622280 675928 703603 657001 468371 514940 790055 812665 802534
9621 802534 639915 508979 617915 629269 582853 741930 729224 696958 519492 433851 711498
9610 711498 736953 816500 834928 952198 1014988 958285 924407 736027 639406 611892 708885
9599 708885 765225 709154 698507 725168 804150 757692 780744 729523 705584 645859 591992 646465
9587 646465 763508 843327 779320 836852 856050 734013 691019 776778 754326 651334 446698
9576 446698 710922 656534 502110 525220 526107 521611 610436 867972 842315 775800 940990
9565 940990 971756 983211 697705 544258 526714 615479 671160 644892 570393 514213 570318
9554E70318K18802J82016K6738l3069j52634R321J46314l2375p1586M6584J7841
9543I28270j6991N1912p599m8252p8969j64778N1702M914L2499p0949r5387J1701
9531E98073J87427K00647l5097p1977n8032m6870J5565L4185j30277m8313P7465
9520G22796o397J44571L0170j44632k5936J42919J71955M316j92779J32637j8962
9509I60658L8597j6312k8466o3927j8312N699M319M8188l9370M5055J70782k3885
9497A083026j28729j6916N1814l323n3330K6890J68875l834K6332P9377k4932
9486A205250j83739l878r9152p0381L6137k1445n2531N1343o0686k12915m9896
9475E38107J46428J16564o8949l8487J38619J27831L5152q7926q485Q9120M2232
$$ plain form
9554 570318 789120 971136 997874 964805 812171 821492 967806 935431 863845 910429 928270
9543 928270 911279 963191 955592 907340 828371 663593 715295 720209 752708 681759 586372 598073
9531 598073 785500 986147 951050 879073 821041 774171 789736 823921 693644 645331 722796
9520 722796 716399 860970 891140 746508 720572 863491 1035446 1039762 846983 979620 960658
9509 960658 999255 982943 954477 890550 872238 877937 882256 930444 891074 936129 1106911 1083026
9497 1083026 954297 937381 989195 985872 932542 959432 1128307 1124473 1150805 1230182 1205250
9486 1205250 1021511 1017633 918481 848100 884237 862792 810261 861604 800918 588003 538107
9475 538107 684535 801099 732150 693663 832282 960113 995265 907339 898854 987974 1030206
9464A030206r1758J83833J22794j83455o9475O1920R4283J19204o257k48457m2112
9453I70726P3417o416o0236n4519p4280j21602k10781J39602K45384M6700j41383
9442H06612k61240o0126K49447P1579N444J13119L4367j39789j72969m0490R7806
9431G03760K2129l15J20810J10987J26120L7925J56935R0987r5777r9163K7983
9420A202381j5821j67853P9265r496J3404j6040j37618j96417p97L1268Q9604
9409H71880P1014J22966K6794J60783K3694o5130R5256J3928N2633m9643j10324
9398A213851j18773j62336J38256P4745P2791M8231j22205R4047M4704O7871O1986
9387A413168m3021k362j4872o0435M2142k44507P7655J22163L9306k9486p929
$$ plain form
9464 1030206 938448 1122281 1245075 1061620 992145 1054065 1148348 1267552 1261295 1012838 970726
9453 970726 1044143 1037727 977491 922972 848692 727090 516309 655911 901295 947995 806612
9442 806612 545372 485246 734693 806272 811716 924835 959202 819413 646444 605954 703760
9431 703760 725889 725574 846384 957371 1083491 1121416 1278351 1369338 1273561 1174398 1202381
9420 1202381 1186560 1018707 1097972 1088476 1101880 1085840 948222 751805 751008 782276 871880
9409 871880 942894 1065860 1092654 1253437 1277131 1212001 1307257 1321185 1373818 1324175 1213851
9398 1213851 1095078 932742 1070998 1145743 1218534 1266765 1144560 1238607 1283311 1351182 1413168
9387 1413168 1370147 1367785 1352913 1292478 1334620 1090113 1167768 1289931 1329237 1299751 1291822
9376A291822m6794p1793J8391r6914J42730J14765O3054J54956J17918n8256k65000
9365A364879j31867K57992J14358p7544L7499M858J18595R1808R1753l0092m2941
9354A799298j55611p4343L265O533P9699J80913P5280n0433j19730Q8258J86616
9343B019745o6356q1907J21789p883j24679J97369J49372J01116J75918J95077
9333B679561l7066j27868r4019J85375J48132J87957J19832j02671P3140R8443
9323C130816P1792N0362J67820L53629J38312J1417p2717L7494o5113L6127K14805
9312D074744N9250K24053L33062J31442J27071l2443J62863J39260L12618J35778
9302E667698L15992K19687J83973M83156L89439L32166L10805K96714M70194M46551
$$ plain form
9376 1291822 1245028 1173235 1191626 1094712 1237442 1352207 1415261 1570217 1688135 1629879 1364879
9365 1364879 1233012 1491004 1605362 1527818 1565317 1570175 1688770 1780578 1872331 1842239 1799298
9354 1799298 1643687 1569344 1572609 1579142 1658841 1839754 1915034 1864601 1744871 1833129 2019745
9343 2019745 1953389 1871482 1993271 1985388 1860709 2058078 2207450 2308566 2484484 2679561
9333 2679561 2642495 2514627 2420608 2605983 2754115 2942072 3061904 2959233 3032373 3130816
9323 3130816 3202608 3252970 3420790 3774419 3912731 3924148 3851431 3888925 3823812 3859939 4074744
9312 4074744 4133994 4358047 4691109 4822551 4949622 4917179 5080042 5219302 5531920 5667698
9302 5667698 5983690 6203377 6387350 6870506 7259945 7592111 7902916 8199630 8669824 9116375
9292I116375N71595N83223O53716M73399O53010P18168J039695Q89053P97409
9283A5495643Q98351J177042J283421J779470J790044J879427K048238K396993
9275B8748629K790284L250275L600748L754070M376441N343310O032457O723098
9267F4619312P685320Q604300R255247R598326R794680R326046Q173185O336593
9259A33393009L432230N64072k401531n142541p138466q314214r166864r372608
9251I5853087q952156q368286p795749o971196o305078n809086n106682m470372
9243D2074482l917732l454762l091865k638701k455998k324151j830457j541759
9235B0819057j411907j415383j307128j145776j156255q60098q20824q20959n26182
$$ plain form
9292 9116375 9687970 10271193 10924909 11398308 12051318 12769486 13809181 14698234 15495643
9283 15495643 16393994 17571036 18854457 20633927 22423971 24303398 26351636 28748629
9275 28748629 31538913 34789188 38389936 42144006 46520447 51863757 57896214 64619312
9267 64619312 72304632 80908932 90164179 99762505 109557185 118883231 127056416 133393009
9259 133393009 136825239 137389311 134987780 129845239 122706773 114392559 105225695 95853087
9251 95853087 86900931 78532645 70736896 63765700 57460622 51651536 46544854 42074482
9243 42074482 38156750 34701988 31610123 28971422 26515424 24191273 22360816 20819057
9235 20819057 19407150 17991767 16684639 15538863 14382608 13522510 12701686 11880727 11354545
9226A1354545m38672o62143n67959k71901l13805n90180n19899n22189m13087
9217G054710k74984l87651l08138m3588j00507k27900l10183j77716k08018k03837
9207D812188k16114k44442M8q2375j74378j79364j36471j6170r6901m9797k7466
9196C588758j61864j07694r8152m0374j03217k4661j44988K5440k6222R40J5216
9185B923182k7746j70849r978l2749n7473j86523j54977N4687L5887l89898j23504
9174A860059J45857L7091n922k8428j51126K6005J00429k05397J12762m3483k2581
9163A825266O4573L2938k16044q0225j59062k06912l0661J26955L6051k2946P123
9152A377056L2138R426o4869j677O7741R8033P453L5908p3312j27155N0134J81500
$$ plain form
9226 11354545 10915873 10253730 9685771 9413870 9100065 8509885 7989986 7467797 7054710
9217 7054710 6779726 6392075 6083937 6040349 5939842 5711942 5401759 5224043 5016025 4812188
9207 4812188 4596074 4351632 4351680 4269305 4094927 3915563 3779092 3762922 3666021 3616224 3588758
9196 3588758 3426894 3319200 3221048 3180674 3077457 3052796 2907808 2933248 2907026 2907966 2923182
9185 2923182 2895436 2724587 2714609 2681860 2624387 2437864 2282887 2337574 2373461 1983563 1860059
9174 1860059 2005916 2043007 2037085 2008657 1857531 1883536 1983965 1778568 1891330 1847847 1825266
9163 1825266 1889839 1922777 1706733 1626508 1467446 1260534 1229873 1356828 1392879 1369933 1377056
9152 1377056 1409194 1418620 1353751 1352074 1419815 1517848 1525301 1561209 1487897 1360742 1410876 1592376
9140A592376q4808k68487j7825P6315O3033p785O3856j12526J9223J24740j8938
9129A429174j08768k08786j68175O6679N5887j21153k4277K83094p619n4824o2380
9118A078852P8452m2833j24160M0772J44045p3373j0248j17540P8398K76438J24012
9107A452815j78786j58192k6451j15754j42486q8782J29801j5873l7273J51912
9097I70931j3451N8517j15638N6072k7646K634j5458o0803k5889l7354P5059K93270
9085A160244K07607p8622o4883m9879O0556r6739j65572n693L9249p1497l4349
9074I00422j20582j09577L1315N8526P3759m6713N987J1431j76396j8683J67395
9063G76884J50049R447N2290j41949j59906k4627P2242K40580J59130j46461k58720
$$ plain form
9140 1592376 1507568 1239081 1221256 1297571 1360604 1352819 1416675 1304149 1323372 1448112 1429174
9129 1429174 1320406 1111620 943445 1010124 1066011 944858 920581 1203675 1196056 1141232 1078852
9118 1078852 1157304 1114471 990311 1031083 1175128 1101755 1091507 973967 1052365 1328803 1452815
9107 1452815 1274029 1115837 1089386 973632 831146 742364 872165 856292 819019 970931
9097 970931 957480 1015997 900359 956431 928785 931419 915961 855158 829269 791915 866974 1160244
9085 1160244 1367851 1289229 1224346 1174467 1235023 1138284 972712 967019 1006268 934771 900422
9074 900422 779840 670263 701578 760104 833863 787150 793137 804568 628172 609489 776884
9063 776884 926933 936380 988670 846721 686815 662188 734430 975010 1134140 987679 728959
9052G28959j54223J90952J96715O5059O002K36j35707K9325o5384L3217J0557
9041I05708J38292J38532j33745p1240r5116p1988J8494J00417J9658p1950o5534
9030H11528j30793k8330Q7939J39315j2368j9887J24212m4275J0846J82830r3079
9019A027938j11031j22016j32398r2960K02745O0341K0870J35993J52016r3039
9009A048459k02463K701m49p0181j7215N1640K0654o7297J07522k5431o0860j1124
8997G75956k23872o6227K95994j6442j07756p9216P3905P9080m8637j03962j3185
8986E65638N0417M9571j8919K0434l8520j58293k4737K7196O4354K0393Q5011
8975F42545L285n5928k43926j23568K6927j0274M224J02376n0270O4447P0129
$$ plain form
9052 728959 574736 765688 962403 1027462 1033464 1033700 897993 927318 861934 895151 905708
9041 905708 1044000 1182532 1048787 977547 882431 810443 828937 929354 949012 877062 811528
9030 811528 680735 652405 740344 879659 867291 847404 971616 927341 938187 1121017 1027938
9019 1027938 916907 794891 662493 569533 772278 832619 853489 989482 1141498 1048459
9009 1048459 845996 848697 848248 778067 760852 812492 833146 765849 873371 847940 787080 775956
8997 775956 552084 485857 781851 765409 657653 578437 652342 731422 682785 578823 565638
8986 565638 616055 665626 646707 667141 628621 470328 445591 472787 537141 557534 642545
8975 642545 645830 589902 345976 222408 249335 239061 243285 345661 295391 359838 429967
8964D29967o3504J7293M8895M5341O5511O8541L4001l9543o0756k72829k1306
8953B51611J49778k9395J32351R3185J03473j6076o0239k58445j05000K5346J25537
8942D12126k6205J900n4119k5998J38288M8972k8890j54979Q5492J33522q7362
8931D42747p1474k2618l9156P1103J49682o6698l4218r9903k00261P0691J18987
8920C18882J4513P4496M518O289J02708r5872j45652j04670n179j50154j68529
8909a48650J89739J44977p0438J21433O2607o7628N0985j3794q8710O3283J20056
8898C63860J677R1570r1390q198m8353l1949r871k4952p9753k9811P9255J25667
8886C37752l5393O5175N7675J0295j99459N4212L5076j24408M019L4258J44541
$$ plain form
8964 429967 366463 383756 432651 477992 543503 612044 646045 606502 545746 272917 251611
8953 251611 401389 371994 504345 597530 701003 684927 624688 366243 261243 286589 412126
8942 412126 385921 387821 333702 307704 445992 494964 466074 311095 396587 530109 442747
8931 442747 371273 348655 309499 380602 530284 463586 429368 329465 129204 199895 318882
8920 318882 333395 407891 412409 418698 521406 425534 279882 175212 170033 19879 -148650
8909 -148650 41089 186066 115628 237061 299668 232040 283025 269231 180521 243804 363860
8898 363860 365537 457107 365717 357519 309166 277217 267346 242394 162641 132830 212085 337752
8886 337752 302359 367534 425209 435504 236045 290257 325333 200925 204944 239202 383743
8875C83743J59853K5320k30936k39442L9456K20732L9842K6045R341j5998k4468
8864C93488L9192j31491n4713J05627L6119Q183K6314L8028O68j28154q3139J04438
8852C54560J60963K9486J11586J65719J8700j34730j36267M5817j1326j33101
8842D71407O4165n3460R0673J19214J44760r2407K5815k5588o9494j28962r6021
8831D50102p734J09061n3885O8003R3094q0892P2894o9986p5454J42918M6536
8820F94657k10859j29855p7944Q6754J90100J4030o8247j14832M3719J99158m6545
8809E80136q0664q0629j9518J09316P853J02049Q417J9948J90520m0636j25319
8798F71473j47943j04393n945J94934J57153L8515j51216j42881k4007J71335
$$ plain form
8875 383743 543596 568916 337980 98538 137994 358726 398568 424613 433954 417956 393488
8864 393488 432680 301189 246476 352103 388222 396405 422719 460747 461415 333261 250122 354560
8852 354560 515523 545009 656595 822314 841014 706284 570017 615834 604508 471407
8842 471407 535572 482112 572785 691999 836759 744352 770167 744579 675085 546123 450102
8831 450102 442368 551429 497544 565547 658641 577749 650643 580657 505203 648121 694657
8820 694657 483798 353943 275999 362753 552853 566883 498636 383804 427523 626681 580136
8809 580136 499472 418843 399325 508641 516494 618543 626960 646908 837428 796792 671473
8798 671473 523530 419137 413192 608126 765279 803794 652578 509697 485690 657025
8788F57025R2695M4237k3169K18342m8634k14276r9295j28642R9432K29571K69615
8777A096901J9830j37951P5426J23527O895l02912k58936N0953J87944J88888
8767A050565k5650l6375n1029j9027R904J29148O5275L6958K8732m9037J61829
8756A301293j03189j19506o2271J1291L8272p3991j43373K0921M9829M3631O1539
8745A024446l00o5326N7964R1807j78574q1835O9225N1146N5301K9438Q791K9883
8733A091966J17525Q5492j07065o1734J29435R3771p4254m2000L8704n0223p6646
8722A144971J85778J42383j57587j97108L6892J2164J8294j44145j32520l7481
8712H71641R5875n0154k9874p9759K9046q0259N4964M2848k2890j03642p9236
$$ plain form
8788 657025 749720 793957 770788 989130 940496 726220 626925 498283 597715 827286 1096901
8777 1096901 1116731 978780 1054206 1177733 1184628 881716 622780 673733 861677 1050565
8767 1050565 1024915 988540 937511 918484 928388 1057536 1122811 1159769 1188501 1139464 1301293
8756 1301293 1198104 1078598 1016327 1027618 1065890 991899 848526 869447 919276 962907 1024446
8745 1024446 1024146 958820 1016784 1108591 930017 848182 917407 968553 1023854 1053292 1062083 1091966
8733 1091966 1209491 1294983 1187918 1126184 1255619 1349390 1275136 1233136 1271840 1221617 1144971
8722 1144971 1330749 1473132 1315545 1118437 1155329 1167493 1185787 1041642 909122 871641
8712 871641 967516 917362 887488 807729 836775 756516 811480 854328 831438 727796 648560
8701F48560k3105J54866Q1252j69908o1585K0433J66280J42254p7227L213O8709
8690I53742J56219j0024k73839j30323J5737J17344O3285L1946P6905O9771N7967
8679A128730j40217j4647L1546J54719k59063j87844Q7985J95203q9861r0056
8669H16495j11059j58942L3376K78864J11236k69678o9277J58741K5784n1907
8659G63633o4195M4690l6463J1496M2249J52136j09919j27711k7532R2237Q1665
8648H22286J08961J26502M68219N59344Q77782M90647J39925j48040n28027p43212
8638B174387m50797k40363k25485q6731j15028k86244k4033R9370L3735M4466
8628I23277o7036L160j97117j68970j9670o3205J13861P3175M9202j13547k09838
$$ plain form
8701 648560 625455 780321 861573 691665 630080 650513 816793 959047 881820 885033 953742
8690 953742 1109961 1099937 826098 695775 711512 828856 892141 924087 1000992 1070763 1128730
8679 1128730 988513 973866 1005412 1160131 901068 713224 801209 996412 906551 816495
8669 816495 705436 546494 579870 858734 969970 700292 631015 789756 815540 763633
8659 763633 699438 744128 707665 719161 761410 913546 803627 675916 648384 740621 822286
8648 822286 931247 1057749 1525968 2085312 2963094 3453741 3593666 3445626 2917599 2174387
8638 2174387 1723590 1483227 1257742 1171011 1055983 769739 745706 845076 878811 923277
8628 923277 856241 859401 662284 493314 473644 410439 524300 597475 646677 533130 323292
8617C23292N9544J0608m312P8035J30853L8086j07512L1631R5483K7994k04807
8606D78895m0286K46657K61813J16953L19740O52210J071235J955174J813822
8597F876213M74837n56457j058299j478747j304718q03971m50832k14076l74624
8588A109326k85863J41351j15190j7499o5721K2235j1011P3370l7148p8262j31728
8577F03860o3754N5334P4885R5992k8125j40976M8706r6778j3732j2220k00707
8566C22485j37573J8875J25391J05088J44070N5530L5787N1640L8109r8726K34854
8555H95530N35055Q33374R25206L28273r6591n70718p76678p61429m07712r7618
8545H06692q0615Q937N4553k28355k58502p2316p6815j18347K9377J13690J70816
$$ plain form
8617 323292 382836 393444 389132 467167 598020 636106 528594 560225 655708 683702 478895
8606 478895 438609 685266 947079 1064032 1383772 2035982 3107217 5062391 6876213
8597 6876213 7351050 6794593 5736294 4257547 2952829 2148858 1698026 1483950 1109326
8588 1109326 823463 964814 849624 832125 766404 788639 777628 850998 813850 735588 603860
8577 603860 540106 595440 670325 766317 738192 597216 645922 549144 535412 523192 322485
8566 322485 184912 203787 329178 434266 578336 633866 669653 721293 759402 660676 895530
8555 895530 1430585 2263959 3189165 3517438 3420847 2850129 2073451 1312022 904310 806692
8545 806692 726077 735014 789567 561212 302710 230394 153579 35232 64609 178299 349115
8534C49115j09562j43535k5713K7598o480R7358K04699J52452J690j75346j14581
8523B57695l602R2195k21681l8340J95607N5531K9093J06611N2736k3049q1535
8512D21261q3361j18421J6580J04841J9847n5654r7075N3859q062L563J24326
8501C81704r8497m2304k1802J6432J5474R7105P0893r6410J2296p5645j27224
8490A32022r7488N8741k1386O6176M5961J9389j8369j6916q2720r5583N2628p8820
8478c6365N1308K11485l9678J0506j31225L697J34860J22014J00251J243j88281
8467B39815j62722k7445q0821j36756R2288R1460j9768p7833k0125J48237J61819
8456B08149P9276J46193r5373j46026K5092J63758l1445J20512m6579l1065K5133
$$ plain form
8534 349115 239553 96018 70305 97903 91423 188781 393480 545932 547622 372276 257695
8523 257695 254093 346288 124607 86267 281874 337405 366498 473109 525845 502796 421261
8512 421261 337900 219479 236059 340900 360747 305093 208018 261877 253815 257378 381704
8501 381704 283207 240903 219101 235533 251007 348112 419005 322595 334891 259246 132022
8490 132022 34534 93275 71889 138065 184026 203415 185046 168130 85410 -10173 42455 -36365
8478 -36365 14943 226428 186750 197256 66031 69728 204588 326602 426853 428096 239815
8467 239815 77093 49648 -31173 -167929 -75641 15819 -3949 -81782 -101907 46330 208149
8456 208149 287425 433618 338245 192219 217311 381069 349624 470136 423557 392492 417625
8445D17625N9879n3459P651j06122j08318R7006J16874N6637j41004J6494r3667
8434B69596j7839J65049M4458n7826j88364j0343n1983j54110k1937L43066J19923
8423D39690K892j5025r8638k19881j1479J35921N5258p6770o92J10466J03151
8412D24893n3186o8987Q9421j29866j75614j06357O6896q9556p929J54360J23302
8401B27377o941j05436L5192p4313J876J82877M0135r2329L5321K1532m9323j9604
8389A96364j69794R5919K22902j35300L3866m716j17847j15818J64505K41827
8379D11908J60520m9812j63797j22735o4637j60502P895O8290N2008K4749o6676
8368I7211p5803J3797M1563R6366Q0632l5317K2012Q745j06164o1787Q6542r9344
$$ plain form
8445 417625 477504 424045 431696 325574 217256 314262 431136 487773 346769 363263 269596
8434 269596 251757 416806 461264 403438 215074 204731 152748 -1362 -23299 319767 439690
8423 439690 442582 427557 328919 109038 97559 233480 288738 211968 211276 321742 424893
8412 424893 371707 302720 392141 262275 86661 -19696 47200 -42356 -50285 104075 227377
8401 227377 220436 115000 150192 75879 77755 260632 300767 208438 243759 265291 215968 196364
8389 196364 26570 122489 345391 210091 243957 239241 121394 5576 170081 411908
8379 411908 572428 522616 358819 236084 171447 10945 18840 87130 139138 163887 97211
8368 97211 21408 35205 76768 173134 253766 218449 240461 249206 143042 81255 167797 68453
8356F8453j13756J08287K02524p6106J03654r0066j19170R0417l64q6172p1714
8345A5987J81882Q168j14994r2292J8192K3896o0201m8745L2900J34337Q777j36067
8333b8160n787K49644P8796m3717j8749n5007j27059j38804M4644J27922k5420
8322E8303o5590J1452J91814P4482r1453l2201j2823j34884l8115o6779J78840
8311G3046J07888j91060j61624J33528L6043Q5400P2399O4571K5660j53717l7386
8300E4748L9465N7834j56782j69182J57485J49677j13253k32509N8995q5433j1323
8289b50278P2808K36957R6382J9091p5753K6431O6331L0213R681k03126j86949
8278a58212j68067K6939J18987M0277p452J26758L5377L9662N0412N1535j11308
$$ plain form
8356 68453 -45303 62984 265508 189402 293056 202990 83820 174237 173873 87701 15987
8345 15987 197869 206037 91043 -1249 16943 40839 -19362 -68107 -35207 99130 107907 -28160
8333 -28160 -33947 215697 294493 250776 232027 177020 49961 -88843 -44199 83723 58303
8322 58303 -7287 4165 195979 270461 179008 146807 133984 -900 -39015 -105794 73046
8311 73046 180934 -10126 -171750 -38222 -2179 83221 155620 220191 245851 92134 54748
8300 54748 94213 152047 -4735 -173917 -16432 133245 19992 -212517 -153522 -238955 -250278
8289 -250278 -177470 59487 155869 174960 99207 125638 191969 222182 231863 28737 -158212
8278 -158212 -326279 -299340 -180353 -140076 -147528 -20770 14607 54269 104681 156216 44908
8267D4908j11331N6139L6976O0870k6555m5434J04365J5397M3221k50707k20037
8256b92188P4837J26471M7244r719R0804J21067r9287O6145J06657l060J0198
8245B39169r5424o8999j2982l2988O2313Q2555L2647j09801q8008O757J38982
8234A54221K0015J06044O8755j61271m9381k7992O2875K0143K5598o9119r6470
8223E3418J02N7586O8683R8660j66885L5549L41836K66480j20103j37312J09848
8212F07862j42293n6923P3067j01236j38647l7717N9285J1923j52212J62272l4956
8201B50425m0981o3739j6790L4853L8943J59159J09895O7395q6708k27374J3590
8190B38668k7346j44604K4674n2288P3057P2397m2292j77678j32735L0741J8123
$$ plain form
8267 44908 -66423 -10284 26692 87562 61007 15573 119938 135335 178556 -72151 -292188
8256 -292188 -217351 -90880 -43636 -53355 37449 158516 59229 125374 232031 228971 239169
8245 239169 143745 74746 61764 28776 91089 173644 206291 96490 8482 15239 154221
8234 154221 174236 280280 349035 187764 138383 110391 173266 193409 219007 149888 53418
8223 53418 53520 111106 179789 278449 111564 147113 488949 755429 635326 498014 607862
8212 607862 465569 408646 481713 380477 241830 204113 263398 275321 123109 285381 250425
8201 250425 209444 145705 128915 163768 202711 361870 471765 539160 452452 225078 238668
8190 238668 211322 66718 91392 39104 112161 184558 142266 -35412 -168147 -137406 -119283
8179a19283J35525K4330r149l2195l3646K7694J07261R6128N7442q610O2660K85650
8167E93807Q055j18606J41488R438n8039j95254J2623n5725p4446n9206o7524
8156A36611Q1694O6284J30926j64811q286j29835j09024J9869n5651l2385n0929
8145a15537q8183l8221K45057J52063K1139O5894N796k0765M3273J39117J4547
8134D24180j16094j46798R4719m0777j77729J24347J25253n0074o2052J14990
8124B89965j07534L2634L8436n3274J07712R4023Q2634J09399n6869j81056j36725
8113B19345r7642p5555N9515K5823j25137R7038M0442J70717J4286L5412K0242
8102C84486j28652k1690P408J6039J48825k2513L8441m1796J08939j2809p5090
$$ plain form
8179 -119283 16242 40572 31423 -772 -34418 -6724 100537 196665 254107 245497 308157 593807
8167 593807 601862 483256 624744 634182 576143 380889 393512 337787 263341 204135 136611
8156 136611 218305 284589 415515 250704 242418 112583 3559 23428 -32223 -64608 -115537
8145 -115537 -203720 -241941 3116 155179 176318 242212 248008 227243 270516 409633 424180
8134 424180 308086 161288 256007 215230 37501 161848 287101 237027 174975 289965
8124 289965 182431 215065 253501 200227 307939 401962 484596 593995 537126 356070 219345
8113 219345 121703 46148 105663 131486 6349 103387 143829 314546 328832 364244 384486
8102 384486 255834 234144 241552 257591 406416 383903 422344 380548 489487 476678 401588
8091D01588r0207Q2000J45608n8366j57671o0200p7583J3706N4753J00846O0126
8080D14600N1922K57874J36669J43446j8124j4401J36007K77624J67272q177k3366
8069A521346j46750j75710n8381P2611j8535j57775L4824O658o537j54221K0552
8058I38082O6535q655k07973J3153J24843j55548o4153j27392L074J27544m1860
8047F67650J17113K18587O4721r6347R5789n8510j32619j21437p8729L2552K94808
8036A003578J00738j35891m00J14189J97821M01285P00084N78090K59696l8434
8026C180756l50296l49571j86860j80069l47818k17420j6610o6177j24569j6655
8016A324711K0536j32815j82533n7740k2474j8293L7426o4508k0527j89308p0284
$$ plain form
8091 401588 311381 393381 538989 480623 322952 262752 185169 198875 253628 354474 414600
8080 414600 466522 724396 861065 1004511 986387 971986 1107993 1385617 1552889 1544712 1521346
8069 1521346 1374596 1198886 1140505 1213116 1194581 1036806 1071630 1078288 1071751 917530 938082
8058 938082 1004617 995962 787989 801142 925985 770437 706284 578892 581966 709510 667650
8047 667650 784763 1003350 1068071 971724 1067513 1009003 876384 754947 676218 708770 1003578
8036 1003578 1104316 968425 968025 1082214 1280035 1681320 2381404 2959494 3219190 3180756
8026 3180756 2830460 2480889 2294029 2113960 1766142 1548722 1532112 1465935 1341366 1324711
8016 1324711 1345247 1212432 1029899 972159 949685 931392 968818 904310 883783 694475 624191
8005F24191p4174o2452K8573J4779m7147j13317K8912J17807O5220J5172n462
7994E92102O0793K2848J0364Q4067Q7956K26172K00065J06288k64812r3959R9550
7983A131434R2289K54675m96q61q2632r0046k06698k29011r6326p8249j44955
7972E49124O8487j27881j90302Q6767k3750J06461M934j34354j12564j7357J22732
7961C32297J63109O7611p3339m1913j13601J37652o9951m9925j04593k13406r2512
7950e8571J5488J11371J38478O1294m5538N6007q7075k4295j9143L2265j00881
7939G9400J30663O8082n4682p6660P9177J04017m6235j53493r9562K437O5399
7928I8543l086K13696K509Q8020k20505j89331M4279L2987J94302R8981J07945
$$ plain form
8005 624191 550017 487565 516138 530917 483770 370453 399365 517172 582392 597564 592102
7994 592102 652895 675743 686107 770174 858130 1084302 1284367 1390655 1125843 1031884 1131434
7983 1131434 1223723 1478398 1477902 1477041 1394409 1304363 1097665 868654 772328 694079 549124
7972 549124 617611 489730 299428 386195 362445 468906 473840 339486 226922 209565 332297
7961 332297 495406 563017 489678 447765 334164 471816 401865 351940 247347 33941 -58571
7950 -58571 -43083 68288 206766 268060 222522 278529 191454 167159 148016 180281 79400
7939 79400 210063 278145 223463 146803 225980 329997 283762 130269 30707 33144 98543
7928 98543 95457 309153 311662 399682 179177 -10154 34125 67112 261414 360395 468340
7917D68340l5044k08149o3547M5317q0227k70665P3496J27835J73724p3030j27073
7906C0977j5681n948J96965K967p6898K1070M2996j04858j61213j79320j0402
7895b59345J0688J07682J55998J43676k2142j64676m4949K8047R6574l4307n2152
7884c4906J92335J46669j08329P4882k7659J2733j61822j7446R9288L6550o040
7873B06255j6523P5661j35304k21680J27672O4509k8903Q9463L8491j5393K4115
7862B08363J70483l7719j71698l3120J54165l8425k31916j43068o5802J02035
7852h6702R7527L2061p7899M8160r1889j3171J02167J18071N6109N6436O621n0206
7840A97285j54963k5109K34201N9099j6884P559k35662n2530P2969O177L7625
$$ plain form
7917 468340 433296 225147 161600 206917 126690 -143975 -70479 57356 231080 158050 30977
7906 30977 15296 9348 206313 209280 132382 153452 196448 91590 -69623 -248943 -259345
7895 -259345 -248657 -140975 15023 158699 136557 -28119 -73068 -45021 51553 17246 -34906
7884 -34906 157429 304098 195769 270651 242992 255725 93903 76457 175745 212295 206255
7873 206255 189732 265393 130089 -91591 36081 100590 71687 161150 199641 184248 208363
7862 208363 378846 341127 169429 136309 290474 252049 20133 -122935 -188737 -86702
7852 -86702 10825 42886 -35013 13147 -78742 -91913 10254 128325 184434 240870 247491 197285
7840 197285 42322 17213 251414 310513 293629 301188 65526 12996 85965 92142 129767
7829A29767N9705j01169M4241j06082j41093P0757J1475K2239l010J7703p6810
7818g2277M7972J33192J10731q6180j00112j20465O3308J26991M0291j07315j12461
7807g6325j5340m1944k3542J19357Q2125L7009k3345K0203m7220l6485R5039J04060
7795A93592O11J14860j1943j896p3841j35365j74214k32208j64610Q3299K21444
7784a80271J05844Q9498m5607J25936M7785J03694J57009j6872m6682j59099p9455
7773A01780r8492Q8755J14434m482o9511j49736k43466m2420J30023K31158J10977
7762A69020Q3716j8855k21407j43407n0534K8209N4503m6609m0828P8855J64046
7751E6709N7221j37104J6560O9753j12798j53301J1049R5743L8048J66689q7059
$$ plain form
7829 129767 189472 88303 132544 26462 -114631 -43874 -32399 -10160 -13170 4533 -72277
7818 -72277 -24305 108887 219618 133438 33326 -87139 -23831 103160 143451 36136 -76325
7807 -76325 -91665 -133609 -157151 -37794 44331 81340 57995 78198 30978 -5507 89532 193592
7795 193592 194203 309063 297120 295224 221383 86018 -88196 -320404 -485014 -401715 -180271
7784 -180271 -74427 15071 -30536 95400 143185 246879 403888 387016 340334 181235 101780
7773 101780 3288 92043 206477 201995 132484 -17252 -260718 -303138 -173115 58043 169020
7762 169020 252736 233881 12474 -130933 -181467 -153258 -98755 -145364 -186192 -107337 56709
7751 56709 113930 -23174 -6614 63139 -49659 -202960 -191911 -96168 -58120 108569 21510
7740B1510p5748J0707m2454J0304k196j14604m3497o5219L1411J79477J36258
7729D5949J7396N5319l22530l4716K0230L807L9223j46697j13040J47798M6956
7718b40305k5824K3593J07805J78079J22489L3818o7221j46371k8549j35596n5081
7707b33163R8955R1812n7040r1312j04017L244O3305J1137K5783J44713l1660
7696g8243p0115P3465O1090Q06J33376l0035r0963l2535r8927l3851N1389J00485
7684a4058N3022N7607R205O2439P5118J5048N9441j0847k10904k64055k3416K15178
7672B3778J88113o8894m0032P8864j86530j17332K673j89277M9526O5225K5645
7661a68241L3965J46018K42708j80002k6621l3435J05418K11556M8953j73620
$$ plain form
7740 21510 -54238 -43531 -85985 -75681 -77877 -192481 -235978 -301197 -269786 -90309 45949
7729 45949 63345 118664 -203866 -238582 -218352 -214545 -175322 -322019 -435059 -287261 -240305
7718 -240305 -266129 -242536 -134731 43348 165837 199655 132434 -13937 -42486 -178082 -233163
7707 -233163 -134208 -42396 -99436 -190748 -294765 -291521 -228216 -217079 -191296 -46583 -78243
7696 -78243 -148358 -74893 -13803 -12997 120379 90344 -619 -33154 -132081 -165932 -114543 -14058
7684 -14058 38964 96571 105776 168215 243333 258381 317822 306975 96071 -167984 -191400 23778
7672 23778 211891 142997 102965 181829 -4701 -122033 -119360 -308637 -259111 -193886 -168241
7661 -168241 -134276 11742 254450 74448 47827 14392 119810 331366 380319 206699
7651B06699j45871m2070r1922J39970k6077l4894n7103j95901j30203P5550N1655
7640b50167p2100K21162J77705j32172J22956N5680l0603j026r1473Q3915R2709
7629A76586o3068j20890L1085J00395k6174q8426k7917l4175r1640k749J56381
7618I408P4222O156q4988p2933j18003l8096K6966l4200j1988Q3785J24189J17761
7606H2279p715j64425N2337L8056J04251O8444j21232p9631m5721J55106K32774
7595C14523j57888l4422N558k4135q890m380j30392j2785q0093p8679J14021J00263
7583B701O0812l588L2228K6201j75987r7858j01634L0210J74091J56076m423q2839
7571A5990k8788J13977J14162q0038j62319l0432J16945l9468q1676J48881j5500
$$ plain form
7651 206699 60828 18758 -73164 66806 40729 5835 -51268 -247169 -377372 -301822 -250167
7640 -250167 -322267 -101105 76600 -55572 67384 123064 92461 91435 -38 83877 176586
7629 176586 113518 -7372 23713 124108 97934 9508 -18409 -52584 -144224 -146973 9408
7618 9408 83630 89786 4798 -68135 -186138 -224234 -197268 -231468 -243456 -159671 -35482 82279
7606 82279 74564 -89861 -37524 532 104783 173227 51995 -27636 -73357 81749 314523
7595 314523 156635 122213 127771 103636 94746 90366 -40026 -52811 -132904 -211583 -97562 2701
7583 2701 63513 59925 92153 118354 -57633 -155491 -257125 -226915 -52824 103252 98829 15990
7571 15990 -12798 101179 215341 135303 -27016 -57448 59497 20029 -61647 87234 71734
7560G1734j54032m2355m0782J8311m2970o8946P1554L6426O1840N4952L9966q9342
7548h3644p1734P2774L533j02672o2931J92269J12070l9787Q7850J76361j31989
7537A52100n7977L3229O2524n5564j77896j94133J20655K00435R9684Q0768L6895
$$ plain form
7560 71734 -82298 -124653 -165435 -147124 -190094 -259040 -187486 -151060 -89220 -34268 5698 -83644
7548 -83644 -155378 -82604 -79071 -181743 -244674 -52405 59665 19878 107728 284089 152100
7537 152100 94123 127352 189876 134312 -43584 -237717 -117062 83373 183057 263825 300720
$$ [...]
##END NTUPLES=NMR SPECTRUM
##END=
