##TITLE=Analysis number 330353
Compound Code cc 63701
Book Reference 464/198/1
Project Code adrs
Chemist Name chrisr
##JCAMPDX= 6.0         $$ Bruker NMR JCAMP-DX V2.0
##DATA TYPE= NMR SPECTRUM
##DATA CLASS= NTUPLES
##ORIGIN= Bruker BioSpin GmbH
##OWNER= nmr
$$ XWIN-NMR		Version 3.5
$$ Fri Nov 16 13:15:33 2007 GMT Standard Time (UT+0h)  MAYBRIDGE\nmr@NMR_250MHZ
##.OBSERVE FREQUENCY= 250.131544655141
##.OBSERVE NUCLEUS= ^1H
##.ACQUISITION MODE= SIMULTANEOUS (DQD)
##.ACQUISITION SCHEME= undefined
##.AVERAGES= 16
##.DIGITISER RES= 18
##SPECTROMETER/DATA SYSTEM= dpx250
##.PULSE SEQUENCE= zg30
##.SOLVENT NAME= DMSO
##.SHIFT REFERENCE= (INTERNAL, DMSO, 0, 16.522)
##AUDIT TRAIL= $$ (NUMBER, WHEN, WHO, WHERE, WHAT)
$$ ##TITLE= Audit trail, XWIN-NMR		Version 3.5
$$ ##JCAMPDX= 5.01
$$ ##ORIGIN= Bruker BioSpin GmbH
$$ ##OWNER= nmr
$$ C:\u/data/dgb/nmr/ADRS/1750/pdata/1/auditp.txt
$$ ##AUDIT TRAIL=  $$ (NUMBER, WHEN, WHO, WHERE, WHAT)
(   1,<2007-11-16 13:15:08.27 +000>,<MAYBRIDGE\nmr>,<NMR_250MHZ>,
      <created by zg, POWCHK disabled, PULCHK disabled
       configuration hash MD5:
       76 6E 9A 78 1E 09 19 81 EC 84 63 8F B0 6A 59 2D
       data hash MD5: 64K
       CF A3 1E CB 49 F1 F0 31 82 49 BD 8C AE A1 78 B4>)
(   2,<2007-11-16 13:15:23.58 +000>,<MAYBRIDGE\nmr>,<NMR_250MHZ>,
      <Start of raw data processing
       ef LB = 0.3 FT_mod = 6 PKNL = 1 SI = 32K 
       data hash MD5: 32K
       74 DC E5 80 6C 46 B5 3A D8 63 00 99 F2 4B 2D A7>)
(   3,<2007-11-16 13:15:25.11 +000>,<MAYBRIDGE\nmr>,<NMR_250MHZ>,
      <apk 
       data hash MD5: 32K
       91 6E 25 8E 34 1A 51 DF 01 A2 D7 21 1F F9 16 DB>)
(   4,<2007-11-16 13:15:25.91 +000>,<MAYBRIDGE\nmr>,<NMR_250MHZ>,
      <abs ABSG = 5 
       data hash MD5: 32K
       4C F2 D2 15 9C 39 86 82 06 D6 9F B4 3F BA F8 22>)
$$ ##END=
$$ 
$$ hash MD5
$$ EA F1 51 45 BC 64 4F 63 0E 5A 4B A7 96 D9 B1 B4
##$RELAX= 
##$RELAX= 
##$RELAX= 
##$RELAX= 
##$RELAX= 
##$RELAX= 
##$RELAX= 
$$ Bruker specific parameters
$$ --------------------------
##$DU= <C:\u>
##$EXPNO= 1750
##$NAME= <ADRS>
##$PROCNO= 1
##$TYPE= <nmr>
##$USER= <dgb>
##$AMP= (0..31)
100 100 100 100 100 100 100 100 100 100 100 100 100 100 100 100 100 100 
100 100 100 100 100 100 100 100 100 100 100 100 100 100 
##$AQSEQ= 0
##$AQ_mod= 3
##$AUNM= <au_zg>
##$AUTOPOS= <29 >
##$BF1= 250.13
##$BF2= 250.13
##$BF3= 250.13
##$BF4= 250.13
##$BF5= 500.13
##$BF6= 500.13
##$BF7= 500.13
##$BF8= 500.13
##$BYTORDA= 1
##$CFDGTYP= 0
##$CFRGTYP= 5
##$CHEMSTR= <none>
##$CNST= (0..31)
1 1 145 1 1 1 1 1 1 1 1 1 1 1 1 1 1 1 1 1 1 1 1 1 1 1 1 1 1 1 1 1 
##$CPDPRG= <>
##$CPDPRG1= <>
##$CPDPRG2= <>
##$CPDPRG3= <>
##$CPDPRG4= <mlev>
##$CPDPRG5= <mlev>
##$CPDPRG6= <mlev>
##$CPDPRG7= <mlev>
##$CPDPRG8= <mlev>
##$CPDPRGB= <>
##$CPDPRGT= <>
##$D= (0..31)
0 1 0 0 0 0 0 0 0 0.06 0 0 0 0 0 0 0.0002 0 0 0 0 0 0 0 0 0 0 0 0 0 0 
0 
##$DATE= 1195218906
##$DBL= (0..7)
120 120 120 120 120 120 120 120 
##$DBP= (0..7)
150 150 150 150 150 150 150 150 
##$DBP07= 0
##$DBPNAM0= <>
##$DBPNAM1= <>
$$ [...]
##$SUBNAM7= <"">
##$SUBNAM8= <"">
##$SUBNAM9= <"">
##$SW= 20.6930455092707
##$SWIBOX= (0..15)
0 0 3 0 0 0 0 0 0 0 0 0 0 0 0 0 
##$SW_h= 5175.983436853
##$TD= 65536
##$TD0= 1
##$TE= 295.16
##$TE2= 300
##$TE3= 300
##$TEG= 300
##$TL= (0..7)
0 120 120 120 120 120 120 120 
##$TP= (0..7)
150 150 150 150 150 150 150 150 
##$TP07= 0
##$TPNAME0= <>
##$TPNAME1= <>
##$TPNAME2= <>
##$TPNAME3= <>
##$TPNAME4= <>
##$TPNAME5= <>
##$TPNAME6= <>
##$TPNAME7= <>
##$TPOAL= (0..7)
0.5 0.5 0.5 0.5 0.5 0.5 0.5 0.5 
##$TPOFFS= (0..7)
0 0 0 0 0 0 0 0 
##$TUNHIN= 0
##$TUNHOUT= 0
##$TUNXOUT= 0
##$USERA1= <user>
##$USERA2= <user>
##$USERA3= <user>
##$USERA4= <user>
##$USERA5= <user>
##$V9= 5
##$VALIST= <valist>
##$VCLIST= <CCCCCCCCCCCCCCC>
##$VD= 0
##$VDLIST= <DDDDDDDDDDDDDDD>
##$VPLIST= <PPPPPPPPPPPPPPP>
##$VTLIST= <TTTTTTTTTTTTTTT>
##$WBST= 1024
##$WBSW= 4
##$XGAIN= (0..3)
0 0 0 0 
##$XL= 0
##$YL= 0
##$YMAX_a= 356047
##$YMIN_a= -564359
##$ZGOPTNS= <>
##$ZL1= 120
##$ZL2= 120
##$ZL3= 120
##$ZL4= 120
##$ABSF1= 16.522
##$ABSF2= -4.171173
##$ABSG= 5
##$ABSL= 3
##$ALPHA= 0
##$AQORDER= 0
##$ASSFAC= 0
##$ASSFACI= 0
##$ASSFACX= 0
##$ASSWID= 0
##$AUNMP= <proc_1d>
##$AZFE= 0.1
##$AZFW= 0.1
##$BCFW= 0
##$BC_mod= 0
##$BYTORDP= 0
##$COROFFS= 0
##$CY= 12.5
##$DATMOD= 1
##$DC= 0
##$DFILT= <>
##$DTYPP= 0
##$F1P= 14.0000005364418
##$F2P= -0.99999901652339
##$FCOR= 0.5
##$FTSIZE= 32768
##$FT_mod= 6
##$GAMMA= 0
##$GB= 0
##$INTBC= 1
##$INTSCL= 1
##$ISEN= 128
##$LB= 0.3
##$LEV0= 0
##$LPBIN= 0
##$MAXI= 10000
##$MC2= 0
##$MEAN= 0
##$ME_mod= 0
##$MI= 0
##$NCOEF= 0
##$NC_proc= -4
##$NLEV= 6
##$NOISF1= 0
##$NOISF2= 0
##$NSP= 0
##$NTH_PI= 0
##$NZP= 0
##$OFFSET= 16.522
##$PC= 1
##$PHC0= 157.5198
##$PHC1= 10.70983
##$PH_mod= 1
##$PKNL= yes
##$PPARMOD= 0
##$PSCAL= 4
##$PSIGN= 0
##$REVERSE= no
##$SF= 250.13
##$SI= 32768
##$SIGF1= 0
##$SIGF2= 0
##$SINO= 400
##$SIOLD= 32768
##$SREGLST= <1H.DMSO>
##$SSB= 0
##$STSI= 32768
##$STSR= 0
##$SW_p= 5175.98343685301
##$SYMM= 0
##$S_DEV= 0
##$TDeff= 65536
##$TDoff= 0
##$TI= <Analysis number 999999
Compound Code 99
Book Reference 9
Project Code 9>
##$TILT= no
##$TM1= 0
##$TM2= 0
##$TOPLEV= 0
##$USERP1= <user>
##$USERP2= <user>
##$USERP3= <user>
##$USERP4= <user>
##$USERP5= <user>
##$WDW= 1
##$XDIM= 32768
##$YMAX_p= 294125247
##$YMIN_p= -257114
$$ End of Bruker specific parameters
$$ ---------------------------------
##NTUPLES= NMR SPECTRUM
##VAR_NAME=  FREQUENCY,     SPECTRUM/REAL,   SPECTRUM/IMAG
##SYMBOL=    X,             R,               I
##VAR_TYPE=  INDEPENDENT,   DEPENDENT,       DEPENDENT
##VAR_FORM=  AFFN,          ASDF,            ASDF
##VAR_DIM=   32768,         32768,           32768
##UNITS=     HZ,            ARBITRARY UNITS, ARBITRARY UNITS
##FACTOR=    0.157963299565203, 1,           1
##FIRST=     4132.6476996994, 0,             0
##LAST=      -1043.33573715361, 0,           0
##MIN=       -1043.33573715361, -257114,     0
##MAX=       4132.6476996994, 294125247,     0
$$ Real data points
##PAGE= N=1
##DATA TABLE= (X++(R..R)), XYDATA
$$ [...]
20205i688l6965n19N0686n971o9580K4645J6033p2120M0046R5113R021R440P721
20192E7862j2520m7020k1432L3422J7569j7414L264q154J8937l5136l2451K2815
20180b0258J6288J6300L3997K3225M338q653n611n6342J3285j8652j13063M6561
20168f8585Q9207L9954j8594J7539J4588k670p892n3991K877L4652n1531K2853
20156A8407k716l4406M4142Q2878L4891l3977k2850J5439k8732J8865n3238l2568
20144F135J5165J6455M6883K2466o6405L3875m4822k7984L5011J3316M138O849
20132F1082M601k2370M2008j3778o8222O200K8299m6590n079N4402N687Q784M0170
20119I5194j3216k7010J0191j0198k0813L955R7573j0593o6755m0010L7680m5696
$$ plain form
20205 -9688 -46653 -47172 3514 -2457 -72037 -47392 -31359 -103479 -63433 31680 40701 50141 57862
20192 57862 45342 -1678 -23110 10312 27881 10467 13731 5577 24514 -10622 -43073 -20258
20180 -20258 -3970 12330 46327 69552 73890 65237 59626 3284 16569 -2083 -115146 -68585
20168 -68585 20622 60576 41982 59521 74109 71439 63547 9556 12433 47085 -4446 18407
20156 18407 15691 -18715 25427 108305 143196 109219 86369 101808 73076 91941 38703 6135
20144 6135 21300 37755 84638 107104 40699 74574 29752 1768 36779 50095 54233 61082
20132 61082 65683 43313 85321 71543 3321 9521 37820 -8770 -13849 40553 46240 55024 95194
20119 95194 81978 54968 65159 54961 34148 38103 135676 125083 58328 18318 55998 10302
20107A0302j02728j0620k2144l0880L9058M4033j3531K3289O5018J5982j5906
20096A873q8223n774J4610k3426K3945L6732Q108J5531M2732M3973K76j7425n2962
20083c0N492M9945J610m9066k9028o56m1108K3884L3527n2256j6700N2764K3565
20070A943j548m279M0228K7714J7213J6170m9708m612K7116l932K9065o2019o8129
20057c4778K8546J01524K936o3050J678J5738N0763J23k1840o116m9888K8011
20045E3647j5233l326N599k9868J0289M0668N9528l5503j8251j6185p0617q33
20033b0085J8030O3879K8981k2380k614L7465L7255o1605l1801j6606m5909K591
20021a2799j7933L3067P9095l8556j01731j5275P1264j0320m8166L41N2570Q3159
$$ plain form
20107 10302 -92426 -103046 -125190 -156070 -117012 -72979 -86510 -63221 1797 17779 1873
20096 1873 -86350 -92124 -77514 -100940 -76995 -40263 -32155 -16624 26108 70081 70357 52932 -30
20083 -30 5462 55407 57017 7951 -21077 -21733 -62841 -38957 -5430 -57686 -74386 -21622 1943
20070 1943 395 -3884 36344 64058 81271 97441 47733 43121 70237 66305 95370 33351 -34778
20057 -34778 -6232 95292 98228 35178 36856 52594 103357 103480 81640 75524 25636 53647
20045 53647 38414 35088 40687 10819 21108 61776 121304 85801 67550 51365 -19252 -20085
20033 -20085 -2055 61824 90805 68425 65811 103276 140531 78926 47125 30519 -15390 -12799
20021 -12799 -30732 2335 81430 42874 -58857 -74132 -2868 -13188 -61354 -61013 -8443 74716
20009G4716J2523j6769l647l1442m2153J9895O7455k1376l0660j5027l2682N6042
19997C6875K2056K8452J6122j0555l3822j9759N3265p337O630L6174k1421Q192
19985A14872M1812p4960n196o316J6681j7449j1237M126N084k3998R447P5729
19973A28595m7055J8778Q326m1663j0389O7685p410l3995K4652J1274m2918k2068
19961E3812l9855l7486L2398n419k4983K6107J9724K577J7334L5164J0732n6420
19949C3685k1693k6748M4425j9023J0893L3351K9249l4950o3943n3434j4375J06824
19937B4261N7994j5824k1956P6823M0999p1739m4722j0517l404l121j4921j2214
19925A659J4771P5670M1033r244l2171l7919m4082J5744J3198L5693k764m5285
$$ plain form
20009 74716 87239 70470 66823 35381 -6772 13123 80578 59202 28542 13515 -19167 36875
19997 36875 58931 87383 103505 92950 59128 39369 92634 85297 91927 128101 106680 114872
19985 114872 156684 81724 76528 70212 86893 69444 58207 62333 67417 43419 52866 128595
19973 128595 81540 100318 108644 66981 56592 124277 116867 82872 107524 118798 75880 53812
19961 53812 13957 -23529 8869 3450 -21533 4574 24298 26875 44209 79373 90105 33685
19949 33685 11992 -14756 29669 10646 21539 54890 84139 49189 -14754 -68188 -82563 24261
19937 24261 82255 66431 44475 121298 162297 90558 45836 35319 31915 28794 13873 1659
19925 1659 16430 92100 133133 123889 91718 53799 9717 25461 38659 74352 71588 26303
19913B6303m3984N7147M2084k8305J0756K4711M3661j8105j4323o1965N336k9618
19901A3698k6293R212K4675m7272k8929L5271N8250j8805k2915l0478J7373j9075
19889c5288m5181K0546R7112j7450m8456N7169l9116o0867M3734L2047K728L592
19877A0570J3983j7206L4569K2612M9208L75o5509q7888q260n2645J9890O0941
19865a9360J7518j4514N2627J7224j5084m1405R987Q296O0931N8211j6964K3763
19853A41230o844j2811M2944K0140o2867p6621M1026J8953l6876k4272k9040N4987
19841F9949O7858P814n0849M7467k3186q6158j4027k5905p9391M2744M8329M3248
19829D7893N1007m6819o2294J2712O3223J0063m0885r646K346j3166J7726N0696
$$ plain form
19913 26303 -17681 39466 81550 53245 64001 88712 132373 114268 99945 37980 43316 13698
19901 13698 -12595 -3383 21292 -25980 -54909 -19638 38612 19807 -3108 -33586 -16213 -35288
19889 -35288 -80469 -59923 37189 19739 -28717 28452 -10664 -71531 -27797 4250 6978 10570
19877 10570 24553 7347 41916 64528 113736 114111 48602 -39286 -47546 -100191 -80301 -19360
19865 -19360 -1842 -16356 36271 53495 38411 -2994 6993 15289 76220 134431 117467 141230
19853 141230 134386 121575 164519 184659 121792 45171 86197 105150 68274 44002 14962 69949
19841 69949 137807 145621 94772 142239 119053 32895 18868 -7037 -86428 -43684 4645 47893
19829 47893 98900 52081 -10213 2499 65722 75785 34900 25254 27600 14434 32160 82856
19817H2856M969l3471J0057k6882r23Q3386L8594k3656q573p1768m8978J4954
19805B0565K9625K1599o412Q8531O9559K7969M933K1442L7826l7918n9860m5344
19793A72515K9367P2470K5869P5648J03853N6497J6748P591L1965l9249p3525
19782D79749q0415R538P0531K3509L6932K5147Q4881L0296n9931q0608k5571J5941
19770E29999k3408l9258j35514n6999r240l8001j1865m8915J8670L57k983L8795
19758B21638m361J9440j8042k7598q70r101O560L8438M428r722j572l1432L3435
19745B21241R1973m5220j6842l5456K7718J419M4007L1614N2133J19590N7904
19734E50081P7167L167R605J8321k0967o3785l2448K4664r696N69L1413k0531
$$ plain form
19817 82856 87825 54354 64411 37529 36606 119992 158586 134930 126357 54589 5611 20565
19805 20565 50190 71789 65377 153908 223467 251436 256369 277811 315637 277719 217859 172515
19793 172515 201882 274352 300221 375869 479722 536219 552967 560558 592523 553274 479749
19782 479749 399334 408872 479403 502912 539844 564991 649872 680168 620237 539629 514058 529999
19770 529999 506591 467333 331819 274820 265580 227579 215714 166799 185469 185826 182843 221638
19758 221638 217277 236717 218675 191077 190207 181106 187666 226104 230532 220810 219238 187806 221241
19745 221241 313214 267994 251152 215696 243414 244833 288840 320454 372587 492177 550081
19734 550081 627248 630415 640020 658341 637374 573589 541141 565805 556109 556678 588091 567560
19722E67560L1455q1012o3019j6883J2798l904o5911p6106n4186k3592j6737l3236
19710A77227j9765p7794l3790Q212K1101J6358k3928n1980j1813K5190K775K5016
19698E6809j6009M545l502M8901l5780r2224J6896J22796L2484m8623m3879j3252
19686B9162L0494k2954L9709K1375l7418l1703l05J9774J3740J484k1055l7022
19674E281K3203O7556N3144M3156n5460l6570J8287q054n7777m5380L693P6978
19662H8057M342l4496L2907M565l0271J0297N872K3950J7947k9712J4252M6779
19650A54489J9268o4807P623N2820j9016k6568r618l0816n8743N443K5790O0517
19638A16382L3910n63k1919p180K1640J6771j4947N2189J9076k8304p3800J638
$$ plain form
19722 567560 599015 518003 454984 438101 450899 446995 381084 304978 250792 227200 210463 177227
19710 177227 157462 79668 45878 54090 75191 91549 67621 15641 3828 29018 31793 56809
19698 56809 40800 45345 41843 90744 54964 -37260 -20364 102432 134916 86293 42414 29162
19686 29162 59656 36702 76411 97786 60368 28665 28360 48134 61874 63358 42303 5281
19674 5281 28484 96040 149184 192340 136880 100310 118597 110543 52766 7386 11079 88057
19662 88057 92399 57903 90810 95375 65104 75401 81273 105223 123170 93458 107710 154489
19650 154489 173757 108950 116573 169393 150377 123809 114191 83375 24632 30075 55865 116382
19638 116382 150292 149729 127810 120630 142270 159041 144094 196283 215359 187055 113255 114893
19626A14893K6360k9797k2142l7499M979J2760k6976J7042M5321P1664Q858k5891
19614A59572m1910k3755j326K9982L6217J867K300k8517r231l6957j5283J5493
19602H8452k806k9109j7315N0422M7132n2816J1428J9474J8133m000r922j2311
19590A06762L5373P3913j6127o1547j04309j6197J3874L9922K9399M8726o297
19579A43492L713J2944M2650J127O191R061j8881n859o1135j1662J9570m4047
19567I7164l8862K8850K8692J2609K5119J0602J0532o5735m4434O176K6335N0804
19555A47852L790J8222l8739j4574M4755J6383k3265m0517J3384J0073K4637K7553
19543A89554J0502J1488o8688N8650l6039p8314k0508k9365L4567O7456J8479
$$ plain form
19626 114893 141253 111456 89314 51815 56794 69554 42578 59620 104941 176605 185463 159572
19614 159572 117662 93907 92581 122563 158780 160647 162947 134430 125199 88242 72959 88452
19602 88452 85646 56537 39222 89644 136776 83960 95388 114862 132995 128995 119073 106762
19590 106762 142135 216048 199921 138374 34065 17868 31742 71664 101063 149789 143492
19579 143492 147205 160149 202799 203926 210117 219178 200297 194438 133303 121641 141211 97164
19567 97164 58302 87152 115844 128453 153572 164174 174706 108971 64537 70713 97048 147852
19555 147852 151642 169864 131125 116551 161306 177689 154424 113907 127291 137364 162001 189554
19543 189554 200056 211544 142856 201506 165467 87153 66645 37280 71847 139303 157782
19532A57782o8249k6023M5163j4250K4234M9871K542L1856M2653j174M2656N74
19520B87635o0269l0157N444M8029j2691n2881l7932m9266N6221l382J9453N7265
19508B27469l7178k7847K0431j1008n6819j2121J4417k2180P503O7782k2519p6478
19496G1452M5704N4415o63l4229J6524L5417O476N9539l5892m6148K2518N1901
19484B47014J6740J7376J3477O545n1738n9650m0305k312K4925J6752M8460L9840
19472B77124J6417q369J1659K5443J1284m6894k4125M901K5883K6505J1540m1269
19460B90099k2123j254J9020K4362J4130k0579l0252n8948l7179L7731J2647j3066
19448B14588R71n1586K0011Q9323J5884o0693p8382p764P898K1672M6987R378
$$ plain form
19532 157782 89533 63510 108673 94423 118657 168528 171070 202926 245579 244405 287061 287635
19520 287635 227366 197209 202653 250682 237991 185110 147178 97912 154133 150751 170204 227469
19508 227469 190291 162444 182875 171867 115048 102927 117344 95164 102667 170449 147930 71452
19496 71452 117156 171571 170908 136679 153203 188620 195096 254635 218743 172595 195113 247014
19484 247014 263754 281130 294607 301152 249414 189764 149459 147147 172072 188824 237284 277124
19472 277124 293541 285172 296831 322274 333558 286664 262539 267440 293323 319828 331368 290099
19460 290099 267976 266722 285742 310104 324234 303655 273403 214455 177276 215007 227654 214588
19448 214588 215559 163973 183984 273307 289191 228498 150116 142352 150250 171922 218909 228287
19436B28287j3978m2184p617N715m3564m9314O6615L1734J7205k8898K6531O4015
19424B54547o444J7380N7448k4835P08k2783l045L3372n2191l3785j8903M079
19412B05548J2317k9379J838L2708N3422M4558m8913l0936L7471M0966j9769P964
19400C07795P8806J7764l1991N385K4586K866J804p5174p4185m9745j7883l3105
19388A56923K3860J02410l8912L5070J9351R1027j4382k4315k8779L6208O7320
19377D25781J325J3474o100r463O7117L9864Q509j09063n3802K8512K6289Q0670
19365E13113Q525M1587k0038l2830p4624j3116o059P588J152J2025O5582P7563
19353E80468K4537m7549n7223J0294Q7801M4617n5485M215P5185l1541o5298l0355
$$ plain form
19436 228287 214309 172125 164508 170223 126659 77345 143960 175694 192899 164001 190532 254547
19424 254547 248103 265483 322931 298096 298804 276021 272976 306348 254157 220372 201469 205548
19412 205548 217865 188486 190324 223032 276454 321012 272099 241163 278634 319600 299831 307795
19400 307795 386601 404365 372374 377759 402345 405211 407015 331841 257656 207911 190028 156923
19388 156923 180783 283193 244281 279351 298702 389729 375347 351032 322253 358461 425781
19377 425781 427106 440580 434480 425017 492134 531998 540507 431444 377642 406154 432443 513113
19365 513113 521638 563225 543187 510357 435733 422617 416558 424146 425298 437323 502905 580468
19353 580468 605005 557456 500233 510527 598328 642945 587460 591675 666860 635319 570021 539666
19341E39666q5895k697K9231K9432N779P8090Q1430K905L2826K8670j9228K2584
19329G42793k9557K3339K1475K5710L5985j2695P2484L3274j2413M343N5655L944
19317I64337M381L5609M7968J8113K3018L3150J28158M9784N8326J08852J24222
19306A595918J46484J18065J22469Q9266J04796J35573J55156J72513K08008K38938
19296C087186L40699L71831M01042L34536K36854L85974M41045N37326O48933
19287F785426Q66939J203821J759759K384624L010847L603095L608930K809704
19279B6033145J618691R36468J220621K711118N460442R391177J4659232K0605789
19271H2636683K5453654K6066779J8598885N990439l966931j0660206j6198653
$$ plain form
19341 539666 453771 451074 480305 509737 515516 593606 675036 677941 710767 739437 720209 742793
19329 742793 713236 736575 758050 783760 819745 807050 879534 912808 900395 904738 960393 964337
19317 964337 968718 1004327 1052295 1070408 1093426 1126576 1254734 1304518 1362844 1471696 1595918
19306 1595918 1742402 1860467 1982936 2072202 2176998 2312571 2467727 2640240 2848248 3087186
19296 3087186 3427885 3799716 4200758 4535294 4772148 5158122 5599167 6136493 6785426
19287 6785426 7652365 8856186 10615945 13000569 16011416 19614511 23223441 26033145
19279 26033145 27651836 28588304 29808925 32520043 37980485 47371662 62030894 82636683
19271 82636683 108090337 134157116 152756001 158746440 154779509 144119303 127920650
19264A27920650j9402725j8793996j5478461j0389546n327344j365624L17969
19257E7480923n77427l504771o304873p687409p551062o367114m881026l535211
19249A7072030k502630j671987j096481o23255k98187k01436j77948L291R6065
19240A0599462P6277J52242K52257M71349R02502J496263K316696L446041M787666
19231B4500755O527733P969722Q538432P342232M183721P72528r67337j08314
19223E8759472L309432Q747993J5328660K1858182K5879307K4701344K0032785
19216A78617175J3564854O88166j6396791k7807360l1202695k7982996k1456341
19209F8024012j4603150q934246m763540k170467j255933j990975l569243m472856
$$ plain form
19264 127920650 108517925 89723929 74245468 63855922 58528578 57162954 57480923
19257 57480923 56903496 53398725 47093852 39406443 31855381 25488267 20607241 17072030
19249 17072030 14569400 12897413 11800932 11177677 10879490 10678054 10500106 10503397 10599462
19240 10599462 10675739 10827981 11080238 11551587 12454089 13950352 16267048 19713089 24500755
19231 24500755 31028488 38998210 47536642 54878874 59062595 59835123 58867786 58759472
19223 58759472 62068904 70816897 86145557 108003739 133883046 158584390 178617175
19216 178617175 192182029 192870195 176473404 148666044 117463349 89480353 68024012
19209 68024012 53420862 44486616 39723076 37552609 36296676 34305701 30736458 26263602
19201B6263602m660236m242606l473327k529849j794340j243077r24241o89493
19193F706433n17098m00153l79567m76399n42695n51038n13219l91629k94906
19184B639729k56465j93622j25502p4843j10922q8499j18701j16223r7134p5207
19174A382611q1108p9204m1791m5520n6754r4272J795k9445l3710O510l560M024
19162I29576n113l2369J8140j5515k6922k042k9336M2448J35567J75212K61506
19151A451152K56736J07114k6736k2372l5610n8032m7593o3159P9514L6901m0535
19140A637380l0537m2095o4124r5199r2428j23693o5217K9161M9472J5776l3260
19129A185236j6212M791l3709k0052O0404k7344n8392q6992j40086j20062r3691
$$ plain form
19201 26263602 21603366 17360760 13887433 11357584 9563244 8320167 7395926 6706433
19193 6706433 6189335 5789182 5409615 4933216 4390521 3839483 3326264 2934635 2639729
19184 2639729 2383264 2189642 2064140 1989297 1878375 1789876 1671175 1554952 1457818 1382611
19174 1382611 1301503 1222299 1180508 1134988 1078234 983962 985757 956312 922602 929112 925552 929576
19162 929576 924463 892094 910234 894719 867797 865755 836419 878867 1014434 1189646 1451152
19151 1451152 1707888 1815002 1788266 1765894 1730284 1672252 1624659 1561500 1641014 1677915 1637380
19140 1637380 1606843 1564748 1500624 1405425 1312997 1189304 1124087 1153248 1202720 1218496 1185236
19129 1185236 1169024 1173815 1140106 1120054 1180458 1153114 1094722 1007730 867644 747582 653891
19118F53891l3131n1600k8182K4374K2884K9714J6285K5579M7369O1016P9537
19107H47736L9965k1158l4069l384P3008J57080J82211J97772J50526O8788L7725
19096A696200j7214j71554j42114j03873j74004j43503n3340n804N18r602k9194
19085H46516o4534K3946k8932j07764j15347r9371r0508o488M8705O4119o3586
19074D06756m549O991j4500m538q4231l4431L1876k2691Q54l6061o7372L0668
19062B08772j8718K1676p4730k1636L5926r027J1342O944J1474k7654n1506M6961
19050A39824o94l7622n5933J5926J2662L888L8673N8350J0530O013j8144K4229
19038A97702l9172o4703J0868j9946J4864J47M1018k6740K4430l6483m969l9882
$$ plain form
19118 653891 620760 569160 540978 565352 588236 617950 634235 659814 707183 768199 847736
19107 847736 887701 866543 832474 829090 902098 1059178 1241389 1439161 1589687 1658475 1696200
19096 1696200 1678986 1507432 1365318 1261445 1087441 943938 890598 884794 885312 875710 846516
19085 846516 781982 805928 776996 669232 553885 454514 364006 357518 406223 470342 406756
19074 406756 402207 409198 394698 390160 305929 271498 303374 280683 281537 245476 178104 208772
19062 208772 190054 211730 137000 115364 151290 142263 153605 160549 172023 144369 92863 139824
19050 139824 139130 101508 45575 61501 74163 78051 116724 175074 185604 191617 173473 197702
19038 197702 158530 93827 104695 84749 99613 99760 140778 114038 138468 101985 97016 57134
19026E7134n0860K3844L9915j1214J5571Q5407K4751J8100k8603J1970J4691j4651
19014A86055k2605j6827J9036K5234L2519j6401m5131l9353l7385J5015K4736
19003A24893j4682J9388m2909k2597N3488J6052j6765n920K0103J6053J2611m7478
18991A12237l0081m2024p1047N1308M9114L4057J0571k4843p7518J2804O7960
18980I2538p3600l7614O68J4238M8764L4197N8345R062m470r771k332J4220K9181
18967A73426p4657k6130O707L8064P220p8919j7901K3036K1268l35p818j6692
18955D7269k4900j9345k1528Q6711J3441m8622k4499Q0843l3567k8812m270O1411
18943H4132M5611r367n4156l3317k933l4472m2123K287M4177M6873Q138m989L4
$$ plain form
19026 57134 6274 30118 70033 58819 74390 159797 184548 202648 174045 186015 200706 186055
19014 186055 163450 146623 165659 190893 223412 207011 161880 122527 85142 100157 124893
19003 124893 110211 129599 86690 64093 117581 133633 116868 110948 131051 147104 159715 112237
18991 112237 82156 40132 -30915 20393 69507 103564 114135 89292 11774 24578 92538
18980 92538 18938 -18676 -18008 -3770 44994 79191 137536 146598 142128 132357 130025 144245 173426
18967 173426 98769 72639 79346 117410 124630 45711 27810 50846 72114 71779 63961 47269
18955 47269 22369 3024 -18504 68207 81648 33026 8527 89370 55803 26991 22721 84132
18943 84132 129743 120376 66220 32903 29970 -4502 -46625 -44338 -161 46712 54850 49861 49895
18930D9895r252L3240L4115J2692j6390j8261l5807m8153J7407J5854L1249k7632
18918C8957L73M6483M0721K974j8900k7632N0889p291K229R127K7583j4077q0566
18905G0870o023L0979K8828K4629K5255l7513l5120J1912P5272N728p804l2550
18893A54463m1673k0119n0168J54J9709P5845O6004m5991n3904m3084L5231l769
18881I2698J2049L2268M7344k636M6552m3821l7526l0478k2893j6767N1163L2349
18869A60302L4388L82o5090J0430N9148m6789K8802M7058p8091n5782l1236K8843
18857I2365L5791K907j7489K6784q8233N690M0658J759R149l0885M4587K7861
18845A50944J1620J4876M5345O5896k3610n1894o5942J8002P6461L1130o177K5381
$$ plain form
18930 49895 40643 73883 107998 120690 104300 86039 50232 2079 19486 35340 66589 38957
18918 38957 39330 85813 126534 129508 110608 82976 133865 126574 128803 137930 165513 151436 70870
18905 70870 64847 95826 124654 149283 174538 137025 101905 113817 189089 194817 187013 154463
18893 154463 112790 92671 42503 42657 62366 138211 204215 158224 104320 61236 96467 92698
18881 92698 104747 137015 184359 181723 228275 184454 146928 116450 93557 76790 127953 160302
18869 160302 194690 195072 129982 140412 199560 152771 181573 228631 150540 94758 63522 92365
18857 92365 128156 131063 113574 140358 52125 57815 98473 100232 109381 78496 123083 150944
18845 150944 162564 177440 222785 288681 265071 213177 147235 165237 241698 272828 266651 292032
18833B92032j5310J3698o1846o8282j90k6310N9468L8194P5442O052m9842m4030
18821B19076L1957l4665k8965k098J9100N413o0266l003p624o023O1001m745j1673
18808A77485n7275K5206L9863J7633Q4152K247l3694o1082l2656l0423L3047N0962
18796B15465j0951m3109n6435J2260J01977P9590L3835K7922k5271m5834j6095
18785B73354J078j7466j6795m1451L5957M9350k7536k609J7215J5736J5396K229
18773C04458o518K960M8424q671J3589K3805n2508l043P8980J8169M0219R3281
18761E53145K9928J7399M9285L4865l3714j7041K3686M5530k3968l6390K8212
18750F70937o552L8282Q4557O4723j6740o5024m8929k6432j02789p5365J8398
$$ plain form
18833 292032 276722 290420 228574 160292 160102 133792 193260 231454 306896 312948 263106 219076
18821 219076 251033 216368 187403 185305 204405 209818 149552 146549 138925 132902 193903 189158 177485
18808 177485 120210 145416 185279 202912 287064 289311 255617 194535 161879 131456 164503 215465
18796 215465 204514 161405 104970 117230 219207 298797 332632 360554 335283 289449 273354
18785 273354 274432 256966 240171 198720 234677 284027 256491 253882 271097 286833 302229 304458
18773 304458 297940 300900 349324 340653 354242 378047 325539 322496 401476 419645 459864 553145
18761 553145 583073 600472 649757 684622 650908 633867 657553 703083 679115 642725 670937
18750 670937 664385 702667 787224 851947 835207 770183 721254 694822 592033 516668 535066
18739E35066L5585k1515J3788Q3077P1531L747n4906r6991p062J6904L9372J8880
18727F37476J6657L6281l354j8754j3955m1564j1377j8419L9757L7774K6416N2267
18715G39205R3272J09160J60005Q9102N3710P0520P1178k2530k7000J5930m7311
18704A305241K917J4099J0332Q2184R0966l8592j3754J63826J37398J52458M3360
18693A950435p0065p0205l619o2660n5853p7948j37492p9967k9950M9913J4795
18682A427384m0876L5371L2106J1853L0311K6137j203K8628N6086O2970q154J08451
18670A769064J64539J04002L6084R4214J39664K05580K60235J78891K86143L11004
18660C549420L47124M72920N39358M97558M31693N15079P32822Q31634J087350
$$ plain form
18739 535066 570651 549136 562924 646001 717532 721279 666373 569382 562320 579224 618596 637476
18727 637476 654133 690414 687060 668306 654351 612787 601410 582991 622748 660522 686938 739205
18715 739205 832477 941637 1101642 1190744 1244454 1314974 1386152 1363622 1336622 1352552 1305241
18704 1305241 1308158 1322257 1332589 1414773 1505739 1467147 1453393 1617219 1754617 1907075 1950435
18693 1950435 1880370 1810165 1806546 1743886 1688033 1610085 1472593 1392626 1362676 1412589 1427384
18682 1427384 1386508 1421879 1453985 1465838 1496149 1522286 1521083 1549711 1605797 1668767 1660613 1769064
18670 1769064 1933603 2037605 2073689 2167903 2307567 2513147 2773382 2952273 3238416 3549420
18660 3549420 3896544 4369464 4908822 5406380 5838073 6353152 7085974 7917608 9004958
18651I004958J519965K017873K352920K606912K893914L262167L487607L422936
18643C0569252L328147L929257N543975Q177952J1256229J3925155J5667749J7268314
18635A09666030J8837165J7293831R649053P11091l763457p267389j1901228j4561498
18627A18663598j4614585j2798132j0461109q318367o208709m364058l728586
18620E8170052m389029n389267n732074n481517n114130m681016m114269l395187
18612A9873563k681011k024081j493269j081964o47522m25557l64074k26196n284
18603A0924605L13033N27293Q20848J285700J884643K597539L313572L929609
18595B5596842M415509M868318N236128N127019M296734L486993L827271N057931
$$ plain form
18651 9004958 10524923 12542796 14895716 17502628 20396542 23658709 27146316 30569252
18643 30569252 33897399 37826656 43370631 51548583 62804812 76729967 92397716 109666030
18635 109666030 128503195 145797026 155446079 156157170 152393713 145126324 133225096 118663598
18627 118663598 104049013 91250881 80789772 72471405 66262696 61898638 58170052
18620 58170052 53781023 48391756 42659682 37178165 32064035 27383019 23268750 19873563
18612 19873563 17192552 15168471 13675202 12593238 11945716 11520159 11156085 10929889 10924605
18603 10924605 11237638 11764931 12585779 13871479 15756122 18353661 21667233 25596842
18595 25596842 30012351 34880669 40116797 45243816 49540550 53027543 56854814 61912745
18587F1912745O582696Q474531J0901302J3006370J2347729Q379906O091985N201165
18579A32898429O13854p986681j3507925j4963309j4359816j3210705j1952918
18572E7530929j0043086p793308n542720l824256l033646k966801k946543k730732
18564A8649837k473409k313679k046983j755587j396824j086698q16346o21761
18556F138550m75763l62220k40686k51537l00037l40848l37934k95270l10436
18547C223819k78689k77212k87241k01896j05523j30905j22407j03472j23317
18538A593157j33974q1786m6062j14310j08975q1336R321n3844j31305l2306M1658
18527H60238R360l0904r8796r7543k2598J5361K7051l1507k480J418K5292J0620
$$ plain form
18587 61912745 68495441 76969972 87871274 100877644 113225373 121605279 127697264 132898429
18579 132898429 133512283 125525602 112017677 97054368 82694552 69483847 57530929
18572 57530929 47487843 39694535 34151815 30327559 27293913 24327112 21380569 18649837
18564 18649837 16176428 13862749 11815766 10060179 8663355 7576657 6760311 6138550
18556 6138550 5662787 5300567 5059881 4808344 4508307 4167459 3829525 3534255 3223819
18547 3223819 2945130 2667918 2380677 2178781 2073258 1942353 1819946 1716474 1593157
18538 1593157 1459183 1377397 1331335 1217025 1108050 1026714 1036035 982191 850886 818580 860238
18527 860238 869598 838694 739898 642355 619757 635118 662169 630662 628182 629600 654892 665512
18515F65512J6847J251N833O3446M6356L0482K9884P0636K6365k6349Q1365L8730
18503A050358R8840R1938O2510j4862j0316N2076m9753j12201j06973n5358o1453
18492I44806j06986n0451o7606m7781l1217j23169j09846m8201l576m5764N2792
18481C63001m6923Q241L0159m3198k4594l2469m458N1629l840m0455N0084M743
18469C11920j1360n8397P208M8255J7313O0267J076o6106o1912o535K3083l3751
18457B31061j7572L6495M4947j5664k7734J3455k8031k5527Q6352N8287l9900
18446C16169m2762k0756j2281J1040P083j5900j3034M8529j406J2624l7077k0890
18434B31339j2120q634M5656N79m089k8213O469Q2717J9354k6097N3375q237J2238
$$ plain form
18515 665512 682359 683610 689443 752889 799245 829727 859611 930247 956612 930263 1011628 1050358
18503 1050358 1149198 1241136 1303646 1288784 1278468 1330544 1280791 1168590 1061617 1006259 944806
18492 944806 837820 787369 719763 671982 640765 517596 407750 359549 355973 310209 363001
18481 363001 316078 324319 354478 311280 286686 254217 249759 301388 297548 257093 307177 311920
18469 311920 300560 242163 249371 297626 314939 375206 376282 310176 248264 241729 264812 231061
18457 231061 213489 249984 294931 279267 251533 264988 236957 211430 297782 356069 316169
18446 316169 273407 252651 240370 251410 258493 242593 229559 278088 276682 289306 252229 231339
18434 231339 219219 210585 256241 256820 252731 224518 230987 313704 333058 306961 360336 352099 364337
18421C64337M3136k587q387N2956O834o7242m4823L6652J4238l4516o0060j9218
18409B81320l7459O721m166j490n9882J622L2634K086m5875j7972Q760m2135k2350
18396A01814M1622P9466K7999J5194N2836n3282m0048N9750j5621k9628K6733
18385B66835l071M9998J5598m9098k2414M4153L1879P427L0767N8356P997j2312
18373D26115J2701J143L3549N9101j6706j47456q2474K6108R3108O5103p6114
18362C94178m1491N816N2678O6908o0137o1757j1099J4592K7154m4337r0875l2575
18350B19055O6297O0432J8057l6881M6089O021J1218J6902q365n737m092L8668
18338D27664Q8695L0366N452m5128M777j4385Q560m462K2993L5486M3716k248
$$ plain form
18421 364337 407473 404886 396499 449455 456289 389047 344224 380876 395114 360598 300538 281320
18409 281320 243861 250582 246416 244926 185044 186666 219300 221386 175511 157539 166299 124164 101814
18396 101814 143436 222902 250901 266095 318931 265649 225601 285351 269730 240102 266835
18385 266835 263764 313762 329360 280262 257848 302001 333880 341307 372074 430430 438427 426115
18373 426115 438816 439959 473508 532609 515903 368447 285973 312081 405189 470292 394178
18362 394178 352687 358503 411181 478089 417952 356195 345096 359688 386842 342505 251630 219055
18350 219055 285352 345784 363841 326960 373049 379070 390288 407190 398825 393088 388996 427664
18338 427664 516359 546725 552177 507049 511826 497441 506001 501539 524532 560018 603734 601486
18326F01486l2522k2441j0781O8676O4668m3269l7724m7239n076M1303L0567J7776
18314F25424j5858n2391k6420j03079m9339L7781O7920M1918j0007J5947O3384
18303E95280j1770l9067k0246l5500K1012Q5348K0835L7307J2497o6677j4639
18292E84380O3582L4790K5904Q7432N0360j3604K4202Q1166K1830K8984L2801
18281A021827N2995M0595J5017K2647K3014N8349J6301M2971J07244J35688J75862
18270A712510Q0496L6536R351k4230O9907J03393J49569K62280K81696L15706
18260B997214N05468Q37488J376425J664406J637585R24740j55281p42030p61967
18251H284048l82293J64247O79019J441395K371711L822909O175467R615030J3561522
$$ plain form
18326 601486 568964 546523 535742 604418 669086 625817 588093 540854 535778 577081 607648 625424
18314 625424 609566 557175 530755 427676 378337 416118 484038 525956 515949 531896 595280
18303 595280 583510 544443 524197 488697 509709 595057 615892 653199 665696 599019 584380
18292 584380 647962 682752 708656 796088 846448 832844 857046 938212 960042 989026 1021827
18281 1021827 1074822 1115417 1130434 1153081 1176095 1234444 1250745 1293716 1400960 1536648 1712510
18270 1712510 1793006 1829542 1838893 1814663 1884570 1987963 2137532 2399812 2681508 2997214
18260 2997214 3502682 4340170 5716595 7381001 9018586 9943326 9788045 9046015 8284048
18251 8284048 7901755 8066002 8745021 10186416 12558127 16381036 22556503 32171533 45733055
18242D5733055J5260002J1306828L876182m858419r756482q738822o024795m956104
18234D1841445n831193n594429m384252k426473k01645J787464K976844J985489
18226C0153250j249151l863120m668702m157491l024916j939129j208761p15058
18218I326922l49852p3029J57935M99819P91535J315530J663552J302207K17626
18209A4852245n63511o08406l40415K97370J121139K137784L372617N057491P076263
18200C2402577R050169J0082263J0696072J3424464J7139365J5900358N541936
18193A14237204m834854p194950m135885o08783K282541N022623P852883R680434
18185A22301213M916533m993502j3752851j6757236j7357874j5793834j2954642
$$ plain form
18242 45733055 60993057 72299885 76176067 71317648 61561166 52822344 46797549 41841445
18234 41841445 36010252 30415823 26031571 23605098 23403453 25190917 28167761 30153250
18226 30153250 28904099 25040979 20372277 16214786 13189870 11250741 10041980 9326922
18218 9326922 8977070 8904041 9061976 9561795 10353330 11668860 13332412 14634619 14852245
18209 14852245 14288734 13680328 13339913 13637283 14758422 16896206 20268823 25326314 32402577
18200 32402577 41452746 51535009 62231081 75655545 92794910 108695268 114237204
18193 114237204 109402350 102207400 98071515 97462732 99745273 104767896 112620779 122301213
18185 122301213 127217746 122224244 108471393 91714157 74356283 58562449 45607807
18178D5607807r832438o943691m725821l034945j644985k72507P89664R60321
18170B0903405l51004j982793k646470k519603j787200j122579p07699l56651
18162I429406L2337K09557M05621P54015J400106K246860L438870M973774O314512
18153B9205058O078034K865207j157042l050919k646266l82048K888778O219229
18145D0020031Q208994P133846O622143J0041871J5023417J6343799J0386159
18138A13780260j211342j5906154k1713292k0289113j5509238j0262853o453705
18131B2434563m256184k887437j885763j043651k68809N79300J339967J552922
18123A5564908L69225j525364k301527k524780k059821j436229r88225o69816
$$ plain form
18178 45607807 35775369 28831678 24105857 21070912 19425927 19153420 19943084 20903405
18170 20903405 20552401 18569608 15923138 13403535 11616335 10493756 9786057 9429406
18162 9429406 9461743 9671300 10076921 10830936 12231042 14477902 17916772 22890546 29205058
18153 29205058 35283092 38148299 36991257 33940338 31294072 30912024 33800802 40020031
18145 40020031 48229025 55362871 61985014 72026885 87050302 103394101 113780260
18138 113780260 112568918 96662764 74949472 54660359 39151121 28888268 22434563
18131 22434563 18178379 15290942 13405179 12361528 12092719 12672019 14011986 15564908
18123 15564908 15934133 14408769 12107242 9582462 7522641 6086412 5098187 4428371
18115D428371m24887l54175l41202k50877k22491j48271j22850j55371j48688
18106B259559j80481k34861j39145j35416j39530j39236j31469k7231j03754p8015
18096I50421p1601k7843M2370j0939j05801n2515M272J1021r8077p5985m4876
18085E20447J6083J8109K9235j0981l260Q0564O5599O7249P182l4725p306j1401
18073G36795m935j327N4864L3317k2183l6761l8214k4335M4373j2434j1394O9608
18061G87374j3114K3658j542k4672n2834j17623q0887j12242m1936M6904O9606
18050D82692o1554j01083k6913j5163P6588M4814l9953l0354K1793L01j3377j9364
18038C18427m348q6461o4265k8627j1870K7863N0405j2213m4467n9442j559J16506
$$ plain form
18115 4428371 4003484 3649309 3308107 3057230 2834739 2686468 2563618 2408247 2259559
18106 2259559 2079078 1844217 1705072 1569656 1430126 1290890 1159421 1132190 1028436 950421
18096 950421 878820 850977 893347 882408 776607 724092 728364 739385 641308 565323 520447
18085 520447 536530 554639 583874 572893 569633 650197 715796 783045 790227 755502 748196 736795
18073 736795 731860 730533 785397 818714 796531 759770 721556 697221 741594 729160 717766 787374
18061 787374 774260 797918 796376 771704 718870 601247 520360 408118 366182 413086 482692
18050 482692 421138 320055 293142 277979 354567 399381 359428 329074 350867 351168 337791 318427
18038 318427 314079 227618 163353 134726 122856 150719 201124 188911 144444 85002 83443 199949
18026A99949O1855j9056R356K2761M2319n8254r9414j9706L3595K2552k7899l1651
18014A36407r094K3276K0727k7134p2322J3224l0072K3718L2289L2521R513q5038
18002F8015K9931N7332P4485m4983n7391m4858k3982n5387l575M2545L7002K2587
17990A01721m865M011K1329j5873n32N3789q12l340L101n5711p2667p160J05479
17977A28470N9218J1794K2480K5736j221k269J2662r198J6769r5687n8657k2122
17965H7975M8556k119J6185P1891L4507q5784r150O0466j9079m836J7527k694
17953B13445l0114l0346j9806l7586k528K0144K2826M3775P5386K2160m4311j4153
17941B18892j1525l8119r008O873N7636L9249L6668Q623N132j5612j1052J5515
$$ plain form
18026 199949 261804 242748 252104 274865 317184 258930 159516 139810 173405 195957 168058 136407
18014 136407 127313 150589 171316 144182 71860 85084 55012 78730 111019 143540 153053 68015
18002 68015 97946 155278 229763 184780 127389 82531 58549 3162 -413 42132 79134 101721
17990 101721 96856 100867 122196 106323 105791 159580 158768 155428 158529 102818 30151 22991 128470
17977 128470 187688 199482 221962 247698 246477 244208 256870 247672 264441 168754 110097 87975
17965 87975 136531 134412 150597 222488 256995 171211 162061 222527 203448 198612 216139 213445
17953 213445 183331 152985 133179 95593 93065 113209 136035 179810 255196 277356 233045 218892
17941 218892 207367 169248 160240 167113 224749 263998 300666 309289 314421 298809 287757 303272
17929C03272J0648n6698k1905J0823P244l7263j4919k3720J2362M6912J201J1236
17917B49193J9653j2764q712Q146n2816j5123k4408l4723J9458K0406Q7639o431
17905B49518m4987P87L0438M2l7786l3429k5438J3655o286Q280j2621M6704J9275
17892B08152O7084Q460J1614K9296l2484j9812o3533K9013J3981m289J4553l0006
17880B32029j6736K0044L5742K3569L9743J1549o3226l8222M6334R6823n063j3180
17868C69406M509j1853n0986m9699l4020k4935O7977M7343m0059J9368L2247M9727
17856C79025j7577m8275j0342l1059J3517K6355m01N2389M0798K4681k870N29
17844D26770L1184M0829K0417n899l1762J11897M3345j18811l5734N6826j9782
$$ plain form
17929 303272 313920 257222 235317 246140 253384 216121 201202 177482 189844 236756 237957 249193
17917 249193 268846 256082 247370 255516 202700 187577 163169 128446 147904 168310 255949 249518
17905 249518 204531 205318 235756 235798 198012 164583 139145 152800 146514 154794 142173 188877 208152
17892 208152 275236 283696 295310 324606 292122 272310 208777 237790 251771 247482 262035 232029
17880 232029 215293 235337 271079 294648 334391 345940 282714 244492 290826 387649 382586 369406
17868 369406 373915 362062 311076 261377 227357 202422 270399 317742 277683 297051 329298 379025
17856 379025 361448 313173 302831 271772 285289 311644 311243 363632 404430 429111 426241 426770
17844 426770 457954 498783 519200 513301 481539 593436 636781 517970 482236 539062 519280
17833E19280R856K6087n479N2153K0412l3795J0879K8606K7316K7702J20853K0699
17821H24569l4831K3827M3786R7325J04329J7337N228L7050J0792M7609M7741
17810A224762M1930J3719L5219J21415J15343P9108J18735J15486J00184J71194
17800B137095J90289K26121K71498L25381L83303M30147M67814N44963P18837
17791E695448R34361J358033J923790K679914L204288K971854K129429J569004
17783B2466121J543532J343361O80409L36708R70187K883157O072636J0543095
17775D6839206J5594058J9131231J7694251Q878786j690180m859261l22365R722515
17767A10988241K0094765K2378460R406895r364840j8685470j8560729j4016086
$$ plain form
17833 519280 529136 555223 549744 601897 622309 588514 599393 627999 655315 683017 803870 824569
17821 824569 789738 813565 857351 954676 1059005 1076342 1081570 1118620 1129412 1177021 1224762
17810 1224762 1266692 1280411 1315630 1437045 1552388 1631496 1750231 1865717 1965901 2137095
17800 2137095 2327384 2553505 2825003 3150384 3533687 3963834 4431648 4976611 5695448
17791 5695448 6629809 7987842 9911632 12591546 15795834 18767688 20897117 22466121
17783 22466121 24009653 25353014 26033423 26370131 27340318 30223475 36296111 46839206
17775 46839206 62433264 81564495 99258746 108137532 106447352 101588091 101265726 110988241
17767 110988241 131083006 153461466 162868361 153503521 134818051 116257322 102241236
17760A02241236j1084458j1020633j1644413j0985336q836564n545832k168287
17753D0955713L84010J265575m90138l673305n649341o000355n211375l846350
17745A7734434k591217j809961j192623q47435n23379k95016j28616R5199L83899
17736A0825285P94643J397974K085016L055241M337583N493648N442977L805042
17728C7237409K080925K176658M088191O577443P388598M561139M23437o31200
17720F3902600K428832Q721783J5465110J7311156R403886j592122p963916p417762
17712A00259567j381470M418226L184197o667502j5502894j7909787j5584162
17705E0816175j1034001o837833m336163l621011l411858l079343k485310j830105
$$ plain form
17760 102241236 91156778 80136145 68491732 57506396 48669832 43124000 40955713
17753 40955713 41339723 42605298 42115160 38441855 32792514 26792159 21580784 17734434
17745 17734434 15143217 13333256 12140633 11293198 10769819 10474803 10346187 10441386 10825285
17736 10825285 11619928 13017902 15102918 18158159 22495742 27989390 33432367 37237409
17728 37237409 39318334 41494992 45583183 52160626 59549224 64110363 64533800 63902600
17720 63902600 66331432 75053215 90518325 107829481 117233367 115641245 107677329 100259567
17712 100259567 98878097 103296323 106480520 99813018 84310124 66400337 50816175
17705 50816175 39782174 32944341 28608178 24987167 21575309 18495966 16010656 14180551
17697A4180551r86489q4739O22748J056704J087125N92996R3464K38561J287393
17688A8088314L145113N244720O169952L598067k53605j505203j68142L082238
17680C7401454O377767O567259J255309m607060p026133o270590l511919p22840
17672B9463247J46447j965130m238963m745797m180061l123045k215043j493408
17664G648247j075009p33303m36453k86919k44787j68999j7032Q9218J24574R9704
17654D999241J40257N8391r013P4857L26885M94030P97675J153151J749137K607678
17644A2392289L923566N810875P213310O365712L715005L268364L891789L689701
17636E0270611M098380P034591J0460783J0172359K978443o225923j0212033r621101
$$ plain form
17697 14180551 13194062 13109323 13732071 14788775 15875900 16468896 16562360 16800921 18088314
17688 18088314 21233427 26478147 32648099 36246166 35992561 34487358 34319216 37401454
17680 37401454 43779221 50346480 51601789 46994729 39968596 33698006 30186087 29463247
17672 29463247 29609694 27644564 23405601 18659804 14479743 11356698 9141655 7648247
17664 7648247 6573238 5839935 5403482 5116563 4871776 4702777 4685745 4774963 4899537 4999241
17654 4999241 5139498 5197889 5188876 5263733 5590618 6084648 6882323 8035474 9784611 12392289
17644 12392289 16315855 22126730 29340040 35705752 39420757 42689121 46580910 50270611
17636 50270611 54368991 61403582 71864365 82036724 85015167 78789244 68577211 58956110
17628E8956110p141229o277650n736345m141940k968310l467677m739430m950932
17620A9532597m349141l367453k341456j570609j101046q23864m82170m10010
17612E086848m05321l44346k86009o9624n495j6619n4737j00712q4152m7391N2935
17601C725377J69139M46783O54223J000174J677252K730286M016131M981800L611939
17592B3013104K94190r83867m14525J886070M731600O150659K972135l001345
17584C4648021n519793n308182l192429p46052N08480n52826k802712l625659
17576A3408848l468918k636991j837806j271124q25697n16000m45585l59185k05471
17567A842071j14022j45523j63414o6929q2909j26693p0038m2544k0543j09490
$$ plain form
17628 58956110 51814881 45537231 39800886 35658946 32690636 29222959 24483529 19532597
17620 19532597 15183456 11816003 9474547 7903938 6802892 5979028 5496858 5086848
17612 5086848 4681527 4337181 4051172 3981548 3976053 3959434 3904697 3803985 3719833 3672442 3725377
17601 3725377 3894516 4341299 4995522 5995696 7672948 10403234 14419365 19401165 23013104
17592 23013104 23307294 22323427 21908902 23794972 28526572 34677231 37649366 34648021
17584 34648021 29128228 23820046 20627617 19881565 20390045 19837219 17034507 13408848
17576 13408848 9939930 7302939 5465133 4194009 3368312 2852312 2406727 2047542 1842071
17567 1842071 1728049 1582526 1419112 1352183 1269274 1142581 1072543 1029999 1009456 899966
17557H99966n7619n4407j06103l6014p9413m1935j2471p8671j15152o2235J054
17546B57000R5332J6791j16508P230K5337N2365r472m2140m6726k6357m5396Q197
17534A75653l7402l6262j3190L7004m1989l835N8004j439k1059k3017j4062Q1132
17522A59538R987k8443k8723j07365q3916O5458K4496M293q055O6621J0360l0766
17510E3485P9652L7472m0177p329P7204K2192m6959j6948k7841k9081m7769J9774
17498G3675r658j6376p62k6322K1215o709Q517j5579l1007j4999N1562j0751k088
17485B0718n5534J5499P776k7365K4155K4804J6346P639m761l1015L7085L3489
17473F8836L1264O5937k0795q5536l021j6265j2823O5601j1455m7989o1277k6597
$$ plain form
17557 899966 842347 787940 681837 645823 566410 524475 512004 433333 318181 255946 257000
17546 257000 352332 369123 252615 259845 285182 337547 328075 285935 239209 212852 167456 175653
17534 175653 138251 101989 88799 125803 83814 79979 137983 136544 115485 92468 78406 159538
17522 159538 169525 141082 112359 4994 -78922 -13464 11032 15325 7270 73891 84251 53485
17510 53485 133137 170609 130432 123103 200307 222499 175540 158592 130751 101670 53901 73675
17498 73675 64017 47641 46879 20557 41772 35063 43580 28001 -3006 -18005 33557 22806 20718
17485 20718 -34816 -19317 -11541 -38906 -14751 10053 26399 34038 29277 -1738 35347 68836
17473 68836 100100 166037 145242 59706 56685 40420 27597 93198 81743 33754 -27523 -54120
17461e4120L3463M3317N0269k4678j4852O7950J5270j2889K878n894J246N372
17449A07332r4074o5129O3057J8915k0750R280J5798l5144n9410r172n514L74
17437g4437N3731M6800Q9923l5770o4857q877o426J9428P1042K1650m5967l6697
17425B9543K4953m9950J4254J9386Q695j8888j5047n0835m329M4174K7106l8310
17413i248L1390J9339o0972m2191K7127J7501K1328k4328J5355l2095m5054k87
17401h2135k3044l4258K6201O5691O325L8855l3940P5013L9763m1539m8100J4486
17389C318J5664o6988o5112k5943J4042Q9076M6684L130j0029M3293J353n0026
17377a538n5680l8014m0678l7821P0178Q9670P1548m188k825k5937K661o3553
$$ plain form
17461 -54120 -20657 22660 72929 48251 33399 101349 116619 103730 106608 100714 101960 107332
17449 107332 13258 -51871 11186 30101 9351 18631 34429 -715 -60125 -69297 -74811 -74437
17437 -74437 -20706 26094 116017 80247 15390 6513 87 19515 90557 112207 66240 29543
17425 29543 54496 4546 18800 38186 46881 27993 12946 -37889 -42218 1956 29062 -9248
17413 -9248 22142 41481 -19491 -61682 -34555 -17054 4274 -20054 -4699 -36794 -81848 -82135
17401 -82135 -105179 -139437 -113236 -47545 -41220 -2365 -36305 38708 78471 36932 -11168 3318
17389 3318 18982 -48006 -113118 -139061 -125019 -35943 10741 13871 3842 47135 48488 -1538
17377 -1538 -57218 -95232 -135910 -173731 -103553 -13883 57665 53477 50652 24715 27376 -36177
17365c6177m6863N9419j5462o5667p574N1458K287l1035n1270k0456L4246K5233
17353a01861J8864L5960j6242J7705j2409j0479k6146k8453j30j0288J5271j6803
17341a35011L947k5862N3312J363o9758j1376j3607J6658L575R925N2781O993
17329a07060K1924K8322L6777j4704L590o1685k4136m395n6980J7401N3692L8816
17317f8438J8736N1532k9989m5149o9385L2677k3434M7714N3849Q65n3918k7219
17305a12159m464K1586j1502j046P2128N875j4350J5878n5451m2392k8280L5030
17293a19147O891K793O7083M0301p272P166M3691m095J2348K5567l4851J0899
17281E1374j0947k8697j5832q797P5850P4472N4367l0729L8394N1274L1088O9969
$$ plain form
17365 -36177 -83040 -23621 -39083 -104750 -112324 -60866 -58579 -89614 -140884 -161340 -127094 -101861
17353 -101861 -82997 -47037 -63279 -45574 -57983 -68462 -94608 -123061 -123191 -133479 -118208 -135011
17341 -135011 -131064 -156926 -103614 -102251 -172009 -183385 -196992 -180334 -176759 -166834 -114053 -107060
17329 -107060 -85136 -56814 -20037 -34741 -31151 -92836 -116972 -121367 -178347 -160946 -107254 -68438
17317 -68438 -49702 1830 -28159 -73308 -142693 -110016 -133450 -85736 -31887 -31022 -84940 -112159
17305 -112159 -116623 -95037 -106539 -107585 -35457 -29582 -43932 -28054 -83505 -125897 -154177 -119147
17293 -119147 -112256 -109463 -42380 -2079 -9351 -2185 41506 37411 49759 75326 40475 51374
17281 51374 40427 11730 -4102 -12899 62951 137423 191790 161061 199455 250729 281817 351786
17269C51786J9162l1059l9259n7768K5677j7368K8902K9045P5041J0280k5376
17258C69063L2412j2928K3571l328N51o7343j2925r222j0666l8952l9062p1975
17246A59196o9693K705j5480j9720M1574k1922m2392n2924k0009K834J5853M3116
17234B3138N4726P2420J8114n8413n824k8269m7749J9137O0366N0389j684J1635
17222A67986M0198J5811J8607N0267J8944Q6216k863o1615J515J3119m003j7049
17210C27133L154o4610r8617k4855L0853j795N6983m211O6303N1978N1594o1402
17198C32508q1544n5879l3227K8445R1875N6099n638k9937n9402p4598j02821
17187F5881j7686j3100k1008Q245J6472L2497r342l2193l1748J7113P8099j231
$$ plain form
17269 351786 370948 339889 300630 242862 268539 251171 280073 309118 384159 394439 369063
17258 369063 401475 388547 412118 408790 409341 341998 329073 319851 309185 270233 231171 159196
17246 159196 89503 92208 76728 57008 98582 76660 34268 -18656 -38665 -35831 -19978 23138
17234 23138 77864 150284 168398 109985 104161 75892 28143 47280 107646 158035 156351 167986
17222 167986 208184 223995 242602 292869 311813 398029 395166 333551 335066 348185 344182 327133
17210 327133 330287 265677 167060 142205 173058 171263 228246 224035 290338 342316 393910 332508
17198 332508 250964 195085 161858 190303 282178 338277 332639 302702 243300 168702 65881
17187 65881 48195 35095 14087 22332 38804 71301 61959 29766 -1982 15131 93230 91999
17175I1999k9682j391o3558l719J4114m9115J6486Q8560N4494K8608p749J9270
17163A58317Q886o9341J9725M6089j5866o7740p3707J229O761J9066j0375m010
17151A9034j5037l725l6350j05580k304J4210n683P895J4202L4008J2718Q4175
17139A7563K1651L6570m468n8563l1295N7408M2230k9288L5971P0740O7989O6012
17127B92520J7355L735L9523p3221L6611r076l932J9199m2698j0629J4281k8746
17115B54922k0148l9230l5342m7553m0567o9740j9378m6485M410J4761J6350O1638
17103C3638J4953n091N1840R28k978k1698K5903k866o5451q1001n9828K9249N5164
17090b7238R307j2423l8228n5046J1217L7464P3008j9862m952L6298P666k081
$$ plain form
17175 91999 62317 60926 -2632 -6351 7763 -41352 -24866 63694 118188 146796 139047 158317
17163 158317 167203 97862 117587 163676 147810 80070 6363 7592 14353 33419 23044 19034
17151 19034 3997 272 -36078 -141658 -143962 -129752 -135435 -127540 -113338 -79330 -66612 17563
17139 17563 39214 75784 71316 12753 -18542 38866 81096 51808 87779 158519 226508 292520
17127 292520 309875 313610 353133 279912 316523 307447 303515 322714 280016 269387 283668 254922
17115 254922 234774 195544 160202 112649 72082 2342 -17036 -63521 -59111 -44350 -28000 33638
17103 33638 48591 43500 95340 96268 93290 71592 97495 94629 29178 -51823 -111651 -82402 -27238
17090 -27238 -17931 -30354 -68582 -123628 -112411 -74947 -1939 -21801 -26753 9545 17211 15130
17078A5130k9424O9408L7323j1558K0663J9613M8921N703m7802m3051k2487K2952
17066H5391Q695n6426m6935N8290j563m968M747m5109n7052m9673K4277J9668
17054f0658L5970p504J7924J2484l432P455k6661m5790M260N3827L9550j7264
17042A0161j4032R068m068l2404o4863m3168M280K2332J8962J4569M7463M0089
17030H389l0850k7994l8276n8570k6058P4902K5330l7635J3638m1992L7652L617
17018i7847m6510j6189M9194L7820j5146l2816L9826N1093L696j2048J0141l1251
17006f0037J3877l660j6682q502j4059k69J982K2633P7034M7246k5696n4085K7121
16993F903p3420n3087K5845M4957L0612j471k8990J5937l2324l9267j5979o13
$$ plain form
17078 15130 -14294 55114 92437 80879 101542 121155 170076 175779 127977 84926 62439 85391
17066 85391 94086 37660 -9275 49015 47452 42484 47231 2122 -54930 -104603 -80326 -60658
17054 -60658 -24688 -32192 -14268 -1784 -5216 2239 -24422 -70212 -65952 -12125 27425 10161
17042 10161 -3871 5197 1129 -31275 -96138 -139306 -135026 -112694 -93732 -79163 -31700 8389
17030 8389 -22461 -50455 -88731 -147301 -173359 -98457 -73127 -110762 -97124 -139116 -101464 -97847
17018 -97847 -144357 -160546 -111352 -73532 -88678 -121494 -81668 -30575 -26879 -38927 -28786 -60037
17006 -60037 -46160 -49820 -66502 -75004 -89063 -89332 -87350 -64717 12317 59563 33867 -20218 6903
16993 6903 -66517 -119604 -93759 -48802 -18190 -19661 -48651 -32714 -65038 -104305 -120284 -120897
16981a20897m1782k1781Q915J27052J3036l9273J4740m8266m740M8456L0655o7193
16969a01078M9120k1801J7630M5234j8442n3255r2413j6747M0634K0588O5330
16958f5200m1737k7430M8113L4704l9941N4789K8104l8678j6900j8862J461r2
16946h1669o6711K248L2198J2212O8594P668r5114n6261O6249K9104J9032k941
16934f5391K9974n594q81n0684K3510M2234m0185J237J2024m3777n3600m3583
16922a94716J8856O4143N2942p629j3495k7690K6448K1934j4430q265J3964o681
16910g4619r6739k5525L6429J0989J5240O2709P223J2673L0156o4088n0777j5973
16898a52302j5962p042P2566L6987K2211p3706k780M3482L6735m2741n4340M8676
$$ plain form
16981 -120897 -162679 -184460 -175545 -48493 -35457 -74730 -59990 -108256 -112996 -64540 -33885 -101078
16969 -101078 -51958 -73759 -56129 -10895 -29337 -82592 -175005 -191752 -151118 -130530 -65200
16958 -65200 -106937 -134367 -86254 -51550 -91491 -36702 -8598 -47276 -64176 -83038 -81577 -81669
16946 -81669 -148380 -146132 -113934 -101722 -33128 -25460 -120574 -176835 -110586 -81482 -62450 -65391
16934 -65391 -35417 -41011 -41892 -92576 -69066 -26832 -67017 -65780 -53756 -97533 -151133 -194716
16922 -194716 -175860 -111717 -58775 -66404 -79899 -107589 -81141 -59207 -73637 -81902 -67938 -74619
16910 -74619 -171358 -196883 -160454 -149465 -134225 -71516 -64293 -51620 -21464 -85552 -136329 -152302
16898 -152302 -168264 -175306 -102740 -65753 -43542 -117248 -120028 -76546 -39811 -82552 -136892 -88216
16886h8216j0692l6425M0474K9314j8271J7221O764K602j0553l1717J3414K0392
16874f5693j3747j5941J2056p3514m9335J1110J5027J748M0596k6059L2620O0379
16862g0753p2510j0041J6384K9281K2786L646o726j2478m5654N7433M2935l1794
16850g7491l829M5626N384m0906P4377M1532k1757k3897j8065l6732k5534j3174
16838i4466N3144j437l8491P206j1288p1864J5199L2335N5230M9849l694k6977
16826c5254J3684K962n1526m329J8586Q150m8742j2625M5067r357j4137j7807
16814a05328K2202P8405l0147o6415O708K0319M809O2027o1859j5331K1036k735
16802f6309j3395R253M4029R431k119m2314l7914R485J2616N2745N0191l702j4000
$$ plain form
16886 -88216 -98908 -135333 -94859 -65545 -83816 -66595 -59831 -57229 -67782 -99499 -86085 -65693
16874 -65693 -79440 -95381 -83325 -156839 -206174 -195064 -180037 -178289 -137693 -163752 -131132 -70753
16862 -70753 -143263 -153304 -136920 -107639 -84853 -81207 -87933 -100411 -146065 -88632 -45697 -77491
16850 -77491 -81320 -35694 -30310 -71216 3161 44693 22936 -961 -19026 -55758 -81292 -94466
16838 -94466 -41322 -42759 -81250 -74044 -85332 -157196 -141997 -109662 -54432 -4583 -8277 -35254
16826 -35254 -21570 -18608 -70134 -74463 -55877 -47727 -96469 -109094 -64027 -73384 -87521 -105328
16814 -105328 -83126 -4721 -34868 -101283 -94575 -74256 -69447 -7420 -69279 -84610 -63574 -66309
16802 -66309 -79704 -70451 -26422 -16991 -19110 -61424 -99338 -89853 -77237 -24492 25699 21997 7997
16789G997m8644n7681L8002j9980m938j0821L0110N8499N0057m417j5776p5333
16777e2925k8772l5902j3427R4721O7861L270n1389l0212L334l1485m6046M1360
16765g9612P742N996O2824m577p182k6921O938O0956j6828p0432l5012l6947J0634
16752a22421N360L1923l2972p318J3515q9331J8971P1876N8675J0273k3635J4455
16740e0629j5948l6678o186j1685J9712J8096J0919J2161p462R2444k335j14419
16728i2010q1300J8335r326O3728R2252K8747o2738q4378l4870L6664N5942L3728
16716c5226l429j4623j7128k8927J7521n7599J8255J2252l499n5449Q028N5749
16704a04075L1744O2677L7167j7657O46M61l8789j3262k2578K8146K860j8407
$$ plain form
16789 7997 -40647 -98328 -60326 -80306 -85244 -96065 -65955 -7456 42601 38184 22408 -52925
16777 -52925 -81697 -117599 -131026 -36305 31556 34826 -16563 -46775 -43441 -74926 -120972 -79612
16765 -79612 -71870 -65874 -3050 -7627 -14809 -41730 -34792 26164 9336 -61096 -96108 -133055 -122421
16752 -122421 -117061 -85138 -118110 -125428 -111913 -201244 -182273 -110397 -51722 -41449 -65084 -50629
16740 -50629 -66577 -103255 -109441 -121126 -101414 -83318 -72399 -60238 -67700 24744 22409 -92010
16728 -92010 -173310 -154975 -164301 -100573 -8321 20426 -42312 -126690 -161560 -124896 -68954 -35226
16716 -35226 -38655 -53278 -70406 -99333 -81812 -139411 -121156 -108904 -112403 -167852 -159824 -104075
16704 -104075 -72331 -9654 27513 9856 10502 10963 -27826 -41088 -63666 -35520 -32660 -51067
16692e1067J9713j3802L8599o2088m4203K1843o9617l0319N7808J5921m0397R885
16680a47724P7380N9456M8680m1489n8499n940m4331j3716L6867K2649L3867n563
16668c8363o901M2113l8364P195m4955n5905K8355M6591j4685J619k0036j4822
16656a08158K6557L8215R3611L6827n8193o3356K8060N9280m4347m5779M255K8333
16644d695J3821o0077n8754P1485N6515m0033J0256q960k1391L512L2690J1432
16632E801j5058n3196k3443j3576l966L1794K7765M652m6035K4686K3485M0368
16620C277L7376j9534n4069J0285o348o9766o373j1693N79L8796N9377n812Q832
16607a5073l5678j7014m9985m7812J01790m380O626O3546J1614k7792p81p0169
$$ plain form
16692 -51067 -31354 -45156 -6557 -68645 -112848 -91005 -160622 -190941 -133133 -117212 -157609 -147724
16680 -147724 -70344 -10888 37792 -3697 -62196 -68136 -112467 -126183 -89316 -66667 -32800 -38363
16668 -38363 -45264 -3151 -41515 -34320 -79275 -135180 -106825 -60234 -74919 -73300 -93336 -108158
16656 -108158 -81601 -43386 50225 87052 28859 -34497 -6437 52843 8496 -37283 -33028 -4695
16644 -4695 9126 -50951 -109705 -38220 18295 -21738 -11482 -20442 -41833 -38321 -5631 5801
16632 5801 -9257 -62453 -85896 -99472 -103438 -71644 -43879 -39227 -85262 -60576 -37091 3277
16620 3277 40653 21119 -32950 -22665 -29013 -98779 -105152 -116845 -116266 -77470 -18093 -23905 -15073
16607 -15073 -50751 -67765 -117750 -165562 -63772 -68152 -61526 2020 13634 -14158 -14939 -85108
16595h5108P877R553L5692K7410j9097p1359K5853L8171K6565L770l3918J8869
16583a5722L8712L8533k7465k7643o9502j3201j7975O9687J8903k2513q390l5814
16571g2390j3385k489J8630j5624K289n9176l8986K5219O679J1320N4957Q8525
16559E569K7909J9765K0923l1911n6264l5410L8099L782l1207J9374q6053k8789
16547a34213J781O1176K9523l5626o3620k7658K795K6086N3926M7329L8236J9228
16535A8963l4946l9194m0642j18M1137j8497P808P7075L3708k7667p3249k5772
16523h1394L8507J2647j9133q7889o0337j7460M729L8105j3489J950J5085P7159
16511i1520j0250m5037P904J2536K7632j3195k1587n076J8219m5919J3276Q22
$$ plain form
16595 -85108 -77231 -67678 -31986 -4576 -23673 -95032 -69179 -31008 -4443 -673 -34591 -15722
16583 -15722 22990 61523 34058 6415 -63087 -76288 -94263 -24576 -5673 -28186 -36576 -72390
16571 -72390 -85775 -88264 -69634 -85258 -82969 -142145 -181131 -155912 -149233 -137913 -82956 5569
16559 5569 33478 53243 74166 42255 -14009 -49419 -11320 -7538 -38745 -19371 -105424 -134213
16547 -134213 -132432 -71256 -41733 -77359 -140979 -168637 -165842 -139756 -85830 -38501 -265 18963
16535 18963 -15983 -55177 -95819 -95937 -54800 -73297 -65489 11586 45294 17627 -55622 -81394
16523 -81394 -42887 -30240 -49373 -137262 -197599 -215059 -210330 -172225 -185714 -183764 -168679 -91520
16511 -91520 -101770 -146807 -138903 -126367 -98735 -111930 -133517 -138593 -120374 -166293 -153017 -152195
16499a52195n705N8806K0662k9804m2477n105O4853K1244k8240J9947K2164n558
16487f1408L4880n3845K533J519K9339k8104l1541M4754m717r936R903L4176m5621
16474g8068l2395r589k894M7591J4818l785L306m9028o4114l2317P3464N8731
16462g4280K6833p1678l2891K1004k7857k288p654M0189K4045l5227n0869N3841
16450a36832L1087O4437R2135J6885j31681p0266j2631K0078k5184j7035J05029
16439f3978Q6424J6007o4579K691n507q2939j1166R1711P6690j2667j4785j0403
16427G499n6540l4964k1440l5648N4896N6286m359j6525n0099k4374m1227m7018
16415b13513l0046K2578K1144P7906O9124m6981J1667R080K0074o667J4135J1162
$$ plain form
16499 -152195 -157900 -99094 -78432 -108236 -150713 -155818 -90965 -69721 -97961 -78014 -55850 -61408
16487 -61408 -26528 -80373 -77840 -76321 -46982 -75086 -106627 -61873 -66590 -76526 -66623 -32447 -78068
16474 -78068 -110463 -120052 -122946 -75355 -60537 -64322 -61016 -110044 -174158 -206475 -133011 -74280
16462 -74280 -47447 -119125 -152016 -131012 -158869 -161157 -168811 -128622 -104577 -139804 -190673 -136832
16450 -136832 -105745 -41308 50827 67712 -63969 -134235 -146866 -126788 -151972 -169007 -63978
16439 -63978 22446 38453 -26126 -23435 -28942 -111881 -123047 -31336 45354 32687 17902 7499
16427 7499 -49041 -84005 -105445 -141093 -86197 -29911 -34270 -50795 -100894 -125268 -166495 -213513
16415 -213513 -243559 -220981 -199837 -121931 -52807 -99788 -88121 -79041 -58967 -65634 -51499 -40337
16403d0337Q138M690M053l9381p7619K8679O4879j0998m3735l656K5717K4783
16391e4787N1476K5940N1931M339l514j0727n2685m5343l5116k5869j6091N3413
16379e7033m6494l1921M9987J563k0353n587P6796L8369n0628m6856M0279j2536
16367f4414O913J9718O8273j5327p4749k285K15J4735q571k1370J0267J6663M970
16354d4962j3225m2744r168m2341l6072j2333K7580K7378L1794j6571k7394O0688
16342i7370M2593K6539l6986n0325Q7835M5610l5879n7631J4187k3387q5406k5979
16330a96199N9321M0703J700m802J0640K500L4896k5826J2691L5580L5418K9519
16318C6141l1965r0731l4087j5798j2356L0809Q9438K7572J7462l7755m5956j0269
$$ plain form
16403 -40337 -32199 -27509 -23456 -62837 -140456 -111777 -46898 -57896 -101631 -105287 -79570 -54787
16391 -54787 -3311 22629 74560 78899 75385 64658 11973 -33370 -68486 -94355 -110446 -57033
16379 -57033 -103527 -135448 -85461 -83898 -104251 -109838 -33042 5327 -45301 -92157 -51878 -64414
16367 -64414 -57501 -37783 30490 15163 -59586 -61871 -61656 -46921 -55492 -76862 -66595 -49932 -44962
16354 -44962 -58187 -100931 -110099 -152440 -188512 -200845 -173265 -145887 -114093 -130664 -158058 -97370
16342 -97370 -54777 -28238 -65224 -115549 -27714 17896 -17983 -75614 -61427 -84814 -170220 -196199
16330 -196199 -136878 -96175 -94475 -99277 -88637 -86137 -51241 -77067 -64376 -28796 6622 36141
16318 36141 4176 -86555 -120642 -136440 -148796 -117987 -28549 -977 16485 -21270 -67226 -77495
16306g7495Q873L5120k7371K2114K4468J0047m8083p5725j4752M1932O7511R2207
16294E8846j3858m9419n2678l4477K1027j8551K1110j7059k7942N0941p621m1078
16282a10759Q577p881j1715N0645M3213p375j2937o440m4375M1795q243o4137
16270a29632j287j5080J0395L8543M4019N782N246L1732k6914r5151N4830K6965
16258e0552M797l0193l2291M0769M5935r524k2688q4241L283N3157j387p679K9438
16245f1176J2993K297q1756l1662n688M9708n975k6057P63O4403k8319k9951J2729
16232a27691M782J4220P0539j0494n8941J9277j597l0872j5674K2596O5126M6816
16220a913k7874q107J3716M776K3350n3402o8656o0841K9704j4600K4828N0998
$$ plain form
16306 -77495 -68622 -33502 -60873 -38759 -14291 -4244 -52327 -128052 -142804 -100872 -33361 58846
16294 58846 44988 -4431 -57109 -91586 -70559 -89110 -68000 -85059 -113001 -62060 -69681 -110759
16282 -110759 -102182 -110063 -121778 -71133 -27920 -35295 -48232 -54672 -99047 -57252 -65495 -129632
16270 -129632 -130919 -145999 -135604 -97061 -53042 -47260 -42014 -10282 -37196 -132347 -77517 -50552
16258 -50552 -45755 -75948 -108239 -67470 -21535 -31059 -53747 -137988 -134705 -81548 -82935 -90614 -61176
16245 -61176 -48183 -45886 -127642 -159304 -164992 -115284 -121259 -147316 -146553 -82150 -110469 -140420 -127691
16232 -127691 -122909 -108689 -38150 -48644 -107585 -88308 -89905 -120777 -136451 -113855 -48729 -1913
16220 -1913 -29787 -37894 -24178 -19402 3948 -49454 -118110 -178951 -149247 -163847 -139019 -88021
16208h8021j1380L7099k1999k3046j4369J5589K3965j3165J791R5277L6694l1065
16196G370J502J3854l8640k3692k4900k3447Q5846M078l0042j4033k0866j9902
16184h2872N4605O1757K5145J8760p7133o4029M3085K9479J0123m3765n756L5895
16172E294Q253K7538k8463n6353K4692L2560M758o4824l4833J433o5038k2390
16160a67373K917J0464N8007O5052k7486l3450k5880O1163N8043l667P038k3723
16148a8895j984m462J6730L9136M426n0492n846l831k6892K4313j6805O215M5735
16135G348m587K671J6531L9839M3224r3196j7091l424l1657m7265L096K6628k5815
16122h3698K0890Q3061m8234o4806O847J3421L5792l2761m6726N742N762k9772
$$ plain form
16208 -88021 -99401 -62302 -84301 -107347 -121716 -106127 -82162 -95327 -93536 1741 38435 7370
16196 7370 8872 22726 -15914 -39606 -64506 -87953 -2107 1971 -28071 -42104 -62970 -82872
16184 -82872 -28267 33490 58635 77395 262 -63767 -20682 8797 18920 -24845 -30601 5294
16172 5294 13547 41085 12622 -43731 -19039 13521 18279 -46545 -81378 -79945 -144983 -167373
16160 -167373 -164456 -153992 -95985 -30933 -58419 -91869 -117749 -56586 1457 -2210 4828 -18895
16148 -18895 -20879 -25341 -8611 30525 34951 -15541 -21387 -25218 -52110 -27797 -44602 -38387 7348
16135 7348 2761 5432 21963 61802 105026 11830 -5261 -8685 -40342 -87607 -84511 -57883 -83698
16122 -83698 -62808 20253 -27981 -92787 -85940 -72519 -36727 -69488 -116214 -110472 -104710 -134482
16110a34482N8253L473j3699j5904L1102m664m5575k0390o7166Q5880J18729O3175
16098E8732m7513n3611P9919m9910o7830m9063j3934P384J6538J5548j61O427
16086i7474R751j0847p7545K3399Q8176o883l5077j0471K2953Q506R2513m3723
16074c6722l1360o789m4568J7322P4783P8485n4520l4737L89K0010K7223R333
16062A8849J0352n943l3160q075M4671Q592l7854N6565m9613j3782l1434j0857
16050e1689J0753l8036n8496k752n1040J7525L9831J3320K0707N7103r599k8862
16038h1235k4529K4844L3701J5110L8817Q806L5460Q611j4649l5900m1387m056
16026c6407m2700m4053L9698L9911J7395K949n163k2084O5014Q355p2359l8890
$$ plain form
16110 -134482 -76229 -72756 -86455 -102359 -71257 -75921 -121496 -141886 -209052 -123172 -4443 58732
16098 58732 11219 -42392 37527 -12383 -80213 -129276 -143210 -135826 -119288 -103740 -103901 -97474
16086 -97474 -87723 -98570 -176115 -152716 -64540 -71423 -106500 -116971 -94018 -85512 7001 -36722
16074 -36722 -68082 -74871 -119439 -102117 -27334 51151 -3369 -38106 -37717 -17707 9516 18849
16062 18849 29201 23258 -9902 -17977 26694 35286 -2568 53997 4384 -9398 -40832 -51689
16050 -51689 -40936 -78972 -137468 -140220 -191260 -173735 -133904 -120584 -99877 -42774 -52373 -81235
16038 -81235 -105764 -80920 -47219 -32109 6708 15514 50974 59585 44936 9036 -32351 -36407
16026 -36407 -79107 -123160 -83462 -43551 -26156 -23207 -28370 -50454 14560 22915 -49444 -88334
16014h8334K3864M7030P866q266q3218K1503N5029L3975l787k1874J7629j3347
16002a1930K2160L1159J5625l3336k0579K2697J8014k9653l6452k2018l5344j9117
15990i8774L6737k3843k04Q1842p492p5857J0544Q6588m4528k7891K8642l3798
15978f8034l1375K5045k9504O319J0824K8100J3263o9432M732j5912l4263K1047
15966a39190M3480K4378p241L3434k9742l6627l5609K2687j252O9049P1676J2596
15954B7639k4676M4416K9212k3827k8676N928l1568j0062q8403m2005r655L8905
15942a12772M6878J4941K9282l7041m6567l3387m9806K7653M2236N5955m230O3571
15930c287J7340k1180o9381j6669k3262M3680L7254m738J1834K0268j6620l3846
$$ plain form
16014 -88334 -64470 -17440 -9574 -17840 -101058 -79555 -24526 9449 5662 -16212 1417 -11930
16002 -11930 10230 41389 57014 23678 3099 25796 43810 14157 -22295 -44313 -79657 -98774
15990 -98774 -62037 -85880 -86084 -4242 -11734 -87591 -77047 9541 -34987 -62878 -34236 -68034
15978 -68034 -99409 -74364 -103868 -97549 -86725 -58625 -45362 -114794 -110062 -125974 -160237 -139190
15966 -139190 -95710 -71332 -78573 -45139 -74881 -111508 -147117 -124430 -125682 -56633 15043 27639
15954 27639 2963 47379 76591 52764 24088 30016 -1552 -11614 -100017 -142022 -151677 -112772
15942 -112772 -65894 -50953 -21671 -58712 -105279 -138666 -188472 -160819 -118583 -62628 -66858 -3287
15930 -3287 14053 -7127 -76508 -93177 -116439 -72759 -35505 -40243 -28409 -8141 -24761 -58607
15918e8607J2422K4287j4002l4484j4585L1029K115j5538K7422P809n633K5221
15906a2544j2356j8835L4588k9152k0064K8722J09487o765p9884m8954j403L5505
15894b1655J05512p68l2416r2132m0817K2210O4552o2011m691L3924R050o751
15882b5993j967K8984L5651K986k024Q023q1399L1585L3597k4336l3936j0104
15870c8933M8064j243l4169j0110m3969n592K6894k2822k3995N800j398q123n457
15857a15053m674L3186j0517o987M1460L6959N8458m018k7407l1033j1635J1991
15845b9270P977L4351K9017n5389r930n8935o764k6240J9845K7335q485L4748
15833d1740Q3039j3109m7069l9079k3356j2674l1262j8100J8141M7031K6877M6
$$ plain form
15918 -58607 -46185 -21898 -35900 -70384 -84969 -53940 -51825 -67363 -39941 -32132 -37765 -12544
15906 -12544 -24900 -43735 -9147 -38299 -58363 -29641 79846 73081 -6803 -55757 -57160 -21655
15894 -21655 83857 83089 50673 -41459 -82276 -60066 4486 -57525 -62216 -28292 -19242 -25993
15882 -25993 -27960 1024 36675 39661 37637 45660 -35739 -4154 29443 5107 -28829 -38933
15870 -38933 9131 7888 -26281 -36391 -80360 -85952 -59058 -81880 -105875 -100075 -101473 -109596 -115053
15857 -115053 -119727 -86541 -97058 -104045 -62585 -25626 32832 28814 1407 -29626 -41261 -29270
15845 -29270 -21293 13058 42075 -13314 -23244 -82179 -88943 -115183 -95338 -68003 -76488 -41740
15833 -41740 41299 28190 -18879 -57958 -81314 -93988 -125250 -143350 -125209 -78178 -51301 -51255
15821e1255l1675m9630j2029J1592K6325J1680k6565L0450r810j2445P0157M7547
15809D342j1490K2923r4l8438J1250k1781J7683n8343k4210j745L1005N2068M3926
15796B7096L9689p6055m3549M1331J9113m4013j1297j6337j7601r529j7178P2727
15784c5603J4831q1747m6798l006N5438K5297j7783q993N5022L5089L1896j1312
15772A2331q4017l0769m890P222k6579j1661L0057L2166k2072m8317k1258K449
15760a65338n7254J9304N2524L696O2685j1293k9069K3556K829M7808N2682Q7139
15748H9269j3517o2150m4551l2196L263N0279j467K4894N3825L0282j7741r1056
15736a0866m9138J2266j8089j2040M004O057j6201j2834P6354K6465J6964k4974
$$ plain form
15821 -51255 -82930 -132560 -144589 -132997 -106672 -94992 -121557 -91107 -100917 -113362 -43205 4342
15809 4342 -7148 15775 15681 -22757 -11507 -33288 -15605 -73948 -98158 -99903 -68898 -16830 27096
15796 27096 66785 -9270 -52819 -11488 7625 -36388 -47685 -64022 -81623 -91152 -108330 -35603
15784 -35603 -20772 -102519 -149317 -152323 -96885 -71588 -89371 -98364 -43342 -8253 23643 12331
15772 12331 -71686 -102455 -107345 -100123 -126702 -138363 -108306 -76140 -98212 -146529 -167787 -165338
15760 -165338 -222592 -203288 -150764 -147068 -84383 -95676 -124745 -101189 -98360 -50552 2130 89269
15748 89269 75752 13602 -30949 -63145 -59882 -9603 -11070 13824 67649 97931 80190 -10866
15736 -10866 -60004 -47738 -65827 -77867 -73863 -67806 -84007 -96841 -20487 5978 22942 -2032
15724b032p3721l2457K1970M6424L004J9663K3613j6734m843J2915K4090l5885
15712a3993o9397k2474R0596N1743Q866j02570R492J6662N1633K5908n5189J0545
15700A822Q9704p920l8596k6417R569r332o3549l9573L8593L1617J6190k4199
15688b2091p099K1802K8391J3250Q036j9807m0223j4454o0853l5848P975K6300
15676i4621L0056M1254K349l1433p955m1709k7230N0877O8550J4811r0439j4366
15664i9856J05725M0572k7895k1016p2167l8741O117J0981M4898J3269o344k3702
15652f8159k9135k563J1539L7351j652K292m4040M4502M194r615m3608N9223L4840
15639d831l9313p6760o901k3253k511R059j7480J0874P8725m411n403J1569M364
$$ plain form
15724 -2032 -75753 -108210 -86240 -39816 -36812 -17149 6464 -10270 -15113 -2198 21892 -13993
15712 -13993 -83390 -105864 -15268 36475 45341 -57229 -47737 -31075 20558 46466 -8723 1822
15700 1822 91526 83606 45010 18593 28162 18830 -44719 -84292 -45699 -14082 2108 -22091
15688 -22091 -29190 -7388 21003 34253 42289 22482 -17741 -32195 -93048 -128896 -120921 -94621
15676 -94621 -64565 -23311 -20962 -52395 -60350 -102059 -129289 -78412 -9862 4949 -85490 -99856
15664 -99856 5869 46441 18546 -2470 -74637 -113378 -107261 -96280 -51382 -38113 -44457 -68159
15652 -68159 -97294 -99857 -88318 -50967 -52619 -50327 -94367 -49865 -45671 -55286 -98894 -39671 -4831
15639 -4831 -44144 -120904 -127805 -151058 -153569 -144510 -161990 -151116 -72391 -76802 -82205 -70636 -66272
15626f6272M0086O1665J0719n5511p2257N1325J9520j4297k7053l3787k830K1660
15614f7032N9126P2995L420J3912k3885m2283p964m3953m1912L0308N2920K0520
15602B6172L1166K5733j7473l7276l1076k9210n9591J9145j2466L7462J2878o2223
15590i6759j9295M7032M8020n952k9120M3285L0205N376J9593j8552M6711K1977
15578I2521n4014m8969m1566K3416K6377l2818l6832J8869N8829K4688m0542l866
15566a3907m1574K1743o460o648L4070R4393l825p5399k5701m184J47K894L7867
15553A3416m434m988L9237K6127k4970q970m8809r235q326k9002o1903m4315R501
15540a56671N6432j7075P5895k5572j0946L2709L6728J1038k1394n6996K4519
$$ plain form
15626 -66272 -26186 35479 46198 -9313 -81570 -30245 -10725 -25022 -52075 -85862 -88692 -67032
15614 -67032 -7906 65089 68509 82421 58536 16253 8289 -35664 -77576 -47268 5652 26172
15602 26172 57338 83071 65598 28322 -2754 -31964 -91555 -72410 -84876 -47414 -34536 -96759
15590 -96759 -116054 -69022 -21002 -26954 -56074 -12789 17416 22792 42385 23833 70544 92521
15578 92521 38507 -10462 -52028 -28612 -2235 -35053 -71885 -53016 5813 30501 -10041 -13907
15566 -13907 -55481 -33738 -40198 -46846 -12776 81617 77792 2393 -23308 -27492 -27345 -24451 13416
15553 13416 8982 3994 43231 69358 44388 35418 -13391 -22626 -30952 -59954 -121857 -166172 -156671
15540 -156671 -100239 -117314 -41419 -66991 -77937 -45228 -8500 2538 -18856 -75852 -51333
15529e1333L3845J944O506j8537J1564L6860K0481L7576N509k3479j5541m7841
15517b446m6060j4775o6211N204l201M504Q431l181P6959Q4315N542J4492q2157
15504a8584L935N3071n3845m1664j1476J8402K0681m2375j5482J2181J06136P1918
15492A02898o5859l748l2877j487J4606K7760J4105j5921n305j7929n3723j7531
15480e5011K0550k0559k3559K4325J8560o0603L4942J1233J0433O0389M913l0941
15468e328J9446J3796k7260p848p2131n6045K4210Q5199L3907l0088j1139L8180
15456D899K9434n3843L1417K4783l9043n3862m4442P2733P4826m6800o2619M1018
15444b1499N6338o7927n7750Q0914R6706N909l9693n0825R716j758M783K8388
$$ plain form
15529 -51333 -17488 -15544 -9038 -27575 -16011 20849 41330 78906 84415 60936 45395 -2446
15517 -2446 -48506 -63281 -129492 -124288 -127489 -122985 -114554 -117735 -40776 43539 49081 63573 -18584
15504 -18584 -14649 38422 -15423 -57087 -68563 -50161 -29480 -71855 -87337 -75156 30980 102898
15492 102898 37039 33291 414 -1073 13533 41293 55398 39477 34172 16243 -37480 -55011
15480 -55011 -34461 -55020 -78579 -54254 -35694 -96297 -61355 -50122 -39689 20700 25613 -5328
15468 -5328 14118 27914 654 -7194 -79325 -135370 -111160 -25961 7946 -22142 -33281 4899
15456 4899 34333 -19510 11907 36690 -2353 -56215 -100657 -27924 46902 102 -62517 -21499
15444 -21499 34839 -33088 -90838 -9924 86782 92691 52998 2173 11889 10131 14914 43302
15432D3302k1890o7895p102M7446j7631M3725J8457k0663o2639l0854o8730K7744
15420a16730J4573L542O693L753O2371L2574j5599m3135O106J1687n6204J2887
15408g7482q60J9147L4280l4601Q1050M2953k0430l9824m8693m162K4493l298
15396b7427n7523M7877P6709L4659R059L8439j2594q5043m6777R547p5447o6029
15384a54550N7854N4413J6659m6211j8818K0810m7079N5000O2127J6806P675k1889
15372B797o19j7454q0806N110K9201j1499k64O936J5242M224l1404l879P9234
15359c181J9318m044L6171L182k9056j9688k6184o639j6547l9613j545L0070O0638
15346B882K556J079n0491l4200O2627O257K0853j3366l65k559M0213j4949P2507
$$ plain form
15432 43302 21412 -46483 -53585 -6139 -23770 19955 38412 17749 -44890 -75744 -144474 -116730
15420 -116730 -102157 -98615 -91922 -88169 -25798 6776 -8823 -51958 -45852 -34165 -90369 -77482
15408 -77482 -78342 -59195 -24915 -59516 21534 64487 44057 4233 -44460 -48622 -24129 -27427
15396 -27427 -84950 -37073 39636 74295 83354 121793 109199 24156 -22621 -13074 -88521 -154550
15384 -154550 -96696 -42283 -25624 -71835 -90653 -69843 -116922 -61922 205 17011 24686 2797
15372 2797 2178 -15276 -96082 -90972 -61771 -73270 -73534 -66598 -51356 -47132 -78536 -82415 -3181
15359 -3181 16137 12093 48264 51446 22390 2702 -23482 -30121 -46668 -86281 -87826 -57756 2882
15346 2882 5438 6517 -43974 -78174 -15547 -9290 11563 -1803 -2168 -4727 35486 20537 93044
15333I3044K48q0258M7288M275M8248M0619N8110L4488L9941O5485o330L5363
15321C80521Q9421N3256J5558R3351R6046P1367J25933J39859L1651R6400O7697
15310A261060L5159j6371n2309q2356q0852j23699q8040q3852j34678q2204r2216
15299D59642m7405k2991o2799k7919o6035q4966j2554k2087j9002k437K9124J5577
15287A36148J7918K0023o9795m9021J7263r66N6247K5864l1535P314O683j6325
15275A19818L165k329p8392Q235M2811j0689o132N4122M3220o9650r0257p393
15263F529K0719J0206P284J9646K9456k6047o5845L2058L8363k7050q784m3859
15251g324p1187m1881J6134N8066R969J8269J561J368M4695P5890l6351o6869
$$ plain form
15333 93044 93292 13034 60322 64597 112845 153464 211574 246062 286003 351488 345158 380521
15321 380521 469942 523198 538756 632107 728153 799520 925453 1065312 1096963 1193363 1261060
15310 1261060 1296219 1279848 1227539 1145183 1064331 940632 852592 768740 634062 551858 459642
15299 459642 412237 389246 326447 298528 232493 147527 134973 112886 93884 91447 120571 136148
15287 136148 154066 174089 104294 55273 72536 71570 127817 153681 122146 129460 136143 119818
15275 119818 122983 120654 42262 50497 93308 82619 76487 130609 173829 104179 13922 6529
15263 6529 27248 37454 44738 64384 93840 67793 1948 34006 72369 45319 36535 -7324
15251 -7324 -78511 -120392 -104258 -46192 -36223 -17954 -16393 -15025 29670 105560 69209 2340
15239B340l7910L4045K6876M496j74K0734k522K1561J8670k6869m5380K1128L1728
15226F8723l081l6997n4631M648n5858l4156K5987L7383k2257r974Q6018P15J1551
15213A8071P1235K6349k3485q2133l0234m60j5241K5432k0821M8152l0942m2344
15201e6421J582n2154k6627K7566P9164N4233L0323k2523m1605l0414N1651L8024
15189E2799n7119k3009J8238l4018K545O426K5294K5671J1348l1676K1814O1751
15177H0064R476P477n013j4635l6676k4982J6860J2517K7896k3596l8838k2889
15165a2339K6198N6853O71K7199J0087l4049l1538j1576J9604j839m3659M5263
15153E0875L5259q047J0500l2608n6088K6433P366M198M320L1839R079j0027L4478
$$ plain form
15239 2340 -35570 -1525 25351 29847 29673 50407 47885 69446 88116 61247 15867 36995 68723
15226 68723 65642 28645 -25986 -21338 -77196 -111352 -85365 -47982 -70239 -80213 5805 6520 18071
15213 18071 89306 115655 92170 10037 -20197 -20657 -35898 -10466 -31287 16865 -14077 -56421
15201 -56421 -54839 -106993 -133620 -106054 -26890 27343 57666 35143 -6462 -36876 14775 52799
15189 52799 -4320 -27329 -9091 -43109 -40564 -34138 -8844 16827 28175 -3501 18313 80064
15177 80064 89540 97017 92004 77369 40693 15711 32571 45088 72984 49388 10550 -12339
15165 -12339 13859 70712 71383 98582 108669 74620 43082 31506 51110 49271 5612 50875
15153 50875 86134 78087 88587 55979 -109 26324 33690 37888 42208 74047 83126 73099 107577
15140A07577k05n5385q934m372n966l8303j7698k8669L1362M8232r997K6105m4089
15127c42J4521O3916l0990J0904J1044L6227n418o642j8679N760m21J0323M7195
15114A37398J7996n255O3069L7457m1178p1227M9010J02230l268j7584p7294j3231
15102A78123J059n7529J2444j4308Q18P1035j0665o6233j5895J9802j4329k9093
15090G5229k5016L238O8461J8912j7252k9558k7577k088l0794M2312J5233L8295
15078A29395k5336k4836J9287M8930N630k2276k0103m1895J6153J0574p783l1687
15066E6053j4143O9902J2475J5749j2069L504k2474O2373j7657q9982k1871Q0805
15054A22665O3271K094N94o492j5223Q51k4438j6576j2050N8763L4212n1969K7214
$$ plain form
15140 107577 107372 51987 43053 38681 32715 -5588 -23286 -51955 -20593 27639 17642 43747 -342
15127 -342 14179 78095 47105 58009 69053 105280 99862 93220 74541 80301 79880 90203 137398
15114 137398 155394 150139 213208 250665 209487 138260 187270 289500 286232 268648 191354 178123
15102 178123 179182 121653 134097 119789 120607 191642 180977 114744 98849 118651 104322 75229
15090 75229 50213 53451 121912 140824 123572 94014 66437 64349 33555 75867 91100 129395
15078 129395 104059 79223 98510 147440 153070 130794 110691 68796 84949 95523 87740 56053
15066 56053 41910 111812 124287 140036 127967 131471 108997 171370 153713 63731 41860 122665
15054 122665 185936 188030 188624 182132 166909 167760 143322 126746 114696 173459 207671 155702 182916
15041A82916N7629J0281o5450r0594K3927L8314o859j3288l3965p9552m9008N0663
15029B5014N0415O1270l1383m643K2217N171M66l5958O1732K140L9567R462l8777
15016A66693n4109l4242L2315Q0998r876o527M2989M0629o9784m2127K0667N9685
15004B27311K1758n6329p359j5453K92N1395L5702l6415k9301k274j6790N5363
14992B27900n64K7862N5405K2054K6733j2827l8053j091J0788k3141p4181q2264
14980A38621J2951L326l806L2357Q096M2982P699N1955L7662k2907n1883O5868
14968C22921J4698j9154j6057M8978K1368k2026M2787J006P209K7939K2683p0821
14956C81531k2232J3343K3222M2546k3496k9273K3892j5223K2471N8821L1152
$$ plain form
15041 182916 240545 250826 185376 94782 118709 157023 150164 136876 102911 23359 -25649 25014
15029 25014 75429 136699 105316 100673 122890 128061 128527 92569 154301 156441 196008 205470 166693
15016 166693 112584 78342 110657 191655 181779 175252 218241 258870 189086 146959 167626 227311
15004 227311 249069 192740 185381 169928 170220 221615 257317 220902 191601 189327 172537 227900
14992 227900 227336 255198 310603 332657 359390 346563 308510 307419 318207 295066 220885 138621
14980 138621 151572 154898 151092 183449 191545 234527 242226 294181 331843 308936 257053 322921
14968 322921 337619 318465 302408 351386 372754 350728 393515 394521 401730 429669 452352 381531
14956 381531 359299 372642 395864 438410 414914 385641 409533 394310 416781 475602 506754
14945E06754m5814o890P694O659L1481M5219l919M6994L9975k9575R944O6129
14933F74651M1618K1108M1262P9966k223Q565K5155L3892j5911J537O2151M2912
14921A014683k0820M5582J1875L7950O3906K0329M0480Q6071M5911J05920L8086
14910A489973J16803Q4759M4685N3219Q5653N0056Q6429J33494K1217O2809R7060
14899B326157Q5666P7010J15099J13009J52316J57259J74401J49879K07876K21099
14889C779771J76540L00165L46441L09779L34637M09568M81157M45426N18356
14880G101840N94547P12874Q30320J024492J145125J328935J616076J893409K276449
14871A8524067K664774L224428L767615M484572N562040O955152Q818708J1315955
$$ plain form
14945 506754 460940 454050 461744 468403 499884 545103 541184 588178 628153 598578 608522 674651
14933 674651 716269 737377 778639 858605 856382 864947 890102 923994 908083 909620 971771 1014683
14921 1014683 993863 1039445 1051320 1089270 1153176 1173505 1213985 1300056 1345967 1451887 1489973
14910 1489973 1606776 1691535 1736220 1789439 1875092 1925148 2011577 2145071 2166288 2229097 2326157
14899 2326157 2411823 2488833 2603932 2716941 2869257 3026516 3200917 3350796 3558672 3779771
14889 3779771 3956311 4256476 4602917 4912696 5247333 5656901 6138058 6583484 7101840
14880 7101840 7696387 8409261 9239581 10264073 11409198 12738133 14354209 16247618 18524067
14871 18524067 21188841 24413269 28180884 32665456 38227496 45182648 54001356 65317311
14863F5317311J4552373J8486159K2726690K6493783K8999552K9881909K8673959
14856B35131736K5131000J9347464J1767033K748014o480761j4834273k1538471
14849B51271742k6051770k8602368k8906769k7328913k4375064k0680855j6818608
14842G8507395j3222514j0344270q153037o584741n411488m505615l796188l224731
14834B3264811k761059k382821j986871j672372j385467j204471j041664r25303
14826I904783q00469o36281o23068n33038m69419m17090l83291l52663k84745
14817E404719k77432k34167j61309j38664r9281r293M0187J9246M2467O2673J56221
14806D805367R9293k5997k9356j18072j11743j94323l28477l19462k94114k60353
$$ plain form
14863 65317311 79869684 98355843 121082533 147576316 176575868 206457777 235131736
14856 235131736 260262736 279610200 291377233 294125247 287644486 272810213 251271742
14849 251271742 225219972 196617604 167710835 140381922 116006858 95326003 78507395
14842 78507395 65284881 54940611 46787574 40202833 34791345 30285730 26489542 23264811
14834 23264811 20503752 18120931 16134060 14461688 13076221 11871750 10830086 9904783
14826 9904783 9104314 8468033 7844965 7311927 6842508 6425418 6042127 5689464 5404719
14817 5404719 5127287 4893120 4731811 4593147 4493866 4484573 4524760 4544006 4586473 4649146 4805367
14806 4805367 4904660 4878663 4849307 4731235 4619492 4425169 4096692 3777230 3483116 3222763
14796C222763l13598k90583k40088j71171j11922j48600r9292n8493r3309o3217
14786A632490o8854m1728q2018m2013l6809l4390p5639q5632j2027M169n3085
14775A104464j6406J0203O242J6589l3259j04653o2983p0571k9750M0123K9285
14764H89284p2061p4772J3108k550k1492j0696k3526n5230j5657Q890J4252j9781
14752F29769J6160m458j4064l2359L1622l5418l5386K3129L5901K7122p8830j0817
14740E52371J1282k6686K333J07490M5601J8757o0186o0308J9825k0488K5538
14729F15529J4759K5596J0625r5669o0624M4867P026j2227m7290q7488q6942n1763
14717B76399R284K1723j181K646J4877N4828j6347m5250k2206J3645K2891j7690
$$ plain form
14796 3222763 2909165 2618582 2378494 2207323 2095401 1946801 1847509 1789016 1695707 1632490
14786 1632490 1563636 1521908 1439890 1397877 1361068 1326678 1251039 1165407 1153380 1157549 1104464
14775 1104464 1088058 1098261 1104503 1121092 1087833 983180 920197 849626 819876 859999 889284
14764 889284 817223 742451 755559 753009 731517 720821 697295 642065 626408 635298 649550 629769
14752 629769 645929 641471 627407 595048 626670 591252 555866 578995 614896 642018 563188 552371
14740 552371 563653 536967 539300 646790 692391 711148 650962 590654 610479 589991 615529
14729 615529 630288 655884 666509 570840 510216 555083 562109 549882 502592 415104 328162 276399
14717 276399 285683 307406 306225 308871 323748 378576 362229 316979 294773 308418 331309 313619
14705C13619o6357k8814K1942k1843M3761L6571l2586k9430j2552l3666Q289L5017
14693B33951J1486l7542l2166P559R830J080L506j7210l8307n00k5951p74O3434
14680A78396q15m2100K215Q5491l9017k8110N7817M5692o2031l7010k9681j1560
14668A19287j0210j8402j2109L2400j7941q4622n455M8151L2728k9330l6024l447
14656A5026R0607P8034L3812k8816l9415q055n1643m8007Q587J3286M7234L7860
14644A48510Q7468j5096J1146K2878J2848K7003l4940k2463R954o5103n6110m0257
14632H5838j6660O3372j3827n3825j4518j936J6672N2419L6882N4265L4396m6741
14620A96337n4660o6507K0879L7178N6719q408m0639m3434l8255l506k0309L313
$$ plain form
14705 313619 247262 218448 240390 218547 262308 298879 266293 236863 224311 190645 198934 233951
14693 233951 245437 207895 175729 183288 193118 194198 197704 180494 142187 141687 115736 114962 178396
14680 178396 177581 135481 137696 223187 184170 156060 213877 259569 197538 160528 130847 119287
14668 119287 109077 90675 78566 110966 93025 8403 2948 51099 83827 54497 18473 15026
14656 15026 105633 183667 217479 188663 149248 141193 89550 41543 50130 63416 110650 148510
14644 148510 235978 220882 232028 254906 267754 294757 259817 237354 247308 182205 126095 85838
14632 85838 69178 132550 118723 64898 50380 48444 65116 117535 154417 208682 243078 196337
14620 196337 141677 75170 96049 133227 189946 181538 140899 97465 59210 55704 35395 38708
14608C8708O0813P6968M21j6575L9284J4542j659j4360j7804k2424p6542j3935
14596F7437l7653N1365L1180N909n8387k2310j6171j2959K5639O8227r401l4266
14584E8610j4178O3247Q5062L459o6394k0845M902k5170q9968j4782O6030M5060
14572I5033l9400n5150j2439L3792j0973J6708P6074Q607k4826J3184R180M713
14560A14503j5839k6638J5278k0612p0344k0655j0000L9852k3672j527R7966P611
14548H5923o2673l0543K0230q7818L3079L1386J8495N0779K4044L7336j8942n3086
14536D8210m4096M5883K9088n6231L6079n473m9796k0755L1301M1355j6138j8298
14524B1129r326O9623L4341j5474l8473J8331J2865k2314k3458J8906m9422k6341
$$ plain form
14608 38708 99521 176489 176910 160335 199619 214161 212502 198142 180338 157914 81372 67437
14596 67437 29784 81149 112329 118238 59851 37541 21370 8411 34050 102277 92876 58610
14584 58610 44432 107679 192741 196200 129806 108961 113863 88693 -1275 -16057 49973 95033
14572 95033 55633 483 -11956 21836 10863 27571 103645 112252 87426 100610 109790 114503
14560 114503 98664 72026 87304 66692 -3652 -24307 -34307 5545 -18127 -19654 78312 85923
14548 85923 23250 -7293 12937 -74881 -41802 -10416 8079 58858 82902 120238 101296 48210
14536 48210 4114 49997 79085 22854 58933 53460 3664 -17091 14210 55565 39427 21129
14524 21129 11803 81426 115767 100293 61820 80151 93016 70702 47244 66150 16728 -9613
14512i613J8381j255J5720L714m147J8449m2713J5867J7906k8607J7622L6594
14500E7918L3304j7781l335J1435R054L5133q954q1275q614r101K806K8130J3903
14487F2623k655L180l0471k6858N2982N1322l2082M423R954m2074m6980K3882
14475B7246P5505j4546n0521M1198J7811m6173n3155m0779J6039P0316L2113k6712
14463D8342m540j505j3951K5368L9190K0366o7441K658K5665L3338o173P395l3985
14450G4727L693o2643m133l0304j0688O1165L5360q5820l2794N3724M5459l0996
14438A6750J1635M6402l1054k427M6977k0491m109p526l8839m3236o444J0237
14426b2125J8974L4785M8450l5146k7868k5506j6056K492M7001J4576q526K4012
$$ plain form
14512 -9613 8768 7513 23233 26947 22800 41249 -1464 14403 32309 3702 21324 57918
14500 57918 91222 73441 70106 81541 90595 125728 116774 35499 26885 17784 20590 48720 62623
14487 62623 59968 63148 32677 5819 58801 110123 78041 82464 92418 50344 3364 27246
14475 27246 102751 88205 37684 78882 96693 50520 -2635 -43414 -27375 42941 75054 48342
14463 48342 43802 42297 28346 53714 92904 113270 45829 48487 74152 107490 101317 108712 74727
14450 74727 78420 15777 11644 -18660 -29348 31817 67177 -18643 -51437 2287 47746 16750
14438 16750 28385 74787 43733 41306 88283 67792 63683 56157 17318 -25918 -32362 -22125
14426 -22125 -3151 31634 80084 44938 17070 -8436 -24492 -22000 25001 39577 31051 55063
14414E5063M1910m638n2307k2916N8594O0167K3833l9484l355j7888J0426P7533
14402A86938P0310L7520L66R6065J20845O8987J14600J72076J05750Q2241Q9224
14391A144922J31920M0900n0488j6526j1460n1002p9261j26206j15643j11049
14381G56107o9808j30620p7860j3976l5178m6722r3631n6168k0226L7294J6755
14370B65967q5089N940l5622M2287K547j6104m8582m9151J2875J7702o0431o0950
14358h611L7515J06273r519r9506j18920Q009N9826O3212L3608o9354j7359L6360
14346B1534l362J9956K2075m6612p3663l1942O4773J13455O1006j8436o1904p4421
14334g541J8295j089r888J5396J0712k4899k5222N8163L7938k2286N3258k7994
$$ plain form
14414 55063 96973 92335 40028 17112 75706 135873 159706 120222 116867 98979 109405 186938
14402 186938 257248 294768 295134 391199 512044 581031 695631 867707 973457 1055698 1144922
14391 1144922 1276842 1317742 1267254 1250728 1239268 1188266 1109005 982799 867156 756107
14381 756107 686299 555679 477819 463843 428665 381943 288312 232144 211918 249212 265967
14370 265967 180878 186818 151196 193483 196030 179926 131344 82193 95068 112770 52339 -8611
14358 -8611 28904 135177 125658 26152 -92768 -84759 -24933 38279 71887 2533 -14826 21534
14346 21534 18172 38128 60203 13591 -60072 -92014 -27241 86214 147220 128784 66880 -7541
14334 -7541 10754 9665 -223 15173 25885 986 -24236 33927 71865 49579 102837 74843
14322G4843m0985J5303K6025K8348m6889m5765J8052K7227P789l2464J3959K0047
14310F5490n5549l6756J7296L4636K3099J4584p1980l888k3883O475p649K6375
14298a1750J3645j8177j7885M0108k1156L603M0512K7026L7901k6180J7043K400
14286H7090j4860m8196k827k3516J354L7117O06o5912K9600J00146l7112j12860
14274d9370j8487N4169M2425L3482R508J9967K737L882m6782m4232J3422K0217
14262D0938K1806K5351n6432k0002J3122j7720K8210K0330j7362M608k644Q832
14250D9037Q942o6446o7992O1396J8810k1724k3160q453j9783r727L6722K897
14238c9481p563P8342K0386n5328o6933q936N8195L6427O973K6973l7343m8712
$$ plain form
14322 74843 33858 49161 75186 103534 56645 10880 28932 56159 63948 31484 45443 65490
14310 65490 9941 -26815 -9519 25117 48216 62800 -9180 -13068 -36951 -30476 -38125 -11750
14298 -11750 1895 -16282 -34167 5941 -15215 -11612 28900 55926 93827 67647 84690 87090
14286 87090 72230 24034 21207 -2309 -955 36162 36768 -29144 456 100602 63490 -49370
14274 -49370 -67857 -13688 28737 62219 71727 91694 94431 98313 51531 7299 20721 40938
14262 40938 62744 88095 31663 11661 24783 7063 35273 55603 38241 42849 40205 49037
14250 49037 57979 -8467 -76459 -15063 3747 -17977 -41137 -49590 -69373 -79100 -42378 -39481
14238 -39481 -47044 31298 51684 -3644 -70577 -79513 -21318 15109 22082 49055 11712 -37000
14226c7000J9453k2787J9485k916o039q320Q754L7243O9524J4294k769n1801K5582
14213F2703n3000q0839j1381L0630M760P1154O0062L965L5308m9118q0757k067
14201h580K4729N7825k616J1112k4858k4479L4028k7598o22l9937l2956O326j0456
14188c8082m6256N8013K4884l9912R859J4663m3589j1862k0508M6258M0641J472
14176d419n5451k9136j1159j4413M4253O2429j1118j811q878n6356o0076M4897
14164a01238O7214k3719l8024O1821Q0452j1050q2931M1061P3921k4709j10147
14153f7349j8577K61O160P640N7399M3542j7819N8868M8262m1902j0829L0996
14141I6652j0988l8352J9512l410m4178K6727l3796n8399L8833M0433J0508K6610
$$ plain form
14226 -37000 -17547 -40334 -20849 -23765 -29804 -38124 -29370 7873 77397 91691 88922 37121 62703
14213 62703 9703 -71136 -82517 -51887 -47127 24027 84089 88054 123362 74244 -6513 -8580
14201 -8580 16149 73974 71358 82470 57612 33133 67161 39563 38941 -996 -33952 -27626 -38082
14188 -38082 -84338 -26325 -1441 -41353 -31494 -16831 -60420 -72282 -92790 -46532 -5891 -4419
14176 -4419 -59870 -89006 -100165 -114578 -70325 -7896 -19014 -20825 -29703 -86059 -146135 -101238
14164 -101238 -34024 -57743 -95767 -33946 46506 35456 -47475 -6414 67507 42798 -67349
14153 -67349 -85926 -85665 -79505 -71865 -14466 29076 11257 70125 118387 76485 65656 96652
14141 96652 85664 47312 66824 63414 19236 45963 12167 -46232 -7399 33034 43542 70152
14129G0152m8123j3815N8405P6414P52l5089r0023n0115M407K9021K0798j3572
14117I212J9745o9885j8706L5422L8069n3305k6393J265l7534J5197O3474K1538
14105a901J6648j543k9958j6922N5003J9588l2512K5079j0806m5613k3810R3652
14093D6905l7823m7561L9908K9530J2067k6590q471j5087p0452l4485N4675M9790
14081g594k283k5769m1888J3201K6431K0342R342j7056K3518j886o034O297L6174
14068C2795L5203l170p1716m627O4643N3413N8977n6060r1411J4441k9115p340
14056c967l425j9037m5535n328P3700N4694K5806q247p583p3036L6330m402r9344
14043g9374k1678J05930J02699N815l3005m1198l4526m3379J2108R115J4038l4074
$$ plain form
14129 70152 22029 8214 66619 143033 143785 108696 18673 -31442 -27035 1986 22784 9212
14117 9212 28957 -40928 -59634 -24212 13857 -39448 -65841 -64576 -102110 -86913 -23439 -1901
14105 -1901 14747 13204 -16754 -33676 21327 40915 8403 33482 22676 -22937 -46747 46905
14093 46905 9082 -38479 1429 30959 43026 16436 7965 -7122 -77574 -112059 -57384 -7594
14081 -7594 -9877 -35646 -77534 -64333 -37902 -17560 -8218 -25274 -1756 -3642 -9676 -3379 32795
14068 32795 67998 64828 -6888 -11515 53128 106541 165518 109458 18047 32488 3373 -3967
14056 -3967 -7392 -26429 -71964 -77292 -3592 51102 76908 68661 61078 -11958 24372 19970 -79374
14043 -79374 -101052 4878 107577 113392 80387 39189 4663 -38716 -26608 -17493 -3455 -37529
14031c7529P504P9630j8212K887P784o0882k0323j165j5712K3916K2332o456M1007
14018B4781j3293J3513J1429J6410j7403k0967n6192N1567N7272L4124k4342n1231
14006B5668m5304k6770L38J9322M3652l067j1502P086L9536j0565j497K619J0848
13993E0364o1049J3920K5825J7602J2791M309k5933M8401L7686k8771q5977l0621
13981b1453m3711j1728J3394N6808L7054o6699m9229k3144N2181j355n0107L3244
13969g4745J4213J8774Q821M2955o2843k5704j4858k7251O8192K8436l2935m9239
13957a06184P2471M4904m0818p752L1141M7397k5384j1992l848l5179M1478L878
13945A0112K7133j829l0391L8841P617n1224Q897K1340J2206p588L3482K1072
$$ plain form
14031 -37529 -30025 49605 31393 34280 42064 -18818 -39141 -40306 -56018 -32102 -9770 -16226 24781
14018 24781 11488 25001 36430 52840 35437 14470 -41722 9845 67117 101241 76899 25668
14006 25668 -19636 -46406 -46068 -26746 16906 13839 2337 9423 48959 38394 36897 39516 50364
13993 50364 -10685 3235 29060 46662 59453 63762 37829 86230 123916 95145 9168 -21453
13981 -21453 -65164 -76892 -63498 -6690 30364 -36335 -85564 -108708 -56527 -57882 -107989 -74745
13969 -74745 -60532 -41758 -32937 10018 -52825 -78529 -93387 -120638 -52446 -24010 -56945 -106184
13957 -106184 -33713 11191 -29627 -37379 -6238 41159 15775 3783 -65 -35244 6234 10112
13945 10112 37245 35416 5025 43866 51483 259 9156 30496 42702 35114 68596 89668
13933H9668P750J671m2203m371o6483o7678l0078L6980M2201P776j6544L202K796
13920c5313k96l1109k0659J1879K7672N65J5935J2150M2260m928R513l9431n9082
13907g0844o9614M1376J14281P6406m9067l9830q432J8846m4563j6283J6669M982
13895b6073m1536L2744O7322m9148j4576K4454R116k4970j6249J9470k7760j6865
13883f4071N7595N3233J9476J4695M9931P0334m910J0175N9436O9081l1202k255
13871C01518N571m1905l2860N856J8899Q441q232k6935p460n3051o8271L1814
13859A33385j9258q254k5442m0332k1526j6965l786P1614L681k4619k5374l8509
13847a5385k2734k1137N12J1809n300N1386L9461l800P779J9708j9439l2014K1105
$$ plain form
13933 89668 97418 99089 56886 52515 -13968 -81646 -111724 -74744 -32543 -24767 -41311 -38109 -35313
13920 -35313 -35609 -66718 -87377 -75498 -47826 -47261 -31326 -19176 23084 18156 27669 -11762 -70844
13907 -70844 -140458 -99082 15199 91605 42538 2708 -5724 13122 -31441 -47724 -31055 -26073
13895 -26073 -67609 -34865 32457 -16691 -31267 -6813 2303 -22667 -38916 -19446 -47206 -64071
13883 -64071 -6476 46757 66233 80928 130859 201193 196283 206458 265894 334975 303773 301518
13871 301518 307089 265184 232324 238180 257079 265520 257288 230353 222893 169842 101571 133385
13859 133385 114127 105873 80431 40099 18573 1608 -2178 69436 73117 48498 23124 -15385
13847 -15385 -38119 -59256 -58744 -46935 -52235 -849 38612 34812 42591 62299 42860 10846 31951
13834C1951m1329l4765k1466J2032j0234K2480N7826l4278m5484O1510N1629r420
13822D0452m1133j5755l7356P4981Q1633Q520k9422j30395j9228m3453Q52J21622
13810A1318J48351L4681k4323n0349L1245J5502l8846m1791J304m4439k0857L0890
13798E2686M3830j4816P20k7953j5523o5737n2757k6455j9057N4750N7283K4395
13786A1366q373l7588L1608K0776K9792M194k3935J1974p138K5163O2532J028
13774A21399j2479j0332l5185l053l966l5783j5789j4117k865M2285J14066l4825
13762A09356m9315K902j6473m7806K995M5757m64N6942K3164m9610K9908J4309
13750A21665j03n0408o4838l7225l6356o67K1611K6298m5732O509M1197K643L7155
$$ plain form
13834 31951 -9378 -44143 -65609 -53577 -63811 -41331 16495 -17783 -63267 -1757 49872 40452
13822 40452 -681 -16436 -53792 21189 102822 111342 81920 -48475 -67703 -111156 -110304 11318
13810 11318 159669 194350 170027 119678 150923 166425 127579 85788 87092 42653 21796 52686
13798 52686 96516 81700 82420 54467 38944 -26793 -79550 -106005 -125062 -70312 -13029 11366
13786 11366 2993 -34595 -2987 17789 47581 51775 27840 39814 32676 57839 120371 121399
13774 121399 108920 98588 63403 60350 56384 20601 4812 -9305 -12170 30115 144181 109356
13762 109356 60041 62943 46470 -1336 1659 47416 46952 103894 127058 77448 107356 121665
13750 121665 121562 71154 6316 -30909 -67265 -67932 -46321 -20023 -65755 -59246 -18049 -15406 21749
13737B1749k0148r5772j6453P5337j2256j5871l8092L8383M8266K6865m3595l993
13725c5580n4317K7406P4534K609K3211J3842l6735L993j8852m5857K3336l3767
13713e6177m9783J2270J02l6955L9340k7264k3677R9810P7750L9222M7864k9079
13701I3423n5391o1460n9213L6734M3721Q097J1754O311m5647n7524L2965L6116
13689a0114K7454N1657j4654n3171P83L4457Q892k758J0755l7541p563M1260N4206
13676A03663j7330p8775l7974M7567J9109n9950k7531M7963N1750J1253j8370
13665D1375j7014m9241k2963K9333L2869p004l1136J9285K6869J5226k179O987
13653D2407K3218q230k5125l1286J0027p511J5490L3141L6411l2599o7787q0169
$$ plain form
13737 21749 1601 -94171 -110624 -35287 -47543 -63414 -101506 -63123 -14857 12008 -31587 -35580
13725 -35580 -89897 -62491 12043 14652 37863 51705 14970 18963 111 -45746 -22410 -56177
13713 -56177 -105960 -93690 -93588 -130543 -91203 -118467 -142144 -42334 35416 74638 122502 93423
13701 93423 38032 -23428 -82641 -45907 -2186 5911 17665 23976 -21671 -79195 -46230 -10114
13689 -10114 17340 68997 54343 1172 1955 36412 45304 42546 53301 15760 8197 49457 103663
13676 103663 86333 7558 -30416 17151 36260 -23690 -51221 -3258 48492 59745 41375
13665 41375 24361 -24880 -47843 -18510 14359 7355 -23781 -4496 22373 37599 35420 42407
13653 42407 65625 57395 32270 984 11011 3500 18990 52131 88542 55943 -11844 -92013
13641i2013J1761M2202j3997l878J3732O4275L5264j630n931m7727j2636q544
13629a9122N520L8054q52R106J0657K7171n352k615k3429M385m6341L7782m2880
13616g916j034n960m1504k8469j7592K4122J27993L6825n6730j5312J6449j2857
13604A8015j2480L9038R867K6199K1206l6313J6944j7782r175j9354K681l16r2195
13591e3665m821O4628M2568l9062K5524J04757j056k7251K1722K562j2650J8971
13579A42227r635l5301m1350o6977o2413J3333O0331L7099m070k5804p519L6237
13567C6158p7049l9604J7963N884n9939M1332N6134l06Q355j0214o411L3167Q0488
13554H5958L7219J0966o4158p5721l4612J2716M2807N9737L0768k5621p8889m8071
$$ plain form
13641 -92013 -80252 -38050 -52047 -55925 -42193 22082 57346 55716 49785 2058 -10578 -19122
13629 -19122 -13602 24452 23600 32706 43363 70534 65182 62567 39138 43523 -2818 34964 -7916
13616 -7916 -8950 -14910 -56414 -84883 -102475 -78353 49640 86465 29735 14423 30872 18015
13604 18015 5535 44573 54440 80639 101845 65532 82476 64694 55519 36165 38846 38530 -53665
13591 -53665 -58486 6142 48710 9648 35172 139929 138873 111622 133344 135906 123256 142227
13579 142227 132592 97291 55941 -11036 -73449 -60116 215 37314 33244 7440 -79 36158
13567 36158 -40891 -80495 -62532 -56648 -116587 -75255 -19121 -19427 -11072 -21286 -27697 5470 85958
13554 85958 123177 134143 69985 -5736 -40348 -27632 15175 74912 105680 80059 1170 -46901
13542d6901j8302M3800Q4646P191l769K3584L7558o0804l0201l6616J2301M6396
13530E8883m2030M8935K8192p16m0778Q625J1669m687m3915j9624O2428P400J2168
13517H6550K0875K8661l999n5248j01141K4333M2925n4K0771J8716k4403j5167
13505D2819J420l1370k7049J5357J3072J2665N6274N145j6383K4365m254l7813
13493E4248j0948j3280j3485m9708K6237L1826L6851j1216p0856m0566L6156K9754
13481E013j3028L617q155L0800K7073j9496K330j5234j7863K4724o1822J8131
13469b3910N3229M852L0219n8517p6673K7614O9125L2965m874p7176l7052L1370
13457b8828k0451K448K1216K1797l3724R485O9290o562j8463j4037M5439O0378
$$ plain form
13542 -46901 -65203 -21403 63243 70434 66665 90249 127807 67003 36802 186 12487 58883
13530 58883 16853 65788 93980 93264 52486 61111 72780 68093 24178 4554 66982 74382 86550
13517 86550 107425 136086 132087 76839 -24302 31 42956 42902 63673 82389 57986 42819
13505 42819 44239 12869 -14180 1177 14249 26914 83188 88333 71950 96315 92061 54248
13493 54248 43300 30020 16535 -33173 -6936 24890 61741 50525 -20331 -60897 -24741 5013
13481 5013 -8015 -4398 -12553 18247 45320 25824 28154 12920 -4943 19781 -42041 -23910
13469 -23910 29319 34171 64390 5873 -70800 -43186 25939 58904 54030 -23146 -60198 -28828
13457 -28828 -49279 -46831 -25615 -3818 -37542 -28057 41233 34671 16208 2171 47610 107988
13445A07988l4911J9393k821p428m879m5899K5511q20M275j5648L3188P8137K5185
13432A81271m6210q0471p5759L2499j8686n148L1199q6100j6272L7573N474K4715
13420a5915N1984k0016L2081N0929j9651m6739L3828l6038l0828K4426k0137k4304
13408b0380K1488l1478k2555l2720L3681K8245L7776l3778l6980J2094O0178n476
13396A0095M6696J1457j4119p603j252k7376J2720k8829O043J5379l1198J1299
13384C312J2142j0666k8777L4616o684j6984N4302K8129l938j00620M2267O957
13372A4056J4333J7570J0796k3343j9593j924K4792N6164M3533r851j814J5044
13360A39763L9624k6185o0702l1697K8268K1106n772m3557o426m0089J4138K8714
$$ plain form
13445 107988 73077 92470 89649 82221 77342 31443 56954 56134 60409 44761 77949 156086 181271
13432 181271 135061 54590 -21169 11330 -7356 -12504 18695 -67405 -83677 -46104 -40630 -15915
13420 -15915 36069 16053 48134 99063 79412 32673 66501 30463 -365 24061 3924 -20380
13408 -20380 1108 -30370 -52925 -85645 -51964 -23719 14057 -19721 -56701 -44607 15571 10095
13396 10095 56791 68248 54129 46526 45274 17898 30618 1789 7832 23211 -7987 3312
13384 3312 15454 4788 -23989 10627 3943 -13041 41261 69390 65452 -35168 7099 14056
13372 14056 28389 45959 56755 33412 13819 11895 36687 92851 136384 126533 124719 139763
13360 139763 179387 153202 92500 60803 89071 110177 104405 60848 54422 14333 28471 57185
13348E7185O7337R766O1453k9157m4133L548k1718j3137M7135J0184j6156m5778
13336H6529J5580K1058m9698K5234O2043j7275r632j0565l9794n1923q0997J6670
13324c2770O2006k7524L1978K6751K0980N8996p182l2487j4878k5819j0133k4642
13312B5276l2222l5701j7671L9871q68j9378L0932o3183l3531K5759M9386J5902
13300a5428k3588J8450q153M2772k0534o158N0145J4240q847j3764n700p558Q643
13287B4520M2383P525J2187J4481j2186j3780n1568l3662J3730j6027n512J5320
13275b589O2394N5839n3496o330N186J9721N7110k2755j9127K947k3778l9278
13263C5844n8414K5738J8511L5980M3332q2863J8335j3574L9981n269m1786L865
$$ plain form
13348 57185 124522 134288 195741 166584 122451 125999 104281 91144 138279 148463 132307 86529
13336 86529 102109 123167 73469 98703 160746 143471 133839 123274 83480 31557 -49440 -32770
13324 -32770 29236 1712 33690 60441 81421 140417 133235 100748 85870 60051 49918 25276
13312 25276 -6946 -42647 -60318 -20447 -21315 -40693 -9761 -72944 -106475 -80716 -31330 -15428
13300 -15428 -39016 -20566 -28719 14053 -6481 -12639 37506 51746 42899 29135 23435 15877 24520
13287 24520 66903 74428 86615 101096 88910 75130 23562 -10100 3630 -12397 -17909 -2589
13275 -2589 59805 115644 62148 55818 61004 80725 137835 115080 95953 98900 75122 35844
13263 35844 -22570 3168 21679 57659 100991 18128 36463 22889 62870 57601 15815 19680
13251A9680L2215Q41O564n3076J8623N0602j5469k4380J389J7619m8083m3519
13239c6994j5350L6797K554O7614j7499M5687L4509m8273n1484r593k8031r420
13227b9483L6326k7737j6834N1630K1396K7499K612m0844m0736K1730J9565L2608
13215E7732j8722l9840k805r244K8459K7780N2308K2994q867L1126L4894l077
13203A72738J350p7333l3682L426p5050l3228J8340j6205M4917Q015K8651K1231
13191F3170L3366J4630M1834l9446j7914p1366l5904L2739M4223m7273p2196O2000
13179G863O304K2358K2193K0686M7232j4462q4070j8631M2388K5119j11375o6044
13167a00439M3380P2420P2607j3937j9055L6875l4655r756J041L2574J5805j8199
$$ plain form
13251 19680 51895 52736 59300 6224 24847 75449 59980 35600 36989 54608 6525 -36994
13239 -36994 -52344 -15547 -12993 54621 37122 82809 117318 69045 17561 7968 -20063 -29483
13227 -29483 6843 -20894 -37728 13902 35298 62797 65409 24565 -16171 5559 25124 57732
13215 57732 39010 -830 -3635 -12879 15580 43360 95668 118662 109795 140921 175815 172738
13203 172738 174088 96755 63073 66499 -8551 -41779 -23439 -39644 5273 13288 41939 63170
13191 63170 96536 111166 153000 113554 95640 24274 -11630 21109 65332 18059 -54137 7863
13179 7863 14167 36525 58718 79404 126636 112174 28104 9473 51861 76980 -34395 -100439
13167 -100439 -57059 15361 87968 74031 54976 91851 57196 47440 48481 81055 96860 78661
13155G8661n6600N7912J0577J352l3460k4873n0379l2967M542N4554N0852j9944
13143D0227o8756p090M1310N2033J5233k090N5073M5828k3918N2889m4397j18277
13131C8065q020N1192K9307j4887l3755j455k888L060n4402j6393k2988J5569
13119a7595O7122O5423J1786j9345o6581K8064M4495k4771m052L5796l4632j7110
13107F8600L7205p43j5842m0330l338L4933M0049K8038l4436q628l772l1370l6859
13094C3507m1677J0858Q238N0658k4419k0688j1183P026o0711r429P1106Q511
13082B1797l2639l8806P678n72P0577K3089o1043J8944N2536M088M606n0766r4174
13069g4685j6209N2678K3391R0442M9590O658l8312Q285L7325q503m9734m1210
$$ plain form
13155 78661 22061 79973 90550 91902 58442 33569 -16810 -49777 -45235 9319 60171 40227
13143 40227 -28529 -35619 5691 57724 72957 70867 125940 171768 147850 200739 156342 38065
13131 38065 30045 81237 110544 95657 61902 60447 57559 60619 6217 -10176 -33164 -17595
13119 -17595 49527 114950 126736 107391 40810 68874 113369 88598 84546 120342 85710 68600
13107 68600 105805 105062 89220 48890 45552 80485 120534 148572 114136 105508 101736 70366 33507
13094 33507 -8170 2688 10926 61584 37165 16477 5294 12320 -48391 -57820 13286 21797
13082 21797 -10842 -49648 -41970 -42542 28035 51124 -9919 9025 61561 65649 70255 19489 -74685
13069 -74685 -90894 -38216 -14825 75617 125207 131865 93553 101838 139163 130660 80926 39716
13057C9716j353M580j7648j1430m3177o0340L6483Q1607L5399l4694j8796n322
13045E025J1524L0366m5020J9763P7572J9375J7024O759o4326m4232j9292j0136
13033D402Q05J4221m556j0060n188O1215J3146j9141K9930K2885o0042m81r430
13020C7706k9591J767k55L8758J9669J7127j8483m488n916L1002J6957l9503o5604
13007h54l1228L1316j0064K888j3053k0498O767P6782L1584J3102L4388o9575
12995E1555k5577M1672O0362k3843M3923K8358m8228k4932j0370K4629J8915j3209
12983A23255k0550k9962l6922J6470K7282O930l7273l5784j8957O659M7043K1219
12971F9410P159J6832K0722r730k5386K3014K0817k4101j6193K1586M2214o3092
$$ plain form
13057 39716 38363 42943 25295 13865 -29312 -89652 -53169 28438 63837 29143 10347 5025
13045 5025 16549 46915 1895 21658 99230 118605 135629 142388 78062 33830 14538 4402
13033 4402 5207 19428 14872 4812 -376 60839 73985 54844 84774 107659 47617 47136 37706
13020 37706 8115 9882 9627 48385 68054 85181 66698 62210 56294 87296 104253 64750 -854
13007 -854 -32082 -766 -10830 -7942 -20995 -41493 -34726 42056 73640 86742 121130 51555
12995 51555 25978 67650 128012 104169 148092 176450 128222 103290 92920 117549 136464 123255
12983 123255 102705 72743 35821 52291 79573 86503 49230 13446 -5511 1148 48191 69410
12971 69410 76569 93401 114123 104393 79007 102021 122838 98737 82544 104130 146344 83252
12959H3252j7005J8414k6022p0292L9469M5618l5372J40m0111K9686N5627m2834
12947D0570N1799O9016q3744o1868K191J6346K3552Q6978o6870l0692O8977m1880
12935G4375p9943L939O2804P6560K3252q2079j4640j655L3729L6439O0564r947
12923A83398j6502l7315q0694j00882k2727j8922L6814j2447P3876J06701j6605
12912I4695p1979m1018J826J15434K5958l1328n7649K0771j1335N688K8965L9019
12900A19047L7603l2002m4655l3472N876o0581r234N3302M737l1781K3773K7148
12888E9761L9835L2591L1832K3084l6167R904m0985k4649M2916N542k1780j3810
12876A08074j1721r861M2420m3631K7645P757O203m578K2742q948r7598j2423
$$ plain form
12959 83252 66247 84661 58639 -11653 27816 73434 38062 38202 -1909 27777 83404 40570
12947 40570 92369 161385 77641 15773 17964 34310 57862 144840 77970 47278 116255 74375
12935 74375 -5568 -1629 61175 137735 160987 78908 64268 62613 96342 132781 193345 183398
12923 183398 166896 129581 48887 -51995 -74722 -93644 -56830 -69277 4599 111300 94695
12912 94695 22716 -18302 -16476 98958 124916 93588 35939 56710 45375 51063 80028 119047
12900 119047 156650 124648 79993 46521 52397 -8184 -17418 35884 40621 8840 32613 59761
12888 59761 99596 132187 164019 187103 150936 160840 119855 95206 138122 143664 121884 108074
12876 108074 96353 86492 128912 85281 112926 120683 126886 122308 145050 136102 38504 26081
12864B6081N3911M7061J1919j9578l4315j5678n7261J2133J0462K2068M308n507
12852E5604j5098M900O5809M3478j4315j8986j4797M4160q944N3071j7141k3996
12840A53745k9229k5595Q782J5047O81r302O2799J5955k1241j1130n6459O271
12828A10324m8846Q9221L724j6844j2596M2158m3485p4249J8009N9343M56J0839
12816A38054o539j6788k9854N906N4280M9919J0648J8290j972j7899n274o066
12804A92705o9990r201K0776Q0884j2034m2690j7100J0538M163P083J8679m7404
12792A36409j4768M4259j8523M3364O9171k7560r5094m3714K739n9012p32M7258
12780H3797L0406j2113k5507j2402M2305K4041l474j5563k4523k7924L703k8936
$$ plain form
12864 26081 79992 127053 138972 119394 85079 69401 12140 24273 34735 56803 61111 55604
12852 55604 40506 45406 111215 154693 140378 121392 106595 150755 141811 194882 177741 153745
12840 153745 124516 98921 107703 122750 123431 114129 176928 192883 171642 160512 104053 110324
12828 110324 61478 150699 154423 137579 124983 167141 123656 49407 67416 126759 127215 138054
12816 138054 131515 114727 84873 90779 145059 194978 205626 223916 221944 204045 198771 192705
12804 192705 122715 113514 134290 215174 203140 160450 143350 153888 158051 165134 183813 136409
12792 136409 121641 165900 147377 190741 259912 232352 137258 93544 96283 37271 36539 83797
12780 83797 114203 102090 76583 64181 106486 130527 127053 111490 86967 59043 62746 33810
12768C3810k7701L0352M8160O3091n557o9127l5636M0661K5988K603o602k4810
12756G5232l317n069P2774P7574m723M789k7927m9801n0842J0306k5950J6581
12744H9627O2781K7817l9405K410L6064L5666n0043k158j5975K3510K3832j4382
12732A79744q7k100l8737r2390L4517L0655l8356m6564M953K2753J0497j5420
12720D9465J0872L3168k2287K9575N0980L6213l5572p3896M3685R7358O6565q775
12708B77351K2098J5153L124m8903k0978k148k6170m5656n3548p1136L4000O7002
12696A50189N334K1273k4065j7128P7760L8793m3068l0196j416K6200N9529k5815
12684B37390j3879m3386m2880K9088K7835l7169r29r390j3281j3425p783j611
$$ plain form
12768 33810 6109 36461 84621 147712 142155 73028 37392 78053 104041 106644 100042 75232
12756 75232 71915 66846 139620 217194 212471 217260 189333 139532 88690 98996 73046 89627
12744 89627 152408 180225 140820 143230 179294 214960 164917 162759 146784 170294 194126 179744
12732 179744 179657 177557 138820 46430 80947 111602 73246 26682 31635 54388 64885 49465
12720 49465 60337 93505 71218 100793 151773 187986 152414 78518 122203 219561 286126 277351
12708 277351 299449 314602 317726 268823 247845 245697 219527 173871 120323 49187 83187 150189
12696 150189 155523 176796 152731 135603 213363 252156 209088 178892 177476 203676 263205 237390
12684 237390 223511 180125 137245 166333 194168 156999 156070 146680 133399 119974 112191 110580
12672A10580L6081M3031m0251Q31j199P615m9606L9675L2665K4211Q2726l5811
12660B50548p6352L746J7987k5404j9246q743j6018L8307J1640m1615K7392Q9585
12648B51827j6121m5208L9289q264p817k6076q4186M6410q763L5458M9983k1395
12636B05137p1024o058j3864m4057n702N4945Q2132K0921J3073k021p874k2854
12624B02754P001K7108l6955R112N1458j4530j8943j7037l1782J1018k8444L182
12612A63942N9235R296M3833Q154o8304m0780l0415L2969N8105K3439n010m783
12600B49681O070L0487j0246l3559P302k5624j4291j1289q6702j5552n7468m4389
12588e580o022O5574N8038L9659N7453J9081j821l2587P916L6007L5383m3944
$$ plain form
12672 110580 146661 189692 149441 150272 149073 156688 107082 146757 179422 203633 286359 250548
12660 250548 174196 177942 195929 170525 151279 142536 126518 164825 176465 134850 162242 251827
12648 251827 235706 190498 229787 221523 213706 187630 103444 149854 141091 176549 226532 205137
12636 205137 134113 128055 114191 70134 64432 119377 201509 222430 235503 233482 225608 202754
12624 202754 209755 236863 199908 209020 260478 245948 227005 209968 178186 189204 160760 163942
12612 163942 223177 232473 276306 284460 216156 175376 144961 177930 236035 259474 254464 249681
12600 249681 255751 286238 275992 242433 249735 224111 209820 198531 111829 96277 38809 -5580
12588 -5580 -11602 53972 112010 151669 209122 228203 226382 193795 201711 237718 273101 229157
12576B29157J985p685J3235O0803M6103n7248m0241l594j0008J3458K8414O3457
12564C37836K473m5580j1675J782K0392p725M806M2568P28l1716n4521k2464K2742
12551B59646j9865P11j5525q2710j0893K5851N7042N0905K5192L2036m8560o1212
12539B12618q377K9941K0727O3008j1518k717K9437j2248q835o839k7009L3435
12527C11623J0521k7971n4048m732Q5423p967j5056L8625k958m6982k6082l8164
12515B22232M0738R2168K4614J6833K876j2799j1470n947j9921j2852l7868P2145
12503C70749L8308J1914k0897j7573m3761J2912J7203J5069K8333l3401n0630
12492C28226q7174L8884R4567K2012j4627o1564k3145j5176m4147L6999j4730
$$ plain form
12576 229157 231142 223457 236692 297495 343598 286350 246109 242515 232507 245965 274379 337836
12564 337836 340309 294729 283054 284836 305228 297503 302309 344877 345605 313889 259368 236904 259646
12551 259646 239781 240492 224967 142257 131364 157215 214257 265162 290354 322390 273830 212618
12539 212618 204241 234182 254909 317917 306399 303682 333119 320871 312036 305197 278188 311623
12527 311623 322144 294173 240125 235393 320816 312849 297793 336418 333460 286478 260396 222232
12515 222232 262970 355138 379752 396585 399461 386662 375192 369245 349324 336472 298604 370749
12503 370749 409057 420971 400074 382501 338740 351652 368855 383924 412257 378856 328226
12492 328226 241052 279936 374503 396515 381888 320324 297179 282003 237856 274855 260125
12481B60125m720m7644j4780J676N2513R1521M2327J1889J9676r786J1833L2970
12469D47600m4838p1665k8080k2409K8549J7214N509P6447K481k9429K0477N1143
12457D52999j9474m8813j3005l0852p9414N8365N5120k5117l2217p4653L3735
12446B76674J7073M6502n0670l7419N4417Q5528K461J5139M3959j5361l662m0833
12434C93808j0182N0525L9155J7777K927j431L5796n7028p7122l29K0722K0374
12422D34992K3158q1K0231K1676K2781J2298l2261o8422J2671J4251r17K2656
12410D83033J7997n6308j6757j8631J4868k0566k1390R88j1694J6760K5431N4633
12398D68364L6972N2156M675q0229n914P538k5663L0557M7222l6231m3612Q88
$$ plain form
12481 260125 255405 207761 192981 194657 247170 338691 381018 392907 412583 402797 414630 447600
12469 447600 402762 331097 303017 280608 309157 326371 331880 408327 410808 381379 401856 452999
12457 452999 433525 384712 371707 340855 261441 319806 374926 349809 317592 242939 276674
12446 276674 293747 340249 289579 252160 306577 392105 394566 409705 453664 438303 434641 393808
12434 393808 383626 434151 473306 491083 494010 492579 528375 471347 394225 393896 414618 434992
12422 434992 458150 458069 478300 499976 522757 535055 502794 434372 447043 461294 460377 483033
12410 483033 501030 444722 427965 409334 424202 403636 382246 383234 371540 388300 413731 468364
12398 468364 505336 557492 562167 481938 476024 483562 457899 488456 535678 499447 455835 456723
12386D56723j9607k0195N4790K6989J2817r396J3151K8034j8909j9753L8060n408
12374E37296J71J8315L3416l8024L7640R2506j6746m7776j8438m7400L4393j2952
12362E72401l373l2760j9755J1901N2675K1493m1642k1127Q360k080M3609L3905
12350F23607N029m5328L9245K3636N6139J5353J4406j1723J0573m9070K0176k9012
12338F73031J493P3391J1606n379m3771M1264J05J6409j9093J0005k4462j3472
12326G21127M95k4233J8049N0123K5933m6057j2271J856J141l5590j1947M9466
12314G38092K7453j708r801m817m9688M0788K7189Q991m1585M6266J9902o0420
12302G40662L3897K5615o3029m09N3770Q677K9931j3335L7536l6391K0968L5810
$$ plain form
12386 456723 437116 416921 471711 498700 511517 502121 515272 543306 524397 504644 542704 537296
12374 537296 537467 555782 589198 551174 588814 681320 664574 616798 598360 550960 585353 572401
12362 572401 569028 536268 516513 528414 581089 602582 560940 539813 548173 546093 589702 623607
12350 623607 628636 583308 622553 646189 702328 717681 732087 720364 730937 681867 702043 673031
12338 673031 674524 747915 759521 754142 710371 751635 751740 768149 749056 759061 734599 721127
12326 721127 721622 697389 715438 765561 791494 745437 733166 735022 736163 700573 688626 738092
12314 738092 765545 763837 754036 749219 699531 740319 767508 776499 734914 781180 801082 740662
12302 740662 774559 800174 737145 736736 790506 799183 829114 815779 853315 816924 837892 873702
12290H73702j1346k9099n181k2255l6075Q4200N5404j9707j0022k0761k971l7706
12278H18183J6690J7013l4622j9250M5165L2579J1186R456O4444k4856m6975J8514
12266I07527Q3506Q936r4797j3339K2822p7805k5751R1397O1077l8799Q878j2477
12254I21175K0075M4509O2067R197N7643J7073k1334Q859p718p756J5527n0352
12242A068965L1086J3045q7981L9653N1008J8716j091q586l1126Q6312k5244j7138
12230A137619p328k1927M5232J687j454m6979M3882P886J0662J191L8087k549
12218A206009J0091m954k9298k3136j8670J0230O392j0215L8878L0272j5052n446
12206A195101j126P9532N4787J7618O8877K1145K1360k1568J6413j3906k3173
$$ plain form
12290 873702 862356 833257 828076 805821 769746 853946 909350 889643 879621 858860 855889 818183
12278 818183 834873 851886 817264 798014 843179 875758 886944 896400 960844 935988 889013 907527
12266 907527 991033 999969 905172 891833 914655 836850 811099 902496 963573 924774 933652 921175
12254 921175 941250 985759 1047826 1057023 1114666 1131739 1110405 1119264 1111546 1103790 1119317 1068965
12242 1068965 1100051 1113096 1025115 1064768 1115776 1134492 1133401 1124815 1093689 1180001 1154757 1137619
12230 1137619 1130291 1108364 1153596 1155283 1153829 1106850 1150732 1158618 1169280 1170471 1208558 1206009
12218 1206009 1216100 1211146 1181848 1158712 1140042 1150272 1156664 1146449 1185327 1215599 1200547 1195101
12206 1195101 1193975 1273507 1328294 1345912 1414789 1435934 1457294 1435726 1452139 1438233 1415060
12195A415060M9526O7531R970O230k3324L6157j3021j417k826O6888O7111l983
12183A673902l4935n6070l5799L8672K9230J8449k0349k3126O433J1850N3161
12172A661418K1372j6629P995M4292M0915Q545L1227m0416K9015J409r614M6101
12160A825630L8204n7590L0511M2976l1407k5977K0824K442j9196M6814M0213
12149A913444Q4125J32189N6741J0468J1896K5384l4807j02527j3203N0225j5780
12138B118155J0845K7970K8030K9373k8369n5133N3097O7564o66j7170N7870P4749
12126B366315K5257N744j3571j5291P1329J7685q361N7510M5403J6397J8652k766
12114B584303J325M1789M5700R29P1914J8710M121J62199R7757P6799J08657R3728
$$ plain form
12195 1415060 1464586 1532117 1542087 1548317 1524993 1561150 1548129 1546712 1543886 1610774 1677885 1673902
12183 1673902 1638967 1582897 1547098 1585770 1615000 1633449 1613100 1589974 1596407 1608257 1661418
12172 1661418 1682790 1666161 1674156 1718448 1759363 1767908 1799135 1758719 1787734 1789143 1779529 1825630
12160 1825630 1863834 1806244 1836755 1879731 1848324 1822347 1843171 1845613 1826417 1873231 1913444
12149 1913444 1997569 2129758 2186499 2196967 2208863 2234247 2199440 2096913 2083710 2133935 2118155
12138 2118155 2129000 2156970 2185000 2214373 2186004 2130871 2183968 2251532 2250866 2233696 2291566 2366315
12126 2366315 2391572 2397316 2383745 2368454 2439783 2457468 2449107 2506617 2552020 2568417 2587069 2584303
12114 2584303 2585628 2627417 2673117 2674046 2745960 2764670 2768791 2930990 3028747 3105546 3214203 3307931
12102C307931N2477J249p5467o3650L8653N276p9425o7205k3329k7469J7022j3136
12090C072927j7167N9217O2261Q1621l3961K2233L0773k8041J2312R3087k137
12079C353125j80N3866N9616K6572O3002K7175L4128j0174J3966P8899Q9950M9129
12067C839074k6846K0818Q8750Q0864L4487Q3992J65601J33732J16268J09380
12057D646120K5150L101q2514q8817r0366j18824p1798N8008J0469N5410M1719
12046D387658L7021L7341J7642k5585O8306R8303N618P1209Q8345J9366N217O0
12034D810501K0279L459O795O0756J26998K3968N2259O7602O0936k3039q357N5888
12022E258045P7401O5506L76K7923P3401Q6704P2436J948N1569J55649R2604K8882
$$ plain form
12102 3307931 3360408 3361657 3286190 3222540 3261193 3266469 3187044 3119839 3096510 3069041 3086063 3072927
12090 3072927 3055760 3114977 3177238 3258859 3224898 3247131 3277904 3249863 3262175 3355262 3353125
12079 3353125 3352945 3406811 3466427 3492999 3556001 3583176 3617304 3607130 3621096 3699995 3789945 3839074
12067 3839074 3812228 3833046 3921796 4002660 4037147 4121139 4286740 4420472 4536740 4646120
12057 4646120 4671270 4674371 4591857 4503040 4412674 4293850 4222052 4280060 4290529 4345939 4387658
12046 4387658 4424679 4462020 4479662 4454077 4522383 4620686 4626304 4697513 4785858 4805224 4810441 4810501
12034 4810501 4830780 4834239 4841034 4901790 5028788 5052756 5105015 5172617 5233553 5210514 5202157 5258045
12022 5258045 5335446 5400952 5401328 5429251 5502652 5589356 5661792 5663740 5715309 5870958 5963562 5992444
12010E992444n3812Q681R7112M5023J2207K823J2224J01087K2934j7779l0635
11999F192309M2098J35499L2886j7140O5778Q9445O9116o9617k2331J9267K7800
11988F565110J4977M5409O2304j1755L2320O9241P3550N5449M8053J1338j2375
11977F953621L791M7739R3088K0177l5781M4682M3007m0447L4289L6046j705M130
11965G202637M2263M5483k0307L3278O7620Q8816N075J6582k595K413M8421j576
11953G528110o2170K6363L7229J6155M2681k2256q6417J8100l9869L1183j1932
11942G477177r105K5603l761J1533k0565o5880K5473K6941p1037o4075j3445m5568
11930G273291k2429j2005k0299q23k6736k3462p297N320N246J0999Q974o733K5984
$$ plain form
12010 5992444 5938632 5947313 6044425 6089448 6101655 6104478 6116702 6217789 6240723 6222944 6192309
11999 6192309 6234407 6369906 6402792 6385652 6451430 6540875 6609991 6540374 6518043 6537310 6565110
11988 6565110 6580087 6625496 6687800 6676045 6708365 6777606 6851156 6906605 6954658 6965996 6953621
11977 6953621 6957412 7005151 7098239 7118416 7082635 7127317 7170324 7129877 7164166 7200212 7198507 7202637
11965 7202637 7244900 7290383 7270076 7303354 7370974 7459790 7464865 7481447 7478852 7481265 7529686 7528110
11953 7528110 7465940 7492303 7529532 7545687 7588368 7566112 7479695 7497795 7457926 7489109 7477177
11942 7477177 7468072 7493675 7489914 7501447 7480882 7415002 7440475 7467416 7396379 7332304 7318859 7273291
11930 7273291 7250862 7238857 7218558 7217735 7190999 7167537 7160240 7165560 7170806 7181805 7190779 7184046 7210030
11917G210030o1644m5341m6918m7080K0078m5571r4288L3878j5260o8164n7931
11906F781789k3521q357m6565n2304j216L1741m6416k8814L19p2816p2725k8806
11894F432309m1084o2857k6404j8003m7900n7222j08072o5026l1183l4083n1501
11883E888974n0615q1017p8977l1112m5848r3570k8311M347m6040O179K5790N5149
11871E524949l5569j06247q0552q617o4726l0176j2091p1204q6522n0172j8724
11860D960349o522n9673k2155j9342m3075m1276n2252m2872J7557P002j0185k4381
11848D663175o7892o8900p223k8500q8025j18054q5059p8139J829l1504q49k132
11836D088727k7562l6816m6841o2144o0776q0661j0429l544l4255j9967o716K710
$$ plain form
11917 7210030 7148386 7103045 7056127 7009047 7029125 6983554 6889266 6923144 6907884 6839720 6781789
11906 6781789 6758268 6749911 6703346 6651042 6649826 6681567 6635151 6606337 6606656 6533840 6461115 6432309
11894 6432309 6391225 6328368 6301964 6283961 6236061 6178839 6070767 6005741 5974558 5940475 5888974
11883 5888974 5838359 5757342 5678365 5647253 5601405 5507835 5479524 5483871 5437831 5444010 5469800 5524949
11871 5524949 5489380 5383133 5302581 5293964 5229238 5199062 5186971 5115767 5029245 4979073 4960349
11860 4960349 4953827 4894154 4871999 4852657 4809582 4768306 4716054 4673182 4690739 4697741 4687556 4663175
11848 4663175 4595283 4526383 4519160 4490660 4402635 4284581 4199522 4121383 4123212 4091708 4090859 4088727
11836 4088727 4061165 4024349 3977508 3915364 3854588 3773927 3763498 3759954 3725699 3705732 3699016 3701726
11824C701726m8882r4933m3684p2650j4170L5842j5765o97o4184m7999m4843k6023
11812C263738k2958P151l5385l3296K660l9373m651M5050J1746p9391p6613k6429
11800C012249J6509j8287n2498j8162K9088M200M8397m9728p9360l9198k6876
11789B826334k6470l3961m3584m440k5165r030k8811j5199j6907J8227N227k7532
11777B618689m5832k2170n4556o2995r9896j9763k7833N5306k3719q151O808M0735
11765B356623k3488q7951L351J1383R337l4810l3385m7967n2873n1812j0999K2009
11753B059418k1872J7367j2910L0244j1824p1535q3619L9467M3094K4326n0828
11742A961328m3500M7508o946o5184l046J2937K3347l2700j6020p0283j16408
$$ plain form
11824 3701726 3652844 3557911 3514227 3441577 3427407 3463249 3447484 3446787 3382603 3334604 3289761 3263738
11812 3263738 3240780 3247931 3212546 3179250 3181910 3142537 3137886 3182936 3194682 3115291 3038678 3012249
11800 3012249 3028758 3010471 2957973 2939811 2968899 2973099 3021496 2971768 2892408 2853210 2826334
11789 2826334 2799864 2765903 2722319 2717879 2692714 2683684 2654873 2639674 2622767 2640994 2646221 2618689
11777 2618689 2572857 2550687 2496131 2433136 2333240 2313477 2285644 2340950 2317231 2309080 2315888 2356623
11765 2356623 2333135 2245184 2248535 2259918 2269255 2234445 2201060 2153093 2100220 2048408 2037409 2059418
11753 2059418 2037546 2054913 2042003 2072247 2060423 1988888 1905269 1944736 1987830 2012156 1961328
11742 1961328 1917828 1965336 1958390 1893206 1890160 1903097 1926444 1893744 1877724 1807441 1691033
11731A691033J167M2995k6264n5941n9243J0355P162k8645k1679J3468J8178l8686
11719A553900q2423m065K0978K4597m3191L5928L1919q182Q889j6269K4119o0139
11707A486061q6772m5906j1653J4654K6359l9163N3763P787j2633p7746k486L4657
11695A346922K5618r165k9902k6813N2290K0688m8254l5248p025r7286M0639L1765
11683A264229p9088J126J223M2896n3179n3504J800L0348K8600m0218n2212M837
11671A096858P138q411K1999K1486L6827m55o7645m5821j8811k5311k3605J4816
11659A009065N6664M073N8456j4985o1204n4809O562J4037l0941l579p909N0394
11647A025824n8225m8252j3981K7398J285l6384J0220J9343K4530J7292L0271
$$ plain form
11731 1691033 1692200 1735195 1708931 1652990 1593747 1604102 1611264 1582619 1560940 1574408 1592586 1553900
11719 1553900 1471477 1467412 1488390 1512987 1469796 1505724 1537643 1529461 1538350 1522081 1546200 1486061
11707 1486061 1399289 1353383 1341730 1356384 1382743 1343580 1397343 1405130 1392497 1314751 1312265 1346922
11695 1346922 1372540 1363375 1333473 1306660 1358950 1379638 1331384 1296136 1289111 1191825 1232464 1264229
11683 1264229 1185141 1186267 1187490 1230386 1177207 1123703 1125503 1155851 1184451 1144233 1092021 1096858
11671 1096858 1103996 1095585 1117584 1139070 1175897 1175442 1107797 1061976 1043165 1017854 994249 1009065
11659 1009065 1065729 1069802 1128258 1113273 1052069 997260 1003822 1017859 986918 983339 975430 1025824
11647 1025824 967599 919347 905366 932764 934049 897665 907885 927228 951758 969050 999321
11636I99321O011P610o693o8524R922p680J4003n7234n4247k4956l4219n4035
11624G29279R0264O4012l6325p0311p1373M3969J35357L7916j9124l091k7846
11613H72727o7103M533R058o539k6507j2763n2713l4000J5501N4913J0910o7527
11601G00490j4126O7680l001m6195r903P628Q951L7732K7098L5760J0257n8527
11589G63844m9524n1644l7134j2314J19448M6635l4364n4844l2539L2666P86m9582
11577F41434k4231j3148K2677K7890o824R410J4965K4969N7377Q480q8252j02558
11565E72189k7696L9976j9290k8285j2367o9619P7333Q9120K8922K8573k9634
11554F49222m0521j3400M473L4283k8791n4136J2947j5116m4329J4269r809K9582
$$ plain form
11636 999321 1005332 1012942 1006249 937725 947647 939967 953970 896736 842489 817533 783314 729279
11624 729279 819543 883555 847230 776919 705546 749515 884872 922788 903664 900573 872727
11613 872727 805624 810157 819215 812676 786169 773406 720693 686693 702194 757107 768017 700490
11601 700490 686364 754044 751043 704848 694945 702573 711524 749256 776354 812114 822371 763844
11589 763844 714320 662676 625542 613228 732676 779311 744947 690103 657564 690230 691016 641434
11577 641434 617203 604055 626732 654622 647798 657208 672173 697142 754519 762999 674747 572189
11565 572189 544493 584469 565179 536894 524527 454908 532241 621361 650283 678856 649222
11554 649222 608701 595301 599774 634057 605266 551130 564077 548961 504632 518901 509092 538674
11542E38674m4409o3859Q1921K1804l8068J0312L5577M3526k8349J5722N6457
11531F29308m7815l6733l9497j4426K05J4412J8659J4564K7877l2318m199l1153
11519D98884p850M7259O328J7006m1731k3260j2876j1669K919L4651k4819N0004
11507E34846O214J9882l945o286M833m6074m9061k782n1483n1853N336J9064M0606
11494D19297N7372K502L2475m2372q6131k5952M6703M1931o223J8198N8301p113
11482E08988l4686k5416N0538O9328q782j02226l9550m8073K141p858P5228M5495
11470D85127J7257J0428p8581j2656l6940J5087k8551l938K3905j2708K6453j6629
11458C88254o1564o524K0157L4126M8324K1603O374l0390M1797q8656o7900n1442
$$ plain form
11542 538674 494265 430406 512327 534131 496063 506375 541952 585478 557129 572851 629308
11531 629308 581493 544760 505263 490837 491042 505454 524113 538677 566554 534236 530037 498884
11519 498884 491034 538293 544621 561627 519896 496636 483760 472091 475010 509661 484842 534846
11507 534846 541060 560942 556997 550711 555544 509470 460409 457627 406144 354291 359627 378691 419297
11494 419297 476669 479171 511646 469274 383143 357191 403894 445825 439602 457800 516101 508988
11482 508988 474302 448886 499424 568752 559970 457744 418194 370121 372262 364404 439632 485127
11470 485127 502384 512812 434231 421575 384635 399722 371171 367233 391138 378430 404883 388254
11458 388254 326690 320166 340323 374449 422773 444376 450750 420360 462157 373501 305601 254159
11446B54159N4526K9875j4480l3907l683k8964n4963N1659Q5316L3045q158O572
11434C70997J8364J3509j2343j781j4693L5286j922q88m0566o0608Q680N871K5821
11421C45727J7650P203k4844M328M1732n2647j5520L8356j1841m0415k2764O4728
11409C51693P9883L0355n3405o0743L7001J2176l586j8003k4804m190k1331j0655
11397C14391q676J3943K6942k2365n1689j2834M1853N291n6744l9384O63J5763
11385B27154M7525K7038K8923J7291k7704o8902O315M4344M1653J9237M3804K2598
11373D29276M222j8818n5068l9654r3725l2418P0748L9672k9510r266M8347l0836
11361B82970l4043k4154K8511J1845L837k2934q147O605K8945L3931n0060k3996
$$ plain form
11446 254159 308685 338560 324080 290173 286490 257526 202563 254222 339538 372583 364425 370997
11434 370997 389361 402870 390527 388746 374053 409339 407417 406529 365963 305355 314035 319906 345727
11421 345727 363377 370580 345736 350064 391796 339149 323629 361985 350144 309729 286965 351693
11409 351693 431576 461931 408526 347783 384784 396960 393374 375371 350567 346377 325046 314391
11397 314391 305715 319658 346600 324235 272546 259712 301565 306856 250112 210728 211391 227154
11385 227154 274679 301717 330640 347931 320227 251325 257640 301984 343637 362874 406678 429276
11373 429276 433498 414680 359612 319958 226233 193815 264563 304235 274725 265459 313806 282970
11361 282970 248927 224773 253284 265129 268966 246032 237885 244490 273435 307366 257306 233310
11349B33310M1806k5917j2543K0670R828K5023j232r0087p954J8759m5428j1911
11337A54324l3957l1326n11M4840O776m6801M2050n4426L2939P26j5762N3592
11325A52464K1107J2009J6628L3982J7100j6644o501n6508j302K862J9319R517
11313B04033J9740o6224j708l1347m385J9024n482J0599j3772J5106L1621J6195
11301A93400J1648L4517O1357l0691q5476r9901k9001O4716L3847M301L6215Q974
11289B03906k1449N241k2810M825j1638j5287m05L2118j0491l9587K7471O4341
11277B16235m3935o68J7366q9512j9044M0695j5455l8974k1236M9759J545R875
11265A06651k933j034J158n302j1991o103k8505M2109O5275k5484j8424j3445
$$ plain form
11349 233310 275116 249199 236656 257326 267154 292177 290945 200858 192904 211663 166235 154324
11337 154324 120367 89041 88530 133370 140146 93345 135395 80969 113908 114634 98872 152464
11325 152464 173571 185580 202208 236190 253290 236646 230145 173637 172335 175197 194516 204033
11313 204033 223773 157549 155841 124494 120109 139133 133651 144250 130478 145584 177205 193400
11301 193400 205048 239565 300922 270231 184755 84854 55853 120569 154416 158717 194932 203906
11289 203906 182457 187698 164888 169713 158075 142788 142383 174501 164010 124423 151894 216235
11277 216235 172300 171632 188998 99486 80442 121137 105682 66708 45472 95231 96776 106651
11265 106651 103718 102684 103842 98540 86549 80446 51941 94050 159325 133841 115417 101972
11253A01972J0582J9686N1276k0929n3197j5465j5049j7973M3197R0425J6054
11242B10579n553n3229o4784J0234O6025J9833K8742K2016m8164j2290j8494J1244
11230A66159P0121O760m2311k7130M853m8421m3717O2016K6069n628m2061j9830
11218A06880K6380L7273q873l0221k343m341k2032J3029K6360K0189j3182Q235
11206A57354N0208L3394Q1615J63129J11451J34958P3576k9O90j89941k27851
11195C88554j36078j09090o108O196l4183N5224O0158k1979o7217k385q875O381
11183A30598k1890r552k1365n4421N6679k3509k7423k6687Q4470Q6413N491k4983
11171A53821M5353k8260J6695J9425j6034m1851j8365J8589J5710k2733l562m7616
$$ plain form
11253 101972 112554 132240 183516 162587 109390 93925 78876 60903 104100 194525 210579
11242 210579 205026 151797 87013 97247 163272 183105 211847 233863 185699 173409 154915 166159
11230 166159 236280 243040 200729 173599 178452 130031 86314 148330 174399 168771 126710 106880
11218 106880 133260 170533 161660 131439 129096 124755 102723 115752 142112 162301 149119 157354
11206 157354 207562 240956 322571 485700 597151 732109 805685 805656 806346 616405 388554
11195 388554 252476 143386 137278 143474 109291 164515 224673 202694 135477 133092 124217 130598
11183 130598 108708 99156 77791 23370 80049 56540 29117 2430 86900 173313 178804 153821
11171 153821 199174 170914 187609 207034 191000 149149 130784 149373 165083 142350 138788 91172
11159I1172l9332o3284j9382j725R922J9073o5405K1301M6995P1524J5601j7073
11147F9387K3187L6274n1791p1613J1825K0507J5227k9198R185J4674M0081M6964
11135A34709m2538n9664j5041R422Q902p441M3338j3025j8757O2351J1908l6939
11123G7225Q203j5868J0146j1015k6952j4041m586M2205m019N2276J406m6529
11111F8451o2931K2241K5039L5265M2940p988p7626m5676J8274P6379j1158k0910
11099F2300J0406n4387p825K4319k3497j1614N9350O3004J4026m0733l8282p1163
11087a4096L3581K3292l8208K057N6166K8425q787L0475p462L0537N3158J4276
11075B03414k8297j5963O774k4773j3676m6338J7225q056L2682N4882n3497r609
$$ plain form
11159 91172 51840 -11444 -30826 -32551 -22629 -3556 -68961 -47660 -665 70859 86460 69387
11147 69387 92574 128848 77057 5444 17269 37776 53003 23805 32990 47664 87745 134709
11135 134709 92171 32507 17466 26888 35790 28349 71687 58662 39905 102256 114164 77225
11123 77225 85428 69560 79706 68691 41739 27698 23112 65317 61298 113574 114980 68451
11111 68451 5520 27761 52800 88065 131005 123017 45391 -285 17989 94368 83210 62300
11099 62300 72706 18319 10494 34813 11316 -298 59052 122056 136082 95349 57067 -14096
11087 -14096 19485 42777 4569 6626 62792 91217 82430 112905 105443 135980 189138 203414
11075 203414 175117 159154 165928 141155 127479 81141 98366 90310 122992 177874 124377 114768
11063A14768J4561L0293l6338o706M01J2615L212o0257m6922J8045P9633N7469
11051A80774J0368L9457O7278N2686M7947J2655j3400l0437o5281r168j056J10109
11039D01932Q3861Q9690Q2816N9396M3583K5417p6751p9561Q053l8927m6273j4553
11027E38683P9243J50289K13696J65649m0238r7263j51157j49234l8886q9699
11017E81083r2277L2556P7256M4538Q1398Q6442J7631k2733n0118p1697j36717
11006E47362j54839q7585o344K0786Q916J0141R408K599j8782m3441l5846o3558
10994A88817m5143n896l8261k8192K0828n1989K060j7333K1568L9041m0601o7761
10982b2862K7854N1912L4644k9262q6009m7808Q981J8897P7645k10n7304m116
$$ plain form
11063 114768 129329 159622 123284 116578 116979 129594 132806 72549 25627 43672 123305 180774
11051 180774 191142 230599 297877 350563 398510 411165 397765 367328 302047 292879 291823 401932
11039 401932 485793 575483 658299 717695 761278 786695 709944 630383 638436 599509 553236 538683
11027 538683 617926 768215 981911 1147560 1107322 1010059 858902 709668 670782 581083
11017 581083 488806 521362 598618 643156 724554 810996 828627 805894 755776 684079 547362
11006 547362 392523 304938 298594 319380 328296 338437 347845 350444 331662 288221 252375 188817
10994 188817 143674 137778 99517 71325 92153 40164 42224 24891 46459 85500 44899 -22862
10982 -22862 4992 56904 91548 62286 -23723 -71531 -62550 -43653 33992 33782 -23522 -27638
10970b7638M6444P7451P134j2395m8706J0680M3071J7501J1313l1154k2961K0945
10958I1685O73m676O7065J74565J49845P3064M6299J3064p893o8513j05572k9846
10946C99760p4457j12727j35527r4483L5995L2584M8565j9878p4777m0634m709
10935d0288N7685L1232m6106k5355K3816L9088n1931p0055O5728Q2074O854J1986
10923H4728l5665m0615J2184k4230j1149O20k4665j1695M4359j2904P623O5906
10911E4497J1718k1918Q341m9799r126M2813M8387L1910m0059J9936L4150J4692
10899A45542p7669k9712N641N9708O8814j5851o8663l7074p545K0480J9J489j7217
10886D7962m4157J448N0762M3823J1524l822j9287k1140l6807o0470P398O6175
$$ plain form
10970 -27638 18806 96257 103391 90996 42290 52970 96041 113542 124855 93701 70740 91685
10958 91685 92358 87682 154747 329312 479157 552221 598520 611584 603691 535178 429606 399760
10946 399760 325303 212576 77049 -17434 18561 51145 99710 79832 5055 -35579 -40288
10935 -40288 17397 48629 2523 -22832 984 40072 -11859 -81914 -16186 65888 72742 84728
10923 84728 49063 8448 20632 -3598 -14747 -14127 -38792 -50487 -6128 -19032 -11409 54497
10911 54497 66215 44297 52638 2839 -6287 36526 84913 116823 76764 96700 130850 145542
10899 145542 67873 38161 43802 103510 172324 156473 87810 50736 43191 63671 63690 65179 47962
10886 47962 3805 5253 56015 99838 111362 107540 88253 67113 30306 -30164 -22766 43409
10874D3409J7167K4892J0504J7513J7725k1866k1533Q4862J1396l4640m7742j3536
10862H8151n3257k2895k3337K2687M9920n435J6337m118L9720j5375K3702N4914
10850A71014N6836m2647p7950K4845L8975m0800n6588l9968M861K2209k5070K6628
10838F2345M7637L9576N911k5247p6291j7149p9253k2018j1611J1224M6654L5283
10826A7061l632J7866k0756K2298l8765k0828J3392Q7553N2460p4296j15345p7571
10814a40563M5406M5997L491l0002k657J6157N6097L4426L342k0116k5003l9773
10802e3198J7863l522n9543J7149N5648k9320j209L1650O518L594L013k8652K1913
10789a8096l8150m7783K6293M3715Q2417K4534L0943L0397l3050n3480K1961L6988
$$ plain form
10874 43409 60576 85468 95972 113485 131210 109344 87811 172673 184069 149429 101687 88151
10862 88151 34894 11999 -11338 11349 61269 55834 72171 68053 107773 92398 116100 171014
10850 171014 227850 185203 107253 132098 171073 130273 73685 33717 38578 60787 35717 62345
10838 62345 109982 149558 155469 130222 53931 36782 -42471 -64489 -76100 -64876 -18222 17061
10826 17061 13429 31295 10539 32837 -5928 -26756 -13364 74189 126649 52353 -62992 -140563
10814 -140563 -95157 -49160 -45669 -75671 -78328 -62171 -6074 28352 31694 11578 -13425 -53198
10802 -53198 -35335 -38857 -98400 -81251 -25603 -54923 -56132 -24482 -17964 -14370 -11357 -40009 -18096
10789 -18096 -56246 -104029 -77736 -34021 48396 72930 103873 134270 101220 47740 69701 106689
10777A06689n1482j8095J3859l0536m5127K0350l7781M577L1680m4084p2113K0463
10765a01600O0361M1352J4851o696l1269O243N1983L005j6853q2118j7981M6956
10753c1766L6973M9869j986m1319j3105r969n4461j3588N6615N4977k0883L358
10741A4715k0399j6454j1206L5790L5648m1351J9142J397n9185M7677J6951j9212
10729C513k8275k1429l0740P470O1088l059p901J4211J727n7696K4037O3897P4783
10716A01626n1349p9002j4606M4027J3198K8886J0761J2383n4543l6255j8655
10705d3529k1376k347l9409Q3406P6996l7528j4423K5528R64m4138j9940J7499
10693a8297Q161j2400o501M9496K8607R178j0055p539L853j3325n2112J8525K0977
$$ plain form
10777 106689 55207 37112 50971 20435 -24692 -4342 -42123 -37546 -5866 -49950 -122063 -101600
10765 -101600 -41239 113 14964 8268 -23001 -16758 35225 38230 21377 -60741 -78722 -31766
10753 -31766 5207 55076 53090 11771 -1334 -11303 -65764 -79352 -22737 32240 11357 14715
10741 14715 -5684 -22138 -33344 2446 38094 -3257 15885 17282 -41903 5774 22725 3513
10729 3513 -24762 -46191 -76931 -69461 -8373 -11432 -19333 -5122 -3395 -61091 -37054 26843 101626
10716 101626 50277 -28725 -43331 696 13894 42780 53541 65924 11381 -24874 -43529
10705 -43529 -64905 -67252 -106661 -23255 53741 16213 1790 27318 28282 -15856 -35796 -18297
10693 -18297 -10136 -22536 -29037 20459 49066 58244 48189 40650 44503 31178 -20934 -2409 18568
10680A8568J3186k5094l9611m5551L5130Q0959L0539q356m8601j1111Q465N9219
10668F7742K3821K6800r516K0980K7788J0313j5950L1476M3262L9824K7918K3565
10656C18023M4548M8747L707M0302N6599O4316N8875J4595N4477P5269O7225Q7485
10644I34168J28908Q3712J41852J37357J05682J54321K35223K99225L95632M22814
10634C038894M70514L90896J71142J84237K78585L70464N10690P63675J139380
10625G318477J624406K293679L138994M293266N809770P500787R067188R445531
10617E0492098P651236L799803j98306k598434k883829j396662J380586M966406
10609F1212898R235536J4168171J8404587J9160947J3638082L099233o737645
$$ plain form
10680 18568 31754 6660 -32951 -78502 -43372 37587 68126 59770 11169 58 8523 67742
10668 67742 91563 118363 108847 129827 157615 167928 151978 183454 226716 266540 294458 318023
10656 318023 362571 411318 415025 455327 511926 576242 635117 649712 704189 779458 846683 934168
10644 934168 1063076 1146788 1288640 1425997 1531679 1686000 1921223 2220448 2616080 3038894
10634 3038894 3509408 3900304 4071446 4255683 4534268 4904732 5415422 6179097 7318477
10625 7318477 8942883 11236562 14375556 18668822 24478592 31979379 41046567 50492098
10617 50492098 58143334 61943137 61744831 59146397 56262568 54865906 56246492 61212898
10609 61212898 70448434 84616605 103021192 122182139 135820221 138919454 132181809
10602A32181809j1654706j1435237p546099j858091M569887J1602288J8655393
10595A34515244K3755688K3116063J3420502k884817j6622389k2682442k1648994
10588A30968855j6317503r594837k944076L396622R012179J2480352J1280815
10581A38282407L839837p018787j5515575j8527027j6859790j2777441q120060
10574F3303564m004629n95952J839380L051863K125048j082296n237408q379930
10566E1019640r434964q631516p051343n424954l974783k962167k205984j623185
10558I710744j258976j060806q37798o46502n95956m84777m79340l95349k62758
10549C688482k46082k22348k41387j44433j53991j83167k13134j34763o7633q1898
$$ plain form
10602 132181809 120527103 109091866 101545767 99687676 104257563 115859851 134515244
10595 134515244 158270932 181386995 194807497 191922680 175300291 152617849 130968855
10588 130968855 114651352 105056515 102112439 105509061 114521240 127001592 138282407
10581 138282407 142122244 135103457 119587882 101060855 84201065 71423624 63303564
10574 63303564 59298935 58702983 60542363 63594226 65719274 64636978 59399570 51019640
10566 51019640 41584676 32953160 25901817 20476863 16502080 13539913 11333929 9710744
10558 9710744 8451768 7390962 6553164 5906662 5310706 4825929 4346589 3951240 3688482
10549 3688482 3442400 3220052 2978665 2834232 2680241 2497074 2283940 2149177 2081544 1999646
10539A999646p8970j04977m2643k846k7263j50757j42295q4462N342K2538j5739
10528A377574l7244n6849j9044k5714l926m6967r5271m0750j765M312m0421p5550
10516I38385P272l0953R288j0941l5449m0705n4155K957L6757o1707O972O5809
10504H33530R214K014o8164o9769k8176p684R880o573k4840J0950J0077J2159
10492F82618M016n0151o2332m9500K3478j8354p806N7841O187J874K298k8809
10480E61360j9420k567J3689J5672j3006n1324l4695K5105K3898l1557k9121M1892
10468D99926M9517J894m9655n1454l2408l0288K306J5283p320n9260l6728j3944
10456B87869L3526K0236j5864K8508M2736P940p1583l4616M1016K184J4105N0383
$$ plain form
10539 1999646 1920676 1815699 1773056 1770210 1742947 1592190 1449895 1365433 1370775 1393313 1377574
10528 1377574 1340330 1283481 1264437 1238723 1234797 1187830 1092559 1051809 1050044 1054356 1013935 938385
10516 938385 945657 914704 923992 913051 877602 836897 782742 785699 822456 760749 767721 833530
10504 833530 842744 844758 776594 706825 678649 670965 680845 674272 649432 660382 670459 682618
10492 682618 686634 636483 574151 524651 548129 529775 521969 579810 585997 587871 590169 561360
10480 561360 541940 539373 553062 568734 555728 504404 469709 494814 518712 487155 458034 499926
10468 499926 549443 551337 501682 450228 417820 387532 389838 405121 397801 338541 301813 287869
10456 287869 321395 341631 325767 354275 397011 404951 333368 298752 339768 341952 356057 406440
10444D06440N950l3415M284l9672k8199J5837J6723k6429n1969N2261L9173m987
10432C55997K5126l625q6006q3615o910k9987j0333j2408k712J2503J1179K9680
10420A98889j6446L5594K6938j7589J2408l2141l6491M5331M4942j9291p0430
10409A71714n8039R5642R7584O224o8261j3544k7828J6532j4840m3919O079n3731
10397A13613j1535R1228K439q9955n4510o752j2527M2003L0450l6427J7511J5687
10385A01225k0196L9023L1237K2912O6478l7518p4342k0818L6008J49092L4037
10374C27138M2919j8107o5190r4752j03923O674K2920K1125L4604M4004K6903
10363B44315o90k4936k2273L658j9727m900l6663q7581J3987R8137L8698j6086
$$ plain form
10444 406440 412390 378975 383259 343587 315388 331225 347948 321519 269550 321811 360984 355997
10432 355997 381123 377498 291492 207877 200967 170980 160647 148239 145527 158030 169209 198889
10420 198889 182443 218037 244975 227386 239794 207653 171162 216493 261435 242144 171714
10409 171714 113675 209317 306901 313125 244864 231320 203492 220024 205184 161265 167344 113613
10397 113613 102078 193306 195745 105790 51280 44528 32001 74004 104454 68027 85538 101225
10385 101225 81029 120052 151289 174201 240679 203161 128819 108001 144009 293101 327138
10374 327138 370057 351950 286760 192008 88085 94759 117679 138804 173408 217412 244315
10363 244315 243625 218689 196416 200074 180347 175447 138784 51203 65190 163327 202025 185939
10351A85939J52N2442o9710p4257o526L8428L6496K1775j9543J4881N0593m063
10339B26607l3906m9368l0829J2883J5130Q273k5625j4176K825R28m4695J8123
10327H6170k3612k8394L6001L2150L5852L1371L6901l5110l5110q022n3044K775
10315G7928K1414m344K0838O5377q04o071k6325j4847Q555K101k1745L1737P071
10302A60885L477k9138l1067m6395k718L6303L1273J1976O508J7100j0751l919
10290A43534M5664j3030L020K7297p9423q9131M6970K3181p7889l7024j7546M3661
10278A9284k1746m1557p01M1281Q5563j5121N766L3773m0613k2166J3744K1597
10266G9104p047K7603O1809j6688j9193j6072p92J5021o5439l2006j1915K7985
$$ plain form
10351 185939 186091 238533 168823 94566 88040 126468 162964 184739 165196 180077 230670 226607
10339 226607 192701 143333 112504 125387 140517 148790 123165 108989 111814 112742 68047 86170
10327 86170 62558 34164 70165 102315 138167 169538 206439 171329 136219 128197 75153 77928
10315 77928 99342 94998 115836 181213 180409 174338 148013 133166 141721 143822 122077 153814 160885
10302 160885 164362 135224 104157 57762 55044 91347 122620 134596 141104 158204 147453 143534
10290 143534 189198 176168 179188 206485 127062 37931 84901 108082 30193 -6831 -24377 19284
10278 19284 -2462 -44019 -44720 -3439 82124 67003 72769 106542 65929 43763 57507 79104
10266 79104 72057 99660 161469 144781 125588 109516 108724 123745 58306 26300 14385 42370
10254D2370k111J5701L9709K1090J91p5105k70R4859K6180r509o3055l2944M9450
10241A06556K9102Q163k2360m9183l0765k124M2122M7914N7598k0813R734O508
10229A82452R801p9848j03312l7779L6512N9037J0928k0645l1506k0977L6146
10218D0809M8302J0615J0458l3094R042J7959n0523k6089N681j4527r99J1770
10206B9404P4287m2802l0223L4372Q803J6649M4685m4493l2450R857P417l1561
10194D3945R973J799j4683n614J3836Q0881O0259Q27K4063L6827K6561Q5761K3704
10181C88139J2211L1541L2643j2330j594o5286j7966K1117J06569K5151M0125
10170E60320J00803J31074O1835j6202o6133j01712q6391N039N9128Q0155O4460
$$ plain form
10254 42370 40259 55960 95669 116759 116950 41845 41575 136434 162614 153105 90050 57106 106556
10241 106556 135658 143821 121461 72278 41513 39389 81511 129425 187023 166210 175944 182452
10229 182452 192253 112405 9093 -28686 7826 66863 77791 57146 25640 4663 40809
10218 40809 89111 99726 110184 77090 86132 104091 53568 27479 33160 18633 17634 29404
10206 29404 103691 60889 30666 65038 73841 90490 135175 90682 58232 68089 75506 43945
10194 43945 53918 55717 41034 35420 49256 130137 190396 191223 215286 252113 278674 364435 388139
10181 388139 400350 431891 464534 452204 450610 385324 367358 388475 495044 520195 560320
10170 560320 661123 792197 854032 837830 771697 669985 583594 588633 647761 727916 792376
10159G92376M4329J21308R6238P2682p2634j57853j23421j5675j2124l1575k5754
10148F87897k1798J7502O4967M7376L5782p2509j01053j04940o8431p8998l1990
10137C73805k5694M6941O5079r413m5718R334n3121j998k3727o2140m1169j4678
10125B17501l4083n4481m1942N535Q7118L2968o3866l9443M7447r552p4467j8706
10113E4029k2313m8258J1634M8623K8911N1444q646j5556j4370m2744n4519J7620
10101E855O1346m4728n9746K0728l4306J5927O1335M6151M7698j2147l4123k2190
10089E1800m1457K1444O8846K5017M942m6210n21K921k4777m8676k5670J1942
10077c99K7910R705p053K7583r667m8252k3282O5563j4860O489P957k3709m9498
$$ plain form
10159 792376 836705 958013 1054251 1126933 1054299 896446 773025 757350 745226 713651 687897
10148 687897 666099 683601 748568 795944 831726 759217 658164 553224 484793 405795 373805
10137 373805 348111 395052 460131 450718 405000 414334 361213 359215 335488 273348 232179 217501
10125 217501 183418 128937 86995 92530 179648 212616 148750 109307 156754 147202 72735 54029
10113 54029 31716 -16542 -4908 43715 72626 124070 115424 99868 85498 42754 -11765 5855
10101 5855 67201 22473 -37273 -16545 -50851 -34924 26411 72562 120260 108113 73990 51800
10089 51800 10343 31787 100633 125650 130592 84382 83861 86782 62005 13329 -12341 -399
10077 -399 27511 37216 30163 57746 48079 -173 -23455 42108 27248 33737 41694 17985 -31513
10064c1513N0929K6134K1271K5143k0140k3912j7263l7283K2438J8645k3255p8950
10052f7756L4712K8394J8625P5012R686k6883m0179j5117j5223k2463M005K0149
10040B962J991m77m909J2616L5853J8085m2765M349r523j8388N6112j1651j3617
10027C0638K7153j269o864j7212j4594O4367N4966m9928l7864L1458j3963j5998
10015E0890r481O0397R3312k9963J347j5871j5954n3699k7952o6435m5524m949
10003f3882q97K607K6441j0262L5610L0873N4617j1242R1010M3421p4962r4941
9991B8393p3374N3383K5656o4357m614M8283N0114l8249M2203K931m221L4718
9979A00866K2633k5356K425Q022R17j5737n7038j4860O7521K3994j4392l6447
$$ plain form
10064 -31513 19416 45550 66821 91964 71824 47912 30649 -6634 15804 34449 11194 -67756
10052 -67756 -33044 -4650 13975 88987 98673 71790 31611 16494 1271 -21192 -17187 2962
10040 2962 4953 4476 -433 12183 48036 66121 23356 27705 18182 -206 55906 44255 30638
10027 30638 57791 56522 49658 32446 17852 82219 137185 87257 49393 80851 66888 50890
10015 50890 41409 101806 195118 165155 166502 150631 134677 80978 53026 -13409 -58933 -63882
10003 -63882 -64779 -62172 -35731 -45993 -10383 20490 75107 63865 154875 198296 123334 28393
9991 28393 -44981 8402 34058 -30299 -34913 13370 63484 25235 67438 70369 66148 100866
9979 100866 123499 98143 100568 108590 109507 93770 36732 21872 89393 113387 98995 62548
9967F2548j7535J6350j4706k3264m1351N8087P6900L3402K10n1770k9713m8010
9955B1148o79N5925k2032m1096k1114n681k4780J3612L471n184K720R820m116
9942a7986j3489K707J5050m5026l748N2547N937o3783p230P5234N0343K961K5573
9929G9090m2467k8970P35L0161j5327o50k7116J2563l339o3124J0507R4725J0485
9916E7273j4791J3975J7464K5963J8911m2665J9875j360Q213k1720o0302M015
9904B4851O0482R654n2974q0001N496J23203Q0559m4218m2484j2993j353k9582
9892D0640k6248L5067l088r92J8856k9388p882K2008J2690k8390q196J0630Q339
9879D4046Q15j05148n2452P8934P4466L2333r245k4439n7534N0391K3931j0347
$$ plain form
9967 62548 45013 61363 46657 23393 -17958 40129 117029 150431 150641 98871 69158 21148
9955 21148 20469 76394 54362 13266 -7848 -13529 -38309 -24697 -21226 -26410 -23690 -13870 -17986
9942 -17986 -31475 -28768 -13718 -58744 -62492 -9945 -4008 -67791 -75021 213 50556 53517 79090
9929 79090 36623 7653 8388 38549 23222 22572 -4544 8019 4680 -58444 -47937 46788 57273
9916 57273 42482 56457 73921 99884 118795 76130 96005 94645 102858 81138 20836 24851
9904 24851 85333 94987 42013 -37988 -32492 90711 171270 127052 84568 71575 70222 40640
9892 40640 14392 49459 46371 45379 64235 34847 26965 48973 61663 33273 25077 35707 44046
9879 44046 44861 -60287 -112739 -33805 40661 72994 63749 39310 -18224 32167 56098 45751
9867D5751l6038M1858k5092n0628J0639L5301L343J8964q0261l2310j418M686
9855f5205L9512n574J7330L1113k2144k2820l9375O5542N0635q589j7649k0274
9843B502K1571Q030k3272o1873L0141M8578m127O50J0138L0373K5891L287l6868
9830E5021o475R433q902k0802N288M748l080Q183K283Rn2846k7136O0510O7210
9816I3444j0864k742l148m2393n2298J3100k9366j8469K2747J10222k8842n2267
9804h76k4271L344l740N7950L5621J482r470m422K3093K330J6952l9673m1809
9791A6511K8535l4843q1473M9379j0788k328O1590k2884j9309M1303J2893k4211
9779A4375n713j036J0185l6437l5455j1576J7050L2016Q7214P4333k5443l9159
$$ plain form
9867 45751 9713 51571 26479 -24149 -13510 21791 25134 44098 -36163 -68473 -69891 -65205
9855 -65205 -25693 -31267 -13937 17176 -4968 -27788 -67163 -1621 49014 40425 22776 2502
9843 2502 24073 32103 8831 -53042 -22901 25677 21550 22200 32338 62711 88602 91889 55021
9830 55021 48546 57979 49077 28275 33563 38311 35231 43414 45697 45706 -7140 -34276 26234 93444
9816 93444 82580 79838 76690 34297 -18001 -4901 -34267 -52736 -29989 80233 51391 -876
9804 -876 -25147 -21803 -25543 32407 68028 69510 60040 55618 78711 81041 97993 58320 16511
9791 16511 45046 10203 -71270 -21891 -32679 -35007 26583 3699 -15610 25693 38586 14375
9779 14375 8662 7626 17811 -18626 -54081 -65657 -48607 -16591 70623 144956 119513 80354
9767H0354P972l4683p4143n803k3431L8388k4786J1151N1316L8575N4357L8837
9755A58104o7441L573k0243m9409l1623j9076j283K734L9482j7440o327j7864
9743b6813J1675Q272J2844K277O2473Q5317n329K8769M0361j23189r3819N47j4803
9730a1418K4603n6491L5116J8091L7582M0203k6570M5507K3618l0460K0938j6270
9718A04449R049j4179k299K316M1447q107m7454j4536l939p6436k101K2915O8642
9705G9767J6518j5093l2008q400L5061L9017j8879J900l518J1796k5168m5816
9693C5177p1153m1822O0688N8491N04p57J3270j7121L135j9279o162k3232k9664
9680c7925L633J0372J8123K0447J4810k1244Q686k9450J650J5875j2871O713j0888
$$ plain form
9767 80354 88326 53643 -20500 -26303 -49734 -11346 -36132 -24981 26335 64910 119267 158104
9755 158104 90663 94236 73993 24584 -7039 -26115 -27398 -24664 14818 -2622 -8949 -26813
9743 -26813 -15138 -6866 5978 8255 70728 156045 150716 179485 219846 96657 2838 3385 -11418
9730 -11418 13185 -43306 -8190 9901 47483 87686 61116 106623 130241 99781 120719 104449
9718 104449 113498 99319 97020 99336 140783 132676 85222 70686 66747 -9689 -11790 11125 79767
9705 79767 96285 81192 49184 40784 75845 114862 95983 97883 94365 106161 80993 35177
9693 35177 -35976 -77798 -17110 41381 41885 41128 54398 37277 40412 21133 14971 -8261 -37925
9680 -37925 -34292 -23920 -5797 14650 29460 8216 16902 -12548 -10898 4977 -7894 -1181 -12069
9667a2069p053N1214m169k9442J736L1913J23440J15864J80417K62081K78049
9656I91981K92001p4824k12506k77828k49436j53639j50331n9283K1397j8705
9646A08827o5147j3187o6055L3443q276P690K3895P784l9586j3736M2437J7332
9634C5421l5611J0750j7717K5957L5848k5204k3106q219j5027j4490L428N3044
9622B5074o3181j0883M6281K4221j9562m6699k469M4492K1898O319J9265K5951
9610G0707m7325j02977j2615M5065Q9215L3663m65l2851l3440k0574l4867p8597
9598a25061J3664O2013K941k9653L0261K9470j1564j0345j4706N4577L951L7868
9586D3416N5976J5698k0766m6315l8267j9446L9651K5447n9204j5046J5552j6498
$$ plain form
9667 -12069 -19122 32092 27923 -1519 217 32130 155570 271434 451851 713932 991981
9656 991981 1283982 1209158 996652 718824 469388 315749 165418 106135 127532 108827
9646 108827 43680 30493 -35562 -2119 -10395 -2705 21190 28974 -10612 -24348 18089 35421
9634 35421 -190 10560 -7157 18800 54648 29444 6338 -1881 -16908 -31398 -27970 25074
9622 25074 -38107 -48990 -2709 21512 1950 -44749 -47218 -2726 19172 25491 44756 70707
9610 70707 23382 -79595 -92210 -47145 42070 75733 75268 42417 8977 -11597 -46464 -125061
9598 -125061 -111397 -49384 -46443 -76096 -45835 -16365 -27929 -38274 -52980 1597 5548 43416
9586 43416 99392 115090 94324 48009 9742 -9704 29947 55394 -3810 -18856 -3304 -19802
9574a9802M6805L3700k6245L4678k9937l448l7061K4414O0636K0548q2748k8086
9562f546L7158J7867k104l5472n9779J7964M7849L8808k598Q627J0103J2925l8991
9549D5811L503O721n7470j7247J1620l0125K8478m758l2683J072J8520K0974j9297
9536b4881j2768j8020O919K6932Q673J860j5758O283J9509J6663j5014k809O1004
9523E8593l7566n3374L0719J4390k4644q5870j2155M1225k4517J7651M4646K9362
9511a540j9497n0609l1153L8166N1502n862l1320M3439O1646r687l0435L0013
9499D4663j7130q134n268O3962O1482j1206l7190m9961n3455k0540l0315O8817
9487E725L3772J1170o7866n4375L2025p409p4592j9310P4578M4344N6873j2591
$$ plain form
9574 -19802 27003 60703 34458 69136 39199 35751 -1310 23104 83740 104288 21540 -6546
9562 -6546 30612 48479 46375 10903 -48876 -30912 16937 55745 53147 61774 71877 84802 45811
9549 45811 49314 56035 -1435 -18682 -7062 -37187 -8709 -13467 -46150 -45078 -26558 -5584 -24881
9536 -24881 -37649 -55669 -48750 -21818 -13145 -11285 -27043 -20760 -1251 15412 398 -2411 58593
9523 58593 21027 -32347 -1628 12762 -11882 -97752 -109907 -68682 -93199 -75548 -30902 -1540
9511 -1540 -21037 -71646 -102799 -64633 -13131 -18993 -50313 -6874 54772 45085 14650 44663
9499 44663 27533 19399 14131 78093 139575 128369 91179 41218 -12237 -32777 -63092 5725
9487 5725 39497 50667 -17199 -71574 -39549 -46958 -121550 -140860 -66282 -21938 34935 22344
9475B2344j3919j6830O53n061K8276L6263l3769j498J4798J8798q1604j0587Q7364
9462D5228K7727p0852p5032P0074N7762k7470K475l474N0161J5063j805m9961
9450C9896Q344J5421l5887m4463J9553L3814P905n1888n6807K3984l8443L007
9438g5564M4638r069O0022k4240l8043L7148o8374n8667J8780J7842j6973J3594
9426i8906M9757K2096N994k2371L3751J1921L1324n1612k1588p365J0920j8971
9414e5050R8302m3169l3991k8922r841j1255L707K460P2080J8579L8883M2342
9402I4125r3280p6160l36M2977l644J5742J7267k2147o015K7650J03116m4314
9390E4981l2514N122K3864k3528j0877M577K0762J824N810m8633k6790n3501o2928
$$ plain form
9475 22344 8425 -8405 -7752 -12813 15463 51726 17957 16459 31257 50055 -31549 -42136 45228
9462 45228 72955 2103 -72929 -2855 54907 27437 29912 26438 76599 91662 89857 39896
9450 39896 48240 63661 27774 -16689 2864 36678 44583 -7305 -64112 -40128 -78571 -75564
9438 -75564 -30926 -39995 20027 -4213 -42256 -5108 -73482 -132149 -113369 -95527 -112500 -98906
9426 -98906 -49149 -27053 -21059 -43430 -9679 2242 33566 -18046 -39634 -46999 -36079 -55050
9414 -55050 43252 83 -33908 -62830 -72671 -83926 -80219 -77759 -5679 12900 51783 94125
9402 94125 845 -75315 -75651 -32674 -36318 -20576 -3309 -25456 -31471 -3821 99295 54981
9390 54981 22467 27589 51453 27925 17048 21625 42387 44211 50021 1388 -25402 -78903 -141831
9377a41831K8938Q2685N1674M5082k4285k2015J543J6587N6291M9969l4165q399
9365A02074j8399l1847K7617K7433o1854m9662J249P5837k1970k726L3303L6200
9353A17255l2985k1725Q332P189o1664o3346j7382L6389J226L7985M7176K6533
9341H4983k5123K4477K9488j9566k0450n8013J5071K1427J4293K0779m8987q7267
9329d8888j7002L2440J9743M6110Q1904l3382k9177l1697k4610m1840j7384m001
9317f7784J1856l0304m3758o930L116J5556Q7684N3642L8806p926l4604j1768
9305G586l3517J5972N8504o528m6253k5217K371M9677J1318j5682K2821J2155
9293E3207K8577m1350l4486O12J6794m0295j9239M7978L905l1940m4370j8157
$$ plain form
9377 -141831 -112893 -30208 21466 66548 42263 20248 21791 38378 94669 144638 110473 102074
9365 102074 83675 51828 79445 106878 45024 -4638 -3389 72448 50478 47752 81055 117255
9353 117255 84270 62545 70877 78066 16402 -46944 -64326 -27937 -26711 11274 58450 84983
9341 84983 59860 84337 113825 94259 73809 15796 30867 52294 66587 87366 38379 -48888
9329 -48888 -65890 -33450 -13707 32403 114307 80925 51748 20051 -4559 -46399 -63783 -67784
9317 -67784 -55928 -86232 -129990 -136920 -133804 -118248 -30564 23078 61884 53958 19354 7586
9305 7586 -25931 -9959 48545 42017 -4236 -29453 -27082 22595 33913 18231 41052 53207
9293 53207 81784 40434 5948 6560 23354 -16941 -36180 11798 15703 -16237 -60607 -78764
9281g8764L5258L1055r555l3072M1222k0377j428K9115l848l96n4512K3987P6265
9268C4950Q592m4129M7015n1770n1913P4968m0897m6235L494o735M4485k7614
9256e5789N5345M9962k0207J8108Q790k9293j09828k2723N0870N7323l5103L7342
9244D797O8679P768N3743J8114o5885k5443M3724o842m1064K77m7120r991m3106
9231d2349K307j746j886m2874L1178L1740l2048K0128L6912J7082K6638m0110
$$ plain form
9281 -78764 -43506 -12451 -22006 -55078 -13856 -34233 -35661 -6546 -10394 -10790 -65302 -41315 34950
9268 34950 43542 -587 46428 -5342 -57255 17713 -23184 -69419 -65925 -72660 -28175 -55789
9256 -55789 -444 49518 29311 47419 56209 26916 -82912 -105635 -54765 2558 -32545 4797
9244 4797 73476 81244 134987 153101 87216 61773 105497 98655 57591 57868 10748 757 -42349
9231 -42349 -40042 -41788 -43674 -86548 -55370 -23630 -55678 -35550 1362 18444 45082 4972
$$ [...]
##END NTUPLES=NMR SPECTRUM
##END=
