##TITLE=Analysis number 329950
Compound Code cc 63704
Book Reference 464/188/1
Project Code adrs
Chemist Name chrisr
##JCAMPDX= 6.0         $$ Bruker NMR JCAMP-DX V2.0
##DATA TYPE= NMR SPECTRUM
##DATA CLASS= NTUPLES
##ORIGIN= Bruker BioSpin GmbH
##OWNER= nmr
$$ XWIN-NMR		Version 3.5
$$ Mon Oct 15 12:26:40 2007 GMT Daylight Time (UT+1h)  MAYBRIDGE\nmr@NMR_250MHZ
##.OBSERVE FREQUENCY= 250.131544655141
##.OBSERVE NUCLEUS= ^1H
##.ACQUISITION MODE= SIMULTANEOUS (DQD)
##.ACQUISITION SCHEME= undefined
##.AVERAGES= 16
##.DIGITISER RES= 18
##SPECTROMETER/DATA SYSTEM= dpx250
##.PULSE SEQUENCE= zg30
##.SOLVENT NAME= CDCl3
##.SHIFT REFERENCE= (INTERNAL, CDCl3, 0, 16.4419)
##AUDIT TRAIL= $$ (NUMBER, WHEN, WHO, WHERE, WHAT)
$$ ##TITLE= Audit trail, XWIN-NMR		Version 3.5
$$ ##JCAMPDX= 5.01
$$ ##ORIGIN= Bruker BioSpin GmbH
$$ ##OWNER= nmr
$$ C:\u/data/dgb/nmr/ADRS/740/pdata/1/auditp.txt
$$ ##AUDIT TRAIL=  $$ (NUMBER, WHEN, WHO, WHERE, WHAT)
(   1,<2007-10-15 12:26:16.73 +100>,<MAYBRIDGE\nmr>,<NMR_250MHZ>,
      <created by zg, POWCHK disabled, PULCHK disabled
       configuration hash MD5:
       76 6E 9A 78 1E 09 19 81 EC 84 63 8F B0 6A 59 2D
       data hash MD5: 64K
       24 D3 01 6A A4 9D 07 06 6A 3E F3 99 58 74 DD 10>)
(   2,<2007-10-15 12:26:30.80 +100>,<MAYBRIDGE\nmr>,<NMR_250MHZ>,
      <Start of raw data processing
       ef LB = 0.3 FT_mod = 6 PKNL = 1 SI = 32K 
       data hash MD5: 32K
       CB 98 5C CA 6D 10 B1 23 51 4B 2E 11 1E 55 D6 6C>)
(   3,<2007-10-15 12:26:32.40 +100>,<MAYBRIDGE\nmr>,<NMR_250MHZ>,
      <apk 
       data hash MD5: 32K
       9D 73 72 06 0C A1 05 AF 58 C5 7C 7B 1E 16 E7 C7>)
(   4,<2007-10-15 12:26:33.10 +100>,<MAYBRIDGE\nmr>,<NMR_250MHZ>,
      <abs ABSG = 5 
       data hash MD5: 32K
       40 4A B3 61 01 6D 15 B0 88 87 20 1D 0E F5 82 54>)
$$ ##END=
$$ 
$$ hash MD5
$$ 35 39 18 91 64 47 D4 3E B7 1B 87 8D 65 5F A0 5C
##$RELAX= 
##$RELAX= 
##$RELAX= 
##$RELAX= 
##$RELAX= 
##$RELAX= 
##$RELAX= 
$$ Bruker specific parameters
$$ --------------------------
##$DU= <C:\u>
##$EXPNO= 740
##$NAME= <ADRS>
##$PROCNO= 1
##$TYPE= <nmr>
##$USER= <dgb>
##$AMP= (0..31)
100 100 100 100 100 100 100 100 100 100 100 100 100 100 100 100 100 100 
100 100 100 100 100 100 100 100 100 100 100 100 100 100 
##$AQSEQ= 0
##$AQ_mod= 3
##$AUNM= <au_zg>
##$AUTOPOS= <18 >
##$BF1= 250.13
##$BF2= 250.13
##$BF3= 250.13
##$BF4= 250.13
##$BF5= 500.13
##$BF6= 500.13
##$BF7= 500.13
##$BF8= 500.13
##$BYTORDA= 1
##$CFDGTYP= 0
##$CFRGTYP= 5
##$CHEMSTR= <none>
##$CNST= (0..31)
1 1 145 1 1 1 1 1 1 1 1 1 1 1 1 1 1 1 1 1 1 1 1 1 1 1 1 1 1 1 1 1 
##$CPDPRG= <>
##$CPDPRG1= <>
##$CPDPRG2= <>
##$CPDPRG3= <>
##$CPDPRG4= <mlev>
##$CPDPRG5= <mlev>
##$CPDPRG6= <mlev>
##$CPDPRG7= <mlev>
##$CPDPRG8= <mlev>
##$CPDPRGB= <>
##$CPDPRGT= <>
##$D= (0..31)
0 1 0 0 0 0 0 0 0 0.06 0 0 0 0 0 0 0.0002 0 0 0 0 0 0 0 0 0 0 0 0 0 0 
0 
##$DATE= 1192447575
##$DBL= (0..7)
120 120 120 120 120 120 120 120 
##$DBP= (0..7)
150 150 150 150 150 150 150 150 
##$DBP07= 0
##$DBPNAM0= <>
##$DBPNAM1= <>
$$ [...]
##$SUBNAM7= <"">
##$SUBNAM8= <"">
##$SUBNAM9= <"">
##$SW= 20.6930455092707
##$SWIBOX= (0..15)
0 0 3 0 0 0 0 0 0 0 0 0 0 0 0 0 
##$SW_h= 5175.983436853
##$TD= 65536
##$TD0= 1
##$TE= 296.16
##$TE2= 300
##$TE3= 300
##$TEG= 300
##$TL= (0..7)
0 120 120 120 120 120 120 120 
##$TP= (0..7)
150 150 150 150 150 150 150 150 
##$TP07= 0
##$TPNAME0= <>
##$TPNAME1= <>
##$TPNAME2= <>
##$TPNAME3= <>
##$TPNAME4= <>
##$TPNAME5= <>
##$TPNAME6= <>
##$TPNAME7= <>
##$TPOAL= (0..7)
0.5 0.5 0.5 0.5 0.5 0.5 0.5 0.5 
##$TPOFFS= (0..7)
0 0 0 0 0 0 0 0 
##$TUNHIN= 0
##$TUNHOUT= 0
##$TUNXOUT= 0
##$USERA1= <user>
##$USERA2= <user>
##$USERA3= <user>
##$USERA4= <user>
##$USERA5= <user>
##$V9= 5
##$VALIST= <valist>
##$VCLIST= <CCCCCCCCCCCCCCC>
##$VD= 0
##$VDLIST= <DDDDDDDDDDDDDDD>
##$VPLIST= <PPPPPPPPPPPPPPP>
##$VTLIST= <TTTTTTTTTTTTTTT>
##$WBST= 1024
##$WBSW= 4
##$XGAIN= (0..3)
0 0 0 0 
##$XL= 0
##$YL= 0
##$YMAX_a= 514356
##$YMIN_a= -574206
##$ZGOPTNS= <>
##$ZL1= 120
##$ZL2= 120
##$ZL3= 120
##$ZL4= 120
##$ABSF1= 16.44185
##$ABSF2= -4.251322
##$ABSG= 5
##$ABSL= 3
##$ALPHA= 0
##$AQORDER= 0
##$ASSFAC= 0
##$ASSFACI= 0
##$ASSFACX= 0
##$ASSWID= 0
##$AUNMP= <proc_1d>
##$AZFE= 0.1
##$AZFW= 0.1
##$BCFW= 0
##$BC_mod= 0
##$BYTORDP= 0
##$COROFFS= 0
##$CY= 12.5
##$DATMOD= 1
##$DC= 0
##$DFILT= <>
##$DTYPP= 0
##$F1P= 14.0000005364418
##$F2P= -0.99999901652339
##$FCOR= 0.5
##$FTSIZE= 32768
##$FT_mod= 6
##$GAMMA= 0
##$GB= 0
##$INTBC= 1
##$INTSCL= 1
##$ISEN= 128
##$LB= 0.3
##$LEV0= 0
##$LPBIN= 0
##$MAXI= 10000
##$MC2= 0
##$MEAN= 0
##$ME_mod= 0
##$MI= 0
##$NCOEF= 0
##$NC_proc= -4
##$NLEV= 6
##$NOISF1= 0
##$NOISF2= 0
##$NSP= 0
##$NTH_PI= 0
##$NZP= 0
##$OFFSET= 16.44185
##$PC= 1
##$PHC0= 159.6473
##$PHC1= 7.434157
##$PH_mod= 1
##$PKNL= yes
##$PPARMOD= 0
##$PSCAL= 4
##$PSIGN= 0
##$REVERSE= no
##$SF= 250.130020046884
##$SI= 32768
##$SIGF1= 0
##$SIGF2= 0
##$SINO= 400
##$SIOLD= 32768
##$SREGLST= <1H.CDCl3>
##$SSB= 0
##$STSI= 32768
##$STSR= 0
##$SW_p= 5175.98343685301
##$SYMM= 0
##$S_DEV= 0
##$TDeff= 65536
##$TDoff= 0
##$TI= <Analysis number 999999
Compound Code 99
Book Reference 9
Project Code 9>
##$TILT= no
##$TM1= 0
##$TM2= 0
##$TOPLEV= 0
##$USERP1= <user>
##$USERP2= <user>
##$USERP3= <user>
##$USERP4= <user>
##$USERP5= <user>
##$WDW= 1
##$XDIM= 32768
##$YMAX_p= 404291340
##$YMIN_p= -330221
$$ End of Bruker specific parameters
$$ ---------------------------------
##NTUPLES= NMR SPECTRUM
##VAR_NAME=  FREQUENCY,     SPECTRUM/REAL,   SPECTRUM/IMAG
##SYMBOL=    X,             R,               I
##VAR_TYPE=  INDEPENDENT,   DEPENDENT,       DEPENDENT
##VAR_FORM=  AFFN,          ASDF,            ASDF
##VAR_DIM=   32768,         32768,           32768
##UNITS=     HZ,            ARBITRARY UNITS, ARBITRARY UNITS
##FACTOR=    0.157963299565203, 1,           1
##FIRST=     4112.60043575182, 0,            0
##LAST=      -1063.38300110119, 0,           0
##MIN=       -1063.38300110119, -330221,     0
##MAX=       4112.60043575182, 404291340,    0
$$ Real data points
##PAGE= N=1
##DATA TABLE= (X++(R..R)), XYDATA
$$ [...]
20120H2381Q814q516P7983l1882l0628q4727R767M4023M8661l1648n7114J181
$$ 82381 91195 82679 160662 128780 98152 13425 23192 67215 115876 84228 27114 28295
20108B8295N141j2959k4962n7243k1425L8399O1195o2495r1084L9923l739N8791
$$ 28295 33436 20477 -4485 -61728 -83153 -44754 16441 -46054 -137138 -97215 -100954 -42163
20096d2163P7313M2690L6089k0073N119m9241L593K978j0677m8984q9315J7456
$$ -42163 35150 77840 113929 93856 98975 49734 53327 56305 45628 -3356 -92671 -75215
20084g5215J3407m3553M1047O7512k8285J05792O0447q4180p0808k1421M8571
$$ -75215 -61808 -105361 -64314 3198 -25087 80705 141152 56972 -13836 -35257 13314
20073A3314O8610p7835n9722m5778L4478K5564M0329R492j1204n5176n2409N3369
$$ 13314 81924 4089 -55633 -101411 -66933 -41369 -1040 8452 -2752 -57928 -110337 -56968
20061e6968K2083K9158M0613P0274m1310q8739l0564l8177N2677L0797l7319M2904
$$ -56968 -34885 -5727 34886 105160 63850 -24889 -55453 -93630 -40953 -10156 -47475 -4571
20049d571M0998j5839k9127r6258m7741M1256Q1329j8266m1192O033J8355l383
$$ -4571 36427 20588 -8539 -104797 -152538 -111282 -29953 -48219 -89411 -83378 -65023 -68406
20037f8406O1173J22867p4342j04119k1679N1267K7818K6483p7680k0156j3496
$$ -68406 -7233 115634 41292 -62827 -84506 -33239 -5421 21062 -56618 -76774 -90270
20026i0270J5732j1209K496N4956j452J3346m9197J3104M3470O6329J3395p787
$$ -90270 -74538 -85747 -83251 -28295 -29747 -16401 -65598 -52494 -9024 57305 70700 62913
20014F2913P5942l7530l1638k1701k9516l557m3289p6924K9291j0656k8275P6790
$$ 62913 138855 101325 69687 47986 18470 14913 -28376 -105300 -76009 -86665 -114940 -38150
20002c8150M1788r935J0005k3004m6337r551l6276L8809M2333j1051N5215K2471
$$ -38150 3638 -6297 3708 -19296 -65633 -75184 -111460 -72651 -30318 -41369 13846 36317
19990C6317J3499J1394l1955k0122J3009k1278n0040k042R3958k2374k8098P32
$$ 36317 49816 61210 29255 9133 22142 864 -49176 -51218 42740 20366 -7732 -7000
19978g000M7200j6487J1170L2284J21143j7010j28754j22833j7402J7252k5362
$$ -7000 40200 23713 34883 67167 188310 171300 42546 -80287 -97689 -80437 -105799
19967a05799m4165J14708P9962l268l2509o6195m0166O0050K0025M0723J515p5155
$$ -105799 -149964 -35256 44706 41438 8929 -57266 -97432 -37382 -17357 23366 24881 -50274
19955e0274K3617M8379J7430n173n4983K7666n2104K1445N4247N823n0275J0304
$$ -50274 -26657 21722 39152 33979 -21004 6662 -45442 -23997 30250 36073 -14202 -3898
19943c898l3721m1440j3726N4726j1435J818M2877k568J380P152o8441j9840r25
$$ -3898 -37619 -79059 -92785 -38059 -49494 -47676 -4799 -7367 -5987 1165 -67276 -87116 -88041
19930h8041l118O1727M5632O2588N3254o7726o9636N5525M4878o601p0704j7161
$$ -88041 -91159 -29432 16200 78788 132042 64316 -5320 50205 95083 88482 17778 617
19918F17m545N8800l462N3746j644p6491j8025k1782m6481L9729m0234k9301k0914
$$ 617 -3928 54872 51410 105156 103512 27021 8996 -12786 -59267 -19538 -59772 -89073 -109987
19905a09987k206O2546K4734j2362p5008M4615k726q5005J28338P6746K558m0927
$$ -109987 -112193 -49647 -24913 -37275 -112283 -67668 -70394 -155399 -27061 49685 52243 11316
19893A1316q324L076M1445o1937j9066l3560O6310J09234p7639q1464k8419n3905
$$ 11316 2992 6068 47513 -14424 -33490 -67050 -740 108494 30855 -50609 -79028 -132933
19881a32933m080P5200R6727M5080j04124k1580J45019L8446q114L6473j7501
$$ -132933 -137013 -61813 34914 79994 -24130 -45710 99309 137755 129641 166114 148613
19870A48613l6428o3012j38517k8197N7579l5745l4072J0080l369r519p1914m0424
$$ 148613 112185 49173 -89344 -117541 -59962 -95707 -129779 -119699 -123068 -132587 -204501 -244925
19858b44925O1107J1547Q6067J3082l4016M9299P499K5043M6213p031l6452j1032
$$ -244925 -183818 -172271 -86204 -73122 -107138 -57839 -50340 -25297 20916 13885 -22567 -33599
19846c3599L477j0104L2772N8362M9682l2189K1932r312l4029l2555L6417N4188
$$ -33599 -30122 -40226 -7454 50908 100590 68401 90333 81021 46992 14437 50854 105042
19834A05042R1j6648j9125j2742Q5594o667q5124K1741O0589l9740J8722r568
$$ 105042 105133 88485 69360 56618 142212 135545 50421 72162 132751 93011 111733 102165
19822A02165m1370j21352l4129Q1911O7379L0141n8671j21957J3347O6310K7589
$$ 102165 60795 -60557 -94686 -12775 54604 84745 26074 -95883 -82536 -16226 11363
19811A1363m3055k2893l7433M1625R4241R525m2916p926l2846M4048L5989R9537
$$ 11363 -31692 -54585 -92018 -50393 43848 53373 10457 2531 -30315 13733 49722 149259
19799A49259N6851j12269j1422L4343L6817j2992m2645o3078l0176k1920O8402
$$ 149259 206110 93841 82419 116762 153579 140587 97942 34864 4688 -17232 51170
19788E1170J14888k34p1451l5143l1675p5586K2529M2871O573M2149j4189o6547
$$ 51170 166058 165824 94373 59230 27555 -48031 -25502 17369 23942 66091 51902 -14645
19776a4645n3109L0849K582M702o5356j3395Q759Q2651J3244k6250m9062k1605
$$ -14645 -67754 -36905 -34323 -29621 -94977 -108372 -99613 -16962 -3718 -29968 -79030 -100635
19764a00635M678J1493O1325P1239k0175J04873O728n4967L7108L2285p0034j15339
$$ -100635 -95957 -84464 -23139 48100 27925 132798 139526 84559 121667 153952 83918 -31421
19752c1421j01516n1656K8277O8038l5385J7791M2779M7013n251n627n8084l2747
$$ -31421 -132937 -184593 -156316 -88278 -123663 -105872 -63093 -16080 -21331 -26958 -85042 -117789
19740a17789N1525K0773j8422n7476m352N5573k3040j2466P5885P5242q149l3985
$$ -117789 -66264 -45491 -63913 -121389 -125741 -70168 -93208 -105674 -29789 45453 37304 3319
19728C319n6901m7222k8243O9471M8908K1037L1904p454L4257J1568M2861n673
$$ 3319 -53582 -100804 -129047 -59576 -10668 10369 42273 34819 69076 80644 123505 117832
19716A17832j20882k7354L3810n1397O6221M7641J8953O583l8524j4157O1498
$$ 117832 -3050 -30404 3406 -47991 18230 65871 84824 91407 52883 38726 100224
19705A00224K175K094p0420n8504k9221q101M1060M8731P259p2749O1696N9734
$$ 100224 102399 104493 34073 -24431 -53652 -61753 -20693 28038 35297 -37452 24244 83978
19693H3978M6960p6252r315j15084o4279K0749J16659J02015o2623j1523Q7363
$$ 83978 130938 54686 45371 -69713 -133992 -113243 3416 105431 42808 31285 118648
19682A18648Q1514N6398J14621L4088l3928j416J29974J22545L9133j20520j21898
$$ 118648 200162 256560 371181 405269 371341 369925 499899 622444 661577 541057 419159
19671D19159l6600n3616r8417L8492J06939J20270L6185M1160l1483p8229J2097
$$ 419159 382559 328943 230526 269018 375957 496227 532412 573572 542089 463860 475957
19660D75957P0034l0848m4329p8321q8984R4408k9024r9797j9197j24745L9364
$$ 475957 545991 515143 470814 392493 303509 397917 368893 269096 249899 125154 164518
19649A64518O2241K2210Q1787n4813r8178Q635Q657K4756k7830p7173O2411J03089
$$ 164518 226759 248969 330756 275943 177765 186400 195057 219813 191983 114810 177221 280310
19637B80310l8652j4171K9257k205m4283O9730L6817j1247k8965R028j08472J6801
$$ 280310 241658 227487 256744 254539 210256 279986 316803 305556 276591 285619 177147 193948
19625A93948J10108J51091R1879J40915J44435L6268K8372n3562q7365o2966p6959
$$ 193948 304056 455147 547026 687941 832376 868644 897016 843454 756089 693123 616164
19614F16164j9926m1586M6848Q7456L0739J249n8202j26778j59491K8519r6453
$$ 616164 596238 554652 601500 688956 719695 720944 662742 535964 376473 404992 308539
19603C08539j04444r751N5476K1878K0833k9331l8571j1455k464j1289O86l699
$$ 308539 204095 194344 249820 271698 292531 263200 224629 213174 210710 199421 200107 196408
19591A96408M553K5109k3230P8128n2886p8122q0140m9105J8251K3268J2245M2712
$$ 196408 200961 226070 202840 280968 228082 149960 69820 20715 38966 62234 74479 117191
19579A17191j1277q114r2193j8444l5603N7823J9512k2377j15439r0995J19538
$$ 117191 105914 97800 5607 -12837 -48440 9383 28895 6518 -108921 -199916 -80378
19568h0378N2714k8779k6989O1193M2971M5464k4877l2027P927Q9515k0911r7933
$$ -80378 -27664 -56443 -83432 -22239 20732 66196 41319 9292 17219 106734 85823 -12110
19556a2110q888N8231Q5160O5410m4604p4263L0773P2777j24065o7529O6305q497
$$ -12110 -20998 37233 122393 187803 143199 68936 99709 172486 48421 -19108 47197 38700
19544C8700R010N9660l1617j1590L5429P0689k7013j01401o1956k383Q5636M4110
$$ 38700 47710 107370 75753 64163 99592 170281 143268 41867 -20089 -22472 63164 107274
19532A07274m1691j1785o8868l0269K7412Q7755k4453o0532K2043J8278j2017
$$ 107274 65583 53798 -15070 -45339 -17927 69828 45375 -15157 6886 25164 13147
19521A3147O7373K0097M3703L914j15350q9565o1839j0652J37411P5073J6882
$$ 13147 80520 100617 144320 148234 32884 -56681 -118520 -129172 8239 83312 100194
19510A00194M3586J2331p4806k7086l3838r8716N244Q0426L4114m1505M2303R8582
$$ 100194 143780 156111 81305 54219 20381 -78335 -73091 7335 41449 -56 42247 140829
19498A40829K6185k6454m4113M7505n0680m782Q6764o3755k1284j8307m9039O9580
$$ 140829 167014 140560 96447 143952 93272 88490 175254 111499 90215 71908 22869 92449
19486I2449J34663p2946p1968O5623m174n8669m3188j0057J0843P164N9641J5771
$$ 92449 227112 154166 82198 147821 143647 84978 41790 31733 42576 49740 109381 125152
19474A25152j5128J7345O4088j6486N8472m7200l7633o8141m8864K8464L2140
$$ 125152 110024 127369 191457 174971 233443 186243 148610 80469 31605 60069 92209
19463I2209j9418n6689j00863Q6136Q167k7627N647K8279O4297M7233j688j8708
$$ 92209 72791 16102 -84761 1375 9542 -18085 -12438 15841 80138 127371 125683 106975
19451A06975Q753o2351k2508Q1327N6218J5428n7426L5574k4818q1866j5648N1436
$$ 106975 115728 53377 30869 112196 168414 183842 126416 161990 137172 55306 39658 91094
19439I1094N0280q2802l708R5918n490p5098o5388O9513M5855J6658k428l1821
$$ 91094 141374 58572 54864 150782 145292 70194 4806 74319 120174 136832 134404 102583
19427A02583o911o7806n5264O871O1499N1410L8344J250n2183q7834M9883R2464
$$ 102583 95672 27866 -27398 -20527 40972 92382 130726 131976 79793 -8041 41842 134306
19415A34306R6708J11433j22738l7246O16j7441M1009R225j9957j6984m7097l5129
$$ 134306 231014 342447 219709 182463 183079 165638 206647 215872 195915 178931 131834 96705
19403I6705m774K7491M5293J5720K4488j07069j42109j14311N0978Q2774N3258
$$ 96705 91931 119422 164715 180435 204923 97854 -44255 -158566 -107588 -24814 28444
19392B8444J4197J485L7649k269K9318o1409j17154m4475O5278M4829J05717J9530
$$ 28444 42641 44126 81775 79506 108824 47415 -69739 -114214 -48936 -4107 101610 121140
19380A21140L2821M5884L4661J409p022K4933k490J6138r6223K6439k1734o9983
$$ 121140 153961 199845 234506 235915 228893 253826 251336 267474 171251 197690 175956 105973
19368A05973J0936l5585l3270M5569Q0014L2768l1280k0922K8040Q417n8350j0569
$$ 105973 116909 81324 48054 93623 173637 206405 175125 154203 182243 190660 132310 121741
19356A21741N8725m2712o4060j726M8035P6375m7539k9687R617j0866k8723Q7642
$$ 121741 180466 137754 73694 71968 120003 196378 148839 119152 128769 117903 89180 176822
19344A76822J03742q0536p1172l8415L7252N1164K9660L525m8467j0818j07377
$$ 176822 280564 200028 128856 90441 127693 178857 208517 212042 163575 152757 45380
19333D5380l4415K313o2209L9824O2992K1491L3125R9095m4100m9745r859j00191
$$ 45380 10965 13278 -48931 -9107 53885 75376 108501 207596 163496 113751 103892 3701
19321C701M105K6065J7938J08611N7687K5718l7592j3870L106l8742K2435k0603
$$ 3701 7806 33871 51809 160420 218107 243825 206233 192363 195469 156727 179162 158559
19309A58559l5462l0039J9034n3160K0270M1637l6528k8642O7351J233k300m7108
$$ 158559 123097 93058 112092 58932 79202 120839 84311 55669 123020 124253 121953 74845
19297G4845R3920Q3001P6889j22484J4105K2773k355l8811r0630L1719l4595j7098
$$ 74845 168765 251766 328655 206171 220276 243049 240694 201883 111253 142972 108377 91279
19285I1279P1835L5362K14j28219M21J1374K4120L3788R875j9632p7378J8983
$$ 91279 163114 198476 198690 70471 70892 82266 106386 140174 150049 130417 53039 72022
19273G2022J05372R3699q496r018j02466N3023l7275k6221K0033M8976m7418r791
$$ 72022 177394 271093 262597 253579 151113 204136 166861 140640 160673 209649 162231 152440
19261A52440K7420J0687J5602Q6671R7900O2270l5323j9731k329o4690l5137J6592
$$ 152440 179860 190547 206149 292820 390720 452990 417667 397936 395607 330917 295780 312372
19249C12372K5133j2380O6599M1674L1897m1283Q6397L6677J0670m5216o0123
$$ 312372 337505 325125 391724 433398 465295 424012 510409 547086 557756 512540 452417
19238D52417K9190M822q8909j07119n7321m3236R6775N6586O7133j9891n9139
$$ 452417 481607 486429 397520 290401 233080 189844 286619 343205 410338 390447 331308
19227C31308P5780K2558l6717j9361l39l980N8777N3565P576L2684M1649K7895
$$ 331308 407088 429646 392929 373568 373229 369249 428026 481591 489167 521851 563500 591395
19215E91395J0078M7563M2698R4580J05556j8865l8485o082p778p278N4580Q1593
$$ 591395 601473 649036 691734 786314 891870 873005 834520 828438 820660 813382 867962 949555
19203I49555O4022L3905J28975J01504M2699O3811R6862J34786Q5464R3783J24134
$$ 949555 1013577 1047482 1176457 1277961 1320660 1384471 1481333 1616119 1701583 1795366 1919500
19192A919500J81958K46239L29340M25896K84663K78947K15526K78186K59496
$$ 1919500 2101458 2347697 2677037 3102933 3387596 3666543 3882069 4160255 4419751
19183D419751L37005M73708N60906Q54880J172255J580096K267044L206268M144170
$$ 4419751 4756756 5230464 5791370 6646250 7818505 9398601 11665645 14871913 19016083
19174A9016083M594422M181463K669770J252073Q34611K039422N466734J1320615
$$ 19016083 23610505 27791968 30461738 31713811 32548422 34587844 40054578 51375193
19166E1375193J9643895K7444066L1925121L0156179J8309717L823782q051664
$$ 51375193 71019088 98463154 130388275 160544454 178854171 182677953 174626289
19159A74626289j5987772k0405046k1826680k0476999j6324624r612943l067677
$$ 174626289 158638517 138233471 116406791 95929792 79605168 69992225 66924548
19152F6924548J227451K000404j294729n976217r358130j0628175r363936p155835
$$ 66924548 68151999 70152403 68857674 62881457 53523327 42895152 33531216 26375381
19144B6375381m965001l123853k046101j440317j050377r01123n58255k91349
$$ 26375381 21410380 18286527 16240426 14800109 13749732 12848609 12290354 11999005
19136A1999005k41480k17434j23193j48142p8955K45493O83294J073940K040410
$$ 11999005 11757525 11540091 11416898 11268756 11189801 11435294 12118588 13192528 15232938
19127A5232938L200292N000507P385377R973339J1386478J0866429P075714J494953
$$ 15232938 18433230 23433737 30819114 40792453 52178931 63045360 70121074 71616027
19119G1616027k675771l628005l36712O624058J5528598K3736805L0406645L2763756
$$ 71616027 68940256 65312251 64975539 71599597 87128195 110865000 141271645 174035401
19111A74035401K9453669K2411949Q541551j2156808k9135702l8841397l8797517
$$ 174035401 203489070 225901019 234442570 222285762 193150060 154308663 115511146
19104A15511146l0261109j9988512j0576005m243819j321502j699152l885261
$$ 115511146 85250037 65261525 54685520 50441701 49120199 47421047 43535786
19097D3535786n808808o761267o281095m966429l702776k541668j897831j551035
$$ 43535786 37726978 30965711 24684616 19718187 16015411 13473743 11575912 10024877
19089A0024877j167356q41267n94145m80944m62202n09703m86169n53566o22932
$$ 10024877 8857521 8016254 7422109 6941165 6478963 5969260 5483091 4929525 4306593
19080D306593n21962m46093l98522k72506k30295k86488j70976k10414p7327L163
$$ 4306593 3784631 3338538 2940016 2667510 2437215 2150727 1979751 1769337 1692010 1695173
19070A695173j08934j28072m8259Q560k3347p8559j5705j03347j24038m6845m7186
$$ 1695173 1586239 1458167 1409908 1418468 1395121 1316562 1300857 1197510 1073472 1026627 979441
19059I79441q0509o2981j9448n2461J2369P8375O3237M5502j08135j16029o6680
$$ 979441 898932 835951 816503 764042 776411 854786 918023 963525 855390 739361 672681
19048F72681m7477j43L908L2067m8789j1581J6106p365l1732L1751q182q0065
$$ 672681 625204 625061 628969 661036 612247 600666 616772 609407 577675 609426 601244 521179
19036E21179m1331O1936R9127r0184r3372j9257L96M3664N467n1227m6769K3124
$$ 521179 479848 541784 640911 550727 457355 438098 438494 482158 487625 436398 389629 412753
19024D12753l0769m8313j3127K8538K8525M0243p517k672k1797l4556o6728j1011
$$ 412753 381984 333671 320544 349082 377607 417850 410333 407661 385864 351308 284580 273569
19012B73569q707N8206K4317n9552M8829Q6749L7059j27910n1157K5854j3888
$$ 273569 264862 323068 347385 287833 336662 423411 460470 332560 281403 307257 293369
19001B93369J15729O0020J4487o6852p668L8566j7102J3246R2480M1547l5480
$$ 293369 409098 469118 483605 416753 409085 447651 430549 443795 536275 577822 542342
18990E42342j09894n1202L5584j917Q0604m607M6150O28j9685r5155o9002l9937
$$ 542342 432448 381246 416830 414913 495517 490910 537060 537688 518003 422848 353846 313909
18978C13909j06452O488J78j6932l3984j6634k4472q2121L9937N1022m4095N6010
$$ 313909 207457 213945 214123 197191 163207 146573 122101 39980 79917 130939 86844 142854
18966A42854R6220q1034M102j2160K1383k2342k447K5570N9713K0141O1192L4647
$$ 142854 239074 158040 162142 149982 171365 149023 146576 172146 231859 252000 313192 347839
18954C47839N9500J455j04548p1543L6118R6114j1051n4958N775K9804J2755M0227
$$ 347839 407339 408794 304246 232703 268821 364935 353884 298926 304701 334505 347260 387487
18942C87487R010o7014k8396N0760k6958n0893L1691k7018J6523n848m9319n2342
$$ 387487 396497 329483 301087 351847 324889 273996 305687 278669 295192 289344 240025 187683
18930A87683p8628m659q43M9632P819J18316P8973k5236o3915j4589j8258L2519
$$ 187683 109055 104396 103553 153185 161004 279320 358293 333057 269142 254553 236295 268814
18918B68814j4197n0666q0455o4654Q5754J16691J9227K5117m1601m673O2021
$$ 268814 254617 203951 123496 58842 144596 261287 280514 305631 264030 259357 321378
18907C21378O1135k5642o8632k4765p226O0m9439J5795R287m9479n7865m576P0520
$$ 321378 382513 356871 288239 263474 256248 256308 206869 222664 231951 182472 124607 120031 190551
18894A90551P4215j0958K0573n50L0800n0487r8706j3313J07128N5185k3522m0632
$$ 190551 264766 253808 274381 273831 304631 254144 155438 142125 249253 304438 280916 240284
18882B40284k0583Q585q4501L6154j8470M5403M8816o4235l8205K4467n9029K667
$$ 240284 219701 228286 143785 179939 161469 206872 255688 191453 153248 177715 118686 121353
18870A21353M9916R3890J2294n4733l1206N6600Q1371M0214N8178N5589M0455
$$ 121353 171269 265159 277453 222720 191514 248114 329485 369699 427877 483466 523921
18859E23921Q6873J80721K13253J51536J18260k9745k36793k68435k37590j31061
$$ 523921 610794 791515 1004768 1156304 1274564 1244819 1008026 739591 502001 370940
18849C70940j44134l8262M1985M4484M0664L0833q2660J9098P3546l9461p5372
$$ 370940 226806 188544 230529 275013 315677 346510 263850 282948 356494 317033 241661
18838B41661N5613j7830k5091l4554q0553m1677O8954P8389P0556o2191O058K4202
$$ 241661 297274 279444 254353 219799 139246 97569 166523 244912 315468 253277 259335 283537
18826B83537N4849n776K0998r802r550k1667j11172q7489l5062J510m6492j1289
$$ 283537 338386 332610 353608 343806 334256 312589 201417 113928 78866 80376 33884 22595
18814B2595P5119J04114L6957j2899k7010Q902k8758q3577k3201m1334L0526M6266
$$ 22595 97714 201828 238785 225886 198876 207778 179020 95443 72242 30908 61434 107700
18802A07700L0606L5354R595q044L3071o0591N6266M418P2486N662N955J20420
$$ 107700 138306 173660 183255 175211 208282 147691 203957 208375 280861 286523 292478 412898
18790D12898N5030n0564l2150j00217j11585M9174L2156l5242M8157J0637k7543
$$ 412898 467928 417364 385214 284997 173412 222586 254742 219500 267657 278294 250751
18779B50751Q6225k4279k8732j8826J04782K2929L3324N7262L5514P7664K54564
$$ 250751 336976 312697 283965 265139 369921 392850 426174 483436 518950 596614 851178
18768H51178K54433Q8945j31284j73652j67288j61465l03K533j6884J6892L458
$$ 851178 1105611 1194556 1063272 889620 722332 560867 560564 563097 546213 563105 566563
18757E66563O5211j9821M724K0775r4920M4886Q1182o784O0539L4116L7659M7435
$$ 566563 631774 611953 616677 637452 542532 587418 668600 661816 722355 756471 794130 841565
18745H41565J6511n792O0123L5077j8274K4818J5541R912N3112M6074K2830J09017
$$ 841565 858076 852284 912407 947484 929210 954028 969569 979481 1032593 1078667 1101497 1210514
18733A210514Q8424J04981j7328r712K8146P7295P0796R5385K59366K23389K39501
$$ 1210514 1298938 1403919 1386591 1376879 1405025 1482320 1553116 1648501 1907867 2131256 2370757
18722B370757J99072K62329K73321K99352L63984L29388L50957M81065O09446
$$ 2370757 2569829 2832158 3105479 3404831 3768815 4098203 4449160 4930225 5539671
18713E539671O21863Q01292J057426J532878K100007K482381K632370K964019
$$ 5539671 6161534 6962826 8020252 9553130 11653137 14135518 16767888 19731907
18705A9731907L539456M084763M447161M944414O581011Q763423J1730375J2777968
$$ 19731907 23271363 27356126 31803287 36747701 43328712 52092135 63822510 76600478
18697G6600478J3623897J6483636J8216931J8083055J3272196J0467121P496396
$$ 76600478 90224375 106708011 124924942 143007997 156280193 166747314 174243710
18690A74243710q28705o844351r833576j1033056j2666075j5075776j4558632
$$ 174243710 173415005 166570654 156737078 145704022 133037947 117962171 103403539
18683A03403539j1674259r005315p276013o730745n583660n618465n963681o011359
$$ 103403539 91729280 82723965 75447952 68717207 63133547 57515082 51551401 45540042
18675D5540042n821040n292764n046443m678260l999218l061940k234122j466986
$$ 45540042 39719002 34426238 29379795 24701535 20702317 17640377 15406255 13939269
18667A3939269r47254o06712m37756q3059K9165K79153O45374J187235J822421
$$ 13939269 12992015 12385303 11947547 11864488 11893653 12172806 12818180 14005415 15827836
18658A5827836K722878L572678L897509M164942M526192N287520N627709N243376
$$ 15827836 18550714 22123392 26020901 30185843 34712035 39999555 45627264 50870640
18650E0870640N826139O258212N914426O565202Q973556J1920205J1988934R485000
$$ 50870640 56696779 62954991 68869417 75434619 84408175 96328380 108317314 117802314
18642A17802314Q908155Q464725O143515J04942l505188o404942j1220348j3537991
$$ 117802314 126710469 135175194 141318709 141423651 137918463 131513521 120293173 106755182
18634A06755182j4708277j2759361j1378375j0594298r294973p934710n866176
$$ 106755182 92046905 79287544 67909169 57314871 48019898 40085188 34219012
18627C4219012m271831l646453l227431k894430k475609k290509k230735j957427
$$ 34219012 29947181 26300728 23073297 20178867 17703258 15412749 13182014 11224587
18619A1224587j645111j255303r51425p72353p09030o09535n36087m71143l72063
$$ 11224587 9579476 8324173 7372748 6600395 5891365 5281830 4745743 4274600 3902537
18610C902537l33497k67118k69304l18982l52400k13739j28055q0032j26230r6104
$$ 3902537 3569040 3301922 3032618 2713636 2361236 2147497 2019442 1939410 1813180 1717076
18600A717076q7730o6200j09616j58322j29184j24865J7456j16013j1466O6831
$$ 1717076 1629346 1563146 1453530 1295208 1166024 1041159 1058615 942602 931136 997967
18590I97967m025j1648j3857m7943N147J1676M7599k04l9740j58637r1422K8289
$$ 997967 993942 982294 968437 920494 925641 937317 984916 984712 944972 786335 694913 723202
18578G23202M1695M0080q967l0928m3595q9443l8597j00825k0153J00845K8895
$$ 723202 764897 804977 796010 765082 721487 632044 593447 492622 472469 573314 602209
18567F02209L1704k0232p3407n364m1512n7589j0388j22984l9717L3850l5542
$$ 602209 633913 613681 540274 534910 493398 435809 425421 302437 262720 296570 261028
18556B61028M5674J23645J11860M9591n8681p2568m9001j0250n2394K9647J7615
$$ 261028 306702 430347 542207 591798 533117 460549 411548 401298 348904 378551 396166
18545C96166p283m2661m5034q7776n1280k040Q0421L6494L3385m3178J6482M7617
$$ 396166 388883 346222 301188 213412 162132 160092 240513 277007 310392 267214 283696 331313
18533C31313K5067J8571o0046M9494P4046O6646n2550j0911J5464O2763K7965
$$ 331313 356380 374951 314905 364399 438445 505091 452541 441630 457094 519857 547822
18522E47822j49l7878k3053j3123l9127m7389k8958m6403O6402p8318l883O0185
$$ 547822 547673 509795 486742 473619 434492 387103 358145 311742 378144 299826 295943 356128
18510C56128l6121j1245p1308q2767N369P0991L8703m3927M7801L4133J9914L5835
$$ 356128 320007 308762 237454 154687 160056 231047 269750 225823 273624 307757 327671 363506
18498C63506o9399j5388p7059K5066o0769j02842J1625J06532J276q2859K6432
$$ 363506 294107 278719 201660 226726 165957 63115 74740 181272 182548 99689 126121
18487A26121J5320k3455l543J13844R6389m195o23M4045n2522m506m1400m8782
$$ 126121 141441 117986 114443 228287 324676 320481 319858 363903 311381 306875 265475 216693
18475B16693O9065n552j4637l0870J9120L4640l4589j9858n526j9251o954j1312
$$ 216693 285758 280206 265569 234699 253819 288459 253870 234012 228486 209235 202281 190969
18463A90969o600n890j4625l6987j0068O9486n7055K0825N5093o411o539J9211
$$ 190969 184369 178479 163854 126867 116799 186285 129230 150055 205148 198737 192198 211409
18451B11409Q7768K6158j18268o0913J9581J08409K6373K4920O9112m085l6027
$$ 211409 299177 325335 207067 146154 165735 274144 300517 325437 394549 390464 354437
18440C54437Q154J0563P8498M6536P0443O7175M8807J74481J78831J14983J29749
$$ 354437 362591 373154 451652 498188 568631 635806 684613 859094 1037925 1152908 1282657
18429A282657J70356J07176K6552N3666p926n7774q8611j28718r0161j29746j39973
$$ 1282657 1453013 1560189 1586741 1640407 1632481 1574707 1486096 1357378 1267217 1137471 997498
18418I97498r5511p2988q8802o4290j4051q827j3498j6605r9780Q464J0632p0522
$$ 997498 901987 828999 740197 675907 661856 653029 639531 622926 523146 531610 542242 471720
18406D71720j06098q0272j9556L7879P2705J3530O064n5745N5685Q279o4092Q9824
$$ 471720 365622 285350 265794 303673 376378 389908 395972 340227 395912 404191 340099 429923
18394D29923J85858P8473P8316J78713J88629N4373J2412n486m7692k0780N53
$$ 429923 615781 694254 772570 951283 1139912 1194285 1206697 1201211 1153519 1132739 1133292
18383A133292J80532K70189L77173O33068O44458O56771O96177O35210L22097
$$ 1133292 1313824 1584013 1961186 2594254 3238712 3895483 4591660 5226870 5548967
18374E548967J85011k2381l17879m01174n41343n39682m71766m70300m05651l80897
$$ 5548967 5733978 5711597 5393718 4992544 4451201 3911519 3439753 2969453 2563802 2182905
18364B182905m73667l05170k21838j61854j36896L3019m6656j41053L0837o0625
$$ 2182905 1709238 1404068 1182230 1020376 883480 916499 869843 728790 759627 699002
18354F99002p2201L6953J59712J51634Q2766J27948K99635L80713M13089M46848
$$ 699002 626801 663754 823466 975100 1057866 1185814 1485449 1866162 2279251 2726099
18344B726099M59755M84595O15357O58326M46227K89485N1236j78310m33727n82198
$$ 2726099 3185854 3670449 4285806 4944132 5390359 5679844 5731080 5552770 5119043 4536845
18334D536845o55098p07474o35665m40821l64687k98310j44894Q4883M5497l8382
$$ 4536845 3881747 3174273 2538608 2097787 1733100 1434790 1289896 1374779 1420276 1381894
18324A381894q9157j17442m6564r8347q4585m6553q1059o0126l4139p1298j43461
$$ 1381894 1292737 1175295 1128731 1030384 945799 899246 818187 758061 723922 652624 509163
18313E09163L9821o7068n1283K7817P27l3902N6708O8586K1841j2232N9725J13235
$$ 509163 548984 481916 430633 458450 459177 425275 481983 550569 572410 560178 619903 733138
18301G33138J03048Q3760J5647m3031J7266J30505R2717j942J0361J37355J02722
$$ 733138 836186 919946 935593 892562 909828 1040333 1133050 1131108 1141469 1278824 1381546
18290A381546Q4937P5265P0546O2590N2885J9634J971k5662j23156j91527j49967
$$ 1381546 1466483 1541748 1612294 1674884 1727769 1747403 1749374 1723712 1600556 1409029 1259062
18279A259062j58954m8533K4538J13532N1611M9495R5137J37564R0240N7442J46455
$$ 1259062 1100108 1051575 1076113 1189645 1241256 1290751 1385888 1523452 1613692 1671134 1817589
18268A817589Q866n4210o6951Q6302P9904J73200L33858L92909N63820P38643
$$ 1817589 1826455 1772245 1705294 1791596 1871500 2044700 2378558 2771467 3335287 4073930
18258D073930J255705K063538K178993Q05508p10993j469045j314860n95195j9895
$$ 4073930 5329635 7393173 9572166 10377674 9666681 8197636 6882776 6287581 6267686
18249F267686M34015P06098J157498J880672K910733M555732P628402J2836224
$$ 6267686 6701701 7407799 8565297 10445969 13356702 17912434 25540836 38377060
18241C8377060J9585066K0347397J3591211M699103j0059995j7905716j8180561
$$ 38377060 57962126 78309523 91900734 96599837 86539842 68634126 50453565
18234E0453565j4022672q193185m042883j058019J407418K396318J378346R93161
$$ 50453565 36430893 28237708 24194825 23136806 24544224 26940542 28318888 29312049
18226B9312049K357637L589559O89428l710145o122607o257511m428500k693455
$$ 29312049 31669686 35259245 35948673 32238528 26115921 19858410 15429910 12736455
18218A2736455j586071p90814k52927N2462L00521O06780R39122J383995K168795
$$ 12736455 11150384 10359570 10106643 10159105 10459626 11066406 12005528 13389523 15558318
18209A5558318L303376L451898J407302p90992j725370j224874N01222K794323
$$ 15558318 18861694 22313592 23720894 22929902 21204532 19979658 20480880 23275203
18201B3275203N544446R098722J2450820J1826734R457058R474788R496836M695732
$$ 23275203 28819649 37918371 50369191 62195925 71652983 81127771 90624607 95320339
18193I5320339J590j079919K407672L000694P74194K698848M705493O639198J1209723
$$ 95320339 95321929 94242010 96649682 99650376 100424570 103123418 107828911 114468109 125677832
18184A25677832J4624014R654971p419500j7215843j7195858j3437050j3263193
$$ 125677832 140301846 149956817 142537317 125321474 108125616 94688566 81425373
18177H1425373j4226050j4503594j2128068q198516n030570k835093j442250n27048
$$ 81425373 67199323 52695729 40567661 32369145 27338575 24503482 23061232 22534184
18169B2534184N50254J237484L10405j762975k731085k738463j853428j024949
$$ 22534184 23084438 24321922 24632327 22869352 20138267 17399804 15546376 14521427
18161A4521427n67268j85911K87345R36668J796839K849853M216570O517135Q319086
$$ 14521427 13954159 13768248 14055593 14992261 16789100 19638953 23855523 30372658 38691744
18152C8691744M818562j926170n647855o394944m006602o75717K460225O297399
$$ 38691744 43510306 41584136 35936281 29541337 25534735 24859018 27319243 33616642
18144C3616642J1681415J6405274J3188133O559258N865027J1143969J2661095
$$ 33616642 45298057 61703331 74891464 81450722 87315749 98459718 111120813
18137A11120813P632022j626608j5766515j9462892j7429934j4181284j1004207
$$ 111120813 118752835 117126227 101359712 81896820 64466886 50285602 39281395
18130C9281395q498363o250826l835194k131180o04870Q20544J239617k66483
$$ 39281395 30783032 24532206 20697012 18565832 17960962 18781506 20021123 19754640
18122A9754640j512965j735516j058817M34460J478242J291322J222106K018597
$$ 19754640 18241675 16506159 15447342 15881802 17360044 18651366 19873472 21892069
18114B1892069M092173Q242763J6137587L1526075N1757085K9924263j8413724
$$ 21892069 25984242 34227005 50364592 81890667 133647752 163572015 145158291
18107A45158291l6093549m1987204k6560182j3152342p171005m380252k931104
$$ 145158291 109064742 67077538 40517356 27365014 20194009 15813757 12882653
18100A2882653k164469j623650j219176r38118p53199p66767p45310n80248n13833
$$ 12882653 10718184 9094534 7875358 6937240 6184041 5417274 4671964 4091716 3577883
18091C577883m56231k57317j99209j89181j88879j25068j13519j65342j32557
$$ 3577883 3121652 2864335 2665126 2475945 2287066 2161998 2048479 1883137 1750580
18082A750580j04722n4607j11189j05675p4658o1612p5792j38734j60239p5019
$$ 1750580 1645858 1591251 1480062 1374387 1299729 1238117 1162325 1023591 863352 788333
18072G88333L7713K3376j1875R4124M0927k4404K6226m4333j31922p3144j9538
$$ 788333 826046 849422 837547 931671 972598 948194 974420 930087 798165 725021 705483
18061G05483j2252r1546p0911L3877R1653o5545M3202L9908n7477j7642j7142
$$ 705483 693231 601685 530774 564651 656304 590759 633961 673869 616392 598750 581608
18050E81608l4048k311n6070J5089k9738p0110o3821L3910Q1396M5481p4949J4014
$$ 581608 547560 545249 489179 504268 474530 404420 340599 374509 455905 501386 426437 440451
18038D40451O6546N908L1328L8481n2831r0465l5975L4048m3617k6278r3121K715
$$ 440451 506997 512905 544233 582714 529883 439418 403443 437491 393874 367596 274475 277190
18026B77190J25426m7667n5720Q0997q016P4287K472n9593o1191p7523J32432
$$ 277190 402616 354949 299229 380226 372210 446497 448969 389376 328185 250662 383094
18015C83094P0707m1699p10M8187l2313r8332o5255J9730j2597m2240p7924o5590
$$ 383094 453801 412102 411392 459579 427266 328934 263679 283409 270812 228572 150648 85058
18003H5058N6557M0410P733Q9315K5888m3453r556l2981p1238j00661L4685O6538
$$ 85058 141615 182025 189758 279073 304961 261508 251952 218971 147733 47072 81757 148295
17991A48295J13816N1126p8399r725k2823J3343K5806J4053k116M658k8733k5267
$$ 148295 262111 313237 234838 225113 202290 215633 241439 255492 253376 258034 229301 204034
17979B04034N252K1243P5324k5156k6146J1289N9752r0666j8676j2601l9483k3084
$$ 204034 209286 230529 305853 280697 254551 265840 325592 234926 216250 203649 164166 141082
17967A41082O7205J9285N9736J2321q0919j45623K7097K7119M5975J5317K4288
$$ 141082 208287 227572 287308 299629 218710 73087 100184 127303 173278 188595 212883
17956B12883M1531J5966Q8548P6132k3693q2370j3354J2487q964l5067m8009J0687
$$ 212883 254414 270380 358928 435060 411367 328997 315643 328130 319166 284099 236090 246777
17944B46777k8051J7135L3353n9787q5624K6441N891J6920J7962l2702j7231J7987
$$ 246777 218726 235861 269214 209427 123803 150244 156135 173055 191017 158315 141084 159071
17932A59071l2182J1261R2297n841j233N9804r308m3309k4920j0641l8727J4953
$$ 159071 126889 138150 230447 224606 223373 283177 273869 230560 205640 194999 156272 171225
17920A71225j0008j8427p4583K4758L5948o3279l3741L5222O4314L1632k7126
$$ 171225 161217 142790 68207 92965 128913 65634 31893 67115 131429 163061 135935
17909A35935P4092O6645J2702k076o2766j20314k41K1920L1600k3695O096M8375
$$ 135935 210027 276672 289374 287298 224532 104218 103977 125897 157497 133802 139898 188273
17897A88273K190l932l7763r665n1593n1011L7794J22803J02474J0950M0509K7112
$$ 188273 190463 186531 148768 139103 87510 36499 74293 197096 299570 310520 351029 378141
17885C78141j339r03k2620r8728m0205l684m4800n0509o0172O1600N0576Q712
$$ 378141 376802 375899 353279 254551 214346 210662 165862 115353 55181 116781 167357 176069
17873A76069j6574k9087n4996j594O0808r829l8610j9905L54k7899M3725J6797
$$ 176069 159495 130408 75412 73818 134626 124797 86187 66282 66636 38737 82462 99259
17861I9259j20758K2391O0815m9100l6936L5752R4500J19316k0843r6212n7694
$$ 99259 -21499 892 61707 12607 -24329 11423 105923 225239 204396 108184 50490
17850E0490K768J4981K4848P4613j3764k4909J4937m2902O640o8863N7758J09859
$$ 50490 53258 68239 93087 167700 153936 129027 143964 101062 107702 38839 96597 206456
17838B06456K1140k9970l9114M6507r6605k9612M5242N5683l1322J2039k8665
$$ 206456 227596 197626 158512 205019 108414 78802 124044 179727 148405 160444 131779
17827A31779O4284M8035j3580n3166q0545m9425K9131n6443R4911J54349J24564
$$ 131779 196063 244098 230518 177352 96807 47382 76513 20070 114981 269330 393894
17816C93894m006o0468j14253r8912m3256M748L3825M7620Q4391M4707j8837j04450
$$ 393894 389888 329420 215167 116255 72999 77747 111572 159192 243583 288290 269453 165003
17804A65003K896O378L2256K4243P7300K8386j0718m9782l5238K5298P1941Q9381
$$ 165003 167899 174277 206533 230776 308076 336462 325744 275962 240724 266022 337963 427344
17792D27344O1976l1139j61335j3876Q0205K3590N6813n3911l5972P8242J24638
$$ 427344 489320 458181 296846 282970 363175 386765 443578 389667 353695 431937 556575
17781E56575p8180j5529P8028K0721M2089Q915M9018L3511K968p8145k1730P5152
$$ 556575 478395 462866 540894 561615 603704 612619 661637 695148 698116 619971 598241 673393
17769F73393L9012O1016J02132M6202Q9495O4314M4272O1336J0836j0183l6767
$$ 673393 712405 773421 875553 921755 1011250 1075564 1119836 1181172 1192008 1181825 1145058
17758A145058j09614L5741J03152K21331K46707P7774j9034M7520M3484O2026
$$ 1145058 1035444 1071185 1174337 1395668 1642375 1720149 1701115 1748635 1792119 1854145
17748A854145J89376K32100L46154L83210L96909P32849J021085J178119J648338
$$ 1854145 2043521 2275621 2621775 3004985 3401894 4134743 5155828 6333947 7982285
17739G982285K615120M410907O051953M302522J132612p5223J077586N050546
$$ 7982285 10597405 15008312 21060265 25362787 26495399 26420176 27497762 32548308
17731C2548308Q939353R126291N972185j374044o712098o504626k353657M180182
$$ 32548308 41487661 50613952 56586137 55212093 48499995 41995369 39641712 43821894
17723D3821894O552326l99570p293790j0213252r248173n967749l339609j875615
$$ 43821894 50374220 49974650 42680860 32467608 23219435 17251686 13912077 12036462
17715A2036462j184556o98468m56396k91635O468R4711L81402R16999J661307
$$ 12036462 10851906 10153438 9697042 9405407 9411875 9506586 9887988 10804987 12466294
17706A2466294K419487L112663L244406L022582L546468M193715L110413O03379
$$ 12466294 14885781 17998444 21242850 24265432 27811900 32005615 35116028 35719407
17698C5719407j113308j075810M89668L473963P494270J3395643K2365143L3964461
$$ 35719407 34606099 33530289 34019957 37493920 44988190 58383833 80748976 114713437
17690A14713437M2110650L9416449L0239437J7769215k390506j1713216m335817
$$ 114713437 156824087 196240536 226479973 244249188 241858682 230145466 225809649
17683B25809649N873879K72699j5594137k1865560j7043325q091157j537393j53893
$$ 225809649 231683528 231956227 216362090 194496530 177453205 169362048 167824655 167670762
17675A67670762o606013j5685426k4368528k6623356k2874400j6673245j0830553
$$ 167670762 161064749 145379323 121010795 94387439 71513039 54839794 44009241
17668D4009241o616983l801243k567874k627709k863642k730885k325699j491737
$$ 44009241 37392258 33591015 31023141 28395432 25531790 22800905 20475206 18983469
17660A8983469p85907l30932L646O8409j62509k77246n6032M43005J298344K731031
$$ 18983469 18197562 17866630 17870276 17938685 17776176 17498930 17442898 17885903 19184247 21915278
17650B1915278M800743P849268J0864774J1225627P664791L317375N35957L55859
$$ 21915278 26716021 34565289 45430063 56655690 64320481 67637856 68173813 68529672
17642F8529672J652832J919421K25398J53968L804609J2731065K5884858L9053173
$$ 68529672 70182504 72101925 72327323 72481291 76285900 89016965 114901823 153954996
17634A53954996M8098616L9355806J1885296j6147939l5352841l7889663l3155694
$$ 153954996 202053612 241409418 253294714 237146775 201793934 163904271 130748577
17627A30748577k7610686k2284635j7556552j3383567r868580p440400n385413
$$ 130748577 103137891 80853256 63296704 49913137 40044557 32604157 27218744
17620B7218744l843996k462973j280077q27741j145467j465244j237903n96247
$$ 27218744 23374748 20911775 19631698 18803957 17658490 16193246 14955343 14359096
17612A4359096L91617R20345Q7975j289758k200401k359704j813024j242293r38739
$$ 14359096 14750713 15671058 15759033 14469275 12268874 9909170 8096146 6853853 5915114
17603E915114p16994n66402n33987l08610j88402k46644l17525k87005j43826
$$ 5915114 5198120 4631718 4097731 3789121 3600719 3354075 3036550 2749545 2605719
17594B605719L111r766Q022N796j32544k59798k09823k10348q1759N8323o8885
$$ 2605719 2608830 2599064 2607086 2612882 2480338 2220540 2010717 1800369 1718610 1776933 1708048
17583A708048j02533j43015j45544p4411r4960q9270q5248J1314M6353j7297n7283
$$ 1708048 1605515 1462500 1316956 1242545 1147585 1058315 973067 984381 1030734 1013437 956154
17572I56154M259k8166n1052j06707j22801O5384R0682n9849r073M6387J4483
$$ 956154 960413 932247 881195 774488 651687 717071 807753 747904 738831 785218 799701
17561G99701n0240K0684p76m2738k9902j22293j11166L5431j0222k2236o6334
$$ 799701 749461 770145 769369 726631 696729 574436 463270 498701 488479 466243 399909
17550C99909n0286R0432r047p4915k8975J9065m9541n3700L3000J04082p95l0778
$$ 399909 349623 440055 431008 356093 327118 346183 296642 242942 275942 380024 379229 348451
17538C48451J7221M8325q1821l347k7845n1623M4423j3352O794J4818O7404J33982
$$ 348451 365672 413997 332176 328829 300984 249361 293784 280432 287226 302044 369448 503430
17526E03430j6516p6831J9736J1702m2807l2752J33612O648l7350n8936m2269
$$ 503430 486914 410083 429819 441521 398714 365962 499574 506222 468872 409936 367667
17515C67667l1746m7181O7114N7901O1290l6607n9664N2724Q2763j5308m1583
$$ 367667 335921 288740 355854 413755 475045 438438 378774 431498 514261 498953 457370
17504D57370k3253j36668j19483m937O9558J8576j03153k4812j1136J20888k737
$$ 457370 434117 297449 177966 173029 242587 261163 158010 133198 122062 242950 240213
17493B40213o1024p6960m7496k113l7122N7701O940r0398L5180J89698M5107o7584
$$ 240213 179189 102229 54733 52620 15498 73199 80139 -10259 24921 214619 259726 192142
17481A92142m7470J5632N0792J01707j420r4435j7630n9726r931O3830N2016j894
$$ 192142 144672 160304 211096 312803 311383 216948 199318 139592 129661 193491 245507 243613
17469B43613k4023K8887r0094j14619m1839l9427M3890O9548M047j8314J7162
$$ 243613 219590 248477 158383 43764 1925 -37502 6388 75936 79983 61669 78831
17458G8831K0565M357L9273O705j723N3442P9612L5537l9582k1923M7366J1782
$$ 78831 99396 103753 143026 149731 148008 201450 281062 316599 277017 255094 302460 314242
17446C14242K5945J41110K49983K17147j0286j26840k00627j37716j94660m4328
$$ 314242 340187 481297 731280 948427 938141 811301 610674 472958 278298 233970
17436B33970k5300o7462K3080R5744J4232o1270q5099o6227J3291M2947j7843
$$ 233970 208670 141208 164288 260032 274264 212994 127895 61668 74959 117906 100063
17425A00063p0856N50L6630K4934j3494J7158N967N7491m7131j5230l9346p7363
$$ 100063 29207 29757 66387 91321 77827 94985 100952 158443 111312 96082 56736 -20627
17413b0627q9246j4473L3327J24322R3297J7522k6860k8127n0136J0033j8769
$$ -20627 -109873 -124346 -91019 33303 126600 144122 117262 89135 38999 49032 30263
17402C0263l4323O4311O2137n9126j25487M130K3374l5247j4346r0728k68K6848
$$ 30263 -4060 60251 122388 63262 -62225 -58095 -34721 -69968 -84314 -175042 -175310 -148462
17390a48462Q8706P3716L2289l3609o4026J066J6318N8729P5756k392N027o8141
$$ -148462 -59756 13960 46249 12640 -51386 -50320 -34002 24727 100483 98091 103118 34977
17378C4977n4296p8065m7162K6658P1277m2655l0811J44181J0153j07086j3501
$$ 34977 -19319 -97384 -144546 -117888 -46611 -89266 -120077 24104 34257 -72829 -86330
17367h6330N9221R6485M0223l5419p0656k7090N8271j6695m2370p4127l4923L8751
$$ -86330 -27109 69376 109599 74180 3524 -23566 34705 18010 -24360 -98487 -133410 -94659
17355i4659J2420L8195J00Q8432K8062m8221O176N2049J1240m0290M7377M2019
$$ -94659 -82239 -44044 -43944 44488 72550 24329 30505 82554 93794 53504 100881 142900
17343A42900M265m2971n8126J2286j8582q3584n2297k1208k727m655N2789n5465
$$ 142900 147165 104194 46068 58354 39772 -43812 -96109 -117317 -120044 -124699 -71910 -127375
17331a27375Q0060Q1438n167J4165m3149l6607p2957k3903N3764L2588Q8414J14720
$$ -127375 -47315 34123 28956 43121 -28 -36635 -109592 -133495 -79731 -47143 41271 155991
17319A55991o6551j57617o9501j627j254k160L0949n9111M2414R2678m1136n0054
$$ 155991 89440 -68177 -137678 -139305 -140559 -142719 -111770 -170881 -128467 -35789 -76925 -126979
17307a26979Q03J4931J12656N849o1312j999O5953j3136J2346R7724r3777l0521
$$ -126979 -126176 -111245 1411 7260 -54052 -56051 9902 -3234 9112 106836 13059 -17462
17295a7462O4512l1732O9577K0550j9076n459l6268l200o3938j04841j7042L1143
$$ -17462 47050 15318 84895 105445 86369 80910 44642 41442 -22496 -127337 -144379 -113236
17283a13236P1717L1996K6239k32j0465N2389L8294j3417M1719j07257n8259p891
$$ -113236 -41519 -9523 16716 16484 6019 58408 96702 83285 125004 17747 -40512 -48403
17271d8403K7568p2341k4638l7235j2700J15064R627m052k1816o1439L0223k8996
$$ -48403 -20835 -93176 -117814 -155049 -167749 -52685 -43058 -47110 -68926 -130365 -100142 -129138
17259a29138O754K3915M7815P3755Q1147p6290q4610n9801k1183K8317n845L5876
$$ -129138 -122384 -98469 -50654 23101 104248 27958 -56652 -116453 -137636 -109319 -115164 -79288
17247g9288P3488L3211N8123N2031j7077J6957M0376j07226p0072l6577r3415
$$ -79288 -5800 27411 85534 137565 120488 137445 177821 70595 523 -36054 -129469
17236a29469q4351P3950P8430O9581k6664L0750L2132J8749j2035M8655Q4831
$$ -129469 -213820 -139870 -61440 8141 -18523 12227 44359 63108 51073 99728 184559
17225A84559O2460L7781k4880j7964k859n3231o489K8831J10243P5797m8060r6727
$$ 184559 247019 284800 259920 241956 239097 185866 179377 208208 318451 394248 346188 249461
17213B49461j25244N8736k6355R500o756p5540m9659m401M6566j5886n0262J1983
$$ 249461 124217 182953 156598 166098 159342 83802 34143 29742 76308 60422 10160 22143
17201B2143k9371j8785k1354k2216P6017J04144k208R4900J02635k669o2655J27643
$$ 22143 -7228 -26013 -47367 -69583 6434 110578 108370 203270 305905 303236 240581 368224
17189C68224K8344o007K9400M7510L9221k2074K1078P6681j7027p2240o3067Q5460
$$ 368224 396568 390561 419961 467471 506692 484618 505696 582377 565350 493110 430043 515503
17177E15503J06926J91782J24012N7003m0874M4377J10170J21775r7399k46482
$$ 515503 622429 814211 938223 995226 954352 998729 1108899 1230674 1133275 886793
17167H86793k24836j7034m9626k0140p4147o6427k7599q1030q6525j14978k1320
$$ 886793 661957 644923 595297 575157 501010 434583 406984 325954 239429 124451 103131
17156A03131q8079k3073N7981Q2232J9699Q889L16j06770q9925J8375J09640M4574
$$ 103131 15052 -8021 49960 132192 151891 160780 161096 54326 -35599 -17224 92416 136990
17144A36990R1858L9456m5450K0461N2167N6530J16298N4526m613Q1657k7319
$$ 136990 228848 268304 222854 243315 295482 352012 468310 522836 518223 599880 572561
17133E72561j10537K4248p795L0707O042J0506j38515o7118R1242O7256P9661
$$ 572561 462024 486272 478477 509184 515226 525732 387217 320099 411341 478597 558258
17122E58258L6379L8929l2358p1908J8863P2684P1843l0116p1540m2566m8673
$$ 558258 594637 633566 601208 529300 548163 620847 692690 662574 591034 548468 499795
17111D99795j09661q3217n0450j25282n5930o5301o2873P2594N4945p832K096
$$ 499795 390134 306917 256467 131185 75255 9954 -52919 19675 74620 66788 68884
17100F8884N2586j2051n5613L4053M215j4425K4486p4593o4171N2021m3564j9674
$$ 68884 121470 109419 53806 87859 92074 77649 102135 27542 -36629 15392 -28172 -47846
17088d7846O6503O8689N019q2941K3698p964j0686J1977l9964j08040j04L0588
$$ -47846 18657 87346 92365 9424 33122 25158 14472 26449 -13515 -121555 -121659 -91071
17076i1071m7692J02333l5188k202L1556j4768J3992N849N4190L984n4701p6817
$$ -91071 -138763 -36430 -71618 -73820 -42264 -57032 -43040 -37191 16999 20983 -33718 -110535
17064a10535J7104O4543J2368P1075l8515k4557q8973q5115N2351J30258L8726
$$ -110535 -93431 -28888 -16520 54555 16040 -8517 -97490 -182605 -130254 4 38730
17053C8730r6171k3166J4473p4659K6158J38459l7735l7704l9752j2563l7469
$$ 38730 -57441 -80607 -66134 -140793 -114635 23824 -13911 -51615 -91367 -103930 -141399
17042a41399P6024K5267L5153K6899K2066j03459l9603M0568L8039M3875K8076
$$ -141399 -65375 -40108 -4955 21944 44010 -59449 -99052 -58484 -20445 23430 51506
17031E1506p2913r238N6902J9303p4415j4033M9197L9677r2230m9196O0024p7551
$$ 51506 -21407 -30645 26257 45560 -28855 -42888 6309 45986 -46244 -95440 -35416 -112967
17019a12967k3562J4670j6989l3591p724P6500r490P8910N6938l4030m4019M121
$$ -112967 -136529 -121859 -138848 -172439 -180163 -103663 -113153 -34243 22695 -11335 -55354 -51233
17007e1233L00k6423N9137K6872j1737p8372j7852J1840L9904M3436m3456o9486
$$ -51233 -50933 -77356 -18219 8653 -3084 -81456 -99308 -87468 -47564 -4128 -47584 -117070
16995a17070o0049j6254J28875L5109J7255O056P0206j9044j8594r1928k2177
$$ -117070 -177119 -193373 -64498 -29389 -12134 -6078 64128 45084 26490 -65438 -87615
16984h7615O633M6110K9727l5331q7304K8768J54930j2338j06101M8251R6882
$$ -87615 -80982 -34872 -5145 -40476 -127780 -99012 55918 43580 -62521 -14270 82612
16973H2612N4637L841l3804j36704l2772j3339M0982J3015j34609J2731J14302
$$ 82612 137249 141090 107286 -29418 -62190 -75529 -34547 -21532 -156141 -143410 -29108
16962b9108K1318m4865o1903J2559K1056m4740q9649o7300Q1660P4969K9338l2522
$$ -29108 -7790 -52655 -114558 -101999 -80943 -125683 -215332 -282632 -200972 -126003 -96665 -129187
16950a29187O6833j604N6631M0881m8325M4157N3165J7878q5206n4475R925j7975
$$ -129187 -62354 -63958 -7327 33554 -14771 29386 82551 100429 15223 -39252 -29327 -47302
16938d7302m9254j5682R2216J23047K6394L8454n2530L7734K3341o2647j61687
$$ -47302 -96556 -112238 -20022 103025 129419 167873 115343 153077 176418 113771 -47916
16927d7916q0512M8175J7170N3115J60777P7998l5558l511q5512k8817L821j3528
$$ -47916 -128428 -80253 -63083 -9968 150809 228807 193249 189738 104226 75409 79230 65702
16915F5702k7849m67o5811L2996J0115l3344M3599k3966o626n861r704K7599L428
$$ 65702 37853 37386 -28425 4571 14686 -18658 24941 975 -5651 -11512 -21216 6383 9811
16902I811R1550l793n9785m9489k2023N3272N291q2038p9784L8063N0236M0871
$$ 9811 101361 97568 37783 -11706 -33729 19543 24834 -57204 -136988 -98925 -48689 -7818
16890g818J7704R2834n0358q9446j1692o579k2205l7364m5659L7271Q8660O3663
$$ -7818 9886 102720 52362 -37084 -48776 -55355 -77560 -114924 -160583 -123312 -34652 29011
16878B9011J204K8143O4749j06469l8081J6305n5097L7113L6853L0436L6736j47069
$$ 29011 30215 58358 123107 16638 -21443 -5138 -60235 -23122 13731 44167 80903 -66166
16866f6166p6671Q8784O8326K015j37044q1459K6622O8211m3054L020N9839l7431
$$ -66166 -142837 -54053 14273 16288 -120756 -202215 -175593 -107382 -150436 -147416 -87577 -125008
16854a25008L232J21893Q437j29086j1712M7676J3358J2825k4181l7638j8848
$$ -125008 -121776 117 8554 -120532 -132244 -84568 -71210 -58385 -82566 -120204 -139052
16843a39052m9271J293O3487k6345m9377J8293J0061P2893J22461M990p5693n6952
$$ -139052 -188323 -187030 -123543 -149888 -199265 -180972 -170911 -98018 24443 29433 -46260 -103212
16831a03212L7257K6455k5739j5053N8190k2240l1809l9416N1805N5408J4050
$$ -103212 -65955 -39500 -65239 -80292 -22102 -44342 -76151 -115567 -63762 -8354 5696
16820E696o6066j1564P0472r8259l2127P1247J5150M7999Q234r183m944R985K1740
$$ 5696 -60370 -71934 -1462 -99721 -131848 -60601 -45451 2548 10782 1599 -3345 6640 28380
16807B8380n064n0161q9287J2165J1452L5336n0214n887P3976m880m3079R9379
$$ 28380 23316 -26845 -116132 -103967 -92515 -57179 -107393 -113280 -39304 -44184 -87263 12116
16795A2116m5009m7085o2110k1550n2719l5711J06317J11903Q420l531k9896j6461
$$ 12116 -32893 -79978 -142088 -163638 -216357 -252068 -145751 -33848 -25428 -28959 -58855 -75316
16783g5316O9224J2054p0226l9421L8957L4448O0994n6564k0000N3517n493j0773
$$ -75316 -6092 5962 -64264 -103685 -64728 -30280 30714 -25850 -45850 7667 2174 -8599
16771h599M6294k5048o5785K2247K7598l1448j0455J5428O8393l0812K716k6528
$$ -8599 37695 12647 -53138 -30891 -3293 -34741 -45196 -29768 38625 7813 10529 -15999
16759a5999M7488M9078p2256j6246Q2041k3549q6449O6974M2498m5970j70767
$$ -15999 31489 80567 8311 -7935 74106 50557 -35892 31082 73580 27610 -143157
16748a43157o0938J24081o9288n9947m4177O3199J8207k5369M1096O5214k0338
$$ -143157 -204095 -80014 -149302 -209249 -253426 -190227 -172020 -197389 -156293 -91079 -111417
16737a11417O3732Q8406l9490j22781J1860J0602K1271Q0143O590p3284q7376
$$ -111417 -47685 40721 1231 -121550 -109690 -99088 -77817 2326 8916 -64368 -151744
16726a51744n596o005l80M3097J7692M3773j5848J1717P3080O3907k207N633k917
$$ -151744 -157340 -163345 -163725 -120628 -102936 -59163 -75011 -63294 9786 73693 71486 77119 74202
16713G4202o386J8169m4657N260O9058P248J4792K9830o9855j52950l8175Q7786
$$ 74202 67816 85985 41328 46588 115646 122894 137686 167516 97661 -55289 -93464 -5678
16701e678l6942m4403M9832R3515j7479j2283p5731p3975n6824N3087l8572L0316
$$ -5678 -42620 -87023 -37191 56324 38845 26562 -49169 -123144 -179968 -126881 -165453 -135137
16689a35137O4605R0247n3930P1750Q156K9932p5755p6207m4616n1419N5913K1857
$$ -135137 -70532 19715 -34215 37535 45691 75623 -132 -76339 -120955 -172374 -116461 -94604
16677i4604l6870m4776J0859L9434j4133O9580M7523l6754r8835K5045J17510
$$ -94604 -131474 -176250 -165391 -125957 -140090 -70510 -22987 -59741 -158576 -133531 -16021
16666a6021Q1428P52L1330o1383n7883k2884K1174J880o205K2102R003L0047r727
$$ -16021 65407 66159 97489 36106 -21777 -44661 -23487 -21607 -27812 -5710 3293 33340 23613
16653B3613K4485q0341p4444N4487p466l9588L021O655k5266P870o8643K0327
$$ 23613 48098 -32243 -106687 -52200 -59666 -99254 -96233 -89578 -114844 -106974 -175617 -155290
16641a55290R4355P883l896M7079L0823n7418J1353K3249n4768K2984M1467L4454
$$ -155290 -60935 -53052 -56948 -9869 20954 -36464 -25111 -1862 -56630 -33646 7821 42275
16629D2275J22m1925m6683J3052m8303N3192K2513j7244K6766k4916k0600o0086
$$ 42275 42397 472 -46211 -33159 -81462 -28270 -5757 -23001 3765 -21151 -41751 -101837
16617a01837J0854R4687m009n5908n340m3377M462J301J9778L6884Q770L9546
$$ -101837 -90983 3704 -305 -56213 -61553 -104930 -100468 -99167 -79389 -42505 -33735 5811
16605E811J5549n8655k1380L5607n0903J3514L4882P464L8680l5521p5153r934
$$ 5811 21360 -37295 -58675 -23068 -73971 -60457 -25575 -18111 20569 -14952 -90105 -100039
16593a00039Q4706K4904p6437n233O7461K0444o5819p4072j521k5729j876l4463
$$ -100039 -15333 9571 -66866 -72099 -4638 15806 -50013 -124085 -125606 -151335 -153211 -187674
16581a87674J21278M9484k1883n0622p6256J1706O9518k4918K0640m6062J0307
$$ -187674 -66396 -16912 -38795 -89417 -165673 -153967 -84449 -109367 -88727 -134789 -124482
16570a24482q590l4040M6924L5138J6586M69O8357J4721k7258m2350j2535j7492
$$ -124482 -133072 -167112 -120188 -85050 -68464 -67995 362 15083 -12175 -54525 -67060 -84552
16558h4552m0603J43151K6946J2548l8932N7550k2505p2514o7411m6250O6601
$$ -84552 -125155 17996 44942 57490 18558 76108 53603 -18911 -86322 -132572 -65971
16547f5971K0074m9207l6689J01463N3219L1822L6296m8266k0024Q285k4438k3511
$$ -65971 -45897 -95104 -131793 -30330 22889 54711 91007 42741 22717 31002 6564 -16947
16535a6947R822M882k3736R6473m3344q0688m5022L4642L5375m8013O691N8024
$$ -16947 -7125 -2243 -25979 70494 27150 -53538 -98560 -63918 -28543 -76556 -69865 -11841
16523a1841j356K879J7406K0790k0007k2048J1575k1245N4162J6282k4623j3856
$$ -11841 -13197 -10318 7088 27878 7871 -14177 -2602 -23847 30315 46597 21974 8118
16511H118k4862R2413L5352j09075r1176L1097K6839M7795K5004L5431k2294j8631
$$ 8118 -16744 75669 111021 1946 -89230 -58133 -31294 16501 41505 76936 54642 36011
16499C6011o6277q2272n131N116N04k1704O7316m496K35r3476m4627J14615J08418
$$ 36011 -30266 -112538 -117669 -112553 -112049 -133753 -66437 -70933 -70698 -164174 -208801 -94186 14232
16486A4232j9116j02647j6380Q7749M0357J4883k6069J7809K1307p2625n6236
$$ 14232 -4884 -107531 -123911 -36162 4195 19078 -6991 10818 32125 -40500 -96736
16475i6736k179k0646o4914K3638o8143K7339k7530M7981M3410K2421M4044J41137
$$ -96736 -98915 -119561 -184475 -160837 -228980 -201641 -229171 -181190 -137780 -115359 -71315 69822
16463F9822L3125l7861J8965k5880l0849o493j2710m2914L275K922J2415L2176
$$ 69822 102947 65086 84051 58171 27322 20829 8119 -34795 -31520 -28598 -16183 15993
16451A5993L174l1527k484J04879M7515n9523n8524q0488j07170K469r52l4949
$$ 15993 19167 -12360 -14844 90035 137550 78027 19503 -60985 -168155 -165686 -166638 -201587
16439b01587R4898N7124k1758q3538k9990M4850L9251O962J2545o2695J0220J4234
$$ -201587 -106689 -49565 -71323 -154861 -184851 -140001 -100750 -93788 -81243 -143938 -133718 -119484
16427a19484m4083k9108O1887N0947J31029L7624n0614j7250R358m559m6463L463
$$ -119484 -163567 -192675 -130788 -79841 51188 88812 38198 20948 30306 25747 -20716 -17253
16415a7253l8961O3527J859j3954J15410j2112j34964k6479J460K811J7568M2083
$$ -17253 -56214 7313 9172 -4782 110628 98516 -36448 -62927 -61467 -58656 -41088 995
16403I95J1699r416N9917M6308M4135o9614j9212L540j41433m3089P2753L4086
$$ 995 12694 3278 63195 109503 153638 84024 64812 68352 -73081 -116170 -43417 -9331
16391i331j2600J141o7122k2521P6022N713K8453M1599k8949r3959L264q581L3846
$$ -9331 -21931 -20790 -87912 -110433 -34411 -28698 -245 41354 12405 -81554 -78290 -86871 -53025
16378e3025j6759m1312O2459L7585R7365k6415j37941p3978J7266o9139P4952
$$ -53025 -69784 -111096 -48637 -11052 86313 59898 -78043 -152021 -134755 -203894 -128942
16367a28942R2962J6886M3573k1261m7378N743m0729J4874K326l1442m7276P4555
$$ -128942 -35980 -19094 24479 3218 -44160 -38417 -79146 -64272 -61946 -93388 -140664 -66109
16355f6109K0970J09039N5811o5153j18743p806k2476k658n7513Q1714N7705n1814
$$ -66109 -45139 63900 119711 54558 -64185 -71991 -94467 -97125 -154638 -72924 -15219 -67033
16343f7033n4910L6741K8086m5591p2157M884L8445O9341J5695o6923q505m267
$$ -67033 -121943 -85202 -57116 -102707 -174864 -169980 -131535 -62194 -46499 -113422 -121927 -126194
16331a26194L0053l9076n5468P4430J92380J4188m8773p491K6186L9671j555k8708
$$ -126194 -96141 -135217 -190685 -116255 76125 90313 41540 34049 60235 99906 98351 69643
16319F9643j8170l1828k0023k5043q6813k7225o546J31297n291L1123P9208m8239
$$ 69643 51473 19645 -378 -25421 -112234 -139459 -146005 -14708 -19999 11124 90332 42093
16307D2093l2062j07053k4629L3172J05494O5466m8003q041k6794L2032O405o5199
$$ 42093 10031 -97022 -121651 -88479 17015 82481 34478 26437 -357 31675 38080 -27119
16295b7119j16683n470O4096N2266K7108J0983o9992j3964P6302K2189q26N1097
$$ -27119 -143802 -149272 -85176 -32910 -5802 5181 -64811 -78775 -2473 19716 18890 69987
16283F9987K4685j37512j9279R736k1129K133L2487N2059j211L9997p0026n8494
$$ 69987 94672 -42840 -62119 -52383 -73512 -71379 -38892 13167 11956 51953 -18073 -76567
16271g6567L5449J5727m8541P747J4913L3591K1230l3672M4931O6003o0605n5993
$$ -76567 -41118 -25391 -73932 -66185 -51272 -17681 3549 -30123 14808 80811 20206 -35787
16259c5787m187l5546L8864o6827q252M3767O3291O3413k3367o1533n3675l2603
$$ -35787 -39974 -75520 -36656 -103483 -111735 -67968 -4677 58736 35369 -26164 -79839 -112442
16247a12442K1449J33282N947k3154j717P2006k791l7077r623o9339q7756k3104
$$ -112442 -90993 42289 48236 25082 23365 95371 92580 55503 45880 -23459 -111215 -134319
16235a34319j4635M454K1191K9166L9714j7992L2139o1096Q882K6766j3653P8073
$$ -134319 -148954 -144500 -123309 -94143 -54429 -72421 -40282 -101378 -92496 -65730 -79383 -1310
16223a310L5681L8188m55J2088J930j10239o6805K6481Q0455K7032l734k4807
$$ -1310 34371 72559 72104 84192 86122 -24117 -90922 -64441 16014 43046 39312 14505
16211A4505N1681k7687l2263J3143R688k0738o9841K2707l1939m8524Q5488R8690
$$ 14505 66186 38499 6236 19379 29067 8329 -61512 -38805 -70744 -119268 -33780 64910
16199F4910P219L7882n1137k5568J4307p9797O3326N1809N7272o9408l5868K6189
$$ 64910 72129 110011 58874 33306 47613 -32184 31142 82951 140223 70815 34947 61136
16187F1136r940p1116o318l6089M9738N963j0746M6387J1859k1936m0337k0483
$$ 61136 51196 -19920 -26238 -62327 -12589 -6626 -17372 29015 40874 18938 -21399 -41882
16175d1882l214K4713N7563L4079k9479q5864N3113M9456k0044q2665L4140j3612
$$ -41882 -45096 -20383 37180 71259 41780 -44084 9029 58485 38441 -44224 -10084 -23696
16163b3696m276R239N1380N0390l7475M9959N765Q8801P6430K631l6358j32715
$$ -23696 -27972 -18733 32647 83037 45562 95521 101286 190087 266517 269148 232790 100075
16151A00075q0865P33J6372R176o9027Q4706L7938o2515j1344n3020L7866K8767
$$ 100075 19210 19943 36315 45491 -23536 61170 99108 36593 25249 -27771 10095 38862
16139C8862l6465l8093M2053P9343N4875q4119J1340O0215m1756k5135k9525M706
$$ 38862 2397 -35696 6357 85700 140575 56456 67796 128011 86255 61120 31595 36301
16127C6301k901r882j44275o6284M1741Q0408j5278P249N7961Q8627l9372n6052
$$ 36301 33400 23518 -120757 -187041 -145300 -64892 -80170 -72921 -14960 73667 34295 -21757
16115b1757m3355j0790Q481j4932M6363N0319J1951m8763j11675M5750L0730l060
$$ -21757 -65112 -75902 -67421 -82353 -35990 14329 26280 -22483 -134158 -88408 -57678 -60738
16103f0738R1468L1148K1710m3722m0586o715j1460k8633l8090P0781L1224J0592
$$ -60738 30730 61878 83588 39866 -720 -7435 -18895 -47528 -85618 -14837 16387 26979
16091B6979n263n6889k0811n9196N3993Q8417K2647k1068n1618j08116K7043m2597
$$ 26979 21716 -35173 -55984 -115180 -61187 27230 49877 28809 -22809 -130925 -103882 -146479
16079a46479M9538O1669n021l3662j6146J45561M8867j2583O9704k4270m3623
$$ -146479 -96941 -35272 -40293 -73955 -90101 55460 104327 91744 161448 137178 93555
16068I3555m8008l6775l132m4129O519J9654O4928Q3867o9577j11436J6362P1025
$$ 93555 45547 8772 5640 -38489 -31970 -12316 52612 136479 66902 -44534 -28172 42853
16056D2853L0227M903j01807J3649M9691N7297m6618m8297q1483j0321M7569m6419
$$ 42853 73080 77983 -23824 -10175 39516 96813 50195 1898 -79585 -89906 -42337 -88756
16044h8756n9918Q9048P3769j4053r278j0928m3265m8613J4805k2174o2327Q1495
$$ -88756 -148674 -59626 14143 90 -9188 -20116 -63381 -111994 -97189 -119363 -181690 -100195
16032a00195P0660j3915p2849J4314J5400o5634j0121L4005L5018O7715J638k4023
$$ -100195 -29535 -43450 -116299 -101985 -86585 -152219 -162340 -128335 -93317 -25602 -23964 -47987
16020d7987o633J9017P8925Q859Q36k028r8184p8048J7649R2849O2637k5832M0516
$$ -47987 -54620 -35603 43322 52181 53017 50989 -47195 -125243 -107594 -14745 47892 22060 62576
16007F2576o0732l7168J7354n2324n2539j2005Q4972N6917K6253n4998l6732m8427
$$ 62576 1844 -35324 -17970 -70294 -122833 -134838 -49866 7051 33304 -21694 -58426 -106853
15995a06853J5338k1559O8991Q5082K3043o7104o4471K631N4887N2048o5717J1166
$$ -106853 -91515 -113074 -44083 40999 64042 -3062 -67533 -64902 -10015 42033 -23684 -12518
15983a2518O9210L4120J2960j244j9916k0706M0513K1331q3971m9939l3457P988
$$ -12518 56692 90812 103772 102528 82612 61906 102419 123750 39779 -10160 -43617 -35629
15971c5629M2758k0484n1709K4985O6859O8106n4998l0358N950k3073Q14M332
$$ -35629 7129 -13355 -65064 -40079 26780 94886 39888 9530 15480 -7593 -6779 -2447
15959b447L6528j28596l1729M6939M3185M5613J9831o658J5703N896o5894N079
$$ -2447 34081 -94515 -126244 -79305 -36120 9493 29324 22666 38369 44265 -21629 -16550
15947a6550M6870J2956o8567R569R5213j05768k4928J00706K5666K4416M2623
$$ -16550 30320 43276 -25291 -15722 79491 -26277 -51205 49501 75167 99583 142206
15936A42206n3402p9016j8152j728K2850O7667P753p5870q815M6491m4071p769
$$ 142206 88804 9788 -8364 -10092 12758 80425 88178 12308 3493 49984 5913 -1856
15924a856J17757m955o0810j05154k0862o015M0293O8952K514l8820n2233L4172
$$ -1856 115901 110946 50136 -55018 -75880 -81895 -41602 27350 29864 -8956 -61189 -27017
15912b7017J0777N6559L4045q520n7545j0367J0384O0727m945r5328n0079O38
$$ -27017 -16240 40319 74364 65844 8299 -2068 8316 69043 64098 -31230 -81309 -80671
15900h0671L9437J62705l0136j5509m1326P6331M5856n2658M4851J4018n9469
$$ -80671 -41234 121471 91335 75826 34500 110831 156687 104029 148880 162898 103429
15889A03429l4556j6486Q31n5115K3051J61708J03101J79976J35177j07681o8496
$$ 103429 68873 52387 53218 -1897 21154 182862 285963 465939 601116 493435 424939
15878D24939n1717o1335o5688j38589j15739l7185o884J6958k7799J5019J0666
$$ 424939 373222 311887 246199 107610 -8129 -45314 -52198 -35240 -63039 -48020 -37354
15867c7354N3027P3002K3357M4278n567l0679J3404l2378m3078J2908q1177K144
$$ -37354 15673 88675 112032 156310 150743 120064 133468 101090 58012 70920 -10257 -8113
15855h113l2823K5797p132Q423N8571k5238K4079j6505j8579q8732n212O2261
$$ -8113 -40936 -15139 -22271 -13848 44723 19485 43564 27059 8480 -80252 -85464 -23203
15843b3203P4304k1029q2615n5094L9518K2895J9779J9929P130J0118l9724o0963
$$ -23203 51101 30072 -52543 -107637 -68119 -45224 -25445 -5516 1614 11732 -27992 -88955
15831h8955n4615J814p307J6223K5301Q3124J8875n8166j420k1051l0709K9752
$$ -88955 -143570 -141756 -149063 -132840 -107539 -24415 -5540 -63706 -65126 -86177 -116886 -87134
15819h7134O964J4714m845N3838K9957N4025m9345r2302p1554j5096k4483J02843
$$ -87134 -80170 -65456 -70301 -16463 13494 67519 18174 -74128 -145682 -160778 -185261 -82418
15807h2418K7398K6399O0017l5024j0954m4963k8024R2140p519p5181L2974L6099
$$ -82418 -55020 -28621 31396 -3628 -14582 -59545 -87569 4571 -2948 -78129 -45155 -9056
15795i056l9461k1214R0172Q0107j1637q3395m6286n7396k434M3912Q6783P3428
$$ -9056 -48517 -69731 20441 100548 88911 5516 -40770 -98166 -100600 -56688 30095 103523
15783A03523M5108P2381l0157p6255p80m788P751j3278n5759j3484L9916k070
$$ 103523 148631 221012 190855 114600 113820 109032 116783 103505 47746 34262 74178 72108
15771G2108k588k6062o3092P1037J8667Q0503Q8712o6324n1672n483j1828P176
$$ 72108 69520 43458 -19634 51403 70070 150573 239285 172961 121289 115806 103978 111154
15759A11154k3975o3310l8670K6884m9877o447k5000j058N7331Q0117n4940n6785
$$ 111154 87179 23869 -14801 12083 -37794 -44241 -69241 -70299 -12968 67149 12209 -44576
15747d4576M5088P4121m8276l232l4989n9594J3782O9858M1471k3641o3260k8308
$$ -44576 512 74633 26357 23125 -11864 -71458 -57676 12182 53653 30012 -33248 -61556
15735f1556r087k0767R4311M5237L6837n1909q9314l7884L1878J5347K0355m5315
$$ -61556 -70643 -91410 2901 48138 84975 33066 -56248 -94132 -62254 -46907 -26552 -71867
15723g1867l4357K586K4262k9981n311m8729J27459O3577l9142k1420j5106j4569
$$ -71867 -106224 -103638 -79376 -109357 -114668 -163397 -35938 27639 -11503 -32923 -48029 -62598
15711f2598O2191O5634m2242o0215m8162K1553N0070k3363j7466K3684j785Q9521
$$ -62598 -407 65227 22985 -37230 -85392 -63839 -13769 -37132 -54598 -30914 -32699 56822
15699E6822l2242N9496k3521l0879P7914K1895n4943j8266J1445j9281l2040J0226
$$ 56822 24580 84076 60555 29676 107590 129485 74542 56276 67721 48440 16400 26626
15687B6626J4239r528k0193j6355J5051N3900q3855k4190N9574j8476K004j9018
$$ 26626 40865 31337 11144 -5211 9840 63740 -20115 -44305 15269 -3207 -1203 -20221
15675b0221j09743L3623O0297l2716L0993Q2995k4242p2095L8218K6416j2441
$$ -20221 -129964 -96341 -36044 -68760 -37767 45228 20986 -51109 -12891 13525 1084
15664A084M0281P405m8063m9332L9942K1381J2047J9539n7297j3024J2260O946
$$ 1084 41365 48770 707 -48625 -8683 12698 24745 44284 -13013 -26037 -13777 -6831
15652f831n2670l6659l3528L9281j9398P1714P7936J63q6902o0492M5793K8847
$$ -6831 -59501 -96160 -129688 -90407 -109805 -38091 39845 40008 -46894 -107386 -61593 -32746
15640c2746k2275j00791J20678R0693j9979J7641l0315j6371j3909J9913j4778
$$ -32746 -55021 -155812 -35134 55559 35580 53221 22906 6535 -7374 12539 -2239
15629b239l2407m4065O9140K15074N7112j30142j64108L0071M6760L6508m8989
$$ -2239 -34646 -78711 -9571 205503 262615 132473 -31635 -1564 45196 81704 32715
15618C2715o4337J8311M1703J08665n0311r2161n3336j2643M9891m8538P7218
$$ 32715 -31622 -13311 28392 137057 86746 -5415 -58751 -71394 -21503 -70041 7177
15607G177M4646N8754R3503j01752j2213M895R3506l5635l8103R854k2524l9531
$$ 7177 51823 110577 204080 102328 90115 95010 188516 152881 114778 124632 102108 62577
15595F2577j07588L2984L5323j7655K8678j8823n4839K042K2337J9767l2864j27172
$$ 62577 -45011 -12027 23296 5641 34319 15496 -39343 -37301 -14964 4803 -28061 -155233
15583a55233J4092J02847K4264n3961K3774M0830P7314L9308m5750J1410m546
$$ -155233 -141141 -38294 -14030 -67991 -44217 -3387 73927 113235 67485 78895 74349
15572G4349j2318k1238J1772r5446n5682r359P0849K8842k0669m675K6616K9272
$$ 74349 62031 40793 52565 -42881 -98563 -107922 -37073 -8231 -28900 -33575 -6959 22313
15560B2313J0116N3508N5236K186m0547p8862N970O5890l746p1795r739L1842
$$ 22313 32429 85937 141173 143359 102812 23950 29920 95810 92064 20269 10530 42372
15548D2372J4329j8238j0269o851K148k2926K9176l2117m1529l9596o5149l7838
$$ 42372 56701 38463 28194 21343 23491 565 29741 -2376 -43905 -83501 -148650 -186488
15536a86488N5216m1370N505N3959L5708m1220m8777R9754K6610l054M9934j5079
$$ -186488 -131272 -172642 -167137 -113178 -77470 -118690 -167467 -67713 -41103 -44157 5777 -9302
15524i302K3482K8437n0306j7043K2508Q738m9387M403J5693K7675K9259M6639
$$ -9302 14180 42617 -7689 -24732 -2224 6514 -42873 -38470 -22777 4898 34157 80796
15512H0796L4414L0191k4785j18286q2345l0793N0560L4587L0228J3409J6975
$$ 80796 115210 145401 120616 2330 -80015 -110808 -60248 -25661 4567 17976 34951
15501C4951J0310J3019m9182l4979J06683n0406r2629K378R4226K5915l8926j0264
$$ 34951 45261 58280 9098 -25881 80802 30396 -62233 -59855 34371 60286 21360 11096
15489A1096m0403O3153l155l6348J8244Q621m509o704N61L4514j5340J10702L5169
$$ 11096 -29307 33846 30691 -5657 12587 21208 16699 9995 10556 45070 29730 140432 175601
15476A75601n11L8457m4222j53827N11O4844k6130k412q4602K6206L3133Q391
$$ 175601 175090 213547 169325 15498 16009 80853 54723 52311 -32291 -6085 27048 35439
15464C5439K2619l6319M5449q606j2741P1499J1947l265K4288n9120l5189L3943
$$ 35439 58058 21739 67188 58582 45841 117340 129287 126022 150310 91190 56001 89944
15452H9944L8462j19531J623N1366l437O159o8839o7082Q520J01613O1345K4578
$$ 89944 128406 8875 10498 61864 58427 64586 -4253 -71335 -62815 38798 100143 124721
15440A24721K3238l0033k3852o6107p6696m1279P034M5437N9931O3519l2606m7879
$$ 124721 147959 117926 94074 27967 -48729 -90008 -82974 -37537 22394 85913 53307 5428
15428E428j5461k2926p373M1299r680K3754N8116O6496N4518M789j22097o7105
$$ 5428 -10033 -32959 -40332 967 -8713 15041 73157 139653 194171 198960 76863 9758
15416I758L9672N0047n4186j05351l6838Q5705M5391J19436N4875o1487n5194
$$ 9758 49430 99477 45291 -60060 -96898 -11193 34198 153634 208509 147022 91828
15405I1828Q0094j1782m2145j0933M284J7354J7148n0808m7579j5404Q325K0477
$$ 91828 171922 160140 117995 107062 111346 128700 145848 95040 47461 32057 40382 60859
15393F0859k9036j2154Q4180q397m7082j1097J6815J8479q3839q8163L5344J1238
$$ 60859 31823 19669 103849 95452 48370 37273 54088 72567 -11272 -99435 -64091 -52853
15381e2853P1360P3764L5949o6359J0080j8961J5561K33K3924O5075M3550m5726
$$ -52853 18507 92271 128220 61861 71941 52980 68541 68774 92698 157773 201323 155597
15369A55597j23410l1409O899J4270J4858J1026l4745O2946o122j02331K0913
$$ 155597 32187 778 7677 21947 36805 47831 13086 76032 69910 -32421 -11508
15358a1508N2267r079M5721L2725n3505M1832J320l6299L0345j0419N9882k9208
$$ -11508 40759 31680 77401 110126 56621 98453 99773 63474 93819 83400 143282 114074
15346A14074n3750J6724M212m6882L420L0407j1733K2508K5074k4404j43759k6647
$$ 114074 60324 77048 81260 34378 37798 68205 56472 78980 104054 79650 -64109 -90756
15334i0756Q1576j6913K0396L5022K161j7056N7939J02172l1186j41955j30699
$$ -90756 -9180 -26093 -5697 29325 31486 14430 72369 174541 143355 1400 -129299
15323a29299P1188O1087q776l1183O0374O0874N2151m0281K1719p4824p7063o323
$$ -129299 -58111 2976 -5800 -36983 23391 84265 136416 96135 117854 43030 -34033 -40356
15311d0356K4715M5521k0425o3745J912K3657k9902P879M1888l548L0729P2806
$$ -40356 -15641 29880 9455 -54290 -52378 -28721 -58623 -50744 -8856 -12404 18325 91131
15299I1131L978p0524j6897R959j8893j8842l6138M6419J67303k1106n1822k7032
$$ 91131 95109 24585 7688 17647 -1246 -20088 -56226 -9807 157496 136390 84568 57536
15287E7536m4069r4527L4940M2541N9448R1373M1704K4041q4528o3398l0266p3613
$$ 57536 13467 -81060 -46120 -3579 55869 147242 188946 212987 128459 65061 34795 -38818
15275c8818k7954L3776r708M9544J3140Q2835p607j5282l7561r8433L8428P7292
$$ -38818 -66772 -32996 -42704 6840 19980 102815 95208 79926 42365 -56068 -17640 59652
15263E9652P2815R0889K3222J0954m7730j14012k8763J01958K5199l0553L0268
$$ 59652 132467 223356 246578 257532 209802 95790 67027 168985 194184 163631 193899
15252A93899L9628M5486J10354J15679K57598K38029L16208K04618J60061R6093
$$ 193899 233527 279013 389367 505046 762644 1000673 1316881 1521499 1681560 1777653
15242A777653R5649P9779M6921m5617j21411k20226k81924k20938k03746k29158
$$ 1777653 1873302 1953081 2000002 1954385 1832974 1612748 1330824 1109886 906140 676982
15232F76982j49519r6492k0070o3655K3831M7032m821n204l75j61832o6580l4584
$$ 676982 527463 430971 410901 347246 371077 418109 413288 408084 407709 245877 179297 144713
15220A44713o2525k8151R9947m3948m7858J088j3103j4931O521k2246R1776J30510
$$ 144713 82188 54037 153984 110036 62178 63266 50163 35232 41753 19507 111283 241793
15208B41793j3259o0480l4482l8354j1712K569J4802n2163L3577M2266j1172n3215
$$ 241793 228534 168054 133572 95218 83506 86075 100877 48714 82291 124557 113385 60170
15196F0170K3324M4240k8121n2056J8257p2308l7153k9124L3990K2587J2703M6108
$$ 60170 83494 127734 99613 47557 65814 -6494 -43647 -72771 -38781 -16194 -3491 42617
15184D2617O8724O4986l326P390k109r0343j13479j7235N5001P1448J9724R540
$$ 42617 111341 176327 173001 180391 178282 87939 -25540 -42775 12226 83674 103398 112938
15172A12938n9141O8973J02297M5420j16978P151l1176j6182M4868K8133n2844
$$ 112938 53797 122770 225067 270487 153509 160660 129484 113302 158170 186303 133459
15161A33459j58658o9999P1447J12830m6009m8650l2307j0115k7027O159Q431
$$ 133459 -25199 -95198 -23751 89079 43070 -5580 -37887 -48002 -75029 -68870 -60439
15150f0439j8322j2352L4563P8464Q8747k7681k5454j2384n1399j8672o7016O926
$$ -60439 -78761 -91113 -56550 21914 110661 82980 57526 45142 -6257 -24929 -91945 -85019
15138h5019j0945l409N3227o035R2509L1999r4693m4558R1850J06064n068K2179
$$ -85019 -95964 -99373 -46146 -52181 40328 72327 -22366 -66924 24926 130990 125922 148101
15126A48101j36077R127L4283O3980K6676q0248n8521N3767j4422m9953k3004
$$ 148101 12024 21151 55434 119414 146090 65842 7321 61088 46666 -3287 -26291
15115b6291K8657J35833P059R671j0865n2636j7448p7062p3392j2059O7720q3963
$$ -26291 2366 138199 145258 154929 144064 91428 73980 -3082 -76474 -88533 -20813 -104776
15103a04776n4190l1203P4648N4654L8259L1588k7526j6275m6053k1119Q0348
$$ -104776 -158966 -190169 -115521 -60867 -22608 8980 -18546 -34821 -80874 -101993 -21645
15092b1645M0122k966O5617J3692k4454k0064J6633l1437M578k2421k501l0521
$$ -21645 18477 15511 81128 94820 70366 50302 66935 35498 40076 17655 15154 -15367
15080a5367q229M4859L8412o0334L0515N8911k5635m7P5868l275j5440n8920k5006
$$ -15367 -23596 21263 59675 -659 29856 88767 63132 63085 138953 135678 120238 61318 36312
15067C6312M3652L5653p0220o4265r999M3856M5164P7100K7434l2666j7624P39
$$ 36312 79964 115617 45397 -18868 -28867 14989 60153 137253 164687 132021 114397 115136
15055A15136n9736j7769J18086L631l0793M0763n6510k1546J10006O7800j7902
$$ 115136 55400 37631 155717 159348 128555 169318 112808 91262 201268 269068 251166
15044B51166N9173l989N6617l0000K6822J9182r276n5474l9438L7194j07497k5353
$$ 251166 310339 306350 362967 332967 359789 378971 369695 314221 274783 311977 204480 179127
15032A79127M7081p0025l1743o7072K2172L9806j2031j0623N520N6727N0161l5809
$$ 179127 226208 156183 124440 57368 79540 119346 107315 96692 102212 158939 209100 173291
15020A73291q9167M3436Q1029p6687r5812k7078m1392o4848K9548N2397K8127
$$ 173291 84124 127560 208589 131902 36090 9012 -32380 -97228 -67680 -15283 12844
15009A2844O0068P2165J4887l9292m8739j4511j9536Q825k9020M7921Q0619j2035
$$ 12844 72912 145077 159964 120672 71933 57422 37886 46711 17691 65612 146231 134196
14997A34196j01951J02851K5335l61r841K1450m9111m9363O5501m2856j14272
$$ 134196 32245 135096 160431 160070 150229 171679 122568 73205 138706 95850 -18422
14986a8422K5479O0244M9046O0801N4089m3945r8964k7990l5816j8381M5133j9445
$$ -18422 7057 67301 116347 177148 231237 187292 88328 60338 24522 6141 51274 31829
14974C1829l5457p3330K3676L4038M1896L6406k280n2665K1514j8306j11980L1909
$$ 31829 -3628 -76958 -53282 -19244 22652 59058 56778 4113 25627 7321 -104659 -72750
14962g2750O8876K9566N3576K2571o778L7241Q7419L1344o4864o7015M591J7843
$$ -72750 -3874 25692 79268 101839 95061 132302 219721 251065 186201 119186 123777 141620
14950A41620o6015k1353K4787m1622p935k6539O2860R211n8544o3005K0354J8981
$$ 141620 75605 54252 79039 37417 29482 2943 65803 75014 16470 -46535 -26181 -7200
14938g200O1634J15132L3990M5594P3154J2241r000M4878j7315q7408m1999m5972
$$ -7200 54434 169566 203556 249150 322304 334545 325545 370423 353108 265700 223701 177729
14926A77729m0510k0541K0163L3335N0987K3010r608J9855L4734J4769m249n8351
$$ 177729 137219 116678 136841 170176 221163 244173 234565 254420 289154 303923 299674 241323
14914B41323j37347j35523n7101J5942L1372M3271j6512n4917N8059m3480m6933
$$ 241323 103976 -31547 -88648 -72706 -41334 1937 -14575 -69492 -11433 -54913 -101846
14903a01846N7060J8041Q3018N2899O5965l8726N6364J847R2387J02873M6087
$$ -101846 -44786 -26745 56273 109172 175137 136411 192775 194622 287009 389882 435969
14892D35969j18447p2698L1053Q9446q380j4044K4589k0711k3126N6711n475k3512
$$ 435969 317522 244824 275877 365323 356943 342899 367488 346777 323651 380362 374887 351375
14880C51375j22559n086M0509K9551N7697O9358p8114L1332K9192K4883r7054
$$ 351375 228816 223730 264239 293790 351487 420845 342731 374063 403255 428138 331084
14869C31084p5747Q4543L6688j7986M9536p612J6988P5729Q1986N1361p4154M026
$$ 331084 255337 339880 376568 358582 408118 400506 417494 493223 575209 626570 552416 556442
14857E56442k523Q7754O4551j2614M6606K3807k0283k0855R575L353K6738l5179
$$ 556442 553919 641673 706224 693610 740216 764023 743740 722885 732460 735813 762551 727372
14845G27372N6198Q7120N8375J7428L6036k1016N1328p051M9782J6345K6515O4739
$$ 727372 783570 870690 929065 946493 982529 961513 1012841 1005790 1055572 1071917 1098432 1163171
14833A163171P2226O2752q183L3063J31966J87561J84909J15863J30309P6378
$$ 1163171 1235397 1298149 1289966 1323029 1454995 1642556 1827465 1943328 2073637 2150015
14823B150015P3689K39402K27370J80880J49464K06804L53444K64863L13838M06256
$$ 2150015 2223704 2463106 2690476 2871356 3020820 3227624 3581068 3845931 4159769 4566025
14813D566025N20253N49048P57766R26676J033431J354723J801300K303555K732129
$$ 4566025 5086278 5635326 6393092 7319768 8353199 9707922 11509222 13812777 16544906
14804A6544906L299634L913377M585206N753525P670721J0676546J5639742K3056677
$$ 16544906 19844540 23757917 28343123 34096648 41767369 52443915 68083657 91140334
14796I1140334L1600405L8811620M3060756M3879290M2679381M0349934L5467964
$$ 91140334 122740739 161552359 204613115 248492405 291171786 331521720 366989684
14789C66989684K6263797J1037859o434510k1921466l2679898l8064745m1029985
$$ 366989684 393253481 404291340 397856830 375935364 343255466 305190721 264160736
14782B64160736m2512028m2398253l9163630l2630560k4640071j7339530j1929628
$$ 264160736 221648708 179250455 140086825 107456265 82816194 65476664 53547036
14775E3547036q493071o498069n279033m479509l924128l386911k799711k492031
$$ 53547036 45053965 38555896 33276863 28797354 24873226 21486315 18686604 16194573
14767A6194573k134289j754446j370280j237952j006590p44451p15956o94724
$$ 16194573 14060284 12305838 10935558 9697606 8691016 7946565 7230609 6535885
14759F535885n58315m51772m62438m10417l83143k45094k22015k64345l31831
$$ 6535885 5977570 5525798 5063360 4652943 4269800 4024706 3802691 3538346 3206515
14750C206515k57546j51396n2939r6731j82501j25271l3115K3887j18951p6462
$$ 3206515 2948969 2797573 2744634 2647903 2465402 2340131 2307016 2330903 2211952 2135490
14740B135490k5331n4367j26230r1471q5551o9290o1219q8895j85475p5474m8767
$$ 2135490 2110159 2055792 1929562 1838091 1752540 1683250 1622031 1533136 1347661 1272187 1223420
14729A223420k5046M4086r9438r5738m1713K3541m785J731P6627J1560J14902
$$ 1223420 1198374 1242460 1143022 1047284 1005571 1029112 1024327 1026058 1102685 1114245 1229147
14718A229147K8396k5673p3696q0272j3842p7163m6200k1406n0244q2303K7262
$$ 1229147 1257543 1231870 1158174 1077902 1064060 986897 940697 919291 869047 786744 814006
14707H14006K333o8490j22459n0339J3180l153k2769Q11M4752j4152m2518J3366
$$ 814006 816339 747849 625390 575051 588231 585078 562309 563120 607872 593720 551202 564568
14695E64568K177o5715k6379J598p132L4702L7118o1449p5782N951J7544K5388
$$ 564568 566745 501030 474651 476249 469117 503819 540937 479488 403706 409657 427201 452589
14683D52589L5463K5951L6280r7547o458m2631M6206P7099M5659M4050k3483K0528
$$ 452589 488052 514003 550283 452736 446278 403647 449853 526952 572611 616661 593178 613706
14671F13706M3067j18313N2112J45580J1101K3712M6489m9265J1479l1757K1077
$$ 613706 656773 538460 590572 736152 747253 770965 817454 768189 779668 747911 768988
14660G68988n6998N1419O1125J20576M6248l1296N3651J14744K41316K65473L52832
$$ 768988 711990 763409 824534 945110 991358 960062 1013713 1128457 1369773 1635246 1988078
14649A988078N68543Q30755R58696J066550J062765R46671O88338M40331R8889
$$ 1988078 2556621 3387376 4346072 5412622 6475387 7422058 8110396 8550727 8649616
14640H649616l00018o58083r15720j017160j095923j053137q21994n45144m68408
$$ 8649616 8349598 7691515 6775795 5758635 4662712 3609575 2787581 2242437 1774029
14631A774029k92334j29525j72725j43251j14562o1158j9386m0105j8423p8675
$$ 1774029 1481695 1352170 1179445 1036194 921632 860474 841088 800983 782560 703885
14621G03885j31571j07879j3739K238L2264m4130r1147j30j18933o3237L9510
$$ 703885 572314 464435 450696 452934 485198 441068 349921 349791 230858 167621 207131
14610B07131Q271L4197J7304R3488p600r7971r106L0368J7439m5019k489l9482
$$ 207131 215402 249599 266903 360391 352791 254820 245714 276082 293521 248502 246013 206531
14598B06531L3417o1214J1102P8733J1759L6514m1999o9377o9296P9896M5853
$$ 206531 239948 178734 189836 268569 280328 316842 274843 205466 136170 216066 261919
14587B61919l3425k5146J9331K669l4001j8752O00j05431j3358M9846O4337k6079
$$ 261919 228494 203348 222679 225348 191347 172595 173195 67764 54406 104252 168589 142510
14575A42510N5948j8321j7261k0581O6757m591N9578Q275j7992j3552j7296n7286
$$ 142510 198458 180137 162876 142295 209052 204461 264039 272314 254322 240770 223474 166188
14563A66188m5643o1845M7448j2380p0287n9586m981K493m4322P1892P6494q087
$$ 166188 120545 58700 106148 93768 23481 -36105 -41086 -38593 -82915 -11023 65471 57384
14551E7384K0374K3215k739l2502M3061P9206k369l9020J2283K7419O6489l0827
$$ 57384 77758 100973 98234 65732 108793 187999 185630 146610 158893 186312 252801 221974
14539B21974j05492m2010Q1555K9019r5959j02610J1573M1523L0747n71k9062
$$ 221974 116482 74472 156027 185046 89087 -13523 -1950 39573 70320 69749 40687
14528D0687M1399l0274J804N6989n2298p6978P6307P0902N7066m0395m7804L7404
$$ 40687 82086 51812 53616 110605 58307 -18671 57636 128538 185604 145209 97405 134809
14516A34809j1188m0710j56938M3472N5083M0804N848N0777j06219m4307L0665
$$ 134809 123621 82911 -74027 -30555 24528 65332 71180 121957 15738 -28569 2096
14505B096m9545M4718P6047N2408l1818k4312m1712j6671R653J02461O2466q9942
$$ 2096 -47449 -2731 73316 125724 93906 69594 27882 11211 20864 123325 185791 95849
14493I5849k1460J4735n9832L4313M3710K0449k8102N0072J7400L402j8696M7887
$$ 95849 74389 89124 29292 63605 107315 127764 99662 149734 167134 170536 151840 199727
14481A99727L7224l0123j4105n6626m9290j08223J6003K6065J5400L6547k6891
$$ 199727 236951 206828 192723 136097 86807 -21416 -5413 20652 36052 72599 45708
14470D5708l1444K8065L412r650L1281K8520k8332o960n789r5692n0705K5250
$$ 45708 14264 42329 45741 36091 67372 95892 67560 60600 54811 -40881 -91586 -66336
14458f6336k3098N8852O8823j2707M7803j7280n0247m2402m5918J6244K6329O9768
$$ -66336 -89434 -30582 38241 25534 73337 56057 5810 -36592 -82510 -66266 -39937 29831
14446B9831j4004P791L8237m7671l213j6458n7483K6241N3612K8858k2465J5848
$$ 29831 15827 23618 61855 14184 10971 -5487 -62970 -36729 16883 45741 23276 39124
14434C9124O8609R8796J128l2554n4512r8918l9530K0414J1095l1343j7703M9968
$$ 39124 107733 206529 207657 175103 120591 21673 -17857 2557 13652 -17691 -35394 14574
14422A4574K6751r276n6710k698N1014N0445j33323j3299K5494O3273k9021j0871
$$ 14574 41325 32049 -24661 -27359 23655 74100 -59223 -72522 -47028 16245 -12776 -23647
14410b3647N6917J4401K4757Q7637N7107M798m6247o1094r8195l627K3574J2209
$$ -23647 33270 47671 72428 160065 217172 221970 175723 114629 16434 12807 36381 48590
14398D8590k8338N7900L2611l4529j29286j1793j2780n7328l1807j4682L4149
$$ 48590 20252 78152 110763 76234 -53052 -64845 -77625 -134953 -166760 -181442 -147293
14387a47293O6166N9704K8159N030o361J7830k517M594N2893p8339j0134k2746
$$ -147293 -81127 -21423 6736 11766 5405 23235 20718 25312 78205 -134 -10268 -33014
14375c3014l4215o0000L4598Q3697N258M9392j0976j0126N7009K0049Q1948O9084
$$ -33014 -67229 -127229 -92631 -8934 -3676 45716 34740 24614 81623 101672 183620 252704
14363B52704o1322j9392o7274j09280m2759p000K0486P3473M7592j42027l8255
$$ 252704 191382 171990 104716 -4564 -47323 -54323 -33837 39636 87228 -54799 -93054
14352i3054P0428Q1867j4978r6261n4528j088J19409J26325J18523K0642J1281
$$ -93054 -22626 59241 44263 -51998 -106526 -107614 11795 138120 256643 277285 288566
14341B88566O1045Q3819N943L6420J10057J10174J20772K72119L49397K71264
$$ 288566 349611 433430 439373 475793 585850 696024 816796 1088915 1438312 1709576
14331A709576J16533J99476Q7437O2478J9708j39448j90029k31767k16192l14650
$$ 1709576 1826109 2025585 2113022 2175500 2195208 2055760 1865731 1633964 1417772 1103122
14321A103122k87575j87720j63272j44768p5760r7R845n7145r9063q3365o8234
$$ 1103122 815547 627827 464555 319787 244027 243930 253775 196630 97567 14202 -54032
14310e4032Q8884P3707M6297L3856q160l7640j00506o8813j0891r1349J299L7346
$$ -54032 34852 108559 154856 188712 180552 142912 42406 -26407 -37298 -128647 -127348 -90002
14298i0002l2763O8904J1751m1686R244j11288l877N0427N3412O7072J01319L0656
$$ -90002 -122765 -53861 -42110 -83796 -74552 -185840 -189717 -139290 -85878 -18806 82513 113169
14286A13169p3734o8561O1923O604p2572Q2072N025n45J1945n2649r3549J0750
$$ 113169 39435 -29126 32797 39401 -33171 48901 53926 53381 65326 12677 -80872 -70122
14274g0122K2238J2020J12681O0229m6494o3588p1413j8461l883J6552k2084j7359
$$ -70122 -47884 -35864 76817 137046 90552 26964 -44449 -62910 -66793 -50241 -72325 -89684
14262h9684J3915k5007J4121M7694o1616j8070m426k911N0792O7215K0237p7883
$$ -89684 -75769 -100776 -86655 -38961 -100577 -118647 -123073 -125984 -75192 -7977 12260 -65623
14250f5623K4955Q1609q830k9625K13N9855P5820K6265R674p3047n1577m9956
$$ -65623 -40668 40941 32111 2486 2699 62554 138374 164639 174313 101266 49689 -267
14238b67M707j2963l123L4847K8319n7240j10783K9797J70865Q780j09126m4615
$$ -267 4440 -8523 -11646 23201 51520 -5720 -116503 -86706 84159 92939 -16187 -60802
14226f0802k4349N9108P6934p043j6874n4272P453O3212q7860j125J1103m6766
$$ -60802 -85151 -26043 50891 43848 26974 -27298 -19845 43367 -44493 -45618 -34515 -81281
14214h1281P4551K4144l5340p484M6333Q0698q5944m2532K9539N0630L764l4923
$$ -81281 -6730 17414 -17926 -25410 20923 101621 15677 -26855 2684 53314 57078 22155
14202B2155m04j693J9270p683M1991l4574p9177l6861L0180r977J212k9557p646
$$ 22155 21751 20058 39328 31645 73636 39062 -40115 -76976 -46796 -56773 -55561 -85118 -92764
14189i2764O2022J7407J10971p855R854q812l2798j8629j4193k3220m6936O148
$$ -92764 -30742 -13335 97636 89781 99635 90823 58025 39396 25203 1983 -44953 -38805
14177c8805O7303j14461K5868J29452J7917n6054k2088M7319L0533j1956J3239
$$ -38805 28498 -85963 -60095 69357 87274 31220 9132 56451 86984 75028 88267
14166H8267k0425n4552L2376J4350l4023p0397j9278K5791P0341l8348m0770J8816
$$ 88267 67842 13290 45666 60016 25993 -44404 -63682 -37891 32450 -5898 -46668 -27852
14154b7852l1749K718l8386k278K4436N9835J19631K3415o9933q8882l867O1569
$$ -27852 -59601 -56883 -95269 -97547 -73111 -13276 106355 129770 59837 -29045 -32912 28657
14142B8657Q5833p2024N9645J4981o6809l5154M346o4337P5564P8987n683p3473
$$ 28657 114490 42466 102111 117092 50283 15129 19475 -44862 30702 109689 104006 30533
14130C0533r1871N5371P0999L0965m2405r627O0474P1307m6982p1986O3176L0287
$$ 30533 -61338 -5967 65032 95997 53592 43965 104439 175746 128764 56778 119954 150241
14118A50241o8960l6035R7108m203K9213Q4615Q0152J6973n4875J4353N4425J04591
$$ 150241 81281 45246 142354 138151 167364 251979 332131 349104 294229 308582 363007 467598
14106D67598J43220K77846K99965L82632M57366N32478N90044M47608L55938K11247
$$ 467598 610818 888664 1188629 1571261 2028627 2561105 3151149 3598757 3954695 4165942
14096D165942P3364j79276m08876n71178o04121m97791m69356k92495k60789j52304
$$ 4165942 4239306 4060030 3651154 3079976 2475855 1978064 1508708 1216213 955424 803120
14086H03120j16175j41088j43535l3942o8290j10415J2479n8382j7335M7168M3917
$$ 803120 686945 545857 402322 368380 300090 189675 202154 143772 126437 173605 217522
14075B17522R9408N3950L0504L2359L3107j6461Q1016J14345K57925L33820L69933
$$ 217522 316930 370880 401384 433743 466850 450389 531405 645750 903675 1237495 1607428
14064A607428N21802O00642N53030N59027L04546K04661n2294k41736m42151m51070
$$ 1607428 2129230 2729872 3282902 3841929 4146475 4351136 4298842 4057106 3614955 3163885
14054C163885o09891o56083m74125k64316k56019j97700j78023j21847l7035m1599
$$ 3163885 2553994 1897911 1423786 1159470 903451 705751 527728 405881 368846 327247
14044C27247l4697m1474k1385n9082N452K5363r8578j02668K8584j5868m7387
$$ 327247 292550 251076 229691 170609 176061 201424 102846 178 28762 12894 -34493
14033c4493J26737R0736K6037J9554j3423k2222m8649J843J763p039j11529r6262
$$ -34493 92244 182980 209017 228571 215148 192926 144277 146120 147883 140844 29315 -66947
14021f6947J05285J1248j796R071l9741K5113L551J02303M2636k838q3572n8321
$$ -66947 38338 49586 47790 56861 17120 42233 45784 148087 190723 187885 104313 45992
14009D5992Q327R294k905l0905n2358Q8567L3703m5083q9581k8234O7981Q6158
$$ 45992 54319 63613 60708 29803 -22555 66012 99715 54632 -34949 -63183 4798 90956
13997I0956J0417k9113o9004J3492Q7147J7665j6992L34L8180m3292l4435m6021
$$ 90956 101373 72260 3256 16748 103895 121560 104568 104902 143082 99790 65355 19334
13985A9334J9270j6590r5277J01756R4061M30n1829l1026l5971k100n695p0866
$$ 19334 38604 22014 -73263 28493 122554 122984 71155 40129 4158 2058 -3637 -74503
13973g4503J9597K4748j2023j1894q980M810M833K1099J6654M7340q107m9171
$$ -74503 -54906 -30158 -42181 -54075 -63055 -58245 -53412 -32313 -15659 31681 23574 -25597
13961b5597Q154J0814k9983K6113J2240K3093M6188j9070m4016q6117r370K9021
$$ -25597 -17443 -6629 -36612 -10499 1741 24834 71022 51952 7936 -78181 -87551 -58530
13949e8530O5798K1202l4598l9686j03216J9513J60617J14822q3063K5101l062
$$ -58530 7268 28470 -6128 -45814 -149030 -129517 31100 145922 62859 87960 84898
13938H4898Q765k2929k3165n375M7533k3147K1971K177r0557J528j2377M5701
$$ 84898 93663 70734 47569 42194 89727 66580 88551 90728 171 1699 -10678 35023
13926C5023M4155L4653n6876K1536m5858K3562L156o8092m8993m8145P067L4021
$$ 35023 79178 113831 56955 78491 32633 56195 59351 -8741 -57734 -105879 -98812 -64791
13914f4791J02945J24703k3740j48616j8103M1435l426N2487N5738p3076j20040
$$ -64791 38154 162857 139117 -9499 -27602 13833 10407 62894 118632 45556 -74484
13903g4484O169N0680O0131K768n3633K9259m4507r5834o8768J05241J47345k2861
$$ -74484 -68315 -17635 42496 45264 -8369 20890 -23617 -119451 -188219 -82978 64367 41506
13891D1506o537P363q4962k7324k0945m4112N1309O0834P0372J6788M297L3424
$$ 41506 34969 42332 -42630 -69954 -90899 -135011 -83702 -22868 47504 64292 68589 102013
13879A02013O3021m7025l3624K1885r7773j08927p3445O6041Q7469Q627K4491
$$ 102013 165034 118009 84385 106270 8497 -100430 -173875 -107834 -20365 -11738 12753
13868A2753R2022O521j173L6348O5708K2545j34570j73550p4419N8481O6768R1012
$$ 12753 104775 111296 110123 146471 212179 234724 100154 -73396 -147815 -89334 -22566 68446
13856F8446k0151m5460J4499j9258K1486j1240m2501j7274J3480J25916J07394
$$ 68446 48295 2835 17334 -1924 19562 8322 -34179 -51453 -37973 87943 195337
13845A95337o0874r3836l5265m33k4626J8228k2165N8366j8767j5366m7212J1028
$$ 195337 134463 40627 5362 4929 -19697 -1469 -23634 34732 15965 599 -46613 -35585
13833c5585M2662K2611l0381j4025m3869O1337M811M370M7924k6606k6057o4873
$$ -35585 7077 29688 -693 -14718 -58587 2750 7561 11931 59855 33249 7192 -57681
13821e7681j8428R9648K3436l3447l5088l4167m5638M0266J682O0659n043o7663
$$ -57681 -76109 23539 46975 13528 -21560 -55727 -101365 -61099 -59417 1242 -3801 -71464
13809g1464l2861K5928k5025L7492J7211n0363l7519J6256O6432M466K8146Q9611
$$ -71464 -104325 -78397 -103422 -65930 -48719 -99082 -136601 -120345 -53913 -49447 -21301 68310
13797F8310N901N903q0859q6750K362K4450J17465K7055k9962o578P201l8101
$$ 68310 74211 80114 -745 -87495 -85133 -60683 56782 83837 53875 47297 54498 16397
13785A6397m4932l8130J16328m6017n7869M1418m5873l6886k5876k7173K9971
$$ 16397 -28535 -66665 49663 3646 -54223 -12805 -58678 -95564 -121440 -148613 -118642
13774a18642O0915N0330j6273j4481l2215K4434N5394J1061j30305m2279J48379
$$ -118642 -57727 -7397 -23670 -38151 -70366 -45932 9462 20523 -109782 -152061 -3682
13763c682J49705o687j02721j7856k9350o4590k1089m0076O2359J1094n109M3040
$$ -3682 146023 139336 36615 18759 -10591 -75181 -96270 -136346 -73987 -62893 -68002 -24962
13751b4962K1591O1773K0735l2238K1837k1808o0504M5315L3304K2195j773l7862
$$ -24962 -3371 58402 79137 46899 68736 46928 -13576 31739 65043 87238 85465 47603
13739D7603J5729n4027r046O4228L8953p3331K977j3401n8202k3243J6991k6825
$$ 47603 63332 9305 259 64487 103440 30109 33086 19685 -38517 -61760 -44769 -71594
13727g1594j044Q322N2164L1340K0842J4119O8378J2664l0871j8839k8860k1518
$$ -71594 -72638 -64316 -12152 19188 40030 54149 122527 135191 104320 85481 56621 35103
13715C5103J5382j3694j6790j18761j0707J3777M7478O4094R931O084l0781l2368
$$ 35103 50485 36791 20001 -98760 -109467 -95690 -48212 15882 25813 31897 1116 -31252
13703c1252l8911J07951M2107m1580j5038q2139j446J6249J06892M6977J2925
$$ -31252 -70163 37788 79895 38315 23277 -58862 -60308 -44059 62833 109810 122735
13692A22735K4786k0382q9129j29975N1016O5907l7448m9209O763o2660j6311
$$ 122735 147521 127139 38010 -91965 -40949 24958 -12490 -61699 -54936 -117596 -133907
13681a33907J23640P1665M0269l4684j4495O937j8343k1211n1561j1292j3948
$$ -133907 -10267 61398 101667 66983 52488 59425 41082 19871 -31690 -42982 -56930
13670e6930n5702o1686Q5162L0308Q8416J423j00088n7804L5362L2697L0234M2545
$$ -56930 -112632 -174318 -89156 -58848 29568 30991 -69097 -126901 -91539 -58842 -28608 13937
13658A3937m2524j0430L4396J09322k8849o7026Q929L9201L5144k8615q1404J3093
$$ 13937 -28587 -39017 -4621 104701 75852 8826 17755 56956 92100 63485 -17919 -4826
13646d826N1624K5827j1303J256O1702n6742j4294L180p0218o3535N9557O4380
$$ -4826 46798 72625 61322 62578 124280 67538 53244 56424 -13794 -77329 -17772 46608
13634D6608J0683L8464P3274K1275p4946j11585n4865n8612J4994J64748O0245
$$ 46608 57291 95755 169029 190304 115358 3773 -51092 -109704 -94710 70038 130283
13623A30283o3930n6582K0947p354r9710J30672L6874m0812J403l3002n34O9006
$$ 130283 66353 9771 30718 23364 -76346 54326 91200 50388 51791 18789 18255 87261
13611H7261M9590O8839K0051k4834r8456o9017M3050R9126K4078j38796n6877
$$ 87261 136851 205690 225741 200907 102451 33434 76484 175610 199688 60892 4015
13600D015J79q9786j0907k7438J6899Q769J4011K9282m600K0053k4069j6581k9927
$$ 4015 4194 -85592 -96499 -123937 -107038 -98269 -84258 -54976 -59576 -39523 -63592 -80173 -110100
13587a10100l8906L7365P9167K5092m2705R686L8453J0684M6073L1799m048l2815
$$ -110100 -149006 -111641 -32474 -7382 -50087 -40401 -1948 8736 54809 86608 82560 49745
13575D9745o0379k4311m130K5704N9637m4501K2043m606k8881p2240k2064M4690
$$ 49745 -10634 -34945 -39075 -13371 46266 1765 23808 19202 -9679 -81919 -103983 -59293
13563e9293j0996M3846k685J6099p1257m1588N2850M5934M2943L645O384K2463
$$ -59293 -70289 -26443 -29128 -13029 -84286 -125874 -73024 -27090 15853 19498 25882 48345
13551D8345l4376m9674J5703K6060m20k8366o866m7836j3516j643k0650k1973
$$ 48345 13969 -35705 -20002 6058 5638 -22728 -29594 -77430 -90946 -92589 -113239 -135212
13539a35212P9613J3751K6491n8680m5977l7415j4268L161N718N7087J40104M4273
$$ -135212 -55599 -41848 -15357 -74037 -120014 -157429 -171697 -168536 -162818 -105731 34373 78646
13527G8646j4101K9447J4584m3809N141k6822q2442J1165K0211O2511M1684j1367
$$ 78646 64545 93992 108576 64767 69908 43086 -39356 -28191 -7980 54531 96215 84848
13515H4848k9205p6606n6091L066O3749P2175k5479o2164J6227m9651N1040O8624
$$ 84848 55643 -20963 -77054 -73988 -10239 61936 36457 -25707 -9480 -59131 -8091 60533
13503F0533J2413m988L7758m567K378j08435q2987K9748K1550M0362k3392O35
$$ 60533 72946 67958 105716 101149 103527 -4908 -87895 -58147 -36597 3765 -19627 -18992
13491a8992j6216o1722n0172N575R9537J21966K7648p3134r0104K6089N5222L7524
$$ -18992 -35208 -96930 -147102 -141527 -41990 79976 107624 34490 -55614 -29525 25697 63221
13479F3221l5500k8494R953M3178j9756k0528l9595J0401Q8584O0298q8873o272
$$ 63221 27721 -773 9180 52358 32602 12074 -27521 -17120 71464 131762 42889 36617
13467C6617N8489L4872n9336j03970j4832m8193P443k1316j4652O173P3425K6001
$$ 36617 95106 129978 70642 -33328 -48160 -96353 -88910 -110226 -124878 -118705 -45280 -19279
13455a9279O0496M046p2678n0716Q4161N0348L8446M4917q6288r9978M4776p3429
$$ -19279 41217 45263 -27415 -78131 6030 56378 94824 139741 53453 -46525 -1749 -75178
13443g5178K3997k7644o7401N5458K8312Q0623O1351p6060o1111O0971M300P319
$$ -75178 -51181 -78825 -146226 -90768 -62456 18167 79518 3458 -57653 3318 7618 14937
13431A4937j9220M4318m850O1014k9368k1485L3412j5068j34215l9046K5784J2703
$$ 14937 -4283 40035 35185 96199 66831 45346 78758 63690 -70525 -109571 -83787 -71084
13419g1084Q820l2988n1094n5169K5097J25753L8998k9732J4594L6623j7013o8303
$$ -71084 -62264 -95252 -146346 -201515 -176418 -50665 -11667 -41399 -26805 9818 -7195 -75498
13407g5498K9213N2363j1871o3811R7721N0253J2808R7027n062j31336k7925J5748
$$ -75498 -46285 6078 -5793 -69604 28117 78370 91178 188205 183143 51807 23882 39630
13395C9630R0841N59k5707p5909l6438L7769M8085N253M303M9685K72r7424q820
$$ 39630 130471 131030 105323 29414 -7024 30745 78830 84083 88386 138071 138343 40919 32099
13382C2099Q831q098m4384m2155K6454k6102j01365L0916l5192Q233J43288J12795
$$ 32099 40930 32832 -11552 -53707 -27253 -53355 -154720 -123804 -158996 -150763 -7475 105320
13370A05320P1076O0559m0843m0065m7997j3982J5122R393Q2441j8740j70617
$$ 105320 176396 236955 196112 156047 108050 94068 109190 118583 201024 182284 11667
13359A1667j1069J06157J4272m9748j1670O1685M4648j2261L6403j6835j11348
$$ 11667 598 106755 121027 71279 59609 121294 165942 153681 190084 173249 61901
13348F1901o0858l7986N3379O2293q3072P145r3358l4132L6741O8546J5818L7758
$$ 61901 1043 -36943 16436 78729 -4343 2802 -90556 -124688 -87947 -19401 -3583 34175
13336C4175O8544M907m827j10945m5688Q408J627n3354M5715R4794O9000K1564
$$ 34175 102719 107626 102799 -8146 -53834 -45426 -43799 -97153 -51438 43356 112356 133920
13324A33920p4940q4622m2271o7039M5521M5851P4944N9280j5099J6036k629j4554
$$ 133920 58980 -25642 -67913 -134952 -89431 -43580 31364 90644 75545 91581 88952 74398
13312G4398Q224n3338N6708K7053k1292m5531k1889k7614k7908p434p969n09m261
$$ 74398 82622 29284 85992 113045 91753 46222 24333 -3281 -31189 -38623 -46592 -47101 -51362
13299e1362m3264P0095R2297o8745n0000l3243L4426K7964n9536M8023Q2097J3132
$$ -51362 -94626 -24531 67766 -979 -50979 -84222 -49796 -21832 -81368 -33345 48752 61884
13287F1884j03621J0881R2633L6510n7683k0855N6295P7066l4677k9572k7004
$$ 61884 -41737 -30856 61777 98287 40604 19749 76044 153110 118433 88861 61857
13276F1857p8790l8325M9374k2608k6501K5232K3275p008o3146M7219O2997N3093
$$ 61857 -16933 -55258 -5884 -28492 -54993 -29761 -6486 -13494 -76640 -29421 33576 86669
13264H6669P7964K1383m4761m6854q6334j39828o6122K5378J37392J7264j2529
$$ 86669 164633 186016 141255 94401 8067 -131761 -197883 -172505 -35113 -17849 -30378
13253c0378J4935p3421O4049O1171Q33l1971O5398M1946L3531M545R605r7581
$$ -30378 -15443 -88864 -24815 36356 37189 5218 70616 112562 146093 150638 160243 62662
13241F2662j01583M1608l6710j19227K3672K7684O3276j861m7706j7289K4874
$$ 62662 -38921 2687 -34023 -153250 -129578 -101894 -38618 -40479 -88185 -105474 -80600
13230h0600j7042M8572r419j761M4705J0770R270J47190N5015p1391q5778o8375
$$ -80600 -97642 -49070 -58489 -60250 -15545 -4775 4495 151685 206700 135309 49531 -18844
13218a8844m4400m8151o1675Q8726Q4391K9596l6741j0593J9782q1171L1033L5030
$$ -18844 -63244 -111395 -173070 -84344 47 29643 -7098 -17691 2091 -79080 -48047 -13017
13206a3017L2612L192M8015k4671m4508J6430L8954J6191j8987j0406n0888l0543
$$ -13017 19595 22787 70802 46131 1623 18053 57007 73198 54211 43805 -7083 -37626
13194c7626o7721n0004J1351M7289K9804M225l67Q5218o366o6167j3873N5417
$$ -37626 -105347 -155351 -144000 -96711 -66907 -62682 -63049 22169 15803 -50364 -64237 -8820
13182h820k2911o1376m0224J03029L3526q8540k8708K0323q600j15975K304L7179
$$ -8820 -31731 -93107 -133331 -30302 3224 -85316 -114024 -93701 -102301 -218276 -215972 -178793
13170a78793q1249N3286M6129M4800J38821N6993o1467n1342P381l002K4369J4761
$$ -178793 -260042 -206756 -160627 -115827 22994 79987 18520 -32822 -25441 -28443 -4074 10687
13158A0687O2326l3781o0924L2611K8352r304k5658j7956j006M7482Q67m43n0464
$$ 10687 73013 39232 -21692 10919 39271 29967 4309 -13647 -14653 32829 33696 33253 -17211
13145a7211j1085J0706l2484L1536K2678M6628P786J1707l1013r4634n8455j177
$$ -17211 -28296 -17590 -50074 -18538 4140 50768 58554 70261 39248 -55386 -113841 -115018
13133a15018O1755J8766L951j7281L40J3737L3929j9579m712p0969l7186O7203
$$ -115018 -53263 -34497 -30546 -47827 -47487 -33750 179 -19400 -24112 -95081 -132267 -65064
13121f5064K9909K7664O9321Q235k6503M1706o3059J5989k6452K9565J02928O76
$$ -65064 -35155 -7491 61830 70065 43562 85268 22209 38198 11746 41311 144239 144915
13109A44915r4853r0820K5531N8867m6306r3114K8657q1640o2094L9207N7518
$$ 144915 50062 -40758 -15227 43640 -2666 -95780 -67123 -148763 -210857 -171650 -114132
13098a14132J8666M2841P977N989k7392P2351j9142q7707l154P0916O6049K1140
$$ -114132 -95466 -52625 -44648 -38659 -66051 6300 -12842 -100549 -103703 -32787 33262 54402
13086E4402M12j05008m7892R0400l339l4572M6416O8366n9016k334R3105P6453
$$ 54402 54814 -50194 -98086 -7686 -11025 -45597 819 69185 10169 7835 100940 177393
13074A77393p2570K6501n6896j04808l2785l1913N030P5462P5492m7525R5609
$$ 177393 104823 131324 74428 -30380 -63165 -95078 -90048 -14586 60906 13381 108990
13063A08990r314j08395k3237N8210J0939m5553K0918M923o6187N782p2353n5576
$$ 108990 99676 -8719 -31956 26254 37193 -8360 12558 17481 -48706 -42924 -115277 -170853
13051a70853J8687M3636p900N4089J00849Q1721R923m8609o0935l5857O0298O6546
$$ -170853 -152166 -108530 -116430 -62341 38508 120229 130152 81543 20608 -15249 45049 111595
13039A11595j5880p1783n7424j8677p768Q604Q3206J03211o3391r4442L2200p488
$$ 111595 95715 23932 -33492 -52169 -59937 -51333 31873 135084 71693 -22749 9451 1963
13027A963L7751L1877o0240N06K1281q6479l6504N6947K5742J8378J5293r522
$$ 1963 39714 71591 11351 11857 33138 -53341 -89845 -32898 -7156 11222 26515 16993
13015A6993K4740j4239k9562m0976k3610N6911o5930l8461o039P7029R4282K5650
$$ 16993 41733 27494 -2068 -43044 -66654 -9743 -75673 -114134 -120173 -43144 51138 76788
13003G6788J05723J4901q5094L507k4437j43649l5283N1004K7910K6953m2400
$$ 76788 182511 197412 112318 115825 91388 -52261 -87544 -36540 -8630 18323 -24077
12992b4077j1040P3264N1707M617j0188k467p0832J9983L0690m9954n1064P608
$$ -24077 -35117 38147 89854 94471 84283 81816 10984 30967 61657 11703 -39361 -31753
12980c1753J0173K8675L0509n8680l4852n6337n8753q097J33454Q1356o7773m0983
$$ -31753 -21580 7095 37604 -21076 -55928 -112265 -171018 -179115 -45661 35695 -32078 -73061
12968g3061M624P9673o924k039l326n247J0527l3318J5925L3852m8841j0414N0121
$$ -73061 -68437 11236 4312 2273 -1053 -6300 4227 -29091 -13166 20686 -28155 -38569 11552
12955A1552N4549J4725Q5590O1520o9608m2155R7201l8073r3363K0472Q398r5881
$$ 11552 66101 80826 166416 227936 158328 116173 213374 175301 81938 102410 110808 14927
12943A4927l8004P1150k4130j8790K871O2686j8268j5594j2290o4466q3041N033
$$ 14927 -23077 48073 23943 5153 8024 70710 52442 36848 24558 -39908 -122949 -117916
12931a17916L5323N0261j9327O1125m0648j8344N2645M2140k3939J0298k9575
$$ -117916 -82593 -32332 -51659 9466 -31182 -49526 3119 45259 21320 31618 2043
12920B043k8389L3140M985L9978m305m326N6327l2061n1312k9870n895j5094R628
$$ 2043 -26346 6794 11779 51757 47452 43126 99453 67392 16080 -13790 -19685 -34779 -25151
12907b5151M1516J3554k0932R438l3788j0626o9651k3247M8314O849M0988N7303
$$ -25151 16365 29919 8987 18425 -15363 -25989 -95640 -118887 -70573 -63724 -22736 34567
12895C4567n5714m8039O7101n5494m5254l7156j623J62587M8583k134q3075k3002
$$ 34567 -21147 -69186 -2085 -57579 -102833 -139989 -141612 20975 69558 67424 -15651 -38653
12883c8653l5441k0400K8263M1784j6277j2811M8526L5306o7335m7419J3418O2694
$$ -38653 -74094 -94494 -66231 -24447 -40724 -53535 -5009 30297 -37038 -84457 -71039 -8345
12871h345M7219j6113L502p0138r9615l3290L6963j1382N5910L2029N365L8061
$$ -8345 38874 22761 26263 -43875 -143490 -176780 -139817 -151199 -95289 -63260 -57895 -19834
12859a9834o44K202N6691p8896M1201K686j2240K6906J2447k4560K1610N1706
$$ -19834 -20478 -18276 38415 -40481 720 3406 -8834 18072 30519 5959 27569 79275
12847G9275q7121j02215N2359J06249O306j5791k003k5539P2714K7570l1291k8021
$$ 79275 -7846 -110061 -57702 48547 54853 39062 37059 11520 84234 111804 80513 52492
12835E2492l1844m0355r023K0815M3034O9960L1294m2848q0219m9598O7807K1772
$$ 52492 20648 -19707 -28730 -7915 35119 105079 136373 93525 13306 -36292 31515 53287
12823E3287k6015O7855R291m5448q5671l9637Q9606p593r7014n2104n9054J1632
$$ 53287 27272 95127 104418 58970 -26701 -66338 23268 15675 -81339 -133443 -192497 -180865
12811a80865M4270k8633K4028R37J1365Q0862l2781o0682j084Q129L8117N962
$$ -180865 -136595 -165228 -141200 -140263 -128898 -48036 -80817 -141499 -142583 -134454 -96337 -90375
12799i0375P7045P8035O238L101J7207j6768p5962p3272J17520K7191j07684n077
$$ -90375 -13330 64705 70943 74044 91251 74483 -1479 -74751 42769 69960 -37724 -42801
12787d2801L3395l3818K8001M9839O1841q1123q9168j1693M0714Q8405M6282J2047
$$ -42801 -9406 -43224 -15223 34616 96457 15334 -73834 -85527 -44813 43592 89874 101921
12775A01921l8503j41047n3524n181k6638K0857R0551J9068r8790n2549M5567
$$ 101921 63418 -77629 -131153 -136334 -162972 -142115 -51564 -32496 -131286 -183835 -138268
12764a38268P4074L8459O2745J4274M9939K365J2736k5445k9891j12789R852j1723
$$ -138268 -64194 -25735 37010 51284 101223 103588 116324 90879 60988 -51801 -41949 -53672
12752e3672R25M2971p9571K0891M7234M4279J8273n955p5904l1095m9571K2120
$$ -53672 -52747 -9776 -89347 -68456 -21222 23057 41330 35375 -40529 -71624 -121195 -99075
12740i9075M8985K6124j453L8467l5683K5762n3734P377k2063L6364J5261k8699
$$ -99075 -50090 -23966 -25419 13048 -22635 3127 -50607 -43230 -65293 -28929 -13668 -42367
12728d2367O6456o7218K306J19139O0039O96N330r736q848k9310n6041j1547M2728
$$ -42367 24089 -43129 -40823 78316 138355 139051 144381 134645 125797 96487 40446 28899 71627
12715G1627N5276K198p4253L4294O708m3175l4489n4755k6860R66m3099R6914
$$ 71627 126903 129101 54848 89142 95850 52675 18186 -36569 -63429 -62463 -105562 -8648
12703h648L3990n8632r349J6164J2091p9039j594l7067j8251P5946O9466N2434
$$ -8648 25342 -33290 -42639 -26475 -14384 -93423 -95017 -132084 -150335 -74389 -4923 47511
12691D7511l6671j0429o960k1253M1094M102j0375K0148n0712o215K816n3318
$$ 47511 10840 411 -6549 -27802 13292 17394 7019 27167 -23545 -29760 -26944 -80262
12679h0262m0166k2072O020O3244m2358L7379K7739m5628L1349J2303Q7481O7649
$$ -80262 -120428 -142500 -136480 -73236 -115594 -78215 -50476 -96104 -64755 -52452 35029 102678
12667A02678j09957j02105K125O9646J02562K5286J0117k1167p4157N3415k7330
$$ 102678 -7279 -109384 -107259 -37613 64949 90235 100352 79185 5028 58443 31113
12656C1113L6689l8135o0335J057k6356k1543k8688N6678K9770K1025m218j07738
$$ 31113 67802 29667 -30668 -29611 -55967 -77510 -106198 -49520 -19750 1275 -2943 -110681
12644a10681j05072J05178R7723k23J3425R6075k6852r7869j626N3666J7932P95
$$ -110681 -215753 -110575 -12852 -13075 350 96425 69573 -28296 -29922 23744 41676 42471
12632D2471k3220p4748k8509P813J2034M7550J2930K9963M118Q2982q5622m9649
$$ 42471 19251 -55497 -84006 -76193 -64159 -16609 -3679 26284 30402 113384 27762 -21887
12620b1887K0276p3974N6267L1616J8193J508m614n50P456j9910j2461N629K978
$$ -21887 -1611 -75585 -19318 12298 30491 31999 27385 26835 34291 14381 1920 7549 10527
12607A0527L3146M9761L794o1297Nl2190O5408J6740m5306n4429o9493P1100L2686
$$ 10527 43673 93434 97228 35931 35936 3746 69154 85894 40588 -13841 -83334 -12234 20452
12594B0452J152m8708L12L1582K9370J7050m4203k4206L1855K2916K1313O1928
$$ 20452 21604 -27104 -26792 4790 34160 51210 7007 -17199 14656 37572 58885 120813
12582A20813l4523j8369m8899j42042m6438L7380K7599M0263J2077j920M1149
$$ 120813 86290 67921 19022 -123020 -169458 -132078 -104479 -64216 -52139 -54059 -12910
12571a2910K7811n8485m5376m4605J1164J5296n7472m1873j7735L7282Q3151j0947
$$ -12910 14901 -43584 -88960 -133565 -122401 -107105 -164577 -206450 -224185 -186903 -103752 -114699
12559a14699J236N2035L8039m5782q4143P6246O2852l9647Q5319Q9971K8483n3248
$$ -114699 -113463 -61428 -23389 -69171 -153314 -77068 -14216 -53863 31456 121427 149910 96662
12547I6662l2452k3683M592O3897o8571j32526k3311J4153N7554J20303k1575
$$ 96662 64210 40527 45119 109016 40445 -92081 -115392 -101239 -43685 76618 55043
12536E5043p5054L4234J8512l2015r9108L1232K3726J3219L2979r551J9571J5396
$$ 55043 -20011 14223 32735 720 -98388 -67156 -43430 -30211 2768 -6783 12788 28184
12524B8184m0062n2359k9913J608l2365q189Q4483O2549K3674J3541m6116o5449
$$ 28184 -11878 -64237 -94150 -92542 -124907 -133096 -48613 13936 37610 51151 5035 -60414
12512f0414J875j6724l1666o256P6602J0436K6771l7058r8393O6228M5445R284
$$ -60414 -58539 -75263 -106929 -113185 -36583 -26147 624 -36434 -134827 -68599 -23154 -13870
12500a3870j4987L039j11566j2391R1166N3687J7403N0043n5706j25932j1463
$$ -13870 -28857 -25818 -137384 -149775 -58609 -4922 12481 62524 6818 -119114 -130577
12489a30577j8428M1322J24120O547r6022N339J3504n3767l2175L5306J09400
$$ -130577 -149005 -107683 16437 22984 -73038 -67699 -54195 -107962 -140137 -104831 4569
12478D569K0223m216j9361Q989J9272j7785L3040k7733k9642o6143P2609J7683
$$ 4569 24792 20576 1215 10204 29476 11691 44731 16998 -12644 -78787 -6178 11505
12466A1505j4639p7001p4028J20506o752M1373L0595k2922J1370P0038K7688q910
$$ 11505 -3134 -80135 -154163 -33657 -40409 964 31559 8637 20007 90045 117733 108823
12454A08823J9443J4783m2129n960o3524r5487M7199R1470L2300l4021K2934j5766
$$ 108823 128266 143049 100920 94960 31436 -64051 -16852 74618 106918 72897 95831 80065
12442H0065q7839q4415p343r8572N2238O2847J2027l523L9020J8014L6006K642
$$ 80065 -7774 -92189 -99532 -198104 -145866 -83019 -70992 -74515 -35495 -17481 18525 21167
12430B1167m4081J3578p3213m614O1917N7023l9323p0843K7744Q2182J2651J5797
$$ 21167 -22914 -9336 -82549 -87163 -25246 31777 -7546 -78389 -50645 31537 44188 59985
12418E9985K7445m0195r0326j5323n6882o8849j490J17833R9319K8821k2528m7605
$$ 59985 87430 47235 -43091 -58414 -115296 -184145 -185635 -67802 31517 60338 37810 -9795
12406i795j1339k7946Q497j0839l3663O6946j7062k5099o4197J2017P0311Q6861
$$ -9795 -21134 -49080 -40583 -51422 -85085 -18139 -35201 -60300 -124497 -112480 -42169 44692
12394D4692L210O2202L6271j7028p5473K4099j29008q9077K8310q1462J0321O1084
$$ 44692 47902 110104 146375 129347 53874 77973 -51035 -140112 -111802 -193264 -182943 -121859
12382a21859O8527L5210O8324m3947m0826j2990N4510L553k5724O1946K4449j33491
$$ -121859 -53332 -18122 50202 6255 -34571 -47561 6949 10502 -15222 46724 71173 -62318
12370f2318m4804P6063j4732k8708N3597P718o6093k7933N284K3967K1222J18886
$$ -62318 -107122 -31059 -45791 -74499 -20902 -13184 -79277 -107210 -101926 -77959 -56737 62149
12358F2149m255n7065r1421n638l1090q350m6334P6898J5742O4246K9560k8946
$$ 62149 57894 829 -90592 -96230 -127320 -135670 -182004 -105106 -89364 -25118 4442 -24504
12346b4504m567l224k9891r2891m4863K0362J926Q2029N1275N0251k0211M834
$$ -24504 -29071 -32295 -62186 -155077 -199940 -179578 -177652 -95623 -44348 5903 -14308 -9474
12334i474K376j242o360N9940l321j33554m5999k3639K1883R8348Q514o9233k9054
$$ -9474 -7098 -8340 -14700 45240 41919 -91635 -137634 -161273 -139390 -41042 -32528 -101761 -130815
12321a30815J20323O5285n5554l3356m5862K5551P1641K6866R04l8807k8820o6884
$$ -130815 -10492 54793 -761 -34117 -79979 -54428 17213 44079 44983 6176 -22644 -89528
12309h9528m8772M0682Q1632m5727L9765M2179J2772m960q9150j1264K5981M5959
$$ -89528 -138300 -97618 -15986 -61713 -21948 20231 33003 28043 -61107 -72371 -46390 -431
12297d31o6103J8801L0964n2090N536J5173n1601K74L9439j3433p2719p324M5971
$$ -431 -66534 -47733 -16769 -68859 -63323 -48150 -99751 -99477 -60038 -73471 -146190 -153514 -107543
12284a07543K5365N2995l1805J8183L0359O516J568L344n4672J8136L637k6710
$$ -107543 -82178 -29183 -60988 -42805 -12446 -5930 -4362 -1018 -55690 -37554 -33917 -60627
12272f0627k4263r795n4275J7450N9694K7821M3677L2079j05918k9658M8769K4703
$$ -60627 -84890 -94685 -148960 -131510 -71816 -43995 -318 31761 -74157 -103815 -55046 -30343
12260c0343M6640O162N501p6815m9522l6633N0651K3797N379Q6170n662L5120
$$ -30343 16297 22459 27960 -48855 -98377 -135010 -84359 -60562 -55183 30987 25325 60445
12248F0445l2258N5391R2184m3290q6461m0002m5890M834o2523l3409N7786P8818
$$ 60445 28187 83578 175762 132472 46011 6009 -39881 -35047 -97570 -130979 -73193 5625
12236E625K4026K1761M4610K0037r3770q6161m9319q53l0936J7563Q6154l0325
$$ 5625 29651 51412 96022 116059 22289 -63872 -113191 -114044 -144980 -127417 -41263 -71588
12224g1588p7973L6731j169Q139L5237P0821J6074m3855J2295l4160k8227N0944
$$ -71588 -149561 -112830 -113999 -105860 -70623 198 16272 -27583 -15288 -49448 -77675 -26731
12212b6731R8574j8951k0805o6937q4685q8324O0604J34259L8152J0249J7065
$$ -26731 71843 52892 32087 -34850 -119535 -207859 -147255 -12996 25156 35405 52470
12201E2470k4392L0946L8273l9186m8639n076J09925J00431k5795j46883q8520
$$ 52470 28078 59024 97297 58111 9472 4396 114321 214752 188957 42074 -46446
12190d6446M6002Q6093p1916m9566q3546L9179M7583K09p976r093P217l0269Q2116
$$ -46446 -444 85649 13733 -35833 -119379 -80200 -32617 -32408 -40384 -49477 -42260 -72529 9587
12177I587N064k3776K2459N2004N9533K889l4601n0433o4448K5084l808Q294j7799
$$ 9587 14651 -9125 13334 65338 124871 127760 93159 42726 -21722 3362 -446 7848 -9951
12164i951N328J07147l5528o4819j10433j3442O0527O8260J8765o4348l7147N9131
$$ -9951 -4623 102524 66996 2177 -108256 -121698 -61171 7089 25854 -38494 -75641 -16510
12152a6510n042P6455K1209o8415r3074L4286N0112N0722j3772j06649n0215O2401
$$ -16510 -21552 54903 76112 7697 -85377 -51091 -979 49743 35971 -70678 -120893 -58492
12140e8492N29K4335k7255l7247p074L1697j0349m0105N1817N2492j9059M3890
$$ -58492 -57963 -33628 -60883 -98130 -105204 -73507 -83856 -123961 -72144 -19652 -38711 5179
12128E179l7985o6494K523j8223M1357Q4883K5085l1234J4753J3628p5582m170
$$ 5179 -32806 -99300 -96777 -115000 -73643 11240 36325 5091 19844 33472 -42110 -46280
12116d6280R0954l4764l8318j6949k2182J30757k7302l9052K1389L6234o47o9399
$$ -46280 44674 9910 -28408 -45357 -67539 63218 35916 -3136 18253 54487 53840 -15559
12104a5559N268N3954r624o9602l7096m1426N557J8908O6604N0967J4379J0715
$$ -15559 -10291 43663 34039 -35563 -72659 -114085 -108528 -89620 -23016 27951 42330 53045
12092E3045L2012o5888j2576m9713o029J1417l2063k116j1244J6525O5424q0584
$$ 53045 85057 19169 6593 -43120 -49149 -37732 -69795 -71911 -83155 -66630 -1206 -81790
12080h1790M7356m2170l8913m5371R681M7690J8704M2266K3295K1278p6721N148
$$ -81790 -34434 -76604 -115517 -160888 -151207 -103517 -84813 -42547 -19252 2026 -74695 -69547
12068f9547P0131L5126o7285j0344L2454p36l9122k1812M1664O1375K4736p300
$$ -69547 584 35710 -31575 -41919 -9465 -10201 -49323 -71135 -29471 31904 56640 49340
12056D9340n5267L356m5777O984J1527j4893M6188J8740J5173j2230p4413j7688
$$ 49340 -5927 -2571 -48348 -41364 -29837 -44730 1458 20198 35371 23141 -51272 -68960
12044f8960j2129p1247j0912O2571J5566m0481n168M6348K9891m1558m3213J6121
$$ -68960 -81089 -152336 -163248 -100677 -85111 -125592 -130760 -84412 -54521 -96079 -139292 -123171
12032a23171J4472L0857k7694K7576K7936L8545m5963m3541M161r488L5407J03882
$$ -123171 -108699 -77842 -105536 -77960 -50024 -11479 -57442 -100983 -96822 -106310 -70903 32979
12020C2979l365p9892P0374q311j3348J0575L355P4205L056n7722m2346j6159
$$ 32979 29614 -50278 20096 11785 -1563 9012 12367 86572 89628 31906 -10440 -26599
12008b6599L4249L3417j6209M217m3861m2927N3863l6702n3280j411N6183L4562
$$ -26599 7650 41067 24858 29075 -14786 -57713 -3850 -40552 -93832 -95243 -39060 -4498
11996d498l7457J1469n1240q110m5797k6613r143J04279K0499L4647J15907K0248
$$ -4498 -41955 -30486 -81726 -89836 -135633 -162246 -171389 -67110 -46611 -11964 103943 124191
11984A24191k9992l0343l5323n5625j20637p7354O1168P3325J6250J02370O0573
$$ 124191 94199 63856 28533 -27092 -147729 -225083 -163915 -90590 -74340 28030 88603
11973H8603L2287k6921m1849r550L3692j1737j23347k5449l2031l7723L6627P3258
$$ 88603 120890 93969 52120 42570 76262 64525 -58822 -84271 -116302 -154025 -117398 -44140
11961d4140M2224Q8201O7227j30446o3168N2336k1499O7949l9298M1812O4944
$$ -44140 -1916 86285 153512 23066 -40102 12234 -9265 58684 19386 61198 126142
11950A26142m4579j2422J7180k755j05929m2184j4847P4579O5239k9909l7932
$$ 126142 81563 69141 86321 83566 -22363 -64547 -79394 -4815 60424 30515 -7417
11939g417J7542K5228K195n0174J3872R06N930K0953m2936o1056L8861N5822o393
$$ -7417 10125 35353 37548 -12626 1246 2152 8082 29035 -13901 -74957 -36096 19726 13333
11926A3333r8132L839k1156K2389R0884O0987q7278j00207M0343J3959n7450J2679
$$ 13333 -84799 -80960 -102116 -79727 11157 72144 -15134 -115341 -74998 -61039 -118489 -105810
11914a05810q6362Q312L8442O9008M3230k4063N5860o074N7396M1230j7928m1708
$$ -105810 -192172 -183860 -145418 -76410 -33180 -57243 -1383 -7457 49939 91169 73241 31533
11902C1533q6282j6911m323J3942K722M5016j8249K0267o4719q9375L0713J25421
$$ 31533 -54749 -71660 -75983 -62041 -59319 -14303 -32552 -12285 -77004 -166379 -135666 -10245
11890a0245K4670M9042L6746N2795l2195r7720o4842K6105j9856J9233L6116q1441
$$ -10245 14425 63467 100213 153008 120813 23093 -41749 -15644 -35500 -16267 19849 -61592
11878f1592o964K8567n5911o8658N5334N2749o6946p5782L5069Q4872M3547o2395
$$ -61592 -68556 -39989 -95900 -164558 -109224 -56475 -123421 -199203 -164134 -79262 -35715 -98110
11866i8110m490m036M2897J6121n764r1406l888O3987N2610Q2255j46462k5000
$$ -98110 -102600 -106636 -63739 -47618 -53382 -144788 -148676 -84689 -32079 50176 -96286 -121286
11854a21286K7044Q206P2215N2735J4554n8528q0838j588M834M8400K3882n5764
$$ -121286 -94242 -86036 -13821 38914 53468 -5060 -85898 -87486 -82652 -34252 -10370 -66134
11842f6134L3477N3149J1389l3243n8645q931K2470n096N0643k0614k8973L4503
$$ -66134 -32657 20492 31881 -1362 -60007 -68938 -46468 -51564 -921 -21535 -50508 -16005
11830a6005j328j265j07558m0017L6720L3216o1424n8207m5580O1366M0811P7207
$$ -16005 -17333 -18598 -126156 -166173 -129453 -96237 -157661 -215868 -261448 -200082 -159271 -82064
11818h2064j964l5943L2829Q7260j842Q1267P1345n0195q4802j6005j8297j704
$$ -82064 -84028 -119971 -87142 118 -1724 79543 150888 100693 15891 -114 -18411 -20115
11806b0115M7789l6117j6859K478K8193L3831J8050j790j00955j09640l6274J3395
$$ -20115 27674 -8443 -25302 -22824 5369 39200 57250 55460 -45495 -155135 -191409 -178014
11794a78014J0877P761M1963J24124j7295K483J8174O2386J9737l7229o3141N0835
$$ -178014 -167137 -159376 -117413 6711 -10584 -8101 10073 72459 92196 54967 -8174 42661
11782D2661k866k0696O8357o6941j6998J8187O877l4978J5340m0710J3768K2132
$$ 42661 39795 19099 87456 20515 3517 21704 28581 -6397 8943 -31767 -17999 4133
11770D133L849J4494k5789N8017L4226m745M8477m9096j05928q3573M1592J1605
$$ 4133 7982 22476 -3313 54704 88930 84185 132662 83566 -22362 -105935 -64343 -52738
11758e2738N46j173J3965M6658K9342L7018j7605K2687K7186q010J2329K3874
$$ -52738 -52192 -53365 -39400 7258 36600 73618 56013 78700 105886 97876 110205 134079
11746A34079o0179L2444k7045p6198K6749O3271J1169p5476j26188q0287K1492
$$ 134079 73900 106344 79299 3101 29850 93121 104290 28814 -97374 -177661 -156169
11735a56169M7327P160M4241K4767Q6362l830M2478K5974n8973q9985L10k3480
$$ -156169 -108842 -101682 -57441 -32674 53688 49858 92336 118310 59337 -30648 -30338 -53818
11723e3818l1095j8737K7310M3360k7912k3145o797p380l5558o0080R1940P5747
$$ -53818 -84913 -103650 -76340 -32980 -60892 -84037 -90834 -98214 -133772 -193852 -101912 -26165
11711b6165k4478m8493p2106K0435P2922K3123K479J2769M4642M9809L0737k5089
$$ -26165 -50643 -99136 -171242 -150807 -77885 -54762 -52283 -39514 5128 54937 85674 60585
11699F0585m6719K8889N341n2828m9208j5352K333Q9766P2559m7686l2509j4554
$$ 60585 13866 42755 48096 -4732 -53940 -69292 -66959 22807 95366 47680 15171 617
11687F17m0506L310l1662p746k6979j3916J11923l5846k5744J9625l1034M130
$$ 617 -39889 -36579 -68241 -75987 -102966 -116882 -4959 -40805 -66549 -46924 -77958 -73828
11675g3828n0548j6124K3636R6488r5424K7322J12713k387m355J3381p332m104
$$ -73828 -124376 -140500 -116864 -20376 -115800 -88478 24235 21848 17493 30874 23542 19438
11663A9438o9013J7472R564o4245Q2025M9676J5745p226k1315M4589L8862J6962
$$ 19438 -49575 -32103 -22539 -86784 -4759 44917 60662 53436 32121 76710 115572 132534
11651A32534l0658p3555l7395k4359R7294j5629k1172o791j10661m9417K9199
$$ 132534 101876 28321 -9074 -33433 63861 48232 27060 20269 -90392 -139809 -110610
11640a10610Q8594q027k9789o089O9598L7643m4723m4099J30005P840n6148k9551
$$ -110610 -22016 -30043 -59832 -65921 3677 41320 -3403 -47502 82503 90343 34195 4644
11628D644L5276j3798L6344r750k7735p6317J212K9109K4246j8312K8522L1568
$$ 4644 39920 26122 62466 52716 24981 -51336 -50124 -21015 3231 -15081 13441 45009
11616D5009j9188q9361p6485Q3911P0771q4488M4681P7152k7884n7120k1909r786
$$ 45009 25821 -63540 -140025 -56114 14657 -69831 -25150 52002 24118 -33002 -54911 -64697
11604f4697m3079l8416l0623M5011P2092M2751n1511k2227r7201j10813J17628
$$ -64697 -107776 -146192 -176815 -131804 -59712 -16961 -68472 -90699 -187900 -298713 -181085
11593a81085R5757M5253M6628K7192J5853l9153j00443o8407q277N9983P4920
$$ -181085 -85328 -40075 6553 33745 49598 10445 -89998 -158405 -166682 -106699 -31779
11582c1779J4020k7176M0981m2239L591J9064j0310M1109n1278p536J05018L1871
$$ -31779 -17759 -44935 -3954 -46193 -42602 -23538 -33848 7261 -44017 -51553 53465 85336
11570H5336k8936p687M5669n1469l6653J5967Q0840R3306J1448o5925k09844m4229
$$ 85336 56400 48713 94382 42913 6260 22227 103067 196373 207821 141896 -67948 -112177
11558a12177L3832j6819l7362P2224M7544n4660J1797R7845N734p6875k7083N62
$$ -112177 -78345 -95164 -132526 -60302 -12758 -67418 -55621 42224 47958 -28917 -56000 -55438
11546e5438l2476P3529Q5039p7761l5908m9049K5039O0288N6756L5843n2574o9612
$$ -55438 -87914 -14385 70654 -7107 -43015 -92064 -67025 -6737 50019 85862 33288 -36324
11534c6324m5423N223J6758k9060k5515L1337M3844j7435R036N7289r519P512
$$ -36324 -81747 -76524 -59766 -88826 -114341 -83004 -39160 -56595 -47559 9730 211 7723
11522G723N9935p643j142j1964K2957O277l4467N5714L1266j13750l8320O6811
$$ 7723 67658 60015 58873 46909 69866 76143 41676 97390 128656 14906 -23414 43397
11510D3397m8043l1970j2397M5877j5252r3508n014j029Q5457J6879L4005N0843
$$ 43397 -4646 -36616 -49013 -3136 -18388 -111896 -116910 -117939 -32482 -15603 18402 69245
11498F9245n5693j9324l9390k982J0160Q025m2302M5255m9674r082J11861O5893
$$ 69245 13552 -5772 -45162 -48144 -37984 -29959 -72261 -27006 -76680 -85762 26099 91992
11486I1992j10593j68374k1906J04704Q8320P4716k4572k3703N4622J3118j15610
$$ 91992 -18601 -186975 -208881 -104177 -15857 58859 34287 10584 65206 78324 -37286
11475c7286l5722j2495k1621M4641M9968o4892l3968P8411J17161N624j18519
$$ -37286 -73008 -85503 -107124 -62483 -12515 -77407 -111375 -32964 84197 89821 -28698
11464b8698j5139L6240M4754K6955m5519k6260K342k2485L3168J25063M1604p6661
$$ -28698 -43837 -7597 37157 64112 18593 -7667 -5325 -27810 5358 130421 172025 95364
11452I5364r9544n058o2752m8104l5763P9188J01303L9894N3338O8736J9906l1657
$$ 95364 -4180 -9238 -71990 -120094 -155857 -76669 24634 64528 117866 186602 206508 174851
11440A74851q6013o0321l5121L6365j1639J41789L6840l9248p2422l8576N3127
$$ 174851 88838 28517 -6604 29761 18122 159911 196751 157503 85081 46505 99632
11429I9632N7403q5793o2870m7208k1623J3849l7005J16454j3400n2675j12338
$$ 99632 157035 71242 8372 -38836 -60459 -46610 -83615 32839 19439 -33236 -145574
11418a45574p828r659N0161J13181P7277P15K0435r0126r1139N9600L7449N3872
$$ -145574 -153402 -163061 -112900 281 77558 78273 98708 8582 -82557 -22957 14492 68364
11406F8364o6392m0358M3956l9657J3520m8275j7997Q3126L282j12180k2631J2585
$$ 68364 1972 -38386 5570 -34087 -20567 -68842 -86839 -3713 -431 -112611 -135242 -122657
11394a22657j0408N633N8919O1948K8958N3278L4604m0966L7532P7284o6306m5250
$$ -122657 -133065 -127432 -68513 -6565 22393 75671 110275 69309 106841 184125 117819 72569
11382G2569j9151q4333n1823j3835K1378L2638m1790r9568r874J8417O6804P6214
$$ 72569 53418 -30915 -82738 -96573 -75195 -42557 -84347 -183915 -193789 -175372 -108568 -32354
11370c2354l5355J7925M4425q5749r9849K6512N1545j8500K9096J14654K4361
$$ -32354 -67709 -49784 -5359 -91108 -190957 -164445 -112900 -131400 -102304 12350 36711
11359C6711l0933K0725O5413M697p7213r2590k3143M5753N4892M8453R23n0104
$$ 36711 5778 26503 91916 96613 19400 -73190 -96333 -50580 4312 52765 53688 3584
11347C584j2813m073l8871N1294l1570p0860l1402J2995N6344J08778j0592k8137
$$ 3584 -9229 -13302 -52173 -879 -32449 -103309 -134711 -121716 -65372 43406 32814 4677
11335D677l2253J2440k7425j7457j1551q195m224q36N1481L6220M3456k7194p45
$$ 4677 -27576 -15136 -42561 -60018 -71569 -79764 -83988 -84824 -33343 2877 46333 19139 18394
11322A8394m94N3272l2502l6258o187L8175k773l7536j764K4243p739n3811r986
$$ 18394 17900 71172 38670 2412 -3775 34400 31627 -5909 -7673 16570 8831 -44980 -54966
11309e4966N5979M2913l5657m0794m9852m2310M6041j1997O2104J02137m7268
$$ -54966 1013 43926 8269 -32525 -82377 -124687 -78646 -90643 -28539 73598 26330
11298B6330j5282L4370r68M4583O267J7349L1100p0315m9199R767O139m0760l7779
$$ 26330 11048 45418 44450 89033 95300 112649 143749 73434 24235 34002 40141 -619 -38398
11285c8398R3993O2024l1102p0424o8982l3714p2909Q8957L0342L1411J1919P768
$$ -38398 55595 117619 86517 16093 -52889 -86603 -159512 -70555 -40213 -8802 3117 10885
11273A0885J9322o0100m3800K1829j4928o0521k3565R5606N0648P4613N9318m814
$$ 10885 30207 -29893 -73693 -51864 -66792 -127313 -150878 -55272 -4624 69989 129307 124493
11261A24493l5408o868j8097j803K9889p4058m2054n6308J9004k0103K155M0839
$$ 124493 89085 82217 64120 62317 92206 18148 -23906 -80214 -61210 -81313 -79158 -38319
11249c8319R3415J26486n319k01955k9414L148M1038J8052K6169n4878l4953l3113
$$ -38319 55096 181582 176263 -25692 -55106 -51958 -10920 7132 33301 -21577 -56530 -89643
11237h9643M4116k1517M276m0501K7790O1946Q8855M5601o7746L5660J7060l8312
$$ -89643 -45527 -67044 -62768 -103269 -75479 -13533 75322 120923 53177 88837 105897 67585
11225F7585m8360m5186L9930n0681q221j6921P9528p2714o306p9524o3600Q2663
$$ 67585 19225 -25961 13969 -36712 -44933 -61854 17674 -55040 -61346 -140870 -204470 -121807
11213a21807J27421M365q8608N3817J6064J3533L6969K8640P1771j7342j39233
$$ -121807 5614 9979 -78629 -24812 -8748 4785 41754 70394 142165 124823 -14410
11202a4410m5407l064L072P4520J1470o854j9114j3531k8644K2732Q3824o4555
$$ -14410 -59817 -62881 -59809 14711 26181 19327 213 -13318 -41962 -19230 64594 39
11190C9O77J1935K1573Q388O7646K8323J5877n9669j21004m747O790l9415j1607
$$ 39 716 12651 34224 42612 110258 138581 154458 94789 -26215 -30962 -24172 -63587 -75194
11177g5194R3326N2416L1675J1341j4009k6302l6271m5996n8584N1986q6079n6818
$$ -75194 18132 70548 102223 113564 99555 73253 36982 -9014 -67598 -15612 -101691 -158509
11165a58509O7582N3597l6444M4172J5450k9457N7474n0739q0254M8681Q216J6601
$$ -158509 -90927 -37330 -73774 -29602 -14152 -43609 13865 -36874 -117128 -68447 -60231 -43630
11153d3630m2272k0973M6301J8139N6169N3100k7550m2969P192J2515K2454k8649
$$ -43630 -85902 -106875 -60574 -42435 13734 66834 39284 -3685 3507 16022 38476 9827
11141I827L8920m168Q865k0806k7948j26691k3524l8775O2872J8336R924l6693
$$ 9827 48747 44579 53444 32638 4690 -122001 -145525 -184300 -121428 -103092 -93168 -129861
11129a29861j3257L8756J10260N0786o2979O7735R737n3716n7421O9197L9933
$$ -129861 -143118 -104362 5898 56684 -6295 61440 71177 17461 -39960 29237 69170
11118F9170j3761n6052o6277j04423L9087O8236K0914J7690k682q0045R271J02338
$$ 69170 55409 -643 -66920 -171343 -132256 -64020 -43106 -25416 -28098 -108143 -98872 3466
11106C466J03792l8991m0554m502L9324J6272K2437j6331m3265k7112l1220K0398
$$ 3466 107258 68267 27713 23211 62535 78807 101244 84913 41648 14536 -16684 3714
11094C714J5462J264k4379O195N2270j5501n0698l8204m3669O8704N5041o6289
$$ 3714 19176 20440 -3939 2256 54526 39025 -11673 -49877 -93546 -24842 30199 -36090
11082c6090q9887N7685M9188J4168J977M9102q610q8964o2896N1620J47091j3262
$$ -36090 -125977 -68292 -19104 -4936 -2959 46143 37533 -51431 -114327 -62707 84384 71122
11070G1122L3562J0139o1176l4500L591O5114L5480K820k8946j02313O485m698
$$ 71122 104684 114823 53647 19147 22738 87852 123332 126152 97206 -5107 1378 -3320
11058c320k3854k4194m491J9827O5136j1886r7330j0113P3201P8358J4131q5000
$$ -3320 -27174 -51368 -55859 -36032 29104 17218 -80112 -90225 -17024 61334 75465 -9535
11046i535j3516L3826n712n7999o559J6203k5562l9165j2397O1012R5570K699
$$ -9535 -23051 10775 5063 -52936 -59495 -43292 -68854 -108019 -120416 -59404 36166 38865
11034C8865p442N5035k9802q3791o2143Q3648l167n4094k0220R120L1402J0074
$$ 38865 31423 86458 56656 -27135 -89278 -5630 -8797 -62891 -83111 -73991 -42589 -32515
11022c2515K9693N3532L4545j9701m8124m5476Q6113K7570o284K1853j12970k8938
$$ -32515 -2822 50710 85255 65554 17430 -28046 58067 85637 79353 101206 -11764 -40702
11010d0702J11119M4592o5394j22370J8703O1728L9434l3122j3554P883j22167
$$ -40702 70417 115009 49615 -72755 -54052 7676 47110 13988 434 8317 -113850
10999a13850O052n116n2032N3131O0100O0183P4745j9993j1995j1194m8679k8715
$$ -113850 -107798 -112914 -164946 -111815 -51715 8468 83213 63220 51225 40031 -8648 -37363
10987c7363j4346j530k8613J1985n5461m5432R9408O4090L0016j8994r6734j01279
$$ -37363 -51709 -53239 -81852 -69867 -125328 -170760 -71352 -7262 22754 3760 -92974 -194253
10975a94253K0077P6848M7624K8007J3366k1520j2851m7146m3718k2969N3653
$$ -194253 -174176 -97328 -49704 -21697 -8331 -29851 -42702 -89848 -133566 -156535 -102882
10964a02882M9453r9885m2134Q7624M0659K6190N0523L8547k6298j3602l9367
$$ -102882 -53429 -153314 -195448 -107824 -67165 -40975 9548 48095 21797 8195 -31172
10953c1172R254Q8358K1015o605J7893l3582j18532r4881N1639R5888J24498K8514
$$ -31172 -21918 66440 87455 80850 98743 65161 -53371 -148252 -96613 -725 123773 152287
10941A52287j37093q0929M6162j4629K3379j2068L0600O6326k6074o1769J0981
$$ 152287 15194 -65735 -19573 -34202 -10823 -22891 7709 74035 47961 -13808 -2827
10930b827J9732o0818p206O6948O0593k5520n2498k0754n6154m9584L2991J11343
$$ -2827 16905 -43913 -51119 15829 76422 50902 -1596 -22350 -78504 -128088 -95097 16246
10918A6246M1124j5888j7805m8745J257k3214l318L834m7338N679K2071N2998
$$ 16246 57370 41482 23677 -25068 -23811 -47025 -50343 -46509 -93847 -88168 -66097 -13099
10906a3099L3136L9799M55q3280M0049P3713m1398K1655O4250n4170l9013N3903
$$ -13099 20037 59836 60291 -22989 17060 90773 49375 71030 135280 81110 42097 96000
10894I6000n0693K8113l9948p3724N4585J45538N1976j36213O273P9878l0603
$$ 96000 45307 73420 33472 -40252 14333 159871 211847 75634 81907 161785 131182
10883A31182J3729l166m732k5729n7657n740n810J3679P56K9135o091M612j695
$$ 131182 144911 141745 137013 111284 53627 47887 42077 55756 56512 85647 79556 84168 82473
10870H2473k1552J7992N5952J5246K7243m9181j03234n7257K1977N6177M3060
$$ 82473 60921 78913 134865 150111 177354 128173 24939 -32318 -10341 45836 88896
10859H8896m8243r2843r453M5032k0085l4002J3009Q285j24702K2866R7153O6725
$$ 88896 40653 -52190 -61643 -16611 -36696 -70698 -57689 -49404 -174106 -151240 -54087 12638
10847A2638l4285n1358n3828p8073J07082R6253O8289N0199N128L3567K573m0727
$$ 12638 -21647 -73005 -126833 -204906 -97824 -1571 66718 116917 122045 155612 158185 117458
10835A17458J332j9671p5682r9727O127J24654P8613o1838j15595j0658J6111
$$ 117458 118790 99119 23437 -76290 -70163 54491 133104 71266 -44329 -54987 -38876
10824c8876L7176M327O7730P7383L7898l7882j01257o0370r881j4358M540o3324
$$ -38876 -1700 2627 70357 147740 185638 147756 46499 -13871 -23752 -38110 -33570 -96894
10812i6894M1429N2656j3938K6794O2195K2616k4604m7302J2684n7403L3614k9547
$$ -96894 -55465 -2809 -16747 10047 72242 94858 70254 22952 35636 -21767 11847 -17700
10800a7700l4663k3676M1338j0982m538Q6607M1789k5090k0826k8267o5400l7546
$$ -17700 -52363 -76039 -34701 -45683 -50221 36386 78175 53085 32259 3992 -61408 -98954
10788i8954o0144l0585P1220K3780J8756l7634N6930R0063M8932l3775j25502
$$ -98954 -159098 -189683 -118463 -94683 -75927 -113561 -56631 33432 82364 48589 -76913
10777g6913K3092L2564O2332j8922m7932l4048N7734M8425K4179J4013l6637J5224
$$ -76913 -53821 -21257 41075 22153 -25779 -59827 -2093 46332 70511 84524 47887 63111
10765F3111p4217M096L3243l2066L694n2226L4405L3043J0854k6605j8581n266
$$ 63111 -11106 -7010 26233 -5833 -2139 -54365 -19960 13083 23937 -2668 -21249 -26515
10753b6515K4540P528j03124K4394r195k5027J8036J1194m8207j8180J03295M9919
$$ -26515 -1975 5553 -97571 -73177 -82372 -107399 -89363 -78169 -126376 -144556 -41261 8658
10741H658N7090l5045O598J7262m17j1864P3591M9719q2530j15956k0816l501
$$ 8658 65748 30703 37301 54563 54146 42282 115873 165592 83062 -32894 -53710 -57211
10729e7211N5016O2772L4503j11996r1796k1714J03498J9822M6822m2355k5170
$$ -57211 -2195 60577 95080 -16916 -108712 -130426 -26928 -7106 39716 -2639 -27809
10718b7809l5130O0812J04254r9988m6761m5269P0822N811L757O24l8096q5621
$$ -27809 -62939 -2127 102127 2139 -44622 -89891 -19069 -13258 -9501 -8877 -46973 -132594
10706a32594l3816k0368L021N7650j4012J15049L9101M754N4645k0443j58106
$$ -132594 -166410 -186778 -183757 -126107 -140119 -25070 14031 18785 73430 52987 -105119
10695a05119r202M1104P6108P7479M0987o4616j42051p0466R5620J23989O641
$$ -105119 -114321 -73217 2891 80370 121357 56741 -85310 -155776 -60156 63833 70474
10684G0474j6908N6107L9841m3680n2029m6805P3557k2556k9187L7680K0395j3475
$$ 70474 53566 109673 149514 105834 53805 7000 80557 58001 28814 66494 86889 73414
10672G3414k8084L7366l4489k8978m232k3042k9844J12274K2910m5828o5572r8055
$$ 73414 45330 82696 48207 19229 14997 -8045 -37889 74385 97295 51467 -14105 -112160
10660a12160L5342P0028K1098m016l4911M6621P8110o561q3528j06668L5150Q608
$$ -112160 -76818 -6790 14308 10292 -24619 22002 100112 93551 10023 -96645 -61495 -52887
10648e2887k3126P4990L8551k1308k5798m9968p6248k7786M9779P7228n343l9353
$$ -52887 -76013 -1023 37528 16220 -9578 -59546 -135794 -163580 -113801 -36573 -41916 -81269
10636h1269q733K1817J1294j16183q5947J66061J6813o0214j9113P1549L9046
$$ -81269 -90002 -68185 -56891 -173074 -259021 -92960 -76147 -136361 -155474 -83925 -44879
10625d4879n03R325n8919J6238q021J1086p436K5655K5193P5927l1159j02519
$$ -44879 -45382 -36057 -94976 -78738 -86759 -75673 -83109 -57454 -32261 43666 12507 -90012
10613i0012P225M8678k4731J00738J06647L5945o8150m1572M7132p2194K5430
$$ -90012 -82787 -34109 -58840 41898 148545 184490 116340 74768 121900 49706 75136
10602G5136o0128n5586P9569N9611j091j21648j1427j5045l2402r3914j834O1168
$$ 75136 15008 -40578 38991 98602 97511 -24137 -35564 -50609 -83011 -176925 -178759 -117591
10590a17591J9007Q4950J1043Q6759j4871l9353j9270p3230j3760J02819O3007
$$ -117591 -98584 -13634 -2591 84168 69297 29944 10674 -62556 -76316 26503 89510
10579H9510j19477J600P0383m3752o6606n8567N5311J8990j6234O2923K4433R566
$$ 89510 -29967 -28367 42016 -1736 -68342 -126909 -71598 -52608 -68842 -5919 18514 28080
10567B8080K7923J01795P4070j17104o5023j3425J3714L729n237M739q1184n2502
$$ 28080 56003 157798 231868 114764 49741 36316 50030 53759 48522 53261 -27923 -80425
10555h0425K5655N7391k926J8860l1551o500j7691k9397N4356P7516K5857o4712
$$ -80425 -54770 2621 -305 18555 -12996 -19496 -37187 -66584 -12228 65288 91145 26433
10543B6433n2276k4026j3221n452n8622Q1978J19666R621m2027J4218n146m6151
$$ 26433 -25843 -49869 -63090 -68542 -127164 -45186 74480 84101 42074 56292 51146 4995
10531D995l0392M405n5595r209K1881J1008P6916M8558L3294l9244L0163L939
$$ 4995 -25397 -20992 -76587 -85796 -63915 -52907 24009 72567 105861 66617 96780 100719
10519A00719k7741k9678j214J8494K9431K3623o7258n6782J0840l9852n6590J911
$$ 100719 72978 43300 42086 60580 90011 113634 46376 -10406 434 -39418 -96008 -94097
10507i4097P4330P1096k7286n316M1105K5474n8446j41j0497p2757j3985j8589
$$ -94097 -19767 51329 24043 18727 59832 85306 26860 26719 16222 -56535 -70520 -89109
10495h9109n7725J7309J6856n7416j2185M1810M8169J7709L1797K0313K9434k0019
$$ -89109 -146834 -129525 -112669 -170085 -182270 -140460 -92291 -74582 -42785 -22472 6962 -13057
10483a3057k4301l5073M4054K4685j579L7031Q2582m1807j3146k2141J612J48417
$$ -13057 -37358 -72431 -28377 -3692 -5271 31760 114342 72535 59389 37248 38860 187277
10471A87277k5029j46628K1763m2735l375l358m0238n3093P4814L729J5152L7535
$$ 187277 162248 15620 37383 -5352 -8727 -12085 -52323 -105416 -30602 -26873 -11721 25814
10459B5814l9121J8015Q0683n6050n7678L3303J15402j0513j75352q5396J19639
$$ 25814 -13307 4708 85391 29341 -28337 4966 120368 109855 -65497 -150893 -31254
10448c1254R2683L7030K3863q3454P94l4467k1105K6803m9455J0579P4299P2908
$$ -31254 61429 98459 122322 38868 39662 5195 -15910 10893 -38562 -27983 46316 119224
10436A19224l1620L8482Q1700k9763j07862K3305k5339r4795k1189n2583l8687
$$ 119224 87604 126086 207786 178023 70161 93466 68127 -26668 -47857 -100440 -139127
10425a39127P6846M5960K0823J6016p6559m2301J24579k5576j5279R0072J1558
$$ -139127 -62281 -16321 4502 20518 -56041 -98342 26237 661 -14618 75454 87012
10414H7012m1575J4066J4543j8215K6018r8039o6000J2623Q3969o0820O4346L5075
$$ 87012 45437 59503 74046 55831 81849 -16190 -82190 -69567 14402 -46418 17928 53003
10402E3003M3508K6639j20441J2593J4525j4691r7690K9765p361k7606J6851J9450
$$ 53003 96511 123150 2709 15302 29827 15136 -82554 -52789 -60150 -87756 -70905 -51455
10390e1455L4297K1783K335J09700o390o2195p0590j290J00480N1686k9965k9016
$$ -51455 -17158 4625 6960 116660 110270 48075 -22515 -23805 76675 128361 98396 69380
10378F9380p2223o9634m0950L9009J5953L0112K5978M1188L6160l5087M0287K8246
$$ 69380 -2843 -72477 -113427 -74418 -58465 -28353 -2375 38813 74973 39886 80173 108419
10366A08419j9794n509n0420o4030m1348L2955L5912N2452p841q2767R000N0879
$$ 108419 88625 83116 32696 -31334 -72682 -39727 -3815 48637 40796 -41971 -32971 17908
10354A7908l3252p216l4420q3876m8295N2950j8638N3594L7323K5140J1675K3279
$$ 17908 -15344 -22560 -56980 -140856 -189151 -136201 -154839 -101245 -63922 -38782 -27107 -3828
10342c828M4259J4507j1679L9270O3893Q705M4238p2932n9507m9017J0691O4622
$$ -3828 40431 54938 43259 82529 146422 155127 199365 126433 66926 17909 28600 93222
10330I3222k4482n2853m251L888m8622L5051l8576o3978L0737J33140J0709p1152
$$ 93222 68740 15887 11636 15524 -33098 1953 -36623 -100601 -69864 63276 73985 2833
10318B833n770J4184k6512o481P7968Q053k9876Q8535p005K1364R6379L6288L0486
$$ 2833 -2937 11247 -15265 -21746 56222 64275 34399 122934 115929 137293 233672 269960 300446
10305C00446q5934j23607l9605j6691k6051n8648k7555M4231N788L693R6654n5833
$$ 300446 214512 90905 51300 34609 8558 -50090 -77645 -33414 -27626 -23933 72721 16888
10293A6888p7013k8581P8253m5455K4339L1702L1736k87o975j7037j3413K8352
$$ 16888 -60125 -88706 -10453 -55908 -31569 133 31869 31582 24607 7570 -5843 22509
10281B2509K4769m7578j9737r9L0476J1170J591n9536l2848J3213Q8158M5228
$$ 22509 47278 -300 -20037 -20136 10340 21510 23101 -36435 -69283 -56070 32088 77316
10269G7316l209j6841l6116p8625L2420K395k3778M4540l4717m4814O6073N112
$$ 77316 74107 57266 21150 -57475 -25055 -22660 -46438 -1898 -36615 -81429 -15356 -10244
10257a0244m6597J9046Q2670j9535J3517k1954o4656P9520Q7009L1938m6919m9727
$$ -10244 -56841 -37795 44875 25340 38857 16903 -47753 31767 118776 150714 103795 54068
10245E4068L1837K3782l9164j5872p696m7259K5025K2006n1154m0577P9159N9340
$$ 54068 85905 109687 70523 54651 46955 -304 24721 46727 -4427 -45004 34155 93495
10233I3495j9623n8831J05680O6993j04785j7179R8748j6911n8844J6679o5498
$$ 93495 73872 15041 120721 187714 82929 65750 164498 147587 88743 105422 39924
10222C9924K2118j6152m692n4085m1548K3512Q0756l6897j9408j2338j266K2720
$$ 39924 62042 45890 41198 -12887 -54435 -30923 49833 12936 -6472 -18810 -20076 2644
10210B644N1381J1538m2816O039l1210n6029J7839N1748j2993k5502P6579K4857
$$ 2644 54025 65563 22747 28786 -2424 -58453 -40614 11134 -1859 -27361 49218 74075
10198G4075L923k5090k8391j5872J4957J4209j5628N701q111m5786L4783M9304
$$ 74075 77998 52908 24517 8645 23602 37811 22183 27884 19773 -26013 8770 58074
10186E8074p0726l5378K4218J1741L8552J5874M2569J5671k1157m5790M987N1730
$$ 58074 -12652 -48030 -23812 -12071 26481 42355 84924 100595 79438 33648 38635 90365
10174I0365J4986p5910j62422K0969j412J4897N114M1966j1878K8440K4050K6309
$$ 90365 105351 29441 -132981 -112012 -113424 -98527 -93413 -51447 -63325 -34885 -10835 15474
10162A5474Q2189l47l7792K0659L6008M9346M6472O094k3150j22948j17176m3890
$$ 15474 97663 97316 59524 80183 116191 165537 212009 218103 194953 72005 -45171 -89061
10150h9061P7346J6747l8044o8559K6629L0858J2509p5514m0659K9174R9331J04905
$$ -89061 -11715 5032 -33012 -101571 -74942 -44084 -31575 -107089 -147748 -118574 -19243 85662
10138H5662j2584p6097o7186O5373K5897J5869M3768k2809k7725q819N0268K707
$$ 85662 73078 -3019 -70205 -4832 21065 36934 80702 57893 30168 21349 71617 74324
10126G4324j4280r2261l9528m2627K6943R3107P3203l4867j9479j2975k0233O2271
$$ 74324 60044 -32217 -71745 -114372 -87429 5678 78881 44014 24535 11560 -8673 53598
10114E3598n1341o2548L8400Q0922r384k6887k8002m785j0494L4263R2351j8309
$$ 53598 2257 -60291 -21891 59031 49647 22760 -5242 -10027 -20521 13742 106093 87784
10102H7784j02883o0533P8887R5186M7656M3523m7756l3996J8763j1774j17452
$$ 87784 -15099 -75632 3255 98441 146097 189620 141864 107868 126631 114857 -2595
10091b595k5356M2650J652O2562k853o7731q0923N3222O6201m3956o7921k5302
$$ -2595 -27951 14699 16351 78913 76060 8329 -72594 -19372 46829 2873 -65048 -90350
10079i0350J7967L9408Q5298k1210o3424K5087K190J0595Q9106k844m974k6366
$$ -90350 -72383 -32975 52323 31113 -32311 -7224 -5034 5561 94667 91823 86849 60483
10067F0483m3535Q1528J9979k3110l4275j1160O2442M4112J0095l5587l5884J48003
$$ 60483 16948 98476 118455 95345 61070 49910 112352 156464 166559 130972 95088 243091
10055B43091J63370l1134j00197m2771q0364q4336N5559J9004p1246K6415k036
$$ 243091 406461 375327 275130 232359 151995 67659 123218 142222 70976 97391 95355
10044I5355M9427J3426n1034p8827q4696K3208l2421n2352N5057J28589L3469
$$ 95355 144782 158208 107174 28347 -56349 -33141 -65562 -117914 -62857 65732 99201
10033I9201K7196M5178O85n5474r7558p178k8088o4643J762j7077J4699M3137
$$ 99201 126397 171575 172260 116786 19228 12050 -16038 -80681 -78919 -95996 -81297 -38160
10021c8160l6654M6423J26226J13227n0987q2967n7028n3199m5361Q7O0520j8527
$$ -38160 -74814 -28391 97835 211062 160075 77108 20080 -33119 -78480 -78393 -17873 -36400
10009c6400o6516K2088K2586K5129Q4275M961l6416K8704p1443J2030K8063P2751
$$ -36400 -102916 -80828 -58242 -33113 51162 56123 19707 48411 -23032 -11002 17061 89812
9997H9812k5875j39488O904O8475N6110M1591j2630k5281o2198K7359L8056l9764
$$ 89812 63937 -75551 -68647 -172 55938 97529 84899 59618 -2580 24779 62835 23071
9985B3071l293J5267q6056l2417n3878N5207P4057n2756P9194J43508m8923m6772
$$ 23071 19778 35045 -51011 -83428 -137306 -82099 -8042 -60798 18396 161904 112981 66209
9973F6209L9018r467r9967o5082O4754L9473j8371n7623j14146K3612L3202N9912
$$ 66209 105227 95760 -4207 -69289 -4535 34938 16567 -41056 -155202 -131590 -98388 -38476
9961c8476l4504K4682J7025M6395J0811j1113o65M7370o3704l2353P357N5346
$$ -38476 -72980 -48298 -31273 15122 25933 14820 14155 61525 -2179 -34532 -27175 28171
9949B8171l8015J2324O0105m6112L5628O5421M314P5212m7631j96039k9658O6505
$$ 28171 -9844 2480 62585 16473 52101 117522 121836 197048 149417 -46622 -76280 -9775
9937i775O3078M5253n1891L8120m191k8396K0714L9432J4789n1291j08594L2670
$$ -9775 53303 98556 46665 84785 80594 52198 72912 112344 127133 75842 -32752 -82
9925h2O692q6704j0068P4770O3011J5541M5059J0474j2285o1793J1928K137Q3031
$$ -82 6610 -80094 -90162 -15392 47619 63160 108219 118693 106408 44615 56543 58680 141711
9912A41711Q3975l4940o1550m869j579K950p3272m8961k783O4448K6484K4292
$$ 141711 225686 190746 129196 124327 122748 125698 52426 3465 682 65130 91614 115906
9900A15906K094m0323n5410P4280L0568n6716J5129O9871l4953Q495q756O420
$$ 115906 118000 77677 22267 96547 127115 70399 85528 155399 120446 128941 120185 126605
9888A26605O9219O276n2765r7450k2802k6012K5595J7222k6027M6827N7077j6740
$$ 126605 195824 202100 149335 51885 29083 3071 28666 45888 19861 66688 123765 107025
9876A07025q7609j08570j658O182j0439l746k1773L0186K1877k0294R2471R1626
$$ 107025 19416 -89154 -90812 -84630 -95069 -98815 -120588 -90402 -68525 -88819 3652 95278
9864I5278P6265k7176j7549l1400j45838j32869L342J38599L2892j5108J0490
$$ 95278 171543 144367 126818 95418 -50420 -183289 -179947 -41348 -8456 -23564 -13074
9853a3074M3171K0674r616j3978k3417l789K5315n6400J8765J24653N5868R6131
$$ -13074 30097 50771 41155 27177 3760 -29 25286 -31114 -12349 112304 168172 264303
9841B64303j1787m0034o6765o6135l3855o2420m0889N4400K9161N2030k9571j24142
$$ 264303 252516 212482 145717 79582 45727 -16693 -57582 -3182 25979 78009 48438 -75704
9829g5704j7906K1545N8758M6352O043N8296l6605n4155J5739M6302n3136q3865
$$ -75704 -93610 -72065 -13307 33045 39088 97384 60779 6624 22363 68665 15529 -68336
9817f8336o9062l1588R2851P7660k1884k2737n4014L094N4078R2995o5783p4403
$$ -68336 -137398 -168986 -76135 1525 -20359 -43096 -97110 -94016 -39938 53057 -12726 -87129
9805h7129r673K5370Q982J0628K971j5967m904R8121P4912r796k0963P8608J4270
$$ -87129 -96802 -71432 -62450 -51822 -48851 -64818 -69722 28399 103311 93515 72552 151160 165430
9792A65430m1459k6021q077N6449k8909j4434K6262J4298K4484o4192r6614j9965
$$ 165430 123971 97950 89873 146322 117413 102979 129241 143539 168023 103831 7217 -12748
9780a2748J3742K0585M2556l8758m5269k4771q2020K7830N3317j1707N3994N2748
$$ -12748 994 21579 64135 25377 -19892 -44663 -126683 -98853 -45536 -57243 -3249 49499
9768D9499N8088L6011o6131j66623r577P9639o6468k7127P503Q594K1014p148
$$ 49499 107587 143598 77467 -89156 -98733 -19094 -85562 -112689 -105186 -96592 -75578 -82726
9756h2726N9964M5558P2442P9123K2651n229p0889q8627j6957j571K606l820K2447
$$ -82726 -22762 22796 95238 174361 197012 191783 120894 32267 15310 13739 16345 12525 34972
9743C4972L6580m8957N6341J9118m4813p5084R4793P9954N3166m0705j11991J0137
$$ 34972 71552 22595 78936 98054 53241 -21843 72950 152904 206070 165365 53374 63511
9731F3511J12766k4283O3M5954J5156L8566n509m4907p8091m1768m9314r6404
$$ 63511 176277 151994 152057 198011 213167 251733 246224 201317 123226 81458 32144 -64260
9719f4260N3989O4095J9269n8793P8658k2184j7993K2069q495P9513J0349j04319
$$ -64260 -10271 53824 73093 14300 92958 70774 52781 74850 66355 145868 156217 51898
9707E1898q5775l6466q746Q391J06490J2112l6661j7056M8404p13m316N8338j2893
$$ 51898 -33877 -70343 -79089 -70698 35792 47904 11243 -5813 42591 41878 37562 95900 83007
9694H3007r3364j041j0015j9591J3297p459J2704J15239K74m9779n5095j7487
$$ 83007 -10357 -11398 -21413 -41004 -27707 -35166 -22462 92777 93051 43272 -11823 -29310
9682b9310O2472M2224j060R769K7651J0376o9374p1443L1354P9583j6243l3034
$$ -29310 33162 75386 74326 84095 111746 122122 52748 -18695 12659 92242 75999 42965
9670D2965Q778K4011N3876n5808r258l1632k9192q0493M6282P7493M8349J7179
$$ 42965 51743 75754 129630 73822 64564 32932 3740 -76753 -30471 47022 95371 112550
9658A12550o6774P226M0375l6849K2119J7561k1648J3567J1975K207O3903L4063
$$ 112550 45776 53002 93377 56528 78647 96208 74560 88127 100102 102309 166212 200275
9646B00275m2197K6252Q4020n7675j92892m3592J6960K1054L0731J7631P7253
$$ 200275 158078 184330 268350 210675 17783 -25809 -8849 12205 42936 60567 137820
9635A37820j7492o7159l4104n3668L3635N8131m6696r433k7048L115l6491K1116
$$ 137820 120328 53169 19065 -34603 -968 57163 10467 1034 -26014 -22899 -59390 -38274
9623c8274P6493Q863l9423M1079l216L448N1813n9345q4369P7313L9268Q3480
$$ -38274 38219 47082 7659 48738 45522 48970 100783 41438 -42931 34382 73650 157130
9611A57130j0004p4844Q471j8783K1380K3903N1291L1486l9945k536N9702r9168
$$ 157130 147126 72282 80753 61970 83350 107253 158544 190030 150085 147549 207251 108083
9599A08083j10378p3597K3981j072J4968Q4842l5237l2201K4026J8274N0272o5788
$$ 108083 -2295 -75892 -51911 -52983 -38015 46827 11590 -20611 3415 21689 71961 6173
9587F173L0251N2236k0978N7315J9607j716q1452q2568K3089M6085K7565l3252
$$ 6173 36424 88660 67682 124997 144604 142888 61436 -21132 1957 48042 75607 42355
9575D2355k9117Q7788Q6142k3892o0682j930n9430M1031k3901n5751K8369K9155
$$ 42355 13238 101026 187168 163276 102594 100664 41234 82265 58364 2613 30982 60137
9563F0137p0349l0704o171k229L9026l2635k8870K0605o5698K3221N3508Q8582
$$ 60137 -10212 -40916 -47087 -49316 -10290 -42925 -71795 -51190 -116888 -93667 -40159 48423
9551D8423j4605j0058j2799N7689M6990j0311p488O5266L8201P536q5593k6240
$$ 48423 33818 23760 10961 68650 115640 105329 97841 163107 201308 208844 123251 97011
9539I7011N8169k6419r5576j80J1957k0805k0172K5770K3572L2284n4500K9902
$$ 97011 155180 128761 33185 33005 44962 24157 3985 29755 53327 85611 31111 61013
9527F1013q0260j258M5931M0033l586l2034N4061q210p1444O2472R8642J7474
$$ 61013 -19247 -20505 25426 65459 61873 29839 83900 75690 4246 66718 165360 182834
9515A82834l9167k9939J8298o0080j4862m6956m1070j5877N4771J9470k1546k0594
$$ 182834 143667 113728 132026 71946 57084 10128 -30942 -46819 7952 27422 5876 -14718
9503a4718J2634P0542L1015l3255m5454j483L1364n005l8765p2818J0317J00201
$$ -14718 -2084 68458 99473 66218 20764 19281 50645 45640 6875 -65943 -55626 44575
9491D4575N0463n8931p7593N4921Q3903K872m383Q1647o0333r3373N588N5786
$$ 44575 95038 36107 -41486 13435 97338 100210 95827 177474 117141 23768 29356 85142
9479H5142O1920o545J6708r1296o3384K7959l078r560K8375M1557P2759L4714
$$ 85142 147062 140517 157225 65929 2545 30504 27426 17866 46241 87798 160557 195271
9467A95271M8098l3196j22379l7050K6413O149K9774j4950m3416q7227j4129R1532
$$ 195271 243369 210173 87794 50744 77157 83306 113080 98130 54714 -32513 -46642 44890
9455D4890l772K6067j941J923m6215K7532K5561q8664j4996M9528K1311M2471
$$ 44890 41118 67185 65244 67167 20952 48484 74045 -14619 -29615 19913 41224 83695
9443H3695l0757n2587N3526j2731l9140J17370J0656j16138n9058k1497R9492
$$ 83695 52938 351 53877 41146 2006 119376 130032 13894 -45164 -66661 32831
9432C2831J6405k5556n8168M9223j1344k5377N3450M0000m6962N5623N9549R9629
$$ 32831 49236 23680 -34488 14735 3391 -21986 31464 71464 24502 80125 139674 239303
9420B39303L6199K0823r1004n1789L0979j2264M8987K5633j20590p3833J0767
$$ 239303 275502 296325 205321 153532 184511 172247 221234 246867 126277 52444 63211
9409F3211O9112k9117m1049q4040k0498M4892M4861Q1429M3284q3318j3861P2860
$$ 63211 132323 103206 62157 -21883 -42381 2511 47372 128801 172085 88767 74906 147766
9397A47766O7847K3134j15959L876R359j43366Q144Q3999j4530m3538n583J2399
$$ 147766 215613 238747 122788 126664 136023 -7343 801 84800 70270 26732 21149 33548
9385C3548M8629l0175O1251L2334j06495k5387j6519j8935L084l8451J6787M780
$$ 33548 82177 52002 113253 145587 39092 13705 -2814 -21749 -18665 -57116 -40329 -35549
9373c5549n7666N9772P0098M018J9096L8104j4727o1025N623N5306J4065n9376
$$ -35549 -93215 -33443 36655 40673 59769 97873 83146 22121 27744 83050 97115 37739
9361C7739J4628O1193M0222j4069j06854J9713N3991J2948K1774k156N603L7207
$$ 37739 52367 113560 153782 139713 32859 52572 106563 119511 141285 139129 144732 181939
9349A81939q9582j7040N123O623Q550P073k2067J2000k265j04489l0228J1357
$$ 181939 92357 75317 80440 87063 95613 102686 80619 92619 90354 -14135 -44363 -33006
9337c3006k1838J6254L2183L4018L6457k5314O8196M3430j5738k6797N917N6782
$$ -33006 -54844 -38590 -6407 27611 64068 38754 106950 150380 134642 107845 113762 170544
9325A70544J15132N7674j03604p6287o5243J8215R4305r232j11052l4840R2773
$$ 170544 285676 343350 239746 163459 98216 116431 210736 201504 90452 55612 148385
9314A48385n223j4574J0140J2183j0538K3861j8813J2163K1286M5028J06231O6596
$$ 148385 143162 128588 138728 150911 140373 164234 145421 157584 178870 223898 330129 396725
9302C96725K101J0099J36413J77256K19823M66374N37733N3263k74044m04030
$$ 396725 398826 408925 545338 722594 942417 1408791 1946524 1999787 1725743 1321713
9292A321713m46966k49528j72580j40063j35629p656O907L8400Q942K2174l476
$$ 1321713 874747 625219 452639 312576 176947 169291 176198 214598 223540 245714 242238
9281B42238j6169k4459J2358m3453K5061K7974K341J6688O8547L3895K4857r312
$$ 242238 226069 201610 213968 170515 195576 223550 225891 242579 311126 345021 369878 360566
9269C60566o1501O951R6853J36380R6854R4924J40651J39484K83128O62157J067351
$$ 360566 299065 306016 402869 539249 636103 731027 871678 1011162 1294290 1956447 3023798
9258C023798Q35743k85406p26599p60174o66679k99770j86523j58627j90181j61713
$$ 3023798 3859541 3574135 2847536 2087362 1420683 1120913 934390 775763 585582 423869
9248D23869L3692L9497n9995o2043K5129M8501m0752o8928n4389J2184L022M5276
$$ 423869 457561 497058 437063 375020 400149 448650 407898 338970 284581 296765 299787 345063
9236C45063j0190m0529l0152q9789K3080J20960J7713l7686l4988O0436M1123
$$ 345063 334873 294344 264192 174403 197483 318443 336156 298470 263482 323918 365041
9225C65041J02553J90273J93939K61414M45026L85993j33170l20996m39157l01653
$$ 365041 467594 657867 851806 1113220 1558246 1944239 1811069 1490073 1050916 749263
9215G49263j40724j01780q0791M888q7542m0584j3881k6560J5065j4839m8139
$$ 749263 608539 506759 425968 430856 343314 302730 288849 262289 277354 262515 214376
9204B14376N9604j0095j8765L2625n5293M2034m3015n1660k160P2378k504R404
$$ 214376 273980 263885 245120 277745 222452 264486 221471 169811 167651 240029 237525 246929
9192B46929j9978L9054L5921n0236j5870r537Q0519N8610j0553k246n5170m8670
$$ 246929 226951 266005 301926 251690 235820 226283 306802 365412 354859 352613 297443 248773
9180B48773m2260k5456k0401M241n5998N6304M8003L3930J684o6800P454J251
$$ 248773 206513 181057 160656 164897 108899 165203 213206 247136 248820 182020 189474 190725
9168A90725j2611R2963K1595J15765L3369o6608j31708j11744K2925J0812N9179
$$ 190725 178114 271077 292672 408437 441806 375198 243490 131746 154671 165483 224662
9157B24662P8764N0706K5131L9173O663j9166n4769p0795j12069k1080M8986N71
$$ 224662 303426 354132 379263 418436 425099 405933 351164 280369 168300 147220 196206 196777
9145A96777K0542Q6866O0035Q740j4130P4868Q8709P1636N565r9250q0481j8443
$$ 196777 217319 304185 364220 372960 358830 433698 522407 594043 599608 500358 419877 401434
$$ [...]
##END NTUPLES=NMR SPECTRUM
##END=
