##TITLE=Analysis number 329949
Compound Code cc 63709
Book Reference 464/184/1
Project Code adrs
Chemist Name chrisr
##JCAMPDX= 6.0         $$ Bruker NMR JCAMP-DX V2.0
##DATA TYPE= NMR SPECTRUM
##DATA CLASS= NTUPLES
##ORIGIN= Bruker BioSpin GmbH
##OWNER= nmr
$$ XWIN-NMR		Version 3.5
$$ Mon Oct 15 12:19:16 2007 GMT Daylight Time (UT+1h)  MAYBRIDGE\nmr@NMR_250MHZ
##.OBSERVE FREQUENCY= 250.131544655141
##.OBSERVE NUCLEUS= ^1H
##.ACQUISITION MODE= SIMULTANEOUS (DQD)
##.ACQUISITION SCHEME= undefined
##.AVERAGES= 16
##.DIGITISER RES= 18
##SPECTROMETER/DATA SYSTEM= dpx250
##.PULSE SEQUENCE= zg30
##.SOLVENT NAME= CDCl3
##.SHIFT REFERENCE= (INTERNAL, CDCl3, 0, 16.522)
##AUDIT TRAIL= $$ (NUMBER, WHEN, WHO, WHERE, WHAT)
$$ ##TITLE= Audit trail, XWIN-NMR		Version 3.5
$$ ##JCAMPDX= 5.01
$$ ##ORIGIN= Bruker BioSpin GmbH
$$ ##OWNER= nmr
$$ C:\u/data/dgb/nmr/ADRS/730/pdata/1/auditp.txt
$$ ##AUDIT TRAIL=  $$ (NUMBER, WHEN, WHO, WHERE, WHAT)
(   1,<2007-10-15 12:18:45.91 +100>,<MAYBRIDGE\nmr>,<NMR_250MHZ>,
      <created by zg, POWCHK disabled, PULCHK disabled
       configuration hash MD5:
       76 6E 9A 78 1E 09 19 81 EC 84 63 8F B0 6A 59 2D
       data hash MD5: 64K
       C8 A9 17 9E CC 71 77 F7 B4 FC 1A CC CB 9B 73 62>)
(   2,<2007-10-15 12:19:00.43 +100>,<MAYBRIDGE\nmr>,<NMR_250MHZ>,
      <Start of raw data processing
       ef LB = 0.3 FT_mod = 6 PKNL = 1 SI = 32K 
       data hash MD5: 32K
       3F CC A5 73 A5 02 13 68 4E 07 00 40 C0 79 01 B8>)
(   3,<2007-10-15 12:19:02.02 +100>,<MAYBRIDGE\nmr>,<NMR_250MHZ>,
      <apk 
       data hash MD5: 32K
       FC E5 63 04 81 7E 1D 08 63 8B 79 1D E7 C8 13 E1>)
(   4,<2007-10-15 12:19:02.82 +100>,<MAYBRIDGE\nmr>,<NMR_250MHZ>,
      <abs ABSG = 5 
       data hash MD5: 32K
       39 8A 1A 6D 64 2A 7D E4 EF 9F 74 3D F4 99 19 AF>)
$$ ##END=
$$ 
$$ hash MD5
$$ E0 C3 DB D8 48 B0 9E F8 B5 1A 34 88 B5 02 D4 E8
##$RELAX= 
##$RELAX= 
##$RELAX= 
##$RELAX= 
##$RELAX= 
##$RELAX= 
##$RELAX= 
$$ Bruker specific parameters
$$ --------------------------
##$DU= <C:\u>
##$EXPNO= 730
##$NAME= <ADRS>
##$PROCNO= 1
##$TYPE= <nmr>
##$USER= <dgb>
##$AMP= (0..31)
100 100 100 100 100 100 100 100 100 100 100 100 100 100 100 100 100 100 
100 100 100 100 100 100 100 100 100 100 100 100 100 100 
##$AQSEQ= 0
##$AQ_mod= 3
##$AUNM= <au_zg>
##$AUTOPOS= <17 >
##$BF1= 250.13
##$BF2= 250.13
##$BF3= 250.13
##$BF4= 250.13
##$BF5= 500.13
##$BF6= 500.13
##$BF7= 500.13
##$BF8= 500.13
##$BYTORDA= 1
##$CFDGTYP= 0
##$CFRGTYP= 5
##$CHEMSTR= <none>
##$CNST= (0..31)
1 1 145 1 1 1 1 1 1 1 1 1 1 1 1 1 1 1 1 1 1 1 1 1 1 1 1 1 1 1 1 1 
##$CPDPRG= <>
##$CPDPRG1= <>
##$CPDPRG2= <>
##$CPDPRG3= <>
##$CPDPRG4= <mlev>
##$CPDPRG5= <mlev>
##$CPDPRG6= <mlev>
##$CPDPRG7= <mlev>
##$CPDPRG8= <mlev>
##$CPDPRGB= <>
##$CPDPRGT= <>
##$D= (0..31)
0 1 0 0 0 0 0 0 0 0.06 0 0 0 0 0 0 0.0002 0 0 0 0 0 0 0 0 0 0 0 0 0 0 
0 
##$DATE= 1192447125
##$DBL= (0..7)
120 120 120 120 120 120 120 120 
##$DBP= (0..7)
150 150 150 150 150 150 150 150 
##$DBP07= 0
##$DBPNAM0= <>
##$DBPNAM1= <>
$$ [...]
##$SUBNAM7= <"">
##$SUBNAM8= <"">
##$SUBNAM9= <"">
##$SW= 20.6930455092707
##$SWIBOX= (0..15)
0 0 3 0 0 0 0 0 0 0 0 0 0 0 0 0 
##$SW_h= 5175.983436853
##$TD= 65536
##$TD0= 1
##$TE= 296.16
##$TE2= 300
##$TE3= 300
##$TEG= 300
##$TL= (0..7)
0 120 120 120 120 120 120 120 
##$TP= (0..7)
150 150 150 150 150 150 150 150 
##$TP07= 0
##$TPNAME0= <>
##$TPNAME1= <>
##$TPNAME2= <>
##$TPNAME3= <>
##$TPNAME4= <>
##$TPNAME5= <>
##$TPNAME6= <>
##$TPNAME7= <>
##$TPOAL= (0..7)
0.5 0.5 0.5 0.5 0.5 0.5 0.5 0.5 
##$TPOFFS= (0..7)
0 0 0 0 0 0 0 0 
##$TUNHIN= 0
##$TUNHOUT= 0
##$TUNXOUT= 0
##$USERA1= <user>
##$USERA2= <user>
##$USERA3= <user>
##$USERA4= <user>
##$USERA5= <user>
##$V9= 5
##$VALIST= <valist>
##$VCLIST= <CCCCCCCCCCCCCCC>
##$VD= 0
##$VDLIST= <DDDDDDDDDDDDDDD>
##$VPLIST= <PPPPPPPPPPPPPPP>
##$VTLIST= <TTTTTTTTTTTTTTT>
##$WBST= 1024
##$WBSW= 4
##$XGAIN= (0..3)
0 0 0 0 
##$XL= 0
##$YL= 0
##$YMAX_a= 452084
##$YMIN_a= -564225
##$ZGOPTNS= <>
##$ZL1= 120
##$ZL2= 120
##$ZL3= 120
##$ZL4= 120
##$ABSF1= 16.522
##$ABSF2= -4.171173
##$ABSG= 5
##$ABSL= 3
##$ALPHA= 0
##$AQORDER= 0
##$ASSFAC= 0
##$ASSFACI= 0
##$ASSFACX= 0
##$ASSWID= 0
##$AUNMP= <proc_1d>
##$AZFE= 0.1
##$AZFW= 0.1
##$BCFW= 0
##$BC_mod= 0
##$BYTORDP= 0
##$COROFFS= 0
##$CY= 12.5
##$DATMOD= 1
##$DC= 0
##$DFILT= <>
##$DTYPP= 0
##$F1P= 14.0000005364418
##$F2P= -0.99999901652339
##$FCOR= 0.5
##$FTSIZE= 32768
##$FT_mod= 6
##$GAMMA= 0
##$GB= 0
##$INTBC= 1
##$INTSCL= 1
##$ISEN= 128
##$LB= 0.3
##$LEV0= 0
##$LPBIN= 0
##$MAXI= 10000
##$MC2= 0
##$MEAN= 0
##$ME_mod= 0
##$MI= 0
##$NCOEF= 0
##$NC_proc= -4
##$NLEV= 6
##$NOISF1= 0
##$NOISF2= 0
##$NSP= 0
##$NTH_PI= 0
##$NZP= 0
##$OFFSET= 16.522
##$PC= 1
##$PHC0= 155.5823
##$PHC1= 5.696266
##$PH_mod= 1
##$PKNL= yes
##$PPARMOD= 0
##$PSCAL= 4
##$PSIGN= 0
##$REVERSE= no
##$SF= 250.13
##$SI= 32768
##$SIGF1= 0
##$SIGF2= 0
##$SINO= 400
##$SIOLD= 32768
##$SREGLST= <1H.CDCl3>
##$SSB= 0
##$STSI= 32768
##$STSR= 0
##$SW_p= 5175.98343685301
##$SYMM= 0
##$S_DEV= 0
##$TDeff= 65536
##$TDoff= 0
##$TI= <Analysis number 999999
Compound Code 99
Book Reference 9
Project Code 9>
##$TILT= no
##$TM1= 0
##$TM2= 0
##$TOPLEV= 0
##$USERP1= <user>
##$USERP2= <user>
##$USERP3= <user>
##$USERP4= <user>
##$USERP5= <user>
##$WDW= 1
##$XDIM= 32768
##$YMAX_p= 343703654
##$YMIN_p= -428178
$$ End of Bruker specific parameters
$$ ---------------------------------
##NTUPLES= NMR SPECTRUM
##VAR_NAME=  FREQUENCY,     SPECTRUM/REAL,   SPECTRUM/IMAG
##SYMBOL=    X,             R,               I
##VAR_TYPE=  INDEPENDENT,   DEPENDENT,       DEPENDENT
##VAR_FORM=  AFFN,          ASDF,            ASDF
##VAR_DIM=   32768,         32768,           32768
##UNITS=     HZ,            ARBITRARY UNITS, ARBITRARY UNITS
##FACTOR=    0.157963299565203, 1,           1
##FIRST=     4132.6476996994, 0,             0
##LAST=      -1043.33573715361, 0,           0
##MIN=       -1043.33573715361, -428178,     0
##MAX=       4132.6476996994, 343703654,     0
$$ Real data points
##PAGE= N=1
##DATA TABLE= (X++(R..R)), XYDATA
$$ [...]
$$ plain form
20177 -94912 -52169 21557 25855 40975 11678 12582 69759 82821 114489 116690 70673 8326
20165 8326 -40673 -85861 -99266 -98705 -18904 36850 41706 2087 -33202 -62051 -54984 3050 5787
20152 5787 802 -1459 -21191 34387 49106 -758 -49923 -25759 -24810 -352 45027 -7898 -19411
20139 -19411 -81225 -93008 -124379 -124970 -70090 8005 83075 89936 -1211 -40700 -52096 -46020
20127 -46020 -61907 -73598 -4140 34826 -32660 -12272 6701 34290 -1619 -96867 -64209 24321
20115 24321 1351 -3327 27319 22996 -5877 -50172 -99544 -113426 -43689 28078 58728 57311
20103 57311 46734 21492 22931 75497 80088 108611 52834 24247 336 27995 49763 21344
20091 21344 42513 -15503 -13871 29451 30205 15713 48001 -1316 -77852 -135917 -105811 -63003
$$ packed form
20177i4912M2743P3726M298J5120k9297R04N7177J3062L1668K201m6017o2347
20165H326m8999m5188j3405N61P9801N5754M856l9619l5289k8849P067N8034K737
20152E787m985k261j9732N5578J4719m9864m9165K4164R49K4458M5379n2925j1513
20139a9411o1814j1783l1371n91N4880P8095P5070O861r1147l9489j1396O076
20127d6020j5887j1691O9458L8966o7486K0388J8973K7589l5909r5248L2658Q8530
20115B4321k2970m678L0646m323k8873m4295m9372j3882O9737P1767L0650j417
20103E7311j0577k5242J439N2566M591K8523n5777k8587k3911K7659K1768k8419
20091B1344K1169n8016J632M3322P54j4492L2288m9317p6536n8065L0106M2808
$$ plain form
20079 -63003 -392 -17538 -52293 -4152 30340 17280 -339 61 -7058 18841 49296 36505
20067 36505 41504 34427 -5671 -28830 -93211 -80311 -31380 -37819 -21902 -37453 -92833 -91164
20055 -91164 -70076 -54839 -72945 -85433 -90419 -79820 -47451 -30241 -8916 36041 24450 -12260
20043 -12260 22935 25559 22369 -2749 -28528 -12450 26533 60766 51283 -22884 -52602 -61960
20031 -61960 -41446 -1040 12225 73189 56352 17648 -51576 -68730 -35949 -69149 -76469 -50457
20019 -50457 -5654 -10732 54213 8837 -4701 30213 -2063 -34134 10412 21386 35714 6961
20007 6961 9921 64516 46546 34004 18689 -4700 -12553 -17908 6533 75741 84381 48158 -5869
19994 -5869 6859 26229 45310 34977 -68480 -107767 -79514 -67406 -33304 -33876 -1307 29473
$$ packed form
20079f3003O2611j7146l4755M8141L4492j3060j7619M00p119K5899L0455j2791
20067C6505M999p077m0098k3159o4381J2900M8931o439J5917j5551n5380J669
20055i1164K1088J5237j8106j2488m986J0599L2369J7210K1325M4957j1591l6710
20043a2260L5195K624l190k5118k5779J6078L8983L4233r483p4167k9718r358
20031f1960K0514M0406J3265O0964j6837l8704o9224j7154L2781l3200p320K6012
20019e0457M4803n078O4945m5376j3538L4914l2276l2071M4546J0974J4328k8753
20007F961K960N4595j7970j2542j5315k3389p853n355K4441O9208Q640l6223n4027
19994e869J2728J9370J9081j0333j03457l9287K8253J2108L4102n72L2569L0780
$$ plain form
19982 29473 58239 15306 -35014 -23951 -7606 38710 31641 17008 -41925 -41424 -34471 -4914
19970 -4914 30389 3578 -5155 5718 -48119 -31872 -2717 11459 21374 25649 30918 28512 1024
19957 1024 -10908 21556 -30704 -76650 -122603 -114137 -44657 11417 71620 53909 54759 37106
19945 37106 -1777 15023 9939 -8990 34870 23515 16747 47637 -33723 -69850 -66155 -12598
19933 -12598 99024 94194 50773 112093 80295 24236 14765 -11736 -9773 -33040 -56059 24446
19921 24446 33352 -41119 -30403 43699 29196 -6699 24368 33183 2395 2937 18848 -30033
19909 -30033 17493 81076 56194 5257 8822 39536 44911 55892 16557 10896 28863 12098
19897 12098 10494 35378 110723 47952 56847 88671 24563 -37536 -33121 -51069 -8227 -31355
$$ packed form
19982B9473K8766m2933n0320J1063J6345M6316p069j4633n8933N01O953K9557
19970d914L5303k6811q733J0873n3837J6247K9155J4176R915M275N269k406k7488
19957A024j1932L2464n2260m5946m5953Q466O9480N6074O0203j7711Q50j7653
19945C7106l8883J6800n084j8929M3860j1355o768L0890q1360l6127L695N3557
19933a2598J11622m830m3421O1320l1798n6059r471k6501J963k3267k3019Q0505
19921B4446Q906p4471J0716P4102j4503l5895L1067Q815l0788N42J5911m8881
19909c0033M7526O3583k4882n0937L565L0714N375J0981l9335n661J7967j6765
19897A2098j604K4884P5345o2771Q895L1824o4108o2099M415j7948M2842k3128
$$ plain form
19885 -31355 -24315 -6165 41628 61826 69674 122935 33891 34038 45919 -7036 -4957 32997 18740
19872 18740 -41580 -72846 -61896 -724 46249 12352 -10565 -7287 -47689 -77560 -59914 -64209
19860 -64209 -53735 -8095 18211 -16651 -26152 -32957 -32714 30310 58550 70304 26908 28166 9188
19847 9188 -16878 687 -1694 5742 -18577 -84355 -70177 -123358 -109010 -83314 -58023 -20706
19835 -20706 -47942 -59999 4964 50085 48103 31128 15502 -37278 -34967 23794 20332 26455
19823 26455 23592 73543 71015 36701 13820 -13893 29322 52329 -14772 -37551 -19083 -15493
19811 -15493 -30798 -17126 -57905 -47621 -17482 -4580 -8018 2530 -35317 -56060 4379 38858
19799 38858 28949 7726 -2373 11160 6660 -20637 -39925 -58885 -72520 -48979 -45291 -91081
$$ packed form
19885c1355P040J8150M7793K0198P848N3261q9044J47J1881n2955K079L7954j4257
19872A8740o0320l1266J0950O1172M6973l3897k2917L278m0402k9871J7646m295
19860f4209J0474M5640K6306l4862r501o805K43O3024K8240J1754m3396J258j8978
19847I188k6066J7565k381P436k4319o5778J4178n3181J4348K5696K5291L7317
19835b0706k7236j2057O4963M5121j982j6975j5626n2780K311N8761l462O123
19823B6455k863M9951k528l4314k2881k7713M3215K3007o7101k2779J8468L590
19811a5493j5305J3672m0779J0284L0139J2902l438J0548l7847k0743O0439L4479
19799C8858r909k1223j0099J3533m500k7297j9288j8960j3635K3541L688m5790
$$ plain form
19787 -91081 -48723 -44777 -69872 -125546 -170821 -126202 -74667 -82918 -121444 -124645 -41811 -8038
19775 -8038 -8220 -16237 -78021 -82564 -29530 -14887 -35414 -47782 -9179 -370 22388 19497 89024
19762 89024 142639 91268 61568 58087 15373 10001 32014 82270 77451 -13840 -56635 -40508
19750 -40508 -10493 10374 33598 -20166 14415 23979 58336 49529 55198 48358 39843 5033 -43358
19737 -43358 -14384 5657 24689 21737 -38480 -106543 -137883 -96643 -68638 -71682 -42033 31744
19725 31744 10626 -12935 -11074 -21553 9175 14383 31494 27802 8140 -4847 17499 -13252
19713 -13252 -19112 -62068 -15182 31900 31421 -36128 -25536 14202 64182 15348 -25421 29907
19701 29907 25885 9534 12620 21193 -42505 -56518 -81371 -69121 -36688 17258 58689 93152
$$ packed form
19787i1081M2358L946k5095n5674m5275M4619N1535q251l8526l201Q2834L3773
19775h038j82q017o1784m543N3034J4643k0527j2368L8603Q809K2758k891O9527
19762H9024N3615n1371k9700l481m2714n372K2013N0256m819r1291m2795J6127
19750d0508L0015K0867K3224n3764L4581R564L4357q807N669o840q515l4810m8391
19737d3358K8974K0041J9032k952o0217o8063l1340M1240K8005l044K9649P3777
19725C1744k1118k3561J861j0479L0728N208J7111l692j9662j2987K2346l0751
19713a3252n860m2956M6886M7082m79o7549J0592L9738M9980m8834m0769N5328
19701B9907m022j6351L086Q573o3698j4013k4853J2250L2433N3946M1431L4463
$$ plain form
19689 93152 92446 47812 62964 41468 68808 45347 51506 85942 89242 110870 54890 49850 71161
19676 71161 52120 63048 71824 102450 41179 -19835 -28027 -19184 -14665 -53977 -12267 -46350
19664 -46350 -22620 -19338 -37727 5713 33275 16424 -12753 7062 24629 -7095 -13007 47889
19652 47889 90307 89383 33380 -2939 14424 39524 41724 -19048 -32064 42524 68509 -22095
19640 -22095 -45853 -29013 -82870 -86349 -43301 -30779 -23274 -7851 -91693 -100407 -51666 18814
19628 18814 36452 -21835 -75275 -103224 -60174 -4821 47444 79640 69313 32845 1564 6036
19616 6036 5310 42641 70924 39102 32315 56108 47057 -8685 -55068 -13935 20883 36582 92011
19603 92011 129865 114891 102196 69658 36724 32077 26150 48109 30616 10004 -10083 -38513
$$ packed form
19689I3152p06m4634J5152k1496K7340k3461O159L4436L300K1628n5980n040K1311
19676G1161j9041J0928Q776L0626o1271o1014q192Q843M519l9312M1710l4083
19664d6350K3730L282j8389M3440K7562j6851k9177J9815J7567l1724n912O0896
19652D7889M2418r24n6003l6319J7363K5100K200o0772j3016P4588K5985r0604
19640b2095k3758J6840n3857l479M3048J2522P505J5423q3842q714M8741P0480
19628A8814J7638n8287n3440k7949M3050N5353N2265L2196j0327l6468l1281M472
19616F036p26L7331K8283l1822o787K3793r051n5742m6383M1133L4818J5699N5429
19603I2011L7854j4974j2695l2538l2934m647n927K1959j7493k0612k0087k8430
$$ plain form
19591 -38513 -53911 36582 49042 64659 42839 -42024 -115384 -147767 -121680 -99849 -104047 -75876
19579 -75876 -57440 -19740 13524 -39421 -44486 -43627 -58277 -70002 -73458 -26325 -28890 -23365 16603
19566 16603 14855 15186 8543 -28212 13611 56584 3071 20927 -3225 54267 32301 962
19554 962 68935 96551 127283 64718 76587 100747 74037 75102 79423 32058 -8076 -54993
19542 -54993 -53683 -79637 -37021 49244 51826 -1453 -45075 -38389 -34274 -9021 45697 8031
19530 8031 13201 1777 21383 568 1746 28919 71193 35092 -25475 -32017 -21000 -13540 4116
19517 4116 11122 -22910 -38140 -30163 -18388 6251 47772 22335 60017 81032 61905 60075
19505 60075 23589 57169 93700 101162 103620 79187 86148 98886 67344 4063 20285 98608
$$ packed form
19591c8513j5398R0493J2460J5617k1820q4863p3360l2383K6087K1831m198K8171
19579g5876J8436L7700L3264n2945n065Q59j4650j1725l456M7133k565N525L9968
19566A6603j748L31o643l6755M1823M2973n3513J7856k4152N7492k1966l1339
19554I62O7973K7616L0732o2565J1869K4160k6710J065M321m7365m0134m6917
19542e4993J310k5954M2616Q6265K582n3279m3622O686M115K5253N4718l7666
19530H031N170j1424J9606k0815J178K7173M2274l6101o0567o542J1017P460J7656
19517D116P006l4032j5230P977J1775K4639M1521k5437L7682K1015j9127j830
19505F0075l6486L3580L6531P462K458k4433O961J2738l1542o3281J6222P8323
$$ plain form
19493 98608 103508 88161 35906 51957 72153 72965 124246 98581 63275 77581 67803 95085
19481 95085 58795 61800 63275 -9175 -53404 -9307 -8526 -15093 -41099 -13795 2469 45129 71001
19468 71001 67912 67729 89067 139741 98042 116707 97092 54969 30366 19616 22167 -2529
19456 -2529 8751 -11374 -8322 -13851 -19527 46847 63016 35669 -7485 -6475 14254 17394 -28137
19443 -28137 -70953 -99365 -52435 -59739 -55844 -27507 -47902 -23921 16046 48412 91501 96996
19431 96996 114089 160785 118859 49671 10232 16555 44909 75462 91268 97779 105926 146233
19419 146233 133662 57201 57356 42287 -14786 -40869 7040 22341 5755 24173 42883 68352
19407 68352 110916 155278 114640 49137 33167 33140 30740 38825 -29950 -87390 -100378 -57344 -68763
$$ packed form
19493I8608M900j5347n2255J6051K0196Q12N1281k5665l5306J4306r778K7282
19481I5085l6290L005J475p2450m4229M4097P81o567k6006K7304J6264M2660K5872
19468G1001l089j83K1338N0674m1699J8665j9615m2123k4603j0750K551k4696
19456b529J1280k0125L052n529n676O6374J6169k7347m3154J010K0729L140m5531
19443b8137m2816k8412M6930p304L895K8337k0395K3981L9967L2366M3089N495
19431I6996J7093M6696m1926o9188l9439O323K8354L0553J5806O511Q147M0307
19419A46233j2571p6461J55j5069n7073k6083M7909J5301j6586J8418J8710K5469
19407F8352M2564M4362m0638o5503j5970k7k400Q085o8775n7440j2988M3034j1419
$$ plain form
19394 -68763 -134095 -100670 -54756 -89389 -75343 -23157 -4303 -50623 -74704 -31796 87204
19383 87204 147625 123573 102600 37419 -4055 -8624 7964 26822 8883 -9185 -60678 -31588
19371 -31588 6513 -32945 -84624 -40956 -52180 -31030 -1259 -14200 -52047 -49900 -63449 -140105
19359 -140105 -114090 -119421 -20181 41672 20424 -6173 -43306 20609 59534 114185 90461 85575
19347 85575 66774 22212 23225 73800 25584 -23779 -5827 -9516 -30753 -36766 15844 84136
19335 84136 103935 44143 40393 37452 31475 65965 100204 70615 47847 100258 192069 183567
19323 183567 140051 72658 24195 37374 39778 50178 82979 76815 33758 17168 90798 116725
19311 116725 107037 87325 52369 70051 109228 87722 44643 67803 85550 78588 95881 92810
$$ packed form
19394f8763o5332L3425M5914l4633J4046N2186J8854m6320k4081M2908J19000
19383H7204O0421k4052k0973o5181m1474m569J6588J8858j7939j8068n1493K9090
19371c1588L8101l9458n1679M3668j1224K1150K9771j2941l7847K147j3549p6656
19359a40105K6015n331R9240O1853k1248k6597l7133O3915L8925N4651k3724m886
19347H5575j8801m4562J013N0575m8216m9363J7952l689k1237o013N2610O8292
19335H4136J9799n9792l750k941n977L4490L4239k9589k2768N2411R1811q502
19323A83567m3516o7393m8463J3179K404J0400L2801o164m3057j6590P3630K5927
19311A16725r688j9712l4956J7682L9177k1506m3079K3160J7747o962J7293l071
$$ plain form
19299 92810 126150 162929 151524 149790 165864 125474 92722 66088 82134 45054 45582 57362
19287 57362 48424 74440 27455 -29321 -32396 -65449 -34905 61739 52819 -27889 -19812 -22826 -62356
19274 -62356 -51861 -82424 -75556 26752 52148 66713 65134 51814 69219 93989 24432 -11583
19262 -11583 -68710 -100599 -26793 22131 -16563 -58987 -6583 97374 125906 115818 90674
19251 90674 78516 44750 19514 -50640 -47934 -5836 -19982 -22296 13598 64359 118603 98838
19239 98838 59174 31737 29490 59707 74453 77287 64523 -19579 -50845 -28210 34889 85557
19227 85557 107524 53662 81829 110393 84154 37809 66725 106453 145118 149745 129231 70478
19215 70478 62405 76317 79252 56195 32755 18468 44054 11469 -42288 -85169 -154049 -105384
$$ packed form
19299I2810L3340L6779j1405j734J6074m0390l2752k6634J6046l7080N28J1780
19287E7362q938K6016m6985n6776l075l3053L0544R6644q920q0708Q077l014l9530
19274f2356J0495l0563O868J02308K5396J4565j579j3320J7405K4770o9557l6015
19262a1583n7127l1889P3806M8924l8694m2424N2404J03957K8532j0088k5144
19251I0674j2158l3766k5236p0154K706M2098j4146k314L5894N0761N4244j9765
19239I8838l9664k7437k247L0217J4746K834j2764q4102l1266K2635O3099N0668
19227H5557K1967n3862K8167K8564k6239m6345K8916L9728L8665M627k0514n8753
19215G0478q073J3912K935k3057k3440j4287K5586l2585n3757m2881o8880M8665
$$ plain form
19203 -105384 -72722 -58892 -41029 9126 -37746 -70116 -43267 -47258 -45391 5023 1166 30371
19191 30371 32217 32279 85348 131514 8692 -42129 22418 94764 147768 180676 160640 124177
19179 124177 117876 134928 145042 128968 93001 91108 110414 68442 61076 80754 80683 34067 -3924
19166 -3924 15916 72094 51112 54041 41382 39240 76455 46153 91990 76457 89393 83631
19154 83631 42917 10436 17462 14543 -3667 -19895 -49228 -37076 -34826 -48401 -44964 -59034
19142 -59034 -75694 -30854 136 -19526 -23928 -8602 76760 80161 35014 50040 21157 -40724
19130 -40724 -90760 -80020 -58369 -39172 -6096 10219 -53416 -72054 -28829 9251 -19780 -28413
19118 -28413 20573 598 -25077 -20537 16009 59428 63836 106126 137907 110998 57927 45286
$$ packed form
19203a05384L2662J3830J7863N0155m6872l2370K6849l991J867N0414l857K9205
19191C0371J846O2N3069M6166j22822n0821O4547P2346N3004L2908k0036l6463
19179A24177o301J7052J0114j6074l5967j893J9306m1972p366J9678p1m6616l7991
19166c924J9840N6178k0982K929j2659k142L7215l0302M5837j5533J2936n762
19154H3631m0714l2481P026k919j8210j6228k9333J2152K250j3575L437j4070
19142e9034j6660M4840L0990j9662m402J5326Q5362L401m5147J5026k8883o1881
19130d0724n0036J0740K1651J9197L3076J6315o3635j8638M3225L8080k9031q633
19118b8413M8986j9975k5675M540L6546M3419M408M2290L1781k6909n3071j2641
$$ plain form
19106 45286 122725 77015 4467 3845 28027 56117 103854 63083 8832 6312 -17545 -22641
19094 -22641 -1265 -8694 -8249 -36209 30825 16303 -12960 33669 66675 58735 70374 97069
19082 97069 22241 -6087 3922 -2227 -7268 -27357 -81520 -78490 -19861 11883 -29763 -14749
19070 -14749 -5650 -14356 30482 53840 81888 69988 33825 0 8548 13831 45842 103083
19058 103083 102478 70657 37621 3466 -30992 -37755 -17179 -26636 -29021 8003 29028 40753
19046 40753 52217 -4716 -31004 14870 -11729 -43845 -7978 -12523 17758 59496 18424 -37141
19034 -37141 -12145 21762 8179 33482 41388 40705 16036 41046 63542 64126 53957 86725 40658
19021 40658 50491 84699 75639 93347 84095 99309 94986 23514 8007 50381 101085 101014 111818
$$ packed form
19106D5286P7439m5710p2548o22K4182K8090M7737m0771n4251k520k3857n096
19094b2641K1376p429M45k7960O7034j4522k9263M6629L3006p940J1639K6695
19082I7069p4828k8328J0009o149n041k0089n4163L030N8629L1744m1646J5014
19070a4749R099q706M4838K3358K8048j1900l6163l3825Q548N283L2011N7241
19058A03083o05l1821l3036l4155l4458o763K0576r457k385L7024K1025J1725
19046D0753J1464n6933k6288M5874k6599l2116L5867m545L0281M1738m1072n5565
19034c7141K4996L3907j3583K5303P906o83k4669K5010K2496N84j0169L2768m6067
19021D0658R833L4208r060J7708r252J5214m323p1472j5507M2374N0704p1J0804
$$ plain form
19008 111818 78851 51332 10018 13651 23920 32718 15140 2146 -28819 -24391 -15965 -10243
18996 -10243 62971 101997 108534 116489 62061 33452 -2209 -17354 -4771 40196 129910 111622
18984 111622 49744 68425 121557 139134 166432 102992 50458 5565 19660 72117 93342
18973 93342 115336 150766 171776 52242 13958 43447 65790 48799 15265 23412 58848 9620
18961 9620 -80297 -41427 -32551 -19507 -41270 -29418 9760 46913 61488 33401 -7793 -2368
18949 -2368 55231 107233 79386 22357 -26715 17880 69925 128527 121154 131343 129753 204321
18937 204321 239256 284300 277545 301037 345375 356747 347897 360623 351605 369093 430759 464863
18925 464863 501320 462621 423702 398132 345024 331057 310600 344966 438127 442358 439719 476598
$$ packed form
19008A11818l2967k7519m1314L633J0269Q798j7578j2994l0965M428Q426N722
18996a0243P3214L9026O537P955n4428k8609l5661j5145J2583M4967Q9714j8288
18984A11622o1878J8681N3132J7577K7298o3440n2534m4893J4095N2457K1225
18973I3342K1994L5430K1010j19534l8284K9489K2343j6991l3534Q147L5436m9228
18961I620q9917L8870Q876J3044k1763J1852L9178L7153J4575k8087m1194N425
18949b368N7599N2002k7847n7029m9072M4595N2045N8602p373J0189j590P4568
18937B04321L4935M5044o755K3492M4338J1372q850J2726r018J7488O1666L4104
18925D64863L6457l8699l8919k5570n3108j3967k0457L4366R3161M231k639L6879
$$ plain form
18913 476598 496760 424652 435377 469490 456824 449913 441117 407135 404503 423717 357067 308332
18901 308332 222882 213278 167825 138762 104600 51787 85887 137996 141027 146318 151702 134558
18889 134558 154489 158377 186630 204300 227365 265515 207525 208120 272861 308083 308320 379380
18877 379380 444691 498461 528094 608330 686291 742904 791127 711513 715029 712063 657732 615799
18865 615799 583299 577144 557381 542276 516642 582803 574171 475518 465091 468815 361555 299778
18853 299778 370465 390290 439175 492274 469332 460599 497344 515910 506734 544245 609089 623401
18841 623401 622475 591336 601004 627215 645056 679055 684916 663471 591631 473464 386906 295787
18829 295787 217133 196173 158105 89582 128272 191729 245127 273856 282364 282442 236180 169429
$$ packed form
18913D76598K0162p2108J0725L4113j2666o911q796l3982k632J9214o6650m8735
18901C08332q5450r604m5453k9063l4162n2813L4100N2109L031N291N384j7144
18889A34558J9931L888K8253J7670K3065L8150n7990N95O4741L5222K37P1060
18877C79380O5311N3770K9633Q0236P7961N6613M8223p9614L516k966n4331m1933
18865F15799l2500o155j9763j5105k5634O6161q632r8653j0427L724j07260o1777
18853B99778P0687J9825M8885N3099k2942q733L6745J8566r176L7511O4844J4312
18841F23401r26l1139R668K6211J7841L3999N861k1445p1840j18167q6558r1119
18829B95787p8654k0960l8068o8523L8690O3457N3398K8729Q508P8m6262o6751
$$ plain form
18817 169429 149693 90980 56906 78669 27813 112757 168968 173142 204841 265090 276185 340393
18805 340393 384339 389074 396880 406867 433516 490605 559715 592324 609264 595816 619638 609817
18793 609817 594668 548079 528289 506748 503720 502528 535304 599864 661562 680347 644551 641671
18781 641671 626862 620452 577108 547551 434252 341803 312486 232507 190628 181557 209083 322985
18769 322985 470983 637396 775535 655177 494531 354155 281359 240615 209689 193876
18759 193876 145015 114951 149505 100065 80127 70400 83825 150442 93620 76936 100733 129175
18747 129175 191759 155682 154622 197950 226146 281510 278813 264771 204335 137567 142088 108717
18735 108717 68980 149223 181280 209268 279257 287100 267313 218534 241077 234579 298764 430625
$$ packed form
18817A69429j9736n8713l4074K1763n0856Q4944N6211M174L1699O0249J1095O4208
18805C40393M3946M735P806R987K6649N7089O9110L2609J6940j3448K3822r821
18793F09817j5149m6589j9790k1541l028j192L2776O4560O1698J8785l5796k880
18781F41671j4809o410m3344k9557j13299r2449k9317p9979m1879r071K7526J13902
18769C22985J47998J66413J38139j20358j60646j40376p2796m0744l0926j5813
18759A93876m8861l0064L4554m9440j9938r727J3425O6617n6822j6684K3797K8442
18747A29175O2584l6077j060M3328K8196N5364k697j4042o0436o6768M521l3371
18735A08717l9737Q0243L2057K7988O9989P843j9787m8779K2543o498O4185J31861
$$ plain form
18723 430625 446372 428074 406822 410070 424577 423674 327765 282453 340572 398560 384637 409304
18711 409304 439025 410811 316835 286762 297934 264769 230980 276316 313141 298687 222880
18700 222880 181617 201419 200229 183973 151744 106976 107513 191250 225395 264642 336866 273417
18688 273417 259727 170953 145252 162574 151071 248011 306096 348138 417718 408161 386484 403302
18676 403302 485456 597751 655335 641002 642299 624660 583754 561869 563769 596477 647154 663082
18664 663082 695243 627409 559956 528285 533796 537761 548964 578177 545604 512673 470084 441596
18652 441596 441821 445948 441426 437162 453911 402949 383872 412351 378817 322021 297511 269201
18640 269201 323166 374656 408867 440983 461675 478346 505598 529985 502566 440272 429088
$$ packed form
18723D30625J5747j8298k1252L248J4507r03r5909m5312N8119N7988j3923K4667
18711D09304K9721k8214r3976l0073J1172l3165l3789M5336L6825j4454p5807
18700B22880m1263J9802j190j6256l2229m4768N37Q3737L4145L9247P2224o3449
18688B73417j3690q8774k5701J7322j1503R6940N8085M2042O9580r557k1677J6818
18676D03302Q2154J12295N7584j4333J297j7639m0906k1885J900L2708N0677J5928
18664F63082L2161o7834o7453l1671N511L965J1203K9213l2573l2931m2589k8488
18652D41596K25M127m522m264J6749n0962j9077K8479l3534n6796k4510k8310
18640B69201N3965N1490L4211L2116K0692J6671K7252K4387k7419o2294j1184
$$ plain form
18629 429088 460242 463380 540422 615518 614679 585096 592696 680163 732212 665263 566821 476319
18617 476319 422724 429098 429352 393779 325844 381922 416325 408724 355449 331888 349788 315536
18605 315536 314429 299425 202831 138656 165881 204125 209242 184330 196886 261208 321166 309239
18593 309239 245411 201035 216375 289380 425427 473877 458235 394313 355995 360545 337027
18582 337027 331532 296062 238887 258603 275900 285336 227419 169798 115197 95732 180987 286147
18570 286147 316329 283281 281675 220344 175506 194215 177825 121192 131378 160369 197833 227670
18558 227670 213386 245066 254697 271357 285810 269562 254630 237132 252163 290343 320360 382250
18546 382250 425167 426761 372085 313435 319716 323044 331471 363204 360539 359031 324379 317709 332871
$$ packed form
18629D29088L1154L138P7042P5096q39k9583P600Q7467N2049o6949r8442r0502
18617D76319n3595O374K54l5573o7935N6078L4403p601n3275k3561J7900l4252
18605C15536j107j5004r6594o4175K7225L8244N117k4912J2556O4322N9958j1927
18593C09239o3828m4376J5340P3005J36047M8450j5642o3922l8318M550k3518
18582C37027n495l5470n7175J9716J7297R436n7917n7621n4601j9465Q5255J05160
18570B86147L0182l3048j606o1331m4838J8709j6390n6633J0186K8991L7464K9837
18558B27670j4284L1680R631J6660J4453j6248j4932j7498J5031L8180L0017O1890
18546C82250M2917J594n4676n8650O281L328Q427L1733k665j508l4652o670J5162
$$ plain form
18533 332871 340145 266069 257985 303758 319737 342671 334918 364520 386100 376945 403442 448476
18521 448476 423989 371884 319651 279189 307070 353396 420745 425202 365905 323909 358599 379325
18509 379325 370946 383438 428938 409142 444846 418270 410078 405294 401876 493530 498751 471629
18497 471629 503623 470241 487933 480388 507987 537100 566229 596910 633289 625120 692003 734864
18485 734864 677145 607515 609692 650276 713499 717337 651511 688651 721624 736137 766482 783200
18473 783200 796392 835868 878146 869882 865900 929703 964144 1027441 1100835 1186997 1276851 1346621
18461 1346621 1412520 1525753 1622398 1710213 1816610 1978056 2101425 2225925 2445074 2734416
18451 2734416 2962857 3254817 3547229 3921094 4343569 4883288 5618701 6547126 7587678
$$ packed form
18533C32871P274p4076q084M5773J5979K2934p753K9602K1580r155K6497M5034
18521D48476k4487n2105n2233m0462K7881M6326O7349M457n9297m1996L4690K0726
18509C79325q379J2492M5500j9796L5704k6576q192m784l418R1654N221k7122
18497D71629L1994l3382J7692p545K7599K9113K9129L0681L6379q169O6883M2861
18485G34864n7719o9630K177M0584O3223L838o5826L7140L2973J4513L0345J6718
18473G83200J3192L9476M2278q264l982O3803L4441O3297P3394Q6162Q9854O9770
18461A346621O5899J13233R6645Q7815J06397J61446J23369J24500K19149K89342
18451B734416K28441K91960K92412L73865M22475N39719P35413R28425J040552
$$ plain form
18442 7587678 8829883 10091629 11607291 13394532 15401345 17667840 20691868 24864117
18434 24864117 30286617 36359727 42569068 48868076 55092692 59641882 61234060 60251779
18426 60251779 57916092 54904727 51105172 46309782 41549905 37695197 34868008 32619091
18418 32619091 30811713 29578200 28721406 27561824 25711404 23380210 20854687 18306612
18410 18306612 15927364 13835903 12137849 10932366 10270505 10022071 10020464 10252944 10678574
18401 10678574 11364987 12399318 13868391 15794087 18451864 21968325 26354109 31372701
18393 31372701 36589198 41756856 46641140 50208627 51972728 52648100 53320178 54980018
18385 54980018 58845837 66366306 78534331 95634114 116902806 141446311 167442580
$$ packed form
18442G587678J242205J261746J515662J787241K006813K266495L024028M172249
18434B4864117N422500O073110O209341O299008O224616M549190J592178r82281
18426F0251779k335687l011365l799555m795390m759877l854708k827189k248917
18418C2619091j807378j233513q56794j159582j850420k331194k525523k548075
18410A8306612k379248k091461j698054j205483o61861k48434j607K32480M25630
18401A0678574O86413J034331J469073J925696K657777L516461M385784N018592
18393C1372701N216497N167658M884284L567487J764101O75372O72078J659840
18385E4980018L865819P520469J2168025J7099783K1268692K4543505K5996269
$$ plain form
18378 167442580 192147439 211145803 222193212 223820377 216636722 200817814 179259908
18371 179259908 155229856 132002697 111444870 94002541 78735258 65566058 54670925
18364 54670925 45582409 37990754 31909625 27324421 24173798 22178087 20985022 20229377
18356 20229377 19946501 20012138 20388429 21094227 22171080 23809465 26088987 29251051 33703708
18347 33703708 39874218 47670038 56629213 67127870 79729472 94023203 110190834
18340 110190834 128897402 149893031 172701223 194974094 212607309 222454258 223740995
18333 223740995 216051700 199512668 175802821 148708227 122141816 98279596 78498573
18326 78498573 63750487 54302531 49437754 47395579 46917907 47097429 46587912 44259361
$$ packed form
18378A67442580K4704859J8998364J1047409J627165p183655j5818908k1557906
18371A79259908k4030052k3227159k0557827j7442329j5267283j3169200j0895133
18364E4670925r088516p591655o081129m585204l150623j995711j193065p55645
18356B0229377k82876O5637L76291P05798J076853J638385K279522L162064M452657
18347C3703708O170510P795820Q959175J0498657J2601602J4293731J6167631
18340A10190834J8706568K0995629K2808192K2272871J7633215R846949J286737
18333B23740995p689295j6539032k3709847k7094594k6566411k3862220j9781023
18326G8498573j4748086r447956m864777k042175m77672J79522n09517k328551
$$ plain form
18318 44259361 40292735 35501795 30430202 25420884 20887095 17169670 14401795 12570811
18310 12570811 11344052 10495427 9938099 9663276 9561217 9620057 9986725 10736641 11818394
18301 11818394 13433516 15600816 18189437 20908614 23585798 26260650 28609765 30123200
18293 30123200 31131396 32158473 33772881 35702724 37948031 40997113 45363999 50339071
18285 50339071 54685165 57773827 60016764 61616136 61110627 57117237 50975622 44324558
18277 44324558 37760702 31301464 25311364 20469622 16979277 14499745 12624340 10993196
18269 10993196 9528760 8308103 7204871 6194979 5308118 4651886 4153617 3861345 3584857
18260 3584857 3366689 3167032 3049082 2903524 2805345 2722157 2691082 2680600 2706586 2807792
$$ packed form
18318D4259361l966626m790940n071593n009318m533789l717425k767875j830984
18310A2570811j226759q48625n57328k74823j02059N8840L66668P49916J081753
18301A1818394J615122K167300K588621K719177K677184K674852K349115J513435
18293C0123200J008196J027077J614408J929843K245307L049082M366886M975072
18285E0339071M346094L088662K242937J599372n05509l993390o141615o651064
18277D4324558o563856o459238n990100m841742l490345k479532j875405j631144
18269A0993196j464436j220657j103232j009892q86861o56232m98269k92272k76488
18260C584857k18168j99657j17950j45558r8179q3188l1075j0482K5986J01206
$$ plain form
18250 2807792 2936569 2994862 3003333 3003150 3035865 3155697 3390193 3784290 4344847 5205793 6121230
18239 6121230 6518466 6364482 5940083 5394800 5120883 5126678 5318661 5748198 6399945 7240624
18229 7240624 8464645 10268809 12828669 15574737 18166829 21514148 26790882 35712851
18221 35712851 48930997 61214895 67334028 68443253 61637969 52895643 46292492 41988488
18213 41988488 37561435 32849383 27876343 23254950 19736271 17475040 16592566 17398283
18205 17398283 19958447 23159023 23760938 21373630 17616638 13893881 11460007 10107613
18197 10107613 9515814 9541645 10089723 11123812 12072818 12353244 12158761 11894513 11859078
18188 11859078 12294385 13257959 14699937 16517224 18509089 20760943 23911045 28873192
$$ packed form
18250B807792J28777N8293Q471j83L2715J19832K34496L94097N60557Q60946R15437
18239F121230L97236j53984m24399n45283k73917N795J91983M29537O51747Q40679
18229G240624J224021J804164K559860K746068K592092L347319N276734Q921969
18221C5712851J3218146J2283898O119133J109225o805284q742326o603151m304004
18213D1988488m427053m712052m973040m621393l518679k261231q82474Q05717
18205A7398283K560164L200576O01915k387308l756992l722757k433874j352394
18197A0107613n91799K5831N48078J034089R49006K80426j94483k64248l5435
18188A1859078M35307R63574J441978J817287J991865K251854L150102M962147
$$ plain form
18180 28873192 36256321 46140483 57264652 67203026 76322464 83728734 87368206 89005177
18172 89005177 89013893 87844501 86987828 88752364 89491460 85952048 80639206 77787786 81292202
18163 81292202 93333599 107575368 113595584 106612163 87580265 65854912 47172704
18156 47172704 34545746 27028321 22591628 20016676 18824294 18933339 20188174 21350952
18148 21350952 20497203 18340152 15776668 13709597 12527194 12026129 11865319 12000180 12487902
18139 12487902 13520179 15239044 18099331 22349806 27359880 30412068 29901017 27232827
18131 27232827 24058842 22160919 21689697 22013745 22903745 24730856 28363380 34620121
18123 34620121 44079679 55190958 65129981 76280311 90718986 105394701 115799610
$$ packed form
18180B8873192P383129R884162J1124169R938374R119438P406270L639472J636971
18172H9005177Q716j169392q56673J764536P39096l539412n312842k851420L504416
18163H1292202J2041397J4241769O020216o983421j9031898k1725353j8682208
18156D7172704j2626958p517425m436693k574952j192382J09045J254835J162778
18148B1350952q53749k157051k563484k067071j182403n01065j60810J34861M87722
18139A2487902J032277J718865K860287M250475N010074L052188n11051k668190
18131B7232827l173985j897923m71222L24048Q90000J827111L632524O256741
18123C4620121R459558J1111279R939023J1150330J4438675J4675715J0404909
$$ plain form
18116 115799610 116630215 102513669 84394324 69121810 63533417 71419646 95032995
18109 95032995 121944477 116067814 92401266 62034461 39938275 29228581 24648230
18102 24648230 23117284 21558827 18558789 15017061 11416103 8700804 6973249 5835548
18094 5835548 5073267 4536043 4080453 3758296 3507717 3295644 3103294 2934098 2812938
18085 2812938 2605030 2425331 2206036 2011569 1892749 1788722 1569466 1415001 1359814 1307670
18075 1307670 1311363 1310955 1279118 1221764 1164805 1193903 1153992 1050855 1006625 971366 938594 990184
18063 990184 994762 914476 836279 812375 742280 690400 690710 705940 647420 653032 729044 717015
18051 717015 666494 584873 539308 537951 544953 468361 443854 488128 495577 471117 493337 537899
$$ packed form
18116A15799610Q30605j4116546j8119345j5272514n588393P886229K3613349
18109I5032995K6911482n876663k3666548l0366805k2096186j0709694m580351
18102B4648230j530946j558457l000038l541728l600958k715299j727555j137701
18094E835548p62281n37224m55590l22157k50579k12073j92350j69196j21160
18085B812938k07908j79699k19295j94467j18820j04027k19256j54465n5187n2144
18075A307670L693m08l1837n7354n6959K9098l9911j03137m4230l5259l2772N1590
18063I90184M578q0286p8197k3904p0095n1880L10J5230n8520N612P6012j2029
18051G17015n0521q1621m5565j357P002p6592k4507M4274P449k4460K2220M4562
$$ plain form
18039 537899 498374 470715 429006 437194 427923 435078 373027 358060 388567 429212 404501 361355
18027 361355 315344 347146 349240 394265 325366 299672 320637 373237 376518 366885 347326 244697
18015 244697 310708 349488 376766 399388 342179 280898 270057 267171 288656 300247 307180 328070
18003 328070 327976 263328 250646 282501 278880 248683 189936 166307 172855 165663 120179 181287 241523
17990 241523 228972 238158 210611 209959 243805 264411 207688 173746 225429 183984 147421 159940
17978 159940 229718 198996 193538 250125 296139 274060 254559 203169 159941 116619 147312 183807
17966 183807 149477 141281 174154 193609 217210 234319 221058 196398 157213 199365 239620 235143
17954 235143 221877 225665 244439 262473 279809 318188 384539 388191 392153 403564 386718 374650
$$ packed form
18039E37899l9525k7659m1709Q188r271P155o2051j4967L0507M0645k4711m3146
18027C61355m6011L1802K094M5025o8899k5694K0965N2600L281r633j9559j02629
18015B44697O6011L8780K7278K2622n7209o1281j0841k886K1485J1591O933K0890
18003C28070r4o4648j2682L1855l621l0197n8747k3629O548p192m5484O1108O0236
17990B41523j2551R186k7547o52L3846K0606n6723l3942N1683m1445l6563J2519
17978A59940O9778l0722n458N6587M6014k2079j9501n1390m3228m3322L0693L6495
17966A83807l4330q196L2873J9455K3601J7109j3261k4660l9185M2152M0255m477
17954B35143j3266L788J8774J8034J7336L8379O6351L652L962J1411j6846j2068
$$ plain form
17942 374650 328081 257746 198985 176611 187804 237888 257477 246399 236218 252136 242678 239374
17930 239374 306609 296160 363213 433509 431974 483696 507004 535120 571699 572632 566775 602222
17918 602222 647700 633897 580961 572099 614576 624431 663913 666698 623850 571133 563782 595502
17906 595502 577558 563984 517762 534833 591351 614079 656840 601577 523499 507463 485153
17895 485153 448615 398657 354558 302303 315852 358056 374949 373588 322190 323471 264504 225638
17883 225638 228538 240307 230049 257249 302306 297164 276873 303824 251253 273949 366372 383367
17871 383367 404818 487686 573383 624998 608746 619670 597509 573987 593800 618808 617551 601373
17859 601373 593389 587962 594722 617160 590963 566708 601410 633796 625974 610585 595627 605617
$$ packed form
17942C74650m6569p0335n8761k2374J1193N0084J9589j1078j0181J5918r458l304
17930B39374O7235j0449O7053P0296j535N1722K3308K8116L6579R33n857L5447
17918F02222M5478j3803n2936q862M2477R855L9482K785m2848n2717p351L1720
17906E95502j7944j3574m6222J7071N6518K2728M2761n5263p8078j6036k2310
17895D85153l6538m9958m4099n2255J3549M2204J6893j361n1398J281n8967l8866
17883B25638K900J1769j0258K7200M5057n142k0291K6951n2571K2696R2423J6995
17871C83367K1451Q2868Q5697N1615j6252J0924k2161k3522J9813K5008j257j6178
17859F01373p984n427O760K2438k6197k4255L4702L2386p822j5389j4958R990
$$ plain form
17847 605617 629345 648290 656432 649782 628903 672868 680024 701067 772080 823897 857987 802991
17835 802991 786348 761407 734407 681525 629719 616495 556790 447526 382108 368853 349153
17824 349153 318638 343886 367682 395144 361456 393351 375174 356835 339225 374739 383179 438870
17812 438870 496667 408970 375649 391498 407687 363087 385832 404785 394500 387340 473670 508228
17800 508228 512221 541776 515076 532919 630032 672122 673213 686965 710274 720715 678154 672621
17788 672621 630637 587173 579051 567322 603801 639444 667556 700315 727979 728897 735115 677968
17776 677968 648279 615370 663660 722811 663948 638497 603122 623808 630387 628443 647506 653590
17764 653590 677591 724477 679847 663273 641929 604915 589733 603560 593838 564352 628855 642443
$$ packed form
17847F05617K3728J8945Q142o650k0879M3965P156K1043P1013N1817L4090n4996
17835H02991j6643k4941k7000n2882n1806j3224n9705j09264o5418j3255j9700
17824C49153l0515K5248K3796K7462l3688L1895j8177j8339j7610L5514Q440N5691
17812D38870N7797q7697l3321J5849J6189m4600K2745J8953j0285p160Q6330L4558
17800E08228L993K9555k6700J7843R7113M2090J091J3752K3309J0441m2561n533
17788F72621m1984m3464q122j1729L6479L5643K8112L2759K7664R18O218n7147
17776F77968k9689l2909M8290N9151n8863k5451l5375K0686O579j944J9063O084
17764F53590K4001M6886m4630j6574k1344l7014j5182J3827r722k9486O4503J3588
$$ plain form
17752 642443 697676 724943 731840 746962 798930 822953 870557 930226 939404 934698 956330 997090
17740 997090 1019734 1066534 1097728 1144058 1253935 1392335 1494715 1567550 1616035 1785308 1970260
17729 1970260 2115388 2285215 2433317 2604148 2860521 3156005 3513629 3886425 4382616
17720 4382616 4943631 5416024 5990811 6615954 7315079 8143793 9155366 10651782 12887409
17711 12887409 16203185 20095771 23511006 25686384 26181506 25419127 24698846 24957625 26850795
17702 26850795 30832831 37007526 45047614 54774147 66010671 79268108 98040731 127462670
17694 127462670 168959063 213687135 247460465 256908609 238225972 201667335 160634553
17687 160634553 125862217 102239796 87779556 77851741 69674516 62131670 54792630
$$ packed form
17752F42443N5233K7267O897J5122N1968K4023M7604N9669R178m706K1632M0760
17740I97090K2644M6800L1194M6330J09877J38400J02380P2835M8485J69273J84952
17729A970260J45128J69827J48102J70831K56373K95484L57624L72796M96191
17720D382616N61015M72393N74787O25143O99125Q28714J011573J496416K235627
17711A2887409L315776L892586L415235K175378M95122p62379p20281K58779J893170
17702B6850795L982036O174695Q040088R726533J1236524J3257437J8772623K9421939
17694A27462670M1496393M4728072L3773330R448144j8682637l6558637m1032782
17687A60634553l4772336k3622421j4460240r927815q177225p542846p339040
$$ plain form
17680 54792630 48340973 43727381 41778325 42845856 45299179 45824885 42389144 36210832
17672 36210832 29526348 24195191 20827499 18863061 17772748 17138381 16673231 16331587
17664 16331587 16128171 16087056 16406931 17156357 18427345 20390574 23249383 27233003 32632527
17655 32632527 39189997 45547639 51529913 59492216 72061210 92426447 120533643 148810948
17647 148810948 168122980 175095693 164821245 146172545 131848893 128994961 136915010
17640 136915010 142481390 138278505 127538899 115143792 108757624 109967024 113114128 108668352
17632 108668352 93399923 73216590 54328653 41203512 33813608 29430203 25616528
17625 25616528 21900607 18385912 15444377 13338597 12158530 11752348 11947640 12753228
$$ packed form
17680E4792630o451657m613592j949056J067531K453323N25706l435741o178312
17672C6210832o684484n331157l367692j964438j090313o34367m65150l41644
17664A6331587k03416m1115L19875P49426J270988J963229K858809L983620N399524
17655C2632527O557470O357642N982274P962303J2568994K0365237K8107196K8277305
17647A48810948J9312032O972713j0274448j8648700j4323652k853932P920049
17640A36915010N566380m202885j0739606j2395107o386168J209400L147104m445776
17632A08668352j5268429k0183333j8887937j3125141p389904m383405l813675
17625B5616528l715921l514695k941535k105780j180067m06182J95292Q05588
$$ plain form
17617 12753228 13569955 13641602 12767659 11444819 10325309 9756730 9802791 10383822 11564508
17608 11564508 13697844 17421272 22736688 26591848 26390516 24347436 22096656 22215435
17600 22215435 25806556 31940322 35254990 32553419 26958591 20846261 17041283 16083117
17592 16083117 16821946 16721677 14497253 11433209 8282701 5975164 4541735 3650780
17584 3650780 3020441 2596500 2355346 2148042 1944468 1738580 1536175 1441763 1387894 1291315
17574 1291315 1322348 1364239 1336547 1208868 1053074 964160 940543 932286 905892 842700 800148
17563 800148 786868 767145 718907 707876 683024 656295 603997 575661 634871 634806 629551 592651
17551 592651 566980 592370 580905 536061 478962 479630 514134 479886 384609 373549 323746 281222
$$ packed form
17617A2753228Q16727P1647q73943j322840j119510n68579M6061N81031J180686
17608A1564508K133336L723428N315416L855160k01332k043080k250780J18779
17600B2215435L591121O133766L314668k701571n594828o112330l804978r58166
17592A6083117P38829j00269k224424l064044l150508k307537j433429q90955
17584C650780o30339m23941k41154k07304k03574k05888k02405r4412n3869r6579
17574A291315L1033M1891k7692j27679j55794q8914k3617q257k6394o3192m2552
17563H00148j3280j9723m8238j1031k4852k6729n2298k8336N9210o5n255l6900
17551E92651k5671K5390j1465m4844n7099O68L4504l4248r5277j1060m9803m2524
$$ plain form
17539 281222 320338 324740 274732 268850 298377 363844 354718 324258 302392 294384 292389 291500 301808
17526 301808 261515 233076 253370 314549 374491 365060 366107 378978 345035 329720 289329 269774
17514 269774 304925 321756 302386 255513 306760 316459 297806 304355 298062 269397 285025 222337
17502 222337 203741 183792 195343 220784 189313 171249 127613 89085 83260 125824 146781 105836
17490 105836 52230 53693 43793 34856 58930 101211 94294 105253 146772 130657 94228 95662
17478 95662 144189 210409 179593 121992 121232 117938 106390 87795 89731 64400 48001 18230
17466 18230 20001 42731 67572 3742 12653 78023 118001 77901 35145 49370 74378 39589
17454 39589 41907 19723 27917 37633 132596 165213 136461 159976 258235 371840 471374 592844
$$ packed form
17539B81222L9116M402n0008n882K9527O5467r126l0460k1866q008j995q89J0308
17526C01808m0293k8439K0294O1179N9942r431J047J2871l3943j5315m0391j9555
17514B69774L5151J6831j9370m6873N1247R699j8653O549o293k8665J5628o2688
17502B22337j8596j9949J1551K5441l1471j8064m3636l8528n825M2564K0957m0945
17490A05836n3606J463r900q937K4074M2281o917J0959M1519j6115l6429J434
17478I5662M8527O6220l0816n7601p60l294j1548j8595J936k5331j6399k9771
17466A8230J771K2730K4841o3830Q911O5370L9978m0100m2756J4225K5008l4789
17454C9589K318k2184Q194R716R4963L2617k8752K3515R8259J13605R9534J21470
$$ plain form
17442 592844 638778 567751 433012 311174 268432 218986 185444 140598 93337 45650 14678
17431 14678 -35162 15765 97474 101791 48997 28887 25905 56194 11575 -35563 -11039 41772
17419 41772 77590 93176 61376 -5416 -10280 34996 87066 95197 82680 47472 22321 9838
17407 9838 23116 -36719 -60915 -39614 -17238 59916 41583 -915 45820 66392 119480 137096
17395 137096 95943 24336 5174 7844 73162 154234 188247 157067 139893 115828 36229 -1889
17383 -1889 40677 52023 51905 117039 168651 166420 105949 119775 60431 20812 4695 11905 -26115
17370 -26115 -3473 -20353 -55869 -20662 17688 -25770 -87440 -91578 -59894 -24098 12318 26100
17358 26100 12350 8474 -50129 -73365 -37514 14982 38024 68959 50968 8173 -5791 -23132
$$ packed form
17442E92844M5934p1027j34739j21838m2742m9446l3542m4846m7261m7687l0972
17431A4678m9840N0927Q1709M317n2794k0110k982L0289m4619m7138K4524N2811
17419D1772L5818J5586l1800o6792m864M5276N2070Q131j2517l5208k5151j2483
17407I838J3278n9835k4196K1301K2376P7154j8333m2498M6735K0572N3088J7616
17395A37096m1153p1607j9162K670O5318Q1072L4013l1180j7174k4065p9599l8118
17383a889M2566J1346j18O5134N1612k231o0471J3826n9344l9619j6117P210l8020
17370b6115K2642j6880l5516L5207L8350m3458o1670m138L1684L5796L6416J3782
17358B6100j3750l876n8603k3236L5851N2496K3042L0935j7991m2795j3964j7341
$$ plain form
17346 -23132 -53117 -71356 -104072 -58361 -28806 772 -24539 -22565 -58380 -95336 -73398 -46941
17334 -46941 12205 18540 44886 4664 -23327 -52783 -38120 -13716 11388 -50223 -12113 -19760
17322 -19760 -47203 -9289 20907 -21953 -69801 -43991 -70429 -54438 -27740 -51196 -39997 -19707
17310 -19707 -57784 -28735 50802 41675 66811 62977 32624 40614 50534 54314 -11233 -20900 -1741
17297 -1741 56093 99489 91436 77598 90866 97881 65676 55625 44092 52888 61503 68726 55053
17284 55053 31934 -19111 -1189 13892 -51621 -55967 30919 48476 -18823 -51573 26088 26209
17272 26209 -58255 -98756 -38730 -9159 -4386 24591 39139 78026 153061 124767 62680 24646
17260 24646 36465 103598 119193 98462 9120 -46914 5132 73922 18068 -20663 -55580 -75273
$$ packed form
17346b3132k9985j8239l2716M5711K9555K9578k5311J974l5815l6956K1938K6457
17334d6941N9146O335K6346m0222k7991k9456J4663K4404K5104o1611L8110p647
17322a9760k7443L7914L0196m2860m7848K5810k6438J5991K6698k3456J1199K0290
17310a9707l8077K9049P9537r127K5136l834l0353P990R920L780o5547r667J9159
17297a741N7834M3396q053j3838J3268P015l2205j0051j1533Q796Q615P223j3673
17284E5053k3119n1045J7922J5081o5513m346Q6886J7557o7299l2750P7661J21
17272B6209q4464m0501O0026K9571M773K8977J4548L8887P5035k8294o2087l8034
17260B4646J1819O7133J5595k0731q9342n6034N2046O8790n5854l8731l4917j9693
$$ plain form
17248 -75273 -63468 -50528 -67273 -45839 -36935 10041 -65045 -123548 -87577 -23251 -826 -8442
17236 -8442 -192 -31057 -62592 -41582 6508 -34071 -75405 -51758 -51479 -71760 -24788 37444
17224 37444 61366 108972 94339 80506 66316 6627 -30266 -27979 -24786 -17067 -6270 -12536
17212 -12536 14402 24332 41070 110944 93046 77248 116861 151316 185432 231931 242440 204249
17200 204249 245761 299578 340326 460222 500267 503939 541055 476705 400728 387917 394357 450228
17188 450228 448907 457655 513370 475865 497861 532036 566717 552767 513125 446852 354584 376344
17176 376344 449424 448639 407003 379707 319991 209848 123913 138573 150783 159006 143168 102542
17164 102542 110479 131121 148254 114336 95861 86345 93327 107007 90646 98680 65653 96929
$$ packed form
17248g5273J1805J2940j6745K1434Q904M6976p5086n8503L5971O4326K2425p616
17236h442Q250l0865l1535K1010M8090m0579m1334K3647K79k0281M6972O2232
17224C7444K3922M7606j4633j3833j4190n9689l6893K287L193P719J0797o266
17212a2536K6938R930J6738O9874j7898j5798L9613L4455L4116M6499J0509l8191
17200B04249M1512N3817M0748J19896M0045L672L7116o4350p5977j2811O440N5871
17188D50228j321Q748N5715l7505K1996L4175L4681j3950l9642o6273r2268K1760
17176C76344P3080p85m1636k7296n9716j10143q5935J4660J2210Q223j5838m0626
17164A02542P937K0642J7133l3918j8475r516O982J3680j6361Q034l3027L1276
$$ plain form
17152 96929 124193 126739 213181 273393 307589 318131 346889 395265 456628 505611 513210 538162
17140 538162 533811 585600 592057 514702 538466 618109 650572 618761 624501 585112 506658 445754
17128 445754 474236 517746 549775 507290 389266 298242 281487 303092 351317 388596 360307
17117 360307 308094 212331 162202 130251 99694 69797 49066 1167 -36707 -58181 -83545
17106 -83545 -36023 -10648 42151 14166 7945 78786 96388 47693 38785 35846 40671 85997
17094 85997 106884 109026 51526 29530 79633 113023 152865 197307 248859 298771 269879 187974
17082 187974 135300 92216 64574 30031 -15029 -22078 46681 73678 64730 52980 36290 36440
17070 36440 -19229 -102112 -138732 -98385 -69921 -49197 -57660 -47131 -36465 -62388 -69093 -58461
$$ packed form
17152I6929K7264K546Q6442O0212L4196J0542K8758M8376O1363M8983P599K4952
17140E38162m351N1789O457p7355K3764P9643L2463l1811N740l9389p8454o0904
17128D45754K8482M3510L2029m2485j18024r1024j6755K1605M8225L7279k8289
17117C60307n2213r5763n0129l1951l0557k9897k0731m7899l7874k1474k5364
17106h3545M7522K5375N2799k7985o221P0841J7602m8695q908k939M825M5326
17094H5997K0887K142n7500k1996N0103L3390L9842M4442N1552M9912k8892q1905
17082A87974n2674m3084k7642l4543m5060p049O8759K6997q948j1750j6690J50
17070C6440n5669q2883l6620M0347K8464K0724q463J0529J0666k5923o705J0632
$$ plain form
17058 -58461 -28230 10275 26813 38725 32866 28562 14887 1761 -15578 9856 49695 18947
17046 18947 29242 6638 -5200 -8847 384 -52973 -74363 -20280 -57874 -85678 -96407 -34422
17034 -34422 34551 59543 42926 39058 70144 87522 64470 -8537 -2362 -16188 -34418 20173
17022 20173 36815 -2152 10577 22374 -17095 -71686 -42635 -9180 -13127 -26769 -19808 36058
17010 36058 -35337 -112025 -77296 -64118 -51291 -33517 -14776 18421 6300 -1272 -61534 -52461
16998 -52461 -24854 -14839 13 69629 147418 179337 152136 91661 20313 -39925 -97130 -148958
16986 -148958 -132852 -109918 -130933 -146576 -110958 -62484 -48621 -87820 -121575 -100115 -19551
16975 -19551 4499 -1748 -556 16221 -45857 -8403 -27100 -49085 17572 8574 6308 37593
$$ packed form
17058e8461L0231L8505J6538J1912n859m304j3675j3126j7339K5434L9839l0748
17046A8947J0295k2604j1838l647R231n3357k1390N4083l7594k7804j0729O1985
17034c4422O8973K4992j6617l868L1086J7378k3052p3007O175j3826j8230N4591
17022B0173J6642l8967J2729J1797l9469n4591K9051L3455l947j3642O961N5866
17010C6058p1395p6688L4729J3178J2827J7774J8741L3197j2121p572o0262R073
16998e2461K7607J0015J4852O9616P7789L1919k7201o0475p1348o0238n7205n1828
16986a48958J6106K2934k1015j5643L5618M8474J3863l9199l3755K1460Q0564
16975a9551K4050o247J192J6777o2078L7454j8697k1985O6657q998k266L1285
$$ plain form
16963 37593 51531 32608 -37385 -26778 7994 41530 61255 18484 16299 -13388 -74582 -48633
16951 -48633 7088 9996 51439 43015 37777 22084 -20722 -1575 419 1649 36901 36465 -30755
16938 -30755 -90140 -102617 -83914 -99699 -120291 -117122 -118617 -70829 -50695 51688 98383 102060
16926 102060 91045 76056 80860 80149 63941 34867 930 -46881 -1875 36335 40375 53651
16914 53651 67819 -8403 -4423 -9033 -43663 -59055 -82894 -37248 -91994 -134928 -80317 -42056
16902 -42056 -15991 -8922 14002 25237 64172 51993 -14340 -83939 -111282 -149801 -90704 -48939
16890 -48939 -66820 -54266 31025 27779 19140 -30487 -31192 -62459 -79174 -14750 31639 -31340
16878 -31340 -55993 -68144 -63045 -34052 -9680 -18315 7435 58397 90801 136950 116830 103685
$$ packed form
16963C7593J3938j8923o9993J0607L4772L3536J9725m2771k185k9687o1194K5949
16951d8633N5721K908M1443q424n238j5693m2806J9147J994J230L5252m36o7220
16938c0755n9385j2477J8703j5785k0592L169j495M7788K0134J02383M6695L677
16926A02060j1015j4989M804p11j6208k9074l3937m7811M5006L8210M040J3276
16914E3651J4168p6222L980m610l4630j5392k3839M5646n4746m2934N4611L8261
16902d2056K6065P069K2924J1235L8935j2179o6333o9599k7343l8519N9097M1765
16890d8939j7881J2554Q5291l246q639m9627p05l1267j6715O4424M6389o2979
16878c1340k4653j2151N099K8993K4372q635K5750N0962L2404M6149k0120j3145
$$ plain form
16866 103685 61602 -14098 -7540 -66516 -133989 -74945 11856 -6059 -12905 -3426 -48861 -21544
16854 -21544 -11158 -56669 -26864 42531 45966 -5819 -43824 -45450 21060 50419 54619 40236
16842 40236 50217 45655 88307 59024 34476 36822 -4837 -57783 -103817 -70480 16121 3004
16830 3004 -1553 17807 -34577 -32906 -36570 -4159 -7605 -31648 -36527 -82504 -82699 -94145 -41463
16817 -41463 7214 23397 100663 95355 43203 -6466 -42887 -48505 -51904 -39658 21646 45375
16805 45375 69355 111949 115219 81465 47649 38897 28534 46212 14035 -40021 -75088 -85194
16793 -85194 -28959 -26741 27890 -22438 -23548 -41537 -83273 -72421 -39822 -24485 -7438 -24858
16781 -24858 10032 82156 111316 71241 -60209 -68796 -58660 -79438 -29012 -24149 -12113 -14462
$$ packed form
16866A03685m2083p5700O558n8976o7473N9044Q6801j7915o846R479m5435K7317
16854b1544J0386m5511K9805O9395L435n1785l8005j626O6510K9359M200j4383
16842D0236R981m562M2652k9283k4548K346m1659n2946m6034L3337Q6601j3117
16830C004m557J9360n2384J671l664L2411l446k4043m879m5977j95j1446N2682
16817d1463M8677J6183P7266n308n2152m9669l6421n618l399J2246O1304K3729
16805D5375K3980M2594L270l3754l3816q752j0363J7678l2177n4056l5067j0106
16793h5194N6235K218N4631n0328j110j7989m1736J0852L2599J5337J7047j7420
16781b4858L4890P2124K9160m0075j31450q587J0136k0778N0426M863J2036k349
$$ plain form
16769 -14462 -42169 -68690 -85250 -49915 4669 -7092 -57872 -56529 -28423 -83337 -64709 -34685
16757 -34685 -54883 -43253 4611 -40388 -60277 -78610 -53990 -19842 39214 71092 84899 48220
16745 48220 13659 28654 -30828 -43504 -12659 -28639 -82009 -45609 -33449 -37160 3729 49876
16733 49876 76163 58690 4172 -12831 -16191 -15308 -45841 -11318 -23815 -6444 -22008 -49585
16721 -49585 -43390 -8566 -48326 -58933 -42795 -73697 -108243 -130449 -85569 -42655 13393 72949
16709 72949 59398 67912 -3483 -26650 -21156 -7649 -22827 -64857 -65460 -62033 -34665 -4577 -11980
16696 -11980 63764 82835 7253 -25449 -881 -18104 -46632 -10269 8968 -3564 -32502 -77403
16684 -77403 -104176 -56181 -4760 32020 -9611 -42922 -64422 -91912 -30572 -9 29903 54323
$$ packed form
16769a4462k7707k6521j6560L5335N4584j1761n0780J343K8106n4914J8628L0024
16757c4685k0198J1630M7864m4999j9889j8333K4620L4148N9056L1878J3807l6679
16745D8220l4561J4995n9482j2676L0845j5980n3370L6400J2160l711M0889M6147
16733D9876K6287j7473n4518j7003l360Q83l0533L4523j2497J7371j5564k7577
16721d9585O195L4824l9760j0607J6138l0902l4546k2206M4880M2914N6048N9556
16709G2949j3551Q514p1395k3167N494J3507j5178m2030o03L427K7368L0088p403
16696a1980P5744J9071p5582l2702K4568j7223k8528L6363J9237j2532k8938m4901
16684g7403k6773M7995N1421L6780m1631l3311k1500k7490O1340L0563K9912K4420
$$ plain form
16672 54323 82960 65691 50764 77223 57693 70666 72762 72094 61656 54562 22258 -7587
16660 -7587 -39395 -319 21257 81304 74679 26970 32563 48378 38685 24737 24330 -9987 21208
16647 21208 19096 -3164 -92577 -133663 -92457 -84411 -117120 -134956 -131060 -76368 -66236 -108815
16635 -108815 -126890 -134321 -81982 -68349 -105799 -152121 -139513 -122677 -66002 -24890 -33391 -18662
16623 -18662 -58773 1337 117756 142619 111286 81608 60246 41458 349 -33396 -41186 6164
16611 6164 16265 77989 71883 12110 -59901 -90937 -88622 -30028 -4659 15993 -32518 -19740
16599 -19740 -26136 -45675 -14920 -1627 -24999 -37180 5071 42527 22475 -4059 3772 -13494
16587 -13494 -62487 -92579 17898 90655 109878 33963 14269 62049 92055 24866 -22382
$$ packed form
16672E4323K8637j7269j4927K6459j9530J2973K096o68j0438p094l2304k9845
16660g587l1808L9076K1576O0047o625m7709N593J5815r693j3948m07l4317L1195
16647B1208k112k2260q9413m1086M1206Q046l2709j7836L896N4692J0132m2579
16635a08815j8075p431N2339J3633l7450m6322J2608J6836N6675M1112q501J4729
16623a8662m0111O0110J16419K4863l1333k9678k1362j8788m1109l3745p790M7350
16611F164J0101O1724o106n9773p2011l1036K315N8594K5369K0652m8511J2778
16599a9740o396j9539L0755J3293k3372j2181M2251L7456k0052k6534P831j7266
16587a3494m8993l0092J10477P2757J9223p5915j9694M7780L0006o7189m7248
$$ plain form
16576 -22382 -37023 -13368 -46948 -41077 -12789 -6421 40828 116864 99581 44126 1845 4965
16564 4965 8039 -6826 28381 70544 6077 -70156 -51671 -42569 -5059 21395 -21570 -73319
16552 -73319 -51749 -2587 -33732 -34001 -17440 -34737 -81153 -80854 -55288 -70723 -51507 1008
16540 1008 10444 -3367 -32187 22452 37607 33524 35210 29263 25055 60822 54340 -12003 -37406
16527 -37406 944 -6268 -41969 -28832 -11808 -26103 -2157 -30369 -63932 -27993 -13062 -79625
16515 -79625 -43386 -2369 31629 82279 68596 71798 67821 -10210 -52093 -100058 -24850 7272
16503 7272 25501 15933 -673 -37947 -67632 -114319 -64959 -54243 -36602 -3918 14363 66843
16491 66843 47144 38250 88632 57708 -3228 -5783 28643 87183 59456 76341 27235 6075
$$ packed form
16576b2382j4641K3655l3580N871K8288O368M7249P6036j7283n5455m2281L120
16564D965L074j4865L5207M2163o4467p6233J8485R102L7510K6454m2965n1749
16552g3319K1570M9162l1145k69J6561j7297m6416K99K5566j5435J9216N2515
16540A008R436j3811k8820N4639J5155m083J686n947m208L5767o482o6343k5403
16527c7406L8350p212l5701J3137J7024j4295K3946k8212l3563L5939J4931o6563
16515g9625L6239M1017L3998N0650j3683L202l977p8031m1883m7965P5208L2122
16503G272J8229r568j6606l7274k9685m6687M9360J0716J7641L2684J8281N2480
16491F6843j9699q894N0382l0924o0936k555L4426N8540k7727J6885m9106k1160
$$ plain form
16479 6075 -24775 -66398 -65138 -122545 -124009 -91031 -42784 -47861 -7681 -12108 4781 12920 19315
16466 19315 19413 28021 46339 -12410 -12876 -45088 -41303 -51421 -133176 -155042 -115116 -67691 15684
16453 15684 44010 11090 9974 -11401 -24035 -19312 -31838 -14126 -19402 -74623 -99728 -46786
16441 -46786 -50100 -49220 -25429 -43139 -54594 -56616 -33075 -26073 -12884 37414 75825 32035 27393
16428 27393 76331 27757 3651 27058 51711 23972 41882 47675 44125 18986 31581 24518
16416 24518 10900 -15113 -64454 -24574 86155 98086 56920 55246 17319 -13101 -18311 -54879
16404 -54879 -76313 -67364 -53714 -26516 -412 -58847 -68710 -74570 -91680 -111342 -77806 -25006
16392 -25006 22501 36485 18148 12115 11622 5994 -9256 -40997 -12916 25244 -18510 -39688
$$ packed form
16479F075l0850m1623J260n7407j464L2978M8247n077M0180m427J6889Q139O395
16466A9315R8Q608J8318n8749m66l2212L785j0118q1755k1866L9926M7425Q3375
16453A5684K8326l2920j116k1375j2634M723j2526J7712n276n5221k5105N2942
16441d6786l314Q80K3791j7710j1455k022K3541P002J3189N0298L8411m3790m642
16428B7393M8938m8574k4106K3407K4653k7739J7910N793l550k5139J2595p063
16416B4518j3618k6013m9341L9880J10729J1931m1166j674l7927l0420n210l6568
16404e4879k1434Q949J3650K7198K6104n8435r863n860j7110j9662L3536N2800
16392b5006M7507J3984j8337o033m93n628j5250l1741K8081L8160m3754k1178
$$ plain form
16380 -39688 -82451 -85027 -75367 -93689 -43444 -18224 25823 9089 -60269 -150606 -131120 -103616
16368 -103616 -90661 -125852 -132636 -90448 -24658 25343 11657 12016 -27199 -79574 -67699 -26300
16356 -26300 28166 26294 35397 74583 76182 27741 -42890 -52450 -71375 -48803 -31093 -16327
16344 -16327 -39677 -108057 -67434 -76992 -49380 -39660 -27269 9287 -18770 -34820 -27359 21399
16332 21399 7309 27934 4037 5100 14661 9329 11717 39215 73505 49908 44164 19487 -8720
16319 -8720 29692 47485 -23203 -77524 -149165 -140155 -89532 -72443 -24740 13236 21105 15450
16307 15450 10824 -22375 -44050 -2804 32750 47898 40743 21673 -22269 -70945 -116640 -85769
16295 -85769 -61878 -30021 -44620 -83397 -103236 -39543 -24768 25929 52579 58774 10408 447
$$ packed form
16380c9688m2763k576R660j8322N0245K5220M4047j6734o9358r0337J9486K7504
16368a03616J2955l5191o784M2188O5790N0001j3686L59l9215n2375J1875M1399
16356b6300N4466j872R103L9186J599m8441p0631r560j8925K2572J7710J4766
16344a6327k3350o8380M0623r558K7612R720J2391L6556k8057j6050P461M8758
16332B1399j4090K0625k3897J063R561n332K388K7498L4290k3597n744k4677k8207
16319h720L8412J7793p0688n4321p1641R010N0623J7089M7703L7976P869n655
16307A5450m626l3199k1675M1246L5554J5148p155j9070m3942m8676m5695L0871
16295h5769K3891L1857j4599l8777j9839O3693J4775N0697K6650O195m8366r961
$$ plain form
16283 447 10825 37862 -21400 -51584 -32037 13972 10587 -48319 -44825 -6518 -16247 21361 1995
16270 1995 -24687 36000 26286 27174 76960 91281 51097 78644 36630 -15993 27951 -3579
16258 -3579 -31643 5508 37528 1871 -31804 -79480 -56611 -3226 62065 26690 -1414 -1939
16246 -1939 -2655 -10272 -27656 -32824 -58081 -91048 -95283 -51928 -51722 -30039 7737 25598 -14452
16233 -14452 -61978 -56379 -35671 57492 94412 45607 -25563 -28534 2535 -16243 -603 51207
16221 51207 67854 90643 87490 -17730 -66146 -66176 -76249 -39036 15360 23140 26236 11426 -17331
16208 -17331 -21868 -101586 -106169 -88196 -52309 -16569 43582 30117 14820 -481 -26066 -68821
16196 -68821 -60615 -19311 11983 55188 46797 32410 40356 33538 20398 10491 -17438 -25196 -39207
$$ packed form
16283D47J0378K7037n9262l0184J9547M6009l385n8906L494L8307r729L7608j9366
16270A995k6682O0687r714Q88M9786J4321m0184K7547m2014n2623M3944l1530
16258c579k8064L7151L2020l5657l3675m7676K2869N3385O5291l5375k8104n25
16246a939p16p617j7384n168k5257l2967m235M3355K06K1683L7776J7861m0050
16233a4452m7526N599K0708R3163L6920m8805p1170k971L1069j8778J5640N1810
16221E1207J6647K2789l153j05220m8416l0j0073L7213N4396P780L096j4810k8757
16208a7331m537p9718m583J7973L5887L5740O0151j3465j5297j5301k5585m2755
16196f8821Q206M1304L1294M3205q391j4387P946o818j3140r907k7929p758j4011
$$ plain form
16183 -39207 -32032 30200 34328 15915 -17462 -38677 25520 37059 27575 17167 32553 26380
16171 26380 33092 17761 -21406 -46127 -23182 44774 71635 51567 10027 9137 25054 80023
16159 80023 91446 101080 42698 -18666 -35360 -10682 -24228 -101947 -83024 -44696 -27839 1345
16147 1345 -20808 -4622 6927 -19114 -17091 -21820 -36006 20891 43476 -2984 -60334 -71344
16135 -71344 -64066 -35490 -36475 15333 -19131 51981 119559 115968 68830 60818 61634 28088 -31077
16122 -31077 -55325 -97757 -86295 -54305 -61195 -74815 200 87212 87245 -14170 -37468 -25458
16110 -25458 -54837 -48453 -45146 -87070 -108422 -91804 -56322 -26750 -4469 -50767 -70620 -44645
16098 -44645 -10257 15086 33844 27675 96578 144511 188615 153918 30461 -46365 -39161 -32037
$$ packed form
16183c9207P175O2232M128j8413l3377k1215O4197J1539r484j0408J5386o173
16171B6380O712j5331l9167k4721K2945O7956K6861k0068m1540q90J5917N4969
16159H0023J1423R634n8382o1364j6694K4678j3546p7719J8923L8328J6857K9184
16147A345k2153J6186J1549k6041K023m729j4186N6897K2585m6460n7350j1010
16135g1344P278K8576r85N1808l4464P1112O7578l591m7138q012Q16l3546n9165
16122c1077k4248m2432J1462L1990o890j3620P5015Q7012L3j01415k3298J2010
16110b5458k9379O384L307m1924k1352J6618L5482K9572K2281m6298j9853K5975
16098d4645L4388K5343J8758o169O8903M7933M4104l4697j23457p6826P204P124
$$ plain form
16086 -32037 -18229 -18573 -12084 -4286 52126 102921 77105 40325 51906 70242 85180 57483
16074 57483 30782 33359 -36113 -1262 5572 -22303 -103821 -99299 -58895 -12721 -32261 -62804
16062 -62804 -55265 -12859 25614 26216 24899 -5995 -13251 -9564 15299 7893 -46814 -1562 46572
16049 46572 67280 40936 -17929 -2757 43138 3803 13429 38003 22375 -9694 -73794 -106567
16037 -106567 -68443 9062 11385 7814 2398 -41932 -49247 -3231 11749 7126 -32546 -80760
16025 -80760 -73300 -39282 -36511 20637 58304 85865 47738 14256 -33207 -40572 2362 43283
16013 43283 37919 7986 -22505 -853 8228 -21430 -33006 -29497 -2890 -33941 -64403 -62228
16001 -62228 -26944 -20601 -29081 -3184 27407 -11154 -29493 -28564 28730 -44657 -108807 -73691
$$ packed form
16086c2037J3808l44O489P798N6412N0795k5816l6780J1581J8336J4938k7697
16074E7483k6701K577o9472L4851O834k7875q1518M522M0404M6174j9540l0543
16062f2804P539M2406L8473O02j317l0894p256L687K4863p406n4707M5252M8134
16049D6572K0708k6344n8865J5172M5895l9335R626K4574j5628l2069o4100l2773
16037a06567L8124P7505K323l571n416m4330p315M6016J4980m623l9672m8214
16025h0760P460L4018K771N7148L7667K7561l8127l3482m7463p365M2934M0921
16013D3283n364k9933l0491K1652R081k9658j1576L509K6607l1051l0462K175
16001f2228L5284O343q480K5897L0591l8561j8339R29N7294p3387o4150L5116
$$ plain form
15989 -73691 -36346 -50015 -51168 -12950 -46069 16583 85234 52498 12613 -47157 -69667 -69611
15977 -69611 -16933 24224 8531 -34111 -51663 -33090 -28914 -2502 -22928 -31757 -44399 -23568
15965 -23568 49822 44724 -4447 -34462 -42143 -66503 -48834 -51561 -19508 -53705 -73933 -21654
15953 -21654 55112 56482 36499 -17662 -90611 -98837 -51676 -16670 10154 37667 93897 94224
15941 94224 39731 -20438 -102621 -103911 -90305 -68997 -111811 -107205 -72483 -82832 -117193 -76871
15929 -76871 -107023 -94736 -35919 30733 72709 25236 -62981 -42491 -43602 28991 21731 16317
15917 16317 18083 -5620 -40287 -35099 -16841 -6613 -41778 -67347 -56876 -68260 -90596 -47345
15905 -47345 -44904 -47924 50182 9940 -22135 6662 16931 7644 -19221 -37516 -1010 60751
$$ packed form
15989g3691L7345j3669j153L8218l3119O2652O8651l2736l9885n9770k2510N6
15977f9611N2678M1157j5693m2642j7552J8573M176K6412k0426q829j2642K0831
15965b3568P3390n098m9171l0015p681k4360J7669k727L2053l4197k0228N2279
15953b1654P6766J370j9983n4161p2949q226M7161L5006K6824K7513N6230L27
15941I4224n4493o0169q2183j290J3606K1308m2814M606L4722j0349l4361M0322
15929g6871l0152J2287N8817O6652M1976m7473q8217K0490j111P2593p260n414
15917A6317J766k3703l4667N188J8258J0228l5165k5569J0471j1384k2336M3251
15905d7345K441l020R8106m0242l2075K8797J0269r287k6865j8295L6506O1761
$$ plain form
15893 60751 77386 84161 93498 84262 36351 29767 17073 -28962 -24308 -22189 -39262 -18545 38083
15880 38083 71612 54023 79807 91018 36952 25847 45681 24389 59593 77746 26561 -15210
15868 -15210 -6153 48164 51963 22674 -22577 -54278 -32353 -6531 -475 -39623 -80834 -39130
15856 -39130 1951 -14778 -32243 -15982 -12951 6215 17088 35523 43586 26611 973 -4475
15844 -4475 67150 68355 14013 8006 -2551 59181 82721 75925 42620 20719 18314 -2137 18875
15831 18875 -25245 -85120 -85206 -82201 -99953 -67351 -20422 -12515 49904 27643 18434 2705 -33859
15818 -33859 -45956 23724 13207 32947 36156 10520 55820 74897 78534 77518 25272 12600
15806 12600 27702 49436 21425 41841 34013 -1485 -37792 -105931 -94866 -61987 -72948 -59737
$$ packed form
15893F0751J6635O775R337r236m7911o584j2694m6035M654K119j7073K0717N6628
15880C8083L3529j7589K5784J1211n4066j1105J9834k1292L5204J8153n1185m1771
15868a5210R057N4317L799k9289m5251l1701K1925K5822O056l9148m1211M1704
15856c9130M1081j6729j7465J6261L031J9166J0873J8435Q063j6975k5638n448
15844d475P1625J205n4342o007j0557O1732K3540o796l3305k1901k405k0451K1012
15831A8875m4120n9875q6L005j7752L2602M6929P907O2419k2261r209j5729l6564
15818c3859j2097O9680j0517J9740L209k5636M5300J9077L637j016n2246j2672
15806A2600J5102K1734k8011K0416p828l5498l6307o8139J1065L2879j0961J3211
$$ plain form
15794 -59737 -56586 -54111 -63657 -6304 -918 50640 45167 14403 -6689 -26118 -45095 -61780 -32728
15781 -32728 -28996 -52944 -51181 -58740 -17759 14646 -1260 -24351 -24651 37746 93958 62815 61166
15768 61166 29140 37254 84058 86488 53568 52268 35395 -29070 -56744 -72140 509 22595
15756 22595 16448 25981 58883 28099 -9558 57175 114595 146076 102501 -13150 -99145 -124870
15744 -124870 -147986 -88547 -7581 26343 25465 52023 106455 105052 115171 109912 105329 100357 95456
15731 95456 122357 149111 122788 63851 50285 -21392 18009 45601 11439 5937 2425 -21082
15719 -21082 -12496 57018 68501 10652 -9803 -8420 -15500 -2878 14165 21524 23357 79793 90822
15706 90822 130524 113541 86658 84255 84862 57558 90716 103625 60522 4151 40532 72120
$$ packed form
15794e9737L151K475r546N7353N386N1558n473l0764k1092j9429j8977j6685K9052
15781c2728L732k3948J763p559M0981L2405j5906k3091l00O2397N6212l1143j649
15768F1166l2026Q114M6804K430l2920j300j6873o4465k7674j5396P2649K2086
15756B2595o147R533L2902l0784l7657O6733N7420L1481m3575j15651q5995k5725
15744a24870k3116N9439Q0966L3924q78K6558N4432j403J0119n259m583m972m901
15731I5456K6901K6754k6323n8937j3566p1677L9401K7592l4162n502l512k3507
15719b1082Q586O9514J1483n7849k0455J383p080J2622J7043P359J833N6436J1029
15706I0822L9702j6983k6883k403O07k7304L3158J2909m3103n6371L6381L1588
$$ plain form
15694 72120 70818 23068 54655 -29372 -126458 -164880 -152428 -74379 -79909 -85664 -21550 -5046
15682 -5046 -36512 -109409 -104430 -103188 -88203 -10424 31513 7255 35298 83013 63666 28968
15670 28968 16692 37510 38238 3985 -93172 -76397 -44735 -65274 -66035 -29905 -33077 -21792 -10368
15657 -10368 -77341 -77481 -90902 -96841 -55014 -39113 35181 112984 166361 120323 84264 47458
15645 47458 88861 48345 14131 25449 39720 66374 29187 -12288 -81007 -76867 -26948 5600
15633 5600 48490 -16317 -27842 -1817 -18252 -40484 -59136 -59596 10979 28221 -38137 12731
15621 12731 56826 32376 -10782 -19822 60025 82375 70938 59289 28430 18164 35049 -11845
15609 -11845 -50077 2561 29710 64916 83114 97124 60224 31894 -18703 18027 85508 77794
$$ packed form
15694G2120j302m7750L1587q4027r7086l8422J2452P8049n530n755O4114J6504
15682e046l1466p2897M979J242J4985P7779M1937k4258K8043M7715j9347l4698
15670B8968j2276K0818P28l4253r7157J6775L1662k0539p61L6130l172J1285J1424
15657a0368o6973j40j3421n939M1827J5901P4294P7803N3377m6038l6059l6806
15645D7458M1403m0516l4214J1318J4271K6654l7187m1475o8719M140M9919L2548
15633E600M2890o4807j1525K6025j6435k2232j8652m60P0575J7242o6358N0868
15621A2731M4095k4450m3158r040P9847K2350j1437j1649l0859j0266J6885m6894
15609a1845l8232N2638K7149L5206J8198J4010l6900k8330n0597L6730O7481p714
$$ plain form
15597 77794 53075 78745 43862 6977 22227 36921 48862 68641 73561 25855 -6013 13202
15585 13202 12940 57471 43729 77074 63840 13890 -50195 -38434 -27322 -15162 45106 -32185
15573 -32185 -95849 -38865 50288 141912 134283 36609 7563 16022 27299 23516 -1899 -14984
15561 -14984 -59918 -62274 -49257 -96343 -38066 31823 13327 35939 113773 146747 136369 93789
15549 93789 55464 43846 70834 60622 37385 5597 -13366 -11356 47343 50785 59690 63842
15537 63842 105337 156152 176538 105170 97290 78748 94304 109080 58931 19704 -51955 -70316
15525 -70316 -25199 -37411 -26715 -51743 -105158 -132745 -122934 -50956 17622 70593 64902 61303
15513 61303 18670 28230 -22592 -54257 -46319 579 16970 56921 75952 20937 -66885 -108497
$$ packed form
15597G7794k4719K5670l4883l6885J5250J4694J1941J9779M920m7706l1868J9215
15585A3202k62M4531j3742L3345j3234m9950o4085J1761J1112J2160O0268p7291
15573c2185o3664N6984Q9153R1624p629r7674k9046Q459J1277l783k5415j3085
15561a4984m4934k356J3017m7086N8277O9889j8496K2612P7834L2974j0378m2580
15549I3789l8325j1618K6988j0212k3237l1788j8963K010N8699L442Q905M152
15537F3842M1495N0815K0386p1368p880j8542J5556J4776n0149l9227p1659j8361
15525g0316M5117j2212J0696k5028n3415k7587R811P1978O8578N2971n691l599
15513F1303m2633R560n0822l1665P938M6898J6391L9951J9031n5015q7822m1612
$$ plain form
15501 -108497 -99123 -70040 -44394 -44568 -32938 -51160 -50078 -4898 58634 26723 46196 68210
15489 68210 9867 2187 17214 45441 2851 -79923 -75277 -20664 -18616 -10010 39752 91834
15477 91834 98395 89666 47807 25917 -8041 -6635 12214 27013 58465 81143 18462 41864
15465 41864 18901 23513 72545 110757 125376 127812 119826 59025 33877 13682 -16826 14033
15453 14033 15537 -47816 -46978 -13227 4745 21719 95501 65565 17505 -11599 38422 123928
15441 123928 97624 33676 39902 38965 31153 84505 113876 69124 42761 62594 104474 148
15429 148 -53575 -24190 -58767 -81139 -57121 7019 33373 63409 71913 48545 13482 32542
15417 32542 -18228 -11593 64870 93253 73027 64975 27124 54930 138068 136809 108702 32333
$$ packed form
15501a08497R374K9083K5646j74J1630j8222J082M5180O3532l1911J9473K2014
15489F8210n8343p680J5027K8227m2590q2774M646N4613K048Q606M9762N2082
15477I1834O561q729m1859k1890l3958J406J8849J4799L1452K2678o2681K3402
15465D1864k2963M612M9032L8212J4619K436p986o0801k5148k0195l0508L0859
15453A4033J504o3353Q38L3751J7972J6974P3782k9936m8060k9104N0021Q5506
15441A23928k6304o3948O226r37p812N3352K9371m4752k6363J9833M1880j04326
15429A48n3723K9385l4577k2372K4018O4140K6354L0036Q504k3368l5063J9060
15417C2542n0770O635P6463K8383k0226q052l7851K7806Q3138j259k8107p6369
$$ plain form
15405 32333 45175 42606 17312 123 -17940 5537 -34239 -44648 -56236 23265 51632 20534
15393 20534 -8420 -41738 -2114 -13385 -66669 -101261 -83171 -83633 -96468 -49614 39270 48062
15381 48062 81721 112336 57737 6629 79961 102774 68283 62517 67069 55517 24771 22964
15369 22964 -10644 -46105 -48031 8344 82980 81684 52554 36190 50103 52642 80281 87678
15357 87678 58921 60170 36143 48179 93906 87724 69324 -20198 2496 70772 77780 93767
15345 93767 47312 -21747 -30275 7129 -7816 14514 -3005 -13792 -17021 -15746 37217 51992
15333 51992 70109 52855 48983 91055 84224 105988 99146 99369 82827 22794 4601 4796 -12639
15320 -12639 6890 -14977 14913 42084 94656 104545 79679 77060 102644 45519 -18188 -27712
$$ packed form
15405C2333J2842k569k5294j7189j8063K3477l9776j0409j1588P9501K8367l1098
15393B0534k8954l3318L9624j1271n3284l4592J8090m62j2835M6854Q8884Q792
15381D8062L3659L0615n4599n1108P3332K2813l4491n766M552j1552l0746j807
15369B2964l3608l5461j926N6375P4636j296k9130j6364J3913K539K7639P397
15357H7678k8757J249k4027J2036M5727o182j8400q9522K2694O8276P008J5987
15345I3767m6455o9059q528L7404j4945K2330j7519j0787l229J275N2963J4775
15333E1992J8117j7254l872M2072o831K1764o842K23j6542o0033j8193J95j7435
15320a2639J9529k1867K9890K7171N2572R889k4866k619K5584n7125o3707r524
$$ plain form
15308 -27712 17950 70767 51623 42051 -1043 -10110 24996 37591 -4303 52075 41189 19776
15296 19776 40056 53476 78674 74382 75002 99727 94908 50309 -25183 -567 61165 17916
15284 17916 19845 50105 18619 -62236 -89000 -107431 -57995 -24443 -40685 -81391 -92420 -75475
15272 -75475 -40807 -2383 -5783 -73422 -97211 -127296 -57127 -86293 -60506 -7710 -21530 -5050
15260 -5050 655 8264 -544 -1621 3412 87879 2382 -46577 14378 122045 148397 50653 31765
15247 31765 27145 -7813 -22155 -16866 -13274 24251 8981 -4393 24609 -4563 -13203 15871
15235 15871 67298 75924 25870 29766 5157 32507 4823 -12686 -10043 32478 22465 2068
15223 2068 26169 47118 92883 101348 46907 48061 112665 125056 97930 80075 50560 42271
$$ packed form
15308b7712M5662N2817j9144r572m3094r067L5106J2595m1894N6378j0886k1413
15296A9776K0280J3420K5198m292O20K4725m819m4599p5492K4616O1732m3249
15284A7916J929L0260l1486q0855k6764j8431M9436L3552j6242m0706j1029J6945
15272g5475L4668L8424l400o7639k3789l0085P0169k9166K5787N2796j3820J6480
15260e050N705P609q808j077N033Q4467q5497m8959O0955J07667K6352r7744j8888
15247C1765m620l4958j4342N289L592L7525j5270j3374K9002k9172q640K9074
15235A5871N1427Q626n0054L896k4609K7350k7684j7509K643M2521j0013k0397
15223B068K4101K0949M5765Q465n4441J154O4604J2391k7126j7855k9515q289
$$ plain form
15211 42271 -6300 -6541 -4996 -37271 -35082 -29825 -16294 9614 31154 76073 46000 -9568 3508
15198 3508 -46711 -36965 -28330 2209 8455 84529 131188 137178 44680 5042 4352 -827 -28388
15185 -28388 -41510 -57658 25682 -3043 5377 -26514 -9338 57749 127603 131092 103086 80351
15173 80351 31047 -7544 -40652 -22730 -4194 63588 30315 3588 -20782 7521 32038 -4585
15161 -4585 10684 41244 36056 29596 72674 97886 118494 112786 72088 85165 140102 172938
15149 172938 136936 103779 39957 16011 16552 34397 67036 112521 82434 53356 47216 120291
15137 120291 140724 108423 67270 69786 62404 33113 71265 91005 89438 77869 68384 107463
15125 107463 131833 120641 81754 54919 88881 116085 116446 127937 149372 105070 186550 272792
$$ packed form
15211D2271m8571k41J545l2275K189N257J3531K5908K1540M4919l0073n5568J3076
15198C508n0219R746Q635L0539O246P6074M6659N990r2498l9638o90n179k7561
15185b8388j3122j6148Q3340k8725Q420l1891J7176O7087O9854L489k8006k2735
15173H0351m9304l8591l3108J7922J8536O7782l3273k6727k4370K8303K4517l6623
15161d585J5269L0560n188o460M3078K5212K0608n708m0698J3077N4937L2836
15149A72938l6002l3157o3822k3946N41J7845L2639M5485l0087k9078o140P3075
15137A20291K0433l2301m1153K516p382k9291L8152J9740j567j1569r485L9079
15125A07463K4370j1192l8887k6835L3962K7204L61J1491K1435m4302Q1480Q6242
$$ plain form
15113 272792 266516 291959 334372 393914 404175 407789 424625 485905 569594 590934 687508 851720
15101 851720 1034250 1302097 1492679 1618861 1748493 1850774 1829712 1725655 1598184 1469122
15091 1469122 1320956 1110582 858578 678584 588981 518880 414468 335739 238935 146427
15081 146427 106271 97291 114334 124981 98627 58688 107420 169513 172661 139499 186664 152012
15069 152012 98312 130302 109368 101534 63862 70667 75383 52701 18637 -929 37121 55928
15057 55928 108269 57034 17116 49238 18241 -1294 13043 21883 82628 129249 175126 143060
15045 143060 100633 99234 111289 62198 -5803 4195 38446 28897 59016 52664 55112 20017
15033 20017 -15035 -90113 -119618 -52917 50593 114295 145597 120843 82413 36628 63053
$$ packed form
15113B72792o276K5443M2413N9542J0261L614J6836O1280Q3689K1340R6574J64212
15101H51720J82530K67847J90582J26182J29632J02281k1062j04057j27471j29062
15091A469122j48166k10374k52004j79994q9603p0101j04412p8729r6804r2508
15081A46427m0156q980J7043J0647k6354l9939M8732O2093L148l3162M7165l4652
15069A52012n3700L1990k0934p834l7672O805M716k2682l4064j9566L8050J8807
15057E5928N2341n1235l9918L2122l0997j9535J4337Q840O0745M6621M5877l2066
15045A43060m2427j399J2055m9091o8001R998L4251r549L0119o352K448l5095
15033B0017l5052p5078k9505O6701J03510O3702L1302k4754l8430m5785K6425
$$ plain form
15022 63053 79304 104771 101534 95509 108716 105433 28535 30258 107786 82341 32912 48500
15010 48500 141718 161952 104500 82331 31968 -2735 -78135 -62121 20719 70076 48901 50031
14998 50031 32556 2660 -3073 -20630 -467 98556 132205 211600 216835 122490 100495 112817
14986 112817 99607 72450 59467 16017 42140 153602 208288 161429 118314 99914 90913
14975 90913 63785 11420 12740 24434 21607 -6530 -32158 24179 65890 38842 21624 -32299
14963 -32299 -63568 -43827 -8823 -6595 51265 79534 79850 97553 75633 20145 -9170 18530
14951 18530 59410 53924 80803 71121 60622 26239 43230 51844 13743 633 36322 85850
14939 85850 49122 37920 48396 14031 33121 48923 44345 27236 31209 30998 107194 147164
$$ packed form
15022F3053J6251K5467l237o025J3207l283p6898J723P7528k5445m9429J5588
15010D8500R3218K0234n7452k2169n0363l4703p5400J6014Q2840M9357k1175J130
14998E0031j7475k9896n733j7557K0163R9023L3649P9395N235r4345k1995J2322
14986A12817j3210k7157j2983m3450K6123J11462N4686m6859m3115j8400r001
14975I0913k7128n2365J320J1694k827k8137k5628N6337M1711k7048j7218n3923
14963c2299l1269J9741L5004K228N7860K8269L16J7703k1920n5488k9315K7700
14951A8530M0880n486K6879r682j0499l4383J6991Q614l8101j3110L5689M9528
14939H5850l6728j1202J0476l4365J9090J5802m578j7109L973k11P6196L9970
$$ plain form
14927 147164 184689 165919 134327 82568 64188 86188 90033 69829 104975 141789 183159 212253
14915 212253 233147 183324 146161 116752 119134 149144 150065 173549 152214 174352 182634 163478
14903 163478 192185 259531 197394 258856 307380 348457 349273 345227 365663 339081 264073 203600
14891 203600 124492 72574 58900 96675 114284 93837 106568 112267 91061 50758 37789 42456
14879 42456 63612 26266 -10194 -11574 -12880 -96 46657 28117 57984 92106 100881 101898
14867 101898 114554 101850 120648 141872 169211 200296 136985 153275 159531 174384 136809 50666
14855 50666 30620 44588 80000 65686 25458 -25126 37220 111772 143646 113333 118929 88389
14843 88389 106947 129845 135241 100301 79192 96885 88233 96883 75644 55084 113885 205930
$$ packed form
14927A47164L7525j8770l1592n1759j8380K2000L845k0204L5146L6814M1370K9094
14915B12253K0894m9823l7163k9409K382L0010R21K3484k1335K2138Q282j9156
14903A63478K8707O7346o2137O1462M8524M1077Q16m046K0436k6582p5008o0473
14891B03600p9108n1918j3674L7775J7609k0447J2731N699k1206m0303j2969M667
14879D2456K1156l7346l6460j380j306J2784M6753j8540K9867L4122Q775J017
14867A01898J2656j2704J8798K1224K7339L1085o3311J6290O256J4853l7575q6143
14855E0666k0046J3968L5412j4314m0228n0584O2346P4552L1874l0313N596l0540
14843H8389J8558K2898N396l4940k1109J7693q652Q650k1239k0560N8801R2045
$$ plain form
14831 205930 165373 134427 165269 97139 60911 62347 145546 218508 183044 161167 114776 107839
14819 107839 117858 120260 161565 118454 95601 149573 182108 154866 148542 126640 157361 172115
14807 172115 190779 246241 291966 208445 119300 134303 98385 151249 172235 141109 127044
14796 127044 168832 261777 245710 188011 176688 215648 204148 203682 225072 283994 291446 202944
14784 202944 166632 194187 260545 259810 234246 214814 203708 210373 185713 186668 233496 287744
14772 287744 348232 390403 391195 369939 367751 371624 418494 475155 475345 367146 258382 294494
14760 294494 372784 396260 389098 305096 299655 369576 407176 424405 368227 355012 353399 330613
14748 330613 334635 381311 363444 340738 371125 393725 431461 436263 433431 389006 387696 406363
$$ packed form
14831B05930m0557l0946L0842o8130l6228J436Q3199P2962l5464k1877m6391o937
14819A07839J0019K402M1305m3111k2853N3972L2535k7242o324k1902L0721J4754
14807A72115J8664N5462M5725q3521q9145J5003l5918N2864K0986l1126j4065
14796A27044M1788R2945j6067n7699j1323L8960j1500m66K1390N8922P452q8502
14784B02944l6312K7555O6358p35k5564j9432j1106O665k4660R55M6828N4248
14772B87744O0488M2171P92k1256k188L873M6870N6661J90j08199j08764L6112
14760B94494P8290K3476p162q4002n441O9921L7600J7229n6178j3215j613k2786
14748C30613M022M6676j7867k2706L0387K2600L7736M802k832m4425j310J8667
$$ plain form
14736 406363 412540 418111 481982 552455 583929 539265 588903 663163 612079 550089 489482 447036
14724 447036 460787 523066 535295 448150 416750 512124 655179 631741 621167 708348 770529
14713 770529 749819 736801 728569 664846 690913 729771 795903 828182 876992 919185 940890 944417
14701 944417 1009364 1043531 1051488 1068199 1073316 1102139 1126457 1195602 1247996 1340437 1454187 1533876
14689 1533876 1533534 1667495 1836257 1913774 2030085 2168283 2257949 2388589 2501770 2613600
14679 2613600 2838374 3016357 3319242 3711678 4075870 4482536 4866812 5266143 5698246
14670 5698246 6222714 6951678 7862994 8958177 10230973 11730052 13465671 15544883 17963888
14661 17963888 20772702 24009931 27903788 32501401 38114603 45057672 54176410 66457056
$$ packed form
14736D06363O177N571O3871P0473L1474m4664M9638P4260n1084o1990o0607m2446
14724D47036J3751O2279J2229q7145l1400R5374J43055k3438j0574Q7181O2181
14713G70529k0710j3018q232o3723K6067L8858O6132L2279M8810M2193K1705L527
14701I44417O4947L4167P957J6711N117K8823K4318O9145N2394R2441J13750P9689
14689A533876l42J33961J68762P7517J16311J38198Q9666J30640J13181J11830
14679B613600K24774J77983L02885L92436L64192M06666L84276L99331M32103
14670E698246N24468P28964R11316J095183J272796J499079J735619K079212K419005
14661A7963888K808814L237229L893857M597613N613202O943069R118738J2280646
$$ plain form
14653 66457056 83160218 105396749 133781690 168182567 207040801 247354982 285224476
14646 285224476 316464156 337013969 343703654 335559314 313734879 281090080 241437985
14639 241437985 199097985 158150049 121988898 92535129 70237033 54227983 43099845
14632 43099845 35284926 29635381 25231729 21628292 18552865 15885424 13632264 11680380
14624 11680380 9986603 8626506 7518952 6623053 5897400 5337780 4909841 4488237 4164612
14615 4164612 3865274 3587010 3310162 3135078 3006937 2868554 2732834 2573332 2431549
14606 2431549 2330929 2224153 2167058 2091170 2060142 1949596 1826739 1782762 1692091 1634667
14596 1634667 1522634 1430910 1344934 1245904 1217140 1174491 1105032 1060588 1077731 1057698 1063969
$$ packed form
14653F6457056J6703162K2236531K8384941L4400877L8858234M0314181L7869494
14646B85224476L1239680K0549813O689685q144340k1824435l2644799l9652095
14639B41437985m2340000m0947936l6161151k9453769k2298096j6009050j1128138
14632D3099845p814919n649545m403652l603437l075427k667441k253160j951884
14624A1680380j693777j360097j107554q95899p25653n59620m27939m21604l23625
14615D164612k99338k78264k76848j75084j28141j38383j35720j59502j41783
14606B431549j00620j06776n7095p5888l1028j10546j22857m3977r0671n7424
14596A634667j12033r1724q5976r9030k8764m2649o9459m4444J7143k0033O271
$$ plain form
14585 1063969 1057955 1046979 1052942 1035857 913847 846938 787486 743325 744774 766431 814561 723338
14573 723338 628492 601042 706677 658226 696903 844126 925805 996419 1126818 1207676 1279432
14562 1279432 1281448 1113715 958423 794826 687585 614519 624265 607908 624098 612878 629055
14551 629055 623902 611750 554165 552625 615743 597488 574844 575275 623730 664243 663162 714369
14539 714369 795391 893091 990438 994111 1028365 1073913 1074143 1087868 1018164 993755 918958 856529
14527 856529 707231 648335 664130 628651 564223 552869 549767 493052 544001 528789 475018
14516 475018 450250 426408 433773 493243 516140 557580 610851 613661 600495 553635 579611 615148
14504 615148 642797 667320 702723 773282 816202 815680 876301 910000 999723 1011909 923521 808221
$$ packed form
14585A063969o014j0976N963j7085j22010o6909n9452m4161J449K1657M8130r1223
14573G23338r4846k7450J05635m8451L8677J47223Q1679P0614J30399Q0858P1756
14562A279432K016j67733j55292j63597j07241p3066R746j6357J6190j1220J6177
14551F29055n153j2152n7585j540O3118j8255k2644M31M8455M0513j081N1207
14539G14369Q1022R7700R7347L673L4254M5548K30J3725o9704k4409p4797o2429
14527H56529j49298n8896J5795l5479o4428j1354l102n6715N0949j5212n3771
14516D75018k4768k3842P365N9470K2897M1440N3271K810j3166m6860K5976L5537
14504F15148K7649K4523L5403P0559M2920n22O0621L3699Q9723J2186q8388j15300
$$ plain form
14492 808221 696419 609097 555531 533032 477231 442133 368029 246957 217963 233069 216459
14481 216459 240963 229776 217114 215802 180708 134468 131386 153306 240779 257715 195062 135455
14469 135455 124375 100562 112676 124529 133860 104530 145676 185041 231809 229083 241176 221080
14457 221080 229448 195751 241003 226968 108965 132536 158262 280983 274374 161558 143979
14446 143979 98571 98604 147020 141707 123184 163740 159699 117225 81129 97557 50833 114059
14434 114059 168848 177612 191570 158484 104073 84303 95245 87821 93738 114864 98998 58241
14422 58241 98288 136444 103518 103257 80474 87582 68353 114547 152331 124959 113375 155169
14410 155169 124455 35485 48335 74056 96158 101805 123440 128132 157796 180187 123112 78161
$$ packed form
14492H08221j11802q7322n3566k2499n5801l5098p4104j21072k8994J5106j6610
14481B16459K4504j1187j2662j312l5094m6240l082K1920Q7473J6936o2653n9607
14469A35455j1080k3813J2114J1853R331k9330M1146L9365M6768k726J2093k0096
14457B21080Q368l3697M5252j4035j18003K3571K5726J22721o609j12816j7579
14446A43979m5408L3M8416n313j8523M0556m041m2474l6096J6428m6724O3226
14434A14059N4789Q764J3958l3086n4411j9770J0942p424N917K1126j5866m0757
14422E8241M0047L8156l2926k61k2783P108j9229M6194L7784k7372j1584M1794
14410A55169l0714q8970J2850K5721K2102N647K1635M692K9664K2391n7075m4951
$$ plain form
14398 78161 91495 98514 88309 63948 72643 83385 -1058 32340 119704 135070 71596 5529
14386 5529 -5756 39966 106602 101587 48444 39257 64834 76112 68463 86720 71511 47066
14374 47066 -3944 -25679 -52434 -50863 37258 75550 59095 47766 82280 141169 74275 -7712
14362 -7712 5437 62824 94073 119997 127691 123008 144149 127875 90925 71402 69027 31624
14350 31624 29739 65342 68730 73357 44311 60243 125546 184726 232232 231135 269606 297776
14338 297776 278388 306726 323084 337703 294115 288950 270067 249116 230260 208811 183131 153383
14326 153383 181480 169907 115554 77930 88433 92937 161823 171290 129138 115254 76225 59760
14314 59760 26408 103799 84809 85465 105886 114819 113431 104308 87855 118176 129654 91337 178706
$$ packed form
14398G8161J3334P019j0205k4361Q695J0742q4443L3398Q7364J5366o3474o6067
14386E529j1285M5722O6636n015n3143r187K5577J1278p649J8257j5209k4445
14374D7066n1010k1735k6755J571Q8121L8292j6455j1329L4514N8889o6894q1987
14362g712J3149N7387L1249K5924P694m683K1141j6274l6950j9523k375l7403
14350C1624j885L5603L388M627k9046J5932O5303N9180M7506j097L8471K8170
14338B97776j9388K8338J6358J4619m3588n165j8883k0951j8856k1449k5680k9748
14326A53383K8097j1573n4353l7624J0503M504O8886R467m2152j3884l9029j6465
14314E9760l3352P7391j8990O56K0421Q933j388r123j6453L0321J1478l8317Q7369
$$ plain form
14301 178706 250102 272146 271347 229252 151912 76112 131730 190544 198082 167029 139322 156994
14289 156994 115216 66859 52123 53191 9189 31940 25603 28152 83054 115165 39136 9663
14277 9663 58621 92674 55086 -17397 -30251 19464 23806 22916 18671 32753 48336 62538 123476
14264 123476 130375 80288 45045 29538 107907 149756 115712 71691 133332 177494 138404 154434
14252 154434 194196 171371 163152 130888 106410 108783 157580 180583 88492 70726 126961 188697
14240 188697 172768 139324 97952 19686 651 37109 68762 116864 177471 170971 163762 84343
14228 84343 99934 106839 129697 148965 96082 122441 185945 204914 199024 189743 205254 199046
14216 199046 223018 197185 188612 161304 168452 269360 317983 313574 318965 333824 324834 338565
$$ packed form
14301A78706P1396K2044p99m2095p7340p5800N5618N8814P538l1053k7707J7672
14289A56994m1778m8357j4736J068m4002K2751o337K549N4902L2111p6029k9473
14277I663M8958L4053l7588p2483j2854M9715M342q90m245J4082J5583J4202O0938
14264A23476O899n0087l5243j5507P8369M1849l4044m4021O1641M4162l9090J6030
14252A54434L9762k2825q219l2264k4478K373M8797K3003r2091j7766N6235O1736
14240A88697j5929l3444m1372p8266j9035L6458L1653M8102O0607o500p209p9419
14228H4343J5591O905K2858J9268n2883K6359O3504J8969n890r281J5511o208
14216A99046K3972k5833q573k7308P148J00908M8623m409N391J4859q990J3731
$$ plain form
14204 338565 317746 348527 416765 467170 509607 531071 581537 588566 605461 653730 754990
14193 754990 849269 992327 1129066 1373121 1610306 1827678 1958571 2016733 2012772 1988215
14183 1988215 1884784 1626513 1415354 1221906 956598 708173 540121 496677 492062 492133 524403
14172 524403 561125 516467 509220 478065 482164 494572 433357 399694 405260 346117 389228 454383
14160 454383 451270 467848 408908 417457 403007 410767 422650 464168 489482 486351 483289 477108 481415
14147 481415 509193 541725 591579 725383 812288 802289 757148 713154 725245 784597 846380
14136 846380 915149 964448 942839 964148 1065261 1158924 1191613 1221298 1251701 1279762 1419302
14125 1419302 1533550 1630235 1724943 1781874 1900359 2044753 2182236 2317559 2485359 2747963
$$ packed form
14204C38565k0819L0781O8238N0405M2437K1464N0466P029J6895M8269J01260
14193G54990R4279J43058J36739K44055K37185K17372J30893N8162l961k4557
14183A988215j03431k58271k11159j93448k65308k48425j68052m3444m615P1L2270
14172E24403L6722m4658p247l1155M099J2408o1215l3663N566n9143M3111O5155
14160D54383l113J6578n8940Q549j4450P760J1883M1518K5314l131l062o181M307
14147D81415K7778L2532M9854J33804Q6905r999m5141m3994J2091N9352O1783
14136H46380O8769M9299k1609K1309J01113R3663L2689K9685L0403K8061J39540
14125A419302J14248R6685R4708N6931J18485J44394J37483J35323J67800K62604
$$ plain form
14115 2747963 3005836 3280151 3632562 3995522 4416372 4842849 5265917 5817332 6576998
14106 6576998 7416461 8437098 9640718 11024964 12546203 14377484 16572740 19166819
14098 19166819 22332736 26326048 31280088 37416768 45245619 54974026 66625888 79935625
14090 79935625 94238689 108623353 121769144 132240189 139064337 141500941 139264715
14083 139264715 132723382 122717390 110330567 96966058 83810323 71703508 61283642
14076 61283642 52791076 46127696 40997637 37050200 34119302 31912665 30286358 29227160
14068 29227160 28672244 28486548 28736078 29370325 30453649 31978823 33974764 36621368 40021934
14059 40021934 44289695 49743098 56746788 65338053 75721036 87708940 100684345 113703751
$$ packed form
14115B747963K57873K74315L52411L62960M20850M26477M23068N51415P59666
14106F576998Q39463J020637J203620J384246J521239J831281K195256K594079
14098A9166819L165917L993312M954040O136680P828851R728407J1651862J3309737
14090G9935625J4303064J4384664J3145791J0471045O824148K436604k236226
14083A39264715o541333j0005992j2386823j3364509j3155735j2106815j0419866
14076F1283642q492566o663380n130059l947437k930898k206637j626307j059198
14068B9227160n54916j85696K49530O34247J083324J525174J995941K646604L400566
14059D0021934M267761N453403P003690Q591265J0382983J1987904J2975405J3019406
$$ plain form
14051 113703751 125660883 135253815 141342304 143143893 140237393 132755810 121496866 107750584
14043 107750584 92759836 77754850 63850288 51736473 41712182 33731562 27589896
14036 27589896 22890613 19255676 16332233 13990769 12120968 10533143 9110619 7928514
14028 7928514 6974121 6198204 5499818 4900913 4401153 4002951 3669006 3301041 2952775
14019 2952775 2737397 2558526 2345639 2192541 2088096 1994052 1915978 1804122 1692019 1589198
14009 1589198 1534900 1484472 1442478 1417287 1374341 1331897 1268976 1221980 1130463 1076875 1010437
13998 1010437 935123 902734 851896 779664 791147 792618 796260 743688 688146 659414 631770 576895
13986 576895 551785 551168 560797 569492 611061 584786 580517 515804 482930 459939 442117 417442
$$ packed form
14051A13703751J1957132R592932O088489J801589k906500p481583j1258944j3746282
14043A07750584j4990748j5004986j3904562j2113815j0024291p980620o141666
14036B7589896m699283l634937k923443k341464j869801j587825j422524j182105
14028G928514r54393p75917o98386n98905m99760l98202l33945l67965l48266
14019B952775k15378j78871k12887j53098j04445r4044p8074j11856j12103j02821
14009A589198n4298n0428m1994k5191m2946m2444o2921m6996r1517n3588o6438
13998A010437p5314l2389n0838p2232J1483J471L642n2572n5542k8732k7644n4875
13986E76895k5110o17R629Q695M1569k6275m269o4713l2874k2991j7822k4675
$$ plain form
13974 417442 381754 402942 441403 548114 514717 424414 427420 388017 312790 301185 398059
13963 398059 465498 444424 456921 413101 371919 418947 412691 431685 407630 338279 290393 251441
13951 251441 245043 289435 270858 286153 307030 309167 290694 272173 272129 353992 321477 227050
13939 227050 245574 192889 152963 169959 176740 185632 183140 154006 159783 171151 208178 191074
13927 191074 226655 245648 204018 244361 287130 237914 183664 186095 168547 185317 182144 157510
13915 157510 171520 196049 160430 138203 134597 154571 161482 192404 165586 154465 171126 138634
13903 138634 118584 121319 86626 99254 144431 131962 136821 110485 72450 81891 86291 33486
13891 33486 70529 176340 188439 99908 63639 57321 54820 53932 83128 45995 47458 76416
$$ packed form
13974D17442l5688K1188L8461J06711l3397r0303L006l9403p5227j1605R6874
13963C98059O7439k1074J2497m3820m1182M7028o256J8994k4055o9351m7886l8952
13951B51441o398M4392j8577J5295K0877K137j8473j8521m4Q1863l2515r4427
13939B27050J8524n2685l9926J6996O781Q892k492k9134N777J1368L7027j7104
13927A91074L5581J8993m1630M0343M2769m9216n4250K431j7548J6770l173k4634
13915A57510J4010K4529l5619k2227l606J9974O911L0922k6818j1121J6661l2492
13903A38634k0050K735l4693J2628M5177j2469M859k6336l8035R441M400n2805
13891C3486L7043J05811J2099q8531l6269o318k501q88K9196l7133J463K8958
$$ plain form
13879 76416 78750 83356 67182 39823 36624 39074 67740 87916 54637 47222 51192 35777 57153
13866 57153 59346 45069 48482 72615 58749 16951 25794 81914 133166 140985 157464 110040
13854 110040 105674 135300 153470 140156 144787 175635 167157 139261 83107 63935 29419 31734
13842 31734 104715 135957 106047 84739 61762 35643 12254 77267 60865 26085 35197 53307
13830 53307 38623 45134 16242 -4262 47269 83066 129744 120512 172263 164306 138942 140878
13818 140878 143921 128365 118627 118386 149222 156800 70057 24148 79710 72583 53866 49699 61881
13805 61881 29862 36496 11815 -5540 41677 65686 36286 26246 35206 73815 106271 110805
13793 110805 72395 18088 6403 26748 8931 533 511 -24742 -13791 -22795 59153 60233 31109
$$ packed form
13879G6416K334M606j6174k7359l199K450K8666K0176l3279p415L970j5415K1376
13866E7153K193j4277L413K4133j3866m1798Q843N6120N1252P819J6479m7424
13854A10040m366K9626J8170j3314M631L0848q478k7896n6154j9172l4516K315
13842C1734P2981L1242k9910k1308k2977k6119k3389O5013j6402l4780R112J8110
13830E3307j4684O511k8892k0504N1531L5797M6678r232N1751p957k5364J936
13818A40878L043j5556r738k41L0836P578q6743m5909N5562p127j8717m167J2182
13805F1881l2019O634k4681j7355M7217K4009k9400j0040Q960L8609L2456M534
13793A10805l8410n4307j1685K0345j7817q398k2k5253J0951r004Q1948J080k9124
$$ plain form
13780 31109 35532 118202 170012 157799 95100 82285 38758 1516 60025 109997 87125 15382
13768 15382 35943 96717 70609 -1028 1424 8375 28241 24472 -15259 31482 34946 -29598
13756 -29598 -22912 -2687 21000 27029 13393 983 -3669 4547 21963 -10187 -49891 -14888
13744 -14888 30326 42966 46559 39267 -3276 -7696 -48617 -81631 -113775 -44415 -64806 -97370
13732 -97370 -30589 27178 151557 187881 139520 78858 48678 66604 68258 76654 28883 -15069
13720 -15069 41806 93848 107499 131693 123547 61282 26465 20807 30871 52768 22884 -5233
13708 -5233 27151 75387 80147 36071 -16847 -47232 -7536 30481 75602 110800 50651 9086
13696 9086 14613 -19481 -24580 26915 47136 95102 100422 17238 -34842 -39937 -97250 -74361 -8639
$$ packed form
13780C1109M423Q2670N1810j2213o2699j2815m3527l7242N8509M9972k2872p1743
13768A5382K0561O0774k6108p1637K452O951J9866l769l9731M6741L464o4544
13756b9598O686K0225K3687O029j3636j2410m652Q216J7416l2150l9704L5003
13744a4888M5214J2640L593p292m2543m420m0921l3014l2144O9360k0391l2564
13732i7370O6781N7767J24379L6324m8361o0662l0180J7926J654Q396m7771m3952
13720a5069N6875N2042J3651K4194q146o2265l4817n658J0064K1897k9884k8117
13708e233L2384M8236M760m4076n2918l0385L9696L8017M5121L5198o0149m1565
13696I086N527l4094n099N1495K0221M7966N320q3184n2080n095n7313K2889O5722
$$ plain form
13683 -8639 19493 36197 38924 36674 7993 -14750 -35664 -33643 -11014 -70437 -107905 -89765
13671 -89765 -61518 -27197 -20839 -25930 -31494 -43356 -15750 -33052 -6985 -8841 -33210 -106584
13659 -106584 -34668 67551 87541 100893 97011 89812 65779 39791 77050 94674 131518 124027
13647 124027 173974 156960 98731 72577 138091 232880 267615 272209 294853 364972 404319 449690
13635 449690 479240 597414 704662 752394 764325 736301 687753 648295 647464 595787 455400
13624 455400 369853 347844 297355 267861 219086 145694 129423 195458 210968 165158 152268
13613 152268 71758 59839 68952 81920 99904 84453 64522 112449 201083 239622 252932 273713
13601 273713 344065 388527 454215 614608 688449 694004 746749 730709 720408 703846 692997
$$ packed form
13683h639K8132J6704K727k250k8681k2743k0914K021K2629n9423l7468J8140
13671h9765K8247L4321O358n091n564j1862K7606j7302K6067j856k4369p3374
13659a06584P1916J02219J9990J3352l882p199k4033k5988L7259J7624L6844p491
13647A24027M9947j7014n8229k6154O5514R4789L4735M594K2644P0119L9347M5371
13635D49690K9550J18174J07248M7732J1931k8024m8548l9458q31n1677j40387
13624D55400q5547k2009n0489k9494m8775p3392j6271O6035J5510m5810j2890
13613A52268q0510j1919R113J2968J7984j5451j9931M7927Q8634L8539J3310K0781
13601B73713P0352M4462O5688J60393P3841N555N2745j6040j0301j6562j0849
$$ plain form
13590 692997 630000 518889 452713 411817 314332 214999 149485 150695 161828 67311 -6925
13579 -6925 22540 62468 66971 91108 68811 66213 23703 -4675 45297 4360 -30770 -65815
13567 -65815 -46662 2047 38491 13883 -21236 -64984 -33902 -20122 -38313 -10209 25162 65890
13555 65890 53590 -23188 -37466 24432 30602 6349 38796 85242 83463 39735 -19540 -83141
13543 -83141 -64047 -39978 69257 137498 142723 57446 23634 -2251 -19301 4773 9434 -8626
13531 -8626 3407 31079 56876 95196 65074 19887 10782 45089 7369 -24506 -4692 62596
13519 62596 48166 19558 -68614 -61105 -29805 -22107 49681 25596 -40367 -44005 -36387 -59313
13507 -59313 -40996 -3995 4675 6768 -14691 -25855 -23195 -53439 -125522 -98085 -51744 -19555
$$ packed form
13590F92997o2997j11111o6176m0896r7485r9333o5514J210J1133r4517p4236
13579f925K9465L9928M503K4137k2297k598m2510k8378M9972m0937l5130l5045
13567f5815J9153M8709L6444k4608l5119m3748L1082J3780j8191K8104L5371M0728
13555F5890j2300p6778j4278O1898O170k4253L2447M6446j779m3728n9275o3601
13543h3141J9094K4069J09235O8241N225q5277l3812k5885j7050K4074M661j8060
13531h626J2033K7672K5797L8320l0122m5187r105L4307l7720l1875J9814O7288
13519F2596j4430k8608q8172P509L1300P698P1788k4085o5963l638P618k2926
13507e9313J8317L7001Q670K093k1459j1164K660l0244p2083K7437M6341L2189
$$ plain form
13495 -19555 -22881 -23671 -27498 7883 48297 -28179 -79920 -64435 -51632 -78854 -86025 -110674 -79785
13482 -79785 -44793 10979 69164 16017 -20926 -16815 -31531 -16828 32140 89897 80652 82146
13470 82146 96608 107644 77389 15487 -7065 31830 23159 68331 98170 23258 -33117 -11468
13458 -11468 -7548 9170 33358 37262 66738 129184 89011 5978 -47405 -60341 -52174 -37020
13446 -37020 -51516 -75149 -29995 -37523 -36529 22873 77132 66264 69356 40672 57298 29792
13434 29792 -11069 -19950 9522 4332 -34173 -36023 -36173 2859 39137 73810 41581 -97483
13422 -97483 -123683 -46559 -23409 -80869 -50153 9685 10001 8922 28863 -4019 5707 24035
13410 24035 -25815 -92887 -89591 -72838 -24735 -35708 -24162 -19207 18044 -19652 -48509 -14461
$$ packed form
13495a9555l326p90l827L5381M0414p6476n1741J5485J2803k7222p171k4649L0889
13482g9785L4992N5772N8185n3147l6943M111j4716J4703M8968N7757r245J494
13470H2146J4462J1036l0255o1902k2552L8895q671M5172K9839p4912n6375K1649
13458a1468L920J6718K4188L904K9476O2446m0173q3033n3383j2936Q167J5154
13446c7020j4496k3633M5154p528R94N9402N4259j0868L092k8684J6626k7506
13434B9792m0861q881K9472n190l8505j850j50L9032L6278L4673l2229j39064
13422i7483k6200P7124K3150n7460L0716N9838L16j079J9941l2882R726J8328
13410B4035m9850o7072L296J6753M8103j0973J1546M955L7251l7696k8857L4048
$$ plain form
13398 -14461 1313 39469 2993 -29297 -41473 -66572 -5292 22215 12627 -551 22849 15176
13386 15176 39228 18872 16038 49079 54698 40749 -861 -65794 -77279 -115205 -132210 -115728
13374 -115728 -100782 -61569 -50285 -14909 -8066 -18061 -245 -15510 -68804 -110735 -37967 27335
13362 27335 12324 -17564 -13927 -22391 -15221 -18606 -31785 -55825 -18911 42754 37832 -1129 -3332
13349 -3332 -6806 -43061 -28564 16766 -1786 46315 48789 7741 -54744 -71998 -104799 -99878
13337 -99878 -83134 -35691 -1408 -10587 -38 -53534 -94847 -87052 -66339 -42033 -27402 -73312
13325 -73312 -110481 -124407 -140738 -99166 -3014 27227 63869 61250 37016 -6095 -10638 -19762
13313 -19762 -79332 -33147 -39280 -40195 9402 -11417 -10181 33885 31464 16964 7293 -87352 -122739
$$ packed form
13398a4461J5774L8156l6476l2290j2176k5099O1280K7507r588j3178K3400p673
13386A5176K4052k0356k834L3041N619j3949m1610o4933j1485l7926j7005J6482
13374a15728J4946L9213J1284L5376O843r995J7816j5265n3294m1931P2768O5302
13362B7335j5011k9888L637q464P170l385j3179k4040L6914O1665m922l8961k203
13349c332l474l6255J4497M5330j8552M8101K474m1048o2485j7254l2801M921
13337i9878J6744M7443L4283r179J0549n3496m1313P795K0713K4306J4631m5910
13325g3312l7169j3926j6331M1572R6152L0241L6642k619k4234m3111m543r124
13313a9762n9570M6185o133r15M9597k0819J236M4066k421j4500r671r4645l5387
$$ plain form
13300 -122739 -113262 -95672 -80138 -91879 -79699 -62919 -101488 -81843 -13221 37052 89939 90127
13288 90127 70811 47950 15667 42747 2301 -35416 -66234 -125438 -128866 -39939 -34807 2135
13276 2135 -7659 7612 21352 1953 13339 -10499 -27701 -12771 19350 24662 237 -18617
13264 -18617 -8921 -26919 -75537 -41535 41618 37096 985 11989 45458 86787 100589 49405
13252 49405 -13353 -28130 -49520 -99333 -74783 -68635 -65916 -58327 -24208 1365 -6232 12870
13240 12870 1700 -61219 -78737 -122441 -116844 46366 81308 94797 91727 55087 22036 13928
13228 13928 40721 68203 32006 15090 11471 39454 -24173 -58920 -30724 7095 33839 50203
13216 50203 35159 24614 5455 60212 72848 117419 147523 72038 -28474 -29495 -7514 -93758
$$ packed form
13300a22739R477J7590J5534j1741J2180J6780l8569J9645O8622N0273N2887J88
13288I0127j9316k2861l2283K7080m0446l7717l0818n9204l428Q8927N132L6942
13276B135r794J5271J3740j9399J1386k3838j7202J4930L2121N312k4425j8854
13264a8617R696j7998m8618L4002Q3153m522l6111J1004L3469M1329J3802n1184
13252D9405o2758j4777k1390m9813K4550O148K719P589L4119K5573p597J9102
13240A2870j1170o2919j7518m3704N597J63210L4942J3489l070l6640l3051q108
13228A3928K6793K7482l6197j6916l619K7983o3627l4747K8196L7819K6744J6364
13216E0203j5044j0545j9159N4757J2636M4571L0104p5485j00512j021K1981q6244
$$ plain form
13204 -93758 -72888 -31365 37846 59814 87850 29037 -21187 -15472 -32433 -14450 757 25832
13192 25832 699 3455 35823 58504 -20687 -60083 -32037 7673 -39223 -40938 8141 32506
13180 32506 24030 -11142 -29732 9677 44776 1312 7213 34258 -18624 7478 4136 27928
13168 27928 93197 130564 65430 424 -45621 -34091 -15711 1413 -29159 -17674 -2501 4530
13156 4530 -5825 22229 38697 25169 30771 61339 12102 -12760 3747 28383 90150 136182
13144 136182 132393 94567 51090 -36530 -117448 -132158 -103648 -111947 -129460 -79580 -71708 -50566
13132 -50566 -18780 -5022 11945 20485 -18652 9374 20818 27631 30229 22564 531 -36606
13120 -36606 -37585 -49793 23640 89476 49889 3290 -16180 51944 119715 78118 34120 34901
$$ packed form
13204i3758K0870M1523O9211K1968K8036n8813n0224N715j6961J7983J5207K5075
13192B5832k5133K756L2368K2681p9191l9396K8046L9710m6896j715M9079K4365
13180C2506q476l5172j8590L9409L5099m3464N901K7045n2882K6102l342K3792
13168B7928O5269L7367o5134o5006m6045J1530J8380J7124l0572J1485J5173P031
13156D530j0355K8054J6468j3528N602L0568m9237k4862J6507K4636O1767M6032
13144A36182l789l7826m3477q7620q0918j4710K8510q299j7513M9880P872K1142
13132e0566L1786J3758J6967Q540l9137K8026J1444O813K598p665k2033l7137
13120c6606r79j2208P3433O5836l9587m6599j9470O8124O7771m1597m3998P81
$$ plain form
13108 34901 34160 2117 33850 51750 29115 -8525 -60635 -79929 -56637 -20303 -16074 -79250
13096 -79250 -95286 -7427 75714 84477 56233 15349 8352 39306 55911 72989 48466 32017
13084 32017 636 -27317 -8965 -20068 -47873 -97022 -114325 -64617 -16248 782 33450 65339
13072 65339 59410 29081 20124 21188 27007 24978 113273 91482 27302 10335 14786 10315 31742
13059 31742 26818 34356 577 -2867 -40941 -62387 -1817 35208 -7548 -30186 28128 -2542
13047 -2542 -19828 16144 20317 -5208 -46974 -47868 -67410 -67776 -68573 -61983 -64579 -46789 -39424 -68664
13033 -68664 -73952 -50336 -38262 -30983 -21421 -42842 -31746 -54277 -69715 -58050 -68163 -24461
13021 -24461 -54603 -62663 -78074 -58563 -46440 -31894 -44564 -78645 -64469 -5300 -543 -34418
$$ packed form
13108C4901p41l2043L1733J7900k2635l7640n2110j9294K3292L6334M229o3176
13096g9250j6036Q7859Q3141Q763k8244m0884o997L0954J6605J7078k4523j6449
13084C2017l1381k7953J8352j1103k7805m9149j7303M9708M8369J7030L2668L1889
13072F5339n929l0329q957J064N819k029Q8295k1791o4180j6967M451m471K1427
13059C1742m924P538l3779l444l8074k1446O0570L7025m2756k2638N8314l0670
13047b542j7286L5972M173k5525m1766q94j9542l66p97O590k596J7790P365k9240
13033f8664n288K3616J2074P279R562k1421J1096k2531j5438J1665j0113M3702
13021b4461l0142q060j5411J9511J2123J4546j2670l4081J4176N9169M757l3875
$$ plain form
13009 -34418 -60049 -49988 -35638 -19984 -32857 -56589 -28307 7399 23259 48074 123715 102070
12997 102070 36359 30608 71469 153194 94397 34281 6073 51751 58619 37463 54395 23179
12985 23179 -63807 -29286 22093 96250 113365 55145 -4643 17218 75052 81671 86809 111981
12973 111981 68463 -21897 -59214 -37756 -53761 -45451 16234 20624 34167 12925 63156 116409
12961 116409 92105 91712 110243 102240 57068 25886 13796 -11989 23495 -25453 -66891 -19467
12949 -19467 -32854 -95926 -65365 -57034 -58467 6447 -6476 -7821 30198 50533 -25011 -67068
12937 -67068 -66532 -33679 33622 35035 47048 71290 20196 -9279 -860 12842 -20130 -4525
12925 -4525 16672 -18441 -28800 -54230 -27131 -48457 -48783 -64446 -21577 -14127 -50102 -100107
$$ packed form
13009c4418k5631J0061J4350J5654j2873k3732K8282L5706J5860K4815P5641k1645
12997A02070o5711n751M0861Q1725n8797o0116k8208M5678O868k1156J6932l1216
12985B3179q6986L4521N1379P4157J7115n8220n9788K1861N7834O619N138K5172
12973A11981m3518r0360l7317K1458j6005Q310O1685M390J3543k1242N0231N3253
12961A16409k4304l93J8531q003m5172l1182j2090k5785L5484m8948m1438M7424
12949a9467j3387o3072L0561Q331j433O4914j2923j345L8019K0335p5544m2057
12937f7068N36L2853O7301J413J2013K4242n1094k9475Q419J3702l2972J5605
12925d525K1197l5113j0359k5430K7099k1326l26j5663M2869P450l5975n0005
$$ plain form
12913 -100107 -81212 -55102 -23549 -25651 -18405 -56203 -79764 -91240 -40405 -574 14436 11752
12901 11752 -23368 -916 49457 -19852 -52122 -34266 -56604 -66327 -74249 17100 70605 71906
12889 71906 55976 552 -75109 -100702 -67627 -57063 -101974 -83126 -21153 -22653 852 -31188
12877 -31188 -13738 -38441 -55156 -50464 -40018 -81551 -50340 -68967 -97924 -45438 42786 -12437
12865 -12437 -23757 -25819 -34773 -55641 -57936 -62699 -23864 21999 99818 115864 30592 -22330
12853 -22330 1892 -13013 -39578 -40582 -9777 -13080 -8164 -36957 -64825 -9788 -9624 33515 60575
12840 60575 -1371 -41996 -34554 -38393 -45144 -22194 21001 57520 29247 43058 88157 92375
12828 92375 52602 90953 86731 62469 -6795 -52825 -53643 -18890 -21221 -20738 58277 87487 88265
$$ packed form
12913a00107J8895K6110L1553k102P246l7798k3561j1476N0835L9831J5010k684
12901A1752l5120K2452N0373o9309l2270J7856k2338r723p922R1349N3505J301
12889G1906j5930n5424p5661k5593L3075J0564m4911J8848O1973j500K3505l2040
12877c1188J7450k4703j6715M692J0446m1533L1211j8627k8957N2486Q8224n5223
12865a2437j1320k062q954k0868k295m763L8835M5863P7819J6046q5272n2922
12853b2330K4222j4905k6565j004L0805l303M916k8793k7868N5037J64M3139K7060
12840F0575o1946m0625P442l839o751K2950M3195L6519k8273J3811M5099M218
12828I2375l9773L8351m222k4262o9264m6030q18L4753k331M83P9015K9210P78
$$ plain form
12815 88265 91486 145684 65483 24050 -21339 -31673 -11205 -6469 36663 43112 -48956 -98467
12803 -98467 -116188 -85169 -59020 -39860 229 33779 58772 19180 19866 -24822 -58299 -94604
12791 -94604 -64421 -3406 -34635 -127191 -136706 -127818 -123288 -92583 -29058 21674 72643 34925
12779 34925 2818 -109289 -190499 -184075 -164280 -158722 -139047 -141564 -109864 -68361 -103657 -133222
12767 -133222 -96189 -44329 -7258 39631 64907 85317 66522 104495 49041 -2237 -14912
12756 -14912 12241 58678 77393 84027 92266 45252 15941 27572 -13777 -17223 -9443 -4209 50194
12743 50194 80712 67809 88134 84042 66717 17314 27714 53241 27883 62251 54928 2149
12731 2149 3159 3528 -47504 -39640 -75674 -62967 -90824 -75711 -46120 -69624 -103406 -43994 34885
$$ packed form
12815H8265L221N4198q0201m1433m5389j0334K0468M736M3132O449r2068m9511
12803i8467j7721L1019K6149J9160M0089L3550K4993l9592O86m4688l3477l6305
12791i4604L0183O1015l1229r2556r515Q888M530L0705O3525N0732N0969l7718
12779C4925l2107j12107q1210O424J9795N558J9675k517L1700M1503l5296k9565
12767a33222L7033N1860L7071M6889K5276K0410j8795L7973n5454n1278j2675
12756a4912K7153M6437J8715O634Q239m7014k9311J1631m1349l446P780N234N4403
12743E0194L0518j2903K0325m092j7325m9403J0400K5527k5358L4368p323n2779
12731B149J010L69n1032P864l6034J2707k7857J5113K9591k3504l3782N9412P8879
$$ plain form
12718 34885 -20630 -2973 76112 119785 30119 -14375 356 20886 27585 -85803 -162416 -141360
12706 -141360 -119497 -89615 -49882 -6722 33600 45747 33630 17400 15444 -8611 -8990 -14314
12694 -14314 -48733 -5900 39623 -7469 -52383 -56372 -23479 -26737 -35636 -36781 23927 35206
12682 35206 24649 -11490 36050 17214 -23186 8541 39237 -33621 -50237 -26309 -69490 -55407
12670 -55407 7653 14114 49673 20941 -6302 -7329 12217 -40811 -32624 -9657 12571 12179 39675
12657 39675 61345 47618 26638 21624 30784 -494 36208 64489 30650 -14563 -58794 -75429
12645 -75429 -40923 -29890 -40811 -84174 -28411 48886 62033 16178 -6087 -22371 -8024 17828
12633 17828 40666 -1560 -63408 -73547 -108866 -140856 -90932 -57846 -125586 -74494 -62576 -30807
$$ packed form
12718C4885n5515J7657P9085M3673q9666m4494J4731K0530O699j13388p6613K1056
12706a41360K1863K9882L9733M3160M0322J2147j2117j6230j956k4055l79n324
12694a4314l4419M2833M5523m7092m4914l989L2893l258q899j145O0708J1279
12682C5206j0557l6139M7540j8836m0400L1727L0696p2858j6616K3928m3181J4083
12670e5407O3060O461L5559k8732k7243j027J9546n3028Q187K2967K2228l92K7496
12657C9675K1670j3727k0980n014R160l1278L6702K8281l3839m5213m4231j6635
12645g5429L4506J1033j0921m3363N5763P7297J3147m5855k2265j6284J4347K5852
12633A7828K2838m2226o1848j0139l5319l1990M9924L3086o7740N1092J1918L1769
$$ plain form
12621 -30807 54145 44975 17544 73782 85291 62115 38623 -4056 -6686 -26379 11001 32338
12609 32338 51746 27194 -31972 3117 48949 63214 4239 -48417 -1703 86797 171396 194534
12597 194534 128397 102860 129917 182476 215460 261167 322629 419181 540360 634757 565821
12586 565821 483507 414978 458799 436847 452135 477444 409752 353338 310154 335443 346357
12575 346357 404165 448161 537051 538725 510879 486563 473560 476367 496395 483441 524320 565832
12563 565832 629153 639732 641988 589384 560427 559200 587058 683259 775279 800585 830011 874099
12551 874099 928360 956145 1135308 1396043 1705161 1883295 1771425 1608461 1331634 1139453
12541 1139453 1028628 911214 723740 629631 677617 738593 677577 593211 622315 671525 730544
$$ packed form
12621c0807Q4952r170k7431N6238J1509k3176k3492m2679k630j9693L7380K1337
12609C2338J9408k4552n9166L5089M5832J4265n8975n2656M6714Q8500Q4599K3138
12597A94534o6137k5537K7057N2559L2984M5707O1462R6552J21179R4397o8936
12586E65821q2314o8529M3821k1952J5288K5309o7692n6414m3184K5289J0914
12575C46357N7808M3996Q8890J674k7846k4316j3003K807K0028j2954M0879M1512
12563E65832O3321J0579K256n2604k8957j227K7858R6201R2020K5306K9426M4088
12551H74099N4261K7785J79163K60735L09118J78134j11870j62964k76827j92181
12541A139453j10825j17414j87474r4109M7986O0976o1016q4366K9104M9210N9019
$$ plain form
12530 730544 697639 602071 554215 565532 557526 499624 438027 400866 385257 397141 408789 417050
12518 417050 397902 391965 323464 290181 353950 382996 424190 435305 483882 494864 435636 461386
12506 461386 498075 634032 744413 715227 625621 432974 317273 232318 204176 214603 226060
12495 226060 189670 177021 168201 180188 151341 69036 58557 68143 99306 121065 176152 183832
12483 183832 208917 152779 129791 144448 170355 154580 127663 121806 110527 119489 157150 120791
12471 120791 63501 80529 70964 78398 54495 -7477 -5134 26917 72681 93620 67814 42114
12459 42114 81835 105571 77327 91262 98513 66215 48961 30523 31047 83531 89719 111168
12447 111168 36912 25350 92872 101153 58982 14653 45849 53562 41462 29094 2609 -10406
$$ packed form
12530G30544l2905r5568m7856J1317q006n7902o1597l7161j5609J1884J1648Q261
12518D17050j9148n937o8501l3283O3769K9046M1194J1115M8577J0982n9228K5750
12506D61386L6689J35957J10381k9186q9606j92647j15701q4955k8142J0427J1457
12495B26060l6390j2649q820J1987k8847q2305j0479R586L1163K1759N5087P680
12483A83832K5085n6138k2988J4657K5907j5775k6917n857j1279Q962L7661l6359
12471A20791n7290J7028r565P434k3903o1972K343L2051M5764K0939k5806k5700
12459D2114L9721K3736k8244J3935P251l2298j7254j8438N24N2484O188K1449
12447A11168p4256j1562O7522Q281m2171m4329L1196P713j2100j2368k6485j3015
$$ plain form
12435 -10406 5809 -2351 17302 23286 58756 72665 2543 -46363 -29506 -17493 661 10911
12423 10911 42515 48034 67753 79956 71101 47812 41606 63534 25789 45787 69286 34686
12411 34686 22138 -597 -28547 -33328 -36650 -16292 3413 -6547 5135 27906 -44984 -82042
12399 -82042 -66971 -82226 -66083 9331 51385 58732 19805 28067 12748 -35400 -87123 -136441
12387 -136441 -120494 -96684 -157774 -122353 -117116 -180293 -198942 -51925 -5869 12852 41057
12376 41057 77245 45609 -17049 -22558 -33301 -91168 -114874 -120159 -87988 -84664 -105876 -86794
12364 -86794 -84544 -76215 -145491 -113012 -71328 -52751 -23600 219 8998 -28745 -63128 -9583
12352 -9583 -6547 -38463 -70150 -100505 -61477 -34420 -9150 -34717 18122 55488 5175 -23181
$$ packed form
12435a0406J6215q160J9653N984L5470J3909p0122m8906J6857J2013J8154J0250
12423A0911L1604N519J9719J2203q855k3289o206K1928l7745J9998K3499l4600
12411C4686j2548k2735k7950m781l322K0358J9705r960J1682K2771p2890l7058
12399h2042J5071j5255J6143P5414M2054P347l8927Q262j5319m8148n1723m9318
12387a36441J5947K3810o1090L5421N237o3177j8649J47017M6056J8721K8205
12376D1057L6188l1636o2658n509j0743n7867k3706n285L2171L324k1212J9082
12364h6794K250Q329o9276L2479M1684J8577K9151K3819Q779l7743l4383N3545
12352i583L036l1916l1687l0355L9028K7057K5270k5567N2839L7366n0313k8356
$$ plain form
12340 -23181 -45822 -98119 -129315 -116243 -121894 -29412 -36209 -4801 67572 64663 73439 67905 20670
12327 20670 -9918 53140 91955 64831 35453 90351 79534 93791 132971 104946 54162 23324
12315 23324 -12409 -67236 -77256 -76943 -74482 -45317 -34180 -46380 -49619 -82023 -83605 -71794 -48657
12302 -48657 -33060 22353 -2285 -19498 -1111 27304 35777 28615 63304 44082 37828 34723
12290 34723 13552 -45985 -80894 15373 -18812 -94163 -68061 -103691 -144326 -122148 -100652 -102528
12278 -102528 -84768 -34227 -48199 -80340 -85693 13296 62581 13565 -47280 -32391 -15681 5047
12266 5047 -23619 -15830 22073 48031 -11744 -56799 -59225 -101012 -110423 -130993 -77951 -39088
12254 -39088 -3579 -21897 -79994 -45583 16042 -1977 6396 17887 -22586 -16261 -24461 -31552
$$ packed form
12340b3181k2641n2297l1196J3072n651R2482o797L1408P2373k909Q776n534m7235
12327B0670l0588O3058L8815k7124k9378N4898j0817J4257L9180k8025n0784l0838
12315B3324l5733n4827j0020L13K461K9165J1137j2200l239l2404j582J1811K3137
12302d8657J5597N5413k4638j7213J8387K8415Q473p162L4689j9222o254l105
12290C4723k1171n9537l4909R6267l4185p5351K6102l5630m0635K2178K1496j876
12278a02528J7760N0541j3972l2141n353R8989M9285m9016o0845J4889J6710K0728
12266E047k8666P789L7903K5958n9775m5055k426m1787r411k0570N3042L8863
12254c9088L5509j8318n8097L4411O1625j8019Q373J1491m0473O325q200p091
$$ plain form
12242 -31552 -32914 -29161 939 20031 9547 2991 11 -9999 -38593 -50132 -13954 -9645 -63011
12229 -63011 -57084 -11922 11239 13519 -1556 64029 50995 63679 46768 4251 -13487 29657
12217 29657 1681 -44966 -100076 -102740 -92809 -85664 -70019 -15666 33464 61229 39311 30867
12205 30867 37928 80683 96215 81836 47503 -6211 -46416 -30453 15200 10937 -53280 -142281
12193 -142281 -90571 -73264 -44556 20357 -23620 -76960 -12045 18084 -4129 70118 92981
12182 92981 68249 2378 -7573 -12580 -1109 17406 68106 23435 -12529 -30613 -38364 -52737
12170 -52737 -60284 -50664 -95936 -92689 -20585 -6994 -83015 -89713 -115057 -129805 -136430 -77478 -9148
12157 -9148 24929 -14865 -28204 51859 86657 118840 119626 114051 12900 21723 43238 15329
$$ packed form
12242c1552j362L753L0100J9092j0484o556k980j0010k8594j1539L6178M309n3366
12229f3011N927M5162K3161K280j5075O5585j3034J2684j6911m2517j7738M3144
12217B9657k7976m6647n5110k664R931P145J5645N4353M9130K7765k1918q444
12205C0867P061M2755J5532j4379l4333n3714m0205J5963M5653m263o4217q9001
12193a42281N1710J7307K8708O4913m3977n3340O4915L0129k2213P4247K2863
12182I2981k4732o5871r951n007J1471J8515N0700m4671l5964j8084p751j4373
12170e2737p547R620m5272L247P2104J3591p6021o698k5344j4748o625N8952O8330
12157i148L4077l9794j3339Q0063L4798L2183P86n575j01151Q823K1515k7909
$$ plain form
12145 15329 -32365 -106193 -128553 -41284 -4948 19097 -21025 -31595 1163 -34678 -15428 2459
12133 2459 -13937 -45317 20563 36001 61631 53271 -20247 -80366 -106947 -71698 -30683 -11587
12121 -11587 14965 37989 98653 77502 1807 -42558 -55803 -26042 18509 82673 67810 -9540
12109 -9540 -17131 -14416 3257 -34562 -68133 -97598 -116417 -113900 -67666 -67369 -62597 -61499 21614
12096 21614 27502 -31032 -38347 -27518 -23224 4986 28855 39605 17681 -59264 -129822 -102838
12084 -102838 -117291 -91778 -41936 11378 68276 96193 126210 92338 7615 -50441 -100293
12073 -100293 -125376 -53381 -35634 -46159 -64193 -30858 4602 -27002 -44959 24338 38445
12062 38445 26439 43566 53328 24797 35466 47670 35844 -18405 -76505 -17138 41758 30218
$$ packed form
12145A5329m7694p3828k2360Q7269L6336K4045m0122j0570L2758l5841J9250J7887
12133B459j6396l1380O5880J5438K5630q360p3518o0119k6581L5249M1015J9096
12121a1587K6552K3024O0664k1151p5695m4365j3245K9761M4551O4164j4863p7350
12109i540p591K715J7673l7819l3571k9465j8819K517M6234K97M772J098Q3113
12096B1614N888n8534p315J0829M294K8210K3869J0750k1924p6945p0558K6984
12084a02838j4453K5513M9842N3314N6898K7917L0017l3872q4723n8056m9852
12073a00293k5083P1995J7747j0525j8034L3335L5460l1604j7957O9297J4107
12062C8445j2006J7127R762k8531J0669J2204j1826n4249n8100N9367N8896j1540
$$ plain form
12050 30218 -37371 -4505 64458 -5634 -116006 -170650 -83640 -41354 -6782 55702 44867
12039 44867 70597 73614 -853 -61514 -27840 20475 47322 118722 105615 69617 26779 56001
12027 56001 74014 79207 -8616 -17207 -41752 -72206 -25218 -40956 -16455 -46496 -87003 -101991
12015 -101991 -122829 -142174 -72277 -17578 -21232 -58971 -42619 -34106 -32638 3193 73529 61809
12003 61809 86925 68344 40818 14163 30296 2719 49838 97910 61635 43752 15893 -17381
11991 -17381 -21829 4617 34654 86234 86204 44545 -36538 -95994 -70291 -20641 -1567 7009 10689
11978 10689 15791 47245 36090 -23018 -34516 -36192 -33399 6424 -24683 -75493 -117357 -45837
11966 -45837 17642 13815 41602 -4772 -42481 -58096 -54384 -30423 -39148 -29158 5620 7496 70540
$$ packed form
12050C0218o7589L2866O8963p0092j10372n4644Q7010M2286L4572O2484j0835
12039D4867K5730L017p4467o0661L3674M8315K6847P1400j3107l5998m2838K9222
12027E6001J8013N193q7823q591k4545l0454M6988j5738K4501l0041m0507j4988
12015a01991k0838j9345O9897N4699l654l7739J6352Q513J468L5831P0336j1720
12003F1809K5116j8581k7526k6655J6133k7577M7119M8072l6275j7883k7859l3274
11991a7381m448K6446L0037N1580l0m1659q1083n9456K5703M9650J9074Q576L680
11978A0689N102L1454j1155n9108j1498j676K793L9823l1107n0810m1864P1520
11966d5837O3479l827K7787m6374l7709j5615L712K3961q725R990L4778J876O3044
$$ plain form
11953 70540 64675 43728 1052 -27243 -3113 17171 5129 17039 3484 -36442 -50570 -1944
11941 -1944 -61218 -60854 -35021 9166 5414 55086 36967 20605 1497 11939 24538 42638
11929 42638 11735 2767 -8010 51938 60316 55272 68666 40995 -18249 -43460 -43769 -4170 63370
11916 63370 59149 61853 64968 49565 26011 25384 20152 52727 88712 94069 80228 11535 49874
11903 49874 118921 118306 91078 51822 8223 45947 72584 51087 29803 -32508 -64717 -68035
11891 -68035 -58818 -34620 -34457 -3560 -40664 -46195 -41539 -40093 -19289 19088 29825 -48309 -104032
11878 -104032 -77220 27838 80005 64622 51138 -2290 -29824 -50141 5640 5761 -33778 -74625
11866 -74625 -32608 -39360 -3271 26095 44972 4573 13228 649 17329 2649 17817 61892
$$ packed form
11953G0540n865k0947m2676k8295K4130K0284j2042J1910j3555l9926j4128M8626
11941a944n9274L64K5833M4187l752M9672j8119j6362j9108J0442J2599J8100
11929D2638l0903q968j0777N9948Q378n044J3394k7671n9244k5211l09L9599O7540
11916F3370m221K704L115j5403k3554o27n232L2575L5985N357j3841o8693L8339
11903D9874O9047o15k7228l9256m3599L7724K6637k1497k1284o2311l2209l318
11891f8035R217K4198J63L0897l7104n531M656J446K0804L8377J0737p8134n5723
11878a04032K6812J05058N2167j5383j3484n3428k7534k0317N5781J21l9539m0847
11866g4625M2017o752L6089K9366J8877m0399Q655j2579J6680j4680J5168M4075
$$ plain form
11854 61892 57138 -8574 17242 -2855 -10755 -15375 27566 29077 -25929 -49872 -67673 -125801
11842 -125801 -87024 -15134 3067 -75280 -119843 -45758 32363 9400 42842 49273 -804 6517
11830 6517 26025 38571 62590 52266 -29085 -75114 -52847 -21992 35763 -15653 -63084 -31644
11818 -31644 8732 -28696 -15148 20158 41642 29930 -46218 -72858 -40592 3383 14566 -22386
11806 -22386 -28093 5475 -12722 -71924 -92940 -51584 -47586 -54559 -28251 -54179 -44582 -74453
11794 -74453 -103310 -26806 -10034 -10061 -41525 -25475 -12333 -29861 -69885 -86967 -111195 -114672
11782 -114672 -90553 -33614 -31904 1157 24827 -23518 -51225 -72755 -41011 -44735 -15795 7233
11770 7233 -26409 -3257 44824 21499 -26171 -6660 736 9643 51172 72293 18244 2142
$$ packed form
11854F1892m754o5712K5816k0097p900m620M2941J511n5006k3943j7801n8128
11842a25801L8777P1890J8201p8347m4563P4085P8121k2963L3442O431n0077P321
11830F517J9508J2546K4019j0324q1351m6029K2267L0855N7755n1416m7431L1440
11818c1644M0376l7428J3548L5306K1484j1712p6148k6640L2266M3975J1183l6952
11806b2386n707L3568j8197n9202k1016M1356L998o973K6308k5928R597k9871
11794g4453k8857P6504J6772k7l1464J6050J3142j7528m0024j7082k4228l477
11782a14672K4119N6939J710L3061K3670m8345k7707k1530L1744l724K8940K3028
11770G233l3642K3152M8081k3325m7670J9511P396Q907M1529K1121n4049j6102
$$ plain form
11758 2142 -26508 -23676 6698 -820 6318 20192 -13670 -69243 -126150 -92565 -64520 -40974
11746 -40974 -55577 -64701 -60809 -75832 -57761 -27632 -13648 18454 4161 2079 -23423 -95750
11734 -95750 -86276 -52436 15970 62675 61910 -999 -27917 -23405 -61435 -44283 -48422 -67999 -74233
11721 -74233 -93823 -78320 -33356 -5905 -47596 -102774 -45708 -7612 15729 13563 -3937 -43358
11709 -43358 -43752 -24164 11115 18540 -17719 -23422 -12511 -15935 15334 19736 -12200 -36269 -69861
11696 -69861 -61091 -17403 -505 -18171 -52250 -84299 -58185 17014 -4819 -3916 -19051 -66502
11684 -66502 -85590 -78699 -30855 -32506 -95874 -73118 -50262 -61445 -47857 1126 -13465 -42880
11672 -42880 -101271 -82793 -69988 -22488 -14510 -26457 -54378 -91856 -83132 -120979 -66777 -33018
$$ packed form
11758B142k8650K832L0374p518P138J3874l3862n5573n6907L3585K8045K3546
11746d0974j4603r124L892j5023J8071L0129J3984L2102j4293k082k5502p2327
11734i5750R474L3840O8406M6705p65o2909k6918M512l8030J7152m139j9577o234
11721g4233j9590J5503M4964K7451m1691n5178N7066L8096K3341k166j7500l9421
11709d3358l94J9588L5279P425l6259n703J0911l424L1269M402l1936k4069l3592
11696f9861Q770M3688J6898j7666l4079l2049K6114P5199k1833R03j5135m7451
11684f6502j9088O891M7844j651o3368K2756K2856j1183J3588M8983j4591k9415
11672d2880n8391J8478J2805M7500P978j1947k7921l7478Q724l7847N4202L3759
$$ plain form
11660 -33018 -4292 -611 -54725 -124534 -41830 -1377 5022 -78252 -136488 -150924 -34281 -4228
11648 -4228 -9315 -58593 -102736 -114408 -74066 -79292 -51748 2364 14057 -8281 -60313 -59496 -67419
11635 -67419 -61525 -50480 -62649 -34103 20546 67877 77614 98306 62951 30216 29153 41513
11623 41513 10852 -265 -970 63258 141226 128269 71456 59481 33464 -31569 -4196 28448
11611 28448 -1512 -15681 -31084 -23040 -52111 -89399 -96732 -59885 -15360 -46664 -50492 -11287
11599 -11287 65461 78085 65 -14343 13815 6046 48251 54922 16660 -15405 -94829 -54819
11587 -54819 -53524 -63375 -30744 -14319 -5755 -4768 -20773 -25309 -50667 -41602 -47103 -28068 -27530 3437
11573 3437 36068 29413 86997 37816 -55313 -95032 -49682 -13051 18707 15318 9108 -16596
$$ packed form
11660c3018K8726L681n4114o9809Q2704M0453O399q3274n8236j4436J16643L0053
11648d228n087m9278m4143j1672M0342n226K7544N4112J1693k2338n2032Q17p923
11635f7419N894J1045j2169K8546N4649M7331R737K0692l5355l2735j063J2360
11623D1513l0661j1117p05O4228P7968j2957n6813j1975k6017o5033K7373L2644
11611B8448k9960j4169j5403Q044k9071l7288p333L6847M4525l1304l828L9205
11599a1287P6748J2624p8020j4408K8158p769M2205O671l8262l2065p9424M0010
11587e4819J295r851L2631J6425Q564R87j6005m536k5358R065n501J9035N38L0967
11573C437L2631o655N7584m9181r3129l9719M5350L6631L1758l389o210k5704
$$ plain form
11561 -16596 -86361 -73898 -8171 20681 -39050 -38439 -86952 -138708 -157743 -50847 -10913 19518
11549 19518 37381 83388 91441 46900 -9540 -19399 13055 55886 32463 -17195 -2522 5799
11537 5799 13947 -12007 -45037 -49167 -70135 -74341 -48127 -26803 -6472 -88600 -170997 -165365 -75979
11524 -75979 -23209 14061 67675 95829 66211 22610 -26589 -59362 -75807 -93714 -76019 -25009
11512 -25009 23167 -1740 -38651 -17333 1103 -19523 -6932 -9258 32946 32589 43197 38713
11500 38713 72709 38547 19143 8443 -1843 -58336 -33551 -17164 3538 28710 91356 16962
11488 16962 -13020 -24660 1669 -25406 -51395 -40773 -40296 30697 78054 78201 57881 -10172
11476 -10172 -40612 -80533 -73511 -15430 12685 21833 -17560 -37410 -74239 -56709 69066 59728
$$ packed form
11561a6596o9765J2463O5727K8852n9731O11m8513n1756j9035J06896L9934L0431
11549A9518J7863M6007Q053m4541n6440r859L2454M2831k3423m9658J4673Q321
11537E799Q148k5954l3030m130k0968m206K6214K1324K0331q2128q2397N632Q9386
11524g5979N2770L7270N3614K8154k9618m3601m9199l2773j6445j7907J7695N1010
11512b5009M8176k4907l6911K1318J8436k0626J2591k326M2204l57J0608m484
11500C8713L3996l4162j9404j0700j0286n6493K4785J6387K0702K5172O2646p4394
11488A6962k9982j1640K6329k7075k5989J0622M77P0993M7357J47k0320o8053
11476a0172l0440l9921P022N8081K8115R148l9393j9850l6829J7530J25775r338
$$ plain form
11464 59728 30519 -1411 8552 76087 39515 49720 71462 68972 81575 62468 36492 -17007
11452 -17007 -2648 -6839 -24783 28982 9575 -80646 -110125 -62552 -20304 39662 90138 84430
11440 84430 -9922 -82012 -54096 8572 14360 16392 -36511 -29283 -6263 -42256 -39282 -42550 -41007
11427 -41007 1367 -33182 -16675 -23384 -69775 -94937 -149629 -110343 -61449 -11384 32195 20524
11415 20524 18627 -14351 -20213 -46263 -74081 -83566 -64499 -36647 -33569 -17467 17389 46939
11403 46939 39700 96839 64979 8026 5094 14373 65214 60605 29851 -20359 -4581 29572
11391 29572 18122 918 3061 -36785 -53209 -61316 -116489 -81067 -6413 57124 39056 26744
11379 26744 6766 51747 69297 40317 67882 42311 5553 -10383 -32217 -5330 53535 34640
$$ packed form
11464E9728k9209l1930R963O7535l6572J0205K1742k490J2603j9107k5976n3499
11452a7007J4359m191j7944N3765j9407r0221k9479M7573M2248N9966N0476n708
11440H4430r4352p2090K7916O2668N788K032n2903P228K3020l5993K974l268J543
11427d1007M2374l4549J6507o709m6391k5162n4692L9286M8894N0065M3579j1671
11415B0524j897l2978n862k6050k7818r485J9067K7852L078J6102L4856K9550
11403D6939p239N7139l1860n6953k932R279N0841m609l0754n0210J5778L4153
11391B9572j1450j7204K143l9846j6424q107n5173L5422P4654O3537j8068j2312
11379B6744j9978M4981J7550k8980K7565k5571l6758j5936k1834K6887N8865j8895
$$ plain form
11367 34640 20032 22067 82852 91450 40853 -55845 -42855 -27052 -30905 -9220 -30846 -46228
11355 -46228 -54189 -119848 -112123 -47029 -38490 -58577 -60411 -78936 -91725 -46242 53511 70515
11343 70515 42479 8932 -44302 -55048 -431 17139 -18553 -82172 -74948 -67402 -87100 -50158
11331 -50158 -12972 -8750 -23004 -82404 -113723 -158335 -118010 -96780 -33545 -4463 23136 7017
11319 7017 -5202 -14586 -70226 -46689 -58150 -59991 -44480 -56474 -54704 -48688 -51482 -657 -36764
11306 -36764 -136929 -123648 -96878 -51951 -32070 -28018 -75120 -76638 -95799 -70706 -70669 -50090
11294 -50090 -74833 -106106 -100760 -41153 -6427 25295 44618 1594 -14946 2883 -40746 8297
11282 8297 8593 -22164 57597 50573 -34992 -30406 -23786 644 -27196 55609 40463 42650 54592
$$ packed form
11367C4640j4608K035O0785Q598n0597r6698J2990J5803l853K1685k1626j5382
11355d6228p961o5659P725O5094Q539k0087j834j8525j2789M5483R9753J7004
11343G0515k8036l3547n3234j0746N4617J7570l5692o3619P224P546j9698L6942
11331e0158L7186M222j4254n9400l1319m4612M0325K1230O3235K9082K7599j6119
11319G017j2219r384n5640K3537j1461j841J5511j1994J770O016k794N0825l6107
11306c6764j00165J3281K6770M4927J9881M052m7102j518j9161K5093L7K0579
11294e0090k4743l1273N346N9607L4726L1722J9323m3024j6540J7829m3629M9043
11282H297K96l0757P9761p024q5565M586O620K4430k7840Q2805j5146K187J1942
$$ plain form
11269 54592 28268 10147 -4074 6159 23657 35563 8261 -33471 -9766 31545 48881 69389
11257 69389 12893 6755 -2457 -8511 3021 13333 31867 81699 128012 133038 79211 44872
11245 44872 41312 -37729 -85445 -101527 -76626 -36710 -36688 -17836 -36135 -57545 -109585 -42918
11233 -42918 48635 29891 -38314 30542 111165 101129 87052 60430 21594 -10075 -36555 31
11221 31 36903 11448 -37658 -26711 14919 -16017 -22736 3730 50578 1892 -5369 -18258 -10873
11208 -10873 -16562 -99410 -139766 -140680 -116204 -44644 -9907 26629 57566 -11020 -57520 -95311
11196 -95311 -79562 -93905 -48874 202 -62993 -40984 -45429 -16543 -3266 -17570 -16528 -75315
11184 -75315 -124869 -67996 -41982 -32160 -94262 -144790 -104704 -80083 -61534 -71671 -115711 -117050
$$ packed form
11269E4592k6324j8121j4221J0233J7498J1906k7302m1732K3705M1311J7336K0508
11257F9389n6496o138r212o054J1532J0312J8534M9832M6313N026n3827l4339
11245D4872l560p9041m7716j6082K4901L9916K2J8852j8299k1410n2040O6667
11233d2918R1553j8744o8205O8856Q0623j0036j4077k6622l8836l1669k6480L6586
11221C1L6872k5455m9106J0947M1630l0936o719K6466M6848m8686p261j2889P385
11208a0873n689q2848m0356r14K4476P1560L4737L6536L0937o8586m6500l7791
11196i5311J5749j4343M5031M9076o3195K2009m445K8886J3277j4304J042n8787
11184g5315m9554N6873K6014R822o2102n0528M0086K4621J8549j0137m4040j339
$$ plain form
11172 -117050 -96225 -65179 -51125 -4695 66607 52421 45049 38281 -33440 -88954 -53720 -25705
11160 -25705 -23426 -13446 -32937 -53858 -97007 -61357 -46984 -33754 -49231 -27902 44701 80873
11148 80873 63793 48413 78240 105268 37622 4000 69384 101259 22984 -23779 -55704 -38023
11136 -38023 -70034 -16972 49294 52424 51964 80572 41788 25088 18943 30052 29095 52796 81428
11123 81428 35009 -27112 -33023 -53678 -44302 14151 58067 78438 49497 13260 -52227 -57554
11111 -57554 -23989 -35562 -28583 -9443 5834 14048 -6757 23836 -6061 12309 24771 27044
11099 27044 -18430 -28654 29555 -8758 -49199 -59073 -81707 -11996 27 -60233 -32746 1540
11087 1540 3312 69414 79522 19536 -40411 -24950 -11566 -20258 -92032 -65072 -14566 13819
$$ packed form
11172a17050K0825L1046J4054M6430P1302j4186p372o768p1721n5514L5234K8015
11160b5705K279R980j9491k0921m3149L5650J4373J3230j5477K1329P2603L6172
11148H0873j7080j5380K9827K7028o7646l3622O5384L1875p8275m6763l1925J7681
11136c8023l2011N3062O6266L130m60K8608l8784j6700o145J1109r57K3701K8632
11123H1428m6419o2121n911k0655R376N8453M3916K0371k8941l6237o5487n327
11111e7554L3565j1573O979J9140J5277Q214k0805L0593k9897J8370J2462K273
11099B7044m5474j0224N8209l8313m0441r874k2634O9711J2023o0260K7487L4286
11087A540J772O6102J0108n9986n9947J5461J3384q692p1774K6960N0506K8385
$$ plain form
11075 13819 68371 48508 71289 33427 4474 9436 9997 -13012 13541 74427 58673 -31165
11063 -31165 -132465 -80181 -72822 -64850 -19560 47437 32592 -43595 -72110 -61322 -72181 -134712
11051 -134712 -83571 -53583 -9134 -6188 -16015 31593 7448 -34424 -48939 -16564 9116 23544
11039 23544 7385 2003 20511 22536 70060 39580 34402 38318 -8051 -46472 7720 7416 23947
11026 23947 -12645 -50796 -53239 -601 7733 88919 73152 20776 19346 -31622 -34070 -4481
11014 -4481 10277 -31054 -13160 -31227 -43227 -26026 -10076 -44975 -93615 -48847 6262 -9652
11002 -9652 -16848 -12028 -55714 -23324 47891 -47685 -121285 -45195 -4881 -40636 -65624 -83083
10990 -83083 -88251 -67061 -67275 -8027 56657 90902 41313 26912 31264 9402 -12458 26503
$$ packed form
11075A3819N4552j9863K2781l7862k8953M962N61k3009K6553O0886j5754q9838
11063c1165j01300N2284P359P972M5290O6997j4845p6187k8515J0788j0859o2531
11051a34712N1141K9988M4449K946r827M7608k4145m1872j4515L2375K5680J4428
11039B3544j6159n382J8508K025M7524l0480n178L916m6369l8421N4192l04J6531
11026B3947l6592l8151k443N2638Q334Q1186j5767n2376j430n0968k448K9589
11014d481J4758m1331J7894j8067j2000J7201J5950l4899m8640M4768N5109j5914
11002i652p196M820m3686L2390P1215r5576p3600P6090M0314l5755k4988j7459
10990h3083n168K1190k14N9248O4684L4245m9589j4401M352k1862k1860L8961
$$ plain form
10978 26503 -19024 -31625 30206 78557 64041 10088 -1558 1170 31206 16514 -69107 -48225
10966 -48225 -1170 35286 67707 94318 106958 103378 109125 52010 16131 -20669 112 30036
10954 30036 21898 30158 -2620 -47200 -22721 16676 -10776 -46079 -29838 -8332 -51340 -56239
10942 -56239 -51394 8604 -24838 -32487 -51080 -63920 -86260 -27605 -7298 -31230 -55002 -77018
10930 -77018 -60341 -9281 42472 49971 18149 -8479 -20855 3823 -15067 -26971 14127 76641
10918 76641 98157 94725 96392 49119 -48422 -56874 -104437 -120968 -107533 -134692 -135276 -99630 -39297
10905 -39297 -35039 -13733 -23283 -35320 -25780 -59726 -23345 17836 30363 2541 24810 26533
10893 26533 -18909 -20442 11297 -13044 -6209 36033 19104 -13108 63397 91025 50725 34839
$$ packed form
10978B6503m5527j2601O1831M8351j4516n3953j1646K728L0036j4692q5621K0882
10966d8225M7055L6456L2421K6611J2640l580N747n7115l5879l6800K0781K9924
10954C0036q138Q260l2778m4580K4479L9397k7452l5303J6241K1506m3008m899
10942e6239M845N9998l3442p649j8593j2840k2340N8655K0307k3932k3772k2016
10930g7018J6677N1060N1753P499l1822k6628j2376K4678j8890j1904M1098O2514
10918G6641K1516l432J667m7273r7541q452m7563j6531J3435k7159n84L5646O0333
10905c9297M258K1306r550j2037R540l3946L6381M1181J2527k7822K2269J723
10893B6533m5442j533L1739k4341O835M2242j6929l2212P6505K7628m0300j5886
$$ plain form
10881 34839 54150 37183 61364 62895 46583 -34853 -42119 -22677 -66841 -37022 -44078 -6132
10869 -6132 29861 14274 -2677 19487 41382 62205 81982 -10929 -66791 7791 38282 13215
10857 13215 -33549 -72036 -67474 -26044 -14713 -33631 -51920 -38920 78066 48964 12295 -26240
10845 -26240 4626 -8455 -653 44072 55132 27888 -18859 -32337 4619 16860 33759 29939
10833 29939 23109 -4452 -6865 -62977 -51338 23691 16733 -8230 33191 27931 -14713 -102950
10821 -102950 -150354 -130210 -44444 57421 14440 10452 31704 30758 44982 19494 -24395 -80286
10809 -80286 -74651 -63665 -48870 -40590 -24408 -24443 -2762 -38987 -45741 -25614 -23 -4807 -16687
10796 -16687 13099 14837 5972 21460 -6172 -33081 -111034 -147895 -79564 -2874 30648 70597
$$ packed form
10881C4839J9311j6967K4181J531j6312q1436p266J9442m4164K9819p056L7946
10869f132L5993j5587j6951K2164K1895K0823J9777r2911n5862P4582L0491k5067
10857A3215m6764l8487M562M1430J1331j8918j8289J3000J16986k9102l6669l8535
10845b6240L0866j3081P802M4725J1060k7244m6747j3478L6956J2241J6899l820
10833B9939o830k7561k413n6112J1639P5029o958k4963M1421n260m2644q8237
10821a02950m7404K0144Q5766J01865m2981l988K1252r46J4224k5488m3889n5891
10809h0286N635J0986J4795Q280J6182l5K1681l6225o754K0127K5591m784j1880
10796a6687K9786J738q865J5488k7632k6909p7953l6861O8331P6690L3522L9949
$$ plain form
10784 70597 58736 8556 -36889 15153 21753 -826 -28035 63899 94605 33068 -4802 8484
10772 8484 52687 75361 55204 -3837 -47924 -107952 -146646 -89852 -18297 29467 -741 -19403
10760 -19403 -20192 24633 67845 16080 -25802 13204 17240 19673 55058 84561 81848 70175 37461
10747 37461 -14519 9673 -36046 10014 47962 17329 35826 59681 49526 24219 28586 28994
10735 28994 67621 70244 73760 45241 30925 36157 1551 -1022 16030 -29887 -18210 -20217 16148
10722 16148 92420 84565 -14844 -49937 -43755 -75129 -21498 24606 -4769 87490 133558 65153
10710 65153 -18004 15575 73972 58093 -49913 -98514 -174792 -157734 -80235 -47529 -23060
10699 -23060 24795 97422 103919 54724 65445 64970 -7593 -46416 -22935 -60437 -124617 -154424
$$ packed form
10784G0597j1861n0180m5445N2042O600k2579k7209R1934L0706o1537l7870J3286
10772H484M4203K2674k0157n9041m4087o0028l8694N6794P1555M7764l0208j8662
10760a9403p89M4825M3212n1765m1882L9006M036K433L5385K9503k713j1673l2714
10747C7461n1980K4192m5719M6060L7948l0633J8497K3855j0155k5307M367M08
10735B8994L8627K623L516k8519j4316N232l4606k573J7052m5917J1677k007L6365
10722A6148P6272p855r9409l5093O182l1374N3631M6104k9375R2259M6068o8405
10710F5153q3157L3579N8397j5879j08006m8601p6278J7058P7499L2706K4469
10699b3060M7855P2627O497m9195J0721m75p2563l8823K3481l7502o4180k9807
$$ plain form
10687 -154424 -100305 52449 105110 84330 16151 53906 -3904 -54710 -5672 34446 11489
10676 11489 46018 52113 35334 -28784 -58410 -1032 23541 1090 -10736 4258 4300 7978 19584
10663 19584 31651 41028 48514 43798 -12406 3864 80684 51548 96566 83942 10584 -12948
10651 -12948 64309 139761 107366 53907 46621 90876 67520 35659 -48378 -59856 -82045 -73492
10639 -73492 -52720 -18694 -3928 36544 15322 23717 45267 49574 23745 -19808 -47469 -73727
10627 -73727 -61597 -29924 42254 131913 171332 80217 83986 143080 65258 -22922 -40493 -39832
10615 -39832 25521 49311 23589 -46854 -105040 -113900 -47536 -29014 -29341 -37909 -16826 37737
10603 37737 52530 23345 -30997 33016 26307 18525 53975 78607 127349 129169 22814 -46758
$$ packed form
10687a54424N4119J52754N2661k0780o8179L7755n7810n0806M9038M0118k2957
10676A1489L4529O095j6779o4118k9626N7378K4573k2451j1826J4994M2L678J1606
10663A9584J2067R377P486m716n6204J6270P6820k9136M5018j2624p3358k3532
10651a2948P7257P5452l2395n3459p286M4255k3356l1861q4037j1478k2189Q553
10639g3492K0772L4026J4766M0472k1222Q395K1550M307k5829m3553k7661k6258
10627g3727J2130L1673P2178Q9659L9419r1115L769N9094p7822q8180j7571O61
10615c9832O5353K3790k5722p0443n8186q860O6364J8522l27q568K1083N4563
10603C7737J4793k9185n4342O4013o709p782L5450K4632M8742J820j06355o9572
$$ plain form
10591 -46758 442 -17735 -19377 -922 -8442 38323 81368 71614 83600 69980 41503 45688
10579 45688 -37918 -71607 -58769 -34856 -27699 -36323 -51093 -13453 59846 109234 90122 47466
10567 47466 16844 -11999 -31435 6946 103546 158340 122167 77577 78521 58622 24907 34998
10555 34998 24104 -47732 -16309 23083 76618 108090 115498 95501 79543 116559 103230 100049
10543 100049 61417 65886 79440 80161 45905 40813 58912 35530 8497 17845 27944 124656
10531 124656 143259 91244 4451 -49331 -110499 -77029 -20479 -11287 -53240 -95406 -55911 -62872
10519 -62872 -17764 3111 10829 -9571 -2582 47971 100888 101982 84816 92580 35002 43737 2715
10506 2715 -13364 33225 -24462 -78406 -47510 8598 49185 24644 -5349 -12582 -664 -30056
$$ packed form
10591d6758M7200j8177j642J8455p520M6765M3045r754J1986j3620k8477M185
10579D5688q3606l3689J2838K3913P157q624j4770L7640P3299M9388j9112m2656
10567D7466l0622k8843j9436L8381R6600N4794l6173m4590R44j9899l3715J0091
10555C4998j0894p1836L1423L9392N3535L1472P408j9997j5958L7016j3329l181
10543A00049l8632M469J3554P21l4256n092J8099k3382k7033R348J0099R6712
10531A24656J8603n2015q6793n3782o1168L3470N6550R192m1953m2166L9495o961
10519f2872M5108K0875P718k0400O989N0553N2917J094j7166P764n7578Q735m1022
10506B715j6079M6589n7687n3944L0896N6108M0587k4541k9993p233J1918k9392
$$ plain form
10494 -30056 -14675 -34593 -96650 -137950 -131598 -138134 -61795 23758 81129 46081 -5062 16756
10482 16756 18245 31522 11355 37573 17539 -31407 -18508 73900 43961 14461 33628 8567
10470 8567 -29494 -11433 23859 89387 49107 54933 -5410 -55341 -36202 14128 22511 20556
10458 20556 -29871 -41697 35846 109312 122291 132082 84013 75769 53433 48167 18015 -12917
10446 -12917 -10885 -87609 -122088 -64986 -52049 -55975 -67157 -70300 -68347 -40150 -8760 -53024
10434 -53024 -84595 -49989 -55047 -39981 -54831 -85283 -21553 -6117 67016 62455 14364 -3322
10422 -3322 -3042 -20907 4390 41814 52536 84639 91833 99933 58764 13821 -14190 1795 -13758
10409 -13758 16933 -28157 -64883 -23503 19942 67267 63452 566 -11317 9550 -12612 2770
$$ packed form
10494c0056J5381j9918o2057m1300O352o536P6339Q5553N7371l5048n1143K1818
10482A6756J489J3277k0167K6218k0034m8946J2899R2408k9939k9500J9167k5061
10470H567l8061J8061L5292O5528m0280N826o0343m9931J9139N0330Q383j955
10458B0556n0427j1826P7543P3466J2979R791m8069q244k2336n266l0152l0932
10446a2917K032p6724l4479N7102J2937l926j1182l143J953K8197L1390m4264
10434e3024l1571L4606n058J5066j4850l0452O3730J5436P3133m561m8091j7686
10422c322K80j7865K5297L7424J0722L2103P194Q100m1169m4943k8011J5985j5553
10409a3758L0691m5090l6726M1380M3445M7325l815o2886j1883K0867k2162J5382
$$ plain form
10397 2770 34349 53560 19453 -13338 -14952 -1601 -48466 -76835 -61764 -101417 -35710 3833
10385 3833 3494 22581 61555 47063 11853 13669 5179 -45467 -49716 -16050 28389 26379 37391
10372 37391 61624 -13496 -42015 -61482 -55249 -25856 6998 -32994 -101529 -157573 -55667 44780
10360 44780 95031 104302 121476 102604 112279 126526 147821 60712 56782 24966 41568 68845
10348 68845 114642 172310 166139 125660 123336 150047 113382 69055 43001 36988 36168 52723 21659
10335 21659 -9046 -21309 14017 46203 43160 66808 63058 50957 -5112 37233 50936 71480
10323 71480 76669 50985 18590 51775 49709 10265 43587 63044 78635 41449 36122 25403
10311 25403 -32971 8735 15618 10661 -9210 16124 44543 17698 32754 7698 -49069 -96552
$$ packed form
10397B770L1579J9211l4107l2791j614J3351m6865k8369J5071l9653O5707L9543
10385C833l39J9087L8974j4492l5210J816q490n0646m249L3666M4439k010J1012
10372C7391K4233p5120k8519j9467O233K9393L2854l9992o8535n6044J01906J00447
10360D4780N0251R271J7174j8872R675J4247K1295q7109l930l1816J6602K7277
10348F8845M5797N7668o171m0479k324K6711l6665m4327k6054o013q20J6555l1064
10335B1659l0705j2263L5326L2186l043K3648l750j2101n6069M2345J3703K0544
10323G1480N189k5684l2395L3185k066l9444L3322J9457J5591l7186n327j0719
10311B5403n8374M1706O883m957j9871K5334K8419k6845J5056k5056n6767m7483
$$ plain form
10299 -96552 -89507 -40779 -43358 -32589 42087 85897 39879 -50502 -76916 -30265 -20127 -49716
10287 -49716 -53636 29782 94888 59900 20778 -6541 -18624 69738 74841 44093 88834 100747
10275 100747 4597 -74257 -8721 69343 88152 53177 57885 84397 52865 57544 76190 79153
10263 79153 60026 58981 120983 149607 67838 24190 -8084 8433 15516 31191 62962 70295
10251 70295 8547 -41618 10268 31678 42334 15456 37751 59398 69484 31355 44602 77789
10239 77789 100206 93367 58966 113808 165840 208197 237133 212256 253955 408882 624671
10228 624671 805797 953099 1024035 1083518 1258565 1328257 1240576 1106625 977481 847775
10218 847775 690375 500763 363183 209379 183958 172987 159751 147841 137664 132049 106018
$$ packed form
10299i6552P045M8728k579J0769P4676M3810m6018r0381k6414M6651J0138k9589
10287d9716l920Q3418O5106l4988l9122k7319j2083Q8362N103l0748M4741J1913
10275A00747r6150p8854O5536P8064J8809l4975M708K6512l1532M679J8646K963
10263G9153j9127j045O2002K8624q1769m3648l2274J6517P083J5675L1771P333
10251G0295o1748n0165N1886K1410J0656k6878K2295K1647J0086l8129J3247L3187
10239G7789K2417o839l4401N4842N2032M2357K8936k4877M1699J54927K15789
10228F24671J81126J47302P0936N9483J75047O9692q7681j33951j29144j29706
10218H47775j57400j89612j37580j53804k5421j0971j3236j1910j0177n615k6031
$$ plain form
10207 106018 65731 49753 5545 -42495 -22905 6010 31435 35939 39981 34052 -17739 4419
10195 4419 -24868 -14981 37828 17427 -24405 -8246 18116 24470 8908 -39699 -57155 -27451
10183 -27451 -42115 -20273 10321 41031 33441 -16100 -31092 -9451 20901 54016 52887 27103
10171 27103 75316 58275 6176 17026 76454 78104 59554 94171 64067 17776 -24212 -39726
10159 -39726 12109 -11285 -31984 7383 14591 34703 32954 66932 48815 48474 -12772 -80674
10147 -80674 -112601 -55348 -11089 3356 -29651 -1061 14249 21997 -35941 -96945 -81056 -31150
10135 -31150 -45795 -80007 -110203 -61449 -53579 -88166 -39060 -18543 -5385 -17506 -2988 -1255
10123 -1255 38370 63608 91412 66846 18303 46122 54690 40741 48077 36512 24025 16974
$$ packed form
10207A06018m0287j5978m4208m8040J9590K8915K5425M504M042n929n1791K2158
10195D419k9287R887N2809k0401m1832J6159K6362O354j5562m8607j7456K9704
10183b7451j4664K1842L0594L0710p590m9541j4992K1641L0352L3115j129k5784
10171B7103M8213j7041n2099J0850N9428J650j8550L4617l0104m6291m1988j5514
10159c9726N1835k3394k0699L9367P208K0112j749L3978j8117l41o1246o7902
10147h0674l1927N7253M4259J4445l3007K8590J5310P748n7938o1004J5889M9906
10135c1150j4645l4212l0196M8754P870l4587M9106K0517J3158j2121J4518J733
10123a255L9625K5238K7804k4566m8543K7819Q568j3949P336j1565j2487p051
$$ plain form
10111 16974 -21925 -29899 11330 24646 -83523 -59995 -56575 -65959 -27076 2996 9608 67899
10099 67899 94967 56259 12196 -31732 -75668 -64702 10651 34310 14303 -6199 -3378 13459
10087 13459 5412 -35119 -38370 -81577 -80861 -34145 39220 34816 32765 -6099 10851 -7213 -53425
10074 -53425 -42010 -39597 -35300 -64892 -10650 75455 88182 40599 27391 35591 69393 80397
10062 80397 -18827 -30482 -412 30447 -21269 -83147 -65177 -21207 33278 46193 46114 19008
10050 19008 6426 -65556 -84009 -2626 64951 49027 16688 10648 -35717 -72734 -103110 -76483
10038 -76483 -44870 -39002 28405 -12889 -81642 -83358 3393 19919 63287 27353 6491 46026
10026 46026 74191 73944 74824 57096 50624 82810 81975 50158 17908 -3675 34696 48635 70346
$$ packed form
10111A6974l8899p974M1229J3316j08169K3528L420r384L8883L0072O612N8291
10099F7899K7068l8708m4063m3928m3936J0966P5353K3659k0007k0502K821J6837
10087A3459q047m0531l251m3207P16M6716P3365m404k051l8864J6950j8064m6212
10074e3425J1415K413M297k9592N4242Q6105J2727m7583j3208Q200L3802J1004
10062H0397r9224j1655L0070L0859n1716o1878J7970M3970N4485J2915p9k7106
10050A9008j2582p1982j8453Q1383O7577j5924l2339o040m6365l7017l0376K6627
10038g6483L1613N868O7407m1294o8753j716Q6751J6526M3368l5934k0862L9535
10026D6026K8165k47Q80j7728o472L2186q35l1817l2250k1583L8371J3939K1711
$$ plain form
10013 70346 58015 9535 54464 50817 66537 58133 45812 65523 37578 60062 68382 46813
10001 46813 29933 -10002 1726 14988 45163 30997 -3166 -36391 -32626 -12832 -61646 -95265
9989 -95265 -77203 -80143 -58006 46947 4886 -44223 3537 -12301 -43551 -29886 -23111 -19779
9977 -19779 -55009 -119105 -107090 -61191 -75352 -74659 -99166 -33379 -5113 15092 20211 129
9965 129 -42556 -81653 -44985 -31990 -8167 -6757 -55926 -38110 45526 71285 43522 -3582
9953 -3582 -40936 13166 67733 87270 101093 125502 133516 149412 117584 21958 3866 -63373
9941 -63373 -25488 -12164 61239 101227 42019 1205 29052 66255 74377 116413 134175 115969
9929 115969 56397 56396 46312 25800 54391 58126 44341 54682 74998 39224 1919 18722 42609
$$ packed form
10013G0346j2331m8480M4929l647J5720q404j2321J9711k7945K2484Q320k1569
10001D6813j6880l9935J1728J3262L0175j4166l4163l3225L765J9794m8814l3619
9989i5265J8062k940K2137J04953m2061m9109M7760j5838l1250J3665O775L332
9977a9779l5230o4096J2015M5899j4161O93k4507O5787K8266K0205N119k0082
9965A29m2685l9097L6668J2995K3823J410m9169J7816Q3636K5759k7763m7104
9953c582l7354N4102N4567J9537J3823K4409Q014J5896l1828r5626j8092o7239
9941f3373L7885J3324P3403L9988n9208m0814K7847L7203Q122M2036J7762j8206
9929A15969n9572jj0084k0512K8591L735j3785J0341K0316l5774l7305J6803K3887
$$ plain form
9916 42609 32802 -12110 20181 17124 26367 45559 20518 1018 31597 70142 125766 205008
9904 205008 193342 108867 68590 13239 34262 49222 15869 -1393 4254 19408 25580 26372
9892 26372 39840 45900 26554 34738 17779 52332 127194 134132 86225 21727 -13206 15642
9880 15642 -9602 34287 52328 -31679 -54097 25707 98961 149036 93026 51057 30305 60507
9868 60507 118232 148687 171389 96875 79433 60604 45774 45065 63430 50394 64254 31027
9856 31027 44097 81728 40027 32138 61646 23750 10576 21487 43945 88438 100902 66098
9844 66098 79357 63021 92265 186299 151807 77161 100770 98391 53951 103431 98904 125197
9832 125197 98179 75263 50791 20678 9223 15554 44490 42937 15439 23306 31963 33242 29077
$$ packed form
9916D2609r807m4912L2291l057R243J9192k5041j9500L0579L8545N5624P9242
9904B05008j1666q4475m0277n5351K1023J4960l3353j7262N647J5154O172P92
9892B6372J3468O060j9346Q184j6959L4553P4862O938m7907o4498l4933K8848
9880A5642k5244M3889J8041q4007k2418P9804P3254N0075n6010m1969k0752L0202
9868F0507N7725L0455K2702p4514j7442j8829j4830p09J8365j3036J3860l3227
9856C1027J3070L7631m1701p889K9508l7896j3174J0911K2458M4493J2464l4804
9844F6098J3259j6336K9244R4034l4492p4646K3609k379m4440M9480m527K6293
9832A25197k7018k2916k4472l0113j1455O331K8936j553k7498P867Q657J279m165
$$ plain form
9819 29077 35602 23678 19266 -888 9138 44225 60998 103235 68191 88675 126677 130003
9807 130003 157116 129235 75788 73640 55020 71181 50650 -1410 14263 18351 7236 -65740
9795 -65740 -75564 -66416 -55237 -22645 5779 9923 -14211 9006 46947 31333 2838 -775 10099
9782 10099 45296 13054 9576 83591 133072 117602 43661 25404 39414 71280 37799 16933
9770 16933 62946 94242 72855 40627 29252 20869 12659 31015 37543 45224 99977 93459 72186
9757 72186 83075 70761 21157 36298 15170 15240 9590 24383 42701 111700 139183 91409 -7253
9744 -7253 27985 52464 31029 46983 58525 73870 14405 -8564 22634 37052 43179 59636
9732 59636 70723 113802 87922 35019 50104 10299 -37052 -91407 -65581 28609 117309 111094
$$ packed form
9819B9077O525j1924m412k0154J0026L5087J6773M2237l5044K0484L8002L326
9807A30003K7113k7881n3447k148j8620J6161k0531n2060J5673M088j1115p2976
9795f5740r824R148J1179L2592K8424M144k4134K3217L7941j5614k8495l613J0874
9782A0099L5197l2242l478P4015M9481j5470p3941j8257J4010L1866l3481k0866
9770A6933M6013L1296k1387l2228j1375q383q210J8356O528P681N4753o518k1273
9757G2186J0889j2314m9604J5141k1128P0n650J4793J8318O8999K7483m7774r8662
9744g253L5238K4479k1435J5954J1542J5345n9465k2969L1198J4418O127J6457
9732E9636J1087M3079k5880n2903J5085l9805m7351n4355K5826R4190Q8700o215
$$ plain form
9720 111094 43223 59669 110805 92166 55992 72789 39387 55472 83085 50305 -19903 -22529
9708 -22529 29140 71770 88164 87528 107404 102019 76090 81404 64013 25607 2955 31594 78674
9695 78674 123188 70798 27117 -6683 -44415 -44380 21919 64288 36614 17873 39609 19486
9683 19486 6168 24729 27923 57351 78139 83894 77874 94486 104170 92759 93055 110187 40220
9670 40220 7626 72167 145835 115102 84346 50698 41939 44683 46442 47851 41940 55534 46647
9657 46647 101023 107535 70023 30208 -16979 39260 106376 57557 75020 142464 135034 91868
9645 91868 80792 57480 2483 42919 92731 56074 67455 76510 120469 111110 91461 103640
9633 103640 85039 71884 60499 29272 8177 76783 86219 37941 64618 93814 82042 82148
$$ packed form
9720A11094o7871J6446N1136j8639l6174J6797l3402J6085K7613l2780p0208k626
9708b2529N1669M2630J6394o36J9876n385k5929N314j7391l8406k2652K8639M7080
9695G8674M4514n2390m3681l3800l7732L5O6299M2369k7674j8741K1736k0123
9683A9486j3318J8561L194K9428K0788N755o020J6612R684j1411K96J7132o9967
9670D0220l2594O4541P3668l0733l0756l3648q759K744J759J409n911J3594q887
9657D6647N4376O512l7512l9815m7187N6239O7116m8819J7463O7444p430m3166
9645I1868j1076k3312n4997M0436M9812l6657J1381R055M3959r359j9649J2179
9633A03640j8601j3155j1385l1227k1095O8606R436m8278K6677K9196j1772J06
$$ plain form
9621 82148 87319 98192 125273 127567 195618 197271 124422 35619 3215 30277 16107 46161
9609 46161 113435 177045 222250 297153 324671 349269 335635 305266 372577 434335 439242 503651
9597 503651 531268 478996 463625 530104 696265 866768 878125 832898 769755 768079 674172
9586 674172 568444 543724 440444 374854 396552 382905 394999 398527 428905 528291 604398
9575 604398 718898 881014 994215 1023332 1001828 967338 937463 845528 782270 781811 700492
9564 700492 649707 640566 652922 675762 689749 638518 688909 790174 867970 933017 1032188 1227414
9552 1227414 1517409 1922258 2318309 2376187 2039788 1631413 1259703 1000061 765289 642221
9542 642221 609525 578756 619469 593609 628866 700439 650615 688556 734005 791325 851722 845304
$$ packed form
9621H2148N171J0873K7081K294O8051J653p2849q8803l2404K7062j4170L0054
9609D6161O7274O3610M5205P4903K7518K4598j3634l0369O7311O1758M907O4409
9597E03651K7617n2272j5371O6479J66161J70503J1357m5227o3143j676r3907
9586F74172j05728k4720j03280o5590K1698j3647J2094L528L0378R9386P6107
9575F04398J14500J62116J13201K9117k1504l4490k9875r1935o3258m59q1319
9564G00492n0785r141J2356K2840J3987n1231N0391J01265P7796O5047R9171J95226
9552A227414K89995M04849L96051N7878l36399m08375l71710k59642k34772j23068
9542F42221l2696l0769M0713k5860L5257P1573m9824L7941M5449N7320O0397o418
$$ plain form
9530 845304 876848 919293 919104 937093 856365 783446 780966 677869 559529 507899 424644 380111
9518 380111 346835 347016 368706 408269 487045 533601 583200 636323 682049 812286 880964 827178
9506 827178 669680 576629 507575 468351 336109 324709 320274 268884 231456 212865 267375
9495 267375 282084 184130 223635 203022 217296 203771 168791 212490 207926 167312 120392 148710
9483 148710 184726 173926 183879 148782 180430 221143 197860 165270 194719 171744 125616 144781
9471 144781 212227 235778 210181 213706 223979 219425 219356 160317 185240 229376 203310 197657 204241
9458 204241 192688 192286 183456 189005 176219 139967 173504 214906 212854 180517 155638 188240 144075
9445 144075 162282 193038 217338 275762 320165 305226 220961 188420 212624 303564 298167 266074
$$ packed form
9530H45304L1544M2445j89J7989q0728p2919k480j03097j18340n1630q3255m4533
9518C80111l3276J81K1690L9563P8776M6556M9599N3123M5726J30237O8678n3786
9506H27178j57498r3051o9054l9224j32242j1400m435n1390l7428j8591N4510
9495B67375J4709r7954L9505k0613J4274j3525l4980M3699m564m0614m6920K8318
9483A48710L6016j0800R953l5097L1648M0713k3283l2590K9449k2975m6128J9165
9471A44781O7446K3551k5597L525J0273m554o9n9039K4923M4136k6066n653O584
9458B04241j1553m02q830N549j2786l6252L3537M1402k052l2337k4879L2602m4165
9445A44075J8207L0756K4300N8424M4403j4939q4265l2541K4204R0940n397l2093
$$ plain form
9433 266074 285398 306211 313629 291401 293176 307373 278141 281907 252318 283434 333581 354452
9421 354452 327487 263120 273490 297858 305868 309093 289043 255754 245462 284343 356770 365298
9409 365298 370804 339554 359076 359900 403925 426549 447669 460533 441203 453631 436985 396619
9397 396619 425915 403579 407074 428957 450049 424641 335093 344061 337748 318194 356603 461817
9385 461817 535803 597915 622061 631916 680076 744837 748793 731883 771616 836250 885068 940168
9373 940168 1047562 1098899 1231654 1285414 1332100 1417943 1572129 1636686 1751443 1949289 2221821
9362 2221821 2486155 2747015 3108592 3577012 4022948 4577062 5269383 6088783 7045891 8311941
9352 8311941 9994591 12096525 14696764 17902918 21798460 26169774 30447136 33958658
$$ packed form
9433B66074J9324K0813P418k2228J775J4197k9232L766k9589L1116N0147K0871
9421C54452k6965o4367J0370K4368Q010L225k0050l3289j0292L8881P2427Q528
9409C65298N506l1250J9522Q24M4025K2624K1120J2864j9330J2428j6646m0366
9397C96619K9296k2336L495K1883K1092k5408q9548Q968o313j9554L8409J05214
9385D61817P3986O2112K4146R855M8160O4761L956j6910L9733O4634M8818N5100
9373I40168J07394N1337J32755N3760M6686Q5843J54186O4557J14757J97846K72532
9362B221821K64334K60860L61577M68420M45936N54114O92321Q19400R57108J266050
9352H311941J682650K101934K600239L206154L895542M371314M277362L511522
$$ plain form
9344 33958658 36212527 37015267 36593400 35206394 32744052 29365167 25570071 21891123
9336 21891123 18758953 16245966 14264831 12745355 11526914 10630577 9947288 9440369 9090511
9327 9090511 8853893 8793260 8890055 9137517 9401564 9844757 10401175 11139661 12119568 13325581
9317 13325581 14887909 17043180 19776964 23331474 27908353 33928127 41767757 51303685
9309 51303685 61906587 71905703 78895357 81377554 80208848 76815470 71464722 63413115
9301 63413115 53210999 42992323 34353308 27693050 22787794 19158790 16422372 14299182
9293 14299182 12778082 11590032 10582426 9755059 9113682 8734908 8472848 8352528 8298491
9284 8298491 8326156 8558052 8951571 9402820 10009573 10779533 11816107 13126866 14812096
$$ packed form
9344C3958658K253869Q02740m21867j387006k462342l378885l795096l678948
9336B1891123l132170k512987j981135j519476j218441q96337o83289n06919l49858
9327I090511k36618o0633R6795K47462K64047M43193N56418P38486R79907J206013
9317A3325581J562328K155271K733784L554510M576879O019774P839630R535928
9309E1303685J0602902R999116O989654K482197j168706l393378n350748q051607
9301F3413115j0202116j0218676q639015o660258m905256l629004k736418k123190
9293A4299182j521100j188050j007606q27367o41377l78774k62060j20320n4037
9284H298491K7665K31896L93519M51249O06753P69960J036574J310759J685230
$$ plain form
9275 14812096 16997006 19643955 22723373 26257877 29827201 32762029 34568018 34968573
9267 34968573 34151112 32289869 29577590 26042174 22074579 18158436 14695176 11910698
9259 11910698 9768540 8154945 6906375 5902781 5041313 4345338 3786341 3365447 3042347
9250 3042347 2776590 2473277 2145940 1903442 1768474 1589721 1438905 1325277 1236676 1174568
9240 1174568 1089485 992377 951419 910839 903313 900712 913149 928104 903054 834348 806418 830679
9228 830679 750860 701973 668378 678218 693116 662915 633763 579714 556065 540175 610566 600689
9216 600689 587410 572670 538985 532722 489605 527226 553000 469117 477129 455086 444412 471289
9204 471289 470490 449323 440148 447059 490803 473886 488522 478980 402379 441724 464798 476270 425769
$$ packed form
9275A4812096K184910K646949L079418L534504L569324K934828J805989M00555
9267C4968573q17461j861243k712279l535416l967595l916143l463260k784478
9259A1910698k142158j613595j248570j003594q61468o95975n58997m20894l23100
9250C042347k65757l03313l27337k42498j34968j78753j50816j13628q8601o2108
9240A174568q5083r7108m0958m0580p526k601J2437J4955k5050o8706k7930K4261
9228H30679p9819m8887l3595R840J4898l0201k9152n4049k3649j5890P0391r877
9216F00689j3279j4740l3685o263m3117L7621K5774q3883Q012k2043j0674K6877
9204D71289p99k1167r175O911M3744j6917J4636r542p6601L9345K3074J1472n0501
$$ plain form
9191 425769 402491 409025 410301 403279 403655 394276 405177 386853 366094 415311 469123 433101 403445
9178 403445 422262 398465 352749 319983 370241 392415 409748 453918 445287 463724 496414 483243
9166 483243 462383 485060 471315 462803 450940 449384 522534 570574 559702 549687 553114 559285
9154 559285 590450 619725 676198 746886 766684 790550 811356 887748 1026479 1127660 1206476
9143 1206476 1344708 1418378 1535897 1732137 1933253 2157107 2422691 2701863 3003689 3479815
9133 3479815 4164013 5100193 6255833 7844215 9921895 12682208 16261555 20445578 24143981
9124 24143981 25745133 24984947 22683478 19236955 15110447 11255066 8383213 6425647
9116 6425647 5071649 4045550 3250229 2626247 2168324 1911805 1708500 1475412 1340195
$$ packed form
9191D25769k3278O534J276p022L76r379J0901j8324k0759M9217N3812l6022k9656
9178D03445J8817k3797m5716l2766N0258K2174J7333M4170q631J8437L2690j3171
9166D83243k0860K2677j3745q512j1863j556P3150M8040j0872j0015L427O171
9154E59285L1165K9275N6473P0688J9798K3866K0806P6392J38731J01181P8816
9143A206476J38232P3670J17519J96240K01116K23854K65584K79172L01826M76126
9133C479815O84198R36180J155640J588382K077680K760313L579347M184023L698403
9124B4143981J601152p60186k301469l446523m126508l855381k871853j957566
9116F425647j353998j026099p95321o23982m57923k56519k03305k33088j35217
$$ plain form
9107 1340195 1200396 1121408 1028640 907014 844739 794622 780567 732431 701753 668959 617854
9096 617854 556859 463840 464717 489922 470862 480244 457891 431438 379837 343540 363103 416270
9084 416270 359968 299978 325800 314944 311330 296555 299274 285675 290802 242781 232264 223442
9072 223442 214887 215514 236120 228441 188240 216928 303430 409228 367457 217022 151280 150563
9060 150563 149881 194146 219565 194191 159080 142527 144979 184872 140738 129186 238514 273758
9048 273758 206657 200925 213283 208571 213606 220993 193582 144561 115085 131919 178105 208639
9036 208639 210954 270582 274845 218895 170562 177975 168015 163354 183329 234386 281186 291941 254078
9023 254078 192919 182653 140176 188403 220466 261699 236963 150259 131382 52231 78242 98339
$$ packed form
9107A340195j39799p8988r2768j21626o2275n0117j4055m8136l0678l2794n1105
9096F17854o0995r3019Q77K5205j9060R382k2353k6453n1601l6297J9563N3167
9084D16270n6302n9990K5822j0856l614j4775K719j3599N127m8021j0517q822
9072B23442q555O27K0606p679m0201K8688Q6502J05798m1771j50435o5742p17
9060A50563o82M4265K5419k5374l5111j6553K452L9893m4134j1552J09328L5244
9048B73758o7101n732J2358m712N035P387k7411m9021k9476J6834M6186L0534
9036B08639K315N9628M263n5950m8333P413r960m661J9975N1057M6800J0755l7863
9023B54078o1159j0266m2477M8227L2063M1233k4736q6704j8877p9151K6011K0097
$$ plain form
9011 98339 54609 54551 93371 111286 109089 107806 154530 161339 152168 138279 168119 242615 187121
8998 187121 88349 72177 74393 71370 65097 79099 115799 116887 107508 100086 86810 124859 126895
8985 126895 61274 -6001 -5754 36623 41026 48594 73412 77395 40588 112260 142759 149267 131174
$$ packed form
9011I8339m3730n8L8820J7915k197j283M6724O809r171j3889K9840P4496n5494
8998A87121r8772j6172K216l023o273J4002L6700J088r379p422j3276L8049K036
8985A26895o5621o7275K47M2377M403P568K4818L983l6807P1672L0499O508j8093
$$ [...]
##END NTUPLES=NMR SPECTRUM
##END=
