##TITLE=Analysis number 330455
Compound Code cc 63710
Book Reference 561/2
Project Code adrs
Chemist Name chrisr
##JCAMPDX= 6.0         $$ Bruker NMR JCAMP-DX V2.0
##DATA TYPE= NMR SPECTRUM
##DATA CLASS= NTUPLES
##ORIGIN= Bruker BioSpin GmbH
##OWNER= nmr
$$ XWIN-NMR		Version 3.5
$$ Tue Nov 27 12:19:54 2007 GMT Standard Time (UT+0h)  MAYBRIDGE\nmr@NMR_250MHZ
##.OBSERVE FREQUENCY= 250.131544655141
##.OBSERVE NUCLEUS= ^1H
##.ACQUISITION MODE= SIMULTANEOUS (DQD)
##.ACQUISITION SCHEME= undefined
##.AVERAGES= 16
##.DIGITISER RES= 18
##SPECTROMETER/DATA SYSTEM= dpx250
##.PULSE SEQUENCE= zg30
##.SOLVENT NAME= CDCl3
##.SHIFT REFERENCE= (INTERNAL, CDCl3, 0, 16.522)
##AUDIT TRAIL= $$ (NUMBER, WHEN, WHO, WHERE, WHAT)
$$ ##TITLE= Audit trail, XWIN-NMR		Version 3.5
$$ ##JCAMPDX= 5.01
$$ ##ORIGIN= Bruker BioSpin GmbH
$$ ##OWNER= nmr
$$ C:\u/data/dgb/nmr/ADRS/2310/pdata/1/auditp.txt
$$ ##AUDIT TRAIL=  $$ (NUMBER, WHEN, WHO, WHERE, WHAT)
(   1,<2007-11-27 12:19:26.31 +000>,<MAYBRIDGE\nmr>,<NMR_250MHZ>,
      <created by zg, POWCHK disabled, PULCHK disabled
       configuration hash MD5:
       76 6E 9A 78 1E 09 19 81 EC 84 63 8F B0 6A 59 2D
       data hash MD5: 64K
       1C 16 06 04 56 8D 95 0C B3 A3 4C E9 E5 92 3B D6>)
(   2,<2007-11-27 12:19:43.28 +000>,<MAYBRIDGE\nmr>,<NMR_250MHZ>,
      <Start of raw data processing
       ef LB = 0.3 FT_mod = 6 PKNL = 1 SI = 32K 
       data hash MD5: 32K
       3F BB 3A 8F EC BF 2F 25 3F 42 1F 00 EC 67 1B 2B>)
(   3,<2007-11-27 12:19:44.97 +000>,<MAYBRIDGE\nmr>,<NMR_250MHZ>,
      <apk 
       data hash MD5: 32K
       6F 5E 3B C2 13 34 DB 93 17 20 18 E6 DD 13 5B 39>)
(   4,<2007-11-27 12:19:46.17 +000>,<MAYBRIDGE\nmr>,<NMR_250MHZ>,
      <abs ABSG = 5 
       data hash MD5: 32K
       21 D5 23 C8 B6 53 F2 C4 8C F1 DC 01 FC A3 29 BE>)
$$ ##END=
$$ 
$$ hash MD5
$$ 8F 44 B8 98 41 1F 90 95 68 06 8C 28 8A EF 8D 7D
##$RELAX= 
##$RELAX= 
##$RELAX= 
##$RELAX= 
##$RELAX= 
##$RELAX= 
##$RELAX= 
$$ Bruker specific parameters
$$ --------------------------
##$DU= <C:\u>
##$EXPNO= 2310
##$NAME= <ADRS>
##$PROCNO= 1
##$TYPE= <nmr>
##$USER= <dgb>
##$AMP= (0..31)
100 100 100 100 100 100 100 100 100 100 100 100 100 100 100 100 100 100 
100 100 100 100 100 100 100 100 100 100 100 100 100 100 
##$AQSEQ= 0
##$AQ_mod= 3
##$AUNM= <au_zg>
##$AUTOPOS= <3 >
##$BF1= 250.13
##$BF2= 250.13
##$BF3= 250.13
##$BF4= 250.13
##$BF5= 500.13
##$BF6= 500.13
##$BF7= 500.13
##$BF8= 500.13
##$BYTORDA= 1
##$CFDGTYP= 0
##$CFRGTYP= 5
##$CHEMSTR= <none>
##$CNST= (0..31)
1 1 145 1 1 1 1 1 1 1 1 1 1 1 1 1 1 1 1 1 1 1 1 1 1 1 1 1 1 1 1 1 
##$CPDPRG= <>
##$CPDPRG1= <>
##$CPDPRG2= <>
##$CPDPRG3= <>
##$CPDPRG4= <mlev>
##$CPDPRG5= <mlev>
##$CPDPRG6= <mlev>
##$CPDPRG7= <mlev>
##$CPDPRG8= <mlev>
##$CPDPRGB= <>
##$CPDPRGT= <>
##$D= (0..31)
0 1 0 0 0 0 0 0 0 0.06 0 0 0 0 0 0 0.0002 0 0 0 0 0 0 0 0 0 0 0 0 0 0 
0 
##$DATE= 1196165964
##$DBL= (0..7)
120 120 120 120 120 120 120 120 
##$DBP= (0..7)
150 150 150 150 150 150 150 150 
##$DBP07= 0
##$DBPNAM0= <>
##$DBPNAM1= <>
$$ [...]
##$SUBNAM7= <"">
##$SUBNAM8= <"">
##$SUBNAM9= <"">
##$SW= 20.6930455092707
##$SWIBOX= (0..15)
0 0 3 0 0 0 0 0 0 0 0 0 0 0 0 0 
##$SW_h= 5175.983436853
##$TD= 65536
##$TD0= 1
##$TE= 295.16
##$TE2= 300
##$TE3= 300
##$TEG= 300
##$TL= (0..7)
0 120 120 120 120 120 120 120 
##$TP= (0..7)
150 150 150 150 150 150 150 150 
##$TP07= 0
##$TPNAME0= <>
##$TPNAME1= <>
##$TPNAME2= <>
##$TPNAME3= <>
##$TPNAME4= <>
##$TPNAME5= <>
##$TPNAME6= <>
##$TPNAME7= <>
##$TPOAL= (0..7)
0.5 0.5 0.5 0.5 0.5 0.5 0.5 0.5 
##$TPOFFS= (0..7)
0 0 0 0 0 0 0 0 
##$TUNHIN= 0
##$TUNHOUT= 0
##$TUNXOUT= 0
##$USERA1= <user>
##$USERA2= <user>
##$USERA3= <user>
##$USERA4= <user>
##$USERA5= <user>
##$V9= 5
##$VALIST= <valist>
##$VCLIST= <CCCCCCCCCCCCCCC>
##$VD= 0
##$VDLIST= <DDDDDDDDDDDDDDD>
##$VPLIST= <PPPPPPPPPPPPPPP>
##$VTLIST= <TTTTTTTTTTTTTTT>
##$WBST= 1024
##$WBSW= 4
##$XGAIN= (0..3)
0 0 0 0 
##$XL= 0
##$YL= 0
##$YMAX_a= 411292
##$YMIN_a= -463247
##$ZGOPTNS= <>
##$ZL1= 120
##$ZL2= 120
##$ZL3= 120
##$ZL4= 120
##$ABSF1= 16.522
##$ABSF2= -4.171173
##$ABSG= 5
##$ABSL= 3
##$ALPHA= 0
##$AQORDER= 0
##$ASSFAC= 0
##$ASSFACI= 0
##$ASSFACX= 0
##$ASSWID= 0
##$AUNMP= <proc_1d>
##$AZFE= 0.1
##$AZFW= 0.1
##$BCFW= 0
##$BC_mod= 0
##$BYTORDP= 0
##$COROFFS= 0
##$CY= 12.5
##$DATMOD= 1
##$DC= 0
##$DFILT= <>
##$DTYPP= 0
##$F1P= 14.0000005364418
##$F2P= -0.99999901652339
##$FCOR= 0.5
##$FTSIZE= 32768
##$FT_mod= 6
##$GAMMA= 0
##$GB= 0
##$INTBC= 1
##$INTSCL= 1
##$ISEN= 128
##$LB= 0.3
##$LEV0= 0
##$LPBIN= 0
##$MAXI= 10000
##$MC2= 0
##$MEAN= 0
##$ME_mod= 0
##$MI= 0
##$NCOEF= 0
##$NC_proc= -4
##$NLEV= 6
##$NOISF1= 0
##$NOISF2= 0
##$NSP= 0
##$NTH_PI= 0
##$NZP= 0
##$OFFSET= 16.522
##$PC= 1
##$PHC0= 167.4005
##$PHC1= 8.906337
##$PH_mod= 1
##$PKNL= yes
##$PPARMOD= 0
##$PSCAL= 4
##$PSIGN= 0
##$REVERSE= no
##$SF= 250.13
##$SI= 32768
##$SIGF1= 0
##$SIGF2= 0
##$SINO= 400
##$SIOLD= 32768
##$SREGLST= <1H.CDCl3>
##$SSB= 0
##$STSI= 32768
##$STSR= 0
##$SW_p= 5175.98343685301
##$SYMM= 0
##$S_DEV= 0
##$TDeff= 65536
##$TDoff= 0
##$TI= <Analysis number 999999
Compound Code 99
Book Reference 9
Project Code 9>
##$TILT= no
##$TM1= 0
##$TM2= 0
##$TOPLEV= 0
##$USERP1= <user>
##$USERP2= <user>
##$USERP3= <user>
##$USERP4= <user>
##$USERP5= <user>
##$WDW= 1
##$XDIM= 32768
##$YMAX_p= 356662050
##$YMIN_p= -383947
$$ End of Bruker specific parameters
$$ ---------------------------------
##NTUPLES= NMR SPECTRUM
##VAR_NAME=  FREQUENCY,     SPECTRUM/REAL,   SPECTRUM/IMAG
##SYMBOL=    X,             R,               I
##VAR_TYPE=  INDEPENDENT,   DEPENDENT,       DEPENDENT
##VAR_FORM=  AFFN,          ASDF,            ASDF
##VAR_DIM=   32768,         32768,           32768
##UNITS=     HZ,            ARBITRARY UNITS, ARBITRARY UNITS
##FACTOR=    0.157963299565203, 1,           1
##FIRST=     4132.6476996994, 0,             0
##LAST=      -1043.33573715361, 0,           0
##MIN=       -1043.33573715361, -383947,     0
##MAX=       4132.6476996994, 356662050,     0
$$ Real data points
##PAGE= N=1
##DATA TABLE= (X++(R..R)), XYDATA
$$ [...]
20075c096l0470j4599j0796j4267k2449l6076K1918M8903Q28Q290K5330l1759
20063e8243m6908k3537K5455J11223L6035q9592j3508L5330j9531k0960j995M4802
20051b1429O4197K1238M143L6678l0773N255p392q158p937n480l0156k3196M5431
20038D2421P679J4948j2218J9768m510j931n492k770J8622q753R17j9975l1256
20025A7450L375Q618l5875l2427r672M3835N0969o6049m4996L1792K0056J5001
20013B077l4894J2004L9777l187L5460L0922k9822p2133L092L2945K5843L5471
20001G7555q489J8510M8940o738o1457o0527j348Q5992R188j8345m8526N6452
19989I1207J3233k6157J4444k8924m0177m3868j5159K0090K0333N8995O938l8168
$$ plain form
20075 -3096 -33566 -48165 -58961 -73228 -95677 -131753 -109835 -60932 -60104 -51814 -26484 -58243
20063 -58243 -105151 -128688 -103233 7990 44025 -45567 -59075 -23745 -43276 -64236 -66231 -21429
20051 -21429 42768 64006 68149 104827 74054 79309 71917 63759 55822 50342 20186 -3010 42421
20038 42421 50100 65048 52830 72598 68088 66157 60665 57895 76517 67764 68681 48706 17450
20025 17450 20825 29443 -6432 -38859 -48531 -4696 46273 -19776 -64772 -32980 -12924 2077
20013 2077 -32817 -20813 18964 15777 51237 82159 52337 -19796 -16704 16241 42084 77555
20001 77555 69066 87576 136516 129778 68321 7794 6446 92438 101626 83281 34755 91207
19989 91207 104440 78283 92727 63803 23626 -20242 -35401 -15311 5022 64017 70955 32787
19977C2787r2871k6039L6658K2586O443O5418O9513m9086m1356o461n1848L8109
19965C853J4012j6554k2674m3682J2459K1181P947r753M5980q321k2887L2800
19953A4361L0711k4658p5282L3491O9023K345K74K7116L818j9938l0224K3147
19941E4184q0928n5912K4134j4098O4896J6443m4177o2396K0244k8114m8023K8604
19929a25143K9547M4623k7865P691M5571L5794O216k770O991m590L996k1078k4254
19916b5271K8722M8764p1356o1601j0123R855K1173j9218L8292L2167l6811r1675
19904a37082l6611M7170M6855l2727J4262L0556J3938N8799M815l1608L3942L8492
19892E0801M915J8772n4071k5961R2059J6385j8664n4548K6110N7676j9285q190
$$ plain form
19977 32787 -60084 -86123 -49465 -26879 -20436 44982 114495 65409 24053 17592 -34256 3853
19965 3853 17865 1311 -21363 -65045 -52586 -31405 -23458 -33211 12769 4448 -18439 14361
19953 14361 45072 20414 -54868 -21377 47646 49991 50265 77381 81199 61261 31037 54184
19941 54184 -26744 -82656 -58522 -72620 -7724 8719 -35458 -97854 -77610 -105724 -153747 -125143
19929 -125143 -95596 -50973 -78838 -71147 -25576 10218 16434 13664 20655 16065 20061 -1017 -25271
19916 -25271 3451 52215 -19141 -80742 -90865 -81010 -59837 -79055 -40763 -8596 -45407 -137082
19904 -137082 -173693 -126523 -79668 -112395 -98133 -67577 -53639 5160 9975 -21633 12309 50801
19892 50801 55716 74488 20417 -5544 86515 102900 84236 29688 55798 113474 94189 85999
19880H5999J2488k9232m5018N454J3075O623j1747j8199j7070l825k8668L2291
19868B171K262n4167N220M3488R452k250K5710m6962k9955L0777J8953j5149j880
19855a2330N3793k8734r391R082l3184J5936r787o187j4189K6220J5837l1030
19843b3964J7255M1796J5838m3814p9567K0104j3700r64L9155j0984j0507j8926
19831f8278j4400P560J775O435l6340P9092O4760L138k6155o8248J9612m3103
19819g4152R483j4069l0430j1181O9638P622M7204L4076K6792L635n1817n9115
19807d2314J6687m033L3464N2297j7635O2280k4932m585M477k3536r1288k5291
19795f4409P5481L535N3223j0091k4500o687j8962n4681O6250l139k7087M1126
$$ plain form
19880 85999 98487 69255 24237 29691 42766 49389 37642 19443 2373 -1452 -30120 2171
19868 2171 4433 -49734 -44514 -1026 8426 6176 31886 -15076 -45031 -14254 4699 -10450 -12330
19855 -12330 41463 12729 3338 12420 -20764 -4828 -14615 -20802 -34991 -8771 7066 -23964
19843 -23964 -6709 35087 50925 7111 -72456 -52352 -66052 -67016 -27861 -38845 -49352 -68278
19831 -68278 -82678 -75118 -73343 -66908 -103248 -24156 40604 43742 17587 -50661 -31049 -74152
19819 -74152 -64669 -78738 -109168 -120349 -50711 -43089 4115 38191 64983 68618 16801 -42314
19807 -42314 -25627 -29660 3804 56101 38466 100746 75814 71229 75706 52170 -39118 -64409
19795 -64409 11072 14607 67830 57739 33239 26552 7590 -47091 19159 16020 -11067 30059
19783C0059K3726k5053J2988m499k6346l8997M1503K1507p757k5636M603l1851
19771b5753Q518K0914M2200K7642n3830o812J2303m3018j6717R5040J7351l7091
19759D0747k9149K4158j1634n830k8707j6777n489q488L2547J00181j1066m3847
19747C6646m4847l3851P1365m380l2585J2913k3768l6546J873J5652o3395j1123
19735a12046L6127N869J4079m2068k1714J33P698Q6492J3555l6772q030L4571
19723b2106L5512J09l2677l1398L828n652M1007Q685l5213j0246L2832M4613J8344
19710D7638k2699N6785n4180m0278L2725M0323R784P429j946l5132r243k5276
19698E930K0123r17o1531k5002J976q432J6911L5484L8940M355k6552k1212n426
$$ plain form
19783 30059 53785 28732 41720 37221 10875 -28122 13381 34888 27131 1495 6098 -25753
19771 -25753 -17235 3679 45879 73521 19691 12879 25182 -17836 -34553 60487 77838 40747
19759 40747 11598 35756 24122 18292 -10415 -27192 -32681 -41169 -8622 91559 80493 36646
19747 36646 -8201 -42052 29313 24933 -7652 5261 -18507 -55053 -53180 -37528 -100923 -112046
19735 -112046 -75919 -70050 -55971 -98039 -119753 -119620 -111922 -25430 -11875 -48647 -56677 -22106
19723 -22106 13406 13515 -19162 -50560 -46732 -52384 -11377 -2692 -37905 -48151 -15319 29294 47638
19710 47638 24939 81724 27544 -12734 19991 60314 70098 77527 75581 40449 31206 5930
19698 5930 26053 25136 -36395 -61397 -59421 -67853 -50942 -15458 23482 27837 1285 -19927 -25353
19685b5353N1453o8132n9170P239j001K0295K4283K3145M3292j1571L8696Q5684
19673A28860J2681j2670j6522l6502m0698J3793K7825k5582n0720o037M1387n814
19661C0001m7317K3992L7427J8897p5039n2491j1495j2116K3224K0274N0028O2133
19649F7518J1010o4481N996J4903k5607m0082m5893j3708K4459J7963N9532R3500
19637A05110M5735l5192n4274n483j188J9100J7583o8332m6698M160N5103J5248
19625E0872R9L4948k2068j0579j4155J6080j6391j802k9584k6811k9168l2193
19613h0752q536J8127k2101J2455M278J239L1037J3570p3542n866M6914N872k783
19600f0088j8279L0757Q4541J3767m8522J847k9189J4453M4599J2794m1362k3510
$$ plain form
19685 -25353 26100 -42032 -101202 -93963 -94964 -74669 -50386 -27241 16051 4480 43176 128860
19673 128860 141541 128871 112349 75847 35149 48942 76767 51185 465 -5572 35815 30001
19661 30001 -17316 6676 44103 63000 -12039 -64530 -76025 -88141 -64917 -44643 5385 67518
19649 67518 78528 14047 20043 34946 9339 -30743 -76636 -90344 -65885 -47922 11610 105110
19637 105110 150845 115653 61379 55896 54708 73808 91391 23059 -23639 -19479 35624 50872
19625 50872 50971 85919 63851 53272 39117 55197 38806 37004 7420 -19391 -48559 -80752
19613 -80752 -89288 -71161 -93262 -80807 -76529 -75290 -44253 -30683 -104225 -110091 -63177 -57305 -60088
19600 -60088 -78367 -47610 36931 50698 2176 4023 -25166 -10713 33886 46680 5318 -18192
19588a8192M3315k5737j5964l3482j5919o155R7702J5727R248J3498p1719k3657
19576c1335J7621Q1839l5908m7872Q281O4016r718o296j7415l3408L153O318k4768
19563b5492j0843m432M9914j1301J3500l4923j7159j3257M390N0098P2091o875
19551F5711m4503l2527M148k6186n3592L1433M1148J20584K2694k798r6784n1012
19539b1684P2483L4474m4863l0028j6185M8826K4222j6664j2076n53M3479O907
19527H8338m2486J899r566K5106l680j5888j9660P271J8714N6067j598l2777k4341
19514D7399j7567K8766N5846Q64n293n3523j2049K7788L7665l0446P719o3558
19502B3611N1002k164n0430J4983P370j2564l0622o28M0758M6288J8609n3709
$$ plain form
19588 -18192 25123 -614 -16578 -50060 -65979 -72134 25568 41295 50543 64041 -7678 -31335
19576 -31335 -13714 68125 32217 -15655 -7374 56642 46924 40628 23213 -10195 -7042 -724 -25492
19563 -25492 -36335 -40767 9147 -2154 11346 -23577 -40736 -53993 -49603 495 72586 65711
19551 65711 21208 -11319 -7171 -33357 -86949 -55516 -14368 106216 128910 126112 29328 -21684
19539 -21684 50799 85273 40410 10382 -5803 43023 67245 50581 38505 37952 81431 88338
19527 88338 45852 47751 38185 63291 59611 43723 24063 31334 50048 106115 104517 71740 47399
19514 47399 29832 58598 114444 115308 110015 56492 44443 72231 109896 79450 87169 23611
19502 23611 74613 72449 22019 37002 44372 31808 1186 558 41316 87604 106213 52504
19490E2504l6966j6064M958k1580o7124J8117P6862J2115l299n3868r741N1119
19478G033K9486n35l9275N392K1690N0308o157p4556M163J4692n605J960j1284
19465b688m0288R427M9794K2497k8442m8323m7455m801K1584L6468N7882p0814
19453d5159l0005N6618O0631M9854L628l5546k2593M8515N9079o1222J9586N951
19441A09337n5259l1170o520m747k09O503M7387O1731o807o9001r4815k1595P8144
19428A2979l2757r359r339l0140K2766N9943j5082m0088L8663J3885J9268K1948
19416E2687j0705l103K1010p7300j4630K0773K3938j424J6977k1485j9078M0832
19404B8492L8653o8165k7163j5714l9903M831M6227K7140j1666k7595L149L7271
$$ plain form
19490 52504 15538 -526 4432 -17148 -84272 -66155 10707 22822 19523 -34345 -44086 7033
19478 7033 36519 35984 -3291 2101 23791 74099 67942 -6614 -2451 12241 6636 8596 -2688
19465 -2688 -42976 -33549 16245 38742 10300 -38023 -85478 -90279 -68695 -32227 25655 -45159
19453 -45159 -75164 -18546 42085 91939 95567 60021 37428 85943 145022 83800 103386 109337
19441 109337 54078 22908 16388 11641 11432 17935 65322 127053 120246 51245 -43570 -65165 12979
19428 12979 -19778 -29137 -38476 -68616 -45850 14093 -989 -41077 -2414 11471 30739 52687
19416 52687 41982 38879 59889 -17411 -32041 -11268 12670 11246 28223 6738 -12340 28492
19404 28492 67145 -1020 -28183 -43897 -83800 -78969 -32742 -5602 -17268 -44863 -41714 -4443
19392d443o670O055K1808k881j939J4558l8339k491Q600O663m0761L1250R4062
19379H5472q8423m9743M0767j2822K2310J3057L0073K7340m9351l0190M9455M5262
19367H3207p823r0788J9442N0142J4893J802j0658j0723m8513m6428J0949N309
19355b9189M4698N7643o350q121l2557k8164j4260M8948m1527K3566O9512p127
19343G7072k6550J0044K3227J2219k7562p7064J8371O532J7425k4417L0704J6094
19331E6095l5365j9324L0099n1447K346O92K9495o0001k5335M0322K5910J9315
19319A2802K6008M2048k472o7597j8152L8895O0647M1229l1619k3609j509l2801
19307D3870M1549Q6557m4842p4723p7347n4979K7914M6464M534o1029M074N8474
$$ plain form
19392 -4443 -11113 -5058 16750 13869 11930 26488 -11851 -14342 -5742 921 -39840 -8590 85472
19379 85472 -2951 -52694 -11927 -24749 -2439 10618 40691 68031 18680 -11510 37945 83207
19367 83207 75384 -15404 4038 54180 69073 70875 60217 49494 981 -45447 -34498 -29189
19355 -29189 15509 73152 66802 58681 26124 -2040 -16300 32648 -8879 14687 84199 77072
19343 77072 50522 60566 83793 96012 68450 -8614 9757 16289 33714 9297 40001 56095
19331 56095 20730 1406 31505 -19942 -17596 -16904 12591 -47410 -72745 -32423 -6513 12802
19319 12802 38810 80858 78386 10789 -7363 31532 92179 133408 101789 78180 76671 43870
19307 43870 85419 171976 127134 52411 -24936 -79915 -52001 -5537 -1003 -62032 -57958 516
19295E16J595J0581P3127P711O769n3967n5009l2105Q209j3423k1300O6833l1234
19282c1697Q837L243K687L6880K4386k0825k9574k8735j6493K9638K41l5745J1126
19269d6031P4301m2560m7463N1710n9789n5631j4761R1684M4336R091j4980m07
19257a0500L4229L4250k32J3927L626j7351m2547k5838r460Q037j6236J2358M3085
19244B7348J5197n9911q996M5898j2954n1360j2133o3877m9573L5866N5230R1
19232g9174K1906j3932n910r575P7878K5094K1640N2886L2657p4234n7762k9720
19220c8246L2307n9570J3526J6399Q8026M8487N033o364k0769l6012J1308P1661
19208A25786N7125j19036l4754k8559K2716M7677j5419l4976J5341N0483j4455
$$ plain form
19295 516 2111 12692 85819 93530 100299 46332 -8677 -40782 -32573 -45996 -67296 -463 -31697
19282 -31697 -22860 -19617 -16930 19950 44336 23511 -6063 -34798 -51291 -21653 -21412 -57157 -46031
19269 -46031 28270 -14290 -61753 -10043 -69832 -125463 -140224 -48540 -4204 4887 -10093 -10500
19257 -10500 23729 57979 57747 71674 75300 57949 15402 -10436 -19896 -11859 -28095 -15737 27348
19244 27348 42545 -17366 -26362 19536 6582 -44778 -56911 -120788 -170361 -134495 -79265 -79174
19232 -79174 -57268 -71200 -77110 -86685 -8807 16287 37927 90813 123470 49236 -8526 -38246
19220 -38246 -5939 -65509 -51983 -35584 52442 100929 105962 99598 78829 42817 54125 125786
19208 125786 182911 63875 29121 562 23278 70955 55536 20560 35901 86384 71929
19197G1929o1616J5298k3082K4787L9353r151l7802k2960j8278K7154J2936j262
19185A7306N3232O1358K8488p865M509o1274o3628n4812n731O7750J9777k3260
19173C5850P999J9717k6751j5424k351l1250l6235k1160M1674L5353L0231j3634
19161B4019M8274j9885n376K1258l563m5044p6194l5846N5279L7251k171P803
19149E805Q2952K4567o2463k4038J8152M3397J9902p6430m5834K9914L9387M6285
19137A01596k4792n2460l6274L7732j2178N3890J13921J03042O6522m3329j12412
19126A95258o0610l844p2844k9963N1177l4530l9530k6552k7783J0365L2754L764
19114b338l1551K3293k2567J7185O2191M8812j972J2471n51n000m6634R015k8213
$$ plain form
19197 71929 10313 25611 2529 27316 66669 57518 19716 -3244 -21522 5632 18568 17306
19185 17306 70538 131896 160384 152519 157028 95754 32126 -22686 -28417 39333 59110 35850
19173 35850 43849 63566 36815 21391 19040 -12210 -48445 -69605 -27931 7422 37653 24019
19161 24019 72293 52408 47032 68290 64727 19683 -56511 -92357 -37078 173 -1998 5805
19149 5805 88757 113324 50861 26823 44975 88372 108274 31844 -13990 15924 55311 101596
19137 101596 76804 24344 -11930 25802 13624 67514 181435 284477 350999 307670 195258
19126 195258 134648 130804 57960 27997 79174 44644 5114 -21438 -49221 -38856 -6102 -2338
19114 -2338 -33889 -10596 -33163 -15978 46213 95025 93053 105524 104973 99973 53339 62354 34141
19101C4141M2260K2670n9778k5442n924j2439J2868m0708k2643J35514J01429
19090A81948m958j4974o8555p1373M3547K6596j03525n86O3614Q4062k342Q4496
19078B17950O1974l162m2726N7961J04704L0181J046P5779O6285l8929o3767q6201
19066C81095r9944K7477R1532n1951k5510J41496R3593M7747Q3499m0469l5598
19055F12967r5794n7831N445k3208n5261l332n314j060m4644p5566q0297J3956
19043A90061m502k5719m0026j6670J4198k1559m5893J8348N589K7328P2612P7742
19031B51509K7709m0029J4627O761J7704l7543j3699N4842n9292N245O7180Q8551
19019C83565Q1419Q7159J07328P2790M2860m0697j28874n581K4570L74L4371K9341
$$ plain form
19101 34141 76401 99071 39293 13851 7927 -4512 8356 -32352 -54995 80519 181948
19090 181948 176990 162016 93461 22088 65635 92231 -11294 -11880 51734 135796 133454 217950
19078 217950 279924 276762 234036 291997 396701 426882 427928 503707 569992 531063 467296 381095
19066 381095 281151 308628 400160 348209 322699 464195 557788 605535 689034 648565 612967
19055 612967 517173 459342 464787 441579 386318 382986 377672 376612 331968 256402 176105 190061
19043 190061 185559 159840 119814 103144 117342 95783 49890 68238 73827 101155 173767 251509
19031 251509 279218 239189 253816 260577 278281 240738 227039 281881 222589 227834 295014 383565
19019 383565 464984 552143 659471 732261 775121 734424 605550 599969 624539 624913 659284 688625
19007F88625o5856l787J1393N950K6749m8239o9769r9815r4315n8277q7109l5482
18995A70068L8461l3207R374k0072L2360L5806n438k0584p9267o9604l6271K8782
18983E0408J2021o1914J7665K9806P639K3087J8639Q239r739l7726l498Q7217
18971A41844M9391m5112l8099j9877k7114K3916k794K6972O110q171p0858j02962
18959f6754N488O8864N9290o7343l3934K0844K992p560Q0335K2580K8572j469
18947A11905j290p3312q282K3955M9048j5732J8237j8192J4832J2794J6248l5675
18935I4536k797J5225n9192J1910J1891k2784m937o896p381p498m7100K6764N3429
18922E5170L7994o5037P580M3724R3455K0321p8742m0784m8514k8384K3598O3347
$$ plain form
19007 688625 622769 618982 630375 636325 663074 614835 545066 445251 350936 292659 205550 170068
18995 170068 208529 175322 184696 164624 196984 232790 227352 206768 127501 57897 21626 50408
18983 50408 62429 515 18180 47986 55625 78712 97351 105590 95851 58125 54627 141844
18971 141844 191235 146123 108024 88147 61033 84949 82155 109127 115237 107066 36208 -66754
18959 -66754 -61266 7598 66888 -455 -34389 -13545 -10553 -18113 62222 84802 113374 111905
18947 111905 110615 37303 29021 52976 102024 86292 104529 86337 101169 113963 130211 94536
18935 94536 91739 106964 47772 59682 71573 48789 43852 36956 29575 22077 -25023 1741 55170
18922 55170 93164 28127 35707 79431 172886 193207 114465 73681 25167 -3217 20381 83728
18910H3728N4343j055j4376M6222k0481r455P0046j4607p3517n4867k2360J7680
18898F1301K5757j0757l6217j2135K0762j398m6226K1355K9138k7611O737L7569
18886F8275O1337M8872K4666j0116m0910n893L9452l9804N365J1247j5490n0738
18874I6263M768q9636o563N0999O7985K161n0543j542Q9055K116k4541l6154k685
18861A01683J5193M6970R873r9839j5988n0229j2448J4016p921j9034K8265P0746
18849H1287L777p247K7739m0647N985L3374M43K3683k3001l0603O996L2341K9140
18836A43267J4990q3558o2052j3544Q8284k7608J9815J19070P850m0949k6384
18825A39181k8764K6546M512J9060J5446n5710p3407M2788J04573k4391n2932
$$ plain form
18910 83728 138071 137016 122640 168862 148381 138926 208972 194365 120848 65981 43621 61301
18898 61301 87058 76301 40084 27949 48711 47313 1087 22442 51580 23969 30706 68275
18886 68275 129612 178484 203150 193034 152124 146231 185683 145879 151244 162491 147001 96263
18874 96263 101031 11395 4832 55831 123816 125977 75434 73892 162947 165063 140522 104368 101683
18861 101683 116876 163846 173719 73880 57892 7663 -4785 9231 1310 -17724 10541 81287
18849 81287 85064 77817 105556 64909 70894 104268 104711 128394 105393 74790 81786 114127 143267
18836 143267 158257 74699 12647 -897 87387 59779 79594 198664 206514 165565 139181
18825 139181 110417 136963 141475 160535 175981 120271 46864 89652 194225 169834 116902
18814A16902L4493R990N096k5125J1634J9437j266K6487K8891j7651n200j3799
18802A89889K3725L369n8997j6102L082N8362N3216K5145N6083L611p1507k097
18790B67779j2924o3438M2535K241n164P919k4022k2498p681K3045N8857m1108
18778B25541l8474N6341K4930J5041n0782m4921J5585M3201O0462J57722K71446
18767G36092L2078j55502q5137j04772p0692o1410m5250l9004j1369l1175K2864
18756A86723P7515J6770M0339L0256k5349J2383L8824M8258k7673N7305P6021
18745E31372M2154L539j3492J5419j4251N4567K2752J6711M0204J5855j1545k0670
18733F82615k1887Q6035M936k5477p2840k820q688k1929o0939L5688N0126M6548
$$ plain form
18814 116902 151395 161385 166481 141356 152990 172427 171161 197648 226539 208888 203688 189889
18802 189889 213614 216983 157986 141884 144966 203328 256544 281689 337772 341383 269876 267779
18790 267779 254855 191417 233952 236193 231029 238948 214926 192428 184747 207792 266649 225541
18778 225541 187067 243408 268338 283379 232597 187676 203261 246462 306924 464646 736092
18767 736092 768170 612668 527531 422759 352067 290657 245407 206403 195034 163859 186723
18756 186723 264238 281008 321347 351603 326254 338637 377461 425719 398046 455351 531372
18745 531372 573526 577065 563573 578992 564741 619308 642060 658771 698975 714830 703285 682615
18733 682615 660728 746763 751699 726222 653382 650562 641874 619945 559006 594694 644820 691368
18721F91368N0902k4723p0547q7331J914J940r0971j10514l3136K6023L5952k2440
18709C68437m2434O0581j0692o1236r766P5192m142P550j9150j6272N5901N3252
18697D57221J26186N7003j6506L6533J9963M050K7967J08339P3082J20251P6120
18686A090209N5036o6477n5740o3175k1353O6874O7226K4395L9034P5424J24286
18675A335739j4639r4740l4554k9947K393o9284r7655k2701k7899m9610n6430
18664H40673n0551o5161l8533o9932k9143o0345k6680q281p972l9950m8794m1603
18652C53728j18094n1356L3746O9275J2398k9414l0278r697P6288K5265P902O4228
18640D03991n9987k6434L3376l7730N860r432k4494K5309P6693J04167J18670
$$ plain form
18721 691368 742270 717547 647000 559669 561583 563523 472552 362038 328902 354925 390877 368437
18709 368437 326003 386584 375892 314656 304890 380082 375940 383490 364340 348068 403969 457221
18697 457221 583407 640410 623904 660437 680400 684450 712417 820756 893838 1014089 1090209
18686 1090209 1145245 1078768 1023028 959853 938500 1005374 1072600 1096995 1136029 1211453 1335739
18675 1335739 1321100 1226360 1191806 1161859 1164252 1094968 997313 974612 946713 897103 840673
18664 840673 790122 724961 686428 616496 587353 527008 500328 492047 484075 444125 395331 353728
18652 353728 235634 184278 218024 287299 299697 270283 240005 230308 306596 331861 339763 403991
18640 403991 344004 317570 350946 313216 319076 309644 285150 310459 387152 491319 609989
18629F09989M0605N0395L8127l3144N673O1850l0048j35830M8879O2021O0947
18618G79464M2024o0237k0026Q630q1087l5239M741o3405o4778n6549l7278k1540
18606C94720l3584J8774R9947O0754Q2174L2789o9131k251J5368m1251L4766Q121
18594F01196o6952l5538P9133O0680N3105R3007N8062k2670L8209K7610K3484
18583I09326L6412J16419R5656P2959Q8313M6169L3272J13986R9538J79793J86675
18572A978518K48412K56479L03370M45683N07619M91703N20765N76785N61632
18563E890966P99164J216490J798716K587670L134441L030048K120604O53898
18555B1231997n9345k81180Q515N44877J250738K174956L503951N574158R174678
$$ plain form
18629 609989 650594 700989 739116 705972 711645 773495 743447 607617 656496 718517 779464
18618 779464 821488 761251 741225 749855 668768 633529 638270 574865 510087 453538 416260 394720
18606 394720 361136 379910 479857 540611 622785 655574 586443 584192 599560 558309 593075 601196
18594 601196 534244 498706 577839 638519 691624 784631 842693 820023 858232 885842 909326
18583 909326 945738 1062157 1157813 1230772 1319085 1365254 1398526 1512512 1612050 1791843 1978518
18572 1978518 2226930 2483409 2786779 3232462 3740081 4231784 4752549 5329334 5890966
18563 5890966 6690130 7906620 9705336 12293006 15427447 18457495 20578099 21231997
18555 21231997 21172652 20891472 20899987 21444864 22695602 24870558 28374509 33948667 43123345
18546D3123345J5040416K2190171K6126266K6230900J5731069J922461o970409
18539A43394219j5106083j9156626j9105882j6852441j2534791p716911k973951
18532D9947534J177675L290431K755920j295247n614269p496353p650616o643617
18524B8471458n234815m044643k980938k072077j279193p75858m80948k91151
18516A1311835j06024J15018L59145N39514N97555O91152Q33427J097798J639494
18507A7078914K464387L790349N703786Q275756J0384775J0556426P718043J930141
18499F7902577k164683l794514k933722k20642L522490R040861J6596543K4551456
18491A12500366L2024129L4178705K5950401J3425992r264901k6747240l2660069
$$ plain form
18546 43123345 58163761 80353932 106480198 132711098 148442167 150364628 143394219
18539 143394219 128288136 109131510 90025628 73173187 60638396 52921485 49947534
18532 49947534 51125209 54415640 57171560 55876313 50262044 42765691 35115075 28471458
18524 28471458 23236643 19192000 16211062 14138985 12859792 12083934 11602986 11311835
18516 11311835 11205811 11320829 11679974 12219488 12817043 13508195 14341622 15439420 17078914
18507 17078914 19543301 23333650 29037436 37313192 47697967 58254393 65972436 67902577
18499 67902577 65737894 61943380 59009658 58789016 62311506 71352367 87948910 112500366
18491 112500366 144524495 178703200 204653601 218079593 208814692 182067452 149407383
18484A49407383l2001754k6392324k0301273j5157173j0956119p420533m389772
18477C2788435j895011J39153J341301J384435l59207l004956m246738m581229
18469B1566183m026415l123699k307198j862585j418249j028425q60515p73720
18461F165377q00814p30797n35335l86981l76457k88628k72417j99884j92923
18452B381141k01882p6854l5698j55588j73567j18957j14236r2704j04948o7013
18442A239694P855m7304l864K36l0414l5539l6552o831L1786K6233k9557o1571
18430A054172o7329n6235l6455P410M2330L6923p2348k4564K4533r9264q4339
18419G24834J918Q0015l4745j14521r1018p9898m4202k4330K3877L3004m7240
$$ plain form
18484 149407383 117405629 91013305 70712032 55554859 44598740 37178207 32788435
18477 32788435 30893424 31032577 32373878 33758313 33399106 30394150 26147412 21566183
18469 21566183 17539768 14416069 12108871 10246286 8828037 7799612 6939097 6165377
18461 6165377 5364563 4633766 4098431 3711450 3334993 3046365 2773948 2574064 2381141
18452 2381141 2179259 2102405 2066707 1911119 1737552 1618595 1504359 1411655 1306707 1239694
18442 1239694 1247549 1200245 1196381 1196617 1166203 1130664 1094112 1087281 1119067 1145300 1115743 1054172
18430 1054172 986843 930608 894153 901563 943893 980816 908468 883904 908437 809173 724834
18419 724834 726752 806767 772022 657501 566483 486585 442383 418053 441930 474934 427694
18408D27694J569P4253K9853r532n1583o3945N3240P4390M4117N1999m148m2352
18396E85555n6812k3360j6320K4142J117o5822l9685O857M6014M1876j3725j1748
18384D78089K5700K4K2230J4197p5374k7737P602k3127N7874L9674m3304p3346
18372D02502K8485o8159k7606J4342J0538K0236K1931m3714R41K0163m4216q20
18360C34623K3830J0387J1047N9729R9176J21184O4791q237J1501j795J8942p2373
18348F72805j29925q9756j8325J2572L0941j8132P4330l0296l4414j2104m5893
18337D11803m998k6317J6774R578l5274j7830j2423N6780J7904K3084M6296m328
18325D81049n2587J0032J2392K754l9099n5104O267J6099J09898P0646M1526J2279
$$ plain form
18408 427694 429263 503516 533369 523837 472254 408309 461549 535939 580056 632055 627907 585555
18396 585555 528743 505383 489063 513205 514322 448500 408815 415672 461686 503562 489837 478089
18384 478089 503789 503813 526043 540240 464866 437129 444731 421604 479478 519152 475848 402502
18372 402502 430987 362828 335222 349564 360102 380338 402269 358555 359496 379659 335443 334623
18360 334623 358453 368840 379887 439616 538792 659976 724767 716530 728031 726236 745178 672805
18348 672805 542880 453124 434799 447371 478312 460180 534510 504214 469800 457696 411803
18337 411803 406805 380488 397262 406840 371566 353736 341313 398093 415997 439081 485377 481049
18325 481049 428462 438494 450886 453640 414541 359437 365704 381803 491701 562347 603873 616152
18313F16152R685k028M0446j4061K3931r32O0425L2904r21J4478J3994M6661K1217
18300H61951R6579P9040L3741n77o362L221k1913q15J190q6364o4875O489j0455
18287H90850K3808K6728Q5097R1818J15787P8109K8260O0022N8794n1578n8146
18276A349549J2552L3863J41197Q6069J5724O9096J32642J35316J55138J85491
18266B316637K39193K38539K64309L08264L85191M07315L72594L46634M02650
18257E281326L57697K90229K91224L17998L99924O05541Q17676J084191J383728
18248A0829534J925352K800244L924366M613725L995966K907011L151938L440320
18240C7588456J364180K06099J294998K725190L216217M055511P046297J2271307
$$ plain form
18313 616152 625837 623809 664255 650194 674125 673193 733618 766522 765601 780079 794073 840734 861951
18300 861951 958530 1037570 1071311 1070734 1064372 1067593 1045680 1044865 1046055 959691 894816 901305 890850
18287 890850 914658 941386 1026483 1118301 1234088 1312197 1340457 1400479 1459273 1407695 1349549
18276 1349549 1362101 1395964 1537161 1623230 1638954 1708050 1840692 1976008 2131146 2316637
18266 2316637 2555830 2794369 3058678 3366942 3752133 4159448 4532042 4878676 5281326
18257 5281326 5639023 5929252 6220476 6538474 6938398 7543939 8361615 9445806 10829534
18248 10829534 12754886 15555130 19479496 24093221 28089187 30996198 34148136 37588456
18240 37588456 38952636 39158735 40453733 43178923 46395140 50450651 57496948 69768255
18232F9768255J9320628K4772712K5309330K9434681L4398527K9239894J0218915
18225B42462942j0927627j5834276j6296868j8701387k0542048j6865301j4233621
18218A29061814j4739123j3313110r463425l588958K231047J911851o550572j1025973
18210G4523551q887063p070244p921387q049153o637034m959111l621749k476123
18202B4901687j478661p56150j01018O80489J677709K876562L391704K265477
18194C3457799J249610K173957M073143N841500P296749Q885654J0159979J1593748
18186H4732139J1926111J0301213Q489265O797595L742369N328110J2470453J6442237
18178A60229492J2850578P271604R580882J1692082Q246703J3737848K5141506
$$ plain form
18232 69768255 89088883 113861595 139170925 168605606 203004133 232244027 242462942
18225 242462942 231535315 215701039 199404171 180702784 160160736 143295435 129061814
18218 129061814 114322691 101009581 91546156 87957198 90188245 92100096 85549524 74523551
18210 74523551 65636488 58566244 50644857 42595704 35958670 30999559 27377810 24901687
18202 24901687 23423026 22666876 22565858 23246347 24924056 27800618 31192322 33457799
18194 33457799 34707409 36881366 40954509 46796009 54092758 62978412 73138391 84732139
18186 84732139 96658250 106959463 115448728 122246323 125988692 131316802 143787255 160229492
18178 160229492 173080070 180351674 189932556 201624638 209871341 223609189 248750695
18171B48750695O284349k4462167k8180243j9018438j8770552k7773987k8549547
18164A08280110k2068645j5965489j1784087q627174o353732m102254j656789
18157C7721940j35832l36931j463959k777342l059727l062088k955006k428925
18149B1502130j614183j035353m30452P8616L44977R62128K033561L665348N867142
18140C1373914P804745N145402j552701m092881k993516j430731K84732K678807
18132C7217771O184970R261536P366107N946187J1320578J5916436J1692176K502598
18124A07408359m624481j4178739j6779769j3147910r620658o942490m391654
18117C7722658k611592j777702j70759K273019N969548J2791024K5233238L8361481
$$ plain form
18171 248750695 255035044 230572877 202392634 183374196 164603644 136829657 108280110
18164 108280110 86211465 70245976 58461889 49834715 43480983 39378729 37721940
18157 37721940 37586108 37249177 35785218 33007876 29948149 26886061 23931055 21502130
18149 21502130 19887947 18852594 18422142 18500758 18845735 19807863 21841424 25506772 31373914
18140 31373914 39178659 44324061 42771360 38678479 35684963 34254232 34538964 37217771
18132 37217771 43402741 52664277 60030384 65976571 77297149 93213585 104905761 107408359
18124 107408359 102783878 88605139 71825370 58677460 49056802 42114312 37722658
18117 37722658 35111066 33333364 33162605 35435624 41405172 54196196 79429434 117790915
18109A17790915J4125076k7988623k7588536j7042166j2765405j1187097q495385
18102B6848779n821145m201891l206422k302237j565484j135990r79765p47262
18094F888583p34108o97395n85093m76243m61219m95692l73533k76595k03438
18085B585267k20819k07246j00693l1012p9002n2345n9240j22869j09848m6799
18075A555394p0028n2705q1547k8660J2541p2504n3091j9708n4896j684r0692
18064A042420q8393m8426J4394j400m5264M1806J0359k2287m334j13111p9196
18053G06568j9602n8032J9886k3307k5501l5950P512o014Q327K972l9167J6184
18041E53876M5228Q073m641L8020M6500o621O7797l2339o9659k3782j3222J7464
$$ plain form
18109 117790915 131915991 103927368 76338832 59296666 46531261 35344164 26848779
18102 26848779 21027634 16825743 13619321 11317084 9751600 8615610 7635845 6888583
18094 6888583 6154475 5457080 4871987 4395744 3934525 3438833 3065300 2788705 2585267
18085 2585267 2364448 2157202 2056509 2025497 1946495 1894150 1834910 1712041 1602193 1555394
18075 1555394 1485366 1432661 1351114 1322454 1334995 1262491 1209400 1189692 1134796 1133112 1042420
18064 1042420 954027 905601 919995 918595 873331 915137 925496 903209 898875 785764 706568
18053 706568 686966 628934 648820 625513 600012 564062 571574 565560 573887 576859 537692 553876
18041 553876 599104 607177 602536 640556 687056 680435 748232 715893 646234 622452 609230 626694
18029F26694k348K286j8029J0935K3531L0843K4964L9360L1421n910k0534K1864
18017G65077P4504L4643N2386M0989p230l8057K1717j0302J2140P0629O0804R672
18005A086972j2694K1744Q898l0918q5485j01082r4325j20294p2627n5811j817
17994E42561l5758j2999L2443O6414j8765j8671L6540k8646k6477l1504n6830
17983D48308r1140j6967K0071m787M4915j0255L7003M1392o6121j3327l766K3165
17971D08491M9814J0701K1352L5282Q7281O5319l4897j4685k0437J4762J4729
17960F37712R6958j2374j1160r662o0179o2443p1684j59997J9172P2858Q0763
17949E19964M5974j2848j5709J5280j1203K6938n9106j00136l2730k4521q745
$$ plain form
18029 626694 624346 626632 608603 619538 643069 673912 698876 738236 769657 763747 743213 765077
18017 765077 839581 874224 926610 967599 960369 922312 944029 933727 945867 1016496 1077300 1086972
18005 1086972 1074278 1096022 1104920 1074002 988517 887435 793110 672816 600189 544378 542561
17994 542561 506803 493804 526247 592661 573896 555225 591765 563119 536642 505138 448308
17983 448308 357168 340201 360272 355485 400400 390145 427148 468540 402419 389092 385326 408491
17971 408491 458305 469006 490358 525640 612921 678240 643343 628658 608221 622983 637712
17960 637712 734670 722296 711136 701474 641295 578852 507168 347171 366343 439201 519964
17949 519964 565938 553090 537381 552661 541458 568396 509290 409154 376424 351903 343158
17938C43158M388L7566k6655O245r276p8163P77R339k3298j7997K457m3611N6726
17925B61656N1826n1091L597L014k260N3122M4550l5157J4145K6285M2894M7147
17913D59728J3904k0987k2553k1300K4719q2862o3741M625j8808l017J0143o7184
17901B12667n8844J82N2267P775o0073J2261j1658K6487P1518K5224m3541j2702
17889B21563J4387K9837K1186r9493J966J0788M1859Q60N2072q760j9952L4216
17877C00529J7020l0635J0971M5030j5989k789p5798l4920j5244J6459P754K8688
17865B51076L2469O0919Q7481p650n0997k7203K530k5607j03514l4258J5529K6250
17853B27025K9282M1812m2476m1348Q491r8853m5055N0813P6821p379J0174P025
$$ plain form
17938 343158 347546 385112 358457 364702 355426 277263 278040 287379 264081 246084 248541 204930 261656
17925 261656 313482 262391 265988 269002 266742 319864 364414 329257 343402 369687 412581 459728
17913 459728 473632 452645 430092 408792 433511 350649 286908 291533 272725 269708 279851 212667
17901 212667 153823 154005 206272 214047 153974 166235 154577 181064 252582 277806 234265 221563
17889 221563 235950 265787 286973 187480 189446 200234 242093 242953 295025 286265 266313 300529
17877 300529 317549 286914 297885 342915 326926 324137 248339 213419 198175 214634 222388 251076
17865 251076 283545 344464 431945 424295 373298 346095 348625 323018 219504 185246 200775 227025
17853 227025 256307 298119 255643 214295 222786 123933 78878 129691 206512 199133 209307 216332
17841B16332k9403K8021O5675K0009o0496p9737l6176K6114j614Q5224Q1778j8061
17829B97666o9791l4010J9614L2131k3449l3538j7256j04088l4513M6802L1908
17818A11476N2460N1805k4634q4762l8772M6722K9412M1015k8119n2021l1881
17807G2701K0822j0916L3310Q5624N0600J2408K4987n918K0311m1904R850O9210
17795C41085Q2028J6870R2262P2414k7112q1979o530P9271J5446m673P7115l4316
17783F21881n3441k2245o5922o8875m9973M1791K5179n1137J6644K216J2923n9976
17771C49065p0031l8128P0219N1146j7220J0500P6072j2030l7632K3173K8063
17760D33197K8420J0874l7345K8788P8659N0796J5489L0600j5295j3888j9244
$$ plain form
17841 216332 186929 214950 280625 300634 240138 160401 124225 150339 148725 233949 315727 297666
17829 297666 227875 193865 213479 245610 222161 188623 171367 67279 32766 79568 111476
17818 111476 163936 215741 191107 106345 67573 114295 143707 184722 156603 104582 72701
17807 72701 93523 82607 115917 201541 252141 264549 289536 283618 303929 262025 271875 341085
17795 341085 423113 439983 532245 604659 577547 495568 489038 568309 583755 579082 656197 621881
17783 621881 568440 546195 480273 411398 361425 403216 428395 377258 393902 396118 409041 349065
17771 349065 279034 240906 311125 362271 345051 355551 431623 419593 381961 405134 433197
17760 433197 461617 472491 435146 463934 542593 593389 608878 639478 624183 610295 591051
17749E91051P3648J00250P3124L5267N5366P3285J11023Q4592O7789K2826J44945
17738A433166J81984J63188J58456J34787J06241J45148K01237K15179K18165
17729B957551L74385M78696N74226N91685P38442Q11900J062618J344042J982720
17720A0916265L234523M911821M491006J122827l39605J008223L422308O317562
17712C5084930P767525N429986j21207n161790m998040j947838J622281M359634
17704D2035481J205353o180507p721115n782761m247343l491102k689374j872666
17696A1255966j308542r23226n74317k54271p7965J41580K85934L70860M45889
17687I361908O29800R09957J117363J475503J964276K627043L251188L566708
$$ plain form
17749 591051 664699 764949 838073 873340 928706 1001991 1113014 1197606 1265395 1288221 1433166
17738 1433166 1615150 1778338 1936794 2071581 2177822 2322970 2524207 2739386 2957551
17729 2957551 3331936 3810632 4384858 4976543 5714985 6526885 7589503 8933545 10916265
17720 10916265 14150788 19062609 23553615 24676442 24336837 25345060 28767368 35084930
17712 35084930 42852455 48282441 48161234 42999444 38001404 36053566 37675847 42035481
17704 42035481 43240834 37060327 29339212 23556451 19309108 15818006 13128632 11255966
17696 11255966 9947424 9024198 8449881 8195610 8117645 8259225 8545159 8916019 9361908
17687 9361908 9991708 10901665 12019028 13494531 15458807 18085850 21337038 24903746
17679B4903746M157452N462688O104482M255155J622018J006232K476828M772209
17671E4760810P862121J2811712K1052100L2302109M1645759L9240164J5347145
17664B25021920r502984j5113121j0714673q904339l654723M263045M876748k042763
17656A84229110j4411141k3130213j9900287j2258729q033505j0269818j4324478
17649H1900939j4453010j1613629q822480o272494l749953j795427j419800k628697
17641C1145449l501355l007323k262300j694462j338790j009269n56280l31875
17633A7443795j21367J30031O00538J164963J785493K750768M275570O629727
17625C4659518Q957498R181557P620598N084145M057454N076902O188905O117969
$$ plain form
17679 24903746 29061198 34523886 40628368 44883523 46505541 47511773 49988601 54760810
17671 54760810 62622931 75434643 96486743 128788852 170434611 209674775 225021920
17664 225021920 215518936 200405815 189691142 180786803 177132080 181395125 186271873 184229110
17656 184229110 169817969 146687756 126787469 114528740 106495235 96225417 81900939
17649 81900939 67447929 55834300 47011820 40739326 36989373 35193946 33774146 31145449
17641 31145449 27644094 24636771 22374471 20680009 19341219 18331950 17775670 17443795
17633 17443795 17322428 17452459 18052997 19217960 21003453 23754221 28029791 34659518
17625 34659518 43617016 52798573 60419171 65503316 69560770 74637672 80826577 86944546
17617H6944546K507800l270364l221009K887766J2616595K4146508K8456903J7828571
17609A68897316k053465j5969609j8080491j3684113q673251q057347j1477664
17602I0901376j4330338j4578164j2396813r534980p164756n347973l704801k376068
17594B1467483j619111j790864k026441j691206j059221m05604K97245M11829
17586A3584110l87310j500027j918830j599261j251225r63150p46377o50824n51346
17577D015760m74185m14762l04548k50565j94363j34259j42960k02097j92451
17568A705570p7303n1759m3658p8654j13643o7950n8867r4503k7425l202J8761
17557A107367r5886r8747R375O9180L2465m0602m2337n2309m1673L0006m1570
$$ plain form
17617 86944546 89452346 86181982 82960973 85848739 98465334 122611842 151068745 168897316
17609 168897316 166843851 150874242 132793751 119109638 110436387 102379040 90901376
17602 90901376 76571038 61992874 49596061 40061081 32896325 27548352 23843551 21467483
17594 21467483 19848372 18057508 16031067 14339861 13280640 12875036 13172281 13584110
17586 13584110 13196800 11696773 9777943 8178682 6927457 5964307 5217930 4567106 4015760
17577 4015760 3541575 3126813 2822265 2571700 2377337 2243078 2100118 1898021 1705570
17568 1705570 1628267 1576508 1532850 1454196 1340553 1272603 1213736 1119233 1091808 1088606 1107367
17557 1107367 1011481 912734 922109 991289 1023754 983152 940815 888506 846833 876839 835269
17546H35269n9866J7220j2374m6053o9909j667K3335k4879n6152p8778k2412O6918
17534E70652L4143k008N5839k5777l9264K1485J6512j9740j9236j1258l9999m2519
17522D98830P542K5656J0551n5581k44l3089k0590j4231j4602K8621j4611P886
17510D26138o4727o4335j9055j1924n085J505O9594M5404L0667L4949K7485j8302
17498D52314j8115Q953l5506m7377l2687K4556k3350r7416j4589J6930Q4339L483
17486C21535m1401j605J8151J376L669p429j9608M5139n5010L7037J7743j1764
17474C07833r609J2807M5535p4199l1201J1121M0168p442N181R5321k3357p6480
17462B95678m7136n8755o9352m5773j7998O0847J3399L1193j6625j1833j9094
$$ plain form
17546 835269 775403 792623 780249 734196 664287 662620 685955 661076 604924 526146 503734 570652
17534 570652 604795 602787 658626 632849 593585 615070 631582 611842 592606 581348 541349 498830
17522 498830 506372 532028 542579 486998 486754 453665 433075 418844 404242 432863 418252 426138
17510 426138 361411 297076 278021 266097 261012 262517 332111 377515 408182 443131 470616 452314
17498 452314 434199 443152 407646 360269 327582 352138 328788 231372 216783 233713 318052 321535
17486 321535 280134 278529 296680 298056 301725 294296 274688 319827 264817 301854 319597 307833
17474 307833 298224 311031 356566 282367 251166 262287 302455 295013 300194 395515 372158 295678
17462 295678 248542 189787 120435 74662 56664 117511 130910 162103 145478 133645 114551
17451A14551M0643k4694j7725L5191J34667J41633O3753R7339P5832r1431j41839
17440D27920o2088k5695o6072n3958m4782N30q669k7269J1493k6583m9158Q788
17428H4457M6102j4774O79J351k8432j6854J473K8839n300J7185Q697j9596j084
17415A02743m315n594k6657M198J5582r427l022p1400R324O7369r5202o6337k6314
17402a09052M909J8623j1902K7101j3860J4933R5405O1272O3405J2438r1375q3619
17390a1722l078J6129P611L9016j5791k6671o8328Q492l241J7014J3583M9968
17378B2982j9329n6525k754O244m1437O1530M4698J6543r3288K6963R5561j6685
17366D4503p3173J9425j275l4816J1208k0982j1542m1647N5884N5706k2283k4669
$$ plain form
17451 114551 155194 130500 112775 147966 282633 424266 488019 585358 661190 569759 427920
17440 427920 365832 340137 274065 220107 175325 175855 167186 139917 151410 124827 75669 84457
17428 84457 130559 115785 116464 117815 89383 72529 74002 102841 97541 114726 123423 103827 102743
17415 102743 98428 92834 66177 70375 85957 76530 73508 2108 11432 78801 -16401 -82738 -109052
17402 -109052 -104143 -85520 -97422 -70321 -84181 -69248 26157 87429 150834 163272 71897 -11722
17390 -11722 -14800 1329 8940 47956 32165 5494 -62834 -54342 -57583 -40569 -26986 22982
17378 22982 3653 -52872 -55626 -49382 -90819 -29289 15409 31952 -61336 -34373 61188 44503
17366 44503 -28670 -9245 -10520 -45336 -34128 -55110 -66652 -108299 -52415 3291 -18992 -43661
17354d3661m6559m1506M2450P5020O2824j3591p881K9656k1292k5412j3524l8747
17342d2223K4334M2004O1884k0258o1294k4428N2028K3230K4362J3436o1717J3770
17330D5128K3916m59m5682j0327l8211M0138m883n2606J6371N9992L3917k8416
17318C8878J4938k6302k7530o5553j0349k4483J0375J4107j7952J6273O2054q776
17306b4320P496k4881k6568r288L3570L3018L1496l7408l8947M5894M7017P209
17294D4288Q488n808p431q1379j9147L2356N38m3506K1467N0677K9869K2675k9642
17281B3445m5274j165j7170m5140L8141L8940L6580J3767L1839m7497l9054k4189
17269c6777O775J8374P962J995n3060j6302L5240o512Q676P705M7755K1183n4918
$$ plain form
17354 -43661 -90220 -131726 -89276 -14256 48568 34977 27096 56752 35460 10048 -3476 -42223
17342 -42223 -17889 24115 85999 65741 4447 -19981 32047 55277 79639 93075 31358 45128
17330 45128 69044 68585 22903 12576 -25635 14503 9620 -42986 -26615 33377 67294 38878
17318 38878 53816 27514 -16 -65569 -75918 -100401 -90026 -75919 -93871 -77598 -15544 -24320
17306 -24320 -16824 -41705 -68273 -77561 -43991 -10973 20523 -16885 -55832 -9938 37079 44288
17294 44288 52776 46968 39537 -41842 -60989 -28633 -28095 -71601 -50134 543 30412 53087 23445
17281 23445 -21829 -22994 -40164 -85304 -47163 -8223 28357 42124 73963 26466 -12588 -36777
17269 -36777 -30002 -11628 -3666 -1671 -54731 -71033 -35793 -42305 -33629 -25924 21831 43014 -11904
17256a1904J2708L5817n792n2549P608L8332k1313l663l3593O5226L6701l7973
17244B9605m4872N6117P2159K7680o5382l8648R474M3974k5218q6611k3530K8411
17232a6841l574l6708l897K087r284M3582P4705L525J3812M0413o749j5135p9688
17219F248n7336M683M4510J1594J297j8175J692j8417J8185k2822P6177K3780
17207G1416o1023L6278O4323Q4038j2710l3994P7053Q6595J2931p6091j4059k137
17195B32620m1741q5180l4899K3652L4068J466j195j5341q2783n6750K0814M2060
17183C6791J5095J2261L2815K054K0079L3442M5300J9836l8543k5221M7491L2029
17171B33429P234L1699J1703O6935L4184o673Q3408P453M1605R3278P3595r848
$$ plain form
17256 -11904 804 36621 30829 -21720 -14112 24220 2907 -756 -34349 30877 67578 29605
17244 29605 -15267 40850 113009 140689 75307 36659 46133 90107 64889 -21722 -45252 -16841
17232 -16841 -20415 -57123 -61020 -58933 -68217 -24635 50070 53595 67407 107820 101071 85936 6248
17219 6248 -51088 -46405 -1895 9699 10996 -7179 -5487 -23904 -5719 -28541 47636 71416
17207 71416 10393 46671 110994 195032 182322 148328 225381 311976 324907 248816 234757 232620
17195 232620 190879 105699 70800 94452 128520 129986 128791 113450 30667 -26083 -5269 36791
17183 36791 51886 64147 96962 99016 119095 152537 197837 217673 179130 153909 201400 233429
17171 233429 240663 272362 284065 351000 385184 378511 461919 469372 510977 604255 677850 668002
17159F68002k7713L0950N2187J0752n2012Q7577J13561Q4680o1349j27587p2217
17148G06831q570K6890O4058j5101j11904p1309o5577r8116o8887q4151l2282
17137B41882n0222k3162j3789l7754L2977J749o6806K3732O7419q012m7343O547
17125A27218L2223j0313n332j310K6410J02358L9320j3532p399O6416P8012K5144
17113D59215J5482J3531M8528L6072N5933K3649l2755j0482J211O898k8881m0448
17101E47953o6421m2241j2425K0917q545O2423j2009q507j2696k4673J9911k5179
17089D38508l3308k4811n8888l9011n7568o9375j15179m9071O3818P6458J7493
17078A49066K08l4049n7121j8124l861n118m185j5687o42l6171K3405K6452j9105
$$ plain form
17159 668002 640289 671239 723426 734178 682166 769743 883304 967984 906635 779048 706831
17148 706831 698261 725151 789209 774108 662204 590895 525318 427202 358315 274164 241882
17137 241882 191660 168498 154709 116955 149932 151681 84875 108607 176026 168014 120671 127218
17125 127218 159441 149128 143796 142486 168896 271254 310574 297042 289643 356059 434071 459215
17113 459215 474697 488228 536756 572828 628761 652410 619655 609173 610384 617282 588401 547953
17101 547953 481532 439291 426866 447783 439238 501661 489652 481145 468449 443776 463687 438508
17089 438508 405200 380389 321501 282490 224922 155547 40368 -8703 55115 131573 149066
17078 149066 149274 115225 58104 39980 36119 31001 26816 11129 10487 -25684 -2279 24173 5068
17065E068l2938o3757l7033L9317M3654Q695K1404K1539K6211K2268J3013p843
17053E9598J5738m868k8377J5884K6877o485k7803o7815q3058K6811j870j6952
17041i2320K9667J07163L2751r599p834M551j5854k5124m4892J3754n8J5079l239
17028D045n447J8729K271K6324j784k2216m1480l5764K2017M8643K1835J5742
17016E2915k0070q7616m6886L2274O0358L9212m366p5938l6550K5646K5010R5917
17004E9906K6853M50k8678r5410p1838M3248N2154K055k7117j3128M6683N5760
16992E0938k105l0707L7872k2118k4183K8105k2706q0532n1538J3652n581K1662
16980h7241K5449R0723p246m1003L8571N0044J6063J7895k574l6812m094j8831
$$ plain form
17065 5068 -27870 -91627 -128660 -89343 -45689 -36994 -15590 5949 32160 54428 67441 59598
17053 59598 75336 70468 42091 57975 84852 78367 50564 -17251 -100309 -73498 -75368 -92320
17041 -92320 -62653 44510 77261 67662 59828 64379 48525 23401 -21491 -7737 -7795 7284 4045
17028 4045 -1402 17327 19598 45922 44138 21922 -19558 -55322 -33305 15338 37173 52915
17016 52915 32845 -54771 -101657 -69383 -9025 30187 25821 -50117 -86667 -61021 -36011 59906
17004 59906 86759 87209 58531 -36879 -108717 -65469 -13315 -11260 -38377 -51505 -4822 50938
16992 50938 48833 18126 55998 33880 9697 37802 15096 -65436 -116974 -103322 -108903 -87241
16980 -87241 -61792 28931 21685 -19318 19253 69297 85360 103255 100681 63869 59775 40944
16968D0944l2451j4612L5903j3961l1755j3404m631K6043K2995K696n616l6397
16956b4246J2189K3078L2519J1760J1350o5373l3995k0398N1140P3457q776R665
16944G2370n3134l6525o2639o36K7403K343K0299M2506k3449N5646P614j5342
16932C6456O4534j009m4705J0857n0770j746N14L6127O9531j5930o2368j4328
16920B7163k0688J5648m5856Q096K8191j7797j761O3007J2462j5245m9604N187
16908H803J0787l5170J5221l7657o2452K7171j2828M1870J674Q1225K4802k5916
16896C7530m0957q892l1529q3002M3186Q4433N4990o2024o8470k6275L2062J09373
16884D0425N7297j5553k9693Q06j6868p6079K4872N0105M6401l1763q1455o674
$$ plain form
16968 40944 8493 -6119 29784 15823 -15932 -29336 -33967 -7924 15071 17767 12151 -24246
16956 -24246 -12057 11021 43540 55300 66650 1277 -32718 -53116 -1976 71481 62705 72370
16944 72370 19236 -17289 -79928 -80564 -53161 -50818 -30519 11987 -11462 44184 51798 36456
16932 36456 100990 99981 55276 66133 15363 13617 14131 50258 119789 103859 41491 27163
16920 27163 6475 22123 -23733 -15637 12554 -5243 -7004 56003 68465 53220 3616 8803
16908 8803 19590 -15580 -359 -38016 -100468 -73297 -86125 -44255 -42581 38644 63446 37530
16896 37530 -3427 -12319 -43848 -126850 -83664 769 55759 -6265 -74735 -101010 -68948 40425
16884 40425 97722 82169 52476 53282 36414 -39665 -14793 35312 81713 49950 -31505 -38179
16872c8179K4544l2326l3228l6904J9809J05828J4712o3639M623n9493n8132k6532
16860a78917j8688N0891J03663L8651p123j4154O843r570M3159k6596l469K1296
16848E986n1768m6864O5585J5838m5574R590M4145k3027m7835P3771M6864o8249
16836b1538o8928M2498Q836M8288P317K9290j9958n1082n237M8758L6855k9027
16824B6072j1229J2004L9067k6882l2622r1101m728L1005M1420l795Q698l9179
16812e1270m38q158L7745J6528j1163j2625k5209J1910j8213J5767K7446K7331
16800I651J3564k7494J0324l0156j2905K3681K7553m3727k8834k2409J4812L0584
16788c5356P1456k417k0948r848M436k1117m7303l8436K6964K2785J3969L0788
$$ plain form
16872 -38179 -13635 -45961 -79189 -116093 -96284 9544 24256 -39383 -34760 -94253 -152385 -178917
16860 -178917 -197605 -146714 -43051 -4400 -11523 -25677 -18834 -28404 14755 -11841 -15310 5986
16848 5986 -45782 -92646 -27061 -11223 -56797 -47207 -3062 -26089 -73924 -153 46711 -21538
16836 -21538 -90466 -47968 -39132 9156 16473 45763 25805 -25277 -30514 18244 55099 26072
16824 26072 14843 26847 65914 39032 6410 -84691 -89419 -58414 -16994 -20789 -12091 -51270
16812 -51270 -51708 -59866 -22121 -5593 -16756 -29381 -54590 -42680 -60893 -45126 -17680 9651
16800 9651 23215 -4279 6045 -24111 -37016 -13335 14218 -29509 -58343 -80752 -65940 -35356
16788 -35356 36100 33683 12735 2887 7323 -13794 -61097 -99533 -72569 -49784 -35815 -5027
16776e027Q89j9724K7857J5491J6262m6441j9881R044l4470K4331k8969m620j1631
16763g6889O4735j7171J9883j8040K3268N6004l9925O9221K6139k6957k9827l8746
16751A1695j1630j6503o532r929L2250k1818J381M3832L3760K5597k0749k0226
16739D1128o9752L7544o964K6187L4209K381M226J4086l5802j3601m6213n0875
16727f3446j9702m5216n9868j6262R1227N1772O5335L0600K1855j3248j5234L3433
16715F1246L8664O813n504q532L7808K9293j29797q9110L8921M8616k5082l7679
16703c4343L1235K4420m4646m929n775l2192k8328m7894L8966M4286l4985J7569
16691g6616M4158j9368R713K6154j376L3214N8794j13950o2158Q463J0376N1815
$$ plain form
16776 -5027 -4138 -23862 3995 19486 35748 -10693 -30574 -21530 -56000 -31669 -60638 -65258 -76889
16763 -76889 -12154 -29325 -9442 -27482 -4214 51790 11865 81086 107225 80268 50441 11695
16751 11695 65 -16438 -22970 -32899 -649 -22467 -21086 22746 56506 82103 61354 41128
16739 41128 -28624 8920 1956 28143 62352 64733 68959 83045 47243 33642 -12571 -63446
16727 -63446 -83148 -128364 -188232 -204494 -113267 -61495 3840 34440 56295 43047 27813 61246
16715 61246 99910 106723 101219 92687 130495 159788 29991 -59119 -20198 28418 3336 -34343
16703 -34343 -3108 21312 -23334 -28263 -34038 -66230 -94558 -142452 -103486 -59200 -94185 -76616
16691 -76616 -32458 -51826 -42113 -15959 -17335 15879 74673 -39277 -101435 -92972 -82596 -30781
16679c0781M3048K6265Q699n7630L000J8558j1403m7960l214L7528q599K443l6264
16666e6310m5964K3752M7416K41r2302j8229J03233M9214J9599J0498L622p6136
16654c1366m6358M314K2974l0071P138R931k0055K2387R1204J2833q9417J1753
16642c4733O3013l2971l8554R128p0163k210k5689L3720N3242Q0688J1194l7060
16630I605J6032M3513l1883n861l6213j6990M3214N931j2552n1725q2742M8957
16618g0714K5563K5483M0852K5904n1042o537k0763j5517m7583k1040J6446M2350
16606e6598k4156N2944N8771J9190k6958j0993j5365J569M381k022J1619m7340
16594c4958m3274J3675J04962L7667k8874l4750m1717L5069R5873k0344l1465
$$ plain form
16679 -30781 12267 38532 47231 -10399 -7399 11159 -244 -48204 -51418 -13890 -22489 -20046 -56310
16666 -56310 -102274 -78522 -31106 -30865 -123167 -141396 -38163 11051 30650 41148 44770 -31366
16654 -31366 -77724 -73410 -50436 -80507 -73369 -63438 -83493 -61106 30098 42931 -46486 -34733
16642 -34733 28280 -4691 -43245 -34117 -104280 -106490 -132179 -98459 -45217 35471 46665 9605
16630 9605 25637 69150 37267 31406 -4807 -21797 21417 27348 14796 -36929 -119671 -70714
16618 -70714 -45151 -19668 21184 47088 -3954 -10491 -31254 -46771 -94354 -115394 -98948 -56598
16606 -56598 -80754 -27810 30961 50151 23193 12200 -3165 -1596 2785 763 12382 -34958
16594 -34958 -78232 -64557 40405 78072 49198 14448 -27269 7800 103673 83329 51864
16583E1864J9562k1089k6598M1195j1821l4234N2805L1957p4314r880k18k8336
16571i107q749L2123M440l8095j6026k8090m6453l9163J6049N1806P5360L2242
16559B6337o382J8041m861n0859J34387K7791j12014p6714k0596M7826L8253l2908
16547a1699k6319M330J9797R463k0909P7359K1959k8009m367j5452J7360L2102
16535G5615K563m8282l4483N3796k5399J8415M629k0658j8372K8668P2766m037
16523A05221O4924r7258j32192j01211M7N8950O4248J0541o0100K5706N1157L1499
16511B1532J4224n9724j6053q125o0024J1800r65M0399k5962P119O6181J7219
16499G621n8330n4840R09Q6834p104j0541R802N9484J3988m1193k5486M189j7156
$$ plain form
16583 51864 71426 50337 23739 64934 53113 18879 71684 103641 29327 19447 19229 -9107
16571 -9107 -17856 14267 18707 -19388 -35414 -63504 -109957 -149120 -133071 -81265 -5905 26337
16559 26337 19955 37996 33135 -17724 116663 144454 32440 -44274 -64870 -17044 21209 -11699
16547 -11699 -38018 -33688 -13891 -4428 -25337 52022 73981 45972 41605 26153 43513 75615
16535 75615 78178 29896 -4587 49209 23810 42225 46854 26196 7824 36492 109258 105221
16523 105221 170145 72887 -59305 -160516 -160469 -101519 -37271 -26730 -86830 -61124 -9967 21532
16511 21532 35756 -23968 -40021 -48146 -108170 -96370 -97335 -56936 -82898 -75779 -9598 7621
16499 7621 -50709 -105549 -104640 -17806 -24910 -35451 -25649 33835 47823 6630 -18856 -14667 -31823
16486c1823r538j9460k5072M5893j6510J081J1698L3456K7035K3685r500K3861
16474E4806L0376k2722q4521j0693K0689N9324L1452r1606p3991m8207K9414K3470
16462h2209J6028m894J963N9381J2823l6487j1555J128r563p951J0389m2369P683
16449h5633n195L1181K586J7582J3496j1095l4744j8317q055L8685P1677R031
16437B1199l6280K8700L2831j9930M3233j2182m6202o4980n5525O0057M4151k618
16425g546K1507j8184k8780n070r016J4614N7110P3661r602l5370n3617J1486
16413A1193l4460k0777n3030J6972K5523N1673m3313l3603M2124J3366J5154L9149
16401B9971O4110j9569k9936l5374L5898r141K6954k8607J5319q0095m77O7697
$$ plain form
16486 -31823 -41361 -60821 -85893 -40000 -56510 -55429 -43731 -10275 16760 40445 30945 54806
16474 54806 85182 62460 -22061 -32754 -12065 47259 78711 -12895 -86886 -135093 -105679 -82209
16462 -82209 -66181 -71075 -69112 -9731 3092 -33395 -44950 -43822 -53385 -61336 -50947 -93316 -85633
16449 -85633 -90828 -59647 -57061 -39479 -25983 -37078 -71822 -90139 -98194 -59509 12168 21199
16437 21199 -15081 13619 46450 26520 69753 57571 11369 -53611 -109136 -49079 -4928 -7546
16425 -7546 13961 -4223 -33003 -38073 -47089 -32475 24635 98296 88694 53324 -293 11193
16413 11193 -23267 -44044 -97074 -80102 -54579 -2906 -46219 -79822 -37698 -24332 -9178 29971
16401 29971 94081 74512 44576 9202 45100 35959 62913 34306 49625 -30470 -30947 36750
16389C6750N0235p150p1664L406K1050K5110J5961l173m9248l0850l6453m6836
16377i2862j6954L1045N2551k51l0827M3970M7313L2866p686m9164k9691k7520
16365d7210j6611O9615K0958l0723R2688L061r2571j1030J291n5400J7901O5500
16353A7469m085m709l9613O3897N4369N7306n0764p1940J7064L346j2592o1934
16341c2186J4923n6444n9743J5770M9351L8935J5913m7659j0155L0941J3676J3877
16329a2801M6058p17J413L5606m4481l2340M762J8105l419j7252r6122K341J310
16316i7537R633M9369Q098k8254K7090L9290j2599n9615l9440k8018j6126L1326
16304a16783K1154p791k7918j2164O808Q0491N5305k9066j3889q425L7392L4639
$$ plain form
16389 36750 86985 79835 8171 11577 32627 57737 73698 70525 21277 -9573 -46026 -92862
16377 -92862 -109816 -78771 -26220 -26471 -57298 -13328 33985 66851 59165 10001 -19690 -47210
16365 -47210 -63821 5794 26752 -3971 88717 91778 -793 -11823 -10532 -65932 -48031 17469
16353 17469 13384 8675 -30938 32959 87328 144634 93870 21930 38994 42340 29748 -32186
16341 -32186 -17263 -73707 -133450 -117680 -68329 -29394 -13481 -61140 -71295 -40354 -26678 -12801
16329 -12801 33257 32540 33953 69559 25078 -7262 -2500 15605 12186 -5066 -101188 -98847 -97537
16316 -97537 -87904 -38535 -30437 -58691 -31601 7689 -4910 -64525 -103965 -131983 -148109 -116783
16304 -116783 -95629 -103420 -131338 -143502 -136694 -56203 -898 -29964 -43853 -52278 -14886 19753
16292A9753J6078p561l4822k8718l5249K8332L6677o803R459O9551J9889k9247
16280E7339o0068o0063m4402N9326M2851L879n3786k5470P0090P0069P2952m794
16268A27923p5639q4256n1495M6620L7583L7415l6386p5993m5969N5303M9552
16257a5342P4989o5607m5438k4536M980K5853o795J4970J8788O04k8054q6999
16245a32587j6889K6709J35157L4315r189j0403o2980J6922L5690N95K3906l0507
16233A0739j5627k7126p768N6737p887K5595P4110p181l5309j9998J5183j1650
16221D9818l8859l107p135j5755K6692L2032R449R05k38q284j6324m9803j7286
16208c7895n255N6124L0012O835J8439p3146j5760L909j2619R370Q934J9826l7759
$$ plain form
16292 19753 35831 28270 -6552 -35270 -70519 -42187 -5510 -12313 -2854 66697 86586 57339
16280 57339 -2729 -62792 -107194 -47868 -5017 -1138 -54924 -80394 -10304 59765 132717 127923
16268 127923 52284 -31972 -83467 -36847 736 38151 1765 -74228 -120197 -64894 -15342
16257 -15342 59647 -5960 -51398 -75934 -70954 -45101 -51896 -36926 -18138 -17534 -45588 -132587
16245 -132587 -149476 -122767 12390 46705 37516 27113 -35867 -18945 16745 17340 41246 10739
16233 10739 -4888 -32014 -39782 16955 9068 34663 108773 101592 66283 46285 61468 49818
16221 49818 10959 7852 717 -15038 11654 43686 53135 54040 53802 45518 29194 -20609 -37895
16208 -37895 -43150 12974 42986 49821 68260 -4886 -20646 -16737 -29356 -19986 -11052 8774 -28985
16195b8985K195k5192K5000j0584L3389m7873L1543P3448j0023k0523K9044K2082
16183G3521m9139J1145L4812j3239k189l8848k6367O1289L6298K3698r254k9742
16171G1985j7143k717k0767l0816k8488o291p738q693j4863J101J8060j5959J9876
16158d2453N4658L9716k8857J710L3120j7019m7134p0632L3723J5848J5228K579
16146i513M219Q023J9304L2059J5706L2319n9565j9271k7550m2061k3564j580
16134g1474O375N0494l399q058J1430k6685p843M5552K4139j7616n0275n1904
16122i9264M457L6635N6991j0491L6008L4999J4175j4098L289j3143p558K6371
16110F8371O8186r295p702J2895m1650l4726K0532K6060j4919m6789q106m4551
$$ plain form
16195 -28985 -26790 -51982 -26982 -37566 -4177 -52050 -20507 52941 42918 22395 51439 73521
16183 73521 24382 35527 70339 57100 54911 16063 -10304 50985 87283 110981 101727 71985
16171 71985 54842 52125 31358 542 -27946 -34237 -41975 -50668 -65531 -64430 -46370 -62329 -42453
16158 -42453 12205 51921 23064 24774 57894 40875 -6259 -76891 -43168 -27320 -12092 -9513
16146 -9513 -5294 2729 22033 54092 69798 102117 42552 23281 -4269 -46330 -69894 -71474
16134 -71474 -65099 -14605 -18004 -26062 -14632 -41317 -49160 -3608 20531 2915 -47360 -99264
16122 -99264 -94807 -58172 -1181 -11672 24336 59335 73510 59412 62701 49558 42000 68371
16110 68371 136557 127262 119560 132455 90805 56079 76611 102671 87752 40963 32857 -11694
16098a1694p9702j5533L8835Q8707L9715J2393m8148k9296J0111l0363L4696m9094
16086c9373p3351l0909N9081K2075m614M1299l03K8109J8296p4908p911Q9336
16074B6827Q0180l8995o9604m003j6703r008K3307J8492J4444N0437K8008N061
16062A08443l9311m7018K8456Q5084j04484q5769k4585M8760M4632P5782L1035
16051A21025q1545n5511L069J4409Q1527J3742j8757j3070j1550p3140l9369o685
16039f5855p01O1671J9931J0437K7429m4690l7370N655J0669l3623N368j1054
16027e2133n9465Q184M6621K5273L4842O3282o7306q0913m8766N6444N5218m02
16015a9121K1380N498m3907m0018k3101j757K6623N2495j4490L4473J4305j08394
$$ plain form
16098 -11694 -91396 -106929 -68094 20613 60328 72721 24573 -4723 5388 -24975 9721 -39373
16086 -39373 -112724 -143633 -84552 -62477 -67091 -25792 -26095 2014 20310 -54598 -62509 26827
16074 26827 107007 68012 -1592 -5595 -22298 -31306 -7999 10493 24937 75374 103382 108443
16062 108443 69132 22114 50570 135654 31170 -54599 -79184 -30424 14208 89990 121025
16051 121025 39480 -16031 -12962 1447 82974 96716 77959 64889 53339 -19801 -59170 -65855
16039 -65855 -66556 -4885 15046 25483 52912 8222 -29148 -23493 -12824 -46447 -41079 -52133
16027 -52133 -111598 -103414 -56793 -31520 3322 66604 -702 -81615 -130381 -73937 -18719 -19121
16015 -19121 2259 7757 -36150 -76168 -99269 -101026 -74403 -21908 -36398 -1925 12380 -96014
16003i6014o3389P2985K3292J9728j5561k2183N8638q491M561k991K8066K3492
15991B2133N3447m5357l0145J5932l3937o832J1053K9171M7655J6473n3486m3702
15979a7595N8737N8550l82m3047L3633p0264n1064O332N2290J833K0103K2490
15967G1616l4517n194l0658k0618M1985J01562k1581o9932l2562j7970L0106o8601
15955e6364K9877K6863L2150O5300K8224k0881m7426m0508l213n004L3021k0332
15943B1707r0130M1513L2434m1724J3291M288J297j1722K2323K9713K0679K6517
15931G0186q4474j1772p608j1312N8623m421m7851n83M1822K2657k8465p4996
15919g8194j6664K7519N5014P0390O901q088m7032l3099j0322J2155Q719M3376
$$ plain form
16003 -96014 -159403 -86418 -63126 -43398 -58959 -81142 -22504 -30995 -26434 -29425 -1359 22133
15991 22133 75580 30223 78 16010 -17927 -24759 -13706 15465 63120 79593 26107 -17595
15979 -17595 41142 99692 99310 56263 89896 19632 -31432 -25100 27190 29023 49126 71616
15967 71616 37099 31905 1247 -19371 22614 124176 102595 32663 101 -17869 12237 -56364
15955 -56364 -26487 376 32526 97826 126050 105169 57743 17235 14022 9018 42039 21707
15943 21707 -68423 -26910 5524 -36200 -22909 -18621 -17324 -29046 -6723 22990 43669 70186
15931 70186 -14288 -26060 -33668 -44980 13643 9222 -38629 -39212 2610 25267 -3198 -78194
15919 -78194 -94858 -67339 -12325 58065 64966 56878 9846 -23253 -33575 -21420 -12701 30675
15907C0675M0935k1963n57l8260L1100K4975j5141k656l5230k3528j8225k0490
15895d8365J5807M7362J6562k6850j3002M5336m8654Q202J2741j01664k5113M9725
15883f7913M8419n3817r946j4071J016q374N172O1529J10218O3118j3008j5677
15871A06666k3292K245M1801J1564q7794m3110j8264k6550K3107M1444K2683l613
15859D6887p925m4050l5401N2233l7020p432k68j5241J9864J4738j5813l3942
15847f3370j483N7566l111k7656J5910j7549j0891N6210Q976K3160k6427l7149
15835b5814m373L2193J6762N5961j8358k7895n9161N9569N9512n1233j6027N3919
15823G5055o732q6212r9698j8194M3523N2680P6K3111O7927j5064p32K3940K7505
$$ plain form
15907 30675 71610 49647 49090 10830 41930 66905 51764 49108 13878 -9650 -27875 -48365
15895 -48365 -32558 14804 31366 4516 -8486 36850 -11804 -3602 9139 -92525 -117638 -67913
15883 -67913 -19494 -73311 -83257 -97328 -96312 -104686 -99514 -37985 72233 135351 122343 106666
15871 106666 83374 85619 127420 138984 51190 8080 -10184 -36734 -13627 27817 50500 46887
15859 46887 38962 -5088 -40489 11744 -25276 -32708 -32976 -48217 -28353 -13615 -29428 -63370
15847 -63370 -64853 -7287 -10398 -38054 -22144 -39693 -50584 5626 14602 37762 11335 -25814
15835 -25814 -30187 2006 18768 74729 56371 28476 -30685 28884 88396 37163 21136 75055
15823 75055 68323 -17889 -117587 -135781 -92258 -39578 -39502 -16391 51536 36472 35740 59680 87185
15810H7185l501n4513m859k3263p8286N0143P08j4518j7047j7722K6261n9274
15798a08686J9462R2843M9610j00043m9422n221L0603Q4751J8754m9318j7222
15787c3889N5855Q6611J7434o6876Q650M5144j6975p6690k1692j8768J3407k2091
15775b9880P934n322n2083j782J1222k9323K4734O7667L3809l9595Q654j9228
15763b3193n0989L9652R4875l7020o1226k1429J1933L8936N6091j3508j4569q388
15751A1165p5757J67R1393N3361L0829J2684J3899j00823p3795M4925N2938m298
15739E6688J3930l3887m0556J4J4455J9136m3569j4307L8530N408j4566k1462
15727b0186n7333J31J8245L1655L3778L6908j737O066K9586O753J6979M785k6044
$$ plain form
15810 87185 83684 29171 24312 1049 -77237 -27094 -26386 -40904 -57951 -75673 -49412 -108686
15798 -108686 -89224 3619 53229 -46814 -96236 -101457 -70854 13897 32651 -16667 -33889
15787 -33889 21966 108577 126011 59135 67785 112929 95954 19264 -2428 -21196 -7789 -29880
15775 -29880 -21946 -27268 -79351 -81133 -69911 -99234 -74500 -6833 26976 -12619 -3965 -23193
15763 -23193 -74182 -34530 60345 23325 -37901 -59330 -47397 -8461 47630 34122 19553 11165
15751 11165 -64592 -64425 26968 80329 111158 123842 137741 36918 -36877 8048 60986 56688
15739 56688 70618 36731 -3825 -3811 10644 29780 -13789 -28096 10434 15842 1276 -20186
15727 -20186 -77519 -77388 -59143 -27488 6290 43198 41461 47527 77113 83866 100845 105630 79586
15714G9586l241k1867k2375J6637j1000n1228J1769M594l0959J0852J4425L7806
15702C4999j9764j3391J8938n1319k069J8109l9918q3770l40O9750L9258M9134
15690A9617K9545Q179L012K8741j5937p3468l1499n7353P3575J6381p7398J4794
15678f1811N7189J2840k4299l4174l6430J2876N5174o688l2953Q7816R2322L0222
15666A52084q8017m6531K3063J1486k7664j4950j3763M762R497P9928m4444n0083
15654d632J6958k9161p2493k5737N4223Q2665j2964l369p06k9452k3794p928M4138
15641a2252N8701K9535m1358l8281l7732M7485Q188M9398k4550p5152O484m455
15629c3989J4459K6358K2847l1068K3895M3583l8983n1340J22819L2428p4147
$$ plain form
15714 79586 76345 54478 32103 48740 37740 -13488 -1719 2875 -28084 -17232 -2807 34999
15702 34999 15235 1844 20782 -30537 -32606 -14497 -54415 -138185 -138525 -68775 -29517 19617
15690 19617 49162 57341 60353 89094 73157 -311 -31810 -89163 -15588 793 -76605 -61811
15678 -61811 -4622 8218 -16081 -50255 -86685 -73809 -18635 -25323 -58276 29540 121862 152084
15666 152084 64067 17536 40599 52085 24421 9471 -4292 470 9967 89895 45451 -4632
15654 -4632 12326 -16835 -89328 -115065 -60842 21823 8859 5490 4784 -24668 -48462 -56390 -12252
15641 -12252 46449 75984 34626 -3655 -41387 6098 14286 63684 39134 -36018 -29534 -33989
15629 -33989 -19530 6828 29675 -1393 22502 66085 27102 -24238 98581 131009 56862
15618E6862o5186k870M6402N62r770j9412P444k4533N8079j2691p0221n085K6500
15605a3919K5101m6414q2887P517K8883n099K6265O3443P5622l0866l2947l9401
15593b4702lJ925K0123R229l1226J01877J3489j096N0834l3218k807l8621m5166
15580B0638N961j5872J1240L0674j5800n2585J0788K0023m4281L1052J0186k4707
15568a2683l6278m096J8713j4483L9177Q234J2866k4092l695k5198k1409O582
15556e6362l0120K3938P9870M5476p4853j7619j1083l8705M0263O2888j9937m941
15544a185O7971Q8896j6726m8981J1617k9134q2481J330Q03j258L4174k4100P160
15531H086m0675J1512m0409o5112N746J353J5549O9276O9285K9209r137J948l62
$$ plain form
15618 56862 -8324 -11194 35208 35770 26000 6588 14032 -10501 47578 34887 -35334 -40419 -13919
15605 -13919 11182 -35232 -118119 -110602 -81719 -86818 -60553 2890 78512 47646 14699 -24702
15593 -24702 -24705 -22780 -2657 6572 -24654 77223 90712 89616 140450 107232 104425 65804 20638
15580 20638 26599 10727 21967 52641 36841 -15744 -4956 15067 -29214 1838 12024 -12683
15568 -12683 -48961 -53057 -34344 -48827 -9650 -1416 11450 -12642 -16337 -41535 -62944 -56362
15556 -56362 -86482 -62544 17326 62802 -12051 -29670 -40753 -79458 -39195 23693 3756 -1185
15544 -1185 66786 155682 138956 89975 101592 72458 -10023 -8693 -7890 -9148 25026 926 8086
15531 8086 -32589 -21077 -61486 -126598 -120852 -119499 -103950 -34674 34611 63820 54683 56631 56269
15518E6269k1859o328M409M6761j9802l3443j4068m9125K6217L8686N1881o8209
15506A1389o1341l7312K9677M4026J2209j4710J4195M3941m7560k9475j2429J3319
15494c4071K5402o4797l6862L9808O6441Q151M3565J09479K9269k6879k2466o3575
15482G3465r7769l0350M2359J6400K1243j4524p4716N413N1910j1036j6350N5723
15470B1768J2430l647O9469L6558j1353n4439o4783l2368K6227j8347k850K5883
15458D548K3217k3153q6340J1780K9274L9701N1730L3725K0613p8303n0408J2789
15446a0827L8999Q654L9060o2226r512P0937P5858n2999o1886p4060m3841N7281
15434b4562M5732M2880j7953p1360o1431L1236k870J4163K1509O3728M5999O786
$$ plain form
15518 56269 34410 28082 32491 79252 59450 26007 11939 -37186 -10969 27717 79598 11389
15506 11389 -49952 -87264 -57587 -13561 -1352 -16062 -1867 42074 -5486 -34961 -47390 -34071
15494 -34071 -8669 -73466 -110328 -70520 -4079 4072 47637 157116 186385 159506 137040 73465
15482 73465 -24304 -54654 -12295 4105 25348 10824 -63892 -58479 -6569 -17605 -33955 21768
15470 21768 34198 30551 100020 136578 125225 70786 6003 -26365 -138 -18485 -21335 4548
15458 4548 27765 4612 -81728 -69948 -40674 -973 50757 84482 105095 26792 -23616 -10827
15446 -10827 28172 36826 75886 13660 4148 75085 150943 97944 36058 -38002 -81843 -24562
15434 -24562 21170 64050 46097 -25263 -86694 -55458 -58328 -44165 -22656 41072 87071 93857
15422I3857l5396j9990l0079l6190m854O535L8605K7815r681N516j1399J3598
15410C8337K3034l325j4725l4369j6647L837L8758j8248j0256P0778n9956o6546
15398d9328J6523O621j0459O1880K4700K1898M399J157P802l8717k6506L356M114
15385B7440l6218M2983N383k0914l8272l4238N8228j1729K8166N9249L1261J1393
15373A22732M0429m2683o7103k7378N651L1446j2275m3217K6796M8896J9702L2365
15361A35361n2629o8013K4451N6063K4238k7987k2654m7652O901M819j3911O895
15349B5882J3128L4572L7260l577o3981n0815K3157K787J3522l0284N0645l1387
15337B0909r8909P219K5687Q9987L629L3425J5255m3402j7354k3566m8063J3891
$$ plain form
15422 93857 58461 38471 8392 -27798 -32652 -26117 12488 40303 30622 36138 24739 38337
15410 38337 61371 58046 43321 8952 -7695 -3858 34900 16652 6396 77174 17218 -49328
15398 -49328 -32805 -26184 -36643 25237 49937 71835 76234 77391 85193 46476 19970 23326 27440
15385 27440 -8778 34205 39588 18674 -19598 -53836 4392 -7337 20829 80078 111339 122732
15373 122732 163161 120478 53375 25997 31648 63094 50819 7602 34398 83294 102996 135361
15361 135361 82732 14719 39170 95233 119471 91484 68830 21178 28079 32898 18987 25882
15349 25882 39010 73582 110842 107265 43284 -7531 15626 18413 31935 1651 52296 20909
15337 20909 -78000 -70781 -45094 44893 48522 81947 97202 53800 36446 12880 -35183 -21292
15325b1292M5515K569K8637m5040p6284L389L7987O9908J6255q8460p3437l2584
15313a32837O9418N8967j0972l6173k2399j228J8309j3968M1505O0914K5392N780
15301F2708k3721J323K6201j2575r408k7932O299n6345n0362k1765L2753M468
15289f8356L7491N0275M2862l8990K752j7397O3764L5270m8902m2349m3269j4267
15277d1116o0541m3533j1598J2403N2289J8383k7206o726N5686M0336n352m3291
15265f0266l3984O179K9515L7547j978m259M796L1485l9574k9405R9801K2110
15253F1967q665J3112K3387o722p317J8440N724k3075J4418k0060k665o341J0236
15240G2439K7657m1954J0330L8909J3346r8067p8371L3488J6417q549M264N210
$$ plain form
15325 -21292 24223 26792 55429 10389 -65895 -62506 -24519 45389 61644 -26816 -100253 -132837
15313 -132837 -63419 -4452 -15424 -51597 -73996 -75224 -56915 -70883 -29378 31536 56928 62708
15301 62708 38987 40310 66511 53936 44528 16596 22895 -33450 -83812 -105577 -72824 -68356
15289 -68356 -30865 19410 62272 23282 26034 8637 72401 107671 58769 16420 -26849 -41116
15277 -41116 -101657 -145190 -156788 -144385 -92096 -73713 -100919 -107645 -51959 -11623 -16975 -60266
15265 -60266 -94250 -88071 -58556 -21009 -22987 -27246 -22450 9035 -30539 -59944 39857 61967
15253 61967 53302 66414 89801 83079 75762 94202 99926 76851 91269 71209 68544 62203 72439
15240 72439 100096 58142 68472 107381 120727 22660 -55711 -22223 -5806 -14355 -10091 -4881
15228d881o0601K4455j0605k7644K9009O9507K661k7605J8479p184Q247L526k983
15215A4381L8508J6199j2076K9303k2092m3057M7283L6714n1364m5828o3962k5224
15203h1215K8400O0949j5059p841J3683l850L999j0312j6506m2571J2805j3407
15191g0925j2643j6215N4593J5521k5585P032P957N7894K2436O584p3401l2384
15179e9136M6491K6781j6604m3988o3706J3034j4788P381k81N6097N3808K0704
15167B5793k8951P878l2535n7737K8348O2106J2420j1345l672o535m7326M9102
15155b454O4338J6351j4738O789K2370l9445m1007l1073k7356J5622k5366P261
15143d8708R2512J7791J3858K0394j9708o9189J8679J0036J0534K72J2966R1051
$$ plain form
15228 -4881 -65482 -41027 -51632 -79276 -50267 19240 21901 -5704 12775 5591 13838 17364 14381
15215 14381 52889 69088 57012 86315 64223 21166 68449 105163 53799 7971 -55991 -81215
15203 -81215 -52815 8134 -6925 -14766 -1083 -4933 -934 -11246 -27752 -70323 -57518 -70925
15191 -70925 -83568 -99783 -45190 -29669 -55254 -48222 -40265 17629 40065 46649 -26752 -59136
15179 -59136 -12645 14136 -2468 -46456 -110162 -97128 -111916 -104535 -104816 -48719 5089 25793
15167 25793 -3158 4720 -27815 -85552 -57204 4902 17322 5977 2305 -4230 -51556 -2454
15155 -2454 61884 78235 63497 70286 92656 53211 12204 -18869 -46225 -30603 -55969 -48708
15143 -48708 43804 61595 75453 95847 76139 6950 25629 35665 46199 46471 59437 150488
15131A50488k4621j4932j24401n5379L7825l3350K3843L6325K5858m7900N3452
15120B7208L8108J455p2435k5584k9657j3386L0951P0617p30M6690J0382q3302
15108C17j9021K2816l3444L27j0371P909l1314j6049J3249j8590L1691M2261m984
15095a5203J1607l8128n2263O1988O7543o6634j3176J7592L7142j9415j1832R546
15083a1233K6059J9293J103K7666l4990M794J9725O253l476l04n9573j0711K4247
15070H853k2357J3043L2687j7442j4037m861J0122j8636o8078n8944M1904J3328
15058h4418p615N7474M4242M0852L4474n4070o5129N923K6602M853K0776K6630
15046E0594l9112J5335Q825m396k903M696k1200l044N1571K9056R2859Q5068j8225
$$ plain form
15131 150488 125867 110935 -13466 -68845 -31020 -64370 -40527 -4202 21656 -26244 27208
15120 27208 65316 66771 -5664 -31248 -60905 -74291 -43340 27277 26547 73237 83619 317
15108 317 -18704 4112 -29332 -29005 -39376 -31467 -62781 -78830 -65581 -84171 -52480 -10219 -15203
15095 -15203 -3596 -41724 -93987 -31999 35544 -31090 -44266 -26674 10468 -8947 -20779 -11233
15083 -11233 14826 34119 35222 62888 27898 32692 52417 58670 55194 54890 -4683 -15394 8853
15070 8853 -13504 -461 32226 14784 747 -4114 6008 -12628 -80706 -139650 -97746 -84418
15058 -84418 -92033 -34559 9683 50535 85009 30939 -34190 -28267 -1665 3188 23964 50594
15046 50594 11482 26817 35642 31246 28343 33039 11839 8795 60366 89422 182281 267349 249124
15033B49124l661L2383M5801M7359L7386J08222J14703K27966K45909J98199J93960
15022A497351J01366J63595J38372o2683n4901o8207m6471j02626j79723j10096
15012A275977j08080m7473l9990M9067K47985J03795k05413k57362k49941j73111
15002E95454j12034n2143p3674p9787o6503l0527k6920m7974n792P754J5750k2885
14990A00719k8141l0405j2513K9167j8523l9904l6655N7589j2083n4023p5738
14979a20510L4313N3487M4929J1104l4631j671L5076K9816k3366l8836j3327O240
14967a7376k234M2606J7086O9986N6278k8088o5443Q568N7809N164k2336q9796
14955C2224K5436N7059o3872n6293j0447N6718m1239m6199L5268L2688L5174L302
$$ plain form
15033 249124 245463 277846 323647 371006 408392 516614 631317 859283 1105192 1303391 1497351
15022 1497351 1598717 1762312 1900684 1838001 1783100 1714893 1668422 1565796 1386073 1275977
15012 1275977 1167897 1120424 1080434 1129501 1377486 1481281 1275868 1018506 768565 595454
15002 595454 483420 431277 357603 277816 211313 180786 153866 105892 100100 107854 123604 100719
14990 100719 72578 42173 29660 58827 40304 400 -36255 21334 9251 -44772 -120510
14979 -120510 -86197 -32710 12219 23323 -11308 -12979 22097 51913 28547 -10289 -23616 -17376
14967 -17376 -19610 22996 40082 110068 166346 138258 72815 81383 139192 144356 122020 32224
14955 32224 57660 114719 50847 -5446 -15893 40825 -414 -46613 -11345 21343 56517 59819
14943E9819K1304o6790R988N2978n7719k4579O0601K9357l7117j6687P832l6065
14931B922k2748J0933N5733o937m1619J1758J5152P6612O8446o1364n5771R97
14919E4114J4487j150l1587J2862M0208M0357m3068M0720l3419k6126k5485j9129
14907B2784J2056M7074M9659L2879l5977k2747l890o844L131m7298p2196j2950
14895c4319l29J7707J5022l070n5497L7802N0424L3465P3799J1354p3103N031
14883G8286o813O3610N9636O6612j4327l4222o4062K7856j5728L5703l779l3208
14871A59564o3633o387k1650j3857N6858J9082P728J0719K2799m8933o5662m2532
14859A4096p8292L9103K6913m0245k7715m832O9754M9364l3562j0030Q7146j7711
$$ plain form
14943 59819 81123 14333 24321 77299 19580 -4999 55602 84959 47842 31155 38987 2922
14931 2922 -19826 -8893 46840 39903 -1716 10042 25194 101806 170252 108888 53117 54114
14919 54114 68601 67451 35864 48726 88934 129291 86223 126943 93524 67398 41913 22784
14907 22784 34840 81914 131573 164452 128475 105728 101838 94994 98125 50827 -21369 -34319
14895 -34319 -34648 -16941 -1919 -4989 -60486 -22684 27740 61205 135004 146358 73255 78286
14883 78286 71473 135083 194719 261331 247004 212782 148720 176576 160848 196551 192772 159564
14871 159564 95931 89544 67894 54037 110895 129977 137705 148424 171223 122290 56628 14096
14859 14096 -64196 -25093 1820 -38425 -66140 -70972 -1218 48146 14584 4554 91700 73989
14847G3989J0742L1503o3880r3304J8560J7424J9729M6278L2829J5021R797o4763
14835E3925q3846O5351Q9790N3725R181q307o394m6384J2060L1704O1065M0423
14823B72293Q9327P9013k4791p5384q2644r6307O666J5614l8352n7022n4566r647
14811B4200L2464O6462J711j7984m2721k6836J674O9485m1714n7508K9718O8147
14799A07098o982k6602o4434o1987N8898O1432k4681J0433j0038K90j5253K3058
14787E1232M7123O4643l2001K4930N753m0960q003J2084q1417K9262M6145j0432
14775A08359n8274j0610K6093M5705K8923n9814q92J7791j2050p8935q4782J6509
14763f1977J7609p580L7248M2377O731r5249j07247N7399Q9167k0716q8778j5040
$$ plain form
14847 73989 84731 116234 52354 -40950 -22390 -4966 14763 61041 93870 108891 118688 53925
14835 53925 -29921 35430 125220 178945 188126 179819 173425 127041 139101 170805 231870 272293
14823 272293 361620 440633 415842 340458 257814 161507 168173 183787 145435 88413 33847 24200
14811 24200 56664 123126 124837 106853 64132 37296 38970 108455 66741 9233 38951 107098
14799 107098 100116 73514 9080 -52907 5991 67423 42742 53175 43137 43427 28174 51232
14787 51232 98355 162998 130997 155927 161680 120720 112717 124801 43384 72646 118791 108359
14775 108359 50085 39475 65568 111273 140196 80382 79490 97281 85231 6296 -78486 -61977
14763 -61977 -44368 -51948 -14700 27677 34408 -60841 -168088 -110689 -21522 -42238 -131016 -146056
14751a46056o127R4124O6626J5861k3241k1625q6132k2589K9949N6047L0744k0722
14739c3141k5884K7421k5128K6890L3636N4513O9853j2007l6451j5909L1995k788
14727I3000J2254k2605K4629k9751k4443l7148l1229J5348N0609L7981J7676o8581
14715C7740k2485j0342l5717M740K189n886N8534Q5299k116k9863N6488K5118
14703A63699K2820k5149j9283O8774O832k4066M1956P9862L1029M7627Q9522K6955
14691E10578q947p8674l0676l6090o9772n6873m9907q4377q9204j2439R417m2143
14679c9107J7183M1284L00p894M5684J5273L370m8483j5548J8542R5236L6832
14667A62672J6483j885m4211j4380o2637Q384P5067J1671l594q9183L17L5203
$$ plain form
14751 -146056 -152183 -58059 8567 24428 1187 -20438 -106570 -129159 -99210 -43163 -12419 -33141
14739 -33141 -59025 -31604 -56732 -29842 3794 58307 128160 116153 79702 63793 95788 93000
14727 93000 105254 82649 107278 77527 53084 15936 -15293 55 50664 88645 106321 37740
14715 37740 15255 4913 -30804 -26064 -23875 -29761 28773 114072 111956 82093 138581 163699
14703 163699 186519 161370 142087 210861 217693 193627 235583 315445 346474 394101 483623 510578
14691 510578 501631 422957 392281 356191 286419 229546 179639 95262 6058 -6381 3036 -39107
14679 -39107 -21924 19360 19660 11766 57450 72723 76093 27610 12062 30604 125840 162672
14667 162672 179155 177270 133059 118679 56042 64426 139493 151164 147570 58387 58704 93907
14655I3907K1394N1520q238M1126L5970L1876M638m673J2825M883j8479K9667
14643B96416q3910m7130L0264P9147R8750J6825J7873J3287N842k082J9467M3265
14631D88014O3128K1925n0318n293Q4340J25089J32737L0008p5444J5997Q6725
14620I16908L4314l526K9339O7649N3439Q469O9116J12919P1087M9671N8317Q3659
14608A551361Q2500O5836P3247R8999P4362J55141J76287J94362K53506L28105
14598C053706L11939L31230M39086M88453N19594O53949P96581R01510J013193
14589H509241J272622J610379K002574K414511K763606L280114L784252M222895
14581B9860194M721559N405789O323037P677553R851598J3594313J9422712K6574681
$$ plain form
14655 93907 115301 166821 158583 199709 235679 267555 272193 267520 280345 285228 266749 296416
14643 296416 212506 165376 195640 274787 373537 390362 408235 421522 427364 425282 444749 488014
14631 488014 551142 573067 522749 517456 601796 726885 859622 889630 814186 830183 916908
14620 916908 951222 947696 977035 1044684 1098123 1106592 1175708 1288627 1359714 1409385 1467702 1551361
14608 1551361 1633861 1699697 1772944 1871943 1946305 2101446 2277733 2472095 2725601 3053706
14598 3053706 3365645 3696875 4135961 4624414 5144008 5797957 6594538 7496048 8509241
14589 8509241 9781863 11392242 13394816 15809327 18572933 21853047 25637299 29860194
14581 29860194 34581753 39987542 46310579 53988132 63839730 77434043 96856755 123431436
14573A23431436L2902536L6742031L8045934L7572204L5211691K9492717J8963151
14566C52361700M300350j0483955k1813424k9400878l4564787l7907305l8810813
14559A83680888l6208085l0528096k3849302j8171507j3759766j0502487q093976
14552D2567669o405152n200273m343802l680534l189306k796185k382970k014733
14544A2554714j659005j374642j061390q25791p00832n78810n35850l85511l83624
14535E049259l52040l35966k85131k85298k48298j98073j30289j22500j50345
14526B941319j53030j65274j84469j89085j10486j03258l7052o1284o3992q1441
14516A791948l5137l4140q5356p9366l5759m9931l4916k1806j16717r3998l4018
$$ plain form
14573 123431436 156333972 193076003 231121937 268694141 303905832 333398549 352361700
14566 352361700 356662050 346178095 324364671 294963793 260399006 222491701 183680888
14559 183680888 147472803 116944707 93095405 74923898 61164132 50661645 42567669
14552 42567669 36162517 30962244 26618442 22937908 19748602 16952417 14569447 12554714
14544 12554714 10895709 9521067 8459677 7633886 6933054 6354244 5818394 5432883 5049259
14535 5049259 4697219 4361253 4076122 3790824 3542526 3344453 3214164 3091664 2941319
14526 2941319 2788289 2623015 2438546 2249461 2138975 2035717 1998665 1937381 1873389 1791948
14516 1791948 1756811 1722671 1637315 1557949 1522190 1472259 1437343 1415537 1298820 1204822 1170804
14505A170804n386j3261q691L7196l4490n3343j00134n3281j1002j7435L0894
14494I41871M9147K165k6747N9K6622l2004k0963P675l0441M2173l4930j3295
14482I11332q6095m9134m4535K5068j1344k0249p7337O296M1838k4991n6897r924
14470F04028K1508n8051J098K2616k3938m626j2197L3129k7430r681J6563j0428
14458E52591k2106J0982J7965k016k5586l7996j526k383m3152M0935N552K7436
14446E20696m120j25213n1948l8467p1329l8281p1410m7960k285Q221M125L7546
14434A19575L2457L5816M4022l799L9910j8421j3516O9830O284k9535N279J853
14422B89755N8666J05161j8132k7504m6607m7388N3564l1322n3472q332j4865
$$ plain form
14505 1170804 1165418 1152157 1143466 1180662 1146172 1092829 992695 939414 928412 910977 941871
14494 941871 991018 993183 966436 966495 993117 961113 940150 947825 917384 959557 924627 911332
14482 911332 825237 776103 731568 756636 745292 725043 647706 654002 695840 670849 613952 604028
14470 604028 625536 567485 568583 591199 567261 562635 550438 583567 556137 546456 563019 552591
14458 552591 530485 541467 559432 557416 531830 493834 492308 489925 446773 487708 493260 520696
14446 520696 516576 391363 339415 300948 229619 191338 119928 71968 69683 77904 82029 119575
14434 119575 152032 187848 231870 228071 267981 249560 236044 305874 312158 282623 287902 289755
14422 289755 348421 453582 435450 407946 361339 313951 367515 336193 282721 274389 259524
14411B59524m2655M792k1237k8678n8860r511P3486L7753K1192K620o205R641
14399B41862L0688M5801j6774N0667j2134j0171J1827L3435l0405O0417j8673
14388C86540n8042l5436j7542K6375K2047l4275o2387k9092K9514J7637j9031
14377B26308q757K7745O802N419K9783r009k5173k6613k5249m4485k273j9806
14365A34692N8726J303j24376j0125K856K209o424r56m3337k6693j7709r54M5248
14352A4460O5861M1395l6658n2341R716M0263j7234J7111K5559k7012l9791l2558
14340H771J2565J3400j8625O3241L514m8616l7009L1635O2503L2573q585K2300
14328A37667p0877k8589M2756M3321q762l554J3097R96j2420j6474m0339J241
$$ plain form
14411 259524 216869 221661 200424 171746 112886 103375 176861 214614 235806 238426 232221 241862
14399 241862 272550 318351 301577 352244 340110 329939 341766 375201 344796 405213 386540
14388 386540 328498 293062 275520 301895 323942 289667 227280 198188 227702 245339 226308
14377 226308 217551 245296 252098 257517 287300 278291 253118 226505 201256 156771 154498 134692
14365 134692 193418 194721 70345 60220 63076 65285 58861 57905 14568 -12125 -29834 -30788 14460
14352 14460 80321 121716 85058 32717 42433 82696 65462 82573 108132 81120 41329 8771
14340 8771 21336 34736 16111 79352 82866 34250 -2759 28876 91379 123952 115367 137667
14328 137667 66790 38201 80957 124278 115516 111962 125059 126055 113635 97161 56822 58063
14316E8063j3407p420O2165O4748l4280q2345M9542M2804j669l6274R484m5321
14304F6090J6950m7261J9183J2290J5939K5066N471j3792j3319K5770j2609l317
14292I6461k1783K1298M2099P425q1557l6607m264K9562L4408O259m5456J629
14280D9474q4646L657J2566q815q006k961M1483l6242L9295L6877m2246l8931
14268c8495L1654J5560k0887m0112O148o211j5713O0444q816p014K1337l150K5393
14255B0138j6197l1486P932J27646O2151j703K0132n5546m4534j3910M8417J8672
14243A41712r1704k5112J4653Q231j0836K6559M0875N2169n5685n2403K8697k6499
14231E0657j3993p2662l1738N1574J9217Q00K5328J6806k7481N3539l5608m5344
$$ plain form
14316 58063 44656 37236 99401 164149 129869 47524 97066 139870 138201 101927 111411 66090
14304 66090 83040 35779 54962 67252 83191 108257 113728 99936 86617 112387 99778 96461
14292 96461 74678 95976 138075 145500 63943 27336 23072 52634 87042 93301 47845 49474
14280 49474 -35172 -31515 -18949 -27764 -35770 -38731 2752 -33490 5805 42682 436 -38495
14268 -38495 -6841 8719 -12168 -52280 -46132 -52343 -68056 -7612 -16428 -23442 -2105 -5255 20138
14255 20138 3941 -27545 -19613 108033 170184 168481 188613 133067 88533 74623 123040 141712
14243 141712 50008 24896 39549 47780 36944 63503 104378 156547 100862 48459 77156 50657
14231 50657 36664 -35998 -67736 -16162 3055 3855 29183 45989 18508 72047 36439 -8905
14219h905J4079P1172k4260M0095l3470q385J0100L4320L3652l7470m5432J756
14207D7252j8961n4058o1978N0264R3561O6643L6007K6460M154k0404q0291P89
14195H9438K0947N174k8947k1225j8117q353l8073k187M8126L1169j0654K8217
14183I5515O778l105l6292j32355j6316N179L3346P1802P948n883j8725m080L6876
14170D0688N35J038J5265L5216N4924m7330k258l3102J0558l686K8626L5214n6198
14157G9490m6752l2500J8405L0421J6535K5830j7078J2474k0945k5662k0825m5719
14145b6326N8270j9473L0155J2029k6551K0733L4143n142m991m4460P71P412l1435
14132E135N4300M6056j0207K7269P8515j1909p3753J3073K052q720K3840P7874
$$ plain form
14219 -8905 5174 76346 52086 92181 58711 50326 60426 94746 128398 90928 45496 47252
14207 47252 28291 -25767 -87745 -37481 56080 122723 158730 185190 189344 168940 88649 89438
14195 89438 110385 115559 86612 65387 47270 38917 844 -1343 46783 77952 67298 95515
14183 95515 102293 99188 62896 -69459 -85775 -80596 -47250 24552 32500 26617 7892 3812 40688
14170 40688 41223 42261 57526 92742 147666 100336 98078 64976 75534 71848 100474 135688 79490
14157 79490 32738 238 18643 49064 65599 91429 74351 86825 65880 40218 19393 -26326
14145 -26326 31944 12471 42626 54655 28104 48837 82980 77838 72847 28387 29158 36570 5135
14132 5135 59435 105491 95284 122553 201068 189159 115406 128479 130531 121811 145651 223525
14120B23525J07892N5394J5064M2527P8484P8447K38548K56593J61936J19875
14110A378285Q7807J09266J24635J17656j6373p0390o8184j64073k15904j67885
14100A114840k25364j64768j07125j14066r1111n7916m2824J6220L5459m2180
14090C21165r5755p1313L780j7449o2316o7215o9387q824K4521J5413m0300M5867
14078b1813R7309M1533o4327n1465l2283j1204M7123J6752J0657m9972l2038L5061
14066a4667J05244O623p7985o8934J678O9198N9226J796n0757K2077J261K3623
14054G8383J0827o624J8254J092j0004n8191j1705L7668J6749q0661o1840J6201
14042d9851Q1633R7156l7263l8875K4627J3123k0313j6312q60j588P8675r732
$$ plain form
14120 223525 331417 386811 401875 444402 522886 601333 839881 1096474 1258410 1378285
14110 1378285 1466092 1575358 1699993 1817649 1801276 1730886 1662702 1498629 1282725 1114840
14100 1114840 889476 724708 617583 503517 412406 354490 311666 327886 363345 321165
14090 321165 225410 154097 157877 140428 78112 10897 -58490 -67314 -42793 -27380 -67680 -21813
14078 -21813 75496 117029 52702 1237 -31046 -42250 4873 21625 32282 -17690 -49728 -14667
14066 -14667 90577 97200 19215 -49719 -48041 21157 80383 82179 31422 53499 54760 78383
14054 78383 89210 82586 100840 101932 91928 33737 22032 59700 76449 -4212 -66052 -49851
14042 -49851 31782 128938 91675 52800 77427 90550 70237 53925 53065 51477 130152 120420
14030A20420l1920L0250n500n3817j5178O086J5560Q621K3902k5283k1657k8606
14018B2878m9797Q633Q8085Q2806l1714j806j4916n0313m7726L7167M4208O832
14006I4337k4442k6266n29J2716o158k5175K9104L4148J7675M5195o444q5323
13994E8838q5162M959L2264J1256L8111J9195O9633j3169J7227l6481p224j9740
13982H9707j5373K3958J6941J4878n738J302m0342O108r3637l7524O3857O406
13970C0543N2629R377J0341J0583o9680l6754Q374n9091l4402N2320P034P556
13958a1170J1466J7107k7527J1322K7784K9332m2557l7450m1041M305N4991K1916
13946A8478j9234J2020K4869m4692L61N9773O154l5749J1712N1618k077k7312
$$ plain form
14030 120420 88500 118750 113250 59433 44255 50341 65901 74522 98424 73141 51484 22878
14018 22878 -26919 -18286 69799 152605 120891 119085 104169 53856 6130 43297 87505 94337
14006 94337 69895 43629 43100 55816 49658 24483 53587 87735 105410 150605 144161 58838
13994 58838 -26324 -21365 10899 22155 60266 79461 149094 135925 153152 116671 109447 89707
13982 89707 74334 98292 115233 130111 124373 125675 85333 91441 -2196 -39720 24137 30543
13970 30543 83172 92549 102890 113473 43793 7039 15413 -43678 -78080 -25760 -18726 -11170
13958 -11170 296 17403 -10124 1198 28982 58314 15757 -21693 -62734 -58429 -3438 18478
13946 18478 -756 11264 36133 -8559 -8198 51575 57729 21980 33692 85310 83233 55921
13934E5921j8771k2604o229J2203j9878l4389L2297N3487k4005J1394O7358j1330
13922I5454k8180r22L8366n9004j4588L9207M2065Q714k3468k7764n8980N5006
13910F5906P1475k303o4745k1148J8294p1797o9097L2765O5676L7261q987P758
13898F1058j211L459N3053q0l2445M645K26k0248n2673p208j334N7060M9748J9242
13884A33292n1319o806K6760n8886p0267n4015L070M1577O0885l9405m803M208
13872a5709j4457K7758K8715k0021j835J17435o4313l7814L2793O617j1086K1450
13860F9533M0351m6061Q616M5870m1977J4247q063k7293J9525K8645n347o8786
13848B9260n2093O864k1073k2792M0010O3194N0794J3201j4083j2921k9467L4494
$$ plain form
13934 55921 37150 14546 8317 20520 642 -33747 -1450 52037 28032 39426 106784 95454
13922 95454 67274 66352 104718 45714 31126 70333 112398 121112 97644 69880 10900 65906
13910 65906 137381 135078 70333 49185 67479 -4318 -73415 -40650 25026 62287 53300 61058
13898 61058 59847 63306 116359 116279 83834 88479 88705 68457 15784 8576 7242 64302 114050 133292
13884 133292 81973 75167 101927 43041 -27226 -81241 -78171 -36594 24291 -15114 -19917 -15709
13872 -15709 -30166 -2408 26307 6286 4451 121886 57573 19759 52552 59169 48083 69533
13860 69533 109884 63823 72439 118309 76332 90579 82516 55223 74748 103393 98046 29260
13848 29260 -22833 -15969 -37042 -59834 -19824 43370 94164 107365 93282 80361 50894 85388
13836H5388l3952L4056j1694L8515j4407j053j6296p906J7192O26p788p042O2087
13823A37726J4317l6727k2382L8724k9697j2918k1819m5133m637n2265l0007M2588
13811b2230N6368L7114K881j1284J0830k0985r573K675M3883K021j5017k6818
13799D9865L905k4810o390K9569K0542l311l0267K3374J0350O006o1144q1770
13787f4081l6100K2258O5064J02461K9980q396j4175j00374p9686j7528L6199
13776f4378O7735L4915J3055j1452m4041K3936j1599j8847O3082P4518p4840r5406
13764d3322K1039K7393k5565R306k2155P001j2973l2038M5553O399j4366o683
13752d0411M0124r640L8835J157K7117r483j0321k2715o3575L248L4794N16N777
$$ plain form
13836 85388 51436 85492 73798 112313 97906 96853 80557 72651 89843 90469 82681 75639 137726
13823 137726 152043 115316 92934 131658 101961 89043 67224 22091 17454 -34811 -64818 -22230
13811 -22230 34138 71252 74133 62849 73679 52694 43121 45796 89679 91700 76683 49865
13799 49865 53770 28960 22570 52139 72681 69370 39103 62477 72827 78833 17689 -64081
13787 -64081 -100181 -77923 -12859 89602 119582 111186 97011 -3363 -83049 -100577 -64378
13776 -64378 3357 38272 51327 39875 -4166 19770 8171 -10676 52406 126924 52084 -43322
13764 -43322 -22283 5110 -20455 -11149 -33304 -26303 -39276 -71314 -25761 -19362 -33728 -40411
13752 -40411 -287 -9927 28908 30065 57182 47699 37378 14663 -48912 -45664 -10870 -10354 -4577
13739d577m4770o902n0778l8889M2788O266m369N4574M1788l6057m9587j3071
13727a03584n385P1278K5199n5969M1314M0613j8199k3870J17224k022m4036P592
13715E0155p2766l5955k5962K2205O8568N4475J627l2687k5025n7931O1160L4905
13703D2769m7885q819L790L4582N4901n6153l0608r029P697N3498O303j6053q180
13690B6813m0879K3017k2780M0772l6440N5868n2705n0690k26J9790M430K2009
13678a1021o1004o5162M1553O4815L0015J9316l2144j9495J9064K3303m7514j2986
13666e1260J3661k0987l312N2599M8581L0585m6143n1596M228l2411M0702J4443
13654i10j7854j3048J4674K1699L0046J9306k6687l4850L40n9194j5531J7186
$$ plain form
13739 -4577 -49347 -56249 -107027 -145916 -103128 -96862 -101231 -46657 -4869 -40926 -90513 -103584
13727 -103584 -108969 -37691 -12492 -68461 -27147 13466 -4733 -28603 88621 86599 42563 50155
13715 50155 -22611 -58566 -84528 -62323 6245 60720 62347 29660 4635 -53296 7864 42769
13703 42769 -5116 -13935 -10145 24437 79338 23185 -7423 -16452 -8755 44743 51046 34993 26813
13690 26813 -14066 8951 -13829 26943 -9497 46371 -6334 -57024 -57250 -37460 -33030 -11021
13678 -11021 -72025 -137187 -95634 -30819 -804 18512 -13632 -33127 -14063 9240 -38274 -51260
13666 -51260 -37599 -58586 -61898 -9299 39282 69867 23724 -27872 -23644 -56055 -15353 -910
13654 -910 -18764 -31812 -17138 4561 34607 53913 27226 -7624 -7284 -66478 -82009 -64823
13642f4823O0481N7094K1361m5720J464k5864j4890J6169K839n0709l4831j563
13630g8992J2612M9997k0892j8869M7189J1690N2096M4276n7577m3984K1272N1636
13618G0454o044l4400n6928J4676J1634Q9543M4110l3733K28J6410n0125N2070
13606A17895o675k4543l1863j8960k2783m108J1702l2535K8696j5297J4276k0911
13594e106q606k3938j109L6602O781L6421m9186K158l2819l8778k5115k9816N3626
13581g8885Q6149N9297M2176J194p7056P44m1863L3025l1616o3586N2042L2080
13569A3701M4895p117j31909n0854O2618M3604k3081L9148K2160L8044N4592J4619
13557A20420j6954n7716j7013m1632o1682r288O4610N1734O4287m8060m8308n9521
$$ plain form
13642 -64823 -4342 52752 74113 28393 29857 3993 -10897 5272 8111 -42598 -77429 -78992
13630 -78992 -66380 -16383 -37275 -56144 -8955 2735 54831 99107 41530 -2454 18818 70454
13618 70454 64410 30010 -26918 -12242 -608 88935 133045 99312 99540 115950 65825 117895
13606 117895 111220 86677 54814 35854 13071 8963 20665 -11870 16826 1529 15805 -5106
13594 -5106 -13712 -37650 -38759 -2157 4624 41045 -8141 -5983 -38802 -77580 -102695 -132511 -78885
13581 -78885 7264 66561 108737 109931 32875 33619 -8244 24781 -6835 -70421 -18379 13701
13569 13701 58596 51479 -80430 -131284 -68666 -25062 -48143 -8995 13165 51209 105801 120420
13557 120420 103466 45750 28737 -12895 -74577 -83865 -19255 32479 96766 48706 398 -59123
13545e9123N3211O702q459M9394j6288o0511m1025J7733L4738M2015m323k137
13533A1927J6629k4599o5999P563k008K0477L5408l3203m6487j5237r621M0589
13521f4561N8197K4898k3818o3479k177J1704K690M0690J4694m3243k5090K513
13509f6982J1481L138P301L1706R138k2615m521M279L0275R415l4389L2352L2558
13496D3136l5040j0186K8408K068K4290L7119Q154m7142j0423m8843k9689j896
13484d0044J9982N1312P1514l372m3253m527J3434J5781p504K3672n886o469m3051
13471D1589o5977r129N5350o637n3398k0252J8749J0283k3188J7896P4639j690
13459C8235j7189L1676J034m5868K3837J8844j5282l5031j6646N7508m6953m3920
$$ plain form
13545 -59123 -5912 790 -7669 41725 25437 -35074 -76099 -58366 -23628 18387 14064 11927
13533 11927 28556 3957 -62042 -54479 -56487 -36010 -602 -33805 -80292 -95529 -105150 -64561
13521 -64561 -6364 18534 -5284 -68763 -70940 -59236 -56546 -15856 -1162 -44405 -69495 -66982
13509 -66982 -55501 -52363 -45062 -13356 -4218 -26833 -31354 -27075 3200 12615 -21774 10578 43136
13496 43136 8096 -2090 26318 28386 52676 89795 97949 50807 40384 -8459 -38148 -40044
13484 -40044 -20062 31250 102764 99392 56139 51612 65046 80827 73323 96995 91109 84640 41589
13471 41589 -24388 -33517 21833 15196 -38202 -58454 -39705 -29422 -52610 -34714 39925 38235
13459 38235 21046 52722 53756 7888 31725 50569 35287 256 -16390 41118 -5835 -49755
13447d9755k7215L9224k5395O938j1188l481N4176O3703K7913J480J5022j2751
13435G8671k020j4562o7965j0290K9027O302L6765j459l0341j5792N9137K5400
13423I2873n2962o6562m9312j8067L0883J3457L9972K1470l932m0046J2316Q6559
13411F6649n86k8425m0013J977l0546P0203j1183J6688m4139n1102l038K2066
13399c1449M0402k4145o9296N0496O7936J6121j5603L1595J3046j2465K221J4364
13387H3223L3848J9366p4614r48n2404p4162k196R535N2835P3395K6989o9529
13375B5338q9813L7418L0819K7433l609o0419l6332L8920J8933k0255K3416k2710
13363c0861L9102J9255l7315p6956m8775N1641O8979l286k2939j7003j7568Q495
$$ plain form
13447 -49755 -76970 -37746 -63141 -56203 -67391 -70872 -16696 47007 74920 76400 91422 78671
13435 78671 76651 62089 -5876 -16166 12861 19163 55928 54469 24128 8336 67473 92873
13423 92873 39911 -26651 -75963 -94030 -63147 -49690 -9718 11752 7820 -32226 -19910 66649
13411 66649 66063 37638 -2375 -398 -30944 39259 28076 44764 625 -50477 -53515 -31449
13399 -31449 8953 -15192 -84488 -33992 33944 50065 34462 66057 79103 66638 68859 83223
13387 83223 117071 136437 61823 60875 8471 -65691 -67887 -58352 -5517 67878 94867 25338
13375 25338 -64475 -27057 3762 31195 27586 -32833 -69165 -30245 -11312 -31567 -8151 -30861
13363 -30861 8241 27496 -9819 -86775 -135550 -83909 -14930 -18216 -41155 -58158 -75726 -67231
13351f7231n40L4870j958M3098O2628Q76k4111M516L7265k699N2349M5427l1267
13338A53223j52584j03488P279M6805j605k7717Q6429L4563P530m0923m180j1430
13326f098R775r107j7081o826m1112J94M6155M2981J8517R76J7587j0690l0215
13313A5056m8397j4905N3736L4974K2394o050o103N2510n7779l4894j7904k7620
13301c4982l105L6678k3583L961K7545J0673l478Q509L5674k1702p569l6959o7684
13288g6022l8643J259N4756L2755m3539j4681m63l915M5161O5536j5300l3747
13276b6843M1229J4301n3090K341R4162R512k0810l1360J014r723l420L6790j376
13263E2727n7599j0613L3040P914o921K5791P2007L1013j8231o9639q2538J9l7729
$$ plain form
13351 -67231 -67771 -32901 -34859 8239 70867 71743 47632 52148 89413 86714 139063 184490 153223
13338 153223 639 -102849 -95570 -48765 -50370 -78087 8342 42905 50435 9512 5332 -6098
13326 -6098 3677 -5430 -22511 -29337 -70449 -70255 -24100 18881 37398 38374 55961 45271 15056
13313 15056 -33341 -48246 5490 40464 62858 56808 50705 103215 45436 10542 -7362 -34982
13301 -34982 -38087 -1409 -24992 -21031 6514 17187 13709 22218 57892 36190 28621 -8338 -76022
13288 -76022 -114665 -113406 -58650 -25895 -69434 -84115 -84578 -88493 -43332 22204 6904 -26843
13276 -26843 14386 28687 -24403 -22062 72100 81612 60802 29442 30456 20733 17313 54103 52727
13263 52727 -4872 -15485 17555 25469 18548 44339 116346 147359 129128 59489 -23049 -23030 -60759
13250f0759j7232j0002J5747o268J1226J0158N7018J4864l7415J6499J4343K1000
13238B9179O758k8276j3474n3997m1752J1379J1696K5550O52l7389Q91N3803J09113
13225G4133M6067m2381o5950P878L4386K2647J6092m5621o2331n8864K8278R3144
13213D7478Q845K3694L8671k1219o4638l2968R916M3467K0611k5626l9601j5336
13201f706l2033R94j0192J7015K8110L9376M4579M3390Q815n6853m146o499k4616
13188D1234n64M8432J4789q205R671p6637j2287o4383n2556K1647K2615m065l440
13175f3749L0442p568L2156k6715J210j0801k5570K0160N7873L1081K1398j5992
13163D3925k2960K3686l494l9241k5828L0545o389N4835J046p718j4619l3948
$$ plain form
13250 -60759 -77991 -87993 -72246 -78514 -67288 -57130 -112 14752 -22663 -6164 8179 29179
13238 29179 35937 7661 -5813 -59810 -101562 -90183 -78487 -52937 -52285 -89674 -88783 -34980 74133
13225 74133 120200 77819 11869 19747 54133 76780 92872 47251 -15080 -73944 -45666 47478
13213 47478 56323 80017 118688 97469 32831 -137 9779 53246 73857 48231 8630 -6706
13201 -6706 -38739 -37745 -47937 -30922 -2812 36564 81143 124533 133348 76495 72349 65850 41234
13188 41234 40670 89102 103891 95686 105357 28720 16433 -47950 -100506 -78859 -56244 -60309 -63749
13175 -63749 -33307 -40875 -8719 -35434 -34224 -45025 -70595 -50435 7438 38519 59917 43925
13163 43925 20965 44651 41157 1916 -23912 6633 244 55079 56125 48407 33788 -160
13151a60j3691O5371k2990l1838l1204k8193m6694K0271O9008L9520m5490k8900
13139e4990R303j1547M4238o490J174M9378o735j4418K560K727J3255J5370L3844
13126G7669p291k8936j8206l4021K236m07O349k7051J3053j2273j9049Q9991M35
13113D2499k7440k2427m3351j0641r39k1463J5765k7085K4294O2251K5127q620
13101G970m0061L4670M3186m7322N4328m0458n3859J4624j4600R260o8236j2459
13089a12957K6721L8479J9347K2775R773j6502p5462k1644L9551K595j7526K2117
13077f2733M3214k7033k6096J517P405J14162K7476l4774j4248J3860J439j8084
13065B6105n9515l8626j7069L3937M9384K0710n4687J7208m944j6362j4074k9771
$$ plain form
13151 -160 -13851 51520 28530 -3308 -34512 -62705 -109399 -89128 -20120 19400 -26090 -54990
13139 -54990 -45687 -57234 -12996 -19486 -18312 31066 24331 9913 12473 15200 28455 43825 77669
13126 77669 70378 41442 23236 -10785 -8549 -8956 -2607 -29658 -16605 -28878 -47927 42064 42499
13113 42499 15059 -7368 -50719 -61360 -62299 -83762 -67997 -95082 -70788 -8537 16590 7970
13101 7970 -32091 2579 45765 -1557 52771 12313 -41546 -26922 -41522 -32262 -100498 -112957
13089 -112957 -86236 -47757 -28410 -5635 4138 -12364 -87826 -109470 -69919 -67324 -84850 -62733
13077 -62733 -19519 -46552 -72648 -71131 -63726 50436 77912 43138 28890 42750 44189 26105
13065 26105 -33410 -72036 -89105 -55168 -5784 14926 -39761 -22553 -27497 -43859 -57933 -87704
13053h7704k8387N7404r049P255P2577o001p170j9339m4098j886J8684L850j3512
13040e7376k3665K7647L0706N3652r8088j6768L7092r996r452P510N0881j9654
13028b7511o9569M4038N8055P5400k3273q7602m6959J4553R518j8309K4170k5214
13016g2703p9864k8241Q438L1578R7582L1955J8326N2781J1082K3234K447k2103
13004G4512j15599k5515J9428L2419N8781L970j0631l7505l008K9532l8795K5793
12992A3382J3073M9105M4840l4434M9285k2768q3978r962p562l5571j2131K0870
12980a5851M0252k2371k3166R50J3470L2003L9547L0730n2768l7942K2163k4129
12968B888k362j7620n7555j7841M3503J0256K6930l8746j221J950M788K4188k4504
$$ plain form
13053 -87704 -116091 -58687 -67736 -60481 12096 6095 -1075 -20414 -64512 -66398 -47714 -43864 -57376
13040 -57376 -81041 -53394 -22688 30964 -67124 -83892 -46800 -56796 -66248 -58738 -7857 -27511
13028 -27511 -97080 -53042 5013 80413 57140 -30462 -77421 -62868 -53350 -71659 -47489 -72703
13016 -72703 -152567 -180808 -172370 -140792 -43210 -11255 7071 59852 70934 94168 96615 74512
13004 74512 -41087 -66602 -47174 -14755 44026 47996 37365 -140 -3148 26384 -12411 13382
12992 13382 26455 75560 120400 85966 135251 112483 28505 18543 10981 -24590 -36721 -15851
12980 -15851 24401 2030 -21136 -20186 -6716 25287 64834 95564 42796 4854 27017 2888
12968 2888 526 -17094 -74649 -92490 -48987 -38731 -11801 -50547 -51768 -49818 -45030 -20842 -45346
12955d5346q163M2908O5581K6257K781q309k3575M8582N1642l0054o9380q6796
12943c3872K5007k252L0632J4864m8016O2598P5775k4943n4355p3424k0074K7805
12931b0255L5065k4161K6669o694l5494M0356k1704Q371l657o891J7934o3007
12919e3468K2657K4344L5322k540K566J8153r535k6910j9455Q8441M8863l7467
12907I0971r24K8299o701n4608k3302k5323J1412l3033l2811N3224M8299q555
12895D6948Q737l8711k977M766J4667k6070m3468k2038M2407M2694K5239l981
12883D8213M0l4710j9943k332j1407M5334J2406N73L2982l0218n3412P6118J34767
12870A98411O042j9082j8106J9585M2309k5767J39M9159o5355r5052K7359J15783
$$ plain form
12955 -45346 -53509 -10601 54980 81237 84018 75709 52134 100716 152358 122304 52924 -33872
12943 -33872 -8865 -11117 19515 34379 -13637 48961 124736 99793 45438 -27986 -48060 -20255
12931 -20255 14810 -9351 17318 10624 -24870 15486 -6218 2153 -1504 -8395 9539 -53468
12919 -53468 -30811 -6467 28855 26315 28881 47034 37499 10589 -8866 79575 128438 90971
12907 90971 90047 118346 111645 57037 33735 8412 19824 -13209 -46020 7204 55503 46948
12895 46948 55685 16974 13997 18763 33430 7360 -36108 -58146 -15739 26955 52194 48213
12883 48213 48253 13543 -6400 -8732 -20139 25195 37601 38174 71156 40938 -12474 63644 198411
12870 198411 204453 185371 167265 186850 229159 203392 203531 252690 187335 92283 119642 235425
12858B35425N2191k8010m0465k7523L8088M8782p6144p5252k2596n3732m8748
12847B016J9650N0116j7222j9564l2265j0552L0629O617m807K4689k8971J3820
12835C4156o150j9715j3546l517p02l5511J7830l8672J359P6828m3980J2167J7017
12822b436K6169J6825o2272o0194L6943J3484P364N5600L0581l3253J362n9381
12810b9208l200Q98p598L8287m155M7083K7937M4405l2994j363p874K8740J0727
12797A11685K1337l7250l7934p0041n474k9504n028K406J7988l3359M5487K6217
12785F530J1904K1520p5464n4744J3467K9287M1775K9432L2250J1927k5879m8899
12773f894j728N210n071m4131j2814L8428J42J2064K1602M950L1258p0725L3498
$$ plain form
12858 235425 287616 259606 219141 191618 229706 278488 202344 127092 104496 50764 2016
12847 2016 21666 71782 54560 34996 2731 -7821 22808 29425 24618 49307 20336 34156
12835 34156 28006 8291 -5255 -8772 -9474 -44985 -27155 -65827 -64468 12360 -31620 -19453 -2436
12822 -2436 23733 40558 -21714 -81908 -44965 -31481 -24117 31483 62064 28811 30173 -29208
12810 -29208 -32408 -31510 -39108 -821 -4976 42107 70044 114449 81455 80092 72218 100958 111685
12797 111685 133022 95772 57838 -12203 -17677 -47181 -52209 -49803 -31815 -65174 -19687 6530
12785 6530 18434 39954 -35510 -90254 -76787 -47500 -5725 23707 55957 67884 42005 -6894
12773 -6894 -8622 -3412 -8483 -52614 -65428 -27000 -26858 -14794 6808 11758 43016 -27709 5789
12760E789O7363l914k0557l014n1451p252O0617M838k9668n0569M8112N9360N1451
12747A31105M9802m8890J7171M3397l301J9728k8607k0844P923K1779n8606p6718
12735E3939n3324J2218k4072K2416N4110R434k6703l1668M5582J5469o6249J2327
12723B3479M2106l8306K3049J1403m9902k749O438K1646n5229r1701J1790R6520
12711a456R667J5101K3333k2996k544L1976K885l8153J833M3338P5337J2693m3903
12698A07111J0267q807m0298l4531M5633j528j6296j0603O076O291l9547o9483
12686d5715K6306J5161Q039n6833m288Q6794M0682L6230l110r0341o0789j1076
12674e8940M6593P5329n5082k9618j6761N0617j718l5642n2830O4016L8267k6497
$$ plain form
12760 5789 73152 69238 48681 45667 -5784 -13036 47581 52419 22751 -27818 20294 79654 131105
12747 131105 180907 132017 149188 192585 189284 209012 180405 159561 167484 189263 130657 53939
12735 53939 615 12833 -11239 11177 65287 74721 48018 16350 61932 77401 11152 23479
12723 23479 65585 27279 50328 61731 11829 9080 15518 37164 -18065 -109766 -97976 -1456
12711 -1456 8211 23312 46645 23649 21105 53081 55966 17813 19646 62984 138321 151014 107111
12698 107111 117378 108571 68273 33742 79375 77847 61551 50948 57024 63315 23768 -45715
12686 -45715 -19409 -4248 3791 -53042 -57330 29464 70146 106376 103266 12925 -47864 -58940
12674 -58940 -12347 62982 7900 -21718 -38479 12138 10420 -25222 -78052 -14036 24231 -2266
12662b266l4431k8504j3659P8322O2089o1937p3453L9642J5131L0095l3942q3328
12650a06241K3095N5093L6133J5969l7013k5069K58L5455j7434K6458P020j8019
12638d295n1392n9286m886N5653M4631o622l1163Q63q138L9249L2301K7749j533
12625C3131r808m1725j8958j7040Q1615L3703l4978r174K6664j0891r0984j3893
12613g2338M7974P6511Q6524O385l0934n9466m6021m875p440j0705k5406m2887
12601h2678K8804M4040j0425K0292M0448n6799L190L1540r833o7114l4745j7954
12589a11234P1368R2187L8399o7772p7686p0571M2541K1584K472j4430l5586L6054
12577g2674N9665k783K6532L251l2313j8248J1667R6393K6332k344n6556o2817
$$ plain form
12662 -2266 -36697 -65201 -78860 -538 61551 -386 -73839 -34197 -19066 11029 -22913 -106241
12650 -106241 -83146 -28053 8080 24049 -12964 -38033 -37775 -2320 -19754 6704 13724 -4295
12638 -4295 -55687 -114973 -119859 -64206 -19575 -26197 -57360 -56497 -64635 -25386 6915 34664 33131
12625 33131 23323 -18402 -37360 -54400 27215 60918 25940 16766 43430 32539 -58445 -72338
12613 -72338 -24364 52147 138671 145056 114122 54656 8635 3760 -3680 -14385 -39791 -82678
12601 -82678 -53874 -9834 -20259 33 40481 -16318 -13128 18412 8579 -58535 -93280 -111234
12589 -111234 -39866 52321 90720 22948 -54738 -125309 -82768 -61184 -58712 -73142 -108728 -72674
12577 -72674 -13009 -15792 10740 13991 -18322 -36570 -24903 71490 97822 95478 38922 -23895
12565b3895k673J2823J8299o98j4252m7619M0145O5507j9530n0943K476M2117
12553B1757Q129k4101j2968p989l1441O786M7702R6513K9422k7244n5556n567
12541D5443L9567l6513J0723j2082m3550J3955P5390L8346k6100o7680j16628
12530g9129L0139J06771K0688n5942k2919n9253j1496L0691p222p437k3448L6267
12518d2290J5905Q256l0278k4819K6111M491l826l246j224L2396p29n4934N7064
12505a7123J7402J2753L4938k48k1526K7990n9470j4664J0001o981K8153L6336
12493D7561k917k9965r024K5993J8706k3665o0571l1149L9766P0301L5571l9618
12481D0989l1224n4042K3432J8637J0855K5988L4035r156k7464K4368n945q1426
$$ plain form
12565 -23895 -26568 -13745 4554 3856 -10396 -58015 -17870 47637 28107 -22836 -20360 21757
12553 21757 29886 5785 -7183 -15172 -46613 -39827 7875 104388 133810 106566 51010 45443
12541 45443 85010 48497 59220 47138 3588 17543 92933 131279 105179 37499 -79129
12530 -79129 -48990 57781 78469 22527 -392 -59645 -71141 -40450 -47672 -55109 -78557 -42290
12518 -42290 -26385 -18129 -48407 -73226 -47115 -42624 -46450 -49696 -50920 -18524 -19253 -74187 -17123
12505 -17123 279 13032 47970 47722 26196 54186 -5284 -19948 -9947 -16928 11225 47561
12493 47561 44644 14679 5655 31648 50354 26689 -33882 -65031 -25265 45036 80607 40989
12481 40989 9765 -44277 -20845 -2208 8647 34635 68670 59514 32050 56418 50473 -30953
12469c0953j5372l7176l7066P6033N3135j8015k4784J4498R679k5116J1984P0985
12457D7832l8844n185K9109k9554j4366r643k0674l2515J0588J7336O430p719
12445d7205P621N1089K0170J4519j364j6579j9131J1764P0792p4003n0766K3158
12433i935N3196j6406j9680m5911N0316j405K8171J9099n8243m8104M7274P1880
12421G0252j8379j7553k0043j2997l811J1344k941l1970M9849R0486L7170l6540
12409A14867j04975o8863K1963K5240K1293L8243l6648o1597K0923Q909L3225
12398A2580J9295k6206n106k4842J5310O2768R6614L313q4650o7151l6399L0974
12386c500R42O185J9059m9471J810J7765m7177Q2567P3444j3044J775j8098k8635
$$ plain form
12469 -30953 -46325 -83501 -120567 -44534 8601 -9414 -34198 -19700 -10021 -35137 -23153 47832
12457 47832 8988 3803 32912 3358 -11008 -20651 -41325 -73840 -63252 -45916 -39486 -47205
12445 -47205 -39584 11505 31675 46194 44830 28251 9120 20884 91676 17673 -33093 -9935
12433 -9935 43261 26855 7175 -38736 11580 10175 38346 57445 -798 -48902 -1628 70252
12421 70252 51873 34320 14277 1280 -2531 8813 5872 -26098 23751 114237 151407 114867
12409 114867 9892 -58971 -37008 -11768 9525 47768 11120 -50477 -29554 -20645 12580
12398 12580 31875 5669 563 -24279 -8969 53799 150413 153726 69076 1925 -34474 -3500
12386 -3500 -2558 3627 22686 -26785 -24975 -7210 -54387 28180 101624 88580 90355 72257 43622
12373D3622l467K6370K4662p542l5220m7106j913j8824N3891Q243m7115P51k2302
12360b5950L1325l0271l0375j0210j7229L9880M1779J6281O355j4393J1264l007
12348A5449j3912l5257L1374j4501j3944J5880K7121K6997m2783J1633r871o2629
12336f4443k7565k0967p793L5271j3965P3176K5674R200N3659M0896o6289n7310
12324b0456r316K605q128L0425M7005P704p0639k9196o1665L2963J8645L792K5578
12311c0683P1675K9979j5354o8707J254R7784m601k2958L3021n7883J9540L658
12299E6725o0799l6146k0446K7796J3241K8743L8740O1953l821p2153n9719l3338
12287e9224N2624M3719J467p632N834L4445m46o894o9476j20028J8980J7296J6472
$$ plain form
12373 43622 40155 66525 91187 83645 48425 1319 -594 -19418 34473 42716 -4399 -3648 -25950
12360 -25950 5375 -24896 -55271 -65481 -82710 -42830 -1051 15230 21585 7192 18456 15449
12348 15449 1537 -33720 -2346 -16847 -30791 -14911 12210 39207 -3576 8057 -1814 -64443
12336 -64443 -92008 -112975 -120768 -85497 -99462 -26286 -612 8588 62247 103143 36854 -20456
12324 -20456 -29772 -27167 -35295 -4870 42135 49839 -20800 -49996 -111661 -78698 -60053 -56261 -30683
12311 -30683 40992 70971 55617 -13090 -11836 85948 81347 58389 91410 33527 53067 56725
12299 56725 -4074 -40220 -60666 -32870 -19629 9114 47854 109807 105986 33833 -25886 -59224
12287 -59224 -6600 37119 38586 30954 36788 71233 70787 63893 -5583 -125611 -106631 -89335 -72863
12274g2863N2154K2000R943l513l0056p930j5586m5702J7867K0575J8774P0820
12262C6483j2421l0230K0698j810m5288l992L950J1459j3684o7805r005M5765
12250f5880N5953K3149k9604k0018K0179o635k0862q451K5260K3575j5094l6349
12238e4777k7044k4549M593L5654M1208j05600L302O0203J5209l8823k470k3231
12226a16325n8986K6193N2433P6464K121o7961j3334N9474J3155M2416n6125r418
12214d9893o479K1799L9677R240k1202N390L7525l6066N1439M6210l5006o3202
12202e68q9556k6072L9392O6272P2235k2099k9732L452K6325N321l9425l794O1937
12189F3688k5913l8894R886j4474J1245p3529M191L4180M1460N3746k1285m4147
$$ plain form
12274 -72863 -20709 1291 11234 7721 -22335 -30265 -45851 -91553 -73686 -53111 -34337 36483
12262 36483 24062 -6168 14530 12720 -32568 -36560 -32610 -21151 -34835 -102640 -111645 -65880
12250 -65880 -9927 13222 -16382 -36400 -16221 -22856 -43718 -52169 -26909 -3334 -18428 -54777
12238 -54777 -81821 -106370 -101777 -66123 -24915 -130515 -127213 -67010 -51801 -90624 -93094 -116325
12226 -116325 -175311 -149118 -96685 -20221 -18100 -86061 -99395 -39921 -26766 15650 -40475 -49893
12214 -49893 -56372 -34573 5104 14344 -6858 -1468 36057 -9 51430 97640 62634 -568
12202 -568 -90124 -116196 -76804 -10532 61703 39604 9872 13324 39649 44970 5545 1751 63688
12189 63688 37775 -1119 8767 -5707 5538 -67991 -63800 -29620 11840 65586 44301 154
12177A54m5869N2043R8283l7304p4662j545L657k3761l4407P666l636j1841M5687
12164b5535k736m7842K2150M5602l0525N160o643L0822J7782J5084O918J6267
12152D6504k8664j4871L0763K2983n0882n0244k2693m336L4826N8865k1049o8476
12140f7274m0180N2249k8818p261m9486O476J1984K9804N2440R549K5688J1447
12128F618k7158K6756m5783k8663n973k701L2656K663k9931k4444L1221J2989
12116e1750L2658M925j4109l0483k8687j5850n649P3576L4192m2572J2017P6884
12104D5152k3193q4014k9242L4837j9467l0888Q901O7471q797K8173m9L7496j1423
12091A4957m2780j6013M1027K9865L495j1528l5341m2514l682J5505k284M6536
$$ plain form
12177 154 -45715 6328 104611 67307 -7355 -8900 -5243 -29004 -63411 -55745 -59381 -71222 -25535
12164 -25535 -28271 -76113 -53963 -8361 -38886 -33726 -40369 -9547 8235 23319 30237 46504
12152 46504 17840 2969 33732 56715 5833 -44411 -67104 -71440 -36614 22251 1202 -67274
12140 -67274 -107454 -55205 -84023 -91284 -140770 -134294 -122310 -92506 -40066 -30517 -4829 6618
12128 6618 -20540 6216 -39567 -68230 -74203 -76904 -44248 -41585 -71516 -95960 -64739 -51750
12116 -51750 -19092 -14167 -28276 -58759 -87446 -103296 -108945 -35369 -1177 -43749 -31732 45152
12104 45152 21959 -62055 -91297 -56460 -75927 -106815 -97914 -30443 -39240 -11067 -11116 26380 14957
12091 14957 -27823 -43836 -2809 27056 30551 19023 -16318 -58832 -62514 -47009 -49293 -2757
12079b757P3545L742m1949k8350M4106L5358l817J4528M5906N919k1323k2881
12067A02027m0358l3226J5445M4051M869p2562p2817J4523K9795M0303M1244q109
12055F5185l2521j4868M8962k0835l419q120k0357k6004m9592j9490l5171k1604
12043a37834J9189K4339j9690N0935L0825n8197J3966K1276k9493l8754J7759
12032a05679J05875L0647K0024N5036m2451m0160n0870k6940o067L701j385j5529
12020g3798J11736j4356m5690l8751J1175N9312K2213J447k5422n648L2526k7119
12008G625J4327J7139m4064k6581L5962Q3600j1637m8482p232J6409k2572l1550
11996a7056k732J0345m2242M6340J044L398L5802L9409L852n315p5954l5592j5914
$$ plain form
12079 -2757 70788 74530 32581 4231 48337 83695 79878 94406 140312 146231 124908 102027
12067 102027 61669 28443 43888 87939 92808 20246 -52571 -38048 -8253 32050 73294 65185
12055 65185 32664 17796 66758 45923 42504 34384 14027 -11977 -61569 -81059 -116230 -137834
12043 -137834 -118645 -94306 -113996 -63061 -32236 -90433 -76467 -55191 -84684 -123438 -105679
12032 -105679 196 30843 50867 105903 63452 23292 -27578 -54518 -60585 -56884 -58269 -73798
12020 -73798 37938 23582 -22108 -60859 -49684 9628 31841 33288 7866 2218 34744 7625
12008 7625 21952 39091 -4973 -31554 4408 88008 76371 27889 20657 37066 14494 -17056
11996 -17056 -19788 -9443 -51685 -5345 -4301 -903 34899 74308 78160 72845 -3109 -38701 -54615
11983e4615Q534O6610l1790k9794k5291O39O5891K3847J8134L3911m7416n9787
11971c1127m9596P220M4889N4392m6270l1390M531L887K5558O0755m6146n5703
11959e9000k3955L0388J0239N006J0207k7902M4993K8541k2045n1325J2538L6229
11947f086M6565k334j7646J8784K0494R850J7426j7706q7274m8364j7602L7825
11935d6068l0833M3031L836k4246K2242P3695O0174K9855r631o3697o7394o3843
11923g2879l3735L7799N9426J9789j7658q341K9066k6740j7318M2378N5017j3973
11911E2831n4373m8166N504k632o631J7007j1810l2038K1482n214l9018j5027
11899a18085M8115M4208K9369K8939L2114j8839p606L9113N6782n727p4994j01327
$$ plain form
11983 -54615 -46081 20529 -11261 -41055 -66346 -65707 184 24031 42165 76076 28660 -31127
11971 -31127 -80723 -73503 -28614 25778 -20492 -51882 -47351 -43464 -17906 42849 -3297 -59000
11959 -59000 -82955 -52567 -42328 -37322 -27115 -55017 -10024 18517 -3528 -54853 -42315 -6086
11947 -6086 40479 38145 20499 39283 59777 69627 87053 69347 -17927 -66291 -83893 -46068
11935 -46068 -76901 -33870 -30034 -54280 -32038 41657 101831 131686 122055 58358 -9036 -72879
11923 -72879 -106614 -68815 -9389 10400 -7258 -15599 13467 -13273 -30591 11787 66804 52831
11911 52831 -1542 -49708 -44204 -46836 -53467 -36460 -48270 -80308 -58826 -64040 -103058 -118085
11899 -118085 -69970 -25762 3607 32546 64660 45821 38215 77328 134110 128383 53389 -47938
11887d7938m0388o262N8318K7171l8579N7914R8644l7374o8711m5041K3831j3861
11875c2276K6452j8520N6421L9440R446l8821j3656J2096J0815r594o0554k5574
11863d4325M7359l3355N5767N2066o5401q920M5145L3053m7086j26l5804m8770
11851e0397L3974M095J0033M4069O323k3935m694o342q8653o1816M4752O8886
11839b3705m3735p1704N074K3757P6268J7046L409l5526k7327J1196k524l7067
11827a04838l0004k8471n4163O329R667N6158j09Q929M7028O1842N882r00k511
11814b5161J2182j4714n7381L2143q67N7336L6555M516J9633r477j5010n6527
11802a6772l271N1552L14M4526j6130j4916l0240n5161J7093N3001m5424o8672
$$ plain form
11887 -47938 -88326 -94588 -36270 -9099 -47678 10236 108880 71506 2795 -42246 -18415 -32276
11875 -32276 -5824 -24344 32077 71517 80963 42142 28486 40582 51397 41803 -18751 -44325
11863 -44325 3034 -30321 25446 77512 12111 3191 48336 81389 34303 34177 -1627 -50397
11851 -50397 -16423 -12328 -2295 41774 48097 24162 19468 13126 -75527 -137343 -92591 -23705
11839 -23705 -67440 -139144 -134070 -110313 -34045 -16999 -13590 -49116 -76443 -65247 -67771 -104838
11827 -104838 -134842 -163313 -217476 -211147 -201480 -145322 -145431 -136502 -89474 -27632 -21750 -22650 -25161
11814 -25161 -12979 -27693 -85074 -52931 -53798 3538 40093 44609 64242 54765 39755 -16772
11802 -16772 -20043 31509 31823 76349 60219 45303 15063 -40098 -23005 29996 -15428 -84100
11790h4100m190q411n4114O2208J27812L7800j0770n4173l4898j9278n60J1675
11778c0999L9767J8873n1098l1429J2474j0596N985K4545j936L6042Q1023L4220
11766A26871r1925K1975k3338n232j9272q5813Q439j269n7870M5239k6476K5485
11754h3186O6602j1799M950M0661L1335l674J095q470k984k8771K1979m4291J0867
11741e686J479p6698p252O6461K2308O9768j5608k3858N6638L8407N3010q6118
11729I2851o1226j6133K1188k5037l1848P48K8975M7469l0318k5355Q367k1199
11717a1518J7744j5820k4431k189k3256p150k1097L513J3050N3101M5343R613
11705C6903m8542j9227j1898k0887j4524N2545N1518m2287R486K6391L5003j3806
$$ plain form
11790 -84100 -88290 -96701 -150815 -88607 39205 77005 66235 12062 -22836 -42114 -42674 -30999
11778 -30999 8768 27641 -23457 -54886 -42412 -53008 -47023 -22478 -24414 11628 92651 126871
11766 126871 34946 56921 33583 28351 9079 -76734 -68295 -69564 -127434 -82195 -108671 -83186
11754 -83186 -16584 -28383 -23433 17228 48563 44889 45984 37514 34530 5759 27738 -16553 -5686
11741 -5686 -4207 -80905 -88157 -21696 612 70380 54772 30914 87552 125959 178969 92851
11729 92851 31625 15492 36680 11643 -20205 -19457 9518 56987 26669 1314 9681 -11518
11717 -11518 6226 -9594 -34025 -36214 -59470 -66620 -87717 -84204 -71154 -18053 27290 36903
11705 36903 -11639 -30866 -42764 -63651 -78175 -25630 25888 -16399 -6913 19478 54481 40675
11693D0675k2290k7674j4231k1588k4150j327N0634J8782k0198l4405k4362K1844
11681e8290k025L2978m0517j0320j6471j0169j8648J1041K7143L5574L9069j0843
11669b1478P070n2073L2035N6664n6209l5157J4072N5453K3574P1680K1240l2548
11657H4323o3123l7864n834K9960K5114o962o124l911L4744n192j8248k4220j5536
11644a2873K1134L4156m1389K5323k6381p0257J6756N4423j5645J819L5439J283
11632B3788k9642l2551n355r256J4665L9966j2411N460K76k1006l8997j4174K6982
11619e2255l3134M9981J9326K1813o828l317k2777l2112j1068o8163K1258K3926
11607i3350K5036K1670j4534K1048J1689O0834J572J1766l7696n4979l348J043
$$ plain form
11693 40675 18385 -9289 -23520 -45108 -69258 -70585 -19951 -1169 -21367 -55772 -80134 -58290
11681 -58290 -60315 -27337 -67854 -78174 -94645 -104814 -123462 -112421 -85278 -49704 -10635 -21478
11669 -21478 -14408 -66481 -34446 22218 -33991 -69148 -55076 377 23951 95631 116871 84323
11657 84323 21200 -16664 -22498 7462 32576 25614 19490 15579 50323 45131 26883 2663 -12873
11644 -12873 8261 42417 1028 26351 -30 -70287 -53531 892 -14753 -12934 22505 23788
11632 23788 -5854 -38405 -43760 -53016 -38351 1615 -10796 -5336 -5060 -26066 -65063 -79237 -52255
11619 -52255 -85389 -35408 -16082 5731 -1097 -4414 -27191 -59303 -70371 -138534 -117276 -93350
11607 -93350 -68314 -46644 -61178 -40130 -28441 32393 33965 45731 8035 -46944 -50292 -49249
11595d9249L767L2325k0157l9929k3979K2543N1563J9809m1876k2755k6994O306
11583h8626P4685k135L2728M1733j1333m6144j5476q6312L2778L2625m1875l775
11571h1127P3495K2083k3353j5596q1302L0115P6638j1360o950j0055K1191M1403
11559C5182J0378k0771m338M482j35K7176n6549m1639o143K3313M0687m3896m9566
11546h1819L2759M1923L3578k5447M089l9740q130L4613N451n0184k6675k6825
11534a06407r455k0701M6167M5955K2527j0039m8192j6246M9685j644P538J3211
11522b7601K3779q324J5092l714K0927k1907L1499L5153l3754r1K7339L8490m5061
11509E1827q7457L826J5665K08k681L4362j4912o1699n2382J4870M904K373m644
$$ plain form
11595 -49249 -45482 -13157 -33314 -73243 -97222 -74679 -23116 -3307 -45183 -67938 -94932 -88626
11583 -88626 -13941 -16076 16652 58385 47052 908 -14568 -100880 -68102 -35477 -77352 -81127
11571 -81127 -7632 14451 -8902 -24498 -105800 -75685 953 -10407 -17357 -27412 -6221 35182
11559 35182 45560 24789 20451 24933 24798 51974 -4575 -46214 -52357 -29044 11643 -32253 -81819
11546 -81819 -49060 -7137 26441 994 5083 -34657 -42787 -8174 -2723 -52907 -79582 -106407
11534 -106407 -115862 -136563 -90396 -44441 -21914 -31953 -80145 -96391 -46706 -48350 -40812 -27601
11522 -27601 -3822 -12146 2946 -768 20159 -1748 29751 64904 31150 31059 58398 96888 51827
11509 51827 -35630 -31804 -16139 -15931 -18612 15750 838 -60861 -113243 -98373 -93469 -91096 -95740
11496i5740N8541K2628m372m1311m658K949j2594M5728M7948J0131j9095l0674
11484b0519m7002j6372L7009O820m959O1472N6396k7669J350M553k1897j4569
11472A4613m1293j5856P2895N8419m498p6598p6881R777L3647L1154M7673l3124
11460A9928r749N7989J863K1725N3177j4828k2737j0964n0647P953k3933k8089
11448A688L032l1957n7390N913K3941Q661k1665m7802J4910R0889K6815r6362
11436g9327m2436P3376P9953k4473o4748J2336l0919N4441J5528o4218l4700J181
11424a04006M3290N4907n463k5699j3443j4142l2327K7213O2057l62q807o996
11412b3778m746o1648M2791P585o1907k9743L8183M6914R0437J4287l7559k5019
$$ plain form
11496 -95740 -37199 -14571 -18943 -60254 -64912 -61963 -74557 -28829 19119 29250 10155 -20519
11484 -20519 -67521 -83893 -46884 -40064 -45023 16449 72845 45176 46526 51079 29182 14613
11472 14613 -26680 -42536 30359 88778 84280 7682 -69199 -59422 -25775 5379 53052 19928
11460 19928 10179 68168 70031 91756 144933 130105 107368 96404 45757 53710 29777 1688
11448 1688 4720 -27237 -84627 -78714 -54773 -46112 -67777 -115579 -100669 -9780 17035 -79327
11436 -79327 -121763 -48387 31566 7093 -57655 -45319 -76238 -21797 -6269 -70487 -105187 -104006
11424 -104006 -60716 -5809 -11272 -36971 -50414 -64556 -96883 -69670 -7613 -7975 -16782 -23778
11412 -23778 -28524 -90172 -47381 -39796 -101703 -131446 -93263 -46349 44088 58375 20816 -4203
11400d203L364j8771j5483M1859L9307k9444o1695N030J3511j5916K8799M0520
11388B6878k9647j6339L4588Q1349l4297j81l0854K2346k0920n5854m1900o9596
11376a34427L5122k7205J0946Q7824N3052r0q239k521K1240o4866l0147J1275
11364d8036N0247P3692J4140m1192j6998J6307l6898o715P0985O1074k3822k0913
11352I1871j3577k1473n1368k2820J04922R864j1636m0775j4940l1473j2244j0506
11340b4155J0402j86o677K5889M372p9443k3595M0796O3245K0200j2553j3038
11328E257n9581j3223L5172M7402j4338K3143l6293k0863L1996J3110L3359k6854
11316A8287m377P253k0130J3244o925K674n449j3748m4944K6203M9459L2191o2735
$$ plain form
11400 -4203 -839 -19610 -35093 6766 46073 16629 -45066 -40036 -26525 -42441 -13642 26878
11388 26878 -2769 -19108 15480 96829 62532 62351 31497 53843 32923 -22931 -64831 -134427
11376 -134427 -99305 -126510 -115564 -27740 25312 25222 16983 14462 35702 -29164 -59311 -48036
11364 -48036 2211 75903 90043 48851 31853 48160 11262 4547 75532 136606 112784 91871
11352 91871 78294 56821 5453 -17367 87555 97419 85783 45008 30068 -1405 -13649 -24155
11340 -24155 -13753 -13939 -20616 5273 9645 -69798 -93393 -52597 10648 30848 18295 5257
11328 5257 -54324 -67547 -32375 15027 689 23832 -12461 -33324 -1328 11782 45141 18287
11316 18287 13910 21163 1033 14277 7352 10026 4577 -9171 -54115 -27912 21547 53738 -8997
11303h997j5317N2010m414R755l643k3694j4013O5526m1877l9330O713j5919l2818
11290f6018L2665J5450o7328p1931k3152J11980J25087m7143k8364k7370n2911
11279i9035M2607M4240r37l2527m8520j1322M2963N6454P847r238J0869l5851
11267c2450r912m17J8260J7148k9652k5169l1279L8832M5202N5571N1361K5881
11255A23376K671k377l8704L7625J687j5504r5282j16727p0048L2050J03590K8073
11243i570j1626J0250j0382n990n1161m4146J3101K0452N7447K2942m5538L724
11231e0497j9749K3569n5228k9576Q7122j9696j0203o940J483O191J6557M8312
11219h655j100j10357N1639J08064L6311Q599k8499o9397q708K4634n9260q95
$$ plain form
11303 -8997 -24314 27696 23282 33037 29394 5700 -8313 57213 15336 -23994 -17281 -33200 -66018
11290 -66018 -33353 -17903 -85231 -157162 -180314 -68334 56753 9610 -18754 -46124 -99035
11279 -99035 -56428 -12188 -13125 -45652 -94172 -105494 -62531 -6077 1770 -7468 3401 -32450
11267 -32450 -42362 -42779 -24519 -7371 -37023 -62192 -93471 -54639 -9437 46134 97495 123376
11255 123376 126047 123670 84966 122591 124278 108774 13492 -103235 -173283 -141233 -37643 -9570
11243 -9570 -21196 -10946 -21328 -27318 -78479 -122625 -109524 -89072 -31625 -8683 -54221 -50497
11231 -50497 -70246 -46677 -101905 -131481 -44359 -64055 -74258 -81198 -79715 -73524 -56967 -8655
11219 -8655 -9755 -120112 -68473 39591 75902 84501 56002 -13395 -22103 2531 -56729 -57624
11207e7624n900j9922j5479q502m134M0251l0606N2146J6397R445j8579k9318
11195g1825L6418J7196P430J8344j7155m2330k9338m9044J4691j8818K495K1684
11183a10252R5554Q668j9511n3885n5542J3028m0447l918O5075K8642K0425M2489
11171i674L9276q3719j6443K9827J154p56p268j7925K36L9493R106l0798k5624
11158g3115J7291p951M707L7988J1559J9486j1909K5251k1455q197m0499J029
11146d5815K8616M4038k2421n1413k5881k386q073Q7R347O9048j2358k5753q937
11133e1901N9014o838p6851O4042N772j2411J9472O3191p7275q8523k8980j0144
11121a41432K7243O3046J5372M587L0331N9265J2265n4930j8977j91k3729M7096
$$ plain form
11207 -57624 -63524 -83446 -98925 -107427 -111561 -71310 -101916 -49770 -33373 -23928 -42507 -71825
11195 -71825 -35407 -18211 -10781 7563 -9592 -51922 -81260 -130304 -115613 -134431 -131936 -110252
11183 -110252 -14698 -6030 -25541 -79426 -134968 -121940 -162387 -166305 -101230 -72588 -52163 -9674
11171 -9674 29602 -54117 -70560 -40733 -39579 -40335 -47603 -65528 -65292 -25799 -16693 -47491 -73115
11158 -73115 -55824 -63775 -59068 -21080 -9521 9965 -1944 23307 1852 -6345 -46844 -45815
11146 -45815 -17199 26839 4418 -46995 -72876 -75262 -83335 -83248 -73901 -4853 -17211 -42964 -51901
11133 -51901 7113 275 -76576 -12534 -6762 -19173 299 63490 -13785 -102308 -131288 -141432
11121 -141432 -114189 -51143 -35771 -31184 -853 58412 70677 15747 -3230 -3421 -27150 19946
11109A9946J9285o699J5889j2041j1937O9278J4566m2547q6359n653J7945j511
11097i838l5604p184q188J7497Q7782L6920j7141J2750K0471l9251Q020n2513
11085A3721n2531k4790M613j028M5889Q424j8690J3073P9151J2647j1313m9656
11073A9510k8030j663k5273k8585j8785l641N9210N2203L4295m6711L5956k2734
11061B5752Q084k7294J5112l8358k1925L3061P998m7788J3135j868J3017M8364
11049B7290n1777J1437j4171j8376O5642K753n5658k3484M7705L9649o027R035
11037C4018j279R677o2284j2613j5772j150r314K0472J1988O7672L9103k2117
11025E8401J3190K2104r7636q0115J2026L4851M6913K2151J6238k2542q6790O122
$$ plain form
11109 19946 39231 32532 48421 36380 24443 93721 108287 65740 -20619 -26272 -8327 -9838
11097 -9838 -45442 -52626 -60814 -43317 44465 81385 64244 76994 97465 58214 66234 13721
11085 13721 -38810 -63600 -58987 -60015 -14126 -5702 -24392 -11319 67832 80479 69166 19510
11073 19510 -8520 -10183 -35456 -64041 -82826 -86467 -27257 24946 59241 12530 48486 25752
11061 25752 33836 6542 21654 -16704 -38629 -5568 2430 -45358 -32223 -34091 -21074 27290
11049 27290 -24487 -13050 -27221 -45597 20045 22798 -32860 -56344 -8639 31010 24983 34018
11037 34018 32739 42416 -19868 -32481 -48253 -49403 -58717 -38245 -26257 41415 80518 58401
11025 58401 71591 93695 -3941 -84056 -72030 -37179 9734 31885 48123 25581 -61209 -55087
11013e5087j1294K8773O740o9564P688M1420n38k50R9914L9022k635l0073l7011
11000A7105n618m420J2678q3548l13R5083J0612Q510l5803l6503L4356N3716J4247
10987H0102j8731k4992k0584k071j4236j1k0906j3557j5327M3865O44m8929J1703
10974d3030K2016l7084p9275K4224K8544M8958R1892J2366J739r053P332Q998
10962G7627k7712j9528j1870m920l9036l983k272j262L4319K4444n4041P302J8638
10949b294n0597J048P1308J1497K4316J3624m0105k4184o4350k8845K4838K1594
10937d2150q076K9982M446j9773J5500K0812l8840j4285N7372j5416m7550L3798
10925b4180J8180k0095M3125K5919m0755l5805O0773M9678L938M5566J6796l1747
$$ plain form
11013 -55087 -66381 -37608 -30868 -100432 -92744 -51324 -51862 -52112 47802 86824 84189 54116 17105
11000 17105 11487 7067 19745 -63803 -64116 30967 41579 50089 14286 -22217 12139 65855 80102
10987 80102 61371 36379 15795 13724 -512 -523 -21429 -34986 -50313 -6448 -5804 -54733 -43030
10974 -43030 -21014 -58098 -137373 -113149 -84605 -35647 56245 68611 70350 61297 68629 77627
10962 77627 49915 30387 18517 13597 -25439 -29422 -31694 -32956 1363 25807 -28234 -20932 -2294
10949 -2294 -52891 -51843 19465 30962 55278 68902 28797 4613 -59737 -88582 -63744 -42150
10937 -42150 -50226 -20244 -15798 -35571 -20071 741 -38099 -52384 4988 -10428 -57978 -24180
10925 -24180 -6000 -26095 17030 42949 2194 -33611 27162 76840 80778 126344 143140 111393
10913A11393J5084m0707L0607p129o7210m8213m589J4133K4288m963k7989k3733
10901b9028J3173Q496K1921l5847l6410l721j7611R398l3990p0698j2113L4808
10889a51622M6950Q9830N1529o1745m916P284k1210l7065m8262k1809l602L8819
10877a15819K8405N6091K9051l0767k528j4150j8736J2336J7077L4316J1800k5098
10865a8022Q232m4463o8588K831R859J7934L9922R6384L4341m3534K0722O989
10853F2607l5345k4086l4347K5533P070k8812K0684L3280m1978k939k2063l9712
10841h0108m257M1534K8974L5367j0929M115K1493j8930M198j1764O5955J5615
10829I1263r3587k9807K6554R299j6850M0361j4922L3207L5439r860k0880n466
$$ plain form
10913 111393 126477 85770 116377 109248 42038 -6175 -10764 3369 27657 22694 -5295 -29028
10901 -29028 -15855 -7359 14562 -21285 -57695 -61416 -79027 -69629 -103619 -174317 -186430 -151622
10889 -151622 -104672 -14842 36687 -25058 -29974 -22690 -43900 -80965 -129227 -151036 -154638 -115819
10877 -115819 -87414 -31323 -2272 -33039 -35567 -49717 -68453 -56117 -39040 -4724 7076 -18022
10865 -18022 -9790 -54253 -122841 -120010 -110151 -92217 -52295 44089 78430 34896 55618 62607
10853 62607 27262 3176 -31171 -5638 1432 -27380 -6696 26584 -15394 -18333 -40396 -80108
10841 -80108 -84365 -42831 -13857 21510 10581 14696 36189 17259 21457 9693 75648 91263
10829 91263 -2324 -32131 -5577 3722 -13128 27233 12311 45518 80957 71097 50217 44751
10817D4751N63M8023J9429m3180k7873K0481l6435q547j9085L3741m048l0612
10805b792J8481q264m9054n5945o890M0275M2178N8774M4246m6673n7143K5425
10793B618M5643J1224k7361m3595j3623K5564O354n13J9549l8693l8343k9468
10781h0644j4291J9447L4278N5002J8661k6865J7763j4165l413J5786j0954k2505
10769a1900L3572j375l3725k0897j3463J4560J3602N2521m8741j0530n400j9832
10757e1608M7028R014n0201L5221N9072p3832L822N3859o8538m2221k2569J1256
10745h9697N1417q635L817M8668p160o7526j6206O801O5410j6510K070L9395k440
10732I404l6656Q4753K0595n5089M5504J1536k2894j986K1968k5363K6546k1197
$$ plain form
10817 44751 45314 93337 112766 69586 41713 62194 25759 17212 -1873 31868 27820 -2792
10805 -2792 15689 7425 -41629 -97574 -104464 -64189 -22011 36763 81009 34336 -22807 2618
10793 2618 48261 59485 32124 -11471 -25094 470 6824 6311 25860 -12833 -51176 -80644
10781 -80644 -94935 -75488 -41210 13792 32453 5588 23351 9186 5773 21559 10605 -11900
10769 -11900 21672 20297 -13428 -34325 -47788 -33228 -19626 32895 -15846 -26376 -31776 -51608
10757 -51608 -4580 4434 -45767 -10546 48526 -25306 -21484 32375 -36163 -78384 -100953 -89697
10745 -89697 -38280 -46915 -43098 5570 -1590 -69116 -85322 -78521 -13111 -29621 -27551 11844 9404
10732 9404 -27252 57501 78096 23007 68511 80047 57153 55167 77135 51772 78318 57121
10720E7121q6618j1339M3006J0381p1979o653P0494Q0831K4275o8912j41911p0119
10708a71423Q0075Q181l4124m255K6830Q3457J5623K8657K2075j9339k3634J8482
10696C0605m6978j4252N7675K7737k9182l7276J6349n7382j7488n050k5405L8335
10684f2312k4807j4133L3018J2549L0899R770J2021q535j4381m6849j4778j1627
10672i9165r049M2M7220O2393j2565l851j7745r879q130L5624J7958L6085L6694
10659G5632j4745j2197j6853p0381q5640L0769O8338N1697L6296K8098k1431n0543
10647A9040o7981K8661J9751O837m5794K4089L5751k441k4125K2603k3376l2212
10635c9197L9607M5859L4703l7158R586L4299J0775k7440n3294k7203J9924M7682
$$ plain form
10720 57121 -29497 -40836 2170 12551 -59428 -66081 4413 85244 109519 40607 -101304 -171423
10708 -171423 -91348 -83167 -117291 -121546 -94716 -11259 4364 33021 55096 35757 12123 30605
10696 30605 -16373 -30625 27050 54787 25605 -11671 4678 -52704 -70192 -75242 -100647 -62312
10684 -62312 -87119 -101252 -68234 -55685 -24786 -15016 -2995 -11530 -25911 -72760 -87538 -99165
10672 -99165 -108214 -108172 -60952 1441 -11124 -14975 -32720 -42599 -50729 -15105 2853 38938 75632
10659 75632 60887 48690 31837 -38544 -124184 -93415 -25077 26620 62916 91014 69583 19040
10647 19040 -48941 -20280 -529 6308 -39486 -15397 20354 17913 -6212 16391 -6985 -39197
10635 -39197 410 46269 80972 43814 53400 87699 98474 71034 17740 -9463 10461 58143
10623E8143K092q6732p68j1121m1311K9803K0505m1968M1506n094n1675K0895
10611f5725K2222Q923L7306R803l0412m385N147M3379n005j1938m5150j9757K7269
10598b8323M2470N4741K066o0697r4435L3053K9635j3237o8387l8428Q4171M3451
10586a3920n0372n9551j3239O0860O6855L548j3147m3655J552N6571K6511L0404
10574E2417q755o537K0895K0943j59K9343l1913o4401p7343M3924M1330K107L2189
10561E4040l004q024n0034n0964j1501M5191M7563K507K428P9473M1362j18071
10549C0966n0008L9807O0692L8793K4671k7629j28545m6483K2091k0435R918L3107
10537a3055N0973k1553o7606j6662L8792m8808p539L3429K7628l6848J2096K595
$$ plain form
10623 58143 60235 -26497 -27265 -38386 -79697 -49894 -29389 -71357 -29851 -34945 -86620 -65725
10611 -65725 -43503 -34580 2726 12529 -17883 -22268 -17121 26258 21253 9315 -35835 -55592 -28323
10598 -28323 14147 68888 70954 10257 -84178 -51125 -21490 -34727 -103114 -141542 -57371 -13920
10586 -13920 -64292 -123843 -137082 -76222 -9367 -5819 -18966 -62621 -61069 -4498 22013 52417
10574 52417 43662 37125 58020 78963 78804 108147 76234 11833 -65510 -21586 19744 21851 54040
10561 54040 51036 43012 -7022 -57986 -69487 -24296 23267 25774 28202 107675 149037 30966
10549 30966 -19042 20765 81457 120250 144921 117292 -11253 -57736 -35645 -56080 -46162 -13055
10537 -13055 37918 16365 -51241 -67903 -29111 -77919 -85458 -52029 -24401 -61249 -49153 -46558
10525d6558M9273M8941m0178M3410n6201m1601l4616J6950k6550K2151m6418n431
10513a16828L2498L1867J5270N6693r347j6652n8932k8542R839N1084J1119j6316
10501c8247K43J5182M3559l118l2924L6877K5825J9531l6884q674J4394m3337
10489g573m3332J6173P338K9240K0315K4743M140r289n442l4329n6038l6350J5376
10476g5028K4227K6904k7627M4999O9432K094l450r6814n339M6503O7455j816
10464G1540l5629l1497n5650K0347l1216o0058j8816j368O9541L6172N4111k4792
10452g315j3333l8609k5681P215J4412R6468K9778k459j3875J9124j2565k8372
10440B4788m267J196n5491K2022L6036l6996n5831l6329k783K147O2645K2828
$$ plain form
10525 -46558 2715 51656 11478 54888 -1313 -42914 -77530 -60580 -87130 -64979 -111397 -116828
10513 -116828 -84330 -52463 -37193 19500 10153 -6499 -65431 -93973 -84134 -33050 -21931 -38247
10501 -38247 -38004 -22822 20737 17619 -15305 21572 47397 66928 30044 21370 35764 -7573
10489 -7573 -50905 -34732 -27394 1846 22161 46904 51044 41755 36313 1984 -54054 -90404 -75028
10476 -75028 -50801 -23897 -51524 -6525 62907 65001 61551 -35263 -40602 5901 73356 71540
10464 71540 35911 4414 -51236 -30889 -62105 -122163 -140979 -142347 -72806 -36634 17477 -7315
10452 -7315 -20648 -59257 -84938 -77723 -63311 33157 62935 60476 46601 65725 53160 24788
10440 24788 20521 21717 -33774 -11752 24284 -12712 -68543 -104872 -107655 -105508 -42863 -20035
10428b0035n0710O3299J342j5210j6242r7934k6014K9766L5057M2023k7952k4952
10416a07562N0592O3171m7228m777p362L378O1543N8288L9591L021l8906j3636
10404F0113N257k405K0505k2463p8859l8837P288M6826N1529j3232m8069J0832
10392a515m595n097j4927k0722p0551L5139K4184R7459P5322j6099p4801n3772
10380b9975M4725N7317J3099k249k0955n3175l8908j1522l0295L5249L7198n5175
10368e4666K987K5095K8241O6930L0370n3385J0428J1152J9129K4803l1047p7904
10356B133m5436M4663m842J1366m475k4788l2676j7246M4266L9515P0431q670
10344G4241j0488K5090r368k8229o3322p628K5387j7925K0176L2861k4614j2433
$$ plain form
10428 -20035 -70745 -7446 -6104 -21314 -37556 -135490 -161504 -131738 -96681 -54658 -82610 -107562
10416 -107562 -56970 6201 -41027 -45804 -53166 -49788 11755 70043 109634 112655 73749 60113
10404 60113 65370 62965 83470 61007 -17852 -56689 -49401 -2575 48954 35722 -12347 -1515
10392 -1515 -6110 -11207 -26134 -46856 -117407 -82268 -58084 39375 114697 98598 23797 -29975
10380 -29975 14750 72067 85166 82917 61962 8787 -30121 -41643 -71938 -36689 509 -54666
10368 -54666 -51679 -26584 1657 68587 98957 45572 56000 67152 86281 111084 80037 2133
10356 2133 -43303 1360 -3482 7884 3409 -21379 -54055 -71301 -27035 12480 82911 74241
10344 74241 63753 88843 79475 51246 -12076 -19704 5683 -12242 7934 40795 16181 3748
10332C748j892K9637M2621p717k9500n5467m338J0913J4907L9193R5006N8100
10320A95211l1984q0420p5552J1424M350m2270K1081L7789n131M5645L0374k3935
10308H6582J8193n95Q306n5966n6374p986k6320k1112L8712M9158k8760l9941
10296c6103o925N6609j2675m2020J2259O233o946j6355N4123O5531l6746j3372
10284B3613l6307J9678K9484m0973m2154K6175J6121j2814l8557J7430l283p284
10272d8871M35J0496N8007L9225J9413l0129k8975j3541n484Q9121J02517m5109
10260A47105n0484j4850l1963q925K1712K9862r0575m9537P4917Q859p0857k8792
10248f3528K011P6755O7171k0590l8158q719p139o585l6981J2087K9188K5495
$$ plain form
10332 3748 1856 31493 74114 66397 36897 -18570 -22908 -11995 2912 42105 137111 195211
10320 195211 163227 82807 7255 18679 23029 -19241 1840 39629 34498 80143 110517 86582
10308 86582 104775 104180 112486 56520 146 -7840 -34160 -55272 -16560 32598 3838 -36103
10296 -36103 -43028 13581 906 -41114 -28855 -22622 -29568 -45923 8200 73731 36985 23613
10284 23613 -12694 6984 36468 -4505 -46659 -20484 -4363 -17177 -55734 -38304 -41587 -48871
10272 -48871 -48436 -37940 20067 59292 78705 48576 19601 6060 576 89697 192214 147105
10260 147105 96621 81771 49808 40883 62595 92457 1882 -47655 27262 36121 -34736 -63528
10248 -63528 -61517 15238 82409 61819 23661 14942 7803 1218 -35763 -23676 5512 31007
10236C1007P393o7285K05L0260l7993j813j7906J6774N0398M7924J3389k2726
10224D9627J0196J8560j713k1925n0088l376j6863K5038j1476j9171M3809q07
10212B1811m6741o407M0118N0419L2953o1586n0573j7555K4726j6400J0662j5454
10200c4027j5553J2649K951l8819j7587N7899K7429J30L566O5035n0376j16658
10188a03361J8836N5122M5430N0245L3463l3298j06715j8163k8944q8897k4905
10177b01187M5511J07113P5121n4465l2741N602O8757J5453R076J4846p320o2487
10165a6721j5263l648r534m5816n8528J0549M1662P3318L1050J4576m1198j1360
10153c0913l5694k3246J0962L7483N9104q502r902o74r337N767n660N1645O5705
$$ plain form
10236 31007 38400 -28885 -28680 1580 -36413 -38226 -56132 -39358 11040 58964 72353 49627
10224 49627 59823 78383 76670 54745 4657 1281 -15582 9456 -2020 -21191 22618 21811
10212 21811 -24930 -31337 8781 59200 92153 30567 -20006 -37561 -12835 -29235 -18573 -34027
10200 -34027 -49580 -36931 -33980 -72799 -90386 -32487 -5058 -4928 -1362 63673 13297 -103361
10188 -103361 -84525 -29403 16027 66272 99735 66437 -40278 -58441 -87385 -176282 -201187
10177 -201187 -155676 -48563 26558 -27907 -60648 -55046 13711 29164 38240 53086 45766 -16721
10165 -16721 -31984 -35632 -45166 -90982 -149510 -138961 -97299 -23981 7069 21645 -19553 -30913
10153 -30913 -66607 -89853 -78891 -41408 17696 9194 -708 -1382 -10719 -4952 -10612 41033 106738
10140A06738l271j7497J3996l1062m5781m6384K2269J2782k2958K3448r24J2215
10128B3571L7850l7710k9307l334p6001j5477M7338K9913K8363J3134l3206m618
10116a9484r082L3102N1352j2256m3650j5278J534J0132N5990M6648j6305l4789
10104D7914K177j764o0199m420J01167k276o8385n3793M7403Q367l5749l9187
10092e8745q251j1042L1164O300K4468L0173M0428k9817m8284j2645J7780L0312
10080A1841N8708J7725l9207j693K285L7044m7532l9776j5275Q0084N8229j2609
10068A09824M9508J21109J15706J34818L47388N68199J5742m30170k80994j96990
10058E54140q2375j17239r1111l1790K7063j5175n9323o0811m7879K371K0384
$$ plain form
10140 106738 103467 85970 99966 68904 23123 -23261 -992 11790 -11168 12280 11356 23571
10128 23571 61421 23711 -5596 -8930 -84931 -100408 -53070 -23157 5206 18340 -14866 -19484
10116 -19484 -28566 4536 55888 43632 -18 -15296 -13762 -3630 52360 99008 82703 47914
10104 47914 50091 48327 -11872 -16292 84875 82599 14214 -39579 7824 16191 -19558 -58745
10092 -58745 -66996 -78038 -46874 -40574 -16106 14067 54495 24678 -23606 -36251 -18471 11841
10080 11841 70549 88274 49067 47374 49659 86703 39171 -605 -15880 64204 122433 109824
10068 109824 159332 280441 396147 530965 878353 1446552 1462294 1032124 751130 554140
10058 554140 471765 354526 263415 231625 258688 243513 184190 123379 75500 77871 98255
10047I8255l7183q1033k7862j8255K0878J1726O4811K2441j1987l6894R704K6186
10035D0787l9544L3658l291q1641n5384k987L3113K8721K5450M4916L35M0795
10023F4928P8455J1088q4734p5998m6488N3472R7774M1447M291J2967q2786m5710
10011B8706l2509L0740K8795L980j7751j4164n784J5166l751k2228k3666n460
9999a7926M0857J239k7402L9057o6914k8705J6706l2155J1844K6514N9808P015
9987B9938R228j6478K3001K354l1404j4715l0439l2104P5215J0333j2062J0148
9975B3015j8140l9635M48M2922K4409M3227K378J1008q3921n5143P220K9802M397
9962h013O544J2971L3593m619j6064o5147k9442k8504L9644N795m107p493k935
$$ plain form
10047 98255 61072 -19961 -47823 -66078 -45200 -33474 31337 53778 41791 4897 14601 40787
10035 40787 1243 34901 31610 -50031 -105415 -108402 -75289 -46568 -21118 23798 24133 64928
10023 64928 143383 154471 69737 -6261 -52749 723 98497 139944 144235 157202 74416 28706
10011 28706 -3803 26937 55732 59712 41961 27797 22013 37179 33428 11200 -12466 -17926
9999 -17926 22931 24170 -3232 35825 -31089 -59794 -43088 -75243 -63399 -36885 22923 29938
9987 29938 39166 22688 45689 48043 16639 1924 -28515 -60619 14596 24929 12867 23015
9975 23015 4875 -34760 -34312 8610 33019 76246 78624 89632 5711 -49432 -42212 -12410 -8013
9962 -8013 -1469 11502 45095 40476 24412 -40735 -70177 -98681 -59037 -53242 -57349 -64842 -67777
9949f7777O3526J3484J3259P611k0786q8068j7858L5020L9984P2161K2235m1813
9937C0978j3546j7462L036m220k5621m61L9674n0593J5706L8212k6842q6421Q163
9924h9397r418L201M7420K185M6243P1709j2122J5385j3493k643l4569l9254k7274
9911d2027k3438p8537J09147Q7660j8270m5098N214J294j2598j7394O275l5727
9899f3499k9529r821L5578J12510J9856n4986R083l127l14j9211P021j1828J890
9886f377l44M1466J2665l4059l8038L0332q513n1861N400N4247L5960L6272l948
9873G3202r6008J700K9866N7035L9212o020k8888n1805k203q7032j6775J140k4107
9860a10683J2807M3212J8663J0420J0013o579M5667L254l5462J7305K1938K1673
$$ plain form
9949 -67777 -4251 9233 22492 30103 9317 -78751 -96609 -61589 -21605 50556 72791 30978
9937 30978 17432 -30 3006 -1214 -26835 -27296 12378 -38215 -22509 15703 -11139 -97560 -89397
9924 -89397 -98815 -95614 -48194 -46009 234 71943 59821 75206 61713 59070 24501 -14753 -42027
9911 -42027 -65465 -144002 -34855 52805 34535 -10563 -5349 -4055 -16653 -34047 -27772 -63499
9899 -63499 -93028 -102849 -67271 45239 65095 10109 19192 16065 15751 -3460 3561 -8267 -6377
9886 -6377 -6721 34745 47410 13351 -24687 5645 -2868 -54729 -49329 4918 40878 77150 73202
9873 73202 -22806 -21106 8760 65795 105007 98987 70099 18294 16091 -70941 -87716 -86576 -110683
9860 -110683 -97876 -54664 -36001 -25581 -15568 -22147 23520 26774 -8688 8617 30555 52228
9848E2228L3954o114q3723m4267N5344L0046N605O3529k7162m9403L7847K3450
9836I1334k3020q9281q672l0237N3724K5272N0102K5568O5516j7946m958K5896
9824A63298j2359o7849l5681k689L105k074J2314R943j127q9652k5703P863N8907
9811A8296K6342N4706n562m9297j6457R171m97M4644j7693m6781L3176M3186l9527
9798E3707o7226m2126J5493j5989N1729J03024K03567O3640m4249j32260o7901
9787A21409m4571n6307R095l5623j2260L5264o1383j04905L3868L4861K7504J8678
9775c4370k4536J7392l301M4483L1597J1992j3024m3539J6322J4436m9550p3888
9763a05986k3684P4257M973n5646j2348P3640O5270L4024l985p9342l7663O7223
$$ plain form
9848 52228 86182 80068 -3655 -47922 7422 37468 43073 106602 79440 30037 67884 91334
9836 91334 68314 -20967 -29639 -59876 -6152 19120 69222 94790 160306 142360 137402 163298
9824 163298 150939 83090 47409 44720 47825 45751 58065 68008 66881 -22771 -48474 -40611 18296
9811 18296 44638 99344 93782 44485 28028 37199 36702 81346 63653 16872 50048 93234 53707
9798 53707 -13519 -55645 -40152 -56141 -4412 98612 302179 365819 321570 189310 121409
9787 121409 76838 20531 29626 -5997 -18257 17007 -44376 -149281 -115413 -80552 -53048 -34370
9775 -34370 -58906 -41514 -44815 -332 31265 43257 30233 -13306 3016 17452 -32098 -105986
9763 -105986 -129670 -55413 -50440 -106086 -118434 -44794 20476 54500 50515 -28827 -66490 733
9751G33N6131N1028j6316j8911r415m6434J4131O4300l0638l1695p134j0819L8727
9738E3688R362l7826j4998l8675j5332j3204l2069n7739O0288N6268O1587m21
9726C0929k419J5146j2006l9394N6436K7192k2537k948k0631M752J1902l9714
9714F708J7077P4908j1834j524J8573j4880L1613P825p7654o7600K762J01738
9702H7712N2287P324m6413m9022m6888J6454k4920N0546K6336p1673k386K7475
9690B6832j5508P141P54m6509P419Q0035j1176k6882m6710m9945N8642M4889m9424
9677b0442J2192M1304L3922p625M582J9464m9162n5377j0153L7845L0770k505
9665C4815K9711j3319k2983p5802l4795k3263N3903M6303N816j7659N833j3597
$$ plain form
9751 733 56864 107892 91576 72665 63250 16816 30947 95247 64609 32914 25780 14961 53688
9738 53688 63050 25224 10226 -28449 -43781 -56985 -89054 -146793 -86505 -30237 31350 30929
9726 30929 28510 43656 31650 -7744 48692 75884 53347 50399 29768 34520 46422 6708
9714 6708 23785 98693 86859 85335 103908 89028 120641 128466 50812 -16788 -14026 87712
9702 87712 139999 147323 100910 51888 5000 21454 -3466 47080 73416 1743 -643 26832
9690 26832 11324 18465 19219 -27290 -19871 60164 48988 22106 -24604 -74549 -15907 28982 -20442
9677 -20442 -8250 33054 66976 59351 63933 83397 34235 -21142 -31295 6550 37320 34815
9665 34815 64526 51207 28224 -47578 -82373 -105636 -51733 -5430 386 -17273 -11440 -25037
9653b5037J3941M8758R657l6811k2033m3722j0746j4650O1884P1548l7043n7343
9641d1597L376j0281Q1329M8829k4099k7391n424P791J583M773N9662l1310o6005
9628A236M7784j3117j9739j8810J0358l238m130K9125J5378k1091M1810L7764
9616A03330q484m3425q7882N1772O3399o427L672j9411l9925J3889M8682l4885
9604D4305n8002J894O0798J1035O444j5028j1765M710J7593j20383j6286l7692
9592a12377p280M2413J8649O2418M9160J7137m4458j3454p2241K4305K6495K4483
9580A5250O741L731K9343o707n9055n1355l6966n0257N5805M9833L7565k4861
9568c0933Q09J9718M853p2666O092N3525N0340J7014k9692j6235j0552j9814m1232
$$ plain form
9653 -25037 -11096 37662 47319 10508 -11525 -55247 -65993 -80643 -18759 52789 15746 -41597
9641 -41597 -38221 -48502 32827 81656 57557 30166 24742 32533 34116 38889 98551 67241 1236
9628 1236 49020 35903 16164 -2646 7712 4474 344 29469 44847 23756 65566 103330
9616 103330 94846 51421 -36461 15311 78710 72283 75955 56544 16619 30508 79190 44305
9604 44305 -13697 -11803 48995 60030 66474 51446 39681 44391 61984 -58399 -74685 -112377
9592 -112377 -119657 -77244 -58595 3823 52983 70120 25662 12208 -60033 -35728 -9233 15250
9580 15250 21991 25722 55065 48358 -10697 -62052 -99018 -149275 -93470 -43637 -6072 -30933
9568 -30933 -30124 -10406 -5553 -78219 -72127 -18602 31738 48752 19060 2825 -7727 -27541 -68773
9555f8773N0942R5875k6147q799m1200j25968N426L3045p778J0552J7651P4547
9543I373N6243j6950l2784K3381R786K8020R088j155o814j8970N233k4672j8515
9530B1264m7733O9938N8316l7259m8771M622m4o382k2399J3180N0605R048K7295
9517I1680J9302j6527n979K7045k1738j06037k0648J9994l5140J3121J9535l19
9505a5711J2596J7576L5102L6251j1004q4237j487J25951L5851m3407J0196L6324
9493A54001p5775l8402j4319K213l2106m183N6486M8928K9629j6426q2796J1097
9481C8347L6562M1070J7190k2199k2869p9167m3531r921L32K9176M4078m1152
9469a2084N4180N7463r269J3084j9473K1231J6060p2863k2599L3285k7335l7151
$$ plain form
9555 -68773 -17831 78044 51897 43098 1898 -124070 -118644 -85599 -93377 -82825 -65174 9373
9543 9373 65616 48666 15882 39263 49049 77069 86157 85002 78188 59218 64451 39779 21264
9530 21264 -26469 43469 101785 64526 15755 20377 20333 13951 -8448 4732 55337 64385 91680
9517 91680 110982 94455 88476 115521 93783 -12254 -32902 -12908 -48048 -34927 -15392 -15711
9505 -15711 -3115 14461 49563 85814 74810 -9427 -10914 115037 150888 107481 117677 154001
9493 154001 78226 39824 25505 27718 -4388 -8571 47915 96843 126472 110046 27250 38347
9481 38347 74909 115979 133169 110970 88101 8934 -34597 -44518 -44186 -15010 29068 -12084
9469 -12084 42096 99559 90290 103374 83901 105132 121192 48329 25730 59015 31680 -5471
9457e471L0206n840j9313j8863L7702N1729m736n8158k0300m2982M4128M4862
9445C2964j8129j8953J9673J0018J2630n2962O408M6385j2974l3747l3671P7534
9433C5176N1951m6234r396K2232L5979M4407p8485j6061o8181R049M3741L2518
9421E6696J5111n2527k5028K9911j6922m0139O489N5594J9416q664n9978L6728
9409A6687N4756Q954J4207r024l4212J0613L4665L7856m0184p1559k5169J4832
9397A2422l0173k6119L4460J7552p756K600k5747N880J5827O8288N4477J4046
9385A35757r4907o7838N8076r982n3635J875K2175r335j6116R548K7152k2434
9373a9664j7524M3104J4352p640j2169M0987M6093m967p1937M302J8692m781M7364
$$ plain form
9457 -5471 24735 18895 -418 -19281 18421 70150 65414 7256 -13044 -56026 -11898 32964
9445 32964 14835 -4118 15555 25573 38203 -14759 -8351 38034 25060 -8687 -42358 35176
9433 35176 87127 40893 31497 53729 89708 134115 55630 39569 -28612 -19563 24178 56696
9421 56696 71807 19280 -5748 24163 7241 -32898 -26409 29185 48601 39937 -20041 16687
9409 16687 71443 80397 94604 85580 51368 61981 96646 134502 94318 22759 -2410 12422
9397 12422 -17751 -43870 -9410 8142 386 2986 -22761 -16881 -1054 67234 121711 135757
9385 135757 40850 -26988 31088 21106 -32529 -30654 -8479 -17814 -33930 -24382 2770 -19664
9373 -19664 -37188 5916 20268 12628 459 41446 87539 82572 10635 14937 33629 28848 76212
9360G6212J3494q0397k1020n950R034K6849l2293P511Q4505N2576K7693n5299
9348A02915J5695k4047p5431R550L861K3247J1596k0838k4982M87J5585j360o0418
9335b4140l8625K7545O6159P1820j6426p8175l8655R5782k6864M4286L3288m0964
9323G5031n0303q6627k9596J1873O09O1124O8117L1869k9728O2678q70J8098J1470
9310A43745K1327k3665j537N073k8206N1638k9415o9940m8566O328p4837L2291
9298a5764K5491k537p96j2055l2796l4864Q811O4545L3580K2422J9775K4706K0827
9285A21345m9610l5379L0268R859J546N9343M3715m7003m360Q2775j6286m6094
9273A50119m1077j5622J8712j8107j9114M0998N6230j6367q3599l341J2749p666
$$ plain form
9360 76212 89706 9309 -11711 -17661 -8627 18222 -14071 -6560 77945 130521 158214 102915
9348 102915 118610 94563 19132 28682 32543 55790 67386 46548 21566 22053 37638 36278 -24140
9335 -24140 -62765 -35220 30939 102759 86333 8158 -30497 65285 38421 82707 115995 75031
9323 75031 24728 -61899 -91495 -79622 -79013 -17889 50228 82097 52369 115047 114177 132275 143745
9310 143745 165072 141407 139870 144943 116737 168375 138960 69020 20454 26782 -48055 -15764
9298 -15764 9727 7190 6394 -5661 -38457 -73321 -64510 35 33615 56037 75812 100518 121345
9285 121345 71735 36356 66624 76483 78029 137372 181087 134084 129724 212499 196213 150119
9273 150119 109042 93420 112132 94025 74911 115909 172139 155772 72173 68832 81581 73915
9261G3915j4467J6963L4767j842l005O0652L9081r7678j7301J2351J8505l6254
9249H5687j9939L4523k616O048k7349j7750k702M8703k6596K5728l8019n2608
9237A3110j9574j9643N7380Q2633K0544O5996j5603m5296l5732L2416N3453k7310
9225A62374k6580J8505L0390l1993o7064k4262M2781J2567j4452n9965k4532O3581
9213H1350k3329Q577N961K0653m5974k2171k713j0960K6661J5096K9357M6082
9201A28590P0894M9131o9310r0551n4785m4265J08866J58322K8868n2857j36021
9190I6882o3513K493J3404M4068N4120M0862m0741l3326J8066K381P972N0477
9178A93145O5739o7084q0738j5507K2167L2226m9955r543O401K5816l951j8116
$$ plain form
9261 73915 59448 76411 111178 109336 106331 166983 206064 108386 91085 103436 121941 85687
9249 85687 65748 100271 97655 103703 76354 58604 55902 104605 78009 103737 65718 13110
9237 13110 -6464 -26107 31273 113906 134450 200446 184843 139547 103815 136231 189684 162374
9225 162374 135794 154299 184689 152696 85632 61370 104151 116718 102266 42301 17769 81350
9213 81350 58021 66598 72559 93212 47238 25067 22354 11394 38055 53151 82508 128590
9201 128590 199484 248615 179305 88754 33969 -10296 98570 256892 285760 232903 96882
9190 96882 33369 35862 49266 93334 147454 188316 147575 114249 132315 134696 142668 193145
9178 193145 258884 191800 111062 95555 117722 149948 99993 90450 96851 122667 118716 100600
9166A00600J6516q254O9599m1189p0820J637M400k48l9730N5550N8918j5922o1759
9153F9298L0709L834k5073o347J5758N1417P256j3844J7498j4438j0157m8129
9141G7782L9725Q812j3003L5752M287N5747Q674o2104n2784l7082L1818m8439
9129D9185M13Q2506O8966K6818j05097n3532L8698M6142l0392l9773P4499M4630
9117B03063m8601J6644j2870n819q8511K1564O4050K3913r0195j9115M6641N8787
9105A69551N8038N608l3174n045J6239L1213K5553k0913n4420r96j2496Q765R3296
9092B81219K6094N501P19J614j5422k7658l4650J3109J8787M2247R3442P7577
9080D82579P1878P5756R1530J03389R9492J49127K31576J67512K50825K59401
$$ plain form
9166 100600 117116 108862 178461 137272 66452 68089 72489 72241 32511 88061 146979 131057 69298
9153 69298 100007 103841 78768 72421 88179 139596 146852 133008 150506 136068 125911 77782
9141 77782 117507 126319 113316 149068 153355 209102 217776 155672 102888 65806 97624 49185
9129 49185 49598 132104 201070 227888 122791 69259 107957 154099 123707 83934 158433 203063
9117 203063 154462 171106 158236 152417 63906 85470 149520 173433 83238 64123 110764 169551
9105 169551 227589 233197 200023 194978 211217 242430 267983 247070 192650 191654 179158 187923 281219
9092 281219 307313 312814 313533 315147 299725 272067 237417 250526 269313 311560 405002 482579
9080 482579 554457 630213 721743 825132 924624 1073751 1305327 1472839 1723664 1983065
9070A983065K02545J74371L49544N53982O40738Q82400J231247J951592L758308
9061A1727792P512276J2684605O175159q020136q274794n019114l698137l300542
9053I787109k635833j830767j288685q60634n46600m46725k63072k06481k23119
9044A485193k51627k05049j31143m8129k1555j14588o7777q3615j17710P512O4558
9033E16070k3929m8040m0962l5850r565l6382k0423k687j4093m737q2571j4809
9021A82022N5973L0953j1329l3092K5890K406n3700m922l556j929j8923l4893
9009A34900j951j8122k7856M1816Q6254J9568q5416n1290P494N8968M07k8865
8997A35907l573k480k8808L1785J285o0952m358O0734J212J5469J1613J8189j0900
$$ plain form
9070 1983065 2185610 2359981 2709525 3263507 3904245 4786645 6017892 7969484 11727792
9061 11727792 19240068 31924673 38099832 30079696 21804902 16785788 13087651 9787109
9053 9787109 7151276 5320509 4031824 3171190 2624590 2177865 1914793 1708312 1485193
9044 1485193 1233566 1028517 897374 849245 827690 713102 645325 561710 444000 451512 516070
9033 516070 492141 444101 403139 367289 357724 321342 300919 298232 284139 279402 196831 182022
9021 182022 237995 268948 257619 224527 250417 252823 199123 194201 190645 188716 169793 134900
9009 134900 132949 114827 86971 128787 215041 234609 149193 97903 105397 164365 164772 135907
8997 135907 132334 129854 101046 132831 134116 73164 68806 129540 130752 146221 157834 176023 165123
8984A65123l3688k0064k1622J7828j1622q1291Q7783K2351K1143l7715q988j828
8972I7410J9846q588n8866n5042J8366J30764J02151J1306l7232j05271j6895
8961I7949K2296K5437N1861l0884q8221K552M4403O988j6618m2883o003K4664
8949I1541P071j0125L6501L1384p5566K7792N705l6078J790J1564M5546J8653
8937A55778K6546j2862k8552M9257k0297o1912m7186j7981N5270L2577m810m0136
8925H5692R270k2768l784J8179j1813k6752r124P715m876N1892q191k7052n0462
8912G926J1080L1875L5792J3047R893n4544l5419l2565j6273l92k0264l2805K5409
8899e7240L0718M5986K4912l6999r738N8899o992j2964O6091p297K7257k0376
$$ plain form
8984 165123 131435 111371 89749 107577 95955 14664 102447 124798 145941 108226 99238 97410
8972 97410 117256 108668 49802 -5240 13126 143890 246041 257347 220115 114844 97949
8961 97949 120245 145682 197543 166659 78438 80990 125393 132381 115763 72880 66877 91541
8949 91541 98612 88487 124988 156372 80806 108598 114303 78225 80015 91579 137125 155778
8937 155778 182324 169462 140910 190167 169870 107958 60772 42791 98061 130638 125828 85692
8925 85692 94962 72194 68410 86589 74776 48024 38900 46615 41739 93631 85440 58388 7926
8912 7926 19006 50881 86673 99720 109613 55069 19650 -12915 -29188 -29580 -49844 -82649 -57240
8899 -57240 -26522 19464 44376 7377 -2361 56538 49546 36582 102673 95376 122633 102257
8887A02257L0375O821m7189m304J0921l3984j8256k2644N4323O4718N267J228
8875A49533k8453k4121n1159J6869l7591M5581N3164O45j424j0607J5109p9843
8863D7703l6946M747K6050O4690k4310M566J7262p9664K135N1370Q577k7060j0894
8850D8226J7661j9115K2248p4404m4673L1565M343m0907J2170J9708M723k0165
8838c8620r068L2934M1493l5620j1934J0381Q303K8691M1913Q94Q468n4193n7352
8825c3710J0107K4282L0854j7119m7439l4379K0216K7716q263l8054O2892k9924
8813c2821M10L6454j6614j8052K493J3538K0786l6786j6597O5677K4741L7060
8801H0289o608o2338L86L6836m309p1155k669P3661P850k6552l7894K0477k851
$$ plain form
8887 102257 132632 139453 92264 87960 98881 64897 46641 23997 78320 143038 148305 149533
8875 149533 121080 96959 45800 62669 25078 70659 123823 124468 123044 112437 127546 47703
8863 47703 10757 15504 41554 106244 81934 86500 103762 24098 26233 77603 86180 59120 48226
8850 48226 65887 46772 69020 -5384 -50057 -18492 -14149 -55056 -42886 -23178 -18455 -38620
8838 -38620 -47688 -14754 26739 -8881 -20815 -10434 -2131 26560 68473 69367 77835 23642 -33710
8825 -33710 -23603 679 31533 14414 -33025 -67404 -47188 -19472 -27735 -65789 -2897 -32821
8813 -32821 -32411 4043 -12571 -30623 -28130 -14592 6194 -30592 -47189 18488 43229 80289
8801 80289 73681 11343 11729 48565 44256 -26899 -29568 44093 51943 25391 -12503 7974 5123
8788E123N050n0362J5851N5354p256n632j3526J0852L9742j8189l3087j2602N5123
8775D6441M3808n740L268k3507K1822j0913M095p71r259J7838l3949l1145P024
8762B9012P479R4246N9328k0725k847j1792m2382k6422J1166J1755l2884m1541
8750C4393n5172k315J7360J2153j5369M5417L3078o8711l3691N0685J4257L208
$$ plain form
8788 5123 10173 -40189 -24338 31016 23760 18128 4602 15454 55196 37007 3920 -8682 46441
8775 46441 90249 84509 87777 64270 86092 75179 79274 78503 69244 87082 53133 21988 29012
8762 29012 36491 130737 190065 169340 166493 154701 112319 85897 97063 108818 75934 34393
8750 34393 -20779 -23094 -5734 6419 -8950 36467 69545 834 -32857 17828 32085 35293
$$ [...]
##END NTUPLES=NMR SPECTRUM
##END=
