##TITLE=Analysis number 330105
Compound Code cc 63714
Book Reference 547/32/5
Project Code adrs
Chemist Name simonw
##JCAMPDX= 6.0         $$ Bruker NMR JCAMP-DX V2.0
##DATA TYPE= NMR SPECTRUM
##DATA CLASS= NTUPLES
##ORIGIN= Bruker BioSpin GmbH
##OWNER= nmr
$$ XWIN-NMR		Version 3.5
$$ Mon Oct 29 10:12:09 2007 GMT Standard Time (UT+0h)  MAYBRIDGE\nmr@NMR_250MHZ
##.OBSERVE FREQUENCY= 250.131544655141
##.OBSERVE NUCLEUS= ^1H
##.ACQUISITION MODE= SIMULTANEOUS (DQD)
##.ACQUISITION SCHEME= undefined
##.AVERAGES= 16
##.DIGITISER RES= 18
##SPECTROMETER/DATA SYSTEM= dpx250
##.PULSE SEQUENCE= zg30
##.SOLVENT NAME= CDCl3
##.SHIFT REFERENCE= (INTERNAL, CDCl3, 0, 16.522)
##AUDIT TRAIL= $$ (NUMBER, WHEN, WHO, WHERE, WHAT)
$$ ##TITLE= Audit trail, XWIN-NMR		Version 3.5
$$ ##JCAMPDX= 5.01
$$ ##ORIGIN= Bruker BioSpin GmbH
$$ ##OWNER= nmr
$$ C:\u/data/dgb/nmr/ADRS/1420/pdata/1/auditp.txt
$$ ##AUDIT TRAIL=  $$ (NUMBER, WHEN, WHO, WHERE, WHAT)
(   1,<2007-10-29 10:11:47.31 +000>,<MAYBRIDGE\nmr>,<NMR_250MHZ>,
      <created by zg, POWCHK disabled, PULCHK disabled
       configuration hash MD5:
       76 6E 9A 78 1E 09 19 81 EC 84 63 8F B0 6A 59 2D
       data hash MD5: 64K
       29 43 E3 BB F6 48 C1 A0 3D 34 F5 52 D3 66 7E 56>)
(   2,<2007-10-29 10:12:00.00 +000>,<MAYBRIDGE\nmr>,<NMR_250MHZ>,
      <Start of raw data processing
       ef LB = 0.3 FT_mod = 6 PKNL = 1 SI = 32K 
       data hash MD5: 32K
       84 FB 5D B6 EA 6A 57 F0 5C 80 25 E3 A9 4A FF CB>)
(   3,<2007-10-29 10:12:01.62 +000>,<MAYBRIDGE\nmr>,<NMR_250MHZ>,
      <apk 
       data hash MD5: 32K
       13 D7 63 41 37 BE 27 76 78 E5 75 07 0B 95 E8 84>)
(   4,<2007-10-29 10:12:02.37 +000>,<MAYBRIDGE\nmr>,<NMR_250MHZ>,
      <abs ABSG = 5 
       data hash MD5: 32K
       17 B3 78 7F 55 C6 4B 9D 7B 2B D3 2E 22 01 4B 65>)
$$ ##END=
$$ 
$$ hash MD5
$$ 06 C7 71 DA 26 BD 6B DE E9 E5 93 D7 6A 43 A5 3A
##$RELAX= 
##$RELAX= 
##$RELAX= 
##$RELAX= 
##$RELAX= 
##$RELAX= 
##$RELAX= 
$$ Bruker specific parameters
$$ --------------------------
##$DU= <C:\u>
##$EXPNO= 1420
##$NAME= <ADRS>
##$PROCNO= 1
##$TYPE= <nmr>
##$USER= <dgb>
##$AMP= (0..31)
100 100 100 100 100 100 100 100 100 100 100 100 100 100 100 100 100 100 
100 100 100 100 100 100 100 100 100 100 100 100 100 100 
##$AQSEQ= 0
##$AQ_mod= 3
##$AUNM= <au_zg>
##$AUTOPOS= <10 >
##$BF1= 250.13
##$BF2= 250.13
##$BF3= 250.13
##$BF4= 250.13
##$BF5= 500.13
##$BF6= 500.13
##$BF7= 500.13
##$BF8= 500.13
##$BYTORDA= 1
##$CFDGTYP= 0
##$CFRGTYP= 5
##$CHEMSTR= <none>
##$CNST= (0..31)
1 1 145 1 1 1 1 1 1 1 1 1 1 1 1 1 1 1 1 1 1 1 1 1 1 1 1 1 1 1 1 1 
##$CPDPRG= <>
##$CPDPRG1= <>
##$CPDPRG2= <>
##$CPDPRG3= <>
##$CPDPRG4= <mlev>
##$CPDPRG5= <mlev>
##$CPDPRG6= <mlev>
##$CPDPRG7= <mlev>
##$CPDPRG8= <mlev>
##$CPDPRGB= <>
##$CPDPRGT= <>
##$D= (0..31)
0 1 0 0 0 0 0 0 0 0.06 0 0 0 0 0 0 0.0002 0 0 0 0 0 0 0 0 0 0 0 0 0 0 
0 
##$DATE= 1193652705
##$DBL= (0..7)
120 120 120 120 120 120 120 120 
##$DBP= (0..7)
150 150 150 150 150 150 150 150 
##$DBP07= 0
##$DBPNAM0= <>
##$DBPNAM1= <>
$$ [...]
##$SUBNAM7= <"">
##$SUBNAM8= <"">
##$SUBNAM9= <"">
##$SW= 20.6930455092707
##$SWIBOX= (0..15)
0 0 3 0 0 0 0 0 0 0 0 0 0 0 0 0 
##$SW_h= 5175.983436853
##$TD= 65536
##$TD0= 1
##$TE= 295.16
##$TE2= 300
##$TE3= 300
##$TEG= 300
##$TL= (0..7)
0 120 120 120 120 120 120 120 
##$TP= (0..7)
150 150 150 150 150 150 150 150 
##$TP07= 0
##$TPNAME0= <>
##$TPNAME1= <>
##$TPNAME2= <>
##$TPNAME3= <>
##$TPNAME4= <>
##$TPNAME5= <>
##$TPNAME6= <>
##$TPNAME7= <>
##$TPOAL= (0..7)
0.5 0.5 0.5 0.5 0.5 0.5 0.5 0.5 
##$TPOFFS= (0..7)
0 0 0 0 0 0 0 0 
##$TUNHIN= 0
##$TUNHOUT= 0
##$TUNXOUT= 0
##$USERA1= <user>
##$USERA2= <user>
##$USERA3= <user>
##$USERA4= <user>
##$USERA5= <user>
##$V9= 5
##$VALIST= <valist>
##$VCLIST= <CCCCCCCCCCCCCCC>
##$VD= 0
##$VDLIST= <DDDDDDDDDDDDDDD>
##$VPLIST= <PPPPPPPPPPPPPPP>
##$VTLIST= <TTTTTTTTTTTTTTT>
##$WBST= 1024
##$WBSW= 4
##$XGAIN= (0..3)
0 0 0 0 
##$XL= 0
##$YL= 0
##$YMAX_a= 291628
##$YMIN_a= -428817
##$ZGOPTNS= <>
##$ZL1= 120
##$ZL2= 120
##$ZL3= 120
##$ZL4= 120
##$ABSF1= 16.522
##$ABSF2= -4.171173
##$ABSG= 5
##$ABSL= 3
##$ALPHA= 0
##$AQORDER= 0
##$ASSFAC= 0
##$ASSFACI= 0
##$ASSFACX= 0
##$ASSWID= 0
##$AUNMP= <proc_1d>
##$AZFE= 0.1
##$AZFW= 0.1
##$BCFW= 0
##$BC_mod= 0
##$BYTORDP= 0
##$COROFFS= 0
##$CY= 12.5
##$DATMOD= 1
##$DC= 0
##$DFILT= <>
##$DTYPP= 0
##$F1P= 14.0000005364418
##$F2P= -0.99999901652339
##$FCOR= 0.5
##$FTSIZE= 32768
##$FT_mod= 6
##$GAMMA= 0
##$GB= 0
##$INTBC= 1
##$INTSCL= 1
##$ISEN= 128
##$LB= 0.3
##$LEV0= 0
##$LPBIN= 0
##$MAXI= 10000
##$MC2= 0
##$MEAN= 0
##$ME_mod= 0
##$MI= 0
##$NCOEF= 0
##$NC_proc= -4
##$NLEV= 6
##$NOISF1= 0
##$NOISF2= 0
##$NSP= 0
##$NTH_PI= 0
##$NZP= 0
##$OFFSET= 16.522
##$PC= 1
##$PHC0= 157.876
##$PHC1= 17.34843
##$PH_mod= 1
##$PKNL= yes
##$PPARMOD= 0
##$PSCAL= 4
##$PSIGN= 0
##$REVERSE= no
##$SF= 250.13
##$SI= 32768
##$SIGF1= 0
##$SIGF2= 0
##$SINO= 400
##$SIOLD= 32768
##$SREGLST= <1H.CDCl3>
##$SSB= 0
##$STSI= 32768
##$STSR= 0
##$SW_p= 5175.98343685301
##$SYMM= 0
##$S_DEV= 0
##$TDeff= 65536
##$TDoff= 0
##$TI= <Analysis number 999999
Compound Code 99
Book Reference 9
Project Code 9>
##$TILT= no
##$TM1= 0
##$TM2= 0
##$TOPLEV= 0
##$USERP1= <user>
##$USERP2= <user>
##$USERP3= <user>
##$USERP4= <user>
##$USERP5= <user>
##$WDW= 1
##$XDIM= 32768
##$YMAX_p= 273919432
##$YMIN_p= -462052
$$ End of Bruker specific parameters
$$ ---------------------------------
##NTUPLES= NMR SPECTRUM
##VAR_NAME=  FREQUENCY,     SPECTRUM/REAL,   SPECTRUM/IMAG
##SYMBOL=    X,             R,               I
##VAR_TYPE=  INDEPENDENT,   DEPENDENT,       DEPENDENT
##VAR_FORM=  AFFN,          ASDF,            ASDF
##VAR_DIM=   32768,         32768,           32768
##UNITS=     HZ,            ARBITRARY UNITS, ARBITRARY UNITS
##FACTOR=    0.157963299565203, 1,           1
##FIRST=     4132.6476996994, 0,             0
##LAST=      -1043.33573715361, 0,           0
##MIN=       -1043.33573715361, -462052,     0
##MAX=       4132.6476996994, 273919432,     0
$$ Real data points
##PAGE= N=1
##DATA TABLE= (X++(R..R)), XYDATA
$$ [...]
19642C64126n9039P392j1886Q5460N3737l0904O3737k6157j52412q8859R855n709
$$ 364126 305087 312479 300593 386053 439790 408886 472623 446466 294054 205195 215050 209341
19630B09341O6243k5311j41202K4086p5685p6423J6682O5634r442j9350K2964
$$ 209341 275584 250273 109071 133157 57472 -18951 -2269 63365 53923 34573 57537
19619E7537M9426O0518P62n9421n5410J14522o4027o5413j1175J7684L4879M9901
$$ 57537 106963 167481 168243 108822 53412 167934 103907 38494 27319 45003 79882 129783
19607A29783R7184P2825Q099j584m4922J9643M60Q8063J29076J13342M2747Q5438
$$ 129783 226967 299792 307891 306307 261385 281028 281488 369551 498627 611969 654716 740154
19595G40154P0566R3300J28795r3764o9100m7416k04635k66277q3524n167K6048
$$ 740154 810720 904020 1032815 939051 869951 822535 617900 351623 268099 262932 288980
19584B88980o0588n4860j5000K2785k4870q6N9247p0431M7048N4271k8139n1155
$$ 288980 228392 173532 158532 181317 156447 156361 215608 145177 192225 246496 218357 167202
19572A67202j30745p0782N784o5272R7536O6111j5896R8256n1836L733Q953r5636
$$ 167202 36457 -34325 -28541 -93813 3723 69834 53938 152194 100358 104091 113044 17408
19560A7408q3510M946L5000j1758Q957J04685j8430l0413n4220p4174K2196J10365
$$ 17408 -66102 -61156 -26156 -37914 -28957 75728 57298 26885 -27335 -101509 -79313 31052
19548C1052J20753p7740j8188j44255L4187L0635M2718j00549k9366m243M0229
$$ 31052 151805 74065 55877 -88378 -54191 -23556 19162 -81387 -110753 -114996 -74767
19537g4767J05876P8359o4115M306N615N56r3583K4643p0971R1746J00392R522
$$ -74767 31109 109468 45353 49659 55274 55830 -37753 -13110 -84081 7665 108057 117579
19525A17579K7139l0023k0320M6760p9455o5436l279p9749m2573L6652J29398
$$ 117579 144718 114695 94375 141135 61680 -3756 -7035 -86784 -129357 -92705 36693
19514C6693n683O508K8349q6717o1148L2109r724L9793P1140Q4396k4482j16365
$$ 36693 31010 37518 65867 -20850 -81998 -49889 -59613 -19820 51320 135716 111234 -5131
19502e131j01361J26614k2775M7464m5028l6282j40410n4490Q1511Q483m5343
$$ -5131 -106492 20122 -2653 44811 -217 -36499 -176909 -231399 -149888 -141405 -186748
19491a86748O9856O3309J846J05334J50182r0782l8063o6630m4038J7523k4707
$$ -186748 -116892 -53583 -51737 53597 203779 112997 74934 8304 -35734 -18211 -42918
19480d2918q3795p9959j5857K935Q4614J22683Q4618M0849L9198k0650q7872j19322
$$ -42918 -126713 -206672 -222529 -219594 -134980 -12297 72321 113170 152368 131718 43846 -75476
19468g5476L3159L1336n0075n8561k2686J29943J17382K5991j58497j03688r8698
$$ -75476 -42317 -10981 -61056 -119617 -142303 -12360 105022 131013 -27484 -131172 -229870
19457b29870O9905J58336J12083l1533n6738q15j9098Q7111k6516j1667j69781
$$ -229870 -159965 -1629 110454 78921 22183 21368 2270 89381 62865 51198 -118583
19446a18583j27708J06144J14319J34923r3121n0593O1350L8476j05993N2142
$$ -118583 -246291 -140147 -25828 109095 15974 -34619 26731 65207 -40786 11356
19436A1356Q6970r8916j37395R2024J85539j0215j20113q6890O4256P1904M1549
$$ 11356 98326 -590 -137985 -45961 139578 129363 9250 -77640 -13384 58520 100069
19425A00069L3235r992j10365k3097L4104M1161j4090n5853j20454Q1723O9389
$$ 100069 133304 123312 12947 -10150 23954 65115 51025 -4828 -125282 -43559 25830
19414B5830j077M5183K6631n359J574o4733J59112j5839n1581K952j2722j05186
$$ 25830 24753 69936 96567 91208 92782 28049 187161 171322 119741 122693 109971 4785
19402D785q9665R0606L9004R360O2915R0660p5151j95864q0572o319k7705l97
$$ 4785 -84880 5726 44730 54090 117005 207665 132514 -63350 -143922 -150241 -177946 -178343
19390a78343J27896L4745l3791n1942P070k1235P6601J125j03977m0447q8083
$$ -178343 -50447 -15702 -49493 -101435 -94365 -115600 -38999 -37874 -141851 -182298 -270381
19379b70381O6746P1468j2947K9103Q0982J07844K832p1396k7332O8548L5689
$$ -270381 -203635 -132167 -145114 -116011 -35029 72815 75647 4251 -23081 45467 81156
19368H1156p4086M3681k3018n9711M5362J10026P3655p0222K9851k2161q2670
$$ 81156 7070 50751 27733 -31978 13384 123410 197065 126843 156694 134533 51863
19357E1863K8899m7282j30604j53063j27307M6447k1891m1153J38613J88099L5602
$$ 51863 80762 33480 -97124 -250187 -377494 -331047 -352938 -394091 -255478 -67379 -31777
19346c1777L9694n0245L8012N0824K380K9723j17757M946j03131Q1519O5198R6275
$$ -31777 7917 -42328 -4316 46508 48888 78611 -39146 -34200 -137331 -55812 9386 105661
19334A05661l0591J8454m4300p0208n846p9696J07310L6248k7207j16644o5233
$$ 105661 75070 93524 49224 -20984 -26830 -106526 784 37032 9825 -106819 -172052
19323a72052m0466J9023M9307j5968J30522M103O3971j1963j02019L2023m4983
$$ -172052 -212518 -193495 -144188 -160156 -29634 -25531 38440 26477 -75542 -43519 -88502
19312h8502q555l0563M0427R6098P6365J9644p174p238m0392o2662m8558q359
$$ -88502 -97057 -127620 -87193 8905 85270 104914 97740 90502 50110 -12552 -61110 -69469
19300f9469q246J6918K6025R8531k3102l7882j12337l3369J78777p212n7473l8850
$$ -69469 -77715 -60797 -34772 63759 40657 2775 -109562 -142931 35846 28634 -28839 -67689
19288f7689n1596O2672N464L1607L1486R5740l9339q5203q5672M940P9304L1002
$$ -67689 -119285 -56613 -51149 -19542 11944 107684 68345 -16858 -102530 -97590 -18286 12716
19276A2716k3103p2998N3464M8109l2276m8490Q7795P1180l4918r4834K7352o1239
$$ 12716 -10387 -83385 -29921 18188 -14088 -62578 25217 96397 61479 -33355 -6003 -67242
19264f7242q3559l0776J2319J13233N0344r6613J10119J2304J9826O5826M9899
$$ -67242 -150801 -181577 -169258 -56025 -5681 -102294 7825 20129 39955 105781 155680
19253A55680R26j52718o5648O1831j05253l732J5480o8397J31591J06215J3256
$$ 155680 156606 3888 -61760 71 -105182 -108914 -93434 -161831 -30240 75975 89231
19242H9231O1217J2851n3947N4608j681r603o0100j36675J38524J38312J2928
$$ 89231 150448 163299 109352 163960 162279 152676 92576 -44099 94425 232737 245665
19231B45665m5847n3505p0285L2602J2968j4664N9148P2971q6054L0867Q4125
$$ 245665 199818 146313 76028 108630 121598 106934 166082 239053 152999 183866 267991
19220B67991m1612N998K974K2156q9781o5536L8309O2260K7010j15403O2267l0316
$$ 267991 226379 232377 235351 257507 167726 102190 140499 202759 229769 114366 176633 146317
19208A46317j7086N3131J3985o640o9410j8097r6253r9891J5005J20900K4215
$$ 146317 129231 182362 196347 189707 120297 102200 5947 -93944 -78939 41961 66176
19197F6176j9766O8944M7306j9220p3896k1259J5665q4087o238K1544K1358r555
$$ 66176 46410 115354 162660 143440 69544 48285 63950 -20137 -26375 -4831 16527 6972
19185F972M0025N0909l1882P2267Q2191M2686o239M9887P841K0491M9057j20381
$$ 6972 46997 97906 66024 138291 220482 263168 256929 306816 314657 335148 384205 263824
19173B63824o8750O475R9675j2162p281K27030N1715k18797k00035j03577p00
$$ 263824 195074 201549 301224 289062 281781 508811 560526 341729 141694 38117 37417
19162C7417j0655J11466R7403P3054J2465n5965m8049q8163K501Q6999L4581L
$$ 37417 26762 138228 235631 308685 321150 265185 217136 128973 131474 218473 253054 253057
19150B53057N7710j99439j38859j3544k4567M6880J3520Q0771O2806j9863j14777
$$ 253057 310767 111328 -27531 -41075 -65642 -18762 -5242 75529 138335 118472 3695
19139C695M134j1499l5336N0188P4919j8351l4981j4481O0656O4412J27603j2863
$$ 3695 7829 -3670 -39006 11182 86101 67750 32769 18288 78944 143356 270959 258096
19127B58096j30858j96534j18967M4941P1816n304J08872P1442N1K0039K5505
$$ 258096 127238 -69296 -188263 -143322 -71506 -76810 32062 103504 103555 123594 149099
19116A49099j2573n9106M1522o7766J1943l9071o3857P6325p446P0299o9966n4687
$$ 149099 136526 77420 118942 51176 63119 24048 -39809 36516 29070 99369 29403 -25284
19104b5284j1142p5573k8705P7137J65736j9167K2217l071L7101j8478k1167n1494
$$ -25284 -36426 -111999 -140704 -63567 102169 83002 105219 102148 139249 120771 99604 48110
19092D8110j33453o1475M2568J29094k195j13374n2354P1901K3949J17330K9963
$$ 48110 -85343 -146818 -104250 24844 22649 -90725 -143079 -71178 -47229 70101 100064
19081A00064j6376J02921K8440j34575O999N7080j3445Q311m1492K1288n0044
$$ 100064 83688 186609 215049 80474 87473 144553 131108 139419 97927 119215 69171
19070F9171L4434q14o3850P2965J7546K3528q1761j2654j6893n8258J3491R616
$$ 69171 103605 102791 38941 111906 129452 152980 71219 58565 41672 -16586 -3095 6521
19058F521N4305Q7571o9093q2016J16896l0331l9461L6832P9139L2200n1996Q939
$$ 6521 60826 148397 79304 -2712 114184 83853 44392 81224 160363 192563 140567 149506
19046A49506q2120m0076N3959Q439n6445J01104L0029l8691j04221l9602P8974
$$ 149506 67386 27310 81269 89708 33263 134367 164396 125705 21484 -18118 60856
19035F0856Q4797O2648L0245m0573j04054j18869N0141k3595J1152Q7890J27845
$$ 60856 145653 208301 238546 197973 93919 -24950 25191 1596 12748 100638 228483
19024B28483k4917j85958j14227J05854J64452N8678P4331p4408r6844j13198
$$ 228483 203566 17608 -96619 9235 173687 232365 306696 232288 135444 22246
19014B2246P4910R2873j18065K8905n2857j06084p3792R2555J02291K4868p8072
$$ 22246 97156 190029 71964 100869 48012 -58072 -131864 -39309 62982 87850 9778
19003I778k3123K4987P0871m6706n2191J75821J35845p8783k7026j27086K1597
$$ 9778 -13345 11642 82513 35807 -16384 159437 295282 216499 189473 62387 83984
18992H3984k606J438l0755Q7636r5137p5903Q5435N3418K5881N7849j09400p8460
$$ 83984 81378 82816 52061 139697 44560 -31343 54092 107510 133391 191240 81840 3380
18980C380r8273m9112R1334J24522k6876M2163n470J3383M0679J3270m1671K6895
$$ 3380 -94893 -144005 -52671 71851 44975 87138 81668 95051 135730 149000 107329 134224
18968A34224k7143n4364P5023O4059N9054J7175n6162P332k1934j16690j20851
$$ 134224 107081 52717 127740 191799 250853 268028 211866 219198 197264 80574 -40277
18957d0277J5377J07912l61m8369Q769M7l2263l8180K6178L5601m2812K4911n4727
$$ -40277 -24900 83012 82651 34282 43051 43098 10835 -27345 -1167 34434 -8378 16533 -38194
18944c8194m1803J59270O4788K0485J9100j2820r6988L4544j3719M2342r3661
$$ -38194 -79997 79273 144061 164546 183646 170826 73838 108382 94663 137005 43344
18933D3344j41950N5054l2976J9335p0835n7487R9101J74304p3312p1602R6609
$$ 43344 -98606 -43552 -76528 -57193 -128028 -185515 -86414 87890 14578 -57024 39585
18922C9585N8716n7430k2893n5846Q8479Q902j2258L4449N6966o878j06830j1199
$$ 39585 98301 40871 17978 -37868 50611 59513 47255 81704 138670 131792 24962 13763
18910A3763l0304l5163p1584N6680J56877J02929q1412k3464o9122K1370m0671
$$ 13763 -16541 -51704 -123288 -66608 90269 193198 111786 88322 19200 40570 -101
18899a01j06915o0216J8385Q6543L8901N3895j1887n9160O7794q1599l1118j4331
$$ -101 -107016 -167232 -148847 -62304 -23403 30492 18605 -40555 27239 -54360 -85478 -99809
18887i9809j5214m0288L5612N956J4268Q2957J28238N7542k8322j41709J889J18562
$$ -99809 -115023 -155311 -119699 -113743 -99475 -16518 111720 169262 140940 -769 1120 119682
18875A19682n7385j60402K0352m8148K1035O3106K1461r8279M0732J52104N3355
$$ 119682 62297 -98105 -77753 -125901 -104866 -41760 -20299 -118578 -77846 74258 127613
18864A27613q2144o1169J34893J40812N7285l3681j16291m5534p735K7470o7574
$$ 127613 45469 -15700 119193 260005 317290 283609 167318 121784 114049 141519 73945
18853G3945j5721L5359Q3125Q3724n1975O9341R9599p1797q657K174q4644r8897
$$ 73945 58224 93583 176708 260432 208457 277798 377397 305600 296943 299117 214473 115576
18841A15576m4468k7771k3884j08865L3926J26793q481j17101o8251J89360J14765
$$ 115576 71108 43337 19453 -89412 -55486 71307 62826 -54275 -122526 66834 181599
18830A81599l5782n2089o8543L6759l5495L5166P9315m0645k6320O506m4140M3995
$$ 181599 145817 93728 25185 61944 26449 61615 140930 100285 73965 80471 36331 80326
18818H0326O15k6313J3299L1112J20517q802J9027l3627k6160l4632J98427J77783
$$ 80326 80941 54628 67927 99039 219556 210754 229781 196154 169994 135362 333789 511572
18806E11572l5123r843k2552o5314q0407l4240n7401r8018j10140m1183J04768
$$ 511572 476449 466606 444054 378740 298333 264093 206692 108674 -1466 -42649 62119
18795F2119K2555O223Q9420k4887j30217J02955O4517j06175o0073J11364Q9621
$$ 62119 84674 90897 180317 155430 25213 128168 192685 86510 26437 137801 227422
18784B27422l0463p5596L3817M7302k9247P0816J8068j02666j50899L3011L9714
$$ 227422 196959 121363 155180 202482 173235 244051 262119 159453 8554 41565 81279
18773H1279j8707l7923K8194K23259L71554N04282K47481j76471k41779k23609
$$ 81279 62572 24649 52843 276102 647656 1151938 1399419 1222948 981169 757560
18763G57560j64065j49284j52672r4917l157m8318m7239K6522L169l2240M3471
$$ 757560 593495 444211 291539 196622 193465 145147 97908 124430 127599 95359 138830
18752A38830n0636J421R6779L4180N0448L4196l8876j66385n5330J04737J21091
$$ 138830 88194 89615 186394 220574 271022 305218 266342 99957 44627 149364 270455
18741B70455q433j16296r5242J3464R2240M8433j29124k7023L1893m84q9975N0006
$$ 270455 262022 145726 50484 63948 156188 204621 75497 48474 80367 79883 -10092 39914
18729C9914J15535q9182p3098O1426o7470n0227N9009j2798P0392R1019n4757
$$ 39914 155449 66267 -6831 54595 -12875 -63102 -4093 -16891 53501 144520 89763
18718H9763l4165J966J9477l1332j11057o734L6270N0053q5690R2110R9792Q6619
$$ 89763 55598 57564 77041 45709 -65348 -72082 -35812 14241 -71449 20661 120453 207072
18706B07072K7822j15216j02186J00287K2098R260j9453R1604m2621O7214P6330
$$ 207072 234894 119678 17492 117779 139877 149137 129684 221288 178667 245881 322211
18695C22211J284l6068k9014P0200j00300j59823m0519L6517O1265L8924o0550
$$ 322211 323495 287427 258413 328613 228313 68490 27971 64488 125753 164677 104127
18684A04127L568O9220R721r5482p0007k63J62035L3108r8470N0065N8471J54846
$$ 104127 107695 176915 186636 91154 21147 20884 182919 216027 117557 167622 226093 380939
18672C80939R0336L9795Q7787j10173j4036Q7447K562m3351J1818P3889L4445
$$ 380939 471275 511070 598857 488684 474648 562095 564657 521306 533124 607013 641458
18661F41458Q375J46993P7420L4375J8988Q7086L4562n6154k5898J57478J67763
$$ 641458 649833 796826 874246 908621 927609 1014695 1049257 993103 967205 1124683 1292446
18650A292446N0246J7673o0995r1658m0005n8000j38951k15953j09846j1031M2048
$$ 1292446 1342692 1360365 1299370 1207712 1167707 1109707 970756 754803 644957 633926 675974
18639F75974J4130n0207r5497j3327m4260j09783j999J8715j8796j6799l5329
$$ 675974 690104 639897 544400 531073 486813 377030 375031 393746 374950 358151 322822
18628C22822N4701M9684m8139k226L8238O1953j15078l4237J35781J3233K3397
$$ 322822 377523 427207 379068 376842 415080 477033 361955 327718 463499 476732 500129
18617E00129R1646Q918J12661J88349K10633Q7975Q4684L3582J01368k8207m7813
$$ 500129 591775 600693 713354 901703 1112336 1200311 1284995 1318577 1419945 1391738 1343925
18606A343925o5345N0908l4579m6501m9637l5520m3009j7389Q4849K3285N9789
$$ 1343925 1278580 1329488 1294909 1248408 1198771 1163251 1120242 1102853 1187702 1210987 1270776
18595A270776P6193m0273j13650j38487p2830l5499m1711j41o6994R560l7003
$$ 1270776 1346969 1306696 1193046 1054559 981729 946230 904519 904378 837384 846944 809941
18584H09941j24608o723p3780J6502n387n7121J3481P9605M3303J57076j16889
$$ 809941 685333 678610 604830 621332 615945 558824 572305 651910 695213 852289 735400
18573G35400j69046l2153R058n8138r3674j6648J24238M4669J1276m2786J5731
$$ 735400 566354 534201 543259 485121 391447 374799 499037 543706 554982 512196 527927
18562E27927K7655N1116N9022M0106K3316o628Q3728O5387o0673j08610n5100
$$ 527927 555582 606698 665720 705826 729142 722514 806242 871629 810956 702346 647246
18551F47246j41189j26009O1602J15787L2074N1657L4100k8383j07687j60687
$$ 647246 506057 380048 441650 557437 589511 641168 675268 646885 539198 378511
18541C78511p7548p8705O0371K2479k5369k4111P4660J12087O9708J21368M8419
$$ 378511 300963 222258 282629 305108 279739 255628 330288 442375 512083 633451 681870
18530F81870l9683K7137N0583o6625o4747j65392M9567J19259q9123o5037j10211
$$ 681870 642187 669324 719907 653282 588535 423143 472710 591969 502846 437809 327598
18519C27598j9442K7277K6313r1406n7278J1554j48165j26429Q2393N2405Q5911
$$ 327598 308156 335433 361746 270340 213062 224616 76451 -49978 32415 84820 170731
18508A70731m0185q7669L4715k7210m0798J647m1929J9144J41065m3294L3384
$$ 170731 130546 42877 77592 50382 9584 11231 -30698 -11554 129511 86217 119601
18497A19601k7803K9928Q3860R5723K0068m3602q8239M2349n389o2551k4105l5671
$$ 119601 91798 121726 205586 301309 321377 277775 189536 231885 226496 163945 139840 104169
18485A04169K8658L708L5405k1002q5074q3741M4342K4127N2326L9562l4229L0836
$$ 104169 132827 136535 171940 150938 65864 -17877 26465 50592 102918 142480 108251 139087
18473A39087J9787l7308L5760M9591R0771k7495o0710j00970o714L3877p1221
$$ 139087 158874 121566 157326 206917 297688 270193 209483 108513 101799 135676 64455
18462F4455p0762P4527n93R2619j7946k7705Q5814J21729P7161j37486l4756N2887
$$ 64455 -6307 68220 67627 160246 142300 114595 200409 322138 399299 261813 227057 279944
18450B79944n2985m3039O5134O4867n5573k7515m5194k9789o9736l8495l9201
$$ 279944 226959 183920 249054 313921 258348 230833 185639 155850 86114 47619 8418
18439H418J28800J39168R3670j0804m5722R6298n0015j66270m4154K4553P505
$$ 8418 137218 276386 370056 359252 313530 409828 359813 193543 149389 173942 181447
18428A81447p161K8726O9362N1376m4250m8060N5117P8272Q6630K9969j30066
$$ 181447 174286 203012 272374 323750 279500 231440 286557 364829 451459 481428 351362
18417C51362n7503J02768l3750j02889k5884m7644M5136L6594n3109l3016r3034
$$ 351362 293859 396627 362877 259988 234104 186460 231596 268190 215081 182065 89031
18406H9031m3640L5083K7125n3864Q5910j7315K064Q7148J8823N3050j6714K3455
$$ 89031 45391 80474 107599 53735 139645 122330 124394 211542 230365 283415 266701 290156
18394B90156L6583N4244L3802L909o6212j67325N7012K05428k7947q3333k6327
$$ 290156 326739 380983 414785 418694 352482 185157 242169 447597 419650 336317 309990
18383C09990L2383p6091M7703M5605m8622o0894n7669J07276K8474j25049O7087
$$ 309990 342373 266282 313985 359590 310968 250074 192405 299681 328155 203106 270193
18372B70193J03307R572n0930l3676P6242J29184q541j4694M1045R5400L3146
$$ 270193 373500 383072 332142 298466 374708 503892 495351 480657 521702 617102 650248
18361F50248J6266j20741r3141j42494j44240N1263K02957L4449n4976q6141M8535
$$ 650248 666514 545773 452632 310138 165898 217161 420118 454567 399591 313450 361985
18350C61985P8830j9978o9413l9275p297q3641J2560j9779N9458K3107J25447
$$ 361985 440815 420837 351424 312149 304852 221211 233771 213992 273450 296557 422004
18339D22004m0497j10873P021P0571L2251l983k484q527J7562J75654L7861q4911
$$ 422004 381507 270634 277655 348226 380477 376494 374010 365483 383045 558699 596560 511649
18327E11649m861O1914j37675K0243l4067J8060K8140q1682L9290n2410n855j8898
$$ 511649 506788 568702 431027 451270 417203 435263 463403 381721 421011 368601 362746 343848
18315C43848j03134R8602J9530J24162J41878L2167K0345J1629r397M455l3184
$$ 343848 240714 339316 358846 483008 624886 657053 677398 689027 679630 684085 650901
18304F50901k7623m3031m7359O7045J10240L6042M4869J25392J57635Q4857m6875
$$ 650901 623278 580247 532888 599933 710173 746215 791084 916476 1074111 1158968 1112093
18293A112093m0206N5700O4354J0377P7149M5878n7918n0937l1671j47264j46859
$$ 1112093 1071887 1127587 1191941 1202318 1279467 1325345 1267427 1216490 1184819 1037555 890696
18282H90696j21455n4821J04182J4238q3085j27160M7504l0719j8843O5087O1264
$$ 890696 769241 714420 818602 832840 749755 622595 670099 639380 620537 685624 746888
18271G46888M835m5342L9113k1641r1027K2397J36835K4371L4391J18692m4497
$$ 746888 751723 706381 745494 723853 632826 655223 792058 816429 850820 969512 925015
18260I25015j2188j15643j26740m5392J06149J53368J25392J21835O7937J18334
$$ 925015 912827 797184 670444 625052 731201 884569 1009961 1131796 1199733 1318067
18250A318067Q5679J26025O6841Q2404J49784Q8656n1791R4805L9006J53183J90729
$$ 1318067 1403746 1529771 1596612 1679016 1828800 1917456 1865665 1960470 1999476 2152659 2343388
18239B343388K19083J49737l4680n7915J8136L40p000j42098k8710o5751o8683
$$ 2343388 2562471 2712208 2677528 2619613 2637749 2638089 2631089 2488991 2460281 2394530 2325847
18228B325847m7972n7661K1174O6947J02006Q7452J3524Q8008K46620L14878P12531
$$ 2325847 2277875 2220214 2241388 2308335 2410341 2497793 2511317 2599325 2845945 3160823 3873354
18217C873354J051479J427139J623446N59593m34131o54870m15980O4964O35150
$$ 3873354 4924833 6351972 7975418 8535011 8100880 7446010 7030030 7094994 7730144
18208G730144J162678J925791L300552N590491R157678J1419495Q878160M820253
$$ 7730144 8892822 10818613 14119165 19709656 28867334 40286829 49164989 53985242
18200E3985242k741160p707306o544924m314594l925281m845623m243632l279393
$$ 53985242 51244082 43536776 36991852 32677258 28751977 23906354 19662722 16383329
18192A6383329j688435j63433J214198K832205L187660J55021k747515l462348
$$ 16383329 14694894 14531461 15745659 18577864 21765524 21920545 19173030 15710682
18184A5710682l344041k420351j374085o36371m19291k27925p7074J51212M77629
$$ 15710682 12366641 9946290 8572205 7935834 7516543 7288618 7211544 7362756 7840385
18175G840385O37881J250643J465736O83121m16533o20984q03122k58065K28270
$$ 7840385 8478266 9728909 11194645 11877766 11461233 10840249 10037127 9779062 10007332
18166A0007332O35339R91393J401957K184452L470059N575440Q682146J1781708
$$ 10007332 10642671 11634064 13036021 15220473 18690532 24265972 32948118 44729826
18158D4729826J3176089J5943090J0836464m900132j0380955q789141l783974
$$ 44729826 57905915 73849005 84685469 79785337 69404382 60615241 56831267
18151E6831267J001459K602856L730474M653407R584167Q971446O09197o863640
$$ 56831267 57832726 60435582 64166056 68819463 78403630 87375076 87984273 81120633
18143H1120633j0683738j3136284j3127790j0386467p641381n063842k921560
$$ 81120633 70436895 57300611 44172821 33786354 26144973 21081131 18159571
18136A8159571j511772o35713J28134J051186J362728l47170j773739j890603
$$ 18159571 16647799 16012086 16140220 17191406 18554134 18206964 16433225 14542622
18128A4542622j769192j054122o77136j18681K90665M30190P34879J330222J608845
$$ 14542622 12773430 11719308 11042172 10923491 11214156 11644346 12379225 13709447 15318292
18119A5318292K271358L575135N217777P837411J1250256J3255909J4973195K4015925
$$ 15318292 17589650 21164785 26382562 34219973 45470229 58726138 73699333 97715258
18111I7715258M5489271P6352242L1436482l9631764m1752562m2422411l0476329
$$ 97715258 143204529 219556771 250993253 211361489 169608927 127186516 96710187
18104I6710187j5566267m654671M049721R437153P493143J803133j0242753j4522386
$$ 96710187 81143920 76489249 80538970 89976123 97469266 99272399 89029646 74507260
18096G4507260j0805974m430165L582749P694164Q504558J1509313J2636550M686465
$$ 74507260 63701286 59271121 62853870 70548034 79052592 90561905 103198455 107884920
18088A07884920j938065l855635o187583r641997j1798231j1953914r878790p138194
$$ 107884920 105946855 102091220 95903637 86261640 74463409 62509495 52630705 45492511
18080D5492511m195833k417426j187591L49281m28708k483198l217289l750420
$$ 45492511 41296678 38879252 37691661 38040942 37612234 35129036 31911747 28161327
18072B8161327m251666m327632l663052k788693j929509j324506q22580n43087
$$ 28161327 23909661 19582029 15918977 13130284 11200775 9876269 9053689 8510602
18064H510602l34788j91373j35199n6559L9427K30427L81680N41515J185406K071133
$$ 8510602 8175814 7984441 7849242 7792683 7832110 8062537 8444217 8985732 10171138 12242271
18054A2242271L025950L944731M136517L871413M331066L930224J089444n27062
$$ 12242271 15268221 19212952 23349469 27220882 31551948 35482172 36571616 36044554
18046C6044554m98510j42906R57356L048546N328661Q840210J3327821J4890961
$$ 36044554 35546044 35403138 36360494 39409040 44737701 53577911 66905732 81796693
18038H1796693J1113480R383942R520501K769996q923635j2494327j3539734j5582242
$$ 81796693 92910173 102294115 111814616 114584612 105660977 93166650 79626916 64044674
18030F4044674j5037779j2423890r477049o229827l837609k129876r63470j00912
$$ 64044674 49006895 36583005 27105956 20876129 17038520 14908644 13945174 13844262
18022A3844262J50507L02441N32459n1112j207621j429009j473072j702066j591354
$$ 13844262 13994769 14297210 14829669 14778557 13570936 12141927 10668855 8966789 7375435
18013G375435j384713j219486p07146n52354m16702l51411l13875k84576k50974
$$ 7375435 5990722 4771236 4064090 3511736 3095034 2743623 2429748 2145172 1894198
18004A894198j68562j93108k34446j20195o6866j29768n0418p4507q1282n6104
$$ 1894198 1725636 1532528 1298082 1177887 1111021 981253 930835 856328 775046 718942
17994G18942j10913q6868J00826q5459o0401k1800K6213l9669j05301n6622j18891
$$ 718942 608029 521161 621987 536528 476127 454327 480540 440871 335570 278948 160057
17983A60057J11907K15230Q9088N2049j0492j21292J08754J73288M0963L452m6627
$$ 160057 271964 487194 576282 628331 617839 496547 605301 778589 819552 823004 776377
17972G76377p8578q0708j7450n3679j17181k4988L8108o6455p7795l7312p1581
$$ 776377 697799 617091 599641 545962 428781 403793 441901 375446 297651 260339 188758
17961A88758j27744J57174K19333J93123O8656j21025j32139r7455j5814J7670
$$ 188758 61014 218188 437521 630644 699300 578275 446136 348681 332867 350537
17951C50537j17927m8192l0093L5665N3597O3815N0720K1517k6258p9026k4775
$$ 350537 232610 184418 154325 189990 243587 307402 358122 379639 353381 274355 249580
17940B49580L6529l1631j44370m9377J96003J52734j01995m9875k5443M743k6141
$$ 249580 286109 254478 110108 60731 256734 409468 307473 257598 232155 236898 210757
17929B10757j26958n4745J3509O4359K4607J12931J94070l9671N180R4733Q4683
$$ 210757 83799 29054 42563 106922 131529 244460 438530 398859 404039 498772 583455
17918E83455p0243k006p6934m9510K0835L9008O53j18444j13120n179J34374Q209
$$ 583455 513212 511206 434272 384762 405597 444605 445258 326814 213694 208515 342889 351098
17906C51098o5712j38591o8567J27121J45950L9654r3015j5257n8455K4861o0714
$$ 351098 285386 146795 78228 205349 351299 390953 297938 282681 224226 249087 188373
17895A88373j54043l0115M0953Q7573l5231j12544J66225P2695m6310N1465m4796
$$ 188373 34330 4215 45168 132741 97510 -15034 151191 223886 177576 229041 184245
17884A84245m3795o487o5363N6265Q2951j5251j75688J16526k4140O5115n740
$$ 184245 140450 133963 68600 124865 207816 192565 16877 133403 109263 174378 168638
17873A68638j44653K0770Q4636J7068L5480J85043n131o0505m1386q3831q2184
$$ 168638 23985 44755 129391 146459 181939 366982 361851 301346 259960 176129 93945
17862I3945o7192J20508N2925L8006j5603l0149k2289l3268j8730J58437N4152
$$ 93945 26753 147261 200186 238192 222589 192440 170151 136883 118153 276590 330742
17851C30742p259j4309j03981j4034o5229o3287j21335L6063P3504j8871q4904
$$ 330742 323483 309174 205193 191159 125930 62643 -58692 -22629 50875 32004 -52900
17840e2900J08640J37237M1478j28015j26783k13099J4918J66258J15314J32740
$$ -52900 55740 192977 234455 106440 -20343 -233442 -218524 -52266 63048 195788
17830A95788J2999o1300q5894j05295j02654K3592J01609P0907M0507K4216N741
$$ 195788 208787 147487 61593 -43702 -146356 -122764 -21155 49752 90259 114475 120216
17819A20216K256o228Q5434P791j3229r938L0076l1415q349Q4461O1860J7973
$$ 120216 122472 116244 201678 209469 196240 186302 216378 184963 176614 261075 322935 340908
17807C40908j15579l4106k6011K8272N3640L2680K5050r5576j05625N9556K9077
$$ 340908 225329 191223 165212 193484 247124 279804 304854 209278 103653 163209 192286
17796A92286M1071Q6803o3871q7036m6413P4195M9775N6515p003Q8978J76268
$$ 192286 233357 320160 256289 169253 122840 197035 246810 303325 296322 385300 561568
17785E61568o9988n7018n1926m6808p0416n3782L8725R4776n2480j1638R2235
$$ 561568 491580 434562 382636 335828 265412 211630 250355 345131 292651 281013 373248
17774C73248J05850j35316m5072l0152N0090R2832m3631k6996R38J87314J83056
$$ 373248 479098 343782 298710 268558 318648 411480 367849 340853 341791 529105 712161
17763G12161q8612r4650m2796L6404j334O7941J9459J03227j984k8700P6408Q3770
$$ 712161 623549 528899 486103 522507 521173 589114 608573 711800 709816 681116 757524 841294
17751H41294N2218J04059P4813J39741J52325P2687L7541J05970J05077J42007
$$ 841294 893512 997571 1072384 1212125 1364450 1437137 1474678 1580648 1685725 1827732
17741A827732K62350K23082r0676m0499O2154j6868j19760J8676J02704k8607
$$ 1827732 2090082 2313164 2222488 2181989 2244143 2227275 2107515 2126191 2228895 2200288
17731B200288l9441R0480J78130J66263O8488l8002j07365P881m216l9951R3858
$$ 2200288 2160847 2251327 2429457 2595720 2664208 2626206 2518841 2526722 2522506 2482555 2576413
17720B576413Q6558K28004J81332J75287J15309J62602j0742k5221Q8148K13504
$$ 2576413 2662971 2890975 3072307 3247594 3362903 3525505 3514763 3489542 3577690 3791194
17710C791194M11958J73444P6561Q9934K13830N12893Q10149J172222J659500
$$ 3791194 4203152 4376596 4453157 4543091 4756921 5269814 6079963 7252185 8911685
17701H911685K124157K452815J697674R71203R31547P72199J53231k68421J80919
$$ 8911685 11035842 13488657 15186331 16157534 17089081 17861280 18014511 17746090 17927009
17692A7927009J397719L445612O060096R136591J0338673Q052399M615343J114768
$$ 17927009 19324728 22770340 28830436 37967027 48305700 56358099 60973442 62088210
17684F2088210K50485M473684J2379168J9529498J7995017M911450j0273413j6536922
$$ 62088210 62338695 66812379 79191547 98721045 116716062 121627512 111354099 94817177
17676I4817177j4575829r630052o362475o512412p652728p238349n048220k080717
$$ 94817177 80241348 70611296 64248821 57736409 50083681 42845332 37797112 35716395
17668C5716395J411118N232271Q519160Q701424J952727n868683p771638o080915
$$ 35716395 37127513 42359784 50878944 59580368 61533095 55664412 47892774 41811859
17660D1811859k434737j394830k742670k197499j904559l007970l225093k486033
$$ 41811859 39377122 37982292 35239622 33042123 31137564 28129594 24904501 22418468
17652B2418468j179685k37401p65543j077724q15801k63427J181241K627293L155926
$$ 22418468 21238783 21001382 20235839 19158115 18342314 18078887 19260128 21887421 25043347
17643B5043347J989107P00278P09854K412371M962479O140354L593451m40097
$$ 25043347 27032454 27732732 28442586 30854957 35817436 41957790 45551241 45111144
17635D5111144j693302L39694M861130J0915182J4041805R396981P44058m998719
$$ 45111144 43417842 43757536 48618666 59533848 73575653 82972634 83716692 78717973
17627G8717973n398049j70255O552013P980837J478458n031631q546650j0862199
$$ 78717973 73319924 73149669 79701682 87682519 89160977 84129346 75582696 64720497
17619F4720497p676228l032539k080191j991613J095250N218815O310630K054965
$$ 64720497 57044269 54011730 51931539 49939926 51035176 56253991 62564621 64619586
17611F4619586m964784q420840p397138m334550l461511m417656m473369l827942
$$ 64619586 59654802 51233962 43836824 39502274 36040763 31623107 27149738 23321796
17603B3321796l351816l580819l077719k651608k045235j379087r47535p42448
$$ 23321796 19969980 16389161 13311442 10659834 8614599 7235512 6287977 5545529
17595E545529o58923m08755k38978j82833j90104j16879m532q2719j70015k77988
$$ 5545529 4886606 4477851 4238873 4056040 3865936 3749057 3744525 3661806 3491791 3213803
17585C213803k28338n6584P2303J13977J71165K35184M11005P52910R89045J619301
$$ 3213803 2985465 2928881 3001184 3115161 3286326 3521510 3932515 4685425 5674470 7293771
17575G293771K864029M177825K442449o27164j419315r49813P73099L435468N420476
$$ 7293771 10157800 14335625 16778074 16150910 14731595 13781782 14554881 17990349 23410825
17566B3410825K481341k812028m177989m062192k618112m32353J059513Q4688
$$ 23410825 25892166 23080138 18902149 14839957 12221845 11789492 12849005 12933693
17558A2933693j981749k387770k385927j760569j179088p42945l60577l25993
$$ 12933693 10951944 8564174 6178247 4417678 3238590 2495645 2135068 1809075
17550A809075k03261k20571j70330J2835N8145n0117p8433J27038O2290m1475
$$ 1809075 1605814 1385243 1214913 1227748 1285893 1235776 1157343 1284381 1346671 1305196
17540A305196o3955j50779j59332k08901m0508P2243L3408k6365l2975o0464N0626
$$ 1305196 1241241 1090462 931130 722229 681721 753964 787372 761007 728032 667568 718194
17529G18194P1730N0347L5133j37107j23858o0738q8159r9696o7800J6359o6932
$$ 718194 789924 840271 875404 738297 614439 553701 465542 365846 298046 314405 247473
17518B47473m9699P9837N8329o3360J745M1143L1425j7885q3567n0698r965j22330
$$ 247473 197774 277611 335940 272580 274325 315468 346893 329008 245441 194743 184778 62448
17506F2448m4383m5912R1656O9590q3715K2660L0052N768N4790L785o5798M203
$$ 62448 18065 -27847 63809 133399 49684 72344 102396 108164 162954 166739 100941 105144
17494A05144J19620l3818j01935p1362K1754K7135j19748j19477O9474Q2044J05662
$$ 105144 224764 190946 89011 17649 39403 66538 -53210 -172687 -103213 -21169 84493
17483H4493L2021J11754M0490j57038m2084j78n2547j42069J6203n851L1194j989
$$ 84493 116514 228268 268758 111720 69636 69458 16911 -125158 -108955 -114806 -83612 -85601
17471h5601J7112J7109J01451Q6927m1922n4347J19956K9957j6594j8872L5101
$$ -85601 -68489 -51380 50071 136998 95076 40729 160685 190642 174048 155176 190277
17460A90277P6111k8027m0010J13460N7473K7720M8398P9466m5156L7715J94536
$$ 190277 266388 238361 198351 311811 369284 397004 445402 524868 479712 517427 711963
17449G11963J58540K2816J50647L5394J54749L67153K93167k43492l85760l88327
$$ 711963 870503 893319 1043966 1079360 1234109 1601262 1894429 1650937 1265177 876850
17439H76850k47585j59760k22644J9554J41520l8260M855p0351j49291p9679Q952
$$ 876850 629265 469505 246861 266415 407935 369675 374530 304179 154888 75209 84161
17428H4161M9831R637p2955j35529r726P2719L7065O5819L837Q063M9141j06747
$$ 84161 133992 143629 70674 -64855 -74581 -1862 35203 101022 104859 112922 162063 55316
17416E5316k704l8873L1659R1166K3772q5219r867J9089M2323N7700M649m6164
$$ 55316 52612 13739 45398 136564 160336 75117 65250 84339 126662 184362 189011 142847
17404A42847O94o7058J05507K11919J26151J57683L4381j72899p4412M151J8202
$$ 142847 143541 76483 181990 393909 520060 677743 712124 539225 464813 468964 487166
17393D87166R1869m2730R469j56210j23411j7126r6760j5138k4767j09896P2705
$$ 487166 579035 536305 545774 389564 266153 249027 152267 137129 112362 2466 75171
17382G5171P2810K8100M5083p8999L50M6213J03329J90732J30548k7135j06822
$$ 75171 147981 176081 221164 142165 142515 188728 292057 482789 613337 586202 479380
17371D79380j50397q6913j67997O0072M3675q2065l6070O6922R56j0571Q6571
$$ 479380 328983 242070 74073 134145 177820 95755 59685 126607 127563 116992 203563
17360B03563O0098o7303L8613J6340j944K011K0789N4762q4767L031j388K5519
$$ 203563 263661 196358 234971 251311 249367 251378 272167 326929 242162 245193 243805 269324
17348B69324n335j23541n3624q96K2279J28558O8778j04679l472m3652k4926R046
$$ 269324 263989 140448 86824 85928 108207 236765 305543 200864 197392 153740 128814 137860
17336A37860Q0625K5208O284N7798j03941l4882J97367K01570J8620j57305j11132
$$ 137860 218485 243693 249977 307775 203834 168952 366319 567889 586509 429204 318072
17325C18072j9348n2922M8620N9270n3112j99928q9766R0096J33012J17982k4303
$$ 318072 298724 245802 294422 353692 300580 100652 10886 100982 233994 351976 327673
17314C27673o938N2901N5796P175k7136r3666k8906L4225L0696P5297R190R396
$$ 327673 320735 373636 429432 436607 409471 315805 286899 321124 351820 427117 436307 445703
17302D45703J01072J00708r5019Q3127O9151K8804j09321j5762m1852m2925J64162
$$ 445703 546775 647483 552464 635591 704742 733546 624225 608463 566611 523686 687848
17291F87848O6358J82173P2816O1942O8255L734J3236P9102J085N123o0120j3527
$$ 687848 754206 936379 1009195 1071137 1139392 1143126 1156362 1235464 1236549 1241672 1181552 1168025
17279A168025J13619J71584K3249l9943Q1090K47265J55003J68935M46078M07211
$$ 1168025 1281644 1453228 1476477 1436534 1517624 1764889 1919892 2088827 2534905 2942116
17269B942116M15059M50124N69090R79543J378286K025319K651286K809824J757382
$$ 2942116 3357175 3807299 4376389 5355932 6734218 8759537 11410823 14220647 15978029
17260A5978029k23005j429852j851981j421928m98333J93377J007029J949485
$$ 15978029 15755024 14325172 12473191 11051263 10552930 10746307 11753336 13702821
17252A3702821L121621N085726Q048023J2829823K0031681K6747380K8160615
$$ 13702821 16824442 21910168 29958191 42788014 62819695 89567075 117727690
17245A17727690J8140943J636879j1694562j8856100k0187707j8637218j5001958
$$ 117727690 135868633 137505512 125810950 106954850 86767143 68129925 53127967
17238E3127967j1245039p084057l274100K68257L235343M667603L423181o87955
$$ 53127967 41882928 34798871 31524771 31793028 35028371 39695974 43119155 42431200
17230D2431200m751560p120269p110876n725315m235748k750998j502492r08434
$$ 42431200 37679640 30559371 23448495 17723180 13487432 10736434 9233942 8325508
17222H325508o08883m73879m71250l63594l63463j19840J96574R5451R4684L80777
$$ 8325508 7716625 7242746 6771496 6407902 6044439 5924599 6121173 6216624 6311308 6692085
17212F692085O06131R11150J440518K321616L666980N302320O909053P041040
$$ 6692085 7298216 8209366 9649884 11971500 15638480 20940800 27849853 34890893
17204C4890893M179867l39622l256288m131603k744507P6630L450895P244665
$$ 34890893 39070760 38731138 35474850 31343247 28598740 28675370 32126265 39370930
17196C9370930J0810405J3642642J5655734J8109733J6577842Q951023o351277
$$ 39370930 50181335 63823977 79479711 97589444 114167286 123118309 116767032
17189A16767032j8381679k3321841k1649975j6194623j0643946o497597m041865
$$ 116767032 98385353 75063512 53413537 37218914 26574968 20077371 16035506
17182A6035506k666104j766814r54825m35028K22342R98489J326360J061525k70530
$$ 16035506 13369402 11602588 10647763 10212735 10435077 11433566 12759926 13821451 13550921
17173A3550921j400137k108036k087702j538797j141047q06588n62756n00327
$$ 13550921 12150784 10042748 7955046 6416249 5275202 4468614 3905858 3405531
17165C405531m94504l66639l93900l45562j75577r7205j34272n8107m2006L9518
$$ 3405531 2911027 2544388 2150488 1804926 1629349 1532144 1397872 1339765 1297759 1337277
17155A337277m5525k0122J6063n1587j10887J7094P3465J1664n0447p3594j2150
$$ 1337277 1291752 1271630 1287693 1236106 1125219 1142313 1215778 1227442 1176995 1103401 1091251
17144A091251j6083j74787j11044k01901J62901P8377q4789m7465k7704j10089
$$ 1091251 1075168 900381 789337 587436 750337 828714 743925 696460 668756 558667
17134E58667M262o4343R2960J2919j95646j11267P9607J34233M7572P6055n6366
$$ 558667 562929 498586 591546 604465 408819 297552 377159 511392 558964 635019 578653
17123E78653r7069n4942K9153L4903q3509p7786j49331N793J04715j8767L624
$$ 578653 481584 426642 455795 490698 407189 329403 180072 185865 290580 271813 275437
17112B75437J47120J68746J28857L061p3911j55822m1303J04434K9888O2837L0516
$$ 275437 422557 591303 720160 723221 649310 493488 452185 556619 586507 649344 679860
17101F79860k2016L7668n4755j29261N0540O5685j80045j14975o6176n7178n5310
$$ 679860 657844 695512 640757 511496 562036 627721 447676 332701 266525 209347 154037
17090A54037j5733Q496k4405m5054j36825q1478J31227M5718J9731r7194o496
$$ 154037 138304 146800 122395 77341 -59484 -140962 -9735 35983 55714 -41480 -47976
17079d7976l748M1340N3573k9659l0195J04089j4114j30991N5060J16083J05696
$$ -47976 -51724 -10384 43189 13530 -16665 87424 73310 -57681 -2621 113462 219158
17068B19158k2665m2154j15846M1268O2016l2O3204r3134K5588L9810j4725p2149
$$ 219158 196493 154339 38493 79761 141777 141745 204949 111815 137403 177213 162488 90339
17056I0339N7170M6564K2694q3632r2527p22n3525N4130M0206P6126O8936K115
$$ 90339 147509 194073 216767 133135 40608 39886 -13639 40491 80697 156823 225759 227874
17044B27874j33495m8510k5936k0712p5466O1762L069K8083J9129q7713K8324
$$ 227874 94379 45869 19933 -779 -76245 -14483 -11414 16669 35798 -51915 -23591
17033b3591r5266N4032P9362n6022j66559M8382J54912N4168m6166j15650q1158
$$ -23591 -118857 -64825 14537 -41485 -208044 -159662 -4750 49418 3252 -112398 -193556
17022a93556Q0211J25730M882K7595j03344j4560O018K9437K3210j2335p8813
$$ -193556 -113345 12385 17267 44862 -58482 -73042 -67024 -37587 -14377 -26712 -105525
17011a05525L2516J55079m172r6252P4268L2318J5651k4757j39126L957m4575
$$ -105525 -73009 82070 77898 -18354 55914 88232 103883 79126 -60000 -56043 -100618
17000a00618L6489M0944j48087P966O2540j5999O5042q3707l2212j316J3135J71550
$$ -100618 -64129 -23185 -171272 -163306 -100766 -116765 -51723 -135430 -167642 -168958 -155823 15727
16988A5727P2935M4077j9853l8693M0848q7455N3860n2937j8965K1562J0482l4319
$$ 15727 88662 132739 112886 74193 115041 27586 81446 28509 9544 31106 41588 7269
16976G269j21971j06574l378J18675O9777l6937O9255M6172j29136P634k5398
$$ 7269 -114702 -221276 -224654 -105979 -36202 -73139 -3884 42288 -86848 -79214 -104612
16965a04612k7208q9230j4467J2165J01418K0358o4393L3352R608n4167j900j9458
$$ -104612 -131820 -221050 -235517 -223352 -121934 -101576 -165969 -132617 -123009 -177176 -179076 -198534
16953a98534n4717N9785j7337J06317L4265p0849L4022m9631M3515L3147j65353
$$ -198534 -253251 -193466 -210803 -104486 -70221 -141070 -107048 -156679 -113164 -80017 -245370
16942b45370q098m4364m6572J32064O7315K4726L4087n93l4556o7553m4734K1729
$$ -245370 -253468 -297832 -344404 -212340 -145025 -120299 -86212 -86805 -121361 -188914 -233648 -211919
16930b11919N347k6489Q450O4152k594n1894J20599R8879J23973K3338j07448
$$ -211919 -206572 -233061 -224611 -160459 -163053 -214947 -94348 4531 128504 151842 44394
16919D4394j70281r146l810O1197L3789L2508o1352K2191j998p8235K6762j7486
$$ 44394 -125887 -135033 -138843 -77646 -43857 -11349 -72701 -50510 -52508 -130743 -103981 -121467
16907a21467O2658r1892j18626J1313J65650N4992j38870j38315q5841M2612J15616
$$ -121467 -58809 -150701 -269327 -258014 -92364 -37372 -176242 -314557 -400398 -357786 -242170
16896b42170j8556M5525L9282j4472J8264p1658P7447L3224Q4641k8278L8217
$$ -242170 -260726 -215201 -175919 -190391 -172127 -243785 -166338 -133114 -48473 -76751 -38534
16885c8534m5186J01291r8838j48389N0680Q1674m0621l0967J34982O5398n0950
$$ -38534 -83720 17571 -81267 -229656 -178976 -97302 -137923 -168890 -33908 31490 -19460
16874a9460l0873J8122q7846J345M2799o9568n2150j7554Q3114j5486j0699P9070
$$ -19460 -50333 -32211 -120057 -118712 -75913 -145481 -197631 -215185 -132071 -147557 -158256 -79186
16862g9186L4826r4366J5889L7013n7547j19120l4484L1178J38651J23527j5191
$$ -79186 -44360 -138726 -122837 -85824 -143371 -262491 -296975 -265797 -127146 -3619 -18810
16851a8810r6715r3853Q5659Q5203l5570N3150r1954p469n2515L6349k5247m0313
$$ -18810 -115525 -209378 -123719 -38516 -74086 -20936 -112890 -120359 -172874 -136525 -161772 -202085
16839b02085J0981L3814J98179J39997p1023j45409P2628Q3594O8804j12423j12874
$$ -202085 -191104 -157290 40889 180886 109863 -35546 37082 120676 189480 77057 -35817
16828c5817n1405j4964M626k6430M3110j8107n4371m425J77014m9260p6389o5824
$$ -35817 -87222 -102186 -97560 -123990 -80880 -98987 -153358 -157783 19231 -30029 -106418 -172242
16816a72242j283P0335R0792K706k1405m4236o6428k4165L1948q8539n0483n2953
$$ -172242 -173525 -103190 -12398 -9692 -31097 -75333 -141761 -165926 -133978 -222517 -273000 -325953
16804c25953K0367J67733j9234k4776J58843K2559q7671q4590K7796O2280k9807
$$ -325953 -305586 -137853 -157087 -181863 -23020 -461 -88132 -172722 -144926 -82646 -112453
16793a12453n3041O5893R9324J2145j0388j55418J5122P0372M7010q0923P8816
$$ -112453 -165494 -99601 -277 11868 1480 -153938 -138816 -68444 -21434 -102357 -23541
16782b3541o3473n2113J6930J37526p1655j02176J3948n2219J2418n7861j15127
$$ -23541 -87014 -139127 -122197 15329 -56326 -158502 -144554 -196773 -184355 -242216 -357343
16771c57343Q7893Q8920j07584m4369J83653J39314O2391M1629n2239l9454m8730
$$ -357343 -269450 -180530 -288114 -332483 -148830 -9516 52875 94504 42265 2811 -45919
16760d5919O0224K21926Q3801J26964J77259j11821j90723m0683L4309r2228j29827
$$ -45919 14305 236231 320032 446996 624255 512434 321711 281028 315337 223109 93282
16749I3282k0811K8306k4163r6309j31976O5866J53013p1197J01224K15225J8927
$$ 93282 72471 100777 76614 -19695 -151671 -85805 67208 -3989 97235 312460 331387
16738C31387r8598j08839m7142J7969j55794p3485O0840n5238k2416M8118P7788
$$ 331387 232789 123950 76808 94777 -61017 -134502 -73662 -128900 -151316 -103198 -25410
16727b5410N8762J47595N237L2286k8844o6821n619p876j01934k0702J0619m525
$$ -25410 33352 180947 186184 218470 189626 122805 117186 109310 7376 -13326 -2707 -7232
16715g232l9236L838P628K997M7121n5532N8210N9921l7484O378o7934J7832O1071
$$ -7232 -46468 -42630 -35002 -32005 15116 -40416 17794 77715 40231 46609 -21325 -3493 57578
16702E7578L7188R1470L438r9870k6272o2046q5299R0876j19543l0930P8381j3016
$$ 57578 94766 186236 189674 89804 63532 1486 -83813 7063 -112480 -143410 -65029 -78045
16690g8045N6420o4699M0964J45084J74271J06321n0967p9633K5770J20757j49391
$$ -78045 -21625 -86324 -45360 99724 273995 380316 329349 249716 275486 396243 246852
16679B46852j39036m2197k6812K1696P5098j69860j67578K1334O9863j2714r3765
$$ 246852 107816 65619 38807 60503 135601 -34259 -201837 -180503 -110640 -123354 -217119
16668b17119N4J4384Q8653J8741N383m992j13189L9491q63p4550K491Q9941K2623
$$ -217119 -217065 -202681 -114028 -95287 -89904 -94896 -208085 -168594 -169457 -244007 -241516 -151575 -128952
16655a28952M3423O3005N3474m3944j81356J13206J40458n8472r0980n6183J064
$$ -128952 -85529 -22524 30950 -12994 -194350 -81144 59314 842 -90138 -146321 -145257
16644a45257J31306K6710l9137j17645l8979m7312P6830M3074n4089j7070r993
$$ -145257 -13951 12759 -26378 -144023 -183002 -230314 -153484 -110410 -164499 -181569 -191562
16633a91562M6251R86O2715k5863k6175M9072p1403K0624J15014J0887j27342
$$ -191562 -145311 -144325 -81610 -107473 -133648 -84576 -155979 -135355 -20341 -9454 -136796
16622a36796m8833j7299O1727J58820L8039M514o6941o8001k9336m3924J35199
$$ -136796 -185629 -202928 -141201 17619 55658 60172 -6769 -74770 -104106 -148030 -12831
16611a2831k1778j6920p2358K5846J17686K1132j24869L3490j640j07883m5763
$$ -12831 -34609 -51529 -123887 -98041 19645 40777 -84092 -50602 -52242 -160125 -205888
16600b05888N4887l8187n1702J2714M2847J4595K7816O6226j8351m1483N1621
$$ -205888 -151001 -189188 -240890 -228176 -185329 -170734 -142918 -76692 -95043 -136526 -84905
16589h4905K7879L1733P7556l7612q8759j8045m1923L1509j06009j36879K6366
$$ -84905 -57026 -25293 52263 14651 -74108 -92153 -134076 -102567 -208576 -345455 -319089
16578c19089P7967P7396N0203L5259j7553j04567j7058N7572q1185n8044n0213
$$ -319089 -241122 -163726 -113523 -78264 -95817 -200384 -217442 -159870 -241055 -299099 -349312
16567c49312m453J24855l3432m2949Q0298M0584q68O3655k8300J1001J55652k338
$$ -349312 -353765 -228910 -262342 -305291 -224993 -184409 -185277 -121622 -149922 -138921 16731 14393
16555A4393j22130l3764j7439n3803M6374N1487j9501K9489J05148m361p8105
$$ 14393 -107737 -141501 -158940 -212743 -166369 -114882 -134383 -104894 254 -4107 -82212
16544h2212j9179L570k517l538j79198O2419L4574M0606q6947O546Q2848k3524
$$ -82212 -101391 -97821 -100338 -103876 -283074 -220655 -186081 -145475 -232422 -225876 -143028 -166552
16532a66552j58295p7403R8554J09924L3886j08030l8166J50900O776Q3603O7163
$$ -166552 -324847 -402250 -303696 -193772 -159886 -267916 -306082 -155182 -148406 -64803 2360
16521B360j08486J2690M4608m576M5194p5084k9142m4643O5274q7125O6122K3298
$$ 2360 -106126 -93436 -48828 -53404 -8210 -83294 -112436 -157079 -91805 -178930 -112808 -89510
16509h9510n1031Q0306J8452K9452m4358q9097P3777K6381l1773j6350l745M7055
$$ -89510 -140541 -60235 -41783 -12331 -56689 -145786 -72009 -45628 -77401 -93751 -97496 -50441
16497e0441n073l8414o9735q426J30016Q8076n6069o6761k2564R4218L4048Q4924
$$ -50441 -55514 -93928 -163663 -172089 -42073 46003 -10066 -76827 -99391 -5173 28875 113799
16485A13799j7871q9400j73995j16083m1470J73935M8632o146N2003R2095n8034
$$ 113799 95928 6528 -167467 -283550 -325020 -151085 -102453 -108599 -56596 35499 -22535
16474b2535r3662j4652M5744L5979K5989P327m3745j9273j6621N6826m5119O648
$$ -22535 -116197 -130849 -85105 -49126 -23137 -15810 -59555 -78828 -95449 -38623 -83742 -77094
16462g7094O9761j23084j56974k9186J06782j66570o0513J49033k9855m7158J9333
$$ -77094 -7333 -130417 -287391 -316577 -209795 -376365 -436878 -287845 -317700 -364858 -345525
16451c45525Q1842l985P167Q2698J34844r373P1883Q8956o8498o0993o9561j73948
$$ -345525 -263683 -267668 -260501 -177803 -42959 -52332 19551 108507 40009 -20984 -90545 -264493
16439b64493o3877j2424N6216J31122L4820m7588o5006M5281N3518p0288J05876
$$ -264493 -328370 -340794 -284578 -153456 -118636 -166224 -231230 -185949 -132431 -202719 -96843
16428i6843K1401j91047k9660J06003R7960K8853K536L4988p9201j69136o7543
$$ -96843 -75442 -266489 -296149 -190146 -92186 -63333 -60797 -25809 -105010 -274146 -341689
16417c41689K9417J2076N65K5416O4465l639K3861L7046N3905q3051n6952J39126
$$ -341689 -312272 -300196 -299631 -274215 -209750 -213389 -189528 -152482 -98577 -181628 -238580 -99454
16405i9454K3627o8805J00645N0363p3397j30108o311M0721O8494l3963l995R6872
$$ -99454 -75827 -144632 -43987 6376 -67021 -197129 -203440 -162719 -94225 -128188 -132183 -35311
16393c5311K6605K5497J4910N9350K5598l3451k68j48007o3201o8947L541q933
$$ -35311 -8706 16791 31701 91051 116649 83198 82930 -65077 -128278 -197225 -193684 -202617
16381b02617l7962R0290j10891O753O8769l5300J24353J33643l7956j10920K9083
$$ -202617 -240579 -150289 -261180 -254427 -185658 -220958 -96605 37038 -918 -111838 -82755
16370h2755n5788l0050N651M7188K2195L2166R728o6381M9704J8620K0348M0223
$$ -82755 -138543 -168593 -162942 -115754 -93559 -61393 -51665 -118046 -68342 -49722 -29374 10849
16358A0849N6994R2014q7351r3792j37337k6967J01836k1051r7877k3662J14207
$$ 10849 67843 159857 72506 -21286 -158623 -185590 -83754 -104805 -202682 -226344 -112137
16347a12137M0241l647n2505q1965M1412l983p8995J5593J6410O4643K8075O7041
$$ -112137 -71896 -75543 -128048 -210013 -168601 -172584 -251579 -235986 -219576 -154933 -126858 -59817
16335e9817P7365N0123j7795j8488n2581q2971p7593k098j5399j39741K8710J93909
$$ -59817 17548 67671 49876 31388 -21193 -104164 -181757 -183855 -199254 -338995 -310285 -116376
16323a16376j10232q610M7318l6520k735j8912K4427R9338o2433K3296P9519J4891
$$ -116376 -226608 -235218 -187900 -224420 -227155 -246067 -221640 -122302 -184735 -161439 -81920 -67029
16311f7029L8134m6135j03403L7562j8877K7558K28053Q1618k17090j15614L6494
$$ -67029 -28895 -75030 -178433 -140871 -159748 -132190 95863 177481 -39609 -155223 -118729
16300a18729L0258K1500L7699l91l0200K4367m7965q7731M7798Q1394J64982n2689
$$ -118729 -88471 -66971 -29272 -29663 -59863 -35496 -83461 -171192 -123394 -42000 122982 70293
16288G0293p2285J83j0704r8880j62014L0197O4355K4354L8653L036n3210L9215
$$ 70293 -1992 -1809 -12513 -111393 -273407 -243210 -178855 -154501 -115848 -112812 -166022 -126807
16276a26807J51386n8591q8342N680J01423N7364j8610l0818r3355k408n8156
$$ -126807 24579 -34012 -122354 -116674 -15251 42113 23503 -7315 -100670 -103078 -161234
16265a61234K4620J21030J32260m1559j33257j26868j05381R1641K5431P7606
$$ -161234 -136614 -15584 116676 75117 -58140 -185008 -290389 -198748 -173317 -95711
16255i5711M7520l4999K1465l3126L1929J962n7244j8385J41399P5729p6041q5657
$$ -95711 -48191 -83190 -61725 -94851 -62922 -60960 -118204 -136589 4810 80539 4498 -81159
16243h1159j13996P9418J9189m3393m5470o7999K8164K2554j5300N6905Q379J7779
$$ -81159 -195155 -115737 -96548 -139941 -185411 -253410 -225246 -202692 -217992 -161087 -152708 -134929
16231a34929j3843J04247l0710J52000M4276n0332k8640l8832p0069J7580K3742
$$ -134929 -148772 -44525 -75235 76765 121041 70709 42069 3237 -66832 -49252 -25510
16220b5510j39940j63015J56146J43175K2054p3945p1400K3817O8716j0763j01706
$$ -25510 -165450 -328465 -172319 -29144 -7090 -81035 -152435 -128618 -59902 -70665 -172371
16209a72371l9726j6776J16695N0815l3007j21717l2569M6290j04964n9104O0367
$$ -172371 -212097 -228873 -112178 -61363 -94370 -216087 -248656 -202366 -307330 -366434 -306067
16198c06067J06066J21588N8539r212o4753n2412j2356O96m0583q5563K9449K42488
$$ -306067 -200001 -78413 -19874 -29086 -93839 -146251 -158607 -157911 -198494 -284057 -254608 -12120
16186a2120Q2931j51381k5538P6094j3888m6406l1861j3434m8583K188Q8358P6319
$$ -12120 70811 -80570 -106108 -30014 -43902 -90308 -122169 -135603 -184186 -181998 -93640 -17321
16174a7321m1957j55642j59084j2023J45498R6176Q380K1451R5421o925o1274
$$ -17321 -59278 -214920 -374004 -386027 -240529 -144353 -135973 -114522 -19101 -26026 -87300
16163h7300r0199N2642J57899k0082j8739r8846O1597M860k6959m9114L3904L6420
$$ -87300 -177499 -124857 33042 12960 -5779 -104625 -43028 -38168 -65127 -114241 -80337 -43917
16151d3917J2553j26951j82535j568L8962J16671K0922j4382J90126P6464n5767
$$ -43917 -31364 -158315 -340850 -342418 -303456 -186785 -165863 -180245 9881 86345 30578
16140C0578j18959j41912q0936O2723J03692J56630J32965o6674j11681j42695
$$ 30578 -88381 -230293 -311229 -248506 -144814 11816 144781 78107 -33574 -176269
16130a76269K7733N9573P4755Q165j1307j22267j0029k3796o4891k3565k0334
$$ -176269 -148536 -88963 -14208 -6043 -17350 -139617 -149646 -173442 -238333 -261898 -282232
16119b82232K20579M5658j16444j07978J14419R6428J3182J09763P7432j7782
$$ -282232 -61653 -15995 -132439 -240417 -125998 -29570 -16388 93375 170807 153025
16109A53025j2699j04618L4559R2021L0062r7467j21798l7221j15035j06817o1160
$$ 153025 140326 35708 70267 162288 192350 94883 -26915 -64136 -179171 -285988 -347148
16098c47148Q7873J30911n3887l0716K4118l3972J71304R3362n4331p5076p9259
$$ -347148 -259275 -128364 -182251 -212967 -188849 -222821 -51517 41845 -12486 -87562 -166821
16087a66821j08436j1440K5826J17516n3190j9460O3148p4084m6321l2472J12291
$$ -166821 -275257 -286697 -260871 -143355 -196545 -216005 -152857 -226941 -273262 -305734 -193443
16076a93443L9890n076p6073M4804M6761P7162N6379l7663r1720L8010P4059N1060
$$ -193443 -153553 -158629 -234702 -189898 -143137 -65975 -9596 -47259 -138979 -100969 -26910 24150
16064B4150o9229m7419k7312j15072q7002N9928N4829l6621J7864M6210J80973
$$ 24150 -45079 -92498 -119810 -234882 -321884 -261956 -207127 -243748 -225884 -179674 1299
16053A299R1762o2309q6151L2154J10801k345j9803O7445r2300j85550j63109
$$ 1299 93061 30752 -55399 -23245 87556 85211 65408 132853 40553 -144997 -308106
16042c08106M1492J71693R1362K6828J00540n4196j58989q456j7901j2629Q7909
$$ -308106 -266614 -94921 -3559 23269 123809 69613 -89376 -97832 -115733 -128362 -40453
16031d0453N5388K8449r2405m7990p0103n2982j2092k3755J018O1479P4277p2901
$$ -40453 14935 43384 -49021 -97011 -167114 -220096 -232188 -255943 -254925 -193446 -119169 -192070
16019a92070K3372j2725m8732J0384Q6638Q8003M0448O549O7947Q4304r4398k5747
$$ -192070 -168698 -181423 -230155 -219771 -133133 -45130 -4682 1867 69814 154118 59720 33973
16007C3973q6217M4288J5291l2826J42676j9347j62489j91865j31130M2699O5966
$$ 33973 -52244 -7956 7335 -25491 117185 97838 -64651 -256516 -387646 -344947 -278981
15996b78981L8619l4280N32J9506Q4355M5401m7191p0002K1823K0529O5183R6248
$$ -278981 -240362 -274642 -274110 -254604 -170249 -124848 -172039 -242041 -220218 -199689 -134506 -38258
15984c8258P9271k8209l1676r5281K0784o175L3740J02743k6501n261r3696L3418
$$ -38258 41013 12804 -18872 -114153 -93369 -99544 -65804 36939 10438 5177 -88519 -55101
15972e5101M0940l9083O1299J9460j01854L941j16947N0526l8475o247J19386
$$ -55101 -14161 -53244 8055 27515 -74339 -70398 -187345 -136819 -175294 -181541 -62155
15961f2155Q8599o3081n7098O7469L1120Q9820m113j55528q3667j16811P8340
$$ -62155 26444 -36637 -93735 -26266 4854 94674 90561 -64967 -148634 -265445 -187105
15950a87105Q0680N296k6584Q3866P5924p873l3852P3915l975o1028K3344m7445
$$ -187105 -106425 -101129 -127713 -43847 32077 24204 -9648 64267 60292 -736 22608 -24837
15938b4837M7168N4252j30982k1622K2977J09827K7214k8634K7639j11206J1831
$$ -24837 22331 76583 -54399 -76021 -53044 56783 83997 55363 83002 -28204 -16373
15927a6373J03085K686n591O6918R582m4453m1570m1377p4428j21949j19789m4541
$$ -16373 86712 89398 83807 150725 160307 115854 74284 32907 -41521 -163470 -283259 -327800
15915c27800J26658m856R0827O7166o2730l7533K2378M8417j1972k7302k1210
$$ -327800 -201142 -205998 -115171 -48005 -110735 -148268 -125890 -77473 -89445 -116747 -137957
15904a37957O4220J4527N8720K4419P2399M7880K1383q2409j35200n6582j8113
$$ -137957 -73737 -59210 -490 23929 96328 144208 165591 83182 -52018 -108600 -126713
15893a26713o7229K2805j8189p6808j2922J14781R5997o3584p3782J3598K7806
$$ -126713 -193942 -171137 -189326 -266134 -279056 -164275 -68278 -131862 -205644 -192046 -164240
15882a64240N7913K3082l2288L0252L0773J2901j0746q6078o9037M9344K6527
$$ -164240 -106327 -83245 -115533 -85281 -54508 -41607 -52353 -138431 -207468 -158124 -131597
15871a31597N0828P7370M382j76425l4698N887J9646Q8056Q0805L5694l9413j9011
$$ -131597 -80769 -3399 983 -175442 -210140 -204253 -184607 -96551 -15746 19948 -19465 -38476
15859c8476j6980m7874o3784N2438J14583J6424j07422q7241L8468J16465j349
$$ -38476 -55456 -103330 -167114 -114676 -93 16331 -91091 -178332 -139864 -23399 -24748
15848b4748q6475j23984J0363J62238J36218J2477j37047m1860L6004J1356Q2271
$$ -24748 -111223 -235207 -224844 -62606 73612 86089 -50958 -92818 -56814 -45458 36813
15837C6813l2111j7547p7773K4556J00896J0110j98495m7961n8910n1871K0655
$$ 36813 4702 -12845 -90618 -66062 34834 44944 -153551 -201512 -260422 -312293 -291638
15826b91638J03528M8236M5922M4791k125L7225j0241J9350j2582n4368j07574
$$ -291638 -188110 -139874 -93952 -49161 -51286 -14061 -24302 -4952 -17534 -71902 -179476
15815a79476P5717J26900j39104r0973J01606J7533J1101Q897N375J5554l8959
$$ -179476 -103759 23141 -115963 -206936 -105330 -87797 -76696 -67799 -62424 -46870 -85829
15804h5829P1006q5373q399P1810J11983k6800o3010p6239m6863j885M3184Q6066
$$ -85829 -14823 -100196 -108595 -36785 75198 48398 -14612 -90851 -137714 -139599 -96415 -10349
15792a0349K1023L1952k5449j25454l7533L2934R258p5504n3599L8220J60780
$$ -10349 10674 42626 17177 -108277 -145810 -112876 -103618 -179122 -232721 -194501 -33721
15781c3721J38747L7192j891L8647k2424L6987j24964j22938K9024P0712l4596
$$ -33721 105026 142218 140327 178974 156550 193537 68573 -54365 -25341 45371 10775
15770A0775m4853k144r126N405m7692k4539k8101n5478k560N4035R3272O9217
$$ 10775 -34078 -36222 -45348 -39943 -87635 -112174 -140275 -195753 -198313 -144278 -51006 18211
15758A8211j36791j09025o5551P4740Q307R6416L6779J1281n3160m4279p417j7724
$$ 18211 -118580 -227605 -293156 -218416 -210109 -113693 -76914 -65633 -118793 -163072 -170489 -188213
15746a88213l6003M4049j9011l9422O4436J60370M2083J0757n0804n4694k5651
$$ -188213 -224216 -180167 -199178 -238600 -174164 -13794 28289 39046 -11758 -66452 -92103
15735i2103J05681l5047k3583K3398l1245r2717J4374r483L2286K6241m1891l7113
$$ -92103 13578 -21469 -45052 -21654 -52899 -145616 -131242 -140725 -108439 -82198 -124089 -161202
15723a61202l2172L9768j1943j5326O6828K3349p2205q7852K990R6891P6834K7532
$$ -161202 -193374 -153606 -165549 -180875 -114047 -90698 -162903 -250755 -247765 -150874 -74040 -46508
15711d6508R706l8461Q240O6265n9357q2513J3686J13115M4181m67J4408k6823
$$ -46508 -36802 -75263 -67023 -758 -60115 -142628 -128942 -15827 28354 27887 42295 15472
15699A5472n2001j65527o4343J57843L3417q5220m8682J9901Q2750J8196q0240
$$ 15472 -36529 -202056 -266399 -108556 -75139 -160359 -209041 -189140 -106390 -88194 -168434
15688a68434p1784k0416J4872Q5042R4197r842R0327K0641Q6961l2466j80735
$$ -168434 -240218 -260634 -245762 -160720 -66523 -76365 13962 34603 121564 89098 -91637
15677i1637k6674l5427O6683k9931l8185J00146R0152k3040j33686p8747J0909
$$ -91637 -118311 -153738 -87055 -116986 -155171 -55025 35127 12087 -121599 -200346 -189437
15666a89437O3914O0501l3250j15693j2163Q8885Q5325o8637p2451J38582J03982
$$ -189437 -125523 -65022 -98272 -213965 -226128 -137243 -51918 -120555 -193006 -54424 49558
15655D9558K4177k429P1277j01026q3327k7088k5851J959J4135k5423p5023J19893
$$ 49558 73735 71306 142583 41557 -41770 -68858 -94709 -92750 -78615 -104038 -179061 -59168
15643e9168m5685K49J06042O782p1414k0875o5627P0194R4964j28222q3128J31008
$$ -59168 -104853 -104604 1438 8220 -63194 -84069 -149696 -79502 15462 -112760 -195888 -64880
15631f4880J47375j45351R054P9687o2113r5698j6596q4645O5785N471n6745o9729
$$ -64880 82495 -62856 -53802 25885 -36228 -131926 -148522 -233167 -167382 -161911 -218656 -288385
15619b88385K2726J45622J17924L7770N1395n1827J4509p4515J4050m2531J22113
$$ -288385 -265659 -120037 -2113 35657 87052 35225 49734 -24781 -10731 -53262 68851
15608F8851m7867j40157m4958o412J20366J74039n9330l0634L8408m9965p2740
$$ 68851 20984 -119173 -164131 -170543 -50177 123862 64532 33898 72306 22341 -50399
15597e0399J48O0275m3633K8671N4990M1800J02679r312o2151j33747p6598k1590
$$ -50399 -50251 10024 -33609 -4938 50052 91852 194531 185219 123068 -10679 -87277 -108867
15585a08867j44150N3061J44640J28225j05256j76303n5641J46748R1465J8104
$$ -108867 -253017 -199956 -55316 72909 -32347 -208650 -264291 -117543 -26078 -7974
15575g974P5913n3401j13157K7710J79493k0725r5108N43n8305l9898p4904N4656
$$ -7974 67939 14538 -98619 -70909 108584 87859 -7249 -6706 -65011 -104909 -179813 -125157
15563a25157O3560R5618L0565j0586K1225l2009j05424M712O9421k5821O057o425
$$ -125157 -61597 34021 64586 54000 75225 43216 -62208 -57496 11925 -13896 -7839 -14264
15551a4264j4550L830J3974m2792j14103j17026J03451J13057L855k1059r689
$$ -14264 -28814 -24984 -11010 -53802 -167905 -284931 -181480 -68423 -64568 -85627 -95316
15540i5316N9738M48K9767m5473m7668j2k3928m6451l42P9456L5970L8305l1249
$$ -95316 -35578 -35130 -5363 -50836 -98504 -98516 -122444 -168895 -169237 -89781 -53811 -15506 -46755
15527d6755l7235j79345q3041j15676J09940O7198Q2731N6720q6394Q801N6236
$$ -46755 -83990 -263335 -346376 -462052 -352112 -284914 -202183 -145463 -231857 -223056 -166820
15516a66820R7413P2055o3483m9012O0094O5016K6550q8120p7930l3024R3458
$$ -166820 -69407 2648 -60835 -109847 -49753 15263 41813 -46307 -124237 -157261 -63803
15505f3803M8637m6152Q9211Q330j28755n5120M8901m0399K3151l7109K2621M9961
$$ -63803 -15166 -61318 27893 36223 -92532 -147652 -98751 -139150 -115999 -153108 -130487 -80526
15493h0526q8888l2670m1624Q6372O4807O5378p7645R3979P9556J4217K2335J4384
$$ -80526 -169414 -202084 -243708 -157336 -92529 -27151 -104796 -10817 68739 82956 105291 119675
15481A19675n2715p2861l3625M6464L2217K3973j0470L9639k658j0250o8893j34450
$$ 119675 66960 -5901 -39526 6938 39155 63128 52658 92297 89639 79389 10496 -123954
15469a23954l2250q7683J20650O3346J6479J243L6845J30526k9043n2403r0296
$$ -123954 -156204 -243887 -123237 -59891 -43412 -42169 -5324 125202 96159 43756 -46540
15458d6540q162N4687J47373k6676j5550p4968l4008j10251J26469P9435O9482
$$ -46540 -54702 -15 147358 120682 105132 30164 -3844 -114095 12374 91809 161291
15447A61291r6843j37276O868J18903j19341O4997O6646p6843q6701j5355N7156
$$ 161291 64448 -72828 -65960 52943 -66398 -1401 65245 -11598 -98299 -113654 -56498
15436e6498n0570J0960j6012J38459j23990m2113O6044Q4290r5800n5066N7185
$$ -56498 -107068 -96108 -112120 26339 -97651 -139764 -73720 10570 -85230 -140296 -83111
15425h3111n2622L4437R3012P5417j34071m610K8390J852R2159K9934j0528m574
$$ -83111 -135733 -101296 -8284 67133 -66938 -71548 -43158 -41306 50853 80787 70259 65685
15413F5685R0409r2106o8524L6949j0028k0242J5571l1206N698L232K3116J236
$$ 65685 156094 63988 -4536 32413 22385 2143 17714 -13492 -7794 -4562 18554 19790
15401A9790k3715j3969R3207N569p5657J5205k9719q2794r817R4784K5076o4361
$$ 19790 -3925 -17894 75313 80882 5225 20430 -9289 -92083 -101900 -7116 17960 -46401
15389d6401n2464r4844L799p4055J14959K11351m8359n2487q6216M6956N9053
$$ -46401 -98865 -193709 -189910 -263965 -149006 62345 13986 -38501 -124717 -77761 -18708
15378a8708J2523n7037j4424J28590K1974p0912n3090P7924Q6176l7877p0361
$$ -18708 -6185 -63222 -77646 50944 72918 2006 -51084 26840 113016 75139 4778
15367D778j2915L7835K9883j8597m8496L1344p9861K0762j8555j10095K0812Q2732
$$ 4778 -8137 29698 59581 40984 -7512 23832 -56029 -35267 -53822 -163917 -143105 -60373
15355f0373Q5461k7125N0210j09123n9053M2311R8015M7407l0832m9977N4132
$$ -60373 25088 -2037 48173 -60950 -120003 -77692 20323 67730 36898 -13079 41053
15344D1053J0584j3066n9783q6136J16288N4442j10605P8117J0737j45244r5948
$$ 41053 51637 38571 -21212 -107348 8940 63382 -47223 30894 41631 -103613 -199561
15333a99561J00590J99861N071n9214m5555j03979J6998J10243Q9271P868j51858
$$ -199561 -98971 100890 105961 46747 1192 -102787 -85789 24454 113725 121593 -30265
15322c0265j2315J23227J12949j17612q8971K7592J4139k9474o8307N510J18857
$$ -30265 -42580 80647 193596 75984 -12987 14605 28744 -730 -69037 -63527 55330
15311E5330r0854j19885k3209P9740O1626r7660l9431O2880k4290M826m7942n5039
$$ 55330 -35524 -155409 -178618 -98878 -37252 -134912 -174343 -111463 -135753 -130927 -178869 -233908
15299b33908j1082Q0524K1607J04550J36894M0389m4633j64610j57117M7385O2702
$$ -233908 -244990 -164466 -142859 -38309 98585 138974 94341 -70269 -227386 -180001 -117299
15288a17299N9130J73650k5485j2992n7580o2666R888j9440J4461R011q1639M6200
$$ -117299 -58169 115481 89996 77004 19424 -43242 -33354 -52794 -38333 -29322 -110961 -64761
15276f4761o9039k5201J2589N8511Q8109J10066n472j12357n9572r661o7495j6334
$$ -64761 -133800 -159001 -146412 -87901 208 110274 104802 -7555 -67127 -76788 -144283 -160617
15264a60617P4638J1396J842K5773m7039o4586k2064l868p8167m2540J28724K4782
$$ -160617 -85979 -74583 -72741 -46968 -94007 -158593 -180657 -184525 -262692 -305232 -176508 -151726
15252a51726j8549R4261n5671k047o860k5321O3443J26755j12193j03186k5943
$$ -151726 -170275 -76014 -131685 -133732 -140592 -165913 -102470 24285 -87908 -191094 -217037
15241b17037J23053K5102r8825K1811J39170R4249k4449j09516k8325m7151O3307
$$ -217037 -93984 -68882 -167707 -145896 -6726 87523 63074 -46442 -74767 -121918 -58611
15230e8611O8987J52886M4880O1781l270q0200o5678j00947q0248j08998L715
$$ -58611 10376 163262 208142 269923 266653 186453 120775 19828 -60420 -169418 -165703
15219a65703M8429o9785J7492N09J81016Q5932p229j4112k5666O532j3712p1110
$$ -165703 -117274 -187059 -169567 -169058 11958 97890 90661 76549 50883 57415 43703 -27407
15207b7407l3735k0518n4838J27840O7372J22661J1200j24947q4456L5741L3736
$$ -27407 -61142 -81660 -136498 -8658 58714 181375 192575 67628 -16828 18913 52649
15196E2649j34215l8715J23392J06432M6809q4217p7032k4975l7163m50M6249
$$ 52649 -81566 -120281 3111 109543 156352 72135 -4897 -29872 -67035 -67485 -21236
15185b1236P6372o6510j38428O0514L4148L4023Q3497N4018L1104p8304n8721
$$ -21236 55136 -11374 -149802 -89288 -55140 -21117 62380 116398 147502 69198 10477
15174A0477j07267P7011k2228k6808O4396Q4838N6632L119p7579L3303l4713k8617
$$ 10477 -96790 -19779 -42007 -68815 -4419 80419 137051 140170 62591 95894 61181 32564
15162C2564N2639q515m2703j8268j54750r1502M9229R7629P3990R5403P3196m434
$$ 32564 85203 76688 33985 15717 -139033 -230535 -181306 -83677 -9687 85716 158912 154478
15150A54478n8828n393P0821o3313n3348q971q6915M2841q4909m3054R9567K3828
$$ 154478 95650 90257 161078 97765 44417 35446 -51469 -8628 -93537 -136591 -37024 -13196
15138a3196p9303M4436K9641o1475N2831J00722L7101p7569j8037J05302k7893
$$ -13196 -92499 -48063 -18422 -79897 -27066 73656 110757 33188 15151 120453 92560
15127I2560m0800l9036j88310p4359J06387K02780l7500j02937M8771l9701m6807
$$ 92560 51760 12724 -175586 -249945 -143558 59222 21722 -81215 -32444 -72145 -118952
15116a18952R4813K3461L9790K9625j81155j10907P9053K05196N5362k0462j29761
$$ -118952 -24139 -678 39112 68737 -112418 -223325 -144272 60924 116286 95824 -33937
15105c3937J7382j9739j00504m6567l2921R9151L6912o0829r510O274j01195K2783
$$ -33937 -16555 -36294 -136798 -183365 -216286 -117135 -80223 -141052 -150562 -144288 -245483 -222700
15093b22700M058n562M8527J38788j17574m4535P379J9518p7957q8684M9426J07055
$$ -222700 -218642 -224204 -175677 -36889 -154463 -198998 -191619 -172101 -250058 -338742 -289316 -182261
15081a82261O0277J06513M5293l7328R2353P2815q8831m9402j1533M9160q6441
$$ -182261 -121984 -15471 29822 -7506 84847 157662 68831 19429 7896 57056 -29385
15070b9385J7882K8606R7100N0075j86415j13309J152K2056L5712O940m9975R7776
$$ -29385 -11503 17103 114203 164278 -22137 -135446 -134294 -112238 -76526 -69586 -119561 -21785
15058b1785J8768r3793p2644m220J83145P4771N4100j20168j16746j17336J4799
$$ -21785 -3017 -96810 -169454 -173674 9471 84242 138342 18174 -98572 -215908 -201109
15047b01109n262q7965J5753J3394N9434Q3939o05J1566O4531R6902k7132K4686
$$ -201109 -206371 -294336 -278583 -265189 -205755 -121816 -122421 -110855 -46324 50578 23446 48132
15035D8132k3936J5108k0824m5868L794Q0263R8674m11j0035k9084o1616O4172
$$ 48132 24196 39304 18480 -27388 -23594 56669 155343 154932 144897 115813 54197 118369
15023A18369m8930j08675L9734j8577j05999m9874J4858J76767N7419j118p2887
$$ 118369 69439 -39236 498 -18079 -124078 -173952 -159094 17673 75092 73974 1087
15012A087r4059j02326K6612M3666p1242K2350n3888L8009O0165k3385J15377
$$ 1087 -92972 -195298 -168686 -125020 -196262 -173912 -227800 -189791 -129626 -153011 -37634
15001c7634P8948k7723n3030N6145k5566m4128K2339l3951q2870P2448J33330
$$ -37634 41314 13591 -39439 16706 -8860 -52988 -30649 -64600 -147470 -75022 58308
14990E8308n332j12568r7299j9208p0081P0909O8737k5260o2666N6020J22844
$$ 58308 52976 -59592 -156891 -176099 -246180 -175271 -106534 -131794 -194460 -138440 -15596
14979a5596O9445l8995j0161N644K210j9211j1817r4531j4862o9743N2250o7296
$$ -15596 53849 14854 4693 10337 12547 -6664 -18481 -113012 -127874 -197617 -145367 -212663
14967b12663k7404J78849J06286J46265q6003j99830j03783J13548P7452p8249
$$ -212663 -240067 -61218 45068 191333 105330 -94500 -198283 -84735 -7283 -85532
14957h5532m8069Q6057n2064j02382n8364j0516J06966J5697m0117n3392M6961
$$ -85532 -133601 -47544 -99608 -201990 -260354 -270870 -163904 -148207 -188324 -241716 -194755
14946a94755P3466K0454N1546q8775k9041J00683j45045r9737R4936J28026Q921
$$ -194755 -121289 -100835 -49289 -138064 -167105 -66422 -211467 -311204 -216268 -88242 -79321
14935g9321q4069J8510J17027l94o4794m686M5322j4920M2450N6977q9529k2366
$$ -79321 -163390 -144880 -27853 -28247 -93041 -97727 -52405 -67325 -24875 32102 -57427 -79793
14923g9793L5425J06861p1587J36279m6982o8281m726k332p2141n767p706M7024
$$ -79793 -44368 62493 -9094 127185 80203 11922 7196 4864 -67277 -73044 -80750 -33726
14911c3726N8308m193N3989P1278p7440n5426Q3646k5218M6986J06734N96j4247
$$ -33726 24582 20389 74378 145656 68216 12790 96436 71218 118204 224938 225534 211287
14899B11287p8560j36136o9330q7389J3825R2338Q6345j52857l2073L3616J7909
$$ 211287 132727 -3409 -72739 -160128 -146303 -53965 32380 -120477 -152550 -118934 -101025
14888a01025j81110K2802J55895N1940m5953j2562o5638N8836J84463J97959K4595
$$ -101025 -282135 -259333 -103438 -51498 -97451 -110013 -175651 -116815 67648 265607 290202
14877B90202Q8909J03177O5258J23785J06026J18155M9056J43251J77489J0147
$$ 290202 379111 482288 547546 671331 777357 895512 944568 1087819 1265308 1275455
14867A275455j1864r1771j41188k28768j74296p1869o6331j29149j81714L7501
$$ 1275455 1263591 1171820 1030632 801864 627568 555699 489368 360219 178505 216006
14857B16006Q1656q5018j03226L5462j89018j22737L3074J9622J48474L8936j03710
$$ 216006 297662 212644 109418 144880 -44138 -166875 -133801 -114179 34295 73231 -30479
14846c0479n7807K2711M3629k9179Q3130K4950P4233N0266M0691j8845J6520R5487
$$ -30479 -88286 -65575 -21946 -51125 32005 56955 131188 181454 222145 203300 219820 315307
14834C15307n0584Q0094P092q5359J6170K5726o2398q4213L0193K2063O9870K21743
$$ 315307 264723 344817 351909 266550 282720 308446 246048 161835 192028 214091 283961 505704
14822E05704J54267J89589J47546J26122J29354J61824L20667J39311j1494p6641
$$ 505704 659971 849560 997106 1123228 1252582 1414406 1735073 1874384 1862890 1786249
14812A786249j13804j11437k16913k02875p7338r0401k06969j30868q420m1418
$$ 1786249 1672445 1561008 1344095 1141220 1063882 973481 766512 635644 627224 585806
14802E85806m3722r3857j03940m0492j19393r976K11687K3527O9527Q9318q400
$$ 585806 542084 448227 344287 303795 184402 174426 386113 409640 479167 568485 560085
14791E60085j08271J0855J23008l8004r8408L1251m1263j7501L1822P280L5736
$$ 560085 451814 462669 585677 547673 449265 480516 439253 421752 453574 460854 496590
14780D96590j70894j86261R8619J01605k4915L180O4366m5720n1750j03930K0156
$$ 496590 325696 139435 238054 339659 314744 317924 382290 336570 284820 180890 201046
14769B01046J17098o936O0458N0841j0846o4560n4410O0925K14412K40727J39775
$$ 201046 318144 311208 371666 422507 411661 347101 292691 353616 568028 808755 948530
14758I48530J51728J0499J16145J58960J61968J07036J09141N4236j21385k57833
$$ 948530 1100258 1110757 1226902 1385862 1547830 1654866 1764007 1818243 1696858 1439025
14748A439025k03272k41270j2221m515k23469j95675J879r412j65159j12233K024
$$ 1439025 1235753 994483 982262 977747 754278 558603 560482 551070 385911 273678 275702
14737B75702j9020l6318l6011r058J2997o1027j55899r6634K4845K2386L6690
$$ 275702 256682 220364 184353 175295 188292 127265 -28634 -125268 -100423 -78037 -41347
14726d1347Q4065K7330r2500j59014n6569N3324K690O1968N024k9651M2234O5753
$$ -41347 42718 70048 -22452 -181466 -238035 -184711 -182021 -120053 -115029 -144680 -102446 -36693
14714c6693K7853j14474m2330m139J10136J46367K0291o4924K9233R5855M2669
$$ -36693 -8840 -123314 -165644 -169783 -59647 86720 107011 42087 71320 167175 209844
14703B09844k3631n0352n4901j18996M0911L08p8160l1374L1379J65j30504O6215
$$ 209844 186213 135861 80960 -38036 2875 3183 -74977 -106351 -74972 -74807 -205311 -139096
14691a39096R4031j2133Q6600k0317N2482r905n9897j52140j1107M53J06506J35364
$$ -139096 -45065 -57198 29402 9085 61567 51662 -8235 -160375 -171482 -171029 -64523 70841
14679G0841m9965l8866J8142L9775p9407J663R6221J91864L4623m4664q3291m4167
$$ 70841 20876 -17990 152 39927 -39480 -37817 58404 250268 284891 240227 156936 112769
14667A12769j59320j09628L6969P8785r0181k7071R6348m1310K3513Q8423R7117
$$ 112769 -46551 -156179 -119210 -40425 -130606 -157677 -61329 -102639 -79126 9297 106414
14656A06414R2716J2466o7502N3471n7842k2271k208m4865k3841Q4389Q5545m0469
$$ 106414 199130 211596 144094 197565 139723 117452 115244 70379 46538 130927 216472 176003
14644A76003O9333J87136R835M0495N5236L4282K1365q2331j10276p6415p2624
$$ 176003 245336 432472 442307 482802 538038 572320 593685 511354 401078 324663 252039
14633B52039j00504q0164l143l0759n1287J1519k2298l3636o2494J13983R518
$$ 252039 151535 71371 68228 37469 -13818 -2299 -24597 -58233 -120727 -6744 2774
14622B774O8620R5677j0829j50110k2614J21878J90478l575k5469j31952q2657
$$ 2774 71394 167071 156242 6132 -16482 105396 295874 292299 266830 134878 52221
14611E2221L7615J1515L3443o3260m8876l5916N7369M4586M9410r295m3660q740
$$ 52221 89836 101351 134794 71534 22658 -13258 44111 88697 138107 128812 85152 76412
14599G6412q7322j1660J43111R4519r4152Q6663J02117m6518q9985l3371o8173
$$ 76412 -10910 -22570 120541 215060 120908 207571 309688 263170 173185 139814 71641
14588G1641n6096j20083l8078M8337J75007K8512j291m4268M737j0615R1326m6684
$$ 71641 15545 -104538 -142616 -94279 80728 109240 107949 63681 68418 57803 149129 102445
14576A02445j62740j3239Q9059K6358n3029q5657K698K37294J9526o9031m7998
$$ 102445 -60295 -73534 15525 41883 -11146 -96803 -94105 143189 162715 93684 45686
14565D5686Q850M4410m0128K3811N1185J8103J7997N370Q7026J6056j03076m6679
$$ 45686 54536 98946 58818 82629 133814 151917 169914 175284 262310 278366 175290 128611
14553A28611N4698K7528j34020O5202M2715n0866m4834J30829R2978l6801r4070
$$ 128611 183309 210837 76817 142019 184734 133868 89034 219863 312841 276040 181970
14542A81970J8204J00824k4875n7894k8405R7316J41359J80441K26692L25372
$$ 181970 200174 300998 276123 218229 189824 287140 428499 608940 835632 1161004
14532A161004L46168J95886J02149K6218K36359J58071j14639k61805k40620j94429
$$ 1161004 1507172 1703058 1805207 1831425 2067784 2225855 2111216 1849411 1608791 1414362
14522A414362k09073l59306j20464j28376q7015n5141j80906o1824P5798O7649
$$ 1414362 1205289 845983 725519 597143 510128 454987 274081 212257 288055 355704
14512C55704j01106j33941P3373l6349o5328L8955l367m2077M0633P2813M8705
$$ 355704 254598 120657 194030 157681 92353 131308 127941 85864 126497 199310 248015
14501B48015R4630L9828r0978j7472N195m0423k1175N1586M8367k5666J00042
$$ 248015 342645 382473 291495 274023 279218 238795 217620 269206 317573 291907 391949
14490C91949l335m3526J5893j6667M5731k7809j6529n5539j0694L2048J0866p441
$$ 391949 388614 345088 360981 344314 390045 362236 345707 290168 279474 311522 322388 314947
14478C14947j7104J8491J2129k3358J51894J65331M8665J3465j7360j12127j00528
$$ 314947 297843 316334 328463 305105 456999 622330 670995 684460 667100 554973 454445
14467D54445K15377O3098J12533P8136o2973L6982K3191M1067J20355l56P6905
$$ 454445 669822 732920 845453 923589 860616 897598 920789 961856 1082211 1081855 1158760
14456A158760P54N8713J24660O4229M3068q094J32362L7074J08150J91252J52947
$$ 1158760 1159514 1218227 1342887 1407116 1450184 1442090 1574452 1611526 1719676 1910928 2063875
14445B063875J68147K50735K71347L16750L51614N82791P73134R09110R89479
$$ 2063875 2232022 2482757 2754104 3070854 3422468 4005259 4778393 5687503 6676982
14436F676982J169682J368129J595522J804718K081266K268699K906321L983199
$$ 6676982 7846664 9214793 10810315 12615033 14696299 16964998 19871319 23854518
14428B3854518N870151Q842670J3823452K0838025K8549188L4776776L7844809
$$ 23854518 29724669 38567339 52390791 73228816 101778004 136554780 174399589
14421A74399589L7414156L2338476K2260510P506701q479306k2201091l1507485
$$ 174399589 211813745 244152221 266412731 273919432 265440126 243239035 211731550
14414B11731550l6451683l7011310l3223579k6776725j9501512j3154492q813155
$$ 211731550 175279867 138268557 105044978 78268253 58766741 45612249 36799094
14407C6799094n865374m111911l232124k808449k503605k219895k059254j743884
$$ 36799094 30933720 26821809 23589685 20781236 18277631 16057736 13998482 12254598
14399A2254598j730364j488131j234528q32747o47520o04621o50143n03681n09209
$$ 12254598 10524234 9036103 7801575 6968828 6321308 5716687 5066544 4562863 4053654
14390D053654l74997l51195j96306k39152l54560j72105j49358q4994k17485l8354
$$ 4053654 3678657 3327462 3131156 2892004 2537444 2365339 2215981 2130987 1913502 1875148
14380A875148J4492j26144j34845j31413l0760r7702k2240p4053j8473j25747
$$ 1875148 1889640 1763496 1628651 1497238 1466478 1368776 1346536 1272483 1254010 1128263
14370A128263l9533j38587l166N7857p306l2864n7464n1187M3214k4501j87459
$$ 1128263 1088730 950143 946977 1004834 997528 964664 907200 856013 899227 874726 687267
14359F87267j76912K2198R4647k8645L2354N0409j28425q2316j33846l0645J24896
$$ 687267 510355 532553 627200 598555 630909 681318 552893 470577 336731 306086 430982
14348D30982m514o2477J8380J19111P0188N0600M3997n0286o8848k8022K5853
$$ 430982 426468 363991 382371 501482 571670 622270 666267 615981 547133 519111 544964
14337E44964p808Q6176j623j18475j33072o8646J01219J39362q3450o8279j45341
$$ 544964 537156 623332 621709 503234 370162 301516 402735 542097 458647 390368 245027
14326B45027p6714M3545M0675n9328r7118L9121P9114O8133M0724l7433N225j6559
$$ 245027 168313 211858 252533 193205 96087 135208 214322 282455 323179 285746 290971 274412
14314B74412n2325k8361R0580j11432K0645J14156M164o7647j28143n6404K36472
$$ 274412 222087 193726 284306 172874 193519 307675 311839 244192 116049 59645 296117
14303B96117N7119m4699o7586k1193K1355j3883p1277j13144j634m7010j7481
$$ 296117 353236 308537 240951 219758 241113 227230 155953 42809 41175 -5835 -23316
14292b3316q2784l9260K31718J93659K5831n8856Q4836L2541j09237k0376k6711
$$ -23316 -106100 -145360 86358 280017 305848 246992 331828 364369 255132 234756 208045
14281B08045p5871O3355o0037J7012M459j24776O9748J41115k7808J0264j6623
$$ 208045 132174 195529 135492 152504 156963 32187 101935 243050 215242 225506 208883
14270B08883m2611l505n633J4146m0690K6438N4324M2441o9672j33797n7352O1311
$$ 208883 166272 162767 157134 171280 130590 157028 211352 253793 184121 50324 -7028 54283
14258E4283J5062q85m3934o3845Q7063K05203O4992j8487j02008O289p2138j29346
$$ 54283 69345 68460 24526 -39319 47744 252947 317939 299452 197444 203733 131595 2249
14246B249n0958M157k6070J2107N3m3882K2105n6182J0628P1328p652r987R9409
$$ 2249 -48709 -44552 -70622 -58515 -58462 -102344 -80239 -136421 -125793 -54465 -62117 -72104 27305
14233B7305J10848K9569L185p5365m5466J74692J03424j2814j55268j39912k4363
$$ 27305 138153 167722 170907 95542 50076 224768 328192 315378 160110 20198 -4165
14222d165n4028j9435o7J4710J2988N6932N6614m6510q3973K9517K6056R4900
$$ -4165 -58193 -77628 -77695 -62985 -49997 6935 63549 17039 -66934 -37417 -11361 83539
14210H3539Q1972k419j02121q8052q7061O1232J05502M9151m4346o5593Q7994
$$ 83539 165511 163092 60971 -27081 -114142 -52910 52592 101743 57397 -8196 79798
14199G9798J4565N4010m9773j2706K7406J6871m1990m9143J884M8839n3123n200
$$ 79798 94363 148373 98600 85894 113300 130171 88181 39038 40922 89761 36638 31438
14187C1438O2069L0177K9528L7450m9935Q3649K4004n8527L3801Q7812m2385m6888
$$ 31438 93507 123684 153212 190662 140727 224376 248380 189853 223654 311466 269081 222193
14175B22193p4963K0029l7156k3575k6063k1322m5293o3338J02669R3533J6265
$$ 222193 147230 167259 130103 106528 80465 59143 13850 -49488 53181 146714 162979
14164A62979l2433p9504l9751Q7445J65090M6733j00062j46131L3600M3769K2743
$$ 162979 130546 51042 11291 98736 263826 310559 210497 64366 97966 141735 164478
14153A64478o0301L1817J5711O239l5869j14597p8681Q9514K2195j25850p28N8000
$$ 164478 104177 135994 151705 157944 122075 7478 -71203 18311 40506 -85344 -86072 -28072
14141b8072q479q4097O1957J1897M0860N042P6306M9239j3196l8071K186J9492
$$ -28072 -36551 -120648 -58691 -46794 -5934 -892 75414 124653 111457 73386 75572 95064
14129I5064p6710N264O4170l5154m7868R2222J09736j05104j09635P2081M8606
$$ 95064 18354 23618 87788 52634 4766 96988 206724 101620 -8015 64066 112672
14118A12672r8688J82307M4128q4896j16694l9671j205o8459m1606K9903J08620
$$ 112672 13984 196291 240419 155523 38829 -842 -2047 -70506 -112112 -82209 26411
14107B6411J14003O6686l140r8455P7765M8105o8269p0945o2379k5742J70219
$$ 26411 140414 207100 203960 105505 183270 231375 163106 92161 29782 4040 174259
14096A74259n1624j6645r2991j9608n6362k7385J58071J1322N802P6530k4740
$$ 174259 122635 105990 12999 -6609 -62971 -90356 67715 79037 84839 161369 136629
14085A36629k0820O4683j2581j08992k2174m3227j2813j09347L67J15320N332
$$ 136629 115809 180492 167911 58919 36745 -6482 -19295 -128642 -128275 -12955 -7623
14074g623q813p7329o2679k509R299Q7408J780M1827k574l11j3359N0939k3224
$$ -7623 -16436 -93765 -156444 -158953 -149654 -62246 -60466 -18639 -21213 -21524 -34883 16056 -7168
14061g168p6090k572Q222q589l9609L7467R8088p1583M2249J03010P2456q4431
$$ -7168 -83258 -85830 -77608 -86197 -125806 -88339 9749 -61834 -19585 83425 155881 71450
14049G1450K4742Q165L8821q3268r0984M0782Q9558J0990K2307r431l2013j16246
$$ 71450 96192 104357 143178 59910 -31074 9708 99266 110256 132563 123132 91119 -25127
14037b5127l587K02215n8009j39122J3959j8803j6201L0289P3140K0028j26532
$$ -25127 -28714 173501 115492 -23630 -9671 -28474 -44675 -14386 58754 78782 -47750
14026d7750j5159L2594J4872J3034P4435m2620l7390k3145J4473L8329K2025O2261
$$ -47750 -62909 -30315 -15443 -2409 72026 29406 -7984 -31129 -16656 21673 43698 105959
14014A05959j14932J707K05326N5374j21520M1884J8811j41085m2726k5184Q949
$$ 105959 -8973 -7266 198060 253434 131914 173798 192609 51524 8798 -16386 -7437
14003g437m6050N2250j855K337M5966J04982j00900Q631Q1377L3298O2804j1917
$$ -7437 -53487 -1237 -3092 -755 45211 150193 49293 57924 139301 172599 235403 223486
13991B23486l3761L9750j01617j08964Q4855J6091K547K5474J9016K3352l6198
$$ 223486 189725 229475 127858 18894 103749 119840 122387 147861 166877 190229 154031
13980A54031q2758n6179N9054J07290N0893k3174j2407j066r9461j0623K1120
$$ 154031 71273 15094 74148 181438 232331 209157 196750 195684 96223 85600 106720
13969A06720P838O8275q653J46059K94472L12999J51335J35282J39221J52473
$$ 106720 114558 182833 174180 320239 614711 927710 1079045 1214327 1353548 1506021
13959A506021K5314j48892j82113k57808k47197j60545j75309m6898j3351Q3487
$$ 1506021 1531335 1382443 1200330 942522 695325 534780 359471 312573 299222 382709
13949C82709l1924q9885k4446L7206r6637K2793J9336q8108k949j20513m8112
$$ 382709 350785 260900 236454 273660 177023 199816 219152 131044 128095 7582 -40530
13938d0530J63336j8478j4294j04862n2273q294o805q9876j3196J61680P2862
$$ -40530 122806 104328 90034 -14828 -67101 -75395 -82200 -172076 -185272 -23592 49270
13927D9270m5293J38774k6454j57703j19877J04309O2542L1100p62n2388K8281
$$ 49270 3977 142751 116297 -41406 -161283 -56974 5568 36668 35906 -16482 11799
13916A1799N4922n3267J7867j05241m2291K5683J12567J61123o9402p2333M8092
$$ 11799 66721 13454 31321 -73920 -116211 -90528 22039 183162 113760 41427 89519
13905H9519j3847n0390m7953M3281o5034l9324L6659Q4560N0477N8181L055o3749
$$ 89519 75672 25282 -22671 20610 -44424 -83748 -47089 37471 87948 146129 149184 85435
13893H5435l9097O2180k1569l9871J5017N1580r3110j64369P4976R9119P3146
$$ 85435 46338 108518 86949 47078 62095 113675 20565 -143804 -68828 30291 103437
13882A03437O6535P4197P2697j45907k25418q8719P9554J06839J38061j23596
$$ 103437 169972 244169 316866 170959 -54459 -143178 -63624 43215 181276 57680
13872E7680o0040l3029l5675m3437p0930o203O4586m584N1691J29196K9157k12655
$$ 57680 -2360 -35389 -71064 -114501 -185431 -191634 -127048 -131632 -79941 49255 78412 -134243
13860a34243o3145O7530O4036N0336L1181k186j2922J9100J9367K1728j6811n0538
$$ -134243 -197388 -129858 -65822 -15486 15695 13509 587 19687 39054 60782 43971 -6567
13848f567M4536O851j4972j183O0451J06363o8495r2346q751M6680j25233O170
$$ -6567 37969 44820 29848 28665 89116 195479 126984 34638 25887 72567 -52666 -46496
13836d6496J25357M1482j4204p8746J7224J0255o14l6714O8942Q6739J15572o9207
$$ -46496 78861 120343 106139 27393 44617 54872 54258 17544 86486 173225 288797 219590
13824B19590m0330O0042o7348k67773j06980N7837Q9458R2328n0030n1687l436
$$ 219590 179260 239302 171954 -95819 -202799 -144962 -55504 36824 -13206 -64893 -68329
13813f8329N185J0395j14383N293l1239m3945J7242L4300L5549J5970Q0444J18393
$$ -68329 -63144 -52749 -167132 -161839 -193078 -237023 -219781 -185481 -149932 -133962 -53518 64875
13801F4875J14219j9710k02859l8483Q6737k7970l8549M9489p0300m5314p4860
$$ 64875 179094 159384 -43475 -81958 4779 -23191 -61740 -12251 -82551 -127865 -202725
13790b02725K7222l0965j23475J6135J56250J10027K0120m08r8176m4274J0439
$$ -202725 -175503 -206468 -329943 -313808 -157558 -47531 -27411 -27819 -125995 -170269 -159830
13779a59830O3094r3047o0842K3143J25294J40006R0719j08750j84622k2336j2278
$$ -159830 -96736 -189783 -250625 -227482 -102188 37818 128537 19787 -164835 -187171 -199449
13768a99449P5277J27135l6868L4778q6808M8217j9218q4581n5850J57281Q0298
$$ -199449 -124172 2963 -33905 873 -85935 -37718 -56936 -141517 -197367 -40086 40212
13757D0212P8862R7118j18518j19357r7453k9174J29982R7145n3585J0103q3178
$$ 40212 119074 216192 97674 -21683 -119136 -148310 -18328 78817 25232 35335 -47843
13746d7843P562l0642L9112R9659O4506n9020Q604M8466j5453j51429j32999J05732
$$ -47843 -40281 -70923 -31811 67848 132354 73334 81938 130404 114951 -36478 -169477 -63745
13734f3745O4409m4426J4962p9711n4611k516J21967M2438p4818O8940O5053M7961
$$ -63745 664 -43762 -28800 -108511 -163122 -165638 -43671 -1233 -76051 -7111 57942 105903
13722A05903j20415j19428j5795O1086J45360K9198j46179k3880l7976J57656
$$ 105903 -14512 -133940 -149735 -88649 56711 85909 -60270 -84150 -122126 35530
13712C5530Q5689j3777j64035K739J06613K4692K2858q4472N2135k6892L2393
$$ 35530 121219 107442 -56593 -53854 52759 77451 100309 15837 67972 41080 73473
13701G3473Q1256p4363M883O7338k180M1562r4058j00725j471P037m0658l8267
$$ 73473 154729 80366 85249 152587 150407 191969 97911 -2814 -4285 2752 -37906 -76173
13689g6173Q627n7597j16175m221N4495J12192O3210L5306l4847n3259m8461J2233
$$ -76173 -67546 -125143 -241318 -245539 -191044 -78852 -15642 19664 -15183 -68442 -116903 -104670
13677a04670P5327N4902K0673j95539o6012J12737J90763J01732K5273o3516j12795
$$ -104670 -29343 25559 46232 -149307 -215319 -102582 88181 189913 215186 151670 38875
13666C8875J2975l5046l2734p1800j0892J88767O0024p1081k6141k4919j19485
$$ 38875 51850 16804 -15930 -87730 -98622 90145 150169 79088 52947 28028 -91457
13655i1457O5619J01277k3208j36285k7070Q6394R9637m823j23288J4304Q4361
$$ -91457 -25838 75439 52231 -84054 -111124 -24730 74907 70084 -53204 -38900 45461
13644D5461K0902O6697k7148j46855l0646m1533M8882o1921r8680O8705m4793
$$ 45461 66363 133060 105912 -40943 -71589 -113122 -64240 -126161 -224841 -156136 -200929
13633b00929Q5431J07413K4681M3977J01341j1568M5539R081L9038o6844r7386
$$ -200929 -115498 -8085 16596 60573 161914 150346 195885 204966 244004 177160 79774
13622G9774l976K8260j65773o5192R3360J27332M9042M2246j12717m1337L4630
$$ 79774 75798 104058 -61715 -126907 -33547 93785 142827 185073 72356 31019 65649
13611F5649k02119q4775P9336R8159J645k9407O8685O4291J25501k5533j6694
$$ 65649 -136470 -221245 -141909 -43750 -42105 -71512 -2827 61464 186965 161432 144738
13600A44738r3115r0147J63713j05774q6001J4072j49913n9581J74907O1066M5193
$$ 144738 51623 -38524 125189 19415 -66586 -52514 -202427 -262008 -87101 -26035 19158
13589A9158M5293j9364l2135P0348J2243j47190j11780L1451J24158N7508j56201
$$ 19158 64451 45087 12952 83300 95543 -51647 -163427 -131976 -7818 49690 -106511
13578a06511N9904J20064o3381o2868M5997O7258R575J15155o2669j46196k1150
$$ -106511 -46607 73457 10076 -52792 -6795 60463 70038 185193 122524 -23672 -44822
13567d4822R8696J05525M0018j8414K7875r1894j10007q2299n7451P6333M8928
$$ -44822 53874 159399 199417 181003 208878 116984 6977 -75322 -132773 -56440 -7512
13556g512K336P1348m0679P3254J01964j28426J0162R3650o8314j14880p7763
$$ -7512 -5176 66172 25493 98747 200711 72285 82447 176097 107783 -7097 -84860
13545h4860J22490P6459n5589o9537o6805q3457N3977K5523Q0128O6018N9066
$$ -84860 37630 114089 58500 -11037 -77842 -161299 -107322 -81799 -1671 64347 123413
13534A23413j3413k3188J00348R222j2608k7447j34986r2651j961n9232j54j06035
$$ 123413 110000 86812 187160 196382 183774 156327 21341 -71310 -73271 -132503 -132657 -238692
13522b38692o058N6088l8802Q373Q1615J16614L9161O0257L5119m5208q5374j64662
$$ -238692 -244750 -188662 -227464 -219091 -137476 -20862 18299 78556 113675 68467 -16907 -181569
13510a81569j74224J49648J74146Q4110L880K1264J85267j50169o6484n7387j12977
$$ -181569 -355793 -206145 -31999 52111 55991 77255 262522 112353 45869 -11518 -124495
13499a24495l9345J40139O4768j30541q1368n007K2714m7027J660O0151M1967
$$ -124495 -163840 -23701 41067 -89474 -170842 -175849 -153135 -200162 -198502 -138351 -96384
13488i6384K589P604K9507M6116O0515j5975K862K6560n9925l5607j20319R1392
$$ -96384 -93795 -86191 -56684 -10568 49947 33972 36834 63394 3469 -32138 -152457 -61065
13476f1065J38790L9137o6086j8670j1781m5505M0629K3013j33206L1748q433
$$ -61065 77725 116862 50776 32106 20325 -25180 15449 38462 -94744 -62996 -71429
13465g1429K7061K2262r8289n155J06458n0827j38273K1385N1460O5374n4710
$$ -71429 -44368 -22106 -120395 -125550 -19092 -69919 -208192 -186807 -135347 -69973 -124683
13454a24683r9345N7730M2026N9961l1010p278N5538q713r170j35334J4207J5057
$$ -124683 -224028 -166298 -124272 -64311 -95321 -102599 -47061 -55774 -64944 -200278 -186071 -171014
13442a71014K13L2607P4700J2509J3401L0200Q8797M8555L924m4777l2853j0819
$$ -171014 -170801 -138194 -63494 -50985 -37584 -7384 81413 129968 133892 89115 56262 45443
13430D5443O0104o5164k1501L4269o3573j00461L5192J35959l313R546p3789k1447
$$ 45443 105547 40383 18882 53151 -10422 -110883 -75691 60268 56955 66501 -7288 -28735
13418b8735J36417Q5835r2550j17726o2498K3251O3626Q8201Q09j11871r6248
$$ -28735 107682 193517 100967 -16759 -79257 -56006 7620 95821 96630 -15241 -111489
13407a11489j6483J06971J81281Q4571j20128m7659q6641j33365M3324j3603j08370
$$ -111489 -127972 -21001 160280 244851 124723 77064 -9577 -142942 -99618 -113221 -221591
13396b21591R6035J26168M8816m0252K69P18p1590J20437O7541o1478K5195N3372
$$ -221591 -125556 612 49428 9176 9445 10163 -61427 59010 126551 65073 90268 143640
13384A43640q19j1072o895r2964j51049j14668K8002K17412J16498m4943j8405
$$ 143640 142821 131749 124854 31890 -119159 -233827 -205825 11587 128085 83142 64737
13373F4737k3949n4309J51927J20848j65237l0886J4169M1519p5560q4625p2500
$$ 64737 40788 -13521 138406 259254 94017 63131 77300 118819 43259 -41366 -113866
13362a13866R0071J57658O8338j7470o9482q9490j42206K462N8519J33517O9650
$$ -113866 -23795 133863 202201 184731 115249 25759 -116447 -113985 -55466 78051 147701
13351A47701M7153p9968r2124P9356R9222p1935j06704j0816M999M2043R5584
$$ 147701 194854 114886 22762 102118 201340 129405 22701 11885 16884 58927 154511
13340A54511j21389j48686R4267M5163m1615K7213l2886r801K8311Q1028m981
$$ 154511 33122 -115564 -21297 23866 -17749 9464 -23422 -33223 -4912 76116 71135
13329G1135j47210l9819M5239O0459j92l6945q3073n7981N6880P6102K1072k0900
$$ 71135 -76075 -115894 -70655 -10196 -10388 -47333 -130406 -188387 -131507 -55405 -34333 -55233
13317e5233O7563P6839O5793Q6766o4793r4045j00410n8776Q5698J7974L4087
$$ -55233 12330 89169 154962 241728 176935 82890 -17520 -76296 9402 27376 61463
13306F1463l151l0772Q776l9172R2660Q2666o2957q2085J211j21886j20345R7864
$$ 61463 58312 27540 36316 -2856 89804 172470 109513 27428 28639 -93247 -213592 -115728
13294a15728J67325Q1931r0329j51493j0352J25402J32241L2597j50569j2997
$$ -115728 51597 133528 43199 -108294 -118646 6756 138997 171594 21025 8028
13284H028J4348j6911L1782m3854J2252R3922L9113K9977m629n039O2080J06289
$$ 8028 22376 5465 37247 -6607 5645 99567 138680 168657 164028 158989 221069 327358
13272C27358k5027k6375N1902J72428Q2846k8919p7100l8618K0154M4344O2341
$$ 327358 302331 275956 327858 500286 583132 554213 477113 438495 458649 502993 565334
13261E65334j05950j83315K9222k4000L2560J25748r3063j39312O9019J50646
$$ 565334 459384 276069 305291 281291 313851 439599 346536 207224 276243 426889
13251D26889o089j80511j62247J7116l4995M0083j9109r6330K7033J52143P5444
$$ 426889 420800 240289 78042 95158 60163 100246 81137 -15193 11840 163983 239427
13240B39427l8136J3364Q0204q7379j4510M3719n0001N6170J9671K221n0362J09371
$$ 239427 201291 214655 294859 207480 192970 236689 186688 242858 262529 264750 214388 323759
13228C23759J2959l7543k7714r3539m3459k505L6270j00538n0734J25743l9185
$$ 323759 336718 299175 271461 177922 134463 131958 168228 67690 16956 142699 103514
13217A03514l9765R7578L6986R1291o114j2762N2699p274j3569p9516n8031M5787
$$ 103514 63749 161327 198313 289604 283490 270728 323427 316153 302584 223068 165037 210824
13205B10824j15420k21101k4158P3023J37353N3654N2221O2078K453n7570J6256
$$ 210824 95404 -125697 -149855 -76832 60521 114175 166396 228474 230927 173357 189613
13194A89613m4912o4383O6655J66450M8754j03989j65290n755J8754m9807O4844
$$ 189613 144701 80318 146973 313423 362177 258188 92898 87143 105897 56090 120934
13183A20934l5634j36558o0363j2607n220J8074J8347m0060k451J80650K06843
$$ 120934 85300 -51258 -111621 -124228 -129448 -111374 -93027 -133087 -135538 45112 251955
13172B51955l0037m2828q2898j15768l7333M870J09616J7644k4710p4194N0831
$$ 251955 221918 179090 96192 -19576 -56909 -52039 57577 75221 50511 -23683 27148
13161B7148R6077J3202o9420o4013J03531j10676j10779n4045O3074J74101N7732
$$ 27148 123225 136427 67007 2994 106525 -4151 -114930 -168975 -105901 68200 125932
13150A25932n1362j6966p841O986n740m3489J4884j11321R4163N3510o9407k02069
$$ 125932 74570 57604 49763 56749 51009 7520 22404 -88917 5246 58756 -10651 -212720
13138b12720M8042O5063n7541N9676J30270N4939J10649J7172L3309p7003l438
$$ -212720 -164678 -99615 -157156 -97480 32790 87729 198378 215550 248859 171856 168418
13127A68418L1075j26200j32173J20385J09830L728j10379K4591J0674j13116
$$ 168418 199493 73293 -58880 61505 171335 175063 64684 89275 99949 -13167
13117a3167l2744j4346k6102j9529K3377J12098J3069q2953m1026M2441J18143
$$ -13167 -45911 -60257 -86359 -105888 -82511 29587 42656 -40297 -81323 -38882 79261
13106G9261j2749j3864J5879l248q9096K2141J65717J41605l7422p4823J582L02
$$ 79261 66512 52648 68527 65279 -23817 -1676 164041 305646 268224 193401 194983 195285
13094A95285l330o2711r8338J3305K8715k466M4141L6830j8686J7580p7348l5951
$$ 195285 191955 129244 30906 44211 72926 70460 114601 151431 132745 150325 72977 37026
13082C7026p164J20914M6768K1120J4202j53529k7293Q8797o8267j25630O1991
$$ 37026 29862 150776 197544 218664 232866 79337 52044 140841 72574 -53056 8935
13071H935L005P2645R1761k8102j12839m4976n5794n3677M6818J3872M3110K5858
$$ 8935 11940 84585 176346 148244 35405 -9571 -65365 -119042 -72224 -58352 -15242 10616
13059A0616M3476R6870l2626k3594n5162N45K3782J0462q6782k009P4857o9668
$$ 10616 54092 150962 118336 94742 39580 40125 63907 74369 -12413 -14422 60435 -9233
13047i233N6258M223M6716p6599j19181m3123N4695M6904J38827J9766n4312n4218
$$ -9233 47025 51248 97964 21365 -97816 -140939 -86244 -39340 99487 119253 64941 10723
13035A0723Q2196k3014K4030J9664J5776J5606Q8490K1029k03772j04699N9686
$$ 10723 92919 69905 93935 113599 129375 144981 233471 254500 50728 -53971 5715
13024E715P7690L9440j58465l290J64297J33308r6331o4203L3382j03522r0632
$$ 5715 83405 122845 -35620 -38910 125387 258695 162364 98161 131543 28021 -62611
13013f2611J40098J14308Q0472M3368q7645l2999J10103M0238q8257j8453m5068
$$ -62611 77487 191795 272267 315635 227990 194991 305094 345332 257075 238622 193554
13002A93554q7580k640O1547J29122M942q5360j07309n0236K3813L6064J1512
$$ 193554 105974 103334 164881 294003 298945 213585 106276 56040 79853 115917 127429
12991A27429J43524k142j27634O2098J19195L7119j26274R594j08616q9287J36686
$$ 127429 270953 268811 141177 203275 322470 359589 233315 242909 134293 45006 181692
12980A81692J24N4184L2119K1196n2683j49457j29108Q6193J95113m9754k11812
$$ 181692 181816 236000 268119 289315 236632 87175 -41933 44260 239373 189619 -22193
12969b2193m8024o271N7613K5299R537K0208O2106P5879L745K2529l7296q5263
$$ -22193 -70217 -76488 -18875 6424 15961 36169 98275 174154 177899 200428 163132 77869
12957G7869j530l4622k842J12774J47485J5065j15581n5066P7956j74944J750
$$ 77869 76339 41717 38875 151649 299134 314199 198618 143552 221508 46564 48314
12946D8314O9274k3876Q5018j0731m0309j07942R0951J46282J14375m4006q8221
$$ 48314 117588 93712 178730 167999 127690 19748 110699 256981 371356 327350 239129
12935B39129n3901p1945K0387Q0284o0636L5904j62548k7254O3095o564N8123
$$ 239129 185228 113283 133670 213954 153318 189222 26674 -580 62515 55951 114074
12924A14074P50o7340O4833L5429m7718L8136o8052j7001N4852L3549O3510L7655
$$ 114074 114824 47484 112317 147746 100028 138164 70112 53111 107963 141512 205022 242677
12912B42677R5139q3992j43427k7187O5143J07183j16100r4443m0700k663l8249
$$ 242677 337816 253824 110397 83210 148353 255536 139436 44993 4293 1630 -36619
12901c6619k2634J68367J2678q3170n8001N9412R8180M5711N7210R428J68568
$$ -36619 -59253 109114 121792 38622 -19379 40033 138213 183924 241134 250562 419130
12890D19130n2012k10404L296j15604P2310P9286l0473o2351q851r6995J658J02708
$$ 419130 367118 156714 160010 44406 116716 196002 165529 103178 94327 -2668 -1010 101698
12878A01698n4929j4965J2417K5654O3897J5155p836q1583M2291R3620l3390J6495
$$ 101698 46769 31804 44221 69875 133772 148927 141091 59508 101799 195419 162029 178524
12866A78524M2971j34490j37359P1901J46678R637L956M684j19367Q0801J55489
$$ 178524 221495 87005 -50354 21547 168225 177862 181818 186502 67135 147936 303425
12855C03425M1725K9938k495r2248m2231r1619r181J08967m9421l872k5943L7668
$$ 303425 345150 375088 372593 280345 238114 146495 137314 246281 196860 192988 167045 204713
12843B04713O0537Q1316p8404J42901K4914j97135o5935Q8419K4676r6309n960
$$ 204713 265250 346566 268162 411063 435977 238842 172907 261326 286002 189693 183733
12832A83733j5092j06142m6555O932J8988J4831K2346J90655J27481M833l3833
$$ 183733 168641 62499 15944 22876 41864 56695 79041 269696 397177 402010 368177
12821C68177j25146L322P591o2234L478O6208j7556O9656o803J4263r7652j09117
$$ 368177 243031 246353 253944 191710 195188 261396 243840 313496 306693 320956 223304 114187
12809A14187k9800R5695L7153P438r264l6420K4826L2526O0024L0736m9341l7734
$$ 114187 84387 180082 217235 224673 215409 178989 203815 236341 296365 327101 277760 240026
12797B40026j9827k2600L6034m5030L0245L9122k6289R6633J5635m3880N0271
$$ 240026 220199 197599 233633 188603 218848 257970 231681 328314 343949 300069 350340
12786C50340N4898k3565m6424k7431o207J2036k0159j62196P0513J01795K2092
$$ 350340 405238 381673 335249 307818 301611 313647 293488 131292 201805 303600 325692
12775C25692j08823J070M5004l5147J6369M8689K5668P5947r83o4805K296q5105
$$ 325692 216869 217939 262943 227796 244165 292854 318522 394469 393486 328681 330977 245872
12763B45872j58498j03834K6079J56443M6894K6922l2255l440j5477Q357m6709
$$ 245872 87374 -16460 9619 166062 212956 239878 207623 204183 188706 197063 150354
12752A50354M4468J33869O9284Q3910K2504p4732j44333n8524j5706J7729M3290
$$ 150354 194822 328691 397975 481885 504389 429657 285324 226800 211094 228823 272113
12741B72113m1356m2146J30684J01050J23341R1140J941j13364j6025Q9953K7214
$$ 272113 230757 188611 319295 420345 543686 634826 636767 523403 507378 597331 624545
12730F24545l1815m8295j54573M0573R5296L620J949N8249J5817j9990l9080n8163
$$ 624545 592730 544435 389862 430435 525731 529351 531300 589549 605366 585376 546296 488133
12718D88133J0325J39404N9582l676q6252o2162j40073p8296J08295N8368K5814
$$ 488133 498458 637862 697444 693768 607516 545354 405281 326985 435280 493648 519462
12707E19462p1598L9736l4960L558M5560k494Q4153J79332l7870j37964j18192
$$ 519462 447864 487600 452640 456198 501758 499264 583417 762749 724879 586915 468723
12696D68723N8037n2208k8761j6388R7996R1272P0526j0935n2525r249K0331m9250
$$ 468723 526760 474552 445791 429403 527399 618671 689197 678262 625737 616488 636819 587569
12684E87569J30531J33415o369k9918M2511p4646j69851r9902L7410P9155P224
$$ 587569 718100 851515 845146 815228 857739 783093 613242 513340 550750 629905 637129
12673F37129n2206j4799J70362J33856j35820m0596P5855R6145l9015p8736k1516
$$ 637129 584923 570124 740486 874342 738522 697926 773781 869926 830911 752175 730659
12662G30659J80731L2331n2149N5155j3370o8727k1653O8881k8363J6941R678
$$ 730659 911390 943721 891572 946727 933357 864630 842977 911858 883495 900436 910114
12651I10114n354J1591K786p364q4602Q2937J25253M0820k4581j3962P5570R439
$$ 910114 904760 916351 919137 911773 827171 910108 1035361 1076181 1051600 1037638 1113208 1122647
12639A122647j00109j9586R8917L4764l6777j1165J827Q1195Q0281j1050K2143
$$ 1122647 1022538 1002952 1101869 1136633 1099856 1088691 1090518 1171713 1251994 1240944 1263087
12628A263087L1701O0300n168Q692j90037m3722j4200j10569k0539j2547J01226
$$ 1263087 1294788 1355088 1349920 1358612 1168575 1124853 1110653 1000084 979545 966998 1068224
12617A068224J40369L8886J69144P7684m7374L9665J18697p8206q6675l9204L8531
$$ 1068224 1208593 1247479 1416623 1494307 1446933 1486598 1605295 1527089 1440414 1401210 1439741
12606A439741J32019L4218P1636R5441O0340O5532q0581k1345L6337N6872Q3864
$$ 1439741 1571760 1605978 1677614 1773055 1833395 1898927 1818346 1797001 1833338 1890210 1974074
12595A974074l9890j01128o7952L8879R6277J91089J99583O0135L853l6081m6014
$$ 1974074 1934184 1833056 1765104 1803983 1900260 2091349 2290932 2351067 2354920 2318839 2272825
12584B272825o5847Q981J80996J44350J2533k440J61039K9609k4581P7816K7290
$$ 2272825 2206978 2215959 2396955 2541305 2553838 2551398 2712437 2742046 2717465 2795281 2822571
12573B822571P3543O2753l1624J16105M321M7604J03931Q6153O7113J52467M9057
$$ 2822571 2896114 2958867 2927243 3043348 3047669 3095273 3199204 3285357 3352470 3504937 3553994
12562C553994m6581J01837L2702j5743J37260J44186K31956J37507L2175p6001
$$ 3553994 3507413 3609250 3641952 3626209 3763469 3907655 4139611 4277118 4309293 4233292
12552D233292R8369J82226Q7630M2630K41365J52023J01306J60657L1909k1790
$$ 4233292 4331661 4513887 4601517 4644147 4885512 5037535 5138841 5299498 5331407 5309617
12542E309617Q9991J25900J63167J53920J94208J49043K25098K24447K42995J93318
$$ 5309617 5399608 5525508 5688675 5842595 6036803 6185846 6410944 6635391 6878386 7071704
12532G071704J58118J74205K30455K93784J89360K23184L47192K16947K40985
$$ 7071704 7229822 7404027 7634482 7928266 8117626 8340810 8688002 8904949 9145934
12523I145934K93420M25817K29434J81318J16155K38136M95945L71593L68897
$$ 9145934 9439354 9865171 10094605 10275923 10392078 10630214 11126159 11497752 11866649
12514A1866649M75155M63014M41021M33480M96925M48906N05004N07601N11230
$$ 11866649 12341804 12804818 13245839 13679319 14176244 14625150 15130154 15637755 16148985
12505A6148985N90802O20374M97506O25466O18416N77205O93582P26654P92774
$$ 16148985 16739787 17360161 17857667 18483133 19101549 19678754 20372336 21098990 21891764
12496B1891764P68265P08032P21560P17196Q46648Q55067Q13550Q05556P35434
$$ 21891764 22660029 23368061 24089621 24806817 25653465 26508532 27322082 28127638 28863072
12487B8863072Q00350P52544Q85933Q78703P96802O82094O55608O35273N55280
$$ 28863072 29663422 30415966 31301899 32180602 32977404 33659498 34315106 34950379 35505659
12478C5505659M80189L74160K95026J88887K31499J98637o9039r876l5790j12496
$$ 35505659 35985848 36360008 36655034 36843921 37075420 37274057 37205018 37195142 37159352 37046856
12468C7046856k65587l74268m79107n30888m63743m46347o94936o37949o25848
$$ 37046856 36781269 36407001 35927894 35397006 34933263 34486916 33791980 33154031 32528183
12459C2528183p82151q66508p69014q06080p64960o90287p69145p13172p29713
$$ 32528183 31746032 30879524 30110510 29304430 28539470 27849183 27080038 26366866 25637153
12450B5637153o33830q46777q76055p17851o15563o76231o09893n92745p43359
$$ 25637153 25003323 24156546 23280491 22562640 21947077 21270846 20660953 20068208 19324849
12441A9324849o90604n65621n62186n10619m60769m10606n75313o06493n32173
$$ 19324849 18634245 18068624 17506438 16995819 16535050 16124444 15549131 14942638 14410465
12432A4410465l93882l26084m02113l72045l02858m23021l45831m46173l33516
$$ 14410465 14016583 13690499 13288386 12916341 12613483 12190462 11844631 11398458 11064942
12423A1064942l29447l94107k91249r0863k86061l06238j54480j47615j65118
$$ 11064942 10735495 10341388 10050139 9959276 9673215 9366977 9212497 9064882 8899764
12414H899764j89996k91404k94049k85619j95291k07111k00035k52085p8206j23828
$$ 8899764 8709768 8418364 8124315 7838696 7643405 7436294 7236259 6984174 6905968 6782140
12404F782140j82588k30183j88107j37474j00132k59555j82672J0659q6633j10262
$$ 6782140 6599552 6369369 6181262 6043788 5943656 5684101 5501429 5512088 5425455 5315193
12394E315193q6900O161j2605k68316j05032j10945j89625p8033j19418m304j10483
$$ 5315193 5228293 5234454 5221849 4953533 4848501 4737556 4547931 4469898 4350480 4346176 4235693
12383D235693j08711l1389j0591p7852j39900m0582k8868j25958r3109j80624
$$ 4235693 4126982 4095593 4085002 4007150 3867250 3826668 3797800 3671842 3578733 3398109
12373C398109n2751l9461j81499m8106k7166k5351Q6650n5508j57546L5348J19131
$$ 3398109 3345358 3305897 3124398 3076292 3049126 3023775 3110425 3054917 2897371 2932719 3051850
12362C051850q2584j56781J208J81591k9728j40052q1576k09568p5836K9711n0645
$$ 3051850 2969266 2812485 2813693 2995284 2965556 2825504 2743928 2534360 2458524 2488235 2437590
12351B437590L1570j10784o831M3301k9874j09145j43571k8319L8096O8971M5322
$$ 2437590 2469160 2358376 2351545 2394846 2364972 2255827 2112256 2083937 2122033 2191004 2236326
12340B236326j17395j56974q6178Q3972N6029n5779j03561q4555M2300N7203K4495
$$ 2236326 2118931 1961957 1875779 1959751 2015780 1960001 1856440 1771885 1814185 1871388 1895883
12329A895883j9596j59625j36505R883L6690j09137k2885J1762k3342j17334O721
$$ 1895883 1876287 1716662 1580157 1590040 1626730 1517593 1494708 1506470 1483128 1365794 1372515
12318A372515J31497J06426L3447j02620k1309o2586j1257j19564k4890m3497
$$ 1372515 1504012 1610438 1643885 1541265 1519956 1457370 1446113 1326549 1301659 1258162
12308A258162J2242O120L6901J9088p7619r6797l037K3204k2265p1180k1172m0673
$$ 1258162 1270404 1276524 1313425 1332513 1254894 1158097 1155060 1178264 1155999 1084819 1063647 1022974
12296A022974J7875P4680K1827J5320J3876J7686q1983P6634Q5155j03959o467
$$ 1022974 1040849 1115529 1137356 1152676 1166552 1184238 1102255 1178889 1264044 1160085 1153618
12285A153618K9750M6468Q870j4186j2571r414o9992j64773p3875M8217N8927
$$ 1153618 1183368 1229836 1238706 1224520 1211949 1202535 1132543 967770 893895 942112 1001039
12274A001039n6844k9656N3306O9305l6299j60516j62745P5909J77664L7228r9234
$$ 1001039 944195 914539 967845 1037150 1000851 840335 677590 753499 931163 968391 869157
12263H69157j54m4547P3559R0938n656N1585o2559j74726k4213K8301m9273m9348
$$ 869157 869003 824456 898015 988953 983297 1034882 972323 797597 773384 801685 752412 703064
12251G03064j7312M0375R4524o7233p3988q3900J4396R5821Q7136N9778j13233
$$ 703064 685752 726127 820651 753418 679430 595530 609926 705747 792883 852661 739428
12240G39428l660P8395k0894J09621J881q9128j9833J2466n8504K5185J7716n0722
$$ 739428 735768 814163 793269 902890 904771 815643 795810 808276 749772 774957 792673 741951
12228G41951j5539p8683j16540Q0100J09704j1475j04991m0473R5300o4673q5684
$$ 741951 726412 647729 531189 611289 720993 709518 604527 564054 659354 594681 508997
12217E08997P7482J03742O3511o731m5491r3290j9257k5879q918n266J6022O5376
$$ 508997 586479 690221 753732 747001 701510 608220 588963 563084 554166 548900 564922 630298
12205F30298J8710K9132o9395J2385n3480J0231J27767M8341m5215n3511r3122
$$ 630298 649008 678140 608745 621130 567650 577881 705648 753989 708774 655263 562141
12194E62141n550l5131J6685L7302J17183R588n8098q5038r6450m782Q680r0215
$$ 562141 556591 521460 538145 575447 692630 702218 644120 559082 462632 457850 466530 376315
12182C76315n3630J56764k7114j07768J2760J6426P3327J21026m9109j30672p7384
$$ 376315 322685 479449 452335 344567 357327 373753 447080 568106 518997 388325 310941
12171C10941J2609m4845m0448J10873P8807R7585J16483o3303k8553j6991L6618
$$ 310941 323550 278705 238257 349130 427937 525522 642005 578702 550149 533158 569776
12160E69776j00744l7353L482j3322J24038J2753j7382N4115l0894m2183n0988
$$ 569776 469032 431679 435161 421839 545877 558630 541248 595363 564469 522286 471298
12149D71298N950q9448o1090O4772O4335O071p8145j03656l0491R6043j1234o9060
$$ 471298 477248 387800 326710 391482 455817 461888 383743 280087 249596 345639 334405 265345
12137B65345m0518o8617m9426Q7436J42273J7567J4404j092j63090o7571L8914
$$ 265345 224827 156210 106784 194220 336493 354060 368464 367372 204282 136711 175625
12126A75625J3998m8658j60689O17K819J1970J24076N6571O2709J50179m2458
$$ 175625 189623 140965 -19724 -19107 -16288 -4318 119758 176329 239038 389217 346759
12115C46759j87954n4535m8588M7080j3800M8717L8090m7185Q1240J17787J41116
$$ 346759 158805 104270 55682 102762 88962 137679 175769 128584 209824 327611 468727
12104D68727j48769m9658m0223k303J35179p955n5453K8961j80553j48221J08309
$$ 468727 319958 270300 230077 227774 362953 354998 299545 328506 147953 -268 108041
12093A08041Q7070K6672o7135o2895J38966Q150l1187J03351K0296p7784m3697
$$ 108041 195111 221783 154648 91753 230719 238869 207682 311033 331329 253545 209848
12082B09848L4019l1749K2841O4020L156m1797k4124M970j19898P1758M2756J3196
$$ 209848 243867 212118 234959 298979 302135 260338 236214 241184 121286 193044 235800 248996
12070B48996n1498n53Q9571Q3210p0283n0163N4512K4382o7337K672R0594L4961
$$ 248996 197498 196945 286516 369726 299443 249280 303792 328174 260837 263509 354103 389064
12058C89064j28675j16882M0810M5086J4980l4171l5515N5867j5086j47506j8885
$$ 389064 260389 143507 184317 229403 244383 210212 174697 230564 215478 67972 49087
12047D9087Q1011L8199k9874j06955J40503M4377L291M6110M9043L7911N275L9123
$$ 49087 130098 168297 138423 31468 171971 216348 219639 265749 314792 352703 357978 397101
12035C97101l677l0954o0973p8045j4379O9288L5838j10114j27484J6932O2352
$$ 397101 393424 362470 301497 223452 209073 278361 314199 204085 76601 93533 155885
12024A55885R3951q488l8495k3443m8499K3409N1998N7460r5916p7156N3210J51408
$$ 155885 249836 241348 202853 179410 130911 154320 206318 263778 167862 90706 143916 295324
12012B95324K6024j12422j23862l0404q846J03004L9096J8559P5594q0719j94631
$$ 295324 321348 208926 85064 54660 45814 148818 187914 206473 282067 201348 6717
12001F717N4020J00193N0254Q7336k7140r0298j87698Q9636p5876q1241M1871
$$ 6717 60737 160930 211184 298520 271380 181082 -6616 83020 7144 -74097 -32226
11990c2226J0199q109J096J11174N0083J2184o3223j48586k3071K8203K8416N6880
$$ -32226 -22027 -30136 -29040 82134 132217 144401 81178 -67408 -90479 -62276 -33860 23020
11978B3020P3256n3510k6447N369M3034j2255j37299K0656R6004J67265l7587
$$ 23020 96276 42766 16319 21688 64722 52467 -84832 -64176 31828 199093 161506
11967A61506N0875n9394n7133m3198n6556L1574J38098M2405j46187m9676q3886
$$ 161506 212381 152987 95854 52656 -3900 27674 165772 208177 61990 12314 -71572
11956g1572J5942N5274N8548k4811Q9147n433M5362R3042k5834k1040r048R4237
$$ -71572 -55630 -356 58192 33381 122528 117095 162457 255499 229665 208625 199577 293814
11944B93814N0426j20484j26221m2000O311L7710r8177o2933J41543M7760l843
$$ 293814 344240 223756 97535 55535 61846 99556 1379 -61554 79989 127749 123906
11933A23906m301K0426K6181j11595k1016J03950Q9806L6631n2356j0728p7477
$$ 123906 119605 140031 166212 54617 33601 137551 227357 263988 211632 200904 123427
11922A23427O6275R6599j0946l8854r2003j6533N0861L6814L9748q9021j88713
$$ 123427 189702 286301 275355 236501 144498 127965 178826 215640 255388 166367 -22346
11911b2346R0312J44597R802L2141P8599L0066j34730k5672l2356M7647l3792
$$ -22346 67966 212563 222365 254506 333105 363171 228441 202769 170413 218060 184268
11900A84268j59359l0219R36O0529M7772n8955K9797J3683O0729M7838l1432R8084
$$ 184268 24909 -5310 -4374 56155 103927 44972 74769 88452 149181 197019 165587 263671
11888B63671J0521r0323o1718M1430R7828j7326k7562o0713J4430j8276l6937
$$ 263671 274192 183869 122151 163581 261409 244083 216521 155808 170238 151962 115025
11877A15025R4947J7659j02250q4916L0882J114N9373K5834n2429j27358N744
$$ 115025 209972 227631 125381 40465 71347 72461 131834 157668 105239 -22119 -16375
11866a6375Q1367P7686J5462O2282q4612L1573k2731n4970j20404J6412L8678
$$ -16375 64992 142678 158140 220422 135810 167383 144652 89682 -30722 -14310 24368
11855B4368l975L1068N6468m315m8434O419J07693L9951m8137n3049q061n4045
$$ 24368 20393 51461 107929 103614 55180 61599 169292 209243 161106 108057 99996 45951
11843D5951m6683m9027M131L5327o08k3191J07749J33340j26942j43884K4711
$$ 45951 -732 -49759 -45628 -10301 -10909 -34100 73649 206989 80047 -63837 -39126
11832c9126O302j16125M8627O4455K8894L5654J07630m1338j21123j33235j4003
$$ -39126 -32824 -148949 -100322 -35867 -6973 28681 136311 94973 -26150 -159385 -173388
11821a73388O7904p5815m8918O8744O3152J6005L8349J54536R2842m1119O3402
$$ -173388 -105484 -181299 -230217 -161473 -98321 -82316 -43967 110569 203411 162292 225694
11810B25694J13187R9197j4119j39935j51914K7905k084j07858R7719N904o8235
$$ 225694 338881 438078 423959 284024 132110 160015 157931 50073 147792 153696 85461
11799H5461j2322l7420l4565J04432j3891r2874J02423L0853p2516k489M0859
$$ 85461 73139 35719 1154 105586 91695 -1179 101244 132097 59581 57092 97951
11788I7951J45766l5842K2872j6327k0804O3549m2998o8107m7036L7739N6235
$$ 97951 243717 207875 230747 214420 193616 257165 214167 146060 99024 136763 192998
11777A92998j6885j21647l9052N6166n331n3932j18515N8703K7381k3250J9984
$$ 192998 176113 54466 15414 71580 66249 12317 -106198 -47495 -20114 -43364 -23380
11766b3380K2830N7095L1452P3130j50168l8230Q0642P0541o8221j074n9327Q113
$$ -23380 -550 56545 87997 161127 10959 -27271 53371 123912 55691 54617 -4710 3403
11754C403K3191N6231J32637k2124q1593k6741j44332n5510J11355N0524N8411
$$ 3403 26594 82825 215462 193338 111745 85004 -59328 -114838 -3483 47041 105452
11743A05452j2157j30988K4772N7499j37933j54629n0635O2265Q0858o410n307
$$ 105452 93295 -37693 -12921 44578 -93355 -247984 -298619 -236354 -155496 -161906 -167213
11732a67213J3271O413m9498M9425J52995J0180K2908r2759j20504P5724l4415
$$ -167213 -153942 -147529 -197027 -147602 5393 15573 38481 -54278 -174782 -99058 -133473
11721a33473p1522K0825J6399L3899J13392J719m3175m160M6523J8462N617j9130
$$ -133473 -204995 -184170 -167771 -133872 -20480 -18761 -61936 -66096 -19573 -1111 4506 -14624
11709a4624J0926N4273o7286Q1483O5250o3508o549J39478M9561j17749k20705
$$ -14624 -3698 50575 -16711 64772 130022 66514 59965 199443 249004 131255 -89450
11698h9450L3871J31016J1513l3279O238P6718k7411K0966k9847p4840m3594N4057
$$ -89450 -55579 75437 86950 53671 59909 136627 109216 130182 100335 25495 -18099 35958
11686C5958m5688j4588J9914m9867K16081M864P6418P3735l4912m7760n9670q173
$$ 35958 -9730 -24318 -4404 -54271 161810 166674 243092 316827 281915 234155 174485 166312
11674A66312o3733j05247o8978o2924M6233O9182J10546M6134p5677N2795P6308
$$ 166312 102579 -2668 -71646 -134570 -88337 -19155 91391 137525 61848 114643 190951
11663A90951K5556J13984j02431j21581O1312r8260j31442k2952p5196l9851N2698
$$ 190951 216507 330491 228060 106479 167791 69531 -61911 -84863 -160059 -199910 -147212
11652a47212K6363L2734N4184O7188p6515N3258J27566o1777o8776q6126q1232
$$ -147212 -120849 -88115 -33931 33257 -43258 10000 137566 75789 7013 -79113 -160345
11641a60345O6359J24152q207j09475R6471L5573M9116J50267n2125p1336l6500
$$ -160345 -93986 30166 21959 -87516 8955 44528 93644 243911 191786 120450 83950
11630H3950o2719o786j1193o6688m090Q1840m9448l8800L9756Q939k1259o737
$$ 83950 21231 14445 3252 -63436 -67526 14314 -35134 -73934 -34178 -25239 -46498 -53235
11618e3235J3062L3730p3132o220R1480J61064o9699r8404o9785N0893m206j10328
$$ -53235 -40173 -6443 -79575 -85795 5685 166749 97050 -1354 -71139 -20246 -24452 -134780
11606a34780O0907J01921O4988j5308j18540M2810K0928J4442p9948K6902P8462
$$ -134780 -73873 28048 93036 77728 -40812 1998 22926 37368 -42580 -15678 62784
11595F2784K0584J09303J4681j33374o1288R7014k3933k1909o2088j0504l8951
$$ 62784 83368 192671 207352 73978 12690 109704 85771 63862 1774 -8730 -47681
11584d7681P1293R9500N5589J7768K2245M5273J3739q0988j18745j0141o8319
$$ -47681 23612 123112 178701 196469 218714 263987 277726 196738 77993 67852 -467
11573d67r4414J5734L9070n3527k7075R710j6598M2817O8272J05503L5993k9777
$$ -467 -94881 -79147 -40077 -93604 -120679 -110969 -127567 -84750 -16478 89025 125018 95241
11561I5241J49278M667o6552K7757P3385o5574r7087m5256j1483P6753N5676n2667
$$ 95241 244519 249186 182634 210391 283776 218202 121115 75859 64376 141129 196805 144138
11549A44138L7900j15315p5970Q0868q4711r7587k4935P3745P7287m6660r5503
$$ 144138 182038 66723 -9247 71621 -13090 -110677 -135612 -61867 15420 -31240 -126743
11538a26743l7442L0994L8034m5975q5266n5848P6831P8948P0567J25013j363
$$ -126743 -164185 -133191 -95157 -141132 -226398 -282246 -205415 -126467 -55900 69113 67750
11527F7750q5212P978J51238k3206Q007k7571J1900j8025r3689R5916n9964r7651
$$ 67750 -17462 -9484 141754 118548 126555 98984 110884 92859 -830 95086 35122 -62529
11515f2529m1871p2359M8163J14916K8950L5753j0442J7588K4895j0044J8926
$$ -62529 -104400 -176759 -128596 -13680 15270 51023 40581 58169 83064 73020 91946
11504I1946p536m0958J05242L203K6670j590Q6475j04172p9865j11043j4733N3514
$$ 91946 84410 43452 148694 151897 178567 176977 263452 159280 79415 -31628 -46361 7153
11492G153J03633K0046j25723o5222K1794L0617j2755R6470J06404J1155l8331
$$ 7153 110786 130832 5109 -60113 -38319 -7702 -20457 76013 182417 193572 155241
11481A55241j564r9760k8565J270k5036M8598N024P3362L1523q7284k7590J181
$$ 155241 153677 53917 25352 26622 1586 50184 55208 128570 160093 72809 45219 46400
11469D6400n8904k9444k3078n4881O7381k5706r209p3940K6539N6772K132o4716
$$ 46400 -12504 -41948 -65026 -119907 -52526 -78232 -87441 -161381 -134842 -78070 -75938 -140654
11457a40654J75423O2243O8726j46926j11516l2295L8318o83P6006m6722l9022
$$ -140654 34769 97012 165738 18812 -92704 -124999 -86681 -87364 -11358 -58080 -97102
11446i7102j24451n4465Q5298J02178Q7595R429l5433N1349r7729m1500J11208
$$ -97102 -221553 -276018 -190720 -88542 -947 8482 -26951 24398 -73331 -114831 -3623
11435c623J86822n6342n0049j51106p1358Q9915P8689J16134n8883n1785l3775
$$ -3623 183199 126857 76808 -74298 -145656 -55741 22948 139082 80199 28414 -5361
11424e361j619j44509O6207J20871P0327O9965j21492L6874M4709p0096j09784
$$ -5361 -6980 -151489 -85282 35589 105916 175881 54389 91263 135972 65876 -43908
11413d3908r4834j5274j8539R3013K5432n8975j2071k7878N6910p6387m8770J18232
$$ -43908 -138742 -154016 -172555 -79542 -54110 -113085 -125156 -153034 -96124 -172511 -221281 -103049
11401a03049P2514o7284M5624P7242k4240k5034k354J990l5997K688J02361l164
$$ -103049 -30535 -97819 -52195 25047 807 -24227 -26581 -24591 -60588 -57900 44461 41297
11389D1297K9707J4612K427j02221O8072O2104j80059q1219m7112K08248J18652
$$ 41297 71004 85616 88043 -14178 53894 115998 -64061 -145280 -192392 15856 134508
11378A34508N5262l5957r9023J3554j08915j65272m3817J43184M1591J08777k2130
$$ 134508 189770 153813 54790 68344 -40571 -205843 -249660 -106476 -64885 43892 21762
11367B1762j0032r7997J7426J39521p195j0518m4586O2200j3069r192J29047L821
$$ 21762 11730 -86267 -68841 70680 63485 52967 8381 70581 57512 48320 177367 181188
11355A81188n812q7112k9089p3003r8802N8801k3297Q953N4927j11264o7281J85100
$$ 181188 175376 88264 59175 -13828 -112630 -53829 -77126 -68173 -13246 -124510 -191791 -6691
11343f691J39781r1968n766L62R237m6347P9267L6588K5701j31491j98393P6402
$$ -6691 133090 41122 35356 35718 44955 -1392 77875 114463 140164 8673 -189720 -113318
11331a13318Q9096m0094l082J03222J01870J7674j36863K270k5065o9054K9177
$$ -113318 -24222 -64316 -67398 35824 137694 155368 18505 20775 -4290 -73344 -44167
11320d4167r5051n5734j3973O2315J09537j9044J4411O6474J131O3470K3506m4068
$$ -44167 -139218 -194952 -208925 -146610 -37073 -56117 -41706 24768 25899 89369 112875 68807
11308F8807L336j06249L9902m6169n736K1275J463k0675J9091j31010j25409N2481
$$ 68807 72143 -34106 5796 -40373 -46109 -24834 -23371 -44046 -24955 -155965 -281374 -228893
11296b28893J42398O4748P0417O8145o096j06261j04749j8923K8003J21878k8730
$$ -228893 -86495 -21747 48670 116815 110719 4458 -100291 -119214 -91211 30667 1937
11285A937r5356j4289O6999J43271m6447l8966l3014l041R7381P8232k6269j05953
$$ 1937 -93419 -107708 -40709 102562 56115 17149 -15865 -18906 78475 156707 130438 24485
11273B4485o6734J2629m1506O716l7769p6692j1360l1038K3181N481J96895J36766
$$ 24485 -42249 -29620 -71126 -64410 -102179 -178871 -190231 -221269 -198088 -192607 4288 141054
11261A41054Q1426K6287r0895K6943K1402j6411m9927o8413l7652K3266o9464
$$ 141054 222480 248767 157872 184815 206217 189806 139879 71466 33814 57080 -12384
11250a2384J1765M809q8354m7743L35o2967l1233J55071J479j27622Q3301R8733
$$ -12384 -619 4190 -84164 -131907 -131572 -194539 -225772 -70701 -69222 -196844 -113543 -14810
11238a4810L2318N6062j30803J5984J9586r2251j65849J04368J35359L7453J438
$$ -14810 17508 73570 -57233 -41249 -21663 -113914 -279763 -175395 -40036 -2583 -1145
11227a145k8007L7902L1857M5054J31748n4645j65511j41680N1988O1130k9353
$$ -1145 -29152 8750 40607 85661 217409 162764 -2747 -144427 -92439 -31309 -60662
11216f0662l0357K9488J04390M7439K2419l7298o6899o5405j7507k8294j6848
$$ -60662 -91019 -61531 42859 90298 112717 75419 8520 -56885 -74392 -102686 -119534
11205a19534Q7106o9795K2961L3402j9999N05n274L2163Q3172n4990m4352j53505
$$ -119534 -32428 -102223 -79262 -45860 -65859 -65354 -70628 -38465 44707 -10283 -54635 -208140
11193b08140J01030o002K5571R4946L0021m9592j53522m7833O8643J77599J53857
$$ -208140 -107110 -113112 -87541 7405 37426 -12166 -165688 -213521 -144878 32721 186578
11182A86578j3088l7219p1196j21475M9939K3544j6338N1037l5200j66301k2898
$$ 186578 173490 136271 65075 -56400 -6461 17083 745 51782 16582 -149719 -172617
11171a72617J46605j9937j1476l463L754l5633j475J9766Q6146J58512l221J4060
$$ -172617 -26012 -45949 -57425 -60888 -57134 -92767 -94242 -74476 11670 170182 166961 181021
11159A81021l1170j14525j16163q3936J8324K4011p3864P8920M7715k4772N6777
$$ 181021 149851 35326 -80837 -164773 -146449 -122438 -196302 -117382 -69667 -94439 -37662
11148c7662j6980n9748J07348N2778M3067l1674N8710j35942k56111k4177J45861
$$ -37662 -54642 -114390 -7042 45736 88803 57129 115839 -20103 -276214 -300391 -154530
11137a54530M7618m1480R0788N9951j02264Q924J29300M2891l2809j8080q8259
$$ -154530 -106912 -148392 -57604 2347 -99917 -90993 38307 81198 48389 30309 -57950
11126e7950j36943j51636O375K5612O2038L616L0961P2720M2713J7219J36225
$$ -57950 -194893 -346529 -340154 -314542 -252504 -248888 -217927 -145207 -102494 -85275 50950
11115E0950R6030o8880j48689J07160J17336r9735j47858O1590o8891j57501P572
$$ 50950 146980 78100 -70589 36571 153907 54172 -93686 -32096 -100987 -258488 -250916
11104b50916P0749J86170K24962m3976k58247p9038Q5535P8408J1327m2514m9859
$$ -250916 -180167 6003 230965 186989 -71258 -150296 -64761 13647 24974 -17540 -67399
11093f7399N124R7053K7305k25702r6647K4964O0543J11651m2227n2249n3226
$$ -67399 -62275 34778 62083 -163619 -260266 -235302 -174759 -63108 -105335 -157584 -210810
11082b10810p064J33883J9873R2317K5815p1482L9088L1924r3009j5565O1266
$$ -210810 -217874 -83991 -64118 28199 54014 -17468 21620 53544 -39465 -55030 6236
11071F236m6868P6319L7236j55505M8054O5766o8069q2656O083J10673p684r570
$$ 6236 -40632 35687 72923 -82582 -34528 31238 -36831 -119487 -113404 -2731 -10415 -19985
11059a9985M9011K8489P2338J14971j7371l9520j07116J8320K5924j17740K6138
$$ -19985 29026 57515 129853 244824 227453 187933 80817 99137 125061 7321 33459
11048C3459n3820P4845J69367N0868j45100k34578r220O8959R5483J10441l8820
$$ 33459 -20361 54484 223851 274719 129619 -104959 -114179 -45220 50263 160704 121884
11037A21884j5227l0425j50649j27510k5860J26384O5592K3460M9313j72140K9698
$$ 121884 106657 76232 -74417 -201927 -227787 -101403 -35811 -12351 36962 -135178 -105480
11026a05480Q6397J04670k4046r15j19252O3965M2628n0560j7025o2983j0991
$$ -105480 -19083 85587 61541 60626 -58626 5339 47967 -2593 -19618 -82601 -93592
11015i3592L9654P8130n9134n267L3777N5383k525M9012N6509l7186K5868M3605
$$ -93592 -53938 24192 -34942 -40209 -6432 48951 46426 95438 151947 114761 140629 184234
11003A84234j68301k5217q5279k4045K7131Q7323j394p5523k6478N5289J43551
$$ 184234 15933 -9284 -94563 -118608 -91477 -4154 -5548 -81071 -107549 -52260 91291
10992I1291J171O3375P012j14499n5609L2937K664q293J08082Q101r5352j33111
$$ 91291 92462 155837 162849 48350 -7259 25678 28342 20049 128131 136232 40880 -92231
10980i2231J3639R9418J15315j5500J6866M8817O0029J57328j15081l1068j7671
$$ -92231 -78592 20826 136141 120641 137507 186324 246353 403681 288600 257532 239861
10969B39861j22745J2145J892K1971p6625o5913L910p0967K1887m6492n4541o9311
$$ 239861 117116 129261 131153 153124 76499 10586 14496 -56471 -34584 -81076 -135617 -204928
10957b04928K5639J04811P7474J7024m5124n6023K4564J06429l5604j01957m9899
$$ -204928 -179289 -74478 2996 20020 -25104 -81127 -56563 49866 14262 -87695 -137594
10946a37594K8353j130Q2625Q5499P2831J0644k8230r6124o1237J15869j9192
$$ -137594 -109241 -110371 -27746 57753 130584 141228 112998 16874 -44363 71506 52314
10935E2314q4501m5123Q8800j14696o9816R5488L7335L724p0929m2784k401L7155
$$ 52314 -32187 -77310 11490 -103206 -173022 -77534 -40199 -36475 -107404 -150188 -152589 -115434
10923a15434K73k3389m5270j15146J45407J10296N8660N8143j0630k6845J10632
$$ -115434 -115161 -138550 -183820 -298966 -153559 -43263 15397 73540 62910 36065 146697
10912A46697l8722p4891l3184r4335K22585R6515r3952o8373m8234Q0281K5962
$$ 146697 107975 33084 -100 -94435 128150 224665 130713 62340 14106 94387 120349
10901A20349K2284M5750n0880n7465k5456l2708L4186l6431N4450P5359j05430
$$ 120349 142633 188383 137503 80038 54582 21874 56060 19629 74079 149438 44008
10890D4008j16507J24081r158n9473j4304q4572P5307j5072n7109p8052M2769
$$ 44008 -72499 51582 42424 -17049 -31353 -115925 -40618 -55690 -112799 -190851 -148082
10879a48082J82091R6235l997k3783j04864j63848q3757J84030L2821q7115N253
$$ -148082 34009 130244 126247 102464 -2400 -166248 -250005 -65975 -33154 -120269 -115016
10868a15016q5872j7080J13897J01341J17299m0390j48255K6778J76751l1606
$$ -115016 -200888 -217968 -104071 -2730 114569 74179 -74076 -47298 129453 97847
10858I7847k4521o5282j42800J16555L7748m2289L2161M7673P6790o9417L1432
$$ 97847 73326 8044 -134756 -18201 19547 -22742 9419 57092 133882 64465 95897
10847I5897l5438o631N4215p3178j25401k6942k5431n1830m6344L4865P5683P2833
$$ 95897 60459 53828 108043 34865 -90536 -117478 -142909 -194739 -241083 -206218 -130535 -57702
10835e7702j8140m2334J677N321M9653k2868J9189l9907p1887j03778Q9416J53144
$$ -57702 -75842 -118176 -116499 -111178 -61525 -84393 -65204 -105111 -176998 -280776 -191360 -38216
10823c8216p826L6614N4811P6178O4772n8603j12027l2091M1329J0295L250j5187
$$ -38216 -46042 -9428 45383 121561 186333 127730 15703 -16388 24941 35236 38486 23299
10811B3299q618l5755O8064M845n2470M470j0343k7907K9360J4630m5194P555
$$ 23299 14681 -21074 46990 51835 -635 3835 -6508 -34415 -5055 9575 -35619 -28064
10799b8064N8496n3839j3393j24960j23538k8156K9899J17521L7034j37317j05137
$$ -28064 30432 -23407 -36800 -161760 -285298 -313454 -283555 -166034 -129000 -266317 -371454
10788c71454N9005J77450K02662Q4638L2161j11335j28221q7035K5113J29842
$$ -371454 -312449 -134999 67663 152301 184462 73127 -55094 -142129 -117016 12826
10778A2826R7644j41318p6413Q5022M3462p4785m8698k4650O9784R3061K6563
$$ 12826 110470 -30848 -107261 -22239 21223 -53562 -102260 -126910 -57126 35935 62498
10767F2498l0365m6964J3900n8103l8874M5601L4319l9919l8296L9091P7539K3827
$$ 62498 32133 -14831 -931 -59034 -97908 -52307 -17988 -57907 -96203 -57112 20427 44254
10755D4254o7840J560M4633Q8557l7851L244K6106J9487k08426k665m249O4896
$$ 44254 -23586 -22026 22607 111164 73313 76557 102663 122150 -86276 -88941 -93190 -28294
10743b8294j06745q0751O7677K3205j09960q790j4197L8838J88067J43076Q6975
$$ -28294 -135039 -215790 -148113 -124908 -234868 -243658 -257855 -219017 -30950 112126 199101
10732A99101j12227J5380J22917j5136m4186p5355o5205m1220o21q8588n2980
$$ 199101 86874 102254 225171 210035 165849 90494 25289 -15931 -16552 -105140 -158120
10721a58120Q6540M7407N7811J1564j17012m4906J52957m9510L1362l6735k8864
$$ -158120 -71580 -24173 33638 45202 -71810 -116716 36241 -13269 18093 -18642 -47506
10710d7506q4261q2284k5673l4085Q3123J94691J2629n4263r451l400o3783r7690
$$ -47506 -131767 -214051 -239724 -273809 -190686 4005 16634 -37629 -47080 -50480 -114263 -211953
10698b11953K7316Q1213J6619P3469O5230k5579o4556j02781L8422k8943j01470
$$ -211953 -184637 -103424 -86805 -13336 51894 26315 -38241 -141022 -102600 -131543 -233013
10687b33013j34426Q6723J51443M43J61738M7068p1889J7644L7161L3423l8006
$$ -233013 -367439 -280716 -129273 -128830 32908 79976 8087 25731 62892 96315 58309
10676E8309p0296o6335m1032j2462L4785j2303n7653j4371L1904P5882J08369
$$ 58309 -11987 -78322 -119354 -131816 -97031 -109334 -166987 -181358 -149454 -73572 34797
10665C4797K9732o3834r0613O0994j7508N5658m6564j3640P783n9257l3330J41489
$$ 34797 64529 695 -89918 -28924 -46432 9226 -37338 -50978 -43195 -102452 -135782 5707
10653E707K5472O6872M135L0363j01898m0972Q055l0869l0015j14654K51J54579
$$ 5707 31179 98051 102186 132549 30651 -10321 -2266 -33135 -63150 -177804 -177553 -22974
10641b2974J48956j11894n3031l6268j075j6211O824J36680K9431n5684n3244
$$ -22974 125982 14088 -38943 -75211 -76286 -92497 -85673 51007 80438 24754 -28490
10630b8490N2782k231J1628M8834L8256m6373j00588k395J1446Q7283L4923N9400
$$ -28490 24292 22061 33689 82523 120779 74406 -26182 -28577 -17131 70152 105075 164475
10618A64475J7754o7582q6694j6311m2847o5464k948L6401O4210r8703l9308l418
$$ 164475 182229 114647 27953 11642 -31205 -96669 -99617 -63216 994 -97709 -137017 -140435
10606a40435M4901M2738k4416q758P535k0861Q1013Q8626n6023m3365p4523j11248
$$ -140435 -95534 -52796 -77212 -85970 -78435 -99296 -18283 70343 14320 -29045 -103568 -214816
10594b14816l599J31264J96362j2900j05979J753n591J27437J4354p844k9099
$$ -214816 -218415 -87151 109211 96311 -9668 -7915 -13506 113931 128285 120441 91342
10583I1342l5843K3642m966M8734m8792j64897l7093O5420k9791r1660N1508o8098
$$ 91342 55499 79141 74175 122909 74117 -90780 -127873 -62453 -92244 -183904 -132396 -200494
10571b00494n3435K2855J11395J61593q8239n3651R7204M3389q1494o2053l962
$$ -200494 -253929 -231074 -119679 41914 -46325 -99976 -2772 40617 -40877 -102930 -106892
10560a06892j9984L9474j17205J26455J40132m156m4323J14123L3629j94659j54517
$$ -106892 -126876 -87402 -204607 -78152 61980 57824 13501 127624 161253 -33406 -187923
10549a87923J31656J13996J39954l5483j01334Q4003N4996o0769q9925J1052k9570
$$ -187923 -56267 57729 197683 162200 60866 144869 199865 139096 49171 60223 30653
10538C0653N1534L6694m2949m2365m3918j06946o0005J03911o0536J09666J7279
$$ 30653 82187 118881 75932 33567 -10351 -117297 -177302 -73391 -133927 -24261 -6982
10527f982o6023P2647P9882j59102j28187L9680Q4440J25449K3635L7790N1097
$$ -6982 -73005 -358 79524 -79578 -207765 -168085 -83645 41804 65439 103229 154326
10516A54326k6022j40016j7239k4677o1683L3173J95617j8648j65594j50171K4313
$$ 154326 128304 -11712 -28951 -53628 -115311 -82138 113479 94831 -70763 -220934 -196621
10505a96621N7829K2146m6015N7484L2325L1418l7652j43749q808J47971K9944
$$ -196621 -138792 -116646 -162661 -105177 -72852 -41434 -79086 -222835 -231643 -83672 -53728
10494e3728J9579M2238l5898K5592k5443O5073m5232k16403k7387M1777k8472
$$ -53728 -34149 8089 -27809 -2217 -27660 37413 -7819 -224222 -251609 -209832 -238304
10483b38304Q7221J18873K4956r6628N945J03836J38754k2201n3240M4612j9323
$$ -238304 -151083 -32210 -7254 -103882 -97937 5899 144653 122452 69212 113824 94501
10472I4501l1069j00278n4744K173R3527M2852n4488Q8269K1676k5510k5245L9039
$$ 94501 63432 -36846 -91590 -89417 4110 46962 -7526 80743 102419 76909 51664 90703
10460I0703K3033j4788J0163r7819q5092J25085R4739k6686p0519j23124j12707
$$ 90703 113736 98948 109111 11292 -73800 51285 146024 119338 48819 -74305 -187012
10449a87012K678J3160Q4466N3469K40m8759l6092N2727Q7910o4297j11126J23758
$$ -187012 -184334 -171174 -86708 -33239 -32999 -81758 -117850 -65123 22787 -41510 -152636 -28878
10437b8878K36649N7150o3990q8305k14421q0613J51722Q1190J32714O9756j73147
$$ -28878 207771 264921 200931 112626 -101795 -182408 -30686 50504 183218 252974 79827
10426G9827k7449K2436P3733Q8701q5877j85601j36224R5260K9004L418K9429
$$ 79827 52378 74814 148547 237248 151371 -34230 -170454 -75194 -46190 -42772 -13343
10415a3343P9510o1662n4351o1835o4468N7560R6215q191l0694k0389o5494n4959
$$ -13343 66167 4505 -49846 -111681 -176149 -118589 -22374 -30565 -61259 -81648 -147142 -202101
10403b02101J73039k0901j01857J41180Q6147q8864P3926n5328m5309q6554l7163
$$ -202101 -29062 -49963 -151820 -10640 75507 -13357 60569 5241 -40068 -126622 -163785
10392a63785K4204p9711O1640Q725K0763J44717J15140k9961o7913K7359m6986
$$ -163785 -139581 -219292 -157652 -148927 -128164 16553 131693 101732 33819 61178 14192
10381A4192m533K4253m1689j05674o3793J795M9513J36028J12020m4766N3872
$$ 14192 9659 33912 -7777 -113451 -177244 -175449 -125936 10092 122112 77346 131218
10370A31218r378o0395p6350l0556J22006J06970m1082j12268j58294p2221J3982
$$ 131218 121840 61445 -14905 -45461 76545 183515 142433 30165 -128129 -200350 -186368
10359a86368Q2722O7436J07822R6602m9050n3215j26070J2242O2886J9514M0306
$$ -186368 -103646 -36210 71612 168214 119164 65949 -60121 -47879 15007 34521 74827
10348G4827l8925m9316k9012L5920n9563l8768M6529N3623j9726o9545k4259O1995
$$ 74827 35902 -13414 -42426 -6506 -66069 -104837 -58308 -4685 -24411 -93956 -118215 -56220
10336e6220M2398n8865j44228L1733P5193m6211k8977Q8203o4691m4104l6228
$$ -56220 -13822 -72687 -216915 -185182 -109989 -156200 -185177 -96974 -161665 -205769 -241997
10325b41997J13299J08102J7936K4132J04179n0594j16122m016J58044M5016K7965
$$ -241997 -128698 -20596 -2660 21472 125651 75057 -41065 -45081 112963 157979 185944
10314A85944M4033j12570j05000O2104N7494N0756K4630J7926p2008q1709j49727
$$ 185944 229977 117407 12407 74511 132005 182761 207391 225317 153309 71600 -78127
10303g8127n202L6835L598J53290o6423n7526m2923j1487P0008o561n9277J19035
$$ -78127 -83329 -46494 -42896 110394 43971 -13555 -56478 -67965 2043 -4518 -63795 55240
10291E5240j047n3320p8648l2312L8054N3060R6615j32683j15075k1206J12700
$$ 55240 54193 873 -77775 -110087 -72033 -18973 77642 -55041 -170116 -191322 -78622
10280g8622K6417J05599N6792k6718M8501J7412M1941r7722j63820n9484O4561
$$ -78622 -52205 53394 110186 83468 131969 149381 191322 93600 -70220 -129704 -65143
10269f5143N3978k196l9069q6303R6385L8065j1819m8681P6533L090p8771j64438
$$ -65143 -11165 -13361 -52430 -138733 -42348 -4283 -16102 -64783 11750 14840 -63931 -228369
10257b28369J5080J09438J39906P1657j6770O291j09057r4329N8367J06662J03233
$$ -228369 -213289 -103851 36055 107712 90942 97233 -11824 -106153 -47786 58876 162109
10246A62109l1705k6016p8113n808M093M4722k3636L3413K0856p7126L783n2465
$$ 162109 130404 104388 26275 20467 24560 69282 45646 79059 99915 22789 26572 -25893
10234b5893K5585L7760L2639K7887p6351q6925r2572o5604l357J34L7439J7904
$$ -25893 -308 37452 70091 97978 21627 -65298 -157870 -223474 -226831 -226697 -189258 -171354
10222a71354k0663n704J44666J16111K5024p1524L4076O2842J1392l3065k5674
$$ -171354 -192017 -197721 -53055 63056 88080 16556 50632 113474 124866 91801 66127
10211F6127K2232L1451m8978k6345L5916K4331q4311j6433P1136J40912N9628
$$ 66127 88359 119810 70832 44487 80403 104734 20423 3990 75126 216038 275666
10200B75666q2482j01965l8422j15296L1250L4787K7942m0482J27703L1877r2197
$$ 275666 193184 91219 52797 -62499 -31249 3538 31480 -9002 118701 150578 58381
10189E8381Q7123n8826q7664j2900R0866M180J247k0662P2259k2341j23615j65106
$$ 58381 145504 86678 -986 -13886 76980 81160 82407 61745 134004 111663 -11952 -177058
10177a77058M1061R9456R610l4315j16016N9690R0065r7364M0343q332M1835J05097
$$ -177058 -135997 -36541 -26931 -61246 -177262 -117572 -27507 -124871 -84528 -92860 -51025 54072
10165E4072R7731j6157L8939M8444J8336J55034o208M305R2604L1131j69045O2525
$$ 54072 151803 135646 174585 223029 241365 396399 390191 394496 487100 518231 349186 411711
10153D11711O7333n3502n018j09473j21413r8223m4238J84575J66013M3328j29425
$$ 411711 479044 425542 420524 311051 189638 91415 47177 231752 397765 441093 311668
10142C11668k18643q7571M6235j4260j55099J3095Q6300j2942l0349J26528j3669
$$ 311668 93025 5454 51689 37429 -117670 -104575 -18275 -31217 -61566 64962 51293
10131E1293K0663k4108k4862r2565J09954Q5716J3033M3831j80886j13790q3586
$$ 51293 71956 47848 22986 -69579 40375 126091 139124 182955 2069 -111721 -195307
10120a95307k878J76102J08846j3990l8736q6549L9132m492N4033j6784m7395
$$ -195307 -198185 -22083 86763 72773 34037 -52512 -13380 -17872 36161 19377 -28018
10109b8018r0703J47466J19849J06209l0876L270q8831l546m3623l1838j219p9909
$$ -28018 -118721 28745 148594 254803 223927 227197 138366 134820 91197 59359 58140 -21769
10097b1769J87316k4311r2669q5865K7669L814Q6699M5908n7196m6289n7859J08166
$$ -21769 165547 141236 48567 -37298 -9629 -5815 80884 126792 69596 23307 -34552 73614
10085G3614q1641j50658P379J31764J1905Q951p8853l6662O8412M3498p2737J6369
$$ 73614 -8027 -158685 -151306 -19542 -7637 1314 -77539 -114201 -45789 -2291 -75028 -58659
10073e8659Q0796J38174M6564Q2592r2211o9709L2811J04779Q4625R3041K32155
$$ -58659 22137 160311 206875 289467 197256 127547 160358 265137 349762 442803 674958
10062F74958N40688O21448J007120K084311L356670M30833j850800j851102j995366
$$ 674958 1215646 1837094 2844214 4928525 8285195 8716028 6865228 5014126 3018760
10053C018760j238385o14794l78844p5249j59366j58317q1780r0789P0260J6366
$$ 3018760 1780375 1165581 786737 711488 552122 393805 312025 221236 291496 307862
10043C07862j62362q8963O0435l2386n960K0664j4647p3720m4605R5665J39252
$$ 307862 145500 56537 116972 84586 78626 99290 84643 10923 -33682 61983 201235
10032B01235p3725j1764K7111L1848J17468J2718l8207p2713m9984L5435L6042
$$ 201235 127510 115746 142857 174705 292173 304891 266684 193971 143987 179422 215464
10021B15464K1772j63242M8789q176J24555K1456j68141j33994R116J25850j4795
$$ 215464 237236 73994 122783 114607 239162 260618 92477 -41517 -32401 93449 78654
10010G8654m7794R0710Q234k7400m7405r8472j36451j1864K1854L1971k8079m1201
$$ 78654 30860 121570 129804 102404 54999 -43473 -179924 -191788 -169934 -137963 -166042 -207243
9998b07243J43949J18426q4783o1855l2636P506K1236l8016L9195K2426P4880
$$ -207243 -63294 55132 -29651 -91506 -124142 -116636 -95400 -133416 -94221 -71795 3085
9987C085O7955p1908q1476j8022O5014o6074k2467K7234J20324M1925j85203L2245
$$ 3085 71040 -868 -82344 -100366 -35352 -101426 -123893 -96659 23665 65590 -119613 -87368
9975h7368J43920J39657L1595o7633m2487n4937l2341k0714r0986J09232J13911
$$ -87368 56552 196209 227804 160171 117684 62747 30406 9692 -81294 27938 141849
9964A41849O9489o9722j79635q3015L6551j1086q2155l5471M4913L1512P7280
$$ 141849 211338 141616 -38019 -121034 -84483 -95569 -177724 -213195 -168282 -136770 -59490
9953e9490j11604j00180j695J40748M8967l8173J13417Q2447j12492N033J19589
$$ -59490 -171094 -271274 -272969 -132221 -83254 -121427 -8010 74437 -38055 -33022 86567
9942H6567p2486r5039L0163M3209l2848o8579m7631o479P4754n9246o6351O1125
$$ 86567 14081 -80958 -50795 -7586 -40434 -109013 -156644 -163123 -88369 -147615 -213966 -152841
9930a52841J3816P9781J06969J2287o5766m5187m9453q3230m799R6190P9163l8293
$$ -152841 -139025 -59244 47725 60012 -5754 -50941 -100394 -183624 -188423 -92233 -13070 -51363
9918e1363q362l048M4888R431j31139J7463J40229Q8127Q0385o1553j2056L2480
$$ -51363 -59725 -62773 -17885 -8454 -139593 -122130 18099 106226 186611 125058 113002 145482
9906A45482o7873j0310J04637J34630K4224R9940q8459j74330r5908j43794L8230
$$ 145482 77609 67299 171936 306566 330790 430730 342271 167941 72033 -71761 -33531
9895c3531K5728p9536P2442J33054O5782L6058r0402r2847j50590q6032M6871
$$ -33531 -7803 -87339 -14897 118157 183939 219997 129595 36748 -113842 -199874 -153003
9884a53003Q2567j6339p6825l9131O4608J00941P4329l1440j10990l5464J8889
$$ -153003 -70436 -86775 -163600 -202731 -138123 -37182 37147 5707 -105283 -140747 -121858
9873a21858q586o463Q07J04016L8530N0144K2135J05830q5554n8702L2112N9792
$$ -121858 -130444 -136907 -136100 -32084 6446 56590 78725 184555 99001 40299 72411 132203
9861A32203q3578j51152m6207J49365J09063j3495L1945Q4508J751k0244J1738
$$ 132203 48625 -102527 -148734 631 109694 96199 128144 212652 214403 194159 205897
9850B05897m4882k1873n9573j34393j5868j47990K5330J01787J41994N6756r0655
$$ 205897 161015 139142 79569 -54824 -70692 -218682 -193352 -91565 50429 107185 16530
9839A6530l012N2656Q9385o6942j49759K3008R3252L0061q5801j48663q8032K9932
$$ 16530 13518 66174 155559 88617 -61142 -38134 55118 85179 -622 -149285 -237317 -207385
9827b07385O7607K2833n0905R087J1333P6568J61816J910l9167q5453n2270J5416
$$ -207385 -139778 -116945 -167850 -158763 -147430 -70862 90954 92864 53697 -31756 -84026 -68610
9815f8610P8898m9456j11222L1327L721r968k0759o1045K293J74705K6972o5394
$$ -68610 10288 -39168 -150390 -119063 -115342 -125310 -146069 -207114 -204821 -30116 -3144 -68538
9803f8538K5008J0579k7434L3147N8889O4523J09538k2175j9982M1933m246p7716
$$ -68538 -43530 -32951 -60385 -27238 31651 96174 205712 183537 163555 205488 201242 123526
9791A23526j67744Q991o491p2849M8257k9319m0142O8712O7987J12028L9240K483
$$ 123526 -44218 -35227 -41718 -114567 -66310 -95629 -135771 -67059 928 112956 152196 154679
9779A54679j46069o146J1106n458j10449n6134K1606J26760J534K5258N7484L4416
$$ 154679 8610 2464 13570 8112 -102337 -158471 -136865 -10105 -8571 16687 74171 108587
9767A08587l4221p8453p2049J4512R5707J25819p6761j18888o2782l2579J5572
$$ 108587 74366 -4087 -76136 -61624 34083 159902 83141 -35747 -98529 -131108 -115536
9756a15536J08977N0521O3482k7925q1210O2146P1790J7205q7011o4171K2445
$$ -115536 -6559 43962 107444 79519 -1691 60455 132245 149450 62439 -1732 20713
9745B0713M8160O6610o1853N7166R4923K6978n4047k57823q5184N6640r949L2628
$$ 20713 68873 135483 73630 130796 225719 252697 198650 -59173 -144357 -87717 -97666 -65038
9733f5038j677M7937N8133j8453l199P0929O0402q6581l7773o0412j23891o9442
$$ -65038 -66715 -18778 39355 20902 17703 88632 149034 62453 24680 -35732 -159623 -229065
9721b29065J73375J04164p7757j9275M8525P5201j10866l0337m9815j3963P6544
$$ -229065 -55690 48474 -29283 -48558 -33 75168 -35698 -66035 -115850 -129813 -53269
9710e3269J7611m0394L8707Q5532k1487m0767o2581q1754J33557J08898o8430
$$ -53269 -35658 -76052 -37345 48187 26700 -14067 -76648 -158402 -24845 84053 15623
9699A5623L1578M2630l3982p9126Q062K9288p1396j02874j5470R6689P5893q0803
$$ 15623 47201 89831 55849 -23277 -15215 14073 -57323 -160197 -175667 -78978 -3085 -83888
9687h3888m0097L0545k2629P0133l653P0733N9395O5681j46144l2704n7992P6399
$$ -83888 -123985 -93440 -116069 -45936 -49589 21144 80539 146220 76 -32628 -90620 -14221
9675a4221Q5171n4856j9020M525j36300l230J76994L5413k2128J5930k603q3865
$$ -14221 70950 16094 -2926 1599 -134701 -137931 39063 74476 52348 68278 65675 -18190
9663a8190r449R5555k7232k6233J28729J10722j5428o239J1176j56884j09291
$$ -18190 -27639 67916 40684 14451 143180 253902 238474 232235 243411 86527 -22764
9652b2764p9680k1639R2370J12932J42631j343j22437l6249J5831j0983j6529
$$ -22764 -102444 -124083 -31713 81219 223850 222507 100070 63821 79652 68669 52140
9641E2140p659p999N2265n1993j00883q2375L3807J10465O703N7744M6239K3055
$$ 52140 44481 36482 88747 36754 -64129 -146504 -112697 -2232 4471 62215 108454 131509
9629A31509j24642k16308N9304J50857J87030J4668n9953Q0166j23367j12941
$$ 131509 6867 -209441 -150137 720 187750 202418 142465 222631 99264 -13677
9619a3677l1179j24440Q4183M6230J25202j5119M2821o8700L6442M9364L9414
$$ -13677 -44856 -169296 -85113 -38883 86319 71200 114021 45321 81763 131127 170541
9608A70541m2163o5365m5794j3426J3943p7479m6328l4851K6644J11565L4485
$$ 170541 128378 63013 17219 3793 17736 -59743 -106071 -140922 -114278 -2713 31772
9597C1772o5778L1724O9943p619O6094J07890m0735r2319m5367r0771q8423K0996
$$ 31772 -34006 -2282 67661 60042 126136 234026 193291 100972 55605 -35166 -123589 -102593
9585a02593r608j39763J13789O1566M2949r021o5812L2356Q4681M7232j04994
$$ -102593 -112201 -251964 -138175 -76609 -33660 -42681 -108493 -76137 8544 55776 -49218
9574d9218J2644j4949l1193R2088m6397k6647J01678j9774j048m5784j18210J34020
$$ -49218 -36574 -51523 -82716 9372 -37025 -63672 38006 18232 17184 -28600 -146810 -12790
9562a2790K3931o4634n692n7765p478R3204m677j52343K3488Q9501m5479K2013
$$ -12790 11141 -53493 -59185 -116950 -124428 -31224 -35901 -188244 -164756 -75255 -120734 -98721
9550i8721N7874k8395O8745l9384k3721l2230K0744N5636J8530J05362j0134j1220
$$ -98721 -40847 -69242 -497 -39881 -63602 -95832 -75088 -19452 -922 104440 94306 83086
9538H3086j09148O4208m496n6864N4382Q6136o7029p4155j53300r1733J39044
$$ 83086 -26062 38146 33650 -23214 31168 117304 50275 -23880 -177180 -268913 -129869
9527a29869J29672J20080L7142l6760p8132K5894K2527j6562k2874l4917j76083
$$ -129869 -197 119883 157025 120265 42133 68027 90554 73992 51118 16201 -159882
9516a59882m2237N8175R4607M4197m9380L2380L0230l5747J8979J00951k656J3894
$$ -159882 -202119 -143944 -49337 -5140 -54520 -22140 8090 -27657 -8678 92273 89617 103511
9504A03511J12471J7248m1967k5767m5647j39903j5416J0321O0347J26455J661
$$ 103511 215982 233230 191263 165496 119849 -20054 -35470 -25149 35198 161653 163314
9493A63314j02544l288N4643O998J150N254N3946k8847o2141j0808p2525K7342
$$ 163314 60770 57482 112125 119123 120273 125527 179473 150626 88485 77677 5152 32494
9481C2494P4683K6581L8696J14186j00215q1456q5514M108j9637p0410l3605q3644
$$ 32494 107177 133758 172454 286640 186425 104969 19455 23563 3926 -66484 -100089 -183733
9469a83733k9169J37804J14164O5303M5307r9729j25533k1466K3707J28479K911
$$ -183733 -212902 -75098 39066 104369 149676 49947 -75586 -97052 -73345 55134 58045
9458E8045k7803L7741J9679j13555j25105R3711J45289j1382N1824j5j305j377
$$ 58045 30242 67983 87662 -25893 -150998 -57287 88002 76620 128444 128429 127124 125747
9446A25747k416M1024j53051J0395R920m8584N6818R2296r745M3769L5012K7593
$$ 125747 123331 164355 11304 21699 31619 -16965 39853 132149 122404 166173 201185 228778
9434B28778n4486m5202L3841j7234j4129Q9750n9479k6090L6446q2803m5874R442
$$ 228778 174292 129090 162931 145697 131568 221318 161839 135749 172195 89392 43518 52960
9422E2960q606o0428M711R4365m1835k0054q2832R522R4572J5174l683M2765j8781
$$ 52960 44354 -16074 -11363 83002 41167 21113 -61719 -52197 42375 57549 53866 96631 77850
9409G7850o705n3518q632M3801j7373Q531r3838m3575M0394J3581m7352K5838
$$ 77850 71145 17627 8995 52796 35423 43954 -49884 -93459 -53065 -39484 -86836 -60998
9397f0998J44683P1393l114j10017j21468J11367R8330l6516m3706J64554J38228
$$ -60998 83685 155078 151964 41947 -79521 31846 130176 93660 49954 214508 352736
9386C52736R195r0277j40484j62386K9868m4384j4828O6371p06q1604m7140R4074
$$ 352736 361931 271654 131170 -31216 -1348 -45732 -60560 5811 5105 -76499 -123639 -29565
9374b9565l6629p4027n0304J07917J04318m3131o5817j03611q636O2446P5080
$$ -29565 -66194 -140221 -190525 -82608 21710 -21421 -87238 -190849 -199485 -137039 -61959
9363f1959P3306q562R451p4649K3103Q552o1833o7148N5247J11746j9670J43280
$$ -61959 11347 2785 12236 -62413 -39310 -30758 -92591 -159739 -104492 7254 -12416 130864
9351A30864J14546j30787j24994l3349j6599J4589n9706R6837m0709L8R4454K8774
$$ 130864 245410 114623 -10371 -43720 -60319 -45730 -105436 -8599 -49308 -49270 45184 73958
9339G3958L4665J5593L5973J48636l9038k2692O3548J9864r1229M5468O8973M8389
$$ 73958 108623 124216 160189 308825 269787 247095 310643 330507 239278 284746 353719 402108
9327D02108j12792n9952J03663Q6930o8205n0928m8118n5349o8372p6104K9497
$$ 402108 289316 229364 333027 419957 351752 300824 252706 197357 128985 52881 82378
9316H2378p9455K4091j9117K2544N7742j23653p3442Q2211J06999j2958j01606
$$ 82378 2923 27014 7897 30441 88183 -35470 -108912 -26701 80298 67340 -34266
9305c4266r4685Q476m8J15333N3145n7519M1333J04068j5664l1425J9726N8667
$$ -34266 -128951 -120475 -120523 -5190 47955 -9564 31769 135837 120173 88748 108474 167141
9293A67141L9493k6370r1757L6463k7187n1191R6393K1705m1343N143q7491j2504
$$ 167141 206634 180264 88507 124970 97783 46592 142985 164690 123347 128490 40999 28495
9281B8495K1019l8846r356k9779j0222m8977P7818Q2370j17092j01302J36689
$$ 28495 49514 10668 1312 -28467 -38689 -87666 -9848 72522 -44570 -145872 -9183
9270i183P6731n1254L8981N4834o330L4592K2687N6388o6423K064M8270L2439
$$ -9183 67548 16294 55275 110109 103779 138371 161058 217446 151023 153087 201357 233796
9258B33796j35661j00715J1732J8505J1656j4713j1400J25392P0620L8234N5715
$$ 233796 98135 -2580 9152 27657 39313 24600 13200 138592 209212 247446 303161
9247C03161J0431l3989j04939j18915K9813P9256j5039K69M4463P577l4661k1208
$$ 303161 313592 279603 174664 55749 85562 164818 149779 150048 194511 202088 167427 146219
9235A46219p5272P8892N853m7757j1715o4165J2049k733J10666p7723o5342P2909
$$ 146219 70947 149839 155692 107935 96220 32055 44104 41371 152037 74314 8972 81881
9223H1881L4617J04482K2702l6925L8024J37756q8586j18799N4829J6391j9152
$$ 81881 116498 220980 243682 206757 244781 382537 293951 175152 229981 246372 227220
9212B27220Q4199m8433j27485N4926J23443P8249L135j8654j6619l5283K2419
$$ 227220 311419 262986 135501 190427 313870 392119 395254 376600 359981 324698 347117
9201C47117J05264M8758l4123l6084k3033o1640J5917p1956n4932L1093K409J18046
$$ 347117 452381 501139 467016 430932 407899 346259 362176 290220 235288 266381 268790 386836
9189C86836N5565q052q0128r9449p1846q4564n9217N2846M5223K4224Q0208O9123
$$ 386836 442401 434349 354221 254772 182926 98362 39145 91991 137214 161438 241646 310769
9177C10769J5096L3388l7527n6990n2957p9422k2849P2895J5086M3929J0836q7729
$$ 310769 325865 359253 321726 264736 211779 132357 109508 182403 197489 241418 252254 164525
9165A64525N7598J34374l9543m5277l7978J2103Q6971r406j3133L2583K6705L9297
$$ 164525 222123 356497 316954 271677 233699 245802 332773 323367 310234 342817 369522 408819
9153D08819k3286r2848p0052m5397j3326L9940O815P1772R5886J29405J30569
$$ 408819 385533 292685 222633 177236 163910 203850 210665 282437 378323 507728 638297
9142F38297N5663k8582l3962n4407j51390l2018L2911o2345n5472J26221P0079
$$ 638297 693960 665378 631416 577009 425619 393601 426512 364167 308695 434916 504995
9131E04995L3559N9956l1101l8287n290O7633N9102J0992J6948p0202l4195P8740
$$ 504995 538554 598510 567409 529122 523832 591465 650567 661559 678507 608305 574110 652850
9119F52850P2629m2682P8026Q5324N9605J08499K0498o0623l6772k0344M5762
$$ 652850 725479 682797 760823 846147 905752 1014251 1034749 974126 937354 917010 962772
9108I62772K06952J06651k2152O8952Q7611P1292R8953J58363N4332K30049J40834
$$ 962772 1169724 1276375 1254223 1323175 1410786 1482078 1581031 1739394 1793726 2023775 2164609
9097B164609P4805J69298K91211L15041K45106L78547M37011M62276M72155N50175
$$ 2164609 2239414 2408712 2699923 3014964 3260070 3638617 4075628 4537904 5010059 5560234
9087E560234P66881R10923J223103J467664J747577K288746K855628L492167M553116
$$ 5560234 6327115 7238038 8461141 9928805 11676382 13965128 16820756 20312923 24866039
9078B4866039N661457O737685P433866P516102N890472K612427j257043m575438
$$ 24866039 30527496 37265181 44699047 52215149 58105621 60718048 59461005 54885567
9070E4885567o411661p032486o442521n621912m649784l871700l114300k528851
$$ 54885567 48473906 41441420 34998899 29376987 24727203 20855503 17741203 15212352
9062A5212352j968302j658542j494287j186873r04468q45070p94585m68292m28746
$$ 15212352 13244050 11585508 10091221 8904348 7999880 7154810 6360225 5891933 5463187
9053E463187m01172k98865k76363l43181m30465m18884j37984j34380k13339j79291
$$ 5463187 5062015 4763150 4486787 4143606 3713141 3294257 3156273 3021893 2808554 2629263
9043B629263j91739n0353K6285j83261j96100L7587j04875k20869m6507K2872
$$ 2629263 2437524 2387171 2413456 2230195 2034095 2071682 1966807 1745938 1699431 1722303
9033A722303o8043q0652k01493J6139R937r1670k1861p3077p9514J78267J42129
$$ 1722303 1654260 1573608 1372115 1388254 1398191 1306521 1284660 1211583 1132069 1310336 1452465
$$ [...]
##END NTUPLES=NMR SPECTRUM
##END=
