##TITLE=Analysis number 330031
Compound Code cc 64104
Book Reference 508/144
Project Code adrs
Chemist Name antons
##JCAMPDX= 6.0         $$ Bruker NMR JCAMP-DX V2.0
##DATA TYPE= NMR SPECTRUM
##DATA CLASS= NTUPLES
##ORIGIN= Bruker BioSpin GmbH
##OWNER= nmr
$$ XWIN-NMR		Version 3.5
$$ Mon Oct 22 12:32:16 2007 GMT Daylight Time (UT+1h)  MAYBRIDGE\nmr@NMR_250MHZ
##.OBSERVE FREQUENCY= 250.131544655141
##.OBSERVE NUCLEUS= ^1H
##.ACQUISITION MODE= SIMULTANEOUS (DQD)
##.ACQUISITION SCHEME= undefined
##.AVERAGES= 16
##.DIGITISER RES= 18
##SPECTROMETER/DATA SYSTEM= dpx250
##.PULSE SEQUENCE= zg30
##.SOLVENT NAME= CDCl3
##.SHIFT REFERENCE= (INTERNAL, CDCl3, 0, 16.522)
##AUDIT TRAIL= $$ (NUMBER, WHEN, WHO, WHERE, WHAT)
$$ ##TITLE= Audit trail, XWIN-NMR		Version 3.5
$$ ##JCAMPDX= 5.01
$$ ##ORIGIN= Bruker BioSpin GmbH
$$ ##OWNER= nmr
$$ C:\u/data/dgb/nmr/ADRS/1020/pdata/1/auditp.txt
$$ ##AUDIT TRAIL=  $$ (NUMBER, WHEN, WHO, WHERE, WHAT)
(   1,<2007-10-22 12:31:52.82 +100>,<MAYBRIDGE\nmr>,<NMR_250MHZ>,
      <created by zg, POWCHK disabled, PULCHK disabled
       configuration hash MD5:
       76 6E 9A 78 1E 09 19 81 EC 84 63 8F B0 6A 59 2D
       data hash MD5: 64K
       8C 1D B6 D1 2A D7 F2 9D 6E 11 25 A1 36 39 86 06>)
(   2,<2007-10-22 12:32:06.60 +100>,<MAYBRIDGE\nmr>,<NMR_250MHZ>,
      <Start of raw data processing
       ef LB = 0.3 FT_mod = 6 PKNL = 1 SI = 32K 
       data hash MD5: 32K
       82 8B 68 B7 9B 1F 44 AE 8D 86 A0 7E BB 71 9E 5E>)
(   3,<2007-10-22 12:32:08.23 +100>,<MAYBRIDGE\nmr>,<NMR_250MHZ>,
      <apk 
       data hash MD5: 32K
       D8 33 FD D0 51 F3 49 51 F7 4A 65 27 6C F4 83 3D>)
(   4,<2007-10-22 12:32:09.01 +100>,<MAYBRIDGE\nmr>,<NMR_250MHZ>,
      <abs ABSG = 5 
       data hash MD5: 32K
       D4 AA D3 BC C4 F7 3C 5C C0 89 A9 EC DF D1 EF 46>)
$$ ##END=
$$ 
$$ hash MD5
$$ 6B 03 86 0B F3 73 1C 1E F1 83 41 86 53 C3 C5 1C
##$RELAX= 
##$RELAX= 
##$RELAX= 
##$RELAX= 
##$RELAX= 
##$RELAX= 
##$RELAX= 
$$ Bruker specific parameters
$$ --------------------------
##$DU= <C:\u>
##$EXPNO= 1020
##$NAME= <ADRS>
##$PROCNO= 1
##$TYPE= <nmr>
##$USER= <dgb>
##$AMP= (0..31)
100 100 100 100 100 100 100 100 100 100 100 100 100 100 100 100 100 100 
100 100 100 100 100 100 100 100 100 100 100 100 100 100 
##$AQSEQ= 0
##$AQ_mod= 3
##$AUNM= <au_zg>
##$AUTOPOS= <24 >
##$BF1= 250.13
##$BF2= 250.13
##$BF3= 250.13
##$BF4= 250.13
##$BF5= 500.13
##$BF6= 500.13
##$BF7= 500.13
##$BF8= 500.13
##$BYTORDA= 1
##$CFDGTYP= 0
##$CFRGTYP= 5
##$CHEMSTR= <none>
##$CNST= (0..31)
1 1 145 1 1 1 1 1 1 1 1 1 1 1 1 1 1 1 1 1 1 1 1 1 1 1 1 1 1 1 1 1 
##$CPDPRG= <>
##$CPDPRG1= <>
##$CPDPRG2= <>
##$CPDPRG3= <>
##$CPDPRG4= <mlev>
##$CPDPRG5= <mlev>
##$CPDPRG6= <mlev>
##$CPDPRG7= <mlev>
##$CPDPRG8= <mlev>
##$CPDPRGB= <>
##$CPDPRGT= <>
##$D= (0..31)
0 1 0 0 0 0 0 0 0 0.06 0 0 0 0 0 0 0.0002 0 0 0 0 0 0 0 0 0 0 0 0 0 0 
0 
##$DATE= 1193052711
##$DBL= (0..7)
120 120 120 120 120 120 120 120 
##$DBP= (0..7)
150 150 150 150 150 150 150 150 
##$DBP07= 0
##$DBPNAM0= <>
##$DBPNAM1= <>
$$ [...]
##$SUBNAM7= <"">
##$SUBNAM8= <"">
##$SUBNAM9= <"">
##$SW= 20.6930455092707
##$SWIBOX= (0..15)
0 0 3 0 0 0 0 0 0 0 0 0 0 0 0 0 
##$SW_h= 5175.983436853
##$TD= 65536
##$TD0= 1
##$TE= 296.16
##$TE2= 300
##$TE3= 300
##$TEG= 300
##$TL= (0..7)
0 120 120 120 120 120 120 120 
##$TP= (0..7)
150 150 150 150 150 150 150 150 
##$TP07= 0
##$TPNAME0= <>
##$TPNAME1= <>
##$TPNAME2= <>
##$TPNAME3= <>
##$TPNAME4= <>
##$TPNAME5= <>
##$TPNAME6= <>
##$TPNAME7= <>
##$TPOAL= (0..7)
0.5 0.5 0.5 0.5 0.5 0.5 0.5 0.5 
##$TPOFFS= (0..7)
0 0 0 0 0 0 0 0 
##$TUNHIN= 0
##$TUNHOUT= 0
##$TUNXOUT= 0
##$USERA1= <user>
##$USERA2= <user>
##$USERA3= <user>
##$USERA4= <user>
##$USERA5= <user>
##$V9= 5
##$VALIST= <valist>
##$VCLIST= <CCCCCCCCCCCCCCC>
##$VD= 0
##$VDLIST= <DDDDDDDDDDDDDDD>
##$VPLIST= <PPPPPPPPPPPPPPP>
##$VTLIST= <TTTTTTTTTTTTTTT>
##$WBST= 1024
##$WBSW= 4
##$XGAIN= (0..3)
0 0 0 0 
##$XL= 0
##$YL= 0
##$YMAX_a= 562633
##$YMIN_a= -539500
##$ZGOPTNS= <>
##$ZL1= 120
##$ZL2= 120
##$ZL3= 120
##$ZL4= 120
##$ABSF1= 16.522
##$ABSF2= -4.171173
##$ABSG= 5
##$ABSL= 3
##$ALPHA= 0
##$AQORDER= 0
##$ASSFAC= 0
##$ASSFACI= 0
##$ASSFACX= 0
##$ASSWID= 0
##$AUNMP= <proc_1d>
##$AZFE= 0.1
##$AZFW= 0.1
##$BCFW= 0
##$BC_mod= 0
##$BYTORDP= 0
##$COROFFS= 0
##$CY= 12.5
##$DATMOD= 1
##$DC= 0
##$DFILT= <>
##$DTYPP= 0
##$F1P= 14.0000005364418
##$F2P= -0.99999901652339
##$FCOR= 0.5
##$FTSIZE= 32768
##$FT_mod= 6
##$GAMMA= 0
##$GB= 0
##$INTBC= 1
##$INTSCL= 1
##$ISEN= 128
##$LB= 0.3
##$LEV0= 0
##$LPBIN= 0
##$MAXI= 10000
##$MC2= 0
##$MEAN= 0
##$ME_mod= 0
##$MI= 0
##$NCOEF= 0
##$NC_proc= -4
##$NLEV= 6
##$NOISF1= 0
##$NOISF2= 0
##$NSP= 0
##$NTH_PI= 0
##$NZP= 0
##$OFFSET= 16.522
##$PC= 1
##$PHC0= 156.4987
##$PHC1= 9.723127
##$PH_mod= 1
##$PKNL= yes
##$PPARMOD= 0
##$PSCAL= 4
##$PSIGN= 0
##$REVERSE= no
##$SF= 250.13
##$SI= 32768
##$SIGF1= 0
##$SIGF2= 0
##$SINO= 400
##$SIOLD= 32768
##$SREGLST= <1H.CDCl3>
##$SSB= 0
##$STSI= 32768
##$STSR= 0
##$SW_p= 5175.98343685301
##$SYMM= 0
##$S_DEV= 0
##$TDeff= 65536
##$TDoff= 0
##$TI= <Analysis number 999999
Compound Code 99
Book Reference 9
Project Code 9>
##$TILT= no
##$TM1= 0
##$TM2= 0
##$TOPLEV= 0
##$USERP1= <user>
##$USERP2= <user>
##$USERP3= <user>
##$USERP4= <user>
##$USERP5= <user>
##$WDW= 1
##$XDIM= 32768
##$YMAX_p= 512210305
##$YMIN_p= -176510
$$ End of Bruker specific parameters
$$ ---------------------------------
##NTUPLES= NMR SPECTRUM
##VAR_NAME=  FREQUENCY,     SPECTRUM/REAL,   SPECTRUM/IMAG
##SYMBOL=    X,             R,               I
##VAR_TYPE=  INDEPENDENT,   DEPENDENT,       DEPENDENT
##VAR_FORM=  AFFN,          ASDF,            ASDF
##VAR_DIM=   32768,         32768,           32768
##UNITS=     HZ,            ARBITRARY UNITS, ARBITRARY UNITS
##FACTOR=    0.157963299565203, 1,           1
##FIRST=     4132.6476996994, 0,             0
##LAST=      -1043.33573715361, 0,           0
##MIN=       -1043.33573715361, -176510,     0
##MAX=       4132.6476996994, 512210305,     0
$$ Real data points
##PAGE= N=1
##DATA TABLE= (X++(R..R)), XYDATA
$$ [...]
$$ plain form
14931 -92824 -68404 -23461 -71591 -96420 -84512 -109125 -116591 -53259 -20341 -18388 -17358 -24170
14919 -24170 -26328 -35471 -7381 -7577 3061 40601 46268 67639 53994 21483 27372 22842 26443
14906 26443 14955 -28683 -81616 -56467 -23574 764 27251 21148 -3574 -35601 -43405 -12934
14894 -12934 -12549 -11897 -4600 -3775 -13334 -25129 -25650 778 35047 -2519 -40886 -58788 -65294 -11947
14880 -11947 -3523 -12699 12116 31364 55091 63857 29111 124 6711 27571 77719 137487
14868 137487 133035 78673 50338 34350 61496 38842 77562 154022 204716 217104 202951 151728
14856 151728 171767 186225 201679 175913 171833 162409 158637 187649 219779 202718 215450 225345
14844 225345 222762 162682 196678 233840 259653 280616 296095 253762 268594 284255 287592 286694
$$ packed form
14931i2824K4420M4943m8130k4829J1908k4613p466O3332L2918J953J030o812
14919b4170k158r143K8090j96J0638L7540N667K1371j3645l2511N889m530L601
14906B6443j1488m3638n2933K5149L2893K4338K6487o103k4722l2027p804L0471
14894a2934L85O52P297Q25r559j1795n21K6428L4269l7566l8367j7902o506N3347
14880a1947Q424r176K4815J9248K3727Q766l4746k8987O587K0860N0148N9768
14868A37487m452n4362k8335j5988K7146k2654L8720P6460N0694J2388j4153n1223
14856A51728K0039J4458J5454k5766m080r424l772K9012L2130j7061J2732R895
14844B25345k583o0080L3996L7162K5813K0963J5479m2333J4832J5661L337q98
$$ plain form
14832 286694 268226 301383 267097 165484 134895 154447 181331 185057 221919 198825 166731
14821 166731 120070 90372 80752 63295 38462 37656 28746 78642 64366 48504 97825 64611
14809 64611 24653 82526 98404 2596 -36394 -63109 -59854 -72027 -41924 -19867 -2626 -31914
14797 -31914 -60335 -68530 -40421 -19515 -38728 13560 40088 60572 26855 3422 694 17005
14785 17005 23424 -8547 5442 18905 22956 -14170 -46217 -93785 -110203 -41119 7388 -1901
14773 -1901 -22463 -39691 -13973 -18698 -153 17644 -14616 -7007 6947 21782 14965 -61945
14761 -61945 -73150 -59698 -71840 -40916 -19013 -44025 -70626 -69298 -71946 -67826 -26111 -30986
14749 -30986 -36268 -84590 -52088 -39053 -87434 -108142 -103654 -100361 -618 23428 -58576 -67404
$$ packed form
14832B86694j8468L3157l4286j01613l0589J9552K6884L726L6862k3094l2094
14821A66731m6661k9698r620j7457k4833q06q910M9896j4276j5862M9321l3214
14809F4611l9958N7873J5878r5808l8990k6715L255j2173L0103K2057J7241k9288
14797c1914k8421q195K8109K0906j9213N2288K6528K0484l3717k3433k728J6311
14785A7005O419l1971J3989J3463M051l7126l2047m7568j6418O9084M8507r289
14773a901k0562j7228K5718m725J8545J7797l2260P609J3954J4835o817p6910
14761f1945j1205J3452j2142L0924K1903k5012k6601J328k648M120M1715m875
14749c0986n282m8322L2502J3035m8381k0708M488L293R9743K4046q2004q828
$$ plain form
14737 -67404 -82554 -126233 -111160 -89057 -94364 -127344 -42118 -8186 -9715 -61120 -137769 -79630
14725 -79630 -5238 -21047 -55402 -68023 -60563 -29457 -22555 -15119 -32032 -6888 -21598 -81470
14713 -81470 -84034 -53010 14601 -31073 -50349 -45250 -58931 -114910 -128415 -155332 -103278 -57481
14701 -57481 -57136 -30014 30601 20897 13870 39103 19434 -17574 9353 35020 18952 -29525
14689 -29525 -11216 4732 -19821 -74639 -45688 -1860 4567 -19615 -45312 -40663 43944 67639
14677 67639 41149 22607 12591 14320 80755 121843 101830 49403 -1529 27429 7040 -10332
14665 -10332 -32781 -10696 39330 26392 -35585 -18757 29660 60812 33180 6659 -14697 -40275
14653 -40275 -67442 -51346 -41873 -32696 -29667 -31893 -59399 -71797 -70514 -55842 -60773 -53185 -33934
$$ packed form
14737f7404j5150m3679J5073K2103n307l2980Q5226L3932j529n1405p6649N8139
14725g9630P4392j5809l4355j2621P460L1106O902P436j6913K5144j4710n9872
14713h1470k564L1024O7611m5674j9276N099j3681n5979j3505k6917N2054M5797
14701e7481L45K7122O0615r704p027K5233j9669l7008K6927K5667j6068m8477
14689b9525J8309J5948k4553n4818K8951M3828O427k4182k5697M649Q4607K3695
14677F7639k6490j8542j0016J729O6435M1088k0013n2427n0932K8958k0389j7372
14665a0332k2449K2085N0026j2938o1977J6828M8417L1152k7632k6521k1356k5578
14653d0275k7167J6096R473R177L029k226k7506j2398J283J4672m931P588J9251
$$ plain form
14640 -33934 -29713 -40053 -41020 -38310 -50281 -31487 -13699 -6866 -23825 11678 6573 -5020 -31581
14627 -31581 -8397 -56703 -90987 -64253 -47303 -52719 -17246 12017 2498 1955 -21317 -27711 7167
14614 7167 -6812 -16303 -14060 2193 9028 -10048 -16027 -14108 -37161 -24536 17858 31476 3062
14601 3062 30174 47820 58444 10967 -40863 -49487 -40842 -2429 2249 -32206 -63785 -93209
14589 -93209 -61613 -54955 -33754 -36784 -17813 -10297 -27779 -46723 14272 12575 -18041 20672
14577 20672 20797 40832 11168 -21527 -34393 -32288 -35527 2227 40639 12889 -30191 -52838
14565 -52838 -68903 -59081 -58465 -75481 -77143 -99355 -85135 -9374 -12469 -22957 5413 4064 9206
14552 9206 24161 -37313 -74462 -107868 -72069 -21584 25866 27481 -11186 -56035 -44973 -62519
$$ packed form
14640c3934M221j0340r67K710j1971J8794J7788O833j6959L5503n105j1593k6561
14627c1581K3184m8306l4284K6734J6950n416L5473K9263r519n43k3272o394L4878
14614G167j3979r491K243J6253O835j9076n979J919k3053J2625M2394J3618k8414
14601C062K7112J7646J0624m7477n1830q624Q645L8413M678l4455l1579k9424
14589i3209L1596O658K1201l030J8971P516j7482j8944O0995j697l0616L8713
14577B0672J25K0035k9664l2695j2866K105l239L7754L8412k7750m3080k2647
14565e2838j6065R822O16j7016j662k2212J4220P5761l095j0488K8370j349N142
14552I206J4955o1474l7149l3406L5799N0485M7450J615l8667m4849J1062j7546
$$ plain form
14540 -62519 -78406 -53649 -21961 -4953 2943 -35707 -51303 -69331 -82122 -45596 7282 36328
14528 36328 21087 6697 13935 45313 45716 46349 52641 15149 -45262 -43668 -19150 -46228 -27198
14515 -27198 -9930 -19295 -64155 -63777 -51127 25024 66343 84948 57562 18580 -19894 -39689
14503 -39689 -3699 13125 17422 -13736 -4708 -3034 26258 51755 3941 26817 38182 -1813
14491 -1813 -19038 -60539 -70666 -42837 -30671 -22047 -5318 -25054 -54224 -39960 -52989 -70632
14479 -70632 -55606 -39785 -28673 11648 19412 578 -17823 10216 -5712 -29276 22136 29703
14467 29703 7204 -5175 1887 39366 42785 28336 -3464 -8023 -5070 -6772 12068 43322 37539
14454 37539 23750 -1053 -22446 52981 107468 157894 189570 204126 183443 192989 262791 292451
$$ packed form
14540f2519j5887K4757L1688J7008P896l8650j5596j8028j2791L6526N2878K9046
14528C6328j5241j4390P238L1378M03O33O292l7492o0411J594K4518k7078J9030
14515b7198J7268r365m4860L78J2650P6151M1319J8605k7386l8982l8474j9795
14503c9689L5990J6824M297l1158R028J674K9292K5497m7814K2876J1365l9995
14491a813j7225m1501j0127K7829J2166Q624J6729j9736k9170J4264j3029j7643
14479g0632J5026J5821J1112M0321P764j8834j8401K8039j5928k3564N1412P567
14467B9703k2499j2379P062L7479L419j4449l1800m559K953j702J8840L1254n783
14454C7539j3789k4803k1393P5427N4487N0426L1676J4556k0683R546O9802K9660
$$ plain form
14442 292451 290186 258564 276947 268509 272076 261902 239923 224080 215532 226988 248885 243217
14430 243217 220356 243950 210538 222423 188516 173275 136063 136375 117076 128105 149809 157742
14418 157742 144080 135271 145933 135093 171470 147553 102500 50893 5796 -10867 4191 65045
14406 65045 54260 51628 105856 178892 215319 193267 225382 203153 231459 242273 255845 256295
14394 256295 212566 183308 267623 316622 332042 328953 328369 305722 289625 310741 285065 240940
14382 240940 185878 145954 120434 144528 120608 109827 85189 55165 39146 46816 40354 34573
14370 34573 31742 28466 30545 78719 134930 131144 78276 39734 11070 -5825 17951 -4462
14358 -4462 -30839 -54237 -42709 -13768 -7333 5137 35641 35009 49589 -45416 -89458 -50183
$$ packed form
14442B92451k265l1622J8383q438L567j0174k1979j5843q548J1456K1897n668
14430B43217k2861K3594l3412J1885l3907j5241l7212L12j9299J1029K1704P933
14418A57742j3662q809J0662j0840L6377k3917m5053n1607m5097j6663J5058O0854
14406F5045j0785k632N4228P3036L6427k2052L2115k2229K8306J0814J3572M50
14394B56295m3729k9258Q4315M8999J5420l089n84k2647j6097K1116k5676m4125
14382B40940n5062l9924k5520K4094k3920j0781k4638l0024j6019P670o462n781
14370C4573k831l276K079M8174N6211l786n2868l8542k8664j6895K3776k2413
14358d462k6377k3398J1528K8941O435J2470L0504o32J4580r5005m4042L9275
$$ plain form
14346 -50183 -15573 6863 21941 23585 51839 48219 37097 -11304 17407 64159 29502 40312
14334 40312 7503 -17939 14272 3934 30672 52468 69746 103984 84586 68870 56767 48949
14322 48949 45316 33765 26178 -1989 4733 -15305 -28061 -39778 -47047 -87930 -126452 -96296
14310 -96296 -41118 -32442 18049 29467 24419 -24823 -29647 -18240 -9334 -59389 -43650 -56233
14298 -56233 -7265 -3901 -22716 -25969 -29472 -6956 -4439 -33784 -52156 -80103 -80491 -19305 -2384
14285 -2384 12509 -4608 -1638 -18690 -25867 -2558 15744 37529 66774 64198 52572 44975 5045
14272 5045 18239 54844 86981 72569 101719 140078 133735 115486 137992 154380 167077 119011
14260 119011 98693 92747 121052 148206 171435 165802 178331 216487 237731 267515 301345 341033
$$ packed form
14346e0183L4610K2436J5078J644K8254l620j1122m8401K8711M6752l4657J0810
14334D0312l2809k5442L2211j0338K6738K1796J7278L4238j9398j5716j2103p818
14322D8949l633j1551p587k8167O722k0038j2756j1717p269m0883l8522L0156
14310i6296N5178Q676N0491J1418n048m9242m824J1407Q906n0055J5739j2583
14298e6233M8968L364j8815l253l503K2516K517k9345j8372k7947l88O1186J6921
14285b384J4893j7117K970j7052p177K3309J8302K1785K9245k576j1626p597l9930
14272E045J3194L6605L2137j4412K9150L8359o343j8249K2506J6388J2697m8066
14260A19011k0318n946K8305K7154K3229n633J2529L8156K1244K9784L3830L9688
$$ plain form
14248 341033 353322 377892 448147 533646 560685 590037 649419 675468 733220 889422 985031
14237 985031 1022800 1086124 1181046 1288440 1400868 1535619 1616374 1719799 1908941 2036481
14227 2036481 2135732 2282551 2399770 2522507 2706815 2880714 2973587 3048358 3133606 3189833
14217 3189833 3219469 3237246 3229053 3237590 3215916 3155398 3049487 2972934 2878683 2824928 2759462
14206 2759462 2608318 2427366 2302813 2125780 1980153 1893325 1762719 1614214 1519969 1409577
14196 1409577 1294131 1214885 1141315 1079635 953941 847500 779990 691651 615090 547213 511828
14185 511828 427679 394070 397218 354744 298278 271977 280759 299607 261363 209217 177159 138873
14173 138873 161253 161771 150806 124256 135075 150435 145272 149394 151270 130116 119233 129103 131407
$$ packed form
14248C41033J2289K4570P0255Q5499K7039K9352N9382K6049N7752J56202R5609
14237I85031L7769O3324R4922J07394J12428J34751Q0755J03425J89142J27540
14227B036481R9251J46819J17219J22737J84308J73899R2873P4771Q5248N6227
14217C189833K9636J7777q193Q537k1674o0518j05911p6553r4251n3755o5466
14206B759462j51144j80952j24553j77033j45627q6828j30606j48505r4245j10392
14196A409577j15446p9246p3570o1680j25694j06441o7510q8339p6561o7877l5385
14185E11828q4149l3609L148m2474n6466k6301Q782J8848l8244n2146l2058l8286
14173A38873K2380N18j0965k6550J0819J5360n163M122J876k1154j0883R870K304
$$ plain form
14160 131407 123834 87950 58637 75242 51714 26238 3873 -4473 14532 12541 10493 43401
14148 43401 52908 62701 64597 41043 12489 7571 -2346 -2874 -18129 45431 70975 76136 46348
14135 46348 -2159 41916 56159 11553 -33161 -24038 19973 65442 40813 23099 68138 97041
14123 97041 87515 71290 42967 38726 32335 47131 101707 82832 62216 62509 -2824 -68762 -62188
14110 -62188 2830 53547 56199 51065 32361 15062 30956 42806 19158 10587 -33990 -24076
14098 -24076 -15086 -18815 -30424 -18814 -18431 26660 72977 52441 -37427 -78396 -76504 -15853 12968
14085 12968 -2491 19134 40678 26796 14877 38865 68204 76321 79385 103680 93501 65886
14073 65886 91916 108583 35163 14190 34956 17553 35146 92555 84169 29867 -28885 -49954
$$ packed form
14160A31407p573l5884k9313J6605k3528k5476k2365q346J9005j991k048L2908
14148D3401R507R793J896k3554k8554m918r917n28j5255O3560K5544N161k9788
14135D6348m8507M4075J4243m4606m4714R123M4011M5469k4629j7714M5039K8903
14123I7041r526j6225k8323m241o391J4796N4576j8875k0616K93o5333o5938O574
14110f2188O5018N0717K652n134j8704j7299J5894J1850k3648q571m4577R914
14098b4076Q990l729j1609J1610L83M5091M6317k0536q9868m0969J892O0651K8821
14085A2968j5459K1625K1544j3882j1919K3988K9339Q117L064K4295j0179k7615
14073F5886K6030J6667p3420k0973K0766j7403J7593N7409q386n4302n8752k1069
$$ plain form
14061 -49954 -43768 -43829 5402 59117 11864 -38432 -61170 -76615 -52020 -25034 27151 84748
14049 84748 84447 74458 59671 74645 123141 119622 150180 181018 182345 160868 100245 151331 164686
14036 164686 165015 171314 128543 94084 51450 -4989 9500 40100 41347 86930 88914 45565
14024 45565 15817 -39617 -39305 14569 14162 15287 14909 36203 26977 32369 46645 5112 -11663
14011 -11663 -2496 -18453 47955 90650 121094 127394 72542 -6359 -41285 -26171 -17198 -40463
13999 -40463 -60670 -38282 -19147 27006 43252 39801 3289 19553 87814 81280 58123 28139
13987 28139 -11571 9483 38719 44345 74425 51588 83670 110905 102048 129447 174527 155923
13975 155923 145381 138364 69351 62101 74430 12154 -60669 -52856 -52971 -76429 -48201 -46463 -64838
$$ packed form
14061d9954O186o1M9231N3715m7253n0296k2738j5445K4595K6986N2185N7597
14049H4748l01r989j4787J4974M8496l519L0558L0838J327k1477o0623N1086J3355
14036A64686L29O299m2771l4459m2634n6439J4489L0600J247M5583J984m3349
14024D5565k9748n5434L12N3874m07J125l78K1294r226N392J4276m1533j6775
14011a1663R167j5957O6408M2695L0444O300n4852p8901l4926J5114Q973k3265
13999d0463k0207K2388J9135M6153J6246l451l6512J6264O8261o534k3157k9984
13987B8139l9710K1054K9236N626L0080k2837L2082K7235q857K7399M5080j8604
13975A55923j0542p017o9013p250J2329o2276p2823P813j15k3458K8228J738j8375
$$ plain form
13962 -64838 -13652 17727 32805 -1191 19579 56629 -14483 -65943 -69387 -57830 -35523 -87644
13950 -87644 -150333 -96976 -56051 -77697 -62172 8175 25629 30333 22753 14955 -8489 -14870
13938 -14870 14286 -5917 -7464 -11175 -19778 -25634 -18592 33891 91406 97644 74158 7664 -9889
13925 -9889 -35694 -59417 -72518 -104371 -71779 -1917 63977 71475 45105 11825 28873 28340
13913 28340 25954 13680 5933 -3183 -39396 -86689 -52963 -24561 -48916 -68809 -9706 30945
13901 30945 -13130 -34184 -5370 39883 31967 27096 -41133 -46454 -20910 -11171 39689 32465 3927
13888 3927 -27422 -42064 -43649 -47676 -19986 -25329 -37419 -7586 -9864 -14322 32435 29518 -3176
13875 -3176 -18094 -71931 -44609 -7093 454 7714 3875 -25020 -65328 -49053 -58392 -48526 -39450
$$ packed form
13962f4838N1186L1379J5078l3996K0770L7050p1112n1460l444J1557K2307n2121
13950h7644o2689N3357M0925k1646J5525P0347J7454M704p580p798k3444o381
13938a4870K9156k0203j547l711q603n856P042N2483N7515O238k3486o6494j7553
13925i889k5805k3723j3101l1853L2592O9862O5894P498k6370l3280J7048n33
13913B8340k386j2274p747r116l6213m7293L3726K8402k4355j9893N9103M0651
13901C0945m4075k1054K8814M5253p916m871o8229n321K5544R739N0860p224k8538
13888C927l1349j4642j585m027K7690n343j2090K9833k278m458M6757k917l2694
13875c176j4918n3837K7322L7516P547P260l839k8895m0308J6275r339R866R076
$$ plain form
13862 -39450 -18481 -6136 -35174 -53520 -33099 -37240 -40109 -41832 -34206 -31380 -52351 -58723 -52853
13849 -52853 -64022 -28822 -21252 -31282 -55231 -79305 -88757 -46365 -56396 -67961 -26322 15001
13837 15001 -27461 -48290 -46908 -16872 -8890 -1786 18520 -31549 -98476 -91999 -9699 -3673 -39320
13824 -39320 -94636 -70172 -261 16044 13910 -7299 -10685 8677 28697 74266 6662 -44489
13812 -44489 -68211 -98131 -136574 -100071 -62695 -40072 1379 12321 -17364 -27724 -82062 -58238
13800 -58238 -41157 -8280 -35223 -50414 -59024 -73116 -79213 -96828 -97926 -129088 -105943 -59268
13788 -59268 -46275 -35166 -39838 -28891 14602 4644 -20614 -58899 -50846 -36106 8629 12505
13776 12505 -21642 -28200 -77294 -35647 -11112 45686 74208 52444 38556 28422 74082 74656
$$ packed form
13862c9450K0969J2345k9038j8346K0421m141k869j723P626K826k0971o372N870
13849e2853j1169L5200P570j0030k3949k4074r452M2392j0031j1565M1639M1323
13837A5001m2462k0829J382L0036P982P104K0306n0069o6927O477Q2300O026l5647
13824c9320n5316K4464O9911J6305k134k1209l386J9362K0020M5569o7604n1151
13812d4489k3722k9920l8443L6503L7376K2623M1451J0942k9685j0360n4338K3824
13800e8238J7081L2877k6943j5191q610j4092o097j7615j098l1162K3145M6675
13788e9268J2993J1109m672J0947M3493r958k5258l8285Q053J4740M4735L876
13776A2505l4147o558m9094M1647K4535N6798K8522k1764j3888j0134M5660N74
$$ plain form
13764 74656 80295 80179 32048 -97 19134 26900 49366 37462 30959 3967 -29239 -42156 -36339
13751 -36339 -9106 16871 36846 -2555 -57949 -33630 29777 21320 11161 19014 703 -32600
13739 -32600 -25261 -41609 -79074 -23385 46840 31565 44529 65816 23358 -14798 12204 -16426
13727 -16426 -66431 -40662 -13027 -191 3925 1133 -9530 -19378 -36412 4869 20402 -24684
13715 -24684 -30447 -39438 -40994 -77877 -113690 -87467 -53469 -13571 1169 30349 57768 19600
13703 19600 3865 -51811 -58442 -52137 -80085 -70481 -109284 -103084 -55974 -9266 11907 21279 -8944
13690 -8944 3724 54140 35123 33382 -3306 -26020 -8343 -19464 -9777 42868 86040 103536
13678 103536 60723 9009 16561 21642 83351 83405 45089 -1406 1039 37944 74261 115001 128959
$$ packed form
13764G4656N639j16m8131l2145J9231P766K2466j1904o503k6992l3206j2917N817
13751c6339K7233K5977J9975l9401n5394K4319O3407q457j0159P853j8311l3303
13739c2600P339j6348l7465N5689P0225j5275J2964K1287m2458l8156K7002k8630
13727a6426n0005K5769K7635J2836M116k792j0663r848j7034M1281J5533m5086
13715b4684n763q991j556l6883l5813K6223L3998L9898J4740K9180K7419l8168
13703A9600j5735n5676o631O305k7948R604l8803O200M7110M6708K1173R372l0223
13690h944J2668N0416j9017j741l6688k2714J7677j1121R687N2645M3172J7496
13678A03536m2813n1714P552N081O1709N4l8316m6495K445L6905L6317M0740J3958
$$ plain form
13665 128959 150419 132916 72067 80190 138444 101658 52952 24939 -10152 28904 39928 17004
13653 17004 40564 81592 106950 111835 105607 71661 64618 130288 117372 103408 129201 105059
13641 105059 77040 136166 201500 221543 194680 163220 158816 153108 128641 144586 164825 98239
13629 98239 89812 104085 143819 143554 157453 190583 239895 202892 110074 78156 101753 148383
13617 148383 172567 183232 201445 158247 101738 81421 111567 160564 182693 192620 205405 245451
13605 245451 217646 153772 136535 180012 198302 175354 135752 87199 121402 153548 118489
13594 118489 142703 181355 153346 130936 97584 51943 75056 122504 89722 91933 102392 140120
13582 140120 144254 163133 154589 127955 99464 78256 74371 77497 87491 114944 113047 92997 76784
$$ packed form
13665A28959K1460j7503o0849Q123N8254l6786m8706k8013l5091L9056J1024k2924
13653A7004K3560M1028K5358M885o228l3946p043O5670j2916j3964K5793k4142
13641A05059k8019N9126O5334K0043k6863l1460m404n708k4467J5945K0239o6586
13629I8239q427J4273L9734k65J3899L3130M9312l7003r2818l1918K3597M6630
13617A48383K4184J0665J8213m3198n6509k0317L0146M8997K2129R927J2785M0046
13605B45451k7805o3874j7237M3477J8290k2948l9602m8553L4203L2146l5059
13594A18489K4214L8652k8009k2410l3352m5641K3113M7448l2782K211J0459L7728
13582A40120M134J8879q544k6634k8491k1208l885L126R994K7453j897k0050j6213
$$ plain form
13569 76784 86202 123759 120627 126835 83885 64321 12710 9521 7363 24103 58945 69160 54372
13556 54372 27629 -4640 2086 45677 51034 1478 -12546 32679 70038 53452 78219 67294
13544 67294 82995 108010 102698 82856 50639 44887 39475 9771 5389 -2686 4452 -990 11656
13531 11656 -29383 -39557 -50274 -35196 -23510 -16876 -50739 -47041 -21643 -13609 3070 19447
13519 19447 53393 78718 76846 80477 70500 49128 18349 -109 1297 42763 27460 -21079
13507 -21079 -55486 -55686 -6548 37646 92082 46563 -21207 -26969 -10256 15717 46850 16479
13495 16479 -3590 -45883 -58113 -29670 25724 19016 9902 -24276 7718 75620 144009 145811
13483 145811 106649 43917 -44563 -36842 -10137 8307 -30476 -61321 -22749 5481 -15431 -20920
$$ packed form
13569G6784R418L7557l132O208m2950j9564n1611l189k158J6740L4842J0215j4788
13556E4372k6743l2269O726M3591N357m9556j4024M5225L7359j6586K4767j0925
13544F7294J5701K5015n312j9842l2217n752n412k9704m382q075P138n442J2646
13531A1656m1039j0174j0717J5078J1686O634l3863L698K5398Q034J6679J6377
13519A9447L3946K5325j872L631r977k1372l0779j8458J406M1466j5303m8539
13507b1079l4407k00M9138M4194N4436m5519o7770n762J6713K5973L1133l0371
13495A6479k0069m2293j2230K8443N5394o708r114l4178L1994O7902O8389J802
13483A45811l9162o2732q8480P721K6705J8444l8783l0845L8572K8230k0912n489
$$ plain form
13471 -20920 27764 -33044 -49419 -21479 21992 3825 -17982 -15574 6975 11870 12753 59680
13459 59680 80942 75857 41014 43015 55222 19583 -10434 48352 73746 65669 37011 -16956
13447 -16956 -9543 -43328 -59128 -35826 -6946 58477 67063 32369 15039 29 -27689 -14621
13435 -14621 10095 -7684 11736 14135 -31336 -74285 -82613 -62988 -28417 -37555 -37273 -3243 -30983
13422 -30983 -25617 -23303 -61192 -47517 1084 52849 55959 54218 15537 -30495 -29627 -44658 -29546
13409 -29546 40134 87902 104130 19213 -44902 -43938 -85873 -127928 -61504 -13308 5965 60032
13397 60032 85525 37479 53180 78935 90302 1478 -12751 22886 31995 31325 36079 23045
13385 23045 14322 38277 46997 71810 77655 86424 111280 120544 117721 37799 8287 -15821 -25039
$$ packed form
13471b0920M8684o0808j6375K7940M3471j8167k1807K408K2549M895Q83M6927
13459E9680K1262n085l4843K001J2207l5639l0017N8786K5394q077k8658n3967
13447a6956P413l3785j5800K3302K8880O5423Q586l4694j7330j5010k7718J3068
13435a4621K4716j7779J9420K399m5471m2949q328J9625L4571r138K82L4030k7740
13422c0983N366K314l7889J3675M8601N1765L110j741l8681m6032Q68j5031J5112
13409b9546O9680M7768J6228q4917o4115R64m1935m2055O6424M8196J9273N4067
13397F0032K5493m8046J5701K5755J1367q8824j4229L5637R109o70M754j3034
13385B3045q723K3955Q720K4813N845Q769K4856R264k823p9922k9512k4108r218
$$ plain form
13372 -25039 -26469 -23615 -25026 -16840 15060 32486 32045 30294 81878 107777 84077 65692 27339
13359 27339 10419 -10418 -36520 -27323 -9230 17697 37939 21498 16378 29246 32248 -347
13347 -347 -19183 -5252 15035 21317 35421 40330 16332 1050 60339 86021 14400 14305 17271
13334 17271 9354 20525 9380 13294 7820 27500 16253 1375 31596 52535 38997 -7986
13322 -7986 -14746 26508 81328 83572 95607 90575 21273 1032 20142 52259 38120 5491
13310 5491 -22478 -38718 -21941 18868 60776 126060 153800 170066 176015 225134 232611 228813
13298 228813 247526 283219 344000 369561 416482 387456 357165 321489 340324 369854 362592 351605
13286 351605 350410 383026 444422 460714 452777 487155 514625 568524 535537 493555 507954 449462
$$ packed form
13372b5039j430K854j411Q186L1900J7426m41j751N1584K5899k3700j8385l8353
13359B7339j6920k0837k6102R197J8093K6927K0242j6441n120J2868L002l2595
13347c47j8836J3931K0287O282J4104M909k3998j5282N9289K5682p1621r5K966
13334A7271p917J1171j1145L914n474J9680j1247j4878L0221K0939j3538m6983
13322g986o760M1254N4820K244J2035n032o9302k0241J9110L2117j4139l2629
13310E491k7969j6240J6777M0809M1908O5284K7740J6266N949M9119P477l798
13298B28813J8713L5693O0781K5561M6921k9026l0291l5676J8835K9530p262j0987
13286C51605j195L2616O1396J6292p937L4378K7470N3899l2987m1982J4399n8492
$$ plain form
13274 449462 433757 400603 417131 442519 382929 438421 424506 356025 368204 421582 387720
13263 387720 334419 339351 377529 382455 397943 415238 411119 347131 317641 252946 199267 175202
13251 175202 190956 197664 183994 172711 207928 276523 283075 305120 305725 317748 325446 358869
13239 358869 359870 303666 256179 204739 245963 248166 196037 160106 143089 140405 125514 113421
13227 113421 98646 47664 48326 23303 1792 9245 2007 26931 80858 94709 67864 53710
13215 53710 56908 22867 30283 86753 112984 130263 141016 135937 143569 170013 161998 131579 99656
13202 99656 100723 106401 112282 114567 168178 165512 119044 99020 116197 149643 151016 138158 137048
13189 137048 148998 162752 153097 90750 81978 125704 102168 118419 120072 102304 72908 65651
$$ packed form
13274D49462j5705l3154J6528K5388n9590N5492j3915o8481J2179N3378l3862
13263C87720n3301M932L8178M926J5488J7295m119o3988k9490o4695n3679k4065
13251A75202J5754O708j3670j1283L5217O8595O552K2045O05J2023P698L3423
13239C58869J001n6204m7487n1440M1224K203n2129l5931j7017k684j4891j2093
13227A13421j4775n0982O62k5023k1511P453p238K4924N3927J3851k6845j4154
13215E3710L198l4041P416N6470K6231J7279J0753n079P632K6444q015l0419l1923
13202I9656J067N678N881K285N3611k666m6468k0024J7177L3446J373j2858j110
13189A37048J1950J3754r655o2347q772M3726k3536J6251J653j7768k9396p257
$$ plain form
13177 65651 50942 64093 92780 111760 116701 156504 175318 167629 162210 134142 77963 67255
13165 67255 80761 98256 111809 98620 123308 105195 96069 103647 77032 83865 115715 77981
13153 77981 46063 23540 35759 86987 56083 23155 4143 5032 11991 69895 133670 121956
13141 121956 95972 75648 134234 115148 142697 123062 91007 82298 34897 4901 -19645 -39111
13129 -39111 -21533 32845 56953 37477 13971 -280 -58160 -76700 -66680 11100 39151 32137
13117 32137 27165 37336 -3714 -28437 -32314 33599 70128 47914 31433 52497 56377 26360
13105 26360 7870 -2986 -2001 23211 17678 -28922 -14296 35695 63725 58438 30994 39416 86437
13092 86437 62410 44186 77297 27401 -9413 25356 45045 33559 -5599 12505 631 -24591
$$ packed form
13177F5651j4709J3151K8687J8980M941L9803J8814p689n419k8068n6179j0708
13165F7255J3506J7495J3553j3189K4688j8113r126P578k6615O833L1850l7734
13153G7981l1918k2523J2219N1228l0904l2928j9012Q89O959N7904O3775j1714
13141A21956k5984k0324N8586j9086K7549j9635l2055q709m7401k9996k4546j9466
13129c9111J7578N4378K4108j9476k3506j4251n7880j8540J0020P7780K8051p014
13117C2137m972J0171m1050k4723l877O5913L6529k2214j6481K1064L880l0017
13105B6360j8490j0856R85K5212n533m6600J4626M9991K8030n287k7444Q422M7021
13092H6437k4027j8224L3111m9896l6814L4769J9689j1486l9158J8104j1874k5222
$$ plain form
13080 -24591 -32420 -24705 -262 6332 31947 34985 11247 -22069 -69528 -93796 -47632 -10636
13068 -10636 -4415 -21009 -61101 -55357 -29051 -36455 -35495 -23708 37598 24203 46741 64151 28829
13055 28829 51156 50033 48907 77575 71429 87914 70393 43317 31319 57316 62250 32494
13043 32494 14811 -13864 27004 55947 23364 16493 15659 -6699 -36878 -4495 -38373 -115103
13031 -115103 -143077 -156703 -96100 -64644 -53142 -66969 -24253 12230 -1256 -28902 -22575 -23017
13019 -23017 -13092 -71440 -57696 15267 48984 51289 24601 -7850 -21890 -31374 -4228 12184
13007 12184 -27552 -36575 -23100 14809 4058 -1059 -10515 -10500 -13765 -25882 -2885 -21256 9017
12994 9017 21312 -230 8475 -3883 35252 50349 16345 -47802 -71394 -54726 -66122 -12633
$$ packed form
13080b4591p829P715K4443O594K5615L038k3738l3316m7459k4268M6164L6996
13068a0636O221j6594m0092N744K6306p404R60J1787O1306j3395K2538J7410l5322
13055B8829K2327j123j126K8668o146J6485j7521k7076j1998K5997M934k9756
13043C2494j7683k8675M0868K8943l2583o871q34k2358l0179L2383l3878p6730
13031a15103k7974j3626O0603L1456J1502j3827M2716L6483j3486k7646O327m42
13019b3017R925n8348J3744P2963L3717K305k6688l2451j4040r484K7146J6412
13007A2184l9736r023J3475L7909j0751n117r456J5l265j2117K2997j8371L0273
12994I017J2295k1542Q705j2358L9135J5097l4004o4147k3592J6668j1396N3489
$$ plain form
12982 -12633 -3972 -34226 -82735 -35415 8649 -11045 -20284 -23193 -6850 2962 -10448 2015
12970 2015 -24904 5069 40140 73458 83639 56726 42307 55399 39834 30747 46510 45883
12958 45883 10309 -18899 12675 86456 102783 113310 40057 12514 -47290 -77390 -103205 -98817
12946 -98817 8133 37012 64188 65666 38001 24663 44067 62229 16895 25182 71055 75296
12934 75296 126341 123292 89496 114839 118844 106448 103927 88205 111407 81110 131395 162538
12922 162538 173074 173715 137446 111680 154914 193376 193261 219006 221038 186371 161409 156076 187523
12909 187523 211121 188079 167440 139675 119550 86271 86442 101448 111336 102188 73764 54568
12897 54568 46925 23836 36262 23517 31236 73382 108981 91286 74070 53832 57919 23827
$$ packed form
12982a2633Q661l0254m8509M7320M4064j9694r239k909J6343R812j3410J2463
12970B015k6919K9973L5071L3318J0181k6913j4419J3092j5565r087J5763o27
12958D5883l5574k9208L1574P3781J6327J0527p3253k7543n9804l0100k5815M388
12946i8817J06950K8879K7176J478k7665j3338J9404J8162m5334Q287M5873M241
12934G5296N1045l049l3796K5343M005j2396k521j5722K3202l0297N0285L1143
12922A62538J0536O41l6269k5766M3234L8462j15K5745K032l4667k4962n333L1447
12909A87523K3598k3042k0639k7765k0125l3279J71J5006R888r148k8424j9196
12897E4568p643k3089J2426j2745P719M2146L5599j7695j7216k0238M087l4092
$$ plain form
12885 23827 46107 129636 139815 75491 53210 57790 102692 94150 58706 21483 44640 42539
12873 42539 30908 94958 131918 124485 182355 249699 284930 281379 276695 280018 248351 199416
12861 199416 191550 268002 294183 265499 262361 273110 295739 348575 386896 389721 373434 334383
12849 334383 268802 259918 252051 302448 363018 395170 347737 339058 320891 289565 285510 304149
12837 304149 281888 248372 259207 259245 245140 208113 246246 246633 203435 193339 190421 166224 165846
12824 165846 177900 180922 199064 204766 260785 301088 302885 324286 297523 246201 215804 233401
12812 233401 274211 364891 396913 446793 514891 567745 603093 645299 660509 656937 650204 678234
12800 678234 670158 680384 634257 599946 611275 628353 649117 690896 710910 679629 678732 665859
$$ packed form
12885B3827K2280Q3529J0179o4324k2281M580M4902q542l5444l7223K3157k101
12873D2539j1631O4050L6960p433N7870O7344L5231l551m684L323l1667m8935
12861A99416p866P6452K6181k8684l138J0749K2629N2836L8321K825j6287l9051
12849C34383o5581q884p867N0397O0570L2152m7433q679j8167l1326m055J8639
12837C04149k2261l3516J0835L8j4105l7027L8133L87m3198j0096k918k4197l78
12824A65846J2054L022J8142N702N6019M0303J797K1401k6763n1322l0397J7597
12812B33401M0810R0680L2022M9880O8098N2854L5348M2206J5210l572o733K8030
12800F78234q076J0226m6127l4311J1329J7078K0764M1779K0014l1281q97j2873
$$ plain form
12788 665859 655575 723152 760958 770596 785668 767808 759113 803104 835557 866468 888486 969892
12776 969892 1018846 981430 971016 983816 974087 917200 949299 1039447 1085369 1093212 1091990 1076261
12764 1076261 990424 948703 965381 942043 961757 1017461 1037481 1006500 991435 934821 854853
12753 854853 829145 853907 834722 769613 721971 723535 728378 662778 660274 675663 661075 688029
12741 688029 669090 599750 605230 638555 590345 558274 530650 478751 443082 406753 421439 413887
12729 413887 350946 300112 265984 264389 256621 264513 242826 229258 224161 198994 197580 209591
12717 209591 206638 215972 188639 187855 210718 211167 186033 141694 141091 146172 174929 199101 156135
12704 156135 130593 136797 163361 162772 109513 142388 138377 93779 111165 128072 87002 94659
$$ packed form
12788F65859j0284O7577L7806R638J5072j7860q695M3991L2453L0911K2018Q1406
12776I69892M8954l7416j0414J2800r729n6887L2099R0148M5922P843j222j5729
12764A076261q5837m1721J6678k3338J9714N5704K0020l0981j5065n6614p9968
12753H54853k5708K4762j9185o5109m7642J564M843o5600k504J5389j4588K6954
12741F88029j8939o9340N480L3325m8210l2071k7624n1899l5669l6329J4686p552
12729D13887o2941n0834l4128j595p768P892k1687j3568n097k5167j414J2011
12717B09591k953R334k7333p84K2863M49k5134m4339o03N081K8757K4172m2966
12704A56135k5542O204K6564n89n3259L2875m011m4598J7386J6907m1070P657
$$ plain form
12692 94659 104567 94433 125553 153771 188942 195539 152588 124257 75067 68830 78730 114505
12680 114505 135893 127230 129469 109803 92560 81028 70630 84229 79560 134580 160216 157964
12668 157964 134916 74814 89520 116663 146831 145331 161869 163178 164177 185528 139776 103998
12656 103998 156373 241722 265692 272316 286219 348492 370538 370877 371241 342629 298625 268995
12644 268995 264647 336948 341098 310582 323060 280617 346341 350406 359832 376296 378271 384210 440621
12631 440621 474001 505130 576515 653895 764554 826454 793872 760071 698064 612635 545367
12620 545367 533999 536907 502594 486361 529900 498889 473414 462791 481256 469984 451265 392768
12608 392768 375956 401887 383823 372493 382488 369836 372020 395854 438532 452833 466333 444478
$$ packed form
12692I4659R908j0134L1120K8218L5171O597m2951k8331m9190o237R900L5775
12680A14505K1388q663K239j9666j7243j1532j0398J3599m669N5020K5636k252
12668A57964k3048o0102J4706K7143L0168j500J6538J309R99K1351m5752l5778
12656A03998N2375Q5349K3970O624J3903O2273K2046L39L64k8612m4004k9630
12644B68995m348P2301M150l0516J2478m2443O5724M065R426J6464J975N939N6411
12631D40621L3380L1129P1385P7380J10659O1900l2582l3801o2007q5429o7268
12620E45367j1368K908l4313j6233M3539l1011k5475j0623J8465j1272j8719n8497
12608C92768j6812K5931j8064j1330R995j2652K184K3834M2678J4301J3500k1855
$$ plain form
12596 444478 422426 439409 481153 528270 507566 543591 561795 579119 570682 573442 591139 587246
12584 587246 555159 565851 598391 613447 579832 539097 553053 538903 536585 512275 505904 541460
12572 541460 540709 556102 573072 584759 558274 533438 562055 610825 670568 721156 715704 705975
12560 705975 676151 693700 688831 638735 599995 580628 537052 514323 506785 494236 489758 461440
12548 461440 426577 407962 405157 389187 378482 373019 350894 381394 420931 442001 453561 482759
12536 482759 461287 444514 499187 511184 492080 494964 504414 520532 529198 543315 563937 597560
12524 597560 594517 624706 680701 690594 744448 768422 746322 746335 755608 716489 710393 688358 683275
12511 683275 724547 686262 670753 643886 665550 692202 709833 754180 763691 772669 764049 790635
$$ packed form
12596D44478k2052J6983M1744M7117k0704L6025J8204J7324q437K760J7697l893
12584E87246l2087J0692L2540J5056l3615m0735J3956j4150k318k4310o371L5556
12572E41460p51J5393J6970J1687k6485k4836K8617M8770N9743N0588n452r729
12560G05975k9824J7549m869n0096l8740j9367m3576k2729p538j2549m478k8318
12548D61440l4863j8615k805j5970j0705n463k2125L0500L9537K1070J1560K9198
12536D82759k1472j6773N4673J1997j9104K884R450J6118Q666J4117K0622L3623
12524E97560l043L0189N5995R893N3854K3974k2100J3R273l9119o096k2035n083
12511F83275M1272l8285j5509k6867K1664K6652J7631M4347R511Q978q620K6586
$$ plain form
12499 790635 837538 865628 900190 877837 896287 942030 950195 953343 983444 966525 955607 967962
12487 967962 969065 1026582 1038879 999728 978587 970478 933389 934009 990306 1035501 1039551 1008665
12475 1008665 1042794 1080045 1116753 1148838 1141812 1118279 1198655 1230321 1207346 1188402 1197506 1283314
12463 1283314 1352616 1391812 1374071 1361431 1376851 1410758 1494954 1616282 1634737 1623078 1680583
12452 1680583 1725519 1774642 1807448 1791435 1834621 1904636 1942695 1957934 2000640 2049531 2040379
12441 2040379 2097323 2158026 2231319 2222917 2300385 2443209 2558479 2679962 2754465 2811604 2933916
12430 2933916 3035332 3165695 3310390 3431440 3550549 3647147 3766431 3863347 3978165 4141191
12420 4141191 4345782 4516202 4646506 4824874 5055252 5251505 5501729 5761289 6107589
$$ packed form
12499G90635M6903K8090L4562k2353J8450M5743Q165L148L0101j6919j0918J2355
12487I67962J103N7517J2297l9151k1141q109l7089O20N6297M5195M050l0886
12475A008665L4129L7251L6708L2085p026k3533Q0376L1666k2975j8944R104Q5808
12463A283314O9302L9196j7741j2640J5420L3907Q4196J21328J8455j1659N7505
12452A680583M4936M9123L2806j6013M3186P0015L8059J5239M2706M8891r152
12441B040379N6944O0703P3293q402P7468J42824J15270J21483P4503N7139J22312
12430B933916J01416J30363J44695J21050J19109R6598J19284R6916J14818J63026
12420D141191K04591J70420J30304J78368K30378J96253K50224K59560L46300
$$ plain form
12411 6107589 6438941 6764701 7121456 7487635 7839193 8255898 8693429 9127940 9547895
12402 9547895 10042808 10599725 11099537 11662360 12236769 12822655 13598314 14540088 15502843
12393 15502843 16626902 17885146 19232353 20765495 22413182 24176754 25952033 27678448
12385 27678448 29427199 31253956 33166862 35226861 37522099 40117146 42976396 46084170
12377 46084170 49643062 53803367 58733927 64416085 70689079 77221028 83639304 89536558
12369 89536558 94742581 99339024 103330297 106595490 109193712 111040340 112149853 112913979
12361 112913979 113699695 114733599 116083394 117645208 119385903 121223432 123210986 125451295
12353 125451295 127880227 130581421 133697978 137332020 141471725 146009422 150756687 155458122
$$ packed form
12411F107589L31352L25760L56755L66179L51558M16705M37531M34511M19955
12402I547895M94913N56917M99812N62823N74409N85886P75659R41774R62755
12393A5502843J124059J258244J347207J533142J647687J763572J775279J726415
12385B7678448J748751J826757J912906K059999K295238K595047K859250L107774
12377D6084170L558892M160305M930560N682158O272994O531949O418276N897254
12369H9536558N206023M596443L991273L265193K598222J846628J109513P64126
12361A12913979P85716J033904J349795J561814J740695J837529J987554K240309
12353A25451295K428932K701194L116557L634042M139705M537697M747265M701435
$$ plain form
12345 155458122 159974719 164345417 168543575 172569954 176478654 180257759 183824935 187128092
12337 187128092 190086366 192584476 194563614 195935067 196829519 197309441 197210286 196419488 194941433
12328 194941433 192666161 189655043 185968731 181646770 176901297 171945496 166898881 161802819
12320 161802819 156814863 152029335 147503639 143445989 139944599 137022634 134614785 132561543
12312 132561543 130603832 128615229 126621677 124639869 122763717 120948383 119002254 116703472
12304 116703472 114002223 110964310 107641051 104194465 100555991 96688971 92426643 87557437
12296 87557437 82101635 76212361 70226721 64538384 59439708 55103932 51440102 48308336
12288 48308336 45635347 43154956 40845248 38615194 36388045 34248717 32305900 30463119
$$ packed form
12345A55458122M516597M370698M198158M026379L908700L779105L567176L303157
12337A87128092K958274K498110J979138J371453Q94452M79922r9155p90798j478055
12328A94941433k275272l011118l686312m321961m745473m955801n046615n096062
12320A61802819m987956m785528m525696m057650l501390k921965k407849k053242
12312A32561543j957711j988603j993552j981808j876152j815334j946129k298782
12304A16703472k701249l037913l323259l446586l638474l867020m262328m869206
12296H7557437n455802n889274n985640n688337n098676m335776l663830l131766
12288D8308336k672989k480391k309708k230054k227149k139328j942817j842781
$$ plain form
12280 30463119 28715685 26936299 25230524 23653133 22139799 20662913 19378427 18213487
12272 18213487 17226904 16354659 15509537 14754432 14115120 13500695 12881846 12292616 11756091
12263 11756091 11246867 10703140 10257230 9832986 9392349 8988496 8647562 8363006 8117371
12254 8117371 7899795 7735848 7543358 7299662 7072582 6883225 6687353 6501868 6318556
12245 6318556 6087498 5891581 5676277 5533133 5390347 5264016 5146857 5019736 4886860
12236 4886860 4696499 4486342 4322816 4170746 4065615 3944859 3818074 3730839 3658469 3583591
12226 3583591 3468468 3384249 3285025 3197724 3118686 3043600 2989137 2950173 2916748 2866803 2787604
12215 2787604 2717371 2625382 2545344 2509797 2481537 2456217 2424050 2332713 2226544 2183352 2130652
$$ packed form
12280C0463119j747434j779386j705775j577391j513334j476886j284486j164940
12272A8213487r86583q72245q45122p55105o39312o14425o18849n89230n36525
12263A1756091n09224n43727m45910m24244m40637m03853l40934k84556k45635
12254H117371k17576j63947j92490k43696k27080j89357j95872j85485j83312
12245F318556k31058j95917k15304j43144j42786j26331j17159j27121j32876
12236D886860j90361k10157j63526j52070j05131j20756j26785q7235p2370p4878
12226C583591j15123q4219r9224q7301p9038p5086n4463l8964l3425m9945p9199
12215B787604p0233r1989q0038l5547k8260k5320l2167r1337j06169m3192n2700
$$ plain form
12204 2130652 2106594 2126789 2139228 2140356 2103065 2014825 1920282 1848886 1778809 1750999 1724244
12193 1724244 1705291 1692715 1699537 1702591 1681487 1616389 1547131 1507079 1490903 1491136 1444902 1391390
12181 1391390 1365940 1319507 1320787 1302441 1280443 1239992 1232678 1221952 1198965 1198549 1226051 1228713
12169 1228713 1200048 1194939 1190024 1201500 1224499 1241737 1200795 1203760 1219832 1226535 1209372 1173036
12157 1173036 1132888 1082264 1097644 1091878 1079780 1019760 1019730 969453 957135 903158 900458 935690
12145 935690 965367 1003418 990945 969551 946741 962493 957012 924469 879138 876560 930341 885628
12133 885628 867368 832516 836188 868962 814255 836610 872101 855396 849137 856151 834144 817142
12121 817142 835242 844318 798429 807370 798951 809533 815420 784067 794852 802119 783214 779178 763593
$$ packed form
12204B130652k4058K0195J2439J128l7291q8240r4543p1396p0077k7810k6755
12193A724244j8953j2576O822L054k1104o5098o9258m0052j6176K33m6234n3512
12181A391390k5450m6433J280j8346k1998m0451p314j0726k2987m16K7502K662
12169A228713k8665n109m915J1476K2999J7238m0942K965J6072O703j7163l6336
12157A173036m0148n0624J5380n766j2098o0020l0n0277j2318n3977k700L5232
12145I35690K9677L8051j2473k1394k2810J5752n481l2543m5331k578N3781m4713
12133H85628j8260l4852L672L2774n4707K2355L5491j6705o259P014k2007j7002
12121H17142J8100R076m5889Q941q419J0582N887l1353J0785P267j8905m036j5585
$$ plain form
12108 763593 692440 693734 684143 667413 648358 724753 787829 743821 708306 700722 676799 674350
12096 674350 690247 687461 637334 637048 683252 686612 622264 618031 644960 686383 747813 753766 732510
12083 732510 714472 719593 773530 744241 706490 727593 745424 779428 775238 695695 681888 701365
12071 701365 706465 679390 676704 744729 709805 658416 670114 714133 729967 721574 778044 773473
12059 773473 775773 777717 772296 786418 790361 757621 792841 794825 799568 758843 791211 772471 750399
12046 750399 779275 832880 849700 808684 732494 699446 679379 736164 770511 706133 627186
12035 627186 637828 672955 644439 578381 588709 605378 605095 635060 588803 552648 559427 538904
12023 538904 530461 544988 571256 584635 591343 604387 603671 610701 620805 581037 597887 614512
$$ packed form
12108G63593p1153J294r591j6730j9055P6395O3076m4008l5515p584k3923k449
12096F74350J5897k786n0127k86M6204L360o4348m233K6929M1423O1430N953k1256
12083G32510j8038N121N3937k9289l7751K1103J7831L4004m190p9543j3807J9477
12071G01365N100k7075k686O8025l4924n1389J1698M4019J5834q393N6470m571
12059G73473K300J944n421J4122L943l2740L5220J984M743m0725L2368j8740k2072
12046G50399K8876N3605J6820m1016p6190l3048k0067N6785L4347o4378p8947
12035F27186J0642L5127k8516o6058J0328J6669k83K9965m6257l6155O779k0523
12023E38904q443J4527K6268J3379O708J3044p16P030J0104l9768J6850J6625
$$ plain form
12011 614512 561821 580877 563941 519986 496003 494830 504884 484803 445799 447989 455586 445721
11999 445721 496519 524116 496969 524198 524524 492509 439410 385435 378282 408670 438357 450942
11987 450942 440236 447869 417874 406284 421197 390847 351131 326143 333186 342686 324381 348404
11975 348404 358999 335984 300237 316243 335381 387944 446555 438891 416950 409834 411447 421385
11963 421385 448800 432241 421540 460311 469082 418016 352289 326071 295788 296580 354441 403851
11951 403851 406329 386539 385115 342737 325892 343732 401436 456430 476653 468460 457854 435023
11939 435023 459511 506724 501715 487288 480903 523734 543850 558966 580677 599327 621564 640155
11927 640155 648309 648426 670395 713004 744752 755403 765203 787854 818944 857584 824507 881721
$$ packed form
12011F14512n2691J9056j6936m3955k3983j173J0054k0081l9004K190P597r865
11999D45721N0798K7597k7147K7229L26l2015n3099n3975p153L0388K9687J2585
11987D50942j0706P633k9995j1590J4913l0350l9716k4988P043R500j8305K4023
11975C48404J0595k3015l5747J6006J9138N2563N8611p664k1941p116J613R938
11963D21385K7415j6559j0701L8771Q771n1066o5727k6218l0283P92N7861M9410
11951D03851K478j9790j424m2378j6845J7840N7704N4994K0223q193j0606k2831
11939D35023K4488M7213n009j4427o385M2831K0116J5116K1711J8650K2237J8591
11927F40155Q154J17K1969M2609L1748J0651R800K2651L1090L8640l3077N7214
$$ plain form
11915 881721 918377 947608 929873 916411 941430 950561 941447 957183 966368 1005806 1015799 958146
11903 958146 961804 1025948 1055796 1060854 1100787 1192626 1232550 1241861 1300729 1300028 1290593 1208832 1189791
11890 1189791 1187794 1212135 1178122 1127524 1081858 1043588 1014206 950266 909303 930149 959493
11879 959493 994757 989357 922043 833753 814481 805906 796831 756046 737845 773756 778061 807427
11867 807427 859036 863608 840364 815827 776194 767321 757182 747469 743971 724587 723605 720966 682918
11854 682918 595898 504647 480710 491901 455027 427317 439417 422126 384068 389681 397172 388841
11842 388841 367616 338110 268658 250552 254705 249942 263395 311958 243578 225990 235557 237962
11830 237962 222759 221034 161968 143999 150587 149662 95803 150248 197087 190202 167716 177963
$$ packed form
11915H81721L6656K9231j7735j3462K5019R131r114J5736R185L9438R993n7653
11903I58146L658O4144K9848N058L9933R1839L9924R311N8868p01r435q1761j9041
11890A189791j997K4341l4013n0598m5666l8270k9382o3940m0963K0846K9344
11879I59493L5264n400o7314q8290j9272q575r075m0785j8201L5911M305K9366
11867H07427N1609M572k3244k4537l9633q873j0139r713l498j9384r82k639l8048
11854F82918q7020r1251k3937J1191l6874k7710J2100j7291l8058N613P491q331
11842C88841k1225k9506o9452j8106M153m763J3453M8563o8380j7588R567K405
11830B37962j5203j725n9066j7969O588r25n3859N4445M6839o885k2486J0247
$$ plain form
11818 177963 211980 245624 256411 228548 174395 157766 190372 189705 190873 207504 212977 170216
11806 170216 166685 190392 203845 235267 185716 124791 124414 136535 141364 111647 83741 80856
11794 80856 93742 111545 131453 125120 121180 95381 72935 67126 65124 62904 70263 62536 86767
11781 86767 65361 64996 91472 77443 111801 128452 86010 53459 52792 94656 93391 53698 35902
11768 35902 41452 90071 94989 124479 84816 74338 98582 77076 54522 90623 130929 123366
11756 123366 88377 92723 89877 61630 54815 84194 89237 102695 98412 131890 132932 138322 142833
11743 142833 135421 72476 -2725 35068 99453 122606 132730 99511 101163 116447 108350 72022
11731 72022 28078 36601 63191 77570 106576 103584 73640 85942 109553 100941 93669 107738
$$ packed form
11818A77963L4017L3644J0787k7863n4153j6629L2606o67J168J6631N473m2761
11806A70216l531K3707J3453L1422m9551o0925l77J2121M829k9717k7906k885
11794H0856J2886J7803J9908o333l940k5799k2446n809k002k220P359p727K4231
11781H6767k1406l65K6476j4029L4358J6651m2442l2551o67M1864j265l9693j7796
11768C5902N550M8619M918K9490l9663j0478K4244k1506k2554L6101M0306p563
11756A23366l4989M346k846k8247o815K9379N043J3458m283L3478J042N390M511
11743A42833p412o2945p5201L7793O4385K3153J0124l3219J652J5284q097l6328
11731G2022m3944Q523K6590J4379K9006k992k9944J2302K3611q612p272J4069
$$ plain form
11719 107738 104164 71207 34722 633 31448 17382 -8612 9031 -12936 37392 98295 110375
11707 110375 100179 40605 32555 44179 17117 41241 112020 135691 113159 146864 153385 123998
11695 123998 110129 103700 73126 64241 81725 92856 80156 70771 94901 103300 115290 86257
11683 86257 45587 42569 86132 93689 77840 52256 27502 47792 94185 58221 69228 34691
11671 34691 18387 22943 10103 27425 32687 42156 2469 -12763 -16595 -3219 35176 103969
11659 103969 117155 103490 30064 33782 92923 116078 103101 64531 94681 73494 67726 69803
11647 69803 67078 55298 71679 106336 80967 24278 17524 -5948 11560 60669 109938 142630
11635 142630 157098 135231 87584 89223 112295 154096 201372 145004 101215 87514 86463 125687
$$ packed form
11719A07738l574l2957l6485l4089L0815j4066k5994J7643k1967N0328O0903J2080
11707A10375j0196n9574q050J1624k7062K4124P0779K3671k2532L3705O521k9387
11695A23998j3869o429l0574q885J7484J1131j2700r385K4130Q399J1990k9033
11683H6257m0670l018M3563P557j5849k5584k4754K0290M6393l5964J1007l4537
11671C4691j6304M556j2840J7322N262R469l9687j5232l832J3376L8395O8793
11659A03969J3186j3665p3426L718N9141K3155j2977l8570L0150k1187n768K077
11647F9803k725j1780J6381L4657k5369n6689o754k3472J7508M9109M9269L2692
11635A42630J4468k1867m7647J639K3072M1801M7276n6368m3789j3701j051L9224
$$ plain form
11623 125687 174442 189361 189797 135376 128070 143532 112877 124548 93176 87203 57376 6694
11611 6694 31827 72316 78581 56325 414 -6144 64822 162759 122316 74700 34403 39368
11599 39368 64509 51321 55879 -1903 9401 18184 71108 82609 56641 21498 47111 59212
11587 59212 33288 20052 34630 28936 54394 68850 58339 -24031 -2536 -9377 -23517 16850
11575 16850 27628 41775 38721 12473 31962 -8066 -47830 -31430 -27811 8722 52100 32515
11563 32515 6092 -17923 -64456 -82533 -52886 -70587 -64742 11177 1893 20123 58287 18452
11551 18452 43420 45772 57692 65696 23033 -18009 24237 72674 49561 39057 39068 19350 25217
11538 25217 50436 50632 -15012 -18172 -1929 -18844 -12511 471 22495 6098 -37054 -63298
$$ packed form
11623A25687M8755J4919M36n4421p306J5462l0655J1671l1372n973k9827n0682
11611F694K5133M0489O265k2256n5911o558P0966R7937m0443m7616m0297M965
11599C9368K5141j3188M558n7782J1304Q783N2924J1501k5968l5143K5613J2101
11587E9212k5924j3236J4578n694K5458J4456j0511q2370K1495o841j4140M0367
11575A6850J0778J4147l054k6248J9489m0028l9764J6400L619L6533M3378j9585
11563C2515k6423k4015m6533j8077K9647j7701N845P5919r284J8230L8164l9835
11551A8452K4968K352J1920Q004m2663m1042M2246M8437k3113j0504J1j9718N867
11538B5217K5219J96o5644l160J6243j6915O333J2982K2024j6397m3152k6244
$$ plain form
11526 -63298 -69631 -65318 -84505 -38597 10430 -5206 8555 -137 7251 30669 61286 57324 43403
11513 43403 40322 1607 -12923 -2697 76457 60228 -11839 23190 69709 46076 41270 29472
11501 29472 -15654 -210 21973 77770 65114 35466 -36244 -43204 -5030 16249 30984 33482
11489 33482 31664 70234 73050 7246 -23012 -34045 -62805 -40608 -20381 -31101 -30770 13299
11477 13299 24206 49245 65986 45953 7886 42580 83893 67308 23684 3184 38468 60828
11465 60828 78337 45602 7437 -17659 9224 3509 35239 64897 34746 -1029 -10911 10592
11453 10592 22578 26019 15572 5847 20222 42853 60433 50773 41842 9043 49245 89367
11441 89367 93049 107827 100427 72726 25769 3413 2424 15492 18419 37262 31987 23164 -33185
$$ packed form
11526f3298o333M313j9187M5908M9027j5636J3761q692P388K3418L0617l962j3921
11513D3403l081l8715j4530J0226P9154j6229p2067L5029M6519k3633m806j1798
11501B9472m5126J5444K2183N5797j2656k9648p1710o960L8174K1279J4735K498
11489C3482j818L8570K816o5804l0258j1033k8760K2197K0227j0720L31M4069
11477A3299J0907K5039J6741k0033l8067L4694M1313j6585m3624k0500L5284K2360
11465F0828J7509l2735l8165k5096K6883n715L1730K9658l0151l5775r882K1503
11453A0592J1986L441j0447r725J4375K2631J7580r660q931l2799M0202M0122
11441H9367L682J4778p400k7701m6957k2356r89J3068K927J8843n275q823n6349
$$ plain form
11428 -33185 -46797 -40985 -18060 -27020 -61167 -29005 38605 42094 4987 24820 43751 36263
11416 36263 73456 66874 57435 60741 61595 45321 43396 -6778 -16713 -29226 -20278 -7909 -29277
11403 -29277 -45513 -33114 -29311 11613 24067 35284 36082 20168 -3616 -2072 -27325 -31389 -26293
11390 -26293 -55192 -89831 -109545 -101734 -75606 20040 42303 6202 35034 53615 82220 103602
11378 103602 114380 81914 40739 7990 27622 14567 -33547 -4094 6491 -15692 15636
11367 15636 38935 13766 -5014 -46449 -46629 -42096 -57691 -27928 -16181 -10798 -16575 -2386 29160
11354 29160 36896 18496 -7698 -35761 -40278 -57143 -55679 -41671 -66089 -61859 -38881 -74370
11342 -74370 -66573 -49157 -33856 5692 11795 63608 82906 58057 22938 14787 26309 50750
$$ packed form
11428c3185j3612N812K2925q960l4147L2162O7610L489l7107J9833J8931p488
11416C6263L7193o582r439L306Q54j6274j925n0174r935j2513Q948J2369k1368
11403b9277j6236J2399L803M0924J2454J1217P98j5914k3784J544k5253m064N096
11390b6293k8899l4639j9714P811K6128R5646K2263l6101K8832J8581K8605K1382
11378A03602J0778l2466m1175l2749J9632j3055m8114K9453J0585k2183L1328
11367A5636K3299k5169j8780m1435j80M533j5595K9763J1747N383n777J4189L1546
11354B9160P736j8400k6194k8063m517j6865J464J4008k4418M230K2978l5489
11342g4370P797J7416J5301L9548O103N1813J9298k4849l5119q151J1522K4441
$$ plain form
11330 50750 62513 58016 56425 13742 3074 52797 79923 77020 52255 3462 44602 54517
11318 54517 54764 30275 33782 98112 120694 101214 -160 -20572 -6087 20107 69044 33042
11306 33042 27233 46857 32391 34829 67104 60887 63843 80249 47431 59070 32724 19418
11294 19418 43064 48428 52032 30209 30326 46940 42147 23342 39588 -2734 -29885 7093 29541
11281 29541 51674 84036 73926 52430 48609 95084 136002 143744 66327 -15483 -36230 7125
11269 7125 27820 20924 -11754 -60835 -33247 19059 6157 -49590 -52355 -20179 -6633 22673
11257 22673 58779 33561 45414 -9415 16906 13908 -35459 -34494 8610 38054 4967 10125
11245 10125 -35882 -36382 -2566 23259 44509 19617 5375 21807 35960 56177 38857 26492
$$ packed form
11330E0750J1763m497j591m2683j0668M9723K7126k903k4765m8793M1140R915
11318E4517K47k4489L507O4330K2582j9480j01374k0412J4485K6194M8937l6002
11306C3042n809J9624j4466K438L2275o217K956J6406l2818J1639k6346j3306
11294A9418K3646N364L604k1823J17J6614m793j8805J6246m2322k7151L6978K2448
11281B9541K2133L2362j0110k1496l821M6475M0918P742p7417q1810k0747M3355
11269G125K0695o896l2678m9081K7588N2306j2902n5747k765L2176J3546K9306
11257B2673L6106k5218J1853n4829K6321k998m9367R65M3104K9444l3087N158
11245A0125m6007n00L3816K5825K1250k4892j4242J6432J4153K0217j7320j2365
$$ plain form
11233 26492 64663 67720 52534 79857 131524 100523 77453 50041 13814 -13237 2375 22230
11221 22230 15542 19570 21756 46380 38133 94592 95680 76438 37603 8578 14429 25235 76580
11208 76580 102832 95318 66433 65990 51221 79147 96091 123302 127826 104073 59038 34439
11196 34439 42749 56109 54591 14709 36594 98447 118863 118857 113595 152703 161104 165860 153849
11183 153849 122518 127481 154790 206374 231750 212540 227714 234939 167561 103347 129393 149730
11171 149730 161813 129959 111729 128483 137152 147814 153407 141270 153997 126103 109687 124746
11159 124746 192205 214693 193870 217830 218371 201511 184970 167771 142985 147493 136695 161038
11147 161038 180631 175699 179035 199916 223120 249264 238131 247187 235515 204900 180483 139105
$$ packed form
11233B6492L8171L057j5186K7323N1667l1001k3070k7412l6227k7051J5612J9855
11221B2230o688M028K186K4624q247N6459J088j9242l8835k9025N851J0806N1345
11208G6580K6252p514k8885m43j4769K7926J6944K7211M524k3753m5035k4599
11196C4439Q310J3360j518l9882K1885O1853K0416on262L9108Q401M756j2011
11183A53849l1331M963K7309N1584K5376j9210J5174P225o7378o4214K6046K0337
11171A49730J2083l1854j8230J6754Q669J0662N593j2137J2727k7894j6416J5059
11159A24746O7459K2488k0823K3960N41j6860j6541j7199k4786M508j0798K4343
11147A61038J9593m932L336K0881K3204K6144j1133R056j1672l0615k4417m1378
$$ plain form
11135 139105 142115 162463 201209 212765 213140 237673 284576 255056 234686 239780 195069 175835
11123 175835 189191 249717 298866 314105 296126 282922 270792 236727 247906 176066 157613
11112 157613 185439 228968 260737 280631 246321 240592 256864 255251 282455 244738 217124 222437
11100 222437 198977 174691 124194 131742 174079 202940 234304 245979 236216 292177 305566 234307
11088 234307 229205 202904 209000 219237 205816 235768 265732 279398 254379 306362 351089 340602
11076 340602 353176 361599 326601 268998 260486 305140 349472 363445 328088 338319 355499 334703
11064 334703 335172 354636 409688 402743 324986 333762 373765 361852 383497 418609 389376 339378
11052 339378 343802 340723 351329 416922 414903 399298 389939 390873 415509 435087 444381 396653 324918
$$ packed form
11135A39105L010K0348L8746J1556L75K4533M6903k9520k0370N094m4711j9234
11123A75835J3356O0526M9149J5239j7979j3204j2130l4065J1179p1840j8453
11112A57613K7826M3529L1769J9894l4310n729J6272j613K7204l7717k7614N313
11100B22437k3460k4286n0497P548M2337K8861L1364J1675r763N5961J3389p1259
11088B34307n102k6301O096J0237j3421K9952K9964J3666k5019N1983M4727j0487
11076C40602J2574Q423l4998n7603q512M4654M4332J3973l5357J0231J7180k0796
11064C34703M69J9464N5052o945p7757Q776M0003j1913K1645L5112k9233m9998
11052C39378M424l079J0606O5593k019j5605r359R34K4636J9578R294m7728p1735
$$ plain form
11039 324918 325523 316465 346346 417530 488447 452209 434121 445730 481097 489788 401713 394308
11027 394308 390391 422837 425944 415351 445512 442956 461117 469773 435445 392626 371880 382880
11015 382880 383061 408870 384123 333323 338985 338415 324090 379837 392097 401168 396387 407763 387212
11002 387212 372982 411400 402029 384368 383971 378656 325363 316909 312221 279581 222081 203928 212662
10989 212662 179265 215738 251910 248653 244429 253272 207718 168865 204046 221517 216494 279273
10977 279273 233213 181732 189323 241109 264576 227820 219601 170275 144862 130758 162158 155808
10965 155808 125990 119066 95295 90940 156564 191320 170073 174832 147021 139865 132038 158500
10953 158500 122837 108651 98957 59242 47004 107557 153471 148200 109578 70977 49875 45951
$$ packed form
11039C24918O05r058K9881P1184P0917l6238j8088J1609L5367Q691q8075p405
11027C94308l917L2446L107j0593L0161k556J8161Q656l4328m2819k0746J1000
11015C82880J81K5809k4747n0800N662n70j4325N5747J2260R071m781J1376k0551
11002C87212j4230L8418r371j7661l97n315n3293q454m688l2640n7500j8153Q734
10989B12662l3397L6473L6172l257m224Q843m5554l8853L5181J7471n023O2779
10977B79273m6060n1481P591N1786K3467l6756q219m9326k5413j4104L1400o350
10965A55808k9818o924k3771m355O5624L4756k1247M759k7811p156p827K6462
10953A58500l5663j4186r694l9715j2238O0553M5914n271l8622l8601k1102l924
$$ plain form
10941 45951 66887 92019 45040 25806 -755 -21631 -53483 -22264 -14709 -12158 -305 8472
10929 8472 32009 -10136 -221 53624 43962 55411 59709 59251 54312 2803 18302 70297 71843
10916 71843 52292 45242 73382 87713 103766 126680 94125 38133 1337 -9148 -19324 12589
10904 12589 75253 66316 62248 109569 107717 83661 61493 37490 59696 67279 42819 8274
10892 8274 31718 20755 15800 34903 42285 30188 53513 58528 33939 19660 22211 77758 97374
10879 97374 90479 62448 56474 25279 -7400 -24464 5662 -24878 -42132 -41647 -7860 -16007 12587
10866 12587 41148 29115 15031 4764 -5657 -25697 24487 77748 44092 24025 26332 50454
10854 50454 81913 53795 71899 141896 138716 121623 92210 11881 3361 35394 69303 131441
$$ packed form
10941D5951K0936K5132m6979j9234k6561k0876l1852L1219P555K551J1853Q777
10929H472K3537m2145R915N3845r662J1449M298m58m939n1509J5499N1995J546
10916G1843j9551p050K8140J4331J6053K2914l2555n5992l6796j0485j0176L1913
10904A2589O2664q937m068M7321j852k4056k2168k4003K2206P583k4460l4545
10892H274K3444j0963m955J9103P382j2097K3325N015k4589j4279K551N5547J9616
10879I7374o895k8031n974l1195l2679j7064L0126l0540j7254M85L3787q147K8594
10866A2587K8561j2033j4084j0267j0421k0040N0184N3261l3656k0067K307K4122
10854E0454L1459k8118J8104O9997l180j7093k9413q0329q520L2033L3909O2138
$$ plain form
10842 131441 114003 92361 42234 32152 55057 88722 69891 83983 113337 130061 106331
10831 106331 83428 96127 76117 66679 63054 109745 153003 153771 126855 66877 100316 161136
10819 161136 161946 122985 101552 83228 65500 31989 21896 13975 114370 143959 127111 81961
10807 81961 75454 98738 111261 113306 118181 129362 126546 109650 76163 69398 48558 62370 67908
10794 67908 95689 99262 89117 64901 29324 -4122 -8902 12977 33905 46096 30852 2374
10782 2374 42526 55601 82486 55842 901 33254 102946 108624 117066 108989 74803 69704 70226
10769 70226 69849 88158 143385 111480 73045 34466 24428 67501 61149 54584 96630 97463 69722
10756 69722 70402 67668 40600 38877 23597 36674 9268 -15300 -29593 31461 54493 75143
$$ packed form
10842A31441j7438k1642n0127j0082K2905L3665j8831J4092K9354J6724k3730
10831A06331k2903J2699k0010r438l625M6691M3258P68k6916n9978L3439O0820
10819A61136Q10l8961k1433j8324j7728l3511j0093p921J00395K9589j6848m5150
10807H1961o507K3284J2523K045M875J1181k816j6896l3487o765k0840J3812N538
10794F7908K7781L573j0145k4216l5577l3446m780K1879K0928J2191j5244k8478
10782B374M0152J3075K6885k6644n4941L2353O9692N678Q442q077l4186n099N22
10769G0226l77J8309N5227l1905l8435l8579j0038M3073o352o565M2046Q33k7741
10756F9722O80k734k7068j723j5280J3077k7406k4568j4293O1054K3032K0650
$$ plain form
10744 75143 47514 21714 16688 39940 34332 3215 -4633 6466 -18424 22003 81143 126835
10732 126835 107412 86573 111310 123077 139279 147946 85914 78299 36271 6057 29825 45837
10720 45837 58091 45817 -4323 17515 52500 36387 37614 84217 76924 92839 73432 4985
10708 4985 2514 15842 828 28819 30052 44047 52368 -23651 -68437 -41056 -28330 -38633
10696 -38633 -21012 4514 45498 41033 24853 44078 56227 58522 40092 31931 17182 -34220
10684 -34220 -23714 4152 41689 40079 56417 19556 19204 11935 10534 67564 89130 65221 36014
10671 36014 -45985 -86756 -30971 3110 -4121 24376 29598 31679 55871 47233 62049 43862
10659 43862 56906 45423 34262 -2773 -46976 -47391 -16904 -64033 -55839 -23507 -16206 -50125
$$ packed form
10744G5143k7629k5800n026K3252n608l1117p848J1099k4890M0427N9140M5692
10732A26835j9423k0839K4737J1767J6202Q667o2032p615m2028l0214K3768J6012
10720D5837J2254j2274n0140K1838L4985j6113J227M6603p293J5915j9407o8447
10708D985k471J3328j5014K7991J233J3995Q321p6019m4786K7381J2726j0303
10696c8633J7621K5526M0984m465j6180J9225J2149K295j8430q161j4749n1402
10684c4220J0506K7866L7537j610J6338l6861l52p269j401N7030K1566k3909k9207
10671C6014q1999m0771N5785L4081p231K8497N222K081K4192q638J4816j8187
10659D3862J3044j1483j1161l7035m4203m15L0487m7129Q194L2332P301l3919
$$ plain form
10647 -50125 -65127 -44750 -23039 -21499 10489 13125 7585 -24609 -7155 60627 110056 98104
10635 98104 106618 87174 89011 55917 27026 22376 3544 23478 35302 1310 -952 -12740
10623 -12740 -33642 -33401 -42668 -36247 -19961 -26617 13949 15895 -1809 -12051 4105 39372 38834
10610 38834 89063 82283 79603 80171 53839 43491 62319 26367 -1019 -28713 -43775 -39957 18618
10597 18618 77348 103730 88602 55297 30198 2433 25224 11685 4993 -11778 14953 56266
10585 56266 66310 42681 60587 6497 57906 90805 95076 76678 31719 1474 -24371 -53175
10573 -53175 -31628 2050 27907 67962 79877 95360 79921 32064 23346 22296 33891 22813
10561 22813 24890 16550 45747 52571 26729 10270 37241 62914 25625 24913 29433 11198 -24727
$$ packed form
10647e0125j5002K0377K1711J540L1988K636n540l2194J7454O7782M9429j1952
10635I8104Q514j9444J837l3094k8891m650j8832J9934J1824l3992k262j1788
10623a2740k0902K41r267O421J6286o656M0566J946j7704j0242J6156L5267n38
10610C8834N0229o780k680N68k6332j0348J8828l5952k7386k7694j5062L818N8575
10597A8618N8730K6382j5128l3305k5099k7765K2791j3539o692j6771K6731M1313
10585E6266J0044k3629J7906n4090N1409L2899M271j8398m4959l0245k5845k8804
10573e3175K1547L3678K5857M0055J1915J5483j5439m7857q718j050J1595j1078
10561B2813K077q340K9197O824k5842j6459K6971K5673l7289p12M520j8235l5925
$$ plain form
10548 -24727 -8089 31600 4014 -33553 -47550 -28189 10997 31174 56467 101845 71085 61883
10536 61883 53875 71184 93624 18624 10240 21261 34520 50695 75023 49640 52180 33014
10524 33014 27370 46765 81093 67627 32679 47069 55709 59662 122593 175294 220481 278399
10512 278399 311689 284873 258171 256147 276849 274802 260855 231866 206165 204529 198738 157499
10500 157499 122241 144452 185230 189858 132258 107969 162145 156351 83743 70112 69910 10825
10488 10825 6743 48663 24013 37804 38070 73763 98148 104849 80635 33241 34317 33443 84714
10475 84714 138456 144445 124540 111570 130122 148709 147922 174311 226648 229851 213231 226001
10463 226001 247309 319519 317078 347806 351378 355522 355792 370914 316338 250660 205453 195680 159779
$$ packed form
10548b4727J6638L9689k7586l7567j3997J9361L9186K0177K5293M5378l0760r202
10536F1883q008J7309K2440p5000q384J1021J3259J6175K4328k5383K540j9166
10524C3014n644J9395L4328j3466l4948J4390Q640L953O2931N2701M5187N7918
10512B78399L3290k6816k6702k024K0702k047j3947k8989k5701j636n791m1239
10500A57499l5258K2211M0778M628n7600k4289N4176n794p2608j3631k02n9085
10488A0825m082M1920k4650J3791K66L5693K4385O701k4214m7394J076q74N1271
10475H4714N3742N989j9905j2970J8552J8587p87K6389N2337L203j6620J2770
10463B26001K1308P2210k441L0728L572M144K70J5122n4576o5678m5207r773l5901
$$ plain form
10450 159779 126677 110693 131807 103913 100307 112968 151445 201376 205986 186037 146936 155062
10438 155062 132694 87447 60240 84504 124745 142694 149993 138791 107703 77562 6702 35597
10426 35597 55752 37739 58110 68409 87053 91989 86899 38164 27213 76793 79380 50161
10414 50161 88117 182886 269346 311933 323702 294744 260002 256587 271284 233819 179117 148638
10402 148638 144872 115033 45418 64572 59693 72980 20255 10654 38570 67798 36393 -35772
10390 -35772 1100 58187 73337 25016 -39221 -22780 -1388 8149 -26147 -35244 -39053 -56562
10378 -56562 -83243 -44309 -32395 -5064 -27121 -39237 -49744 -79034 -80135 -81755 -107877 -91020
10366 -91020 -60907 -19607 2383 -34879 3936 22493 13965 12705 27594 46613 37300 35257
$$ packed form
10450A59779l3102j5984K1114k7894l606J2661L8477M9931M610j9949l9101Q126
10438A55062k2368m5247k7207K4264M0241J7949P299j1202l1088l0141p0860K8895
10426C5597K0155j8013K0371J0299J8644M936n090m8735j0951M9580K587k9219
10414E0161L7956R4769Q6460M2587J1769k8958l4742l415J4697l7465n4702l0479
10402A48638l766k9839o9615J9154m879J3287n2725r601K7916K9228l1405p2165
10390c5772L6872N7087J5150m8321o4237J6441K1392R537l4296r097l809j7509
10378e6562k6681L8934J1914K7331k2057j2116j0507k9290j101j620k6122J6857
10366i1020L0113M1300K1990l7262L8815J8557q528j260J4889J9019r313k043
$$ plain form
10354 35257 38749 39701 39389 67671 72486 60638 38967 13540 28127 19962 45522 34038 40007
10341 40007 23184 9424 -20398 -58686 -46006 -8665 -2255 -50567 -50142 -21859 6540 44084
10329 44084 38154 38394 35325 10733 25896 40343 14605 -2211 29075 95344 78452 28783
10317 28783 5465 3125 -5476 -15673 -3602 45829 69388 90412 76337 45856 46492 41471 46460
10304 46460 40677 -5382 -40357 -11427 23551 47784 68725 53766 118806 161831 125594 71990
10292 71990 82264 113000 59006 19436 16545 31573 72171 74159 52859 92068 108583 76621
10280 76621 61417 81319 83458 82277 74948 78287 32930 45791 57488 29764 2816 14470
10268 14470 34254 59727 79952 97971 78711 69335 87618 102618 93115 71349 80483 96958
$$ packed form
10354C5257L492R52l12K8282M815j1848k1671k5427J4587q165K5560j1484N969
10341D0007j6823j3760k9822l8288J2680L7341O410m8312M25K8283K8399L7544
10329D4084n930K40l069k4592J5163J4447k5738j6816L1286O6269j6892m9669
10317B8783k3318k340q601j0197J2071M9431K3559K1024j4075l0481O36n021M989
10304D6460n783m6059l4975K8930L4978K4233K0941j4959O5040M3025l6237n3604
10292G1990J0274L0736n3994l9570k891J5028M0598J988k1300L9209J6515l1962
10280G6621j5204J9902K139j181p329L339m5357J2861J1697k7724k6948J1654
10268A4470J9784K5473K0225J8019j9260r376J8283J5000r503k1766R134J6475
$$ plain form
10256 96958 123400 80261 54065 41166 58795 51636 8615 1173 11021 25681 41418 55573
10244 55573 71915 106611 40540 25647 34206 31800 94446 167940 172946 170844 129949 124026 122264
10231 122264 87564 89889 140638 113979 92141 113460 175343 169343 179679 177504 208116 281308
10219 281308 311610 316611 334062 289529 242971 236466 213987 196642 232369 247725 261536 316432
10207 316432 341141 307580 269366 215495 230222 212944 212539 221894 198092 248336 256579 229744
10195 229744 209530 227875 193447 181144 212191 150355 97981 100041 106475 122143 180839 191370
10183 191370 175454 183269 176007 194068 243005 217872 216967 222189 228385 225321 214414 196642 219821
10170 219821 259311 250211 234637 265634 259612 269047 271582 227539 209125 208824 186354 215595 188182
$$ packed form
10256I6958K6442m3139k6196j2899J7629p159m3021p442R848J4660J5737J4155
10244E5573J6342L4696o6071j4893Q559k406O2646P3494N006k102m0895n923j762
10231A22264l4700K325N0749k6659k1838K1319O1883o000J0336k175L0612P3192
10219B81308L0302N001J7451m4533m6558o505k2479j7345L5727J5356J3811N4896
10207C16432K4709l3561l8214n3871J4727j7278m05R355k3802N0244Q243k6835
10195B29744k0214J8345l4428j2303L1047o1836n2374K060O434J5668N8696J0531
10183A91370j5916P815p262J8061M8937k5133r05N222O196l064j0907j7772K3179
10170B19821L9490r100j5574L0997o022R435K535m4043j8414l01k2470K9241k7413
$$ plain form
10157 188182 129995 110114 141522 111871 122287 165692 173046 160484 206961 216857 140612 93358
10145 93358 109337 134831 127906 103973 110387 144909 116526 113663 79931 77975 82501 85416 81472
10132 81472 85427 81867 58096 60648 55659 17887 15730 13799 57977 98435 131948 180883 236556
10119 236556 277315 310978 312064 326137 360957 366105 363875 336899 261681 266140 245583 217728
10107 217728 257291 251148 212746 204550 195458 135695 109575 115707 134032 152888 132217 101432
10095 101432 53603 59842 41239 25537 20217 -43957 -13937 55617 62993 41449 17419 -4101
10083 -4101 -10130 14066 7994 -3301 37150 52062 63166 32351 24606 47937 22028 -16619
10071 -16619 -15107 -3770 15185 -3147 39098 52439 53750 56471 82688 88458 -1585 -226 -3274
$$ packed form
10157A88182n8187j9881L1408k9651J0416M3405P354j2562M6477R896p6245m7254
10145I3358J5979K5494o925k3933O414L4522k8383k863l3732j956M526K915l944
10132H1472L955l560k3771K552m989l7772k157j931M4178M0458L3513M8935N5673
10119B36556M0759L3663J086J4073L4820N148k230k6976p5218M459k0557k7855
10107B17728L9563o143l8402q196r092n9763k6120O132J8325J8856k0671l0785
10095A01432m7829O239j8603j5702n320o4174L0020O9554P376k1544k4030k1520
10083d101o029K4196o072j1295M0451J4912J1104l0815p745K3331k5909l8647
10071a6619J512J1337J8955j8332M2245J3341J311K721K6217N770r0043J359l048
$$ plain form
10058 -3274 22398 72036 59102 10415 -32448 -61097 -18170 11654 33404 20143 -8751 521
10046 521 -5964 41021 17871 2060 -11364 -10203 10864 -12406 -50881 -41328 -45068 -31354 -2093
10033 -2093 -5233 14214 23402 29613 58229 79782 45698 -25125 -39000 -27134 -29365 -44709 -52927
10020 -52927 -26096 -41875 -35172 -32645 -21281 -22189 -27623 -20632 -48310 -47528 -91069 -81828 -63010
10007 -63010 -11552 -7395 -42186 -17519 7148 35678 39200 40894 85572 80024 79832 91350 99564
9994 99564 41704 17827 37785 13673 12439 78431 143632 132778 78619 50310 61127 99194
9982 99194 112865 61221 -753 -27568 -3723 -23241 -30929 9713 47983 47375 9838 -1388
9970 -1388 -27479 -24457 -904 4432 -41235 -60869 -14309 -32584 -15153 -13409 -57229 -91312 -96785
$$ packed form
10058c274K5672M9638j2934m8687m2863k8649M2927K9824K1750j3261k8894R272
10046E21o485M6985k3150j5811j3424J161K1067k3270l8475R553l740J3714K9261
10033b093l140J9447R188O211K8616K1553l4084p0823j3875J1866k231j5344q218
10020e2927K6831j5779O703K527J1364r08n434O991k7678P82m3541R241J8818
10007f3010N1458M157l4791K4667K4667K8530L522J694M4678n548j92J1518Q214
9994I9564n7860k3877J9958k4112j234O5992O5201j0854n4159k8309J0817L8067
9982I9194J3671n1644o1974k6815K3845j9518p688M0642L8270o08l7537j1226
9970a388k6091L022K3553N336m5667j9634M6560j8275J7431J744m3820l4083n473
$$ plain form
9957 -96785 -112080 -91294 -96887 -67344 -14770 -63688 -74008 -26274 -11867 -14825 4866 60608
9945 60608 35468 6744 -44244 -70539 -82144 -94585 -115506 -89923 -66252 -14394 31466 70908
9933 70908 54697 22681 -33010 -32578 -21093 -22985 -29688 -217 -4807 -27154 6092 68885 2485
9920 2485 -82489 -90146 -51290 -39683 -32577 -52042 -27440 -7460 -819 -366 970 29066 64951
9907 64951 49439 60991 48703 24459 43363 97854 107421 93110 93405 153372 178616 224458
9895 224458 299966 385678 384201 381842 280417 150645 83835 79886 93985 84945 79154 75186
9883 75186 75173 96177 92964 99564 97272 83962 94637 81888 60846 71368 27563 -21481 -56857
9870 -56857 -57859 -28980 3580 13552 44897 90741 88741 69282 68840 93117 61456 69172 56629
$$ packed form
9957i6785j5295K0786n593K9543N2574m8918j0320M7734J4407k958J9691N5742
9945F0608k5140k8724n0988k6295j1605j2441k0921K5583K3671N1858M5860L9442
9933G0908j6211l2016n5691M32J1485j892o703K9471m590k2347L3246O2793o6400
9920B485q4974p657L8856J1607P106j9465K4602J9980O641M53J336K8096L5885
9907F4951j5512J1552j2288k4244J8904N4491R567j4311K95N9967K5244M5842
9895B24458P5508Q5712j477k359j01425j29772o6810l949J4099r040n791l968
9883G5186j3K1004l213O600k292j3310J0675j2749k1042J0522m3805m9044l5376
9870e6857j002K8879L2560R972L1345M5844k000j9459m42K4277l1661P716j2543
$$ plain form
9857 56629 16187 20948 52113 99129 143175 124462 133712 110720 101932 116513 119040 126096 170398
9844 170398 220897 195059 184409 167791 129435 172234 167658 186653 194019 232851 240411 304749
9832 304749 374184 466759 519342 499362 363247 308810 244320 187062 154277 136001 130184 97174
9820 97174 124618 147881 122475 81749 68078 83686 136876 112071 120588 145633 168283 184487
9808 184487 145541 135997 169957 134715 146036 112956 59390 53029 62609 70010 93698 123982
9796 123982 178080 193771 211797 288968 299955 264994 256111 219375 197323 223505 247485 287159
9784 287159 327940 322253 372741 423190 433851 402268 357801 316839 292909 294388 293455 313055
9772 313055 315417 271777 305885 359658 360990 380121 346314 370236 414825 478683 505283 540680
$$ packed form
9857E6629m0442M761L1165M7016M4046j8713R250k2992q788J4581K527P056M4302
9844A70398N0499k5838j0650j6618l8356M2799m576J8995P366L8832P560O4338
9832C04749O9435R2575N2583j9980j36115n4437o4490n7258l2785j8276n817l3010
9820I7174K7444K3263k5406m0726j3671J5608N3190k4805Q517K5045K2650J6204
9808A84487l8946r544L3960l5242J1321l3080n3566o361R580P401K3688L0284
9796A23982N4098J5691J8026P7171J0987l4961q883l6736k2052K6182K3980L9674
9784B87159M0781n687N0488N0449J0661l1583m4467m0962k3930J479r33J9600
9772C13055K362m3640L4108N3773J332J9131l3807K3922M4589O3858K6600L5397
$$ plain form
9760 540680 515641 480090 561352 624495 648205 643850 640236 689611 678317 638092 621578 654346
9748 654346 686879 708514 755586 809702 767739 751295 790655 807576 812636 784481 795490 790055
9736 790055 801724 856085 887482 930907 924215 896289 936175 918511 859043 816118 820862 852213
9724 852213 885673 883914 880207 895050 951261 962890 991594 1071200 1064570 1066310 1093090 1122075
9712 1122075 1147829 1171414 1172341 1212577 1201402 1196833 1183626 1168963 1113095 1071285 1047287 1014833
9700 1014833 990483 986863 994305 986445 948433 929432 917790 902723 896157 902129 943648 912488
9688 912488 907910 930384 891221 905428 927866 923328 907293 905805 919788 954345 943601 906958
9676 906958 942863 902685 930288 919694 855897 881824 871168 837097 856413 825507 809362 770320
$$ packed form
9760E40680k5039l5551Q1262O3143K3710m355l614M9375j1294m0225j6514L2768
9748F54346L2533K1635M7072N4116m1963j6444L9360J6921N060k8155J1009n435
9736G90055J1669N4361L1397M3425o692k7926L9886j7664n9468m2925M744L1351
9724H52213L3460j759l707J4843N6211J1629K8704P9606o630J740K6780K8985
9712A122075K5754K3585R27M0236j1175m569j3207j4663n5868m1810k3998l2454
9700A014833k4350l620P442p860l8012j9001j1642j5067o566N972M1519l1160
9688I12488m578K2474l9163J4207K2438m538j6035j488J3983L4557j0744l6643
9676I06958L5905m0178K7603j0594o3797K5927j0656l4071J9316l0906j6145l9042
$$ plain form
9664 770320 671644 629382 633606 644154 626656 620212 620851 585211 538672 533873 543114 511820 481366
9651 481366 444114 429358 395112 375738 326966 337715 326210 311422 309693 355258 347368 341225
9639 341225 362751 423046 435300 460841 424254 384338 380975 353241 339086 319636 312747 289766
9627 289766 260597 238712 189513 128662 84694 90628 83174 81690 76932 82366 87100 68204 -7500
9614 -7500 27902 87616 119819 89966 84010 127989 129623 87312 108803 100410 132603 151938 198369
9601 198369 181564 206368 189666 140214 166844 220992 224070 230520 213881 175120 166586 145016
9589 145016 146429 163711 144489 182101 175347 180937 175056 157132 193185 230265 259077 272886
9577 272886 219813 208712 177118 165077 219686 272787 332048 399243 411835 419103 398362 353583
$$ packed form
9664G70320r8676m2262M224J0548j7498o444O39l5640m6539m799R241l1294l0454
9651D81366l7252j4756l4246j9374m8772J0749j1505j4788j729M5565p890o143
9639C41225K1526O0295J2254K5541l6587l9916l363k7734j4155j9450o889k2981
9627B89766k9169k1885m9199o0851m3968N934p454j484m758N434M734j8896p5704
9614g500L5402N9714L2203k9853n956M3979J634m2311K1491q393L2193J9335M6431
9601A98369j6805K4804j6702m9452K6630N4148L078O450j6639l8761q534k1570
9589A45016J413J7282j9222L7612o754N590n881j7924L6053L7080K8812J3809
9577B72886n3073j1101l1594j2041N4609N3101N9261O7195J2592P268k0741m4779
$$ plain form
9565 353583 332275 375855 411996 420413 426426 464719 456744 490242 518015 493264 506785 559061
9553 559061 556502 502307 444530 440496 457366 496131 507080 487469 468326 455189 453144 495919
9541 495919 497812 495688 469233 431652 421624 407893 358407 309931 319146 290526 262377 269887
9529 269887 291766 290889 254198 275373 342994 323791 325669 309232 289822 238536 232968 278724
9517 278724 282566 263802 265156 288342 249280 245331 249567 282669 255470 195227 186419 251619 266134
9504 266134 301896 285515 230207 240292 216384 208282 276769 333140 341788 375489 411952 336814
9492 336814 343909 389125 387471 424389 459725 454107 435877 446932 472612 485391 508593 485966
9480 485966 494686 474361 482521 477188 515737 541045 566487 610267 615056 637804 646611 631103 603327
$$ packed form
9565C53583k1308M3580L6141Q417O013L8293p975L3498K7773k4751J3521N2276
9553E59061k559n4195n7777m034J6870L8765J0949j9611j9143j3137k045M2775
9541D95919J893k124k6455l7581j0028j3731m9486m8476R215k8620k8149P510
9529B69887K1879q77l6691K1175O7621j9203J878j6437j9410n1286n568M5756
9517B78724L842j8764J354K3186l9062l949M236L3102k7199o0243q808O5200J4515
9504B66134L5762j6381n5308J0085k3908q102O8487N6371Q648L3701L6463p5138
9492C36814P095M5216j654L6918L5336n618j8230J1055K5680J2779K3202k2627
9480D85966Q720k0325Q160n333L8549K5308K5442M3780M789K2748Q807j5508k7776
$$ plain form
9467 603327 649171 712589 755856 720023 730279 762570 766480 781356 781399 791380 852823 851804 839856
9454 839856 840783 904227 950104 988401 1062785 1141729 1228210 1268613 1294655 1300650 1320414 1335748
9442 1335748 1392317 1415786 1387514 1390294 1391203 1393836 1405772 1467187 1485908 1500075 1567797 1595811
9430 1595811 1590617 1573012 1571905 1592956 1607601 1648936 1682861 1703952 1653444 1626664 1689447 1732027
9418 1732027 1766040 1815427 1855214 1888415 1993861 2088521 2136179 2233015 2318429 2372595 2446994
9407 2446994 2563996 2707961 2808884 2855603 2957537 3036175 3110116 3192800 3316127 3447414
9397 3447414 3548598 3668006 3829196 3974576 4093547 4202271 4353841 4558823 4734664 4945015
9387 4945015 5171774 5464748 5773559 6085640 6402467 6745794 7119218 7516836 7952512 8403836
$$ packed form
9467F03327M5844O3418M3267l5833J0256L2291L910J4876M3R981O1443j019j1948
9454H39856R27O3444M5877L8297P4384P8944Q6481M0403K6042N995J9764J5334
9442A335748N6569K3469k8272K780R09K633J1936O1415J8721J4167O7722K8014
9430A595811n194j7605j107K1051J4645M1335L3925K1091n0508k6780O2783M2580
9418A732027L4013M9387L9787L3201J05446R4660M7658R6836Q5414N4166P4399
9407B446994J17002J43965J00923M6719J01934P8638P3941Q2684J23327J31287
9397C447414J01184J19408J61190J45380J18971J08724J51570K04982J75841K10351
9387D945015K26759K92974L08811L12081L16827L43327L73424L97618M35676M51324
$$ plain form
9377 8403836 8803426 9174301 9608811 10099369 10568731 11020800 11578580 12240318 12977815 13717167
9367 13717167 14470164 15318889 16211119 17189986 18256566 19370330 20601298 21899487 23188346
9358 23188346 24563662 25908706 27150630 28328136 29422804 30593638 31816528 33178958
9350 33178958 34625720 36099168 37564955 38999449 40449624 42033160 43700819 45584219
9342 45584219 47835790 50638232 54211173 58620867 63898030 70086013 77125162 84771473
9334 84771473 92692264 100519678 108001965 115161762 122236341 129732331 138173936 147809944
9326 147809944 158308933 169057447 179335225 188536812 196519054 204019608 211983343 220958269
9318 220958269 230976189 241568241 252305845 263337192 275305316 288640131 302633679
$$ packed form
9377H403836L99590L70875M34510M90558M69362M52069N57780O61738P37497P39352
9367A3717167P52997Q48725Q92230R78867J066580J113764J230968J298189J288859
9358B3188346J375316J345044J241924J177506J094668J170834J222890J362430
9350C3178958J446762J473448J465787J434494J450175J583536J667659J883400
9342D5584219K251571K802442L572941M409694N277163O187983P039149P646311
9334H4771473P920791P827414P482287P159797P074579P495990Q441605R636008
9326A47809944J0498989J0748514J0277778R201587P982242P500554P963735Q974926
9318B20958269J0017920J0592052J0737604J1031347J1968124J3334815J3993548
$$ plain form
9311 302633679 316301248 329118667 341258405 353853649 368293953 385665926 406646747
9304 406646747 431427303 459079227 486520452 506838315 512210305 500019423 474078158
9297 474078158 441926455 410856883 384380895 362716954 344758806 328861615 313546474
9290 313546474 297796412 281357073 264732631 248803617 234611024 222744238 213265471
9283 213265471 205864132 200007298 195068667 190151961 184538064 177671790 169361909 159828470
9275 159828470 149619901 139180934 128906080 119241948 110877668 104286086 99665269 96667035
9267 96667035 94483959 92491019 90088573 86865662 82818764 77979204 72420536 66603155
9259 66603155 61116936 56353084 52345113 48862827 45663750 42721298 40080937 37789096
$$ packed form
9311C02633679J3667569J2817419J2139738J2595244J4440304J7371973K0980821
9304D06646747K4780556K7651924K7441225K0317863N371990j2190882k5941265
9297D74078158l2151703l1069572k6475988k1663941j7958148j5897191j5315141
9290C13546474j5750062j6439339j6624442j5929014j4192593j1866786r478767
9283B13265471p401339n856834m938631m916706n613897o866274q309881r533439
9275A59828470j0208569j0438967j0274854r664132q364280o591582m620817k998234
9267I6667035k183076j992940k402446l222911m046898m839560n558668n817381
9259F6603155n486219m763852m007971l482286l199077k942452k640361k291841
$$ plain form
9251 37789096 35883341 34297505 32936893 31692939 30579328 29448942 28183911 26814163
9243 26814163 25441166 23968076 22481952 21113517 19969564 19039947 18240411 17629036 17220748
9234 17220748 16842440 16428644 15959972 15341577 14654775 13903136 13183935 12493846 11835725
9225 11835725 11265434 10750049 10301619 9972859 9679066 9388725 9184571 9046869 8875049
9216 8875049 8629617 8342512 7972412 7702953 7529096 7435397 7326358 7141262 6987466 6826313
9206 6826313 6598086 6361955 6165146 6022927 5890433 5747749 5632576 5538445 5502770 5460629
9196 5460629 5373572 5290506 5188470 5101340 5009367 4917499 4862215 4778756 4707693 4661923 4632448
9185 4632448 4578150 4537052 4550616 4536243 4517756 4495011 4441582 4341061 4202416 4074447 3993961
$$ packed form
9251C7789096j905755j585836j360612j243954j113611j130386j265031j369748
9243B6814163j372997j473090j486124j368435j143953r29617p99536o11375m08288
9234A7220748l78308m13796m68672o18395o86802p51639p19201o90089o58121
9225A1835725n70291n15385m48430l28760k93793k90341k04154j37702j71820
9216H875049k45432k87105l70100k69459j73857r3699j09039j85096j53796j61153
9206F826313k28227k36131j96809j42219j32494j42684j15173r4131l5675m2141
9196E460629q7057q3066j02036q7130r1973r1868n5284q3459p1063m5770k9475
9185D632448n4298m1098J3564j4373j8487k2745n3429j00521j38645j27969q0486
$$ plain form
9174 3993961 3846934 3717907 3607036 3506706 3422990 3366422 3253711 3152189 3063548 2967044
9164 2967044 2887624 2829911 2769215 2713974 2653543 2608956 2542808 2480053 2470392 2501145 2495271 2438360
9152 2438360 2353914 2301971 2319160 2348689 2344009 2322754 2292728 2322759 2303340 2292515 2261944 2222606
9140 2222606 2173510 2135841 2122922 2114907 2051230 2017814 1987669 1957232 1931003 1948429 1943374 1904502
9128 1904502 1903314 1885037 1883877 1854511 1852627 1872949 1864416 1786964 1689696 1633974 1668377 1721911
9116 1721911 1741276 1858594 1877897 1808032 1728937 1690059 1681375 1709180 1668617 1655197 1659887 1679842
9104 1679842 1672910 1700070 1705763 1680402 1637505 1631240 1615543 1617080 1540937 1469038 1429978 1433033
9092 1433033 1482281 1477127 1413044 1359455 1376861 1380120 1358594 1412336 1429079 1412908 1402799 1358027
$$ packed form
9174C993961j47027j29027j10871j00330q3716n6568j12711j01522q8641r6504
9164B967044p9420n7713o0696n5241o0431m4587o6148o2755r661L0753n874n6911
9152B438360q4446n1943J7189K9529m680k1255l0026L0031j9419j0825l0571l9338
9140B222606m9096l7669j2919q015o3677l3416l0145l0437k6229J7426n055l8872
9128A904502j188j8277j160k9366j884K0322q533p7452r7268n5722L4403N3534
9116A721911J9365J17318J9303o9865p9095l8878q684K7805m0563j3420M690J9955
9104A679842o932K7160N693k5361m2897o265j5697J537p6143p1899l9060L055
9092A433033M9248n154o4083n3589J7406L259k1526N3742J6743j6171j0109m4772
$$ plain form
9080 1358027 1368018 1372684 1397316 1355401 1321560 1314730 1304670 1310072 1346123 1342905 1303185 1339084
9068 1339084 1390278 1398297 1417791 1444135 1429298 1342978 1256555 1218251 1232551 1207497 1153048 1140297
9056 1140297 1157237 1211191 1209297 1204466 1182172 1160653 1154373 1155918 1148102 1172299 1180996 1161985 1178860
9043 1178860 1210278 1191611 1213774 1187488 1151393 1135974 1119361 1117434 1080563 1044293 1100331 1182287
9031 1182287 1138520 1155112 1196983 1191858 1158664 1146666 1113529 1126550 1143702 1151817 1189786 1211993
9019 1211993 1200755 1229307 1250381 1267177 1242441 1159979 1118181 1132469 1134036 1136025 1122637 1118248
9007 1118248 1113184 1060311 1020492 1012365 1017498 991181 983283 1031015 1048530 1083377 1072211 1021409
8995 1021409 1004648 1021902 1045033 1069453 1059280 1050556 1022381 1059614 1085484 1080814 1058525 1081126
$$ packed form
9080A358027R991M666K4632m1915l3841o830j0060N402L6051l218l9720L5899
9068A339084N1194Q019J9494K6344j4837q6320q6423l8304J4300k5054n4449j2751
9056A140297J6940N3954j894m831k2294k1519o280J545p816K4197Q697j9011J6875
9043A178860L1418j8667K2163k6286l6095j5419j6613j927l6871l6270N6038Q1956
9031A182287m3767J6592M1871n125l3194j1998l3137J3021J7152Q115L7969K2207
9019A211993j1238K8552K1074J6796k4736q2462m1798J4288J567J989j3388m389
9007A118248n064n2873l9819q127N133k6317p898M7732J7515L4847j1166n0802
8995A021409j6761J7254K3131K4420j0173q724k8175L7233K5870m670k2289K2601
$$ plain form
8983 1081126 1074026 1090495 1104112 1122543 1133848 1086485 1053670 1038606 1077207 1169984 1203193 1253855
8971 1253855 1320505 1343461 1320671 1348950 1394862 1409554 1456168 1484084 1490634 1487117 1447562 1376887
8959 1376887 1346033 1344700 1343909 1295597 1296944 1262221 1270075 1281986 1262904 1251803 1236868 1244043 1258238
8946 1258238 1251495 1233736 1232115 1228179 1213082 1244006 1289347 1357927 1419848 1484532 1525993 1515019
8934 1515019 1533079 1624674 1693355 1719215 1753184 1795532 1838941 1911800 1946691 1964042 1943563
8923 1943563 1919641 1915837 1979847 2011255 2032639 2086909 2087543 2075209 2062407 1997787 1944939 1891956
8911 1891956 1855534 1819920 1753674 1720851 1715659 1710299 1703300 1734941 1777933 1783476 1809757 1857247
8899 1857247 1901896 1956883 1971746 1989517 1991172 2013635 2102941 2152297 2174568 2159324 2150202 2139722
$$ packed form
8983A081126p100J6469J3617J8431J1305m7363l2815j5064L8601R2777L3209N0662
8971A253855O6650K2956k2790K8279M5912J4692M6614K7916O550l517l9555p0675
8959A376887l0854j333p91m8312J347l4723P854J1911j9082j1101j4935P175J4195
8946A258238o743j7759j621l936j5097L0924M5341O8580O1921O4684M1461j0974
8934A515019J8060R1595O8681K5860L3969M2348M3409P2859L4891J7351k0479
8923A943563k3922l804O4010L1408K1384N4270O34j2334j2802o4620n2848n2983
8911A891956l6422l5614o6246l2823n192n360o999L1641M2992N543K6281M7490
8899A857247M4649N4987J4863J7771J655K2463Q9306M9356K2271j5244r122j0480
$$ plain form
8887 2139722 2166716 2183261 2124178 2051899 2011284 1907002 1839850 1814680 1759258 1733842 1759687
8876 1759687 1762362 1806115 1842328 1870037 1928837 1926228 1913492 1865133 1800952 1738720 1683840 1659425
8864 1659425 1673555 1648369 1596514 1604602 1633240 1663982 1702183 1710854 1680445 1653419 1595081 1532775
8852 1532775 1498606 1459885 1471750 1480958 1443801 1398878 1353775 1333617 1301063 1298531 1320832 1312513
8840 1312513 1260882 1255142 1259223 1278822 1258637 1215802 1159112 1097319 1130711 1164664 1128030 1122050
8828 1122050 1141423 1167428 1211981 1268175 1300473 1306196 1314615 1345145 1316487 1251389 1183565 1127472
8816 1127472 1124805 1140164 1142349 1087537 1090221 1108241 1097513 1067735 989712 954494 912581 937344
8804 937344 893403 887960 905111 894364 923483 988350 1019671 1060162 1027910 1014291 984436 970360
$$ packed form
8887B139722K6994J6545n9083p2279m0615j04282o7152k5170n5422k5416K5845
8876A759687K675M3753L6213K7709N8800k609j2736m8359o4181o2232n4880k4415
8864A659425J4130k5186n1855Q088K8638L0742L8201Q671l0409k7026n8338o2306
8852A532775l4169l8721J1865R208l7157m4923m5103k0158l2554k532K2301q319
8840A312513n1631n740M081J9599k0185m2835n6690o1793L3392L3953l6634n980
8828A122050J9373K6005M4553N6194L2298N723Q419L0530k8658o5098o7824n6093
8816A127472k667J5359K185n4812K684J8020j0728k9778p8023l5218m1913K4763
8804I37344m3941n443J7151j0747K9119O4867L1321M0491l2252j3619k9855j4076
$$ plain form
8792 970360 950970 890157 856994 835720 834487 838328 857784 845053 878353 930496 919433 908250
8780 908250 931949 948016 898636 880008 853511 852736 881807 921202 934584 913739 911230 906827
8768 906827 904290 907634 911633 898598 853508 856063 846569 850349 879596 878678 906691 908440 931940
8755 931940 888762 841862 918225 971073 958015 966742 981204 966884 1007396 1042070 1036335 1033885
8743 1033885 1054778 1047701 1069399 1083188 1043023 1058627 1044789 1019020 983471 979034 980224 989357
8731 989357 1001872 1104844 1197654 1186899 1212952 1254960 1244900 1229658 1242837 1285719 1317902
8720 1317902 1342510 1392956 1415008 1451016 1452603 1415095 1368442 1319687 1271478 1261425 1279231 1289364
8708 1289364 1283344 1285611 1340869 1424856 1455110 1442083 1420244 1399949 1365904 1350445 1393978 1401176
$$ packed form
8792I70360j9390o0813l3163k1274j233L841J9456j2731L3300N2143j1063j1183
8780I08250K3699J6067m9380j8628k6497p75K9071L9395J3382k0845k509m403
8768I06827k537L344L999j3035m5090K555r494L780K9247r18K8013J749K3500
8755I31940m3178m6900P6363N2848j3058Q727J4462j4320M0512L4674n735k450
8743A033885K0893p077K1698J3789m0165J5604j3838k5769l5549m437J190R133
8731I89357J2515J02972R2810j0755K6053M2008j0060j5242J3179M2882L2183
8720A317902K4608N0446K2052L6008J587l7508m6653m8755m8209j0053J7806J0133
8708A289364o020K267N5258Q3987L0254j3027k1839k0295l4045j5459M3533P198
$$ plain form
8696 1401176 1401663 1416766 1467379 1467249 1499992 1540900 1593545 1640362 1735378 1807781 1862319 1937208
8684 1937208 1993544 2110024 2176400 2209920 2254364 2252569 2218191 2136805 2025087 1919149 1864007
8673 1864007 1837580 1777919 1711274 1685782 1723331 1740396 1732675 1708820 1738432 1770183 1800527 1815738
8661 1815738 1857088 1898103 1847776 1801142 1788551 1767601 1745374 1720113 1716889 1679812 1677623 1711580
8649 1711580 1827648 1905837 1909832 1902651 1869588 1816102 1805913 1829683 1809297 1812287 1823422 1815465
8637 1815465 1838804 1844037 1827444 1869829 1930512 1952414 1889048 1853739 1834107 1807875 1760901 1720608
8625 1720608 1749952 1787518 1854938 1887533 1912964 1901350 1857023 1801940 1710033 1593917 1586650
8614 1586650 1567449 1533289 1523214 1484194 1435581 1482541 1487626 1509413 1540581 1591460 1629713 1647786
$$ packed form
8696A401176M87J5103N0613j30L2743M0908N2645M6817R5016P2403N4538P4889
8684A937208N6336J16480O6376L3520M4444j795l4378q1386j11718j05938n5142
8673A864007k6427n9661o6645k5492L7549J7065p721k3855K9612L1751L0344J5211
8661A815738M1350M1015n0327m6634j2591k0950k2227k5261l224l7077k189L3957
8649A711580J16068P8189L995p181l3063n3486j0189K3770k0386K990J1135p957
8637A815465K3339N233j6593M2385O0683K1902o3366l5309j9632k6232m6974m0293
8625A720608K9344L7566O7420L2595K5431j1614m4327n5083r1907j16116p267
8614A586650j9201l4160j0075l9020m8613M6960N085K1787L1168N0879L8253J8073
$$ plain form
8602 1647786 1639091 1607297 1642033 1658757 1673166 1660802 1681206 1735596 1811488 1850420 1913082 2006577
8590 2006577 2145816 2267477 2368908 2480982 2687706 2882321 3032359 3182703 3331733 3415041
8580 3415041 3501486 3654230 3802637 3914776 3923980 3819876 3701391 3498303 3251789 2995681
8570 2995681 2701081 2410854 2206000 2017662 1839603 1659126 1587288 1491531 1402195 1319053
8560 1319053 1276803 1265470 1261168 1247739 1188947 1171135 1110156 1032542 1010202 1009584 1000207 969145
8548 969145 992244 1008248 1012475 935426 902504 925722 960722 979847 977325 980732 949889 925325
8536 925325 940025 935906 890661 885266 866228 811949 796803 837769 849121 801823 750978 735752
8524 735752 709268 719488 715526 700044 686563 697123 706067 722366 733996 725251 710029 687906
$$ packed form
8602A647786q695l1794L4736J6724J4409j2364K0404N4390P5892L8932O2662R3495
8590B006577J39239J21661J01431J12074K06724J94615J50038J50344J49030Q3308
8580C415041Q6445J52744J48407J12139R204j04104j18485k03088k46514k56108
8570B995681k94600k90227k04854j88338j78059j80477p1838r5757q9336q3142
8560A319053m2250j1333m302j3429n8792j7812o0979p7614k2340o18r377l1062
8548I69145K3099J6004M227p7049l2922K3218L5000J9125k522L407l0843k4564
8536I25325J4700m119m5245n395j9038n4279j5146M0966J1352m7298n0845j5226
8524G35752k6484J0220l962j5482j3481J0560Q944J6299J1630q745j5222k2123
$$ plain form
8512 687906 712563 772605 748136 743755 763692 688410 632580 660089 678532 680230 674634 670110
8500 670110 676904 644506 600075 562045 560341 585122 617979 618561 582739 567788 571978 572075 588807
8487 588807 574407 561329 548254 539308 535352 548958 535538 510528 484908 469653 518559 573471
8475 573471 561389 558136 504844 468321 441261 464819 434049 403399 396584 404150 403964 440164 467108
8462 467108 441950 428020 460427 456297 442174 426788 414169 435470 515754 537133 466732 452564
8450 452564 447422 476923 481846 419308 370053 362368 383979 427989 453996 413393 412553 416619 434592
8437 434592 416310 425936 408821 403539 432828 414427 426595 455557 500924 479469 464242 470957
8425 470957 482426 453068 450948 420576 407218 389245 382880 401599 400328 424101 398540 373399
$$ packed form
8512F87906K4657O0042k4469m381J9937p5282n5830K7509J8443J698n596m524
8500F70110O794l2398m4431l8030j704K4781L2857N82l5822j4951M190R7J6732
8487E88807j4400j3078j3075q946l956J3606j3420k5010k5620j5255M8906N4912
8475E73471j2082l253n3292l6523k7060K3558l0770l0650o815P566j86L6200K6944
8462D67108k5158j3930L2407m130j4123j5386j2619K1301Q0284K1379p0401j4168
8450D52564n142K9501M923o2538m9255p685K1611M4010K6007m0603q40M066J7973
8437D34592j8282R626j7115n282K9289j8401J2168K8962M5367k1455j5227O715
8425D70957J1469k9358k120l0372j3358j7973o365J8719j271K3773k5561k5141
$$ plain form
8413 373399 361148 356496 364865 370803 364222 373395 395694 391493 405509 405011 437151 388665 352590
8400 352590 394253 416920 449438 472140 464579 459403 424323 420985 479316 485058 470043 473862 478259
8387 478259 427773 355192 367131 386225 336289 346433 415719 416747 385028 371905 364388 364702
8375 364702 364028 368034 388136 441316 477781 442182 376571 332948 366143 365283 358307 367529 302477
8362 302477 298711 314499 342576 331756 275090 310040 340407 334568 372728 363329 349676 340409
8350 340409 317335 324644 355149 330293 272104 237440 241342 215177 197418 241270 257672 258554
8338 258554 300299 298335 325830 338283 322215 313389 301332 237952 272365 306934 252908 209268
8326 209268 238445 283806 328583 287405 264078 294987 327920 313343 290775 278215 298224 286117
$$ packed form
8413C73399j2251m652Q369N938o581R173K2299m201J4016m98L2140m8486l6075
8400C52590M1663K2667L2518K2702p561n176l5080l338N8331N742j5015L819M397
8387D78259n0486p2581J1939J9094m9936J0144O9286J028l1719j3123p517L14
8375C64702o74M006K0102N3180L6465l5599o5611m3623L3195q60o976R222o5052
8362C02477l766J5788K8077j0820n6666L4950L0367n839L8160r399j3653r267
8350C40409k3074P309L0505k4856n8189l4664L902k6165j7759M3852J6402Q82
8338B58554M1745j964K7495J2453j6068q826j2057o3380L4413L4569n4026m3640
8326B09268K9177M5361M4777m1178k3327L0909L2933j4577k2568j2560K0009j2107
$$ plain form
8314 286117 302323 297478 287874 271100 293559 309285 336687 354899 359819 348302 334202 286201
8302 286201 247740 212508 221243 233568 276392 286523 335750 293812 251996 269222 273548 306023
8290 306023 311788 286182 267184 306244 323139 294137 332646 316074 304951 299223 328333 335266
8278 335266 299498 317197 332298 329792 323533 319863 311206 256389 218383 222732 271954 260671 253818
8265 253818 242782 226056 227621 230453 254142 262853 276209 259573 232289 224471 195255 213203
8253 213203 233851 205430 190646 201914 241013 282300 291099 249562 234053 219755 214914 239438
8241 239438 280108 331596 315966 321434 376319 376757 377455 401977 365339 313697 321036 390745 472418
8228 472418 537386 608253 718388 775959 815977 809821 772969 674240 556329 448950 347211
$$ packed form
8314B86117J6206m845r604j6774K2459J5726K7402J8212M920j1517j4100m8001
8302B86201l8461l5232Q735J2325M2824J0131M9227m1938m1816J7226M326L2475
8290C06023N765k5606j8998L9060J6895k9002L8509j6572j1123n728K9110O933
8278C35266l5768J7699J5101k506o259l670q657n4817l8006M349M9222j1283o853
8265B53818j1036j6726J565K832K3689Q711J3356j6636k7284p818k9216J7948
8253B13203K0648k8421j4784J1268L9099M1287Q799m1537j5509j4298m841K4524
8241B39438M0670N1488j5630N468N4885M38O98K4522l6638n1642P339O9709Q1673
8228D72418O4968P0867J10135N7571M0018o156l6852r8729j17911j07379j01739
$$ plain form
8217 347211 274808 354155 380658 350000 320796 307881 348565 379834 366658 318533 273331 332684
8205 332684 346962 335996 364001 389483 417572 440221 453595 490546 455066 445714 444876 405285
8193 405285 425060 461785 433232 405817 500501 602752 642012 723819 837843 904424 1035204
8182 1035204 1202673 1365516 1496060 1604419 1664285 1599071 1466232 1261528 1033202 841188
8172 841188 675278 639633 596862 586508 596418 606669 578886 528176 517135 510205 499219 513256
8160 513256 491054 519031 488965 451904 444168 483658 504404 473782 430732 389183 394175 432383
8148 432383 451084 421268 483039 505161 504821 587571 721280 838716 961698 1161679 1349776
8137 1349776 1556195 1723941 1778903 1740183 1604153 1444191 1291972 1124716 1016887 896853
$$ packed form
8217C47211p2403P9347K6503l0658k9204j2915M0684L1269j3176m8125m5202N9353
8205C32684J4278j0966K8005K5482K8089K2649J3374L6951l5480r352q38l9591
8193D05285J9775L6725k8553k7415R4684J02251L9260Q1807J14024O6581J30780
8182A035204J67469J62843J30544J08359N9866o5214j32839k04704k28326j92014
8172H41188j65910l5645m2771j0354R910J0251k7783n0710j1041o930j0986J4037
8160E13256k2202K7977l0066l7061p736L9490K0746l0622m3050m1549M992L8208
8148D32383J8701k9816O1771K2122l40Q2750J33709J17436J22982J99981J88097
8137A349776K06419J67746N4962l8720j36030j59962j52219j67256j07829j20034
$$ plain form
8127 896853 828222 766954 690842 608581 594539 578712 590825 613333 605282 590696 546368 572381
8115 572381 598213 592003 587243 585585 525468 543650 592254 583725 567106 597554 584745 560039
8103 560039 569808 631279 652586 622919 680755 702473 818844 871800 953125 1063391 1123692
8092 1123692 1115653 1109044 1108060 1110038 996515 895611 833548 767325 688949 643820 651482 656866
8080 656866 688434 700552 722781 722907 697724 700022 678341 694120 750532 810718 813872 835778
8068 835778 844987 908155 936652 989288 1049841 1127359 1166516 1160188 1148890 1120210 1100569 1042607
8056 1042607 1061969 1138165 1127616 1180884 1288666 1369836 1489455 1604006 1720590 1752466 1724486
8045 1724486 1675232 1572965 1469348 1322211 1201936 1111782 1059923 1053642 1075329 1093364 1055302
$$ packed form
8127H96853o8631o1268p6112q2261j4042j5827J2113K2508q051j4586m4328K6013
8115E72381K5832o210m760j658o0117J8182M8604q529j6619L0448j2809k4706
8103E60039R769O1471K1307k9667N7836K1718J16371N2956Q1325J10266O0301
8092A123692q039o609r84J978j13523j00904o2063o6223p8376m5129P662N384
8080F56866L1568J2118K2229J26k5183K298k1681J5779N6412O0186L154K1906
8068H35778R209O3168K8497N2636O0553P7518L9157o328j1298k8680j9641n7962
8056A042607J9362P6196j0549N3268J07782Q1170J19619J14551J16584L1876k7980
8045A724486m9254j02267j03617j47137j20275r0154n1859o281K1687J8035l8062
$$ plain form
8034 1055302 1081209 1126257 1173282 1284179 1418460 1492718 1556749 1654866 1794953 1936787 2027395
8023 2027395 2101095 2186646 2329711 2531525 2682417 2733958 2646399 2465643 2288124 2130646
8013 2130646 2031663 2010579 1976063 1939754 1921809 1952156 1975504 1970148 1940395 1883660 1847596 1862400
8001 1862400 1826023 1797537 1782942 1800508 1782387 1729278 1678443 1640708 1609519 1634503 1678924
7990 1678924 1723480 1801669 1943448 2074320 2150440 2332761 2582225 2848483 3122691 3333659
7980 3333659 3501820 3517113 3379581 3130663 2823712 2561448 2373853 2246214 2152635 2074466
7970 2074466 1948519 1801408 1709747 1652492 1635388 1625903 1594623 1617759 1645180 1622676 1638452
7959 1638452 1618517 1542989 1510209 1425542 1336857 1268707 1304056 1325922 1303610 1331001 1301988
$$ packed form
8034A055302K5907M5048M7025J10897J34281P4258O4031R8117J40087J41834R0608
8023B027395P3700Q5551J43065K01814J50892N1541q7559j80756j77519j57478
8013B130646r8983k1084l4516l6309j7945L0347K3348n356k9753n6735l6064J4804
8001A862400l6377k8486j4595J7566j8121n3109n0835l7735l1189K4984M4421
7990A678924M4556P8189J41779J30872P6120J82321K49464K66258K74208K10968
7980C333659J68161J5293j37532k48918l06951k62264j87595j27639r3579p8169
7970B074466j25947j47111r1661n7255j7104r485l1280K3136K7421k2504J5776
7959A638452j9935p5528l2780q4667q8685o8150L5349K1866k2312K7391k9013
$$ plain form
7948 1301988 1308870 1323720 1327900 1377673 1404021 1459394 1476730 1556914 1640916 1649617 1666477 1678780
7936 1678780 1744539 1741907 1753966 1711074 1671710 1565874 1458287 1289809 1147633 1023310 1013351
7925 1013351 997646 993422 1007883 1001309 1072731 1106133 1088762 1028400 1019329 1039042 996893 920521
7913 920521 873460 842711 848603 866993 770327 741242 773107 725748 721487 775678 786118 790196
7901 790196 764795 723168 692656 633674 681412 658219 651700 660145 681237 660207 682665 650533
7889 650533 620140 571872 566359 545313 486532 460287 479808 497111 531538 573717 600747 568098
7877 568098 573221 600467 601052 555125 492289 515182 508151 401167 386467 389842 417184 410063 417540
7864 417540 443275 446617 446356 447586 401770 383972 365642 404603 440642 416645 371128 335242
$$ packed form
7948A301988O882J4850M180M9773K6348N5373J7336Q0184Q4002Q701J6860J2303
7936A678780O5759k632J2059m2892l9364j05836j07587j68478j42176j24323r959
7925A013351j5705m224J4461o574P1422L3402j7371o0362r071J9713m2149p6372
7913I20521m7061l0749N892J8390r6666k9085L1865m7359m261N4191J0440M078
7901G90196k5401m1627l0512n8982M7738k3193o519Q445K1092k1030K2458l2132
7889F50533l0393m8268n513k1046n8781k6245J9521J7303L4427M2179K7030l2649
7877E68098N123K7246N85m5927o2836K2893p031j06984j4700L375K7342p121P477
7864D17540K5735L342k61J230m5816j7798j8330L8961L6039k3997m5517l5886
$$ plain form
7852 335242 292724 279914 261517 236395 254402 279306 292015 313011 281703 245982 280675 297993
7840 297993 289962 267386 265141 239884 273459 291033 276504 269389 232549 135549 75403 94452
7828 94452 124895 143063 159704 243764 274787 234055 209241 186216 201627 224677 189759 214441
7816 214441 224401 200410 200384 187182 184455 145870 115972 129587 85073 31684 31103 70552 103582
7803 103582 131696 129370 74412 77909 128181 132572 124462 141279 150235 194020 188329 163507 114854
7790 114854 118138 99284 124461 121742 156695 143059 110986 118533 187541 182984 161137 198702
7778 198702 194157 162151 190926 246154 249371 214423 171877 99904 89578 102331 103778 134642
7766 134642 78137 98892 88386 99777 97816 124220 121115 122920 133847 144597 114367 135147
$$ packed form
7852C35242m2518j2810j8397k5122J8007K4904J2709K0996l1308l5721L4693J7318
7840B97993q031k2576k245k5257L3575J7574j4529p115l6840r7000o0146J9049
7828I4452L0443J8168J6641Q4060L1023m0732k4814k3025J5411K3050l4918K4682
7816B14441R960k3991k6j3202k727l8585k9898J3615m4514n3389n81L9449L3030
7803A03582K8114k326n4958L497N0272M391q110J6817Q956M3785n691k4822m8653
7790A14854L284j8854K5177k719L4953j3636l2073P547O9008m557k1847L7565
7778A98702m545l2006K8775N5228L217l4948m2546p1973j0326J2753J447L0864
7766A34642n6505K0755j0506J1391j961K6404l105J805J0927J0750l0230K0780
$$ plain form
7754 135147 115391 115199 138366 168746 171854 125171 117271 90189 57141 110812 110304 100517 162228
7741 162228 149274 129570 103228 107497 57304 -11576 14392 24737 40152 57074 99088 72305
7729 72305 20344 21624 42723 74533 60933 37125 51325 116832 126024 153903 147586 148047 125261
7716 125261 80802 103186 102439 82166 76894 58892 92405 97581 70461 82736 76981 99770 108795
7703 108795 98501 93649 93019 81125 101366 101795 88283 89586 92316 87043 66555 102011 69423
7690 69423 24145 39960 67846 82403 73878 72277 40342 51550 62726 87803 104532 90977
7678 90977 89027 121803 79122 53591 69264 88487 106563 142842 115054 90103 102161 66839
7666 66839 51587 87404 110110 110510 78911 83706 88331 56212 -10269 -28061 -50918 -24694 20330
$$ packed form
7754A35147j9756j92K3167L0380L108m6683p900k7082l3048N3671n08r787O1711
7741A62228j2954j9704k6342M269n0193o8880K5968J0345J5415J6922M2014k6783
7729G2305n1961J280K1099L1810j3600k3808J4200O5507R192K7879o317M61k2786
7716A25261m4459K2384p47k0273n272j8002L3513N176k7120J2275n755K2789R025
7703A08795j0294m852o30j1894K0241M29j3512J303K730n273k0488L5456l2588
7690F9423m5278J5815K7886J4557q525j601l1935J1208J1176K5077J6729j3555
7678I0977j950L2776m2681k5531J5673J9223J8076L6279k7788k4951J2058l5322
7666F6839j5252L5817K2706M00l1599M795M625l2119o6481j7792k2857K6224M5024
$$ plain form
7653 20330 91189 142526 67495 15034 7132 3482 30590 39985 44155 83422 73794 52768 48436
7640 48436 116099 144114 86472 50132 46345 71573 76227 92096 90354 100725 71593 14444
7628 14444 140 9073 -10563 31477 82074 93222 120408 115112 67684 3139 64518 109879
7616 109879 92218 68239 36473 61097 109631 122204 102376 59947 83329 72398 89845 36087
7604 36087 60661 72102 50356 64278 37761 14876 49869 48600 53709 73398 95716 100455
7592 100455 87546 51245 34881 20175 26962 47593 70277 53213 14398 12354 19633 81389
7580 81389 82503 66194 61018 45328 36586 17218 19302 68089 56294 44479 98720 100865 71775
7567 71775 44245 71948 77072 40316 39678 66529 35528 7484 18883 31104 30330 34461 65496
$$ packed form
7653B0330P0859N1337p5031n2461p902l650K7108R395M170L9267r628k1026m332
7640D8436O7663K8015n7642l6340l787K5228M654J5869j742J0371k9132n7149
7628A4444j4304Q933j9636M2040N0597J1148K7186n296m7428o4545O1379M5361
7616A09879j7661k3979l1766K4624M8534J2573j9828m2429K3382j0931J7447n3758
7604C6087K4574J1441k1746J3922k6517k2885L4993j269N109J9689K2318M739
7592A00455j2909l6301j6364j4706O787K0631K2684j7064l8815k044P279O1756
7580H1389J114j6309n176j5690q742j9368K084M8787j1795j1815N4241K145k9090
7567G1775k7530K7703N124l6756o38K6851l1001k8044J1399J2221p74M131L1035
$$ plain form
7554 65496 45241 6891 25779 54835 55949 82571 87804 51657 64113 96571 88635 38578
7542 38578 44974 72016 121768 109466 93056 81608 78346 95740 84182 34299 -763 -5378
7530 -5378 -16833 -21395 -5194 2379 9657 -3656 -20004 -46434 -37041 -27098 -10555 21595 27524
7517 27524 3793 -15179 -20917 -36195 20016 6777 -7652 -1714 -2312 39948 41801 35123 -28453
7504 -28453 -37602 -32784 -21894 17057 30035 48560 30295 38254 15768 25610 1154 24912 80530
7491 80530 75729 96377 90637 58294 4973 -18703 12070 23322 21017 62364 79572 80277 47280
7478 47280 15316 22973 43507 48385 39586 45195 86880 80413 74670 51869 58475 65996 35656
7465 35656 69610 90488 60032 57720 72649 105498 67583 49295 88522 115241 153202 144589
$$ packed form
7554F5496k0255l8350J8888K9056J114K6622N233l6147J2456L2458p936n0057
7542C8578O396K7042M9752j2302j6410j1448l262J7394j1558m9883l5062m615
7530e378j1455m562J6201P573P278j3313j6348k6430R393R943J6543L2150N929
7517B7524k3731j8972n738j5278N6211j3239j4429N938n98M2260J853o678o3576
7504b8453r149M818J0890L8951J2978J8525j8265P959k2486R842k4456K3758N5618
7491H0530m801K0648n740l2343n3321k3676L0773J1252k305M1347J7208P05l2997
7478D7280l1964P657K0534M878q799N609M1685o467n743k2801O606P521l0340
7465C5656L3954K0878l0456k312J4929L2849l7915j8288L9227K6719L7961q613
$$ plain form
7453 144589 87138 56827 55393 55562 60524 30553 39661 39873 -6873 -13830 -44354 -4015 55318
7440 55318 88386 88469 27093 43685 45748 18237 24739 -12640 -59384 -37221 -14492 -4336 -17681
7427 -17681 41111 39095 -4024 20743 55558 44322 36375 17757 32100 54461 56608 35612
7415 35612 3100 21556 24705 19714 22793 14626 1474 -19410 17727 26278 37690 53158 42794
7402 42794 80043 73233 54242 44946 35668 87698 128828 90275 72465 24194 -16063 -31507
7390 -31507 -38121 -14367 -1939 31480 55335 105137 87778 73536 56693 68150 62170 -5123
7378 -5123 -49156 -101423 -76121 -21625 48410 96879 86888 97994 78934 74856 36220 22610
7366 22610 22725 24688 7619 11634 9093 70888 70900 40791 3912 -3618 -26274 -18616 10239 -15239
$$ packed form
7453A44589n7451l0311j434J69M962k9971R108K12m6746o957l0524M0339N9333
7440E5318L3068Q3o1376J6592K063k7511O502l7379m6744K2163K2729J0156j3345
7427a7681N8792k016m3119K4767L4815j1236p947j8618J4343K2361K147k0996
7415C5612l2512J8456L149m991L079q167j3152k0884L7137Q551J1412J5468j0364
7402D2794L7249o810j8991r296r278N2030M1130l8553j7810m8271m0257j5444
7390c1507o614K3754J2428L3419K3855M9802j7359j4242j6843J1457n980o7293
7378e123m4033n2267K5302N4496P0035M8469r991J1106j9060m078l8636j3610
7366B2610J15J963j7069M015k541O1795J2l0109l6879p530k2656P658K8855k5478
$$ plain form
7352 -15239 -13939 3169 17068 43535 49246 10859 -12802 21637 24936 35027 24528 7633
7340 7633 13024 73830 70223 20581 112773 165584 116167 30397 -1115 16354 506 18116
7328 18116 7854 14902 43645 53454 43127 8083 10178 16799 -19978 -35469 -42761 -37558 -8112
7315 -8112 29798 21000 26918 12200 -22391 -67721 -103282 -122771 -93894 -60254 -24726 -24000 6156
7302 6156 -22672 -93876 -95876 -88443 -89574 -25387 -11181 8549 5475 6926 1251 45459 59104
7289 59104 114713 135001 115103 101259 65163 24026 34232 57572 14756 9954 49375 33673
7277 33673 5941 38480 48871 64551 36626 8445 38382 65879 66156 46374 59615 75457
7265 75457 64543 8680 -31406 -59579 -35696 -18507 -12186 -12836 13748 37743 30516 4877 -16265
$$ packed form
7352a5239J300J7108J3899K6467N711l8387k3661L4439L299J0091j0499j6895
7340G633N391O0806l607m9642R2192N2811m9417q5770l1512J7469j5848J7610
7328A8116j0262P048K8743R809j0327l5044K095O621l6777j5491p292N203K9446
7315h112L7910q798N918j4718l4591m5330l5561j9489K8877L3640L5528P26L0156
7302F156k8828p1204k000P433j131O4187J4206J9730l074J451n675M4208J3645
7289E9104N5609K0288j9898j3844l6096m1137J0206K3340m2816m802L9421j5702
7277C3673k7732L2539J0391J5680k7925k8181K9937K7497K77j9782J3241J5842
7265G5457j0914n5863m0086k8173K3883J7189O321o50K6584K3995p227k5639k1142
$$ plain form
7252 -16265 18396 68421 34142 22849 4067 27283 8582 9219 28140 60698 96743 107591
7240 107591 112684 111153 102929 66671 4378 11071 30235 1123 -13704 -15530 17019 45873 63999
7227 63999 58407 51939 47461 65327 34547 8708 -16820 2801 31904 49860 67281 86666
7215 86666 70519 35028 52689 79882 68798 47284 4347 5141 23155 7481 3454 22861
7203 22861 22545 62360 29669 33359 10340 -16110 4377 26296 34807 28659 63271 94271 78743
7190 78743 80398 59726 49658 60088 91534 96401 34432 32609 35015 -6038 -7397 32595 26137
7177 26137 -2082 72489 83543 27475 22357 -11731 60322 138141 120251 89002 106201 86567
7165 86567 83074 100020 74296 42690 33762 5700 -58883 -51846 4906 -4176 -14712 26181 98195
$$ packed form
7252a6265L4661N0025l4279j1293j8782K3216j8701O37J8921L2558L6045J0848
7240A07591N093j531q224l6258o2293O693J9164k9112j4827j826L2549K8854J8126
7227F3999n592o468m478J7866l0780k5839k5528J9621K9103J7956J7421J9385
7215H6666j6147l5491J7661K7193j1084k1514m2937P94J8014j5674m027J9407
7203B2861l16L9815l2691L690k3019k6450K0487K1919Q511o148L4612L1000j5528
7190G8743J655k0672j0068J0430L1446M867o1969j823K406m1053j359L9992o458
7177B6137k8219P4571J1054n6068n118l4088P2053P7819j7890l1249J7199j9634
7165H6567l493J6946k5724l1606q928k8062o4583P037N6752r082j0536M0893P2014
$$ plain form
7152 98195 107979 71306 64541 23317 -39419 -52113 -54586 -59569 -20450 23593 56325 60262 10845
7139 10845 66459 56689 -4670 -10553 -19642 -49218 -39197 17784 52383 70830 35563 -18947
7127 -18947 -64690 -45370 -25476 2433 62598 44730 40963 -2910 -13323 -5766 5365 19859
7115 19859 -14329 -28138 -33555 19825 85403 76463 46656 22224 37133 97659 100615 98517 79588
7102 79588 75272 141886 150330 108323 109809 57662 27917 -1698 43516 95409 102060 77489 53528
7089 53528 61430 94576 88033 33622 72051 113839 93379 82604 77268 42867 61845 16000
7077 16000 20700 10214 28246 10612 28908 56820 83338 112090 133710 140473 115164 87302
7065 87302 51469 62621 82962 57585 21714 11796 -49122 -61075 -29298 13587 28291 -45049
$$ packed form
7152I8195R784l6673o765m1224o2736j2694k473m983L9119M4043L2732L937m9417
7139A0845N5614r770o1359n883r089k9576J0021N6981L4599J8447l5267n4510
7127a8947m5743J9320J9894K7909O0165j7868l767m3873j0413P557J1131J4494
7115A9859l4188j3809n417N3380O5578q940k9807k4432J4909O0526K956k098j8929
7102G9588m316O6614Q444m2007J486n2147k9745k9615M5214N1893O651k4571k3961
7089E3528P902L3146o543n4411L8429M1788k0460j0775n336l4401J8978m5845
7077A6000M700j0486J8032j7634J8296K7912K6518K8752K1620O763k5309k7862
7065H7302l5833J1152K0341k5377l5871r918o0918j1953L1777M2885J4704p3340
$$ plain form
7053 -45049 -48627 -15562 1892 36804 53922 42441 4738 -45109 -49200 13093 -12898 -43314
7041 -43314 7018 36662 14256 31360 12035 7681 13894 24684 20810 -29648 -26584 41505 55074
7028 55074 16868 -19968 7818 69977 31870 2741 23149 32066 -10861 -32038 39025 41019
7016 41019 -44 -8140 21252 62396 52955 48608 33716 -4742 -24345 -34227 -33161 -39264 -78472
7003 -78472 -59490 -10898 27310 39508 73461 81175 83368 73521 65263 64103 64776 75959 95455
6990 95455 83373 52978 74197 92910 37999 -58461 -103078 -49563 27103 35961 72913 71574
6978 71574 33339 29250 26799 3378 40093 20268 -14399 1187 -2922 -55976 -20590 22025
6966 22025 16648 -14128 -26985 20966 9666 5434 -11021 21224 39450 51764 50908 42025 5343
$$ packed form
7053d5049l578L3065J7454L4912J7118j1481l7703m9847m091O2293k5991l0416
7041d3314N0332K9644k2406J7104j9325m354O213J0790l874n0458L064O8089J3569
7028E5074l8206l6836K7786O2159l8107k9129K0408Q917m2927k1177P1063J994
7016D1019m1063q096K9392M1144r441m347j4892l8458j9603r882J066o103l9208
7003g8472J8982M8592L8208J2198L3953P714K193r847q258j160O73J1183J9496
6990I5455j2082l0395K1219J8713n4911r6460m4617N3515P6666Q858L6952j339
6978G1574l8235m089k451k3421L6715j9825l4667J5586m109n3054L5386M2615
6966B2025n377l0776j2857M7951j1300m232j6455L2245J8226J2314q56q883l6682
$$ plain form
6953 5343 -15333 -8167 37644 9572 36073 39797 33706 17522 9629 15336 37900 65150 33510
6940 33510 23946 43456 97824 112843 100547 67824 13647 -5660 -35530 6207 71975 60484
6928 60484 -9612 -65820 -29769 3858 1958 7249 20595 35076 23857 8679 55965 39882
6916 39882 -19842 -51911 -2371 52560 27464 22087 54246 60456 57904 55690 51045 -1000 -37383
6903 -37383 -24962 -20161 -20522 17705 -15776 -32716 -33283 -14525 -30603 -41877 -26379 -17967 -71048
6890 -71048 -58419 -24212 -10040 31439 88655 61831 39110 42386 29831 47387 46860 69934
6878 69934 63493 89045 80636 20177 26889 -6392 -38435 -78209 -22951 43533 51253 45283 25886
6865 25886 46820 25590 -8451 -16649 19801 87705 69078 49566 12602 -24141 -33295 -28131
$$ packed form
6953E343k0676P166M5811k8072K6501L724o091j6184p893N707K2564K7250l1640
6940C3510r564J9510N4368J5019j2296l2723n4177j9307k9870M1737O5768j1491
6928F0484p0096n6208L6051L3627j900N291J3346J4481j1219j5178M7286j6083
6916C9882n9724l2069M9540N4931k5096n377L2159O210k552k214m645n2045l6383
6903c7383J2421M801l61L8227l3481j6940n67J8758j6078j1274J5498Q412n3081
6890g1048J2629L4207J4172M1479N7216k6824k2721L276j2555J7556n27K3074
6878F9934o441K5552q409o0459O712l3281l2043l9774N5258O6484P720n970j9397
6865B5886K0934k1230l4041q198L6450O7904j8627j9512l6964l6743r154N164
$$ plain form
6853 -28131 -94187 -112076 -96738 -78353 -24821 -12811 -40054 -6913 30012 33499 4456 3554
6841 3554 -31746 -49862 -17830 7869 -8073 -11995 -11647 35407 49850 69251 35542 -3052 -59575
6828 -59575 -24823 -4427 40426 61717 81133 44137 -35238 -94651 -85133 -50845 6814 42662
6816 42662 695 -18911 -27432 -46284 -23223 -2629 17370 15688 31106 65447 72585 33351
6804 33351 26187 -31373 -41065 -13094 22467 46512 79643 78457 115146 118659 103261 73950 77801
6791 77801 55913 53963 47832 47605 67804 63467 115651 148249 91968 47985 32150 22352 23763
6778 23763 21830 23965 15472 -30434 24562 69471 29316 -9123 9919 5536 -31064 -18596 -32776
6765 -32776 -23100 -8646 -15521 -35644 -30729 35398 97671 113517 81296 30863 25483 33156 33784
$$ packed form
6853b8131o6056j7889J5338J8385N3532J2010k7243L3141L6925L487k9043r02
6841C554l5300j8116L2032K5699j5942l922L48M7054J4443J9401l3709l8594n6523
6828e9575L4752K0396M4853K1291J9416l6996p9375n9413R518L4288N7659L5848
6816D2662m1967j9606q521j8852K3061K0594J9999j682J5418L4341P138l9234
6804C3351p164n7560r692K7971L5561K4045L3131j186L6689L513j5398k9311L851
6791G7801k1888j950o131k27K0199m337N2184L2598n6281m3983j5835r798J411
6778B3763j933K135q493m5906N4996M4909m0155l8439J9042m383l6600J2468j4180
6765c2776R676J4454o875k0123M915O6127O2273J5846l2221n0433n380P673O28
$$ plain form
6752 33784 19230 41788 59551 40542 87974 56328 56575 51077 55794 89305 87161 123547 85617
6739 85617 38876 35778 -20664 -36110 -17681 14390 40085 27114 -276 25114 36200 43848
6727 43848 49729 17750 -48537 -2122 76823 65082 55194 10302 9083 27341 19232 -4218 14376
6714 14376 46756 73856 31894 20473 14556 45622 73155 90504 120345 139760 185126 194849
6702 194849 217574 208671 130360 60038 12144 13019 29331 -14490 5351 16750 36072 68111
6690 68111 74832 72344 60889 63055 70071 47327 23489 2156 42803 59776 78552 64381 7390
6677 7390 -2078 -52091 -61419 -40838 -3063 38701 50513 51154 45144 52253 34558 9271 10169 -41279
6663 -41279 -39960 849 -2871 -8229 -34155 -106978 -111103 -114796 -76995 -21738 -41056 -72632 -56024
$$ packed form
6752C3784j4554K2558J7763j9009M7432l1646K47n498M717L3511k144L6386l7930
6739H5617m6741l098n6442j5446J8429L2071K5695j2971k7390K5390J1086P648
6727D3848N881l1979o6287M6415P8945j1741r888m4892j219J8258q109k3450J8594
6714A4376L2380K7100m1962j1421n917L1066K7533J7349K9841J9415M5366R723
6702A94849K2725q903p8311p0322m7894Q75J6312m3821J9841J1399J9322L2039
6690F8111O721k488j1455K166P016k2744k3838k1333M0647J6973J8776j4171n6991
6677G390r468n0013r328K0581L7775M1764J1812O41o010P109j7695k5287Q98n1448
6663d1279J319M0809l720n358k5926p2823m125l693L7801N5257j9318l1576J6608
$$ plain form
6650 -56024 -11267 256 33679 -5559 -28892 -86079 -93643 -85127 -32065 -15727 -19625 -41889
6638 -41889 -58078 3472 23337 2517 -43436 -16499 11172 19853 27098 48697 28496 9403
6626 9403 -29221 1962 76024 97621 89484 31413 20532 45909 12444 5060 15188 42430
6614 42430 16691 -37884 -65906 -40110 -36135 -33882 -23676 -82809 -31807 55339 91113 96203
6602 96203 46795 39438 -16220 -79601 -51133 -35572 -15468 -3656 -3971 -13113 -22420 2305 -18142
6589 -18142 -47681 -51806 -29760 -16300 -52995 -46908 29958 47946 70751 37573 24116 26373
6577 26373 14202 6040 -15410 -5693 25136 63230 80513 42766 7623 -3249 30461 43398
6565 43398 6694 33171 23056 -6333 9452 28846 -18589 -22300 43875 24400 8374 -5688
$$ packed form
6650e6024M4757J1523L3423l9238k3333n7187p564Q516N3062J6338l898k2264
6638d1889j6189O1550J9865k0820m5953K6937K7671Q681P245K1599k0201j9093
6626I403l8624L1183P4062K1597q137n8071j0881K5377l3465p384J0128K7242
6614D2430k5739n4575k8022K5796L975K253J0206n9133N1002Q7146L5774N090
6602I6203m9408p357n5658o3381K8468J5561K0104J1812l15r142r307K4725k0447
6589a8142k9539m125K2046J3460l6695O087P6866J7988K2805l3178j3457K257
6577B6373j2171q162k1450R717L0829L8094J7283l7747l5143j0872L3710J2937
6565D3398l6704K6477j0115k9389J5785J9394m7435l711O6175j9475j6026j4062
$$ plain form
6553 -5688 11821 -9605 -20963 -42419 -23840 3402 20029 33226 18101 -12571 -2344 27186
6541 27186 50646 3089 20326 9119 -30513 -34587 2736 58233 57294 57777 39606 46206 32342
6528 32342 -13506 -16036 -7342 2486 38993 66628 39000 22273 19670 38176 26596 -3705 -4938
6515 -4938 28222 -3212 -3201 -29995 -2636 20816 32809 855 2644 9476 22388 34521 67554
6502 67554 99126 54766 12127 -14662 -14869 7020 -21553 -73487 -39213 -42271 -23302 -11281
6490 -11281 -23682 -40560 -18378 -10546 12513 55471 63127 29993 -36599 -73533 -57507 -51076
6478 -51076 39 16981 3244 -15475 17 5382 16063 39317 87254 48731 46714 62392
6466 62392 63760 26957 -36312 -74406 -50645 -16938 -13490 10913 34716 -11843 1287 -16376
$$ packed form
6553e688J7509k1426j1358k1456J8579K7242J6627J3197j5125l0672J0227K9530
6541B7186K3460m7557J7237j1207l9632m074L7323N5497r39M83j8171O600j3864
6528C2342m5848k530Q694R828L6507K7635k7628j6727k603J8506j1580l0301j233
6515d938L3160l1434J1k6794K7359K3452J1993l1954J789O832J2912J2133L3033
6502F7554L1572m4360m2639k6789k07K1889k8573n1934L4274l058J8969J2021
6490a1281j2401j6878K2182P832K3059M2958P656l3134o6592l6934J6026O431
6478e1076N1115J6942j3737j8719J5492N365J0681K3254M7937l8523k017J5678
6466F2392J368l6803o3269l8094K3761L3707L448K4403K3803m6559J3130j7663
$$ plain form
6454 -16376 2435 36553 42833 19690 -209 -13038 -17248 -11339 -29336 37054 73261 9680
6442 9680 -33744 -84708 -88101 -50662 -11514 -38189 -16291 4051 -19956 -21038 36146 25090
6430 25090 43907 103307 78037 56990 81369 88998 26814 -3580 7554 27942 48959 17701
6418 17701 9105 17202 30916 32299 39827 16076 2891 8190 18519 49288 11025 -46540 -71468
6405 -71468 -25446 15334 50580 60322 52016 83240 41594 7356 5950 -8943 -14670 -12905 -17202
6392 -17202 -109011 -135605 -45795 18712 14827 15599 10900 -9174 -39033 -28462 5859 8903 1866
6379 1866 -10275 -27006 -11691 7798 -4997 10346 -9045 -4762 -9746 -22108 -43149 -29683
6367 -29683 19743 21673 37318 -4904 -84686 -34872 2681 -13342 -39050 -25815 -14119 -11086
$$ packed form
6454a6376J8811L4118O280k3143j9899j2829m210N909j7997O6390L6207o3581
6442I680m3424n0964l393L7439L9148k6675K1898K0342k4007j082N7184j1056
6430B5090J8817N9400k5270k1047K4379P629o2184l0394J1134K0388K1017l1258
6418A7701q596Q097J3714J383P528k3751j3185N299J0329L0769l8263n7565k4928
6405g1468M6022M0780L5246R742q306L1224m1646l4238j406j4893n727J765m297
6392a7202r1809k6594Q9810O4507l885P72m699k0074k9859J0571L4321L044p037
6379A866j2141j6731J5315J9489j2795J5343j9391M283m984j2362k1041J3466
6367b9683M9426J930J5645m2222p9782M9814L7553j6023k5708J3235J1696L033
$$ plain form
6355 -11086 -21272 -29148 -67405 -107092 -70208 -75567 -73073 -19623 -37118 -108513 -56766 2480
6343 2480 15497 25994 -10771 7652 5590 -20224 -46474 -31557 -30555 1615 40772 35728 40412
6330 40412 -17605 -68396 -64359 -51025 -51951 -30792 -18438 8734 -34159 -38650 2450 33273 -5754
6317 -5754 -34011 5835 38388 -92 -31613 -33155 -23260 -3164 64349 60219 5225 -34155 -30375
6304 -30375 34769 38746 40097 59921 42794 14302 -36791 -57186 1570 21467 16248 13490 10682
6291 10682 34011 62534 28508 56047 50734 26088 780 14139 41499 35384 18090 -2979
6279 -2979 -55886 -65761 -38402 -19316 -19065 -43514 -82375 -45662 -22039 -38440 -24605 -19127 27473
6266 27473 34772 74268 91521 68858 22366 -2878 -16051 -1844 38354 57145 33062 -8564
$$ packed form
6355a1086j0186p876l8257l9687L6884n359K494N3450j7495p1395N1747N9246
6343B480J3017J0497l6765J8423k062k5814k6250J4917J002L2170L9157n044M684
6330D0412n8017n0791M037J3334r26K1159J2354K7172m2893m491M1100L0823l9027
6317e754k8257L9846L2553l8480l1521j542R895K0096O7513m130n4994l9380L780
6304c0375O5144L977J351J9824j7127k8492n1093k0395N8756J9897n219k758k808
6291A0682K3329K8523l4026K7539n313k4646k5308J3359K7360o115j7294k1069
6279b979n2907r875K7359J9086K51k4449l8861L6713K3623j6401J3835N478M6600
6266B7473P299L9496J7253k2663m6492k5244j3173J4207M0198J8791k4083m1626
$$ plain form
6254 -8564 1248 13164 24830 -7982 -1568 36944 11703 -5731 11467 40766 41492 34430 14716
6241 14716 6877 4369 771 -16689 -3316 7532 -362 24209 17562 10635 38963 -15752 -54297
6228 -54297 -49945 -45324 -10513 20362 15031 912 -78001 -62056 -16113 -27355 -45783 -28329
6216 -28329 -12292 13519 5419 -30381 -58739 -72811 -83501 -82165 -68310 -28694 4941 -9859
6204 -9859 -1474 -11892 -27434 -61576 -26491 -885 52197 42636 15531 -17255 -27049 -53111 -13992
6191 -13992 -84 251 16996 25523 11879 7567 10348 -49408 -68246 -48916 -8032 16339 14143
6178 14143 14757 11813 -13907 -16650 19450 21820 11477 24195 13465 24054 -1977 -22436 -33413
6165 -33413 7269 -13911 -67988 -68520 -62228 -31910 -9350 -3653 -51390 -99138 -38829 -2215 27114
$$ packed form
6254h564R812J1916J1666l2812O414L8512k5241j7434J7198K9299P26p062j9714
6241A4716p839k508l598j7460J3373J0848p894K4571o647o927K8328n4715l8545
6228e4297M352M621L4811L0875n331j4119p8913J5945M5943j1242j8428J7454
6216b8329J6037K5811q100l5800k8358j4072j0690J336J3855L9616L3635j4800
6204i859Q385j0418j5542l4142L5085K5606N3082r561k7105l2786r794k6062L9119
6191a3992J3908L35J6745Q527j3644m312K781n9756j8838J9330M0884K4371k196
6178A4143O14k944k5720k743L6100K370j0343J2718j0730J0589k6031k0459j0977
6165c3413M0682k1180n4077n32O292L0318K2560N697m7737m7748O0309L6614K9329
$$ plain form
6152 27114 40973 41679 -15871 -30586 14142 -48427 -105374 -76986 -66147 10220 4907 -11100
6140 -11100 -26886 -10455 -43966 -54286 -38965 -26483 -8730 -61057 -77267 -73126 -48939 -40899
6128 -40899 -35518 -42018 -91960 -88158 -45670 -26335 -3660 -43739 -55111 -20529 -18752 3556 -21628
6115 -21628 -18253 -7454 -414 35053 40247 -763 -22631 -26495 12010 30965 -17489 -1856 14508
6102 14508 16322 22405 32177 35850 -14322 -30059 20448 -15794 942 34344 46863 73613 91393
6089 91393 60813 18676 12377 36937 13814 -23532 -39161 -42526 -16178 2865 14383 43437
6077 43437 46893 24733 32799 2164 24362 30803 59460 68572 72503 79000 31987 -17337 -71559
6064 -71559 -79677 -70978 -21065 35388 32403 30307 81590 93427 89707 34913 2094 -23350 -75920
$$ packed form
6152B7114J3859P06n7550j4715M4728o2569n6947K8388J0839P6367n313j6007
6140a1100j5786J6431l3511j0320J5321J2482J7753n2327j6210M141K4187Q040
6128d0899N381o500m9942L802M2488J9335K2675m0079j1372L4582J777K2308k5184
6115b1628L375J0799P040L5467N194m1010k1868l864L8505J8955m8454J5633J6364
6102A4508J814O083R772L673n0172j5737N0507l6242J6736L3402J2519K6750J7780
6089I1393l0580m2137o299K4560k3123l7346j5629l365K6348J9043J1518K9054
6077D3437L456k2160Q066l0635K2198O441K8657R112L931O497m7013m9324n4222
6064g1559q118Q699M9913N6453k985k096N1283J1837l720n4794l2819k5444n2570
$$ plain form
6051 -75920 -46089 521 32384 15071 -14661 7048 1755 -35663 -28711 3062 -23331 -27515
6039 -27515 24356 37889 14138 -433 -11318 -1915 37753 13416 2648 1350 56624 55768 6622
6026 6622 -23599 -45212 -72832 -90093 -81539 -83214 -95072 -68077 139 -2529 12041 25218 3655
6013 3655 -22369 8022 41181 24502 6788 -36576 -13068 -32158 -23407 -58012 -104139 -106399
6001 -106399 -56241 -56705 -61039 -32717 -4998 -23053 -30665 -16780 -10093 29660 35137 1494 -16895
5988 -16895 -4396 12296 -1109 -12077 26700 10661 -25987 -2229 13954 65038 68966 48765
5976 48765 36776 2842 27556 45903 18434 -1958 16446 2400 -44099 -56533 -38616 -47964
5964 -47964 -53194 -9296 -15629 -11980 -265 -20467 -24805 -26333 -5623 -5548 -57395 -75198 -33325
$$ packed form
6051g5920K9831M6610L1863j7313k9732K1709n293l7418O952L1773k6393m184
6039b7515N1871J3533k3751j4571j0885R403L9668k4337j0768j298N5274q56m9146
6026F622l0221k1613k7620j7261Q554j675j1858K6995O8216k668J4570J3177k1563
6013C655k6024L0391L3159j6679j7714m3364K3508j9090Q751l4605m6127k260
6001a06399N0158m64m334K8322K7719j8055p612J3885O687L9753N477l3643j8389
5988a6895J2499J6692j3405j0968L8777j6039l6648K3758J6183N1084L928k0201
5976D8765j1989l3934K4714J8347k7469k0392J8404j4046m6499j2434J7917r348
5964d7964n230M3898o333L649J1715k0202m338j528K0710P5n1847j7803M1873
$$ plain form
5951 -33325 -62811 -65251 -53715 -26897 -21953 -6073 -11527 -36913 -60667 -52076 -53842 -18114 -65192
5938 -65192 -80443 -86523 -72316 -76257 -49281 -48973 -45661 -65613 -50038 -28982 -64373 -102961 -58627
5925 -58627 -87389 -84549 -95177 -132069 -112164 -56351 -19063 4550 -4447 -35047 -49909 -35777
5913 -35777 -40452 -46081 -20405 7242 19336 50812 24362 29110 39167 12897 12794 42204 26622
5900 26622 37135 10340 -19558 -30482 -57426 -60593 -45322 -4580 13467 -1376 7916 17822
5888 17822 -7378 -8855 8800 -915 7214 2607 14068 -16633 -63292 -41447 -41021 -28740 -11099
5875 -11099 -5244 38275 33486 7660 -2415 31838 -8617 -15903 8525 -6112 -21136 -53276
5863 -53276 -52518 -50203 -35628 13437 24536 8833 30222 26834 13908 -4561 17599 40752 18254
$$ packed form
5951c3325k9486k440J1536K6818M944J5880n454k5386k3754Q591j766L5728m7078
5938f5192j5251o080J4207l941K6976L08L312j9952J5575K1056l5391l8588M4334
5925e8627k8762K840j0628l6892J9905N5813L7288K3613q997l0600j4862J4132
5913c5777m675n629K5676K7647J2094L1476k6450M748J0057k6270j03K9410j5582
5900B6622J0513k6795k9898j0924k6944l167J5271M0742J8047j4843R292R906
5888A7822k5200j477J7655r715Q129m607J1461l0701m6659K1845M26J2281J7641
5875a1099N855M3519m789k5826j0075L4253m0455p286K4428j4637j5024l2140
5863e3276P58K315J4575M9065J1099j5703K1389l388j2926j8469K2160K3153k2498
$$ plain form
5850 18254 -20205 -38616 -11793 27991 21436 34292 -770 -10723 -37661 -24723 -36092 -48302
5838 -48302 -20779 -23907 6819 55467 32688 -14950 9260 15992 -22918 -8969 12911 -24141
5826 -24141 -76565 -78562 -81172 -87596 -101011 -80093 -36970 -11456 9003 7512 15132 -16803 5792
5813 5792 -9645 -30037 -43561 -120057 -119922 -75253 -41694 -12036 -8568 -11898 33107 15767 5709
5800 5709 26735 45204 -15190 -69604 -69146 -80269 -33008 -49242 -39987 20642 45783 19816 -43692
5787 -43692 -30293 -29695 -60353 -29892 -28135 -27288 -68812 -71481 -34443 -24032 -14445 38999 53751
5774 53751 17487 18587 -19377 62236 67118 9071 -49517 -69939 -50000 -17505 5417 18149
5762 18149 -161 -11537 -58098 -38958 -45453 -18615 1878 648 -34109 -67942 -57673 -59588
$$ packed form
5850A8254l8459j8411K6823L9784o555J2856l5062r953k6938J2938j1369j2210
5838d8302K7523l128L0726M8648k2779m7638K4210O732l8910J3949K1880l7052
5826b4141n2424j997k610o424j3415K0918M3123K5514K0459j491P620l1935K2595
5813E792j5437k0392j3524p6496J35M4669L3559K9658L468l330M5005j7340j0058
5800E709K1026J8469o0394n4414M58j1123M7261j6234R255O0629K5141k5967o3508
5787d3692J3399N98l0658L0461J757Q47m1524k669L7038J0411R587N3444J4752
5774E3751l6264J100l7964Q1613M882n8047n8588k0422J9939L2495K2922J2732
5762A8149j8310j1376m6561J9140o495K6838K0493j230l4757l3833J0269j915
$$ plain form
5750 -59588 -29946 27630 59393 47615 18660 14949 39454 54694 64882 53002 19558 -7710
5738 -7710 -9342 -30865 -42209 -31498 -13452 -24780 -42750 13759 50178 72724 46122 49194
5726 49194 48378 -14526 -70229 -111026 -122486 -120040 -103956 -74576 -34675 8496 81160 104141
5714 104141 79679 28833 -52363 -67212 -6305 -11060 -17615 -53834 -52709 -73169 -17196 37713
5702 37713 62184 58664 32998 23086 -12102 -26216 -14466 -19586 -38883 -59220 -66808 -30968 -17835
5689 -17835 -24814 41140 42413 1207 26020 -2593 -46219 -45243 -34376 9061 743 -36093 -63325
5676 -63325 -81659 -91848 -72692 -58641 -19037 -13058 -52457 -8973 29166 2289 -17418 -15084
5664 -15084 -29491 -47845 -48721 16263 56571 15718 -36021 -76384 -43644 -48220 -81316 -128275
$$ packed form
5750e9588K9642N7576L1763j1778k8955l711K4505J5240J0188j1880l3444k7268
5738g710j632k1523j1344J0711J8046j1328j7970N6509L6419K2546k6602L072
5726D9194q16o2904n5703m0797j1460K446J6084K9380L9901M3171P2664K2981
5714A04141k4462n0846q1196j4849O0907m755o555l6219J125k0460N5973N4909
5702C7713K4471l520k5666r912l5188j4114J1750n120j9297k0337p588L5840J3133
5689a7835o979O5954J273m1206K4813k8613m3626R76J0867M3437q318l6836k7232
5676f3325j8334j0189J9156J4051L9604N979l9399M3484L8139k6877j9707K334
5664a5084j4407j8354q76O4984M0308m0853n1739m0363L2740m576l3096m6959
$$ plain form
5652 -128275 -142170 -102006 -56041 -72297 -93006 -115460 -111558 -103765 -83228 -45549 -2858 -19694
5640 -19694 -21922 -14832 51771 32166 8427 16726 58077 30185 36416 52898 11271 -38066 -49103
5627 -49103 -45963 -29709 -28164 -14660 16800 21394 -7365 -16805 -32990 -69496 -87563 -76479 -46387
5614 -46387 -19790 -1762 -861 -15342 -67731 -49442 -72907 -81923 -73371 -56151 -55006 -60279 -59546
5601 -59546 -12901 2995 1888 23713 49576 53436 65744 79940 79185 3037 -26511 -13615 -43163
5588 -43163 -61247 -21128 30821 54392 65237 7735 14514 37114 -4604 3870 7815 -24638
5576 -24638 -22252 -3243 -14904 3247 57387 83435 93266 73950 34614 -27577 -60390 -33291
5564 -33291 15431 -1129 -3365 -16698 -38449 -12763 -2268 -30865 -34592 -21783 -4426 -6097
$$ packed form
5652a28275j3895M0164M5965j6256k0709k2454L902P793K0537L7679M2691j6836
5640a9694k228P090O6603j9605k3739Q299M1351k7892O231J6482m1627m9337j1037
5627d9103L140J6254J545J3504L1460M594k8759r440j6185l6506j8067J1084L0092
5614d6387K6597J8028R01j4481n2389J8289k3465r016Q552J7220J145n273P33
5601e9546M6645J5896j107K1825K5863L860J2308J4196p55p6148k9548J2896k9548
5588d3163j8084M0119N1949K3571J0845n7502O779K2600m1718Q474L945l2453
5576b4638K386J9009j1661J8151N4140K6048R831j9316l9336o2191l2813K7099
5564c3291M8722j6560k236j3333k1751K5686J0495k8597l727J2809J7357j671
$$ plain form
5552 -6097 -37344 -46953 -49764 -66544 -74657 -81981 -55929 -9952 40339 69130 87462 55953 20579
5539 20579 -3314 -1857 -11358 -6219 56559 35346 -3771 5840 -11038 1618 -2775 20670 4155
5526 4155 -20233 -13949 -23871 27088 81964 67629 34827 51991 100111 88878 49578 -10994
5514 -10994 -51655 -52703 -42156 -41276 -19379 13284 54517 37183 38243 6717 -32692 4705 30283
5501 30283 371 -33878 -49700 -26640 50240 75570 21336 -25811 -29586 3846 11335 -14117
5489 -14117 -37084 -71017 -51971 -18176 21409 -13741 -9044 -8306 -35476 -37760 -65486 -99376 -66883
5476 -66883 -22798 -5895 -28234 -19716 14103 -10217 4441 -27995 -57859 -80915 -14002 15055
5464 15055 -15773 12583 31418 56155 45432 -33409 -57170 2241 17254 31733 53885 3865
$$ packed form
5552f097l1247r609k811j6780q113p324K6052M5977N0291K8791J8332l1509l5374
5539B0579k3893J457r501N139O2778k1213l9117R611j6878J2656m393K3445j6515
5526D155k4388O284r922N0959N4876j4335l2802J7164M8120j1233l9300o0572
5514a0994m0661j048J0547Q80K1897L2663M1233j7334J060l1526l9409L7397K5578
5501C0283k9912l4249j5822K3060P6880K5330n4234m7147l775L3432P489k5452
5489a4117k2967l3933J9046L3795L9585l5150M697P38k7170k284k7726l3890L2493
5476f6883M4085J6903k2339Q518L3819k4320J4658l2436k9864k3056O6913K9057
5464A5055l0828K8356J8835K4737j0723p8841k3761N9411J5013J4479K2152n0020
$$ plain form
5452 3865 -3410 -1164 3663 -37616 -26224 -40145 -34603 -23685 35677 90624 93463 59448 37370
5439 37370 16958 -13025 -32669 -61738 -91104 -107801 -95877 -86775 -63138 -47185 7082 6432
5427 6432 42669 46566 46722 24722 -14787 -20657 -25688 -16983 -4526 18713 41385 81384 68558
5414 68558 11374 -34541 -49843 -42305 -27983 -58646 -77475 -46494 -14278 -16860 -9533 -23889
5402 -23889 -21061 -34284 -64402 -58647 -32010 3729 73934 79329 23647 23169 11360 27462 17820
5389 17820 -4691 -28615 -23140 -13559 -5099 -32052 -25524 26864 43942 44286 17049 10751 -30908
5376 -30908 -76525 -66535 -7667 14548 71821 94365 55823 -10055 -22980 -66774 -93125 -131391
5364 -131391 -70098 -23708 7355 -33660 -59131 -17300 4844 -35639 -98356 -102962 -64838 -78294
$$ packed form
5452C865p275K246M827m1279J1392j3921N542J0918N9362N4947K839l4015k2078
5439C7370k0412k9983j9644k9069k9366j6697J1924R102K3637J5953N4267o50
5427F432L6237L897J56k2000l9509n870n031Q705J2457K3239K2672L9999j2826
5414F8558n7184m5915j5302P538J4322l0663j8829L0981L2216k582P327j4356
5402b3889K828j3223l0118N755K6637L5739P0205N395n5682m78j1809J6102r642
5389A7820k2511k3924N475R581Q460k6953O528N2388J7078L44k7237o298m1659
5376c0908m5617R990N8868K2215N7273K2544l8542o5878j2925m3794k6351l8266
5364a31391O1293M6390L1063m1015k5471M1831K2144m0483o2717m606L8124j3456
$$ plain form
5352 -78294 -34046 -12968 -7605 20121 57376 28432 -12349 -85185 -47549 -59747 -29437 4160
5340 4160 34778 -3419 -58997 -75168 -60634 -46881 -70554 -99457 -76847 -30696 -27641 -15210
5328 -15210 -5375 2537 44848 63976 92848 81697 53904 67981 59066 33156 -3037 2205 -21198
5315 -21198 -12692 8998 3238 21637 6813 -209 13544 25440 -14495 -36223 -24570 -27999 -43386
5302 -43386 -66222 -103346 -59935 -20880 -35845 -58259 -39701 -49698 -56590 -57251 -65840 -75553 -71506
5289 -71506 -26812 -11965 5860 20338 57161 69034 34765 -15783 -48902 -57729 -21260 25685
5277 25685 67187 56870 54017 50443 5847 -10323 16737 -2990 -35172 -72872 -53049 -38795
5265 -38795 -26462 -48589 -102731 -89302 -12617 -9808 -30331 -56514 -52836 -32415 -7256 -20161
$$ packed form
5352g8294M4248K1078N363K7726L7255k8944m0781p2836L7636j2198L0310L3597
5340D160L0618l8197n5578j6171J4534J3753k3673k8903K2610M6151L055J2431
5328a5210R835P912M2311J9128K8872j1151k7793J4077q915k5910l6193N242k3403
5315b1198Q506K1690n760J8399j4824p022J3753J1896l9935k1728J1653l429j5387
5302d3386k2836l7124M3411L9055j4965k2414J8558r997o892o61q589r713M047
5289g1506M4694J4847J7825J4478L6823J1873l4269n0548l3119q827L6469M6945
5277B5685M1502j0317k853l574m4596j6170K7060j9727l2182l7700J9823J4254
5265c8795J2333k2127n4142J3429P6685K809k0523k6183L678K0421K5159j2905
$$ plain form
5253 -20161 -2819 29916 -238 4911 30957 45331 27715 11694 -7402 -11371 5744 67406
5241 67406 23334 -51400 -67649 -40174 20110 39705 22581 28517 -3076 9023 28450 44560
5229 44560 39106 20656 -18773 -34293 -35546 40109 4255 838 63324 3638 -43516 -48856 -37415
5216 -37415 20633 48760 56334 15479 2406 1586 28148 16650 -22368 -23779 488 235 4552
5203 4552 -29176 -29705 -21737 -25391 -6639 20582 22814 18746 -4872 14314 16402 -5119 -4840 -25163
5189 -25163 -3678 15 -2682 8422 -6020 -26369 -64953 -123751 -150370 -176510 -96077 -19483
5177 -19483 33941 41770 22817 -21623 -26604 -54184 -47119 -18533 4520 -9413 -11321 19457 17154
5164 17154 28333 25484 -10007 -23396 -25807 -27406 -19649 -32557 -10520 -31207 -51075 -23629 -20411
$$ packed form
5253b0161J7342L2735l0154N149K6046J4374j7616j6021j9096l969J7115O1662
5241F7406m4072p4734j6249K7475O0284J9595j7124N936l1593J2099J9427J6110
5229D4560n454j8450l9429j5520j253P5655l5854l417O2486n9686m7154n340J1441
5216c7415N8048K8127P574m0855j3073q20K6562j1498l9018j411K4267k53M317
5203D552l3728n29P968l654J8752K7221K232m068k3618J9186K088k1521K79k0323
5189b5163K1485L693k697J1104j4442k0349l8584n8798k6619k6140Q0433P6594
5177a9483N3424P829j8953m4440m981k7580P065K8586K3053j3933j908L0778k303
5164A7154J1179k849l5491j3389k411j599P757j2908K2037k0687j9868K7446L218
$$ plain form
5151 -20411 -15160 -31699 -19029 -7700 -1024 -58947 -64941 -58785 -40799 -62039 -55254 -33457 -3048
5138 -3048 20837 14089 -28213 -25251 24112 20692 5780 -32880 -17359 -12634 -5137 -3615 -19701
5125 -19701 6297 41253 17744 48500 80467 57006 29428 36528 -5253 9278 48265 26651
5113 26651 50310 82957 34494 23421 670 -16803 -85769 -108414 -73352 -44517 -19743 -65187
5101 -65187 -109375 -117170 -93997 -99701 -85707 -95195 -53748 7335 17060 -24399 -12324 47329 38913
5088 38913 -23583 -54412 -35633 -34275 -49075 -104128 -88511 -47190 -35733 -19466 19333 22132
5076 22132 -4898 -15506 -19598 -38640 -10224 20336 10228 10786 -2923 32047 68142 6872
5064 6872 -49539 -48351 -34451 -29943 -36555 -30285 -7800 -19699 3681 9719 723 33950 45627
$$ packed form
5151b0411N251j6539J2670J1329O676n7923n994O156J7986k1240O785K1797L0409
5138c048K3885o748m2302K962M9363l420j4912l8660J5521M725P497J522j6086
5125a9701K5998L4956k3509L0756L1967k3461k7578P100m1781J4531L8987k1614
5113B6651K3659L2647m8463j1073k2751j7473o8966k2645L5062K8835K4774m5444
5101f5187m4188p795K3173n704J3994r488M1447O1083R725m1459J2075N9653q416
5088C8913o2496l0829J8779J358j4800n5053J5617M1321J1457J6267L8799K799
5076B2132k7030j0608m092j9042K8416L0560j0108N58j3709L4970L6095o1270
5064F872n6411J188J3900M508o612O270K2485j1899K3380O038q996L3227J1677
$$ plain form
5051 45627 62736 56081 58970 59420 71569 68979 68169 -6566 -17652 -9552 23702 59914 37810
5038 37810 22696 48 -22780 -40466 -30885 -21002 -43908 -51891 -48917 -25249 -40146 -10945 10629
5025 10629 23752 -28030 -28967 -31186 -2549 49463 48807 81121 66873 -4292 -24061 -10592 -8427
5012 -8427 51443 105827 86474 15286 -17837 231 20912 -4594 -24206 17566 15672 24497
5000 24497 23710 -17438 -43096 -46507 4693 53189 60582 59787 52184 51931 37331 -23478 -12568 -21094
4986 -21094 -51446 -36325 4712 -3430 -35875 -28427 15009 21776 23918 -10637 -27533 -57688 -48071
4973 -48071 -34937 -34094 -47095 -28309 11351 71396 73434 34965 6503 -22598 2572 56820
4961 56820 69051 51079 -10266 -39179 -42626 -7537 22018 -8281 -20044 9992 19960 23858
$$ packed form
5051D5627J7109o655K889M50J2149k590q10p4735j1086Q100L3254L6212k2104
5038C7810j5114k2648k2828j7686R581R883k2906p983K974K3668j4897K9201K1574
5025A0629J3123n1782r37k219K8637N2012o56L2314j4248p1165j9769J3469K165
5012h427N9870N4384j9353p1188l3123J8068K0681k5506j9612M1772j894Q825
5000B4497p87m1148k5658l411N1200M8496P393p95p603k53j4600o0809J0910q526
4986b1094l0352J5121M1037q142l2445P448M3436O767K142l4555j6896l0155R617
4973d8071J3134Q43j3001J8786L9660O0045K038l8469k8462k9101K5170N4248
4961E6820J2231j7972o1345k8913l447L5089K9555l0299j1763L0036R968L898
$$ plain form
4949 23858 9197 17489 12545 -57389 -72597 -29605 -34240 -38298 -72107 -37362 -2386 8248 -11834
4936 -11834 -56339 -77277 -25165 -8178 3197 12547 -2928 -18824 13547 47624 46040 12871
4924 12871 -25880 -92956 -109147 -127159 -66272 -22831 10848 3007 10237 38255 11816 -52073
4912 -52073 -48506 -10938 -11517 -11234 -33810 -59056 -46626 -16689 11645 75012 100804 74304 60765
4899 60765 54566 26885 4248 -9446 -51154 9821 78410 -20354 -65861 -44444 -1360 10787
4887 10787 -4449 -1634 -30604 -54419 -48850 -96773 -138429 -139226 -99553 -125627 -86714 -49801 -74230
4874 -74230 -110613 -94076 -58368 -70640 -94447 -108654 -159799 -74356 -45910 -30040 -22398 -3988
4862 -3988 -9751 -26154 -25865 -11446 -30708 -48753 -68307 -55737 -10472 -33127 -56677 -21562 4530
$$ packed form
4949B3858j4661Q292m944o9934j5208M2992m635m058l3809L4745L4976J0634k0082
4936a1834m4505k0938N2112J6987J1375R350j5475j5896L2371L4077j584l3169
4924A2871l8751o7076j6191j8012O0887M3441L3679p841P230K8018k6439o3889
4912e2073L567L7568n79K83k2576k5246J2430K9937K8334O3367K5792k6500j3539
4899F0765o199k7681k2637j3694m1708O0975O8589r8764m5507K1417M3084J2147
4887A0787j5236K815k8970k3815N569m7923m1656p97L9673k6074L8913L6913k4429
4874g4230l6383J6537L5708j2272k3807j4207n1145Q5443K8446J5870P642J8410
4862c988n763j6403K89J4419j9262j8045j9554J2570M5265k2655k3550L5115K6092
$$ plain form
4849 4530 45020 58332 118564 104655 30075 -53909 -82186 -55616 -58557 -37065 -20169 -7819
4837 -7819 20881 44569 49106 11103 -19347 46862 80373 39355 -6840 -1570 -48417 -44922 -3528
4824 -3528 -15916 -10251 9595 19640 41826 16216 -20956 -42865 -50893 -72524 -58979 -27672
4812 -27672 -985 -15797 -21002 -17512 8240 65251 57064 57532 68582 31813 -6720 -41861 -57255
4799 -57255 -87288 -104955 -78764 -23920 10839 18347 9356 -11202 -16287 29055 -15429 -85753
4787 -85753 -88461 -35138 6514 25894 -7331 -56360 -15668 9385 -26456 -34455 -31594 -14898
4775 -14898 -42004 -37649 -10989 -29919 -44411 -61073 -74879 -49110 -21282 -9605 -57029 -86978
4763 -86978 -86850 -78279 -51259 -35641 -96750 -95911 -15644 14124 7349 4889 -21100 -23683 -21342 -63182
$$ packed form
4849D530M0490J3312O0232j3909p4580q3984k8277K6570k941K1492J6896J2350
4837g819K8700K3688M537l8003l0450O6209L3511m1018m6195N270m6847L495M1394
4824c528j2388N665J9846J0045K2186k5610l7172k1909q028k1631J3545L1307
4812b7672K6687j4812n205L490K5752N7011q187M68J1050l6769l8533l5141j5394
4799e7255l0033j7667K6191N4844L4759P508q991k0558n085M5342m4484p0324
4787h5753k708N3323M1652J9380l3225m9029M0692K5053l5841p999K861J6696
4775a4898k7106M355K6660j8930j4492j6662j3806K5769K7828J1677m7424k9949
4763h6978J28Q571K7020J5618o1109Q39Q0267K9768o775k460k5989k583K341m1840
$$ plain form
4749 -63182 -69889 -79424 -33727 -37740 -67677 -54659 -29724 -52886 -10768 -9789 11389 72285 49101
4736 49101 -3153 -24757 23976 32665 3205 -15124 -11021 9212 18238 32884 41152 1996 -23779
4723 -23779 -18594 -8631 -15206 -33468 -5580 -3157 -816 -21626 -22538 -28825 -33565 12272 16970 44443
4709 44443 32566 -17617 -7032 14871 -45 -18442 -51410 -44290 -43845 -44178 -23497 -8646 25950
4696 25950 16651 13165 -4796 5549 -23663 -51787 -58742 -70318 -65685 -11518 -36076 -67897 -87088
4683 -87088 -64932 2236 -2037 8883 6484 -3584 -9480 -9071 22708 -17631 -30553 33860 71107
4670 71107 37601 20379 43453 2711 -50073 -43253 -43625 -54766 -59511 -24980 -4165 -21886 -53251
4657 -53251 -55401 8283 47131 -20776 -64926 -6508 16388 8941 11556 29914 54431 69655
$$ packed form
4749f3182o707r535M5697m013k9937J3018K4935k3162M2118R79K1178O0896k3184
4736D9101n2254k1604M8733Q689k9460j8329M103K0233R026J4646Q268l9156k5775
4723b3779N185R963o575j8262K7888K423K341k0810r12o287m740M5837M698K7473
4709D4443j1877n0183J0585K1903j4916j8397l2968P120M45l33K0681J4851L4596
4696B5950r299l486j7961J0345k9212k8124o955j1576M633N4167k4558l1821j9191
4683h7088K2156O7168m273J0920k399j0068n896M09L1779m0339j2922O4413L7247
4670G1107l3506j7222K3074m0742n2784O820l72j1141m745L4531K0815j7721l1365
4657e3251k150O3684L8848o7907m4150N8418K2896p447K615J8358K4517J5224
$$ plain form
4645 69655 65003 19020 -30573 -49567 -71396 -45384 -3672 -8744 -65930 -68926 -19106 37014
4633 37014 28446 28279 56910 61002 18921 50203 42583 9776 21187 36631 -12777 15141 7388
4620 7388 -22096 -43313 -30073 -50052 -39678 -73701 -102357 -67609 -39614 -34087 -86999 -59671
4608 -59671 -26108 9647 376 -54070 -88840 -111845 -125902 -93987 -65682 -53449 -31606 -23294
4596 -23294 -34134 -31089 -31953 -74650 -65018 -54207 -33379 -12664 37170 72224 66716 23288 -16568
4583 -16568 -77301 -67063 -47728 -29402 -883 2989 -59215 -37300 4162 37073 -5747 -52908
4571 -52908 -58054 -50980 -9716 22426 26967 15830 2969 -27566 -4207 21531 1997 28634
4559 28634 47568 -26620 -36764 -38260 -42470 4636 10386 -48991 -57487 -23661 -40396 -14905 -22681
$$ packed form
4645F9655m652m5983m9593j8994k1829K6012M1712n072n7186k996M9820N6120
4633C7014q568j67K8631M092m2081L1282p620l2807J1411J5444m9408K7918p753
4620G388k9484k1217J3240j9979J0374l4023k8656L4748K7995N527n2912K7328
4608e9671L3563L5755r271n4446l4770k3005j4057L1915K8305J2233K1843Q312
4596b3294j0840L045q64m2697R632J0811K0828K0715M9834L5054n508m3428l9856
4583a6568o0733J0238J9335J8326K8519L872o2204K1915M1462L2911m2820m7161
4571e2908n146P074M1264L2142M541j1137j2861l0535K3359K5738j9534K6637
4559B8634J8934p4188j0144j496m210M7106N750n9377q496L3826j6735K5491p776
$$ plain form
4546 -22681 -7473 7850 -29012 -27871 28272 30486 45941 39315 -12244 -57101 -129944 -94863
4534 -94863 -63550 -18327 13771 41807 4284 6420 9273 43814 19489 21211 -10326 13092
4522 13092 121639 147645 45672 -10452 -41638 -47430 20324 17952 -501 17400 12152 17428
4510 17428 16080 -34596 -86024 -78732 -74422 -57364 -98909 -99259 -38732 -7487 -6873 14593 -1163
4497 -1163 -4523 -36084 -39259 -28733 12028 -9046 -43075 -80705 -22368 9289 -26447 -26246 -21136
4484 -21136 49663 95859 53544 30081 28929 -1497 -11134 48724 48370 14162 -6704 -32832 -89246
4471 -89246 -30203 72483 69101 36451 30733 49330 32305 2828 -3214 29332 10034 -20456
4459 -20456 -3237 -32306 -72179 -98416 -78535 -75451 -78237 -24275 -27451 -89677 -55275 -17521
$$ packed form
4546b2681J5208J5323l6862J141N6143K214J5455o626n1559m4857p2843L5081
4534i4863L1313M5223L2098K8036l7523K136K853L4541k4325J722l1537K3418
4522A3092J08547K6006j01973n6124l1186n792O7754k372j8453J7901n248N276
4510A7428j348n0676n1428P292M310J7058m1545l50O0527L1245O14K1466j5756
4497a163l360l1561l175J0526M0761k1074l4029l7630N8337L1657l5736K01N110
4484b1136P0799M6196m2315k3463j152l0426r637N9858l54l4208k0866k6128n6414
4471h9246N9043J02686l382l2650n718J8597j7025k9477o042L2546j9298l0490
4459b0456J7219k9069l9873k6237J9881L084k786N3962l176o2226L4402L7754
$$ plain form
4447 -17521 16064 848 10373 22243 -13882 -29659 -7450 16607 -40856 -70939 -74433 -46469
4435 -46469 -50187 4871 -2124 -4524 -3418 -30269 -23470 -10227 2231 11853 48488 9727 -31470
4422 -31470 -3562 -1773 22763 35968 -3289 -65027 -68002 -63473 -71304 -85015 -64946 -58198 -87508
4409 -87508 -85516 -95654 -71535 -4249 13296 18678 13621 -27191 -17089 -32468 -56992 -69407
4397 -69407 -80223 -94743 -97165 -82842 -117175 -80727 -74773 -70279 -53841 -48779 -37256 9019 9828
4384 9828 33383 26341 936 29582 86849 75325 32514 14151 29032 12183 -17998 -1130
4372 -1130 -4338 23851 17122 22358 -7601 -40499 -34001 -20635 989 8893 26800 15224 -21928
4359 -21928 5249 52198 47474 1692 -23282 -38794 -7660 10074 23115 3444 -27716 -32641
$$ packed form
4447a7521L3585j5216R525J1870l6125j5777K2209K4057n7463l0083l494K7964
4435d6469l718N5058o995k400J106k6851O799J3243J2458R622L6635l8761m1197
4422c1470K7908J789K4536J3205l9257o1738k975M529p831j3711K0069O748k9310
4409h7508J992j0138K4119O7286J7545N382n057m0812J0102j5379k4524j2415
4397f9407j0816j4520k422J4323l4333L6448N954M494J6438N062J1523M6275Q09
4384I828K3555p042k5405K8646N7267j1524m2811j8363J4881j6849l0181J6868
4372a130l208K8189o729N236k9959l2898O498J3366K1624P904J7907j1576l7152
4359b1928K7177M6949m724m5782k4974j5512L1134J7734J3041j9671l1160m925
$$ plain form
4347 -32641 -12832 6791 7386 46783 39770 13022 -2829 -27223 -82145 -71960 -52926 -82942
4335 -82942 -105683 -55498 -41134 -31018 -31152 -17809 -3485 -9304 -43354 -3244 14863 11294 12202
4322 12202 -12738 -35420 -11980 -21842 -9522 -6781 -23347 -51880 -49536 -67681 -84228 -60781
4310 -60781 -60525 -13457 41122 65566 81818 93291 33332 -11309 -10471 -5226 -36232 -41124 10534
4297 10534 25460 3068 -78376 -27424 -29097 -37023 -47714 -19604 5711 13407 22162 27284 38162
4284 38162 61976 51273 10315 -21929 -34245 -28221 -25000 -44466 7308 -8983 -44190 -41427
4272 -41427 -59380 -77753 -72370 -21051 -23570 -62063 -54124 -54835 -880 27709 -3395 -9380 -2316
4259 -2316 -12068 27023 82904 73496 29158 -16904 -24629 28983 42699 -6341 -32824 -22593 -108
$$ packed form
4347c2641J9809J9623N95L9397p013k6748j5851k4394n4922J0185J9034l0016
4335h2942k2741N0185J4364J0116j34J3343J4324n819l4050M0110J8107l569R08
4322A2202k4940k2682K3440r862J2320K741j6566k8533K344j8145j6547K3447
4310f0781K56M7068N4579K4444J6252J1473n9959m4641Q38N245l1006m892N1658
4297A0534J4926k2392q1444N0952j673p926j0691K8110K5315P696Q755N122J0878
4284C8162K3814j0703m0958l2244j2316O024L221j9466N1774j6291l5207K763
4272d1427j7953j8373N383N1319k519l8493P939p11N3955K8589l1104n985P064
4259b316r752L9091N5881r408m4338m6062p725N3612J3716m9040k6483J0231K2485
$$ plain form
4246 -108 -22317 26368 78918 56475 17009 -15473 -13805 -15018 247 20782 57042 75505 67980
4233 67980 45657 33107 35866 -19438 -44500 -50982 -32702 -18521 -16794 -6038 -12611 -20308 -33975
4220 -33975 -248 19805 -31286 -74931 -33852 -15845 10093 -58805 -77855 -44351 -45837 -83195
4208 -83195 -18006 25765 25951 26786 15334 -45437 -73840 -38072 -60612 -82232 -19780 -6182 -59442
4195 -59442 -97205 -72279 -67583 -62859 -41505 -37128 -13760 -5090 -17800 -23791 -29803 -25279 -33224
4182 -33224 2505 4983 8776 -10870 -1679 23679 52607 67537 41657 51418 88615 57345 73438
4169 73438 70054 21934 17102 10107 6134 5379 12763 -26989 -50808 -62904 -41492 -12601 22501
4156 22501 -9489 -33598 811 -2010 -12119 -30463 -42727 -47833 -86153 -56657 -28569 -43601
$$ packed form
4246a08k2209M8685N2550k2443l9466l2482J668j213J5265K0535L6260J8463p525
4233F7980k2323j2550K759n5304k5062o482J8280J4181J727J0756o573p697j3667
4220c3975L3727K0053n1091m3645M1079J8007K5938o8898j9050L3504j486l7358
4208h3195O5189M3771J86Q35j1452o0771k8403L5768k2540k1620O2452J3598n3260
4195e9442l7763K4926M696M724K1354M377K3368Q670j2710n991o012M524p945
4182c3224L5729K478L793j9646R191K5358K8928J4930k5880R761L7197l1270J6093
4169G3438l384m8120m832o995l973p55P384l9752k3819j2096K1412K8891L5102
4156B2501l1990k4109L4409k821j0109j8344j2264n106l8320K9496K8088j5032
$$ plain form
4144 -43601 -80702 -70941 -48913 -68216 -89405 -85338 -89351 -80110 -65842 -37396 -8351 -10042 -30637
4131 -30637 -10889 -22 23448 39563 54336 44902 58161 20701 -30349 -13179 -736 4472
4119 4472 35538 -13213 -52714 -31974 -22249 22102 6949 -13227 14636 10078 7339 24147 43261
4106 43261 49648 44662 -6124 -9703 -2705 -8664 -60024 -66519 -75352 -57893 -9015 47003 71341
4093 71341 22519 -3938 15983 10577 16773 25580 -9237 -13702 70976 42944 -6749 -1488 -13762
4080 -13762 -45872 -20748 -1241 -46941 -59968 -68694 -1954 -7372 -9977 45914 66223 36967
4068 36967 63139 124892 86719 2719 -8995 -47424 -46585 -58457 -22186 -51833 -50666 -13150
4056 -13150 -41525 -65511 -69443 -83967 -51865 17926 52820 46529 34857 14500 -3739 1434
$$ packed form
4144d3601l7101R761K2028j9303k1189M067m013R241J4268K8446K9045j691k0595
4131c0637J9748J0867K3470J6115J4773r434J3259l7460n1050J7170J2443N208
4119D472L1066m8751l9501K0740R725M4351j5153k0176K7863m558k739J6808J9114
4106D3261O387m986n0786l579O998n959n1360o495q833J7459M8878N6018K4338
4093G1341m8822k6457J9921n406O196Q807l4817m465Q4678k8032m9693N261j2274
4080a3762l2110K5124J9507m5700j3027q726O6740n418k605N5891K0309k9256
4068C6967K6172O1753l8173q4000j1714l8429Q39j1872L6271k9647J167L7516
4056a3150k8375k3986l932j4524L2102O9791L4894o291j1672k0357j8239N173
$$ plain form
4044 1434 -7238 -45973 -50200 -28885 18867 8597 -14036 -107310 -82342 -43938 -13848 -40116
4032 -40116 -28429 -24234 -30404 -43744 -35317 -52297 -87075 -92027 -102151 -80095 -47648 -37742 -2118
4019 -2118 -20485 -57951 -86815 -68050 -43197 8955 3494 -22134 -70575 -28918 26667 417
4007 417 -10124 -20445 -27725 15420 21748 -13071 -37508 -55094 -4704 -10004 -14263 -390 -32977
3994 -32977 -30287 5877 11579 -7256 -14992 -9135 -5408 19119 -1208 11320 39147 11646 4384
3981 4384 19302 -36680 -50020 -21269 -8268 10404 4088 -46125 -25620 -22163 -76497 -61434
3969 -61434 -51689 -38387 -31443 -22394 16014 14214 -28352 -42064 -51651 -48790 -94149 -137188 -142762
3956 -142762 -111848 -89641 -74792 -46089 -64102 -68595 -97867 -124499 -157216 -138769 -114422 -51435
$$ packed form
4044A434q672l8735m227K1315M7752j0270k2633r3274K4968L8404L0090k6268
4032d0116J1687M195o170j3340Q427j6980l4778m952j0124K2056L2447R906L5624
4019b118j8367l7466k8864J8765K4853N2152n461k5628m8441M1657N5585k6250
4007D17j0541j0321p280M3145O328l4819k4437j7586N0390n300m259J3873l2587
3994c2977K690L6164N702j8835p736N857L727K4527k0327J2528K7827k7501p262
3981D384J4918n5982j3340K8751J3001J8672o316n0213K0505L457n4334J5063
3969f1434R745J3302O944R049L8408j800m2566j3712r587K861m5359m3039n574
3956a42762L0914K2207J4849K8703j8013m493k9272k6632l2717J8447K4347O2987
$$ plain form
3944 -51435 -38029 -45989 -36676 -77922 -101316 -114926 -31010 24470 -11740 -45952 -28998 -10534
3932 -10534 -6907 -29575 -33802 -81155 -57994 -47837 -13892 1569 26131 9390 -12996 -45684
3920 -45684 -45734 -91655 -100578 -66456 -64309 -92365 -77027 -77492 -54023 -26137 10394 16275 -18385
3907 -18385 -18899 33187 67922 60611 34866 19110 -35090 -39462 -37506 -26730 -23791 -14864 -26595
3894 -26595 -10156 -43204 -82268 -98292 -73728 -59080 -45402 -92718 -100057 -52302 -24845 -54758
3882 -54758 -72454 -24114 -53131 -34710 12367 34877 58004 59750 56531 -981 -54649 -43368
3870 -43368 -62054 -3985 44597 31337 -15419 -32706 17834 37819 5468 16542 7508 -28616
3858 -28616 32477 49709 5287 15066 4692 -30549 -14076 -8073 -25026 -63719 -40991 -16090
$$ packed form
3944e1435J3406p960R313m1246k3394j3610Q3916N5480l6210l4212J6954J8464
3932a0534L627k2668m227m7353K3161J0157L3945J5461K4562j6741k2386l2688
3920d5684n0m5921q923L4122K147k8056J5338m65K3469K7886L6531N881l4660
3907a8385n14N2086L4735p311k5745j5756n4200m372J956J0776K939Q927j1731
3894b6595J6439l3048l9064j6024K4564J4648J3678m7316p339M7755K7457k9913
3882e4758j7696M8340k9017J8421M7077K2510K3127J746l219n7512n3668J1281
3870d3368j8686N8069M8582j3260m6756j7287N0540J9985l2351J1074r034l6124
3858b8616O1093J7232m4422R779j0374l5241J6473O003j6953l8693K2728K4901
$$ plain form
3846 -16090 -16925 -55048 -44258 -41772 -27414 -20556 4144 9953 36997 79793 79625 96158 26879
3833 26879 4021 -44340 -54814 -53863 -58459 -34950 -8249 -5013 2128 -14458 -33242 4348 16203
3820 16203 -32229 -66321 -84308 -99191 -79528 -51165 -31192 -44790 -65479 -27250 22335 44368
3808 44368 40876 6890 -17851 -37747 -5559 22631 21595 -11324 -25910 -33914 -2803 -11292 -35385
3795 -35385 -24691 -37082 -58612 -8164 -10257 -104605 -126383 -133502 -108168 -75631 -46066 2240
3783 2240 -15453 -85331 -101778 -118025 -71227 -36146 -6860 -15059 17721 53216 90951 46796
3771 46796 33470 23730 -42090 -68615 -78647 -35760 -35490 -48527 -57962 -52917 -54820 -27430 -2793
3758 -2793 -29817 -14688 2665 -57257 -75912 -92733 -102217 -86714 -57712 -36468 -10837 5553
$$ packed form
3846a6090q35l8123J0790K486J4358O858K4700N809K7044M2796j68J6533o9279
3833B6879k2858m8361j0474R51m596K3509K6701L236P141j6586j8784L7590J1855
3820A6203m8432l4092j7987j4883J9663K8363J9973j3598k0689L8229M9585K2033
3808D4368l492l3986k4741j9896L2188K8190j036l2919j4586q004L1111q489k4093
3795c5385J0694j2391k1530N0448k093r4348k1778p119K5334L2537K9565M8306
3783B240j7693o9878j6447j6247M6798L5081K9286q199L2780L5495L7735m4155
3771D6796j3326r740o5820k6525j0032M2887K70j3037r435N045j903K7390K4637
3758b793k7024J5129J7353n9922j8655j6821r484J5503K9002K1244K5631J6390
$$ plain form
3746 5553 21496 -3687 -35855 -44872 -29138 1389 30224 -20779 -67164 -43104 -28326 -34933
3734 -34933 -68061 -48722 -60083 -62604 -76629 -66418 -53744 -40165 -61741 -50819 -50562 -75741
3722 -75741 -44688 -25340 1970 26915 139 -32208 -60542 -57724 -24554 -41674 -55275 -46692
3710 -46692 -30760 -45421 -71159 -60398 -68629 -49601 -5355 12642 -1822 -34606 -45538 -11149
3698 -11149 11439 43057 34002 4346 5306 -4717 -22173 2394 17683 -12315 7033 -12931
3686 -12931 -26704 8629 -4708 -37609 -29159 -18293 -40258 -10731 -22261 -50329 -57936 -7559
3674 -7559 10341 -30337 -45154 -46819 -70727 -26230 42485 30388 -13065 -43873 -28066 -32528
3662 -32528 -59043 -53036 -40279 -23267 10204 18040 -14581 -27902 -3586 -20879 4506 31585
$$ packed form
3746E553J5943k5183l2168r017J5734L0527K8835n1003m6385K4060J4778o607
3734c4933l3128J9339j1361k521j4025J0211J2674J3579k1576J0922K57k5179
3722g5741L1053J9348K7310K4945k6776l2347k8334K818L3170j7120j3601Q583
3710d6692J5932j4661k5738J0761q231J9028M4246J7997j4464l2784j0932L4389
3698a1149K2588L1618r055k9656R60j0023j7456K4567J5289k9998J9348j9964
3686a2931j3773L5333j3337l2901Q450J0866k1965K9527j1530k8068p607N0377
3674g559J7900m0678j4817j665k3908M4497O8715j2097m3453l0808J5807m462
3662c2528k6515O007J2757J7012L3471P836l2621j3321K4316j7293K5385K7079
$$ plain form
3650 31585 -7615 -68312 -104859 -83749 -58815 -24106 -30136 -48282 -43429 -7394 -7444 -58138 -102413
3637 -102413 -48715 -52435 -46344 -21099 -16802 -45423 -95649 -95438 -64318 -14963 -24874 -33325 -25156
3624 -25156 -27430 2854 -6881 19118 28888 33706 -2243 -25495 -18518 -16702 -1537 -6270 -6990 -17175
3610 -17175 -32170 -12084 -47361 -44581 -17619 -45355 -45758 -48819 -23132 28410 -15265 -37409 -55245
3597 -55245 -63067 -57618 -6252 39071 64867 102386 63172 41135 12285 -6762 -10571 -37572
3585 -37572 -51940 -71800 -98094 -82821 -59239 2808 -7848 -6010 -26979 -56010 -64620 -7836
3573 -7836 71831 85659 50865 38353 3157 6414 -8881 753 -5587 3147 30855 53965 7094
3560 7094 -38517 -57863 -74220 -81201 -74573 -90504 -119914 -88553 -33943 4139 7468 -29846 -30579
$$ packed form
3650C1585l9200o0697l6547K1110K4934L4709o030j8146M853L6035n0n0694m4275
3637a02413N3698l720O091K5245M297k8621n0226K11L1120M9355r911q451Q169
3624b5156k274L0284r735K5999R770M818l5949k3252O977J816J5165m733p20j0185
3610a7175j4995K0086l5277K780K6962k7736m03l061K5687N1542m3675k2144j7836
3597e5245p822N449N1366M5323K5796L7519l9214k2037k8850j9047l809k7001
3585c7572j4368j9860k6294J5273K3582O2047j0656J838k0969k9031q610N6784
3573g836P9667J3828l4794j2512l5196L257j5295R634o340Q734K7708K3110m6871
3560G094m5611j9346j6357o981O628j5931k9410L1361N4610L8082L329l7314p33
$$ plain form
3547 -30579 5361 2507 -47228 -49315 -74597 -106061 -121459 -93308 -64696 -17220 -8865 -15766 -34769
3534 -34769 -20100 10034 12906 6838 1512 25937 15858 -11194 -10264 16517 7022 4923 -6416
3521 -6416 3086 16706 9694 14359 1671 -75380 -59470 -14963 -56353 -17922 38032 82679 49880
3508 49880 5378 -14556 9310 -54077 -22116 18673 -11373 -84641 -112778 -124626 -92335 -39983
3496 -39983 -3058 6367 3241 15465 18778 46170 59052 61083 72339 76382 18696 893 -12951
$$ packed form
3547c0579L5940k854m9735k087k5282l1464j5398K8151K8612M7476Q355o901j9003
3534c4769J4669L0134K872o068n326K4425j0079k7052R30K6781r495k099j1339
3521f416R502J3620p012M665j2688p7051J5910M4507m1390L8431N5954M4647l2799
3508D9880m4502j9934K3866o3387L1961M0789l0046p3268k8137j1848L2291N2352
3496c9983L6925R425l126J2224L313K7392J2882K031J1256M043n7686j7803j3844
$$ [...]
##END NTUPLES=NMR SPECTRUM
##END=
