##TITLE=Analysis number 330450
Compound Code cc 64201
Book Reference 559/8
Project Code adrs
Chemist Name benw
##JCAMPDX= 6.0         $$ Bruker NMR JCAMP-DX V2.0
##DATA TYPE= NMR SPECTRUM
##DATA CLASS= NTUPLES
##ORIGIN= Bruker BioSpin GmbH
##OWNER= nmr
$$ XWIN-NMR		Version 3.5
$$ Tue Nov 27 10:12:54 2007 GMT Standard Time (UT+0h)  MAYBRIDGE\nmr@NMR_250MHZ
##.OBSERVE FREQUENCY= 250.131544655141
##.OBSERVE NUCLEUS= ^1H
##.ACQUISITION MODE= SIMULTANEOUS (DQD)
##.ACQUISITION SCHEME= undefined
##.AVERAGES= 16
##.DIGITISER RES= 18
##SPECTROMETER/DATA SYSTEM= dpx250
##.PULSE SEQUENCE= zg30
##.SOLVENT NAME= DMSO
##.SHIFT REFERENCE= (INTERNAL, DMSO, 0, 16.522)
##AUDIT TRAIL= $$ (NUMBER, WHEN, WHO, WHERE, WHAT)
$$ ##TITLE= Audit trail, XWIN-NMR		Version 3.5
$$ ##JCAMPDX= 5.01
$$ ##ORIGIN= Bruker BioSpin GmbH
$$ ##OWNER= nmr
$$ C:\u/data/dgb/nmr/ADRS/2280/pdata/1/auditp.txt
$$ ##AUDIT TRAIL=  $$ (NUMBER, WHEN, WHO, WHERE, WHAT)
(   1,<2007-11-27 10:12:22.61 +000>,<MAYBRIDGE\nmr>,<NMR_250MHZ>,
      <created by zg, POWCHK disabled, PULCHK disabled
       configuration hash MD5:
       76 6E 9A 78 1E 09 19 81 EC 84 63 8F B0 6A 59 2D
       data hash MD5: 64K
       2C 43 34 6D 8F 12 95 DE 57 FE FE E4 4A 2B 9C 5E>)
(   2,<2007-11-27 10:12:41.68 +000>,<MAYBRIDGE\nmr>,<NMR_250MHZ>,
      <Start of raw data processing
       ef LB = 0.3 FT_mod = 6 PKNL = 1 SI = 32K 
       data hash MD5: 32K
       1E D6 36 3A 73 BF FD 6B FA 6A A0 A9 1F E5 B0 77>)
(   3,<2007-11-27 10:12:43.53 +000>,<MAYBRIDGE\nmr>,<NMR_250MHZ>,
      <apk 
       data hash MD5: 32K
       BE A3 D8 99 2C 51 E7 93 F5 7B 34 62 BA 07 FA 5D>)
(   4,<2007-11-27 10:12:44.29 +000>,<MAYBRIDGE\nmr>,<NMR_250MHZ>,
      <abs ABSG = 5 
       data hash MD5: 32K
       75 12 81 D7 CB 09 31 9F 98 69 FE EB 20 E3 26 44>)
$$ ##END=
$$ 
$$ hash MD5
$$ 01 64 1F EF 32 0E 98 5F 63 89 7E 2B 3D 08 F9 F2
##$RELAX= 
##$RELAX= 
##$RELAX= 
##$RELAX= 
##$RELAX= 
##$RELAX= 
##$RELAX= 
$$ Bruker specific parameters
$$ --------------------------
##$DU= <C:\u>
##$EXPNO= 2280
##$NAME= <ADRS>
##$PROCNO= 1
##$TYPE= <nmr>
##$USER= <dgb>
##$AMP= (0..31)
100 100 100 100 100 100 100 100 100 100 100 100 100 100 100 100 100 100 
100 100 100 100 100 100 100 100 100 100 100 100 100 100 
##$AQSEQ= 0
##$AQ_mod= 3
##$AUNM= <au_zg>
##$AUTOPOS= <48 >
##$BF1= 250.13
##$BF2= 250.13
##$BF3= 250.13
##$BF4= 250.13
##$BF5= 500.13
##$BF6= 500.13
##$BF7= 500.13
##$BF8= 500.13
##$BYTORDA= 1
##$CFDGTYP= 0
##$CFRGTYP= 5
##$CHEMSTR= <none>
##$CNST= (0..31)
1 1 145 1 1 1 1 1 1 1 1 1 1 1 1 1 1 1 1 1 1 1 1 1 1 1 1 1 1 1 1 1 
##$CPDPRG= <>
##$CPDPRG1= <>
##$CPDPRG2= <>
##$CPDPRG3= <>
##$CPDPRG4= <mlev>
##$CPDPRG5= <mlev>
##$CPDPRG6= <mlev>
##$CPDPRG7= <mlev>
##$CPDPRG8= <mlev>
##$CPDPRGB= <>
##$CPDPRGT= <>
##$D= (0..31)
0 1 0 0 0 0 0 0 0 0.06 0 0 0 0 0 0 0.0002 0 0 0 0 0 0 0 0 0 0 0 0 0 0 
0 
##$DATE= 1196158341
##$DBL= (0..7)
120 120 120 120 120 120 120 120 
##$DBP= (0..7)
150 150 150 150 150 150 150 150 
##$DBP07= 0
##$DBPNAM0= <>
##$DBPNAM1= <>
$$ [...]
##$SUBNAM7= <"">
##$SUBNAM8= <"">
##$SUBNAM9= <"">
##$SW= 20.6930455092707
##$SWIBOX= (0..15)
0 0 3 0 0 0 0 0 0 0 0 0 0 0 0 0 
##$SW_h= 5175.983436853
##$TD= 65536
##$TD0= 1
##$TE= 295.16
##$TE2= 300
##$TE3= 300
##$TEG= 300
##$TL= (0..7)
0 120 120 120 120 120 120 120 
##$TP= (0..7)
150 150 150 150 150 150 150 150 
##$TP07= 0
##$TPNAME0= <>
##$TPNAME1= <>
##$TPNAME2= <>
##$TPNAME3= <>
##$TPNAME4= <>
##$TPNAME5= <>
##$TPNAME6= <>
##$TPNAME7= <>
##$TPOAL= (0..7)
0.5 0.5 0.5 0.5 0.5 0.5 0.5 0.5 
##$TPOFFS= (0..7)
0 0 0 0 0 0 0 0 
##$TUNHIN= 0
##$TUNHOUT= 0
##$TUNXOUT= 0
##$USERA1= <user>
##$USERA2= <user>
##$USERA3= <user>
##$USERA4= <user>
##$USERA5= <user>
##$V9= 5
##$VALIST= <valist>
##$VCLIST= <CCCCCCCCCCCCCCC>
##$VD= 0
##$VDLIST= <DDDDDDDDDDDDDDD>
##$VPLIST= <PPPPPPPPPPPPPPP>
##$VTLIST= <TTTTTTTTTTTTTTT>
##$WBST= 1024
##$WBSW= 4
##$XGAIN= (0..3)
0 0 0 0 
##$XL= 0
##$YL= 0
##$YMAX_a= 494797
##$YMIN_a= -510093
##$ZGOPTNS= <>
##$ZL1= 120
##$ZL2= 120
##$ZL3= 120
##$ZL4= 120
##$ABSF1= 16.522
##$ABSF2= -4.171173
##$ABSG= 5
##$ABSL= 3
##$ALPHA= 0
##$AQORDER= 0
##$ASSFAC= 0
##$ASSFACI= 0
##$ASSFACX= 0
##$ASSWID= 0
##$AUNMP= <proc_1d>
##$AZFE= 0.1
##$AZFW= 0.1
##$BCFW= 0
##$BC_mod= 0
##$BYTORDP= 0
##$COROFFS= 0
##$CY= 12.5
##$DATMOD= 1
##$DC= 0
##$DFILT= <>
##$DTYPP= 0
##$F1P= 14.0000005364418
##$F2P= -0.99999901652339
##$FCOR= 0.5
##$FTSIZE= 32768
##$FT_mod= 6
##$GAMMA= 0
##$GB= 0
##$INTBC= 1
##$INTSCL= 1
##$ISEN= 128
##$LB= 0.3
##$LEV0= 0
##$LPBIN= 0
##$MAXI= 10000
##$MC2= 0
##$MEAN= 0
##$ME_mod= 0
##$MI= 0
##$NCOEF= 0
##$NC_proc= -4
##$NLEV= 6
##$NOISF1= 0
##$NOISF2= 0
##$NSP= 0
##$NTH_PI= 0
##$NZP= 0
##$OFFSET= 16.522
##$PC= 1
##$PHC0= 156.5481
##$PHC1= 7.010747
##$PH_mod= 1
##$PKNL= yes
##$PPARMOD= 0
##$PSCAL= 4
##$PSIGN= 0
##$REVERSE= no
##$SF= 250.13
##$SI= 32768
##$SIGF1= 0
##$SIGF2= 0
##$SINO= 400
##$SIOLD= 32768
##$SREGLST= <1H.DMSO>
##$SSB= 0
##$STSI= 32768
##$STSR= 0
##$SW_p= 5175.98343685301
##$SYMM= 0
##$S_DEV= 0
##$TDeff= 65536
##$TDoff= 0
##$TI= <Analysis number 999999
Compound Code 99
Book Reference 9
Project Code 9>
##$TILT= no
##$TM1= 0
##$TM2= 0
##$TOPLEV= 0
##$USERP1= <user>
##$USERP2= <user>
##$USERP3= <user>
##$USERP4= <user>
##$USERP5= <user>
##$WDW= 1
##$XDIM= 32768
##$YMAX_p= 406540561
##$YMIN_p= -656641
$$ End of Bruker specific parameters
$$ ---------------------------------
##NTUPLES= NMR SPECTRUM
##VAR_NAME=  FREQUENCY,     SPECTRUM/REAL,   SPECTRUM/IMAG
##SYMBOL=    X,             R,               I
##VAR_TYPE=  INDEPENDENT,   DEPENDENT,       DEPENDENT
##VAR_FORM=  AFFN,          ASDF,            ASDF
##VAR_DIM=   32768,         32768,           32768
##UNITS=     HZ,            ARBITRARY UNITS, ARBITRARY UNITS
##FACTOR=    0.157963299565203, 1,           1
##FIRST=     4132.6476996994, 0,             0
##LAST=      -1043.33573715361, 0,           0
##MIN=       -1043.33573715361, -656641,     0
##MAX=       4132.6476996994, 406540561,     0
$$ Real data points
##PAGE= N=1
##DATA TABLE= (X++(R..R)), XYDATA
$$ [...]
24781B3728k3285q3251J3037O4737J0676n2438L1460k8817l3172M6053M4666M1039
$$ 23728 443 -82808 -69771 -5034 5642 -46796 -15336 -44153 -77325 -31272 13394 54433
24769E4433K2088l7404p0019n1880N1930O2721j1526K15K4260k7713k7667k3761
$$ 54433 76521 39117 -30902 -82782 -30852 31869 20343 20558 44818 17105 -10562 -34323
24757c4323j5693J9281j658K2472k667K2506K5140L425l5474P304L9789K6333
$$ -34323 -50016 -30735 -32393 -9921 -12588 9918 35058 38483 3009 10313 50102 76435
24745G6435M4949m957m7805n6932k256l4407M5957J909N599N3475J2448l9413
$$ 76435 121384 116427 68622 11690 9434 -24973 20984 22893 28492 81967 94415 55002
24733E5002l9483l7015j2659j1497J2726m3320J5086Q0390N666k1534N860j9783
$$ 55002 15519 -21496 -34155 -45652 -32926 -76246 -61160 19230 24896 3362 9222 -10561
24721a0561m211J4546l0646r722n443O1l1573J6529K3518k1046J6377Q3253K3411
$$ -10561 -14772 -226 -30872 -40594 -46037 -45976 -77549 -61020 -37502 -58548 -42171 41082 64493
24708F4493n0013J2700p727j2680m4941J4052l3496l8247J7256O7205K5127L772
$$ 64493 14480 27180 19453 6773 -38168 -24116 -57612 -95859 -78603 -11398 13729 17501
24696A7501k9843Q2548L8853K8052j8298m1902j2628k7521J368M9698j5497k0086
$$ 17501 -12342 70206 109059 137111 118813 76911 64283 36762 38130 87828 72331 52245
24684E2245p870N611J7210m942j9415K2065r735o3690j7210M6237j0356j0781
$$ 52245 44375 49986 67196 62254 42839 64904 55169 -8521 -25731 20506 10150 -631
24672f31k9721k7339l3630P2480O5675J307j5713j6856j8262L7386k3900m3141
$$ -631 -30352 -57691 -91321 -18841 46834 48141 32428 15572 -2690 34696 10796 -32345
24660c2345j1036o510L7621Q550K3034K9529M5808K6607j6050m6580j1614K5074
$$ -32345 -43381 -49891 -12270 -3720 19314 48843 94651 121258 105208 58628 47014 72088
24648G2088L111K0428J0843j7764k2628m6336j1336r555N633M595o4934p7944
$$ 72088 75199 95627 106470 88706 66078 19742 8406 -1149 4484 9079 -55855 -133799
24636a33799K7301O2889K5851L3712R436l2618o7619o607j3953J9222N6979j4797
$$ -133799 -106498 -43609 -17758 15954 25390 -7228 -74847 -81454 -95407 -76185 -19206 -34003
24624c4003k0461P145J0831l3135k1957K7331K5057L0040P9660m544j6962p0925
$$ -34003 -54464 -47319 -36488 -69623 -91580 -64249 -39192 -9152 70508 65964 49002 -21923
24612b1923m1876J9383M1303P633k0960P2870K5196q6081j3439k7924k8616J5030
$$ -21923 -63799 -44416 -3113 4520 -16440 56430 81626 -4455 -17894 -45818 -74434 -59404
24600e9404o127j4298j229N5441O7389K8548k6948j4736j5894q3734k7481K8339
$$ -59404 -65531 -79829 -81058 -25617 41772 70320 43372 28636 12742 -70992 -98473 -70134
24588g0134j4487N6P8541L0688M778k1864K9838Jl012O5852n6080k1983J8971
$$ -70134 -84621 -84565 -6024 24664 29442 7578 37416 37417 34405 100257 44177 22194 41165
24575D1165l3351l4319l9872r657M66o6209M1409L7852L3386L4963L4244l9295
$$ 41165 7814 -26505 -66377 -76034 -75568 -141777 -100368 -62516 -29130 5833 40077 782
24563G82L8877K0824l1362J2367k9154k2232M94K3011L2411J7029k7833j7322
$$ 782 39659 60483 29121 41488 12334 -9898 -9404 13607 46018 63047 35214 17892
24551A7892L648j100k4124l3224k5531k2285r590K2497N525J6885J9866J2029
$$ 17892 21540 20440 -3684 -36908 -62439 -84724 -94314 -71817 -66292 -49407 -29541 -17512
24539a7512L527K480O723N404R266J8416p942q099m5557J5673j3569R447P0509
$$ -17512 -13985 -11505 -4782 622 9888 28304 20362 12263 -33294 -17621 -31190 -21743 48766
24526D8766k529m8861l7689K0041O451L9923K1153m8141k9483k5999k8035M8177
$$ 48766 46237 -2624 -40313 -20272 -13821 26102 47255 -886 -30369 -56368 -84403 -36226
24514c6226P7406Q5819k2527m8487n5263K5190j2663K4844O0219p7294q0791N023
$$ -36226 41180 126999 104472 55985 722 25912 13249 38093 98312 21018 -59773 -54750
24502e4750j5994j5530R459J274J1144R9816P941j1842n448n7158m4234J6343
$$ -54750 -70744 -86274 -76815 -75541 -64397 35419 43360 31518 26070 -31088 -75322 -58979
24490e8979L349K1497j1862J3345J4831J5985L6417R710k0954j2303n8148j1346
$$ -58979 -55630 -34133 -45995 -32650 -17819 -1834 34583 44293 23339 11036 -47112 -58458
24478e8458L5331J778k8960r370J6397M390L0531L5918j9481l2962L9857j2810
$$ -58458 -23127 -21349 -50309 -59679 -43282 -38892 -8361 27557 8076 -24886 14971 2161
24466B161J8441k8498j4151O1631J0030m6925n1360n217K714Q1624J22048l1218
$$ 2161 20602 -7896 -22047 39584 49614 2689 -48671 -53888 -51174 30450 152498 121280
24454A21280n8152o2825l0187P865j6441l8775J9919K7552O3053p147p757N787
$$ 121280 63128 303 -29884 -22019 -38460 -77235 -57316 -29764 33289 26142 18385 24172
24442B4172J196L1701J5768l1745o1479k4477M6507M6552M706n9550n9003l2816
$$ 24172 25368 57069 72837 41092 -20387 -44864 1643 48195 52901 -6649 -65652 -98468
24430i8468j2600l676N1715O1025k5162l401M4846n1646p4553j8115J6067M1556
$$ -98468 -111068 -114744 -63029 -2004 -27166 -30567 14279 -37367 -111920 -130035 -113968 -72412
24418g2412Q3943J9104p829J6523L6676r629m4200l9088r25J4072L3681M2614
$$ -72412 11531 30635 22806 39329 76005 66376 22176 -16912 -17837 -3765 29916 72530
24406G2530L6852j9810m4527M0940M867q5809m916K3975n1828n4869M3087L3059
$$ 72530 109382 89572 45045 85985 90852 5043 127 24102 -27726 -82595 -39508 -6449
24394f449l1387L9380r233k8909J4827M9376J4604j5086k010j7960k1661n712
$$ -6449 -37836 1544 -7689 -36598 -21771 27605 42209 27123 25113 7153 -14508 -20220
24382b0220o946k0714N0011P3543l6441k8475n426M207l6445k4902j2291J717
$$ -20220 -27166 -47880 2131 75674 39233 10758 5332 9539 -26906 -51808 -64099 -62382
24370f2382N095K7873q004L3202l5609o3489L4960N2149q929j6453M1054P7690
$$ -62382 -57287 -29414 -37418 -4216 -39825 -103314 -68354 -16205 -25134 -41587 -533 77157
24358G7157N3141m1978j175m5088m1928R994l4652l1860r265N6375J3331j3182
$$ 77157 130298 88320 87145 42057 129 10123 -24529 -56389 -65654 -9279 4052 -9130
24346i130J1603N3694k6512P931j9058o7420K966K6645j3206k1920L929m0908
$$ -9130 2473 56167 29655 37586 18528 -48892 -45926 -19281 -32487 -54407 -50478 -91386
24334i1386m173J4446k2629N4552M1518R462J5119J0570k0249o3680P409R867
$$ -91386 -95559 -81113 -103742 -49190 -7672 1790 16909 27479 7230 -56450 -49041 -39174
24322c9174j628N1147Q0744r157m0012o6606n2213j1693L7130O7972P8512K3802
$$ -39174 -40802 10345 91089 81932 41920 -24686 -76899 -88592 -51462 16510 95022 118824
24310A18824o0967k5203k1427k7662L133l7927l8545j2039M3393M3721J2799J2662
$$ 118824 57857 32654 11227 -16435 -13302 -51229 -89774 -101813 -58420 -14699 -1900 10762
24298A0762N838m0971J1934m6306j0534N8780L0954l835N0892Q649p2551n3800
$$ 10762 16600 -24371 -12437 -58743 -69277 -10497 20457 16622 67514 76163 3612 -50188
24286e0188m1780j7997O5063N1089M0149r083K1001N9323n2449r763L8461j5437
$$ -50188 -91968 -109965 -44902 6187 46336 37253 58254 117577 65128 55365 93826 78389
24274G8389l1414l4141j7674m6844N0615J6724l2988N1744p183m5586J0273n1844
$$ 78389 46975 12834 -4840 -51684 -1069 15655 -17333 34411 27228 -18358 -8085 -59929
24262e9929J4519N3099r798n3044n3201j3571l851O2575N2955J351j8000J3079
$$ -59929 -45410 7689 -2109 -55153 -108354 -121925 -125776 -63201 -10246 -8895 -26895 -13816
24250a3816K7560J3011q8487k2928K2974Q935M3958k2549j7798K1164j7274j6466
$$ -13816 13744 26755 -61732 -84660 -61686 -52751 -8793 -31342 -49140 -27976 -45250 -61716
24238f1716r251J3680p044M1390K3113j2908j2637L0704J9546j621k5164n9020
$$ -61716 -70967 -57287 -64331 -22941 172 -12736 -25373 5331 24877 23256 -1908 -60928
24226f0928K0447K8049m5791j0170l144K2376L1913P067k8027l4478J3120Q3231
$$ -60928 -40481 -12432 -58223 -68393 -71537 -49161 -17248 -10181 -38208 -72686 -59566 23665
24214B3665K829n2206K304J5540L3442j373p885J9319r285k4839L2539K7795M91
$$ 23665 26494 -25712 -23408 -7868 25574 24201 16316 35635 26350 1511 34050 61845 62336
24201F2336J7306J3186K4467n7698K149o212o9346n2723J3409j3083K8252Q2074
$$ 62336 79642 92828 117295 59597 61746 55534 -13812 -66535 -53126 -66209 -37957 44117
24189D4117M3763p277k2738M586L9125l1409Q2928J0755l4738j5456k523m2073
$$ 44117 87880 80603 57865 62451 101576 70167 153095 163850 129112 113656 111133 69060
24177F9060p1318o1402o5888O1641O3109L7744l871n3866m5339K4115L1481l5205
$$ 69060 -2258 -63660 -129548 -67907 -4798 32946 29075 -24791 -70130 -46015 -14534 -49739
24165d9739O293N7342J8058m140j8678Q416k967l7441j4189M0878M1292L174o540
$$ -49739 -43446 13896 31954 27814 9136 17552 14585 -22856 -37045 3833 45125 48299 41759
24152D1759j1956k5956m6301P038M4927K1364M1477J9713k865J0709k6118n4982
$$ 41759 29803 3847 -42454 -35416 9511 30875 72352 92065 89200 99909 73791 18809
24140A8809k7666L632k305k4821j4826N5479L5625j7388l0417m9105K8520N7681
$$ 18809 -8857 -5225 -7530 -32351 -47177 8302 43927 26539 -3878 -52983 -24463 33218
24128C3218l1o434o087M3409O870Q47j790K669K8506n5860n4382l5103k2278n5040
$$ 33218 33187 26753 20666 64075 70945 71792 70002 72671 101177 45317 -9065 -44168 -66446 -121486
24114a21486m340Q242J8929P6716L3323L2579L6125l9005r3647j0161L1234K5839
$$ -121486 -125826 -117584 -98655 -21939 11384 43963 80088 41083 -52564 -62725 -31491 -5652
24102e652j4099l0811M568N169K740M626p646J3474J4184j5380M3l6564j0232
$$ -5652 -19751 -50562 -45994 -40825 -38085 -33459 -41105 -27631 -13447 -28827 -28784 -65348 -75580
24089g5580L6752J0650J5870m172K6380j5312m4151J1160O1035K7113m71k6889
$$ -75580 -38828 -28178 -12308 -16480 9900 -5412 -49563 -38403 22632 49745 49274 22385
24077B2385l344p1947p973K6836k2816p538N5149m325r337O7090L8n790k6515
$$ 22385 19041 -52906 -60879 -34043 -56859 -64397 -9248 -13573 -22910 44180 44218 38428 11913
24064A1913j8114J7431K2772k5581l1526M2378K1450J4189j5518j7045J9366N454
$$ 11913 -6201 11230 34002 8421 -23105 19273 40723 54912 39394 22349 41715 47169
24052D7169k7452k4492o1147j9070P551J6965L051J3089L413n7887L1067L7927
$$ 47169 19717 -4775 -65922 -84992 -77441 -60476 -57425 -44336 -40923 -98810 -67743 -29816
24040b9816m4881k6916j8028J4877P5873m749k1431N2464L0795J4868L1394k9843
$$ -29816 -74697 -101613 -119641 -104764 -28891 -33640 -55071 -2607 28188 43056 74450 44607
24028D4607j9892o6943J3304j3503M4153J4875n4352K9128L6386l542j1198J4309
$$ 44607 24715 -42228 -28924 -42427 1726 16601 -37751 -8623 27763 24221 13023 27332
24016B7332P890k1680j6801J726l758K1557k187j3020p248m746O582k3530k4845
$$ 27332 35222 13542 -3259 -1533 -5291 16266 14079 1059 -6189 -10935 -4353 -27883 -52728
24003e2728N0286l9009j8901J09444j0902m8281N505l0925K8348M6559m5699l7435
$$ -52728 -2442 -41451 -60352 49092 38190 -10091 -4586 -35511 -7163 39396 -6303 -43738
23991d3738K5739J2306J1298N852j8562m6818L1909J3769j045K8076p9831k6785
$$ -43738 -17999 -5693 5605 11457 -7105 -53923 -22014 -8245 -9290 18786 -61045 -87830
23979h7830P6572O1908K9288K0246m2147n5088K2162K4685Q26j5929K6081j2056
$$ -87830 -11258 50650 79938 100184 58037 2949 25111 49796 50622 34693 60774 48718
23967D8718P379m5381m0947K6785N0814R113L681l7817j2753j6482j2750j5776
$$ 48718 56097 10716 -30231 -3446 47368 56481 60162 22345 9592 -6890 -19640 -35416
23955c5416r212l8738o677k5747l2888K5939M2793P9294K2830M39m4028k4119
$$ -35416 -44628 -83366 -90043 -115790 -148678 -122739 -79946 -652 22178 22617 -21411 -45530
23943d5530J3300j2341J7833K9623J8836J5919j0207J3388O572k5475l478K4857
$$ -45530 -32230 -44571 -26738 2885 21721 37640 27433 40821 47393 21918 18440 43297
23931D3297k3998p431o510r376P573j8193m1231K1986O9401k916m6622q894L1515
$$ 43297 19299 11868 5358 -4018 3555 -14638 -55869 -33883 35518 32602 -14020 -22914 8601
23918H601p0j9559J4054j6621N622L1891Q173O020j3760l4852Q629J2566J3561
$$ 8601 8531 -11028 3026 -13595 -7973 23918 32091 38111 24351 -10501 -1872 10694 24255
23905B4255J1338k7459l2191P091J7775p604k671J738J3633m6322M5117m564k4986
$$ 24255 35593 8134 -24057 -16966 809 -6795 -9466 -7728 5905 -40417 4700 136 -24850
23892b4850M3705N4870k8768o3804m0298n036K5272J2712K0142N1568j9974m851
$$ -24850 18855 73725 44957 -18847 -59145 -64181 -38909 -26197 -6055 45513 25539 20688
23880B0688j8262j3455L3158k0130l361r66N6680L512Q808R958j6449k220l958
$$ 20688 2426 -11029 22129 1999 -1362 -2328 54352 57864 66672 76630 60181 57961 54003
23867E4003l8165o936J25K4036J0951k9056l8249P256K1576n05J7239L3302j53
$$ 54003 15838 8902 9027 33063 44014 14958 -23291 -16035 5541 5036 22275 55577 55424
23854E5424l6065l9172q351q335K5262L411J2966J1785m92J2659j4992Q146m7516
$$ 55424 19359 -19813 -28164 -36499 -11237 -7826 5140 16925 16433 29092 14100 22246 -25270
23841b5270R016M1876N5033J9680l5548m7124n029n510l3626l0563L3995J9300
$$ -25270 -16254 25622 80655 100335 64787 17663 12634 7124 -26502 -57065 -23070 -3770
23829c770k6355p356L900m2782l0264N0931P8395J292n9714n6305N6021R339R879
$$ -3770 -30125 -37481 -33581 -76363 -106627 -55696 22699 23991 -35723 -92028 -36007 -26668 -16789
23816a6789o6502r699O7499O3126J4455l6364K2144O8562l1792o9945k9854K0290
$$ -16789 -83291 -92990 -25491 37635 52090 15726 37870 106432 74640 4695 -25159 -4869
23804d869L9486k4840l7251m7790k938L0775k0247L344L571p438Q13K7814L1742
$$ -4869 34617 9777 -27474 -75264 -78202 -47427 -67674 -64330 -60759 -68197 -67384 -39570 -7828
23791g828n129J5541K1277j9132k6399L433O677M0657L0423J1993k7396j3278
$$ -7828 -12957 2584 23861 4729 -21670 -18237 -11560 29097 59520 71513 44117 30839
23779C0839j8117K8987K1048l2566j38N603m2912j3748j3566L4572P714k1357
$$ 30839 12722 41709 62757 30191 30053 35656 -7256 -21004 -34570 2 7716 -13641
23767a3641K0200j8676l4406L1464N4498m1841n8968r609M4290k2049J5865K7750
$$ -13641 6559 -12117 -46523 -15059 39439 -2402 -61370 -70979 -26689 -48738 -32873 -5123
23755e123M2062n6386l2743L5102r402k319L2735n79j6833q420l2568l2976L6817
$$ -5123 36939 -19447 -52190 -17088 -26490 -28809 3926 3347 -13486 -21906 -54474 -87450 -50633
23742e0633J6486L0563j1906j9063m417N513J5305J0374j6144l3105L1657J8438
$$ -50633 -34147 -3584 -15490 -34553 -38970 -33457 -18152 -7778 -23922 -57027 -25370 -6932
23730f932L6160k141k6270L2627k0085K0907K0728k4760o7430L9194k3157K0000
$$ -6932 29228 27087 817 33444 13359 34266 54994 30234 -37196 1998 -21159 -1159
23718a159M6409j3438j9899j3983k798j9482l1434j6958l3739j866L8386J9668
$$ -1159 45250 31812 11913 -2070 -4868 -24350 -55784 -72742 -106481 -108347 -69961 -50293
23706e0293J0300j5153k8956j4372M3481o602O5589O9275l6407p6109p2876r033
$$ -50293 -39993 -55146 -84102 -98474 -54993 -61595 3994 73269 36862 -39247 -112123 -121156
23694a21156N5215j1021M3589K4825m8852m4064J8428M4385N9952J7338L6118
$$ -121156 -65941 -76962 -33373 -8548 -57400 -101464 -83036 -38651 21301 38639 74757
23683G4757n2460k4520j0509j2158J7953k5387J3929q881J2527L1670q442l3174
$$ 74757 22297 -2223 -12732 -24890 -6937 -32324 -18395 -27276 -14749 16921 8479 -24695
23671b4695K0219K6986J9291k6010n364L6308M4596K4909q395n1960j07707j0307
$$ -24695 -4476 22510 41801 15791 10427 46735 91331 116240 107845 55885 -51822 -62129
23659f2129J25916K3617n4760l8378J9427m3453k3574k2734K4382j6396N2142
$$ -62129 63787 87404 32644 -5734 13693 -29760 -53334 -76068 -51686 -68082 -15940
23648a5940J0083n4308k029L254J3678J474N901j8572q942m7526l8082N3880N0947
$$ -15940 -5857 -60165 -62194 -58940 -45262 -43788 -37887 -56459 -65401 -112927 -151009 -97129 -46182
23635d6182J3115j7552o803L25j6076O979K8968k0355L3631M0892o1544o7850
$$ -46182 -33067 -50619 -57422 -57097 -73173 -66194 -37226 -57581 -23950 16942 -44602 -112452
23623a12452O443Q406K1577o859L7240N5836k846J7929k3654m3321O331L5069
$$ -112452 -106009 -97603 -76026 -82885 -45645 10191 7345 25274 1620 -41701 -35370 -301
23611c01O3089N8535j3281n9022m0577m2817k7293R519N8506O014m1214P205j1756
$$ -301 62788 121323 108042 49020 8443 -34374 -61667 -52148 6358 12372 -28842 -21637 -33393
23598c3393J9186K3340j1066j4542M4849K8061m5819p5117J4930P2394L4886J5191
$$ -33393 -14207 9133 -1933 -16475 28374 56435 10616 -64501 -49571 22823 57709 72900
23586G2900k7381K7574M690M177l8911l3117q916K5843K2370O113K1262L5461
$$ 72900 45519 73093 77783 81960 43049 9932 1016 26859 49229 55342 76604 112065
23574A12065p0602j21082j0248L3520J9195P6092n1512j5358J1130J1144p744
$$ 112065 41463 -79619 -89867 -56347 -37152 38940 -12572 -27930 -16800 -5656 -13400
23563a3400m2483l2274O465K1381Q573J5617J6778M6436o225m289J8820m8160
$$ -13400 -55883 -88157 -81692 -60311 -51738 -36121 -19343 27093 20868 16579 35399 -12761
23551a2761P1067J0497n6373J3764J8370n612q373j6984m7115r806r279N9880
$$ -12761 58306 68803 12430 26194 44564 38952 30579 13595 -33520 -43326 -52605 7275
23539G275j3758K9153J4075m7711l4632K1543J6429r44l5755l6233n7138M7794
$$ 7275 -6483 22670 36745 -10966 -45598 -24055 -7626 -8570 -44325 -80558 -137696 -89902
23527h9902Q2471L1133l37j8780n0197J959k7540P4485O245k8270N1728k8027
$$ -89902 -7431 23702 23365 4585 -45612 -43653 -71193 3292 9537 -18733 32995 4968
23515D968j2283k198K8019r031m9481J6382j8126l5972m20j6319K7697N2744k0419
$$ 4968 -7315 -9513 18506 9475 -40006 -23624 -41750 -77722 -78142 -94461 -66764 -14020 -34439
23502c4439j6244R74M4021m4531K7637M0651j9567m338N083k0734q236k4492k0487
$$ -34439 -50683 -49709 -5688 -50219 -22582 18069 -1498 -5836 -753 -21487 -29723 -54215 -74702
23489g4702J2672K1408L334n747J0426O6567r225N4949Q6312k5400o4287m8609
$$ -74702 -62030 -40622 -37288 -43035 -32609 33958 24733 79682 165994 140594 76307 27698
23477B7698n0843l0341j4853l461J4210J4133k1087K9980J9407O033R364K6063
$$ 27698 -23145 -53486 -68339 -71800 -57590 -43457 -64544 -34564 -15157 -9124 240 26303
23465B6303K1272k6858j0874K7750L0465m8476m6180k3917j4413J3031k6904r184
$$ 26303 47575 20717 9843 37593 68058 19582 -26598 -50515 -64928 -51897 -78801 -87985
23453h7985j3459N1512R954K206p192j8724M2542L6410K8389K2321k0111K9723
$$ -87985 -101444 -49932 -39978 -37772 -44964 -63688 -21146 15264 43653 65974 45863 75586
23441G5586m0345m8643J8555L3129n1015J766O8266l3477k3384j3869m320K3535
$$ 75586 35241 -13402 5153 38282 -12733 -10967 57299 23822 438 -13431 -17751 5784
23429E784N089k8016k9390m2288M7367K2320K8696K4271K3212k4523k5141M0229
$$ 5784 10873 -17143 -46533 -88821 -41454 -19134 9562 33833 57045 32522 7381 47610
23417D7610L722r54P274n1829Q089J7630j4227r756m2397r592P6422K8819n3113
$$ 47610 51332 50378 57652 5823 13912 31542 17315 7559 -34838 -44430 31992 60811 7698
23404G698p8161L2951L8700J4168K0097p6912m311L4213J8190K8576n0433j2974
$$ 7698 -70463 -37512 1188 15356 35453 -41459 -45770 -11557 6633 35209 -15224 -28198
23392b8198N278l893j1690n7827j5733K8788Q2593N3979n6758m2832J9368K2059
$$ -28198 -22920 -26813 -38503 -96330 -112063 -83275 -682 53297 -3461 -46293 -26925 -4866
23380d866L0632M86N932L0354k3825J8709n5338q6188J6046O7301L3120P735l9029
$$ -4866 25766 26252 32184 62538 38713 57422 2084 -84104 -68058 -757 32363 40098 1069
23367A069p7265j5915L1217N1701j6064l6684J3247M2970m416K3760K9097J4846
$$ 1069 -76196 -92111 -60894 -9193 -25257 -61941 -48694 -5724 -10140 13620 42717 57563
23355E7563k9246l4298P781M0666j6127o7257j475O040r228l8M2145P9240M4107
$$ 57563 28317 -5981 1800 42466 26339 -40918 -42393 -36353 -45581 -45619 -3474 75766 119873
23342A19873M873p1908Q224R937P840l4979m4477P688Q313j9020L4144J6555j0628
$$ 119873 124746 52838 61062 70999 78839 43860 -617 7071 15384 -3636 30508 47063 36435
23329C6435j8121j1330j6595K786P366l2658J0032R35j3332l1378J5887N7652
$$ 36435 18314 6984 -9611 -6825 541 -32117 -22085 -21150 -34482 -65860 -49973 7679
23317G679J5066j4729K266k0J688J3520K2841n4405q688J5006n381M443r268l3126
$$ 7679 22745 8016 10282 10262 11950 25470 48311 -6094 -14782 224 -5157 -714 -9982 -43108
23303d3108o201M92k4605m795M9912O3386L7562J3659n5330k543M1465k9635n5140
$$ -43108 -49309 -48817 -73422 -78217 -28305 35081 72643 86302 30972 28429 69894 40259 -14881
23290a4881Q550L6769l619n2375m6775j5597L6206K2313j3929R360n041M6978
$$ -14881 -6331 30438 26819 -25556 -72331 -87928 -51722 -29409 -43338 -33978 -39019 7959
23278G959L493k8703l9336k7899O4829J1598j1113M4192K3339k6779K6622N8815
$$ 7959 11452 -17251 -56587 -84486 -19657 -8059 -19172 25020 48359 21580 48202 107017
23266A07017k7671l632m467n4749j3622P529r287p296K0051K4444M750o0428j049
$$ 107017 79346 75714 71247 16498 2876 10405 1118 -6178 13873 38317 43067 -17361 -18410
23253a8410J0720L0583L8176K7152L322J3201k4152J0441K1108K2046n9471n4871
$$ -18410 -7690 22893 61069 88221 91543 104744 80592 91033 112141 134187 74716 19845
23241A9845k5074j8794J8415L3555j2741m5386k1000M84m583L0584N5708K7858
$$ 19845 -5229 -24023 -5608 27947 15206 -30180 -51180 -50696 -55279 -24695 31013 58871
23229E8871m970Q440m5975Q433L5319R060j1029l5945n5036K3683o4660p450M6425
$$ 58871 53901 62341 16366 24799 60118 69178 58149 22204 -32832 -9149 -73809 -81259 -34834
23216c4834Q9393p301j7049l4459m4147P533J6457n0720K1401Q5200j3348L6438
$$ -34834 54559 47258 30209 -4250 -48397 -40864 -24407 -75127 -53726 31474 18126 54564
23204E4564M2749o2936m5721l321J3848m4667m6634N5906N9427M010Q757l376
$$ 54564 97313 34377 -11344 -14665 -817 -45484 -92118 -36212 23215 27225 35982 32606
23192C2606P441l501n420k1724j4441L0049q579L815P971l9190o2679K6768R0713
$$ 32606 40047 36546 31126 9402 -5039 25010 16431 20246 28217 -10973 -73652 -46884 43829
23179D3829J9045K3772L4223p1821n4507Q879k0120l8909n3032j4882J7926O4606
$$ 43829 62874 86646 120869 49048 -5459 3420 -16700 -55609 -108641 -123523 -105597 -40991
23167d0991R634n801R6623o5163q2286r288L2153J2786L8289J7194M7884O152
$$ -40991 -31357 -37158 59465 -5698 -87984 -97272 -65119 -52333 -14044 3150 51034 57186
23155E7186k5835L186O982l7063l4953J3501n045k379k6254J7002L0884J4829
$$ 57186 31351 34537 41519 4456 -30497 -16996 -22041 -24420 -50674 -33672 -2788 12041
23143A2041J5481L3854k8909m0299n0392J2220n408J972K0479J479N848L1466
$$ 12041 27522 61376 32467 -7832 -58224 -46004 -51412 -49440 -28961 -27482 -21634 9832
23131I832N1810l7124o1791m2042m0240L5974M3658N1427j1363m3590M8733J6134
$$ 9832 61642 24518 -37273 -79315 -119555 -83581 -39923 11504 141 -43449 5284 21418
23119B1418J1059L7025k0198k7348o090l278j3305m6221q46J2423J9346K5103
$$ 21418 32477 69502 49304 21956 15866 12588 -717 -46938 -47784 -35361 -16015 9088
23107I088P0984j0842k9601r765K7287Q776j3145P842m0547j4002k1145L485K102
$$ 9088 80072 69230 39629 29864 57151 65927 52782 60624 20077 6075 -15070 -11585 -9483
23094i483P0217L2722m1074n8076M8238K3777l8465m9861J4562L7087m060K01
$$ -9483 60734 93456 52382 -5694 42544 66321 27856 -22005 -7443 29644 25584 25785
23082B5785k5954k0395m3873L2359q216O271P474J1537O0302M638m0304l3123
$$ 25785 -169 -20564 -64437 -32078 -40294 -34023 -26549 -15012 45290 49928 9624 -23499
23070b3499N4644k5438j5918L1283k7520q875P5075j3605o2948L2855J0145l8583
$$ -23499 31145 5707 -10211 21072 -6448 -15323 59752 46147 -16801 16054 26199 -12384
23058a2384m1920M059J0162M585q674k4265l6786K6829K3673N2618J4777p310
$$ -12384 -54304 -50245 -40083 -35498 -44172 -68437 -105223 -78394 -54721 -2103 12674 5364
23046E364j9485l0670L8394k9836j2351O1959K3796J4005m1932k3444K715K6705
$$ 5364 -14121 -44791 -6397 -36233 -48584 13375 37171 51176 9244 -14200 -11485 15220
23034A5220k2054L3375j854k8963K3813n2821l4062j3831J5748j165M6387J1225
$$ 15220 -6834 26541 24687 -4276 19537 -33284 -67346 -81177 -65429 -66594 -20207 -8982
23022h982p394p374j6264l5500j1033j4793k1023O5516N4826J4915J5987K2198
$$ -8982 -16376 -23750 -40014 -75514 -86547 -101340 -122363 -56847 -2021 12894 28881 51079
23010E1079m0134m2246l5019K7429K9998j1346L045L534M708l1182k860M0343
$$ 51079 10945 -31301 -66320 -38891 -8893 -20239 -17194 -13660 -8952 -40134 -42994 -2651
22998b651K6635n2967n6053n5287K2253O2922O5404m055M903j0325q588k2282
$$ -2651 23984 -28983 -85036 -140323 -118070 -55148 10256 6201 11104 779 -7809 -30091
22986c0091o3810J0993J3825K867L7581j9871j3138K6627L1497k8545n1179l2403
$$ -30091 -93901 -82908 -69083 -66216 -28635 -48506 -61644 -35017 -3520 -32065 -83244 -115647
22974a15647J4638M2941K4718P00M1040J4850K5819m63k0173p805j1657k8522
$$ -115647 -101009 -58068 -33350 -32650 8390 23240 49059 48596 28423 20618 8961 -19561
22962a9561L2974O794r801m5967l3502R0283o361n9738j0296J6652L3660q284
$$ -19561 13413 20207 10406 -35561 -69063 21220 14859 -44879 -55175 -38523 -4863 -13147
22950a3147K2421j1077K939l7267J529j454n8258N0073p90L4099L0541j4155O684
$$ -13147 9274 -1803 1136 -36131 -34602 -36056 -94314 -44241 -45031 -10932 19609 5454 12138
22937A2138k5936j015N9995K5563l0723m5787J5927J9860l0094K667J8483m8714
$$ 12138 -13798 -14813 45182 70745 40022 -5765 10162 30022 -72 2595 21078 -27636
22925b7636n448o0232N144Q5044L7205k9168m9770K3847k6501n070M5102Q7121
$$ -27636 -33084 -93316 -88172 -3128 34077 4909 -44861 -21014 -47515 -52585 -7483 79638
22913G9638P283n4758j3926k4308J2584J9929L1092k2615k553m203L877n179l084
$$ 79638 86921 32163 18237 -6071 6513 26442 57534 34919 32366 28163 32040 26861 23777
22900B3777k2392K5485O222m305n0407p1507K0834L2827J4536l5468K882m047
$$ 23777 1385 26870 33092 28787 -21620 -93127 -72293 -39466 -24930 -60398 -57516 -61563
22888f1563N2525K0514l3699m4691N1204L8883j5849J2438j5781k5517K3996L3678
$$ -61563 -9038 11476 -22223 -66914 -15710 23173 7324 19762 3981 -21536 2460 36138
22876C6138M383n1015p1612n8466K813R329M3780K4435L522m3215Q025O0113k1108
$$ 36138 40521 -10494 -82106 -140572 -137759 -128430 -84650 -60215 -56693 -99908 -91883 -31770 -52878
22863e2878j6502K6894K379k7217j3925K4872R158J7818J1332J9371J6681m394
$$ -52878 -69380 -42486 -40107 -67324 -81249 -56377 -47219 -29401 -18069 1302 17983 13589
22851A3589k9955M8192n67o543J810j7567q8753k8136J4003L4047L6892l234m0592
$$ 13589 -16366 31826 31259 24716 26526 8959 -79794 -107930 -93927 -59880 -22988 -26222 -66814
22838f6814n3094K4452O306n3961N4221R2087R615l9323n730J180m6636n3337
$$ -66814 -119908 -95456 -89150 -143111 -88890 3197 12812 -26511 -32241 -31061 -77697 -131034
22826a31034O5488Q8966M9179J3888n2012m1867o761l459J699O6814L9678n9003
$$ -131034 -65546 23420 72599 86487 34475 -7392 -14153 -17612 -15913 50901 90579 31576
22814C1576j9179j0771O4572K213j0501n3437k5286P709O242k2759J894J5395
$$ 31576 12397 1626 66198 68411 57910 4473 -20813 -13104 -6862 -29621 -27727 -12332
22802a2332k9540m8161K4704K107L9459M2084K5104l1853n863m3336K8442M0382
$$ -12332 -41872 -90033 -65329 -63222 -23763 18321 43425 11572 5709 -37627 -9185 31197
22790C1197l483k8782L094n1435m7385k5433N9943L3869J0309M7919R935O779
$$ 31197 27714 -1068 2026 -49409 -96794 -122227 -62284 -28415 -18106 29813 39748 46527
22778D6527k9611k1869k2627q178l7169J1148K4215Q58m032J464M049n053O088
$$ 46527 16916 -4953 -27580 -35758 -72927 -61779 -37564 -36706 -40738 -39274 -35225 -40278 -34190
22765c4190J6190L4610K4697p165o0020k6247J731l6842l7577K8846J07744L4800
$$ -34190 -18000 16610 41307 34142 -25878 -52125 -50394 -87236 -124813 -95967 11777 46577
22753D6577k6228m3324k0395K4199J6965k4351k4640j5232M6880J130K7757l8125
$$ 46577 20349 -22975 -43370 -19171 -2206 -26557 -51197 -66429 -19549 -18419 9338 -28787
22741b8787j8945n3757j3934l727R252R1059N5352K2140l8834k4473l349m911
$$ -28787 -47732 -101489 -115423 -119150 -109898 -18839 36513 58653 19819 -4654 -8003 -12914
22729a2914O119k1561o6318k1501M3305L15k5665j2262r493j8856M3446N3280
$$ -12914 -6795 -28356 -94674 -116175 -72870 -72555 -98220 -110482 -119975 -138831 -95385 -42105
22717d2105j0668K3719M6272k1608n832R824j8721j1983J6366M2583j2696n6573
$$ -42105 -52773 -29054 17218 -4390 -10222 -398 -19119 -31102 -14736 27847 15151 -41422
22705d1422J0668O5787J2430q3816o8692L5877N2954O187N116m3813l5331K9346
$$ -41422 -30754 35033 47463 -36353 -105045 -69168 -16214 -10027 -4911 -48724 -84055 -54709
22693e4709K5366k6440r140J134k1229O494P3554n932q998L3985n628k6862J2771
$$ -54709 -29343 -55783 -64923 -63789 -85018 -78524 -4970 -10902 -19900 14085 8457 -18405 -5634
22680e634L7611M4200j3469k9146m5364M5918M0578l7407l208o096j9425J8401
$$ -5634 31977 76177 62708 33562 -11802 34116 74694 37287 34079 27983 8558 26959
22668B6959J9400l8008j5501Q584K2605L1305K5351n3401j5964m451K2715j8794
$$ 26959 46359 8351 -7150 1434 24039 55344 80695 27294 11330 6879 29594 10800
22656A0800k5942M1733K5401l1321n4944K4910r818q6937K774K3759j8165J6055
$$ 10800 -15142 26591 51992 20671 -34273 -9363 -19181 -106118 -103344 -79585 -97750 -81695
22644h1695N1409J8988K0751K033j6958m8740j3754K1779J8051j3158J4565J6101
$$ -81695 -30286 -11298 9453 11486 -5472 -54212 -67966 -46187 -28136 -41294 -26729 -10628
22632a0628K2749l2203j1453l2766k2312M3063M2453N4190m0026l8639k0486p479
$$ -10628 12121 -20082 -31535 -64301 -86613 -43550 -1097 53093 13067 -25572 -46058 -53537
22620e3537R331J3113L0661L4642M8335J578k6722j4573l1289k2805p415K6879
$$ -53537 -44206 -31093 -432 34210 82545 84123 57401 42828 11539 -11266 -18681 8198
22608H198j116K4249n0445J2942K6429L746j0318j507k7189K4261N7464Q070l6610
$$ 8198 7082 31331 -19114 -6172 20257 24003 13685 12178 -15011 9250 66714 74784 38174
22595C8174r631j1981N086k0425p2060m4833K9137O5044J0924r305p712l319J6370
$$ 38174 28543 16562 21648 1223 -70837 -115670 -86533 -21489 -10565 -19870 -27582 -30901 -14531
22582a4531J0069p881j0684l3435M1452Q6663k7893o8107K75L7753K4596r790
$$ -14531 -4462 -12343 -23027 -56462 -15010 71653 43760 -24347 -24072 13681 38277 28487
22570B8487k2700J3146l851j7453m0715o7108n225K6138K4329M0674o12K1846
$$ 28487 5787 18933 15082 -2371 -43086 -110194 -115419 -89281 -64952 -24278 -24890 -3044
22558c044N2840M5129m4760o0694k5723J956Q008l7227L5893K1787l197k727J8913
$$ -3044 49796 94925 50165 -10529 -36252 -34296 -26288 -63515 -27622 -5835 -9032 -11759 7154
22545G154M8345k4374m9373m148k2647L2567q390J1225N164J7625L846L2779k4788
$$ 7154 55499 31125 -18248 -22396 -45043 -12476 -20866 -9641 -4477 13148 16994 49773 24985
22532B4985q966L1079k0474l2055m051L0454K7190k8286J1975j6275p379n281
$$ 24985 16019 47098 26624 -5431 -9482 20972 48162 19876 31851 15576 8197 2916
22520B916o3452o1824P628j5494P2984M0799P636k161R398Q960j6123k6783j8162
$$ 2916 -60536 -122360 -114732 -130226 -57242 -16443 -8807 -10968 -1570 7390 -8733 -35516 -53678
22507e3678l2886J5344N2123N125N1240M874l1803k4356k8038n4897k6024j2151
$$ -53678 -86564 -71220 -19097 -13972 37268 42142 10339 -14017 -42055 -96952 -122976 -135127
22495a35127M3805K2524M4679o827m7203K8442M771L3572P427q25J0950J3928
$$ -135127 -91322 -68798 -24119 -30946 -78149 -49707 -44936 -11364 -3937 -4762 6188 20116
22483B0116n8338k1611O4833K7937K8717j8983k7576L9296N8070J392n362O6j2850
$$ 20116 -38222 -59833 5000 32937 61654 42671 15095 54391 112461 113853 108491 108557 95707
22470I5707l0880q8204K7087M075o5048M2519j7513P533L7343K9653J0534o1178
$$ 95707 64827 -23377 3710 7785 -57263 -14744 -32257 -24724 12619 42272 52806 -8372
22458h372k4759k508L4059Q782n0194l8324K125j9602J3341K4665R3265M3300
$$ -8372 -33131 -35639 -1580 7202 -42992 -81316 -79191 -98793 -85452 -60787 32478 75778
22446G5778K8479M425l14k3774m814L7858o96j6850j1996O765l0348j6352o9174
$$ 75778 104257 108682 108368 84594 79780 117638 116942 100092 88096 94861 64513 48161 -21013
22433b1013n1350L0387N6723J7934N7648o677m1634q2708k1291m0645M3609K8272
$$ -21013 -72363 -41976 14747 32681 90329 83652 42018 -40690 -61981 -102626 -59017 -30745
22421c0745Q783L5717j6832k6742n9919K4613M8011K5367J1305n5510O9074M4981
$$ -30745 -21962 13755 -3077 -29819 -89738 -65125 -17114 8253 19558 -35952 33122 78103
22409G8103m0433k127J3425m8398m0734L1418M2787L2419n4565m7100k886M942
$$ 78103 37670 35543 48968 570 -40164 -8746 34041 66460 11895 -35205 -38091 -33149
22397c3149m8505J5203O6281J7594j0098J5261M795J2964M8715m5589n2779J9853
$$ -33149 -81654 -66451 -170 17424 7326 22587 27382 40346 89061 43472 -9307 10546
22385A0546P4567J3641p8503Q806n8059l2841j7195M9194L8059N8322K4902l452
$$ 10546 85113 98754 20251 29057 -29002 -61843 -79038 -29844 8215 66537 91439 87987
22373H7987j8807k607k179k6831l3904j9243J4118o052K6573J04635j5918k8547
$$ 87987 69180 66573 64394 37563 3659 -15584 -1466 -7518 19055 123690 107772 79225
22361G9225l7985k214J566l7905R637M0301N385r929l7847k7588l85O829O4662
$$ 79225 41240 39026 40592 2687 12324 52625 58010 48081 10234 -17354 -17739 -10910 53752
22348E3752o310m4841J76K5880J4103r138P731K0683n8748j0211Q629O7346r95
$$ 53752 47442 2601 2777 28657 42760 33622 41353 62036 3288 -6923 1706 69052 68057
22335F8057j9385n7429n5636l985r380M4593J6296o293J3530K5671k0687j0405
$$ 68057 48672 -8757 -64393 -68378 -77758 -33165 -16869 -23162 -9632 16039 -4648 -15053
22323a5053K1596p622j1487J4187m1161n3142J8857L5053m5059m7277L2975R7947
$$ -15053 6543 -1079 -12566 1621 -39540 -92682 -73825 -38772 -83831 -131108 -98133 -186
22311a86L8535l7397M771K6402p226K7718P239p4875l6325K1639M1628L0276n1393
$$ -186 38349 952 5723 32125 24899 52617 59856 -15019 -51344 -29705 11923 42199 -9194
22298i194P735J0536n4290n1465j6084L5972k9460P182O8111M1079k9679K8494
$$ -9194 -1459 9077 -45213 -96678 -112762 -76790 -106250 -99068 -30957 10122 -19557 8937
22286H937K6120j5706L8183j3318r001J2126P3050L9243j0378l3517o5082k277
$$ 8937 35057 19351 57534 44216 35215 47341 120391 159634 149256 115739 50657 48380
22274D8380j514n6065m4600K5647L0365n002J693j85j1674j6485o186P822N6676
$$ 48380 46866 -9199 -53799 -28152 2213 -2789 -1096 -1281 -12955 -29440 -35626 -27804 28872
22261B8872J6573k2568L7998n5098o3144n4099P4O8752K6959n7545l3860j0446
$$ 28872 45445 22877 60875 5777 -57367 -111466 -111392 -42640 -15681 -73226 -107086 -117532
22249a17532L2533R511k7842Q105K1881j5560N9336L2257k5510l501j092m0501
$$ -117532 -84999 -75488 -103330 -95225 -73344 -88904 -29568 2689 -22821 -26322 -27414 -67915
22237f7915L133J9136J9562K0664K0342K6310L9330l8542j025l4902l746M3234
$$ -67915 -64782 -45646 -26084 -5420 14922 41232 80562 42020 40995 6093 2347 45581
22225D5581p0171n1265O2058N0244k3198J5514r459m6024k5525p219n103M1173
$$ 45581 -24590 -75855 -13797 36447 13249 28763 19304 -26720 -52245 -59464 -64567 -23394
22213b3394j6245R51J7755O786q82R579M8416k1616m0089J1033k3221k551J0222
$$ -23394 -39639 -38688 -20933 -14147 -15029 -5450 42966 21350 -18739 -7706 -30927 -33478 -23256
22200b3256J3338L4200k9817k3439j862J6491n1190L0780L8359q460n6139O0456
$$ -23256 -9918 24282 -5535 -28974 -30836 -14345 -65535 -34755 3604 -4856 -60995 -539
22188e39L193j9054K8642o686L368O318j3019p8596j4612N1183N1803K5201l9312
$$ -539 2654 -16400 12242 5556 8924 15242 2223 -76373 -90985 -39802 12001 37202 -2110
22175b110L5969M7372j8780m7898l4913j2689j8182k5890K9087K1254o588N4552
$$ -2110 33859 81231 62451 14553 -20360 -33049 -51231 -77121 -48034 -26780 -33368 21184
22163B1184M9684N292m9463k1615K3604K8360l2501K8450m891o21l2670j0970
$$ 21184 70868 76160 26697 5082 28686 57046 24545 52995 48104 47483 14813 3843
22151C843k7487n5111J5213p380q41L5766L9605P359j4052J2766k6273j3581J1093
$$ 3843 -23644 -78755 -63542 -70922 -71763 -35997 3608 10967 -3085 9681 -16592 -30173 -19080
22138a9080l7190j7703O145O1998K835K7941q62j3488P080K327r486k119p8479
$$ -19080 -56270 -73973 -67828 -5830 -2995 24946 24084 10596 17676 20003 10517 8398 -70081
22125g0081K0653N4777O2726k2842k6893M9191Q699K3003k6434j2525o6874j4733
$$ -70081 -49428 5349 68075 45233 18340 67531 76230 99233 72799 60274 -6600 -21333
22113b1333J3408o136l6552M036q244L6094K9589j3251l8916k8289O9374J2688
$$ -21333 -7925 -14061 -50613 -46577 -54821 -18727 10862 -2389 -41305 -69594 -220 12468
22101A2468k3111J3754K1347o1931k5287K6742k662K5736J1723P846J2420J2794
$$ 12468 -10643 3111 24458 -37473 -62760 -36018 -38680 -12944 -1221 6625 19045 31839
22089C1839n478L4181L018j4786k3721n6237k7421k8201K6413K7540J0234k9197
$$ 31839 26361 60542 63560 48774 25053 -31184 -58605 -86806 -60393 -32853 -22619 -51816
22077e1816Q127P0734M7741n4966p6115J7543O3708J6220R635j2391q975K2470
$$ -51816 -43689 27045 74786 19820 -56295 -38752 24956 41176 50811 38420 29445 51915
22065E1915j9023o888J5076m8220j6585J0689l8960m9286Q350O2813K7489j9483
$$ 51915 32892 26004 41080 -7140 -23725 -13036 -51996 -101282 -92932 -30119 -2630 -22113
22053b2113k9964M8463n572j5598K9517m2220M829J1747J218J6065L9531J1468
$$ -22113 -52077 -3614 -9186 -24784 4733 -37487 -32658 -20911 -19693 -3628 35903 47371
22041D7371j1220L1137j4418k8973J679J193L0903R227O078Q737L2641M4766l5133
$$ 47371 36151 67288 52870 23897 25576 26769 57672 66899 72977 81714 114355 159121 123988
22028A23988l5377J2309j5495R573j8586m678k6185o1702K3598L6059j0437k7478
$$ 123988 88611 100920 85425 94998 76412 71734 45549 -16153 7445 43504 33067 5589
22016E589k8047J2287J0432J9755l3845k2689n3922j608N5084N3844k1204j0977
$$ 5589 -22458 -10171 261 20016 -13829 -36518 -90440 -92048 -36964 16880 -4324 -15301
22004a5301K0520R278r591J1432n0654m8956M7218M855q199J6500r477l621M5707
$$ -15301 5219 14497 4906 16338 -34316 -83272 -36054 -31199 -39398 -22898 -32375 -35996 9711
21991I711N391p1291l6615M0901L8843J5394j7m9373K49M012m1598j0704J0726
$$ 9711 15102 -56189 -92804 -51903 -13060 2334 2317 -47056 -46807 -42795 -84393 -95097 -84371
21978h4371O046J7745N7541L5876n0284O04N6510K2925m1095n5623k2181K2034
$$ -84371 -78325 -60580 -3039 32837 -17447 -16843 39667 62592 21497 -34126 -56307 -34273
21966c4273K7065K2530L5171l9359l7605J2044K3331M1408N2895k6549j4168j1426
$$ -34273 -7208 15322 50493 11134 -26471 -14427 8904 50312 103207 76658 62490 51064
21954E1064j8592j1490m8727n0204K534J124J7002M453n222k1611r948l756j1952
$$ 51064 32472 20982 -27745 -77949 -75415 -74291 -57289 -52836 -58058 -79669 -89617 -93373 -105325
21941a05325P706R0634P5619L5962k4494l9420k3125m3322q003O1224J5613k4494
$$ -105325 -97619 -6985 68634 104596 80102 40682 17557 -25765 -33768 27456 43069 18575
21929A8575k5787k463k1744J7056J6307q362l3428M0178r440j0744K0537O3060
$$ 18575 -7212 -9675 -31419 -14363 1944 -6418 -39846 332 -9108 -19852 685 63745
21917F3745N1498N202Q488m5700l1459J2170q513p3081j9165j5554R7754j2116
$$ 63745 115243 120445 128933 83233 51774 63944 55431 -17650 -36815 -52369 45385 33269
21905C3269j2794M8911j2653j8234n1493o2493O439L1451l40M636P1086L8891
$$ 33269 20475 69386 56733 38499 -12994 -75487 -69048 -37597 -37937 -33301 37785 76676
21893G6676k5965o668j4943L1319J9183n595o7873k8192K3096K9694N748J6471
$$ 76676 50711 44043 29100 60419 79602 74007 6134 -22058 1038 30732 36480 52951
21881E2951l9981l1180M1232M224l6467K9592j6184l9771M0487m5063M9755K9044
$$ 52951 12970 -18210 23022 27246 -9221 20371 4187 -35584 4903 -40160 9595 38639
21869C8639m4629J8490L8520j2574k3581p1585J8320K9885k9531K7319K6117k672
$$ 38639 -5990 12500 51020 38446 14865 -56720 -38400 -8515 -38046 -10727 15390 12718
21857A2718O832K0449m3418j8944K1234L0199L3681K4261K8400j9634J4665K3317
$$ 12718 19550 39999 -3419 -22363 -1129 29070 62751 87012 115412 95778 110443 133760
21845A33760n8336m9062l3288l1296j6736K7183L4183j8812M7424j7167K164m2422
$$ 133760 75424 26362 -6926 -38222 -54958 -27775 6408 -12404 35020 17853 20017 -22405
21833b2405N3891M9114n5460o7108q6612P785M5035O5279M0573l884k0280p1525
$$ -22405 31486 80600 25140 -41968 -128580 -120795 -75760 -10481 30092 26208 5928 -65597
21821f5597k9467N3472J2243J0361L3109k0944k1610k8236K1816L4889o340j378
$$ -65597 -95064 -41592 -29349 -18988 14121 -6823 -28433 -56669 -34853 36 -6304 -7682
21809g682J4066L5179L034o1798p6722j7837J1515M1433M7200k0308o4421P946
$$ -7682 6384 41563 44597 -17201 -93923 -111760 -100245 -58812 -11612 -31920 -96341 -88395
21797h8395j9755R504O5100m1829o295K4990K1400m733L023M4627L9171K7191
$$ -88395 -108150 -98646 -33546 -75375 -81670 -56680 -35280 -40013 -36990 7637 46808 73999
21785G3999j2138k5694k8913m9403j2383j6324k5585o0185j903N2638N2204L596
$$ 73999 61861 36167 7254 -42149 -54532 -70856 -96441 -156626 -158529 -105891 -53687 -50091
21773e0091L049L2975O8786L5108j5321q6173m6733j9931K7864N4437p881j7017
$$ -50091 -47042 -14067 54719 89827 74506 -11667 -58400 -78331 -50467 3970 -3911 -20928
21761b0928K2856k0035m7811j3456L101J1362l040K0673M8262j5069K623J1853
$$ -20928 1928 -18107 -65918 -79374 -76273 -64911 -67951 -47278 984 -14085 -11462 391
21749C91J907L07k7793M5132N0257J7727J653l8119k652k9607o629K9727k9951
$$ 391 2298 2605 -25188 19944 70201 87928 89581 51462 48810 19203 12574 42301 12350
21736A2350k3605L7801K1370m0321l2812l2070O8218k197m692K7879J1323l3461
$$ 12350 -11255 26546 47916 7595 -25217 -57287 10931 8734 4042 31921 43244 9783
21724I783q776J8042m461K0419l2135n6353R480J7024J686k0748J6902N7424n442
$$ 9783 1007 19049 14588 35007 2872 -53481 -44001 -26977 -25291 -46039 -29137 28287 22845
21711B2845l1693M3431J7407J6494j5860j1940n8428R435J4773M1688l9983p3838
$$ 22845 -8848 34583 51990 68484 52624 40684 -17744 -8309 6464 48152 8169 -65669
21699f5669m1005Q3404O2356o1821m0998J3449L2398M5742J5385k2011K4936l1634
$$ -65669 -106674 -23270 39086 -22735 -63733 -50284 -17886 27856 43241 21230 46166 14532
21687A4532l924J7869K501J7847j9671j8859k5408l0276k1506N4483j2904j4581
$$ 14532 10608 28477 30978 48825 29154 10295 -15113 -45389 -66895 -12412 -25316 -39897
21675c9897k0685L1517l4900m0366K3389J9213J1244l0994M3803M8824l2374j3129
$$ -39897 -60582 -29065 -63965 -104331 -80942 -61729 -50485 -81479 -37676 11148 -21226 -34355
21663c4355J1375R6566L5092n370K0315n7120j6733n919O593l7504j811M7667
$$ -34355 -22980 73586 108678 103308 123623 66503 49770 43851 50444 12940 11129 58796
21651E8796j9017m0215k6893J9663O8507O634n8822m2496J8942L9950J5393j6523
$$ 58796 39779 -436 -27329 -7666 60841 67475 8653 -33843 -14901 25049 40442 23919
21639B3919M5168o9639l4539K1785J9999k3277p501J1050j8777K1746j4046K0375
$$ 23919 69087 -552 -35091 -13306 6693 -16584 -24085 -13035 -31812 -10066 -24112 -3737
21627c737K7631K1612J0531l6614n2035n4022M3164o086R588j0794M0526K5693
$$ -3737 23894 45506 56037 19423 -32612 -86634 -43470 -49556 -39968 -50762 -10236 15457
21615A5457m1884j4280j6713N8244R511n5258J7312P6508n262n9700o442P6718
$$ 15457 -26427 -40707 -57420 824 10335 -44923 -27611 48897 43635 -16065 -22507 54211
21603E4211j667q3132n5619J1636N7858M7125N7904k5488m074P553l9793M2409
$$ 54211 52544 -30588 -86207 -74571 -16713 30412 88316 62828 58754 66307 26514 68923
21591F8923J8022j07965l1294o024K2625L1259l9199p8084j6242N7025J9424j0314
$$ 68923 86945 -21020 -52314 -58338 -35713 -4454 -43653 -121737 -137979 -80954 -61530 -71844
21579g1844L2532L0352m315J2522k0911N880L412l7003j0155L1615Q2448P1699
$$ -71844 -39312 -8960 -13275 -753 -21664 -15784 -12372 -49375 -59530 -27915 54533 126232
21567A26232l7619q9661k7570L2313K7797J5769j0497l0870M79K2317l971L5900
$$ 126232 88613 -1048 -28618 3695 31492 47261 36764 5894 6373 28690 24719 60619
21555F0619j6932o8245l7141p346N2945J6310K3978j8240K9037m2099n065p765
$$ 60619 43687 -24558 -61699 -69045 -16100 210 24188 5948 34985 -7114 -12179 -19944
21543a9944L8584L9144N0371n0475l6556K8356j00219m5066l0677N041L6530O5515
$$ -19944 18640 57784 108155 57680 21124 49480 -50739 -95805 -126482 -121441 -84911 -19396
21531a9396J610p068o4780J2691P7679O080j4530K8610j7312l9107l7726m628
$$ -19396 -17786 -24854 -89634 -76943 736 6816 -7714 20896 3584 -35523 -73249 -77877
21519g7877P2866O0391m868j5918n4926l9173k3717O6440Q7203J9570n0678m6690
$$ -77877 -5011 55380 50512 34594 -20332 -59505 -83222 -16782 70421 89991 39313 -7377
21507g377j2113M4887q17p0337j3772L415l579j357l283K7689P653l9409K2290
$$ -7377 -19490 25397 24580 -45757 -59529 -56114 -59693 -61050 -64333 -36644 -28991 -68400 -46110
21494d6110K8K1105J1509q763m3O268L6710J8343k9669o7882N878J4090N9654
$$ -46110 -46082 -24977 -13468 -22231 -22274 -16006 20704 39047 9378 -58504 -52626 -38536 21118
21481B1118J6276J7588j9545l5695j9763j3232l2841J8983M3506j5722J3452K9589
$$ 21118 37394 54982 35437 -258 -20021 -33253 -66094 -47111 -3605 -19327 -5875 23714
21469B3714J3874O090j8766j10175n9060N6165P6785J3707l6604l829P8788k3099
$$ 23714 37588 43678 24912 -85263 -144323 -88158 -11373 2334 -34270 -38099 40689 17590
21457A7590n6158j8966K2622k8949r689N9137j1251l3761j4799P1219L4542J0279
$$ 17590 -38568 -57534 -34912 -63861 -73550 -14413 -25664 -59425 -74224 -3005 31537 41816
21445D1816p638M749k3145l4281K5104L6558j5441o6051L813J6637n822Q161j0181
$$ 41816 34178 38927 15782 -18499 6605 43163 27722 -38329 -34516 -17879 -23701 -15540 -25721
21432b5721k4771J5053j8012l6238L7207K089l8915o766J9406j2840j9887P3472
$$ -25721 -50492 -35439 -53451 -89689 -52482 -50393 -89308 -96074 -76668 -89508 -109395 -35923
21420c5923M3120O186k4016K108j748O6263k4930l1457J8808k0572R54k5247j6887
$$ -35923 7197 13383 -10633 -8525 -10273 55990 31060 -397 18411 -2161 -1207 -26454 -43341
21407d3341M0088L1548k5419l2007l1376o54K6349Q920k5791Q1663O9365l2424
$$ -43341 -3253 28295 2876 -29131 -60507 -61161 -34812 -25892 -51683 29980 99345 66921
21395F6921m1495l292M81K1488J6842k3698n7660l9125O8430M2763L5465j5174
$$ 66921 25426 22134 22615 44103 60945 37247 -20413 -59538 8892 51655 87120 71946
21383G1946K7733L890m1585j7774l5833J6035j5841Q285M631K4664P151l5819
$$ 71946 99679 103569 61984 44210 8377 24412 8571 16856 21487 46151 53302 17483
21371A7483j6490l825m40P523L8620j1424l7933K97J4044Q154r267k9259L8478
$$ 17483 993 -2832 -3272 4251 42871 31447 -6486 -6189 7855 16009 6742 -22517 15961
21358A5961k2971j5414m8587r893L9570m999J8252L6447k929J7461M404o6557
$$ 15961 -7010 -22424 -71011 -80904 -41334 -46333 -28081 8366 5437 22898 27302 -39255
21346c9255K1864K7103J335J5291l0104k9633J3112j3149K1924J5121J0936M6463
$$ -39255 -17391 9712 11047 26338 -3766 -33399 -20287 -33436 -11512 3609 14545 61008
21334F1008o216p068K9793l4159k9310l7892m5695n946O501J0411k6751j8023
$$ 61008 54792 47724 77517 43358 14048 -23844 -69539 -75485 -68984 -58573 -85324 -103347
21322a03347K2440P9223M1424p5125l4325N7855K9874K6854j987j9196j5894J5491
$$ -103347 -80907 -1684 39740 -35385 -69710 -11855 18019 44873 42886 23690 7796 23287
21310B3287m748m154r171k9172J4295L7579L8969O317o076o0859m2764j8452K2851
$$ 23287 18539 14385 5214 -23958 -9663 27916 66885 73202 67126 6267 -36497 -54949 -32098
21297c2098O2242R277l4619J4082L9929o867n7514k8229m784K420K9693K766n0892
$$ -32098 30144 39421 4802 18884 58813 51946 -5568 -33797 -38581 -36161 -6468 -3702 -54594
21284e4594p2571q394K2657j4742N2377P663j7523L6992N4756l5483j2933M987
$$ -54594 -127165 -135559 -112902 -127644 -75267 -67604 -85127 -48135 6621 -28862 -41795 -36808
21272c6808k5861k922K2115J3139K2636J1108K2696J4116l8667m1770J938N6446
$$ -36808 -62669 -65591 -43476 -30337 -7701 3407 26103 40219 1552 -40218 -38280 18166
21260A8166L3415J326L5385M394l5528l4339J3102M4535r374N192l5238n1273
$$ 18166 51581 52907 88292 92686 57158 22819 35921 80456 71082 76274 41036 -10237
21248a0237p164j2434r219M927R602j4479L8943j4338l201K1901j501m863n0396
$$ -10237 -17401 -29835 -39054 -34127 -24525 -39004 -61 -14399 -17600 4301 2800 -2063 -52459
21235e2459l2644N542L682K6847M2435J2302j1746l4510J8179j2137l5386k6471
$$ -52459 -85103 -79561 -75879 -49032 -6597 5705 -6041 -40551 -22372 -34509 -69895 -96366
21223i6366l7863k0008O1507J3895m0995N0493J9615K8229l5320j1778K0399K595
$$ -96366 -134229 -154237 -92730 -78835 -119830 -69337 -49722 -21493 -56813 -68591 -48192 -45597
21211d5597L3497K8646m4529o5151j6018O261q979J5567k5066O3463O7517k0837
$$ -45597 -12100 16546 -27983 -93134 -109152 -102891 -111870 -96303 -121369 -57906 9611 -11226
21199a1226m7696m4222j2230N7209M1197L9035K7946l3569L2963J6134q6698r4330
$$ -11226 -58922 -103144 -115374 -58165 -16968 22067 50013 16444 49407 65541 -21157 -115487
21187a15487n7104p810M7861P1575L448P255L5247J3382N3903K0351l4683L9675
$$ -115487 -172591 -180401 -132540 -60965 -57517 -50262 -15015 -1633 52270 72621 37938 77613
21175G7613J9149k1855j5297l9324j0088J9452N4108K3619q1711p3555M4693j447
$$ 77613 96762 74907 59610 20286 10198 29650 83758 107377 25666 -47889 -3196 -4643
21163d643o949K0042J1111M0312j9992n1214l0628q328N3859O077m4883l526m0210
$$ -4643 -11592 8450 19561 59873 39881 -11333 -41961 -50289 3570 9647 -35236 -38762 -78972
21150g8972Q77j7280L3319j3772L4990O1484L5251M0868L6447n8900q6627l977
$$ -78972 -78095 -95375 -62056 -75828 -40838 20646 55897 96765 133212 74312 -12315 -16292
21138a6292L2807M6317n5380L327J007K6169r9702n6167J9551K3092o459l720
$$ -16292 16515 62832 7452 10779 11786 37955 -61747 -117914 -98363 -75271 -81730 -85450
21126h5450J288k263P861m5847K4458M8838K4506N253j1807j3712o320j4443J4107
$$ -85450 -84162 -86425 -78564 -124411 -99953 -51115 -26609 -21356 -33163 -46875 -53195 -67638 -53531
21113e3531L9650J4732j5764j8318J784K3848k1993k1586p253K0893M8273L725
$$ -53531 -13881 851 -14913 -33231 -31447 -7599 -29592 -51178 -58431 -37538 10735 14460
21101A4460M622n9620j8044J6969j10L0938n0796K536M4071O4352L584m6058j8602
$$ 14460 19082 -40538 -58582 -41613 -41723 -10785 -61581 -59045 -14974 49378 52962 6904 -11698
21088a1698K3171j0j0166L2072J470j4557K2965l9023j4297L0845j5770p9435
$$ -11698 11473 11463 1297 33369 34839 20282 43247 4224 -10073 20772 5002 -74433
21076g4433n893K2823K938k5470n90P3188L0208n2684j3481M285l2075j9074N516
$$ -74433 -80326 -57503 -54565 -80035 -80625 -7437 22771 -29913 -43394 -39109 -71184 -90258 -84742
21063h4742M7989K2482L6160J0123K0444k9986l0186m5605j8700p373O061K0914
$$ -84742 -36753 -14271 21889 32012 52456 22470 -7716 -53321 -72021 -79394 -73333 -52419
21051e2419j7349n458L4375n11R096K6646J471m9798k8428k8170P009m401k0226
$$ -52419 -69768 -75226 -40851 -41362 -32266 -5620 -4149 -53947 -82375 -110545 -103536 -107937 -128163
21038a28163R1492L5908n3604l0542L5568J9936q878L729J822K1604m9087k948
$$ -128163 -36671 -763 -54367 -84909 -49341 -29405 -38283 -34554 -32732 -11128 -60215 -63163
21026f3163L9376P1654n456k2707K3209l1312l8015j763J3971K5530K7980K8121
$$ -63163 -23787 47867 42411 19704 42913 11601 -26414 -28177 -14206 11324 39304 67425
21014F7425J3901k8576l0321k0401k285L662k9075n1711l1647J3473O0334L1686
$$ 67425 81326 52750 22429 2028 -257 3405 -25670 -77381 -109028 -95555 -35221 -3535
21002c535k5818n0974l266R3529O4447Q774k8641q477j6772m9727r619K083K0348
$$ -3535 -29353 -80327 -83593 9936 74383 83157 54516 46039 29267 -20460 -30079 -27996 -7648
20989g648n27m2780J5760R512N1224l7159j2138M3188j5951m5492N8343K3542
$$ -7648 -8175 -50955 -35195 -25683 25541 -11618 -23756 19432 3481 -42011 16332 39874
20977C9874L558l2707k3381p060j5134m7953Q61K6685L6792J5365k5707n8583
$$ 39874 43432 10725 -12656 -19716 -34850 -82803 -81942 -55257 -18465 -3100 -28807 -87390
20965h7390M0456N2745l401l0279r2443O454N0696j4494j3974O9364M3552P4514
$$ -87390 -46934 5811 2410 -27869 -120312 -113858 -63162 -77656 -91630 -22266 21286 95800
20953I5800j3251o9605k8373J5124k0887Q88l8592N968L0416j8848J1292q032
$$ 95800 82549 12944 -15429 -305 -21192 -20304 -58896 -52928 -22512 -41360 -30068 -38100
20941c8100Q45k7035L4000N6335N5407k1904k2045k6325n3220r053k0428K3598
$$ -38100 -37255 -64290 -30290 26045 81452 59548 37503 11178 -42042 -51095 -71523 -47925
20929d7925L3818M6861o5865K0518J0540k712l0952l0448K129l199j8536L1994
$$ -47925 -14107 32754 -33111 -12593 -2053 -4765 -35717 -66165 -64036 -67235 -85771 -53777
20917e3777O3271n566k0125o064o707k0844K2424L7099J8674n4778k7529p355
$$ -53777 9494 3928 -16197 -22261 -28968 -49812 -27388 9711 28385 -26393 -53922 -61277
20905f1277j6477N980q094L3509K1594K9837J9372k4000j7458N044o4103m904
$$ -61277 -77754 -71774 -79868 -46359 -24765 5072 24444 444 -17014 -11970 -76073 -80977
20893h0977K8299k2300K7802J6230k432j1473O569q071k4616l7576n7596k87P0968
$$ -80977 -52678 -74978 -47176 -30946 -33378 -44851 -38282 -46353 -70969 -108545 -166141 -166428 -95460
20880i5460M4772L2579O1221L9903l0276l4437p1186k7042J4168k1806j70j1104
$$ -95460 -50688 -18109 43112 83015 52739 18302 -52884 -79926 -65758 -87564 -87734 -98838
20868i8838P747M5545M7581L9716K2508m4581m2720q856J4525m461L515m2388
$$ -98838 -91091 -45546 2035 41751 64259 19678 -23042 -31898 -17373 -21834 -18319 -60707
20856f0707J6762L9964K7847P0373J7978n9855j3589o0937o6645L783P2143K2802
$$ -60707 -43945 -3981 23866 94239 112217 52362 38773 -22164 -88809 -85026 -12883 9919
20844I919R1678K6581q5944j2798M716K75k8311k8100O0161L1030J1230J4675
$$ 9919 101597 128178 42234 29436 34152 34427 6116 -21984 38177 69207 80437 95112
20832I5112n0220j3063Q838j9612N3981K3843l5792j05992K3391N1287k2681m6035
$$ 95112 44892 31829 40667 21055 75036 98879 63087 -42905 -19514 31773 9092 -36943
20820c6943j2532M0686K7085r486q1923k3376j033L2546J2046J5001L5765k949
$$ -36943 -49475 -8789 18296 8810 -73113 -96489 -97522 -64976 -52930 -37929 -2164 -5113
20808e113n066l3248J1396J6593o788n246K2324Q342r410l807j7469K5821k5853
$$ -5113 -10179 -43427 -32031 -15438 -22226 -27472 -5148 3194 -6216 -10023 -27492 -1671 -27524
20795b7524l529k699R40J6947M0878n4416n8183q741J4148Q225O0759N1477P786
$$ -27524 -31053 -33752 -32812 -15865 25013 -29403 -87586 -96327 -82179 -73954 -13195 38282 46068
20782D6068o1160l3244N690N766J7135n0819P212N285l8486M2852L8023K4271
$$ 46068 -15092 -48336 -42646 -36880 -19745 -70564 -63352 -58067 -96553 -53701 -15678 8593
20770H593j8743j6874J0494j0623L9777L3981L1840M4155m7503k9912j1105J4439
$$ 8593 -10150 -27024 -16530 -27153 12624 46605 78445 122600 75097 45185 34080 48519
20758D8519O208l1128l7854k0918L994k1432L540L0165l4256k1613K7834j9777
$$ 48519 54727 23599 -14255 -35173 -31179 -52611 -49071 -18906 -53162 -74775 -46941 -66718
20746f6718N4171P5901J7352k1348L625l8235J922L2508m9545r911K0063j3481
$$ -66718 -12547 63354 80706 59358 62983 24748 26670 59178 9633 -278 19785 6304
20734F304j3094O989r559N0076l6933p9719l1045p914N5984J7431M4077L5763
$$ 6304 -6790 199 -9360 40716 3783 -75936 -106981 -114895 -58911 -41480 2597 38360
20722C8360r529l744k2124l9307m501j3984J8128j9449l6030L6397M9264r091
$$ 38360 28831 25087 2963 -36344 -40845 -54829 -36701 -56150 -92180 -55783 -6519 -15610
20710a5610m3123l594J1978J8618j9122j7341J8052k5629K295J2544L1144K7380
$$ -15610 -58733 -62327 -50349 -31731 -50853 -68194 -50142 -75771 -73476 -60932 -29788 -2408
20698b408K7541k4766J023j1039P167J1978J389K5287m835n8145J0708k7901k1970
$$ -2408 25133 367 1390 -9649 -2482 9496 10885 36172 31337 -26808 -16100 -44001 -65971
20685f5971J6167K0762K0752K5275j9597J2601L9284o522J1546j9221o654L7764
$$ -65971 -49804 -29042 -8290 16985 -2612 9989 49273 42751 54297 35076 28422 66186
20673F6186j5629k4980n009k197k427j2462j4225j3337j8133K0983J0841l6004
$$ 66186 50557 25577 20568 18371 15944 3482 -10743 -24080 -42213 -21230 -10389 -46393
20661d6393k0759J7981N4700L5921K400l3241o412j6441L277K0045n0843l0952
$$ -46393 -67152 -49171 5529 41450 43850 10609 4197 -12244 -8967 11078 -39765 -70717
20649g0717R085K469L4554K0953l8751o614N9210M5426L7m6834j5315M9546L2085
$$ -70717 -61632 -59163 -24609 -3656 -42407 -49021 10189 55615 55652 8818 -6497 43049 75134
20636G5134k5400m7567j4504j2992m9510K8931j119m0552J5274K1034J9540J7912
$$ 75134 49734 2167 -12337 -25329 -74839 -45908 -47027 -87579 -72305 -51271 -31731 -13819
20624a3819J2527M4790m1341k3610j2689K8768j3665j3343O3080j4657o1172J005
$$ -13819 -1292 43498 2157 -21453 -34142 -5374 -19039 -32382 30698 16041 -45131 -44126
20612d4126K1861r983o548j1675k1335P7337K9975P004N1002m0847m1323k3980
$$ -44126 -22265 -32248 -38796 -50471 -71806 5531 35506 42510 93512 52665 11342 -12638
20600a2638o842N6719L9679j4383n9568k1058K1091L1602k1827q645J7646m1648
$$ -12638 -19480 37239 76918 62535 2967 -18091 3000 34602 12775 4130 21776 -19872
20588a9872k1314l707k1680L7379L6606o9385O005O7619N1761k1970n2033p356
$$ -19872 -41186 -44893 -66573 -29194 7412 -61973 -55968 11651 63412 41442 -10591 -17947
20576a7947N790J9866J2397N7281o5927p1859p893K0386K0761J2845m1481o2753
$$ -17947 -12157 7709 20106 77387 11460 -60399 -68292 -47906 -27145 -14300 -55781 -118534
20564a18534J5839R4454L025r849M1403M126k9916n681k2660l2433M7137J0985
$$ -118534 -102695 -8241 -5216 -15065 26338 30464 548 -5133 -27793 -60226 -13089 -2104
20552b104n897m9250j8646O274k3439l749k0544M542K5324k8554j8912J8527J1547
$$ -2104 -8001 -57251 -75897 -69623 -93062 -96811 -117355 -112813 -87489 -116043 -134955 -116428 -104881
20539a04881O3172J849L2544q164O91j5261l1303j2167k3873j898O2796l739L227
$$ -104881 -41709 -39860 -7316 -15480 -14789 -30050 -61353 -73520 -97393 -99291 -36495 -40234 -37007
20526c7007j8941J3037M3932K2862K3362J0255j7071n666l0198k406L1767j5617
$$ -37007 -55948 -42911 1021 23883 47245 57500 40429 34763 4565 2159 33926 18309
20514A8309j9066l7183k3927j0507J3480K3239k9545n0807K5195L4307K5278J45
$$ 18309 -757 -37940 -61867 -72374 -58894 -35655 -65200 -116007 -90812 -56505 -31227 -31082
20502c1082l5500m548M5645P799n17k4062M8268R407m2993m139Q722j2237r469
$$ -31082 -66582 -71130 -25485 -17686 -18203 -42265 6003 15410 -27583 -31722 -23000 -35237 -44706
20489d4706K428R96j4236J6743p041l7186N2235R788J3465L936L2797N769j5200
$$ -44706 -42278 -41282 -55518 -38775 -45816 -83002 -30767 -20979 -7514 -3578 29219 34988 19788
20476A9788J5229L9712q741R278n45K3094m587k5960n1979n793K428L8671k818
$$ 19788 35017 74729 65988 75266 74721 97815 93228 67268 15289 9496 11924 50595 47777
20463D7777o0830l2073K0117M6748J0343m9106k4540M4997m8928r34P097j2294
$$ 47777 -13053 -45126 -25009 21739 32082 -17024 -41564 3433 -45495 -46429 -39332 -51626
20451e1626M3006R075M7677J2386j072j8008k4998k6976K6396k0141q160J3158
$$ -51626 -8620 455 48132 60518 59446 41438 16440 -10536 15860 -4281 -12441 717
20439G17L2905j8935o8205j5786L3834j399M0507M4839j7501n2342q9725m3482
$$ 717 33622 14687 -53518 -69304 -35470 -36869 3638 48477 30976 -21366 -111091 -154573
20427a54573J0192M364j2895K5124J6326L7073J04932O5888J5239n627K4814K6865
$$ -154573 -144381 -140017 -152912 -127788 -111462 -74389 30543 96431 111670 106043 130857 157722
20415A57722m4559m6851l4232L725J0613m1208K8064M098n19K019k5058l685j9138
$$ 157722 113163 66312 32080 35805 46418 5210 33274 37372 36853 38872 13814 10129 -9009
20402i009N506k438N0689J3755L452m7379m6995k3422q913K6173N6663K09o2169
$$ -9009 -3503 -5941 44748 58503 61955 14576 -32419 -55841 -64754 -38581 18082 18291 -43878
20389d3878p423L4922J457l7988j4467R483l9648K3486N2483K7284m6287j4379
$$ -43878 -51301 -16379 -14922 -52910 -67377 -57894 -97542 -74056 -21573 5711 -40576 -54955
20377e4955r052k2660J7587l291l078K3003j4018M5177M154M1641N6678k5081
$$ -54955 -64007 -86667 -69080 -72371 -75449 -52446 -66464 -21287 -17133 24508 81186 56105
20365E6105p2741p538P6652n187q259j5580j6358p474K4344l0241l8447J8076
$$ 56105 -16636 -24174 52478 47291 39032 23452 7094 -380 23964 -6277 -44724 -26648
20353b6648N2095j329l5487m7522N199R557j1599L2905K7250r400m9623K6706
$$ -26648 25447 24118 -11369 -58891 -53692 -44135 -55734 -22829 4421 -4979 -54602 -27896
20341b7896k2143j01129N980P9190K6115o362L7755K9704k4658J7090P6507O124
$$ -27896 -50039 -151168 -145188 -65998 -39883 -46245 -8490 21214 -3444 13646 90153 96277
20329I6277j26775m2251P4153M3665o619J0602m6175m0236K9845k7103K8086j6986
$$ 96277 -30498 -72749 1404 45069 38450 49052 2877 -37359 -7514 -34617 -6531 -23517
20317b3517n616P9136J4599k1432J1160J8053l1100n8256L2551l403J473L6533
$$ -23517 -29133 50003 64602 43170 54330 72383 41283 -16973 15578 12175 13648 50181
20305E0181k1207q647J3621K6227K5912O468p0857j107N5930r168l8346l7251
$$ 50181 28974 20327 33948 60175 86087 92555 21698 20591 76521 67353 29007 -8244
20293h244q2671q796M5616M7553J0069K788j5410L5303n2414j0862K7012p844
$$ -8244 -90915 -99711 -54095 -6542 3527 6315 -9095 26208 -26206 -37068 -10056 -17900
20281a7900m2510N0883q346J9903J6632k8771n9285n738L5125k743N1821J2677
$$ -17900 -60410 -9527 -17873 2030 18662 -10109 -69394 -75132 -40007 -42750 9071 21748
20269B1748K4921J2482p5891l3307M5871q835n0073J6201O4030N734l0575J0794
$$ 21748 46669 59151 -16740 -50047 -4176 -13011 -63084 -46883 17147 22881 -7694 3100
20257C100q042l4333K2285J0080p5479l2984m0165J9688J7100J8828L6515k974
$$ 3100 -4942 -39275 -16990 -6910 -82389 -115373 -155538 -135850 -118750 -99922 -63407 -66381
20245f6381L7883K991l0476J3251K3027j5805n022o965j3858j9672p550O5015
$$ -66381 -28498 -25507 -55983 -42732 -19705 -35510 -40532 -47497 -61355 -81027 -88577 -23562
20233b3562J058j9608n939O1600n898r548q339M8364J4587m064J7119j3696K2800
$$ -23562 -22504 -42112 -48051 13549 7651 -1897 -10236 38128 52715 48651 65770 52074 74874
20220G4874k8416p8962n0445N3573j3802j4450N090K9132K9458K9484o419j3235
$$ 74874 46458 -32504 -82949 -29376 -43178 -57628 -52538 -23406 6052 35536 29117 15882
20208A5882L8593j1129k6292q896o2341k1763L4640P5772m066L2426J5665j7337
$$ 15882 54475 43346 17054 8158 -54183 -75946 -41306 34466 30400 62826 78491 61154
20196F1154k7056k2039r558j9740m329J4638N4182Q852k0148q94j6292Q21j2024
$$ 61154 34098 12059 2501 -17239 -21568 -6930 47252 56104 35956 35062 18770 19591 7567
20183G567k1385M0457M3338m3117j8250L585N379j0231j6218J0830K2041j8028
$$ 7567 -13818 26639 69977 26860 8610 12195 17574 7343 -8875 1955 23996 5968
20171E968l8634q157l2665l0293K5397O188K251M3138r744L2432K6597J0404k7778
$$ 5968 -32666 -40823 -73488 -103781 -78384 -72196 -69945 -26807 -36551 -4119 22478 32882 5104
20158E104N2026l3571m1825P277j0674j6284o017k5225l4692j5800L7732Q6557
$$ 5104 57130 23559 -18266 -10989 -21663 -37947 -43964 -69189 -103881 -119681 -81949 4608
20146D608N3805j3782l6417L7839n581q4858k732r067K3964J6624L8449J2014
$$ 4608 58413 44631 8214 46053 40472 -44386 -47118 -56185 -32221 -15597 22852 34866
20134C4866n563k784m3123m8233L3574N8435l553J3121L95j9539n459P956k9603
$$ 34866 29303 26519 -16604 -64837 -31263 27172 23619 36740 37135 17596 12137 20093 -9510
20121i510k445J3848N233J19o118j1685K8100J530J0852n9576m863k0200l9960
$$ -9510 -11955 1893 7126 7245 1127 -10558 17542 19072 29924 -29652 -34515 -54715 -94675
20108i4675M6158L6878q205m096M350k9168j04n9596K50M4053j8782q497o090
$$ -94675 -48517 -11639 -19844 -23940 -19590 -48758 -48862 -108458 -108208 -64155 -82937 -91434 -97524
20095i7524Q746j1418K9167P1160j0083o9802K1342M2049J8854P9863m1125o0912
$$ -97524 -88778 -100196 -71029 131 -9952 -79754 -58412 -16363 2491 82354 41229 -19683
20083a9683O769N5594J7050l5533n1193r520P2014M9492k8623M5044m223n8103
$$ -19683 -12914 42680 59730 24197 -26996 -36516 35498 84990 56367 101411 97188 39085
20071C9085J4413q3432m9012J9282M6927N1264j3331q46M3126J6581Q764l3969
$$ 39085 53498 -29934 -78946 -59664 -12737 38527 25196 24350 67476 84057 92821 58852
20059E8852p5058l5351O1084m68k1470p638k6602K6161L9841L3096P180q100l5455
$$ 58852 -16206 -51557 9527 9059 -12411 -20049 -46651 -20490 19351 52447 59627 51527 16072
20046A6072m519p6446m4119k6047r210N0747O7732j9981l4106l5282K1718L4043
$$ 16072 11553 -64893 -109012 -135059 -144269 -93522 -25790 -45771 -79877 -115159 -93441 -59398
20034e9398k3344M5189Q007N4064p783j4180l0612j7361O115J6048J7049J848
$$ -59398 -82742 -37553 -29546 24518 16735 2555 -28057 -45418 -39303 -23255 -6206 -4358
20022d358j7328M6369N636q612k4455j8549Q113N7549J7829l6823m4097j5686
$$ -4358 -21686 24683 30319 21707 -2748 -21297 -13184 44365 62194 25371 -18726 -34412
20010c4412M2387M881K5568K0561J0006L718p3562k4171m698j5958o903K0198
$$ -34412 7975 12856 38424 58985 68991 72709 -853 -25024 -29722 -45680 -52583 -32385
19998c2385j2275j9501L5240L1022j5015o3040L0624J6919n0065j4136Q6112P1330
$$ -32385 -44660 -64161 -28921 2101 -12914 -75954 -45330 -28411 -78476 -92612 -6500 64830
19986F4830k7377n0856m6447k5328K2425P5871N074j5363k2150P0466J4030m0894
$$ 64830 37453 -13403 -59850 -85178 -62753 13118 18192 2829 -19321 51145 65175 24281
19974B4281r227N558J2327k9676l9331M5750K6834p5193n2718L9545K9931j9772
$$ 24281 15054 20612 32939 3263 -36068 9682 36516 -38677 -91395 -51850 -21919 -41691
19962d1691m884K119o596M4756M056Q732L4343R874q6332k5795M8299N2610K8164
$$ -41691 -46575 -44456 -51052 -6296 -2240 6492 40835 50709 -35623 -61418 -13119 39491 67655
19949F7655K4559r534M684k6128l6016j6016P497J5451J2904J5803K0027l416
$$ 67655 92214 82680 87364 61236 25220 9204 16701 32152 45056 60859 80886 77470
19937G7470K8232k8833m7221k7042M4645l6222r0485O683m165K5272j66K3171
$$ 77470 105702 76869 29648 2606 47251 11029 -79456 -72773 -76938 -51666 -51832 -28661
19925b8661O57o5966r942l413K0241J0824L7155j5490k4285j3878K2297N5244
$$ -28661 -28004 -93970 -103912 -107325 -87084 -76260 -39105 -54595 -78880 -92758 -70461 -15217
19913a5217K3415k728J7791p823l4444k1026O2060o570k160L3766m4603k7125
$$ -15217 8198 5470 23261 15438 -19006 -40032 22028 15458 13298 47064 2461 -24664
19901b4664j0600o1832N051L9257L5933r209k8779J2179j5359l7223L518k0305
$$ -24664 -35264 -97096 -92045 -52788 -16855 -26064 -54843 -42664 -58023 -95246 -91728 -112033
19889a12033O113l3198l6976J8066P9417N9095L0921J2909P911l5093o7033J0362
$$ -112033 -105920 -139118 -176094 -158028 -78611 -19516 11405 24314 32225 -2868 -69901 -59539
19877e9539J4985K9039J1796l1860q564K9492m4256l4181Q053O0899j0884J3142
$$ -59539 -44554 -15515 -3719 -35579 -44143 -14651 -58907 -93088 -85035 -24136 -35020 -21878
19865b1878K9436K1132l619l1999m7554k0958L2198R879L9381K7585j9631m0942
$$ -21878 7558 28690 25071 -6928 -54482 -75440 -43242 -33363 6018 33603 13972 -26970
19853b6970J2059M1853L7304m7513L960K2816k0636j6710j9332l3527L3617L0373
$$ -26970 -14911 26942 64246 16733 20693 43509 22873 6163 -13169 -46696 -13079 17294
19841A7294K9782l3934K8386N0707k7872m1003p278n8314n6771Q0633O0720j725
$$ 17294 47076 13142 41528 92235 64363 23360 16082 -42232 -99003 -18370 42350 40625
19829D0625o519K1958o508L5072J9648n7186k0466J2850j1070K079N564k0202
$$ 40625 34106 56064 49556 84628 104276 47090 26624 39474 28404 30483 36047 15845
19817A5845l0088k7242l1640L9119L8788j1037l2893N3907K2246J1441k5958M4089
$$ 15845 -14243 -41485 -73125 -34006 4782 -6255 -39148 14759 37005 48446 22488 66577
19805F6577j8757o1472j2215P2948K0732m3316j8413k2635r890O35J1062J8936
$$ 66577 47820 -13652 -25867 47081 67813 24497 6084 -16551 -26441 -25806 -14744 4192
19793D192L2912j6281k4033P110k8130m8405n608N1849J3033j0325M7652o768
$$ 4192 37104 20823 -3210 3900 -24230 -72635 -78243 -26394 -13361 -23686 23966 17198
19781A7198K7367J110j8974n6037p169l325K8466L5578j4653K6002N3579j6349
$$ 17198 44565 45675 26701 -29336 -36505 -39830 -11364 24214 9561 35563 89142 72793
19769G2793J432j0251r318L6061j6770m5559k3647p5566m9574K0406N1934j5144
$$ 72793 74225 63974 54656 90717 73947 28388 4741 -70825 -120399 -99993 -48059 -63203
19757f3203r222J0067K2928L234N560P7239k5224j9074M333j3655L4777M803k67
$$ -63203 -72425 -62358 -39430 -36196 -30636 46603 21379 2305 6638 -7017 27760 32563 32296
19744C2296k1329n472J6182j5580L1908L0565l100J3822L4209J5768l4803o8057
$$ 32296 10967 5495 21677 6097 38005 68570 65470 79292 113501 129269 94466 26409
19732B6409q495J7662k1099N856M3842M7450J3048j9105o6585k9183o881J3894
$$ 26409 17914 35576 14477 20333 64175 111625 124673 105568 38983 9800 2919 16813
19720A6813M2197J3177J418l075l5978j7696j1759j3962l8607K4997L9950M7435
$$ 16813 59010 72187 73605 70530 34552 16856 5097 -8865 -47472 -22475 17475 64910
19708F4910L4002j4196J5799l7143m0234l1917j3293J4668o322L7400M4445N5933
$$ 64910 98912 84716 100515 63372 23138 -8779 -22072 -7404 -13726 23674 68119 124052
19696A24052M038j4357l5019M97K190m3572j3079J5820J6425R732k8444o1163
$$ 124052 128090 113733 78714 79211 81401 37829 24750 40570 56995 66727 38283 -22880
19684b2880l6597K4390L9697k6933J0911Q1223Q025k1206J5594m3966k3882k5196
$$ -22880 -59477 -35087 4610 -22323 -11412 69811 77836 56630 72224 28258 4376 -20820
19672b0820m8694R998J5731l183m814M248N4087N1083l7249j828N9955j1366m8265
$$ -20820 -69514 -59516 -43785 -46968 -51782 -47534 6553 57636 20387 18559 78514 67148 18883
19659A8883P248j8090J9365n9014J6311K3328k3949o364J3696k0082K0396l135
$$ 18883 26131 8041 27406 -31608 -15297 8031 -15918 -22282 -8586 -28668 -8272 -11407
19647a1407J9586M2860N587M967l2477j0569J3988K004J7987l6465n9014k438
$$ -11407 8179 51039 56626 61593 29116 18547 32535 34539 52526 16061 -42953 -45391
19635d5391j9398Q84K017J795J6774O3217j4909j5810J6176q552j7644l5330K6399
$$ -45391 -64789 -63905 -61888 -60093 -43319 19898 4989 -10821 5355 -3197 -20841 -56171 -29772
19622b9772K4507J631j1257r052l5108K5924J5813N7289k2042m7646k0234L607
$$ -29772 -5265 -3634 -14891 -23943 -59051 -33127 -17314 39975 17933 -29713 -49947 -46340
19610d6340L1171K864J4593l361M8707N5032j3559o2787l5918K1661L984l9727
$$ -46340 -15169 -12305 2288 -1073 47634 102666 89107 26320 -9598 12063 16047 -23680
19598b3680k225J9069K2781k25L794J8350o831L7708K9638Q75n2254j2448J6600
$$ -23680 -25905 -6836 15945 15720 19514 37864 31033 68741 98379 99254 47000 34552 51152
19585E1152j3428o470j3597p177j6346k1133K9604K2429j1861P2627L2289j5166
$$ 51152 37724 31254 17657 10480 -5866 -26999 2605 25034 13173 85800 118089 102923
19573A02923j2419m6461R717L8488J3Q16k0518M3499k6163p5555p106J157m704
$$ 102923 90504 44043 53760 92248 92261 93077 72559 116058 89895 14340 7234 8391 3687
19560C687k1509J3164K8961M297k569K6727M4080k6146j963K457N6654j3988n5587
$$ 3687 -17822 -4658 24303 28600 26031 52758 96838 70692 68729 71186 127840 113852 58265
19547E8265K479m4662k823M0835o043J4139l5497n0089m940N8308K0909o6688
$$ 58265 60744 16082 13259 54094 48051 62190 26693 -23396 -28336 29972 50881 -15807
19535a5807n2866R9556N7323n719l7808K7021l3231J5322P020L0567J9903J8327
$$ -15807 -68673 30883 88206 82487 44679 71700 38469 53791 60811 91378 111281 129608
19523A29608K0630m2892O2587L4338Q3696O1717J10968J93996K19596L00059L70382
$$ 129608 150238 107346 169933 204271 287967 349684 460652 654648 874244 1174303 1544685
19512A544685K54732J384k66470l61669k32183j77874j45259j14151j07981j00315
$$ 1544685 1799417 1800801 1534331 1172662 940479 762605 617346 503195 395214 294899
19502B94899j09234j14730L767N3315N7706n1087k5423N9693M5788p5788j11693
$$ 294899 185665 70935 74702 128017 185723 134636 109213 168906 214694 138906 27213
19491B7213r297M2321j7459k191L122m533L2287jj0384j9058q072J904j7580J3767
$$ 27213 17916 60237 42778 40587 43709 39176 71463 71462 61078 42020 33948 35852 18272 32039
19477C2039j3904M257N0110J236l5222L279n7726l3731n730L1917M3569k0315
$$ 32039 18135 22392 72502 73738 38516 41795 -15931 -49662 -55392 -23475 20094 -221
19465b21k4332j5542K0063J3346J4728k5024M1308M9888L8761m4907n5146K5275
$$ -221 -24553 -40095 -20032 -6686 8042 -16982 24326 74214 112975 68068 12922 38197
19453C8197J0482Q973J0736j7933m904k7207n4977p015L8699J0045M3276n948
$$ 38197 48679 57652 68388 50455 45551 18344 -36633 -43648 -4949 5096 48372 42424
19441D2424R929K5790q756j7746m6416j5753N6665n339J8645J2989L973Q316m5592
$$ 42424 52353 78143 69387 51641 5225 -10528 46137 40798 59443 72432 76405 84721 39129
19428C9129n679K7656M0472j8844o3698K13j4495L1658L5332K876o865j2103k8041
$$ 39129 33450 61106 101578 82734 19036 19249 4754 36412 71744 74620 67755 55652 27611
19415B7611l3664J3146L6173l2772K661J2778R2188j2082o3193k5964k1279J9537
$$ 27611 -6053 7093 43266 10494 13155 25933 118121 106039 42846 16882 -4397 15140
19403A5140k439o4934j0180L955O8799j3267k6648L5913P2281j6967n4452J1890
$$ 15140 12701 -52233 -62413 -58458 10341 -2926 -29574 6339 78620 61653 7201 19091
19391A9091j0753K3124M5874j5904m4530p343o9063p029L4836L3727k2512K1228
$$ 19091 8338 31462 77336 61432 16902 9559 -59504 -66533 -31697 2030 -20482 746
19379G46L9358K920m893l167J5091O047j3195M882K4393K4825j9589m4102K831
$$ 746 40104 43024 38131 34964 50055 56102 42907 47789 72182 97007 77418 33316 36147
19366C6147J518j089m225K9693L5997j1484J2873m165K4821o5549l6244p690k070
$$ 36147 37665 36576 32351 62044 98041 86557 99430 95265 120086 54537 18293 10603 8533
19353H533Q645M4385J2569J7422k5316k0391k9406Q6706N648n2538j01272r733
$$ 8533 17178 61563 74132 91554 66238 45847 16441 103147 108795 56257 -45015 -54748
19341e4748N108J385K9386L4088J7693k0048K7915L4909j3891o8834L720q274
$$ -54748 -49640 -48255 -18869 15219 32912 12864 40779 75688 61797 -7037 -3317 -11591
19329a1591K8828K4712j2975k1789M5497N587J6103R765m7239n6323L8686P349
$$ -11591 17237 41949 28974 7185 52682 58269 74372 84137 36898 -19425 19261 26610
19317B6610J6771j506p744m9437k4024L9670J0196M3461q813l4445k4062l5223
$$ 26610 43381 41875 34131 -15306 -39330 340 10536 53997 45184 10739 -13323 -48546
19305d8546L8830M61j7938K9402k4065O2711P82m7882o750K1198k2582o5818R729
$$ -48546 -9716 -9255 -27193 2209 -21856 40855 41637 -6245 -12995 8203 -14379 -80197 -70468
19292g0468J8518O6204K6588j6069L673L0537k5991l1402k5557R236L8711J5983
$$ -70468 -51950 14254 40842 24773 28446 58983 32992 1590 -23967 -14731 23980 39963
19280C9963j0421j5626J1570J9331k4121J5446L8078l333L6627K3793l579o0002
$$ 39963 29542 13916 25486 44817 20696 36142 74220 70887 107514 131307 127728 67726
19268F7726l0730l7377J9308L1926k5556k1410K5587n3348o6295J11237L3607
$$ 67726 36996 -381 18927 50853 25297 3887 29474 -23874 -90169 21068 54675
19257E4675k231J3486J3939R250l1064l642J2943N1063Q695j9945N3j9398N6667
$$ 54675 52444 65930 79869 89119 58055 54413 67356 118419 127114 107169 107222 87824 144491
19244A44491M5596j4741j7740m938N1992J7594j23226q0290k4246J9824K3165
$$ 144491 190087 175346 157606 152668 204660 222254 99028 18738 -5508 14316 37481
19233C7481m7246n014J8488O8776L5770r2832k7573k1829p5494r958Q4624M3592
$$ 37481 -9765 -14779 3709 72485 108255 15423 -12150 -33979 -109473 -119431 -34807 8785
19221H785j9573n9k1726n1821J9876J2898L5150J6044j4033k9201K4438q022l3722
$$ 8785 -10788 -10847 -32573 -84394 -64518 -51620 -16470 -426 -14459 -43660 -19222 -27244 -60966
19208f0966J4215k0186L122j0208K1750K8228R532j0785n344N7807M4874L4789
$$ -60966 -46751 -66937 -63815 -74023 -52273 -24045 -14513 -25298 -30642 27165 72039 106828
19196A06828O068j7828l2569L1465k3810l5086L514N6905O0813P3779L8188M4243
$$ 106828 112896 95068 62499 93964 70154 35068 38582 95487 156300 230079 268267 312510
19184C12510o263n7429o1532k2506n4614l9824m6234m5054j0361M9749L2226N372
$$ 312510 306247 248818 187286 164780 110166 70342 24108 -20946 -31307 18442 50668 56040
19172E6040J589M4074K3409l3676n779j6453k7462K1087R896K3527j5432k5179
$$ 56040 57629 101703 125112 91436 85657 69204 41742 62829 72725 96252 80820 55641
19160E5641k0424k2120o1445J1873K9370P152L6424L4544r119R010L5880L668
$$ 55641 35217 13097 -48348 -36475 -7105 47 36471 71015 61896 70906 106786 110454
19148A10454j7512j8050n0823Q985J00449J8386k5111k303k6152j3110m1002m2895
$$ 110454 92942 74892 24069 33054 133503 151889 126778 124475 98323 85213 44211 1316
19136A316K6555N6491J6737k3460k8979m2252K325J4058L0396M2932k6774m6559
$$ 1316 27871 84362 101099 77639 48660 6408 8733 22791 53187 96119 69345 22786
19124B2786j1917j0065j7804j3071k991k5867n9648L331M0828j3442J9459L6347
$$ 22786 10869 804 -17000 -30071 -33062 -58929 -118577 -115246 -74418 -87860 -68401 -32054
19112c2054M0163j8402j8306O0225L0700N6785m1221l6617J9983k3666R246N881
$$ -32054 8109 -10293 -28599 31626 62326 119111 77890 41273 61256 37590 46836 52717
19100E2717j3366l9287J8237n634r130J5412L1256M4217K32p92l1299K8708J7505
$$ 52717 39351 64 18301 12667 3537 18949 50205 94422 94654 93862 62563 91271 108776
19087A08776M2388O2621J5496n3345j5073k3027n8160n1797m590J822m2111j4919
$$ 108776 151164 213785 229281 175936 160863 137836 79676 27879 23289 25111 -17000 -31919
19075c1919K0770O2062J0334R783l7783n8978k415O8474j8313p7926q1682k1280
$$ -31919 -11149 50913 61247 71030 33247 -25731 -28146 40328 22015 -55911 -137593 -158873
19063a58873l3124k298J4944L6784J89926L02864L39136J57554O7271n636j03923
$$ -158873 -191997 -194295 -179351 -142567 47359 350223 689359 846913 914184 908548 804625
19052H04625r0392j11733o2936r281k9715q453m3909l9860j1603j5127j5573k7261
$$ 804625 714233 602500 539564 530283 500568 492115 448206 408346 396743 381616 366043 338782
19040C38782l5957L0987J65K0790j537p672R348j0711l8001k0553r376j2482N6726
$$ 338782 302825 333812 333977 354767 353230 345558 354906 344195 306194 285641 276265 263783 320509
19027C20509m426J2173m0728K0909O1825m856l2949J248p792j0048j6415M0742
$$ 320509 316083 328256 287528 308437 370262 365406 332457 333705 325913 315865 299450 340192
19015C40192K3335K5144j4777j248K2796J6784K046L9402J2429N0013J7462N212
$$ 340192 363527 388671 373894 372646 395442 412226 414272 453674 466103 516116 533578 538790
19003E38790j9511j4462j8276k6075N2906P275M0854M8005N3634R7621J22624
$$ 538790 519279 504817 486541 460466 513372 520647 561501 609506 663140 760761 883385
18992H83385J13686J03788K78274M88452O11366L90289r8658l15635l35183l04614
$$ 883385 997071 1100859 1379133 1867585 2478951 2869240 2770582 2454947 2119764 1815150
18982A815150k61291j82674p9428J3987M028P5914P9328J23064J87261L51812
$$ 1815150 1553859 1371185 1291757 1305744 1309772 1385686 1465014 1588078 1775339 2127151
18972B127151O60954O78434J75209k21300j90939o0940p6453j63134k36341j68293
$$ 2127151 2788105 3466539 3641748 3420448 3229509 3168569 3092116 2928982 2692641 2524348
18962B524348p5830P468O7861J04251R8012J27952K01233K24595L23475L93502
$$ 2524348 2448518 2455986 2523847 2628098 2726110 2854062 3055295 3279890 3603365 3996867
18952C996867L78501L93349L99962N95152O50096P52920Q50995J038641J329240
$$ 3996867 4375368 4768717 5168679 5763831 6413927 7166847 8017842 9056483 10385723
18943A0385723J603767K060129K744027L804426N172192P376285J1170813J7360239
$$ 10385723 11989490 14049619 16793646 20598072 25770264 33146549 44317362 61677601
18935F1677601K7958960M7918255Q1802163J13343778P3839804l0212779p5802478
$$ 61677601 89636561 137554816 219356979 332700757 406540561 376327782 300525304
18928C00525304p0494296o2767413n0359559l4812796k2531634j4603401r847257
$$ 300525304 230031008 167263595 116904036 82091240 59559606 44956205 35108948
18921C5108948p046772n264474m034427l097016k428701j983948j577742j269709
$$ 35108948 28062176 22797702 18763275 15666259 13237558 11253610 9675868 8406159
18913H406159j077167q68078p76114o27966n10896m75634l84478k01984k26089
$$ 8406159 7328992 6460914 5684800 5056834 4545938 4070304 3685826 3483842 3257753
18904C257753l11558k99233k20747j70668r7479r2881j1758R2739J73405J97779
$$ 3257753 2946195 2646962 2426215 2255547 2158068 2065187 2053429 2146168 2319573 2517352
18894B517352P1486k2144J06154L10974M49283J38945l91456m98277m25329m34287
$$ 2517352 2588838 2566694 2672848 2983822 3433105 3572050 3180594 2682317 2256988 1822701
18884A822701l17669k24000j64688o6262k3936j2292P1162K95501M91181N40192
$$ 1822701 1505032 1281032 1116344 1050082 1026146 1013854 1085016 1380517 1871698 2411890
18874B411890K40388l14368m52670l93659l22667k02188j32864q7651o9810r7385
$$ 2411890 2652278 2337910 1885240 1491581 1168914 966726 833862 746211 676401 579016
18864E79016r1040p2275k3911j2490J3830k707l4572m0408j1980l4330r8745j3807
$$ 579016 487976 415701 391790 379300 393130 390423 355851 315443 303463 269133 170388 156581
18852A56581Q176J5272l5695R973J7696l5260j3257J0760K6855m4717n8572J714
$$ 156581 164757 180029 144334 154307 172003 136743 123486 134246 161101 116384 57812 59526
18840E9526O1042K4835J057k5234j0241j5397J0540K3363O230l3807l1416j3068
$$ 59526 120568 145403 146460 121226 110985 95588 106128 129491 135721 101914 70498 57430
18828E7430n136J6104L0299J7392N570O154m4943j1207j6046m1096m4937K0859
$$ 57430 52294 68398 98697 116089 121659 127813 82870 71663 55617 14521 -30416 -9557
18816i557O885m0759m5582o9890K0398j8158l7386k5499j04273k09746j23074
$$ -9557 -2672 -43431 -89013 -158903 -138505 -156663 -194049 -219548 -323821 -533567 -656641
18805f56641J02899L10232K67272J02243L7988N6664N6391L7833M0553K6881o3609
$$ -656641 -553742 -243510 23762 126005 163993 220657 277048 314881 355434 382315 318706
18794C18706n2145j7329o9629n4312P8865K2861N241k8022j4268j9754m0091l904
$$ 318706 266561 249232 179603 125291 204156 227017 232258 204236 189968 170214 130123 126219
18782A26219m3319n444k2079l8521l1203j0172m629M2504N4020r838j0570j2268
$$ 126219 82900 77456 55377 16856 -14347 -24519 -29148 13356 67376 57538 46968 34700
18770C4700K4088M092m4113M5944N0021M0738j0583m2663o7042j2397O2439O500
$$ 34700 58788 62880 18767 64711 114732 155470 144887 102224 35182 22785 85224 91724
18758I1724L7464k5124l9386J5542J1762j406j5297N8970J3001J5115k2446l9094
$$ 91724 129188 104064 64678 80220 91982 90576 75279 134249 147250 162365 139919 100825
18746A00825Q217o563k2852o5532o9540N737K1071O0805R910m6153j4753O3565
$$ 100825 109042 102479 79627 14095 -55445 -49708 -28637 32168 42078 -4075 -18828 44737
18734D4737M2616l5127l6972L4068l043m608J57j3876M2984N3670K5845l2918
$$ 44737 87353 52226 15254 49322 46279 41671 41828 27952 70936 124606 150451 117533
18722A17533o1136j3445l2102j0919k155o371j3300k9849k4902K3679n401j4675
$$ 117533 56397 42952 10850 -69 -2224 -8595 -21895 -51744 -76646 -52967 -58368 -73043
18710g3043J6261L0077O0355O199n2923J297K9033k1734l4965J1459L2615K0646
$$ -73043 -56782 -26705 33650 39849 -13074 -11777 17256 -4478 -39443 -27984 4631 25277
18698B5277k6716N6004L1893l5510k9217N9583j148j5046j1796n2094k1022J075
$$ 25277 -1439 54565 86458 50948 21731 81314 80166 65120 53324 1230 -19792 -18717
18686a8717J7887m9931J4268K4442Q0525m1516m104K2339J0381P765J4419j2143
$$ -18717 -830 -50761 -36493 -12051 68474 26958 22854 45193 55574 63339 77758 65615
18674F5615l0039K2313m0376k6551L5538J3372j8278l5000j8463o750j2501P714
$$ 65615 35576 57889 17513 -9038 26500 39872 21594 -13406 -31869 -38619 -51120 -43406
18662d3406P9312K06l0045k4137k9805l049J2172L0514k2149j2888L1668p141
$$ -43406 35906 36112 6067 -18070 -47875 -50924 -38752 -8238 -30387 -43275 -11607 -18748
18650a8748N5149K7594k4926n1458m9167K7467j5037N186O7241j0341j3051k4888
$$ -18748 36401 63995 39069 -12389 -61556 -34089 -49126 -43940 23301 12960 -91 -24979
18638b4979R826l75k2160L3739J5894m2088j2151J8259K9481K8467j9527K8591
$$ -24979 -15153 -15528 -37688 -3949 11945 -30143 -42294 -24035 5446 33913 14386 42977
18626D2977k2375l1013j6323k8118k3432l2476m1702k80m0373O2238K8514q986
$$ 42977 20602 -10411 -26734 -54852 -78284 -110760 -152462 -152742 -193115 -130877 -102363 -111349
18614a11349K6243L4996J3615r527R485K7495K2511l4870k9325M1867M9960J539
$$ -111349 -85106 -50110 -36495 -46022 -36537 -9042 13469 -21401 -50726 -8859 41101 42640
18602D2640j1077j9013l967N412N1720l2895o197n342l3886j6882l9290m1446
$$ 42640 31563 12550 8583 13995 65715 32820 26623 21281 -12605 -29487 -68777 -110223
18590a10223j053N0220R2459L1905k7382m1450J6250l7474j02072l973Q4280Q3023
$$ -110223 -111276 -61056 31403 63308 35926 -5524 10726 -26748 -128820 -132793 -48513 34510
18578C4510J5109j2517k0325p715k6855q3263j0851L8884P817L2985L6058r334
$$ 34510 49619 37102 16777 9062 -17793 -101056 -111907 -73023 -65206 -32221 3837 -5497
18566e497j0541m3204J602K8195k499J8372J9673O23j5587K3146l6565O849N6667
$$ -5497 -16038 -59242 -57640 -29445 -31944 -13572 6101 6724 -8863 14283 -22282 -15433 41234
18553D1234J6552l8881K8986J6686K4084K5007M0850n1338q5881j476k858k6584
$$ 41234 57786 18905 47891 64577 88661 113668 154518 103180 17299 15823 12965 -13619
18541a3619q72n0494L2783L4536O2768m3989k7098L2647J7353J2178K5000n03
$$ -13619 -14491 -64985 -32202 2334 65102 21113 -5985 26662 44015 56193 81193 80690
18529H0690p3417k6659J3401M1474K4968j0840m511m35j9205k9864o5253k5801
$$ 80690 7273 -19386 -5985 35489 60457 49617 45106 44671 25466 -4398 -69651 -95452
18517i5452l6607k691N4449M4624m069J4194J8206q228O213M3394j8925j1563
$$ -95452 -132059 -134750 -80301 -35677 -39746 -25552 -7346 -15574 -9361 34033 15108 3545
18505C545j7087O3016J272O020l1181r618l5884K0509K5836n919m389k182K4292
$$ 3545 -13542 49474 50746 56766 25585 15967 -19917 592 26428 20509 16120 13938 38230
18492C8230j4513k5826r78k6215k0679l4294L0832k013m2904J1857Q230l721K3481
$$ 38230 23717 -2109 -3087 -29302 -49981 -84275 -53443 -55456 -98360 -86503 -78273 -81994 -58513
18479e8513J3516J8424m9942m2281k2334k282L152M2201O4164R5334k4098j0224
$$ -58513 -44997 -26573 -76515 -118796 -141130 -143412 -140260 -98059 -33895 61439 37341 27117
18467B7117J0216m8799R385K3609j5414N2765L6598j6401N2701J573m7452o9046
$$ 27117 37333 -11466 -2081 21528 6114 58879 95477 79076 131777 133350 85898 16852
18455A6852j1441k6999j3866Q2150K8383l6884j7423j9986m3014m9823k7011J0016
$$ 16852 5411 -21588 -35454 46696 75079 38195 20772 786 -42228 -92051 -119062 -109046
18443a09046L8963L1674k0908J515L8761L3230K0608j1711k8668J3665K5688j4158
$$ -109046 -70083 -38409 -59317 -57802 -19041 14189 34797 23086 -5582 8083 33771 19613
18431A9613m3494j1509K1081J1833m8620j1091J8415k824K6044j9879n7773J4172
$$ 19613 -23881 -35390 -14309 -2476 -51096 -62187 -43772 -46596 -20552 -40431 -98204 -84032
18419h4032J8228k9876K9270r93n2190j9438k5352L7050K8787N1589K6080P828
$$ -84032 -65804 -95680 -66410 -67403 -119593 -139031 -164383 -127333 -98546 -46957 -20877 -13049
18407a3049k0979R623j8946J8340J5312K9396J8959K1197q849n1886K9622P045
$$ -13049 -34028 -24405 -43351 -25011 -9699 19697 38656 59853 51004 -882 28740 35785
18395C5785m9155m851P630L2784M9169K0568m6946r112n555k4521j6076K444K745
$$ 35785 -13370 -18221 -10591 22193 71362 91930 44984 35872 30317 5796 -10280 -7836 -5091
18382e091J7876k4177n9657L3439P882j9155L8575K8027J3790J4635L8234j3984
$$ -5091 12785 -11392 -71049 -37610 -29728 -48883 -10308 17719 31509 46144 84378 70394
18370G0394j09770n1267j200j2090P1098L0880J7855m594J320j642K8148n9529
$$ 70394 -39376 -90643 -91843 -103933 -32835 -1955 15900 11306 12626 10984 39132 -20397
18358b0397J1162K1038J1226Q162L7199J8244J9712P1921Q0741N5718R8497J48686
$$ -20397 -9235 11803 23029 31191 68390 86634 106346 178267 259008 314726 413223 561909
18346E61909J90058K46923L73157L19008L9664j93759k25743k02988k14639j95625
$$ 561909 751967 998890 1372047 1691055 1730719 1536960 1311217 1108229 893590 697965
18336F97965j83797j90998j02860l8826l4215n6877l7703M3354m2363k3559k3832
$$ 697965 514168 323170 220310 181484 147269 90392 52689 96043 53680 30121 6289
18325F289M683N5668o394p9552l8395M6580K8517k6601l880l2166L5598l3078
$$ 6289 10972 66640 60246 -19306 -57701 -11121 17396 -9205 -13085 -45251 -9653 -42731
18313d2731j7401K8273N151m4761o3548q065N6037N9631L6242J3668m4834k6778
$$ -42731 -60132 -31859 -26708 -71469 -135017 -143082 -87045 -27414 8828 22496 -22338 -49116
18301d9116R260o881l721L1814n5617k500j3300K1931l896l6169N3271K3105K5746
$$ -49116 -39856 -46737 -50458 -18644 -74261 -76761 -90061 -68130 -72026 -108195 -54924 -31819 -6073
18288f073m1848j3969K8076K4574O82m7083M389J986j1760j9128j1657L8423p252
$$ -6073 -47921 -61890 -33814 -9240 -8558 -55641 -51252 -49266 -61026 -80154 -91811 -53388 -60640
18275f0640j5552K7884L2117M2757M707j4197k0488k3760K1989N3599j1178j02423
$$ -60640 -76192 -48308 -16191 26566 31273 17076 -3412 -27172 -5183 48416 37238 -65185
18263f5185j8571j9322M0600P7707j520m8231j8967l6375p939k4614r576M6561
$$ -65185 -83756 -103078 -62478 15229 13709 -34522 -53489 -89864 -97803 -122417 -131993 -85432
18251h5432M5865N4763l2980m3982R437L165M9277K0808j4028o7596k4075N1436
$$ -85432 -39567 15196 -17784 -61766 -52329 -49164 113 20921 6893 -60703 -84778 -33342
18239c3342o142k3541n824L7961k1066J8530K0020j5680O513m0722n531p3J3236
$$ -33342 -39484 -63025 -68849 -30888 -51954 -33424 -13404 -29084 -22571 -63293 -68824 -68897 -55661
18226e5661L6536L5481j3913j316O978O902K4716J8425j0513k3613M643l0668
$$ -55661 -19125 16356 2443 1127 8105 15007 39723 58148 47635 24022 28665 -2003
18214b003l1594J401N8695j774m2432k4405n2851k6413M4325J5542p594j2835
$$ -2003 -33597 -32196 26499 24725 -17707 -42112 -94963 -121376 -77051 -61509 -69103 -81938
18202h1938M8863j2417m6278j867Q1154M4765J0775M516K4894l1139Q089o360
$$ -81938 -33075 -45492 -91770 -93637 -12483 32282 43057 47573 72467 41328 49417 43057
18190D3057K3740j9124Q110m1666m2337l4763n7211L5297L6035K1659J1923J9932
$$ 43057 66797 47673 55783 14117 -28220 -62983 -120194 -84897 -48862 -27203 -15280 4652
18178D652K2005j289n1905J6559k7090J1450N276K0216k9453M2619J6889k8286
$$ 4652 26657 25368 -26537 -9978 -37068 -25618 -20342 -126 -29579 13040 29929 1643
18166A643j154k0579l1381n344J2272j8656j982P7424j46r7482K999K6097J8396
$$ 1643 489 -20090 -51471 -56815 -44543 -63199 -65181 12243 12097 -85385 -82386 -56289 -37893
18153c7893Q748J19k1239l6407Q525L2421L5423J1759k5249k2275o1077k4206
$$ -37893 -29145 -29026 -50265 -86672 -78147 -45726 -10303 1456 -23793 -46068 -107145 -131351
18141a31351k7923l7528K1259M6874O4288O2552k5780j445M2860r482M14L2177
$$ -131351 -159274 -196802 -175543 -128669 -64381 -1829 -27609 -29054 13806 4324 4738 36915
18129C6915J9523m1282o3834n162K0212R151K6024k7252l3641n2613j4478M9654
$$ 36915 56438 15156 -48678 -53840 -33628 -24477 1547 -25705 -59346 -111959 -126437 -76783
18117g6783K3471k4721j3290l834J5693m621J1200L0890K5606L0982J1798n4220
$$ -76783 -53312 -78033 -91323 -95157 -79464 -84085 -72885 -41995 -16389 14593 26391 -27829
18105b7829l1191l4696k0965J8424L5231J0451k6532L7087L5929L1237l0906r372
$$ -27829 -59020 -93716 -114681 -96257 -61026 -50575 -77107 -40020 -4091 27146 -3760 -13132
18093a3132J348J8038n789J4612l671Q077k6418l7065k5026Q792M489J7653m765
$$ -13132 -11784 6254 465 15077 11406 19483 -6935 -44000 -69026 -60234 -55745 -38092 -42857
18080d2857L8632k1613m981q668l1937J0096M7454o485j6677J8537M50m6847l2827
$$ -42857 -4225 -25838 -30819 -39487 -71424 -61328 -13874 -20359 -37036 -18499 -18049 -64896 -97723
18067i7723K20K9692L4418L1557J9717j9379l3479n7810m4644P4898L4010R085
$$ -97723 -97503 -67811 -33393 -1836 17881 -1498 -34977 -92787 -137431 -62533 -28523 -19438
18055a9438q569k7155J589j7952k8027K328M4102j3311K515n038L5630O1635m0910
$$ -19438 -28007 -55162 -53573 -71525 -99552 -97224 -53122 -66433 -63918 -68956 -33326 28309 -12601
18042a2601o7522m5425l0556K1030N2407P6771J1643R36l3270p8527K0392K9070
$$ -12601 -80123 -125548 -156104 -135074 -82667 -5896 5747 6683 -26587 -105114 -84722 -55652
18030e5652P0640K3095m0531m8672j2987n017j1451n3086P3544R0392j9715k8701
$$ -55652 14988 38083 -2448 -51120 -64107 -69124 -80575 -133661 -60117 30275 10560 -18141
18018a8141J2199N1358K6975k0333j01707l6015j2239q285M4429P1018J40j3027
$$ -18141 -5942 45416 72391 52058 -49649 -85664 -97903 -106188 -61759 9259 9399 -3628
18006c628m252O5964J0830n1541l3901j3937j7902K9411j3239m4289k6372L2773
$$ -3628 -7880 58084 68914 17373 -16528 -30465 -48367 -18956 -32195 -76484 -102856 -70083
17994g0083K7155L7766k7523j8854l397J9034J1737m8547j4674M9600J0156P75
$$ -70083 -42928 -5162 -32685 -51539 -54936 -35902 -24165 -72712 -87386 -37786 -27630 -26855
17982b6855L616L9870K425J9246j6253m1202j7181j8087K8620J00739J1026m1515
$$ -26855 -23239 16631 19056 38302 22049 -19153 -36334 -54421 -25801 74938 85964 44449
17970D4449p1707K3115L8422k9103m4549K877M1123P1743M2936l4304p5943k7289
$$ 44449 -27258 -4143 34279 5176 -39373 -36496 4627 76370 119306 85002 9059 -18230
17958a8230L0538k6816M8191L1223n580m466K8377o1345l8133J1380K9392n8218
$$ -18230 12308 -14508 33683 64906 59326 54860 83237 21892 -16241 -4861 24531 -33687
17946c3687l1479L883k0092L3525K3312k3034J0385K6850O8747M6230Q321l9489
$$ -33687 -65166 -61283 -81375 -47850 -24538 -47572 -37187 -10337 58410 104640 112961 73472
17934G3472k9825k0883K3210J9549J4344m8998k2606M080K0280K1729L8994L1092
$$ 73472 43647 22764 45974 65523 79867 30869 8263 12343 32623 54352 93346 124438
17922A24438n0168l8864N656k911j5699J2077k0854r146O3069j1725l3491N4665
$$ 124438 74270 35406 41062 38151 22452 34529 13675 4529 67598 55873 22382 77047
17910G7047P1693K9433j4151r4140p212M0906l7427J4562j088p7119r8222k4675
$$ 77047 148740 178173 164022 69882 62670 103576 66149 80711 79623 2504 -95718 -120393
17898a20393R975L3026O4054N8175K2622k8329k04L6065j3241M9554l6622K4663
$$ -120393 -110418 -77392 -13338 44837 67459 39130 38926 74991 61750 111304 74682 99345
17886I9345O0624J1689n907k5952j3664K7370J9053r7098n9397j7688Q519J3922
$$ 99345 159969 171658 165751 139799 126135 153505 172558 75460 16063 -1625 6894 20816
17874B0816K7927J7372L81n7887J4452J3203j9297J2399J3504K4083R01m7467
$$ 20816 48743 66115 66496 8609 23061 36264 16967 29366 42870 66953 67854 20387
17862B0387m909m2178j089J3572J6227M6207n2243k4148M4777m5281L5815K8108
$$ 20387 15478 -26700 -27789 -14217 2010 48217 -4026 -28174 16603 -28678 7137 35245
17850C5245J8523k0716k2366L530j4505K5839J9112k8652n3321P665M2263k28
$$ 35245 53768 33052 10686 14216 -289 25550 44662 16010 -37311 -29646 12617 12389
17838A2389l0608K3252m5128j3744Q0577k3693n4544k4408n165J0280k096J9644
$$ 12389 -18219 5033 -40095 -53839 26738 3045 -51499 -75907 -81072 -70792 -72888 -53244
17826e3244N9512O300K7078O1956l7759k7940K2714L42n2929K7217M1801P114
$$ -53244 6268 12568 39646 101602 63843 35903 58617 58959 6030 33247 75048 82162
17814H2162j0842O547J4781m1521n8077j5307O8937J3935m9442j3553l9738o075
$$ 82162 71320 77867 92648 51127 -6950 -22257 46680 60615 11173 -2380 -42118 -48193
17802d8193J0029J1069K200L4306P615o0309K5920j0860l3695q2908k163q695
$$ -48193 -38164 -27095 -24895 9411 17026 -43283 -17363 -28223 -61918 -144826 -146989 -155684
17790a55684O5815N0541J350l223M9019K4090l3294J8365k48k9443L4459J6685
$$ -155684 -89869 -39328 -37978 -41201 7818 31908 -1386 16979 16731 -12712 21747 38432
17778C8432K5217k8650l9032l6130j7820P237J9051R706J272K106N3886m0499
$$ 38432 63649 34999 -4033 -40163 -57983 -50746 -31695 -21989 -20717 -18611 35275 -5224
17766e224L682l8478Q881N1693L4791l4305K8525k5660j7926J4403j4240L1041
$$ -5224 -1542 -40020 -31139 20554 55345 21040 49565 23905 5979 20382 6142 37183
17754C7183l309k4412l6970M8191K5907m2643n3746K842j2207n5802Q06L0291
$$ 37183 33874 9462 -27508 20683 46590 3947 -49799 -46957 -59164 -114966 -114160 -83869
17742h3869K9256j0323m993P4123P8898K6316K139j8887l7742j4404p9097j5134
$$ -83869 -54613 -64936 -69929 4194 83092 109408 111547 92660 54918 40514 -38583 -53717
17730e3717j0210J6581m2752l2794k3973P644O6159M4467J5114l5947N780J0525
$$ -53717 -63927 -47346 -90098 -122892 -146865 -139221 -73062 -28595 -13481 -49428 -43648 -33123
17718c3123J3843k051l8272n885J0214N352K4279N7659j423l8092N439j9785m1410
$$ -33123 -19280 -21331 -59603 -65488 -55274 -49922 -25643 32016 30593 -7499 -2060 -21845 -63255
17705f3255M1234P889K7292j6608l0814m8349k0663L250n4766J8509j2870M048
$$ -63255 -22021 -14132 13160 -3448 -34262 -82611 -103274 -100024 -154790 -136281 -149151 -145103
17693a45103O5507K4521J6285j2012j4353J6185m1314n289N9644K6888k892L9731
$$ -145103 -79596 -55075 -38790 -50802 -65155 -48970 -90284 -95573 -35929 -9041 -11933 27798
17681B7798k3946L2209L0442r746l8570J8562J6673l541n910O437J0703j5151
$$ 27798 3852 36061 66503 56757 18187 36749 53422 49881 43971 50408 61111 45960
17669D5960k2103j3687l9483j1623N4065j9097m7053j9203N659j0759m521j7185
$$ 45960 23857 10170 -29313 -40936 13129 -5968 -53021 -72224 -66565 -77324 -81845 -99030
17657i9030m2128M3581K4038l6558O8601K5975j5435J5114L136j8361k0313M1429
$$ -99030 -141158 -97577 -73539 -110097 -41496 -15521 -30956 -15842 -12706 -31067 -51380 -9951
17645i951Q703l638L2459L6707j4871n0153L4053O454J0071L534l710J940k4671
$$ -9951 -1248 -4886 27573 64280 49409 -744 33309 39763 49834 53368 49658 51598 26927
17632B6927l3274p392J2183N8689l0731L844Q941J8688K128J6421j4099k3440
$$ 26927 -6347 -13739 -1556 57133 26402 30246 39187 57875 60003 76424 62325 38885
17620C8885k6608N23k4170k9102k2833l4656P5359J3333m6054M0971j1319n0386
$$ 38885 12277 12800 -11370 -40472 -63305 -97961 -22602 -9269 -55323 -14352 -25671 -76057
17608g6057j0483O1388M3001m5680m5211Q9870J632m9473p7650r584O1455l702
$$ -76057 -86540 -25152 17849 -27831 -73042 16828 18460 -31013 -108663 -118247 -56792 -60494
17596f0494l1483O97K1627q689j7021L2534J6670J4155M0510O5398J4014k5656
$$ -60494 -91977 -91280 -69653 -78342 -95363 -62829 -46159 -32004 8506 73904 87918 62262
17584F2262j3387j8488Q065K8662J1038l2867l9905m15j7249j6339N0239J371
$$ 62262 48875 30387 38452 67114 78152 45285 5380 4965 -12284 -28623 21616 22987
17572B2987o2139k7729O740k5752J5980j5678Q530J1953J8565K9937j3328k7194
$$ 22987 -39152 -66881 -60141 -85893 -69913 -85591 -77061 -65108 -46543 -16606 -29934 -57128
17560e7128J4629j7237L8184K0156m2051j7560O0710K1117K73k2662k7487M978
$$ -57128 -42499 -59736 -21552 -1396 -43447 -61007 -297 20820 21093 -1569 -29056 -24078
17548b4078J0469J173k699l6666j9563L1642O974K9895J1619l9662L5288O7048
$$ -24078 -13609 -12436 -15135 -51801 -71364 -39722 -32748 -2853 8766 -30896 4392 71440
17536G1440k8695j4203L0702j9258l2508L5459q21l9760l6022N8939M3772k0527
$$ 71440 42745 28542 59244 39986 7478 42937 42116 2356 -33666 25273 69045 48518
17524D8518m1304M24j376l9602n6017L9681J2643j2997J7037J9994l3364O2327
$$ 48518 7214 7638 6262 -33340 -89357 -49676 -37033 -50030 -32993 -12999 -46363 15964
17512A5964L3636q0310p2940K4496M1034j6559Q729j613l5849K6983K9543N2815
$$ 15964 49600 -30710 -103650 -79154 -38120 -54679 -45950 -47563 -83412 -56429 -26886 25929
17500B5929M2296m3769n6208L5824m078n4918l0293N5482J4105J3339k9975M3662
$$ 25929 68225 24456 -31752 4072 -6 -54924 -85217 -29735 -15630 -2291 -32266 11396
17488A1396j0143J6406Q578q247J1179L128r315m5333k0397L6578K4613j0849
$$ 11396 1253 17659 26237 17990 29169 32297 22982 -22351 -42748 -6170 18443 7594
17476G594j7089j6093K5995L132K8232m32k0583o3090n364J5772L134L828K5779
$$ 7594 -9495 -25588 407 3539 31771 31339 10756 -52334 -57698 -41926 -38792 -34964 -9185
17463i185J0571j6800J9859j0357K3243L3664k3014n2878k7520J5538L5563M6085
$$ -9185 1386 -15414 4445 -5912 17331 50995 27981 -24897 -52417 -36879 -1316 44769
17451D4769m1629m9113J01293M2651m7153m4859k1319J4552k6163L7114N438J5242
$$ 44769 3140 -45973 55320 97971 50818 5959 -15360 -808 -26971 10143 15581 30823
17439C0823l9222L0870l7879L308j7510K2514p446j8454j0493Q183O6164J9933
$$ 30823 -8399 22471 -15408 -12100 -29610 -7096 -14542 -32996 -43489 -35306 30858 50791
17427E0791L1627j4746k2897j6207l9675l9180N0650Q626p6834m529m1919j9368
$$ 50791 82418 67672 44775 28568 -11107 -50287 363 8989 -67845 -72374 -114293 -133661
17415a33661j2949j5688N9817P4711K1787l583m5739n6117J4528O065R517N0855
$$ -133661 -146610 -162298 -102481 -27770 -5983 -9566 -55305 -111422 -96894 -90829 -81312 -30457
17403c0457L7781n981k6955J4461N6490l8766j1321K1718K0893m8505n9699L1081
$$ -30457 7324 1343 -25612 -11151 45339 6573 -4748 16970 37863 -10642 -70341 -39260
17391c9260J00232Q172n6221m0565j5559N623N0055j5311R065m7340j5911M3025
$$ -39260 60972 69144 12923 -27642 -43201 -37578 12477 -2834 6231 -41109 -57020 -13995
17379a3995M3890k4971k1361j1663J1293N4728O3655J0923l7048j5951j5810l3313
$$ -13995 29895 4924 -16437 -28100 -16807 37921 101576 112499 75451 59500 43690 10377
17367A0377K6394o03n9454l1329J1656J88N1923N509j7657l097j3941l0775o603
$$ 10377 36771 36168 -23286 -54615 -42959 -42771 9152 14661 -2996 -6093 -20034 -50809 -57412
17354e7412J9964M092R81j856j5085l158J7796K4405l0780j0584M8160l9633o066
$$ -57412 -37448 -33356 -32375 -34231 -49316 -52474 -34678 -10273 -41053 -51637 -3477 -43110 -49176
17341d9176K7345k4711K024k457J5205R049K6061L9889m3420o2604L153p345o422
$$ -49176 -21831 -46542 -44518 -46975 -31770 -22721 3340 43229 -191 -62795 -59642 -66987 -73409
17328g3409r499j6014k3305M0854L8457k3282m6630L5600K4670j4171O296K7533
$$ -73409 -82908 -98922 -122227 -81373 -42916 -66198 -112828 -77228 -52558 -66729 -60433 -32900
17316c2900N5200K7559m1439l2540j0175j2529O545p042k898j5813j8537M8879
$$ -32900 22300 49859 8420 -24120 -34295 -46824 -40279 -47321 -50219 -66032 -84569 -35690
17304c5690L1676J3566k1634l0356l6207o0811M4126j8861L0692j0303R562J6881
$$ -35690 -4014 9552 -12082 -42438 -78645 -139456 -95330 -114191 -83499 -93802 -84240 -67359
17292f7359M7630N217K6679M2682j9679l1868p763q543L4293j3764J3426J0425
$$ -67359 -19729 -14512 12167 54849 35170 3302 -4461 -13004 21289 7525 20951 31376
17280C1376j1145M3677j5259k7785q2778p9592o768J1635l116L7048J3531r061
$$ 31376 20231 63908 48649 20864 -61914 -141506 -148274 -136639 -139755 -102707 -89176 -98237
17268i8237M2948O5138r913p3117k7439L4063N592k9080L7534K6883M5919K4510
$$ -98237 -55289 9849 -64 -73181 -100620 -66557 -60965 -90045 -52511 -25628 20291 44801
17256D4801K5307K9692o9309p9628k4630j6516M0335L3057m3299J6001L6910o791
$$ 44801 70108 99800 30491 -49137 -73767 -90283 -49948 -16891 -60190 -44189 -7279 -14070
17244a4070l8316m5590j2161L2272K1814M8254O0066m5242L1008k5587o0909L0269
$$ -14070 -52386 -97976 -110137 -77865 -56051 -7797 52269 7027 38035 12448 -48461 -18192
17232a8192N3329L5648K3488q111p785n3698j2027J5229R2866Q3493j8727j9262
$$ -18192 35137 70785 94273 86162 78377 24679 12652 27881 120747 204240 185513 166251
17220A66251m9716n5686m8563l5423l2373L1952j2232J4254j2432M013j795m2273
$$ 166251 116535 60849 12286 -23137 -55510 -23558 -35790 -21536 -33968 -29955 -31750 -74023
17208g4023r97J4127N3813J8743K1487L939N1115Q1828j4753L827P992n3751j04133
$$ -74023 -75020 -60893 -7080 11663 33150 37089 88204 170032 155279 159106 167098 113347 9214
17195I214q7019l562M8056o472L2300Q2820J8107l4767p0367k0853L0380L3604
$$ 9214 -77805 -81367 -33311 -39783 -7483 75337 93444 58677 -11690 -32543 -2163 31441
17183C1441p783K1669k5339k4550n549J7855r240L1057L3370j1542j4205j8976
$$ 31441 23658 45327 19988 -4562 -10111 7744 -1496 29561 62931 51389 37184 18208
17171A8208m7927M624N1876l7164r722O4582K7298n4768j8177L3070J2967L3198
$$ 18208 -29719 -25095 26781 -10383 -20105 44477 71775 17007 -1170 31900 44867 78065
17159G8065m224k8415k6983n7701R218j9393j5446N920M3737j3988l5659l122
$$ 78065 73841 45426 18443 -39258 -30040 -49433 -64879 -58959 -15222 -29210 -64869 -67991
17147f7991K3089J2326J5969J7918q563j8957n5800M2643P931r08k4021Q748k5197
$$ -67991 -44902 -32576 -16607 1311 -7252 -26209 -82009 -39366 -31435 -32343 -56364 -47616 -72813
17134g2813q329O5329L8198m2100m4184K0703K3911M8701j9424k6707O1366m6837
$$ -72813 -81142 -15813 22385 -19715 -63899 -43196 -19285 29416 9992 -16715 44651 -2186
17122b186P864k9364N4666m255o147L931l9397m0510Q495j1499j7020j0802N4656
$$ -2186 5678 -23686 30980 26725 20578 24509 -14888 -55398 -46903 -58402 -75422 -86224 -31568
17109c1568M3382k4943l1818K8004n8682j9884P8806J6234m6784n648M8036M606
$$ -31568 11814 -13129 -44947 -16943 -75625 -95509 -16703 -469 -47253 -52901 -4865 -259
17097b59k1712n2058r59L7819L1908P116P502K4023l610l4249m7421J4669J3711
$$ -259 -21971 -74029 -74988 -37169 -5261 1855 9357 33380 29770 -4479 -51900 -37231 -23520
17084b3520j6978M0713K9337L687k8777m7355L8608P7625j2351o3326l5056M894
$$ -23520 -40498 215 29552 33239 4462 -42893 -4285 73340 60989 -2337 -37393 -32499
17072c2499p5669k1213N1913K166M8588l1921n6188O895J3309k6530K5685N8124
$$ -32499 -108168 -129381 -77468 -75302 -26714 -58635 -114823 -107928 -94619 -121149 -95464 -37340
17060c7340M6163K0407k7658j9780l3773k793K4648J5208J0213j3100O284o503
$$ -37340 8823 29230 1572 -18208 -51981 -54774 -30126 -14918 -4705 -17805 -11521 -18024
17048a8024k4994k7627N6870M7466o6079m8755J9488K1484J9447J466L5485n840
$$ -18024 -43018 -70645 -13775 33691 -32388 -81143 -61655 -40171 -20724 -19258 16227 10387
17036A0387j714K8412j4307p431l948k5394l6765K9866J7220k3726l3052K0375
$$ 10387 8673 37085 22778 15347 11399 -13995 -50760 -20894 -3674 -27400 -60452 -40077
17024d0077k6910K4506L0236J1106n1451j3368L7799r47p4239p050J6456O4752
$$ -40077 -66987 -42481 -12245 -1139 -52590 -65958 -28159 -29106 -103345 -110395 -93939 -29187
17012b9187M7560K1488R327L0429L62m0059k5111J5207J4553o2350n0616l4626
$$ -29187 18373 39861 49188 79617 79979 39920 14809 30016 44569 -17781 -68397 -103023
17000a03023P5447M5733M1401K822n970m611n2766l2247K8634m9352k4845K4783
$$ -103023 -27576 18157 59558 62380 56410 51799 -967 -33214 -4580 -53932 -78777 -53994
16988e3994M9331J1064J8602j0413n8099l7250L6984J08894L5476j9979P476n8138
$$ -53994 -4663 6401 25003 14590 -43509 -80759 -43775 65119 100595 80616 88092 29954
16976B9954n4867K7805J5011M337l5018j7707M8461K397m9066J7260M5224K7706
$$ 29954 -24913 2892 17903 22240 -12778 -30485 17976 20373 -28693 -11433 33791 61497
16964F1497j8188k1927n0588j1143J0926O5684j8612m3123o528o0950n3287L5853
$$ 61497 43309 21382 -29206 -40349 -29423 36261 17649 -25474 -32002 -92952 -146239 -110386
16952a10386O0128M9326K7233n0479k5582M538k1196K3523r271j9190K7717R757
$$ -110386 -50258 -932 26301 -24178 -49760 -45222 -66418 -42895 -52166 -71356 -43639 -33882
16940c3882L2134L1122K0636K7611K4258o3029j14111n6258L240j9894p734L8939
$$ -33882 -1748 29374 50010 77621 101879 38850 -75261 -131519 -128279 -148173 -155907 -116968
16928a16968L7941k286J8671p801j2946O7397L2323j6542j6527j1474p717p28
$$ -116968 -79027 -81313 -62642 -70443 -83389 -15992 16331 -211 -16738 -28212 -35929 -36657
16916c6657N2365N1144R536l4591l4743j8394m7204r190O18N4255k199n9326L3287
$$ -36657 15708 66852 76388 41797 7054 -11340 -58544 -67734 -67116 -12861 -15060 -74386 -41099
16903d1099K0682J1805J3878j8573j8469r88j7817L6006J6037n1686l4567Q4597
$$ -41099 -20417 -8612 5266 -13307 -31776 -32764 -50581 -14575 1462 -50224 -84791 -194
16891a94Q381n3795m935L2721J8168K47L111j9657L3610L824m4297K7472J3910
$$ -194 8187 -45608 -50543 -17822 346 593 3704 -15953 17657 21481 -22816 4656 18566
16878A8566o0759n7290N092J1426Q1500J2638j2026n7981k6608J479J1499o44
$$ 18566 -42193 -99483 -94391 -82965 -1465 11173 -853 -58834 -85442 -83963 -72464 -73108
16866g3108K1483R641l7328K5660N7045M8054k8324O692J8337l7939o2548O2260
$$ -73108 -51625 -41984 -79312 -53652 3393 51447 23123 29815 48152 10213 -52335 9925
16854I925P5144k0741l2882k1288k7277o931L946J4055m0454l1644j2758M2121
$$ 9925 85069 64328 31446 10158 -17119 -24050 -20104 -6049 -46503 -78147 -90905 -48784
16842d8784J4928J3582k6243J0023M2831M8981m870n2392m7666K0023N2637l769
$$ -48784 -33856 -20274 -46517 -36494 6337 55318 50448 -1944 -49610 -29587 23050 19281
16830A9281M2420R20k7483K4650j2432m3478r4419J3472N2429K9826j4475l3161
$$ 19281 61701 62621 35138 59788 47356 3878 -90541 -77069 -24640 5186 -9289 -42450
16818d2450O069L0906L9539j3870l694j6867K0631n961o7988k8081j3405J3624
$$ -42450 -36381 -5475 34064 20194 16500 -367 20264 14303 -53685 -81766 -95171 -81547
16806h1547K7269N9988j2686k3228K0899l8910k1794Q3450R9411q104q7546l4212
$$ -81547 -54278 5710 -6976 -30204 -9305 -48215 -70009 13441 112852 104748 17202 -17010
16794a7010K5155N1808J7172p5462J8709M7016k6983k4266l6526J3675j6720O958
$$ -17010 8145 59953 77125 1663 20372 67388 40405 16139 -20387 -6712 -23432 -16474
16782a6474L567k1626k2655l6666m011k0643K0757L5049K1467M7859j3321J7722
$$ -16474 -12907 -34533 -57188 -93854 -97865 -118508 -97751 -62702 -41235 6624 -6697 11025
16770A1025k4234n1485j3376L5194J0841M9014k1863k1392l1673k5756OJ6378
$$ 11025 -13209 -64694 -78070 -42876 -32035 16979 -4884 -26276 -57949 -83705 -83699 -67321
16758f7321K1732P656J6636L6522K2691r389k2542L5636N302R238k4339j5614
$$ -67321 -45589 -37933 -21297 15225 37916 28527 5985 41621 46923 56161 31822 16208
16746A6208k4510O1925J6615n9258J2334j9984l1241l0458N971l7908r364J4670
$$ 16208 -8302 53623 70238 10980 23314 3330 -27911 -58369 -52398 -90306 -99670 -85000
16734h5000L0039J702l0494j0562J0367J0380j856M0723N8588P2314l224J6113
$$ -85000 -54961 -53259 -83753 -94315 -83948 -73568 -75424 -34701 23887 96201 92977 109090
16722A09090O294j0120J2862j3795k3301L244J944m9891j0403J6710M419n2671
$$ 109090 115384 105264 118126 104331 81030 84274 86218 36327 25924 42634 47053 -5618
16710e618k9599k1096O3920j235l9929j4737K1227Q477N857l126K2916N0813l5209
$$ -5618 -35217 -56313 7607 6372 -33557 -48294 -27067 -18590 -12733 -15859 7057 57870 22661
16697B2661r2776r099J3105j0153j8819J0527L819L2133L4721m0311k6691O798
$$ 22661 -70115 -79214 -66109 -76262 -95081 -84554 -80735 -48602 -13881 -54192 -80883 -74085
16685g4085N0094J2800l5745J3432P7249Q452o4227l7615J3102L435J0107r997
$$ -74085 -23991 -11191 -46936 -33504 43745 52197 -12030 -49645 -36543 -33108 -23001 -32998
16673c2998l8243J9238N7861j8667p323K406o113K0092J6663r644j6911j7991
$$ -32998 -71241 -52003 5858 -12809 -20132 -17726 -23839 -3747 12916 3272 -13639 -31630
16661c1630M8721L9047r475N3847l4410m8356L4595l3550m6388m0732J3488O6022
$$ -31630 17091 56138 46663 100510 66100 17744 52339 18789 -27599 -68331 -54843 11179
16649A1179R668K4832m5095K639k4090K2651N0385j3347p296l418m779L6013J4731
$$ 11179 20847 45679 584 3223 -20867 1784 52169 38822 31526 28108 23329 59342 74073
16636G4073m0523k6171l9254J534J5617j8374J0885P4940o360p5369m4426L8762
$$ 74073 33550 7379 -31875 -30341 -14724 -33098 -22213 52727 46367 -29002 -73428 -34666
16624c4666K0940j7393N453N5341j2031j5225j2000r156k4444p025O3818K0971
$$ -34666 -13726 -31119 -25666 29675 17644 2419 -9581 -18737 -43181 -50206 13612 34583
16612C4583p840J423O835k8148l3832k5460k257m3067J8950M0475P716j2000m263
$$ 34583 26743 28166 35001 6853 -26979 -52439 -54696 -97763 -78813 -38338 -30622 -42622 -46885
16599d6885O0525j4401k6033J5970L8344J2024J590m9659l2797L6178P4880o996
$$ -46885 13640 -761 -26794 -10824 27520 39544 41134 -8525 -41322 -5144 69736 62740
16587F2740l9680l3699l9737o078J0366J0769k4689J1844P8026l6087n6223J8795
$$ 62740 23060 -10639 -50376 -56454 -46088 -35319 -60008 -48164 29862 -6225 -62448 -43653
16575d3653j5565j6089k3407L2462P9967j0024l2291l1935K3925K2421J5125K3831
$$ -43653 -59218 -75307 -98714 -66252 13715 3691 -28600 -60535 -36610 -14189 936 24767
16563B4767l9343k0555k8841M8219K7375L0127J8972k350N927k6828k3027m0255
$$ 24767 -14576 -35131 -63972 -15753 11622 41749 60721 58371 64298 37470 14443 -25812
16551b5812j5412L1533P1178l9246r1079N093L7030M474K5897L5616K9628n0743
$$ -25812 -41224 -9691 61487 22241 -68838 -63745 -26715 -22241 3656 39272 68900 18157
16539A8157j9378K3729l4583R308J660l7700K5271l6235j8921K9003M0745R779
$$ 18157 -1221 22508 -12075 -2767 -1107 -38807 -13536 -49771 -68692 -39689 1056 10835
16527A0835j6494j6984M905j4698K0797N9141m545k3801K1922J6926k2172j3293
$$ 10835 -5659 -22643 -17738 -32436 -11639 47502 42957 19156 41078 58004 35832 22539
16515B2539m6629M980M5698l5113J0037L4158P368l3690j6919j1218p833L0445
$$ 22539 -24090 -19110 26588 -8525 1512 35670 43038 9348 -7571 -18789 -26622 3823
16503C823K6476k9029m7443l1405Q937R29M8872L7658m903J9104l2213R39K7837
$$ 3823 30299 1270 -46173 -77578 -68641 -67712 -18840 18818 13915 33019 806 1745 29582
16490B9582L4037k4964l5689l589M4018r4020n3902m9410J852N4032N3291L2615
$$ 29582 63619 38655 2966 -623 43395 -50625 -104527 -153937 -152085 -98053 -44762 -12147
16478a2147N2945J3924j8667k6679m7702j5321J9541j5534l996l3104J0482o800
$$ -12147 40798 54722 36055 9376 -38326 -53647 -34106 -49640 -53636 -86740 -76258 -83058
16466h3058O4643K8314l3565J6997K9235J1628j6331j850J7250l5436j2140K2218
$$ -83058 -18415 9899 -23666 -6669 22566 34194 17863 16013 33263 -2173 -14313 7905
16454G905o3336J2174L7143p145K141K5729O577k5132n9557P477J3514k1817k5560
$$ 7905 -55431 -43257 -6114 -13259 -11118 14611 21188 -3944 -63501 -56024 -42510 -64327 -89887
16441h9887j7184j5505J2753K2033M5534m8252l2349k6833L3150K3216N6158K6696
$$ -89887 -107071 -122576 -109823 -87790 -42256 -90508 -122857 -149690 -116540 -93324 -37166 -10470
16429a0470j9638L7050j2168R970o270j01796l5429M9676J4775J0763M2291j2502
$$ -10470 -30108 6942 -5226 4744 -1526 -103322 -138751 -89075 -74300 -63537 -21246 -33748
16417c3748p7966M5135K7485K3342N5108K6260o794o5335l7312p156m7377q6460
$$ -33748 -111714 -66579 -39094 -15752 39356 65616 58822 -6513 -43825 -50981 -98358 -184818
16405a84818l0541N0328J1168j0518l391M0046P6929K2233L0785k6636p86K4109
$$ -184818 -215359 -165031 -153863 -164381 -167772 -127726 -50797 -28564 2221 -24415 -25201 -1092
16393a092R172k1207j2365k8700L1415N6835K6466m9604m820j507j9550j9026
$$ -1092 8080 -13127 -25492 -54192 -22777 34058 60524 10920 6100 4593 -14957 -33983
16381c3983O300M0644k4969L6888L607p327k0694K216K0095l0146l302k6756J5500
$$ -33983 -27683 12961 -12008 24880 28487 21160 466 2682 22777 -7369 -10671 -37427 -21927
16368b1927O345j8177J2357J4398N5079K0357l3938J0470J9328m0992l2331L5503
$$ -21927 -15582 -33759 -21402 -7004 48075 68432 34494 44964 64292 23300 -9031 26472
16356B6472l2983j6301j3413k6984n9855K1724M2694K4462J3971J2371K2569j019
$$ 26472 -6511 -22812 -36225 -63209 -123064 -101340 -58646 -34184 -20213 -7842 14727 13708
16344A3708k7715o0296J2895N9999J8972n1173k9214K0263l7116J1411L8197N3521
$$ 13708 -14007 -74303 -61408 -1409 17563 -33610 -62824 -42561 -79677 -68266 -30069 23452
16332B3452K790o1368J124M3886M5026j4632n734m4693m6472k2086N8654k496
$$ 23452 26242 -35126 -34002 9884 54910 40278 34544 -10149 -56621 -78707 -20053 -22549
16320b2549l3004p338J6842K2379M5615J991p6109J8614j0909K1334K736O072
$$ -22549 -55553 -62891 -46049 -23670 21945 23936 -52173 -33559 -44468 -23134 -20398 -14326
16308a4326m8607N715l6535k4615P2484M2994k1241j8339o1282L3244J01557K350
$$ -14326 -62933 -57218 -93753 -118368 -45884 -2890 -24131 -42470 -103752 -70508 31049 33399
16296C3399j3428p496k8992j6015J4587Q068n9005m4827R3189R9411l0729q6870
$$ 33399 19971 12475 -16517 -32532 -17945 -9877 -68882 -113709 -20520 78891 48162 -38708
16284c8708j9069K2069O9321m3907q170R065P923r228l1091m3901K1365K1327
$$ -38708 -57777 -35708 33613 -10294 -18464 -9399 -1476 -10704 -41795 -85696 -64331 -43004
16272d3004k85j9435k7161o2952O8265P8589L1768O7708l029l2220L585k095j9672
$$ -43004 -43289 -62724 -89885 -152837 -84572 -5983 25785 93493 90464 58244 61829 59734 40062
16259D0062m363l3394n8099J372O1490j3670k292n0636k4645K9412J6040J8730
$$ 40062 35699 2305 -55794 -54422 7068 -6602 -8894 -59530 -84175 -54763 -38723 -19993
16247a9993J446j1668j3084O867l7677J472K7401Q1100L37K2203N2027j3239p2536
$$ -19993 -18547 -30215 -43299 -36432 -74109 -72637 -45236 35864 36201 58404 110431 97192 24656
16234B4656k6166k9791k5512N0131l1856P92J0793q547M5077K6918J0116p848
$$ 24656 -1510 -31301 -56813 -6682 -38538 -37746 -26953 -35500 9577 36495 46611 38763
16222C8763j9370j3418K2775P352K7523j0575J1721j0213k5783l1943r422j689
$$ 38763 19393 5975 28750 36102 63625 53050 64771 54558 28775 -3168 -12590 -14279
16210a4279M877j6803k3990k2092l547O665L8753m3936j5591J3386L4742L7503
$$ -14279 -9402 -26205 -50195 -72287 -75834 -69169 -30416 -74352 -89943 -76557 -41815 -4312
16198d312m52l7782l8259L5070L6884K9895m7747n628j8487k133M3239k4203j6506
$$ -4312 -4764 -42546 -80805 -45735 -8851 21044 -26703 -32331 -50818 -52951 -9712 -33915 -50421
16185e0421L1012m5115K0960O6850M5364j825m0932m2128j7562J2865n4380l1204
$$ -50421 -19409 -64524 -43564 23286 68650 66825 25893 -16235 -33797 -20932 -75312 -106516
16173a06516j2903l5399N0535O0902K4855k5597o74L001k145q430n622m5738j9150
$$ -106516 -119419 -154818 -104283 -43381 -18526 -44123 -44797 -41796 -43941 -52371 -57993 -103731 -122881
16160a22881M6268L7079m173n7701j8838k555J3448K4957M5155J4220n5644k5356
$$ -122881 -76613 -39534 -43707 -101408 -120246 -122801 -109353 -84396 -39241 -25021 -80665 -106021
16148a06021L8025l0680j9437L7901J0673l7247K3846O0752K7545j0314p5832
$$ -106021 -67996 -98676 -118113 -80212 -69539 -106786 -82940 -22188 5357 -4957 -80789
16137h0789P907L7595l0428j1820O8201O9716L7718L3606p2752k8443M8O742k9390
$$ -80789 -72882 -35287 -65715 -77535 -9334 60382 98100 131706 58954 30511 30559 37301 7911
16124G911m4127j1518L1557k645J5565m639m576j7733K0254M0777K8171n0644
$$ 7911 -36216 -47734 -16177 -18822 -3257 -7896 -12472 -30205 -9951 30826 58997 8353
16112H353K9748P114n4552M948R240k3699j2999P927L5926j473j6933J7345k9396
$$ 8353 38101 45215 -9337 -4389 4851 -18848 -31847 -23920 12006 10533 -6400 10945 -18451
16099a8451l6796M000K5076J9997k3698K0074K1382j6732L6995l392l8269l8889
$$ -18451 -55247 -51247 -26171 -6174 -29872 -9798 11584 -5148 31847 28455 -9814 -48703
16087d8703J7042M9541J0246L299k7653p8645k4859K1898j6683L9430M5750j1413
$$ -48703 -31661 17880 28126 31425 3772 -74873 -99732 -77834 -94517 -55087 -9337 -20750
16075b0750j5540N5106K7698l6731J1560n2441m6984m8496J6581L6893o463l0993
$$ -20750 -36290 18816 46514 9783 21343 -31098 -78082 -126578 -109997 -73104 -79567 -110560
16063a10560j7232L31L0038J6765l5594K1911J7762p506M9849r266k2318K3778
$$ -110560 -127792 -127461 -97423 -80658 -116252 -94341 -76579 -84085 -34236 -43502 -65820 -42042
16051d2042P075K3661O339M8757j6736j2163l2303m0737k6587j6180J534O0699
$$ -42042 -34967 -11306 -4967 43790 27054 14891 -17412 -58149 -84736 -100916 -99382 -38683
16039c8683L4395j5187L367K3624q8838p224o331M039K3463J9083K4384j2645
$$ -38683 -4288 -19475 -16108 7516 -81322 -88546 -94877 -90838 -67375 -48292 -23908 -36553
16027c6553J8835J7911m2183l8561J4432k9272J7596K5795N4487j6084k2432L0905
$$ -36553 -17718 193 -41990 -80551 -66119 -95391 -77795 -52000 2487 -13597 -36029 -5124
16015e124Q809M637L9669K6821m52J1077l1128p6157l7929O787K7931M6484p17
$$ -5124 3685 8322 47991 74812 74360 85437 54309 -21848 -59777 -52990 -25059 21425 20708
16002B0708K4793L3716j7112n9141l5136j2388l970N578k1085L6160K5026N553
$$ 20708 45501 79217 62105 2964 -32172 -44560 -48530 -42952 -64037 -27877 -2851 2702
15990B702m2687o5463j6761N4953K2161J1394J7202R47j2626j5039K9246J3532
$$ 2702 -39985 -105448 -122209 -67256 -45095 -33701 -16499 -15552 -28178 -43217 -13971 -439
15978d39K9171q2257l8482K9165j5328l6178O519N2078L3263P749N804Q6116K9487
$$ -439 28732 -53525 -92007 -62842 -78170 -114348 -107829 -55751 -22488 -14739 -8935 77181 106668
15965A06668n4569n6040K9056K5444j6679n0066l2082N062K5183J3613k0253o04
$$ 106668 52099 -3941 25115 50559 33880 -16186 -48268 -43206 -18023 -4410 -24663 -25267
15953b5267n449q129J4361L4019L8588l4555J7974J3203l5912l0172j2107J375
$$ -25267 -30716 -38845 -24484 9535 48123 13568 31542 44745 8833 -21339 -33446 -32071
15941c2071M119J9245J8562N360K6805M952K9507k8593n1359j5023J1596K0355
$$ -32071 -27952 -8707 9855 15215 42020 46972 76479 47886 -3473 -18496 -6900 13455
15929A3455j8962J0042j0592J3056P697k9401J5920N4669k2175l1888k2925j6595
$$ 13455 -5507 4535 -6057 6999 14696 -14705 1215 55884 33709 1821 -21104 -37699
15917c7699N2570P881o6838l3616K8999R152P311j0968o48M3944J5066j7286q5837
$$ -37699 14871 22752 -44086 -77702 -48703 -39551 -32240 -43208 -43856 88 15154 -2132 -87969
15904h7969m94K0691r000M0974Q99J6350l2845k0268O597M8850M6214k6903K3592
$$ -87969 -88463 -67772 -76772 -35798 -34899 -18549 -51394 -71662 -65065 -16215 29999 3096 26688
15891B6688J6522j9258k7203J2704L5138J8316l1859l1243L3010j0563l4318j5598
$$ 26688 43210 23952 -3251 9453 44591 62907 31048 -195 32815 22252 -12066 -27664
15879b7664n4363k4166L1546N5829j2600o7531m3607R605O1683k0163l5725K9219
$$ -27664 -82027 -106193 -74647 -18818 -31418 -98949 -142556 -132951 -71268 -91431 -127156 -97937
15867i7937j4291K7242L4492n344M4344O515p2368l7324K1104O7989M30n0437
$$ -97937 -112228 -84986 -50494 -55838 -11494 -4979 -77347 -114671 -93567 -25578 -25148 -75585
15855g5585Q447n827k4946p567Q867j5670L4109K4154M8485j9769l1039J9934
$$ -75585 -67138 -72965 -97911 -105478 -96611 -112281 -78172 -54018 -5533 -25302 -56341 -36407
15843c6407k2209l0715m0277n0089O1117J14156L4827l2572o3564J6283m6017
$$ -36407 -58616 -89331 -129608 -179697 -118580 -4424 30403 -2169 -65733 -49450 -95467
15832i5467J4517M3716j1621n9378M6369O3700M6597r932p9076m3146m0914M598
$$ -95467 -80950 -37234 -48855 -108233 -61864 1836 48433 38501 -40575 -83721 -124635 -120037
15820a20037P2941O9412J7547J8515q166j3918L2183n9870k8878r5210k7975M0843
$$ -120037 -47096 22316 39863 58378 50212 36294 68477 8607 -20271 -115481 -143456 -102613
15808a02613J6307N096N0769K0979l7058O920q33j2894m2977k941L0194O0805
$$ -102613 -86306 -81210 -30441 -9462 -46520 -39600 -40433 -53327 -96304 -99245 -69051 -8246
15796h246J5992R054N3612l2352o3116k7471n802J4424J5633Q9861p034k7965
$$ -8246 7746 16800 70412 38060 -25056 -52527 -58329 -43905 -28272 61589 54555 26590
15784B6590M4580m3841m0969k3324n379L8807o688j7159l313j496J6067K8099
$$ 26590 71170 27329 -13640 -36964 -42343 -3536 -10224 -27383 -30696 -32192 -16125 11974
15772A1974n6332l3899m5104N0964N8205P722j0294O8530J6226p4792m4589n1984
$$ 11974 -44358 -78257 -123361 -72397 -14192 -6470 -16764 51766 67992 -6800 -51389 -103373
15760a03373J8009J228Q426J4073M526K9252n7667R46J9900P614K9323l3575k6356
$$ -103373 -85364 -84136 -75710 -61637 -57111 -27859 -85526 -84580 -64680 -57066 -27743 -61318 -87674
15747h7674L204k4938K8899P9776N0206K1286k7139m1779l3762L2347R11p0730
$$ -87674 -84470 -109408 -80509 -733 49473 70759 43620 1841 -31921 426 1337 -69393
15735f9393m9965N2943M4380J8231m4516R675J7814K4222p633K3803J4526K4536
$$ -69393 -119358 -66415 -22035 -3804 -48320 -38645 -20831 3391 -4242 19561 34087 58623
15723E8623m010p0381k641o481l0539l3016O5059J6763m0796J2427K5328j3653
$$ 58623 54613 -15768 -18409 -24890 -55429 -88445 -23386 -6623 -47419 -34992 -9664 -23317
15711b3317r956M6020k98j0004M265j8894j5353R818m90K3328j154O952N2627
$$ -23317 -33273 12747 12449 2445 6710 -12184 -27537 -17719 -18209 5119 3965 10917 63544
15698F3544L7105k7943o134j6505j7480k2776J2733n5618m8641J8044O5817K5871
$$ 63544 100649 72706 66572 50067 32587 9811 22544 -33074 -81715 -63671 2146 28017
15686B8017o7667r180k1888L9210K8470n1880J6737J7980R1119M9611l770o3319
$$ 28017 -39650 -48830 -70718 -31508 -3038 -54918 -38181 -20201 70918 120529 116759 53440
15674E3440j3217L7249r0301j3637K6351l7821M4400j9138m9279R545J5064P421
$$ 53440 40223 77472 -12829 -26466 -115 -37936 6464 -12674 -61953 -52408 -37344 -29923
15662b9923k3585M572k1599j1225k6033j8659M4436N1114L7651p254q122K6418
$$ -29923 -53508 -48936 -70535 -81760 -107793 -126452 -82016 -30902 6749 -505 -8627 17791
15650A7791P101k6k3857q984j3721o83K6523M3498L034k1039o1727k6459N1551
$$ 17791 24892 24866 1009 -7975 -21696 -22379 4144 47642 50676 29637 -32090 -58549 -6998
15637f998K7118O3047l886n1329J0610M3753q0818K9596K4286k8346o5227J1145
$$ -6998 20120 83167 79281 27952 38562 82315 1497 31093 55379 27033 -38194 -27049
15625b7049j4546k365k142l7158l270N3650J7661K3006n0820k8878j2896m043
$$ -27049 -41595 -43960 -46102 -83260 -86530 -32880 -15219 7787 -43033 -71911 -84807 -88850
15613h8850L8063J0269O786Q3860K4329o0454o3262k3498l0134k8132O3315J7928
$$ -88850 -50787 -40518 -33732 50128 74457 14003 -49259 -72757 -102891 -131023 -67708 -49780
15601d9780k4218J6370J5372k547p550K7845L8290n878L1038K5222Q585l0780
$$ -49780 -73998 -57628 -42256 -44803 -52353 -24508 13782 7904 38942 64164 72749 41969
15589D1969j3771j0764J4110J9259j1044l919m1519k2597n7545l5290o315Q457
$$ 41969 28198 17434 31544 50803 39759 35840 -5679 -28276 -85821 -121111 -127426 -118969
15577a18969L9417P6937M6836m2179j9756O1262k1521n1524N2208M6210J1296
$$ -118969 -79552 -2615 44221 2042 -17714 43548 22027 -29497 22711 68921 80217
15566H0217m9339J7746L2736q8850q6081j3901P6003O1548M4437k6902k5603q806
$$ 80217 30878 48624 81360 -7490 -93571 -107472 -31469 30079 74516 47614 22011 13205
15554A3205J228L9645p871K669N278p2075j4671K7796l373m1973O33J6217o2883
$$ 13205 14433 54078 46207 48876 54154 -17921 -32592 -4796 -8169 -50142 -49509 -33292 -96175
15541i6175J7259N7406J3435k7841l6013M6250M8918l2704o9605r463M7867J8962
$$ -96175 -78916 -21510 -8075 -35916 -71929 -25679 23239 -9465 -79070 -88533 -40666 -21704
15529b1704L5686m232M326m952j9352k6567R979j5775m20M1981K9359m127l6256
$$ -21704 13982 9750 14076 9124 -10228 -36795 -26816 -42591 -43011 -1030 28329 24202 -12054
15516a2054K3956R963l699L2015j8774k8367J2299J4432n376k6301j1013k0210
$$ -12054 11902 21865 18166 50181 31407 3040 15339 29771 24395 -1906 -12919 -33129
15504c3129N7604j93r347m2199p2714P753K8870N1240O7099L0414j0971K4982
$$ -33129 24475 24282 14935 -27264 -99978 -92225 -63355 -12115 54984 85398 74427 99409
15492I9409J0044k0967m3634o8243M1785M3793l5592j5595j6214l36n3063N160
$$ 99409 109453 88486 44852 -23391 18394 62187 26595 11000 -5214 -5550 -58613 -53453
15480e3453p5719M3633M6706L21j0187M6099O6457J273j0295O260K277o08p0158
$$ -53453 -129172 -85539 -38833 -38512 -48699 -2600 63857 65130 54835 61095 63372 62764 -7394
15467g394K241J2697j2972K3001O51m9860r119M3142N4856Q319q501k0838l3372
$$ -7394 -5153 7544 -5428 17573 18224 -31636 -40755 2387 57243 65562 57061 36223 2851
15454B851k390o514J2770L1277J8255k6887J9434P299j1590o1502m2356j963l2469
$$ 2851 461 -6053 6717 37994 56249 29362 48796 56095 44505 -16997 -59353 -61316 -93785
15441i3785O8551P238J4266J3032j504k2531m503J7612L2047j9631j5557k1343
$$ -93785 -25234 -17996 -3730 9302 7798 -14733 -19236 -1624 30423 10792 -4765 -26108
15429b6108Q355n5388K2825r730k8432n403L7182K9736Q530l2491J799K638l4282
$$ -26108 -17753 -73141 -50316 -60046 -88478 -93881 -56699 -26963 -18433 -50924 -49125 -46487 -80769
15416h0769j4745K7979N8656K625m345k3513J9324K3370M432m8072L4558N5397
$$ -80769 -95514 -67535 -8879 -6254 -10599 -34112 -14788 8582 13014 -35058 -500 54897
15404E4897k9091n2781l2821N001L556M7012k2176n948O10P828L8315j0890k2447
$$ 54897 25806 -26975 -59796 -54795 -51239 -4227 -26403 -32351 -31741 -23913 14402 3512 -18935
15391a8935J0497O229J6465N0731Q9M0953R444o1671p7729n3467L7188L5689K5960
$$ -18935 -8438 -2209 14256 64987 65076 106029 115473 53802 -23927 -77394 -40206 -4517 21443
15378B1443P969m7133j7170K6202N577L2975k1438j188L655j5921J0681K6705
$$ 21443 29412 -17721 -34891 -8689 -3112 29863 8425 7237 10892 -5029 5652 32357
15366C2357o2083n2163J8928M2222N9785j902n2601m5248N503M9801K4359n007
$$ 32357 -29726 -81889 -62961 -20739 39046 37144 -15457 -60705 -55202 -5401 18958 13951
15354A3951m2001k0494M5581J7712k6472m4380j66N829l7347o3597M2628N9712
$$ 13951 -28050 -48544 -2963 14749 -11723 -56103 -56269 -50440 -87787 -151384 -108756 -49044
15342d9044j0152j2294O1395M492k9785J0262K8848N0449L742p397j4078Q484
$$ -49044 -59196 -71490 -10095 -5603 -35388 -25126 3722 54171 57913 50516 36438 44922
15330D4922m6929l0637M1104P0426M6201q683l9708o1902k7792m515l5584l1784
$$ 44922 -2007 -32644 8460 78886 125087 116404 76696 14794 -12998 -17513 -53097 -84881
15318h4881O3355M1320r07l3235R638j5935l7080K8346M5261l45l7466M2145L2673
$$ -84881 -21526 19794 18887 -14348 -4710 -20645 -57725 -29379 15882 15537 -21929 20216 52889
15305E2889n9464n8993r541L3560R0552r248n6491k3181m3221J9812M1822N649
$$ 52889 -6575 -65568 -75109 -41549 49003 39755 -16736 -39917 -83138 -63326 -21504 -15855
15293a5855L3172O8349m3367q010l6893l5166m0114k1151M4682P1949Q077o6990
$$ -15855 17317 85666 42299 34289 -2604 -37770 -77884 -99035 -54353 17596 25673 -41317
15281d1317L528k350K9031P3878k8260j9869J5690m6887j2401n0997M1493M9820
$$ -41317 -37789 -40139 -11108 62770 34510 14641 30331 -16556 -28957 -79954 -38461 11359
15269A1359k0442N1411m2402J5071k07k9948J7858O2908o5985n9809j2731n938
$$ 11359 -9083 42328 -74 14997 14790 -15158 2700 65608 -377 -60186 -72917 -78855
15257g8855R425K3499M4262J5041j587p875l2442j1794M335J762j3377k1676l4903
$$ -78855 -69430 -45931 -1669 13372 11785 3910 -28532 -40326 -35991 -34229 -47606 -69282 -104185
15244a04185M1305M0849J8709J4112m047m7480l6434J0460j58J2015K7197M0616
$$ -104185 -62880 -22031 -3322 10790 6743 -40737 -77171 -66711 -66869 -54854 -27657 12959
15232A2959l13k879j7198M923k7088k2341J2890J5193O474l0994L3799L23j8897
$$ 12959 12646 9767 -7431 -2508 -29596 -51937 -39047 -23854 -17380 -48374 -14575 -14252 -33149
15219c3149k3901M5239N9253k052k678q203o9827L579N0200Q048k1601q9910N88
$$ -33149 -57050 -11811 47442 45390 42712 34509 -35318 -31739 18461 26509 4908 -85002 -84414
15206h4414N7649J4350j7933k5414j8863J4593M5338k3856M871p525M1524j0956
$$ -84414 -26765 -12415 -30348 -55762 -74625 -60032 -14694 -38550 -33679 -41204 320 -10636
15194a0636O855k688q233j119N2172m774J3752j5496j6006o1063k3864k0387j4341
$$ -10636 -3781 -6469 -14702 -15821 36351 31577 45329 29833 13827 -47236 -71100 -91487 -105828
15181a05828K4583N3008K7132l3928K6512K8285p0533L766l112o468r709L8437
$$ -105828 -81245 -28237 -1105 -35033 -8521 19764 -50769 -47003 -50115 -56583 -66292 -27855
15169b7855M6512J7320r904K451k3155l0929o8096M8755K9467p0126l3311J4498
$$ -27855 18657 35977 26073 28524 5369 -25560 -93656 -44901 -15434 -85560 -118871 -104373
15157a04373L2697M7391M2131k7156n4679K7623J4482j3094j9259O3796J8026
$$ -104373 -71676 -24285 17846 -9310 -63989 -36366 -21884 -34978 -54237 9559 27585
15146B7585m7730n8635l112L5806K4334j1252K094K6073L3327n247n7976L4743
$$ 27585 -20145 -78780 -81892 -46086 -21752 -33004 -30910 -4837 28490 23243 -34733 10
15134A0j3110l9881O6905M3477K468K716J8783K006p4592j05275j0899L7949J0955
$$ 10 -13100 -52981 13924 57401 59869 62585 81368 83374 8782 -96493 -107392 -69443 -58488
15121e8488P2997R622l7147j9252K4379k4153M8m1133K2405M3234k8893j3399
$$ -58488 14509 24131 -13016 -32268 -7889 -32042 -31994 -73127 -50722 -7488 -36381 -49780
15109d9780L6133j5048q817Q540K8673L3628k5467K2719j6544k8344j7653k6561
$$ -49780 -13647 -28695 -37512 -28972 -299 33329 7862 30581 14037 -14307 -31960 -58521
15097e8521M0829P2086O5446p556r8229j1597J7042J4576r156j2025M097l2598
$$ -58521 -17692 54394 119840 112284 14055 2458 19500 34076 24920 12895 16992 -15606
15085a5606k3046j9099R762K5971J7319R572j6252l0791K4986L9025k0310p6755
$$ -15606 -38652 -57751 -47989 -22018 -4699 4873 -11379 -42170 -17184 21841 1531 -75224
15073g5224O1683Q1286J2321k6147o746l8316l7288R454K7331j1936Q138K3016
$$ -75224 -13541 67745 80066 53919 47173 8857 -28431 -18977 8354 -3582 4556 27572
15061B7572m5641m0459k6388j2902N1631M4870p882L9811p317j1973j8662o7389
$$ 27572 -18069 -58528 -84916 -97818 -46187 -1317 -9199 30612 23295 11322 -7340 -74729
15049g4729p786l1716l3811N6432M8258j4332L6976j264j1101j4817j210L4407
$$ -74729 -82515 -114231 -148042 -91610 -43352 -57684 -20708 -21972 -33073 -47890 -49100 -14693
15037a4693k618m2402N2523N0227l5088m8552q0374n5826K4563N4792K3809N5808
$$ -14693 -17311 -59713 -7190 43037 7949 -40603 -120977 -176803 -152240 -97448 -73639 -17831
15025a7831Q2178k8319l7727p79P673j9597l3570R587k7710J7520m082P4273L685
$$ -17831 64347 36028 -1699 -2478 5195 -14402 -47972 -38385 -66095 -48575 -52657 21616 25301
15012B5301n652L7697K3767n2656m8326k4474J7466j275p900K6155L5986J3115
$$ 25301 19649 57346 81113 28457 -19869 -44343 -26877 -28152 -36052 -9897 26089 39204
15000C9204m3600k3452o427O4335J2651L6111n539l7458q738l5412M110n6737
$$ 39204 -4396 -27848 -34275 30060 42711 78822 73283 35825 27087 -8325 -4215 -60952
14988f0952p8533K1643J03594J4878n24L870o6698m227j011J8873O1472P283m4968
$$ -60952 -139485 -117842 -14248 630 106 3976 -62722 -66949 -67960 -49087 12385 19668 -25300
14975b5300j6267j0940P4047M2520L7740l4231n5411k9460L400Q7659K814q6699
$$ -25300 -41567 -52507 21540 64060 101800 67569 12158 -17302 -13902 73757 76571 -10128
14963a0128n6975o189K7373M1871K3575m323j6414K7180N9030o8588q7132M6180
$$ -10128 -67103 -73292 -45919 -4048 19527 15204 -1210 25970 85000 16412 -70720 -24540
14951b4540L3509k2740J6159L4269k5129p1915j2304J960J297k2252k4527j8989
$$ -24540 8969 -13771 2388 36657 11528 -60387 -72691 -70731 -69434 -91686 -116213 -135202
14939a35202j0513M0735K514K7087O9252j4232k7870L9526k4355k8283M06k4082
$$ -135202 -145715 -104980 -102466 -75379 -6127 -20359 -48229 -8703 -33058 -61341 -60935 -85017
14927h5017K8508K4674l3910J8722O221K3990L9699l4067O46j1671l5466K0373
$$ -85017 -56509 -31835 -65745 -47023 -40802 -16812 22887 -11180 -10534 -22205 -57671 -37298
14915c7298J6327K2576l1276L8122J0823j5773r893P242Q199J0127O7882j3157
$$ -37298 -20971 1605 -29671 8451 19274 3501 -6392 850 9049 19176 87058 73901
14903G3901m5135N0983N7615J153j2629m4492m9474p7162J6649N4517L7837N5341
$$ 73901 28766 79749 137364 138517 125888 81396 31922 -45240 -28591 25926 63763 119104
14891A19104J8595n3011K39j8887k997m1272n6524k2052j4293k3467M0439j1930
$$ 119104 137699 84688 84927 66040 63043 21771 -34753 -56805 -71098 -94565 -54126 -66056
14879f6056J6261k6118j8831j099K3816K6555O1787o45n8600j3544O2425K3175
$$ -66056 -49795 -75913 -94744 -95843 -72027 -45472 16315 15670 -42930 -56474 5951 29126
14867B9126m5805K8848k0940j3613j0545M5953L9761m3827k5357J5311l086l0864
$$ 29126 -16679 12169 -8771 -22384 -32929 13024 52785 8958 -16399 -1088 -4174 -35038
14855c5038J4553j5176L9581j3916m1846Q086j0072n0460j4053r49R6688N5807
$$ -35038 -20485 -35661 3920 -9996 -51842 -43756 -53828 -104288 -118341 -119290 -22602 33205
14843C3205n8319k4476o935K7443N8881K861q0070o1110l4660K6311Q6046L2117
$$ 33205 -25114 -49590 -56525 -29082 29799 32660 -47410 -108520 -143180 -116869 -30823 1294
14831A294L7574K0037K8259n5057p8909N676M0827j4754j9034k7195L3297K5548
$$ 1294 38868 58905 87164 32107 -46802 -41126 -299 -15053 -34087 -61282 -27985 -2437
14819b437J5669k0943J4293l7161J8205Q101k506J9840J9590k9841j6792j3787
$$ -2437 13232 -7711 6582 -30579 -12374 -4273 -6779 13061 32651 2810 -13982 -27769
14807b7769K734L510J6131K2811k1797j0256o1988j1824K0879O7888P7K3544l890
$$ -27769 -25035 -21525 -5394 17417 -4380 -14636 -76624 -88448 -67569 319 396 23940 20050
14794B0050M643L9180K5194k1016j9967m2236L8723R479n4584J6757J7747k7618
$$ 20050 24693 63873 89067 68051 48084 5848 44571 54050 -534 16223 33970 6352
14782F352k1420K3402J2438K8135j6200k421j8600l1004n543n926k2063J2079
$$ 6352 -15068 8334 20772 48907 32707 30286 11686 -19318 -24861 -30787 -52850 -40771
14770d0771K3619M9476L4675K3153j4755l9334N6959K6675l6272n3002j755K5051
$$ -40771 -17152 32324 66999 90152 75397 36063 93022 119697 83425 30423 28668 53719
14758E3719K8196k7557l0705m231J0623L750m2000l1755K4948Q4248Q1953P249
$$ 53719 81915 54358 23653 19422 30045 33795 -8205 -39960 -15012 69236 151189 158438
14746A58438m1734m7457m5453m8030J3774M7044n1952L434N8473Q099k5286L458
$$ 158438 116704 69247 23794 -24236 -10462 36582 -15370 -11936 46537 54636 29350 32808
14734C2808N468L2028R129l5606r7936L5728M0707j9896M6597L8841m7396k2148
$$ 32808 38276 70304 79433 43827 -54109 -18381 22326 2430 49027 87868 40472 18324
14722A8324K8733M1112p809m5340j007l6255l7505k7535J7849R7738K4458m0116
$$ 18324 47057 88169 80360 35020 34013 -2242 -39747 -67282 -49433 48305 72763 32647
14710C2647n6902m0712L2190l607n0591O2745K284m6733N565K1261L6716K8475
$$ 32647 -24255 -64967 -32777 -36384 -86975 -24230 -21946 -68679 -63114 -41853 -5137 23338
14698B3338N7499m5448K385J1729j6343k0330j5319l9157r532L3660l634J4651
$$ 23338 80837 35389 37774 49503 33160 12830 -2489 -41646 -51178 -17518 -21152 -6501
14686f501K8443K0411n8376l3991N2204k0271m0176O4264L0421N217m4230l9122
$$ -6501 21942 42353 -16023 -50014 2190 -18081 -58257 6007 36428 41645 -2585 -41707
14674d1707R034M0021l2713l612N6115j2332l7196K939L2123M2523K3964k3978
$$ -41707 -32673 7348 -25365 -28977 27138 14806 -22390 -19451 12672 55195 79159 55181
14662E5181l0368O2402J1141l8782k0905K0314l6766l9544j3471N8604P0533O889
$$ 55181 24813 87215 98356 59574 38669 58983 22217 -17327 -30798 27806 98339 105228
14650A05228n86k1880k4713o2561n3738N3647K7410L9590L2219m105m1542n6530
$$ 105228 104642 82762 58049 -4512 -58250 -4603 22807 62397 94616 90511 48969 -7561
14638g561K267J5053L3393L0871J3028j8488j3040o4560k907J7734J241J97j1567
$$ -7561 -5294 9759 43152 74023 87051 68563 55523 -9037 -11944 5790 7031 7228 -4339
14625d339r941k138k777n77r651J8515J6229r702J2580q167k124m237j5m4892
$$ -4339 -14280 -16418 -19195 -19772 -29423 -10908 5321 -4381 8199 32 -2092 -6329 -6344 -51236
14611e1236K7556Q5675P7411l4023q8801k437M6845O3594k5345o2581r2619j5669
$$ -51236 -23680 61995 139406 105383 16582 14145 60990 124584 99239 36658 -55961 -71630
14599g1630K0625L2110k408j9299N5897O2090j7336J343L386J1169m7670o7349
$$ -71630 -51005 -18895 -21303 -40602 15295 77385 60049 61392 64778 75947 28277 -39072
14587c9072n0944L359p074j0346l2987K525M2139P1685R314n9207m8394l1154
$$ -39072 -90016 -86657 -93731 -104077 -137064 -134539 -92400 -20715 -11401 -70608 -119002 -150156
14575a50156K5858O007K8651Q6454N9931J758p3646l311N4689k228l6496l0309
$$ -150156 -124298 -118291 -89640 -3186 56745 58503 -15143 -18454 36235 34007 -2489 -32798
14563c2798k1327r149P586O232J0649J911K516O3504L1724m2829m6136P212J9337
$$ -32798 -54125 -63274 -55688 -49456 -38807 -36896 -34380 29124 60848 18019 -28117 -20905 -1568
14550a568j0295j6299m4090L0746J5293M4093L8412J1829l8895j5304L6354J453
$$ -1568 -11863 -28162 -72252 -41506 -26213 17880 56292 68121 29226 13922 50276 51729
14538E1729m6436K3880M508K4213O1103K661l648m1050L012l3469n1077K6312
$$ 51729 5293 29173 33681 57894 118997 121658 118010 76960 79972 46503 -4574 21738
14526B1738K7865j5406K9381p256l1735K646J4568j5522j1756L4533l7531l9297
$$ 21738 49603 34197 63578 56322 24587 27233 41801 26279 14523 49056 11525 -27772
14514b7772K0095P983j8883K8019j501p2871n7825J3656M6921M9923j6394m6118
$$ -27772 -7677 306 -18577 9442 7941 -64930 -122755 -109099 -62178 -12255 -28649 -74767
14502g4767l520j5461L2153L6108J4083m6058R874M1966j5048l2264J4287k9011
$$ -74767 -78287 -93748 -61595 -25487 -11404 -57462 -47588 -5622 -20670 -52934 -38647 -67658
14490f7658j4993K4783J6212L7494j27k6027j5461K1943o0280N531j0736L8994
$$ -67658 -82651 -57868 -41656 -4162 -4289 -30316 -45777 -23834 -84114 -78583 -89319 -50325
14478e0325N4034o914j4182J0680K418L5198M4500j7670k525N150m7817J1680
$$ -50325 3709 -3205 -17387 -6707 -4289 30909 75409 57739 55214 60364 12547 24227
14466B4227p440J8334n0512o5949O230N3099K4250j2530j5507K7461j1974K1359
$$ 24227 16787 35121 -15391 -81340 -75110 -22011 2239 -10291 -25798 1663 -10311 11048
14454A1048k2515m1728J1336L5586j2700K7104O7711l8453l3557k1384j0410k3187
$$ 11048 -11467 -53195 -41859 -6273 -18973 8131 75842 37389 3832 -17552 -27962 -51149
14442e1149n1405q643K8284Q2597K5357L0108K0073j0409L032l3764m789J4148
$$ -51149 -102554 -111197 -82913 -316 25041 55149 75222 64813 67845 34081 29292 43440
14430D3440J9546l0185n6974l1161J6532O0464r23J1134k8451p985K3607k991
$$ 43440 62986 32801 -24173 -55334 -38802 21662 20739 31873 3422 -4563 19044 16053
14418A6053J1081K6536o9673m9018K5108q61Q966L0609j8567m1279j2850j2070
$$ 16053 27134 53670 -16003 -65021 -39913 -40774 -31808 -1199 -19766 -61045 -73895 -85965
14406h5965N6737k3724k5613P8170J8541r952j1343J0653o429l4547k7227n9516
$$ -85965 -29228 -52952 -78565 -395 18146 8194 -3149 7504 1075 -33472 -60699 -120215
14394a20215k1848O1694O4121L7249J3870j2270k9809j2688K9179p411j8178L0506
$$ -120215 -142063 -80369 -16248 21001 34871 22601 -7208 -19896 9283 1872 -16306 14200
14382A4200L2752L8420O744N866m5235J1655J6885r2305n4267P696N1928J7776
$$ 14200 46952 85372 92116 97982 52747 64402 81287 -11018 -65285 -57589 -5661 12115
14370A2115p57J8309n6823l251n129J5323L1028L5326L6646o537l2766K0391J6707
$$ 12115 11358 29667 -27156 -30407 -35536 -20213 10815 46141 82787 76250 43484 63875 80582
14357H0582k9687k1160j4298m2502J4603j4990K7645m447P3L5953m0222J3042
$$ 80582 50895 29735 15437 -27065 -12462 -27452 193 -4254 -4181 31772 -8450 4592
14345D592J4565k9053q243J3967k3604J2196P245j42R039M1719j2644L7445M9008
$$ 4592 19157 -9896 -18139 -4172 -27776 -15580 -8335 -8477 562 42281 29637 67082 116090
14332A16090m9430l6850Q33L7325J9877j0708n0196j6464m5132j7384o298K3950
$$ 116090 66660 29810 30643 67968 87845 77137 26941 10477 -34655 -52039 -58337 -34387
14320c4387J3621K1017l4291J1143M0715r293R827Q2691j377q8728j4575K5618
$$ -34387 -20766 251 -34040 -22897 17818 8525 18352 101043 99666 10938 -3637 21981
14308B1981p1094J2620N3425M497m511L3577k4764l3209k3973R4655M0599l3590
$$ 21981 -49113 -36493 16932 21429 16918 50495 25731 -7478 -31451 63204 103803 70213
14296G0213L6421L6819k1347o5353q1246r852K9096K4929n7662P137J9542M741
$$ 70213 106634 143453 122106 56753 -24493 -34345 -5249 19680 -37982 -30845 -11303 -6562
14284f562K9786K4898j1053k1710J8791L0795m3702N264K130J2629M1147M019
$$ -6562 23224 48122 37069 15359 34150 64945 21243 26507 28637 41266 82413 86432
14272H6432j4592j675O622R3566L4910l4122l2789k7524n5890o7760k2P156O876
$$ 86432 71840 70165 76787 170353 205263 171141 138352 110828 54938 -12822 -12844 -5688 1188
14259A188m1912j4211K4349J3186k3449p092M3787N7090K1499k0248l5640m9443
$$ 1188 -40724 -54935 -30586 -17400 -40849 -47941 -4154 52936 74435 54187 18547 -30896
14247c0896R021L1058j6399l9097J1462n0876l7698r419J0191K4182O1637K5283
$$ -30896 -21875 9183 -7216 -46313 -34851 -85727 -123425 -132844 -122653 -98471 -36834 -11551
14235a1551j3318j944o4325j2406L4363O956J6722K6053M5234M5326K3838n798
$$ -11551 -24869 -26813 -91138 -103544 -69181 -62225 -45503 -19450 25784 71110 94948 89150
14223H9150o0451m9566L6603J9695k6978r8334j2087N6636N7752N3435j9068m8405
$$ 89150 28699 -20867 15736 35431 8453 -89881 -101968 -45332 12420 65855 46787 -1618
14211a618k7848r339L0467O1925L0500O7k3909j2378k7228k2050m6543M657J5092
$$ -1618 -29466 -38805 -8338 53587 84087 84154 60245 47867 20639 -1411 -47954 -43297 -28205
14198b8205J4453q5451k4126L2474K6744O4662k6696r924j7787k5013M945R155
$$ -28205 -13752 -99203 -123329 -90855 -64111 551 -26145 -36069 -53856 -78869 -73924 -64769
14186f4769l0262K1153K8761K6502k8604q432M079K4511M5606O865n4035n6111
$$ -64769 -95031 -73878 -45117 -18615 -47219 -55651 -51572 -27061 18545 25410 -28625 -84736
14174h4736J4879l035j7716l495J392k527P8419L4989K9308K8659j9627j8362
$$ -84736 -69857 -72892 -90608 -94103 -92711 -95238 -16819 18170 47478 76137 56510 38148
14162C8148j4793J1177R169M6286K3044J4643m3430n1587J794M208K1399K0069
$$ 38148 23355 34532 43701 89987 113031 127674 84244 32657 34451 38659 60058 80127
14150H0127l0573n2818m597j0140J025J4845k9422j3374k4236N87J8192L8212
$$ 80127 49554 -3264 -7861 -18001 -16976 -2131 -31553 -44927 -69163 -68576 -50384 -12172
14138a2172K5967J2229J9203j1646l2011J602K0948J2144J0167n049p326k0576
$$ -12172 13795 26024 45227 33581 1570 3172 24120 36264 46431 41382 34056 13480
14126A3480n6236k7621Q056K1536l2992j1330L4212K1884M7837l089q5986J5032
$$ 13480 -42756 -70377 -62321 -40785 -73777 -85107 -50895 -29011 18826 15737 -70249 -55217
14114e5217N0406O0313l944K7567q7010q3617N5609M0759l5972K4873M7931L4273
$$ -55217 -4811 55502 51558 79125 -7885 -91502 -35893 4866 -31106 -6233 41698 75971
14102G5971O908j1282k7553m5729j3886K1136K7573l0506l8210K3771M2505j4879
$$ 75971 82879 71597 44044 -1685 -15571 5565 33138 2632 -35578 -11807 30698 15819
14090A5819m1297K0678N1773l6830j02050j5209R751O6181P3533N436L8443l6000
$$ 15819 -25478 -4800 46973 10143 -91907 -107116 -97365 -31184 42349 47785 86228 50228
14078E0228n7611l2711J4638k4184R27L1968P061M7972j7290l8424Q947M0590
$$ 50228 -7383 -40094 -25456 -49640 -48713 -16745 -9684 38288 20998 -17426 -8479 32111
14066C2111M4753j7253m909q050j0576l2324l619r915J0343l2166p50K3413O3086
$$ 32111 76864 59611 54702 46652 36076 3752 133 -9782 561 -31605 -32355 -8942 54144
14053E4144J159k0916l9122J5728N5152m9274J2285L2376K929O123m4584p2972
$$ 54144 55303 34387 -4735 10993 66145 16871 29156 61532 64461 70584 26000 -46972
14041d6972j4402L989K5520k9282L1561j5973M232j9778m035j3613J3941M8176
$$ -46972 -61374 -57385 -31865 -61147 -29586 -45559 -41327 -61105 -65140 -78753 -64812 -16636
14029a6636J4349Q902M2121k2335J0603L911k3176j0135J9193n7238l2814M7423
$$ -16636 -2287 6615 48736 26401 37004 40915 17739 7604 26797 -30441 -63255 -15832
14017a5832J5181L3519j9242j07j5672J6929L3892k5645l079J7354J4697j3810
$$ -15832 -651 32868 13626 13519 -2153 14776 48668 23023 19944 37298 51995 38185
14005C8185m4180p876L0086K2752j5336P915m785K7352O918k3309j9604j9114
$$ 38185 -5995 -13871 16215 38967 23631 31546 26761 54113 61031 37722 18118 -996
13993i96K7480j4233o708k5723L3158L8490M43L7943p79o5930k5114J4422M928
$$ -996 26484 12251 5543 -20180 12978 51468 51911 89854 89075 23145 -1969 12453 17381
13980A7381J4889K8850k818R08j5029k9498k9493K5115n7083j4212O816J9078
$$ 17381 32270 61120 58302 59210 44181 14683 -14810 10305 -46778 -60990 -54174 -35096
13968c5096l419M9086J9098k3122K0683J9332N9394l247m0953j3714L86p798l6272
$$ -35096 -38515 10571 29669 6547 27230 46562 105956 102709 61756 48042 48428 40630 4358
13955D358K0315K3636O97l5550q7352K0999K7343J3003O4779K3267m5278l4230
$$ 4358 24673 48309 49006 13456 -73896 -52897 -25554 -12551 52228 75495 30217 -4013
13943d013j8280Q528j2414l9598l275P4535P8732M2769q401j15840p7891m2914
$$ -4013 -22293 -13765 -26179 -65777 -69052 5483 84215 126984 118583 2743 -75148 -118062
13931a18062K5962J01837J8570j7345l7057J0143L7617l986j6355k1285J8439
$$ -118062 -92100 9737 28307 10962 -26095 -15952 21665 17679 1324 -19961 -1522
13920a522L9979m3397m3833N0555N0520m5033j8400j6997k0288o437K149L8288
$$ -1522 38457 -4940 -48773 1782 52302 7269 -11131 -28128 -48416 -54853 -52704 -14416
13908a4416L3157K7638k1704k5079m1341j6143m2360k918J3359M0351M5733L8692
$$ -14416 18741 46379 24675 -404 -41745 -57888 -100248 -103166 -89807 -49456 -3723 34969
13896C4969l1915Q391M8677K822k4215o5869m9770L8150L1803N216j290p6582
$$ 34969 3054 11445 60122 62944 38729 -27140 -76910 -38760 -6957 -1741 -3031 -79613
13884g9613j5378K4304K6103P4940l1233P821N3324K8794N5218l1879o6530r935
$$ -79613 -94991 -70687 -44584 30356 -877 6944 60268 89062 144280 112401 45871 35936
13872C5936R3261J9291l4658m4846l8231n8768l4564J1523L793Q849M689q687
$$ 35936 129197 148488 113830 68984 30753 -28015 -62579 -51056 -47263 -38414 -33725 -42412
13860d2412J5496L2604r244J0195m5350m2336J0022K8921L7309j1216k8004O3137
$$ -42412 -26916 5688 -3556 6639 -38711 -81047 -71025 -42104 -4795 -16011 -44015 19122
13848A9122j680o0671M3662K2777P503J7520L8586k8449l0151o5749l4798N5621
$$ 19122 17442 -43229 433 23210 30713 48233 86819 58370 28219 -37530 -72328 -16707
13836a6707L7563K4679j3052j7118J9477K641k9147k5012j2203K6525Q190l4507
$$ -16707 20856 45535 32483 15365 34842 37483 8336 -16676 -28879 -2354 5836 -28671
13824b8671l6290l2943q530O7316L8048m004n1870j2931L2883N350K325j0083
$$ -28671 -64961 -97904 -106434 -39118 -1070 -5074 -56944 -69875 -36992 -31642 -29317 -39400
13812c9400q198k6408l7072K6751O6675P875M7111M1403K365n1309k1390M121
$$ -39400 -47598 -74006 -111078 -84327 -17652 -9777 37334 78737 81102 29793 8403 12524
13800A2524R599K623M5243r223O062J2828o44j8560m124o0562M3991J6836R894
$$ 12524 22123 24746 69989 60766 66828 79656 79012 60452 56328 -4234 39757 56593 66487
13787F6487K8269l3560j2721l2180l4502j4412P2598M3533J1936j5631l3585k5269
$$ 66487 94756 61196 48475 16295 -18207 -32619 39979 83512 95448 79817 46232 20963
13775B0963K9396L0979K1110j5764j4596O9370k2720r970m988K847j1667N849
$$ 20963 50359 81338 102448 86684 72088 141458 118738 108768 103780 106627 94960 100809
13763A00809J6723o3827m1730j0128J6192N1863K4022K0089j6969m3454K1760
$$ 100809 117532 53705 11975 1847 18039 69902 93924 114013 97044 53590 75350
13752G5350k5303k3881k894R200J53j689k1254N9921n1417p105K6512P728m5212
$$ 75350 50047 26166 23272 32472 32625 30936 9682 69603 18186 11081 37593 45321 109
13739A09m6736L5763L625K7179k1615m9626K7233K0766l4917r116N7603k159j8347
$$ 109 -46627 -10864 -7239 19940 -1675 -51301 -24068 -3302 -38219 -47335 10268 8109 -10238
13726a0238k6172m7460k2723N341L8599J8632K0340M9278k1820K1856J1277l728
$$ -10238 -36410 -83870 -106593 -101252 -62653 -44021 -23681 25597 3777 25633 36910 33182
13714C3182L8346Q525n8497n2687j9388K4853j0500K8160O9743m8807n567j1443
$$ 33182 71528 80053 21556 -31131 -50519 -25666 -36166 -8006 61737 12930 7363 -4080
13702d080k0247P633l2588m4509J702j1947K6104l4572k438J2596l1526J1043
$$ -4080 -24327 -16694 -49282 -93791 -92089 -104036 -77932 -112504 -114942 -102346 -133872 -122829
13690a22829M572k8620M4196Q6212K5286j0770J701n6867K1554Q9105R983K7834
$$ -122829 -118257 -146877 -102681 -16469 8817 -1953 -252 -57119 -35565 53540 63523 91357
13678I1357r390M7261J7364m4391l0902l5265l670J3317k7081l9533k227K2514
$$ 91357 81967 129228 146592 102201 71299 36034 32364 45681 18600 -20933 -23160 -646
13666f46J6594m804N824j3030l22j3550M5384n633j7980K7838k9622n8919l3153
$$ -646 15948 11144 16968 3938 3616 -9934 35450 29817 11837 39675 10053 -48866 -82019
13653h2019N3083K6434o807k5840L4285j2282L564K1919L7208m0235m5751J5171
$$ -82019 -28936 -2502 -9309 -35149 -864 -13146 -9582 12337 49545 9310 -36441 -21270
13641b1270k5656J8566j0843k9462O6788M2617J1106k1099n5953j4472M8552P0069
$$ -21270 -46926 -28360 -39203 -68665 -1877 40740 51846 30747 -25206 -39678 8874 78943
13629G8943L2022M2776m601k6355N701l5185j3329j2523p397J9034k3116l4785
$$ 78943 110965 153741 149140 122785 128486 93301 79972 67449 60052 79086 55970 21185
13617B1185o0388o595p652K4727M1331M5937K8935k9j8740j9764k5372J6146Q695
$$ 21185 -39203 -45798 -53450 -28723 12608 58545 87480 87451 68711 48947 23575 39721 48416
13604D8416l7887J5439K8530m3092k3834J4003M0633m186j5019l5825o6349j2970
$$ 48416 10529 25968 54498 11406 -12428 1575 42208 38022 23003 -12822 -79171 -92141
13592i2141N7301K9926M8659J1830j8680O914K4809P195l3872J3476L7765J6642
$$ -92141 -34840 -4914 43745 55575 36895 43809 68618 75813 41941 55417 93182 109824
13580A09824J5367o2207p6258l2581O9945P2556l8705n4987O582K0237P302m062
$$ 109824 125191 62984 -13274 -45855 24090 96646 57941 2954 9536 29773 37075 33013
13568C3013n4885L3830N6858j9380k052J9581k5309k3329m1721k1750k0154K4088
$$ 33013 -21872 11958 68816 49436 47384 66965 41656 18327 -23394 -45144 -65298 -41210
13556d1210L9049j9814k2367n3699R148O3233m927k7826m3635M6919L8808n8805
$$ -41210 -2161 -21975 -44342 -98041 -88893 -25660 -30587 -58413 -102048 -55129 -16321 -75126
13544g5126K6464P1042j4454k9531j2378K0141N9707J0966o484J599L50j9009
$$ -75126 -48662 22380 7926 -21605 -33983 -13842 45865 56831 50347 51946 52296 33287
13532C3287j1846q2643n5321K1032Q2570N2455k2646K960L9281M4234l2075n1434
$$ 33287 21441 -61202 -116523 -95491 -12921 39534 16888 19848 59129 103363 71288 19854
13520A9854j377o1084j4998M7544L2619O137J9635j1544L467j5639j753J4874
$$ 19854 18477 -42607 -57605 -10061 22558 28695 48330 36786 40253 24614 22861 37735
13508C7735k5097J6226P2657p01j9152k2076P0180N5480m1317n1387k2693q15
$$ 37735 12638 28864 101521 100820 81668 59592 129772 185252 143935 92548 69855 69040
13496F9040Q32K2253K3234j393n0595K0117J494J9615j1957o6267L0553j0199
$$ 69040 69872 92125 115359 113966 63371 83488 84982 104597 92640 26373 56926 46727
13484D6727k9583J3725L2k4097l5566k9055M8090N4697J7805l1834j2380p742
$$ 46727 17144 30869 30901 6804 -28762 -57817 -9727 44970 62775 30941 18561 10819
13472A0819L9308k2803J1240n2298J7957J3609L3835N0000k3103l5301r93l4244
$$ 10819 50127 27324 38564 -13734 4223 17832 51667 101667 78564 43263 42270 8026
13460H026L5773M5770K7080j4445p1095J0061J5374n3491j4640M085j7342j0039
$$ 8026 43799 89569 116649 102204 31109 41170 56544 3053 -11587 -7502 -24844 -34883
13448c4883M8037M9651j9724o3292j2779L3989M1786L7236j3306o3893J5198m0075
$$ -34883 13154 62805 43081 -20211 -32990 999 42785 80021 66715 2822 18020 -22055
13436b2055r228L452k0073O0729J3262J0157J4596P125n71J0259J9528k9300l4302
$$ -22055 -31283 -27831 -47904 12825 26087 36244 50840 57965 57394 67653 87181 57881 23579
13423B3579k8793L4596M6227J499m283K4208K1139k3635k0277j0098L4455J0967
$$ 23579 -5214 29382 75609 77108 72825 97033 118172 94537 74260 64162 98617 109584
13411A09584j9408J8611L8947M9869k9801o4364j6267N3029n1246l3754L9651
$$ 109584 90176 108787 147734 197603 167802 103438 87171 140200 88954 55200 94851
13400I4851J1697k6599k4323k7104k3738l7906J4955j5102p310r60n624o448K7539
$$ 94851 106548 79949 55626 28522 4784 -33122 -18167 -33269 -40579 -41539 -47163 -53611 -26072
13387b6072L6772M6347K2220K9637o5929k2650j297L614K7131P2300K6468L204
$$ -26072 10700 57047 79267 108904 42975 20325 19028 22642 49773 122073 148541 151745
13375A51745m8314n0426L073M4673K3920m2368k3173k8794L2045M34n240m233
$$ 151745 103431 53005 56078 100751 124671 82303 59130 30336 62381 62815 57575 53342
13363E3342J145L503L0479K1947k4224p821l3866J1103M5924q41o4193m2893k3003
$$ 53342 54487 57990 88469 110416 86192 78371 44505 55608 101532 100691 36498 -6395 -29398
13350b9398L9739O2312L0597q36P541l6789o2596n687K5823K7255L1936L1228
$$ -29398 10341 72653 103250 102414 109955 73166 10570 4883 30706 57961 89897 121125
13338A21125o2482l3114O1272r073o255j0107j8624M048K3945o302k5005m3301
$$ 121125 58643 25529 86801 77728 71473 61366 42742 46790 70735 64433 39428 -3873
13326c873J2624M3725R578k3618m052O2619r248k4000l48m126M1383J69m8666
$$ -3873 8751 52476 62054 38436 34384 97003 87755 63755 63407 59281 100664 100833 52167
13313E2167k8906J3818L334n2757j3217L3568N8952L3682K6015j4257o6252j8737
$$ 52167 23261 37079 40413 -12344 -25561 8007 66959 100641 126656 112399 46147 27410
13301B7410J7573m2176j0101K1049k071k052M6382P64o4569j3427r12M043L7152
$$ 27410 44983 2807 -7294 13755 11684 9632 56014 56778 -7791 -21218 -22130 -18087 19065
13288A9065K3819N005j7115j4002J8896j4981J257O7302J8330L0825k8667l7152
$$ 19065 42884 47889 30774 16772 35668 20687 21944 89246 107576 138401 109734 72582
13276G2582j8994o506l9444q653J9492K1533m5357r341N5181P966j0017K4362
$$ 72582 53588 47082 7638 -1015 18477 40010 -5347 -14688 40493 48459 38442 62804
13264F2804l8536j3183N6462k1910j1101k127p329j9687L4756N2758n263l8225
$$ 62804 24268 11085 67547 45637 34536 32409 25080 5393 40149 92907 87644 49419
13252D9419o011J5527j5439j9346P582K4039L9407L4636q518M205j4421o6521
$$ 49419 43408 58935 43496 24150 31732 55771 95178 129814 121296 125501 111080 44559
13240D4559j2608J1713k629K8068N7968M528j8973o3961k2867J9285K0978M5532
$$ 44559 31951 43664 41035 69103 127071 131599 112626 48665 25798 45083 66061 111593
13228A11593k4521m3319r537p227m22m631J9896k421j7253K5103l8599o2747L1251
$$ 111593 87072 43753 34216 26989 26567 21936 41832 39411 22158 47261 8662 -54085 -22834
13215b2834P2854m3364j7109M7250N3935k222k6557J4327j8864n1378n1227L309
$$ -22834 50020 6656 -10453 36797 90732 88510 61953 76280 57416 6038 -45189 -41880
13203d1880L7727n440k8583j8399K638K6636N2653J057l35L0535J4962n6385J9456
$$ -41880 -4153 -9593 -38176 -56575 -53937 -27301 25352 26409 26074 56609 71571 15186 34642
13190C4642L9383j0376j9509k18n963J1758M5169N4488K1220o159M794n5391J5895
$$ 34642 74025 63649 44140 43922 37959 49717 94886 149374 170594 164435 169229 113838 129733
13177A29733L2697l1350K1183m3475n6839n6132N8287M2558j2529l0196l448P971
$$ 129733 162430 131080 152263 108788 51949 -4183 54104 96662 84133 53937 50489 58460
13165E8460m996O606N844p494L2450l928n7712l2392l3469N3105N2306K228K3917
$$ 58460 53464 60070 65914 58420 90870 86942 29230 -3162 -36631 16474 68780 71008 94925
13152I4925j6509m5190M397L5841P362k136J5990K3391K7766n6761r5961j6933
$$ 94925 78416 33226 37623 73464 80826 78690 94680 118071 145837 89076 -6885 -23818
13140b3818P8350j6887K234K556N111K4510m241j0350L402o60R569p144o0242
$$ -23818 54532 37645 39879 42435 47546 72056 67815 57465 60867 60207 69776 62632 2390
13127B390O546Q4744k0946m2037j801L75k1310l004N6872l0981l4929k5071L2592
$$ 2390 8936 93680 72734 30697 28896 29271 7961 4957 61829 30848 -4081 -29152 3440
13114C440M4649j2083L4044r382n1562l8353R7797Q2966o4089m9064L3428k2452
$$ 3440 48089 36006 70050 60668 9106 -29247 68550 151516 87427 38363 71791 49339
13102D9339N061j1521j7924K0827K912k7641N7292K3953j7914l1526N2177L2551
$$ 49339 54400 42879 24955 45782 48694 21053 78345 102298 84384 52858 105035 137586
$$ [...]
##END NTUPLES=NMR SPECTRUM
##END=
