##TITLE=Analysis number 330133
Compound Code cc 66146
Book Reference 513/153/9
Project Code adrs
Chemist Name ronp
##JCAMPDX= 6.0         $$ Bruker NMR JCAMP-DX V2.0
##DATA TYPE= NMR SPECTRUM
##DATA CLASS= NTUPLES
##ORIGIN= Bruker BioSpin GmbH
##OWNER= nmr
$$ XWIN-NMR		Version 3.5
$$ Tue Oct 30 13:48:53 2007 GMT Standard Time (UT+0h)  MAYBRIDGE\nmr@NMR_250MHZ
##.OBSERVE FREQUENCY= 250.131544655141
##.OBSERVE NUCLEUS= ^1H
##.ACQUISITION MODE= SIMULTANEOUS (DQD)
##.ACQUISITION SCHEME= undefined
##.AVERAGES= 16
##.DIGITISER RES= 18
##SPECTROMETER/DATA SYSTEM= dpx250
##.PULSE SEQUENCE= zg30
##.SOLVENT NAME= CDCl3
##.SHIFT REFERENCE= (INTERNAL, CDCl3, 0, 16.522)
##AUDIT TRAIL= $$ (NUMBER, WHEN, WHO, WHERE, WHAT)
$$ ##TITLE= Audit trail, XWIN-NMR		Version 3.5
$$ ##JCAMPDX= 5.01
$$ ##ORIGIN= Bruker BioSpin GmbH
$$ ##OWNER= nmr
$$ C:\u/data/dgb/nmr/ADRS/1570/pdata/1/auditp.txt
$$ ##AUDIT TRAIL=  $$ (NUMBER, WHEN, WHO, WHERE, WHAT)
(   1,<2007-10-30 13:48:24.73 +000>,<MAYBRIDGE\nmr>,<NMR_250MHZ>,
      <created by zg, POWCHK disabled, PULCHK disabled
       configuration hash MD5:
       76 6E 9A 78 1E 09 19 81 EC 84 63 8F B0 6A 59 2D
       data hash MD5: 64K
       60 3F 4E DC 75 3A 54 19 75 DF D9 60 67 A5 A3 8F>)
(   2,<2007-10-30 13:48:42.79 +000>,<MAYBRIDGE\nmr>,<NMR_250MHZ>,
      <Start of raw data processing
       ef LB = 0.3 FT_mod = 6 PKNL = 1 SI = 32K 
       data hash MD5: 32K
       93 1D 2A 79 40 3B 32 8C AC 59 29 4E 58 05 D7 D8>)
(   3,<2007-10-30 13:48:45.04 +000>,<MAYBRIDGE\nmr>,<NMR_250MHZ>,
      <apk 
       data hash MD5: 32K
       5B 09 00 57 93 0D 93 0F A6 35 25 81 31 82 6F 95>)
(   4,<2007-10-30 13:48:45.93 +000>,<MAYBRIDGE\nmr>,<NMR_250MHZ>,
      <abs ABSG = 5 
       data hash MD5: 32K
       C3 6E 73 BE 24 6B 4B EC 81 B5 AC 7F 9A B3 1C 42>)
$$ ##END=
$$ 
$$ hash MD5
$$ AC 22 FB 43 70 7D FD E2 94 81 7D 83 7A 15 BF 31
##$RELAX= 
##$RELAX= 
##$RELAX= 
##$RELAX= 
##$RELAX= 
##$RELAX= 
##$RELAX= 
$$ Bruker specific parameters
$$ --------------------------
##$DU= <C:\u>
##$EXPNO= 1570
##$NAME= <ADRS>
##$PROCNO= 1
##$TYPE= <nmr>
##$USER= <dgb>
##$AMP= (0..31)
100 100 100 100 100 100 100 100 100 100 100 100 100 100 100 100 100 100 
100 100 100 100 100 100 100 100 100 100 100 100 100 100 
##$AQSEQ= 0
##$AQ_mod= 3
##$AUNM= <au_zg>
##$AUTOPOS= <29 >
##$BF1= 250.13
##$BF2= 250.13
##$BF3= 250.13
##$BF4= 250.13
##$BF5= 500.13
##$BF6= 500.13
##$BF7= 500.13
##$BF8= 500.13
##$BYTORDA= 1
##$CFDGTYP= 0
##$CFRGTYP= 5
##$CHEMSTR= <none>
##$CNST= (0..31)
1 1 145 1 1 1 1 1 1 1 1 1 1 1 1 1 1 1 1 1 1 1 1 1 1 1 1 1 1 1 1 1 
##$CPDPRG= <>
##$CPDPRG1= <>
##$CPDPRG2= <>
##$CPDPRG3= <>
##$CPDPRG4= <mlev>
##$CPDPRG5= <mlev>
##$CPDPRG6= <mlev>
##$CPDPRG7= <mlev>
##$CPDPRG8= <mlev>
##$CPDPRGB= <>
##$CPDPRGT= <>
##$D= (0..31)
0 1 0 0 0 0 0 0 0 0.06 0 0 0 0 0 0 0.0002 0 0 0 0 0 0 0 0 0 0 0 0 0 0 
0 
##$DATE= 1193752103
##$DBL= (0..7)
120 120 120 120 120 120 120 120 
##$DBP= (0..7)
150 150 150 150 150 150 150 150 
##$DBP07= 0
##$DBPNAM0= <>
##$DBPNAM1= <>
$$ [...]
##$SUBNAM7= <"">
##$SUBNAM8= <"">
##$SUBNAM9= <"">
##$SW= 20.6930455092707
##$SWIBOX= (0..15)
0 0 3 0 0 0 0 0 0 0 0 0 0 0 0 0 
##$SW_h= 5175.983436853
##$TD= 65536
##$TD0= 1
##$TE= 296.16
##$TE2= 300
##$TE3= 300
##$TEG= 300
##$TL= (0..7)
0 120 120 120 120 120 120 120 
##$TP= (0..7)
150 150 150 150 150 150 150 150 
##$TP07= 0
##$TPNAME0= <>
##$TPNAME1= <>
##$TPNAME2= <>
##$TPNAME3= <>
##$TPNAME4= <>
##$TPNAME5= <>
##$TPNAME6= <>
##$TPNAME7= <>
##$TPOAL= (0..7)
0.5 0.5 0.5 0.5 0.5 0.5 0.5 0.5 
##$TPOFFS= (0..7)
0 0 0 0 0 0 0 0 
##$TUNHIN= 0
##$TUNHOUT= 0
##$TUNXOUT= 0
##$USERA1= <user>
##$USERA2= <user>
##$USERA3= <user>
##$USERA4= <user>
##$USERA5= <user>
##$V9= 5
##$VALIST= <valist>
##$VCLIST= <CCCCCCCCCCCCCCC>
##$VD= 0
##$VDLIST= <DDDDDDDDDDDDDDD>
##$VPLIST= <PPPPPPPPPPPPPPP>
##$VTLIST= <TTTTTTTTTTTTTTT>
##$WBST= 1024
##$WBSW= 4
##$XGAIN= (0..3)
0 0 0 0 
##$XL= 0
##$YL= 0
##$YMAX_a= 452832
##$YMIN_a= -435335
##$ZGOPTNS= <>
##$ZL1= 120
##$ZL2= 120
##$ZL3= 120
##$ZL4= 120
##$ABSF1= 16.522
##$ABSF2= -4.171173
##$ABSG= 5
##$ABSL= 3
##$ALPHA= 0
##$AQORDER= 0
##$ASSFAC= 0
##$ASSFACI= 0
##$ASSFACX= 0
##$ASSWID= 0
##$AUNMP= <proc_1d>
##$AZFE= 0.1
##$AZFW= 0.1
##$BCFW= 0
##$BC_mod= 0
##$BYTORDP= 0
##$COROFFS= 0
##$CY= 12.5
##$DATMOD= 1
##$DC= 0
##$DFILT= <>
##$DTYPP= 0
##$F1P= 14.0000005364418
##$F2P= -0.99999901652339
##$FCOR= 0.5
##$FTSIZE= 32768
##$FT_mod= 6
##$GAMMA= 0
##$GB= 0
##$INTBC= 1
##$INTSCL= 1
##$ISEN= 128
##$LB= 0.3
##$LEV0= 0
##$LPBIN= 0
##$MAXI= 10000
##$MC2= 0
##$MEAN= 0
##$ME_mod= 0
##$MI= 0
##$NCOEF= 0
##$NC_proc= -3
##$NLEV= 6
##$NOISF1= 0
##$NOISF2= 0
##$NSP= 0
##$NTH_PI= 0
##$NZP= 0
##$OFFSET= 16.522
##$PC= 1
##$PHC0= 158.3414
##$PHC1= 2.988605
##$PH_mod= 1
##$PKNL= yes
##$PPARMOD= 0
##$PSCAL= 4
##$PSIGN= 0
##$REVERSE= no
##$SF= 250.13
##$SI= 32768
##$SIGF1= 0
##$SIGF2= 0
##$SINO= 400
##$SIOLD= 32768
##$SREGLST= <1H.CDCl3>
##$SSB= 0
##$STSI= 32768
##$STSR= 0
##$SW_p= 5175.98343685301
##$SYMM= 0
##$S_DEV= 0
##$TDeff= 65536
##$TDoff= 0
##$TI= <Analysis number 999999
Compound Code 99
Book Reference 9
Project Code 9>
##$TILT= no
##$TM1= 0
##$TM2= 0
##$TOPLEV= 0
##$USERP1= <user>
##$USERP2= <user>
##$USERP3= <user>
##$USERP4= <user>
##$USERP5= <user>
##$WDW= 1
##$XDIM= 32768
##$YMAX_p= 280902547
##$YMIN_p= -84430
$$ End of Bruker specific parameters
$$ ---------------------------------
##NTUPLES= NMR SPECTRUM
##VAR_NAME=  FREQUENCY,     SPECTRUM/REAL,   SPECTRUM/IMAG
##SYMBOL=    X,             R,               I
##VAR_TYPE=  INDEPENDENT,   DEPENDENT,       DEPENDENT
##VAR_FORM=  AFFN,          ASDF,            ASDF
##VAR_DIM=   32768,         32768,           32768
##UNITS=     HZ,            ARBITRARY UNITS, ARBITRARY UNITS
##FACTOR=    0.157963299565203, 1,           1
##FIRST=     4132.6476996994, 0,             0
##LAST=      -1043.33573715361, 0,           0
##MIN=       -1043.33573715361, -84430,      0
##MAX=       4132.6476996994, 280902547,     0
$$ Real data points
##PAGE= N=1
##DATA TABLE= (X++(R..R)), XYDATA
$$ [...]
$$ plain form
16079 -38184 -45296 -52220 -56113 -62850 -49991 -36579 -18277 -28828 -28701 -37709 -45820 -35873 -32408 -32933
16065 -32933 -34371 -41170 -23629 -11146 -4294 26297 29882 14938 6048 12806 16306 723 -6402
16052 -6402 -6182 -14980 -21161 -42635 -27667 -16106 -26301 -38247 -24535 -2584 10228 1259 -4403
16039 -4403 9849 13178 -8780 -32195 -27695 -25344 -26747 -5245 -5180 -15418 -19156 -28023 -36092 -27926
16025 -27926 -18327 -9240 -1563 4377 11005 2786 -17827 -26869 -32261 -32882 -19447 -3140 2058 -3766
16011 -3766 -20918 -11111 3702 6722 -1870 331 -3283 -10646 -2914 10222 9948 -3691 -14088 -24591
15997 -24591 -39604 -30209 -6003 -4396 -15074 -5102 -98 8097 12570 -7324 -14609 547 8217
15984 8217 10291 -189 -8335 -787 4329 23135 35805 30398 25523 22077 13903 26954 15215
$$ packed form
16079c8184p112o924l893o737J2859J3412J8302j0551J27r008q111R947L465n25
16065c2933j438o799J7541J2483O852L0591L585j4944q890O758L500j5583p125
16052f402K20q798o181k1474J4968J1561j0195j1946J3712K1951J2812q969n662
16039d403J4252L329k1958k3415M500K351j403K1502O5j0238l738q867q069Q166
16025b7926R599R087P677N940O628q219k0613r042n392o21J3435J6307N198n824
16011c766j7152R807J4813L020q592K201l614p363P732J3136k74j3639j0397j0503
15997b4591j5013R395K4206J607j0678R972N004Q195M473j9894p285J5156P670
15984H217K074j0480q146P548N116J8806J2670n407m875l446q174J3051j1739
$$ plain form
15971 15215 -2517 -7472 -11255 -16967 -16992 -7827 1334 19636 18256 19372 17959 30130 22627 -836
15957 -836 3725 18586 16588 10624 20767 30061 1622 -23193 -12101 5760 22972 8571 -1143
15944 -1143 -7587 -17842 3283 9684 -447 -8519 -27800 -16164 11225 21048 26861 8741 20322
15931 20322 30564 39724 33853 12250 -4158 -4901 -9834 -16225 -10514 16175 25618 15700 8303 10932
15917 10932 7785 11935 -591 -1656 2109 7128 -7021 -11718 -25229 -19699 2904 10627 13547
15904 13547 575 -28756 -42582 -39241 -49463 -41247 -49307 -51103 -59041 -46366 -35245 -25742 -8675
15891 -8675 9003 15504 -3028 -12003 -11049 -131 -5448 -9685 -2356 30273 37854 6909 -10825
15878 -10825 -20240 -19586 -17164 -15100 2103 -1744 5619 18334 18420 17946 19167 14556 9743 -18114 -27343
$$ packed form
15971A5215j7732m955l783n712k5R165R161J8302j380J116j413J2171p503k3463
15957h36M561J4861j998n964J0143R294k8439k4815J1092J7861J7212j4401r714
15944a143o444j0255K1125O401j0131q072j9281J1636K7389R823N813j8120J1581
15931B0322J0242R160n871k1603j6408p43m933o391N711K6689R443r918p397K629
15917A0932l147M150j2526j065L765N019j4149m697j3511N530K2603P723K920
15904A3547j2972k9331j3826L341j0222Q216q060j796p938J2675J1121R503J7067
15891h675J7678O501j8532q975R54J0918n317m237P329L2629P581l0945j7734
15878a0825r415O54K422K064J7203l847P363J2715Q6m74J221m611m813k7857r229
$$ plain form
15863 -27343 -37147 -29029 -20459 -12186 -16668 -4739 10727 5696 9563 -10123 -32510 -43718 -39561
15850 -39561 -30765 -39842 -39044 -10908 1824 -8319 -6421 -4195 -7752 -6403 4835 7494 -11232
15837 -11232 5012 29962 26231 34871 30547 10856 -7475 -5228 4269 13514 8157 22776 20973
15824 20973 13946 21951 8875 -3993 -8847 -10671 -18999 -4875 -5332 1287 9965 3658 7234 17222
15810 17222 18326 10794 -1125 -12544 -12653 -32242 -19878 -13223 -14823 -1040 2616 -2007 -3966
15797 -3966 5347 8553 -8698 -12777 -15922 -19155 -24710 -22748 -10725 6468 -1612 -6757 -8423 -18747
15783 -18747 -5384 -1182 -3007 -8916 -16701 -18703 -22768 -11701 2855 -7592 -4549 -8682 -7803 -4248
15769 -4248 -7466 -17994 -16902 -15076 -17183 -13783 -17427 -14438 -21419 -36172 -54132 -54989 -35595 4345
$$ packed form
15863b7343r804Q118Q570Q273m482J1929J5466n031L867j9686k2387j1208M157
15850c9561Q796r077P98K8136J2732j0143J898K226l557J349J1238K659j8726
15837a1232J6244K4950l731Q640m324j9691j8331K247R497R245n357J4619j803
15824B0973p027Q005j3076j2868m854j824q328J4124m57O619Q678o307L576R988
15810A7222J104p532j1919j1419j09j9589J2364O655j600J3783L656m623j959
15797c966R313L206j7251m079l145l233n555J962J2023J7193q080n145j666j0324
15783a8747J3363M202j825n909p785k002m065J1067J4556j0447L043m133Q79L555
15769d248l218j0528J092J826k107L400l644K989o981j4753j7960q57J9394L9940
$$ plain form
15755 4345 13874 11587 13256 13738 3322 -2106 -14722 -22686 -45721 -52989 -20636 -27607 -36723 -9880
15741 -9880 5445 -5914 -11248 -23953 -12544 -22124 -23033 -6548 -17777 -10156 17226 3406 -15903
15728 -15903 -1146 27902 32012 14450 -16848 -33837 -14102 1380 12334 3305 -1516 -12632
15716 -12632 -10725 9057 12377 13059 7017 4715 4595 -1594 -4772 -3676 -3806 -2498 -8287 3419 -4610
15701 -4610 -6686 -24581 -25785 -8620 -247 4611 844 -19770 -1592 15302 7580 1632 10525
15688 10525 -1493 -13871 -3496 14023 18238 4495 -1053 -17316 -10269 -3139 -9289 -41102 -20527
15675 -20527 -3496 -1307 234 10860 11859 10592 2441 -3957 -12437 -3051 13038 20069 26517 22162
15661 22162 3951 27399 39393 38030 28623 18090 2306 -9476 7399 18759 15022 17716
$$ packed form
15755D345R529k287J669M82j0416n428j2616p964k3035p268L2353o971r116K6843
15741i880J5325j1359n334j2705J1409r580r09J6485j1229P621K7382j3820j9309
15728a5903J4757K9048M110j7562l1298j6989J9735J5482J0954r029m821j1116
15716a2632J907J9782L320O82o042k302j20o189l178J096j30J308n789J1706q029
15701d610k076j7895j204J7165Q373M858l767k0614J8178J6894p722n948Q893
15688A0525j2018j2378J0375J7519M215j3743n548j6263P047P130o150l1813K0575
15675b0527J7031K189J541J0626R99j267q151o398q480R386J6089P031O448m355
15661B2162j8211K3448J1994j363r407j0533j5784j1782J6875J1360l737K694
$$ plain form
15649 17716 19927 5464 -21638 -30408 -37781 -19722 -14053 -9454 -10156 -12319 4781 3816 20467 21438
15635 21438 28334 27226 12662 12181 1468 -27842 -21139 6688 9618 -876 9340 10177 -2590
15622 -2590 -24162 -28226 -34983 -27908 -14460 -14376 -32283 -29977 -19137 4625 17355 9811 -4985
15609 -4985 -16616 -14980 -18412 -13928 -14315 -13608 -14652 -12153 -9096 13531 20295 -2238 -1056 -1564 10806
15594 10806 14321 8441 21811 34087 20260 4833 6627 23555 11683 11359 20414 26994 27981
15581 27981 13633 17331 5199 1281 5757 -3877 7633 24152 30372 24393 4645 -35038 -28610
15568 -28610 -26495 -30008 -31083 -27939 -10683 14142 19055 34270 46387 24500 -6137 -33753 -8786
15555 -8786 4484 -8484 -25454 -29801 -38086 -30098 -21070 -9134 672 3509 18383 40588 38050
$$ packed form
15649A7716K211j4463k7102q770p373J8059N669M599p02k163J7100r65J6651R71
15635B1438O896j108j4564m81j0713k9310O703K7827K930j0494J0216Q37j2767
15622b590k1572m064o757P075J3448Q4j7907K306J0840K3762J2730p544j4796
15609d985j1631J636l432M484l87P07j044K499L057K2627O764k2533J182n08J2370
15594A0806L515n880J3370J2276j3827j5427J794J6928j1872l24R055O580R87
15581B7981j4348L698j2132l918M476r634J1510J6519O220n979j9748l9683O428
15568b8610K115l513j075L144J7256K4825M913J5215J2117k1887l0637k7616K4967
15555h786J3270j2968j6970m347q285P988R028J1936R806K837J4874K2205k538
$$ plain form
15542 38050 16432 2936 1888 5178 14434 16027 3207 4285 -8068 -17693 -21140 -4638 22155
15529 22155 9367 1501 -10730 -2095 -2062 -1791 -1225 9793 18747 8191 -9540 -22742 -16852 -11695
15515 -11695 -10497 10250 20897 12531 12522 21256 30239 27302 30235 31769 25042 40695 38489 31703
15501 31703 15736 275 3084 -3237 10792 9002 -8742 -2992 947 -12085 -9788 1342 11002
15488 11002 14557 12221 -1048 2989 15170 21460 17133 6751 5642 -7304 -15474 -21351 -24479
15475 -24479 -19544 -18590 -8125 4846 9323 7198 20216 15589 14197 28596 34016 23048 8869
15462 8869 21703 29453 34801 9567 2001 -6607 -15216 2906 3458 1368 -4086 2583 5968 20493
15448 20493 33985 26290 23199 32716 38713 16629 9540 19981 11537 -9997 -2532 5591 16463
$$ packed form
15542C8050k1618j3496j048L290R256J593j2820J078j2353r625l447J6502K6793
15529B2155j2788p866j2231Q635L3K71N66J1018Q954j0556j7731j3202N890N157
15515a1695J198K0747J0647q366rQ734Q983k937K933J534o727J5653k206o786
15501C1703j5967j5461K809o321J4029j790j7744N750L939j3032K297J1130R660
15488A1002L555k336j3269M037J2181O290m327j0382j109j2946q170n877l128
15475b4479M935R54J0465J2971M477k125J3018m627j392J4399N420j0968j4179
15462H869J2834P750N348k5234p566q608q609J8122N52k090n454O669L385J4525
15448B0493J3492p695l091R517N997k2084p089J0441q444k1534P465Q123J0872
$$ plain form
15435 16463 16070 16635 18223 -258 -23736 -13653 -5904 -5613 13101 23770 34874 14110 10373
15422 10373 10471 11284 7672 -9191 -17196 -6290 -1252 6660 25886 19913 -2778 -4125 -113 13347
15408 13347 18269 5971 -1390 1042 -9565 -3002 4948 14091 12902 7376 17080 29476 28986 7762
15394 7762 21771 24580 44293 46811 39036 11741 11107 -2198 785 22276 30914 24098 13354
15381 13354 6596 -9362 -4515 -18635 -40626 -39195 -2788 22335 26396 23552 14489 5666 100
15368 100 9066 21166 24437 37858 33152 32162 28324 19715 21288 26190 25007 21312 26908 8321
15354 8321 -1103 6813 21806 28260 14693 7227 12251 6775 16156 26497 11368 12910 1200
15341 1200 -15939 -3540 -1912 -5084 -14668 3050 4401 -8116 -9428 -8084 2137 -12851 -13259
$$ packed form
15435A6463l93N65J588j8481k3478J0083P749K91J8714J0669J1104k0764l737
15422A0373R8Q13l612j6863q005J0906N038P912J9226n973k2691j347M012J3460
15408A3347M922j2298p361K432j0607O563P950R143j189n526R704J2396m90k1224
15394G762J4009K809J9713K518p775k7295o34j3305K983K1491Q638o816j0744
15381A3354o758j5958M847j4120k1991J431L6407K5123M061k844r063q823n566
15368A00Q966J2100L271J3421m706r90l838q609J573M902j183l695N596j8587
15354H321r424P916J4993O454j3567p466N024n476R381J0341j5129J542j1710
15341A200j7139J2399J628l172r584J7718J351j2517j312J344J0221j4988m08
$$ plain form
15328 -13259 -12848 -26289 -31639 -18954 -5677 -4307 -10587 -838 14171 25513 24686 -457 -19070
15315 -19070 -17204 -19515 -25296 -8220 9528 28886 29116 37113 6880 -19383 -11166 10093 15568
15302 15568 11296 4958 22676 26485 12008 11533 18697 17711 7533 11187 -13454 -26091 -20506 -11007
15288 -11007 2404 -3818 374 9759 11155 8475 15063 20280 29684 24085 17628 14141 9758 8154
15274 8154 24512 5861 1262 13229 -5702 -4898 -2156 -11211 -14646 -30327 -25125 -13730 -24668
15261 -24668 -19396 -6689 -1125 7057 22799 23014 9327 3051 5707 2394 7180 -8152 -18492
15248 -18492 -19367 -13803 1074 5911 19758 26511 14286 15170 1264 2310 -4098 451 19989 23145
15234 23145 3518 -13020 -13873 5595 17735 22784 18302 17770 26191 29252 34380 37385 45020 30049
$$ packed form
15328a3259M11j3441n350J2685J3277J370o280R749J5009J1342q27k5143j8613
15315a9070J866k311n781J7076J7748J9358K30P997l0233k6263Q217K1259N475
15302A5568m272o338J7718L809j4477m75P164r86j0178L654k4641j2637N585R499
15288a1007J3411o222M192R385J396k680O588N217R404n599o457l487m383j604
15274H154J6358j8651m599J1967j8931Q04K742r055l435j5681N202J1395j0938
15261b4668N272J2707N564Q182J5742K15j3687o276K656l313M786j5332j0340
15248a8492q75N564J4877M837J3847O753j2225Q84j3906J046o408M549J9538L156
15234B3145j9627j6538q53J9468J2140N049m482n32Q421L061N128L005P635j4971
$$ plain form
15220 30049 30954 22809 25559 19286 20058 18014 25053 22201 3036 -1338 4069 11879 30387 27269
15206 27269 4132 -4465 1361 8558 16079 18873 33444 44572 43083 50900 37791 27690 6602
15193 6602 -15897 -28400 -18557 3577 4700 -3986 -11205 -13586 -27137 -37470 -33996 -36784 -38581
15180 -38581 -26087 -20518 -17944 -32659 -27912 -3764 7676 10087 8988 8203 7727 -4811 3306 3186
15166 3186 2206 6845 35220 46728 31739 27660 -430 -17856 -32774 -41888 -36251 -23893 -21958
15153 -21958 -10695 1491 8641 9011 25190 28575 -1645 -9526 -6020 -16302 -17928 -15578 -4217
15140 -4217 8377 4067 -22625 -21559 -25101 -28620 -37336 -19466 -7981 -10637 -5744 5763 26661
15127 26661 9722 -17794 -15304 -9697 -21436 -20293 -15102 -5928 3992 -11990 -23695 -38465 -29514
$$ packed form
15220C0049R05q145K750o273P72k044P039k852j9165m374N407P810J8508l118
15206B7269k3137q597N826P197P521K794J4571J1128j489P817j3109j0101k1088
15193F602k2499j2503R843K2134J123q686p219k381j3551j0333L474k788j797
15180c8581J2494N569K574j4715M747K4148J1440K411j099p85m76j2538Q117j20
15166C186r80M639K8375J1508j4989m079k8090j7426j4918r114N637J2358J935
15153b1958J1263J2186P150L70J6179L385l0220p881L506j0282j626K350J1361
15140d217J2594m310k6692J066l542l519q716J7870J1485k656M893J1507K0898
15127B6661j6939k7516K490N607j1739J143N191R174R920j5982j1705j4770Q951
$$ plain form
15114 -29514 -31063 -35665 -21421 -11686 -14775 -14630 -14225 -14946 -12573 -4026 -11052 -21725 -30026 -25357 -26336
15099 -26336 -9195 -8298 2633 26230 41666 27400 23458 27151 32343 47691 35750 17846 -14002
15086 -14002 -24672 -7507 3561 11 882 10627 18979 -3015 -18178 -1776 4756 4616 -3661
15073 -3661 7921 -3987 -24956 -23058 -27316 -26967 -14065 -1727 14537 17799 -2790 -4008 22
15060 22 7519 10214 -7783 -11318 14792 16105 7053 -1145 2024 2418 -5998 4693 1030 13866
15046 13866 8079 -15595 11819 19166 22210 23160 6378 -17080 -14935 -6075 5364 10462 19016
15033 19016 -2950 -9706 4399 628 6868 16330 5737 3334 6892 18764 20135 7649 -2166
15020 -2166 2001 3286 15118 22558 24186 20344 19540 27183 33723 34749 28698 20989 22277 23187 31074
$$ packed form
15114b9514j549m602J4244R735l089J45M05p21K373Q547p026j0673q301M669r79
15099b6336J7141Q97J0931K3597J5436j4266l942L693N192J5348j1941j7904l1848
15086a4002j0670J7165J1068l550Q71R745Q352k1994j5163J6402O532j40q277
15073c661J1582j1908k0969J898m258L49J2902J2338J6264L262k0589j218M030
15060B2P497K695j7997l535K6110J313r052q198L169L94q416J0691l663J2836
15046A3866n787k3674K7414P347L044R50j6782k3458K145Q860J1439N098Q554
15033A9016k1966o756J4105l771O240R462j0593k403L558J1872J371j2486r815
15020b166M167J285J1832P440J628l842q04P643O540J026o051p709J288R10P887
$$ plain form
15005 31074 17602 22358 41606 58783 65601 63283 60003 72493 100486 129021 154971 210111
14993 210111 290988 406689 549959 753310 1063542 1673532 2691108 3405223 3247593 2553894
14983 2553894 1651062 1008361 670201 489859 368972 271752 210958 169010 138076 116727
14973 116727 103923 70884 55727 60607 55483 46866 53627 78133 53719 23897 32270 47158
14961 47158 30644 27889 31029 35218 36062 40801 43680 31815 29019 43275 33321 34557 49532 35087
14947 35087 23984 17256 7066 -6154 9319 30560 46801 43032 33789 10582 -2550 6110
14935 6110 4348 -16388 -3463 -3019 -16636 -1700 23533 20404 9651 -5474 -1637 -2434 -11249
14922 -11249 5711 23486 26439 27509 23877 19045 13646 8045 5321 -747 -99 -10658 -2425 1765
$$ packed form
15005C1074j3472M756J9248J7177O818k318l280J2490K7993K8535K5950N5140
14993B10111Q0877J15701J43270K03351L10232O09990J017576P14115j57630o93699
14983B553894r02832o42701l38160j80342j20887r7220o0794m1948l0934k1349
14973A16727j2804l3039j5157M880n124q617O761K4506k4414k9822Q373J4888
14961D7158j6514k755L140M189Q44M739K879j1865k796J4256r954J236J4975j4445
14947C5087j1103o728j0190j3220J5473K1241J6241l769r243k3207j3132Q660
14935F110j762k0736J2925M44j3617J4936K5233l129j0753j5125L837p97q815
14922a1249J6960J7775K953J070l632m832n399n601k724o068O48j0559Q233M190
$$ plain form
14908 1765 12974 20936 18346 17193 34148 29785 16126 7796 -1989 7483 19030 21033 2794
14895 2794 -23012 -27937 -17179 -39925 -31722 -12546 -17178 -15820 -24409 -24407 -51138 -52214 -32624 -29411
14881 -29411 -23026 -19891 -8036 3161 12864 -829 -28770 -34115 -13178 -8346 6318 18647 9830
14868 9830 3240 20670 34510 31574 26065 27068 12474 176 183 894 3396 17837 16050 -6951
14854 -6951 -12104 -16815 -24372 -14058 -1330 2071 -6755 -20156 -17545 -5052 -7501 -236 -7434 -8560
14840 -8560 -9195 -17298 -20484 -20020 -11261 5117 8836 11350 14180 31229 31712 22699 6619 4456 -11092
14825 -11092 4665 28252 26147 8232 -4914 -7700 -8559 2957 14456 10911 9000 10605 -10725
14812 -10725 -22672 -9548 -4179 220 5223 4905 -8083 -7784 -6235 -23478 -38829 -15743 -1927
$$ packed form
14908A765J1209P962k590j153J6955m363j3659q330r785R472J1547K003j8239
14895B794k5806m925J0758k2746Q203J9176m632J358q589Kk6731j076J9590L213
14881b9411O385L135J1855J1197R703j3693k7941n345K0937M832J4664J2329q817
14868I830o590J7430J3840k936n509J003j4594j2298PP11K502J4441j787k3001
14854f951n153m711p557J0314J2728L401q826j3401K611J2493k449P265p198j126
14840h560o35q103l186M64Q759J6378L719K514K830J7049M83r013j6080k163j5548
14825a1092J5757K3587k105j7915j3146k786q59J1516J1499l545j911J605k1330
14812a0725j1947J3124N369M399N003l18j2988K99J549j7243j5351K3086J3816
$$ plain form
14799 -1927 -8914 -9487 1435 9118 25666 38066 22903 11122 316 -4689 4321 3638 -22437
14786 -22437 -19039 2788 6301 -3487 -13116 -26640 -13756 -9261 9416 6971 5722 12246 12333 9882
14772 9882 13702 18506 24561 9072 4550 16595 12643 8389 14385 12096 21993 20895 6890 -9512
14758 -9512 -18583 -12848 1324 27076 36023 21517 11003 24519 20629 13000 22020 19294 -4366
14745 -4366 -8550 143 9185 17471 5129 186 2240 -10417 -13591 -18299 -1681 12992 14068 8880
14731 8880 4927 134 -9880 -16190 -8181 -16738 -10031 24093 13382 5487 -7146 -10392 -15556 -18768
14717 -18768 -24952 -39282 -49180 -31261 -19813 -17643 -16241 -14932 -19983 -32151 -24468 -25873 -17767
14704 -17767 -9615 -19594 -17682 206 3594 -3370 -24699 -36179 -26332 -20247 -15919 -7946 1287 8680
$$ packed form
14799a927o987n73J0922P683J6548J2400j5163j1781j0806n005R010o83k6075
14786b2437L398K1827L513r788r629j3524J2884M495J8677k445j249O524Q7k451
14772I882L820M804O055j5489m522J2045l952m254N996k289R897j098j4005j6402
14758i512r071N735J4172K5752Q947j4506j0514J3516l890p629R020k726k3660
14745d366m184Q693R042Q286j2342m943K054j2657l174m708J6618J4673J076n188
14731H880l953m793j0014o310Q009q557O707L4124j0711p895j2633l246n164l212
14717a8768o184j4330r898J7919J1448K170J402J309n051j2168P683j405Q106
14704a7767Q152r979J912J7888L388o964k1329j1480R847O085M328P973R233P393
$$ plain form
14690 8680 8738 5517 -22434 -19319 -13682 -16688 -16237 -2493 6667 -7167 -8678 -13375 -32911 -27719
14676 -27719 -31981 -20078 -15758 -19766 -4503 1955 16353 13235 5734 -4643 -5395 -109 1688 -4026
14662 -4026 -6527 -6518 -7825 21195 31964 14258 12455 10532 4224 -99 -6894 -693 13337 17282
14648 17282 16691 3408 -9259 -25693 -24224 -1542 8575 13699 11975 -707 9869 15416 -3171
14635 -3171 3777 6837 6434 14085 34652 35484 11723 10889 18181 17715 17179 3210 3465 14560 29970
14620 29970 45917 30729 19746 16928 21295 35991 31957 22712 15572 2783 -401 24093 28138
14607 28138 10173 19425 11878 15555 11311 1399 5331 20094 15323 19898 24297 8849 -5798
14594 -5798 11235 10756 803 -2963 2477 17263 5664 -12863 5354 26805 24946 8608 -9660
$$ packed form
14690H680N8l221k7951L115N637l006M51J3744R160j3834j511m697j9536N192
14676b7719m262J1903M320m008J5263O458J4398l118p501j0377p52N286J797n714
14662d026k501Rj307K9020J0769j7706j803j923o308m323o795O201J4030L945
14648A7282n91j3283j2667j6434J469K2682J0117N124j724j2682J0576N547j8587
14635c171O948L060m03P651K0567Q32k3761q34P292m66n36j3969K55J1095J5410
14620B9970J5947j5188j0983k818M367J4696m034r245p140j2789l184K4494M045
14607B8138j7965R252p547L677m244r912L932J4763m771M575M399j5448j4647
14594e798J7033m79r953l766N440J4786j1599j8527J8217K1451j859j6338j8268
$$ plain form
14581 -9660 -19411 -14369 -1928 11987 -11771 -18776 3387 11579 378 12066 7580 19680 14118
14568 14118 -6676 1189 7027 153 4590 9802 32270 40077 26219 24883 22579 16145 15726 10914
14554 10914 7208 2119 -901 21538 33413 22599 10703 5974 23305 20163 7619 13580 12184
14541 12184 1450 -5388 6862 10174 11410 16807 6424 12227 12183 -4356 -20292 -17050 -7390 1266
14527 1266 -2956 -21243 -16562 -3916 4237 -14797 -10261 -1846 -11707 230 8294 -8445 -8501 -5539
14513 -5539 2608 11353 7851 9812 12143 25818 15239 1794 -19849 -49114 -48231 -34421 -20679
14500 -20679 -2393 -7419 -5379 -11620 -20065 -20764 -15261 -1336 2020 5059 -7562 -7125 16734 -1566
14486 -1566 -21773 -19548 -12771 -7582 -2174 -324 -573 -20309 -17863 -274 586 -3878 -11834 -22753
$$ packed form
14581i660r751N042J2441J3915k3758p005K2163Q192j1201J1688m486J2100n562
14568A4118k0794P865N838o874M437N212K2468P807j3858j336k304o434m19m812
14554A0914l706n089l020K2439J1875j0814j1896m729J7331l142j2544N961j396
14541A2184j0734o838J2250L312J236N397j0383N803m4j6539j5936L242R660Q656
14527A266m222j8287M681J2646Q153j9034M536Q415r861J1937Q064j6739n6K962
14513e539Q147Q745l502J961K331J3675j0579j3445k1643k9265Q83J3810J3742
14500b0679J8286n026K040o241q445o99N503J3925L356L039j2621M37K3859j8300
14486a566k0207K225O777N189N408J850k49j9736K446J7589Q60m464p956j0919
$$ plain form
14472 -22753 -8821 189 12270 10298 10150 20114 16518 21134 10169 -2526 3392 -8166 -10483
14459 -10483 1843 3213 1567 2964 -7096 -2862 -4853 15686 27236 28683 18967 20657 24671
14446 24671 45396 33075 12035 25409 37551 61921 54426 38282 33631 19948 17460 18084 -6098
14433 -6098 -4475 -21559 -3348 12663 13532 -3482 -11894 -15163 -16158 -2677 17424 18700 9879 10072
14419 10072 6640 -2639 223 -16114 -5811 -435 8306 17983 16351 9744 27085 37051 23320
14406 23320 14465 28063 31370 12760 9490 11696 24560 28783 21088 19559 21416 16985 13282 27391
14392 27391 43633 66344 60192 24792 10662 10858 -6556 -6987 -11834 -16887 -11165 -10033 -4161 3672
14378 3672 4272 -1382 -4558 30 18198 28420 26734 26144 32837 32993 36466 41942 28125 16344
$$ packed form
14472b2753J3932R010J2081j972j48R964l596M616j0965j2695N918j1558k317
14459a0483J2326J370j646J397j0060M234j991K0539J1550J447r716J690M014
14446B4671K0725j2321k1040J3374J2142K4370p495j6144m651j3683k488O24k4182
14433f098J623j7084J8211J6011Q69j7014q412l269r95J3481K0101J276q821J93
14419A0072l432r279K862j6337J0303N376Q741R677j632o607J7341R966j3731
14406B3320q855J3598L307j8610l270K206J2864M223p695j529J857m431l703J4109
14392B7391J6242K2711o152l5400j4130J96j7414m31m847n053N722J132N872P833
14378C672O00n654l176M588J8168J0222j686n90O693J56L473N476j3817j1781
$$ plain form
14364 16344 9857 -5163 2223 8307 188 -7128 8975 2754 -1917 6204 13152 38100 40819 34461
14350 34461 32962 30912 10791 -5976 -6173 -11514 7008 13864 15730 39012 41536 24217 319
14337 319 10144 7991 2570 22199 4021 5435 7525 11510 18513 23517 31651 31823 17059 23523
14323 23523 45253 47656 40632 44657 48615 28065 38109 58434 46448 26120 17244 22395 19559
14310 19559 10677 31555 47160 36598 25412 6764 11296 40447 48293 41466 32549 34657 28914
14297 28914 23931 25923 27811 38895 30970 20984 12646 15701 37599 38624 41486 41858 37773 36070
14283 36070 24391 21947 18899 15125 22743 30612 20242 6352 -2069 -2529 4219 25625 45554
14270 45554 54070 56334 52361 22425 19582 39820 47190 25389 23135 29225 20628 17591 9431 960
$$ packed form
14364A6344o487j5020P386O084q119p316J6103o221m671Q121O948K4948K719o358
14350C4461j499k050k0121j6767j97n341J8522O856J866K3282K524j7319k3898
14337C19R825k153n421J9629j8178J414K090L985P003N004Q134J72j4764O464
14323B3523K1730K403p024M025L958k0550J0044K0325j1986k0328q876N151k836
14310A9559q882K0878J5605j0562j1186j8648M532K9151P846o827q917K108n743
14297B8914m983J992J888J1084p925r986q338L055K1898J025K862L72m085j703
14283C6070j1679k444l048l774P618P869j0370j3890q421m60O748K1406J9929
14270D5554Q516K264l973k9936k843K0238P370k1801k254O090q597l037q160q471
$$ plain form
14256 960 6718 7593 6050 24412 10164 5114 10312 3474 15330 28033 29342 30860 26106 23875
14242 23875 10371 11893 23728 33528 31713 15497 -2150 -3067 -8933 -2044 26108 28058 19246
14229 19246 12808 20397 34572 43236 53787 53306 36507 49221 51123 41012 37067 19875 33977
14216 33977 51631 56888 54283 40838 40368 48828 54539 47233 39527 18942 12256 10545 26806 34260
14202 34260 37736 31503 20784 -1619 1214 15170 21351 15754 25896 26653 4041 7483 9080
14189 9080 15045 39995 49613 46559 29380 17392 10501 -2207 1828 17793 2387 4278 11112
14176 11112 3715 -5640 6866 41556 35770 820 -2319 -7957 -19003 -14238 -3636 16658 10469
14163 10469 21802 31224 45697 41777 25796 12669 8723 19217 34835 34389 30549 33975 52579
$$ packed form
14256I60N758Q75j543J8362j4248n050N198o838J1856J2703J309J518m754k231
14242B3875j3504J522J1835R800j815j6216j7647r17n866O889K8152J950q812
14229A9246o438P589J4175Q664J0551m81j6799J2714J902j0111l945j7192J4102
14216C3977J7654N257k605j3445m70Q460N711p306p706k0585o686j711J6261P454
14202C4260L476o233j0719k2403K833J3956O181n597J0142P57k2612L442J597
14189I080N965K4950R618l054j7179j1988o891j2708M035J5965j5406J891O834
14176A1112p397r355J2506L4690n786l4950l139n638j1046M765J0602K0294o189
14163A0469J1333R422J4473l920j5981j3127l946J0494J5618m46l840L426J8604
$$ plain form
14150 52579 45368 35253 37685 44032 35939 41367 40742 17454 9405 20110 32749 35856 27684 31410
14136 31410 39786 50441 61853 47334 33908 36630 44603 48331 54093 56736 41523 26867 25260
14123 25260 35805 43712 36065 6299 11917 20550 14626 -4376 5109 25112 30901 23223 43973
14110 43973 38972 27021 14325 8528 11781 24927 34937 31469 7823 10311 10143 12874 12987 19074
14096 19074 14322 12086 14334 19155 20146 -4159 -15648 4029 47366 44384 8409 5042 26913
14083 26913 24835 19878 12215 -6521 17811 46113 40037 27886 26977 29767 16803 -3128 20675
14070 20675 29554 44153 43172 33032 36641 38681 19533 19165 27776 31321 26362 11658 2930 -9317
14056 -9317 -8415 22188 17282 4341 3965 2383 37698 35086 26393 28419 13372 30873 43382 44155
$$ packed form
14150E2579p211j0115K432O347q093N428o25k3288q049J0705J2639L107q172L726
14136C1410Q376J0655J1412j4519j3426K722P973L728N762K643j5213j4656j607
14123B5260J0545P907p647k9766N618Q633n924j9002R485K0003N789p678K0750
14110D3973n001j1951j2696n797L253J3146J0010l468k3646K488j68K731J13O087
14096A9074m752k236K248M821R91k4305j1489J9677M3337k982l5975l367K1871
14083B6913k078m957p663j8736K4332K8302o076j2151r09K790j2964j9931K3803
14070B0675Q879J4599r81j0140L609K040j9148l68Q611L545m959j4704q728j2247
14056i317R02L0603m906j2941l76j582L5315k612q693K026j5047J7501J2509P73
$$ plain form
14042 44155 38154 30754 28454 33724 36947 28750 12062 -6161 -6555 774 13597 28033 47173
14029 47173 52943 51144 45903 27804 14191 26336 43128 43863 52053 65383 50146 36127 30200
14016 30200 34914 45057 66564 70111 58531 31323 16540 27758 21551 11738 10221 28903 29318
14003 29318 28839 2068 -8889 -1389 14037 26110 35412 33107 42458 50131 30456 18631 15772
13990 15772 27435 25687 18465 28560 49690 49346 28694 7752 4495 14100 25732 30247 31269
13977 31269 25976 17675 28049 28744 11342 2964 5114 22905 11410 -1004 1540 24403 39162
13964 39162 31318 27473 27251 60097 60384 32056 31230 32146 19542 25121 23284 18799 29822 34022
13950 34022 30962 14806 15012 15582 18397 20733 23961 25636 21918 28692 21052 31331 48933 40477
$$ packed form
14042D4155o001p400k300N270L223q197j6688j8223l94P329J2823J4436J9140
14029D7173N770j799n241j8099j3613J2145J6792P35Q190J3330j5237j4019n927
14016C0200M714J0143K1507L547j1580k7208j4783J1218o207r813j517J8682M15
14003B9318m79k6771j0957P500J5426J2073R302k305R351P673j9675j1825k859
13990A5772J1663j748p222J0095K1130l44k0652k0942l257R605J1632M515J022
13977C1269n293q301J0374O95j7402q378K150J7791j1495j2414K544K2863J4759
13964C9162p844l845k22L2846K87k8328q26R16j2604N579j837m485J1023M200
13950C4022l060j6156K06N70K815K336L228J675l718O774p640J0279J7602q456
$$ plain form
13936 40477 19856 11007 23897 20037 16588 31622 35746 35880 26053 18087 33074 49181 47047
13923 47047 42703 34399 25635 19681 24802 24284 42063 37867 47652 57915 49756 39013 36843 28018
13909 28018 15408 19156 28619 10640 15893 17216 9937 23521 13131 12181 29714 34278 18831
13896 18831 15750 19476 14133 22704 13753 6380 1785 2005 13908 7965 6434 19697 18321 21362
13882 21362 35008 28498 28117 11402 -2233 8967 7601 -5237 -1326 7670 20026 15860 11032
13869 11032 28824 24695 13733 -1907 6912 18224 23963 35043 29123 27758 40843 37922 29320
13856 29320 38807 37211 33808 29001 16491 11995 26675 43208 54375 43890 12760 714 11536
13843 11536 29705 19209 38960 42929 19945 13817 19386 26813 23071 12998 11779 28653 45643
$$ packed form
13936D0477k0621q849J2890l860l449J5034M124J34r827p966J4987J6107k134
13923D7047m344q304q764n954N121n18J7779m196R785J0263q159j0743k170q825
13909B8018j2610L748R463j7979N253J323p279J3584j0390r50J7533M564j5447
13896A8831l081L726n343Q571q951p373m595K20J1903n943j531J3263j376L041
13882B1362J3646o510l81j6715j3635J1200j366j2838L911Q996J2356m166m828
13869A1032J7792m129j0962j5640Q819J1312N739J1080n920j365J3085k921q602
13856B9320R487j596l403m807j2510m496J4680J6533J1167j0485l1130j2046J0822
13843A1536J8169j0496J9751L969k2984o128N569P427l742j0073j219J6874J6990
$$ plain form
13830 45643 44560 37561 9363 -10636 -10534 1867 6019 -11102 -29871 -34959 -390 15604 8306
13817 8306 28944 35380 22527 7152 8046 5130 -1946 -8277 -6885 11928 18594 17741 21990 21585
13803 21585 9647 13860 26726 37709 30650 17599 30294 37959 37006 40123 17413 13402 9833
13790 9833 -4441 2889 9678 13602 23519 26541 22061 23836 11874 15381 30020 33741 36295 17534
13776 17534 -1988 -12108 2945 10613 11328 8859 16598 4039 -13175 -20022 1898 6787 2896
13763 2896 9473 12964 10319 19963 7685 19762 23037 34714 22427 50985 58529 46538 40305
13750 40305 35377 28975 18100 21219 28833 1712 -19156 -21308 -14775 7689 5259 -6138 -11495
13737 -11495 -3449 18369 31507 31463 32291 29441 24062 24278 34204 44716 35593 19657 11615 -4740
$$ packed form
13830D5643j083o999k8198j9999J02J2401M152j7121j8769n088L4569J5994p298
13817H306K0638O436j2853j5375Q94k916p076o331J392J8813O666q53M249m05
13803B1585j1938M213J2866J0983p059j3051J2695P665r53L117k2710m011l569
13790I833j4274P330O789L924R917L022m480J775j1962L507J4639L721K554j8761
13776A7534j9522j0120J5053P668P15k469P739j2559j7214o847K1920M889l891
13763B896O577L491k645R644j2278J2077L275J1677j2287K8558P544j1991o233
13750D0305m928o402j0875L119P614k7121k0868k152O533K2464k430j1397n357
13737a1495Q046K1818J3138m4Q28k850n379K16R926J0512r123j5936q042j6355
$$ plain form
13723 -4740 -24678 -23150 7559 16495 7679 6189 -5425 -530 -6033 -16952 -6105 15984 16871
13710 16871 20236 24605 14538 -2302 -5398 8817 22312 17369 -3222 -26541 -20043 -3906 -2059
13697 -2059 6689 10947 12082 13659 18034 17942 19115 27738 25957 25308 12576 4100 17310 27860 30920
13682 30920 40716 22391 19961 20849 6919 9983 -13066 -1906 284 -7729 -5604 -2393 -4064 14922
13668 14922 21390 8011 3871 12028 10757 11592 11998 19182 -2236 -2617 2770 4421 -13983 -29145
13654 -29145 -23897 -24948 -19614 -31230 -13351 15578 14328 28008 17137 1155 -9217 1804
13642 1804 -7891 9178 32820 32965 19639 21012 18944 13534 2058 -23691 -17005 1046 -2713
13629 -2713 4307 23336 40344 44960 29933 32104 22421 19628 15406 6247 -10115 -20924 -18244
$$ packed form
13723d740j9938J528L0709Q936q816j490j1614M895n503j0919J0847K2089Q87
13710A6871L365M369j0067j6840l096J4215J3495m943k0591k3319O498J6137J847
13697b059Q748M258J135J577M375r2J173Q623j781o49j2732q476J3210J0550L060
13682C0920R796j8325k430Q88j3930L064k3049J1160K190q013K125L211j671J8986
13668A4922O468j3379m140Q157j271Q35M06P184k1418l81N387J651j8404j5162
13654b9145N248j051N334j1616J7879K8929j250J3680j0871j5982j0372J1021
13642A804r695J7069K3642J45j3326J373k068n410j1476k5749O686J8051l759
13629b713P020J9029J7008M616j5027K171r683k793m222r159j6362j0809K680
$$ plain form
13616 -18244 -14616 -9871 -30813 -27269 -26505 -26952 -32871 -13986 -2639 -6905 -1645 -21399 -7047 4248
13602 4248 -5691 5302 12776 35826 28102 12019 5019 -8127 -8349 -19049 -4227 6521 5917
13589 5917 13553 11518 3490 22436 24186 18423 -5143 -221 10685 368 6654 20141 31923
13576 31923 32134 43481 32334 -8647 -21765 -10983 -11288 -30515 -36180 -14224 2645 1164 -5570
13563 -5570 3249 21009 3310 3681 21076 20161 -5130 -12405 -8615 1064 -1246 10985 16044 12292
13549 12292 -7992 -5276 -6683 -1891 -12707 -23975 611 22237 6087 254 -2428 3154 -1112
13536 -1112 -15436 -12629 -3168 -1014 11822 13422 14024 11630 854 -709 16996 17929 14648 4825
13522 4825 -12292 -24828 -4646 12094 17414 12453 13538 2685 9740 25735 35635 43871 43225
$$ packed form
13616a8244L628M745k0942L544P64m47n919J8885J1347m266N260j9754J4352J1295
13602D248r939J0993P474K3050p724j6083p000j3146k22j0700J4822J0748o04
13589E917P636k035q028J8946J750n763k3566M922J0906j0317O286J3487J1782
13576C1923K11J1347j1147m0981j3118J0782l05j9227n665K1956J6869j481o734
13563e570Q819J7760j7699L71J7395r15k5291p275L790R679k310J2231N059l752
13549A2292k0284K716j407M792j0816j1268K4586K1626j6150n833k682N582m266
13536a112j4324K807R461K154J2836J600O02k394j0776j563J7705R33l281r823
13522D825j7117j2536K0182J6740N320m961J085j0853P055J5995R900Q236o46
$$ plain form
13509 43225 49125 50278 70567 52427 23163 10311 12851 1039 6719 1969 2126 42 10013
13496 10013 20235 12861 6186 5628 -1728 -2678 598 944 15760 16840 27130 17979 13604 19549
13482 19549 28388 16301 10006 34537 35597 31215 31529 16092 11767 9330 15049 7412 14641 18504
13468 18504 4913 -6377 -2181 -1748 -13904 -16166 7671 19982 5737 -5080 -25437 -15588 -6847
13455 -6847 -12927 -3894 5979 14899 9411 -886 -4293 -281 6283 12820 19089 32171 20044 -10752
13441 -10752 -34214 -43030 -32338 -18005 -12077 -29771 -15314 11878 4114 -2673 -12868 -20491 -22924
13428 -22924 -17492 -21538 -24894 -11126 3441 11263 -4646 -9147 17035 46964 45139 27127 19287
13415 19287 9616 663 -5247 -7562 -1875 14038 8739 15919 15290 5003 -4243 1027 13440 11969
$$ packed form
13509D3225N900J153K0289j8140k9264j2852K540j1812N680m750J57k084R971
13496A0013J0222p374o675n58p356r50L276L46J4816J080J0290r151m375N945
13482A9549Q839j2087o295K4531J060m382L14j5437m325k437N719p637P229L863
13468A8504j3591j1290M196M33j2156k262K3837J2311j4245j0817k0357R849Q741
13455f847o080R033R873Q920n488j0297l407M012O564O537O269J3082j2127l0796
13441a0752k3462q816J0692J4333N928j7694J4457K7192p764o787j0195p623k433
13428b2924N432m046l356J3768J4567P822j5909m501K6182K9929j825j8012p840
13415A9287r671q953n910k315N687J5913n299P180o29j0287r246N270J2413j471
$$ plain form
13401 11969 9756 -3521 -19138 -24257 -7243 -3598 215 11500 17531 6979 -5447 -22099 -25308
13388 -25308 -9813 5066 24244 36844 45750 35417 16803 15707 23516 9746 19474 9036
13376 9036 -19339 -26871 -29328 -17799 14428 15719 21151 15898 4596 -8299 -14742 -1075 -699
13363 -699 -5057 8005 20659 15452 8632 6476 -22427 -28760 -9841 -12179 -17852 -19701 4481 13767
13349 13767 -4320 9000 10467 -9701 -8269 -7568 -1004 -6857 -21035 -24583 -24804 -22229 -28273 -35835
13335 -35835 -31365 -17834 12518 44180 31828 19051 16980 6196 15390 15479 11789 22918 25425
13322 25425 25315 37631 12885 6505 -9375 -8121 -13538 -20708 -15163 -33104 -30019 -6252 14857
13309 14857 3604 -2395 -11132 2272 4229 -11751 -14481 -13637 6133 20857 17143 11137 17049
$$ packed form
13401A1969k213j3277j5617n119J7014L645L813J1285O031j0552j2426j6652l209
13388b5308J5495J4879J9178J2600Q906j0333j8614j096P809j3770R728j0438
13376I036k8375p532k457J1529L2227J291N432n253j1302j2895o443J3667L76
13363f99m358J3062J2654n207o820k156k8903o333J8919k338n673j849K4182R286
13349A3767j8087J3320J467k0168J432P01O564n853j4178l548k21K575o044p562
13335c5835M470J3531L0352L1662j2352j2777k071j0784R194Q9l690J1129K507
13322B5425j10J2316k4746o380j5880J254n417p170N545j7941L085K3767K1109
13309A4857j1253n999q737J3404J957j5980k730Q44J9770J4724l714o006N912
$$ plain form
13296 17049 11528 19856 3676 -7591 20891 30595 36553 36618 38286 24902 12773 -1994 -1584 11336
13282 11336 13993 6120 -9736 -17965 -21228 12260 31195 22321 5660 -10107 -26834 -18238 -5730
13269 -5730 5403 -4763 -13982 -3005 3554 -13384 -27154 -23239 -12133 -30224 -45395 -26890
13257 -26890 -14365 -16486 -28205 -14283 -9477 -6306 -8061 -12956 -9767 -32931 -39954 -18607 2834
13244 2834 24541 22913 22608 30234 39007 30464 23774 33056 24421 7589 8813 2180 -1252 -18314
13230 -18314 -33982 -32404 -27722 -35186 -30410 -7234 -3263 8405 16158 28815 15659 13826 2169
13217 2169 -6435 -21451 -22653 2549 13251 12631 6629 10337 23128 24533 20202 -7151 -2332 -1804
13203 -1804 -4688 -14130 -19939 -17593 -32596 -42498 -26876 7413 29807 22895 4182 16794 2280
$$ packed form
13296A7049n521Q328j6180j1267K8482R704N958O5J668j3384j2129j4767M10J2920
13282A1336K657p873j5856q229l263L3488J8935q874j6661j5767j6727Q596J2508
13269e730J1133j0166r219J0977O559j6938j3770L915J1106j8091j5171J8505
13257b6890J2525k121j1719J3922M806L171j755m895L189k3164p023K1347K1441
13244B834K1707j628l05P626Q773q543o690R282q635j6832J224o633l432j7062
13230a8314j5668J578M682p464M776K3176L971J1668P753J2657j3156j833j1657
13217B169q604j5016j202K5202J0702o20o002L708J2791J405m331k7353M819N28
13203a804k884r442n809K346j5003r902J5622L4289K2394o912j8713J2612j4514
$$ plain form
13190 2280 -8416 -11785 -11307 -14159 -11315 -1552 -1847 -9688 -23564 -23564 -12102 1533 26991 26666 12163
13175 12163 15386 21193 7004 -12227 183 14439 18930 21303 23315 22463 18604 1292 -12804
13162 -12804 -31603 -31855 -10271 -15426 -27340 -14512 -10118 -1151 -15304 -19078 -12250 -3149 -728
13149 -728 721 11204 -8132 -28497 -20283 -14091 -6045 -5629 1494 -22435 -22852 850 685 -14216
13135 -14216 -22513 -29272 -13717 -12906 -19188 -13869 10099 18788 11238 -10336 -14360 7331 7859 4877
13121 4877 -7363 -26803 -20719 -15260 -17159 -13587 -6207 -9847 -5845 7413 -5069 -10246 1192
13108 1192 873 8957 13400 11295 241 3559 1237 -5883 -7406 6758 9866 24888 29530 28338
13094 28338 21532 17768 218 8742 14220 20400 28226 31610 5216 -8267 1439 10895 16395 15376
$$ packed form
13190B280j0696l369M78k852K844R763k95p841j3876%J1462J3635K5458l25j4503
13175A2163L223N807j4189j9231J2410J4256M491K373K012q52l859j7312j4096
13162a2804j8799k52K1584n155j1914J2828M394Q967j4153l774O828R101K421
13149g28J449J0483j9336k0365Q214O192Q046M16P123k3929m17K3702j65j4901
13135a4216q297o759J5555Q11o282N319K3968Q689p550k1574m024K1691N28k982
13121D877j2240j9440O084N459j899L572P380l640M002J3258j2482n177J1438
13108A192l19Q084M443k105j1054L318k322p120j523J4164L108J5022M642j192
13094B8338o806l764j7550Q524N478O180P826L384k6394j3483R706R456N500j019
$$ plain form
13080 15376 -9761 -8971 5759 9050 -9629 -14317 -29265 -12999 6896 11973 2792 -11794 -16094
13067 -16094 -771 -2533 9556 10696 7976 2961 -527 3024 19762 27261 14956 15023 9365 13969
13053 13969 21714 14940 17401 10547 9958 -4877 5670 21820 13854 -13058 -14303 -13195 -13588 21320
13039 21320 34494 17160 492 -17552 -22188 -17237 -25089 -39708 -38687 -15997 -7670 -4606 -17516
13026 -17516 -8382 -9250 -16734 -6977 22518 16661 20274 33301 30496 13957 4855 6719 -22938 -39375
13012 -39375 -37428 -23535 319 1693 15549 19877 16639 8094 4394 -9789 897 6011 -5724
12999 -5724 576 12681 3690 -5588 -2753 4814 4769 9404 -1358 -11368 -7629 9469 13823 10272
12985 10272 20602 28871 23180 -10840 -30220 -23833 -5658 -3547 7223 11455 22531 21014 18382
$$ packed form
13080A5376k5137P90J4730L291j8679m688j4948J6266J9895N077r181j4586m300
13067a6094J5323j762J2089J140k720n015l488L551J6738P499j2305O7n658M604
13053A3969P745o774K461o854n89j4835J0547J6150p966k6912j245J108l93L4908
13039B1320J3174j7334j6668j8044m636M951p852j4619J021K2690Q327L064j2910
13026a7516R134q68p484R757K9495n857L613J3027k805j6539r102J864k9657j6437
13012c9375J947J3893K3854J374J3856M328l238q545l700j4183J0686N114j1735
12999e724O300J2105q991r278K835P567m5M635j0762j0010L739J7098M354l551
12985A0272J0330Q269n691l4020j9380O387J8175K111J0770M232J1076j517k632
$$ plain form
12972 18382 27565 30975 41424 44038 18119 3592 3332 -5869 -8336 -8621 -11823 -12975 -15306 -19349
12958 -19349 -23913 -19828 -8326 -4302 -7960 -17761 -13180 7551 12131 2866 5321 16256 4989
12945 4989 -7885 -22571 -33438 -29231 -3901 -8009 -17248 -7571 -2987 4868 5134 14994 25886 32443
12931 32443 41600 36278 29624 16457 4292 -11079 -14089 -22226 -22986 -5103 5191 2030 6317
12918 6317 -7223 -740 5617 -1240 -5510 16909 22299 17060 4727 3097 -721 -8783 1000 1699
12904 1699 49 15459 9396 1833 -6681 -23179 -20474 -22845 -36069 -24523 -19181 -10119 -10508 12314
12890 12314 12598 -2242 -17745 -14261 -23559 -17268 -13278 -11460 -16233 -20493 -6650 -406 9995 8248
12876 8248 7196 -3140 -8691 4990 15635 1768 2829 32079 40721 29839 7427 74 -8103
$$ packed form
12972A8382R183L410J0449K614k5919j4527k60r201k467k85l202j152k331m043
12958a9349m564M085J1502M024l658r801M581K0731M580r265K455J0935j1267
12945D989j2874j4686j0867M207K5330m108r239R677M584P855K66R860J0892O557
12931C2443R157n322o654j3167j2165j5371l010q137p60J7883J0294l161M287
12918F317j3540O483O357o857m270K2419N390n239j2333j630l818q062R783O99
12904A699j650J5410o063p563q514j6498K705k371j3224J1546N342R062l89K2822
12890A2314K84j4840j5503L484r298O291L990J818m773m260J3843O244J0401j747
12876H248j052j0336n551J3681J0645j3867J061K9250Q642j0882k2412p353q177
$$ plain form
12863 -8103 -1271 11574 1035 -6400 5599 13939 9964 4919 -3738 -7952 -4821 4122 6419 6728
12849 6728 10109 11024 18855 25377 17077 6455 19818 25324 46334 50567 32030 -5329 -8928 -5098
12835 -5098 -2095 -2472 17606 10595 -1478 12444 20267 16168 11152 4164 14797 2539 -8697
12822 -8697 -1183 5297 4545 10597 3612 -8645 -24113 -33652 -26262 -26866 -28646 -11619 5293 -5737
12808 -5737 2047 23880 24393 4510 -3919 18305 10764 6177 1507 7156 5208 -1215 -13741 -13152
12794 -13152 -9270 -5539 -6855 -16711 -23823 162 6475 -520 -16540 3859 9483 6490 -10329
12781 -10329 -9682 16377 38761 26259 9268 11863 23135 19709 9083 -4537 -3649 -7275 -7329 9782
12767 9782 17146 16236 10993 13260 878 -11039 416 30229 29417 -5020 -298 8143 1307 204
$$ packed form
12863h103O832J2845j0539p435J1999Q340l975n045q657m214L131Q943K297L09
12849F728L381R15P831O522q300j0622J3363N506K1010M233j8537l7359l599L830
12835e098L003l77K0078p011j2073J3922P823m099n016o988J0633j2258j1236
12822h697P514O480p52O052o985j2257j5468r539P390o04j780J7027J6912j1030
12808e737P784K1833N13j9883q429K2224p541m587m670N649j948o423j2526N89
12794a3152L882L731j316r856p112K3985O313o995j6020K0399N624k993j6819
12781a0329O47K6059K2384j2502j6991K595J1272l426j0626j3620Q88l626n4J7111
12767I782P364r10n243K267j2382j1917J1455K9813q12l4437M722Q441o836j103
$$ plain form
12753 204 17170 22104 25876 24492 32784 20453 12486 2848 3074 21940 33328 27545 13325 7141
12739 7141 -9463 -4052 -5175 -13023 -3528 -12816 -20112 -7817 -17593 -6600 -23733 -41812 -22233
12726 -22233 -5128 7181 2558 -5050 13399 26289 11140 9262 17863 15705 19623 43734 31549
12713 31549 38508 48194 28915 26615 33643 36763 23443 18279 10225 -7169 -8624 4066 25969
12700 25969 20216 3010 -431 -2459 17807 18178 10136 8952 -8955 -2251 4317 -462 -8643 -8634 -1367
12685 -1367 -18976 -22673 -14386 -17087 -21143 -15849 -2391 8961 3482 -5389 -9150 -15281 -13801 -8819
12671 -8819 -11108 -5814 1480 13036 16943 13081 13918 -320 1629 12517 -12490 -37468 -28405 -4856
12657 -4856 10637 11551 10944 7281 -3269 -5387 -19316 -23604 -23933 -22360 -6351 12696 5853 8197
$$ packed form
12753B04J6966M934L772j384Q292j2331p967r638K26J8866J1388n783j4220o184
12739G141j6604N411j123p848R495r288p296J2295r776J0993j7133j8079J9579
12726b2233J7105J2309m623p608J8449J2890j5149j878Q601k158L918K4111j2185
12713C1549O959R686j9279k300P028L120j3320n164q054j7394j455J2690K1903
12700B5969n753j7206l441k028K0266L71q042j184j7907O704O568m779q181RP267
12685a367j7609l697Q287k701m056N294J3458J1352n479q871l761o131J480M982
12671h819k289N294P294J1556L907l862Q37j4238J949J0888k5007k4978R063K3549
12657d856J5493R14o07l663j0550k118j3929m288l29J573J6009J9047o843K344
$$ plain form
12643 8197 13735 11179 16135 16883 18629 20380 8868 -6111 -25453 -12379 -4032 -2568 3820 -12299
12629 -12299 -9015 1545 5390 5194 17139 14041 -3196 -9059 -5705 -4324 1361 6832 4452 15026
12615 15026 26857 25911 18778 2061 3518 12886 18130 21317 29410 32766 38014 42771 11561 -31063
12601 -31063 -30954 6651 30103 22862 8713 15112 23919 8359 -16772 -15755 -34353 -43630 -27807
12588 -27807 -11781 -4182 2994 -1626 -9440 -6408 16394 19775 25900 38600 46799 36184 33451
12575 33451 32094 37042 44919 17276 14040 36777 41983 39886 52232 60109 51881 67567 76764
12562 76764 84531 110359 122677 130786 140537 129553 107789 78204 65152 73424 65490 54297 50834
12549 50834 31919 29301 20002 18937 20492 15011 11202 6596 4187 24606 36269 26892 28286 31455
$$ packed form
12643H197N538k556M956P48J746J751j1512j4979j9342J3074Q347J464O388j6119
12629a2299L284J0560L845j96J1945l098j7237n863L354J381N685N471k380J0574
12615A5026J1831r46p133j6717J457R368N244L187Q093L356N248M757l1210m2624
12601c1063J09L7605K3452p241j4149O399Q807j5560k5131J017j8598r277J5823
12588b7807J6026P599P176m620p814L032K2802L381O125J2700Q199j0615k733
12575C3451j357M948P877k7643l236K2737N206k097J2346P877q228J5686R197
12562G6764P767K5828J2318Q109R751j0984k1764k9585j3052Q272p934j1193l463
12549E0834j8915k618r299j065J555n481l809m606k409K0419J1663r377J394L169
$$ plain form
12535 31455 29549 35016 29531 24479 18814 18199 20501 25731 28888 39311 42912 58635 53378 61156
12521 61156 56358 34997 22920 25617 26170 43928 36260 11284 11544 22268 35283 42207 31516
12508 31516 12483 6970 18015 6080 3370 8807 16401 13218 1074 -2601 4318 14175 8943
12495 8943 -6839 -4505 -11055 -14119 -786 2588 -1932 -17006 -12571 -17479 304 17536 21936
12482 21936 7245 -13827 -17328 6469 19155 -6181 -3439 -5069 -3555 12241 3530 -4643 -3682
12469 -3682 -12906 -14663 -6546 4316 -1088 6803 18966 26425 12916 3186 11256 9446 18121 14151
12455 14151 7879 10053 17754 22390 32023 53490 70290 64194 73996 87504 88317 65547 52700
12442 52700 33662 17021 -270 -2087 -1764 -4594 6303 2548 9401 20291 32779 12444 4800
$$ packed form
12535C1455j906N467n485n052n665o15K302N230L157J0423L601J5723n257P778
12521F1156m798k1361j2077K697N53J7758p668k4976K60J0724J3015O924j0691
12508C1516j9033n513J1045j1935k710N437P594l183j2144l675O919R857n232
12495H943j5782K334o550l064J3333L374m520j5074M435m908J7783J7232M400
12482B1936j4691k1072l501K3797J2686k5336K742j630J514J5796q711q173R61
12469c682r224j757Q117J0862n404P891J2163P459j3509r730Q070j810Q675l970
12455A4151o272K174P701M636R633K1467J6800o096R802J3508Q13k2770j2847
12442E2700j9038j6641j7291j817L23k830J0897l755O853J0890J2488k0335p644
$$ plain form
12429 4800 22657 35108 25223 17660 8976 10910 18450 18074 20968 21377 18280 18798 17804 4650 13680
12414 13680 10437 2517 13014 21719 21708 20606 20423 14974 1408 -5166 4138 10624 35377 43114
12400 43114 32519 16342 12582 20310 33782 48454 50377 40898 18148 -7358 -13992 -8484 -10429
12387 -10429 -9541 -23427 -10074 -2445 13440 33317 38215 38048 51181 44998 40206 41872 30840
12374 30840 48841 49546 49335 56960 68228 56876 49377 65977 74933 51808 54568 83695 97792
12361 97792 107707 108758 114196 132965 148326 168132 195268 221187 243227 242533 221287 214412 182146
12348 182146 159259 137225 118232 108322 102304 89586 92429 94518 90648 107355 124079 127484 117193
12335 117193 107120 112028 111974 99187 94115 94560 102748 118211 154584 168279 188099 208844 212693
$$ packed form
12429D800J7857J2451r885p563q684J934P540l76K894M09l097N18r94j3154R030
12414A3680l243p920J0497Q705j1j102j83n449j3566o574R304O486K4753P737
12400D3114j0595j6177l760P728J3472J4672J923r479k2750k5506o634N508j945
12387a0429Q88j3886J3353P629J5885J9877M898j67J3133o183m792J666j1032
12374C0840J8001P05k11P625J1268j1352p499J6600Q956k3125K760K9127J4097
12361I7792R915J051N438J8769J5361J9806K7136K5919K2040o94k1246o875l2266
12348A82146k2887k2034j8993r910o018j2718K843K089l870J6707J6724L405j0291
12335A17193j0073M908n4j2787n072M45Q188J5463L6373J3695J9820K0745L849
$$ plain form
12322 212693 211141 226009 236018 262495 255936 223790 202069 192827 170269 166827 171004 157524
12310 157524 145578 122930 110609 104035 101366 101268 116104 106582 78943 98658 121743 140449 173487
12297 173487 171884 173722 192418 210883 226052 244302 271805 315986 366420 408495 440555 478862
12285 478862 500799 497176 474803 426964 389368 357042 335937 298954 242262 222523 230875 241356
12273 241356 253663 252687 261154 241505 235946 223328 212408 214261 212353 223122 250683 259412 291636
12260 291636 320862 351152 401209 444425 468004 486935 507621 522126 506264 482434 456158
12249 456158 400065 359938 340282 300905 252505 220318 185386 168739 135807 116274 109268 105454
12237 105454 109985 92991 94441 80650 79870 83784 73054 83466 65846 47322 60707 71569
$$ packed form
12322B12693j552J4868J0009K6477o559l2146k1721r242k2558l442M177j3480
12310A57524j1946k2648j2321o574k669r8J4836r522k7639J9715K3085J8706L3038
12297A73487j603J838J8696J8465J5169J8250K7503M4181N0434M2075L2060L8307
12285D78862K1937l623k2373m7839l7596l2326k1105l6983n6692j9739Q352J0481
12273B41356J2307r76Q467j9649n559j2618j0920J853j908J0769K7561Q729L2224
12260B91636K9226L0290N0057M3216K3579J8931K0686J4505j5862k3830k6276
12249D56158n6093m0127j9656l9377m8400l2187l4932j6647l2932j9533p006l814
12237A05454M531j6994J450j3791p80L914j0730J0412j7620j8524J3385J0862
$$ plain form
12225 71569 82201 95299 90527 83171 70730 92478 92481 85044 90775 93773 108757 117190 111784 92627
12211 92627 103183 121209 122509 125022 145757 179390 210131 242704 287465 342024 402961 466749
12199 466749 517617 559421 567728 550969 511968 484011 434346 390481 331355 301104 289821 261326
12187 261326 228826 217070 200671 172950 163814 148615 155013 153529 160187 184815 188813 195198 182266
12174 182266 173647 169420 185185 208602 253851 277582 317649 353596 386645 428284 476865 511266
12162 511266 521723 556883 588231 565843 536546 497019 437915 389311 322339 263258 230720
12151 230720 210123 193775 188203 189713 177556 143419 133882 143162 156548 148752 127895 131544 139415
12138 139415 165247 183163 224716 254162 268663 286022 318287 361589 389563 436137 494263
$$ packed form
12225G1569J0632J3098m772p356j2441K1748Lp437N731K998J4984Q433n406j9157
12211I2627J0556J8026J300K513K0735L3633L0741L2573M4761N4559O0937O3788
12199D66749N0868M1804Q307j6759l9001k7957m9665m3865n9126l0251j1283k8495
12187B61326l2500j1756j6399k7721r136j5199O398j484O658K4628L998O385j2932
12174A82266q619m227J5765K3417M5249K3731M0067L5947L3049M1639M8581L4401
12162E11266J0457L5160L1348k2388k9297l9527n9104m8604o6972n9081l2538
12151B30720k0597j6348n572J510j2157l4137r537R280J3386p796k0857L649P871
12138A39415K5832J7916M1553K9446J4501J7359L2265M3302K7974M6574N8126
$$ plain form
12127 494263 517687 542812 520876 456614 398190 328303 270697 223728 191216 182747 166620 155348
12115 155348 133352 138593 147826 154689 156429 157850 135851 107331 89781 98192 121835 127792 141459
12102 141459 165152 183548 188921 201356 221594 262310 321035 351411 388224 444310 483478 527142
12090 527142 602516 619076 593512 537657 468221 388656 303916 244019 221220 203696 191532
12079 191532 169269 150494 145690 143373 166749 166339 147070 138633 134379 145957 174008 202861 218078
12066 218078 259841 329486 416701 532458 695196 914158 1187768 1493759 1718225 1754854
12056 1754854 1649929 1414345 1106152 840447 635285 503893 414562 354738 321270 296507
12046 296507 268067 240636 236644 230745 219693 214364 195159 195640 194568 199350 219570 247052 277507
$$ packed form
12127D94263K3424K5125k1936o4262n8424o9887n7606m6969l2512q469j6127j1272
12115A55348k1996N241R233O863J740J421k1999k8520j7550Q411K3643N957J3667
12102A41459K3693J8396N373J2435K0238M0716N8725L0376L6813N6086L9168M3664
12090E27142P5374J6560k5564n5855o9436p9565q4740n9897k2799j7524j2164
12079A91532k2263j8775m804k317K3376m10j9269q437m254J1578K8051K8853J5217
12066B18078M1763O9645Q7215J15757J62738K18962K73610L05991K24466L6629
12056A754854j04925k35584l08193k65705k05162j31392q9331n9824l3468k4763
12046B96507k8440k7431l992n899j1052n329j9205M81j072M782K0220K7482L0455
$$ plain form
12033 277507 311743 355833 409633 463518 548280 666152 827901 1047253 1382834 1830010
12023 1830010 2360650 2849504 3182025 3245639 3015745 2557666 2032135 1555506 1181373 919373
12013 919373 743057 600816 502545 433791 380812 330998 293873 255954 241546 218873 207391
12002 207391 188861 188884 178562 164962 158804 148213 136131 136064 146686 149280 151017 161664 181842
11989 181842 200140 205313 228270 254149 294210 354885 440415 527482 669433 854854 1061499
11978 1061499 1320446 1529539 1609766 1556923 1381690 1133891 891465 687103 547097 447947
11968 447947 379205 320622 281674 251586 229451 206804 171450 166394 182899 204084 206352 234697
11956 234697 275483 332965 402129 435807 433336 388139 323155 253340 201008 147027 114891 108158
$$ packed form
12033B77507L4236M4090N3800N3885Q4762J17872J61749K19352L35581M47176
12023A830010N30640M88854L32521O3614k29894m58079n25531m76629l74133k62000
12013I19373j76316j42241r8271o8754n2979m9814l7125l7919j4408k2673j1482
12002B07391j8530K3j0322j3600o158j0591j2082o7J0622K594J737J0647K0178
11989A81842J8298N173K2957K5879M0061O0675Q5530Q7067J41951J85421K06645
11978A061499K58947K09093Q0227n2843j75233k47799k42426k04362j40006r9150
11968D47947o8742n8583l8948l0088k2135k2647l5354n056J6505K1185K268K8345
11956B34697M0786N7482O9164L3678k471m5197o4984o9815n2332n3981l2136o733
$$ plain form
11944 108158 97072 76975 85188 93500 80427 70587 75867 90873 78291 57860 53076 48542 70493
11931 70493 81272 68535 60675 69532 64354 53400 44240 39703 31361 43052 48675 58301 69955
11918 69955 78551 85062 95552 121650 159481 193700 224386 262401 304362 363307 418262 436138
11906 436138 397797 327488 246407 184123 166102 154131 119354 110313 81084 56536 61384 64061
11894 64061 43083 37854 35218 35644 26850 27722 24982 14997 25855 22332 19338 13895 22908 32143
11880 32143 31880 20083 20600 28665 39302 42607 33508 19477 22460 33663 40321 36737 20300 19874
11866 19874 16019 10270 9779 15010 14631 7340 11302 21355 13246 21982 38932 50021 50968 37020
11852 37020 26785 28544 36881 48919 53049 37612 19685 21370 27848 27251 6685 -1568 13280
$$ packed form
11944A08158j1086k0097Q213Q312j3073r840N280J5006j2582k0431m784m534K1951
11931G0493J0779j2737p860Q857n178j0954r160m537q342J1691N623R626J1654
11918F9955Q596O511J0490K6098L7831L4219L0686L8015M1961N8945N4955J7876
11906D36138l8341p0309q1081o2284j8021j1971l4777r041k9229k4548M848K677
11894F4061k0978n229k636M26q794Q72k740r985J0858l523k994n443R013R235
11880C2143k63j1797N17Q065J0637L305r099j4031K983J1203O658l584j6437m26
11866A9874l855n749m91N231l79p291L962J0053q109Q736J6950J1089R47j3948
11852C7020j0235J759Q337J2038M130j5437j7927J685O478n97k0566q253J4848
$$ plain form
11839 13280 32373 23664 32170 52672 49751 26727 19171 32501 42935 30934 31631 24174 41591
11826 41591 53940 43682 43180 40069 17870 19371 7223 13220 26580 31933 19373 25358 31310
11813 31310 38353 30084 24480 47403 69854 59385 55709 46897 55448 35661 51377 73368 60045
11800 60045 28292 26854 32682 44912 48515 52201 59460 56202 29580 21382 11115 -6198 -1633
11787 -1633 23088 35292 43917 34220 38362 55606 42934 51152 67653 61774 32305 15134 17322
11774 17322 8860 4686 15141 22292 36649 36646 34156 23818 29391 27134 20212 21114 15084 11411 27680
11759 27680 36128 28062 32085 39404 33636 21396 15432 20488 36338 38834 23788 12062 14508
11746 14508 25035 23853 17011 30818 23798 41456 79752 83500 78172 93955 86433 77330 88053
$$ packed form
11839A3280J9093q709Q506K0502k921k3024p556J3330J0434j2001O97p457J7417
11826D1591J2349j0258n02l111k2199J501j2148N997J3360N353j2560N985N952
11813C1310P043q269n604K2923K2451j0469l676q812Q551j9787J5716K1991j3323
11800F0045l1753j438N828J2230L603L686P259l258k6622q198j0267j7313M565
11787a633K4721J2204Q625r697M142J7244j2672Q218J6501n879k9469j7171K188
11774A7322q462m174J0455P151J4357lk490j0338N573k257o922R02o030l673J6269
11759B7680Q448q066M023P319n768j2240n964N056J5850K496j5046j1726K446
11746A4508J0527j182o842J3807p020J7658L8296L748n328J5783p522r103J0723
$$ plain form
11733 88053 88374 95809 94044 79568 68206 68078 65273 64145 54164 52218 32714 15956 30599 34682
11719 34682 22242 27993 46166 35311 28235 24364 8109 -5574 19057 40082 56084 43614
11707 43614 15069 20277 25410 38205 49782 34821 23122 22457 50340 69907 67962 57344 68089
11694 68089 78946 48082 50648 69852 89428 113627 121579 103073 90546 92394 90512 92615 78247
11681 78247 82086 84440 84456 88830 90758 80451 52448 48625 59679 52431 65400 77498 81768 68015
11667 68015 37217 43110 42974 49932 48980 33501 37237 36929 33665 40303 58479 65472 55974 48985
11653 48985 43430 42851 32703 38602 57774 66467 53875 63611 69404 56607 52778 71360 74472
11640 74472 71263 58634 65125 66326 61873 49841 51457 41113 46445 71112 70857 59534 59169 80907
$$ packed form
11733H8053L21P435j765j4476j1362j28k805j128r981j946j9504j6758J4643M083
11719C4682j2440N751J8173j0855p076l871j6255j3683K4631K1025J6002j2470
11707D3614k8545N208N133J2795J1577j4961j1699o65K7883J9567j945j0618J0745
11694F8089J0857l0864K566J9204J9576K4199P952j8506j2527J848j882K103j4368
11681G8247L839K354J6M374J928j0307k8003l823J1054p248J2969J2098M270j3753
11667F8015l0798N893j36O958r52j5479L736l08l264O638J8176O993r498o989
11653D8985n555n79j0148N899J9172Q693j2592R736N793j2797l829J8582L112
11640G4472l209j2629O491J201m453j2032J616j0344N332K4667k55j1323l65K1738
$$ plain form
11626 80907 108345 124475 137362 120811 86978 90335 102452 99202 79346 78820 88643 96118 104243
11613 104243 106881 104834 104194 96224 83394 72702 86820 96571 86008 72217 85035 88875 81892
11600 81892 69667 72281 74703 71741 58738 71422 90618 90032 85601 92389 96160 91115 91701 83238
11586 83238 89268 101818 84299 79615 67760 60598 60915 43410 26402 28123 43072 59580 45204
11573 45204 29207 39688 51650 65349 88940 80232 61256 63260 48297 51758 55511 59658 66366
11560 66366 77168 83178 76814 81347 96205 97835 84598 83020 77052 72889 60730 77427 103382
11547 103382 123092 118766 107790 103969 101863 105495 125821 123371 103461 104095 109986 113027 98390
11534 98390 76409 65631 75162 83493 76275 81914 97620 102741 97640 89273 84196 89008 80987 87177
$$ packed form
11626H0907K7438J6130J2887j6551l3833L357J2117l250j9856n26R823P475Q125
11613A04243K638k047o40p970j2830j0692J4118R751j0563j3791J2818L840o983
11600H1892j2225K614K422k962j3003J2684J9196n86m431O788L771n045N86q463
11586H3238O030J2550j7519m684j1855p162L17j7505j7008J721J4949J6508j4376
11573D5204j5997J0481J1962J3699K3591q708j8976K004j4963L461L753M147O708
11560F6366J0802O010o364M533J4858J630j3237j578n968m163j2159J6697K5955
11547A03382J9710m326j0976l821k106L632K0326k450j9910O34N891L041j4637
11534I8390k1981j0778R531Q331p218N639J5706N121n101q367n077M812q021O190
$$ plain form
11520 87177 91382 76363 67875 63452 53550 57392 58329 43745 60770 77284 85464 83374 86843 82986
11506 82986 80072 93427 89617 90952 80814 77244 79874 63989 56025 61856 62461 51139 49619 60305
11492 60305 72077 58568 53181 62515 73928 61688 67497 70365 69418 73929 76993 70275 62903 71472
11478 71472 92765 93390 77719 81246 82321 73801 81787 70658 63771 78420 98127 95264 69709
11465 69709 63727 72784 73550 83445 78800 87536 97538 95321 87419 95906 95034 91729 93278 99100 110151
11450 110151 127501 146001 147790 131908 133209 150044 141101 131484 139737 137370 122960 121650 137381
11437 137381 136071 136012 127184 105469 108644 122518 143326 150396 140087 146779 136544 131867 126552
11424 126552 124717 120326 115279 128653 120616 125222 136557 128497 104157 99819 105982 103343 87455
$$ packed form
11520H7177M205j5019q488m423r902L842R37j4584J7025J6514Q180k090L469l857
11506H2986k914J3355l810J335j0138l570K630j5885p964N831O05j1322j520J0686
11492F0305J1772j3509n387R334J1413j2240N809K868r47M511L064o718p372Q569
11478G1472K1293O25j5671L527J075q520P986j1129o887J4649J9707k863k5555
11465F9709n982R057P66R895m645Q736J0002k217p902Q487q72l305J549N822J1051
11450A10151J7350J8500J789j5882J301J6835q943r617Q253k367j4410j310J5731
11437A37381j310n9q828k1715L175J3874K0808P070j0309O692j0235m677n315
11424A26552j835m391n047J3374q037M606J1335q060k4340m338O163k639j5888
$$ plain form
11411 87455 86897 99928 101046 89803 71156 70084 82170 109921 107192 84602 81942 88602 97968
11398 97968 106001 114386 123906 118212 109605 111976 123840 134407 130861 133469 143266 142769 135426 137712
11384 137712 123013 126915 133168 133757 129096 121559 129379 146099 148963 154677 167204 158696 155993 162282
11370 162282 168829 160744 179625 177249 171369 165465 172285 165998 162648 165936 158607 174711 207597
11357 207597 202657 196712 190646 173426 160310 152025 146247 160687 151745 141006 126439 125194 127448
11344 127448 141224 150515 144868 127255 101462 102446 119245 124175 130052 125650 124794 110818 113069
11331 113069 125167 114756 131681 141205 132809 142766 151523 128136 138834 155579 150189 157864 166133
11318 166133 171808 166164 155084 151710 150171 164627 172205 176612 162621 158519 174092 182613 186180
$$ packed form
11411H7455n58J3031J118j1243j8647j072J2086K7751k729k2590k660O660R366
11398I7968Q033Q385R520n694q607K371J1864J0567l546K608R797m97p343K286
11384A37712j4699L902O253N89m661p537P820J6720K864N714J2527q508k703O289
11370A62282O547q085J8881k376n880n904O820o287l350L288p329J6104L2886
11357B07597m940n945o066j7220j3116q285n778J4440q942j0739j4567j245K254
11344A27448J3776R291n647j7613k5793R84J6799M930N877m402q56j3976K251
11331A13069J2098j0411J6925R524q396R957Q757k3387J0698J6745n390P675Q269
11318A66133N675n644j1080l374j539J4456P578M407j3991m102J5573Q521L567
$$ plain form
11305 186180 174334 188722 190677 186407 182919 187468 203148 202777 203358 214786 213981 224134 218610 225633
11291 225633 248616 254290 260681 268681 276184 304107 340525 337985 342963 354115 370383 382553 396834
11278 396834 434606 479512 530736 564463 577809 591525 593529 584904 614806 623510 609811 596489
11266 596489 607380 632420 687015 744669 793474 852073 901348 945368 1004147 1100612 1227713
11255 1227713 1400332 1644037 1968802 2402151 2959554 3870358 5512500 8180705 10391331
11246 10391331 10332410 8621965 6205521 4303815 3232660 2653625 2308163 2080878 1920215
11237 1920215 1797931 1710285 1644240 1584404 1534750 1501827 1484058 1470270 1495086 1512291 1523745
11226 1523745 1533112 1564179 1614565 1673789 1728513 1796591 1904683 2024890 2149273 2308822 2521528
$$ packed form
11305A86180j1846J4388J955m270l488M549J5680l71N81J1428q05J0153n524P023
11291B25633K2983N674O391Q000P503K7923L6418k540M978J1152J6268J2170J4281
11278C96834L7772M4906N1224L3727J3346J3716K004q625K9902Q704j3699j3322
11266E96489J0891K5040N4595N7654M8805N8599M9275M4020N8779R6465J27101
11255A227713J72619K43705L24765M33349N57403R10804J642142K668205K210626
11246A0391331n8921j710445k416444j901706j071155n79035l45462k27285j60663
11237A920215j22284q7646o6045n9836m9654l2923j7769j3788K4816J7205J1454
11226A523745R367L1067N0386N9224N4724O8078J08092J20207J24383J59549K12706
$$ plain form
11215 2521528 2769145 3096492 3470026 3846505 4212440 4575080 4871094 5129782 5375370
11206 5375370 5593592 5820394 6089475 6427188 6838155 7272684 7695795 8062176 8330509
11197 8330509 8463707 8490419 8444880 8404628 8397567 8481613 8640701 8852583 9061117 9222467
11187 9222467 9284245 9243772 9155738 9065451 8986583 8964220 9023366 9141615 9254652 9312625 9269523
11176 9269523 9111266 8858284 8499051 8106630 7748622 7402436 7128026 6918448 6734374
11167 6734374 6523575 6266297 5961668 5593478 5174067 4759080 4399018 4049823 3730634
11158 3730634 3476702 3279115 3140084 3037018 2963935 2925748 2919614 2948784 3026486 3138918
11148 3138918 3315587 3539730 3816994 4147984 4495512 4841131 5178341 5470804 5735299
$$ packed form
11215B521528K47617L27347L73534L76479L65935L62640K96014K58688K45588
11206E375370K18222K26802K69081L37713M10967M34529M23111L66381K68333
11197H330509J33198K6712m5539m0252p061Q4046J59088K11882K08534J61350
11187I222467O1778m0473q8034r0287p8868k2363N9146J18249J13037N7973m3102
11176I269523j58257k52982l59233l92421l58008l46186k74410k09578j84074
11167F734374k10799k57278l04629l68190m19411m14987l60062l49195l19189
11158C730634k53932j97587j39031j03066p3083l8187o134K9170P7702J12432
11148C138918J76669K24143K77264L30990L47528L45619L37210K92463K64495
$$ plain form
11139 5735299 5981719 6224342 6456519 6747670 7104829 7509650 7945856 8391478 8796005
11130 8796005 9095159 9281485 9359177 9339599 9316821 9347828 9507390 9821807 10071195 10124267
11120 10124267 10040412 9877407 9748222 9623006 9459562 9264182 9093309 8981363 8917377 8904636
11110 8904636 8884825 8860737 8786730 8640833 8393998 8089013 7726727 7339138 6978659 6646582
11100 6646582 6329675 6016808 5672133 5289700 4905343 4478286 4057234 3633782 3235704
11091 3235704 2881240 2587391 2341013 2144921 2004332 1903682 1838392 1805262 1773087 1753937
11081 1753937 1747437 1774305 1860602 2014428 2209943 2458629 2815773 3296295 3987484 4945963
11071 4945963 6166475 7298237 7767747 7343471 6304407 5106389 4112074 3410291 2927297
$$ packed form
11139E735299K46420K42623K32177K91151L57159M04821M36206M45622M04527
11130H796005K99154J86326P7692j9578k2778L1007J59562L14417K49388N3072
11120A0124267q3855j63005j29185j25216j63444j95380j70873j11946o3986j2741
11110H904636j9811k4088p4007j45897k46835l04985l62286l87589l60479l32077
11100F646582l16907l12867l44675l82433l84357m27057m21052m23452l98078
11091C235704l54464k93849k46378j96092j40589j00650o5290l3130l2175j9150
11081A753937o500K6868Q6297J53826J95515K48686L57144M80522O91189R58479
11071D945963J220512J131762M69510m24276j039064j198018r94315p01783m82994
$$ plain form
11062 2927297 2604359 2400659 2269004 2181661 2138981 2098211 2097944 2143799 2240872 2358160 2518064
11051 2518064 2703493 2930023 3207970 3513835 3781020 3996813 4203411 4352447 4490535
11042 4490535 4607145 4731769 4857284 4971340 5083575 5183929 5243919 5278256 5301203 5340005
11032 5340005 5382683 5478419 5640535 5821887 6026318 6262028 6532283 6781294 7010718 7256835
11022 7256835 7491528 7722712 7969873 8225840 8454611 8614121 8706494 8733407 8695662 8618682
11012 8618682 8499359 8344931 8179304 8007184 7824988 7647805 7480788 7307290 7136496
11003 7136496 6963208 6784301 6599191 6407507 6232922 6103535 6025505 5982041 5989291 6021675
10993 6021675 6069104 6145022 6130103 5940005 5657186 5347926 5137876 5003512 4918545 4865950
$$ packed form
11062B927297l22938k03700j31655q7343m2680m0770k67M5855R7073J17288J59904
11051B518064J85429K26530K77947L05865K67185K15793K06598J49036J38088
11042D490535J16610J24624J25515J14056J12235J00354N9990L4337K2947L8802
11032E340005M2678R5736J62116J81352K04431K35710K70255K49011K29424K46117
11022G256835K34693K31184K47161K55967K28771J59510R2373K6913l7745p6980
11012H618682j19323j54428j65627j72120j82196j77183j67017j73498j70794
11003G136496j73288j78907j85110j91684j74585j29387p8030m3464P250L2384
10993F021675M7429P5918j4919j90098k82819l09260k10050j34364q4967n2595
$$ plain form
10983 4865950 4829189 4810367 4810247 4833209 4891336 4964139 5041830 5124553 5217018 5295652 5383179 5519366
10971 5519366 5659834 5791352 5924600 6055868 6140928 6218874 6263972 6264681 6288214 6338098 6438242
10960 6438242 6603057 6810260 7024201 7256415 7509056 7735512 7946904 8141477 8323544
10951 8323544 8499488 8650778 8817255 8995652 9146033 9284973 9377021 9398987 9363349 9246929
10941 9246929 9067866 8836929 8596270 8388842 8178012 7985722 7812080 7621802 7417830
10932 7417830 7174745 6908070 6623836 6375357 6147421 5963978 5858719 5784243 5732201 5670377
10922 5670377 5571220 5389958 5166552 4930392 4676019 4413297 4174567 3958304 3754915 3573275
10912 3573275 3351357 3113145 2885080 2665300 2431543 2214967 2035485 1888257 1770594
$$ packed form
10983D865950l6761j8822j20K2962N8127P2803P7691Q2723R2465P8634Q7527J36187
10971E519366J40468J31518J33248J31268Q5060P7946M5098P09K3533M9884J00144
10960F438242J64815K07203K13941K32214K52641K26456K11392J94573J82067
10951H323544J75944J51290J66477J78397J50381J38940R2048K1966l5638j16420
10941I246929j79063k30937k40659k07428k10830j92290j73642j90278k03972
10932G417830k43085k66675k84234k48479k27936j83443j05259p4476n2042o1824
10922E670377r9157j81262k23406k36160k54373k62722k38730k16263k03389j81640
10912C573275k21918k38212k28065k19780k33757k16576j79482j47228j17663
$$ plain form
10903 1770594 1670165 1586996 1489409 1398821 1311954 1236439 1172963 1112907 1044057 997497 964951
10892 964951 949851 927456 900617 882204 874892 879982 875562 852278 818314 805568 820116 843011
10880 843011 845718 840441 847002 854639 860564 867490 863896 897470 923716 924920 917569 921503 923193 934713
10866 934713 928588 926886 909695 888086 870694 852637 836137 806368 753501 718762 738446 735486
10854 735486 697296 695946 694542 685959 661719 663785 694026 720095 752750 838249 923247 1048529
10842 1048529 1249110 1518490 1761785 1767357 1578001 1298436 1034565 836431 703259 623828
10832 623828 566350 521688 501661 483236 473265 457534 433844 400717 390189 370242 364332 361687
10820 361687 366214 371503 361221 360618 381576 372773 351477 346818 346582 360917 372650 388962 384962
$$ packed form
10903A770594j00429q3169r7587r0588q6867p5515o3476o0056o8850m6560l2546
10892I64951j5100k2395k6839j8413p312N090m420k3284l3964j2746J4548K2895
10880H43011K707n277O561P637N925O926l594L3574K6246J204p351L934J690J1520
10866I34713o125j702j7191k1609j7392j8057j6500k9769n2867l4739J9684k960
10854G35486l8190j350j404q583k4240K066L0241K6069L2655Q5499Q4998J25282
10842A048529K00581K69380K43295N572j89356k79565k63871j98134j33172p9431
10832F23828n7478m4662k0027j8425r971j5731k3690l3127j0528j9947n910k645
10820C61687M527N289j0282o03K0958q803k1296m659k36J4335J1733J6312m000
$$ plain form
10807 384962 382766 379286 396553 410800 404784 386016 389843 388912 391307 402831 398326 405232 406862
10794 406862 402453 414013 410607 422326 420661 406433 396344 395742 395324 398345 392047 399852 414040
10781 414040 387598 362866 375918 378236 357636 337937 332275 350325 345713 335168 350396 361907
10769 361907 367596 355398 340741 340400 351747 362392 370504 378498 369587 370448 392200 405684 420111
10756 420111 435518 423384 411096 402091 382764 386221 397769 394439 394994 413311 406160 401648 390222
10743 390222 377680 397971 390294 397206 383259 360304 365301 380492 377833 361553 363318 372241 366831
10730 366831 361734 333074 333463 355589 369742 400119 414835 408318 423402 429181 436156 440500 447775
10717 447775 449086 438189 427964 422953 423315 403352 389947 401548 404020 405869 395487 385881 388298
$$ packed form
10807C84962k196l480J7267J4247o016j8768L827r31K395J1524m505O906J630
10794D06862m409J1560l406J1719j665j4228j0089o02m18L021o298P805J4188
10781D14040k6442k4732J3052K318k0600j9699n662J8050m612j0545J5228J1511
10769C61907N689j2198j4657l41J1347J0645Q112P994q911Q61K1752J3484J4427
10756D20111J5407j2134j2288r005j9327L457J1548l330N55J8317p151m512j1426
10743C90222j2542K0291p677O912j3947k2955M997J5191k659j6280J765Q923n410
10730C66831n097k8660L89K2126J4153L0377J4716o517J5084N779O975M344P275
10717D47775J311j0897j0225n011L62j9963j3405J1601K472J849j0382r606K417
$$ plain form
10704 388298 389294 397655 390455 391065 417022 403538 391845 380535 379935 390561 391541 394692 379863 356953
10690 356953 345228 337807 352006 384067 399659 390754 389347 381590 357501 334960 357299 390123
10678 390123 391222 420100 431274 418150 419636 421312 401193 357185 343839 334890 312244 307317
10666 307317 291221 260112 242012 230195 229331 210819 193075 196477 200553 202257 246178 245908 239889
10653 239889 248315 239080 223827 216541 219885 215415 202587 181792 178493 192645 208090 213805 212678
10640 212678 199426 197932 202394 217043 246473 262729 268077 256307 242165 238825 250637 269895
10628 269895 287821 313684 344157 364417 367758 385260 382370 361661 350366 333654 327521 332250
10616 332250 327985 310275 295146 274832 277979 290436 295099 315169 339876 353462 374265 397497
$$ packed form
10704C88298R96Q361p200O10K5957j3484j1693j1310o00J0626R80L151j4829k2910
10690C56953j1725p421J4199L2061J5592q905j407p757k4089k2541K2339L2824
10678C90123J099K8878J1174j3124J486J676k0119m4008j3346q949k2646m927
10666C07317j6096l1109j8100j1817q64j8512j7744L402M076J704M3921k70o019
10653B39889Q426r235j5253p286L344m470j2828k0795l299J4152J5445N715j127
10640B12678j3252j494M462J4649K9430J6256N348j1770j4142l340J1812J9258
10628B69895J7926K5863L0473K0260L341J7502k890k0709j1295j6712o133M729
10616C32250m265j7710j5129k0314L147J2457M663K0070K4707J3586K0803K3232
$$ plain form
10604 397497 418774 407806 390989 397028 399716 414328 428575 422497 422005 439535 455231 466531
10592 466531 495778 506997 519759 524543 532282 554810 578024 650268 718839 793582 891604 1026250
10580 1026250 1214659 1445071 1716315 1946859 2034008 1961221 1763949 1600670 1564429 1645818
10570 1645818 1756592 1792895 1734918 1609836 1440866 1282931 1167357 1084258 1013467 970721
10560 970721 938913 927103 936716 940988 915876 931006 947315 985140 1032411 1104272 1216665 1311236
10548 1311236 1346417 1326757 1273314 1203977 1163430 1153664 1150323 1149339 1202813 1262623 1319274 1355985
10536 1355985 1436803 1554111 1720430 1923111 2135744 2347777 2541748 2698846 2776177 2736109
10526 2736109 2613154 2473752 2358575 2287820 2285204 2343751 2430196 2521416 2635982 2757403
$$ packed form
10604C97497K1277j0968j6817O039K688J4612J4247o078m92J7530J5696J1300
10592D66531K9247J1219J2762M784P739K2528K3214P2244O8571P4743R8022J34646
10580A026250J88409K30412K71244K30544Q7149p2787j97272j63279l6241Q1389
10570A645818J10774L6303n7977j25082j68970j57935j15574q3099p0791m2746
10560I70721l1808j1810R613M272k5112J5130J6309L7825M7271P1861J12393R4571
10548A311236L5181j9660n3443o9337m0547r766l341r84N3474N9810N6651L6711
10536A355985Q0818J17308J66319K02681K12633K12033J93971J57098P7331m0068
10526B736109j22955j39402j15177p0755k616N8547Q6445R1220J14566J21421
$$ plain form
10516 2757403 2896459 3070384 3272873 3560857 3914191 4301851 4707952 5187000 5727039
10507 5727039 6355954 7097230 7979242 9065444 10448138 12221429 14486748 17382423 21128825
10498 21128825 25729979 30727457 35196952 38277470 39672817 39919835 39880728 40017738 39946055
10489 39946055 38811604 36092609 31986583 27274735 22812143 19088494 16225302 14108615
10481 14108615 12533923 11348087 10453076 9728553 9150713 8731814 8416454 8184525 8061744
10472 8061744 8059371 8155958 8346895 8605427 8984945 9505535 10200979 11104700 12226465 13633698
10462 13633698 15417835 17644505 20361095 23600464 27239649 31002055 34528275 37415847
10454 37415847 39380177 40431494 40810032 40912985 40912663 40654130 39726768 37775242 34812532
$$ packed form
10516B757403J39056J73925K02489K87984L53334L87660M06101M79048N40039
10507E727039O28915P41276Q82012J086202J382694J773291K265319K895675L746402
10498B1128825M601154M997478M469495L080518J395347K47018l9107J37010p1683
10489C9946055j134451k718995m106026m711848m462592l723649k863192k116687
10481A4108615j574692j185836q95011p24523n77840m18899l15360k31929j22781
10472H061744k373R6587J90937K58532L79518N20590O95444R03721J121765J407233
10462A3633698J784137K226670K716590L239369L639185L762406L526220K887572
10454C7415847J964330J051317L78538J02953l22k58533r27362j951526k962710
$$ plain form
10445 34812532 31219226 27527491 24211708 21556870 19693924 18619902 18104249 17876493
10437 17876493 17870440 18129641 18735396 19822263 21632540 24462434 28738174 34904510 43445311
10428 43445311 55013441 70947568 94417729 131022169 185015014 243021576 269335959
10421 269335959 250529966 201446662 145551500 102249380 74193117 56427451 44649727
10414 44649727 36297573 30036959 25176138 21310283 18201805 15716244 13771812 12372090
10406 12372090 11359815 10493677 9566914 8527392 7482529 6577884 5865456 5319153 4873717
10397 4873717 4483231 4119807 3814127 3559655 3342203 3152561 2982928 2871428 2792157 2699447
10387 2699447 2607588 2515765 2417817 2361491 2339694 2346595 2397008 2513955 2677589 2872243 3032842
$$ packed form
10445C4812532l593306l691735l315783k654838j862946j074022n15653k27756
10437A7876493o053K59201O05755J086867J810277K829894M275740O166336Q540801
10428D3445311J1568130J5934127K3470161L6604440N3992845N8006562K6314383
10421B69335959j8805993m9083304n5895162m3302120k8056263j7765666j1777724
10414D4649727q352154o260614m860821l865855l108478k485561j944432j399722
10406A2372090j012275q66138r26763j039522j044863r04645p12428n46303m45436
10397D873717l90486l63424l05680k54472k17452j89642j69633j11500p9271r2710
10387B699447r1859r1823r7948n6326k1797O901N0413J16947J63634J94654J60599
$$ plain form
10376 3032842 3150334 3176634 3122034 2977186 2773943 2522488 2246648 1992092 1786659 1620258
10366 1620258 1529643 1469653 1401109 1340056 1290940 1236608 1180403 1105540 1038811 978996 939627
10355 939627 904963 870015 821833 782334 755216 746710 727238 729521 722071 731708 765042 759311
10343 759311 762754 755873 750926 724188 707053 723165 748403 737823 743189 757426 766945 779721
10331 779721 794952 789907 742698 703338 684302 668266 664783 694570 760132 852581 927771 1010407
10319 1010407 1061644 1036700 964975 867871 768174 676853 605900 547468 522881 530988 535098 536611
10307 536611 530010 531672 553349 553707 553992 553292 565738 572847 552222 513112 448475 365124 294498
10294 294498 284826 342317 418066 508140 601528 692870 792907 930458 1004083 964313 885272
$$ packed form
10376C032842J17492K6300n4600j44848k03243k51455k75840k54556k05433j66401
10366A620258r0615n9990o8544o1053m9116n4332n6205p4863o6729n9815l9369
10355I39627l4664l4948m8182l9499k7118q506j9472K283p450R637L3334n731
10343G59311L443o881m947k6738j7135J6112K5238j0580N366J4237R519J2776
10331G79721J5231n045m7209l9360j9036j6036l483K9787O5562R2449P5190Q2636
10319A010407N1237k4944p1725r7104r9697r1321p0953n8432k4587Q107M110J513
10307E36611o601J662K1677L58K85p00J2446P109k0625l9110o4637q3351p0626
10294B94498r672N7491P5749R0074R3388R1342J00037J37551P3625l9770p9041
$$ plain form
10283 885272 797439 720323 675319 671520 709998 780800 855495 944973 1016290 1073001 1063672 1014150
10271 1014150 950391 855159 777916 713942 669774 639295 647051 641751 641558 637685 618655 614451
10259 614451 605060 579925 567549 578397 585971 585997 574394 574163 592341 615418 626631 642019 655569
10246 655569 669346 680506 702690 745992 798750 854163 866650 854955 847675 829413 849460 875959
10234 875959 937981 957203 963838 1017741 1075055 1108106 1106987 1064119 1014565 986028 964327 945680
10222 945680 940011 951325 989651 1020506 1073515 1143406 1202371 1235193 1248955 1255535 1283261 1337617
10210 1337617 1390717 1436773 1488396 1551113 1646331 1764495 1897340 2000186 2077333 2173556 2291070
10199 2291070 2447622 2646254 2895117 3242149 3664088 4190173 4858053 5769180 7120571
$$ packed form
10283H85272q7833p7116m5004l799L8478P0802P4695Q9478P1317N6711r329m9522
10271A014150o3759r5232p7243o3974m4168l0479P756n300j93l873j9030m204
10259F14451r391k5135j2376J0848P574K6j1603k31J8178K3077J1213J5388J3550
10246F55569J3777J1160K2184M3302N2758N5413J2487j1695p280j8262K0047K6499
10234H75959O2022J9222O635N3903N7314L3051j119m2868m9554k8537k1701j8647
10222I45680n669J1314L8326L0855N3009O9891N8965L2822J3762O580K7726N4356
10210A337617N3100M6056N1623O2717R5218J18164J32845J02846P7147R6223J17514
10199B291070J56552J98632K48863L47032M21939N26085O67880R11127J351391
$$ plain form
10190 7120571 9220225 12535039 16724070 19390649 18920710 16186105 12822110 10359719
10182 10359719 9102628 8639143 8652255 9038485 9793805 10853788 11865265 12646845 13347611
10173 13347611 14255522 15644915 17732114 20780805 25141922 31266210 39742444 51170624
10165 51170624 66478242 87590851 118228240 164350291 225419406 275149921 280902547
10158 280902547 244071586 185429677 130232119 91533206 67114509 51548331 41124345
10151 41124345 33690133 28084441 23658701 20099394 17267482 15118640 13651952 12744975
10143 12744975 12080418 11237210 10103584 8808562 7525183 6467179 5676982 5097969 4633264
10134 4633264 4213639 3849308 3536692 3268028 3051698 2890452 2744179 2611848 2494559
$$ packed form
10190G120571K099654L314814M189031K666579m69939k734605l363995k462391
10182A0359719j257091m63485J3112L86230P55320J059983J011477P81580P00766
10173A3347611R07911J389393K087199L048691M361117O124288Q476234J1428180
10165E1170624J5307618K1112609L0637389M6122051O1069115M9730515N752626
10158B80902547l6830961n8641909n5197558l8698913k4418697j5566178j0423986
10151D1124345p434212n605692m425740l559307k831912k148842j466688r06977
10143A2744975o64557q43208j133626j295022j283379j058004p90197n79013m64705
10134D633264m19625l64331l12616k68664k16330j61246j46273j32331j17289
$$ plain form
10125 2494559 2383342 2271530 2159736 2049351 1931420 1846616 1765254 1643999 1520320 1436066
10115 1436066 1371368 1331531 1298350 1231638 1158317 1111339 1079092 1074078 1055390 1036520 1000341
10104 1000341 937230 905453 914638 895385 862540 846631 831369 797614 762464 742906 743937 749158
10092 749158 755377 755437 742612 725032 726339 749250 768946 807310 830704 846993 858084 861965 846778
10079 846778 838235 838777 880936 883760 877455 873703 879974 886883 919902 980830 1071765 1187220 1317588
10066 1317588 1513654 1796052 2172228 2529090 2659310 2519021 2252915 1992473 1889056
10057 1889056 1949096 2141791 2510151 3105933 3997903 5172233 6426106 7321677 7497155
10048 7497155 6839830 5679793 4406261 3328794 2574347 2069218 1749314 1515380 1362146
$$ packed form
10125B494559j11217j11812j11794j10385j17931q4804q1362j21255j23679q4254
10115A436066o4698l9837l3181o6712p3321m6978l2247n014j8688j8870l6179
10104A000341o3111l1777R185j9253l2845j5909j5262l3755l5150j9558J031N221
10092G49158O219O0j2825j7580J307K2911J9696L8364K3394J6289J1091L881j5187
10079H46778q543N42M2159K824o305l752O271O909L3019O0928R0935J15455J30368
10066A317588J96066K82398L76176L56862J30220j40289k66106k60442j03417
10057A889056O0040J92695L68360N95782Q91970J174330J253873Q95571J75478
10048G497155o57325j160037j273532j077467p54447n05129l19904k33934j53234
$$ plain form
10039 1362146 1256817 1187022 1136773 1080835 1036550 952183 860698 804469 769347 761075 740762
10028 740762 728681 723397 691697 650355 619331 574792 545549 513881 499973 501900 509704 524279
10016 524279 558980 580956 599791 649029 740116 831944 956092 1102942 1241699 1349955 1384636
10005 1384636 1366657 1320179 1290521 1330052 1455761 1660412 1859792 1925330 1772192 1491248
9995 1491248 1193787 964234 810642 718074 653367 594601 568098 536257 526691 518847 562611
9984 562611 636576 713196 825798 989716 1135195 1200586 1188900 1100554 982048 876530 794992
9973 794992 731467 701552 679982 665971 687543 729045 797670 889759 997326 1104379 1181937
9962 1181937 1238419 1291804 1324988 1349503 1365921 1375725 1375433 1358832 1301147 1211758 1115728 996822
$$ packed form
10039A362146j05329o9795n0249n5938m4285q4367r1485n6229l5122q272k0313
10028G40762j2081n284l1700m1342l1024m4539k9243l1668j3908J927P804J4575
10016E24279L4701K1976J8835M9238R1087R1828J24148J46850J38757J08256L4681
10005A384636j7979m6478k9658L9531J25709K04651J99380O5538j53138k80944
9995A491248k97461k29553j53592r2568o4707n8766k6503l1841r566p844M3764
9984E62611P3965P6620J12602J63918J45479O5391j1686q8346j18506j05518q1538
9973G94992o3525k9915k1570j4011K1572M1502O8625R2089J07567J07053P7558
9962A181937N6482N3385L3184K4515J6418R804k92j6601n7685q9389r6030j18906
$$ plain form
9950 996822 895402 813277 752526 721274 668160 637310 624249 588639 551701 538895 532218 503371
9938 503371 479620 490644 508398 537452 576899 601993 643061 696711 745859 804123 879402 943198
9926 943198 1000354 1061862 1094912 1053051 961776 870906 790455 717841 652903 609481 569254 539364
9914 539364 499311 463863 456920 418603 386158 371868 367323 371696 383406 403117 393528 392860 417810
9901 417810 461213 484377 511540 537513 562104 569448 544861 517149 494639 482284 484737 501993
9889 501993 512123 540831 569312 588529 614802 620247 614889 598491 581455 570305 574112 575735
9877 575735 589273 607625 603361 587151 564842 561547 554256 538094 516138 506629 475867 472033 460119
9864 460119 442921 427862 407048 388560 385614 386836 380330 388355 403362 433631 452592 477240
$$ packed form
9950I96822j01420q2125o0751l1252n3114l0850j3061l5610l6938j2806o677k8847
9938E03371k3751J1024J7754K9054L9447K5094M1068N3650M9148N8264P5279O3796
9926I43198N7156O1508L3050m1861r1275r0870q0451p2614o4938m3422m0227k9890
9914E39364m0053l5448o943l8317l2445j4290m545M373J1710J9711r589o68K4950
9901D17810M3403K3164K7163K5973K4591P344k4587k7712k2510j2355K453J7256
9889E01993J0130K8708K8481J9217K6273N445n358j6398j7036j1150L807J623
9877E75735J3538J8352m264j6210k2309l295p291j6162k1956r509l0762l834j1914
9864D60119j7198j5059k0814j8488k946J222o506Q025J5007L0269J8961K4648
$$ plain form
9852 477240 538711 582729 604115 636836 654493 662128 650573 628659 587972 517863 466425 467215
9840 467215 487164 482052 475890 456859 442479 455618 457972 459814 472860 484383 491394 487514 476599
9827 476599 461567 465256 464843 461982 465195 462811 465203 492151 501901 521256 544896 590040 616516
9814 616516 654751 693483 703551 686998 671495 650261 620338 613873 606778 604702 601839 599172 601590
9801 601590 604050 604383 605496 612347 618247 642132 671194 671569 657074 642977 635926 613743 598019
9788 598019 609014 610809 605735 581590 575473 579643 603609 647880 703169 783497 903143 1063012
9776 1063012 1350551 1868177 2625796 2991580 2807340 2283003 1679413 1273740 1034286 918206
9766 918206 874697 859461 841711 799550 767015 726424 660187 633818 625896 622390 616075 623652
$$ packed form
9852D77240O1471M4018K1386L2721J7657P635j1555k1914m0687p0109n1438P90
9840D67215J9949n112o162j9031j4380J3139K354J842J3046J1523P011l880j0915
9827D76599j5032L689m13k861L213k384K392K6948R750J9355K3640M5144K6476
9814F16516L8235L8732J0068j6553j5503k1234k9923o465p095k076k863k667K418
9801F01590K460L33J113O851N900K3885K9062L75j4495j4097p051k2183j5724
9788E98019J0995J795n074k4145o117M170K3966M4271N5289Q0328J19646J59869
9776A063012K87539N17626P57619L65784j84240n24337o03590m05673k39454j16080
9766I18206m3509j5236j7750m2161l2535m0591o6237k6369p922l506o315P577
$$ plain form
9754 623652 651788 664595 676083 705895 721626 736688 768043 792639 820623 848787 871227 922356
9742 922356 1003272 1122888 1264526 1460695 1702729 1931413 2010171 1879857 1635348 1411817
9732 1411817 1229340 1120788 1071275 1059652 1083199 1160080 1271237 1367297 1409273 1399375 1340892
9721 1340892 1248977 1150590 1067670 988991 904457 812842 745619 701687 697367 688013 697254 724504
9709 724504 758847 772525 775340 780816 805082 834890 860320 881196 898846 895105 882516 850082
9697 850082 837151 845572 836913 839584 830447 829381 834239 854622 857300 834916 813728 814515 803616
9684 803616 801046 805226 829810 867613 910121 936216 957613 964390 949546 936224 942386 954662
9672 954662 928256 900931 869203 837527 823868 833736 853677 881552 885314 880679 870151 846336
$$ packed form
9754F23652K8136J2807J1488K9812J5731J5062L1355K4596K7984K8164K2440N1129
9742I22356Q0916J19616J41638J96169K42034K28684P8758j30314k44509k23531
9732A411817j82477j08552m9513j1623K3547P6881J11157R6060M1976r898n8483
9721A340892r1915r8387q2920p8679q4534r1615o7223m3932m320r354R241K7250
9709G24504L4343J3678K815N476K4266K9808K5430K0876J7650l741j2589l2434
9697H50082j2931Q421q659K671r137j066M858K0383K678k2384k1188P87j0899
9684H03616k570M180K4584L7803M2508K6095K1397O777j4844j3322O162J2276
9672I54662k6406k7325l1728l1676j3659R868J9941K7875L762m635j0528k3815
$$ plain form
9660 846336 832686 847150 868082 880517 863821 835538 832102 818203 809900 792962 771549 777415
9648 777415 791820 792339 833483 883769 927413 984367 1034898 1096230 1123569 1137080 1141657 1158051
9636 1158051 1209988 1276886 1351055 1425480 1521000 1616756 1736474 1873484 2046786 2269749 2535939
9625 2535939 2863767 3257908 3707012 4213727 4788963 5376342 5893863 6295195 6505270 6482742
9615 6482742 6252579 5861859 5360681 4875011 4472098 4145712 3941203 3816121 3771429 3819891
9605 3819891 3977656 4227229 4556970 4974010 5443249 5931851 6405985 6808133 7068990 7105651
9595 7105651 6907837 6505925 5932140 5292587 4663091 4103330 3623786 3222076 2877802 2629958
9585 2629958 2435992 2271698 2158546 2068167 1989863 1940052 1899210 1863863 1842354 1838746 1839414
$$ packed form
9660H46336j3650J4464K0932J2435j6696k8283l436j3899q303j6938k1413N866
9648G77415J4405N19M1144N0286M3644N6954N0531O1332K7339J3511M577J6394
9636A158051N1937O6898P4169P4425R5520R5756J19718J37010J73302K22963K66190
9625B535939L27828L94141M49104N06715N75236N87379N17521M01332K10075k2528
9615F482742k30163l90720n01178m85670m02913l26386k04509j25082m4692M8462
9605C819891J57765K49573L29741M17040M69239M88602M74134M02148K60857L6661
9595G105651j97814m01912n73785o39553o29496n59761m79544m01710l44274k47844
9585B629958j93966j64294j13152r0379p8304m9811m0842l5347k1509l608O68
$$ plain form
9574 1839414 1842118 1847111 1835585 1816559 1833182 1857458 1901578 1967035 2037981 2117918 2200315 2293470
9562 2293470 2429045 2595358 2824744 3065992 3334689 3677984 4091324 4583911 5166699 5889595
9552 5889595 6755453 7744420 8849338 9996693 11076410 11938720 12429071 12507331 12202861
9543 12202861 11617248 10829139 10011884 9347451 8849802 8555556 8454861 8480925 8607325 8858037
9533 8858037 9267106 9835854 10588805 11472220 12401018 13238662 13842547 14075090 13868882 13202924
9523 13202924 12185887 10996431 9801497 8714670 7835181 7212511 6781297 6492467 6249820
9514 6249820 5956657 5597994 5185716 4767244 4376810 4052939 3809268 3640800 3481480 3346662
9504 3346662 3263657 3206582 3160899 3166647 3228275 3316612 3444883 3650652 3939702 4257941 4511925
$$ packed form
9574A839414K704M993j1526j9026J6623K4276M4120O5457P0946P9937Q2397R3155
9562B293470J35575J66313K29386K41248K68697L43295M13340M92587N82788P22896
9552E889595Q65858R88967J104918J147355J079717Q62310M90351P8260l04470
9543A2202861n85613p88109q17255o64433m97649k94246j00695K6064J26400K50712
9533H858037M09069N68748P52951Q83415R28798Q37644O03885K32543k06208o65958
9523A3202924j017037j189456j194934j086827q79489o22670m31214k88830k42647
9514F249820k93163l58663m12278m18472l90434l23871k43671j68468j59320j34818
9504C346662q3005n7075m5683N748O1628Q8337J28271K05769K89050L18239K53984
$$ plain form
9493 4511925 4618478 4587052 4460584 4298292 4142074 4051980 4043748 4116230 4281082 4547440
9483 4547440 4882315 5324199 5869309 6522910 7311195 8194192 9119285 9979278 10711218 11284214
9473 11284214 11640243 11668562 11290726 10568380 9696159 8868096 8167400 7662015 7376088 7321674
9463 7321674 7463196 7777851 8265521 8887006 9586747 10247619 10786477 11121464 11247619 11229815
9453 11229815 11121117 11018681 10905700 10740938 10458659 9994025 9381593 8730686 8114236
9444 8114236 7499616 6903054 6353717 5924577 5626281 5399772 5291937 5290506 5382602 5547118
9434 5547118 5800974 6183707 6687724 7305089 7910803 8370772 8567514 8503273 8274057 7993941
9424 7993941 7735436 7459019 7167722 6904395 6708978 6638611 6701605 6920185 7251901 7678864
$$ packed form
9493D511925J06553l1426j26468j62292j56218r0094q232P2482J64852K66358
9483D547440L34875M41884N45110O53601P88285Q82997R25093Q59993P31940N72996
9473A1284214L56029K8319l77836p22346q72221q28063p00696n05385k85927n4414
9463G321674J41522L14655M87670O21485O99741O60872N38858L34987J26155j7804
9453A1229815j08698j02436j12981j64762k82279m64634o12432o50907o16450
9444H114236o14620n96562n49337m29140k98296k26509j07835j431R2096J64516
9434E547118K53856L82733N04017O17365O05714M59969J96742o4241k29216k80116
9424G993941k58505k76417k91297k63327j95417p0367O2994K18580L31716M26963
$$ plain form
9414 7678864 8183450 8739628 9377321 10115782 10970029 11916935 12848932 13557156 13838192 13655056
9404 13655056 13156836 12515078 11847618 11253100 10771659 10436307 10306333 10407407 10695505
9395 10695505 11098037 11530595 11952656 12359135 12824438 13337735 13877257 14390365 14855498
9386 14855498 15190372 15303223 15122536 14677136 14106291 13559036 13146888 12835591 12628176
9377 12628176 12474381 12395992 12390363 12455479 12539482 12612823 12595817 12468495 12271734 12052086 11859645
9366 11859645 11627806 11328356 10971324 10666508 10536039 10573306 10814198 11266792 11872248 12520833
9356 12520833 13047651 13229058 12939267 12332226 11633172 11062903 10721040 10505915 10363487
9347 10363487 10232649 10079153 9854262 9590739 9325671 9103809 8991255 8984537 9110928 9384461
$$ packed form
9414G678864N04586N56178O37693P38461Q54247R46906R31997P08224K81036j83136
9404A3655056m98220o41758o67460n94518m81441l35352j29974J01074K88098
9395A0695505M02532M32558M22061M06479M65303N13297N39522N13108M65133
9386A4855498L34874J12851j80687m45400n70845n47255m12148l11297k07415
9377A2628176j53795p8389n629O5116Q4003P3341j7006j27322j96761k19648j92441
9366A1859645k31839k99450l57032l04816j30469L7267K40892M52594O05456O48585
9356A2520833N26818J81407k89791o07041o99054n70269l41863k15125j42428
9347A0363487j30838j53496k24891k63523k65068k21862j12554o718J26391K73533
$$ plain form
9337 9384461 9816546 10423688 11130485 11752792 12155582 12282357 12151426 11884918 11488362 10994046
9327 10994046 10459061 9954067 9597618 9532865 9766119 10235244 10841283 11501604 12080306 12539457
9317 12539457 12890752 13203901 13597387 14157081 14870788 15627266 16235690 16466951 16216794
9308 16216794 15521531 14500338 13427602 12546394 12061635 12052650 12443582 13088892 13925475
9299 13925475 14822022 15548736 15896917 15797998 15394622 14920108 14562442 14371023 14227227 13952741
9289 13952741 13448972 12633424 11638426 10634603 9783731 9199293 8892927 8851622 9028274
9280 9028274 9362706 9738631 10044025 10169932 10012735 9631250 9159704 8748261 8455149 8242670
9270 8242670 8062083 7914687 7760620 7661877 7702475 7972314 8473339 9079545 9563360 9683195
$$ packed form
9337I384461M32085O07142P06797O22307M02790J26775j30931k66508l96556m94316
9327A0994046n34985n04994l56449o4753K33254M69125O06039O60321N78702M59151
9317A2539457L51295L13149L93486N59694P13707P56478O08424K31261k50157
9308A6216794o95263j021193j072736q81208m84759q985L90932O45310Q36583
9299A3925475Q96547P26714L48181r8919m03376m74514l57666j91419j43796k74486
9289A3952741n03769q15548r94998j003823q50872n84438l06366m1305J76652
9280I028274L34432L75925L05394J25907j57197l81485m71546m11443k93112k12479
9270H242670j80587j47396j54067r8743M0598K69839N01025O06206M83815J19835
$$ plain form
9260 9683195 9412033 8863331 8211504 7613983 7118861 6706580 6380106 6151982 6054507 6095601
9250 6095601 6276575 6636374 7175999 7977956 9090871 10558320 12288417 13938152 15003043
9241 15003043 15148113 14412042 13179620 11937658 11084996 10726370 10783358 11060351 11343061
9232 11343061 11565710 11792688 12174586 12905687 14068922 15506088 16971902 18287779 19475019
9223 19475019 20608299 21644989 22380301 22755053 22899228 23113458 23685940 24670702 25858922
9214 25858922 26804120 27014378 26198770 24481880 22300231 20081013 18168680 16754723 15916507
9205 15916507 15634917 15840490 16292569 16635226 16687397 16452968 16121414 15836141 15535611 15208332
9195 15208332 14948369 14716506 14364168 13683516 12590853 11279292 9946508 8776007 7854639
$$ packed form
9260I683195k71162n48702o51827n97521m95122m12281l26474k28124r7475M1094
9250F095601J80974L59799N39625Q01957J112915J467449J730097J649735J064891
9241A5003043J45070p36071j232422j241962q52662l58626N6988K76993K82710
9232A1343061K22649K26978L81898P31101J163235J437166J465814J315877J187240
9223A9475019J133280J036690P35312L74752J44175K14230N72482R84762J188220
9214B5858922R45198K10258q15608j716890k181649k219218j912333j413957q38216
9205A5916507k81590K05573M52079L42657N2171k34429l31554k85273l00530l27279
9195A5208332k59963k31863l52338o80652j092663j311561j332784j170501r21368
$$ plain form
9186 7854639 7171083 6684138 6328153 6091379 5943517 5889311 5914963 6053770 6306645 6722370
9176 6722370 7302209 8016092 8696233 9061732 8965048 8479568 7828145 7264680 6891471 6737920
9166 6737920 6743512 6858025 7050260 7334331 7759427 8311316 9036542 9952953 10979427 11981342
9156 11981342 12925564 13990678 15276800 16829663 18525542 20093585 21300069 22032849
9148 22032849 22357390 22316656 21918399 21191723 20240979 19179175 18035532 16875897 15649896
9139 15649896 14373367 13183301 12175925 11395046 10866697 10573820 10436301 10495576 10860475
9130 10860475 11596874 12638885 13634287 14087402 13720711 12616145 11166746 9734393 8553770
9121 8553770 7647514 7032599 6672060 6526176 6506153 6461322 6307598 6067141 5861511 5721711
$$ packed form
9186G854639o83556m86945l55985k36774j47862n4206K5652J38807K52875M15725
9176F722370N79839P13883O80141L65499r6684m85480o51423n63465l73209j53551
9166F737920N592J14513J92235K84071M25096N51889P25226R16411J026474J001915
9156A1981342R44222J065114J286122J552863J695879J568043J206484P32780
9148B2032849L24541m0734l98257p26676r50744j061804j143643j159635j226001
9139A5649896j276529j190066j007376p80879n28349k92877j37519N9275L64899
9130A0860475P36399J042011R95402M53115l66691j104566j449399j432353j180623
9121H553770r06256o14915l60539j45884k0023m4831j53724k40457k05630j39800
$$ plain form
9111 5721711 5640308 5614218 5669782 5854331 6232631 6866429 7646560 8304337 8515932 8150584
9101 8150584 7384278 6499415 5744136 5210344 4873053 4717069 4672710 4683475 4778264 4979965
9091 4979965 5258904 5671188 6197445 6785921 7402523 8048966 8675308 9279276 9844917 10357033
9081 10357033 10745095 11004144 11013820 10659824 9973685 9119378 8312420 7632824 7161928 6892038
9071 6892038 6788324 6774264 6735200 6592989 6256867 5776801 5281527 4882897 4633805 4513917
9061 4513917 4550894 4738954 5043561 5507528 6132708 6816617 7347898 7496926 7209831 6633070
9051 6633070 5988364 5460973 5128500 5042007 5173287 5464834 5797767 6044445 6084725 5850292
9041 5850292 5397542 4887002 4420586 4074477 3846980 3716226 3694544 3780452 3985627 4235324
$$ packed form
9111E721711q1403k6090N5564J84549L78300O33798P80131O57777K11595l65348
9101H150584p66306q84863p55279n33792l37291j55984m4359J0765R4789K01701
9091D979965K78939M12284N26257N88476O16602O46443O26342O03968N65641N12116
9081A0357033L88062K59049R676l53996o86139q54307q06958o79596m70896k69890
9071F892038j03714j4060l9064j42211l36122m80066m95274l98630k49092j19888
9061D513917L6977J88060L04607M63967O25180O83909N31281J49028k87095n76761
9051F633070o44706n27391l32473q6493J31280K91547L32933K46678M0280k34433
9041E850292m52750n10540m66416l46109k27497j30754k1682Q5908K05175K49697
$$ plain form
9031 4235324 4431503 4434687 4203928 3852989 3487329 3199717 3029967 2940460 2912500 2949962
9021 2949962 3027700 3143969 3207374 3145944 2980706 2749841 2501016 2281879 2097813 1931276
9011 1931276 1785772 1666870 1579963 1494783 1398267 1329833 1280839 1249892 1255541 1277599 1288215
9000 1288215 1313424 1395353 1525945 1708462 1942279 2088419 2090328 1973872 1789414 1589857
8990 1589857 1465565 1388366 1354307 1349198 1353502 1332619 1308652 1277271 1261732 1251245 1287156 1321688
8978 1321688 1366000 1435895 1537060 1715858 1963013 2276048 2622205 2895232 2948528 2777793
8968 2777793 2460425 2130858 1852128 1625842 1464117 1383630 1304003 1253376 1224587 1203875
8958 1203875 1196486 1190877 1187320 1206337 1223940 1243812 1294698 1351739 1414649 1490919 1586646 1679969
$$ packed form
9031D235324J96179L184k30759l50939l65660k87612j69750q9507k7960L7462
9021B949962P7738J16269O3405o1430j65238k30865k48825k19137j84066j66537
9011A931276j45504j18902q6907q5180r6516o8434m8994l0947N649K2058J0616
9000A288215K5209Q1929J30592J82517K33817J46140J909j16456j84458j99557
8990A589857j24292p7199l4059n109M304k0883k3967l1381j5539j0487L5911L4532
8978A321688M4312O9895J01165J78798K47155L13035L46157K73027N3296j70735
8968B777793l17368l29567k78730k26286j61725q0487p9627n0627k8789k0712
8958A203875p389n609l557J9017J7603J9872N0886N7041O2910P6270R5727R3323
$$ plain form
8946 1679969 1694059 1618833 1424808 1219843 1054683 911885 807897 757872 726103 694067
8936 694067 663990 639724 613566 582755 563552 551060 539086 513670 483992 482838 488506 475112
8924 475112 459271 457076 447482 429431 414835 409713 412835 414283 408708 414241 432360 441382 442669
8911 442669 428466 433428 443428 456928 452780 453877 471650 476713 465235 447486 444095 459179 444923
8898 444923 429338 415855 419917 414168 410498 401146 398932 388992 392008 394599 380824 362091 368519
8885 368519 374126 365909 359604 370546 370883 346104 337821 334398 327579 323558 339480 337376 314904 320630
8871 320630 319031 328664 349213 348980 326998 312906 304270 317529 337358 356827 359192 358275 351777
8858 351777 339750 315226 316152 333226 324426 303084 314658 299249 279681 270026 273815 277025 311143
$$ packed form
8946A679969J4090p5226j94025k04965j65160j42798j03988n0025l1769l2036
8936F94067l0077k4266k6158l0811j9203j2492j1974k5416k9678j154N668j3394
8924D75112j5841k195r594j8051j4596n122L122J448n575N533J8119R022J287
8911D42669j4203M962J0000J3500m148J097J7773N063j1478j7749l391J5084j4256
8898D44923j5585j3483M062n749l670r352k214r940L016K591j3775j8733O428
8885C68519N607q217o305J0942L37k4779q283l423o819m021J5922k104k2472N726
8871C20630j599R633K0549k33k1982j4092q636J3259J9829J9469K365r17o498
8858C51777j2027k4524R26J7074q800k1342J1574j5409j9568r655L789L210L4118
$$ plain form
8845 311143 341585 333388 336592 357205 359752 350426 340597 339979 358026 357942 329046 321849 332856 337222
8831 337222 345371 351008 352103 357849 355379 339934 338367 360153 368383 364621 374367 383630 394107 406275
8817 406275 407217 423518 440398 432451 419148 436920 455838 463091 457102 441927 414660 395276 375853
8804 375853 373099 392177 409966 419365 437387 433817 429048 422185 435510 419543 413552 419934 404975
8791 404975 409744 408682 394839 390709 387168 376168 370095 365282 356664 353038 359076 352297 342489 350496
8777 350496 354532 349044 327684 303415 318265 329554 332727 339409 339587 344394 342330 330599 322339
8764 322339 326791 335671 344179 345585 332362 355041 379057 394540 397497 403648 398852 397938 399999 400954
8750 400954 419875 415741 430271 444355 429901 442464 453144 444714 439113 433471 410322 407104 410273
$$ packed form
8845C11143L0442q197L204K0613K547r326r829o18J8047q4k8896p197J1007M366
8831C37222Q149N637J095N746k470j5445j567K1786Q230l762R746R263J0477J2168
8817D06275R42J6301J6880p947j3303J7772J8918P253n989j5175k7267j9384j9423
8804C75853k754J9078J7789R399J8022l570m769o863J3325j5967n991O382j4959
8791D04975M769j062j3843m130l541j1000o073m813q618l626O038o779r808Q007
8777C50496M036n488k1360k4269J4850J1289L173O682J78M807k064j1731q260
8764C22339M452Q880Q508J406j3223K2679K4016J5483K957O151m796r14K061R55
8750D00954J8921m134J4530J4084j4454J2563J0680q430n601n642k3149l218L169
$$ plain form
8737 410273 404801 403631 373814 360896 366699 371047 386307 397362 396678 401788 418221 423783 392742
8724 392742 391810 390248 384503 371330 365891 372655 384663 390215 394670 383986 353192 354851 362512 371480
8710 371480 363933 373425 365468 370216 375279 400242 423085 424577 401426 384016 365788 366485 366191 370091
8696 370091 367550 371949 377573 375981 377991 391133 400953 382555 368039 379952 407874 427041 415319
8683 415319 409041 416486 431967 448864 450570 438636 439762 453940 444777 444621 439107 462360 453207
8670 453207 435986 421103 412995 416797 430797 436545 425256 396108 381277 386233 405124 427369
8658 427369 457882 458207 452503 437918 420448 409467 397749 425560 430369 450823 454599 433627 431606
8645 431606 429566 422576 422346 418014 425492 423451 428258 399123 410503 434063 448821 466392 477337
$$ packed form
8737D10273n472j170k9817j2918N803M348J5260J1055o84N110J6433N562l1041
8724C92742r32j562n745j3173n439O764J2008N552M455j0684l0794J659P661Q968
8710C71480p547R492p957M748N063K4963K2843J492k3151j7410j8228O97k94L900
8696C70091k541M399N624j592K010J3142R820j8398j4516J1913K7922J9167j1722
8683D15319o278P445J5481J6897J706j1934J126J4178r163j56n514K3253r153
8670D53207j7221j4883q108L802J4000N748j1289k9148j4831M956J8891K2245
8658D27369L0513L25n704j4585j7470j0981j1718K7811M809K0454L776k0972k021
8645D31606k040o990k30m332P478k041M807k9135J1380K3560J4758J7571J0945
$$ plain form
8632 477337 485678 486431 466620 453226 442926 418407 424984 444590 443121 455279 460855 450450 450419
8619 450419 454552 434652 428186 432963 425802 431846 434293 452460 468912 472103 455619 457140 458302
8606 458302 477127 458437 448080 451981 460033 457508 448914 460650 459016 454139 467747 472170 465043
8593 465043 490743 503544 500855 479419 475814 493757 502380 505459 509534 505899 500185 503954 496051
8580 496051 492810 498558 496314 490723 486230 503541 514352 506649 530538 558453 574088 574371 592963
8567 592963 589472 581283 566020 544312 538308 525823 530553 537203 529894 515911 513835 532090 535707
8554 535707 543361 550943 561462 572865 582191 563224 563643 575255 571924 567620 557101 533485 529400
8541 529400 542437 545006 544998 547343 561134 565978 564916 553026 557533 564545 570047 574430 586691 595152
$$ packed form
8632D77337Q341P53j9811j3394j0300k4519O577J9606j469J2158N576j0405l1
8619D50419M133j9900o466M777p161O044K447J8167J6452L191j6484J521J162
8606D58302J8825j8690j0357L901Q052k525q594J1736j634m877J3608M423p127
8593D65043K5700J2801k689k1436l605J7943Q623L079M075l635n714L769p903
8580D96051l241N748k244n591m493J7311J0811p703K3889K7915J5635K83J8592
8567E92963l491q189j5263k1708o004j2485M730O650p309j3983k076J8255L617
8554E35707P654P582J0519J1403R326j8967M19J1612l331m304j0519k3616m085
8541E29400J3037K569qK345J3791M844j062j1890M507P012N502M383J2261Q461
$$ plain form
8527 595152 616917 652668 680563 704511 678755 645112 640757 638390 606074 600418 607621 614198 619636
8514 619636 625648 624136 633470 644511 644154 643407 660809 675932 687004 680102 668615 652987 649123
8501 649123 650258 641947 640303 646753 643066 642219 652410 656421 658317 646393 653119 644346 635722 652988
8487 652988 660653 665171 686032 685562 680164 673193 702323 741421 757544 755156 747642 738578 735623 729046
8473 729046 728296 727745 763974 788663 777154 767076 767678 768600 758565 745684 740859 739763 741800 738753
8459 738753 748179 747543 738505 743395 750649 749173 758847 749310 757339 755222 753348 751678 748764 760408
8445 760408 773274 775416 793558 806346 805981 835193 825337 829639 846383 849165 850588 850864 844411 820030
8431 820030 814055 843188 857764 863824 862126 887201 892151 904120 908271 883910 877221 879733 874780
$$ packed form
8527E95152K1765L5751K7895K3948k5756l3643m355k367l2316n656P203O577N438
8514F19636O012j512R334J1041l57p47J7402J5123J1072o902j1487j5628l864
8501F49123J135q311j644O450l687q47J0191M011J896j1924O726q773q624J7266
8487F52988P665M518K0861m70n398o971K9130L9098J6123k388p514r064k955o577
8473G29046p50n51L6229K4689j1509j0078O02R22j0035j2881m825j096K037l047
8459G38753R426o36r038M890P254j476R674r537Q029k117j874j670k914J1644
8445G60408J2866K142J8142J2788l65K9212r856M302J6744K782J423K76o453k4381
8431H20030n975K9133J4576O060j698K5075M950J1969M151k4361o689K512m953
$$ plain form
8418 874780 870807 871801 896145 898114 903451 919932 915137 918056 920809 918711 950368 958247 948979 949173
8404 949173 954356 956240 955894 950045 957038 979963 990082 970081 964121 980475 990895 988233 983298
8391 983298 1009550 1006656 1011548 1007860 1016390 1042661 1049196 1039845 1033809 1045134 1054181 1074390 1085456
8378 1085456 1070675 1071867 1077168 1081837 1091273 1101747 1120068 1138640 1148753 1176948 1189794 1202953
8366 1202953 1208472 1226500 1244953 1270473 1310224 1359352 1383024 1385704 1385385 1374480 1381562 1385984 1371119
8353 1371119 1354905 1348138 1328120 1298551 1277228 1276585 1269927 1265906 1280837 1294495 1281996 1290406 1309319
8340 1309319 1319061 1328276 1353760 1383127 1431683 1474109 1492543 1505206 1513444 1514221 1509085 1526475 1524978
8327 1524978 1536662 1522922 1499644 1494346 1471676 1461014 1449164 1447223 1460240 1472956 1472529 1486503
$$ packed form
8418H74780l973R94K4344J969N337J6481m795K919K753k098L1657P879r268J94
8404I49173N183J884l46n849O993K2925J0119k0001n960J6354J0420k662m935
8391I83298K6252k894M892l688Q530K6271O535r351o036J1325R047K0209J1066
8378A085456j4781J192N301M669R436J0474J8321J8572J0113K8195J2846J3159
8366A202953N519J8028J8453K5520L9751M9128K3672K680l19j0905P082M422j4865
8353A371119j6214o767k0018k9569k1323o43o658m021J4931J3658j2499Q410J8913
8340A309319R742R215K5484K9367M8556M2426J8434J2663Q238P77n136J7390j497
8327A524978J1684j3740k3278n298k2670j0662j1850j941J3017J2716m27J3974
$$ plain form
8315 1486503 1471412 1462701 1466954 1470852 1464499 1466125 1478180 1491518 1511003 1532222 1534040 1551160 1591060
8302 1591060 1615010 1614573 1606896 1632384 1644658 1639354 1641957 1648333 1666294 1689099 1735556 1772781 1799547
8289 1799547 1820819 1835087 1840902 1836335 1843286 1849968 1855639 1850498 1836218 1849850 1863538 1877630 1844500
8276 1844500 1813016 1810834 1816530 1807885 1790763 1782063 1793819 1827181 1839866 1861526 1906450 1969389
8264 1969389 2040322 2090201 2154243 2212874 2272631 2341306 2428942 2550298 2740271 3034159 3400953
8253 3400953 3742611 3874251 3709351 3374672 2983165 2654640 2427491 2278977 2177584 2111036
8243 2111036 2058644 1998631 1948270 1912710 1898147 1904276 1884580 1867229 1866811 1866869 1849231 1825215 1830632
8230 1830632 1835545 1855121 1885408 1905277 1923502 1942615 1956120 1973382 1995954 2010144 2034746 2063256
$$ packed form
8315A486503j5091q711M253L898o353J626J2055J3338J9485K1219J818J7120L9900
8302A591060K3950m37p677K5488J2274n304K603O376J7961K2805M6457L7225K6766
8289A799547K1272J4268N815m567O951O682N671n141j4280J3632J3688J4092l3130
8276A844500l1484k182N696q645j7122q700J1756L3362J2685K1660M4924O2939
8264A969389P0933M9879O4042N8631N9757O8675Q7636J21356J89973K93888L66794
8253C400953L41658J31640j64900l34679l91507l28525k27149j48514j01393o6548
8243B111036n2392o0013n0361l5560j4563O129j9696j7351m18N8j7638k4016N417
8230A830632M913J9576L0287J9869J8225J9113J3505J7262K2572J4190K4602K8510
$$ plain form
8218 2063256 2088473 2144776 2223154 2321625 2466282 2675938 2939434 3303242 3820177 4585026
8208 4585026 5434669 5867442 5680195 5006115 4176706 3494195 3026959 2716992 2501879 2363705
8198 2363705 2264162 2191874 2145204 2130023 2102883 2099368 2088710 2093717 2102570 2090458 2081204 2075494
8186 2075494 2073926 2070667 2074749 2068262 2046942 2032525 2027341 2017700 1997199 1957041 1932329 1925964 1916322
8173 1916322 1925636 1947405 1963951 1992026 2032578 2084699 2179003 2328768 2555437 2838771 3151768
8162 3151768 3377861 3384488 3169841 2837162 2517684 2284182 2119062 2019110 1976213 1941077
8152 1941077 1930672 1905679 1882740 1869539 1872353 1865654 1863935 1884176 1906586 1939718 1979085 2008943
8140 2008943 2066126 2107575 2150616 2210396 2279728 2383798 2494211 2606377 2751840 2936797
$$ packed form
8218B063256K5217N6303P8378R8471J44657K09656K63496L63808N16935P64849
8208D585026Q49643M32773j87247o74080q29409o82511m67236l09967k15113j38174
8198B363705r9543p2288m6670j5181k7140l515j0658N007Q853j2112r254n710
8186B075494j568l259M082o487k1320j4417n184r641k0501m0158k4712o365r642
8173A916322R314K1769J6546K8075M0552N2121R4304J49765K26669K83334L12997
8162C151768K26093O627k14647l32679l19478k33502j65120r9952m2897l5136
8152A941077j0405k4993k2939j3201K814o699j719K0241K2410L3132L9367K9858
8140B008943N7183M1449M3041N9780O9332J04070J10413J12166J45463J84957
$$ plain form
8130 2936797 3161494 3428238 3686029 3929667 4135079 4255772 4266149 4201929 4056387 3871256
8120 3871256 3684470 3511436 3364878 3218009 3113050 3019347 2927529 2850830 2801728 2772326
8110 2772326 2743187 2736016 2733213 2725068 2751608 2807085 2855919 2941500 3045374 3148811 3252466
8099 3252466 3383635 3550842 3686386 3791591 3878940 3935345 3934841 3900394 3808020 3699577 3599242
8088 3599242 3520319 3424126 3332675 3238247 3123801 2988775 2849590 2736012 2620467 2527848
8078 2527848 2457674 2411945 2380054 2342144 2315559 2295830 2296140 2300320 2322981 2367001 2421434 2501182
8066 2501182 2585172 2677257 2779130 2873236 3015488 3214268 3446809 3701495 3988136 4313962
8056 4313962 4654821 5037370 5426310 5836597 6237127 6609076 6938121 7166444 7307037 7369576
$$ packed form
8130B936797K24697K66744K57791K43638K05412J20693J0377o4220j45542j85131
8120C871256j86786j73034j46558j46869j04959r3703r1818p6699m9102k9402
8110B772326k9139p171k803q145K6540N5477M8834Q5581J03874J03437J03655
8099C252466J31169J67207J35544J05205Q7349N6405n04l4447r2374j08443j00335
8088C599242p8923r6193r1451r4428j14446j35026j39185j13578j15545r2619
8078B527848p0174m5729l1891l7910k6585j9729L10M180K2661M4020N4433P9748
8066B501182Q3990R2085J01873R4106J42252J98780K32541K54686K86641L25826
8056D313962L40859L82549L88940M10287M00530L71949L29045K28323J40593O2539
$$ plain form
8046 7369576 7338617 7291075 7311099 7416564 7536262 7589563 7519323 7303124 6911752 6429145
8036 6429145 5924892 5463682 5116344 4885983 4758630 4699740 4712162 4792605 4943907 5160849
8026 5160849 5467668 5847861 6253819 6649165 7019055 7331117 7546437 7685252 7787537 7867130
8016 7867130 7919300 7912451 7842691 7678764 7420155 7061941 6563215 5988245 5373267 4814931
8006 4814931 4341866 3930408 3617428 3369352 3177231 3024722 2890385 2781031 2710756 2670519
7996 2670519 2634714 2610187 2585047 2587987 2616648 2669256 2743174 2859384 3004692 3186919 3412725
7985 3412725 3687743 4010192 4299449 4587338 4828381 4975343 5009542 4950270 4840875 4718684
7975 4718684 4639284 4675219 4822905 5092091 5469774 5932841 6457691 6969267 7336031 7475908
$$ packed form
8046G369576l0959m7542K0024J05465J19698N3301p0240k16199l91372m82607
8036F429145n04253m61210l47338k30361j27353n8890J2422Q0443J51302K16942
8026E160849L06819L80193M05958L95346L69890L12062K15320J38815J02285P9593
8016G867130N2170o849o9760j63927k58609l58214m98726n74970o14978n58336
8006D814931m73065m11458l12980k48076j92121j52509j34337j09354p0275m0237
7996B670519l5805k4527k5140K940K8661N2608P3918J16210J45308J82227K25806
7985C412725K75018L22449K89257K87889K41043J46962L4199n9272j09395j22191
7975D718684p9400L5935J47686K69186L77683M63067N24850N11576L66764J39877
$$ plain form
7965 7475908 7360473 7019147 6524912 6005510 5538144 5157048 4870481 4682060 4578713 4563147
7955 4563147 4633009 4803832 5050942 5362710 5686368 6007400 6271762 6465158 6559296 6551669
7945 6551669 6466022 6310799 6142474 6005798 5881568 5778510 5699224 5615609 5501712 5330631
7935 5330631 5094581 4817032 4529127 4203206 3890650 3616830 3352523 3112334 2918162 2779334
7925 2779334 2644834 2520730 2376980 2234264 2108418 1999996 1897547 1817392 1755970 1690236
7915 1690236 1648531 1632700 1624224 1603867 1603406 1632925 1650640 1697729 1776237 1864219 1967477 2077908
7903 2077908 2174409 2261822 2354697 2465909 2596197 2722256 2858681 2960596 3067788 3123318
7893 3123318 3119002 3044849 2937462 2775754 2595113 2425093 2282361 2186759 2124970 2086598 2048110
$$ packed form
7965G475908j15435l41326m94235n19402m67366l81096k86567j88421j03347j5566
7955D563147O9862J70823K47110L11768L23658L21032K64362J93396R4138p627
7945F551669q5647j55223j68325j36676j24230j03058p9286q3615j13897j71081
7935E330631k36050k77549k87905l25921l12556k73820k64307k40189j94172j38828
7925B779334j34500j24104j43750j42716j25846j08422j02449q0155o1422o5734
7915A690236m1705j5831q476k0357m61K9519J7715M7089P8508Q7982J03258J10431
7903B077908R6501Q7413R2875J11212J30288J26059J36425J01915J07192N5530
7893C123318m316p4153j07387j61708j80641j70020j42732r5602o1789l8372l8488
$$ plain form
7882 2048110 2003507 1937869 1879602 1816451 1774345 1732060 1702898 1732217 1799402 1860632 1945037
7871 1945037 2061112 2144842 2226055 2298330 2372624 2422053 2440839 2413094 2341405 2238986 2131921
7860 2131921 2017572 1881523 1759063 1623374 1499503 1388378 1296790 1216572 1154193 1117406
7850 1117406 1060384 1018117 977832 932694 899531 860064 829183 804485 783299 760094 741228
7839 741228 701017 679770 677407 666439 661749 650170 634728 638110 624299 617124 599120 595627 591782
7826 591782 580977 542809 543690 547156 543760 534288 541429 533088 539579 550529 540928 540813 539243 557675
7812 557675 562619 552302 563908 567925 552987 556737 554146 555610 547790 515990 493378 482250 500018
7799 500018 514062 500606 487812 468672 463164 482244 479619 473154 486811 475508 459744 459813 453835
$$ packed form
7882B048110m4603o5638n8267o3151m2106m2285k9162K9319O7185O1230Q4405
7871A945037J16075Q3730Q1213P2275P4294M9429J8786k7745p1689j02419j07065
7860B131921j14349j36049j22460j35689j23871j11125r1588q0218o2379l6787
7850A117406n7022m2267m0285m5138l3163l9467l0881k4698k1186k3205j8866
7839G41228m0211k1247k363j0968m690j1579j5442L382j3811p175j8004l493l845
7826E91782j0805l8168Q81L466l396r472P141q341O491J0950r601j15j570J8432
7812E57675M944j0317J1606M017j4938L750k591J464p820l1800k2612j1128J7768
7799E00018J4044j3456j2794j9140n508J9080k625o465J3657j1303j5764O9n978
$$ plain form
7786 453835 455859 450199 442034 444963 447149 453822 460627 454151 444549 436215 439834 437574 451192 449185
7772 449185 437010 424462 410261 405270 395946 410087 404494 387018 370540 379055 396710 388514 362564
7759 362564 348011 342177 338898 342523 344743 346737 344667 351037 335436 320190 335937 328363 306777
7746 306777 304554 303951 299616 300513 294452 285775 291890 299042 304346 281672 276646 262790 269180 287554
7732 287554 302123 309384 311598 315229 312982 298853 295488 301357 299444 290870 292797 295283 287239 273589
7718 273589 262497 259876 261474 281863 286194 288536 296117 285555 269464 256823 265483 266318 271836
7705 271836 284042 282995 279629 273589 285307 278415 270146 246192 255088 247887 252186 253905 244865 237035
7691 237035 221779 213106 229570 231240 238754 242649 244237 233951 218797 219602 229058 239020 225783
$$ packed form
7786D53835K024n660q165K929K186O673O805o476r602q334L619k260J3618k007
7772D49185j2175j2548j4201m991r324J4141n593j7476j6478Q515J7655q196k5950
7759C62564j4553n834l279L625K220J994k070O370j5601j5246J5747p574k1586
7746C06777k223o03m335Q97o061q677O115P152N304k2674n026j3856O390J8374
7732B87554J4569P261K214L631k247j4129l365N869j913q574J927K486q044j3650
7718B73589j1092k621J598K0389M331K342P581j0562j6091j2641Q660Q35N518
7705B71836J2206j047l366o040J1718o892q269k3954Q896p201M299J719r040p830
7691B37035j5256q673J6464J670P514L895J588j0286j5154Q05R456R962j3237
$$ plain form
7678 225783 213218 194926 184473 204007 236211 242054 236513 230872 217751 219993 202130 211362 221762
7665 221762 222119 214487 229633 230154 230596 243763 258684 248317 217169 226485 237146 242419 238661 227869
7651 227869 233342 239601 234571 247731 246587 230765 227414 230041 197830 194262 200488 192076 177550
7638 177550 197001 207942 186966 185589 200986 203446 196589 202746 204920 196776 197231 218104 232244
7625 232244 245291 247220 238586 229652 225168 216618 222831 221035 230750 226970 220640 221053 201606 181645
7611 181645 160605 178970 205461 206552 193333 177097 167012 161244 163070 152980 151411 152389 149959
7598 149959 163926 181309 173926 177237 187530 194691 187487 159110 151179 154109 159744 166450 177724
7585 177724 183745 180123 195093 196410 178097 178618 195547 195043 183716 186904 199927 219008 222923
$$ packed form
7678B25783j2565j8292j0453J9534L2204N843n541n641j3121K242j7863R232J0400
7665B21762L57p632J5146N21M42J3167J4921j0367l1148R316J0661N273l758j0792
7651B27869N473O259n030J3160j144j5822l351K627l2211l568O226q412j4526
7638A77550J9451J0941k0976j377J5397K460o857O157K174q144M55K0873J4140
7625B32244J3047J929q634q934m484q550O213j796R715l780o330M13j9447j9961
7611A81645k1040J8365K6491J091j3219j6236j0085n768J826j0090j569R78k430
7598A49959J3967J7383p383L311J0293P161p204k8377p931K930N635O706J1274
7585A77724O021l622J4970J317j8313N21J6929n04j1327L188J3023J9081L915
$$ plain form
7572 222923 211953 174158 162835 127014 111096 117980 138076 129807 131417 151994 169661 173226
7560 173226 165898 161068 157546 159692 182777 199836 210462 207467 205629 213037 178009 159996 155344
7547 155344 144572 143951 145733 138640 142164 158294 153960 149850 133938 110348 107063 142205 167161
7534 167161 160372 160494 152248 145160 142325 139194 132631 135302 117995 110926 101404 107971 117618 105348
7520 105348 115577 115631 111326 111696 106627 108330 110347 105830 114714 113523 106335 114586 113022 119223 144192
7505 144192 167966 158189 173581 161081 135645 137375 140738 124373 121988 106925 107876 115644 126625
7492 126625 140319 150872 145312 152797 151693 119456 93679 90019 89803 88710 106977 123905 131088
7479 131088 134088 139433 134148 149673 154596 148173 142797 150457 135333 122828 116777 108125 100933 101787
$$ packed form
7572B22923j0970l7795j1323l5821j5918O884K0096q269J610K0577J7667L565
7560A73226p328m830l522K146K3085J7059J0626k995j838P408l5028j8013m652
7547A55344j0772o21J782p093L524J6130m334m110j5912k3590l285L5142K4956
7534A67161o789J22q246p088k835l131o563K671j7307p069r522O567R647j2270
7520A05348J0229N4m305L70n069J703K017m517Q884j191p188Q251j564O201K4969
7505A44192K3774r777J5392j2500k5436J730L363j6365k385j5063R51P768J0981
7492A26625J3694J0553n560P485j104l2237k5777l660k16j093J8267J6928P183
7479A31088L000N345n285J5525M923o423n376P660j5124j2505o051q652p192Q54
$$ plain form
7465 101787 119984 123957 127874 118008 106315 108546 102353 97006 114403 111891 93845 82892 69137
7452 69137 63037 72306 71795 73460 70210 87345 100190 97359 92408 67625 77608 100815 104521 92833
7438 92833 92824 106284 102155 104056 106999 107055 123533 122277 108895 111198 103048 108426 101311 98194 99980
7423 99980 113244 125569 130409 127721 100162 86190 83620 72460 84978 81609 91840 97454 114104
7410 114104 108901 105408 97642 87092 79645 76947 98376 90796 72801 72557 90078 84196 68405
7397 68405 61059 87411 95338 108777 115595 107575 89739 83517 101602 105160 105985 115673 119640 114094
7383 114094 101483 79311 54580 73246 92253 99187 89052 84370 88471 88245 88749 75617 83389
7370 83389 90055 87765 75518 70384 71097 52922 49895 67343 75314 65219 70666 74499 92180 97909
$$ packed form
7465A01787J8197L973L917r866j1693K231o193n347J7397k512j8046j0953j3755
7452F9137o100R269n11J665l250J7135J2845k831m951k4783R983K3207L706j1688
7438I2833rJ3460m129J901K943N6J6478j256j3382K303q150N378p115l117J786
7423I9980J3264J2325M840k688k7559j3972k570j1160J2518l369J0231N614J6650
7410A14104n203l493p766j0550p447k698K1429p580j7995k44J7521n882j5791
7397F8405p346K6352P927J3439O818q020j7836o222J8085L558Q25R688L967n546
7383A14094j2611k2172k4731J8666J9007O934j0135m682M101k26N04j3132P772
7370H3389O666k290j2247n134P13j8175l027J7448P971j0095N447L833J7681N729
$$ plain form
7356 97909 87715 60606 46931 52234 78939 78280 77412 63031 56968 65426 75777 79060 64994
7343 64994 48562 40523 41097 52087 48908 48448 54015 40802 26011 44568 64564 68530 65702 51523
7329 51523 49455 50806 37742 51634 72883 59435 57368 67278 47535 35671 56893 65541 69260
7316 69260 65036 52750 41769 54893 58296 59605 60666 66704 59182 68099 59419 58031 60734 52643
7302 52643 43643 44932 56277 73162 72384 56360 44189 25718 29542 36075 25299 39181 43737
7289 43737 48944 60104 35879 5930 11360 46721 70870 73432 71345 72916 83628 65340 51375
7276 51375 47115 41217 43876 35537 42287 57225 51165 40421 38455 52748 50980 41808 30062 55676
7262 55676 51320 57524 68619 66954 59359 39054 25474 28812 23522 26735 27945 25083 13196 12136
$$ packed form
7356I7909j0194k7109j3675N303K6705o59q68j4381o063Q458J0351L283j4066
7343F4994j6432q039N74J0990l179m60N567j3213j4791J8557J9996L966k828j4179
7329E1523k068J351j3064J3892K1249j3448k067R910j9743j1864K1222Q648L719
7316F9260m224j2286j0981J3124L403J309J061O038p522Q917q680j388K703q091
7302E2643r000J289J1345J6885p78j6024j2171j8471L824O533j0776J3882M556
7289D3737N207J1160k4225k9949N430L5361K4149K562k087J571J0712j8288j3965
7276E1375m260n898K659q339O750J4938o060j0744j966J4293j768r172j1746K5614
7262E5676m356O204J1095j665p595k0305j3580L338n290L213J210k862j1887j060
$$ plain form
7248 12136 4575 23138 31214 56285 59172 48754 54524 70953 59361 37028 24326 18196 16726
7235 16726 54706 82152 80811 64375 45889 41816 28272 15907 10414 8086 -425 21374 39641
7222 39641 37904 32109 20771 25861 35108 35570 44247 52268 63610 62059 47024 42286 32915 47097
7208 47097 60919 82007 87990 65848 59911 56153 48611 47347 40614 36669 56063 65896 52232
7195 52232 46743 38669 38544 44499 61188 68017 57298 46859 41231 43528 42896 23779 15459 36262
7181 36262 54796 54034 50883 40487 52258 48792 59783 55021 47491 25475 18192 27631 14575
7168 14575 -6165 10836 34490 50417 54047 43501 34395 45295 59978 33921 17953 31679
7156 31679 35355 24330 16171 21084 49282 63407 58360 60177 62980 39090 27290 43204 48519
$$ packed form
7248A2136p561J8563Q076K5071K887j0418N770J6429j1592k2333j2702o130j470
7235A6726L7980K7446j341j6436j8486m073j3544j2365n493k328q511K1799J8267
7222C9641j737n795j1338N090R247M62Q677Q021J1342j551j5035m738r371J4182
7208D7097J3822K1088N983k2142n937l758p542j264o733l945J9394R833j3664
7195E2232n489q074j25N955J6689O829j0719j0439n628K297o32j9117q320K0803
7181C6262J8534p62l151j0396J1771l466J0991m762p530k2016p283R439j3056
7168A4575k0740J7001K3654J5927L630j0546r106J0900J4683k6057j5968J3726
7156C1679L676j1025q159M913K8198J4125n047J817K803k3890j1800J5914N315
$$ plain form
7143 48519 61070 61340 61213 69357 58260 60591 74665 67348 67808 60886 43833 42123 33705 31914
7129 31914 41458 49717 39474 35876 33123 36865 47913 52678 38541 23004 20265 8490 17058
7116 17058 35844 41883 59848 74731 68348 56949 55846 37573 19759 26391 53171 54987 45608
7103 45608 44905 43217 27947 21625 35407 40940 15792 5161 10886 21448 28398 19703 10461 4967
7089 4967 25866 38638 50222 61742 65042 48912 22030 41757 60075 47719 50878 37954
7077 37954 20897 39798 58400 50074 48635 28033 -2189 -13580 -4092 1296 5114 -1736 -5973
7064 -5973 -77 3929 5165 17294 27998 30448 31490 28830 23272 15566 23212 7290 -4648 2300
7050 2300 22022 26601 35402 30231 44858 28858 20316 24635 18469 24523 24728 24712 31339 49480 30645
$$ packed form
7143D8519J2551K70j27Q144j1097K331J4074p317M60o922j7053j710q418j791
7129C1914R544Q259j0243l598k753L742J1048M765j4137j5537k739j1775Q568
7116A7058J8786O039J7965J4883o383j1399j103j8273j7814O632K6780J816r379
7103D5608p03j688j5270o322J3782N533k5148j0631N725J0562O950q695r242n494
7089D967K0899J2772J1584J1520L300j6130k6882J9727J8318j2356L159j2924
7077C7954j7057J8901J8602q326j439k0602l0222j1391R488N388L818o850m237
7064e973N896M006J236J2129J0704K450J042k660n558p706P646j5922j1938O948
7050B300J9722M579Q801n171J4627j6000q542M319o166O054K05j6O627J8141j8835
$$ plain form
7035 30645 25477 50899 54168 46485 39504 42214 33986 26829 36859 42256 38817 38827 24564 8976
7021 8976 16738 34634 30445 25560 18949 10711 29657 48280 46436 37956 29208 30863 23684 16391
7007 16391 33600 26690 20645 28186 30588 32387 23257 25864 11590 7058 27166 31118 23902 16416
6993 16416 16704 10182 15919 20817 17488 13808 21121 18137 22305 19633 15051 10719 583 -550 8715
6978 8715 20040 21109 -1586 12582 23437 29138 41869 52811 33243 19870 16914 -7949 -18971
6965 -18971 -28756 -5864 3208 9669 19159 19587 16419 14786 14179 13675 9178 7680 13482 17858 26478
6950 26478 29608 30598 19217 13987 8636 12031 13514 16626 26375 39203 22594 11836 6853 16668
6936 16668 34516 34667 40998 21481 14078 27161 16264 12174 31028 36319 41030 33354 32271 17926
$$ packed form
7035C0645n168K5422L269p683o981K710q228p157J0030N397l439J0j4263j5588
7021H976P762J7896m189m885o611q238J8946J8623j844q480q748J655p179p293
7007A6391J7209o910o045P541K402J799r130K607j4274m532K0108L952p216p486
6993A6416K88o522N737M898l329l680P313k984M168k672m582m332j0136j133R265
6978H715J1325J069k2695J4168J0855N701J2731J0942j9568j3373k956k4863j1022
6965a8971r785K2892R072O461R490M28l168j633o07n04m497j498N802M376Q620
6950B6478L130R90j1381n230n351L395J483L112R749J2828j6609j0758m983R815
6936A6668J7848J51O331j9517p403J3083j0897m090J8854N291M711p676j083j4345
$$ plain form
6922 17926 20042 4804 -8008 -14725 -31471 -38763 -35145 -14709 -6754 -9885 -3781 23395 27736
6909 27736 22023 11977 -860 -2693 7838 10626 3381 5586 17646 22361 10987 8069 18074
6896 18074 26703 34075 41159 42957 45423 15920 9839 13215 22624 27161 15012 4767 5620 -10452
6882 -10452 -17120 -768 12357 27742 33209 21599 17428 26191 26037 29957 26977 23195 27677 27320
6868 27320 23071 10692 -9580 -11700 -500 7024 9741 21956 26657 25875 24983 40028 26742 21211
6854 21211 45164 33797 18964 16032 32098 31678 25699 18208 17543 27976 29782 25595 34376 31088
6840 31088 18201 7537 2707 -20651 -34493 -26421 3763 4940 15452 16210 12685 19687 17677
6827 17677 13586 4514 4329 -9113 -20829 3075 15888 13850 5988 8221 22017 31208 28859 33365
$$ packed form
6922A7926K116j5238j2812o717j6746p292L618K0436P955l131O104K7176M341
6909B7736n713j0046j2837j833J0531K788p245K205J2060M715j1374k918J0005
6896A8074Q629P372P084J798K466k9503o081L376R409M537j2149j0245Q53j6072
6882a0452o668J6352J3125J5385N467j1610m171Q763j54L920k980l782M482l57
6868B7320m249j2379k0272k120J1200P524K717J2215M701p82q92J5045j3286n531
6854B1211K3953j1367j4833k932J6066m20n979p491o65J0433J806m187Q781l288
6840C1088j2887j0664m830k3358j3842Q072L0184J177J0512P58l525P002k010
6827A7677m091r072j85j3442j1716K3904J2813k038p862K233J3796R191k349M506
$$ plain form
6813 33365 34817 30107 18561 17375 9889 6277 -10291 -54 16336 8059 -14048 -20478 3185
6800 3185 19589 9017 15701 36867 42755 59149 60849 65840 46761 38488 42895 29417 37173
6787 37173 36650 37407 30779 6171 9781 14495 11522 7605 1596 8159 7787 3214 16353 33433 44570
6772 44570 48912 38208 39376 21653 11030 43178 49921 32021 13951 10661 34364 51186 49363
6759 49363 31200 11950 23592 39165 29654 26953 25022 29533 34110 42756 33331 33459 37488 26426
6745 26426 18685 13935 -1352 -9008 842 2753 3596 20167 31200 30206 23965 13843 22914 31220
6731 31220 12269 23575 34728 33600 26955 6361 -9594 -22103 -21746 -2729 20235 42695 45218
6718 45218 37353 41419 36436 27893 25568 26239 28857 10790 19434 17757 22549 29993 21604 31260 26709
$$ packed form
6813C3365J452m710j1546j186p486l612j6568J0237J6390q277k2107o430K3663
6800C185J6404j0572O684K1166N888J6394J700M991j9079q273M407j3478P756
6787C7173n23P57o628k4608L610M714k973l917o009O563l72m573J3139J7080J1137
6772D4570M342j0704J168j7723j0623L2148O743j7900j8070l290K3703J6822j823
6759D9363j8163j9250J1642J5573r511k701j931M511M577Q646r425J28M029j1062
6745B6426p741m750j5287p656R850J911Q43J6571J1033r94o241j0122R071Q306
6731C1220j8951J1306J1153j128o645k0594j5955j2509L57J9017K2964K2460K523
6718D5218p865M066m983q543k325O71K618j8067Q644j677M792P444q389R656m551
$$ plain form
6703 26709 19938 27368 31108 45054 49882 57317 48278 34811 34244 35557 39214 31353 21687 22723
6689 22723 14233 2731 5560 18857 29600 24309 13974 15319 17599 11756 27880 21124 21801 27832
6675 27832 28515 17433 -5832 -6053 5850 18898 15771 -4719 2356 20971 10965 -7607 2741
6662 2741 16696 19296 6481 462 -6392 -9044 -35651 -37231 -23129 -9715 10295 2858 -9698
6649 -9698 -2362 13118 23857 32111 32114 24600 29352 27888 14547 9152 15732 2667 5591 9760 3181
6634 3181 -1938 507 -7512 -19501 -1234 15323 22645 27033 36040 42344 43087 41792 21488 10216
6620 10216 5929 7911 -7059 -1959 18239 24472 10289 -9694 -15177 8001 6350 1153 1672 -17672
6606 -17672 -8370 19258 22914 3217 10785 19617 17149 23974 18673 10503 11138 9031 3343 -3556
$$ packed form
6703B6709o771P430L740J3946M828P435r039j3467n67J313L657p861r666J036
6689B2723q490j1502K829J3297J0743n291j0335J345K280n843J6124o756O77O031
6675B7832O83j1082k3265k21J1903J3048l127k0490P075J8615j0006j8572J0348
6662B741J3955K600j2815o019o854k652k6607j580J4102J3414K0010p437j2556
6649i698P336J5480J0739Q254Lp514M752j464j3341n395O580j3065K924M169o579
6634C181n119K445q019j1989J8267J6557P322M388R007O304P43j295k0304j1272
6620A0216m287J982j4970N100K0198O233j4183j9983n483K3178j651n197N19j9344
6606a7672R302K7628L656j9697P568Q832k468O825n301q170O35k107n688o899
$$ plain form
6592 -3556 -1453 -2941 6853 14581 14175 17418 22474 4463 517 -8639 -22857 -16538 -17232 -15883 -1201
6577 -1201 37715 36703 28885 33112 36967 32655 26129 20498 9669 -1489 -1000 10688 2658 -18527
6563 -18527 -13651 -7982 7472 9495 -6245 -3571 -954 12560 -2418 -9221 13320 39283 33773
6550 33773 31867 12782 6068 9735 30001 32894 29222 32975 34876 42961 34323 23090 6844 14008
6536 14008 19829 7636 11811 4271 14099 25083 38367 24970 21490 17975 32930 22444 17741
6523 17741 20334 -592 -11383 -14300 -20366 -17112 -13880 -11013 -7025 -6988 -10792 -17265 -11143 23297
6509 23297 33380 11764 27020 34612 12596 -7539 -12553 -12867 9168 9379 600 5442 4867 2245
6495 2245 25462 29608 37173 30591 11012 3843 -1518 3070 -8908 -12900 -14029 -8798 2664 384
$$ packed form
6592c556K103j488R794P728m06L243N056j8011l946r156j4218O319o94J349J4682
6577a201L8916j012p818M227L855m312o526n631j0829j1158M89J1688q030k1185
6563a8527M876N669J5454K023j5740K674K617J3514j4978o803K2541K5963n510
6550C3773j906j9085o714L667K0266K893l672L753J901Q085q638j1233j6246P164
6536A4008N821j2193M175p540R828J0984J3284j3397l480l515J4955j0486m703
6523A7741K593k0926j0791k917o066L254L232K867L988L7l804o473O122L4440
6509B3297J0083k1616J5256P592k2016k0135n014l14K2035K11q779M842n75k622
6495B245K3217M146P565o582j9579p169n361M588j1978l992j129N231J1462k280
$$ plain form
6481 384 -3141 -19 3338 -1155 8464 11773 14383 11726 17031 11498 -21104 -21563 4285 3186 6135
6466 6135 4091 4704 -1032 -24444 -5707 10813 -2299 -597 -1794 21393 30693 28039 38565 36705
6452 36705 28478 38482 23502 7239 18437 28876 45375 39049 15566 -1360 -12554 -4232
6440 -4232 1237 16017 41788 40604 40663 36709 30466 42449 58302 51782 38549 9256 8824 19366
6426 19366 12431 5254 2712 27614 29898 39572 11047 -11095 4573 5373 -5697 -23686 -5119
6413 -5119 8442 1028 -1791 -13880 -15061 -2203 16339 34011 25726 2180 -21489 -5666 10291
6400 10291 10592 8419 4240 5156 12922 18542 17115 9592 21929 15073 3926 8448 21899 24924
6386 24924 21344 18385 7028 10171 1163 -4065 9842 16457 1396 -2039 18210 14076 5885 -3553
$$ packed form
6481C84l525L122L357m493R619L309K610k657N305n533l2602m59K5848j099K949
6466F135k044O13n736k3412J8737J6520j3112J702j197K3187R300k654J0526j860
6452C6705q227J0004j4980j6263J1198J0439J6499o326k3483j6926j1194Q322
6440d232N469J4780K5771j184N9l954o243J1983J5853o520j3233k9293m32J0542
6426A9366o935p177k542K4902K284R674k8525k2142J5668Q00j1070j7989J8567
6413e119J3561p414k819j2089j181J2858J8542J7672q285k3546k3669J5823J5957
6400A0291L01k173m179R16P766N620j427p523J2337o856j1147M522J3451L025
6386B4924l580k959j1357L143r008n228J3907O615j5061l435K0249m134q191r438
$$ plain form
6372 -3553 -21835 -29199 -19648 -5180 -4247 -3177 -24331 -38185 -20836 -6508 -3055 929 -27073
6359 -27073 -24544 -12319 -20995 -31945 -29300 -20442 -2266 4392 1102 4681 602 7732 14684 11973
6345 11973 1778 12098 3898 7428 6384 -2423 -5355 -2097 6509 8498 14776 -5575 -27675 -6833
6331 -6833 14176 10653 21128 24238 20636 19351 -5621 -13162 -18971 -9311 124 -14356 -26732 -32423
6317 -32423 -15513 2513 15135 7331 -11071 -22433 -22391 -37659 -34718 -25349 -5170 -3795 18197
6304 18197 38456 34443 24144 20280 24427 15187 24003 12372 3005 6753 13203 9336 5849 10398
6290 10398 16030 6761 -6007 -8521 -8898 1102 11348 17476 23488 29915 24436 1489 3625 9029
6276 9029 12649 11204 -9188 7719 9561 9241 8672 -1486 -6830 -3397 -9655 -7962 -5790 4439
$$ packed form
6372c553j8282p364R551J4468R33J070k1154j3854J7349J4328L453L984k8002
6359b7073K529J2225q676j0950K645Q858J8176O658l290L579m079P130O952k711
6345A1973j0195J0320q200L530j044q807k932L258Q606J989O278k0351k2100K0842
6331f833K1009l523J0475L110l602j285k4972p541n809R660R435j4480j2376n691
6317c2423J6910J8026J2622p804j8402j1362M2j5268K941R369K0179J375K1992
6304A8197K0259m013j0299l864M147r240Q816j1631r367L748O450l867l487M549
6290A0398N632r269j2768k514l77J0000J0246O128O012O427n479k2947K136N404
6276I029L620j445k0392J6907J842l20n69j0158n344L433o258J693K172J0229
$$ plain form
6262 4439 14307 8215 11304 -5589 -29365 -22303 5689 12397 -1605 -6667 5455 26195 25692 19347
6248 19347 2861 -3255 -14380 -22680 -19814 -10916 -16621 -22800 -9106 7818 11771 453 2803
6235 2803 15905 21892 41763 28471 4397 5894 9380 3441 -5780 -4838 1970 -12695 -11181 -16134
6221 -16134 -22447 -14588 602 1748 7765 28263 26454 20676 1934 -11702 -23565 -17415 -12372
6208 -12372 12648 14393 17436 28030 26608 27139 26017 -7460 -896 4789 -3045 -18622 -19287 -5379
6194 -5379 9016 19579 27913 19536 -645 -8971 5326 21187 11013 745 9934 26786 32596
6181 32596 21745 10705 5593 3638 5299 -6089 -21021 -8019 -11190 -17362 -21171 -6273 7029
6168 7029 12057 -18427 -19595 -13837 -13078 -13616 -8933 8772 5441 8910 17086 2190 -6364 325 436
$$ packed form
6262D439R868o092L089j6893k3776P062K7992O708j4002n062J2122K0740n03o345
6248A9347j6486o116j1125q300K866Q898n705o179J3694J6924L953j1318K350
6235B803J3102N987J9871j3292k4074J497L486n939r221R42O808j4665J514m953
6221a6134o313P859J5190J146O017K0498j809n778j8742j3636j1863O150N043
6208a2372K5020J745L043J0594j422N31j122l3477O564N685p834j5577o65J3908
6194e379J4395J0563Q334q377k0181q326J4297J5861j0174j0268R189J6852N810
6181C2596j0851j1040n112j955J661j1388j4932J3002l171o172l809J4898J3302
6168G029N028l0484j168N758P59n38M683J7705l331L469Q176j4896q554O689J11
$$ plain form
6153 436 -475 -2640 -18266 -38930 -37567 -32140 -21178 -16381 -318 8908 3710 1461 -2586 -18539
6139 -18539 -33930 -28980 -19219 649 1872 1214 19439 14845 10125 5846 -1309 6591 13845 10403
6125 10403 12350 20869 22530 15219 11634 27689 35410 36500 31736 14146 6687 -16315 -8430 -2848
6111 -2848 -187 12537 23932 17667 9017 -181 17407 23543 13956 -1847 -727 7898 7192 -882
6097 -882 542 -38315 -20368 -7439 -18038 -15894 -22354 -1569 2227 705 3663 8179 2169 -5008
6083 -5008 3306 13833 13630 -7909 1114 6013 1329 -203 4231 9940 17011 11949 468 3428
6069 3428 5259 -17131 -26264 -26277 -13645 14866 21683 -3167 -4365 -716 -6383 -13359 1001 -1494
6055 -1494 -18041 -23577 -7480 7874 15408 30329 38382 35791 12088 1232 -15 2662 -9458
$$ packed form
6153D36r11k165j5626k0664J363N427J0962M797J6063R226n198k249m047j5953
6139a8539j5391M950R761J9868J223o58J8225m594m720m279p155P900P254l442
6125A0403J947Q519J661p311l585J6055P721J090m764j7590p459k3002P885N582
6111b848K661J2724J1395o265q650r198J7588O136r587j5803J120Q625p06q074
6097h82J424l8857J7947J2929j0599K144o460K0785L796j522K958M516o010p177
6083e008Q314J0527k03k1539R023M899m684j532M434N709P071n062j1481K960
6069C428J831k2390r133j3J2632K8511O817k4850j198L649n667o976J4360k495
6055a494j6547n536J6097J5354P534J4921Q053k591k3703j0856j247K677j2120
$$ plain form
6042 -9458 62 -10707 -35731 -22330 -13715 -11284 -14665 -2088 -3768 -11206 -14354 -19429 -20532 -33316
6028 -33316 -31172 -45684 -38394 -26835 -16069 -25032 -23837 -19377 -14550 -5152 -7224 -12368 -291 8999
6014 8999 5070 5546 11092 19265 20910 11666 12105 1083 -26975 -31576 -19976 -5960 -12138 -19467
6000 -19467 -7913 -11575 -5176 1232 3593 -2276 -21011 -22915 -5725 18375 19695 13824 20009 30634
5986 30634 22444 20487 21916 10848 -2630 -14251 -11062 -10399 -3635 9362 11035 346 304 -6946
5972 -6946 2970 1937 9807 17612 16024 14350 -5394 -6195 2809 1101 14082 9076 -5587 -2301
5958 -2301 13822 13573 10622 -17822 -9500 -17971 -28185 -6058 -966 -11965 -3455 6186 6849 -4837
5944 -4837 -9851 1626 12841 21768 27420 20863 8826 -4720 6291 18404 16098 9919 9260 2120
$$ packed form
6042i458R520j0769k5024J3401Q615K431l381J2577j680p438l148n075j103j2784
6028c3316K144j4512P290J1559J0766q963J195M460M827R398k072n144J2077R290
6014H999l929M76N546Q173J645r244M39j1022k8058m601J1600J4016o178p329
6000a9467J1554l662O399O408K361n869j8735j904J7190K4100J320n871O185J0625
5986C0634q190j957J429j1068j3478j1621L189O63O764J2997J673j0689m2p250
5972f946R916j033P870P805j588j674j9744q01R004j708J2981n006j4663L286
5958b301J6123k49k951k8444Q322q471j0214K2127N092j0999Q510R641O63j1686
5944d837n014J1477J1215Q927N652o557j2037j3546J1011J2113k306o179o59p140
$$ plain form
5930 2120 -14962 -4584 32392 34984 -11838 -27133 -30143 -17035 4461 14246 -9869 -6763 -12269
5917 -12269 -13137 -7593 -33084 -32143 -15980 -11998 -34877 -26013 -9487 5291 20000 -10135 -21184
5904 -21184 -13707 -261 3123 1848 5515 -3039 851 -8778 -4283 -3215 -6241 -13531 -23713 -34606
5890 -34606 -35993 -24034 -10723 -25889 -32315 -10848 -8980 -26357 -14571 -4925 -15218 -11804 10086
5877 10086 22681 27885 23311 25520 20671 4850 -4966 -11710 -15420 -20588 -11323 3589 -10672 -6569
5863 -6569 -2792 5207 20453 17409 14103 -4693 -2560 -595 -11742 -2736 -7652 -5881 -9068 7915
5849 7915 21130 24236 1291 -30640 -45155 -25565 -11777 -11692 -1123 -1633 22044 29418 3962
5836 3962 -9732 -10635 -13543 -10829 -2557 -4199 -6217 301 7054 -3062 1896 13466 10238 6588
$$ packed form
5930B120j7082J0378L6976K592m6822j5295l010J3108K1496R785k4115L106n506
5917a2269q68N544k5491R41J6163L982k2879Q864J6526J4778J4709l0135j1049
5904b1184P477J3446L384j275L667q554L890r629M495J068l026p290j0182j0893
5890c4606j387J1959J3311j5166o426K1467J868j7377J1786R646j0293L414K1890
5877A0086J2595N204m574K209m849j5821r816o744l710n168R265J4912j4261M103
5863f569L777P999J5246l044l306j8796K133J965j1147R006m916J771l187J6983
5849G915J3215L106k2945l1931j4515J9590J3788Q5J0569n10K3677P374k5456
5836C962j3694r03k908K714Q272j642k018O518O753j0116M958J1570l228l650
$$ plain form
5822 6588 14781 -7980 -14099 -8310 -8558 -15751 -19042 -18266 -25018 -25915 -26397 -29133 -15416 -14663 -13857 -14715
5806 -14715 5366 12152 13293 5706 7334 20039 29334 10842 1029 -734 -13208 -16086 -19033 -9162
5792 -9162 1042 35441 48513 39745 35135 18228 -4523 6278 7433 -10711 -13893 -5599 15102
5779 15102 23332 10204 -7845 -12159 -6060 10384 14971 23283 21360 11849 19972 20699 7941 -21628
5765 -21628 -4169 2640 -5599 7876 -1717 -8262 -2682 7296 6278 -19022 -14810 134 -1141 -2448
5751 -2448 5229 -3106 -176 -154 -12434 -10522 -5623 -9632 -20282 -31457 -30513 -18880 4302 6128
5737 6128 -15554 -34493 -30137 -27204 -33282 -31543 -23672 -24537 -26661 -15961 -15581 -25820 -18170 6165
5723 6165 16589 4640 -10998 -8903 -5376 -5208 -6003 -5863 -10439 -26368 -35417 -23892 -9908 9041
$$ packed form
5822F588Q193k2761o119N789k48p193l291P76o752q97m82k736J3717P53Q06q58
5806a4715K0081O786J141p587J628J2705R295j8492r813j763j2474k878k947R871
5792i162J0204L4399J3072q768m610j6907k2751J0801J155j8144l182Q294K0701
5779A5102Q230j3128j8049m314O099J6444M587Q312j923r511Q123P27j2758k9569
5765b1628J7459O809q239J3475r593o545N580R978j018k5300M212J4944j275j307
5751b448P677q335K930K2j2280J912M899m009j0650j1175R44J1633K3182J826
5737F128k1682j8939M356K933o078J739P871q65k124J0700L80j0239P650K4335
5723F165J0424j1949j5638K095L527J68p95J40m576j5929r049J1525J3984J8949
$$ plain form
5709 9041 27370 20154 13164 10422 7312 -6904 -2949 -12106 -22315 -16954 -17046 -20529 -23578 -23518 -26945
5694 -26945 -34798 -32043 -23408 -550 5585 3910 19778 4850 2707 24998 24278 4680 -18409
5681 -18409 -11022 11450 5183 -32 2972 14285 19736 17135 3662 8011 12558 19147 15043 -4782
5667 -4782 -18199 -12003 -22403 -33093 -24364 -17394 -14412 -21157 -18656 -6631 -665 -5460 -13435 -15901
5653 -15901 -17717 -5090 -4168 -25315 -14045 7189 2179 -6834 -13967 781 19969 -2523 -1726
5640 -1726 2469 -12755 -4603 9251 14000 -664 -15796 -28498 -50992 -48093 -32327 -5235 -415
5627 -415 -13307 -14668 -13063 -23190 -21427 -12171 -18482 -27595 -18567 -22386 -31361 -19845 -4937 -18540
5613 -18540 -19823 -11435 8789 20800 10447 -5560 1753 -4452 5645 3200 16220 19217 9210
$$ packed form
5709I041J8329p216o990k742l110j4216L955r157j0209N361r2l483l049O0l427
5694b6945p853K755Q635K2858O135j675J5868j4928k143K2291p20j9598k3089
5681a8409P387K2472o267n215L004J1313N451k601j3473M349M547O589m104j9825
5667d782j3417O196j0400j0690Q729O970K982o745K501J2025N966m795p975k466
5653a5901j816J2627R22k1147J1270K1234n010r013p133J4748J9188k2492P97
5640a726M195j5224Q152J3854M749j4664j5132j2702k2494K899J5766K7092M820
5627d15j2892j361J605j0127J763R256o311r113R028l819q975J1516J4908j3603
5613a8540j283Q388K0224J2011j0353j6007P313o205J0097k445J3020K997j0007
$$ plain form
5600 9210 14642 3019 -4673 4214 2924 -3715 -9131 339 -412 -11483 -10769 -2790 13214 9546 5261
5585 5261 4360 -12879 -12547 12119 15401 15685 -3403 -28474 -31777 3948 28961 18402 13968 19766
5571 19766 19636 30779 44607 24330 18512 23915 34705 23403 33986 30813 9662 889 18903
5558 18903 24764 5331 -7719 -27125 -27608 -14967 -3522 8035 25447 15811 6215 -23984 -28837
5545 -28837 -19355 -22771 -26330 -8829 -4103 -26925 -20304 -9607 1702 9759 27169 21079 8138
5532 8138 11995 -219 15410 14102 7931 -11411 -10451 -8044 -2859 -9517 -3264 2700 2062 -65 -6435
5517 -6435 -21688 -26357 -14406 -5976 -11375 -3090 14470 22861 6246 -7671 2812 7703 7419 4023
5503 4023 -1529 -9031 416 9815 25469 28849 34966 19891 8016 4416 1447 6375 -2001 -5592
$$ packed form
5600I210N432j1623p692Q887j290o639n416R470p51j1071P14P979J6004l668m285
5585E261r01j7239L32K4666L282K84j9088k5071l303L5725K5013j0559m434N798
5571A9766j30J1143J3828k0277n818N403J0790j1302J0583l173k1151q773J8014
5558A8903N861j9433j3050j9406m83J2641J1445J1557J7412r636r596l0199m853
5545b8837R482l416l559J7501M726k2822O621J0697J1309Q057J7410o090j2941
5532H138L857j2214J5629j308o171j9342R60K407N185o658O253N964o38k127o370
5517f435j5253m669J1951Q430n399Q285J7560Q391j6615j3917J0483M891k84l396
5503D023n552p502R447R399J5654L380O117j5075j1875l600k969M928q376l591
$$ plain form
5489 -5592 4651 22301 37697 47171 43479 19044 9279 -1253 -13928 -11015 -11754 3260 12910
5476 12910 4668 -18898 -10464 6625 3209 5817 -7542 -4405 -16157 -23705 -30497 -28383 -37582 -53587
5462 -53587 -36299 -6459 4067 4072 -7773 -27851 -27423 -5465 -2467 14107 18568 3868 -10552
5449 -10552 -27503 -39325 -55674 -62018 -58481 -57454 -46326 -35267 -27246 -23607 -23477 -17833 -13765 -8529
5435 -8529 -20840 -19701 -20178 10267 8360 8689 13484 6417 -5068 -1483 -14683 -27320 -21399 -14453
5421 -14453 -3056 -2354 4146 1165 -2492 -6798 -4784 -2050 10468 -5127 -10393 -1851 2210 10158
5407 10158 3518 4291 18073 5984 -6813 -8162 39 14502 11588 4571 11259 4439 18266 12256
5393 12256 7769 819 -2949 8586 18449 14887 -7844 -25362 -25246 -21937 -15468 -6075 -3649 -12815
$$ packed form
5489e592J0243J7650J5396R474l692k4435r765j0532j2675K913p39J5014R650
5476A2910q242k3566Q434J7089l416K608j3359L137j1752p548o792K114r199j6005
5462e3587J7288K9840J0526Nj1845k0078M28K1958K998J6574M461j4700j4420
5449a0552j6951j1822j6349o344L537J027J1128J1059Q021L639J30N644M068N236
5435h529j2311J139m77L0445j907L29M795p067j1485L585j3200j2637N921O946
5421a4453J1397P02O500k981l657m306K014K734J2518j5595n266Q542M061P948
5407A0158o640P73J3782j2089j2797j349Q201J4463k914p017O688o820J3827o010
5393A2256m487o950l768J1535R863l562k2731j7518J16L309O469R393K426r166
$$ plain form
5379 -12815 -20343 4219 9516 -9657 -15882 -23261 -28984 -30381 -12135 -1442 -15293 -17599 -16378
5366 -16378 -9410 7899 4649 -2156 -17 -12736 -28708 -17661 -13180 -39805 -48998 -40497 -37755
5353 -37755 -16903 22142 31686 7687 -9870 -78 -9928 -8271 -11190 560 9781 14307 12327
5340 12327 6223 -2550 -14935 -36882 -34415 -13911 -6838 9418 20509 11806 3807 -11081 7005
5327 7005 12391 -2933 1733 -10998 -24820 -37384 -21645 -23685 -31189 -25298 -21223 -23066 -9695
5314 -9695 -1570 -18420 -19518 -14394 -19911 -18584 -15538 -4207 -2754 940 -3451 -2406 -5929 -12958
5300 -12958 -14934 -8324 -5218 2715 5282 13756 23520 6861 -7060 -7672 6352 -2256 -5131 -5872
5286 -5872 5152 17379 6692 7092 5920 7289 -6824 -25086 -35282 -32741 -16624 -5317 994
$$ packed form
5379a2815p528K4562N297j9173o225p379n723j397J8246J0693j3851k306J221
5366a6378O968J7309l250o805K139j2719j5972J1047M481k6625r193Q501K742
5353c7755K0852L9045R544k3999j7557R792r850J657k919J1750R221M526j980
5340A2327o104q773j2385k1947K467K0504P073J6256J1091q703p999j4888J8086
5327G005N386j5324M666j2731j3822j2564J5739k040p504N891M075j843J3371
5314i695Q125j6850j098N124n517J327L046J1331J453L694m391J045l523p029
5300a2958j976O610L106P933K567Q474R764j6659j3921o12J4024q608k875p41
5286e872J1024J2227j0687M00j172J369j4113j8262j0196K541J6117J1307O311
$$ plain form
5273 994 -4001 -6391 479 11924 3700 -3502 -10816 -21674 -32027 -7151 8231 3841 5042 6018
5259 6018 -5413 -27737 -16823 -15505 -16844 10062 21349 23340 -10996 -22860 -12874 -6373 -12505
5246 -12505 -39131 -48711 -37934 -38504 -46150 -31289 -9881 -7551 -9570 2798 7467 -11615 -15543
5233 -15543 -9722 -18530 -12814 -10815 -5446 -2119 -5174 1330 157 -2272 4974 14145 14183 15052 -12375
5218 -12375 -10501 1516 2303 9368 12615 13208 5227 11390 9833 2594 -4420 -11337 -3327 -3464 1348
5203 1348 -3508 -28862 -32027 -32589 -37769 -27851 -18739 -11827 5725 9000 8158 11141 686 -4829 2738
5188 2738 4322 9231 7689 8117 -6102 -3180 -8510 -29070 -13878 -8934 -2410 -8801 -13572 -14536 -21699
5173 -21699 -3855 15803 7635 1421 3263 -4380 -8135 -2788 12209 4982 1289 10544 16985 11285
$$ packed form
5273I94m995k390O870J1445q224p202p314j0858j0353K4876J5382m390J201R76
5259F018j1431k2324J0914J318j339K6906J1287J991l4336j1864R986O501o132
5246a2505k6626r580J0777n70p646J4861K1408K330k019J2368M669j9082l928
5233a5543N821q808N716J999N369L327l055O504j173k429P246R171L8Q69k7427
5218a2375J874J2017P87P065L247N93p981O163j557p239p014o917Q010j37M812
5203A348m856k5354l165n62n180R918R112O912J7552L275q42K983j0455n515P567
5188B738J584M909j542M28j4219K922n330k0560J5192M944O524o391m771r64p163
5173b1699J7844J9658q168o214J842p643l755N347J4997p227l693R255O441n700
$$ plain form
5159 11285 -683 2736 23038 24557 19489 844 4468 1864 18792 5847 -431 -3424 -3679 -15622
5145 -15622 -29137 -14804 4171 7753 3663 -6636 -2038 19099 33668 29732 26843 10593 8203
5132 8203 24646 26063 33100 33465 13823 -8660 -7861 9426 502 -29956 -28481 -19049 -13822 -2605
5118 -2605 7555 18520 23373 25403 25102 23966 7212 -6763 -36936 -38875 -21575 10549 4713
5105 4713 -7680 -18250 -21998 -13558 -23029 -25297 -36434 -39450 -31074 -12211 816 17515 2762
5092 2762 13956 29513 23609 74 -3909 3547 -2902 -32329 -39326 -31824 -32647 -27440 -19709 -13858
5078 -13858 -24462 -22977 -4931 3030 15486 10490 222 9484 2173 -5684 -3886 -12703 -3517 -648
5064 -648 18966 34375 20621 676 -4538 -5983 -13515 -10308 -8788 -4807 -8853 -21801 -14709 -1896
$$ packed form
5159A1285j1968L419K0302J519n068j8645L624k604J6928j2945o278k993k55j1943
5145a5622j3515J4333J8975L582m090j0299M598K1137J4569l936k889j6250k390
5132H203J6443J417P037L65j9642k2483P99J7287q924l0458J475R432N227J1217
5118b605J0160J0965M853K030l01j136j6754j3975l0173j939J7300L2124n836
5105D713j2393j0570l748Q440r471k268j1137l016Q376J8863J3027J6699j4753
5092B762J1194J5557n904k3535l983P456o449k9427o997P502q23N207P731N851
5078a3858j0604J485J8046P961J2456m996j0268R262p311p857J798q817R186K869
5064f48J9614J5409j3754j9945n214j445p532L207J520L981m046j2948P092J2813
$$ plain form
5050 -1896 9220 5389 -21960 -34932 -15601 -5797 -11124 -9958 -4674 10220 14135 -13952 -22354
5037 -22354 -11283 -9791 -8123 6847 17208 20716 8222 -7392 -5020 -1540 -2838 -12422 -26824
5024 -26824 -17369 -12442 -13900 -13947 -12814 -15130 -25314 -21030 -29263 -37685 -26314 -7673 -8050 -19148
5010 -19148 -11282 -2930 -3524 -7118 -18775 -22381 -30329 -14020 -9388 5623 4608 -9055 7979 20913
4996 20913 13652 20318 10721 1049 -844 -2518 6619 16399 9830 9607 10380 3460 1830 -9848 -28017
4981 -28017 -17307 -5603 -4696 -5278 -1840 -482 -14363 -28332 -15791 -17100 -18011 -8755 1479 680
4967 680 -14214 -30288 -21443 -16623 -10155 26973 41318 27443 22687 25909 38470 41679 12481
4954 12481 903 3882 10805 -1612 -11274 -5048 -21309 -17463 -10943 599 -12028 -8125 -4177
$$ packed form
5050a896J1116l831k7349j2972J9331R804n327J166N284J4894L915k8087q402
5037b2354J1071J492J668J4970J0361L508j2494j5614K372L480j298r584j4402
5024b6824R455M927j458m7J133k316j0184M284q233q422J1371J8641l77j1098
5010a9148P866Q352n94l594j1657l606p948J6309M632J5011j015j3663J7034J2934
4996B0913p261O666r597r672j893j674R137R780o569k23P73o920j630j1678j8169
4981b8017J0710J1704R07n82L438J358j3881j3969J2541j309r11R256J0234p99
4967F80j4894j6074Q845M820O468L7128J4345j3875m756L222J2561L209k9198
4954A2481j1578K979O923j2417r662O226j6261L846O520J1542j2627L903L948
$$ plain form
4941 -4177 -8419 -5722 -3716 4377 8321 3072 -780 1865 -4483 -2463 7351 2847 -3316 13120 26362
4926 26362 8633 400 2685 -3207 -11750 -2660 -7285 -3699 -8299 -33187 -25438 -24215 -25953 -18788
4912 -18788 -10491 2649 5870 -1932 -17294 -26314 -27856 -4871 -2677 1875 -3150 -23525 -36830
4899 -36830 -42044 -40704 -18423 -28283 -52539 -66347 -30867 -13925 -15415 -11029 -20147 -29259 -17933
4886 -17933 -11523 -20109 -20861 -23443 -5805 6357 3378 6185 -11307 -5286 6410 4630 -3599 -3769
4872 -3769 -13259 -28075 -24670 -11331 -12371 -23038 -24750 -15255 -25020 -18133 -15819 -12119 -13410 -14579
4858 -14579 -13079 -24996 -19629 -3564 -6314 -6492 -303 8371 16179 3363 5793 10623 -1182 6192
4844 6192 -4005 -16005 -12067 -26958 -22275 -20372 -13059 -2049 558 -7526 -704 2478 13481 5159
$$ packed form
4941d177m242K697K006Q093L944n249l852K645o348K020R814m504o163J6436J3242
4926B6362j7729q233K285n892q543R090m625L586m600k4888P749J223j738P165
4912a8788Q297J3140L221p802j5362r020j542K2985K194M552n025k0375j3305
4899c6830n214J340K2281r860k4256j3808L5480J6942j490M386r118r112J1326
4886a7933O410q586p52k582J7638J2162k979K807j7492O021J1696j780q229j70
4872c769r490j4816L405J3339j040j0667j712R495r765O887K314L700j291j169
4858a4579J500j1917N367J6065k750j78O189Q674P808j2816K430M830j1805P374
4844F192j0197j2000L938j4891M683J903P313J1010K607q084O822L182J1003q322
$$ plain form
4830 5159 -12587 -6629 -12029 -13342 3922 14308 -7432 -21446 -3085 -8610 -21597 -22524 -14300
4817 -14300 3733 11292 3386 629 8927 -2578 -27073 -23955 -24303 -22844 -9333 -10764 -18678 -20512
4803 -20512 -30166 -23799 -18719 -21047 -20947 -31283 -19300 -2293 13310 8729 15130 -5719 -18266
4790 -18266 -14810 1722 19432 29883 29625 11743 2465 9317 12895 -2115 -26677 -36549 -33054
4777 -33054 -28990 -12636 -3154 -2187 -14822 -24232 -28364 -28905 -21969 -12949 -9493 3801 9513 16691
4763 16691 10685 696 -7988 -2821 -4843 -21597 -30996 -9866 3519 1973 -14867 -3581 13899
4750 13899 17535 -5050 -12299 -4103 6779 10151 3131 -3320 13154 18118 -7912 -12814 -19609 -30835
4736 -30835 -37866 -33227 -27701 -23081 -18767 -13152 -18564 -5781 -3689 -9917 -3031 17845 27496 28626
$$ packed form
4830E159j7746N958n400j313J7264J0386k1740j4014J8361n525j2987r27Q224
4817a4300J8033P559p906k757Q298j1505k4495L118l48J459J3511j431p914j834
4803b0512r654O367N080k328J00j0336J1983J7007J5603m581O401k0849j2547
4790a8266L456J6532J7710J0451k58j7882r278O852L578j5010k4562r872L495
4777c3054M064J6354R482R67j2635r410m132n41O936R020L456J3294N712P178
4763A6691o006r989q684N167k022j6754r399K1130J3385j546j6840J1286J7480
4750A3899L636k2585p249Q196J0882L372p020o451J6474M964k6030m902o795j1226
4736c0835p031M639N526M620M314N615n412J2783K092o228O886K0876R651J130
$$ plain form
4722 28626 17143 19657 16089 -1781 -6456 9435 8493 -963 -4058 -7959 -11552 -12773 1443 3851
4708 3851 -3697 -6419 3798 -9812 -10537 2987 4279 -6331 3540 -1563 -15570 -28483 -32133 -18652
4694 -18652 6438 -775 -25159 -40524 -23239 -7095 1103 11732 19636 22377 24289 11374 12727
4681 12727 18351 14914 255 -25996 -18256 6296 15022 -268 7251 7902 8914 7841 5513 20838
4667 20838 30143 12770 -2978 -20704 -32617 -33482 -20044 7241 17580 8557 8915 -2084 -6335
4654 -6335 -10603 -10692 -25621 -31724 -24630 -21828 -4688 20332 29498 11110 6646 2637 6793 6400 -4875
4639 -4875 6702 18247 581 -4179 4518 6807 13299 25146 29180 21819 14861 17870 25376 21856
4625 21856 -2445 -2089 22109 11560 11289 8926 -2763 -3012 -23114 -29126 -20966 -6135 -5223 -6163
$$ packed form
4722B8626j1483K514l568j7870m675J5891r42r456l095l901l593j221J4216K408
4708C851p548k722J0217j3610p25J3524J292j0610R871n103j4007j2913l650J3481
4694a8652K5090p213k4384j5365J7285J6144Q198J0629P904K741J912j2915J353
4681A2727N624l437j4659k6251P740K4552Q726j5290P519O51J012j073k328J5325
4667B0838R305j7373j5748j7726j1913q65J3438K7285J0339r023L58j0999m251
4654f335m268q9j4929o103P094K802J7140K5020R166j8388m464m009M156l93j1275
4639d875J1577J1545j7666m760Q697K289O492J1847M034p361o958L009P506l520
4625B1856k4301L56K4198j0549k71k363j1689k49k0102o012Q160J4831R12r40
$$ plain form
4611 -6163 -241 11025 16677 -5486 -17745 -21767 -27306 -44483 -68628 -60032 -36010 -10675 13648
4598 13648 6761 7711 -853 -432 -11794 -15068 18757 37687 18120 -927 1260 -4571 -11154 -19406
4584 -19406 -26952 -18170 -29017 -30235 -38845 -30638 -25488 1998 17932 16099 1676 -13059 -16823
4571 -16823 -18419 -7806 -11259 -11667 -3492 -3772 -16811 -16125 -9704 3299 12705 5544 1652 10599 -6620
4556 -6620 -27854 -23272 -22173 -25388 -28587 -6243 16814 11077 15811 17149 18280 4381 -1958 4102
4542 4102 -192 -15226 -9926 -2361 3414 17455 15930 2986 -6428 5175 12895 12328 19391 24181
4528 24181 23441 12924 -17725 -22783 -531 4771 -3477 -7973 -14606 -19242 -14637 -12972 -8216 -11842
4514 -11842 -26052 -29945 -34569 -23230 -591 -8941 -21974 -19847 -23795 -29895 -28211 -20934 -23720 -14554
$$ packed form
4611f163N922J1266N652k2163j2259m022n539j7177k4145Q596K4022K5335K4323
4598A3648o887R50q564M21j1362l274L3825J8930j9567j9047K187n831o583q252
4584a9406p546Q782j0847j218q610Q207N150K7486J5934j833j4423j4735l764
4571a6823j596J0613l453m08Q175k80j3039O86O421J3003R406p161l892Q947j7219
4556f620k1234M582J099l215l199K2344K3057n737M734J338J131j3899o339O060
4542D102m294j5034N300P565N775J4041j525j2944r414J1603P720n67P063M790
4528B4181p40j0517l0649n058K2252N302q248m496o633m636M605J665M756l626
4514a1842j4210l893m624J1339K2639q350j3033K127l948o100J684P277k786R166
$$ plain form
4500 -14554 -4547 -3368 -5621 -20690 -13285 -23837 -22296 -14642 -12288 -5958 -9277 -8731 -11614 -15422
4486 -15422 -6589 -7415 -14259 -3670 -2035 -16456 -19264 -12635 -12975 140 -5443 -24814 -17576 -11500
4472 -11500 7907 17135 22717 14007 17372 34681 14624 -3045 1508 18877 44383 33094 36592
4459 36592 28181 13599 6539 -636 23351 19072 16414 16973 10355 -811 -4638 8358 23875 21037
4445 21037 23945 27566 23210 11975 11738 9507 29898 27136 13652 5353 2674 5772 404 1379
4431 1379 -951 -12723 -7056 6904 2938 -169 -7920 -15953 -22117 -16412 -1759 8891 1977 1101
4417 1101 -5629 -1418 -6069 -9186 -23357 -23888 -32395 -20512 9255 13323 7782 21053 22669 7260
4403 7260 -5044 4205 10160 17704 15313 3968 -2382 -548 8407 11444 -3502 -14733 -6856 -5091
$$ packed form
4500a4554J0007J179k253j5069P405j0552J541P654K354O330l319N46k883l808
4486a5422Q833q26o844J0589J635j4421k808O629l40J3115n583j9371P238O076
4472a1500J9407R228N582q710L365J7309k0057j7669M553J7369K5506j1289L498
4459C6592q411j4582p060p175K3987m279k658N59o618j1166l827J2996J5517k838
4445B1037K908L621m356j1235k37k231K0391k762j3484q299k679L098n368R75
4431A379k330j1772N667J3960l966l107p751q033o164N705J4653J0650o914q76
4417A101o730M211m651l117j4171n31q507J1883K9767M068n541J3271J616j5409
4403G260j2304R249N955P544k391j1345o350J834Q955L037j4946j1231P877J765
$$ plain form
4389 -5091 -7010 -10605 -8109 7632 -7972 1403 18992 12898 14166 18153 17426 11904 -1624 -22115
4375 -22115 -32473 -31334 -18562 -24712 -26828 -25038 -25466 -24258 -26757 -4234 8530 -8971 -14936 -11324
4361 -11324 5240 9261 26486 10024 -10900 -23098 -16270 -19912 -37540 -41570 -4676 26658 41286
4348 41286 40562 7347 -16057 -12294 -3521 -933 4648 14641 20756 18978 20326 8777 2189 -5248
4334 -5248 4559 11090 16439 -1029 -16465 -23347 -28911 -42211 -31756 -25097 -18033 -26181 -30319 -26922
4320 -26922 -24495 -18257 -17639 -5753 -1222 1639 3566 6384 5188 -2468 -13852 -19011 -32559 -36643
4306 -36643 -25686 -19550 -34162 -36130 -26271 -19524 -13434 -11888 -18640 -15516 -31315 -37759 -34794 -37173
4292 -37173 -37898 -34126 -15232 -11432 -3506 14937 10084 -10233 -34528 -37652 -30106 -48660 -49401 -32798
$$ packed form
4389e091j919l595K496J5741j5604R375J7589o094J268L987p27n522j3528k0491
4375b2115j0358J139J2772o150k116J790m28J208k499K2523J2764j7501n965L612
4361a1324J6564M021J7225j6462k0924j2198O828l642j7628m030L6894L1334J4628
4348D1286p24l3215k3404L763Q773K588N581R993O115j778J348j1549o588p437
4334e248R807O531N349j7468j5436o882n564j3300J0455O659P064q148m138L397
4320b6922K427O238O18J1886M531K861J927K818j196p656j1384n159j3548m084
4306c6643J0957O136j4612j968R859O747O090J546o752L124j5799o444K965k379
4292c7173p25L772J8894L800P926J8443m853k0317k4295l124P546j8554p41J6603
$$ plain form
4278 -32798 -20845 -14671 -19749 -38054 -38439 -39648 -38200 -36833 -8466 8314 -4240 -16767 -19763
4265 -19763 -2294 -8048 -574 3653 6455 8135 -5324 -15492 -11524 -22453 -28066 -33076 -27949 -19382
$$ packed form
4278c2798J1953O174n078j8305l85j209J448J367K8367J6780j2554j2527k996
4265a9763J7469n754P474M227K802J680j3459j0168L968j0929n613n010N127Q567
$$ [...]
##END NTUPLES=NMR SPECTRUM
##END=
