##TITLE=Analysis number 330354
Compound Code cc 66322
Book Reference 464/150/1
Project Code adrs
Chemist Name chrisr
##JCAMPDX= 6.0         $$ Bruker NMR JCAMP-DX V2.0
##DATA TYPE= NMR SPECTRUM
##DATA CLASS= NTUPLES
##ORIGIN= Bruker BioSpin GmbH
##OWNER= nmr
$$ XWIN-NMR		Version 3.5
$$ Fri Nov 16 13:23:10 2007 GMT Standard Time (UT+0h)  MAYBRIDGE\nmr@NMR_250MHZ
##.OBSERVE FREQUENCY= 250.131544655141
##.OBSERVE NUCLEUS= ^1H
##.ACQUISITION MODE= SIMULTANEOUS (DQD)
##.ACQUISITION SCHEME= undefined
##.AVERAGES= 16
##.DIGITISER RES= 18
##SPECTROMETER/DATA SYSTEM= dpx250
##.PULSE SEQUENCE= zg30
##.SOLVENT NAME= CDCl3
##.SHIFT REFERENCE= (INTERNAL, CDCl3, 0, 16.522)
##AUDIT TRAIL= $$ (NUMBER, WHEN, WHO, WHERE, WHAT)
$$ ##TITLE= Audit trail, XWIN-NMR		Version 3.5
$$ ##JCAMPDX= 5.01
$$ ##ORIGIN= Bruker BioSpin GmbH
$$ ##OWNER= nmr
$$ C:\u/data/dgb/nmr/ADRS/1760/pdata/1/auditp.txt
$$ ##AUDIT TRAIL=  $$ (NUMBER, WHEN, WHO, WHERE, WHAT)
(   1,<2007-11-16 13:22:44.05 +000>,<MAYBRIDGE\nmr>,<NMR_250MHZ>,
      <created by zg, POWCHK disabled, PULCHK disabled
       configuration hash MD5:
       76 6E 9A 78 1E 09 19 81 EC 84 63 8F B0 6A 59 2D
       data hash MD5: 64K
       D3 15 F8 2B 0B EE 77 D2 BF B0 53 E8 32 5B 48 04>)
(   2,<2007-11-16 13:22:59.68 +000>,<MAYBRIDGE\nmr>,<NMR_250MHZ>,
      <Start of raw data processing
       ef LB = 0.3 FT_mod = 6 PKNL = 1 SI = 32K 
       data hash MD5: 32K
       B7 B3 CA 4F 23 AF A5 3E FD 13 2F B1 71 03 5C A6>)
(   3,<2007-11-16 13:23:01.25 +000>,<MAYBRIDGE\nmr>,<NMR_250MHZ>,
      <apk 
       data hash MD5: 32K
       9C 80 7D 01 37 39 56 7E 93 13 1B 72 D7 79 04 4B>)
(   4,<2007-11-16 13:23:01.96 +000>,<MAYBRIDGE\nmr>,<NMR_250MHZ>,
      <abs ABSG = 5 
       data hash MD5: 32K
       75 93 49 34 E4 1E BE 05 44 32 17 FC A9 BF FA 44>)
$$ ##END=
$$ 
$$ hash MD5
$$ D7 83 A8 BB 03 67 12 83 6C 4B EB 82 DA 9C F9 64
##$RELAX= 
##$RELAX= 
##$RELAX= 
##$RELAX= 
##$RELAX= 
##$RELAX= 
##$RELAX= 
$$ Bruker specific parameters
$$ --------------------------
##$DU= <C:\u>
##$EXPNO= 1760
##$NAME= <ADRS>
##$PROCNO= 1
##$TYPE= <nmr>
##$USER= <dgb>
##$AMP= (0..31)
100 100 100 100 100 100 100 100 100 100 100 100 100 100 100 100 100 100 
100 100 100 100 100 100 100 100 100 100 100 100 100 100 
##$AQSEQ= 0
##$AQ_mod= 3
##$AUNM= <au_zg>
##$AUTOPOS= <30 >
##$BF1= 250.13
##$BF2= 250.13
##$BF3= 250.13
##$BF4= 250.13
##$BF5= 500.13
##$BF6= 500.13
##$BF7= 500.13
##$BF8= 500.13
##$BYTORDA= 1
##$CFDGTYP= 0
##$CFRGTYP= 5
##$CHEMSTR= <none>
##$CNST= (0..31)
1 1 145 1 1 1 1 1 1 1 1 1 1 1 1 1 1 1 1 1 1 1 1 1 1 1 1 1 1 1 1 1 
##$CPDPRG= <>
##$CPDPRG1= <>
##$CPDPRG2= <>
##$CPDPRG3= <>
##$CPDPRG4= <mlev>
##$CPDPRG5= <mlev>
##$CPDPRG6= <mlev>
##$CPDPRG7= <mlev>
##$CPDPRG8= <mlev>
##$CPDPRGB= <>
##$CPDPRGT= <>
##$D= (0..31)
0 1 0 0 0 0 0 0 0 0.06 0 0 0 0 0 0 0.0002 0 0 0 0 0 0 0 0 0 0 0 0 0 0 
0 
##$DATE= 1195219362
##$DBL= (0..7)
120 120 120 120 120 120 120 120 
##$DBP= (0..7)
150 150 150 150 150 150 150 150 
##$DBP07= 0
##$DBPNAM0= <>
##$DBPNAM1= <>
$$ [...]
##$SUBNAM7= <"">
##$SUBNAM8= <"">
##$SUBNAM9= <"">
##$SW= 20.6930455092707
##$SWIBOX= (0..15)
0 0 3 0 0 0 0 0 0 0 0 0 0 0 0 0 
##$SW_h= 5175.983436853
##$TD= 65536
##$TD0= 1
##$TE= 295.16
##$TE2= 300
##$TE3= 300
##$TEG= 300
##$TL= (0..7)
0 120 120 120 120 120 120 120 
##$TP= (0..7)
150 150 150 150 150 150 150 150 
##$TP07= 0
##$TPNAME0= <>
##$TPNAME1= <>
##$TPNAME2= <>
##$TPNAME3= <>
##$TPNAME4= <>
##$TPNAME5= <>
##$TPNAME6= <>
##$TPNAME7= <>
##$TPOAL= (0..7)
0.5 0.5 0.5 0.5 0.5 0.5 0.5 0.5 
##$TPOFFS= (0..7)
0 0 0 0 0 0 0 0 
##$TUNHIN= 0
##$TUNHOUT= 0
##$TUNXOUT= 0
##$USERA1= <user>
##$USERA2= <user>
##$USERA3= <user>
##$USERA4= <user>
##$USERA5= <user>
##$V9= 5
##$VALIST= <valist>
##$VCLIST= <CCCCCCCCCCCCCCC>
##$VD= 0
##$VDLIST= <DDDDDDDDDDDDDDD>
##$VPLIST= <PPPPPPPPPPPPPPP>
##$VTLIST= <TTTTTTTTTTTTTTT>
##$WBST= 1024
##$WBSW= 4
##$XGAIN= (0..3)
0 0 0 0 
##$XL= 0
##$YL= 0
##$YMAX_a= 313211
##$YMIN_a= -303682
##$ZGOPTNS= <>
##$ZL1= 120
##$ZL2= 120
##$ZL3= 120
##$ZL4= 120
##$ABSF1= 16.522
##$ABSF2= -4.171173
##$ABSG= 5
##$ABSL= 3
##$ALPHA= 0
##$AQORDER= 0
##$ASSFAC= 0
##$ASSFACI= 0
##$ASSFACX= 0
##$ASSWID= 0
##$AUNMP= <proc_1d>
##$AZFE= 0.1
##$AZFW= 0.1
##$BCFW= 0
##$BC_mod= 0
##$BYTORDP= 0
##$COROFFS= 0
##$CY= 12.5
##$DATMOD= 1
##$DC= 0
##$DFILT= <>
##$DTYPP= 0
##$F1P= 14.0000005364418
##$F2P= -0.99999901652339
##$FCOR= 0.5
##$FTSIZE= 32768
##$FT_mod= 6
##$GAMMA= 0
##$GB= 0
##$INTBC= 1
##$INTSCL= 1
##$ISEN= 128
##$LB= 0.3
##$LEV0= 0
##$LPBIN= 0
##$MAXI= 10000
##$MC2= 0
##$MEAN= 0
##$ME_mod= 0
##$MI= 0
##$NCOEF= 0
##$NC_proc= -3
##$NLEV= 6
##$NOISF1= 0
##$NOISF2= 0
##$NSP= 0
##$NTH_PI= 0
##$NZP= 0
##$OFFSET= 16.522
##$PC= 1
##$PHC0= 176.4346
##$PHC1= 5.241322
##$PH_mod= 1
##$PKNL= yes
##$PPARMOD= 0
##$PSCAL= 4
##$PSIGN= 0
##$REVERSE= no
##$SF= 250.13
##$SI= 32768
##$SIGF1= 0
##$SIGF2= 0
##$SINO= 400
##$SIOLD= 32768
##$SREGLST= <1H.CDCl3>
##$SSB= 0
##$STSI= 32768
##$STSR= 0
##$SW_p= 5175.98343685301
##$SYMM= 0
##$S_DEV= 0
##$TDeff= 65536
##$TDoff= 0
##$TI= <Analysis number 999999
Compound Code 99
Book Reference 9
Project Code 9>
##$TILT= no
##$TM1= 0
##$TM2= 0
##$TOPLEV= 0
##$USERP1= <user>
##$USERP2= <user>
##$USERP3= <user>
##$USERP4= <user>
##$USERP5= <user>
##$WDW= 1
##$XDIM= 32768
##$YMAX_p= 406957246
##$YMIN_p= -260881
$$ End of Bruker specific parameters
$$ ---------------------------------
##NTUPLES= NMR SPECTRUM
##VAR_NAME=  FREQUENCY,     SPECTRUM/REAL,   SPECTRUM/IMAG
##SYMBOL=    X,             R,               I
##VAR_TYPE=  INDEPENDENT,   DEPENDENT,       DEPENDENT
##VAR_FORM=  AFFN,          ASDF,            ASDF
##VAR_DIM=   32768,         32768,           32768
##UNITS=     HZ,            ARBITRARY UNITS, ARBITRARY UNITS
##FACTOR=    0.157963299565203, 1,           1
##FIRST=     4132.6476996994, 0,             0
##LAST=      -1043.33573715361, 0,           0
##MIN=       -1043.33573715361, -260881,     0
##MAX=       4132.6476996994, 406957246,     0
$$ Real data points
##PAGE= N=1
##DATA TABLE= (X++(R..R)), XYDATA
$$ [...]
18792A31901k7393l4202m6639P035K1001L462J3847k7470l1107k3035J2448M2918
18780D2766L2205n383k6916P947K6213L192R216j6654L7995O6633R5680J24963
18768C97857J75781P0564j22202j41652j51508r3589J1085l9368J8771K6466m5555
18757A06650k9021J7659N201J1384k3987J8560K9873J0517M2416K7267L0501N37
18745B47557j244m1271M811J527K7964j6843m0055m1904l2411K5376K40O034J0058
18732A49839j6791j0151P452j2727O393J6153o2555k7647P764J5424j2812J1088
18720G1430l052k0642l717J3882q360J232j8025N3098M2890J2580k044l7892p4343
18707B7037m680L5778N3969P193k3523K1966K6083K9111J0915Q985J7654n698
$$ plain form
18792 131901 104508 70306 23667 30702 51703 55165 69012 41542 10435 -12600 -152 42766
18780 42766 74971 69588 42672 50619 76832 80024 89240 72586 110581 177214 272894 397857
18768 397857 573638 644202 522000 380348 228840 135251 146336 106968 125739 152205 106650
18757 106650 77629 95288 100489 111873 87886 106446 136319 146836 189252 216519 247020 247557
18745 247557 246313 205042 209853 211380 239344 222501 182446 140542 108131 133507 133747 139781 149839
18732 149839 133048 122897 130349 117622 124015 140168 77613 49966 57730 73154 60342 71430
18720 71430 68378 47736 44019 57901 49541 50773 32748 85846 128736 141316 139272 101380 27037
18707 27037 22357 58135 112104 119297 95774 117740 143823 172934 183849 192834 210488 204790
18695B04790J8839K6693Q584j7685m7165m1392m3651k6745p1095m1990k8806n0215
18683a09838O064Q1240Q6281M727j6460j1194l146k0395m7937n9557J6601N7728
18671a5886N2231K3330j1340K3242L7910J0745k5681K2999J202m4092R037j914
18659H1783L8607P1397J35j9017q815Q888m1752l9360O474M7408o349J9159K1521
18646A80079m146O636L0425N714j326J6102L6406m030M1695J07605J10326J2425
18634E37911L565L0467m63J2211K4498Q3299J69153K57975M06684L29766l8471
18623A816595j84426k22580k19549j97853j10826j4469P1175J18034K56904M98448
18613A811453M55209k3895k32783k97518l62116k60906j38252m2098m060L0516
$$ plain form
18695 204790 223629 250322 258906 241221 194056 152664 109013 82268 11173 -30817 -59623 -109838
18683 -109838 -103774 -22534 63747 68474 52014 40820 37674 17279 -30658 -90215 -73614 -15886
18671 -15886 36345 59675 48335 71577 109487 120232 94551 117550 118752 74660 83697 81783
18659 81783 120390 191787 191922 172905 164090 172978 131226 91866 98340 145748 139399 158558 180079
18646 180079 175933 182569 212994 218708 217382 233484 269890 265860 307555 415160 525486 537911
18634 537911 541476 571943 571480 583691 608189 691488 860641 1118616 1525300 1855066 1816595
18623 1816595 1632169 1409589 1190040 992187 881361 866892 938067 1056101 1313005 1811453
18613 1811453 2266662 2242767 2009984 1712466 1350350 1089444 951192 909094 905034 935550
18603I35550L5697N3835N5252L2809M717N8224J53917J47636J75397J64691J64412
18592A982137K43271L66075N95193Q43144J261129J924651J843262K64614n64033
18583H759443p41998q09467k77311M95183J374324K550340L672265K470112k13978
18574A7278913p96220p90700l9695J108887M60943q80250q72767p93096k14599
18565A4461416Q21904K084342L646029O007166R916600J5015454J7394555J4812048
18557H4159514R072116k730920j0860685j2062269j2403010r102168m100623P05962
18549D2677917O394051J2839131J4572163Q559521K666800l322544o321479p847484
18541G0218076j0377294j1019737j0014747q421852o246217m180201k520546j339132
$$ plain form
18603 935550 971247 1025082 1080334 1113143 1117860 1176084 1330001 1477637 1653034 1817725 1982137
18592 1982137 2225408 2591483 3186676 4029820 5290949 7215600 9058862 9323476 8759443
18583 8759443 8017445 7207978 6930667 7425850 8800174 11350514 15022779 17492891 17278913
18574 17278913 16482693 15691993 15652298 16761185 17222128 16341878 15469111 14676015 14461416
18565 14461416 15283320 17367662 21013691 27020857 36937457 51952911 69347466 84159514
18557 84159514 93231630 90500710 79640025 67577756 55174746 46072578 41971955 42677917
18549 42677917 49071968 61911099 76483262 85042783 87709583 84387039 78065560 70218076
18541 70218076 59840782 48821045 38806298 30384446 24138229 19958028 17437482 16098350
18533A6098350l81784L88327J349907K680028M632329O419574M257650j33647
18525C5310734o25664q5042P46169J63141m84902j573894k633431r96389J057170
18516C0877892J311820L11376J698163M104221N198580K330143N96348J97996
18508D6626539l971784p003496o387680n535024l777370k552457k622297k323000
18500A2453431k096348j874751j270614p07181k18795K04436O55082J268793J315091
18491I729144K34183k70478j91684l07004n43751m27427k6201O51865J842920
18482A0691567K220127j43281j342566j311055j571370j601028j298133j061987
18474D582274q31848n65001l81251k09266q1132J196P8346K39477N47876O23177
$$ plain form
18533 16098350 15716566 16104893 17454800 20134828 24767157 31186731 35444381 35310734
18525 35310734 34685070 34600028 35346197 35509338 35024436 33450542 30817111 29820722 30877892
18516 30877892 32189712 32501088 34199251 38303472 43502052 45832195 46428543 46626539
18508 46626539 42654755 35651259 29263579 23728555 19951185 17398728 14776431 12453431
18500 12453431 10357083 8482332 7211718 6504537 6285742 6490178 7145260 8414053 9729144
18491 9729144 9963327 9692849 9501165 9194161 8650410 8222983 8196782 8848647 10691567
18482 10691567 12911694 12768413 11425847 10114792 8543422 6942394 5644261 4582274
18474 4582274 3750426 3185425 2804174 2594908 2513776 2514972 2593318 2832795 3380671 4003848
18464D003848N2712l58154l21589l77710j52460K42848N55110N33908J12951K07595
18454D499059M92861L79691m15582q00412q13824q36650o26301l55713k19709
18445A303420j59989j37814q4592o5543j7454P2501N2074K4545o2614o7353o7563
18434G89618p0949q9823p3673R253M032k7763k5633j6170l0739n3613n7690k9150
18422C27700l3511J3698K734J756J15M6627J5581l2516j5567n5146m5180L0859
18410B57150P2610K9406M454K5871j6202n3941n5163k7522n8970k8487K6829K9273
18398B05308J3245j703o2126J109L6919j1242l7850j6929J7261L107k853L017
18386A47263p139j4148L1242O6908J6589L812L7137k4241j5697l8042l7891M728
$$ plain form
18464 4003848 4056560 3698406 3376817 2999107 2846647 3089495 3644605 4178513 4291464 4499059
18454 4499059 4991920 5371611 4956029 4155617 3341793 2505143 1878842 1523129 1303420
18445 1303420 1143431 1005617 921025 855482 838028 910529 962603 987148 924534 857181 789618
18434 789618 718669 628846 555173 564426 568458 540695 515062 498892 468153 414540 356850 327700
18422 327700 294189 307887 310621 312377 312492 359119 374700 342184 326617 271471 226291 257150
18410 257150 329760 359166 363620 389491 373289 319348 264185 236663 177693 149206 176035 205308
18398 205308 218553 216850 154724 155833 192752 181510 143660 126731 143992 147099 144246 147263
18386 147263 140124 125976 157218 224126 240715 244527 281664 257423 241726 203684 165793 170521
18374A70521Q488N605k4419k1915q413q157j2146J0776j5606K686J0852r860N9867
18361A68279J6371o0806l0472l783k3801l056J5827k0698k5099R887K0429J5899
18349G8977L2543k0558J7902N6869K6763J2930o579n2978o780J6370j8944j2259
18337A24256j8304J6420k0294l0048p239L2856M4996O271m9999m9314K4176k021
18325G1756o058N2804M9043l7028o8146j596K7130L5184L7617L6589l4846n2530
18313A09919J2898o363j7251k2294j3039m137K6744K2805O623p390m042R66K0024
18300A25463K86K770j4286J6523j3740k8118M4268K4143n547j5385l6071O118
18288A06424K1579k7324J9315K3356J591j6420j3051k8682l7656n2416o246M1276
$$ plain form
18374 170521 179009 184614 160195 138280 129867 121710 109564 120340 104734 107420 118272 108412 168279
18361 168279 184650 123844 93372 89589 65788 62732 78559 57861 32762 42649 63078 78977
18349 78977 111520 90962 108864 165733 192496 205426 198847 145869 139089 155459 136515 124256
18337 124256 105952 122372 102078 72030 64791 97647 142643 148914 98915 49601 73777 71756
18325 71756 65698 118502 167545 130517 62371 60775 87905 123089 160706 197295 162449 109919
18313 109919 122817 116454 99203 76909 63870 59733 86477 109282 115905 108515 104473 105439 125463
18300 125463 125749 128519 114233 130756 117016 88898 133166 157309 151762 136377 100306 106424
18288 106424 128003 100679 119994 143350 144941 128521 115470 86788 49132 -3284 -9530 31746
18276C1746K724K9015k3082k2972J1988K9187K652l6375N3506j0805Q407K072
18264G8063j7220J1498j658l468j0997Q059N1920Q266n1997r197l218P142J1929
18251G9122L492K0491K0773J6772J677L796p623j00n5201p9240k6403L6339K0902
18238C4797k8545J438p442m1889M4858O8716K45j675J4168l452l1231l1327J2873
18225C1534j8341J6553K4125J4044l606l1432l2580M366M5823j6272O70j8835
18213A6049j8389M8343O9041r907k9714J7607j9547p6227M590J9126l4838K9412
18201A5546K1846l2895k1924j6288R297N3732K1630j0419q458l0719m000p802
18189a0454J6777j0292M38K1477N5640M8170J2812l9117K294K6077r537K423J7430
$$ plain form
18276 31746 34470 63485 40403 17431 29419 58606 61258 24883 78389 67584 75991 78063
18264 78063 60843 72341 70683 67215 56218 64277 116197 124463 72466 63269 60051 67193 79122
18251 79122 82614 103105 123878 140650 142327 146123 138500 138400 83199 3959 -22444 13895 34797
18238 34797 6252 7690 248 -41641 3217 71933 72178 70503 84671 81219 49988 18661 31534
18225 31534 13193 29746 53871 67915 64309 32877 297 4663 50486 34214 34884 16049
18213 16049 -2340 46003 115044 105137 75423 93030 73483 -2744 1846 20972 -13866 15546
18201 15546 37392 4497 -17427 -33715 -24418 29314 50944 40525 32067 1348 -2652 -10454
18189 -10454 6323 -3969 -3531 17946 73586 121756 134568 95451 97745 123822 114285 116708 134138
18176A34138r010k7039J7862J6638r100m4457q582L5202J6753k1106J9024m458
18164A15865J9960J1694Q494l3895j6539j3358N660L1128N5609K8366m909m6064
18152A62011l0628k4089M6686L6934P227L0608j7529K9408P468k5992J6966L8821
18140B77891O8607O7834M1393K1246j5691J4817J6613N2521N5234J27830J00994
18129H29289J18195R8444J88857K10711K81189L04748L55941L79284M26732M67910
18119C661300N98469P54322J004937J446779K275405L625208N901300J0148445
18111B9416165J9128930L0763837J2277308j4982339j4042262j9401308j6405918
18104B6754413r313064n153758l122506k079155j441484j002507p29968o01284
$$ plain form
18176 134138 125128 98089 115951 132589 123489 79032 70450 105652 122405 101299 120323 115865
18164 115865 135825 147519 156013 122118 105579 92221 97881 129009 184618 212984 208075 162011
18152 162011 131383 107294 153980 190914 198141 228749 211220 240628 248096 222104 239070 277891
18140 277891 346498 414332 455725 476971 461280 476097 492710 545231 600465 728295 829289
18129 829289 947484 1045928 1234785 1445496 1726685 2031433 2387374 2766658 3193390 3661300
18119 3661300 4259769 5014091 6019028 7465807 9741212 13366420 19267720 29416165
18111 29416165 48545095 79308932 91586240 76603901 62561639 43160331 26754413
18104 26754413 17441349 12287591 9165085 7085930 5644446 4641939 3911971 3310687
18096C310687m47352l74548l18583k83582k13758j60932j30206r7917j18994j10391
18086A054424j35129j09391n2646q5365r0123m1089k205j7897k9733l1302o7446
18075C92098j6149O6933J975m3616j9457k9546J0838L3531k933k6673k1520O505
18063C51986J6760L5303P924J2295k2161l2931j5061j2589M4305L2924j7930M475
18051D05300L3944N2488j4175J680p6559j17630n1027m7525n497r137q161r359
18039A54342P696P912n319l1599k8048N2512O1646J5729k3307k3597j0906R936
18027A86997J8524M9746l7268j22568j8471N2641K7741n68K5695M627O4069L8712
18015B89877M1110O9569L5522j0461k1658l8877m1115n0130L3369j7423p9174
$$ plain form
18096 3310687 2863335 2488787 2170204 1886622 1672864 1511932 1381726 1283809 1164815 1054424
18086 1054424 919295 809904 757258 671893 581770 540681 538476 520579 490846 459544 392098
18075 392098 375949 442882 444857 401241 381784 352238 363076 396607 393674 367001 345481 351986
18063 351986 368746 404049 411973 424268 402107 369176 354115 341526 385831 418755 400825 405300
18051 405300 439244 491732 477557 479237 402678 285048 234021 186496 180999 171862 163701 154342
18039 154342 162038 169950 164631 133032 104984 157496 219142 234871 211564 187967 177061 186997
18027 186997 205521 255267 217999 95431 76960 129601 157342 156774 182469 187096 251165 289877
18015 289877 330987 400556 436078 425617 403959 365082 323967 273837 307206 289783 210609
18004B10609M416R112l445P292k8289j9956N875K4798L377R636l779n2200m1535
17991A25911j3323j266l358k5177m2856j0650K0166Q6499P8009M0961m092l599
17979B47225m1479m1059n2228j2020L8951p201J3570l7021K4779J0604r819k7715
17967A06587m8400n0681r398o778j6810L2885N2416M0328O976j2800K463L7792
17955A34580M2540L5006m566j5155n7788o4749k317J1479l161j8524N3542N110
17943A15997l5950K7326K3328j2390m8743n8050m883L4631M0794L2912j1101k772
17931A01099o3536j032L9152J3557l0281j8895m0757j1938J6022N2735L857l8822
17919B1161k9789J1288J8695M4633m0047j1504p017J0657L4733m638l9514l1259
$$ plain form
18004 210609 215025 224137 220692 227984 199695 179739 185614 210412 213789 223425 219646 167446 125911
17991 125911 112588 111322 107964 82787 39931 29281 49447 135946 213955 254916 250824 247225
17979 247225 205746 164687 112459 100439 139390 132189 145759 108738 133517 144121 134302 106587
17967 106587 58187 7506 -1892 -8670 -25480 7405 59821 100149 107125 94325 96788 134580
17955 134580 177120 212126 207560 192405 134617 69868 67551 79030 75869 57345 110887 115997
17943 115997 80047 107373 130701 118311 69568 11518 6635 41266 82060 114972 103871 101099
17931 101099 37563 36531 75683 89240 58959 40064 -693 -12631 3391 56126 59983 21161
17919 21161 -8628 2660 21355 65988 25941 14437 7420 18077 52810 48172 8658 -22601
17907b2601R285L0550o0837J5076M7151k807J2150J1333j5307l8661m0450L9816
17895a5302N3352j4325k2488k1584o648K2529K7312M7124M0998l2302j1627k505
17883F4534J7378K6844J4436l9715L592j530m1240l2959l1420k7345L9662J8147
17871A0384k2824L3964J8516j5766j3336m4428j829O029J4887p191L2711L2004
17859D3121P130k7526P774r607j4249K81P131K8316J057m5150j1973P61k9355
17846d2289k1674O0929k423l7256J5131J1273Q199K4928o334j6867k5153K8583
17834b953J4860j5757j2063N5689m2728k1446k7469l7730J5812L5582Q568m511
17822c4146J2337K8526N4807P259j8212L546j2102j1986k3799p167p790k1573
$$ plain form
17907 -22601 -13316 17234 -43603 -28527 18624 15817 27967 39300 23993 -14668 -55118 -15302
17895 -15302 38050 23725 1237 -20347 -26995 -4466 22846 69970 110968 78666 67039 64534
17883 64534 81912 108756 123192 83477 87069 85539 44299 11340 -20080 -47425 -7763 10384
17871 10384 -12440 21524 40040 24274 10938 -33490 -35319 -29290 -14403 -21594 11117 43121
17859 43121 50251 22725 30499 20892 6643 6924 14055 42371 43428 -1722 -13695 -12934 -42289
17846 -42289 -63963 -3034 -5457 -42713 -27582 -16309 -8110 16818 10484 -6383 -31536 -2953
17834 -2953 11907 -3850 -15913 39776 -2952 -24398 -51867 -89597 -73785 -38203 -29635 -34146
17822 -34146 -21809 6717 61524 68783 50571 54117 42015 30029 6230 -937 -8727 -30300
17810c0300P186M1131M6090M4225n687k6797K8503n952Q834J0357j8434o623J0028
17797A02561j3378m6072m5139j9100j4580K8449l1425q019N1070o502j2722j5288
17785c0145J8034J8383j8674r878J0982K7489m60k1155m303j4329J632K4160J9919
17772B1655J0347J1095J491J0058J81k3460j1483j8153o979L832j6911K0719L4800
17759C7192J0058l8334J816j0392l000N251K7828n4757m0350K2407K0795j6713
17747c8199n08Q8581N016O856j8259K106j5663k0057k1931k3455J2614L7603J9533
17734C4237N632R053l065P812J638J2493j7046k8966l039N612L189K1000J0817
17721E9367m1724L603j4706j7016M907J2350J7647k9101j0844k5551M362N725
$$ plain form
17810 -30300 -23114 18017 64107 108332 102645 75848 104351 98399 107233 117590 99156 92533 102561
17797 102561 89183 43111 -2028 -21128 -35708 -7259 -38684 -46703 4367 -2135 -14857 -30145
17785 -30145 -12111 6272 -12402 -22280 -11298 16191 15731 -5424 -9727 -24056 -22424 1736 21655
17772 21655 32002 43097 44588 54646 54827 31367 19884 1731 -5248 -1416 -18327 2392 37192
17759 37192 47250 8916 10732 340 -2660 2591 30419 -24338 -64688 -42281 -21486 -38199
17747 -38199 -38707 49874 54890 61746 43487 45593 29930 9873 -12058 -35513 -22899 14704 34237
17734 34237 39869 48922 45857 53669 55307 67800 50754 21788 18749 24361 27550 48550 59367
17721 59367 17643 21246 6540 -10476 -5569 6781 24428 -4673 -15517 -41068 -36706 -30981
17709c0981K0959J755J2771P693K076K893L323l755k0604j4174L6864r822j4279
17696e281J7611m16J0718J866N4310K512j7380L0686O997J252J0691k8482l5741
17683D9343J6239R804P943J7850r363o7522k3810N5144K908m0934j3650L2413
17671C6365J8986n0555j5630j0490k3113J1409N2602M1450K2210n3757o6773l5158
17659g2454m619O4872L2598k7142m6569j852J6283K6614J4643n882j9245K6979
17647D226Q378L5244L5470l9743m8609j0813M532N2994K2214J802m6412l6126
17635a6843J1139J486J7813j3464j5506J1882N446j2950l2469k461M0703J7034
17623A1810k407J1351K9039j2987m6368j5901j5655J9467K7994K1872Q24j4732
$$ plain form
17709 -30981 -10022 -8267 4504 12197 14273 17166 20489 16734 -3870 -18044 18820 8998 -5281
17696 -5281 12330 11914 22632 24498 78808 81320 63940 94626 101623 102875 113566 85084 49343
17683 49343 65582 75386 83329 101179 91816 24294 484 55628 58536 17602 3952 36365
17671 36365 55351 4796 -10834 -21324 -44437 -33028 19574 61024 83234 29477 -37296 -72454
17659 -72454 -77073 -12201 20397 -6745 -53314 -55166 -38883 -12269 2374 -3508 -22753 4226
17647 4226 12604 47848 83318 43575 -5034 -15847 -11315 41679 63893 65695 19283 -16843
17635 -16843 -5704 -4218 13595 131 -15375 -3493 1953 -10997 -43466 -45927 -5224 11810
17623 11810 9403 20754 49793 36806 -9562 -25463 -41118 -21651 6343 28215 29039 14307
17611A4307l9606j2344J1731j7997L8856N9441m0301m4802j8298K1964K3199J040
17599b810N3713k4681r4814k8610N1290M4813K319q433m728L80k4546k4380J9800
17586d0687j1135L3528L1676k5260L837j1984K1312K7563J1907J2888j9453q805
17574B5387J4832k406J6095o655k0873j7688j384o561k497Q975k5900j4366k3649
17561e6690n127N8258J1318J6241J4389J5799j5145o9673n9094j4765J8163j889
17549h8215M1543K0147m3018m578k824J3926J801J4168M4484O755J1084O53j2417
17536C509j2539k1024M4886K5700j3715P628p2524l5264Q710L9898N5418j2836
17524A7847n1604O447J1759o37K9039j7131k6359M461k9226K4475J6405J6086
$$ plain form
17611 14307 -25299 -37643 -25912 -43909 -5053 54388 14087 -30715 -49013 -27049 -3850 -2810
17599 -2810 50903 26222 -68592 -97202 -45912 -1099 1220 -7213 -11941 -11561 -36107 -60487 -40687
17586 -40687 -51822 -18294 13382 -11878 -8041 -20025 1287 28850 40757 53645 34192 25387
17574 25387 40219 37813 53908 47253 26380 8692 7308 747 -1750 7225 -18675 -33041 -56690
17561 -56690 -61817 -3559 7759 24000 38389 54188 39043 -30630 -89724 -104489 -86326 -88215
17549 -88215 -46672 -26525 -69543 -74121 -76945 -63019 -61218 -47050 -2566 4189 15273 15926 3509
17536 3509 -9030 -30054 14832 40532 26817 34445 -38079 -73343 -64633 -24735 30683 17847
17524 17847 -33757 -27310 -15551 -16188 12851 -4280 -30639 -26178 -55404 -30929 -14524 1562
17512A562o685j5216j0997j4045J2275Q130l8217k0590K261K1100k0079N473k954
17499g7982m129M8596M1389J5587n833P181k8291j120k7047k1746k4506M6328
17487c1573L3277L7712O701j3578J3195k7245m4932k0584r312J8154J7708k5545
17475d6022j3758P261K6752L2668J3189J2211o1651l6721K4090M2389N4095q654
17463D5849L85K8749k5418l3924k1753J6059L9268O838m1507n010j4337L4179
17451B9378j931j9179N0J924L7375J12823J01760J57274P5009j01885p4838r9012
17439B18748j00695k3536k2411K752R638l903j912J0545m589k4450m5549j941
17427A2697K830P246Q645K0351l2958k361n19r838j4698j0517M3j8692L698J8295
$$ plain form
17512 1562 -5123 -20339 -31336 -45381 -33106 -24976 -63193 -83783 -81522 -60422 -80501 -75028 -77982
17499 -77982 -82111 -33515 7874 23461 17628 24809 -3482 -4602 -31649 -53395 -77901 -31573
17487 -31573 1704 39416 46117 32539 45734 18489 -26443 -47027 -56339 -38185 -20477 -46022
17475 -46022 -59780 -52519 -25767 6901 20090 32301 -29350 -66071 -41981 408 54503 45849
17463 45849 46234 74983 49565 15641 -6112 9947 49215 56053 14546 9536 -4801 29378
17451 29378 27447 8268 8318 10242 47617 160440 262200 419474 494483 392598 317760 218748
17439 218748 118053 94517 72106 74858 84496 80593 78681 89226 84637 60187 14638 12697
17427 12697 15527 22773 31418 51769 18811 16450 15931 6093 -8605 -19122 -19079 -37771 -34073 -15778
17413a5778L2034j8591j2177L0562K5658q185K8592K869n0214j3928k83M5465
17401D6024J7457m950k7698m7123K2229K7928Q659q636k2601l0995j2848K6503
17389f051K2915K3716l0094l908K9268R41k6108k6512j3320K4067L1302j6054
17377A0162k7783j1622J079L2078J9412J3377m6259j1647J2439N667J5726J6962
17365B9591J6823L8339k8030k8273k6919L3649Q584J6511j2600k7440l3714k2605
17353c6084L8743L2446k034l5916m4494k1392Q359k806M9459R724K9649q078j1038
17340F538N182n222j1159N570R569k0401j7363l87p644l3153M5914O512l9177
17327e5221O946j834M5278L5512O139R148l5285j846j1470j1346J6433K3820m3954
$$ plain form
17413 -15778 16256 -2335 -14512 16050 41708 33523 62115 64984 14770 842 559 46024
17401 46024 63481 58531 30833 -16290 5939 33867 42526 33890 11289 -19706 -32554 -6051
17389 -6051 16864 40580 10486 6578 35846 36787 10679 -15833 -29153 -5086 26216 10162
17377 10162 -17621 -29243 -28164 3914 23326 36703 -9556 -21203 -8764 -3097 12629 29591
17365 29591 46414 84753 56723 28450 1531 35180 43764 60275 47675 20235 -13479 -36084
17353 -36084 2659 35105 33071 -2845 -47339 -68731 -60372 -63178 -13719 -3995 25654 17576 6538
17340 6538 11720 6498 -4661 909 10478 -9923 -27286 -27673 -35317 -68470 -22556 -16044 -55221
17327 -55221 -48275 -50109 -4831 30681 36820 45968 10683 8837 -2633 -13979 2454 26274 -17680
17314a7680k4230L7446l1589J0547O754J384J661J4372j4785Q388K840J243j1507
17301a5156K0177O5250l291Q873l7558j0312l787J3449J361q646q444j3098K284
17288A1102j5317K4190K1667j6888j9588m9443k1987J8922M2588L8776j9326O72
17276A5368n870m9596r859J1325K2025j8358r300N4788J166j7265K9759Q741l5678
17263b754k5184j5835P758J8718L8162L0137k2803L1788M347J6082k3950J2308
17251F8774n59n0704n58j7967j6023O9627N289j8262j1714m1591J6059K0349l590
17238A9130L7283J152j9546j0771j6749K1315J0108L3323k265k5735l0881k0657
17226d293j8485J1099L3073J9414j3192l4757j6126K5252J8969m3077k6814K2262
$$ plain form
17314 -17680 -41910 -4464 -36053 -25506 -18752 -17368 -15707 -1335 -16120 -7732 -4892 -3649 -15156
17301 -15156 5021 70271 66980 75853 38295 27983 24196 37645 39006 30360 21916 8818 11102
17288 11102 -4215 19975 41642 24754 5166 -44277 -66264 -47342 -4754 34022 14696 15368
17276 15368 9498 -40098 -49957 -38632 -16607 -34965 -44265 10523 11689 -5576 24183 32924 -2754
17263 -2754 -27938 -43773 -36015 -17297 20865 51002 28199 59987 64334 80416 56466 68774
17251 68774 68215 17511 16953 -1014 -17037 52590 57879 39617 27903 -13688 2371 22720 19130
17238 19130 56413 57565 38019 27248 10499 31814 41922 75245 72980 47245 16364 -4293
17226 -4293 -22778 -11679 21394 40808 27616 -7141 -23267 1985 20954 -22123 -48937 -26675
17214b6675K125j1331j094N6451K4307L3652j9487j3074j003j0627j3898L1704
17202E1050r451l0288J9548M0779J024j8388j9996k166k325k8272L826L3239M2295
17189H0875K972j59m9324L938k2621l2863l915J390K1772M204J0461j611p526
17176G593k5753K3692J0702J733j2586J7690K7610J0902q178n194l063q38n988
17163C8322K304n482m2017n5929o948L5232K9281j2100j9521r856P803p430L8571
17150g770J9963r524Q160P24M3238R867J2546j5203l2527k7141l7778M676J4965
17137a5804J13j1697L6891M4205n337K969k1375k1733j247J3270m3746j6706P593
17124c2604k3282J2535M1420J6976j0317n1059m146L4322K2721K065n2472J2855
$$ plain form
17214 -26675 -24550 -35881 -36975 19476 43783 77435 57948 44874 43871 33244 19346 51050
17202 51050 41599 11311 30859 71638 72662 54274 34278 32112 29787 1515 5341 38580 80875
17189 80875 83847 83688 34364 38302 15681 -17182 -21097 -19707 2065 6269 16730 15119 7593
17176 7593 -18160 5532 16234 17967 5381 23071 50681 61583 53405 48211 45148 44310 38322
17163 38322 40626 35144 -6873 -62802 -69750 -34518 -5237 -17337 -36858 -46714 -38911 -46341 -7770
17150 -7770 12193 2669 10829 11553 54791 64658 77204 62001 29474 2333 -35445 -30769 -15804
17137 -15804 -15691 -27388 9503 53708 48371 51340 29965 8232 6985 20255 -23491 -40197 -32604
17124 -32604 -55886 -43351 -1931 15045 4728 -46331 -50477 -16155 6566 8631 -43841 -30986
17112c0986K4846J4812L811k1432k1012j6646L8734K3199L4578j3508k9067m2116
17100c4787N76o891l3167q71K4616n3220L3791K2066K8919K1495L874j5898m8175
17087e7672K7963J2799q708n0613L0804K6386n9485j4263o884L7175L4897K1411
17075f190O154M5725J4953J0892K6807k5511l7769l2247k8013l721J9963K4320
17063A5363J7845J759n305k2680o7473J5770k3044K8088O3482L871n4182k4011
17051e0517J956R031o20J1962K7128J4082l026q969p848J3349J0382j0454J8538
17038B4994J264K4208J9998k0184k3689l6086j5495R002p360L923M723K3855J254
17025A0407J9413J5791l2133j988j0737j583Q898K9796m452p3561m943N529N0829
$$ plain form
17112 -30986 -6140 8672 12483 -8949 -29961 -46607 -7873 15326 49904 36396 7329 -34787
17100 -34787 -34211 -41102 -74269 -75140 -50524 -103744 -69953 -47887 -18968 2527 6401 -9497 -57672
17087 -57672 -29709 -16910 -25618 -76231 -45427 -19041 -78526 -92789 -99673 -62498 -27601 -6190
17075 -6190 -36 45689 60642 71534 98341 72830 35061 2814 -25199 -28920 -8957 15363
17063 15363 33208 34967 29662 6982 -60491 -44721 -67765 -39677 23805 27676 -26506 -50517
17051 -50517 -48561 -39530 -40150 -28188 -1060 13022 9996 1027 -6821 6528 16910 6456 24994
17038 24994 26258 50466 70464 50280 26591 -9495 -24990 -15988 -23348 -19425 -14702 9153 10407
17025 10407 29820 45611 13478 11490 753 -830 8068 37864 33412 -40149 -45092 -39563 11266
17012A1266J1728J5352K1112k0971j3508j0075q46K088k8016j328J8624O262n1634
16999c9946m883J0725j1988l374M2329K516R842K1611J2460n4330k1763J910K7635
16986g256k6140K705l0888l6763Q696k1452L2599J9909l871L7419R126K2634M5039
16973E1757j0868k4874N100n1500m3121K3812M552n73j0477q583P666K4101M6067
16960A3059J7013k2256k0136k0743L3257r511l4041j1061O1981J701K4992J6296
16948E0551J4657J0828J3582Q96M10n956m9375k9262j9326m5410L9559J8778J7366
16935A7298K4280l2131J980K8753j952n1238j3232K3729J97k393J0390o211j9976
16922b0506n509p28L1136J4917K6948J9446j2621p783k9591j5458K109K1093J6601
$$ plain form
17012 11266 22994 38346 59458 38487 24979 14904 14058 16146 -11870 -13198 5426 11688 -39946
16999 -39946 -44829 -34104 -46092 -49466 -7137 -4621 5221 26832 39292 -15038 -36801 -34891 -7256
16986 -7256 -33396 -30691 -61579 -98342 -89646 -111098 -78499 -58590 -62461 -25042 -15916 6718 51757
16973 51757 40889 16015 21115 -30385 -73506 -49694 -45142 -45715 -56192 -64775 -57109 -33008 13059
16960 13059 30072 7816 -12320 -33063 194 -9317 -43358 -54419 7562 9263 34255 50551
16948 50551 65208 76036 89618 90514 90924 84968 35593 6331 -12995 -58405 -18846 -68 17298
16935 17298 41578 9447 11427 40180 38228 -13010 -26242 -2513 -2316 -4709 5681 -530 -20506
16922 -20506 -26015 -26743 4393 19310 46258 65704 53083 45300 15709 251 2360 23453 40054
16909D0054l1156j10p0583l7262M7723J5205k09n469M578r321p9J2124K0190L0605
16895A6290k1470k7213K6981J9494k3771k7663j8455J4397J4061J7794M5786N2194
16883H8425m7380j4209K1876o738M807P531k5236L540n632K538j9735k2685l6974
16870d9872K439K9482L0411J5765l1563k7540k0016l2587J7627M1128K7534m5806
16858d2998k0917j3817J0876J1845j4860j0068j2081K9457K7753L0308M1789j6531
16846B0756m574k8273n0729j0448N0901Q647J6615J2709L0138l0943k2106l4424
16834d1731K629J0734q807m3730O497J5363P10L1360P774K371Q302j1762j6662
16821c6952l4735L0214N0412Q229K1286K12j2465k7486j9593K3673L4066j7989
$$ plain form
16909 40054 8898 8788 -61795 -99057 -51334 -36129 -36338 -41807 -37229 -46550 -46629 -34505 -14315 16290
16895 16290 -5180 -32393 -5412 14082 -9689 -37352 -55807 -41410 -27349 -9555 36231 88425
16883 88425 41045 26836 48712 41974 46781 54312 29076 32616 26984 29522 9787 -12898 -49872
16870 -49872 -47433 -17951 12460 28225 -3338 -30878 -50894 -83481 -65854 -24726 2808 -42998
16858 -42998 -63915 -77732 -66856 -55011 -69871 -79939 -92020 -62563 -34810 -4502 37287 20756
16846 20756 16182 -12091 -62820 -73268 -22367 -13720 2895 15604 45742 14799 -7307 -41731
16834 -41731 -39102 -28368 -37175 -80905 -74408 -59045 -58335 -26975 -19201 -16830 -8528 -20290 -36952
16821 -36952 -71687 -41473 8939 17168 38454 38666 26201 -1285 -20878 2795 36861 18872
16809A8872l4754o1984m631L6178L6134k4473J7635P8986o601m5417l3730R69
16797b2816K2805K0530R234J8973J0521n45j0445p652J5256m2160k1560l7439
16785d5298k1137l942M7665j2368n5167P414L4101K1701J5191j4796L429M1851
16773A8644l858O389r63j5398k2221L3163L9412M6566m9214m8321j5943l6500
16761d8244j3285k37K7212j4318j5431k866k6552J2417l21L425L1470J0174j4440
16748e0996o4N214p025q71k6961J7914O3735L6480K6908k9092o9267l1274r697
16735g4996J4906p732J8721J4239K0702O996j2846P59L2978m4803j351M9333J3848
16722C0754q637j8999j1841o498r757r035p592K3013J2967J517m2642J5114J9142
$$ plain form
16809 18872 -15882 -77866 -82497 -46319 -10185 -34658 -17023 61963 55362 9945 -23785 -22816
16797 -22816 -11 20519 29753 48726 59247 58702 48257 40605 55861 13701 -7859 -45298
16785 -45298 -66435 -70377 -22712 -35080 -90247 -82833 -48732 -27031 -11840 -26636 -23207 18644
16773 18644 14786 21175 20212 4814 -17407 15756 55168 101734 52520 4199 -11744 -48244
16761 -48244 -61529 -61766 -34554 -48872 -64303 -67169 -93721 -81304 -81625 -78200 -46730 -36556 -50996
16748 -50996 -51060 -45846 -52871 -53742 -80703 -62789 946 37426 64334 35242 -34025 -65299 -74996
16735 -74996 -60090 -67822 -49101 -34862 -14160 -7164 -20010 -19251 13727 -31076 -32427 16906 30754
16722 30754 22117 3118 -8723 -15221 -24978 -34013 -41605 -18592 -5625 -4108 -46750 -31636 -12494
16709a2494L8472K1685J1950N907k2588p902N70j0762j5981k5825p170L2936R433
16696A8231M747K767K2621R009k6631k6573K0417j5676j7904j1663K756o810k2692
16683d7401k1210l330K2028L6966J473j4080k4439K7441k2907l6015K9673M7474
16671d327L8510R410l3432q410O299N9040J9589l2823o7047l9846J4606k3149
16659f1580m1248J3583M2090P018k289L268K1179m509m1776M838j1954J7659L4642
16646a9079m910M138o00j9229m591l918J8005K9186J6793K8831J4377L0913p4299
16633A5617q1711p012Q274m1387k9935K1137Q6814P2185J9560l7981j0774K0389
16621C5176J0575j6759m0315o0488j9780N474K5373L9049j0268J8419R329n6782
$$ plain form
16709 -12494 25978 47663 59613 65520 42932 35030 35600 24838 8857 -16968 -24138 8798 18231
16696 18231 22978 25745 48366 57375 30744 4171 24588 8912 -8992 -20655 -17899 -24709 -47401
16683 -47401 -68611 -71941 -49913 -12947 -11474 -25554 -49993 -22552 -45459 -81474 -51801 -4327
16671 -4327 34183 43593 10161 1751 8050 67090 86679 53856 -13191 -53037 -38431 -61580
16659 -61580 -102828 -89245 -47155 -40137 -42426 -39158 -17979 -22488 -64264 -59426 -71380 -53721 -19079
16646 -19079 -23989 -19851 -20451 -39680 -44271 -48189 -30184 -998 15795 44626 59003 89916 15617
16633 15617 -66094 -73106 -64832 -106219 -136154 -115017 -28203 43982 63542 25561 14787 35176
16621 35176 45751 28992 -11323 -71811 -91591 -86117 -60744 -21695 -31963 -13544 -4215 -60997
16609f0997q479k8045k2188M7440K4990K0814n546k1465n573J2318r329J6256
16597c9804L9691R3j3275M82M514p114j9506k8035K4162r99j9198J3138J9476
16584b6375J9509K2665K6069J2937m9183j3478N1222J4503l5104o8655o021l593
16572e5504J4611N3790L5078M4775Q599o3304j6337j308k1739j9483j8629l3709
16560g3160K0616k1829k937N799j2098K969K1544n799J9776M7726M0848n0236
16548f781k9243L2085N1131J4039n162r282l8298k5365R186P073r59K971P960
16535I355l5313j9309J7547J1202O707J063J3316L0786k9387q903j0286J763n269
16522a6728J4843L111j0675m7382m583M9679r591j1048L6607P594L446j4299K0377
$$ plain form
16609 -60997 -69476 -97521 -119709 -72269 -47279 -26465 -32011 -53476 -59049 -46731 -56060 -39804
16597 -39804 -113 -20 -13295 -12813 -8299 -15413 -34919 -62954 -38792 -39791 -58989 -45851 -26375
16584 -26375 -6866 15799 41868 54805 5622 -7856 43366 57869 22765 -45890 -51911 -55504
16572 -55504 -40893 12897 47975 92750 101349 38045 21708 20400 -1339 -20822 -39451 -73160
16560 -73160 -52544 -74373 -77310 -71511 -83609 -80640 -59096 -64895 -45119 2607 43455 -6781
16548 -6781 -36024 -3939 47192 61231 56069 46787 8489 -16876 -7690 -617 -1576 1395 9355
16535 9355 -25958 -45267 -27720 -16518 -9811 -8748 4568 35354 5967 -2936 -13222 -11459 -16728
16522 -16728 -1885 1226 -9449 -56831 -61414 -11735 -21326 -32374 4233 11827 15273 974 21351
16509B1351j7405l0833K3206M9677J6084m1686j6379n2497R712r789m646J0551
16497d2654J0721J4264J8045k79k1056k3627J1529j7086M854M2298o76l88L5288
16484C1233K8580r26l2504r367Q391k2604k2703k1836k2009J5905K9863L6718
16472A8741j3959k6169R243j4872j0377L2678q582m1263l4391n314L2631L4538
16460b7096q631j599L2009L1194J9208m7145j5990K7557j725K8427k2086l2061
16448a7938l0370L272q599j259M0648M1748k5208R433j7164k2381k73J3684L1492
16435A7085p574p7488L3450L9030m1635K1655m130m6451N8476N5030k42l7460
16423I746r819n8200j9384J2461Q952K8392R254K0449M5201j3944m9149J1915
$$ plain form
16509 21351 3946 -26887 -3681 45996 62080 20394 4015 -48482 -38770 -48559 -53205 -42654
16497 -42654 -31933 -17669 376 97 -20959 -44586 -33057 -50143 -45289 -2991 -3667 -4055 31233
16484 31233 59813 58887 26383 17016 25407 2803 -19900 -41736 -63745 -47840 -17977 18741
16472 18741 4782 -21387 -12144 -27016 -37393 -4715 -13297 -54560 -88951 -94265 -61634 -27096
16460 -27096 -35727 -37326 -5317 25877 45085 -2060 -18050 9507 7782 36209 14123 -17938
16448 -17938 -48308 -45036 -53635 -54894 -14246 27502 2294 11727 -5437 -27818 -28091 -14407 17085
16435 17085 9511 -67977 -34527 4503 -37132 -15477 -19607 -66058 -7582 47448 47206 9746
16423 9746 -73 -58273 -77657 -65196 -56244 -27852 -18598 1851 47052 33108 -16041 -4126
16411d126K3863j1209j8960J606R284m571j085J9486M6148N128M073k7101n1550
16398i014k0238j7031K3310K9025K5553j4693j8435r689K1524j2622k3352K3725
16386a937k1785k274p37J6790J5646J2817M461K5382K607m218j0967n4686Q237
16373a0664K3789M874O414k0663L4994K3280q813k2867J2959l3270j4222k79q316
16360a2784m904J2242P610M050M629l2912j5594N1274N6090j1300p3656K1101
16348E846K015n514L6383M5822j1145l7011n6119l8544J3551J6897L341n811K440
16335b7849K6769K0645k2594n4K2309k2287L842k7103k1357O4805k599k9489k016
16322a6978l0042K3164K6940J6525J7113K7940k6652l5128j3486q665J9177j4783
$$ plain form
16411 -4126 19737 8528 -10432 -8826 458 -4113 -5198 14288 60436 65564 69637 42536 -9014
16398 -9014 -29252 -46283 -22973 6052 31605 16912 -1523 -11212 10312 -2310 -25662 -1937
16386 -1937 -23722 -25996 -26733 -9943 5703 18520 22981 48363 50970 46752 35785 -18901 -10664
16373 -10664 13125 17999 24413 3750 38744 62024 53211 30344 43303 10033 -4189 -4468 -12784
16360 -12784 -17688 -5446 2164 6214 10843 -22069 -37663 13611 69701 58401 -15255 5846
16348 5846 7861 2347 38730 84552 73407 36396 -19723 -58267 -44716 -27819 -24478 -30289 -27849
16335 -27849 -1080 19565 -3029 -3083 19226 -3061 781 -26322 -47679 17126 14527 -14962 -16978
16322 -16978 -47020 -23856 3084 19609 36722 64662 38010 2882 -10604 -19269 -92 -14875
16310a4875m0479J4083K4360n432N675J0244n1487m4534o118L9113O776l851j9388
16297h5913M6057Q0194K7420n785k7791j4972k6059L9707J8651k5971k0877K777
16285G438J4742P886l911n7170j2771M5725N171R925L1883j3511j6735j9762n63
16272a653j6277q014K1712k256o0780j3960J4576L4039K6724J8760j7570P245
16260B546L4273r050p330K0439n998l0359j3043Q219N7568m2917l6573K5494M1082
16247D4351l9440k5805L915l3137J1913J8512k029J117j8032j5306K2225K870
16235b8846J920J2967J8973o918k4737r59L767L0311K3278j5963J1903J4631L847
16222D4174M970J5675l2719K5590K9094k3513o2711m4885j917j3242L203L6410
$$ plain form
16310 -14875 -55354 -41271 -16911 -22343 -16668 -6424 -57911 -102445 -108563 -69450 -62674 -66525 -85913
16297 -85913 -39856 40338 67758 61973 34182 19210 -6849 32858 51509 25538 4661 7438
16285 7438 22180 30066 26155 -31015 -43786 1939 7110 17035 48918 35407 18672 -1090 -1653
16272 -1653 -17930 -25944 -4232 -6488 -67268 -81228 -66652 -32613 -5889 12871 -4699 2546
16260 2546 36819 27769 20439 40878 34880 4521 -8522 -303 57265 14348 -22225 3269 44351
16247 44351 4911 -20894 -16979 -50116 -38203 -19691 -21720 -20603 -38635 -53941 -31716 -28846
16235 -28846 -26926 -13959 5014 -1904 -26641 -27600 -23833 6478 29756 13793 25696 40327 44174
16222 44174 49144 64819 32100 57690 86784 63271 560 -44325 -46242 -59484 -56281 -19871
16210a9871L2109L7194o303O428l2930L809O234J2108m4081k6768K1522L2848
16198B2299L4703l9960k0644n1053k2764J8799l69j1392J7789M7202J9780L0518
16186D4908j0431j3863l9879K0863J3976j7943K233P739J1047k0595P424r517
16174d038n4175n7315j4154M9488N3490M8818l9017l2826K1643J5938J3686j4939
16162a3401l6498n877M3419J0197q806J2256J0196P30j9759P063o798K2443L6126
16149E1291j70j848j5740J0178L5105K3033r221n362p4014l8837m549j484l1391
16136f3009R938J5176J8397K2968N6050l4053n2042j3539j2662L0462K3737M0686
16124D2109n0073j7020l619o283m1809l0732n142M4938Q637m4833J9999j662R24
$$ plain form
16210 -19871 12238 49432 43129 49557 16627 20436 26670 38778 -5303 -32071 -10549 22299
16198 22299 57002 17042 -3602 -54655 -77419 -58620 -58989 -70381 -52592 -5390 14390 44908
16186 44908 34477 20614 -19265 1598 15574 -2369 -136 7603 18650 -1945 5479 -4038
16174 -4038 -58213 -115528 -129682 -80194 -26704 22114 -16903 -49729 -28086 -12148 1538 -13401
16162 -13401 -49899 -55776 -12357 -2160 -10966 1290 11486 12216 -7543 -480 -7278 15165 51291
16149 51291 51121 49273 33533 43711 78816 101849 92628 87266 13252 -25585 -30134 -31618 -63009
16136 -63009 -53071 -37895 -19498 3470 59520 25467 -26575 -40114 -52776 -22314 1423 42109
16124 42109 -7964 -24984 -28603 -34886 -76695 -107427 -112569 -67631 -58994 -103827 -83828 -85490 -84566
16111h4566M481R457J0259L3770l225K9107K4607K4847J3480l5761k734L260K4360
16098E1342q551k5286j5686L196L1989J0330j0976l165j190l2668l6721j6163
16086e3549l453l6875J4848J8529k022K1213K8985L3199K815j1127j8208J8078
16074A2433l7363J8149L1868j1898J1854o3001l843p968L6058Q421p397q849j5019
16061c6555P414L239j1540j0500M1002R716r384r335M528n205j5818j7163j2961
16048f2562m835K6553M6909j1982q22j468r848l841L3393O811m3932k310K857
16035b5077K836L4494r837k8430p005Q999Q554k569K7125J0000J1297L1836o6438
16022d215k8740o416L969k7303p814K9153J4726j7631j818K6643M3961K158m9239
$$ plain form
16111 -84566 -80085 -70628 -60369 -26599 -29824 -717 23890 48737 62217 26456 23722 26982 51342
16098 51342 42791 17505 1819 5015 37004 47334 36358 33193 32003 -665 -37386 -53549
16086 -53549 -57002 -93877 -79029 -60500 -62522 -41309 -12324 20875 23690 12563 -5645 12433
16074 12433 -24930 -6781 25087 13189 25043 -37958 -41801 -49769 -13711 -5290 -12687 -21536 -36555
16061 -36555 -29141 -25902 -37442 -47942 -6940 2776 -6608 -15943 -11415 -16620 -32438 -49601 -62562
16048 -62562 -67397 -40844 6065 -5917 -6739 -8207 -18055 -21896 11497 18308 -25624 -27934 -25077
16035 -25077 -22241 12253 2416 -26014 -33019 -24020 -15466 -18035 9090 19090 30387 62223 -4215
16022 -4215 -32955 -39371 -35402 -62705 -70519 -41366 -26640 -44271 -46089 -19446 24515 26673 -22566
16009b2566Q702n700k3864L6698L2507k2972n169R834j7478m5705l6475O4200
15997b7988M4612k8361q877l4359K59M3304R389r694K492l1822j6622p737j6548
15984h1952j4213N399L3274K954K3334M2120j2886l1203n349r555J2206J4579
15972b1292P732k8379N086L3439j7774l6119M1303J9696k8987k2080J9986J0540
15960a6849j1651j448l5743j8973q911r738J1041J7543M6790J1627J2228j8838
15948b2922M494L187n367L1617K6790J9262n6348j1652K7893M3949n0287k9817
15936a9201J3305J8485l7777l1378Q829K5200N648K2042R14l7519r044K3080L6001
15923A8585J0814N636J7446l1529o5562j4029K3007P772q361L5712j2234k9662
$$ plain form
16009 -22566 -13864 -19564 -43428 -6730 25777 2805 -2364 7470 -10008 -55713 -92188 -27988
15997 -27988 16624 -11737 -20614 -54973 -54714 -11410 -2021 -11715 -9223 -41045 -57667 -65404 -81952
15984 -81952 -96165 -90766 -57492 -54538 -31204 10916 -1970 -33173 -38522 -48077 -35871 -21292
15972 -21292 -13560 -41939 -36853 -3414 -21188 -57307 -16004 3692 -25295 -47375 -27389 -16849
15960 -16849 -28500 -29948 -65691 -84664 -93575 -103313 -92272 -74729 -27939 -16312 -4084 -22922
15948 -22922 -18428 -15241 -20608 11009 37799 57061 713 -10939 16954 60903 10616 -19201
15936 -19201 -5896 12589 -25188 -56566 -47737 -22537 -16889 5153 6067 -31452 -40496 -17416 18585
15923 18585 29399 35035 52481 20952 -44610 -58639 -35632 -27860 -36221 -509 -12743 -42405
15911d2405J364p255K713N156K2513J8047J8529N3696j3479R867k2117l7010o0651
15898e1032l0203J9857J2095K3863n461k5333k1285O2603M7605r300n2241j8621
15886d7453J205J7928L6255n6817M658L3758J3448j6974m5357k9508M5923Q052
15874c4882m0110K3759L0968K8299k9117L4230J4481J0166j0133k5145l6197L9398
15862E717R567n0243k4013M5855J8267o206P221P3j4952l3356L4045J2J4383J5337
15848B1707L1449J0370m0979j1987j0682l8092j7127L931l757J5871j7602r948
15836f6846R516K7104J5643l585k2337K31K721j5147M4537q052m319J4481n2021
15823e8074j7920L2644k714p365K4730L0649k9769O611K5303J95j9099L801j3717
$$ plain form
15911 -42405 -41041 -48296 -45583 -40427 -17914 133 18662 72358 58879 68746 46629 9619 -51032
15898 -51032 -81235 -61378 -49283 -25420 -30881 -56214 -77499 -14896 32709 23409 -28832 -47453
15886 -47453 -46248 -28320 7935 -48882 -44224 -10466 2982 -13992 -59349 -88857 -42934 -34882
15874 -34882 -74992 -51233 -20265 8034 -21083 13147 27628 37794 27661 2516 -33681 5717
15862 5717 15284 -34959 -58972 -13117 5150 -1056 6165 6238 -8714 -42070 -8025 -8013 6370 21707
15848 21707 53156 63526 22547 10560 -122 -38214 -55341 -51410 -55167 -39296 -56898 -66846
15836 -66846 -57330 -30226 -14583 -18168 -40505 -40274 -37553 -52700 -8163 -16215 -20534 -6053 -58074
15823 -58074 -75994 -43350 -46064 -53429 -28699 1950 -27819 -21208 4095 4290 -14809 -11008 -24725
15810b4725m759Q645j1435L057L2604P24m2894j0883O396M5774l426K4137K5637
15797D8852j3729j0829J1098k4312J5155k290l3220J0807J1801M227k6525J1698
15785B733k4603L0680M340k4691n1067k974O4649n36j3164Q216K9455J3595j7919
15772A8714K2701L216m1648Q96j6072k8903k1214k7401N5236L1926K535P465J0246
15759A7697N7907M0691J2859q0246j4405M458J0412j8602j9439K9165J0523m103
15747D6917k9502l417q551Q92j7887R93K0443K1270N142n8874O196K5773j9099
15734i704j192L243j8111m1094l1058l780P154L6103j1830L4831P0189J32j6448
15721A8435J0423L5525M120k3329j8418m6199k6728l645j3314q595O942j6319
$$ plain form
15810 -24725 -29484 -20839 -32274 -29217 3387 4111 -38783 -49666 -43270 2504 -922 23215 48852
15797 48852 35123 24294 35392 11080 26235 23945 -9275 1532 13333 17560 -8965 2733
15785 2733 -21870 8810 13150 -11541 -62608 -65582 -933 -1469 -14633 -6417 23038 36633 18714
15772 18714 41415 44631 2983 3879 -12193 -41096 -62310 -89711 -34475 -2549 -14 7451 17697
15759 17697 75604 116295 129154 48908 34503 38961 49373 30771 11332 40497 51020 46917
15747 46917 17415 13998 5447 6339 -11548 -10555 9888 31158 36300 -22574 -16378 9395 -9704
15734 -9704 -10896 -7653 -25764 -66858 -97916 -101696 -94542 -58439 -70269 -35438 34751 34883 18435
15721 18435 28858 64383 68503 45174 26756 -19443 -46171 -49816 -63130 -71725 -64783 -81102
15709h1102M4396O2462J3386n953k2702l5515k3484J2345Q861J070J4057j7665
15697b9844L616j0207P989p774q444K4944r457J5116M420l2634O272J7584o453
15684b4872l2567m8584l4866N291M4662Q1291J2921k4423j8962J7190J1321k8333
15672c9931p659J4141L7137L4021M7867l0676k9317O631k4657m2582J4491K7858
15660G324j2176m5123K2129J0626j52N4834j2841n2951J9299J2029o6010l382
15648f6394k3657L7277L9045K4448J6693N466J5963k9883l7805K3780P11o7575
15636f1931k2276K4635K8273J2986N4057Q119m4754m005K5924L2384k475L001
15624E3938j6957m626J655o4987j1692M0142k341J8822k7044m4213L8500N0673
$$ plain form
15709 -81102 -36706 25756 39142 33189 10487 -25028 -48512 -36167 -27306 -26236 -12179 -29844
15697 -29844 -26228 -36435 -28446 -36220 -44664 -19720 -29177 -14061 -9641 -42275 -36003 -18419 -24872
15684 -24872 -57439 -106023 -140889 -135598 -90936 -9645 3276 -21147 -40109 -22919 -11598 -39931
15672 -39931 -47590 -33449 3688 37709 85576 54900 25583 32214 7557 -35025 -20534 7324
15660 7324 -4852 -49975 -27846 -17220 -17372 37462 24621 -28330 -9031 2998 -63012 -66394
15648 -66394 -90051 -52774 -13729 10719 27412 32878 48841 18958 -18847 4933 5644 -61931
15636 -61931 -84207 -59572 -31299 -18313 35744 43863 -891 -4896 21028 53412 50937 53938
15624 53938 36981 32355 34010 -30977 -42669 -2527 -4868 13954 -13090 -57303 -18803 31870
15612C1870j6619q247N0455N1797k4762l9400j1210j5184j2133m942k6901m5027
15600g0303p731M5862N705j1968N2988n968n5821K9882J2188p067M0346q326k0398
15587f11j0857N156L6546j0700k3987q188n841q002l489J5067L655l2071k1040
15574f4362j2477J8611o429O6091N0824j7185l2845l6844j6889M096L866Q851
15562c4692j1074J3904L4116k698k3771J9335O5808l0475p3261J7936J7994l83
15550g261j9746m8600j6942L3711O3470L2716n2533n6799P5J7306K4674k9647
15538e9576K1163N4982l6080k5303L9319J6789k2537K8486k2852M910J3881J576
15526A4758q765k4061N010N0905L0577Q642j0747K8798Q852m0316k6671l391l8338
$$ plain form
15612 31870 15251 7004 57459 109256 84494 45094 33884 18700 6567 1625 -25276 -70303
15600 -70303 -78034 -32172 -26467 -38435 14553 8585 -47236 -17354 -5166 -12233 28113 19787 -611
15587 -611 -11468 -6312 30234 19534 -4453 -12641 -18482 -26484 -29973 -14906 -11251 -43322 -64362
15574 -64362 -76839 -58228 -64657 1434 52258 35073 2228 -34616 -51505 -47409 -43543 -34692
15562 -34692 -45766 -31862 2254 -444 -24215 -4880 60928 30453 -42808 -24872 -6878 -7261
15550 -7261 -27007 -75607 -92549 -58838 4632 37348 -15185 -71984 -71909 -54603 -29929 -59576
15538 -59576 -38413 16569 -19511 -44814 -5495 11294 -11243 17243 -5609 -699 13182 14758
15526 14758 5993 -18068 -13058 37847 68424 77066 66319 95117 103969 63653 36982 33591 -4747
15513d747P67K828j6743K261j1353J5892N5818K3206K695l4502m2858j3778K0492
15500b2K0280O595k5028o0194J0734K4672j6787K7889k7930j2860K6883K4527
15488a241J4124k3697J0553J9472k2555M3049P996j6218k0473k0531O460L14k9080
15475c1827J241L4755Q9810k7657o0017m9608J6853k5180k0533M0524K9584k084
15463d139j9683q842J2527K2767J2484m5388l0043k0199K3432O1803O55L6365
15451D1739J2770r245J807k0612o8192o300K7281K4181l9139l8771K8258K3589
15439b2634N231O210K9613J3034J962j888n7043l8159r053R450r042r282J4170
15426f7431J4703L5002K1623K3303N303K704K837j6918k0473j784k4287k5910
$$ plain form
15513 -4747 -3980 -1152 -17895 -15634 -26987 -11095 44723 67929 70624 36122 -6736 -20514 -22
15500 -22 20258 26853 1825 -58369 -47635 -22963 -39750 -11861 -39791 -52651 -25768 -1241
15488 -1241 12883 -10814 -261 19211 -3344 39705 47701 31483 11010 -9521 -3061 -2747 -31827
15475 -31827 -30586 4169 93979 66322 6305 -43303 -26450 -51630 -72163 -31639 -2055 -4139
15463 -4139 -23822 -32664 -20137 2630 15114 -30274 -60317 -80516 -57084 4719 5374 41739
15451 41739 54509 45264 47071 26459 -41733 -48033 -20752 3429 -35710 -74481 -46223 -22634
15439 -22634 -17403 -11193 18420 31454 33416 31528 -25515 -63674 -72727 -63277 -72319 -81601 -67431
15426 -67431 -52728 -17726 3897 27200 32503 35207 38044 21126 653 -1131 -25418 -51328
15414e1328m4716Q598J2334M2364J6496J1925l148k3229J5705j2693l3577k7793
15402h9062j3142M3139N2036J1033l140k7921O647n652J0334N4525K512k9530
15390A1779O811L5107N234j0876k9576m0707j9723N4681J9944J1237L1653J917
15378G7481j5514j7350k9133m3335k2409K219L5409Q624k7388m3699m1470j421
15366a17986L9568M0654K5687L0616J0662j9793k3245j0430J1163j1565j7932
15355d2601M189L3188J8189n315M045j3808L1409N791k2787j4979N4444j4808
15343C6957j2653O68J445J7267j6848L9941J0060l0371n0635l0184n195m8158
15331h7706j6210L9387J3577M6333l490j8188Q394J2248K2895r412R944J9516
$$ plain form
15414 -51328 -96044 -87446 -75112 -32748 -16252 -4327 -7475 -30704 -14999 -27692 -61269 -89062
15402 -89062 -102204 -59065 -7029 4004 864 -27057 -20410 -26062 -15728 38797 41309 11779
15390 11779 18590 53697 58931 48055 18479 -22228 -41951 12730 32674 43911 75564 77481
15378 77481 61967 44617 15484 -27851 -50260 -48041 -12632 -4008 -31396 -75095 -116565 -117986
15366 -117986 -78418 -37764 -12077 18539 29201 9408 -13837 -24267 -13104 -24669 -42601
15355 -42601 -38412 -5224 12965 7650 11695 -2113 29296 35087 12300 -2679 51765 36957
15343 36957 24304 24972 26417 43684 26836 66777 76837 46466 -4169 -34353 -39548 -87706
15331 -87706 -103916 -64529 -50952 -4619 -8109 -26297 -17903 -5655 17240 7828 17772 37288
15319C7288K556J9637n540r543m3242o1633O207J7565k2344p459O7652K8654k6475
15306C323j4516j0286k6475j070j9759M0102J5433l5693j2532O2204M3728J8744
15294F3203k0240m9974l9184j2168O231M8252k0999k6386k6817J3599L9214K4323
15282i46J277j7645J5714M9461k4743L4280J2614K53k8431j0887J4025l2095k1220
15269h343l7629M6809M2225J9278l687r957k4908p1534l1100J9411M2540J869
15257a5026j6906R195J3369j3652K2131L3409J3649j4587Q35k1174p342r388J7950
15244A2463L6826M28k0173j4146k4295l2770K3846L1222r509R569k2907K637J6844
15231A0035j3889p293J1051M1774J4243m1807q594Q213L780j8008k8514J359r703
$$ plain form
15319 37288 39844 59481 53941 44398 1156 -60477 -54270 -36705 -59049 -66508 1144 29798 3323
15306 3323 -11193 -21479 -47954 -49024 -68783 -28681 -13248 -48941 -61473 731 44459 63203
15294 63203 42963 -7011 -46195 -58363 -52132 -3880 -24879 -51265 -78082 -64483 -25269 -946
15282 -946 331 -17314 -1600 47861 23118 57398 70012 70265 41834 30947 44972 12877 -8343
15269 -8343 -45972 837 43062 62340 58653 48696 23788 -47746 -78846 -59435 -16895 -15026
15257 -15026 -31932 -22737 -9368 -23020 -889 32520 46169 31582 32417 11243 3901 -5487 12463
15244 12463 49289 49717 29544 15398 -8897 -41667 -17821 13401 3892 13461 -9446 -6809 10035
15231 10035 -3854 -11147 -96 41678 55921 14114 5520 13733 17513 -495 -29009 -27650 -37353
15218c7353J2232j9525k6151k1754R012J851J6056M0599M4291l4109K844L1414
15206A9407M4710M202k6347j4503n6158l4560J2842L7054M2048R330r028K1653
15194E0650J8086m3875k3884k4756q223K3970L5547N644k3655J985l203l0508
15182b2222q318L5908K1215j4980m2245Q75j4444N332J9260n171l6114J1866J8041
15169c0997l072j8500M5168J0556K8226k4354m0693q403J1886N7723J235p041
15157B1734k7846j5629j7135N680m661L0330L8800p210l3581j6279O478K3998
15145D679j2798m413L5501j2519j2067L2372j795l8487m371o22N238q206j6654
15132c4142n6j4087l4592K4590K5780k1397k950M0918K1938l798M314o977m2640
$$ plain form
15218 -37353 -25121 -44646 -70797 -92551 -83539 -81688 -65632 -25033 19258 -14851 -12007 19407
15206 19407 64117 68319 41972 27469 -28689 -63249 -50407 -13353 28695 38025 28997 50650
15194 50650 68736 24861 977 -23779 -32002 -8032 27515 33159 9504 11489 8286 -22222
15182 -22222 -30540 5368 26583 11603 -30642 -29767 -44211 -38879 -19619 -24790 -60904 -49038 -30997
15169 -30997 -34069 -52569 -7401 3155 31381 7027 -33666 -42069 -30183 27540 28775 21734
15157 21734 -6112 -21741 -38876 -33196 -37857 -7527 31273 24063 -9518 -25797 -19319 4679
15145 4679 -8119 -12532 22969 10450 -1617 30755 28960 -9527 -13898 -14520 -9282 -17488 -34142
15132 -34142 -34198 -48285 -82877 -58287 -32507 -53904 -56854 -15936 6002 2204 6518 -459 -43099
15119d3099J0841J7341J9027Q847j0979k2789J0640L511K7836n65j6494k8091
15107b3974L0709M3127L8227j4964j9906o4238j3083K9380O0721K5717M999j5739
15095H0976k2290n4181j6013J4725P862J2040n8702k7248L3946n543j0209l497
15083d8134L829K9373P096K655R755J1515j8833k674J9265J4552K4116k97O993
15070E9211j4523k0340K3109M8825J7930j3907m7462m1158N140J4799r373j5434
15058F817j1810J7662L173Q218k004L431j0344R892o898O489r228l0022K9003
15045A4379K5774m387j4258M702Q774k7314k9629R16n106P627J1592k370M9528
15032D0228K4338m6090j9189J0772J2606P135p607j6928j4294m0540k8119K2099
$$ plain form
15119 -43099 -32258 -14917 4110 12957 1978 -20811 -10171 -6660 21176 20611 4117 -23974
15107 -23974 6735 49862 88089 73125 53219 -11019 -24102 5278 65999 91716 96715 80976
15095 80976 58686 4505 -11508 3217 11079 23119 -35583 -62831 -28885 -34428 -44637 -48134
15083 -48134 -44305 -14932 -7836 -5181 4574 16089 -2744 -5418 13847 28399 52515 52218 59211
15070 59211 44688 24348 47457 96282 114212 100305 52843 11685 16825 31624 22251 6817
15058 6817 -4993 12669 15842 24060 22056 25487 15143 25035 18137 24626 15398 -14624 14379
15045 14379 40153 35766 21508 26210 34984 7670 -21959 -21043 -26149 -18522 -6930 -9300 40228
15032 40228 64566 18476 -713 10059 22665 29800 22193 5265 -9029 -49569 -77688 -55589
15020e5589n648J6893j4317J3588M6370J8283q996q617K1654M1387L8526n0532
15008E3002n5614j2702J8184k7610J0773J6918K4932j1494k6266j930K6222p675
14996F740J9118p202p565k7620o140K7537p873L8758J3684l1940J0860R875k6331
14983A1901N934o895l355J74l72k1018q884J4763N2512n394l4293n2744j4118
14970f1789K841o647l0746N2461O7857p689j1362m860k2788L220n408R484k4518
14957c9944j2477K6319J7359q146j0620J4766k469R698n45j3181l4684k1324J5147
14944f0101K7512K8730M8797J3252j455J0684j3422j7484m7126j6003J8065k9416
14932c7967l6208R573K6429M3060L1648k4388m6538l2956J8261L8311K2436J8131
$$ plain form
15020 -55589 -61237 -44344 -58661 -45073 1297 19580 10584 1967 23621 65008 103534 53002
15008 53002 -2612 -15314 2870 -24740 -13967 2951 27883 16389 -9877 -11807 14415 6740
14996 6740 25858 18656 11091 -16529 -22669 4868 -3005 35753 49437 17497 28357 38232 11901
14983 11901 17835 10940 7585 7759 7387 -13631 -22515 -7752 44760 39366 5073 -47671 -61789
14970 -61789 -58948 -65595 -96341 -43880 23977 16288 4926 66 -22722 -19502 -24910 -15426 -39944
14957 -39944 -52421 -26102 -8743 -16889 -27509 -12743 -15212 -5514 -6059 -19240 -53924 -75248 -60101
14944 -60101 -32589 -3859 44938 58190 56735 67419 53997 36513 -10613 -26616 -8551 -37967
14932 -37967 -74175 -64602 -38173 4887 36535 12147 -34391 -67347 -49086 -10775 11661 29792
14920B9792n967l1234p775J0967J4400K0023l3620r585m59j4171J7547N0889k1600
14907A9207m1652p696J2521o82N4160L7552l0609l0338J963l0703j6981L3372
14895A14K8202r855j47J6295L2070K7269l5942k2488P853k4113K0881j3177l1039
14882d077J5900m1931K2193K8744n877l3815k1211J1373J5070J4842P383n865
14870B729Q154j5492K9321J3938j3152l793M9055l134k4037l6767k5746k1746
14858d0670J6227K2322j2593k4406r86J289l726M4170L3757k4018n5615n028K4357
14845b4920q263o337j2874m661L5356L8044o824j2259j0781L087L7494j4936J2342
14832B4468n731n062k4660k9823l1652Q737K8476L8409k0448l0335L9475M3338
$$ plain form
14920 29792 23825 -7409 -15184 -4217 10183 30206 -3414 -12999 -13458 -27629 -10082 40807 19207
14907 19207 -22445 -30141 -17620 -18302 35858 73410 42801 12463 14426 -16277 -33258 114
14895 114 28316 18461 18314 34609 66679 93948 58006 35518 43371 19258 40139 26962 -4077
14882 -4077 11823 -30108 -7915 20829 14952 -18863 -40074 -28701 -13631 1211 8594 2729
14870 2729 10883 -4609 24712 38650 25498 21705 70760 67626 43589 6822 -18924 -40670
14858 -40670 -24443 -2121 -14714 -39120 -40106 -38817 -42543 1627 35384 11366 -44249 -49277 -24920
14845 -24920 -33183 -39520 -52394 -57055 -21699 16345 9521 -2738 -13519 -10432 27062 12126 24468
14832 24468 18737 13675 -10985 -40808 -72460 -63723 -35247 3162 -17286 -47621 -8146 35192
14820C5192k0831l2973Q227J1500m8575J8775N3558J6379q0095j9109k3207j7297
14808i8456P459K1872N1443K5525R382k5914K5500O974k2518n2324J9843L229
14796b7985k6758l0778L258N2657K5104P548k6154j4761J2230n805R176L4006
14784A1738J0530M748L4861p699n974j3229k8235k776k979K0640Q307j7536j7972
14771e576J124K7497j376L659q134K4490J9470l257K334k703j2196k7466K1589
14758C9455J4210j2963l4224j8389k1030K0543o210j2739K4719K5422J847l2179
14746a1538j498L7961J0317k332m4220m3309M162M1787j3045j9936M1404K49j3980
14733a3978L313j8324j4302j1863L1785M2208k0618j439O9j0564j2525k5395K307
$$ plain form
14820 35192 14361 -18612 -10385 1115 -47460 -28685 24873 41252 -38843 -57952 -81159 -98456
14808 -98456 -90997 -69125 -17682 7843 17225 -8689 16811 23785 1267 -51057 -31214 -27985
14796 -27985 -54743 -85521 -82263 -29606 -4502 3046 -23108 -37869 -25639 -31444 -22268 11738
14784 11738 22268 27016 61877 54178 48204 34975 6740 3964 985 21625 29932 12396 -5576
14771 -5576 -4452 23045 21669 25328 17194 41684 61154 57897 60231 57528 45332 17866 39455
14758 39455 53665 40702 6478 -11911 -32941 -12398 -18608 -31347 -6628 18794 20641 -11538
14746 -11538 -13036 24925 35242 32910 -11310 -54619 -50457 -8670 -21715 -41651 -247 2 -13978
14733 -13978 -10665 -28989 -43291 -55154 -23369 18839 -1779 -3218 -3149 -13713 -26238 -51633 -49326
14720d9326L5724q708K1282l0966J8658N0564m281J2995l1110l7832m0112l6715
14708i9827K1646L1609K905o578L9028L2931j1562m107L1771K5127l6440m0395
14696a3892L5083J01n6091q742n897J6783k5103n47Q707p97M9011j0359k9167
14683d0910Q322J6572J6875Q848n987l552l2557p818j8608K7076l1306k820K6511
14670c9354N2196M2384k3323l6619O879J593O341k1999j2661l313N231M6755L560
14657B7670Q310M8744j8777Q75k3643l4121J8252L89l4489N111Q175M2380M953
14644E3829k1514j9187j3151J3961j7296j3764r238m851J9828l396j3491J1635
14632a6635L2304J4172N088n983k0581j6909j7877k2199j3573M9136O9045j75
$$ plain form
14720 -49326 -13602 -22310 -1028 -31994 -13336 37228 32947 45942 14832 -23000 -63112 -99827
14708 -99827 -78181 -46572 -43667 -50245 -11217 21714 10152 6045 37816 62943 26503 -13892
14696 -13892 21191 21292 -34799 -43541 -49438 -32655 -57758 -58305 -49598 -50395 -1384 -11743 -40910
14683 -40910 -32588 -16016 859 9707 3720 168 -32389 -40207 -58815 -31739 -63045 -65865 -39354
14670 -39354 12842 55226 31903 -4716 2163 3756 10097 -11902 -24563 -27876 -22645 24110 27670
14657 27670 35980 84724 65947 66822 43179 9058 27310 27699 -6790 -1679 6496 48876 53829
14644 53829 32315 13128 -23 13938 -3358 -17122 -26360 -31211 -11383 -14779 -28270 -16635
14632 -16635 15669 29841 34929 28946 8365 -8544 -26421 -48620 -62193 -13057 55988 55813
14620E5813m0751l6084l6594J3487J5949J136K3557K7341M4652K7413j4789l7071
14608D4059j1198l1273n44j5132L3991L1125L641j939m2182l0272J2626L318j8247
14595b2027P260L3976J3265L4969M921L9979k0981k8420j6879m0042J9134J7565
14583D2720J3618k8344k28k198K4065P814Q672l5744l0423k0424j6238L2387K0206
14570A5883l3566Q082J2687j2768m4461j9980J176M4638J7464K904K0787Q594
14558B1440k7536r897J177q398J0420N4911o227k4647l4560L0428J7454P944o347
14545B6162j4740n4781k5189J4939P784J5942j1321m666N8555o23j6208j6777
14533b0923m0043O6730J7626n060m3614N639Q640Q605J9360J1904J0316j6851
$$ plain form
14620 55813 15062 -21022 -57616 -44129 -28180 -27044 -3487 23854 68506 95919 81130 44059
14608 44059 32861 1588 1044 -14088 19903 51028 54669 52730 10548 -19724 -7098 -3780 -22027
14595 -22027 -14767 19209 32474 67443 72364 112343 91362 62942 46063 6021 25155 42720
14583 42720 56338 27994 27766 25568 49633 57447 66119 30375 -48 -20472 -36710 -4323 15883
14570 15883 -17683 -9601 3086 -9682 -54143 -74123 -72947 -28309 -10845 -7941 12846 21440
14558 21440 -6096 -15993 -14816 -23214 -12794 42117 35890 11243 -23317 7111 24565 32509 26162
14545 26162 11422 -43359 -68548 -53609 -45825 -29883 -41204 -45870 12685 12062 -4146 -20923
14533 -20923 -60966 5764 23390 18330 -25284 -19645 -11005 -2400 16960 28864 39180 22329
14521B2329k5600l5338k0764q133N0807L3018j2958K8262J1303k2690n4566l074
14509c7404K9607N2444K2293k7229n228k7313m844o999j4787J1125j7418n673
14497c1426K0543J7244K2742L709j4451l968Q5K3219n4102p8772k8709N8126J1925
14484e3835J4977q692k0562O5751K2477n5193j4195J036O884J1165j1441o0897
14472a02525L8681O0314R317J0190j4282J0415j0120j631l2639J9711J138q560
14460a9991k0891k6088R451j1796j4647P3818j1954j6819K1516M4838M3217L5160
14448A05814j8079m9724q909Q9k0746j1803J5235L8987k0970l6517k8033J507
14436c3149N9547N0399l7979j4952k6069l1006K0661K2892J6675P53J882j6558
$$ plain form
14521 22329 -3271 -38609 -59373 -67506 -16699 16319 3361 31623 42926 20236 -34330 -37404
14509 -37404 -7797 44647 66940 39711 34483 7170 2326 -4673 -19460 -8335 -25753 -31426
14497 -31426 -10883 6361 29103 32812 18361 14393 14478 37697 -16405 -95177 -123886 -65760 -53835
14484 -53835 -38858 -47550 -68112 -2361 20116 -35077 -49272 -48236 -41352 -30187 -41628 -102525
14472 -102525 -63844 -3530 5787 15977 1695 12110 1990 359 -32280 -12569 -11431 -19991
14460 -19991 -40882 -66970 -57519 -69315 -83962 -10144 -22098 -38917 -17401 27437 70654 105814
14448 105814 87735 38011 29102 29191 8445 -3358 11877 50864 29894 -6623 -34656 -33149
14436 -33149 26398 76797 38818 23866 -2203 -33209 -12548 10344 27019 27772 29654 13096
14424A3096K4634l618L781l6634J6183R951j9532p620m7431L06M9979j283j2292
14411a0480o150j913K4596J2798J0210K559n0487k8252L6646J4722M4211J4911
14399F3371j0795j6887m3324l8194p022j4690J3916m607J1246J5650K2021j1496
14387b0811K3209M534k8230M4128k58J2496k463J0818k1584m8562r549P2278L4862
14374G0868j7552j7716p836M122k5476j0686j1127l1850o127K9911J2981J1887
14362A399J114J4547O801l4356j1706K9193J3694o352k5118k6313m47K0577k489
14349a9456l6137j831Q29R14J0780O5079J5713J1834L08J573k118k4509K2737
14336D5716J1771l2539j00888l472L8420J7686L6092m3437L5724p12J5981K1608
$$ plain form
14424 13096 37730 34112 37893 1259 17442 27393 7861 241 -47190 -46884 3095 1812 -10480
14411 -10480 -16630 -18543 6053 18851 29061 31620 -18867 -47119 -10473 4249 48460 63371
14399 63371 52576 35689 -7635 -45829 -52851 -67541 -53625 -58232 -46986 -31336 -9315 -20811
14387 -20811 2398 6932 -21298 22830 22572 35068 32605 43423 21839 -26723 -36272 36006 70868
14374 70868 53316 35600 27764 31886 6410 -4276 -15403 -47253 -53380 -23469 -10488 1399
14362 1399 2513 17060 23861 -10495 -22201 6992 20686 14334 -10784 -37097 -37544 -16967 -19456
14349 -19456 -55593 -57424 -56595 -55681 -44901 20178 35891 47725 48033 49606 47488 22979 45716
14336 45716 57487 24948 -75940 -79412 -40992 -23306 12786 -30651 5073 4361 20342 41950
14324D1950j7936N099K0224j1561l8035l0539n1899j9642L6369K8754K9409J2538
14312D731K4857j6841L2683J6797k3883J2263n021l7649j047L6483k027j4160
14300B7186k1283J0106k6308o2177K5360J7824k572P916m651l4602M0125R074
14288a4002K0455J2777k1780j3323J210K8810L237m8340j4352j1323J4366K8471
14276a3794L6828K1177K694K7496j055l2303k4009k992P829j8265l400k4219k2515
14263d6528J8720K3193J697K9170O131k3752J346K1041O103l1659k4190L3963
14251A5235k0624p192L4550o265j8208k1286k1823K0339K9936K2684l611j4166
14239I569l6457N940L0160J8931l9457l2149R970J2636L2638k2635p726L1342
$$ plain form
14324 41950 24014 29113 49337 37776 -259 -30798 -82697 -102339 -65970 -37216 -7807 4731
14312 4731 29588 12747 45430 62227 38344 50607 45586 7937 6890 43373 41346 27186
14300 27186 5903 16009 -10299 -72476 -47116 -29292 -31864 -23948 -28599 -63201 -23076 -14002
14288 -14002 6453 19230 -2550 -15873 -14663 14147 17384 -30956 -45308 -56631 -42265 -13794
14276 -13794 23034 44211 46905 74401 73346 41043 17034 14042 21871 3606 206 -24013 -46528
14263 -46528 -27808 -4615 -2918 26252 32383 8631 9977 31018 37121 5462 -18728 15235
14251 15235 -5389 -12581 21969 15704 -2504 -23790 -45613 -25274 4662 27346 23735 9569
14239 9569 -26888 -20948 9212 28143 -11314 -43463 -33493 -20857 11781 -10854 -18580 12762
14227A2762M4055r640l9162j4211K5040K6023m2937r954J8828L5079o967M072
14215D2988j279j7673N97o156l3866R990O97L034L8051k1172n456o780J059J0192
14201A4226K5J1172P420l593k2373L5302O207k2999j9271L8410Q057k5908m2629
14188a5954j8013J3378J8391J7731K0484j7630l7019J9294l4064P558M2078P596
14176B3830k2539k0971J0067j3907j6346L7013J182j0357J0645k9002L0304J2407
14164A2326n3299j2724m451k7996K3898N5K4125O326K3013K5809k9045n8529m0980
14151a11472k0793M4571N7315M1128N0897J3309l6767l3030j6506M5298K4482
14140E8432l0343m9196p222r141K4598K1006m2255j2754K3527L2961M2491k357
$$ plain form
14227 12762 56817 47177 8015 -6196 18844 44867 1930 -8024 10804 45883 38916 42988
14215 42988 41709 24036 24633 18477 -15389 -5399 -4702 -1668 36383 15211 9755 2975 4034 14226
14201 14226 14251 25423 32843 29250 6877 42179 48386 25387 6116 44526 52583 26675 -15954
14188 -15954 -33967 -20589 -2198 15533 36017 18387 -18632 662 -33402 -25844 16234 23830
14176 23830 1291 -19680 -9613 -23520 -39866 -2853 -1671 -12028 -1383 -30385 -81 12326
14164 12326 -40973 -53697 -58148 -86144 -62246 -62191 -38066 -31740 -8727 17082 -11963 -70492 -111472
14151 -111472 -132265 -87694 -30379 10749 61646 74955 38188 5158 -11348 33950 58432
14140 58432 28089 -21107 -28329 -37470 -12872 8134 -34121 -46875 -23348 9613 52104 49747
14128D9747R708J3151k3156l2781j4564L5034K566n7011m1921k0273P196L0572
14116d1732K696k1869L2999M5944K9227n4364j4140K4156j5446l84j5875J0148
14104a8640K2410K5920J6779l2307k3353j890J5233K7345J7463O440r05J6026
14092G0521k5299m0044K377K5145N353K5734L233l89k6401m3744J1102m569K4798
14079B7817P995P8K4007K438k5467q659P209k2841j2471K4544K5728L766k2286
14066C1858J0481L480J3531p669M555r183k2806k4916j0840J6424k2102l094k7501
14053d7782m0195J428N0659k8689k7847O4189K3696m5165r015O3171J345l3889
14041b8094l0913j5259M318N5923J9157J2329K359k9721R59q126K2569n915J977
$$ plain form
14128 49747 59455 72606 49450 16669 2105 37139 39705 -17306 -59227 -79500 -72304 -41732
14116 -41732 -39036 -60905 -27906 18038 47265 -7099 -21239 2917 -12529 -12913 -28788 -18640
14104 -18640 3770 29690 46469 14162 -9191 -11081 4152 31497 48960 55400 54495 70521
14092 70521 45222 5178 7555 32700 38053 63787 67020 66631 40230 -3514 7588 3019 27817
14079 27817 35812 35890 59897 62335 36868 28209 35418 12577 106 24650 50378 54144 31858
14066 31858 42339 45819 59350 51681 56236 47053 24247 -669 -11509 4915 -17187 -20281 -47782
14053 -47782 -87977 -86549 -35890 -64579 -92426 -28237 -4541 -49706 -58721 4450 5795 -28094
14041 -28094 -59007 -74266 -69948 -14025 5132 17461 19820 -9901 -8942 -17068 5501 -414 1563
14028A563j7551j1154n64M430l229J6908m1264K6369M2289j5451K5410N423l8834
14015e655l6692k3440K686k874q507L7758L3125p301m4733J1355K4173K403k0479
14002c8181J2027L2286J3727J8709j9688n5696o896M5265L835K3685J4297j3518
13990B9852n30L573n4712j8850N9337K9951j2968K6840n686j0915m050J6644L4931
13977I3417L928l2061k0680K188j4056q742n4963m1517J5467N4860J2668L2521
13965D3030l663l7751j5622o903j7636P011K4332j7036K8513J6500K529l509m0383
13952b0588m5393K950n516j2731J5624L2261N7840k0416k381N3384K9031k9166
13940E4899J8696r896l687j9155J1896l7999n4796l264P774M4636P943n6295j2898
$$ plain form
14028 1563 -15988 -27142 -27706 -23276 -26505 -9597 -50861 -24492 17797 2346 27756 33179 -5655
14015 -5655 -42347 -65787 -63101 -65975 -74482 -36724 -3599 -10900 -55633 -44278 -20105 -17702 -38181
14002 -38181 -26154 6132 19859 38568 18880 -36816 -43712 1553 5388 29073 43370 29852
13990 29852 29322 32895 -21817 -40667 18670 48621 35653 62493 56807 45892 41842 58486 93417
13977 93417 97345 65284 44604 46792 32736 23994 -30969 -72486 -57019 -2159 10509 43030
13965 43030 39367 1616 -14006 -20909 -38545 -31534 -7202 -24238 4275 20775 23304 19795 -20588
13952 -20588 -65981 -63031 -68547 -81278 -65654 -33393 24447 4031 1650 55034 84065 54899
13940 54899 73595 63699 60012 40857 52753 14754 -40042 -43306 -35532 9104 17047 -39248 -52146
13927e2146J4150J4642L870j7140J4615M688j7301J7165L9502j595j7419r318
13915f287j5082J9077k8655l9592j7292L3739n699p349L5824J0141j3913M0162
13903E074m522l337j7422m753L9888M89p249N0863j3021k3795k2557m840L3986
13890B8804M22N531l6200m5492L1565J8537p016l930R539K8147j024l1758J2930
13877A0055k9369K703q823j4362L4336o480k673j4124J241k3650j9887r453O138
13864g4348J7185N6790m3886m5782K018L7767j0010J1247J5276O011j1744L1182
13852h294J3302j2359o240K1430q249l7723j1669j2276J4164L3382R242M2159
13840C6869m1694k2687P065n745k8491L2883J4812r443l8871N710K0694p804L362
$$ plain form
13927 -52146 -37996 -23354 -19484 -36624 -22009 -17321 -34622 -17457 22045 20450 3031 -6287
13915 -6287 -21369 -2292 -30947 -70539 -87831 -54092 -59791 -67140 -31316 -21175 -35088 5074
13903 5074 552 -2785 -20207 -24960 14928 15417 8168 59031 46010 22215 -342 -5182 28804
13890 28804 29226 34757 -1443 -46935 -15370 3167 -3849 -7779 1760 29907 28883 -2875 10055
13877 10055 -19314 -16611 -25434 -39796 -5460 -11940 -14613 -28737 -27496 -51146 -71033 -80486 -74348
13864 -74348 -57163 -373 -44259 -90041 -88023 -50256 -60266 -49019 -33743 -27732 -39476 -8294
13852 -8294 5008 -7351 -13591 7839 -410 -38133 -49802 -62078 -47914 -14532 -5290 36869
13840 36869 -4825 -27512 -20447 -26192 -54683 -21800 -6988 -16431 -55302 -49592 -28898 -36702 -33340
13827c3340M412O800K1772N4932K762l7519j8793J4473N329M583q85k6227l3625
13814c5326j6069L0568K2872j2497J2610K9089K3737j5807j9755j5362P028L434
13802A4522l4014R529M4138k915k6596l4323K7000M1278J2126j17o4829n8204
13790g2405O7008L762l8754l5656O241j0149K728j9983J9638L7941L4358J452
13778c819k3963L4479L943L0763j1797m7628K6839J945k4943M012L0962M2589
13766F3382k7881r114l1540m597L677l5325R287j0845L5233M7736M347J011n254
13753D0117l2110j2845J9709j3619J1982J8531J8310O706j8835m304j8521n3309
13741c8188n8567K7069O141L209J4749j5116K0101R907K01L8053K8679j2391J7265
$$ plain form
13827 -33340 -28928 -22128 -356 54576 57338 19819 1026 15499 20828 25411 24526 -1701 -35326
13814 -35326 -51395 -20827 2045 -10452 2158 31247 54984 39177 19422 4060 11088 14522
13802 14522 -19492 -9963 34175 31260 4664 -29659 -2659 38619 50745 50628 -14201 -72405
13790 -72405 -5397 -1635 -40389 -76045 -69804 -79953 -77225 -97208 -77570 -39629 -5271 -3819
13778 -3819 -27782 6697 10640 41403 29606 -18022 8817 10762 -14181 -10169 20793 63382
13766 63382 35501 26387 -5153 -9750 -6073 -41398 -32111 -42956 -7723 40013 44360 45371 40117
13753 40117 8007 -4838 14871 1252 13234 31765 50075 56781 37946 33642 15121 -38188
13741 -38188 -96755 -69686 -63545 -60336 -45587 -60703 -40602 -30695 -30494 7559 36238 23847 41112
13728D1112j6879k1923l5153J1339K2532n0702o442R113J786P764J6259J035L0858
13715A0699J0566r451j2612n755L4724K327k9421K5492m443j9762j3074j7030
13703b7740J2226J037M4172M1420m4270l0998q420j5703k0929K9799J1093m979
13691a3292j0596j8469o59M987k0855L3121k779m4815N362L9577j7987p642K6365
13678b7682K4950j3720J6214L8657j3509k7529K625j0485M3198P233m5556l6654
13666d2258j0124J8385j2270J1599J5061l9228K3468q077L0641J2692R414n182
13654D121P304K3126L794j1364n2431m611q410J8237M5750L9722r974k8007J667
13641B8924M800m968m5264j5088M2073O9062k687k4410O126q007l3979m663j2647
$$ plain form
13728 41112 24233 2310 -32843 -21504 1028 -49674 -56116 -47003 -45217 -37453 -21194 -20159 10699
13715 10699 21265 11814 -798 -6553 28171 30498 1077 26569 22126 2364 -10710 -27740
13703 -27740 -15514 -14477 29695 71115 26845 -4153 -12573 -28276 -49205 -19406 -8313 -13292
13691 -13292 -23888 -42357 -43016 -38029 -58884 -25763 -28542 -73357 -67995 -28418 -46405 -54047 -27682
13678 -27682 -2732 -16452 -238 38419 24910 -2619 6 -10479 32719 39952 -5604 -42258
13666 -42258 -52382 -33997 -46267 -34668 -19607 -58835 -35367 -43444 -12803 -111 9303 4121
13654 4121 11425 34551 38345 26981 -25450 -30061 -38471 -20234 25516 65238 55264 27257 28924
13641 28924 33724 28756 -16508 -31596 10477 79539 76852 52442 58568 50561 16582 11919 -728
13628g28k1455o083J6736p70l970O423j8300J9296L5377k384L5285L5307j6399
13615G8335j4076q062n0501n1282k240K6401P4481R014l6783j6563m2764j8932
13603e2972K544L2107K0696Q659k495J5826M6519l5458k4361P912K7389j3681
13591C2685k2439J3481J9518o949q660J5645J818o6288m456J5959K3738k3259
13579i207k2421K651j8049j3002K9902M4142j4625m3492r794K6916Q115K3270
13567D406P272n9658l7104K423J5708K5767K4297m4685j0888k0970L1298M7653
13555a4481l6813k465k0539p620q931J321k8097L5139L5206J6192K124j8895j7629
13542f5488L6781K8631k1496J2414j2091j6198Q881N4756K8066O888l6353r461
$$ plain form
13628 -728 -22183 -28266 -11530 -12300 -16270 -9847 -28147 -8851 26526 24142 59427 94734 78335
13615 78335 64259 56197 5696 -45586 -47826 -21425 53056 62070 25287 8724 -34040 -52972
13603 -52972 -50428 -18321 2375 11034 8539 24365 70884 35426 11065 18977 46366 32685
13591 32685 10246 23727 43245 36296 27636 43281 45099 -21189 -25645 -9686 14052 -9207
13579 -9207 -31628 -28977 -47026 -60028 -30126 14016 -609 -44101 -53895 -26979 -18864 4406
13567 4406 11678 -47980 -85084 -82661 -66953 -41186 -16889 -61574 -72462 -93432 -62134 -14481
13555 -14481 -51294 -53759 -74298 -81918 -90849 -89528 -117625 -82486 -47280 -31088 -28964 -47859 -65488
13542 -65488 -28707 -76 -21572 -9158 -21249 -37447 -28566 26190 54256 61144 24791 15330
13530A5330m6331m1733K5472N0410J8404J2965j1840m5876l0415J8019L7802O290
13518H497o7800J516R847K6300M4866K801o6945m6816o853K8772L124k1503K050
13505h2144q211J7764L1981j688O704J1487J110P953L0239J0941J5897l0222m510
13492G301L3249M063k0054o565J4097L2579l1655l1915K462K1135J862n3k4148
13479B358k1862n3086L6512L4365K6359n619p064k5359j1762m132N5736l089P948
13466C1305J8293M454n676J2658j9205J3291O0227l8641n4326M806j502o4189
13454c8505j7614K982J308J4033k8806k2673R992j4905K4788L9954K3076j0532
13442a6902j334K2157J4870J9850J7399l3245m6144M58K5561J6143Q746o937O383
$$ plain form
13530 15330 -31001 -72734 -47262 3148 21552 34517 22677 -23199 -53614 -35595 2207 8497
13518 8497 -59303 -57787 -47940 -21640 23226 26027 -40918 -87734 -94587 -65815 -62691 -84194 -82144
13505 -82144 -90355 -72591 -40610 -42298 -35594 -24107 -22997 -15044 15195 26136 42033 11811 7301
13492 7301 40550 44613 24559 17994 32091 64670 33015 1100 3562 24697 26559 26506 2358
13479 2358 -19504 -72590 -36078 -1713 24646 19027 11963 -13396 -25158 -29290 26446 23357 31305
13466 31305 49598 54052 48376 61034 41829 55120 115347 76706 22380 27186 25684 -38505
13454 -38505 -56119 -53137 -51829 -37796 -66602 -89275 -79283 -94188 -69400 -29446 -6370 -16902
13442 -16902 -18236 3921 18791 38641 56040 22795 -23349 -22891 2670 18813 27559 20622 27005
13429B7005k1689k3692M9501N6218j0165k2674k6913K4597P6668J2983P526n272
13417A44093M5989J1586K9534P6242J09801J54154K20333L36250N12455M36748
13407B077185p2416l49442m13279m13962k85170j49488j16758p7180m6975n0664
13397A01851j5190k2211k5387K7552j7189r052k521R327k957l1349j5957q190
13385a1273J6191n1267R767P632L9730J9728o448m5026j430L0514J7986Q437n4563
13372b0022j9287l2664J6377R501J0299q519K6419J1793P854k6874q389K9864
13360c648Q370l348m065k9796k0913L2206O2876K7217l5214j5236M233j7438p527
13347b283m1881J2096K9158L1632J1416k7800k7917n0559q93j4144J2050L9799
$$ plain form
13429 27005 5316 -18376 31125 87343 77178 54504 27591 52188 128856 141839 149365 144093
13417 144093 190082 201668 231202 307444 417245 571399 791732 1127982 1640437 2077185
13407 2077185 2004769 1655327 1242048 828086 542916 393428 276670 199490 152515 101851
13397 101851 86661 64450 39063 66615 49426 40374 37853 47180 44223 12874 -3083 -11273
13385 -11273 4918 -46349 -36582 -28950 10780 30508 24060 -20966 -22396 8118 26104 34541 -20022
13372 -20022 -39309 -71973 -55596 -46095 -35796 -44315 -17896 -6103 1751 -25123 -33512 -3648
13360 -3648 4722 1374 -2691 -32487 -53400 -21194 41682 68899 33685 18449 22682 5244 -2283
13347 -2283 -44164 -32068 -2910 28722 40138 12338 -15579 -66138 -67031 -81175 -69125 -29326
13335b9326M8708Q670J1357J0496M011k6315j8786l5074k9556L7274j8313p240
13323d4094p485L0230J446n522M143Q797K7206J5182M371r331r726J685Q627r196
13309A6333j225j0921K9064m090l4916n8408n833K2979K2404J9807k6852l2770
13297f4428j9855n12K1556J2774p871J0076j489K4696O3315O490j5863l7597n2097
13284f0805M780P6848l205j6589L11q239j7900K9070M8821j2656l9912N918J1337
13271A7779m287Q401k776n0885j3234J6879J3080J1307J8280j7809j6110l165
13259b2540M9061K7423m9706n4321J6064O078k1961k1564j6003K9636O0904L6659
13247C9730Q034K4397q805p8484k9950N7682P2013n989q5596m2419l709j133J7334
$$ plain form
13335 -29326 19382 28052 39409 49905 53916 27601 8815 -26259 -55815 -18541 -36854 -44094
13323 -44094 -51579 -21349 -19903 -25425 -21282 -12485 14721 29903 34274 24943 15217 16902 25529 16333
13309 16333 15108 4187 33251 29161 -5755 -64163 -69996 -47017 -24613 -4806 -31658 -64428
13297 -64428 -84283 -84795 -63239 -50465 -58336 -48260 -49749 -25053 38262 44752 28889 -8708 -60805
13284 -60805 -56025 20823 17618 1029 1340 -6899 -24799 4271 53092 40436 524 6442 17779
13271 17779 13492 21893 19117 -31768 -45002 -28123 -15043 -3736 14544 -3265 -19375 -22540
13259 -22540 26521 53944 4238 -50083 -34019 -27941 -49902 -71466 -87469 -57833 3071 39730
13247 39730 47764 72161 63356 -15128 -45078 12604 84617 78628 -6968 -49387 -53096 -54229 -36895
13234c6895R622L2183L3434O033k4885j4769M603j8364K818K1486O0270k2358
13222E3178j8248k2650n5452j8659L8417M0089l6592l3078K5107l7003L3267K7115
13210d509J5909J7373J0786K078L204K2769P953n483K0039L8910M0005M1848K824
13197B13706K6331j8508n0913p9041n5487K904K7576K847l523k9114j0370J9673
13185D6081L0674k4865m8254l1401r485L4937R967M1172K8086J011k5418J818
13173E4323K4145J1443l3375j4199m3754m8865n9279J2537j5976Q680L0912L7618
13161c5790M0805K6241l6306J6934r098k5983K3079n963j149L3984M820m0620
13149i046l8494L2183N2133K2399J3547p3450l7206K7873j5435M9517N2070J3108
$$ plain form
13234 -36895 -27273 4910 38344 44377 19492 4723 9326 -9038 -6220 15266 75536 53178
13222 53178 34930 12280 -43172 -61831 -23414 16675 -19917 -52995 -27888 -64891 -31624 -4509
13210 -4509 11400 28773 39559 41637 44841 67610 75563 70080 90119 129029 169034 210882 213706
13197 213706 240037 221529 170616 91575 36088 38992 66568 69415 65892 36778 26408 46081
13185 46081 76755 51890 3636 -27765 -37250 -2313 7654 48826 76912 77923 52505 54323
13173 54323 78468 89911 56536 42337 -1417 -50282 -109561 -97024 -113000 -104320 -73408 -35790
13161 -35790 5015 31256 -5050 11884 2786 -23197 -118 -6081 -7230 26754 31574 -9046
13149 -9046 -47540 -15357 36776 59175 72722 -728 -37934 -10061 -25496 24021 76091 89199
13137H9199j2375M056K9790j0849k3057l5576j3489K2070O823L8605L4317p653
13125A21861k6685J664J9690K4283k4034k3897j0925P585l1499m6258n652K6612
13113C2745L4535N057p2722m3003j6055P730J9811K2659L207R203J0710j0638
13101C239P65O0494P0474K6799p5777l7712Q398J5588k2674J4342m982K4183K7236
13088A10373l1408k8099o93o557K9795Q233m1599j6370Q380Q74m4539n8533K9537
13075d0606l3777m3952m8541o3213l0792J9155Q7760J25635J17700R6441K9254
13064B15064l7588j8101j802J9032Q291r062j5782l9000M6875K8646k9200r565
13052A57808j6640k4987M2338K2347L9095k731l4173P640J3753K5886o338m0476
$$ plain form
13137 89199 76824 80880 110670 99821 76764 41188 27699 49769 56592 95197 129514 121861
13125 121861 95176 96840 116530 140813 116779 92882 81957 89542 58043 11785 6133 32745
13113 32745 67280 72337 -385 -43388 -59443 -51713 -31902 -9243 -6036 3167 13877 3239
13101 3239 4004 64498 134972 161771 85994 48282 56680 72268 49594 63936 58954 83137 110373
13088 110373 78965 50866 50173 43616 73411 81644 40045 23675 32055 32929 -11610 -70143 -40606
13075 -40606 -74383 -118335 -166876 -230089 -260881 -241726 -153966 -28331 89369 185810 215064
13064 215064 177476 159375 157573 176605 184896 175834 160052 121052 167927 196573 167373 157808
13052 157808 141168 116181 158519 180866 219961 217230 183057 190697 204450 230336 223998 183522
13040A83522m2134J2165L0478k1090l5890M518K5197J5484k344l2564m1094l0426
13028F5822L1112P3303K6471J2556J8139L8544N2385j2k1956l3163L6137R0365
13016C89703O0797k0843r150J5946L334J3766k3282j6745J7223J6426J0723L9992
13004D97890k8080k900k3043n497K7740M8087L3289K286J379M0778N7079P5573
12992G24581J1006J2370K0125N3742Q9743L5328M8611N2875O5306L6417M3571
12981A193675P9361Q0970J21564J23265J51407J69981J62306J72318J98479J71352
12971B624678K34351K40553K15095K77892L90804M67452N78342O05094P83484
12962F417745J003612J255311J591567J913189K309324K769906K849141K660101
$$ plain form
13040 183522 141388 153553 184031 162941 127051 131569 156766 172250 169906 137342 96248 65822
13028 65822 96934 170237 196708 209264 227403 265947 318332 318320 296364 263201 299338 389703
13016 389703 450500 429657 420507 436453 439787 453553 430271 413526 430749 447175 457898 497890
13004 497890 469810 466910 443867 438370 466110 514197 547486 549772 551151 591929 649008 724581
12992 724581 735587 747957 768082 821824 911567 946895 995506 1048381 1113687 1150104 1193675
12981 1193675 1273036 1354006 1475570 1598835 1750242 1920223 2082529 2254847 2453326 2624678
12971 2624678 2859029 3099582 3314677 3592569 3983373 4450825 5029167 5634261 6417745
12962 6417745 7421357 8676668 10268235 12181424 14490748 17260654 20109795 22769896
12954B2769896L028805L684396M907941P205110J1044380J7131465K6857257M3251561
12946A39880811P1715864J09045109Q6315462k2008489n9325084p4777865p9217286
12939A71628522n5949969l4138974k1055718j3808857r511683o706888m692117
12932B5764316l365218k751107k629518k269896j967941j735388j399930j144871
12924H500447r14494o83403o29508o14670n55503n01972m35824l47570l02380
12915C515123k22809k49678k28114j45690j91948j54278j28388q8170j09435p9227
12905A917386n2158j00055j00163o8146q4608r6301q3995q4935o2015q737o2358
12894A113915p3846l4035k0787j6231k5457m0215l1495l673k8018j9399n9654
$$ plain form
12954 22769896 25798701 29483097 34391038 41596148 52640528 69771993 96629250 139880811
12946 139880811 211596675 320641784 406957246 384948757 325623673 250845808 171628522
12939 171628522 115678553 81539579 60483861 46675004 37163321 30456433 25764316
12932 25764316 22399098 19647991 17018473 14748577 12780636 11045248 9645318 8500447
12924 8500447 7585953 6902550 6273042 5658372 5102869 4600897 4165073 3817503 3515123
12915 3515123 3292314 3042636 2814522 2668832 2476884 2322606 2194218 2106048 1996613 1917386
12905 1917386 1865228 1765173 1665010 1596864 1512256 1415955 1331960 1247025 1185010 1176273 1113915
12894 1113915 1040069 1006034 985247 969016 943559 903344 871849 868176 840158 820759 761105
12883G61105o0073o8665m2874k8019J5780m5563n7537q449R735n277L5814q938
12871D97039P710l7043o746N863l9632J8041J4692j9683m626Q401O958k2921o1012
12858C67041J6218L0244L3165k8929j5258k3938j7747K1085K639j2132q601L620
12846C67407j9486o0848n2109J8644N0421K7147j6760m947n879J2689j404l4865
12834B80010m7259k6796k1065K0461J0965Q905O9747J4461J5889l3336p5627j8955
12822A97400J5182O234K9865L9871J36627J60909P0479j9669l0044p7483j17103
12811D12268l8675j7906k6346n4272j3909k0945r303o04m7268m3391J887L8052
12799A79588L5876k9350j7643M1423J8552k3681n2014l1422l1059m1376J5276
$$ plain form
12883 761105 701032 632367 589493 561474 577254 531691 474154 465705 475440 470163 505977 497039
12871 497039 504749 467706 460960 466823 427191 445232 459924 440241 435615 444016 450974 428053 367041
12858 367041 383259 413503 446668 417739 402481 378543 360796 381881 384520 372388 363787 367407
12846 367407 347921 287073 234964 253608 304029 331176 314416 309469 303590 316279 314875 280010
12834 280010 232751 205955 184890 205351 216316 225221 294968 309429 325318 291982 216355 197400
12822 197400 212582 218816 248681 288552 425179 586088 656567 636898 606854 529371 412268
12811 412268 373593 355687 329341 275069 261160 240215 230912 230308 183040 139649 141536 179588
12799 179588 215464 186114 168471 209894 228446 204765 152751 121329 90270 48894 64170
12788F4170L8416K2644M7879N2673M3905L527l0264j2941R263j168m037O487O783
12775B47337q852j9871k903N145m7311l3328j6411r96j0687j0338J449L3771l1604
12762A05401l8227L5699K2596o726n7450M331L2119l6005p5719l9996O778P8142
12750C0943R851J3167M3871L7264K0312l1557k1841j614r176J6334N6476K0960
12738A84990K674m0305k7586P788J8715j6460l3554k1753R340P013K7261j2046
12726A06077o430j7552J0321M097l3239j8740M0983J229q433J0812o113K2009
12714A05021k389n7524j3202m5979J7745r873j6151M3169J4344k7972l257j5806
12702a1874O262K8960J6111l607J4345j410O557N2692O62J8213M805r953n8801
$$ plain form
12788 64170 102586 125230 173109 225782 269687 273214 242950 230009 239272 238104 234067 240554 247337
12775 247337 238485 218614 215711 220856 173545 140217 123806 122810 112123 101785 103234 137005 105401
12762 105401 67174 102873 125469 118743 61293 65624 97743 61738 -13981 -53977 -47199 30943
12750 30943 40794 53961 97832 135096 155408 123851 102010 100396 91220 107554 164030 184990
12738 184990 187664 147359 119773 127561 146276 129816 96262 74509 83849 90862 118123 106077
12726 106077 99647 82095 92416 96513 63274 44534 85517 86746 78313 89125 83012 105021
12714 105021 102632 45108 31906 -14073 3672 -6201 -22352 20817 35161 7189 3932 -11874
12702 -11874 -5612 23348 39459 35852 50197 48787 55344 108036 108698 126911 131716 121763 62962
12689F2962j2233J3392J5947j4331K8137J7654J349k0469N693O10q6012j3167
12677d68J7454M424L1825l2478L865l4349m4276L4L1806M1342L3699K1019k8014
12664D5883l6663L6433l224r617o776J7632J0231J0836j8567L016N3935J2071
12652A15190p726k2563l8906k2963l9973K5586L5616L2559J4598J9388l8202o3817
12640H787k0064O3669L9093P286K0235K6420r098J1673q0719o9106m1845J9257
12628b4412j2997M9062J3482K4595J3484K8441k5121l3183j2262L2977j0980j1592
12616C1494k041j6443k7194K9143k3368j8437P774L7372J6603p101k1493m1523
12604c5214K5627K5340M1475r28k2852k9547l8325n418M0053J6929Q649Q861O293
$$ plain form
12689 62962 50729 64121 80068 65737 93874 111528 112877 92408 98101 98711 12699 -468
12677 -468 16986 21410 53235 20757 24622 -9727 -54003 -53969 -22163 19179 52878 73897 45883
12664 45883 9220 45653 42429 32812 26036 43668 53899 64735 46168 49184 103119 115190
12652 115190 107464 84901 45995 23032 -16941 8645 44261 76820 91418 110806 72604 8787
12640 8787 -11277 52392 91485 98771 119006 145426 136328 148001 67282 -1824 -43669 -24412
12628 -24412 -37409 11653 25135 49730 63214 91655 66534 33351 21089 54066 43086 31494
12616 31494 29453 13010 -14184 14959 -8409 -26846 -19072 18300 34903 27802 6309 -35214
12604 -35214 -9587 15753 57228 56300 33448 3901 -34424 -39842 211 17140 25789 34650 40943
12591D0943j5770n566N9008k5122k8691k2136J2338K099O835l0062k4736N2291
12579B1431L9229j8215k5023R076O255P005l1856j4592l4482k4390R421J4070
12567d2071L2130M9209K8004L778J4743p041j6589k4133O14k8031k1329J4606
12555C890N1564K9001k3323k7561k2581R187K9256p465J0860K022j9699l0060
12543E091k585K2162R791L167J2366o162L4643j7190J5076k4717l7246Q638l4464
12530a1430L0273K1777J2410j3968k8151q64P6857j0680j295l6011o5970K9830
12518B778L2768J2685K1802J3625k4982m2941N422n545J3446N4275r937k3344
12506E0052K2434L2271j2704j5259n6782j781m5016L5296K5949K6295J0097K9316
$$ plain form
12591 40943 25173 19607 78615 53493 24802 2666 15004 17103 23938 -6124 -30860 21431
12579 21431 60660 42445 17422 26498 32753 39758 7902 -6690 -41172 -65562 -56141 -42071
12567 -42071 -9941 39268 67272 71050 85793 78752 62163 38030 38644 10613 -10716 3890
12555 3890 55454 84455 61132 33571 10990 20177 49433 41968 52828 54850 35151 5091
12543 5091 2506 24668 34459 37626 49992 43830 78473 61283 76359 51642 14396 23034 -11430
12530 -11430 18843 40620 53030 39062 10911 10047 86904 76224 74929 38918 -27052 2778
12518 2778 35546 48231 70033 83658 58676 15735 21157 15612 29058 83333 73396 50052
12506 50052 72486 104757 92053 76794 20012 18231 -26785 8511 34460 60755 70852 100168
12494A00168K7864k4578k3903j8710n842n1435k7200J058M6742O9553Q244o772
12482I5189O0517O1224K6994J3570O4678J11694J57256K06406L44623M60258L77502
12471A979911k1713k72291l74118l75859k84625j65808j03127p9286k3462j1278
12461B68344k9394m4492n1169l1153K711n294P638m0586l5126j8267j157J9723
12449D1778k6717l168k947K7503L4799J0022l109k8937j6745J088K0959K8659
12437H3185j0635p487K8317r751p332m0150l2298m1199j8068P253K7996J8537
12425a632J801K3689L3086K0235q021K4924k7372K0247K0059n8546m2977j7491
12413a1998r149k931j9643J7460M6817O149o921l4437M911P188m1232N239K5994
$$ plain form
12494 100168 128032 103454 79551 60841 54999 3564 -23636 -22578 24164 93717 101961 95189
12482 95189 155706 216930 243924 257494 322172 433866 591122 797528 1142151 1602409 1979911
12471 1979911 1958198 1685907 1311789 935930 651305 485497 382370 303084 279622 268344
12461 268344 238950 194458 143289 112136 114847 109553 117191 76605 41479 23212 22055 41778
12449 41778 15061 11893 8946 36449 71248 81270 78161 49224 32479 33567 54526 83185
12437 83185 72550 65063 93380 83629 76297 36147 3849 -37350 -55418 -48165 -20169 -1632
12425 -1632 169 23858 56944 77179 69158 94082 66710 86957 107016 48470 5493 -11998
12413 -11998 -21147 -24078 -43721 -26261 20556 26705 19784 -14653 -9742 -2554 -43786 -38547 -12553
12400a2553L6409K0676J5925k1881l3305j8955j1712r093k478J6998M6533J081
12388B7645k4615L5580M0357k8528o8280n201J0312q233L4462J769k4381M2983
12376C3870R283K6659l1686l3843K1597K2867k0267p274P934m018j2073r420N739
12363I368K701K0563j1860R942L7655j3390j1519j6436k9887P495N2991L4133
12351I1756J2135l0154l4909j4593O578j8846j0050j7268J2650J4367K2911K5924
12339F0501j0813j1815k9037j1374R493p307l482o3032k242J9581J2168J834L5654
12326A29J8683j2081J3072k942j1585r526j9105P009J5914R355J5296L8237k1892
12313D0564j4869j4554l5893J9698K2026J2292J1064j2314J0826m112m0550J4723
$$ plain form
12400 -12553 23856 44532 60457 38576 5271 -13684 -25396 -34489 -36967 -19969 26564 27645
12388 27645 3030 38610 78967 50439 -17841 -23042 -12730 -20963 13499 15268 -9113 33870
12376 33870 43153 69812 38126 4283 25880 48747 28480 21206 29140 25122 13049 3629 9368
12363 9368 12069 32632 20772 30714 68369 54979 43460 27024 -2863 4632 57623 91756
12351 91756 103891 73737 38828 24235 30813 11967 1917 -15351 -2701 11666 34577 60501
12339 60501 49688 37873 8836 -2538 6955 -352 -3834 -66866 -69108 -49527 -37359 -35525 129
12326 129 18812 6731 19803 16861 5276 -4250 -23355 -16346 -432 8923 24219 62456 40564
12313 40564 25695 11141 -24752 -5054 16972 29264 40328 28014 38840 34728 -5822 8901
12301H901O5640J6717j6550k6274N777k1892m7990J1576j8624l2227M0058p656
12289b2544l5917j7781J8197K3384k4892J4273L2374k9083J888L7698l0320j2687
12277d5410K2610k771K1873l6766l0457M6048N9545J2776n6969m1038k2356M4000
12265b8915J7865j6470j6903q387l7788l650M2948K2891J4970M3302K2667K155
12253E4685K7390j4548J099k9731q965K9763R565k115P625j8754k4860m0631k1523
12240c1000j1894J8866K8162K1918j089K1110K7336k0092k4717N047J2442m3327
12228B762j781J9244J7401j3711l8313J0707J7031J0494M0561Q081j6337k7330
12216B8809n3940j8980j7655L5672M1012k255j6516k3729L4317K2838O657j9820
$$ plain form
12301 8901 74541 91258 74708 48434 54211 32319 -15671 -4095 -22719 -54946 -14888 -22544
12289 -22544 -58461 -76242 -58045 -34661 -59553 -45280 -12906 -41989 -40101 -2403 -32723 -45410
12277 -45410 -22800 -25571 -3698 -40464 -70921 -24873 34672 47448 -9521 -50559 -72915 -28915
12265 -28915 -11050 -27520 -44423 -52810 -90598 -94248 -51300 -28409 -13439 29863 52530 54685
12253 54685 82075 67527 68626 38895 29930 59693 69258 67143 74768 56014 31154 -9477 -31000
12240 -31000 -42894 -24028 4134 26052 24963 46073 73409 53317 28600 33647 46089 2762
12228 2762 981 20225 37626 23915 -14398 -3691 13340 23834 64395 72476 56139 28809
12216 28809 -25131 -44111 -61766 -26094 14918 12663 -3853 -27582 6735 29573 36230 16410
12204A6410K2253J1011k6479j8907k7154m6232k061n503J1488L3810Q612j5469
12192c8221J3906M288Q83j1466k280O268k5292J8254M0578q183J0404K2871m2460
12179a0450j0882n711L502K4211k5072l7128K7288M7775j236N135J7962M7780
12167H3174J8932o9610j6487K7354n469k1647m5492m775j9340M5884K8234O087
12155B6845Q408m5425l4651L7126O0819P135k3949J11J2727k44k8986M974j6935
12142G955o396J0273l5231J2038L192J0042J9614J767M179j1688J1164m550k8305
12129e946L4798k0195k3680O616O1612K3518n6280R484J9243m4089j3981l553
12117a2453j4585N756M9155K3524j7068l0349o6426J1406J8131j2513j5324K0091
$$ plain form
12204 16410 38663 49674 23195 4288 -22866 -69098 -71159 -76662 -65174 -31364 -22752 -38221
12192 -38221 -24315 -20027 -19144 -30610 -32890 -26622 -51914 -33660 6918 -1265 9139 32010 -10450
12179 -10450 -21332 -27043 -23541 670 -24402 -61530 -34242 13533 12297 17432 35394 83174
12167 83174 102106 32496 16009 43363 37894 16247 -29245 -34020 -53360 -7476 20758 26845
12155 26845 35253 -10172 -44823 -7697 53122 60257 36308 36419 49146 48902 19916 24890 7955
12142 7955 1559 11832 -23399 -11361 -8169 1873 21487 23254 27433 15745 26909 22359 -5946
12129 -5946 28852 8657 -15023 -8407 53205 76723 20443 29927 49170 5081 -8900 -12453
12117 -12453 -27038 -21282 27873 51397 34329 3980 -62446 -51040 -32909 -45422 -60746 -40655
12105d0655K3538k740R103K7023K3056J4032n854m7097j9350j7529j8705m05L8347
12092a7236l460n3101j2677j6788j1214q995L2284N0644N2592M3583k4617l2103
12080a088j0574n4874M2976O3882j2535R962J2344K985j5970K371K1005k3529
12068C6955K098j2568l8786l5904J8518o743p739M4648j2938N0361J3546m4820
12056F628j7111r067j2274N675J6608n082k6782L694K4871K786j5413K8959P369
12043A0861k7149l554J8021p456R50J909K5889J3352l3779M495m570j9981j1406
12030c2418J3450m141J3749k2798q749K4936J7376M778K8133L743k67j1909n0207
12017b4324j4215O365J5007j4911K3441L2240J6287j331k8637l0346j3171k255
$$ plain form
12105 -40655 -17117 -19857 -10754 16269 39325 53357 47503 406 -18944 -36473 -55178 -55583 -17236
12092 -17236 -20696 -73797 -86474 -103262 -114476 -123471 -91187 -40543 12049 55632 31015 -1088
12080 -1088 -11662 -66536 -23560 40322 27787 37749 50093 53078 37108 39479 60484 36955
12068 36955 39053 26485 -12301 -48205 -29687 -36430 -44169 479 -12459 37902 51448 6628
12056 6628 -10483 -19550 -31824 -26149 -9541 -14623 -41405 -37711 -12840 -10054 -25467 3492 10861
12043 10861 -16288 -19842 -1821 -9277 -8327 -6418 19471 32823 -956 3539 -1031 -21012 -32418
12030 -32418 -18968 -23109 -9360 -32158 -40907 -15971 1405 6183 34316 38059 37792 25883 -24324
12017 -24324 -38539 -32174 -17167 -32078 -8637 23603 39890 38559 9922 -20424 -33595 -35850
12005c5850p18m757r030j2227r55K1835L795n6671n732r94M4330O6206M0823j1118
11991C8937j5226j4340k4092n697L3846n781o0707j1925M5366J0831j3518k9735
11979e2041L3700Q689j9713Q96K1188M609j655k5795N050L0021L5868j1341N1051
11966H0527K8311k3883j7671l4607k6206L358j2209j9096K7098L4068o351m6098
11954a2759n3889L190r535j1533L6965q835M0836L4719J893M926L2684k0306J4450
11941E2806j8998n4000J8182O118n7479k2043K6426j0869l2846J2876J2200J3828
11929e3799k2787J1086r554l717P251Q199k1607J4229L6057m062n4652J8565N5237
11916a9554K668k1950J3578J7140J8963p375n277k6312j1166j937j8772j3381
$$ plain form
12005 -35850 -36568 -41325 -50355 -62582 -63537 -41702 -37907 -94578 -100310 -101304 -56974 9232 50055 38937
11991 38937 23711 9371 -14721 -20418 13428 7647 -53060 -64985 -19619 -8788 -22306 -52041
11979 -52041 -18341 -9652 -29365 -28469 -7281 -2672 -4327 -30122 -25072 4949 40817 29476 80527
11966 80527 108838 84955 67284 32677 6471 9829 -2380 -21476 5622 39690 33339 -12759
11954 -12759 -66648 -63458 -72993 -84526 -47561 -56396 -15560 19159 21052 25978 58662 38356 52806
11941 52806 33808 -20192 -2010 4108 -53371 -75414 -48988 -59857 -92703 -79827 -67627 -53799
11929 -53799 -76586 -65500 -75054 -78771 -71520 -63321 -84928 -70699 -34642 -38704 -93356 -74791 -19554
11916 -19554 -16886 -38836 -25258 -8118 10845 3470 -1807 -28119 -39285 -41222 -59994 -73375
11904g3375K0834L6829L8415j6157l1206O886L3197J424l2006M8339K3409l0308
11892B6281N084l1043j3946j5287J63O250k1996o259M646L5134j575k5160J8090
11879a9618k1248J6331M0247m1641M387p75j1881j2833K3604q68K3681O285K636
11866H307q741m390j4541j1414j760K7033J1423j5350l1583J2890j6369j0911
11854e5406K4626j0287j8709j701K2408J4564K4247L386k5494k2016J0826O071
11842b7485k6037n3098J2476L0911N0823L1059l128K8769l0293n1910m0281J5785
11830f2409L4472L0141L4926J6096q838l2336k1396j696K3357K3736k0944p2685
11818e7576J7714K9546J0252k8274j0383j2154K6089J459M5762Q482j4985k5935
$$ plain form
11904 -73375 -52541 -15712 22703 6546 -24660 -17774 15423 16847 -15159 33180 56589 26281
11892 26281 31365 322 -13624 -28911 -28748 -22498 -44494 -50753 -46107 -10973 -12548 -37708 -19618
11879 -19618 -40866 -24535 15712 -25929 -21542 -22317 -34198 -47031 -23427 -24295 -614 5671 8307
11866 8307 -434 -4824 -19365 -30779 -32539 -5506 5917 -9433 -41016 -28126 -44495 -55406
11854 -55406 -30780 -41067 -59776 -61477 -39069 -24505 -258 3128 -22366 -44382 -33556 -27485
11842 -27485 -53522 -106620 -94144 -63233 -12410 18649 15521 44290 13997 -37913 -78194 -62409
11830 -62409 -27937 2204 37130 53226 44388 12052 -9344 -11040 12317 36053 15109 -57576
11818 -57576 -39862 -10316 -64 -28338 -38721 -50875 -24786 -23327 22435 30917 15932 -10003
11806a0003l7900r286r593r761N1305J0303j7474J43L185k7142M9059L7677n378
11793B5135J0451k6727J374j0137R519j787K9116N175o0989j2421J8967l4247
11781d6571n696P1209L5040l7944m0513J1313O976R271R246Q027O52J9861p281
11768C3590j7079l3428n6993J6569P405J0182J8701J4293K1701R670j1869j3805
11756a063m0668Q024K7184j1704L522K7960K8353m8095j9613L6646P207j6065
11744A688k4939m77J8652K6839k0180m9635j143L4247l1710k0481O3687O1465
11732E8013J1018R103l913N356p9434n0667J803O0562K7400R68j7956K2969L2531
11719G7753J28k5255N463l36n7483k5256K3631N026j5670L2700J0923r258J988
$$ plain form
11806 -10003 -47903 -57189 -66782 -76543 -25238 -14935 -32409 -32266 -29081 -56223 -7164 30513 25135
11793 25135 35586 8859 10233 96 9615 7828 36944 42119 -18870 -31291 -12324 -46571
11781 -46571 -52267 18942 53982 16038 -24475 -13162 -6186 3085 12331 20358 21010 40871 33590
11768 33590 16511 -16917 -73910 -57341 -49936 -39754 -21053 -6760 14941 24611 12742 -1063
11756 -1063 -41731 -33707 -6523 -18227 -14705 13255 41608 -6487 -26100 10546 17753 1688
11744 1688 -23251 -23728 -5076 21763 1583 -48052 -49195 -14948 -46658 -67139 -3452 58013
11732 58013 69031 78134 74221 79577 143 -50524 -48721 11841 39241 40209 22253 45222 77753
11719 77753 77881 52626 58089 57753 270 -24986 -1355 3671 -11999 20701 31624 22366 24354
11706B4354j5996K166M2523K363j3990M668K0635j5867m5379J816j1073l209M5989
11693C9000j4901k3016L983m1095r037Q917O2470M7529p996j9334P221l348m1458
11680H935J0592Q746k087K4494j0241L6478k9860p1558o451R937R069k748J0088
11667d606l0683j4565L7288L0921o152j8121j0953k8968o471Q529N1313j2613
11655e081j6912k9012N981K1920j987L6484k983J2710K4579m6207n2076J4642
11643c7942l583j3122M3391J6291m9327p5708K6343M5066j754k9804q768K7096
11631f1821L7496R112L2210Q43m0597j27j4991p630L9486O3797j0236n3235l0206
11618c5899J7960K6435j3853K6723p104J6496j9048O005N419k2423m325j000J8962
$$ plain form
11706 24354 8358 10524 53047 55410 41420 46088 66723 50856 5477 7293 -3780 -6989 39000
11693 39000 24099 1083 5066 -36029 -45066 -36149 26321 73850 65854 46520 53741 50393 8935
11680 8935 19527 28273 26186 50680 40439 76917 47057 -24501 -30952 -21015 -11946 -14694 -4606
11667 -4606 -35289 -49854 -12566 18355 12203 -5918 -16871 -45839 -52310 -43781 7532 -5081
11655 -5081 -21993 -51005 -45024 -23104 -25091 11393 8410 21120 45699 -508 -52584 -37942
11643 -37942 -41525 -54647 -11256 5035 -44292 -120000 -93657 -48591 -50345 -80149 -88917 -61821
11631 -61821 -24325 -15213 16997 17840 -22757 -22884 -37875 -45505 -6019 57778 47542 -5693 -35899
11618 -35899 -17939 8496 -5357 21366 14262 30758 11710 17715 23134 711 -3614 -4614 14348
11605A4348p862n0040k4131k6100K0677N6355L2669k1708M6956M3779o0298j00669
11593g6024J2206K9232K8249l8195o885M4042O342j4949k8288k757J247L4300
11581a1480J9553n933j3667L0980J272k9834p454J6265O973j2075J4514q984l4302
11568c4172j3189J4465M1024J5490m8365j5004L4641J3519J5842o443J2528j7603
11556A2733m5851m956J8021Q404L7476K4730l0153n4983m116L3178K6979O282
11544B7744k8920M214n245m8831O290p897L4894L4329l6805J3568K8150M10o975
11531A4926l0037Q258O359j4464J6966J479J5574K5396j1999j8683j5178k932
11519d335K9277k1849m1537j339j0059J2141M3572K809k9J0748j0463O945L3024
$$ plain form
11605 14348 6486 -43554 -67685 -93785 -73108 -16753 15916 -5792 41164 84943 24645 -76024
11593 -76024 -63818 -34586 -6337 -44532 -51417 -7375 -1033 -15982 -44270 -47027 -45780 -11480
11581 -11480 8073 2140 -11527 19453 20725 -9109 -16563 -298 6675 -5400 9114 130 -34172
11568 -34172 -47361 -32896 8128 23618 -24747 -39751 -5110 8409 24251 17808 30336 12733
11556 12733 -33118 -38074 -20053 -11649 25827 50557 20404 -34579 -38695 -5517 21462 27744
11544 27744 -1176 3038 -2207 -51038 -44748 -52645 -17751 16578 -20227 -6659 21491 21901 14926
11531 14926 -15111 -6853 -494 -14958 2008 3487 19061 44457 32458 13775 -1403 -4335
11519 -4335 24942 3093 -38444 -39783 -49842 -37701 5871 8680 8651 19399 8936 15881 48905
11506D8905j0789n2377L0840K8447J1144k5889R932L3177l2463o9700m5672J5832
11494e8613K5618N0023L7007J3398K1739J057p4213m0369J0932L1799J9528k2614
11482A5292K6734n074l6325n2981l5206k6090J0662M1108L0531L0027O137k0564
11470a5749O173j85M534L4447L2494j8649m7945j4007J0993J3467L9627k3855
11458B1345K4216M4365l4379k5316N680k6297N933k0144k9431K689J4958k298
11446a8679J1589L2834j4154m138k1998k3740k5403M2342M3630J1762q519l7985
11434a2459n717K3104j1764N1906L9445R377j2168r466l2120m2416L925n6346
11422e4699j8111N5788J1015K9486J0488k5875k7335K5944N7553l6992k3285J6976
$$ plain form
11506 48905 38116 -14261 16579 45026 56170 30281 40213 73390 40927 -28773 -74445 -58613
11494 -58613 -32995 17028 54035 67433 89172 90229 16016 -24353 -13421 18378 37906 15292
11482 15292 42026 36952 627 -52354 -87560 -113650 -102988 -61880 -31349 -1322 4815 -15749
11470 -15749 -9576 -9761 -5227 29220 61714 43065 -4880 -18887 -7894 5573 45200 21345
11458 21345 45561 89926 55547 30231 35911 9614 15547 -4597 -34028 -31339 -16381 -18679
11446 -18679 -7090 25744 11590 7452 -14546 -38286 -63689 -21347 22283 34045 25526 -12459
11434 -12459 -18176 4928 -6836 45070 84515 93892 81724 72258 40138 -2278 1647 -54699
11422 -54699 -72810 -17022 -6007 23479 33967 8092 -19243 6701 64254 27262 3977 20953
11410B0953J8083k470J1628j0621o2609K765j1054m6265r950J7518K6134K9580
11398a6308J0045K9843k6970M085L6059j788L400K146L8444m2903m3410k2304
11386b9661K4767M3336K5052R495l5258j3573q046J59j2442J2137m269n1022K4231
11373a5094K0725K7174j2005o0570j9607M5883l7730J4769J5688j8313L5764O038
11361B722J1293K7177J9826J0419l3042n286M749j6121k0836m632m305k5482J3266
11348b0252M9335J282J0137j4833m1673j8615j1802k8313j258M2431P6260J1779
11336E4478k1206k6591P755j4455K6423K6654l0677j489J3369j6409l295L3429
11324D7986J3145k7157K1015j6394l6117K081K9841L2364K0705l4822l3627j0932
$$ plain form
11410 20953 39036 36566 48194 37573 -25036 -22271 -33325 -79590 -89540 -72022 -45888 -16308
11398 -16308 -6263 23580 -3390 695 36754 34966 38366 40512 78956 36053 -7357 -29661
11386 -29661 -4894 38442 63494 72989 37731 24158 16112 16271 3829 15966 11697 -39325 -15094
11373 -15094 5631 32805 20800 -39770 -59377 -13494 -51224 -36455 -20767 -39080 -3316 2722
11361 2722 14015 41192 61018 71437 38395 33109 37858 21737 901 -3731 -8036 -33518 -20252
11348 -20252 29083 30365 40502 25669 -16004 -34619 -46421 -74734 -75992 -33561 42699 54478
11336 54478 33272 6681 14436 -19 26404 53058 22381 20892 34261 17852 14557 47986
11324 47986 61131 33974 54989 38595 2478 4559 34400 66764 87469 52647 19020 8088
11312H088L9158K5503M4532L390q8256K5054J9607J361j8680M573j5525L0855
11300G9660n0157k4902L3673P8068J05258N9386J01959K68277J83735N1457J07957
11289I94371J1269j34639j65417k01087j71868j31579q2470r3015m3921J6767
11279a589K3678l5216j0313K3j1635J9052M1770k0342j353M7944n6319K818L1204
11266B9722Q369l2456k1212R766k5920K9241J5009L1737k8009j8671k8050m882
11254c5356J3323M1571p464m6589k2901k0032K9717o806j0431K9713N1949J8869
11242C5563j3724k4789k6067O995L737P3579N8951r0650p5581j9082K2258K0042
11230b8768k1634q256N314J1975N2306O945J1901K810j3795L8811L8292J4794
$$ plain form
11312 8088 47246 72749 117281 120671 32415 57469 77076 78437 59757 64330 48805 79660
11300 79660 29503 4601 38274 116342 221600 280986 382945 651222 834957 886414 994371
11289 994371 1005640 871001 705584 504497 332629 201050 118580 25565 -18356 -1589
11279 -1589 22089 -13127 -23440 -23417 -35052 -16000 25770 5428 4075 52019 -4300 -1482 29722
11266 29722 38091 5635 -15577 -5811 -31731 -2490 12519 44256 16247 -2424 -30474 -35356
11254 -35356 -22033 19538 12074 -34515 -57416 -77448 -47731 -54537 -64968 -35255 16694 35563
11242 35563 21839 -2950 -29017 -22022 -18285 55294 114245 23595 -51986 -71068 -48810 -28768
11230 -28768 -50402 -58658 -53344 -41369 10937 17882 29783 32593 18798 57609 95901 110695
11218A10695j9034r873k0539k4791k8963l2881k0539m268K2667K3514j120j7430
11206b2562L0435p390L0919J2619o3454p995N29l4598J2444K7074J9323J5052
11194A2396J7573L0927N3318M203l8711o453R638k310Q376M2457M8915N9178Q2329
11181C21836J46052J64111P4720L2369R9371P0971o5025j61944j34789j50506
11171C97166j35246q0046q4544q328L0690k3817L415l4906k0685j6689k553l2433
11159g976j595M4213q55k3556J1247L858N1845k5949P927J954p419n1082l2697
11146c0085p263K5961J3886o565l117k2469n1364J4120K2371K4050K1684O3099
11134F4308O251O98j1932k7660k0736k0043q450J3785l3979J2966L2637J3023
$$ plain form
11218 110695 91661 81788 61249 36458 7495 -25386 -45925 -50193 -27526 -4012 -5132 -22562
11206 -22562 7873 483 31402 44021 -19433 -27428 -26899 -61497 -49053 -21979 -2656 12396
11194 12396 29969 60896 114214 118417 79706 73253 82891 80581 88957 131414 180329 239507 321836
11181 321836 467888 631999 706719 739088 838459 909430 844405 682461 547672 397166
11171 397166 261920 181874 97330 89002 119692 95875 99290 64384 43699 27010 24457 -7976
11159 -7976 -9571 34642 33787 10231 21478 25336 77181 51232 59159 61113 53694 2612 -30085
11146 -30085 -37348 -11387 2499 -4066 -7183 -29652 -81016 -66896 -44525 -20475 1209 64308
11134 64308 70559 71257 59325 31665 10929 -9114 -17564 -3779 -37758 -24792 7845 20868
11122B0868P222k5138J2857j0177n464O955k2895m3956m8233j3675p519J1277
11110a17878M9470L1893M3715k5923l0494j1364J9023K0965n633J1793K6355n34
11098A1388j0621j3432L948k5964L3758L1971J693K2602l6765o4996j4604K0253
11086d0769k5610J476K8179N7086P294j999J7642k1762k2757n782K6345K7386
11074D6729l1804M186K9469K697l9867r056m2139r964k5192K1743M1384M2645
11062C0831q571k4751K3347K2316p757r036m0121j2348J3285k1356J6988K4787
11050G614j0156n406j3073r196L4272K4075K640k9037P154R541K9607j0009k0278
11037A7748J7873J9271m9073J5802J2428J0818k3787j0073J486k9311K42J4925
$$ plain form
11122 20868 28090 2952 15809 5632 168 7123 -15772 -59728 -107961 -121636 -129155 -117878
11110 -117878 -68408 -36515 7200 -18723 -49217 -60581 -41558 -20593 -26226 -14433 11922 11388
11098 11388 767 -12665 -8717 -34681 -923 31048 32741 55343 18578 -46418 -61022 -40769
11086 -40769 -66379 -64903 -36724 20362 27656 25657 43299 21537 -1220 -7002 19343 46729
11074 46729 14925 19111 48580 51277 11410 2354 -39785 -49749 -74941 -53198 -11814 30831
11062 30831 22260 -2491 20856 43172 35415 26379 -13742 -26090 -12805 -34161 -17173 7614
11050 7614 -2542 -7948 -21021 -30217 4055 28130 30770 1733 8887 18428 48035 38026 17748
11037 17748 35621 54892 5819 21621 34049 44867 21080 11007 12493 -16818 -16576 -1651
11025a651m9884K0437N2088o162r356l613j435P807j1605J0868L7081O639j1961
11012C9253k4916P183K6250m4370l5026K1535L4408j407j994J2953l9697k6020
11000c1848j2659J7331K0367M8290n451o0638M645J555P213l416k5866J0379K0788
10987i310K399m9065K5303L6396L5364j0537k2926l1837L2184J0164j6978K257
10975C414j4086r723j0010p809J0961J2061J4731K1496l350k9670n969J0921M003
10962c030o647K5448J6752n822M8977p578l4802n3744k2907j0908K1403J2027
10950b0831J2037J880q952n426j7318J6854p800K8589r827j3543j6539O254K1338
10937a3284L0609M1662r735l9255J7510L0138l5713l8625M6877M7613Q023l1723
$$ plain form
11025 -1651 -51535 -31098 20990 14828 5472 1859 424 8231 -3374 7494 44575 51214 39253
11012 39253 14337 21520 47770 3400 -31626 -10091 24317 22910 20916 33869 -5828 -31848
11000 -31848 -44507 -27176 -6809 41481 36030 -24608 -19963 -18408 -11195 -14611 -40477 -30098 -9310
10987 -9310 -6911 -55976 -30673 5723 41087 30550 7624 -24213 7971 18135 1157 3414
10975 3414 -10672 -20395 -30405 -38214 -27253 -15192 -461 21035 17685 -11985 -17954 -7033 -3030
10962 -3030 -9677 15771 32523 26701 75678 68100 33298 -20446 -43353 -54261 -32858 -20831
10950 -20831 -8794 -6914 -15866 -21292 -38610 -21756 -29556 -967 -10794 -24337 -40876 -34622 -13284
10937 -13284 17325 58987 49252 9997 27507 57645 21932 -16693 30184 77797 85820 54097
10925E4097r650k868l0165l5850l8990N7653K3895j3323l23j659j4891k764o277
10912b1115L2543K3766m161k3612j5531M792j1923k7067r360k8895k7203R014
10900i8752J9504K3224J5240J1017K6718q360k4885K21k597K2488J5484k9026
10888b9724J737J9480k7974L961K3371r930J59o66L1788l55J1591Q904j2620l693
10874A6029J7896j0296J5561k7447n7071l5238J8147k6235O943J9120K832K9843
10862b9916P0050N6334l803k5361k5080R648k4488n9297J5296M0758J5594j1282
10850B8453j4432J99J7298j1167k2811o606m8527o390j4277l8350L3051N8610
10838b4949J7587M7538L6638K475n2849j2640j7771k3582L6507m002l2081j2061
$$ plain form
10925 54097 44447 41579 11414 -24436 -63426 -5773 18122 4799 4476 2817 -12074 -14838 -21115
10912 -21115 11428 35194 31033 7421 -8110 -3318 -15241 -42308 -51668 -80563 -107766 -98752
10900 -98752 -79248 -56024 -40784 -29767 -3049 -11409 -36294 -36073 -38670 -16182 -698 -29724
10888 -29724 -27987 -8507 -36481 -32520 -9149 -19079 -18920 -19586 12202 11847 23438 32342 19722 16029
10874 16029 33925 23629 39190 11743 -45328 -80566 -62419 -88654 -81711 -62591 -59759 -29916
10862 -29916 40134 96468 92665 67304 42224 51872 27384 -31913 -16617 24141 39735 28453
10850 28453 14021 14220 31518 20351 -2460 -9066 -57593 -63983 -78260 -116610 -83559 -24949
10838 -24949 -7362 40176 76814 79289 26440 13800 -3971 -27553 8954 4952 -27129 -39190
10826c9190k981J7853J42K2437N5681m0537m7526j2844l08O2067M1242k1241k0166
10813A4629j7279p342k0217m1053r758J6773o693N0923K2608M1169K00J1912J4755
10800G0627P780J437J3169j0891o8700q1737j3702M0909O0399m560j2788L004
10788D947J3565k2510l5739L0752K4179M493k1847n278k4056m451O718k1273m443
10775e4943l3105K5711N9178J0145K2801J9864J7523k5725j6787j5575k0886K8698
10763A6899L1001m644n0152p6203M1007L5335J8483K0384k4230L5816M0824J3084
10751I7604j7009m9628L019k3801k5065k1846L6664J1443r315n7003K2532P2709
10739D0304J8964k0820k3430J2955k5720k4266n88J1843J9119k4551l8767J4905
$$ plain form
10826 -39190 -42171 -24318 -24176 -1739 53942 13405 -34121 -46965 -47273 14794 56036 34795 14629
10813 14629 -2650 -9992 -30209 -71262 -81020 -64247 -70940 -20017 2591 43760 43960 55872 70627
10800 70627 78407 79844 93013 82122 13422 -68315 -82017 -41108 19291 14731 1943 4947
10788 4947 18512 -3998 -39737 -8985 15194 19687 -2160 -7438 -31494 -35945 -29227 -50500 -54943
10775 -54943 -88048 -62337 -3159 6986 29787 49651 67174 41449 24662 9087 -11799 16899
10763 16899 47900 43256 -6896 -83099 -42092 -6757 11726 32110 7880 43696 84520 97604
10751 97604 80595 30967 33986 10185 -14880 -36726 -62 11381 2066 -54937 -32405 40304
10739 40304 59268 38448 15018 27973 2253 -22013 -22601 -10758 8361 -16190 -54957 -40052
10727d0052M7598N0402K4743k9432m444k2389J3026K3896k3309n7717j3238R654
10715b1262p433j2960j586O550L7561L611j9124M331R28k532j6172L192l4528
10702e9424k4309j3201L4566K4264M251k7563L8525L3536L136k8820l351K279
10690a6111L867J7975M05K5850l5210m1838q557J1631L2107N2652j2280q270l3179
10677a0958k023L8676K7511j754k7169j1962L5529l392J7046n8576m0826j6594
10665e4492J3881J3702N2878J7854N105j0864k5119j5412l8802M8517M1929m27
10653D8750k4187k0367j6291k2358k5743k2663J0443p232K8949M7415j8918K0988
10641a214M9390l0140l4217r88k9118J2828L8690k6273K5991J8456l009j5070
$$ plain form
10727 -40052 7546 57948 82691 53259 48815 26426 39452 63348 40039 -17678 -30916 -21262
10715 -21262 -28695 -41655 -43241 -36691 870 4481 -14643 -10312 -9384 -11916 -28088 -24896 -59424
10702 -59424 -83733 -96934 -62368 -38104 -33853 -61416 -22891 10645 13781 -15039 -18390 -16111
10690 -16111 -12244 5731 6136 31986 -3224 -45062 -53619 -41988 -9881 42771 30491 22221 -10958
10677 -10958 -12981 25695 53206 51452 24283 12321 47850 44458 61504 2928 -37898 -54492
10665 -54492 -40611 -26909 25969 43823 48928 38064 12945 -2467 -41269 7248 49177 48750
10653 48750 24563 4196 -12095 -34453 -60196 -82859 -72416 -79648 -50699 -3284 -22202 -1214
10641 -1214 48176 18036 -16181 -17169 -46287 -33459 5231 -21042 4949 23405 20396 5326
10629E326l4796R495l663o8157N2732K8519J6347K3289J9049l1410l3344k5567
10617d2180M885L4564M8657L5102j2408m6564k3567J3930L3437l2027l4917O028
10605a5060J0912J7728j8985r967J0401N724J0776l1468j7985J6273Q788l6579
10593d9442K8353K3169q117j6287J4666N124j1012m80m5042m8309q88O377K9159
10580g2729L4182l201j0187k954J9602J2861m569J9098O060o585j6826P321p60
10567a8687K6090M3849P143m5668l4775q05j605k349N554K443K7073K4159M8918
10554H1340K377m2842m2590k169Q042k76n7298n4878P201N2667M2504j707j6587
10541b4216j9674J5916J6003m556k1667O848O2304P679k2157k9337j6587K3775
$$ plain form
10629 5326 -29470 -19975 -23638 -91795 -39063 -10544 5803 29092 48141 16731 -16613 -42180
10617 -42180 -37295 -2731 45926 81028 68620 22056 -1511 12419 45856 13829 -21088 -15060
10605 -15060 -4148 13580 -5405 -15372 -4971 753 11529 -19939 -37924 -21651 -12863 -49442
10593 -49442 -21089 2080 -6037 -22324 -7658 -2534 -13546 -14026 -59068 -107377 -108265 -101888 -72729
10580 -72729 -38547 -41748 -51935 -54889 -35287 -22426 -26995 -7897 -1837 -8422 -25248 -17927 -18687
10567 -18687 7403 51252 58395 12727 -22048 -22853 -24458 -26807 -21253 -18810 8263 32422 81340
10554 81340 83717 40875 -1715 -3884 4158 3882 -53416 -108294 -101093 -48426 -5922 -7629 -24216
10541 -24216 -43890 -27974 -11971 -16527 -38194 -31346 30958 38637 16480 -12857 -29444 -5669
10529e669Q707m1444k0699j7813p675O560R3860L6110j1999J2824k0406l9503
10517g147L770J5565J5781j5692j2985Q391n6730j9237Q132L6353P115o765J5750
10504g699M4138K942l9846M202K65m032J9736q562p578m574L8979P099j6099j6880
10490A2091m83k5559K4745K4685j3672J449m6609j7491K7713M164N9559N1410
10478A02002l9589o7502j8317J2586k870j3194l1636K4357l4060j1189J7149N0872
10466a1391K8868m7405K6225K1875l7790Q070K8609L1881n1546O741M27J3512
10454A8076j7689m5938n971J0432L4079O0566N756k4067n384K6812m3095m829
10442H748j4569Q87J3776J0453R633N6119p496o9440j045N397P84j870k696j3898
$$ plain form
10529 -5669 3038 -38406 -59105 -76918 -84593 -78033 15827 51937 39938 52762 32356 -7147
10517 -7147 -3377 12188 27969 12277 -708 7683 -49047 -68284 -60152 -23799 -16684 -23449 -7699
10504 -7699 36439 39381 -465 3737 4002 -30 19706 11144 3566 -1008 37971 45070 28971 12091
10490 12091 11608 -13951 10794 35479 21807 23256 -23353 -40844 -13131 -8967 50592 102002
10478 102002 62413 -5089 -23406 -10820 -13690 -26884 -58520 -34163 -68223 -79412 -62263 -11391
10466 -11391 17477 -29928 -3703 18172 -19618 -11548 17061 48942 -2604 4137 4564 18076
10454 18076 387 -45551 -51522 -41090 -7011 53555 59311 35244 29860 56672 13577 8748
10442 8748 -5821 -4934 8842 19295 28928 85047 77551 8111 7066 12463 13247 11377 8681 -5217
10428e217m9648k3252J3387J4240J9745J613J5700J7130J4146j0643J1515k3613
10416d897l9584L2590J9227k7454k2457k6155M1100P3039O546N1936j7519M161
10404I0533j5283l4824k6608l8102k3677M4709J9511r795l2069l3582J0135M763
10392d4289q533K8131L1135l5429m4266k723j0673K8161L840J1196P167J5269
10380b1014M1639P898Q196n689j9033j8688m0438p65J3186J2320K1933L5118j0306
10367B4357j9527j9469m124K3276M3629O305k9795k733O13j6861J9002L0050J5100
10354F9823j4118q729L234k4008J2259j3129P173M1564N9675k9711o0455k8825
10342A4753N798K1903L2618l348q5357m2981J5304J2084Q366l0023L9373K8446
$$ plain form
10428 -5217 -54865 -78117 -64730 -50490 -30745 -29132 -13432 3698 17844 7201 18716 -4897
10416 -4897 -44481 -11891 7336 -20118 -42575 -68730 -27630 45409 51955 103891 86372 90533
10404 90533 75250 40426 13818 -24284 -47961 -3252 16259 6464 -25605 -59187 -49052 -44289
10392 -44289 -52822 -24691 6444 -28985 -73251 -75974 -86647 -58486 -54646 -43450 -36283 -21014
10380 -21014 20625 28523 36719 31030 11997 -6691 -47129 -47894 -34708 -22388 -455 34663 24357
10367 24357 4830 -14639 -18763 4513 48142 54447 24652 21919 22532 5671 24673 54723 69823
10354 69823 55705 46976 50210 26202 38461 25332 32505 74069 133744 104033 43578 14753
10342 14753 20551 42454 75072 71724 -13633 -56614 -41310 -29226 -20860 -50883 -11510 16936
10330A6936L4771k150J000j4242k7581j9180k58J8802J3161m804k0278j2549K6654
10317A0282K0684N648L4901j339k0145p8236P476J3994l8230l2807L3485O2809
10305A8522L4818o481K895k1796n654K8586p810m1635l5032k3142O5517L4705
10293D3493m898m1786k8626L227L7091j1808K9323L94j6973J2465Q811n3587q600
10280c1474L4116j5062j7991j2857L8287K7299K9935o708k5568J8247j0171j9844
10268H209j1933L8842l289l4156J4676j2730p399J3962K4148j198j9678J8831
10256B8285L278n208K2086j0743p5446k1796Q809L3008R538M0956o230k2137k0750
10243a6350J201J3695J4533M324K5511M069k3366l200j1979j6490R033l0009Q574
$$ plain form
10330 16936 51707 49557 50557 36315 8734 -10446 -10704 8098 21259 16455 -3823 -16372 10282
10317 10282 30966 36614 71515 70176 50031 -28205 -20729 -6735 -44965 -77772 -44287 18522
10305 18522 53340 46859 49754 27958 22304 50890 43080 1445 -33587 -56729 8788 43493
10293 43493 38595 -3191 -31817 -28590 8501 -3307 26016 26410 9437 21902 30713 -22874 -31474
10280 -31474 2642 -12420 -30411 -43268 -4981 22318 52253 45545 19977 38224 28053 8209
10268 8209 -3724 35118 31829 -2327 12349 -381 -7780 6182 30330 29132 9454 28285
10256 28285 31563 26355 48441 37698 -37748 -59544 -50735 -17727 -8189 32767 26537 4400 -16350
10243 -16350 -15149 -1454 13079 17403 42914 46983 23617 20417 8438 -8052 981 -29028 -20454
10230b0454K7406M9032m035r617m8296q100N4191r509l8911P6681J0289j6522
10218F2155K1450k929l7087l5999n299k5521j6460L6242L7098l9577l7843K8756
10206a5014m782K684K3119j7520r713M487L1559k127J4257K3048k6302m2353M871
10193a3786mL1224J5525p189j7507R289l6524m4516L6491K6922o227J3461K486
10180I645l3998N3583R1m1183Q229j6070l3863M6836Q1977K3280j2559l2155l9350
10167A4463j2124M878l489q119k0934P137J0801o155j5323J5599M9403j3582P374
10154B9929K882P611j6879M4j7364j8031K0518J9575k5266J1433K5055j3568J8473
10141D4412M929K0179m4209o123J872l9149l5316J9043J2231J6507O7380K2094
$$ plain form
10230 -20454 6952 55984 51949 42332 -5964 -14064 40127 30618 -8293 68388 78677 62155
10218 62155 83605 80676 43589 7590 2291 -23230 -39690 -3448 33650 -5927 -43770 -15014
10206 -15014 -19796 -17112 6007 -11513 -21226 -16739 14820 12693 26950 49998 23696 -18657 -13786
10193 -13786 -13790 17434 32959 25770 8263 17552 -18972 -63488 -26997 -75 -6302 7159 9645
10180 9645 -24353 29230 29321 -11862 -3633 -19703 -53566 -6730 75247 98527 85968 53813 14463
10167 14463 2339 7217 3728 -4391 -25325 -18188 -7387 -13542 -28865 -13266 36137 22555 29929
10154 29929 32811 40422 23543 23587 6223 -11808 8710 28285 3019 14452 39507 25939 44412
10141 44412 49341 69520 25311 19188 21060 -18089 -53405 -34362 -22131 -5624 61756 83850
10129H3850k4398k3606l3567k602J737J7778J853k0336k55K1013k9345k2329J6002
10116a4205P533N964N764k3539m2681L391K003j3446N246K1312J7474l0954J3535
10103d2603J0488p068J7135J6289m5976m531K9305J9912J3313k1793o375m825
10091b6729p234j2263k631M695Q822K9059K972o131k2841R96Q8086N9342k881
10078A13262l4958q318l2950k203l3335r205k6728r418K5229L6019j3213k0457
10066a6275k6027K5214L1649J0657L5186k771l0138j3412j0561j7682J0756Q965
10054E561J0937R846j5399P859j9617l5927K0738N9464k00n3627L5432R871m1870
10041f932j9615L048M0405l1303k6234K5056j5084l3897l4184P689J3798J6515
$$ plain form
10129 83850 59452 35846 2279 -323 1414 19192 21045 709 454 21467 -7878 -30207 -14205
10116 -14205 -6672 -708 5056 -18483 -61164 -57773 -55770 -69216 -63970 -42658 -25184 -56138 -42603
10103 -42603 -32115 -39183 -22048 -5759 -51735 -56266 -26961 -7049 6264 -15529 -21904 -26729
10091 -26729 -33963 -46226 -48857 -44162 -35340 -6281 -3309 -9440 -32281 -31285 56801 116143 113262
10078 113262 78304 69986 37036 34833 1498 -7707 -34435 -43853 -18624 17395 4182 -16275
10066 -16275 -42302 -17088 14561 25218 60404 57633 27495 14083 3522 -14160 -3404 5561
10054 5561 16498 26344 10945 18804 -813 -36740 -16002 43462 43262 -10365 25067 34938 -6932
10041 -6932 -26547 -23499 16906 -14397 -40631 -15575 -30659 -64556 -98740 -91051 -77253 -60738
10029f0738M871l0120j3770N0067K5551J3295K4231j7515j801n834o578M87j3856
10016c1710O306n983k231l034K8866L7707K6509l185l7958k4702K1087J5497o821
10003B0348j2696k7906J1333O4641J6396j3320k2906L0498j4971p7574N1475K9332
9991E4650p877n9022j7075M2414L8910J3876l8029j7491L1332M2804l3922l6976
9979A3594k9894J7332K5192k6930j2733R187K9972n487k721J3321Q583K5902O320
9966G1638m6944K6308o502j6972L830N092n3148n582J4099k903l0819K390K1333
9953a8180K1743o957P157j1023k1331k665O9409J0313m0361k9666K6805N053j6379
9940f082J8338M3803p905k070p14k3362j3219Q05R835p663k0546j2680o6582N992
$$ plain form
10029 -60738 -55867 -85987 -99757 -49690 -24139 -10844 13387 -4128 -5929 -11763 -18341 -17854 -31710
10016 -31710 -25404 -31387 -33618 -36652 -7786 29921 56430 53245 15287 -9415 11672 27169 20348
10003 20348 7652 -20254 -8921 55720 72116 58796 35890 66388 51417 -26157 25318 54650
9991 54650 46773 -12249 -29324 13090 52000 65876 27847 10356 41688 84492 50570 13594
9979 13594 -16300 1032 26224 -706 -13439 -4252 25720 20233 17512 30833 39416 65318 71638
9966 71638 24694 51002 44500 27528 31358 36450 -16698 -22280 -8181 -11084 -41903 -39513 -18180
9953 -18180 3563 -3394 3763 -7260 -28591 -31256 38153 48466 8105 -21561 5244 10297 -6082
9940 -6082 12256 56059 48154 46084 45370 22008 8789 9594 19429 11766 -8780 -21460 -88042 -82050
9926h2050M0453Q998k1291k9230m2790q386N0415L8248N3342L4906J4644k5948
9914C1311k7380K1153L8928L5798O830l2318l6173j0236K7720p517o5405m0872
9902e8161L9705K8085K4682O500o281K0701N2335P484j6574m4812k0289N221q034
9889C0562r837j8645q246P649K9137j1252k787k827K6183p33l1171j8670j7581
9876b8218l4340K6941K7745M6193j4686j7618j7948N361M4370L0656M5089k0149
9864I3396o0128k6445j2481n100M6681P6388M5322j6859m7313k6380j0009j4790
9852D2282M038J336K6688j9362j9891j1813k5964K7840j7285J2095J4952J4067
9840D8983j1765n2363L1165M276J133L0636J9759L7625l8658p6954L749J8589
$$ plain form
9926 -82050 -41597 -32599 -53890 -83120 -125910 -134296 -83881 -45633 7709 42615 57259 31311
9914 31311 3931 25084 64012 99810 106640 74322 38149 27913 55633 48116 -17289 -58161
9902 -58161 -18456 9629 34311 40811 34530 55231 107566 115050 98476 53664 33375 38596 30562
9889 30562 20725 2080 -6166 1483 30620 19368 16581 13754 39937 39204 8033 -10637 -28218
9876 -28218 -62558 -35617 -7872 38321 23635 6017 -11931 -6570 37800 68456 113545 93396
9864 93396 33268 6823 -5658 -10758 35923 112311 157633 140774 93461 67081 57072 42282
9852 42282 46320 47656 74344 54982 35091 23278 -2686 25154 7869 19964 34916 48983
9840 48983 37218 -15145 16020 20296 21429 52065 71824 109449 70791 -6163 -2414 16175
9828A6175J7643j5425l3912k2270K8760J7666m0196j3807K9328L0082r64j2071
9816A009m217j4213J513M0021K6058m800l6752K7809L7021j7454l5906P630j2824
9803A4895j7842M121M837l205k961Q604O267n9734m4161R951M0966J3589N0637
9790B5964K3311L2512r072m849m3155n600l802J0395R453N585j2295m4558k0663
9777c6774j8116O055K0708K1828L5796k1372j9402J9567j7142K4642L3732k6201
9765B3321l0257j2445k6561L0410j7064k4451K8156J1589L3816j3273m7376K4400
9753a9735M087j6126r620J862p81O715L4228l6472p3240J5610P6350J2545L389
9740a188J3968n3591n73O5073L1744m9168m934j751j6705K8198K2662K2051k4791
$$ plain form
9828 16175 33818 18393 -15519 -37789 -9029 8637 -31559 -45366 -16038 14044 13080 1009
9816 1009 -3208 -17421 -15908 24113 50171 45371 8619 36428 73449 55995 20089 27719 14895
9803 14895 -2947 1174 6011 2806 -155 8449 14716 -45018 -89179 -79228 -38262 -24673 25964
9790 25964 49275 81787 72715 67866 24711 19111 15309 25704 35157 40742 28447 -16111 -36774
9777 -36774 -54890 -48835 -28127 -6299 29497 8125 -11277 8290 -8852 15790 49522 23321
9765 23321 -6936 -19381 -45942 -15532 -32596 -57047 -28891 -17302 16514 3241 -44135 -19735
9753 -19735 -15648 -31774 -41394 -39532 -40313 -33598 630 -35842 -109082 -93472 -17122 -4577 -1188
9740 -1188 12780 -40811 -41384 23689 55433 6265 1331 -420 -17125 11073 33735 55786 30995
9727C0995m6636k3976J2445K338r61j5690J4638N7478N5467K2014L4642l5534
9715A07220m2776o107P373k5879n997L6460j975k7540m498J4818m735l1797m5526
9702c0959m0510K9620K633K0251K7490k561k1148J3042K5825K972l6864m2694
9690e2903L2771R5125L0453m1693n6748j2015J6526j8497J5056K3199n441n5550
9678b9717M9905N9954J410n1260J737J0514L8392l4880l1439j3044J8935K2776
9666D3283n785j9060J1438J6850J2711P789j2808K558R377j1345O26K7854p353
9653G6135q878L9230j7635l1008l8065m7976j0305L3216L9576j5150R108N2783
9641H1031j3157n8463k4123K6782L0017l2641k0536n605j5491L4514O2723L0374
$$ plain form
9727 30995 -15641 -39617 -27172 -24834 -25795 -41485 -26847 30631 86098 108112 142754 107220
9715 107220 64444 58337 65710 39831 33834 70294 68319 40779 36281 51099 46364 14567 -30959
9702 -30959 -71469 -41849 -39216 -18965 8525 5964 -15184 -2142 23683 26655 -10209 -52903
9690 -52903 -20132 74993 105446 63753 7005 -5010 11516 -6981 8075 31274 25833 -29717
9678 -29717 20188 80142 81552 30292 32029 42543 80935 46055 14616 1572 20507 43283
9666 43283 37498 18438 29876 46726 59437 67226 54418 56976 66353 55008 55634 83488 76135
9653 76135 67257 106487 88852 57844 19779 -28197 -38502 -5286 34290 19140 28248 81031
9641 81031 67874 9411 -14712 12070 42087 9446 -11090 -16695 -32186 2328 65051 95425
9629I5425p029m8514m6653k4987j550J9947J73J1286K4971J0748J2035j792j292
9616D2768J362K767j0186n951j1682r853o679p103K161J7308n338K1899M981k5173
9602A1281m1553O491R232M746k1224K8990M5841J5006K0289l5997m4073M0585
9590C9614M27j1912J3075j9543J0868J7743r098L008r307q264j3165o74K4977
9577C7749L1769K440j3808M1090M3378p6171o7731j4342J5128J3712J0222m43
9565B2993K8338J6112o6489k8183R578J7466J7492k6385k3354J9796L993Q925
9553B82K3217K8027r053j0090l8494L261L2707j0236l6622j4914K4522k5519J0431
9540b2481j1009K3819m42J7135J8026L0789n976l516J92m2882k9537K8089N436
$$ plain form
9629 95425 88396 39882 -6771 -31758 -33308 -13361 -13188 -1902 23069 33817 45852 44060 42768
9616 42768 44130 46897 36711 30760 19078 9225 2546 -4557 -2396 14912 9574 31473 36454 11281
9602 11281 -30272 -23781 -14549 -9803 -31027 -2037 43804 58810 79099 43102 -971 39614
9590 39614 40041 28129 41204 21661 32529 50272 41174 44182 34875 26611 13446 12772 37749
9577 37749 69518 71958 58150 99240 142618 66447 -1284 -15626 -498 13214 23436 22993
9565 22993 51331 67443 954 -27229 -17651 -185 17307 -9078 -32432 -12636 -8643 282
9553 282 23499 51526 42473 32383 -6111 -2850 29857 19621 -17001 -31915 -7393 -32912 -22481
9540 -22481 -33490 -9671 -10113 7022 25048 55837 49861 46345 46537 3655 -25882 2207 7643
9527G643K1401r562k1150k8107J4007M2991n23k0425J2681J2579j9628J8120J7008
9514D7035M487K3090J746m0404n7669j2443l570R716K4009K6602L7081k7464j0563
9501B1653k5616J8205j1176J8476L7182J1487m0524k5598J6278n282L1191l617
9489D2659r824J553M7820M5844m630j0139J5517l511j0164l0458J0298K5473K6325
9476A46763k5356l0321P600m1261l7873M599K0762M2108N863l9138m7235K5885
9464C2396R196L1518N486j3696q728k3792L5594j1750j0340L4538P761j2295j0988
9451F4900L727J8103K1383k1089k3811l0283k402K716j8079K0455K925k2111m2554
9438b6120J2882M955K5521K6579K1132n2768j7520m935k6105J1146L3214J4246
$$ plain form
9527 7643 29044 19482 -1668 -29775 -15768 27223 26700 6275 18956 31535 11907 30027 47035
9514 47035 51522 74612 76358 35954 -21715 -34158 -37728 -28012 -4003 22599 59680 32216 21653
9501 21653 -3963 14242 3066 21542 58724 70211 29687 4089 20367 15085 46276 42659
9489 42659 32835 34388 82208 128052 123422 113283 128800 125289 115125 84667 94965 120438 146763
9476 146763 121407 91086 98686 57425 19552 24151 44913 87021 92884 53746 6511 32396
9464 32396 41592 73110 78596 64900 56172 32380 67974 56224 45884 80422 88183 75888 64900
9451 64900 68627 86730 108113 87024 63213 32930 30528 33244 15165 35620 38545 16434 -26120
9438 -26120 -13238 -8283 17238 43817 64949 12181 -5339 -10274 -36379 -25233 7981 22227
9426B2227j0950j959M3931L7658j2448m7211l4506J0088M4776l7714j3263N849
9414F478O975k6671q659j1865L082N47O311J0478J5068O463J5173O588M424m8360
9400a3968j2273R2447l2204p7298m1521J8025K2948k6645j9831O3549O2527L4011
9388F9767j3904L1458L7588p835l8310Q595J1260o860j4392r866L6394l0477p4868
9375a450N510J2711J0978L6609j9573n442O127J8194j7397J1277k4516R210M0617
9362H2855L7217K9515J7698k7802q0811j5573j8811k2257j1534k9550k2368M8707
9350a2714M4111M3446k3863L6268Q770M914J0581l1825k7505j9450k1611K0663
9338C1785L7093K5212k2209l0075j8324j702j7519q975K1396M2004k6010l4887
$$ plain form
9426 22227 11277 9318 53249 90907 78459 31248 -3258 6830 51606 13892 629 6478
9414 6478 13453 -13218 -21877 -33742 -30660 -30113 -23802 -13324 1744 8207 23380 29968 34392 -13968
9400 -13968 -26241 66206 34002 -43296 -84817 -66792 -43844 -70489 -90320 -26771 35756 69767
9388 69767 55863 87321 124909 117074 78764 87359 98619 91759 77367 67501 103895 73418 -1450
9375 -1450 4060 16771 27749 64358 44785 39343 45470 63664 46267 57544 33028 42238 82855
9362 82855 120072 149587 167285 139483 58672 43099 24288 2031 -9503 -39053 -61421 -12714
9350 -12714 31397 74843 50980 87248 96018 100932 111513 79688 52183 32733 11122 31785
9338 31785 68878 94090 71881 41806 23482 21780 4261 -4714 16682 58686 32676 -2211
9326b211j267K2771K0146r693k0437K3989K8881Q274p29k1539L65k4727k600J7149
9312C8372K8618o147k5128k1041K0178P270p37K4717m947l896n4321K9226J6885
9299D9049Q178J4755N7130o460o7k2459l1976n9973l6632K2097J3467l779Q204
9286A1534p646N900j2799l5523M2412M907k5535L43J8386L9798l0593j4020j6514
9273a9350J0704k466K0818j4022P380L4135L4204n138L881j8976j3739j519r963
9260B5949P421K5119J6805r76K2975L8500k9495o2348l8937J3122M8864J2935
9248G9934O507k1795j5449j4428j9087M4357m426k6225j4971M2942L4707j6307
9236G5759O291L0833o080N586k4097K3592K2066l2212R606k6905R562L18J1916
$$ plain form
9326 -2211 -3478 19293 39439 29746 9309 33298 62179 70453 69724 48185 48550 23823 21223 38372
9312 38372 66990 60843 35715 14674 34852 42122 41385 66102 61155 57259 2938 32164 49049
9299 49049 57227 71982 129112 122652 122585 100126 68150 8177 -28455 -6358 7109 3330 11534
9286 11534 3888 9788 -3011 -38534 3878 8785 -16750 -16407 1979 41777 11184 -2836 -19350
9273 -19350 -8646 -11112 9706 -4316 3064 37199 71403 66265 70146 51170 37431 35912 25949
9260 25949 33370 58489 75294 74318 97293 135793 106298 43950 5013 18135 66999 79934
9248 79934 86441 64646 49197 34769 15682 60039 55613 29388 14417 57359 92066 75759
9236 75759 82050 112883 106803 112389 88292 111884 133950 101738 111344 84439 94001 94319 106235
9223A06235Q742m8202j6422j0951P895O1414J9416n117n8351R389O3119L7187
9211A74354l1536k3998K855k4192j2860J3071J6895K2545O849L950K467m303m4805
9198A01292l8935J7137K378J336L3238j0462j8156n92J908l595k0912q10L4760
9185I8587K4194j3407n3379K1826l608L1260N5775j4662l8355K2152L2145K0035
9173A82563j4862j0228K4647j8582r643K3492J8940J3823k0142m54L2917L8249
9161B60720j9969j6747K4795q283j5679M5750j2600k1906l164J4534P776r529
9149B45698N2745L6666L0023K577J7690L0132M6624N0063K0043N1085N4605J9687
9137F57638M1831Q4257N8211J59101J78762J46077J59672J89155K76956L64512
$$ plain form
9223 106235 114977 66775 50353 39402 47297 108711 128127 123010 64659 74048 137167 174354
9211 174354 142818 118820 121675 97483 84623 97694 114589 137134 143983 147933 150400 146097 101292
9198 101292 62357 79494 81872 83208 116446 105984 87828 87236 89144 85549 64637 63827 98587
9185 98587 122781 109374 55995 77821 74213 105473 161248 146586 108231 130383 162528 182563
9173 182563 167701 157473 182120 163538 153895 177387 196327 210150 190008 189554 222471 260720
9161 260720 240751 224004 248799 240516 224837 270587 257987 236081 232917 247451 255227 245698
9149 245698 298443 335109 365132 367709 385399 415531 462155 512218 532261 583346 637951 657638
9137 657638 699469 783726 841937 1001038 1179800 1325877 1485549 1674704 1951660 2316172
9127B316172M44444N24744O11170P66874Q98545Q45355O52503L25897p4210m73702
9117F837792p60139q60473p84273o74531o15134m76177l48043l49895k88160k51466
9107A429501j67608j36661j51544j01520q4339r1500k4893o9089o4850n9315n8750
9096D19432m8683m075K2069P811l8848l8412j3623K829k324N453k9695l1506k4315
9083B26113M3035K6373q371k8737o5159l6912N0071k9201j923n271J5811J8952
9071B04781k5270q7416j6051O1646R310k8796K6823K8698k7322l929m2032O897
9059A07339j1769J0498R800k7195K5552J2957J2284r549l124r442K142K1723O307
9046A47523m0259k7224L3731k3169n777M284k1881K8031J4690N0224n086m6501
$$ plain form
9127 2316172 2760616 3285360 3896530 4663404 5561949 6407304 7059807 7385704 7311494 6837792
9117 6837792 6077653 5217180 4432907 3758376 3143242 2667065 2319022 1969127 1680967 1429501
9107 1429501 1261893 1125232 973688 872168 787829 696329 671436 602347 537497 478182 419432
9096 419432 370749 366674 388743 396554 357706 319294 305671 308500 306176 311629 281934 250428 226113
9083 226113 269148 295521 287150 258413 193254 156342 206413 177212 175289 170018 185829 204781
9071 204781 179511 92095 76044 137690 147000 118204 145027 173725 146403 142474 100442 107339
9059 107339 95570 106068 115868 88673 114225 127182 139466 129917 126793 117351 119493 141216 147523
9046 147523 107264 80040 113771 90602 84825 89109 67228 95259 109949 160173 155087 108586
9034A08586k6319m0341m713k5390m2917J801K5142M6888q934J3756J7733K0931
9022H6223K2310J7584J3143K5472l8853j7631J2788k7987p515J3627n360J6171
9010A09972j0298L2845k3090K5166K723n1033k8606j399L6967l75j1683K9407
8998A10596k2830K8036o463l6539J3622r901k7832k0555n996J3331J0676j8622
8986B7523L344J9578P906J3616K7511o27P567l7644J4830L4202l069l7415m8897
8973B8425Q788K6937j8663m343L7714j6105J2782M6972j2408J621K8368j617J9971
8960A58442K090k7533l7911o0192p729p216O2190J6617j5080M064r641J7187L4234
8947A29522q529m8317j7810M414M0311J0909j3280M342J5150m4629p0849j6550
$$ plain form
9034 108586 82267 41926 37213 11823 -31094 -29293 -4151 42737 33803 47559 65292 86223
9022 86223 108533 126117 139260 164732 125879 108248 121036 93049 85534 99161 93801 109972
9010 109972 99674 132519 109429 134595 137318 86285 57679 56280 93247 92872 81189 110596
8998 110596 87766 115802 109339 72800 86422 76521 48689 28134 22138 35469 46145 27523
8986 27523 30867 50445 58351 71967 99478 98851 106418 68774 83604 117806 114737 77322 28425
8973 28425 37213 64150 45487 41144 78858 62753 75535 122507 110099 111720 140088 138471 158442
8960 158442 160532 132999 95088 34896 27167 19951 82141 98758 83678 87742 78101 95288 129522
8947 129522 120993 72676 54866 59280 99591 110500 97220 101562 116712 72083 1234 -15316
8935a5316O966Q214K4223J0051q547K5527J1835k0215m489k940l208q997n589
8922A7515j2827M5302M0010m8976n0079j0778J6074J5968K0836l402L5013M1111
8910A05767k9019j2933j0155j0958k6475k9815K0810O178Q890k4480m0644Q061
8898c4773O9336L0492l5251l412K5308p4j8672m0390k6218k407K8832J7559L1754
8885D2084j2831K4886L4902R919j570k1826n0900p849l1866j0294L9647J2315
8873B6617N2038K0178j8985m1607j5614l6964o718K9073m745m894Q762J2871j2690
8860G322J2634K6990l7621J0092M1581j010n2970J3216J1913j9893j2064J170
8848A360k726J2638m645R827N835L6350j8134K739L0472l9766n9902j6729N614
$$ plain form
8935 -15316 -8350 -136 24087 34138 25591 51118 62953 42738 38249 35309 32101 23104 17515
8922 17515 4688 49990 90000 41024 -9055 -19833 -3759 12209 33045 29643 64656 105767
8910 105767 76748 63815 53660 42702 16227 -13588 7222 13400 22290 -2190 -42834 -34773
8898 -34773 34563 65055 29804 26392 51700 51626 32954 -7436 -33654 -36061 -7229 10330 42084
8885 42084 29253 54139 89041 98960 97390 75564 24664 16815 -15051 -25345 14302 26617
8873 26617 78655 98833 79848 38241 22627 -14337 -21055 8018 3273 -1621 7141 20012 7322
8860 7322 19956 46946 9325 19417 60998 59988 7018 20234 32147 12254 190 1360
8848 1360 -1366 11272 6627 16454 22289 58639 40505 43244 73716 33950 -25952 -42681 -37067
8835c7067J1195n636j943J1523L8564L6903k6400l188N411K3856K369j6407m343
8822C4837r941q534k2438L744O6728R308n2715l5975Q346q955j9820k7731k5369
8809h8515n91M363J8665K4203L831J6788L6617j2038l2480j178J9195q416K3996
8796D440K1355L5168L4094j0517l2245l9237l406l020K2323N922N672j9884j7484
8783C181M0522l2480j5640J1383l7511m507J6113p208q139j0565J0644M574L987
8770b5646l6630p531J7744L5338j5517j5370K1457K3982O9385N0309K850m0968
8758G9403l806o935O786k0986k4079l4873r483M3158J9223j1399l2802p0183J1518
8745e4458Q9440M5947O022j3228n7069P630J6641l4878J2369J1344M166j2412
$$ plain form
8835 -37067 -25872 -31508 -33451 -21928 16636 53539 27139 23951 29362 53218 55587 39180 34837
8822 34837 24896 16362 -6076 -2332 64396 73704 20989 -14986 -6640 -15595 -35415 -63146 -88515
8809 -88515 -89106 -84743 -66078 -41875 -38044 -21256 15361 3323 -29157 -30335 -11140 -19556 4440
8796 4440 25795 60963 95057 84540 52295 13058 9652 6632 28955 34877 40549 20665 3181
8783 3181 43703 11223 -4417 6966 -30545 -35052 -18939 -26147 -34286 -44851 -34207 -29633 -25646
8770 -25646 -62276 -69807 -52063 -16725 -32242 -47612 -26155 -2173 67212 117521 120371 79403
8758 79403 75597 68662 75448 54462 30383 -4490 -13973 29185 48408 37009 4207 -65976 -54458
8745 -54458 34982 80929 86951 73723 16654 24284 40925 6047 18416 29760 33926 21514
8733B1514n5892K6004O685K6082r752k7898o250M855M4265K1803M753j0613j5768
8720B9788Q02j3623J793k2047k0455J5201j2536K255j326k1252K8332J8789J2598
8707A8319K114k1558l6534k5580K2376L3105J280R495J9985M240l6585l5781J1594
8694c3530L9026k3261k715j55J2531J3636R645J0363l2638k7574K8085k5512k2770
8681e4869Q360M0756N9255m173l8384J767q742j9083J8503M0928L2754l2124k8062
8668A6886R157L901n606m646K4748k5325j8633r775J356P036L1259K6391M419
8655F1168j3442N869m2845P128J8898r420r070k105j7665l5129m3745J2387J9568
8642d8403K7564M224j6051K4870K5055r930k5774m2252N1620L7252K1307J5043
$$ plain form
8733 21514 -34378 -8374 -1689 24393 14641 -13257 -19507 -14652 29613 51416 56169 45556 29788
8720 29788 30590 16967 18760 -3287 -23742 -8541 -21077 -18822 -20148 -41400 -13068 5721 18319
8707 18319 20433 -1125 -37659 -63239 -40863 -7758 -6478 3017 23002 27242 -9343 -45124 -33530
8694 -33530 5496 -17765 -20480 -20635 -8104 5532 15177 25540 -7098 -34672 -6587 -32099 -54869
8681 -54869 -46509 -5753 53502 49329 10945 12712 3970 -15113 3390 44318 77072 44948 16886
8668 16886 26043 29944 24338 19692 44440 19115 482 -9293 -7937 -901 30358 56749 61168
8655 61168 47726 53595 10750 17878 36776 27356 18286 16181 -1484 -36613 -80358 -67971 -48403
8642 -48403 -20839 -16615 -32666 -7796 17259 7329 -18445 -60697 -9077 28175 49482 64525
8630F4525j3658k9375L868K7393K5688O094M1416m0379K287k6763o261O997l880
8617E7952k2566n9393j949L2301M358k368k606Q879j2656j4224M016L5596O83
8604B8023K1221J5930J8765M1975n5766r691j5294j7085p609J7354q199q413O111
8591B7322R553J3998N622k0451k4097J5398K2719J2328K032J3150O238m1807j1919
8578C0086J6362Q81l0610k2273J8681J2692j1359L329j6985J4095p502o290l728
8565b621n415j7637J7396K3485m5623l2209P698p748J3505P299j0894J1040L3031
8552h693K4541Q732M311k795k2856j6723J0627L5317K2390L387j8480J5744j3600
8539D1902L3139J3035o9157m3332l0214M81N7265N8121j0945k8237J179j7233
$$ plain form
8630 64525 50867 21492 25360 52753 78441 84535 125951 85572 87859 61096 54835 61832 57952
8617 57952 35386 -24007 -25956 6345 10703 8335 5729 14608 1952 -12272 -8256 27340 28023
8604 28023 49244 65174 83939 125914 70148 60457 45163 28078 20469 37823 29624 21211 27322
8591 27322 36875 50873 56495 36044 11947 27345 50064 62392 64424 77574 83812 42005 30086
8578 30086 46448 47329 16719 -5554 13127 25819 14460 17789 804 14899 7397 1107 -2621
8565 -2621 -8036 -25673 -8277 15208 -30415 -62624 -54926 -62674 -49169 -41870 -52764 -41724 -8693
8552 -8693 15848 24580 28891 26096 3240 -13483 -2856 32461 54851 58238 39758 55502 41902
8539 41902 75041 88076 18919 -24413 -54627 -54146 3119 61240 50295 22058 23237 6004
8527F004k3749P765K1388N490k1397j8501K3593J8137M2463k1285l87m086l0883
8514D552j2160Q463J0398J5632p569J0922M1568j9819l0357k3669r896Q739K1717
8501A8521k4857k2041J06r939K5545J3819O527K4726K050n8921J1428N672n0930
8488e8294K4553N669J8515J950K6441K3513l4221p7021l6492o326L4967M6939
8476b9807J5291K2275r645m6272Q384N4164L8763L2798k8475k0333m1814j8802
8464b3473L6755J227P101o613J4769K7319L3638J1207m4981l0473j5559n476K8433
8451C3874n33l4786j7280K2316n068J6979N983N939p107M2118k7375l411K0867
8438E2516N179o4852k1275O64K8338j385l2459L6650L6102k1039j3197l3365J0468
$$ plain form
8527 6004 -17745 -9980 11408 16898 -4499 -23000 593 18730 61193 39908 39521 35435 4552
8514 4552 -7608 855 11253 26885 19316 30238 71806 51987 21630 -2039 -11935 -3196 18521
8501 18521 -6336 -28377 -28271 -38210 -12665 1154 7681 32407 34457 -24464 -13036 -7364 -58294
8488 -58294 -33741 -28072 -9557 -7607 18834 42347 8126 -68895 -105387 -111713 -76746 -29807
8476 -29807 -14516 7759 -1886 -48158 -39774 14390 53153 85951 57476 37143 -4671 -23473
8464 -23473 13282 14509 21610 14997 29766 57085 90723 101930 56949 26476 10917 5441 33874
8451 33874 33341 -1445 -18725 3591 -1477 15502 21485 27424 20317 62435 35060 31649 52516
8438 52516 57695 -7157 -28432 -27768 570 -815 -33274 3376 39478 18439 5242 -28123 -17655
8425a7655J7765M352Q958k682N424q094L1685O77o601J6463l1184m7418L4612
8412F302k6809l5952L2406P051k3525K4023K4255O245K074M9046o500J6452J2927
8399H7995J5785n483m3950n1401m975j3655J210L7072J4706l4642L7571P862k6405
8386B1690j9425k9075Q588K16J0863L3614j480k9274l6702K3519k0283K4298K5009
8373A1558q407O499m1841j4967J7609N6845N2673J6664j8420j1280j5747j1786
8361C9400j3148k9P595M1270j472j0297m783m4080j6725l0585O189N016l761j579
8347b6989N07R626k7469N496M983r312L7307J9408k1760n1255M2268O8095k2130
8334B8775k7359J3667K3563k3324J7164j4108J3958Q327k9666n153m3899k4781
$$ plain form
8425 -17655 110 4462 13420 10738 16162 8068 39753 40430 33829 50292 19108 -28310 6302
8412 6302 -20507 -56459 -24053 -17002 -40527 -16504 7751 13996 16070 65116 58616 75068 87995
8399 87995 103780 98297 54347 2946 -2029 -15684 -14474 22598 37304 2662 40233 48095 21690
8386 21690 2265 -26810 -18222 -18006 -7143 26471 24991 -4283 -40985 -17466 -37749 -13451 11558
8373 11558 3151 9650 -32191 -47158 -29549 27296 79969 96633 78213 66933 51186 39400
8361 39400 26252 26223 33818 75088 73616 63319 58536 14456 -2269 -32854 -26665 -21649 -25410 -26989
8347 -26989 -26482 -16856 -44325 -38829 -33846 -43158 -5851 13557 -8203 -59458 -17190 50905 28775
8334 28775 1416 15083 38646 15322 32486 18378 32336 40663 10997 5844 -38055 -62836
8322f2836K9617J2383j8048j9503J4801J7449j5928k8082L3235L6378J9781j3375
8310E872k0523J2163L1713M4423N443j4661l3285m595j0027k8668N666K828p435
8297a1086J3203j5482K557J2607J994Q649L5868M1216k9852l9633m6160L8967
8285A2848M8337p195j7972P434L0258j3190j5163j3559n997K5608p29j6525P92
8272C4947J9545O659j5113k4796Q675l732n512l8230J5144m11J4347n416k6574
8259b0467j7961k920j2947J0249L3613K4588L5632K5481k3124L400l3574j0987
8247A0983Q696q126j6700j5134k2431k1411R013j832R217L3963R848r922k0955
8234c4791K360K2831j2996K41K472P698L3379l6840m5020k3841J4575j4380M2703
$$ plain form
8322 -62836 -33219 -20836 -38884 -58387 -43586 -26137 -42065 -70147 -36912 -534 19247 5872
8310 5872 -14651 -2488 29225 73648 79091 64430 31145 26550 16523 -12145 -6479 -3651 -11086
8297 -11086 2117 -13365 -10808 1799 3793 12442 48310 89526 59674 20041 -26119 12848
8285 12848 61185 53990 36018 43452 73710 60520 45357 31798 25801 51409 50680 34155 34947
8272 34947 54492 61151 46038 21242 29917 26185 20673 -17557 -2413 -2824 11523 6107 -20467
8259 -20467 -38428 -41348 -54295 -44046 -10433 14155 49787 75268 52144 55544 21970 10983
8247 10983 19679 11553 -5147 -20281 -42712 -64123 -55110 -56942 -47725 -13762 -3914 -13836 -34791
8234 -34791 -32431 -9600 -22596 -22355 -19883 -12185 21194 -15646 -60666 -84507 -69932 -84312 -41609
8221d1609N5880n120k9035j8261M2924p409q0270n910M2131j5828J6700L6621
8209i186K3980q96k7114K2083k7245P452j1826k6872J7383K9262K7095J0728K2259
8196E7103J1564J0117m4620J84j3791m0623j6346M4170J5323j769r60j4756k9657
8183b4061n3632L3805M2268j1423N2416K5104j5858j8201K3734J211l5842m2959
8171b3438l0626J7199K9767L0532o754n149j2576J4207m1396k8163j2864K9358
8159c9903L8198O204j9579r954j665K0240n84p250J7592o2343m6721M6246O5144
8146E625R892K1675l5391m6294o353M6762M9621K4440r276R491j4598k7335o645
8133B1614j1119j0673M8201j1866l9222l5165K1013N7968j1287m0652J8783j5595
$$ plain form
8221 -41609 14271 9151 -19884 -38145 4779 -2630 -82900 -88810 -46679 -62507 -45807 -9186
8209 -9186 14794 13898 -13216 8867 -18378 -10926 -22752 -49624 -32241 -2979 24116 34844 57103
8196 57103 68667 78784 34164 34348 20557 -20066 -36412 7758 23081 21312 20352 5596 -24061
8183 -24061 -77693 -43888 -1620 -13043 39373 64477 48619 30418 54152 55363 19521 -23438
8171 -23438 -54064 -36865 -7098 23434 16680 11531 -1045 13162 -28234 -56397 -69261 -39903
8159 -39903 -1705 4499 -15080 -25034 -26699 -6459 -7043 -14293 3299 -59044 -105765 -59519 5625
8146 5625 15517 37192 1801 -44493 -50846 -4084 45537 69977 60701 70192 55594 28259 21614
8133 21614 10495 -178 48023 36157 -3065 -38230 -17217 40751 29464 -11188 7595 -8000
8121h000j3755J1624j596J6856L2021K0986K608k7101l5934J4070M6383K6289
8109H4451l3514l4009m8643Q058O10m204L1164L851j2358K5856J4152j6035j2682
8096F697j0557J8988J2341l431m1609m8976m5550R005R843K1788K3731J5305n470
8083c7895q610J5945N6577K1146J9637j8870q746L5494m2297N728J2310n234l5902
8070I283J5796K0108n09k5525m4736j3961j8304K5189J6394J6608m463k2123M419
8057b1824K7414K7069l779J9211J0821k8290m4255L7863J646K1889k06l9603l3377
8044b5421p419r203K7029J1968L9112j5590l9899R614J2431K305p250l1141r516
8031d2980K1887m340J7831K7256j3158r4042k2495R904J3701J0982M5079L1244
$$ plain form
8121 -8000 -21755 -10131 -11727 5129 37150 58136 60744 33643 -2291 11779 58162 84451
8109 84451 50937 16928 -31715 -23657 -23047 -27251 3913 7764 -4594 21262 35414 19379 6697
8096 6697 -3860 15128 27469 24038 -17571 -66547 -112097 -103092 -93249 -71461 -47730 -32425 -37895
8083 -37895 -46505 -30560 26017 47163 66800 47930 39184 74678 32381 38109 50419 45185 9283
8070 9283 25079 45187 44678 19153 -25583 -39544 -57848 -32659 -16265 343 -4120 -26243 -21824
8057 -21824 5590 32659 28880 48091 58912 30622 -13633 24230 25876 47765 47559 7956 -25421
8044 -25421 -32840 -42043 -15014 -3046 36066 20476 -19423 -9809 2622 4927 -2323 -33464 -42980
8031 -42980 -21093 -25433 -7602 19654 6496 -87546 -110041 -100137 -86436 -75454 -30375 869
8019H69N3032J8471p046J2712o3213j3840L5308J890j3744j085k042n7659l1455
8006f7802Q9001M1509m159O635j2631j9752K123m893n524O892K9189k9211m968
7993B6409j7928j756J301q043k0219l2570o482J3979K3275J3785L984K36L5373
7980C1344N987R171K1735k3133j9627j8580j4119j4468M8679M7051l0495R487
7968E3032m139j6254j9889J0068j3289l2431m578m4049J3935J8867L1095J6525
7956H893j8786R655P035r504L5778j0454k3036j3441m6724L5026l120K7738L8091
7943C7151P2383K2906k1046m5809p2480K7150N2769K516k9785k9297j0372N564
7931A1650k54J9342L4671L6919O803o0936k4126L116k1768J559J7518j6508n774
$$ plain form
8019 869 53901 72372 65326 78038 14825 985 36293 38183 24439 23354 21312 -36347 -67802
8006 -67802 21199 62708 58549 65184 52553 32801 34924 30031 24507 31399 60588 31377 26409
7993 26409 8481 6725 8026 -17 -20236 -52806 -59288 -45309 -22034 -8249 -4265 -4029 31344
7980 31344 37331 46502 68237 45104 25477 6897 -7222 -21690 26989 74040 43545 53032
7968 53032 48893 32639 12750 22818 9529 -22902 -27480 -71529 -57594 -38727 -7632 8893
7956 8893 -9893 -238 6797 -2707 33071 22617 -419 -13860 -60584 -25558 -28678 -940 37151
7943 37151 109534 132440 111394 65585 -6895 20255 73024 75540 45755 16458 6086 11650
7931 11650 11396 30738 65409 102328 109131 48195 24069 27185 5417 6976 24494 7986 2212
7918B212Q118k1872J1350L91J0907N803k6103J2397j3216K4361k2361m5682j9072
7905g2767K4001J7872j0474J2001L5898M2565l0176n1156L3007l342P356K6802
7893C1587j3851N581l4277k3334M209J4820L0759M9224l1955m0534L8978j8072
7881A3135k5904k6860J8122K7761K099j2750J8468o435p793k7634j8855N4515
7869G869M3547N6160n2242k9868m7972k0990K8247K60m889M868p738L912k3739
7856d2575K3560O349O456J1176j0389j3392J0085p812N4861K3478l7341j4319
7844A0137j8136m5353n159R1p072P814N0379J1735j4934n0485j9449L7466N7382
7831A4416R41K0063r910j1532k1443k8539J918k19k0789J5839J5309P480r759
$$ plain form
7918 2212 10330 -11542 -192 199 11106 16909 -9194 3203 -10013 14348 -8013 -53695 -72767
7905 -72767 -48766 -30894 -41368 -29367 6531 49096 18920 -32236 771 -2571 4785 31587
7893 31587 17736 23317 -10960 -34294 -30085 -15265 15494 64718 32763 -7771 31207 13135
7881 13135 -12769 -39629 -21507 6254 8353 -4397 14071 7636 -157 -27791 -46646 7869
7869 7869 51416 107576 55334 25466 -22506 -43496 -15249 -14989 -19878 -15010 -22748 -18836 -42575
7856 -42575 -19015 -12666 -6210 4966 -5423 -18815 -8730 -16542 38319 61797 24456 10137
7844 10137 -7999 -53352 -58511 -58420 -65492 -57678 -7299 4436 -10498 -60983 -80432 -42966 14416
7831 14416 15357 35420 25510 13978 -7465 -36004 -34086 -34305 -55094 -39255 -23946 -16466 -26225
7818b6225Q553J7514K3306k430m432l844J4149J9886p087l9503r041L5062j3436
7805A2472l3697j4770J1421K5912j6923O427K4584k3001l4453J6264J0063k328
7793a8029l650L4187K7906r196q2695l4778k892M8664J9530K376J67n191k8409
7780e2010J9922K0275J6274R085p136O408j4043K8538J5209J3335K4239J013o702
7767G4407k2868o9170l0160K4929M1829P2357q973n131j9265j5697j8144J415
7755B5529j5041K7295K7826k5921k3164k8716n5645j2801n571J9539L6358l594
7743c3906L7431P1661j2628p795O530n6552k7744J2146k8611K3097p604l3284
7731e7259l5622O453J1857L9744O900L4677M1371m5377r50m3367j644N0886M3425
$$ plain form
7818 -26225 -17672 -158 23148 20718 16286 12442 26591 46477 39390 -113 -9154 25908 12472
7805 12472 -21225 -35995 -24574 1338 -15585 -9158 15426 -7575 -42028 -25764 -15701 -18029
7793 -18029 -21679 12508 40414 31218 -51477 -86255 -89147 -40483 -20953 -18577 -18410 -23601 -52010
7780 -52010 -32088 -11813 4461 13546 6410 12818 -1225 27313 42522 55857 80096 81109 74407
7767 74407 51539 -17631 -47791 -22862 18967 91324 82351 77220 57955 42258 24114 25529
7755 25529 10488 37783 65609 39688 16524 -12192 -67837 -80638 -86209 -66670 -30312 -33906
7743 -33906 3525 75186 62558 54763 61293 4741 -23003 -10857 -39468 -16371 -23975 -57259
7731 -57259 -92881 -86428 -74571 -34827 -27927 6750 48121 2744 1794 -41573 -43217 7669 51094
7718E1094l3471r038K7725M2753k3728j6665M656l3083p0062m6825M6791L9065
7706b0788L1355R303M975q845J238j6407j4263J7638q759J4512k726l3908k1646
7693d8321J9524j0156J4007r236K0325K6360L537o062M486l3460p546Q880M2459
7680B4797J9678j0973m0748k7322l236O084M4453L4041N2078K8080o4720m8633
7668A3579J9980K8095J0681k8456n277R425M146j7023m2714k9873L811K3430k2809
7655c3005k2328K9496K1418q006K160j1775o800j8311L1716J3803j6112o029j4588
7642c8361m1028M0057P0884l3104k5506j4143J8994L2850j6615k9396j2389K8886
7630a8871j7715P765J8659l620K6713R422l5356j9389K2726q035N661K9513M2550
$$ plain form
7718 51094 17623 8585 36310 79063 55335 38670 43326 10243 -59819 -106644 -59853 -20788
7706 -20788 10567 19870 24845 16000 17238 831 -13432 4206 -4553 9959 7233 -26675 -48321
7693 -48321 -28797 -38953 -24946 -34182 -13857 12503 16040 9978 14464 -18996 -26542 -17662 24797
7680 24797 44475 33502 -7246 -34568 -37804 -31720 12733 46774 98852 126932 62212 13579
7668 13579 33559 61654 72335 43879 38602 48027 52173 35150 -7564 -37437 -33626 -10196 -33005
7655 -33005 -55333 -25837 -4419 -12425 -10265 -22040 -28840 -47151 -15435 -1632 -17744 -23773 -38361
7642 -38361 -79389 -39332 31552 -1552 -27058 -41201 -22207 10643 -5972 -35368 -47757 -18871
7630 -18871 -36586 -28821 -10162 -13782 12931 22353 -13003 -32392 -9666 -17701 -12040 17473 60023
7617F0023j4659k4883K0418j7655m644L2237j305l3948J9300M069K5454n999q071
7604E0337l9562k703L3990J5796n6344j5963L6169K6241r740j4052j5642j811
7592F716j6837o901N99l1949j0004K3762M7927M5984j8415k1703j4527J1956J8285
7579C4893L9781K741k6871k3085j3627k3504j9467J9257M8148L8031k5233p4071
7567b3007l5043R412L8022L2472R161k5066k1900p916j8052J3348k6033k3140
7555g7742k3902J0883K6796j7040M4650M383k9491J9872N719K1392K1241J2286
7543A9047M4851N329k1374j4198l3024j5184J386J2751k0496J9606P915j2027
7531e418k5645Q478l1859l3548k593O8807K8279k7223j628Q768J7679K0505M511
$$ plain form
7617 60023 45364 20481 40899 23244 18600 50837 49532 15584 34884 38953 64407 58408 50337
7604 50337 10775 8072 42062 57858 1514 -14449 21720 47961 38221 24169 8527 6716
7592 6716 -10121 -17022 -16423 -48372 -58376 -34614 13313 59297 40882 19179 4652 16608 34893
7579 34893 74674 77415 50544 27459 13832 -9672 -29139 -9882 38266 76297 51064 -23007
7567 -23007 -58050 -48638 -10616 21856 31017 5951 -15949 -23865 -41917 -28569 -54602 -77742
7555 -77742 -101644 -90761 -63965 -81005 -36355 -31972 -61463 -41591 -35872 -14480 6761 19047
7543 19047 63898 69227 47853 33655 631 -14553 -13167 -416 -20912 -1306 6609 -5418
7531 -5418 -31063 -22585 -54444 -87992 -90585 -21778 6501 -20722 -22350 -13582 4097 24602 29113
7518B9113l3860Q670j3056j3695L204L2947M1327L155Q924l1539J0924K4922m6397
7505B4639n4341m6376L3478m352j9783J6838N144j7444k4376j7091N1368L3999
7493a8297l724o803K8757K7592L7508l7391l4466l1204j2746n658K8242j2032
7481d0222L4825O312l1638N296K1752p234l7821j051J638k9366J5148M7293j398
7468a6466O518K4573j9750k0907J246l2429j1498P2133J7852k4678r697K3599
7456A0496k601N838m135Q126k8676l9088J2543J1722J2599k109P322J1640k7499
7443b3822l1005L0910j2977M6288K1046m2769l1315r88j4170k4223k7805l416
7431a14246k1708K3013P563K1042K7076o73J5200j8656k5290J9108N048k5640
$$ plain form
7518 29113 -4747 3923 -9133 -22828 -19624 13323 54650 57805 66729 35190 46114 71036 24639
7505 24639 -29702 -76078 -42600 -46952 -66735 -49897 -44753 -62197 -86573 -103664 -52296 -18297
7493 -18297 -22021 -28824 -67 27525 65033 27642 -6824 -38028 -50774 -56432 -28190 -40222
7481 -40222 -5397 915 -30723 -25427 -3675 -10909 -48730 -49781 -48143 -77509 -62361 -15068 -16466
7468 -16466 -9948 14625 -5125 -26032 -24786 -57215 -68713 3420 21272 -3406 -13103 10496
7456 10496 7895 13733 9598 17724 -10952 -50040 -37497 -25775 -13176 -15285 -7963 3677 -23822
7443 -23822 -54827 -23917 -36894 9394 30440 -12329 -43644 -44632 -58802 -83025 -110830 -114246
7431 -114246 -135954 -112941 -105378 -84336 -57260 -57933 -42733 -61389 -86679 -67571 -62523 -88163
7419h8163J1922M7678K1658M860K6451O123m6266j9712J5980K606j4008J1986
7407a8885Q079p676n945K4972n613L3790j6106l209j5035k1608k6599k589j715
7394e8139j8208r80L7933J7411j1484M2119k1316k272M7374k5380q484J3449k4660
7381a2637j0009j3008l3080K9040J5721P243J3808K4659j5498j2946j1609J6485
7369a831p4581p803K2299K5308j921q204N065K2503M6412N903l0304L969R485
7356A6300n0456k6607K7061M061r764k4427k3725L9398N1393N671j4503J6008
7344A0410L4968k547j5624j6987j0997J2312k6635R543K9087K613L0102O983o234
7331E6994J8732m53m0658m8464n570M0742m7669k2377J8252P8637M0408P046k0554
$$ plain form
7419 -88163 -76241 -28563 -6905 -2045 24406 30529 -15737 -35449 -19469 -16863 -30871 -18885
7407 -18885 -10806 -18482 -24427 545 -5068 28722 12616 9407 -5628 -27236 -53835 -56424 -58139
7394 -58139 -76347 -77327 -39394 -21983 -33467 8652 -12664 -14936 32438 7058 -1426 12023 -12637
7381 -12637 -22646 -35654 -68734 -39694 -23973 -16730 -2922 21737 6239 -6707 -18316 -1831
7369 -1831 -76412 -84215 -61916 -36608 -38529 -46733 -41668 -19165 27247 33150 2846 6815 16300
7356 16300 -34156 -60763 -33702 -29641 -39405 -63832 -87557 -48159 3234 8905 -5598 10410
7344 10410 45378 42831 27207 10220 -777 11535 -15100 -5557 23530 26143 56245 63228 56994
7331 56994 75726 75273 34615 -13849 -19419 21323 -26346 -48723 -30471 48166 88574 95620 75066
7318G5066p0223l7564r578k051O0379L5051n226L443l3212r928J1907j9889n3981
7305e5806j6530K937K7257K9144k5034l5322r187N8919J8873k9209k0127K1401
7293c2684O3318K4655l2863N906R746o4561l6532K794k0661j3101K1135j0742
7281h3590N1703L2658J1511j6070k5095l4878o746N2167J0087l981J9983K1267
7269B9016L773k0029q136J4190l6127J8325o976o9322J8132K3935j8210J33p707
7256e9003J6422K2556O154k1590J7101L7521k732k0358O259k180n0892J1540L9116
7243h6M2210m109J5202L1142R069j9197j5137l1812m2840o122M5611K0496j0773
7230C3654n2606j0558L0521j4593L135J1967l1524k009L0878K0447m269j0380
$$ plain form
7318 75066 4843 -32721 -42299 -44350 16029 51080 45854 49297 16085 6157 18064 -1825 -55806
7305 -55806 -72336 -69399 -42142 -12998 -38032 -73354 -82541 -23622 -4749 -33958 -54085 -32684
7293 -32684 30634 55289 22426 28332 38078 -26483 -63015 -60221 -80882 -93983 -72848 -83590
7281 -83590 -31887 771 12282 -3788 -28883 -63761 -70507 -18340 -8253 -12234 7749 29016
7269 29016 32789 12760 4624 18814 -17313 1012 -5964 -75286 -57154 -33219 -51429 -51296 -59003
7256 -59003 -42581 -20025 -13871 -35461 -18360 19161 16429 -3929 2330 150 -50742 -39202 -86
7243 -86 42124 38015 53217 84359 93428 74231 59094 27282 -15558 -21680 23931 44427 33654
7230 33654 -18952 -29510 1011 -13582 -10447 1520 -30004 -32013 -1135 19312 15043 4663
7218D663j297m8187j6556l3540J1876J96N460K2702J7236J8068P100J1354R798
7205H873l9238p5490K0755L0683l147m353M1672M6068L6263N579m6840L5341K7269
7192H3435p4855l2098K6079K7606J9692k1193j1729N4177l973m1029K1230o653
7180D0689P9n769j2681l484j604k4393J4858J8815j8026k3509r028J89K303N7598
7166C6037k9201l178Q996L3668J353j0528J6916j5270n520j8362M722o332L3179
7153D6480J401l2979P871j9664l3732k5753L4469p526K5107L6953O514l4836p992
7140c687P429k1901K0860j71m7462p5463Q865M9382n644Q262K0770K0810j7771
7127c5721j6589N5597J1353j5880j0470n319Q506j679J1772R081j213M0078K68
$$ plain form
7218 4663 3366 -44821 -61377 -94917 -83041 -82845 -77385 -54683 -37447 -19379 -12279 -925 8873
7205 8873 -30365 -105855 -85100 -54417 -57564 -61917 -20245 25823 62086 67665 20825 56166 83435
7192 83435 8580 -23518 2561 30167 49859 28666 16937 71114 67141 26112 47342 40689
7180 40689 40768 34999 22318 18834 17230 -7163 7695 26510 8484 -15025 -24053 -23864 -21561 36037
7166 36037 6836 3658 12654 46322 47675 37147 54063 38793 33273 14911 19633 13301 46480
7153 46480 47881 14902 22773 3109 -30623 -56376 -21907 -29433 -4326 32627 39141 4305 -3687
7140 -3687 3742 -18159 2701 2530 -44932 -120395 -111530 -62148 -67792 -59530 -38760 -17950 -35721
7127 -35721 -52310 3287 14640 -1240 -11710 -17029 -8523 -10202 1570 10651 9438 49516 49784
7114D9784m5958m0255j0493j979k5182j8104N002N9793J1447k6679j6433N7012
7102b045R206j2965j3093l8898j2582J4365L3514J9854k4998q271j5754n650J577
7089e5740J1418K7273j0666K6659K7519J1815k9673k629J065j0352L17K5875Q699
7076C1580l969l487l372m1181l7384L840K7218J7157J7771q475P064J2288L2398
7063E1448p368p637J844m6644n1275k1746L0440p236N040m0354L959O2839L7119
7050A0429P559o431k958P639l5618m1099j5820j3450M4537K2198j354N006K0713
7037A351N800J035J0495j9647Q1J4113k7538N679J7477J7235Q851M297l2511J2806
7023A9524j8324K3162J6752k2045m6516j2825k5894j586K282J2090K2322K4896
$$ plain form
7114 49784 3826 -36429 -46922 -48901 -74083 -92187 -87185 -27392 -15945 -42624 -59057 -2045
7102 -2045 7161 -5804 -18897 -57795 -70377 -56012 -22498 -2644 -27642 -35913 -51667 -57317 -55740
7089 -55740 -44322 -17049 -27715 -1056 26463 38278 8605 5976 7041 -3311 -2994 22881 31580
7076 31580 27611 24124 20752 -20429 -57813 -53973 -26755 -9598 8173 -302 6762 19050 51448
7063 51448 44080 36443 38287 -8357 -59632 -81378 -50938 -58174 -53134 -93488 -89529 -26690 10429
7050 10429 17988 11557 8599 16238 -19380 -60479 -76299 -89749 -45212 -23014 -24368 -19362 1351
7037 1351 7151 8186 18681 -966 -885 13228 -14310 -8631 8846 26081 34932 39229 6718 19524
7023 19524 1200 24362 41114 19069 -27447 -40272 -66166 -67752 -65470 -53380 -31058 -6162
7011f162j8588l1024M7784K6830l995l1074j4508k824J8770K9934L8398k4527
6999B9014r606j5268l3533j1709J7341K8552l0489O541K6183J2481J6395l3987
6987A915n1401J825K1689R845M7573L7701N180k4944m1189k4205r766M723J5749
6974e305M7841j7251l5371m947K5885J3986J4482k4183k4286n4466J268J6878
6962d5469J0242q314M408M9702O6579k2912m2457l0926M0174L1294k7987n0449
$$ plain form
7011 -6162 -24750 -55774 -7990 18840 14845 -16229 -30737 -33561 -14791 15143 53541 29014
6999 29014 19408 4140 -29393 -41102 -23761 4791 -25698 -19157 7026 19507 35902 1915
6987 1915 -49486 -47661 -25972 -16127 31446 69147 74327 49383 8194 -16011 -25777 -21054 -5305
6974 -5305 42536 25285 -10086 -15033 10852 24838 39320 15137 -9149 -63615 -62347 -45469
6962 -45469 -35227 -43541 -39133 10569 77148 54236 11779 -19147 21027 52321 24334 -26115
$$ [...]
##END NTUPLES=NMR SPECTRUM
##END=
