##TITLE=Analysis number 329960
Compound Code cc 66546
Book Reference 467/190
Project Code adrs
Chemist Name benw
##JCAMPDX= 6.0         $$ Bruker NMR JCAMP-DX V2.0
##DATA TYPE= NMR SPECTRUM
##DATA CLASS= NTUPLES
##ORIGIN= Bruker BioSpin GmbH
##OWNER= nmr
$$ XWIN-NMR		Version 3.5
$$ Tue Oct 16 09:24:31 2007 GMT Daylight Time (UT+1h)  MAYBRIDGE\nmr@NMR_250MHZ
##.OBSERVE FREQUENCY= 250.131544655141
##.OBSERVE NUCLEUS= ^1H
##.ACQUISITION MODE= SIMULTANEOUS (DQD)
##.ACQUISITION SCHEME= undefined
##.AVERAGES= 16
##.DIGITISER RES= 18
##SPECTROMETER/DATA SYSTEM= dpx250
##.PULSE SEQUENCE= zg30
##.SOLVENT NAME= CDCl3
##.SHIFT REFERENCE= (INTERNAL, CDCl3, 0, 16.4534)
##AUDIT TRAIL= $$ (NUMBER, WHEN, WHO, WHERE, WHAT)
$$ ##TITLE= Audit trail, XWIN-NMR		Version 3.5
$$ ##JCAMPDX= 5.01
$$ ##ORIGIN= Bruker BioSpin GmbH
$$ ##OWNER= nmr
$$ C:\u/data/dgb/nmr/ADRS/790/pdata/1/auditp.txt
$$ ##AUDIT TRAIL=  $$ (NUMBER, WHEN, WHO, WHERE, WHAT)
(   1,<2007-10-16 09:23:51.01 +100>,<MAYBRIDGE\nmr>,<NMR_250MHZ>,
      <created by zg, POWCHK disabled, PULCHK disabled
       configuration hash MD5:
       76 6E 9A 78 1E 09 19 81 EC 84 63 8F B0 6A 59 2D
       data hash MD5: 64K
       93 25 46 F8 15 0F 32 BC BC BD A5 85 D2 74 73 89>)
(   2,<2007-10-16 09:24:11.44 +100>,<MAYBRIDGE\nmr>,<NMR_250MHZ>,
      <Start of raw data processing
       ef LB = 0.3 FT_mod = 6 PKNL = 1 SI = 32K 
       data hash MD5: 32K
       19 25 83 68 59 78 4F 20 4A 3F 21 D3 8E 2C E8 46>)
(   3,<2007-10-16 09:24:13.38 +100>,<MAYBRIDGE\nmr>,<NMR_250MHZ>,
      <apk 
       data hash MD5: 32K
       71 06 FC DD 2C B0 98 64 39 B3 DC 63 39 80 96 10>)
(   4,<2007-10-16 09:24:14.15 +100>,<MAYBRIDGE\nmr>,<NMR_250MHZ>,
      <abs ABSG = 5 
       data hash MD5: 32K
       E2 14 96 02 9E 89 F8 A3 0C 3C C6 DD EC 4F 0A 10>)
$$ ##END=
$$ 
$$ hash MD5
$$ 2E 45 14 0F 81 BE EF 32 07 32 B4 FD 9B 76 50 9F
##$RELAX= 
##$RELAX= 
##$RELAX= 
##$RELAX= 
##$RELAX= 
##$RELAX= 
##$RELAX= 
$$ Bruker specific parameters
$$ --------------------------
##$DU= <C:\u>
##$EXPNO= 790
##$NAME= <ADRS>
##$PROCNO= 1
##$TYPE= <nmr>
##$USER= <dgb>
##$AMP= (0..31)
100 100 100 100 100 100 100 100 100 100 100 100 100 100 100 100 100 100 
100 100 100 100 100 100 100 100 100 100 100 100 100 100 
##$AQSEQ= 0
##$AQ_mod= 3
##$AUNM= <au_zg>
##$AUTOPOS= <7 >
##$BF1= 250.13
##$BF2= 250.13
##$BF3= 250.13
##$BF4= 250.13
##$BF5= 500.13
##$BF6= 500.13
##$BF7= 500.13
##$BF8= 500.13
##$BYTORDA= 1
##$CFDGTYP= 0
##$CFRGTYP= 5
##$CHEMSTR= <none>
##$CNST= (0..31)
1 1 145 1 1 1 1 1 1 1 1 1 1 1 1 1 1 1 1 1 1 1 1 1 1 1 1 1 1 1 1 1 
##$CPDPRG= <>
##$CPDPRG1= <>
##$CPDPRG2= <>
##$CPDPRG3= <>
##$CPDPRG4= <mlev>
##$CPDPRG5= <mlev>
##$CPDPRG6= <mlev>
##$CPDPRG7= <mlev>
##$CPDPRG8= <mlev>
##$CPDPRGB= <>
##$CPDPRGT= <>
##$D= (0..31)
0 1 0 0 0 0 0 0 0 0.06 0 0 0 0 0 0 0.0002 0 0 0 0 0 0 0 0 0 0 0 0 0 0 
0 
##$DATE= 1192523030
##$DBL= (0..7)
120 120 120 120 120 120 120 120 
##$DBP= (0..7)
150 150 150 150 150 150 150 150 
##$DBP07= 0
##$DBPNAM0= <>
##$DBPNAM1= <>
$$ [...]
##$SUBNAM7= <"">
##$SUBNAM8= <"">
##$SUBNAM9= <"">
##$SW= 20.6930455092707
##$SWIBOX= (0..15)
0 0 3 0 0 0 0 0 0 0 0 0 0 0 0 0 
##$SW_h= 5175.983436853
##$TD= 65536
##$TD0= 1
##$TE= 296.16
##$TE2= 300
##$TE3= 300
##$TEG= 300
##$TL= (0..7)
0 120 120 120 120 120 120 120 
##$TP= (0..7)
150 150 150 150 150 150 150 150 
##$TP07= 0
##$TPNAME0= <>
##$TPNAME1= <>
##$TPNAME2= <>
##$TPNAME3= <>
##$TPNAME4= <>
##$TPNAME5= <>
##$TPNAME6= <>
##$TPNAME7= <>
##$TPOAL= (0..7)
0.5 0.5 0.5 0.5 0.5 0.5 0.5 0.5 
##$TPOFFS= (0..7)
0 0 0 0 0 0 0 0 
##$TUNHIN= 0
##$TUNHOUT= 0
##$TUNXOUT= 0
##$USERA1= <user>
##$USERA2= <user>
##$USERA3= <user>
##$USERA4= <user>
##$USERA5= <user>
##$V9= 5
##$VALIST= <valist>
##$VCLIST= <CCCCCCCCCCCCCCC>
##$VD= 0
##$VDLIST= <DDDDDDDDDDDDDDD>
##$VPLIST= <PPPPPPPPPPPPPPP>
##$VTLIST= <TTTTTTTTTTTTTTT>
##$WBST= 1024
##$WBSW= 4
##$XGAIN= (0..3)
0 0 0 0 
##$XL= 0
##$YL= 0
##$YMAX_a= 323941
##$YMIN_a= -510217
##$ZGOPTNS= <>
##$ZL1= 120
##$ZL2= 120
##$ZL3= 120
##$ZL4= 120
##$ABSF1= 16.45344
##$ABSF2= -4.239733
##$ABSG= 5
##$ABSL= 3
##$ALPHA= 0
##$AQORDER= 0
##$ASSFAC= 0
##$ASSFACI= 0
##$ASSFACX= 0
##$ASSWID= 0
##$AUNMP= <proc_1d>
##$AZFE= 0.1
##$AZFW= 0.1
##$BCFW= 0
##$BC_mod= 0
##$BYTORDP= 0
##$COROFFS= 0
##$CY= 12.5
##$DATMOD= 1
##$DC= 0
##$DFILT= <>
##$DTYPP= 0
##$F1P= 14.0000005364418
##$F2P= -0.99999901652339
##$FCOR= 0.5
##$FTSIZE= 32768
##$FT_mod= 6
##$GAMMA= 0
##$GB= 0
##$INTBC= 1
##$INTSCL= 1
##$ISEN= 128
##$LB= 0.3
##$LEV0= 0
##$LPBIN= 0
##$MAXI= 10000
##$MC2= 0
##$MEAN= 0
##$ME_mod= 0
##$MI= 0
##$NCOEF= 0
##$NC_proc= -3
##$NLEV= 6
##$NOISF1= 0
##$NOISF2= 0
##$NSP= 0
##$NTH_PI= 0
##$NZP= 0
##$OFFSET= 16.45344
##$PC= 1
##$PHC0= 156.6363
##$PHC1= 2.244227
##$PH_mod= 1
##$PKNL= yes
##$PPARMOD= 0
##$PSCAL= 4
##$PSIGN= 0
##$REVERSE= no
##$SF= 250.130017147791
##$SI= 32768
##$SIGF1= 0
##$SIGF2= 0
##$SINO= 400
##$SIOLD= 32768
##$SREGLST= <1H.CDCl3>
##$SSB= 0
##$STSI= 32768
##$STSR= 0
##$SW_p= 5175.98343685301
##$SYMM= 0
##$S_DEV= 0
##$TDeff= 65536
##$TDoff= 0
##$TI= <Analysis number 999999
Compound Code 99
Book Reference 9
Project Code 9>
##$TILT= no
##$TM1= 0
##$TM2= 0
##$TOPLEV= 0
##$USERP1= <user>
##$USERP2= <user>
##$USERP3= <user>
##$USERP4= <user>
##$USERP5= <user>
##$WDW= 1
##$XDIM= 32768
##$YMAX_p= 482178206
##$YMIN_p= -457477
$$ End of Bruker specific parameters
$$ ---------------------------------
##NTUPLES= NMR SPECTRUM
##VAR_NAME=  FREQUENCY,     SPECTRUM/REAL,   SPECTRUM/IMAG
##SYMBOL=    X,             R,               I
##VAR_TYPE=  INDEPENDENT,   DEPENDENT,       DEPENDENT
##VAR_FORM=  AFFN,          ASDF,            ASDF
##VAR_DIM=   32768,         32768,           32768
##UNITS=     HZ,            ARBITRARY UNITS, ARBITRARY UNITS
##FACTOR=    0.157963299565203, 1,           1
##FIRST=     4115.49915743388, 0,            0
##LAST=      -1060.48427941913, 0,           0
##MIN=       -1060.48427941913, -457477,     0
##MAX=       4115.49915743388, 482178206,    0
$$ Real data points
##PAGE= N=1
##DATA TABLE= (X++(R..R)), XYDATA
$$ [...]
16348b2238r6J0468J6312J1309J426K3191L585k4299N306j0024m0478k7444p299
16335f0281k5960J1495m568R209L6905J4034l15p932j4746Q585L0588N947l3388
16322c0427l0212K787l139J0446J7542J6971J6778J252j4694P306j1956k5336
16310d2682L523N400O83r230j1491J0677O512j2439j8758J5046R348K8991k514
16297a6934l282j320R576J7763J9681m872j3724p958k0581j9854O436K0189K0345
16284E465J5790m336n980L658j5095k2830k2981N923J5265N556j1748M044j043
16271b8312N249O676q874l4317j7046J9851K3568n195L0760j6036r826j3666J761
16258d5407K3147L2012k1129k555J8011J1044j3520k810j8639j3609J294j0966
$$ y = [-22238, -22334, -11866, 4446, 15755, 17181, 40372, 43957, 19658, 24964, 14940, -25538, -52982, -60281, -86241, -74746, -79314, -70105, -33200, -19166, -19481, -27413, -42159, -33574, -2986, 2961, -30427, -60639, -57852, -60991, -50545, -33003, -16032, 746, 1998, -12696, -5390, -17346, -42682, -39159, -33759, -33076, -42306, -53797, -43120, -36608, -49047, -67805, -52759, -43411, -14420, -16934, -20216, -21536, -11960, 5803, 25484, 20612, 6888, -1070, -21651, -41505, -35069, -14880, 5465, 21255, 16919, 10939, 14597, -498, -23328, -46309, -40386, -25121, -19565, -31313, -27269, -28312, -23063, -16387, -25261, -59578, -76624, -56773, -33205, -38400, -7640, -23676, -33502, -47168, -45407, -22260, 9752, -11377, -13932, 4079, 15123, 1603, -1207, -19846, -33455, -32161, -43127]
16246d3127K0466R953k7661l5106J7744L4298k0626j6583J8522P891L327K418
16234b8484K5944j1160j4374N106j1464j3762j6718O591K916J2948J5265K4566
16222b626N574M0739j6022q472j5424J0723L284N46j7646k921J5732P707j4557
16209F637j9615J5299l733j4743l8449l9120K6872K3231q716k018k3136j1327
16197h8818L4971J8960K0475J7305n056j2039K2319r961l956O432R586Q168l1172
16184a2786j3846P054M417J3257q358m3065O792J3886K859K1804J8364J9258j6070
16171A3566k6618J9612k202j2324j0666p103m1287M794L0877N1433L5010M089
16159E9181m1875j8505j3506j9536Q916J1665K1398J5021j1637j4661N151q347
$$ y = [-43127, -22661, -12708, -40369, -75475, -57731, -23433, -44059, -60642, -42120, -34229, -30902, -28484, -2540, -13700, -28074, -22968, -34432, -48194, -64912, -58321, -55405, -42457, -27192, -2626, 2948, 43687, 27665, 19193, 3769, 14492, 17776, 18322, 676, -2245, 13487, 21194, 6637, -12978, 2321, -1412, -16155, -54604, -93724, -66852, -43621, -52337, -54355, -77491, -88818, -53847, -34887, -14412, 2893, -2163, -14202, 8117, -1844, -5800, 632, 10218, 18386, -12786, -26632, -19578, -15161, -1904, -10262, -53327, -46535, -32649, -29790, -7986, 10378, 29636, 13566, -13052, 6560, 4358, -7966, -18632, -25735, -67022, -62228, -31351, 20082, 55092, 59181, 17306, -1199, -14705, -34241, -25325, -13660, 7738, 22759, 11122, -3539, 1612, -6735]
16147f735n5762m066J2439J842L3773M129N552k0489r142R961P250L0061J7223
16134B6036k5106r535j5074j0011O066m052M670R515K39j2854k1075j6278K305
16121f5154j6897K5325K2013J0647j4209p807j890K4447l826R155J6909p705j6070
16108b5062j240N183j8978j7965K679K6377m181K3209j4555j0542O228j1872N170
16095c5549L1126n689p336J1542J63J0919l3676K603J2148L1582J3461J2528j458
16082D2364j004k4146j9862p34P486j8265m644K03j0776r6O182J9219r278n412
16068a8763J0110K7570J4997l992j2360J8297k9050J875p14M835L934J0901O384
16055C4024P280k9343m2577k5660j2607L0911N187J3172Q96J2629r085N746j168
$$ y = [-6735, -62497, -66563, -54124, -52282, -18509, -14380, -8828, -29317, -38459, -28498, -21248, 8813, 26036, 930, -8605, -23679, -33690, -27624, -31676, -27006, -17491, -17252, -30106, -51181, -67459, -65154, -82051, -56726, -34713, -24066, -38275, -46082, -47972, -23525, -27351, -18196, -1287, -8992, -25062, -26302, -21119, -40097, -58062, -55383, -29006, -33187, -9978, -24533, -35075, -28847, -40719, -35549, -4423, -10112, -17448, -5906, -5743, 5176, -28500, -25897, -13749, 17833, 31294, 43822, 42364, 41360, 17214, -2648, -3382, 4104, -14161, -18805, -18602, -29378, -29474, -23292, -4073, -13351, -18763, -8653, 18917, 33914, 29922, 17562, 35859, 6809, 8684, 7970, 12805, 16739, 27640, 34024, 41304, 11961, -30616, -56276, -68883, -37972, -32785, -19613, -18717, -6088, -15173, -9427, -10595]
16042a0595k8263p116J0684n864Q684n018k2894K7655K1402j6963p468K1474M0272
16029B5990N11k4239k9550j4756j2816q811o570J2132J5718m373R661K7545o568
16016a6126l2858j5620Q407J1787j1097L6153L6086r649n663Q160J1486m2074
16004b1008P739L8962m765j6006J8284l569O602R269k0955j542N382k9020l1437
15991d2064M1411K6615R510q066l5989j6797L172K2285J0327L202k2177j7766
15979b6337L4704O582k8881k0980J326K9357J6192l1928l9099O638P875R172k4234
15966e9613j0035J7165K2089J7210q923P845j203l92j2459j973k0989j782K5179
15953b7881L7210K3221r637k6689j2518l220l6200J9552M2452P447k6446P256
$$ y = [-10595, -38858, -45974, -35290, -41154, -32470, -37488, -60382, -32727, -11325, -28288, -35756, -14282, 25990, 26501, 2262, -27288, -42044, -54860, -63671, -70241, -58109, -42391, -46764, -37103, -9558, -16126, -48984, -64604, -56197, -44410, -55507, -19354, 16732, 7083, 1420, 9580, 21066, -21008, -13269, 25693, 20928, 4922, 23206, 19637, 26239, 35508, 14553, 13011, 18393, -10627, -42064, -653, 25962, 35472, 27406, -8583, -25380, -22208, 77, 10404, 13606, -8571, -26337, 8367, 14949, -13932, -34912, -33586, -4229, 11963, -19965, -59064, -52426, -44551, -35379, -59613, -69648, -52483, -30394, -13184, -22107, -14262, -15465, -15857, -28316, -30289, -51278, -53060, -27881, 9329, 32550, 22913, -3776, -16294, -19514, -55714, -36162, 6290, 13737, -12709, -5453]
15941e453J0566k2758k855L492k170l7832L929J9740j2414o939M115M0570J6862
15928H853L234L0216j5093k3942l3429O526K0909j4132l0828R740L1250k2399
15916b9095l3013N287J1035K7887J005j0955r299Q029Q231L328J8826p711k6404
15903c2849p09Q900l483R979p605J7284L250j7416P050j770n108P301N259L404
15889f513J9218k9422J1790J8597K1269O782o234j9516k5544k1358q104L079K3902
15876a2054J0790K6087J8991J2146q683k8430l1616J9039N839K646j2560K4033
15864B6228o410j9469p361J6959r300j5783J1812l6583j5404L3370M6367j5490
15852H936p53j895k4517K221J7344K2061l2366k5147j2213j0463J5763j5128K6339
$$ y = [-5453, 5113, -17645, -20500, -17008, -19178, -57010, -53081, -33341, -45755, -52694, -48579, -8009, 8853, 12087, 42303, 27210, 3268, -30161, -23635, -2726, -16858, -47686, -37946, -6696, -29095, -62108, -56821, -45786, -17899, -16894, -27849, -37148, -29119, -20888, -17560, 1266, -6445, -32849, -33558, -24658, -28141, -18162, -25767, -8483, -5233, -22649, -15599, -17369, -22477, -15176, -9917, -6513, 12705, -16717, -4927, 13670, 34939, 41721, 35487, 15971, -9573, -30931, -39035, -35956, -12054, -1264, 24823, 43814, 55960, 47277, 18847, -12769, 6270, 12109, 14755, 2195, 26228, 19818, 349, -7012, 9947, 647, -15136, -3324, -39907, -55311, -21941, 24426, 8936, 8183, 6288, -18229, -16008, 1336, 23397, -8969, -34116, -46329, -56792, -41029, -56157, -29818]
15839b9818J2373K8439k363o428k991m422N409K3717j6051k7309J3623J5955m610
15826E524N045j882k5270J1617r234o780P970p622j5140m89j837o262j8832l739
15812f6931J1948K0421K0902Q016n861R621J033j0993n167P721o466j0863N290
15799b1329L27n39J8587P477j9637m789j0163O141J2623J6850j0854j7776P771
15786a5311K766l5681O351J82p320k674N579J9701J160J075M902J6748j6779j0139
15772b9440K6045K9797J1472j5981J0515j2226o624k6908j3922q384r58J1590
15760b5024J5396K6061j2459l3949l0979M854k5176k207J8836l5224k995J5965
15748h6901K1163N284K2785J7179J6178K4012L2312L780k0415k339m036Q7k1553
$$ y = [-29818, -17445, 10994, 8631, 2203, -788, -5210, 199, 23916, 7865, -19444, -5821, 10134, 5524, 10569, 8687, -16583, -4966, -14200, -20980, -13010, -20632, -35772, -36261, -38098, -44360, -63192, -66931, -54983, -34562, -13660, -5644, -11505, -1884, -851, -11844, -17011, -9290, -15756, -26619, -21329, -21002, -21541, -2954, 4523, -15114, -19903, -30066, -23925, -11302, 5548, -5306, -23082, -15311, -12545, -48226, -41875, -41693, -49013, -51687, -46108, -26407, -25247, -24172, -19270, -2522, -19301, -29440, -3395, 26402, 37874, 21893, 32408, 20182, 13558, -13350, -27272, -35656, -36614, -25024, -9628, 16433, 3974, -29975, -60954, -56100, -81276, -83483, -64647, -99871, -102866, -86901, -65738, -60454, -37669, -20490, -4312, 19700, 52012, 55792, 35377, 33038, 29002, 29089, 7536]
15735G536l2059m113N4175R284j7679M485l3951N801j249l1894j5387J9380P205
15722b8466K3691K7710M158j8293J4952Q782r560l181n81q236k5410l46K841j11
15708a2050J8513j4255r414j6872J924j0301j0159L5979r699j683O140j5059n980
15695d2916j1201K0797L6546O263r894k7820J7182o139K673j1456J1916Q446k3864
15682b9467j2122j085Q353J008k4865M248K5045K0995j0332j5851L6810K7450
15670C0187m6601l5269m89l133K239n856J1766L7614J3129J6213J2125j4376n011
15657A2538k6632o98M9147J0423k5124k0460J0763j4220k2589J1006J7187J2427
15645A3768r703k9126q219L6841R006p718j0421o957J4867J4389k0243J1573O549
$$ y = [7536, -24523, -28636, 25539, 34823, 17144, 21629, -12322, -6521, -7770, -39664, -55051, -35671, -28466, -4775, 22935, 27093, 8800, 23752, 32534, 22974, 19793, 19212, 10976, -14434, -14780, -11939, -12050, 6463, -7792, -17206, -34078, -32154, -42455, -52614, -16635, -26334, -28017, -21877, -36936, -42916, -54117, -33320, 3226, 9489, -405, -28225, -11043, -17182, -14509, -25965, -14049, -5603, -29467, -41589, -42674, -34321, -33313, -58178, -53930, -28885, -7890, -18222, -34073, 2737, 30187, -16414, -51683, -52172, -55305, -53066, -58922, -47156, -9542, 3587, 19800, 31925, 17549, 12538, -14094, -14792, 34355, 44778, 19654, -806, 9957, -4263, -26852, -15846, 1341, 13768, 4065, -25061, -33280, 3561, 12567, 4849, -5572, -12529, 2338, 16727, -3516, 8057, 14606]
15632A4606R734l420j9789O991K540n836P292O990J009K2869j6669k7171j7104
15619a7958k6376J7419K5076M841o798j8885J53Q898L2529J0444k027j4347j0970
15606A999r40n150J0706o377o552K258p698j7861n44K1174r715M317r984j2896
15592c7263j315J7643L603O656j8346l8844p035J2161L0039J3921k3762J7480
15580b5062J7768K4749J8282L005l9714k5607j470R978K0259P715J9538k4781
15568D660j6279J5490M751L2203O464l8140r183J6652J082K8566n050o59J7943
15555E8500k6560l4006k2371K4246K1064o304k0164J3817Q047J1921J7136k3576
15543B1750j7358K1899n229j4051q106J0065K8798m039j9685q264Q175o516N099
$$ y = [14606, 24340, 20920, 1131, 8122, 10662, 4826, 12118, 19108, 20117, 42986, 26317, -854, -17958, -44334, -26915, -1839, 3002, -3796, -22681, -22528, -13630, 18899, 29343, 27316, 12969, 1999, 1059, -4091, 6615, 238, -6314, -4056, -11754, -29615, -30159, -8985, -18700, -14383, -24367, -37263, -38578, -20935, -17332, -10676, -29022, -67866, -74901, -62740, -32701, -18780, -42542, -25062, -7294, 17455, 35737, 38742, -972, -26579, -28049, -18071, 2188, 9903, 29441, 4660, -11619, 3871, 8622, 40825, 47289, 9149, -34, 16618, 17700, 46266, 41216, 40557, 58500, 31940, -2066, -24437, -191, 20873, 14569, -5595, 8222, 16269, 28190, 45326, 21750, 4392, 26291, 21062, 7011, -1095, 8970, 37768, 33729, 14044, 5780, 13955, 7439, 12538]
15530A2538k1466j1752K3326J2645m378O772j8721p074L336J8670M538j5093k1264
15517a7923j9752n754j3481k346J9035Q161J4072P851P80L474K1398j0347j7612
15504a2444n502Q080L698L679j5684n369J5535N842N597j1747j7479o659R387
15491b3066K3910P709k1035j7875j0022k1619k817K7128K8994j802k6798j920
15479c9213K1014L950j5320n537k466o83J0240m812j9226L205R198K4856J9045
15466D251K1202l386j4063K2702m760j8515j2849J629J2498r069K47K1390p04
15453B0573j5588p248r781j4325R611n531K687J0758K2154J4236J1562L84j8358
15440B1134j4385J944j5125k489J225J0980J9355r556j1988k5214k3980r654K7267
$$ y = [12538, -8928, -20680, 2646, 15291, 10913, 17685, -1036, -8110, -4774, 13896, 18434, 3341, -17923, -37675, -43429, -56910, -59256, -40221, -32060, -17988, -10137, -9357, -5883, 15515, 5168, -12444, -17946, -9866, -6168, -2489, -18173, -23542, -8007, -2165, 3432, -8315, -25794, -32453, -23066, 844, 8553, -12482, -30357, -40379, -61998, -64815, -37687, -8693, -10495, -37293, -39213, -18199, -14249, -29569, -35106, -37572, -38255, -28015, -32827, -52053, -48848, -39650, -14794, 4251, 25453, 22067, 8004, 30706, 25946, 7431, -5418, -3789, 8709, -360, -113, 21277, 20573, 4985, -2263, -12044, -26369, -16758, -22289, -19602, -8844, 13310, 27546, 39108, 39492, 21134, 6749, 8693, -6432, -8921, -7696, 3284, 22639, 13083, 1095, -24119, -48099, -57753, -30486]
15427c0486K8588n857l8419J8283L2390p607k3636Q157J8670J2626k7741k5816
15415d0848M156K1496p189M058Q519J1154j8239r258J2082O737K4986k922j6698
15402a966j1504k5640n272K9404Q617J0016m162J429j0417j4946J5815K5666K7053
15389D4093O211n191k7693J857P350k6536O280k1250l380J5120j7179R334K9646
15376A8662K3065J699O088j3680l8916j6169o560j0602O756J8723M801J3941r20
15363F888M709L0502k6882j7807Q499j1653j4566J1513J3376K0214N265k9897
15351A61j6513Q597j5647j2644M9424K6805l9630l5932j6426k1303K7199L0958
15339a4951L1465K9311L775k3099J9192k0877n1643l7314K0792K0239L04M31j8659
$$ y = [-30486, -1898, -7755, -46174, -27891, 4499, -3108, -26744, -18587, 83, 12709, -15032, -40848, -36692, -15196, -22385, -18327, -9808, 1346, -16893, -26151, -14069, -7332, 17654, 14732, -1966, -13470, -39110, -44382, -14978, -6361, 3655, -507, 922, -9495, -24441, -8626, 17040, 44093, 50304, 45113, 17420, 19277, 26627, 91, 6371, -14879, -18259, -3139, -20318, -10984, 18662, 41727, 43426, 49514, 35834, -3082, -19251, -25811, -36413, -29657, -10934, -6133, 7808, 6888, 11597, 42099, 15217, -2590, 5909, -5744, -20310, -8797, 4579, 24793, 30058, 161, -16352, -7755, -23402, -36046, 13378, 40183, 553, -35379, -51805, -73108, -45909, -14951, 16514, 45825, 49600, 26501, 45693, 24816, -26827, -64141, -43349, -23110, -22806, -22375, -41034]
15326d1034K125L247k1915M774O300r536M031q247P101L5331j8471o743J9452
15313b3585K2666L917J6026k1078l5926J1578J1236j5165l622r63R101K7148M010
15300E343K0732O795m138k111m006r915J3850K2162q218o022k6637n2159m113
15287d8437K7388J5719j3O981M874J988J0495K172j0943j471M36k062J7390J3958
15273C8475k3567j1758m1508n349L1239M0674j1395k8473O907R732L0012K582
15261C7571k1225j3151q784j7607m6271k0019J6724K8216K3438O336L183j0702
15249b2291n628J3567m368Q700O730K5358j4394k1132j0105Q605J4447L399j6333
15236a3445K0744j565l1038j0847J4721K5130M5251J8327l6855m523q079n778
$$ y = [-41034, -38909, -35662, -57577, -52803, -46503, -56039, -52008, -60255, -53154, -17823, -36294, -43037, -23585, -919, 2998, 19024, -2054, -37980, -26402, -15166, -30331, -33953, -34916, -25815, 1333, 5343, 26075, 32870, 28732, 26621, 22615, 12700, 26550, 48712, 40494, 34472, 7835, -44324, -48437, -21049, -5330, -5343, 1638, 6512, 8500, 18995, 21167, 10224, 8753, 9189, 7127, 24517, 38475, 14908, 3150, -38358, -43707, -12468, 28206, 16811, -11662, -4755, 4977, 34989, 37571, 16346, 3195, -5589, -23196, -69467, -89486, -72762, -44546, -21108, -14772, -11589, -22291, -27919, -14352, -18720, -10020, -3290, 22068, 7674, -13458, -23563, -14958, -511, 2888, -13445, 7299, 5734, -25304, -36151, -21430, 3700, 48951, 67278, 30423, 25900, 17821, 12043]
15224A2043N917J1641p705j6912k983j4287j9117l948L8322K4509Q433k1384m622
15211I907k0620L788k175j0240m370Q468J6782j1026p969o110R856J2307J398
15198dQ219l960k1252j8816q221j2973N081J7673J055J403J983O811j4000o155
15184d3156J224J6128Q751l42J2673j8706j8340L183L7428R798r113l1437o44
15171c2553n014P393J0919j316j3008j0082k445j052O344o559P426J8163O364
15158a5420J8616j759O601k1532L532q524l7193L3130K4611o690j3691j3745J0935
15145b1129L3922J7229j0004j5165P361n19J0562Q441l312j8705k5032k0840p723
15132d4914J5320J0645J8642J3728O326K1736j8569k7146k676n27j2869k1133
$$ y = [12043, 17960, 29601, 21896, 4984, 2001, -12286, -31403, -35351, 2971, 27480, 35913, 14529, 9907, -10713, -6925, -9100, -19340, -23710, -15242, 1540, -9486, -17455, -23565, -13709, -1402, -4, 8215, 4255, -16997, -35813, -44034, -57007, -51926, -34253, -33198, -31795, -29812, -23001, -37001, -43156, -41932, -25804, -17053, -17395, -4722, -23428, -41768, -38585, -1157, 8641, -472, -31909, -32553, -37567, -30174, -19255, -20571, -33579, -43661, -46106, -47158, -40814, -47373, -39947, -21784, -15420, 3196, 1437, 8038, -13494, -9962, -18486, -55679, -22549, 2062, -4628, -18319, -32064, -21129, 12793, 30022, 20018, 4853, 12214, 11695, 22257, 30698, 27386, 8681, -16351, -37191, -44914, -29594, -18949, -307, 13421, 19747, 41483, 22914, -4232, -6908, -7435, -20304, -41437]
15120d1437L957L1420J4080P131p598J3382r405p509j4569K9344j799J7573o398
15107B8172j9397l1597J350M137o633J1006K9011R256j0876j208j0362l3394n2806
15094h3341j1296K6313J9045j1106K6244L2515J6428Q507l0856j9116M080N228
15082a7355n902r438J4992J2497p389K3059J6611p222l4180l9330j8272K1756
15070e0173J4675k8789k2617J5076N3940O4354J5988j7737l071k4533k244n009
15058I860j8018l62K7049K842K544O528j7173K3198O492o354j5840q323M922n08
15044A6857K83J1294n971J3408m800l5828J3256J9976j3258j7748m689l781Q530
15031b471J955k4295k4126j553J1445L0552j3190r21J0013j0371L422l246J1313
$$ y = [-41437, -37480, -6060, 8020, 15151, 7553, 20935, 11530, 4021, -10548, 18796, 16997, 34570, 28172, 8775, -22822, -21472, -17335, -23968, -12962, 16049, 25305, 14429, 13221, 2859, -30535, -83341, -94637, -68324, -49279, -60385, -34141, -1626, 14802, 23309, -7547, -26663, -22583, -17355, -23257, -32695, -17703, -5206, -12595, 10464, 27075, 19853, -14327, -53657, -71929, -50173, -35498, -64287, -86904, -71828, -17888, 46466, 62454, 44717, 41646, 17113, 14869, 9860, -8158, -8520, 18529, 21371, 23915, 30443, 13270, 36468, 42960, 36606, 20766, 12443, 17365, 16857, 17140, 28434, 22463, 35871, 31071, -4757, 8499, 28475, 15217, -2531, -7220, -11001, -2471, -516, -24811, -48937, -50490, -39045, -8493, -21683, -22604, -12591, -22962, -19540, -22786, -11473]
15018a1473O281L898K6613r383K1199J6743n055j7195J0573j3398k1026K7494
15006C5271K9456K5503P091j4721k5133R472J5358n540J6231M5531K6703P0226
14994B35448J00190K04810L57428N43667M68855l13750o29941l88230k21406j27743
14984B29328o5530l6858l2220k4421K9916M337k4068o2656j5002L624M734J4260
14972B5444l4864k3702K2138O950J4284K5514r367L556J0312P784K1516k5380
14960D4185k2596j5099J1044p227j9760K4299k3718j835J239m022K4101q658J5594
14947A7547O646l1661l657p120j6650J6449m284P03l154j0981k7066l4817J1021
14934h7024K6033L567k1577M659N8172J4263J4848K384k1789q137J889J9695K2411
$$ y = [-11473, -5192, -1294, 25319, 15936, 37135, 53878, 48823, 31628, 42201, 28803, 7777, 35271, 64727, 90230, 97321, 82600, 57467, 66939, 82297, 76757, 92988, 138519, 165222, 235448, 335638, 540448, 897876, 1441543, 1910398, 1596648, 966707, 578477, 357071, 229328, 163798, 126940, 94720, 70299, 100215, 104552, 80484, 17828, 2826, 6450, 11184, 25444, -9420, -33122, -10984, -4034, 10250, 35764, 26397, 29953, 40265, 48049, 69565, 44185, 21589, 6490, 17534, 10307, -9453, 14846, -8872, -10707, -9468, -13490, 10611, 1953, 17547, 24193, -7468, -11125, -18245, -34895, -18446, -22730, -22027, -25181, -36162, -63228, -98045, -87024, -60991, -57424, -79001, -74342, -16170, -1907, 12941, 15325, -6464, -14601, -12712, 6983, 29394]
14921B9394k1984j7121K3078J6531J2351K5969M664j367k1806l6605l9640j9856
14909d6392J1771N3868J2134q622l6477j5596q099J1534J7719K1932P917K313
14897B4002l6376k9071K5761j3774k069J1317L6708K0675k769r505k1108j8580
14885a4789j8689J0981N899j3202j1551J4620j8912K1388L2251j1742j5838m702
14873b4286l198M435J320m202k5966j4845L9396J2734r987l386P390J137l272
14860b2730P179m369K5637J6984j405L849j2260k7547J5974K7324M383l6011k6940
14847b9932P023j738l1573O358M4365K4946P480J2357j3231o060j3522n594j1591
14834a0712k5884n208J4243P442O588Q592N464j1619k0219r787J4414j2953J3503
$$ y = [29394, 7410, -9711, 13367, 29898, 42249, 68218, 72882, 71515, 49709, 13104, -26536, -46392, -34621, 19247, 31381, 22759, -13718, -29314, -37413, -25879, -8160, 13772, 21689, 24002, -12374, -41445, -15684, -29458, -31527, -20210, 16498, 37173, 34404, 24899, 3791, -14789, -33478, -22497, -16598, -29800, -41351, -26731, -45643, -24255, 7996, -3746, -19584, -24286, -27484, -23049, -21729, -25931, -51897, -66742, -27346, -14612, -24599, -27985, -20595, -19458, -22730, -15551, -19920, 5717, 22701, 21296, 25145, 12885, -14662, 1312, 28636, 33019, -2992, -29932, -22909, -24647, -56220, -49862, -5497, 19449, 26929, 39286, 26055, 19995, 6473, 879, -10712, -36596, -41804, -27561, -20119, -13531, -4939, 525, -11094, -31313, -41100, -26686, -39639, -26136]
14821b6136J8681j8045N612q091Q695L7193M533l0082L100J3594j4409j1954j0446
14808b7755r390r900M0843k025k1045J034j1435J76K7999J2872K875L3248K2509
14795F0006j7680q598l43j8758m615R519j7821k3384N327K609j84N839J4573P798
14781A4288J5548k829p808K636M596N44q918l2222j4777K1077J8735o459k2848
14768a8437J0091J8300l675j2721J5385j9028j6190P188M4245J2010P774k3691
14756B1251K712K676j6631n6459K0500L6906K8771j8783k8918J6097K6793k1576
14744A3339k2743R5R098J6179j5982j2223K5494j1678O977Q606l444J6047k1814
14731G951m3648J6314m437m9274P897M1726J6514J056Q591J7370K321q032K1407
$$ y = [-26136, -7455, -25500, -19888, -27979, -19284, 17909, 22442, -7640, -4540, 9054, -5355, -17309, -27755, -37145, -47045, -6202, -8227, -29272, -28238, -39673, -39497, -11498, 1374, 4249, 37497, 60006, 42326, 33728, 33385, 14627, 10012, 19531, 1710, -21674, -16347, -13738, -13922, -8083, 6490, 14288, 29836, 27007, 19199, 21835, 26431, 26975, 18057, -14165, -28942, -7865, 10870, 4411, -18437, -8346, 9954, 6279, -6442, 8943, -10085, -26275, -19087, 25158, 37168, 44942, 21251, 23963, 26639, 10008, -46451, -25951, 10955, 39726, 20943, -7975, 8122, 34915, 13339, -9404, -9309, -211, 15968, -14, -12237, 13257, 1579, 8556, 17162, 13718, 29765, 7951, -35697, -19383, -23820, -73094, -65197, -23471, -6957, -5901, 2690, 20060, 22381, 14349, 35756]
14718C5756r848p699o742k5558k2631j5084Q388K1857n4k0958l249N949J3730
14705b6143K8667J7381P134n61l2754k8199J198J6371P114L186M642O008J2711
14692A6755ol3199j9190J6924K3653J6950j5117j6461l628q535M725m295r220
14679c0644J7325J9503r52K3112o50P847J4806j0045j9460k3131J1657k2409M320
14666h721K8789j0535k3456J8783J4408K943l6907l7795J971L7550J7240L527
14654G797J4484k0507l3647J2361J332r346L0633J7432r948J5527J908q31J528
14641B8723J2750m14k2574J1547l6115j7434j6829O885J0566J2808J0422k1411
14629b1076k9992N917L801J6797k758J4227J1621J7049J704j6350r090j8316k9407
$$ y = [35756, 25908, 18209, 11467, -14091, -36722, -51806, -43418, -21561, -21615, -42573, -45822, -39873, -26143, 2524, 19905, 27039, 26478, -6276, -34475, -33277, -16906, -9792, -6606, -1964, 4044, 16755, 16749, -16450, -35640, -18716, 4937, 21887, 6770, -9691, -13319, -21854, -17129, -21424, -30644, -13319, 6184, 5232, 28344, 27694, 35541, 50347, 40302, 20842, -2289, 9368, -13041, -8721, 20068, 9533, -13923, 4860, 19268, 22211, -14696, -52491, -50520, -12970, 4270, 7797, 22281, 1774, -31873, -19512, -18180, -27526, 3107, 20539, 10591, 26118, 28026, 27195, 28723, 41473, 41059, 18485, 30032, -6083, -23517, -40346, -33461, -22895, -10087, 335, -21076, -51068, -45151, -41350, -24553, -27311, -13084, -1463, 15586, 17290, 940, -8150, -26466, -55873]
14616e5873K1526J2491j7258R135K5097J533K2324R111l2027J519J3924j8893
14604g391K2118j706M882J0173m0115k729J2208J5381r254K3303L3373l1971k5486
14591B786k0470J1053J5926R29j8671L7463L362k4030j3427k25j5801J4456K5119
14578A8470n779J14Q507J2786M21k3184J1445J6888J7012j3849o645q371L443
14565C1258p104K1924Q870J8485J913K0524K6454j2484l5041l853p176l646q655
14552E1469K4223k2955j2374J1892J2596J4005p672l5750l3291p902o749Q316
14540d192K7935K7729j4876N011j1596l0434M856j7387k3947N36K7595J6324K2310
14527B9864J6731k5391j5849K4520N773r944k9955n847k0802M935j562J4143J5939
$$ y = [-55873, -34347, -21856, -39114, -29979, -4882, -3349, 18975, 28086, -3941, -2422, 11502, -7391, 14727, 13021, 17903, 28076, -12039, -14768, -2560, 12821, 3567, 26870, 60243, 28272, 2786, -17684, -6631, 9295, 10224, -8447, 29016, 32378, 8348, -5079, -5304, -21105, -6649, 18470, 12691, 12805, 21312, 34098, 34519, 11335, 22780, 39668, 56680, 42831, 36186, 27815, 31258, 24154, 46078, 54948, 73433, 75346, 95870, 122324, 109840, 74799, 70946, 63770, 60124, 51469, 75692, 52737, 40363, 52255, 64851, 78856, 71184, 35434, 2143, -5759, -12508, -4192, 23743, 51472, 36596, 41607, 30011, -423, 4433, -12954, -36901, -36365, -8770, 7554, 29864, 46595, 21204, 5355, 29875, 35648, 25704, -4251, -10098, -30900, -25965, -27527, -13384, 2555]
14514B555J4502j854r792k2000j9125q257J641J5007N781J1995l015K0634J7530
14501B5602L3540j3034j8916p160M591j1548j0466K068R175l5810j7111J8809
14489b0260k400K1600R296oJ0550K3286j7849r062j7373J50L504j962l2932R465
14475b3993N251l500O576K2058L851J431J4491Q719K29j4529n047K7343j3114
14462B9766k6927j7646M019P242N36J2057p997j1575J5132R801p138n559K91L7449
14448C9451K6225k9235k0182J0194o944j722r382j7j4725j6304O804K8173J0097
14435B2433J3673M537l5919j4852J9355k356l344L0828J0394P661j3835J571n700
14422C4446q149J2309l912P02M324k061j2886L547J5751K3498p453m7762k4240
$$ y = [2555, 17057, 15203, 5411, -16589, -35714, -43971, -42330, -27323, -21542, -9547, -12562, 8072, 25602, 59142, 46108, 27192, 20032, 24623, 13075, 2609, 4677, 13852, -21958, -39069, -20260, -22660, -1060, 8236, 8230, 18780, 42066, 24217, 15155, -2218, -2068, 1436, -526, -33458, -23993, -18742, -22242, -15666, 6392, 10243, 11674, 26165, 34884, 35113, 20584, 15537, 42880, 29766, 2839, -14807, -10788, -3546, -3010, 9047, 1050, -10525, 4607, 14408, 7270, 1711, 2002, 39451, 65676, 36441, 16259, 26453, 19509, 17787, 8405, 8388, -6337, -22641, -15837, 12336, 22433, 36106, 40643, 4724, -10128, 9227, 6871, 3527, 34355, 44749, 52410, 38575, 40146, 34446, 26297, 38606, 34694, 35396, 39720, 37659, 24773, 28320, 44071, 67569, 60116, 12354, -11886]
14409a1886j8192J3870k374L293J201k870q191k7730k124K2731P368J1761k0319
14396c3462p883j6192K1295K6312J3418L1410j1342m865Q864K2268k5102k0607
14384D114k6808k549K3600L2864j8560k5492J271m249O402j3859J7201Q076p242
14371e231P754q186l42j6584j0151m587j8431L090q893J8802J4867L5017j7381
14358a0256n6209o441L5337M4739j9790l2218J508L1521J9527k1485O656K6236
14346A9125K7469q497k5643M942J0084j3459k8588k511O744J3217J2172j150j7505
14333c600j3279J480M9016j4400k0813L862Q862j1878J4903K6742k36K333l4601
14320H391m4626j420r929j2744L2290K8097j3129l7041K3053M6368m413j346K548
$$ y = [-11886, -30078, -16208, -18582, -15289, -14088, -16958, -25149, -52879, -55003, -32272, -24904, -13143, -33462, -41345, -57537, -36242, -9930, 3488, 34898, 23556, 18691, 27555, 49823, 24721, 4114, -22694, -25243, -1643, 31221, 12661, -12831, -11560, -15809, -9407, -23266, -6065, 2011, -5231, 2523, -5663, -6005, -22589, -32740, -37327, -55758, -52668, -61561, -42759, -27892, 7125, -10256, -66465, -72906, -37569, 7170, -12620, -44838, -43330, -11809, 7718, -13767, -7111, 19125, 46594, 38097, 12454, 17396, 27480, 14021, -14567, -17078, -10334, 2883, 15055, 13905, -3600, -16879, -15399, 33617, 19217, -1596, 2266, 11128, -750, 14153, 40895, 40659, 42992, 8391, -36235, -37655, -47584, -60328, -28038, 59, -13070, -50111, -27058, 19310, 14897, 13551, 16099]
14307A6099r807Q36J5708k3391J1819k778M3L755j832p523j9129l6819j4729L6485
14293c1263K2138M11J0306L433J2118J5162k8592k8969l672j2N045R247K738k800
14279a4710J7379J6521j3780J001J7865j1892l3732N333K0945p268p657Q798Q709
14266G512k1256L932r515l1149n392O56N062O226M1554M343J4084j5812n695J4480
14252I030j6937j181M182l732J5211J0573k3726j4572j6586J7310J3846r889k5500
14239d1971M592L0825L574j302j2913j9872k2730J9572L6124K9286j3024j6714
14227d553j1260J3707j5463K0766O149k9818q815K7869K7408k2398l0834M727
14215b2515J5728K3969J9865J3123J2000N302j927k9386j1999L6638J8308j0295
$$ y = [16099, 6292, 7128, 22836, -555, 11264, 8486, 8529, 12284, 10452, 2929, -16200, -53019, -67748, -31263, -9125, -8714, 1592, 5025, 17143, 32305, 3713, -25256, -28928, -28940, -23895, -14648, -11910, -14710, 2669, 19190, 5410, 6411, 24276, 12384, -21348, -16015, 4930, -2338, -9995, -1197, 7512, -13744, -9812, -19327, -50476, -55868, -55212, -50150, -43924, -2370, 1973, 16057, 245, -5450, 9030, -7907, -9088, -4906, -8638, 6573, 17146, -6580, -21152, -37738, -20428, -6582, -16471, -41971, -37379, -6554, -2980, -4282, -17195, -37067, -59797, -40225, -4101, 25185, 12161, -4553, -15813, -2106, -17569, 3197, 9346, -20472, -29287, -1418, 25990, 3592, -27242, -22515, -6787, 17182, 37047, 50170, 62170, 67472, 65545, 36159, 24160, 60798, 79106, 68811]
14203F8811j1561l7320j2862r961K0526m118j6207n112j3539P432K4219O218k7184
14190a0658j5469j1525O035J2211J9574L373R818o031j8805k6112q501M989M709
14177c6392J7414K6882L5246j6890m9340K54J8899K4764J9166R305K5029J7254
14165I1591k1701l3669l6487n296J5716q965l039J9943l635j3453m829K092J3025
14152A1293L300j3738Q825O151P073R5j3159J7107J5255J5308j7402k5079j088
14139A3941j3469m850J308J4083J2864j215J6934k174l7403J5148K2194m356l1302
14126A703l092n663n942J1618L0999L4127o908l6557k217L5962J1686J415k3809
14113D3322m3499j9183k4719j650J1426K4067J3764q716j4141M270J0330j2884
$$ y = [68811, 57250, 19930, 7068, -2893, 17633, 13515, -2692, -7804, -21343, -13911, 10308, 16526, -10658, -26127, -37652, -31617, -19406, 168, 3541, 13359, 7328, -11477, -37589, -46090, -41101, -36392, -18978, 7904, 43150, 26260, -23080, -22826, -3927, 20837, 40003, 49308, 74337, 91591, 69890, 36221, -266, -5562, 10154, 1189, -1850, 18093, 14458, 1005, -3824, -1732, 11293, 14593, 855, 9680, 15831, 22904, 22999, 9840, 26947, 42202, 57510, 40108, 15029, 13941, 472, -4378, -3070, 11013, 23877, 22662, 39596, 37422, 19, 15167, 37361, 33005, 1703, -1389, -7052, -12994, -1376, 29623, 63750, 56842, 20285, 18068, 54030, 65716, 67131, 43322, -177, -19360, -44079, -45729, -34303, -10236, 3528, -5188, -19329, -15059, -4729, -17613]
14101a7613M904K5302J0721j206K221J8370J4993j3046j342r191j4345M412K7546
14088E1726J3149j7480J2932J2783j3158j581R323J3953J2279K4081j3625m6296
14076E8086l777j3099n593m866j748K8190o633j8956m3245q169K650j48J0007
14063g301j1391n225j2132K4538L0448j64M108m504j3927R388K4203L0543k183
14050F6401m3287q399K5010r247J7849j5651j1700L917J6990q305j0425m476K132
14037B0809J9513m5270M076l597j8227j5798l63L1459J7545J1918j3795q281M2175
14024D2164J1766k2928J55J7371K822k0167l7892n527M6833K8338l226m5341k8797
14011a4429q344j5094J4111K3220k5672L672n288K2147J3431o947j9634K3481
$$ y = [-17613, -12709, 12593, 23314, 22108, 24329, 42699, 57692, 44646, 43304, 34113, 19768, 24180, 51726, 64875, 47395, 60327, 73110, 59952, 58371, 67694, 81647, 93926, 118007, 104382, 58086, 54309, 41210, 35617, 30751, 29003, 57193, 50560, 31604, -11641, -19810, -17160, -17308, -7301, -18692, -23917, -36049, -11511, 18937, 18773, 22881, 18377, 4450, 13838, 38041, 68584, 66401, 23114, 14715, 39725, 30478, 48327, 32676, 20976, 24893, 41883, 33578, 23153, 18677, 20809, 40322, -4948, -872, -4469, -22696, -38494, -38857, -7398, 10147, 22065, 8270, -11, 42164, 53930, 31002, 31157, 48528, 51350, 31183, -6709, -12236, 34597, 62935, 59709, 14368, -14429, -22773, -37867, -23756, -536, -26208, -22536, -27824, -5677, 7754, 807, -18827, 4654]
13999D654M351J8821jj6416j8713j4273j16l0017j6782L2484K9462K8035j0631
13986A0858k3331K0710r590k5164m161P322Q555J3389J8018K276m0993o715J7051
13973a1775J7784L659k8795k3070J8231M514R704n366k6008j8287L9867L2434
13961A2892n639Q290R946l051j0597m0623m389K2672j6714J8020J3950q495J5421
13948A1683j1110q50M8223p624k0946j832J891O690J8547J5712j1703j5040O377
13935D0018q879m648k8935r327L172K4626j115j4670o455R988O0295L0599j4862
13922G9807l6807k1813M2948k831k0370m889J0024q554j3052K889K360j5987J5996
13909B9721R43k5258k3116K4930J1117k2663K036M0980R077j1685j1955k2817
$$ y = [4654, 9005, 27826, 27825, 11409, -7304, -21577, -21693, -51710, -68492, -36008, -6546, 21489, 10858, -12473, 8237, -1353, -26517, -30678, -23356, -14801, -1412, 16606, 18882, -22111, -28826, -11775, 6009, 9668, -19127, -42197, -23966, -19452, -9748, -15114, -41122, -59409, -19542, 12892, 7253, 15543, 25489, 22438, 11841, -28782, -33171, -10499, -27213, -9193, 4757, -3738, 11683, 573, -277, 47946, 40322, 19376, 17544, 19435, 26125, 44672, 60384, 48681, 33641, 40018, 31139, 26491, -2444, -11771, -8599, 16027, 14912, 242, -6213, 3775, 64070, 94669, 79807, 43000, 21187, 64135, 61304, 40934, 36045, 46069, 37515, 24463, 27352, 29712, 13725, 29721, 30664, 5406, -17710, 7220, 18337, -4326, -2290, 38690, 47767, 36082, 24127, 1310]
13897A310L905j3301k0214J4430K1617j6789K3558L9420j1170l0576n1933k6642
13885f6385K2620L3556n863J1246L0809J6370r161J8387K402j3901q251K943K1103
13872E5875r711j4342J3667J9901o754j8832j5706J3673J1811j5989Q84j2669
13860B1808m340J7794R285j5342j13p109K4257K616j2721J0885j862j5436K2802
13847E2524j0800j4911K0768k893l3099L283n041k6964M133j168L1440q668n998
13834B606J0639j351J0931J6586l997l0848J7435L8106Q0r349k4924n498j4556
13821E860k5070N527O648N426K2662j4512p228J34K4722n019j1149O155l88j2974
13807G94o898J3292j0432j048J287O71Q360K5284L5855j6888l9378m8970j7242
$$ y = [1310, 5215, -8086, -28300, -13870, 7747, -9042, 14516, 53936, 42766, 12190, -39743, -66385, -43765, -10209, -16072, -4826, 25983, 42353, 33192, 51579, 53981, 40080, 31829, 34772, 55875, 46164, 31822, 45489, 65390, 58636, 39804, 24098, 37771, 49582, 33593, 34477, 21808, 17468, 35262, 44547, 29205, 29092, 21983, 46240, 48856, 36135, 47020, 45158, 29722, 52524, 41724, 26813, 47581, 44688, 11589, 14872, 9831, -17133, -13000, -14168, 17272, 8604, 2606, 13245, 11894, 22825, 39411, 35414, 4566, 22001, 60107, 60187, 50838, 25914, 20416, 5860, -19210, -13683, -7035, -1609, 21053, 6541, -687, -553, 24169, 19150, 8001, 14156, 13768, 794, -6104, 7188, -3244, -4292, -3005, -2334, 6026, 31310, 67165, 50277, 10899, -38071, -55313]
13794e5313K1840J9225L798k3004O218q204l9181J430K6409J2885J3983M0014
13782B0100M0878q058j5823j9107l669n666P129J0217O394K211m816l2247j4824
13769a7281O8j8101L543L0260M787k0298L476N00Q228N550j765K1274K8837k132
13755D6946j0849K4969l434j166M328K614j2130l820K1247P822J9115j2652j8248
13742F4742k1565J2442j4603j2862N3K3939j6134J467o818j8701m929K0893j3444
13729A4480j1600n703Q490k4511k560K1563p066j5173N25L999P550J4747K811
13716G552j562k3902J6264J8119J6913J5336k1315k0943r654m1418O478J1211
13704b6921j5677K2602K1151K1546L738M541J6454P581j2239k31J4269N880j4496
$$ y = [-55313, -33473, -14248, -10450, -33454, -27236, -35440, -74621, -73191, -46782, -33897, -19914, 20100, 60978, 52920, 37097, 17990, 14321, 8655, 15784, 26001, 32395, 34606, 29790, -2457, -17281, -17213, -35314, -31771, -1511, 3276, -17022, -13546, -13046, -4818, 732, -1033, 20241, 49078, 46946, 36097, 61066, 57632, 56466, 60794, 63408, 51278, 47458, 68705, 76527, 95642, 82990, 64742, 43177, 55619, 41016, 28154, 28207, 52146, 36012, 37479, 30661, 11960, 7031, 27924, 14480, 2880, -2823, 5667, -18844, -21404, 159, -6907, -22080, -21555, -17556, -10006, 4741, 7552, 5990, -17912, -1648, 16471, 33384, 48720, 27405, 6462, -3192, -44610, -38132, -26921, -42598, -19996, 1155, 22701, 26439, 30980, 47434, 55015, 42776, 42545, 56814, 62694, 48198]
13691D8198j3787k2377K349j1153j9737p245J2596K0850K409Q68q998M5087R241
13678E8301j049j7614r840k6024k06K1632N738r832K767L9845J8250p099l1211
13665D3658k8971N246p668j8033k4983j2649J8053L3547n998J52l4693M687K6867
13652g85R880r26n859j3082j6339j0673P299K1491K3880k1947l5679l801J9192
13639b7349M5472L6566N994j6761l9406l66J5791O811Q74r121l1156j276L4600
13626B0673j8856K650P29q803J9744L763j7807J5708k392j6106K2836j250R583
13613C0472j171k1914o714L8979R161j151p394P58j388p64J2930m05l4663k597
13599A4139K6242j9476j8842K6208K8951l119r617O755O14J287K0330r158j0219
$$ y = [48198, 34411, 12034, 14383, 3230, -16507, -23752, -11156, 9694, 12103, 12971, 3973, 49060, 58301, 57252, 39638, 29798, 3774, 3568, 25200, 30938, 21106, 23873, 63718, 81968, 74869, 43658, 14687, 19933, 12265, -5768, -30751, -43400, -25347, 8200, 2202, 2354, -32339, -27652, -785, 9095, 8169, 2310, -10772, -27111, -37784, -30485, -8994, 14886, -7061, -42740, -46541, -27349, 18123, 54689, 60683, 43922, 4516, 4150, 19941, 26752, 27626, 18505, -12651, -13927, 20673, 1817, 4467, 5196, -3607, 16137, 19900, 2093, 17801, 15409, -697, 22139, 20889, 30472, 29301, 7387, 673, 39652, 48813, 47662, 40268, 41026, 39638, 38874, 51804, 51399, 16736, 14139, 40381, 20905, 2063, 28271, 57222, 54103, 44486, 51241, 51855, 53142, 73472, 64314, 54095]
13586E4095l8689k5224J5310K4563n942J9697K3450l0277l9209j3857J8319M530
13574F766n219l475J0045K2161Q623R668j5206n023J1775p649K349K5083M3000
13561A02898J810l3860k3075j0316J2800o232k2004J0613K4096r04J4827k9187
13549D1466p118m799j9461k2479k354L1022R360l004K1120k1499m3K4019l145
13536D3085k8318q812l640r945o443J6443K4608J2798p696j4091j3509l0860R455
13523a6925L5557m477j2836L1942q048j7924P668J7941J4064j2642J0523Q639
13511E3482n0l5630j7503R05j0280r36K0861j0974j651n641N688J5682Q541l0285
13497g791k0389J4889j4222Q213L6151J6106L5996q170k5974J5373J1798j2929
$$ y = [54095, 15406, -9818, 5492, 30055, 24113, 43810, 67260, 36983, -2226, -16083, 2236, 6766, 1547, -1928, 8117, 30278, 38901, 48569, 33363, 28340, 40115, 32466, 34815, 59898, 102898, 104708, 70848, 47773, 37457, 50257, 44025, 22021, 32634, 56730, 55826, 70653, 41466, 34348, 29549, 10088, -12391, -14745, 16277, 25637, 22633, 43753, 22254, 22211, 46230, 43085, 14767, 5955, 2315, -7630, -14073, 2370, 26978, 39776, 32080, 17989, 4480, -26380, -16925, 18632, 14155, 1319, 33261, 25213, 7289, 14957, 32898, 46962, 34320, 44843, 53482, 53432, 17802, 299, 1204, -9076, -10012, 10849, -125, -1776, -7417, -1729, 13953, 22494, -7791, -28180, -13291, -27513, -19300, 16851, 32957, 68953, 60783, 34809, 50182, 61980, 49051]
13485D9051m4469j8878N839N749M381j0483m440J5432J8890j8107k8550j1582
13473c7167J5559K1134j1071M153n600p171K6889K1371k39k7903J6573L2568q387
13460D0709n1173j2082L7423K4658J8035k4563j6382J5095l917J5499m213o2754
13448b3665P342L8053M75K028J0462l752j6215j6350n778J0888J1533K031Q326
13435B5378j216o100L4973K4163p115q683l5815l9608K6362K0456j8991k7603
13423a3799M49K1113N894J7043Q287l9928l7910J7660Q261m87J0979Q918J8084
13410B4564J6169K348j5850p563K4070n607l3583k7101J0859K7179J5286j368
13398B9403j3820j2669q336k5574j319N2519O316k5027l5824j457k5490j6375
$$ y = [49051, 4582, -14296, -8457, -2708, 1673, -8810, -13250, 2182, 21072, 2965, -25585, -37167, -21608, -474, -11545, -7392, -12992, -20163, 6726, 28097, 27858, -45, 16528, 49096, 40709, -10464, -22546, 14877, 39535, 57570, 33007, 16625, 31720, 27803, 43302, 39089, -23665, -16323, 21730, 22205, 24233, 34695, 30943, 14728, -1622, -7400, 3488, 15021, 17052, 25378, 24162, 18062, 53035, 77198, 70083, 61400, 25585, -14023, 12339, 32795, 13804, -13799, -13350, 7763, 13657, 30700, 38987, -941, -38851, -21191, -12930, -13417, -2438, 6480, 24564, 40733, 43081, 27231, 19668, 43738, 38131, 4548, -22553, -11694, 15485, 30771, 29403, 15583, 2914, -5422, -30996, -32315, 20204, 26520, 1493, -34331, -35788, -61278, -77653]
13386g7653M7360J5901m63K7116K5558M872k2684n365L0427K3491j8226j0493
13374C9841J2563k7837j8279L4967N96q021L407K00N249J4668O587m7519k6136
13361i714k7542j658K2308J3413k0330K3187K5120M630J2437J0725m191k6095
13349B2290J3100J2970J842k9708k3513J0668k1076k0094Q322K4698M3778k9143
13337A4134o710J3943K3898j1197k9889Q296K3296Q446j7684k5480j7955P842
13325i060J5943J4327J7046j8930j1330N338Q761j7823k962L0655J5228j2346
13313C4847R768J9418l302m5559l6726O818J0130N087L7433Q498k8494n0602j40
13300c2824J2286L068l411p656j138J7630L0530K1358K2673n735p4j5373j3233
$$ y = [-77653, -30293, -14392, -14855, 12261, 37819, 42691, 20007, 14642, 45069, 68560, 50334, 39841, 52404, 24567, 6288, 41255, 41851, 33830, 37237, 37437, 42686, 57354, 63941, 16422, -9714, -37256, -38914, -16606, -3193, -23523, -336, 24784, 29414, 41851, 52576, 48385, 22290, 35390, 48360, 50202, 20494, -3019, 7649, -13427, -33521, -25199, -501, 43277, 14134, 7424, 21367, 45265, 34068, 4179, 12475, 35771, 44217, 26533, 1053, -16902, -9060, 6883, 21210, 38256, 19326, 7996, 13334, 22095, 4272, 1310, 31965, 47193, 34847, 44615, 64033, 60731, 15172, -21554, -14736, -4606, 481, 37914, 46412, 17918, -32684, -32824, -20538, -17470, -20881, -28537, -29675, -12045, 18485, 39843, 62516, 56781, 56707, 41334, 28101]
13287B8101k6466p919K7418J9586N059k8350n581j0461K2878L9957j877j6458
13275D5887j9509k0299j1269J2762k2827j1449J6000L1949j3589l278J8697j301
13263B1774K3352j8257l0700J2211L1128J9030q845Q629j4740J5842j1992k0957
13251B6475l068J1209J3836o996j1721l2261j3018K588L0692J9942j5300l3001
13239a0623J0970P952J4990J3262K510j001k5534j1247k57o507j2265l484K2793
13226A559K7142n356R241K1692j4866j9324M00j3054p078K6237r482P113J7977
13213D2201P119J0169M770M537j5741M207J0033p344k2511o220J7817q833J004
13200D1208J6393j32q246k1241M48Q365R81M4156k0530l7502j1319O651k9653
$$ y = [28101, 1635, -6284, 21134, 40720, 45779, 17429, 11848, 1387, 24265, 64222, 62345, 45887, 26378, 6079, -5190, 7572, -15255, -26704, -10704, 21245, 7656, 4378, 23075, 21774, 45126, 26869, -3831, 8380, 39508, 58538, 49693, 58322, 43582, 59424, 47432, 26475, 23407, 34616, 48452, 41456, 29735, -2526, -15544, -12956, 17736, 37678, 22378, -10623, 347, 8299, 23289, 36551, 39061, 38060, 12526, 1279, 1022, -5485, -17750, -21234, 1559, 28701, 23345, 32586, 54278, 39412, 20088, 20488, 7434, 356, 26593, 17111, 24224, 42201, 49320, 59489, 64259, 68796, 53055, 57262, 67295, 59951, 37440, 31220, 49037, 40204, 41208, 57601, 57469, 49223, 27982, 28430, 36795, 37776, 81932, 61402, 23900, 12581, 19232, -10421]
13187a0421k0364K2567J7618m917j3598j8770J6048K6464L2480M167M359l58j0841
13174D4434k6428j1670K0379K0290K6873M2368j890j654l9143m1286M422P372
13162D4067J2128K560k4643k2107M376q710L6006J8919R08J7964J8415L4913J1136
13149A45932o492n2075k1214j02q780p325j0710k149q074N974J9614K359r460
13136D7498R438P236K2576J0674J8738K8865Q092l3933l8150N520J6846j1698
13124I1702l8044P39L0604K1139R779j9521m1018k6122j0192J3549L7372M198
13112G4185l3426R91L3929K3824j161O000q261l6194J5498J028J8579q570K2210
13099A08632J3102l3076k8041k4588j948K275N528O655J792m491O247J4121n514
$$ y = [-10421, -30785, -8218, 9400, 4483, -9115, -27885, -11837, 14627, 47107, 51274, 55633, 55275, 44434, 18006, 6336, 26715, 47005, 73878, 116246, 114356, 112702, 73559, 32273, 36695, 44067, 56195, 58755, 34112, 12005, 16381, 7671, 43677, 62596, 63504, 81468, 99883, 134796, 145932, 139440, 87365, 66151, 66049, 57269, 49944, 39234, 37085, 29011, 34985, 54599, 56958, 47498, 56936, 64172, 86748, 97422, 116160, 145025, 153117, 119184, 81034, 86554, 103400, 91702, 53658, 54397, 85001, 106140, 115919, 96398, 55380, 29258, 19066, 32615, 69987, 74185, 40759, 41750, 75679, 99503, 98342, 104342, 96081, 59887, 75385, 76413, 94992, 86422, 108632, 121734, 88658, 60617, 36029, 34081, 36356, 41884, 48539, 50331, 45840, 52087, 66208, 60694]
13086F0694n21j90N42K3575J7882k5845j5147j4411K6390O190q854Q907P483r344
13072G7351l2865j0967Q272R838N157q434k0381J2135L209Q595J7553J1492K2056
13059A03011K1803j805j5486l3943r662K94j1247N507r889K262L922J9240j61
13046G3846j3123J647J509R039j2117M375J1319L090K986o556j293l924m408L6099
13032A02489K3931M985O647m558j9592j4201k3662q299J6849J9104K4119m058
13020A23754k6514j521j5040J3326J2847K3090K0791M585l466j110K5704P065
13008A83511J5883J4896R710p181k5630l0922J1689L2734l1391j7260J3398j6434
12996A53003j2406J5570r981k0927N893r446q545k7805J6071O893M13J1443K5429
$$ y = [60694, 60173, 59983, 60525, 84100, 101982, 76137, 60990, 46579, 72969, 79159, 70305, 79212, 86695, 77351, 44486, 33519, 41791, 51629, 56786, 48352, 27971, 40106, 43315, 51910, 69463, 80955, 103011, 124814, 123009, 107523, 73580, 63918, 64212, 52965, 58472, 48583, 50845, 54767, 74007, 73846, 60723, 62370, 63879, 72918, 60801, 65176, 76495, 79585, 82571, 76015, 74722, 70798, 66390, 102489, 126420, 131405, 138052, 133494, 113902, 99701, 76039, 67740, 84589, 103693, 127812, 123754, 97240, 95719, 80679, 94005, 106852, 129942, 150733, 155318, 151852, 150742, 176446, 183511, 199394, 214290, 224000, 216819, 191189, 160267, 171956, 204690, 173299, 156039, 169437, 153003, 140597, 156167, 146186, 125259, 131152, 121706, 113161, 85356, 101427, 108320, 108733, 120176, 145605]
12983A45605K0989L8251K0178L9205L1519N5962O5406Q2021J11571J32871J17730
12972H61308R4626J12048M8883k9271p3904r5731q5588j26627j35697j15302p7904
12961C76841n9277m7128n8948o3489o816j2031j2724j1566m294J7750L174j7103
12949A04389M14O575l3794j7751j0849j0509J3480K0992K318O858K2853K354j5799
12936I1531j1141O094O696J5783J2460K0830m9299j7775m2879j5318K9987J4544
12924F1513k1702j977J9259L0160j4980k4507P407K7388J9750k9759j449r232
12912F1871M780q687O489J7728J4679k0706m540L659l691q372n759J6256R924
12899H3631Q763k0140j5908J7617q473M286j91J8170K1053P439q741J0683k92
$$ y = [145605, 166594, 204845, 225023, 264228, 295747, 351709, 417115, 499136, 610707, 743578, 861308, 955934, 1067982, 1116865, 1087594, 1013690, 917959, 832371, 705744, 570047, 454745, 376841, 317564, 270436, 211488, 147999, 141183, 129152, 116428, 104862, 100568, 118318, 121492, 104389, 104803, 111378, 77584, 59833, 48984, 38475, 51955, 72947, 75265, 82123, 104976, 107330, 91531, 80390, 86484, 93180, 108963, 121423, 142253, 92954, 75179, 32300, 16982, 46969, 61513, 39811, 37834, 57093, 87253, 72273, 47766, 55173, 82561, 102311, 72552, 71103, 61871, 66651, 57964, 64453, 82181, 96860, 76154, 71614, 75273, 71582, 63210, 57451, 73707, 83631, 92394, 72254, 56346, 73963, 65490, 69776, 69585, 87755, 108808, 116247, 107506, 118189, 117897]
12886A17897j5606k846K027R363Q799J8577q495j7052J964j6453L418k1240r387
12873G0966J5682j1416n600l045J1051J992q548k8957M102J0781Q493M0k2985
12860D2556j1152N88J1862O1261J2567j7458J9991Q230M489j2556O527o016J844
12847A22733m198k5757j7845R695K6920J4686r774j3857m45K1906J44J7826j1720
12834A30314n520O215J6375j903k2389j7555M606J0444P801j5109j3476j2468
12822H7335Q290J682J099j9612O381M1592J970p874O886K9618Q37O725K2335p614
12808A79650j6867P496p16K7093L6550J7653j1892J450l255J0309j056o125j7105
12795B23185p3011r211J5499k1844K045p146j091J4156K2596l450j5959j9217
$$ y = [117897, 102291, 99445, 101472, 110835, 119634, 138211, 129716, 112664, 114628, 98175, 101593, 80353, 70966, 86648, 75232, 69632, 66587, 77638, 79630, 71082, 42125, 46227, 57008, 65501, 65541, 42556, 31404, 31992, 43854, 105115, 117682, 100224, 120215, 128445, 132934, 120378, 126905, 120889, 122733, 118535, 92778, 74933, 84628, 111548, 126234, 116460, 102603, 102158, 124064, 124208, 142034, 130314, 124794, 131009, 147384, 145481, 123092, 105537, 110143, 120587, 128388, 113279, 99803, 87335, 95625, 97307, 98406, 78794, 85175, 126767, 128737, 120863, 127749, 157367, 158204, 164929, 187264, 179650, 162783, 170279, 169563, 196656, 233206, 250859, 238967, 240417, 237162, 247471, 246415, 240290, 223185, 150174, 140963, 156462, 134618, 136663, 129517, 128426, 142582, 165178, 161728, 145769, 126552]
12783A26552O296j476P671j6517m0757j4469Q279M0085O197k7R236o585K4903
12770A49388J0400k6822j8108L4985K9965l771n866q209l4896k3907q370l29K4935
12757A19395J7871K8297j2914l3083N943K163k7182l41q982L275K6941M7500R397
12744A78280P148K416k801R518L2739L1366k186J5086J8238k2607k8096k153J7938
12731B54886J822k8044Q405j17j8681j2258k5651j0609K4507J658k0679L4247
12719B09486R734j2361p149K2069J638J2540K6881n667k9427J0622P133j2973
12707B32526k3769K901j0137j3407Q338j0013J3865o245k212K3743J89K1017K025
12694B38821O679Q938K136N717r738j2477J511J6420K0715q749K62K7377M7258
$$ y = [126552, 132848, 131372, 139043, 122526, 81769, 67300, 75579, 115664, 121861, 121834, 131070, 124485, 149388, 159788, 132966, 114858, 149843, 179808, 176037, 170171, 161962, 127066, 103159, 94789, 94460, 119395, 137266, 165563, 152649, 119566, 125509, 127672, 100490, 100149, 91167, 94442, 121383, 168883, 178280, 185428, 187844, 185043, 194561, 227300, 258666, 256480, 271566, 289804, 267197, 239101, 236948, 254886, 256708, 228664, 237069, 236952, 218271, 206013, 180362, 169753, 194260, 195918, 175239, 209486, 219220, 206859, 199710, 221779, 223417, 235957, 262838, 257171, 227744, 238366, 245499, 232526, 208757, 211658, 201521, 188114, 196452, 186439, 200304, 194059, 191847, 215590, 215779, 236796, 238821, 245500, 254438, 256574, 262291, 252553, 240076, 241587, 258007, 278722, 269973, 270235, 297612, 344870]
12681C44870J8400J6883L261N7348Q6964P1751M1371J5047L2395K5887j8520n2631
12669F43026o9311l2143j0100J6068Q32p413j8618j7337j8903j3278J7851J3626
12657E04300j4426J1934J1593j2464O383Q913L7417K8638l366K7584j5675o193
12645E84638J9319J9345j4252J3561K9544O1898N6673L4221J2031K3940M9643
12634H90561P7388N7441P4329P8247J09052J07111J02833P1540J09097J65565
12624A843164J97154K99171M20992O15618Q83794J225607J426794J404109J121707
12615I438110J057856J009338M87352m49345j014052j066053j082779j316724
12607G063703j395375j170383q18179n53175l71894k36330j49838p7980q7345
$$ y = [344870, 363270, 380153, 383414, 440762, 527726, 599477, 640848, 655895, 688290, 714177, 695657, 643026, 573715, 541572, 531472, 547540, 548372, 540959, 522341, 505004, 486101, 472823, 490674, 504300, 489874, 501808, 513401, 500937, 507320, 516233, 553650, 582288, 578922, 606506, 590831, 584638, 603957, 623302, 609050, 622611, 652155, 714053, 770726, 804947, 816978, 840918, 890561, 967949, 1025390, 1099719, 1177966, 1287018, 1394129, 1496962, 1568502, 1677599, 1843164, 2040318, 2339489, 2760481, 3376099, 4259893, 5485500, 6912294, 8316403, 9438110, 10495966, 11505304, 11992656, 11543311, 10529259, 9463206, 8380427, 7063703, 5668328, 4497945, 3679766, 3126591, 2754697, 2518367, 2368529, 2290549, 2203204]
12598B203204j8045J931j5505Q310k2232L3J0444J9667M2024O5085N2718L1506
12586B379140O7896R5709P6563J01961R9404J19850J54872J53511J78633K06521
12576C634060K68541L17763L54225L68738M47007N48398O79515Q35420J036629
12567H490296J219078J280523J370822J507452J636247J700833J829358K180951
12559B1215560K869356M001916N703122Q393986J2434515J7923468K3633798K6541027
12551A22716748K4359789K0251743J9039580J6421330M377176j1912854j9861629
12544A75391883k0015586k1646061k5582240k5695337k0830596j4761461r925368
12537C6935234o652076m617957l361454k488094j853919j561481j568790j559696
$$ y = [2203204, 2185159, 2187090, 2171585, 2179895, 2157663, 2157696, 2168140, 2187807, 2229831, 2294916, 2347634, 2379140, 2447036, 2542745, 2619308, 2721269, 2820673, 2940523, 3095395, 3248906, 3427539, 3634060, 3902601, 4220364, 4574589, 4943327, 5390334, 5938732, 6618247, 7453667, 8490296, 9709374, 10989897, 12360719, 13868171, 15504418, 17205251, 19034609, 21215560, 24084916, 28086832, 33789954, 42183940, 54618455, 72541923, 96175721, 122716748, 147076537, 167328280, 186367860, 202789190, 207166366, 195253512, 175391883, 155376297, 133730236, 108147996, 82452659, 61622063, 46860602, 36935234, 30283158, 25665201, 22303747, 19815653, 17961734, 16400253, 14831463, 13271767]
12529A3271767j374981j268412j236162j200208j062958q62056o75575n94059
12521D997356m71631l56943l31120k57901k18911k06189k25467k08300j84198
12512B536696j80504j67273j88104j73782j29088j00182j03177o5688m4069q4400
12502A300429o7484k2118n6099m9251j0983m0670o2258o3225n9154o7149o4377
12491G37661m8549k0829j0573k1646m3633k5461j9490j5201K350q386K4347j2217
12479E38373n21K9905j2056m019k4289n4226m0629p533K3423M083m7041m1871
12467C63599l8678j4382J5875N689L6939J1740m712j1065L452j6086k6376j5234
12455C10761n2881j136K4785L488j8990j6285l2086o039n184L174J0106L965J5586
$$ y = [13271767, 11896786, 10628374, 9392212, 8192004, 7129046, 6266990, 5591415, 4997356, 4525725, 4168782, 3837662, 3579761, 3360850, 3154661, 2929194, 2720894, 2536696, 2356192, 2188919, 2000815, 1827033, 1697945, 1597763, 1494586, 1428898, 1384829, 1300429, 1232945, 1210827, 1154728, 1105477, 1094494, 1053824, 991566, 928341, 869187, 802038, 737661, 689112, 668283, 657710, 636064, 592431, 566970, 547480, 532279, 534629, 526243, 550590, 538373, 537852, 567757, 555701, 551682, 527393, 473167, 432538, 425005, 448428, 452511, 405470, 363599, 324921, 310539, 326414, 332103, 369042, 380782, 376070, 365005, 368457, 352371, 325995, 310761, 257880, 256744, 281529, 285017, 266027, 249742, 217656, 211617, 206433, 209607, 219713, 223678, 239264]
12442B39264K7978K0362j2940k7516n484J5477K861k5661k2243r671l045J642
12430B01024j5016l8858m4060n8158p2126j6183O571m784j3195L970K8958L4177
12418A2320L1135K2382M0965j2453o032K5724P149j8144k558k733j4358J0727
12406I4124n339k9792k3451o552M0339L2431l818J86M850N48m06K950J4435P356
12392A27861J9908J4922j9915l0122k7340l7388L861O450K3834r768J7762J0011
12380A00076L8556J146Q948K4854J4997j2349k6412Q931m375K122j6013J417q64
12367A41034m564j7437K9525K2340K683l150J6452L9251L4063r34O420K3793L0346
12354C19822k574j2852o8599j6485p008j5376k5808j7888m919n3941o731R986
$$ y = [239264, 267242, 287604, 274664, 247148, 241664, 257141, 260002, 234341, 212098, 202427, 199382, 201024, 186008, 147150, 103090, 44932, -27194, -43377, -36806, -41590, -54785, -50815, -21857, 12320, 43455, 65837, 106802, 94349, 88317, 114041, 121190, 103046, 100488, 97755, 83397, 94124, 88785, 58993, 35542, 28990, 69329, 101760, 97942, 98128, 102978, 103526, 103120, 106070, 120505, 127861, 147769, 162691, 142776, 112654, 85314, 47926, 51787, 58237, 82071, 72303, 90065, 100076, 138632, 139778, 148726, 173580, 188577, 176228, 149816, 158747, 154372, 156494, 140481, 141898, 141034, 136470, 119033, 148558, 170898, 173581, 170431, 186883, 226134, 260197, 259263, 265683, 289476, 319822, 317248, 304396, 235797, 219312, 212304, 196928, 171120, 153232, 148313, 94372, 87641, 97627]
12342I7627k4777q52O47l419o529J0011J6101j6793l3583o787K0306K9460N089
12329H6501k9512P186R680l3768o356J1767J7792J4002L675k3956l4316k6922
12317d227Q462J3784N951M027k9744o620p092K1063O82K2737J5291L8927J9403
12304A02644j8310k5345j753Q453J0478R011m987J4986J3387K947k7955O896J4601
12291A05053l8347Q838J1573j8044l3467N125K127n274j1701J2883J3436j133
12279E1069O870K8898Q008j2940L328Q18j8709j4276N905K3556M238k5584r517
12266E1664J4567M686J7977l5309K312n896k3176l818J694k739N436l859j7881
12253E658K394k5214O89Q013K2769N0870J0005k6926j7976M177k485j6549J2203
$$ y = [97627, 72850, 71998, 72645, 69226, 62697, 72708, 88809, 72016, 38433, 31646, 51952, 81412, 86501, 56989, 64175, 73855, 40087, 33731, 45498, 63290, 77292, 80967, 57011, 22695, -4227, 4235, 18019, 23970, 27997, -1747, -8367, -15459, 5604, 6286, 29023, 44314, 83241, 102644, 84334, 58989, 57236, 65689, 76167, 85178, 80191, 95177, 108564, 111511, 83556, 90452, 105053, 66706, 75544, 87117, 69073, 35606, 40731, 42858, 37584, 25883, 38766, 52202, 51069, 57939, 86837, 94845, 81905, 85233, 86051, 67342, 53066, 58971, 82527, 86765, 61181, 51664, 66231, 70917, 88894, 53585, 55897, 50001, 26825, 23007, 24701, 21962, 27398, 23539, 5658, 8052, -17162, -16473, -8460, 14309, 65179, 75184, 48258, 30282, 34459, 31974, 15425, 27628]
12240B7628K761M645K8196K5904k7285l0570K1596m883k1015r561P956J9922r22
12227D4372k2176m6510j3903J1780L2984o454p566R470J3528R180Q728o893k685
12214B3855O236k550J1173j4295L095K4089n722j2361J8594R974o384l1672j0917
12201A3115k172R297J0602j0550j940j358j4788l7310N323L2097K8291J1791j2684
12188B9714m856O305L0830J0961O09J8668J1765r115j5466N637J740k6661k7289
12175C2842K2782q507J6016R001j326k4332J2983J0846J6796p28j2271j4567j9015
12162D0520L273J7026M994k0036q141j2829j0077J7213J8394m835K1837J8647
12150H5986P185M905Q139p931Q417J9328P328J7960j8557j6629j4640J3773j1757
$$ y = [27628, 30389, 35034, 63230, 89134, 61849, 31279, 52875, 47992, 26977, 17416, 25372, 45294, 44372, 22196, -24314, -38217, -26437, 6547, 93, -7473, 1997, 15525, 24705, 33433, 26540, 23855, 30091, 27541, 38714, 24419, 27514, 51603, 45881, 33520, 52114, 62088, 55704, 24032, 13115, 10943, 20240, 30842, 20292, 18352, 16994, 2206, -35104, -29781, 2316, 30607, 42398, 29714, 24858, 31163, 61993, 72954, 73563, 92231, 103996, 94881, 79415, 85052, 86792, 60131, 32842, 55624, 47117, 63133, 72134, 70808, 46476, 59459, 70305, 87101, 86373, 74102, 59535, 40520, 43793, 60819, 65813, 45777, 37636, 24807, 14730, 31943, 50337, 45502, 67339, 85986, 93171, 98076, 106215, 98284, 106701, 126029, 133357, 151317, 132760, 116131, 101491, 115264, 103507]
12137A03507p543L6842L6144J5585L8174P210J5373L0705L9130k5079J7565O8062
12125C75675J03218J20610J51051J37562J00940Q1956R1041J4369q6274j07699
12115I82449j01065r9896r7081j33962j21425p7132n6598l9303l387j7284j3999
12104B21317j9478M401j3327k0448p981K7507l195m1172q667j9008K6861J4583
12092A61393J1580j5658j1528M309K4126J1362K1522R837j0410j4712k2430j9576
12080A49815j2835k94j2250k3767J2662Q678k6587r834o472r71P17j4544N974
12067G0292j6317K806K2173j5475m35j142r594J7867N387k248N17K3064P28j7821
12053G9802O757M172J8704l752j6570l65L5951J6947l174j1249j2630J3123L8775
$$ y = [103507, 95964, 132806, 168950, 184535, 222709, 229919, 245292, 275997, 315127, 290048, 307613, 375675, 478893, 599503, 750554, 888116, 989056, 1071012, 1162053, 1176422, 1090148, 982449, 881384, 781488, 684407, 550445, 429020, 351888, 295290, 255987, 252600, 235316, 221317, 201839, 206240, 192913, 172465, 164484, 191991, 188796, 147624, 138957, 119949, 146810, 161393, 172973, 157315, 145787, 150096, 174222, 185584, 207106, 216943, 206533, 191821, 169391, 149815, 136980, 136686, 124436, 100669, 113331, 122009, 95422, 85588, 79116, 78145, 78862, 64318, 70292, 53975, 56781, 78954, 63479, 63044, 61902, 52308, 70175, 75562, 73314, 73831, 96895, 97623, 79802, 86559, 90731, 109435, 105683, 89113, 88748, 124699, 141646, 138472, 127223, 114593, 127716, 166491]
12040A66491M3351K2556J4051r329N729L3542L0968J1601M3791O0521N3541R1918
12028E68731R1583J47039K24381L17725L72519L77263L75235L61358K99175J71346
12018C306355k138j83470k93039l43014l72143l87280l65226l06243k49621j47690
12008F56491j09449q7881m4640p3203p8995l6374J562q168k2069m6421k3102J5622
11996A43373K7512j5315j9906j7328j5623l9663j3091Q092L0771j6259j0437J420
11984F3546k3815j1683k287J2219K7327k9495l3076j3515q993M569K9721K5420
11972C9938K5916o827k7986J6902M200j503j1155K335P190K434m816r042J7066
11959E4652M701j498J6397L646m8907J4995K2549j830j0655k6222k7584j605L061
$$ y = [166491, 209842, 232398, 246449, 237120, 242849, 276391, 307359, 318960, 362751, 423272, 476813, 568731, 660314, 807353, 1031734, 1349459, 1721978, 2099241, 2474476, 2835834, 3135009, 3306355, 3304217, 3120747, 2827708, 2484694, 2112551, 1725271, 1360045, 1053802, 804181, 656491, 547042, 459161, 414521, 341318, 262323, 225949, 227511, 219343, 197274, 150853, 127751, 143373, 170885, 155570, 135664, 118336, 102713, 63050, 49959, 58051, 88822, 72563, 62126, 63546, 39731, 28048, 25761, 37980, 65307, 35812, 2736, -10779, -19772, -15203, 14518, 39938, 65854, 59027, 31041, 47943, 52143, 50640, 39485, 41820, 49010, 51444, 46628, 37586, 54652, 59353, 57855, 74252, 77898, 28991, 43986, 66535, 64705, 54050, 27828, 244, -1361, 1700]
11946A700j5640p577Q247J0968J8936J0999K7051N911J7792k8895m1926m989j4037
11933a1460P222M732j8514J5856N7690J5149j8068j3225l756J0162q255o03O877
11920D3807k9562k0334o331J3424M8481O971j1128r269J3932j5810j5573J1090
11908B9698l0094k8669K8408K0979j0013j5099J0070K3102J0610J8407j600k0755
11896C5044j6674q382l479L0701j694j8418J1693l192J1143j2104J343P408J485
11883C4874r976q66K3994j4069l3180J1214j0418k3863J6342J0117k079j1594
11871i504K9258K0818l2200j1157J3868J0099N234j3113p024K1604r386P247j1317
11858A4427j713J6156l464j5751l902J630J6269L3079j7630k2442P017q466j4138
$$ y = [1700, -13940, -21517, -13270, -2302, 16634, 27633, 54684, 60595, 78387, 49492, 7566, 2577, -11460, -4238, 494, -18020, -2164, 55526, 70675, 52607, 39382, 35626, 45788, 37533, 36930, 43807, 14245, -6089, -12420, 1004, 49485, 56456, 45328, 36059, 49991, 34181, 18608, 29698, -396, -29065, -657, 20322, 10309, -4790, 5280, 28382, 38992, 57399, 55799, 35044, 18370, 9988, 6509, 37210, 35516, 17098, 28791, 25599, 36742, 24638, 25981, 33389, 34874, 24898, 24032, 48026, 33957, 777, 11991, 1573, -22290, -5948, 4169, 2090, -9504, 19754, 40572, 8372, -2785, 11083, 21182, 26416, 13303, 6279, 27883, 18497, 25744, 14427, 12714, 28870, 25406, 9655, 5753, 7383, 23652, 56731, 39101, 16659, 23676, 15210, 1072]
11845A072r448J3016K2460L4961k5179k6595j0186o742l0609l912K2934M4323
11833B6095M6847J3676j2838l8819n6581j1745J331j91M5988J9623N068k4971
11821A3483k8139J0984K5990P561j1596j8975K937M229k302k936l353K2730K8422
11808D9035r201j9103k5966M686K5164L418p670K5246K1014k7940k4944L664q177
11795I226j3609j5474J4886K0223K8131j190n699K7941Q870j8853k3407m268p34
11782B6043J8375m198p999Q181j0491J9270J0645p782J7809n813P495j87q074
11769F3274l36l132j4701j3430j59J1433j0909J1590J8681o201q483J94K011j816
11755D8016J1737J3272n034r195j6425j9105j095K5662K8057L8798j074m5443
$$ y = [1072, -8376, 4640, 27100, 62061, 36882, 10287, 101, -6641, -37250, -41162, -18228, 26095, 72942, 86618, 73780, 34961, -21620, -33365, -32034, -32225, 13763, 33386, 38454, 13483, -14656, -3672, 22318, 29879, 18283, -692, 2245, 6474, 4172, 1236, -2117, 20613, 49035, 39834, 20731, -5235, -549, 24615, 28033, 20363, 45609, 66623, 38683, 13739, 17403, 9226, -4383, -19857, -4971, 15252, 43383, 42193, 36494, 64435, 73305, 54452, 31045, 26777, 26043, 44418, 40220, 32221, 40402, 29911, 49181, 59826, 52044, 69853, 64040, 71535, 71348, 63274, 62938, 59806, 45105, 31675, 31516, 42949, 32040, 43630, 62311, 56110, 47627, 47821, 49832, 48016, 59753, 73025, 67991, 58796, 42371, 23266, 22171, 47833, 75890, 114688, 113614, 68171]
11743F8171k1855r294k4922p226O152K2462K4876K2360K4744j2805j2501k4589
11731E5573j4676j6595N271J3565n318l8079K4009J7880L2636o458j6171K9203
11719H0840k3238l7456K5333J3299k427j0754n240P138Q683J7523j5747k2849
11707C5105j6151K8055K3950r540k3647k3156O815M1561k161k8606k3151Q726
11695A7800J4130J1706O895L0237K0384j2889k4191Q264k2020k5603R729K1468
11683E5910j2675k0157J6216J5500j5183n0617J2072L9561J4765l395r481j3044
11671B9472j228J5295O170p669j5802o44J670L4138J6133L252k8000k3932o973
11658B1882j0049R78r057q656J7041Q34R752J856M889P011j8208k1368J3101j6845
$$ y = [68171, 46316, 37022, 12100, 4874, 11026, 33488, 58364, 80724, 105468, 92663, 80162, 55573, 40897, 24302, 29573, 43138, 37820, -259, 23750, 41630, 74266, 67808, 51637, 80840, 57602, 20146, 45479, 58778, 56351, 45597, 40357, 47495, 56178, 73701, 57954, 35105, 18954, 47009, 70959, 61419, 37772, 14616, 21431, 62992, 60831, 32225, 9074, 17800, 31930, 43636, 50531, 80768, 101152, 88263, 64072, 72336, 50316, 24713, 34442, 55910, 43235, 23078, 39294, 54794, 39611, -11006, 1066, 40627, 55392, 51997, 42516, 29472, 28244, 43539, 49709, 42040, 26238, 25594, 27264, 61402, 77535, 80787, 52787, 28855, 21882, 11833, 12811, 3754, -4902, 12139, 12973, 22725, 24581, 29470, 36481, 18273, -3095, 10006, -6839]
11644f839L3847j2287Q437K1730K9538K836j1740j8834p985J5173P820l966N484
11631F3214r416o925q588P902J6100j306j8509m589L136Q608j3071m385J8211
11618E0382R897j8939K771J5129J732O992k6926r057J0594j1295L5400J1194k8792
11605D9082m693j878N907N617Q166J3634n6303j4468L796L620L7513L1357J5043
11592I6393J4942m7305N854O701Q064k1558J0469K8942L3752O533o070m4932q030
11579H3755l075k6102j6952j0432j629k0943l716L3971L3907J285q394j6152o49
11566D4874j762j6102L0189L3852O378k3483J4026j1105o66k4628k4713j1270
11554A5590K6144K2064M5293O233k5304j0976p42J0335j4387j5777J7046p426
$$ y = [-6839, 27008, 14721, 23158, 44888, 74426, 77262, 65522, 46688, 38703, 53876, 61696, 57730, 63214, 53798, 46873, 38285, 46187, 62287, 60981, 42472, 37883, 41019, 49627, 36556, 32171, 50382, 60279, 41340, 44111, 59240, 60972, 67964, 41038, 31981, 42575, 31280, 66680, 77874, 49082, 44389, 42511, 48418, 54035, 62201, 75835, 19532, 5064, 8860, 12480, 49993, 81350, 96393, 111335, 64030, 69884, 76585, 84649, 63091, 73560, 102502, 136254, 142787, 136717, 91785, 83755, 80680, 54578, 37626, 27194, 25565, 4622, 906, 34877, 68784, 70069, 61675, 45523, 44874, 43112, 27010, 57199, 91051, 97429, 73946, 87972, 76867, 76201, 51573, 26860, 15590, 41734, 63798, 109091, 115324, 90020, 79044, 78302, 88637, 74250, 58473, 75519, 68093]
11542F8093r742P304j2664k0927K7485J3270j566m5585l0932R568n801L0921Q908
11529C8332J3723P853J5308L1924k0312j6954J104m32o431p748P414K7276p481
11516H3576l4412K3633M4819R740J246j1556o360j2451k6793r364K379M4009J9929
11503A28395m971K4573K8112L6522m162l0032j2189K1260j1528o3167J3087P0171
11491A96071N150r094m8424q161R737k6149q646k9022J021K0480K3305j3216l214
11478A09838N78L0455K0993L2484J8213K7916k0002k1654J8693O010j7095k9612
11466A76817q054j5457l630j2950k8238k2407J0462L654J7221J5216j5892q579
11454A08163K0922J3336R880K133j1721N2512M9355L3046o691j3724J3673j6741
$$ y = [68093, 58351, 65655, 52991, 32064, 59549, 72819, 71253, 25668, -5264, 4304, -1497, 29424, 38332, 52055, 59908, 75216, 107140, 86828, 69874, 70978, 70546, 64115, 56367, 63781, 91057, 83576, 49164, 72797, 117616, 127356, 128602, 117046, 110686, 98235, 71442, 62078, 64457, 108466, 128395, 123424, 147997, 176109, 212631, 208469, 178437, 166248, 187508, 175980, 112813, 125900, 196071, 201221, 192127, 143703, 135542, 145279, 119130, 110484, 81462, 82483, 102963, 126268, 113052, 109838, 110416, 140871, 161864, 194348, 212561, 240477, 220475, 198821, 217514, 223524, 206429, 176817, 168763, 153306, 149676, 136726, 108488, 86081, 96543, 100197, 117418, 132634, 116742, 108163, 129085, 142421, 152301, 154434, 142713, 195225, 244580, 277626, 270935, 257211, 270884, 254143]
11442B54143k5191m940l6417m6318p644j5462j1260j814m692K7793K6863l7957
11430A17104l5247K930J3339K642J6396k6723l280J1260j4392j0153r039j0130
11418E4707J4801K6199j936p678O619L214l033k2208r517J2882M1164J3863O713
11405A35790k211j2333r795j5139k2783J5459J606j9769J1241Q387l637J0468
11393I7284J6159k561m830J7363j2268j5226r405O798J6381J5075r024K296L4754
11380A52796J8417q584r777j3857M710K7459J3250J926n699l293p089M525m544
11367A70240J7541N476K7953L3684j053j0843M8035L8303L7055L1936K7290N9934
11355D85551J13160J20681O8830m7513n9666o9800m9663l4545l3347j0536K2290
$$ y = [254143, 228952, 224012, 187595, 141277, 133633, 118171, 106911, 105097, 100405, 128198, 155061, 117104, 81857, 84787, 98126, 100768, 117164, 90441, 87161, 98421, 84029, 73876, 64837, 54707, 69508, 95707, 93771, 86093, 92712, 95926, 92893, 70685, 61168, 74050, 115214, 129077, 135790, 133579, 121246, 111451, 96312, 73529, 88988, 90594, 70825, 82066, 90453, 86816, 97284, 113443, 110882, 106052, 123415, 111147, 95921, 86516, 93314, 109695, 124770, 115746, 118042, 152796, 171213, 162629, 152852, 138995, 143705, 171164, 184414, 186340, 180641, 177348, 170259, 174784, 170240, 187781, 193257, 221210, 254894, 253841, 242998, 291033, 329336, 366391, 398327, 425617, 485551, 598711, 719392, 788222, 740709, 681043, 611243, 561580, 527035, 493688, 483152, 505442]
11344E05442J6311J9722L9873L0253j5821K6388L7397K2108K9813O0150M5248
11333H16884O5958J02849O4412P1844J10904R6185Q8535J34370K29960L08376
11323B090277M41745O32221Q18862J100084J253123P97220m16993j319932j350268
11314D046339j005728p12061m73184l28269k32129j91628j64666j16704p4269
11305G47701p5557p3659m5344k8816m1214m7184k9503l1262o885j2717j3039l5803
11293C06718J3267k2106j2125k0871j0505l415k312k3030j657L8341J3518j8257
11281B57566J6589J4735k0440p1325r973J9955k5427K15J7209L566j4439k8394
11269A59837j2576k3L52m755o119q959J6993P100j2990Q965K2525K0648K362j4864
$$ y = [505442, 521753, 541475, 581348, 611601, 595780, 622168, 659565, 681673, 711486, 771636, 816884, 882842, 985691, 1050103, 1121947, 1232851, 1329036, 1417571, 1551941, 1781901, 2090277, 2532022, 3164243, 3983105, 5083189, 6336312, 7133532, 6716539, 5396607, 4046339, 3040611, 2328550, 1855366, 1527097, 1294968, 1103340, 938674, 821970, 747701, 672144, 598485, 553141, 524325, 483111, 435927, 406424, 375162, 368277, 355560, 342521, 306718, 319985, 297879, 285754, 264883, 254378, 250963, 248651, 225621, 223964, 262305, 275823, 257566, 274155, 288890, 268450, 197125, 187152, 207107, 181680, 181895, 199104, 202670, 188231, 159837, 147261, 147238, 147590, 142835, 136716, 127757, 144750, 151850, 138860, 147825, 170350, 190998, 193360, 178496]
11255A78496J1504K5511J3223K7307j9j7128o2178n3063J2227M1543N640k9748
11243A53315k5053k6592l6638K7429K6917J9114n844q793k298L935J9255M6802
11231A91549j232j3953J5320K0228J3131M707q066l5496o1613j6088j1720r528
11219H7239J960J9856J4822n341l8149o141J2536j6679j5577j3097m69J8436M3997
11206A03393L12j7123K4296J0971j0624l334N089j8753l1958l326j9499J1505
11194E0949L393m239j929O549J192j0570R405J4528J5477k241Q768j3268j1829
11181F6185J6226J636O701J5351q362L1972k2094j3872Q67J2259j3790j7266p510
11168F8303J0660r370j5589K5304K6229m878j1429P50L7347p006j4618l8759K9350
$$ y = [178496, 190000, 215511, 228734, 256041, 256022, 238894, 176716, 123653, 135880, 177423, 183063, 153315, 128262, 101670, 65032, 92461, 119378, 138492, 132648, 123855, 121557, 125492, 144747, 191549, 190317, 176364, 191684, 211912, 225043, 229750, 221684, 186188, 124575, 108487, 96767, 87239, 89199, 109055, 123877, 118536, 80387, 74246, 86782, 70103, 54526, 41429, 40960, 59396, 103393, 103705, 86582, 110878, 121849, 111225, 107891, 112980, 94227, 62269, 58943, 39444, 50949, 54342, 50103, 48174, 54723, 55915, 45345, 54750, 69278, 84755, 82514, 91282, 78014, 66185, 82411, 84047, 90748, 106099, 97737, 129709, 107615, 93743, 94610, 106869, 93079, 75813, 68303, 78963, 69593, 54004, 79308, 105537, 100659, 89230, 89980, 127327, 120321, 105703, 66944, 96294]
11155I6294L0230j5113R591J648k4246l2666o028q28M347l195K2660L163J9915
11142A05772k8850j4846M0940J4146k3834k3368j7363j12K2653j540m44L003j7420
11129E8737p199j834l059k660O230l306J4398J9132l6373j1605J7998L5151J765
11116H7375J759k546k1679q943K5320J0344k1449j6887j449j1463q755J0606J4571
11103E6804M2531O569p093M326m210J4568M866j3031j7632j4665m275J852m864
11090F5746J0538J1771J6419J0096l3500L139N1679J4139n3128l3835n252L5437
11078I3249J9757k2006k4120p7l755J9423M485N835K623Q49L1289O302k772q135
11064A22947l9538j2997J3415J7N043j8766m1248l487M9611K162L476o028k7048
$$ y = [96294, 126524, 111411, 121002, 122650, 98404, 65738, 59710, 58882, 63229, 60034, 82694, 85857, 105772, 76922, 62076, 103016, 117162, 93328, 69960, 52597, 52485, 75138, 73598, 73154, 76157, 58737, 51538, 49704, 46645, 43985, 50215, 46909, 61307, 80439, 44066, 32461, 50459, 85610, 87375, 89134, 86588, 64909, 55966, 81286, 91630, 70181, 53294, 51845, 40382, 31627, 42233, 56804, 99335, 105904, 98811, 103137, 98927, 113495, 118361, 105330, 87698, 73033, 68758, 70610, 65746, 76284, 88055, 104474, 114570, 81070, 84209, 135888, 150027, 96899, 63064, 57812, 93249, 113006, 91000, 66880, 66803, 63048, 82471, 86956, 92791, 95414, 96263, 127552, 133854, 131082, 122947, 83409, 70412, 83827, 83844, 88887, 70121, 28873, 25386, 74997, 77159, 80635, 74607, 47559]
11051D7559J1613M8538L2189k4365j285K3397q634l0483j5799r65K0985Q945o901
11038A04794l1576k603N104j1067j0550k7801j001K9298L1642l1k4033k1152k5213
11025A5811j6006M0195L2217K2960K9603k471M9431M5595p228k4k3841j6378j3965
11012A55899k1343j5951K2055l141J0007J5557j7962l6774J7823n869k7912o404
11000H5985J1068K8024M042M1502k134n2165l0194M546K2439j8405q573J1334
10988I7469K3568J164K2323k4823n821J1908J5297J7806k2628q302P861J2792
10976A48614J3475N402J2680M885J5080P19q702j2320r534j1978k9211q275M3009
10963A63844L2535M0239J7540l7926k6016j622j4048m754J3097M1283J7518l4902
$$ y = [47559, 59172, 107710, 139899, 115534, 114249, 137646, 129012, 98529, 82730, 81765, 102750, 111695, 104794, 73218, 70615, 75719, 64652, 54102, 26301, 25300, 54598, 86240, 86209, 62176, 41024, 15811, -195, 40000, 72217, 95177, 124780, 122309, 171740, 217335, 210107, 210083, 186242, 169864, 155899, 134556, 118605, 140660, 137519, 147526, 163083, 145121, 108347, 126170, 120301, 92389, 85985, 97053, 125077, 129119, 170621, 168487, 116322, 86128, 90674, 113113, 94708, 86135, 97469, 121037, 122201, 144524, 119701, 113880, 125788, 141085, 158891, 136263, 127961, 135822, 148614, 162089, 167491, 180171, 185056, 200136, 200855, 192153, 179833, 170299, 158321, 129110, 120835, 163844, 196379, 236618, 254158, 216232, 190216, 188594, 174546, 169792, 182889, 224172, 241690, 206788]
10951B06788l4804l1204m33K1184o542K893J3075J8172L3397J8576L9166L4159
10939C14427J5180p23J2143L2999N4545Q5976J37342J70717K83608M19074M87119
10928B012407M53516J32658l31354n55025m79282l24239k18531j55679r1378n8785
10918C84308m0073k8559k0106j9947j1667k80K5017j2333j1840k7544j6086k1925
10906A98965j3807k6062r27R853J8523k439j6864k3137k32o369j864j0537M438
10893A29541J8990P901j1662k1944K2327K2548k148l764P803L188L1775m2585
10881A61970l7936j5542j4919J4871O373K2323J8076k8654j9078j1476j3585K237
10869H4660K1885J0401J4886K0290q257k8251l233q575J1874L854J0025K5310
$$ y = [206788, 171984, 140780, 140347, 161531, 154989, 157882, 170957, 189129, 222526, 241102, 280268, 314427, 329607, 328884, 341027, 374026, 428571, 514547, 651889, 822606, 1106214, 1525288, 2012407, 2465923, 2598581, 2267227, 1712202, 1232920, 908681, 690150, 534471, 443093, 384308, 344235, 315676, 295570, 275623, 263956, 263676, 288693, 276360, 264520, 236976, 220890, 198965, 185158, 159096, 158169, 168022, 186545, 184106, 167242, 144105, 143873, 137504, 135640, 125103, 129541, 148531, 156432, 144770, 122826, 145153, 167701, 165553, 161789, 169592, 172780, 204555, 161970, 124034, 108492, 93573, 108444, 114817, 137140, 155216, 126562, 107484, 96008, 82423, 84660, 106545, 116946, 131832, 152122, 143865, 115614, 112381, 103806, 115680, 119534, 129559, 154869]
10857A54869o720p789o976L584J7106K1396j0313j0533J341J6408L199j2450k3359
10844A39763k3762J6605K2675l7530l255K1877m761O859k7564J4735J9946J4057
10832A59645k0828l8742N580n592R493M369l803L6734J3068k654j9364J1492o805
10819A42593J061n554j6346M1024J1839j7226J3980K9661K0063m451k817M1295
10807B55122k4670j3229j2120j4302q75O031L599l1154n606K0831J0769J4425
10795B08821k9549j2549q106j0949P249K0134n696J0569L3077p682k3816P996
10783A89499R803N664q501J2045Q571j9799j0444K0778L2315K7251K5037J0067
10771C02286j7927m0973K9436J9085P597K6965K0506J9834K8930M2168M900m9521
$$ y = [154869, 148149, 140360, 133384, 136968, 154074, 175470, 165157, 154624, 155965, 172373, 175572, 163122, 139763, 116001, 132606, 155281, 117751, 114496, 136373, 131612, 138471, 110907, 125642, 145588, 159645, 138817, 100075, 105655, 100063, 109556, 113925, 110122, 146856, 159924, 157270, 137906, 149398, 142593, 143654, 138100, 121754, 162778, 174617, 157391, 171371, 201032, 221095, 216644, 213827, 255122, 230452, 217223, 205103, 190801, 189926, 195957, 199556, 168402, 162796, 183627, 194396, 208821, 179272, 166723, 158617, 147668, 154917, 175051, 169355, 179924, 213001, 205319, 181503, 189499, 199302, 204966, 196465, 208510, 217081, 197282, 186838, 207616, 239931, 267182, 292219, 302286, 284359, 243386, 272822, 291907, 299504, 326469, 346975, 366809, 395739, 437907, 442807, 393286]
10759C93286n2815j9865k9076k6044k179M089p961l0969j496j990q337Q566Q351
10746B33560J1309Q253Q501m059p887p870k691j1623R388j630k3181k1221J7853
10733B08702K015K9722K121j2151k5786J4817p9J108K968J6723L350q537j7989
10720B16984n223L2690J3944j7980L2691L6815J1840j5430k3767j0439Q614O704
10708B87443L2214M2710K0167K3882k4907l7210L4177J558j9934j932J0871J2157
10696C81196j319q768J4562N891j4126M034Q479n6547k2297k496M70l7834q866
10683B62379M6279J4112K2450J5707k325K0600L1776J5944j4143R176J2013l49
10671D33619K0946m935r282n492M167j8883J5673j3931k5897m5675m2115m5985
$$ y = [393286, 340471, 320606, 291530, 265486, 263307, 267396, 259435, 228466, 226970, 224980, 216643, 225209, 233560, 244869, 253122, 261623, 257564, 249677, 241807, 239116, 227493, 236881, 235251, 212070, 190849, 208702, 210717, 240439, 242560, 230409, 204623, 219440, 219361, 220469, 223437, 240160, 243510, 234973, 216984, 211761, 244451, 258395, 240415, 273106, 309921, 321761, 306331, 282564, 272125, 280739, 287443, 319657, 362367, 382534, 406416, 381509, 344299, 378476, 380034, 360100, 358168, 369039, 381196, 379877, 371109, 385671, 391562, 377436, 381470, 389949, 333402, 311105, 308609, 309079, 271245, 262379, 308658, 322770, 345220, 360927, 358602, 379202, 410978, 426922, 412779, 421955, 433968, 433619, 454565, 449630, 440348, 434856, 439023, 420140, 435813, 421882, 395985, 350310, 308195, 262210]
10659B62210j8286K3516K8091N3568N3810N0117j6576k2253K0657R724k489K2451
10647D64540K2797L413J1165m375P609L5230N542m198M3899P4400R9076J44083
10635I03181J77388K03543J65405k648j30832j75799j15156r7571p0045r1101
10625G66365l1389l4691k4878L375K5168P405J8387K6361L8674j5345q151J9852
10613G91133J0858J0054p552J2644Q132J1621K3592J2755N050J3586M616K0179
10601I16668J9001N36K0876N0976N940J4774O958j4170m131L902N4301K5814J3435
10588A114880L0800K1777L1273L2994K0128n697J7156M0495L2747M3331N0651
10577A430535M6460L2161N1154L9810N3622Q9983O7403O3666O2604N4804O9711
$$ y = [262210, 243924, 267440, 295531, 349099, 402909, 453026, 436450, 414197, 434854, 444578, 442089, 464540, 487337, 490750, 501915, 497540, 505149, 540379, 545921, 541723, 585622, 660022, 759098, 903181, 1080569, 1284112, 1449517, 1446869, 1316037, 1140238, 1025082, 927511, 857466, 766365, 734976, 700285, 675407, 678782, 703950, 711355, 729742, 756103, 794777, 779432, 771281, 791133, 801991, 812045, 804493, 817137, 825269, 836890, 860482, 873237, 878287, 891873, 896489, 916668, 935669, 936205, 957081, 1008057, 1013997, 1028771, 1035729, 1021559, 1017428, 1021330, 1075631, 1101445, 1114880, 1145680, 1167457, 1198730, 1231724, 1251852, 1246155, 1263311, 1303806, 1336553, 1379884, 1430535, 1476995, 1509156, 1560310, 1600120, 1653742, 1743725, 1811128, 1874794, 1937398, 1992202, 2061913]
10566B061913O9230M8080P4412Q3842J16854J46279J58191J30666J58575J30239
10556C178281J17030J83602K68165K76002L04694L70264M54995N81338P58527
10547F492898J050877J486955K274575L418065M885485N889095M556321k34896
10539B9819375m899020n658179m131178k516896j393878p37684l07039N9948L47292
10530A0582741N97791Q60212J075747J288779J333112J204607J083181J308199
10522A9334369J792641K396326L026887L883424N103672O749108R125668J2696708
10514F4108803J8314065K7413666M2084040O3990786R0223908J04310631P1732307
10507D82178206j8722440r6711375j06808841p9311821n1669107l3416790k2323003
$$ y = [2061913, 2131143, 2179223, 2253635, 2337477, 2454331, 2600610, 2758801, 2889467, 3048042, 3178281, 3295311, 3478913, 3747078, 4023080, 4327774, 4698038, 5153033, 5734371, 6492898, 7543775, 9030730, 11305305, 14723370, 19608855, 25497950, 30054271, 29819375, 24920355, 19262176, 15130998, 12614102, 11220224, 10482540, 10175501, 10235449, 10582741, 11180532, 12040744, 13116491, 14405270, 15738382, 16942989, 18026170, 19334369, 21127010, 23523336, 26550223, 30433647, 35537319, 42286427, 51412095, 64108803, 82422868, 109836534, 151920574, 215911360, 306135268, 410445899, 482178206, 463455766, 366744391, 259935550, 180623729, 128954622, 95537832, 73214829]
10500G3214829j5440974j1063017q137865o136710m754935l772111k893108k140825
10492A8875284j574408j172865r60745j110538j466702j537863j289904r79504
10484H782755p68789o31461n80964n66662n09251l59905l21356l03313k93723
10475D447331l24597l57365l54318k82634k22920j54675j46834j64141j62053
10466B277794j49460j10473j02167j01171r7457q6350j00224o2704m9449o7327
10456A351012m6852k0739m5723p0087m5727p1722q3223j5161N964M224l9339k4800
10444H97827k3921l2989l7250l3418m4109n8782n0298K0125K1868r758O382K8010
10432F83687j6762k0418k0533j3141J6115N295k7284m9780k3369j8560k6744p364
$$ y = [73214829, 57773855, 46710838, 38572973, 32436263, 27681328, 23909217, 21016109, 18875284, 17300876, 16128011, 15167266, 14056728, 12590026, 11052163, 9762259, 8782755, 8013966, 7382505, 6801541, 6234879, 5725628, 5365723, 5044367, 4741054, 4447331, 4122734, 3765369, 3411051, 3128417, 2905497, 2750822, 2603988, 2439847, 2277794, 2128334, 2017861, 1915694, 1814523, 1717066, 1630716, 1530492, 1467788, 1418339, 1351012, 1304160, 1283421, 1237698, 1167611, 1121884, 1050162, 966939, 951778, 957742, 961966, 922627, 897827, 873906, 840917, 803667, 770249, 726140, 667358, 617060, 637185, 659053, 649295, 655677, 683687, 666925, 646507, 625974, 612833, 628948, 634243, 606959, 557179, 533810, 515250, 488506, 481142]
10420D81142j905j6025q95j9257m1909k9255l1098J0422J5408P189k5253j8491
10408C30073k926j8857k4418k940j7502j6582J537m840O540M594k1239k4154n319
10395B03967p211J7068J6110R86P653k776m3501m9784p0636j01284j24527j35950
10383b89885j27739l9853Q4556J24647J51743J29325P2507L5505P114j1817O91
10372A36794L401j679K3107p209l231K4765l4998j0253j418R373O431M0953K8268
10359B14304j1448K2442K0816L4017k1167o2176m0392j4855P78l353j1967J0924
10347A37923p612j6972j8376k1064k291j589l518J717K440Q683O056k695p502
10334G5200K4286J8456J36q372q987J3018k8456k2240j0223K6405L5719J5346
$$ y = [481142, 479237, 463212, 462317, 443060, 401151, 371896, 340798, 351220, 366628, 373817, 348564, 330073, 327147, 308290, 283872, 280932, 263430, 246848, 248385, 243545, 250085, 254679, 233440, 209286, 203967, 196756, 213824, 229934, 230920, 238573, 235797, 192296, 142512, 71876, -29408, -153935, -289885, -417624, -457477, -372921, -248274, -96531, 32794, 105301, 140806, 147920, 136103, 136794, 140195, 138516, 161623, 154414, 151183, 175948, 140950, 130697, 129279, 138652, 145083, 186036, 214304, 202856, 225298, 246114, 280131, 258964, 196788, 156396, 141541, 142319, 138966, 126999, 137923, 130311, 113339, 94963, 73899, 71608, 70019, 66501, 68218, 70658, 79341, 85397, 82702, 75200, 99486, 117942, 118078, 109706, 100719, 113737, 85281, 63041, 52818, 79223, 114942, 130288]
10322A30288k4795m8843Q892K402j3069p181n14J419M691J2047K4932m151O321
10309I2439M1823l656K4176L8956J0433L191K5591k475k5961k8266k8759J2640
10297A60132L221j0119J0902n439o220O537m063k1712k7218K0456M6020J4022
10285A86519R406r52r505j6641j2049j6090j044J9526J9582J3186N395j8912q53
10272A77568k7421l3896j5470O4938L5276K36O697N2755N3642O8628J04815J53862
10260F41630J15080M1399M6374J30455J52498J3140j10943j16035j06846o4542
10250G42210o0898r1857j14328j19595o4787k2914p804K5070O177j8251j0117
10239B62906J9250l0406O379K3150K4831L3521L5903M4900M7706j829j707O49
$$ y = [130288, 105493, 56650, 65542, 67944, 54875, 47694, 47180, 48599, 53290, 65337, 90269, 86118, 92439, 134262, 130606, 154782, 193738, 204171, 207362, 232953, 230478, 204517, 176251, 147492, 160132, 163353, 153234, 164136, 158697, 152477, 159014, 154951, 133239, 106021, 126477, 172497, 186519, 195925, 194973, 185468, 168827, 156778, 140688, 139644, 159170, 178752, 191938, 197333, 178421, 177568, 150147, 116251, 100781, 165719, 200995, 201231, 207928, 260683, 314325, 382953, 487768, 641630, 756710, 798109, 844483, 974938, 1127436, 1140576, 1029633, 913598, 806752, 742210, 681312, 589455, 475127, 355532, 290745, 267831, 260027, 285097, 291274, 273023, 262906, 282156, 251750, 258129, 281279, 306110, 339631, 375534, 420434, 468140, 466311, 464604, 465253]
10227D65253J9175J490k7663r704k0837j5389j3830l3442j8208J6843K0990K6277
10215D10955Q312J3902L0452Q0178J17146J10158J05329M5670m629l5705m1774
10204H39994m4436k2585m0180k109L1622J3522L3369P0729M0818r472J2398N3204
10192I76874O1987P6025J04223J74790K42134L14717M30335O50356R56170J471060
10182E458671K196689K982419L202569K031339m84775k730895l345758k754803
10174F555456j883420j213755p91226n44659m00882k75138j93170j47965j16694
10165I88547q5795n3437m4541o0003o5322m2753l2709k8993n4963m3763o534o416
10153D63318k7126K1219r089n0028k3010K5133K8783J0342J4514N9866M4203j9414
$$ y = [465253, 484428, 485918, 458255, 448551, 427714, 412325, 398495, 365053, 346845, 363688, 384678, 410955, 419267, 433169, 463621, 543799, 660945, 771103, 876432, 922102, 917473, 881768, 839994, 795558, 772973, 732793, 730684, 762306, 775828, 809197, 879926, 920744, 911272, 923670, 976874, 1038861, 1114886, 1219109, 1393899, 1636033, 1950750, 2381085, 3031441, 3987611, 5458671, 7655360, 10637779, 13840348, 15871687, 15386912, 12656017, 9310259, 6555456, 4672036, 3458281, 2667055, 2122396, 1721514, 1446376, 1253206, 1105241, 988547, 902752, 849315, 804774, 744771, 679449, 636696, 603987, 574994, 520031, 476268, 469734, 463318, 436192, 457411, 448322, 398294, 375284, 400417, 429200, 439542, 454056, 513922, 558125, 538711]
10141E38711q4122q8637m2071j8181j7341l2353M554P304P278J3021J4071M9571
10129C51805K9666j244l4732l7173m4714k9903m061j2434M243K1012Q913J2273
10117B63651M0547O7763j0942k2264l3972m4156k5306K845j4155J8704k531K5079
10105B65263L7607J5274l1098l325J9476Q210l045m058J2715J7528Q580p840k821
10092C32466K9700K3367K0061P8686J26952J51370K20099L43246M52554M90006
10082B268507L23714j34602m79733n25041l78200k62590j75843j08789j26107
10073D01316n0516l7081k1208j6718j1277k3275j6319l9094n3286k7876J6296
10062A20962O120k4927J5950L5148j8375l2714k5081k1688K4367J4884k853K4277
$$ y = [538711, 454589, 365952, 323881, 305700, 288359, 256006, 260560, 267864, 275142, 288163, 302234, 351805, 381471, 380227, 345495, 308322, 263608, 233705, 229644, 217210, 221453, 242465, 251378, 263651, 304198, 371961, 361019, 338755, 304783, 260627, 235321, 238166, 224011, 242715, 240184, 265263, 302870, 318144, 287046, 283721, 303197, 311407, 308362, 304304, 317019, 334547, 343127, 335287, 332466, 362166, 385533, 405594, 484280, 611232, 762602, 982701, 1325947, 1778501, 2268507, 2592221, 2457619, 1977886, 1452845, 1074645, 812055, 636212, 527423, 401316, 350800, 313719, 292511, 275793, 264516, 241241, 224922, 185828, 132542, 104666, 120962, 127082, 102155, 118105, 153253, 134878, 102164, 77083, 55395, 79762, 94646, 91793, 116070]
10050A16070O366l5033k6097k3844N88K5444J3596j717j6088j4138J801j5429
10038C1519J4315L3719M2738K1810K2592l4363r90N93j1400K024k7368K626J4872
10025A12687l3415J994J1270k2886j09k666K9737L8654j0239k3971m447N18J1831
10012A08958k6945o555K7412p593n052J3240k0171P127J8039q38M267J2092R97
9999A24978j1343m1366Q891k6809M15j3879n174K0813N223k1557j1280M9833J9785
9986I8530o065O906J3149J3470j8679j8056P021N359j7541k2998j2800L419j850
9973D9865j8896K2004J2588L3840L9617K4814n0503l9083J4751Q101o063r181
9961H1854J2885j3800m1258j4825J5954K3219K9321J2257j0455r721j7423n646
$$ y = [116070, 122436, 87403, 61306, 37462, 38050, 63494, 77090, 75373, 59285, 45147, 46948, 31519, 45834, 79553, 122291, 144101, 166693, 132330, 131340, 131933, 120533, 122557, 95189, 97815, 112687, 79272, 81266, 92536, 69650, 69541, 66875, 96612, 135266, 125027, 101056, 96609, 97127, 108958, 82013, 75458, 102870, 95277, 90225, 103465, 83294, 90421, 108460, 107622, 111889, 123981, 124978, 113635, 72269, 81160, 54351, 54766, 40887, 35713, 56526, 61749, 40192, 28912, 78745, 98530, 92465, 99371, 112520, 125990, 107311, 89255, 96276, 101635, 84094, 61096, 48296, 51715, 49865, 30969, 52973, 65561, 99401, 139018, 163832, 113329, 74246, 88997, 97098, 91035, 81854, 94739, 80939, 39681, 24856, 40810, 64029, 93350, 105607, 95152, 85431, 68008, 62362]
9949F2362J6446P074l2822l6540J2371J2562J2935M886r097j3861K2211L9648
9937I8175J2889l747K876o178J5317l2122m0876l469N176K0509P04L193J1896
9924H4343M672j5739r848K6905j1832l7023j1731J1888Q74J8747K2437j9173K355
9911F6875K355J7090m374P349R688K0716J5294j2808j2131l198j0944j1446K4773
9898A09239M8134k5985j8797j8540k1997j0914J2607L737L0603J9583n183o549
9886A15938j1356m380q3O108K1200M0139j4742l1568l1630J0102R611j077j3245
9873I5017M850K2453L154p664L5408j1151k2272j5927J7261j7k6212q59K9519
9860A23560n561J9547J7199k667n771K7013J0998j3723j3067J7077j0776k3327
$$ y = [62362, 78808, 85882, 53060, 16520, 28891, 41453, 54388, 59274, 50177, 36316, 58527, 98175, 111064, 107317, 110193, 104015, 119332, 87210, 46334, 42865, 48041, 68550, 69254, 72447, 84343, 89015, 73276, 63428, 90333, 78501, 41478, 29747, 41635, 42509, 61256, 83693, 64520, 66875, 69230, 86320, 81946, 89295, 98983, 119699, 134993, 122185, 110054, 106856, 95912, 84466, 109239, 157373, 131388, 112591, 94051, 72054, 61140, 73747, 77484, 108087, 127670, 122487, 115938, 104582, 100202, 100119, 106227, 127427, 167566, 152824, 121256, 89626, 99728, 109339, 108262, 95017, 99867, 122320, 125474, 117810, 153218, 142067, 119795, 103868, 121129, 121112, 94900, 94041, 123560, 117999, 137546, 154745, 152078, 146307, 173320, 184318, 170595, 157528, 174605, 163829, 140502]
9848A40502q661j7635r90M123p622J1367K3282j4137l974L572p386l812J0699
9835A29328l497L471o782N804m637N348L3785L051m4043l0198k047J9570L8691
9822A47844J2210k2229J050J2316j4930j0120J0878K9574K197l4891j0619K386
9810A25666J0654j8058J4859M6357R506r437l096M457n229j4837j7724o3467j0640
9797F9011m390J7223J768N858L0269O278N041j2561K726J9405J6351j8260p941
9784A30778k4196K8442k161j9487j8378j3550J4868K3556J5085k1320k5169J6898
9772A05366J1379j50j9170J0836J5547M004R05n533j0671K927P92O98m1365K787
9758G8352K4241N615K7290K1474J2459L539J4388l4549l3750J1267j3371K4801
$$ y = [140502, 131841, 114206, 113216, 117339, 109717, 121084, 144366, 130229, 126255, 129827, 122441, 118629, 129328, 125831, 129302, 122520, 128324, 123687, 129035, 162820, 165871, 121828, 91630, 89583, 109153, 147844, 160054, 137825, 138875, 151191, 136261, 126141, 137019, 166593, 168790, 133899, 123280, 125666, 136320, 118262, 133121, 179478, 188984, 179547, 176451, 180908, 175679, 160842, 143118, 79651, 69011, 64621, 81844, 83612, 89470, 119739, 126017, 131058, 118497, 121223, 140628, 156979, 138719, 130778, 106582, 135024, 132863, 113376, 94998, 81448, 96316, 119872, 134957, 113637, 88468, 105366, 116745, 116595, 97425, 108261, 123808, 127812, 128717, 123184, 112513, 115440, 116232, 116930, 75565, 78352, 102593, 108208, 135498, 156972, 169431, 172970, 187358, 152809, 119059, 130326, 116955, 141756]
9746A41756l3606k7110J4490R131K2363N284K4561J3746j6920r843O840l346p200
9733A40146m275N207k4608l4841j4821J6017K2234J9131K2729K3519r430j0173
9721A50835K3395M0899k4741k8199k184j3548J84J9213l689k6130j7830j1375
9709A06830N694J6855m611J2585L171j8585l5041Q884L6248K1874n205m0438j0089
9696I8172P142K5886k277l528j6757r096j233j2380L3889m488q891J5812J6440
9683A38691j402j1784j0907k2834P9J4280K8578P182r46J431n274l7797m34O42
9669I9505n165K3563P191M189J1491l2326k7788Q748J7900L0061o143r012J5269
9656A37483K46k5747K946J3809m7J864j2312n999k5111k3633O077K5747J4066
$$ y = [141756, 108150, 81040, 95530, 104661, 127024, 132308, 156869, 170615, 153695, 143852, 150692, 147346, 140146, 135871, 141078, 116470, 81629, 66808, 82825, 105059, 124190, 146919, 170438, 161008, 150835, 174230, 215129, 190388, 162189, 160005, 146457, 146641, 165854, 162165, 136035, 118205, 106830, 112524, 129379, 124768, 137353, 140524, 121939, 86898, 95782, 132030, 153904, 148699, 108261, 98172, 105314, 131200, 128923, 125395, 108638, 99542, 98309, 85929, 119818, 115330, 106439, 122251, 138691, 137289, 125505, 114598, 91764, 91843, 106123, 134701, 141883, 140937, 142368, 137094, 99297, 98863, 99505, 94340, 117903, 125094, 129283, 140774, 108448, 80660, 89408, 107308, 137369, 131226, 122214, 137483, 137729, 111982, 114928, 128737, 128690, 130554, 118242, 112243, 87132, 63499, 69576, 95323, 109389]
9643A09389J6415J2463r866M016J4444K2841L092r458k6855j5225N325K2137J2110
9630A60828J6941J2306m5440n23J042O252J7598J1035J5606k4159j8110k3491
9618A29885j2684k8059M744J3553M1867m32k0502J4365J3186J8463J8389k2998
9606A69777m997k2883M162J0929l615Q983r454K934O786Q180l484J3756N873j8780
9592A68167m2528k2101J2006j0940k0729O3047M9444N181o20O854n2254r117M450
9579A50860k4482K1043K1123j7205P262n552J1151K2179k4303k4100L2139J8426
9567A88541J5499k518Q347J9881l281m140O048k8000L89M514j1050j5562j7412
9554A61256K5875q078M847J5750K1878k857j2659k3473p96m237J4264j8973K099
$$ y = [109389, 125804, 138267, 128401, 132417, 146861, 169702, 172794, 163336, 136481, 121256, 126581, 148718, 160828, 177769, 190075, 144635, 144112, 145154, 151406, 169004, 180039, 195645, 171486, 153376, 129885, 117201, 89142, 93886, 107439, 149306, 148874, 128372, 142737, 155923, 174386, 192775, 169777, 164780, 141897, 146059, 156988, 153373, 162356, 152902, 155836, 162622, 170802, 167318, 181074, 186947, 168167, 125639, 103538, 115544, 104604, 83875, 146922, 196366, 201547, 200927, 207781, 155527, 146410, 150860, 126378, 147421, 168544, 151339, 158601, 153049, 164200, 186379, 162076, 137976, 170115, 188541, 204040, 201522, 209869, 229750, 226469, 222329, 228377, 200377, 200766, 205280, 194230, 178668, 161256, 187131, 179053, 183900, 199650, 221528, 218671, 206012, 182539, 181743, 177506, 191770, 172797, 174896]
9541A74896j7483L869N713m9J41m190R222R296k4458K0033L5625j1145P913J2286
9527B21669m820j9878l5307j9283K597J2183j8469J4181L4744j0246j9987K533
9515A59917Q296j0774r309K6798J0912N103L380j2091p510K8044q383j8692m481
9502A71210p03P219q529o549J0664J7836J061m1189r394J1796K4953J9912k2331
9489A75956j1090r992o195O335N71K2729M1882Q311j5676q054P869k061l0956
9476A79629r295J2255L0237L0650j588j7801J2436n391j0251M735J3334L1705
9464B70655K654m8373j4309j2394n54j1853O460Q639l970K980J9193J5207j3909
9451B20426m11J2841J1388j415p898m315L5595j0340l4503l0977K7809L336P507
$$ y = [174896, 157413, 161282, 166995, 166946, 167087, 162897, 172119, 181415, 156957, 176990, 212615, 201470, 209383, 221669, 216849, 196971, 161664, 142381, 144978, 157161, 138692, 152873, 187617, 177371, 157384, 159917, 168213, 157439, 148130, 174928, 185840, 190943, 194323, 182232, 174722, 202766, 194383, 175691, 171210, 170507, 177726, 169197, 162648, 173312, 191148, 192209, 151020, 141626, 153422, 178375, 198287, 175956, 164866, 154874, 148679, 155014, 155585, 178314, 220196, 228507, 212831, 204777, 212646, 210585, 179629, 170334, 182589, 212826, 243476, 241888, 224087, 236523, 231132, 220881, 225616, 238950, 270655, 273309, 224936, 210627, 198233, 197679, 185826, 192286, 200925, 196955, 199935, 219128, 234335, 220426, 220015, 232856, 244244, 242829, 234931, 230616, 266211, 255871, 221368, 190391, 218200, 221536, 229043]
9438B29043J3111j7175n059Q029j755N769j0302K403p131k4351M7857L2581p731
9425B65289j5259J9166J634k8807K374M691O273L660J7436k0994l450O020O520
9412B64553l7703l0276J7707J1414J50O210P267J297j7511N102K5129Q264l8438
9399B23165K210J2308J3678l047J4420O683K3373J8884J0892L601k1332J501k7176
9386B79160k6294J359K7908j446m848q861j4786k4630J8544j7621M4517L1289
9374C04291J1772R898j7469l7866n709K795k487K0467r145j1440r00J6368Q732
9361B89307K0718k325K819Q074L2743n125N567j1633m2816J2262N993l0057j8651
9348B66876j6206K8391J8414k9677j5242J2586J754j6732J2085J8561J9592R835
$$ y = [229043, 242154, 224979, 219920, 227949, 226194, 231963, 221661, 224064, 216933, 192582, 240439, 273020, 265289, 250030, 269196, 270830, 242023, 244397, 249088, 255361, 259021, 276457, 255463, 252013, 258033, 264553, 226850, 196574, 214281, 225695, 225845, 232055, 239322, 240619, 223108, 228210, 253339, 261603, 223165, 225375, 237683, 251361, 248314, 262734, 269417, 292790, 311674, 322566, 326167, 304835, 306336, 279160, 252866, 254225, 282133, 280687, 275839, 266978, 252192, 227562, 246106, 228485, 273002, 304291, 316063, 325961, 308492, 270626, 264917, 267712, 265225, 285692, 276547, 265107, 264207, 280575, 289307, 310025, 307700, 310519, 318593, 351336, 346211, 351778, 340145, 297329, 309591, 315584, 285527, 266876, 250670, 279061, 297475, 267798, 252556, 265142, 266896, 250164, 262249, 280810, 300402, 310237]
9336C10237K2688O331r403j9995j375N401J9895J9469Q152J1567k14m8762K236
9323C26227j2828m9102k8648L0463O707K5993J1572R845K6833K4977p929l643
9311C60467k7045R98n063r600j3217K4176J1589K0323J1043L664j0827N364k723
9298C69149o681j3667J479J1541r146o610J0258j102j538J4633q941J0944n89
9285C69730j0666J0042J5589J7936k6827r38M382j1401j7018m810j6899j331L4577
9272C62366K1712j1832N853l53J0288K1285j8152J0227K5703K4164o614k3485
9260D21162j04J7270k9582j3264p589j0422J68K4159K2045M708q623r651m923
9247D05354j0783J593P536r135k8830J273j1466K9152K5459m32k5555j2694J0088
$$ y = [310237, 332925, 339256, 329853, 309858, 308483, 313884, 333779, 353248, 361400, 372967, 372753, 323991, 326227, 313399, 264297, 235649, 266112, 272819, 298812, 310384, 320229, 347062, 372039, 364110, 360467, 333422, 334420, 329357, 319757, 306540, 330716, 342305, 362628, 373671, 377335, 366508, 371872, 369149, 362468, 348801, 350280, 361821, 352675, 346065, 356323, 355221, 353683, 368316, 359375, 370319, 369730, 359064, 369106, 384695, 402631, 375804, 374866, 379248, 367847, 350829, 346019, 329120, 327789, 362366, 384078, 372246, 378099, 377746, 388034, 409319, 391167, 401394, 427097, 451261, 444647, 421162, 421058, 438328, 408746, 395482, 387893, 377471, 377639, 401798, 423843, 428551, 419928, 410277, 405354, 394571, 396164, 403700, 394565, 365735, 367008, 355542, 384694, 410153, 409721, 384166, 371472, 381560]
9234C81560M761L246K9232K6116k561j6329J581K4276N0959J89m2680n793O0j1396
9220D43221J18K4166N368j751k8654J1014Q510J1166O038m1294j6843N2728j4486
9207D59301n558J750j6618L401J0191J5551L1585K1927J83O764j6807o806l406
9194E01458N530j0856k4839r574j1177k140L0328q813j6973J7285k456K0278L241
9181D91292k538P680J8729J7464N32j1342j9505J0787l810l1902j861O75J7364
9168D93565K8877J0086J6664j6515M264j5425K369J7300J5718K3806J0680J2325
9156F03714O26p825R506l923J7240Q140k8267k6831L2011K4737K0038j5875k1769
9143F11522j0554J1627Q369K205j8330j4580N008Q832l8358j9241K1782L5325
$$ y = [381560, 386321, 389567, 418799, 444915, 442354, 426025, 427606, 451882, 502841, 503030, 460350, 454557, 454617, 443221, 443339, 467505, 472873, 471122, 442468, 453482, 461992, 473158, 479196, 437902, 421059, 473787, 459301, 453743, 455493, 438875, 442276, 452467, 468018, 499603, 521530, 521713, 528477, 511670, 504864, 501458, 506988, 496132, 471293, 461719, 450542, 448402, 478730, 469917, 452944, 470229, 467773, 488051, 491292, 488754, 496434, 515163, 532627, 533159, 521817, 502312, 513099, 509289, 477387, 475526, 476201, 493565, 522442, 532528, 549192, 532677, 536941, 521516, 523885, 541185, 556903, 580709, 591389, 603714, 604340, 596515, 606021, 602098, 619338, 627478, 599211, 572380, 604391, 629128, 649166, 633291, 611522, 600968, 612595, 620964, 623169, 604839, 590259, 595267, 604099, 565741, 546500, 568282, 603607]
9131F03607L3427K6826J4317J764o203p621N095j0535k0681l41k617K164j1384
9118F27818j6726L1667J0155K3392L2046N4142J0766k7372j3542J9452m4349l4655
9106F72794j913J9022m400j699r148l3985L586J8790J8439K355J9455L9362K2987
9093G65645L5051K5394k5083O662j4462k3522l373l451k3280P423K5427q427N157
9080G69161K6343J9636m064j3692M421K9483l5615l4382j1025P562j1420Q62J5804
9067G63074J5679J338j0763l912L575O385Q106o203n530K4393J8009P429n622
9054H15958k516j2127N19J3749K2187M707q004j217k3098M731K8508L8290P849
9041H89536k0750l9714L4402K4084k5863l278R176P899J8791K7180j1015N168
$$ y = [603607, 637034, 663860, 678177, 679941, 673738, 666117, 671212, 660677, 639996, 639655, 637038, 639202, 627818, 611092, 642759, 652914, 676306, 708352, 762494, 773260, 745888, 732346, 751798, 707449, 672794, 670881, 689903, 685503, 683804, 674656, 640671, 644257, 663047, 681486, 683841, 703296, 742658, 765645, 800696, 826090, 801007, 807669, 793207, 769685, 766312, 762861, 739581, 747004, 772431, 764004, 769161, 795504, 815140, 811076, 797384, 801805, 831288, 795673, 761291, 750266, 757828, 746408, 747270, 763074, 778753, 780091, 769328, 765416, 768991, 775376, 783482, 777279, 771749, 796142, 814151, 821580, 815958, 813442, 801315, 801834, 815583, 837770, 842477, 834473, 833256, 810158, 814889, 843397, 881687, 889536, 868786, 829072, 863474, 887558, 861695, 858417, 867593, 875492, 894283, 921463, 910448, 915616]
9029I15616n601n729j0608K69k158N357J6262J6180J5201P797j5632J6584K2838
9016I76376J0127k16j2118J6662J6618j3253O524J4640j0992k345m249p469k3592
9003I66713J3512L8926M6090n926j1344j9734J12J1008L3870N520l3194p321L9916
8990A078148k15k1145j5256p478J9136M9300j8j1195J2129J3991j3818q265J9503
8977A114817K1327k578q344j4682J100K0337K4969k575J453K602l468J1490J0749
8964A177197J1491p41n361K2141Q02j3655K8741J9296K1100K8981j9282k6005
8952A244705k4468L0949Q211K7915M4085L1971j6269m5517J613L1336k4279j4227
8940A296025j3742K6229O497K9115K8436Q013K5766K6384O817l1278k4986m846
$$ y = [915616, 910015, 904286, 893678, 893947, 891789, 897146, 913408, 929588, 944789, 952586, 936954, 953538, 976376, 986503, 986287, 974169, 990831, 1007449, 994196, 1000720, 1015360, 1004368, 1002023, 997774, 990305, 966713, 980225, 1019151, 1065241, 1059315, 1047971, 1028237, 1028349, 1039357, 1073227, 1078747, 1045553, 1038232, 1078148, 1077933, 1056788, 1041532, 1034054, 1053190, 1102490, 1102472, 1091277, 1103406, 1117397, 1103579, 1095314, 1114817, 1136144, 1133566, 1125222, 1110540, 1111640, 1131977, 1156946, 1154371, 1155824, 1158426, 1154958, 1166448, 1177197, 1188688, 1187947, 1182586, 1204727, 1205529, 1191874, 1220615, 1239911, 1261011, 1289992, 1270710, 1244705, 1220237, 1251186, 1259397, 1287312, 1331397, 1363368, 1347099, 1301582, 1303195, 1334531, 1310252, 1296025, 1282283, 1308512, 1315009, 1344124, 1372560, 1380573, 1406339, 1432723, 1439540, 1408262, 1383276, 1378430]
8928A378430m351J2211j247J297L6790N6631K2879j0653J9563r307K6148L8557
8916A566948j609q639j4589K9357K2132j1081J5364K272n650k611r485J8597L0756
8903A631762K9607j0021K520N994K9351k578O72K2007P64L989m077J3067L2292
8890A755349M143K857J8534J8777m468P77k595K9268L6750J9276k298J6455R961
8877A902786M73k3842J9206R030L5520J4365J3652N158j4508J3971K1799J2962
8865B010572K5231L6939J3580l199Q517N32O313M4893J5755J9606m640M038j6623
8852B161514J0564P165J154J7237M2456J2535K0532j965k102L3077M2346J7462
8840B361975J2283J0206o64M08m877L0156J9241J4689K2822L3597j997L553J7788
$$ y = [1378430, 1374079, 1386290, 1385043, 1386340, 1423130, 1479761, 1502640, 1491987, 1511550, 1502243, 1528391, 1566948, 1565339, 1556700, 1542111, 1571468, 1593600, 1582519, 1597883, 1600155, 1594505, 1591894, 1582409, 1601006, 1631762, 1661369, 1651348, 1653868, 1659862, 1689213, 1686635, 1687307, 1709314, 1710078, 1714067, 1709990, 1723057, 1755349, 1759492, 1762349, 1780883, 1799660, 1795192, 1795969, 1793374, 1822642, 1859392, 1878668, 1876370, 1892825, 1902786, 1903259, 1879417, 1898623, 1907653, 1943173, 1957538, 1971190, 1976348, 1961840, 1975811, 1997610, 2010572, 2035803, 2072742, 2086322, 2083123, 2091640, 2092172, 2098485, 2143378, 2159133, 2178739, 2174099, 2178137, 2161514, 2172078, 2179243, 2180397, 2197634, 2240090, 2252625, 2273157, 2271192, 2269090, 2302167, 2344513, 2361975, 2374258, 2384464, 2383800, 2384208, 2379331, 2409487, 2428728, 2443417, 2466239, 2499836, 2497839, 2501392, 2519180]
8827B519180J574P753N1012O138J065o210J0733K0524K7410j594K1114J6826K1294
8814B696819k02L6867M2678q714N438J339K2061K1157J0702K6139J256L78Q328
8801B864246N152M1518M6659K5328J7870J084P642K1301N3816J4003N935l6452
8789C068102K1736J3013L5763J6217n163L1267L8726J6658O661J6408J5766L5524
8777C310678Q575L481J9391M1260L076j1033J8612K5172k1796K7280L7516N188
8765C467400L3715L4491J4676J909J2937J1772K1451K0780O562O087n156j0723
8753C615901K8844L5643J4907J9557J2155L5582J2453K2279L4221J1545j0393
8742C832694j4202J2764J5861l718J0380J9956J1956j8046n756n65L4951J5712
$$ y = [2519180, 2520754, 2528507, 2579519, 2585657, 2586722, 2580512, 2591245, 2611769, 2639179, 2637585, 2658699, 2675525, 2696819, 2696617, 2733484, 2776162, 2767448, 2772886, 2774225, 2796286, 2817443, 2828145, 2854284, 2855540, 2855918, 2864246, 2869398, 2910916, 2957575, 2982903, 3000773, 3001857, 3009499, 3030800, 3084616, 3098619, 3104554, 3068102, 3089838, 3102851, 3138614, 3154831, 3149668, 3180935, 3219661, 3236319, 3242980, 3259388, 3275154, 3310678, 3319253, 3322734, 3342125, 3383385, 3386461, 3375428, 3394040, 3419212, 3397416, 3424696, 3462212, 3467400, 3501115, 3535606, 3550282, 3552191, 3565128, 3576900, 3598351, 3619131, 3625693, 3631780, 3626624, 3615901, 3644745, 3680388, 3695295, 3714852, 3727007, 3762589, 3775042, 3797321, 3831542, 3843087, 3832694, 3818492, 3831256, 3847117, 3843399, 3853779, 3873735, 3885691, 3867645, 3861889, 3861324, 3896275, 3911987]
8730C911987K0625N171K20J8776j979L0067J5107J1188p873l2015J5259J6975
8718D003508J5241K4004J1816r031N071P071J8689M5783Q893q345K5154j2215
8706D135639k2095j5487l45j0012k2333j5987M357k1Q316J165k1367j5442L90
8693D026778Q696j91k1593k5719q987N0257J1659l5982o1240k3007l604K4069
8681C941136N7852J5928l5342j2649m853l314q923K0592n744l5819m6528k4751
8669C857585L3143k1043j7306O052L829k5462m4124k9700J2503j4513q392j4402
8657C738170j8134k3765m4092l1208j443o858k3353J4107l0974j5854k9541j9540
8645C507515J1334o831j7449p987k8093k7455l466P205K1108k8838m0183j8735
$$ y = [3911987, 3932612, 3937783, 3938003, 3956779, 3954800, 3984867, 3999974, 4011162, 4003289, 3971274, 3986533, 4003508, 4018749, 4042753, 4054569, 4045538, 4050609, 4057680, 4076369, 4122152, 4131045, 4122700, 4147854, 4135639, 4113544, 4098057, 4097712, 4087700, 4065367, 4049380, 4053737, 4053716, 4062032, 4063197, 4041830, 4026388, 4026778, 4035474, 4035283, 4013690, 3987971, 3978984, 4029241, 4040900, 4004918, 3943678, 3920671, 3917067, 3941136, 3998988, 4014916, 3979574, 3966925, 3962072, 3958758, 3949835, 3970427, 3964683, 3928864, 3882336, 3857585, 3890728, 3869685, 3852379, 3858431, 3862260, 3836798, 3792674, 3762974, 3775477, 3760964, 3752572, 3738170, 3720036, 3696271, 3652179, 3620971, 3619528, 3612670, 3589317, 3603424, 3572450, 3556596, 3527055, 3507515, 3518849, 3512018, 3494569, 3486582, 3458489, 3431034, 3427568, 3434773, 3455881, 3427043, 3386860, 3368125]
8633C368125o802k2370l0335n2500m1513k9431O101J0612j8549o528J5450j4939
8621C177321k9907k0927j8934m8202n0844j9121K650j611R669k1748k9806j7693
8609B930847r204l9739m1305j822q944q834m810k0135j5694k1778n144j1255l212
8596B738971p993k0239j8381j4765q66r973k2887P357o462J7075k4751k4181j5480
8583B597425j3065k5174n5980l0305j5742k2977J1232l0136n3693j7139l2897
8572B311549l1998J1710k4864j4011J1418k7522k8473k8658J2398n828M724n3136
8560B137309k7522O170j4268j9044k8446k5612j1199k0109j4719k9825l3794k0931
8548A898010M421q570j3494j4503j6673k9755j7966k5874k314J1752q23j1563
$$ y = [3368125, 3361323, 3338953, 3308618, 3256118, 3214605, 3185174, 3191275, 3201887, 3183338, 3176810, 3192260, 3177321, 3147414, 3126487, 3107553, 3059351, 3008507, 2989386, 2992036, 2990425, 3000094, 2978346, 2948540, 2930847, 2921643, 2881904, 2840599, 2838777, 2829833, 2820999, 2816189, 2796054, 2780360, 2758582, 2753438, 2742183, 2738971, 2730978, 2710739, 2692358, 2677593, 2676727, 2666754, 2643867, 2651224, 2644762, 2661837, 2637086, 2612905, 2597425, 2584360, 2559186, 2503206, 2472901, 2457159, 2434182, 2445414, 2415278, 2361585, 2344446, 2311549, 2279551, 2291261, 2266397, 2252386, 2263804, 2236282, 2207809, 2179151, 2191549, 2185721, 2190445, 2137309, 2109787, 2115957, 2101689, 2082645, 2054199, 2028587, 2017388, 1997279, 1982560, 1952735, 1918941, 1898010, 1902431, 1893861, 1880367, 1865864, 1849191, 1819436, 1801470, 1775596, 1773282, 1785034, 1784211, 1772648]
8536A772648j2293K1794L133k3138n9794l1260K8939p462m3249l6061o827P14
8524A607144M505j2199q671j4730j6323j4280L584r510K3611j0536j6038j1951
8512A524606l7645k8060J512k3111m945M531N922r031l1829k8864J5752Q698k4318
8499A373218n40J1886k4099k3780k4681K341k0765l6579j1936P698K0396K434
8487A275593j8356j1049J1492k9487n8646l1794K7106J8224K680k4489k5341k4194
8475A111739j0854Q463J8960o696O668l484J1427k4387J2882R444k9760k8118
8463A076284k276j7477j0783j1252J2968q79j1720m048j4814j2766n196J7469
8451A015510l2345n700k3009k7937r519j5090m332n368J8867L2788j7200k3419
$$ y = [1772648, 1760355, 1782149, 1785282, 1762144, 1702350, 1671090, 1700029, 1692567, 1649318, 1613257, 1606430, 1607144, 1611649, 1599450, 1590779, 1576049, 1559726, 1545446, 1549030, 1539520, 1563131, 1552595, 1536557, 1524606, 1486961, 1458901, 1460413, 1437302, 1432357, 1436888, 1442810, 1433779, 1401950, 1373086, 1388838, 1397536, 1373218, 1372678, 1384564, 1360465, 1336685, 1312004, 1314345, 1293580, 1257001, 1245065, 1252763, 1273159, 1275593, 1257237, 1246188, 1257680, 1228193, 1169547, 1137753, 1164859, 1183083, 1185763, 1161274, 1135933, 1111739, 1100885, 1109348, 1128308, 1121612, 1128280, 1124796, 1136223, 1111836, 1124718, 1134162, 1104402, 1076284, 1074008, 1056531, 1045748, 1034496, 1047464, 1046585, 1034865, 1030817, 1016003, 1003237, 998041, 1015510, 983165, 977465, 954456, 926519, 917000, 901910, 897578, 892210, 911077, 943865, 926665, 903246]
8439I03246l1400P865K0405N072m2631j5064L0119K6103q952j8037R037q840l871
8426H73052M412k2072J8873P309p512j2096m3834J283P019q281J691o262n490
8413H08092j5212l6666L795L292J1178r446j6174k4124K257j3431K6327R45l2153
8400G08680l3477K4237K1032j0574j5405J766p562k0266J9692O900K5911M620
8388G25554m048K634l3304q835J7571j5680q262k2823r033K6155J4235j7040j7023
8375F50101r794O458m094o453j8324J5764Q358J0481j344m6574l1862k276K1734
8362E92175J576l9505k9710m264J6182J558J322K8435p401J1732j3507l5520J5048
8349E38121M43j3430J0764J1709M744Q508j4622L1480J7512k2436n4887k8627
$$ y = [903246, 871846, 879711, 900116, 905188, 862557, 847493, 877612, 903715, 894763, 876726, 885763, 876923, 873052, 877464, 855392, 874265, 881574, 874062, 861966, 818132, 819415, 826434, 818153, 819844, 813582, 808092, 792880, 756214, 760009, 763301, 774479, 765033, 748859, 724735, 726992, 713561, 739888, 740833, 708680, 675203, 699440, 720472, 709898, 694493, 696259, 688697, 668431, 688123, 695023, 720934, 725554, 721506, 724140, 690836, 682001, 699572, 683892, 675630, 652807, 643774, 669929, 684164, 667124, 650101, 640307, 646765, 642671, 636218, 617894, 633658, 642016, 652497, 651153, 604579, 572717, 570441, 592175, 593751, 554246, 524536, 520272, 536454, 538012, 539334, 567769, 560368, 572100, 558593, 523073, 538121, 538564, 525134, 535898, 547607, 552351, 560859, 546237, 577717, 595229, 572793, 517906, 489279]
8337D89279N206P365J5394k8583j508O986L742L468m859j5204Q573K465r654P131
8323D89801k208m1634M86M0185K2545k6273k0250r924L9099K4905l0095k9452
8311D57185k2194K6306j0822k4715k7640J893N503k6414J5738K7324J31K281J792
8298D26368L5578j8j6382j5506k7016j065k9446n596L1164j1835O174j992j3512
8285C76916K66q716N809r83L1396j2391j8053j8508l912l230J5376J8490J9111
8272D01571k2259o0232j5735L2261O8642M657m1101l0984L283N110l8165k328
8260C04720J1819J635l829K373O02j110k9127r399j8756k0869J2398N8872K2184
8247C31513M949P966m5450j6747L7759K043j7894j0896m119K4716q391k1789J3783
$$ y = [489279, 494485, 501850, 517244, 488661, 487153, 494139, 497881, 501349, 496490, 481286, 489859, 492324, 482670, 489801, 487593, 445959, 446445, 486630, 509175, 482902, 462652, 452728, 491827, 516732, 486637, 457185, 434991, 461297, 450475, 425760, 398120, 400013, 405516, 379102, 394840, 422164, 422295, 424576, 426368, 461946, 461928, 445546, 430040, 403024, 401959, 372513, 366917, 398081, 386246, 392420, 390428, 376916, 377182, 368466, 374275, 373292, 404688, 392297, 374244, 355736, 351824, 348594, 363970, 382460, 401571, 379312, 319080, 303345, 335606, 404248, 408905, 367804, 336820, 340103, 345213, 307048, 304720, 316539, 318174, 314345, 316718, 317320, 316210, 287083, 277684, 258928, 238059, 250457, 309329, 331513, 336462, 344428, 298978, 282231, 319990, 322033, 304139, 293243, 289124, 313840, 305449, 283660, 297443]
8234B97443J3215k7636J2996K2545K9865m635k4856j06m458m403m338R926q546
8221C07012j3545k5788j2332N102Q274P357l398L877k4192K850m453K751K2417
8208B75932Q680o312K314j5775K9900J3211N301k4152k9591l0731j1210L1028
8196B48595M632m887o497k334k5555K2105J1617K0609J8747j0159k3292J166k0709
8183B34038m3517J5893k6341K1085K7944m276r807J6725J6633k9647j8924p437
8171A92369P021K5790L2507O65j8247o1765j8541M0954j7935j2626N0163K8446
8159B48801K2184K845j2636K363l350k1523m4419k6665K9837L2386J5916m796
8147B40943k7719m998K8998J2498k2671m0278m158P321O278J8260p05k1378j0344
$$ y = [297443, 310658, 283022, 296018, 318563, 348428, 343793, 318937, 318831, 314373, 309970, 305632, 315558, 307012, 293467, 267679, 255347, 260449, 268723, 276080, 272682, 276559, 252367, 255217, 250764, 253515, 275932, 284612, 278300, 280614, 264839, 294739, 307950, 313251, 289099, 259508, 228777, 217567, 248595, 253227, 248340, 241843, 239509, 213954, 236059, 247676, 268285, 287032, 276873, 253581, 254747, 234038, 190521, 206414, 180073, 201158, 229102, 224826, 215019, 231744, 248377, 218730, 199806, 192369, 199390, 225180, 257687, 258352, 240105, 178340, 159799, 200753, 182818, 170192, 220355, 248801, 270985, 273830, 261194, 263557, 260207, 238684, 194265, 167600, 197437, 229823, 245739, 240943, 213224, 208226, 237224, 249722, 227051, 186773, 182615, 189936, 196214, 214474, 213769, 192391, 182047]
8134A82047k1078L1156j0407m0075k6586L7424J0994J5361M9779P41j7082k0725
8122A91549J003m409K443k0679j9301k3909M787L468J2254l218k1321j0978L6757
8109A48446L8802J3186j95O067j6426l5444k6387J4012K7675j0677l6586p7K3538
8096A45934l5896m1054j619L0790J6651K8448J9771l112L1312R071j074n829O275
8083A99668r469R949l9344k6452p419p659J213J8873M27Q209M1032Q961m3036
8070A54953j0421L417J0081j7592j9536K9j37J5995L2796J6265k3815l3150o279
8057A22606K3441R784j6662p006N0896J7751K570n38j8149l3717l1926J577j0871
8044A09756J1277L762Q174k7601j5937K8057J1323J3463N025J083n863l8711k9705
$$ y = [182047, 160969, 192125, 181718, 141643, 115057, 152481, 163475, 178836, 228615, 229356, 212274, 191549, 192552, 188143, 190586, 169907, 150606, 126697, 131484, 134952, 147206, 143988, 122667, 111689, 148446, 187248, 200434, 200239, 206306, 189880, 154436, 128049, 142061, 169736, 159059, 122473, 122396, 145934, 110038, 68984, 67365, 98155, 114806, 143254, 163025, 159913, 191225, 200296, 199222, 193393, 199668, 190199, 200148, 160804, 134352, 126933, 119274, 120487, 139360, 139787, 147996, 189028, 197989, 154953, 144532, 147949, 158030, 140438, 120902, 120931, 120794, 136789, 169585, 185850, 162035, 128885, 122606, 146047, 155831, 139169, 132163, 183059, 200810, 203380, 202842, 184693, 150976, 119050, 120627, 109756, 121033, 124795, 132969, 105368, 89431, 117488, 128811, 142274, 147299, 148382, 142519, 103808, 74103]
8031G4103L4992n177J3761J0547N638k165k8006m518P708j480Q538J7574j2830
8018A18685j0241R523J6020L7976J0787K068k4617j1156J6273m822k2716J091
8006A38871J178N610K292N359J6868j2553l9977J8776o597k2612M822L6580J6374
7993A64991j9690q587l5119l2602J4993J6663R825M411M484J9255l8027k2474
7981G8123P39J81M413k0043J4255P565N113J128M142K299J6092l50R96j4242k7471
7966G2940O631J8535Q945p520j8408J0207L2609J5304k3247m3484j6143j1803
7954D4566R192L4033M7960J1419m089l9253j1542Q176J2680N219K1862r379o7114
7941F3730j4617K7380J664j3175J0972o960m366K3101L0917k25Q899K1102o311
$$ y = [74103, 109095, 103918, 117679, 128226, 133864, 131699, 103693, 99175, 106883, 105403, 113941, 131515, 118685, 108444, 117967, 133987, 171963, 182750, 184818, 160201, 149045, 165318, 160496, 137780, 138871, 140049, 145659, 147951, 153310, 170178, 157625, 117648, 136424, 129827, 107215, 112037, 148617, 164991, 145301, 136714, 101595, 68993, 83986, 100649, 110474, 114885, 119369, 138624, 100597, 78123, 78862, 79043, 83456, 63413, 77668, 85233, 90346, 91474, 95616, 97915, 114007, 113657, 114653, 100411, 72940, 79571, 98106, 107051, 99531, 81123, 91330, 123939, 139243, 115996, 72512, 56369, 44566, 53758, 87791, 135751, 147170, 143081, 103828, 92286, 100462, 113142, 118361, 140223, 130844, 63730, 49113, 76493, 78157, 64982, 75954, 68994, 64628, 87729, 118646, 118421, 127320, 148422, 142111]
7928A42111l3177k6817K84j2678K3116K7076l602m1910m416N062P072M9j9336
7915F2834j5051K3834K6036j7749L337P806k2403n270J5890o154p518m25J6062
7902H1229j9718J2672J2145n670r301K0586o42M613k410N554l0512J0252J3176
7889I1974M93P71j9170J1098Q166l27q774m8035j3219J9957L6162J2487j5075
7876G6508j5650Q914K3590k1908l6063l575K3363o679P153J845K0163K4483j1823
7863I0321m8088k0013J1072M2321K922n843M425j1879l1298j8061K1253J4657
7851E1789N282J9727j1311k7289o099N932m736J21J5043j4548J4321K4265l3189
7838C9308m750L6480q50k3560k1332l1814R682K0514j1956R282P176J1630k0378
$$ y = [142111, 108934, 82117, 82401, 69723, 92839, 119915, 116313, 74403, 69987, 75049, 82121, 82170, 62834, 47783, 71617, 97653, 79904, 83241, 91047, 68644, 63374, 79264, 73110, 65592, 65167, 81229, 61511, 74183, 86328, 80658, 71357, 91943, 91301, 95914, 93504, 99058, 68546, 78798, 91974, 92467, 93238, 74068, 85166, 93332, 93005, 84231, 36196, 22977, 42934, 79096, 91583, 76508, 60858, 69772, 93362, 71454, 35391, 31816, 55179, 48500, 55653, 57498, 77661, 102144, 90321, 42233, 22220, 33292, 75613, 78535, 72692, 77117, 65238, 33940, 15879, 37132, 51789, 57071, 76798, 65487, 38198, 32099, 38031, 33295, 33416, 48459, 33911, 48232, 72497, 39308, 34558, 71038, 70188, 46628, 25296, -6518, 3164, 23678, 11722, 21004, 28180, 39810, 19432]
7825A9432j3027R097L5212j1644Q799j1972q143J2385K4712k322k2150r861J5931
7812D6449L197N294K896k9845J461J2234m671n576K9032O271K1139N788M94l0708
7798F3455j0904M388N016l9097j3391m087j2787J1219M5091M985n327n304j3121
7785C0136L498l0879j0454K5551K3685j6048j4139K2544L95k0129l724K37J715
7772A2388P913J6630J7381Q553K8008l40k2443j2812k8007M270j1578R52j194
7759A9721J3665P805Q994p763q622k8365j0672K3960J5208K5476l069j634k4797
7746B9907J9605K5868N95k633k0097K574k3739o204k867K2505l358j9158O470
7733B9468k015N27k2841j0085J095J3824K3309p533K314L231O832J1826K4100
$$ y = [19432, 6405, 15502, 50714, 39070, 47869, 35897, 27754, 40139, 64851, 62529, 40379, 30518, 46449, 49646, 54940, 57836, 27991, 29452, 41686, 37015, 31439, 60471, 66742, 87881, 93669, 94163, 63455, 52551, 56939, 61955, 22858, 9467, 5380, -7407, 3812, 48903, 53888, 48561, 43257, 30136, 33634, 2755, -7699, 17852, 41537, 25489, 11350, 33894, 34289, 14160, 10436, 10673, 12388, 20301, 36931, 54312, 62865, 90873, 90533, 68090, 55278, 27271, 31541, 19963, 20915, 19721, 33386, 41191, 50185, 42422, 33800, 5435, -5237, 18723, 33931, 59407, 56338, 54704, 29907, 49512, 75380, 75975, 73342, 53245, 55819, 32080, 25876, 23009, 45514, 42156, 22998, 29468, 27453, 27980, 5139, -4946, -3851, 9973, 33282, 25749, 28063, 31294, 38126, 49952, 74052]
7720G4052k938j3973k6575q349p356n931Q815m199R46K5602l05k4575j4942J261
7706A533L0849K5933J4849k3411j9341J0000N040m7551k4894O588J4269K6266
7694B0130N653q065m0216Q505L5825M6706J6177j180k8575k318q216P161J977
7681E3564l4677R519M0023M488j9189l4569L268K3349O619K94m011l6152k8191
7668a5665L312J7429J2854j9050r743L4461L19l8814j5183K6480K1638k0735J3944
7655A1247M1283R093O466m375j1738l5183m997O569k5250n4876j8802K9658L4512
7642a6393O0544O955k4293j1038j2595l275K963J8099J0053J2556k2231o641R596
7629B4300m459j2446m4827n483J643N242J1188J3471L8517K2466R314l388k2408
$$ y = [74052, 71114, 57141, 30566, 22217, 14861, 8930, 17745, 13546, 14492, 40094, 39789, 15214, 272, 1533, 32382, 58315, 73164, 49753, 30412, 40412, 45452, -2099, -26993, -20405, -6136, 20130, 25783, 17718, -22498, -13993, 21832, 68538, 84715, 83535, 54960, 52642, 44426, 51587, 53564, 18887, 28406, 68429, 72917, 53728, 19159, 22427, 45776, 52395, 52689, 48678, 12526, -15665, -12353, 5076, 17930, -1120, -10863, 23598, 23917, -14897, -30080, -3600, 18038, -2697, 11247, 52530, 61623, 68089, 63714, 51976, 16793, 11796, 18365, -6885, -61761, -80563, -50905, -16393, 44151, 51106, 26813, 15775, 3180, -95, 2868, 20967, 31020, 43576, 21345, 14704, 24300, 19841, 7395, -37432, -42915, -41272, -36030, -24842, -11371, 27146, 49612, 58926, 55538, 33130]
7616C3130L810K4026J6922m911j2500K180J693k3277k0636l656R740M228K9404
7603F0153J4681M316J517j3807k1204j8869K5084j0382o683k01L7417j5095l0477
7590B6450k1283j6914k318j4730L0772j0642k3753K9837K196J056R222J780j2668
7577i95j9162k9949m722K0068m832n764p354K0828K0719K4246J6212j8471n042
7564E782k1858j4742J4552K7843n742J8968j754l0450R195L1356L645o588k0847
7551I360N600K2166M334K435j0888k0029j2101K1334L886k734Q928J0600K096
7538D4987R559R013q867k2093J1269P426l18J7165j1252o801N471P424n412N15
7524E8086J3581n045k2023j3684k8296l2094k385j0182m293K2280K8441J0757
$$ y = [33130, 36940, 60966, 77888, 72977, 60477, 62657, 64350, 41073, 20437, 16781, 26521, 30749, 60153, 74834, 79150, 80667, 66860, 45656, 26787, 51871, 41489, 34806, 34605, 72022, 56927, 26450, 5167, -11747, -14065, -28795, 1977, -8665, -32418, -2581, -385, 671, 9893, 11673, -995, -20157, -50106, -54828, -34760, -39592, -45356, -52710, -31882, -11163, 13083, 29295, 10824, 5782, -16076, -30818, -16266, 11577, 5835, 24803, 23049, -7401, 1794, 33150, 36795, 30207, 9360, 14960, 37126, 41460, 43895, 33007, 12978, 877, 22211, 26097, 23363, 32291, 42891, 44987, 54546, 63559, 54692, 32599, 43868, 51294, 50976, 68141, 56889, 50088, 55559, 62983, 57571, 58086, 71667, 66622, 44599, 30915, 2619, -29475, -31860, -42042, -46335, -24055, 4386, 15143]
7512A5143J3349k0006j8150j1103m717J7357M0190L616j5124o226J0124m482k6390
7499f419r388J2016L3954k8308j1447j8546J2109J1347k49L732J484j6896j2742
7486b9353K1816N90j2382J6553J1938k1671j5474j7622j0516L1606J3897J5034
7474D416k369K9762J5773J1917k6251k3957M085Q205n124j5414k659j6528m471
7461b2615K2729P101j9909J3841R72P776M108p388M198N605l554m886k7786p514
7447b7322Q278K0583Q374k099K919P469J2101L280j838k2002l625l1465R105M148
7433a2094j693J5261j342j4311n407j204P777L7990o941l3308k080K7146J2044
7420B1838N600j8097j897Q634q375K631l26j8163j6629j3246q986J2939K6599
$$ y = [15143, 28492, 8486, -9664, -20767, -25484, -8127, 32063, 35679, 20555, 14329, 24453, 19971, -6419, -15807, -3791, 30163, 1855, -9592, -28138, -16029, -4682, -4931, -1199, 285, -16611, -29353, -7537, -6947, -19329, -2776, 9162, -12509, -27983, -45605, -56121, -24515, -10618, 4416, 2047, 31809, 47582, 59499, 33248, 9291, 13376, 21581, 16457, 1043, -1616, -18144, -22615, 114, 7215, -12694, 1147, 2119, 9895, 14003, 6615, 10813, 16418, 12864, 7978, -19808, -27322, -19044, 1539, 9913, 7814, 10733, 18202, 30303, 33583, 31745, 9743, 6118, -25347, -16242, -12094, -13787, 1474, 132, -14179, -19586, -20790, -13013, 24977, 18036, -15272, -17352, 9794, 21838, 27438, 9341, 7444, 16078, 7703, 10334, 10008, -8155, -24784, -38030, -47016, -34077, -7478]
7407g478K510R373j4262q604K4961K3757J0953q464n854K985P445j3589J215J2163
7393C7111K854q012j2721j072q118k5830R564J0648j0341k4125J2337J7223j995
7380b477J47K223j8107J0810J0410J1821J3570K689O347P26K238J2037k725k0159
7366B9550n859j1126l7240p630J5791m247J5889J4287O000O020l2497j8833K2862
7353g033L1332L910j1751l287m234p296k3831L531M623j2613o807K1054m614J4136
7339b880q511P004L1191j3629j7818N097J6647J867j813l857K0096K249j2297
7326B3346o291q241m540k2625N345K0847j0131j0007J3841J3432J7654k747k9649
7313B34j3952k641p331j3787R179l0979j5184L1782L602K0589L6110M375j699
$$ y = [-7478, -4968, 4405, -9857, -18461, 6500, 30257, 41210, 32746, 26892, 29877, 37322, 23733, 24948, 37111, 39965, 31953, 19232, 18160, 10042, -15788, -6224, 4424, -5917, -30042, -17705, -482, -2477, -2330, -107, -18214, -7404, 3006, 14827, 28397, 31086, 37433, 38159, 40397, 52434, 49709, 29550, 23691, 12565, -24675, -32305, -16514, -20761, -4872, 9415, 15415, 21435, -11062, -29895, -7033, 24299, 28209, 16458, 13171, 8937, 1641, -22190, -18659, -14036, -26649, -33456, -12402, -17016, -2880, -11391, -4387, 26804, 13175, -4643, 454, 17101, 18968, 17155, 13298, 33394, 35643, 23346, 17055, 8814, 4274, -18351, -13006, 7841, -2290, -12297, 1544, 14976, 32630, 29883, 234, -13718, -16359, -23690, -37477, -28298, -59277, -74461, -42679, -39077, -18488, 17622, 21997, 20298]
7300B0298k1667L719J2591p900l1250M296J9251l182Q076K273k666O47j692K1466
7286B4260j0535k2397k398k6031l049J5162k2186j116J5158L3657M3298J6925
7274F0748j3445n722k6224p091j8905J2231K933j6727k7545K3131J2674J5441
7262A1499j4214K428L2492p382l2876J4079j176k9980j2616K2898J8406K3629
7250B7187j8560j3541l483l263j8822o355o289K0616K6899J6620o823l3585m556
7237b3955K5025o987K673K3836n705n254o946J559N87J1294m202j3153l848j1112
7223a6188j0436J3707K3618K381k080l8841K35j479k777N016j2910M176J9797
7210a5781L4855K566j0857K1348j5796k9443j2621L884J8896L0453K5893k5795
$$ y = [20298, -1369, 2350, 14941, 7041, -24209, -19913, -662, -3844, 4232, 6505, 3839, 4486, 2794, 24260, 13725, -8672, -11070, -37101, -40150, -24988, -47174, -48290, -33132, 525, 43823, 60748, 47303, 41581, 15357, 8266, -10639, 1592, 4525, -12202, -39747, -16616, -3942, 11499, -2715, -287, 32205, 24823, -8053, 6026, 4850, -25130, -37746, -14848, 3558, 27187, 8627, -4914, -8397, -11660, -30482, -36837, -43126, -22510, 4389, 21009, 14186, -19399, -23955, 1070, -5917, -3244, 20592, 14887, 9633, 2687, 4246, 4833, 16127, 11925, -1228, -5076, -16188, -26624, -12917, 10701, 13082, 11002, -27839, -27604, -29083, -31860, -26844, -39754, -35578, -15781, 19074, 21640, 10783, 32131, 16335, -13108, -25729, -21845, -2949, 27504, 53397, 27602]
7198B7602k4892j8130L478J1908l4539n2486O779M2027P179O332N134j745p06
7185b2059O919L6182J615k4179Q333m07l581j7418k0351p45j9515j2413L6599
7172c1020J7861K1173N726k131k9983l872P59R616J4231j1996k0447J3250k7107
7159d3940k341n270M3178k04J4108m571l6054K807N0829Q320q218k3038l394L4532
7145B6744J1691j8908k3847O700j953k3240K5449J4888M690l3227k972M680P752
7132a553o76M07j609l3241j5722L7098M1296q305J7037J307M08l7089j4246k264
7118a7152j1389K6990J2416N064l05r652K5222j788m1959n2105o280l355K6032
7105d8261K6654J8220K1391j8088k436J374P363j2798j575j5585l6248K907K9035
$$ y = [27602, 2710, -15420, -11942, -34, -34573, -87059, -80280, -38253, -31074, -24742, -19608, -21353, -22059, -15140, 21042, 22657, -1522, 6811, 6404, 2823, -14595, -34946, -35691, -55206, -67619, -31020, -13159, 8014, 13740, 11609, -18374, -22246, -21487, -11871, 2360, -9636, -30083, -16833, -43940, -46281, -51551, -8373, -8577, 5531, 960, -35094, -32287, 18542, 26862, 18644, -4394, -7788, 26744, 38435, 19527, -4320, 2380, 427, -22813, 2636, 17524, 22214, -11013, -13985, -9305, -1553, -2229, -1822, -3431, -36672, -52394, -15296, 26000, 17695, 34732, 36039, 36447, -642, -14888, -17152, -28541, -1551, 10865, 15929, 15624, 5972, 31194, 29406, -12553, -64658, -70938, -74293, -48261, -21607, -3387, 18004, -84, -2520, -1146, 6217, -6581, -8156, -23741, -59989, -57082, -28047]
7092b8047J4320K390J0980R676j436O445J4031K454j1097n658p861k0293k5519
7079c9615P26n27J2659M3711J5577K2578n5571n2269l504K6913J7179n113r010
7066b6266l2670o703K9551L6669R962j0686j7794l564R268j7276j4306K7876M7432
7053C1493p350j5830K02L938j0347k0816J5356J6224q512k6492l5894P574P068
7040d3386j0428J5876K0160k7409P705J5162K5419K5049K6074k8063Q934K4780
7028E9873p241l320M900m4770k9770J5986j1040J2567l617k8009K5488L8334J9706
7015D9087P736j792J8016j0547j6342m0250j7751J8639K2871j2211K090O434J0836
7002C6816k4076m8153j5950j158J9339O994j085k5664l2994P367N4415L1511m363
$$ y = [-28047, -13727, -11337, -357, 9319, 7883, 14328, 28359, 30813, 19716, 14058, 6197, -14096, -39615, -38889, -39416, -26757, 16954, 32531, 55109, -462, -52731, -56235, -29322, -12143, -17256, -26266, -58936, -65639, -36088, 581, 10543, -143, -17937, -21501, -12233, -29509, -43815, -15939, 31493, 24143, 8313, 8515, 12453, 2106, -18710, -3354, 12870, 4358, -22134, -58028, -50454, -43386, -53814, -37938, -17778, -45187, -37482, -22320, 3099, 28148, 54222, 26159, 35093, 59873, 52632, 49312, 54212, 9442, -20328, -4342, -15382, -2815, -6432, -34441, -8953, 29381, 49087, 56823, 55031, 73047, 62500, 46158, 5908, -11843, 6796, 29667, 17456, 19546, 25980, 36816, 12740, -35413, -51363, -52521, -33182, -26188, -27273, -52937, -85931, -78564, -24149, 7362, 2999]
6989B999j4263J3938l2434l7595K1467K3929j6023k804J6203K5091J571k089j0867
6976a0877J1532J8462n71N019M975j6937k5240m7637K5358K0597J4960L1029K7973
6963E8643n411l6679q235j1410J8709M500q364J575K7078j1282k3120j280k239
6950B485k8641N847R906j6417L0944L9380J0710j5657j5017O623l120m7052j2682
6937c2691N8092K8312j3367l6783J959N471j2111k2117j3893j8958j8758Q22J9584
6924e4438J3942R683l321L1715L5642K8759l1088n681O299j5750j8982j3365N446
6911a1139J8627n364K4274j590q320r507j496j7389K900j6814Q217J7834J626
6898A859n718j8830M981J8510J630L093l192j5097k0316j1107J4845J2287J1226
$$ y = [2999, -11264, 2674, -29760, -67355, -45888, -21959, -37982, -40786, -24583, 508, 2079, -10, -10877, 655, 19117, 18546, 23565, 28540, 11603, -13637, -61274, -35916, -15319, -359, 30670, 58643, 53232, 16553, 8318, -3092, 15617, 20117, 11753, 13328, 40406, 29124, 6004, 4724, 2485, -26156, -20309, -10403, -26820, 4124, 43504, 54214, 38557, 23540, 30163, 27043, -20009, -32691, 25401, 53713, 40346, 3563, 5522, 10993, -1118, -23235, -37128, -56086, -74844, -74022, -54438, -40496, -30813, -34134, -2419, 33223, 61982, 30894, 25213, 31512, 15762, -3220, -16585, -11139, 7488, 2124, 26398, 24808, 16488, 6981, 5485, -11904, -9004, -25818, -17601, 233, 1859, -3859, -22689, -17708, 802, 2432, 5525, 2333, -12764, -33080, -44187, -29342, -17055, -5829]
6885e829K9173J9806J3776M853j8446k5210j9588n854k5784k8385j345K0658J3174
6872b9001P97j1183j8659j1262Q119J6678M563J7060J7776j8694j1659L2002K2675
6859A9212J0561k129l8766n3131j703J5887O701k1785n026J562K2070J7097M827
6846b4623P671q449J6972l0684j4824m901K4086M1321K7835L902j8249J0118j722
6833B8453j5835r51k0616m093O574k4802O559K1958p049n762j3698M015M539J143
6819a9565J8598M563p226k3841m5921k641K6550J1165L6798K3455J725p872Q403
6806B4191J026j3895q441r155J0720r645K279J6348j635k0119j6688K017K6866
6793C869m210k3715j9846N586k1254J7909K5374K1093K476j7522l994p292j0845
$$ y = [-5829, 23344, 43150, 56926, 61779, 43333, 18123, -1465, -7319, -33103, -61488, -62833, -42175, -29001, -28204, -39387, -58046, -69308, -61189, -44511, -39948, -22888, -5112, -23806, -35465, -3463, 19212, 29773, 27644, -11122, -64253, -65956, -50069, -43368, -65153, -70179, -68617, -46547, -29450, -24623, -16952, -25401, -8429, -39113, -53937, -58838, -34752, 6569, 34404, 38306, 20057, 30175, 28453, 12618, 11667, -8949, -13042, -6468, -31270, -24711, -2753, -9802, -15564, -29262, -25247, -20708, -19565, -967, 3596, -3630, -27471, -73392, -76033, -49483, -38318, -1520, 21935, 23660, 15788, 24191, 25217, 11322, 2881, -6274, 4446, -5199, -2920, 13428, 11793, -8326, -25014, -22997, 3869, -341, -24056, -43902, -38316, -59570, -41661, -16287, 4806, 7282, -10240, -14234, -21526, -32371]
6780c2371J2169K481M110O244k092k5207l495J0889J4440K6948J6565l643k7051
6767a3k8017o301j861q732L0863J9240J8765O481k9163K134j0874k507J1988K2855
6753B4858P311j529j5189k3747q646m711J1056K093N756K7157K2225J8908K1417
6740H6959J5715J0520J1834L3280K1283r296j9123Q869J2793k161K2342J8062
6728B11077l339J2024K3383J6694M4585L4101P3555R0943J76794K57779L46282
6717A283878N09979Q03039J039857Q69874k04690j204072j086299o78736l94625
6708I38205k58631j70923j37011p5214n7302l4449l9421m2831j2481j2765J225
6697I8402k515j79J5275k2003J2960K6175J6232k2355n326k4034k8639j8252o389
$$ y = [-32371, -20202, -17721, -13611, -7367, -9459, -34666, -38161, -27272, -12832, 14116, 30681, 27038, -13, -28030, -34331, -36192, -44924, -14061, 5179, 23944, 30425, 1262, 3396, -7478, -9985, 2003, 24858, 32169, 30640, 15451, -8296, -16942, -21653, -10597, -8504, -2748, 24409, 46634, 65542, 86959, 102674, 113194, 125028, 158308, 179591, 170295, 151172, 160041, 172834, 170673, 193015, 211077, 207738, 219762, 243145, 259839, 304424, 338525, 412080, 503023, 679817, 937596, 1283878, 1793857, 2596896, 3636753, 4506627, 4301937, 3097865, 2011566, 1332830, 938205, 679574, 508651, 371640, 296426, 239124, 204675, 165254, 122423, 109942, 97177, 98402, 95887, 95708, 110983, 88980, 101940, 128115, 144347, 121992, 116666, 92632, 63993, 45741, 39352]
6684C9352j2654k1503P777O969j0887K0316J7643K364m179k5502m999j788k4659
6671a1750R019l920k7616O578J445o533p035J4873K4423J6704N645L700j2817
6658A2716j6781j1318J4257J7978M271k4038r133k5422p374K3466J1781j042M4261
6645C3622L2625j4539p497J737J1967k3024l6507K2445O487J6263r619j6137L385
6632B1208j5778J3529O358j7586j5351P388K3807L214K016r66q776J6450l287
6619C2226j4607j4125P693j6183l0039j4669K1639J2942N805n389J0958J8163
6607A4414J2772k1140q067N181k0618J092L775r952j3286j0407m358L386J3795
6594c3413q252M0305M1366m0190P708j314k5674m9951p636M1610L1845l044J5131
$$ y = [39352, 26698, 5195, 12972, 19941, 9054, 29370, 47013, 49377, 45198, 19696, 14697, 12909, -11750, -2731, -6651, -34267, -27689, -26244, -32777, -39812, -24939, -516, 16188, 21833, 25533, 12716, -4065, -15383, -1126, 16852, 21123, -2915, -12048, -37470, -44844, -21378, -9597, -10639, 33622, 66247, 51708, 44211, 45948, 57915, 34891, -1616, 20829, 27316, 43579, 33960, 17823, 21208, 5430, 18959, 25317, 7731, -7620, -232, 23575, 26789, 28805, 27839, 19063, 35513, 32226, 17619, 3494, 11187, -4996, -35035, -49704, -28065, -15123, -9318, -14707, -3749, 14414, 27186, 6046, -2021, 3160, -17458, -16366, -12591, -22543, -35829, -46236, -50594, -47208, -33413, -41665, -1360, 40006, -184, 7524, 6210, -19464, -69415, -77051, -35441, -3596, -6640, 8491]
6581H491Q798j7561l5140k2972N714J1604l7726j9402L0181L4495R798P708N007
6568a1005K7973K86L488j2443J279p228k2856l927K0023j5781O36J4580L0764
6555B5789P02k5026q41P317k3035M644J0477k2916j862m445l1022Q81M3468N6182
6541D0313L524k6511K1621O17q178J2273j77l4198p422n834K1215j6010p763k4938
6527c1468p532J6077M813K753o293M437q661L418J95j1399j515K0773j5162j577
6513c1141M053M2885j1730j8000P830M024P495m549j4753k9123k7754R006J4424
6500d7333J1681K3828J1837j0181q040J9315m919j029m054Q924M062k3237l272
6487b2418k1032j3259K1433K9576N580j8011k6617k3911j278J4635K1219J5634
$$ y = [8491, 17289, -272, -35412, -58384, -52670, -41066, -78792, -98194, -68013, -33518, -23720, -16012, -11005, 16968, 17254, 20742, 8299, 9578, 2350, -20506, -24433, -4410, -20191, -19555, -4975, 25789, 26491, 1465, 624, 7941, -15094, -10450, 27, -22889, -24751, -29196, -60218, -59337, -15869, 40313, 43837, 17326, 38947, 39564, 31386, 43659, 43482, 9284, 1862, -3972, 17243, 1233, -6530, -31468, -39000, -22923, -18110, -15357, -21650, -17213, -25874, -22456, -22261, -33660, -35175, -14402, -29564, -31141, -27088, 15797, 4067, -13933, -6103, -2079, 5416, 867, -13886, -43009, -70763, -61757, -47333, -35652, -11824, 13, -10168, -18208, 1107, -3812, -4841, -8895, 29, 4091, -19146, -22418, -43450, -56709, -35276, -5700, -120, -18131, -44748, -68659, -69937, -55302, -34083, -18449]
6475a8449J939J1946K4654K1786j1277n3629j8109J238K2445r757M954J6176J0393
6462D310k1340k369j6252j5896K162K982J2065N5035k7274n579N421Q097n778
6449d416l762O964m806k4378k9703J5340K6780L614L043K1498j6404P282J0770
6436A1822M497J3362R573n4643m4794J6184L8068K6879q837r802n494j8969J6577
6423e577l5278l6758K9840L0694N159l1649j4751o598L1583L219J6312J0995j0449
6410a3258P09Q467R259J323J6880Q294k5421k2480K240J6155k6859k0692J2370
6397c3013o399J471K7085J1237J565q77k3202o011J9579K013L930j6245o715R82
6383b4600q516L033n959q40o972m716L1677J6651J0345J8292n633j6914j4740
$$ y = [-18449, -16510, -4564, 20090, 41876, 30599, -23030, -41139, -39901, -17456, -27213, -22259, -6083, 4310, -17030, -19399, -35651, -51547, -49385, -46403, -34338, 20697, -6577, -12156, -6735, 1362, -4416, -8178, -1214, -6020, -30398, -60101, -44761, -17981, -14367, -11324, 10174, -6230, 1052, 11822, 16319, 29681, 39254, -15389, -60183, -43999, -5931, 20948, 12111, 2309, -3185, -22154, -5577, -40855, -77613, -47773, -17079, -11920, -43569, -58320, -64918, -33335, -30116, -13804, -2809, -13258, -12549, -4082, 5177, 6500, 23380, 31674, 6253, -16227, -13987, 2168, -24691, -45383, -33013, -39412, -37941, -10856, 381, 1946, 1069, -22133, -28144, -8565, -6552, -2622, -18867, -25582, -24600, -33116, -30083, -36042, -36882, -43854, -48570, -16893, -242, 10103, 28395, 22762, 5848, -8892]
6370h892Q71j2408O34J941j6329J857M267j0972j1631J8862L2471n653M499P801
6356G318K820j3205o711K6833j762k773j614j5519k0648p970j8179J5491J5950
6343a9969K3836N670l3706P433R987l573j0342j222K3844l3828J6788J1902j4726
6330a7906j6922R439K6533j8741n164J5235j9574l0599K6333r55J61j178k9788
6317f3126r243J2148N311j8177M000K1596L4141P390j703K6688p266k9771l2275
6304e0287n466k1295L8463L9568j6187j8078M173O620K889P620j0134j9225M698
6291c6641L2869K7067p189J0471k5204o926k58j0669j7310r243j4875M137R002
6278d4769Q447k0440k2598J2841J6227J1387L577J2569r79j663k4183R863M2695
$$ y = [-8892, -8021, -20429, -19795, -17854, -34183, -32326, -28059, -39031, -50662, -31800, 671, -4982, -483, 7318, 10138, -3067, -9778, 17055, 15293, 12520, 10906, -4613, -25261, -33231, -51410, -35919, -19969, 3867, 9537, -24169, -16736, -6749, -10322, -20664, -21886, 1958, -31870, -15082, -3180, -17906, -34828, -25389, 1144, -17597, -22761, -7526, -27100, -57699, -31366, -32321, -32160, -33338, -63126, -72369, -60221, -54910, -73087, -69087, -47491, -13350, -5960, -7663, 19025, 11759, -18012, -50287, -55753, -77048, -38585, 983, -15204, -33282, -29109, -22489, -19600, -11980, -22114, -41339, -36641, -3772, 23295, 16106, 26577, 1373, -5553, -5811, -16480, -33790, -43033, -57908, -53771, -44769, -36322, -56762, -79360, -66519, -50292, -38905, -35328, -22759, -23738, -25401, -49584, -39721, 2974]
6265B974o217J5474k8041k1928K9929Q976N553Q643L589O239m7034l9722k9309
6252i0874J6231J3539Q764L0196O609J7783n621j7922J053K3238J2015M852J135
6239B0998K505j5923n227Q515j9968k9849K9492L0662j0738o743j6137o102L068
6226a5447q820L110J5690L8266l0444l1603J3062R733k2403j2955K1436l2721
6214e3096k4089j2012J8496N0677P228p743R314j6997j2112l1651J2178N7379
6202b428J2968j2092K897r756j7418k1860l084o322J1772J911j3954K2363J1383
6189b3620Q246L5937L378k3762k6124m0907q099K1720M104J164J6113j9404J7396
6176c3858J9318Q705l240Q41k6190l026Q430o688K0957N298l0948r910J1408j261
$$ y = [2974, -3243, 12231, -15810, -37738, -7809, 1167, 6720, 15363, 18952, 25191, -21843, -61565, -90874, -74643, -61104, -52340, -22144, -15535, 2248, -3373, -21295, -20242, 2996, 15011, 19863, 20998, 23503, 7580, 2353, 10868, -9100, -38949, -9457, 21205, 10467, 3724, -12413, -18515, -15447, -24267, -21157, -5467, 32799, 2355, -29248, -16186, -6453, -28856, -41811, -20375, -53096, -77185, -89197, -70701, -20024, -12796, -20539, -11225, -28222, -40334, -71985, -59807, -2428, 10540, -1552, 1345, -8411, -25829, -47689, -50773, -57095, -45323, -43412, -57366, -35003, -23620, -15374, 20563, 23941, 179, -25945, -66852, -74951, -53231, -49127, -47963, -31850, -51254, -33858, -14540, -5835, -9075, -8234, -34424, -37450, -29020, -35708, -14751, -9453, -40401, -50311, -38903, -40164]
6162d0164K0068L4132m56j4541J4960J5129k6632k4070j5395j22p177r430j026
6149e4724P54J2113k970L8029L2650j64k4088j0192J799j2036j8820P519R222
6136b0908K8811K3041l5044J7112j5000l269j7732j3298O625K9458j3733j6029
6124b9966J8455J1679K3549j8542m0631j127l430J2700Q14J844p784k2908N293
6111e0054k734J5622J423J4665M066O939l5j6422K8992J8918o811o235l0208j4162
6097c6036Q347J8842l4059r530m521L0845M026J2902J56k4689R464L2008J3356
6084B1111J3369j0438j2843J9683J5038J0551l522k4513l7341J168R203o920J277
6071d177J1928M528k1504j0578J464M2264K3652k0002k418l3150k5585r190m472
$$ y = [-40164, -20096, 14036, 13580, -961, 13999, 29128, 2496, -21574, -36969, -37091, -44268, -53698, -54724, -53970, -41857, -44827, -6798, 25852, 25688, 1600, -8592, -6793, -18829, -37649, -30130, -20908, 7903, 30944, -4100, 13012, -1988, -5257, -22989, -36287, -29662, -204, -13937, -29966, -11511, 168, 23717, 5175, -35456, -36583, -40013, -27313, -26499, -24655, -32439, -55347, -50054, -52788, -37166, -35743, -21078, -17012, -10073, -10108, -26530, 2462, 21380, 14569, 8334, -21874, -36036, -27689, -8847, -42906, -52436, -56957, -26112, -22086, -9184, -9028, -33717, -24253, 7755, 21111, 34480, 24042, 11199, 30882, 45920, 56471, 52949, 28436, -8905, -7737, 1466, -5454, -4177, 7751, 12279, -9225, -19803, -18339, 23925, 47577, 27575, 25157, -7993, -33578, -42768, -47240]
6058d7240J5472q923k7109L9945L3322j3963n289j4109j1023J1391m749o210M01
6045c8084Q968J8576k349l474K2610M669k1241m525J4759J6709m135o505k3522
6032a7544j5924K1279J0821j1369p359K1547N063O954r826J1204j5423k9831j3702
6019d4110K0408L125k350K7534K8646P054K0650P623j5634k8853Q583j1875m6379
6006b5578j354J3029o862j2816K6695j0740r558J4876j0495l4918Q296K7326M3320
5993B1221j8199j9087M070o705k989j8378J7555J8328Q942J5101Q376j126L044
5980C0153j143n352k6511j4700n218k3781k9756K4929J9023k872l14J5379J1422
5967h741j3899j1902Q468J9893J0648J96k858j3275l6580J0575K2487K4261J57
$$ y = [-47240, -31768, -40691, -67800, -27855, 5467, -8496, -13785, -27894, -38917, -27526, -32275, -38485, -38084, -29116, -10540, -12889, -16363, 6247, 10916, -10325, -14850, -91, 16618, 12483, 5978, -17544, -33468, -12189, -1368, -12737, -20096, 1451, 6514, 13468, 3642, 14846, -577, -30408, -44110, -23702, -20577, -22927, 4607, 33253, 40307, 60957, 68580, 52946, 24093, 32676, 20801, -25578, -26932, -13903, -20765, -33581, -6886, -17626, -27184, -12308, -22803, -57721, -49425, -22099, 21221, 3022, -16065, -11995, -18700, -21689, -40067, -22512, -4184, 4758, 19859, 28235, 27109, 30153, 29010, 23658, -2853, -17553, -22771, -46552, -76308, -51379, -32356, -35228, -35542, -20163, -8741, -22640, -34542, -26074, -6181, 4467, 4663, 1805, -11470, -48050, -37475, -14988, 9273, 9430]
5954I430K823J46k7146K613K0660Q925k6659m515M766J4619J542j1731k8400j4746
5940d7673j5284J4813K2750j1966K3944J1067K044K1833k583k5112k0644K0011
5928f800l1080j6904k1736K58O5814L4421P493k0126m0002j7143j5164J6063M3180
5915a726q451J0896J761l8665k6280K1007J9827J7250j5003j005J616J8167j049
5902a655q461n523R133O4r837k1478J7325N026M921j8599J1954J45j9176J5202
5888b0959K4022L445j0171N633K5356J0762N775J0376N045k0238k0651J1525p30
5875B9190j1832m1788j0850J9422R548J6458j7645J1943k808M157J868J1315j1550
5862G428K3484O15j6605k9905j1382N496l661M770Q873O676R95K292R830J3199
$$ y = [9430, 12253, 12399, -14747, -12134, 8526, 17451, -9208, -13723, -8957, 5662, 7204, -4527, -32927, -47673, -62957, -48144, -25394, -37360, -13416, -2349, -305, 21528, 18945, -6167, -26811, -6800, -37880, -54784, -76520, -76262, -10448, 23973, 31466, 11340, -28662, -45805, -60969, -44906, -1726, -10177, 719, 2480, -36185, -62465, -41458, -21631, -4381, -19384, -20389, -18773, -606, -1655, -10116, -15639, -6506, -6442, -16279, -37757, -20432, -15406, -10485, -29084, -17130, -16985, -36161, -20959, 3063, 6508, -3663, 1970, 27326, 38088, 43863, 54239, 59284, 39046, 18395, 29920, 29190, 17358, -24430, -35280, -15858, -6310, 10148, -7497, 4446, 1638, 5795, 7663, 18978, 7428, 30912, 31527, 14922, -14983, -26365, -20869, -24530, -19760, -10887, -4211, -3216, -924, 8906, 22105]
5848B2105k5079k7934J1028J7655j7484O914K897J4106O938j0402k112q765k5006
5835c5139k2541j1699K3701r866j633J2696J0825K9304J5108o315J532K0882p72
5822B6083k7838j692O708n099m8993j7659J4352O966j314K2444J2014k0925p678
5809d2631J5307M048n354J461j0015J6717J2136l442J1591P260M256J6243j0657
5796A6920n1803l1144K4468J8478L870j578J956j5993J4914J6738K5365K6312
5784D8503q643j8540r313J1419J894M160j9465K469j7810j4660R91m863q856n9447
5770i2161L169K6968M76K3795O749j1977j9851o7K1032N24k1362j6892K583j00
5756g7114K3465J3141J9279K5236m902k8544K3025J4607n586Q492L6573J0258
$$ y = [22105, -2974, -30908, -19880, -2225, -19709, -12795, -9898, 4208, 11146, 744, -1368, -10133, -35139, -57680, -69379, -45678, -55544, -57177, -44481, -33656, -4352, 10756, 4441, 5973, 26855, 26083, -1755, -3447, 3261, -1838, -50831, -68490, -54138, -47172, -48486, -26042, -14028, -34953, -42631, -27324, -23276, -28630, -27169, -37184, -20467, -8331, -11773, -182, 7078, 11334, 27577, 16920, -34883, -66027, -41559, -23081, -19211, -20789, -18833, -34826, -19912, -3174, 22191, 48503, 39860, 21320, 12007, 23426, 25320, 29480, 10015, 12484, -5326, -19986, -18995, -23858, -32714, -92161, -88992, -62024, -61548, -37753, -31004, -42981, -62832, -62899, -41867, -41343, -62705, -79597, -77014, -77114, -53649, -40508, -21229, 4007, -895, -29439, -6414, 8193, 2607, 11099, 47672, 57930]
5744E7930l5444j9548r916m416R692R039K4081Q019N258k2857q986k7520k3141
5731c7809K8898J368j5268l4409J3692L408J89k307J7685N403Q896L2106k514
5718A9338j6953q356K0156J8292j492j1190j6068P91J7986k0498p748j1031J0822
5705e951L029P772k465j2799q885P706k1923k327p479J6013R709J2853J0811o153
5691h9J406p986m372J8046M163Q329l6507m812J3123l0778o267J4208L2922n962
5677d576K810J8637K009n726p98j1251J1081p401k7908q672J8892j703J5534J2323
5663A3251K3124j9244m4860j2131N930M1892J7100j74R860Q988k1588K0707K843
5650D5698k6751j9685L382J3749O631P565j1218Q543K0554l1993l4874l2637J1386
$$ y = [57930, 22486, 2938, -6978, -11394, -1702, 7337, 31418, 39437, 44695, 21838, 12852, -14668, -37809, -8911, -7543, -22811, -57220, -43528, -40120, -39931, -42238, -24553, -19150, -10254, 21852, 19338, 2385, -5971, 14185, 32477, 30985, 19795, 3727, 4518, 22504, 2006, -5742, -16773, -5951, -2922, 4850, 2385, -10414, -19299, -11593, -33516, -35843, -43322, -27309, -17600, -4747, 6064, -89, 1317, -6669, -11041, 7005, 11168, 19497, -17010, -21822, -8699, -39477, -45744, -31536, 1386, -4576, -1766, 16871, 18880, 13154, 12356, 1105, 12186, 4785, -23123, -31795, -12903, -14606, 928, 13251, 36375, 17131, -27729, -39860, -33930, 7962, 25062, 24888, 34748, 43736, 22148, 42855, 45698, 18947, -738, 2644, 16393, 23024, 30589, 19371, 27914, 48468, 16475, -18399, -51036, -39650]
5637c9650J3285J8808j121k4453J0973m223J47j528n554J8053p767j6857j471
5624d1358L8413K0334n971p991j6002P144J6581K4217j668k4220k135j2086o583
5611a1325N118j9274k906K071n176K1170o194p673P39m232J1617P656M104m404
5597h709j9459k2556j6972L1952J8269J0509Q383q62n972j9559k7387L620j2833
5584f1576M0233J1880k0972J6056J3992p725K4114K886r610p697n870k892j3687
5571b0868j7231P177J8854O012j825j2594j1346q026J694N6586J9113l0825j7664
5558a0943L25k0151P920m475J0413O765l733k4179N561p941J1018L6875q907J2672
5544A1220l5764J233R933l6908j3920O700K0220P198L1667L4434k3608l4218j7012
$$ y = [-39650, -26365, -7557, -8678, -33131, -22158, -26381, -26234, -27762, -33316, -15263, -23030, -39887, -41358, -2945, 17389, 11418, 3427, -12575, -5431, 11150, 35367, 33699, 9479, 7344, -4742, -11325, -6207, -25481, -28387, -26316, -31492, -10322, -16516, -24189, -23450, -27682, -16065, -8409, -4305, -8709, -28168, -50724, -67696, -35744, -17475, -6966, 1417, 555, -5417, -24976, -52363, -48743, -61576, -21343, -9463, -30435, -14379, -387, -8112, 16002, 18888, 9278, 1581, -4289, -7181, -20868, -38099, -30922, -12068, -6056, -7881, -20475, -31821, -39847, -38153, 18433, 37546, 6721, -10943, -10618, -30769, -22849, -27324, -16911, -10146, -13879, -38058, -32497, -40438, -29420, 7455, -1452, 11220, -24544, -23311, -13378, -50286, -64206, -57506, -37286, -30088, 1579, 36013, 12405, -21813, -38825]
5531c8825K1742K459k6221J3584K4354J4846j3218M37m726j2496N088J5902o581
5518c655J971J9812j6723k4217K0199Q392M93J9207k6705j4711J739P560r449
5505a6087L5982J308J5738q131j9875m2535r392k533O421O675n170Q260o796j6204
5491e2339r037M55N426K0787R907P802M851l040J5701k691L449P64O038Q28J0703
5476A9604M475k893J0546j0714l5932n840j6599K1867L7844k1619j558J956n08
5463F29K702L560k67K0607r704Q393P175j0955q012m44p506J6496R746J1702k4330
5448A9792q986p541j7639k6910k6259J2625L119n60m311j2040J3452J2954j1504
5435e3808n477J7357L6427j9717k612L445o321j5114j6280L3251L5738l207l2223
$$ y = [-38825, -17083, -14624, -40845, -27261, -2907, 11939, -1279, -842, -5568, -18064, -12976, 2926, -3655, -1684, 18128, 1405, -22812, -2613, 5779, 6272, 25479, -1226, -15937, -14198, -6638, -16087, 19895, 21203, 36941, 28810, 8935, -33600, -42992, -45525, -39104, -32429, -37599, -29339, -36135, -52339, -61376, -60921, -55495, -34708, -24801, -16999, -12148, -15188, 513, -2178, 1271, 2035, 8073, 8901, 19604, 24079, 21186, 31732, 21018, -14914, -20754, -37353, -15486, 22358, 739, -819, 1137, 629, 3331, 6891, 6624, 27231, 17527, 25920, 33095, 22140, 14128, 13684, 6178, 22674, 32420, 44122, 19792, 10806, 3265, -14374, -41284, -67543, -54918, -51799, -52359, -56670, -68710, -55258, -42304, -53808, -59285, -41928, -5501, -25218, -27830, -24385, -30706, -45820, -62100, -28849, 6889, 3682, -28541]
5422b8541k1794Q817k556J8597R039j0447J3488q593p151K4410j0977k2106l9
5409c7853L7424J2775j9264J079j4237l4715J3927J4140K3799J6654j3879o950
5397g100Q577l3055k905R798o245N43J722J0424M303j7679J5117R169n277j1600
5383b4208k0377K6289M1324l246k7861k6791k0317K5087J1641l1454k7261j883
5371g9057m860L2610K6648K231l3274J8188L8690N205q683l483j1754Q338l03
5358i504R407P088q21q274j3874j433J2290K9220o776m3350Q645J9441K6298M181
5344C2538j6273J1308P207l4909J0231K9218k6575k1903n743J365q988j4483J2565
5331b4442J9436R633J1843m0903q01L1634l074L140J377q05l8943k8526L6936
$$ y = [-28541, -50335, -41518, -44074, -25477, -16438, -26885, -13397, -21990, -29141, -4731, -15708, -37814, -37853, -429, 12346, -6918, -5839, -20076, -54791, -40864, -26724, -2925, 13729, -150, -7100, 1477, -31578, -34483, -24685, -30930, -30387, -28665, -18241, -13938, -31617, -16500, -7331, -12608, -24208, -44585, -18296, 23028, 19782, -8079, -34870, -55187, -30100, -18459, -49913, -77174, -79057, -83917, -51307, -24659, -22428, -55702, -37514, 1176, 6381, -2302, -5785, -17539, -9201, -9504, -97, 6991, 6170, -2104, -15978, -17411, -5121, 24099, 17323, -26027, -17382, 2059, 28357, 32538, 16265, 27573, 34780, -129, 10102, 39320, 12745, -9158, -14901, -13536, -22524, -37007, -24442, -5006, 4627, 16470, -24433, -25234, 6400, 3326, 6466, 7843, 7038, -31905, -60431, -23495]
5318b3495M0640J4501j0218J8683p694l7702J0598n152k7861Q992m141o577r18
5305c0344j597l2472m144J0772j279J8532J4124L1824J2467q034j2083R677J2247
5292A9690K2679K766r00k9870K104Q190J3499j2575l1450M155p52N196n265r400
5278a1933M592j4471m941J1930J9661o319R31J2822j4057l636P573j0517k4355
5265c2720k1762r947J2474J7364K0380J2624j2948Q037j3088l1632J3843K4414
5253a2961j1291m402J9150j4845j617K2752q516j9551M7531k4512j4663K5233
5241B308k6631L252j4652J1129J344j2861J3333j2263J1484j2891R032N0183j4651
5228H116k9205j224o664K7672J1278j103k2631N415K1218o342j9189k3799j7411
$$ y = [-23495, 17145, 31646, 21428, 40111, 32417, -5285, 5313, 161, -27700, -18708, -22849, -29426, -30344, -31941, -64413, -68557, -57785, -59064, -40532, -26408, 5416, 17883, 9849, -2234, 7443, 19690, 42369, 45135, 44235, 14365, 16469, 24659, 38158, 25583, -5867, -1712, -2464, 2732, -2533, -11933, -7341, -21812, -26753, -14823, 4838, -1481, -550, 12272, -1785, -5421, 2152, -8365, -32720, -54482, -64429, -51955, -34591, -14211, -1587, -14535, -6498, -19586, -51218, -37375, -12961, -24252, -28654, -9504, -24349, -25966, -3214, -11730, -31281, 16250, -8262, -22925, 2308, -24323, -21071, -35723, -24594, -23250, -36111, -22778, -35041, -23557, -36448, -27416, 22767, 8116, -21089, -22313, -28977, -1305, 9973, 8870, -13761, -8346, 12872, 6530, -12659, -36458, -53869]
5215e3869j3821J0013L629P417J3895n907q848J3025n128J8285J1136J0667q713
5202h219j1013k540O899L312K4733j2762k4710O069L301P241K4805K2835q640
5189C1311o022J4127j5679m7938m9744K6099M4150J1893J1712J5l5765K3930K9748
5176C7837j8311m0801R803J1795j7319P124M226k641J1500K9289K318j3985k8912
5163h077r285L554L242K1663Q824j069j7583r992J0066P470r188J044j6952k4463
5149d0746K2948N5094K5011o460k3636o937j4325k560j6222Q991J7937J4662j5556
5136A8201j7989j5652k308J2551P922J1188K472q897O002R887j9794j5984J4844
5123B443J8699N30m942J693o500k9082q614k884j5824K3741J3463J8352L841l5384
$$ y = [-53869, -67690, -57677, -54048, -46631, -32736, -38643, -47491, -34466, -39594, -21309, -10173, 494, -8219, -19232, -21772, -14873, -11561, 13172, 410, -24300, -18231, -14930, -7689, 17116, 39951, 31311, 25289, 39416, 23737, -24201, -73945, -47846, -3696, 8197, 19909, 19924, -15841, 8089, 37837, 19526, -21275, -11472, 323, -16996, -9872, -5646, -8287, 3213, 32502, 34820, 20835, -8077, -17362, -13808, -10566, 11097, 19921, 18852, 1269, -8723, 1343, 8813, -375, 669, -16283, -40746, -17798, 37296, 62307, 55847, 32211, 25274, 10949, 8389, -7833, 1158, 19095, 33757, 18201, 212, -15440, -17748, -5197, 2725, 13913, 16385, 7488, 13490, 23377, 3583, -12401, 2443, 21142, 21672, 16730, 18423, 11923, -17159, -25773, -28657, -44481, -20740, -7277, 11075, 14916, -20468]
5109b0468j80K5115K2951K3295Q85m7383k4502K4790K6032m772j7229m3424j1198
5096d6088M8981L262o055N2727Q608k2700k8559l3735l1637R916J6750l857M358
5083b8029K2687K6516r937m516J461j8291j0574j7232N133k3766J5776L0865J1602
5070A695J4136J5835k1522n351l067N444k1811k1680j0818K5155L5359Q26Q389
5057B2590R345j177J6783m711l1740k6570J6142j3955j9785K143Q539j2400k6043
5044f0839K9786J3941l401J5716K6610J8699o653q169J8882j6884q820K914j7389
5031D393j3616N532O034P880j4566k5429n212J2842j171K6460J3183K5819J3550
5018E5699j0979l9794l2682O512K0346p438O629N582j2119k5792J0387L3128L1014
$$ y = [-20468, -20648, 4467, 27418, 50713, 51598, 4215, -20287, 4503, 30535, 25763, 8534, -34890, -46088, 2893, 6155, 100, 52827, 61435, 38735, 10176, -23559, -55196, -45280, -28530, -32387, -28029, -5342, 21174, 11237, 6721, 8182, -10109, -20683, -37915, -32782, -56548, -40772, -9907, 1695, 15831, 31666, 10144, 4793, 1726, 7170, -14641, -36321, -47139, -21984, 13375, 14201, 22590, 31935, 30758, 47541, 42830, 11090, -15480, 662, -13293, -33078, -30935, -22396, -34796, -60839, -31053, -17112, -20513, -4797, 21813, 40512, 33859, 25690, 44572, 27688, 18868, 21782, 4393, -9223, -3691, 2343, 10223, -4343, -29772, -34984, -22142, -23313, 3147, 16330, 42149, 55699, 44720, 4926, -27756, -21244, -898, -8336, -1707, 3875, -8244, -34036, -23649, 9479, 40493]
5005D0493k684k0623j4474j624L301L295q763j3088L8923L1401l0644k3195j2701
4992a0383R503J011p735P046O989J9639j330K346K5448P930o592j1305l801j126
4978C7640l16l3429j429Q879P843J832k2290L626K1516J3956j1727j8770j8949
4965a1618l0880J1918J5781n374J8351r008j3886k710J2694n48k1091l0734J1955
4952e5150K9075K4704j6047K6193K8081M454j6476k5616l5553k6057J2109K5879
4940b4404k8936l4556K2491J929J9084l418J5635J0007l593m898J3768j722N666
4927a2947R872M2201J0306j2116j1711L453q630K1916k3004J49J4501m579J0513
4914C9924j2055j5796j0139J1374j2658j6623M932R479j5350r410j549M2519L5021
$$ y = [40493, 37809, 17186, 2712, 1088, 4389, 7684, -1079, -14167, 24756, 56157, 25513, 2318, -10383, -880, 131, -7604, -558, 6431, 26070, 24740, 27086, 52534, 60464, 53872, 42567, 38766, 37640, 37324, 3895, 2466, 11345, 19188, 21020, -1270, 2356, 23872, 37828, 26101, 7331, -11618, -42498, -30580, -14799, -20173, -1822, -10830, -24716, -27426, -14732, -15280, -36371, -67105, -55150, -26075, -1371, -17418, 8775, 36856, 41310, 24834, -782, -36335, -62392, -50283, -24404, -53340, -87896, -65405, -63476, -44392, -47810, -32175, -22168, -25761, -30659, -16891, -18613, -12947, -3075, 39126, 49432, 37316, 25605, 29058, 20428, 42344, 19340, 19489, 33990, 29411, 39924, 27869, 12073, 1934, 13308, 650, -15973, -11041, -1562, -16912, -26322, -27871, 14648, 49669]
4901D9669K7596k9404k7128N401j955j6223r717N496j3557L520k4412l942J3640
4888b1016N896M947J4410K8079j3836J935o401k5304l3429k8451n029M1429q189
4875d4959j3611O664r905K0330K4809m73j3759Q265O207J9068j7665j950k554
4862a9533j7681j2499M7447K7071J7979m850j0080k2704l1914j5917j5652l767
4850f2100J1524q012J6578J7255K5374K3572j1726n570l9717O901L6161M126n905
4837H461O171k4972o504K0750k063j5324q416j2866k2483L161n29L3246J1353
4824a0015o972K3079p393J3441n190K6731Q478k4486m75J2105j514k1628j5299
4811i138K1490N0363j0979j9346m1911n771J1162n551J4909O339r422p456m37
$$ y = [49669, 77265, 47861, 20733, 26134, 24179, 7956, -1761, 3735, -9822, -6302, -30714, -34656, -21016, -15120, -10173, 4237, 32316, 18480, 20415, 14014, -11290, -44719, -73170, -78199, -36770, -44959, -58570, -51906, -61811, -41481, -16672, -17145, -30904, -22639, -16432, 2636, -15029, -16979, -19533, -37214, -49713, -2266, 24805, 42784, 37934, 27854, 5150, -26764, -42681, -58333, -62100, -50576, -58588, -42010, -24755, 619, 24191, 12465, 6895, -32822, -25921, 10240, 14366, 8461, 14632, -10340, -16844, 3906, 1843, -13481, -21897, -34763, -57246, -54085, -54614, -21368, -10015, -16987, 6092, -1301, 12140, 6950, 33681, 42159, 17673, 17198, 29303, 27789, 6161, -9138, 12352, 62715, 51736, 32390, -9521, -15292, -4130, -9681, 5228, 11567, 2145, -5311, -5748]
4798e748N237R518J4959k2695P916K79J2051j7266p051k2459K6466J5315K9569
4785D6091k5848m4047K5479R313j6429m157k8328j8125J6063J9219M2537J830
4773B3598k0237j3623j1876p10J0112J9693J260p968j5298J4574J0409K2737k251
4760C0420j2943k0301m3832q067N117N86p185M2121L0889L599K388J7858k6606
4747A4044j0256m199j3295q109K3433Q154k2181j083J9275M46O136p192j4758
4734i585J408j0044q948j8052p283Q928J6047L2736K945j9874K5765J8482j8954
4721A3571k1083j6810o351K4n660k8706k1081M6457L3193L20Q216j6373k9688
4708d3971K1092K3936j47K2644L0882k0167j2954K2489q305m7972k0068M313J6204
$$ y = [-5748, -511, 9007, 23966, 1271, 9187, 9466, 21517, 4251, -2800, -25259, 1207, 16522, 46091, 20243, -23804, 1675, 10988, -5441, -9598, -37926, -56051, -39988, -20769, 21768, 23598, 3361, -10262, -22138, -22848, -12736, 6957, 8217, 249, -15049, -475, 9934, 32671, 30420, 17477, -2824, -46656, -54723, -49606, -49020, -56205, -14084, 16805, 20404, 22792, 40650, 14044, 3788, -411, -13706, -21815, 1618, 9772, -12409, -13492, 5783, 6229, 12365, 5173, -9585, -8177, -18221, -27169, -45221, -52504, -43576, -27529, 5207, 8152, -11722, 14043, 32525, 13571, -7512, -24322, -30673, -30649, -36309, -65015, -86096, -39639, -6446, -6126, 2090, -14283, -43971, -22879, 1057, 910, 23554, 54436, 34269, 21315, 43804, 35499, -12473, -32541, -28228, -12024]
4695a2024L4613K1695j4727N738k5943j3030j8387m208M8680j774j0916R769k6169
4682f683j9284l324J2426k1837L1767L3309j054r380Q169L232L120l961k2260
4669D240m7268q82J8055L2388K1843m1305l2482J3705M1389J5005j3587j8657
4657g556M194r972k7374J1129L5181K469l0023J5362k0224j5516L4700J1396p121
4644c355K5030n169j0261j5391r652Q334J9894j1776k3008o190O58L479M004J3588
4630i815J5009l0051J7029j3194k983O895Q833k552j561K44J5047J0842j062j927
4616A0754j3480j9678l4624J828K1552K4851n537J6132k798J4181J440p418j0036
4603b833j224l697K1735M784L6308N692j8113l1282l1101l5024n761J0229k6389
$$ y = [-12024, 22589, 44284, 29557, 35295, 9352, -3678, -22065, -26273, 22407, 20633, 9717, 19486, -6683, -25967, -29291, -16865, -38702, -6935, 26374, 25320, 15940, 24109, 27341, 30461, 26500, 4240, -43028, -43910, -25855, 6533, 28376, -12929, -45411, -31706, 9683, 24688, 11101, -7556, -3362, -13334, -40708, -29579, 5602, 8071, -21952, -6590, -26814, -42330, -7630, 3766, -3355, 21675, 16506, 6245, -9146, -18798, -10464, 9430, -2346, -25354, -31544, -30886, -27407, -23403, -9815, 5194, -24857, -7828, -21022, -24005, -17110, -8277, -10829, -12390, -12146, 2901, 13743, 12681, 10754, -2726, -22404, -57028, -55200, -33648, -8797, -14334, 1798, -1000, 13181, 14621, 7203, -2833, -4057, -7754, 13981, 18765, 55073, 60765, 42652, 11370, -19731, -54755, -60516, -50287, -76676]
4590g6676j4196K6009J6119L2027L2879q86j8570j6353P097M964O382J7219K1240
4577C7255j2275j0673r989N853L018R93j299K0575j0090j0260J2222J6480J0490
4564E2300n995m1120j1772n245m029j0046J2284K4643L6279R561L829r363j338
4551D9988O617q976l4345m7791J634Q038l0170k626L5181K7690J791k0234j4553
4538b7756K279J4904L0326p73l3639j3434j946J0235J3437N053k4790k5199L989
4525d7314m792N494o093K3625J3256J6717L0393r388J911L002J4084j2648l2287
4512d040j0443J2672l4953k5390n222M4672J5707k5871j1012L8634O945N977M780
$$ y = [-76676, -90872, -64863, -48744, -16717, 16162, 15276, -3294, -19647, -12550, -7586, -1204, 16015, 37255, 24980, 14307, 4318, 10171, 13189, 14182, 12883, 33458, 23368, 13108, 25330, 41810, 52300, 46305, 5185, -6587, -11832, -15861, -25907, -13623, 11020, 47299, 56860, 60689, 51326, 49988, 56605, 47629, 13284, -34507, -32873, -24835, -55005, -57631, -22450, 5240, 7031, -13203, -27756, -25477, -10573, 19753, 18980, -14659, -28093, -30039, -19804, -6367, -1314, -26104, -51303, -47314, -52106, -46612, -52705, -29080, -15824, 893, 31286, 21898, 23809, 26811, 40895, 28247, -4040, -14483, -1811, -36764, -62154, -67376, -22704, -6997, -32868, -43880, -5246, 1699, 7676, 12456]
$$ [...]
##END NTUPLES=NMR SPECTRUM
##END=
