##TITLE=Analysis number 330469
Compound Code cc 66801
Book Reference 553/32
Project Code adrs
Chemist Name simons
##JCAMPDX= 6.0         $$ Bruker NMR JCAMP-DX V2.0
##DATA TYPE= NMR SPECTRUM
##DATA CLASS= NTUPLES
##ORIGIN= Bruker BioSpin GmbH
##OWNER= nmr
$$ XWIN-NMR		Version 3.5
$$ Wed Nov 28 10:24:04 2007 GMT Standard Time (UT+0h)  MAYBRIDGE\nmr@NMR_250MHZ
##.OBSERVE FREQUENCY= 250.131544655141
##.OBSERVE NUCLEUS= ^1H
##.ACQUISITION MODE= SIMULTANEOUS (DQD)
##.ACQUISITION SCHEME= undefined
##.AVERAGES= 16
##.DIGITISER RES= 18
##SPECTROMETER/DATA SYSTEM= dpx250
##.PULSE SEQUENCE= zg30
##.SOLVENT NAME= DMSO
##.SHIFT REFERENCE= (INTERNAL, DMSO, 0, 16.522)
##AUDIT TRAIL= $$ (NUMBER, WHEN, WHO, WHERE, WHAT)
$$ ##TITLE= Audit trail, XWIN-NMR		Version 3.5
$$ ##JCAMPDX= 5.01
$$ ##ORIGIN= Bruker BioSpin GmbH
$$ ##OWNER= nmr
$$ C:\u/data/dgb/nmr/ADRS/2380/pdata/1/auditp.txt
$$ ##AUDIT TRAIL=  $$ (NUMBER, WHEN, WHO, WHERE, WHAT)
(   1,<2007-11-28 10:23:46.71 +000>,<MAYBRIDGE\nmr>,<NMR_250MHZ>,
      <created by zg, POWCHK disabled, PULCHK disabled
       configuration hash MD5:
       76 6E 9A 78 1E 09 19 81 EC 84 63 8F B0 6A 59 2D
       data hash MD5: 64K
       D0 01 12 5A 69 A2 C1 B2 2B CB 5B AB 08 8A 92 50>)
(   2,<2007-11-28 10:23:57.49 +000>,<MAYBRIDGE\nmr>,<NMR_250MHZ>,
      <Start of raw data processing
       ef LB = 0.3 FT_mod = 6 PKNL = 1 SI = 32K 
       data hash MD5: 32K
       6D FB 74 83 1D 9E 05 0B B8 FF 7E BC 2C 67 17 5F>)
(   3,<2007-11-28 10:23:59.13 +000>,<MAYBRIDGE\nmr>,<NMR_250MHZ>,
      <apk 
       data hash MD5: 32K
       CA 4C 57 0B 2B 50 0C DE 79 49 D9 60 C6 33 54 0D>)
(   4,<2007-11-28 10:23:59.94 +000>,<MAYBRIDGE\nmr>,<NMR_250MHZ>,
      <abs ABSG = 5 
       data hash MD5: 32K
       0B 34 7F B2 2A D6 2B 17 54 86 32 19 E2 47 61 F8>)
$$ ##END=
$$ 
$$ hash MD5
$$ 5F 6C 33 23 7C 9E 26 A0 DF E4 08 29 AD EB 77 26
##$RELAX= 
##$RELAX= 
##$RELAX= 
##$RELAX= 
##$RELAX= 
##$RELAX= 
##$RELAX= 
$$ Bruker specific parameters
$$ --------------------------
##$DU= <C:\u>
##$EXPNO= 2380
##$NAME= <ADRS>
##$PROCNO= 1
##$TYPE= <nmr>
##$USER= <dgb>
##$AMP= (0..31)
100 100 100 100 100 100 100 100 100 100 100 100 100 100 100 100 100 100 
100 100 100 100 100 100 100 100 100 100 100 100 100 100 
##$AQSEQ= 0
##$AQ_mod= 3
##$AUNM= <au_zg>
##$AUTOPOS= <5 >
##$BF1= 250.13
##$BF2= 250.13
##$BF3= 250.13
##$BF4= 250.13
##$BF5= 500.13
##$BF6= 500.13
##$BF7= 500.13
##$BF8= 500.13
##$BYTORDA= 1
##$CFDGTYP= 0
##$CFRGTYP= 5
##$CHEMSTR= <none>
##$CNST= (0..31)
1 1 145 1 1 1 1 1 1 1 1 1 1 1 1 1 1 1 1 1 1 1 1 1 1 1 1 1 1 1 1 1 
##$CPDPRG= <>
##$CPDPRG1= <>
##$CPDPRG2= <>
##$CPDPRG3= <>
##$CPDPRG4= <mlev>
##$CPDPRG5= <mlev>
##$CPDPRG6= <mlev>
##$CPDPRG7= <mlev>
##$CPDPRG8= <mlev>
##$CPDPRGB= <>
##$CPDPRGT= <>
##$D= (0..31)
0 1 0 0 0 0 0 0 0 0.06 0 0 0 0 0 0 0.0002 0 0 0 0 0 0 0 0 0 0 0 0 0 0 
0 
##$DATE= 1196245425
##$DBL= (0..7)
120 120 120 120 120 120 120 120 
##$DBP= (0..7)
150 150 150 150 150 150 150 150 
##$DBP07= 0
##$DBPNAM0= <>
##$DBPNAM1= <>
$$ [...]
##$SUBNAM7= <"">
##$SUBNAM8= <"">
##$SUBNAM9= <"">
##$SW= 20.6930455092707
##$SWIBOX= (0..15)
0 0 3 0 0 0 0 0 0 0 0 0 0 0 0 0 
##$SW_h= 5175.983436853
##$TD= 65536
##$TD0= 1
##$TE= 295.16
##$TE2= 300
##$TE3= 300
##$TEG= 300
##$TL= (0..7)
0 120 120 120 120 120 120 120 
##$TP= (0..7)
150 150 150 150 150 150 150 150 
##$TP07= 0
##$TPNAME0= <>
##$TPNAME1= <>
##$TPNAME2= <>
##$TPNAME3= <>
##$TPNAME4= <>
##$TPNAME5= <>
##$TPNAME6= <>
##$TPNAME7= <>
##$TPOAL= (0..7)
0.5 0.5 0.5 0.5 0.5 0.5 0.5 0.5 
##$TPOFFS= (0..7)
0 0 0 0 0 0 0 0 
##$TUNHIN= 0
##$TUNHOUT= 0
##$TUNXOUT= 0
##$USERA1= <user>
##$USERA2= <user>
##$USERA3= <user>
##$USERA4= <user>
##$USERA5= <user>
##$V9= 5
##$VALIST= <valist>
##$VCLIST= <CCCCCCCCCCCCCCC>
##$VD= 0
##$VDLIST= <DDDDDDDDDDDDDDD>
##$VPLIST= <PPPPPPPPPPPPPPP>
##$VTLIST= <TTTTTTTTTTTTTTT>
##$WBST= 1024
##$WBSW= 4
##$XGAIN= (0..3)
0 0 0 0 
##$XL= 0
##$YL= 0
##$YMAX_a= 345126
##$YMIN_a= -371703
##$ZGOPTNS= <>
##$ZL1= 120
##$ZL2= 120
##$ZL3= 120
##$ZL4= 120
##$ABSF1= 16.522
##$ABSF2= -4.171173
##$ABSG= 5
##$ABSL= 3
##$ALPHA= 0
##$AQORDER= 0
##$ASSFAC= 0
##$ASSFACI= 0
##$ASSFACX= 0
##$ASSWID= 0
##$AUNMP= <proc_1d>
##$AZFE= 0.1
##$AZFW= 0.1
##$BCFW= 0
##$BC_mod= 0
##$BYTORDP= 0
##$COROFFS= 0
##$CY= 12.5
##$DATMOD= 1
##$DC= 0
##$DFILT= <>
##$DTYPP= 0
##$F1P= 14.0000005364418
##$F2P= -0.99999901652339
##$FCOR= 0.5
##$FTSIZE= 32768
##$FT_mod= 6
##$GAMMA= 0
##$GB= 0
##$INTBC= 1
##$INTSCL= 1
##$ISEN= 128
##$LB= 0.3
##$LEV0= 0
##$LPBIN= 0
##$MAXI= 10000
##$MC2= 0
##$MEAN= 0
##$ME_mod= 0
##$MI= 0
##$NCOEF= 0
##$NC_proc= -5
##$NLEV= 6
##$NOISF1= 0
##$NOISF2= 0
##$NSP= 0
##$NTH_PI= 0
##$NZP= 0
##$OFFSET= 16.522
##$PC= 1
##$PHC0= 162.6775
##$PHC1= 8.861614
##$PH_mod= 1
##$PKNL= yes
##$PPARMOD= 0
##$PSCAL= 4
##$PSIGN= 0
##$REVERSE= no
##$SF= 250.13
##$SI= 32768
##$SIGF1= 0
##$SIGF2= 0
##$SINO= 400
##$SIOLD= 32768
##$SREGLST= <1H.DMSO>
##$SSB= 0
##$STSI= 32768
##$STSR= 0
##$SW_p= 5175.98343685301
##$SYMM= 0
##$S_DEV= 0
##$TDeff= 65536
##$TDoff= 0
##$TI= <Analysis number 999999
Compound Code 99
Book Reference 9
Project Code 9>
##$TILT= no
##$TM1= 0
##$TM2= 0
##$TOPLEV= 0
##$USERP1= <user>
##$USERP2= <user>
##$USERP3= <user>
##$USERP4= <user>
##$USERP5= <user>
##$WDW= 1
##$XDIM= 32768
##$YMAX_p= 464677392
##$YMIN_p= -703816
$$ End of Bruker specific parameters
$$ ---------------------------------
##NTUPLES= NMR SPECTRUM
##VAR_NAME=  FREQUENCY,     SPECTRUM/REAL,   SPECTRUM/IMAG
##SYMBOL=    X,             R,               I
##VAR_TYPE=  INDEPENDENT,   DEPENDENT,       DEPENDENT
##VAR_FORM=  AFFN,          ASDF,            ASDF
##VAR_DIM=   32768,         32768,           32768
##UNITS=     HZ,            ARBITRARY UNITS, ARBITRARY UNITS
##FACTOR=    0.157963299565203, 1,           1
##FIRST=     4132.6476996994, 0,             0
##LAST=      -1043.33573715361, 0,           0
##MIN=       -1043.33573715361, -703816,     0
##MAX=       4132.6476996994, 464677392,     0
$$ Real data points
##PAGE= N=1
##DATA TABLE= (X++(R..R)), XYDATA
$$ [...]
23915C9197j15685K985K7170o1486l1749J22759j5082j08191m331J271J11659
$$ 39197 -76488 -73503 -46333 -107819 -139568 -16809 -31891 -140082 -144413 -143142 -31483
23904c1483J07113n1552j24620P5284Q5434m8430k0930O8767J94600j8543p9621
$$ -31483 75630 24078 -100542 -25258 60176 11746 -9184 59583 254183 235640 156019
23893A56019j24794j12876J48781K83780n7895k06614r7699j22844N1016J30463
$$ 156019 31225 -81651 67130 350910 293015 86401 -11298 -134142 -83126 47337
23883D7337J23664j31218O6432l782L0867o96o86M7643L9087M1849J35382j80049
$$ 47337 171001 39783 106215 102433 133300 132604 131918 179561 218648 260497 395879 215830
23871B15830m31555k9950J1906J54793j14130j78998O6596Q7074j6791J89634
$$ 215830 -215725 -245675 -233769 -78976 -193106 -372104 -305508 -218434 -235225 -45591
23861d5591J78935J8989j82581j32331j4120O1989J25434k2051j440P9116l5909
$$ -45591 133344 152333 -30248 -162579 -176699 -114710 10724 -11327 -12767 66349 30440
23850C0440r7908J17789q3390q734Q4779p2279k35332l527J13119N7240p1680
$$ 30440 -67468 50321 -33069 -41803 42976 -29303 -264635 -268162 -155043 -97803 -169483
23839a69483j31049J34269M7108Q2675J21438o7227O2690J59805q9000k54310
$$ -169483 -300532 -166263 -119155 -36480 84958 17731 80421 240226 151226 -103084
23829a03084k0990J809k515p7080k76718J9213R1992j0204N3113K12565j28384
$$ -103084 -124074 -122265 -124780 -201860 -478578 -459365 -367373 -377577 -324464 -111899 -240283
23818b40283L967J17035J47658R9718J23285j67085j22387R2814j06992o9232
$$ -240283 -236316 -119281 28377 128095 251380 84295 -38092 54722 -52270 -121502
23808a21502j2936o670M7129n314K2142K37740J52911k34908o267R2376n3068
$$ -121502 -134438 -141108 -93979 -99293 -77151 160589 313500 78592 72325 164701 111633
23797A11633j72513P6523N4704L647q2312P6431j70923j62616P575N3365j02928
$$ 111633 -60880 15643 70347 73994 -8318 68113 -102810 -265426 -257851 -204486 -307414
23786c07414p3181J69508R3632N8095M2193J07874J09906p7866j20921k19428
$$ -307414 -380595 -211087 -117455 -59360 -17167 90707 200613 122747 1826 -217602
23776b17602p4921L3249J13680P1632J51655J7489r8843j17046j3361K23034J45072
$$ -217602 -292523 -259274 -145594 -73962 77693 95182 -3661 -120707 -134068 88966 234038
23765B34038r8034j85734n5276n2034o6997R1723O3634K5453j13922j4681J95047
$$ 234038 136004 -49730 -105006 -157040 -224037 -132314 -68680 -43227 -157149 -171830 23217
23754B3217J07935j87049k5181m173j62884N9175J81579n8798j77691r3030J7394
$$ 23217 131152 -55897 -81078 -85251 -248135 -188960 -7381 -66179 -243870 -336900 -319506
23743c19506J77483Q9400L0266j00600r513j57130m0963J06507J67836l123O6324
$$ -319506 -142023 -52623 -22357 -122957 -132470 -289600 -330563 -224056 -56220 -59343 6981
23732F981o9989k42633l5553J96523J55268J15228l9604q358p6345m8504j96754
$$ 6981 -63008 -305641 -341194 -144671 10597 125825 86221 77863 1518 -46986 -243740
23721b43740m0735N5880n3213l1927J5190j002R8329N1975J40419R889k05945
$$ -243740 -284475 -228595 -281808 -313735 -298545 -299547 -201218 -149243 -8824 1065 -204880
23710b04880O8051J60993K08465j17145k40151r9618J92767j8659j39352m9190
$$ -204880 -136829 24164 232629 115484 -124667 -224285 -31518 -50177 -189529 -238719
23700b38719j23252j39023J85775J12624n1455J1949P225k1980K15842J35716
$$ -238719 -361971 -500994 -315219 -202595 -254050 -242101 -234876 -256856 -41014 94702
23690I4702j10771p3424r1540N4333J43298J15712r9140o6075j48737j01532m0115
$$ 94702 -16069 -89493 -181033 -126700 16598 132310 33170 -32905 -181642 -283174 -323289
23679c23289K18584P7926m8542k3952M3535J87890L4628p092O9792l0502l2658
$$ -323289 -104705 -26779 -75321 -99273 -55738 132152 166780 159688 229480 198978 166320
23668A66320j89557j32789k3258p8864j17847m0371J21810J97363R4944N9410
$$ 166320 -23237 -156026 -179284 -258148 -375995 -416366 -294556 -97193 -2249 57161
23658E7161p7913n7182J24905l7247m8919L1092j3422j29874O9868j8314m2735
$$ 57161 -20752 -77934 46971 9724 -39195 -8103 -21525 -151399 -81531 -99845 -142580
23647a42580K17343l0636j547m9885J32921J3576m6468o8059l4595n7564K113
$$ -142580 74763 44127 42580 -7305 125616 139192 92724 24665 -9930 -67494 -65381
23636f5381R6885P919l4154m7398j42112j58049o593J05244J19158Q3448R151
$$ -65381 31504 39423 5269 -42129 -184241 -342290 -348883 -243639 -124481 -41033 -31882
23625c1882K9348O2353J768q9060L0087K8806J89436K7051j08553j34311n5485
$$ -31882 -2534 59819 61587 -27473 2614 31420 220856 247907 139354 5043 -50442
23614e0442j94360J8365J15532j9790j7280J14026J32215p0936l1438p3538K0258
$$ -50442 -244802 -226437 -110905 -130695 -147975 -33949 98266 27330 -4108 -77646 -57388
23603e7388r3018j401Q448N0697J22920r8121J30117m5449j55515K926l9988J62815
$$ -57388 -150406 -151807 -143359 -92662 30258 -67863 62254 16805 -138710 -135784 -175772 -12957
23591a2957J44626j5022m4999j59977j2585L3096Q237j45967N980J13945J24378
$$ -12957 131669 116647 71648 -88329 -100914 -67818 -59581 -205548 -199568 -85623 38755
23580C8755O596j62180j44631j9229J17352K72073J13464j62256P6816j01039
$$ 38755 45351 -116829 -261460 -280689 -163337 108736 222200 59944 136760 35721
23570C5721r7360q8756o2575j42167j18745J29545Q9768J4744p7760q192L8483
$$ 35721 -61639 -150395 -212970 -355137 -473882 -344337 -254569 -239825 -317585 -325777 -287294
23559b87294K3546J22755Q9693m2906O823J4657O4891M6310P816r4195k5571O2954
$$ -287294 -263748 -140993 -51300 -94206 -87383 -72726 -7835 38475 46291 -47904 -73475 -10521
23547a0521Q9628j50352l9056j38801k8058P8563L3870j38436n2749J63700N8968
$$ -10521 79107 -71245 -110301 -249102 -277160 -198597 -164727 -303163 -355912 -192212 -133244
23536a33244K9715R8437m642K1068R7829p8949J8097J19861j82189o6415p0384
$$ -133244 -103529 -5092 -9734 11334 109163 30214 48311 168172 -14017 -80432 -150816
23525a50816n1703l3192K8044J11166J5017j0197J55258j7485L8675L6414j8348
$$ -150816 -202519 -235711 -207667 -96501 -81484 -91681 63577 46092 84767 121181 102833
23514A02833K04913j34375o2614J01722M7073L4925l6553p040R8974K3471k11467
$$ 102833 307746 173371 110757 212479 259552 294477 257924 250884 349858 373329 161862
23503A61862j81978K532j60443n9985O1547N4503j8145o0327J27001Q6486P198
$$ 161862 -20116 -17584 -178027 -238012 -176465 -121962 -140107 -200434 -73433 13053 20251
23492B0251m1042P1195p8420j19643L293M3976q709o2841q3495J13103J12469
$$ 20251 -20791 50404 -28016 -147659 -144366 -100390 -109099 -171940 -255435 -142332 -29863
23481b9863m5601q7990q798J77556Q3279k19295k69633p9062J50778J29939J49535
$$ -29863 -75464 -163454 -172252 5304 88583 -130712 -400345 -479407 -328629 -198690 -49155
23470d9155M4756m2677j2985o3261j00919j15957J66035J50734N5504j41595k21796
$$ -49155 -4399 -47076 -60061 -123322 -224241 -340198 -174163 -23429 32075 -109520 -331316
23459c31316m4106r7467k9505J63394J41077O4794R2041k3472j70610j2618J28692
$$ -331316 -375422 -472889 -502394 -339000 -197923 -133129 -41088 -64560 -235170 -247788 -119096
23448a19096J24285J16740k8987j74994j18742n8025q489J29047J35747J22784
$$ -119096 5189 121929 92942 -82052 -200794 -258819 -267308 -138261 -2514 120270
23438A20270j01244j02898k6423P1047J39316q8178q6418J623q7249K7370J84803
$$ 120270 19026 -83872 -110295 -39248 100068 11890 -74528 -72905 -160154 -132784 52019
23427E2019j39880p6538J13872J1513j59050Q4368K03K9795J9533m1886j13618
$$ 52019 -87861 -164399 -50527 -39014 -198064 -113696 -113493 -83698 -64165 -106051 -219669
23416b19669k0844j7094J29410K16237J4617j90072p127k79j2340K03399q1125
$$ -219669 -240513 -257607 -128197 88040 102657 -87415 -94542 -94821 -107161 96238 15113
23405A5113q1755J4895k2678m1481k3136J3216O5542J9162p5468l2690j00297
$$ 15113 -66642 -51747 -74425 -115906 -139042 -125826 -60284 -41122 -116590 -149280 -249577
23394b49577m2864J59568J36938J8951l1485j43446J66708J3734j02911q0447
$$ -249577 -292441 -132873 4065 23016 -8469 -151915 14793 28527 -74384 -154831
23384a54831O3553J9622j5638J58768J20166l3651M7961l7604j75285j86811k4396
$$ -154831 -91278 -71656 -87294 71474 191640 157989 205950 168346 -6939 -193750 -218146
23373b18146J05628P3530j71690l618J40929P7386k9960p4601q3493J42397J17022
$$ -218146 -112518 -38988 -210678 -214296 -73367 4019 -25941 -100542 -184035 -41638 75384
23362G5384j36884k50132p495M3056m0425k8551J23147j938q9385p5577k7319
$$ 75384 -61500 -311632 -319127 -276071 -316496 -345047 -221900 -223838 -313223 -388800 -416119
23351d16119j86322J41839K12337J00641N9144J86304q2705m7512M5666J7840
$$ -416119 -602441 -460602 -248265 -147624 -88480 97824 15119 -32393 13273 31113
23341C1113k3276J44241j83084j52165J19677J01541j24816J03774O322p0024
$$ 31113 7837 152078 -31006 -183171 -63494 38047 -86769 17005 23327 -46697
23331d6697r8971j07518n6592N0671J15547o5316J73918P6496j04788L6724r7068
$$ -46697 -145668 -253186 -309778 -259107 -143560 -208876 -34958 41538 -63250 -26526 -123594
23320a23594Q4318J6927J22740m884j02009j50816k5936j2648P2826R0946J24193
$$ -123594 -39276 -22349 100391 95507 -6502 -157318 -183254 -195902 -123076 -32130 92063
23309I2063j12087j52523q9492J38298j251q7366P5373J07978q2091j00148r0857
$$ 92063 -20024 -172547 -262039 -123741 -124992 -212358 -136985 -29007 -111098 -211246 -302103
23298c02103k2500J00654N4472L1528P2345R8517k9715p0127l3126k4769K67083
$$ -302103 -324603 -223949 -169477 -137949 -65604 32913 3198 -66929 -100055 -124824 142259
23287A42259L4550j53579j61236j33150p1958J68623J84273q3645J59691J36552
$$ 142259 176809 23230 -138006 -271156 -343114 -174491 9782 -73863 85828 222380
23277B22380O516J8852r9390M3228o5337p3900m0139o6985j5991m8610K01600
$$ 222380 228896 247748 148358 191586 126249 52349 12210 -54775 -70766 -119376 82224
23266H2224J9208n176q1022j47039J791K20025J73935j22246k61199M1248K26087
$$ 82224 101432 96256 15234 -131805 -130014 90011 263946 141700 -119499 -78251 147836
23255A47836J01107j21156j20941j64069J40604M8692j03908j6548K5413M1711
$$ 147836 248943 127787 6846 -157223 -16619 32073 -71835 -88383 -62970 -21259
23245b1259j07L4747P5641N6631k7408j68254O3051L8626j32452K5146J42830
$$ -21259 -21366 13381 89022 145653 118245 -50009 13042 51668 -80784 -55638 87192
23234H7192j60169j4575l001J38653K2308k45802n4420j10185J07311J01579k7482
$$ 87192 -72977 -87552 -90553 48100 70408 -175394 -229814 -339999 -232688 -131109 -158591
23223a58591j5172j49259L6013J11794J07313J41920o9221j04180q4547J1773
$$ -158591 -173763 -323022 -287009 -175215 -67902 74018 4797 -99383 -183930 -172157
23213a72157O6440L0297J2643o2742N2960M9343O9244n6555R0522J07757K7701
$$ -172157 -105717 -75420 -62777 -125519 -72559 -23216 46028 -10527 79995 187752 215453
23202B15453K5962k10704k0982J81248l6228k33970p9057M2247K8822K06187r1693
$$ 215453 241415 30711 9729 190977 154749 -79221 -158278 -116031 -87209 118978 27285
23191B7285J698J39056k9453L6308K0990j6635j43432l0302r5796p92j68421j51995
$$ 27285 28983 168039 138586 174894 195884 179249 35817 5515 -90281 -91073 -259494 -411489
23179d11489Q6015N414J9275Q1578M2971j28474K1665J36678L7373l7157K0495
$$ -411489 -325474 -320060 -300785 -219207 -176236 -304710 -283045 -146367 -108994 -146151 -125656
23168a25656L5916k2843m1810l2361q702M6568J28611q8435K0607R4572J68250
$$ -125656 -89740 -112583 -154393 -186754 -195456 -148888 -20277 -108712 -88105 6467 174717
23157A74717o399N9694N8319P5394l47424n827J98581J04792j24962j27224j41412
$$ 174717 168318 228012 286331 361725 14301 8474 207055 311847 186885 59661 -81751
23146h1751n4117j90682J3988Q6929J17721J2305N5605j50505K8938K45341O1703
$$ -81751 -135868 -326550 -312562 -225633 -107912 -95607 -40002 -190507 -161569 83772 145475
23135A45475j14165p5493m1467J11906L5909R0572r4623j20216M4244J8086J12431
$$ 145475 31310 -44183 -85650 26256 62165 152737 58114 -62102 -17858 228 112659
23124A12659L9889n454j04026K4420J58169J7048j62619j46172q2830J73740N3023
$$ 112659 152548 147094 43068 67488 225657 242705 80086 -66086 -148916 24824 77847
23113G7847j04298j22700M2300J64677m7478m3198J95425M0686j43661j18104
$$ 77847 -26451 -149151 -106851 57826 10348 -32850 162575 203261 59600 -58504
23103e8504l4190J7678J97167m1922l5181j18645l7842q815N852m123j54319J17519
$$ -58504 -92694 -75016 122151 80229 45048 -73597 -111439 -120254 -114402 -118525 -272844 -155325
23091a55325P7438J2330Q7035R4220q9816j6713J71450k5308p0405r9508n0937
$$ -155325 -77887 -65557 21478 115698 25882 9169 180619 155311 84906 -14602 -65539
23080f5539l8999j16348J6574K2909k9916j94462K2975J43009o0187Q782J10968
$$ -65539 -104538 -220886 -204312 -181403 -211319 -405781 -382806 -239797 -299984 -291202 -180234
23069a80234L9337R185k6525j52558j68440K0251J17394J98251P4505k5156k4816
$$ -180234 -140897 -131712 -158237 -310795 -479235 -458984 -341590 -143339 -68834 -93990 -118806
23058a18806J69868N0123k14094j12304k5227j8834Q3126J54516J51246K80056
$$ -118806 51062 101185 -112909 -225213 -250440 -269274 -186148 -31632 119614 399670
23048C99670o3745j45464j68023j15949J5289L4770K8207R4378J05220K370j41868
$$ 399670 335925 190461 22438 -93511 -78222 -43452 -15245 79133 184353 186723 44855
23037D4855j75930k3735L00342Q6613j87079k51999q6062m6815m8225J14965R0384
$$ 44855 -131075 -154810 145532 232145 45066 -206933 -292995 -339810 -388035 -273070 -182686
23026a82686j18347J43220J83867m0463p232M6816o5925M5030K0240o9109k723
$$ -182686 -301033 -157813 26054 -14409 -21641 25175 -40750 4280 24520 -44589 -47312
23015d7312J48817J41510l0616k25716j19156j8977J91905Q7546m4192k1178J857
$$ -47312 101505 243015 212399 -13317 -132473 -151450 40455 128001 83809 62631 64488
23004F4488j14671O0770K56389k167j20764k18265K2829L8784K47481j04443j71159
$$ 64488 -50183 10587 266976 264809 144045 -74220 -51391 -12607 234874 130431 -40728
22993d0728o497P3322n2583L2343j4750j13495k89828j31354J33625K59623J64871
$$ -40728 -47225 26097 -26486 5857 -8893 -122388 -412216 -543570 -409945 -150322 14549
22982A4549p2089j09833J23444K6404l1519L8568R3145J7456p1857j99438j65468
$$ 14549 -57540 -167373 -43929 -17525 -49044 -10476 82669 100125 28268 -171170 -336638
22971c36638J80919O6837O5305K9428J88090N6209j39597j3954Q60L2171m0681
$$ -336638 -155719 -88882 -23577 5851 193941 250150 110553 96599 97459 129630 88949
22960H8949k3448p9980M816j03729O8615L7037P432k41151j7365j15712Q113m1180
$$ 88949 65501 -14479 -9663 -113392 -44777 -7740 -308 -241459 -258824 -374536 -366423 -407603
22948d07603J83406Q4610p8171J584o1270j23641M3227R2376j7059K3059R589
$$ -407603 -224197 -139587 -217758 -216174 -277444 -401085 -357858 -265482 -282541 -259482 -249893
22937b49893o7816L8736L1046K27076K5623O4181J56478q695R3171j5727m4073
$$ -249893 -317709 -278973 -247927 -20851 4772 68953 225431 216736 309907 294180 250107
22926B50107q0037j00605k1734r1163m5572N7501J24086q3138j15725O1775J14273
$$ 250107 170070 69465 47731 -43432 -89004 -31503 92583 9445 -106280 -44505 69768
22915F9768j32687j24608n2752N0215J38705K9317k4377l3307P0771K13146M0147
$$ 69768 -62919 -187527 -240279 -190064 -51359 -22042 -46419 -79726 -8955 204191 244338
22904B44338j58130k752J00348P3696n8611n032j31149j03141j05540j69549l0534
$$ 244338 86208 83456 183804 257500 198889 193857 62708 -40433 -145973 -315522 -346056
22893c46056R2302k0028J26863J89078L2293Q0423k715r5943j27037P641P9N9307
$$ -346056 -253754 -273782 -146919 42159 74452 154875 152160 56217 -70820 -63179 -63100 -3793
22881c793N6848m2417N941q4379j91068k42969j08401L31946K12615j5346k08880
$$ -3793 53055 10638 16579 -67800 -258868 -501837 -610238 -278292 -65677 -81023 -289903
22870b89903J00730P2793Q1023N4705o3489j41408m2931J56594N6259p7608J1302
$$ -289903 -189173 -116380 -35357 19348 -44141 -185549 -228480 -71886 -15627 -93235 -81933
22859h1933k1364j67688j57242o1075J19347K95074J63968J43527M5641j39865
$$ -81933 -103297 -270985 -428227 -489302 -369955 -74881 89087 232614 278255 138390
22849A38390j3341N07j30451L7373o0708J46590r8759o1451R2011j53665l46066
$$ 138390 125049 125556 -4895 32478 -28230 118360 19601 -41850 50161 -103504 -449570
22838d49570k53900J74231J60634J01003k5219J39802l307K8722j56063j52077
$$ -449570 -703470 -529239 -368605 -267602 -292821 -153019 -156326 -127604 -283667 -435744
22828d35744O2107J15163O0364j19811q943J85961J4427r5506r8795m7685k1389
$$ -435744 -373637 -258474 -198110 -317921 -326864 -140903 -126476 -221982 -320777 -368462 -389851
22817c89851o656M4022J13041J33852J16953m1852j14028j32758k9377J32561
$$ -389851 -396507 -352485 -239444 -105592 11361 -30491 -144519 -277277 -306654 -174093
22807a74093k7895j4753q83J71824j01903j28068J15377J60045J17880J11402
$$ -174093 -201988 -216741 -217624 -45800 -147703 -275771 -160394 -349 117531 228933
22797B28933L0695j07803j65750k12671j08417l382j0219P0732j05058n2221R6037
$$ 228933 259628 151825 -13925 -226596 -335013 -338395 -348614 -277882 -382940 -435161 -339124
22786c39124L62008J39268M286j32865j00J06759p8460J07378r236P8318j46559
$$ -339124 22884 162152 166438 33573 33473 140232 61772 169150 159914 238232 91673
22775I1673k77233L707J77635q4732J6324l1508K7767O0685m7238N041q3887m6085
$$ 91673 -185560 -181853 -4218 -88950 -72626 -104134 -76367 -15682 -62920 -57879 -141766 -187851
22763a87851j09843J74778O6626K6260P9282M3697p0167j13797k34234j59383
$$ -187851 -297694 -122916 -56290 -30030 49252 92949 22782 -91015 -325249 -484632
22753d84632J38774J38008M9468k3059L2278N7217j74018K640J82095R4780j8941
$$ -484632 -345858 -207850 -158382 -181441 -149163 -91946 -265964 -263324 -81229 13551 -5390
22742e390j38298j7576j70674j9672j6370J118J52808J00238P3376p5275R833
$$ -5390 -143688 -161264 -331938 -351610 -367980 -366862 -214054 -113816 -40440 -115715 -105882
22731a05882j6302j44719n6905N2423J05917l0936J04902J78450k27184j32787
$$ -105882 -122184 -266903 -323808 -271385 -165468 -196404 -91502 86948 -140236 -273023
22721b73023k3084Q5081k2250q9142J48044R3689N5780J72744j73529r6065j5419
$$ -273023 -296107 -211026 -233276 -322418 -174374 -80685 -24905 147839 -25690 -121755 -137174
22710a37174j25473M6519J91585L9272N9458P243k10058M5785Q5095P5360N4333
$$ -137174 -262647 -216128 -24543 14729 74187 81430 -128628 -82843 2252 77612 131945
22699A31945n9418N3367q3296j67311k26685j26506j55818J53722K23018K99976
$$ 131945 72527 125894 42598 -124713 -351398 -477904 -633722 -480000 -256982 42994
22689D2994n5534j20376O0938J22024P5868j40194j47761j6952J16210p870j90224
$$ 42994 -12540 -132916 -71978 50046 125914 -14280 -162041 -178993 -62783 -70653 -260877
22678b60877M3161K55236O4639O8966P0151q2975j6703j88263P8510k24678n4356
$$ -260877 -217716 37520 102159 171125 241276 158301 141598 -46665 31845 -192833 -247189
22667b47189j1125K44425Q6311j44501k35341M2516r9260L2748J28130P5214o6525
$$ -247189 -258314 -13889 72422 -72079 -307420 -264904 -364164 -331416 -203286 -128072 -194597
22656a94597p1677J22572M6922O7887j14331o4831R2497J00120J04437L6353N8843
$$ -194597 -266274 -143702 -96780 -28893 -143224 -208055 -115558 -15438 88999 125352 184195
22645A84195K1335K2149k5074j67370l51458j76227J94915P7829J29648k0388
$$ 184195 205530 227679 202605 35235 -316223 -492450 -297535 -219706 -90058 -110446
22635a10446j37261l9696K24874P9418j04699L9683Q0558r1925k62127j11198
$$ -110446 -247707 -287403 -62529 16889 -87810 -48127 32431 -59494 -321621 -432819
22625d32819R7093R8190l0087J82752J55172J08840N634m5318j60026k37412k05068
$$ -432819 -335726 -237536 -267623 -84871 70301 179141 184775 139457 -20569 -257981 -463049
22614d63049J31358J00137m7975q1163k838j679k48288J3196K06610J1093J56874
$$ -463049 -331691 -231554 -279529 -360692 -363530 -365209 -613497 -600301 -393691 -382598 -225724
22603b25724K19207r1712o6770p8357j06601J09028J30053Q3123O9556p5947j4923
$$ -225724 -6517 -98229 -164999 -243356 -349957 -240929 -110876 -27753 41803 -34144 -49067
22592d9067J18914J91137L8632j07024k67359j65844J50954J82915L0259O3214
$$ -49067 69847 260984 299616 192592 -74767 -240611 -89657 93258 123517 186731
22582A86731q9718j8881k5196J07977O6557l7587J00524j50076j13098q0710j41991
$$ 186731 97013 78132 52936 160913 227470 189883 290407 140331 27233 -53477 -195468
22571a95468K2863j11578j75220m0202K08011K36010J6566j455N1152k0550J3515
$$ -195468 -172605 -284183 -459403 -499605 -291594 -55584 -39018 -40473 10679 -9871 3644
22560C644L4335R1274J12837l79p9555k18105j97805o0956P541O8806N9265O7050
$$ 3644 37979 129253 242090 241711 162156 -55949 -253754 -314710 -307169 -238363 -179098 -112048
22548a12048j00377j88279J34124J25841R9328K02667n5911j11723J283K4370
$$ -112048 -212425 -400704 -266580 -140739 -41411 161256 105345 -6378 -5095 19275
22538A9275O207P9955q3575r2399n507O0290j12018P8046j03228j95032R4579
$$ 19275 25482 105437 21862 -70537 -76044 -15754 -127772 -49726 -152954 -347986 -253407
22527b53407J70340q8350j57019J51910J45827P4724O738P3570m9453J11135k36340
$$ -253407 -83067 -171417 -328436 -176526 -30699 44025 50763 124333 74880 186015 -50325
22516e0325n6942J07206j06235j20573p5015j08358j52359L4193J79556J09050
$$ -50325 -107267 -61 -106296 -226869 -301884 -410242 -562601 -528408 -348852 -239802
22506b39802M7055R1485J23001J4261O0024j26276O0060J32138J7554j08760r6662
$$ -239802 -192747 -101262 21739 36000 96024 -30252 29808 161946 179500 70740 -25922
22495b5922j74206o9331R9293L1615p3446J39966O9810K7434j32275L8413J79174
$$ -25922 -200128 -269459 -170166 -138551 -211997 -72031 -2221 25213 -107062 -68649 110525
22484A10525l6854j08708j24j8997j2100j33716l554J34085o834o6628n5358k8057
$$ 110525 73671 -35037 -35161 -54158 -66258 -199974 -203528 -69443 -76277 -142905 -198263 -226320
22472b26320j15941M7495K45164L17966m5170j78619q5310l0586o1363q5150m602
$$ -226320 -342261 -294766 -49602 268364 223194 44575 -40735 -71321 -132684 -217834 -222436
22461b22436J43298J50983q672n9185o342j5718L185k7873N4059q3011Q0269K8683
$$ -222436 -79138 71845 63173 3988 -2354 -18072 -14887 -42760 11299 -71712 8557 37240
22449C7240M2695o8233O8932K04292N6801l08928l79599p4174K57791P5590P0730
$$ 37240 79935 11702 80634 284926 341727 32799 -346800 -420974 -163183 -87593 -16863
22438a6863J18165J06696M3727q137n7836j11811M6512p3455l2568Q2885K18246
$$ -16863 101302 207998 251725 243588 185752 73941 120453 46998 14430 97315 315561
22427C15561o4309k34292M0243J24641K4920R9226j24179j05972j50809l7894
$$ 315561 251252 16960 57203 181844 206764 305990 181811 75839 -74970 -112864
22417a12864J39029J56484j71361p3133j78496L725P4138Q7823O0405O4623J93942
$$ -112864 26165 182649 11288 -61845 -240341 -236616 -162478 -74655 -14250 50373 244315
22406B44315P7991k8809j44740o1303q4660j25054j25707Q3769J38303J7455m0696
$$ 244315 322306 293497 148757 87454 2794 -122260 -247967 -164198 -25895 -8440 -49136
22395d9136r0916j03876j522Q9712J23681N4939j0588K3309k7358K0019n706k4810
$$ -49136 -140052 -243928 -245450 -155738 -32057 22882 12294 35603 8245 28264 22558 -2252
22383b252J7922R8129j00703q9700J27542J5436j64550j48519J98732L2793j16773
$$ -2252 15670 113799 13096 -76604 50938 66374 -98176 -246695 -47963 -15170 -131943
22372a31943q1248N6424m2739J9305k2439O1044J33061N8208p1371o2182M1894
$$ -131943 -213191 -156767 -199506 -180201 -202640 -141596 -8535 49673 -21698 -83880 -41986
22361d1986P03R4715J45510q4470J02823R5298j16013j26082o4790q4629L7387
$$ -41986 -41283 53432 198942 114472 217295 312593 196580 70498 5708 -78921 -41534
22350d1534j05356k01525J2888J45543J24351J54427l5433Q5398K8357k3479j50861
$$ -41534 -146890 -348415 -335527 -189984 -65633 88794 53361 138759 167116 143637 -7224
22339g224l4363J3603L1512j05755j06111k5911O3468l052K0980K6486L8663q3886
$$ -7224 -41587 -27984 3528 -102227 -208338 -234249 -170781 -173833 -152853 -126367 -87704 -171590
22327a71590n6886K9078J52633k275n9382K9764J80191P4795l0125n5718j1759
$$ -171590 -228476 -199398 -46765 -49040 -108422 -78658 101533 176328 146203 90485 78726
22316G8726j79836j28614L6382J78877J7430q9795j3455K2593m0768j49012L6980
$$ 78726 -101110 -229724 -193342 -14465 2965 -86830 -100285 -77692 -118460 -267472 -230492
22305b30492K33561J07654j10311l9858j03939k64632P193K83682j963p0927m8479
$$ -230492 3069 110723 412 -39446 -143385 -408017 -400824 -117142 -119105 -190032 -238511
22294b38511P3024O1178j4401l5629K5541o2763J8124M110L5303R286P7258m4409
$$ -238511 -165487 -104309 -118710 -154339 -128798 -191561 -173437 -169327 -134024 -124738 -47480 -91889
22282i1889J0730O3660L0642j106R7j94342j3527K439P2588L1147J0889p0566
$$ -91889 -81159 -17499 13143 12037 12134 -182208 -195735 -193296 -120708 -89561 -78672 -149238
22270a49238N210M2956J51286J53529M2361M9405j20263l9442j7418J12991o1861
$$ -149238 -144028 -101072 50214 203743 246104 295509 175246 135804 118386 231377 169516
22259A69516j63569k31696j80314J25861K07809P1460o9931k19512K7J43289J12831
$$ 169516 5947 -225749 -406063 -280202 -72393 -933 -70864 -290376 -290349 -147060 -34229
22248c4229j7843j4618k4829o7483K0053K7688J2537J8613J13587q9987l500K0469
$$ -34229 -52072 -66690 -91519 -159002 -138949 -111261 -98724 -80111 33476 -56511 -60011 -39542
22236c9542J30433J02317k26360j5125R6006n9829l2509J66287P5177j4966K01666
$$ -39542 90891 193208 -33152 -48277 47729 -12100 -44609 121678 196855 181889 383555
22225C83555r4355k6442p605k17571j11208K0686j4331K1181J91923N7857Q4534
$$ 383555 289200 262758 255153 37582 -73626 -52940 -67271 -46090 145833 203690 288224
22214B88224R7373j65305k24768j03230o984k4438J32955r064k30893J02Q7245
$$ 288224 385597 220292 -4476 -107706 -114690 -139128 -6173 -15237 -246130 -246028 -158783
22203a58783J5858N5708k1104m0039R361R1134K41359j3961k4614N2443m8687
$$ -158783 -142925 -87217 -108321 -148360 -138999 -47865 193494 179533 154919 207362 158675
22192A58675j22713j38157j02034R1834J05521q6133Q3129K00362j15214M842
$$ 158675 35962 -102195 -204229 -112395 -6874 -93007 -9878 190484 75270 80112
22182H0112J9099n8158O9321M5733J58377m95j34357l10500l0420K41416o522
$$ 80112 99211 41053 110374 156107 314484 313989 179632 -130868 -161288 80128 73606
22171G3606N985j1463r0697j0385J48931m4909j93133j13946j58893j79811Q6768
$$ 73606 79591 68128 -22569 -32954 115977 71068 -122065 -236011 -394904 -574715 -487947
22160d87947J41982o0355M2110J56203J29035m0471q9980J36320J28322Q1456
$$ -487947 -345965 -406320 -364210 -208007 -78972 -119443 -209423 -73103 55219 136675
22150A36675j08781j98116L0128O4827n1516K9753N4403J94716p1872j26524j52244
$$ 136675 27894 -170222 -140094 -75267 -126783 -97030 -42627 152089 80217 -46307 -198551
22139a98551O076P6940L1654O6720J61525K03486M4478k01660k04216L1782q829
$$ -198551 -192475 -115535 -83881 -17161 144364 347850 392328 190668 -13548 18234 9405
22128I405K6446R6425Q1333o970k90539r1352j95367p9997J81578J17424M9835
$$ 9405 35851 132276 213609 206639 -83900 -175252 -370619 -450616 -269038 -151614 -101779
22117a01779N6895L003l5142J469j48055j41675j37003Q5270K03627Q3722J2078
$$ -101779 -44884 -41881 -77023 -75554 -223609 -365284 -502287 -417017 -213390 -129668 -117590
22106a17590Q3827k1903m0665R6106J59807j28519k27832o0974J88102P3267n5227
$$ -117590 -33763 -55666 -96331 -225 159582 31063 -196769 -257743 -69641 3626 -51601
22095e1601j5399j77433L9189P8426Q917l5636M2542n7774o8353J7445R8922O3287
$$ -51601 -67000 -244433 -205244 -126818 -117901 -153537 -110995 -168769 -237122 -219677 -120755 -57468
22083e7468r4669J48020K04173l6331j80492j1177l1949k16201R3058J78622M2293
$$ -57468 -152137 -4117 200056 163725 -16767 -27944 -59893 -276094 -183036 -4414 37879
22072C7879q6716q0788q9310j37341j06732O5285J08461P076N8850j3361o1490
$$ 37879 -48837 -129625 -218935 -356276 -463008 -397723 -289262 -282186 -223336 -236697 -298187
22061b98187k3038O6680j4436k374p294O7997J41343j08579J28880p332p3143
$$ -298187 -321225 -254545 -268981 -271355 -278649 -210652 -69309 -177888 -49008 -56340 -129483
22050a29483L2072M2414J88897n1507m137j16846P936J73227j0652p6890o998
$$ -129483 -97411 -54997 133900 82393 78256 -38590 -30654 142573 131921 55031 48033
22039D8033P8998q3221k24202p4116j1458J7685J02328Q763j46285q9180j0206
$$ 48033 127031 43810 -180392 -254508 -265966 -248281 -145953 -137190 -283475 -372655 -382861
22028c82861J62512J48510R3891p0903M4089n5368j52769p6889K25030K38000
$$ -382861 -220349 -71839 22052 -48851 -4762 -60130 -212899 -289788 -64758 173242
22018A73242j31349m3168J46143o0778l1357O9957N1001L3980k1937N494N4790
$$ 173242 41893 -1275 144868 84090 52733 122690 173691 207671 185734 191228 246018
22007B46018j76473o3642r357J07479q0442q6164j0370l2826j0638j56109M9192
$$ 246018 69545 5903 -3454 104025 23583 -62581 -72951 -105777 -116415 -272524 -223332
21996b23332K1311R7738l1152n2487L1489K8588P0868r8129P5209J04605O2775
$$ -223332 -202021 -104283 -135435 -187922 -156433 -127845 -56977 -155106 -79897 24708 87483
21985H7483r7459n8244L7544k3075J41077J3168j14283l380m7338J3440J42637
$$ 87483 -9976 -68220 -30676 -53751 87326 100494 -13789 -17169 -64507 -51067 91570
21974I1570n9409L3323J51912r7349m3965l1171Q4514K9243L7874L0135j05075
$$ 91570 32161 65484 217396 120047 76082 44911 129425 158668 196542 226677 121602
21963A21602k33051l9653j1078J91886n7916j33759O5035K0047J31417O2872J4334
$$ 121602 -111449 -151102 -162180 29706 -28210 -161969 -96934 -76887 54530 117402 131736
21952A31736j66716q8347J50717J70328j16594j42267O7674O2956L7756R603q1089
$$ 131736 -34980 -123327 27390 197718 81124 -61143 6531 69487 107243 116846 35757
21941C5757j8289P282J2777j39823P6816J7281J2122j63395o0443Q1421N3199
$$ 35757 17468 24750 37527 -102296 -25480 -8199 3923 -159472 -219915 -138494 -85295
21930h5295j55786j21778Q9693J18730R0949r5254O7635L707k7522O8474N2673
$$ -85295 -241081 -362859 -273166 -154436 -63487 -158741 -91106 -87399 -114921 -46447 6226
21919F226J3994J8026N294j33145k4317R1379M3940o7833m034L5253j28003j25596
$$ 6226 20220 38246 43540 -89605 -113922 -22543 21397 -46436 -50470 -15217 -143220 -268816
21907b68816L2501Q6690J09053P7656j13085n5746J36035j93544q0405n1980M9081
$$ -268816 -236315 -149625 -40572 37084 -76001 -131747 4288 -189256 -269661 -321641 -272560
21896b72560j25359J94424K31060J01071J0305R797p9140j73204k45247k1296
$$ -272560 -397919 -203495 27565 128636 138941 148738 69598 -103606 -348853 -370149
21886c70149L00417J26568m6087k0769J06539k382L565j32312j79182k1973p4757
$$ -370149 -69732 56836 10749 -10020 96519 94137 97702 -34610 -213792 -235765 -310522
21875c10522P2439o2018j05303K01188J24335J58830J75225k6075o1103M6838
$$ -310522 -238083 -300101 -405404 -204216 -79881 78949 254174 228099 166996 213834
21865B13834o4214k32351k7760K24616J96882J6211k20612j23275L8764R5080
$$ 213834 149620 -82731 -110491 114125 311007 327218 106606 -16669 22095 117175
21855A17175L0488r7701j54404m1456O7824L7995m614N7574R630j50481q7758
$$ 117175 147663 49962 -104442 -145898 -78074 -40079 -44693 12881 22511 -127970 -215728
21844b15728O9394j262l4974N5003k180k4420k6525R0402q0209M0101J04903m370
$$ -215728 -146334 -147596 -182570 -127567 -129747 -154167 -180692 -90290 -170499 -130398 -25495 -29865
21832b9865k17109p1125R2234J41326K27054Q3285q6729K6569P6129k0570j49654
$$ -29865 -246974 -318099 -225865 -84539 142515 225800 139071 165640 241769 221199 71545
21821G1545o7646L7394j56771j31687P7887K14938Q3960L7877j01337l0386L0044
$$ 71545 3899 41293 -115478 -247165 -169278 45660 129620 167497 66160 35774 65818
21810F5818j24718o5249J0266q4879n7964J14887n2422n6620p2660M7121q5883
$$ 65818 -58900 -124149 -113883 -198762 -256726 -141839 -194261 -250881 -323541 -276420 -362303
21799c62303M2045J80444K36874J02958q1919j06684k3357n1026J2937m6673o6406
$$ -362303 -320258 -139814 97060 200018 118099 11415 -11942 -62968 -50031 -96704 -163110
21788a63110J7904J41590J1799j36177N2261n1803j21595M1135j5650P3035Q5261
$$ -163110 -145206 -3616 8183 -127994 -75733 -127536 -249131 -207996 -223646 -150611 -65350
21777f5350m827j11214j01283J68393R1512L057J60000p049R1177P6886j6463
$$ -65350 -70177 -181391 -282674 -114281 -22769 -19712 140288 133239 224416 301302 284839
21766B84839q9072j37478j00227k9330R7369m4196Q5185J57623j25912o3130K4021
$$ 284839 195767 58289 -41938 -71268 26101 -18095 67090 224713 98801 35671 59692
21755E9692K2357k07425j71232n7337m7501O8365L06427J31618j08523k906J9320
$$ 59692 82049 -125376 -296608 -353945 -401446 -333081 -26654 104964 -3559 -6465 12855
21744A2855j73676j01453J5669o2330q5768m7138Q0031J10671m9010j3804J57049
$$ 12855 -160821 -262274 -246605 -308935 -394703 -441841 -361810 -251139 -300149 -313953 -156904
21733a56904J37701Q06q7078j45320L1461J4765P2915K1635p7394Q4646M8196
$$ -156904 -19203 -18397 -105475 -250795 -219334 -204569 -131654 -110019 -187413 -102767 -54571
21722e4571j4450j75060j30979K14881P1193J43039M8411r6249K359Q0338J20512
$$ -54571 -69021 -244081 -375060 -160179 -88986 54053 102464 6215 8574 88912 209424
21711B09424r6186m273K03159K820n7488j16765q4541L9942j74805K8375M2417
$$ 209424 113238 108965 312124 314944 257456 140691 56150 96092 -78713 -50338 -7921
21700g921j56345j4393n9644o076N0837k5329q311J11110P004l6432k34501n8073
$$ -7921 -164266 -178659 -238303 -244379 -193542 -218871 -227182 -116072 -109068 -145500 -380001 -438074
21688d38074J64103O2953j3944p7137Q2770J63601J05022L2576m3388j64832j7772
$$ -438074 -273971 -211018 -224962 -302099 -219329 -55728 49294 81870 38482 -126350 -144122
21677a44122N6574P5676J27390k9058j40771j53619r6981l1234K20358j5076o4518
$$ -144122 -87548 -11872 115518 86460 -54311 -207930 -304911 -336145 -115787 -130863 -195381
21666a95381k7585j79907O5406O3485J30596J44331Q1864j41320q9412J62946
$$ -195381 -222966 -402873 -337467 -273982 -143386 945 82809 -58511 -147923 15023
21656A5023Q3509j57423O3901m6237O8178Q4518o7654N5035R2704j8131L2441
$$ 15023 98532 -58891 5010 -41227 26951 111469 43815 98850 191554 173423 205864
21645B05864l3776k7933L469j70194N0754n712p4216r7475Q9948J26111l1976
$$ 205864 172088 144155 147624 -22570 28184 22472 -51744 -149219 -59271 66840 34864
21634C4864k10729k05023r1088O2277K5625Q9567R3556o4190J56986J39765K4361
$$ 34864 -175865 -380888 -471976 -409699 -384074 -294507 -200951 -265141 -108155 31610 55971
21623E5971J25985p1012k02161j09027n1647j3584K02073R1455J16862j7480n117
$$ 55971 181956 110944 -91217 -200244 -251891 -265475 -63402 28053 144915 127435 122318
21612A22318q0476j07307J03562J25703j49235j25520q856M6707J71719J09837
$$ 122318 41842 -65465 38097 163800 14565 -110955 -119811 -73104 98615 208452
21602B08452n9235m9489l6999J10780j4754m0971M0926r4374J489J153k81208
$$ 208452 149217 99728 62729 173509 158755 117784 158710 64336 65825 66978 -214230
21591b14230q6654R79L2660J74419P3473J13291Q0894j22346j16444P5801q6275
$$ -214230 -300884 -299905 -267245 -92826 -19353 93938 174832 52486 -63958 11843 -74432
21580g4432j208K2157k697K8566J23337J76554O3423r678j87424q7854Q2622l8451
$$ -74432 -75640 -53483 -56180 -27614 95723 272277 335700 326022 138598 50744 133366 94915
21568I4915q3589p0932r4612m2149l7586j8055P0005J68150J44764O1873N7559
$$ 94915 11326 -59606 -154218 -196367 -233953 -252008 -182003 -13853 130911 192784 250343
21557B50343J40972j80210j38188R442P662p1011j18736o0619l2044J54319P9928
$$ 250343 391315 211105 72917 82359 90021 19010 -99726 -160345 -192389 -38070 41858
21546D1858j01861Q407J08416J06976K3165P4546r9715k96712o819J52443J64396
$$ 41858 -60003 -51596 56820 163796 186961 261507 161792 -134920 -141739 10704 175100
21535A75100q9390J43598q3016j13223o9589j9240P7348j691N3820Q1055j15120
$$ 175100 85710 229308 146292 33069 -36520 -55760 21588 19897 73717 154772 39652
21524C9652j28879N7763L3121O5722Q8565M0402o6718o0745l8225j05283M4410
$$ 39652 -89227 -31464 1657 67379 155944 196346 129628 68883 30658 -74625 -30215
21513c0215N6297k5080j92084n1002J39800N3719Q1673r432j55682o1529k2446
$$ -30215 26082 1002 -191082 -242084 -102284 -48565 33108 23676 -132006 -193535 -215981
21502b15981J79628o9905L1785j30277p3778J41811J96114k23578q2835J45801
$$ -215981 -36353 -106258 -74473 -204750 -278528 -136717 59397 -164181 -247016 -101215
21492a01215o4719k3284K1523L8429k4335n0074J31105K68705J90194q1076j77325
$$ -101215 -165934 -189218 -167695 -129266 -153601 -203675 -72570 196135 386329 305253 127928
21481A27928j53166j56422j9886k6619N0632Q2542J24820m0187l4161L9541j2743
$$ 127928 -25238 -181660 -201546 -228165 -177533 -94991 29829 -10358 -44519 -4978 -17721
21470a7721J66575o7031j38563M9288k10723j7107K25880P9584L2487k4567J49417
$$ -17721 148854 81823 -56740 -7452 -218175 -235282 -9402 70182 102669 78102 227519
21459B27519j62110k10334r7381J40052J07808p7239j09243j12344J0989M5549
$$ 227519 65409 -144925 -242306 -102254 5554 -71685 -180928 -293272 -282283 -236734
21449b36734J91831J5482k5177o7321r8941Q8822K51995P9967P385o8797o7238
$$ -236734 -44903 -29421 -54598 -121919 -220860 -132038 119957 199924 207309 138512 71274
21438G1274J14483p345p036j381Q6225L0305J79090L03114K59914l442O3778J54778
$$ 71274 185757 178412 171376 169995 256220 286525 465615 768729 1028643 1025201 1088979 1243757
21426A243757j20414k90903j37943O3009J80305l0150p5506l3597L5173J04948
$$ 1243757 1123343 832440 694497 757506 937811 907661 832155 798558 833731 938679
21416I38679R6836p9851O3351k790o9532p9966j78033k01738k9659q297q4870
$$ 938679 1035515 955664 1019015 1016225 946693 866727 688694 486956 457297 449000 364130
21405C64130k13143j23045Q98L3236k5478o007k9923j066j292j98655j74113O243
$$ 364130 150987 27942 28840 62076 36598 30591 668 -398 -1690 -200345 -374458 -368215
21393c68215J28000J35474J71856J45063Q1361N9419j03497k23035j89433j52078
$$ -368215 -240215 -104741 67115 212178 293539 352958 249461 26426 -163007 -315085
21383c15085Q4315N950o6780J14754O7531J2467J80898j08186k02631p7639M8985
$$ -315085 -230770 -224820 -291600 -176846 -109315 -96848 84050 -24136 -226767 -304406 -255421
21372b55421j8619N3065K26475N0720J79949P7069O8028j97534k38923K8310K18550
$$ -255421 -274040 -220975 5500 56220 236169 313238 381266 183732 -55191 -26881 191669
21361A91669P454j34684j29508Q495P9763J25955k5429j1221j55315k6988Q3845
$$ 191669 199123 64439 -65069 -56574 23189 149144 123715 112494 -42821 -69809 14036
21350A4036M4878P7892J054j30335J5962r9780L8273L8172P7025r3034r5202j6048
$$ 14036 58914 136806 137860 7525 23487 -76293 -38020 152 77177 -15857 -111059 -127107
21338a27107R7952l480J56716K00688M9280r3643r7300P4850L4530j84353j94590
$$ -127107 -29155 -32635 124081 324769 374049 280406 183106 257956 292486 108133 -86457
21327h6457n8531p2477o0996J1064L7980J620J1722N1420J02245Q0646m9558n3028
$$ -86457 -144988 -217465 -278461 -267397 -229417 -227797 -216075 -164655 -62410 18236 -31322 -84350
21315h4350l3714O0346p2811K4399M5856r9220j4771J8220R0926M0461r2663j69136
$$ -84350 -118064 -57718 -130529 -106130 -60274 -159494 -174265 -156045 -65119 -24658 -117321 -286457
21303b86457P635J39686J84087o379k9657j14981l297N2539J44304j0716j35677
$$ -286457 -278822 -139136 44951 38572 8915 -106066 -109363 -56824 87480 76764 -58913
21292e8913j35636N9690J72377r0359j27774K6028R9152K88842J22720q4426k70386
$$ -58913 -194549 -134859 37518 -52841 -180615 -154587 -55435 233407 356127 271701 1315
21281A315k5634M8395K8788P7250l7499J215q5234j31355k7632R6956J34742P0432
$$ 1315 -24319 24076 52864 130114 92615 93830 8596 -122759 -150391 -53435 81307 151739
21269A51739K6025J0173j64448j24029R0859L3366O9277Q0642J76905r8263l07492
$$ 151739 177764 187937 23489 -100540 -9681 23685 92962 173604 350509 252246 -55246
21258e5246o3866J65335Q6781K0847r0302k15974M705J25120J8231j17199m0443
$$ -55246 -119112 46223 133004 153851 63549 -152425 -147720 -22600 -4369 -121568 -162011
21247a62011R8823J04876M88K47664O5434j49972j94460J6609j80013N0446J50507
$$ -162011 -63188 41688 42176 289840 355274 205302 10842 27451 -152562 -102116 48391
21236D8391L7399L2467p9504K6093M7214J3964N4169O8059r7906j48794j13621
$$ 48391 85790 118257 38753 64846 112060 126024 180193 248252 150346 1552 -112069
21225a12069j40643j21086N5840K54455J68859j20928r8168J36773L9748m4774
$$ -112069 -252712 -373798 -317958 -63503 105356 -15572 -113740 23033 62781 18007
21215A8007n3465O1849P3814m3683P5482L875N1685j10734j07585J11254p602
$$ 18007 -35458 26391 100205 56522 132004 135879 187564 76830 -30755 80499 72897
21204G2897j70090j4372M0520J38296o9699n0178M5077L5160L09n1344j88200
$$ 72897 -97193 -111565 -71045 67251 -2448 -52626 -7549 27611 27920 -23424 -211624
21193b11624j0243J57103M723q3891j29362J00006J33985J04999O8890J10097
$$ -211624 -221867 -64764 -60041 -143932 -273294 -173288 -39303 65696 134586 244683
21183B44683K7338j61495p4741Q8394q482j45529J02175P0201J47958K46377k87028
$$ 244683 272021 110526 35785 124179 115697 -29832 72343 142544 290502 536879 249851
21172B49851r3624M7052j3074Q5141j85058m1980j8920j24943p1766j06566j1254
$$ 249851 156227 203279 190205 275346 90288 48308 29388 -95555 -167321 -273887 -285141
21161b85141q7140R334R8318q455N4175J51265P7990J00182O8491j5186k315l432
$$ -285141 -372281 -362947 -264629 -273084 -218909 -67644 10346 110528 179019 163833 161518 158086
21149A58086j62217l9715O5340R0751j58806O7942J63442J8377P190n8263j26590
$$ 158086 -4131 -43846 21494 112245 -46561 21381 184823 203200 210390 152127 25537
21138B5537J1231O4576Q5445O3099L2940r8563J3655J15722l6581k11643K7420
$$ 25537 36768 101344 186789 249888 282828 184265 197920 313642 277061 65418 92838
21127I2838J97805M7671j7783J708j01940J06959l9117p7367o6976J07382L0084
$$ 92838 290643 338314 320531 322239 220299 327258 288141 210774 143798 251180 281264
21116B81264m3711r6297J11711n1488j01315J56586J7012K5101m9449Q0523k5270
$$ 281264 237553 141256 252967 201479 100164 256750 273762 298863 249414 329937 304667
21105C04667L2695O6465k5631p5721p9382j20905q7046J33887K2640o5036j21041
$$ 304667 337362 403827 378196 302475 223093 102188 15142 149029 171669 106633 -14408
21094a4408K00697J02574q3868P7759j44241J81188J14649q2801k54172q4450
$$ -14408 186289 288863 204995 282754 138513 319701 434350 351549 97377 12927
21084A2927Q6665j45902J02731J64093J27575K0138o2357Q297j11861p6563Q2007
$$ 12927 99592 -46310 56421 220514 348089 368227 305870 314167 202306 125743 207750
21073B07750q9067O9802J76639N3699j83027j3080M0875Q3052j4429P756n6672
$$ 207750 118683 188485 365124 418823 235796 222716 263591 346643 332214 339970 283298
21062B83298J6429n6044j41289k08453j57526l3579J71304R9574l5865k2416J72669
$$ 283298 299727 243683 102394 -106059 -263585 -297164 -125860 -26286 -62151 -84567 88102
21051H8102O471O1293J62055q0749j8947n0817r6378O4338K148J10478O1084k6237
$$ 88102 94573 155866 317921 237172 218225 167408 71030 135368 137516 247994 309078 282841
21039B82841J11282R058n742l4489j36000J35357j60207j13389L6528r6524J2712
$$ 282841 394123 403181 397439 362950 226950 362307 202100 88711 125239 28715 41427
21028D1427N2319P3397m129N0860M980q5788J45140K29991j40945l80j97662k22244
$$ 41427 93746 167143 163014 213874 218854 133066 278206 508197 367252 366872 169210 -53034
21016e3034M7163m608O1994P8773n035m0080J632P3707N5752O3472R2363l5604
$$ -53034 -5871 -10479 51515 130288 125253 85173 86805 160512 216264 279736 372099 336495
21004C36495l8449q192J10714r3909j62538k67315j46835J11317K76141R7442
$$ 336495 298046 289854 400568 306659 144121 -123194 -270029 -158712 117429 214871
20994B14871r8631k13930l2795J36330j20734j29601R7981L29475Q0616p7265
$$ 214871 116240 -97690 -130485 5845 -114889 -244490 -146509 182966 263582 186317
20984A86317j65550j43458m4670q8671R2289K10476Q9164k4634J8044R930J38283
$$ 186317 20767 -122691 -167361 -256032 -163743 46733 135897 111263 129307 139237 277520
20973B77520n6282q662J67087J49786j774j18785k1095O6739m674k06726R1021
$$ 277520 221238 212576 379663 529449 527675 408890 387795 454534 449860 243134 334155
20962C34155R0302O2175J5036j13606j28271N1645J06405K35039L0717J30855
$$ 334155 424457 486632 501668 388062 259791 311436 417841 652880 683597 814452
20952H14452Q7726j37567k28448J12883J85701m5764j1130j13203m9688J34376
$$ 814452 902178 764611 536163 649046 834747 788983 777853 664650 614962 749338
20942G49338k4554j38155O665J63730O0550m8492j16343j1070J09799k7190Q8410
$$ 749338 724784 586629 593294 757024 817574 769082 652739 641669 751468 724278 812688
20931H12688K28946J40094K7933l7816m1734n6946K0472q116K705J44836k580
$$ 812688 1041634 1181728 1209661 1171845 1130111 1073165 1093637 1085521 1088226 1233062 1230482
20920A230482J351K28005J94533k0390j17552M8033J15509L08097j52987m6926
$$ 1230482 1231833 1459838 1654371 1633981 1516429 1564462 1679971 1988068 1835081 1788155
20910A788155J76768J24771J30318J58888J30405L13089M11377L19076J99498
$$ 1788155 1964923 2089694 2220012 2378900 2509305 2822394 3233771 3552847 3752345
20901C752345K34821K17756J30472K11605K35191L56319L18443K38766K99908
$$ 3752345 3987166 4204922 4335394 4546999 4782190 5138509 5456952 5695718 5995626
20892E995626M00346L70618N14570O66622P84473P05084M69633O61383P98508
$$ 5995626 6395972 6766590 7281160 7947782 8732255 9437339 9906972 10568355 11366863
20883A1366863J117797J319283J626130K248164K778759L365390M783384O933465
$$ 11366863 12484660 13803943 15430073 17678237 20456996 23822386 28605770 35539235
20875C5539235J0146480J5253039K2798463L0367949L1880250K3309891J0370668
$$ 35539235 45685715 60938754 83737217 114105166 145985416 169295307 179665975
20868A79665975K591761M479852R728137P276573m513444j8817136k5480100k2088304
$$ 179665975 182257736 186737588 196465725 203742298 199228854 180411718 154931618 132843314
20860A32843314j4564304n078119O336437J8780648K7330739K3807418J0570859
$$ 132843314 118279010 113200891 119537328 138317976 165648715 189456133 200026992
20853B00026992j612144m825168R30660L749092l572032j7076059k7972762l0033080
$$ 200026992 198414848 193589680 194520340 198269432 194697400 177621341 149648579 119615499
20845A19615499k6357347k1284928j6062602j1604682q180544n945315m758884
$$ 119615499 93258152 71973224 55910622 44305940 36125396 30180081 25421197
20838B5421197l767066k835578k084791j760051j483827j217846r65102r07332
$$ 25421197 21654131 18818553 16733762 14973711 13489884 12272038 11306936 10399604
20830A0399604q11426q58742o71736p56041o13267m48613l06536l89354l69387
$$ 10399604 9588178 8729436 8057700 7301659 6688392 6239779 5933243 5543889 5174502
20821E174502k21403L5553j17044k51059j41597k12287l49836j19496j32299l02589
$$ 5174502 4953099 4988652 4871608 4620549 4478952 4266665 3916829 3797333 3665034 3362445
20811C362445k72291k49401k87545j91812j37943k9585N0087k9662n0560k20410
$$ 3362445 3090154 2840753 2553208 2361396 2223453 2193868 2243955 2214293 2163733 1943323
20801A943323r9454m4599q7086j17577K9051j28231j63935r4058k5766j69931
$$ 1943323 1843869 1799270 1712184 1594607 1623658 1495427 1331492 1237434 1211668 1041737
20791A041737m5583j19114n1352J86142K97920m9756j36624j39897N6709J92434
$$ 1041737 996154 877040 825688 1011830 1309750 1259994 1123370 983473 1040182 1232616
20781A232616K21304J00541k40658j94095j00160J7379L00415M6413M2786L9147
$$ 1232616 1453920 1554461 1313803 1119708 1019548 1036927 1337342 1383755 1426541 1465688
20771A465688j76061l8659q9895q5698O3104p0714k00037j39639K5230j13566
$$ 1465688 1289627 1250968 1161073 1075375 1138479 1067765 867728 728089 753319 639753
20761F39753k14244Q2339J41165N4130j2545L7952m7613n1920o8215n7827J47968
$$ 639753 425509 507848 649013 703143 690598 728550 680937 629017 560802 502975 650943
20750F50943P0779Q1894J21151M0667k22791j65789J28434n2151K0859K6567P927
$$ 650943 721722 803616 924767 965434 742643 576854 705288 653137 673996 700563 708490
20739G08490M3762N7970P5138r7294j49420m7811l0065J48005M7478p2682j30730
$$ 708490 752252 810222 885360 788066 638646 590835 560770 708775 756253 683571 552841
20728E52841l6036j35171j4876q277M3813J77489J29095k7240q8269n6191o5128
$$ 552841 516805 381634 366758 358481 402294 579783 708878 681638 593369 537178 472050
20717D72050n7341N4469J12976q8650N977Q7868o2299j43906L7183r2638M8916
$$ 472050 414709 469178 582154 493504 499481 587349 525050 381144 418327 325689 374605
20706C74605l3293p3460J66458p2519j2524k8054J36827J29271k9190j45530q6731
$$ 374605 341312 267852 434310 361791 349267 321213 458040 587311 558121 412591 325860
20695C25860k02285L3279J21923L9263k1788k11677j6500o680J55060O0861k0677
$$ 325860 123575 156854 278777 318040 296252 84575 68075 61395 216455 277316 256639
20684B56639P6271J45632j56478k91401j1546J32151J05418O5300j19080J27308
$$ 256639 332910 478542 322064 30663 19117 151268 256686 321986 202906 330214
20674C30214O8208o1701K3053l4584K6613K2365o3536j01362O0977J14918N8442
$$ 330214 398422 336721 359774 325190 351803 374168 310632 209270 270247 385165 443607
20663D43607P1037L598r3754j25265j34782L5213M0024q9964k804k7397k0128
$$ 443607 514644 518242 424488 299223 164441 199654 239678 149714 146910 119513 99385
20652I9385j31695n5800m9444J058J42227J09352P8395N6656O8737N955n9170
$$ 99385 -32310 -88110 -137554 -136496 5731 115083 193478 250134 318871 324826 265656
20641B65656J7069n0366j55432l1181R2373R9120r896M1742J18111J59947m0226
$$ 265656 282725 232359 76927 45746 138119 237239 227343 269085 387196 547143 506917
20630E06917k06720o4953J5302J71714O999j73311L4739n3616m2044R7017Q7358
$$ 506917 300197 235244 250546 422260 429259 255948 290687 237071 195027 292044 379402
20619C79402J4832r3086N3065J10659j9737j68110K4879m2357J01225k8276P7241
$$ 379402 394234 301148 354213 464872 445135 277025 301904 259547 360772 332496 409737
20608D09737O2701m3313n1372N5469o0607L5812J2368j41394k19484M0530M9156
$$ 409737 472438 429125 377753 433222 372615 408427 420795 279401 59917 100447 149603
20597A49603L05n9198j24206q3992O343J71487N4039j27111J02395l2672J40865
$$ 149603 149908 90710 -33496 -117488 -111145 60342 114381 -12730 89665 56993 197858
20586A97858J3301N0159J29439J1408L7035J5234q9782j22702M1580L4672r3561
$$ 197858 211159 261318 390757 402165 439200 454434 364652 241950 283530 318202 224641
20575B24641l3040j09707J7539O7859J16609Q3372M4188j81461j03287r7799j24915
$$ 224641 191601 81894 99433 167292 283901 367273 411461 230000 126713 28914 -96001
20564i6001Q3114J91383P1104N4410Q1579k53726j21095M354J00191l7561n5571
$$ -96001 -12887 178496 249600 304010 385589 131863 10768 15122 115313 77752 22181
20553B2181o0308N3320J56248O5176K8988Q7098n5936j18511M3115j35620j76231
$$ 22181 -38127 15193 171441 236617 265605 352703 296767 178256 221371 85751 -90480
20542i0480J2833J69499O2398m4680j90976L7100l0236N3019r4898m4286L55327
$$ -90480 -77647 91852 154250 109570 -81406 -44306 -74542 -21523 -116421 -160707 194620
20531A94620k0776k62136J15216q2364r2589n4237M4571P2222O1848J82747L3110
$$ 194620 173844 -88292 26924 -55440 -148029 -202266 -157695 -85473 -23625 159122 192232
20520A92232k4696N4090J06590k15256k4840K4979R3363R5032p304j82983j97539
$$ 192232 167536 221626 328216 112960 88120 113099 206462 301494 294190 111207 -86332
20509h6332J33902J67795o3924r9049N5506O6152m8409P6421n3853m6090j4570
$$ -86332 47570 215365 151441 52392 107898 174050 125641 202062 148209 102119 87549
20498H7549P2639J61165Q3719N0179q1819r4174J32439j64599j6932M7118m0159
$$ 87549 160188 321353 405072 455251 373432 279258 411697 247098 230166 277284 237125
20487B37125l381L8862L5792j87697P5391L5071R634j01659l1370P5906Q23k3636
$$ 237125 233744 272606 308398 120701 196092 231163 240797 139138 107768 183674 184497 160861
20475A60861p1156j69685j41012j00514k1818J55152L7706L3001N5788N9458J53149
$$ 160861 89705 -79980 -220992 -321506 -343324 -188172 -150466 -117465 -61677 -2219 150930
20464A50930J28093p7081j45409k1090J14409J40488Q9717K30062R1994m3541
$$ 150930 279023 201942 56533 35443 149852 290340 380057 610119 702113 658572
20454F58572j61334j11049k11184p0727m9136J54277L0418j37089J4005m7375
$$ 658572 497238 386189 175005 104278 55142 209419 239837 102748 116753 69378
20444F9378l8245P0158J76152j22084J8567Q9142O6676K7856k82670j49198Q8759
$$ 69378 31133 101291 277443 155359 173926 263068 329744 357600 74930 -74268 14491
20433A4491N7288L0721p0482N9895J18294N5235J12671J47308K59961j131j31718
$$ 14491 71779 102500 32018 91913 210207 265442 378113 525421 785382 784251 652533
20422F52533l1261M6760l7659j20831k22017k8725k6361k13924j66534R9602K32666
$$ 652533 621272 668032 630373 509542 287525 258800 232439 18515 -148019 -48417 184249
20411A84249J11738r5361M9891l6419r1837p4831N7849P4140R289l0670N8714
$$ 184249 295987 200626 250517 214098 122261 47430 105279 179419 188708 158038 216752
20400B16752o8851n2173K5040k1708m3055q9976J20628J92921L7183q4789n6824
$$ 216752 147901 95728 120768 99060 56005 -33971 86657 279578 316761 231972 175148
20389A75148K08054J83015M2176j40515p319O8453o0495p3886r479L890J67589
$$ 175148 383202 566217 608393 467878 460559 529012 468517 394631 385152 389042 556631
20378E56631K1545j41847J4982P716j26801p9053r2498o6982j59268k3148J92063
$$ 556631 578176 436329 451311 459027 332226 253173 160675 93693 -65575 -88723 103340
20367A03340Q0447k8472K5598j02373k3900q385K8715j9331k4267L3071k0992
$$ 103340 183787 155315 180913 78540 54640 46255 74970 55639 31372 64443 43451
20356D3451K45712K00140p0748J54735K3848j7398p8956j53202l9423J53221R4283
$$ 43451 289163 489303 418555 573290 597138 579740 500784 347582 308159 461380 555663
20345E55663J06389J06615L1311j43411l11567r9855L5944k1988j9479j9224R6791
$$ 555663 662052 768667 799978 656567 345000 245145 281089 259101 239622 220398 317189
20334C17189J39362K9439k3960j0023n6113J68502q236J0704l0022K3001j42088
$$ 317189 456551 485990 462030 452007 395894 564396 556160 566864 536842 559843 417755
20323D17755J19998j60244o5420k9271j4098Q6977J82555N0424J41736J20477
$$ 417755 537753 377509 312089 282818 268720 355697 538252 588676 730412 850889
20313H50889J06291j2642k27935j43508Q3218Q0823K4225P8192J12160K86526
$$ 850889 957180 944538 716603 573095 656313 737136 761361 839553 951713 1238239
20303A238239J09443K02465J90901L7109M9067j268j10350J99591Q6986o3599
$$ 1238239 1347682 1550147 1741048 1778157 1827224 1825956 1715606 1915197 2002183 1938584
20293A938584r3222k07356k0264R4582Q5459L04199J83816K69042K23751K2109
$$ 1938584 1845362 1638006 1617742 1712324 1797783 2101982 2285798 2554840 2778591 2800700
20283B800700j04687N0831J74762J29206J77292J20496J18220l6003k46278m1963
$$ 2800700 2696013 2746844 2921606 3050812 3228104 3348600 3466820 3430817 3184539 3142576
20273C142576J87539K15526J37101K93067K73692J25993L37774J67589p4905J58480
$$ 3142576 3330115 3545641 3682742 3975809 4249501 4375494 4713268 4880857 4805952 4964432
20263D964432J27479L81324M36221K41213M37905O66157O79143Q07104Q91778
$$ 4964432 5091911 5473235 5909456 6150669 6588574 7254731 7933874 8740978 9632756
20254I632756J256431J709949K042218K685320L998770N510987P907098J2101804
$$ 9632756 10889187 12599136 14641354 17326674 21325444 26836431 34743529 46845333
20246D6845333J8189955K5044992K8417819K1810677O191146r822493j6883107
$$ 46845333 65035288 90080280 118498099 140308776 146499922 136677429 119794322
20239A19794322j5208554r470890j645532Q510640J9237074K4283854J6764427
$$ 119794322 104585768 95114878 93469346 101979986 121217060 145500914 162265341
20232A62265341j537375j9379758k6578159k4421234j9682943j4984044j0569077
$$ 162265341 160727966 141348208 114770049 90348815 70665872 55681828 45112751
20225D5112751p212554m487950k464673j417914k37851J418820L507877N972102
$$ 45112751 37900197 33412247 30947574 29529660 29291809 30710629 34218506 40190608
20217D0190608R750671J5885919K4245031L1286050K7852720J1837455p289356
$$ 40190608 49941279 65827198 90072229 121358279 149210999 161048454 153759098
20210A53759098j8861782j9489010j3692261n795420M111828J5142607K2829519
$$ 153759098 134897316 115408306 101716045 95920625 100032453 115175060 138004579
20203A38004579J9627922L776664j4199664k4917102k5844757k2084321j7517700
$$ 138004579 157632501 161409165 147209501 122292399 96447642 74363321 56845621
20196E6845621j2929477r395575o771800m997009l586563k783179k325218j940306
$$ 56845621 43916144 34520569 27748769 22751760 19165197 16382018 14056800 12116494
20188A2116494j509881j118981j054383o59075l67310n08328m38540k04773k35699
$$ 12116494 10606613 9487632 8433249 7774174 7406864 6898536 6459996 6255223 6019524
20179F019524j82469k83154j74771j46975k01250l05933l85356k28898j72733
$$ 6019524 5837055 5553901 5379130 5232155 5030905 4724972 4339616 4110718 3937985
20170C937985j51876k90081j33594l6868j84139k23049k56219j91987k39790j74232
$$ 3937985 3786109 3496028 3362434 3325566 3141427 2918378 2662159 2470172 2230382 2056150
20160B056150j3606k10447k31360o0504n5347N2410J1398j11122n5499J00657
$$ 2056150 2042544 1832097 1600737 1540233 1484886 1537296 1548694 1437572 1382073 1482730
20150A482730o0169M8146L3226l9166l8767j31568n5998K0835J79923k1657r547
$$ 1482730 1422561 1470707 1503933 1464767 1426000 1294432 1238434 1259269 1439192 1417535 1407988
20139A407988Q4438j27127j70794l926j6841r9016j64628j3289R2550n6536o5992
$$ 1407988 1492426 1365299 1194505 1190579 1173738 1074722 910094 896805 989355 932819 866827
20128H66827o9386j24212j21359N1692N1699K2872r5500J34335N8885n7758J06051
$$ 866827 797441 673229 551870 603562 655261 678133 582633 716968 775853 718095 824146
20117H24146k42P8797N1515k1408P1275j84849q6598M9667n6476R0889K05971
$$ 824146 823904 902701 954216 932808 1004083 819234 732636 782303 725827 816716 1022687
20106A022687j31256J10223Q6351o3649k16490k69855j77634M8958K1880Q6608
$$ 1022687 891431 1001654 1088005 1024356 807866 538011 360377 409335 431215 517823
20096E17823j55714R7811L9201m0128J69L0478K1758J25626O2765r3449Q8217
$$ 517823 362109 459920 499121 458993 459162 489640 511398 637024 699789 606340 694557
20085F94557L22975J89739k92985j15719P6182L0999k2488m6317L2158L3572J2370
$$ 694557 1017532 1207271 914286 798567 874749 905748 883260 836943 869101 902673 915043
20074I15043j5443j22603m3788n8023J10759J62479k6097m7756k5569K5464l3398
$$ 915043 899600 776997 733209 675186 785945 948424 922327 874571 849002 874466 841068
20063H41068q0208J06392M736m6665o4942j80252J16249J95525M7012p9618k63031
$$ 841068 760860 867252 871988 825323 760381 580129 696378 891903 938915 859297 596266
20052E96266j28333j24435j3070L6486j5107O8530l2674N7123J81708j33318j90928
$$ 596266 467933 343498 330428 366914 351807 420337 387663 444786 626494 493176 302248
20041C02248j644j10952p1363P8999O8969J1R3626k2836J66431K86313p9593p2802
$$ 302248 300604 189652 118289 197288 266257 266268 359894 337058 503489 789802 710209 637407
20029F37407N9616L2634J88380k65457j37851J16683Q280J20921J43497L8381
$$ 637407 697023 729657 918037 652580 514729 631412 639692 760613 904110 942491
20019I42491P609j3455m1072k14707m8963Q2544j22283o9213J9431K3365l1859
$$ 942491 950100 936645 895573 680866 631903 714447 592164 522951 542382 565747 533888
20008E33888P7841N7696o5854M645k0607m3065o9930k0813j31912k6839l3708
$$ 533888 611729 669425 603571 608216 587609 544544 474614 453801 321889 295050 261342
19997B61342j01611O1508J14991o8710J2858N3459N4845Q2782O58j49851j56473
$$ 261342 159731 221239 336230 267520 280378 333837 388682 471464 472122 322271 165798
19986A65798k3997M4269m0237J36544m1324j47141L4952O4319R1318o9048P245
$$ 165798 141801 186070 145833 282377 241053 93912 128864 193183 284501 215453 222698
19975B22698J5005K68915q3733R534J28618r4039j42502P5049m6711k01629O272
$$ 222698 237703 506618 422885 432419 561037 466998 324496 399545 352834 151205 157477
19964A57477P8670k6538R3808P8120r6057j27038j9146p2362j12092q8329o4104
$$ 157477 236147 209609 303417 381537 285480 158442 139296 66934 -45158 -133487 -197591
19953a97591J64884J02280j2228J55146Q4080R7628K1622j33771k27830J07178
$$ -197591 -32707 69573 57345 212491 296571 394199 415821 282050 54220 161398
19943A61398r2042j19274q8950J7148j3961L4422J05106n8885n5483Q373N4847
$$ 161398 69356 -49918 -138868 -121720 -135681 -101259 3847 -55038 -110521 -102148 -47301
19932d7301j07029J5961K35656R8527j2786m45P1639p7387j16903k3313J03223
$$ -47301 -154330 -138369 97287 195814 183028 182583 254222 176835 59932 36619 139842
19921A39842R5030Q2370r2075n8875l4040R7666O2715l812l6588j99372r1806
$$ 139842 234872 317242 225167 166292 132252 229918 292633 288821 252233 52861 -38945
19910c8945J29039J67004J64288R3805L4535p5496k3902k9858r6906J66978K5781
$$ -38945 90094 257098 421386 515191 549726 474230 450328 420470 323564 490542 516323
19899E16323n4603k28239n3305J3487j59776k71213j95990J69779J14681J63095
$$ 516323 461720 233481 180176 193663 33887 -237326 -433316 -263537 -148856 14239
19889A4239J11945J36568L6364r6453M6753J05803j06220p3111M4719P2651l2427
$$ 14239 126184 262752 299116 202663 249416 355219 248999 175888 220607 293258 260831
19878B60831K7722J04150N1364o4681n2222j88942j71486p9897J64590O5123j6059
$$ 260831 288553 392703 444067 379386 327164 138222 -33264 -113161 51429 116552 100493
19867A00493l1080J3761J49866J37352j37086j65601M0625L7100L7350L0319m5882
$$ 100493 69413 83174 233040 370392 233306 67705 108330 145430 182780 213099 167217
19856A67217J8313K9556J9832j11555j03779p8893p8004J34477J40905R1172m8166
$$ 167217 185530 215086 234918 123363 19584 -59309 -137313 -2836 138069 229241 181075
19845A81075J5040j55843q6399J63411J02751j51779r7236j02192n8395P0021
$$ 181075 196115 40272 -46127 117284 220035 68256 -28980 -131172 -189567 -119546
19835a19546N8108j18098l4796L3624J42027R6043r9630k8665j2712m0196K6663
$$ -119546 -61438 -179536 -214332 -180708 -38681 57362 -42268 -70933 -83645 -123841 -97178
19824i7178L4251J12696r0806Q7479M5170r5616q4222r3324o1561J49460k055
$$ -97178 -62927 49769 -41037 46442 91612 -4004 -88226 -181550 -243111 -93651 -95706
19813i5706K16799O1811j6616j32036L9418J29787j18888o4007J18402O3921J57992
$$ -95706 121093 182904 166288 34252 73670 203457 84569 20562 138964 202885 360877
19802C60877p7458j16944J9640L0812r3434n0132o4294K8053P7371J51824P0809
$$ 360877 283419 166475 186115 216927 123493 73361 9067 37120 114491 266315 337124
19791C37124O6884K8716K2307k7694M7235j51065l3671J55685N5115j47066j97424
$$ 337124 404008 432724 455031 427337 474572 323507 289836 445521 500636 353570 156146
19780A56146n1039j68462q5302J13293K42314Q903k8494K6331m8463J26854J0555
$$ 156146 105107 -63355 -148657 -35364 206950 215853 187359 213690 165227 292081 302636
19769C02636P2100L6627p1158n6843p6301j18810o0307O0034J10167R7315l2794
$$ 302636 374736 411363 340205 283362 207061 88251 27944 87978 198145 295460 262666
19758B62666l6043K7294o2051o9815l6449q0516K43679P1622n1141K1770j17962
$$ 262666 226623 253917 191866 122051 85602 5086 248765 320387 269246 291016 173054
19747A73054o1927M8996N2079L256l374J2747J51376M4940M4720n7194m6474j54920
$$ 173054 111127 160123 212202 215458 212084 224831 376207 421147 465867 408673 362199 207279
19735B07279k8571J64889J1580n3821j37533J27991J6632j43628k14193j22063
$$ 207279 178708 343597 355177 301356 163823 291814 308446 164818 -49375 -171438
19725a71438J4645J86106O2221p5590R1103J01796J50016j02352j4998M0378p7281
$$ -171438 -156793 29313 91534 15944 107047 208843 358859 256507 241509 281887 204606
19714B04606J40821J54761j44688j41226J2145m7294Q3643J05620K5254l4884
$$ 204606 345427 500188 355500 214274 226419 179125 262768 368388 393642 358758
19704C58758r437N9532q9532O8021J26012k8586J83376r3747k57900j35690Q7303
$$ 358758 349321 408853 319321 387342 513354 484768 668144 574397 316497 180807 268110
19693B68110J38672L3706Q6702J34618K2543j22112L993o2024M3158n2116m328
$$ 268110 406782 440488 527190 661808 684351 562239 566232 504208 547366 495250 490922
19682D90922L809l6172j07808j36008n7619K63641J06099p1012j15704Q3547P2702
$$ 490922 494731 458559 350751 214743 157124 420765 526864 455852 340148 423695 496397
19671D96397Q2112R3223N5609m5085J6294J74380J02908K1586k7279p2195j65965
$$ 496397 578509 671732 727341 682256 698550 872930 975838 997424 970145 897950 731985
19660G31985Q739J87627K41786p8477K7252J8669j78050m72J54261j33465o1217
$$ 731985 740724 928351 1170137 1091660 1118912 1137581 959531 959059 1113320 979855 918638
19649I18638L8233j07385j46787P5860J5893j16181m51p0038N3742L34532K19864
$$ 918638 956871 849486 702699 778559 794452 678271 677820 607782 661524 996056 1215920
19638A215920r1960o7401J5318O0961j48970j21269M9021J24485o9940O1604P2822
$$ 1215920 1123960 1056559 1071877 1132838 983868 862599 911620 1036105 966165 1027769 1100591
19627A100591M8555L9370l3048k71424j64541l1452N5995o4068K7465o8883N1441
$$ 1100591 1149146 1188516 1155468 884044 719503 688051 744046 679978 707443 638560 690001
19616F90001q0741j75355J42308K49029M3886O9572R8299r0161l1103j40397l0144
$$ 690001 609260 433905 576213 825242 869128 938700 1036999 946838 915735 775338 745194
19605G45194K72238K27235M4112Q6750R9672L2533N0704J24145J41273J43238
$$ 745194 1017432 1244667 1288779 1375529 1475201 1507734 1558438 1682583 1823856 1967094
19595A967094j03865k164J22555J48511J66322l0752K18726J97706J25952K01127
$$ 1967094 1863229 1861065 1983620 2132131 2298453 2267701 2486427 2684133 2810085 3011212
19585C011212K01931K74991L80667M76686L96255M57334M08019M32289O18505
$$ 3011212 3213143 3488134 3868801 4345487 4741742 5199076 5607095 6039384 6657889
19576F657889J058677J306026J928090K557425L776230N880878R727451J5164465
$$ 6657889 7716566 9022592 10950682 13508107 17284337 23165215 32892666 48057131
19568D8057131K0615402J7941757O93486j1895504j2567860r849323o371766j161929
$$ 48057131 68672533 86614290 87307776 75412272 62844412 52995089 46623323 45461394
19560D5461394N242910J2677812K0441995J9104443J916052q612413m379211L643605
$$ 45461394 50704304 63382116 83824111 102928554 104844606 96232193 91852982 95496587
19552I5496587Q542511J617915j1937352j6125428j3712532j0140680n637624
$$ 95496587 104039098 105657013 93719661 77594233 63881701 53741021 48103397
19545D8103397j94896O248413J3519789J7249333O926367j0796127j6163186j4036978
$$ 48103397 47908501 54156914 67676703 84926036 91852403 81056276 64893090 50856112
19537E0856112j1854557q952471o199627m258781k778304j896478j134563p78374
$$ 50856112 39001555 30049084 23849457 19590676 16812372 14915894 13781331 13002957
19529A3002957n22215l31682J53468L39937N07467R02268J708846K958480M478742
$$ 13002957 12480742 12149060 12302528 12642465 13149932 14052200 15761046 18719526 23198268
19520B3198268P191336J2295571J9752422K5307970J5237538o504631j5422560
$$ 23198268 30389604 42685175 62437597 87745567 102983105 96478474 81055914
19513H1055914j3674093j0189437n351972N79372P674339J5671400K1527338J3641509
$$ 81055914 67381821 57192384 51840412 52419784 60094123 75765523 97292861 110934370
19505A10934370k937913p277426m44000R673953J3039369l303097j9194895j9362399
$$ 110934370 107996457 100719031 100275031 109948984 122988353 119685256 100490361 81127962
19497H1127962j5212426j0496900m736246J675676R306831J6972925J7330377
$$ 81127962 65915536 55418636 50682390 52358066 61664897 78637822 95968199
19490I5968199Q05456j5271218j7063950j4627791j2069224q989011o112326m306997
$$ 95968199 96773655 81502437 64438487 49810696 37741472 28752461 22640135 18333138
19482A8333138l241464k407287j578578j366553j232598q71891p62016q97679
$$ 18333138 15091674 12684387 11105809 9739256 8506658 7634767 6872751 5975072
19474E975072p52174n11207l86171k96526k77071l73420k05647j58182j79124
$$ 5975072 5222898 4711691 4325520 4028994 3751923 3378503 3172856 3014674 2835550
19465B835550j09970j43654n5680j02244n7754K04470K51411L24298K9619k34000
$$ 2835550 2725580 2581926 2526246 2424002 2366248 2570718 2822129 3146427 3176046 2942046
19455B942046m28677l38946j86634k02480k14363j74169j56065j26999j9292m2773
$$ 2942046 2513369 2174423 1987789 1785309 1570946 1396777 1240712 1113713 1094421 1051648
19445A051648k74552k43458j6333R0024j8694n4479J20098J76488R5530o3445
$$ 1051648 777096 533638 517305 607329 588635 534156 654254 830742 926272 862827
19435H62827j17418n2794M9946j79750l6531J18022m0613N0615O1099J01465o3992
$$ 862827 745409 692615 742561 562811 526280 644302 603689 654304 715403 816868 752876
19424G52876o6532j24710J9659L2033r6112J45279J33216J15488j5978o0602m9845
$$ 752876 686344 561634 581293 613326 517214 662493 795709 911197 895219 834617 784772
19413G84772p7970j45326j49751O1227P739J12167j41345l7149J02811o7005r1674
$$ 784772 706802 561476 411725 472952 480691 592858 451513 414364 517175 450170 358496
19402C58496O1960J84271Q1384n9017j46243r8444O2401L7675N9965J16826K228
$$ 358496 420456 604727 686111 627094 480851 382407 444808 482483 542448 659274 661502
19391F61502K9776K08490J81046J41441K82537O3875n7756M4409l7081j51834
$$ 661502 691278 899768 1080814 1222255 1504792 1568667 1510911 1555320 1518239 1366405
19381A366405o6671j75144r395q6599j82073K6958q9815O4381j6707q594K7891
$$ 1366405 1299734 1124590 1115195 1028596 846523 873481 783666 848047 831340 822746 850637
19370H50637J805k0183j01423R3398J16050J2822L22295K31635J66962K60108
$$ 850637 852442 832259 730836 824234 940284 953106 1275401 1507036 1673998 1934106
19360A934106K07415m1170k40410m20335l10183j48452p1213m0852j60288k20565
$$ 1934106 2141521 2100351 1859941 1439606 1129423 980971 909758 868906 708618 488053
19350D88053O3178J47865q6607k9821R8782K7529k05160k27213j64146P7958R4030
$$ 488053 551231 699096 612489 582668 681450 708979 503819 276606 112460 190418 284448
19339B84448R7888k2341q3229P354m3626p818J8606J0464p6864j45233J0228J24612
$$ 284448 382336 359995 276766 284120 240494 232676 251282 261746 184882 39649 49877 174489
19327A74489J02401M0004J3058j24865p5526L7261R7806L4835j30216l640Q8829
$$ 174489 276890 316894 329952 205087 129561 166822 264628 299463 169247 165607 254436
19316B54436O5089j9877k1140k0205J66822J3526m4456O1440r3137M0413j11335
$$ 254436 319525 299648 278508 258303 425125 438651 394195 455635 362498 402911 291576
19305B91576j79255K1588Q1609N1426O5054O6702j20433Q2351J49250j57117j19745
$$ 291576 112321 133909 215518 266944 331998 398700 278267 360618 509868 352751 233006
19294B33006J70584J21543L8005p0959r835J60510M0699o9798j18368m1829P8096
$$ 233006 403590 525133 563138 492179 482344 642854 683553 613755 495387 453558 531654
19283E31654n8626Q9265l2947q0399k84817j27183L3897J86536K36124K0186l20545
$$ 531654 473028 562293 529346 448947 164130 36947 70844 257380 493504 513690 193145
19272A93145l9694J17397J1789R6811N0978P8648N7980l4138j7288j13790n3039
$$ 193145 153451 270848 282637 379448 430426 509074 567054 532916 515628 401838 348799
19261C48799P9307p779N3001J57812j01210k931l6952M1483L931q9643j86673
$$ 348799 428106 420327 473328 631140 529930 526999 490047 531530 535461 445818 259145
19250B59145M3205K40073K9690j9989j40305j13467o2291j1431n1968J34337j51243
$$ 259145 302350 542423 572113 552124 411819 298352 236061 224630 172662 306999 155756
19239A55756q9231J39700o599N977j67059M3693J85552l6014p0601O5738O354
$$ 155756 66525 206225 199626 205603 38544 82237 267789 231775 161174 226912 233266
19228B33266N479k6887m9188j48136K3645j28685J28821K59142j4445j09886m8122
$$ 233266 238745 211858 162670 14534 38179 -90506 38315 297457 283012 173126 125004
19217A25004K2162l8207K4019K3876N3826J42488J5145k30862j69339O7991L01117
$$ 125004 147166 108959 132978 156854 210680 353168 368313 137451 -31888 36103 337220
19206C37220Q0302q554k0691L7072L6367M3984J935J92835o4934k52876p8475
$$ 337220 417522 408968 388277 425349 461716 505700 507635 700470 635536 382660 304185
19195C04185k0875O6072k8314J9099k3523j34071m007m4284m5347r0501R5166
$$ 304185 283310 349382 321068 340167 316644 182573 178566 134282 88935 -1566 93600
19184I3600Q07O284j70281P410K56524J64894L14j4442J04952n1180J49189J76369
$$ 93600 94407 100691 -69590 -62180 194344 359238 359552 345110 450062 398882 548071 724440
19172G24440K0625k21270k08575K4811L5724j95394j34740J56921M8061k4427
$$ 724440 745065 523795 315220 340031 375755 180361 45621 202542 250603 226176
19162B26176q1872m2705K52130J42761N9003n1681j71915K6114P1549J03829m4447
$$ 226176 144304 101599 353729 496490 555493 503812 331897 358011 429560 533389 488942
19151D88942j36055j24984J2109L40743J77861o5711j40779k26124k37152r062
$$ 488942 352887 227903 240012 580755 758616 692905 552126 326002 88850 79788
19141G9788Q8029q3714o2796P9743K69970R2997r2259k24097J4657j2808j2803
$$ 79788 167817 84103 21307 101050 371020 464017 371758 147661 162318 149510 136707
19130A36707k6089r4705j0081l6504N0886r5050J36515K29501L1643O1809Q2088
$$ 136707 110618 15913 5832 -30672 20214 -74836 61679 291180 322823 384632 466720
19119D66720L7987O5460K2847p2181n0772l7575J8511L6919J13079r0365l2790
$$ 466720 504707 570167 593014 520833 470061 432486 450997 487916 600995 510630 477840
19108D77840J62600J45882K10581K55699m3952k27744j57742l0486J34064p737
$$ 477840 640440 786322 996903 1252602 1208650 980906 823164 792678 926742 919005
19098I19005l6568k05531m9912r1033p958l0502N7823r2919m3782O8259K25490
$$ 919005 882437 676906 626994 535961 528003 497501 555324 462405 418623 486882 712372
19087G12372M3092j64471k66701r2341k4726L4506O7044j4280o1207N0551J51828
$$ 712372 755464 590993 324292 231951 207225 241731 308775 294495 233288 283839 435667
19076D35667p390K498p7486j43067j88984l4102J08213J46520R1053J58325P4120
$$ 435667 428277 430775 353289 210222 21238 -12864 95349 241869 332922 491247 565367
19065E65367k4448M4112O6889L7972J15853K34556J08614j27561L66q8354j68119
$$ 565367 540919 585031 651920 689892 805745 1040301 1148915 1021354 1021720 933366 765247
19054G65247j12635l1760J71251m2190o6018l55880l06971M150Q2601L41469R4663
$$ 765247 652612 620852 792103 749913 683895 328015 21044 25194 107795 449264 543927
19043E43927K23972K40689P8726j53871K410N2516Q5475J13922J01263O5794N9572
$$ 543927 767899 1008588 1087314 933443 935853 988369 1073844 1187766 1289029 1354823 1414395
19032A414395N6247M8246k32473R5176J57043J35504J10032M1096p3368n9802
$$ 1414395 1470642 1518888 1286415 1381591 1538634 1674138 1784170 1825266 1751898 1692096
19022A692096j70231q0699p3129j35223R9826J99094k1049k63336k18416m582
$$ 1692096 1521865 1441166 1368037 1232814 1332640 1531734 1510685 1247349 1028933 1024351
19012A024351J83800M5153P0491J73791p8629j08150O8602P2962J58705K3719
$$ 1024351 1208151 1253304 1323795 1497586 1418957 1310807 1379409 1452371 1611076 1634795
19002A634795q539Q832j14325l02609j03926K16806K18789J58703j25306k32292
$$ 1634795 1626256 1635088 1520763 1218154 1114228 1331034 1549823 1708526 1583220 1350928
18992A350928K01024J52625J67142K72304N2668j26103K9764K65186J46972K22391
$$ 1350928 1551952 1704577 1871719 2144023 2196691 2070588 2100352 2365538 2512510 2734901
18982B734901M10102M59785M40273M53994j96567o13896l64788k88242j07898
$$ 2734901 3145003 3604788 4045061 4499055 4302488 3688592 3323804 3035562 2927664
18973B927664K50863L68507K31658K33782P7617o8888K09284K07960K64533O73266
$$ 2927664 3178527 3547034 3778692 4012474 4090091 4021203 4230487 4438447 4702980 5376246
18963E376246Q96683J061241J122514R69449Q29232Q42308J035110J489942K436531
$$ 5376246 6272929 7334170 8456684 9426133 10255365 11097673 12132783 13622725 16059256
18954A6059256K609918K632100L819618O251180J0852177J9518700L4407776N8411350
$$ 16059256 18669174 21301274 25120892 31372072 42224249 61742949 96150725 154562075
18946A54562075Q2203497M9465403l4243414n8144939m7818774l9496461k9585034
$$ 154562075 236765572 286230975 251987561 193842622 146023848 106527387 76942353
18939G6942353j9302097j1363072o416198m311310l356360k253157j425329m92922
$$ 76942353 57640256 46277184 39860986 35549676 32193316 29940159 28514830 28021908
18931B8021908P75914K479369M262906N756971Q265599J2721911K0841238L5943450
$$ 28021908 28797822 31277191 35540097 41297068 49562667 62284578 83125816 119069266
18923A19069266O2416154J02261062J28845538N2085372o9813478r2953949p7312420
$$ 119069266 181485420 283746482 412592020 464677392 394863914 301909965 224597545
18916B24597545o3377166m6920289l1210722j9888118j2872310r644577p403636
$$ 224597545 161220379 114300090 83089368 63201250 50328940 40684363 33280727
18909C3280727n676165m295466l577734k599991j666760q94723l69694m35917
$$ 33280727 27604562 23309096 19731362 17131371 15464611 14569888 14200194 13764277
18901A3764277j136287j428406j403620j250919q28456q27365n71940k04539j02183
$$ 13764277 12627990 11199584 9795964 8545045 7716589 6889224 6317284 6112745 6010562
18892F010562l23260q8233L6682N4234N37582O35336K63437l86599o43966l83978
$$ 6010562 5687302 5599069 5635751 5689985 6227567 6862903 7126340 6739741 6095775 5711797
18882E711797J8859K91269N82355L82766k68695n69421m16995k19184j8455K43013
$$ 5711797 5730656 6021925 6604280 6987046 6718351 6148930 5731935 5512751 5494296 5737309
18872E737309K64006N17548P50173P22187J034874J059704P14239M83539O37816
$$ 5737309 6001315 6518863 7269036 7991223 9026097 10085801 10800040 11283579 11921395
18863A1921395O78155J042119J237519J793866K625437L624860M841405O422686
$$ 11921395 12599550 13641669 14879188 16673054 19298491 22923351 27764756 34187442
18855C4187442Q768902J2793929K0099063L3526911N5628071Q7020321J10076227
$$ 34187442 42956344 55750273 75849336 109376247 165004318 252024639 362100866
18848C62100866O9754593k9245385q0427299p6190559o3682947m9417356l4490873
$$ 362100866 431855459 402610074 322182775 245992216 182309269 132891913 98401040
18841I8401040k2723474j5152374j0560235p645479n464684l934054k509862j501384
$$ 98401040 75677566 60525192 49964957 42319478 36854794 32920740 30410878 28909494
18833B8909494n72917O75416K037798L581199O701376J2400231K1568015L6091952
$$ 28909494 28336577 29011993 31049791 34630990 41332366 53732597 75300612 111392564
18825A11392564N7494000O9983508L2176922l1108093n1535429m5188345l7327099
$$ 111392564 168886564 238870072 271046994 239938901 188403472 143215127 105888028
18818A05888028k8389426j9351262j3054894r308424o745083m975484l865716
$$ 105888028 77498602 58147340 45092446 35784022 29038939 24063455 20197739
18811B0197739k910001k123901j629025j462694j395074j273760r31565o21031
$$ 20197739 17287738 15163837 13534812 12072118 10677044 9403284 8471719 7850688
18803G850688k58433m00970o65856o58564n81284m28550m00521k07866M4361L31597
$$ 7850688 7592255 7191285 6525429 5866865 5285581 4857031 4456510 4248644 4293005 4624602
18793D624602M65300K42900l25532n38390o16903k59663k36296l88324k89258
$$ 4624602 5089902 5332802 5007270 4468880 3851977 3592314 3356018 2967694 2678436
18784B678436j76316k31615j10822j99600j25374k3994k46061o4406m655j04732
$$ 2678436 2502120 2270505 2159683 1960083 1834709 1810715 1564654 1500248 1495593 1390861
18774A390861p4135J43651O7950n9277P5839m0907k00527l0805P0514Q8866J3798
$$ 1390861 1316726 1460377 1528327 1469050 1544889 1503982 1303455 1272650 1343164 1432030 1445828
18763A445828j06866j31556R2229J24467n9977q1953p2861k0078j09621o6677
$$ 1445828 1338962 1207406 1299635 1424102 1364125 1282172 1209311 1189233 1079612 1012935
18753A012935m9549n9004K9010j41889p7927O0333n92Q523j03134o7328K47955
$$ 1012935 963386 904382 933392 791503 713576 773909 773317 781840 678706 611378 859333
18742H59333K3497k247L4089N2104q4622j10800M2916l4041k7353k1047k6339
$$ 859333 882830 880583 914672 966776 882154 771354 814270 780229 752876 731829 705490
18731G05490N9984j98046R7140J36129j73179L370N8806J08237K05078K08979
$$ 705490 765474 567428 664568 800697 627518 630888 689694 797931 1003009 1211988
18721A211988L31138n564k04403l57407j71643m6088m1667n2929J8690P659O8540
$$ 1211988 1543126 1537562 1333159 975752 804109 758021 716354 663425 682115 689774 758314
18710G58314m9494j53637l7731M5990O2102l6962n5673k60191O8956K57492K9498
$$ 758314 708820 555183 517452 563442 625544 588582 532909 272718 341674 599166 628664
18699F28664r2017Q8411K67838K06691K6643Q566j57998q1451L8648J4106j22861
$$ 628664 536647 625058 892896 1099587 1126230 1134796 976798 895347 933995 948101 825240
18688H25240j39975r0729J79240n035R2953j05868j01792j02223J4608K1265J16254
$$ 825240 685265 594536 773776 768741 861694 755826 654034 551811 566419 587684 703938
18677G03938l404o5516n7189Q390P9568J7747j06734j56935K6818l2615q4735
$$ 703938 700534 635018 577829 586219 665787 683534 576800 419865 446683 414068 329333
18666C29333j09843j36373k4973Q8055J24088P2588j41338P7759O9425Q675J61822
$$ 329333 219490 83117 58144 146199 270287 342875 201537 279296 348721 357396 519218
18655E19218R5269j53608p761Q2930P2757J55678o8905j69801j14610N6875J35010
$$ 519218 614487 460879 453118 536048 608805 764483 695578 525777 411167 468042 603052
18644F03052n3259J01385k5174j01423n7787j2488r2638M9962R602j27679j17053
$$ 603052 549793 651178 626004 524581 466794 454306 361668 411630 421232 293553 176500
18633A76500Q0959p2783k0957K36845J26048L4555J2056N7848k86614j38693R0540
$$ 176500 257459 184676 163719 400564 526612 561167 573223 631071 344457 205764 296304
18622B96304N3625K11488o7816N5123N0396p1984p5651j7858j56633l175O353
$$ 296304 349929 561417 493601 548724 599120 527136 451485 433627 276994 273819 280172
18611B80172p3962J06178K01524m4416K9333Q9859q8949j6006J62735J12279o5848
$$ 280172 206210 312388 513912 469496 498829 588688 499739 483733 646468 758747 692899
18600F92899J9106Q5330l3607l2223l6427K73426K28489n7432p7404j3102q7731
$$ 692899 712005 797335 763728 731505 695078 968504 1196993 1139561 1062157 1049055 961324
18589I61324J0921o3883J3892l2831J20747J63565Q2746R2335r7236j55759p5421
$$ 961324 972245 908362 922254 889423 1010170 1173735 1256481 1348816 1251580 1095821 1020400
18578A020400o9537Q9235L6917K49917K9983j01607N4321L7033J20049Q6752j47085
$$ 1020400 950863 1040098 1077015 1326932 1356915 1255308 1309629 1346662 1466711 1553463 1406378
18567A406378L09311K39670M4492Q2853J17278J05068L07093K63394m6688J69274
$$ 1406378 1715689 1955359 1999851 2082704 2199982 2305050 2612143 2875537 2828849 2998123
18557B998123L94022K08765L03925K80608R1282M84757P42128P33334P52119J052818
$$ 2998123 3392145 3600910 3904835 4185443 4276725 4761482 5503610 6236944 6989063 8041881
18547H041881J617944K029696K725203M161249O923922J1114305J7437451K4829056
$$ 8041881 9659825 11689521 14414724 18575973 25499895 36614200 54051651 78880707
18539G8880707K3495835N536604o309410l334273M816450J1032599K845558j5288376
$$ 78880707 102376542 107913146 101603736 98269463 103085913 114118512 116964070 101675694
18531A01675694k0757990j8055736j4824707j1300327p903739n555307l813276
$$ 101675694 80917704 62861968 48037261 36736934 28833195 23277888 19464612
18524A9464612k501884j713917j178440o74312m05917q0889M60832J113701J699715
$$ 19464612 16962728 15248811 14070371 13396059 12990142 12909253 13370085 14483786 16183501
18515A6183501K318283L480135N528106Q636856J3669057K0299074K3451112J2388554
$$ 16183501 18501784 21981919 27510025 36146881 49815938 70115012 93566124 105954678
18507A05954678k775666m782670J197064Q090794O796960q076352j8414274j8054369
$$ 105954678 103179012 98396342 99593406 107684200 114481160 106404808 87990534 69936165
18499F9936165j4950314j1495972p953231m829809k247545o4667K336541N585890
$$ 69936165 54985851 43489879 35536648 30706839 28459294 28394627 30731168 36317058
18491C6317058J0306947J6678869K2138074J6149010j36146o254335j507203N822504
$$ 36317058 46624005 63302874 85440948 101589958 101453812 95199477 93692274 99514778
18483I9514778Q709516k857459j6774435j8468089j5437530j2712226r512851
$$ 99514778 108224294 105366835 88592400 70124311 54686781 41974555 32461704
18476C2461704o735040m464461l163696k426440j677932j103341n93649k90191
$$ 32461704 25726664 21262203 18098507 15672067 13994135 12890794 12297145 12006954
18468A2006954j87768L25341Q60210J171305J989143L341740N476645Q976577
$$ 12006954 11819186 12144527 13004737 14176042 16165185 19506925 24983570 33960147
18460C3960147J4417520K1282177K1775984O307681o293642m237517L167065R877981
$$ 33960147 48377667 69659844 91435828 97743509 91449867 87212350 90379415 100257396
18452A00257396M552661j2938297j9531662j6875134j4005447j0538907p687250
$$ 100257396 104810057 91871760 72340098 55464964 41459517 30920610 23233360
18445B3233360n186084l389152k598585j998095j274459j073801r88925p79758
$$ 23233360 18047276 14658124 12059539 10061444 8786985 7713184 6724259 5944501
18437E944501m62650k90134m85744l91100l96858k35990j11552j30516j49948
$$ 5944501 5481851 5191717 4705973 4314873 3918015 3682025 3570473 3439957 3290009
18428C290009p7168k03226k93469j50959o422j75193k50942j60374p7348J0915
$$ 3290009 3212841 3009615 2716146 2565187 2558765 2383572 2132630 1972256 1894908 1905823
18418A905823p2544k24863p5095K4648j3975J05411J71319k8874l00354j20130
$$ 1905823 1833279 1608416 1533321 1557969 1543994 1649405 1820724 1791850 1491496 1371366
18408A371366Q4925J34691J47686j06303j15089O2082P3061K04273K12698J64967
$$ 1371366 1456291 1590982 1738668 1632365 1517276 1579358 1652419 1856692 2069390 2234357
18398B234357L47908K5121j65118j82975m36340k04964J42211j28675k36994k68220
$$ 2234357 2582265 2607386 2442268 2259293 1822953 1617989 1760200 1631525 1394531 1126311
18388A126311L8986J58246R6858k56168j09576O0437M1189j47311N8495J87581
$$ 1126311 1165297 1323543 1420401 1164233 1054657 1115094 1156283 1008972 1067467 1255048
18378A255048N0692O4186J55055M20026M00927J73596j27292k21534m69379k99174
$$ 1255048 1305740 1369926 1524981 1945007 2345934 2519530 2392238 2170704 1701325 1402151
18368A402151K5714n1414j28254k37448o7208J1810N6650P45K8482Q0584k22231
$$ 1402151 1427865 1376451 1248197 1010749 943541 955351 1012001 1012746 1041228 1121812 899581
18357H99581k11310J46822P224m7160n138J7496q1242k48497l3428q307K529N5227
$$ 899581 688271 835093 842317 795157 790019 807515 726273 477776 444348 436041 438570 493797
18345D93797N3532R5160J4166q3152r572L2286p6147p0403j9205J83599l6986
$$ 493797 547329 642489 656655 573503 563931 596217 520070 449667 430462 614061 577075
18334E77075n1091L6671J23841j6864k96374q9723Q2328J94358J17848N1008K1674
$$ 577075 525984 562655 686496 669632 373258 283535 365863 560221 678069 729077 750751
18323G50751o7637l0405j36383l9375j11544l8569Q9739K7374m7590J75108J26406
$$ 750751 683114 652709 516326 476951 365407 326838 416577 443951 396361 571469 697875
18312F97875K23984J07970J4715J07705L20399M0758j28811j48454l03155o6271
$$ 697875 921859 1029829 1044544 1152249 1472648 1513406 1384595 1236141 932986 866715
18302H66715k4735j88992p6631J00129O591j21450j30784j50096j07523P4240
$$ 866715 841980 652988 576357 676486 683077 561627 430843 280747 173224 247464
18292B47464n1796J82622J06567l5598J82905N9896L1372K17779L07001L23523
$$ 247464 195668 378290 484857 449259 632164 692060 723432 941211 1248212 1571735
18282A571735O5796l11215k89917k2862j13129j91301j14573j10350p7846L4166
$$ 1571735 1637531 1326316 1036399 1013537 900408 709107 594534 484184 406338 440504
18272D40504n8426j9106Q3692P5113j15280k31161P4624o0950k8815m2822j28505
$$ 440504 382078 362972 446664 521777 406497 175336 249960 189010 160195 117373 -11132
18261a1132K1513P6804J09308P8258l5471j27921N4956J5232Q1741J2078o1225
$$ -11132 10381 87185 196493 274751 239280 111359 166315 181547 263288 275366 214141
18250B14141k4768j87477j54438J10507J47711N8333J4283j2928k4266J0701L7453
$$ 214141 189373 1896 -152542 -42035 105676 164009 178292 165364 141098 151799 189252
18239A89252O7047J1731R612j57394n1955P818J64194J72210J18081j17321J37358
$$ 189252 256299 268030 277642 120248 68293 76111 240305 412515 530596 413275 550633
18228E50633p6198n3897m8394p3081m0919j19680k38811J23677J48271J36921
$$ 550633 474435 420538 372144 299063 258144 138464 -100347 23330 171601 308522
18218C08522l3855j28995L783J8574K9976Q3945j56067j44345K27228P6807l4617
$$ 308522 274667 145672 149455 168029 198005 281950 125883 -18462 208766 285573 250956
18207B50956j0336J16938P9772j37581k44419r0748o312P6897J21540K06050R3140
$$ 250956 240620 357558 437330 299749 55330 -35418 -41730 35167 156707 362757 455897
18196D55897r9639j62708J82152P644M2043l3638k1570p1005N2484P1479j19688
$$ 455897 356258 193550 375702 383346 425389 391751 370181 299176 351660 423139 303451
18185C03451p2090J81362J47834J2790l2120j2761J72692j14363j36854j62511
$$ 303451 231361 412723 560557 573347 541227 528466 701158 586795 449941 287430
18175B87430n5454N5789L9154j53819L2986J30803k2779J25724L2019J16296J03262
$$ 287430 231976 287765 326919 173100 206086 336889 314110 439834 471853 588149 691411
18164F91411P2929j81382k20673J05071J06606p4875n3346m3275K60325m5644
$$ 691411 764340 582958 362285 467356 573962 499087 445741 402466 662791 617147
18154F17147j84220K8029N6717j51095j64271l3019o7760l4808Q7921J98404J66109
$$ 617147 432927 460956 517673 366578 202307 169288 101528 66720 154641 353045 519154
18143E19154Q1919O8485j21484j77993j1514l3947o4674j86409j19350L1503K66116
$$ 519154 601073 669558 548074 370081 358567 324620 259946 73537 -45813 -14310 251806
18132B51806M1632m7723J5454j41721o6000r3658N8638M9950P9469l0019J00084
$$ 251806 293438 245715 261169 119448 53448 -40210 18428 68378 147847 117828 217912
18121B17912j6651j01699Q1894K4983N4355l5082J56539R963q5717m1366l8654
$$ 217912 201261 99562 181456 206439 260794 225712 382251 392214 306497 265131 226477
18110B26477j06644p0833o0035J1595l8673N0131R1983K09586l7400m0645R5524
$$ 226477 119833 49000 -11035 560 -38113 12018 104001 313587 276187 235542 331066
18099C31066l3325j48573k9537J6630O8878j29652n7092l8669J19027o0734j36291
$$ 331066 297741 149168 119631 136261 205139 75487 18395 -20274 98753 38019 -98272
18088i8272N0960R9138J07098M43n510K1469k0324M3755N9242j12332q238R8397
$$ -98272 -47312 51826 158924 159367 153857 175326 155002 198757 257999 145667 137429 235826
18076B35826P8735o3398r128j38698j17700O9315p3465j44067o8700J40469J34089
$$ 235826 314561 251163 242035 103337 -14363 54952 -18513 -162580 -231280 -90811 43278
18065D3278J29036m1120l1999r6819m4246L0999R0194k303m4419L5914l1603j2459
$$ 43278 172314 131194 99195 2376 -41870 -10871 79323 77020 32601 68515 36912 24453
18053B4453N3551p7361k4197J65372J38651p7530O4055j34534N5888k6395j43283
$$ 24453 78004 643 -23554 141818 280469 202939 266994 132460 188348 161953 18670
18042A8670o6059j3955K22504L16294j16577l8808O5569r0279j94977O5144J56219
$$ 18670 -47389 -61344 161160 477454 360877 322069 387638 297359 102382 167526 323745
18031C23745L0128j51967M945M6780J1267p0919N3284L4383J55483K1063k78732
$$ 323745 353873 201906 206851 253631 264898 193979 247263 281646 437129 458192 179460
18020A79460j06278N0364J39592J39920J40629M2170Q7028K12442M8347j83024
$$ 179460 73182 123546 263138 403058 543687 585857 672885 885327 933674 750650
18010G50650k74802p6458L3583J76486O1302j35936p9032l9868J03699J4867r8507
$$ 750650 475848 399390 432973 609459 670761 534825 455793 415925 519624 534491 435984
17999D35984J052M4210k61358k26981p0534J2832J89671j9515J00427Q2786j20915
$$ 435984 437036 481246 219888 -7093 -77627 -64795 124876 105361 205788 288574 167659
17988A67659o7812j13248L2109J68004J19434R6060n9296m82K2573P1633q126
$$ 167659 99847 -13401 18708 186712 306146 402206 342910 342428 365001 436634 428508
17977D28508J19878J14406j04455M7857j24265m4682j22221j19815K461J03538
$$ 428508 548386 662792 558337 606194 481929 437247 315026 195211 197672 301210
17967C01210K3190M8939P1649J7773L5605Q7208N7020L664k2926M1720j52600
$$ 301210 324400 373339 444988 462761 498366 585574 642594 646258 623332 665052 512452
17956E12452j11161l4300m8653j22446O1812O8092J9515k71992j12566K70566
$$ 512452 401291 366991 318338 195892 257704 325796 345311 73319 -39247 231319
17946B31319L0265j13742L0715k2878j33276k27668l2228j23737J82888J26302
$$ 231319 261584 147842 178557 155679 22403 -205265 -237493 -361230 -178342 -52040
17936e2040J57481K1257L3932P7470J59821Q4995R6338O7707K4004L2659j93761
$$ -52040 105441 126698 160630 238100 397921 482916 579254 646961 670965 703624 509863
17925E09863j07018p4682k0461j00150j01534J75097J67806j15044j98496k13506
$$ 509863 402845 328163 307702 207552 106018 281115 448921 333877 135381 -78125
17915g8125l7573K7172J38784K7548l2305R1166n6139k45781j07440K65194N1760
$$ -78125 -115698 -88526 50258 77806 45501 136667 80528 -165253 -272693 -7499 44261
17904D4261P683k320J10623j26739k3319l1258j9199N0891R4111J8756r9394q0438
$$ 44261 51944 49624 160247 33508 10189 -21069 -40268 10623 104734 123490 24096 -56342
17892e6342O5098N6441p8619j22673J1171O5361r5683j23144m9242K25730J66576
$$ -56342 8756 65197 -13422 -136095 -124924 -59563 -155246 -278390 -327632 -101902 64674
17881F4674J0497k2195m7511O4112J33951P1518j89036j26801q184O9711n7161
$$ 64674 75171 52976 5465 69577 203528 275046 86010 -40791 -48975 20736 -36425
17870c6425m313K61944k6087r6796L0554j68213r3397J79081J22579l5733p9829
$$ -36425 -40738 221206 195119 98323 128877 -39336 -132733 46348 168927 133194 53365
17859E3365j06346j12987k1724J18303L12033o4042j77963j58651j2826j65495
$$ 53365 -52981 -165968 -187692 -69389 242644 178602 639 -158012 -170838 -336333
17849c36333k1375K631M4922J30822K64253R3287K2844J9930K2599r6960j22734
$$ -336333 -357708 -355077 -310155 -179333 84920 178207 201051 220981 243580 146620 23886
17838B3886n2757l9171j7592J11882L560q7524n9482J61230q292n9635J04109
$$ 23886 -28871 -68042 -85634 26248 29808 -57716 -117198 44032 35740 -23895 80214
17827H0214K8547r6054m5219r626k501k6954K3263j24043O5361M568j88115k0308
$$ 80214 108761 12707 -32512 -42138 -44639 -71593 -48330 -172373 -107012 -102444 -290559 -310867
17815c10867J72409J36418k6881m5392k103J5829O5228M9430p4316O6254m7243
$$ -310867 -138458 -2040 -28921 -74313 -76416 -60587 4641 54071 -20245 46009 -1234
17804a234o134n2961j27487j15992J66239K36395K64290l317j59972j86815J2714
$$ -1234 -7368 -60329 -187816 -303808 -137569 98826 363116 359799 199827 13012 25726
17793B5726J90038l6524k65871r1641k4192j67194J31924K19416J46617j60052
$$ 25726 215764 179240 -86631 -178272 -202464 -369658 -237734 -18318 128299 -31753
17783c1753q2731J75848k05834j0754L9319O7035o0825k90081j4731K72727K56323
$$ -31753 -114484 61364 -144470 -155224 -115905 -48870 -109695 -399776 -414507 -141780 114543
17772A14543N369n3434L3934Q8716p7265j30254J72156P0446j33963j26174M4486
$$ 114543 119912 66478 100412 189128 111863 -18391 153765 224211 90248 -35926 8560
17761H560O7117m0779p673r3065J10687Q5282j56979k28354m4085p4762m3212
$$ 8560 75677 34898 27225 -65840 44847 130129 -26850 -255204 -299289 -374051 -417263
17750d17263K03996J29238q845r0370q1712J69000M0691m8839p2853O896R6682
$$ -417263 -213267 -84029 -92874 -183244 -264956 -95956 -55265 -104104 -176957 -170061 -73379
17739g3379P5899k5029k3907p9094q4817J69697J01323K7154p7141n9430q370
$$ -73379 2520 -22509 -46416 -125510 -210327 -40630 60693 87847 10706 -48724 -57094
17728e7094J33269m3578j98866K7432O5007l0089j7504k1481p817R8636m1387
$$ -57094 76175 32597 -166269 -138837 -73830 -103919 -121423 -142904 -150721 -52085 -93472
17717i3472L4914m9012L4003P5483j4957k3810j93769j6418Q172M7878l1533L61486
$$ -93472 -58558 -107570 -73567 1916 -13041 -36851 -230620 -247038 -238866 -190988 -222521 138965
17705A38965O0203o7902r4557k61184j49194K39053J51764O3572M7165j84414
$$ 138965 199168 131266 36709 -224475 -373669 -134616 17148 80720 127885 -56529
17695e6529j11664j141J15422J47356Q1421M7216l9940p8589j98677o4437J20987
$$ -56529 -168193 -169334 -53912 93444 174865 222081 182141 103552 -95125 -159562 -38575
17684c8575J65153l662J14521j0901j78493J5274j27686j40468O2636P7905n927
$$ -38575 126578 122916 237437 226536 48043 63317 -64369 -204837 -142201 -64296 -70223
17673g0223k6980J36754J57417O0259j42001l4478j40702N8162J38747R5375p0240
$$ -70223 -97203 39551 196968 257227 115226 80748 -59954 -1792 136955 232330 162090
17662A62090P2009k3046l2514k2332k800K234j81274o2875J25428m3003j56147
$$ 162090 234099 211053 178539 156207 153407 155641 -25633 -88508 36920 -6083 -162230
17651a62230K7037l5074K4112R419N0258n6405n8031j56792n508O3023K01678
$$ -162230 -135193 -170267 -146155 -136736 -86478 -142883 -200914 -357706 -363214 -300191 -98513
17640i8513J70197l8456r5854r3013q006j0163p5868M2335J53940N6783k0832
$$ -98513 71684 33228 -62626 -155639 -163645 -173808 -249676 -207341 -53401 3382 -17450
17629a7450J77654q0505q2172k8010q1565q5904j51841L2266J50241j26797L0501
$$ -17450 160204 79699 -2473 -30483 -112048 -197952 -349793 -317527 -167286 -294083 -263582
17618b63582O155k3685Q2879J33895P9252M8755Q5697l2722j02925j35508K0707
$$ -263582 -257427 -281112 -198233 -64338 14914 63669 149366 116644 13719 -121789 -101082
17607a01082j52699Q2370K2914m1606j31429J8228J33856P7583P5130j2167r250
$$ -101082 -253781 -171411 -148497 -190103 -321532 -303304 -169448 -91865 -16735 -28902 -38152
17596c8152k9970J53312j25605k4744J05210k11444n1923J09115p1494N8475m196
$$ -38152 -68122 85190 -40415 -65159 40051 -171393 -223316 -114201 -185695 -127220 -131416
17585a31416j21518r385j9115J91117J08257m9189N5460J05199L2002R9921k8766
$$ -131416 -252934 -262319 -281434 -90317 17940 -31249 24211 129410 161412 261333 232567
17574B32567m6157n1978N4748J3683k8814q2956p3828k8901m857j90995P8037
$$ 232567 186410 134432 189180 202863 174049 91093 17265 -11636 -16493 -207488 -129451
17563a29451J58210J1142k40094o3075p0141m6155K63671l6263p5326J25696K1399
$$ -129451 28759 39901 -200193 -263268 -333409 -379564 -115893 -152156 -227482 -101786 -80387
17552h0387J60938J49105m9876K4030j06785k48889o4353k7740j41231j82987
$$ -80387 80551 229656 179780 203810 97025 -151864 -216217 -243957 -385188 -568175
17542e68175M0893J28377J96392J19024P0770J2088o9389L5095K6885n5462O8052
$$ -568175 -527282 -398905 -202513 -83489 -12719 -631 -70020 -34925 -8040 -63502 4550
17531D550J40743q9389k22136m5028P1614O5855m8476q7769j15679J43279J57807
$$ 4550 145293 55904 -166232 -211260 -139646 -73791 -122267 -210036 -325715 -182436 -24629
17520b4629J7151q6109j38573l0345J22313N3831r371P0995P7608n5855j6024
$$ -24629 -7478 -93587 -232160 -262505 -140192 -86361 -95732 -24737 52871 -2984 -19008
17509a9008l4718o0138j48018N3965J21303j4529L1006k3381j14555Q8112J1968
$$ -19008 -53726 -113864 -261882 -207917 -86614 -101143 -70137 -93518 -208073 -119961 -107993
17498a07993O689Q0857r1224J14050n8372j96098o8374J37909J71826J2345j08989
$$ -107993 -101304 -20447 -111671 2379 -55993 -252091 -320465 -182556 -10730 1615 -107374
17487a07374J14653J28505j7608Oj38763o6637j3337k1403N8857P5005K7151o1562
$$ -107374 7279 135784 118176 118182 -20581 -87218 -100555 -121958 -63101 11904 39055 -22507
17475b2507k22779P303p1035K5805J22479J31219J22760p9319o7607j05962l5367
$$ -22507 -245286 -237983 -309018 -283213 -160734 -29515 93245 13926 -53681 -159643 -195010
17464a95010m9815M6988M8811P4996j13174j569L1903P560L2137R2287R9706L2944
$$ -195010 -244825 -197837 -149026 -74030 -187204 -188773 -156870 -149310 -117173 -24886 74820 107764
17452A07764l9791p4423m4924Q9661O0325j43184j48057l371j47948j7408P9315
$$ 107764 67973 -6450 -51374 38287 98612 -44572 -192629 -196000 -343948 -361356 -282041
17441b82041J21493J25094J19684k3334j43744m5357j6236P7671m8634j57911
$$ -282041 -160548 -35454 84230 60896 -82848 -128205 -144441 -66770 -115404 -273315
17431b73315j79855k5849J12799O0777J89725J03307p6630J03632J63175j1570
$$ -273315 -453170 -479019 -366220 -305443 -115718 -12411 -89041 14591 177766 166196
17421A66196m204M8686m0073r782o8758j36205L2535K4136N1835M4284l5381n041
$$ 166196 161992 210678 170605 160823 92065 -44140 -11605 12531 64366 108650 73269 68228
17409F8228O8679j34911q8913k3532N4685J11564K6990n1406m1674j66508j14680
$$ 68228 136907 1996 -86917 -110449 -55764 55800 82790 31384 -10290 -176798 -291478
17398b91478L5418J66290Q795M4525J0537j20107j15869L7120J1236q2022J8331
$$ -291478 -256060 -89770 -80975 -36450 -25913 -146020 -261889 -224769 -213533 -295555 -277224
17387b77224J64085l1622J13500l5980n2302J60392K1936K7874k6953k2132j27330
$$ -277224 -113139 -144761 -31261 -67241 -119543 40849 62785 90659 63706 41574 -85756
17376h5756k17380J24438J39774j00204m4480q2232K13127K08726o3364L4235
$$ -85756 -303136 -178698 -38924 -139128 -183608 -265840 -52713 156013 92649 126884
17366A26884M8093P823p1764M6833j09513j50910J68354K96480m1693j21202o9435
$$ 126884 174977 182800 111036 157869 48356 -102554 65800 362280 320587 199385 129950
17355A29950j03831p537J53902O7288q8572o8015j34178p7415l1079M2192J9113
$$ 129950 26119 18582 172484 239772 151200 83185 -50993 -128408 -159487 -117295 -98182
17344i8182K6625j29332O3025J32985j9587l9871J05748N5934j1257j23733J4320
$$ -98182 -71557 -200889 -137864 -4879 -24466 -64337 41411 97345 86088 -37645 -23325
17333b3325o3220j94108J39550q0201o5308Q2756N3343l0826j4747J06631J75490
$$ -23325 -86545 -280653 -141103 -221304 -286612 -203856 -150513 -181339 -196086 -89455 86035
17322H6035o5214n3581n0346J2398K754l0853K603M5211o1124J00201O7393O2738
$$ 86035 20821 -32760 -83106 -70708 -67954 -98807 -96204 -50993 -112117 -11916 55477 118215
17310A18215K3231Q2177k0573j51027j02970J76633L00774k70602k13839M7798
$$ 118215 141446 223623 203050 52023 -50947 125686 426460 155858 -57981 -10183
17300a0183N4227J71441Q507p4671k53371l4299O8095Q4351o6722j17459l8002
$$ -10183 44044 215485 223992 149321 -104050 -138349 -70254 14097 -52625 -170084 -208086
17289b08086m197k78974j56992P8337J92288K33295O0251R0105N5423k05853j89202
$$ -208086 -212283 -491257 -648249 -569912 -377624 -144329 -84078 6027 61450 -144403 -333605
17278c33605J4965J63466Q1442J80170j0448j04773j3564J81498K86450j32737
$$ -333605 -318640 -155174 -73732 106438 95990 -8783 -22347 159151 445601 312864
17268C12864k90439j82026j5103M4184k7689Q518j43073m1869O7036K0751k5981
$$ 312864 22425 -159601 -174704 -130520 -158209 -149691 -292764 -334633 -267597 -246846 -272827
17257b72827r17K02577J48456J4474K3906m4497k9608r9983q4882J41843N5557
$$ -272827 -273744 -71167 77289 91763 115669 71172 41564 -58419 -143301 -1458 54099
17246E4099r3843j5716M2741K0363J944M2418j09676R256Q9879P7062k2228p7734
$$ 54099 -39744 -55460 -12719 7644 9588 52006 -57670 -48414 41465 118527 96299 18565
17234A8565J02156m8597j70048O6855M6683R2568R2030k4253N3812p904q2393
$$ 18565 120721 72124 -97924 -31069 15614 108182 200212 175959 229771 221867 139474
17223A39474m3978r6258r4096L4276M7800J02627r9620q9825L9842J94327j4271
$$ 139474 95496 -762 -94858 -60582 -12782 89845 -9775 -99600 -59758 134569 120298
17212A20298j05959o8202j25163Q7011j8648O761J60359K16809M4338O2306k6740
$$ 120298 14339 -53863 -179026 -92015 -110663 -103902 56457 273266 317604 379910 353170
17201C53170j68772q5307k3472m0151P5025J7828j3641O4664J04055k31902j26342
$$ 353170 184398 99091 75619 35468 110493 128321 114680 179344 283399 51497 -74845
17190g4845m3251Q5390K27824Q3729J40543k8016j79507j35188k705J58255M6893
$$ -74845 -118096 -32706 195118 278847 419390 391374 211867 76679 73974 232229 279122
17179B79122M6150k9766P7294j7441r4626j28120M684K11530K0780j72889j8476
$$ 279122 325272 295506 372800 355359 260733 132613 137297 348827 369607 196718 178242
17168A78242l4828j1567l49643r2126j04623K40663J75315j14491N2991R3026
$$ 178242 143414 131847 -217796 -309922 -414545 -173882 1433 -113058 -60067 32959
17158C2959J4076J81856J7158j0966P3821R8618K24136R4632j54925k21537l16990
$$ 32959 47035 228891 246049 235083 308904 407522 631658 726290 571365 349828 32838
17147C2838m5541K22344j00991j29836j57592N3538K7008O0205M051q4604p4158
$$ 32838 -12703 209641 108650 -21186 -178778 -125240 -98232 -38027 -33976 -118580 -192738
17136a92738O129Q2312n439k311O4863j64224J01548R9110J27646o7013K5056
$$ -192738 -186609 -104297 -109736 -112047 -47184 -211408 -109860 -10750 116896 49883 74939
17125G4939k1815l7530N6927n7906O574j3970L1090k9132p2485K3060R8856K3875
$$ 74939 53124 15594 72521 14615 21189 7219 38309 9177 -63308 -40248 58608 82483
17113H2483m8957j54750j59661j21706O7623J32946O7403m1283R6965j84586R8304
$$ 82483 33526 -121224 -280885 -402591 -334968 -202022 -134619 -175902 -78937 -263523 -165219
17102a65219J28269n344R4716J48735k36776j64668J51290P9120N8843J9974j11142
$$ -165219 -36950 -42294 52422 201157 -35619 -200287 -48997 30123 88966 108940 -2202
17091b202J43329P4221j45866j20309j89572J9534K10202j4473P6706r4814l42310
$$ -2202 141127 215348 69482 -50827 -240399 -220865 -10663 -25136 51570 -43244 -385554
17080c85554j955J28140J37294J3389o3502M2492j23218J22041J98992M5562j72354
$$ -385554 -387509 -259369 -122075 -108686 -172188 -129696 -252914 -130873 68119 113681 -58673
17069e8673j15066j3029J99956M6535j1371m4245j41189m8467j54693L6463J84517
$$ -58673 -173739 -186768 13188 59723 48352 4107 -137082 -185549 -340242 -303779 -119262
17058a19262K68916K6204p0060O1459n1076j6446l3795j66152j18901l0908J43310
$$ -119262 149654 175858 105798 167257 116181 99735 65940 -100212 -219113 -250021 -106711
17047a06711J5332l142J50568m3136N804J1553j9658O328q0070J39422R6546m382
$$ -106711 -91379 -94521 56047 12911 18715 30268 10610 16938 -63132 76290 172836 168454
17035A68454j15071l014J34641m6214m8127j92378P7014M5745j5518N9969j6535
$$ 168454 53383 50369 185010 138796 90669 -101709 -24695 21050 5532 65501 48966
17024D8966j7821R8263l4884k83968l908M450m4579n0492L2072o0484J30432J45416
$$ 48966 31145 129408 94524 -189444 -193352 -188902 -233481 -283973 -251901 -312385 -181953 -36537
17012c6537k1517M3886m3469l4999J08066J28642J90552K3856j17284n2168k1773
$$ -36537 -58054 -14168 -57637 -92636 15430 144072 334624 358480 241196 189028 167255
17001A67255o9601l7979M7426m3579r4893j03628j4101R1155K53611J09382M5816
$$ 167255 97654 59675 107101 63522 -31371 -134999 -149100 -57945 195666 305048 350864
16990C50864k54871k33869J63591Q0367o2540P9521o4387j43087j49518j41304
$$ 350864 95993 -137876 25715 106082 43542 123063 58676 -84411 -233929 -375233
16980c75233j06086O2513J81486j2892o1617R6392L01859J38472O9184n4950k49484
$$ -375233 -481319 -418806 -237320 -250212 -311829 -215437 86422 224894 294078 239128 -10356
16969a0356q7253J47659J30346j53697L7777J17622K8612p3823p3665O5650P0634
$$ -10356 -97609 50050 180396 26699 64476 182098 210710 136887 63222 128872 199506
16958A99506R3192n8798n3261p1552J8786p9297L5627j57264p4194M6623K2241
$$ 199506 292698 233900 180639 109087 127873 48576 84203 -73061 -147255 -100632 -78391
16947g8391J4229j70319q7889R9961Q248P5486J48578N5182p2343n7461k0038
$$ -78391 -64162 -234481 -322370 -222409 -214161 -138675 9903 65085 -7258 -64719 -84757
16936h4757l152n7939j28346j22288J24843J7004J53964L1765Q2553L7453n7028
$$ -84757 -87909 -145848 -274194 -396482 -271639 -254635 -100671 -68906 13647 51100 -5928
16925e928J16804L9965Q4458r2366j40919Q598j01499j67344K38684K32028m8865
$$ -5928 110876 150841 235299 142933 2014 10612 -90887 -258231 -19547 212481 163616
16914A63616q3039M5052k0939r0427K9928Q6233M5390J58051L2043j97980n1582
$$ 163616 80577 125629 104690 14263 44191 130424 175814 333865 365908 167928 116346
16903A16346J7951j36209l2391N7604n4619q132k17281j48146L7676P5165n9329
$$ 116346 134297 -1912 -34303 23301 -31318 -39450 -256731 -404877 -367201 -292036 -351365
16892c51365k2386o300K29060P2827K1540L7657r5519O9976J44300M238j0653
$$ -351365 -373751 -380051 -150991 -78164 -56624 -18967 -114486 -44510 99790 104028 93375
16881I3375L7560J11451M0032p8169L5687m2880k9492j41069r9246j76670N9764
$$ 93375 130935 242386 282418 204249 239936 197056 167564 26495 -72751 -249421 -189657
16870a89657J26444n0695L5739R1527j59466j53178o0489o1875K08880J96252
$$ -189657 -63213 -113908 -78169 13358 -146108 -299286 -359775 -421650 -212770 -16518
16860a6518j8720N5519p9969m0513K21033J07766j57928j00439k9615L6641P1669
$$ -16518 -35238 20281 -59688 -100201 120832 228598 70670 -29769 -59384 -22743 48926
16849D8926N6397o2685n0505o3305K7731M2575n0882k5356M7622l2186j35581
$$ 48926 105323 42638 -7867 -71172 -43441 -866 -51748 -77104 -29482 -61668 -197249
16838a97249j04168p0615O2152K16176J81680J11800j31325o7049J1016J25747
$$ -197249 -301417 -372032 -309880 -93704 87976 199776 68451 1402 12418 138165
16828A38165Q26r1489q867j736j56457j05525j08457M8901J77156N147L8916j20737
$$ 138165 138991 47502 38635 36899 -119558 -225083 -333540 -284639 -107483 -102336 -63420 -184157
16816a84157j27840P2596o3575k095J3591m1778J24641P3291k0814l3905J2338
$$ -184157 -311997 -239401 -302976 -305071 -291480 -333258 -208617 -135326 -156140 -190045 -177707
16805a77707K9420J61885J07985o4362p1728K1093j45421j33597P8669R4754j12335
$$ -177707 -148287 13598 121583 57221 -14507 6586 -138835 -272432 -193763 -99009 -211344
16794b11344j95058L7431N5985M8055K07804R0730J06694o1561j66207j41152
$$ -211344 -406402 -368971 -312986 -264931 -57127 33603 140297 78736 -87471 -228623
16784b28623P6768j41214p2713L5221K69550K23446l4531Q7799L0440k9971k8266
$$ -228623 -151855 -293069 -365782 -330561 -61011 162435 127904 215703 246143 216172 187906
16773A87906N8892q331l21261k2202l8660l6641p0728r5025J23063P2788N3637
$$ 187906 246798 238467 -82794 -104996 -143656 -180297 -251025 -346050 -222987 -150199 -96562
16762i6562M6039J42501L9255N2415j81223j30737N7062J76446o9690j29600L3041
$$ -96562 -50523 91978 131233 183648 2425 -128312 -71250 105196 35506 -94094 -61053
16751f1053j52983K4485Q9429Q4108K7607p7979O4246j07982k3883M2343J32562
$$ -61053 -214036 -189551 -100122 -16014 11593 -66386 -2140 -110122 -134005 -91662 40900
16740D0900p3659j89814p88J48910M3736p6915p7816L3858m8065j7772N2533n4870
$$ 40900 -32759 -222573 -223361 -74451 -30715 -107630 -185446 -151588 -199653 -217425 -164892 -219762
16728b19762J13229J79834q0157o0897J04098j70528m0902N3744j14288M9928
$$ -219762 -106533 73301 -6856 -67753 36345 -134183 -175085 -121341 -235629 -185701
16718a85701j23011r1690J28473J51080k02053k11373M5025m9574Q3868j9589
$$ -185701 -308712 -400402 -271929 -120849 -322902 -534275 -489250 -538824 -454956 -474545
16708d74545J40262J14759K2101j09572l9701r184M2027J78190n6434l0066O174
$$ -474545 -334283 -219524 -197423 -306995 -346696 -355880 -313853 -135663 -192097 -222163 -215989
16697b15989l1351k7438N0731o4488k7119Q6481q6078r437R1476j5286j063P3523
$$ -215989 -247340 -274778 -224047 -288535 -315654 -229173 -315251 -324688 -233212 -248498 -249561 -176038
16685a76038J68513J1298j23799n2378Q7598J3907j25110J09383k5402k8477R2895
$$ -176038 -7525 3773 -120026 -172404 -84806 -70899 -196009 -86626 -112028 -140505 -47610
16674d7610J74133l4996o7085j42150m129N2482m0341O9097J50360K04875n8254
$$ -47610 126523 91527 24442 -117708 -121837 -69355 -109696 -40599 109761 314636 256382
16663B56382k19372j41513n3333k8179k6824J41780M0857j4102N8709R565J7278
$$ 256382 37010 -104503 -157836 -186015 -212839 -71059 -30202 -44304 14405 23970 41248
16652D1248j1274k4149m6604m2241K4073L4697p711j37029k3669j85666q0394
$$ 41248 29974 5825 -40779 -83020 -58947 -24250 -31961 -168990 -192659 -378325 -458719
16641d58719R9011K12457J51779M7626k8245o2315j65247J2643q3546q9251J14482
$$ -458719 -359708 -147251 4528 52154 23909 -38406 -203653 -191010 -274556 -363807 -249325
16630b49325J49470O3039J37785m3541q9705j62472m6168Q8925N9497J32444J4459
$$ -249325 -99855 -36816 100969 57428 -32277 -194749 -240917 -151992 -92495 39949 54408
16619E4408p1283j11641r247l6931l0754J18855J61198k9367j40392j06084M1238
$$ 54408 -16875 -128516 -137763 -174694 -205448 -86593 74605 45238 -95154 -201238 -160000
16608a60000R2823L7192M9679k5186j19086p9560n4621P6075P8934k810K5000
$$ -160000 -67177 -29985 19694 -5492 -124578 -204138 -258759 -182684 -103750 -106560 -81560
16597h1560j9882o0860l9529j16889l5126P7324J2943j11454K2769j1684J69732
$$ -81560 -101442 -162302 -201831 -318720 -353846 -276522 -263579 -375033 -352264 -363948 -194216
16586a94216J65632j44083P1473J3284p8549Q072J04843K0112K842n5899k51865
$$ -194216 -28584 -172667 -101194 -87910 -166459 -158387 -53544 -33432 -30590 -86489 -338354
16575c38354j69311o078M8619O6018j1055Q5422J31557O5875R5194l8984J86457
$$ -338354 -507665 -513743 -465124 -399106 -410161 -324739 -193182 -127307 -32113 -71097 115360
16564A15360k4697k8748J10251j9774j36947r5118P6594P3694o8611j40146o0607
$$ 115360 90663 61915 172166 152392 15445 -79673 -3079 70615 2004 -138142 -198749
16553a98749n4192N3669J19848M9050r4122M9219J0181K3110J02599q8053p5087
$$ -198749 -252941 -199272 -79424 -30374 -124496 -75277 -65096 -41986 60613 -27440 -102527
16542a02527P05K11630r9723K351m3461P7792K3347j07539q5187P8805j20401
$$ -102527 -101822 109808 10085 12436 -31025 46767 70114 -37425 -122612 -43807 -164208
16531a64208k6773n9613M566J3784j4074J33101J52097n9460M1680k0969J20843
$$ -164208 -190981 -250594 -246028 -232244 -246318 -113217 38880 -20580 21100 131 120974
16520A20974R6679m1956J24913M2847j50721k31189k36360l1680J47307J9715
$$ 120974 217653 175697 300610 343457 192736 -38453 -274813 -306493 -159186 -139471
16510a39471j42961l821J99416J31722M1586j77331n8675k0867l2063j8071L8528
$$ -139471 -282432 -286253 -86837 44885 86471 -90860 -149535 -170402 -202465 -220536 -182008
16499a82008N7987J2178r0132l8944j93662J20161J90195J2674p7319r6777j5339
$$ -182008 -124021 -111843 -201975 -240919 -434581 -314420 -124225 -111551 -188870 -285647 -300986
16488c00986J3396l9798q411j5955J47181J6599l8193N3303J0250J1415K2284
$$ -300986 -287590 -327388 -335799 -351754 -204573 -187974 -226167 -172864 -162614 -151199 -128915
16477a28915l5915Q322r104L4657J42952l2189K2049J522p8903R6156k8586k09179
$$ -128915 -164830 -156508 -165612 -130955 11997 -20192 1857 3379 -75524 20632 -7954 -217133
16465b17133L9667K26902J37857l5326j81265n9922j19116q7237q9789j1275Q4188
$$ -217133 -177466 49436 187293 151967 -29298 -89220 -208336 -295573 -385362 -396637 -312449
16454c12449J29625N3979n3371j0931o423m7165Q243N4210k1740m0614M9866m7565
$$ -312449 -182824 -128845 -182216 -193147 -199570 -246735 -238492 -184282 -206022 -246636 -196770 -244335
16442b44335L0821P678q6289k2961m1070J56956J48410J6374r6047R6540q726
$$ -244335 -213514 -205836 -292125 -315086 -356156 -199200 -50790 -34416 -130463 -33923 -42649
16431d2649l8026k23197R4513K09419l9315j08879J46528J25633r9867J5338j46151
$$ -42649 -80675 -303872 -209359 60 -39255 -148134 -1606 124027 24160 39498 -106653
16420a06653j29216K2149P4518o3804Q7593O4987j77851o7449R4093K4975J12521
$$ -106653 -235869 -213720 -139202 -203006 -115413 -50426 -228277 -295726 -201633 -176658 -64137
16409f4137l1888O1236q5172q9265j25667J08275J31389o8456m8572R2011J93588
$$ -64137 -96025 -34789 -119961 -209226 -334893 -226618 -95229 -163685 -212257 -120246 73342
16398G3342j99289m1543J40079J23239j00795r2133M096p7600j41758N348N567
$$ 73342 -125947 -167490 -27411 95828 -4967 -97100 -93004 -170604 -312362 -307014 -301447
16387c01447l1631P1417J60555J92421L7261j16328m5299Q032o4484k504P8887
$$ -301447 -333078 -261661 -101106 91315 128576 12248 -33051 -25019 -89503 -92007 -13120
16376a3120P4645k589n9821L5543K2412K2443Q8175p4218L4981m369k95658j24661
$$ -13120 61525 58936 -885 34658 57070 79513 167688 93470 128451 124082 -171576 -296237
16364b96237k46077J8088K0379J96214K8302l7828J36793J10480n0572Q7674r7020
$$ -296237 -542314 -524226 -503847 -307633 -279331 -317159 -180366 -69886 -120458 -32784 -129804
16353a29804p8374l2331r6403J26388N1995J2656l4412J3827K41615J54858k19261
$$ -129804 -208178 -240509 -336912 -210524 -158529 -145873 -180285 -166458 75157 230015 10754
16342A0754k82227N5036O3808M5316j20497j89827L5021m1335L1620N8185l228
$$ 10754 -271473 -216437 -152629 -107313 -227810 -417637 -382616 -423951 -392331 -334146 -337374
16331c37374j85099M4788K47013J19231j00813Q1909J6898Q142m8703p2539J11953
$$ -337374 -522473 -477685 -230672 -111441 -212254 -130345 -113447 -105305 -154008 -226547 -114594
16320a14594L9541l6860p4679J1657n028J39249J55713R1397j9620m5309j59298
$$ -114594 -75053 -111913 -186592 -174935 -179963 -40714 114999 206396 186776 141467 -17831
16309a7831j8992O623M0224r1417j99982p7612O1022M8077N7450P8368P698K65161
$$ -17831 -36823 -30200 10024 -81393 -281375 -358987 -297965 -249888 -192438 -114070 -106372 158789
16297A58789J61519n5684p3327j61264J9826O6952N4722k39463j99467K318L8553
$$ 158789 320308 264624 191297 30033 49859 116811 171533 -67930 -267397 -265079 -226526
16286b26526J60712R6252n6951J71158j57985j25491K600J39549q219q8741j15191
$$ -226526 -65814 30438 -26513 144645 -13340 -138831 -136231 3318 -4901 -93642 -208833
16275b08833J14673N0880J1316j08727L8746K220q5161j33758L096L2479P3121
$$ -208833 -94160 -43280 -31964 -140691 -101945 -99725 -184886 -318644 -315548 -283069 -209948
16264b09948J6403j48080l1921p0487R6226J09169r8199J80555J41708q5991Q3569
$$ -209948 -193545 -341625 -373546 -444033 -347807 -238638 -336837 -156282 -14574 -100565 -16996
16253a6996J11551K1212j22423j5476k9645r3036j00058J2136J15991J10798o7955
$$ -16996 94555 115767 -6656 -22132 -51777 -144813 -244871 -232735 -116744 -5946 -73901
16242g3901p6710k0770m6973J28350O1851o1012K4808m2300P1773J13914M6268
$$ -73901 -150611 -171381 -218354 -90004 -28153 -89165 -64357 -106657 -34884 79030 125298
16231A25298j59723N0712n1365j13636N6807R1155R0680k4175j44954j43311J60757
$$ 125298 -34425 16287 -35078 -148714 -91907 -752 89928 65753 -79201 -222512 -61755
16220f1755j1286r6461K22589K0812q5583J20231j05504j74870J9127K01421K6114
$$ -61755 -73041 -169502 53087 73899 -11684 108547 3043 -171827 -152700 48721 74835
16209G4835j72201Q924o4253j21061O5046Q5602p0617M8993J70542n9859o6870
$$ 74835 -97366 -88442 -152695 -273756 -208710 -123108 -193725 -144732 25810 -34049 -100919
16198a00919M9798J29628P4024j09167P203K9034n2268r9977o1170R853m8195
$$ -100919 -51121 78507 152531 43364 50567 79601 27333 -72644 -133814 -123961 -172156
16187a72156J38479Q5872p9492O7758J00528m7421r8159q6703j6496q8646J16270
$$ -172156 -33677 52195 -27297 40461 140989 93568 -4591 -91294 -107790 -196436 -80166
16176h0166J30920K9816k47173p8013J00613J58200L2889j35747J91516J3233
$$ -80166 50754 80570 -166603 -244616 -144003 14197 47086 -88661 102855 116088
16166A16088Q9174j11066o9660q1872j51020J84916N9257k08000r626o3351M7983
$$ 116088 205262 94196 24536 -57336 -208356 -23440 35817 -172183 -181809 -245160 -197177
16155a97177J53715j36467p1580L3968J54493R1566j34606j95291K8433J78531
$$ -197177 -43462 -179929 -251509 -217541 -63048 28518 -106088 -301379 -272946 -94415
16145i4415R5146k43169j33643P0809L8555l4757j18478J19909J36690P7124L0476
$$ -94415 731 -242438 -376081 -305272 -266717 -301474 -419952 -300043 -163353 -86229 -55753
16134e5753N6508j36809j385P8532m9497P4366K8809K2624K3782j6917n9345n2840
$$ -55753 755 -136054 -137439 -58907 -108404 -34038 -5229 17395 41177 24260 -35085 -87925
16122h7925k6648j7695N2930n3208j17652l4850j3284O926P0243M9444J27110
$$ -87925 -114573 -132268 -79338 -132546 -250198 -285048 -298332 -291406 -221163 -171719 -44609
16111d4609r3018o7991r663J01044M7790l3065n0108j09613o9540R601P5024M1290
$$ -44609 -137627 -205618 -215281 -114237 -66447 -99512 -149620 -259233 -328773 -319172 -244148 -202858
16099b02858k1383j00298p0249J15407k6302J7045J34564p0064j02464K6472P4168
$$ -202858 -224241 -324539 -394788 -279381 -305683 -288638 -154074 -224138 -326602 -300130 -225962
16088b25962K44650K3252j70691j2549K9617q8633K4765J85846k0544O4393J02050
$$ -225962 18688 41940 -128751 -141300 -111683 -200316 -175551 10295 -10249 54144 156194
16077A56194K3794j73446m6836K47309m1971r923k4481o6799m4324J90523P2837
$$ 156194 179988 6542 -40294 207015 165044 155121 130640 63841 19517 210040 282877
16066B82877p0345K8785o4452p4368j19991j02854j1131j45264r4005L1182J70709
$$ 282877 212532 241317 176865 102497 -17494 -120348 -131479 -276743 -370748 -339566 -168857
16055a68857K0452J26630o3903m0082J7879j4945m64l6007J1229q7017m2914J5860
$$ -168857 -148405 -21775 -85678 -125760 -107881 -122826 -123290 -159297 -148068 -235085 -277999 -262139
16043b62139J3481J0315j74677o5973J35462P5192j84592n9435J80245J10795
$$ -262139 -248658 -238343 -413020 -478993 -343531 -268339 -452931 -512366 -332121 -221326
16033b21326M6206n7181q8377k4245N9797O9518O2145l5907q1415j1768P6803
$$ -221326 -175120 -232301 -320678 -344923 -285126 -215608 -153463 -189370 -270785 -282553 -205750
16022b05750L8370J03733o724n5895n6368j38889m1813R1026o5875j39125P3443
$$ -205750 -167380 -63647 -70371 -126266 -182634 -321523 -363336 -272310 -338185 -477310 -403867
16011d03867R1634J5511N0574J10709J24406O3758j18257m1753O3694r4192j28648
$$ -403867 -312233 -296722 -246148 -135439 -11033 52725 -65532 -107285 -43591 -137783 -266431
16000b66431m5108J48274m8017j58234J91022P6350P630L9534K8302P37O6338
$$ -266431 -311539 -163265 -211282 -369516 -178494 -102144 -94514 -54980 -26678 -25941 40397
15989D0397M6794r5017N7782O197k9684Q853r2291j04956l5320R0312N8142k9350
$$ 40397 87191 -7826 49956 56153 26469 35322 -56969 -161925 -197245 -106933 -48791 -78141
15977g8141l4631O5560J70553J57023p2157k28903n9070j69982R5120O9135J450
$$ -78141 -112772 -47212 123341 280364 208207 -20696 -79766 -249748 -154628 -85493 -84043
15966h4043l9006M4441j15631N7424q5195j60033L2983J57583J17671l9342N363
$$ -84043 -123049 -78608 -194239 -136815 -222010 -382043 -349060 -191477 -73806 -113148 -107785
15955a07785K9016o1554J8451j8874m6291L5421p5412j00322j0617J55299Q2588
$$ -107785 -78769 -140323 -121872 -140746 -187037 -151616 -227028 -327350 -337967 -182668 -100080
15944a00080k7083o6984M6289J0675J10117P1169P740l5077n4443l9090o4969
$$ -100080 -127163 -194147 -147858 -137183 -27066 44103 51843 16766 -37677 -76767 -141736
15933a41736j31389M2116R7994J67882J0049q5415j93783r6462N7691n9598l7259
$$ -141736 -273125 -231009 -133015 34867 44916 -40499 -234282 -330744 -273053 -332651 -369910
15922c69910J38080R8852r5444j6434Q099J82342K13272R9768l6756p7319o8110
$$ -369910 -231830 -132978 -228422 -244856 -236757 -54415 158857 258625 221869 144550 76440
15911G6440Q5475j87159j40522J61222P4785j05551n3558m0740P958n4506j24255
$$ 76440 161915 -25244 -165766 -4544 70241 -35310 -88868 -129608 -121650 -176156 -300411
15900c00411n0805m4834l096J12530K46833R3137Q0504j14869M4307m5062p7444
$$ -300411 -351216 -396050 -399146 -286616 -39783 53354 133858 18989 63296 18234 -59210
15889e9210o1467N0167l3116P0436Q4021r7290r5187q7665L1414J31545p4684
$$ -59210 -120677 -70510 -103626 -33190 50831 -46459 -141646 -229311 -197897 -66352 -141036
15878a41036k03145J61740O3961m9623j3238J19077J55814L8468j01757O719J55352
$$ -141036 -344181 -182441 -118480 -168103 -181341 -62264 93550 132018 30261 36980 192332
15867A92332l176j16995j22524n5475q990M1835r3392L4329J2984J5863N8435
$$ 192332 189156 72161 -50363 -105838 -114828 -72993 -166385 -132056 -119072 -103209 -44774
15856d4774j04463Q3983J89720L4809j18569j71990J2335n5051j62824j27205
$$ -44774 -149237 -65254 124466 159275 40706 -131284 -118949 -174000 -336824 -464029
15846d64029J63338J8060P1715O2336l4394M4312J26359l9348l7141m4631N0833
$$ -464029 -300691 -282631 -210916 -148580 -182974 -138662 -12303 -51651 -88792 -133423 -82590
15835h2590k4784l6163J04590k50669j88269J62237J11174L682j13695j39516
$$ -82590 -107374 -143537 -38947 -289616 -477885 -315648 -204474 -200792 -314487 -454003
15825d54003N5203J53908K5734J23062J12788m3204N0578r7435k6539j64776K7910
$$ -454003 -398800 -244892 -219158 -96096 16692 -26512 24066 -73369 -99908 -264684 -236774
15814b36774L4800J01109J8057M082q6003M1223K1953R1251m4743n5583o529j17241
$$ -236774 -201974 -100865 -82808 -78726 -164729 -123506 -101553 -10302 -55045 -110628 -117157 -234398
15802b34398k9075O6483o578j1931K6268N077M7626q9392J08143Q4458j05716
$$ -234398 -263473 -196990 -203568 -215499 -189231 -184154 -136528 -225920 -117777 -33319 -139035
15791a39035n5308Q5375N1527j86749R4628P3426n5242P6811J74682r80n935k31699
$$ -139035 -194343 -108968 -57441 -244190 -149562 -76136 -131378 -54567 120115 119135 113200 -118499
15779a18499j23612l4300j16169P9637q1412J26287Q7138j7550o4944M0631n4558
$$ -118499 -242111 -276411 -392580 -312943 -394355 -268068 -180930 -198480 -263424 -222793 -277351
15768b77351l6240K7774K24176J5348o4324K2663J5629O2135j01520M2395k1501
$$ -277351 -313591 -285817 -61641 -46293 -110617 -87954 -72325 -10190 -111710 -69315 -90816
15757i0816L1801N0871m4078J37340P7394J2628j29911o5829j26261q8650J15499
$$ -90816 -59015 -8144 -52222 85118 162512 175140 45229 -20600 -146861 -235511 -120012
15746a20012J68748k8525j89474j0285l7439K18205J35554r4507k1923j01200
$$ -120012 48736 20211 -169263 -179548 -216987 1218 136772 42265 20342 -80858
15736h0858j07180J26672K2220p6662Q2625j16091R4897M663r2031j18044o2583
$$ -80858 -188038 -61366 -39146 -115808 -33183 -149274 -54377 -49714 -141745 -259789 -322372
15725c22372J51687n302k5178Q1661m1245m8827J4040L3372K1127Q1369j32283
$$ -322372 -170685 -175987 -201165 -119504 -160749 -209576 -195536 -162164 -141037 -59668 -191951
15714a91951j5551J74303N2050Q0213l4660n2265l2152j2928r4616o8357J03022
$$ -191951 -207502 -33199 18851 99064 64404 12139 -20013 -32941 -127557 -195914 -92892
15703i2892J59906L389j31141j27829K5405J21745O7076j21532J8665N8242J3294
$$ -92892 67014 70403 -60738 -188567 -163162 -41417 25659 -95873 -77208 -18966 -5672
15692e672j61055j34790Q7721J06492n0303J9320N6038j4168p1392p1374o7040
$$ -5672 -166727 -301517 -213796 -107304 -157607 -138287 -82249 -96417 -167809 -239183 -306223
15681c06223j02911J1386N9888P2297K07935J35521n782j91194j05094M9244J5976
$$ -306223 -409134 -397748 -337860 -265563 -57628 77893 72111 -119083 -224177 -174933 -158957
15670a58957l701J12910L0186n6516P2741K0852K0549k31J7216j88571j43377
$$ -158957 -162658 -49748 -19562 -76078 -3337 17515 38064 37833 55049 -133522 -276899
15659b76899p7345j77584j71988J26702K38937K11465j4106j7472k3815o8127
$$ -276899 -354244 -531828 -703816 -577114 -338177 -126712 -140818 -158290 -182105 -250232
15649b50232J1670j02332N5936O6134J10123k347l4503o0498O5494N8476l4937
$$ -250232 -238562 -340894 -284958 -218824 -108701 -111048 -145551 -206049 -140555 -82079 -117016
15638a17016k92545J6058K27537o4768K3169k7325M8578N0573J59742l8362r2403
$$ -117016 -409561 -393503 -165966 -230734 -207565 -234890 -186312 -135739 24003 -14359 -106762
15627a06762J8331N5705J25962Q515p5675M9022J34409K4252M3577o0601k21273
$$ -106762 -88431 -32726 93236 101751 26076 75098 209507 233759 277336 216735 -4538
15616d538j14731R9962j50114O441K8194L7647l7611N7420j53573n6305J72585
$$ -4538 -119269 -19307 -169421 -162980 -134786 -97139 -134750 -77330 -230903 -287208 -114623
15605a14623J68928M3583o0213j75244J04557Q2540j28690o1212M873N3264J56056
$$ -114623 54305 97888 37675 -137569 -33012 49528 -79162 -140374 -135501 -82237 73819
15594G3819j43828N2091O4370J40376J25839j0282j79319k16168k7482J12582
$$ 73819 -70009 -17918 46452 186828 312667 302385 123066 -93102 -120584 -8002
15584h002j12797j00072J16975K348N0845K3351P2435r0808l1192m764O911K518
$$ -8002 -120799 -220871 -103896 -101548 -50703 -27352 45083 -45725 -76917 -81681 -74770 -72252
15572g2252o7875k42330L3764J56261J53289m3362J4265l7922k2892M4117K1779
$$ -72252 -140127 -382457 -348693 -192432 -39143 -82505 -68240 -106162 -129054 -84937 -63158
15561f3158j58262L8047J67370J05221l1318J2958j24495j26485J38701k5984
$$ -63158 -221420 -183373 -16003 89218 57900 70858 -53637 -180122 -41421 -67405
15551f7405k88507q8233l7348j8073J84907K75505J06533l4559j64008j1763P3358
$$ -67405 -355912 -444145 -481493 -499566 -314659 -39154 67379 32820 -131188 -142951 -69593
15540f9593R8818j9254J7642n5068n5866R2833J952n7609K5025M72o6630M6782
$$ -69593 29225 9971 27613 -27455 -83321 9512 11464 -46145 -21120 -20648 -87278 -40496
15528d0496Q3179M3483k8166j36857j74895N8148j78566q1615m1207n7744J66487
$$ -40496 42683 86166 58000 -78857 -253752 -195604 -374170 -455785 -496992 -554736 -388249
15517c88249J70230J6996k4227l5051M0088K7948N9186j08743p2259J50650J93941
$$ -388249 -218019 -201023 -225250 -260301 -220213 -192265 -133079 -241822 -314081 -163431 30510
15506C0510q1438l8924K7334J05539n8227R258N8386J45131q2806k1030J4339
$$ 30510 -50928 -89852 -62518 43021 -15206 -5948 52438 197569 114763 93733 108072
15495A08072p7641n1689J2178j59337r7797J26871M6242O8267N6505N3238J30156
$$ 108072 30431 -21258 -9080 -168417 -266214 -139343 -93101 -24834 31671 84909 215065
15484B15065O4722j12264j13569q4620K5215j0163j05900j69837K9099l9085J66567
$$ 215065 279787 167523 53954 -30666 -5451 -15614 -121514 -291351 -262252 -301337 -134770
15473a34770J49093j11102j56953M4912k2913j38R1619R7241j01772K5662N5098
$$ -134770 14323 -96779 -253732 -208820 -231733 -231871 -140252 -43011 -144783 -119121 -64023
15462f4023j9179k9157L8193n476j61863K3917J08862K04570J32668J32737o1159
$$ -64023 -83202 -112359 -74166 -79642 -241505 -217588 -108726 95844 228512 361249 300090
15451C00090q3431k25822j49712K2633O9077O5559M2925p9174q1528L301P0389
$$ 300090 216659 -9163 -158875 -136242 -67165 -1606 41319 -37855 -119383 -116082 -45693
15440d5693L7901O1640p2882j93149j01435j0947q71q7048j50384J09905O4366
$$ -45693 -7792 53848 -19034 -212183 -313618 -324565 -325436 -412484 -562868 -452963 -388597
15429c88597J873O2573L7822O7443Q1330J96129J8774k6460K8840Q3360j63872
$$ -388597 -386724 -324151 -286329 -218886 -137556 58573 77347 50887 79727 163087 -785
15418g85k42982m3026M1197J23471N9851K20507K3450p6950n5198n7749j09204
$$ -785 -243767 -286793 -245596 -122125 -62274 158233 181683 104733 49535 -8214 -117418
15407a17418m1791J42393o1937o9866P4488O2310J002J08256P5365K8462r1345
$$ -117418 -159209 -16816 -78753 -148619 -74131 -11821 -10819 97437 172802 201264 109919
15396A09919k31296K3833M6651J9366O9771m35j54287j36418L7346K30048L8279
$$ 109919 -121377 -97544 -50893 -31527 38244 37809 -116478 -252896 -215550 14498 52777
15385E2777k13378j16876J22640O2339k7935n5817P6324N9635r5702N6943j2693
$$ 52777 -160601 -277477 -154837 -92498 -120433 -176250 -99926 -40291 -135993 -79050 -91743
15374i1743j1787p3787j3002P3820J97594K6544r8552r6343j32385m0928L2202
$$ -91743 -103530 -177317 -190319 -116499 81095 107639 9087 -87256 -219641 -260569 -228367
15363b28367J15654O1641J57820m1295r7623o4657O7285r7889m3768L3093J82171
$$ -228367 -112713 -51072 106748 65453 -32170 -96827 -29542 -127431 -171199 -138106 44065
15352D4065q9915j05100J01820J72684j15809j16943K00124K4204q3286j02200
$$ 44065 -45850 -150950 -49130 123554 7745 -109198 90926 115130 31844 -70356
15342g0356n2770K15453N8546j79209O1989N1229r5048m0646n7954R9659k5503
$$ -70356 -123126 92327 150873 -28336 33653 84882 -10166 -50812 -108766 -9107 -34610
15331c4610p5797Q5245M6603j7183l1616j30227n5736P2247J6579m6577p0364
$$ -34610 -110407 -25162 21441 4258 -27358 -157585 -213321 -141074 -124495 -171072 -241436
15320b41436J03841L3483k885q0955j6574N7976j47282o0815K0678J53113K05685
$$ -241436 -137595 -104112 -106997 -187952 -204526 -146550 -293832 -354647 -333969 -180856 24829
15309B4829M0735M7472L6171j22178q9540q3817K9085j0848l5571L6358L7233
$$ 24829 65564 113036 149207 27029 -62511 -146328 -117243 -128091 -163662 -127304 -90071
15298i0071N9681j18621j65964J66975J22743J6250p7589k8370j026J57882P5712
$$ -90071 -30390 -149011 -314975 -148000 -25257 -9007 -86596 -114966 -115992 41890 117602
15287A17602r6871j41907P8559K21255l8419k65459j15983N0981J32509K04837
$$ 117602 20731 -121176 -42617 178638 140219 -125240 -241223 -190242 -57733 147104
15277A47104j2549q2459L4956K8440n8686k46865q1141p297J54200O9649J4320
$$ 147104 134555 52096 87052 115492 56806 -190059 -271200 -278497 -124297 -54648 -40328
15266d0328J18239J79604J66290j27888l55388p4293J83790L3405j08394K7865
$$ -40328 77911 257515 423805 295917 -59471 -133764 50026 83431 -24963 2902
15256B902l9136j661K8329J27382o2151j29712r8592m4031L7517J35504N3634
$$ 2902 -36234 -37895 -9566 117816 55665 -74047 -172639 -216670 -179153 -43649 9985
15245I985o0940M0634k2517l8750K17159K11328k16986j13082n3922M6879r4609
$$ 9985 -50955 -10321 -32838 -71588 145571 356899 139913 26831 -27091 19788 -74821
15234g4821r9616j15047q387J46666j54694k78726Q8185N3385N7070n952k9070
$$ -74821 -174437 -289484 -297871 -151205 -305899 -584625 -496440 -443055 -385985 -391937 -421007
15223d21007J19794K82155j3257j95153l327R7041l0786J43448K5941j72424j2038
$$ -421007 -301213 -19058 -32315 -227468 -230795 -133754 -164540 -21092 4849 -167575 -179613
15212a79613N0957R0204K9292J01359J78026j5557J489q6249j22746k64570j00017
$$ -179613 -128656 -38452 -9160 92199 270225 254668 256157 169908 47162 -217408 -317425
15201c17425J24941J40209q700j49662R5891L2185R2884P2634J6037j02742M7896
$$ -317425 -192484 -52275 -60975 -210637 -114746 -82561 10323 82957 98994 -3748 44148
15190D4148j69547j05836Q3927K6607K5425N9261M6895l7465L622P0621o4600
$$ 44148 -125399 -231235 -147308 -120701 -95276 -36015 10880 -26585 -22963 47658 -16942
15179a6942k61961Q0669M9663O5967K27330n0020n6977K0750J75175j95804j26985
$$ -16942 -278903 -198234 -148571 -82604 144726 94706 37729 58479 233654 37850 -89135
15168h9135k6720J42156J12415J42105k553m5680j09985k46271j6692m6415j49211
$$ -89135 -115855 26301 138716 280821 278268 232588 122603 -123668 -140360 -186775 -335986
15157c35986N4537Q3502N2499O8933n1776n6274l3039P1661M8600l0461Q7156
$$ -335986 -281449 -197947 -145448 -76515 -128291 -184565 -217604 -145943 -97343 -127804 -40648
15146d0648r9888o425J36794L7559R5354j28802j40643J25967J12720K0989k4962
$$ -40648 -140536 -146961 -10167 27392 122746 -6056 -146699 -20732 91988 112977 88015
15135H8015j060k3858j87848j29985k3563k5285O6420L1593R4579J99318m9742
$$ 88015 86955 63097 -124751 -254736 -278299 -303584 -237164 -205571 -110992 88326 38584
15124C8584k43627o7536R790k3583P3724K2680j21206R5967J12023j0322j1733
$$ 38584 -205043 -272579 -262789 -286372 -212648 -189968 -311174 -215207 -103184 -113506 -125239
15113a25239m9743N368J21766J76900k30575m0603M9946J0960K6408p4276L4676
$$ -125239 -174982 -169614 -47848 129052 -101523 -142126 -92180 -81220 -54812 -129088 -94412
15102i4412M9402l4986j29138j25681J66183J4422J334J15153o6892K32r1345
$$ -94412 -45010 -79996 -209134 -334815 -168632 -154210 -152876 -37723 -104615 -104383 -195728
15091a95728o117P3930J9892l3191J42019Q3426k39662n9672m3856J66376j898
$$ -195728 -201845 -127915 -108023 -141214 805 84231 -155431 -215103 -258959 -92583 -94481
15080i4481k41576k2181J29682J96845L2369o89n124j05766l2645j31317N8548
$$ -94481 -336057 -358238 -228556 -31711 658 -31 -5155 -110921 -143566 -274883 -216335
15069b16335K19269m8437O189L9406N5128M2989j71439n9998K8992r5946j63316
$$ -216335 2934 -45503 -39314 92 55220 98209 -73230 -133228 -104236 -200182 -363498
15058c63498j0531J15648M0805k07431p9103M4032K15281J69440o963J60505P041
$$ -363498 -374029 -258381 -217576 -425007 -504110 -460078 -244797 -75357 -82320 78185 85226
15047H5226p3398J17401j51939q6837k6034m3621P9129K3838p4636l1228r7716
$$ 85226 11828 129229 -22710 -109547 -135581 -179202 -100073 -76235 -150871 -182099 -279815
15036b79815n6781Q7806J78475R7836N1961j58619M6600l3257j19687r9214o8607
$$ -279815 -336596 -248790 -70315 27521 79482 -79137 -32537 -65794 -185481 -284695 -353302
15025c53302J31002J05738K08153R4134k24590N5500r892k79583o3523N0768j3565
$$ -353302 -222300 -116562 91591 185725 -38865 16635 6743 -272840 -336363 -285595 -299160
15014b99160l873J0600Q6395J44970m717K1959k7303P928R3800j94959m1632n1154
$$ -299160 -303033 -292433 -206038 -61068 -65785 -43826 -71129 -63201 30599 -164360 -205992 -257146
15002b57146J00353l6194k4607J6023J11777N255M645J10020M9573n9901j51032
$$ -257146 -156793 -192987 -217594 -201571 -89794 -84539 -79894 30126 79699 19798 -131234
14991a31234M0701K0293m7607J0726J5914m4650R6562r9936J6958K88680J49842
$$ -131234 -90533 -70240 -117847 -107121 -91207 -135857 -39295 -139231 -122273 166407 316249
14980C16249j89636J1684P1202J30707L339r2238k00603k24556o3252m7644p0756
$$ 316249 126613 138297 209499 340206 343545 251307 50704 -173852 -237104 -284748 -355504
14969c55504J55816J51103J20854L0860L8216k8997j27210J84048R8707j91002
$$ -355504 -199688 -48585 72269 103129 141345 112348 -14862 169186 267893 76891
14959G6891p9506p3034j36828m1396L7796P133Q6726l8702M9298o7144J5865J39285
$$ 76891 -2615 -75649 -212477 -253873 -216077 -208944 -122218 -160920 -111622 -178766 -162901 -23616
14947b3616J2482r9106r3581J78913J79800o3148j77865q4104j11578p9602j4220
$$ -23616 -11134 -110240 -203821 -24908 154892 91744 -86121 -170225 -281803 -361405 -375625
14936c75625J30259N9620Q789J09063r1366j33571r9596j53059P9283J02630N7013
$$ -375625 -245366 -185746 -176957 -67894 -159260 -292831 -392427 -545486 -466203 -363573 -306560
14925c06560K03663J11371P8129L8495k59444j47501J85424j2725k73970q0703
$$ -306560 -102897 8474 86603 125098 -134346 -281847 -96423 -109148 -383118 -463821
14915d63821J53853K78704J56157k04558r0622o3935j1389K5254J60972N2592
$$ -463821 -309968 -31264 124893 -79665 -170287 -234222 -245611 -220357 -59385 -6793
14905f793j40458o7472o0245p1000Q881Q7365p1237k5528R186l4377J64775j08898
$$ -6793 -147251 -214723 -274968 -345968 -337087 -249722 -320959 -346487 -337301 -371678 -206903 -315801
14893c15801q163L9947j6135R0624N5788J149J34373K5398q9792N5723M4708K916
$$ -315801 -323964 -284017 -300152 -209528 -153740 -152591 -18218 7180 -82612 -26889 17819 20735
14881B0735P2503o6262K5350n6003q8873J15858J51817l4717k4563k05770j44631
$$ 20735 93238 26976 52326 -3677 -92550 23308 175125 140408 115845 -89925 -234556
14870b34556o5356m1595j50794l3684L4410L051J07639K5337o99J20932J77975
$$ -234556 -299912 -341507 -492301 -525985 -491575 -488524 -380885 -355548 -356247 -235315 -57340
14859e7340K1949n2454j41853O3427N2269j76956n4321N1302K61219K68994q900
$$ -57340 -35391 -87845 -229698 -166271 -114002 -290958 -345279 -293977 -32758 236236 227336
14848B27336j06368K3721R6832l3939j63758o562J82905L651j30928j61103k52710
$$ 227336 120968 144689 241521 207582 43824 37262 220167 223818 92890 -68213 -320923
14837c20923p256o8624J38849Q7942N4011Q7345p9418j46473J3984K04550O2637
$$ -320923 -328179 -396803 -257954 -170012 -116001 -28656 -108074 -254547 -240563 -36013 26624
14826B6624j57792j63821K22903o0121q6353k7808j53960k5118J41411J83720
$$ 26624 -131168 -294989 -72086 -132207 -218560 -246368 -400328 -425446 -284035 -100315
14816a00315J29028n9339j7379R5223j06435K682n5436K9505J28026q7738p657
$$ -100315 28713 -30626 -48005 47218 -59217 -56535 -111971 -82466 45560 -42178 -49835
14805d9835O7956m0339r5860j06981M9961M8890K2039j42783j31033L5172M5317
$$ -49835 18121 -22218 -118078 -225059 -175098 -126208 -104169 -246952 -377985 -342813 -297496
14794b97496M8657J71931J09490Q7861j7768M4517j19400j210l6167O3487j42240
$$ -297496 -248839 -76908 32582 120443 102675 147192 27792 26582 -9585 53902 -88338
14783h8338o7243p1087q125j04211J38830J17032p2697J5232J9596O1278n0470
$$ -88338 -155581 -226668 -234793 -339004 -200174 -83142 -155839 -140607 -121011 -59733 -110203
14772a10203p9036N5604P2616p0173J5646K4336M4035O6604O5892J09369L2572
$$ -110203 -189239 -133635 -61019 -131192 -115546 -91210 -47175 19429 85321 194690 227262
14761B27262j72870m3990J22820p9342K5374q9197j77163O4174L1124N3069N5689
$$ 227262 54392 10402 133222 53880 79254 -9943 -187106 -122932 -91808 -38739 16950
14750A6950k4566p3144l2069L7134L3933L4099L7545j89104j9014P4852Q077q882
$$ 16950 -7616 -80760 -112829 -75695 -41762 -7663 29882 -159222 -178236 -103384 -95307 -104189
14738a04189K1990M7212J20622j54061r270L8730m6045j6775k2242m4008j57645
$$ -104189 -82199 -34987 85635 -68426 -77696 -38966 -85011 -101786 -124028 -168036 -325681
14727c25681n3682l3006J54646J97838j06694m9272N9849M3496m3790k1086K1451
$$ -325681 -379363 -412369 -257723 -59885 -166579 -215851 -156002 -112506 -156296 -177382 -155931
14716a55931j34995j45361m2619M5543M5703n3474J25056K19691N7643k7161o0364
$$ -155931 -290926 -436287 -478906 -433363 -387660 -441134 -316078 -96387 -38744 -65905 -126269
14705a26269k3567j51588p3658Q3039p2532p3655J11908K64406O2579j29060l7014
$$ -126269 -149836 -301424 -375082 -292043 -364575 -438230 -326322 -61916 663 -128397 -165411
14694a65411K0685M8344M6902J1318R4404m0346j3686j54796n3449J23248K3663
$$ -165411 -144726 -96382 -49480 -38162 56242 15896 2210 -152586 -206035 -82787 -59124
14683e9124j03510K372L3789J31660K65579Q829k29200m1372n2208o334j09828
$$ -59124 -162634 -160262 -126473 5187 270766 279595 50395 9023 -43185 -49519 -159347
14672a59347O0231J87907k1991l6952l953q6414Q2568J0883l2342M2034R2624
$$ -159347 -99116 88791 66800 29848 25895 -60519 22049 32932 590 42624 135248
14661A35248j87570n6240l0633Q646m5586L3900R9131n8929j04590j13754k995
$$ 135248 -52322 -108562 -139195 -130549 -176135 -142235 -43104 -102033 -206623 -320377 -323372
14650c23372K650r9066J21901J08893O1057j54653L9137J60634K01312J14895
$$ -323372 -320722 -419788 -297887 -188994 -127937 -282590 -243453 -82819 118493 233388
14640B33388k3866o7913J07938N4199j50510l0246K2791R618l1273j50775p6997
$$ 233388 209522 141609 249547 303746 153236 122990 145781 155399 124126 -26649 -103646
14629a03646J66784N5088L1692j11249j5358o5468P8537K7964j19989K6523K11358
$$ -103646 63138 118226 149918 38669 23311 -42157 36380 64344 -55645 -29122 182236
14618A82236j79980j87886k5837J69734J34967K6370r5047j11082J57701p3786
$$ 182236 2256 -185630 -211467 -41733 93234 119604 24557 -86525 71176 -2610
14608b610k156p483o5369j29686Q6403j31191k11407m531M16718J60398j0799
$$ -2610 -4766 -12249 -77618 -207304 -120901 -252092 -463499 -468030 -51312 109086 98287
14597I8287j4155O8355J0641r1178l6841l4635j68089j34550P1609J1333K8422
$$ 98287 84132 152487 163128 71950 35109 474 -167615 -302165 -230556 -219223 -190801
14586a90801J80162J33773L8913l7592k924K0486j2455o7799j1985q384l6763
$$ -190801 -10639 123134 162047 124455 121531 142017 129562 61763 49778 41394 4631
14575D631j20635O3096j28222L65j01418O2372N9500o3452l5744J38869O0439
$$ 4631 -116004 -52908 -181130 -180765 -282183 -219811 -160311 -223763 -259507 -120638 -60199
14564f0199j39148m901Q2615l5622K271P6276j87148J26096j011R466P5956K4493
$$ -60199 -199347 -204248 -121633 -157255 -154984 -78708 -265856 -139760 -140771 -131305 -55349 -30856
14552c0856J46615j4659j5237j52543K1251j1908j43391j58681J36617j8545Q9505
$$ -30856 115759 101100 85863 -66680 -45429 -57337 -200728 -359409 -222792 -241337 -151832
14541a51832R7421P9895P0521j32753N9888J65502n496q8493j33060l9331J6792
$$ -151832 -54411 25484 96005 -36748 23140 188642 183146 94653 -38407 -77738 -60946
14530f0946r9212q0609o8885k6421J15609J44921N2597n1899j79545p4864O5892
$$ -60946 -160158 -240767 -309652 -336073 -220464 -75543 -22946 -74845 -254390 -329254 -263362
14519b63362q5518J99982M4298J4513R7282Q3449o7253m2690j0141J20892N7671
$$ -263362 -348880 -148898 -104600 -90087 7195 90644 23391 -19299 -29440 91452 149123
14508A49123j18994J22796n4093m9413j4199r6315l7031m4606k6634J12149J06389
$$ 149123 30129 152925 98832 49419 35220 -61095 -98126 -142732 -169366 -57217 49172
14497D9172j8030l1080m9452r8837J12525J17510j12360j20797J2623J71075O5353
$$ 49172 31142 62 -49390 -148227 -35702 81808 -30552 -151349 -138726 32349 97702
14486I7702j77757r273R779l4613K8989o0483j7214R9621p2687Q2596P4360K874
$$ 97702 -80055 -89328 -79549 -114162 -85173 -145656 -162870 -63249 -135936 -53340 21020 23894
14474B3894J4686j10628k24126o992M8229p711N083Q4033O0478Q2456J07514Q4785
$$ 23894 38580 -72048 -296174 -303166 -254937 -262648 -257565 -173532 -113054 -30598 76916 161701
14462A61701m5786J10173O074o6286q0239j85407N3904N4150J2865M7241m3092
$$ 161701 115915 226088 232162 165876 85637 -99770 -45866 8284 21149 68390 25298
14451B5298j27119k5397q9300j8005J00556n173r3602j04374q0381J62762K80549
$$ 25298 -101821 -127218 -216518 -234523 -133967 -139140 -232742 -337116 -417497 -254735 25814
14440B5814P1172m915l1763p1208j18649L2241n6406J56323K30949M4851l3889
$$ 25814 96986 92071 60308 -10900 -129549 -97308 -153714 2609 233558 278409 244520
14429B44520L0239o4764j00446k48540p4433R333R7653J85922K66047j73556k54695
$$ 244520 274759 209995 109549 -138991 -213424 -204091 -106438 79484 345531 171975 -82720
14418h2720q7393j14686k0476L6016P2326j0592m8025P9219n1628r4278R055l5059
$$ -82720 -170113 -284799 -305275 -269259 -196933 -207525 -255550 -176331 -227959 -322237 -313182 -348241
14406c48241l1189N0551O6018J61914J12981J2045P9108L5032j15462j51012j6782
$$ -348241 -379430 -328879 -262861 -100947 12034 24079 103187 138219 22757 -128255 -145037
14395a45037J09126O6475J879q4619j16881j58200P6466K23840O1411n7050k5685
$$ -145037 -35911 30564 32443 -52176 -169057 -327257 -250791 -26951 34460 -22590 -48275
14384d8275R6007p6682j80694J46o1055O3033J15869k3499j74673l6330J22148
$$ -48275 47732 -28950 -209644 -209498 -270553 -207520 -91651 -115150 -289823 -326153 -204005
14373b04005l3824L0250J57636M9146q3574Q5000j8923K0632J5253j2397J3302
$$ -204005 -237829 -207579 -49943 -797 -84371 629 -18294 2338 17591 5194 18496
14362A8496J03095j30258o2212J27032k8657j62855J10640J29684q5741r8754
$$ 18496 121591 -8667 -70879 56153 27496 -135359 -24719 104965 19224 -79530
14352g9530l5593L7207J75840q7331N2523q3688r1756p0522J0501K0766O9274
$$ -79530 -115123 -77916 97924 10593 63116 -20572 -112328 -182850 -172349 -151583 -82309
14341h2309J11053k6547r1151k13364L719Q2781J36751J38483K43677r5750j51634
$$ -82309 28744 2197 -88954 -302318 -298599 -215818 -79067 59416 303093 207343 55709
14330E5709j17747j04950J70065J42296q1798K726q0703j19328k58650j26450
$$ 55709 -62038 -166988 3077 145373 63575 66301 -14402 -133730 -392380 -518830
14320e18830K25678K07697K00144P0656r1046l05838j16692J41470O9562j22509
$$ -518830 -293152 -85455 114689 185345 94299 -211539 -328231 -186761 -117199 -239708
14310b39708J3786o1068k4244J0844l8640O7339L01162J50375k52814j32253J04284
$$ -239708 -225922 -286990 -311234 -300390 -339030 -271691 29471 179846 -72968 -205221 -100937
14299a00937N8199K9521K7090j1470j10935J22141R8318r2183k8288j0338J3639
$$ -100937 -42738 -13217 13873 2403 -108532 13609 111927 19744 -8544 -18882 -5243
14288e243o0547q0036j39482q6901J27128j9516L4286P6852J29314K17512J27997
$$ -5243 -65790 -145826 -285308 -372209 -245081 -264597 -230311 -153459 -24145 193367 321364
14277C21364J9735j92177k20476j6573J24352J14597J29841k12188l10871J59239
$$ 321364 341099 148922 -71554 -88127 36225 150822 280663 68475 -242396 -83157
14267h3157J8485P1026j08159q7544r8745J46977R9935l2603q9241J88654J14672
$$ -83157 -64672 6354 -101805 -189349 -288094 -141117 -41182 -73785 -163026 25628 140300
14256A40300J50021j03322k9237J0212k9131k5103J19187J0857p6697m8772Q2414
$$ 140300 290321 186999 157762 167974 138843 113740 232927 243784 167087 118315 200729
14245B00729j26087j13902j58071r4696Q1830J53347K8256j45723N5428j92959
$$ 200729 74642 -39260 -197331 -292027 -210197 -56850 -28594 -174317 -118889 -311848
14235c11848K8463K30481J15047N0282j54740p5895r3205M0165N9306J1372k9007
$$ -311848 -283385 -52904 62143 112425 -42315 -118210 -211415 -171250 -111944 -100572 -129579
14224a29579J51001R8713l4978j95060j65930M6163J74115k1267o0074Q0981N4195
$$ -129579 21422 120135 85157 -109903 -275833 -229670 -55555 -76822 -136896 -55915 -1720
14213a720L4502j2557m1180m3483j49984L1142J04295L3056O1121J7254Q0545
$$ -1720 32782 20225 -20955 -64438 -214422 -183280 -78985 -45929 15192 32446 112991
14202A12991j17615L7172m1261K2206Q970j1369O1249Q7245l4748j74864j36090
$$ 112991 -4624 32548 -8713 13493 22463 11094 72343 159588 124840 -50024 -186114
14191a86114m4198J28859j7874j80293Q0490J91873J80110N2878k59193p639N9995
$$ -186114 -230312 -101453 -119327 -299620 -219130 -27257 152853 205731 -53462 -61101 -1106
14180a106m9233k25084N0067l0263M2704R0930J58523j26214O0259R4087n7025
$$ -1106 -50339 -275423 -225356 -255619 -212915 -121985 36538 -89676 -29417 64670 7645
14169G645R3015o2675p9657L3643m0400j18958K4081R3813J72497l583j03526
$$ 7645 100660 37985 -41672 -8029 -48429 -167387 -143306 -49493 123004 119421 15895
14158A5895n62J318j38317k165q0524j55627k9583N4392R3454M3185J00468J56003
$$ 15895 15333 16651 -121666 -123831 -204355 -359982 -389565 -335173 -241719 -198534 -98066 57937
14146E7937L3268k2131p7422j09838k3225J21516o1845J94900J63669O2623k25142
$$ 57937 91205 69074 -8348 -118186 -141411 -19895 -81740 113160 276829 339452 114310
14135A14310j21444K7093N2229m7806j14057J02463q0523O8923J04636J23432
$$ 114310 -7134 19959 72188 24382 -89675 12788 -67735 1188 105824 229256
14125B29256M7328q702k3646j34684N952L2538M8009m0176r3765L5364P7645N8838
$$ 229256 276584 267882 244236 109552 115504 148042 196051 155875 62110 97474 175119 233957
14113B33957j64430j63234q9173l1975r3527J4093n9779J6175j170J56689J52189
$$ 233957 69527 -93707 -182880 -214855 -308382 -294289 -354068 -337893 -339063 -182374 -30185
14102c0185Q3870q208n0080R5104K7101M089P9523J21089n6570j17003o5740J88788
$$ -30185 53685 45477 -4603 90501 117602 121691 201214 322303 265733 148730 82990 271778
14090B71778J21311j52844j60845r9527j2847j20806K3842J46475n83n4437j77812
$$ 271778 393089 240245 79400 -20127 -32974 -153780 -129938 16537 15954 -38483 -216295
14079b16295l0060J1679n3005N8254K2953O7166j52K7659j9645o8790j57807k5103
$$ -216295 -246355 -234676 -287681 -229427 -206474 -139308 -139460 -111801 -131446 -200236 -358043 -383146
14067c83146J40693k8740L6943j26005J52683J33742P4680j01822l4784j4597
$$ -383146 -242453 -271193 -234250 -360255 -207572 -73830 850 -100972 -135756 -150353
14057a50353l2203j69249K171P1944J37021j57268J31386L20116q9234n1699j25182
$$ -150353 -182556 -351805 -349634 -277690 -140669 -297937 -166551 153565 64331 12632 -112550
14046a12550k770m5767j08191m1664J38379J21989k5447j08124k1673J13071L4480
$$ -112550 -115320 -161087 -269278 -310942 -172563 -50574 -76021 -184145 -205818 -92747 -58267
14035e8267l959J16747l4863j14682j75859K8556J27309J28177K4627J1242M5240
$$ -58267 -62226 54521 19658 -95024 -270883 -242327 -115018 13159 37786 49028 94268
14024I4268r2744o4674J44219O7l36612R9522O5417m0416Q2489O3304N8687L5597
$$ 94268 1524 -63150 81069 81136 -255476 -155954 -90537 -130953 -48464 14840 73527 109124
14012A09124M7359k5501l4984j5089P7384M9562L3503q8544l999j65062m2146
$$ 109124 156483 130982 95998 80909 158293 207855 241358 152814 148815 -16247 -58393
14001e8393L7052o0751j60651r9092J20830J51188m1835l9965J73425K8697L9075
$$ -58393 -21341 -82092 -242743 -341835 -221005 -69817 -111652 -151617 21808 50505 89580
13990H9580o1353j47493m2837L1927m7903P7157K37182O335k25716m6632j7382
$$ 89580 28227 -119266 -162103 -130176 -178079 -100922 136260 142595 -83121 -129753 -147135
13979a47135J58853J7854p9873j26795Q8689j0463N5801q7343l7433J16935P0549
$$ -147135 11718 29572 -50301 -177096 -88407 -98870 -43069 -130412 -167845 -50910 19639
13968A9639N0806j6990p8011K65800j203j16426Q2886L9752n6412j15063J1991
$$ 19639 70445 53455 -24556 241244 240041 123615 206501 246253 189841 74778 86769
13957H6769q3525m6466p6427P176o95j976o8545p6410k0643J7572K25990J41545
$$ 86769 3244 -43222 -119649 -112473 -113168 -115144 -183689 -260099 -280742 -263170 -37180 104365
13945A04365l1863k34454k06862q5568l7320p2531J31477J25425J83107N1243
$$ 104365 72502 -161952 -368814 -454382 -491702 -564233 -432756 -307331 -124224 -72981
13935g2981j01880q9635J11670J87639O8062k1971l5680M2111m7060k26494J07717
$$ -72981 -174861 -264496 -152826 34813 102875 80904 45224 87335 40275 -186219 -78502
13924g8502N0233J600m5035J37711j10129l83412j33392J62281K29271J45698
$$ -78502 -28269 -26669 -71704 66007 -44122 -427534 -560926 -398645 -169374 -23676
13914b3676K2998k0701P3172k2035j21329N3900L9662j71720P4091M8839L5988
$$ -23676 -678 -21379 51793 29758 -91571 -37671 1991 -169729 -95638 -46799 -10811
13903a0811m6423o0819o7557Q1625K53636J10315j27698o9744J8975p2986K7163
$$ -10811 -57234 -118053 -185610 -103985 149651 259966 132268 62524 81499 8513 35676
13892C5676o7978l9217P3612n9322j17042J56384J35424o23j91784n1519O0214
$$ 35676 -32302 -71519 2093 -57229 -174271 -17887 117537 116914 -74870 -126389 -66175
13881f6175Q9970J70843j36528r8685j37878J25897J38179j5871j72026P0596
$$ -66175 23795 194638 58110 -40575 -178453 -52556 85623 69752 -102274 -31678
13871c1678J20004r7392J36680p6946k5918k7531r489j4852L1544j17482r4503
$$ -31678 88326 -9066 127614 50668 24750 -2781 -12270 -27122 4422 -113060 -207563
13860b07563J63311J17406j22840j09217P5875l0697L6233p710K6119j15968o1799
$$ -207563 -44252 73154 -49686 -158903 -83028 -113725 -77492 -85202 -59083 -175051 -236850
13849b36850j20869J50078J77793k7098l0835p2222J4170K14423L7658o944Q9977
$$ -236850 -357719 -207641 -29848 -56946 -87781 -160003 -145833 68590 106248 99304 189281
13838A89281j13154J3729k34550k03195j02950N4308R5668K50837J31661R3340
$$ 189281 76127 89856 -144694 -347889 -450839 -396531 -300863 -50026 81635 174975
13828A74975J50264n3013o954j91155j21368J39513J11080k2405r0216p5265j1799
$$ 174975 325239 272226 265272 74117 -47251 92262 203342 180937 90721 15456 3657
13817C657j22464J23920J62785M7954k9019r4903j36217O1173J10634o0408K6660
$$ 3657 -118807 5113 167898 215852 186833 91930 -44287 16886 127520 67112 93772
13806I3772n5223M7829n9682j13519J98036L3640j33617m3182k15447N1985J9867
$$ 93772 38549 86378 26696 -86823 111213 144853 11236 -31946 -247393 -195408 -175541
13795a75541M470L3223P7532O1447R7882M0674q0991M9676J22322k7117R3186
$$ -175541 -171071 -137848 -60316 1131 99013 139687 58696 108372 230694 203577 296763
13784B96763j2369p6841L8370l1873j20170j12326j01405p9535J45476P895r1256
$$ 296763 284394 207553 245923 214050 93880 -18446 -119851 -199386 -53910 -46015 -137271
13773a37271j257L3337m7347l3690Q6847O5852J0188L4489j24646k79383n036
$$ -137271 -138528 -105191 -152538 -186228 -99381 -33529 -23341 11148 -113498 -392881 -397917
13762c97917J58796Q9767J03960J06971M3484o8862J16273N501q8926j7111O6971
$$ -397917 -239121 -149354 -45394 61577 105061 36199 152472 157973 69047 51936 118907
13751A18907N6039o6967r2004j02645j8578l4099m1213Q3399J00375R7963o674
$$ 118907 174946 107979 15975 -86670 -105248 -139347 -180560 -97161 3214 101177 94503
13740I4503Q9396N6006k66790j07899o4887r3794J53954J5458p8675R111K344
$$ 94503 183899 239905 -26885 -134784 -199671 -293465 -139511 -124053 -202728 -193617 -191273
13729a91273M0758j28558k02332J30849O6021q4471k6548M9747J76788R7037J14326
$$ -191273 -150515 -279073 -481405 -350556 -284535 -369006 -395554 -345807 -169019 -71982 42344
13718D2344n8860n3206p345L1704n3820m3976N4285J94300M0207o1403q2447k9197
$$ 42344 -16516 -69722 -77067 -45363 -99183 -143159 -88874 105426 145633 84230 1783 -27414
13706b7414K6915j34444k01065P0116J13110K67012L3910j6285j91959k44973
$$ -27414 -499 -134943 -336008 -265892 -152782 114230 148140 131855 -60104 -305077
13696c05077R9529J10658J23546n3310o6643K4287m0270J00316K3045L5371q5789
$$ -305077 -205548 -94890 28656 -24654 -91297 -67010 -107280 -6964 16081 51452 -34337
13685c4337j55259L1102O5210l9852n5000O9224J45892J38229l8214j94412o5859
$$ -34337 -189596 -158494 -93284 -133136 -188136 -118912 26980 165209 126995 -67417 -133276
13674a33276K43459J62691K920r9877j5307l5610m864L4738j03101Q835K08012
$$ -133276 110183 272874 275794 175917 160610 125000 120136 154874 51773 60608 268620
13663B68620j06504k92205Q8050J49579P3759q460P7501o2905q7146l8492j44957
$$ 268620 162116 -130089 -42039 107540 181299 172839 250340 187435 100289 61797 -83160
$$ [...]
##END NTUPLES=NMR SPECTRUM
##END=
