##TITLE=Analysis number 330032
Compound Code cc 66810
Book Reference 553/20/1
Project Code adrs
Chemist Name simons
##JCAMPDX= 6.0         $$ Bruker NMR JCAMP-DX V2.0
##DATA TYPE= NMR SPECTRUM
##DATA CLASS= NTUPLES
##ORIGIN= Bruker BioSpin GmbH
##OWNER= nmr
$$ XWIN-NMR		Version 3.5
$$ Mon Oct 22 12:39:59 2007 GMT Daylight Time (UT+1h)  MAYBRIDGE\nmr@NMR_250MHZ
##.OBSERVE FREQUENCY= 250.131544655141
##.OBSERVE NUCLEUS= ^1H
##.ACQUISITION MODE= SIMULTANEOUS (DQD)
##.ACQUISITION SCHEME= undefined
##.AVERAGES= 16
##.DIGITISER RES= 18
##SPECTROMETER/DATA SYSTEM= dpx250
##.PULSE SEQUENCE= zg30
##.SOLVENT NAME= CDCl3
##.SHIFT REFERENCE= (INTERNAL, CDCl3, 0, 16.4501)
##AUDIT TRAIL= $$ (NUMBER, WHEN, WHO, WHERE, WHAT)
$$ ##TITLE= Audit trail, XWIN-NMR		Version 3.5
$$ ##JCAMPDX= 5.01
$$ ##ORIGIN= Bruker BioSpin GmbH
$$ ##OWNER= nmr
$$ C:\u/data/dgb/nmr/ADRS/1030/pdata/1/auditp.txt
$$ ##AUDIT TRAIL=  $$ (NUMBER, WHEN, WHO, WHERE, WHAT)
(   1,<2007-10-22 12:39:21.12 +100>,<MAYBRIDGE\nmr>,<NMR_250MHZ>,
      <created by zg, POWCHK disabled, PULCHK disabled
       configuration hash MD5:
       76 6E 9A 78 1E 09 19 81 EC 84 63 8F B0 6A 59 2D
       data hash MD5: 64K
       5C EF E8 26 1A 3D D0 C7 2C E2 01 F1 9F 88 F8 B1>)
(   2,<2007-10-22 12:39:38.13 +100>,<MAYBRIDGE\nmr>,<NMR_250MHZ>,
      <Start of raw data processing
       ef LB = 0.3 FT_mod = 6 PKNL = 1 SI = 32K 
       data hash MD5: 32K
       67 2E 56 93 86 C1 87 6C DD 9C D3 3F A2 62 DE 18>)
(   3,<2007-10-22 12:39:43.21 +100>,<MAYBRIDGE\nmr>,<NMR_250MHZ>,
      <apk 
       data hash MD5: 32K
       7D D7 62 BA D2 CC 55 F3 B9 B8 B4 73 16 37 33 10>)
(   4,<2007-10-22 12:39:44.73 +100>,<MAYBRIDGE\nmr>,<NMR_250MHZ>,
      <abs ABSG = 5 
       data hash MD5: 32K
       00 C8 EA AA 7F F5 A9 01 B4 E2 25 2E B3 49 C2 18>)
$$ ##END=
$$ 
$$ hash MD5
$$ 46 A4 0E 82 7C 82 C4 95 D1 A5 D2 2E B0 10 39 AE
##$RELAX= 
##$RELAX= 
##$RELAX= 
##$RELAX= 
##$RELAX= 
##$RELAX= 
##$RELAX= 
$$ Bruker specific parameters
$$ --------------------------
##$DU= <C:\u>
##$EXPNO= 1030
##$NAME= <ADRS>
##$PROCNO= 1
##$TYPE= <nmr>
##$USER= <dgb>
##$AMP= (0..31)
100 100 100 100 100 100 100 100 100 100 100 100 100 100 100 100 100 100 
100 100 100 100 100 100 100 100 100 100 100 100 100 100 
##$AQSEQ= 0
##$AQ_mod= 3
##$AUNM= <au_zg>
##$AUTOPOS= <25 >
##$BF1= 250.13
##$BF2= 250.13
##$BF3= 250.13
##$BF4= 250.13
##$BF5= 500.13
##$BF6= 500.13
##$BF7= 500.13
##$BF8= 500.13
##$BYTORDA= 1
##$CFDGTYP= 0
##$CFRGTYP= 5
##$CHEMSTR= <none>
##$CNST= (0..31)
1 1 145 1 1 1 1 1 1 1 1 1 1 1 1 1 1 1 1 1 1 1 1 1 1 1 1 1 1 1 1 1 
##$CPDPRG= <>
##$CPDPRG1= <>
##$CPDPRG2= <>
##$CPDPRG3= <>
##$CPDPRG4= <mlev>
##$CPDPRG5= <mlev>
##$CPDPRG6= <mlev>
##$CPDPRG7= <mlev>
##$CPDPRG8= <mlev>
##$CPDPRGB= <>
##$CPDPRGT= <>
##$D= (0..31)
0 1 0 0 0 0 0 0 0 0.06 0 0 0 0 0 0 0.0002 0 0 0 0 0 0 0 0 0 0 0 0 0 0 
0 
##$DATE= 1193053159
##$DBL= (0..7)
120 120 120 120 120 120 120 120 
##$DBP= (0..7)
150 150 150 150 150 150 150 150 
##$DBP07= 0
##$DBPNAM0= <>
##$DBPNAM1= <>
$$ [...]
##$SUBNAM7= <"">
##$SUBNAM8= <"">
##$SUBNAM9= <"">
##$SW= 20.6930455092707
##$SWIBOX= (0..15)
0 0 3 0 0 0 0 0 0 0 0 0 0 0 0 0 
##$SW_h= 5175.983436853
##$TD= 65536
##$TD0= 1
##$TE= 296.16
##$TE2= 300
##$TE3= 300
##$TEG= 300
##$TL= (0..7)
0 120 120 120 120 120 120 120 
##$TP= (0..7)
150 150 150 150 150 150 150 150 
##$TP07= 0
##$TPNAME0= <>
##$TPNAME1= <>
##$TPNAME2= <>
##$TPNAME3= <>
##$TPNAME4= <>
##$TPNAME5= <>
##$TPNAME6= <>
##$TPNAME7= <>
##$TPOAL= (0..7)
0.5 0.5 0.5 0.5 0.5 0.5 0.5 0.5 
##$TPOFFS= (0..7)
0 0 0 0 0 0 0 0 
##$TUNHIN= 0
##$TUNHOUT= 0
##$TUNXOUT= 0
##$USERA1= <user>
##$USERA2= <user>
##$USERA3= <user>
##$USERA4= <user>
##$USERA5= <user>
##$V9= 5
##$VALIST= <valist>
##$VCLIST= <CCCCCCCCCCCCCCC>
##$VD= 0
##$VDLIST= <DDDDDDDDDDDDDDD>
##$VPLIST= <PPPPPPPPPPPPPPP>
##$VTLIST= <TTTTTTTTTTTTTTT>
##$WBST= 1024
##$WBSW= 4
##$XGAIN= (0..3)
0 0 0 0 
##$XL= 0
##$YL= 0
##$YMAX_a= 413060
##$YMIN_a= -512947
##$ZGOPTNS= <>
##$ZL1= 120
##$ZL2= 120
##$ZL3= 120
##$ZL4= 120
##$ABSF1= 16.45007
##$ABSF2= -4.243103
##$ABSG= 5
##$ABSL= 3
##$ALPHA= 0
##$AQORDER= 0
##$ASSFAC= 0
##$ASSFACI= 0
##$ASSFACX= 0
##$ASSWID= 0
##$AUNMP= <proc_1d>
##$AZFE= 0.1
##$AZFW= 0.1
##$BCFW= 0
##$BC_mod= 0
##$BYTORDP= 0
##$COROFFS= 0
##$CY= 12.5
##$DATMOD= 1
##$DC= 0
##$DFILT= <>
##$DTYPP= 0
##$F1P= 14.0000005364418
##$F2P= -0.99999901652339
##$FCOR= 0.5
##$FTSIZE= 32768
##$FT_mod= 6
##$GAMMA= 0
##$GB= 0
##$INTBC= 1
##$INTSCL= 1
##$ISEN= 128
##$LB= 0.3
##$LEV0= 0
##$LPBIN= 0
##$MAXI= 10000
##$MC2= 0
##$MEAN= 0
##$ME_mod= 0
##$MI= 0
##$NCOEF= 0
##$NC_proc= -4
##$NLEV= 6
##$NOISF1= 0
##$NOISF2= 0
##$NSP= 0
##$NTH_PI= 0
##$NZP= 0
##$OFFSET= 16.45007
##$PC= 1
##$PHC0= 154.6082
##$PHC1= 27.77014
##$PH_mod= 1
##$PKNL= yes
##$PPARMOD= 0
##$PSCAL= 4
##$PSIGN= 0
##$REVERSE= no
##$SF= 250.130017989414
##$SI= 32768
##$SIGF1= 0
##$SIGF2= 0
##$SINO= 400
##$SIOLD= 32768
##$SREGLST= <1H.CDCl3>
##$SSB= 0
##$STSI= 32768
##$STSR= 0
##$SW_p= 5175.98343685301
##$SYMM= 0
##$S_DEV= 0
##$TDeff= 65536
##$TDoff= 0
##$TI= <Analysis number 999999
Compound Code 99
Book Reference 9
Project Code 9>
##$TILT= no
##$TM1= 0
##$TM2= 0
##$TOPLEV= 0
##$USERP1= <user>
##$USERP2= <user>
##$USERP3= <user>
##$USERP4= <user>
##$USERP5= <user>
##$WDW= 1
##$XDIM= 32768
##$YMAX_p= 528516447
##$YMIN_p= -333361
$$ End of Bruker specific parameters
$$ ---------------------------------
##NTUPLES= NMR SPECTRUM
##VAR_NAME=  FREQUENCY,     SPECTRUM/REAL,   SPECTRUM/IMAG
##SYMBOL=    X,             R,               I
##VAR_TYPE=  INDEPENDENT,   DEPENDENT,       DEPENDENT
##VAR_FORM=  AFFN,          ASDF,            ASDF
##VAR_DIM=   32768,         32768,           32768
##UNITS=     HZ,            ARBITRARY UNITS, ARBITRARY UNITS
##FACTOR=    0.157963299565203, 1,           1
##FIRST=     4114.65616182524, 0,            0
##LAST=      -1061.32727502777, 0,           0
##MIN=       -1061.32727502777, -333361,     0
##MAX=       4114.65616182524, 528516447,    0
$$ Real data points
##PAGE= N=1
##DATA TABLE= (X++(R..R)), XYDATA
$$ [...]
23095i5738Q5306K2534o804N1865n0079N844j5583N276J13440P3398n393j06462
$$ -95738 -10432 12102 5298 57163 7084 12928 -2655 2621 116061 189459 184066 77604
23083G7604q7036o533K7516N6278j3923L9718j2419l0750r9405q8809K6849K7951
$$ 77604 -9432 -15965 11551 67829 53906 93624 81205 50455 -48950 -137759 -110910 -82959
23071h2959J4000m2665k2254J5092J0471L0618L227L9356O1913j4949j9N3435
$$ -82959 -68959 -111624 -133878 -118786 -108315 -77697 -74470 -35114 26799 11850 11831 65266
23059F5266j32199j7725O2092K4742l5919l209J0714n5943L2816J3003m5563P8054
$$ 65266 -66933 -84658 -22566 2176 -33743 -36952 -26238 -82181 -49365 -36362 -81925 -3871
23047c871J38717k5603l0727k3297l0935p4831l384P5850l1988J4330m6141L8635
$$ -3871 134846 109243 78516 55219 24284 -50547 -53931 21919 -10069 4261 -41880 -3245
23035c245M8254l6789l0463L7874P8125Q9278o2589j31111n2087M8478K5084o4487
$$ -3245 45009 8220 -22243 15631 93756 183034 120445 -10666 -62753 -14275 10809 -53678
23023e3678K3590J9989J335k3143j6725j7846N6272J61162k8866o8045J1533r3320
$$ -53678 -30088 -10099 -8764 -31907 -48632 -66478 -10206 150956 122090 54045 65578 -27742
23011b7742o5157l1158j0837J9256P6572m052K3861k2473k5267m9155J10253R0406
$$ -27742 -92899 -124057 -134894 -115638 -39066 -43118 -19257 -41730 -66997 -116152 -5899 84507
22999H4507n9791p4962k5316L4649J5894M7245Q8859k8569m7619P715m1159J4978
$$ 84507 24716 -50246 -75562 -40913 -25019 22226 111085 82516 34897 42612 1453 16431
22987A6431q6928l6996k0087k580L1103P971j4076L0673N8244N347O219L2750
$$ 16431 -70497 -107493 -127580 -130160 -99057 -91086 -105162 -74489 -16245 -10898 -4679 28071
22975B8071N9919l4343l0012k9515Q4620n1100j0778L5295M6578l65j5301j29074
$$ 28071 87990 53647 23635 -5880 78740 27640 16862 52157 98735 98370 83069 -46005
22963d6005p9094M639M1666j1314K1653L2468N1357k8662p629j1366l4709O3947
$$ -46005 -125099 -120460 -78794 -90108 -68455 -35987 15370 -13292 -20921 -32287 -66996 -3049
22951c049M8441j3069k8008L0304l413J2972O2493M7025p1047r4931K0665L3895
$$ -3049 45392 32323 4315 34619 31206 44178 106671 153696 82649 -12282 8383 42278
22939D2278J6049o8432J9993N5233j7991q8951Q986N7838L2416j2821m4151l0363
$$ 42278 58327 -10105 9888 65121 47130 -41821 -32835 25003 57419 44598 447 -29916
22927b9916m3912M763O39N5374J4131n8176J0027K6066l6390l6326J847L8804
$$ -29916 -73828 -69065 -68426 -13052 1079 -57097 -47070 -21004 -57394 -93720 -91873 -53069
22915e3069k3908n8380L4494Q4204m1895O5914J36715L9944l7942l8910m690j07400
$$ -53069 -76977 -135357 -100863 -16659 -58554 7360 144075 184019 146077 107167 102477 -4923
22903d923o8047R921k7412j0784m0510j4127J22314N2129L8484k2526j01222q4565
$$ -4923 -72970 -63049 -90461 -101245 -141755 -155882 -33568 18561 57045 34519 -66703 -151268
22891a51268N2068M705N349j5263k2607O6404Q1558j6308o9246j2547O62K7227
$$ -151268 -99200 -94495 -89146 -104409 -127016 -60612 20946 4638 -64608 -77155 -76493 -49266
22879d9266L6744k9432l7146J101J448M9085j5801k0048P766Q4377k4825p8613
$$ -49266 -12522 -41954 -79100 -77999 -76551 -27466 -43267 -63315 -55549 28828 4003 -74610
22867g4610p963k3024M2606P2080q5360p4074j1251J22572O8214M5881K1495r202
$$ -74610 -82573 -105597 -62991 9089 -76271 -150345 -161596 -39024 29190 75071 96566 87364
22855H7364o1773k009J02052k8479m2231K621j7853l1271J7940m179k6617n1644
$$ 87364 25591 23582 125634 97155 54924 57545 39692 8421 26361 22182 -4435 -56079
22843e6079k3M0678j0146R6310L7232l9102j1102p4536n5807Q801L3092J9608
$$ -56079 -56102 -15424 -25570 70740 107972 68870 57768 -16768 -72575 -63774 -30682 -11074
22831a1074k135p6436J0840J02134P0194j60634o0233N552N8049Q1971m9752L808
$$ -11074 -13209 -89645 -78805 23329 93523 -67111 -127344 -121792 -63743 18228 -31524 -27716
22819b7716L9292O13k7944L0421P6874M9892n0290q0406p5991r0967J204Q0473
$$ -27716 11576 12189 -15755 14666 91540 141432 91142 10736 -65255 -156222 -155018 -74545
22807g4545L4091m4927l0166O7807J2520n6200o3834j9267j7747K6553K1765N1771
$$ -74545 -40454 -85381 -115547 -47740 -35220 -91420 -155254 -174521 -192268 -165715 -143950 -92179
22795i2179o1085j1334O9394L9940k6488O3621J5296p8555k2990q643o457J5559
$$ -92179 -153264 -164598 -95204 -55264 -81752 -18131 -2835 -81390 -104380 -113023 -119480 -103921
22783a03921K7310k0935j4469M5712n2329J5135Q6446R5166K2696O3571k7227
$$ -103921 -76611 -97546 -112015 -66303 -118632 -103497 -17051 78115 100811 164382 137155
22772A37155q7616M8409j03308j22721K6340J1949k7633M5072M0678n998q124
$$ 137155 49539 97948 -5360 -128081 -101741 -89792 -117425 -72353 -31675 -37673 -45797
22761d5797l560O5530j1316L4034K6554k7258L6987J9361j0650P060P136l8944
$$ -45797 -49357 16173 4857 38891 65445 38187 75174 94535 83885 90945 98081 59137
22749E9137q9492q9689l114O2100l1968j25847J02685J03759O0427K2931k2497
$$ 59137 -30355 -120044 -123158 -61058 -93026 -218873 -116188 -12429 47998 70929 48432
22738D8432O13L2188j9558K1913R0029m4863p0111m6607p7136m4685j6015m9319
$$ 48432 49045 81233 61675 83588 173617 128754 58643 12036 -65100 -109785 -125800 -175119
22726a75119J10499J18759n1117j13312O2601J06008O6597J8675j10697q8592
$$ -175119 -64620 54139 3022 -110290 -47689 58319 124916 143591 32894 -55698
22716e5698j2907j4577L2221q397N063O0126J19426L6421k8134l6524j08191K7253
$$ -55698 -68605 -83182 -50961 -59358 -54295 5831 125257 161678 133544 97020 -11171 16082
22704A6082K7305o1425k1885O8493l8503p4284n7271K6281P6043L6063l272m1870
$$ 16082 43387 -18038 -39923 28570 -9933 -84217 -141488 -115207 -39164 -3101 -6373 -48243
22692d8243k0514R0435K9351p0636K5901K3967K2413p4642j5271l0133M2177k4063
$$ -48243 -68757 21678 51029 -19607 6294 30261 52674 -21968 -37239 -67372 -25195 -49258
22680d9258O407N291O3321J4751p1168J0203N4415P4423J475K7560k2562p6683
$$ -49258 -42851 -37560 25761 40512 -30656 -20453 33962 108385 109860 137420 114858 38175
22668C8175m1017k7271J0837M5511P4042n0704j1850N2026m7899kl344p6989m1278
$$ 38175 -2842 -30113 -19276 26235 100277 49573 37723 89749 41850 41848 38504 -38485 -79763
22655g9763R4996K2009o0828j887P3223J42192J9535q9840k02432r4764Q4947
$$ -79763 15233 37242 -23586 -25473 47750 189942 209477 119637 -82795 -177559 -92612
22644i2612l778n050L6003L7497J0293K6118k3573p116o243L4466M6756J2701
$$ -92612 -96390 -101440 -65437 -27940 -17647 8471 -15102 -22218 -28461 6005 52761 65462
22632F5462N7321j8635m9826N0816o812j05570o9260N990M3228J924L0929k1236
$$ 65462 122783 104148 54322 105138 98326 -7244 -76504 -70514 -27286 -25362 5567 -15669
22620a5669o2505n5937j0609O0129N2831j5482l9844J6897l6713J9323K1069L1798
$$ -15669 -78174 -134111 -144720 -84591 -31760 -47242 -87086 -70189 -106902 -87579 -66510 -34712
22608c4712k511k2145r108L7320M1457q1023o9310J30473P2686j6927r360J03088
$$ -34712 -37223 -59368 -68476 -31156 10301 -70722 -140032 -9559 63127 46200 36840 139928
22596A39928k2197m2209O780k9516o9234j0281L8609J5366n6078m2235L1841R794
$$ 139928 117731 75522 82302 52786 -16448 -26729 11880 27246 -28832 -71067 -39226 -29432
22584b9432l5878P9238J68756P2364j21729p4760m2290L9016J7381K611J7435
$$ -29432 -65310 13928 182684 255048 133319 58559 16269 55285 72666 75277 92712
22573I2712q9333o9821k0896M2564N04J7804m9310L2105N2571o9932l2413K825
$$ 92712 3379 -66442 -87338 -44774 -44270 -26466 -75776 -43671 8900 -61032 -93445 -90620
22561i0620P0848L0939K2684O3081J173n600p251k2994m5344j6588k0601J2296
$$ -90620 -19772 11167 33851 96932 98105 92505 85254 62260 16916 328 -20273 -7977
22549g977L0681j7190R594l6710M914M2128k0000l361M414j6533L1377R06o6398
$$ -7977 22704 5514 15108 -21602 -16688 25440 5440 2079 6493 -10040 21337 22243 -44155
22536d4155m524K0833M7911m4027j789M022N5173L8173k8278r6777P7455k7522
$$ -44155 -48679 -27846 20065 -23962 -25751 -21729 33444 71617 43339 -53438 24017 -3505
22524c505p7566k5134M4847j5418P2505N3711q1398l4273P2223l5709O6571k4347
$$ -3505 -81071 -106205 -61358 -76776 -4271 49440 -31958 -66231 5992 -29717 36854 12507
22512A2507j30081n6080R7700Q83L7526N756j7753q182m0517j2138J20559M9373
$$ 12507 -117574 -173654 -75954 -75071 -37545 -31789 -49542 -57724 -98241 -110379 10180 59553
22500E9553j1592q591J7560l481J6394K2316k8509n5391K9754N1618n7835O41
$$ 59553 47961 39370 56930 53449 69843 92159 63650 8259 38013 89631 31796 32437
22488C2437O5731J630l4953k5168K7700m9609K0799k8301Q1946j2004N4433O9187
$$ 32437 98168 99798 64845 39677 67377 17768 38567 10266 92212 80208 134641 203828
22476B03828j29751j35231K0112J31610N1010q7181k726N2197P1543l0578n7996
$$ 203828 74077 -61154 -41042 90568 141578 54397 51671 103868 175411 144833 86837
22465H6837o5710p0764r480M5318J4745k2788P887m0453m2693J2368J2906L9260
$$ 86837 21127 -49637 -59117 -13799 946 -21842 -13955 -54408 -97101 -84733 -71827 -32567
22453c2567o7330j5078J7464K0471O1945J12207N6825K5428p0533r6214k242P566
$$ -32567 -99897 -114975 -97511 -77040 -15095 97112 153937 179365 108832 12618 10376 17942
22441A7942k5491M0274R1192p0808r2217l7574J3587K3760K3374n4154N271J10418
$$ 17942 -7549 32725 123917 53109 -39108 -76682 -63095 -39335 -15961 -70115 -64844 45574
22429D5574n606m6430m5753N5484L5536j24920O4136J12047O62m2386m4046L8348
$$ 45574 39968 -6462 -52215 3269 38805 -86115 -21979 90068 90730 48344 4298 42646
22417D2646j3805q368K4650P1682P0496l1480k0326l2803p1197r6267n9489N6464
$$ 42646 28841 20473 45123 116805 187301 155821 135495 102692 31495 -64772 -124261 -67797
22405f7797R2234n6675n0372L0651n0221j2848Q988L1687K7535N5885N2451L1502
$$ -67797 24437 -32238 -82610 -51959 -102180 -115028 -106040 -74353 -46818 9067 61518 93020
22393I3020k9201j09228J511p0553J3045M5235r77M8457L4767M9429l0655k640
$$ 93020 63819 -45409 -43898 -114451 -101406 -56171 -57148 -8691 26076 75505 44850 42210
22381D2210l8715n3347k1630K1800M4712J9274N522k4621m6931n2073J2171k2477
$$ 42210 3495 -49852 -71482 -49682 -4970 14304 19826 -4795 -51726 -103799 -91628 -114105
22369a14105m0469J0737N9911K5306M8373l4602m033R5393p6400n2151L3904L640
$$ -114105 -154574 -143837 -83926 -58620 -10247 -44849 -48882 46511 -29889 -82040 -48136 -44496
22357d4496m7885Q0152N5227L6792l2322j18930j6315O0071k3298j00430L7055
$$ -44496 -92381 -12229 42998 79790 47468 -71462 -87777 -27706 -51004 -151434 -114379
22346a14379O7507O9846L3785J0087k1768m0831o3783J0617O6800O6490l3264
$$ -114379 -46872 22974 56759 66846 45078 4247 -59536 -48919 17881 84371 51107
22335E1107n5278j6937K6520L2624O7821J2982m8226j10056J9306O6420q6564
$$ 51107 -4171 -21108 5412 38036 105857 118839 70613 -39443 -20137 46283 -40281
22324d0281p2633O5534J55214n1658p9129l2729K8824l3929l0547J0000l2877
$$ -40281 -112914 -47380 107834 56176 -22953 -55682 -26858 -60787 -91334 -81334 -114211
22313a14211l4291R1707J03360M0846o1898k446Q2398j6773N7273r3355r0935
$$ -114211 -148502 -56795 46565 87411 25513 23067 105465 88692 145965 52610 -38325
22302c8325L9990J912k0555J0990J22759J7157L6766M9799j17630q7009K7876
$$ -38325 1665 3577 -16978 -5988 116771 133928 170694 220493 102863 15854 43730
22291D3730o1397m0055J2377j3312k6720R9120N3922M488q013R28J3022j21735
$$ 43730 -17667 -57722 -45345 -58657 -85377 13743 67665 72153 64140 65068 78090 -43645
22279d3645o0370J951p546M2571N9956m0038j1485J0478j9458J8531O062k2185
$$ -43645 -104015 -102064 -109610 -67039 -7083 -47121 -58606 -48128 -67586 -49055 -42993 -65178
22267f5178N6580J16556K5747q788J1681j0521o4318l8348K0549J2702j6767m2846
$$ -65178 -8598 107958 133705 124917 136598 126077 61759 23411 43960 56662 39895 -2951
22255b951q2095l9928n6701r4359K9882k9008M0543J08702l3428R726R0850M8026
$$ -2951 -85046 -124974 -181675 -276034 -246152 -275160 -234617 -125915 -159343 -149617 -58767 -10741
22243a0741n0656N2517R374k563p7052l5148L1859O2418j452k8089L4990R7850
$$ -10741 -61397 -8880 494 -2069 -79121 -114269 -82410 -19992 -21444 -49533 -14543 83307
22231H3307P4758J4296r9760L3045J4311J4798o9134l2645K0979O1972p2719m9949
$$ 83307 158065 172361 72601 105646 119957 134755 65621 32976 53955 115927 43208 -6741
22219f741K9220K1066o7877p0300j8228O1758N9854L0990k4175o0395J7372K4575
$$ -6741 22479 43545 -24332 -94632 -112860 -51102 8752 39742 15567 -44828 -27456 -2881
22207b881o6439j4361O198K9220J8643L0775L0657L2207r547j12678l4058L0872
$$ -2881 -69320 -83681 -77483 -48263 -29620 1155 31812 64019 54472 -58206 -92264 -61392
22195f1392J06754N6034k2560j177j5952m5479m9451l5396O3160j5885j01409
$$ -61392 45362 101396 78836 77659 61707 16228 -33223 -68619 -5459 -21344 -122753
22184a22753K8020J15106K5498O1376K0286L2845j7940n8228l1845l6916P048
$$ -122753 -94733 20373 45871 107247 127533 160378 142438 84210 52365 15449 22497
22173B2497J822J813J1621N8488O0443j5608k5747O087m3616q9857k9416n5755
$$ 22497 24319 26132 37753 96241 156684 141076 115329 121416 77800 -12057 -41473 -97228
22161i7228o0558N177K5371J9570J2181k0004o0604l0622l9741N2884o475M3710
$$ -97228 -157786 -152609 -127238 -107668 -95487 -115491 -176095 -206717 -246458 -193574 -200049 -156339
22149a56339K7745K2854R4271k5001n0002k333J53864J8258j04108j832K5826
$$ -156339 -128594 -105740 -11469 -36470 -86472 -88805 65059 83317 -20791 -22623 3203
22138C203L5055K2804K7514p00o7135L3330O7211M6783j5403N0215m8777j14121
$$ 3203 38258 61062 88576 87876 20741 54071 121282 168065 152662 202877 154100 39979
22126C9979l7057L6868J1373m3177K7994P0645k7962j0429q90k9056M5619N5265
$$ 39979 2922 39790 51163 7986 35980 106625 78663 68234 67344 38288 83907 139172
22114A39172j8085o1401n2022P8567n085k1153k977n1582l2483M9334m4059o9253
$$ 139172 121087 59686 7664 86231 81146 59993 57016 5434 -27049 22285 -21774 -91027
22102i1027k2465j3662K766M4821q713J1377n7359R8765L0695L633P3813l7580
$$ -91027 -113492 -127154 -124388 -79567 -88280 -76903 -134262 -35497 -4802 -1169 72644 35064
22090C5064m2725k691J04097N4892j7181m8546l9402r2495J4246L8479L7214J8613
$$ 35064 -7661 -10352 93745 148637 131456 82910 43508 -48987 -34741 3738 40952 59565
22078E9565l7090p861r344q7930j21447Q7184O8769N1443j2941o8105K6140m854
$$ 59565 22475 14614 5270 -82660 -204107 -116923 -48154 3289 -9652 -77757 -51617 -56471
22066e6471p6072l7863K7289O1555K7462O9349P7750j3314p2926K9383K283p438
$$ -56471 -132543 -170406 -143117 -81562 -54100 15249 92999 79685 6759 36142 38425 30987
22054C0987j3408n4750m9521p582K3141L0311K5008K5897k7473O9941J8600n7315
$$ 30987 17579 -37171 -86692 -94274 -71133 -40822 -15814 10083 -17390 52551 71151 13836
22042A3836q3534O787j0341N3094K0861q3240k5614J2137K455K4544P2025m0374
$$ 13836 -69698 -62911 -73252 -20158 703 -82537 -108151 -96014 -93559 -69015 3010 -37364
22030c7364Q288O6197o594m287J2895k9441m3739N4868N5355j2156r635l6580
$$ -37364 -29076 37121 30527 26240 39135 9694 -34045 20823 76178 64022 54387 17807
22018A7807l8720J568j2438M6402N4828k6958j42462k4939O6748J2370l2230O4324
$$ 17807 -20913 -19345 -31783 14619 69447 42489 -99973 -124912 -58164 -45794 -78024 -13700
22006a3700L6316j9178l4699o7493O046K6428J5209R8805L6655j15172l7775N0605
$$ -13700 22616 3438 -31261 -98754 -92708 -66280 -51071 47734 84389 -30783 -68558 -17953
21994a7953R1156l2270m696m6562n9011p0976M9154j4020j5780J09051J070k5883
$$ -17953 73203 40933 36237 -10325 -69336 -140312 -91158 -105178 -120958 -11907 -10837 -36720
21982c6720l6540O756L1842M6304l2181l6055l8297j1201M1494K1128J6894J2811
$$ -36720 -73260 -66504 -34662 11642 -20539 -56594 -94891 -106092 -64598 -43470 -26576 -13765
21970a3765k9937J17783j1174m4915L208n6366o8097j8189R5214R3534n3265l4748
$$ -13765 -43702 74081 62907 17992 21200 -35166 -103263 -121452 -26238 67296 14031 -20717
21958b0717j2108j1256l4448N5439K8558n4205K9138j3799j1614M6609L2493K5351
$$ -20717 -32825 -44081 -78529 -23090 5468 -48737 -19599 -33398 -45012 1597 34090 59441
21946E9441l5153r9086m1119R0147Q7797N7069k3685p3455K445j42436n5016M9813
$$ 59441 24288 -74798 -115917 -25770 62027 119096 95411 21956 24401 -118035 -173051 -123238
21934a23238J35229m6957M2308Q8194n314l9099q463q732O0468Q2173K5402j11555
$$ -123238 11991 -34966 7342 95536 90222 51123 42660 33928 94396 176569 201971 90416
21922I0416o3650O5092q1982j6131J8492K185j9838n6312O1728O3777j9027J2241
$$ 90416 26766 91858 9876 -6255 12237 14422 -5416 -61728 0 63777 44750 56991
21910E6991j14405Q492J5163l1038J7462P1818n7685m107K8936L2759O822k1668
$$ 56991 -57414 -48922 -33759 -64797 -47335 24483 -33202 -37309 -8373 24386 31208 9540
21898I540M5955L7672n1208m3377l5305n7062L9472N6001L1304k0875L1149K4102
$$ 9540 55495 93167 41959 -1418 -36723 -93785 -54313 1688 32992 12117 43266 67368
21886F7368m7478m5319l2785O2744R2531j8958o4720j8478M1838l0236l5067K629
$$ 67368 19890 -25429 -58214 4530 97061 78103 13383 -5095 36743 6507 -28560 -25931
21874b5931m349K1118l1497l8562K5940Q9624J8407N9976k2911p0665J4977P2857
$$ -25931 -30280 -9162 -40659 -79221 -53281 36343 54750 114726 91815 21150 36127 108984
21862A08984n0812n2324n8812L1746N9063Q2571M4858k4716P6567r4817j16791
$$ 108984 58172 5848 -52964 -21218 37845 120416 165274 140558 217125 122308 5517
21851E517M312R5748L7793n6558l1174n7837p8216j6532J09000P6106m5362j10609
$$ 5517 9829 105577 143370 86812 55638 -2199 -80415 -96947 12053 88159 42797 -67812
21839f7812j7603P1202K6866m4512p4066l0766K1774J07396L6156L4402j3398
$$ -67812 -85415 -14213 12653 -31859 -105925 -136691 -114917 -7521 28635 63037 49639
21828D9639l1659k8712j3017r1637K1050J6148k2180K3831K5156k1574N9733J01916
$$ 49639 17980 -10732 -23749 -115386 -94336 -78188 -100368 -76537 -51381 -72955 -13222 88694
21816H8694k6422k4804n9029M5148M7387J2795r5384k5290N0625M3833j3749j6818
$$ 88694 62272 37468 -21561 23587 70974 83769 -11615 -36905 13720 57553 43804 26986
21804B6986n2976M6546K1464j2975l5973m0429k9742N4037O5137K4873K4685o363
$$ 26986 -25990 20556 42020 29045 -6928 -47357 -77099 -23062 42075 66948 91633 85270
21792H5270j5999l1182J5887o695L6573L0875P4603m3303k334K6297O4791L1884
$$ 85270 69271 38089 53976 47281 83854 114729 189332 146029 143695 169992 234783 266667
21780B66667p6574j39323j9247m4263K5693n665j10345l5434N1274r129N0300
$$ 266667 190093 50770 31523 -12740 12953 7288 -103057 -138491 -87217 -96346 -46046
21769d6046M0837n919N2288M0278m1167o7775J9195J685L9096M0234j173k8339
$$ -46046 -5209 -11128 41160 81438 40271 -27504 -8309 -6624 32472 72706 71533 43194
21757D3194l2269j33428j9701P9308L3542j6387L6428J337l4598L1948K6373J3572
$$ 43194 10925 -122503 -142204 -62896 -29354 -45741 -9313 -7976 -42574 -10626 15747 29319
21745B9319p9623l5063m2283j1910j758P6048R7403L741m5557m0929j4202N3441
$$ 29319 -50304 -85367 -127650 -139560 -141318 -65270 32133 35874 -9683 -50612 -64814 -11373
21733a1373m603K0573j3543j1502J3209j5209l6618O0784r177k1858k9879n6537
$$ -11373 -15976 4597 -8946 -20448 -7239 -22448 -59066 1718 -7459 -29317 -59196 -115733
21721a15733l7613N386L2210L2652L9668p21L0344L744j3932L9672K0566q2641
$$ -115733 -153346 -147960 -115750 -83098 -43430 -44151 -13807 -10063 -23995 15677 36243 -46398
21709d6398l1775k6576Q000M8222J05073q0892p5423L8276N4171K3786j8390n7348
$$ -46398 -78173 -104749 -96749 -48527 56546 -24346 -99769 -61493 -7322 16464 -1926 -59274
21697e9274o4894P0095O3621J00510m3582n4473J477q734J8078l9307p8156k7666
$$ -59274 -124168 -54073 9548 110058 66476 12003 13480 4746 22824 -16483 -94639 -122305
21685a22305K2514K2618J4809O7372M8601O6702m8290O5866K6039j44264p394
$$ -122305 -99791 -77173 -62364 5008 53609 120311 72021 137887 163926 19662 12268
21674A2268M5778J1836j30253J5759l2872n4428R3385Q2186N6487K9478p5745
$$ 12268 58046 69882 -60371 -44612 -77484 -131912 -38527 43659 100146 129624 53879
21663E3879j8491K6778O054m0631m169n4759m3449R621L2082n5949l881J112N1322
$$ 53879 35388 62166 68220 27589 23420 -31339 -74788 -65167 -33085 -89034 -92915 -91803 -40481
21650d0481K1577K4770n143N8729N2367n6940p9460M272J5314r9078j15624K2645
$$ -40481 -18904 5866 723 59452 111819 54879 -24581 -20309 -4995 -104073 -219697 -197052
21638a97052P8562M8474O2111J35474N838P290q2281o1506N8088P069N4759l4473
$$ -197052 -118490 -70016 -7905 127569 133407 140697 58416 -3090 54998 62067 116826 82353
21626H2353O027l1249O0196R1694l2146n7279N8931j1717j3608j8046o053K7422
$$ 82353 88380 57131 117327 209021 176875 119596 178527 166810 153202 135156 129103 156525
21614A56525j03941o4934j3031O9850J02000O902j33387m4786P107j456j296P4550
$$ 156525 52584 -12350 -25381 44469 146469 153371 19984 -24802 -17695 -19151 -20447 54103
21602E4103l2407k0984m674L7165l4672m6998L4343N7842m76r8507L0591m2345
$$ 54103 21696 712 -3962 33203 -1469 -48467 -14124 43718 43242 -55265 -24674 -67019
21590f7019o1543l1956K0257N8967l293L1146N781J613L5086O6460m0529J8629
$$ -67019 -128562 -160518 -140261 -81294 -84587 -53441 -47660 -46047 -10961 55499 14970 33599
21578C3599L2734J0042P7046j25290k6753L2815k0258J865j5890m6254q352P1400
$$ 33599 66333 76375 153421 28131 1378 34193 13935 15800 -90 -46344 -54696 16704
21566A6704l089j09798P6898P3776k1021n4911m7470j631k1729J7272j1513j3337
$$ 16704 13615 -96183 -19285 54491 33470 -21441 -68911 -70542 -92271 -74999 -86512 -99849
21554i9849M5018K5581J8659n8488m6661q668Q2709J10033j6447m6092k9594k9983
$$ -99849 -54831 -29250 -10591 -69079 -115740 -124408 -41699 68334 51887 5795 -23799 -53782
21542e3782j17713N6155M4204O2529K6209m9993N9762l5158k4681l90k6547O4597
$$ -53782 -171495 -115340 -71136 -8607 17602 -32391 27371 -7787 -32468 -32858 -59405 5192
21530E192R9328L5671M1170j23676o5637P6564Q6498q416j11294r0057k4489k2124
$$ 5192 104520 140191 181361 57685 -7952 68612 155110 146694 35400 -54657 -79146 -101270
21518a01270Q8454K7642M294L974P470L4516j0988J1945P3798K3823k2471l1411
$$ -101270 -12816 14826 19120 23094 30564 65080 54092 66037 139835 163658 141187 109776
21506A09776K6563P537j4987j4134J0611n0120K8563P3068R9925n7933j26603
$$ 109776 136339 143876 128889 114755 125366 75246 103809 176877 276802 218869 92266
21495I2266r837l0558m5951r2781M0148L6566J2893K3072K9250l7273K5907O5552
$$ 92266 82429 51871 5920 -86861 -46713 -10147 2746 25818 55068 17795 43702 109254
21483A09254O5237q5645j11038N4349L3038o272L8388L0914r091m2144r384O2069
$$ 109254 174491 88846 -22192 32157 65195 58923 97311 128225 119134 76990 67606 129675
21471A29675m2029j1760l4891n0405L758k4800m2976p6144Q0685N5744j0843K2211
$$ 129675 87646 75886 40995 -9410 -5652 -30452 -73428 -149572 -68887 -13143 -23986 -1775
21459a775N9648q131p6183m5384L2505P6715L1076l8676q8083L3517K7976J5864
$$ -1775 57873 49742 -26441 -71825 -39320 37395 68471 29795 -58288 -24771 3205 19069
21447A9069J8747J8543N9874m275m3448L3421L4475J0766q2863M5153N393o9869
$$ 19069 37816 56359 116233 111958 68510 101931 136406 147172 64309 109462 114855 44986
21435D4986J0856O2397R259J7299m176q3232l2122P8026n2814j13725J3267P1981
$$ 44986 55842 118239 127498 144797 140621 57389 25267 103293 50479 -63246 -49979 22002
21423B2002M8428m6205o6185J08762N5789k7665m0001P428J8751q9N0192l0099
$$ 22002 70430 24225 -41960 66802 122591 94926 54925 62353 81104 81015 131207 101108
21411A01108m8078k7322L3132K6458o3697o1891L2067p5652l8573O9864L4101
$$ 101108 53030 25708 58840 85298 21601 -40290 -8223 -83875 -122448 -52584 -18483
21400a8483L9218k421n4021L2279n1861m4577L6806K8700L0342L9130K1604p3444
$$ -18483 20735 18314 -35707 -3428 -55289 -99866 -63060 -34360 -4018 35112 56716 -16728
21388a6728r958q346R7425L491l06q5464l7288k1680L0916J37522Q651r2986n1142
$$ -16728 -26686 -35032 62393 65884 65578 -19886 -57174 -78854 -47938 89584 98235 5249 -45893
21375d5893J870j666k9438J7639K3449l2678j9168m6116K6955j475P9081r930
$$ -45893 -44023 -45689 -75127 -57488 -34039 -66717 -85885 -132001 -105046 -106521 -27440 -37370
21363c7370p5486R934K7080J2405j13446J9120M8899M6671L6135o879q0218J7284
$$ -37370 -112856 -102922 -75842 -63437 -176883 -157763 -108864 -62193 -26058 -32937 -113155 -95871
21351i5871M1701J7018L1752K1639q269j1921p9887R34N4386J3789Q9694J6970
$$ -95871 -54170 -37152 -5400 16239 7970 -3951 -83838 -82904 -28518 -14729 74965 91935
21339I1935M6130m6040Q703l5133L7193k0914j9472j1670K7942M5223K8287j21936
$$ 91935 138065 92025 100728 65595 102788 81874 62402 50732 78674 123897 152184 30248
21327C0248j01042K0291P5927O3635n9868Q1740R4599o7860j01312l1268n4782
$$ 30248 -70794 -50503 25424 89059 29191 110931 205530 137670 36358 5090 -49692
21316d9692k9336O8700P9731m2244q7696l6654r93N7421R5064R1101o9986l7110
$$ -49692 -79028 -10328 69403 27159 -60537 -97191 -98184 -40763 54301 145402 75416 38306
21304C8306J984j2189k2887o0736J413L8804L8858P2552n8836r095K7939Q3492
$$ 38306 40290 28101 5214 -55522 -54109 -15305 23553 96105 37269 28174 56113 139605
21292A39605J964R919p1251j15852n5212Q1338M2750j5991L0704m4896k0056P5244
$$ 139605 141569 151488 80237 -35615 -90827 -9489 33261 17270 47974 3078 -16978 58266
21280E8266N3916K1641j814o0095n1981N7859N913n5186L3280K6184N8334o2950
$$ 58266 112182 133823 132009 71914 19933 77792 83705 28519 61799 87983 146317 83367
21268H3367k1544o9019k238J6268j001N1551j4639N7715J9578q3455P6602J08065
$$ 83367 61823 -7196 -9434 6834 5833 57384 42745 100460 120038 36583 113185 221250
21256B21250m2751p1002J723k3862q7889J6722j862L3268N4838k6413M6008Q2193
$$ 221250 178499 107497 109220 85358 -2531 14191 12329 45597 100435 74022 120030 202223
21244B02223J0017q8261l2606o0634p7275P6958M0768m4362k3103L2803L3899
$$ 202223 212240 123979 91373 30739 -46536 30422 71190 26828 3725 36528 70427
21233G0427L7835N359k8719m115o2875L4520L6211m7742p7668K0103M5213q4895
$$ 70427 108262 113621 84902 80787 17912 52432 88643 40901 -36767 -16664 28549 -56346
21221e6346n2678j653Q3916Q0973k2206k4625L436r943J08843L292m84n7260m3664
$$ -56346 -109024 -110677 -26761 54212 32006 7381 10817 874 109717 113009 112525 55265 11601
21208A1601k5243m459J8729n860M5147K272O1084Q9317O6536j31728k9825n7572
$$ 11601 -13642 -18101 628 -5232 39915 42187 103271 192588 259124 127396 97571 39999
21196C9999p9088J2819M864r325M1968O0985m4774n476K0285K8639l0041P137
$$ 39999 -39089 -26270 -21406 -30731 11237 72222 27448 21972 42257 70896 40855 47992
21184D7992Q4653O4480K6830j02420q4275o8590L2941m8749j09914l9546N9075
$$ 47992 132645 197125 223955 121535 37260 -31330 1611 -47138 -157052 -196598 -137523
21173a37523R5323k1040K7276N4081J21736K3375j00918q3013N8926J3620q3330
$$ -137523 -42200 -63240 -35964 18117 139853 163228 62310 -20703 38223 51843 -31487
21162c1487N605o9744K316J14645j5506p592R4994M7003J7532M5443n1594q4059
$$ -31487 -25882 -95626 -93310 21335 5829 -1763 93231 140234 157766 203209 151615 67556
21150F7556l216P9693N0693l0086k5104o2865q5209L5886L3968j7061k1789l4094
$$ 67556 64340 144033 194726 164640 139536 76671 -8538 27348 61316 44255 22466 -11628
21138a1628N2737N9151o6491M4076P1965K806k1635o4222m0492R1377N249r4855
$$ -11628 41109 100260 33769 77845 149810 152616 130981 66759 26267 117644 122893 28038
21126B8038l1538O4770J89J5886M9223O6475L7563o243k7779l9571k1726O343
$$ 28038 -3500 61270 61459 77345 126568 193043 230606 224363 196584 157013 135287 141630
21114A41630N2763r912N2520O8057J18597L2478R916J09985J34920J05990J7108
$$ 141630 194393 184481 237001 305058 423655 456133 466049 576034 710954 816944 834052
21103H34052O5610l2245o5055O7522K1216p2293m0376o0701o6186K2024N6218
$$ 834052 899662 867417 802362 869884 891100 818807 778431 717730 651544 673568 729786
21092G29786O9305Q1373J33114J05599o1292j46907j11760Q6932K9269j2378j33413
$$ 729786 799091 880464 1013578 1119177 1057885 910978 799218 886150 915419 903041 769628
21081G69628o4004n8981j15595r6608j07645k1052l8182o4852j5294p2057o077
$$ 769628 705624 646643 531048 434440 326795 305743 267561 202709 187415 115358 109281
21070A09281j5552M3757J913l9509J0191l1465L8297o251j5546j1888n2545O1376
$$ 109281 93729 137486 139399 99890 110081 78616 116913 110662 95116 83228 30683 92059
21058I2059P3396N0621J9501k5701p1431n879O6298P2654r5123p7796p10k5012
$$ 92059 165455 216076 235577 209876 138445 132566 198864 271518 176395 98599 97889 72877
21046G2877q742k8292l2614j4612J7938l3428O8642P2149k318o9060n6615k5149
$$ 72877 64135 35843 3229 -11383 6555 -26873 41769 113918 111600 42540 -14075 -39224
21034c9224Q1960K9769r554n7419J4503j2317J3125M4953k4490m6037n738m0588
$$ -39224 42736 72505 62951 5532 20035 7718 20843 65796 41306 -4731 -10469 -51057
21022e1057k2550L3847M6338R4160l2229l9244O8655o0213J9841N0680J3847M2526
$$ -51057 -73607 -39760 6578 100738 68509 29265 97920 37707 57548 108228 122075 164601
21010A64601L2552p008M0772m1249m599L4018Q938p6063j8100K939q4021j9920
$$ 164601 197153 190145 230917 189668 185069 219087 228025 151962 133862 136801 52780 32860
20998C2860J0116n3367O0123M048M7367M9754J5769l9934k9131k7707n0820l6782
$$ 32860 42976 -10391 49732 53780 101147 150901 166670 126736 97605 69898 19078 -17704
20986a7704Q348P7639Q7207n7041j18282M6602O6940J03083q422q4126n9895N4756
$$ -17704 -9356 68283 155490 98449 -19833 26769 93709 196792 188370 104244 44349 99105
20974I9105K2886K5083p9068l0088r272j01618K50m352m7330L6310Q0867K5001
$$ 99105 121991 147074 68006 37918 28646 -72972 -72722 -77074 -124404 -88094 -7227 17774
20962A7774J0085M3903N9611m2479n3066j1929J9432J00612j7959m4930m4518
$$ 17774 27859 71762 131373 88894 35828 23899 43331 143943 125984 81054 36536
20951C6536o846L5476J46592L091l0406J7171k2360j3888J7454m8653k0603k4661
$$ 36536 29690 65166 211758 214849 184443 201614 179254 165366 182820 134167 113564 88903
20939H8903p742P054M8081K8697m3685o1465L7088o1270m0724L2972L4915P4741
$$ 88903 81161 88215 136296 164993 121308 59843 96931 35661 -5063 27909 62824 137565
20927A37565n3323j1600N9174M8792L4758j6455L3402k6276p205p3597n9646M611
$$ 137565 84242 72642 131816 180608 215366 198911 232313 206037 198832 125235 65589 70200
20915G0200m6796n5827M6455J04819j9447J686L3985p8274l9650j1577L1373J1720
$$ 70200 23404 -32423 14032 118851 99404 101090 135075 56801 17151 5574 36947 48667
20903D8667r2941n5186K1930J28647R6301j452p900m78O178k9165m9600K4789
$$ 48667 -44274 -99460 -77530 51117 147418 145966 138066 137588 143766 114601 65001 89790
20891H9790P9831n8606l8200M0266M5532Q056k7096q781n184j9853L6750J26653
$$ 89790 169621 111015 72815 113081 158613 166669 139573 130792 125608 105755 142505 269158
20879B69158O948r9595o3184k57P4562K0720o356l5932M5067K8860L0681k4385
$$ 269158 276106 176511 113327 113070 187632 208352 201996 166064 211131 239991 270672 246287
20867B46287m211N4817k6045r3817K0741P7486l0302k3413k6978k927M7763L1054
$$ 246287 242076 296893 270848 177031 197772 275258 244956 221543 194565 191638 239401 270455
20855B70455m1439l3793q42k5772M150R0908N1055n1106k3764L8267o6819m9602
$$ 270455 229016 195223 194381 168609 172759 263667 314722 263616 239852 278119 211300 161698
20843A61698L8915M5900o0444j08288M1967R2985m9937l1448M6513K633M2679
$$ 161698 200613 246513 186069 77781 119748 212733 162796 131348 177861 180494 223173
20832B23173R76K0594M0270m0760M733N345L9603n5525q8046k9927j1389J9736
$$ 223173 224149 244743 285013 244253 248986 254331 293934 238409 150363 120436 109047 128783
20820A28783M4127M4580l1286K936n2429q3838p1696Q0428J31657N619M716l3358
$$ 128783 172910 217490 186204 189140 136711 52873 -18823 61605 193262 198881 203597 170239
20808A70239M5014O7301M7901n1140o7954l7589L6775L5840N4683j2477J3680
$$ 170239 215253 282554 330455 279315 211361 173772 210547 246387 301070 288593 302273
20797C02273M504Q5301Q6122M3408J1893l8887p7093k7886j57560K5252M3210
$$ 302273 306777 392078 478200 521608 533501 494614 417521 389635 232075 257327 300537
20786C00537N4952K9268L2724P1018k935o0527k2435M7412M2692j09399n1130
$$ 300537 355489 384757 417481 488499 485564 425037 402602 450014 492706 383307 332177
20775C32177N1618K9462K5423q2593j22673k3053P1198L2250l4948n633J1111
$$ 332177 383795 413257 438680 356087 233414 210361 281559 313809 278861 273228 284339
20764B84339k8931m2486L5299l2311l6864q958k7999J248K6702J10467J9901k8023
$$ 284339 255408 212922 248221 215910 179046 170088 142089 143337 170039 280506 300407 272384
20752B72384P379R872m1921J16068Q7521q1254J8440Q969M8440l3712n0624L2826
$$ 272384 279763 289635 247714 363782 451303 370049 388489 397458 445898 412186 361562 394388
20740C94388m9378k5054M3212Q2045K2271m9902k2708O2504L5902K5765K2305
$$ 394388 345010 319956 363168 445213 467484 417582 394874 457378 493280 519045 541350
20729E41350r307l2558M3257j604K167J1235P2580J09008L036k6669l715P403
$$ 541350 532043 499485 542742 541138 543305 554540 627120 736128 739164 712495 708780 716183
20717G16183L330M6301l4474J03972J00011N8158J11477J47377N9950r332m0602
$$ 716183 719513 765814 731340 835312 935323 993481 1104958 1252335 1312285 1302953 1262351
20706A262351J429N9098j0568J1573J07163L3099J01422J03987r150K0227J47008
$$ 1262351 1263780 1322878 1312310 1323883 1431046 1464145 1565567 1669554 1660404 1680631 1827639
20695A827639R1460J09453J69914K96302L54922L85627L44509K19500J50017M7489
$$ 1827639 1919099 2028552 2198466 2494768 2849690 3235317 3579826 3799326 3949343 3996832
20685C996832K7584J06915M5151m7944n1262r5424j08407l9859R2158J16293J71434
$$ 3996832 4024416 4131331 4176482 4128538 4077276 3981852 3873445 3833586 3925744 4042037 4213471
20674D213471K34168R7222P3395R613j7811m3599o1156k63606m00991m82828n06410
$$ 4213471 4447639 4544861 4618256 4627869 4610058 4566459 4505303 4241697 3840706 3357878 2851468
20663B851468l97972k36984k04798j74143o4610k2715r0118j05334k4312j39647
$$ 2851468 2453496 2216512 2011714 1837571 1772961 1750246 1660128 1554794 1530482 1390835
20653A390835j21651N939n2819L9203M266m1786p6519P685j1943k5048K7848J3814
$$ 1390835 1269184 1275123 1222304 1261507 1265773 1223987 1147468 1155153 1143210 1118162 1146010 1159824
20641A159824q5526j5854r7513j07539o650Q3445j1719L1884Q2601p8649O364
$$ 1159824 1074298 1058444 960931 853392 846742 930187 918468 950352 1032953 954304 960668
20630I60668J6157j8050n1193J700J0050L1275m9163l9507P9003J09088R4600
$$ 960668 976825 958775 907582 909282 919332 950607 901444 861937 940940 1050028 1144628
20619A144628O2004R541l2275P9561J24454P0685R718j11135N7401O2026Q0101
$$ 1144628 1206632 1216173 1183898 1263459 1387913 1458598 1468316 1357181 1414582 1476608 1556709
20608A556709J16128L1031l2276j1680P257M3503R2869Q7731N9729K6969Q3737
$$ 1556709 1672837 1703868 1671592 1659912 1667169 1710672 1803541 1891272 1951001 1977970 2061707
20597B061707O6350P1482O7736J9480K2999O4876J00302J55534l723P1882J75182
$$ 2061707 2128057 2199539 2267275 2286755 2309754 2374630 2474932 2630466 2626743 2698625 2873807
20586B873807K20954J21398J93568K36357K64632K54933L05701L00644M05773
$$ 2873807 3094761 3216159 3409727 3646084 3910716 4165649 4471350 4771994 5177767
20577E177767L53559K58018K89528L01352K75734K92401K52509L55642M27430
$$ 5177767 5531326 5789344 6078872 6380224 6655958 6948359 7200868 7556510 7983940
20568G983940N24764N23697O67919P25786Q04785R86499J048314J180303J358013
$$ 7983940 8508704 9032401 9700320 10426106 11230891 12217390 13265704 14446007 15804020
20559A5804020J545354J632416J863061K193808K598758L104685L619758M343199
$$ 15804020 17349374 18981790 20844851 23038659 25637417 28742102 32361860 36705059
20551C6705059N269729O737901Q813603J1307902J4396764J7636374J9933944
$$ 36705059 41974788 48712689 57526292 68834194 83230958 100867332 120801276
20544A20801276J9012711J4275277P941104L525263K462784K568264M17419m804016
$$ 120801276 139813987 154089264 162030368 165555631 168018415 170586679 171004098 166200082
20536A66200082j0275780j2726781j1187546o428493l46811O212560J1323238
$$ 166200082 155924302 143197521 132009975 125581482 125234671 131447231 142770469
20529A42770469J2941175R886695M039047j039578k820543k633142m007673q776078
$$ 142770469 155711644 165598339 169637386 168597808 165777265 163144123 159136450 150360372
20521A50360372j5175046j9567248k0391481j8385598j5052189j1547964q637665
$$ 150360372 135185326 115618078 95226597 76840999 61788810 50240846 41603181
20514D1603181o675196n174354l973160l085380k539149k112921j759947j419562
$$ 41603181 34927985 29753631 25780471 22695091 20155942 18043021 16283074 14863512
20506A4863512j151260j045800r22924r53116q96884p58882o28813n65803n52089
$$ 14863512 13712252 12666452 11743528 10790412 9893528 9134646 8505833 7940030 7387941
20497G387941m43735m15342l49857l07017k72068j91303k79425k97743k33098
$$ 7387941 6944206 6528864 6179007 5871990 5599922 5408619 5129194 4831451 4598353
20488D598353k33249k70838k88947l50614k87847k57092k01380j84914k00181
$$ 4598353 4365104 4094266 3805319 3454705 3166858 2909766 2708386 2523472 2323291
20479B323291j26779p5217n7015o8415j86734p9219p5003n2501n3710r4199k9087
$$ 2323291 2196512 2121295 2064280 1995865 1809131 1729912 1654909 1602408 1548698 1454499 1425412
20468A425412m2973r5803j21611J7529N1925K3273k5819n5042m4200j01983n4012
$$ 1425412 1382439 1286636 1165025 1182554 1234479 1257752 1231933 1176891 1132691 1030708 976696
20457I76696k8157j29039j04429K5023N5419M6787r2486m8839K3456q3436J9352
$$ 976696 948539 819500 715071 740094 795513 842300 749814 700975 724431 640995 660347
20446F60347q095m8321J17899P3315K6186j31122p4433k6461O6762l1684j825
$$ 660347 652252 603931 721830 795145 821331 690209 615776 589315 656077 624393 622568
20435F22568l7746k3866j49640l0271Q911K9398L2102j615k2160l4168k2291o398
$$ 622568 584822 560956 411316 381045 389956 419354 451456 449841 427681 393513 371222 364824
20423C64824n5133n3880O6422K2752K3656l771O6155L5227p577p3293Q540k8549
$$ 364824 309691 255811 322233 344985 368641 364870 431025 466252 458675 385382 393922 365373
20411C65373m2131k2774o3962o068R674n2915k6513R264L1811K2765J7207l0516
$$ 365373 323242 300468 236506 230438 240112 187197 160684 169948 201759 224524 241731 211215
20399B11215K9356J87214L0263r6381j00013N6055j6781N81p9852K1271K4271
$$ 211215 240571 427785 458048 361667 261654 317709 300928 301509 221657 242928 267199
20388B67199r360P455j2140O5828O6503Q539n6906o2998j00955m0473N8493Q191
$$ 267199 257839 265294 253154 318982 385485 394024 337118 274120 173165 132692 191185 199376
20376A99376l5366J20564O2717m7380j9485L8814j3520j3785j7364J1556m274
$$ 199376 164010 284574 347291 299911 280426 319240 305720 291935 274571 286127 281853
20365B81853N7457l8673L9443J6777J6448L9531K4122j1236k3883J678J0420J49336
$$ 281853 339310 300637 340080 356857 373305 412836 436958 425722 401839 403517 413937 563273
20353E63273n0825o8634k9758p7371o5847m6998l0065n881j1103j0108p09K2152
$$ 563273 512448 443814 414056 336685 270838 223840 193775 187894 176791 166683 165974 188126
20341A88126m884N4666J41918k5479o8327m3826p3864N8625M1521j25977k3933
$$ 188126 183242 237908 379826 354347 286020 242194 168330 226955 268476 142499 118566
20330A18566R1835M6516r7137k8886N4908J15482j6455k849N7719r2984n2846
$$ 118566 210401 256917 159780 130894 185802 301284 284829 281980 339699 246715 193869
20319A93869K975k5872q1025K7382Q0149M2879J5359O8783M0512L169m974j26386
$$ 193869 196844 170972 89947 117329 197478 240357 255716 324499 365011 368180 363206 236820
20307B36820n3868J8556m8156M6896M25j7236N3289R0922L9773J8096N9408J082
$$ 236820 182952 201508 153352 200248 200673 183437 236726 327648 367421 385517 444925 446007
20295D46007m8534R469L5220o4149n4608m8710K5871m7042P943P6927L5155Q1315
$$ 446007 397473 406942 442162 378013 323405 274695 300566 253524 261467 338394 373549 454864
20283D54864K7844M6278n3952K7057K9957q7758l1799O4682P0418J3545O819L3386
$$ 454864 482708 528986 475034 502091 532048 444290 412491 477173 547591 561136 567955 601341
20271F01341K8732Q0340k6534k9019n2721n5669N9673L3356r5518J0118N5843
$$ 601341 630073 710413 683879 654860 602139 546470 606143 639499 543981 554099 609942
20260F09942m2480P0232l3193L8224J03251J01987m2184j4701M2433L0978L4384
$$ 609942 567462 637694 604501 642725 745976 847963 805779 791078 833511 864489 898873
20249H98873K247q5559q1556p2798N4623N2080M8868R0588J8583J4832J1494J07019
$$ 898873 901120 815561 734005 661207 715830 767910 816778 907366 925949 940781 952275 1059294
20237A059294L2060q2715M668q6439q0655j9q817K3917q795K2942n4644N651O4335
$$ 1059294 1091354 1008639 1013307 926868 846213 846194 837377 861294 852499 875441 820797 826448 890783
20224H90783M6365K8243p2493l7734J9018k59l2314N1932Q4318J3267k3226K5156
$$ 890783 937148 965391 892898 855164 874182 873923 841609 893541 977859 991126 967900 993056
20212I93056L6856O8620k4196r7800j814l032N7203L6948R0271Q4000P1210K9827
$$ 993056 1029912 1098532 1074336 976536 974722 971690 1028893 1065841 1156112 1240112 1311322 1341149
20200A341149l379M8131M1601Q7525O2844J6252P1643J31838j9892l0606L3976
$$ 1341149 1337770 1385901 1427502 1515027 1577871 1594123 1665766 1797604 1777712 1747106 1781082
20189A781082K4991P5974J83835J80283J17656J32497M6741J36760J79965J28623
$$ 1781082 1806073 1882047 2065882 2246165 2363821 2496318 2543059 2679819 2859784 2988407
20179B988407J75907L20703J97845P0298J63207K38536J59312K01567K44662L79546
$$ 2988407 3164314 3485017 3682862 3753160 3916367 4154903 4314215 4515782 4760444 5139990
20169E139990M32420M20727L86040L95221M50113L20933L19161M98406M40852
$$ 5139990 5572410 5993137 6379177 6774398 7224511 7545444 7864605 8363011 8803863
20160H803863O09313P44986Q96995J123221J321315J567591J890602K312674K667389
$$ 8803863 9413176 10158162 11055157 12178378 13499693 15067284 16957886 19270560 21937949
20151B1937949L090304L833327M944729O322455Q215999J0821834J3928411J6665641
$$ 21937949 25028253 28861580 33806309 40128764 48344763 59166597 73095008 89760649
20143H9760649J7001654J2763830M477711m180848r218044r574815o270272j287919
$$ 89760649 106762303 119526133 124003844 119822996 110604952 101030137 94759865 93471946
20135I3471946M162640Q985749J0988660Q013271K48916q836427j4950876j6564398
$$ 93471946 97634586 106620335 117608995 125622266 125871182 117034755 102083879 85519481
20127H5519481j4732815j1537600q283425n596318l311393j576867o0947J181417
$$ 85519481 70786666 59249066 50965641 45369323 42057930 40481063 40420116 41601533
20119D1601533K517587M108480O113029Q563080J1715035J4979967J7061093J5646509
$$ 41601533 44119120 48227600 54340629 62903709 74618744 89598711 106659804 122306313
20111A22306313R255845k12390p920290j0982509r588604n125484K95880N644225
$$ 122306313 131562158 131349768 123429478 112446969 102858365 97732881 98028761 103672986
20103A03672986R527321R540234M164686m895432j3160734j7456584j7559691
$$ 103672986 113200307 122740541 126905227 122009795 108849061 91392477 73832786
20096G3832786j5190315j1891001r007645o772013n012521l776141l042703k202122
$$ 73832786 58642471 46751470 37743825 30971812 25959291 22183150 19140447 16938325
20088A6938325j606658j357543j075281p98928p04545o30644o40388o42078o09108
$$ 16938325 15331667 13974124 12898843 12099915 11395370 10764726 10124338 9482260 8873152
20079H873152m96469k58460j53671q8827j08817j84228m01260o37547p61256o35154
$$ 8873152 8376683 8118223 7964552 7875725 7766908 7582680 7181420 6543873 5782617 5147463
20069E147463n27426m02245k23400k11016k01643j61340k84566l15526j97749
$$ 5147463 4620037 4217792 3994392 3783376 3581733 3420393 3135827 2820301 2622552
20060B622552k52286j99638j12588k29671j35459N4K4098j11471r4810p1068L7466
$$ 2622552 2370266 2170628 2058040 1828369 1692910 1692964 1717062 1605591 1510781 1439713 1477179
20049A477179K892r3274j32341j38034p8896n369m128j2856n727o5224q8232p6408
$$ 1477179 1480071 1386797 1254456 1116422 1037526 1032157 1028029 1015173 1009446 944222 855990 779582
20037G79582K6949K1012p2554j5188m6572m6376n7209k0301j8871L4528N5098
$$ 779582 806531 827543 754989 739801 693229 646853 589644 569343 550472 585000 640098
20026F40098l3677p9031j11597q0966L6893O3592L2067J2769n4103k4615j5618
$$ 640098 606421 527390 415793 334827 371720 435312 467379 480148 426045 401430 385812
20015C85812k4436n09p3183M7993j7175n4768J4836N4318m3491J8343o023m3888
$$ 385812 361376 360867 287684 335677 318502 263734 278570 332888 289397 307740 301717 257829
20003B57829j1028N7433J8462M5241l3947j08459j7917P099J5464N6258o8534
$$ 257829 246801 304234 322696 367937 333990 225531 207614 214713 230177 286435 217901
19992B17901L2788K4297M8781L4113q447j197n5428J4650K5097N8666N2639M2170
$$ 217901 250689 274986 323767 357880 349433 348236 292808 307458 332555 391221 443860 486030
19980D86030K0901K9050P6330R5909J22863L8924n5386P3229M8580P2220L348
$$ 486030 506931 535981 612311 708220 831083 870007 814621 887850 936430 1008650 1011998
19969A011998r3424p0605n7482l405K322p9549J6506J02205M8187R1340K0551
$$ 1011998 918574 847969 790487 787082 789404 709855 726361 828566 876753 968093 988644
19958I88644J8474n9994j24185q4428j30435q4388j569q196o5303k8796p8438
$$ 988644 1007118 947124 822939 738511 608076 523688 522119 513923 448620 419824 341386
19947C41386l4419j09419K5431l9741o6585J245L3103J6364n7646r6794j60882
$$ 341386 306967 197548 222979 183238 116653 117898 151001 167365 109719 12925 -147957
19936a47957L5947O8411K6486L5706K1233o7204K270M2210L9905n4009l4726M0368
$$ -147957 -112010 -43599 -17113 18593 39826 -27378 -25108 17102 57007 2998 -31728 8640
19924H640O2917M5829p2808n5673m7505n8503j540r573O4577M0091n1868R726
$$ 8640 71557 117386 44578 -11095 -58600 -117103 -118643 -128216 -63639 -23548 -75416 -65690
19912f5690J4411l1516J015N1875n576J5354N4924K1044J2674J4907n0774m6744
$$ -65690 -51279 -82795 -81780 -29905 -35481 -20127 34797 55841 68515 83422 32648 -14096
19900a4096Q289j1960O3810O199L3915k3777j30668J8624M9252l6659j2420q856
$$ -14096 -5807 -17767 46043 52242 86157 62380 -68288 -49664 -412 -37071 -49491 -58347
19888e8347k5635k3232O2698J30011p7026o9432k8575P6086J2645j7578q5097
$$ -58347 -83982 -107214 -44516 85495 8469 -60963 -89538 -13452 -807 -18385 -103482
19877a03482m9083K0414N7724N3683P5135O711p6042n6768j30256M450M595k52
$$ -103482 -152565 -132151 -74427 -20744 54391 61102 -14940 -71708 -201964 -197514 -192919 -193171
19865a93171l4690L0834Q7285N2906m34Q07j4810O421J8048j8744o0013O4446
$$ -193171 -227861 -197027 -109742 -56836 -57270 -56463 -71273 -64852 -46804 -65548 -125561 -61115
19853f1115p392p387l8775P0770L4663Q210k7410j8624M3286K1436j01651o3673
$$ -61115 -68507 -75894 -114669 -43899 -9236 -1026 -28436 -47060 -3774 17662 -83989 -147662
19841a47662O8631O2078J0593m4132m2877Q2200N9634j036J6825M9281Q906J2704
$$ -147662 -79031 -16953 -6360 -50492 -93369 -11169 48465 47429 64254 113535 122441 135145
19829A35145O1548l1252j09143k5198o3100n9257P6003J1007q8782n0656N8492
$$ 135145 196693 165441 56298 31100 -32000 -91257 -15254 -4247 -93029 -143685 -85193
19818h5193M2756N4042N7586n5054j41128N1548R8043R874L0432K4347j8652L499
$$ -85193 -42437 11605 69191 14137 -126991 -75443 22600 32474 62906 87253 68601 72100
19806G2100L7828o5335l8507Q0887m2562p2341k8984l659K7860L60r7037k1882
$$ 72100 109928 44593 6086 86973 44411 -27930 -56914 -60573 -32713 -32353 -129390 -151272
19794a51272L5995j4836m0375o3681j6165M7706P4299Q5186J8770o9796q5457
$$ -151272 -115277 -130113 -170488 -234169 -250334 -202628 -128329 -43143 -24373 -94169 -179626
19783a79626r3292m347P0298P2935j991R778j8377j3899J9465K0343L6572o583
$$ -179626 -272918 -277265 -206967 -134032 -136023 -126245 -144622 -158521 -139056 -118713 -82141 -88724
19771h8724L9810K6177N3744M1120r663k0047l0838n6935k4501k8865p359j8612
$$ -88724 -48914 -22737 31007 72127 62464 42417 11579 -45356 -69857 -98722 -106081 -124693
19759a24693j4080M1597j8330o6857M0820M5084j7396K417j7190m0435M523L4021
$$ -124693 -138773 -97176 -115506 -182363 -141543 -96459 -113855 -111438 -128628 -169063 -164540 -130519
19747a30519J5128R8949L4737J9919k4931q6334K6536K883n4466q9460P2542J8743
$$ -130519 -115391 -16442 18295 38214 13283 -73051 -46515 -43632 -98098 -187558 -115016 -96273
19735i6273r1744l0399j5638L4152K8779J1393N2534k5963L0567n368k1019n6137
$$ -96273 -188017 -218416 -234054 -199902 -171123 -159730 -107196 -133159 -102592 -107960 -128979 -185116
19723a85116m8145J3329K7229O7583L0526j6289R347p0517J2766L7526n739o2326
$$ -185116 -233261 -219932 -192703 -125120 -94594 -110883 -101536 -172053 -159287 -121761 -127500 -189826
19711a89826j87L4592m2910m0508P6941N7198q555q397r161Q2248O1435k6238
$$ -189826 -190013 -155421 -198331 -238839 -161898 -104700 -113255 -121652 -130813 -48565 12870 -13368
19699a3368l3134J4307l1944M7073K8337K260m1550j38216O525L3709K9207L1917
$$ -13368 -46502 -32195 -64139 -17066 11271 13531 -28019 -166235 -159710 -126001 -96794 -64877
19687f4877k9657K3187l7502N5684K6720o3337o7874K7950L2523N5244k4486l8814
$$ -64877 -94534 -71347 -108849 -53165 -26445 -89782 -157656 -129706 -97183 -41939 -66425 -105239
19675a05239n1885j1068L1009P662N133L0780J5953J998J4480J222J3730k2795
$$ -105239 -157124 -168192 -137183 -129521 -124388 -93608 -77655 -75657 -61177 -59955 -46225 -69020
19663f9020M169Q6911L1587n4712m3746m8181J1058N7797n7006k0875O2410M2030
$$ -69020 -64851 22060 53647 -1065 -44811 -92992 -81934 -24137 -81143 -102018 -39608 2422
19651B422q589k3562j0782J0261L0441J5459j9980j8532l8375L8126Q1881L002
$$ 2422 -6167 -29729 -40511 -30250 191 15650 -4330 -22862 -61237 -23111 58770 61772
19639F1772j5330o6654l5789k839k1978K2400j3610m8181m3547M2454J8895l3584
$$ 61772 46442 -20212 -56001 -58840 -80818 -58418 -72028 -120209 -163756 -121302 -102407 -135991
19627a35991L7613l6313j3752l4691l8322K0421l3690P205O0442M3015L742l3097
$$ -135991 -98378 -134691 -148443 -183134 -221456 -201035 -234725 -227520 -167078 -124063 -120321 -153418
19615a53418q2508P1452J18975k9774L2125n2818k3203K1639R583K1656J4924
$$ -153418 -235926 -164474 -45499 -75273 -43148 -95966 -119169 -97530 -87947 -66291 -51367
19604e1367m3008J7882J7441j1073m3820M9814p39j1091j7735M1851N7452q9628
$$ -51367 -94375 -76493 -59052 -70125 -113945 -64131 -64870 -75961 -93696 -51845 5607 -84021
19592h4021p2272o633o6229N3865R2986P437o8952J4225M7832m7189j1282M4895
$$ -84021 -156293 -162926 -229155 -175290 -82304 -74867 -143819 -129594 -81762 -128951 -140233 -95338
19580i5338K9307p920m9046m4269o721L1067R1849J08281J47545R0662J17209
$$ -95338 -66031 -73951 -122997 -167266 -173987 -142920 -51071 57210 204755 295417 412626
19569D12626J23355L365k7557K225k9154m9704o2676j39353n0489P6272Q81L1962
$$ 412626 535981 539346 511789 514014 484860 435156 372480 233127 182638 258910 259791 291753
19557B91753J67229o282r6435j13330k7888j9197n5890n1621m4254L4276P9924
$$ 291753 458982 452700 356265 242935 215047 195850 139960 88339 44085 78361 158285
19546A58285j8154M2426Q617o2175r869N4532Q5558J20242J24319R0492J4208
$$ 158285 140131 182557 191174 128999 119130 173662 259220 379462 503781 594273 608481
19535F08481m2322m6540J1846K0090p4748m6599L4927J6508K1452N2915n3053
$$ 608481 566159 519619 531465 551555 476807 430208 465135 481643 503095 556010 502957
19524E02957j35045k4814j26376r4121q1195K5192q947k3385p368P6712L4214
$$ 502957 367912 343098 216722 122601 41406 66598 57651 34266 26898 103610 137824
19513A37824j30353o1130j3056q802O2233j03798k0261L1861K5256k4295r297
$$ 137824 7471 -53659 -66715 -75517 -13284 -117082 -137343 -105482 -80226 -104521 -113818
19502a13818j5957J3708K2064J5066m6401J220O803K0738j00070m6320P132J13285
$$ -113818 -129775 -116067 -94003 -78937 -125338 -124118 -117315 -96577 -196647 -242967 -235835 -122550
19490a22550j0063p4168j6569O8175M0061o4263q1292j7763O3632J00391M5368
$$ -122550 -132613 -206781 -223350 -155175 -115114 -179377 -260669 -278432 -214800 -114409 -69041
19479f9041J3776N5401j9630k0549k1954M5134L0299O3390k8681M5467l5769p0476
$$ -69041 -55265 136 -19494 -40043 -61997 -16863 13436 76826 48145 93612 57843 -12633
19467a2633L135Q141Q3693J23019N1087M8168j22679j2743J5859L6784l9305j9661
$$ -12633 -9498 -1357 82336 205355 256442 304610 181931 169188 185047 221831 182526 162865
19455A62865J4L8175M5799O6973m7033n6250O4716k5897O6921P2868M5991o3834
$$ 162865 162879 201054 246853 313826 266793 210543 275259 249362 316283 389151 435142 371308
19443C71308p1668l6278n9113j05573K0314M8711J18791k203l5558k0016K7380
$$ 371308 299640 263362 204249 98676 118990 167701 286492 284289 248731 228715 256095
19432B56095o7277j28153m3811r9516p5634L5275R8981P7601M0598n1623k7744
$$ 256095 188818 60665 16854 -82662 -158296 -123021 -24040 53561 94159 42536 14792
19421A4792R1476n5201p8135K8949P1713O5769k1256L5730l194P9032R3378j685
$$ 14792 106268 51067 -27068 1881 73594 139363 118107 153837 150643 229675 323053 321368
19409C21368j16722L808K1285J7568N4919l9632K9928O2337N7936k7036m7746
$$ 321368 204646 208454 229739 247307 302226 262594 292522 354859 412795 385759 338013
19398C38013R555J5291m5219j7014k7885j16780m5527m882L1808L6716q954M0840
$$ 338013 347568 362859 317640 300626 272741 155961 110434 105552 137360 174076 165122 205962
19386B05962Q9340M3708n6691j16319o4298j00500k934Q6715J9353J1327o4551
$$ 205962 295302 339010 282319 166000 101702 1202 -1732 84983 104336 115663 51112
19375E1112n4235l6631k2323k803J1645o9356M646L2515j0986n0037M0003O2120
$$ 51112 -3123 -39754 -62077 -64880 -53235 -122591 -117945 -85430 -96416 -146453 -106450 -44330
19363d4330L2872j8390q182L1347n949j05730o9270M5850k8884k1483p2458K1828
$$ -44330 -11458 -29848 -38030 -6683 -12632 -118362 -187632 -141782 -170666 -192149 -264607 -242779
19351b42779j758R890J5818K6558J03784N7520k7783m8359l0565j5953K2204L3147
$$ -242779 -244537 -234647 -218829 -192271 -88487 -30967 -58750 -107109 -137674 -153627 -131423 -98276
19339i8276k0580j2785N7944l2900N8042P5088K5427m5135p9415r1799K6567Q1799
$$ -98276 -118856 -131641 -73697 -106597 -48555 26533 51960 6825 -72590 -164389 -137822 -56023
19327e6023O5644L2768r6678k9950N7083N4762K8454k2213j9986m8008r232k4900
$$ -56023 9621 42389 -54289 -84239 -27156 27606 56060 33847 13861 -34147 -43379 -68279
19315f8279o4350o9063q788P4974K383M4292k474K0360O477K86m0666K2567P1929
$$ -68279 -132629 -201692 -210480 -135506 -133123 -88831 -91305 -70945 -64468 -64182 -104848 -82281 -10352
19302a0352n4874k269m305n665n3410m8247k8231L1794P0079N5166p3159k3310
$$ -10352 -65226 -67495 -71800 -77465 -130875 -179122 -207353 -175559 -105480 -50314 -123473 -146783
19290a46783j2207J2775L1635L9134K7982K6728M3643o7052K7940o3134J4919
$$ -146783 -158990 -146215 -114580 -75446 -47464 -20736 22907 -44145 -16205 -79339 -64420
19279f4420J18372p6853o4236k2944Q3671J32144j5979l8570K76J6468n2349n3464
$$ -64420 53952 -22901 -87137 -110081 -26410 105734 89755 51185 51461 67929 15580 -37884
19267c7884n0706J0396l474k0544J5707l1098k3627k2844O4875L7916R6577O7521
$$ -37884 -88590 -78194 -81668 -102212 -86505 -117603 -141230 -164074 -99199 -61283 35294 102815
19255A02815M5299J7187m5617r6558r3798O1343j6834l7075n22j7701L0978p2250
$$ 102815 148114 165301 119684 23126 -70672 -9329 -26163 -63238 -63760 -81461 -50483 -122733
19243a22733n845O9850M2742L3728J3613r5915r4563j9080N2084L9741O1095Q0722
$$ -122733 -128578 -58728 -15986 17742 31355 -64560 -159123 -178203 -126119 -86378 -25283 55439
19231E5439r072o3322M6755M876o264j5817m1389K3013J709J16088M3507o8334
$$ 55439 46367 -16955 29800 34676 28412 12595 -28794 -5781 -4072 112016 155523 87189
19219H7189k2137o7521k150N4286L1637M8163m6605n1673m2059O8584J9592O285
$$ 87189 65052 -2469 -4619 49667 81304 129467 82862 31189 -10870 57714 77306 83591
19207H3591j6843O1789J0605q8652P049N0455o3378m8437Q2961n9283m0387Q0490
$$ 83591 66748 128537 139142 50490 57539 107994 44616 -3821 79140 19857 -20530 59960
19195E9960j9755j6896p418r735p7715l1358P693K2001q2497Q4847L4392M9411
$$ 59960 40205 23309 15891 6156 -71559 -102917 -95224 -73223 -155720 -70873 -36481 12930
19183A2930P7630q083n6624j08655j21466J10656N9701M3974J3700j01907N2551
$$ 12930 90560 82477 25853 -82802 -204268 -93612 -33911 10063 23763 -78144 -25593
19172b5593O0635k7800n6649J13269L3302q213n8993j9159M8560M6484L220n2228
$$ -25593 35042 7242 -49407 63862 97164 88951 29958 10799 59359 105843 109063 56835
19160E6835j74P7414k5111J1497M8180l9644l8817q9026L9370R2513Q5501j0460
$$ 56835 56661 134075 108964 120461 168641 128997 90180 1154 40524 133037 218538 208078
19148B08078L2120o6679j22124r2411R9009O7467Q1067l5040q8515j18507l97
$$ 208078 240198 173519 51395 -41016 57993 125460 206527 171487 82972 -35535 -35932
19137c5932k7665J7958P9284M2364L2866q4864j441L7561J8089n858m6628N2172
$$ -35932 -63597 -45639 33645 76009 108875 24011 22570 60131 78220 72362 25734 77906
19125G7906Q0196R9289l2935l595K6949J7641l4558j60895m3881Q2614Q9171O3184
$$ 77906 158102 257391 224456 220861 247810 265451 230893 69998 26117 108731 197902 261086
19113B61086P5282P9301K3777O6147J95938K58622K94709K68940P1723j71635
$$ 261086 336368 415669 439446 505593 701531 960153 1254862 1523802 1595525 1423890
19103A423890j58297o2971j62476M1393J00071K11757K62555K26217J48657q5044
$$ 1423890 1265593 1202622 1040146 1081539 1181610 1393367 1655922 1882139 2030796 1945752
19093A945752j60395p822K3739k0724j72464k13694j93773k06638n3657N2110
$$ 1945752 1785357 1777535 1801274 1780550 1608086 1394392 1200619 993981 940324 992434
19083I92434P0489J33697K67418J15169j32034l26176k43589j71389o9477j36978
$$ 992434 1062923 1196620 1464038 1579207 1447173 1120997 877408 706019 636542 499564
19073D99564j85538l2979p654j1043p359N0639Q746M8034J03909k0545o4524m6684
$$ 499564 314026 281047 273393 262350 254991 305630 314376 362410 466319 445774 381250 334566
19061C34566R5063J33927J98294K69237K29674L73789K45664j0k07649k57979
$$ 334566 429629 563556 761850 1031087 1260761 1634550 1880214 1880204 1672555 1414576
19051A414576k06562n6742L075M3373K45255L87230K59378J10136l815Q570J52308
$$ 1414576 1208014 1151272 1154347 1197720 1442975 1830205 2089583 2199719 2195904 2204474 2356782
19040B356782L1924k43415l86534l20218k55087j40768J9443L0356J24496L44100
$$ 2356782 2388706 2145291 1758757 1438539 1183452 1042684 1062127 1092483 1216979 1561079
19030A561079K90750p9387l37425k98589l06204j98568j11706m6040q5240l9439
$$ 1561079 1851829 1772442 1435017 1136428 830224 631656 519950 473910 388670 349231
19020C49231J5308j11666q3775P165J33950Q1333L286m6685L2270J9756j6319
$$ 349231 364539 252873 169098 176263 310213 391546 394832 348147 380417 400173 383854
19009C83854r1274k8421P4077p102N85q5905J2650O1469l7101o4151J19411P8896
$$ 383854 292580 264159 338236 331134 331719 245814 258464 319933 282832 218681 338092 416988
18997D16988o0595K0800K7314K1502N6908k3527j11163R4493R4583Q3952N6126
$$ 416988 356393 377193 404507 426009 482917 459390 348227 442720 537303 621255 677381
18986F77381M4110K6759N7986P4525J10563J35349Q5683J13391J95516K96223
$$ 677381 721491 748250 806236 880761 991324 1126673 1212356 1325747 1521263 1817486
18976A817486K18430J76947K51683K87109K81558K96856M49099N36988N75321
$$ 1817486 2035916 2212863 2464546 2751655 3033213 3330069 3779168 4316156 4891477
18967D891477O91875P35079R44242J161205J284747J658243K115737K856817M182558
$$ 4891477 5583352 6318431 7262673 8423878 9708625 11366868 13482605 16339422 20521980
18958B0521980O258915R516833J3992794J6869374J1370731p12100q711194j0349102
$$ 20521980 26780895 36297728 50290522 67159896 78530627 77818527 69107333 58758231
18950E8758231p670380l227355J449899O276471J1708113J5794928J2245962J801396
$$ 58758231 51087851 47860496 49310395 55586866 67294979 83089907 95335869 97137265
18942I7137265l700668j707831L267322K804075n743765j2765305j4079725j1218786
$$ 97137265 93436597 91728766 94996088 97800163 92056398 79291093 65211368 53992582
18934E3992582o266680j438436L236917Q014605J1500204Q508139k751713j2011105
$$ 53992582 47725902 46287466 49524383 57538988 69039192 77547331 74795618 62784513
18926F2784513j4479194j2694804q936291n689882l610422k462454j743014j005315
$$ 62784513 48305319 35610515 26674224 20984342 17373920 14911466 13168452 12163137
18918A2163137l25919J2819L23718N98057Q38221Q88146J215299J814909K644852
$$ 12163137 11837218 11850037 12173755 12771812 13610033 14498179 15713478 17528387 20173239
18909B0173239L790839N736582Q895928J3430819J8302220J7324590N660764o914610
$$ 20173239 23964078 29700660 38596588 52027407 70329627 87654217 93314981 86400371
18901H6400371j1941661j0916410o361936r84378M501546J0178922J5951353J6722827
$$ 86400371 74458710 63542300 57180364 56195986 60697532 70876454 86827807 103550634
18893A03550634P591931k191880l531515J647364N277241j381034j2181863j6617076
$$ 103550634 111142565 108950685 105419170 107066534 112343775 110962741 98780878 82163802
18885H2163802j5225363j0328113m324719J136469O448936J1435458J2500506
$$ 82163802 66938439 56610326 52285607 53422076 59871012 71306470 83806976
18878H3806976L260981j0101454j6421253j6226492j2508949q363506n458895
$$ 83806976 87067957 76966503 60545250 44318758 31809809 23446303 17987408
18871A7987408l791814k668834j890733j454771j030564p05775n76864n32368
$$ 17987408 14195594 11526760 9636027 8181256 7150692 6444917 5868053 5335685
18863E335685m41280m65477l49615k65060l00965k63609j53122k31639k24341
$$ 5335685 4894405 4428928 4079313 3814253 3513288 3249679 3096557 2864918 2640577
18854B640577k97125k50792j68212r3462n1778j09729j30351o4955n2967j43943
$$ 2640577 2343452 2092660 1924448 1830986 1779208 1669479 1539128 1474173 1421206 1277263
18844A277263j08045j37425j40234R867O4117k0259M715j72917p4331L9008O2756
$$ 1277263 1169218 1031793 891559 901426 965543 945284 949999 777082 702751 741759 804515
18833H04515Q7829o419j24159p4489l3283j1343l9996k4197J2000k5254k8343
$$ 804515 892344 885925 761766 687277 653994 642651 602655 578458 590458 565204 536861
18822E36861r134n0583k6956p6135q4523r543N236Q4702P1031j9339j02406P4966
$$ 536861 527727 477144 450188 374053 289530 279987 285223 369925 440956 421617 319211 394177
18810C94177J02215q4006j2266K703K0186K9811J2311m0521m5505q4541K8070
$$ 394177 496392 412386 400120 402823 423009 452820 465131 424610 379105 294564 322634
18799C22634N4848o1821j03036m82l2119Q2879J64987K527j02403q4461L3371
$$ 322634 377482 315661 212625 212143 180024 262903 427890 430417 328014 243553 276924
18788B76924O4842l5280m1399m0202K5571O1329k5522l1011k0975M1928L2390
$$ 276924 341766 306486 265087 224885 250456 311785 286263 255252 234277 276205 308595
18777C08595R762q0835p6761l1690K6335J3630J0438J40999J58499L16600K00261
$$ 308595 318357 237522 160761 129071 155406 169036 179474 320473 478972 795572 995833
18766I95833r1697p4486k48363k69055j34023o490P7511m129O7904l6934m8451
$$ 995833 904136 829650 581287 312232 178209 171719 249230 245101 313005 276071 227620
18755B27620q1739m7738j492N8611l2046k6483L559K4832l7956O845R1342Q1220
$$ 227620 145881 98143 96651 155262 123216 96733 100292 125124 87168 94013 185355 266575
18743B66575O5114O3624J52889M2956R5089J7888l6098O6633O1288q0342j04341
$$ 266575 331689 395313 548202 591158 686247 704135 668037 734670 795958 715616 611275
18732F11275j28650r1594q5613L4019r223j24732j04606j6476j7819K6699M3339
$$ 611275 482625 391031 305418 339437 330214 205482 100876 84400 66581 93280 136619
18721A36619j4830N5060K6781j1910K7387J00737l8590J6344P6043N8431R2891
$$ 136619 121789 176849 203630 191720 219107 319844 281254 297598 373641 432072 524963
18710E24963J11289O0488J0569l7937L1514J2926l545p5615k39656j46266l6411
$$ 524963 636252 696740 707309 669372 700886 713812 710267 634652 394996 248730 212319
18699B12319o0833P409N8253m9071j07138P818l6456J0812J10223J53159P7975
$$ 212319 151486 158895 217148 168077 60939 68757 32301 43113 153336 306495 384470
18688C84470m4779l5315N2437K2163o5519K8312k4286r5626r8298l8173J7461
$$ 384470 339691 304376 356813 378976 313457 341769 317483 221857 123559 85386 102847
18677A02847o5684p7208J5479K4172K4135K0900n2338J9166j7871O3478J00547
$$ 102847 37163 -40045 -24566 -394 23741 44641 -7697 11469 -6402 57076 157623
18666A57623K2856l9816j7674l6629K1703M6281J5544O1831R5467L6111N9008
$$ 157623 180479 140663 122989 86360 108063 154344 169888 231719 327186 363297 422305
18655D22305m1398o7032j6094R345J7733j02695m7292m5907q9094L6724N2487
$$ 422305 380907 313875 297781 307126 324859 222164 174872 128965 39871 76595 129082
18644A29082k8238o0046p880L8888K3135K5057m8393Q654r244n9880n0525j9373
$$ 129082 100844 40798 32918 71806 94941 119998 71605 80259 71015 11135 -39390 -58763
18632e8763K6888r050o6904k8607N5782q546o9337L4285O4687j9574K1453L9099
$$ -58763 -31875 -40925 -107829 -136436 -80654 -89200 -158537 -124252 -59565 -79139 -57686 -18587
18620a8587P073q8687q2542L1312Q9108J0601K6282k6465n367L6872P8k1911L960
$$ -18587 -11514 -100201 -182743 -151431 -62323 -51722 -25440 -51905 -57272 -20400 -20322 -42233 -38273
18607c8273N624k0997M2165j8581Q499k0077m3509K2145o694M788p4066k8305
$$ -38273 -32649 -53646 -11481 -30062 -21563 -41640 -85149 -63004 -69698 -64910 -138976 -167281
18595a67281Q021L2315M8305L8925L4316m1210q8851o193m2098K284R6789M6831
$$ -167281 -159260 -126945 -78640 -39715 -5399 -46609 -135460 -141653 -183751 -181467 -84678 -37847
18583c7847m020L7935k6922j1510n8578j21716n5593M6308M9162K573m2169J1886
$$ -37847 -41867 -3932 -30854 -42364 -100942 -222658 -278251 -231943 -182781 -180208 -222377 -210491
18571b10491J14670K2969j0862k2523L0034N7935o8600r0457m472R9126N8760
$$ -210491 -95821 -72852 -83714 -106237 -76203 -18268 -86868 -177325 -181797 -82671 -23911
18560b3911K2387J406L0707L2303J2608P7j0678k1426L7798O2129o6130l172N2954
$$ -23911 -1524 -118 30589 62892 75500 75577 64899 43473 81271 143400 77270 74098 127052
18547A27052p0257j09429q7033p9394M108Q9497l721j4683J3588L0523k195L2529
$$ 127052 56795 -52634 -139667 -219061 -214953 -125456 -129177 -143860 -130272 -99749 -101944 -69415
18535f9415l383k3566L1830N3845l0862j1145M2306p7402j29684k8846M3415K0652
$$ -69415 -72798 -96364 -64534 -10689 -41551 -52696 -10390 -87792 -217476 -246322 -202907 -182255
18523a82255K0597L7483Q27K7856N8427l6996L1484Q312n0729P085j4752n0721
$$ -182255 -161658 -124175 -123348 -95492 -37065 -74061 -42577 -34265 -84994 -77909 -92661 -143382
18511a43382j7298K8406L400K4639m646l5725J7807R7816k3154l6563Q121k8448
$$ -143382 -160680 -132274 -128874 -104235 -108881 -144606 -126799 -28983 -52137 -88700 -80579 -109027
18499a09027N360J6438k2318M1662m6172l6171j5849N0884J4624O5162K9704k5717
$$ -109027 -103667 -87229 -109547 -67885 -114057 -150228 -166077 -115193 -100569 -35407 -5703 -31420
18487c1420j37400j30716L4564R3508P0272O7992o7000k8317P2741J01679J5631
$$ -31420 -168820 -299536 -264972 -171464 -101192 -33200 -100200 -128517 -55776 45903 61534
18476F1534q7316j7396L4035M0748K2635j02163j0966L7684j10637l4001m6751
$$ 61534 -25782 -43178 -9143 31605 54240 -47923 -58889 -21205 -131842 -165843 -212594
18465b12594P4387J5652L6876J7643P7439M6372p0555n3957p7562J4233Q0230
$$ -212594 -138207 -122555 -85679 -68036 9403 55775 -14780 -68737 -146299 -132066 -51836
18454e1836L7347L079j2391R7135J43501Q3132J11262p5882p4268K0696M0619
$$ -51836 -14489 -11410 -23801 73334 216835 299967 411229 335347 261079 281775 322394
18443C22394R7203R4233J00708K9793l2002k1301p5272j3061L530k3055l84J13819
$$ 322394 419597 513830 614538 644331 612329 591028 515756 502695 506225 483170 482786 596605
18431E96605k5870k487l3020P1294N2338o950K8610P7830P934L4976m7675j60960
$$ 596605 570735 568248 535228 606522 658860 651910 680520 758350 766284 801260 753585 592625
18419E92625q4300o4831K9957O4361N2028j00999p4581j17924j07286P531L03
$$ 592625 508325 443494 473451 537812 589840 488841 414260 296336 189050 196581 196884
18408A96884R2703Q155J40509J01410K28891M16696M75877K11762j37164l35499
$$ 196884 289587 297742 438251 539661 768552 1185248 1661125 1872887 1735723 1400224
18398A400224l33792j87838q6570p8484j5202R0257J48516J54463N1772n3382
$$ 1400224 1066432 878594 792024 713540 698338 788595 937111 1091574 1143346 1089964
18388A089964q8945K9053J22159Q4569O7409Q7657Q8181K29781K95171L01802
$$ 1089964 1001019 1030072 1152231 1236800 1304209 1391866 1480047 1709828 2004999 2306801
18378B306801N48885N21494O3231m31351n06707l77850j52392o7873l4256J15005
$$ 2306801 2855686 3377180 3440411 3009060 2502353 2124503 1972111 1904238 1869982 1984987
18368A984987K76637N00003K46727k98547m60061n17717m50713l16168j86194
$$ 1984987 2261624 2761627 3008354 2709807 2249746 1732029 1281316 965148 778954
18359G78954j47241p0883l8954o2683m1675l7376p900r920N1165r2552l7484J44017
$$ 778954 631713 560830 521876 459193 417518 380142 372242 362322 413487 320935 283451 427468
18347D27468J64590K10738J98162L93211N19163M22360n9865l06104m31928l82142
$$ 427468 592058 802796 1000958 1394169 1913332 2335692 2275827 1969723 1537795 1155653
18337A155653k82769j34890n1133n7985J51511J60850N9976J7630o5487j39956
$$ 1155653 872884 737994 686861 628876 780387 941237 1001213 1018843 953356 813400
18327H13400r3098p8341r9845n706K2776J11425L8771L6657J19240M6871q6019
$$ 813400 720302 641961 542116 536410 559186 670611 709382 746039 865279 912150 826131
18316H26131j42135j7441l1218m6888n7014j13364j15569o6742m3321n2477K3470
$$ 826131 683996 666555 635337 588449 531435 418071 302502 235760 192439 139962 163432
18305A63432j6168R2062R6637J1929J43289J69645J37483Q3562J37145R6135O4259
$$ 163432 147264 239326 335963 347892 491181 660826 798309 881871 1019016 1115151 1179410
18294A179410Q8162J82793K83897L72912O73061J300948K145371L295779L038476
$$ 1179410 1267572 1450365 1734262 2107174 2780235 4081183 6226554 9522333 12560809
18285A2560809L88895k171831k877469k297436j444461r76107o61205m47545k96795
$$ 12560809 12949704 10777873 7900404 5602968 4158507 3182400 2521195 2073650 1776855
18276A776855k63152j09640n1660L9647J53552K67935K53506L71700L89011J68629
$$ 1776855 1513703 1404063 1352403 1392050 1545602 1813537 2067043 2438743 2827754 2996383
18266B996383O3183J18634L22329P69954J439110J835133J165679j15803k03145
$$ 2996383 3059566 3178200 3500529 4270483 5709593 7544726 8710405 8594602 8391457
18257H391457L25120M86256n78253j531358j590568j108693m97998L705K93209
$$ 8391457 8716577 9202833 8624580 7093222 5502654 4393961 3895963 3899668 4192877
18248D192877K85089m9123k48464j25254p1890K55078M86805L59770M94036O75299
$$ 4192877 4477966 4428843 4180379 4055125 3983235 4238313 4725118 5084888 5578924 6254223
18238F254223R05754J186856J379180J584277K039032K569944L364947M638676
$$ 6254223 7159977 8346833 9726013 11310290 13349322 15919266 19284213 23922889
18230B3922889O519194R331467J3691713J8712416J9885245J1579924J031478
$$ 23922889 30442083 39773550 53465263 72177679 92062924 103642848 104674326
18223A04674326k774782k32253L664960K65616j0209958j7218886j8141543j4953115
$$ 104674326 101899544 101667291 105332251 105597867 95387909 78169023 60027480 45074365
18215D5074365j0400226o759808m651476l225386k207104j501427q11544k36171
$$ 45074365 34674139 27914331 23262855 20037469 17830365 16328938 15517394 15281223
18207A5281223J99771O01208J002720J352325J838804K485122L565411N086518
$$ 15281223 15480994 16082202 17084922 18437247 20276051 22761173 26326584 31413102
18199C1413102P193909J0588324J5263114J9005555J6178884N865854j881765
$$ 31413102 38607011 49195335 64458449 83464004 99642888 105508742 103626977
18192A03626977k478554J303728K961718l864376j3465655j7299218j5805282
$$ 103626977 101148423 102452151 105413869 101549493 88083838 70784620 54979338
18185E4979338j1571140p120896l900776j544749L66626K671864N238646Q763191
$$ 54979338 43408198 36287302 32386526 30841777 31208403 33880267 39118913 47882104
18177D7882104J3439059J6870949J3750863M291136k130337k233570J415141K466638
$$ 47882104 61321163 78192112 91942975 96234111 94103774 91870204 93285345 95751983
18169I5751983m524310j3112118j6273341j4853399j1263918p659024n022701
$$ 95751983 91227673 78115555 61842214 46988815 35724897 28065873 23043172
18162B3043172l387234k405965j643279j151808n95716l0447K88137O65150J000444
$$ 23043172 19655938 17249973 15606694 14454886 13859170 13828723 14116860 14782010 15782454
18153A5782454J307949J741791K378915L418514N185102P622152J1132190J5268616
$$ 15782454 17090403 18832194 21211109 24629623 29814725 37436877 48569067 63837683
18145F3837683J6379801R708178N09022l052762j131622K337698L659q822593
$$ 63837683 80217484 89925662 90434684 87381922 86250300 88587998 88591657 79769064
18137G9769064j5189229j5937057j3050086r129394o135051m033929k758651k025239
$$ 79769064 64579835 48642778 35592692 26463298 20328247 16294318 13535667 11510428
18129A1510428j504753j013786p21483m19585j91560o512L43031O50660P74224
$$ 11510428 10005675 8991889 8270406 7850821 7659261 7652749 7995780 8646440 9420664
18120I420664J021288J220355J222470J458314K057129L126725N204047Q629708
$$ 9420664 10441952 11662307 12884777 14343091 16400220 19526945 24730992 33360700
18112C3360700J5225959K8138629M7331518L7317610j6556158l6349021l7017803
$$ 33360700 48586659 76725288 124056806 161374416 144818258 108469237 71451434
18105G1451434k7076379j5124676q188900n116671l660734k566010j742696j190505
$$ 71451434 44375055 29250379 21061479 15944808 12284074 9718064 7975368 6784863
18097F784863r29021p04339o49670o09686m40403l15036k27764k64515j00010
$$ 6784863 5855842 5151503 4501833 3892147 3451744 3136708 2908944 2644429 2544419
18088B544419j32310k05552r2433j10605k47824j33361p9115m3471q0923L797
$$ 2544419 2412109 2206557 2114124 2003519 1755695 1622334 1543219 1499748 1418825 1422622
18078A422622n7048p6487p898j05365M566j2970Q2693P2924m1531j58974j20667
$$ 1422622 1365574 1289087 1281189 1175824 1180390 1167420 1250113 1323037 1281506 1122532 1001865
18067A001865j11002K6779N6158J2549J6924K1265j07805r7924l3061k6255j7435
$$ 1001865 890863 917642 973800 986349 1003273 1024538 916733 818809 785748 759493 742058
18056G42058l7426k5794J8751r211m3694j5810J3589J5544J13666L234p9147j07659
$$ 742058 704632 678838 697589 688378 644684 628874 642463 658007 771673 774907 695760 588101
18044E88101O2057N6919k3741o3817n0579o0180q4726j0956o9445p5871k4182
$$ 588101 650158 707077 683336 619519 568940 508760 424034 413078 343633 267762 243580
18033B43580k3954l697j3870M5134O3979l1179j3659R5825J1140p8992Q7077M7204
$$ 243580 219626 215929 202059 247193 311172 279993 266334 362159 373299 294307 381384 428588
18021D28588l8092J274q811j02222l1662m2997J4296Q1249O3159q8652k0910P3035
$$ 428588 390496 391770 382959 280737 249075 206078 220374 301623 364782 276130 255220 328255
18009C28255Q9272l2791k7454k3398l0172k0884O0918R489J8887l7472q2888j955
$$ 328255 417527 384736 357282 333884 303712 282828 343746 353235 372122 334650 251762 249807
17997B49807J5255j4816O4206Q483P375m301o1788L7618O2427Q2307P6571k5381
$$ 249807 265062 250246 314452 322935 330310 326009 264221 301839 364266 446573 523144 497763
17985D97763o3314M3111L2717l7549M281P6600J5660m7882q4139j9258L8924j4868
$$ 497763 434449 477560 510277 472728 477009 553609 569269 521387 437248 417990 456914 442046
17973D42046j01539m8399k2247m2773Q598K2453J7384o456n6753m3378K755j9416
$$ 442046 340507 292108 269861 227088 235686 258139 275523 269067 212314 168936 171691 152275
17961A52275n3596Q7242J3633R7192J17206P1393Q2723J68246P2964J1350q530
$$ 152275 98679 185921 199554 296746 413952 485345 568068 736314 809278 820628 812098
17950H12098j246K1815M8070L5770j1408P2467L337m1506n7614Q3455O4817R4935
$$ 812098 810852 832667 880737 916507 905099 977566 980903 939397 881783 965238 1030055 1124990
17938A124990J91202L11460J60358j63380j36994q6511p2228j01401m7620K2177
$$ 1124990 1316192 1627652 1788010 1624630 1487636 1401125 1328897 1227496 1179876 1202053
17928A202053J5903R5405J27973N7786K37283L79460N10472O48331N55944N37020
$$ 1202053 1217956 1313361 1441334 1499120 1736403 2115863 2626335 3274666 3830610 4367630
17918D367630Q49393L14408p32894j025691q35246m09331j06525O8715R1011J18167
$$ 4367630 5217023 5531431 4798537 3772846 2937600 2528269 2421744 2490459 2581470 2699637
17908B699637J40022J05982R667L6803Q9077M5201K26222L63613M50005N49972
$$ 2699637 2839659 2945641 2955308 2992111 3081188 3126389 3352611 3716224 4166229 4716201
17898D716201O89773Q83630R31156N32632O48754Q87045N01507J92429J76436
$$ 4716201 5405974 6289604 7220760 7753392 8402146 9289191 9790698 9983127 10159563
17889A0159563O62021J450005K185502J820678J352121J310989J609786K255389
$$ 10159563 10821584 12271589 14457091 16277769 17629890 18940879 20550665 22806054
17881B2806054L526371N707579R431149J6427330K9140832M9268070N8199789
$$ 22806054 26332425 32040004 41471153 57898483 87039315 136307385 194507174
17874A94507174J5732808l3948658m7620241m2694152k8010160j4886087p248764
$$ 194507174 210239982 176291324 128671083 85976931 57966771 43080684 35831920
17867C5831920l527486k164357j439143Q5909K272628L730506L733841L957896
$$ 35831920 32304434 30140077 28700934 28786843 31059471 34789977 38523818 42481714
17859D2481714M388655N323714P727882J2083402J8851536L0796556N3389437
$$ 42481714 46870369 52194083 59921965 72005367 90856903 121653459 175042896
17852A75042896R3227134J38831228J06282222k8058980j06256042j17051268
$$ 175042896 268270030 407101258 513383480 485324500 379068458 262017190
17846B62017190r2288195n6762639l1892640j8909101j2375179q888043o662362
$$ 262017190 169728995 112966356 81073716 62164615 49789436 40901393 34239031
17839C4239031m641904l017500j655785o70817P8294M25288J039355K017543K625320
$$ 34239031 29597127 26579627 24923842 24253025 24331319 24756607 25795962 27813505 30438825
17830C0438825K637838L039040L659074M374664N680722P916617J1790488J8347081
$$ 30438825 33076663 36115703 39774777 44149441 49830163 57746780 69537268 87884349
17822H7884349K9341955M9951107Q8382102J43875104J29081830k6754267j10724437
$$ 87884349 117226304 167177411 255559513 399434617 528516447 501762180 391037743
17815C91037743j21733483r6212522n7613736l1533698j8365662j1592809p412205
$$ 391037743 269304260 173091738 115478002 83944304 65578642 53985833 46573628
17808D6573628m726559l090161j756364j774262j892880j474767o10191Q82874
$$ 46573628 41847069 38756908 37000544 35226282 33333402 31858635 31248444 32131318
17800C2131318K245331M413640P755440J3663251K4929478M5349942O4460161
$$ 32131318 34376649 38790289 46545729 60208980 85138458 130488400 194948561
17793A94948561K5725062l5302465n0014150m6648792l1208455j7077474r333285
$$ 194948561 220673623 185371158 135357008 88708216 57499761 40422287 31089002
17786C1089002n653946m220897l521167k638818j786350j108649j022963j207698
$$ 31089002 25435056 21214159 17692992 15054174 13267824 12159175 11136212 9928514
17778I928514j151773r99052p74914o12266l76109k80542k79386k03750j92124
$$ 9928514 8776741 7777689 7002775 6390509 6014400 5733858 5454472 5250722 5058598
17769E058598k73547k02296j94202k24789m8248n1344J17649L56664K52906k56534
$$ 5058598 4785051 4582755 4388553 4163764 4115516 4064172 4181821 4538485 4791391 4534857
17759D534857m95488m16515m18261l03431m6738q0862j64112j54389j20942j41048
$$ 4534857 4039369 3622854 3204593 2901162 2854424 2773562 2609450 2455061 2334119 2193071
17749B193071n4434q4046q7614l4532j6201J669q4371o7502m067q349l8343L6621
$$ 2193071 2138637 2054591 1966977 1932445 1916244 1917913 1833542 1766040 1761973 1753624 1715281 1751902
17737A751902k608p2691r0381p0880n7659N091O2263n289K1232M8326N9559p997
$$ 1751902 1749294 1676603 1586222 1515342 1457683 1462774 1525037 1519748 1540980 1589306 1648865 1640868
17725A640868N1883l2284p4692o5556q3528j05530l7691K2172L1341l6478K7941
$$ 1640868 1692751 1660467 1585775 1520219 1436691 1331161 1293470 1315642 1346983 1310505 1338446
17714A338446o9629r1304q863l1851K0302k125R3929J07136P3011K3961j7613
$$ 1338446 1268817 1177513 1168650 1136799 1157101 1154976 1248905 1356041 1429052 1453013 1435400
17703A435400J7166P3979l4278Q0710M7669l1146m6512p0130n7139j17750j11210
$$ 1435400 1452566 1526545 1492267 1572977 1620646 1589500 1542988 1472858 1415719 1297969 1186759
17692A186759k6757j04325p2055l3757k3885n4188m5383O284K1536q1697m79L2473
$$ 1186759 1160002 1055677 983622 949865 925980 871792 826409 832693 854229 772532 772053 804526
17680H04526n8842P484N2123M516n1985J10784J22624Q4970Q6968J02471M8553
$$ 804526 745684 753168 805291 809807 757822 868606 991230 1076200 1163168 1265639 1314192
17669A314192j0609k7233l1407r6493r1406p2830o6714l3448n7388q0440l1637
$$ 1314192 1303583 1276350 1244943 1148450 1057044 984214 917500 884052 826664 746224 714587
17658G14587J2869k5759J12614P9454J40995J11187L2330n805n230p1513n1911
$$ 714587 727456 701697 814311 893765 1034760 1145947 1178277 1172472 1167242 1095729 1043818
17647A043818J30841n1743n9852j12482q4638r061n5171N1887p5389r7943l1189
$$ 1043818 1174659 1122916 1063064 950582 865944 856883 801712 853599 778210 680267 649078
17636F49078J0142r8112m3225N1158O9723R5328N4493n0726q1726p0220K3754
$$ 649078 659220 561108 517883 569041 638764 734092 788585 737859 656133 585913 609667
17625F09667J33761R8782L9955L6472L2959N0848J0713P9137k7502O0179o3504
$$ 609667 743428 842210 882165 918637 951596 1002444 1013157 1092294 1064792 1124971 1061467
17614A061467j12756j24132p5576j37736j86052j5366N9406k441M2668M0001M016
$$ 1061467 948711 824579 749003 611267 425215 409849 469255 466814 509482 549483 553499
17603E53499o7639j35994M4424R2973k4448r1310J7009N5290J5194j3067p6711
$$ 553499 485860 349866 394290 487263 462815 371505 388514 443804 458998 445931 369220
17592C69220m1781j3432l4338J3486K5965L4217M3794o5389k7835j1415j3484
$$ 369220 327439 314007 279669 293155 319120 353337 397131 331742 303907 292492 279008
17581B79008K6037M0895P3528J12294N5940r7365n8585p551l7872l6942j0229
$$ 279008 305045 345940 419468 531762 587702 490337 431752 424201 386329 349387 339158
17570C39158M7871N8416O859q696L4450m3099k1713j8085r956O493O4347p3844
$$ 339158 387029 445445 452304 443608 478058 434959 413246 395161 385205 391698 456045 382201
17558C82201j14642n7240o6903N9826K4569J02183M8473J3718K9058n4036q5219
$$ 382201 267559 210319 143416 203242 227811 329994 378467 392185 421243 367207 281988
17547B81988l5079J7067N6591M5695j9651n5177m2136n0796p0009j170J3128K9802
$$ 281988 246909 263976 320567 366262 346611 291434 249298 198502 128493 127323 140451 170253
17535A70253O2956K0543J9437O0478O7140m6511k9290l4984p7389p7181R917O7078
$$ 170253 233209 253752 273189 333667 400807 354296 325006 290022 212633 135452 145369 212447
17523B12447J9788J8356K442p13N3110l7983j6897l4896J5474m4848O7144K4800
$$ 212447 232235 250591 253033 252320 305430 267447 250550 215654 231128 186280 253424 278224
17511B78224k2515L8534o6110Q3140P0242m8273n4773N6563q4354p1664Q8339
$$ 278224 255709 294243 228133 311273 381515 333242 278469 335032 250678 179014 267353
17500B67353J2574k8881m7917m7591q0251o0820M1347M6351N0480k5866M6088
$$ 267353 279927 251046 203129 155538 75287 14467 55814 102165 152645 126779 172867
17489A72867j705K6293K4813K6715m75j0104J65n9826K824q8014l9653o7299m9100
$$ 172867 171162 197455 222268 248983 248508 238404 238569 178743 181567 93553 53900 -13399 -62499
17476f2499l6880j2372J35562J19408N1482k2947o2306L977P8940j1413r2900
$$ -62499 -99379 -111751 23811 143219 194701 171754 109448 113425 192365 180952 88052
17465H8052q3003k3970O1714k7665M0382K4743K4452P8411R4266o1539J0264O3341
$$ 88052 5049 -18921 42793 15128 55510 80253 104705 183116 277382 215843 226107 289448
17453B89448j1665q0786j1511J15058K9574m327o379M1162J97478K41753K39030
$$ 289448 277783 196997 185486 300544 330118 325791 319412 360574 558052 799805 1038835
17442A038835l2013j59075k33555k15311j65037r4692Q7441j222q3452m7139L9732
$$ 1038835 1006822 847747 614192 398881 233844 139152 226593 225371 141919 94780 134512
17431A34512K6985R1285j7637q1431j902m7965l7302R1558J7076m420k818K6960
$$ 134512 161497 252782 235145 153714 151812 103847 66545 158103 175179 170759 167941 194901
17419A94901j353o0967p1519k211J21140M6962m5784j8325j1186Q0M1857Q9811
$$ 194901 193548 132581 61062 58851 179991 226953 181169 162844 151658 151738 193595 283406
17407B83406K5831m5665j9230j09257p4636k2582L6574K6192L8184o006L8720
$$ 283406 309237 263572 244342 135085 60449 37867 74441 100633 138817 132811 171531
17396A71531P6197k4523J6748J0847O7014q057l148n3551K0040L4912r6533j38438
$$ 171531 247728 223205 239953 250800 317814 309757 306609 253058 273098 308010 211477 73039
17384G3039k1359J03439O2827r8211l3072l096O559j0691K4674J35339l9960j47483
$$ 73039 51680 155119 217946 119735 86663 83567 90126 79435 104109 239448 199488 52005
17372E2005j8263J13632Q7859o2855j0181J9492k8276J24109Q2868J9906n6303
$$ 52005 33742 147374 235233 172378 162197 181689 153413 277522 360390 380296 323993
17361C23993j09146J1908N0853K8438j7234q7304j19142r2005K0172Q0069O2788
$$ 323993 214847 226755 277608 306046 288812 201508 82366 -9639 10533 90602 153390
17350A53390k0931P7604l1753l3762K3592N1294M5204P1013O3220K6005N9600
$$ 153390 132459 210063 178310 144548 168140 219434 264638 335651 398871 424876 484476
17339D84476J70111L43201N19988M27036J73482k70599m77849m36453k62326q0682
$$ 484476 654587 997788 1517776 1944812 2118294 1847695 1369846 933393 671067 590385
17329E90385m9083q9801k2042l7924j5980M2701j9954m8785o3772J9328O9686
$$ 590385 541302 451501 429459 391535 375555 418256 398302 349517 285745 305073 374759
17318C74759P1423k2611J08931J32897J70805L09959M32431L83128j26118l37804
$$ 374759 446182 423571 532502 665399 836204 1146163 1578594 1961722 1835604 1497800
17308A497800m34525k94302k04063j45071o9345j7950p070L0455l9499j09274
$$ 1497800 1063275 768973 564910 419839 350494 332544 325474 355929 316430 207156
17298B07156n4298O7005k5353p2058j224K819K4617O3681p014k1007L6J9210r972
$$ 207156 152858 219863 194510 122452 121228 124047 148664 212345 205331 184324 184360 203570 193598
17285A93598j0909N9681M6641m3451m6824l3215k8387J5486J2875J13877M7329
$$ 193598 182689 242370 289011 245560 198736 165521 137134 152620 165495 279372 326701
17274C26701J5993R3390J42258K26084L77425N29841K35044k56769m17677l56389
$$ 326701 342694 436084 578342 804426 1181851 1711692 1946736 1689967 1272290 915901
17264I15901k68232j54566j39371p4639j9450P3935M4109j14968j8778n1978J03708
$$ 915901 647669 493103 353732 279093 259643 333578 377687 262719 243941 191963 295671
17253B95671m624N4556j0324K8230J36968J54012J55637K80100M09281L78719
$$ 295671 291047 345603 335279 363509 500477 654489 810126 1090226 1499507 1878226
17243A878226j2575l05975m30812l62287j75490j82372p7020m0535n1789o0897
$$ 1878226 1865651 1559676 1128864 766577 591087 408715 331695 291160 239371 178474
17233A78474O0783L230J6065q8073j0399J01261K979j15914l6726k559N3245K7959
$$ 178474 239257 242487 258552 170479 160080 261341 264320 148406 111680 109121 162366 190325
17221A90325m3193l7619M5810N2389k3558M7276J202r0842j7423j0728j4710L0641
$$ 190325 147132 109513 155323 207712 184154 231430 232632 141790 124367 113639 98929 129570
17209A29570k4131j8203O3943K6001k8074r3724o2261L2143P0554O901l3931n7809
$$ 129570 105439 87236 151179 177180 149106 55382 -6879 25264 95818 102719 68788 10979
17197A0979J0793L6880N6412j8977m5596N5599O4149l4977P200L2114n060k1962
$$ 10979 21772 58652 115064 96087 50491 106090 170239 135262 142462 174576 169516 147554
17185A47554k5983l562k0856j9528j4506o7992K9183M2623L1941L5129J9623p7585
$$ 147554 121571 118009 97153 77625 63119 -4873 24310 66933 98874 134003 153626 76041
17173G6041N9110K3632j52964m2060M9894P244J4966R2124K2041K6332l2870j7651
$$ 76041 135151 158783 5819 -36241 13653 20897 35863 127987 150028 176360 143490 125839
17161A25839m1760O6884l8550m7357J2546P3798M6415o6902M218p3301j8674R6800
$$ 125839 84079 150963 112413 65056 77602 151400 197815 130913 135131 61830 43156 139956
17149A39956J5800p7879j7222J4579L962M3262l769m0323k4971Q8023R1026q6537
$$ 139956 155756 77877 60655 75234 79196 122458 118689 78366 53395 141418 232444 145907
17137A45907o5327J108N7294k131j6246l1703K0389Q0384J1657j29602M7359j3928
$$ 145907 80580 81688 138982 136851 120605 88902 109291 189675 201332 71730 119089 105161
17125A05161m5661L187n9279N9775L3312k3708N0155l4205l6790K1961Q5520m7216
$$ 105161 59500 62687 3408 63183 96495 72787 122942 88737 51947 73908 159428 112212
17113A12212l7500k8220Q8729M1700o4984r6888p8180N5784J01385R5860l8983
$$ 112212 74712 46492 135221 176921 111937 15049 -63131 -7347 94038 189898 150915
17102A50915j1979L5788N535j28865N734O5854k8161n1979N278J0282m2970P480
$$ 150915 138936 174724 180259 51394 57128 122982 94821 42842 48120 58402 15432 22912
17090B2912P8750L7654K56m0107q7466o0607J11392L8142R246K6895p6202o3834
$$ 22912 101662 139316 139572 99465 11999 -48608 62784 100926 110172 137067 60865 -2969
17078b969O913l444k525J7776M2655L3139m698n3820Q441N0583p0951r054J9746
$$ -2969 3944 500 -2025 15751 58406 91545 86847 33027 41468 92051 21100 12046 31792
17065C1792K8882J6072o593m7084P328K3706J4503Q4905m8889l5618j06878p2678
$$ 31792 60674 76746 70153 23069 30397 54103 68606 153511 104622 69004 -37874 -110552
17053a10552r163N6119N6727J6870N1517L608n251j1580Q0440J2740J0813M4896
$$ -110552 -119715 -63596 -6869 10001 61518 65126 59875 48295 128735 141475 152288 197184
17041A97184m9441K3871j12843j05158l5851L3207N8020J21303Q088K4478m5910
$$ 197184 147743 171614 58771 -46387 -82238 -49031 8989 130292 138380 162858 116948
17030A16948o6812k5847K8978M8966j533K2692K4809J0102j1938n631K6942k7372
$$ 116948 50136 24289 53267 102233 100700 123392 148201 158303 146365 140734 167676 140304
17018A40304m5131m204L1781o5187j34620j5751R2549N0831l2976o797j7734J2020
$$ 140304 95173 90969 122750 57563 -77057 -92808 -259 50572 17596 10799 -6935 5085
17006E085J3901M1757L957O565n7329r017M144L2559n0068k196K9380K6320p2462
$$ 5085 18986 60743 64700 71265 13936 4919 9063 41622 -8446 -10642 18738 45058 -27404
16993b7404m2563N2782j5236J3057J0748j06597O342M9145N067K8164j440j2967
$$ -27404 -69967 -17185 -32421 -19364 -8616 -115213 -108871 -59726 -54659 -26495 -27935 -40902
16981d0902j0099K3037N5204M9686m5682p8770N0385O7845M7853P190j4584l9142
$$ -40902 -51001 -27964 27240 76926 31244 -47526 2859 70704 118557 125747 111163 72021
16969G2021m7970M9830M7421l004K6314k2009K5269r9820p7152L6601J26960l6299
$$ 72021 24051 73881 121302 118298 144612 122603 147872 48052 -29100 7501 134461 98162
16957I8162J5367L7535M9963j420m8437P329J8799k0421M0413j0570l5881j01222
$$ 98162 113529 151064 201027 199607 151170 158499 177298 156877 197290 186720 150839 49617
16945D9617n681m1270J8391r978N9329N1303m0207l3140r2667J6746Q3407l9220
$$ 49617 43936 2666 21057 11079 70408 121711 81504 48364 -44303 -27557 55850 16630
16933A6630l1868J1782J2007j2678L4208P6185l1146q3530j9914m8737O0561J1210
$$ 16630 -15238 -3456 8551 -4127 30081 106266 75120 -8410 -28324 -77061 -16500 -5290
16921e290L4530K4985m6753k0092q291Q6179O0802j8495K4295n1824m0142P1902
$$ -5290 29240 54225 7472 -12620 -20911 65268 126070 107575 131870 80046 39904 111806
16909A11806Q898j48975n4772M6593Q9620N4324p5379n002l7621j400O0746P7607
$$ 111806 120704 -28271 -83043 -36450 53170 107494 32115 27113 -10508 -11908 48838 126445
16897A26445P121m0270n6254k8475k523K5524L9541Q807l5819m9277K3918O2489
$$ 126445 133566 93296 37042 8567 6044 31568 71109 79916 44097 -5180 18738 81227
16885H1227R3283L1426o0824q0062l3136L5017K5175p810j7129R9870j613j90180
$$ 81227 174510 205936 145112 65050 31914 66931 92106 84296 67167 167037 165424 -24756
16873b4756j36765K383O1779O3022L7474L2626K5339L5171k390n9197m9934n9325
$$ -24756 -161521 -159138 -97359 -34337 3137 35763 61102 96273 93883 34686 -15248 -74573
16861g4573j0184P1768P8904N1524o2222m6609q5493p3708K9162O6087L3199l2679
$$ -74573 -84757 -12989 65915 117439 55217 8608 -76885 -150593 -121431 -55344 -22145 -54824
16849e4824M2658J8879M057M0686N3760K2730o1281q7135m0509Q6955l4773l7845
$$ -54824 -12166 6713 10770 51456 105216 127946 66665 -20470 -60979 25976 -8797 -46642
16837d6642K8949j6231M0261j1998N1088l1399M3324R6383k9253o5485q6737m4623
$$ -46642 -17693 -33924 6337 -5661 45427 14028 57352 153735 124482 58997 -27740 -72363
16825g2363O6227L417p4305L3047P9738P259m4604M6352J08303M7432p6840K8291
$$ -72363 -6136 -2719 -77024 -43977 35761 43020 -1584 44768 153071 200503 123663 151954
16813A51954N7660J19o4312n0341l2872M667J6945r0726m322K6819M6649N0801
$$ 151954 209614 209733 145421 95080 62208 66875 83820 -6906 -11228 15591 62240 113041
16801A13041J8620r308p779n7595o9554L3527J5422l1912k1108j11186q884M8675
$$ 113041 131661 122353 114574 56979 -12575 20952 36374 4462 -16646 -127832 -136716 -88041
16789h8041R1948M8661o6747J10278J13241j5934L817j6575l0848o5934J7354
$$ -88041 3907 52568 -14179 96099 209340 193406 197223 180648 149800 83866 101220
16778A01220k4572O740m9460j37262L0168J7611M753l046L0235P5246P2306j6505
$$ 101220 76648 83388 33928 -103334 -73166 -55555 -50802 -53848 -23613 51633 123939 107434
16766A07434l392J704l7131K4734o6797j31509L0307J04J9776K9827N0877L1678
$$ 107434 104042 105746 68615 93349 26552 -104957 -74650 -74546 -54770 -24943 25934 57612
16754E7612J6986l5118n8365L8769K619p9644j7706Q9006O0895K39K9474p828
$$ 57612 74598 39480 -18885 19884 22503 -57141 -74847 14159 75054 75293 104767 96939
16742I6939m0157k8893N999J15594M0570n821j4425m4612j17606m4425Q6105J3401
$$ 96939 56782 27889 33888 149482 190052 184231 169806 125194 7588 -36837 49268 62669
16730F2669K8213N086j6496j3376J19233k5026o9487J7041K2047J958l4715r790
$$ 62669 90882 95968 79472 66096 185329 160303 90816 107857 129904 131862 97147 87357
16718H7357L7530o2440p6265O7999L4617r9074k3146O3776Q546j8862K2621j660
$$ 87357 124887 62447 -13818 54181 88798 -10276 -33422 30354 38900 20038 42659 40999
16706D0999j773l5458l7040J0321L5366j5132k0974j1946M0539M336J5041J239
$$ 40999 39226 3768 -33272 -22951 12415 -2717 -23691 -35637 4902 9238 24279 25518
16694B5518K9088r0461o2240J6059J01705P2522j4233r2261l1038N2795q329q9802
$$ 25518 54606 -35855 -98095 -82036 19669 92191 77958 -14303 -45341 7454 -875 -90677
16682i0677P5022R2439n417j4305k7546K0259m9612j8439k4183M1412K8966q4555
$$ -90677 -15655 76784 71367 57062 29516 49775 163 -18276 -42459 -1047 27919 -56636
16670e6636m7121j5867M1443O6227m2459J1426O7781P2367J8014n0305o2811J0549
$$ -56636 -103757 -119624 -78181 -11954 -54413 -42987 24794 97161 115175 64870 2059 12608
16658A2608k66n8099j5764k0770o6020l464K1905n369Q100m928P878N8881m7937
$$ 12608 12342 -45757 -61521 -82291 -148311 -151775 -129870 -135239 -127139 -132067 -124189 -65308 -113245
16645a13245J9693J03823L3766j16888j46867K5561L4739n856J1097J06625O7457
$$ -113245 -93552 10271 44037 -72851 -219718 -194157 -159418 -165274 -154177 -47552 19905
16634A9905L5829K3724k0520N879j5906l4501l3520j1623m1263n6265K9717N6299
$$ 19905 55734 79458 58938 64817 48911 14410 -19110 -30733 -71996 -128261 -98544 -42245
16622d2245L4225p8448l0777L5342N3061P6277J32101n0238n6990K1336l3145
$$ -42245 -8020 -86468 -117245 -81903 -28842 47435 179536 129298 72308 93644 60499
16611F0499n5300K3564K2986k0452o3948j5361p640l323K9525k8359N2042O7565
$$ 60499 5199 28763 51749 31297 -32651 -48012 -55652 -58975 -29450 -57809 -5767 61798
16599F1798N465n7034L6005q8250p4231M1691M290J805O40J3256J08222K3037
$$ 61798 67263 10229 46234 -42016 -116247 -74556 -70266 -68461 -67821 -54565 53657 76694
16587G6694p4620n2255m830L1646Q428M2235R603N4298K284o8589j08637j6321
$$ 76694 2074 -50181 -55011 -23365 -14937 27298 36901 91199 93483 24894 -83743 -100064
16575a00064R5921J9941j06M9893m5372j034L5862r624j7877l982K8514O5965
$$ -100064 -4143 15798 15692 65585 20213 19179 55041 45417 27540 23558 52072 118037
16563A18037P9865P691m1524K698L2170j10469j59805n5360N6674J688j3682L234
$$ 118037 197902 205593 164069 166767 198937 88468 -71337 -126697 -70023 -68335 -82017 -78783
16551g8783l1321L1813m3547M4408K1971J8616J608Q5290L5827n6872J0861L5046
$$ -78783 -110104 -78291 -121838 -77430 -55459 -36843 -35235 50055 85882 29010 39871 74917
16539G4917o7826n119N8304M2962r778j9693r796R7942N686q5856m6344j0160
$$ 74917 7091 1972 60276 103238 93460 73767 63971 161913 167599 81743 35399 25239
16527B5239l779k4147O4756J0101p010l1143M286p566j15689Q771L0560K9083
$$ 25239 21460 -2687 62069 72170 65160 34017 38303 30737 -84952 -76181 -45621 -16538
16515a6538K1128J08696L9874n1223l5722J8301q2616n0814P821M6649m1977l0235
$$ -16538 4590 113286 153160 101937 66215 84516 1900 -48914 -41093 5556 -36421 -66656
16503f6656k8276Q145M9875P8909j3824j00647P776L6600k6072j5950n4602j19059
$$ -66656 -94932 -86787 -36912 41997 28173 -72474 -64698 -28098 -54170 -70120 -124722 -243781
16491b43781Q6394O9623J0730k7140j3407N6563R850o6082k2935j2682j5880m5858
$$ -243781 -157387 -87764 -77034 -104174 -117581 -61018 -51168 -117250 -140185 -152867 -168747 -214605
16479b14605N2862J17458P2277m8992r998L1822N3157l2702n6405k5771O7228
$$ -214605 -161743 -44285 27992 -21000 -30998 824 53981 21279 -35126 -60897 6331
16468F331O9613n5948J0705p2312M0051L3789n8072L891q446j0485P71J2726m9928
$$ 6331 75944 19996 30701 -41611 -1560 32229 -25843 -21952 -30398 -40883 -40112 -27386 -77314
16455g7314j2493P1593K9386P6095N9905J4268m8063l9908l8586k3681O1873M8419
$$ -77314 -89807 -18214 11172 87267 147172 161440 113377 73469 34883 11202 73075 121494
16443A21494k1814o9900j07322k8533R221L0459R6665o0061m9608J2394K7842
$$ 121494 99680 29780 -77542 -106075 -96854 -66395 30270 -29791 -79399 -67005 -39163
16432c9163O1977L2470O7786N4864m3887n6133n8414p2141M3417k6162k4806j1580
$$ -39163 22814 55284 123070 177934 134047 77914 19500 -52641 -9224 -35386 -60192 -71772
16420g1772o0756n238K8451P1540J7666K4744q8218K5965k1318j9278R5481N3532
$$ -71772 -132528 -137766 -109315 -37775 -20109 4635 -83583 -57618 -78936 -98214 -2733 50799
16408E0799l9469k2406O7485O9782m4314l9610o2418k5265K2809l313K7799K5921
$$ 50799 11330 -11076 56409 126191 81877 42267 -20151 -45416 -22607 -25920 1879 27800
16396B7800k9724K2615P9307J0391K8038m1378n7270N2428L9386o302J3042K2532
$$ 27800 -1924 20691 99998 110389 138427 97049 39779 92207 131593 125291 138333 160865
16384A60865o2987j03684m6321P3252J02967o5071o7269l6639J8817J8573L2113
$$ 160865 97878 -5806 -52127 21125 124092 59021 -8248 -44887 -26070 -7497 24616
16373B4616k678q9034k5444O7515K6189n6101j11067L8162N6112J9456L3269M7121
$$ 24616 21938 -67096 -92540 -25025 1164 -54937 -166004 -127842 -71730 -52274 -19005 28116
16361B8116j3845K8383k2254p215N676M3203J8998j1554k7569l26P2999J7591
$$ 28116 14271 42654 20400 13185 18861 62064 81062 69508 41939 41613 114612 132203
16349A32203k27k6933n4148l3056j6311J5042j7088J0574o3236j17439M6272O6606
$$ 132203 131976 105043 50895 17839 1528 16570 -518 10056 -53180 -170619 -124347 -57741
16337e7741K0286J1630l632J0661m195k6530L8335P7933j0739n534k8093j0952
$$ -57741 -37455 -25825 -29457 -18796 -22991 -49521 -11186 66747 56008 50474 22381 11429
16325A1429l4922O5485O221j04356J411L9927m0551J0493K4836J18421M6770L7704
$$ 11429 -23493 41992 48213 -56143 -54732 -14805 -55356 -44863 -20027 98394 145164 182868
16313A82868q146p7452J1029j1422p9187j09799M529L4087N8516p68K7146K1932
$$ 182868 174722 97270 108299 96877 17690 -92109 -87580 -53493 5023 4255 31401 53333
16301E3333m83j07959p5427L5787N7550J8247P948O0524n4914n190J13225l114
$$ 53333 52850 -55109 -130536 -94749 -37199 -18952 -11004 49520 -5394 -10584 102641 99527
16289I9527l1750M1585L6175l8858n4855K550N3260l1632m4963m7591l7803l3646
$$ 99527 67777 109362 145537 106679 51824 54374 107634 76002 31039 -16552 -54355 -88001
16277h8001O2168R760j9228L5310L765O6005n5513o2750M9745M0365l4335M6225
$$ -88001 -25833 -16073 -35301 9 3774 69779 14266 -48484 1261 41626 7291 53516
16265E3516K6407j2796j9316j01025L6397N4141j6343N8577J2303r1224m2981
$$ 53516 79923 67127 47811 -53214 -16817 37324 20981 79558 91861 637 -42344
16254d2344K2391k890Q5086L5489K3204L839l6723k8002k5801j6708O2801j7926
$$ -42344 -19953 -22843 62243 97732 120936 124775 88052 60050 34249 17541 80342 62416
16242F2416m5731O835J3264k2563k3814n1905J0138K4229J9507n6897M4627k4122
$$ 62416 16685 23520 36784 14221 -9593 -61498 -51360 -27131 -7624 -64521 -19894 -44016
16230d4016J2573Q957l6572J3339O3470L7251j5278O3133O1340p0754M4186k2911
$$ -44016 -31443 -22486 -59058 -45719 17751 55002 39724 102857 164197 93443 137629 114718
16218A14718o1785l3146k7879M8821p925o3695M4243j4246n0013Q1959O0698l2572
$$ 114718 52933 19787 -8092 40729 32804 -30891 13352 -894 -50907 31052 91750 59178
16206E9178l3248L0430N2226m1078m1594R990r4979L327N628j8693N9356Q5098
$$ 59178 25930 56360 108586 67508 25914 35904 -59075 -55748 -50120 -68813 -9457 75641
16194G5641j65o9818P841K4988j2798p8510o7938l566L5429K6999M1112K1284
$$ 75641 75476 5658 13499 38487 25689 -52821 -120759 -124325 -88896 -61897 -20785 499
16182D99k8710o1243O1771O3179p7990q3183k4351n033L742L4024o013K5121K7336
$$ 499 -28211 -89454 -27683 35496 -42494 -125677 -150028 -155061 -151319 -117295 -123308 -98187 -70851
16169g0851M0303J8792k9157K5422O4025K2982M7391L4204n4403j09719j2505
$$ -70851 -30548 -11756 -40913 -15491 48534 71516 118907 153111 98708 -11011 -23516
16158b3516L2559n1857k0534k3898L6310O6057L608J1059J4232l0517j821R822
$$ -23516 9043 -42814 -63348 -87246 -50936 15121 18729 29788 44020 13503 11682 21504
16146B1504k918Q3391l0898l9160L2n0403o6205j1953J5155N0603O2429J8649
$$ 21504 18586 101977 71079 31919 31951 -18452 -84657 -96610 -81455 -30852 31577 50226
16134E0226k593J4254o7424M7889M2210m6393n5715l3873o2945J276Q507M0102
$$ 50226 47633 61887 -5537 42352 84562 38169 -17546 -51419 -114364 -113088 -104581 -64479
16122f4479M5038P7882l980N156l9776j07315q675J03383N2449o3047l1542l2162
$$ -64479 -19441 58441 54461 59617 19841 -87474 -96149 7234 59683 -3364 -34906 -67068
16110f7068r377J3275K327O2187J7941L4802n9668N8525J02571p6999j0954k0103
$$ -67068 -76445 -63170 -60843 1344 19285 54087 -5581 52944 155515 78516 67562 47459
16098D7459n5118m2692N6051J15520N1949k2321k0955r5645O7101O040j9695l5389
$$ 47459 -7659 -50351 5700 121220 173169 150848 129893 34248 101349 107389 87694 52305
16086E2305n3279J0656j7861l2472N1489J6554l0665k6640J03602k507q7021j7316
$$ 52305 -974 9682 -8179 -40651 10838 27392 -3273 -29913 73689 71182 -15839 -33155
16074c3155o7451j3339J27501l2123K1056R3448k2224k4978k8936j04277L5130
$$ -33155 -100606 -113945 13556 -18567 2489 95937 73713 48735 19799 -84478 -49348
16063d9348J5630J6373n3278R1832N3364m5694K168k7029j8660P6417K6240j0175
$$ -49348 -33718 -17345 -70623 21209 74573 28879 31047 4018 -14642 61775 88015 77840
16051G7840m501m4528m9277l1277j441R9638K7745k4720n608m9292q1783J0409
$$ 77840 73339 28811 -20466 -51743 -53184 46454 74199 49479 43871 -5421 -87204 -76795
16039g6795k0830l03M5288l3879R573k8636M5447P3314l9715k6122o4482j2962
$$ -76795 -97625 -97928 -52640 -86519 -76946 -105582 -60135 13179 -26536 -52658 -117140 -130102
16027a30102Q073L5742N2195k9825J130M9854P6691k0798n1887n7192J8927N851
$$ -130102 -122029 -86287 -34092 -63917 -62787 -12933 63758 42960 -8927 -66119 -47192 -41341
16015d1341J5306n6693q1704j3129M0178n91K9906R916Q6024R624n1707L7322
$$ -41341 -26035 -82728 -164432 -177561 -137383 -137974 -108068 -98152 -12128 -2504 -54211 -16889
16003a6889l707l3781M7761N6437K8472M661P236j886m7293M320M434K2801p4832
$$ -16889 -20596 -54377 -6616 49821 78293 82954 90190 88304 41011 45331 49765 72566 -2266
15990b266n4512K4462L7532k1045m0993k6531N6135M2747q0799k2924N2697L2963
$$ -2266 -56778 -32316 5216 -15829 -56822 -83353 -27218 15529 -65270 -88194 -35497 -2534
15978b534K1333O9824P267l836M2378n8301n1257j158m3407k9199o360P4316O6081
$$ -2534 18799 88623 95890 92054 134432 76131 24874 23716 -19691 -48890 -55250 19066 85147
15965H5147P3979p0760r5689P4018M0187J5457j5547n584j47807j6641K0318Q6161
$$ 85147 159126 88366 -7323 66695 106882 122339 106792 101208 -46599 -63240 -42922 43239
15953D3239k4122n3221R264k0974M945N2559J403m5601n2744m2328K3419K2054
$$ 43239 19117 -34104 -24840 -45814 -40869 11690 13093 -32508 -85252 -127580 -104161 -82107
15941h2107j1384K9311M924j5804n8141O5248m0671q635J7620m259N6675j1142
$$ -82107 -93491 -64180 -59256 -75060 -133201 -67953 -108624 -117259 -99639 -103898 -47223 -58365
15929e8365M3467J5051j0911M5849Q4364k2315o5922N5345J01898p9901j27432
$$ -58365 -14898 153 -10758 35091 119455 97140 31218 86563 188461 108560 -18872
15918a8872M5713J7428K0981L2314q3734q6645r3674O177O3627J00362M3912n0131
$$ -18872 26841 44269 65250 97564 13830 -72815 -166489 -160312 -96685 3677 47589 -2542
15906b542l3306l4116K077K0654J8070o134l8437o9397m5191O7832L3552Q5454
$$ -2542 -35848 -69964 -67887 -47233 -29163 -35297 -73734 -143131 -188322 -120490 -86938 -1484
15894a484n210m1490p0324k8162j6693l156k5061J7862N0198J8465p8091k8779
$$ -1484 -6694 -48184 -118508 -146670 -163363 -166519 -191580 -173718 -123520 -105055 -183146 -211925
15882b11925P1961M9352K961M3733J14702J14559j5591k4280K3816l6824l7517
$$ -211925 -139964 -90612 -87651 -43918 70784 185343 169752 145472 169288 132464 94947
15871I4947k0740K1784K5940O7578n6882K1716O07q1381l5324q7186l4635L0359
$$ 94947 74207 95991 121931 189509 132627 154343 154950 73569 38245 -48941 -83576 -53217
15859e3217O7192K389l5916m0976L967K4209J2166J20475n212o8629M51O8211
$$ -53217 13975 16364 -19552 -60528 -56561 -32352 -20186 100289 95077 26448 26899 95110
15847I5110k2249l6817o1019K7658k7497l8425J6664Q8790j3901k1820j9702L8735
$$ 95110 72861 36044 -24975 2683 -24814 -63239 -46575 42215 28314 6494 -13208 25527
15835B5527M6314K0436q5034o3925Q6330N7439J23242K3223j00918n2674J764
$$ 25527 71841 92277 7243 -56682 29648 87087 210329 233552 132634 79960 81724
15824H1724p8116L8270L8325n6261r015O3941L1138J9381k9901r2492p7998k9859
$$ 81724 3608 41878 80203 23942 14927 78868 110006 129387 99486 6994 -71004 -100863
15812a00863R9659j5992n7292m7602Q8189q798p6863K2945O2303K1498O0468N3665
$$ -100863 -1204 -17196 -74488 -122090 -33901 -42699 -119562 -96617 -34314 -12816 47652 101317
15800A01317L4791m2481m938j07561k1793K6824n0399L2950P3407J8380j43775
$$ 101317 136108 93627 88689 -18872 -40665 -13841 -64240 -31290 42117 60497 -83278
15789h3278o8302O7465O39L6007Q1834K7269p4036j35651K4835J21102J9370J3760
$$ -83278 -151580 -84115 -83476 -47469 34365 61634 -12402 -148053 -123218 -2116 17254 31014
15777C1014m3399n1840k6687N185J05799O4305j7393r5J0743N5115q6594P917
$$ 31014 -12385 -64225 -90912 -85727 20072 84377 66984 66889 77632 132747 46153 54070
15765E4070P4928n5536l3481m025o670P0294M5613J0981k3374k4621L750O225
$$ 54070 128998 73462 39981 35956 29286 99580 145193 156174 132800 108179 111929 118154
15753A18154J1105q8087r9827o9703p6048N3289R6983K2436O410K334k6725M9772
$$ 118154 129259 41172 -58655 -128358 -204406 -151117 -54134 -31698 -25288 -22954 -49679 93
15741I3o7397q0349m2541K569J08562O6783Q4278K6020l1247l7680N74l024l1004
$$ 93 -67304 -147653 -190194 -187625 -79063 -12280 71998 98018 66771 29091 29665 26641 -4363
15728d363o920l5716P3456K6889j026j6216R904m4508k0100N1927K9650M8016
$$ -4363 -11283 -46999 26457 53346 52320 36104 46008 1500 -18600 33327 62977 110993
15716A10993l3631j36821J1253N6861P0828o85m0241o2830n6181q291k6391n905
$$ 110993 77362 -59459 -48206 8655 79483 78798 38557 -24273 -80454 -88745 -115136 -121041
15704a21041J02326j5794N2320R5787l3277K354O46J5012n1042k7627P39M6467
$$ -121041 -18715 -34509 17811 113598 80321 82675 83321 98333 47291 19664 20403 66870
15692F6870m9442l5900l5809j7270N8759N2808o9n3780j4260N6518P674K8016
$$ 66870 17428 -18472 -54281 -71551 -12792 40016 39947 -13833 -28093 28425 36099 64115
15680F4115M4426N8148m6980r5563R8137O0441j18676p2825K4282r290l537k0810
$$ 64115 108541 166689 119709 24146 122283 182724 64048 -8777 15505 6215 2678 -18132
15668a8132l989R9796j402l3715M9196j8435K1012l5356j5405r5477j0291N9076
$$ -18132 -22121 77675 76273 42558 91754 73319 94331 58975 43570 -51907 -62198 -3122
15656c122L6712J6260R0258n8284j33918J7932J07670M1306l9540o4028m7035
$$ -3122 33590 49850 140108 81824 -52094 -34162 73508 114814 75274 11246 -35789
15645c5789O449P2724N1285O7421j8013j1260p1091q5000l4819N3082j2022J7712
$$ -35789 -29340 43384 94669 162090 144077 132817 61726 -23274 -58093 -5011 -17033 679
15633F79Q2640k2845j9299j881j586N757m9575m0841N2056l7865n233j4520N7070
$$ 679 83319 60474 41175 39294 37708 43465 -6110 -46951 5105 -32760 -37993 -52513 4557
15620D557K5674o3799K0504K4545M0143M8048k19n7091M263O762k1011m4624L9915
$$ 4557 30231 -33568 -13064 11481 51624 99672 99453 42362 46625 53387 32376 -12248 27667
15607B7667N2564j6548m6719o3623J6883l13l1510j1135O9215J25040n3186o5977
$$ 27667 80231 63683 16964 -46659 -29776 -30089 -61599 -72734 -3519 121521 68335 2358
15595B358m1181l0268K8006N249J9765p939J6127k8853l3366p222K465K2039O37
$$ 2358 -38823 -69091 -41085 -35836 -16071 -24010 -7883 -36736 -70102 -77324 -74859 -52820 -52183
15582e2183k6223O913O2495N112l38L876M4186N5971o4337o4883K23J3550N3663
$$ -52183 -78406 -71493 -8998 -3886 -4224 -348 43838 99809 35472 -29411 -29188 -15638 38025
15569C8025M7889J19879m2130K6233p4849j40677r1688M4733M6411k6452N6917
$$ 38025 85914 205793 163663 189896 115047 -25630 -117318 -72585 -26174 -52626 4291
15558D291P681j03167K5362N3465j3268N9502K9608n8076m7950L5030L7532M3790
$$ 4291 11972 -91195 -65833 -12368 -25636 33866 63474 5398 -42552 -7522 30010 73800
15546G3800k7834q4837m1159L0954J2357j6488m324P413Q3812J14410Q7313j48623
$$ 73800 45966 -38871 -80030 -49076 -36719 -53207 -57531 -50118 33694 148104 235417 86794
15534H6794j55981j6779M1445j8733J5727k799R573L57N9011M457r0176o3781
$$ 86794 -69187 -85966 -44521 -63254 -47527 -50326 -40753 -40396 18615 23072 -67104 -130885
15522a30885j8174K4795j0907J18424N2292j02940L7590N3456j9740L4814l687
$$ -130885 -149059 -124264 -135171 -16747 35545 -67395 -29805 23651 3911 38725 35038
15511C5038P992J610L5552N8384m8595l0483o5998n8902J9961N5849q690k4975
$$ 35038 43030 44640 80192 138576 89981 59498 -6500 -65402 -45441 10408 1718 -23257
15499b3257K2954J7293l9240K9637l0608m6323n0030k2946Q331O1491L7628j5477
$$ -23257 -303 16990 -22250 7387 -23221 -69544 -119574 -142520 -134189 -72698 -35070 -50547
15487e0547J5814L2507k298P812n094n3456K1825q463k0057M3667O2550J8044
$$ -50547 -34733 -2226 -4524 3288 -1806 -55262 -33437 -41900 -61957 -18290 44260 62304
15475F2304L605p7816p2037k4063q742L9143l5179m1560O4224q909j1738L1978
$$ 62304 65909 -11907 -83944 -108007 -116749 -77606 -112785 -154345 -90121 -99030 -110768 -78790
15463g8790L8541m1326M2340P5966O5600j0340k8019p0734k9044O5154K2971n4407
$$ -78790 -40249 -81575 -39235 36731 102331 91991 63972 -6762 -35806 29348 52319 -2088
15451b088n5483O4817J15218l2603j00206L736n6202J4459P7191N6673L0774l2084
$$ -2088 -57571 7246 122464 89861 -10345 -6609 -62811 -48352 28839 85512 116286 84202
15439H4202k5672q318j04722L7120J3788K161n890N8337k0162j06779l4405P1334
$$ 84202 58530 50212 -54510 -17390 -3602 -1441 -7331 51006 30844 -75935 -110340 -39006
15427c9006O5412l8137J0191N9942N4136l4482j02108N5700L7527J6803O2664
$$ -39006 26406 -11731 -1540 58402 112538 78056 -24052 31648 69175 85978 148642
15416A48642q5016r5201P5242M970p9931K1916l27l3241L0202J46969M6059q9178
$$ 148642 63626 -31575 43667 48637 -31294 -9378 -9705 -42946 -12744 134225 180284 91106
15404I1106m5282K3458M529M5025j482J0754m7870K3731n4432r0679k2238O2959
$$ 91106 45824 69282 73811 118836 117354 128108 80238 103969 49537 -41142 -63380 -421
15392d21L6497l4030m6770r9204N889J05706M5346l4476Q93j9614L7576M8595
$$ -421 36076 2046 -44724 -143928 -138039 -32333 13013 -21463 -20570 -40184 -2608 45987
15380D5987k2492o2089K3287k3573k140j2150m3215o4560M8256J5479O4663P4033
$$ 45987 23495 -38594 -15307 -38880 -41020 -53170 -96385 -160945 -112689 -97210 -32547 41486
15368D1486M0394k3506R202j9444o5804p9777R718j8921J01464L8528n07p4776
$$ 41486 81880 58374 67576 48132 -17672 -97449 -87731 -106652 -5188 33340 32833 -41943
15356d1943m260N1309K4079o6189m4121P7209J8929L3287o1940k4105M1640k8584
$$ -41943 -46203 5106 29185 -37004 -81125 -3916 15013 48300 -13640 -37745 3895 -24689
15344b4689m1486K4146K6286j5738J8650k2286o6737l986Q759P8112R0934N394
$$ -24689 -66175 -42029 -15743 -31481 -12831 -35117 -101854 -105840 -97081 -18969 71965 77359
15332G7359m0045M0396M6583o8654P501J5331M24q7653o3207L9020Q7395o9062
$$ 77359 37314 77710 124293 55639 63140 78471 78895 -8758 -71965 -32945 54450 -14612
15320a4612M0216K4959K0425Q059N7121L7811l4975p0522j5737l5610j13337N522
$$ -14612 25604 50563 70988 79047 136168 173979 139004 68482 52745 17135 -96202 -90680
15308i0680O5139O8920r271m0294m842k3989J1711K4957j7804O603J3523J6916
$$ -90680 -25541 43379 34108 -6186 -11028 -35017 -23306 1651 -16153 -9550 3973 20889
15296B0889j50261j17263L2911J16865Q5197Q520j8747O8253K7393Q5955N9253
$$ 20889 -129372 -246635 -213724 -96859 -11662 -3142 -21889 46364 73757 159712 218965
15285B18965M552j16526j24626Q515p811N2184J5858j09122q9482O0582M4147
$$ 218965 223517 106991 -17635 -9120 -16931 35253 51111 -58011 -147493 -86911 -42764
15274d2764P4022k1310P800Q494K3586O8664N8658k6471k4221J5436j2685l7187
$$ -42764 31258 9948 17748 26242 49828 118492 177150 150679 126458 141894 129209 92022
15262I2022K9013l7912p9808r1928L2555M0037k9547l1114J08497L9117m5315
$$ 92022 121035 83123 3315 -88613 -56058 -16021 -45568 -76682 31815 70932 25617
15251B5617m5612j8279J5928R6557K6508q5552Q0309n719j34955j5412j952K2937
$$ 25617 -19995 -38274 -22346 74211 100719 15167 95476 89757 -45198 -60610 -62562 -39625
15239c9625n9196O69K4314l744N8927j6453k1059N3571L7230J712P785K3072j090
$$ -39625 -98821 -98152 -73838 -77582 -18655 -35108 -56167 -2596 34634 36346 44131 67203 66113
15226F6113j010l0005O1228R392L9321p5615K4630j6340J4041j5492K5621q3019
$$ 66113 65103 35098 96326 105718 145039 69424 94054 77714 91755 76263 101884 18865
15214A8865l0726R2747Q4454n085r0596m8506k2779J5803O0176N2554r7303p3748
$$ 18865 -11861 80886 165340 160255 69659 21153 -1626 14177 74353 126907 29604 -44144
15202d4144R262O2350J1301K8443l233n4372L626k2732j9379L549p1974J3422
$$ -44144 -34882 27468 38769 67212 63979 9607 13233 -9499 -28878 -25329 -97303 -83881
15190h3881J6374N706K7782k2369Q17L6103J04081J7035j3187j311l0497K2299
$$ -83881 -67507 -61801 -34019 -56388 -55571 -19468 84613 101648 88461 87150 56653 78952
15178G8952K6122j4070j07038K3071m3991k4653O7728O7619j1763k3873j3460
$$ 78952 105074 91004 -16034 7037 -36954 -61607 6121 73740 61977 38104 24644
15167B4644L2963m162m6515o0799K9458M3425m4472o7902n403p11J0738N042m1338
$$ 24644 57607 53445 6930 -53869 -24411 19014 -25458 -93360 -98763 -99474 -88736 -83694 -125032
15154a25032P489K2163Q0714p433q0453M4095Q1800P8358N7472m6645q2363o1171
$$ -125032 -117543 -95380 -14666 -22099 -102552 -58457 23343 101701 159173 112528 30165 -31006
15142c1006O636O8278L3375r7698p053k4805o396o0026m6299J12689Q481o8956
$$ -31006 -24370 43908 77283 -20415 -27468 -52273 -58669 -118695 -164994 -52305 -43824 -112780
15130a12780j6777M3501J19199O4531M0550j7749r0920P96m7735m6727N4696R936
$$ -112780 -129557 -86056 33143 97674 138224 120475 29555 30351 -17384 -64111 -9415 521
15118E21j9130l5332j05325L0132P3451M2684N1538j7585l7631L4347N3590j295
$$ 521 -18609 -53941 -159266 -129134 -55683 -12999 38539 20954 -16677 17670 71260 69965
15106F9965k4717j3775L6688P9419j5439k5375j7398O3755q5930m9003P3236r587
$$ 69965 45248 31473 68161 147580 132141 106766 89368 153123 67193 18190 91426 81839
15094H1839m6570n6205j439J7528Q9903N8084m7844M3736q9838p9659K0462k390
$$ 81839 35269 -20936 -22375 -4847 85056 143140 95296 139032 49194 -30465 -10003 -12393
15082a2393j1623J5657K926m503j04288o876k896k0628J06136L2663j7898l6627
$$ -12393 -24016 -8359 -5433 -9936 -114224 -121100 -123996 -144624 -38488 -5825 -23723 -60350
15070f0350J8169L8157j5493L9731K1851m1607l5022o617M5076R53O3073n5096
$$ -60350 -42181 -4024 -19517 20214 42065 458 -34564 -41181 3895 4848 67921 12825
15058A2825l2278M5569j3222l2864k6087L4693M6732J2010o6098k3015M2957L4636
$$ 12825 -19453 26116 12894 -19970 -46057 -11364 35368 47378 -18720 -41735 1222 35858
15046C5858P2754J1259j9531l6367n2447p3637o4742M809r080M862O7322j1600
$$ 35858 108612 119871 100340 63973 11526 -62111 -126853 -122044 -131124 -126262 -58940 -70540
15034g0540o2272j7851N1622J1095j66L5776P0500M2431j999q54K2272K2651O2578
$$ -70540 -132812 -150663 -99041 -87946 -88112 -52336 18164 60595 58596 57742 80014 102665 165243
15021A65243k6169l9713j6380L546l8804M9342j8978o0407j8927J4743J2166J7121
$$ 165243 139074 99361 82981 86527 47723 97065 78087 17680 -1247 13496 25662 42783
15009D2783l3933j07802L6426L7237K4899O1569j3044l0313R045N948L8627j2870
$$ 42783 8850 -98952 -62526 -25289 -390 61179 48135 17822 26867 32815 71442 58572
14997E8572K718J0469j3682J439P463l5642K2971M99p1013j02728p880L0349J1435
$$ 58572 61290 71759 58077 59516 66979 31337 54308 54807 -16206 -118934 -126814 -96465 -85030
14984h5030K6328m9376o92J231r5677K6018O2435j3436M6514N9452o4975R801
$$ -85030 -58702 -108078 -108770 -107539 -203216 -177198 -114763 -128199 -81685 -22233 -87208 -77407
14972g7407K1948P5108r5126n1117L0220L8128N2754O7555j4271j03004P974N435
$$ -77407 -55459 19649 -75477 -126594 -96374 -58246 -5492 62063 47792 -55212 -47238 -41803
14960d1803q975O8431K4018j6412l7921L0672j4181l456n5323o5425m478K8459
$$ -41803 -50778 17653 41671 25259 -12662 18010 3829 373 -54950 -120375 -124853 -96394
14948i6394P6763N5927n2070k702k2692j3224P5088P3216j9209m7135l830L1324
$$ -96394 -19631 36296 -15774 -18476 -41168 -54392 20696 93912 74703 27568 23738 55062
14936E5062N9820m1656q1829l4668L7474Q1534K8705j10932o2428L7753l4669
$$ 55062 114882 73226 -8603 -43271 -5797 75737 104442 -6490 -68918 -31165 -65834
14925f5834P2998l4379l708Q4744Q9800l5396o4065m2706K4178k4501n8226L1195
$$ -65834 7164 -27215 -30923 53821 143621 108225 44160 1454 25632 1131 -57095 -25900
14913b5900m6465j4871J8962J17554L3885l4023j40723J04388M6378O55r7251
$$ -25900 -72365 -87236 -68274 49280 83165 49142 -91581 12807 59185 59840 -37411
14902c7411j6894J25335l0256j17846M7592J03809n1613j05108J08700N9802L5396
$$ -37411 -54305 71030 40774 -77072 -29480 74329 22716 -82392 26308 86110 121506
14891A21506m5250O0369k3818J4489m1699n4932p9546J0162K6433J4876m5391
$$ 121506 76256 136625 112807 127296 85597 30665 -48881 -38719 -12286 2590 -42801
14880d2801q211p6274l3088M7653M4208J4123l780j813J00912J3426J4597K44
$$ -42801 -51012 -127286 -160374 -112721 -68513 -54390 -58170 -59983 40929 54355 68952 69196
14868F9196K5536J9211l4507M4065R418k0659K6211R298m9871j3984n6230j1678
$$ 69196 94732 113943 79436 123501 132919 112260 138471 147769 97898 83914 27684 16006
14856A6006l8444K6991J10728j828r0744p2614J0986p4617N1356O2103n1754L6478
$$ 16006 -22438 4553 115281 113453 22709 -49905 -38919 -113536 -62180 -77 -51831 -15353
14844a5353n3508l5039L7495J8584k6960k8221N4026J21978K8019q8245p9827
$$ -15353 -68861 -103900 -66405 -47821 -74781 -103002 -48976 73002 101021 12776 -67051
14833f7051n610l3337L5375J03644O2703n5829n2761p2774Q1162l9730l2148m4803
$$ -67051 -72661 -105998 -70623 33021 95724 39895 -12866 -85640 -4478 -44208 -76356 -121159
14821a21159L7110M1930n5174J7637J31656l2020m8570m0549o8814K8058K1743
$$ -121159 -84049 -42119 -97293 -79656 52000 19980 -28590 -69139 -137953 -109895 -88152
14810h8152K0675P1566L2291k5632j28196K9036M4196L2814o9627l7702K5823
$$ -88152 -67477 4089 36380 10748 -117448 -88412 -44216 -11402 -81029 -118731 -92908
14799i2908j559K204M1521O7489J5764j07447Q308J34860L4560l7265n3922j4877
$$ -92908 -94467 -92263 -50742 16747 32511 -74936 -66628 68232 102792 65527 11605 -3272
14787c272M7601P1102k390r2054l5792L3124M2898J26786J0880p6779r1408m0749
$$ -3272 44329 115431 113041 20987 -14805 18319 61217 188003 198883 122104 30696 -10053
14775a0053m7197l6562L8451m4592M875j700M1990j8282n5498N7983m7792k6680
$$ -10053 -57250 -93812 -55361 -99953 -95078 -96778 -54788 -73070 -128568 -70585 -118377 -145057
14763a45057q624j5766K7481L4070M3882J4447K5849K7874p7836M2096O9349J3350
$$ -145057 -153681 -169447 -141966 -107896 -64014 -49567 -23718 4156 -73680 -31584 37765 51115
14751E1115p1056r3578L5884j9715K6434Q0157j0800n1286l8644O4209R8867j3098
$$ 51115 -19941 -113519 -77635 -97350 -70916 9241 -1559 -52845 -91489 -27280 71587 58489
14739E8489j24614J6947L2325K9450j684L02k8424n536L299R1260o1839L0602
$$ 58489 -66125 -49178 -16853 12597 10913 11215 -17209 -22745 -19446 71814 9975 40577
14727D0577N4061m7799m5268k0870o5409L4463N8615k0686m1784m453Q3299J5919
$$ 40577 94638 46839 1571 -19299 -84708 -50245 8370 -12316 -54100 -58553 24746 40665
14715D0665m1741j9091p6524K3680M7095P9592k0358l6541o4131J09516M8865
$$ 40665 -1076 -20167 -96691 -73011 -25916 53676 33318 -3223 -67354 42162 91027
14704I1027k6644R244j4124k7805o5378k4116k5750l7817k5840N3909m662j2345
$$ 91027 64383 73627 59503 31698 -33680 -57796 -83546 -121363 -147203 -93294 -97956 -110301
14692a10301k1812P6082M4596L4843n0549O4600M1896k9610m1222k7386j7275
$$ -110301 -132113 -56031 -11435 23408 -27141 37459 79355 49745 8523 -18863 -36138
14681c6138N155L5663M2005m7884O3205R6504L3575O492L828j2991p1481J020
$$ -36138 -30983 4680 46685 -1199 62006 158510 192085 198577 202405 189414 117933 118953
14669A18953K2397j8422m3613q1425m9063N0321L0954q9490k8352M4550M2312
$$ 118953 141350 122928 79315 -2110 -51173 -852 30102 -59388 -87740 -43190 -878
14658h78O433r8701j0966P1463M3188O0100J8981J5360P9288q1385p3386p0345
$$ -878 5555 -93146 -104112 -32649 10539 70639 89620 104980 184268 102883 29497 -40848
14646d0848j0670N6321J6343p4154l0829M3520L4660j5587m3843M7467M6419L9161
$$ -40848 -51518 4803 21146 -53008 -83837 -40317 -5657 -21244 -65087 -17620 28799 67960
14634F7960K9562j0665p7936P0751l5753m9774M913K3904K0873o1293K102l8759
$$ 67960 97522 86857 8921 79672 43919 -5855 -942 22962 43835 -17458 -15356 -54115
14622e4115j2693O5589o8826p5343K3744M0965k1815N8064J2330K5226m488P334
$$ -54115 -66808 -1219 -70045 -145388 -121644 -80679 -102494 -44430 -32100 -6874 -11362 -4028
14610d028j39513K0821Q8588j3562q1618k1932K8529N739k4069N7012R0026L8570
$$ -4028 -143541 -122720 -34132 -47694 -129312 -151244 -122715 -116976 -141045 -84033 5993 44563
14598D4563J1470P5353L771q8961n0131K2034M3411l2320M605r2851m0427J19607
$$ 44563 56033 131386 135157 46196 -3935 18099 61510 29190 33795 -59056 -99483 20124
14586B0124Q1780n0384q8003l093J05767N2174Q4863K2098n6489o9424o332m7646
$$ 20124 101904 51520 -36483 -39576 66191 118365 203228 225326 168837 99413 93081 45435
14574D5435O0355N6882m7498M3816l0036j12108q8425k1001N5856L3454o0674
$$ 45435 105790 162672 115174 158990 128954 16846 -71579 -92580 -36724 -3270 -63944
14563f3944j24518J7107N8965O6934M1423N7882l6117N482K7393r604n500p763
$$ -63944 -188462 -171355 -112390 -45456 -4033 53849 17732 23214 50607 41003 35503 27740
14551B7740K6579J292j15938r3614N082l1399Q080L9094P038k2249K9377J31583
$$ 27740 54319 55611 -60327 -153941 -148859 -180258 -172178 -133084 -126046 -148295 -118918 12665
14539A2665Q5391n3038m0366O0689K7755k4890m2797j00366K3504L0465o2734
$$ 12665 98056 45018 4652 65341 93096 68206 25409 -74957 -51453 -20988 -83722
14528h3722J7784L3237K7834l345L1108m7733m5623l9955k6095J20009N4275K6320
$$ -83722 -65938 -32701 -4867 -8212 22896 -24837 -70460 -110415 -136510 -16501 37774 64094
14516F4094j8808l6329k6420J8112J38963J34447k9134o5685q2418m8177j6599
$$ 64094 45286 8957 -17463 649 139612 274059 244925 179240 96822 48645 32046
14505C2046j1631L8270N6452q4392p3517l3979O295l24m8092o4758J37902P8895
$$ 32046 20415 58685 115137 30745 -42772 -76751 -70456 -70780 -118872 -183630 -45728 33167
14493C3167J8056J2421k40o7007p3244l6608L9358J8032Q0803L498l159O7170
$$ 33167 51223 63644 63404 -3603 -76847 -113455 -74097 -56065 24738 28236 25077 92247
14481I2247J7202N8849p276n8169l5300k6847l8334l9847M1515J10703k0156J9017
$$ 92247 109449 168298 161022 102853 67553 40706 2372 -37475 4040 114743 94587 113604
14469A13604l8489k5803M37P2583j6474o5074j0679K3302k7116o3743q7279J153
$$ 113604 75115 49312 49749 122332 105858 40784 30105 53407 26291 -37452 -124731 -123578
14457a23578J8075R0400M1942l2329r101q5150l9022J01888M4651k5208K825P7479
$$ -123578 -105503 -15103 26839 -5490 -14591 -99741 -138763 -36875 7776 -17432 -14607 62872
14445F2872R8198q4874o6479N478J150L4851Q91r833l805L4021L9386M731K1232
$$ 62872 161070 76196 9717 15195 16345 51196 52087 42254 38449 72470 111856 116587 137819
14432A37819p1375j8808m2073N8881O5179k11l9721j2037j6089n124p59N6439
$$ 137819 66444 47636 5563 64444 129623 129412 89691 77654 61565 56441 55682 112121
14420A12121L0961m5863o6140o9713J5673p839J44728O9201o5543k8832M0705
$$ 112121 143082 97219 31079 -38634 -22961 -30800 113928 183129 117586 88754 129459
14409A29459l5382q1817K289J070n8611Q5378R9867l463q4435l3809p640m5711
$$ 129459 94077 12260 14549 15619 -42992 42386 142253 138790 54355 20546 12906 -32805
14397c2805j1180M8685J4539R4781K3062N862L1980m8591p3964L0676K2977n5350
$$ -32805 -43985 4700 19239 114020 137082 142944 174924 126333 52369 83045 106022 50672
14385E0672m9561r4395J07985Q1937K2367n4369q7753O1654k1092J7455Q1239
$$ 50672 1111 -93284 14701 96638 119005 64636 -23117 38537 17445 34900 116139
14374A16139o6684j55383M616P5819J01485J0680m8084N862k63k0100j0529r3571
$$ 116139 49455 -105928 -101312 -25493 75992 86672 38588 44450 44187 24087 13558 -80013
14362h0013l6136J9548n8237p121N5942P0180R4626L1576k0649r909J3736k0092
$$ -80013 -116149 -96601 -154838 -161959 -106017 -35837 58789 90365 69716 59807 73543 53451
14350E3451l4497p3346l0327P506K2781O9050k0428K229m8178K9491J7757L7798
$$ 53451 18954 -54392 -84719 -77213 -54432 14618 -5810 -3581 -51759 -22268 -4511 33287
14338C3287j1589j09386o0566J05431J03208L8472K8843m5569l8341j4872r702
$$ 33287 21698 -87688 -148254 -42823 60385 98857 127700 82131 43790 28918 19216
14327A9216n4090m4206J1965n706l932N084K6175k17l049J3720N9127M3483m7242
$$ 19216 -34874 -79080 -67115 -72821 -76753 -71669 -45494 -45711 -48760 -35040 24087 67570 20328
14314B0328k2560o4924j02636K9579O3524n019L0524K4348J9676L5746L1277j8800
$$ 20328 -2232 -67156 -169792 -140213 -76689 -81708 -51184 -26836 -7160 28586 59863 41063
14302D1063O797q2738k0150M5383K675j2841j2585o9285L5263p9410o9165N8510
$$ 41063 47860 -34878 -55028 -9645 -6970 -19811 -32396 -101681 -66418 -145828 -214993 -156483
14290a56483O4564P2355P6160L7589m8996K5078n8102n9530R266K5000o4490k5539
$$ -156483 -91919 -19564 56596 94185 45189 70267 12165 -47365 -38099 -13099 -77589 -103128
14278a03128J1253r544J6877Q7450N9440j9850k1256r5811K9586L1455l8350o3148
$$ -103128 -91875 -101419 -84542 2908 62348 42498 21242 -74569 -44983 -13528 -51878 -115026
14266a15026j2542N9985k9568K8110l7620M3822l3981M1870R3041k6823r9896
$$ -115026 -127568 -67583 -97151 -69041 -106661 -62839 -96820 -54950 38091 11268 -88628
14255h8628q7959M4341P8744N441J8018j2936o5736R1696O4112J8633J3318l5008
$$ -88628 -176587 -132246 -53502 -48061 -30043 -42979 -108715 -17019 47093 65726 79044 44036
14243D4036m0067J5032k2768p5092j0738j7400O221n062j3027N3025J48478j3277
$$ 44036 3969 19001 -3767 -78859 -89597 -106997 -100776 -105838 -118865 -65840 82638 69361
14231F9361j49084P4378J22045Q5899j09084r6831p9711J3071J07788N9422r412
$$ 69361 -79723 -5345 116700 202599 93515 -3316 -83027 -69956 37832 97254 87842
14220H7842l7484l3768j9933l055n7384n7891k3063K9417K4831P4239J06118k0956
$$ 87842 50358 16590 -3343 -6398 -63782 -121673 -144736 -115319 -90488 -16249 89869 68913
14208F8913k0127k1052k0765r5097j9723K2331k0183M5515k0704r312M1160J559
$$ 68913 48786 27734 6969 -88128 -107851 -85520 -105703 -60188 -80892 -90204 -49044 -47485
14196d7485J5449L7782M1448k2809m8665n5889K5250Q7098L3778J0284o7641k82
$$ -47485 -32036 5746 47194 24385 -24280 -80169 -54919 32179 65957 76241 8600 8318
14184H318M1179m6474K8627K7492q2107Q098n6604K7280J2169m7323l5922N1139
$$ 8318 49497 3023 31650 59142 -22965 -14867 -71471 -44191 -32022 -79345 -115267 -64128
14172f4128L4506p958L1638Q0791L557n6292l8498j8217l8710J0815J6439q3347
$$ -64128 -29622 -37580 -5942 74849 78406 22114 -16384 -34601 -73311 -62496 -46057 -129404
14160a29404R6835J10765M8472r0702k4280r274J5160R0005J1487m2931q0710
$$ -129404 -32569 78196 126668 35966 11686 2412 17572 107577 119064 76133 -4577
14149d577o7458r814o0117J7597J06917P3016j380J9853l4072j14420l315K9215
$$ -4577 -72035 -81849 -141966 -124369 -17452 55564 54184 74037 39965 -74455 -77770 -48555
14137d8555k3413j295k4769n2151o7782K3694J37479K3071l2810o6671l2166Q7342
$$ -48555 -71968 -73263 -98032 -150183 -217965 -194271 -56792 -33721 -66531 -133202 -165368 -78026
14125g8026J8359J829P0970P886m2038J5463l0420J1444N6615M2379L8062Q6j5509
$$ -78026 -59667 -57838 13132 21018 -21020 -5557 -35977 -24533 32082 74461 112523 112609 97100
14112I7100m1925l0212l1514O446k6887J8018O8512K5999l4983m5069r271n1874
$$ 97100 55175 24963 -6551 -105 -26992 -8974 59538 85537 50554 5485 -3786 -55660
14100e5660N3675J34527N4237p4589r2538j9299L2328Q7418M0927M186m4385r2987
$$ -55660 -1985 132542 186779 112190 19652 353 32681 120099 161026 165212 120827 27840
14088B7840l0664K4374l8077J8396n64l0998j7247m5405n5783N9661L3496K5751
$$ 27840 -2824 21550 -16527 1869 1305 -29693 -46940 -92345 -148128 -88467 -54971 -29220
14076b9220l3118O6656k0620k3223q6786j7274J27684O2966k0061j5113j05172
$$ -29220 -62338 4318 -16302 -39525 -126311 -143585 -15901 47065 27004 11891 -93281
14065i3281k7823O1995K9709M3512o8211K4768P143l178k2207L6711K0000O1580
$$ -93281 -121104 -59109 -29400 14112 -54099 -29331 -22188 -25366 -47573 -10862 9138 70718
14053G0718m2148m4991M4834M2035m9359K6989o7751m3633P9615O1333q755j3542
$$ 70718 28570 -16421 28413 70448 21089 48078 -19673 -63306 16309 77642 68887 55345
14041E5345q0291o6925K7754R4146k1545m0988P851J53206O503q8150m643l219
$$ 55345 -24946 -91871 -64117 30029 8484 -32504 -24653 128553 135056 46906 42263 39044
14029C9044K0270L1736p2737Q719m3923l0280P0067l0355q705o8953m6199L8574
$$ 39044 59314 91050 18313 27032 -16891 -47171 22896 -7459 -16164 -85117 -131316 -92742
14017i2742k0903R7172Q1005M4202n2183l1621k8241j1730m9277J09393L4928
$$ -92742 -113645 -16473 64532 108734 56551 24930 -3311 -15041 -64318 45075 80003
14006H0003o1826p6998j0012j74m2339j2161Q1537J26925M2479N490n332m5818
$$ 80003 18177 -58821 -68833 -69007 -111346 -123507 -41970 84955 127434 132924 127592 81774
13994H1774j70521L9736P6226m2037J4263P7375L9232j13531q0184J9180j7836
$$ 81774 -88747 -49011 27215 -14822 -559 76816 116048 2517 -77667 -58487 -76323
13983g6323k7690N0418K1255J0236P8891K998j01196Q513P8354m3180q5124l0401
$$ -76323 -104013 -53595 -32340 -22104 56787 59785 -41411 -32898 45456 2276 -82848 -113249
13971a13249O6855P6857K6048o1080j5034L8983L6760P698K821k8350m5844r7541
$$ -113249 -46394 30463 56511 -4569 -19603 19380 56140 63838 66659 38309 -7535 -105076
13959a05076j5325M7770L7719M1331N7825O0164o582j28962j31735j831J24745
$$ -105076 -120401 -72631 -34912 6419 64244 124408 117826 -11136 -142871 -144702 -19957
13948a9957L1032K1523j7557l8212P5244o9121k0219n110r331J574O6301O393
$$ -19957 11075 32598 15041 -23171 52073 -17048 -37267 -42377 -51708 -50134 16167 22560
13936B2560Q4153j0081n1145n5545n763J8919O3421N5353o5673j1432O5691n8046
$$ 22560 106713 96632 45487 -10058 -15821 3098 66519 121872 56199 44767 110458 52412
13924E2412p7370L7997o7131m6223K4977j765K5838k5870j8114M5759l1182k4210
$$ 52412 -24958 13039 -54092 -100315 -75338 -77103 -51265 -77135 -95249 -49490 -80672 -104882
13912a04882l5143O8139k9485l9451j7701L0238K1729O1912k8629J5947O1799
$$ -104882 -140025 -71886 -101371 -140822 -158523 -128285 -106556 -44644 -73273 -57326 4473
13901D473M3454N644J4976J3619p9111m8979M3730l0472L6116M142q248J0397
$$ 4473 47927 53571 68547 82166 3055 -45924 -2194 -32666 3450 7592 -656 9741
13889I741Q2029K5499p9964p2485o111L1585l8745p0874Q3834O9478Q605o4472
$$ 9741 91770 117269 37305 -35180 -41291 -9706 -48451 -119325 -35491 33987 42592 -21880
13877b1880L656j0045P295K1985K7261K6228k053J4039q1467m2816k8501k6378
$$ -21880 -18224 -28269 -20974 1011 28272 54500 52447 66486 -14981 -57797 -86298 -112676
13865a12676R4656J35270L4796K3371L3503j18408m9893L3132p9795n4419m592
$$ -112676 -18020 117250 152046 175417 208920 90512 40619 73751 -6044 -60463 -65055
13854f5055P4048O2679J16m997r2983j8864N5222j7720l2858J3267N0664J0581
$$ -65055 8993 71672 71788 66791 -26192 -45056 10166 -7554 -40412 -27145 23519 34100
13842C4100p897Q6690N978j1411m9329q7471n9065M4064J3366n2698J6520k4844
$$ 34100 26203 112893 118871 107460 58131 -29340 -88405 -44341 -30975 -83673 -67153 -91997
13830i1997o9642j8210N7283N7099N9619J7653n0112m2801N3605o4645J1984N6880
$$ -91997 -161639 -179849 -122566 -65467 -5848 11805 -38307 -81108 -27503 -92148 -80164 -23284
13818b3284j3903K4885J6824N467k526o444P706L6250K8580k9143p3376l7514
$$ -23284 -37187 -12302 4522 9989 7463 1019 8725 44975 73555 44412 -28964 -66478
13806f6478J5640J3893M9418K6490O8127J3474k1863N792L0935Q9898j8300p5413
$$ -66478 -50838 -36945 12473 38963 107090 120564 98701 104493 135428 225326 207026 131613
13794A31613J9967M1561K4768r7038k1744n1600J1541R582p623k881j21403q1086
$$ 131613 151580 193141 217909 120871 99127 47527 59068 68650 61027 58146 -63257 -144343
13782a44343q5494O1710R0475N4154o2973l4205j9972P5709Q8930j18787k4968
$$ -144343 -229837 -168127 -77652 -23498 -86471 -120676 -140648 -64939 23991 -94796 -119764
13771a19764l6094O4011M9667r300J3924n392K4290N8032R2062M73n5241J7557
$$ -119764 -155858 -91847 -42180 -51480 -37556 -42948 -18658 39374 131436 131909 76668 94225
13759I4225j071l6254j1141l6671n3024J6521q443r4352k1747M0114p6223m863
$$ 94225 93154 56900 45759 9088 -43936 -27415 -35858 -130210 -151957 -111843 -188066 -192929
13747a92929Q4304M7413J3510K079N331n4571P3550j6787q985K7622M985M7118
$$ -192929 -108625 -61212 -47702 -45623 -40292 -94863 -21313 -38100 -47085 -19463 -14478 32640
13735C2640K1546k1455l5140o2051j3025O6637O9575L5330l716m2702k1617n1614
$$ 32640 54186 32731 -2409 -64460 -77485 -10848 58727 94057 90341 47639 26022 -25592
13723b5592P1336N5690K3797q5585k2341k6399K4908m3043r4114L230L5869Q0348
$$ -25592 45744 101434 125231 39646 17305 -9094 15814 -27229 -121343 -118113 -82244 -1896
13711a896N4433n673l4276p5031q699J8256K4916n2357P753K9391P705Q0316J0059
$$ -1896 52537 46864 12588 -62443 -71142 -52886 -27970 -80327 -72574 -43183 -35478 44838 54897
13698E4897l242L130k8253j14621J0537K8942l9826L6105J1582n2291M253L1714
$$ 54897 51655 54785 26532 -88089 -77552 -48610 -88436 -52331 -40749 -93040 -88787 -57073
13686e7073N5426M5398N794r7224J7758o322J7506J05216L2753o6490k3331l2954
$$ -57073 -1647 43751 49545 -47679 -29921 -36243 -18737 86479 119232 52742 29411 -3543
13674c543m2347J2787M4877j8655l2443J3031k2763j5950j0834L6702q078P7476
$$ -3543 -45890 -33103 11774 -6881 -39324 -26293 -49056 -65006 -75840 -39138 -47216 30260
13662C0260L0477j17801m163m886m6835N7140R2454r811l395M97K2545L2044Q6979
$$ 30260 60737 -57064 -61227 -66113 -112948 -55808 36646 26835 23440 23937 46482 78526 165505
13649A65505l3214o5488k3444j4320k5356k7001M4155J01865J28875n9357p6038
$$ 165505 132291 66803 43359 29039 3683 -23318 20837 122702 251577 192220 116182
13638A16182k6643M8475Q7140J3387j07515P913j641q0990k3101J1141k7040P9800
$$ 116182 89539 138014 225154 238541 131026 138939 137298 56308 33207 44348 17308 97108
13626I7108Q0686p8950k7241N5131p009o8058q0366l3667j1953L5076m7289p6996
$$ 97108 177794 98844 71603 126734 119725 51667 -28699 -62366 -74319 -39243 -86532 -163528
13614a63528k2350L2028M0428K0416O3883k3730m2421P8362p983l5022K3278j1799
$$ -163528 -185878 -153850 -113422 -93006 -29123 -52853 -95274 -16912 -24895 -59917 -36639 -48438
13602d8438L4625n7887N0665K5803n0940n7381O5012J23018m2130j7188k4815
$$ -48438 -13813 -71700 -21035 4768 -46172 -103553 -38541 84477 42347 25159 344
13591C44J0632m021l4940o3861m8807R7530K7902K1919l4470J342l7871j8942
$$ 344 10976 6955 -27985 -91846 -140653 -43123 -15221 6698 -27772 -26430 -64301 -83243
13579h3243J9482J9020R1445n9908l9647J6030N9709k9269n0399m391l2336P507
$$ -83243 -63761 -44741 46704 -13204 -52851 -36821 22888 -6381 -56780 -61171 -93507 -86000
13567h6000N0653K5172R104J8097M6495m087m0760L1135K5434k7072m089n4190
$$ -86000 -35347 -10175 -1071 17026 63521 59434 18674 49809 75243 48171 44082 -10108
13555a0108n7842l9971j5607l6633j5205J6890J6973L4375L7368j153M8498o191
$$ -10108 -67950 -107921 -123528 -160161 -175366 -158476 -141503 -107128 -69760 -70913 -22415 -28606
13543b8606m6095n7429O4597L251L4662n5593j10245K7967P5832O1842l3398O6450
$$ -28606 -74701 -132130 -67533 -64282 -29620 -85213 -195458 -167491 -91659 -29817 -63215 3235
13531C235j0730k2368l1101L7814K8059l0783l4209R8565M2p3062j5308J32938
$$ 3235 -7495 -29863 -60964 -23150 4909 -25874 -60083 38482 38524 -34538 -49846 83092
13519H3092m825k0873j02067j08992p534O3580R4811o562k488N2866l1440J8607
$$ 83092 78267 57394 -44673 -153665 -161199 -97619 -2808 -9370 -11858 41008 9568 28175
13507B8175l293J3412j5248m9894m8064k0728J7446J18101O3556O446l5394p4128
$$ 28175 24882 38294 23046 -26848 -74912 -95640 -78194 39907 103463 109909 74515 387
13495C87o8498k5635O981L0883m5341n2663j6541O6695R8914k9580k077O0380
$$ 387 -68111 -93746 -86765 -55882 -101223 -153886 -170427 -103732 -4818 -34398 -36475 23905
13483B3905l0676j6367K077Q1179J08191K5877n6161m0095n3506r2397q5942m9758
$$ 23905 -6771 -23138 -21061 60118 168309 194186 138025 97930 44424 -47973 -133915 -183673
13471a83673K7617P7359O6643O3632m2940J1064P698o6533j0693l820j7375j2796
$$ -183673 -156056 -78697 -12054 51578 8638 19702 27400 -39133 -49826 -53646 -71021 -83817
13459h3817O1798P6751l5044j1902M3805L5941p2446j09728N2280P5773r602j00447
$$ -83817 -22019 54732 19688 7786 51591 87532 15086 -94642 -42362 33411 23809 -76638
13447g6638n9523J4514L2639K7014M0492J2597n0070M3969N1498K1760k1466m4438
$$ -76638 -136161 -121647 -89008 -61994 -21502 -8905 -58975 -15006 36492 58252 36786 -7652
13435g652o4997J26819L1515l2006J0726L1165P149L2117k2248n9275l9209m521
$$ -7652 -72649 54170 85685 53679 64405 95570 102719 134836 112588 53313 14104 9583
13423I583K0534O0497n082M8049j7339r7335L0046M7754J2270K9190j6767p0604
$$ 9583 30117 90614 85532 133581 116242 18907 48953 96707 108977 138167 121400 50796
13411E0796R371M7617P817q22m282J7211k1717l3298J964m3701p6262m7755R3770
$$ 50796 60167 107784 115601 114779 110497 127708 105991 72693 74657 30956 -45306 -93061 709
13398G09K6183m4555k1258N29L9950L622q315N3874m4075l0536k420K6801J05228
$$ 709 26892 -17663 -38921 -38392 1558 5180 -3135 50739 6664 -23872 -26292 509 105737
13385A05737l6753m8053O568J137N9503J18858J3163q9847q7145o247M0682P116
$$ 105737 68984 20931 27499 28636 88139 206997 220160 130313 43168 36921 77603 84719
13373H4719J7173l1081k486m3619M4671Q3243j19102j17916K5337K6036m0504
$$ 84719 101892 70811 68325 24706 69377 152620 33518 -84398 -59061 -33025 -73529
13362g3529J742N9731m5647r0573M8232K7583O8136N5530M838k1420k0037j3094
$$ -73529 -71787 -12056 -57703 -148276 -100044 -72461 -4325 51205 56043 34623 14586 1492
13350A492m8130M0919J3474l9928p4849o0509K7930P3991M1661P888N1748o4465
$$ 1492 -46638 -5719 7755 -32173 -107022 -167531 -139601 -65610 -23949 -16061 35687 -28778
13338b8778N5113L1688L5470n8670J4984m13m8794k81K9924o802J1700m6519l4867
$$ -28778 26335 58023 93493 34823 49807 49394 600 319 30243 23441 35141 -11378 -46245
13325d6245Q53q7049m7765l4931J24471J03650o790m1810N4523N2393r107k2180
$$ -46245 -45392 -132441 -180206 -215137 -90666 12984 6194 -35616 18907 71300 62193 40013
13313D0013L955j327l4010j30241J9286n039J5393M2610M4035m3898o2110L3653
$$ 40013 43968 42641 8631 -121610 -102324 -107363 -91970 -49360 -5325 -49223 -111333 -77680
13301g7680r009R1983M9980k327m879n7213r9273l7486O0301p777k74J4094k635
$$ -77680 -86689 5294 55274 52947 48068 -9145 -108418 -145904 -85603 -93380 -93654 -79560 -82195
13288h2195k5997J0806M6704O7630p9820p2132Q0862P4665j3615o9536M5600M7544
$$ -82195 -108192 -97386 -50682 16948 -62872 -135004 -54142 20523 6908 -62628 -17028 30516
13276C0516r247J7845n5401K4174L8482o2791N948j6n7076o6261P1777P8495k7073
$$ 30516 21269 39114 -16287 7887 46369 -16422 -10474 -10490 -67566 -133827 -62050 16445 -10628
13263a0628p7876M8666L8916N669r628M2388q664K532p9829o390M1883J31306
$$ -10628 -88504 -39838 -922 4747 -4881 37507 28843 31375 -48454 -54844 -12961 118345
13251A18345M6264m5240j23382N71M2078Q3772m9219l2658j8877o3125N9844j5729
$$ 118345 164609 119369 -4013 -3442 38636 122408 73189 40531 21654 -41471 18373 2644
13239B644M9211J061p2187m9376q1855L4544K8901J752m0155R3598Q4276L6428
$$ 2644 51855 52916 -19271 -68647 -150502 -115958 -87057 -85305 -125460 -31862 52414 88842
13227H8842k8108j31863l9036K1238J3673L0588p8434j0750n1908Q7801N2109
$$ 88842 60734 -71129 -110165 -88927 -75254 -44666 -123100 -133850 -185758 -97957 -45848
13216d5848k5115m46M9809J1610m1376m9436M2556J1729P588k2916N478R855J4811
$$ -45848 -70963 -71409 -21600 -9990 -51366 -100802 -58246 -46517 -38929 -61845 -56367 -46512 -31701
13203c1701M4393K2406l0134J51078q8506j28530Q0364N8012P2251L5254k7195
$$ -31701 12692 35098 4964 156042 67536 -60994 19370 77382 149633 184887 157692
13192A57692n5297k7282m1294j1369K9682o0776n084l6905J1464M3723M8532O7783
$$ 157692 102395 75113 33819 22450 52132 -8644 -13728 -50633 -39169 4554 53086 120869
13180A20869p3429o8769n8142l7872Q5567l7946M6357j3128O4787L571J6425K9636
$$ 120869 47440 -21329 -79471 -117343 -31776 -69722 -23365 -36493 28294 31865 48290 77926
13168G7926K2451J3022n0753Q1625L1067p8072J393m650p0222q1305O4100J2711
$$ 77926 100377 113399 62646 144271 175338 97266 98659 94009 23787 -57518 6582 19293
13156A9293j8787k2440m146R1924L6477j03275J2j9904Q8224L6732J4803k440
$$ 19293 506 -21934 -26080 65844 102321 -954 -942 -20846 67378 104110 118913 116473
13144A16473q4439n625K9p6657l6158R0330l3661j12557k309M1532J12513O1912
$$ 116473 32034 26409 26438 -50219 -86377 3953 -29708 -142265 -144574 -103042 9471 71383
13132G1383q3480q9614m56K0618N5256J2570M1792J23390K7622j02442o3187o092
$$ 71383 -12097 -101711 -102167 -81549 -26293 -13723 28069 151459 179081 76639 13452 7360
13120G360M4057o7749q2536N8365l916l7878o5738N1946L6448L314j8856l4479
$$ 7360 51417 -16332 -98868 -40503 -44419 -82297 -148035 -96089 -59641 -56327 -75183 -109662
13108a09662J4152Q4842K2877j16248K7878r751K9088K4419M7662J9215m0719
$$ -109662 -95510 -10668 12209 -104039 -76161 -85912 -56824 -32405 15257 34472 -6247
13097f247P321O6720m35n9690k7600M5011N8988J0213n7643o6325j3024K8275
$$ -6247 1074 67794 67359 7669 -19931 25080 84068 94281 36638 -29687 -42711 -14436
13085a4436L5068k2145l291j1150o5016k3977R0345L5960n6027N9619l8371m5709
$$ -14436 20632 -1513 -4804 -15954 -80970 -104947 -14602 21358 -34669 24950 -13421 -59130
13073e9130j9308P5828K1039m4163P7677l3497m1660K4563K2671K7789l3621N2332
$$ -59130 -78438 -2610 18429 -25734 51943 18446 -23214 1349 24020 51809 18188 70520
13061G0520l4463N824N6145L1015k5023l4957r984k4237Q2441J1889M4604J0455
$$ 70520 36057 41881 98026 129041 104018 69061 59077 34840 117281 129170 173774 184229
13049A84229j8586q9552j03342k4794Q3329j8781o6012k8601R0876O1756n1757
$$ 184229 165643 76091 -27251 -52045 31284 12503 -53509 -82110 8766 70522 18765
13038A8765m0154J9429M3340p8827n7317K6836M5971o8701m0685j68N3300N0132
$$ 18765 -21389 -1960 41380 -37447 -94764 -67928 -21957 -90658 -131343 -131511 -78211 -28079
13026b8079Q5456J6487k7094n2801j4172K2748k822m2627q0402L50M0555M0359
$$ -28079 57377 73864 46770 -6031 -20203 2545 -277 -42904 -123306 -122956 -82401 -42042
13014d2042M760l1311K3932L019L5355N3163m7908k556m0826l1602N1953P4234
$$ -42042 -37282 -68593 -44661 -41642 -6287 46876 -1032 -3588 -44414 -76016 -24063 50171
13002E0171m4017j10356l2847j9300O792j41673M9384N4185N9315L4699m0911
$$ 50171 6154 -104202 -137049 -156349 -149557 -291230 -241846 -187661 -128346 -93647 -134558
12991a34558J5157J8523K1224p475M3972K1324P2235O871m300L165L3561j8974
$$ -134558 -119401 -100878 -79654 -87129 -43157 -21833 50402 57273 52973 56138 89699 70725
12979G0725j04284r871N5067j6347l1133o094J4098o139r9405l1528K8649J3152
$$ 70725 -33559 -43430 11637 -4710 -35843 -41937 -27839 -33978 -133383 -164911 -136262 -123110
12967a23110j2769M7421J3336J1709L0628N0250O5592q4013k5950L5477J3268
$$ -123110 -135879 -88458 -75122 -63413 -32785 17465 83057 -956 -26906 8571 21839
12956B1839l1778K5833k792j1081K910J622k544k0045q2406M0496M3207n4480
$$ 21839 -9939 15894 13102 2021 4931 6553 4009 -16036 -98442 -57946 -14739 -69219
12944f9219K5543J0817J9770m1598O23O4938J4395q6709l3779J7056k9402N3095
$$ -69219 -43676 -32859 -13089 -54687 -54064 10874 25269 -61440 -95219 -78163 -107565 -54470
12932e4470M227n457Q8422p425l5739j6864k3415j5923K2292L5821N4985M5182
$$ -54470 -50243 -55700 32722 25297 -10442 -27306 -50721 -66644 -44352 -8531 46454 91636
12920I1636K7980j33098n9629P2543J2661n9776n0619M7830L3257j6727n6001
$$ 91636 119616 -13482 -73111 -568 12093 -47683 -98302 -50472 -17215 -33942 -89943
12909h9943k9099O4572o867k0385O8946M3321M8164o780O968J4002o5322p3490
$$ -89943 -119042 -54470 -61337 -81722 -12776 30545 78709 71929 78897 92899 27577 -45913
12897d5913n4183o3822n7857n9475P0919O8814O5960N2752P6573j3172p4041o2575
$$ -45913 -100096 -163918 -221775 -281250 -210331 -141517 -75557 -22805 53768 40596 -33445 -96020
12885i6020p2170q478K7577j5045j0946J9363Q9412Q4352L1365l5459l1410M2113
$$ -96020 -168190 -176668 -149091 -164136 -175082 -155719 -66307 18045 49410 13951 -17459 24654
12873B4654J26616M9284p6157j17156l7117Q2871r00n6204l6761l3587L3285m631
$$ 24654 151270 200554 124397 7241 -29876 52995 52095 -4109 -40870 -74457 -41172 -45803
12861d5803j5610J9517n3009l4790K0409j4214n6384P6008O2568R0576l0769K692
$$ -45803 -61413 -41896 -94905 -129695 -109286 -123500 -179884 -103876 -41308 49268 18499 21191
12849B1191O860m0544m6551L5303O4673j0500M7909L1776q0974l8800n794m3319
$$ 21191 28051 -12493 -59044 -23741 40932 30432 78341 110117 29143 -9657 -15451 -58770
12837e8770l5602n2493m6991N1379P0066R673L6755M5330L603q52m2828L0145
$$ -58770 -94372 -146865 -193856 -142477 -72411 -62738 -25983 19347 22950 22098 -20730 9415
12825I415n996n9064m8364o497q762J2165N7573M2160r089O422M263J4387l1861
$$ 9415 3419 -55645 -104009 -110506 -119268 -107103 -49530 -7370 -16459 -10037 -5774 8613 -23248
12812b3248o0256N8873Q6707m5470J1893m2332L4746o1729l7136O7354R0998J8405
$$ -23248 -83504 -24631 62076 16606 28499 -13833 20913 -40816 -77952 -10598 80400 98805
12800I8805O8513q7384o5231M0650j3449n7809j7594k6982n0546L8671j859J3819
$$ 98805 167318 79934 14703 55353 41904 -15905 -33499 -60481 -111027 -72356 -74215 -60396
12788f0396l4018L28r991q12J01529m2701k5523p8276k8482L0294N2147K2504
$$ -60396 -94414 -94086 -104077 -104889 -3360 -46061 -71584 -149860 -178342 -148048 -95901 -73397
12776g3397l5160l1054q657K6745L8193k7391N6771q786K2538K4352J2940L0428
$$ -73397 -108557 -139611 -148268 -121523 -83330 -110721 -53950 -62736 -40198 -15846 -2906 27522
12764B7522o412M6298n4579o9070l9245L5648J00696N7346K0846j5030k9664K3715
$$ 27522 21110 67408 12829 -56241 -95486 -59838 40858 98204 119050 104020 74356 98071
12752I8071R540k3291n5306m2655J7139K1447J8872M7869P18o5065n8903N3317
$$ 98071 107611 84320 29014 -13641 3498 24945 43817 91686 92404 27339 -31564 21753
12740B1753N5833n6352l8987k5097k7653M0557k1004m2005Q931k084N8819J1932
$$ 21753 77586 21234 -17753 -42850 -70503 -29946 -50950 -92955 -84024 -86108 -27289 -15357
12728a5357j8102P8159M2616j5249J0553j8743j8220m8177j5538O559J8671P5853
$$ -15357 -33459 44700 87316 72067 82620 63877 45657 -2520 -18058 -11499 7172 83025
12716H3025M7981l0794j30850o5949N109P8590k954p8872J7407K6488n3710J3115
$$ 83025 131006 100212 -30638 -96587 -91478 -12888 -15842 -94714 -77307 -50819 -104529 -91414
12704i1414N9789O3148o9043n6849m5083N6571J9574O3867r1008o818P2157P705
$$ -91414 -31625 31523 -37520 -94369 -139452 -82881 -63307 560 -90448 -97266 -25109 -17404
12692a7404L3554j8355n4124P5324J5491k563L6431M1174J1354l7446q1652J9502
$$ -17404 16150 -2205 -56329 18995 34486 31923 68354 109528 120882 83436 1784 21286
12680B1286l3818K663P5877O3511L297l6556K3062o8193q9389l1600k9528l6704
$$ 21286 -12532 -9869 66008 129519 132816 96260 119322 51129 -38260 -69860 -99388 -136092
12668a36092J824O0207L519M763O5307J5658k3323L737K1460l2801l3803l2542
$$ -136092 -134268 -74061 -70542 -65779 -472 15186 -8137 -4400 17060 -15741 -49544 -82086
12656h2086L4694N8338O7884O008l2247k5768r0068o4333n6062J15644M5574O8844
$$ -82086 -47392 10946 78830 84838 52591 26823 -63245 -127578 -183640 -67996 -22422 46422
12644D6422m0381n5980m155m70n1303P71L0377m7552J4573O1386M9709j8199k4931
$$ 46422 6041 -49939 -54094 -54564 -105867 -105096 -74719 -122271 -107698 -46312 3397 -14802 -39733
12631c9733K6799K4762M4554J4376k1612L9391L065m2046k6905o7570n221m854
$$ -39733 -12934 11828 56382 70758 49146 88537 91602 49556 22651 -44919 -50140 -54994
12619e4994o4793J0364J8747n036L6270Q7695j6732m4122K2229o6432N5441J5084
$$ -54994 -119787 -109423 -90676 -95712 -59442 28253 11521 -32601 -10372 -76804 -21363 -6279
12607f279l1543j04133j6154m9249J0026J01947j76N8417k1694K3471r986o6256
$$ -6279 -37822 -141955 -158109 -207358 -197332 -95385 -95561 -37144 -58838 -35367 -45353 -111609
12595a11609K1899L1204k2618n2903K4976K5444J1673n3048L4856P0175N563J1010
$$ -111609 -89710 -58506 -81124 -134027 -109051 -83607 -71934 -124982 -90126 -19951 -14388 -3378
12583c378q0119m1746N8523m7606n2387R5610P6718m7127q0984k3739O878l7557
$$ -3378 -83497 -125243 -66720 -114326 -166713 -71103 5615 -41512 -122496 -146235 -139357 -176914
12571a76914L7228k6791M582M2355R0954R2696J091j353J3424p8932n9131o697
$$ -176914 -139686 -166477 -161895 -119540 -28586 64110 65201 63848 77272 -1660 -60791 -67488
12559f7488J12362J09314k8954j14194k6981l501Q5391R048p0633J1874M8674
$$ -67488 44874 154188 125234 11040 -15941 -19442 65949 74997 4364 16238 64912
12548F4912J4219j1918N5347m23m2012J1863j1573p9308m6943m8024M6122J03445
$$ 64912 79131 67213 122560 122137 80125 91988 80415 1107 -45836 -93860 -47738 55707
12536E5707J282l2259j3123J5750k1178r896n2607n9643l7621R5093L3265M0274
$$ 55707 56989 24730 11607 27357 6179 -3717 -56324 -115967 -153588 -58495 -25230 15044
12524A5044O6021n4663k9951L8019J599p792L553l7901j10481l3519M8533J5555
$$ 15044 81065 26402 -3549 34470 36069 28277 31830 -6071 -116552 -150071 -101538 -85983
12512h5983l1034P963R0823k2673L201N8512Q6608O8341M3746L166p7516m5503
$$ -85983 -117017 -109054 -18231 -40904 -37703 20809 107417 175758 219504 222670 145154 99651
12500I9651q1360j59389l2183J05674n9765m9359M8817N1301r359q0595K1994
$$ 99651 18291 -141098 -173281 -67607 -127372 -176731 -127914 -76613 -85972 -166567 -144573
12489a44573L0744K7659K4497m7963L4915O6994n0179L699K1243R609j6636j3173
$$ -144573 -113829 -86170 -61673 -109636 -74721 -7727 -57906 -54207 -32964 -23355 -39991 -53164
12477e3164P1249l965j27776m3834J08766R191Q5154J6230l1193R3367l8878k9881
$$ -53164 18085 14120 -113656 -157490 -48724 -39533 45621 61851 30658 124025 85147 55266
12465E5266o7007k2108P3508l0425l6871J727j6838l1490K1495o1268o0007M9179
$$ 55266 -11741 -33849 39659 9234 -27637 -25910 -42748 -74238 -52743 -114011 -174018 -124839
12453a24839N175o680m9022l6792k1869J17024Q7232J0816l6492Q29Q438k2996
$$ -124839 -119664 -126344 -175366 -212158 -234027 -117003 -29771 -18955 -55447 -54618 -46180 -69176
12441f9176j7986Q69P3482R0956j11233j81498m5573N9135O9377N7973k1970R0463
$$ -69176 -87162 -86293 -12811 78145 -33088 -214586 -260159 -201024 -131647 -73674 -95644 -5181
12429e181K226m9210o1413m578K0117j5214n775J7469M2064P6694K7189p7301
$$ -5181 -2955 -52165 -113578 -118156 -98039 -113253 -119028 -101559 -59495 17199 44388 -32913
12417c2913o1811q392O9997L1398L6370N0721L158L7637k3076p8856k180n3369
$$ -32913 -94724 -103116 -33119 -1721 34649 85370 88528 126165 103089 24233 22053 -31316
12405c1316Q4087N8298l9735p2294o2950J1759j0688o912M8424l637r2641K0415
$$ -31316 52771 111069 71334 -960 -63910 -52151 -62839 -69751 -21327 -24964 -117605 -97190
12393i7190N4496L6814K565M9855M5460N8357j6108q2116r336k7347P4919j8074
$$ -97190 -42694 -5880 -3315 46540 92000 150357 134249 52133 42797 15450 90369 72295
12381G2295q160r1465m8759P5521L4918n3828j3058j0997K4085k9173L9024K0132
$$ 72295 64135 -27330 -76089 -568 34350 -19478 -32536 -43533 -19448 -48621 -9597 10535
12369A0535L649J8995M4104L2077K7661m2316o1754k2810q995j5435L1372O5146
$$ 10535 14184 33179 77283 109360 137021 94705 32951 10141 1146 -14289 17083 82229
12357H2229k3199m9382P628M674J1303J4197L6761M2277l8700l7204m1704L898
$$ 82229 59030 9648 17276 21950 33253 47450 84211 126488 87788 50584 8880 12778
12345A2778N1352L1087K6053j01155m9836N5936N1077m18o3194m08Q463q5465
$$ 12778 64130 95217 121270 20115 -29721 26215 77292 76874 13680 13272 21735 -63730
12333f3730m0267P2856P4753n585J3387L3709J127l982J8381m934m0962p4396
$$ -63730 -103997 -31141 43612 38027 51414 85123 86250 82268 100649 95715 54753 -19643
12321a9643l9257P4110K2593k4762Q0287M6473m5804n7123o053o26j4805n8227
$$ -19643 -58900 15210 37803 13041 93328 139801 93997 36874 30821 30195 15390 -42837
12309d2837O9011P5168l695R7671j11547j49671o1038P8427R3001k1601n1557
$$ -42837 26174 101342 97647 195318 83771 -65900 -126938 -48511 44490 22889 -28668
12298b8668R6286N4287k2300r780j8849m6879L2841n8234O1804J8036p9684P2449
$$ -28668 67618 121905 99605 89825 70976 24097 56938 -1296 60508 78544 -1140 71309
12286G1309R5099J649k4999M6877l2377q4291o3256j5367Q2191L2398n1740l2141
$$ 71309 166408 168057 143058 189935 157558 73267 10011 -5356 76835 109233 57493 25352
12274B5352m5193m9497J9000L1852p1024N772N6786O790K030Q5970O1142j8151
$$ 25352 -19841 -69338 -50338 -18486 -89510 -83738 -26952 -20162 -18132 67838 128980 110829
12262A10829o6072Q516j23629p0307q4568M1235J2167k5571J0477L9662K4677
$$ 110829 44757 53273 -70356 -140663 -225231 -183996 -171829 -197400 -186923 -147261 -122584
12251a22584m8573L7416k6896m5375N8373J04007M3643j00137l9169M5887N5237
$$ -122584 -171157 -133741 -160637 -206012 -147639 -43632 11 -100126 -139295 -93408 -38171
12240c8171M2234o8793K7401J9780m4920l3700J1712k9113J0055o85M6318L0395
$$ -38171 4063 -64730 -37329 -17549 -62469 -96169 -84457 -113570 -103515 -104200 -57882 -27487
12228b7487K6096Q5972n9807j3727N5928M1559j4246j4933o9830n1771P581N5794
$$ -27487 -1391 84581 24774 11047 66975 108534 94288 79355 9525 -42246 -34665 21129
12216B1129K2233n1098K0607M3054q0194l4229M6288N6093R8281l9656r4544p6062
$$ 21129 43362 -7736 12871 55925 -24269 -58498 -12210 43883 142164 102508 7964 -68098
12204f8098l734N682j5409L7634K7032M7035J2360M5834l5136r9642l3415K4712
$$ -68098 -71832 -66150 -81559 -43925 -16893 30142 42502 88336 53200 -46442 -79857 -55145
12192e5145k3350M6673L5640J01275L923p0955q799k1273l4573L4841Q6777N666
$$ -55145 -78495 -31822 3818 105093 109016 38061 29262 7989 -26584 8257 95034 100700
12180A00700K7776M6450k0583j1638j1356l2145m1736k6361j0252J8919N627K1122
$$ 100700 128476 174926 154343 142705 131349 99204 57468 31107 20855 39774 45401 66523
12168F6523j3195j6892J0041m4207l8512j8450K0058j2231m0631j6297L6680M0449
$$ 66523 53328 36436 46477 2270 -36242 -54692 -34634 -46865 -87496 -103793 -67113 -26664
$$ [...]
##END NTUPLES=NMR SPECTRUM
##END=
