##TITLE=Analysis number 330386
Compound Code cc 66813
Book Reference 553/30
Project Code adrs
Chemist Name simons
##JCAMPDX= 6.0         $$ Bruker NMR JCAMP-DX V2.0
##DATA TYPE= NMR SPECTRUM
##DATA CLASS= NTUPLES
##ORIGIN= Bruker BioSpin GmbH
##OWNER= nmr
$$ XWIN-NMR		Version 3.5
$$ Wed Nov 21 12:15:56 2007 GMT Standard Time (UT+0h)  MAYBRIDGE\nmr@NMR_250MHZ
##.OBSERVE FREQUENCY= 250.131544655141
##.OBSERVE NUCLEUS= ^1H
##.ACQUISITION MODE= SIMULTANEOUS (DQD)
##.ACQUISITION SCHEME= undefined
##.AVERAGES= 16
##.DIGITISER RES= 18
##SPECTROMETER/DATA SYSTEM= dpx250
##.PULSE SEQUENCE= zg30
##.SOLVENT NAME= CDCl3
##.SHIFT REFERENCE= (INTERNAL, CDCl3, 0, 16.522)
##AUDIT TRAIL= $$ (NUMBER, WHEN, WHO, WHERE, WHAT)
$$ ##TITLE= Audit trail, XWIN-NMR		Version 3.5
$$ ##JCAMPDX= 5.01
$$ ##ORIGIN= Bruker BioSpin GmbH
$$ ##OWNER= nmr
$$ C:\u/data/dgb/nmr/ADRS/1930/pdata/1/auditp.txt
$$ ##AUDIT TRAIL=  $$ (NUMBER, WHEN, WHO, WHERE, WHAT)
(   1,<2007-11-21 12:15:30.40 +000>,<MAYBRIDGE\nmr>,<NMR_250MHZ>,
      <created by zg, POWCHK disabled, PULCHK disabled
       configuration hash MD5:
       76 6E 9A 78 1E 09 19 81 EC 84 63 8F B0 6A 59 2D
       data hash MD5: 64K
       26 74 71 15 BD 39 E2 57 F6 BA 47 F1 0C EC 0F 87>)
(   2,<2007-11-21 12:15:44.67 +000>,<MAYBRIDGE\nmr>,<NMR_250MHZ>,
      <Start of raw data processing
       ef LB = 0.3 FT_mod = 6 PKNL = 1 SI = 32K 
       data hash MD5: 32K
       2B 85 F1 CA C3 A0 58 7A C3 FA FE 96 4B 98 54 13>)
(   3,<2007-11-21 12:15:46.19 +000>,<MAYBRIDGE\nmr>,<NMR_250MHZ>,
      <apk 
       data hash MD5: 32K
       42 D2 EB 57 67 CD 25 0A F4 27 AA E4 58 99 E1 0D>)
(   4,<2007-11-21 12:15:46.92 +000>,<MAYBRIDGE\nmr>,<NMR_250MHZ>,
      <abs ABSG = 5 
       data hash MD5: 32K
       83 55 4F 7B 59 A4 FA 90 C0 C6 AB A7 C6 69 A5 3C>)
$$ ##END=
$$ 
$$ hash MD5
$$ 25 45 EB AA 8E 9C A8 58 32 F6 6E EB 52 F5 67 B4
##$RELAX= 
##$RELAX= 
##$RELAX= 
##$RELAX= 
##$RELAX= 
##$RELAX= 
##$RELAX= 
$$ Bruker specific parameters
$$ --------------------------
##$DU= <C:\u>
##$EXPNO= 1930
##$NAME= <ADRS>
##$PROCNO= 1
##$TYPE= <nmr>
##$USER= <dgb>
##$AMP= (0..31)
100 100 100 100 100 100 100 100 100 100 100 100 100 100 100 100 100 100 
100 100 100 100 100 100 100 100 100 100 100 100 100 100 
##$AQSEQ= 0
##$AQ_mod= 3
##$AUNM= <au_zg>
##$AUTOPOS= <19 >
##$BF1= 250.13
##$BF2= 250.13
##$BF3= 250.13
##$BF4= 250.13
##$BF5= 500.13
##$BF6= 500.13
##$BF7= 500.13
##$BF8= 500.13
##$BYTORDA= 1
##$CFDGTYP= 0
##$CFRGTYP= 5
##$CHEMSTR= <none>
##$CNST= (0..31)
1 1 145 1 1 1 1 1 1 1 1 1 1 1 1 1 1 1 1 1 1 1 1 1 1 1 1 1 1 1 1 1 
##$CPDPRG= <>
##$CPDPRG1= <>
##$CPDPRG2= <>
##$CPDPRG3= <>
##$CPDPRG4= <mlev>
##$CPDPRG5= <mlev>
##$CPDPRG6= <mlev>
##$CPDPRG7= <mlev>
##$CPDPRG8= <mlev>
##$CPDPRGB= <>
##$CPDPRGT= <>
##$D= (0..31)
0 1 0 0 0 0 0 0 0 0.06 0 0 0 0 0 0 0.0002 0 0 0 0 0 0 0 0 0 0 0 0 0 0 
0 
##$DATE= 1195647329
##$DBL= (0..7)
120 120 120 120 120 120 120 120 
##$DBP= (0..7)
150 150 150 150 150 150 150 150 
##$DBP07= 0
##$DBPNAM0= <>
##$DBPNAM1= <>
$$ [...]
##$SUBNAM7= <"">
##$SUBNAM8= <"">
##$SUBNAM9= <"">
##$SW= 20.6930455092707
##$SWIBOX= (0..15)
0 0 3 0 0 0 0 0 0 0 0 0 0 0 0 0 
##$SW_h= 5175.983436853
##$TD= 65536
##$TD0= 1
##$TE= 295.16
##$TE2= 300
##$TE3= 300
##$TEG= 300
##$TL= (0..7)
0 120 120 120 120 120 120 120 
##$TP= (0..7)
150 150 150 150 150 150 150 150 
##$TP07= 0
##$TPNAME0= <>
##$TPNAME1= <>
##$TPNAME2= <>
##$TPNAME3= <>
##$TPNAME4= <>
##$TPNAME5= <>
##$TPNAME6= <>
##$TPNAME7= <>
##$TPOAL= (0..7)
0.5 0.5 0.5 0.5 0.5 0.5 0.5 0.5 
##$TPOFFS= (0..7)
0 0 0 0 0 0 0 0 
##$TUNHIN= 0
##$TUNHOUT= 0
##$TUNXOUT= 0
##$USERA1= <user>
##$USERA2= <user>
##$USERA3= <user>
##$USERA4= <user>
##$USERA5= <user>
##$V9= 5
##$VALIST= <valist>
##$VCLIST= <CCCCCCCCCCCCCCC>
##$VD= 0
##$VDLIST= <DDDDDDDDDDDDDDD>
##$VPLIST= <PPPPPPPPPPPPPPP>
##$VTLIST= <TTTTTTTTTTTTTTT>
##$WBST= 1024
##$WBSW= 4
##$XGAIN= (0..3)
0 0 0 0 
##$XL= 0
##$YL= 0
##$YMAX_a= 188024
##$YMIN_a= -247019
##$ZGOPTNS= <>
##$ZL1= 120
##$ZL2= 120
##$ZL3= 120
##$ZL4= 120
##$ABSF1= 16.522
##$ABSF2= -4.171173
##$ABSG= 5
##$ABSL= 3
##$ALPHA= 0
##$AQORDER= 0
##$ASSFAC= 0
##$ASSFACI= 0
##$ASSFACX= 0
##$ASSWID= 0
##$AUNMP= <proc_1d>
##$AZFE= 0.1
##$AZFW= 0.1
##$BCFW= 0
##$BC_mod= 0
##$BYTORDP= 0
##$COROFFS= 0
##$CY= 12.5
##$DATMOD= 1
##$DC= 0
##$DFILT= <>
##$DTYPP= 0
##$F1P= 14.0000005364418
##$F2P= -0.99999901652339
##$FCOR= 0.5
##$FTSIZE= 32768
##$FT_mod= 6
##$GAMMA= 0
##$GB= 0
##$INTBC= 1
##$INTSCL= 1
##$ISEN= 128
##$LB= 0.3
##$LEV0= 0
##$LPBIN= 0
##$MAXI= 10000
##$MC2= 0
##$MEAN= 0
##$ME_mod= 0
##$MI= 0
##$NCOEF= 0
##$NC_proc= -4
##$NLEV= 6
##$NOISF1= 0
##$NOISF2= 0
##$NSP= 0
##$NTH_PI= 0
##$NZP= 0
##$OFFSET= 16.522
##$PC= 1
##$PHC0= 173.1519
##$PHC1= 10.71345
##$PH_mod= 1
##$PKNL= yes
##$PPARMOD= 0
##$PSCAL= 4
##$PSIGN= 0
##$REVERSE= no
##$SF= 250.13
##$SI= 32768
##$SIGF1= 0
##$SIGF2= 0
##$SINO= 400
##$SIOLD= 32768
##$SREGLST= <1H.CDCl3>
##$SSB= 0
##$STSI= 32768
##$STSR= 0
##$SW_p= 5175.98343685301
##$SYMM= 0
##$S_DEV= 0
##$TDeff= 65536
##$TDoff= 0
##$TI= <Analysis number 999999
Compound Code 99
Book Reference 9
Project Code 9>
##$TILT= no
##$TM1= 0
##$TM2= 0
##$TOPLEV= 0
##$USERP1= <user>
##$USERP2= <user>
##$USERP3= <user>
##$USERP4= <user>
##$USERP5= <user>
##$WDW= 1
##$XDIM= 32768
##$YMAX_p= 287372539
##$YMIN_p= -462526
$$ End of Bruker specific parameters
$$ ---------------------------------
##NTUPLES= NMR SPECTRUM
##VAR_NAME=  FREQUENCY,     SPECTRUM/REAL,   SPECTRUM/IMAG
##SYMBOL=    X,             R,               I
##VAR_TYPE=  INDEPENDENT,   DEPENDENT,       DEPENDENT
##VAR_FORM=  AFFN,          ASDF,            ASDF
##VAR_DIM=   32768,         32768,           32768
##UNITS=     HZ,            ARBITRARY UNITS, ARBITRARY UNITS
##FACTOR=    0.157963299565203, 1,           1
##FIRST=     4132.6476996994, 0,             0
##LAST=      -1043.33573715361, 0,           0
##MIN=       -1043.33573715361, -462526,     0
##MAX=       4132.6476996994, 287372539,     0
$$ Real data points
##PAGE= N=1
##DATA TABLE= (X++(R..R)), XYDATA
$$ [...]
27665 28918 67374 172963 59582 47623 -26822 -112582 -147921 -83634 18641 42974 81459
27654 81459 13174 123627 151040 7135 -107411 -7045 41946 -129569 -257496 -291246
27644 -291246 -282727 -297763 -271435 -236374 -226532 -120902 -38399 82268 85262 -15993 -71562
27633 -71562 -4721 115384 148402 99491 90551 126470 117342 -26444 17938 73166 -8873 -93418
27621 -93418 2379 30327 -90000 -123224 -147117 -48131 16930 25083 49978 113212 110189 47493
27609 47493 -145104 -95948 76020 35135 -27407 44055 174174 147120 45870 82710 46563
27598 46563 -4211 -8674 10688 -40448 -18058 848 92257 156522 151579 56752 13922 -60615
27586 -60615 -99040 -114305 -157942 -211813 -84760 68638 64031 -34889 -138170 -79517 979
27575 979 -28512 55418 78274 90387 -31909 -109750 -151717 -213053 -259019 -215879 -153498 -114212
27563 -114212 -134415 -50428 -64010 -29680 49201 56493 73958 71735 23821 159829 200754 114416
27551 114416 90693 132136 117232 120507 191113 195483 135747 71977 -11491 -90729 -7345 92271
27539 92271 -3825 -134273 -137524 -62979 46325 55793 103344 101615 185851 145338 14877 -39171
27527 -39171 -205590 -174829 -155178 -139392 -259032 -240191 -272695 -224058 -80305 -90488 -230256
27516 -230256 -229032 -123922 -100086 -103891 62519 43299 62831 89811 62008 -14121 -21364 -58268
27504 -58268 -46016 3382 -70997 -27850 -83985 -130553 21236 112794 67687 -19542 -14672 -27478
27492 -27478 24211 37340 -19423 -107349 -172894 -173892 -178749 -122758 -27382 -42961 -12136 84708
27480 84708 116808 99280 53978 63081 90706 -49169 -109028 -64843 10121 -48794 -116273 -116989
27468 -116989 -176939 -121511 -10872 42176 69589 50069 66986 117784 21572 -37837 85277
27457 85277 51601 -32034 -90324 -103475 -116135 -86184 -1391 -75746 -243699 -316072 -202886
27446 -202886 -90383 87080 161594 146280 31342 -20985 90250 149261 141411 57426 -557
27435 -557 27353 -4582 -2076 101670 102470 73818 -116356 -158345 -19805 66828 172175 265781
27423 265781 125928 85752 56029 15794 -81967 -84099 -74711 -67072 -2908 124053 87435 117071
27411 117071 116087 107603 77469 107063 25181 -52357 -112708 -44348 -78444 -84939 -125406 -107328
27399 -107328 -17328 31714 -47203 -42963 -133859 -114013 -62304 -69549 -88648 -106379 -79313 85562
27387 85562 180395 191193 133669 165963 157067 71102 52731 -68695 -176884 -159587 -121671
27376 -121671 -127417 -115370 20484 180290 251233 209957 60686 -45748 -50510 -21146 61649
27365 61649 50712 -57998 -62339 -127913 -30847 -73896 46294 264512 175350 44177 17666
27354 17666 10359 -43734 -130458 -125484 -56839 2832 -16512 -43322 -53583 -42926 -5332 -72404
27342 -72404 -119406 -114591 -54794 86192 13340 977 4338 114372 52280 -10117 -43834 -62623
27330 -62623 -57645 60862 152514 103740 13263 113727 229885 152918 116904 10594 -64490
27319 -64490 -50523 -20956 114063 36423 -1359 67607 43706 81210 144604 150643 181451 81057
27307 81057 -54658 -92245 -94546 23011 123672 172995 7554 -10129 23249 979 7554
27296 7554 47303 135255 185790 96384 -98888 -179760 -103670 -26815 34236 88577 72612 105842
27284 105842 49586 13521 56515 67123 -13998 -65107 -51194 6245 3528 18192 26974 35815
27272 35815 22667 39959 132300 100418 43647 22677 104096 43382 -137218 -68659 53172
27261 53172 24931 30913 -42324 -97549 46631 85228 99006 205327 67045 -33351 14364
27250 14364 9046 118347 162915 200409 95070 57454 85662 73892 -36743 -146439 -111763
27239 -111763 26760 7940 -74094 -63092 -31716 7327 75925 54630 -51924 2932 18936
27228 18936 61947 98891 88624 202073 144816 59133 83131 102906 143332 88758 67867
27217 67867 -11301 78418 196827 147846 111274 -8054 -32943 -34115 -99129 -40456 8738
27206 8738 102228 199720 243858 80963 -55326 31046 141805 214560 129290 44228 43828 17978
27194 17978 93446 165922 112549 57142 37059 46006 43834 29123 7399 -19935 19290 74340
27182 74340 142921 64802 -16945 -16993 52255 81454 7644 -122499 -132343 8469 97772 41303
27170 41303 -44274 8834 61575 67803 -5044 -129014 -161563 2461 35920 16193 -52401
27159 -52401 -175388 -89941 39681 58815 7831 -134509 -119052 -63942 -103949 -112106 -60541
27148 -60541 -70098 28180 60117 37201 91764 -33940 -30476 17353 -2239 14663 -9405 32594
27136 32594 108592 125157 -355 -9289 -134823 -150277 19205 -16546 -62181 -72301 -79450
27125 -79450 -9555 15783 5404 -101524 -158375 -140882 -53154 76631 79963 82218 -15824 -108703
27113 -108703 -88792 -37303 -39192 53806 180843 127747 239262 205939 229311 263013 229220
27102 229220 283842 84751 -125307 -183698 -176551 -45137 113506 124664 32660 60977 71923
27091 71923 33452 -57388 -119804 -124474 -298 99128 182443 179946 134074 61611 60331 137822
27079 137822 181118 134801 92947 67713 73077 151890 92787 155229 96472 -37066 -69954
27068 -69954 75429 113180 -16201 -105315 -127586 2436 -5850 -102743 -117392 -114540 4095
27057 4095 105406 222062 234777 102764 165252 178713 180567 226015 188022 250753 330737
27046 330737 190835 12498 12966 -85416 -69125 998 4068 -27510 1385 34654 -23104 -28743
27034 -28743 28034 -117218 -158719 -135239 -71268 -61522 28578 -41563 -12614 4500 -118497
27023 -118497 -85459 -89116 -139965 -134059 -124198 -98891 -44166 29916 78465 112150 201275 95392
27011 95392 -5877 -48314 -66768 20523 69770 95358 90065 96802 110585 67943 57508 102588
26999 102588 85401 -10755 117603 146662 71343 77849 90465 197222 144869 83886 132072
26988 132072 150690 77525 51164 128982 14369 143063 281630 155852 -8602 -46310
26978 -46310 109603 94700 -329 82565 86335 203761 231753 137268 159922 143333 42268
26967 42268 -14491 -1458 -107136 -68279 -4643 -112165 -81772 -56023 -132125 -131303 30328
26956 30328 38524 -9788 -6674 -593 6848 -21674 -90907 -101247 -89651 -94414 15696 115937
26944 115937 129470 110151 76584 -73881 -209552 -124324 36483 106440 -26416 -164072
26934 -164072 -121462 -102985 -46124 43017 -657 -5754 -41487 -90613 -111830 -126682 -198127 -257256
26922 -257256 -200104 -158313 -95509 -98331 -73271 5279 37843 11209 12726 -42 -1849 -181202
26910 -181202 -240518 -181755 -31287 17801 27260 99967 61972 14744 -78602 -74402 -141314 -168913
26898 -168913 -96173 -46356 -32359 4645 96357 60576 41252 -3692 -36801 -100185 -39884
26887 -39884 23140 -1490 18777 -41579 -126060 -114976 -145033 -57147 21628 146736 147667 226210
26875 226210 240296 335835 269575 117809 69519 -110731 -63468 -20568 -5139 34891 69887
26864 69887 210196 211400 198874 303692 222200 151440 129321 37679 56474 7555 -66803
26853 -66803 -172674 -194721 -117891 -44259 -111122 -156202 -199325 -119390 -108948 -6433 -28446
26842 -28446 -65092 -125983 -46110 -36332 -169683 -198836 -65549 33362 -4540 -7689 116664
26831 116664 65599 102893 117562 147392 38073 25583 70392 -443 -29985 50206 147597
26820 147597 257875 200124 24241 -500 -8506 145071 115049 -15033 -60012 -16424 -900
26809 -900 -79818 -55929 -61470 -80776 -38795 10171 184340 304911 290851 236359 97401 160356
26797 160356 175516 45542 -13079 102478 145839 147532 56478 -25606 -70439 -109595 -33748
26786 -33748 -42364 -6189 108032 69397 86854 115199 7036 67738 108654 193913 250779
26775 250779 201793 109638 -31549 -127130 -150876 -136645 -125901 -90339 17418 69558 68261
26764 68261 88481 31567 128125 233093 277557 196639 151456 83602 87121 26831 -43705 -39983
26752 -39983 -57759 46780 105047 85761 -45222 -139002 -224818 -173878 -58373 -26563 -149716
26741 -149716 -214147 -135480 -150589 -112801 -88392 -80255 -109473 -52959 -49355 -16208 85069 76626
26729 76626 180037 251360 169715 104597 82257 33555 21309 -19316 -69252 -100152 -81976
26718 -81976 -80329 -104678 -86523 96870 257226 201979 111462 24736 32340 89320 158157 155778
26706 155778 53570 -136827 -112353 -65175 -92782 -80439 -120123 -59437 -98736 -229531 -161864
26695 -161864 -129 -19523 -39313 -24396 48556 95911 135671 215157 124843 -87383 -66775
26684 -66775 -91498 27111 -64690 -106145 -91251 -97243 -109579 -34069 20313 34082 124397 91028
26672 91028 12589 -34871 -84486 -17027 114176 123235 142916 142698 -107086 -174543 -207843 -154724
26660 -154724 -184597 -144778 -208963 -233566 -120452 -28436 -14714 86607 179095 210000 81841
26649 81841 126104 133471 150986 257347 210327 125360 86187 26805 15991 -17822 -42490 42594
26637 42594 128324 27022 -122913 -125047 -175112 -102866 62805 20761 -97356 -161274 -173729
26626 -173729 -94396 103915 149151 173381 167631 108561 96366 98809 359 -81035 45753
26615 45753 11392 -24889 45017 73104 106394 202249 212998 83481 -12159 8557 3129 -87677
26603 -87677 -83329 34750 127635 18907 -50417 20561 -27536 -119694 -31497 28435 79024
26592 79024 227167 76728 -59981 -70758 34090 11599 -91820 -52935 21939 -706 -14867
26581 -14867 -8169 4197 -54717 -142631 -60481 -34413 -122095 -125537 -104422 -158570 -261255 -281551
26569 -281551 -194878 -50027 47396 81651 55378 198122 257336 224505 155071 136353 189619
26558 189619 188951 52015 71600 161028 72379 -108780 -144133 -179284 -119650 -61589 -60201 -5519
26546 -5519 -49071 -825 -14225 54045 135142 67402 -85960 -184008 -77815 35911 69960
26535 69960 147569 148252 116083 107956 149850 159052 65019 65837 -46869 -69988 -30699 46580 205967
26522 205967 239503 174450 196233 61260 -109614 -42266 -81556 -5516 104341 119416 98584
26511 98584 121857 93750 21549 -32474 -12584 -27739 -22091 43456 20524 -76032 -152112 4806
26499 4806 131957 66867 65994 -1968 -123054 -175454 -103204 -207814 -271679 -117473 -29966
26488 -29966 -96051 -175381 -183625 -83943 -172073 -206513 -113276 -94207 -77702 9351 -21048 -112898
26476 -112898 -219693 -128127 -50462 -45658 -2822 63237 30831 -14337 -3311 -33072 4718
26465 4718 91600 75780 -39991 -209550 -125047 -38033 -14842 -43645 -119044 -88025 -3468
26454 -3468 71250 81142 72109 110640 76161 74842 40138 10959 -87481 -60917 48242 6453
26442 6453 17105 130509 150501 228359 153340 24414 -54920 -43734 83151 97615 148826
26431 148826 55968 10578 159897 94046 98360 193570 173716 82770 -17457 14065 -5676
26420 -5676 23100 100786 87421 72168 146388 164564 292228 221266 166657 47101 55903 107073
26408 107073 53800 93744 100516 51777 69134 59819 -37258 -64224 1856 114553 132924 119830
26396 119830 108877 7392 -49006 -74760 -165462 -77676 -29665 2152 55265 48280 30075
26385 30075 -56460 -83178 19839 18801 54653 -39768 46475 50976 16482 -73249 -100127 -83086
26373 -83086 -125246 -212735 -211260 -76633 2321 1802 -39851 -10938 -40736 -29566 5406 108929
26361 108929 156779 140388 293 -47262 -52636 -143768 24434 142834 138813 124377 93721
26350 93721 145206 157361 99084 92114 95459 111235 83793 221734 253596 374789 329640 211543
26338 211543 -13499 -153729 -4310 -61702 -154184 -250000 -244738 -125895 -12068 -94006 -35584
26327 -35584 -93270 -236897 -288012 -235194 -171186 -119460 -192460 -257650 -236359 -108499 -72899
26316 -72899 24763 70115 5692 -418 37266 15797 19636 38498 30830 -4385 28318 15599
26304 15599 -7280 74610 80460 53204 -172486 -231221 -223671 -52060 75013 22659 14251 7215
26292 7215 37536 68962 207309 232752 141358 98144 -96278 -147061 22575 121240 16669
26281 16669 -93164 -108017 -86482 -166152 -202026 -108384 -55205 88261 193649 181226 130722
26270 130722 109769 128013 46812 110667 102825 -35238 -72965 -72462 -120659 -128242 -26882 72510
26258 72510 110874 202101 190356 73026 -29591 -12760 63940 1877 -45689 -10815 45969
26247 45969 71611 99952 105048 -11634 11894 31842 -4632 45548 195040 151638 205929
26236 205929 234461 191007 166925 185390 91921 -48148 -48026 68416 138889 116788 133015
26225 133015 144563 149410 54561 -105283 -214413 -154206 -156963 -246555 -150280 -64119 -43658
26214 -43658 54747 119214 149640 212819 131537 -6077 -22019 -6503 84618 97937 89526 25701
26202 25701 59959 111875 134709 157894 177440 198944 143220 148645 41898 45429 -42641 -24008
26190 -24008 -8843 18556 174746 153080 211083 139901 29579 -4829 -17891 4137 29298
26179 29298 -9222 -57764 -65771 -96057 -64756 152255 186071 106414 -71110 -92744 -110796
26168 -110796 -76361 -49830 -74290 -57656 -25999 14068 113948 120909 162590 59547 -47664
26157 -47664 -7392 68989 65696 70605 10852 59054 -64318 -69307 6654 -43398 -108854 -218233
26145 -218233 -153937 -96074 -44766 59599 37240 -32301 -113765 -245329 -145555 -13506 -81219
26134 -81219 -100770 -140704 31503 59990 89743 127011 2436 -66352 -156814 -159077 -30756
26123 -30756 -25855 -50017 -9323 41953 -23264 -87839 -3421 -82587 -115725 7224 19189 -972
26111 -972 -56845 -188224 -188553 -126625 -165782 -29555 27694 9864 -34751 4680 35792 38769
26099 38769 142562 127233 175013 185559 86809 23169 -50243 -125218 -22166 -53979 -140861
26088 -140861 -67283 6532 51961 63957 153938 93485 94943 133666 142487 58491 50600 61889
26076 61889 170558 129892 196020 214490 146747 103567 155684 124528 162321 195186 195776 -52200
26064 -52200 -254317 -235628 -195802 -150606 -20374 -66105 -66676 -173652 -152209 -103366 61605
26053 61605 120465 48067 -68006 -98499 -80272 -53015 -6005 -25530 75295 150287 181978
26042 181978 29798 -164600 -202662 -59330 56453 61536 80983 93698 120748 151488 126390
26031 126390 103041 13673 18296 82711 10297 29025 164305 85613 38883 99708 216945
26020 216945 207910 130577 57194 -123954 -156765 -86909 -40307 -24416 -13968 -61294 -145090
26009 -145090 -148792 -72577 33035 114450 118647 126572 258353 273060 116973 43066 54104
25998 54104 111167 93968 3582 36375 20007 31102 179719 188575 124131 -2084 -112120
25987 -112120 1917 14573 9544 49401 50106 44524 55699 28008 -61010 -140220 -138390 -103190
25975 -103190 -117271 -24162 34423 23620 174592 136626 89590 189425 153357 61640 102325
25964 102325 113612 45055 -3490 32236 485 28215 50750 116503 125772 203245 156384 98850
25952 98850 245350 269534 155966 -18927 -29876 19065 -66229 -82540 -136691 -150408 15555
25941 15555 112930 177215 180154 130393 211124 255801 169618 109915 150055 232585 55054 -647
25929 -647 -34641 26303 -66511 -132935 -16233 5074 18676 79358 69224 15698 -610 -50081
25917 -50081 -32033 -25846 -60121 -13156 -10694 50241 -35930 28032 166221 270014 89979
25906 89979 -169282 -151159 -47349 10526 -61691 -102333 -158203 -140886 9592 13495 -3052
25895 -3052 -15592 -146109 -204277 -183167 -41594 88335 127905 86768 87316 101705 -24605
25884 -24605 -165957 -108291 -76161 -23530 -22369 -58007 30729 31210 16624 -110116 -263789 -83400
25872 -83400 -1083 -39458 -70192 -12660 -17177 -43387 -9204 20900 -4519 -50588 -117607 -188764
25860 -188764 -204076 -130308 -140896 -121792 154869 215481 51533 -64510 -8225 111076 144454
25849 144454 89159 82714 93533 -55174 -88931 -230901 -245265 -148231 -136829 -109564 -87093
25838 -87093 -75958 -89847 -39480 -130544 -228154 -261597 -258632 -43286 61392 124962 157634
25827 157634 153544 38760 49100 -9617 -36465 -57156 22804 -34410 -17620 72816 152379
25816 152379 95738 67456 66686 -68098 -90734 -1464 30840 32271 52573 68504 96073 -50800
25804 -50800 -165575 -230053 -250169 -134856 -48116 -76640 -22626 74687 -5449 13029 160421
25793 160421 297785 258932 68192 -15852 -47209 -62031 -9374 -20579 -155257 -102368 12356
25782 12356 53493 60372 156107 259270 164751 17347 -115498 -120843 -117666 -88787 -40204 -182215
25770 -182215 -208844 -62659 -33016 -100227 -63379 -3882 58102 175517 168515 230961 196274
25759 196274 49568 -62598 -57887 -3724 -72358 -116403 -99745 -60870 24814 91226 176971
25748 176971 206031 131841 67953 44690 34757 24491 4192 -54367 -76689 -83594 -100202 -69132
25736 -69132 -53448 -66697 -114267 -121463 -42690 -95119 -57874 89494 126521 190896 123642 76740
25724 76740 183165 160877 12925 20596 -49675 -67062 55771 44327 -27476 -56548 -85220
25713 -85220 -128849 -76399 -38703 -9302 114771 167774 213302 47023 -106350 -77695 -11312
25702 -11312 -25412 -10998 -40397 -19151 21160 86738 99575 100141 139085 85780 41267 -408
25690 -408 44723 -14631 -23348 -1198 38143 -18488 -51763 39142 128356 109004 32731 16367
25678 16367 16010 140531 168474 128157 168786 93448 -55104 -71196 66917 -7102 -89689
25667 -89689 51569 77101 132133 180813 85506 49934 68474 43553 117845 108705 -11527
25656 -11527 36262 101904 112672 71560 109884 51414 55437 51129 33072 30597 -2842 8953
25644 8953 -20562 2499 59007 -10094 -210669 -154244 -46946 -53141 -17672 -10966 -5717 -48538
25632 -48538 -36256 -15146 3022 61242 12927 51376 79409 119141 100180 953 -46250 79522
25620 79522 178745 63496 4389 -8687 114306 96099 -5063 -39138 12690 50462 15077
25609 15077 -19606 -45625 -138222 -177088 -58144 45219 43229 12554 -129446 -97593 -25486
25598 -25486 24578 -3809 45091 -28816 -96411 59665 108945 130940 -71132 -112648 -128306
25587 -128306 -36870 -3668 88878 147882 24744 -464 46858 78620 83697 -40853 37830
25576 37830 7891 -85455 35991 173443 115422 38503 22234 40957 54272 181744 198323
25565 198323 103723 78568 52563 24744 68959 -23232 -74590 -70487 -240694 -289736 -71559
25554 -71559 15837 42703 -35756 -203078 -165510 -121291 -52139 -55498 -27539 -44488 -41229 11780
25542 11780 128420 124762 105667 163868 125765 100826 130187 83959 -14667 -68160 -130224 -169287
25530 -169287 -216833 -152753 -33894 -35343 -128828 -149119 -19289 104547 196091 242436 215488
25519 215488 175190 148371 142748 122710 94038 17807 -9434 -68180 -167345 -287473 -313730
25508 -313730 -176456 -119721 -58024 -37819 -102764 -225491 -245472 -111563 -74387 -63701 -28957
25497 -28957 39765 183131 267354 131849 87120 190503 89250 -44332 -46453 -36259 -9475
25486 -9475 6018 -2224 40069 27127 46508 -125984 -179318 -117364 -60412 54369 145827 297146
25474 297146 189188 134288 114581 64736 92177 102364 96936 55329 -9249 25782 23664 24205
25462 24205 -61187 -123041 -620 143388 21445 -83212 49352 79201 28962 80142 144504
25451 144504 154761 103385 -85446 -92069 -10664 32711 37850 91641 101860 187240 190092 93541
25439 93541 149949 37972 -16848 -170053 -293324 -279424 -151094 -60466 -88971 -56574 78309
25428 78309 22489 -6933 -86793 -73738 -33571 -105411 -64881 -22796 6872 -44622 -189633
25417 -189633 -304298 -272037 -223926 -235884 -232317 -150931 -20881 1449 -2147 69754 73412 58918
25405 58918 54828 -44257 -117973 -122012 -43575 81424 70478 98728 65331 20244 -100266 -197145
25393 -197145 -106866 -31119 9102 76044 12997 -95182 -229514 -276027 -165703 -7159 85118
25382 85118 163150 184925 40817 13600 -19862 -1943 -91441 -163625 -112043 25899 67284
25371 67284 26465 -73670 42903 34989 134556 176027 168951 179121 81568 32162 -5728 -34362
25359 -34362 -39057 131419 108084 111378 21050 -107737 -19032 99766 130864 34120 44025 -7931
25347 -7931 9787 28052 -57631 -124919 -181424 -196966 -80768 -30443 146977 164649 15302
25336 15302 -41151 81664 61243 -33159 69380 172168 141938 24029 26687 28206 86555
25325 86555 210360 235007 194636 133679 43638 21098 55305 13418 -22057 62602 58137 103265
25313 103265 12944 87795 170925 258141 216028 145738 96838 137663 146635 187627 175834 142407
25301 142407 113831 102129 153662 170265 33670 -101024 -30016 58353 52418 -18312 -107340
25290 -107340 -86599 -55006 -21609 63612 82019 70681 -24616 -155104 -153038 -96495 -71620
25279 -71620 -85242 -170627 -239948 -65618 49496 54066 -9529 26288 41844 -54935 -60850 -176907
25267 -176907 -177699 -102674 -25939 -7708 11072 8808 23163 89458 161121 263363 163696 133132
25255 133132 160800 144620 182177 215246 186845 -24457 -59019 47687 56073 129580 125906
25244 125906 126517 164129 113140 99162 103273 -24692 -13535 176721 194818 48695 116790
25233 116790 108967 18067 85296 111912 174560 190803 124907 67289 -33915 98831 79361
25222 79361 -54313 43349 9321 -14645 39737 33379 10362 -37812 -9336 -11929 -4423 34844
25210 34844 102656 129403 48450 -10118 -88056 -128162 -182619 -173233 -119600 1300 98114 57029
25198 57029 455 -89915 79910 140849 126874 187927 110428 25938 -34970 -25967 -63873 -101860
25186 -101860 -59273 -80994 -118410 -75271 -114212 -61312 65291 110518 54116 70114 48011
25175 48011 -46313 68541 97692 32741 -28514 -6724 32839 85676 72808 124194 197109
25164 197109 250963 211579 122182 104207 26595 71700 84907 75697 105311 59570 8102 -77220
25152 -77220 -168046 -39899 -43855 -136172 -146311 -96062 -109637 -106567 -167667 -191837 -81679 -74973
25140 -74973 -141343 -117126 -155878 -136082 -33149 -20405 -48196 -62312 -29212 -71482 -182093
25129 -182093 -88659 66981 73017 7362 14728 -95723 -121825 -125914 -70772 -30393 88654
25118 88654 120045 95328 141320 157656 114197 178226 175809 133955 146451 47659 2991 -24513
25106 -24513 -65723 -62559 51379 -55718 -170660 -175135 -105896 13597 46071 49213 -68899
25095 -68899 -114914 -72528 42449 -34848 -175394 -84707 -30460 -77726 -16447 88435 137919
25084 137919 160205 163371 146125 161808 274083 230724 155711 115481 23029 31432 161733
25073 161733 233474 102223 -70410 -121389 -205477 -92763 -50252 3505 -27705 14883 43575
25062 43575 93714 208778 160249 151672 137767 117781 61536 163517 180725 217800 237116
25051 237116 212734 153487 48988 -26046 -50296 -37419 116046 110985 57566 35484 92986
25040 92986 67151 -16700 -104139 -91872 -61802 -2270 20432 65813 122330 101784 73490 -19928
25028 -19928 -164927 -133980 -46361 -64725 -54766 -97061 -79267 -6025 36102 66641 140938 53641
25016 53641 46683 -104674 -123338 -77725 -48541 -73205 -39637 74177 39068 -6967 -51115
25005 -51115 -9778 76833 180068 77753 -25585 -34241 -116924 -141220 -60784 -27064 -103980
24994 -103980 -61331 -38185 -123104 -181768 -62338 120692 27815 -1464 64504 97374 69547
24983 69547 78127 67399 30002 -11047 86847 45351 -76047 -33877 45754 98087 80784 78282
24971 78282 27348 7380 -98437 -235419 -233617 -82023 -35970 -44947 -54167 -63729 -93963 -157692
24959 -157692 -53553 54779 7952 5331 108647 89504 35321 45981 145207 150395 -97422
24948 -97422 -315765 -231979 -111295 -41192 10519 35822 -22090 -59489 -55282 -43932 -157949
24937 -157949 -161344 -168718 -215223 -184728 -112972 -109149 -161021 -151342 -87854 -42211 -56116 -259980
24925 -259980 -300654 -196474 -113931 -28921 77326 92081 144002 143502 145773 185276 76677
24914 76677 -27729 -48074 95268 98635 -73103 -120912 -45850 -12556 71473 276461 440086
24903 440086 416606 240777 112112 -25808 -108879 -149600 -114366 -80624 -61402 -46718 -163381
24892 -163381 -228511 -71071 3173 22573 12768 33362 -8167 -58121 -11143 5840 61576
24881 61576 154189 180196 -3140 -51905 -40715 6461 133928 124606 50092 -14898 11670
24870 11670 -47346 -34411 13432 86568 33828 83974 241179 281246 148448 27163 39378
24859 39378 64546 145671 135244 107837 -3690 -42723 166642 175185 124247 83688 36306
24848 36306 77518 4820 -92298 -172009 -237102 -104329 -10628 98387 328431 317225 80266
24837 80266 -69379 -74257 -4491 30057 -55515 -129901 -194378 -166381 -119760 -179352 -140406 -16176
24825 -16176 47217 -57870 -122318 -104205 -68670 60310 29067 43031 -41854 -73211 -42513
24814 -42513 -36742 91507 55692 -37912 -95373 -187244 -176315 -206291 -50150 49272 48018 56978
24802 56978 -78614 -152567 -68962 51669 100049 14377 55231 36759 135284 96222 113997
24791 113997 142668 184043 150480 172559 62559 89922 183457 52591 -24075 4390 75174
24780 75174 -49763 -73526 -8625 42430 143191 57993 51028 -61526 -83375 -144978 -36404
24769 -36404 51237 6161 -159338 -66558 -118117 -125321 -81802 -33232 393 -14472 -48530 -34195
24757 -34195 55769 1547 -81403 -129193 -25489 57120 -51366 -52468 96845 169164 175605
24746 175605 117448 64705 97184 65510 102927 89492 -74298 -36079 121804 231258 246459
24735 246459 120800 46639 109378 118053 58603 83496 -79367 -216947 -160737 -36735 -60932
24724 -60932 -109040 -86215 -12080 3697 111263 122897 69127 -18184 7541 64206 23019
24713 23019 64671 119366 109286 12627 42243 32463 -74715 -31411 36450 -40987 -196654
24702 -196654 -196301 -43324 4947 -109288 -124047 -90823 -113515 -152996 -151831 -82849 -57028 -127374
24690 -127374 -162174 -63698 -76774 -127910 -16868 214711 292692 201820 171765 265178 220787
24679 220787 67170 17269 162088 236219 162495 87677 42776 13943 -31787 -64844 -347
24668 -347 36925 -26229 -66261 -108284 -98920 -78309 18471 81224 100358 113920 116380 49091
24656 49091 -8098 -45942 -66989 -24234 70383 116882 -72049 -101902 -147046 -129021 -123737 -136559
24644 -136559 -107755 16977 122599 68227 75569 145280 215352 280722 82113 -10625 17748
24633 17748 18958 10070 105264 84872 3475 -86381 -112448 -31789 51930 185608 262586 155679
24621 155679 12424 -38812 133 30543 -44501 -25438 -91152 -181015 -172528 -109741 -92899
24610 -92899 -63705 31331 30306 -46748 -7283 93752 26519 -75528 -145446 -56250 8714
24599 8714 -69221 30856 143637 169912 117692 -73207 -139570 -225062 -200356 -142878 -77387
24588 -77387 -56767 -124704 -188619 -92368 -3889 66100 91577 -25887 -168914 -135230 15781
24577 15781 126598 55106 -31134 -95628 -173037 -252220 -188415 -152085 -84268 -155332 -131333
24566 -131333 17860 132906 7372 -6139 2900 22696 -3656 -89880 -100851 -4232 102161
24555 102161 26302 -77612 -119191 -62720 -80903 36795 84410 158963 167850 82881 -5848
24544 -5848 68172 171598 82254 11112 22569 19678 -7002 -39303 25130 5683 -150085 -299617
24532 -299617 -260852 -100544 -105139 -106571 -132007 -219559 -201064 -161503 -72413 -86292 -103302 -78951
24520 -78951 -26371 -91810 -64256 -7933 -5751 93199 167498 71417 66252 96520 129953 33894
24508 33894 -53532 -160482 -181532 -88631 -95507 -103539 -13810 46663 132887 45190 -44249 -47925
24496 -47925 -117816 -175340 -146606 -94646 -165303 -51169 -63786 67659 196156 224826 138024
24485 138024 182658 168337 103102 141109 143260 -53783 -179016 28820 99056 138982 139453
24474 139453 23884 -61069 -42411 29396 -16665 -54902 -79998 -130374 -144107 -140924 -146577 -44005
24462 -44005 68700 101727 124793 73933 -19669 -15401 -66267 -68010 -105655 -79939 -53782 -51126
24450 -51126 -17103 101900 271159 323891 180273 16323 -100791 -165188 -184865 -221128 -144565
24439 -144565 48967 80262 44366 107190 90463 88578 73564 19703 -113624 -141100 -96100
24428 -96100 14263 144691 217342 124397 16055 -53298 -130067 -258206 -289356 -192039 -76648
24417 -76648 -20707 -49113 -52309 -94725 -131831 -169357 -223365 -210814 -109631 -36768 29337 64753
24405 64753 53079 -160087 -259487 -183948 -122611 -169243 -136895 -94788 -187941 -176573 -132295
24394 -132295 -120059 -238664 -334325 -240635 -72739 53018 98248 129150 85396 87807 97474
24383 97474 104448 75606 -27558 79740 25991 -83681 -6683 135936 237059 253033 218839
24372 218839 82038 -20833 -103276 -59499 43379 196255 217171 243979 177753 188086 65188
24361 65188 8541 16148 -37194 -52949 70681 143788 87874 77143 15484 79003 47582 30267
24349 30267 -61591 -108993 -14533 49237 115404 126247 176674 77724 -31943 -15673 61887
24338 61887 -5898 45335 17463 -77975 -41095 -3631 53019 47065 27895 43873 -27768 -4503
24326 -4503 186670 231414 275789 140655 -30927 670 44291 111454 89197 955 5982
24315 5982 -8099 -101086 -41983 57988 -22810 -8982 -8348 -82106 -95207 18482 69622 100170
24303 100170 97749 88860 156447 150940 127505 156130 76903 92803 120252 84766 118315 123040
24291 123040 41173 -30882 -85536 23306 53300 -18471 -66754 -147729 -135528 -4918 151607
24280 151607 95635 29800 -27128 -69492 -111935 -52977 452 -17449 -82716 -122809 -62286
24269 -62286 -82933 -133783 -181346 -129318 -25389 42759 63400 124357 54027 -43781 -131890
24258 -131890 -118267 -132665 -71625 61986 89018 14924 -90598 -127543 -159619 -95592 -27726
24247 -27726 92190 109687 85304 21590 10365 111568 172763 167662 64320 39084 -97888
24236 -97888 -139549 -90692 -183052 -256530 -113197 -20635 -161709 -136509 -52260 -84343 -43425
24225 -43425 -42036 -48597 -88526 -171358 -204281 -96214 20785 56369 66792 -69521 -109504
24214 -109504 -146925 -122822 -146655 -98686 82844 129383 76879 -35572 -64019 -115569 -45027
24203 -45027 -128942 -149067 -104274 -5902 -95023 -134800 -156133 -203422 -64194 115402 308184
24192 308184 326638 199660 114380 34615 10074 103054 63132 100597 64568 -29566 -167740
24181 -167740 -42592 161781 166067 111203 31088 -65784 -45357 77699 69208 77000 79537 -5547
24169 -5547 35177 64828 177240 161219 19152 -63539 -167114 -144328 -194240 -116074 -142344
24158 -142344 -88240 -100816 -218012 -265697 -226330 -67766 77470 82093 52087 6299 9680
24147 9680 50262 89504 41089 -1500 -38009 -91643 -141735 -120681 53799 49052 39186 6807
24135 6807 83132 87835 -48012 -13958 56403 29916 -16361 -97842 -186206 -159546 -146857 -47228
24123 -47228 -50330 -42759 -5097 85857 160584 114673 -8808 -40563 19915 158813 130300 23200
24111 23200 26580 43168 108903 33127 40559 110273 124165 3363 -21779 -17466 28347 53504
24099 53504 3991 31414 -45767 -40588 -37338 -80863 -135871 -194503 -155279 -130267 -141474 -116912
24087 -116912 31141 28248 -26914 29311 -32767 -92256 -168618 -62918 -24500 -36342 -69485
24076 -69485 -143717 -140271 -79877 -93607 -54692 51057 28254 27683 83726 87743 4733 89078
24064 89078 89658 186529 161916 104802 158866 28729 -140619 -58712 349 -75693 -139074 -184115
24052 -184115 -245162 -121674 55266 68376 753 -34215 -31246 45158 166514 144970 27413
24041 27413 -123392 -246268 -186853 -120028 -85536 -78078 752 54437 97067 225215 194917
24030 194917 74428 -76396 -11821 -20971 25390 -1542 -119050 -266038 -341439 -289824 -183733
24019 -183733 -61200 13921 81222 46122 -99752 -38216 -9315 135836 179118 111855 155069
24008 155069 162142 165830 210059 82021 216167 238804 300127 288843 155706 -25084 -93400
23997 -93400 -47050 9415 -34984 -134439 -84760 21283 48034 60735 13414 -69815 -133165
23986 -133165 -180758 -304197 -141409 -19269 -59444 -99889 -70083 -87581 -128823 -131860 -143588
23975 -143588 -78876 -62660 58726 143391 78955 -43813 -58923 68519 204000 139640 95321
23964 95321 108434 62581 -37272 -522 42666 -32372 -85903 8020 64469 -43629 -43566 106659
23952 106659 80394 11434 -78344 -188661 -163947 -105646 -107844 -82557 -100948 -139410 -171424
23941 -171424 -176010 -13385 100357 121013 71258 -85813 -127901 -175170 -29180 18834 17857
23930 17857 6360 51135 154766 155572 76206 57707 48100 71436 92898 45771 -96857 -207608
23918 -207608 -84365 177820 285834 255769 126892 96919 130060 19943 114308 199730
23908 199730 130723 -37647 -23293 15225 79560 29089 -94532 -119471 -42384 -129076 -69860
23897 -69860 52037 212023 169746 87369 -26636 -41035 17907 -29403 -98519 -28866 -20316
23886 -20316 20818 54256 32502 76460 95438 56229 -34000 -66137 -61392 62190 47868 5302
23874 5302 53966 10627 15130 -55197 -157093 -22977 53112 85299 177884 -29626 -87393
23863 -87393 -52152 -160592 -108111 -72203 -135223 -213300 -134641 -63450 2062 70471 50645
23852 50645 -2562 32640 40971 64440 -27385 -121721 -111116 9907 18482 25172 49580 19678
23840 19678 -34995 -50545 -35349 2358 44758 76203 194507 86373 -148487 -226436 -290570
23829 -290570 -275362 -193404 -170669 -301369 -191743 24043 -30351 -152202 -79250 -74859 -49172
23818 -49172 -56676 -71377 -52063 -29404 16442 4326 81576 75566 -23754 21168 -37551 -140384
23806 -140384 -154650 -141374 -100567 -53126 62899 146684 119292 120558 10626 -54771 12909
23795 12909 -1187 -27901 -16754 -51196 -4926 -59424 -51440 -82114 -138341 -59677 -76926 -80973
23783 -80973 -177119 -56671 -4110 -69576 -161847 -262137 -170934 -50302 40 43500 126855
23772 126855 190226 -75892 -197789 -114910 -190045 -123960 44632 200651 239126 163892 76661
23761 76661 84199 87198 -67353 -109811 3274 -6185 -4783 -17951 -102059 -201807 -69479 38893
23749 38893 -36960 -78550 -27963 -57890 -116698 -56082 57704 103850 45440 58580 80736
23738 80736 2550 -6656 26616 42284 38111 98393 239401 193077 5364 -9556 68289 7639
23726 7639 -60920 24866 -160531 -174055 -91026 -158656 -83786 -37672 4429 95244 98997 66609
23714 66609 -179 -112830 -169548 -126015 -106465 -28094 86029 -22075 -54876 -12217 144652
23703 144652 170360 15048 -39711 -25567 -100877 -91912 -72909 -51309 -22660 38248 94711
23692 94711 118434 90061 28289 34969 39888 -60382 -93252 -29725 119360 243865 172094
23681 172094 82350 92906 35873 -71012 -76388 -128046 -122442 -125 23745 885 -109329
23670 -109329 -151876 -44949 -4248 -21680 -82357 -103446 -45676 -50834 -98227 -22476 -42001
23659 -42001 9425 11564 118196 97972 54377 81770 53818 74519 -74137 -152441 -254611
23648 -254611 -166602 -81364 -97853 -106594 -26526 26724 -118235 -302193 -366987 -304186 -155951
23637 -155951 -155980 -97945 -15382 -15071 -126386 -225021 -224009 -245845 -179657 -75197 -54114 20214
23625 20214 141626 8369 -153424 -137530 -142367 -182549 -150839 -33424 123906 26842 121276
23614 121276 192768 164371 2297 -139631 -116889 -14716 18273 -24411 -34843 -55448 36407
23603 36407 99165 67328 132426 163030 73732 -26809 14363 85144 32085 39680 61102 74452
23591 74452 62987 67155 18050 -87504 -86063 -153128 -180384 -155011 -161100 -121239 -72496 -50711
23579 -50711 -62828 -80936 -172868 -161247 -16748 -69670 -115391 -152232 -147539 -178742 -32974
23568 -32974 -23287 -113912 -112631 -63201 -149068 -906 21693 15611 35680 111136 105429 48298
23556 48298 -70876 -92281 -16205 48221 80030 8976 -51624 -71962 -22572 83732 42171
23545 42171 17850 -7552 -121241 -246869 -214077 -87361 74690 102266 -3181 11549 76458
23534 76458 192627 69213 -7904 -109711 -116664 -72039 -117323 -116203 -154959 -74365 -37786
23523 -37786 -13990 89658 82127 138205 118530 32165 -84386 1967 49821 33033 -23411
23512 -23411 -31043 -125408 -94924 13234 23587 65463 1389 4638 136179 147838 112686 82665
23500 82665 83067 108131 66997 113017 200754 69915 -204564 -298636 -156421 -122341 -72894
23489 -72894 -47370 -37831 -221449 -285281 -100541 -41839 -132928 -197668 -214863 -334859 -396880
23478 -396880 -250827 -197456 -190511 -38413 24636 88813 141244 206902 162594 104309 104581 94659
23466 94659 72124 134844 130649 53726 3857 -42125 4822 -8382 -40364 27057 49739 147120
23454 147120 74455 -35278 -168116 -60426 2977 36520 3014 80792 198186 93665
23444 93665 -29654 -156545 34751 159360 153497 -62864 -134551 -66698 84445 139213 65018
23433 65018 -1348 -13583 15142 55573 -17159 -43364 -152913 -215529 -158595 -146461 -71709
23422 -71709 -62048 -84874 667 202067 218957 135986 121576 54622 -36252 22425 117533 133438
23410 133438 41491 -35773 -34318 74918 8111 -46650 -168316 -220707 -270015 -140213 -55895
23399 -55895 -61072 23456 105366 114011 25073 -55278 63307 155299 37019 -41470 -60651 38121
23387 38121 83929 103947 81764 65186 135100 165440 129115 32502 42293 32162 -21140 -70401
23375 -70401 -88782 -27854 -13924 -47738 58007 169478 55551 50164 71744 -62737 -86491
23364 -86491 -40353 48411 158717 159400 116014 196565 123276 -125528 -257718 -158522 -122455
23353 -122455 -62675 -85268 -89932 -1138 1939 56712 108472 -23937 -58727 691 26491 21534
23341 21534 -30045 -132202 -146901 -163768 -67475 -24522 30819 70304 123534 41627 50237 106334
23329 106334 84158 192544 107732 -76743 -198929 -287729 -288451 -125813 -71031 -124499 48611
23318 48611 169869 168855 79376 176542 231690 115482 191392 162929 61147 -5819 20535
23307 20535 152298 128225 61341 39089 -10074 -69539 -25369 59278 75809 157878 189391
23296 189391 106302 20437 -105868 -175967 -144036 -90230 -159383 -171546 -140690 -153438 -162113
23285 -162113 -132954 -41391 -1863 -21823 -80068 -121941 -242203 -224840 -72974 -7391 -60563
23274 -60563 -106772 -13198 84863 81340 8383 120189 224073 160186 184275 173672 -2935
23263 -2935 -83848 42267 53642 76054 63663 1018 19095 61538 30355 -45634 -94503 -153382
23251 -153382 -70609 -73481 -128227 -221803 -257640 -287370 -242108 -223247 -201938 -347719 -346676 -231885
23239 -231885 -239639 -163658 -147805 -122487 -104761 -12257 99982 124570 53916 91768 55488
23228 55488 -60463 -172750 -137127 -36901 -56371 -127213 -137004 -28333 -31189 -22696 -44374
23217 -44374 -44345 9565 -87389 -125317 -25989 21577 124228 161057 79206 -103035 -183790 -172134
23205 -172134 -145668 -156164 -115560 -106095 -131381 -54732 29185 31994 29377 5929 116383 79045
23193 79045 107001 86152 101722 138687 93449 106947 89596 -49036 -172117 -143973 -114627
23182 -114627 -76709 -35554 -91878 -72478 -113199 -63122 -58933 -91827 -173799 -154654 -157070 -119601
23170 -119601 -107578 -51564 -61232 -44147 -32230 -83686 -101075 -99359 -64072 -37954 13276 71646
23158 71646 40095 55177 57921 -1660 -5195 -70936 -101104 -80983 -876 23055 -82278 -70813
23146 -70813 -63241 -30460 -2310 3347 -13199 -70820 -45764 64602 44187 114339 192881 132453
23134 132453 67449 84709 71982 -53439 -263569 -268613 -139030 -52866 -70684 -35834 79608
23123 79608 51150 88208 101602 114688 -43925 -73549 24522 29818 -3560 -103106 -164378 -133050
23111 -133050 -165490 -64372 -48433 -104996 -237127 -164532 -74084 25953 18909 5255 132057
23100 132057 45760 -60288 -28184 56971 93488 92516 121202 -1580 -30076 -54740 -75808
23089 -75808 -155948 -98893 -38662 -209468 -215956 -28422 -26977 -12676 -14331 -49494 -54680 -72623
23077 -72623 -44630 -99168 -217929 -191902 -110762 -18770 -90065 46765 173984 98838 38508
23066 38508 -26585 -38449 -184705 -222784 -61504 42596 55898 -48006 -11212 858 -31453
23055 -31453 -40092 -6924 -54935 -193341 -170406 -57075 -18394 6599 -36779 -164496 -310737
23044 -310737 -279074 -183417 -128745 -110307 -162151 -92111 -20647 -62214 -112240 -110796 -121154 -20840
23032 -20840 20794 36191 -18062 34683 164483 68542 -54251 -91464 -106566 -41706 69535
23021 69535 128396 192351 199643 140478 -3345 6020 -84358 -118341 -177918 -313449 -221908 -144570
23009 -144570 -17353 -59362 -48222 63957 34771 -7781 -1286 30022 -19582 35571 71549
22998 71549 -71742 -96396 11882 118510 119319 80458 -75145 -172445 -156855 -249706 -250778
22987 -250778 -262018 -209255 -107311 -12014 41005 77694 115559 126586 49822 83352 100745
22976 100745 84060 -8327 25119 17427 5070 9794 51930 92192 60962 31407 5288 -5018
22964 -5018 -52792 -205630 -258978 -182956 -72540 -66058 -70446 -95408 -23485 69766 -49999 -117887
22952 -117887 -123947 -122002 -109962 -53349 414 -36882 24634 59439 40328 -59650 -23153 -29086
22940 -29086 -194186 -192557 -124995 3310 77064 23538 -97876 -18496 21239 -49637 -38767
22929 -38767 -114775 -137888 -141888 -3633 47448 54797 9972 -46896 -110669 -140908 -45550 -49740
22917 -49740 74112 210676 203241 -7659 -163826 -179096 -120998 -168629 -159459 -126586 -120666
22906 -120666 -3325 -57137 -159641 -179952 -178828 -149895 -166481 -142866 -47144 -64254 -66139
22895 -66139 -55078 96241 73170 33724 -5606 -1830 81736 54857 -67599 19677 113882
22884 113882 122060 170327 98554 52948 8744 -69273 -97417 -70688 -44658 89575 173807
22873 173807 82108 9718 -16930 -83955 -18853 68317 46279 136652 119860 -19858 63380
22862 63380 152977 90884 29269 68254 -4148 -118473 -159216 -116206 -69769 -19565 -103442
22851 -103442 -190087 -107885 -19111 30051 -18888 -2433 35239 42388 -13316 -36869 -12251 -15397
22839 -15397 -147158 -370423 -314980 -232900 -150799 -66312 29056 229967 251353 166758 39921
22828 39921 -42164 -96959 -158111 -100860 -103328 -13776 -1601 27039 45 14269 7017 19784
22816 19784 3444 -27850 -77244 -51669 -53838 3480 39001 61360 98887 69264 54930 69058
22804 69058 81590 111287 -9566 -55903 -1216 19791 120236 93909 -50750 -104053 -65580
22793 -65580 71894 128736 149068 51509 -80426 -85741 -34034 -15135 -26691 -83976 -65611
22782 -65611 -106830 -42341 -69116 -66569 -105939 -118688 -104296 -18363 -88588 -113084 -158944 -69374
22770 -69374 -30732 -91776 -97570 -87815 18899 -4770 -90047 -48672 107495 104309 71283 -44649
22758 -44649 -91250 39144 88403 110590 61407 63985 -33782 6484 120801 109106 -9594
22747 -9594 -152676 -183831 -179502 -111283 -99054 -170010 -143770 -118427 -161153 -28644 57059 117562
22735 117562 60676 51985 79410 48848 74789 96187 17918 75599 42707 50440 -14383 -4302
22723 -4302 -10505 -7399 54638 -6843 -42400 -121059 -194867 -146194 -94694 -163396 -140419 -128544
22711 -128544 5946 169634 142586 124884 126346 176970 184834 30520 -55460 -54723 -94118 -138901
22699 -138901 -102736 -55793 -65768 9192 11387 -62883 -108762 -146845 -29993 -20420 -122902 -88817
22687 -88817 -94707 -130187 -212413 -181725 -53682 4828 -54694 -112067 -147547 -185150 -53890
22676 -53890 78706 134269 23949 -47058 -28326 108980 97598 -7621 87887 132047 138989
22665 138989 80343 -18550 -126864 13808 122534 106670 -76120 -69198 -68673 -96996 -43102
22654 -43102 70775 54119 -50022 -190888 -177725 -140766 -80437 -69159 -125401 -152058 -68695
22643 -68695 -6162 -26925 -108431 -83181 84629 70109 -87556 -272102 -283011 -261091 -225712
22632 -225712 -181559 -222903 -291242 -281956 -274459 -208380 -112917 -129776 -121622 -83753 -36680 -33224
22620 -33224 -109353 -129670 -154540 -119030 -20425 40693 78249 133884 153121 -32768 -64659
22609 -64659 -1487 89597 90831 89056 186171 309017 290139 146767 131924 56868 -63682
22598 -63682 -34682 55935 -53249 -85584 -98782 -194099 -246881 -87774 45081 27689 -92213
22587 -92213 -146202 -211790 -98589 -104056 -124332 14055 72544 49593 -47305 29497 -63930
22576 -63930 -10545 189924 153612 124301 147976 42019 -107095 -21805 35618 -126387 -88757
22565 -88757 19590 -30174 -14459 45847 -80312 -167355 -243751 -199437 -2319 40725 170228
22554 170228 86469 -121578 -214968 -243536 -199812 -46239 79643 31777 -21496 -105605 -108849
22543 -108849 -63281 79130 39529 -70154 -133690 -121819 -144980 -116057 -44776 -3140 7453
22532 7453 -9407 -88933 -69490 97533 169186 138950 81314 -86110 -203973 -218525 -173581
22521 -173581 -112329 -133582 -177403 -122500 3865 -48896 -8756 57727 -82704 -138110 -138255
22510 -138255 -97940 -172913 -191667 -133705 -43376 -1628 -77446 -62606 84546 115090 110327
22499 110327 -54271 -113547 -1495 19358 12048 -28886 -150150 -121713 -159215 -141453 18408
22488 18408 120939 55582 -21989 -24389 -73799 -105460 31842 49856 45225 108000 119270 84349
22476 84349 38796 -104230 -157091 -123306 -63904 37329 -30770 -115836 -137009 -42820 100128
22465 100128 154817 1812 -66324 -62634 89355 122032 -70248 -96380 -157325 -97835 32910
22454 32910 23009 -40164 8185 106127 82528 -172962 -373263 -374171 -267068 -219102 -125009 -73449
22442 -73449 -93534 -580 13743 -102148 -90779 60941 43744 -95847 -190762 -179086 -41093
22431 -41093 19419 71811 95342 62026 116823 72377 80328 98665 172542 151699 150796 193089
22419 193089 30901 27564 88039 -82071 -255706 -237930 -105831 -82018 -187268 -207703 -198118
22408 -198118 -148038 -59763 12141 82273 209801 97799 105161 46193 -138739 -176930 -44240
22397 -44240 13013 48197 11190 -106940 -175561 -268197 -212635 -18843 62345 91920 22914
22386 22914 16510 40065 16122 -22254 23902 47829 -22264 -24143 6440 -17189 -110202 -208888
22374 -208888 -238270 -79027 35568 36835 60245 128074 284109 325544 201826 119199 79288
22363 79288 22190 -46017 11155 87553 81719 33637 121533 27666 -20716 75794 127475 30843
22351 30843 174209 169021 109125 42466 84461 52980 44332 -8641 14934 104441 108729 121957
22339 121957 180975 99514 6469 94949 140315 -39137 -34441 19809 15586 179820 241931
22328 241931 265497 244031 210184 82043 -38028 -19844 -43054 -35416 19400 -127181 -223137
22317 -223137 -284237 -292450 -357141 -336884 -391208 -453106 -338811 -198209 -163505 -92536 -8046
22306 -8046 84761 68166 117921 35408 -33759 40627 96946 102578 40325 -118065 -241803 -157101
22294 -157101 -67504 38945 -118156 -169130 -154911 -88482 -114434 -46592 16606 1395 -61048
22283 -61048 -188902 -123940 27002 44727 28295 218364 278615 197086 62670 14219 -58956
22272 -58956 -142156 -200062 -175343 -41581 -888 -100041 -162700 -267054 -224781 -138062 -55337
22261 -55337 41915 107879 179036 177402 86123 73380 174861 180916 -21986 -169353 -20711
22250 -20711 97801 87721 45308 582 59104 41791 189791 199843 181834 238498 334314
22239 334314 178973 51941 43459 -21816 -119434 -92296 -53119 20039 67792 -13709 -27271
22228 -27271 -4873 65423 65929 -11200 -41428 -23625 -147690 -237503 -172171 -124000 -67633 -112363
22216 -112363 -56690 -21418 -93311 -55001 -8394 -87514 -118259 -41653 19165 98378 144900
22205 144900 149336 60177 131636 258668 220344 132449 228859 205141 100988 27707 30875
22194 30875 -22671 -69938 -39302 43665 182475 83336 18810 28551 -49826 -183723 -138014
22183 -138014 -189593 -216398 -137498 -87875 -98053 -97285 -96061 -64637 -46064 44952 -9805 77583
22171 77583 -39735 -167412 -214806 -131705 -71722 -32657 51834 64098 8954 -114102 -188866
22160 -188866 -196157 -146589 -84501 7183 103799 15128 -2445 -87708 -139864 -178707 -125524 -70414
22148 -70414 -52974 -105315 -161782 -10592 24647 -98232 34017 148510 225795 124888 137523
22137 137523 62024 -67550 -92913 -55406 -89860 -137208 -211077 -288516 -187307 -63675 -8265
22126 -8265 -109560 -110919 -142920 -291413 -272082 -140526 -145790 -109012 -105666 -153073 -188612 -193540
22114 -193540 -205288 -228265 -118021 -23530 -9515 34171 68594 58969 96072 111835 109139 62321
22102 62321 56869 109871 88504 -54775 -47794 -45205 -109071 -171689 -34842 -51271 -138351 -177895
22090 -177895 -282984 -311424 -242098 -164195 -136293 -80570 -99914 -52574 -21487 -52543 -106456
22079 -106456 -84125 -17456 -85094 -78370 16132 -66732 -1123 92318 21517 63102 115402 82784
22067 82784 117406 31048 -20165 -97656 -75091 43522 105059 69052 -53660 -158569 -226659
22056 -226659 -213676 -136700 -243147 -195667 -95610 -49780 -18002 -71209 -11 -28801 -49578
22045 -49578 1014 75451 37591 -19629 6998 113959 40862 14863 5209 -57841 -115005 -119965
22033 -119965 -113418 -67981 -81489 -62567 43093 60914 60844 -26146 -135786 -115421 -81920 -38799
22021 -38799 81038 105907 62154 117125 183936 237026 334343 154617 88516 37324 -5216
22010 -5216 -9274 -42327 -43026 -13902 -6102 -34360 -78612 -77620 -7712 -187373 -212145 -128798 21429
21997 21429 8233 -126821 -107189 -119798 -162020 -250514 -241142 -189819 -117259 -109254 -18490 -66227
21985 -66227 -201750 -220836 -267980 -187052 -137142 -151395 -105115 -27660 4054 -67196 -24072
21974 -24072 32730 -21418 39989 98299 13092 -24362 953 -61234 -123014 -21675 85956
21963 85956 36565 54127 64572 129469 110170 8454 -7997 -81419 -149418 -225749 -204665
21952 -204665 -186036 -65642 96815 34769 49404 133154 178480 218864 136229 117286 30364
21941 30364 -42129 -76117 -60183 37786 94725 41862 -63200 9549 -4969 -66030 -93838
21930 -93838 56305 190158 183149 79398 92589 -14308 -47070 70308 43876 -10955 4019
21919 4019 -48315 -13877 71114 76531 88692 104368 -34769 -99001 -152545 -59290 33075 -33885
21907 -33885 -154208 -59655 77606 83201 37271 -22137 3080 38903 55018 -19056 -139627
21896 -139627 -206547 -113061 12411 12181 -128086 -164519 -104130 -32014 -37861 -17427 41061 51757
21884 51757 -21023 -10954 -77302 -115100 22772 -20521 -185835 -183214 -113986 -49327 -38847
21873 -38847 -30729 8968 77683 55032 -14140 -18851 87739 83331 102237 97864 145582 67781
21861 67781 -24730 -7147 -139752 -89698 -42152 2615 -37520 -7424 -55086 -71827 -28517
21850 -28517 43347 24736 40977 -9357 -71993 3015 -37896 -124025 -216180 -202131 -85976
21839 -85976 -90952 -157040 -60306 96295 53908 97400 110992 133772 114546 145409 131499 175214
21827 175214 43121 -108242 -135987 -185704 -86484 -43910 -70625 -105726 -150964 -58259 -50392
21816 -50392 39635 95388 31253 -53927 -80970 -47048 -139087 -92637 -231836 -168713 -39119
21805 -39119 63863 129226 157790 212675 177652 91185 123939 134630 86393 -6541 5269
21794 5269 35243 15337 22529 62419 67017 90033 150997 139915 124890 205304 111724 13555
21782 13555 -40776 19652 20370 80791 52697 25576 80252 135038 96604 107093 45833 -56063
21770 -56063 13517 47653 54648 -55722 -169379 -207702 -163720 -161864 -178219 -200113 -154695 -93478
21758 -93478 -65086 -191045 -345949 -256291 -65958 53937 179650 93254 -27408 -260096
21748 -260096 -164891 29682 25521 -73829 -104227 -52959 -72606 5858 64461 90528 138708
21737 138708 138316 27794 -41313 82931 87716 45926 -6398 -23953 18104 -10768 -52134 -55350
21725 -55350 39358 89384 62631 -75218 -138792 -181723 -181184 -56702 -78531 -165102 -153718 -76248
21713 -76248 -11256 100331 107327 73445 -20289 -134381 -279139 -276005 -239477 -181106 -110690
21702 -110690 15245 28498 11286 -27816 -139096 -154776 -209249 -193864 -154379 -122114 -79339
21691 -79339 -32614 -27491 -21609 109703 61586 57463 18149 -64689 -29224 58392 39175 -57012
21679 -57012 -200034 -230284 -294956 -254533 -184958 27177 65970 17953 20671 91541 88427 78570
21667 78570 115637 40839 -59380 -88225 -24655 -1273 59787 -67311 -108524 -74225 -34253
21656 -34253 64856 88705 35655 -87715 -157657 -144931 -195306 -288687 -181996 -82706 23638
21645 23638 93139 175122 248308 141474 24110 -16440 -6870 43874 23665 -53235 -87161
21634 -87161 -89646 -80146 25146 -55168 -26337 70209 79576 15851 131830 6964 -110316
21623 -110316 -109268 -138543 -29273 -80145 -37481 78264 117104 51827 -16549 7412 -56167
21612 -56167 -59663 -47213 -18199 77209 99579 -23128 -40089 -58108 -90059 -136410 -226691 -84440
21600 -84440 -6663 -46391 -64017 -25112 18823 100797 -57921 -168042 2614 2591 -5969 4221
21588 4221 75919 72024 106862 131127 143662 166218 259479 238391 170158 54039 -93246 -171235
21576 -171235 -97554 -40261 -163194 -171220 -224932 -287744 -279741 -217095 -103021 -29802 -9069
21565 -9069 9545 45607 27992 79929 99860 72489 -389 10536 18653 50217 14280 -80471
21553 -80471 -2858 143316 226013 169068 52933 -67633 -167699 -140017 -87674 -39589 47258
21542 47258 92134 114855 174444 193070 187420 159399 72629 -72389 -225686 -93492 -53978
21531 -53978 -20898 31893 128867 206612 136846 57414 114490 152300 33792 66920 79393
21520 79393 120943 47984 -4384 -132325 -112829 -9916 26507 -73579 -29145 62095 115864
21509 115864 156451 54460 -15182 7059 -53185 -147512 -79819 -91461 -71003 -63122 -109966
21498 -109966 -129630 -118472 -67015 -8054 65709 17122 -67542 -61975 -52661 -71280 -179240 -213185
21486 -213185 -63771 -75032 -37453 -36954 -8346 55419 69206 -6274 445 77117 12752 25662
21474 25662 -11983 -70844 -117332 13818 1247 29800 16671 18449 -105333 -102280 -43887 -9187
21462 -9187 10687 -12396 -68109 -19880 -19721 -83059 -100620 -85983 -41751 49023 55265 99066
21450 99066 18821 -48494 -91073 -1705 -68138 -240745 -258747 -173813 -191011 -127352 -30927
21439 -30927 -140536 -204720 -182458 -276494 -291092 -248050 -174699 -121623 -149765 -71315 -134464
21428 -134464 -72031 84274 118396 54948 37729 3927 -56993 38507 53674 48253 -29113
21417 -29113 -135069 -152383 -79768 -24317 -13218 -11633 -53340 3208 7252 19353 81504 -22249
21405 -22249 -75330 -55241 72364 125808 32784 -45294 -53089 2312 57950 51950 -7303 -87740
21393 -87740 91590 90063 52794 123551 22244 -36607 54346 -112777 -218969 -155526 -195458
21382 -195458 -287440 -225121 -62055 66457 50200 -28677 -112921 -48855 79418 155659 176432
21371 176432 139477 19009 -43128 -51657 -11008 5316 -24904 1318 -107658 -167624 -213873
21360 -213873 -229411 -88766 -39120 -51071 -36947 -101415 -25677 57167 191478 219871 87322
21349 87322 98871 52000 29358 35048 25094 6473 28892 126563 33419 -44723 -107991 -171477
21337 -171477 -157543 -56864 -53794 -172972 -230691 -319944 -329967 -207867 -149019 -22070 139846
21326 139846 194593 227223 160108 93485 120431 312652 292987 247511 258695 179728 -57991
21315 -57991 39222 175275 178197 65838 2199 -92204 -143112 -127939 -125604 -130433 19663 80557
21303 80557 33399 150676 297018 184566 55609 17429 71584 152453 80965 -35791 -3954
21292 -3954 6737 106310 104325 -8573 -164287 -161880 -152512 -171316 1442 55640 -82916 -87925
21280 -87925 243 -35722 -79400 -126942 38124 44179 12729 103546 101102 109303 136018 -59480
21268 -59480 -95592 -88921 -187473 -169695 -109009 -37727 -33523 29127 26610 -16919 -79322 -116686
21256 -116686 -29494 37134 73829 75110 18367 -30661 -4779 -46932 -76256 8335 -63392 -57453
21244 -57453 -114340 -140613 -59660 -72727 -47947 -76611 -125028 -100675 -153380 -136891 -54864 -40595
21232 -40595 -144866 -205076 -21030 34813 -2427 -12434 1459 14839 -35654 38362 124100
21221 124100 4037 -12173 92271 179456 187354 83888 47712 82523 63332 -65419 -49522
21210 -49522 -19246 45852 115664 108817 20907 88600 211411 173379 95857 94148 126583 110539
21198 110539 161948 141871 68069 2853 81875 70165 175869 163718 147530 87227 -24909
21187 -24909 59571 135928 125550 205235 300658 282261 274215 118442 75196 136951 141167 72274
21175 72274 -13246 -38799 38572 -18767 -11910 -24908 -26032 -41016 -123779 -159984 -117703 -63139
21163 -63139 -27067 -38265 -109522 -135310 -144597 -102851 41677 85745 19598 -10946 34600 -25863
21151 -25863 -99892 -51343 -111940 -48367 -26765 -16573 -20397 -34379 -89693 -110970 -23646 55601
21139 55601 8209 -41528 -110407 -308116 -433116 -283208 -197910 -113201 -105786 -126505 -210931
21128 -210931 -251899 -96393 -24504 64138 161384 119981 60875 66783 8601 -87269 -38625
21117 -38625 9288 -37535 -121244 -73194 -78402 -42244 63425 25971 19722 31008 -14962 -45383
21105 -45383 -154139 -33304 86030 141347 22078 -46286 -81149 -31431 854 -41406 -106491
21094 -106491 -115309 -40217 -76708 -65543 -73037 14724 47265 -26345 -100162 -103761 -125818 -86868
21082 -86868 -88117 -64975 -4900 11920 -15153 -241526 -254094 -232160 -151929 -72013 -39623 -18663
21070 -18663 -66478 -75434 67344 124550 59000 40622 59847 95144 103788 212128 236287 144182
21058 144182 87044 154654 92270 -91705 -123425 -46193 -75729 -175603 -166056 -114869 -28465
21047 -28465 27832 95396 117500 231263 237439 120857 133140 106486 205128 128508 17235
21036 17235 -19437 -65114 -94485 2510 -69351 -180301 -181648 -249327 -183053 -36626 -22841
21025 -22841 28008 93179 60279 -69459 -90682 -73354 64575 75806 103696 181598 141987
21014 141987 102302 61510 169063 139304 26492 -47597 -4068 97247 165521 136184 127240
21003 127240 22543 10172 82393 -89281 -199824 -252819 -264455 -247399 -134698 -28439
20993 -28439 1707 129778 20736 -103554 -153416 -110403 -28608 -99635 -119070 -12615 -59021
20982 -59021 -11586 75130 111463 87765 -89115 -181623 -172445 -119879 -46015 -39561 54385 106837
20970 106837 45487 -30484 -22552 88940 87184 -60311 -3110 -2723 -36696 -23409 91667 76690
20958 76690 -32791 -23941 -39845 -10422 423 -65493 -165751 -223908 -316816 -329340 -105040
20947 -105040 -48075 -172086 -216941 -213644 -209040 -193286 -56703 -55828 25546 -47684 -102205 -177222
20935 -177222 -80175 -73683 -80948 -91388 -29984 49700 16613 112213 273410 191731 141148 -18907
20923 -18907 -56425 166636 223602 212826 162322 126141 -53684 -124967 -206649 -303024 -309077
20912 -309077 -306306 -290288 -258646 -267897 -276751 -158964 -268014 -274598 -277244 -161248 -33349 -17059
20900 -17059 -70703 43845 52212 7309 -15863 -107279 -199618 -193300 -39817 118122 132112
20889 132112 75150 -29786 42009 77707 121926 155653 231729 211006 20283 100297 105300
20878 105300 169004 146716 9767 8942 -46601 -40230 -57092 -103744 -9470 133992 208308 195237
20866 195237 136494 147080 124728 54315 -10208 -50305 22821 42529 81345 -16121 -72577
20855 -72577 -109685 -74847 15055 -58920 -134704 26404 158645 18693 -136944 -161951 -75853
20844 -75853 -2113 19642 -15863 -78151 -157184 -157157 -276239 -355294 -253922 -218856 -203896 -187209
20832 -187209 -172617 -37831 19684 14981 142811 77918 32148 44567 15053 -43639 -25966
20821 -25966 -109444 -88840 -36651 -64107 -139505 -76865 -24257 -88564 -70325 -42514 5873 103515
20809 103515 124862 8490 -76957 -16916 103652 91919 488 -17154 -141578 -188732 -153882
20798 -153882 -158100 -172863 -122416 -2288 192548 167527 59260 37598 -26935 -41560 73550
20787 73550 198331 241532 214662 166943 133051 198573 139944 75951 166815 55380 -25397
20776 -25397 -108628 -23746 62735 141449 88986 128364 97718 38734 118304 119716 98139 81806
20764 81806 64147 44566 92687 161584 72422 -112837 -8801 185591 224132 297940 318631
20753 318631 332794 243846 182762 170894 198633 133006 36368 -24772 69413 73088 -141882
20742 -141882 -375219 -402734 -234806 -101903 2740 36448 92142 13020 14670 130856 153556
20731 153556 -11972 -95039 -91482 -35792 -51767 -44896 -92485 78876 96147 -2295 -51764
20720 -51764 11221 70304 -26560 -33410 -17157 21006 -932 114449 170153 237234 202852 198600
20708 198600 200694 205413 195671 98795 65181 40410 200646 187491 102668 78433 48710 -26705
20696 -26705 115316 117425 18959 76624 159083 165336 168619 180984 247244 323973 323446 295482
20684 295482 273592 250386 203602 334988 396712 351799 459973 635351 724060 788177 768050
20673 768050 823257 843525 789829 679235 761379 823385 854923 827319 862968 1028191 1092084
20662 1092084 1088302 1212940 1252673 1280999 1380584 1522535 1842348 2102922 2331230 2581426
20652 2581426 2664325 2680383 2988493 3340923 3629300 3943972 4480712 5340367 6286030 7673952
20642 7673952 9699727 12955782 18323858 26240197 35388504 42323139 44662084 43468127
20634 43468127 42592777 44481495 47685209 48236722 44028906 36776194 29900098 25281163
20626 25281163 23742535 25857531 31584332 39670166 46484873 48910964 47092986 44710842
20618 44710842 44875768 47012760 47295639 42956704 34963386 26361275 19159752 14238822
20610 14238822 11120929 9105699 7690288 6497062 5635343 4885555 4350294 3955867 3578458
20601 3578458 3196658 2927414 2871861 2685495 2481536 2270527 2040057 2011447 1798302 1635700
20591 1635700 1533520 1465874 1416336 1382317 1346761 1242707 1148194 1066097 944524 853684 712377
20580 712377 588186 525224 542612 634138 628466 507625 539173 503393 377880 257357 362962
20569 362962 303998 168596 282270 368547 256164 107663 28912 43781 51793 63083 97601
20558 97601 54411 43746 114295 86673 72078 115669 112861 140260 173473 227806 215892 276538
20546 276538 288667 244243 236875 184761 58109 27628 83556 152124 71788 23962 90198
20535 90198 144166 143169 74812 87735 208098 298692 100731 34853 107724 145422 208752 145200
20523 145200 89105 81373 160609 252647 258559 192399 132313 76879 33356 51760 21435 88623
20511 88623 130415 95282 36174 -51420 -54558 9863 -6900 -47851 -33208 80828 68943 162121
20499 162121 97407 55301 39304 42361 179222 231866 209196 39456 4078 45854 146761
20488 146761 157332 83885 -12639 -62063 133941 184134 164827 206660 120212 120058 -73692
20477 -73692 -109004 -47269 -50083 -85280 -37049 -11309 -13189 79370 42202 -10967 -62948 -118783
20465 -118783 16096 92362 39741 1569 10793 71126 56915 22089 48322 101222 91486 143697
20453 143697 206052 211992 12517 -39626 -100353 -43037 -4913 68206 14002 7619 -47339 -119871
20441 -119871 -118897 -243836 -321147 -211474 -145129 -265218 -244005 -38473 35206 35714 -51457
20430 -51457 -97588 -50778 23889 79185 41677 -99866 -56173 16484 -38409 -147754 -107669
20419 -107669 -53401 -22810 77008 129593 49936 2660 113324 118909 115664 83527 8574 -51532
20407 -51532 -53381 83781 151513 2666 -15127 10586 5176 -48149 -197677 -95184 53998
20396 53998 -23520 -74851 -36677 26098 126075 132308 189301 166275 138191 89409 45132 136820
20384 136820 163675 181910 307013 226076 57408 -10181 -44217 -2130 30251 81107 159430
20373 159430 166342 155748 181603 168565 131882 152844 110120 111110 -31594 9617 -74957 -159676
20361 -159676 -115433 -76467 26544 140714 217335 261373 211395 167582 116702 138840 193435
20350 193435 110833 150204 192898 224203 122477 62049 68907 89305 190075 227870 236303
20339 236303 232796 166081 -62497 -110422 32058 2892 26986 28279 70428 92033 149293
20328 149293 111852 42690 34764 -20628 -42951 -21119 9829 62183 81737 113610 145742 143911
20316 143911 109211 123443 52083 11647 -95364 -129675 -112207 -68494 16067 55353 -5901
20305 -5901 -14500 36335 18087 -94390 -58081 25888 114652 46670 -30875 6102 115487 66824
20293 66824 1250 -139940 -236498 -71928 -55932 -34281 91696 113351 151969 233823 244229
20282 244229 286154 246869 114740 30325 8981 79392 18642 -155078 -174843 -35069 7916
20271 7916 95898 146151 108110 61916 66046 112224 73539 19474 -22979 -111791 -77403 62127
20259 62127 -69604 -246049 -186726 -178526 -154228 -117754 53903 201239 128172 76308 65446
20248 65446 170340 253058 80814 -30167 -125705 -51888 33672 160691 152977 5808 -105007
20237 -105007 -47603 -18099 60941 107380 164097 209132 106031 46803 -21947 -70247 -161376
20226 -161376 -201593 -164614 62218 117475 -12810 -147731 -109203 -31059 -41800 -97772 -22676
20215 -22676 60423 12299 -72519 -12838 53910 87436 51924 137266 68669 91353 48952 5201
20203 5201 -16225 29129 115790 80143 149841 251847 254524 226866 104588 31368 6243 -102388
20191 -102388 -114198 -38231 -96688 -157315 36501 191446 234672 231875 389192 310569 197976
20180 197976 156418 105686 197673 301663 290641 334573 320827 97466 -110446 -185413 11003
20169 11003 119159 160231 190439 87237 -26172 115070 154860 186687 283066 120916 -16266
20158 -16266 50746 174524 177465 193061 158944 186392 245233 143790 44405 84066 167903
20147 167903 91547 -911 -57094 -90193 -76775 -13051 13037 116552 217459 223586 182191
20136 182191 303822 373113 339159 294243 316238 358207 273438 314470 410144 265736 200525
20125 200525 235307 246924 369441 466065 611628 557010 511013 560236 639324 643096 605686
20114 605686 595261 696629 756966 947567 1067939 1025064 931666 904279 894325 952383 1062584
20103 1062584 1170028 1336854 1398067 1572283 1683977 1899909 2245776 2530404 2798529 3239153
20093 3239153 3796069 4449794 5590656 7131172 9266806 12934906 18530779 26067801
20085 26067801 33302324 36928228 35652017 30636359 24772584 20463450 18730602 19573627
20077 19573627 22979925 29093798 35919039 39555943 37812557 31820302 24427368 18093618
20069 18093618 13630070 10766020 9117026 8026391 7375660 7050944 6926282 7101494 7489515
20060 7489515 8435410 10154134 12839985 17216272 24034868 32049510 38204382 39418262
20052 39418262 35545756 29361572 23809962 20367381 19761169 21699920 26411714 33272256
20044 33272256 38829293 39710433 35294845 27983507 20580317 14857545 11068904 8608801
20036 8608801 6892373 5646230 4833109 4060241 3465120 2968099 2568454 2284679 2147003
20027 2147003 2067908 2009524 2029600 1933170 1768508 1650999 1501990 1293646 1182262 1299804
20017 1299804 1199746 937706 839852 804739 810414 658417 447890 350090 362312 317628 301182
20006 301182 349955 463514 534764 525909 477625 530585 526829 451960 492604 573146 555041 561213
19994 561213 583507 402668 187182 32326 -4627 -13493 -4562 -70834 -2962 -79861 -36218
19983 -36218 79166 124218 86200 3784 51930 161575 162151 165166 37399 -16094 92816
19972 92816 69186 165932 72897 23627 -78626 -107889 54695 148928 113557 124154 192833
19961 192833 232010 198151 168695 127727 295831 264438 212303 206583 -12621 -61536 -30897
19950 -30897 -36110 110889 90386 14301 101330 195547 63270 -60139 9234 -17824 6675
19939 6675 -78519 -92927 -72719 -4699 9143 -42224 -73716 105108 115519 22285 -28347 51218
19927 51218 21133 -34206 45376 23446 16001 -13346 20021 35627 8639 -93590 -20920 11550
19915 11550 -2519 -4482 -58857 -70962 -117243 -113356 -82155 -109956 -79105 -60022 -36629 45889
19903 45889 -59167 -185210 -174345 -122972 -148630 -213851 -161311 -161976 -30268 -3858 26105
19892 26105 -29319 73022 136586 166179 105376 46454 53888 -23346 -71277 -52795 -32458 78726
19880 78726 15509 28778 4319 27674 -7337 -8807 -20695 -46482 -55613 -47631 34592 140018
19868 140018 211698 283171 189492 224804 173212 112233 137151 106682 -94372 -181250 -198755
19857 -198755 -225113 -234528 -57516 73768 55425 -2256 -24826 93329 23824 -20373 -16289
19846 -16289 43471 111124 80347 18855 -95582 -141037 -214382 -244691 -289969 -311921 -150894
19835 -150894 -96846 -96871 -112923 -59743 -61797 43988 44919 -5011 -22584 -27987 -43605 -18406 -50792
19822 -50792 -104323 -109816 -91304 -204547 -123535 -8762 2449 -18197 -43303 -61476 -71902
19811 -71902 31925 -30046 -130238 -146084 -191916 -226538 -93157 89300 199757 150100 24206
19800 24206 -71109 -28710 -59723 -167568 -141364 -108180 -171060 -219485 -114825 19478 -97526
19789 -97526 -219204 -175190 -165686 -122744 -110311 -174469 -129427 18364 93656 44736 -58150
19778 -58150 42002 -3104 -92171 -122670 -113733 -38826 34757 2698 -25157 -49351 -28713 39601
19766 39601 106158 72819 152450 118035 26268 -68046 -64221 -39370 -54166 -175018 -184848 -112215
19754 -112215 -113002 -152595 -96359 -152378 -134330 -258476 -259781 -174058 -150958 -93736 -14651 53204
19742 53204 196239 177769 95830 106139 170236 44305 -63492 -119987 -142963 -205606 -184001
19731 -184001 -95161 -56968 4314 146470 150449 75273 13214 87904 -4033 -4206 106564 239128
19719 239128 301192 118557 -26854 -69641 44347 135904 164432 85602 89456 101562 76584
19708 76584 51708 72950 39149 46355 39493 20486 -73734 -123125 -80901 -65576 -54293 -62489
19696 -62489 5011 55155 81919 33003 -97378 -116915 -25119 10822 -48738 -45551 77048
19685 77048 111855 64988 153270 105039 89159 96011 158570 150195 187344 194975 274297 272499
19673 272499 251174 136657 84543 43306 49820 -51638 -138410 -193061 -187099 -49564 -56428
19662 -56428 -78779 -145487 -168770 -253732 -177327 -126763 -25905 -77339 -126525 -230631 -319767
19651 -319767 -286758 -191132 -228278 -120905 -186932 -171487 -66964 -46232 -28639 -97830 -173202
19640 -173202 -122040 -172718 -135647 -149057 -231943 -211905 -268501 -333451 -338621 -157238 -984
19629 -984 80762 65241 118423 55325 -51974 -114424 -251766 -242488 -105375 -32304 -93643 -211431
19617 -211431 -220324 -262401 -247194 -79671 -60985 -111630 -82856 27693 96511 -48496 -62808
19606 -62808 11750 136190 212904 102403 -39000 -54921 -118842 -135770 -86912 -94954 -63387
19595 -63387 -69222 -57459 -112915 -143710 -169 21061 -15486 17153 40369 12551 121819
19584 121819 86565 -189431 -185456 -119895 -122841 -181828 -204029 -88761 68672 45732 9628
19573 9628 -5325 -41768 -35719 -76242 -118733 -95841 -90059 -24484 -4183 43387 12782 -64708
19561 -64708 -100265 -99868 -15500 -2571 80211 78156 105190 39389 22882 -43621 -20997 -21256 -53060
19548 -53060 -69645 -48503 -113734 -144136 -78147 26593 42117 135293 275953 282899 149673
19537 149673 28936 97700 62236 101416 225398 177171 61452 10911 50553 151654 143161
19526 143161 30214 24467 24094 23560 58092 93500 101552 1310 -40392 -48304 110829 148751
19514 148751 107097 110834 14003 -10903 77356 195824 116059 44009 116824 233239 357154
19503 357154 277536 302971 423801 493589 370155 150624 23752 83922 87026 135794 215976
19492 215976 191678 156444 126125 55328 45416 28612 54081 46194 128278 344148 357084 285018
19480 285018 120037 127277 118343 92942 94313 139922 307105 265278 132080 120234 223350
19469 223350 338501 360665 258641 331426 265893 116831 177965 209830 149935 131203 54198
19458 54198 13636 31541 60144 81158 14121 -70585 -174691 -108118 44306 92247 15103
19447 15103 54656 32296 -76255 -56961 -9722 74332 131901 214309 94810 -37210 -24418
19436 -24418 -45069 47667 37518 73304 82692 80899 30966 -59565 -7533 -67261 -152833 -114574
19424 -114574 -141831 -154125 -149946 -181999 -218474 -103590 -57942 36469 -30664 -166504 -128998
19413 -128998 -130999 -228590 -266298 -207559 -67620 85505 96666 -24048 -53430 -64070 -39837
19402 -39837 -32509 -19218 -99100 -90019 -111877 -93197 -24005 -34706 283 38543 66212 -42909
19390 -42909 -101895 -293915 -235812 -157486 -166553 -72261 -33384 -178654 -261800 -265884 -326949 -282431
19378 -282431 -212568 -149265 -76171 -183117 -149804 -129937 -109278 -141914 -118167 -138666 -182198
19367 -182198 -229193 -111359 -59610 -44991 -88429 -34280 46694 -6627 -11549 -63153 -79788
19356 -79788 -71229 -22297 -40069 -84113 -70004 -33574 -102599 -41758 -35774 -148362 -107683 -74364
19344 -74364 2249 7886 51289 58314 -59178 -144131 -79568 -32669 -11704 37543 37382 -41323
19332 -41323 -113208 -418 63859 135481 78920 -4255 1076 131708 58404 38331 11732
19321 11732 -7720 806 -27669 1825 -13479 77846 66173 31331 8336 -17304 -71990 148196
19309 148196 299173 215725 213368 345971 336641 268588 67154 -90983 6551 12531 -21899
19298 -21899 41134 80585 65306 -61353 -149254 -80285 2935 -24609 50879 159502 49826
19287 49826 -26392 -5540 -36288 21704 22121 21947 27289 -100130 -190459 -54116 -9467 -55449
19275 -55449 -124183 -200773 -220321 -158522 -194691 -96259 24604 -11794 -82040 -72695 -33733 -45014
19263 -45014 -38053 -1992 -3464 45812 102176 139111 100987 39882 -49370 -72230 -30700 17740
19251 17740 309 -63210 -83257 36848 -5295 -65363 -98799 -115963 -143715 -82059 -40738
19240 -40738 -71215 -21357 17546 38940 17973 119783 22348 49510 46261 39195 5470 102915
19228 102915 162411 67310 -13903 -51817 16963 30583 -2663 -26327 -87277 -28955 -16342
19217 -16342 -14477 -75443 -68310 -238349 -345459 -218049 -145108 -276276 -258115 -109556 -117011
19206 -117011 -16285 47890 75338 -10985 -90502 -132465 -177741 -80687 -106829 -44765 -12611
19195 -12611 -14480 33300 -68374 -69710 11700 27021 -102582 -123753 -14942 18265 16249 -40122
19183 -40122 34471 39389 3177 -14198 118533 197567 191813 248114 158847 19894 4949 -29202
19171 -29202 -28287 -84848 -10736 -26213 33997 122364 67358 56855 52910 47102 77944 44801
19159 44801 96687 169904 30373 -50591 -35589 -16699 -34556 -72330 13200 30968 13312
19148 13312 83785 124541 147843 154852 116401 204496 234045 193678 135436 198378 252903 174427
19136 174427 120973 134143 227509 230372 151138 51168 17229 -17989 -34904 -81594 -98879 -42903
19124 -42903 -12790 87052 29685 -40239 -103586 -76310 -198006 -276740 -266576 -225770 -209608
19113 -209608 -189405 -244807 -123100 29154 62862 38912 108100 165450 34754 -16340 -25278
19102 -25278 -26185 -47798 -4933 125680 196994 187255 215094 145286 156995 256955 314748 236461
19090 236461 241519 342330 194490 146644 28004 148777 316933 407814 447663 397239 280051
19079 280051 178386 189834 240683 228785 125234 151802 248186 358185 410185 396309 392644
19068 392644 277031 187699 337893 432242 419992 551042 566632 590368 598685 711376 817250
19057 817250 977130 1059361 1053504 1071301 1189737 1443378 1790129 2227582 2869755 3930150
19047 3930150 5721848 8875393 14209048 20391400 22747369 20528221 16264251 12114531
19039 12114531 9698177 8761814 9203166 11357990 15921362 22296520 26068609 25448780
19031 25448780 23586235 23337506 25680901 26736501 23827570 19093554 14157418 10868115
19023 10868115 9389324 9319783 10673489 14142770 19572337 23102410 21613983 17345921
19015 17345921 12442356 8603726 6438843 5263592 4269402 3577826 3308513 3198663 2880254
19006 2880254 2631375 2679908 2745014 2720009 2841495 3153850 3593397 4185530 4924046 6303692
18996 6303692 8849310 13602802 20634713 25841908 25073706 20742840 15779589 11931247
18988 11931247 10175056 10023722 11550211 15422689 21849268 27806510 28946685 27001677
18980 27001677 25635740 27551636 30569521 29123367 24125673 18198086 13377479 10795060
18972 10795060 10080728 10918396 13690249 19002092 24533357 25285840 21384948 15866545
18964 15866545 10863679 7451531 5580213 4494724 3732594 3111839 2690098 2308014 1960870
18955 1960870 1787693 1775108 1534475 1239118 1102918 1014709 892099 889031 800519 794822 695171
18944 695171 715229 609234 459031 443781 475053 478757 438120 449290 479287 351636 184895
18933 184895 83188 5669 -29118 -1444 111051 245977 180232 86906 91227 83270 -2356
18922 -2356 108577 59337 -6526 -24936 -71688 -70342 2324 -33298 36253 61651 69812 151446
18910 151446 93819 -17831 -53630 81725 98663 91138 38627 30858 -15761 -23775 12858 28474
18898 28474 55802 -46341 -94445 -107202 -78124 -31872 -55966 -2050 34613 46205 56944
18887 56944 19535 97162 276076 253759 231475 159701 126820 143931 175386 88297 30858
18876 30858 145376 129152 221212 233395 171939 127428 33559 57165 23063 -64540 61605
18865 61605 25077 -61501 -167539 -145811 -59525 136021 138897 -102975 -63216 2322 29840
18854 29840 69500 26415 99387 230632 58362 -56603 -82631 -166085 -226717 -223333 -131455
18843 -131455 -85552 -120438 -210571 -196980 -82125 -58729 -123767 -229935 -223160 -70716 140108
18832 140108 257726 113962 -39249 -55400 -120526 -133683 -88953 -48301 -33876 -63988 23160
18821 23160 35623 -43818 -79975 51435 165331 64521 68181 134886 178993 12505 -131355
18810 -131355 44839 106540 19358 -2826 8007 -92449 -127707 -119241 -63386 -22215 -33636
18799 -33636 -66571 -92361 -105835 27355 25333 -8214 -89697 -254316 -170169 -113300 -155688
18788 -155688 -157990 -48683 286 -25059 -59376 -45991 -108110 -40709 -13916 75071 170265
18777 170265 54972 59802 -42939 -77393 13200 47593 202212 305580 641937 1231435
18767 1231435 1445498 1283356 843155 467649 340279 305788 259320 306444 77634 49838
18757 49838 89720 67867 98390 28622 12084 109747 160458 123676 90150 120933 161447 155475
18745 155475 54196 118663 63025 -3479 -27771 6592 95325 20795 3814 17935 -63022
18734 -63022 -74971 -51231 -38926 -126657 -203674 -231482 -69889 1128 -101342 -47763 71249
18723 71249 79892 23590 -39007 -33109 -30984 49996 142994 271142 243595 126799 105296 52200
18711 52200 21410 72037 21054 -77235 -83176 -112703 -102633 -16509 6821 20690 44107 55401
18699 55401 128098 193091 187502 162014 112793 98322 92269 105976 -32722 -110103 -62206 3730
18687 3730 47293 -10856 23561 60049 199199 214166 148574 157446 39484 -42352 27172 -378
18675 -378 60628 112574 113320 60185 -79576 -172066 -117327 -20044 175183 298639 202501 68362
18663 68362 16008 -50781 -77402 -17917 55350 207526 201189 68846 154587 308309 357078
18652 357078 168278 -67203 9346 101466 56942 -40521 25730 60050 -3369 -6698 89588
18641 89588 129470 33971 -9274 128873 268583 380851 223618 117465 173516 81015 90894
18630 90894 92388 -24535 9565 132570 119325 51261 -22109 -101009 -161269 -130254 -25178
18619 -25178 117616 59432 -58510 -37202 -56752 -163413 -162253 -81922 -148659 -145066 -177944
18608 -177944 -179413 -40499 -74357 -57497 -38550 -83619 -67460 -137350 -171869 -185466 -150339
18597 -150339 -149261 -148244 -128208 -67042 142854 154598 37219 -19183 -26512 15493 38489 -74699
18585 -74699 -133499 -68774 -8313 13041 -35484 -2771 100727 170482 158128 41077 -14877
18574 -14877 -51811 70660 245733 230647 225893 213376 95082 -666 -49714 -12501 157104
18563 157104 235532 296230 298806 268315 127759 97776 -39501 -154455 -14981 90882 87286
18552 87286 60930 132550 50007 186848 342221 340219 284457 201960 159243 146683 203851
18541 203851 319416 406492 407919 411591 304380 248097 169238 238583 185286 54134 55563
18530 55563 46625 152062 144412 39021 -83772 -86732 -61143 -53593 -30277 -78189 -50807 28849
18518 28849 54193 194214 261734 249718 183243 97683 168112 161445 191175 192134 146081 212704
18506 212704 248081 259000 357392 302526 162559 79549 17923 30249 26223 15485 20075 62318
18494 62318 47014 81790 -41532 -40234 49338 129374 165028 142237 114077 119421 162756 168349
18482 168349 235055 314478 330886 386611 196923 -9520 -89477 -21207 154611 308373 121009
18471 121009 69602 203456 251245 171906 168787 202601 254815 221341 272296 173951 -92888
18460 -92888 -69959 27073 128013 235750 213422 136431 138577 24464 -72182 -65129 24257
18449 24257 161627 259384 262012 169259 62949 44380 53512 108774 163907 134030 208717 232949
18437 232949 237368 186455 155505 72724 14679 22909 179162 141360 37383 53952 132174
18426 132174 115019 57497 6127 21374 125044 157223 286278 350952 183252 1357 -17547
18415 -17547 -33212 -27342 74985 68173 156907 208134 181529 77068 98900 136235 147767 52095
18403 52095 -36662 98585 39259 16994 -44606 -98151 53956 123402 146009 286806 193464
18392 193464 -26215 -107794 -9703 16756 37127 60629 80147 58284 -8561 24668 106269
18381 106269 117335 54318 92275 108009 204598 174922 21233 -25836 55984 25873 67965
18370 67965 165691 158091 139556 150236 226231 228259 237197 280186 285862 195974 76088 99373
18358 99373 96755 34039 23662 35566 -27518 22724 125345 165796 190086 44339 -3218
18347 -3218 35431 -14819 -5319 77569 35155 470 -83630 -144961 -73735 -2734 114973 70944
18335 70944 15267 4401 28623 29736 12642 23512 8648 18397 219506 302818 163327 52064
18323 52064 86122 63818 -30681 -48994 -20836 -44692 -3762 -44991 -89780 12583 122378
18312 122378 102696 35901 36140 12844 38991 118230 185216 203104 213793 187569 136353 97168
18300 97168 74698 4576 12559 110231 171836 177096 -244 -178891 -79691 -26366 -57545 128265
18288 128265 177017 170814 218976 152606 154522 87452 124543 48091 51927 141473 99974 57460
18276 57460 140677 128637 158518 254914 298479 164451 24527 97041 101245 177528 291232
18265 291232 449947 411856 368000 293729 296492 443563 482164 398791 305357 323491 259247
18254 259247 152760 179178 190481 255670 187187 160957 172449 182592 182656 155119 98495 176884
18242 176884 232798 219022 253767 271959 285554 349268 320188 313246 322989 341038 400746 272169
18230 272169 234055 450057 644069 629113 571465 639676 665112 686146 764595 975365 1051239
18219 1051239 1054339 1167607 1203977 1235620 1337102 1551360 1884810 2210440 2594611 3316224
18209 3316224 4343695 6039427 9064942 14405475 22295455 27676042 27049353 24128949
18201 24128949 22201947 24170691 28369314 28410453 23853022 17758727 12285259 8632591
18193 8632591 6550279 5401562 4591924 4050858 3654923 3277966 3025867 2847095 2805391
18184 2805391 2908770 3044871 3280317 3695207 4123845 4835791 6172235 8350244 12094213
18175 12094213 18414672 25669143 27988797 25784562 23063180 22593091 26053373 28984377
18167 28984377 26506341 21151575 15240257 11009622 8666807 7326963 6644359 6493316
18159 6493316 6688947 7500782 9345333 12935382 18762716 24990470 26428730 24162736
18151 24162736 21568102 21404886 24784254 27136898 24402561 19444533 14022632 9937632
18143 9937632 7492700 6162308 5170591 4486360 4099299 3879344 3700786 3550676 3522399
18134 3522399 3536831 3665839 3908629 4270660 4753936 5556387 6687777 8395394 11276214
18125 11276214 16180885 23149469 28059899 28087540 26512949 25881625 29149582 35153211
18117 35153211 37898504 37650306 38080559 42528424 55657131 85878934 149884995 248495263
18109 248495263 287372539 242257917 175448294 106508085 64989686 44380426 32840780
18102 32840780 25553903 20816929 17441439 14575482 12190194 10472271 9057210 7920146
18094 7920146 7009170 6208500 5646835 5064820 4476091 4002711 3684552 3616496 3449043 3148655
18084 3148655 3022450 2784785 2445463 2322537 2309799 2179839 2142195 2106122 2074591 2113305
18074 2113305 2116008 2031726 1871736 1695253 1522968 1484193 1519112 1553759 1651327 1682944 1696619
18063 1696619 1775822 1933967 2256020 2369636 2499207 2653385 2950803 3512157 4171360 4832944
18053 4832944 5445249 6344752 7601579 9292588 12239224 17580440 26920102 40740507
18045 40740507 56639290 69768452 73652947 67214674 53910703 39144868 27343736
18038 27343736 19327561 14529864 11690567 10004174 8860597 8167902 7959985 8018275 8336158
18029 8336158 8979453 10082627 11931920 15267948 21262794 31647219 46989157 64390693
18021 64390693 78074302 81244453 73195461 57957636 41543793 28467658 19629654
18014 19629654 14323761 11193660 9228697 7726532 6378889 5320729 4423635 3877567
18006 3877567 3552803 3361109 3214150 2961119 2847615 2822413 2614213 2317425 2137749 1856030
17996 1856030 1674745 1563710 1506036 1450156 1437201 1438667 1276751 1230962 1173205 1165552 998883
17985 998883 937036 1016827 932976 801124 665383 477372 373100 382724 388438 293449 320848
17974 320848 388347 321996 375787 462722 386972 324634 254300 284339 432051 417698 326745
17963 326745 318422 377383 421606 323592 255639 329528 175934 1734 20764 164055 189028
17952 189028 234806 257919 167805 108882 139044 212828 280631 295208 320666 251196 208663
17941 208663 171811 151095 177244 236385 165948 54627 89119 193947 209522 172572 170302
17930 170302 156883 147764 164245 340353 399685 298005 211916 196968 237611 134597 66473
17919 66473 152127 135791 205575 150888 115501 -15372 -106717 -101047 31217 -16045 43412
17908 43412 103160 21349 6048 181671 102046 145848 195159 179604 211325 178010 83313
17897 83313 83464 -102547 -188157 -59872 -31421 -3663 28639 -32284 -31982 -66449 -81901 62784
17885 62784 40984 -51860 22144 17252 -18625 48790 65620 152802 161093 163736 114598 41405
17873 41405 20261 -14755 -40421 5633 -94688 -165795 -36626 36358 84496 51931 16861
17862 16861 18736 82334 1559 785 49336 -19221 -21404 73112 145973 251729 218257 111746
17850 111746 134064 76875 9381 61074 88437 179469 100395 -13451 -30605 71256 97922
17839 97922 85342 34209 64008 32463 -37107 78838 77963 147096 54621 35058 5120 123122
17827 123122 231675 22659 -89096 -82695 -77291 28929 14518 34477 -778 -79524 -25302
17816 -25302 80294 151749 222775 292379 276825 288686 157468 141373 88482 142862 187531
17805 187531 206235 147513 165882 262896 209504 147361 111910 56444 -42016 -107611 -92131
17794 -92131 35714 69396 158065 129191 108644 60046 7342 -91766 -242563 -236987 -235393 -105384
17782 -105384 -93689 -88724 -107831 -116927 -138942 -116081 -108965 -240406 -252529 -196698 -168534 -133008
17770 -133008 -93274 -103876 -60517 -25599 -112990 -188825 -103509 24497 -39833 -99034 -20531
17759 -20531 -24366 120306 220257 170842 100121 69857 74088 124425 192955 165347 45808 19764
17747 19764 68370 120099 52558 -3905 -41933 -1429 -45120 -64421 -5566 63075 138304 178713
17735 178713 182659 94346 4639 -27147 1732 28325 77427 151057 181797 201832 145512 172725
17723 172725 274318 149011 110111 230330 296505 320372 273191 63945 68892 -30546 -75806
17712 -75806 -60945 62424 157825 187278 122125 114299 48973 78511 132941 2280 16935
17701 16935 49803 -31849 -3534 129388 73049 115163 88770 -2603 -34280 68386 14031
17690 14031 -39304 -9328 90782 88025 109564 362631 359003 272239 335412 365808 225996
17679 225996 75705 74999 116832 107320 175810 239840 352248 398149 409583 319917 288360 231412
17667 231412 210188 205230 200056 308310 267227 24687 3027 42733 113166 222310 316632
17656 316632 344794 257489 261122 372219 324962 347403 357043 386071 457118 427246 302851
17645 302851 221322 207389 248961 396154 351410 334219 302377 385486 514673 514210 430198
17634 430198 423558 535035 557002 550154 588594 556014 548066 624817 613221 596595 557745 562425
17622 562425 543502 520350 532075 547775 635962 703517 665685 677142 662365 626745 737775
17611 737775 949020 1062348 1105614 1159562 1312387 1502254 1578907 1718551 1970249 2262427
17601 2262427 2541723 2809187 3178377 3634527 4283058 5341688 6857397 9461732 13749915
17592 13749915 20391077 26551553 28413264 27549807 26984808 29992535 38899231 50348071
17584 50348071 52721565 46557441 37848509 31133836 29732697 31701963 31693952 27792210
17576 27792210 22338282 17104193 13520723 11856565 11826065 13031022 16254587 21652197
17568 21652197 26708629 27831227 26700271 26011474 28695572 36886802 46764274 48143046
17560 48143046 42022885 34033059 27960239 26493978 28104144 27700314 23723259 18418608
17552 18418608 13389944 9683793 7189176 5771728 4938792 4289316 3726973 3291277 2962760
17543 2962760 2597367 2297446 2197354 2075783 1817470 1607082 1559968 1315291 1123471 1024716
17533 1024716 926410 911341 905806 945010 838157 719863 617156 566891 541659 651825 610627
17522 610627 431813 260392 245819 362025 486535 617974 682334 851295 926994 880353
17512 880353 642666 520094 555133 508735 445617 450597 355174 319879 341211 271283 356302
17501 356302 412166 286899 240702 124626 108843 183519 194222 138603 257687 424241 469516
17490 469516 454287 442216 352807 253585 177715 73450 48594 105249 149428 253967 276316
17479 276316 280289 254684 274504 250803 224718 209387 261713 265749 235881 153861 90433 88458
17467 88458 133704 221922 256210 205654 120282 174499 173500 240356 133306 30265 -44810 -25198
17455 -25198 -54337 -102336 -63743 -63028 16149 124869 199379 267437 451376 528603 724675
17444 724675 1232741 1601237 1444005 998571 586900 395477 251742 249843 219431 192603
17434 192603 216980 202088 196134 91193 30616 -21800 37307 83378 105865 46494 -127532
17423 -127532 -146170 -53538 -2265 39846 135152 168692 97454 119882 66258 71848 22725 -111655
17411 -111655 -115802 -158068 -143260 30180 75050 -96695 -137213 -54324 -15797 52931 12694
17400 12694 61503 79609 91484 87150 41449 -33925 -109425 -196782 -140205 -122748 -70441 -78821
17388 -78821 -20625 -39550 -166777 -159894 -108784 -124572 -225303 -170720 -139837 -40397 -90924
17377 -90924 -105381 1111 148105 6342 -102752 -79009 6838 -48945 -39208 156885 232463
17366 232463 249811 214429 109024 36804 -41583 -68727 -133967 -77906 10015 160614 215867
17355 215867 318260 362665 283715 346345 281178 225438 160742 -52353 -108106 31746 182607
17344 182607 177275 134872 77983 5629 61733 122114 190361 144206 -11649 -117826 -73333
17333 -73333 -72920 -39837 -27661 -77124 -54297 44540 157689 271712 186041 41822 24781
17322 24781 3361 -71758 -164059 -146411 -193016 -72820 49520 116767 35104 -48962 -59632
17311 -59632 -7267 -37555 -94542 -4318 11688 -60213 -63931 -144005 -159640 -253410 -229408 -57332
17299 -57332 -54976 -58133 64752 60353 70426 55393 125399 211347 106916 88724 64906 40209
17287 40209 44481 88295 112646 139693 108481 71928 -79725 -100251 93626 85865 -5471 -79912
17275 -79912 -51835 -52429 -12766 25817 27640 7947 19193 37287 120453 1426 -22043 109197
17263 109197 139320 17479 -35457 -48448 -122778 -45264 -53983 -10360 117477 121249 16617
17252 16617 16050 64834 81544 94080 -296 32752 146638 98334 50917 30108 60172 106572
17240 106572 162815 204642 202471 221260 164716 100260 133513 25945 -68680 -193329 -217827
17229 -217827 -136396 -58714 -106216 -96851 -49756 -27872 -62794 -64073 -35837 -61859 -81952 -85308
17217 -85308 -182088 -127928 -105066 -143911 -104599 -18201 10207 -23848 -110628 -83514 -54586 -34329
17205 -34329 39445 -64925 -24832 -46972 -52693 -109168 -108451 -97921 -162921 -177740 -155816 64034
17193 64034 144191 116998 117866 22788 -24955 -46713 -154816 -163495 -53382 105755 43133 -24445
17181 -24445 -132007 -99789 -10795 -52947 -139085 -172502 -202833 -30372 -13352 17082 59754
17170 59754 7088 23610 1489 -10042 82535 81960 158774 161969 32302 9508 9304 107132
17158 107132 146696 185754 103303 -17931 -140338 -215047 -127596 -100147 -47599 -114371 -155244
17147 -155244 -179751 -178933 -139204 -147389 -201499 -182025 -207507 -215040 -218743 -91838 -226715 -234153
17135 -234153 -89686 -41206 -21757 -39918 -32911 -143736 -257315 -182625 -236831 -152925 -9172
17124 -9172 24780 -15828 -111269 -66089 -17331 -69499 -166719 -160008 -122463 -100468 -11655 -5289
17112 -5289 122112 116226 182176 176816 74432 -19357 9569 143245 130404 52122 76194 176531
17100 176531 82186 87001 154361 196958 268594 295316 198226 86446 -57937 -137938 -99371
17089 -99371 -41028 -39697 30195 53226 1282 29742 138320 247108 210941 230026 222318 155577
17077 155577 91791 -9959 -16206 -87613 -132378 -129909 -187853 -291448 -186023 -105686 -136391
17066 -136391 -101306 1960 59863 -22254 41700 74580 109102 92944 197893 306686 325152
17055 325152 212681 1167 -29603 -10924 -38907 60494 62299 -36152 -64201 94582 112820
17044 112820 21224 60288 -9384 123621 159873 92811 -115271 -37884 110209 192064 112550
17033 112550 -76525 -46222 -55880 -187547 -71578 19370 63290 143665 127661 21247 31535
17022 31535 -95794 -126970 -68111 -75838 -167550 -266854 -223860 -130237 -112241 -119088 -147814 -108073
17010 -108073 -124439 -130524 -89876 -60119 -127267 -85984 -71820 -55439 -103987 -115497 -24721 31007
16998 31007 141259 166196 28192 -121731 -196543 -132929 -141704 -60870 -100686 -43319 -51113
16987 -51113 -61455 -20194 -125604 -177057 35537 54474 -102182 -95970 19916 59076 11746
16976 11746 -43812 10559 -43068 -117558 -85235 25899 4169 -24111 -96941 -196609 -121711
16965 -121711 11838 75852 98182 190760 125662 -42969 -78479 81812 166267 71721 -95935
16954 -95935 -41554 -74538 -175614 -158030 -125277 -43402 -92801 -206330 -206793 -72105 -111661
16943 -111661 -167556 -157319 -186571 -147714 -159420 -110930 -165543 -47756 11962 34234 124595
16932 124595 7042 -96343 -18922 -41585 -58724 -173791 -204673 -131668 -4131 -111657
16922 -111657 -166252 -205366 -365381 -349175 -405463 -462526 -382779 -233868 -130369 -35777 -45992
16911 -45992 -203459 -204128 -259536 -229236 -89859 -33506 -188056 -269481 -222348 -183783 -94107
16900 -94107 -21715 -109824 -82130 -106320 -98943 -111520 -20020 -3036 -44758 -60763 -171144 -103124
16888 -103124 -134896 -154181 -239920 -314795 -283739 -186236 -90855 -12080 19647 -81752 -170300
16877 -170300 -68702 -106415 -175200 -228129 -262974 -250193 -207150 -154971 -90309 -47873 -9386
16866 -9386 31099 54342 96247 103739 25775 -79739 -96122 -14265 47465 117122 203633 158927
16854 158927 89755 195093 104831 -9776 -145899 -174394 49556 234156 239850 123614
16844 123614 89042 -5307 -109902 -64009 85197 147329 81071 -58735 -99125 -75471 -181179
16833 -181179 -115245 -72850 -21539 -102862 -151447 -139124 -57579 -92864 -113098 -110133 -22020 46072
16821 46072 -27283 -80349 -4956 -28479 -18484 53783 47935 37433 157511 181540 172902 110321
16809 110321 95197 55190 -108563 -252228 -232684 -126185 -22276 -64960 -74713 58973 28677
16798 28677 -54182 60446 -79820 -89514 -50755 -123880 -99873 -12985 13886 -27036 -145142
16787 -145142 -140052 -16514 -31716 -16921 48875 149470 150619 10294 -146635 -61695 82563
16776 82563 -106076 -276025 -183601 -102624 -85225 -144744 -128949 -36493 -20891 -50282 -31472
16765 -31472 -41671 -20361 43236 278905 328498 240482 145108 66605 -10026 -5608 -58188 1557
16753 1557 -33103 -103102 12814 67305 93228 90868 122089 -17121 -134894 -215491 -150179
16742 -150179 -121991 -139399 -167593 -154478 -56960 46953 21587 48051 2890 -16886 -93146
16731 -93146 -84365 -77365 6037 29891 45176 24661 27267 -307 -45721 -47699 -71133 -42520
16719 -42520 -91547 -231049 -250316 -162811 -53006 -24 27187 -38123 -86691 58009 65040
16708 65040 -57526 -69654 -35671 12730 72650 60408 22301 -49980 -108696 -117237 -177874 -73715
16696 -73715 88992 26902 -119547 -176493 -169520 -3712 100937 31816 -32875 32464 65669
16685 65669 -17610 -102666 -85808 46474 20773 -66377 19335 114432 85372 -51024 -168091
16674 -168091 -217877 -50971 -39948 -149904 -195295 -200692 -143271 -23937 -55369 10507 31546
16663 31546 -7183 -51534 -61864 49040 24445 -29737 78913 136193 176083 200044 201782
16652 201782 147366 78447 -10368 -90466 -48891 -55950 5867 109773 254136 222749 42988
16641 42988 -91939 -83187 -160786 -138472 -12342 53282 -89172 -172481 -11431 117169 27115
16630 27115 -91515 -191694 -223044 -219721 -185617 -197568 -171142 -234731 -160464 -38112 61561
16619 61561 87680 -33702 -127430 43227 -58520 -179996 -70086 -48353 -76965 -51001 -39575
16608 -39575 -64164 -33793 3930 -3314 -101218 -116282 -49382 -27404 -111020 -151046 -35113 63628
16596 63628 70122 10571 -125452 -158373 -191137 -87255 18523 72107 -38777 -79032 -39287
16585 -39287 -80338 -21319 82557 -33214 -194659 -249991 -247176 -195770 -143432 -64552 -52533
16574 -52533 -142435 -203985 -258550 -210578 -136108 -63039 19067 63740 87654 81115 80150 72447
16562 72447 42788 87085 56020 19754 4678 -12828 -3120 77382 208752 220156 155487 196351
16550 196351 -32034 -122275 -85012 -54340 26149 -27936 -85929 -114243 -57055 4816 -23314
16539 -23314 -2940 44323 -49569 -48974 102494 75822 -3716 138545 215310 108352 8696
16528 8696 -23133 -83784 75209 161810 131866 3461 -84004 -73642 -82693 -28950 -108 -91467
16516 -91467 -51997 -108720 22389 157568 28370 -41811 -39738 -94065 -79041 -37807 -12456
16505 -12456 9704 -149048 -201059 -155794 -13663 126316 160075 227336 184201 116931 44718
16494 44718 8712 -90306 -137613 -193059 -159777 -79689 -89129 -69122 35238 105714 20559 -57532
16482 -57532 -81881 -27297 37510 41833 68605 61212 -38399 -65795 -111659 -74971 120797 109812
16470 109812 37541 -104799 -88753 -55325 13726 -24254 -133169 -121116 -76752 -107162 -129178
16459 -129178 -258649 -350156 -225594 -102788 -72114 -27604 -41832 9691 54850 28077 -46311
16448 -46311 -125540 -505 112823 1077 -114754 -145698 -191209 -131709 -12074 104506
16438 104506 175058 90309 43093 -58049 -183179 -112873 22973 209456 293402 189248
16428 189248 98576 44613 -3033 -8973 -31869 -117333 -202390 -182779 -103242 -37178 -63717 -31504
16416 -31504 3027 -34390 -147255 -242508 -189266 -124344 -33582 -57158 -175315 -153453 -187476
16405 -187476 -5468 65711 135102 96044 2443 8060 -82092 -155995 -144677 -143009 -74621 3605
16393 3605 127789 31559 -124012 -175615 -163002 -220194 -192188 -129432 -168169 -268848 -224454
16382 -224454 -83948 -57260 -49172 -1483 28741 66963 -4909 -20203 27929 -48776 -163771
16371 -163771 -209582 -104685 87903 -41079 587 71988 59303 121012 127305 -62200 -246231
16360 -246231 -311234 -245455 -283628 -372688 -429043 -392386 -337812 -210500 -16122 37258 -48570
16349 -48570 -36968 -71753 -45557 -37 -87139 -104218 -91675 -68829 -100217 -47123 -18197 -67400
16337 -67400 -257 10014 4295 -59568 77705 173005 106049 -33380 -84171 -175368 -156025
16326 -156025 -77221 -66776 -114827 -173694 -137774 -93921 -228621 -259421 -89866 -6658 12322
16315 12322 -15528 -5768 56117 22474 -3341 -86957 -132170 -74603 -33089 -113556 -304010 -322669
16303 -322669 -174425 -129375 -77822 -108485 -270707 -232914 -164016 -151531 -159078 -168397 -170827 -186675
16291 -186675 -170655 -176224 -103474 8212 52229 43975 58225 13807 -30822 -65702 114473
16280 114473 96796 22066 9166 -3295 -67391 -154414 -201120 -120845 -110761 -139870 -135441 -235573
16268 -235573 -243504 -211776 -237126 -91302 -151260 -220842 -120839 -47219 7604 53440 -47075
16257 -47075 -56377 -84943 24583 49783 -14997 -33883 -98184 -88316 -95758 -102279 -124678 -78145
16245 -78145 -20786 -14516 85885 120528 -9878 -81038 19641 -43126 -21667 130203 154916
16234 154916 -6165 -107088 -99655 -109333 -54606 -98044 -255007 -290159 -292147 -194181 -31848
16223 -31848 -52794 -107210 -145633 -151889 -159753 -259332 -264507 -104116 -5954 98762 -41077 -66011
16211 -66011 -117345 -228774 -271102 -169998 -228983 -251374 -207807 -147325 -93352 -193431 -264601
16200 -264601 -257835 -201855 -108666 -42814 51489 74905 20918 5101 42969 137779 176053 28908
16188 28908 -20377 165602 201220 167419 -27633 -286860 -312686 -94243 -98114 -21982 6333
16177 6333 47068 2467 -11626 9991 13217 148551 333907 267951 236956 185473 82308
16166 82308 125717 197292 135040 83220 112249 97475 -64885 -69382 -83875 -259509 -220244
16155 -220244 -177543 -178620 -59916 -103333 -41270 12690 19400 62600 105251 84556 62701 -228
16143 -228 37141 65600 -16807 -104872 -27180 51662 73835 72685 -12597 -88732 -152865 -53180
16131 -53180 100804 -54981 -166383 6943 181480 206928 45622 -34127 -69443 -21676
16121 -21676 15957 18618 95776 63251 -10299 -115631 -90433 -53302 -49643 -106457 -39418 -210475
16109 -210475 -249993 -250960 -172153 -85129 -138754 -217289 -280316 -233576 -215654 -72976 50354
16098 50354 77464 160035 48035 -74588 -10532 -59463 -97841 -125036 -37548 54514 51823
16087 51823 90780 7677 -124270 1414 119929 136397 -65234 -64472 16873 -55237 -101992
16076 -101992 -28785 -142260 -197566 -23868 14582 18668 33567 96026 189959 223131 180057
16065 180057 117115 -10275 -139115 -161689 -118409 -77505 -83952 -89641 -26942 -132588 -284627
16054 -284627 -169234 43061 -30695 -92181 -46064 -32494 -44120 -8202 29732 -47807 -51913
16043 -51913 18201 14610 52151 169095 57683 -13467 -29782 -42339 -41700 6456 50392 -5230
16031 -5230 -3370 -136488 -76035 49724 100954 29680 -43519 -59227 -73091 -118039 92621
16020 92621 197938 168779 89260 104462 -59115 -276756 -246106 -101976 5307 -59548 -102616
16009 -102616 -59024 10109 -32520 -61639 68646 27331 7549 -81609 -171903 -182913 -111590
15998 -111590 21223 20133 1815 1690 30212 106938 79609 218 3832 122349 163929 173849
15986 173849 34924 -89536 -54908 -36815 -23336 16384 -37458 14116 104089 -97995 -106366
15975 -106366 -66218 29901 60588 53282 32464 46896 55599 23296 95250 167901 95611 -73152
15963 -73152 -135072 -54551 -51406 -60216 41958 1809 -72166 -122869 -108821 -116862 -84740 -103970
15951 -103970 55876 46445 -50096 26487 86560 -10579 -27626 30518 81807 23606 -54179
15940 -54179 75321 187140 168792 47142 98645 188442 124273 29167 -4695 -6762 16758
15929 16758 93451 113548 77632 55362 74540 48984 103432 104551 -18833 -78114 -49525 23401
15917 23401 -61362 -85401 -117140 -34399 87235 121136 157869 143965 98084 127552 100580
15906 100580 23230 -34625 -26154 -156918 -129834 -62099 -14464 91705 80295 -69127 -213288
15895 -213288 -264601 -270881 -114170 -67241 -80948 -20365 33090 -24755 -134498 -143093 -236704
15884 -236704 -226034 -301039 -217660 -31283 89945 -6031 3445 -70313 -1054 17136 -68404
15873 -68404 -71672 118862 287398 369462 405038 213961 -47303 -91717 -51510 38086 -68502
15862 -68502 -67996 60242 101296 75329 103078 124076 114045 -38050 -122314 -90659 -69256 -65569
15850 -65569 -61894 -60289 -60691 -1420 -1489 -62050 11243 89198 81016 72451 -59731 -157309 -41726
15837 -41726 120877 129033 -22624 21752 57389 16268 -41743 -46052 -26543 36768 56709 22320
15825 22320 27143 -33109 -5445 -12805 -25832 66396 218925 165269 12540 96124 168701 272065
15813 272065 298996 267367 136969 92473 56447 -64651 -38282 -62485 -9787 18501 23539
15802 23539 143983 196917 74605 -25250 -17412 44101 57686 102719 88344 -22185 -97379
15791 -97379 -147304 -137251 -163526 -94855 -47345 -105252 -146375 -152118 -84428 -99798 -95299 -97946
15779 -97946 -201787 -60717 53066 45245 -48815 -49534 -7926 -54628 -149322 16734 193198
15768 193198 97141 -45900 -151019 -203103 -173057 -248957 -282139 -73112 25011 41569 8885
15757 8885 -12389 -13719 77546 -2885 -218273 -263095 -255239 -274919 -262771 -154764 -114245 -243176
15745 -243176 -178899 -127683 -71978 8678 7968 33006 17159 -30183 -22839 -80004 -163016 -175979
15733 -175979 -29174 39939 -49192 -145442 -181670 -127675 -152155 -119462 -50359 -5098 15666
15722 15666 87627 -5428 -156624 -226101 -150406 -137923 -41792 158328 149876 85663 65434
15711 65434 -32605 906 40268 -85569 52174 88876 -30063 -54043 -68746 -18206 -92462
15700 -92462 -73850 -64782 -5851 99924 35973 -56911 22463 128980 271123 252218 129079
15689 129079 70626 56326 -5394 -121686 8103 15487 -27066 -130779 -128110 -57097 -48858
15678 -48858 -22605 95248 142595 45026 65054 145690 49120 10381 57546 63889 -27875 -106402
15666 -106402 -17190 -89430 -106607 -105058 -14484 35824 8986 1080 -35750 -30287 -118749 -171690
15654 -171690 -188286 -246836 -254614 -241401 -217875 -177896 -202569 -150415 -108851 73749 94524
15643 94524 50154 27587 -3372 -78834 -2918 148834 88109 12853 -196689 -201457 -173736
15632 -173736 -97758 -9840 63444 55197 -446 21401 55264 63907 -8320 -75337 -87880 -24146
15620 -24146 -60230 -95400 -94092 -199876 -153858 -168787 -135060 -120315 -197918 -297396 -365609 -244195
15608 -244195 -172538 -129372 -124323 -107922 -38904 84161 189306 189811 78472 -46123 -115379
15597 -115379 -144049 -64133 3711 75009 94276 81578 6791 -159443 -112502 -43236 8837
15586 8837 28095 -6294 27236 41355 -16893 -55791 -131153 -217125 -230116 -150405 -71456 -73733
15574 -73733 7259 13971 41301 -12689 -38747 13129 69076 56659 4605 49072 26803 -39944
15562 -39944 -14223 -11739 -67782 -58266 -37010 113819 176344 155148 62803 70404 91295 177836
15550 177836 114259 1832 -62989 70069 24049 -66887 24099 -23816 -183860 -210950 -192562
15539 -192562 -234454 -303578 -281455 -292785 -252131 -160876 -122928 -21750 3416 -146959 -236536
15528 -236536 -98863 -48398 -171330 -178587 -145235 -114129 -31975 -106250 -26343 151003 185568
15517 185568 166186 162634 129119 114733 27626 -116073 -54750 44328 49893 43132 -39320 -154273
15505 -154273 -205418 -165541 -76067 -10891 165655 197321 87614 58613 20528 -42846 24197
15494 24197 30410 114571 57385 -18219 -26726 -31109 51282 98361 76469 42576 18828 -22643
15482 -22643 -74575 -130057 -73525 -66199 -35603 5326 64773 33434 11639 32443 32932 38495
15470 38495 714 -156451 -194410 -176495 -119233 -147467 -76662 7883 33782 50668 86695
15459 86695 -9888 39946 129332 92982 -42058 -16586 -9111 -14574 -88272 -127301 -71007 58644
15447 58644 64546 44645 5682 -69998 -152458 -57966 -10517 -93694 -14316 72096 85886 66773
15435 66773 42011 200369 36501 -28080 -26073 -80430 -116209 -105450 -32216 -67658 -31049
15424 -31049 -5930 34519 119044 179349 114450 -69028 -92460 -6269 -10346 93890 117481
15413 117481 79147 23030 75232 87962 -27954 -49678 -9039 -84132 -159661 12415 108169
15402 108169 73312 -17575 1856 -24496 50858 125032 224082 202761 62483 32185 103986
15391 103986 11348 -54323 -159181 -168517 -125396 -178915 -240692 -127678 -113107 -163853 -111435
15380 -111435 -56247 -114310 -131370 -70891 -73188 22149 87086 16344 -90045 -162649 -67498
15369 -67498 28874 71076 120409 146832 161938 36830 -652 149961 172447 111866 65305
15358 65305 124146 223949 176973 22487 19518 110385 155172 121497 123888 84298 62215 136417
15346 136417 83024 -41356 -37398 6239 -14469 3303 -475 -14249 -7976 37187 93620 22834
15334 22834 -83921 -51308 15281 -16344 -119422 -80403 11905 147410 66122 52734 29096
15323 29096 82182 68194 154923 158887 143279 135822 100826 107089 28020 -65251 -136439 -100036
15311 -100036 -56772 10873 22054 -3838 -98170 -96875 -123541 -63225 -59797 -66654 -26765 31287
15299 31287 36425 36780 149896 154047 104729 43486 -53997 -221575 -155076 -14308 -96160 -121274
15287 -121274 -130341 -72885 -6810 -3719 -95977 -111190 -32434 -121640 -134034 -171341 -129315 -136478
15275 -136478 -78612 4227 -41675 -77210 110510 200144 148688 32444 81933 152328 174665
15264 174665 204174 129498 40139 40476 49288 56516 109675 87255 48423 -94732 -85773 -22549
15252 -22549 -104556 -80533 -61907 -22274 24195 74367 161595 261511 256796 145402 28101
15241 28101 -30552 2271 32729 -79671 -89579 -25102 29324 2647 -6178 67241 -122282 -113910
15229 -113910 -178038 -79795 -61075 -7830 -94120 -85907 -50164 -101767 -120653 -120870 -136032 -82424
15217 -82424 1593 -38589 -131875 -158964 -111552 -11792 -10985 -7094 -86188 -83459 -9141 110338
15205 110338 -2069 -62742 -100501 -20143 23290 -1523 -18992 -126831 -221281 -95702 -21414
15194 -21414 4644 62975 24588 -37894 -22427 -99351 -93759 -115476 -68813 -74974 -148813 -125903
15182 -125903 -145287 -140225 -52329 -87268 -134580 -175791 -208575 -104837 -69886 -20457 -30680
15171 -30680 -51197 10878 157926 120595 50625 58485 93474 129777 56676 7465 75654 -41249
15159 -41249 -139810 -176231 -170656 -217536 -262711 -221426 -93641 37623 82550 41 -73809
15148 -73809 -69067 -101804 -91673 -87860 -12695 -15279 -52075 16850 44283 -80004 -95114 -73602
15136 -73602 -2308 -1509 -124188 -115428 -143963 -124533 -84311 -84226 -22106 -179255 -275811 -298125
15124 -298125 -305229 -339635 -304319 -115079 -346 61531 -53098 -277858 -325378 -137654 -71249
15113 -71249 87476 130255 10915 21841 50984 50124 63714 9072 -57242 -27365 104888
15102 104888 120370 49459 45002 -64805 -189124 -174834 -157277 -83777 -49861 -97400 -116133
15091 -116133 -256574 -228112 -44398 15286 -90395 -133560 -121643 -102334 -60286 84696 51172
15080 51172 -221010 -237470 -175825 -64803 -35308 -27740 -29206 -56476 -111607 -117691 -87547 -196652
15068 -196652 -163606 -85391 -78427 -187654 -184826 -131388 -3532 2891 33379 -56231 -144823 -155058
15056 -155058 -15365 -9567 86752 142370 91821 96052 -60662 -82769 -66775 -89903 3072
15045 3072 176339 248800 174863 131752 61416 95827 103897 97694 83894 15571 -124228 -211025
15033 -211025 -173749 -99078 18071 -16864 -162144 -229301 -204955 -183479 -176005 -134803 -116996
15022 -116996 -147937 -128033 24291 -23307 -21828 40840 179405 182060 120228 13886 -15672
15011 -15672 5725 0 -67322 -87670 -142737 -243242 -239164 -47022 74294 9662 -51353
15000 -51353 -15064 -92025 -143342 -103519 -60461 82027 38775 -30413 -45028 -53481 -23634 -33965
14988 -33965 3128 -13773 -137677 -105029 5153 55309 -42498 -87246 -34109 39847 112438
14977 112438 137356 78967 6935 -13158 -32212 -34598 -76431 -76786 -13242 118842 115151 64140
14965 64140 98918 125621 81497 68327 16289 -16589 -142513 -179448 -171184 -81503 50825
14954 50825 -77983 -59911 12495 77502 64481 29221 66701 -37005 -148968 -172953 -171221
14943 -171221 -186469 -210456 -191135 -150249 -116165 -16118 164455 54263 -90371 -202705
14933 -202705 -235095 -167756 -19270 130861 112261 113671 142707 105421 66144 -5245 69392
14922 69392 4344 -21496 98124 190246 49750 19710 -49086 -113282 -46054 7743 171314
14911 171314 151600 106106 125385 149450 98200 157385 175084 51174 136674 198961 226351
14900 226351 130104 96428 157808 207279 250215 187018 58077 -2280 22279 13726 -129820
14889 -129820 -138093 -115109 -94217 28453 90274 -49271 -83946 -38093 -7832 96879 225381
14878 225381 310947 193912 -31979 -99312 -30521 -125472 -139945 -41677 13591 84523 70627
14867 70627 154530 124802 91786 79969 19013 58996 35936 -55940 -43463 73455 131681
14856 131681 118903 -41857 -107552 6221 66127 9069 60107 954 15365 39402 -101450
14845 -101450 -187489 -119839 -103343 -59799 31366 101353 100035 9042 -7346 -122045 -179216
14834 -179216 -162825 -125287 -110424 -82102 -20591 -70037 -186179 -224573 -135692 -125889 -157735
14823 -157735 -113680 -34993 -48239 27547 32129 -10651 19200 140623 178510 -55838 -150004
14812 -150004 -164025 -171159 -157146 -119419 -183621 -225484 -157898 -148321 -183523 -147816 -187298 -171680
14800 -171680 -99639 -102695 -8158 114834 230845 91474 125396 177757 101398 110663 31117
14789 31117 28960 56009 -50019 -28747 52641 2632 -168374 -180181 -232063 -202024 -173709
14778 -173709 -161040 -76395 -13191 -84242 -49867 -104886 -164291 -184339 -66521 -71498 1829
14767 1829 67669 137525 148144 65231 -15131 -16243 -15129 63176 72967 68060 63678 -75212 -229950
14754 -229950 -214813 -95484 -76560 -55987 -60909 -5944 62423 16706 95134 134405 53052
14743 53052 -13831 -5627 17160 30307 73036 64157 -25158 -75324 -41295 -82221 -12250 38362
14731 38362 15121 -102648 -119490 -24044 4693 -16747 50919 99449 75155 42545 97186
14720 97186 36686 -64859 -30924 -60039 -22514 -51748 -28252 -88024 -157263 -85884 -72561
14709 -72561 -92860 -92666 -114881 -220920 -197419 -70170 2118 111204 117472 174979 199632 139213
14697 139213 16544 31554 66763 -19324 -18793 -406 30176 117560 107273 135352 98933 131468
14685 131468 101066 96798 124359 137344 34453 -56647 -31758 -70261 -49947 -81079 -141636
14674 -141636 -144632 -217316 -192499 -184276 -242752 -250332 -62788 15514 -4715 -44201 -112911 -159754
14662 -159754 -68321 40548 158832 128979 126344 40892 110736 99793 32477 20624 86054
14651 86054 141985 2161 -18728 -26058 -71613 68273 27033 3820 -53421 -123407 -34178
14640 -34178 -75076 -51542 -1703 -44724 -153346 -183505 -123606 -86457 -30268 81948 60857
14629 60857 77739 -90180 -87954 -48465 -3116 -74038 11467 111933 147036 204969 170309
14618 170309 146364 199413 214039 173283 115726 128256 63845 -20540 74942 134750 124216
14607 124216 116833 72455 74260 100608 184557 92715 -38595 -93638 -100676 -52224 3485 -146448
14595 -146448 -237618 -204463 -130684 -155619 -169630 -62811 17599 89645 70819 107748 64502
14584 64502 185896 348428 330338 327316 163666 52530 10709 27310 78014 99611 45449
14573 45449 -7953 53880 67021 51613 -45624 -116472 -92550 -99299 -84123 48105 119658 109897
14561 109897 22422 -11374 21014 6083 80995 77008 108575 -20692 -95498 -109987 -106870 -83415
14549 -83415 -39153 60326 103756 -5717 -3343 77944 190414 167540 128759 85192 143082
14538 143082 5015 -114020 -270019 -281313 -247173 -118938 30083 98344 87488 -4238
14528 -4238 -28924 115659 278699 237825 74422 -134954 -35005 75794 39036 40842 89483
14517 89483 192395 191696 210715 229915 277835 197811 116419 96054 121609 157896 107122 17568
14505 17568 -48083 -74027 -33173 -15300 -1139 111804 207497 192846 74252 81876 13609
14494 13609 -13335 -10148 8333 37632 38021 115703 8215 -24520 -67859 -94673 -116881 -96568
14482 -96568 -30791 81736 57634 128920 65462 -17574 7449 28532 100126 239832 96523
14471 96523 39959 62592 153516 70927 -172743 -206922 -221183 -88205 -5922 -91173 -93926
14460 -93926 4878 -52531 -23458 -39477 -57523 -74881 -113637 -36646 -77745 -97220 -46102 -132427
14448 -132427 -177143 -3852 52978 -703 -46942 -16866 -46173 -61644 -180080 -145937 -94685
14437 -94685 -142563 -179072 -152090 -130424 -72939 -96403 -165257 -158743 -61269 35367 113034 87162
14425 87162 100088 142613 147146 111161 132527 161411 115637 -31373 -46554 -91240 -159215 -206205
14413 -206205 -295357 -233889 -54509 85094 32271 -29247 -95709 -206097 -227236 -146385 28409
14402 28409 171465 172852 87261 63078 89572 147881 119814 174463 99694 67626 -99779
14391 -99779 -89701 -93221 33988 59479 -753 99912 155746 89703 94751 272906 259184
14380 259184 123652 134811 227057 224776 203905 206945 87512 114370 180378 162739 248701
14369 248701 177187 51677 32624 -2160 -65803 65247 1210 -12759 63734 3984 -22995
14358 -22995 24823 74398 112928 73005 68834 83789 116062 96931 90822 6875 -12033 49489
14346 49489 -28293 -121542 -118541 18242 62500 83067 112437 42372 19274 41370 50991 69798
14334 69798 94361 225640 133322 -74098 -128100 -41810 -95440 -59484 -142851 -91349 85433
14323 85433 151322 145416 145624 -9989 -98410 -4991 59776 29628 -21714 -135668 -2926 60809
14311 60809 -40048 5480 104719 182100 53698 -52864 20438 76431 110423 142231 -6540
14300 -6540 -28164 -61728 -72345 -44726 -88347 4244 -21467 -94096 -93676 -64899 -98135 -115334
14288 -115334 -20946 35684 82687 80423 -38615 4409 2176 -41153 -25560 -66556 -55299 -60577
14276 -60577 -79652 -58671 -1772 87386 135895 75440 -33409 6185 87549 151476 167293
14265 167293 109072 54692 7748 86448 165431 130838 50814 49491 20677 26179 -48892 -115668
14253 -115668 -47468 33242 6109 14157 2704 9573 145164 121391 4202 -60232 -89652
14242 -89652 -97037 -66510 25003 -26088 -95756 -130670 -176925 -139778 8746 154609 176961
14231 176961 122297 45947 25668 97561 144560 154421 -17333 -99534 108675 197225 203178
14220 203178 188862 68769 -56452 -37829 26617 130188 348 -15683 57122 104912 101834
14209 101834 38244 -4521 5530 162358 258803 217252 110022 136128 144465 153094 -18636
14198 -18636 -119488 -23992 26583 135929 230851 121404 -91502 -111479 -152846 -178036 -122038
14187 -122038 -26322 90179 227046 192766 168069 193931 172251 -29035 55562 207222 148214
14176 148214 192081 155385 223045 313487 187745 109830 54120 72927 16270 2693 -57233
14165 -57233 3821 -24842 -36275 6052 93487 115978 140890 145080 205297 159982 81668 -3009
14153 -3009 27606 12059 -61440 -15759 -1015 48604 23298 -37059 4466 -89213 -106471 -131917
14141 -131917 -164084 -167138 -125588 -113093 -95933 -109698 -220364 -285138 -220365 -137817 -118779
14130 -118779 -81475 -52781 -84767 9687 48728 -1497 -103218 -80531 79566 4498 -50767
14119 -50767 -41316 34526 238036 259204 208700 241691 191703 175476 193010 135322 79121 85654
14107 85654 104750 112093 113422 90021 59976 -15288 63423 66648 81383 114027 79189 118479
14095 118479 185069 181793 26966 -32167 -57576 27996 53524 131520 59935 -37674 -84480
14084 -84480 -227675 -183562 -143968 -113456 -27322 26109 3751 46270 186512 178541 95911
14073 95911 59307 -110335 -67798 2328 -10332 -41861 -36650 8671 -36459 -21110 37963 43027
14061 43027 4215 -110873 -99992 -18375 -129275 -322471 -348298 -110606 -4164 129575
14051 129575 131559 103692 113046 105012 -22770 32902 95174 -19547 -93162 -34100 118195
14040 118195 226353 194477 99792 91249 105785 106515 62131 76086 10260 -15908 25178 88102
14028 88102 50482 -44628 -145382 -135049 -119705 -89521 -77033 4276 50881 7568 -35758
14017 -35758 -121790 -43901 -2014 -31978 -44999 -87763 -150681 -64957 25250 26764 67927 64766
14005 64766 142276 194244 33752 11461 -55563 32153 67005 89523 126420 178705 104519
13994 104519 -4112 -1637 114092 -13213 -121619 -86954 -35224 -72040 -80901 -30768 24795
13983 24795 49259 -11330 7023 87941 173761 242620 219816 145302 197356 141326 130449 177613
13971 177613 145144 43118 52824 11317 -64608 -18987 58012 104896 107000 134927 20416
13960 20416 -108978 62106 67522 -35016 -75366 -16040 96385 186520 109147 81605 169917
13949 169917 253886 279178 347322 316057 272112 361766 427161 449734 372487 292431 244026
13938 244026 177112 218901 301901 173237 107791 73247 13374 29312 115152 54126 -1494
13927 -1494 -82063 44483 143515 159486 51058 75419 167048 149127 123948 51630 124373
13916 124373 130293 131584 -29091 -49305 51429 98609 105344 234550 205862 82657 -19670
13905 -19670 -110172 -125014 1162 83966 -9059 -62630 66972 98870 -14274 -15133 4327
13894 4327 46257 -5140 16132 81295 32552 32537 -10270 -95334 -83213 -6062 39376 1864
13882 1864 -33430 78028 225370 279214 200633 217089 200280 151389 -9137 -20335 43794
13871 43794 -84387 31123 -16793 -39838 72115 28391 -36323 6664 36453 25157 -23517
13860 -23517 111772 171475 153604 139987 108791 534 -43265 -81446 -85212 -8364 -10721 -63597
13848 -63597 -49877 9129 6161 -65910 -63206 -15189 12209 -11408 14359 8863 -73467 -36941
13836 -36941 35189 40825 10429 74866 118234 -1318 40152 157227 123787 -37473 -32090
13825 -32090 22723 128084 248327 159919 113504 188826 290921 333182 282917 188230 112379
13814 112379 65793 181701 251297 267837 166924 117899 233929 193194 183243 250831 177025
13803 177025 85578 132998 297255 444913 375773 234468 115856 130902 88961 17091 73609
13792 73609 114203 156803 186552 125959 -5906 -13013 58158 172011 52297 -54827 -54044
13781 -54044 9960 88886 64577 -53125 -131148 -184833 -219126 -177269 -59009 -174220 -264280
13770 -264280 -226687 -219280 -232245 -228776 -15656 102830 11695 -63267 -52836 25248 67086
13759 67086 19806 -21441 -27272 -36702 9086 27517 114383 59817 -48918 -208012 -151279 63346
13747 63346 87406 59334 16353 -179237 -128802 -131386 -229539 -233461 -279906 -244783 -190949 -129164
13735 -129164 -90119 -48537 -55063 -51297 -47404 -1012 12181 80742 85838 30484 55305 154943
13723 154943 55814 62977 48376 -27684 -76882 -114317 -135036 -172818 -174880 -76542 59515 146646
13711 146646 241820 169613 196741 200220 51810 -20566 61019 116376 54152 57927 4710 -26252
13699 -26252 -25343 -102095 -121655 -78433 -10194 -76651 -153138 -157620 -67917 -4405 11792 74903
13687 74903 166804 58519 -132946 -227644 -249581 -45576 -47678 72618 136813 121169 53552
13676 53552 -130312 -93225 21879 7546 25858 40855 50547 75224 109899 99278 33522
13665 33522 -64329 -63260 3945 -60563 -64185 -103695 -140017 -126962 -151658 -142767 -110431 -101859
13653 -101859 -69667 -48234 9457 -17170 -84023 31672 122258 110810 6348 -117570 -58391
13642 -58391 -43939 -93994 -48629 -55937 -62026 -44272 17458 79907 99871 -23745 -145911 -185179
13630 -185179 -160300 -57712 -110022 -145917 -103038 -49383 72491 23093 -22016 21260 -87179
13619 -87179 -66823 -5975 74765 89498 114131 19391 -82846 -77216 45761 96372 14087
13608 14087 -65291 16522 -5748 -120796 -185469 -185741 -14286 78551 57628 -5190 12285 -7268
13596 -7268 -31566 31242 74884 54888 -21302 -33312 -119227 -214038 -193280 -150199 -94721 -91385
13584 -91385 -58644 -128811 -136729 -86406 -37655 -53479 -6641 41090 28091 -59288 -79968 -31420
13572 -31420 -34130 -95164 -139556 -62809 -92614 -70455 -108895 -120235 -130665 -179968 -257904 -232158
13560 -232158 -203253 -209164 -287178 -223087 -66717 -92300 -113078 -93552 -64046 -87480 -106738
13549 -106738 -72228 -5639 -52236 -121933 19009 74312 79120 -8543 -60725 -54921 -73974 -45459
13537 -45459 27711 -43988 -110763 -11795 -15881 32747 120095 167066 107291 57285 -23980 -16493
13525 -16493 52876 -30023 44581 103041 134395 171068 181391 274914 433066 510892 543117
13514 543117 660556 723324 745009 750555 873159 856370 745294 685901 478374 365422 297891
13503 297891 182429 170995 123198 86811 -53031 -144377 -107853 -100451 -56372 84955 134704
13492 134704 114725 47995 103303 222398 331311 149783 98627 156188 32269 -450 -19478
13481 -19478 25991 -10045 -88898 -32908 -49579 -42874 -38146 -41649 5545 46296 -126648 -268949
13469 -268949 -217210 -139934 -28547 63584 48109 -2516 -4066 -39087 -10571 27752 78777
13458 78777 38696 932 -153052 -177506 -224584 -221735 -207503 -254610 -170543 -108587 -94710 -78542
13446 -78542 -66658 -59737 -45477 -16718 290 -43061 -130180 -127350 -73231 -65599 -125999 -183726
13434 -183726 -88509 68204 139217 148060 42472 -20155 141538 287048 243792 98578 -51751
13423 -51751 -57768 64672 168429 196053 109200 106105 120920 56993 1698 4084 -47122 -39409
13411 -39409 7567 -80111 -78492 39486 154532 127139 65356 -5922 22360 23719 11156 19351
13399 19351 -108957 -287243 -287414 -167867 -148218 -166008 -269996 -350117 -298066 -339172 -263886
13388 -263886 -224567 -90928 23081 184225 14771 10434 61658 -32544 -115533 -115906 -47358
13377 -47358 -27163 -20140 13713 -87939 -39557 102944 210487 186087 50205 -21232 22445
13366 22445 -65484 -104814 -164657 -167687 -82768 -15339 89098 102993 39024 85141 124106 160937
13354 160937 128607 125276 91487 -19807 -104167 4241 148831 118996 -25849 -29374 35828
13343 35828 79229 41084 -1748 21700 -80324 -19213 25916 926 53519 44770 151606
13332 151606 146824 -5948 -94337 -83807 -243058 -282019 -182608 -121526 2134 85281 -14253
13321 -14253 -98719 -148296 -44297 73497 24851 -81510 -155262 -93712 19249 -11969 -111809
13310 -111809 -98819 32705 -41137 -73656 -58934 37263 -24734 -107304 -26767 18885 18316 18844
13298 18844 -22819 -52714 -32066 14492 99928 85223 -72865 -105077 -6492 -26456 -16100
13287 -16100 -94921 -172105 -66539 45975 65325 -46609 -30794 107168 222777 153341 47431
13276 47431 -18878 138081 126294 51126 112903 68173 -13826 25206 102803 172035 81144
13265 81144 -49464 14318 25191 26768 192642 238106 205351 41461 38180 122937 107047
13254 107047 -5628 -57020 -75954 -91762 -125180 -2010 149398 153038 128912 126454 104552
13243 104552 6931 -46055 38675 -43120 -5164 112243 68556 53633 54503 120755 87913 104771
13231 104771 -1261 -63423 -112173 -187547 -171898 -178428 -173962 -62380 16897 83422 30959
13220 30959 106786 106039 74517 141151 121941 148621 200120 214496 215056 55705 26318 58149
13208 58149 62966 -4282 13920 110715 235118 297375 230808 190694 97002 71756 70886 -32670
13196 -32670 -100375 50814 279567 365434 398256 310384 167771 -13436 48964 124255 162398
13185 162398 92926 240964 406231 321449 196370 189172 188343 164870 168678 201063 230440 186146
13173 186146 125909 92026 159664 117353 199572 158354 192612 262079 323566 218098 203958
13162 203958 412865 504055 492982 454143 384852 364105 406025 467387 411029 128226 77121
13151 77121 120338 184463 236856 259433 324729 333929 323248 426120 360003 308195 361550 334716
13139 334716 407100 323716 328697 465883 611494 651488 642405 600987 576572 565817 612955
13128 612955 678413 798160 971327 997760 954174 930095 1089700 1096371 1097350 1154776 1210132
13117 1210132 1334082 1442192 1598345 1855581 1889640 1975772 2041600 2098741 2247597 2386458
13107 2386458 2688480 3130761 3507189 3933045 4377829 4972016 5721861 6596708 7609729
13098 7609729 8734289 10021658 11541002 13281730 15523229 18524620 22374018 27604981
13090 27604981 34890883 45253533 60239235 80807523 105109946 127961209 143495066
13083 143495066 149435544 148340739 146622679 148530885 152648602 153361558 145658094 128535311
13075 128535311 106148414 83831220 65222210 51235173 41179583 33940854 28493394
13068 28493394 24223283 20953070 18332167 16155030 14377231 12937481 11391755 10108464
13060 10108464 9071577 8150737 7277832 6558018 5949423 5407449 5089692 4703636 4347624
13051 4347624 4030615 3763629 3602590 3391320 3058960 2751424 2620874 2544914 2341606 2105332
13041 2105332 1881241 1698687 1709123 1661145 1597245 1509186 1378851 1365978 1357303 1350334 1310373
13030 1310373 1318163 1278180 1249941 1254793 1201219 1139184 1045441 945693 980028 980465 1068504 927697
13018 927697 917828 905105 792115 779588 875510 961502 947208 821213 825916 940738 930159
13007 930159 777346 600459 612754 722016 734772 642707 611757 608761 592350 601601 616295
12996 616295 528043 520483 615542 571868 591449 696021 649272 580609 475160 346698 364883
12985 364883 451777 515848 640184 510014 341094 373629 420678 323209 221778 262903 380079
12974 380079 435533 327349 279008 387888 404238 410069 359415 286756 207280 188622 382206
12963 382206 361090 341799 278932 279101 362629 378269 362864 416605 459572 267217 182565 293280
12951 293280 188919 144714 230754 300324 238371 180826 257185 214508 129097 176056 102065
12940 102065 126974 135390 191663 221406 342181 358991 310389 101793 5344 103531 337067
12929 337067 267289 47128 80539 94285 139626 137558 72155 78930 196434 158462 114257
12918 114257 125988 176339 107355 133940 205150 146629 105834 88814 34841 93983 301589
12907 301589 269322 175745 122112 106752 109979 124049 166183 226401 262475 363232 341575
12896 341575 368413 356274 303548 379180 368189 304936 284002 366945 383725 401369 284331
12885 284331 224858 49340 -108737 -34747 8887 126289 186354 158212 100847 34473 150589
12874 150589 272802 252485 250273 324533 324494 270662 239818 124456 47796 132683 148114 192289
12862 192289 257647 451861 456074 335167 252790 270984 307929 258748 52147 62302 262552
12851 262552 224145 181166 180970 106344 60042 235229 156279 76454 105953 49988 115329 64339
12839 64339 19139 2659 -64775 334 71628 81333 43085 130793 300311 292956 159330 128815
12827 128815 146367 137632 264004 279372 179199 120952 66531 153171 277115 212024 167240
12816 167240 268565 198975 167725 175707 294202 230334 97039 102659 138530 183303 224797
12805 224797 187378 230766 223723 168019 129134 179637 108361 83438 86238 28054 21078 43236
12793 43236 62024 28177 71680 51808 -3837 -82518 9648 153612 139892 120265 103139
12782 103139 24130 22957 -17910 -31613 -59627 -52983 -611 77333 175175 256331 61560 -16573
12770 -16573 -21885 -45740 -128493 -38681 107830 143219 65675 9175 67454 59644 94365 33469
12758 33469 214598 315921 318524 273346 228229 39545 -56374 920 -64876 -36206 10549
12747 10549 -80623 8005 29352 -101999 -79718 -3991 18797 2926 140180 165217 171787
12736 171787 246290 206292 97157 74302 45838 -163055 -224059 -185882 -229612 -87147 78394
12725 78394 160006 147512 131327 103832 164151 185467 139011 20357 -77739 9220 2459 -72310
12713 -72310 -3250 -58870 -14948 86409 200598 268063 129397 84512 -78017 -179574 -125696
12702 -125696 -46664 -76998 -40133 69473 192896 191083 235205 237292 142987 83033 57863
12691 57863 551 -48717 -60090 -30143 31416 28387 -2905 -65527 -87646 -99541 -27473 28113
12679 28113 -8422 -12529 -26179 34996 -5956 -26165 44180 -16242 -78677 -88627 -66180 -73660
12667 -73660 -43239 -40039 -177559 -118795 72209 171150 206742 114113 50488 44062 78578 81577
12655 81577 44971 101127 210323 291339 337889 358131 432445 574898 769182 867040 893046
12644 893046 807883 748162 718309 773689 769924 777610 732563 548557 402021 347112 154043
12633 154043 164739 226440 193764 237880 250528 267528 314614 379403 268140 228446 233768
12622 233768 249043 140952 55695 116310 101018 36553 -24981 40808 145728 167450 161439
12611 161439 103780 61955 86064 159463 99580 -28718 -134690 -96191 161889 270195 282225
12600 282225 153415 59166 19306 -12338 -19963 75861 64230 33173 42729 129065 234917
12589 234917 261209 191499 171304 73245 -77868 -154900 -174403 -119360 -76988 -38278 -49368
12578 -49368 -51723 -72742 12157 -11966 -71101 -83885 -25060 51082 187946 107465 40206 -28308
12566 -28308 -26585 33692 -26910 -154580 -193379 -118989 4580 11035 -53445 -96685 -75481 -69882
12554 -69882 17108 96524 124378 63190 71038 46223 57469 79934 -27302 -53537 -59357 -164948
12542 -164948 -116438 103109 61138 -11115 -47313 -108778 6156 138556 185731 110326 30907
12531 30907 -19484 -133119 -180209 -74321 -61207 -112708 -18498 28065 -43692 -48158 -26912
12520 -26912 107725 157635 60883 -66498 -74596 -80896 -128158 -162281 -71917 -49340 9633 55287
12508 55287 68252 23476 11845 -21350 -49406 -140049 -108311 -76481 -51180 47336 98412 40093
12496 40093 25958 29749 44123 -137220 -195016 -64955 -52666 5046 -24580 71128 161056
12485 161056 153885 53173 92006 314197 393317 89323 -67437 -16804 -44758 -112219 51654
12474 51654 -46294 -93838 -67323 -92756 -188427 -139007 -149768 -178571 -32715 -37099 -52221 -20350
12462 -20350 37912 19610 -31655 7863 2534 -5702 5677 23506 39051 23179 15546 52229
12450 52229 76072 104792 64549 125137 90909 78332 175427 234359 195988 318522 214561
12439 214561 171178 216672 84197 2244 84283 101127 102589 125990 46665 5027 -43870
12428 -43870 -46006 594 145400 169069 131369 43357 14581 88407 -2754 -95943 -49697 -78329
12416 -78329 -121680 79891 177346 119835 152046 122765 65559 39860 46096 36691 27296 -36825
12404 -36825 70655 21602 -129088 -30593 99284 135959 81042 -54157 -38734 8703 -51666
12393 -51666 -117475 -130151 -44647 67507 141042 88250 -15106 -1305 -6376 85542 156483
12382 156483 96141 102972 19368 -57734 -2962 -129334 -150702 73131 -5356 -135121 -9479
12371 -9479 11394 50695 78337 26604 -57002 -88940 -19242 68625 47523 -36363 -92234 -92769
12359 -92769 13326 58840 59416 -52140 36875 83349 -24665 -53921 77886 135406 76647
12348 76647 103314 54279 -2131 -3635 29361 18068 57926 20109 21289 -77084 -190317 -149504
12336 -149504 -235531 -135595 -77669 -84371 -24038 37894 -60160 -91361 19690 27687 -23166 -28706
12324 -28706 -40680 14645 -16686 4095 50495 -14274 -130861 -77455 37123 98959 -3190
12313 -3190 -75579 -27899 -35911 -88166 -69490 -91653 -204990 -366367 -353755 -286630 -267784 -136781
12301 -136781 -96834 -47741 -105168 -10437 147399 197147 100977 86525 84784 11091 -28643
12290 -28643 -32887 -16672 37393 29344 4274 65623 62869 -71378 -109690 -100889 -111008 -160537
12278 -160537 -184626 -99946 -68625 -83674 -137995 -125475 -15850 85284 31890 -9395 59291
12267 59291 5522 13929 -68543 -37593 -21894 -71841 -128486 51476 109334 -26387 -120351
12256 -120351 -120580 -45834 90815 45980 80550 54018 -34848 -13358 40311 31979 -40065 -52294
12244 -52294 -101205 -274890 -331424 -248517 -65913 51990 80368 55781 -46634 -105473 -95789
12233 -95789 -59862 -90289 -114439 -116859 -212650 -209862 -86321 -94252 -65768 -102595 -69047 40651
12221 40651 133751 120532 928 -79549 7316 -54769 -124863 -50254 -131136 -176511 -56637
12210 -56637 71112 123059 45660 11432 -15221 27468 66998 -87798 -203596 -123886 -37828
12199 -37828 42051 38249 44661 -85888 -31089 27918 -27811 49100 88492 -20183 -153298
12188 -153298 -26621 12854 -43830 -1313 -21441 -52395 -26285 -45787 -58458 -65704 -24788
12177 -24788 -87093 -113081 -67255 -20495 -127218 -103835 26186 27972 28964 72602 108462 34096
12165 34096 -43503 -221712 -193141 -131305 -134619 -166417 -173217 -40086 -1730 -29546 10971 -15677
12153 -15677 -6164 -13089 -82923 -113608 -199128 -235080 -122695 -10442 1992 65079 72351 116272
12141 116272 232496 175091 80973 -9353 -11731 -54907 -89791 61906 57667 -5690 -54617
12130 -54617 -90107 -157992 -93640 -139032 -52603 -62367 -24685 103674 155432 89041 -91615
12119 -91615 -197080 -155041 -73577 -48861 77485 178757 189764 103665 68292 13171 -87656
12108 -87656 -36895 112254 78457 -84319 -231312 -105688 17867 179934 112377 31515
12098 31515 56953 70926 92782 68488 -80910 -85861 22407 1702 2130 76274 -13352 -84449
12086 -84449 -108798 -38772 -61682 -71148 -105325 -104653 -74884 38226 -3947 1401 -38790 65820
12074 65820 -50314 -31186 32485 78016 137627 105647 145809 89936 118007 51353 -5579
12063 -5579 -47280 -66254 -28881 -32910 33024 62668 -45330 -172302 -154210 -18473 113179
12052 113179 118617 124403 27978 -10879 59490 17119 -96719 84137 199128 207105 107408
12041 107408 160750 345110 255987 199479 96377 80892 31351 1913 61041 62589 49071
12030 49071 55523 28712 -57552 -10839 -52367 -56186 -28702 5846 47216 79198 242054 267724
12018 267724 173613 137270 158564 127762 153789 124988 130334 109262 -23640 -62171 -107538
12007 -107538 -234886 -274776 -244861 -125713 -61364 -37105 -74936 29460 112916 127525 133302
11996 133302 126227 61191 100033 89807 90371 -65661 -142774 -246903 -237883 -185256 -34430 52847
11984 52847 32770 -19657 5023 53389 72477 88771 146261 115071 247758 128380 163702
11973 163702 215459 153045 56180 -105837 -27067 62107 53408 50012 -14263 -106030 -213258
11962 -213258 -178821 -110408 -29158 -20557 -20670 -85747 -72945 -2643 -61472 -190293 -188568 -215905
11950 -215905 -303642 -223940 -33717 -30953 -88173 -147645 -154919 -187406 -82643 53279 12314
11939 12314 -110448 -150582 -41606 -70307 -22053 -11185 -60127 -125200 -209898 -160052 -87161
11928 -87161 16215 143575 98361 129620 102458 29974 -18059 -36369 -86522 -59746 -31626
11917 -31626 -29415 -84067 -125025 -19556 29284 -23215 -14225 1323 -63682 -90404 -75767 -31702
11905 -31702 13000 -2092 -60224 -96603 75671 107019 -34886 -79779 21690 68013 2088
11894 2088 -98156 -177583 -141915 -227867 -120093 44015 79633 11962 69344 166177 164539
11883 164539 44123 -14587 112062 119236 53620 129653 50692 -37160 -101932 -32065 -36350
11872 -36350 -185610 -146278 -125414 -130187 -120726 -24876 4300 17688 -67124 -34837 18926 146407
11860 146407 166507 116810 108866 -28082 -138069 -146051 -194190 -242661 -309687 -143173 -99328
11849 -99328 -69164 9749 -42869 -72087 -90165 -180918 -304979 -331645 -302422 -232813 -152972
11838 -152972 -100912 -116823 -120505 -148613 -135512 -118489 -105711 -76537 19815 -9097 50799 58551
11826 58551 -64261 -142914 -66669 12279 -105966 -215628 -99393 30172 85394 160748 101781
11815 101781 44795 130291 81165 -73325 -61935 -24367 -99057 -41870 -10083 20371 96912
11804 96912 -8372 -53268 23268 -29181 -91363 66046 27418 97028 169479 119397 34817
11793 34817 74448 113911 117403 142859 195308 237435 164814 -6449 -12102 30666 12088 100552
11781 100552 164601 132248 71497 -19883 170813 226552 129277 91051 14023 -79243 -24005
11770 -24005 21235 -20399 4118 -40321 24971 -16185 -174166 -292957 -255402 -83791 7959
11759 7959 -108404 -149834 -203020 -315371 -220627 -170764 -214455 -190522 -159642 -146268 -156138 -150009
11747 -150009 -86286 -119913 -47146 48422 57148 -20111 -40132 66085 95343 64133 60771 2000
11735 2000 33077 59039 69088 105244 232657 192251 74393 -103191 -145005 -113640 -59598
11724 -59598 -109811 -105291 -106498 -102808 14394 73338 32475 78206 118390 80642 7698 -29780
11712 -29780 14391 4543 -72009 9118 119568 153357 264872 185552 60159 -46132 -150480
11701 -150480 -123271 -164674 -129584 -51691 18492 -49478 2611 115138 -9744 34573 45277
11690 45277 -31064 -188489 -125457 -105785 13503 128667 55145 4440 -153050 -249273 -257821
11679 -257821 -353917 -448789 -369472 -293848 -196970 -74873 277 -117121 -113775 -87988 19818
11668 19818 38180 32504 96840 109043 162787 148214 127653 898 -89380 -123821 -101178 -35578
11656 -35578 -15072 -13238 88247 124772 71410 79474 177297 102671 19586 -32706 24429 30007
11644 30007 -91565 -77000 -159924 -170611 -195267 -117479 -39753 21860 -2000 -42349 27737
11633 27737 162702 142964 92256 79824 216039 166514 58311 104800 41579 48421 83764
11622 83764 9121 39918 -47733 -213142 -189821 -56374 -38942 -58462 -2743 7190 140174
11611 140174 148189 8664 -70379 -7356 123014 55297 -62143 -100365 -150422 -159331 -150173
11600 -150173 -156865 -108935 -35027 -96186 -52124 -12572 -92704 -146853 -143515 -222678 -236952 -190632
11588 -190632 -72861 -104094 -93085 -76134 -35949 -10260 95538 122381 95751 25932 -91119
11577 -91119 -83093 -2711 -45752 -10869 -68418 42144 139967 102535 96850 95383 42974 61451
11565 61451 77688 -19775 -125396 -151143 -174069 -87290 -61951 91989 117256 -20242 -61928
11554 -61928 -107896 -139084 -71948 34065 55768 36462 31332 -13927 -69663 -72060 -110895 -122727
11542 -122727 -76853 -15869 -40084 22613 -2763 -93453 -26834 48303 74722 -39880 -127295
11531 -127295 -75827 -41975 13363 110395 108377 151281 96807 -23240 -80465 -10680 -81545
11520 -81545 -48501 24004 29235 84379 81776 21165 -6525 8160 -27960 -135422 -60100 -47649
11508 -47649 -138326 -159476 -106945 -72965 -93769 -136032 -32480 -129858 -237970 -295623 -221187
11497 -221187 -73168 -83240 -19314 18019 -32581 3631 -23384 -45495 -60966 -159279 -320440
11486 -320440 -338193 -245251 -351671 -283489 -216581 -201461 -256625 -271709 -230127 -237731 -144720
11475 -144720 -46206 -31801 -6332 -36782 -12068 -28666 -38128 60047 -15702 -66270 13191 68336
11463 68336 -10711 -139745 -291902 -292498 -202377 -85842 37121 -82425 -31847 -1930 -33366
11452 -33366 -93529 53155 -58299 -125587 -146470 -228056 -138970 -132888 -246490 -359456 -285260
11441 -285260 -125339 -12069 -75372 -132286 -55235 90073 107234 108073 29493 27462 -102204
11430 -102204 -99961 -191106 -236664 -173041 71924 158550 132496 147961 45900 -94102 -175825
11419 -175825 -202554 -179604 -99824 -115731 6066 -14388 -43857 27307 68878 -6738 -9478
11408 -9478 -55492 3599 -111766 -167281 -117342 -99809 -63570 -172619 -139816 1305 -66852
11397 -66852 -82039 -66800 -35259 -23025 -10450 -19301 -2311 115264 161548 79845 29794 30698
11385 30698 160370 250890 201847 55084 -17872 740 -66262 -55066 -168214 -207135 2716
11374 2716 88260 82257 189160 119136 64841 71767 111203 40374 -5579 54212 92438 45403
11362 45403 64350 66183 -69324 -94223 -23114 -10545 -87163 -62760 -84379 -36914 178328
11351 178328 172327 41676 -84873 -132452 -116280 -95940 -150830 -107852 51922 150376 158651
11340 158651 93039 32053 -11384 -27362 -62669 -33392 -62284 -66070 -107343 -209717 -88485
11329 -88485 33420 80821 18827 -35344 20000 117681 103724 56860 83941 147865 207810
11318 207810 123652 61641 -17398 -29829 12793 16946 -67085 -23026 -141183 -204013 -107284
11307 -107284 -34973 -32395 -26323 107930 106450 -20716 18666 24869 80873 55566 143195 369854
11295 369854 774415 1194989 1382117 1490066 1507399 1277298 1025943 680797 408193 202627
11285 202627 110336 26978 -30621 59226 136763 43979 5887 37188 25606 101404 41438
11274 41438 -113160 -74110 80330 109292 101185 -125850 -225588 -251119 -257554 -246674 20743
11263 20743 46029 80663 60076 -10356 21621 67567 1473 57009 2243 -51368 -238146
11252 -238146 -262410 -146096 -133858 -61559 89711 124821 64914 -181102 -202547 -63340 57766
11241 57766 37756 -62404 -108946 -33811 5327 -68432 -97712 -151033 -238345 -273806 -143500
11230 -143500 -20347 4785 49675 40825 15888 48448 -66421 -225382 -203507 -154467 -146909
11219 -146909 -183778 -149608 -110885 44873 115245 142741 19161 -1228 -68503 -81973 -29870
11208 -29870 -143101 -178449 -50352 -5881 41035 154601 128824 -3908 -217548 -290650 -388755
11197 -388755 -328948 -122265 -16214 -10486 14259 74946 -23325 1233 97558 81710 45380
11186 45380 147347 232057 311683 373834 497592 702632 876516 1083685 1159261 1208395 1268507
11175 1268507 1245995 1087267 870866 641530 411546 264789 194965 63106 -36245 13958
11165 13958 72865 112644 73509 27479 14567 13337 81965 95178 -16332 -157343 -64756
11154 -64756 -14465 25512 16648 -114047 -95857 -30476 -22692 -103722 -34918 -17672 -499 -10014
11142 -10014 5210 44979 -23259 -50796 -76101 -120357 -114942 -165312 -64417 136216 159672
11131 159672 50136 63970 151551 52329 -117078 -156100 -153944 82658 291392 241671 27462
11120 27462 42669 94670 -1411 -102068 -18363 -29783 47169 36811 51299 1822 -54028
11109 -54028 -21034 5660 -68988 -113547 -64391 -12755 -8150 70986 67631 72962 -25856 -110573
11097 -110573 -77119 -126162 -183635 -188507 -215627 -202024 -174883 -88300 6737 -12433 -40407 -21023
11085 -21023 3865 21299 -14171 -49524 -54717 -130428 -108292 -54387 18678 -11951 -54494 -51079
11073 -51079 -90663 -81108 -107035 -81716 -34929 -15230 45580 185749 141882 29433 71615
11062 71615 39574 -76131 -136300 -107042 38544 101382 6502 -46861 14211 -41002 -123016
11051 -123016 -79038 31181 -69867 -125341 -87851 38369 94242 140625 190868 73647 -148510
11040 -148510 -140779 -8917 18791 21376 -32156 1201 -32998 -66474 -31656 27681 -110 -66060
11028 -66060 45584 -36326 -125015 -105340 -110824 -126033 -101186 -145483 -67872 -188592 -165179
11017 -165179 -151455 -119925 15703 55473 19001 45893 -28204 -145460 -134896 -24946 43856
11006 43856 101819 56618 29904 67724 114732 17011 45484 66169 43453 61494 57597 77940
10994 77940 123288 150638 229503 179450 61031 39920 75583 67829 114307 126759 -37247
10983 -37247 -74323 53077 167726 71864 55519 144570 244192 112362 166771 194983 65725
10972 65725 9957 113583 151940 100076 37848 11870 -36725 -109906 -131116 -98993 -14956
10961 -14956 -15008 4932 -12116 -46084 804 55177 67468 37351 57066 47181 54034 30539 -69997
10948 -69997 -159793 -99034 -61402 -87991 -37793 -12253 -61037 12301 -18607 9810 47165 61816
10936 61816 64456 17471 -115228 -94246 -65876 -72388 -141595 -197456 -46498 39930 180154
10925 180154 136231 60138 94174 49793 132169 240492 271047 218672 13728 -9940 52540
10914 52540 39157 108267 13962 -97731 -116461 -68123 -71506 -24977 -796 -4141 46875 119676
10902 119676 258626 184376 22121 -7052 94109 10694 -52570 69421 167927 62673
10892 62673 73465 129004 77912 -147901 -188081 -100945 23226 36293 21744 10740 -43121
10881 -43121 -37844 -124651 -271355 -162090 -31397 87314 65011 -79858 -81184 8414 70931
10870 70931 174228 76473 -641 61396 154827 103830 146731 135234 133882 29456 -59892
10859 -59892 -104102 -98608 -85273 -21396 119837 15413 -94843 -12092 -19144 49336 124562
10848 124562 64566 80173 -9009 30358 6109 -68760 -130842 -113244 -52388 448 -39069
10837 -39069 -86381 -173744 -125539 -146484 -6357 -27680 -101284 -67158 3607 -66945 -69019 -17560
10825 -17560 8675 59222 133283 158757 231861 265944 136157 26949 16379 58171 13477
10814 13477 -27812 -168822 -125383 -70823 -151267 -53225 -195 37894 -13026 -25268 -102891
10803 -102891 -72145 4136 -47633 -6057 42983 18987 -125951 -97393 -38559 -28530 -29449 -3632
10791 -3632 -12076 76105 92281 119710 116029 106217 -14743 -102140 -85199 -62291 -14952 -6395
10779 -6395 20014 43599 32261 -24601 -6115 -49060 -38036 3119 -6015 -29957 43254 87797
10767 87797 156841 236852 268540 226910 36472 40245 44947 -18827 -86469 -117237 -194818 -152162
10755 -152162 -87040 -96270 -162493 -104586 -62421 23002 56829 -33367 -48172 24802 18436 817
10743 817 100947 45420 93571 185492 129284 50473 -14450 -45007 -46027 16035 72849 61095
10731 61095 66277 66827 18479 25191 16098 16761 110765 11578 -66809 -89913 -50572 -16267 -63712
10718 -63712 -92642 -124373 90334 165385 79525 132726 56382 -44714 3997 44374 86843
10707 86843 -3584 -75973 -83453 -76364 -100582 45370 56906 32318 19966 20328 41299 74129
10695 74129 3081 56787 35777 62037 16021 -88936 -122507 -40973 33593 175560 247130
10684 247130 223385 138912 170662 105806 46151 41709 70042 81478 126483 35876 -29770 -6138
10672 -6138 108385 233430 200590 132692 20862 -96055 -124669 -18564 55289 -44810 -142874
10661 -142874 -68440 -161526 -292120 -309916 -107371 97066 166146 184916 63195 -34971 -41104
10650 -41104 76446 58218 -64262 -96647 -125619 -99236 -113917 -116448 -171910 -114565 38728
10639 38728 -31259 -16317 -46970 2665 45092 -42544 -70880 41058 115501 -29883 -44477
10628 -44477 -53551 -113837 -30726 -27336 -103759 -150713 -199636 -106887 -146886 -149693 -104415 -101660
10616 -101660 -20769 -82401 -92630 -116192 -111027 -120284 -22896 24425 -103278 -93466 46156 102375
10604 102375 40268 33211 134853 135000 -9694 -117360 -34317 -35276 -168205 -103766 -7917 113441
10592 113441 259875 218615 91596 -11566 20033 152201 151840 -18887 -45672 143186 177605
10581 177605 100396 20416 -30529 9249 29722 49959 31728 -71613 -160062 55277 120063
10570 120063 47314 11445 27423 -36567 -68024 -38736 -58047 71931 25926 -56319 -208427
10559 -208427 -181701 -95812 -66447 -70583 28351 18051 46059 102512 44683 45357 44054 4581
10547 4581 -41900 -71929 -129681 -79912 15143 64480 98056 104717 86597 113005 24683 -82350
10535 -82350 -92240 -80805 7202 157783 40349 -98285 -148307 -77980 -80407 -130278 -62069
10524 -62069 22189 -19877 -80845 -33405 195 105052 19823 -1269 24922 74381 157993
10513 157993 45360 -28507 34594 67569 7996 -24603 -70597 -104519 -185334 -233673 -179637
10502 -179637 -36334 -38056 -30281 -55743 -81767 -129101 -67722 -3082 143048 110576 9813
10491 9813 -6765 -4533 -48410 7933 73554 74677 74748 156280 88794 109475 58825 98983 23795
10478 23795 -32662 -57708 -81228 7348 -39424 -140992 -113779 -41558 19639 -41015 -70809
10467 -70809 -104255 56720 36332 11677 -5650 23413 6687 -43681 30654 49435 79634
10456 79634 20432 -44078 640 -60650 10588 70758 117774 124751 -39934 -88545 19494
10445 19494 24716 -41121 -17256 51084 77664 108382 57646 -46012 -40004 -97582 -52873 -114795
10433 -114795 -106430 -35161 -149001 -177213 -91975 -93310 -29258 116135 71925 -63589 -56826
10422 -56826 -5644 -102307 528 -27236 -99476 1351 -7114 32945 79611 97243 125957
10411 125957 20785 -92491 -75857 -43624 -91540 -70303 -144052 -138055 26658 -19579 3952
10400 3952 -44133 -162253 -179148 -93886 -70158 -72774 -210501 -273290 -248645 -210396 -213155 -297199
10388 -297199 -279735 -174111 -136863 -101401 -36434 25387 -7131 31578 57607 115874 24273
10377 24273 -79774 -18144 171119 250619 213745 164952 71500 68977 189909 227424 169738
10366 169738 21520 -14675 80584 50227 58223 111755 63290 88764 115668 95031 31132
10355 31132 -6352 52946 79387 57176 41893 21260 21436 73951 54382 33682 21619 -11712
10343 -11712 -55107 45158 73266 5913 -114650 -83724 -22434 71497 114505 135820 53528
10332 53528 -21539 -127954 -91338 14646 65899 -30201 -16674 47320 -10219 92757 47307
10321 47307 86036 45958 -96887 -131346 -21236 -13556 57296 75202 95409 48789 27486
10310 27486 33396 -24185 -64277 -162306 -82207 -34117 -53999 -52209 -41911 -48340 -36275 -41643
10298 -41643 -123960 -176982 -135132 -86442 -59059 -91935 -85296 -35040 82691 105456 87586 -48378
10286 -48378 -65337 -180575 -185582 -118133 -10254 -14453 -28971 -101828 -185749 -222190 -158437 21660
10274 21660 130508 92035 100187 54459 62926 119382 109657 55485 96714 62573 28183 -5617
10262 -5617 12256 -33591 -21013 -19899 -28879 27317 47916 -28865 -155401 -109392 -86953 -169459
10250 -169459 -160721 -962 18211 -195032 -237536 -207589 -122813 -172518 -120959 -142752 -191929
10239 -191929 -178971 -104252 -48392 41314 100368 81087 30300 -46471 -73041 -16204 116962
10228 116962 88178 20041 52441 -22445 -102026 -129114 -149856 -131437 -136878 2385 191850
10217 191850 97436 19197 -42503 -93226 -9296 138077 183880 154188 46793 -38097 -22380
10206 -22380 58083 5888 -104153 -39874 -49808 -53606 18750 19364 56771 92222 47439 -83952
10194 -83952 -82106 -190271 -172296 -137865 -224056 -200856 -154878 -172965 -88558 29355 87679
10183 87679 39286 46210 144549 39709 61206 121631 -12263 -6348 -108931 -61919 18136
10172 18136 14140 -142880 -192909 -56355 40001 95417 -10290 84837 180938 167343 206642
10161 206642 153643 224491 202531 80627 -57873 -29264 74515 19289 -21663 -52846 -99700
10150 -99700 -151704 -168934 -153580 -60438 -66466 -19228 33127 -67346 -76464 -52109 -15283 39373
10138 39373 40245 -14562 -76194 -93302 -223803 -130662 -24805 12324 8678 -32417 10544 30479
10126 30479 -22290 59240 115686 83328 161192 166858 5296 -113492 -102620 -100158 -8905 12279
10114 12279 -85543 -113681 -75462 63810 172987 235480 210318 149143 131543 14620 -40331
10103 -40331 97979 82149 6962 -31804 -39118 -26794 34922 162797 105422 99064 200054
10092 200054 256425 208226 271348 281941 258310 55439 -96566 -4267 -118031 -138896 -11848
10081 -11848 101334 156640 192317 232078 88995 -20804 -148849 -197586 -203478 -51882 -85362
10070 -85362 -273324 -197960 -162507 -213319 -214400 -280298 -286421 -132418 -165127 -212262 -9530
10059 -9530 25775 13293 22586 52637 132402 275367 398352 518233 596118 538673 499465
10048 499465 318319 208321 252155 221301 36737 -204831 -328130 -241917 -150526 191
10038 191 87308 133431 103187 191515 185373 52479 91875 153791 152163 159529 -9727 4763
10026 4763 119043 168376 191458 146047 112023 78190 8890 -62078 -19356 -114677 -140885 -36269
10014 -36269 33774 5754 91562 219828 197758 138415 60339 -60824 -148426 -86413 -43519
10003 -43519 -69331 -140981 -246297 -191608 -154904 -147872 -107469 -141480 -151514 -93155 -74490 -72246
9991 -72246 -4366 -82191 -171002 -120649 -34039 65624 12343 67236 8821 -82928 -196014 -135411
9979 -135411 -58196 -71459 -123636 -66329 -15291 43047 -109039 -159138 -156952 -32066 -128580
9968 -128580 -205291 -10575 203406 149740 95511 137097 149977 155318 223280 142941 154430
9957 154430 305361 319062 442542 574098 568236 475050 461204 453790 486209 543919 464258
9946 464258 358507 383708 236407 123341 125502 232782 212257 150146 74471 31927 55956
9935 55956 56950 30612 33894 36429 6581 -34249 58461 149750 139440 34977 -16566 72475
9923 72475 110271 260280 262449 332285 314415 247737 193932 179921 187432 196801 224040 129237
9911 129237 37663 -36534 20405 117503 67603 96221 91165 100059 115532 187837 155212 92758
9899 92758 56660 174927 303666 361314 330964 244493 139418 110607 160153 109869 103097
9888 103097 132856 138929 185677 292248 301220 236437 113768 137944 220883 111583 226917
9877 226917 158941 267706 268554 159604 120349 115603 64687 -47850 -103705 -71819 -63959 128578
9865 128578 139516 29806 -42590 19793 9315 -37145 185284 288353 234309 164158 263877
9854 263877 361909 412366 593147 767938 1012251 1018059 916216 731314 573098 489106 483738
9843 483738 501507 396775 285581 176442 89653 104902 122874 62533 -69350 -130201 -56162
9832 -56162 62439 133848 -21004 -93304 -89484 -64644 -18473 187934 118067 51895 -33298
9821 -33298 57694 171874 144565 -2629 -21235 69850 -31163 -54155 -78369 -68105 48877
9810 48877 154806 168016 86043 -92883 11887 40723 91236 209009 175702 140004 45318
9799 45318 -57713 -99038 -53914 6167 129560 239606 200300 140156 28598 119306 157424
9788 157424 120973 138623 179053 160975 40837 137709 243595 237980 169156 140385 259553
9777 259553 255942 135422 163711 84398 161847 222582 190483 241554 250876 142240 49289 33898
9765 33898 43517 -14556 -60819 14459 -23422 -29525 38021 -23473 -57908 -93225 -127664 -141177
9753 -141177 -76750 -97320 38597 111332 154868 80586 153339 218837 121013 25433 58274
9742 58274 91403 68706 136660 155921 175485 119296 46669 104565 69347 41038 -31679 133425
9730 133425 358035 473562 436735 402121 388175 478979 612544 576548 457069 457999 495952
9719 495952 523410 399462 259627 228174 148125 22742 -20129 -73291 -54431 29117 125091
9708 125091 187312 150913 50341 80280 113554 125079 98283 12061 -63300 19657 129607
9697 129607 126093 57222 -81826 22911 622 -97054 -96463 31828 174118 207003 138005
9686 138005 135765 89753 -42192 -115798 -106077 47120 100534 -13388 81600 150782 228925
9675 228925 320880 211795 198639 188416 209047 161021 143067 97054 -10788 -74283 -23468
9664 -23468 91714 121119 164195 198191 107371 -72554 -81975 7457 61319 35124 -53443 -44213
9652 -44213 10023 -10181 -4935 9227 113458 115099 140228 108364 12588 108909 149092 125868
9640 125868 100341 149625 199442 218135 154816 77397 34209 61309 40083 -47581 -29431 42012
9628 42012 45414 8599 116218 162008 141289 162093 134454 164980 176058 22197 -67616 38543
9616 38543 36836 -113268 -33157 -56620 -120671 -123389 -57092 -33801 -145685 -93968 39161 67092
9604 67092 27786 17882 -3940 -13686 112316 98123 70439 16185 87739 29465 44033 114607
9592 114607 50901 21669 199243 149890 75488 66826 10056 126472 173707 111848 65356
9581 65356 -12074 45875 67101 -83019 -114154 -74044 -41994 3197 100390 133661 231454 191253
9569 191253 163480 160894 120314 144183 91558 56949 58017 139978 122248 74732 36868 161050
9557 161050 156257 198894 254129 350534 358755 201903 -955 12789 96285 163557 184577 262900
9545 262900 282781 170637 78712 35018 96913 104383 -64998 -9002 93818 90742 84371 138547
9533 138547 148110 194648 221677 159878 78653 97586 155539 75580 17600 25948 66456 49235
9521 49235 38114 99311 126100 169545 144391 104529 74538 146189 66871 -84491 -84872 100647
9509 100647 201658 205417 213105 241315 328337 334431 214963 198199 308641 321305 342574 331503
9497 331503 325404 278662 200861 135693 102821 88385 103874 119465 73802 -21238 -45305 144883
9485 144883 228967 172144 231642 311966 313680 225824 111108 148622 191933 211462 216883 257111
9473 257111 291404 309272 325835 319775 310417 309934 335504 320967 348534 336573 214776 213627
9461 213627 239425 213961 283989 103618 31411 177638 269907 194463 173438 295482 358878
9450 358878 311515 306994 225333 116586 202913 345359 306825 186049 78067 93738 79440
9439 79440 202901 283481 343633 356375 178401 62905 91251 108359 187104 282409 426714
9428 426714 383893 452542 551188 492068 426581 250642 149186 180959 163830 148976 49360
9417 49360 -71409 64224 146524 207894 303892 407421 474697 493158 399471 502151 474757
9406 474757 365265 250212 242013 175895 56184 -68143 1946 122212 143684 187408 171116
9395 171116 187093 186414 195266 291382 331161 247941 195484 289944 341066 388426 483293 535384
9383 535384 602227 562565 466363 348208 340154 491052 607760 648126 563205 433825 478737
9372 478737 559526 578949 503791 441504 380739 322271 418394 486751 389269 395087 394112 474609
9360 474609 548845 558255 412439 323882 294032 373948 452947 606325 537671 449458 570349
9349 570349 791699 792825 703429 631869 650144 545938 498836 528951 485380 617689 777811
9338 777811 838990 820731 766018 634995 573424 642611 708970 744640 704523 855693 805113
9327 805113 708385 692680 705368 756343 725581 696243 773353 791771 817529 861039 811806 818206
9315 818206 765701 844968 870251 866750 882297 900291 877268 922758 1122647 1176863 1115000 1141058
9303 1141058 1260958 1417129 1347155 1205241 1197394 1225614 1184857 1254903 1181697 1208815 1238706
9292 1238706 1257549 1239527 1345598 1397994 1453991 1475584 1509312 1549389 1602904 1594691 1741950
9281 1741950 1820169 1748878 1727691 1821322 1933719 1884640 1911700 1920426 1866526 1865327 1897769 1829552
9269 1829552 1850695 2028160 2098359 2096099 2206325 2341892 2284656 2196948 2234190 2314955 2312204
9258 2312204 2344235 2405720 2581869 2720033 2698938 2589271 2561814 2645063 2764165 2826987 2834242
9247 2834242 2817257 2848761 2851817 2936498 3052514 3244090 3295555 3371545 3412457 3407296 3420673
9236 3420673 3551585 3636495 3708473 3776095 3713480 3752565 3772134 3815234 3811127 3885887 4059737
9225 4059737 4102771 4241318 4321367 4228106 4213986 4286196 4349730 4381041 4503721 4491073 4614441
9214 4614441 4763049 4817510 4856242 4925785 5055716 5241401 5405888 5489233 5496730 5538341 5558477
9203 5558477 5688581 5795942 5892967 5966358 6023092 6012777 6094620 6195096 6247020 6309865 6462028
9192 6462028 6604606 6744554 6876408 6788120 6828033 6929313 6984033 7069667 7111057 7211907
9182 7211907 7342775 7536089 7677938 7768217 7874818 8067108 8267375 8248189 8237193 8361236
9172 8361236 8435559 8562960 8649521 8839633 8944221 9041160 9239883 9363098 9581666 9809516
9162 9809516 9999792 10050814 10192865 10288120 10518645 10631375 10697283 10876183 11123453 11200853
9152 11200853 11330649 11618117 11908866 11963526 12095873 12341822 12500123 12621302 12741390 13086272
9142 13086272 13468387 13785417 14139633 14517059 14609181 14611874 14763895 15138073 15417193 15707110
9132 15707110 15984696 16372188 16812180 17158984 17310694 17479458 17771060 18191024 18445055
9123 18445055 18689814 19000892 19305272 19639822 19931280 20277544 20728791 21145375 21532383
9114 21532383 21905631 22320591 22644219 22853677 23248532 23720541 23919099 24126158 24446405
9105 24446405 24873913 25178298 25442854 25823450 26027751 26217621 26497309 26751881 26958085
9096 26958085 27188573 27324573 27356271 27443731 27483093 27446368 27318987 27249813 27098248 27078509
9086 27078509 26936755 26641265 26475101 26250148 26060740 25772836 25419448 25076344 24756240
9077 24756240 24440892 24064026 23641566 23226276 22737508 22347914 21929008 21477930 21102421
9068 21102421 20673191 20198546 19711803 19292091 18818008 18358120 17934897 17432761 16934925
9059 16934925 16547089 16108552 15719507 15404226 15079869 14675981 14290267 13918706 13541441
9050 13541441 13224894 12767653 12469380 12218677 11875361 11617633 11306638 10964099 10622156
9041 10622156 10178733 9934595 9805425 9556156 9302717 8989236 8612150 8373779 8299046 8099113
9031 8099113 7785322 7649190 7585348 7465050 7374925 7205157 7023329 6794633 6614047 6432246
9021 6432246 6178407 6027474 5915305 5733518 5576995 5518635 5431438 5278534 5104348 4939415
9011 4939415 4910448 4887444 4703663 4525094 4466134 4421542 4445043 4356810 4217471 4044438 3944696
9000 3944696 3895761 3733796 3773760 3893021 3808794 3589459 3507471 3439081 3385419 3335666 3178014
8989 3178014 3219313 3236782 3143142 3028034 3052834 3048262 2972633 2918308 2765766 2748656 2675642
8978 2675642 2562113 2491836 2466192 2446557 2310387 2166939 2189363 2327426 2451418 2419835
8968 2419835 2277970 2234161 2088610 1985964 1980593 2089616 2109116 1967194 2006399 2077971 2000705
8957 2000705 1833557 1771740 1791288 1677833 1695042 1785621 1777257 1690723 1782349 1766081 1676673
8946 1676673 1629643 1617526 1658406 1652872 1642051 1558536 1572400 1476234 1458499 1540299 1490774 1407006
8934 1407006 1323379 1281781 1139464 1026800 1148592 1218106 1283235 1392350 1389989 1329078 1337635
8923 1337635 1290176 1301362 1384312 1350511 1254619 1179089 1159747 1192916 1023342 883422 818941
8912 818941 881849 1021354 1106479 1054695 984047 1023349 1109954 1058476 1067656 1042012 1020884 1081233
8900 1081233 1123594 1101297 1104312 1074481 964042 801243 892123 997640 998367 978036 961712
8889 961712 1017207 1162677 1217432 1169277 1052904 984660 1024608 1243264 1291979 1340048 1475675
8878 1475675 1509437 1509966 1655303 1831211 1963579 2271267 2790089 3550103 4695761 6698373
8868 6698373 9745687 13587154 16194774 15429020 12711340 9565832 6914423 5060233
8860 5060233 3995246 3241776 2700296 2391113 2195794 1861649 1546139 1392745 1383098 1395663
8850 1395663 1479182 1417277 1277970 1268468 1276751 1266219 1280953 1189188 1061890 985102 912376
8839 912376 924198 900321 786410 689912 636236 625640 647515 762181 859267 824664 661487
8828 661487 486341 524844 520999 479000 537166 583506 601403 517098 486703 575918 565446 565913
8816 565913 513506 488147 537703 572991 449803 464277 481065 453210 535292 551436 593616
8805 593616 503336 346132 386883 486284 591486 538316 476856 452421 378687 343236 380953
8794 380953 443789 515736 524928 506360 398008 297178 329022 488054 562546 588498 565269
8783 565269 462211 439817 393914 294562 430016 515176 482741 453531 321633 272162 312410
8772 312410 318176 283948 269941 177020 294786 384153 416007 391528 364964 404775 454186 428024
8760 428024 338410 384243 338927 332555 303288 299220 266393 292897 306836 336576 330467 201741
8748 201741 216901 292784 337916 347767 266332 267760 385005 365286 355291 300311 297184 288245
8736 288245 165587 179563 299320 407533 474328 526663 577687 475828 442104 435944 471874
8725 471874 463706 470795 425330 320458 440408 493001 540318 435240 406381 401626 436568 403042
8713 403042 408506 301978 269840 243124 169898 209439 314222 297443 345429 545444 643537
8702 643537 512305 334773 203797 197672 123806 271103 260634 347601 401498 354304 401922
8691 401922 281700 297586 349204 308646 328782 300725 153873 107130 210918 284235 149838
8680 149838 165628 247303 231375 193462 215900 100119 73876 86761 70836 124957 227030
8669 227030 264428 356223 364869 376405 207509 269187 366605 399257 482756 578776 543026 436818
8657 436818 389730 296229 348071 483988 456206 410384 548094 614243 658534 620611 555933
8646 555933 426554 289777 164313 135683 214971 291000 379707 387159 340612 346697 273564
8635 273564 228279 323347 338263 248994 202981 239100 284602 339911 449709 417451 473168
8624 473168 501394 467563 549777 621891 625190 544917 463482 413716 464704 571289 605881 654412
8612 654412 543741 480340 507449 639506 556879 502745 602454 652131 810885 919128 1001952
8601 1001952 870840 711499 683789 644751 568393 524809 577843 519174 388766 337273 313472
8590 313472 326767 409546 456852 338740 218791 358624 404846 339776 351854 404547 229107
$$ [...]
##END NTUPLES=NMR SPECTRUM
##END=
