##TITLE=Analysis number 330090
Compound Code cc 66901
Book Reference 510/94
Project Code adrs
Chemist Name jimp
##JCAMPDX= 6.0         $$ Bruker NMR JCAMP-DX V2.0
##DATA TYPE= NMR SPECTRUM
##DATA CLASS= NTUPLES
##ORIGIN= Bruker BioSpin GmbH
##OWNER= nmr
$$ XWIN-NMR		Version 3.5
$$ Thu Oct 25 11:28:09 2007 GMT Daylight Time (UT+1h)  MAYBRIDGE\nmr@NMR_250MHZ
##.OBSERVE FREQUENCY= 250.131544655141
##.OBSERVE NUCLEUS= ^1H
##.ACQUISITION MODE= SIMULTANEOUS (DQD)
##.ACQUISITION SCHEME= undefined
##.AVERAGES= 16
##.DIGITISER RES= 18
##SPECTROMETER/DATA SYSTEM= dpx250
##.PULSE SEQUENCE= zg30
##.SOLVENT NAME= DMSO
##.SHIFT REFERENCE= (INTERNAL, DMSO, 0, 16.522)
##AUDIT TRAIL= $$ (NUMBER, WHEN, WHO, WHERE, WHAT)
$$ ##TITLE= Audit trail, XWIN-NMR		Version 3.5
$$ ##JCAMPDX= 5.01
$$ ##ORIGIN= Bruker BioSpin GmbH
$$ ##OWNER= nmr
$$ C:\u/data/dgb/nmr/ADRS/1360/pdata/1/auditp.txt
$$ ##AUDIT TRAIL=  $$ (NUMBER, WHEN, WHO, WHERE, WHAT)
(   1,<2007-10-25 11:27:46.43 +100>,<MAYBRIDGE\nmr>,<NMR_250MHZ>,
      <created by zg, POWCHK disabled, PULCHK disabled
       configuration hash MD5:
       76 6E 9A 78 1E 09 19 81 EC 84 63 8F B0 6A 59 2D
       data hash MD5: 64K
       3B B6 36 05 55 28 58 1C E4 82 F5 E4 8C D8 5E 83>)
(   2,<2007-10-25 11:27:58.44 +100>,<MAYBRIDGE\nmr>,<NMR_250MHZ>,
      <Start of raw data processing
       ef LB = 0.3 FT_mod = 6 PKNL = 1 SI = 32K 
       data hash MD5: 32K
       C1 EA CC 2E A4 8F 7F 74 CA 62 07 D5 0A 05 17 64>)
(   3,<2007-10-25 11:28:00.24 +100>,<MAYBRIDGE\nmr>,<NMR_250MHZ>,
      <apk 
       data hash MD5: 32K
       D1 6F 95 E1 32 69 75 B1 E9 48 33 25 09 C2 DC 33>)
(   4,<2007-10-25 11:28:01.11 +100>,<MAYBRIDGE\nmr>,<NMR_250MHZ>,
      <abs ABSG = 5 
       data hash MD5: 32K
       B0 BE 9B 86 1A A9 EA B2 5D 8F 75 74 8F B7 83 ED>)
$$ ##END=
$$ 
$$ hash MD5
$$ 6C 3B 89 07 33 66 F4 79 BA 18 25 5A 29 35 01 65
##$RELAX= 
##$RELAX= 
##$RELAX= 
##$RELAX= 
##$RELAX= 
##$RELAX= 
##$RELAX= 
$$ Bruker specific parameters
$$ --------------------------
##$DU= <C:\u>
##$EXPNO= 1360
##$NAME= <ADRS>
##$PROCNO= 1
##$TYPE= <nmr>
##$USER= <dgb>
##$AMP= (0..31)
100 100 100 100 100 100 100 100 100 100 100 100 100 100 100 100 100 100 
100 100 100 100 100 100 100 100 100 100 100 100 100 100 
##$AQSEQ= 0
##$AQ_mod= 3
##$AUNM= <au_zg>
##$AUTOPOS= <21 >
##$BF1= 250.13
##$BF2= 250.13
##$BF3= 250.13
##$BF4= 250.13
##$BF5= 500.13
##$BF6= 500.13
##$BF7= 500.13
##$BF8= 500.13
##$BYTORDA= 1
##$CFDGTYP= 0
##$CFRGTYP= 5
##$CHEMSTR= <none>
##$CNST= (0..31)
1 1 145 1 1 1 1 1 1 1 1 1 1 1 1 1 1 1 1 1 1 1 1 1 1 1 1 1 1 1 1 1 
##$CPDPRG= <>
##$CPDPRG1= <>
##$CPDPRG2= <>
##$CPDPRG3= <>
##$CPDPRG4= <mlev>
##$CPDPRG5= <mlev>
##$CPDPRG6= <mlev>
##$CPDPRG7= <mlev>
##$CPDPRG8= <mlev>
##$CPDPRGB= <>
##$CPDPRGT= <>
##$D= (0..31)
0 1 0 0 0 0 0 0 0 0.06 0 0 0 0 0 0 0.0002 0 0 0 0 0 0 0 0 0 0 0 0 0 0 
0 
##$DATE= 1193308064
##$DBL= (0..7)
120 120 120 120 120 120 120 120 
##$DBP= (0..7)
150 150 150 150 150 150 150 150 
##$DBP07= 0
##$DBPNAM0= <>
##$DBPNAM1= <>
$$ [...]
##$SUBNAM6= <"">
##$SUBNAM7= <"">
##$SUBNAM8= <"">
##$SUBNAM9= <"">
##$SW= 20.6930455092707
##$SWIBOX= (0..15)
0 0 3 0 0 0 0 0 0 0 0 0 0 0 0 0 
##$SW_h= 5175.983436853
##$TD= 65536
##$TD0= 1
##$TE= 295.16
##$TE2= 300
##$TE3= 300
##$TEG= 300
##$TL= (0..7)
0 120 120 120 120 120 120 120 
##$TP= (0..7)
150 150 150 150 150 150 150 150 
##$TP07= 0
##$TPNAME0= <>
##$TPNAME1= <>
##$TPNAME2= <>
##$TPNAME3= <>
##$TPNAME4= <>
##$TPNAME5= <>
##$TPNAME6= <>
##$TPNAME7= <>
##$TPOAL= (0..7)
0.5 0.5 0.5 0.5 0.5 0.5 0.5 0.5 
##$TPOFFS= (0..7)
0 0 0 0 0 0 0 0 
##$TUNHIN= 0
##$TUNHOUT= 0
##$TUNXOUT= 0
##$USERA1= <user>
##$USERA2= <user>
##$USERA3= <user>
##$USERA4= <user>
##$USERA5= <user>
##$V9= 5
##$VALIST= <valist>
##$VCLIST= <CCCCCCCCCCCCCCC>
##$VD= 0
##$VDLIST= <DDDDDDDDDDDDDDD>
##$VPLIST= <PPPPPPPPPPPPPPP>
##$VTLIST= <TTTTTTTTTTTTTTT>
##$WBST= 1024
##$WBSW= 4
##$XGAIN= (0..3)
0 0 0 0 
##$XL= 0
##$YL= 0
##$YMAX_a= 238211
##$YMIN_a= -400780
##$ZGOPTNS= <>
##$ZL1= 120
##$ZL2= 120
##$ZL3= 120
##$ZL4= 120
##$ABSF1= 16.522
##$ABSF2= -4.171173
##$ABSG= 5
##$ABSL= 3
##$ALPHA= 0
##$AQORDER= 0
##$ASSFAC= 0
##$ASSFACI= 0
##$ASSFACX= 0
##$ASSWID= 0
##$AUNMP= <proc_1d>
##$AZFE= 0.1
##$AZFW= 0.1
##$BCFW= 0
##$BC_mod= 0
##$BYTORDP= 0
##$COROFFS= 0
##$CY= 12.5
##$DATMOD= 1
##$DC= 0
##$DFILT= <>
##$DTYPP= 0
##$F1P= 14.0000005364418
##$F2P= -0.99999901652339
##$FCOR= 0.5
##$FTSIZE= 32768
##$FT_mod= 6
##$GAMMA= 0
##$GB= 0
##$INTBC= 1
##$INTSCL= 1
##$ISEN= 128
##$LB= 0.3
##$LEV0= 0
##$LPBIN= 0
##$MAXI= 10000
##$MC2= 0
##$MEAN= 0
##$ME_mod= 0
##$MI= 0
##$NCOEF= 0
##$NC_proc= -3
##$NLEV= 6
##$NOISF1= 0
##$NOISF2= 0
##$NSP= 0
##$NTH_PI= 0
##$NZP= 0
##$OFFSET= 16.522
##$PC= 1
##$PHC0= 149.656
##$PHC1= 4.371531
##$PH_mod= 1
##$PKNL= yes
##$PPARMOD= 0
##$PSCAL= 4
##$PSIGN= 0
##$REVERSE= no
##$SF= 250.13
##$SI= 32768
##$SIGF1= 0
##$SIGF2= 0
##$SINO= 400
##$SIOLD= 32768
##$SREGLST= <1H.DMSO>
##$SSB= 0
##$STSI= 32768
##$STSR= 0
##$SW_p= 5175.98343685301
##$SYMM= 0
##$S_DEV= 0
##$TDeff= 65536
##$TDoff= 0
##$TI= <Analysis number 999999
Compound Code 99
Book Reference 9
Project Code 9>
##$TILT= no
##$TM1= 0
##$TM2= 0
##$TOPLEV= 0
##$USERP1= <user>
##$USERP2= <user>
##$USERP3= <user>
##$USERP4= <user>
##$USERP5= <user>
##$WDW= 1
##$XDIM= 32768
##$YMAX_p= 354250120
##$YMIN_p= -190037
$$ End of Bruker specific parameters
$$ ---------------------------------
##NTUPLES= NMR SPECTRUM
##VAR_NAME=  FREQUENCY,     SPECTRUM/REAL,   SPECTRUM/IMAG
##SYMBOL=    X,             R,               I
##VAR_TYPE=  INDEPENDENT,   DEPENDENT,       DEPENDENT
##VAR_FORM=  AFFN,          ASDF,            ASDF
##VAR_DIM=   32768,         32768,           32768
##UNITS=     HZ,            ARBITRARY UNITS, ARBITRARY UNITS
##FACTOR=    0.157963299565203, 1,           1
##FIRST=     4132.6476996994, 0,             0
##LAST=      -1043.33573715361, 0,           0
##MIN=       -1043.33573715361, -190037,     0
##MAX=       4132.6476996994, 354250120,     0
$$ Real data points
##PAGE= N=1
##DATA TABLE= (X++(R..R)), XYDATA
$$ [...]
18543C771720m72106k98634k26959j79089j52221q4343j7849j141k5800L030J7413
$$ 3771720 3299614 3000980 2774021 2594932 2442711 2358368 2340519 2339378 2313578 2316608 2334021
18532B334021j16K4174K1554P2695J18406J43650J61910K65189M47847O65425
$$ 2334021 2333905 2358079 2379633 2452328 2570734 2714384 2876294 3141483 3589330 4254755
18522D254755R60291J408263K178568L393690N249461O972482O527738M477930
$$ 4254755 5215046 6623309 8801877 12195567 17445028 24417510 30945248 35423178
18514C5423178K333507j352090l565122k679521n76136J880250K353171J174215
$$ 35423178 37756685 36404595 32839473 30159952 29583816 31464066 33817237 34991452
18506C4991452o48267m011289o010841n867920n090309l839175k461616j598402
$$ 34991452 34343185 30331896 24321055 18453135 13362826 9523651 7062035 5463633
18498E463633j103088q24402n82736m26930l38288k42157j65531j32904o8763
$$ 5463633 4360545 3536143 2953407 2526477 2188189 1946032 1780501 1647597 1578834
18489A578834j7695p9602j06830j24186j52848n1758m6496l0675n3347k5545n6748
$$ 1578834 1561139 1481537 1374707 1250521 1097673 1045915 999419 968744 915397 889852 833104
18478H33104p7586n1062q2162o8635l5496l9077o2607n6739J7939K921m3948l4582
$$ 833104 755518 704456 622294 553659 518163 479086 416479 359740 377679 380600 336652 302070
18466C02070j7116Q632j9773l1943o365l673N520K1253j0430j1010j0320k4660
$$ 302070 284954 293586 273813 241870 235505 231832 237352 258605 248175 237165 226845 202185
18454B02185l015j0649k2671J600J3313l602J6164P258k0857j8684K4788j0096
$$ 202185 199170 188521 165850 167450 180763 177161 193325 200583 179726 161042 185830 175734
18442A75734m8583J04J7819j8480k6284K8431N728R905p719m2609J916j2948J6565
$$ 175734 127151 127255 145074 126594 100310 128741 134469 144374 136655 94046 95962 83014 99579
18429I9579K8893M4658J6286j0325k2519j0095k3264j276M907J1143M6947K3601
$$ 99579 128472 173130 189416 179091 156572 146477 123213 121937 126844 137987 184934 208535
18417B08535K6935L6516J6672P995j5100r796P742K2226J7505p460q197l5557
$$ 208535 235470 271986 288658 296653 281553 271757 279499 301725 319230 311770 303573 268016
18405B68016K108l709k4141l227k571l5603j3828O212K588K2332K5185k3809l9395
$$ 268016 270124 266415 242274 239047 236476 200873 187045 193257 195845 218177 243362 219553 180158
18392A80158J5770K9065k139l962J487j6015J126K8421M2524O274J5335O666K9088
$$ 180158 195928 224993 222854 218892 220379 204364 205490 233911 276435 282709 298044 304710 333798
18379C33798J2502K2794K3131n121j1415l4684j7970m970j670P545N585K2896
$$ 333798 346300 369094 392225 387104 375689 341005 323035 318065 316395 323940 329525 352421
18367C52421L5036O1097M3891N7483N5532j3590l3599j2664K7543K1967M5622
$$ 352421 387457 448554 492445 549928 605460 591870 558271 545607 573150 595117 640739
18356F40739L1810L2511P9187P2268L9923J16366J08596R1094J01072R5737P6935
$$ 640739 672549 705060 784247 856515 896438 1012804 1121400 1212494 1313566 1409303 1486238
18345A486238N4977P5539L5236K7366L8746J16309J82712K16868K91369L85039
$$ 1486238 1541215 1616754 1651990 1679356 1718102 1834411 2017123 2233991 2525360 2910399
18335B910399N21988O90829R15620J272216J765152K568203L793602N564501P714521
$$ 2910399 3432387 4123216 5038836 6311052 8076204 10644407 14438009 20002510 27717031
18326B7717031R225354Q986012O669441K599032k186817o195156q479446q590773
$$ 27717031 36942385 45928397 52597838 55196870 53010053 46814897 38335451 29744678
18318B9744678p294269n455619l670567k271161j265977m38569K66242J026052
$$ 29744678 22450409 16994790 13324223 11053062 9787085 9348516 9614758 10640810
18310A0640810K023882L445584N394999P630448R203665R051366O798512K587445
$$ 10640810 12664692 16110276 21505275 29135723 38339388 47390754 54189266 56776711
18302E6776711k305662o466418q917701r085549p806090o024200m273205k867885
$$ 56776711 54471049 48004631 39086930 30001381 22195291 16171091 11897886 9030001
18294I030001j985691j422474j016363p32157n57974m26013l36232k59267j80866
$$ 9030001 7044310 5621836 4605473 3873316 3315342 2889329 2553097 2293830 2112964
18285B112964j14952p5127k4248k3305n5928o3036r9691r6767r8042q6011q8054
$$ 2112964 1998012 1922885 1898637 1875332 1819404 1756368 1656677 1559910 1461868 1375857 1287803
18274A287803q3245p8719l2158N2526J05905N6733p6599j41976k02954k04375
$$ 1287803 1204558 1125839 1093681 1146207 1252112 1308845 1232246 1090270 887316 682941
18264F82941j26591l5541m4874m1505l2323j2990k8805j1128J6102j8155k5662
$$ 682941 556350 520809 475935 434430 402107 389117 360312 349184 365286 347131 321469
18253C21469j2110r729k0513J2475q023J4505j3215k355m2264m2126j1124K783
$$ 321469 309359 299630 279117 291592 283569 298074 284859 282504 240240 198114 186990 189773
18241A89773J5109q280n286k2346n0793m0371j3904J4274L1287J8862j1204j9391
$$ 189773 204882 196602 191316 168970 118177 77806 63902 78176 109463 128325 117121 97730
18229I7730j7791J4194J4502j4902L718M326l2109K3794j6654O267J3231k9570
$$ 97730 79939 94133 108635 93733 97451 101777 69668 93462 76808 83075 96306 66736
18217F6736p995J3047J7897K4389M782j4127J1406q3m028o82J2796k8685k7603
$$ 66736 58741 71788 89685 114074 118856 104729 116135 116052 112024 111342 124138 95453 67850
18204F7850r974k6788J8785L0773m5403m2939J5443M5704N7585j7321J29o600
$$ 67850 57876 31088 49873 80646 35243 -7696 7747 53451 111036 93715 93844 87244
18192H7244m146K133n3730J069L9466k489j0152l6012k615K482J7659J7025l320
$$ 87244 83098 85231 31501 32570 72036 69547 59395 23383 20768 23250 40909 57934 54614
18179E4614M3775K2449J2758m3907l8666J1430j383M139M1998m3903l9620K7172
$$ 54614 98389 120838 133596 89689 51023 62453 61070 65209 107207 63304 23684 50856
18167E0856Q923k5645L5120l673k618L0509j226k1282r019L5528J8367k6243j6142
$$ 50856 59779 34134 69254 65581 62963 93472 92246 70964 61945 97473 115840 89597 73455
18154G3455L1712K2627l6659o5767n2685M9292N4526p802N185N25J69N597n2599
$$ 73455 105167 127794 91135 25368 -27317 21975 76501 68699 73884 74409 74578 80175 27576
18141B7576P649N6895j5296m9822k947j2515K1520R558n725K791J4034m804r590
$$ 27576 35225 92120 76824 27002 24055 11540 33060 42618 36893 39684 53718 48914 39324
18128C9324q243K8765K8762p359l145J2163r866l6908J5313O0467K9547J2061
$$ 39324 31081 59846 88608 81249 78104 90267 80401 43493 58806 119273 148820 160881
18116A60881p183k9071l778j2161r684p093J8973K1026P55m7981k0850l0174m0692
$$ 160881 153698 124627 120849 108688 99004 91911 110884 131910 132665 84684 63834 33660 -7032
18103g032R564J9511Q238j767K4270k258p046q628j010J481M073M078j3025P956
$$ -7032 2532 22043 30281 28514 52784 50526 43480 34852 33842 35323 39396 43474 30449 38405
18089C8405N900J4747p413j2116L6470l413J2917L04K3144N710K5581N769J2049
$$ 38405 44305 59052 51639 39523 75993 72580 85497 85801 108945 114655 140236 146005 158054
18076A58054j9347M252L0327L7313K8136k862k6664l5451j9790J8027j8834j5523
$$ 158054 138707 142959 173286 210599 238735 235873 209209 173758 153968 171995 153161 137638
18064A37638R356q216j4027j8122k222n415M677J6904J1301K7578L0336K1843
$$ 137638 146994 138778 124751 106629 104407 98992 103669 120573 131874 159452 189788 211631
18052B11631M8047L9264J1864J0849m6064l8064m9216j1386j4437j9089l2074
$$ 211631 259678 298942 310806 321655 275591 237527 188311 176925 162488 143399 111325
18041A11325O081n404p93k3384m23K3535j9556m3248j014O01M7912Q393k5549
$$ 111325 117406 112002 111209 87825 87402 110937 91381 48133 47119 47720 95632 104025 78476
18028G8476j2094O355k627J7409K4652R705k9542o582N9742L1901j9185k9230
$$ 78476 66382 72737 70110 87519 112171 121876 92334 85752 145494 177395 158210 128980
18016A28980j4321J0502J0800J2413K561L9407O8661M6934L8694L5541K8369N7323
$$ 128980 114659 125161 135961 148374 150935 190342 259003 305937 344631 380172 408541 465864
18004D65864N1411q909N699J2816k4374k0894l0931o6316m6589l5174j7411k2563
$$ 465864 517275 508366 514065 526881 502507 481613 450682 384366 337777 302603 285192 262629
17992B62629r968j4130n358l3855k7130j2770o879k5766k2333k2357J1855J2994
$$ 262629 252661 238531 233173 199318 172188 159418 152539 126773 104440 82083 93938 106932
17980A06932J1649K3081j8448j7986P991j0830r654L5833j1020q293M5048L5657
$$ 106932 118581 141662 123214 105228 113219 102389 92735 128568 117548 109255 154303 189960
17968A89960J9960j1845m3202k1021J2920J7127j2604J1312M9787M2407k5887
$$ 189960 209920 198075 154873 133852 146772 163899 151295 162607 212394 254801 228914
17957B28914k6699j2469K0863L2822K7168P478p0706m0165j1025L574j2507j85
$$ 228914 202215 189746 210609 243431 270599 278077 207371 167206 156181 159755 147248 147063
17945A47063q445N454n771J974j5514K8971j220j2422J7049P835n529M3851L810
$$ 147063 138618 144072 138301 140275 124761 153732 152512 140090 157139 164974 159445 203296 207106
17932B07106N3262L8635L0845L0936J7545L7605L1242L8306O4724K4497R825J0363
$$ 207106 260368 299003 329848 360784 378329 415934 447176 485482 550206 574703 584528 594891
17920E94891n748L3446L0905l536m0652k0339k8107o1880l0462l7494L670J29
$$ 594891 589143 622589 653494 649958 609306 588967 560860 498980 468518 431024 434694 434823
17908D34823j6741K6581M5151L3600O8354R7259P7023O5357r890j9042l3472m1497
$$ 434823 418082 444663 489814 523414 591768 689027 766050 831407 821517 802475 769003 727506
17896G27506l9938k6232Q664N7281P7657P5776J45317K08428J93105K24699K76595
$$ 727506 687568 661336 670000 727281 804938 880714 1026031 1234459 1427564 1652263 1928858
17885A928858L80514N57919P61554J074916J644858K596792M133900O438983Q708514
$$ 1928858 2309372 2867291 3628845 4703761 6348619 8945411 13079311 19518294 28226808
17876B8226808P705160J577484m171391o593641p250834o090269m053687k506635
$$ 28226808 35931968 37509452 33338061 26744420 19493586 13403317 9349630 6842995
17868F842995j589594j076444p21754m76908k93795k07990k36373k50589k18535
$$ 6842995 5253401 4176957 3455203 2978295 2684500 2476510 2240137 1989548 1771013
17859A771013j43455j00890P32N6188P1784J27461J20984J01849N4736n0513j00089
$$ 1771013 1627558 1526668 1527400 1583588 1655372 1782833 1903817 2005666 2060402 2009889 1909800
17848A909800j01094j02712m2464J3916N6901J36469J65339K29794L12215M10733
$$ 1909800 1808706 1705994 1663530 1677446 1734347 1870816 2036155 2265949 2578164 2988897
17838B988897N42541P44798J020537J394240K086556L273779N163975P963336
$$ 2988897 3531438 4276236 5296773 6691013 8777569 12051348 17215323 25178659
17830B5178659J0734998J0450084O785916L808744q10694p383920r928501r673648
$$ 25178659 35913657 46363741 53149657 56958401 56147707 48763787 38835286 29161638
17822B9161638q472979o173828l969061k485679j625856j093026p74636n75064
$$ 29161638 20688659 14514831 10545770 8060091 6434235 5341209 4566573 3991509
17814C991509m83521m55355l96396l25988k43138j79680j01174m1813L7353P8397
$$ 3991509 3507988 3052633 2656237 2330249 2087111 1907431 1806257 1764444 1801797 1880194
17804A880194M3439k9657o2241o6152j15373j34807j09323j12579l9778k7074
$$ 1880194 1923633 1893976 1831735 1765583 1650210 1515403 1406080 1293501 1253723 1226649
17794A226649K1832O5147J25368J34939J78845K57740L58215N07300P29134J092554
$$ 1226649 1248481 1313628 1438996 1573935 1752780 2010520 2368735 2876035 3605169 4697723
17784D697723J704080K758019M410695O544651P280586L521741k052420m924082
$$ 4697723 6401803 9159822 13570517 20115168 27395754 30917495 28865075 23940993
17776B3940993n999070n625078l953271k454224j499170r72484o67230m21081
$$ 23940993 17941923 12316845 8363574 5909350 4410180 3437696 2770466 2349385
17768B349385k92346k41602k19887j98898k00597j67806j22540j01692k9684n8696
$$ 2349385 2057039 1815437 1595550 1396652 1196055 1028249 905709 804017 774333 715637
17758G15637m9835k6199J3959N0543K6951j5559n6366q2990j37599o4132m3256
$$ 715637 665802 639603 653562 704105 731056 715497 659131 576141 438542 374410 331154
17747C31154m6693k5847K4215K3046J184J918J3500L2769j4667M8674M1109j0654
$$ 331154 284461 258614 282829 305875 307059 308977 322477 355246 340579 389253 430362 419708
17735D19708k1829k4768o0060k2130k9015l7160l7374L3400N135k4860l6686P77
$$ 419708 397879 373111 313051 290921 261906 224746 187372 220772 225907 201047 164361 165138
17723A65138p02K6084J8966K6317M5440L3694L8915J4042j868m0573m9755j8648
$$ 165138 164436 190520 209486 235803 281243 314937 353852 367894 366026 325453 275698 257050
17711B57050l8247k9849l2961l1920j1814j8835j0401m737j313k0961K4729r135
$$ 257050 218803 188954 155993 124073 112259 93424 83023 78286 76973 56012 80741 71606
17699G1606l1809p071L3118r529K1999K6477j1382k6233N81J1988J0852m8000
$$ 71606 39797 32726 65844 56315 78314 104791 93409 67176 67757 79745 90597 42597
17687D2597K654O436j2954r384J615k1424R881r073K9567K2996o540j2950M733
$$ 42597 45251 51687 38733 29349 30964 9540 19421 10348 39915 62911 56371 43421 48154
17674D8154N443j7271p462j171j4788L681P602l572K6592k5219J4179Q41J2297
$$ 48154 53597 36326 28864 27693 12905 16586 24188 20616 47208 21989 36168 37009 49306
17661D9306N557k5888k1986j5823K0339J7519j20k2540l726J9052K471l3722P545
$$ 49306 54863 28975 6989 -8834 11505 29024 28904 6364 2638 21690 24161 -9561 -2016
17648b016J2455l3474n798j0842N028J4888J4683j8777R471J5466q047j3343m506
$$ -2016 10439 -23035 -28833 -39675 -34647 -19759 -5076 -23853 -14382 1084 -6963 -20306 -24812
17635b4812j8731L215K9658J7678Q485k2787m2638m775K0266L7283O309q19j3338
$$ -24812 -43543 -40328 -10670 7008 15493 -7294 -49932 -54707 -34441 2842 9151 8332 -5006
17622e006k517R497P208L2024l6243n0027L0393N3927R45O779Q150k4150k6005
$$ -5006 -7523 1974 9182 41206 4963 -45064 -14671 39256 40201 46980 55130 30980 4975
17609D975k777J1624j0036L164Q812K017j3704j2523k1799j60r983j494J9981
$$ 4975 2198 13822 3786 6950 15762 17779 4075 -8448 -30247 -30407 -40390 -41884 -21903
17596b1903O212L0358K7970R579K170j9663l3047R719O078K845L9066j4608k1041
$$ -21903 -15691 14667 42637 52216 54386 34723 1676 11395 17473 20318 59384 44776 23735
17583B3735P689o959k1925p571K6641J1115K2592n423p709j7057p730j8452q005
$$ 23735 31424 24465 2540 -5031 21610 32725 55317 49894 42185 25128 17398 -1054 -9059
17570i059K843R843J1529M3979M937l5077R029K32M806K2351L1082m4852p627
$$ -9059 -6216 3627 15156 59135 64072 28995 38024 38256 43062 65413 96495 51643 44016
17557D4016J0646K2092o669J3788K6707J8946M8791K3142L480m490o875l4461
$$ 44016 54662 76754 70085 83873 110580 129526 178317 201459 204939 200449 193574 159113
17545A59113l1700l1134o940n152k227K6425J7076j1602l871l704J8202M3495
$$ 159113 127413 96279 89339 84187 81960 108385 125461 113859 109988 106284 124486 167981
17533A67981M3700L8593K7316K881j061k0651m0928j3749j6676l7049j7377n7294
$$ 167981 211681 250274 277590 280471 279410 258759 217831 204082 187406 150357 132980 75686
17521G5686l1500l1363R226P073J1496J4150l6151m5231J3621K6414p217J582
$$ 75686 44186 12823 22049 29122 40618 54768 18617 -26614 -12993 13421 6204 7786
17509G786l5744R028K1675K5723N698j5656P308L289r75j6820l8449R314k853
$$ 7786 -27958 -18930 2745 28468 34166 18510 25818 29107 28132 11312 -27137 -17823 -20676
17496b0676P433K2210J9236Q574P465n783k5581q019L613J1459J8439J2937l3431
$$ -20676 -13243 8967 28203 36777 44242 38459 12878 4859 8472 19931 38370 51307 17876
17483A7876k7383j6552R898K2844l3423p831K7013k0187J5745k3781R118r311
$$ 17876 -9507 -26059 -16161 6683 -26740 -34571 -7558 -27745 -12000 -35781 -26663 -35974
17471c5974J0476J7938R774j6056p950j5718l546K0279L9897o229j7333k1127
$$ -35974 -25498 -7560 2214 -13842 -21792 -37510 -41056 -20777 19120 12891 -4442 -25569
17459b5569k1100j4601l320J3403R202J8253L9192J4632j2334J6657j1708L351
$$ -25569 -46669 -61270 -64590 -51187 -41985 -23732 15460 30092 17758 34415 22707 26058
17447B6058J7701k9938l1811j4363K976L0843j2439j1624k0977p946o196j3103
$$ 26058 43759 13821 -17990 -32353 -29377 1466 -10973 -22597 -43574 -51520 -57716 -70819
17435g0819n096J5353K8981Q281J3529k3418l961k4176l409J0712M756L2121o910
$$ -70819 -75915 -60562 -31581 -23300 -9771 -33189 -37150 -61326 -64735 -54023 -49267 -17146 -24056
17422b4056j4213K5295K3231N701p277k2496j0549n510K1036p429M5587J6722
$$ -24056 -38269 -12974 10257 15958 8681 -13815 -24364 -29874 -8838 -16267 29320 46042
17410D6042j9509n2057j7545n308j2973J2151j0705J3426K4052K6991J4515L332
$$ 46042 26533 -25524 -43069 -48377 -61350 -49199 -59904 -46478 -22426 4565 19080 22412
17398B2412l49M077L286j800J5492L3321j5675k4286M787q619k3212m8969P655
$$ 22412 22063 26140 29426 27626 43118 76439 60764 36478 41265 32646 9434 -39535 -31880
17385c1880J2242m98L669M333L2984M3995K3328k020j2494m4113j7765M533O791
$$ -31880 -19638 -20136 -16467 -12134 20850 64845 88173 86153 73659 29546 11781 16314 23105
17372B3105K137k8657k9503J4399O9998M8857N9479J752M604J3012n5444k7856
$$ 23105 25242 -3415 -32918 -18519 51479 100336 159815 161567 166171 179183 123739 95883
17360I5883k6870j8373J3639R873j9667l291J3980j1379k8514j0438Q098m338
$$ 95883 69013 50640 64279 74152 54485 51194 65174 53795 25281 14843 22941 18603
17348A8603j4337m185k9783j6272K6827K0513J9438j1894l7678r996J575M251
$$ 18603 4266 81 -29702 -45974 -19147 1366 20804 8910 -28768 -38764 -37189 -32938
17336c2938J2384j0238j4230J0458M873L8169L86j1036j7399R893J8385M9106
$$ -32938 -20554 -30792 -45022 -34564 -29691 8478 8864 -2172 -19571 -9678 8707 57813
17324E7813L8411Q797Q512Q670K3328L7295K2899M3821J4177N008l8201j8089
$$ 57813 96224 105021 113533 122203 145531 182826 205725 249546 263723 268731 230530 212441
17312B12441l6792m9694k7477m0207J0519k0365m994J1702K1566O21l9928k5132
$$ 212441 175649 125955 98478 58271 68790 48425 43431 55133 76699 77320 37392 12260
17300A2260K9848Q627p276l7947P61J1400M2072j3587m6316j4730k891J3308O180
$$ 12260 42108 50735 43459 5512 6273 17673 59745 46158 -158 -14888 -17779 -4471 1709
17287A709j0225k4395m859k7238L8525N5549L7947m0792j1209L768L8152J9903
$$ 1709 -8516 -32911 -37770 -65008 -26483 29066 67013 26221 15012 18780 56932 76835
17275G6835P278k7265j1110K0606M0328L4168J5717M0373j3277o0293q2442m3476
$$ 76835 84113 56848 45738 66344 106672 140840 156557 196930 183653 123360 40918 -2558
17263b558j7107J6522K9333K563K3685K8209K7963j5472k2472j8691m663K9464
$$ -2558 -19665 -3143 26190 28753 52438 80647 108610 93138 70666 51975 47312 76776
17251G6776j59o0604l927m568j3356Q293k0203L8653K4280N235j8255l970l1105
$$ 76776 76617 16013 12086 7518 -5838 2455 -17748 20905 45185 50420 32165 28195 -2910
17238b910m9354J1424L9745K9490L3802p521l8140p337N466J0526q137K0861P12
$$ -2910 -52264 -40840 -1095 28395 62197 54676 16536 9199 14665 25191 17054 37915 38627
17225C8627j3351j5925k4512L456K9669r975k546k1829j1999L4503K6996r762
$$ 38627 25276 9351 -15161 -11705 17964 7989 5443 -16386 -28385 6118 33114 23352
17213B3352j9337l7508k0015l620J8996k2293j5650L8699j49r173L6090L2192
$$ 23352 4015 -33493 -53508 -57128 -38132 -60425 -76075 -37376 -37525 -46698 -10608 21584
17201B1584p081r802j551n338Q684j1963j5486p5j4186j457L5470L5692l7994
$$ 21584 14503 4701 3150 -2188 6496 -5467 -20953 -21028 -35214 -36671 -1201 34491 -3503
17188c503n3542p357J4861M7501J9404j5046R37j7k945L5705J1822J0530J9748
$$ -3503 -57045 -64402 -49541 -2040 17364 2318 3255 3238 293 35998 47820 58350 78098
17175G8098k80k400k0365J3058L2522j4633p931k1233l1253p404j0167M555M4163
$$ 78098 77818 75418 55053 68111 100633 86000 78069 56836 25583 18179 8012 12567 56730
17162E6730o475m988j5757n2340M3997J5554J1681J7523l3464k622l1098r409
$$ 56730 50255 45267 29510 -22830 21167 36721 48402 65925 32461 29839 -1259 -10668
17150a0668m56k663L1483r884l1988K2267M000p781K4295L5698J4645k741j5728
$$ -10668 -11124 -13787 17696 7812 -24176 -1909 2091 -5690 18605 54303 68948 66207 50479
17137E0479k2341J1358j1041p640K393r603l882k407k1615N874j5051J5310L9866
$$ 50479 28138 39496 28455 20815 23208 13605 9723 7316 -14299 -8425 -23476 -8166 31700
17124C1700P031k8843j1597L895K3325J1420oq481J2980J0831j726J2005L4171
$$ 31700 38731 9888 -1709 2186 25511 36931 36925 28444 41424 52255 50529 62534 96705
17111I6705J6602n4113j2748L982m390K7276K2362R318J0979J4808l059k2373
$$ 96705 113307 59194 46446 50428 46038 73314 95676 104994 115973 130781 127722 105349
17099A05349j8679J4204l0442l9542k4502L855R703J9850p855k8560k7346J3945
$$ 105349 86670 100874 70432 30890 6388 10243 19946 39796 31941 3381 -23965 -10020
17087a0020L0998J4832K8626k129L6103j4991l0067j80M166k4963k1727j9868
$$ -10020 20978 35810 64436 62307 98410 83419 53352 53172 57338 32375 10648 -9220
17075i220R647L2769p615k8899K6483O6575k337k1798k8674K8332O721q298L0227
$$ -9220 427 33196 25581 -3318 23165 89740 87403 65605 36931 65263 71984 63686 93913
17062I3913J9556l51J4248N09j6675L3421j1869L738p282j2057J425k535j88K8132
$$ 93913 113469 113118 127366 127875 111200 144621 132752 136490 129208 117151 118576 116041 115853 143985
17048A43985J0621j2892R597L6554j2424M6615N8517L6276J5825k8722n994r294
$$ 143985 154606 141714 151311 187865 175441 222056 280573 316849 332674 303952 297958 288664
17036B88664L2194M759K0223M6170M9630L4234L6187N1912P6120J12710J26881
$$ 288664 320858 325617 345840 392010 441640 475874 512061 563973 640093 752803 879684
17025H79684J02710N8107O3692P6499J08267J53688J88626J36273J22033J77328
$$ 879684 982394 1040501 1104193 1180692 1288959 1442647 1631273 1767546 1889579 2066907
17015B066907K01067K19981K00835K07798L91516N24417P77405J182557J697989
$$ 2066907 2267974 2487955 2688790 2896588 3288104 3812521 4589926 5772483 7470472
17006G470472K565513M045920O653713J0866564J5824073J6055129P287747m642060
$$ 7470472 10035985 14081905 20735618 31602182 47426255 63481384 70769131 66127071
16998F6127071j1663694j3653532j2320239q647175n208819l115488j888275j113356
$$ 66127071 54463377 40809845 28489606 19842431 14633612 11518124 9629849 8516493
16990H516493n10767Q869N51146J276786K216654L777133O345666J0386132J5137691
$$ 8516493 8005726 8014595 8565741 9842527 12059181 15836314 22181980 32568112 47705803
16981D7705803J5163454O317422n292596j1977858j3774050j2308643q561977
$$ 47705803 62869257 69186679 63894083 51916225 38142175 25833532 17271555
16974A7271555n212904l119657j985614j365071r89158p50428n63321l58356k48625
$$ 17271555 12058651 8938994 6953380 5588309 4599151 3848723 3285402 2927046 2678421
16965B678421j65595j52473j58807j79200j88652j97328j95412j80825j64208
$$ 2678421 2512826 2360353 2201546 2022346 1833694 1636366 1440954 1260129 1095921
16956A095921j30146o5689n249k9796M392l7771j8626m9986p8766n3730o4148
$$ 1095921 965775 900086 894837 865041 869433 831662 813036 763050 684284 630554 566406
16945E66406n9971n3771m7609n4217j8779R884J1708p1563k3530L769j7030j1257
$$ 566406 506435 452664 405055 350838 332059 341943 353651 282088 258558 262327 245297 234040
16933B34040j4003j1022j3793M855M895j1559m8217k471J8748J1378j491J3141
$$ 234040 220037 209015 195222 200077 204972 193413 145196 142725 161473 172851 171360 184501
16921A84501k1816l2224k5718K10l397q961K2042L1239m6247o3984k601L8192
$$ 184501 162685 130461 104743 104953 101556 92595 114637 145876 99629 35645 33044 71236
16909G1236J0386K5400J9933m1951k1487J7532q028N517J2906j7549r537j8173
$$ 71236 81622 107022 126955 85004 63517 81049 73021 78538 91444 73895 64358 46185
16897D6185j9476J9818o877l915N661J8225J8279j4036j0606K2897K9031r737
$$ 46185 26709 46527 39650 35735 41396 59621 77900 63864 53258 76155 105186 95449
16885I5449r875R157j2908l2782J3797j6421k874k7660Q672K2561L7105J6621
$$ 95449 85574 94731 81823 49041 62838 46417 43543 15883 24555 47116 84221 100842
16873A00842n18r858o4185j9934K8088L1351J4687K4242n617k2541r30L2781j9712
$$ 100842 100324 90466 26281 6347 34435 65786 80473 104715 99098 76557 75627 108408 88696
16860H8696l1887J4191j7j2823J2972l3637l4049L8367k713l815J3114l0386k6513
$$ 88696 56809 71000 70983 58160 71132 37495 3446 41813 39100 35285 48399 18013 -8500
16847h500L5489J2607J8082k1489k8380J3939J8314r776p145j1555j5503k0240
$$ -8500 26989 39596 57678 36189 7809 21748 40062 30286 23141 11586 -3917 -24157
16835b4157j298R937O530Q327L0807K1937l4513n275Q298J3541j8297J1687j0238
$$ -24157 -25455 -15518 -8988 -661 30146 52083 17570 12295 20593 34134 15837 27524 17286
16822A7286j7077l9830P789O959L0723J822j7846J0156J6535r616r033J230J0316
$$ 17286 209 -39621 -31832 -24873 5850 7672 -10174 -18 16517 6901 -2132 -902 9414
16809I414j623K742j5707k0644J5756J364R333j918l5950n744L0132P034k6176
$$ 9414 7791 10533 -5174 -25818 -10062 -8698 635 -1283 -37233 -42977 -12845 -5811 -31987
16796c1987J7431K3266O120j5203q313J1705j0183j1089Q137Q629L807k1486M053
$$ -31987 -14556 8710 14830 -373 -8686 3019 -7164 -18253 -10116 -1487 2320 -19166 -15113
16783a5113j8026R92M039J2612O8261K8333J0801j5198j4870J5722n079p639l1319
$$ -15113 -33139 -32147 -28108 -15496 52765 81098 91899 76701 61831 77553 72474 64835 33516
16770C3516j2652J6290q141k8697j7950J9742M2506l219j6034j3083j4750j9617
$$ 33516 20864 37154 29013 316 -17634 2108 44614 41395 25361 12278 -2472 -22089
16758b2089l7369k3521K3018M2675j461J265l557k3694m974K7744J4921K4779
$$ -22089 -59458 -82979 -59961 -17286 -18747 -17482 -21039 -44733 -49707 -21963 -7042 17737
16746A7737Q302l9032k9568K0701K7043p771l588j635J241m593J3840K2061J2267
$$ 17737 26039 -12993 -42561 -21860 5183 -2588 -6176 -7811 -6570 -11163 2677 24738 37005
16733C7005k2147r540r412j9191J29j4335o55K5550J4492L2121O156j4820k6890
$$ 37005 14858 5318 -4094 -23285 -23156 -37491 -38146 -12596 1896 34017 40173 25353 -1537
16720a537M19j4881n230J0382P329O380j5513k1419j1796q461N637R240J0987
$$ -1537 -1118 -15999 -21229 -10847 -3518 2862 -12651 -34070 -45866 -54327 -48690 -39450 -28463
16707b8463o184J3700N337J083J4711K4300R180j8134j9502o072j7371Q553n591
$$ -28463 -34647 -20947 -15610 -14527 184 24484 33664 15530 -3972 -10044 -27415 -18862 -24453
16694b4453k7111n45r668q744K9614K1761j3635j4012K0039M1592J139M192k5134
$$ -24453 -51564 -52109 -61777 -70521 -40907 -19146 -32781 -46793 -26754 14838 15977 20169 -4965
16681d965l0915P469J7192k2766K2982L698R737m083J1199p357m613K9799P92
$$ -4965 -35880 -28411 -11219 -33985 -11003 -7305 2432 -1651 9548 2191 -2422 27377 28169
16668B8169k8634k008K3337L8292l8976l6951k9770j1895k580k071L8279J6975
$$ 28169 -465 -2473 20864 59156 20180 -16771 -46541 -58436 -61016 -63087 -24808 -7833
16656g833J6451J5267j333k8795k8644k3401L8529P459J8863J1827j2330j0154
$$ -7833 8618 23885 22552 -6243 -34887 -58288 -19759 -12300 6563 18390 6060 -4094
16644d094p297n343J131P74K6417N476j6121l1358K2188K8223N445j1599k5660
$$ -4094 -11391 -16734 -15603 -14829 11588 17064 943 -30415 -8227 19996 25441 13842 -11818
16631a1818k3727p517r541R103L3543K1889K3496l274O460o305J3844L9397o280
$$ -11818 -35545 -43062 -52603 -43500 -9957 11932 35428 32154 38614 32309 46153 85550 79270
16618G9270j071Q624l5307m7386Q456Q979q291m3178j5053M337P710K0252r991
$$ 79270 78199 86823 51516 4130 12586 21565 13274 -29904 -44957 -40620 -32910 -12658 -22649
16605b2649J1248Q672O462M460j7437m0281J9197K5911J2666k6327j6897n451
$$ -22649 -11401 -2729 3733 8193 -9244 -49525 -30328 -4417 8249 -18078 -34975 -40426
16593d0426n634P840j120j643k3767L2324J8481L7078J983l4345l589J7161L2780
$$ -40426 -46060 -38220 -39340 -40983 -64750 -32426 -13945 23133 25116 -9229 -12818 4343 37123
16580C7123J1726k5847j5030j4444j7998L1916K6935m954r32j5684k2838O048
$$ 37123 48849 23002 7972 -6472 -24470 7446 34381 29427 28495 12811 -10027 -3979
16568c979J02j3805j0275Q576l458K9633K759R84o589j3104L2298o710k5869l3608
$$ -3979 -3877 -17682 -27957 -19381 -22839 6794 9553 10537 3948 -9156 23142 16432 -9437 -43045
16554d3045K5586J9565j2611L3990L9163J5915l301r61k0398p052N285n198J2380
$$ -43045 -17459 2106 -10505 23485 62648 78563 75262 74301 53903 46851 52136 46938 59318
16541E9318l3917M865L7655J8192l4049k5545q957j7242j9274K174J6090J2108
$$ 59318 25401 30266 67921 86113 52064 26519 17562 320 -18954 -16780 -690 11418
16529A1418l6045k1217Q295J1278N658l174J6942J2807m1804q991O589K1339K1918
$$ 11418 -24627 -45844 -37549 -26271 -20613 -23787 -6845 5962 -35842 -44833 -38244 -16905 5013
16516E013l012q611n119K5886J6482l0718j1249P810k758j8774k2972O753L4374
$$ 5013 2001 -6610 -11729 14157 30639 -79 -11328 -3518 -6276 -25050 -48022 -41269 -6895
16503f895l716M59L429K148M177J0745J4132j1613k7983M504n80R302j7740p39
$$ -6895 -10611 -10152 -6723 -4575 -398 10347 24479 12866 -15117 -10613 -11193 -1891 -19631 -20370
16489b0370l181m2216j8716J2328J5206J4478J2508J6863L0078L638J2543j5761
$$ -20370 -23551 -65767 -84483 -72155 -56949 -42471 -29963 -13100 16978 20616 33159 17398
16477A7398r157l6564l8891l614K5173M8958K0176j290K1926j8550m1249k506
$$ 17398 8241 -28323 -67214 -70828 -45655 3303 23479 22189 44115 25565 -15684 -18190
16465a8190M5369J3703k217R41k9084j147N213K174k1508k7847k0873K9528L5225
$$ -18190 27179 40882 38665 39606 10522 9375 14588 16762 -4746 -32593 -53466 -23938 11287
16452A1287L9207R178N865M1671L2654M1387N7098P4098L583p4989r8083k9877
$$ 11287 50494 59672 65537 107208 139862 181249 238347 312445 316028 241039 142956 113079
16440A13079j7757k8117N279Q292J1226J2334R271k5487j1003K8984K0290K630
$$ 113079 95322 67205 72484 80776 92002 104336 113607 88120 77117 106101 126391 129021
16428A29021J7228K8617M2526J9130O965l629k6928o5846m7353l9442J0845N334
$$ 129021 146249 174866 217392 236522 243487 239858 212930 147084 99731 60289 71134 76468
16416G6468k9277j5198Q90k5100m8195k154M1712j5247L791k041j6862k0558p566
$$ 76468 47191 31993 32883 7783 -40412 -42566 -854 -16101 -12310 -14351 -31213 -51771 -59337
16403e9337R660K6894K6471j2865m9q504Q509L9698L23j521l5349j8878J5105
$$ -59337 -49677 -22783 3688 -9177 -9226 -17730 -9221 30477 30800 29279 -6070 -24948 -9843
16390i843N793J3220j9837O878J2156l1836k4018K5525L6661K4624r459k4765
$$ -9843 -4050 9170 -10667 -3789 8367 -23469 -47487 -21962 14699 39323 29864 5099
16378E099j4585j1967J5529L331K50O078k897j0298n4958J202M422K1996J0286
$$ 5099 -9486 -21453 -5924 -2593 -2343 3735 838 -9460 -64418 -63216 -58794 -36798 -26512
16365b6512J516K143N467j0444J4266j3650n52K3603P006k8502M573O695m579
$$ -26512 -24996 -22853 -17386 -27830 -13564 -27214 -27766 -4163 2843 -25659 -21086 -14391 -18970
16352a8970n863K1217j0543k7838l2261K427j1258L3141L7427k417j3384P950
$$ -18970 -24833 -3616 -14159 -41997 -74258 -71831 -83089 -49948 -12521 -14938 -28322 -20372
16340b0372J4352L2772k3607l0923m400J511n361L4733J6741l8362r192n931K1628
$$ -20372 -6020 26752 3145 -27778 -32178 -30667 -36028 -1295 15446 -22916 -32108 -38039 -16411
16327a6411l492n430j002K098J2313j9070k8783O833j7981j883j476L7675L9990
$$ -16411 -19903 -25333 -26335 -24237 -11924 -30994 -59777 -52944 -70925 -72808 -74284 -36609 3381
16314C381k815j4041k7529l3332M242N8797M6382Q616l7673l7460k9163J9214
$$ 3381 566 -13475 -41004 -74336 -70094 -11297 35085 43701 6028 -31432 -60595 -41381
16302d1381J2660j6255N854K6317J1856k3401m2602Q39M6328O280p45K9474j89
$$ -41381 -28721 -44976 -39122 -12805 -949 -24350 -66952 -66113 -19785 -13505 -14250 15224 15035
16289A5035k6463p120Q400j0694l815k0530k4848o635J1345M1185N3834j0473
$$ 15035 -11428 -18548 -10148 -20842 -24657 -45187 -70035 -76670 -65325 -24140 29694 19221
16277A9221k5142J4416j967l4404P236r645J5255J0003J5017R023j0716j1615
$$ 19221 -5921 8495 6528 -27876 -20640 -30285 -15030 -5027 9990 19013 8297 -3318
16265c318j2643j0318l6374j2027K9172K2018K9784R266l4999k8998j4675J9245
$$ -3318 -15961 -26279 -62653 -74680 -45508 -23490 6294 15560 -19439 -48437 -63112 -43867
16253d3867O2275k2906m7404k743L972K4566j0112K753J5194Q568o801k1278O749
$$ -43867 18408 -4498 -51902 -54645 -50673 -26107 -36219 -33466 -18272 -9704 -16505 -37783 -31034
16240c1034k3301j8181L0190j8415N629j1287J0824K7479K3666j6482p899p095
$$ -31034 -54335 -72516 -42326 -60741 -55112 -66399 -55575 -28096 -4430 -20912 -28811 -35906
16228c5906m399K9317K4276M987k2357k6743p477k4993M8539L422k560J4285L5419
$$ -35906 -40305 -10988 13288 18275 -4082 -30825 -38302 -63295 -14756 -11334 -13894 391 35810
16215C5810j2630K2464p347k4057J9934j9070P252M2225k9413L3623p901k7768
$$ 35810 23180 45644 38297 14240 34174 15104 22356 64581 35168 68791 60890 33122
16203C3122m5225k0008q450K7547L6139P260J287q339j3069R869n412n416K7407
$$ 33122 -12103 -32111 -40561 -13014 23125 30385 31672 23333 10264 20133 14721 9305 36712
16190C6712q157l5938j2958K1600K2425j1908j8841J1160j9364k6300L8320J3745
$$ 36712 28555 -7383 -20341 1259 23684 11776 -7065 4095 -15269 -41569 -3249 10496
16178A0496j9771J317J6714j49p121o492J1047N058j5255l0383M312K8026P721
$$ 10496 -9275 -7958 8756 8607 1486 -5006 6041 11099 -4156 -34539 -30227 -2201 5520
16165E520n384k2364l3126J2940M0803O919j2613k5248l4497j9294j0086j1579
$$ 5520 136 -22228 -55354 -42414 -1611 5308 -7305 -32553 -67050 -86344 -96430 -108009
16153a08009N868p30K1185M0498J6212P145k5574q915L126k3932k0324l978R663
$$ -108009 -102141 -102871 -81686 -41188 -24976 -17831 -43405 -52320 -49194 -73126 -93450 -97428 -87765
16140h7765N0088L0076K7496j4394l0525J234j372J4091J2005M053m47q380J7407
$$ -87765 -37677 -7601 19895 5501 -25024 -23790 -25162 -11071 934 4987 4540 -3840 13567
16127A3567O836q440j3108K3684J6395j7848n86J6018l943j2269k302j77j3034
$$ 13567 20403 11963 -1145 22539 38934 21086 20500 36518 32575 20306 18004 17827 4793
16114D793J2424k0559k9844j4563M7284r626j2640J4882k022K338N153K2834J4894
$$ 4793 17217 -3342 -33186 -47749 -465 -10091 -22731 -7849 -9871 -7533 -2380 20454 35348
16101C5348k1109p174J0134l5369j1992J740q75N835p287J6793K1450n138K6044
$$ 35348 14239 7065 17199 -18170 -30162 -28422 -29297 -23462 -30749 -13956 7494 2356 28400
16088B8400p352j0991q324L603j0134j096j3160J440J3976O126k3933j6736N12
$$ 28400 21048 10057 1733 5336 -4798 -5894 -19054 -17614 -3638 2488 -21445 -38181 -37669
16075c7669K134J2113L5839k0195J8833J299j7631l824Q834j4759j6098R053M2971
$$ -37669 -35535 -23422 12417 -7778 11055 12354 -5277 -9101 -267 -15026 -31124 -22071 20900
16062B0900K578l561N596Q693k5370k7608l1248m263L5174P532j2675n28k266
$$ 20900 23478 19917 25513 34206 8836 -18772 -50020 -54283 -19109 -11577 -24252 -24780 -27046
16049b7046k527K1292M2361J7259K3978q799n6789nj7021k8707L5034J7140J9367
$$ -27046 -29573 -8281 34080 51339 75317 66518 9729 9724 -7297 -36004 -970 16170 35537
16036C5537J5826j9463n8811k6665P415J2599K9446L738R690k0027J0192J5742
$$ 35537 51363 31900 -26911 -53576 -46161 -33562 -4116 -378 9312 -10715 -523 15219
16024A5219l072k9553k8208j7898M4568L6615J736J1574j4034J6398j509l6187
$$ 15219 12147 -17406 -45614 -63512 -18944 17671 19407 30981 16947 33345 31836 -4351
16012d351J8559k0566l0243j339p951K0747K4682K6536j5427l0020K0662L3499
$$ -4351 14208 -6358 -36601 -37940 -45891 -25144 -462 26074 10647 -19373 1289 34788
16000C4788l0783l3625q795L2501R815k569j9306p85K8705k0502l7935R94K8823
$$ 34788 4005 -29620 -38415 -5914 3901 1332 -17974 -18759 9946 -10556 -48491 -47497 -18674
15987a8674K8907J4619k7691m9860L577J0334K346K2163J3555J8823O050j3892
$$ -18674 10233 24852 -2839 -52699 -49122 -38788 -36442 -14279 -724 18099 24149 10257
15975A0257j4434j1415q45j419k2255J1779K9538J7194j22r876J0582j3710j4965
$$ 10257 -4177 -15592 -16437 -17856 -40111 -28332 1206 18400 18278 8402 18984 5274 -9691
15962i691k835p498l9739L1536K6415k4932P45J8401J0631j469r978j0608K5515
$$ -9691 -12526 -20024 -59763 -28227 -1812 -26744 -25999 -7598 3033 1564 -8414 -19022 6493
15949F493J120J3722P456k7713m0796l430Q242Q08J3339K1769l18m992q093j9285
$$ 6493 7613 21335 28791 1078 -39718 -43148 -34906 -34098 -20759 1010 692 -4300 -12393 -31678
15935c1678O163j6669N660m571n476J2753J4169O548q58j5892J177L4464K484
$$ -31678 -25515 -42184 -36524 -41095 -46571 -33818 -19649 -13101 -13959 -29851 -28674 5790 8274
15922H274K403P990N245n425q207O595k1708k5399m4569j7082N5394J4011q549
$$ 8274 10677 18667 23912 18487 10280 16875 -4833 -30232 -74801 -91883 -36489 -22478 -31027
15909c1027K3519Q872k9224l7790j6677J6841N0103k406n645K3453L288j1326
$$ -31027 -7508 1364 -27860 -65650 -82327 -65486 -15383 -17789 -23434 19 3307 -8019
15897h019J659K3118K451p310J0121j4066k3613P660k0177k9479L7808m67j3611
$$ -8019 -6360 16758 19209 11899 22020 7954 -15659 -7999 -28176 -57655 -19847 -20314 -33925
15884c3925K2110m0013p828O248r693R519M947J5285K908J9275L5945j1848m0867
$$ -33925 -11815 -51828 -59656 -53408 -63101 -53582 -48635 -33350 -30442 -11167 24778 12930 -27937
15871b7937P051J8599J9181L5671K630k963j2735k3130P583q447k8833l1990k4022
$$ -27937 -20886 -2287 16894 52565 55195 52232 39497 16367 23950 15503 -13330 -45320 -69342
15858f9342R8J2933L6672N2796J406j0437j406J8238k7715n678L1592k2440k9132
$$ -69342 -69244 -56311 -19639 33157 34563 24126 22720 40958 13243 7565 39157 16717 -12415
15845a2415k4109j2861J4568J8619J8526J2327J9305k7134m8128l0823L0041K4253
$$ -12415 -36524 -49385 -34817 -16198 2328 14655 33960 6826 -41302 -72125 -42084 -17831
15833a7831m072L92K1103K3453n652j2815k9478m6043m680J6446K8802K3167j3433
$$ -17831 -21903 -21511 -408 23045 17393 4578 -24900 -70943 -75623 -59177 -30375 -7208 -20641
15820b0641j0580J3182K4376J619l6516k7582l0600o949J6705J2399J9751K3311
$$ -20641 -31221 -18039 6337 7956 -28560 -56142 -86742 -93691 -76986 -64587 -44836 -21525
15808b1525j1903Q67K3982j51k159j3213J1227K9937m1934j9793L8036j2711l4091
$$ -21525 -33428 -32561 -8579 -8730 -10889 -24102 -12875 17062 -24872 -44665 -6629 -19340 -53431
15795e3431q507K2214k642L4004j6637k6915q323J4739j188K8763J7871m2698
$$ -53431 -61938 -39724 -42366 -8362 -24999 -51914 -60237 -45498 -46686 -17923 -52 -42750
15783d2750l1775p5L3246L2922n095k7344L636k057K4669J7717j1819J2913j3255
$$ -42750 -74525 -74600 -41354 -8432 -13527 -40871 -37235 -39292 -14623 3094 -8725 4188 -9067
15770i067k677l3931n239K432J6067O496n808k3467K541K3928J636o091R493l425
$$ -9067 -11744 -45675 -50914 -48482 -32415 -25919 -31727 -55194 -52653 -28725 -27089 -33180 -23687 -27112
15756b7112p956J7929N4796k4567m6663M116j3035M1297J7862k3997p27K4367
$$ -27112 -35068 -17139 37657 13090 -33573 -29457 -42492 -1195 16667 -7330 -8057 16310
15744A6310L5711k4007k4416J3619m980k224j8424N710j3512l8604J3268l184
$$ 16310 52021 28014 3598 17217 12237 10013 -8411 -2701 -16213 -54817 -41549 -44733
15732d4733k1414J445M4582L0747J0520n872L922l3085k9802J4436K3919l378
$$ -44733 -66147 -64702 -20120 10627 21147 15275 19197 -13888 -43690 -29254 -5335 -8713
15720h713L802J767j9758J663J2190K521p903j2482K2507j889O533M0947J6119
$$ -8713 -4911 -3144 -22902 -21239 -9049 -6528 -14431 -26913 -4406 -6295 238 41185 57304
15707E7304j9551K374N032r895j3810k3249o335Q942J3555k6687q531J7327L145
$$ 57304 37753 40127 45159 35264 21454 -1795 -8130 812 14367 -12320 -20851 -3524 -379
15694c79k5205L0673P042k3776m3274J9337N9386j0789l0143k1986J9181K2253
$$ -379 -25584 5089 12131 -11645 -54919 -35582 23804 13015 -17128 -39114 -19933 2320
15682B320j2156m032J5933k579l590k5356k7048k3038J6864L4574J1853J1703
$$ 2320 -9836 -13868 2065 -514 -4104 -29460 -56508 -79546 -62682 -28108 -16255 -4552
15670d552J6716o44k3288l1058K573k7278j6997M1734L8736N0191M757l8821K1700
$$ -4552 12164 11520 -11768 -42826 -40253 -67531 -84528 -42794 -4058 46133 50890 12069 33769
15657C3769L601j6275m206j1302k4839j2194J3748J1179K2711L850J4899J1005
$$ 33769 37370 21095 16889 5587 -19252 -31446 -17698 -6519 16192 20042 34941 45946
15645D5946m1267j432k3698j9136k4060K6234K9774J1329J6883p312j6671N135
$$ 45946 4679 3247 -20451 -39587 -63647 -37413 -7639 3690 20573 13261 -3410 1725
15633A725j4841j0530J8093Q585k3207K4492M981J2239J2030N749j3589J610l3751
$$ 1725 -13116 -23646 -5553 3032 -20175 4317 9298 21537 33567 39316 25727 27337 -6414
15620f414N553r847n408J8657j797J420P15K3679k4933m2084l462j0401p933q853
$$ -6414 -861 -10708 -16116 2541 744 2164 2879 26558 1625 -40459 -43921 -54322 -62255 -71108
15606g1108R812J9151J7040l0239k0241K5342j71j5333L1209K2368j0595J5723
$$ -71108 -61296 -42145 -25105 -55344 -75585 -50243 -50414 -65747 -34538 -12170 -22765 -7042
15594g042L135K527M0358j0700M498j4133j4367k6285P564L0711K1315j8692k0409
$$ -7042 -3907 -1380 38978 28278 32776 18643 4276 -22009 -14445 16266 37581 18889 -1520
15581a520l7611j4741J0691J8368M232j0919J5398J9973K1329L5908l457l3682
$$ -1520 -39131 -53872 -43181 -24813 -20581 -31500 -16102 3871 25200 61108 57651 23969
15569B3969n2417l0158k8160P733J2738J9740j0040J7797J4641J216j3693J7040
$$ 23969 -28448 -58606 -86766 -79033 -66295 -46555 -56595 -38798 -24157 -22941 -36634 -19594
15557a9594o721k1336q556j960R59J4265n577K2866n002k6116k794J9501L355
$$ -19594 -26315 -47651 -56207 -58167 -57208 -42943 -48520 -25654 -30656 -56772 -59566 -40065 -36710
15544c6710K4602Q006l6153m788O282K3444J2119K713J9654l787J1367k5736j2915
$$ -36710 -12108 -4102 -40255 -45043 -38761 -15317 -3198 -485 19169 15382 26749 1013 -11902
15531a1902J6500l3691j6241R439l958j940L1031m703n535K3765m133L822j4248
$$ -11902 4598 -29093 -45334 -35895 -39853 -41793 -10762 -15465 -21000 2765 -1368 2454 -11794
15518a1794j9745n03k7932k608K8965K2411J5167J2297K8397K4077j4787l3757
$$ -11794 -31539 -32042 -59974 -62582 -33617 -11206 3961 16258 44655 68732 53945 20188
15506B0188j0129l4249j5766o340K9738R63k0086k1683J9682N1033j4825k7158
$$ 20188 10059 -24190 -39956 -46296 -16558 -15595 -35681 -57364 -37682 13351 -1474 -28632
15494b8632j7457K106M8690j4196j9215q882J190K1542L9844O480j1275k1187
$$ -28632 -46089 -43983 4707 -9489 -28704 -37586 -36396 -14854 24990 31470 20195 -992
15482i92j8083r109J4079k6606K1387K3633m7146p089K3643K3597Q471P374j7562
$$ -992 -19075 -28184 -14105 -40711 -19324 4309 -42837 -49926 -26283 -2686 5785 13159 -4403
15469d403N828J4796r662l401j4074J2657m817m257m1422K072k8603R554J4864
$$ -4403 1425 16221 6559 3158 -10916 1741 -3076 -7333 -48755 -46683 -75286 -65732 -50868
15456e0868k2487J770L4744P228l522q478J3094J0806l0051l0431k0734m329L1997
$$ -50868 -73355 -71585 -36841 -29613 -33135 -41613 -28519 -17713 -47764 -78195 -98929 -103258 -71261
15443g1261K9237K573l617M2811J0365k6426k7541j1992k1129l628L2249K8100
$$ -71261 -42024 -39451 -43068 -257 10108 -16318 -43859 -55851 -76980 -80608 -48359 -20259
15431b0259J0888J6240j265O596R70j6283L6405J9084k7930k3199k010j6191J453
$$ -20259 -9371 6869 5604 12200 13170 -3113 33292 52376 24446 1247 -763 -16954 -15501
15418a5501j6026N366N80q620Q703M458J2460J8504J4235K5500n3874n1533P463
$$ -15501 -31527 -26161 -25581 -34201 -25498 -21040 -8580 9924 24159 49659 -4215 -55748 -48285
15405d8285L315o052K295J2049p207J7567m624p193j202J7255Q272J2796k3707
$$ -48285 -44970 -51022 -48727 -36678 -43885 -26318 -30942 -38135 -39337 -22082 -13810 -1014 -24721
15392b4721L1551j3642r869J7264L0333R76J077l748k9792l3922j3574N8962J5381
$$ -24721 6830 -6812 -16681 583 30916 31892 32969 29221 -571 -34493 -48067 10895 26276
15379B6276o6214l7057L2475K4989K0365j555k1349q481p962r472n213K9803J0897
$$ 26276 -39938 -76995 -44520 -19531 834 -721 -22070 -30551 -38513 -47985 -53198 -23395 -12498
15366a2498J0801O800Q334J7446j8957K544J7918R679k6111k2703O528J5417k5254
$$ -12498 -1697 5103 13437 30883 11926 14470 32388 42067 15956 -6747 -219 15198 -10056
15353a0056n676m538K289J2137J8795J9697k1530j7117J0129O7m592K733K737
$$ -10056 -15732 -20270 -17981 -5844 12951 32648 11118 -5999 4130 4197 -395 2338 5075
15340E075J6131m499j3955k428k3183P793K7390K0481K0568n050m2617l4367p494
$$ 5075 21206 16707 2752 324 -22859 -15066 12324 32805 53373 48323 5706 -28661 -36155
15327c6155J6210K462k1560j2246r676N884L2788J5462l0182L8845l277k2652
$$ -36155 -19945 -17483 -39043 -51289 -60965 -55081 -22293 -6831 -37013 1832 -1445 -24097
15315b4097k3359r919J6679N816N1347K8800L204j1573k5360l0954k8719j9316
$$ -24097 -47456 -57375 -40696 -34880 16467 45267 48471 36898 11538 -19416 -48135 -67451
15303f7451K6422M1096K6966l8149l1255j1552j1412j2780J7769L5017L8186K7871
$$ -67451 -41029 67 27033 -11116 -42371 -53923 -65335 -78115 -60346 -25329 12857 40728
15291D0728j7775k8281j5548o719j4633M898K2648k9076k2798K1767K7264q039
$$ 40728 22953 -5328 -20876 -27595 -42228 -37330 -14682 -43758 -66556 -44789 -17525 -25564
15279b5564j3848n271J3176j4881N451J3849l763J9113J8664K3525k431j189l9104
$$ -25564 -39412 -44683 -31507 -46388 -40937 -27088 -30851 -11738 6926 30451 28020 26831 -12273
15266a2273N017Q630k0800k8686K6176K3889R889n164k3098r379K4020L751r995
$$ -12273 -7256 1374 -19426 -48112 -21936 1953 11842 6678 -16420 -25799 -1779 1972 -8023
15253h023l0568j4507O0J4321K0902J0683J4998p020j9184j7571O769L5519k140
$$ -8023 -38591 -53098 -53038 -38717 -17815 -7132 7866 846 -18338 -35909 -29140 6379 4239
15240D239o768Q017m956J744j664P763O539J0771j046j3617k1956Q625k865j0339
$$ 4239 -2529 5488 532 2276 612 8375 14914 25685 24639 11022 -10934 -2309 -5174 -15513
15226a5513k0066P207J9489l826J6331M8779k9855l659k1291m576K6459l6971
$$ -15513 -35579 -28372 -8883 -12709 3622 52401 22546 18887 -2404 -6980 19479 -17492
15214a7492J3389J3796k9934k2716k5702Q558J4260K8165M9372Q349K1247K6044
$$ -17492 -4103 9693 -20241 -42957 -68659 -60101 -45841 -17676 31696 40045 61292 87336
15202H7336j8402k7293k3432R793k5018k4621m150o352J5338O552K9096j8304
$$ 87336 68934 41641 18209 28002 2984 -21637 -25787 -32139 -16801 -10249 18847 543
15190E43m4103K0940L5226j5509j9593J120J6102K4269r926m265p651k3392j7874
$$ 543 -43560 -22620 12606 -2903 -22496 -21376 -5274 18995 9069 4804 -2847 -26239 -44113
15177d4113j5464J35J7342P914O701k1477j2170M414L2925K0311Q567K0502K4794
$$ -44113 -59577 -59442 -42100 -34186 -27485 -48962 -61132 -56718 -23793 -3482 5085 25587 50381
15164E0381j5652k2790N916j1343k6254j9198P027J889l645l182l252j2272M721
$$ 50381 34729 11939 17855 6512 -19742 -38940 -31913 -30024 -33669 -36851 -40103 -52375 -47654
15151d7654M556j5714N338n117J6221M749N040R656J4023J9884j2329j2435r892
$$ -47654 -43098 -58812 -53474 -58591 -42370 -37621 -32581 -22925 -8902 10982 -1347 -13782 -23674
15138b3674j1050P70p071P393J0487K5547j3858K408L839k6666j3131L0970J2388
$$ -23674 -34724 -33954 -41025 -33632 -23145 2402 -11456 -9048 -5209 -31875 -45006 -14036 -1648
15125a648j4259l0826n022J7713P877K230K07K3977L155j2460k3422O09J5214
$$ -1648 -15907 -46733 -51755 -34042 -26165 -23935 -23728 249 3404 -9056 -32478 -31869 -16655
15112a6655N198k3786L0420J9371l937j7051Q531J1917l8912k008L742m064K5351
$$ -16655 -11457 -35243 -4823 14548 10611 -6440 2091 14008 -24904 -26912 -23170 -27234 -1883
15099a883P353M9242J4653n8528j4515M6336J8007j1393m0137J7241P116k6802
$$ -1883 5470 54712 69365 10837 -3678 42658 60665 49272 9135 26376 33492 6690
15087F690l1665J3731O6984j6347j5410k8312m4517J2470L1744M8868J5671l8787
$$ 6690 -24975 -11244 55740 39393 23983 -4329 -48846 -36376 -4632 44236 59907 21120
15075B1120m4095l471J0762k3067R970L1357K8454n809k4067l0021k3647l3056
$$ 21120 -22975 -26446 -15684 -38751 -28781 2576 31030 25221 1154 -28867 -52514 -85570
15063h5570M069L7003K3577j7741m795L8888L8712J4227k2370l3652m0031j601
$$ -85570 -81501 -44498 -20921 -38662 -43457 -4569 34143 48370 26000 -7652 -47683 -49284
15051d9284K770J2979J9321R559l0215J9563K2690J4864l0767m2210j1244K6589
$$ -49284 -46514 -33535 -14214 -4655 -34870 -15307 7383 22247 -8520 -50730 -61974 -35385
15039c5385J3199N612O194O081n96L515N521k7196k1228L0485Jq123K2028J6336
$$ -35385 -22186 -16574 -10380 -4299 -4895 -1380 4141 -23055 -44283 -13798 -13797 -21920 108 16444
15025A6444j2527k603L7056O91m31L104j7511L985j6316J2812n871j8794j2171
$$ 16444 3917 1314 38370 39061 38630 41734 24223 28208 11892 24704 18833 39 -12132
15012a2132M0435N0407J2735l5122j5082n523j3772k0232j7831K1279K4134J6814
$$ -12132 28303 78710 91445 56323 41241 35718 21946 1714 -16117 5162 29296 46110
15000D6110k1393J3018N444R671j7534j0083J4019P658J3443Q703k3030m4753
$$ 46110 24717 37735 43179 52850 35316 25233 39252 46910 60353 69056 46026 1273
14988A273j2061k2253k0048l5136J3575K9808J7467R114J3812r890p921j1536
$$ 1273 -10788 -33041 -53089 -88225 -74650 -44842 -27375 -18261 -4449 -14339 -22260 -33796
14976c3796j8023r216K0310L6136J1014m3800J9575P884l414j8195j6367K3999
$$ -33796 -51819 -61035 -40725 -4589 6425 -37375 -17800 -9916 -13330 -31525 -47892 -23893
14964b3893K3668j9660L637p210j8267O552L3313M5375J7596J1872O424j2582
$$ -23893 -225 -19885 -16248 -23458 -41725 -35173 -1860 43515 61111 72983 79407 66825
14952F6825m3365L891K0116j8765J058K0999m504j2341j1292J1538L593n18K920
$$ 66825 23460 27351 47467 28702 29760 50759 46255 33914 22622 34160 37753 37235 40155
14939D0155L350J9013K1802k2474k5612J0896j1700j814j692J749k3185K39r670
$$ 40155 43505 62518 84320 61846 36234 47130 35430 33616 31924 33673 10488 10727 1057
14926A057J2991j5115r323m179M920j6474k1360K6139J9214j7815M953N460J5251
$$ 1057 14048 -1067 -10390 -14569 -9649 -26123 -47483 -21344 -2130 -19945 -14992 -9532 5719
14913E719r82j6601O259j570P867N685k0561j9189o824Q28k154k509J652M170
$$ 5719 4737 -11864 -5605 -7175 692 6377 -14184 -33373 -40197 -39369 -41523 -44032 -42380 -38210
14899c8210J5565J647K118J4755k766J1380K9721k969l1892m0475l1366J3200
$$ -38210 -22645 -20998 -18880 -4125 -6891 4489 34210 31241 -651 -41126 -72492 -59292
14887e9292N0120O664J1673J2082P572M426l7005k3392r180K9403L4360r480j7763
$$ -59292 -9172 -2508 9165 21247 28819 33245 -3760 -27152 -36332 -6929 27431 17951 188
14874A88L030K4759J2888o7401l1525M1643O0615L0134R889k7668l4908P785j0841
$$ 188 3218 27977 40865 -26536 -58061 -16418 44197 74331 84220 56552 21644 29429 18588
14861A8588j5687l09N762j8263j8780J8525L3126L8164O308j1024k2816n612R033
$$ 18588 2901 2592 8354 -9909 -28689 -10164 22962 61126 67434 56410 33594 27982 37015
14848C7015q075k5093K355K1793j7052m1313M579J9863L2666j2432j7178j4045
$$ 37015 28940 3847 6202 27995 10943 -30370 -25791 -5928 26738 14306 -2872 -16917
14836a6917k724J4344N532J5776J4051p073j0563q06j4126K5625J8097l1237l4956
$$ -16917 -19641 -5297 235 16011 30062 22989 12426 11620 -2506 23119 41216 9979 -24977
14823b4977l309J575M6056n596k7507j3257j9673J6064J5602P370K2377J765k5145
$$ -24977 -28286 -26711 19345 13749 -13758 -27015 -46688 -30624 -15022 -7652 14725 16490 -8655
14810h655o859k4622n043M5039K7022k8853k3091l5291P856J1786L645l1346j111
$$ -8655 -15514 -40136 -45179 -140 26882 -1971 -25062 -60353 -52497 -40711 -37066 -68412 -69523
14797f9523J2897j9843k556m008L9112L5243N424k5845j7436K3280l993r707J6828
$$ -69523 -56626 -76469 -79025 -83033 -43921 -8678 -3254 -29099 -46535 -23255 -27248 -36955 -20127
14784b0127K4275p91P014o079M742r22k7013L582L0592J7803J3735J226J9475
$$ -20127 4148 3357 10371 4292 9034 8112 -18901 -15319 15273 33076 46811 48037 67512
14771F7512j458k9555l9567O207N1852L4798k8441m8368l3857N404l067M60j7159
$$ 67512 66054 36499 -3068 3139 54991 89789 61348 12980 -20877 -15473 -18540 -18080 -35239
14758c5239M6010J4122j3302l225J8968M5951k0714l1841Q554k7336j5303K0090
$$ -35239 10771 24893 11591 8366 27334 73285 52571 20730 29284 1948 -13355 6735
14746F735j5679q631J0135M4623J3677K1790J4187J3936j8219n0653Q469K3982
$$ 6735 -8944 -17575 -7440 37183 50860 72650 86837 100773 82554 31901 40370 64352
14734F4352k4578l7236n042k054M658k8154m454Q60K2742o871K3990j9182n935
$$ 64352 39774 2538 -2504 -4558 100 -28054 -32508 -31648 -8906 -15777 8213 -10969 -16904
14721a6904K2652J8632l65k277J4119J2887j7365m0166J3153J0754k5965k20J5268
$$ -16904 5748 24380 24015 21738 35857 48744 31379 -8787 4366 15120 -10845 -11065 4203
14708D203K67J9839K4171K633r938q701j8775K029n2959K7930N7795j2389j3904
$$ 4203 4470 24309 48480 51113 41175 32474 13699 15728 -37231 -9301 48494 36105 22201
14695B2201J2251N194l9898l2549k055k2686K4911K6630K1575o766k4838P988
$$ 22201 34452 39646 -252 -32801 -34856 -57542 -32631 -6001 15574 8808 -16030 -8042
14683h042L3148O048l647p055J12r627J013j0753j2804L195J4384N193O897L3046
$$ -8042 25106 31154 27507 20452 20564 10937 11950 1197 -11607 -8412 5972 11165 18062 51108
14669E1108K0268l7678l2512k3979O878j2875j3608K4053K3183Q859l0207r643
$$ 51108 71376 33698 1186 -22793 -15915 -28790 -42398 -18345 4838 13697 -16510 -26153
14657b6153K8347K5777K1357n968j1462j0126L6856k687k3386m1830k0851L936
$$ -26153 2194 27971 49328 43360 31898 21772 58628 55941 32555 -9275 -30126 -26190
14645b6190J6755m946R775J7789N760q824J2865k696j916j3998P790L178J4295
$$ -26190 -9435 -14381 -4606 13183 18943 10119 22984 20288 18372 4374 12164 15342 29637
14632B9637n528k041P937l7608J5835K790r135L0240J3886O715J8769r044k6614
$$ 29637 24109 22068 30005 -7603 8232 11022 1887 32127 46013 52728 71497 62453 35839
14619C5839j1792L920n296P350m67k1513j8212J5098K7354j8875k5983k311j3479
$$ 35839 24047 27967 22671 30021 29554 8041 -10171 4927 32281 13406 -12577 -14888 -28367
14606b8367r675J401O57L253J7274J1898J2718j0318M159J7368q59k59P694l399
$$ -28367 -38042 -36641 -35984 -32731 -15457 -3559 9159 -1159 3000 20368 19509 19250 26944 23545
14592B3545j296P131K0058L556l5577N879n384k8435j3732K7504M2076R538k5503
$$ 23545 22249 29380 49438 52994 17417 23296 17912 -10523 -24255 3249 45325 54863 29360
14579B9360l6592N735K5823p752j8586J8917J5296M54j8651K7463L7636j2048
$$ 29360 -7232 -1497 24326 16574 -2012 16905 32201 32655 14004 41467 79103 67055
14567F7055n6532j4793k9661O311L6127N814K710J2676l5860o705K3749J4016
$$ 67055 10523 -4270 -33931 -27620 8507 14321 17031 29707 -6153 -12858 10891 24907
14555B4907j2363m6080Q858J7024K127J3571K2131j0091l1878j7165j9581l2750
$$ 24907 12544 -33536 -24678 -7654 -5527 8044 30175 20084 -11794 -28959 -48540 -81290
14543h1290K0813K3876n674L3546K1208K239J771q556l4198P033K9326j5187J2706
$$ -81290 -60477 -36601 -42275 -8729 12479 14718 16489 7933 -26265 -19232 10094 -5093 7613
14530G613J3497L700j429M481J7524K2821j9854l2174l2472l9349k7905J6237
$$ 7613 21110 24810 23381 27862 45386 68207 48353 16179 -16293 -55642 -83547 -67310
14518f7310N9967N5784M599l4858j1471P215k2540k1668P632K3897L2169m884
$$ -67310 -7343 48441 53040 18182 6711 13926 -8614 -30282 -22650 1247 33416 28532
14506B8532j3313J7709l283m6615j3795J2129K2545R609N322L804K728l2398j5085
$$ 28532 15219 32928 29645 -16970 -30765 -18636 3909 13518 18840 22644 25372 -7026 -22111
14493b2111K6540J6692J8221l6234j196M043O258L621J5672k5646j4132Q493O497
$$ -22111 4429 21121 39342 3108 1912 5955 12213 15834 31506 5860 -8272 221 6718
14480F718J8556j3059l5253n4244j8124L6395M4340O884j5928L2733J1488M550
$$ 6718 25274 12215 -23038 -77282 -95406 -59011 -14671 -7787 -23715 9018 20506 25056
14468B5056K209J1704m9971J6298K1827O165m4107j9887J5990J4525R55j3913
$$ 25056 27265 38969 -11002 5296 27123 33288 -10819 -30706 -14716 -191 764 -13149
14456a3149O688J8286J8031l4300r717J2256K7034j1630k1310l0750r676J87J7887
$$ -13149 -6461 11825 29856 -4444 -14161 -1905 25129 13499 -7811 -38561 -48237 -48050 -30163
14443c0163O159k5326l1500k258K2685K9613L1069L8497K547K055J3988j1654
$$ -30163 -24004 -49330 -80830 -83088 -60403 -30790 279 38776 41323 43378 57366 45712
14431D5712l6432r415L3873J6141j6356j7676K2391j4572o263o598K992L645j0808
$$ 45712 9280 -135 33738 49879 33523 15847 38238 23666 17403 10805 13797 17442 6634
14418F634m118r831o360M070J7413j4958n287P855k3875o195P409j8853k1330
$$ 6634 2516 -7315 -13675 -9605 7808 -7150 -12437 -4582 -28457 -34652 -27243 -46096 -67426
14405f7426l882N6288Q052K2406M45j4103q542J0547K9757k5069j5873L9362J8787
$$ -67426 -71308 -15020 -6968 15438 15883 1780 -6762 3785 33542 8473 -7400 31962 50749
14392E0749o849M426p071k0411n634K6067Q282k668Q686J683k9610j3675p302
$$ 50749 43900 48326 41255 20844 15210 41277 49559 46891 55577 57260 27650 13975 6673
14379F673J2542q218O089L4332j9673l2973m0096J0405L6929m750J2165J4933
$$ 6673 19215 10997 17086 51418 31745 -1228 -41324 -30919 6010 1260 13425 28358
14367B8358j2302o74k1507K830K462r518J8071J6572l9300R762K7646J4297o294
$$ 28358 16056 15382 -6125 -3295 -833 -10351 7720 24292 -15008 -5246 22400 36697 30403
14354C0403l594J8434J521k7799l7989J2046J3690r155l3970P870K9784M9936
$$ 30403 26809 45243 46764 18965 -19024 -6978 6712 -2443 -36413 -28543 1241 51177
14342E1177J7443j5817k0399k2028k8839m459N1463M3784k9144j0345j6992l9591
$$ 51177 68620 52803 32404 10376 -18463 -22922 28541 72325 43181 32836 15844 -23747
14330b3747O048k726M3269K8849m192M328l0100K5900K647l130K711k6624o5636
$$ -23747 -17699 -20425 22844 51693 47501 51829 21729 47629 50276 47146 49857 23233 -42403
14317d2403L9642L5503J0174L158j3386K376k0980J8834K8068K133L182k0792
$$ -42403 -2761 32742 42916 46074 32688 35064 14084 32918 60986 63119 66301 45509
14305D5509j1739r119r142p898m954K1292n362k6705k4826j0011P875M0140J1839
$$ 45509 33770 24651 15509 7611 2657 23949 18587 -8118 -32944 -42955 -35080 5060 16899
14292A6899j1448K0086R738K1294j5299l8050J078Q380J7626o345l5314r168r483
$$ 16899 5451 25537 35275 56569 41270 3220 4298 12678 30304 23959 -11355 -20523 -30006
14279c0006J3515J6458K1131K4238J4744n6588r892L0326K5116J648l6868j5906
$$ -30006 -16491 -33 21098 45336 60080 3492 -6400 23926 49042 50690 13822 -2084
14267b084l797j0692M499m1036M367K4042j1924k4771L020L4725J5720j0373J2872
$$ -2084 -5881 -16573 -12074 -53110 -48743 -24701 -36625 -61396 -58376 -23651 -7931 -18304 -5432
14254e432R293j995P466J606L023J5874J235l6127k4624k2757K3082L1280K6215
$$ -5432 3861 1866 9332 10938 13961 29835 31070 -5057 -29681 -52438 -29356 1924 28139
14241B8139M92m6138j5879K4692K2311L486k1332l650M3473J1030k3459J015Q865
$$ 28139 28631 -17507 -33386 -8694 13617 17103 -4229 -7879 35594 46624 23165 24180 33045
14228C3045L5231j2294l5603k1653q672M618L802J7649J8517l6417k2786J7636
$$ 33045 68276 55982 20379 -1274 -9946 -5328 -1526 16123 34640 -1777 -24563 -6927
14216f927p334m875n666k325j7602j3164J0725k289J7123j2347O299j0250K6480
$$ -6927 -14261 -19136 -24802 -27127 -44729 -57893 -47168 -49457 -32334 -44681 -38382 -48632 -22152
14203b2152J9637p520k4304J4743o262k2002M9592L9202K148o5725l1871j3857
$$ -22152 -2515 -10035 -34339 -19596 -25858 -47860 1732 40934 43082 -22643 -54514 -68371
14191f8371J1013L9722k1083l107J8278J9630j881Q73K2822M643K7356L1656l709
$$ -68371 -57358 -17636 -38719 -41826 -23548 -3918 -5799 -4926 17896 22539 49895 81551 77842
14178G7842j5508j3136k5644n875J1690L2802j320L251j1603k9262q279j1258
$$ 77842 62334 49198 23554 17679 29369 62171 60851 64102 52499 23237 14958 3700
14166C700J2718L1333j2902l8480j0678k780j661l1785p161K2221L54M564j62
$$ 3700 16418 47751 34849 -3631 -14309 -17089 -18750 -50535 -57696 -35475 -35121 -30557 -30719
14153c0719L6097L9475k320j5697j4890r436M435j1546J0115L310J8804p533Q408
$$ -30719 5378 44853 42533 26836 11946 2510 6945 -4601 5514 8824 27628 20095 28503
14140B8503J43K2580N848L475j9774j8392j1674O936J7288K1188J8435j1328k8280
$$ 28503 28646 51226 57074 60549 40775 22383 10709 17645 34933 56121 74556 63228 34948
14127C4948j0546j6382J7420K3299N362l0311j6684J0530J3359r700K0002K2128
$$ 34948 24402 8020 25440 48739 54101 23790 7106 17636 30995 21295 41297 63425
14115F3425k5213k1591k4712P690j421J0609q757l7839K6383M1770o651o029L0716
$$ 63425 38212 16621 -8091 -401 -1822 8787 30 -37809 -11426 30344 23693 17664 48380
14102D8380j0523j5891j9673j6170q324K0767J0585J4062l785l5165Q472K9163
$$ 48380 37857 21966 2293 -13877 -22201 -1434 9151 23213 19428 -15737 -7265 21898
14090B1898L4746n126o0237l2063m632K6699K720r352k7288J3710L5021J9218
$$ 21898 56644 51518 -8719 -40782 -45414 -18715 -15995 -25347 -52635 -38925 -3904 15314
14078A5314M676j3543N830M367j1386J7983k4000J664J465J83J9833n819k2954
$$ 15314 19990 6447 12277 16644 5258 23241 -759 905 2370 2553 22386 16567 -6387
14065f387J2165K6377L22J867k137k0474j6381L780K3924J1796P391l1935L146
$$ -6387 5778 32155 32477 34344 32207 11733 -4648 -868 23056 34852 42243 10308 13454
14052A3454M820J6564K9152k1099k1213j7030j7802J242r117k6749K4987J4739
$$ 13454 18274 34838 63990 42891 21678 4648 -13154 -11912 -21029 -47778 -22791 -8052
14040h052O447L2807l2398q870J5421m927K3806M328l1720O372N0781N348l7634
$$ -8052 -1605 31202 -1196 -10066 5355 428 24234 28562 -3158 3214 53995 59343 21709
14027B1709K343R604J0617l3798P721K0124L2290P868j9083k058J2799l1255n608
$$ 21709 24052 33656 44273 10475 18196 38320 70610 78478 59395 57337 70136 38881 33273
14014C3273P942k1237k7628K8287J221l313p416K4372Q360M18m446l3190j7749
$$ 33273 41215 19978 -7650 20637 21858 18545 11129 35501 43861 44279 39833 6643 -11106
14001a1106K1940L7315n854k7636k1876N386Q36m751o445j1521L565K7326Q291
$$ -11106 10834 48149 42295 14659 -7217 -1831 -995 -5746 -12191 -23712 -20147 7179 15470
13988A5470J6883n126o568l289j71m795N38K2280J8681j9686j197L140O051L9392
$$ 15470 32353 27227 20659 17370 17199 12404 12942 35222 53903 34217 33020 36160 42211 81603
13974H1603J3067l2427m2652k6750j9575J2812L5352j4439J3703K2111K4329j8699
$$ 81603 94670 62243 19591 -7159 -26734 -13922 21430 6991 20694 42805 67134 48435
13962D8435k415k550k1452j646L8419n428m1712k2951n276L7343K0894j6165l0178
$$ 48435 46020 43470 22018 20372 58791 53363 11651 -11300 -16576 20767 41661 25496 -4682
13949d682L9487j4233n2605L542J2891K0291R92k9748K0929N7833K8165j183R812
$$ -4682 34805 20572 -32033 -28491 -15600 4691 5683 -24065 -3136 54697 82862 81679 91491
13936I1491r782k4530k2611j9962K5874K1856k1537J3885j6668m2141L28K8836
$$ 91491 81709 57179 34568 14606 40480 62336 40799 54684 38016 -4125 -3797 25039
13924B5039j3863r539m901K6677J6566K261l2536N171P436R865o684j1306j7292
$$ 25039 11176 1637 -3264 23413 39979 42240 9704 14875 22311 32176 25492 14186 -3106
13911c106R188O2334J6269j4713l176Q09k634j1017M114K7707l0481k4421M262
$$ -3106 6082 68416 84685 69972 66796 67605 64971 53954 58068 85775 55294 30873 35135
13898C5135M822k242q454J8989j5157k3035p78m5912j6457K3466M9828K3127j4805
$$ 35135 39957 37715 29261 48250 33093 10058 9280 -36632 -53089 -29623 20205 43332 28527
13885B8527P450p770k6364k830K2254J2419J964k1705k1654j2052L0644M1419
$$ 28527 35977 28207 1843 -987 21267 33686 35650 13945 -7709 -19761 10883 52302
13873E2302P068j8720n40k44j2269l434K4332L6311j2645k2877K0194j436j1653
$$ 52302 59370 40650 40110 39866 27597 24163 48495 84806 72161 49284 69478 68042 56389
13860E6389r410j5030J559K688K261j2487k1840L7313L3107J2818j4267k0096
$$ 56389 46979 31949 33508 36196 38457 25970 4130 41443 74550 87368 73101 53005
13848E3005j2702n401k3313J7836j0889m237L726J3619J2460k6906k3896L822
$$ 53005 40303 34902 11589 29425 18536 14299 18025 31644 44104 17198 -6698 -2876
13836b876J7444j6756Q495P096o805K0374k418m6051J519n86r552K3423K8294
$$ -2876 14568 -2188 6307 13403 6598 26972 24554 -21497 -19978 -20564 -30116 -6693 21601
13823B1601P485k9166m5722J5961j9756L5664J6860J459L854P673J2010j0878
$$ 21601 29086 -80 -45802 -29841 -49597 -13933 2927 4386 8240 15913 27923 17045
13811A7045q422J0486K137l661m726O132j2916j5726N794j5450K2568N742k1884
$$ 17045 8623 19109 21246 17585 12859 18991 6075 -9651 -3857 -19307 3261 9003 -12881
13798a2881J230K3022j5975l5911K0490J1514k8353R871L5077K2248j4090j8377
$$ -12881 -11651 11371 -4604 -40515 -20025 -8511 -36864 -26993 8084 30332 16242 -2135
13786b135J9142K412K1134J9448m740j3269j7684j1775k7463J0949J2312j1235
$$ -2135 17007 19419 40553 60001 55261 41992 24308 12533 -14930 -3981 8331 -2904
13774b904k3295J6123J8344K9038m514k1759o154J4741m823J5059J6305n179K0469
$$ -2904 -26199 -10076 8268 37306 32792 11033 4879 19620 14797 29856 46161 40982 61451
13761F1451l5548o4932j2298M6975N1233k742J1183r760k4474J2362j4343o190
$$ 61451 25903 -39029 -51327 -4352 46881 44139 55322 45562 21088 33450 19107 12917
13749A2917J7540o439j4498l8537J7374K8635j1364k9291l702n837n755j703m919
$$ 12917 30457 24018 9520 -29017 -11643 16992 5628 -23663 -27365 -33202 -38957 -40660 -45579
13736d5579p929M763J7813L3414K4072M920j3953j1338J1972J4858K0314j8804
$$ -45579 -53508 -48745 -30932 2482 26554 31474 17521 6183 18155 33013 53327 34523
13724C4523j2018l2631O72l1023o064K4640K2717k3488K1419N1119j7848J7295
$$ 34523 22505 -10126 -9454 -40477 -46541 -21901 816 -22672 -1253 49866 32018 49313
13712D9313l2478k8353K6223J4098J7189k9632j4935L3509K3485l674n8558k3186
$$ 49313 16835 -11518 14705 28803 45992 16360 1425 34934 58419 54745 -3813 -26999
13700b6999L3315K9930J4585j4706K7666J517k1141J367q483j5882m9474n415
$$ -26999 6316 36246 50831 36125 63791 65308 44167 45534 37051 21169 -28305 -33720
13688c3720l3415j810N897K0620K6544K5045K491J5665j9828k72K018l5035K53
$$ -33720 -67135 -68945 -63048 -42428 -15884 9161 11652 27317 7489 7217 9235 -25800 -25547
13675b5547L2173L077r11K1521M1559j4891J4971k7597q431L23p563P274j7536
$$ -25547 6626 9703 8792 30313 71872 56981 71952 44355 35924 36247 28684 35958 18422
13662A8422l0121q340k092J7989J2689J2161j7923j6067j2913K3236K9853J4938
$$ 18422 -11699 -20039 -22131 -4142 8547 20708 2785 -13282 -26195 -2959 26894 41832
13650D1832n578J3998Q954j1083k7716K438J1264R341k3616j8796P751Q487j6864
$$ 41832 36254 50252 59206 48123 20407 22845 34109 43450 19834 1038 8789 17276 412
13637D12K657J9p924K227K138j183K0273m212j8983L5943N055K501k4308K109
$$ 412 3069 3088 -4836 -2609 -471 -1654 18619 14407 -4576 31367 36422 38923 14615 16724
13623A6724j9071j2075P690L4992j3187l769N723j029n1577K6520J7476L732k5369
$$ 16724 -2347 -14422 -6732 28260 15073 11304 17027 15998 -35579 -9059 8417 12149 -13220
13610a3220k8822l6597K4868K570K1298J5023m040J3237J8945K3518J013j3597
$$ -13220 -42042 -78639 -53771 -51201 -29903 -14880 -18920 -5683 13262 36780 37793 24196
13598B4196l743M705j7420p757o637q869N748J0782J9776J7617o936J9831l6962
$$ 24196 20453 25158 7738 -19 -6656 -15525 -9777 1005 20781 38398 31462 51293 14331
13585A4331k3520J2824j3112L7421K1963L0495Q543j1699l9988r028k537o349
$$ 14331 -9189 3635 -9477 27944 49907 80402 88945 77246 37258 28230 25693 19344
13573A9344M47j405j4202M099L4778L641L4655k553k9745O8557O4367K8986J4134
$$ 19344 19791 18386 4184 8283 43061 46702 81357 78804 49059 117616 181983 210969 225103
13560B25103N193o3571o5893k2181m1056k1794j4698J3863k1051j1120L0227j716
$$ 225103 230296 166725 100832 78651 37595 15801 1103 14966 -6085 -17205 13022 11306
13548A1306K2605j4757k4374L5982L780l4523j5613J9179j59l892J8914n59l184
$$ 11306 33911 19154 -5220 30762 34542 19 -15594 3585 3426 -466 18448 17889 14705
13535A4705m358L5215J3889R231J3923M925K632j2738n2394l3907M932r552L5717
$$ 14705 10347 45562 59451 68682 82605 87530 90162 77424 25030 -8877 -3945 -13497 22220
13522B2220L604m1647K0238R988J2923j1427l7081M029O210J4281k1172K2184
$$ 22220 25824 -15823 4415 14403 27326 15899 -21182 -17153 -10943 3338 -17834 4350
13510D350N5585n098J6024m949j1643K4283n935K136l170n755k547l0906j5930
$$ 4350 59935 54837 70861 65912 54269 78552 72617 74753 71583 65828 63281 32375 16445
13497A6445n319O83Q140J9012J8598r397n0135j9665M4665k2794k9910N021J3357
$$ 16445 11126 11809 19949 38961 57559 48162 -1973 -21638 23027 233 -29677 -24656 -11299
13484a1299L558J4995J1778M065o059J2773p991q835K4395M7642k4879k5614O263
$$ -11299 -7741 7254 19032 23097 17038 29811 21820 12985 37380 85022 60143 34529 40792
13471D0792K2969j5060r657J8222L552j5110m0437p729J5552L5535k863J1440
$$ 40792 63761 48701 39044 57266 60818 45708 5271 -2458 13094 48629 45766 57206
13459E7206m290j6526K4025J338j6914K9138J2519j9268n379K962j3559k3441
$$ 57206 52916 36390 60415 61753 44839 73977 86496 67228 61849 64811 51252 27811
13447B7811k9002K28m9645K4763J9609J282N769Q859j6018q41k6906q058M0480
$$ 27811 -1191 -963 -50608 -25845 -6236 -4954 815 9674 -6344 -7185 -34091 -42149 -1669
13434a669M935j3963n316J1721K3326K765J4311O340k1919K9595J3070l2190R808
$$ -1669 3266 -10697 -16013 -4292 19034 21799 36110 42450 20531 50126 63196 31006 40814
13421D0814JM971j1543j0456j6906j5802J9429j4555j6385p880J3621J1375J0786
$$ 40814 40815 45786 34243 23787 6881 -8921 10508 -4047 -20432 -28312 -14691 -3316 7470
13408G470K0237J2175K1958k0214j1467J6103k6046k241J7615q124Q04P822J3959
$$ 7470 27707 39882 61840 41626 30159 46262 20216 17975 35590 27466 28270 36092 50051
13395E0051J729l1382K9110J1719j9937Q837k793J2661J7475J2401j6680m3945
$$ 50051 51780 20398 49508 61227 41290 50127 47334 59995 77470 89871 73191 29246
13383B9246k3657j449P119l039J6398k3744K8369K4634K1334K3908j9928m616
$$ 29246 5589 4140 11259 8220 24618 874 29243 53877 75211 99119 79191 74575
13371G4575j1856l1614l5885j5818K7534J7753R909K9579J2289O275P009k4347
$$ 74575 62719 31105 -4780 -20598 6936 24689 34598 64177 76466 82741 89750 65403
13359F5403j0615q18o912N724m559j7462Q668N272J1275K7429K7090m848k4027
$$ 65403 54788 53970 47058 52782 48223 30761 39429 44701 55976 83405 110495 105647 81620
13346H1620m1496k2479M419j0365M9336J3793M321O093p221l4965r138o223Q308
$$ 81620 40124 17645 22064 11699 61035 74828 79149 85242 78021 43056 33918 27695 36003
13333C6003N574j0014j5825K9910J0009j9764L742j0703k4490k539M4550J5088
$$ 36003 41577 31563 15738 45648 55657 35893 39635 28932 4442 1903 46453 61541
13321F1541n9710j779K8194K0783j5640k5108K9620J9460K541J021k5197l1814
$$ 61541 1831 52 28246 49029 33389 8281 37901 57361 59902 60923 35726 3912
13309C912L1377J1848j7182j1966Q73J8370J4141K5936j1047j7165j0343J0040
$$ 3912 35289 47137 29955 17989 18862 37232 51373 77309 66262 49097 38754 48794
13297D8794L2268L138j729j6585O501o631J4144J0417p902k4931l2916J5947K4088
$$ 48794 81062 84200 82471 65886 72387 65756 79900 90317 82415 57484 24568 40515 64603
13284F4603J4770J7469m9811n4192J1521L6163J3072O986q183j2561k3610p100
$$ 64603 79373 96842 47031 -7161 4360 40523 53595 60581 52398 39837 16227 9127
13272I127j718N87j4712K1579K8119J8768k01j0664o080J459K4791K4116m9184
$$ 9127 7409 7996 -6716 14863 42982 61750 61549 50885 44805 46264 71055 95171 45987
13259D5987j5790J9335l9979L976L1489L868m815K2001n869k1595j6775l3335
$$ 45987 30197 49532 9553 13529 45018 48886 44071 66072 60203 38608 21833 -11502
13247a1502k1786L034J7508K9605J9564n509O636L6279L0757L11m650k1671o4447
$$ -11502 -33288 -30254 -12746 16859 36423 30914 37550 73829 104586 104897 100247 78576 14129
13234A4129l4856l003K4689M5481l254j7209Q529k3219J6138J5279J5340L1943
$$ 14129 -20727 -23730 959 46440 43186 25977 34506 11287 27425 42704 58044 89987
13222H9987M3011l4728J974k1761j9692l6743L158n081r80J833J4632K2887j807
$$ 89987 132998 98270 100244 78483 58791 22048 25206 20125 19145 20978 35610 58497 56690
13209E6690J451m561m9R821L8332O070K3522k7173k8687J3877N63J7258K0180
$$ 56690 58141 53580 53531 63352 101684 107754 131276 104103 75416 89293 89856 107114 127294
13196A27294j2270l1766k6176j4745m2J4418L130J040j3825k5227R642O562L786
$$ 127294 115024 83258 57082 42337 42295 56713 59843 60883 47058 21831 31473 38035 41821
13183D1821K4695j7597j4574L3761J6436l4075j9471j1344M2306N0081N228K1044
$$ 41821 66516 48919 34345 68106 84542 50467 30996 19652 61958 112039 117267 138311
13171A38311J4705j5308n7309l6817J1274L8531M9560M9127L4415M8484Q9753
$$ 138311 153016 137708 80399 43582 54856 93387 142947 192074 226489 274973 364726
13160C64726J13211J61834J86620K41754L18573K65615R6583j12744k50969k75775
$$ 364726 477937 639771 826391 1068145 1386718 1652333 1748916 1636172 1385203 1109428
13150A109428k71124j97139j30496q9037o5075r5219n2558k0167m8293j007K657
$$ 1109428 838304 641165 510669 421632 356557 261338 208780 188613 140320 139313 141970
13139A41970m1269q041N7069K5258n984j2820k5781j2183R403J9365j2839n2323
$$ 141970 100701 92660 149729 174987 169003 156183 130402 118219 127622 146987 134148 81825
13127H1825l1074p470J8558N571M3279q16o686J7898m3204q229j5688L4669r359
$$ 81825 50751 43281 61839 67410 110689 109873 103187 121085 77881 69652 53964 88633 79274
13114G9274n157r137k076J522O379K1172l4649l9532O842J4968n023M7734j5175
$$ 79274 74117 64980 62904 64426 70805 91977 57328 17796 24638 39606 34583 82317 67142
13101F7142j4815L8668K2481J6699n586l1807l319J0522J1029j4174K3185k7568
$$ 67142 52327 90995 113476 130175 124589 92782 89463 99985 111014 96840 120025 92457
13089I2457K3996j532j2802k5461q973j0669J1670L3319J0548j4972M641l825
$$ 92457 116453 114921 102119 76658 67685 57016 68686 102005 112553 97581 102222 98397
13077I8397j8553J7765k4633n3533M475K2575M7319j1769l3746j3083K2166K0875
$$ 98397 79844 97609 72976 19443 23918 46493 93812 82043 48297 35214 57380 78255
13065G8255q284l0316M337L7679L1892l3781l5574j1483K9668K0088o9J734J8772
$$ 78255 69971 39655 43992 81671 113563 79782 44208 32725 62393 82481 82412 84146 102918
13052A02918J1937n591J7869J7092j2865R346m3303m8129m081N3850L2674m2250
$$ 102918 114855 109264 127133 144225 131360 140706 97403 49274 45193 99043 131717 89467
13040H9467j1445M4267j8228n4101L9142N040K0325L2804j1737m0827l024M6729
$$ 89467 78022 122289 104061 49960 89102 94142 114467 147271 135534 94707 91683 138412
13028A38412J3937k7164m1706m556j2422j6891N750L3216j6953l5643J1899J7721
$$ 138412 152349 125185 83479 78923 66501 49610 55360 88576 71623 35980 47879 65600
13016F5600p05K1314R140L0893Q617o361l9384j111m441j2136M6690N1775n21
$$ 65600 64895 86209 95349 126242 134859 128498 89114 88003 83562 71426 118116 169891 169370
13003A69370l9189k0587n231l4297J9710l2732k048M1839L7349J4906j0283l1533
$$ 169370 130181 109594 104363 70066 89776 57044 54996 96835 134184 149090 138807 107274
12991A07274L407P006m210j3916p724K298J0712M1395J6551k2754m312j300O819
$$ 107274 110681 117687 113477 99561 91837 94135 104847 146242 162793 140039 135727 134427 141246
12978A41246r906n448k4502K7821N8366M0800K5204O4117N5454K4054k1580n6641
$$ 141246 131340 125892 101390 129211 187577 228377 253581 317698 373152 397206 375626 318985
12966C18985m2118k9297m5681l1071j6564J3537O882j6820J7699N68O260l275
$$ 318985 276867 247570 201889 170818 154254 167791 174673 157853 175552 176120 182380 179105
12954A79105j5362J561j4807l5181K1495K0947J3382M4339j2853j0530K3604M1736
$$ 179105 163743 165304 150497 115316 136811 157758 171140 215479 202626 192096 215700 257436
12942B57436j0598M2744L4945M0482O9044R8542J08636J39252K16826L08899K80966
$$ 257436 246838 289582 324527 365009 434053 532595 641231 780483 997309 1306208 1587174
12931A587174J88834o3141j95892k84384k38226j90849j52271j45821o9192r0154
$$ 1587174 1776008 1712867 1516975 1232591 994365 803516 651245 505424 436232 346078
12921C46078o8439o2961J3794K2269Q240j1536K7012r7l7143k1310O859J7238
$$ 346078 277639 214678 228472 250741 258981 247445 274457 274360 237217 215907 222766 240004
12909B40004q698k3996k8010j9287M795m132R986r27K8742j643k3094k6717J5523
$$ 240004 231306 207310 179300 160013 164808 160676 170662 169735 198477 196834 173740 147023 162546
12896A62546L3655k8485K26K0808J5223j4728Q993j3599j9283j926K1575n849
$$ 162546 196201 167716 167942 188750 203973 189245 198238 184639 165356 163430 185005 179156
12884A79156J7182L377O2303J3078l7355j4600j8065n453J6162k3609J6640K8224
$$ 179156 196338 199715 262018 275096 237741 223141 205076 199623 215785 192176 208816 237040
12872B37040J0659M894l765j6148k7995k7057k3534K83j0100k2612P903N1509
$$ 237040 247699 252593 248828 232680 204685 177628 154094 154377 144277 121665 129568 181077
12860A81077M3304K3693L1256m2499k6666M74P460J2286k442N6J794K7749L5798
$$ 181077 224381 248074 279330 236831 210165 210639 218099 230385 227943 227999 229793 257542 293340
12847B93340J8166q017j7288J3554J9233O9366K4321P046l0723n9885j7339l8179
$$ 293340 311506 303489 286201 299755 318988 388354 412675 419721 388998 329113 311774 273595
12835B73595j419j900J2983j0509k6090K2739j7973m2665L7336J276K3134j2780
$$ 273595 272176 270276 283259 272750 246660 269399 251426 208761 246097 247373 270507 257727
12823B57727J1833M3644K0697o417N218k2760J9986L0560J0881O039J1453L538
$$ 257727 269560 313204 333901 327484 332702 309942 329928 360488 371369 377408 388861 392399
12811C92399m896J9976J3850j1368J2630J0778Q772M4668J2668K1564N2831J3508
$$ 392399 387503 407479 421329 409961 422591 433369 442141 486809 499477 521041 573872 587380
12799E87380j0731N424P047L19q257m0744R194K2082K3400J6927j5229J7446L3288
$$ 587380 576649 582073 589120 589439 581182 540438 549632 571714 595114 612041 596812 614258 647546
12786F47546P2750K3540m3472k5048J5734L5870P932L5674L9166L3071M5404J0859
$$ 647546 720296 743836 700364 675316 691050 726920 734852 770526 809692 842763 888167 899026
12774H99026L4905m357l706r975j4261L8886J02279M6401K0871J9311N6035P2252
$$ 899026 933931 929574 925868 915893 901632 940518 1042797 1089198 1110069 1129380 1185415 1257667
12762A257667M5639N501M8261J11277O8539Q6516R2011R1316Q2283J09374J20325
$$ 1257667 1303306 1308807 1357068 1468345 1536884 1623400 1715411 1806727 1889010 1998384 2118709
12751B118709J41623J61387J62636J79983J97981J85247K23530K62978K86074
$$ 2118709 2260332 2421719 2584355 2764338 2962319 3147566 3371096 3634074 3920148
12742C920148K98762L40443L74417L75678M46600N78485O89673Q24727R74517
$$ 3920148 4218910 4559353 4933770 5309448 5756048 6334533 7024206 7848933 8823450
12733H823450J165000J422328J762760K208052K668659L219808L901651M898745
$$ 8823450 9988450 11410778 13173538 15381590 18050249 21270057 25171708 30070453
12725C0070453O325215Q469586J1990305J7809777K7139812M1208362N8947712
$$ 30070453 36395668 44865254 56855559 74665336 101805148 143013510 201961222
12718B01961222P1245333N9332770K1710795k3159086n3889722o3492789n8248419
$$ 201961222 273206555 332539325 354250120 331091034 277201312 213708523 155460104
12711A55460104m4283815k9744791j9480528j3122627r226665o850133n329715
$$ 155460104 111176289 81431498 61950970 48828343 39601678 32751545 27421830
12704B7421830m300408l589809k922308k386510j977393j581523j260362r94759
$$ 27421830 23121422 19531613 16609305 14222795 12245402 10663879 9403517 8408758
12696H408758q47596p23544o44737n96952n24887m36841m01137l55215k72732
$$ 8408758 7561162 6837618 6192881 5595929 5071042 4634201 4233064 3877849 3605117
12687C605117k58498j97246j79605j74415j63738j95144j54521j17239j16019
$$ 3605117 3346619 3149373 2969768 2795353 2631615 2436471 2281950 2164711 2048692
12678B048692r8197o6618r6129q0384n4077q2039o9269n6178n1165k7402m6233
$$ 2048692 1950495 1883877 1787748 1707364 1653287 1571248 1501979 1445801 1394636 1367234 1321001
12667A321001m0026k3890l3374l9691o0011m8362n0259n5872p6632m8994P38j6455
$$ 1321001 1280975 1257085 1223711 1184020 1124009 1075647 1025388 969516 892884 843890 844628 828173
12655H28173k5007l6210K830J9634k9990k9758j9068j8005o0353n4750k7964k0133
$$ 828173 803166 766956 769786 789420 759430 729672 710604 692599 632246 577496 549532 529399
12643E29399P362K5778k5909k6582j7266J7111l7466l9970m2859r325L6382j716
$$ 529399 536761 562539 536630 510048 492782 509893 472427 432457 389598 380273 416655 414939
12631D14939q101M717O395O957l496j7737J3125l611J5241J9841J3437l1653O420
$$ 414939 406838 411555 417950 424907 421411 403674 416799 413188 428429 448270 461707 430054 436474
12618D36474L8932N046M4370K2817J9985M3678Q2677J21212J76070K39130L48742
$$ 436474 475406 480452 524822 547639 567624 611302 693979 815191 991261 1230391 1579133
12607A579133M72306M83004L29313N7409k76626m59854m69967m08109l05180j89958
$$ 1579133 2051439 2534443 2863756 2921165 2644539 2184685 1714718 1306609 1001429 811471
12597H11471j30870o6381l1098l8680l6019p2377o7554k3837M096j2591j8861
$$ 811471 680601 614220 583122 544442 508423 436046 368492 344655 348751 336160 317299
12586C17299l1923l4434q779j0006M313J6066o259j7850k0087j7542L1082J3512
$$ 317299 285376 250942 242163 232157 236470 252536 246277 228427 208340 190798 221880 235392
12574B35392j3685j416j0872R032k2583j0657M772l0653n655J0016j097o6087
$$ 235392 221707 220291 209419 218451 195868 185211 189983 159330 153675 163691 162594 96507
12562I6507l0100L2267j4164j2308K539M638j2590L0905k3081j6582K6688L4095
$$ 96507 66407 98674 84510 72202 74741 79379 66789 97694 74613 58031 84719 118814
12550A18814N157K62q359J4954R795j8153l1424j1575J9351k161J6124j5870N118
$$ 118814 123971 124233 115874 130828 140623 122470 91046 79471 98822 96661 112785 96915 102033
12537A02033m579j8844O539j2952K0126K1544j7117Q227N162M745N560j7212m5570
$$ 102033 97454 78610 85149 72197 92323 113867 96750 104977 110139 114884 120444 103232 57662
12524E7662q149J7727J7585j697l3085J4815K659J5822K4461J2795P929j5269
$$ 57662 49513 67240 84825 83128 50043 64858 67517 83339 107800 120595 128524 113255
12512A13255K0J5460j6023Q370K0903J6916l4317l0373L177O77M1103J5425K3926
$$ 113255 113275 128735 112712 121082 141985 158901 124584 94211 97388 98065 139168 154593 178519
12499A78519j4115m21k9458j2001r387k5371j0448m512k348M0J403j0229J2619
$$ 178519 164404 163983 134525 122524 113137 87766 77318 72806 70458 70498 71901 61672 74291
12486G4291J9432l170O975K6783P187l5795o944Q59J3127K0627k217L507K3577
$$ 74291 93723 90553 97528 124311 131498 95703 88759 89618 102745 123372 121155 124662 148239
12473A48239o442l5849j602J4169p564K767q423p070n488R843J6976R832k560
$$ 148239 141797 105948 104346 118515 110951 113718 105295 98225 92737 102580 119556 129388 126828
12460A26828j0303q004l6946P95K2024L7161K8052l0550m5535l5723Q846J2267
$$ 126828 116525 108521 71575 72370 94394 131555 159607 129057 83522 47799 56645 68912
12448F8912Q302J5895j555j1231N297J8914J6582L4643L5930p811o0106m2463
$$ 68912 77214 93109 91554 80323 85620 104534 121116 155759 191689 183878 123772 81309
12436H1309J1571J6900J0074n135k080j9055J8920k543K4089K9562j5728k494
$$ 81309 92880 109780 119854 114719 112639 93584 112504 109961 134050 163612 147884 145390
12424A45390k777j0044m396j0577N744j2858o898J5378J8671j3356o124J6586
$$ 145390 142613 132569 128173 117596 123340 110482 103584 118962 137633 124277 118153 134739
12412A34739N594k9035k9266j1932P190p108m107M405k3600m359J4351R573j4453
$$ 134739 140333 111298 82032 70100 77290 70182 66075 70480 46880 42521 56872 66445 51992
12399E1992j2121q45K336M211j5691l0655j9580M0104N1937j8398J1020K0300
$$ 51992 39871 39026 41362 45573 29882 -773 -20353 19751 71688 53290 64310 84610
12387H4610j1113O066K2725j1688q056K8311J5426k2622j1358j0459k2644Q432
$$ 84610 73497 79563 102288 90600 82544 110855 126281 103659 92301 81842 59198 67630
12375F7630j3174k7833k834L4535M0987K1647k5126j2687O055K7582o570J0736
$$ 67630 54456 26623 23789 58324 99311 120958 95832 83145 89200 116782 110212 120948
12363A20948J2604M78J9537N706l4667k8241n080l7167k2654K0823K9537m803
$$ 120948 133552 134030 153567 159273 124606 96365 91285 54118 31464 52287 81824 77021
12351G7021L017L1526K1142K7074q448k5088J1729j984O906o787j9263k5619j6317
$$ 77021 80038 111564 132706 159780 151332 126244 137973 135989 142895 136108 116845 91226 74909
12338G4909K7968p36k2414J1425L1116R594k0380J8288j965n5992k7280J6602
$$ 74909 102877 102141 79727 91152 122268 131862 111482 129770 127805 71813 44533 61135
12326F1135L4100N0623L5680k7475j9678m1357L6266k5949q436m088Q829L0726
$$ 61135 95235 145858 181538 154063 134385 93028 129294 103345 94909 90821 99650 130376
12314A30376j7833m368J174r264K7293j1984k0895J6488K9631J7316P201L2080
$$ 130376 112543 108175 109349 100085 127378 115394 94499 110987 140618 157934 165135 197215
12302A97215m455l479J0021r883j8868K0144P4J6167n567l0706j6753m1824J9641
$$ 197215 192760 189281 199302 189419 170551 190695 190769 206936 201369 170663 153910 112086 131727
12289A31727M4201N1902K1323J7898K8611J4476J3893k5990n279R421K6278N7422
$$ 131727 175928 227830 249153 267051 295662 310138 324031 298041 292762 302183 328461 385883
12277C85883Q1820J38519K15784L03485L62410K68197N4545j15630k19629k87556
$$ 385883 467703 606222 822006 1125491 1487901 1756098 1810643 1695013 1475384 1187828
12267A187828k79947j98063j62058j03327p1211m0483j0521l0126j9324M134j4492
$$ 1187828 907881 709818 547760 444433 373222 332739 322218 292092 272768 276902 262410
12256B62410l3784J4074R933j5570J1421p582R334R579L285k4625n8298l353O8295
$$ 262410 228626 242700 252633 237063 248484 240902 250236 259815 263100 238475 180177 176824 245119
12243B45119P627n1417N700J0985j98m5369L710J5864J3166R431l8378M823K8038
$$ 245119 252746 201329 207029 218014 217816 172447 176157 192021 205187 214618 176240 181063 209101
12230B09101K0709j125Q286j9372n0295r043l355O706N5943L6172j182j7151l8107
$$ 209101 229810 228685 236971 217599 167304 158261 154906 161612 217555 253727 252545 235394 197287
12217A97287j1753j5221j4320K5284J2741L144l1363J9629K1683N297J5632K4920
$$ 197287 185534 170313 155993 181277 194018 197162 165799 185428 207111 212408 228040 252960
12205B52960J0460j1427m0973j3709N5339K0228j2933o8003j3420M8497L8855
$$ 252960 263420 251993 211020 197311 252650 272878 259945 191942 178522 227019 265874
12194B65874M1406J0594m2536m052Q596l5706n551m224j136L523J8360j7262O852
$$ 265874 307280 317874 275338 271286 279882 244176 238625 234401 233265 236788 255148 237886 244738
12181B44738J2614L629j9864l835J0550o949K8867M6798o74M69N482K0492k7577
$$ 244738 257352 260981 241117 237282 247832 240883 269750 316548 315874 316343 321825 342317 314740
12168C14740l3764k1615K7312J3582j3204N589Q735K1792K5719L2675O651n5251
$$ 314740 280976 259361 286673 300255 287051 292640 301375 323167 348886 381561 388212 332961
12156C32961k0974L886K1949K2203N228m557l174o312k4326J9102p826q801o357
$$ 332961 311987 315873 337822 360025 365253 360696 357522 351210 326884 345986 338160 329359 323002
12143C23002M0387L3207j768m365L1781K3096m4867l3889O76j2896L177J6234
$$ 323002 363389 396596 394828 390463 422244 445340 400473 366584 367260 354364 357541 373775
12131C73775j700J7465J8123m881J847K1040Q056J3918j5083m0915q924M2202
$$ 373775 372075 389540 407663 402782 404629 425669 433725 447643 432560 391645 382721 424923
12119D24923O4651L6208r927k4366r073j4129k3848K8268N484n425K2700q121
$$ 424923 489574 525782 515855 491489 482416 468287 444439 472707 478191 472766 495466 487345
12107D87345L8201M8112k5815j269k0460j0177Q674M3794J554j5143P903r12j504
$$ 487345 525546 573658 547843 546574 526114 515937 524611 568405 569959 554816 562719 561807 560303
12094E60303J0081o780L719m158L3327K2887J0866N199J7315Q152J0K8075K5665
$$ 560303 570384 563604 567323 563165 596492 619379 630245 635444 652759 660911 660921 688996 714661
12081G14661N844J260k8790K0460J9136M5560J7905l2409k1357o232J0349Q670
$$ 714661 720505 721765 692975 713435 732571 778131 796036 763627 742270 736038 746387 755057
12069G55057K7682L7359J9652J8964J5618J255J5589K2045L01j3914P859L0951
$$ 755057 782739 820098 839750 858714 874332 875587 891176 913221 913522 899608 907467 938418
12057I38418L7211M3959J8478o021n225j9032P193K9608R970N9170L4706k0157
$$ 938418 975629 1019588 1038066 1032045 1026820 1007788 1014981 1044589 1054559 1113729 1148435 1128278
12045A128278l323J3285m546M6736K7753N7447K6589N282J3324K6422o788J5656
$$ 1128278 1124955 1138240 1133694 1180430 1208183 1265630 1292219 1297501 1310825 1337247 1330459 1346115
12033A346115J4165O3956K6346q163K0643M6973N0788L0395j359M5835K8542M3372
$$ 1346115 1360280 1424236 1450582 1442419 1463062 1510035 1560823 1591218 1589859 1635694 1664236 1707608
12021A707608N5760J5554N1031N1430L8687N0078L5995K6865P3162N6710N3545
$$ 1707608 1763368 1778922 1829953 1881383 1920070 1970148 2006143 2033008 2106170 2162880 2216425
12010B216425M0296M2245M0736N4309N0040O8836O4749L3900O3027K9013N3994
$$ 2216425 2256721 2298966 2339702 2394011 2444051 2512887 2577636 2611536 2674563 2703576 2757570
11999B757570Q1375P1806O7051J00205Q3795R4527Q4749Q7429P0276J05254J03068
$$ 2757570 2838945 2910751 2977802 3078007 3161802 3256329 3341078 3428507 3498783 3604037 3707105
11988C707105O8857R7727J34701Q4258J25054J33822P9124R8899J42935J53635
$$ 3707105 3775962 3873689 4008390 4092648 4217702 4351524 4430648 4529547 4672482 4826117
11978D826117J38237J28136J38598J79163J92447J45297J38365K01868J89428
$$ 4826117 4964354 5092490 5231088 5410251 5602698 5747995 5886360 6088228 6277656
11969F277656J89927K17091J83155K01779K04432K27632K26383K83201K13210
$$ 6277656 6467583 6684674 6867829 7069608 7274040 7501672 7728055 8011256 8224466
11960H224466K14093K70057K69678K28327K61274K57656K45154K66127K48501
$$ 8224466 8438559 8708616 8978294 9206621 9467895 9725551 9970705 10236832 10485333
11951A0485333L15051K78702K09519K43501K50057K14846K17633K19053J92277
$$ 10485333 10800384 11079086 11288605 11532106 11782163 11997009 12214642 12433695 12625972
11942A2625972J61610K09874K01601J87764J43834J08342N5557O3486K6937K6904
$$ 12625972 12787582 12997456 13199057 13386821 13530655 13638997 13694554 13758040 13784977 13811881
11932A3811881J9283m6836n1205o8847j22624j49902j63209j74623j48205j71516
$$ 13811881 13831164 13784328 13733123 13664276 13541652 13391750 13228541 13053918 12905713 12734197
11922A2734197k32476k51279k30666k53842k59026k50841k57960k64066k86126
$$ 12734197 12501721 12250442 12019776 11765934 11506908 11256067 10998107 10734041 10447915
11913A0447915k92350l06916k66532k61346k56716k77108k02337k16623k47478
$$ 10447915 10155565 9848649 9582117 9320771 9064055 8786947 8584610 8367987 8120509
11904H120509k35867k38411k28591k14856k30273k45559j91343k02513j99228
$$ 8120509 7884642 7646231 7417640 7202784 6972511 6726952 6535609 6333096 6133868
11895F133868k04398j71613j57446j89518j41606j28788j20403j42351j43396
$$ 6133868 5929470 5757857 5600411 5410893 5269287 5140499 5020096 4877745 4734349
11886D734349j18659j44533j13597j06250j04813j21995j00017j06515j24724
$$ 4734349 4615690 4471157 4357560 4251310 4146497 4024502 3924485 3817970 3693246
11877C693246r1642n6239p4588q6335q8828r5141r0676j00807q2406p2536n5704
$$ 3693246 3601604 3545365 3470777 3384442 3295614 3200473 3109797 3008990 2926584 2854048 2798344
11866B798344k9605n4578n8821p9804p1144p5275n7923o5679o4527m1100o8094
$$ 2798344 2768739 2714161 2655340 2575536 2504392 2429117 2371194 2305515 2240988 2199888 2131794
11855B131794m0299p2470n4203j6213l0715l6542n2526k5736j1665l1990k6951
$$ 2131794 2091495 2019025 1964822 1948609 1917894 1881352 1828826 1803090 1791425 1759435 1732484
11844A732484r023o5681m5572l1250k5446j5417O546j4119k5746l1175m6163l4992
$$ 1732484 1723461 1657780 1612208 1580958 1555512 1540095 1546641 1532522 1506776 1475601 1429438 1394446
11832A394446j6788m5020l0160j5692l6805j7150k9260m5184j7368K935k780k3739
$$ 1394446 1377658 1332638 1302478 1286786 1249981 1232831 1203571 1158387 1141019 1143954 1141174 1117435
11820A117435j3865l6603j2967k5240m1483j5084k3249K148Q028l9453m3591l8908
$$ 1117435 1103570 1066967 1054000 1028760 987277 972193 948944 951092 959120 919667 876076 837168
11808H37168R358j0946j6248p301j4731m0898J4671J2818k1274l9072k4915K2043
$$ 837168 846526 835580 819332 812031 797300 756402 771073 783891 762617 723545 698630 720673
11796G20673M2362K127N214l9574k9252M635J1208j836K611k7950j0895l0937
$$ 720673 763035 765162 770376 730802 701550 706185 717393 715557 718168 690218 679323 648386
11784F48386m4443q075l01k0829j9810O749L549J845j9893O805J5961K6428j3602
$$ 648386 603943 595868 595567 574738 554928 561677 565226 567071 547178 553983 569944 596372 582770
11771E82770o6934j9467m668j9585K6877K9573m4373L064k8772p469M3121L2878
$$ 582770 515836 496369 491701 472116 498993 528566 484193 487257 458485 451016 494137 527015
11759E27015Q145k1370j5223k0454n7934l740J5966J3468m503r227k2152j679
$$ 527015 535160 513790 498567 478113 420179 416439 432405 445873 441370 432143 409991 408312
11747D08312J7328L356j0848j3435k8188j3415K7976l026L192l1409l9382K2568
$$ 408312 425640 428996 418148 404713 376525 363110 391086 388060 391252 359843 320461 343029
11735C43029P200K6786k8097m5927j162J7388K430r02m287k7163k8289J5444K4810
$$ 343029 350229 377015 348918 302991 301829 319217 321647 320745 316458 289295 261006 276450 301260
11722C01260J3818l868m2211L847J8926K4965K1098P695j0327k9516K1562K62
$$ 301260 315078 311210 268999 272846 291772 316737 337835 345530 335203 305687 327249 327511
11710C27511j4248j5296l7324j959M246Q653M303K477m884j7936k3743k2320k5398
$$ 327511 313263 297967 260643 258684 262930 271583 275886 278363 273479 255543 231800 209480 184082
11697A84082J1707K53P525j2104p182P847J4057j3128K30J2672K4081k3601l5059
$$ 184082 195789 196042 203567 191463 184281 192128 206185 193057 193287 205959 230040 206439 171380
11684A71380L1519J7859k335K651k7549k2657L4311K5589j1571l863n23j5248
$$ 171380 202899 220758 218423 221074 193525 170868 205179 230768 219197 215334 214811 199563
11672A99563m523J2368k756j8611j4458J0751J0690k0005R892j2172j8748L4896
$$ 199563 195040 207408 204652 186041 171583 182334 193024 173019 182911 170739 151991 186887
11660A86887K4511l1799n2958j0922M7687L550L693J3569j3318K3493K2696l1104
$$ 186887 211398 179599 126641 115719 163406 166956 170649 184218 170900 194393 217089 185985
11648A85985n322K2686J6193j2106j8643o888K410k4242j7699M841K9421p076
$$ 185985 180663 203349 219542 207436 188793 181905 184315 160073 142374 147215 176636 169560
11636A69560l3486j0540K2371M8511M729j1007j3373j1398K0855K9323j6269l1914
$$ 169560 136074 125534 147905 196416 201145 190138 176765 165367 186222 215545 199276 167362
11624A67362j4433j572o64m914R402r841K0577j696k5010J995k5864j1903K3157
$$ 167362 152929 151357 150693 145779 155181 145340 165917 164221 139211 141206 115342 103439 126596
11611A26596K0419L2582J5732P332n5533l2636l349J06Q684m953j1549j474J5960
$$ 126596 147015 179597 195329 202661 147128 114492 111143 111249 119933 114980 103431 101957 117917
11598A17917O758k7371o723K8172nk0139J793J8629J576n012J7101L1309j1657
$$ 117917 124675 97304 90581 118753 118748 98609 100402 119031 120607 115595 132696 164005 152348
11585A52348k1451j6245k4242L1590r008k4379J255J8092O516O383l809M06Q238
$$ 152348 130897 114652 90410 122000 112992 88613 89868 107960 114476 120859 117050 117456 125694
11572A25694k6311j9090L713P004j5098K0718K1134j8906k5136K4081j4985m6122
$$ 125694 99383 80293 84006 91010 75912 96630 117764 98858 73722 97803 82818 36696
11560C6696K490J926K6158J2803l437j0464j9661k120K0350J8761J6008l009k7148
$$ 36696 39186 41112 67270 80073 76636 66172 46511 44391 64741 83502 99510 96501 69353
11547F9353J8476J0319k9238J3750M5194K1034j6321k4036k7240N464J0329j9843
$$ 69353 87829 98148 68910 82660 127854 148888 132567 108531 81291 86755 97084 77241
11535G7241O31R254R854O088j6490K0665j0002k5246j1999L3478L9401j7472k0026
$$ 77241 77872 87126 96980 103068 86578 107243 97241 71995 59996 93474 132875 115403 95377
11522I5377J3084j8697J0335j8129m4598J6815l140j9995N644M526J7024k0931
$$ 95377 108461 89764 100099 81970 37372 54187 51047 31052 36696 41222 58246 37315
11510C7315j4879K2200M9684P493J3638J372r077k898k3161j6184o956k1900j3280
$$ 37315 22436 44636 94320 101813 115451 116823 107746 104848 81687 65503 58547 36647 23367
11497B3367K4379J2217J5075j5710k5007m005K5653j814J330J8322O910k0189
$$ 23367 47746 59963 75038 59328 34321 30316 55969 54155 55485 73807 80717 60528
11485F0528r809K991K0485j2739k1134J4225L0335M959l2181k4522N110K6089
$$ 60528 50719 53710 74195 61456 40322 54547 84882 89841 57660 33138 38248 64337
11473F4337K1996j1544l637k9523l3445J9364K5795J1846p108m982l2194J8936
$$ 64337 86333 74789 71152 41629 8184 27548 53343 65189 58081 53099 20905 39841
11461C9841O530l1413N6745L3997J6161r842k6253l844P640j3721j5413j0182
$$ 39841 46371 14958 71703 105700 121861 112019 85766 81922 89562 75841 60428 50246
11449E0246j0785Q451k9799p807L3786l443k4578o657R104M1976M1860J2776j4945
$$ 50246 39461 47912 18113 10306 44092 40649 16071 9414 18518 60494 102354 115130 100185
11436A00185k4792L290K5438l6597l7787J4792L1162K9255j5483m8885j4889L8923
$$ 100185 75393 78683 104121 67524 29737 44529 75691 104946 89463 40578 25689 64612
11424F4612K2633M797l5207k6074j4683L4546L5904O941l0701n79K0929J8445
$$ 64612 87245 92042 56835 30761 16078 50624 86528 93469 62768 62189 83118 101563
11412A01563p592J2705k3336l5325m581K6178K16j3759o108k9083j5452J2636
$$ 101563 93971 106676 83340 48015 43434 69612 69828 56069 49961 20878 5426 18062
11400A8062q21L879k519r355J8801l264m1102J6029L6049N179j422j9099K336
$$ 18062 17241 21120 18601 9246 28047 24783 -16319 -290 35759 40938 39516 20417 22753
11387B2753o378j6448k16J6827L7600m353j0609l8309k2767J4122L2362K9676
$$ 22753 16375 -73 -289 16538 54138 49785 39176 867 -21900 -7778 24584 54260
11375E4260L5944m680l3700j3495M862J8509p120k5794J3053J8445P81M124k4376
$$ 54260 90204 85524 51824 38329 43191 61700 54580 28786 41839 60284 61065 65189 40813
11362D0813m333L4665O214o103p845J0339l7841j0266q502Q378j0092J3421K5655
$$ 40813 36480 71145 77359 71256 63411 73750 35909 25643 17141 25519 15427 28848 54503
11349E4503L3470o417J0155L876q857j2582m3220K7470K0967j2742O27J646m2885
$$ 54503 87973 81556 91711 95587 86730 74148 30928 58398 79365 66623 67250 68896 26011
11336B6011j70r076L686J4458j2871P926K934P741k3832Q924L7592K3451M71j0358
$$ 26011 25841 16765 20451 34909 22038 29964 32898 40639 16807 25731 63323 86774 87245 76887
11322G6887L371l4324k8720k2919r291N2717K9415m343k4245k7943J3322j174
$$ 76887 80258 45934 17214 -5705 -14996 37721 67136 62793 38548 10605 23927 22753
11310B2753K453P932J456l950k6172N286K6921n648j9212r059J7048J8563k1364
$$ 22753 25206 33138 34594 30644 4472 9758 36679 31031 11819 2760 19808 38371 17007
11297A7007K791N489p822O906P761M808J611p127j460N883k0621J3977K0987k6971
$$ 17007 19798 25287 17465 24371 32132 36940 38551 31424 29964 35847 15226 29203 50190 23219
11283B3219j578J106J1356j8422r667L043K0516K8479N377l284J159j2706P749
$$ 23219 21641 22747 34103 15681 6014 9057 29573 58052 63429 60145 61304 48598 56347
11270E6347j9679j3028M062M264M523L5225k1551m4742k0645J3925j4720O337
$$ 56347 36668 23640 27702 31966 36489 71714 50163 5421 -15224 -1299 -16019 -9682
11258i682L5561j0102k9361K25J7419L1286K4406j049k6885j9421K4623K1852
$$ -9682 25879 15777 -13584 -13359 4060 35346 59752 58703 31818 12397 37020 58872
11246E8872K0668J3879k9920k1017j2908o963J7739k7975j8942J0107L3969P389
$$ 58872 79540 93419 63499 42482 29574 22611 40350 12375 -6567 3540 37509 44898
11234D4898j5642j8499K7735N50j8595k9641K717J3163K036P601M670J7739K4798
$$ 44898 29256 10757 38492 39042 20447 -9194 -6477 6686 8722 16323 20993 38732 63530
11221F3530k1809m4274k9885J1692J2690j298k077J8118o586j8949K678P067J3480
$$ 63530 41721 -2553 -32438 -20746 -8056 -9354 -11431 6687 101 -18848 -16170 -9103 4377
11208D377K4732J6618j0727j0313L6660o921k3387j7556j3393k2468o153K1441
$$ 4377 29109 45727 35000 24687 61347 54426 31039 13483 90 -22378 -28531 -7090
11196g090N617R690K4826K855k1379J3415J3945K208k7517o489o8K0722J4482
$$ -7090 -1473 8217 33043 35898 14519 27934 41879 44087 16570 10081 10013 30735 45217
11183D5217j0821J2529o967o405K8139Q634j3805m0500m3440K1661M2110M2844
$$ 45217 34396 46925 39958 33553 61692 70326 56521 16021 -27419 -5758 36352 79196
11171G9196M8106J1738o7755m5222j37L7599J5503P790o148k2465j297N893N158
$$ 79196 127302 139040 71285 26063 25926 63525 79028 86818 80670 58205 56908 62801 67959
11158F7959J1749p955k5453k4995Q987j0399J5664P357k1557Q347K2744O837J4001
$$ 67959 79708 71753 46300 21305 30292 19893 35557 42914 21357 29704 52448 59285 73286
11145G3286J2930j0809n566k2614k5113p179L7832J9093j2422l0145J8138J2261
$$ 73286 86216 75407 69841 47227 22114 14935 52767 71860 59438 29293 47431 59692
11133E9692J4064m546O789J8428j2698M142N59K0785k1541n032N514j1486O234
$$ 59692 73756 69210 75999 94427 81729 85871 86430 107215 85674 80642 86156 74670 80904
11120H0904l5113j2724k8636k0254P778m032p763K3934J6096n539k1027K8540
$$ 80904 45791 33067 4431 -15823 -8045 -12077 -19840 4094 20190 14651 -6376 22164
11108B2164L7119q341J9747K195l5808J0597K7490j2838m4481k409J0511j3735
$$ 22164 59283 50942 70689 72884 37076 47673 75163 62325 17844 15435 25946 12211
11096A2211J583J0162J8838R236k6202k1295J6274J1519K8094O743j3271k2972
$$ 12211 13794 23956 42794 52030 25828 4533 20807 32326 60420 67163 53892 30920
11084C0920Q904J1757m515l7704j2372J9912K3769R266k1347N407J6032j6746
$$ 30920 39824 51581 47066 9362 -3010 16902 40671 49937 28590 33997 50029 33283
11072C3283j5096M1179J3729J3908l049m8616M90K5331J1656o947J6725j3292
$$ 33283 18187 59366 73095 87003 83954 35338 35828 61159 72815 65868 82593 69301
11060F9301p133R959K0268P772l6523n7604j6120J8940K3846K4729J1596M1770
$$ 69301 62168 72127 92395 100167 63644 6040 -10080 8860 32706 57435 69031 110801
11048A10801M335O304J775k281L4673J0919k5028j1404M8399O9744J1737k316
$$ 110801 115136 121440 123215 120934 155607 166526 141498 130094 178493 248237 259974 257658
11036B57658J1576J7509J9407p985l1586m1416M0254J4221j2275J5819M4277M5071
$$ 257658 269234 286743 306150 298165 266579 225163 265417 279638 267363 283182 327459 372530
11024C72530J273J3368j1975l8293k7785n3892n3554j3158J0045K7984J9385K1180
$$ 372530 373803 387171 375196 336903 309118 255226 201672 188514 198559 226543 245928 267108
11012B67108j254j5716O842j0702j8949j9582j8858m8666n2099J6791L0958K7597
$$ 267108 265854 250138 256980 246278 227329 207747 188889 140223 88124 104915 135873 163470
11000A63470J8010N860m677k2653l6845k2846n7J3524J0623J225j1736L2498l8266
$$ 163470 181480 187340 182663 160010 123165 100319 100262 113786 124409 125634 113898 146396 108130
10987A08130k7982J544k2688j3505j2945R423J0663P518p759r264N015r114J6333
$$ 108130 80148 81692 59004 45499 32554 41977 52640 60158 52399 43135 48150 39036 55369
10974E5369J0796p297k0453N491J2979m077j4245K1687j9596m156K689K1839J0776
$$ 55369 66165 58868 38415 43906 56885 52808 38563 60250 40654 36498 39187 61026 71802
10961G1802J5872j6067k0224J9081q116N44J3698L985J6156l420k3118k6517j0368
$$ 71802 87674 71607 51383 70464 62348 62892 76590 80575 96731 93311 70193 43676 33308
10948C3308Q451J0446R916j950j6756P057K1553M4079M1064M743q670l8855k163
$$ 33308 41759 52205 62121 60171 43415 50472 72025 116104 157168 161911 153241 114386 112223
10935A12223m988O826M0658q444n726m0069L533L3579K072k1346j3832p060J5968
$$ 112223 107235 114061 154719 146275 140549 100480 104013 137592 139664 118318 104486 97426 113394
10922A13394Q627l5699R792K4146K5128J7966k7118l8428O875j7601j2257j536
$$ 113394 122021 86322 96114 120260 145388 163354 136236 97808 104683 87082 74825 73289
10910G3289r832j6512P481J9981k3556K6475N714j1148o530R200K8231m186l5318
$$ 73289 63457 46945 54426 74407 50851 77326 83040 71892 65362 74562 102793 98607 63289
10897F3289J6134K5637n1257k3447J2812j9929J3990l469K1047K3936k696Q514
$$ 63289 79423 105060 53803 30356 43168 23239 37229 33760 54807 78743 76047 84561
10885H4561j0879k7464l8264j2608j7249J5223K4134P335J6828K2485J0473J3142
$$ 84561 73682 46218 7954 -4654 -21903 -6680 17454 24789 41617 64102 74575 87717
10873H7717O593j8548j9591j4401N7962R116J2739k4302l9230l7526K1139L5031
$$ 87717 94310 75762 56171 41770 99732 108848 121587 97285 58055 20529 41668 76699
10861G6699J8790M2118N335K1504L9589m82l877j0613q817j5017j6393J7203N8260
$$ 76699 95489 137607 142942 164446 204035 203553 199676 189063 180246 165229 148836 166039 224299
10848B24299K4506j996P658J5743K6796m774l951r750K0956M6562K6601K5588
$$ 224299 248805 246809 254467 270210 297006 292232 288281 278531 299487 346049 372650 398238
10836C98238k0035L0766M415m7426R380J4364m9j7411m6275k5135k317q560k2049
$$ 398238 378203 408969 413384 365958 375338 389702 389653 372242 325967 300832 298515 289955 267906
10823B67906j8699q803l109l5097J1439J9436j0458J8163l097n3070m0109j0386
$$ 267906 249207 240404 237295 202198 213637 233073 222615 240778 237681 184611 144502 134116
10811A34116n298l98P463j0107J9915j3414k366K0966k837j6702N089L569Q860
$$ 134116 128818 128420 135883 125776 145691 132277 129911 150877 148040 131338 136427 139996 148856
10798A48856p184l420j5986k1167J2760J5166J6722j2566J4821J8105o324r0m007
$$ 148856 141672 138252 122266 101099 113859 129025 145747 133181 148002 166107 159783 159693 155686
10785A55686l2577j3740j1191L8837N0916M1078J7998L4105R344p054L733k2732
$$ 155686 123109 109369 98178 137015 187931 229009 247007 281112 290456 283402 287135 264403
10773B64403N4850L6183L1523M8579N604O662k0415O113L6182k6452m2033k6749
$$ 264403 319253 355436 386959 435538 441142 447804 427389 433502 469684 443232 401199 374450
10761C74450j9355j609K0844K6979j6497l0893K759j9239l1885l6343j4954N66
$$ 374450 355095 353486 374330 401309 384812 353919 356678 337439 305554 269211 254257 254823
10749B54823k1726n109o979J0601o030m2679k0541j0118k2419J799L2389q210
$$ 254823 233097 227988 221009 231610 225580 182901 162360 152242 129823 131622 164011 155801
10737A55801k6811m895Q183j7759L095L0816j7041j368K1751J4159J9345j2904
$$ 155801 128990 124095 132278 114519 117614 148430 131389 130021 151772 165931 185276 172372
10725A72372k193Q649j107j4458j4846j7788n431L354J4565L951q586l0414J7729
$$ 172372 170179 178828 177721 163263 148417 130629 125198 128552 143117 147068 138482 108068 125797
10712A25797N6706R983j293l605k3684J869Q14L911J8649m867n745K6556m329
$$ 125797 182503 192486 191193 187588 163904 165773 166587 170498 189147 184280 178535 205091 200762
10699B00762P681K4635J7966k7977n573K3129j8332k6802k1643K133L7934l458
$$ 200762 208443 233078 251044 223067 217494 240623 222291 195489 173846 175979 213913 210455
10687B10455M619J8924J3621j5850j5691L858K0734L2371k4102j2972M4967L5794
$$ 210455 215074 233998 247619 231769 216078 219936 240670 273041 248939 235967 280934 316728
10675C16728L911J3526j9152j3985L1626O2394J2359n7453l6052L6276L417K308
$$ 316728 320639 334165 315013 301028 332654 395048 407407 349954 313902 350178 353595 355903
10663C55903J6204J8368K1282P948r812J6380N715M004O258o483m5O22N3814M2945
$$ 355903 372107 390475 411757 419705 409893 426273 431988 435992 442250 435767 435722 436344 490158 533103
10649E33103K5143M5343K2188R139J2357L8327L7942J6455M1030J09238R1320
$$ 533103 558246 603589 625777 634916 647273 685600 723542 739997 781027 890265 981585
10638I81585O3586O3075J38536J70800J49402J88341J48294J33197J73104K23760
$$ 981585 1045171 1108246 1246782 1417582 1566984 1755325 1903619 2036816 2209920 2433680
10628B433680K79256M00656N39174O74535Q88817J262506J676697K183199K792993
$$ 2433680 2712936 3113592 3652766 4327301 5216118 6478624 8155321 10338520 13131513
10619A3131513L416603L577057K841170J473463R1642p53881r48219m58387N08301
$$ 13131513 16548116 20125173 22966343 24439806 24531448 23777567 22829348 22370961 22879262
10610B2879262J882961L526168N298788O825108O946691M814260J175321k083413
$$ 22879262 24762223 28288391 33587179 40412287 47358978 52173238 53348559 51265146
10602E1265146l893876m064856k881341p95516J644739M262264O804313Q614667
$$ 51265146 47371270 43306414 40425073 39629557 41274296 45536560 52340873 60955540
10594F0955540Q231999M506021j062378n595351p915950q016028o340841l880808
$$ 60955540 69187539 73693560 72631182 67035831 59119881 51103853 44763012 40882204
10586D0882204j302554J127087L218634M418047L845590J101482k586900n392986
$$ 40882204 39579650 40706737 43925371 48343418 52189008 53290490 50703590 45310604
10578D5310604o593774o297048m972425l263765j659512l16501O21097J037271
$$ 45310604 38716830 32419782 27447357 24183592 22524080 22207579 22828676 23865947
10570B3865947O05478n46496j934180k992324l405263l277263k740254k085725
$$ 23865947 24471425 23924929 21990749 18998425 15593162 12315899 9575645 7489920
10562G489920j547601j155135q75255o11000m50215l76808k77098k69485k25926
$$ 7489920 5942319 4787184 3911929 3300929 2850714 2473906 2196808 1927323 1701397
10553A701397j93653j77884j37321j01677j07425o2221l7330p0509q4930n9738
$$ 1701397 1507744 1329860 1192539 1090862 983437 921216 883886 813377 728447 668709
10543F68709l9533m7867l0219j5839n3171k0035j7765n0424m9013l1369j6222
$$ 668709 629176 581309 551090 535251 482080 462045 444280 393856 344843 313474 297252
10532B97252J4092m135k253K440K075j8453j4812J0338K6031J3153r709k1436
$$ 297252 311344 307209 304956 307396 309471 291018 276206 286544 312575 325728 316019 294583
10520B94583j0925j0411k0985k6314k9429j1384k9021r261R332J310Q861K1192
$$ 294583 283658 273247 252262 225948 196519 185135 156114 146853 156185 157495 166356 187548
10508A87548k3874m1764k3292l5898j34K2377J6256K2381r433N894J62P451j3383
$$ 187548 163674 121910 98618 62720 62586 84963 101219 123600 114167 120061 120223 127674 114291
10495A14291j5489k0513J1176J2456J8928j4366l858j1461j9821j6121J1492j0241
$$ 114291 98802 78289 89465 101921 120849 106483 102625 91164 71343 55222 66714 56473
10483E6473j9621J5325K0272K200l6173J6133M7368j5625m5855m418M3808K9535
$$ 56473 36852 52177 72449 74649 38476 54609 101977 86352 40497 36079 79887 109422
10471A09422j2936L291L209l3287j1397j320o758k144J9657K243l5818J125J8803
$$ 109422 96486 99777 102986 69699 58302 56982 50224 48080 67737 69980 34162 35287 54090
10458E4090L1961K5817k6787J1728k7764n1150N747m546m7077J8285L1991K0204
$$ 54090 86051 111868 85081 96809 69045 17895 23642 19096 -27981 -9696 22295 42499
10446D2499k3746l624J3645P1j7505j5408k7928j333K2216Q019l726j2665J6408
$$ 42499 18753 15129 28774 28845 11340 -4068 -31996 -33329 -11113 -3094 -6820 -19485 -3077
10433c077J6501j4605k5780o706j376J060O289M211K5381J3549j8188k0537K0254
$$ -3077 13424 -1181 -26961 -33667 -35043 -33983 -27694 -23483 1898 15447 -2741 -23278 -3024
10420c024J9131j4018m6249p446K8046J41L55J9707K1862R018K265k3253l1937
$$ -3024 16107 2089 -44160 -51606 -23560 -23419 -23064 -3357 18505 27523 29788 6535 -25402
10407b5402j7033j8455n788L6584P710J9338L0317L9429N497k631l5441j5488
$$ -25402 -42435 -60890 -66678 -30094 -22384 -3046 27271 66700 72197 69566 34125 18637
10395A8637K7620J1370K2570m1972m2613r935k474p142J4730N459N555M904k0260
$$ 18637 46257 57627 80197 38225 -4388 -14323 -16797 -23939 -9209 -3750 1805 6709 -13551
10382a3551o744K4377r250K8876J7382m4974j4026j9935p016K3167k644P576J9590
$$ -13551 -20295 4082 -5168 23708 41090 -3884 -17910 -37845 -44861 -21694 -24338 -16762 2828
10369B828k9434L3236J883K8333r282l9099L164J8624k523N796n450n5992m6485
$$ 2828 -26606 6630 8513 36846 27564 -11535 -8371 10253 7730 13526 8076 -47916 -94401
10356i4401J8155K3401O315J3323K4225M6990J3962j7442j1301l1409j7661K6323
$$ -94401 -76246 -52845 -46530 -33207 -8982 38008 51970 34528 23227 -8182 -25843 480
10344D80K5544j1834l2231J2097l554k8731j7907K1597Q659o696k9563L6509K6190
$$ 480 26024 14190 -18041 -5944 -9498 -38229 -56136 -34539 -25880 -32576 -62139 -25630 560
10331E60k5466L371M4521O6k9142l4112M283j9904k0841O385K4324M0129l317
$$ 560 -24906 -21535 22986 23052 -6090 -40202 -35919 -55823 -76664 -70279 -45955 -5826 -9143
10318i143j1041j668O383j2354p666L6029J2262r137K15M3830n921j7821r902
$$ -9143 -20184 -21852 -15469 -27823 -35489 540 12802 3665 3880 47710 41789 23968 14066
10305A4066l5846L3592K8347j7167o026R46j9573j3760J2560K4774J6117j7610
$$ 14066 -21780 11812 40159 22992 16966 17912 -1661 -15421 -2861 21913 38030 20420
10293B0420k3198n338p520j6359M045P24P449J5671l210J5462J4636j1584K4215
$$ 20420 -2778 -8116 -15636 -31995 -27950 -27226 -19777 -4106 -7316 8146 22782 11198 35413
10280C5413K2915L6174K1542L9259N2225L7116N8059N8004M0885J7056L5045Q386
$$ 35413 58328 94502 116044 155303 207528 244644 302703 360707 401592 418648 453693 462079
10268D62079j2538n8603l4436p1098o2258j6534k1555p7603n8887j3717l997J129
$$ 462079 449541 390938 356502 285404 223146 206612 185057 107454 48567 34850 30853 31982
10256C1982k350p302j5403j8612q097j504j8359k8726J160j1948j0413L6760J8140
$$ 31982 29632 22330 6927 -11685 -19782 -21286 -39645 -68371 -67211 -79159 -89572 -52812 -34672
10243c4672J4710l637k4352O015Q991q573n7986J0484J6967K5561N4004J2645
$$ -34672 -19962 -23599 -47951 -41936 -32945 -41518 -99504 -89020 -72053 -46492 7512 20157
10231B0157K9033K010l8095P423K3931j7308j0547k7906m7394j3088K3839N3831
$$ 20157 49190 51200 13105 20528 44459 27151 16604 -11302 -58696 -71784 -47945 5886
10219E886K1047l881k6890j497j4K3451M4817L6007o77j383K0521J3176k2161
$$ 5886 26933 23052 -3838 -5335 -5349 18102 62919 98926 98249 96866 117387 130563 108402
10206A08402M0506M7926K3482J3947N4259M3245O3442Q8726J64475J83633K32502
$$ 108402 148908 196834 220316 234263 288522 331767 395209 483935 648410 832043 1064545
10195A064545K19861J42011J7814n2226l5751R982J06429J9180n3847j47240j93150
$$ 1064545 1284406 1426417 1444231 1392005 1356254 1366236 1472665 1491845 1437998 1290758 1097608
10184A097608j99414j62761j45583r1311n4268m3309l0574m8755m6801n644J6165
$$ 1097608 898194 735433 589850 498539 444271 400962 370388 321633 274832 269188 285353
10173B85353k0241q960K1198M5471N1564K4210k3705m4996m7795k1293j2414r753
$$ 285353 265112 256152 277350 322821 374385 398595 374890 329894 282099 260806 248392 238639
10161B38639M4457N2096O6965Q1719J6418k3238k6606k0953n8378o1998j7352
$$ 238639 283096 335192 402157 483876 500294 477056 450450 429497 371119 309121 291769
10150B91769k8812m3908l7543Q075J8885K0047K1173j3375j0625n7041n7740l8404
$$ 291769 262957 219049 181506 189581 208466 228513 249686 236311 225686 168645 110905 72501
10138G2501l2777J1571N1769L5695N793p936J4944j8706k9311m5381Q652k7547
$$ 72501 39724 51295 103064 138759 144552 136616 151560 132854 103543 58162 66814 39267
10126C9267m3769K3687j263k6980j23J5093K3809k6550m6005j7055j4068J360
$$ 39267 -4502 19185 17922 -9058 -9181 5912 29721 3171 -42834 -59889 -73957 -72597
10114g2597K6843M3817J2499m912J1019L8469L611J5599l5700o9874m3181J303
$$ -72597 -45754 -1937 10562 5650 16669 55138 58749 74348 38648 -31226 -74407 -73104
10102g3104L5624M1912L138j6958k3744o307K2428P011k0141r119l3680J8773
$$ -73104 -37480 4432 7570 -9388 -33132 -39439 -17011 -10000 -30141 -39260 -72940 -54167
10090e4167K1261L5976J0345j0937j0100j5425O755L9427k2906k5389R719j1474
$$ -54167 -32906 3070 13415 2478 -7622 -23047 -16292 23135 229 -25160 -15441 -26915
10078b6915j9024R43l4450k5309J5700j2827m2142J8437K5178K9814K6217L2102
$$ -26915 -45939 -44996 -79446 -104755 -89055 -101882 -144024 -125587 -100409 -70595 -44378 -12276
10066a2276J1973k05L841p356L507k913j945k4882J7829J2000k5586l496k3381
$$ -12276 -303 -508 3333 -4023 -516 -3429 -5374 -30256 -12427 -427 -26013 -29509 -52890
10053e2890j5859J495j9762O993j1419K1278P223K982j7251J1276N8296o93k2555
$$ -52890 -68749 -67254 -87016 -80023 -91442 -70164 -62941 -59959 -77210 -65934 -7638 -8331 -30886
10040c0886J4308p102j9744P974j237p897k8396k9047j3504K0162M6297K1322
$$ -30886 -16578 -23680 -43424 -35450 -36687 -44584 -72980 -102027 -115531 -95369 -49072 -27750
10028b7750j2993K0814K4368j939j7907O229j8982m1362J440J5393l3940r050
$$ -27750 -40743 -19929 4439 2500 -15407 -9178 -28160 -69522 -68082 -52689 -86629 -95679
10016i5679K9519N9726K7152J4446k6533k7171n068j5882J769r118J5919K9147
$$ -95679 -66160 -6434 20718 35164 8631 -18540 -23608 -39490 -37721 -46839 -30920 -1773
10004a773N099J5006k4320q339m1292k2060j2470J3863K8409P295K00k0292Q42
$$ -1773 3326 18332 -5988 -14327 -55619 -77679 -90149 -76286 -47877 -40582 -40382 -60674 -59832
9991e9832R816K4943J5327l60j9324L793M692l503O246j6797l5306L1641Q730
$$ -59832 -50016 -25073 -9746 -10106 -29430 -25637 -20945 -24448 -18202 -34999 -70305 -38664 -29934
9978b9934j661K0977q980n283k2936R128L676L0589L978l9993k1342k1944K0294
$$ -29934 -31595 -10618 -19598 -24881 -47817 -38689 -35013 -4424 -446 -40439 -61781 -83725 -63431
9965f3431J8737J8244R691J4336k5724j8536K2404K0743J4607r227P259J5879
$$ -63431 -44694 -26450 -16759 -2423 -28147 -46683 -24279 -3536 11071 1844 9103 24982
9953B4982J8584N33n7309j5457k292K3599L128k331k4381J722n012Q529k2512
$$ 24982 43566 44099 -13210 -28667 -30959 -7360 -4232 -6563 -30944 -29222 -34234 -25705 -48217
9940d8217k6983L085J2983J8596J1322N509J4979p809L9270j4573k0390l5085
$$ -48217 -75200 -72115 -59132 -40536 -29214 -23705 -8726 -16535 22735 8162 -12228 -47313
9928d7313j1130K4944j6288j0710L962K3993J6587L8677p954j0206L5391k562
$$ -47313 -58443 -33499 -49787 -60497 -56535 -32542 -15955 22722 14768 4562 39953 37391
9916C7391k7058J2685q92Q372j2646m6566n104p953J1616k525J1984K5264K1386
$$ 37391 10333 23018 22126 30498 17852 -28714 -33818 -41771 -30155 -32680 -20696 4568 25954
9903B5954j6977l4293k523L3502L1625q201j0981r005l64k4842m744L9355P916
$$ 25954 8977 -25316 -27839 5663 37288 29087 18106 9101 8737 -16105 -20849 18506 26422
9890B6422m1331r390P951j9174k0551K0145j2249l4178j5383L3998L1042n145
$$ 26422 -14909 -24299 -16348 -35522 -56073 -35928 -48177 -82355 -97738 -63740 -32698 -37843
9878c7843j3513J7883N495P101L167R853J4385q236j5075J4686p755j0436K3311
$$ -37843 -51356 -33473 -27978 -20877 -17710 -7857 6528 -1708 -16783 -2097 -9852 -20288 3023
9865C023J9827j7068j0189m817q298k1207k3924j0373j3983N1910L3652j8343
$$ 3023 22850 5782 -4407 -9224 -17522 -38729 -62653 -73026 -87009 -35099 -1447 -19790
9853a9790k4131k3638j6644j2327k441K188K6241L2078K6577k6450q862K2183
$$ -19790 -43921 -67559 -84203 -96530 -98971 -96783 -70542 -38464 -11887 -38337 -47199 -25016
9841b5016m034N707L4708K8700Q590j3564q602j2880m443K860r784j0622k8279
$$ -25016 -29050 -23343 11365 40065 48655 35091 26489 13609 9166 12026 2242 -8380 -36659
9828c6659j3876K3439K1267j2588l8798k4703J1277K2590q709R288j3160P960
$$ -36659 -50535 -27096 -5829 -18417 -57215 -81918 -70641 -48051 -56760 -47472 -60632 -52672
9816e2672N294j4019j7605K3805Q055k9475L8755L9127j3737J1294j0510n537
$$ -52672 -47378 -61397 -79002 -55197 -47142 -76617 -37862 1265 -12472 -1178 -11688 -17225
9804a7225q78j5232k2694L3553K2760j4792J4911l9018n643J5146j1208K2298
$$ -17225 -18103 -33335 -56029 -22476 284 -14508 403 -38615 -44258 -29112 -40320 -18022
9792a8022K0397J6420k1287k2272K1705K3162J2179j8723k6474j147J0202k7724
$$ -18022 2375 18795 -2492 -24764 -3059 20103 32282 13559 -12915 -14062 -3860 -31584
9780c1584l455K0116j6837k3987l2863j7075J6308K7032K7978K0686J2163j9259
$$ -31584 -35039 -14923 -31760 -55747 -88610 -105685 -89377 -62345 -34367 -13681 -1518 -20777
9768b0777K289K3329k5631k5507r315L0295K6994n839j6273k6794k2956j0110
$$ -20777 -18488 4841 -20790 -46297 -55612 -25317 1677 -4162 -20435 -47229 -70185 -80295
9756h0295J2847P064N442k2825M1416K0708o930K0087j6028l6958M97m7K816K6400
$$ -80295 -67448 -60384 -54942 -77767 -36351 -15643 -22573 -2486 -18514 -55472 -54975 -55022 -52206 -25806
9742b5806M1401J212k9924o248l152j3454K841K3494J885p296q923j538J9997
$$ -25806 15595 16807 -13117 -19365 -22517 -35971 -33130 -9636 -7751 -15047 -23970 -25508 -5511
9729e511K9791J1853J999k8576j5194K5092o47j5201K2667k87K1309J4052m2099
$$ -5511 24280 36133 38132 9556 -5638 19454 18807 3606 26273 25986 47295 61347 19248
9716A9248K824j0046l370M9913j952j791P166O592R546k7081m0103l9261l8722
$$ 19248 22072 12026 8656 58569 56617 54826 61992 68584 78130 51049 10946 -28315 -67037
9703f7037l078M3344M845J7844L8356R01q174r401j6076j9967j0186k797P972
$$ -67037 -70115 -26771 -21926 -4082 34274 35175 27001 17600 1524 -18443 -28629 -31426 -23454
9690b3454M6008j8587j3667O895J7662J9103j0279l2657P91N992K0663Q102j3854
$$ -23454 22554 3967 -9700 -2805 14857 33960 23681 -8976 -8185 -2193 18470 26572 12718
9677A2718j2922l4523r178J0038L5527M3299J0624k3629l1499n051J6833J4068
$$ 12718 -204 -34727 -43905 -33867 1660 44959 55583 31954 455 -4596 12237 26305
9665B6305J5522J3542J7171J0479K4352J06081J63262K12816P824r3788r6699
$$ 26305 41827 55369 72540 83019 107371 213452 376714 589530 597354 503566 406867
9654D06867r8235j17436j01517k6119j127p6055o5086K9532L8926K7860J6820
$$ 406867 308632 191196 89679 63560 62433 -13622 -78708 -49176 -10250 17610 34430
9643C4430J9914j1903M448r210K063j715j3932k3582Q963p354l3980Q225K7917
$$ 34430 54344 42441 46889 37679 39742 38027 24095 513 9476 2122 -31858 -23633 4284
9630D284Q292R857R772k733Q132J7707p399J1717k9349l7969l5767j3849K8254
$$ 4284 12576 22433 32205 29472 37604 55311 47912 59629 30280 -7689 -43456 -57305 -29051
9617b9051J1842r329p355N252r488r480J7133J7476L5761J4500m932p007k2641
$$ -29051 -17209 -26538 -33893 -28641 -38129 -47609 -30476 -13000 22761 37261 32329 25322 2681
9604B681p237P31j9971l8645M74K0072K70k5315j5644R503M1722J5926L298M980
$$ 2681 -4556 -3825 -23796 -62441 -61967 -41895 -41625 -66940 -82584 -73081 -31359 -15433 -12135 -7155
9590g155J4098J833m402M832n41j6765j4484j518K2548O244K4530M714N2k7762
$$ -7155 6943 8776 4374 9206 8665 -8100 -22584 -24102 -1554 4690 29220 33934 33986 6224
9576F224J341j941q718k6896r005K2715k430K2699k1486m6419K0055J9860J3068
$$ 6224 7565 5624 -3094 -29990 -38995 -16280 -18710 3989 -17497 -63916 -43861 -24001 -10933
9563a0933j0871j1115M901j187J7268k1877Q023L5408L8213J476K41K3509n745
$$ -10933 -21804 -32919 -28018 -29205 -11937 -33814 -25791 9617 47830 49306 49547 73056 67311
9550F7311j1014l4841n3381j7759j5369o202M2524L8809J5623O450J414k448K4640
$$ 67311 56297 21456 -31925 -49684 -65053 -71255 -28731 10078 25701 32151 33565 31117 55757
9537E5757m547l4293k6885k6773J3925L7786n282j7751n611L06k099N472N09k2774
$$ 55757 51210 16917 -9968 -36741 -22816 14970 9688 -8063 -13674 -13368 -15467 -9995 -9486 -32260
9523c2260M712r463m27r070O219M627j3617K2220J1217k696K6021r545K110k9071
$$ -32260 -27548 -37011 -37438 -46508 -40289 -35662 -49279 -27059 -15842 -18538 7483 -2062 48 -29023
9509b9023K5037R656o107R55K5827R64n930o377r5k5714O677P411J425J5172q310
$$ -29023 -3986 5670 -437 518 26345 27309 21379 15002 14907 -10807 -4130 3281 4706 19878 11568
9494A1568J917N397l409j3806m985K2038O248n574j8265m337p842n244J2754K3272
$$ 11568 13485 18882 15473 1667 -3318 18720 24968 19394 1129 -3208 -11050 -16294 -3540 19732
9480A9732K0606K7989Q521j945m3110j6262m523k2814j3818j63M655q926j4117
$$ 19732 40338 68327 76848 74903 31793 15531 11008 -11806 -25624 -25787 -21132 -30058 -44175
9467d4175J5132J394k0737L5104k757k6152m228k885j3317L000R221L3228N977
$$ -44175 -29043 -27649 -48386 -13282 -16039 -42191 -46419 -49304 -62621 -59621 -50400 -17172 -11195
9454a1195k7314j6000l114j1867r541J8443L2625n067J8056J5090n4997K0315
$$ -11195 -38509 -54509 -57623 -69490 -79031 -60588 -27963 -33030 -14974 116 -54881 -34566
9442c4566K2924n008K8442J6464K1535N151K4864k599k5532k4395o621L2985k9459
$$ -34566 -11642 -16650 11792 28256 49791 54942 79806 77207 51675 27280 20659 53644 24185
9429B4185j3462P175k5089l4552K5728p011O994J1505n745k6267J3267J2140j294
$$ 24185 10723 17898 -7191 -41743 -16015 -23026 -16032 -4527 -10272 -36539 -23272 -11132 -12426
9416a2426M13k552J3292n672m608K9352J5579Q410j2720l6845n933o199J082L789
$$ -12426 -12013 -14565 -1273 -6945 -11553 17799 33378 41788 29068 -7777 -13710 -19909 -18827 -15038
9402a5038L7585O0070l700m6275j7905j7281j2192K458m4N364k3764O965J671
$$ -15038 22547 82617 78917 32642 14737 -2544 -14736 -12278 -12322 -6958 -30722 -23757 -22086
9389b2086L0349j261l1618N545J7573k010k4493K2357K6720q129p333J9814k1241
$$ -22086 8263 7002 -24616 -19071 -1498 -3508 -28001 -5644 21076 12947 5614 25428 4187
9376D187k5089J0785J3331j4380K61P680k7308p272Q344K834K075N665J890L6236
$$ 4187 -20902 -10117 3214 -11166 -10905 -3225 -30533 -37805 -29461 -26627 -24552 -18887 -16997 19239
9362A9239J7343J5556n499j6880j0867k7898K0375j681J0943j4326l002j7371
$$ 19239 36582 52138 46639 29759 18892 -9006 11369 9688 20631 6305 3303 -14068
9350a4068l129K5231K3409K186n1342k7905J8573R794o741k6611O919J18K3267
$$ -14068 -17197 8034 31443 33629 -17713 -45618 -27045 -17251 -23992 -50603 -43684 -43566 -20299
9337b0299K1550O032J024J4348J0559o864k2012j6753K3400K5413q682l1331P515
$$ -20299 1251 7283 8307 22655 33214 26350 4338 -12415 10985 36398 27716 -3615 3900
9324C900l199j4720j0636J222J4485j1927j359Q869m137J1742L137J5784l354
$$ 3900 701 -14019 -24655 -23433 -8948 -20875 -22234 -13365 -17502 -5760 -2623 13161 9807
9311I807p087k5951k4338J5129j1771J903J8876N930m967J3420P138m9847k3518
$$ 9807 2720 -23231 -47569 -32440 -44211 -42308 -23432 -17502 -22469 -9049 -1911 -51758 -75276
9298g5276Q141K2276p155J0585J7109K906m720k0667p184K4123J0555J1727N257
$$ -75276 -67135 -44859 -52014 -41429 -24320 -21414 -26134 -46801 -53985 -29862 -19307 -7580 -2323
9285b323K3199P601J7704O672p7l3502m3567Q654K3196J7846j7678R127j0170
$$ -2323 20876 28477 46181 52853 52776 19274 -24293 -15639 7557 25403 7725 16852 6682
9272F682l4909r711J794k7778m2412M9184O0712n240m2877p466P937K0449p292
$$ 6682 -28227 -37938 -36144 -63922 -106334 -57150 3562 -1678 -44555 -52021 -44084 -23635 -30927
9259c0927Q27r042J6354L0487n821m571J5399J2170L045M394k2698r826M737j3113
$$ -30927 -30100 -39142 -22788 7699 1878 -2693 12706 24876 27921 32315 9617 -209 4528 -8585
9245h585o684K9422J8715n797l334J1950k7764k1357J0731N224K3422Q925j3561
$$ -8585 -15269 14153 32868 27071 23737 35687 7923 -13434 -2703 2521 25943 34868 21307
9232B1307k6207K7820J0479j7685m612J4277K1781J4383l8490k2317L1278K9100
$$ 21307 -4900 22920 33399 15714 11102 25379 47160 61543 23053 736 32014 61114
9220F1114M148q541m9073l7081J831l184M46J5455L2345K3288N174j4864n189
$$ 61114 65262 56721 7648 -29433 -27602 -30786 -30340 -14885 17460 40748 45922 31058 25869
9207B5869o921l3835j7180M680R63K6360K2534k7177K9642K8059J5895l7713k2559
$$ 25869 18948 -14887 -32067 -27387 -26424 -64 22470 -4707 24935 52994 68889 31176 8617
9194H617q101k1061P374M785J4266K52l979j102L359J5612M035j9249K6233O221
$$ 8617 516 -20545 -13171 -8386 5880 6132 2153 1051 4410 20022 24057 4808 31041 37262
9180C7262l0066J4219j2684k1441J1825K1109n654k2815J0804l1131k3091m643
$$ 37262 7196 21415 8731 -12710 -885 20224 14570 -8245 2559 -28572 -51663 -56306
9168e6306j8741L5651N4523K931j2091K2507J619k0785L385n833k3342j3230K5145
$$ -56306 -75047 -39396 15127 18058 5967 28474 30093 9308 12693 6860 -16482 -29712 -4567
9155d567L7488k0208j998k666N005k1632N301J0222k8713j58J8992k1577j4816
$$ -4567 32921 12713 10715 8049 13054 -8578 -3277 6945 -21768 -21926 -2934 -24511 -39327
9142c9327K4613N5321P903o2969j159L4479M768J9544k0193j1674m2067l2220
$$ -39327 -14714 40607 48510 -14459 -15618 18861 23629 43173 22980 11306 -30761 -62981
9130f2981l2905K4800L9704O558k4996o691j3240j1287J2191K1176J5358K2400
$$ -62981 -95886 -71086 -31382 -24824 -49820 -56511 -69751 -81038 -68847 -47671 -32313 -9913
9118i913J4057J5326j6174J0983M495l0833j1563J9480N837j455J0014M117L0130
$$ -9913 4144 19470 3296 14279 18774 -12059 -23622 -4142 1695 240 10254 14371 44501
9105D4501J246k8592k0050J5218Q07l5026j2615j4742J4554j92M737M5763j1424
$$ 44501 45747 17155 -2895 12323 13130 -21896 -34511 -49253 -34699 -34891 -30154 15609 4185
9092D185j3863k9860l200m357J1569q436p671J6350m37j0711K7714K0269N562
$$ 4185 -9678 -39538 -42738 -47095 -35526 -43962 -51633 -35283 -35720 -46431 -18717 1552 7114
9079G114L6933k709k7117l3438J9024K8877k1246m2368J4960K1142O590j5414
$$ 7114 44047 41338 14221 -19217 -193 28684 7438 -34930 -19970 1172 7762 -7652
9067g652k9189k707K3416K007k0631P362k067l0460O809j952L5707j0788L187
$$ -7652 -36841 -39548 -16132 -14125 -34756 -27394 -29461 -59921 -53112 -55064 -19357 -30145 -26958
9054b6958K2806N050r171k758J8143l4350k4968M0256l3852j215K6537P179J3955
$$ -26958 -4152 898 -8273 -11031 7112 -27238 -52206 -11950 -45802 -47017 -20480 -13301 654
9041F54k3336l4345M4482M0180J1024N687k9311j6409k0805K563Q956j7325l1867
$$ 654 -22682 -57027 -12545 27635 38659 44346 15035 -1374 -22179 -19616 -10660 -27985 -59852
9028e9852r208J6435L4095J1099l475j5055r768k4224m572M1806L1697K8507j1699
$$ -59852 -69060 -52625 -18530 -7431 -10906 -25961 -35729 -59953 -64525 -22719 8978 37485 25786
9015B5786r543P384n843k4785j6381L8791P854j692J9879q945k227k2518j6346
$$ 25786 16243 23627 17784 -7001 -23382 15409 23263 21571 41450 32505 30278 7760 -8586
9002h586j6215j1557o50N280L1481L5857k0913l2270j915J3178k5L396l1693R841
$$ -8586 -24801 -36358 -37008 -31728 -247 35610 14697 -17573 -19488 -6310 -6335 -2939 -34632 -24791
8988b4791L7640m619k3797l2316J5438M6799l9680j1357K9827R631J6760k8735
$$ -24791 12849 8230 -15567 -47883 -32445 14354 -25326 -36683 -6856 2775 19535 -9200
8976i200j760k9836j2962j8194K0425K8014o468j1005K718j9377L6284J7057k3380
$$ -9200 -10960 -40796 -53758 -71952 -51527 -23513 -29981 -40986 -38268 -57645 -21361 -4304 -27684
8963b7684N822J1257K7279J1960j8863k4912J5207k5064l3742R176J6425J3480
$$ -27684 -21862 -10605 16674 28634 9771 -15141 66 -24998 -58740 -49564 -33139 -19659
8951a9659J9932M8329J7281l6311m1709k0137J2575K219J1267M307j1495o698
$$ -19659 273 48602 65883 29572 -12137 -32274 -19699 -17480 -6213 -1906 -13401 -20099
8939b0099J222J2865J6392q147k5406p727K5219L6499L014l9946J4555J8674k8992
$$ -20099 -18877 -6012 10380 2233 -23173 -30900 -5681 30818 33832 -6114 8441 27115 -1877
8926a877Q975P541l3565K5530Q667j9497j5294K302K8365J4846K4768K7303j2135
$$ -1877 7098 14639 -18926 6604 15271 -4226 -19520 -17218 11147 25993 50761 78064 65929
8913F5929j1151l8475j7615n323j506j552j7489M624K9122k186O184L3300j8394
$$ 65929 54778 16303 -1312 -6635 -8141 -9693 -27182 -22558 6564 4378 10562 43862 25468
8900B5468k6244l3484k817K1773J580q712k275k0665J7929J2938K4426L3574q353
$$ 25468 -776 -34260 -37077 -15304 -13724 -22436 -24711 -45376 -27447 -14509 9917 43491 35138
8887C5138l0445j7873o030L223K4732j561R846q029J5082k0122j4779L473Q699
$$ 35138 4693 -13180 -19210 -15987 8745 7184 17030 9001 24083 3961 -10818 -7345 1354
8874A354N1046l770Q339j0215N801P201n483m0746J2815o855k9172k1170K1841
$$ 1354 52400 48630 56969 46754 52555 59756 54273 13527 26342 19487 -9685 -30855 -9014
8861i014J3257k3078M262K960O095J7210J5692j1613j0517k0399j568J4697k5742
$$ -9014 4243 -18835 -14573 -11613 -5518 11692 27384 15771 5254 -15145 -16713 -2016 -27758
8848b7758p23K624J6012L918J2220j1854j7121J7953K8023J2793k3736m777J0859
$$ -27758 -28481 -25857 -9845 -5927 6293 -5561 -22682 -4729 23294 36087 12351 7574 18433
8835A8433J3351J4474m428j8100k3610J2054J6711j1905P131l2606p115j2726
$$ 18433 31784 46258 41830 23730 120 12174 28885 16980 24111 -8495 -15610 -28336
8823b8336J7855j9288M2458M923j8782J2805K0232J223p926K4832O206l7145j3230
$$ -28336 -10481 -29769 12689 17612 -1170 11635 31867 33090 25164 49996 56202 19057 5827
8810E827J5159J7744K8450L796K206K917k6713m7315p468K6041J7463r962j0776
$$ 5827 20986 38730 67180 70976 73182 76099 49386 2071 -5397 20644 38107 28145 17369
8797A7369j0820j7887j5671K426O803L1455J8405l7261J5169L8553J257K953j2713
$$ 17369 6549 -11338 -27009 -24583 -17780 13675 32080 -5181 9988 48541 49798 52751 40038
8784D0038p6452o922J6023L1478K2409N597l8118N512l535J8182m467j5685j6207
$$ 40038 -36414 -43336 -27313 4165 26574 32171 -5947 -435 -3970 14212 9745 -5940 -22147
8771b2147k1097j3103J2958J3724R939J1902K3713j4351R503J3145j3494R384
$$ -22147 -43244 -56347 -43389 -29665 -19726 -7824 15889 1538 11041 24186 10692 20076
8759B0076L4331L507k1665k4816L6410k554k3853k5900K689M5234l702k6203j3589
$$ 20076 54407 57914 36249 11433 47843 45289 21436 -4464 -1775 43459 39757 13554 -35
8746c5l7689j5199p087L3957O101J5413J7852J2932j3299l6152J0543j946J1451
$$ -35 -37724 -52923 -60010 -26053 -19952 -4539 13313 26245 12946 -23206 -12663 -14609 -3158
8733c158N028J9415j8102J5430N134j0356k2311l949O675J2974m851k6173o629
$$ -3158 1870 21285 3183 18613 23747 13391 -8920 -12869 -6194 6780 1929 -24244 -30873
8720c0873J6809K2212o03k1564r931k757L021M3575q678J3611m6160k7128M860
$$ -30873 -14064 8148 7545 -14019 -23950 -26707 -23686 19889 11211 24822 -21338 -48466 -43606
8707d3606K1306K7579J0434m678r756O622k687l018N116k0120P296O406k8049
$$ -43606 -22300 5279 15713 11035 1279 7901 5214 2196 7312 -12808 -5512 894 -27155
8694b7155J2661q943J9088K155l1877j8590o519J5490J6869J0261Q318Q843j3561
$$ -27155 -14494 -23437 -4349 -2194 -34071 -52661 -59180 -43690 -26821 -16560 -8242 601 -12960
8681a2960k986R52m93k743j9197j5454L5080L0361M5692n400l7588j781k228J29
$$ -12960 -15946 -14994 -15487 -18230 -37427 -52881 -17801 12560 58252 52852 15264 13483 11255 11384
8667A1384J3498J9051J5980k6954m1873j1185m30K5978j8599m44j1098N1364K1063
$$ 11384 24882 43933 59913 32959 -8914 -20099 -20529 5449 -13150 -13594 -24692 26672 47735
8654D7735P795k1476m1439p300N5876k2691o725l392j1821j2231J200q973m0431
$$ 47735 55530 34054 -7385 -14685 41191 18500 11775 8383 -3438 -15669 -14469 -23442 -63873
8641f3873J9492K5449K2588L672J8321M2784k0466l9451J8783p640Q5K7514P36
$$ -63873 -44381 -18932 3656 7328 25649 68433 47967 8516 27299 19659 19744 47258 47994
8628D7994O390m857m7428l4618K1217J1990k3968O358K1108M139P590o902k856
$$ 47994 54384 49527 2099 -32519 -11302 688 -23280 -16922 4186 8325 15915 9013 6157
8615F157j5270M802K3861L2215k374j6226j0967R525n914j1730J7271J1452J8391
$$ 6157 -9113 -4311 19550 51765 49391 33165 22198 31723 25809 14079 31350 42802 61193
8602F1193J5938j0666j2115j3848p490K1063j4880J3957j1745j0016j3222L4455
$$ 61193 77131 66465 54350 40502 33012 54075 39195 53152 41407 31391 18169 52624
8590E2624L2413o046j8746l2259l5288l472O2122M9256J1343k4188k1343k7946
$$ 52624 85037 78991 60245 27986 -7302 -10774 51348 100604 111947 87759 66416 38470
8578C8470k1231j9508o742L690L3912R7k4903j488k2281m271j4539J6986M6120
$$ 38470 17239 -2269 -9011 -5321 28591 28688 3785 2297 -19984 -24255 -38794 -21808 24312
8565B4312K5067o99k0781j4952M459m586n920K6251o952q995M152K0970m346n7494
$$ 24312 49379 48680 27899 12947 17406 12820 6900 33151 26199 17204 21356 42326 37980 -19514
8551a9514Q627O847r961L0499r954k6277J0540O798Q966j9005K4245K9831M625
$$ -19514 -10887 -4040 -14001 16498 6544 -19733 -9193 -2395 6571 -12434 11811 41642 46267
8538D6267n953k9467k762J7610J457j1521j478Q437J665R341J3851j0073l3315
$$ 46267 40314 10847 8085 25695 27152 15631 14153 22590 24255 33596 47447 37374 4059
8525D059j1063K508j9194P909k826K3675K4508j3403j5692J0122P034P746k676
$$ 4059 -7004 -4496 -23690 -15781 -18607 5068 29576 16173 481 10603 17637 25383 22707
8512B2707k8786J9727J5196J9909P647o091L3699J0139n0239j9212J862L9411
$$ 22707 -6079 13648 28844 48753 56400 50309 84008 94147 43908 24696 26558 65969
8500F5969J6239m0788k6370J1227j0028j5820K3942R565j8706k754J5344M478
$$ 65969 82208 41420 15050 26277 16249 429 24371 33936 15230 12476 27820 32298
8488C2298j5319r134K0586J0451j2526n857k072P70m676Q848l67K2531J159l7863
$$ 32298 16979 7845 28431 38882 26356 20499 18427 19197 14521 23369 23002 45533 46692 8829
8474H829R513J045J1110J3519R468p13p146j1372m3614p15J2986K2232R746J3245
$$ 8829 18342 19387 30497 44016 53484 52771 45625 34253 -9361 -10076 2910 25142 34888 48133
8460D8133n333q694l35K1724K4159m102R583p189m974k548J0713k2054l53K419
$$ 48133 42800 34106 33771 55495 79654 75552 85135 77946 72972 70424 81137 59083 58730 61149
8446F1149q949J5827K4776l682j1280N31l8204p2491K897M0000L7050K9715M221
$$ 61149 52200 68027 92803 89121 77841 78372 40168 -32323 -29426 10574 47624 77339 81560
8433H1560l237Q568J7288l828j5905n019k061j7173k3101K0666J0509q752j5940
$$ 81560 78323 86891 104179 100351 84446 79427 77366 60193 37092 57758 68267 59515 43575
8420D3575J6795j3830j4078J6608j8885k497K6961J4658p197m3169O278J6807
$$ 43575 60370 46540 32462 49070 30185 27688 54649 69307 62110 18941 25219 42026
8408D2026J0590l1732K9296l042l0575o156M6895q479l4298J6211r141j0260K2094
$$ 42026 52616 20884 50180 47138 16563 10407 57302 48823 14525 30736 21595 11335 33429
8395C3429L6925L360j2364n101m076k0474j3363Q593O311K6054k832j3575J9702
$$ 33429 70354 73714 61350 56249 52173 31699 18336 26929 33240 59294 56462 42887 62589
8382F2589J4062R015L3757j350m7688j2965n36j2461j5297j4091p047M244Q953
$$ 62589 76651 85666 119423 118073 70385 57420 56884 44423 29126 15035 7988 12232 21185
8369B1185l954j5782k5540K4058n396R367K9375L1858J0673k3002m1217K3931
$$ 21185 17231 1449 -24091 -33 -5429 3938 33313 65171 75844 52842 11625 35556
8357C5556K9321j4926o822j0841k4845J2416K8138K354J9948k2391j3972p28j942
$$ 35556 64877 49951 43129 32288 7443 19859 47997 50351 70299 47908 33936 33208 31266
8344C1266k3535j9967N13P816r068M2916K6796L3815J0195k7486Q125O241l1401
$$ 31266 7731 -12236 -11723 -3907 -12975 29941 56737 90552 100747 73261 81386 87627 56226
8331E6226j5790K3971J5307j7315J2263J8547J719J5986k7491q207k9502j2696
$$ 56226 40436 64407 79714 62399 74662 93209 94928 110914 83423 75216 45714 33018
8319C3018M7072r026M760Q451L7269l2810m7212k7726n954J7699Q740Q385J1884
$$ 33018 80090 71064 75824 84275 121544 88734 41522 13796 7842 25541 34281 42666 54550
8306E4550L0173K1656m255m6125q123J5133q434j5312K6782J6407K7960k9416
$$ 54550 84723 106379 102124 55999 47876 63009 54575 39263 66045 82452 110412 80996
8294H0996j4352j5668j3229m135K1535M5175K0929L44P928j4080j5713J1732n779
$$ 80996 66644 50976 37747 33612 55147 100322 121251 121595 129523 115443 99730 111462 105683
8281A05683L1538M862j6771k5006j2324o726L650j4050k1227n727k109K3583L7291
$$ 105683 137221 142083 125312 100306 87982 81256 84906 70856 49629 43902 41793 65376 102667
8268A02667K1547k5319k0254l7899M5249M0413K2878l0611j624J0415l7465k2345
$$ 102667 124214 98895 78641 40742 85991 126404 149282 118671 117047 127462 89997 67652
8256F7652n165p74J3983K295O524j7339l8065k431j2823L3480L0800r68k7613
$$ 67652 62487 61713 75696 77991 84515 67176 29111 26680 13857 47337 78137 77169 49556
8243D9556k1036J8545Q292J5273P157n7238k0503L1335J3131J8647N266n909k1635
$$ 49556 28520 47065 55357 70630 77787 20549 46 31381 44512 63159 68425 62516 40881
8230D0881K8854R815j4858j1908K4564m659k6182m135j5880K236J1754J2048j0750
$$ 40881 69735 79550 64692 52784 77348 72689 46507 42372 26492 28728 40482 52530 41780
8217D1780r659p422K470L2908l0251J0407J0573j0167J4045l413J7769K4125k2355
$$ 41780 32121 24699 27169 60077 29826 40233 50806 40639 54684 51271 69040 93165 70810
8204G0810n272p366R124K251J5360J3537j5349p543J4383L6343j2275p09k2637
$$ 70810 65538 58172 67296 69547 84907 98444 83095 75552 89935 126278 114003 113294 90657
8191I0657l4821R120o826K1967n2608m409K8478n728j4360q228N3689N5838l0527
$$ 90657 55836 64956 58130 80097 27489 23080 51558 45830 31470 23242 76931 132769 102242
8178A02242j9532k3692l6701j6069M4279o640k748K5908n151q88R457j0878k1632
$$ 102242 82710 59018 22317 6248 50527 43887 41139 67047 61896 61008 70465 59587 37955
8165C7955j1604j6623R930K1762L359k980J1192l7457k5034K5167L0887L2769
$$ 37955 26351 9728 19658 41420 44779 41799 52991 15534 -9500 15667 46554 79323
8153G9323p448o094k9917k0775q913K5595J3890n700L6467Q656K610j162k0051
$$ 79323 71875 65781 35864 15089 6176 31771 45661 39961 76428 85084 87694 86532 66481
8140F6481j4778r252J101K2834K3744K6042k4340l0831l8227K2299O378k6193
$$ 66481 51703 42451 43552 66386 90130 116172 91832 61001 22774 45073 51451 25258
8128B5258J0493k5165r058L7261J0790j3482j2n660j7368j1784J8797J750P644
$$ 25258 35751 10586 1528 38789 49579 36097 36085 30425 13057 1273 20070 21820 29464
8115B9464o565J2368R858M630J488j3927k2360r022K4888K7253J4227K5631j305
$$ 29464 22899 35267 45125 49755 51243 37316 14956 5934 30822 58075 72302 97933 96628
8102I6628k7400n6722k1667J6622J1178O967J6641J4937j5945j5268J2391l86
$$ 96628 69228 12506 -9161 7461 18639 25606 42247 57184 41239 25971 38362 37976
8090C7976j2291l3259J9043M5476J6471K0665r755j4837j5965J7037n924R208
$$ 37976 25685 -7574 11469 56945 73416 94081 84326 69489 53524 70561 64637 73845
8078G3845J8255N424j2538l9896K248n134l3458k9305J1628L0084J8669J6349
$$ 73845 92100 97524 84986 45090 47338 42204 8746 -20559 -8931 21153 39822 56171
8066E6171J4444j8852k1077j1845k934l8429O983M5682K4347k3470k5425o086
$$ 56171 70615 51763 30686 18841 15907 -22522 -15539 30143 54490 31020 5595 -491
8054d91j3130n25q656j2429J270K1573L0550J2007P690n072J35K8134l4101p839
$$ -491 -13621 -14146 -22802 -35231 -33961 -12388 18162 30169 37859 32787 32922 61056 26955 19116
8040A9116K6904j604j9576J3793L411k4632K4816j6069j3410j2068j8254o286
$$ 19116 46020 44416 24840 38633 42044 17412 42228 26159 12749 681 -17573 -23859
8028b3859J8513K1892K7874K3657p787j8208n681J8233o772J3582k0510r380Q42
$$ -23859 -5346 16546 44420 68077 60290 42082 36401 54634 47862 61444 40934 31554 32396
8015C2396k4500P97J0963L1099O711j7853J0808K9852p596J3843m612j9726j5552
$$ 32396 7896 8693 19656 50755 57466 39613 50421 80273 72677 86520 81908 62182 46630
8002D6630j3681j5693k0192J6859J6291K4235J6582j1996k3844J719K860m981
$$ 46630 32949 17256 -2936 13923 30214 54449 71031 59035 35191 36910 39770 34789
7990C4789l5088O996n627j4355K1136j0836j3221J1711J125Q403J5405r227r936
$$ 34789 -299 6697 1070 -13285 7851 -2985 -16206 -4495 -3370 5033 20438 11211 1275
7977A275L442N085K0810L353K4992J505l9031m0748J4047l3770q073J5830M2226
$$ 1275 4717 9802 30612 33965 58957 60462 21431 -19317 -5270 -39040 -47113 -31283 10943
7964A0943K7909k4998R02m0011j3602J0647k5151J0292L3452J0023k103K0686
$$ 10943 38852 13854 14756 -25255 -38857 -28210 -53361 -43069 -9617 406 -1697 18989
7952A8989j7381j6602O788K4567j7109l2805l098J044j0319k5769J6844M1599
$$ 18989 1608 -14994 -8206 16361 -748 -33553 -36651 -35607 -45926 -71695 -54851 -13252
7940a3252Q410P718J222J2663R897m7518J2069K0061o023k0315M892K6593l4164
$$ -13252 -4842 2876 4098 16761 26658 -20860 -8791 11270 5247 -15068 -10176 16417 -17747
7927a7747k0683j5161j1226K8843L2402L2024j0927m8718k806L7936K018j2434
$$ -17747 -38430 -53591 -64817 -35974 -3572 28452 17525 -31193 -33999 3937 5955 -6479
7915f479L3766K8481j064l2751J469K5064j2303Q807m4508j2369K6155M978k3682
$$ -6479 27287 55768 54704 21953 23422 48486 36183 44990 482 -11887 14268 19246 -4436
7902d436L2952M830K0807k678n312k17J6318L615m782J3073m7802l7118j5989
$$ -4436 28516 33346 54153 51475 46163 45946 62264 65879 61097 74170 26368 -10750 -26739
7889b6739j3738J0736J1399j6104n646L2521R395J8375J9502M336k0616L181k3403
$$ -26739 -40477 -29741 -18342 -34446 -40092 -7571 1824 20199 39701 44037 23421 26602 3199
7876C199r33j2722n687J025K3902M3456j76j9139j6900r061J4984N985j4373q762
$$ 3199 2266 -10456 -16143 -15118 8784 52240 52064 32925 16025 6964 21948 27933 13560 4798
7862D798J0101l853r048R17j2345k2764M66L2389K8583j2251L934N321k5891m01
$$ 4798 14899 11046 1998 2915 -9430 -32194 -31728 661 29244 16993 20927 26248 357 -44
7848d4K3545q851j9029K0926l0209l3707J3408P523K2216L1066r422J4920J5443
$$ -44 23501 14650 -4379 16547 -13662 -47369 -33961 -26438 -4222 26844 17422 32342 47785
7835D7785J0850j7318J74j4915k463l0104m0589L9861J9970k5411J73J4885J7563
$$ 47785 58635 41317 41491 26576 24113 -5991 -46580 -6719 13251 -12160 -11987 2898 20461
7822B0461J0838l1k1974l4101k7942J288J9999k734J2502J9610m630j536l38l5093
$$ 20461 31299 31268 9294 -24807 -52749 -51461 -31462 -34196 -21694 -2084 -6714 -8250 -8588 -43681
7808d3681m3077K3287M4260p961j299M5582L6306o877j9583J8725l912k1702j7513
$$ -43681 -86758 -63471 -19211 -27172 -28471 17111 53417 46540 26957 45682 41770 20068 2555
7795B555p273l978m424L994j1892K122r850L68J7546M2330J1597m3841m8269L1995
$$ 2555 -4718 -8696 -13120 -9126 -21018 -18896 -28746 -28378 -10832 31498 43095 -746 -49015 -17020
7781a7020K7075J4473L0535j9910m2474m7563K3808L0522K86N793L2694j5899
$$ -17020 10055 24528 55063 35153 -7321 -54884 -31076 -554 -268 5525 38219 22320
7769B2320l1071o139o382q533n158l820M800j2922M395L3717Q785J3162J670k2839
$$ 22320 -8751 -14890 -21272 -29805 -34963 -38783 -33983 -46905 -42510 -8793 -8 13154 14824 -8015
7755h015j0686M4193K486o332j2587m098o549N132J0908l6430k454J0559n222
$$ -8015 -18701 25492 27978 21646 9059 4961 -1588 3544 14452 -21978 -24432 -13873 -19095
7742a9095k9266o873K611K4770K5685M319k6184k5539k2075J9995N7123R794o690
$$ -19095 -48361 -55234 -52623 -27853 -2168 2151 -24033 -49572 -71647 -51652 5471 15265 8575
7729H575l5002r612q101M9103J7745l8529M519K0406M037k2057O899J7616o705
$$ 8575 -26427 -36039 -44140 4963 22708 -15821 -11302 9104 13141 -8916 -2017 15599 8894
7716H894j4821n788j0212j4706L4319M2526n674j4353j943k707m459J2931L2248
$$ 8894 -5927 -11715 -21927 -36633 -2314 40212 34538 20185 18242 15535 11076 24007 56255
7703E6255m0413m1983J2922J5549J6690k652J0048J3637K7515l3815m9426j0283
$$ 56255 15842 -26141 -13219 2330 19020 16368 26416 40053 67568 33753 -15673 -25956
7691b5956n359J6611K3964o929j0945j864j6190K4322J7809m43j659j31J6376
$$ -25956 -31315 -14704 9260 2331 -8614 -10478 -26668 -2346 15463 15020 13361 13230 29606
7678B9606k1018k3302R697N790j0411l2788J2232K7968Q266o739j5736k5633o778
$$ 29606 8588 -14714 -5017 773 -9638 -42426 -30194 -2226 6040 -699 -16435 -42068 -48846
7665d8846M2287L9270M091L1982j2386k9864l52p73k8841j6914R865j6028L5895
$$ -48846 -6559 32711 36802 68784 56398 26534 26182 25409 -3432 -20346 -10481 -26509 9386
7652I386L308N691Q19P347k5824n035K1251L3613L6358q06k8549l7076r449J2127
$$ 9386 12694 18385 19204 26551 727 -4308 16943 50556 86914 86108 57559 20483 11034 23161
7638B3161L8725k5953l4952k3993m690K873J950K6410j5738L6328L9714J1557
$$ 23161 61886 35933 981 -23012 -27702 -24829 -22879 3531 -12207 24121 63835 75392
7626G5392K373j3025J5128n574J8988N537k863j6914l6671k8782k911q570k860
$$ 75392 77765 64740 79868 74294 93282 98819 95956 79042 42371 13589 10678 2108 -752
7613g52M538L7551J1105j7280k1839N119r29L2376J5533K489n4937n4509J2614
$$ -752 3786 41337 52442 35162 13323 18442 17513 49889 65422 67911 12974 -41535 -28921
7600b8921J7091K2605l2015k4317k660k5711J4438J9868j8780R558K2020L5499
$$ -28921 -11830 10775 -21240 -45557 -48217 -73928 -59490 -39622 -58402 -48844 -26824 8675
7588H675q204Q581N564j5749L7472l8598j3693M1914M550m1481r714m103j2723
$$ 8675 471 9052 14616 -1133 36339 -2259 -15952 25962 30512 -10969 -20683 -24786 -37509
7575c7509K858M2917N899j6580l9172r58K1679j699j2736O229J0077K9584L1044
$$ -37509 -34651 8266 14165 -2415 -41587 -42545 -20866 -22565 -35301 -29072 -18995 10589 41633
7562D1633J5382K2872K6370k2713k1604K483J2976J1112k1187k2717o4120J072
$$ 41633 57015 79887 106257 83544 61940 64423 77399 88511 67324 44607 -19513 -18441
7550a8441K864M262j3242j413L0129J0016K351r369O801k5305m8967J8456J3671
$$ -18441 -15577 -11315 -24557 -25970 4159 14175 16526 7157 13958 -11347 -60314 -41858 -28187
7537b8187l409N715l074m2039j6982R781K9070J8039J3500Q09j069K8060K5603
$$ -28187 -31596 -25881 -28955 -70994 -87976 -78195 -49125 -31086 -17586 -16777 -17846 10214 35817
7524C5817J0241j7867l125k3713l5291k6481K4669K6056k797l3452J2834N5487
$$ 35817 46058 28191 25066 1353 -33938 -60419 -35750 -9694 -12491 -45943 -33109 22378
7512B2378J8279j8208q195l899R533J0578j3981K852L332k6009M016J4822J3939
$$ 22378 40657 22449 14254 10355 19888 30466 16485 19337 22669 -3340 676 15498 29437
7499B9437j8344r036p522J4609L0466r398m3196J8294k6031r626L5461R197K4639
$$ 29437 11093 2057 -5465 9144 39610 30212 -12984 5310 -20721 -30347 5114 14311 38950
7486C8950L52k849J2353j7631n944L172J5532o050m1113J459j0856k038r858k4567
$$ 38950 39302 36453 48806 31175 25231 28403 43935 37885 -3228 -1769 -12625 -14663 -24521 -49088
7472d9088j2379L7502P098J0690j181r372j7486K594j4698k6441j1445o751K4200
$$ -49088 -61467 -23965 -16867 -6177 -7358 -16730 -34216 -31622 -46320 -72761 -84206 -90957 -66757
7459f6757J2261N923n83K0879L1120p459l3258K0604R71j7356j8162p931j2064
$$ -66757 -54496 -48573 -49156 -28277 2843 -4616 -37874 -17270 -16299 -33655 -51817 -59748 -71812
7446g1812K9491J9307N05O187J7288R806j9401k3721Q559p959J5757J3968K6434
$$ -71812 -42321 -23014 -22509 -16322 966 10772 -8629 -32350 -23791 -31750 -15993 -2025 24409
7433B4409J3055Q87l2277l2989j7211n14k503J4779M842n735K731J9389k713L011
$$ 24409 37464 38351 6074 -26915 -44126 -44640 -47143 -32364 -27522 -33257 -30526 -11137 -13850 -10839
7419a0839j2194p763j205L0278J0693L2755N0749k6265k3956O792j918l2028j5458
$$ -10839 -23033 -30796 -32001 -1723 8970 41725 92474 66209 42253 49045 47127 15099 -359
7406c59k8518j3667K4709m561J5512N42O98O966j2684M688R284Q468l0408m2781
$$ -359 -28877 -42544 -17835 -22396 -6884 -6342 -5644 1322 -11362 -6674 2610 11078 -19330 -62111
7392f2111r027K3317K0078n925j5437k1507K884J2358K808N3374P541k4189R27
$$ -62111 -71138 -47821 -27743 -33668 -49105 -70612 -67728 -55370 -52562 812 8353 -15836 -14909
7379a4909m218r788J8984j1258k996J6387k0410K0199K6680J2920j6577m561J0988
$$ -14909 -19127 -28915 -9931 -21189 -24185 -7798 -28208 -8009 18671 31591 15014 10453 21441
7366B1441j4161j2534l821l971j1430r251K2581L1096j3992p148J8098j0528K431
$$ 21441 7280 -5254 -9075 -13046 -24476 -33727 -11146 19950 5958 -1190 16908 6380 8811
7353H811r119k2220j7278L2572N77j1761p132K3749K0261O582j9961j6424J7156
$$ 8811 -308 -22528 -39806 -7234 -6657 -18418 -25550 -1801 18460 25042 5081 -11343 5813
7340E813k5173j4024m1444j5196L3861K4979Q602O429J2038r409N04q90K8989
$$ 5813 -19360 -33384 -74828 -90024 -56163 -31184 -22582 -16153 -4115 -13524 -13020 -13910 15079
7327A5079Q514m3869j6453j841R887J5035l5035j3256K9816J5559j3292J5260
$$ 15079 23593 -20276 -36729 -38570 -28683 -13648 -48683 -61939 -32123 -16564 -29856 -14596
7315a4596j1957K5863j590l4776J2482K5629J3399j0651l026j0844K1514r303
$$ -14596 -26553 -690 -2280 -37056 -24574 1055 14454 3803 777 -10067 11447 2144
7303B144k9613k173J6705J7428j6671m3910j1677Q769k7301j0043N5045J2865
$$ 2144 -27469 -29642 -12937 4491 -12180 -56090 -67767 -58998 -86299 -96342 -41297 -28432
7291b8432m164L1950N843k3861r621O934K1865K2688k3443j5436p977P745J0876
$$ -28432 -32596 -646 5197 -18664 -28285 -21351 514 23202 -241 -15677 -23654 -15909 -5033
7278e033M544L569J1375k7745k3885q023K8601L1466J5817l086q220q137k7680
$$ -5033 -489 3080 14455 -13290 -37175 -45198 -16597 14869 30686 27600 19380 11243 -16437
7265a6437N074j3215j7952j9850Q481Q071j3427k5872j5907j9123k7980Q203O5624
$$ -16437 -11363 -24578 -42530 -62380 -53899 -45828 -59255 -85127 -101034 -120157 -148137 -139934 -74310
7252g4310P3075M041m0539j1948k796K4243P0567J9954n5670n7206j0060L352
$$ -74310 -1235 2806 -37733 -49681 -52477 -28234 42333 62287 6617 -50589 -60649 -57297
7240e7297K0497M1007P444m3608j9194J8753J0271J1520J2285l584j2572k2731
$$ -57297 -36800 4207 11651 -31957 -51151 -32398 -22127 -10607 1678 -1906 -14478 -37209
7228c7209k0454J6483N2014l908k9900k107K7535R449K1250J681l127j3484l0402
$$ -37209 -57663 -41180 10834 6926 -22974 -25081 2454 11903 33153 34834 31707 18223 -12179
7215a2179n551k912O396j5776Q060n084P882L6600L6169p315k2316j6202K314
$$ -12179 -17730 -20642 -14246 -30022 -21962 -27046 -19164 17436 53605 46290 23974 7772 10086
7202A0086k655n1043k1566j1101K5694L0223K8752r043k1039N196j9603J258k4323
$$ 10086 7431 -43612 -65178 -76279 -50585 -20362 8390 -653 -21692 -16496 -36099 -34841 -59164
7189e9164q407J6148j4119K7926K3547r373Q671n967L365K0152J7132K1475j0211
$$ -59164 -67571 -51423 -65542 -37616 -14069 -23442 -14771 -20738 -17373 2779 19911 41386 31175
7176C1175m6361J7596m856j1777J4976l809K3899J7884j0091j0682L9115l559
$$ 31175 -15186 2410 -2446 -14223 753 -3056 20843 38727 28636 17954 57069 53510
7164E3510k4249j0756q531j9348m3269j8880Q26J5193J8788L8071R205K0790K0497
$$ 53510 29261 18505 9974 -9374 -52643 -71523 -70697 -55504 -36716 1355 10560 31350 51847
7151E1847k9578m4471J7085J9500K6430M262k8601k7277n745Q69k7267M9307N915
$$ 51847 22269 -22202 -5117 14383 40813 45075 16474 -10803 -16548 -15679 -42946 6361 12276
7138A2276l9650J1246O935j1239l1218P852K4333L9869l629j8053m0338N567J3155
$$ 12276 -27374 -16128 -9193 -20432 -51650 -43798 -19465 20404 16775 -1278 -41616 -36049 -22894
7125b2894J1906l0445L408M3608J4744J781k5920m1752Q329O668j570l450K8355
$$ -22894 -10988 -41433 -38025 5583 20327 22108 -3812 -45564 -37235 -30567 -32137 -35587 -7232
7112g232J9983j5006j3785J7144K5458r572j3091J2250J1167L1185N498l2634
$$ -7232 12751 -2255 -16040 1104 26562 16990 3899 16149 27316 58501 63999 31365
7100C1365k4675J3135j6996r670N470j5452N416J6593j0505K810j3236L761m428
$$ 31365 6690 19825 2829 -6841 -1371 -16823 -11407 5186 -5319 -2509 -15745 -11984 -16412
7087a6412J1129j0485j0905n648j1397j8197L008L610K418k0389J5575L7779L7299
$$ -16412 -5283 -15768 -26673 -32321 -43718 -61915 -58907 -55297 -52879 -73268 -57693 -19914 17385
7074A7385L6863j1567m4532l3820l036J4936k284J9268M127j8993j1560l5483
$$ 17385 54248 42681 -1851 -35671 -38707 -23771 -26055 -6787 -2660 -21653 -33213 -68696
7062f8696L4717L1774p537n964K792K3665K4563j3414k9113k847K1660Q716l5005
$$ -68696 -33979 -2205 -9742 -15706 -12914 10751 35314 21900 -7213 -10060 11600 20316 -14689
7049a4689j6760K8251M427j2052J8384q443j0471J3482O186K02l9211L4466J4915
$$ -14689 -31449 -3198 1229 -10823 7561 -882 -11353 2129 8315 8517 -30694 3772 18687
7036A8687K562k2344l0989r403J6400n218j57K8002P334k0468k0547J8282P956
$$ 18687 21249 -1095 -32084 -41487 -25087 -30305 -30462 -2460 4874 -15594 -36141 -17859 -9903
7023i903m301r864j3847r90r63K4514L3817l764k8082j2434J5445J2499J9108
$$ -9903 -14204 -24068 -37915 -38905 -39868 -15354 18463 14699 -13383 -25817 -10372 2127 21235
7010B1235l1830l8299K4698P242P360J0437J9674Q564J2071l5701n589J6917q407
$$ 21235 -10595 -48894 -24196 -16954 -9594 843 20517 29081 41152 5451 -138 16779 8372
6997H372j2711j4105R560r323L182K3899j3055m3036j0703N3184j2420k4273m9237
$$ 8372 -4339 -18444 -8884 -18207 -15025 8874 -4181 -47217 -57920 -4736 -17156 -41429 -90666
6984i0666J2656J2269J1316J0039j7330K4222J5827k9460m1312j0427K2952J6354
$$ -90666 -78010 -65741 -54425 -44386 -61716 -37494 -21667 -51127 -92439 -102866 -79914 -63560
6972f3560J4867O332j990J0032J2146M258r069J0670Q237P117J0737l8026Q615
$$ -63560 -48693 -42361 -44351 -34319 -22173 -17915 -26984 -16314 -8077 -960 9777 -28249 -19634
6959a9634K3064K2668l6903j9283k6515n626m584Q807J1563L6547J5658n1064
$$ -19634 3430 26098 -10805 -30088 -56603 -62229 -66813 -58006 -46443 -9896 5762 -45302
6947d5302j3614K7540q547m4470m747L6574L7765M848m199J0668l9809o194J1141
$$ -45302 -58916 -31376 -39923 -84393 -89140 -52566 -14801 -9953 -14152 -3484 -43293 -49487 -38346
6934c8346J1215j0894j3213k4226K3721L3654J7105M2677K1977j1581k7942J47
$$ -38346 -27131 -38025 -51238 -75464 -51743 -18089 -984 41693 63670 52089 24147 24294
6922B4294q5k4657k7077Q690K460J4958M681j7429o438K83O10K0128M634L99o319
$$ 24294 24209 -448 -27525 -18835 -16375 -1417 3264 -14165 -20603 -20320 -19710 418 5052 5451 -868
6907h68j4830n616M300q412q746K3006J1976k1787l4440j4867k4637K2157P3204
$$ -868 -15698 -21314 -17014 -25426 -34172 -11166 810 -20977 -55417 -70284 -94921 -72764 440
6894D40n736k3222K032K3728l542p106k7772L0903k969P763J3896J0370P299N427
$$ 440 -5296 -28518 -26486 -2758 -6300 -13406 -41178 -10275 -13244 -5481 8415 18785 26084 31511
6880C1511J2666n1923l1032O638j027J6686J1425j4818k2264p32j8976q856m358
$$ 31511 44177 -7746 -38778 -32140 -33167 -16481 -5056 -19874 -42138 -42870 -61846 -70702 -75060
6867g5060J78L8184J2338J6888j4185j2049K1702K8463J9817k5411k0143p678
$$ -75060 -74882 -36698 -24360 -7472 -21657 -33706 -12004 16459 36276 10865 -9278 -16956
6855a6956J0981m2663m795L0290J2584k373l741j5202j3264J8800J3268J4716
$$ -16956 -5975 -48638 -53433 -23143 -10559 -12932 -16673 -31875 -45139 -26339 -13071 1645
6843A645J0554o413l6158k529K3932k2767m711r940Q681R24O946K1516l150m561
$$ 1645 12199 5786 -30372 -32901 -8969 -31736 -36447 -46387 -37706 -36782 -29836 -8320 -11470 -16031
6829a6031m562L0362K364k468K1148k7649n7688P633J3252N83J1949J4307M240
$$ -16031 -20593 9769 12133 9665 30813 3164 -54524 -46891 -33639 -33056 -21107 -6800 -2560
6816b560K889N827m725J5945M172m7339r495L288K5897j3756o039M3731N1690
$$ -2560 329 6156 1431 17376 21548 -25791 -35286 -31998 -6101 -19857 -25896 17835 69525
6803F9525n366o3224j9735R191j6700k3703J2014L8152l6129n9276J6340K5013
$$ 69525 64159 935 -18800 -9609 -26309 -50012 -37998 154 -35975 -95251 -78911 -53898
$$ [...]
##END NTUPLES=NMR SPECTRUM
##END=
