##TITLE=Analysis number 329867
Compound Code cc 66903
Book Reference 510/90
Project Code adrs
Chemist Name jimp
##JCAMPDX= 6.0         $$ Bruker NMR JCAMP-DX V2.0
##DATA TYPE= NMR SPECTRUM
##DATA CLASS= NTUPLES
##ORIGIN= Bruker BioSpin GmbH
##OWNER= nmr
$$ XWIN-NMR		Version 3.5
$$ Fri Oct  5 10:57:25 2007 GMT Daylight Time (UT+1h)  MAYBRIDGE\nmr@NMR_250MHZ
##.OBSERVE FREQUENCY= 250.131544655141
##.OBSERVE NUCLEUS= ^1H
##.ACQUISITION MODE= SIMULTANEOUS (DQD)
##.ACQUISITION SCHEME= undefined
##.AVERAGES= 16
##.DIGITISER RES= 18
##SPECTROMETER/DATA SYSTEM= dpx250
##.PULSE SEQUENCE= zg30
##.SOLVENT NAME= CDCl3
##.SHIFT REFERENCE= (INTERNAL, CDCl3, 0, 16.522)
##AUDIT TRAIL= $$ (NUMBER, WHEN, WHO, WHERE, WHAT)
$$ ##TITLE= Audit trail, XWIN-NMR		Version 3.5
$$ ##JCAMPDX= 5.01
$$ ##ORIGIN= Bruker BioSpin GmbH
$$ ##OWNER= nmr
$$ C:\u/data/dgb/nmr/ADRS/320/pdata/1/auditp.txt
$$ ##AUDIT TRAIL=  $$ (NUMBER, WHEN, WHO, WHERE, WHAT)
(   1,<2007-10-05 10:57:04.49 +100>,<MAYBRIDGE\nmr>,<NMR_250MHZ>,
      <created by zg, POWCHK disabled, PULCHK disabled
       configuration hash MD5:
       76 6E 9A 78 1E 09 19 81 EC 84 63 8F B0 6A 59 2D
       data hash MD5: 64K
       2B DB 99 07 41 4C BF 83 D4 BD 2D DD 8F 5D A4 4E>)
(   2,<2007-10-05 10:57:16.87 +100>,<MAYBRIDGE\nmr>,<NMR_250MHZ>,
      <Start of raw data processing
       ef LB = 0.3 FT_mod = 6 PKNL = 1 SI = 32K 
       data hash MD5: 32K
       8C B1 4B BC 35 DA 72 65 EF A7 D9 04 35 33 06 3D>)
(   3,<2007-10-05 10:57:18.51 +100>,<MAYBRIDGE\nmr>,<NMR_250MHZ>,
      <apk 
       data hash MD5: 32K
       85 D6 8D 19 34 4F AA 48 41 D9 E0 C4 08 2B AC 04>)
(   4,<2007-10-05 10:57:19.21 +100>,<MAYBRIDGE\nmr>,<NMR_250MHZ>,
      <abs ABSG = 5 
       data hash MD5: 32K
       90 1C CD F1 5D 02 7D DA 10 4D C4 3A C6 F5 C1 3B>)
$$ ##END=
$$ 
$$ hash MD5
$$ 5E A0 0C 60 F7 5A EA DE 47 14 6A 9B E7 82 8E 1E
##$RELAX= 
##$RELAX= 
##$RELAX= 
##$RELAX= 
##$RELAX= 
##$RELAX= 
##$RELAX= 
$$ Bruker specific parameters
$$ --------------------------
##$DU= <C:\u>
##$EXPNO= 320
##$NAME= <ADRS>
##$PROCNO= 1
##$TYPE= <nmr>
##$USER= <dgb>
##$AMP= (0..31)
100 100 100 100 100 100 100 100 100 100 100 100 100 100 100 100 100 100 
100 100 100 100 100 100 100 100 100 100 100 100 100 100 
##$AQSEQ= 0
##$AQ_mod= 3
##$AUNM= <au_zg>
##$AUTOPOS= <14 >
##$BF1= 250.13
##$BF2= 250.13
##$BF3= 250.13
##$BF4= 250.13
##$BF5= 500.13
##$BF6= 500.13
##$BF7= 500.13
##$BF8= 500.13
##$BYTORDA= 1
##$CFDGTYP= 0
##$CFRGTYP= 5
##$CHEMSTR= <none>
##$CNST= (0..31)
1 1 145 1 1 1 1 1 1 1 1 1 1 1 1 1 1 1 1 1 1 1 1 1 1 1 1 1 1 1 1 1 
##$CPDPRG= <>
##$CPDPRG1= <>
##$CPDPRG2= <>
##$CPDPRG3= <>
##$CPDPRG4= <mlev>
##$CPDPRG5= <mlev>
##$CPDPRG6= <mlev>
##$CPDPRG7= <mlev>
##$CPDPRG8= <mlev>
##$CPDPRGB= <>
##$CPDPRGT= <>
##$D= (0..31)
0 1 0 0 0 0 0 0 0 0.06 0 0 0 0 0 0 0.0002 0 0 0 0 0 0 0 0 0 0 0 0 0 0 
0 
##$DATE= 1191578223
##$DBL= (0..7)
120 120 120 120 120 120 120 120 
##$DBP= (0..7)
150 150 150 150 150 150 150 150 
##$DBP07= 0
##$DBPNAM0= <>
##$DBPNAM1= <>
$$ [...]
##$SUBNAM7= <"">
##$SUBNAM8= <"">
##$SUBNAM9= <"">
##$SW= 20.6930455092707
##$SWIBOX= (0..15)
0 0 3 0 0 0 0 0 0 0 0 0 0 0 0 0 
##$SW_h= 5175.983436853
##$TD= 65536
##$TD0= 1
##$TE= 296.16
##$TE2= 300
##$TE3= 300
##$TEG= 300
##$TL= (0..7)
0 120 120 120 120 120 120 120 
##$TP= (0..7)
150 150 150 150 150 150 150 150 
##$TP07= 0
##$TPNAME0= <>
##$TPNAME1= <>
##$TPNAME2= <>
##$TPNAME3= <>
##$TPNAME4= <>
##$TPNAME5= <>
##$TPNAME6= <>
##$TPNAME7= <>
##$TPOAL= (0..7)
0.5 0.5 0.5 0.5 0.5 0.5 0.5 0.5 
##$TPOFFS= (0..7)
0 0 0 0 0 0 0 0 
##$TUNHIN= 0
##$TUNHOUT= 0
##$TUNXOUT= 0
##$USERA1= <user>
##$USERA2= <user>
##$USERA3= <user>
##$USERA4= <user>
##$USERA5= <user>
##$V9= 5
##$VALIST= <valist>
##$VCLIST= <CCCCCCCCCCCCCCC>
##$VD= 0
##$VDLIST= <DDDDDDDDDDDDDDD>
##$VPLIST= <PPPPPPPPPPPPPPP>
##$VTLIST= <TTTTTTTTTTTTTTT>
##$WBST= 1024
##$WBSW= 4
##$XGAIN= (0..3)
0 0 0 0 
##$XL= 0
##$YL= 0
##$YMAX_a= 418981
##$YMIN_a= -536244
##$ZGOPTNS= <>
##$ZL1= 120
##$ZL2= 120
##$ZL3= 120
##$ZL4= 120
##$ABSF1= 16.522
##$ABSF2= -4.171173
##$ABSG= 5
##$ABSL= 3
##$ALPHA= 0
##$AQORDER= 0
##$ASSFAC= 0
##$ASSFACI= 0
##$ASSFACX= 0
##$ASSWID= 0
##$AUNMP= <proc_1d>
##$AZFE= 0.1
##$AZFW= 0.1
##$BCFW= 0
##$BC_mod= 0
##$BYTORDP= 0
##$COROFFS= 0
##$CY= 12.5
##$DATMOD= 1
##$DC= 0
##$DFILT= <>
##$DTYPP= 0
##$F1P= 14.0000005364418
##$F2P= -0.99999901652339
##$FCOR= 0.5
##$FTSIZE= 32768
##$FT_mod= 6
##$GAMMA= 0
##$GB= 0
##$INTBC= 1
##$INTSCL= 1
##$ISEN= 128
##$LB= 0.3
##$LEV0= 0
##$LPBIN= 0
##$MAXI= 10000
##$MC2= 0
##$MEAN= 0
##$ME_mod= 0
##$MI= 0
##$NCOEF= 0
##$NC_proc= -2
##$NLEV= 6
##$NOISF1= 0
##$NOISF2= 0
##$NSP= 0
##$NTH_PI= 0
##$NZP= 0
##$OFFSET= 16.522
##$PC= 1
##$PHC0= 155.9457
##$PHC1= 7.036106
##$PH_mod= 1
##$PKNL= yes
##$PPARMOD= 0
##$PSCAL= 4
##$PSIGN= 0
##$REVERSE= no
##$SF= 250.13
##$SI= 32768
##$SIGF1= 0
##$SIGF2= 0
##$SINO= 400
##$SIOLD= 32768
##$SREGLST= <1H.CDCl3>
##$SSB= 0
##$STSI= 32768
##$STSR= 0
##$SW_p= 5175.98343685301
##$SYMM= 0
##$S_DEV= 0
##$TDeff= 65536
##$TDoff= 0
##$TI= <Analysis number 999999
Compound Code 99
Book Reference 9
Project Code 9>
##$TILT= no
##$TM1= 0
##$TM2= 0
##$TOPLEV= 0
##$USERP1= <user>
##$USERP2= <user>
##$USERP3= <user>
##$USERP4= <user>
##$USERP5= <user>
##$WDW= 1
##$XDIM= 32768
##$YMAX_p= 359404987
##$YMIN_p= -64864
$$ End of Bruker specific parameters
$$ ---------------------------------
##NTUPLES= NMR SPECTRUM
##VAR_NAME=  FREQUENCY,     SPECTRUM/REAL,   SPECTRUM/IMAG
##SYMBOL=    X,             R,               I
##VAR_TYPE=  INDEPENDENT,   DEPENDENT,       DEPENDENT
##VAR_FORM=  AFFN,          ASDF,            ASDF
##VAR_DIM=   32768,         32768,           32768
##UNITS=     HZ,            ARBITRARY UNITS, ARBITRARY UNITS
##FACTOR=    0.157963299565203, 1,           1
##FIRST=     4132.6476996994, 0,             0
##LAST=      -1043.33573715361, 0,           0
##MIN=       -1043.33573715361, -64864,      0
##MAX=       4132.6476996994, 359404987,     0
$$ Real data points
##PAGE= N=1
##DATA TABLE= (X++(R..R)), XYDATA
$$ [...]
24164 8369 8067 12476 13295 25304 25321 13390 14341 14573 27774 38636 22413 7061 -2121 -5871 -3890
24149 -3890 -7561 -11738 -905 -10460 -8641 -4509 527 1811 16303 28620 12254 7184 5394 -11632
24135 -11632 -25688 -23453 -24598 -19604 -14962 -10976 -11527 -19056 -12628 -870 3703 8214 21184 6243
24121 6243 -12816 -11101 4990 15092 8046 7840 -9842 -22008 -27815 -17791 -9130 -6190 -14090
24108 -14090 -21313 -29419 -18639 1784 4139 -8026 -757 32969 42007 31178 19596 11157 11502
24095 11502 1133 -16226 -1535 -1867 -1033 -15105 -27550 -17596 -9199 -8368 2198 3019 10862 -1280
24081 -1280 -14467 -23807 -28194 -24544 -9251 12667 1935 -8944 -26419 -30740 -7028 6641 2253
24068 2253 -16618 -31486 -28298 -32082 -25101 -37007 -36042 -21943 -9452 -4273 -2271 -14245 -29685
24055 -29685 -31851 -6780 8783 5667 2459 5473 446 -8150 -26382 -27300 -8377 -4789 -11273 -10843
24041 -10843 -2944 2380 2045 -1830 -24217 -30556 -23451 -22139 -9745 -8008 -6474 9230 5357 -7944
24027 -7944 -16804 -20400 -21091 -30659 -8246 3939 -10585 -16733 -10397 -6250 -18396 -35301 -23768
24014 -23768 -23638 -23838 -19077 -7106 -12522 1536 26125 26475 23384 21064 19214 21819 16859 15854
24000 15854 25056 29457 26615 20144 32979 43397 50935 47675 25565 -3116 -2773 -61 -7044 -1607
23986 -1607 7907 4573 8045 5270 -11442 -3953 -2611 -5266 -215 13370 12313 4218 4307 15629
23972 15629 -3878 -17862 -24904 -16606 1088 4659 17076 26993 2755 -6043 -19348 -11675 12261
23959 12261 21337 10705 880 6340 3900 4930 24798 32517 35766 9277 -8553 8364 21448
23946 21448 18091 28685 3531 -12285 -22976 -8078 -2267 -11344 -17070 -11856 -4855 5439 14772
23933 14772 12131 11656 18215 18447 19851 13271 5335 8103 892 7972 20078 20294 7030 -14466
23919 -14466 -22891 -6473 1738 -976 -10160 -1126 1424 -4675 -5410 -34280 -43542 -22501 -22636 -28660
23905 -28660 -8297 -3506 -4359 -11777 -2482 3408 1285 7244 5362 5790 -3248 -8481 -16515 -11778 -1410
23890 -1410 15388 2924 -11245 -29607 -12218 -2042 -5590 -2019 -367 2805 -2235 -24010 -16205
23877 -16205 -25061 -26220 -16817 -7141 9062 13140 -17194 -21262 -24952 -18696 -4782 -10426 -13120 -3321
23863 -3321 750 5956 8061 -1742 -8734 -7408 -2741 4806 6131 13116 22558 9623 -3316 13403
23849 13403 2903 -9501 -13454 -15419 -10583 -4990 11077 4846 -6380 -6580 -5722 -4568 1846 9627
23835 9627 9163 15571 -12093 -10329 3939 19580 22533 12101 12987 10966 3477 1812 5399 21547
23821 21547 20571 20939 12207 -8445 -7912 290 4979 -10445 -4639 -6520 21614 28103 19256 4947
23807 4947 13378 9654 11009 16568 24368 25843 13690 6804 17956 21170 11327 1027 2722 -2326
23793 -2326 6329 -11482 -28232 -7519 5285 3699 8161 -3049 -6385 6356 12295 9690 3755
23780 3755 226 -4436 -9110 -12382 1220 7392 905 5924 -5472 -7106 4150 6226 -3396 1013
23766 1013 6201 -18550 -26426 -15332 -4697 -10592 816 -7843 -24723 -23323 -24558 -31772 -16442
23753 -16442 4750 23572 24489 5734 -18285 -25050 -14981 -10161 -21937 -10625 4181 11049 12899
23740 12899 25682 27527 12420 5070 6115 120 -9692 -20290 -26728 -11779 4980 17702 15131
23727 15131 11532 10895 24218 29657 5938 6107 16912 12372 -4304 -16075 -5862 -8420 -21233
23714 -21233 -25084 -22924 -22912 -32728 -13071 8423 13216 8778 6444 4332 7840 22720 33815 27732
23700 27732 12510 4084 -11422 -18889 -18473 -28849 -26129 -17446 -16654 -15391 -24285 -22928 -1531 2171
23686 2171 -18331 -5881 4927 18362 14725 8887 4810 -5388 3843 10065 174 -607 -5196 2422
23672 2422 6555 -1407 -12054 -12715 4690 1859 -24266 -28812 -12064 16604 27500 17215 12295
23659 12295 9513 14673 6268 510 13331 10142 -2821 -9472 -13254 -20208 -16614 -3271 16625
23646 16625 17149 -6803 -20150 -28537 -28024 -20486 -13454 -7221 -13055 -20048 -20634 -15726 -12150 11704
23632 11704 11406 17538 17609 1064 4248 11613 6744 -769 -9130 -18103 -27726 -14017 -3653 -8794
23618 -8794 -2111 -477 -7493 -3643 9083 -1067 -14624 -12388 -18582 -14359 -13007 -11413 -1884 8012
23604 8012 -9631 -15719 -27028 -10119 4328 11983 10540 -4264 4821 7744 10749 22078 13038
23591 13038 9119 -8709 -12814 -16338 -12303 16 20410 32834 40605 26499 19174 11220 -1196
23578 -1196 -7313 -9714 -12737 -10985 -5483 -504 1262 1846 -1006 -2745 -22552 -24034 -11953 -13638
23564 -13638 -8635 -15051 -3876 16866 19830 3531 5489 10988 11254 424 -6711 -2761 6249 21233
23550 21233 7945 4993 -2067 -9896 -11573 -8372 -14666 -1268 4072 -4750 773 7021 -2411 3960
23536 3960 12658 13895 8641 4412 6806 -11795 -23625 -11908 -8734 3219 -5277 -6030 685 1218
23522 1218 -7955 -6298 -10242 -15464 -13967 2197 8470 -3071 1301 19884 8334 3059 56 -12890
23508 -12890 -30246 -28858 -17611 -14233 -16641 -12328 6279 -2003 -14133 -9078 -10933 -7314 2809
23495 2809 -3327 -17111 -21142 -12845 15692 34863 36042 22000 -1991 -8023 5045 18790 4983
23482 4983 -6283 1184 16355 18777 18780 10963 -2257 4581 22160 22120 17633 12210 16341 97 -18366
23467 -18366 -3344 19126 21667 17930 10487 6605 3411 7684 10224 16542 1783 -12990 5337
23454 5337 19196 9818 9015 18271 15942 7537 -1911 4627 15932 -755 -5738 7336 12600 11394
23440 11394 190 -11875 -5035 -3810 -22357 -23811 -473 1144 -2688 2853 8749 5776 -6477
23427 -6477 8046 4021 4801 -6777 -31854 -32484 -10368 -14234 -21274 -8129 2494 5222 2996 11131
23413 11131 -1331 -20527 -19595 -11590 -3753 -11696 -24464 -22056 -19026 -37600 -42354 -32691 -29670 -29623
23399 -29623 -15055 -13047 -11671 -23051 -36307 -33466 -25272 -9257 8290 449 -10182 4326 17252
23386 17252 22526 31479 24962 14605 11463 9239 9302 3753 15546 22733 26671 9295 -4827 6198
23372 6198 -9059 -2247 1743 -16073 -28370 -26152 -14607 -18678 -11022 1644 9105 16352 -227
23359 -227 -9573 -18737 -20498 -20279 -13541 -3034 12723 14087 17081 26827 31912 23495 22004 9828
23345 9828 -794 8165 4494 -7064 -4934 -15142 -18745 -3820 10415 13221 -4568 -33209 -34545
23332 -34545 -30295 -34072 -24436 -2452 20363 18086 1866 -16820 -44426 -39359 -18763 -3202 22302
23319 22302 26512 8476 4242 -4098 -8131 2564 17033 25563 17590 20848 5715 1590 -1551
23306 -1551 -6966 8397 20825 24232 19932 18960 24675 17256 4145 869 -16887 -30615 -34094 -28836
23292 -28836 -19025 -15956 -10401 -958 -8748 -8422 -8821 -3327 -1557 7393 11199 24202 34002 25514 18218
23277 18218 22982 18514 23280 29388 21852 9377 20376 18758 5914 -2112 -14346 -10925 -13791
23264 -13791 -2409 4276 -2843 2871 10211 7915 -9814 -20790 -7497 -5199 6779 3172 1886
23251 1886 -7288 -11287 -18054 -26883 -26103 -3861 7243 14796 8364 -14450 -18056 -7844 -20679 -25584
23237 -25584 -24061 -12084 -7470 -21975 -29586 -20281 -21903 -12299 -1380 14615 9848 612 -6190
23224 -6190 2783 -10991 -26143 -19720 2327 4862 9829 9094 16523 27500 22583 6731 2284 148
23210 148 8952 12833 23475 25137 13521 11867 24091 11276 -12328 -8125 -3827 6057 -1286 -5568
23196 -5568 -1498 5597 -3105 -18634 -32578 -35829 -11086 -17627 -14616 -573 4605 6183 -7361
23183 -7361 -17277 -22253 -18629 -9918 -4583 -2153 4869 20436 10892 10611 -2404 -16350 -11465 -14198
23169 -14198 -27235 -32869 -21724 -17338 -7750 -445 1356 -6889 -8127 -14471 -16443 -20590 -12739 -14958
23155 -14958 -13787 -5943 -6347 -7834 499 6975 2078 -7277 -18955 -21590 -27670 -21127 -12923 3517
23141 3517 6463 17942 26919 5503 -14169 -13170 1972 -2245 -23143 -11578 -760 -7497 -1779
23128 -1779 1566 -6162 -10209 -6026 -11039 -17633 -9864 4674 4425 1625 -9596 -7657 -9639 -7653
23114 -7653 -4463 10925 8864 15026 27159 28415 11403 14594 20608 16306 -1149 -12029 -1550
23101 -1550 11088 7171 1495 -3245 -2642 2837 -2587 -21095 -24932 -8071 3466 3966 14659 17508
23087 17508 10177 1327 -12982 -24472 -5950 -7227 -13005 -19768 -34262 -19376 -6699 4684 -7109
23074 -7109 -13874 5448 19825 33781 25619 11338 23323 30981 17767 -11807 -29645 -18521
23062 -18521 -9680 -3029 3185 20063 29908 22320 12039 -851 -19410 -17254 -27674 -25684 -13480
23049 -13480 -17915 -19785 -5716 6718 -1926 -5357 -217 6804 8958 8358 8023 317 7955 7244 4215
23034 4215 9513 14245 6063 -12035 -9533 4166 -2919 -13148 -5692 4841 13275 8922 -1007 -25475
23020 -25475 -24042 -4551 5522 13045 24563 35251 15313 9617 25768 15783 3872 -5332 -35281
23007 -35281 -27752 705 -2536 -766 12438 14726 6882 2724 14088 12656 13247 -674 -16861
22994 -16861 -18943 -18174 -13555 -14950 -4927 -1143 7290 5459 20627 19407 15335 10588 14954 18229
22980 18229 7378 -5729 -19824 -18401 -11121 -24040 -42284 -36610 -6344 -7100 -13055 -3437 6861
22967 6861 5856 -11438 -16164 -15818 -21055 -17468 -11879 -14644 -9839 -11528 -20725 -20269 -3149 -6736 -21166
22952 -21166 -30953 -34236 -27998 -24095 4483 8421 -1866 2144 10798 -182 -796 -1651 -7121 -3471
22938 -3471 9489 -957 -4491 5958 15593 594 7091 -163 -11145 -3771 13163 11290 1797
22925 1797 2403 12231 16610 9934 -26690 -28220 -27168 -17671 -7303 1818 329 8627 -8015 -21694
22911 -21694 -14476 -7137 -17326 -5147 3091 -4207 6336 -3774 -9042 -5488 10273 17438 -3667
22898 -3667 -9956 -9883 -12868 -27415 -36255 -51907 -48564 -21413 -16177 -17659 -15970 -2101 195 12411
22884 12411 19330 9536 5053 -17151 -30942 -38615 -25446 -12931 -10405 -9532 1219 4801 26751
22871 26751 27303 11071 1800 -6807 -3789 10521 15298 17973 12658 14047 20074 24724 23797 6616
22857 6616 -9874 -7622 -10562 7728 19712 -901 -16172 -11844 -7532 8582 1199 -3955 -2300
22844 -2300 -1739 9496 13138 -7113 -8013 -1269 222 9302 1555 -7134 -2135 9708 7098 -9276
22830 -9276 -5760 -8747 -16281 742 4990 551 15548 24918 13898 14014 8037 -7035 -9053 9057
22816 9057 13146 4493 2193 -22740 -15404 3068 341 -5302 402 11792 12851 11145 22632 33093
22802 33093 24319 4561 -9194 -24774 -14257 -4925 1635 5835 -4975 -9634 -6380 -6791 -24693
22789 -24693 -26258 -16376 -1708 -1406 -5622 -16532 -8605 1762 -14358 -11717 2911 2191 -183 -7532
22775 -7532 2914 -1885 -4466 -13172 -20065 -13008 -26830 -11865 11765 11907 -6410 -21438 -16473
22762 -16473 -13653 -11402 574 10566 2778 -23895 -21660 -8819 -8863 9560 9966 9819 7570 6911 7438
22747 7438 -1344 1217 -4136 -3703 -7529 5511 794 8880 3373 -7208 -7175 4750 1790 -10886
22733 -10886 -11894 3965 27800 38959 22893 27854 24240 8024 4581 1375 12303 22396 22361
22720 22361 15645 11133 8961 22158 33884 26036 19346 -4396 -31794 -43372 -29699 -20945 -15231
22707 -15231 -3701 5971 -5434 -9971 2768 2554 12591 19009 25391 44854 46508 20325 2831
22694 2831 -8655 -5374 1091 598 -2000 -2112 -6189 -16138 4191 11325 1589 1163 2258 2551 1639
22679 1639 1726 7704 -5448 -11617 -12325 -18667 -19935 -8277 893 -7779 -9490 -23424 -15596 8494
22665 8494 18466 22505 25615 41503 29790 11880 1008 5353 12 -2633 9936 18634 30643
22652 30643 31076 27757 -9447 -24077 -16087 -1400 -8610 -5482 7079 14481 10575 284 -9604
22639 -9604 -6665 -6189 -12204 -3930 3462 2509 -14360 -15046 -2217 752 5820 11667 9851 13139 11952
22624 11952 -2076 -10928 -17893 -10690 -10186 -13995 -444 -4597 -12846 -10846 -23249 -28310 -12642 3302
22610 3302 2602 4342 15223 7966 6446 -1304 -18510 -14323 -14834 -12347 -4246 -2256 -17299 -8118
22596 -8118 15022 9604 -17626 -28750 -17962 3407 9650 5693 650 -15143 -26597 -22453 -6923
22583 -6923 -4891 -4027 13747 20430 3713 -3325 -6196 -3933 -9843 -1266 5558 -14143 -10118 -13839
22569 -13839 -16407 -15875 -6999 17871 29464 12836 4932 17160 9682 14179 6306 4286 -6065
22556 -6065 -10376 -1737 -3384 -8567 7222 -1881 -16689 -10702 -16872 -11761 -15614 -23683 -12509 -11273
22542 -11273 -1583 11605 19300 10132 -9158 -10921 -10717 -19520 -29501 -39399 -24921 -5012 -17020
22529 -17020 -27246 -5917 -8660 -10751 -12936 -15990 -23158 -15420 -2053 6993 9436 6521 13902 4837
22515 4837 -2218 4842 12953 3581 3410 10635 9891 15812 12062 2211 17208 29371 21069 13551 15568
22500 15568 22402 26046 24400 20032 21110 32750 32949 16548 8372 16968 27438 24218 7172 -7825
22486 -7825 7164 8719 -4240 -15054 -16444 -20741 -4391 12656 8355 416 -332 -5457 -16955
22473 -16955 -22940 -8701 5057 -6647 -3391 -8019 -18642 -11148 -3770 -5489 -5339 -1701 11817
22460 11817 26374 40409 36065 9171 10183 12112 502 -12301 -14431 -13614 -18766 -28449 -18020
22447 -18020 -11176 -4101 -5928 -21667 -12097 4118 9092 -3394 -17146 -24241 -8869 -681 -11007
22434 -11007 -27978 -24847 -28709 -35163 -11332 6004 5356 -7724 -16028 -27039 -22742 -9811 -11858
22421 -11858 -2956 -5428 -23190 -11713 -2702 -9996 -3491 -3953 -4587 10327 48 -8676 -3521 -5767
22407 -5767 8518 9341 -21 -14217 -17469 -2766 -1927 10775 8023 -1297 -12065 -3140 550 -7363
22393 -7363 -11538 -14209 -23364 -13061 -11862 -7026 -6734 -1244 17099 31141 20857 20222 12021 5785
22379 5785 -11351 -20287 -26718 -26200 -6119 -4967 -12738 -3868 1182 19301 14460 2702 709 -4928
22365 -4928 4503 10193 11214 13372 9966 17003 20586 15096 22697 18549 -8391 -15622 -11297 -18382
22351 -18382 -25040 -30245 -22952 -5643 5041 13995 14415 -1352 -26097 -1509 10457 -2418 -23028
22338 -23028 -38330 -34313 -22704 -10256 8516 5046 -7459 827 11527 13144 18257 21268 11943
22325 11943 792 -11091 -7001 2502 9806 13205 2646 -1290 -2277 -13623 -11989 -6380 4240
22312 4240 29944 36656 28572 15142 -6565 -23425 -19350 -23169 -12245 -9238 -16640 -26376 -21539
22299 -21539 -27925 -24043 -30367 -32334 -12495 -13827 -10579 2034 11081 -41 -3951 -3347 -18348 -9605
22285 -9605 -3057 -6744 -14911 -12419 -10536 -12006 -11593 -3832 -11189 -1909 -1080 -6665 -5636 4133 -24
22270 -24 14238 -2866 -20500 -16093 -9395 -20520 -27025 -12829 -18066 -36156 -27680 -22251 -20264 -16515
22256 -16515 -1687 9932 12121 5012 81 -4640 3462 -412 8072 5399 -3152 -4165 -1060 15879
22242 15879 29841 11222 -1879 -8165 -5125 -13972 -21407 -28933 -18265 -5986 11106 10286 -1504
22229 -1504 -7710 -1451 -6036 -11797 -12060 8962 10421 -10955 -5916 9205 7944 1757 -6985 -16100
22215 -16100 -15280 -9805 4806 9030 22091 22340 13145 3002 6716 -1898 -21846 -22993 -20599 -19256
22201 -19256 -18612 -13852 334 7862 -4045 -9540 -21807 -26874 -23006 -18472 -14865 -2578 13171
22188 13171 30672 15710 -4762 315 -2309 -4634 17357 30621 10014 2451 -1154 -6234 -13791
22175 -13791 -11371 -6094 -7040 -1179 -5791 331 1 -6297 -5420 2180 -208 -2428 1839 16878 31769
22160 31769 16472 12017 14183 11882 20638 25591 9437 17648 12435 6054 -3721 -8316 8649 10143
22146 10143 -421 1161 -6631 -14739 -7108 -12652 -13521 -15158 -20642 -12015 -9175 -16648 -17879 -21148
22132 -21148 -1706 8211 2662 -10583 -6545 -12420 9135 7592 -3061 -2888 12099 29113 29026 10031
22118 10031 5651 11526 22435 19221 15954 14857 9655 12367 119 -10938 190 6559 74
22105 74 -5813 -4562 -348 4787 14238 8913 813 -4793 1298 -8142 -11045 -17948 -6499 -7498 -3387
22090 -3387 5437 8068 9404 761 4746 918 -2197 -8361 -14389 -12582 -4214 10081 5320 -1661
22076 -1661 -21494 -24071 -32307 -45125 -41119 -17415 -12493 -15277 -22781 -24994 -22744 -30300 -33118 -35663
22062 -35663 -25122 -9938 -6991 -5953 -14219 -12498 -19061 -21752 -23374 -22376 -25433 -23859 -16796 -23618
22048 -23618 -21508 -21958 -21292 -21766 -12521 -20095 -27681 -34234 -21083 -3495 3493 12702 15908 16902 16961
22033 16961 -4604 -23629 -22326 -23512 -19020 -12681 -6181 3656 8744 4281 -10224 -405 -4938 -9033
22019 -9033 7079 4343 7905 19539 7315 1603 412 -1954 5032 5274 1855 -4753 -9943 -4466
22005 -4466 2438 4253 12636 1618 -19441 -18223 -9207 -21645 -18966 -10787 -10011 -5305 -10132 -10414
21991 -10414 -7197 -17592 -23668 -23146 -14786 -25629 -28461 -8548 -8941 3120 10207 -93 -1981 -8833
21977 -8833 -5906 -2651 -11557 -15363 -14351 -14961 -20398 -29365 -30792 -18086 -15540 -16081 -893 15116
21963 15116 6770 4222 -646 -1608 14347 28550 35354 19704 -7018 -11995 -22904 -19016 -8501
21950 -8501 1645 83 -10612 -21054 -25773 -20998 -18778 -24049 -22185 -22522 -26157 398 18561 23134
21936 23134 28805 22257 9129 184 7632 1223 5892 20642 33409 26398 -1393 -1087 4486 -5669
21922 -5669 -4415 -16048 -19404 -5852 -3318 -8701 2117 8737 6630 13367 10340 11502 11562 -15
21908 -15 -16683 -15519 -8533 -3179 8029 5589 -2775 -947 -16083 -33128 -46153 -34592 -17480
21895 -17480 -13151 -7107 3791 -18690 -17253 -10635 -7698 -2884 -978 3778 16711 11210 8923 11531
21881 11531 11860 -7013 -13836 -14871 -11942 -12094 -5220 -4102 -4329 13990 12435 4534 11191 18300 25713
21866 25713 25963 24013 43443 24079 8143 9173 9383 17342 11133 -2217 -23486 -9789 8600
21853 8600 3055 15156 25023 28252 16788 10495 229 -8722 -13507 5631 20271 19255 16741
21840 16741 12070 6634 -2082 -20038 -15853 -7684 -7083 -11755 -12670 -16856 -25773 -19910 -3220 -2326 -5891
21825 -5891 3730 -17376 -21338 -4487 368 -6272 -221 -135 -7235 12202 21965 34258 25900 22465
21811 22465 26024 10774 -2413 -7726 -23721 -25721 -14189 -11701 -10585 -145 -9753 -13428 7388
21798 7388 6885 5221 -3120 -11125 2447 2593 -10556 -13678 -19024 -12573 -9346 -15709 -16892 -15112 -6593
21783 -6593 -18278 -10035 -28375 -55181 -41277 -11424 -7115 4707 17404 8066 -7701 1103 11767
21770 11767 -7521 -10763 7445 13837 3087 54 -7974 -16133 -8373 11787 6649 8842 21072
21757 21072 35806 34155 2495 -6657 13871 21753 16617 12818 8072 -3164 -12322 3535 22759
21744 22759 24630 16599 13650 2887 -17795 -22162 -18748 5903 8027 9413 3327 -5232 967 4951
21730 4951 -6554 -9100 -10408 -13720 -10573 -11144 -5447 16124 16778 -10928 -16591 -25770 -35592 -27492
21716 -27492 -11765 -13707 -33870 -38178 -40240 -56662 -47305 -25446 -15678 -20001 -8844 3686 -13207
21703 -13207 -22062 -6586 8571 9315 809 -548 -2710 5368 -5000 -23620 -19777 6391 14336
21690 14336 -2852 -4266 -10828 -19173 -22231 -21493 -17047 -31971 -32271 -30975 -38236 -23759 -5904 -10318
21676 -10318 -3643 -10953 -19929 -23695 -12857 3615 5351 8370 -4401 -11468 -14953 4581 17004
21663 17004 15205 21013 13462 -514 9128 11527 633 -10600 -19496 -19566 -27453 -14499 -14945 -15269
21649 -15269 -6406 -6716 -9981 -15645 -14847 -15880 80 5687 9885 19634 22610 23639 19699 12965 -2008
21634 -2008 6563 -14457 -26114 -33759 -28225 -23161 -18651 -17229 -22790 -19587 -3861 -10108 2835 11329
21620 11329 1382 -16977 -7023 -4635 -17117 -18753 -4501 8945 18746 13199 -6193 -10677 3338
21607 3338 6030 1793 -3433 -3591 -2124 5534 17540 19817 25455 22152 8501 3524 4475 9753 -2529
21592 -2529 -24975 -30694 -28176 -14774 -10573 -26930 -31150 -19872 -8409 -12183 -14687 -8085 8037
21579 8037 6341 -7887 -17407 -12473 -20890 -15001 -20296 -22210 -12185 -9571 -10145 -12835 -10827 -9766
21565 -9766 -8055 14179 30899 26978 -1231 -11526 -171 7141 9056 770 -3054 -6455 -8084
21552 -8084 -10752 -13436 -22058 -15462 -22042 -18718 -614 8958 15354 2092 -4108 -4997 8085 25875
21538 25875 19429 -2718 -2277 -1541 -9130 -21503 -29541 -35082 -17210 -13237 -20504 -31215 -39893 -34472
21524 -34472 -11548 1684 -5731 -14715 -7977 -12838 -12936 -5313 17565 13742 -15718 -24728 -20807 -12787
21510 -12787 -8264 -303 1534 7919 3354 -965 10290 17007 10198 13124 1434 -15351 -4877
21497 -4877 -15759 -26881 -18083 -17148 -18526 -26862 -33883 -31409 -30036 -30807 -21089 -32316 -42386 -42781
21483 -42781 -26989 -17122 -15437 -16971 -4779 14159 11995 -1312 -6608 3312 641 -12333 -18940
21470 -18940 -17128 7355 17685 20602 13442 11792 20572 20631 23348 21755 14502 1210 -5495 -16126
21456 -16126 -15462 -25337 -23041 -11416 -10005 -19333 -9523 -13194 -26034 -10351 3433 5431 10303 13342
21442 13342 3864 15184 15189 -1326 -9039 -12201 -10325 -7395 -12357 -27488 -24800 -10275 12037 13122
21428 13122 2887 -7806 -19907 -31320 -25012 -30209 -44425 -42977 -20591 -19637 -28163 -20367 -14183
21415 -14183 4327 8181 4118 14765 3133 -4424 3915 7572 521 3312 5005 1685 -14038
21402 -14038 -18208 -21023 -16583 -10492 -13798 -17261 -25164 -30400 -34205 -26691 -34300 -34699 -32931 -51706
21388 -51706 -48499 -30168 -25613 -17247 -7591 -10877 -18429 -24844 -23469 -6919 -6287 -4307 5707 13256
21374 13256 16309 -286 -12357 6787 8265 -1352 7568 11190 -6656 -10209 7690 -4533 -10752
21361 -10752 -12992 -31372 -16176 -19191 -23613 -16309 -5310 769 5316 13986 18997 8614 4925
21348 4925 6407 300 -5886 9824 35869 48384 24297 16849 32626 36072 40371 24247 18882
21335 18882 26005 24065 19640 20266 26721 29642 21615 18264 7987 -2998 7853 16240 15049 13563
21321 13563 10501 15239 20315 18085 9563 1097 -13724 -32037 -25276 -14626 -9083 3767 16041
21308 16041 16564 13924 12816 17469 10297 -5008 -18127 -7677 12892 9749 -7320 -15627 -23371
21295 -23371 -25170 -17148 956 -11020 -24170 -34725 -35674 -37683 -42898 -35212 -33029 -14396 -1502
21282 -1502 -5610 -6861 -18690 -20996 -20919 -20917 -19658 -14439 -8977 -11510 -8406 -1052 -2477 1783 -8669
21267 -8669 -21715 -11037 -2818 12097 30128 21067 -12844 -16394 -10334 -28486 -24412 -15772 -11170
21254 -11170 -9301 8821 19667 15901 12218 -8582 -31531 -43248 -35707 -32495 -22346 -17203 -14225
21241 -14225 -6576 2444 -1431 -19663 -9642 4808 2336 2530 6557 10538 -2217 7769 -255 3776
21227 3776 -5716 -5979 -1119 -7162 -6731 -2332 20555 21759 14260 11652 13921 10214 10533 3166 -123
21212 -123 4757 579 -7191 -21376 -12274 970 -2027 -6975 -8440 -10007 -1135 457 10775 20658
21198 20658 14459 16060 11000 13122 13416 -1416 -10637 -15532 -6784 -7358 -19856 -9892 -28169 -43490
21184 -43490 -43618 -34098 -15693 -11749 -6531 411 11126 14070 7634 -6204 -3101 -7070 -10564 10951
21170 10951 -6533 -33938 -24751 -14745 8676 19994 16909 16622 10495 12727 11110 8318 1010
21157 1010 -7402 -10381 -20768 -42299 -53037 -44794 -21432 -943 2079 12735 31112 24990 11124
21144 11124 -2694 -7336 -4678 -19268 -27354 -16179 -112 -5083 -8580 -15449 -17776 -21757 -23829
21131 -23829 -22379 -26377 -12337 -8749 -4177 -5043 -9959 -18714 -33056 -27558 -16642 -1426 -2676 11325
21117 11325 10502 -2670 -25994 -21651 -16182 8905 23126 14127 3140 -502 7497 12915 13506 4077
21103 4077 -9688 -12511 -7876 -17644 -22989 -6616 -4278 -14354 -26922 -36467 -25595 -10132 1769
21090 1769 18109 8908 -13370 -5718 9952 15029 5653 -12333 -6325 -9223 744 6298 12327 317
21076 317 -14314 -26877 -4491 5192 2962 -755 2095 -6217 -16795 -17006 -24737 -23655 -30842 -30009
21062 -30009 -20600 -21853 -20585 -4396 183 -9180 -26672 -23117 -30727 -27436 -28936 -26496 -3991 1950
21048 1950 -14109 -18551 -21856 -18899 -6053 6680 5502 4080 10967 17834 10415 -2289 -4227 -3081
21034 -3081 -8170 -9488 6957 2429 -10144 -12783 -10254 -6800 -18615 -23167 -19728 -22437 -32115 -22531
21020 -22531 -12100 -10174 -7254 9641 23022 19537 10432 5322 -12270 -18183 -13849 -19289 -11950
21007 -11950 9260 24327 16875 11239 24546 23686 3059 12460 9127 -2144 -9445 -13861 -8081
20994 -8081 -6174 -95 698 2520 -1168 -361 -3278 -2113 -8836 -16484 -17529 -23662 -16950 -4582 5577
20979 5577 5440 -20072 -25745 -11217 -1670 -9405 -23948 -20944 -11203 -1946 6393 3940 -4597 -9141
20965 -9141 -12292 -11918 -24188 -27557 -19557 -3789 488 7555 7850 -3517 -9487 -18775 -11756 166
20951 166 5421 -9815 -16886 -13751 -7592 2563 6837 10678 7331 584 9237 6429 -2159 -11891
20937 -11891 -18877 -29352 -23415 -21564 7323 29727 28499 23576 17643 9721 11755 9767 32149
20924 32149 31051 24399 6795 -16005 -15316 -26762 -25138 -21169 -17316 -7552 -3902 680 -3789 -10599
20910 -10599 -10023 -3170 -4793 -8698 -7722 2160 4459 -4584 -863 1738 -8211 6034 5916 152 -8153
20895 -8153 -8393 119 -4692 -11 -5956 -12080 -3022 12514 10012 7918 -2122 -8971 3772 10993
20881 10993 11359 9878 -2665 4401 952 -2191 -5368 -7027 5392 3236 -6449 -17805 -16234 -11688
20867 -11688 -11470 -6750 6163 3332 -16556 6494 20499 9516 -14918 -7991 -9072 -7023 -3005
20854 -3005 7191 8798 287 -9412 -15885 -21669 -14663 -26179 -26174 -22741 -3585 -4723 -11213 -21039 -20887
20839 -20887 -7754 904 -6696 -6393 -8559 -7383 -1635 3681 15756 17070 9648 3655 9304 10125
20825 10125 17325 18782 1391 4268 80 -12230 -8031 10774 28335 21115 15637 3806 -2361
20812 -2361 16243 36512 24943 26926 4765 -4278 -19494 -32741 -20298 -23823 -27821 -25651 -22172
20799 -22172 -16621 -873 7779 22312 34224 28426 23727 15375 9197 6963 6627 -12995 11595
20786 11595 10060 -1630 -10009 -20660 1395 28094 18383 8747 3943 3854 21102 14550 9725 15627
20772 15627 19132 19251 21284 10987 3056 -3748 -9646 -5386 463 11704 -489 -105 -4321 5087
20758 5087 10435 14922 13217 5838 2319 -781 21306 16523 14201 3169 717 -8266 -4446 4336
20744 4336 -8009 -24362 -31683 -25094 -12281 -5773 -4453 -8378 -27857 -35844 -31239 -24734 -7605
20731 -7605 2998 4419 -1133 3796 15503 -1619 -29347 -47083 -22355 -5557 -7346 -8085 -16350
20718 -16350 -18287 -6924 5630 18481 20234 20983 14212 13244 19407 -3344 -9153 -2843 -5449 -28611
20704 -28611 -17620 -14434 -16633 -15647 -17725 -16222 -15325 5744 -5308 -12613 57 -1476 -14969 -13016
20690 -13016 -18158 -18387 -2257 2358 -418 -14806 -17123 -5182 -3518 -10302 -10232 -3081 120 7346
20676 7346 -15478 -24184 -26476 -26621 -41774 -39262 -26547 -26516 -16647 -21621 -12814 -557 10968 15715
20662 15715 -2565 -12501 -34241 -41164 -37985 -20792 -17517 -40949 -32517 -21035 -7789 9907 5647
20649 5647 -13276 -3005 -13399 -28781 -28283 -12954 -16955 -10590 -7058 -7176 -14948 -1584 11222
20636 11222 11172 5341 11006 10535 2255 10638 15825 3202 13703 23611 21932 13484 12569 17721 18189
20621 18189 21505 13183 18120 17596 8165 13722 19083 17385 10064 10869 -4707 -2387 -6840 -922 -2950
20606 -2950 15039 32382 18164 -11667 -26447 -20357 -11569 2872 -10536 -16428 -12781 -11442 -21991
20593 -21991 -20856 -12581 -8206 -8753 -16102 -34681 -43738 -31094 -25667 -14547 -16132 -14488 -12575 -6475
20579 -6475 -5237 -12630 4125 10123 14517 17114 2218 -12212 -22965 -9165 7036 10382 -4746
20566 -4746 -10623 -21571 -18467 -15633 -17419 -6277 -17921 -35856 -20657 -7495 -20005 -24759 -10893
20553 -10893 -2186 -1539 -6449 -7517 5667 3861 -2962 6649 -11870 -27050 -20783 -5297 6131
20540 6131 8379 -2575 -2168 -2407 -13052 -4789 -3789 -13071 -16534 -25407 -19126 -14972 -24026 -25050 -146
20525 -146 236 -4765 5181 11979 12380 -2364 -4356 -20486 -24645 -34366 -34877 -29892 -38341 -42966 -35383
20510 -35383 -28287 -10405 3532 12150 7686 4136 6627 14644 27017 29553 23534 24309 15373 10211
20496 10211 -5096 -20683 -33217 -25256 -11384 7108 5849 54 -10760 4153 8724 9482 3287
20483 3287 -771 -8712 -4874 -2989 -3137 -19633 -25253 -15297 -11254 -15019 -9228 -7109 13264 17279
20469 17279 -3309 -9041 4134 10603 -6871 -4017 2908 -2572 -17033 -13345 -991 3005 7371
20456 7371 5099 -9629 7484 12301 4390 -20850 -43143 -33563 -16980 -17216 -14043 -11253 -5730 -18880
20442 -18880 -23650 -16613 -14898 -2042 -4576 -18501 -30070 -35257 -12395 4567 5414 2247 8066
20429 8066 17192 16501 -6701 1500 9750 1887 -28012 -38058 -22573 -16769 -11300 -5294 -5896 -22032
20415 -22032 -16506 -1517 -3718 -2217 1120 1456 19448 18844 -5893 -28386 -33262 -23849 -13153 -10333
20401 -10333 -10422 5962 -4803 -22034 -26681 -19194 -15497 -13123 -7329 -2317 -7127 -16473 -15193 -12501
20387 -12501 -15162 -622 14198 18310 16381 8383 11942 14067 -1471 -5386 -13382 -31209 -30852 -17429
20373 -17429 -25038 -21670 -8740 -1383 -7425 -16977 -16805 -20354 -14505 -21555 -27382 -25989 -23399 -7245
20359 -7245 -1198 -5316 -10811 5846 -928 -5957 -16233 -29663 -21609 -10436 -5509 -5322 4393 9111
20345 9111 33188 38249 15496 -4794 -18790 -26827 -12309 11775 31272 17757 1982 -8559
20333 -8559 -18723 615 14492 -3264 -5836 -30984 -35867 -13197 -3888 -22809 -22084 -21038 -15639
20320 -15639 -17854 -7731 3984 7124 11449 13687 -5621 -22604 -35150 -35093 -39376 -32198 -35161 -27480
20306 -27480 -31670 -48818 -45980 -39335 -37873 -22645 -16185 -2539 23278 31321 14226 -757 12089
20293 12089 12228 -1852 -16228 -16146 -8538 -12211 -6077 6069 -4491 -10680 -3429 -5617 5984 24207
20279 24207 7858 -18006 -28590 -30204 -26028 -20829 -138 3033 1767 15164 26719 12005 170
20266 170 -4612 -5896 -10702 -11359 -17492 -23960 -27891 -39528 -39438 -27105 -28250 -20533 9840 16875 11124
20251 11124 5004 -4675 6695 7151 18059 19651 11800 6284 -6458 -3372 16094 28795 11603
20238 11603 -1287 -3082 -21106 -23099 -15838 -16310 -33403 -35736 -16001 -8274 -9771 -14579 -7637 -9836
20224 -9836 -4280 471 5367 5809 -7085 -9905 -11228 -5560 3153 2826 7345 8175 6611 14895 13746
20209 13746 17372 22400 21639 17893 5013 -7464 -7162 -38 13743 468 -10491 -4168 7655
20196 7655 -7565 -18656 -28411 -27944 -12896 -5329 -8859 2861 -133 -22637 -12535 6908 -3251
20183 -3251 -18004 -11885 -20028 -25533 -25612 -26532 -35037 -21638 -12670 1801 -692 -11906 -18449 -10051
20169 -10051 -13941 -10543 -7625 -8640 -12373 -16307 -10425 -12628 -23735 -16400 221 17271 6714
20156 6714 13064 16122 9553 -1298 7382 2044 2910 13759 16096 21065 25299 39828 16592 -4081
20142 -4081 1548 16282 21480 32146 34531 21373 25372 19590 -17126 -20413 -14931 -16721 -13407 2082
20128 2082 688 -1208 9049 4905 1146 -7314 -3744 1525 -13372 -17602 837 21742 20021 9008
20114 9008 3848 20512 28623 14495 10840 17091 6480 6365 7440 -1496 -9720 -10504 -11345 7504
20100 7504 -483 -15415 -8854 -4414 -8270 -10335 -23805 -16366 -170 7158 17804 9236 6398 17997
20086 17997 17358 20889 19228 7867 -5350 -24988 -16761 -10810 -18238 -12169 -8848 -18496 -33729 -39139
20072 -39139 -24479 -14405 -6866 -104 -10963 -10713 -9892 -14760 -2058 12020 13984 448 -3479
20059 -3479 -18773 -17795 -8595 2611 -2933 -1925 -3750 4823 8309 -146 -1061 -5781 -18209 -10378
20045 -10378 14976 19322 9995 -10960 -12704 -7984 -14086 -5896 -2418 -863 -7961 1788 20619 3745
20031 3745 -11767 -10482 -2447 15546 8010 7278 8019 -3111 -4087 -1640 -9541 -7943 -19572 -21235
20017 -21235 845 4864 -4373 7055 -8434 -8556 -18238 -13942 -7589 -18310 -25717 -24981 -21776 -22180
20003 -22180 -21429 -15186 -7528 -10529 -3264 2330 12 17367 20812 18661 5888 -14134 -5208 10334
19989 10334 -2916 -7067 5473 16099 24740 16983 -2690 -23093 -24615 -18453 -13038 -15274 -10665
19976 -10665 -19694 -26503 -5480 -11208 -11383 9098 -7982 -9175 434 -6956 -3604 -9344 -12286 -14325
19962 -14325 43 2160 11370 29001 29891 666 -6654 -4398 -18460 -32050 -35521 -31152 -32194
19949 -32194 -35724 -15321 -3220 9105 10376 3380 -3677 2137 5150 -3547 -665 -22418 -27225
19936 -27225 -25749 -37345 -28072 -21750 -18706 -25377 -26040 -13949 -1625 5750 6455 12853 10795 19219
19922 19219 16377 14045 -793 -12709 -6046 -694 900 6915 -2861 1405 4704 -7034 -12495 -18192
19908 -18192 -12538 -6988 -13114 7463 30290 28944 21929 6769 -2284 -3915 1816 21 -6673 -22360
19894 -22360 -9533 -13227 -14123 1970 15078 15417 9202 1286 -10921 2129 10828 15068 28136
19881 28136 28684 20308 13280 10099 -1424 -1583 8571 15389 24880 34644 38534 24124 30457 57124
19867 57124 86560 91929 99941 110019 147661 205560 298989 429354 558849 594682 531207 460303
19855 460303 405187 418379 486362 584765 642334 589739 463047 348312 256800 179384 120911
19844 120911 70495 43947 27119 24408 35570 45290 61235 47510 32514 22230 26927 40793
19832 40793 46889 56012 56043 43178 43687 52024 41622 19020 18251 26434 18579 11740 20184 34282
19818 34282 53018 77290 73396 78454 111960 145401 210072 331392 475267 600435 612222
19807 612222 542828 457603 429822 466222 546888 644342 693249 613391 472582 356293 277079
19796 277079 217688 161989 109433 109541 94535 76520 47433 33414 25015 25813 25655 22948 19987
19783 19987 38176 48921 57168 59249 59885 75240 96930 122940 151250 184380 193047 182164 155156
19770 155156 136588 121698 144982 180881 187424 176419 124074 98230 72986 40684 3138 -7966
19758 -7966 -6913 -680 1628 7406 -829 -25791 -11038 2947 -12527 -10678 -15430 -3403 18338
19745 18338 14971 10167 8186 22960 23138 11538 18854 28898 38864 35244 19906 20828 9289 23955
19731 23955 44796 58081 72306 68726 67737 106953 142328 155232 153779 148695 136647 127485 135399
19718 135399 156515 178428 187378 172087 118661 96569 73617 55120 35146 19831 25537 28708
19706 28708 30100 30742 36702 35124 24030 14597 3693 6304 8710 19755 10643 5721 -4714 697
19692 697 -407 -14271 -28423 -19150 4508 27701 24616 13581 76 11207 18571 17689 23847
19679 23847 23012 19434 13867 27893 41518 47492 50602 31007 20995 30730 41299 30004 3530
19666 3530 7142 13024 5132 -1937 790 -631 -7199 9589 19945 19522 15682 4567 13061 13927
19652 13927 22070 28311 12256 -2605 6627 1319 3618 9559 3680 12558 8866 6529 12271 20531
19638 20531 21564 15423 3589 -6191 -5560 10269 19284 31301 29270 16926 16095 39786 51530
19625 51530 44076 30901 30198 23466 6634 26560 26473 23004 16446 19499 2544 -7549 16055 32206
19611 32206 44460 41750 24030 9902 4112 -2799 -8357 -5009 446 2405 -8445 -10457 14329
19598 14329 13784 6324 18191 32359 50868 48294 27129 7022 3720 1275 2379 8998 35521
19585 35521 23352 -3488 -8067 2673 -411 568 19180 47368 59330 62901 61356 39039 25689
19572 25689 26071 10247 11900 26643 31920 29250 39160 24832 18125 19100 27017 39332 39205 33000
19558 33000 40884 25050 24651 25358 14617 27316 46484 43196 33604 23401 11822 25260 53361
19545 53361 78844 72717 56199 49287 34969 45058 62536 64969 70476 79704 91595 97917 107439
19532 107439 116114 128029 151464 175445 227540 321890 417475 473538 473877 408249 334235 305646
19520 305646 344046 438299 490610 487916 426328 308034 216977 165065 142974 128275 129136 119169
19508 119169 99046 75781 48842 30681 26313 20499 37438 51089 56162 54221 61789 64280 73792
19495 73792 103750 104814 87076 69659 55954 51859 58797 89128 96022 93643 80366 86157 97006
19482 97006 101804 107420 116065 163896 223822 298479 400007 491479 533383 487310 414369 359212
19470 359212 363513 428649 497699 531122 499525 408463 301237 225935 194164 174301 152701
19459 152701 110009 89094 74436 64237 66929 64594 67201 62236 54474 55324 71354 63349 80434
19446 80434 86137 77751 63503 56159 66572 77385 76963 60992 59672 57927 48195 55946 61054 55256
19432 55256 55584 65443 64234 45012 46615 55251 48322 40492 19304 32696 40880 37332 34659 34490
19418 34490 38559 38306 47643 50088 61412 72760 85257 96657 92779 70939 65965 87938 114360
19405 114360 137172 153739 129963 109523 96192 76148 77523 84739 98450 113964 115471 89002
19393 89002 83158 95428 92364 84767 102672 121138 126254 130570 146185 160361 158976 160285 155140
19380 155140 149505 147125 169071 181651 188773 174313 163657 175899 181399 181706 205029 226596 236092
19367 236092 227469 215382 230554 261048 279442 321502 370923 421053 475385 515403 557443 615020
19355 615020 633835 649787 683980 728874 786419 845095 920322 972465 1016880 1086470 1200869
19344 1200869 1340176 1541066 1820541 2173014 2582188 3085115 3679027 4473146 5639855
19335 5639855 7449263 10292039 14590804 19846410 23611275 25316666 26040229 25148334
19327 25148334 23409994 23082194 25512112 28364655 28901813 28088976 25297628 19905905
19319 19905905 13837626 9042351 6207086 4575270 3572063 2894194 2435446 2134629
19311 2134629 1914768 1782817 1724822 1729413 1741832 1723519 1735871 1753934 1778578 1806346 1820032
19300 1820032 1858603 1916355 1986335 2060027 2144409 2252882 2413688 2639668 2921166 3263604
19290 3263604 3683547 4167850 4816625 5718470 7064653 9081015 12216615 16906221 22545260
19281 22545260 26509831 28402244 29423280 28832336 27562836 28014414 31465938 35236811
19273 35236811 36645162 36904629 35501734 32442542 30533287 31914360 35413613 37285634
19265 37285634 35054049 29693421 24401111 22007374 23225113 26480613 28733061 27485396
19257 27485396 22726197 16600455 11485317 8129639 6127775 4914333 4154769 3630727
19249 3630727 3256036 3002524 2826653 2668951 2538683 2414260 2344816 2273561 2171729 2033298
19239 2033298 1881839 1805412 1829503 1904058 2016270 2089523 2117876 2151204 2222534 2417607 2742153
19228 2742153 3149971 3618988 4161150 4802486 5615465 6717793 8330151 10834009 14913317
19219 14913317 21165707 28827238 35042261 36648964 33084370 27083720 22634971 21861244
19211 21861244 24439745 27719894 28609995 25511266 19601298 13538718 9051974 6288188
19203 6288188 4657900 3645691 2982781 2536099 2215576 1990162 1830836 1687057 1553578
19194 1553578 1451390 1376229 1316583 1236064 1104207 972297 888163 845680 842719 824153 799282
19183 799282 736361 644504 558892 498884 472839 459922 445553 408470 359471 318437 318485 333836
19171 333836 351212 318176 277957 252019 220179 200372 196521 191858 187735 194512 206134 219664
19159 219664 221149 244303 244424 213334 182237 178340 188514 190011 198709 205874 194642 176015 160821
19146 160821 153152 151777 133064 117989 129301 127028 109392 81935 72808 76105 81244 81096 98340
19133 98340 93573 85908 69199 67143 64766 76269 82680 82711 84682 84183 91028 100810 119193 134316
19119 134316 120976 100990 95314 87910 86624 94315 101998 96634 92132 113945 139608 169933 168259
19106 168259 150927 122824 103222 126481 144223 159110 161095 159711 139434 107080 80164 79137
19094 79137 106591 133154 159974 172073 180855 173070 145390 142960 164806 185812 182580 157864
19082 157864 145654 126867 113179 99058 88034 81000 53516 41506 49122 39586 51793 49633
19070 49633 36331 29637 36436 47653 53022 63476 62172 51507 28746 36134 47290 54034 58550
19057 58550 62386 66992 63903 47345 59922 64796 49303 57664 62283 52877 55789 63645 84312
19044 84312 131784 159758 165054 153087 133622 123632 107601 96465 114010 123359 111902 97344
19032 97344 89560 74652 60008 55904 28823 21655 38730 29725 8622 1479 7026 10667 14958
19019 14958 24794 42587 30340 15792 14254 36224 39335 17996 8396 14382 12792 20575 35278
19006 35278 14071 -3793 -4120 11475 14260 25435 48588 26817 377 -3018 3413 15141 -5144
18993 -5144 -856 18770 23695 37717 52144 52122 62014 45662 27783 25308 16660 9314 21469 23711
18979 23711 23818 22288 17828 12961 9546 17180 5856 14105 18697 27996 45992 56825 53971 42516
18965 42516 30802 38679 44309 32125 33370 27785 33906 20211 2640 -15913 -20163 -1246 15669
18952 15669 24080 31500 27376 26264 19960 18561 15244 17338 13436 17948 11181 -25 2748 28707
18938 28707 45763 45872 42477 23402 4674 27118 24084 22376 309 -22245 -8727 4098 11781
18925 11781 19971 14219 9695 20407 39924 44267 61942 51686 22401 16109 26733 26411 22485
18912 22485 12169 -2548 -3061 -6163 -1684 11744 14276 25993 24147 26768 12379 10748 7385
18899 7385 17668 -3187 -18044 -17576 -17875 -4075 19759 10193 5782 11143 373 -3935 -3806 -7694
18885 -7694 -2350 12565 3316 -3329 8469 5624 7024 6486 -3259 522 -2787 3282 10201 2456
18871 2456 52 418 -4691 5250 22645 18587 11658 1703 4153 19497 20337 11762 9013 9720 3580
18856 3580 -10702 -3619 -1160 -14148 -17089 5085 25155 5615 -9877 3544 -3520 -5993 7822
18843 7822 14042 976 -10 -980 -5070 -21610 -28002 2258 4574 -8340 -9792 -10197 7214 23046
18829 23046 38058 31785 30585 20394 10422 128 819 15732 8418 4153 14026 17104 -308
18816 -308 -1970 1692 7309 12595 29230 47102 34929 11948 24923 33282 33976 30490 29576 41623
18802 41623 61516 100035 131770 147694 159244 157009 156021 149473 137607 119795 122172 129604 135941
18789 135941 122201 102379 80979 60995 34667 30384 16453 26980 38686 41024 39929 18095
18777 18095 21657 28460 40905 51015 64247 52233 66572 89870 126841 188519 225281 218352
18765 218352 184722 118362 71283 50446 47897 52873 56969 62116 81657 125140 186455 236851
18753 236851 275463 284521 298545 312453 344814 368368 374844 396342 401957 417256 406484 380950
18741 380950 365224 367643 366804 390670 444585 564957 787019 1134325 1500901 1702935 1622940
18730 1622940 1291946 886680 566124 368473 262112 207037 168147 145418 122873 106558
18720 106558 104585 102903 94761 97115 101802 99480 80547 61745 66223 81062 93835 99824 104170
18707 104170 121307 154546 187191 198074 204466 202719 179216 157070 162192 159110 175867 203742
18695 203742 202282 174299 146035 103384 93191 89083 75805 42970 13733 5433 6473 22721
18683 22721 33391 19102 17388 34095 40894 33119 30304 29982 49748 48246 26856 24186 27291
18670 27291 31561 37368 38205 43717 45445 38585 32366 37349 40460 40375 46321 48686 51804 61203 52773
18655 52773 54231 54711 45564 29472 24038 22588 26182 36694 41612 37269 41338 26066 24893 24875
18641 24875 25625 36748 38557 25503 7537 186 -3994 3205 -11523 -5978 13073 -4218 -30981
18628 -30981 -20077 5446 11116 -4099 -11384 -4176 16017 20276 22233 29365 26994 22140 24828
18615 24828 29819 44615 47000 29501 33954 35521 52835 59468 73976 63609 54144 54131 60365 66734
18601 66734 52808 36222 26794 25605 32157 43752 28659 20047 27058 27678 48457 71224 61680
18588 61680 54884 41362 20619 28750 27297 19111 19000 37122 44939 31622 28753 35508 53680
18575 53680 53760 77143 105319 126355 145757 182853 231289 292537 355361 416748 453944 428689
18563 428689 363444 283978 209609 153467 118162 107189 85227 57644 56329 56754 66231 80958
18551 80958 99447 112184 143144 185864 209186 236843 242226 220861 209679 188414 144520 109982
18539 109982 84905 57360 54797 53871 39695 33709 44713 43096 49209 46079 37784 35121 30907
18526 30907 34228 36552 28313 32929 56907 85564 102179 125040 185240 260396 324718 335102
18514 335102 286492 187053 117664 74296 66739 70523 61615 57355 43525 28130 16294 7179
18502 7179 12594 23399 21774 18101 27850 40002 37344 29477 14002 25824 49189 42563 13719
18489 13719 13823 20198 13364 -3440 -3980 6858 18729 34597 42026 36638 26824 25832 42250 48396
18475 48396 56045 68262 76040 63891 51532 78446 95723 109684 134231 141966 138921 116404
18463 116404 82745 49645 39062 29033 19714 15120 20785 22660 18693 16148 19792 24419 23395
18450 23395 13604 7918 11385 18545 22996 15766 16998 10050 2198 6311 20890 26890 19317 42747
18436 42747 53983 41339 35058 31086 41000 60438 52543 39628 47202 33812 23176 27342 25035
18423 25035 28068 30464 36200 29856 44060 39622 25599 12486 12965 -354 -5502 -6099 1125 364
18409 364 821 8328 26169 52724 48560 36274 38569 43989 42458 52029 64736 67309 67199 66408 71252
18394 71252 89553 100321 112953 149394 197412 273737 376795 489732 499038 388265 252491
18383 252491 172990 128052 92247 71049 45506 35298 38840 28883 15154 23168 17370 3598
18371 3598 16183 21842 17764 24809 34473 49797 65189 66331 57972 57896 47207 20729 6637 912
18357 912 15358 21337 40148 46690 47187 55772 70646 87776 102506 108735 113052 125767 119108 128542
18343 128542 161249 185383 217450 309499 446384 655096 854298 896297 754801 536735
18333 536735 374046 263155 189762 138453 98084 64419 51408 56562 57646 56690 44062 37670
18321 37670 34864 37281 27300 27667 46459 48577 46430 37520 44591 55447 39029 37308 42898 59748
18307 59748 66362 53213 52605 45060 30923 31636 37792 47623 57823 79209 83983 78557 71676 82251
18293 82251 92178 101754 122202 149458 207072 297954 415455 454157 390000 270551 181042 128783
18281 128783 104494 93524 83554 72115 54121 35173 36232 48799 51049 35187 23039 23464
18269 23464 38486 40549 43178 44892 42670 48545 47823 53547 37784 25515 17739 25380 52288 49760
18255 49760 48684 42666 28854 54980 76969 97657 106437 118259 107704 89750 78133 71678
18243 71678 79190 103962 111122 145735 186484 183898 170794 170256 163412 157682 163317 164973 181079
18230 181079 173794 123471 102254 102644 107721 99401 74542 73825 90478 103098 107110 107590 112162 122074
18216 122074 133163 136608 152682 172741 203915 228753 234862 223898 201443 178858 169890 170589
18204 170589 186464 204059 196429 189706 182782 171523 147097 122434 107756 108406 111153 100093 114185
18191 114185 130909 144835 145762 155491 158861 143399 136598 133546 110955 87683 84027 75200 75452
18178 75452 76977 80945 91866 106205 110323 110886 116015 107247 98438 107292 110650 100336 89328 76503
18164 76503 74939 89453 94908 101270 100520 91666 88782 80676 103940 111625 123514 141435 151665
18151 151665 159404 163110 172294 174083 165514 154224 155129 143180 154187 166829 192475 214595 244301
18138 244301 263833 261521 243534 239396 241052 253078 272104 305451 334609 369084 431381 492781
18126 492781 552894 632487 722900 823880 967490 1171482 1449444 1809283 2190164 2583824
18116 2583824 3017973 3589203 4477041 5928521 8492182 13218852 20971510 29995419 30887647
18107 30887647 23544272 14289774 8153600 5157349 3583271 2624734 2011622 1615123
18099 1615123 1348512 1153823 990785 859031 749612 660622 582958 524857 485849 464452
18089 464452 455879 437182 447032 448450 437601 421631 415636 414945 440612 441190 437066 470181 536111
18076 536111 601158 630276 636223 625935 625699 610498 580612 573009 592784 618754 646044 696997
18064 696997 775826 864860 963641 1100452 1273889 1488924 1817830 2253966 2731470 3203511
18054 3203511 3706925 4358853 5322921 6843982 9360124 13565214 20159890 28388920 33611226
18045 33611226 31212840 23371051 15214320 9676546 6552561 4763720 3635606 2870431
18037 2870431 2361835 2034391 1841619 1709313 1566936 1418050 1313499 1247010 1230146 1279522
18027 1279522 1363890 1448243 1498506 1504935 1558129 1654368 1714431 1702956 1658420 1651990 1708346 1820759
18015 1820759 1938993 2064679 2237308 2481766 2799396 3205613 3778870 4532713 5446397
18006 5446397 6401572 7331540 8366204 9721714 11759760 15029761 20465658 29491993
17998 29491993 43014925 58002367 64720027 57591442 43019542 29907471 22178429
17991 22178429 18766943 18007536 19306927 22685568 28003937 34453013 40538248 44584034
17983 44584034 45489402 42898025 37400932 30321171 23261353 17490405 13529033 11155063
17975 11155063 9941755 9488834 9586173 10159911 11156786 12688021 15099794 18899822 24420940
17966 24420940 31297016 38313555 43849895 46526893 45649120 41399111 34754066 27300602
17958 27300602 20587236 15504394 12119760 10026743 8842402 8343407 8543331 9607415
17950 9607415 11967162 16243747 22636129 28898312 30010236 24814525 17292445 11263255
17942 11263255 7713319 5743002 4554203 3758656 3180184 2762804 2419124 2121200 1865200
17933 1865200 1618763 1373995 1176563 1038300 934466 873895 813404 768199 749832 737246
17923 737246 744469 770400 785495 760912 718782 696297 692281 684047 621117 565000 523638 524358
17911 524358 559282 581672 624825 609808 539261 459842 389152 335020 291708 269436 265054 267852
17899 267852 264610 258856 265183 251882 223624 221837 219541 215640 205298 197782 178174 157974 151393
17886 151393 154165 163139 153540 132199 118523 118268 128059 134707 126156 113903 116786 127674 141146
17873 141146 140108 141958 137299 161958 178146 154387 133923 129713 135259 149562 153741 156823 178701
17860 178701 200560 222674 198630 150432 130754 128477 130198 121917 122298 114911 103756 102133 107124
17847 107124 110029 118019 120885 121246 136526 140100 142294 129166 103711 97084 98531 95103 102826 107046
17833 107046 105519 124171 127949 136081 137211 128989 117941 104231 101273 98751 86310 78162 80273
17820 80273 93669 97367 84939 78373 84539 95534 101528 94137 78054 65246 49328 36497 30778
17807 30778 38855 48337 58459 61920 63634 67325 64639 60045 70216 79634 92519 86556 82853 77918
17793 77918 84307 73231 68124 71987 67468 49547 50337 52045 63058 67989 79911 73646 73832 86925
17779 86925 81820 85117 105276 134975 187301 233322 299267 350375 350715 315261 254866 180754
17767 180754 139155 130625 117097 108326 97618 106090 105169 86918 72374 53106 53198 70067 108063
17754 108063 173554 232100 297916 320810 291828 234842 186529 149021 126721 111252 79552
17743 79552 60793 58795 61431 54317 42332 50804 49306 22190 11419 10685 959 23010 39123
17730 39123 52068 48003 25786 13898 5037 18742 36200 38991 37538 33898 30499 29319 44130
17717 44130 54764 78487 88483 70670 62961 55884 35005 16405 16783 23439 22091 11840 873
17704 873 8431 15060 23456 23096 32257 34809 27620 11556 16059 16102 -7622 -2776 18999 19015 14217
17689 14217 24270 42921 59109 56919 64667 42638 22942 16783 2979 5340 11113 11690 8393
17676 8393 9349 1503 6425 20907 35029 41235 29536 12701 22977 32783 34275 23164 15024
17663 15024 37782 46269 52404 33748 26938 23798 31477 40156 41515 23285 11901 2786 1159
17650 1159 8973 31252 43108 23996 18081 30726 47042 41716 38406 43722 45162 30775 22025
17637 22025 34515 39403 45478 52115 46456 44865 46352 57793 39404 25419 22635 36227 68486
17624 68486 101062 140050 155361 157564 139590 103204 87367 72226 64333 51528 64421 85593
17612 85593 89555 99056 123261 117990 115580 116478 128043 132115 125956 127079 133522 123369 110252 109223
17598 109223 97170 75997 74576 77456 78107 73501 76499 65090 55360 48350 37857 30167 24436
17585 24436 18394 -2713 8747 23662 15837 12596 22578 29633 54788 39565 40169 41015 30360
17572 30360 23020 9664 4447 14023 15287 -1340 -12623 -10923 708 7898 4039 -2163 -10
17559 -10 -2595 6852 18174 29805 34714 43639 32068 16929 8272 2626 3188 1976 21522 24649
17545 24649 17345 17910 19804 24506 17533 9132 23852 22792 8173 -840 -3635 -2024 -13298 -10851
17531 -10851 -5733 4305 13038 25589 28158 37139 52123 63404 93459 135113 167801 174422 152240
17518 152240 102253 57270 38817 34292 14954 6019 23134 20108 8452 989 6947 -1536 -10207
17505 -10207 -7162 -432 -9939 -16850 5697 30476 16540 8938 14523 14398 19766 38687 35854 37321
17491 37321 42159 41906 34717 50106 61862 43070 26354 22020 30851 19888 -5678 -9138 11583
17478 11583 31717 49001 75253 106247 156809 207101 284669 356801 342899 269737 219183 162487
17466 162487 110039 65599 46159 25671 25377 33953 25107 26491 2066 2960 42436 54953 37556
17453 37556 20069 22530 27626 20077 39753 84261 110840 104965 117089 140852 179002 199091
17441 199091 160870 105581 64825 46495 45385 39782 36298 24184 37186 46781 56321 60075 33671
17428 33671 29999 31718 41830 58343 77595 94785 130329 154307 157021 137794 79938 51933
17416 51933 42179 40382 37755 40437 50404 42259 40101 40094 38352 31339 34722 46731 62377 72825
17402 72825 79825 93540 106494 136424 177830 204457 228703 247356 253203 231337 193098 161858
17390 161858 123488 83124 70649 68962 88591 107304 114542 115821 103637 90467 100915 130709
17378 130709 179439 226718 251911 263534 251487 236950 202360 158667 119492 102488 97738 67374
17366 67374 35275 9617 -4834 -5566 -6411 9634 20016 21602 23242 39727 48015 38144 39224
17353 39224 48034 41883 30104 33021 38981 21222 13074 9205 185 -126 -10895 -19075 -12438 9255
17339 9255 11803 3640 12144 18843 29025 30461 37060 35713 32820 11287 587 -4219 13931 46127
17325 46127 52416 44923 30240 27665 31992 15236 10341 15627 26446 22499 7191 22428 38225
17312 38225 47008 39539 46124 52662 41493 43964 62347 69800 60331 46293 47095 50850 56851 77364
17298 77364 75608 64936 75967 82584 86127 98443 106502 114573 122368 105393 97925 86266 65811
17285 65811 62700 59730 53636 44381 46494 56585 62710 71256 72671 81609 99595 96314 97163 102246
17271 102246 114894 110920 118272 122215 125152 129445 133992 137348 138978 130258 137578 135914 137647 158861
17257 158861 184321 200275 193195 208849 240499 261074 277613 301414 333633 369432 387993 407247
17245 407247 452290 504089 555786 622929 723428 835898 957442 1053369 1159346 1284027
17235 1284027 1423871 1567355 1710454 1867903 2075455 2339725 2611620 2913683 3369399
17226 3369399 4006719 4800411 5708777 6772340 8109812 9957391 12761491 17277766 24691118
17217 24691118 35944606 49201320 57916295 57139063 46665599 33110191 22110986
17210 22110986 15336112 11544069 9328091 8032773 7417050 7289724 7524515 8051821 8924115
17201 8924115 10216571 12227235 15473842 20890943 29667475 41673558 52413304 55750420
17193 55750420 49173078 36411357 24146235 15666268 10783637 7949960 6110243 4814354
17185 4814354 3848425 3138551 2622190 2264928 2032887 1899089 1802952 1710566 1604828 1483695
17175 1483695 1364003 1233603 1100627 1002912 917754 865858 839108 828157 807082 736637 654174
17164 654174 589630 506338 445275 417904 379344 338132 296226 270504 251691 245696 255050 241796
17152 241796 220754 206135 200141 214710 230209 215367 205925 195256 205194 200439 175017 160311
17140 160311 140675 132482 135086 141085 142967 136737 133576 131011 128502 120207 108933 106300 134084
17127 134084 139507 124939 119613 111605 102838 93609 82817 68664 54617 60190 63373 58210 50801
17114 50801 56389 48723 40960 49904 58313 54484 61147 72189 61748 40547 43514 40658 40338 37412
17100 37412 38257 40993 38472 45404 34976 22489 20640 30663 35592 32191 27095 44706 61574
17087 61574 51709 48621 39256 31967 45390 43544 20303 20762 33859 48135 40523 35691 30526 42869
17073 42869 55401 43659 32039 28337 59086 61163 59041 67669 72373 74701 67927 51900 28924
17060 28924 23031 22166 12029 13967 27039 26895 32986 24800 29206 26484 30428 36718 37536 32108 23155
17045 23155 27509 39500 34108 38957 37400 10588 11344 35157 24249 18672 22561 19371 29962
17032 29962 27532 20596 8827 14517 18654 20851 26044 17403 10058 11759 7011 15339 41822 41699
17018 41699 24033 -2261 6139 29305 34877 32844 23832 15976 17451 7571 3163 -16843 -32612
17005 -32612 -23652 -14948 751 22500 33885 38988 40520 36683 35130 42045 30967 12758 -6514
16992 -6514 -13462 -18842 -5291 1370 -4277 207 8901 10501 21592 18806 24761 5454 1194 17486
16978 17486 25703 34639 43018 19535 -9686 -13616 -12443 -1374 9911 11850 12878 15451 7058
16965 7058 6982 -16042 -20237 -27250 -31875 -5557 2304 -8785 -10855 -11429 1784 14840 18012 11069
16951 11069 10072 2132 -6104 -4608 -1180 -3235 3267 16430 20150 17587 17096 -583 4551 17355
16937 17355 24385 23281 10164 6020 9127 9519 6814 1740 14263 16911 23088 29120 18964 18104
16923 18104 16050 26794 10158 -2699 12348 36887 44543 32787 44665 46217 45753 40039 33771
16910 33771 39286 50234 54274 55522 33674 23029 20078 -635 -22190 5744 28914 36502 33897
16897 33897 28466 23821 11223 -1567 -11171 11481 30738 31488 36758 40635 41906 33664 24164 14707
16883 14707 9160 23273 52087 64741 71190 95934 137661 159930 165186 182295 207445 229648
16871 229648 234310 262028 296940 285772 227643 183846 155626 144916 147337 132518 100289 73593
16859 73593 38613 29965 36522 34739 22233 4905 -4293 -15206 -3601 22703 36543 41922 18926
16846 18926 1033 1209 -4658 -2067 9085 4961 -14154 -8756 17834 18942 23600 16467 10634 19826
16832 19826 2728 -4751 -18912 -33256 -28907 -21992 -20507 -4853 10294 9932 -17463 -34136 -29211
16819 -29211 -13747 -3546 12365 19487 11460 -5995 -21963 -28317 -27174 -20075 -9197 -1885 -4711
16806 -4711 6073 3218 246 380 5005 2028 -731 7900 6164 10938 5747 10941 1169 -3172 -4077
16791 -4077 -7335 852 -6649 -7042 -13767 -15278 -10656 -6653 6907 -5848 -24138 -31639 -29399 -24380
16777 -24380 -8103 -14475 -19202 -10717 -7388 -10360 -12467 -33080 -28373 -4535 1750 -3166 -12386 -11562
16763 -11562 -20646 -23455 -8385 5816 509 626 14291 10635 16696 12539 11925 19864 9482 -8141
16749 -8141 -18214 -13598 -13321 -16996 -25994 -28988 -32999 -30709 -17437 2883 3305 -5216 -13080 -20454
16735 -20454 -27246 -11876 -17020 1075 -10024 -5126 672 -1735 -3281 -4736 -3483 -11971 -19663 -29975
16721 -29975 -27003 -9997 -13065 -9726 -19007 -20812 -14251 -2011 -12435 -28309 -28046 1262 7145
16708 7145 12470 3563 -8170 -8366 2201 -7536 -13532 -2741 10939 8644 -10493 -20157 -23235 -12072
16694 -12072 9091 9495 3533 12595 19027 16679 -5541 -10335 -12365 -18511 -26882 -40610 -40732 -14453
16680 -14453 -11958 -23076 -18105 719 6132 2238 14271 9597 -11285 1528 8183 14596 15374
16667 15374 -653 -5 2242 -12780 -6251 -2604 10352 37306 47358 62616 87446 123938 161399
16654 161399 200625 259153 311610 300545 241784 165172 94595 47610 30186 30446 32691 13925
16642 13925 25103 31167 31065 48448 63867 70175 90360 121296 181713 246137 292424 303879
16630 303879 283161 203729 124945 80219 57571 51998 43285 34672 18472 3203 -20638 -33887
16618 -33887 -13725 -7272 -11265 -8789 8809 20081 23390 14302 11752 22377 20356 28149 24493
16605 24493 17189 12134 9077 19096 3022 -3553 -11233 -12362 -14647 1980 -6207 -11872 -12935 -18312
16591 -18312 -24844 -19462 -17337 -17846 -3605 -2506 -2790 10395 5275 -1128 6337 8347 1867 9756
16577 9756 13451 10758 1906 -16225 -23509 -6867 9026 12101 -5581 -16676 -13385 -3223 -10797
16564 -10797 3474 19168 6518 1043 -7515 1422 1991 -4705 9733 -7475 -17604 -10049 -753
16551 -753 -11240 -4876 -7206 -11136 -8212 -12535 -12323 -18111 -19761 -9712 9748 14501 10991 -6351
16537 -6351 -11440 -29647 -33566 -20874 -17144 -23100 -23879 -25484 -24367 -16900 4478 3888 -7040 -20508
16523 -20508 -22906 -17962 -515 1833 -15351 -10454 -16717 -19689 -16131 -17182 -1257 5421 -4583
16510 -4583 -6482 -12951 -20947 -14129 -11889 -5599 -4621 -11297 -28977 -31136 -24047 -5406 -10176 -8790
16496 -8790 -9344 -12746 -22257 -8534 -13 16959 15716 4640 10925 -1695 -12695 -9610 -1409 -14321
16482 -14321 -28272 -9636 -2312 6166 8270 -12779 -18276 -2046 793 -16874 -9663 -7341 -12298
16469 -12298 -13717 -25461 -33749 -29262 -22246 -25613 -19025 -33912 -39396 -26769 -29787 -26028 -22920 -32011
16455 -32011 -35243 -25409 -29616 -37215 -30069 -21303 -24505 -29963 -29518 -14359 -7470 -1989 -6526 -18406
16441 -18406 -25508 -25600 -27498 -15560 -8492 -14152 -22246 -24531 -10172 -9931 -15878 -3059 930 -8641
16427 -8641 -10155 -23586 -33188 -42711 -27272 -13487 -1309 -8213 -27322 -36225 -35831 -11383 1661
16414 1661 2186 -10762 -18333 -12875 -22075 -28899 -24695 -23164 -11938 -11750 -16390 -4261 -11442 -16622
16400 -16622 -8743 -13254 -19761 -2545 -1993 -15364 -16257 -11935 5859 2940 -1183 -14957 -17865 -11204
16386 -11204 -1658 11337 5372 -331 1999 7642 16116 -3171 -19021 -19436 -29688 -16816 -6307
16373 -6307 -12945 -29066 -22508 3686 9221 -10625 -16655 -9787 -24219 -31285 -40016 -28126 -14348
16360 -14348 -20491 -10456 -3550 -4836 -17086 -23173 -31946 -15686 664 12917 3304 -17064 -24206
16347 -24206 -9508 9612 19353 15284 11097 -1454 -23654 -40067 -21759 -7244 -2525 -7840 -16689
16334 -16689 -27005 -14915 -9153 -8103 -3230 -13691 -15765 -24151 -39405 -27751 -23146 -13000 -7458
16321 -7458 -19640 -25951 -25147 -7944 -13517 -16386 5320 18508 8589 1678 263 -20834 -20997 -4121
16307 -4121 -5759 -4958 -1474 -3021 11678 12331 -6966 -14604 3867 4224 -20813 -31192 -29527 -27116
16293 -27116 -32348 -26391 -10213 6126 -4873 -24554 -15813 -17726 -24661 -15040 -8796 1392 7817
16280 7817 3245 -4647 -1195 4182 -12375 -13306 -2343 -14279 -22465 -12903 -567 6435 1183 -1246
16266 -1246 4641 3547 2078 -1844 3400 -9973 -15062 3895 17272 10341 3913 -9546 -18651 -20857
16252 -20857 -15187 -682 2857 10219 11536 4913 6843 17817 19735 3366 -6568 -490 -9026 -23342
16238 -23342 -22538 -8327 -11258 -19001 -30497 -28308 -8473 10078 13099 3093 -8827 -6341 3964
16225 3964 9372 -13045 -9928 -16944 -30184 -45064 -31528 -30904 -33820 -15723 3381 -2543 -1809 5031
16211 5031 13484 17636 5119 -11522 -1493 -741 -7265 1550 -5760 -18865 -7936 -12723 -20812 -25186
16197 -25186 -23288 -15224 -9354 -25679 -7078 -11485 -5242 2443 -12114 -13085 -8552 -15783 -12146 -15740
16183 -15740 -28395 -16390 -6833 18322 20936 11486 -5399 -7927 -6878 -4530 -2960 -4294 -6426
16170 -6426 -17650 -14487 -914 895 11182 1209 -12703 -1318 1956 290 4463 2452 4824
16157 4824 4648 6613 16373 21040 -2546 -22671 2775 9058 13178 19093 24943 27818 25318 13756
16143 13756 14562 9593 14385 17451 13668 5765 -161 -9291 3898 5609 4489 2608 -1500 -9018
16129 -9018 -23939 -19162 3502 10008 23019 6379 -6189 -21208 -35983 -40370 -29877 -23708 -21993
16116 -21993 -12173 -11342 -9068 -9921 -13274 -20326 -24059 -28886 -17323 -10465 -1578 -8705 -10231 -11363 -196
16101 -196 -11360 -12307 -6049 -21723 -35577 -41066 -33231 -24023 -8205 8794 8659 -4578 -9957 -10488
16087 -10488 -1306 11419 21073 34153 26613 20434 19999 9649 7978 13251 12353 8988 2931 -3546
16073 -3546 -4734 -10985 -12254 -3758 -12449 -16362 -3349 -4743 -18163 -11156 -14109 -16413 -18722 -33386
16059 -33386 -37314 -22448 -11494 -16014 -29212 -25523 -9673 1646 -6106 -5727 -16185 -11663 1883
16046 1883 1112 2147 -5926 -2708 -16716 -28812 -8881 -5594 -25795 -32553 -26080 -26599 -34056 -13947
16032 -13947 3725 2715 512 -3137 248 13789 13119 20726 33893 26187 4852 4778 -9625 -23979
16018 -23979 -24324 -18442 190 2799 8890 4598 -102 -1925 11335 -1252 -4919 178 157 -8402
16004 -8402 -29289 -40955 -43236 -36614 -41227 -17120 -11830 -14099 -15933 -5496 -6869 -9679 -13383 5378
15990 5378 -7513 -20534 -25031 -23432 -16543 -15520 -11891 -10078 -3687 6193 18218 33457 43067 16561
15976 16561 -425 -5701 5260 8957 -12712 -12568 -15558 -22626 -262 15998 31048 26275 1251
15963 1251 -8159 6010 1321 5828 17520 19067 4432 -6559 -10719 -13657 -13190 -16254 -29639 -26669
15949 -26669 -17072 -19328 -31112 -38364 -29293 -11707 -11545 -10781 7859 14971 684 1756 499 -5188
15935 -5188 -16265 -11255 -1202 11787 221 -13131 -15480 -16703 -1931 9333 3469 -6548 14376
15922 14376 8 -14645 -17473 -35882 -15003 -4315 -853 -8517 -15394 -14779 -14990 -19923 -33074
15909 -33074 -18857 -11784 -12625 -11901 -12956 -9454 750 15770 2137 -4004 -4835 -436 15743 15558
15895 15558 10928 2871 -645 -9049 -17205 -24072 -26182 -11895 -1281 3693 -4266 -22925 -36356
15882 -36356 -30517 -17733 -5064 1926 -1273 4057 12810 15031 20973 6537 -6883 -3753 -22832
15869 -22832 -23053 -23073 -16626 -17498 -18413 -12593 -2333 -9638 -1081 2380 743 -68 -3654 -8631 -9016 -12603
15853 -12603 -28334 -21902 -682 -12818 -21151 -10286 5369 4575 -2823 -6493 -19639 -22114 -24993
15840 -24993 -28204 -22944 -22906 -16495 -21326 -18494 -17690 -27309 -26243 -16389 3124 12440 -8925 -9941 976
15825 976 7412 965 -5201 -17579 -20941 -20575 -21484 -7836 -9972 -6626 -13372 -16384 -12392 3773 15317
15810 15317 17019 21161 9780 9303 18604 13061 14257 16958 14752 11652 -3144 -790 7049 -3384
15796 -3384 -8251 -12662 -20276 -34427 -29436 -24624 -22048 -4736 -1625 -16806 -13321 -12215 -867 -10961
15782 -10961 -14723 -2393 516 14909 11800 3045 2694 10042 17644 1467 -10134 -16243 -24378 -28188
15768 -28188 -13580 -13717 -37045 -46876 -32656 -15327 -6343 -1564 -11729 -11845 -4620 -12871 -21455 -12778
15754 -12778 10652 5277 4602 2874 4080 -13002 -16650 -17734 -3655 2129 3617 677 11937 14150
15740 14150 5694 -8982 -15283 -3859 4955 15371 7425 3695 8158 15960 10170 10511 -1187 -24345
15726 -24345 -14362 6276 13382 7460 11128 1373 -10018 -924 13928 1206 -9937 1198 559
15713 559 -6624 -16577 -5658 -12631 -1864 3781 -5202 2295 12751 -874 5216 8425 2089 8582
15699 8582 15454 13452 16265 7048 5989 2196 1567 709 -10817 -7410 -5343 -11946 -13268 -11454 -6091
15684 -6091 6844 8805 24921 28784 9775 -22027 -16954 -15661 -15295 -18718 -28641 -27986 -16978 -12391
15670 -12391 -5963 1355 -2483 -13788 -14895 11360 14319 -2744 -3618 -10147 -6299 -6212 -2571 11868
15656 11868 6819 -971 9111 14154 2225 1929 10230 7287 -11579 -12102 -5617 -2566 1670 -1489
15642 -1489 19329 32830 38429 26168 3037 -9592 -9932 -8773 -14307 -15131 -10827 -17385 -2340 -4678
15628 -4678 -23724 -43051 -35512 -8866 4895 758 -9205 -14847 -2620 3692 -5649 -5807 -2991 -1189
15614 -1189 -1235 6199 -11311 -27190 -17736 -8912 -20898 -18875 -11886 -23289 -35255 -14849 -6950 -9342
15600 -9342 -7542 7876 10252 926 -17636 -24058 -3150 -2257 -20233 -24843 -16964 -24973 -12769 -10707
15586 -10707 -11350 -21036 -26738 -23334 -6427 6936 -5221 -23564 -19193 -10706 152 -6002 -1604
15573 -1604 4688 -8796 -2311 -8193 -15893 -5878 -2226 -24128 -10398 -14651 -15468 -7656 -5228 -5635
15559 -5635 -4474 -1466 -5157 1392 12142 8362 16899 21942 9419 10115 14791 29150 29790 11225
15545 11225 -10743 -11694 -5865 6687 8283 9595 1565 8497 -7893 -7397 -3146 -1684 4061 -367
15531 -367 -10675 -9930 7429 15810 20108 17519 14440 5660 13580 11109 -1311 -12217 -11537 -8464
15517 -8464 -24334 -29051 -25123 -28634 -33656 -20370 -25077 -23782 -17572 -16425 -5048 -3865 -4908 -5303
15503 -5303 -20056 -26740 -10528 5372 6889 -13579 -25368 -17283 -14096 -14246 -26752 -34615 -21206
15490 -21206 -7918 -6029 -6547 -11155 -21573 -17364 -13230 5404 11827 11468 6066 -17698 -27455 -14333
15476 -14333 -10298 -12585 -34160 -16246 -1627 6651 -6362 -24 3854 15055 13294 3177 -5208
15463 -5208 -12900 -23874 -35159 -14351 14397 20093 3163 -24408 -37784 -22153 5526 19567
15451 19567 10687 9391 -4136 -15409 -3933 21240 14943 -345 -18350 -27505 -15782 -16298 -29106
15438 -29106 -35003 -44183 -42797 -19225 -10539 -2676 1984 1706 -10446 -12899 -18401 -17763 -17673 -13232 -9800
15423 -9800 -10195 -23871 -28840 -12634 -16180 -12778 -4209 -11271 -5007 -657 8379 17059 21543 13373
15409 13373 1781 1603 5158 2056 -15 11637 7166 4786 -6019 -15767 -19865 -16982 2639 -901
15395 -901 -2949 -5005 -8658 1147 -1501 -16848 -8056 71 -3736 -17702 -18589 -16530 -13546 -23188 -14988
15380 -14988 -4814 -7204 -18946 -18882 -5869 6444 21100 22295 10542 8391 6110 -5895 -16326
15367 -16326 -8360 -8542 -5360 -1117 7434 8514 -840 -21772 -39427 -30132 -8987 -6701 -14106 -24987
15353 -24987 -17212 -1924 2290 -8884 -5936 -13064 -598 -2217 -17864 -19146 -18500 -8504 -6360 730
15339 730 5756 -1655 -2779 -9799 -25614 -27149 -16338 -11670 -12278 -19808 3642 22331 15125 -846
15325 -846 -10231 7886 12539 10942 12091 14961 15050 19651 9693 -7909 -16380 -15114 -20897 -38081 -42697
15310 -42697 -15090 -259 -5201 -3977 -4576 -5537 -9238 -18404 -13541 3876 12380 5320 -5492 -21702
15296 -21702 -42231 -34438 -4472 -12892 -23007 -21362 -10194 -11436 -4581 -10653 -17805 -8777 4345
15283 4345 7118 13650 17694 28458 33002 13152 11336 18409 11662 12795 6638 -11655 -7893 -18512
15269 -18512 -23729 -4661 -3966 6027 14186 18504 183 -6215 -20434 -12242 -14866 -8615 3099 11859
15255 11859 17749 8083 -133 -4057 5216 -816 -19764 -16530 -24608 -16130 -19898 -23468 -13544 -8248
15241 -8248 -15495 -20421 -23949 -20346 -14721 -11297 -9086 8026 5739 -11936 -27345 -25542 -15111 -5763
15227 -5763 3294 -8559 -26056 -26318 -8454 -1117 -11831 -4428 15003 10777 24453 27839 10630
15214 10630 -1577 -10172 -12917 -12522 -24731 -32017 -19694 -7265 -7490 -13991 -7556 -11887 -9182 -7817
15200 -7817 -15323 -33574 -29521 -18594 -11211 -11845 -15485 -14420 -27716 -31254 -32439 -25644 -27393 -46805
15186 -46805 -35244 -11556 -52 -6550 4697 11504 16659 10126 1768 16015 30579 33401 32247
15173 32247 13542 16464 2309 -7034 -12764 -13434 -12696 -10412 -20567 -22285 -7512 -12573 -5381 5058
15159 5058 13381 7668 3935 4411 -4298 -3264 9023 -5693 -27767 -27782 -25065 -10624 -17971 -37373
15145 -37373 -36118 -23286 -19119 -25242 -9576 -2799 -4929 -15497 -7460 -12773 -18969 -20258 -22256 -10102
15131 -10102 -16199 -30637 -42915 -33748 -32439 -37601 -22922 -26273 -20266 -18156 -6305 2152 -1713
15118 -1713 6487 4485 6592 15555 18715 16518 5334 4965 12483 3223 -11378 -27564 -39310 -28011
15104 -28011 -13582 -10128 -18395 -21386 -26240 -29851 -22634 -2216 2775 -10097 -16156 -16154 -6044 -11805
15090 -11805 -26251 -47059 -50578 -46890 -36797 -6072 770 3896 2105 2710 7587 5061 -5024
15077 -5024 -20224 -42689 -53108 -46755 -23900 -3020 8501 66 -4770 -11505 -3332 -18588 -26397
15064 -26397 -9757 -5884 -11178 -5462 -88 -3565 -2004 -2397 -5077 -16240 -7532 1951 -197 -2311
15050 -2311 10842 24120 8892 -13292 -3983 18053 5784 -20001 -20579 -19114 424 10195 -8603
15037 -8603 517 -3680 -2133 -9595 -6328 -13301 -23044 -18611 -10901 -8383 -18711 -32897 -22922 -11460
15023 -11460 -1721 12236 5966 -6705 -9396 13472 21475 29504 21918 26829 50266 65831 80576
15010 80576 103984 153400 216692 332950 534653 730676 691044 494564 285732 171659
15000 171659 104001 63901 30374 -3594 -1841 6972 7039 -5480 4116 9159 15661 23468 27157
14987 27157 25613 15348 4923 9709 2761 -3023 2148 7938 14231 497 -11061 -15572 -12109
14974 -12109 -9941 -9319 -10359 -12333 -22862 -32321 -25468 -25944 -28492 -29184 -35569 -14710 1610 -12976
14960 -12976 -39969 -25984 -8424 -9103 -28911 -31195 -20351 -24739 -16244 -6205 -16942 -11262 688
14947 688 4375 20403 24677 2998 -3197 -1555 9940 12533 -4093 202 13973 20661 16854 11096
14933 11096 6217 -3014 -8020 -16597 -21131 -19078 -16113 -10266 -8209 -16618 -17917 -19179 -9797 -3441
14919 -3441 248 6683 9636 2925 -1241 3552 7999 17611 -4465 -29853 -27944 -23567 -21395 -23047
14905 -23047 -21289 -13340 -27027 -22753 -25771 -36128 -20852 -12452 -7648 6644 6193 9666 5777 15936
14891 15936 11573 13806 12586 -11905 -22269 -19873 -4670 2026 5362 7426 3242 5278 2464 -1638
14877 -1638 -25511 -29940 -26186 -9300 -3069 -9894 3983 -2438 -17433 -5827 -5415 -14910 -44708
14864 -44708 -35995 -6672 13141 9802 12618 10122 1968 -11375 8437 2118 -3850 -12425 -9895
14851 -9895 -9207 -13057 -14377 -36762 -37149 -11543 9385 4993 -14736 -20469 -12084 -1203 -17049 -15609
14837 -15609 -14249 -15007 -24166 -24180 -14115 7175 2993 -3453 -6038 -7781 -1307 -3843 -401 -14389
14823 -14389 -27569 -38288 -26094 -7847 -8317 2026 -2844 -14154 -21114 -27463 -28782 -17309 -13273
14810 -13273 -7096 645 -1324 -13895 -19741 -17561 -12949 3689 11281 -12288 -13327 -10298 -16883 -28878
14796 -28878 -25440 -3996 4382 -6033 1902 -6970 -11399 1313 19411 21791 20003 20384 10455 -3897
14782 -3897 9681 6765 5464 9635 19863 17053 829 -9809 7610 4887 4402 -24272 -36059
14769 -36059 -28144 -34025 -35900 -9380 6899 11571 -1844 -4920 -13162 -23431 -18683 -21370 -29969
14756 -29969 -30727 -14359 -1499 -7168 -6085 -5868 2188 20025 15709 6383 -11077 -14563 -2826 3174
14742 3174 2440 16614 26456 18439 2151 1752 16946 20099 27644 46289 28401 15743 12139 15137
14728 15137 21458 13257 2304 -19611 -15423 -6314 -7360 691 -3910 -5014 -5620 -20850 -17575 -19382
14714 -19382 -22925 -24744 -26524 -25364 -14132 -11686 -9409 -7399 -11486 -22226 -26947 -23816 -21301 -29030
14700 -29030 -30991 -22871 -22959 -24357 -15642 -3763 -21190 -19655 -9683 -277 18778 11274 -5982 -236
14686 -236 -461 1013 3485 12194 23809 24577 24173 26387 11002 3403 2920 4507 9361 2435 6565
14671 6565 14961 18144 12702 -5954 -11572 1941 6786 -74 -13968 -16882 -5492 8914 17253
14658 17253 290 1960 12597 636 4551 2118 18312 25815 8904 11036 13847 6205 -725
14645 -725 -3053 -12860 -18362 -18383 -33520 -34300 -27920 -15745 -5050 7967 7971 8173 12502 5838 -9968
14630 -9968 -20363 -7943 1500 -1143 10697 7537 14359 18305 19874 4043 685 2020 -3388 1224
14616 1224 -16825 -28936 -24464 -36925 -37575 -22280 -14784 -4827 -10429 -11591 -10984 -12873 -15758 -7832
14602 -7832 13864 19421 5904 -24527 -41185 -31262 -31516 -15667 -12710 -20128 -12814 -3017 -11612 -9130
14588 -9130 -573 -11146 -12510 -6443 -6531 -11706 -27568 -7466 926 -985 11244 1977 -12502 -9558
14574 -9558 -10122 -15547 -20716 -25620 -8403 6791 -6619 -20786 -9068 772 7261 9463 -10288
14561 -10288 -39926 -31239 -20255 3640 19079 20622 6339 -7973 -15520 -16751 -18229 -13162 -17273
14548 -17273 -12825 -427 12618 11287 -5994 -9949 -7355 -8517 -2098 5824 5021 -22353 -30358 -29060
14534 -29060 -31775 -23769 -28111 -40311 -35310 -29438 -22881 -11817 1379 14777 8078 4433 -7740
14521 -7740 -22050 -26238 -7822 -6121 4444 17097 2840 -23924 -12070 -3864 -11297 -16243 -11364
14508 -11364 4778 3761 -15036 -32044 -46023 -36338 -17899 -9016 -6328 -8639 -8754 17 14299
14495 14299 9886 11176 -2543 -12890 -8346 -9751 -9927 -13568 1162 11520 3210 -6856 -1162
14482 -1162 -600 -2008 -9115 -7352 5385 -7684 -10466 7459 20183 20588 12906 -772 -2581 2653
14468 2653 2636 -7320 -11563 -17113 -10104 -4461 -4125 -14431 -18273 -7743 -4079 -3692 -13428 -20958 -18186
14453 -18186 -5453 -10990 -13701 -11564 -4272 3801 -1807 3158 212 -4242 -1602 -6207 -21819 -13544
14439 -13544 11457 9424 -6269 -1389 12572 15509 14894 -1129 431 4626 2941 -4860 -15636
14426 -15636 -17216 6379 -1449 -10267 12461 18307 16532 381 -4815 -18039 -10384 -8361 -4797
14413 -4797 6929 19428 14026 8628 257 -10733 -7028 -9314 -4393 2712 -2482 -17972 -24109 -15593
14399 -15593 -14883 -22971 -26082 -32419 -15727 -10714 -14857 -19445 -9354 -9978 -6992 -3354 -6205 -4347
14385 -4347 -7607 -13232 -24135 -27713 -24879 -15193 -4368 11057 -4716 -10293 -16374 -22108 3336
14372 3336 28052 29818 25902 22884 13766 10593 -10175 -1132 -4625 -3209 1819 11215 17951 1526
14358 1526 -56 6152 18402 9436 8952 2095 6980 5922 -3698 6812 4901 4211 -1381 6257 11061
14343 11061 12006 12226 8407 -1055 3512 -3436 2995 19330 8068 -1632 -3907 6168 9160 15772
14329 15772 11868 8424 14118 8148 -3760 -8547 -2571 -173 -2242 -1493 4754 10950 20097 20588 12540
14314 12540 15861 14187 -256 2204 15925 19964 22649 13094 -2267 -10379 -9999 -21060 -19998 -6337
14300 -6337 -5020 -6242 -15769 -8868 -14256 -14625 -16709 -22687 -7076 15550 22145 -1715 -11838 -6658
14286 -6658 3045 3887 16868 149 -9596 -28908 -31133 -28995 -13108 -7748 -8158 -14 22806 27221
14272 27221 31196 18006 1996 11775 10873 6930 6934 3697 -4664 -17870 -16868 -6598 10383 -3778
14258 -3778 -10120 -19836 -30997 -52362 -42265 -23228 -14538 -13330 -12097 2670 10664 -8704 -19133
14245 -19133 -16950 -11441 -4235 6874 14831 32234 39998 37883 13818 -7013 -3424 -4150 13129
14232 13129 6406 -3478 459 8760 6233 11819 22491 14845 1086 -11754 -3960 -1175 -842 6902
14218 6902 25583 28971 20156 22073 16177 7951 -1078 -2895 -3660 -8357 -6602 9666 15657 10771
14204 10771 928 3024 -16191 -15728 -12125 5987 -4598 -14195 -7559 -17459 -31900 -19352 -16689
14191 -16689 -24691 -29112 -13200 -3376 -3491 3054 12366 26946 23836 18394 11473 4278 4553 25882
14177 25882 28202 23801 16445 27038 26826 13325 -718 8593 14889 12454 6287 12700 24243 30007
14163 30007 33744 23875 515 -18089 -18102 -6810 7875 19716 24700 34557 24948 13528 3682
14150 3682 1531 1906 4712 3561 -875 -10389 -33170 -37431 -9669 4809 7649 -917 -11173 -11853
14136 -11853 -25672 -24699 -2588 -705 -17791 -16406 -17718 -15666 -5035 -12857 -8913 5516 -14560
14123 -14560 -31898 -26399 -27414 -2089 5603 -14258 -24495 -25318 -13856 -1518 10114 10287 -4116
14110 -4116 -20715 -10456 -4051 -8778 -7324 -16619 -23170 -24662 -14312 -15754 -28992 -24406 -14328
14097 -14328 -7876 -8551 2034 12781 16098 -5673 -18411 -16463 -16271 -11014 -12697 -16191 -5444 2393
14083 2393 5609 -267 8025 6598 6323 15934 6249 -6958 -2650 -26979 -25517 -23331 -31300 -24030
14069 -24030 -21233 -2943 19977 23019 21829 20641 8202 2696 -12146 -7684 -5395 -462 3590
14056 3590 5352 10983 9573 25077 17980 -5087 -10953 -4266 4545 11085 20418 8528 -14006 -5226
14042 -5226 8074 8672 2570 -1171 -12226 -5782 2539 12896 31875 37738 21313 29138 32831 35083
14028 35083 29412 34847 41543 47560 47500 55776 38206 21679 8716 13394 19335 14533 10112 -3431
14014 -3431 -5903 11570 9679 7810 2168 -4495 13132 16175 9173 17472 28499 28860 30169 31062
14000 31062 36372 41588 41948 57162 76822 76123 73021 89436 104012 114644 129247 145509 177715
13987 177715 213118 250659 328198 427036 507384 586399 662346 785249 976198 1290250 1863446
13976 1863446 2829669 4256018 5587998 5535724 4245655 2686476 1617957 1050599 739965
13967 739965 560767 443379 375769 317555 281072 237768 188158 161206 161692 160486 140763 113406
13955 113406 89392 79189 74109 64238 56531 63582 61903 52530 41235 40502 30490 22021 28545
13942 28545 9977 21683 27914 20712 19459 19734 21198 30241 27477 29433 51639 73434 79294 67731
13928 67731 39663 18438 1091 -9019 3524 25773 41735 47153 66300 91933 107963 102463
13916 102463 94690 72912 60196 49476 57470 66859 63400 74138 87367 106271 121979 138253
13904 138253 163278 179851 213025 258018 296745 355315 454478 640709 945577 1354273 1718221
13893 1718221 1822862 1582857 1142187 739054 472536 330018 255479 197980 162216 138867
13883 138867 123608 114350 104564 94338 79732 56936 34402 25218 -5557 -3079 24349 27665
13871 27665 35327 29084 24595 11093 362 -8934 -4530 14749 19558 11767 2246 11103 22248
13858 22248 37671 31627 18118 10589 12556 9782 17503 27528 26567 21031 20641 -6479 -23099 4241
13844 4241 24762 6165 6809 14245 21360 29274 40628 27890 27611 24061 21278 15841 15227 6367
13830 6367 -12161 -4685 4770 13000 24586 20907 18384 4558 636 9816 21997 13900 4780 11031
13816 11031 23002 18653 23451 14144 9564 14841 13142 7266 2016 6273 3597 -9252 3954 19114
13802 19114 37408 41429 33460 24599 13320 6899 6500 7601 -1665 3662 15417 27145 38572
13789 38572 24496 19826 30259 26713 29244 47997 45622 22131 5298 -1910 -5293 12012 13294
13776 13294 12411 2173 10232 10558 5775 -9430 -1156 14437 17830 7544 -206 -2651 -13091 -10767
13762 -10767 -11959 -592 12721 27242 45826 66993 75054 90618 90938 76154 64044 61322 55267
13749 55267 50879 51201 51622 48562 40105 16283 -6567 -17496 -8004 4571 10007 18066 21087 14220
13735 14220 22547 26362 17657 7262 6891 25229 33240 36216 21844 10426 10548 8026 -4592 7834
13721 7834 29283 22906 24581 27368 16514 14386 30159 15911 16729 34170 29875 32083 67329
13708 67329 131636 207201 285848 354004 337234 259289 156101 83032 30750 19942 20944 17072
13696 17072 19762 22918 29543 42389 58746 55188 29930 34207 19233 12090 5664 21975 38366
13683 38366 44641 46899 52929 37622 43428 43350 55159 48607 34951 35352 31476 2864 -2556 -13643
13669 -13643 -19318 -18733 -15471 7457 39200 52713 50314 46714 41145 46504 37568 12836 -4653
13656 -4653 -8359 -5743 1755 19042 405 -15472 -7619 -2886 4344 33384 54032 80238 106239
13643 106239 120416 144372 170382 202463 178550 108689 49544 21927 5108 12467 19413 28315
13631 28315 41534 60300 76302 71894 83530 92973 78721 75744 67188 61579 54930 38183 16898
13618 16898 20749 16612 10123 8764 14838 27620 38026 45992 39991 44942 50424 67220 60107 43434
13604 43434 12531 11594 27159 36280 44951 53200 78509 71491 45805 35592 34015 51099 58085
13591 58085 68849 77925 83384 100661 109705 119577 123594 155137 189516 201540 223181 273450 352836
13578 352836 504772 728038 920000 973131 827687 605963 417769 311476 251478 223752
13568 223752 212024 212490 204815 171726 161963 155973 138199 130494 141560 154975 151760 157672 146961
13555 146961 144450 159959 171120 177909 161639 133575 115199 111176 128853 151816 151261 157205 145401
13542 145401 137828 141707 136389 141728 155483 174638 183190 183048 175063 183123 197367 209537 215922
13529 215922 219623 213450 187392 191491 194241 176138 171200 180591 178723 176212 187715 201527 224064
13516 224064 241294 243765 256732 272950 266838 243197 227116 230125 268892 318724 365289 418896
13504 418896 441892 486795 526121 554556 575401 608611 641520 669150 725099 789790 840935
13493 840935 883245 932677 996178 1067223 1130348 1185071 1241127 1300645 1376036 1475952 1588314
13482 1588314 1723032 1873442 2011542 2100873 2209934 2404015 2701299 3116107 3642719 4252677
13472 4252677 4944758 5709359 6553855 7557330 8844690 10524549 12841081 15970778 19979846
13463 19979846 24701383 29842080 35177863 40990932 48205653 58759121 75853455 105135577
13455 105135577 154693921 229816976 313049209 359404987 339797070 263423150 176289192
13448 176289192 110483183 71849890 50419586 37701220 29656320 24256780 20326736
13441 20326736 17274695 14757494 12561366 10582178 8880545 7537528 6530158 5749122
13433 5749122 5128866 4638056 4273007 4005336 3794561 3554626 3289640 3024061 2760855
13424 2760855 2492214 2248322 2084936 1991727 1950979 1898875 1763117 1588371 1409463 1272966
13414 1272966 1187018 1112208 1059211 1013101 977514 951954 921836 872935 824674 793505 759552
13403 759552 735959 729272 737806 725361 708144 676810 681043 699004 715411 711706 688279 660061
13391 660061 636254 621154 597841 575334 573320 569952 552208 537367 521613 504128 489361 466881
13379 466881 430055 386907 372769 353231 329051 337827 339299 335302 332112 336558 323460 310492
13367 310492 312305 319359 343926 341949 313068 301806 278824 259037 258549 261055 254761 242068 239414
13354 239414 241221 249505 251342 246662 255434 253507 244664 236400 242843 246812 252715 258097 259467 277074
13340 277074 295259 324062 384433 465863 637186 882328 1099990 1164248 1030284 799512
13330 799512 597571 467592 394460 375977 402797 392185 343717 283019 242687 220710 220989
13319 220989 206104 189951 194183 189108 200179 192399 172133 150828 152222 152508 143700 119937 105782
13306 105782 117761 142962 174027 227721 270482 278773 262201 216622 163661 127720 120124 115952
13294 115952 124537 120861 107721 112066 125718 115014 105029 103319 116173 136302 130874 132740 127363
13281 127363 98708 83281 72231 69790 68878 70838 80881 90329 112480 118818 123394 132762 121550
13268 121550 119472 96791 46851 -4328 -35269 -47339 -24167 15343 38557 47526 70113 99618
13256 99618 133645 144615 159873 166820 150535 149355 149105 175775 181297 202291 244965 287665 345045
13243 345045 413866 521798 715254 1036728 1395092 1594517 1460657 1103301 745027 518611
13233 518611 386321 287378 216084 189605 189000 185987 149506 137451 141942 140214 124862 109109
13221 109109 88972 68994 70693 60345 44850 39311 37618 42203 44412 54443 61418 47700 40956
13208 40956 61665 78358 78114 80083 84392 87860 95546 105405 80759 54547 51455 59281 49038
13195 49038 27738 27407 25016 22344 39171 56525 51762 36244 41061 45955 35792 23813 23369
13182 23369 47731 63196 59135 55101 54410 82222 94775 88594 77457 55351 40178 41480 51691
13169 51691 55487 53528 39565 35180 27195 39385 39936 40978 44400 30540 21656 38733 42599 48344
13155 48344 57482 72308 115101 129021 159152 221968 307991 380737 369220 288483 194762 128320
13143 128320 85237 71816 50664 34364 51612 55480 38995 36417 25247 15798 15424 30918
13131 30918 32027 30996 37890 48973 54610 47657 35162 35122 37306 39632 42647 40174 37156 16980
13117 16980 36579 62617 68476 61304 42114 33799 33061 42057 47935 66605 97205 122366 116625
13104 116625 98280 76896 66293 74798 66549 71052 62966 43078 35283 26100 23625 19516 30612
13091 30612 26373 25653 26309 25647 9885 9539 16873 19973 13690 20131 18069 12480 15007 23573 36339
13076 36339 24686 677 8067 32702 37800 33143 36929 28186 5841 -1643 17270 24110 41798
13063 41798 49691 45451 29097 12801 8756 11363 4556 795 3618 14968 8909 4730 2453 11756
13049 11756 19389 20711 38241 48904 47877 58383 39766 24666 38845 43599 40463 37350 41462
13036 41462 41534 40514 43747 55041 42727 38874 32742 16527 9374 30685 52240 40500 33192
13023 33192 39988 33021 54439 70716 78760 84422 111984 147215 142392 172924 192878 207673 212070
13010 212070 263619 350804 468248 678631 1021622 1438450 1778293 1832297 1532667 1099143
13000 1099143 715878 473678 354928 283452 224651 176930 152974 129768 117047 94872 72810
12989 72810 54976 33823 10870 26967 59952 77641 101170 131370 130820 93042 72419 76388
12977 76388 58882 24395 19303 21167 6655 6648 -5220 -5060 7442 7461 9834 13791 14505 11637 7274
12962 7274 7711 20025 33148 28928 29062 21233 29493 29656 14475 1245 989 -2736 10718 4090
12948 4090 10931 -909 908 7735 8705 15834 26819 39256 34944 28901 23076 18300 12496 3932
12934 3932 6824 8991 15316 16995 26997 29213 24169 18619 29038 25627 11222 17424 21266 14031
12920 14031 12985 7717 11580 4866 5885 4134 6163 19762 25104 29530 34553 34048 29091 22847
12906 22847 4740 -1295 15290 30315 47740 38806 27372 25861 22042 2985 -5699 4624 14991
12893 14991 4541 -6704 -17076 -7418 9425 4881 -1130 111 6196 13466 12843 6599 18639
12880 18639 23253 17595 -6765 -11423 9757 22885 34357 25567 4662 -15351 -31088 -22041 -26491
12867 -26491 -12440 -18335 -23638 -30923 -27178 -6430 12384 26619 32573 8761 10124 19677 12675
12854 12675 7458 17372 18782 22161 22027 22099 33177 45968 28451 16048 22957 23568 30251 33330
12840 33330 31460 26547 8800 17671 11476 -5049 4413 16999 33438 23067 1080 2971 -7320
12827 -7320 5330 15529 19483 11456 14123 24510 6231 -9008 -8924 9510 23954 29321 17189
12814 17189 16181 10905 10277 12561 34770 44536 46047 40645 28204 19567 8289 4632 14508 4667
12800 4667 -22070 -27407 -22545 4737 12927 15991 11124 6384 4865 4092 -6754 250 4781 3397
12786 3397 -1073 6119 7054 9608 4687 12529 3685 5758 12530 1480 -4786 -18389 -5786 14381
12772 14381 10214 -1272 5564 22124 21277 13756 -6245 6266 11183 8395 18309 32913 24777
12759 24777 17416 7645 6980 19770 25980 23414 20522 32124 37195 30092 26682 20804 16512 14463
12745 14463 14116 12466 16882 28436 20203 10385 4901 -3052 -10582 -26092 -25725 -26211 -27494 -25468 -14157
12730 -14157 2789 9589 14148 9430 15377 16255 13487 5907 3679 -4560 -13058 -21027 -14920 -10258
12716 -10258 3802 6881 15744 27772 24338 23927 33605 26774 17904 595 3020 15788 3043
12703 3043 -5414 3185 15770 27017 25544 18169 3114 -5388 4901 1959 14728 7120 -12150
12690 -12150 -18685 -13635 -20365 -8441 3926 4518 -4767 -2561 2383 -14910 -10959 -8695 -11583 1312
12676 1312 20205 39050 30180 22504 19978 14398 8553 1609 8387 -10219 -22983 -9025 -6712
12663 -6712 -2560 7986 12489 13300 -1425 -6122 4337 6629 2724 3629 6065 4996 -884 -18573
12649 -18573 -23330 -32234 -21708 -11790 -1149 -10635 -14997 -4669 -1880 4131 6028 16096 -5856
12636 -5856 -8289 -7459 -2237 14667 19191 10096 1448 3929 16210 20248 1984 9399 27297 21348
12622 21348 24761 28130 19428 27163 23766 6085 1026 4635 13574 26217 44227 63856 74458
12609 74458 101713 143035 172683 179614 139986 87861 50000 24480 14275 16139 5218 6013
12597 6013 -3004 -14320 -9933 -6014 -8519 73 11547 16666 3485 -7888 -7601 -2447 -4175 -18423
12583 -18423 -3597 12894 24628 19745 21932 12381 8454 3139 8418 7159 -3505 -588 4398
12570 4398 21663 41551 49225 46466 20270 7045 4791 19900 23111 18626 20686 27098 39018
12557 39018 50506 51256 32341 14176 14124 20873 12047 13648 18660 37870 31028 22912 8161 7673
12543 7673 -9204 -18336 -12950 6037 2190 -11008 -17035 -20163 -11232 4592 5606 6804 9294 -422
12529 -422 -1701 -7610 -6676 6166 7335 6154 17904 43830 59408 68692 78395 56414 28327 36049
12515 36049 44080 21119 4493 2797 3064 12317 3916 14994 29665 26026 13963 8998 709
12502 709 -20052 -21654 888 2066 13052 11670 9220 386 2442 -5190 -1107 6599 -1455 4526
12488 4526 30566 28145 33768 58930 73225 64242 66615 62791 60132 82985 95351 111417 130431
12475 130431 195620 270031 333767 353959 320767 267162 195841 128513 92098 81940 58480
12464 58480 40555 41504 47840 41850 24936 21360 28358 26528 18517 22574 33528 26757 13228 12680
12450 12680 14970 17153 29260 29394 42083 57810 66290 72852 73035 78579 105302 127233 145970
12437 145970 143630 134830 124531 140692 162970 168589 161302 139081 123647 143154 162854 194235
12425 194235 226206 265220 273298 253692 230218 208240 175637 121987 96312 107406 117241 127939
12413 127939 144218 136803 132439 132262 122197 114981 106458 121884 124137 109051 103814 99803 78648
12400 78648 53466 46361 32479 42667 59585 53171 48289 56113 40787 24669 25727 22946 9438
12387 9438 15295 14918 21153 28440 40530 43648 58862 74275 89413 107094 142764 194613 251535
12374 251535 313796 349236 346874 292091 213868 152143 99885 70155 54772 40466 25855 16075
12362 16075 19156 10125 3103 8347 6684 2752 14409 1662 -15537 -19902 -6077 9749 16735
12349 16735 10786 -841 5056 16938 32717 31211 17737 -1575 -1703 4214 17315 5693 -16019
12336 -16019 -21925 -7727 -2331 -802 -2885 3484 14409 15524 7521 -4160 922 6361 -7717
12323 -7717 -12225 -1451 -836 -935 3571 17337 30778 22195 21396 41200 52192 71691 68938 65897
12309 65897 64779 75719 108477 144010 197419 293255 417797 522985 518793 396071 234762
12298 234762 132217 109902 103149 76100 46180 30482 39865 42758 44441 33637 24539 31246
12286 31246 26723 12653 15547 23887 42840 39785 24849 18882 32569 61994 79369 96720 143418
12273 143418 202424 210711 169126 123434 81661 44522 12991 -446 -19092 -26728 -3037 10971
12261 10971 16296 3807 -19848 -34033 -14267 -7671 1644 221 -11881 548 11200 9308 -3282
12248 -3282 -2496 5705 11327 29703 24789 28679 40094 55713 60858 71686 112496 162704 227562
12235 227562 239452 191532 121439 81248 80396 78621 56057 35319 19775 17263 14461 20530 32358
12222 32358 14590 11078 21008 17233 14609 7664 -48 5452 -6499 -28481 -29249 -10614 -4018 -2267
12208 -2267 13027 28792 26485 12842 -4628 -11685 -7982 7005 24203 44585 35835 29773 42919
12195 42919 74637 95370 93519 109192 97473 79566 50365 42730 50318 42375 30753 12265
12183 12265 3659 7395 17702 6837 2440 343 5842 10576 16818 20331 17486 8475 -6139 -3319
12169 -3319 2006 20223 18685 10188 1304 -707 8753 33410 33002 29829 29453 32186 62872 83541
12155 83541 64337 67855 80916 126470 217644 285956 335344 342862 282734 183058 112011 68047
12143 68047 35300 37793 50742 57170 52525 26236 2359 -1218 25135 52804 36022 22174
12131 22174 15189 11871 19599 9307 13759 13303 1355 -468 749 14619 18279 20787 10513 2328
12117 2328 3251 8889 21603 28047 30539 28425 40429 50776 66595 101087 157026 237694 310906
12104 310906 339440 289396 217250 145810 108496 70605 35705 29650 41074 33397 25059 22149
12092 22149 -35 -2947 17207 28958 33191 21321 26016 33071 30590 32565 39045 21619 18500
12079 18500 12357 2931 -874 6360 -197 345 9422 7726 13776 1613 4877 6175 -1166 7693
12065 7693 15379 6613 26256 62153 82114 95081 96549 87603 70588 49270 35228 1497 -18236
12052 -18236 -22818 -20941 -14788 -13143 -5325 5440 11822 19739 27130 19936 14420 28406 29178 26928
12038 26928 23305 26260 34584 26323 23096 9338 424 7344 11415 3437 -512 -2185 -3615 -2989
12024 -2989 20983 19012 -5803 -34711 -26331 -24113 -18405 -10971 -17103 -12709 -4928 -131 1809 6216
12010 6216 2260 -9915 -3507 1005 3547 1088 12167 26 -1873 12307 27567 26505 30469
11997 30469 23822 358 -11828 -2230 11409 16732 41724 48400 27937 -243 -10257 -34957
11985 -34957 -42374 -34278 -21299 -10841 -22187 -18930 -15217 -10337 -4295 1631 -8162 -13315 -10706 -9649
11971 -9649 2287 5295 -9473 -1266 -4181 -13233 -5833 -3034 -7864 -2262 -630 -4740 10217 -10554
11957 -10554 -20731 -23739 -20587 -23319 -20507 -2159 7723 -2508 -521 10874 -6308 -35544 -25249
11944 -25249 10154 16847 15023 18975 6588 -6879 23 9932 4694 1971 2627 2515 -4724 -12619
11930 -12619 -20865 -12191 1418 3564 -6876 -12474 -12549 -7282 -11223 -4510 -8518 -13631 -16242 -10767
11916 -10767 -8152 -5272 -22631 -11088 8 13063 4938 -4668 -8765 1719 -4445 -13974 -2605
11903 -2605 1924 -11313 -7771 -3684 11966 6524 -14356 -11109 -8336 10597 7042 -6442 -20463
11890 -20463 -31983 -5679 7732 -2759 -19896 -4844 11436 3919 -2717 -22381 -32259 -40857
11878 -40857 -25582 -11923 -11389 -6790 -3193 9680 13920 7981 11559 22368 20970 15401 -10220
11865 -10220 -20120 -1201 -1116 -1154 -21553 -22937 -26569 -21842 -25042 -23790 -14317 -1053 -8528 -5652 7821
11850 7821 13824 -5970 -5837 -2057 -6907 -15832 -28634 -46172 -51682 -39103 -35672 -30893 -16385 -16814
11836 -16814 -18317 -12937 -6071 10792 20459 26228 24511 25231 18072 14757 17729 12708 7610 2430
11822 2430 -917 -2057 -14497 -16066 -706 -10864 -14259 -890 -2834 -7040 -20276 -27603 -23741
11809 -23741 -20827 -10844 -10767 -9527 -18375 -14910 -5235 3624 -3670 973 2724 9364 27346 25574 7810
11794 7810 -2743 -13115 -18662 -24838 -29435 -31070 -22969 -5398 -11713 -9055 -4851 550 9070 9849
11780 9849 1141 -1043 345 7969 21168 39490 52852 46216 24301 2259 -9734 -3001 7650
11767 7650 25553 33858 24285 17923 -4706 -18206 -18327 -15483 -21964 -26178 -14833 -27506 -11378
11754 -11378 -5376 -11555 -13039 -295 3585 -3325 -19167 -18788 -10686 -6299 5167 14511 22785 17615
11740 17615 15725 8461 8832 869 5599 12964 3659 -1444 -5459 3363 4570 6144 17331 9200
11726 9200 10741 5433 537 -16426 -22992 -20680 -18684 -7372 -10092 -2395 14768 20287 21958 5596
11712 5596 -19777 -25473 -15133 7257 13756 9806 5450 -4094 10741 11349 -4265 -11905 -5195 9427
11698 9427 28416 35717 23452 10102 12630 10740 -1887 -4797 -14517 -29346 -24537 -12216 8423
11685 8423 17862 31026 15072 -8561 -21669 -26969 -19351 -4396 1558 6554 4675 -3424 -12612
11672 -12612 -15099 -7941 -11324 -18176 -12305 -4772 -3330 -2392 -561 -10466 -18788 -20984 -4513 21227
11658 21227 21745 34331 23818 6098 -12275 -27094 -29623 -20256 -24542 -10535 4264 -230 5039
11645 5039 -11779 -34979 -42819 -34320 -25465 -23842 -19799 -18655 -24197 -19005 3372 16002 25252 20544
11631 20544 7909 172 2786 6497 5122 4415 19716 12864 -3835 -17253 -12027 -16494 -15109 -540
11617 -540 -4460 7568 4835 -13466 -12206 -11674 -13356 -21606 -16267 -6638 -4459 -4857 -8047 -698 -4429
11602 -4429 -2697 -3101 -3884 15730 34363 19546 5883 11135 8279 20521 9886 14614 29158
11589 29158 8320 -8996 -10254 -16006 -7035 -16683 -39086 -21322 -12318 -9754 -482 -4727 -17902
11576 -17902 -11067 -82 -11740 -8806 -864 -7147 -15676 -16007 -13112 2891 17088 27533 45324
11563 45324 30841 20149 19280 -1361 3624 5868 653 -1565 -8421 -11542 -7025 7314 16322 28050
11549 28050 33630 22967 13768 3456 -8777 -20019 -27958 -5588 339 -3273 -26048 -21420 -1193
11536 -1193 5812 4024 7657 12384 32171 21065 -4964 -24532 -15162 284 -1059 -3577 -10752
11523 -10752 10518 919 -11683 36 4756 -3598 2386 2883 2430 15894 9805 15623 4513 9974
11509 9974 2314 -8215 -7340 -16860 -14331 -6291 879 -14079 -16070 -2276 1574 10342 -2337 2634
11495 2634 4519 3208 13853 2239 7639 3634 -2255 11184 -2455 -11214 -18569 -7176 11868
11482 11868 14543 8363 24953 26170 27964 14291 1060 14430 18608 17523 27678 45940 71661
11469 71661 91205 92402 88184 114489 155237 184416 204767 226811 241323 245307 253304 291681
11457 291681 338297 347116 337362 314254 294109 289636 256752 223612 218583 223946 238491 266593
11445 266593 305678 321213 322463 307499 278132 251659 214883 193080 176952 178806 160047 110433
11433 110433 69728 43975 31145 36511 37078 38424 33438 41701 26831 17900 10313 -4738 -5517
11420 -5517 -549 9259 4402 7441 12924 10096 8304 13290 25152 36315 41997 50479 55746 41301
11406 41301 29928 25599 27256 37688 34847 41529 52924 42490 33971 35785 41105 39600 47056
11393 47056 49582 52432 40478 39940 39278 32978 37996 28604 24836 21199 13953 36528 62954 86174
11379 86174 111569 151678 217566 285080 312471 291969 239933 181499 140667 119390 102330 86736
11367 86736 79120 65578 40632 30690 43461 37728 16736 2752 6871 17791 30052 30406 42206
11354 42206 43113 40975 34227 28929 23199 28871 35536 29962 27245 24101 41074 26726 20096 25588
11340 25588 14672 -6605 -16682 -13727 -17815 -10201 -2282 -2851 13580 15485 5360 19813 21395
11327 21395 14916 448 -18709 -13552 -5242 1753 13534 796 -14205 -18127 -5718 15995 5195
11314 5195 -22292 -19959 262 8836 755 -5454 -14508 3236 15072 14971 7617 8950 13657 14946
11300 14946 22711 6311 -4846 -5199 14471 17950 13841 -7407 -3638 5734 27621 21846 3495
11287 3495 -12214 -17586 -16253 -11699 7983 24559 24652 18815 15276 12513 14088 15412 6251 -5753
11273 -5753 -3961 -4346 3049 -6879 -337 6916 12740 16491 19372 8448 5563 14429 28215 19294
11259 19294 3315 4760 21089 31738 11386 13723 17208 16587 4388 -5943 7470 2877 -5953
11246 -5953 -9633 -1716 864 17366 28482 14581 6861 1966 -18696 -25126 -27492 -16201 -22205
11233 -22205 -16955 -2837 702 -16890 -21864 -15443 -18447 -5324 -4441 -5094 11777 10173 2050 -8182
11219 -8182 -6493 3324 -5725 6964 3727 -2954 8459 11953 20428 28329 22302 16185 7996 10236
11205 10236 4445 7519 30815 32081 17698 2924 -8195 -47 10290 7914 9538 -4617 -12199
11192 -12199 4510 4229 -15794 -15716 -4490 -8775 -9534 -8446 -10255 -9191 -3159 2759 -6706 -2838 8477
11177 8477 -4152 -6108 -13695 -9590 -15007 -23806 -30410 -16531 -11734 -18763 -17591 -3147 -7194 5927
11163 5927 26065 20579 -998 2800 -9470 264 18057 16820 19927 13655 13714 32943 47170 37556
11149 37556 43047 47485 45556 52936 48354 55828 89788 147564 208402 242971 205976 148677 94886
11136 94886 61187 41180 28242 29764 22791 32292 17111 11890 10122 -2235 -14192 -6208 -1833
11123 -1833 1557 23377 28175 34874 29095 27680 32269 19176 12887 10241 8543 14350 19177 33551
11109 33551 29323 33990 35495 23803 13068 8675 8803 6968 4208 -16095 1081 24323 32844
11096 32844 29190 33087 16401 4018 11416 16879 9556 3634 -1448 17027 18398 22690 24686 21621
11082 21621 25815 22259 17019 12757 18162 9336 -7003 -14697 -14430 1515 6881 1109 -18496 -3992
11068 -3992 18862 15030 4274 -2544 4437 13018 32592 52647 69524 72341 81060 110316 108786
11055 108786 97301 97466 99934 104836 115747 108423 104329 101788 95075 81486 60504 48886 47498
11042 47498 44701 38957 32778 49093 50725 37899 41645 49446 49260 42537 34683 40410 46328 28577
11028 28577 29343 19273 16924 10453 4598 13629 7861 23272 34313 40749 37840 41910 32737 51669
11014 51669 69826 86779 98980 110044 114335 103570 132747 174407 192517 203554 199039 185706
11002 185706 173702 140534 127366 130473 131814 134246 116391 108929 96912 82686 65035 51556
10990 51556 41485 42557 52408 54748 54224 32621 23482 25972 40700 21216 17845 11493 13447 25620
10976 25620 38477 39180 32800 25170 7328 2823 4959 -1178 8349 16794 34029 36570 43268 62532
10962 62532 60765 66338 85153 105705 123554 128362 129559 130758 136151 141444 132393 106649 87663
10949 87663 61278 37328 10922 -6311 16403 31913 25247 15478 22295 18964 14802 -9067 1872
10936 1872 15470 12404 12633 15773 1016 -6281 -10179 8367 25476 20522 -2754 -4187 -7813 -4349
10922 -4349 1434 -3742 -3055 -14992 -23789 -17586 -9112 -12178 -18257 61 14326 2034 -2070 -1012
10908 -1012 -4641 -8393 -12938 -8648 -14997 -14170 -17627 -18231 -3509 -10142 -25630 -31936 -25920 369
10894 369 3656 -11073 -3286 -15000 -16485 -32894 -36500 -24953 -24826 -24143 -13621 13101 21334 17345
10880 17345 4903 -11973 -9525 -15025 -1428 6567 -11408 -18668 -12739 -19028 -2343 16360 27240
10867 27240 23752 16506 14899 -4785 -3209 13465 7605 -15448 -21406 -26629 -24664 -14743 -5192 1837
10853 1837 7806 12663 19987 18340 16966 -2945 2884 8693 1564 -3815 -8766 -22960 -29585 -35763
10839 -35763 -30133 -24724 -17600 -16798 -6691 -10595 -7067 -3988 2467 15347 20293 10184 15529 10738
10825 10738 -4185 -9335 -10682 -3591 -11564 -22055 -20819 -15007 -3402 -5188 -5943 9049 4459 -9115
10811 -9115 -18792 -5639 138 7245 15460 6287 1810 6390 17407 11629 -5626 -9035 2300 24084
10797 24084 28347 18788 3337 2777 -1091 -5233 5675 10155 12229 13346 19515 29737 26078 7957
10783 7957 3501 11236 9716 5800 3017 1685 -1902 -10618 -24428 -23801 -28409 -31062 -9250 14074
10769 14074 13493 1242 213 385 8658 3554 5046 22437 23723 27269 40553 15239 -10444 -11519
10755 -11519 -12954 981 12736 -1341 -11874 1364 -4467 -4495 16180 33100 23899 17782 13653
10742 13653 1465 -9852 -4032 -9463 1308 7576 13990 10173 -6429 -7240 -13127 -23180 -21378
10729 -21378 -34999 -35358 -23260 -18757 1052 9142 6261 -8233 -23189 -15634 -4124 3245 1312
10716 1312 -5762 -9039 -22038 -9300 1218 4547 -1822 -4498 -6719 -5629 -13097 -4321 7960 -63
10702 -63 -7818 -16328 -39298 -39999 -21277 -18149 -13186 -6304 -8545 -10869 -8833 -17310 -16854 -17357 1895
10687 1895 19545 284 -14204 -10447 -17046 -27267 -23645 -9168 -2722 7068 -7125 -11520 -731
10674 -731 14986 4312 4048 13132 -2805 2844 1496 -21085 -29480 -33622 -28931 -31582 -16122 -7075
10660 -7075 6305 9993 11385 4390 -8419 -2723 10106 6839 6646 21914 3790 -3643 -5562 -7942
10646 -7942 -4346 -4344 20372 16970 1000 -20895 -23386 -9189 4214 -1468 3001 16009 5737 -4018
10632 -4018 5729 10977 25424 31173 6493 -13835 -25875 -14886 -9376 -6083 3968 -7388 -18063
10619 -18063 -13625 -18018 4203 21014 20976 14737 8178 2589 11167 6953 5312 26197 38961 28171
10605 28171 17050 6095 -2400 3395 7775 575 2595 1705 -18603 -18066 -345 19315 7871
10592 7871 16071 10703 3118 -12549 288 19646 27852 19506 2919 -7062 -13824 -12240 7897
10579 7897 -8402 -13953 -9434 -12677 -13099 -19167 -22544 -36731 -22836 -12280 -12709 -15150 -5216 835
10565 835 -924 -1329 -6891 -15180 -21131 -4301 -5316 5123 19860 6618 11745 28173 31574 24570
10551 24570 16866 23743 11524 4774 5685 20065 28689 18214 20407 25558 24169 14911 7251 -2843
10537 -2843 -6241 4230 5223 5519 14875 26100 32505 30146 11284 1043 -13180 -25305 -20181 -12278
10523 -12278 -3709 -985 -336 -23614 -27887 -4778 -7048 -26024 -24876 -29452 -12788 10919 4253
10510 4253 10855 7566 -9727 -8309 -25211 -17418 -6331 -6873 2521 4641 20983 16615 25639 34631
10496 34631 28796 -4466 -1714 3432 -4985 -9651 -16960 -15709 -6658 -3751 9231 15030 16494 5565
10482 5565 -1018 31 754 11352 16678 155 -21770 -21143 4740 18850 23566 23224 6195 5385
10468 5385 8687 1976 -2381 2760 9845 5629 3278 4084 23229 12553 -3654 4536 7903 -2302
10454 -2302 -18006 -35682 -58792 -42945 -37863 -24289 -4077 -12920 -25411 -24196 -9306 -253 15799
10441 15799 20731 13842 18324 26745 29733 30641 23719 12360 7859 16235 23042 7288 5912 -1999
10427 -1999 -15434 -14277 4503 13243 5794 -5776 -11348 -18583 -17217 -12463 7380 15156 34726
10414 34726 47792 47093 27534 14762 8840 20170 13105 -2660 -1726 4554 1622 -6581 -12101 -16455
10400 -16455 -18994 -25459 -29768 -25867 -9357 -16733 -6650 7849 1237 -7335 -1541 7509 15832 16659
10386 16659 10551 -737 3928 7733 7275 -10656 -16182 -13673 -8001 3842 14266 3538 -8879
10373 -8879 -14304 -3866 -3263 11645 8283 13994 3958 -8805 -10565 -8437 -24475 -29511 -32151 -21267
10359 -21267 -6158 5458 4560 13003 8920 17969 22936 24348 28226 22889 20645 35199 32426 25063
10345 25063 27261 18211 17412 20289 17427 1859 -5944 2630 15582 11243 5046 1624 7721 -4993
10331 -4993 -3878 1307 15044 41954 42383 40079 49808 69475 87479 105058 111489 109139 136247
10318 136247 179454 254871 370322 483086 575094 562253 483622 403010 385871 417353 477306
10307 477306 533703 503920 381621 256774 175318 125939 83767 72196 79285 84371 73391
10296 73391 74949 63251 48719 40478 30683 27788 18968 11683 5211 3300 10237 13291 11205 6465
10282 6465 -6507 371 15819 18184 28709 13492 7875 -8682 -7606 3165 -11309 -12704 -12238
10269 -12238 1819 11584 6173 -14929 -16351 3177 19798 32388 28005 40018 42302 22443 3174
10256 3174 9832 -2699 5082 10333 10638 3650 8929 5701 27660 34100 26548 18485 33469 24023
10242 24023 25477 25347 18792 6922 -8585 -5288 -6552 13512 29132 29629 29463 25475 18628 2920
10228 2920 -7710 5762 -4454 -12940 1303 -8604 -23367 -20681 -24735 -34153 -30001 -31920 -24017
10215 -24017 -19132 -16110 -5873 -6493 -10636 -10764 688 23306 41349 45871 34842 30853 11991
10202 11991 23020 20067 14409 14490 13153 32666 42417 45169 30516 28275 21666 16786 2143 -18220
10188 -18220 -6796 -10079 -7226 5630 15164 10129 8978 13624 7656 6924 -11001 -8987 -16393 -5519
10174 -5519 9670 18913 13670 18700 15614 4306 -10690 -23660 -24886 -22163 -17384 -15975 -26001
10161 -26001 -29144 -27510 -18720 -1868 -8971 -22569 -21713 -27824 -24690 -10721 -7387 5658 2505 4344
10147 4344 11067 13728 20597 31617 30903 18449 21864 18691 17855 16115 6209 -3902 -27210 -42303
10133 -42303 -39596 -40869 -44405 -42332 -28282 -14574 6231 10997 4059 -5634 -14413 -8033 5661
10120 5661 1727 -2882 -2143 -6795 -16025 -13080 -8341 -10727 -21080 -27521 -25174 -19758 -40920 -35286
10106 -35286 -14951 -14398 -21784 -9783 -6072 6807 -10436 -21103 -4269 24093 34137 22309
10094 22309 14085 10751 7787 2127 -8044 -4103 6497 13770 8798 -18865 -25578 -19912 -20755 -26634
10080 -26634 -9471 1151 -12365 -10598 4554 17720 32102 29308 19211 18495 18551 11248 12933
10067 12933 20685 131 111 -12766 -12988 -10170 -15733 -16058 -19427 -15448 10575 16252 21844 24105 10751
10052 10751 1368 -2081 418 5497 8736 14969 26618 36315 40718 30328 20719 25117 14652 4935
10038 4935 -394 -6121 -8348 -4541 6290 3882 9231 18868 25860 13568 22140 18074 7329 15231
10024 15231 11888 10236 20759 8009 -1002 -17508 -25078 -24073 -20659 -17072 -166 5537 3578
10011 3578 846 10038 5878 19893 23099 8252 9975 24202 29382 23661 -1812 -21117 -26934
9998 -26934 -26428 -20647 1945 1619 10051 14643 17493 28778 29723 27772 17596 10016 5975 11769 23431
9983 23431 27117 20893 23855 34930 25792 24479 18793 9635 13894 5966 -8955 -1704 -4883 8813
9969 8813 8277 -16637 -2773 3335 -2749 2795 17191 28285 13680 -1392 -5888 578 7360 -6194
9955 -6194 -17422 -8658 -16240 -38450 -24137 4846 17486 20001 18579 11133 8665 11680 16400 23160
9941 23160 7616 13875 41044 46172 34695 39707 62556 89540 115626 111662 76751 48270 38863
9928 38863 23017 23741 25372 15992 6825 5399 -5924 -10813 2436 16522 16412 24566 23536 16839
9914 16839 19586 36339 30592 18268 38962 46951 52808 60163 55494 36899 39077 45657 71497
9901 71497 95510 98405 82936 77397 83596 71702 82307 101166 111327 96363 82622 80414 98353
9888 98353 98554 112374 118437 115103 96319 89863 97802 93799 80858 75397 66005 46866 60232 67958
9874 67958 69974 45685 52113 61332 61595 59236 58686 51954 60711 54757 61962 53360 65846 66745 49567
9859 49567 48210 61783 71015 87629 108935 119995 127016 95382 73640 54357 60641 67062 55856
9846 55856 60744 53291 42524 53648 72145 126183 166141 204724 224541 236856 245480 256160
9834 256160 250558 230360 198350 152309 96425 80046 73657 38956 36470 27344 19023 32501 51749
9821 51749 38680 43175 49496 64101 84596 112862 126895 118517 91380 52716 24462 20413 35127
9808 35127 41746 44684 46680 55608 68132 65003 48306 38297 37961 30677 31708 48031 64274 80443
9794 80443 83337 93504 103886 100267 116261 146363 164834 179967 197820 186774 136192 107131
9782 107131 93607 62632 57318 75172 86760 88819 80381 82367 92875 96135 85949 74825 52053
9769 52053 49113 30497 12676 -4014 -5150 -7201 5825 11521 -5348 -12501 12715 29783 20672
9756 20672 19472 32166 17854 -3600 -17028 -8976 -20527 -15412 2936 1272 20845 28423 22282
9743 22282 34742 62073 60328 38195 47241 68900 70095 61261 51100 37803 38284 22562 19927
9730 19927 16168 8530 20358 27452 36943 35004 39159 49718 43089 32165 32318 24913 30804 32810
9716 32810 19541 2671 4080 1102 19706 32910 43187 36686 19606 36511 40289 21032 10141
9703 10141 1331 -13207 -30879 -34702 -52118 -46855 -44112 -47213 -49973 -22443 -6702 -4439 -5016 -2649
9689 -2649 -5009 4435 9279 11571 15730 11206 3106 18049 2572 -8633 -13568 2997 15841 16878
9675 16878 9547 13022 4963 6933 5070 7647 10289 6255 4305 -7405 7195 21362 11101 -6562
9661 -6562 -8263 4798 26441 32307 19115 16731 20424 20146 27069 32410 46779 51550 53580 57938
9647 57938 49787 35092 37549 17996 3308 2690 -4912 -5646 -5683 -12837 -962 1373 -643 -3701 5863
9632 5863 294 -15081 -12271 -6815 5708 15661 19121 17123 15309 19730 20991 32938 33633 42575
9618 42575 14356 1316 10981 12092 27731 20287 14744 25140 29694 27997 28602 15464 97
9605 97 10151 22391 6407 -10582 -10460 -6701 6809 23980 25585 24545 15467 5547 12886 22626
9591 22626 42765 31929 30602 17520 6986 10700 26785 43958 51744 40583 38598 29112 9897
9578 9897 3944 16300 27593 39648 43457 39116 34293 27935 32938 44783 54178 46897 33911 30879
9564 30879 27500 19675 10503 13098 22447 34990 42558 44123 31962 25957 31483 25247 10616 13434
9550 13434 19734 21236 17146 19768 23628 7231 10768 9338 3705 10518 11804 -1288 -631 -2497
9536 -2497 2680 9122 11122 23771 24819 9754 2068 15109 29031 28367 23612 25689 36805 44423
9522 44423 45430 59473 53803 32156 16071 15436 28570 33431 18837 25274 35464 45680 38389
9509 38389 38996 29554 24599 25474 29230 44999 49412 31934 3911 2916 16333 24089 26722 29554
9495 29554 40946 42177 43376 44245 62546 68919 77366 73665 50433 39868 35943 33191 12674 -3846
9481 -3846 -4830 3841 23175 23153 18831 43123 56917 38155 30544 22921 19288 27589 28174 19210 22793
9466 22793 42582 51784 56110 33071 4712 -964 4034 6029 10790 24112 40543 53594 56717
9453 56717 59443 53210 58904 79454 104469 102848 108326 119420 117048 127302 128514 109909 86677
9440 86677 83091 99947 112772 107817 85669 76981 78540 76527 74260 64047 66682 68818 55307
9427 55307 54303 43323 32482 31750 30495 31325 48296 45038 48127 34150 8820 10295 26357 22867
9413 22867 21133 36866 28433 20974 17526 19164 34012 48095 68927 92164 95580 85417 78105
9400 78105 71254 72258 95416 101920 102155 117301 118638 122090 123165 118488 112488 105031 98682 92546
9386 92546 75188 66784 66811 44604 37287 43017 57140 65872 75542 101586 102660 85696 62229 52229
9372 52229 29409 38777 69108 59360 44279 46526 69577 77924 67479 56315 46253 33385 31831
9359 31831 42671 67748 79911 86211 94535 93285 99529 77353 58846 62114 87434 113502 115663
9346 115663 110538 118170 113751 104109 84885 77058 81512 83812 91679 89865 71158 43680 35719 39562
9332 39562 55974 57802 42359 34658 52519 60318 50279 44997 46484 46463 48162 45149 38424 38196
9318 38196 29337 23316 24830 24697 29133 37704 44372 53013 44326 51827 54027 34008 20472 25154
9304 25154 22874 20699 18957 23055 27415 31248 29127 37883 53173 72126 65413 68091 61410 39700
9290 39700 34081 41961 48009 57079 61846 52605 38783 36381 45894 54314 57492 35895 24247 26093
9276 26093 35247 39427 44035 40975 39879 48505 42563 48516 52366 43136 31808 39381 41917 29282
9262 29282 27642 26711 38752 32415 19984 26650 24904 33859 48779 49856 44731 14894 17053 34667
9248 34667 56234 64751 54855 45735 39414 44361 47483 45292 22990 18396 14741 12789 26390 38537
9234 38537 56896 58094 53651 30415 35225 46248 51598 68245 47135 40905 50329 51391 58162
9221 58162 63881 54994 61822 61328 52997 58730 56035 54314 63867 68619 49347 34604 32775 25937
9207 25937 34692 35051 29903 41871 39549 41218 71661 79101 67562 52704 62978 80705 95557
9194 95557 94487 71929 47716 46119 45635 56412 46044 38972 55823 50557 40488 40522 51387 50870
9180 50870 55227 70010 69661 67857 68671 64043 69735 88477 113721 117077 115852 122133 122761 104865
9166 104865 101444 87918 71795 68042 79495 79341 74724 64916 62143 69646 80682 80076 93509 87929
9152 87929 81347 82986 87701 74596 70058 79006 93657 87706 93496 102860 102448 92362 73523 70812
9138 70812 68439 79947 86870 91185 86650 104034 110761 96921 100307 114511 129155 148022 170395
9125 170395 185515 209964 246909 275647 277989 257307 241563 214999 196364 198397 185260 161799
9113 161799 171705 181203 180015 184503 201949 217968 226116 230160 217950 217336 211096 212323 233220 250965
9099 250965 274952 286222 301086 317311 328929 363536 411866 456241 500176 534878 590927 663625
9087 663625 725068 820068 949644 1079642 1196350 1330791 1533447 1780234 2067120 2395494
9077 2395494 2779272 3219086 3664888 4072082 4385915 4489009 4360449 4014711 3552457 3074176
9067 3074176 2612052 2200134 1859611 1593926 1383989 1222322 1073046 944503 833924 739134
9057 739134 655711 581115 527451 483260 439454 428800 415368 382511 350641 317693 300750 293971
9045 293971 292444 286003 284109 282437 270197 263743 250672 251963 252102 254840 274646 301979 315532
9032 315532 326438 327658 335616 370072 393590 393134 390035 359507 325767 306565 291061 287390 270890
9019 270890 250112 241326 239341 239441 231861 240387 238520 229183 220497 210680 199495 181609 158401 149911
9005 149911 154676 152891 150404 135953 145395 145338 143681 145903 153498 152572 147258 147088 155115 154771 141997
8990 141997 131709 137615 149695 143389 155361 181452 213275 239869 233140 240160 250716 252346 256521
8977 256521 235762 203330 195516 177285 166760 154512 151911 147706 155008 168208 185811 195301 185903
8964 185903 165567 153447 146990 136368 119321 108961 91487 82114 76090 88672 98955 89978
8952 89978 68108 62542 53350 77432 91295 100840 96363 85194 76367 74699 76911 82408 77776 76513
8938 76513 96082 91676 94115 94542 100878 104280 95442 87732 84518 75575 75837 76753 87803 98916 119839
8923 119839 126074 126656 124288 116934 111870 109084 86920 71266 59882 59975 63017 62851 55876 44782
8909 44782 51714 73851 83836 82837 86583 74643 63311 53944 40563 39952 33853 21416 29413 40802
8895 40802 36563 36943 34833 21099 10965 2545 5469 4547 3249 13124 21030 22182 22215 26843 43985
8880 43985 51393 44915 38531 38950 33361 35294 40818 46788 47800 50066 60252 38045 19140 17308
8866 17308 26481 32284 28092 22480 25268 39425 40120 46912 56498 45369 32659 31024 40650 33544
8852 33544 12100 3549 11639 1820 -4616 -5496 -4348 -6292 -724 -2250 -2512 16812 20932 13532 17343
8837 17343 26894 33551 23284 34117 45049 47999 64271 58980 42166 30542 29322 32459 21123
8824 21123 -2449 -14387 -6355 21227 30262 23055 12999 12761 -3583 -1313 14412 15495 11431
8811 11431 13214 22233 41021 43463 38427 26745 34596 31283 32114 49926 50185 42576 29902 28153
8797 28153 30836 32330 11786 21042 19546 21720 34909 38940 40517 38853 27201 16324 16723 32858
8783 32858 35532 27530 20368 24389 22421 14976 11925 14860 20635 34826 35853 29284 37452 38075 39301
8768 39301 48751 37842 41588 31027 40987 40468 31055 32577 33443 41122 37969 32578 25690 13561
8754 13561 15868 22066 23444 13453 -3752 4307 11918 18930 28936 44443 43952 30468 26981 34753
8740 34753 48237 39616 24164 19047 20366 31261 51583 70033 93513 102351 81269 72272 72646
8727 72646 64026 60936 53389 66364 63475 50657 45805 54803 59123 68118 73944 71610 48366 52001
8713 52001 68706 70379 76858 67517 39869 48889 55988 48808 55293 84975 90768 87327 101383 121685
8699 121685 124462 120366 109975 120117 140571 144497 137609 131088 127820 114620 127898 149824 157194
8686 157194 154446 149569 143805 126791 137053 145650 148133 134510 125212 128947 138854 127087 126839 139860
8672 139860 142449 133972 142238 153867 152899 151910 162197 189110 205314 200731 207668 221255 235183
8659 235183 231488 229821 216067 218958 226713 244141 260188 251795 256451 266749 285219 285078 288383
8646 288383 309284 326450 354797 365283 369786 388506 427549 474283 513453 550396 595501 628174
8634 628174 657601 693305 718794 740742 763200 791018 832325 853153 853120 834299 816898 806772
8622 806772 806057 774172 741257 700272 668086 638438 600987 586227 579484 551231 532177 527734
8610 527734 525250 516181 522306 511756 500075 498193 504532 481439 432296 397504 368265 325230 300822
8597 300822 288573 265400 238194 215940 190929 176494 169069 157621 152905 155860 149315 152130 139176
8584 139176 125144 140602 149677 178761 215515 275873 368381 434918 406002 331801 237612 179187
8572 179187 153041 160672 140336 131166 132847 129417 129272 105674 79356 87119 88492 80446 62576
8559 62576 50863 38898 31146 44087 44072 44291 49497 40872 38171 57070 54649 74010 84279 73047
8545 73047 43760 53444 62082 71664 88811 100849 112083 132933 188317 251549 347862 516028
8533 516028 682254 709311 574777 399505 253806 181435 120300 84914 71470 62060 54496
8522 54496 47852 43484 43254 45448 55285 56678 60961 55344 44513 39136 46990 39972 40528 43023 39838
8507 39838 53288 54762 31697 27190 39095 45555 37660 22120 20759 42726 48420 55927 40365
8494 40365 43749 53804 101525 141898 203191 285293 340650 293717 219604 154608 109131 69008
8482 69008 38915 21242 34114 40425 35783 40012 24098 23820 25422 6571 -9619 5198 19748
8469 19748 22832 28128 24940 14296 -103 4215 16426 23704 46898 51205 52212 44507 38375 27858
8455 27858 28538 21658 19162 16637 1772 -2917 7953 14929 4595 6881 4875 -1164 19915 17641
8441 17641 6806 2411 11776 19470 13962 19289 16138 10946 25518 28365 21021 31544 46228 37780
8427 37780 22686 8527 15397 20727 21216 16423 17603 32495 48090 45195 28597 7223 3064
8414 3064 -5441 -19568 -6094 -11151 -8585 2000 11759 28058 15334 523 350 14296 21193
8401 21193 5406 -6157 -20287 -28937 -37199 -38183 -17488 210 -112 1769 14294 13454 -15158 -28957
8387 -28957 -19965 -1912 11948 5431 1005 -2273 4293 16643 9496 12610 10141 -1994 -2127 -3945
8373 -3945 -18039 -8593 2165 -5662 -5895 1815 16321 17252 3147 -15746 -18656 -5109 12930 12166
8359 12166 23873 24477 30047 24465 31551 18921 2394 -12402 -7494 10587 21930 15356 3564
8346 3564 17276 2826 4415 6308 -3088 -3130 -18980 -21240 -19207 -30022 -27808 -15885 -14793 -31729
8332 -31729 -41702 -38850 -29908 -19075 -1861 15074 11952 7960 12276 39179 43191 35270 47561
8319 47561 50192 26948 20101 8984 4190 7806 2221 3649 2210 2213 10722 5953 12660 27222 15979
8304 15979 5511 10361 -110 -2707 23689 15091 3697 2319 6077 12859 19720 19493 28451 27956
8290 27956 21110 12102 3514 10915 19701 25845 32968 20796 14307 3584 3942 4548 3437 20670
8276 20670 29267 36053 57228 44207 47031 63359 59145 51729 52554 65906 75508 83437 86673 101536
8262 101536 120414 149783 183523 202606 246176 287042 347762 434364 531065 607120 664560 698642
8250 698642 701939 628899 537870 442526 335782 242405 164403 112029 87559 61199 53831 49878
8238 49878 45777 41966 50663 55837 59187 56069 55765 50971 47755 59595 70144 72861 70381 56869
8224 56869 69316 80931 86808 94989 99513 111906 118539 134143 156034 193015 248080 312804 394922
8211 394922 506314 648935 802935 937183 1035731 1145543 1252496 1308326 1257481 1060469
8201 1060469 794276 566269 397733 292552 208762 159077 142057 127584 86137 81567 89427
8190 89427 101686 107964 106917 102388 88285 80312 75161 69580 77731 95044 91181 102797 102621 133188
8176 133188 146227 155361 161710 143958 131860 127447 122017 136994 173046 217119 244637 261080
8164 261080 298115 350195 409680 465987 511598 547304 563614 555896 500950 431392 356303 268430
8152 268430 208767 162770 138386 112546 97792 88551 70421 57559 50607 82489 93283 97448
8140 97448 109401 106491 95313 98271 97292 97209 93656 115972 140254 156457 151870 134103 118034 114224
8126 114224 101759 65647 44774 59107 65102 63490 66252 60909 64093 63482 65191 60880 58326 49943
8112 49943 39108 42213 39197 38441 38227 41194 46846 49871 46434 36145 32757 34912 39114 39387 42797
8097 42797 53619 50588 37790 36059 44285 55488 58404 55761 67248 82403 70265 77822 90343
8084 90343 90827 98091 89574 72764 71155 88198 82735 60698 68183 85287 87496 100305 128012
8071 128012 120635 122687 125324 135522 153694 162512 178842 189406 195052 242565 274822 287618 293253
8058 293253 305626 298848 305885 319178 311196 296011 279886 278697 256354 262971 276430 272893 269881
8045 269881 271231 271391 256022 250518 228963 223163 216426 207044 204397 219383 223507 219639 217571 225997
8031 225997 232128 235662 258170 281331 291645 301860 312326 333776 377683 408270 471972 563040
8019 563040 684976 870322 1070684 1154814 1055714 880294 703628 564927 470654 410837
8009 410837 371741 327053 282745 263197 227706 184371 175441 172709 162440 178756 172582 157669
7997 157669 150769 138582 137742 138668 136155 140694 133832 131460 146806 146429 136247 144588 156216 154536
7983 154536 163665 161792 158364 179207 191995 215250 243317 264236 303786 344312 372405 378405
7971 378405 337812 295451 266987 228121 194478 173744 170867 154456 142696 141764 114261 95156
7959 95156 75315 53798 46149 67881 85133 67077 49154 44092 40832 38137 31188 28492 38850
7946 38850 58025 59098 35804 9609 12348 5283 11991 17864 -8587 -7107 1795 6580 8309 15763
7932 15763 30935 32910 27225 31541 23837 6516 15520 16357 8370 17772 7537 5164 24463 12245
7918 12245 -1287 4259 14014 13849 12660 1995 10202 8050 508 7048 13663 17300 6322 11783
7904 11783 11281 13933 5612 21374 22561 27937 28087 13877 -1973 -44 -1913 -6401 -4301 -3904 -1136
7889 -1136 -1302 4 -7305 -19067 -786 12627 8819 13334 5311 -19032 -22990 -9819 -3698 -22240
7875 -22240 -24716 -23890 -16700 -18691 -32325 -25961 -18588 -19069 -17496 -3306 6105 12242 8937 -1988
7861 -1988 -1893 2023 10387 15256 17932 15694 14622 8217 10718 7821 6290 -1682 -4771 12989 27796
7846 27796 32898 31467 24313 18124 9064 4260 2714 -5719 168 4849 -9804 -23970 -19743 -13067
7832 -13067 5732 13947 4571 14409 17053 -1378 -9167 -7736 -7375 9975 7294 3648 -9081 -7209
7818 -7209 -13619 -5540 -11014 9646 17072 -5243 -15920 11109 12594 4858 -3775 -4114 -3039 -1609
7804 -1609 -2879 -910 -2536 69 16474 11663 -1015 -23307 -32833 -25289 -8651 -3448 -11819 -4321
7790 -4321 1896 4390 7681 10363 -3540 -23402 -16748 -21202 -16792 -5957 -7727 -1658 -3330 6230
7776 6230 8922 6398 3533 4129 4248 4497 -15852 -20854 -8734 -8828 -15197 -18495 -20561 -6808 -4163
7761 -4163 -4061 -7045 -15490 -17095 -277 -10037 -11908 -3790 -56 8055 14692 17646 21882 8032 -19716
7746 -19716 -18418 -17516 -15855 -18753 -16846 -7019 -19082 -26831 -3373 -303 -4083 193 -3820 -3166 -7333
7731 -7333 -10569 -12159 -13193 -24632 -21670 -8241 -1726 532 2120 257 18785 28861 22294 11448
7717 11448 17552 4984 -7193 -13944 -22516 -32126 -29560 -28750 -28940 -29606 -37282 -28524 -8207 -4740 -10860
7702 -10860 -25308 -23381 -12171 -9449 -15065 -25119 -37775 -17237 2005 -5318 -13908 -6838 -1759
7689 -1759 -15299 -12195 -11734 -19045 -18745 -20869 -10346 -6999 -1304 -18103 -17554 -18181 -22023 -18308 -11235
7674 -11235 -14547 1348 9651 -10341 -8705 -2582 6137 7291 -12542 -16904 -14371 -17093 -17811 -16382
7660 -16382 -8782 -9640 -11664 -22889 -21262 1168 1822 -14204 -5740 13227 1252 -5077 1761 3063
7646 3063 -9042 -16249 -17042 -36826 -41694 -23628 -12469 -3903 3376 -2475 -8453 -1397 -16640 -25449
7632 -25449 -3872 20812 23484 6140 -9481 -7211 -4145 -3998 -204 12370 5902 11316 9481 124
7618 124 5328 7485 10120 614 -15679 -3005 -12649 -11509 -14635 -9268 3339 -3951 -7989 -10628
7604 -10628 -9551 -17153 -24055 -35524 -25211 -24923 -17802 4001 5505 2143 7212 9873 18863 8583
7590 8583 634 7569 6157 -168 11745 24791 17151 17129 20835 20690 21154 1950 -15139 -10423 -2387
7575 -2387 -3553 7257 20793 6221 -2703 -11651 -9069 -27945 -17185 -1824 5301 -10995 -18941
7562 -18941 -4763 -4918 -653 -13762 -18247 -19672 -27962 -13002 -9808 -23616 -26943 -22870 -28065 -18026
7548 -18026 -8462 -6778 -7290 4690 8655 -718 -12787 -12423 4920 6351 8150 -628 1325 3836
7534 3836 7241 6854 156 -21151 -21744 -2798 3333 -11359 -13183 -24996 -32667 -18467 -19563 -18045
7520 -18045 -26244 -28309 -28979 -37737 -22042 -3938 -15684 -28347 -22971 -15142 -24212 -7742 15689
7507 15689 18848 13628 1113 1619 -3689 -2350 7416 10828 12046 27992 17115 -19041 -34059 -25831
7493 -25831 -2809 8273 2243 8452 7547 12731 9200 -1045 4623 8206 7087 -3584 -6899 -12003
7479 -12003 9242 1336 -9217 -6356 1558 -40 23027 24605 3531 -18404 -15313 -14047 -10952
7466 -10952 -11344 -16613 -7624 13319 29133 23785 1172 -7511 -3227 -11391 -10976 10966 8827 12228
7452 12228 82 -14978 -3725 2398 -12278 -18669 -22199 -25434 -15865 -1995 3571 -7698 -27368
7439 -27368 -37730 -34463 -37639 -41472 -49376 -32127 -762 23245 25368 19679 12327 1019 6371
7426 6371 7568 1215 1899 -11799 -7895 592 -9674 -10209 -19314 -10043 -1572 9628 14453 17907 1531
7411 1531 -8531 -9555 -2456 -3231 -5099 -4191 -16743 -5767 19704 27138 32113 28072 7316 -3109
7397 -3109 -2177 -6807 -10179 -29 11433 -4988 -19799 -23609 -10089 -8880 -21642 -26196 -29152 -18762
7383 -18762 -12323 -10086 -16838 -17912 -12648 -14984 -25156 -38653 -36272 -35339 -15174 -12913 -16025 -28150
7369 -28150 -34192 -34415 -43266 -35846 -28498 -40002 -19282 7536 25957 10416 212 -12387 -18772
7356 -18772 -7972 -10524 -23141 -28678 -23545 -7884 -18337 -25749 -12743 -9686 -3920 -10214 -16828
7343 -16828 -12115 -5039 -20462 -27509 -23822 -32001 -23378 -26600 -32363 -39532 -35167 -16143 1003 -2175
7329 -2175 -19603 -10546 -9136 -1025 19212 14231 1730 -3634 5414 4774 -9328 -5475 -4817 -14360
7315 -14360 -20615 -8931 3459 -2485 -7274 -6494 -13310 -19744 -20506 -29091 -30732 -21039 -8860 -2952
7301 -2952 11963 16448 6010 -753 -1441 -8171 -18491 -9022 4099 -6234 -13145 -6416 -14094 -20555
7287 -20555 -24057 -10581 -6916 217 -7372 -16082 -8889 -15745 -4386 -2542 -12757 -6286 -16626 -20523
7273 -20523 -19675 -17415 -6931 2886 24087 30560 35276 30460 16076 12308 17218 509 -8079 -11705
7259 -11705 -10452 -33050 -35277 -26686 -36396 -29700 -19669 3520 4040 -2036 1943 -1727 -8252 693
7245 693 -1689 9208 8585 -3724 -14775 -3510 -9989 -13188 -13760 -22524 -28270 -15479 -8333 -16923
7231 -16923 -20151 -6136 10926 20093 7485 731 -1696 -3266 -12057 -8871 14062 3724 -920
7218 -920 -4741 -6917 6924 5102 -9764 -20338 -31402 -35316 -33434 -31554 -26706 -23582 -20329 -5293
7204 -5293 22328 16793 -5451 2181 11601 -985 8777 9298 9319 115 -1004 -6303 -18856 -26140 -29334
7189 -29334 -32111 -26414 -18625 -411 16475 9905 15055 -1504 -14299 -10112 -4040 -6531 3557
7176 3557 21159 31949 32463 13012 -296 -17092 -33939 -41826 -26481 -6815 2979 6492 12954
7163 12954 -3013 -3776 -8434 -4763 2965 7320 3294 1735 -10145 -23496 -49275 -55377 -29747 -25072
7149 -25072 -13927 -10237 -4759 -1454 -6193 657 10233 12987 20131 22472 18928 11890 12255 18954 20282
7134 20282 2830 -9929 -6529 -962 -15847 -28643 -23218 -17761 -19471 -14741 -15295 -12767 -4735 1379
7120 1379 -17121 -26949 -22690 -11382 7980 14522 8435 8482 24270 23975 5588 13708 33438 23078
7106 23078 20177 16078 -9262 -18242 -3298 -4882 -5832 -12204 -6701 13974 24164 27116 27398 25875
7092 25875 6721 -3260 -12434 -12588 -6741 -3168 -2513 -4748 -3522 -338 -16997 -32858 -22668 -23817
7078 -23817 -22246 -8464 -1105 -18105 -14823 -22977 -9439 4518 3902 1700 -6158 -19863 -21240 4501
7064 4501 19770 13027 19089 20234 5290 2421 -12294 -21933 -12085 -16337 -24349 -26204 -37913 -22270
7050 -22270 -9851 -4209 10869 15489 5166 12947 35043 31625 20444 17307 6553 4453 4916
7037 4916 1837 -9415 -6427 10514 7327 -255 -5138 -18717 -26674 -22554 -22818 -9451 -6011 -4379
7023 -4379 3408 14941 9704 10714 7571 3977 -3803 358 -3627 -5723 175 803 77 -5852 -17759
7008 -17759 909 11865 12067 -1931 -8961 1672 4666 -12416 -2705 2097 5697 23510 39459
6995 39459 31281 10560 -9467 -17614 -25654 -13112 -11397 -14988 -16529 -4885 -5553 -17096 -14736 -10571
6981 -10571 -18357 -10476 7482 16271 9314 15710 12808 3033 -3133 5394 5651 -3403 -9441 3484
6967 3484 5912 6922 1778 2373 -13976 -21952 -31948 -26130 -23705 -24591 -15122 -5948 -10256 -20056 -34251
6952 -34251 -51484 -57543 -35169 -25285 -11304 -7491 -7285 -13797 -11854 -6296 -17350 -36120 -13041
6939 -13041 1619 23641 32627 16023 -3233 -4966 5542 2096 3773 8471 8157 3058 3999 -4802
6925 -4802 -5923 -16860 -14592 -9065 5308 5746 -1161 393 8136 660 -20531 -38850 -23247 -11472
6911 -11472 563 13760 3067 -16861 -17057 -24695 -22518 -10897 -23954 -27602 -376 3652 7940
6898 7940 13670 2163 -15233 -892 8182 2400 5371 4040 -5522 13888 20454 35894 25063
6885 25063 424 6938 2417 -1808 12771 2909 1938 -730 -1863 10715 -2779 6045 23460 14585
6871 14585 -2351 -16487 -2873 -7368 -12339 -12125 -14488 -28334 -22066 -26205 -27593 -27053 -8610 -2126
6857 -2126 -12135 -15307 -10510 -7598 9166 10373 -2706 -565 7249 19041 17207 12495 -3941 -13174
6843 -13174 -5957 2239 -14155 -24879 -25943 -7956 12577 -1802 -8942 183 -9920 -28354 -28939
6830 -28939 -26954 -22940 -20611 3229 14296 5237 -14379 -14359 2550 15037 21246 19649 17411 22614
6816 22614 21235 10410 11384 -3321 -13008 -21759 -32443 -27303 -11412 -10368 791 -3528 -4912 -10380
6802 -10380 -15034 -15813 -8384 11124 22525 2566 -6701 -8728 -15449 -6972 -1157 -11285 -16471 -16944
6788 -16944 -13925 3441 3894 -16567 -40190 -7628 -444 -23659 -10936 -6329 -7898 3505 3805
6775 3805 -4643 -10275 -8790 -4118 -6776 9141 5736 -2034 13969 15110 4403 -1353 13546 20092
6761 20092 5760 3963 9180 8498 -5014 1193 -706 -19925 -31788 -46010 -38008 -46593 -44157 -28849
6747 -28849 -6166 8199 12764 9714 11245 2582 1452 9850 9189 -3324 -6781 -1394 8735 8962
6733 8962 17018 13728 5110 -41 -2139 -6300 -3826 -8800 -23236 -8898 -4980 -20119 -12297 10050
6719 10050 10183 7657 -3670 -315 3787 10466 16309 10859 2523 -21448 -16533 2381 7908 11126
6705 11126 11999 9359 668 5154 1240 1623 -2327 4771 9211 -182 -1753 -5965 -10447 -19285 -12007
6690 -12007 -11320 -17443 -7524 13444 1363 -18948 -26303 -21645 -6681 6008 7417 -6773 -12743
6677 -12743 -17808 -24006 -21080 -8169 502 13404 7871 -909 -12697 -16362 -13163 -16069 -21596 -23877
6663 -23877 -7289 -1460 8556 -2409 -3344 -18471 -16898 -16254 -13700 -9911 -9125 -4436 -10072 -15260
6649 -15260 2915 16944 3076 -3953 2043 7856 9449 16499 27259 28263 24817 24150 -2761 -8533
6635 -8533 -15268 -24380 -34989 -38412 -27308 -17069 -19614 -29266 -22661 -18446 -4249 11760 7394 -12239
6621 -12239 -23437 -25104 -16000 8284 13348 10968 13506 16467 17393 27046 24814 8344 5985 7643
6607 7643 16529 8442 7831 -3282 -16366 -10647 -1367 108 5543 6846 10580 -2112 -9219 -14658
6593 -14658 -11528 -7532 -20263 -22666 -5519 528 -7153 -10402 -3720 -5636 1628 -6189 -4723 3340
6579 3340 1570 3864 -3191 -8507 12412 11581 -1804 -15044 -10469 -14300 -17395 -6395 -15097 -21173
6565 -21173 -17964 -8118 5226 8172 3900 15040 17400 -8259 -24689 -17824 3512 13064 2450
6552 2450 -5051 -3785 -7870 -10128 -12442 -14936 -28024 -33922 -16668 -14013 -18550 -7555 -23738 -28912
6538 -28912 -27245 -12019 -2315 1253 5184 3902 6123 18144 25288 7595 6374 6707 -10940 -16694
6524 -16694 540 8228 9225 -11021 -10182 -14969 -13427 -14665 -16228 -22470 -25658 -25956 -11041 3916
6510 3916 3966 18415 33736 32196 7148 -4133 -4392 -1439 -3402 6198 -453 -8766 -12117 -2310 11057
6495 11057 19374 30553 25635 9564 -6256 1302 556 -5142 3952 -85 13308 12672 -9983 -20868
6481 -20868 -9769 -3930 -7283 -10610 -19321 -19521 -20742 -4564 -8001 -16202 -29197 -28668 -25486 -22628
6467 -22628 -31505 -34206 -43823 -28991 2587 19042 22466 689 10051 20585 -9204 -11804 -13206
6454 -13206 -19235 -14384 -11995 -6309 -5393 -7055 -10560 -3845 -17703 -25789 -31816 -30014 -23152 -3044
6440 -3044 6424 15387 13390 16682 -2720 -22459 -18602 -6865 196 12547 1540 -9532 -6776
6427 -6776 -10935 -7758 -17131 -17717 -16545 -3162 13670 25081 7653 -1930 -9149 -8963 -7319 1836
6413 1836 1979 -18723 -32487 -41692 -29511 -17622 -2771 10019 651 6546 7063 9018 17035 18983
6399 18983 1758 6266 15666 6097 12235 5581 -2811 -5103 -33084 -47589 -40320 -20997 -8982
6386 -8982 -14583 -31322 -33284 -22979 -14236 -11205 -54 -6676 -21370 -26410 -31933 -27167 -34361 -31886
6372 -31886 -28239 -16926 -4955 1690 -2291 4122 1461 7416 12564 11314 4903 11993 21 -17047
6358 -17047 -24828 -10151 -7065 -6888 -13158 -10233 -2754 2853 1271 4682 5807 3656 -14996 -15113 -9595
6343 -9595 -14765 -24733 -18731 -18989 -23619 -29921 -28698 -28088 -1203 15589 9947 1556 -199 -7110 -12175
6328 -12175 -4560 6909 14198 10856 -9469 -29663 -34010 -19524 -21172 -12736 -12976 -3806 17152 31633
6314 31633 26240 19879 18839 5631 -5030 1297 -6410 -7133 8 -3088 -3816 5057 6403 1404 11633
6299 11633 12417 16619 13537 4500 4666 24403 17073 2721 -15296 -13006 -1729 10127 9050 5015
6285 5015 -4442 -9597 -16832 -9044 -6344 -7561 -5221 -23118 -25150 -21480 -3757 -5116 -25150 -45154
6271 -45154 -35207 -15301 -4315 9330 17139 22393 24285 22554 15653 4013 3603 -4085 -6178 -1598
6257 -1598 7022 19158 15591 8520 4285 6642 9853 9699 -1783 18 -2648 4346 16478 7048
6243 7048 2689 14327 3919 -8943 -17553 -20430 -1249 7688 13041 -3890 -12108 -13786 -10055 -8311
6229 -8311 -8046 -622 10577 12809 15981 10378 -12539 -26675 -19509 -6086 2959 -5228 -19099 -22643
6215 -22643 -15032 -11297 -10859 -5741 -3304 -10228 -7016 -18274 -30453 -28288 -23585 -17227 -11875 11801
6201 11801 25497 22911 26732 27791 23664 28948 26039 13749 -11885 -16387 -17297 -11005 6483 21479
6187 21479 7052 -11734 -628 19484 20143 7119 13962 17106 17863 21473 16378 10579 113 -6620
6173 -6620 -25430 -28946 -19874 -14804 -6694 5051 -4879 -11514 -21778 -9866 426 -1733 8020 17601
6159 17601 14886 -2973 -17663 -12323 -13072 -16883 -17046 -11334 -4543 2015 -6488 -8891 -14111 -10098 -21297
6144 -21297 -28172 -29817 -17581 -337 -2340 -15454 -19984 -5737 -7169 -7737 9342 -845 -13701
6131 -13701 -22488 -6336 5184 14608 3220 -10657 -27239 -32223 -29115 -24996 -12619 2655 5101
6118 5101 15720 16718 32978 34672 10958 -3143 -12265 -16966 -15643 -25184 -19594 -6330 -4207 -1009
6104 -1009 5920 22316 7866 649 -2445 -2821 -13190 -14249 -12227 9035 12494 20378 9025 -264
6090 -264 -5662 -4849 -17736 -19571 -13169 -10338 -18843 -32443 -24303 -18934 -10971 -20584 -25400 -18797 -31260
6075 -31260 -27223 -17104 -9402 -19919 -12079 -13219 -24649 -39820 -32735 -16556 -12859 729 11243
6062 11243 16220 11418 -543 6349 3167 18090 17882 7056 377 -1607 -19952 -35836 -32843 -32648
6048 -32648 -45114 -38048 -21249 -19549 -4437 3608 16852 28247 21649 8272 9404 25369 21046
6035 21046 10678 2344 -6463 -5179 6134 16049 2766 -2839 7431 22869 28149 4266 -20743
6022 -20743 -22157 -21289 -9955 -13070 -33962 -39402 -29756 -30220 -7763 20537 28446 27507 25920 14132
6008 14132 15648 27420 20784 11287 -2496 3417 -49 -12730 -5131 2324 -1573 2347 285 -13983
5994 -13983 -21701 -21885 -19200 -7408 7109 -3938 -18345 -12538 -2457 -5094 -7119 5057 6168
5981 6168 3489 -113 -19772 -18094 -6665 -1021 -726 -7339 -5299 -7279 -623 -7997 -9911 -10078 -15922
5966 -15922 -10227 -3510 7250 1023 -5436 -8503 -28848 -24353 -20133 -9756 -15258 -22276 -27954 -34198
5952 -34198 -15545 -15548 -433 17154 19652 13838 4537 2782 12761 18603 8063 12026 13808 -2928
5938 -2928 -8311 -14209 -13604 -13399 17553 32600 23343 20996 -6704 -27236 -20907 -24568 -21776 -17920
5924 -17920 -5222 -6125 -17182 -20828 -14053 -4927 -7598 -4493 6974 -1392 -1812 -3180 -4423 15056
5910 15056 15446 3132 -5014 9929 13590 10606 7657 -970 -1886 5919 -3330 -1106 5223 22025
5896 22025 28207 14134 -3922 9070 -3065 -16302 -14553 -7908 -2975 9615 5853 -14092 -20563
5883 -20563 -24484 -23705 -12013 -10295 -7737 -4058 -6580 -16520 -7814 -10846 -10868 10056 19189 6121 8891
5868 8891 8196 10980 16698 27438 9921 1943 9426 23237 11726 14264 27695 12751 23727
5855 23727 36832 11940 1855 7723 8710 -663 -11653 -2580 -1707 -9345 -16024 -10121 3798 14228
5841 14228 20988 23067 14445 -9907 -2338 8799 13730 2516 -6819 7541 12207 8897 7436 17833
5827 17833 5208 -3244 -8440 -6526 3950 -3262 -7938 362 -9382 -14815 -12796 -25125 -16056 -5799
5813 -5799 -9156 -15124 -11467 -3074 -571 3117 9400 2479 13355 18228 9543 -5638 -10591 -11654
5799 -11654 -2083 9313 11533 30459 14861 4918 3617 5804 -4719 -5061 9442 18508 14
5786 14 -5959 -213 -17294 -18573 -30157 -32788 -17731 -5841 668 7446 12202 -24 5363 9255
5772 9255 8051 8452 12234 7966 9562 -111 2290 4465 -3925 -6929 -4478 6940 13280 10110 3005
5757 3005 -4305 2487 4180 -15873 -10522 -15644 -21355 -25121 -30065 -34988 -18148 -5002 -2108 4204
5743 4204 -6477 -7044 3668 -977 -13804 -20628 -6859 -15275 -22658 -14313 -9883 2810 937 825
5729 825 -3933 -11663 -9299 -813 -12075 -16973 -18483 -22515 -28425 -13027 -15543 -22855 -16809 -16864 -13798
5714 -13798 -4014 -7713 -10047 -12419 -4990 -6819 -13892 -12431 -5855 1028 2833 -21303 -33941 -22277
5700 -22277 -12186 -22146 -25589 -19137 1874 18141 4897 -14490 -17875 -6957 3854 4570 9135
5687 9135 -267 -1061 6488 25230 29403 12158 -9316 1867 93 -18915 -10594 -9915 -11044 -3745
5673 -3745 -6634 -6445 4160 -9431 -28719 -5014 12018 16494 -14359 -21293 -9911 9317 8736
5660 8736 -11332 -19397 -18651 -11262 -1065 3207 2046 3928 3591 4782 23136 33456 31828 42583
5646 42583 34712 18639 -4800 -26839 -20310 -24312 -17454 -2199 4172 5792 -2957 -6124 -3089 7882
5632 7882 17364 7528 7424 10412 17640 20644 15349 15978 30139 22425 22655 25041 19981 8852 6540
5617 6540 5409 -7883 -1036 -6367 -13265 -10789 -14605 -2939 -3026 1047 12790 8136 580 -213 -144
5602 -144 -92 -12516 -22200 -20643 -21979 -6030 15972 17751 -2645 -6990 -11644 -10478 -14248 -3149
5588 -3149 200 -7159 -26590 -47380 -40591 -18511 -11116 4387 29806 21087 4318 6598 5741 -3150
5574 -3150 -4819 -12662 -4396 -7216 -4384 2531 7355 -10045 -17695 9535 19614 11923 2576 -9780
5560 -9780 -1841 -13219 -20374 -21638 -16618 -16199 968 -2803 -5949 -6592 6248 -64 -19620 -15202
5546 -15202 -23420 -24348 -23995 -10611 -1302 -7792 -17165 -17352 -17888 -11010 -11383 -14314 -8941 -10484 -23961
5531 -23961 -24668 -29458 -21604 -10820 -5893 -5069 -15013 -31976 -26892 -5958 14208 17190 -2662 -9342
5517 -9342 -4817 -11495 -15273 -6035 13038 20860 -2159 -21470 -22522 -16593 -15365 -10590 -11763 3383
5503 3383 4203 4395 3910 14239 26342 17265 6864 6747 -8018 -11630 -11390 -11792 -11559 -9156 4423
5488 4423 13399 26828 19859 16663 8716 12636 4959 4841 2209 9606 4755 16412 18096 24041 31746
5473 31746 19611 -868 -22967 -29110 -21445 -30550 -31226 -21016 -13998 -17500 -11489 -12973 -4273 -8560
5459 -8560 -17631 -20664 -21696 -2930 6069 3809 2435 12044 3758 -23550 -18862 -24605 -31181 -37801
5445 -37801 -33929 -21811 -25623 -11228 -9018 -15099 13767 6760 -26207 -22371 -13127 -11032 -7134 -8371
5431 -8371 -8918 5315 16381 21651 23402 19906 -8547 -23379 -30081 -23602 -5115 -2413 7799 33921
5417 33921 25436 9802 14741 8479 12692 -2524 -13170 -10709 1441 15379 17792 -3864 -9001
5404 -9001 -17897 -19788 -10005 1650 11763 959 -8176 -10927 290 8670 16118 6635 9219 3910
5390 3910 2581 6028 8951 6831 -2752 -12288 -15279 -11714 -7228 -17236 -27045 -16762 -5651 -21
5376 -21 -809 -80 -13930 6316 9690 803 -5763 -11323 -17057 -10881 -12761 -5892 11504 18967 11060
5361 11060 32606 34939 9971 -3161 -1595 1854 -5079 6770 5641 9532 3623 937 -3612 -9180
5347 -9180 1459 16505 23151 22881 13468 4811 8137 17164 20883 8618 0 6234 5102 4216 16307
5332 16307 10128 5752 -2793 -8897 785 9070 -5562 -9021 -11401 -2570 -3543 -2879 -17620 -11889 -15006
5317 -15006 -18972 -24495 -17674 -21357 -6376 17254 30909 26061 8527 -12069 -423 4626 4740
5304 4740 -2485 -9931 -5605 -4590 1972 -5141 -17334 -11644 -11432 -6263 -9301 -42582 -45514 -22321
5290 -22321 -22438 -22891 -132 5819 -4060 744 3585 -1273 5518 20240 12445 -13658 -38004 -30331
5276 -30331 -6230 4552 3033 -4447 -7939 -5590 11686 -2728 -3470 10688 -12850 -7334 6909
5263 6909 662 -13200 5465 11542 9901 -18583 -35678 -38757 -40354 -37543 -25853 -15526 -6510
5250 -6510 -3656 4881 11297 11514 18179 4966 -11536 -16223 -19384 -17646 -15905 32 2366 -7474
5236 -7474 3409 1566 14492 20851 17286 26271 18463 11042 27949 17543 22107 39053 35552 27704
5222 27704 24661 16089 8099 -8321 -8793 -2073 -1704 752 754 -1504 -3749 -3607 5555 9937 1060 -5501
5206 -5501 -3763 -10428 -6574 -2974 -19820 -20265 -12495 -11407 -18803 -19866 2405 -380 -6782 -6265 -10918
5191 -10918 -31368 -44835 -15450 7723 -2532 -14753 -2445 -1871 -6751 -1623 1658 -16421 -29476
5178 -29476 -39294 -38510 -32524 -28618 -14545 5040 13203 5056 22749 19867 10782 6051 -4021 -1352
5164 -1352 -10623 -16092 -12064 -5646 10437 5943 -1482 -3283 -9727 -16991 -8014 6262 -3672 -3798 -3239
5149 -3239 -13169 -18047 -14676 -6312 5079 6314 -4414 7081 16083 12999 4689 -17080 -17803 -20444
5135 -20444 -24005 -20789 -2480 -6908 -15441 -7843 -9169 -17669 -15701 -17185 -11819 -3083 -4408 -11189
5121 -11189 -10182 5767 5658 5997 -3801 -4612 3851 7970 3954 7794 7745 -5076 -5853 14137 11205
5106 11205 -9715 -20310 919 5848 -7534 -4803 6168 8627 3867 -287 -10684 -13312 -22701
5093 -22701 -42870 -53260 -54299 -45626 -19886 -10472 -15159 -14806 -15827 -16000 -27566 -39043 -29058 -18938
5079 -18938 -565 6280 6802 -9577 -20279 -22090 -22703 -5082 -8633 -9903 -217 1191 10346 29212
5065 29212 17771 6234 1118 -8009 3112 8032 590 -1196 -12643 -9900 8531 9190 12420 4780
5051 4780 -8504 -11786 7276 12288 -636 3209 -4667 15894 13668 -3969 -6770 -9257 -19456
5038 -19456 -31340 -44043 -22723 -4040 -5501 -398 -11077 -6991 2061 10810 6120 8282 4272
5025 4272 10523 12810 3756 1044 -6084 6533 15918 -6624 -16844 -22432 -21126 -15543 -22337 -16654
5011 -16654 -2144 8265 14125 3669 -3691 -6885 4411 10194 -4617 -14058 -12420 -7708 -7383 -12500
4997 -12500 -15336 -4190 -11706 -18506 -17953 -21069 -24028 -16515 -12771 -20203 -8755 -8117 -11713 1956
4983 1956 -6339 -26502 -17266 -15068 927 6024 9343 11831 4516 18014 21820 13728 -556 -1277
4969 -1277 7476 8821 -6460 5824 12802 8784 -1827 4426 4819 7941 -3426 -527 -661 -8384
4955 -8384 -19721 -9203 15310 2916 -4967 -536 -9983 -7937 -1292 3101 15622 7444 16468 19007
4941 19007 22033 23514 14035 15515 17084 9754 18104 19207 22870 19709 2369 9492 9726 176 6704
4926 6704 12772 2606 -13910 -25426 -16953 -5382 5025 10493 5016 9774 7077 -5283 3025
4913 3025 7068 19588 33134 42852 38214 18506 41 251 7390 21010 19798 15072 5342 -9069
4899 -9069 -31515 -27849 -19948 -19523 -15577 -5031 -1362 -4890 -17757 -26870 -37922 -24692 -4886 10746
4885 10746 3816 1999 692 -5259 -4006 -14231 -13529 -4149 -2919 4792 4180 -2580 -4173 -4772 -13943
4870 -13943 -10506 -9499 3938 15278 2319 -10403 -6632 -12062 -22715 -18951 -10737 -15164 -22582
4857 -22582 -25496 -7670 3130 3694 -18982 -18015 -7763 1250 4401 -5373 -13486 -3652 -2129 1962
4843 1962 12325 8940 4754 -6842 -22480 -21843 2402 3377 1487 11670 -1755 -15384 -9071 2689
4829 2689 -5807 -7780 -13921 -2581 22054 3210 -18078 -26961 -30386 -29165 -19485 -9851 -21099 -25069
4815 -25069 -16677 -22796 -22662 -16757 -20737 -31540 -29197 -27945 -25435 -10266 7547 7348 15992 11474
4801 11474 -4758 -2130 98 -3561 4873 4492 843 -2722 2801 8104 6553 420 1881 3721 -13161
4786 -13161 -20114 -27279 -34901 -50433 -42951 -24456 -16814 -19361 -8727 -3207 476 4068 2519 -19595
4772 -19595 -25384 -2856 5716 2452 14206 21795 16851 9288 7164 -12147 -9632 7322 18733
4759 18733 3120 967 13309 10501 -1202 -1210 -434 13550 26132 7717 -132 12191 9509 -2828
4745 -2828 -5900 -4046 6188 6511 -12583 -6973 4957 -2010 -649 3266 4210 -11165 -31434 -31768
4731 -31768 -19231 -9858 5133 15986 4824 -205 10833 24741 17099 5090 -1014 -674 -10221
4718 -10221 -5899 10515 1138 1267 -7322 -18766 -22295 -10005 -17152 -25250 223 6454 -7672 -13092
4704 -13092 6823 12873 97 981 13219 15773 9934 996 -6043 -13639 -8088 -9512 10401 24397
4690 24397 16906 11312 -3958 -129 5345 -7556 -14316 -17857 -11642 15639 21525 6844 -5374
4677 -5374 3155 3090 -2758 -9439 2524 5149 2189 7284 17173 -367 -1316 6851 1170 -2108 -164
4662 -164 3056 -2648 -14681 -11984 -13271 -8736 -17440 -5854 -4778 7739 20463 25721 17098 13676
4648 13676 2232 -23775 -29260 -48347 -47163 -34590 -24970 -9729 -5962 -4506 -5047 -1346 6945 3499
4634 3499 4368 3695 8281 10754 -3450 -1485 3841 16945 41118 34734 25801 16478 9133 4578 -5934
4619 -5934 -21994 -9064 -8181 -16414 -4240 11612 3162 -5780 -17499 -25337 -13521 -12891 -15063 7642
4605 7642 14760 12698 17522 5217 -8435 605 6888 933 -15512 -13182 -9417 -7117 -6454 -19634
4591 -19634 -13742 -9718 -12391 -8816 -14350 -16652 -22773 -23451 -16349 -9855 -10176 -10355 3220 4319 7722
4576 7722 -5395 -5988 -948 8205 4961 -547 7002 11024 1831 -13272 -9101 -2805 1381 -6762 -14031
4561 -14031 -5612 -1607 -2502 -11549 -13957 -10542 -9836 -9911 -12255 -225 -3981 888 28971 32689 13114
4546 13114 8977 -4528 -18919 -14635 -11552 -1966 -2022 -11622 -16219 -7311 -15419 -16076 -378 -15292
4532 -15292 -19191 -14001 -14469 -15084 -10708 5053 7544 5456 19274 29742 19677 10786 8606 -217
4518 -217 -11419 -34386 -33728 -27173 -10099 3207 8338 18549 21114 24418 12300 19902 31090 15759
4504 15759 -6023 -14427 -1402 12176 8357 -10356 739 12441 3678 -15193 -8620 -11614 -10364
4491 -10364 -12362 -15684 -14226 1875 5606 -11459 -23521 -24118 -9044 -7275 -731 5776 9516 7341
4477 7341 -6962 -22575 -23404 -21562 -20751 -27912 -37054 -16201 -2294 5957 10222 9581 3187 -14794
4463 -14794 -21156 -16550 -27184 -13221 -3624 3514 4641 -3587 2426 7005 4408 -487 -7222 -1908
4449 -1908 5169 -5170 -4132 10986 21843 15229 5441 -4937 -14028 -5480 -12990 -25048 -19075 -19258
4435 -19258 -4987 7365 -2124 -15219 -13826 -15630 -8275 -3267 -4756 -20024 -15367 -11318 -17139 -11735
4421 -11735 6471 12952 19625 19826 8191 13735 4422 -6538 -7615 1697 134 4050 11828 9662
4407 9662 5098 -3211 -5793 1915 13046 8239 11866 2612 2931 -8747 -9848 18033 35762 29009
4393 29009 8662 2179 3213 -17841 -3539 11516 -888 -21306 -25668 -29424 -26603 -19047 -8155
4380 -8155 3376 15123 9609 4692 -4961 -20365 -26747 -14241 -14997 -25091 -14463 -21786 -21233 -21268
4366 -21268 -6188 -2651 -3468 -5213 -13973 -14731 -10113 -12535 -8775 -9995 -5656 3146 19449 5185
4352 5185 -1851 5091 4771 -1289 3851 10897 11516 15715 6727 -3584 -13484 -11776 2599 236 -15603
4337 -15603 -3065 8513 -951 -16347 -25908 -27185 -15232 -5598 5118 8404 -603 -6555 -10183
4324 -10183 9035 22022 21505 24342 23874 19735 30963 12752 -4939 -11627 -15458 676 1623 -13754
4310 -13754 -10668 -18565 -11731 3259 5372 17607 13224 22391 17766 15187 21956 23489 28875 15900
4296 15900 -95 3240 7759 1974 -14099 -9571 -7431 -17986 -12898 -7311 -20790 -48387 -41006
4283 -41006 -16490 -23837 -39358 -26994 -19400 -14636 -15790 -7402 -10156 -21351 -13968 3275 721
4270 721 3118 2361 728 -6794 -9558 -28735 -38969 -33987 -11531 11321 13458 4916 -7814 3208
4256 3208 -178 -8717 -11311 -9612 11531 22138 6548 -9002 -31942 -15723 -7519 -5794 7466
4243 7466 -2139 -8465 -708 11425 16651 2477 4138 -9025 -16424 -17834 -36485 -44708 -21809 -20559
4229 -20559 -28570 -25975 -26782 -24378 -6510 8616 -2246 -14381 -27461 -25503 -21129 -20875 -22627 -6916
4215 -6916 -10615 -10634 -8411 3744 21002 12773 5988 1607 -16384 -2539 15581 25847 32640 33369
4201 33369 28449 15755 22735 12110 13183 14481 -8776 -21800 -24754 -12467 -5708 -7895 -18285
4188 -18285 -9354 5877 2519 -7869 -13750 -14600 -9592 -5235 -7151 -11878 -14640 -23184 -20945 -15016
4174 -15016 -15576 -25238 -37313 -47921 -52676 -44228 -41830 -32019 -25800 -34735 -26346 -13936 2643 3095
4160 3095 8555 10487 1634 11293 15302 5167 3271 -7426 -13875 -11278 -29640 -35947 -32289 -27719
4146 -27719 -11932 -1825 -13132 -19154 -21752 -18481 -7990 -16024 -17949 -9462 9128 11799 5704
4133 5704 8590 3273 8160 12712 7398 -1214 -3206 -12138 719 1988 -12954 -20514 -15478 -19237
4119 -19237 -15967 -10683 14530 17661 -8877 -19763 -10043 7470 4166 -16692 -20335 -4573 1709
4106 1709 -1981 2541 -4709 -3445 -10933 -28936 -26675 -26637 -6779 4662 7661 19938 26088 30179
4092 30179 16463 18782 17027 7248 -7918 -3713 1248 12980 21276 14682 3314 -20047 -30299
4079 -30299 -16586 219 5261 -12602 -24538 -19162 -3157 -3966 -9755 -12545 -12255 -3430 -4393 -670
4065 -670 3317 16936 13427 -287 -866 -10596 -13994 -7567 -9159 -23953 -15854 -4693 -366 12821
4051 12821 -8681 -15772 -18096 -12114 -198 -4960 -31951 -48805 -28981 -21989 -9545 -20 6356
4038 6356 18974 2642 2965 1262 1221 6270 25039 27604 18950 -1163 -19014 -8673 982 -6119
4024 -6119 12460 38821 40998 38268 32727 15383 2062 4833 -6738 -13649 -21228 -21675 -18923 6520
4010 6520 12159 8239 17072 22810 15625 26528 22252 23319 22554 24119 41634 43417 10622 4611
3996 4611 -13438 -4135 -11617 -17399 -1373 5855 7592 1950 11745 18290 25179 20850 9772 2288
3982 2288 13170 21444 15213 4070 -12626 -21964 -14835 -3145 5021 14825 21079 1245 330 12087
3968 12087 3311 -6468 -4942 2613 -2225 -15282 -9159 -4116 -6228 5109 -2928 -9354 491 3385
3954 3385 -6613 1743 14126 18000 22155 14484 22979 35151 18257 27438 35656 18781 -1824 -17805
3940 -17805 -18185 -3762 6548 2418 -3044 -6009 -22300 -24685 -18305 -6423 6807 17584 15159
3927 15159 11923 6418 -6053 -19887 -12937 7247 18266 6802 -6451 -10658 -7465 -14631 -17256
3914 -17256 -5724 10723 25701 16120 -3155 2663 13555 18129 -7480 -19636 -6069 1926 8365
3901 8365 -3513 -7981 2461 15828 14119 6673 788 4134 6723 3570 10465 -4639 364 11455
3887 11455 20435 16352 11988 7386 4757 -4294 -12733 4201 8527 -4541 -14828 -10542 -9568 3300
3873 3300 -8719 -4247 15551 16753 -433 -6354 -12453 -16472 -14007 -38420 -41489 -39550 -27269 -3338
3859 -3338 -7234 3 4741 -1899 -5995 -12984 -34760 -45044 -33833 -17623 -7869 -5813 11332 17562
3845 17562 12854 24242 17059 11603 5765 6651 4784 -8635 -12636 -18353 -13049 -9351 -9190 -5194 -16391
3830 -16391 -27397 -19223 1471 -4237 -7986 -5247 -4626 2119 15258 7283 -1610 -10271 -17663 -17443
3816 -17443 -29147 -41310 -25590 -5568 7081 5637 -5438 -23954 -24033 -17349 -7944 -5011 -14799
3803 -14799 -4717 4535 -246 -5444 -5555 11283 22989 4501 -589 7497 -2115 11264 12029 1303
3789 1303 -2986 -11339 -24868 -22969 -13149 -9138 -3233 9225 8138 430 -12396 -4535 1992 8748
3775 8748 13356 21443 11809 -10600 -6931 5356 6730 -6767 -18485 -10869 -2757 -10618 10655 1920
3761 1920 -2024 -4445 -7017 -14482 -4897 12029 23775 25985 8079 -13595 -11557 10236 21956
3748 21956 14839 16949 25499 4746 -11970 -636 -4283 -8341 -7476 -4977 -5971 -4172 -11157 -7327
3734 -7327 18412 22015 20014 24941 11941 5741 349 3198 10913 22522 23616 16926 16122 20208
3720 20208 22553 32699 20591 11734 20831 2654 -1518 8826 5825 15302 22767 2727 786
3707 786 8021 4630 -6043 -5348 11592 5302 1943 16369 2868 -12402 -1902 -12417 -9799 -7838
3693 -7838 -18979 -11465 20213 18957 2965 4070 26504 24614 18860 10552 -3708 -3102 -12146 -19644
3679 -19644 -8502 -8389 -9622 -8364 1131 10738 13031 18454 19550 -3177 -31320 -27317 -25796 -8437
3665 -8437 4374 -2077 2155 -4632 -23314 -12175 -17597 -13989 -12950 3734 6034 -3312 -14888 -7604
3651 -7604 4726 262 4823 14831 12653 10125 20562 15493 -10310 -8991 3629 10734 15374 24168
3637 24168 17146 24265 3103 -8616 -1273 -1293 2263 -4062 4389 4792 -6956 10859 26401 16693
3623 16693 17499 13599 11450 19440 -3533 -14073 -2588 12840 -3711 -30693 -37991 -31655 -26985
3610 -26985 -7211 4505 -5549 -4705 -1091 -3056 392 -7068 -25931 -9007 -9278 -22865 -34902
3597 -34902 -33538 -20401 -2042 21393 21273 16251 14874 20944 3871 6482 20691 35273 19323
3584 19323 15173 11593 9053 -273 -5184 -17384 -6204 6357 20544 17531 -3036 -2308 4133 4729
3570 4729 -6500 -14056 -9212 7787 20270 37891 27704 21086 16244 -8632 -10195 -17430 -2425
3557 -2425 14366 15028 6174 1796 -10489 -13124 -14500 -19676 -18045 -5949 -14173 -23032 -13318 -11861
3543 -11861 -20763 -19666 -13510 -9192 -422 21172 9686 6727 2947 -12908 -12671 3736 -948 -5839
3529 -5839 -1981 -3219 -2611 1983 9739 3951 9099 14065 10484 -12048 -22727 -31206 -29087 -30373 -17929
3514 -17929 -8293 8293 20371 23645 33527 18960 13763 16543 11530 8050 -2502 -14478 -26746
3501 -26746 -19125 -600 5542 21146 16943 13106 20605 -1293 -1382 3707 9419 928 -9593 -19149
3487 -19149 -27985 -27266 285 10187 7325 12287 25335 19428 12827 -2763 -20002 -24929 -19398 1154
3473 1154 27620 18139 3236 -6072 -13431 -1560 1372 -3524 -10730 -6510 -4451 -5351 -11951 -16480
3459 -16480 -9634 -2361 4394 14408 7007 -1720 -8896 -18916 -25887 -29289 -26950 -34191 -24948 -20663
3445 -20663 -15914 -19393 -15286 -10834 -191 18276 28666 13237 15548 27442 28114 19967 9777
3432 9777 1967 -9983 -16546 -24574 -17424 2536 3152 -7820 -2875 20768 26794 17013 656 -12308
3418 -12308 -9827 -11351 -8944 -7961 6507 1020 -14833 -26942 -25938 -27941 -16490 -8786 -6883 -3465
3404 -3465 -1456 -13232 -24671 -27304 -33152 -29945 -26188 -9796 9501 4434 -5731 -6873 -6053 3445
3390 3445 13602 9500 -4761 4713 15116 25378 15484 -2392 -5451 5704 9653 21001 -143
3377 -143 -18367 -26627 -37326 -47344 -30846 -18205 -13433 4998 2986 -6065 -8944 -1731 926 -6126
3363 -6126 -10683 -19963 -44523 -48499 -32138 -29854 -17483 10337 2299 -9853 -9375 -16418 -32640 -17427
3349 -17427 11095 29280 25932 20204 27609 32680 28476 17945 11314 11736 3578 3445 10330 10071 21656
3334 21656 17981 3189 -7629 -23601 -12344 21074 34961 26793 20224 14876 14244 9312 19974
3321 19974 26949 24945 20186 -1359 -10517 3133 24 -6854 -1955 642 518 -3437 -6148 -4787
3307 -4787 -6715 -13560 -31203 -33481 -29027 -13871 -3289 -2672 -785 -10357 3991 19857 24566 12174
3293 12174 6951 -1027 2922 -2279 -15791 -4330 -1863 -4445 -13039 -11907 -1873 23675 25890 898
3279 898 -1665 -1900 -7581 -8668 858 -10984 -14977 8091 12603 10443 11415 -12476 -14345 -6379 -5812
3264 -5812 -21836 -37655 -27660 -1346 12547 4570 -35 -18199 -19806 -12699 3384 -1483 -7214
3251 -7214 -935 -9126 -17130 -6044 -8177 -24431 -21100 -18499 -6566 7109 15188 21990 23763 5113
3237 5113 17941 43542 45389 49769 53008 43675 49879 59051 50395 27980 11435 -3422 1600 17571
3223 17571 3068 8108 14118 15962 -8917 -22775 -25991 -20716 -14933 -6054 -15496 -12089 -10851 -4848
3209 -4848 -675 -13007 -21066 -6306 11422 1424 -12679 -475 4696 15383 11168 -4654 -9130
3196 -9130 -5443 -2843 -2569 -4497 -22605 -22639 -2493 -4657 -8877 -1545 -8418 -7807 -18439 -24816 -19531
3181 -19531 -11998 948 -6991 10 8503 14941 19691 18930 18024 15130 12345 17957 34432 43124 46599
3166 46599 39633 32100 29292 30223 29490 29842 12863 7609 12687 6597 -15356 -22606 -7450 10704
3152 10704 8094 5669 -10039 -8403 -183 741 8687 7622 4382 1966 874 -107 -5967 -7056 -16143
3137 -16143 -14537 -8253 -8744 -11430 -30619 -11433 3373 2110 125 9167 13561 977 -9809 -17662
3123 -17662 -8988 -645 -2362 -10718 4765 7798 7898 11073 10497 -4002 -15209 -16028 -8915 -3441 -1278
3108 -1278 4565 2096 -19949 -9323 67 -4473 -8889 -2027 8881 3408 -628 -14212 -15582 -8963
3094 -8963 -18256 -23663 -24485 -19711 -2355 -4302 -5320 11425 -453 4623 18910 19221 14254 -15673
3080 -15673 -18586 -4119 -18128 -30654 -17995 -2285 -5575 10019 16388 16413 10899 -11643 -6548
3067 -6548 -615 -6085 5190 -11917 -15109 -24031 -29368 -27592 -17897 12695 24570 12152 593
3054 593 3345 -3802 -6764 -5536 -10163 -9763 -2233 14401 -1701 -15024 -20628 -7627 11785 21229
3040 21229 9457 15308 21475 30869 18291 17707 30811 19391 1143 -7049 -1041 5281 3550 -1187
3026 -1187 -12926 9665 22809 27175 19622 27300 27896 8101 -1367 3978 25927 21836 18092 1358
3012 1358 8721 9177 -3498 -11755 -9476 104 10012 2865 11922 26704 6368 -138 21888 11702
2998 11702 -1744 105 -1902 -16525 -20007 -13623 -2062 5961 13638 26948 6518 -8717 -13382
2985 -13382 -14549 -3215 8751 5478 -10196 -11017 -16781 -30167 -24103 3801 8531 -9242 -12259
2972 -12259 -12700 -1876 -10065 -29076 -24019 -13302 -4506 5046 8465 3231 2490 16352 15277 8499
2958 8499 -359 7511 3632 -436 3761 8144 11440 2774 6411 6730 15806 13563 10238 -647 4928
2943 4928 6315 1335 -6783 3369 12904 21717 17677 17877 18837 11790 14205 6864 7 -13387 -8827
2928 -8827 -19232 -22702 -25921 -20585 -18057 -25617 -18829 -20081 -10335 -13171 -15292 -12211 10043 19682
2914 19682 20822 25267 15165 6511 4773 12585 7580 11103 15602 15894 18608 12653 5440 3799 1259
2899 1259 2924 4194 11961 9265 -8246 -4211 3918 5466 22680 19042 2018 1082 -4703 3470
2885 3470 17160 24879 30250 20894 -222 -950 388 3930 9482 38853 43294 37813 17795 8911
2871 8911 9336 15597 8967 5967 13296 10101 15073 30229 30926 18561 13546 -1333 4972 18223
2857 18223 17209 16461 19554 12139 5712 13282 12067 18775 25758 10393 -3502 6720 2637 1671
2843 1671 -6734 8060 6492 3538 13518 -989 -16230 -4206 2806 -2399 4133 11683 16341 20938
2829 20938 27750 28553 13613 -55 12681 30509 27687 22528 9329 4006 -2428 1379 5641 -10423
2815 -10423 -9111 -4255 -15683 -5149 -18458 -17093 -11891 -14546 -9367 5254 4557 15515 112
2802 112 -13584 934 17635 13520 9411 4770 9353 6967 536 -9407 -2903 -16972 -23729 -9652
2788 -9652 7162 14593 -2258 -1446 -8015 2704 -5645 -7210 2705 498 -3609 1831 14788 28928
2774 28928 29463 6929 -11588 703 -10350 -23329 -17233 -16891 -18781 -35196 -45122 -32968 -13556
2761 -13556 6265 2978 -12323 -11315 -18326 -16402 -9899 -6827 -10502 8512 14859 2016 12 8862
2747 8862 8839 16135 21821 16621 22669 22927 3921 -16883 -13536 -6463 -3760 -11404 -5396 -14526 -20269
2732 -20269 -22969 -17898 -16086 -12812 -6346 15481 4703 -3235 -6855 -16633 -12725 -12768 -5705 9082
2718 9082 16768 10081 -4632 -18856 -5446 5682 -766 -14526 -6506 -16556 -10461 -1444 3972
2705 3972 -7868 -19815 -23892 -23565 -18751 -8357 -4551 7093 13236 8651 7235 1858 3425 -5932
2691 -5932 -11178 3124 5682 7055 4063 12788 20539 10222 -1516 -8338 -11067 -9928 -2936 19446
2677 19446 23361 19573 8785 2824 -6171 -4679 -5243 -4062 -6792 -5015 -11745 -2617 9697 7601
2663 7601 3182 -4423 -11752 -3521 3994 15616 -969 -2954 7640 13621 17067 -1237 -4163 2718
2649 2718 12928 -1349 -12582 -20180 -18743 -8487 4563 19118 29617 25582 17001 10170 -5081
2636 -5081 258 7412 14285 25917 36377 41643 45381 62664 73227 65097 39891 24080 19507
2623 19507 4993 5798 -235 -2713 -14980 -10367 -3377 6424 6730 -10327 -2431 6411 11171 8808
2609 8808 15710 23100 18771 25456 23951 22576 16118 5407 -15879 -37830 -27848 -13009 1021 -4568
2595 -4568 -8892 2995 20297 11012 1463 15670 13672 18796 24270 20406 -873 -1916 -1022 208
2581 208 2060 -1197 12241 27718 15115 11770 14879 27636 30185 21241 19970 16770 16967 3016
2567 3016 -13432 -12780 -16177 -17982 -15945 -6258 -17838 -14537 -16462 -12222 -11408 -23243 -18932 -10021 -7163
2552 -7163 -6977 670 13786 4483 -2714 9427 -7507 -12412 -6119 -8517 -32143 -31514 -32876 -32312 -29893
2537 -29893 -23557 5476 29018 32892 27168 685 -4867 14424 15364 3363 6200 -9739 -8763 7507
2523 7507 10312 5127 -10602 -17570 -15484 -8553 -2072 -15266 -11933 -2907 -6987 1114 -1942 15207
2509 15207 20415 2708 181 5181 12160 11596 14919 17155 8810 10023 27174 2461 -2291 13633
2495 13633 21971 21885 34192 34100 63 -18696 -415 3513 4012 10809 28382 27029 23318 25373 14714
2480 14714 19463 32133 19720 -1758 -24363 -34933 -37549 -34681 -17594 -2976 6894 5214 965
2467 965 -10568 3383 17625 31485 12098 -8491 -8044 3121 7277 4573 -22253 -23273 -8410
2454 -8410 2768 14428 -1960 -11798 720 7563 5009 10476 18387 25256 37488 22898 5232
2441 5232 -4460 -12681 -1708 16024 20099 13340 12401 13687 11974 11942 11668 22184 22516 29960 28266
2426 28266 19604 21905 17398 24762 22200 36669 37493 17471 667 -13188 -2019 3508 -8906
2413 -8906 -15871 -11777 9539 20839 -242 -3876 3907 -12988 -9451 10652 12107 6370 11209 24523
2399 24523 24741 23122 30238 17946 -6 244 6262 27727 27631 28157 24237 20061 17649 10050 11316
2384 11316 4107 -646 -13697 -12107 4232 2026 6919 -7670 -22090 -29091 -33721 -29904 -23767 -12050
2370 -12050 -5655 3410 -919 -7694 7961 8891 9765 1796 -15396 -22214 -21772 -16421 -31897 -27597 -19733
2355 -19733 -20478 -10393 6356 18329 10366 2614 10883 17959 17275 10318 1651 940 703 5602 -3607
$$ [...]
##END NTUPLES=NMR SPECTRUM
##END=
