##TITLE=Analysis number 330453
Compound Code cc 66926
Book Reference 510/102
Project Code adrs
Chemist Name jimp
##JCAMPDX= 6.0         $$ Bruker NMR JCAMP-DX V2.0
##DATA TYPE= NMR SPECTRUM
##DATA CLASS= NTUPLES
##ORIGIN= Bruker BioSpin GmbH
##OWNER= nmr
$$ XWIN-NMR		Version 3.5
$$ Tue Nov 27 10:21:03 2007 GMT Standard Time (UT+0h)  MAYBRIDGE\nmr@NMR_250MHZ
##.OBSERVE FREQUENCY= 250.131544655141
##.OBSERVE NUCLEUS= ^1H
##.ACQUISITION MODE= SIMULTANEOUS (DQD)
##.ACQUISITION SCHEME= undefined
##.AVERAGES= 16
##.DIGITISER RES= 18
##SPECTROMETER/DATA SYSTEM= dpx250
##.PULSE SEQUENCE= zg30
##.SOLVENT NAME= CDCl3
##.SHIFT REFERENCE= (INTERNAL, CDCl3, 0, 16.4439)
##AUDIT TRAIL= $$ (NUMBER, WHEN, WHO, WHERE, WHAT)
$$ ##TITLE= Audit trail, XWIN-NMR		Version 3.5
$$ ##JCAMPDX= 5.01
$$ ##ORIGIN= Bruker BioSpin GmbH
$$ ##OWNER= nmr
$$ C:\u/data/dgb/nmr/ADRS/2290/pdata/1/auditp.txt
$$ ##AUDIT TRAIL=  $$ (NUMBER, WHEN, WHO, WHERE, WHAT)
(   1,<2007-11-27 10:20:32.65 +000>,<MAYBRIDGE\nmr>,<NMR_250MHZ>,
      <created by zg, POWCHK disabled, PULCHK disabled
       configuration hash MD5:
       76 6E 9A 78 1E 09 19 81 EC 84 63 8F B0 6A 59 2D
       data hash MD5: 64K
       2A 8C 20 3B B5 D6 78 06 7D A0 C7 CA 04 EB 2F 57>)
(   2,<2007-11-27 10:20:51.28 +000>,<MAYBRIDGE\nmr>,<NMR_250MHZ>,
      <Start of raw data processing
       ef LB = 0.3 FT_mod = 6 PKNL = 1 SI = 32K 
       data hash MD5: 32K
       C3 90 96 17 ED 82 04 03 5D 64 CF 87 4E 1D 3A CA>)
(   3,<2007-11-27 10:20:53.00 +000>,<MAYBRIDGE\nmr>,<NMR_250MHZ>,
      <apk 
       data hash MD5: 32K
       CC 20 7B 37 14 A9 FA C4 5E 2B F8 A4 63 B7 9C 97>)
(   4,<2007-11-27 10:20:53.89 +000>,<MAYBRIDGE\nmr>,<NMR_250MHZ>,
      <abs ABSG = 5 
       data hash MD5: 32K
       DB 80 BE B0 BF A2 8F 3F 85 95 BE 16 F9 1F 91 8E>)
$$ ##END=
$$ 
$$ hash MD5
$$ EE 15 71 7B F3 81 60 C3 27 39 3F DB D4 7E E5 03
##$RELAX= 
##$RELAX= 
##$RELAX= 
##$RELAX= 
##$RELAX= 
##$RELAX= 
##$RELAX= 
$$ Bruker specific parameters
$$ --------------------------
##$DU= <C:\u>
##$EXPNO= 2290
##$NAME= <ADRS>
##$PROCNO= 1
##$TYPE= <nmr>
##$USER= <dgb>
##$AMP= (0..31)
100 100 100 100 100 100 100 100 100 100 100 100 100 100 100 100 100 100 
100 100 100 100 100 100 100 100 100 100 100 100 100 100 
##$AQSEQ= 0
##$AQ_mod= 3
##$AUNM= <au_zg>
##$AUTOPOS= <49 >
##$BF1= 250.13
##$BF2= 250.13
##$BF3= 250.13
##$BF4= 250.13
##$BF5= 500.13
##$BF6= 500.13
##$BF7= 500.13
##$BF8= 500.13
##$BYTORDA= 1
##$CFDGTYP= 0
##$CFRGTYP= 5
##$CHEMSTR= <none>
##$CNST= (0..31)
1 1 145 1 1 1 1 1 1 1 1 1 1 1 1 1 1 1 1 1 1 1 1 1 1 1 1 1 1 1 1 1 
##$CPDPRG= <>
##$CPDPRG1= <>
##$CPDPRG2= <>
##$CPDPRG3= <>
##$CPDPRG4= <mlev>
##$CPDPRG5= <mlev>
##$CPDPRG6= <mlev>
##$CPDPRG7= <mlev>
##$CPDPRG8= <mlev>
##$CPDPRGB= <>
##$CPDPRGT= <>
##$D= (0..31)
0 1 0 0 0 0 0 0 0 0.06 0 0 0 0 0 0 0.0002 0 0 0 0 0 0 0 0 0 0 0 0 0 0 
0 
##$DATE= 1196158830
##$DBL= (0..7)
120 120 120 120 120 120 120 120 
##$DBP= (0..7)
150 150 150 150 150 150 150 150 
##$DBP07= 0
##$DBPNAM0= <>
##$DBPNAM1= <>
$$ [...]
##$SUBNAM7= <"">
##$SUBNAM8= <"">
##$SUBNAM9= <"">
##$SW= 20.6930455092707
##$SWIBOX= (0..15)
0 0 3 0 0 0 0 0 0 0 0 0 0 0 0 0 
##$SW_h= 5175.983436853
##$TD= 65536
##$TD0= 1
##$TE= 295.16
##$TE2= 300
##$TE3= 300
##$TEG= 300
##$TL= (0..7)
0 120 120 120 120 120 120 120 
##$TP= (0..7)
150 150 150 150 150 150 150 150 
##$TP07= 0
##$TPNAME0= <>
##$TPNAME1= <>
##$TPNAME2= <>
##$TPNAME3= <>
##$TPNAME4= <>
##$TPNAME5= <>
##$TPNAME6= <>
##$TPNAME7= <>
##$TPOAL= (0..7)
0.5 0.5 0.5 0.5 0.5 0.5 0.5 0.5 
##$TPOFFS= (0..7)
0 0 0 0 0 0 0 0 
##$TUNHIN= 0
##$TUNHOUT= 0
##$TUNXOUT= 0
##$USERA1= <user>
##$USERA2= <user>
##$USERA3= <user>
##$USERA4= <user>
##$USERA5= <user>
##$V9= 5
##$VALIST= <valist>
##$VCLIST= <CCCCCCCCCCCCCCC>
##$VD= 0
##$VDLIST= <DDDDDDDDDDDDDDD>
##$VPLIST= <PPPPPPPPPPPPPPP>
##$VTLIST= <TTTTTTTTTTTTTTT>
##$WBST= 1024
##$WBSW= 4
##$XGAIN= (0..3)
0 0 0 0 
##$XL= 0
##$YL= 0
##$YMAX_a= 219064
##$YMIN_a= -311718
##$ZGOPTNS= <>
##$ZL1= 120
##$ZL2= 120
##$ZL3= 120
##$ZL4= 120
##$ABSF1= 16.44388
##$ABSF2= -4.249292
##$ABSG= 5
##$ABSL= 3
##$ALPHA= 0
##$AQORDER= 0
##$ASSFAC= 0
##$ASSFACI= 0
##$ASSFACX= 0
##$ASSWID= 0
##$AUNMP= <proc_1d>
##$AZFE= 0.1
##$AZFW= 0.1
##$BCFW= 0
##$BC_mod= 0
##$BYTORDP= 0
##$COROFFS= 0
##$CY= 12.5
##$DATMOD= 1
##$DC= 0
##$DFILT= <>
##$DTYPP= 0
##$F1P= 14.0000005364418
##$F2P= -0.99999901652339
##$FCOR= 0.5
##$FTSIZE= 32768
##$FT_mod= 6
##$GAMMA= 0
##$GB= 0
##$INTBC= 1
##$INTSCL= 1
##$ISEN= 128
##$LB= 0.3
##$LEV0= 0
##$LPBIN= 0
##$MAXI= 10000
##$MC2= 0
##$MEAN= 0
##$ME_mod= 0
##$MI= 0
##$NCOEF= 0
##$NC_proc= -3
##$NLEV= 6
##$NOISF1= 0
##$NOISF2= 0
##$NSP= 0
##$NTH_PI= 0
##$NZP= 0
##$OFFSET= 16.44388
##$PC= 1
##$PHC0= 172.4297
##$PHC1= 9.240701
##$PH_mod= 1
##$PKNL= yes
##$PPARMOD= 0
##$PSCAL= 4
##$PSIGN= 0
##$REVERSE= no
##$SF= 250.13001953969
##$SI= 32768
##$SIGF1= 0
##$SIGF2= 0
##$SINO= 400
##$SIOLD= 32768
##$SREGLST= <1H.CDCl3>
##$SSB= 0
##$STSI= 32768
##$STSR= 0
##$SW_p= 5175.98343685301
##$SYMM= 0
##$S_DEV= 0
##$TDeff= 65536
##$TDoff= 0
##$TI= <Analysis number 999999
Compound Code 99
Book Reference 9
Project Code 9>
##$TILT= no
##$TM1= 0
##$TM2= 0
##$TOPLEV= 0
##$USERP1= <user>
##$USERP2= <user>
##$USERP3= <user>
##$USERP4= <user>
##$USERP5= <user>
##$WDW= 1
##$XDIM= 32768
##$YMAX_p= 343266539
##$YMIN_p= -229088
$$ End of Bruker specific parameters
$$ ---------------------------------
##NTUPLES= NMR SPECTRUM
##VAR_NAME=  FREQUENCY,     SPECTRUM/REAL,   SPECTRUM/IMAG
##SYMBOL=    X,             R,               I
##VAR_TYPE=  INDEPENDENT,   DEPENDENT,       DEPENDENT
##VAR_FORM=  AFFN,          ASDF,            ASDF
##VAR_DIM=   32768,         32768,           32768
##UNITS=     HZ,            ARBITRARY UNITS, ARBITRARY UNITS
##FACTOR=    0.157963299565203, 1,           1
##FIRST=     4113.10804601306, 0,            0
##LAST=      -1062.87539083995, 0,           0
##MIN=       -1062.87539083995, -229088,     0
##MAX=       4113.10804601306, 343266539,    0
$$ Real data points
##PAGE= N=1
##DATA TABLE= (X++(R..R)), XYDATA
$$ [...]
18533D00007j09905r8560n9297q4900r870J4093L3394j6700k4084K0538K3428
18522H8144N1422J9592l3334j16625J9925K0236j4462m05r1562J6068P004p827
18510d1824l010n794K1186p8987J682J03020P6204j1017l4812k6039J8471n8965
18498c9885L6529k6543p0155P24P2938J2702k3824L4488r229J506O392J46897
18486A42540L9121m778J4783o9328p3405k3396q319k5334K8426M0587m2582M1573
18474E9888J5266p745Q5106J03703M0304j5723n676j0544j4135K2765n5608q8796
18462A28805m8788l3937p3173L4518L2346J7725j1745L953K9142L6334L6341J7729
18450A69250K3180O026j1099k0177n8459j0728k0334m215m3226q5659M1334O4397
$$ plain form
18533 400007 290102 191542 132245 47345 37475 51568 84962 68262 44178 64716 88144
18522 88144 139566 159158 125824 9199 29124 49360 34898 34493 -57069 -41001 -33997 -41824
18510 -41824 -44834 -50628 -29442 -108429 -106747 -3727 72477 61460 26648 609 19080 -39885
18498 -39885 -3356 -29899 -100054 -99330 -26392 -13690 -37514 -3026 -12255 -10749 -4357 142540
18486 142540 181661 176883 191666 122338 48933 25537 17218 -8116 20310 60897 18315 59888
18474 59888 75154 67409 152515 256218 296522 280799 275123 264579 250444 273209 217601 128805
18462 128805 80017 46080 -27093 7425 39771 57496 45751 49704 78846 115180 151521 169250
18450 169250 192430 198456 187357 167180 108721 97993 77659 73444 30218 -55441 -14107 50290
18438E0290l0542k9894J6816j357N483m631l7658m4821L1294M6931L6555l1717
18426F749n6867l0964M0478K1031L7372j1653l8834J1830j1409m4014j1861N4091
18414c4051k1179J7094J4070R408j3962K6909Q685n899N2783N207j8035K0119
18402F1149l4713n362j3717M013K6535j6619j8162l6386n0787o581K6155L4759
18390b9716R061M1594l7979k4075K0974j2707L8177L7235J4482N769m9777K322
18378A5360Q2870n553j8081n7133j9949L554R381M2256K4469m2254j7594L6900
18366E4226K8824j6006K3947m1540p411L4872O309L5879j3746j26679J480k055
18354b1900L8248n9902k0789M485P497K1174L6617L4258k5423p3814M96L2919
$$ plain form
18438 50290 19748 -10146 6670 5313 10796 6165 -31493 -76314 -45020 1911 38466 6749
18426 6749 -50118 -81082 -40604 -19573 17799 6146 -32688 -20858 -32267 -76281 -88142 -34051
18414 -34051 -55230 -38136 -24066 -14658 -28620 -1711 6974 1075 53858 59065 41030 61149
18402 61149 26436 21074 7357 11370 37905 21286 3124 -33262 -84049 -90630 -64475 -29716
18390 -29716 -20655 20939 -17040 -41115 -20141 -32848 5329 42564 57046 62815 13038 15360
18378 15360 98230 92677 74596 17463 -2486 1068 10449 52705 77174 34920 17326 54226
18366 54226 83050 67044 90991 49451 42040 76912 83221 119100 105354 -21325 -19845 -21900
18354 -21900 16348 -43554 -64343 -59858 -52361 -31187 5430 39688 14265 -59549 -59053 -26134
18342b6134O3022J7908J293J326O2208L2217j05528k5685M7735M331l5461J6808
18330E4040J2719j7599m0832o6084j3413L3234N8982N8261j9559l2165k2605j8949
18318a3970m383M9662p486j3179l320o8324N4818K0016j217j080L9870k549m3700
18305E158m2716o5539j5924k72J7295Q1704M6032k4058q302L6110J8194l3101
18293A4581M771K6829J2852K1991k8544n6875j3231J4475O5625K6865l9416R42
18281E0865k2985M149O9907M8812l6149m5820N487J1706k3250n8478k393r945
18269h094m4765J5570N416J1697m3789j6224M8317J8129n6404L6087O8682N091
18257C9713P665J8507j7912J3530k9802n4086l7515L5279P0007J2487L2876L2351
$$ plain form
18342 -26134 36888 54796 56089 57415 119623 151840 46312 20627 68362 72693 37232 54040
18330 54040 66759 49160 8328 -57756 -71169 -37935 21047 79308 59749 27584 4979 -13970
18318 -13970 -18353 31309 23823 10644 7324 -61000 -6182 13834 12617 11537 51407 48858 5158
18305 5158 -37558 -103097 -119021 -119293 -101998 -20294 25738 1680 -6622 29488 47682 14581
18293 14581 19352 46181 59033 81024 52480 -4395 -17626 -3151 62474 89339 49923 50865
18281 50865 27880 32029 101936 150748 114599 68779 74266 85972 62722 4244 1851 -8094
18269 -8094 -52859 -37289 -31873 -20176 -63965 -80189 -31872 -13743 -70147 -34060 34622 39713
18257 39713 47378 65885 47973 61503 31701 -22385 -59900 -24621 45386 57873 90749 123100
18245A23100p501k2397L5053l37j3083j6147k1907l3535M2262l9435r133K3267
18233F0207O614k0316M8582K5903m7069L3245P305J2393n059n3769K2781j3109
18221G7708m4332K8745R6278k2578n3076k6708j8782J077k6999l8884j5749L9628
18209c672k4928r157j20J8605O1216O1840N0531q11n7546k4106M1863l6209j7726
18196E9780J2783J8212L871Q980O3122k227n4115m2395l039J7239J4325J6471
18184A13007N5166K5330K0729J9976k0372m514n7498p0453L6214K2983n2069k7147
18172F1352J4233Q997N7200k9985m3426M2870P3269M4003K2143l3235o3083m5890
18160A08448P3335j2431k3610Q3178L9155M5498O236o9656j0407N6954Q033K850
$$ plain form
18245 123100 115599 93202 128255 127918 114835 98688 76781 43246 85508 46073 36940 60207
18233 60207 66821 46505 95087 120990 73921 107166 114471 126864 121805 68036 90817 77708
18221 77708 33376 62121 158399 135821 82745 56037 37255 38332 11333 -27551 -43300 -3672
18209 -3672 -28600 -37757 -37877 -19272 41944 103784 154315 153504 95958 71852 113715 77506 59780
18196 59780 72563 90775 94646 103626 166748 164521 110406 68011 64972 82211 96536 113007
18184 113007 168173 193503 214232 234208 213836 209322 151824 81371 117585 140568 88499 61352
18172 61352 75585 84582 141782 111797 68371 111241 184510 228513 250656 217421 154338 108448
18160 108448 181783 169352 145742 228920 268075 313573 319809 250153 239746 296700 304733 307583
18148C07583n3178M6100J28269N7279O1072j623O5675J3114Q7197P9780P5920
18137H67188N4165J06969N2156P8193J39132L20465L62644L63646L43793L17190
18127C005541K58814K99344L67017M71694N72939O69209Q68242J083802J271806
18118H868408J450155J600160J901144K333633L400390N803855J1180733K2199346
18110E8737824L6569365K4412329j1345157k3902185l1132195k0441687j1400833
18103B1497461o561317l956310k437478j626736j106343q04788o96190n28081
18095C780218l46323k48306j65749j05775j21530n4986L2726l0280J03474K30325
18085C073794K64134L05541L75821M52353N71143Q33008J057703J578993K693511
$$ plain form
18148 307583 254405 300505 428774 486053 547125 545502 611177 624291 711488 791268 867188
18137 867188 921353 1028322 1080478 1158671 1297803 1618268 1980912 2344558 2688351 3005541
18127 3005541 3264355 3563699 3930716 4402410 4975349 5644558 6512800 7596602 8868408
18118 8868408 10318563 11918723 13819867 16153500 19553890 25357745 36538478 58737824
18110 58737824 95307189 119719518 108374361 84472176 53339981 32898294 21497461
18103 21497461 14936144 10979834 8542356 6915620 5809277 5004489 4308299 3780218
18095 3780218 3433895 3185589 3019840 2914065 2792535 2737549 2770275 2739995 2843469 3073794
18085 3073794 3337928 3643469 4019290 4471643 5042786 5875794 6933497 8512490 11206001
18076A1206001M691096P210492P595263K425668l567393o808069p009274n009199
18068A0734585l176356k061588j254901q05593n43388m20645l24266k49534j41485
18059A756829j08640j20890l3816J4226n203m943R9787J43380J38570J89118R5124
18048B163542P1172O4805m3661K9592J32836J33778Q4050O3418K99500L62211
18038C361243L44594N16151N35504P48692Q94832J033897J274674J523143K240882
18029A2473612L515255N975224R678075J2409003R987430K717374o354919j1251794
18021C9149260j1483943q833162n714990l631380k365712j486705j039144p26731
18013C867493n85911m36186l67922k50116j30835j27862n0117N942n9375j03417
$$ plain form
18076 11206001 15897097 23107589 30702852 33128520 29561127 22753058 15743784 10734585
18068 10734585 7558229 5496641 4241740 3436147 2892759 2472114 2147848 1898314 1756829
18059 1756829 1648189 1527299 1493483 1507709 1502506 1497563 1597350 1740730 1879300 2068418 2163542
18048 2163542 2234714 2299519 2255858 2285450 2418286 2552064 2636114 2699532 2999032 3361243
18038 3361243 3705837 4221988 4757492 5506184 6401016 7434913 8709587 10232730 12473612
18029 12473612 15988867 21964091 31642166 44051169 54038599 56755973 50401054 39149260
18021 39149260 27665317 18832155 13117165 9485785 7120073 5633368 4594224 3867493
18013 3867493 3281582 2845396 2477474 2227358 2096523 1968661 1918544 1924486 1865111 1761694
18003A761694j19472K1580J09209J27289O683m9146j11483m4815n3422q498j1186
17992A628433R6553N1048K6253J03879K17837K91372M13369M22455M87196O00860
17982D339255P00021R76308J669720K713201M559742O745087N721916L08381m125226
17973B3608405o329748n710223l726774k303775j476292j016642o77394l65528
17965B002029k84747k85720k14130j25607j34834q9389m682n2485J1032l749J1732
17954H29450p3649r889m377P5392O8309L861j00256j48908q5999l4969m8617k317
17942D68031n4744o5020m9485N750K8395L3509j3802K9534o441L3097M2158m0071
17930D10911K9455L5933j7221J8353L8439J35696O7514j4376R087J03586J22471
$$ plain form
18003 1761694 1642222 1663802 1773011 1900300 1906983 1857837 1746354 1701539 1648117 1639619 1628433
17992 1628433 1724986 1776034 1802287 1906166 2124003 2415375 2828744 3251199 3738395 4339255
17982 4339255 5039276 6015584 7685304 10398505 14958247 21703334 27425250 27733631 23608405
17973 23608405 17278657 11568434 7841660 5537885 4061593 3044951 2367557 2002029
17965 2002029 1717282 1431562 1217432 1091825 956991 867602 862920 810435 821467 817718 829450
17954 829450 755801 745912 741535 816927 885236 889097 788841 639933 553934 518965 470348 468031
17942 468031 413287 348267 298782 304532 332927 366436 352634 382168 375727 408824 450982 410911
17930 410911 440366 476299 459078 477431 515870 651566 719080 704704 713791 817377 939848
17919I39848J10210J87448J96822J18005J29150K17079J98902J32887P9119J41621
17909B451091J64523K03051K05014L18575L64822M78272N67955P14773Q95230
17900F363306J078120J406384J782015K557770L906349N533957O953479P270509
17892C6851889O079024L360619l07083l914912o411282p198364o439907n009595
17884A7010389l418492k004592j033049l54490J96636O71712J218997K020046
17876A4307157L213856M848293O589138P374365O584498M137337M88792l295779
17868D4247657o432314p854431p510516o139259m548987l129989k083165j405781
17860E143215j006848p74816m77528l78872k42598k50518j85593j28431j21069
$$ plain form
17919 939848 1050058 1237506 1434328 1552333 1681483 1898562 2097464 2230351 2309470 2451091
17909 2451091 2615614 2818665 3023679 3342254 3707076 4185348 4753303 5468076 6363306
17900 6363306 7441426 8847810 10629825 13187595 17093944 22627901 29581380 36851889
17892 36851889 42930913 46291532 45984449 42069537 35658255 28459891 22019984 17010389
17884 17010389 13591897 11587305 10554256 10199766 10396402 11068114 12287111 14307157
17876 14307157 17521013 22369306 28958444 36332809 42917307 47054644 47543436 44247657
17868 44247657 37815343 29960912 22450396 16311137 11762150 8632161 6548996 5143215
17860 5143215 4136367 3361551 2884023 2505151 2262553 2012035 1826442 1698011 1576942
17851A576942o1733l8708o071j8331k7836m5172q2414j30172r3281r8076r6610
17840H78538j37125j44151p1916p524k3982l1829m9598q742o2633r19K2995k3850
17828C39264q4329m204J1186P169k2625m2745l829o8104j0671n8365o6180n971
17816i404m850J3163N3184M6577O807o4742j2142j7761o876O0017k4519R556M1367
17803I0377J6018l3488l3600m0842J7643J123j5227K9111M1378k1908j2923k6014
17791A1648j8728L5195P9261L9139j3368o4204J9444n9856r50Q616j9439m2732
17779b5974l737K1833k2146m1281L4670N1335k6766o6059j4326L4751n0211L6752
17767g1159Q7383n342K5697n082k6806J0118p864j8362P4311O4687J966n0080
$$ plain form
17851 1576942 1515209 1476501 1470430 1452099 1424263 1379091 1296677 1166505 1073224 975148 878538
17840 878538 741413 597262 525346 517822 493840 462011 412413 403671 341038 340119 363114 339264
17828 339264 254935 250731 261917 269086 246461 203716 199887 131783 121112 62747 -3433 -9404
17816 -9404 -14254 -1091 52093 98670 105477 40735 28593 10832 3956 63973 39454 49010 90377
17803 90377 106395 72907 39307 -1535 16108 17231 2004 31115 72493 50585 37662 11648
17791 11648 -7080 28115 107376 146515 133147 68943 88387 28531 27581 36197 16758 -25974
17779 -25974 -29711 -7878 -30024 -71305 -36635 14700 -12066 -78125 -92451 -57700 -107911 -71159
17767 -71159 16224 10882 36579 31497 4691 14809 6945 -11417 62894 127581 129547 79467
17755G9467j47386K2683M5389M5164J5361k9730m3984O0808O214j3709K2849p088
17743E6038k8889K6726p966m2719J2782j9460J5096K7891j6431k3259L860K541
17731F210p1947R789N9465k3556J0838L6494L6295K349N179K5038N4395L1106
17719A81655k2381p8440n8954m2357K4625N392q922P994J15k7938j1182k6891
17707e7284O4511J4358j225L9300j1540J4398J8639m6203k3563K3515J5947K671
17695E3524K7101R033k8079m8645n6186k1420k1620K2636P1077J3369R41j3620
17683H111j7744l1725J2583j359j4806J0709O2056N5385j1672j2094P4079k1685
17671A11838m7346j6400j7824n5663K9525Q4906M2M80l704j4292m2401l4390j8719
$$ plain form
17755 79467 -67919 -45236 153 45317 60678 30948 -13036 47772 53986 40277 63126 56038
17743 56038 27149 53875 45909 3190 15972 -3488 11608 39499 23068 -191 3669 6210
17731 6210 -65737 -55948 3517 -20039 -9201 27293 63588 65937 71116 96154 150549 181655
17719 181655 159274 80834 21880 -20477 4148 9540 618 8612 8727 -19211 -30393 -57284
17707 -57284 7227 21585 20360 59660 48120 62518 81157 34954 11391 34906 50853 53524
17695 53524 80625 89658 61579 12934 -43252 -64672 -86292 -63656 7421 20790 21731 8111
17683 8111 -9633 -41358 -28775 -30134 -44940 -34231 27825 83210 71538 59444 133523 111838
17671 111838 64492 48092 30268 -25395 4130 89036 89078 89558 85854 71562 29161 -5229 -23948
17658b3948j1987J3047Q2608N0681L322Q6979K0699L1155R040j06305q9222N80
17646F6649j0105n1669r4032J1835j5478J956L3197R0487N0272j9523K5354K1522
17634A10465L6957p29M941K8260K4316k7785p5752m7678k4306N1970J187j2848
17622F8998K3211l7221L6407K0587k0092l2524n0701K7768J3836o1218N7989N7221
17610A04261n7235k7293k0432l4659J27L2388L8033n9030o588K0336O1098J6237
17598F7243j5019K3369N503l9890L7043o097m5226j1182K5279Q028k8345J2532
17586C3238k0949l67j3800n295L7079j2931J7243K8246M252m4068j5827P066N992
17573A9879l6014K0046k1478l1780j3456M5074N7691P973m8977K2459K8395O650
$$ plain form
17658 -23948 -35935 -22888 59720 110401 113723 200702 221401 252556 261596 155291 66069 66649
17646 66649 56544 4875 -89157 -77322 -92800 -90844 -57647 32840 83112 63589 88943 110465
17634 110465 147422 146693 151634 179894 204210 176425 100673 52995 28689 80659 81846 68998
17622 68998 92209 54988 91395 111982 91890 59366 8665 36433 50269 -10949 47040 104261
17610 104261 47026 19733 -699 -35358 -35231 -2843 35190 -23840 -30428 -10092 51006 67243
17598 67243 52224 75593 81096 41206 78249 72152 26926 15744 41023 49051 20706 33238
17586 33238 12289 11922 -1878 -7173 29906 16975 34218 62464 66716 22648 6821 13887 19879
17573 19879 -16135 3911 -17567 -49347 -62803 -17729 39962 47935 -1042 21417 49812 56462
17561E6462Q4244K0804n3759k5409L5098K1364j8877j1534n6207o684j1023k6588
17549G891M3553n472j7791q926K4565P3530N611p0596m2666r545o9161J8598P9098
17536B8689L5857q0254R962O4388P6524l1018L990j1075Q933j6470m4632l3895
17524A0999M1387L9515J5840r056k3361o85J1284j1622L671N9593M4469K4719
17512B06753J02328P3855L2208L7876J12981P2776o7618j09554q7128q9083p0014
17501B15380p4666k616l0605j9528K6563m5236k9691J2146j1962j0008J0678M2716
17489H3171K8512l3818J074j4886m004j5594L699l1502p2702o5451L5773P6235
17477i493J4166Q012k534n7177L3677J6984q50j234K0677P77k1475l7034M4710
$$ plain form
17561 56462 140706 161510 107751 82342 117440 138804 119927 108393 52186 45502 34479 7891
17549 7891 51444 45972 28181 19255 43820 117350 122961 52365 9699 154 -69007 -50409 28689
17536 28689 64546 -15708 -5746 58642 135166 104148 108138 97063 105996 89526 44894 10999
17524 10999 52386 91901 107741 98685 75324 74639 85923 74301 77972 137565 182034 206753
17512 206753 309081 382936 415144 453020 566001 638777 571159 461605 374477 285394 215380
17501 215380 140714 138098 107493 87965 114528 69292 39601 51747 39785 29777 40455 83171
17489 83171 111683 77865 78939 64053 60049 44455 48154 16652 -56050 -121501 -85728 -9493
17477 -9493 4673 12685 10151 -47026 -13349 3635 2785 1551 22228 23005 1530 -35504 9206
17464I206N8619n7440O4119L4529L6060K1839k1844l5430n6563p3816K3334j17
17452B496P1415J2110K0514M9233j2664J4385O6974J06275K16016J82451n6173
17441F73032j56002k30904j13727k8731l0610r2102l2686J3616O823N4094K1478
17430H4281l0071k7521R764q901r279n784k776j5784k3020j1982J6402O7194N8402
17417A00925k7426p7756m0396j6413K3470L3420l1758J2189N2549N018o3606K7824
17405a960L8705q248K1179J0663J0654m5336n4756r209L769q243O0400L7852l77
17392E5093k8650j0128l6591n2468j6414K6002L7084J210N4626M6411K4680k280
17380I8575k0454n0739p0692k6623M9441O3423l7686o6934Q138O9425K2819J2086
$$ plain form
17464 9206 67825 10385 74504 109033 145093 166932 145088 109658 53095 -20721 2613 2496
17452 2496 73911 86021 106535 155768 143104 157489 224463 330738 546754 729205 673032
17441 673032 517030 286126 172399 143668 113058 20956 -11730 1886 8709 62803 84281
17430 84281 54210 26689 36453 27552 18273 12489 9713 -6071 -29091 -41073 -24671 42523 100925
17417 100925 73499 -4257 -44653 -61066 -37596 -4176 -35934 -23745 28804 33822 -29784 -1960
17405 -1960 36745 28497 49676 60339 70993 25657 -29099 -38308 -34539 -42782 17618 55470 55093
17392 55093 26443 16315 -20276 -72744 -89158 -63156 -26072 -24862 29764 76175 100855 98575
17380 98575 78121 27382 -43310 -69933 -20492 42931 5245 -61689 -53551 15874 38693 50779
17368E0779l9616j2082k654O5469j7382j9735k3318k4231L7376J8533N0591n621
17356G8109q244K4779l346j2528m5734K8110L4832m6553O71n237n8199m0199m7833
17343a01372m5893P2668N175l5200J3415J846O7800K4824j3502L0276k3590K3789
17331B0236M6688K8547m545q2560J0389M0148K4386j5007J4481J767k2139j2254
17319E0137L5666L0893K3211k4204j1935l0005j5772L508L7463N0590L7166L8296
17307B25014L3151m0227r8330q5415k1164M2874j1709k6271p7285J5175M3849
17296c38k5518P7185Q2944P2135M4424J856l301J0038k918p3180Q3176j5357q0816
17283A70330p3301m7787L3975Q4O321L760o880N173L5093n718M0969J2676p2087
$$ plain form
17368 50779 11163 -919 -3573 61896 44514 24779 1461 -22770 14606 33139 83730 78109
17356 78109 69865 94644 91298 78770 33036 61146 95978 49425 50096 44859 -13340 -53539 -101372
17343 -101372 -147265 -74597 -69422 -104622 -91207 -89361 -21561 3263 -10239 20037 -3553 20236
17331 20236 66924 95471 90926 8366 18755 58903 83289 68282 82763 84530 62391 50137
17319 50137 85803 116696 139907 115703 103768 73763 57991 61499 98962 149552 186718 225014
17307 225014 258165 217938 119608 34193 13029 55903 44194 17923 -59362 -44187 -338
17296 -338 -25856 51329 134273 206408 250832 252688 249387 259425 256507 183327 266503 251146 170330
17283 170330 97029 49242 83217 83301 89622 93382 86502 91675 126768 121050 162019 174695 102608
17270A02608m6833m3685K7349J00547k3659r286O392j2938j0758l2180J580m4921
17258A4216j5296J3766k7472n02k5218n9374R776L2552M6921l734k5971j4427
17246e4763M0621k2551P770l4577M3K8413J4286N3981j945j4217K5649m7463j9408
17233b4161J7767l1783n313r705K1768K7431p6273m8424l7747O651O6587O9314
17221b3888j756l0723L6045J7412M5977l6779m7790j0746m9649J703K3582P1521
17209e091k322P257k9106P274m2409K9787L7711M6853O8604o4232o6554J1292
17197i36m022K5997J7326k1756k3414J6822L3595N699J7033R293r279R711O138
17184H2207k2597j077k1511k7542j4877P964l2143N3061J1057l3489P2L4963j9039
$$ plain form
17270 102608 55775 12090 39439 139986 116327 107041 113433 100495 89737 57557 59137 14216
17258 14216 -1080 12686 -14786 -15288 -40506 -99880 -90104 -57552 -10631 -14365 -40336 -54763
17246 -54763 -14142 -36693 -28923 -63500 -63457 -35044 -20758 33223 31278 17061 42710 -4753 -24161
17233 -24161 -6394 -38177 -43490 -53195 -31427 -3996 -80269 -128693 -166440 -159789 -93202 -23888
17221 -23888 -25644 -56367 -20322 -2910 43067 6288 -41502 -52248 -101897 -100194 -76612 -5091
17209 -5091 -7413 -156 -29262 -21988 -64397 -34610 3101 49954 118558 54326 -12228 -936
17197 -936 -4958 21039 38365 16609 -6805 10017 43612 49311 66344 75637 66358 76069 82207
17184 82207 59610 58533 37022 9480 -5397 2567 -29576 23485 34542 1053 1125 36088 17049
17171A7049k6071L6160L1882L559J2586J5497n5259L6694L1648L7820J8856m4045
17159A16376m379j0027r0614K2231M5660j587q0345J6295N5156P0283N2855N335
17147A97239l9857K813M7263n005j6422J6133k7747N2142O3451o9136l708O0948
17135B78114K9631r543J7756P3402M2814N7688P5671N1116O9588J44303J78474
17124A009014J93354J52353K07165J95334J66430K53719K03891J56549J57032
17115B694841K68195L15438L14001M12001M21050N89318P17940P98378R77153
17106G508315J316461J676093K307147L486942N984380J0120063J4267013J2089350
17098E8755764L052375p536442j2486078j2191719q634210n284099l157420j860502
$$ plain form
17171 17049 -9022 27138 59020 62579 75165 90662 35403 72097 103745 141565 160421 116376
17159 116376 111997 101970 11356 33587 79247 77660 -2685 13610 68766 139049 191904 197239
17147 197239 157382 160195 207458 202453 186031 202164 174417 226559 290010 220874 217166 278114
17135 278114 307745 298202 315958 389360 432174 489862 565533 616649 686237 830540 1009014
17124 1009014 1202368 1354721 1561886 1757220 1923650 2177369 2381260 2537809 2694841
17115 2694841 2963036 3278474 3592475 4004476 4425526 5014844 5732784 6531162 7508315
17106 7508315 8824776 10500869 12808016 16294958 22279338 32399401 46666414 58755764
17098 58755764 61808139 54271697 41785619 29593900 20959690 15675591 12518171 10657669
17090A0657669j003099m73857n7604L71377P26038J129197J775165K730026M602755
17081B0457667Q121833J2361659J2354668N098927n285293j1737497j2524007
17074B8847957r582067o072985l748033k306372j540517j160384q28765n94798
17066C014036l20229k23542k10578j16240j28600j88066j60106j46203j75460
17057A345012j69014j43649q5064o4867r9861k4401L6906K3242k5885r1528p6390
17046F24501o7985l8458q8733p6166k1502o5839m6256J8198m9834k2646K4422
17035A89702k4936j1812l2550n1774j8030j3949J119M9138j5563P445Q868K8866
17023A16524m5962J0791l4085p3583n3570P6907L2071J3803N684O320J3349O380
$$ plain form
17090 10657669 9654570 9180713 9123109 9494486 10220524 11349721 13124886 15854912 20457667
17081 20457667 28579500 40941159 53295827 58394754 53109461 41371964 28847957
17074 28847957 19265890 13192905 9444872 7138500 5597983 4437599 3608834 3014036
17066 3014036 2693807 2470265 2259687 2143447 2014847 1826781 1666675 1520472 1345012
17057 1345012 1175998 1032349 947285 882418 782557 758156 795062 818304 792419 700891 624501
17046 624501 556516 518058 429325 353159 331657 265818 219562 237760 187926 165280 189702
17035 189702 164766 152954 120404 68630 50600 36651 37770 86908 71345 78790 87658 116524
17023 116524 70562 81353 47268 -26315 -79885 -2978 29093 42896 48580 54900 68249 74629
17011G4629k6035N3375O565k6839l7301p349M8662j4458l2605Q272M4022l1420
16999E9518r7435N3010L0522l6970J1272K3692k3327K9755k4824l2260K7754O3001
16987H3708l9M8669K8200p1724K7362j0742l6476Q384K9313o492p6893q150m26
16974A4694j8312n914N5244L5210j184j9322M1467l272m1784j7511N747o9586
16962b4523K5907N5675n9680k5290l609K8977M7312l747p0098m2612L4527P3728
16950C6567J1391q228J9373o074k4227P8009j4030m0388l0813o2891J6665L3953
16938I307j7976K2262J791K3154L9412n5875l8186K860K0721M5003j6836l8330
16926b693M7205j345r5262J5635qL8017m238P230j4819J6117N4080n7014m5457
$$ plain form
17011 74629 48594 101969 108534 81695 44394 37045 85707 71249 38644 46916 90938 59518
16999 59518 -37917 15093 45615 8645 19917 43609 20282 50037 25213 -7047 20707 83708
16987 83708 83669 132338 160538 88814 116176 105434 68958 77342 106655 100163 23270 15120 14694
16974 14694 -3618 -9532 45712 80922 79738 60416 101883 98611 56827 39316 45063 -24523
16962 -24523 1384 57059 -2621 -27911 -31520 -2543 44769 41022 -29076 -71688 -37161 36567
16950 36567 47958 39730 59103 53029 28802 106811 92781 52393 21580 -41311 -24646 9307
16938 9307 -8669 13593 15384 38538 77950 22075 -16111 -13251 7470 52473 35637 -2693
16926 -2693 44512 43167 -52095 -36460 -36468 1549 -2689 4541 -10278 5839 59919 2905 -42552
16913d2552O284l7830K733N5907J823J3117K6303j156L2970M4676o7577j7070
16901A7628K0515K3377q962J1544Q3209k5166j0509p835l8890J8774L1588l4304
16889H0969m789N134l787k4682N5424n037o9995k2293l792n1654q4974k0404L5185
16876a14695R2730K7951J1297J4282j1947j2152J138l1163l3176l7653K3589r632
16864g9431m921N0472m962P595L9993m8034k4769p890L3175R352N479L2716j1781
16851c006J3547k6469n1044j1900r479j9720L1521P090K1111Q286L8679J7104
16839A5720j9126l5000r455M8960p1701o5846M3719J16672M3623L0172p3592J088
16827B5234K9917J3595j2492j9605J9127l5960J5015J4371q8266k5275L2343M1173
$$ plain form
16913 -42552 -36268 -74098 -71365 -15458 -13635 -518 25785 24629 57599 102275 34698 17628
16901 17628 38143 61520 52558 64102 147311 122145 111636 103801 64911 83685 115273 80969
16889 80969 76180 81314 77527 52845 108269 103232 33237 10944 7152 -44502 -129476 -149880 -114695
16876 -114695 -21965 5986 17283 31565 19618 7466 8604 -22559 -55735 -93388 -69799 -79431
16864 -79431 -84352 -33880 -38842 -31247 8746 -39288 -64057 -71947 -38772 -29420 -23941 8775 -3006
16851 -3006 10541 -15928 -66972 -78872 -88351 -108071 -76550 -69460 -48349 -40063 -1384 15720
16839 15720 -3406 -38406 -47861 1099 -70602 -136448 -92729 23943 67566 97738 24146 25234
16827 25234 55151 68746 56254 36649 55776 19816 34831 49202 -39064 -64339 -31996 9177
16815I177M49j8533J07892P6598j17867j21510l3885k9532L8044J4898Q685K5247
16803d0337N1199Q284l329j8875k7500l1161K9210L9405J5288K9124J4781k9084
16791C7005n4450k4307N3211l7072L457J9347J4069J3717k3266l045m5689M1166
16779e857Q184K901J9353M1708p080o6201r3026j1845J3409L0598r094J00226
16767B3276M205o3512J1217M593J6330K5473L4942n1939q2122j2468k6771K933
16755a13843N6226Q4045j152p8379m7842M4977j05k7971N345L4029M5154m6398
16743d5914m7546J3900L8961l5653K9829O3670J3272l2395j0451l7044l8193l0452
16731a18016k2129L2392L4843Q71J0911M2570k5946L4705J6682R428k1460l7912
$$ plain form
16815 9177 9626 -8907 98985 175583 57716 -63794 -97679 -127211 -89167 -74269 -65584 -40337
16803 -40337 10862 19146 15817 -3058 -30558 -61719 -32509 6896 22184 51308 66089 37005
16791 37005 -17445 -41752 11459 -25613 -22156 -2809 11260 24977 1711 -1334 -47023 -5857
16779 -5857 2327 5228 24581 66289 59209 -6992 -100018 -111863 -98454 -67856 -76950 23276
16767 23276 27481 -36031 -24814 -20221 -3891 21582 56524 4585 -77537 -90005 -116776 -113843
16755 -113843 -57617 26428 25276 -53103 -100945 -55968 -56073 -84044 -78699 -44670 484 -45914
16743 -45914 -93460 -79560 -40599 -76252 -46423 17247 30519 -1876 -12327 -49371 -87564 -118016
16731 -118016 -140145 -107753 -72910 -72039 -61128 -18558 -44504 -9799 6883 16311 -5149 -43061
16719d3061K5966J2511J1559L2227j6457J1392m0647l2346k5782j8951M7194j1873
16707d8268j9864J8980L5201J5363L045N208l4681m5008l517O9131P841J540J3181
16694A8152O5873o025k2219J59L079r512Q062o9669p4665J8267k2753K6439M6076
16681a8736k973m1954r493L3079o636R530L3387j2204n6598n809K5394k362J6515
16668c8860O1551N4140k8412p7749m3348K1314p600j636j4704J6693J6852J0287
16656c1472n170l2947M6625N2134l1929k0416K374P1501N8723j1592o4329K4702
16644E8204P077N402l6581J509K3303m0278m0901O049K6586J0616N0266k9990
16632D1262J1614l6976p725J3383l0817j9645K3999N1220k7949r028k6260k8297
$$ plain form
16719 -43061 -17095 -4584 6975 39202 22745 34137 -6510 -38856 -64638 -83589 -36395 -48268
16707 -48268 -68132 -49152 -13951 1412 4457 9665 -25016 -70024 -73541 -4410 3431 4971 18152
16694 18152 84025 78000 55781 55940 59019 49507 57569 -12100 -86765 -68498 -91251 -64812 -18736
16681 -18736 -21709 -63663 -73156 -40077 -46713 -37183 -3796 -16000 -72598 -78407 -53013 -55375 -38860
16668 -38860 22691 76831 48419 -29330 -72678 -51364 -58964 -60600 -75304 -58611 -41759 -31472
16656 -31472 -36642 -69589 -22964 29170 -2759 -23175 -20801 50700 109423 97831 33502 58204
16644 58204 65281 70683 34102 35611 58914 18636 -22265 -16216 10370 20986 71252 41262
16632 41262 52876 15900 8175 21558 -9259 -28904 -4905 46315 18366 9338 -16922 -45219
16620d5219L4736K0406o610O817n3888K2595j1950k9390q742M2135L6109j7066
16608a0067j2586j2949j948L0260l910J7549N070j4042q0813k2306L8941r094
16596g5895J9359N6668n2400l3029J2550m1451j3653p339P424m250N3943N1856
16584b6217L0930l9248j7074K7854K5040m8153j2224P8045P7517J3644n0942j4733
16572D4439o5093J7896Q0231k3310n4776j4523J6380O0375K1983J3360j4790R287
16560I1459o1613K4399N4287r0040p6099l0805R662J1875L1949l996k8236j2499
16548g9657M2232J5949j9927J825J02047R5029L3450L6353P8775r3359j19755
16537I2962l8160m242k9601J8693l5835l0597j7916j2141Q954M4147K7027J4181
$$ plain form
16620 -45219 -10483 9923 3313 10130 -43758 -21163 -33113 -62503 -71245 -29110 6999 -10067
16608 -10067 -22653 -35602 -37550 -7290 -11200 6349 11419 -2623 -83436 -105742 -66801 -75895
16596 -75895 -56536 132 -52268 -85297 -72747 -114198 -127851 -135190 -127766 -132016 -78073 -26217
16584 -26217 4713 -34535 -51609 -23755 1285 -46868 -59092 18953 96470 110114 59172 44439
16572 44439 -20654 -2758 77473 54163 -613 -15136 1244 61619 83602 96962 82172 91459
16560 91459 29846 54245 108532 18492 -57607 -88412 -78750 -66875 -34926 -38922 -67158 -79657
16548 -79657 -37425 -21476 -41403 -39578 62469 157498 190948 227301 306076 212717 92962
16537 92962 54802 50560 20959 39652 3817 -26780 -44696 -56837 -47883 -3736 23291 37472
16525C7472p452K3599J00584O8689N0972N967J1921k1379j08450l0486o9654n8194
16513C589j1290j4722q55l5324R0297M4947N231J3842l4224L6409m3392m8870
16501E638K4582M7843m2153j3146P896j4155k9572l841R5020Q155r7676J783L0308
16488B0682J4350j4599k5319j3852l5871R732j9560K4676L0646J872j4518L4889
16476A3128M7752l9396l6512o9823L4212j3525k1628Q383K5219K8945n551q376
16464c7172Q0106L4061j3274j5828L6007k9798m6044K2881k9436k7061l0982J5959
16452d0581N116R100n8409k6820l725L8664M557K5321L1676l7518k5985O6006
16440a2598P518q8893N3987j1810K7390M6220O31N9393J4784l0763m8007l2755
$$ plain form
16525 37472 30020 53619 154203 222892 273864 279831 291752 270373 161923 131437 61783 3589
16513 3589 -7701 -22423 -23278 -58602 31695 76642 81873 95715 61491 97900 54508 5638
16501 5638 30220 78063 35910 22764 30660 16505 -13067 -16908 78112 86267 -11409 -9626 20682
16488 20682 35032 20433 -4886 -18738 -54609 -44877 -64437 -39761 -9115 -7243 -21761 13128
16476 13128 60880 21484 -15028 -84851 -50639 -64164 -85792 -77409 -52190 -23245 -28796 -37172
16464 -37172 42934 76995 63721 47893 83900 54102 8058 30939 1503 -25558 -56540 -40581
16452 -40581 -35465 -26365 -84774 -111594 -115319 -76655 -72098 -46777 -15101 -52619 -78604 -12598
16440 -12598 -5080 -93973 -39986 -51796 -24406 21814 22445 81838 96622 65859 17852 -14903
16428a4903M203O1680O280m8494J6906J0681l5662K560P8377J2896l5761o6292
16416g529p9799J9166P033M3978N3208R692J4859m1765o2579j5284k4109L2287
16404e0842m221M0325P771j3790N9526l0453J525j9477l7832K2359n9318l4434
16392a18861L5861K5183q600J8852Q431J3209j349l8501L2285l3302P850L9212
16380a9730j5630o2128p819J0902M4927l6439n3615J2923m75k474N1211K7486
16368e0861L2706k4837m5765L1480L5723M7889J1085k2608l403n0716k0019L5827
16356b3499L1682l4466L6241N3958n835k8445o335n6045k3170k215N4622l1621
16344c5128p606p476n8435k2940N9091J36223j5642n0429j9752m5106k0502K3005
$$ plain form
16428 -14903 -10700 50980 57260 8766 25672 36353 691 3251 81628 94524 58763 -7529
16416 -7529 -87328 -68162 -61129 -17151 36057 45749 60608 18843 -43736 -59020 -83129 -50842
16404 -50842 -55063 -14738 -6967 -20757 38769 8316 9841 -9636 -47468 -25109 -84427 -118861
16392 -118861 -83000 -57817 -66417 -47565 -39134 -25925 -27274 -65775 -33490 -66792 -58942 -19730
16380 -19730 -35360 -97488 -105307 -94405 -49478 -85917 -139532 -126609 -127084 -129558 -78347 -50861
16368 -50861 -18155 -42992 -88757 -57277 -21554 26335 37420 14812 11409 -39307 -59326 -23499
16356 -23499 8183 -26283 9958 63916 58081 29636 23301 -32744 -55914 -58129 -3507 -35128
16344 -35128 -42734 -50210 -108645 -131585 -72494 63729 48087 -2342 -22094 -67200 -87702 -64697
16332f4697J8915K333n2822L18j7895j6235Q8443K3207K2831q471m9330m5967
16320i9370N5176k4656k9631N0404P9383J9012q7248p7158L4540J5628K7186N330
16308c1404k8843P5005J5144N5781K2339n3485k8638n6242l1358L0038M8976L5882
16296E3195j3041m8205j8080o252k7667K7283Q717l1271n272k7945l284M5717
16284d6105l620P651k1994j9758M6695R3066R7109R227n6003l5644j4973j5136
16272D0515n455m0519o9661r323K5580O1918L0017k0551j1141q641Q295q06j7647
16259a7419p04l7485j8474M6818L672n4370p1186J1173R6942J11191K0125m0481
16247D9802o726k1882r236o828n433J8448J5705q424j1324J0957k6513k9660k1483
$$ plain form
16332 -64697 -45782 -43449 -96271 -95953 -113848 -130083 -41640 -18433 4398 -4073 -53403 -99370
16320 -99370 -44194 -68850 -98481 -48077 31306 50318 -36930 -114088 -79548 -63920 -36734 -31404
16308 -31404 -60247 14758 29902 85683 108022 54537 25899 -30343 -61701 -31663 17313 53195
16296 53195 40154 -8051 -26131 -32383 -60050 -32767 -24050 -55321 -60593 -88538 -91822 -46105
16284 -46105 -49725 -42074 -64068 -83826 -37131 55935 153044 162271 106268 70624 55651 40515
16272 40515 35060 -5459 -75120 -84443 -58863 3055 33072 12521 1380 -7261 1034 228 -17419
16259 -17419 -18123 -55608 -74082 -27264 -23592 -77962 -149148 -137975 -41033 70158 90283 49802
16247 49802 43076 21194 11958 5130 -303 18145 33850 25426 14102 25059 -1454 -31114 -52597
16234e2597k1102j3440M442R002J28317J3340j303j8757L0189k763k3155L3641
16222H5814M514L6275J4306k1735K6208J0999J5952L0561l5043m8110k6582J4754
16210A07913L8532l2369l7557k7507J6356j2450p010n4578k5549j8858O8100k4245
16198i222p0608k668L5628K8976K2032j5319J6341N8630l2277k7985N0136K2814
16186G6478M709n2893m1080R508R5774K2098n3385q1466n8815O7268O4758K778
16174E5732j7945m6348K7272L218J9729J4637q626l2869n8818l4765O8911K9562
16162A9690O016L4015Q116n7726l6792Q0481N9373J3655j637j04919o1435m3377
16150h4540J3756J2739j6426J7602J973M6616K6758l3807k8915J0427k5436O2864
$$ plain form
16234 -52597 -73699 -87139 -82697 -73695 54622 67962 66659 47902 78091 75328 52173 85814
16222 85814 90328 126603 140909 119174 145382 156381 172333 202894 167851 119741 93159 107913
16210 107913 146445 114076 76519 49012 65368 52918 45908 -8670 -34219 -53077 15023 -9222
16198 -9222 -79830 -82498 -46870 -17894 4138 -11181 5160 63790 31513 3528 53664 76478
16186 76478 81187 28294 -12786 -3278 92496 114594 61209 -20257 -79072 -11804 52954 55732
16174 55732 37787 -8561 18711 21929 41658 56295 47669 14800 -44018 -78783 -9872 19690
16162 19690 25706 59721 67837 10111 -26681 53800 113173 126828 125191 20272 -41163 -84540
16150 -84540 -70784 -58045 -74471 -56869 -54896 -8280 18478 -15329 -44244 -33817 -59253 3611
16138C611N607l5986R982M6906K59j604k0759n6798N604j5298K2158J2215K891
16125b1212P501m0758K1859L2222L4624j8525J0935L2612k8937r0147k2702m638
16113h7166l3276j0949J341O2158L4221p8719k3268N6105R028K0178L1636J2331
16101f380l3432K7786o735k1773K7085O7L8723J923q9479J5944M4821j3694l461
16088a8605J0761N183p93j2571K4089m4622k6779O9546L0530n1245p2316K0858
16076f5964o086M52N9135k5882p923K1183M4639J7047N9339p828p7814j0775j6761
16063a7238M430K7576Q796n503j4267K9383J9461J0854L300o9209j03181K4012
16051h1586J1949k6045M1425M0316K2599r652j8792l9898P541M1341k2307O05
$$ plain form
16138 3611 9218 -26768 -16786 30120 30379 28775 8016 -48782 -43178 -58476 -36318 -24103 -21212
16125 -21212 -13711 -54469 -32610 -388 34236 15711 26646 59258 30321 -59826 -82528 -87166
16113 -87166 -120442 -131391 -130050 -67892 -33671 -112390 -135658 -79553 -70525 -50347 -18711 -6380
16101 -6380 -39812 -12026 -18761 -40534 -13449 -13382 25341 27264 -62215 -46271 -1450 -15144 -18605
16088 -18605 -7844 -2661 -3454 -16025 8064 -36558 -63337 6209 36739 -14506 -86822 -65964
16076 -65964 -72050 -71598 -12463 -38345 -46268 -25085 19554 36601 95940 88112 10298 -477 -17238
16063 -17238 -12808 14768 23564 18061 3794 33177 52638 63492 66792 -2417 -105598 -81586
16051 -81586 -69637 -95682 -54257 -13941 8658 -994 -19786 -59684 -52143 -10802 -33109 -32504
16039c2504j3970j5109K6286L8719m1899j20616k3243n006L8253R0741j8463m741
16027h1552L4810Q902k5887n3274j617M9828N2515k0805m4555L2947N0406P4707
16015G6425k6635o4293K4800N0829o7086o1001O243K2100j055m9302R333J6699
16003f2943m66L9252j7010N812k5167J6829r302l2535K6690l0469r658P2210M0959
15990A4202L5272q713n4848m9019k2909l7806n6385k1309O5472L9611k2706J6928
15978a02210l0553M1626J6407Q523P7102k8148q4704P181P8963O8472r2307j0711
15966e0359m3389L7459M4874J8409J1575J2871o307l3731L1904N2676n2111l8642
15954a4771N2828j0481m3356l827l253J8391K1000K8184P3408k2049n2339m7855
$$ plain form
16039 -32504 -46474 -61583 -35297 3422 -38477 -159093 -182336 -187342 -149089 -58348 -76811 -81552
16027 -81552 -46742 -37840 -63727 -117001 -118618 -68790 -16275 -37080 -81635 -48688 1718 76425
16015 76425 49790 -14503 10297 61126 -5960 -66961 -60718 -38618 -39673 -88975 -79642 -62943
16003 -62943 -63409 -24157 -41167 -35355 -60522 -43693 -52995 -85530 -58840 -89309 -98967 -26757 14202
15990 14202 49474 40761 -14087 -63106 -86015 -123821 -180206 -201515 -136043 -96432 -119138 -102210
15978 -102210 -132763 -91137 -74730 -66207 10895 -17253 -101957 -94776 -15813 52659 -39648 -50359
15966 -50359 -93748 -56289 -11415 6994 18569 31440 25133 -8598 23306 75982 23871 -14771
15954 -14771 38057 27576 -15780 -19607 -22860 -4469 16531 44715 118123 96074 43735 -4120
15942d120J3123q678l5186j1894L2831J0980M278l8299p1903o5306J7933J06686
15930d9555O4649N927k7254j0702K331l1852m5260K5166L6635R774q2355L6803
15918f5693O7504j0936J1868K297n1589l6897L2916m2480l655P708J03361N7164
15906G1568n7005p0620N249J65K2408N8870k6082k0519J7078L0790J1730L9906
15894H3538o8496r3236q950J4064k0953K3290Q6007L4566j9440k6539L5728O674
15882D6253L2123J7723m3901j06051l7360Q621K3926M8567l2998R65J1751o271
15870c6652k4531K1438L7323k563J1799j4200M911j783l5843P720L7984j7640
15858a2037l1102J9099j4763n5765K1623l6092L0679M7535L4195m7601k1389L8792
$$ plain form
15942 -4120 9003 325 -34861 -46755 -13924 -2944 1334 -36965 -108868 -174174 -156241 -49555
15930 -49555 15094 21021 -6233 -16935 -14604 -46456 -91716 -66550 -29915 -20141 -102496 -65693
15918 -65693 1811 -9125 2743 5040 -46549 -83446 -50530 -93010 -96665 -88957 14404 71568
15906 71568 14563 -56057 -50808 -50643 -28235 30635 4553 -15966 1112 31902 43632 83538
15894 83538 15042 -78194 -87144 -73080 -94033 -70743 15264 49830 30390 3851 39579 46253
15882 46253 78376 96099 52198 -53853 -91213 -82592 -58666 -10099 -43097 -42132 -30381 -36652
15870 -36652 -61183 -39745 -2422 -4985 6814 -7386 -2475 -4258 -40101 -32381 5603 -12037
15858 -12037 -43139 -24040 -38803 -94568 -72945 -109037 -78358 -30823 3372 -44229 -65618 -26826
15846b6826M7520o9504L8507j8641k8316J6006J1922K7504l3296k1730j538O5666
15834G274R125j3098m8869j3629n61K0782M3124J5108K8769l458o3768m7416k0470
15821h7087K0222Q2955L7749j735m1772O037k3252m5403L6188K1551q826K1069
15809A7696L7390l2986J0554k984J9914o833m2081j9610J0696L8343k2133o5923
15797e7957L267j6559N552N8974K3477l4106n539q631J1479K5372O858k9913K4923
15784G197J06L983n2311l7591m9514N8287N8296l1457l7088p2255k6609Q3654
15772i5302P5250K9624L6711J5780O1434k9533j19324k6503L1966k0829K1368
15761a9358l0186j3382L7392K2453K6881J8841M3590K0241m6372r2679L1474K9949
$$ plain form
15846 -26826 20694 -48810 -10303 -28944 -57260 -41254 -29332 -1828 -35124 -56854 -58392 7274
15834 7274 16399 3301 -45568 -59197 -59758 -38976 4148 19256 48025 44567 -19201 -66617 -87087
15821 -87087 -66865 16090 53839 52104 10332 16369 -6883 -52286 -16098 5453 -3373 17696
15809 17696 55086 22100 32654 29670 49584 42751 670 -18940 -8244 30099 7966 -57957
15797 -57957 -54690 -71249 -65697 -6723 16754 -17352 -22891 -31522 -20043 5329 12187 -17726 7197
15784 7197 7303 11286 -41025 -78616 -128130 -69843 -11547 -43004 -80092 -152347 -178956 -95302
15772 -95302 -20052 9572 46283 62063 123497 93964 -25360 -51863 -19897 -40726 -19358
15761 -19358 -49544 -62926 -25534 -3081 23800 42641 86231 106472 60100 -32579 -1105 28844
15749B8844N2j1334L1559L3170N9302l0708r050j2848o5204j0001L1075k1558
15737B3299q943k164n7260O667L9523j734K2164l2399N398P4376m739J9182j2371
15724G0999m6545m2267n5635j6391R2073M0943k2425O845l1414n060O369j3658
15712a6166n8639J7638L3091J7555M8068M3994k5443K943l6480p0672k0560L6540
15700b8131J7713j566n6387k0843K4541k1685R528K9619p779K5900m036j4328
15688d7454m1860q7311m8693Q5004N4198J1325M7091O8707R333m4662K495P869
15676A6042L3283l2318n740Q318K1628J9769q3738J3355J03017O42K605K8956
15664A25819m5538j4457l4788o1661k9723l4457K6082M3618Q8859P530J1229l0102
$$ plain form
15749 28844 28896 17562 49121 82291 141593 110885 101835 88987 23783 13782 44857 23299
15737 23299 14356 12192 -45068 -38401 1122 -612 21552 -10847 -5449 68927 64188 83370 70999
15724 70999 24454 -17813 -73448 -89839 2234 43177 20752 27597 -3817 -8877 -2508 -16166
15712 -16166 -74805 -57167 -24076 -6521 41547 85541 60098 63041 26561 -44111 -64671 -28131
15700 -28131 -10418 -11984 -68371 -89214 -64673 -86358 -76830 -47211 -54990 -29090 -33126 -47454
15688 -47454 -89314 -176625 -225318 -140314 -86116 -74791 -27700 41007 50340 5678 8173 16042
15676 16042 49325 17007 11267 19585 41213 60982 -22756 -9401 93616 94258 96863 125819
15664 125819 80281 65824 31036 -30625 -60348 -94805 -68723 -25105 63754 71284 82513 52411
15652E2411k8703q1639j1170L5372L1854K6303L4332R696o5802l1900J6135L5921
15640B2810l3119m1697K2908O0428j7478l2244p357N2060J7723q2022J6846J902
15628a9240o714J4781M8640K0164r4239L0620K8012k4745R751J7577k886j4496
15616G225k6485l4851N0227M0110r12l22M8145l7933k6706n6406j3125J3718l3601
15603g0916j3759P772r103m791P2854R176J1407j1251k6044L0005L7198L2850
15591F5398j5204q8906j9901j0798N4533J367L4570l8235m1911M597j1406R726
15579e6170N8269K3302L7020M8017J6540n3277k9035k2996L8448L7525K6381P108
15567A31132m4071j8646r669L9385l2941l7083j5359K2437k7941j8953j7991O3128
$$ plain form
15652 52411 23708 -57931 -69101 -33729 -1875 24428 58760 68456 2654 -29246 -13111 22810
15640 22810 -10309 -52006 -29098 31330 13852 -18392 -25749 26311 44034 -37988 -21142 -19240
15628 -19240 -25954 -11173 37467 57631 -36608 -5988 22024 -2721 7030 24607 21721 7225
15616 7225 -19260 -54111 -3884 36226 35314 34992 83137 45204 18498 -37908 -51033 -37315 -70916
15603 -70916 -84675 -76903 -86006 -90797 -17943 -8767 2640 -8611 -34655 -4650 32548 65398
15591 65398 50194 -38712 -58613 -69411 -14878 -13511 21059 -17176 -59087 -54490 -65896 -56170
15579 -56170 2099 25401 62421 110438 126978 73701 44666 21670 60118 97643 124024 131132
15567 131132 87061 68415 58746 98131 65190 28107 12748 35185 7244 -11709 -29700 33428
15555C3428M8424r505o6165o8508m5972N6075K6499N561o307n630K8302p2550
15543g6348n5867J2864l1796J6017J6538l776N7946L9684K5649l5446k9491k7977
15531i2003K0373L3011L1521L63N2962m4644o4207P0567M1237R723n4012r8420
15519i3529k3810O6602O3871M4867J7148L1672k4996p373R131l7783n2499o1636
15507f8335N598J14832L1244j4555J4918l4886k0437L9919N1483J1076m0700k2319
15495F7838n5853n0180K2489j315K9249M4507j1224O422j3814l5931M3077m4780
15483D85k4057J3671k15k5177K7804R896M7390L0556o785k9374K8453j987l9529
15470C1131j0196j3589m444j9099j3623M834n5284P509N1065Q3945m183l0832
$$ plain form
15555 33428 81852 72347 6182 -62326 -108298 -52223 -25724 -20163 -26470 -32100 -3798 -76348
15543 -76348 -132215 -119351 -151147 -135130 -118592 -122368 -64422 -24738 911 -34535 -64026 -92003
15531 -92003 -71630 -38619 -7098 -6735 46227 1583 -62624 7943 49180 58903 4891 -93529
15519 -93529 -117339 -50737 13134 58001 75149 106821 81825 74452 83583 45800 -6699 -68335
15507 -68335 -62737 52095 83339 68784 83702 48816 28379 68298 119781 130857 90157 67838
15495 67838 11985 -38195 -15706 -17021 12228 56735 45511 51933 38119 2188 45265 485
15483 485 -23572 -9901 -10116 -35293 -7489 2407 49797 80353 73568 44194 72647 70660 31131
15470 31131 20935 7346 2902 -16197 -29820 -24986 -80270 -72761 -21696 62249 58066 27234
15458B7234P696m3453K0585o7887o265j496L1972L1737j9476j0100k2300j0736
15446f2489m3975L0093N6661k0138p7000K5765j8846J9160K1388m1672K8312M1971
15434d0770N5205M8858K5765j9391n1959n400L176K9617Q349m8660M9588p863
15422D6515j6245K3612K2920n2649k1700j1162o864J5935j4425J4205P145Q104
15410A5391P6675l7115l0531Q93k4366m1475J2594M1853L7589l6110j6019m1521
15398d2142k4249q333j868K5312k0364j8112K5255P121J1057J4342P3484K5282
15386F6785j0073Q4708j0002j46968q9040L0486M4852J9140K6042m0418Q852J3213
15374b423L007L4337K7310J3168K4697k2317l1512K2114j1217k1941N531M3609
$$ plain form
15458 27234 34930 -8523 12062 -55825 -62090 -63586 -31614 123 -19353 -29453 -51753 -62489
15446 -62489 -106464 -76371 -19710 -39848 -116848 -91083 -109929 -90769 -69381 -111053 -82741 -40770
15434 -40770 14435 63293 89058 69667 17708 12308 15484 45101 53450 4790 54378 46515
15422 46515 30270 53882 76802 24153 2453 -8709 -15573 362 -14063 142 7287 15391
15410 15391 92066 54951 24420 25313 947 -40528 -27934 13919 51508 15398 -621 -42142
15398 -42142 -66391 -74724 -76592 -51280 -71644 -89756 -64501 -57380 -46323 -31981 41503 66785
15386 66785 56712 141420 131418 -15550 -104590 -74104 -29252 -10112 15930 -24488 -15636 -2423
15374 -2423 584 34921 62231 75399 100096 77779 46267 68381 57164 35223 40754 84363
15362H4363K1948j8861l5346q2497k4717p162L6468L0680N024M2731L7267l0244
15350E9654q595m801k5890j2687K7378Q438l4882m6970m6270j4753J7701L7565
15338d4112K3250r574j5181j9761o0252p0208j3232J09559P508J2660J1035J2839
15326e5469k3237J7564K3297L8997K4915k6062l2511j891N5776J0516j9349J449
15314A3995j1661J9777r411m886J1243q1009r182j4929N5P384M901M3476p214
15301c7461q895J5779Q458m8555j1441M855K6053N7746L9880P7378K5468J7056
15289A66321n2394p6008r1349k1939m3960J274O8567q46n4677k3945M5066N369
15277g8521j4349l679J3431J4066Q944M0987J4592R5959P2219m5915p0865p4967
$$ plain form
15362 84363 106311 87450 52104 -30393 -55110 -62272 -25804 4876 9900 52631 89898 59654
15350 59654 51059 46258 20368 7681 35059 43497 8615 -38355 -84625 -99378 -81677 -44112
15338 -44112 -20862 -30436 -45617 -65378 -125630 -195838 -209070 -99511 -92003 -79343 -68308 -55469
15326 -55469 -78706 -61142 -37845 1152 26067 5 -32506 -34397 21379 31895 12546 13995
15314 13995 2334 22111 12700 7814 19057 -61952 -71134 -86063 -86008 -78624 -73723 -30247 -37461
15301 -37461 -46356 -30577 -22119 -70674 -82115 -77260 -51207 6539 46419 123797 149265 166321
15289 166321 113927 37919 -53430 -75369 -119329 -118055 -49488 -50334 -105011 -128956 -83890 -78521
15277 -78521 -92870 -96549 -83118 -69052 -60108 -19121 -4529 91430 163649 117734 46869 -28098
15265b8098q1683O2028O1465k9113k4139K6938L124k3240n633N7742K0466j4209
15253B5648M4556K8138N965K4735Q87q216q6411r5587j103N2875l4876q336J0192
15240d1533N72J1159P2121M207p302J0642k8918n2612K0100K9694j0901K5353
15228C2582m0458q207J881k8811j8902j8810J1737L0725K8964N6921J0552j6575
15216D1599j0738n160m1897k397N0123j203j8281R318n5615k6209J9597k4019
15204f4882l4668L4074L5235L6746m6903o0202O641L2800Q048K7344L2591N5302
15192F2126k0398k1693P0684l4322q0931K0399K4348k9713m6065P8202K2886k0897
15180B4626k1994J1366o892K2651j3555o1287m7515Q934Q493K7308J8135K2583
$$ plain form
15265 -28098 -109781 -47753 13712 -15401 -39540 -12602 -9478 -32718 -38351 19391 39857 25648
15253 25648 70204 98342 104307 129042 129929 121713 35302 -60285 -61388 -8513 -43389 -51725 -41533
15240 -41533 -40961 -29802 42319 46526 39224 49866 20948 -31664 -11564 18130 7229 32582
15228 32582 -7876 -16083 -14202 -43013 -61915 -80725 -68988 -38263 -9299 47622 58174 41599
15216 41599 30861 25701 -16196 -18593 31530 30327 12046 21364 -34251 -60460 -40863 -64882
15204 -64882 -99550 -65476 -30241 6505 -40398 -100600 -93959 -61159 -53111 -25767 6824 62126
15192 62126 41728 20035 90719 56397 -24534 -4135 20213 -9500 -55565 22637 45523 24626
15180 24626 2632 13998 7106 29757 16202 -45085 -92600 -83666 -75173 -47865 -29730 -7147
15168g147O9810k5222J0687k2995K913k3222J4338o2713m2205n8334j3834K2361
15156a35563K6358J4871K778O7933N0515n5223k4168J2417J0994J9615n359J3170
15144a662k6871o575K3186l969K0662r951J8438K606n5205q9331m9R5222J19599
15131H6100M3242j9658L0392L0457j01115q0046j01467J0120N1900M621J8723
15120b6731m1224L7917j4553k5361l1025k0106L4214O8840M9892k37l524j8775
15108I327m7887o9193k514J8225K7658l5912j5088J3595K261J3190J3884N3301
15096a9153R222J426J9365j75m1877K4312j4032r102o4679O7608r80Q798k44j1276
15082c0787L0899K9379J906q2715J33P1390m32l8490J1564j2035K9607j4289o691
$$ plain form
15168 -7147 62663 37441 48128 25133 28046 4824 19162 -43551 -85756 -144090 -157924 -135563
15156 -135563 -109205 -94334 -91556 -23623 26892 -28331 -52499 -40082 -29088 -9473 -14832 -1662
15144 -1662 -28533 -35108 -11922 -15891 4771 -5180 13258 15864 -39341 -128672 -128721 -33499 86100
15131 86100 129342 109684 140076 170533 69418 -10628 -112095 -101975 -50075 -45454 -26731
15120 -26731 -67955 -30038 -44591 -69952 -100977 -121083 -86869 -18029 31863 31626 28102 9327
15108 9327 -38560 -107753 -110267 -92042 -64384 -100296 -115384 -101789 -99528 -86338 -72454 -19153
15096 -19153 -9931 -8505 10860 10685 -31192 -6880 -20912 -30014 -94693 -27085 -28065 -19267 -19511 -30787
15082 -30787 112 29491 31397 -51318 -51185 20205 19773 -18717 -7153 -19188 10419 -3870 -10561
15069a0561J0875K6749M9298j5779p9857m6830o1128k396J972M9569M8927N423
15057b3738O892j7004R426k6249o559P3119j0370j3254J4136k6388J8506L125
15045A642J7462n4556J1954Q4994j655K163L897o1773K1784J366m0977J5651L1568
15032C3520J7371J9178J4556l1383p7727J1596L4484k9584j6538j2988K6584k419
15020a3350o4809j8696O0026K2838j3718l7659r298M3116l183j2004N4112N7293
15008F4668K3813m5711j5149o4926o3652M4756R2419m2847p7980o8653J7553L7221
14996i8488j6656K1023J8529j9429Q2115l077l6523m1059J0447M6365Q5681L4245
14984H3173p093j6851l7738P519K6607o3072l7554l9502p906L0378J6258M4276
$$ plain form
15069 -10561 314 27063 76361 60582 -19275 -66105 -127233 -129629 -127657 -78088 -29161 -23738
15057 -23738 -16846 -33850 -24424 -50673 -57232 15887 5517 -7737 6399 -19989 -1483 1642
15045 1642 19104 -35452 -23498 61496 59841 62004 65901 4128 25912 27278 -13699 1952 33520
15032 33520 50891 70069 84625 53242 -24485 -12889 21595 -7989 -24527 -37515 -10931 -13350
15020 -13350 -78159 -96855 -36829 -13991 -27709 -65368 -74666 -31550 -34733 -46737 7375 64668
15008 64668 88481 42770 27621 -37305 -100957 -56201 36218 -6629 -84609 -153262 -135709 -98488
14996 -98488 -115144 -94121 -75592 -95021 -12906 -15983 -52506 -93565 -83118 -36753 48928 83173
14984 83173 76080 59229 21491 29010 55617 -7455 -45009 -84511 -92417 -62039 -45781 -1505
14972a505J4217L3866k6857L719o829N9664M6321n7069n6305m6388J7825P1803
14960E2462L2284k2905k5658K0829M7616m5217j9696N2508k7283j9671m096j2660
14948B8513M786k1690m2721k2630j9193N501L1172Q840J518M265J6231K5399M2422
14935F2413j1231m398J8341m9647J4779k8568k8538P375O4736l1720o6684J1474
14923d1668L6920l2158m551K3974M1841m6071R669K7548K4850l8508K5052M6679
14911G3577j2761p1194j0523K8475M0517l9991j8599L6113o0052n2012j2681J4853
14899h4278M1902J5828j521Q45M7145p816r541J8422o254j0307P036L5202l6928
14886I735k2871J6628J0781q758l3135n626M8447L827m0941j3840L3405m8623
$$ plain form
14972 -1505 12712 46578 19721 23440 16611 76275 122596 65527 9222 -37166 -19341 52462
14960 52462 84746 61841 36183 57012 104628 59411 39715 92223 64940 45269 41173 28513
14948 28513 33299 11609 -31112 -53742 -72935 -67434 -36262 -27422 -25904 -21639 -5408 19991 62413
14935 62413 51182 46784 65125 15478 30257 1689 -26849 -19474 45262 13542 -53142 -41668
14923 -41668 -4748 -36906 -41457 -17483 24358 -21713 -12044 15504 40354 1846 26898 73577
14911 73577 60816 -10378 -20901 7574 48091 8100 -10499 25614 -34438 -86450 -99131 -84278
14899 -84278 -42376 -26548 -28069 -27224 19921 12105 2564 20986 14732 4425 11461 46663 9735
14886 9735 -13136 3492 14273 5515 -27620 -33246 15201 19028 -21913 -35753 -2348 -50971
14874e0971N8057L7147J3508o0223o3771J9754L4589M4025N922k7259o7346m8174
14862a04742k4687k7099K1714N2847O2213p156Q14L6880j3K3704l3350j2416K5279
14849A3988k8507l029J3065j0935k2431o348R3000K1235J0217P795J6046l2651
14837G1445k1782N4060J0725n3022m4028m7073j0570m04N0433K1678o0269m4463
14825g3270P6476Q790j4818m1848P298J7686O941m1276m3815J1335P8936O6035
14813E8470N3968k5036l7594J734q202j2045j5852k7568K9192K2268m3791m9322
14801e3778p260p948m0718L8053Q3024r897M52j7251m4578o135L7305M3539j2404
14788B404k3823P762p777l674L3376J0605J810n7105O198N691J4448Q395n9489
$$ plain form
14874 -50971 7086 44233 57741 -2482 -66253 -46499 -11910 32115 38037 10778 -56568 -104742
14862 -104742 -129429 -156528 -134814 -81967 -19754 -26910 -26096 10784 10771 34475 1125 -11291 13988
14849 13988 -14519 -17548 -4483 -15418 -37849 -44197 48803 70038 80255 88050 104096 71445
14837 71445 49663 103723 114448 61426 17398 -29675 -40245 -40649 9784 31462 -28807 -73270
14825 -73270 3206 11996 -2822 -44670 -37372 -19686 -12745 -54021 -97836 -86501 -7565 58470
14813 58470 112438 87402 49808 51542 43340 31295 15443 -12125 17067 39335 -4456 -53778
14801 -53778 -61038 -68986 -109704 -71651 11373 1476 1928 -15323 -59901 -66036 -28731 14808 2404
14788 2404 -21419 -13657 -21434 -25108 8268 18873 20683 -36422 -30224 -24533 -10085 -1690 -61179
14775f1179l9388j0601N5828O3609k6171k9318J0026N2944K7531o3885n9392l6119
14763a16115n1927L7400R0984K1769O813N1440L8583j2869k6846l3614o0777j988
14751e7147L3195K1949j388j2810L7223q751o9808l030M2305l7570k0867l0191
14739a06890M2612j0362j1473k8949K9699J2623O1156O1237o593J5478J5653l0375
14727D3816m8669m0790M8495J9845k4925m7758j541M0203J8875N746n2658r8861
14715a38222k1001J08913J26428j6435l4500J0547K975K3265K6092L555l4080
14704E7537k1602m1541P160j9179J7866Q119P941j6469k1537k1N9198L2904k9359
14691D1017j1848j0816M4474K4820k4115k1573r553j8706J3303j7232K6597r279
$$ plain form
14775 -61179 -100567 -111168 -55340 8269 -17902 -47220 -37194 15750 43281 -20604 -79996 -116115
14763 -116115 -168042 -130642 -39658 -17889 -11076 40364 78947 66078 39232 5618 -55159 -57147
14751 -57147 -23952 -2003 -3391 -16201 21022 12271 -57537 -60567 -18262 -55832 -76699 -106890
14739 -106890 -64278 -74640 -86113 -115062 -85363 -72740 -11584 49653 43060 58538 74191 43816
14727 43816 -4853 -45643 2852 22697 -2228 -49986 -51527 -11324 7551 13297 -39361 -138222
14715 -138222 -159223 -50310 76118 59683 25183 35730 38705 61970 88062 91617 57537
14704 57537 35935 -5606 1554 -17625 241 8360 16301 -168 -21705 -21726 37472 70376 41017
14691 41017 29169 18353 62827 87647 63532 41959 32406 13700 27003 9771 36368 27089
14679B7089l6113J063M7357O6612L9451n8602j7848M3659m0535m5470J7780p305
14667C7138o9706m8360j7933L5407L9012J5705M138J8601J3797m38j0999L684
14655B0046N6848l2480m2929k7785P360m747m4375J7346L941N2811j829J8441
14643B2648J2665j7534k4393k8117M2510R9476l1995o6469r739j6622k3268k3361
14631f4199K2808O6724K4240j8612k4317k9180l3646N379J9823k480J7053m006
14619b0413m7372K843P8670J6289m6785n9218l1464L2122K3595J4596m8204J0700
14607g4641J0136M7529O5356k8759j2005j2862J7010l0128q95J8391n810K6590
14595A9912Q968M379k5936l2383k2148o986j4724J2898K765L5399P849L9952k5896
$$ plain form
14679 27089 -9024 -7961 39396 106008 145459 86857 69009 112668 72133 26663 44443 37138
14667 37138 -32568 -80928 -98861 -63454 -24442 -8737 -4599 14002 27799 27361 16362 20046
14655 20046 76894 44414 1485 -26300 -18940 -23687 -68062 -50716 -46775 6036 4207 22648
14643 22648 35313 17779 -6614 -34731 7779 107255 75260 8791 -948 -17570 -40838 -64199
14631 -64199 -41391 25333 49573 30961 6644 -22536 -56182 -50803 -30980 -33460 -16407 -20413
14619 -20413 -67785 -64942 13728 30017 -16768 -75986 -107450 -75328 -51733 -37137 -85341 -74641
14607 -74641 -64505 -16976 48380 19621 7616 -5246 11764 -18364 -19259 -868 -6678 19912
14595 19912 28880 33259 7323 -25060 -47208 -54194 -68918 -56020 -53255 -17856 -10007 29945 4049
14582D049n0177l8500L8700K4742J04947Q0901q9004n3753K7790N8863l6204l1294
14570D1060m0099K5134m46l3546K8983K9714O2909j6165k6597J7970K1447m5818
14558F4546p3674k7161J079m2115J4208N2791L3169J1224j7153j6044l9878m4115
14546h3123m0855Q0976O2838K5850K4196K2480L7172K5697n6338n3879l7533K5597
14534C3078M5112o5574m5414k2064N3394J02717J2670J1249p139J2308J293p9597
14522E2033l8001k4166l06K668J1142m974K3294J2907O115k8079R232K0207k3377
14509A8695L281J2857o330J7121k412j4660j5841j4196K0802j542m2602O440k7464
14496d5851j3865j3282M0441L505L7509j6591J5237m927n9988q639q010P4735
$$ plain form
14582 4049 -46128 -84628 -45928 -21186 83761 164662 75658 21905 49695 108558 72354 41060
14570 41060 961 26095 25649 -7897 21086 50800 113709 97544 70947 88917 110364 64546
14558 64546 -9128 -36289 -35210 -77325 -63117 -10326 22843 34067 16914 870 -39008 -83123
14546 -83123 -123978 -43002 19836 45686 69882 92362 129534 155231 98893 45014 7481 33078
14534 33078 78190 12616 -32798 -54862 -1468 101249 113919 125168 118029 130337 131630 52033
14522 52033 14032 -10134 -10440 -7772 3370 -1604 21690 34597 40712 12633 21865 42072 18695
14509 18695 21976 34833 28503 45624 43212 28552 12711 -1485 19317 17775 -24827 -18387 -45851
14496 -45851 -59716 -72998 -32557 -29052 8457 -8134 7103 2176 -57812 -66451 -74461 274
14484B74K8717K085j103J017J9318J200m3712m513L4822K5372o032m9427j1876
14471c858K0208M0786K2276k302l4344m0239k8631k7623K2700K8438p02L3489
14459C0198N0484J8249j0090p1576n2088K1041j0714M940O5480m4477n0979q8726
14447a38258k8882P1987M9062n8970J883M5693L7675J912N1266K8927k0602j2606
14435B9087L3852j6230m6451o232r509K9594K4800l0688n8892J9930K2708K5418
14423A7387P755J6135K5391L677k0571K7196l3152q65N6890p1764l1023L8566
14411C5622R296j1567P342j9813p6871l0885M9365J2651j4726L2026j6060R288
14399a4332P9075j2072n7843n4448J6808j1918O784M114N639P472O248L682O359
$$ plain form
14484 274 28991 31076 29973 30990 50308 51508 7796 3283 38105 63477 57445 8018 -3858
14471 -3858 16350 57136 79412 77110 42766 2527 -26104 -53727 -31027 -2589 -3291 30198
14459 30198 80682 98931 88841 17265 -34823 -13782 -24496 -19556 45924 1447 -49532 -138258
14447 -138258 -167140 -95153 -46091 -105061 -103178 -57485 -19810 -17898 33368 62295 41693 29087
14435 29087 62939 46709 258 -5974 -15483 14111 38911 8223 -50669 -30739 -8031 17387
14423 17387 25142 41277 66668 70345 49774 76970 43818 42953 99843 28079 -2944 35622
14411 35622 44918 33351 40693 20880 -55991 -86876 -37511 -24860 -39586 -7560 -23620 -14332
14399 -14332 64743 52671 -5172 -59620 -42812 -54730 -47946 -43832 -38193 -30721 -24473 -20791 -14432
14386a4432q610k8851K5280O0212P3517n1282j04973l8379L1459K9070q002k4145
14374e9136n570J6087L771M7739J2835K8218l774L0226n435l6960n1837k4856
14362d8692L9019N3421k2943n0221J5607J449K535j1823o4989K5602Q0171M7249
14350F6385j531m0082n7066k2438N551P736n607M3017K6687k6297o42J6365p603
14337D475j4278R087l1467l358l0872J7190k6p364O3585j6379m4621o1758K7547
14324h8239J12768p027q6472L8534R558m0750o8146K1466N1382J6038L539r106
14312d6455m3302N226r86K6623K7471P6746O5936j3297K0510m1073j7366l0235
14300B9798j7823m9360J7264j6922K2012L7946k5232p3372m39L7799K894P135
$$ plain form
14386 -14432 -23042 -51893 -26613 33599 107116 55834 -49139 -87518 -56059 -26989 -34991 -59136
14374 -59136 -64706 -48619 -44848 2891 15726 43944 40170 70396 64961 28001 -23836 -48692
14362 -48692 -9673 43748 20805 -29416 -13809 -12360 -9825 -21648 -86637 -61035 19136 66385
14350 66385 64854 24772 -32294 -54732 -49181 -41445 -47052 -4035 22652 -3645 -4287 12078 4475
14337 4475 -9803 -716 -32183 -35541 -66413 -49223 -49249 -56613 6972 -9407 -54028 -115786 -88239
14324 -88239 24529 17502 -68970 -30436 -20878 -61628 -129774 -108308 -56926 -40888 -37349 -46455
14312 -46455 -89757 -84531 -85517 -58894 -31423 45323 111259 97962 118472 77399 60033 29798
14300 29798 11975 -37385 -20121 -37043 -15031 22915 -2317 -75689 -76128 -38329 -35435 -28300
14288b8300q6470R328j2040K7552M977m6460L5610P3913O9163j1433k3674K272
14276A4438K1083J9630k3713j1759l5349m1306N4551L7232m0838k010k0759q373
14264c7173N2296M9982o2831K3706L6138j1647p776j4563j7444N2692j1825n7158
14252e603j1590J6128m374J11662j124j9134k456o480k1654l5422O2917j0990
14240G1880k8219l0881j6940M0139k9857j566k5237k8410N0476j7268j4917L789
14228b7011n0194M1447J9774l4939l0896r040J1022J2762K3176O4885k4338k3794
14216b7146j3312j3686N22o501L7110L2800j1934k7678L627J4556L5656J8287
14204D2301o6967n4650O359r310O93O1870o90m8883J7960N208j987N1406O9812
$$ plain form
14288 -28300 -114770 -105442 -117482 -89930 -84953 -131413 -95803 -21890 47273 35840 12166 14438
14276 14438 35521 55151 31438 19679 -15670 -56976 -2425 34807 -6031 -8041 -28800 -37173
14264 -37173 15123 65105 2274 25980 62118 50471 42695 28132 10688 63380 51555 -5603
14252 -5603 -17193 -1065 -5439 106223 105099 85965 83509 77029 55375 19953 82870 71880
14240 71880 43661 12780 -4160 35979 6122 4556 -20681 -49091 1385 -15883 -30800 -27011
14228 -27011 -77205 -35758 -15984 -50923 -81819 -90859 -79837 -67075 -43899 20986 -3352 -27146
14216 -27146 -40458 -54144 -53622 -60123 -23013 9787 -2147 -29825 -26198 -11642 24014 42301
14204 42301 -24666 -79316 -72957 -82267 -81574 -19704 -20394 -69277 -51317 -46109 -48096 3310 73122
14191G3122J8125J4455J544m5229l9302l6866k1714l3667P528K1091o69K0633
14179b0949N9482r281n0389o3643l0184O9746j1091n0500N4304R2139K7870k230
14167F5274j3846Q153k0802m6833j9291N704j2585K7110m899J525p8689k0494
14155a09673l8250M3997O4231L6057L2140L837j1274l6269N1249M0639J7511l2531
14143F1664q6143j0747K3954j9130j7860k9956k496L9182O2561Q046l2093o3098
14131f6116m5035l0582q600M9860J9365o4779M5685M0924q747l9345L0806j2932
14119h9496j884L1681N6876N9451J0045k6094L571l9995m760J4597o979J6702
14107B3715L2249n4112j6448r246o4828k3794N2159L5500J7241r59o395l196Q335
$$ plain form
14191 73122 91247 105702 107246 62017 22715 -14151 -35865 -69532 -62004 -40913 -41582 -20949
14179 -20949 38533 29252 -21137 -84780 -114964 -45218 -56309 -106809 -52505 39634 67504 65274
14167 65274 51428 59581 38779 -8054 -27345 -21641 -34226 -7116 -12015 -10490 -89179 -109673
14155 -109673 -147923 -103926 -39695 -3638 28502 32339 21065 -15204 36045 76684 94195 61664
14143 61664 -24479 -35226 -11272 -30402 -48262 -78218 -80714 -41532 21029 29075 -3018 -66116
14131 -66116 -111151 -141733 -150333 -100473 -81108 -145887 -100202 -59278 -68025 -107370 -76564 -89496
14119 -89496 -91380 -59699 -2823 56628 66673 40579 44150 4155 -605 13992 7013 23715
14107 23715 55964 1852 -14596 -23842 -88670 -112464 -60305 -24805 -7564 -8523 -14918 -18114 -9779
14094i779L1409K9079L8030j7321o5383j1820J9550k6423R405k7171n8642l096
14082i2162J7025Q391J0628j3102O6318o694j2292l311l834J6968m4448j7071
14070g3584L106J5291N106J6113K986R825K0697q08j2972L2242M2808n116n5350
14057C44L1421J5415J2593K602J4481P930m6177q3730l5016m0523j6915J2893
14045a24682K0251M5085K2896P5192j2000J2548l1737j4894N0318N2523j4849
14034H0651o3047p2317J1185O3878m658L2068K3461l8659q55j7275l7176l0381
14022e3125j3900k4237m8386L0860L8610J6483j4182M34L8168L557k5803L3905
14010a7616L1044p327K9774L5969r4674m5272L4407k559j9696P2653O3658L1175
$$ plain form
14094 -9779 21630 50709 88739 71418 6035 -5785 13765 -12658 -3253 -30424 -89066 -92162
14082 -92162 -75137 -66746 -56118 -69220 -2902 -9596 -21888 -25199 -29033 -12065 -56513 -73584
14070 -73584 -70478 -55187 -50081 -33968 -30982 -21157 -460 -1268 -14240 18002 60810 55694 344
14057 344 31765 47180 59773 62375 76856 84786 38609 -45121 -80137 -120660 -137575 -124682
14045 -124682 -104431 -59346 -36450 38742 26742 39290 7553 -7341 42977 95500 80651
14034 80651 17604 -54713 -43528 20350 15692 47760 71221 32562 31707 14432 -22744 -53125
14022 -53125 -67025 -91262 -139648 -108788 -70178 -53695 -67877 -67443 -29275 -25718 -51521 -17616
14010 -17616 13428 6101 35875 71844 -22830 -68102 -33695 -36254 -55950 16703 80361 111536
13998A11536J6033j7959q4908l4985o1360q1613k1694O3353M7631R8644L9667
13987G4345p857j4830k8984k7477M0142J4240K5183j3367k3138M6449l3021j9066
13975C2619k6884j1509j1488K8806n5882N518j2425k8547Q9433O8834j4744p3991
13963a0260l3609J6727l8283m8861n057N9844j3408J6811M7183m4282j7095O5563
13951d727j8943m3034K6497J7903M1208J0805n7748k6304N3168m1349m2811L4063
13939e1272j55L464J2180p363K7973j1649n7177l6179J7638J10095k016m8895
13927d3356k1912R368K9444n0675l4928L063j339K1805P484Q054O1081O5180l1911
13914B1358m4656l9048L226J3560L5977J8564k9466k3519L0995L9803n4591l6339
$$ plain form
13998 111536 127569 109610 24702 -10283 -71643 -153256 -174950 -111597 -63966 34678 74345
13987 74345 66488 51658 22674 -4803 35339 49579 74762 61395 38257 84706 51685 32619
13975 32619 5735 -5774 -17262 11544 -44338 -38820 -51245 -79792 9641 78475 63731 -10260
13963 -10260 -43869 -27142 -65425 -114286 -119343 -59499 -72907 -56096 -8913 -53195 -70290 -4727
13951 -4727 -23670 -66704 -40207 -22304 18904 29709 -28039 -54343 -1175 -42524 -85335 -51272
13939 -51272 -51427 -47963 -35783 -43146 -15173 -26822 -83999 -120178 -102540 7555 5539 -43356
13927 -43356 -65268 -55900 -26456 -77131 -112059 -108996 -110335 -88530 -81046 -72992 -11911 53269 21358
13914 21358 -23298 -62346 -59120 -45560 -9583 8981 -20485 -44004 -13009 26794 -27797 -64136
13902f4136K6083J8143K723J9870r276n3469l162M6620j6907K544J6488k3237
13890c7716j1706L9327O972J8262J742J2165o8663q233M3590J5596K907M2445
13878E6688j5394j1315j5154m7866q960L1397k7911P228L6769R026n2232j995
13866c9719K4810R001L1458n258M574m233j2128K564J4786m7522l9799M1908M7348
13853B7790k7299J9792O2512o0174J2615m9087m8589J5960Q1222N8458K2005n4239
13841F0966q3710L231L2309j3242R775l6205J605n931o979j2052P341k9861J3284
13828e9469J3364j9821j0026P7166N4416P214o6104o7672L6101P2802M5019L5395
13816A18385j7762q239Q376o1412n1868O319j2886N028p6396m9333k2322l2133
$$ plain form
13902 -64136 -38053 -19910 -17187 2683 -6593 -60062 -63224 -16604 -33511 -30967 -14479 -37716
13890 -37716 -49422 -10095 -3123 15139 16881 29046 -39617 -47850 -4260 11336 14243 56688
13878 56688 41294 29979 14825 -33041 -42001 -10604 -38515 -31287 5482 14508 -37724 -39719
13866 -39719 -14909 -5908 25550 20292 24866 20633 8505 11069 25855 -21667 -61466 -19558 27790
13853 27790 491 20283 82795 22621 35236 -13851 -62440 -46480 34742 93200 115205 60966
13841 60966 -22744 -19513 12796 -446 9329 -26876 -25271 -31202 -38181 -50233 -42892 -72753 -59469
13828 -59469 -46105 -65926 -75952 1214 55630 62844 -3260 -70932 -34831 37971 82990 118385
13816 118385 100623 92384 100760 39348 -12520 -6201 -19087 -14059 -90455 -139788 -162110 -194243
13804a94243N0801J3563j9429L7397J728j450M6394J3466k5143j611J6778l4967
13792i6716M021L0473N474R0595j4700m7542K3938M716N4522m0528J023K1304
13780C6580j6272o7038l7956r069M9835M9443k1116K4680J3772j8437p1211q352
13768g5141J0582L5060n5704M2369M4932J7267N9331j3381J3252j4583M2413M758
13756A11155k9567j3320k2797J8359L9902j8658r0433m0896j8886j8663M0646
13745d3158o714J570J5945M2672j2665j4866r94P8429j9930j9851K2387R9385
13733A42210m4845o4169J9412J1407J5900k644p5566k7709m8895k7575J0571O6897
13721b5006N332j7251K0490K7445Q6037J9540J0477K9937q1453m6033m9307K2873
$$ plain form
13804 -194243 -143442 -129879 -149308 -111911 -110183 -111633 -65239 -51773 -76916 -78527 -61749 -96716
13792 -96716 -92695 -62222 -56748 33847 19147 -28395 -4457 259 54781 14253 15276 36580
13780 36580 20308 -46730 -84686 -93755 -43920 5523 -15593 9087 22859 4422 -66789 -75141
13768 -75141 -64559 -29499 -85203 -42834 2098 19365 78696 65315 78567 63984 106397 111155
13756 111155 81588 68268 45471 63830 103732 85074 -5359 -46255 -65141 -83804 -43158
13745 -43158 -49872 -48302 -32357 10315 -2350 -17216 -18210 60219 40289 20438 42825 142210
13733 142210 97365 33196 52608 64015 79915 77271 1705 -26004 -74899 -102474 -91903 -25006
13721 -25006 -19674 -36925 -16435 11010 97047 116587 127064 157001 75548 29515 -19792 3081
13709C081Q3999l1155j2935m2450J8871L6063J202j2097K9542o3444n98K688q406
13696D361p808k0138k3236M2133L1719J2218K5788p223K6002L6885j2922j0031
13684I7748k6869o971o1615m9806M8891K0216j53m733N672Q653q3373n5489M4925
13671f2904J8903k4932k0338O9588M8731j4512n9094m0484o048K0143N8227Q3614
13659G0894M0734l4323q2226l7935M6380M1303J5391o4094n1117k4049K1622r648
13647f7068l1835M1370O6949J0854j19817J6617j5820K3101L073N952O4506j9671
13635b1789j492j5680l7781K7934O1169J0468l0360k2552N8575M8957P463m8017
13623C6895l7612M5051j0797N34k3431k8073j3813L4781m5342l887J6883l0061
$$ plain form
13709 3081 87080 55925 42990 540 19411 55474 56676 44579 74121 10677 10079 12767 4361
13696 4361 -3447 -23585 -46821 -4688 27031 39249 65037 57814 83816 120701 107779 97748
13684 97748 70879 63908 2293 -47513 1378 21594 21441 16708 22380 31033 -52340 -107829 -62904
13671 -62904 -44001 -68933 -89271 -19683 29048 14536 -44558 -85042 -91090 -70947 -12720 70894
13659 70894 111628 77305 -4921 -42856 3524 44827 60218 -3876 -54993 -79042 -57420 -67068
13647 -67068 -98903 -57533 9416 20270 -99547 -82930 -98750 -75649 -72576 -66624 -2118 -21789
13635 -21789 -23281 -38961 -76742 -48808 12361 22829 -7531 -30083 28492 77449 84912 36895
13623 36895 -717 44334 33537 34071 10640 -17433 -31246 3535 -41807 -45694 -28811 -58872
13611e8872J32L8494L7856N6812K6311J646k6719K3593m459m4359k0681k8245
13599A509k4768l7553L6114N0398P398k7099r971q904l2679N774L0240P339L9389
13586C7187l1566q707l352L989M9670k5631p7968L3911k138m8756J7590Q2803
13574B7032N3004l8479j4622l8704j0193m6893K4658N0505L6398K48n9252k7504
13562d3802M8344O8087j1159K3532k3055m4933m3621R393O7555j1241N281J9174
13550F3555j7936O7118K4519l8362l0689k4148p0137m8660M2229Q4336K9758p4691
13538F892k6728k6679j4864k573K8363l4593k1144M9032k3461N0458P2591J3243
13526G0537j9662J0552m4987j5577l0093L72N012L3722k0320o7458l2894K3093
$$ plain form
13611 -58872 -58740 -20246 17610 74422 100733 102379 75660 99253 94794 50435 29754 1509
13599 1509 -23259 -60812 -24698 25700 33098 5999 -3972 -12876 -45555 -39781 -9541 -2202 37187
13586 37187 5621 -3086 -6438 -2449 47221 21590 -56378 -22467 -24605 -73361 -55771 27032
13574 27032 80036 41557 26935 -11769 -21962 -68855 -44197 6308 42706 42954 -16298 -43802
13562 -43802 4542 72629 61470 85002 61947 17014 -26607 -17214 50341 39100 44381 63555
13550 63555 45619 112737 137256 98894 68205 44057 -26080 -74740 -32511 51825 81583 6892
13538 6892 -19836 -46515 -61379 -63952 -35589 -70182 -91326 -42294 -65755 -15297 57294 70537
13526 70537 50875 61427 16440 863 -29230 -28858 -23846 9876 -10444 -77902 -110796 -87703
13514h7703M2300J0572n2297O6117O848J5635k4317o0993R682o21L2770P3172
13502C1165N1277L0770n4371m1591L2032n8286k852J9880K7746M622l8319q814
13490f741j2639k1687m5173j3161L4016L2342M1764K6443k4051k6927m0270M4479
13478a1605L2530p6724n4837O6019N3448j6822k8306L090N052M9167J7465l8599
13466a22m6967P444M4004L2095J4155j1552o8212o2789k0354J7503Q8933L9374
13454C3512K926j407M6437j8637j4879k3533k5232j400J5151n4186P657O4663
13442C1072O5301N8933k3432j21650l4586N4081J4395k3155K4778l4091j0648
13431I98J3886k9143K2162J7964O136j2342o608K3662k0668m5006n0619j8844
$$ plain form
13514 -87703 -45403 -34831 -87128 -21011 -14163 1472 -22845 -83838 -74156 -74777 -42007 31165
13502 31165 82442 113212 58841 17250 49282 -9004 -11856 8024 35770 40392 2073 -6741
13490 -6741 -19380 -41067 -86240 -99401 -65385 -33043 8721 35164 11113 -15814 -56084 -11605
13478 -11605 20925 -55799 -110636 -44617 8831 -7991 -36297 -33207 -28155 21012 38477 -122
13466 -122 -47089 -39645 4359 36454 50609 39057 -29155 -91944 -112298 -94795 -5862 33512
13454 33512 36438 35031 81468 62831 47952 24419 -813 -2213 12938 -41248 -33591 31072
13442 31072 96373 155306 131874 10224 -24362 29719 44114 20959 45737 11646 998
13431 998 14884 -14259 7903 25867 32003 19661 13053 36715 16047 -28959 -79578 -98422
13419i8422J8040O8464k5793M288L8807L1591P574L0313J100k5086j8204J2294
13407D4966j3223K3839L6743k7521m3128p0748k1959K5881J3321p177L2255J7347
13395A0596l1649j2236m5477J7959L1672J7761K031l8976m5327k2157J8050K7264
13383g0489L5649O298O430j2792l1884K0754L6843j2758L3052L8494P980q8781
13371c1204m3922N8908K9532j2577r705O902p3842l0709M0024n390L1980K1020
13359a8983P014l588p6302k966K6438O0264L9664k0364n6337r21n373l599M3412
13346a1641L5783k9824n5141m4515J9376J08991O420L1667M3342K9027j3487l3267
13334H6731l3106l2089j9345k7204m8464L1698j8439O7724N8450l9740o8972k704
$$ plain form
13419 -98422 -80382 -11918 -37711 -33423 5384 36975 44549 74862 75962 50876 32672 44966
13407 44966 31743 55582 92325 64804 21676 -49072 -71031 -45150 -31829 -39006 -6751 10596
13395 10596 -21053 -33289 -78766 -60807 -29135 -11374 -9343 -48319 -93646 -115803 -97753 -70489
13383 -70489 -34840 -28542 -22112 -34904 -66788 -46034 -9191 -21949 11103 49597 57577 -31204
13371 -31204 -75126 -16218 13314 737 -8968 -2066 -75908 -106617 -66593 -71983 -40003 -18983
13359 -18983 -11969 -15557 -91859 -94825 -68387 -8123 31541 11177 -45160 -46081 -51454 -55053 -11641
13346 -11641 24142 -5682 -60823 -105338 -85962 23029 29449 61116 104458 133485 119998 86731
13334 86731 53625 21536 2191 -25013 -73477 -41779 -60218 7506 65956 26216 -42756 -45460
13322d5460P167r249J6850r066O3548m6907p0957j0223M209j8045j6914O8054
13310f6993O5964L6141K9751Q28L379n8370j6088P7911P260m3073l0119j9739
13298a3148L5241P58M5148J6498j8093l5945j3545k5998P504M9082O9744L921
13286A21167m9411O6006l172J7693N4285M2104P2891R9161J81200J78805K83371
13275A064100L91215K24123L5415j96247l25305l47108k99630j53776q6247p0656
13265B35884n0983l7096o7224n0576J8779L4349p6067k144j2763J704M490L1213
13253B9566J4833n2970R493N9509K0874M8651J363K1107r376q4011n2563r626
13241c150J8858L5531m9380j1822j9376L570N5312N0337J0144j2305l3146K973
$$ plain form
13322 -45460 -38293 -47542 -30692 -39758 23790 -23117 -94074 -104297 -100088 -118133 -135047 -66993
13310 -66993 -1029 35112 64863 65691 69070 10700 -5388 72523 79783 36710 6591 -13148
13298 -13148 22093 22851 67999 84497 66404 30459 16914 -9084 -1580 47502 117246 121167
13286 121167 71756 137762 134590 152283 206568 248672 321563 420724 601924 780729 1064100
13275 1064100 1455315 1679438 1714853 1518606 1193301 846193 546563 392787 306540 235884
13265 235884 184901 147805 80581 30005 48784 83133 7066 4922 -7841 -6137 -1647 29566
13253 29566 44399 -8571 922 60431 81305 129956 131319 152426 143050 59039 6476 -3150
13241 -3150 15708 51239 1859 -9963 -29339 -25769 29543 79880 90024 77719 44573 47546
13229D7546n511o5876p039j6067o397L6944l1588M2142J1572m5654K1920l1791
13217d9799n2335j5370M4089M8072R56l0646j0016J1098O3541L7840k3807J1267
13205C4890j582n3321k1194J4076M8629N6632K8311k2812N472o160k7232r617
13193D6092j7685J3004k1360n2810Q538O0490L311k8455k8768J2142O5561l2250
13181B7810n1026Q47n2358K3331J2009O6851P334n009k6735m0919J9926O1841
13169D3902m2915j4168K7518o951K83k0127K1321j4925K4759L8189J1712K0594
13157H9192J2648j2510l4841j7507L0165j4761l0866r5685k2613M7951M8547l536
13145c816K6275L4260k6615K1899l8210k6556N4715j4605N8864P4852J5032o7279
$$ plain form
13229 47546 42035 -23841 -30880 -46947 -53344 -16400 -47988 -5846 5726 -39928 -18008 -49799
13217 -49799 -102134 -117504 -73415 -25343 -24387 -55033 -65049 -53951 9590 47430 23623 34890
13205 34890 33308 -20013 -41207 -27131 21498 78130 106441 83629 89101 82941 55709 46092
13193 46092 28407 41411 20051 -32759 -24221 36269 39580 11125 -17643 -5501 60060 27810
13181 27810 -23216 -22369 -74727 -51396 -39387 27464 34798 29789 3054 -37865 -17939 43902
13169 43902 987 -13181 14337 7386 7669 -12458 8863 -6062 18697 56886 68598 89192
13157 89192 101840 89330 54489 36982 67147 52386 21520 -74165 -96778 -48827 -280 -3816
13145 -3816 22459 56719 30104 52003 13793 -12763 41952 27347 86211 161063 176095 108816
13133A08816J8930J3529j04335J2473L9074o691m7419K0221L0289Q855o1031l4280
13121a569k6418j6131O6762M5976o4622n5393N4991O1364l2958M1005O4659l5875
13109A01791q0357o6386m224O4656q87j063K454L5457O690q2009J3623K6911J0829
13096B7485N4016K0978o0736k4230N7716k3535M672K7622L8958Q4062l4118o1611
13084A11279r765p6316m3833k9379j0813k1092L5954j4752l6853L6319j9717J8014
13072f0954m9336L599J8124J1431N0371N0165l6394J710n8642j433M5261K7337
13060A239N6783k8450n2347J9325J5479p2248k1877M6333M6932k9776J7692q749
13048i664K7053K5166l3139j5225j1787N4905N4120p2003r991L2811n612k4927
$$ plain form
13133 108816 127746 141275 36940 49413 88487 81796 34377 54598 84887 93742 32711 -1569
13121 -1569 -27987 -44118 22644 68620 3998 -51395 3596 64960 32002 73007 137666 101791
13109 101791 21434 -44952 -49176 15480 14593 13530 15984 51441 58131 -23878 -10255 16656 27485
13096 27485 81501 102479 41743 17513 75229 51694 56366 83988 122946 207008 172890 111279
13084 111279 101514 25198 -18635 -48014 -58827 -79919 -43965 -58717 -95570 -59251 -78968 -60954
13072 -60954 -110290 -106691 -88567 -77136 -26765 23400 -12994 -11284 -69926 -71359 -26098 1239
13060 1239 58022 29572 -22775 -3450 12029 -60219 -82096 -35763 11169 -18607 -915 -9664
13048 -9664 17389 42555 9416 -5809 -17596 37309 91429 19426 9435 42246 36634 11707
13036A1707j7573o7754l3137j4158N0607j501k5033L9799J2482j8547r793L115
13024f9786R981L4840N5047k585k2804m5824n639L6433J1661p5893o0155O0828
13012g3896K6597j9375k816J2592l501K6845M5134K1401M2925j7010l4038L105
13000B7963j2483J4883K1990L2474J1958p5886k4602o0769O8903P4981K3905R771
12988A13088l4105n5278m1847J6843n6278j9731m5139m8200K7228N3863M2620
12977d6936M3424L5819J5504P077J1279k3178k4733L5616N540o5631p3417m8772
12965a28408K7936P6454J3982o1475k0189J3977P7104L1278k8409M7771J0478
12954F0499L4852L5744M0865j1737j0207l2323l0478l1417O614M9849J857m6543
$$ plain form
13036 11707 -5866 -73620 -106757 -120915 -70308 -71809 -96842 -57043 -44561 -63108 -72901 -69786
13024 -69786 -59805 -24965 30082 27497 4693 -41131 -46770 -10337 1324 -74569 -134724 -73896
13012 -73896 -47299 -66674 -69490 -56898 -60399 -33554 11580 32981 75906 58896 24858 27963
13000 27963 15480 30363 52353 84827 96785 20899 -3703 -64472 4431 79412 103317 113088
12988 113088 78983 23705 -18142 -1299 -57577 -77308 -122447 -170647 -143419 -89556 -46936
12977 -46936 -3512 32307 47811 54888 66167 42989 18256 53872 59412 -6219 -79636 -128408
12965 -128408 -100472 -24018 -10036 -71511 -91700 -77723 -619 30659 2250 50021 60499
12954 60499 95351 131095 171960 160223 150016 117693 87215 55798 62412 112261 114118 67575
12942F7575J2314K2897l781N035L3268k1808k1796o7500l2839M9453M2133m0422
12930D4529j9393J4373k3283k9178M7825N3882O8885k9036J9514K8699L8199J3809
12918B28825m301J9656m680o146k670m6246j291O8358L2892n927j0804n652K2802
12905B84816L285n5001j2446L0423J4508J7261M7497M1459M1816k6120k8529M4239
12893D03208o413n055L0285K6021O0643L0032M7035L3980M9332j0247O6021O4158
12881G89000L087L0039K5543P3628J20040K6899M3166N7094L8807l6053J20795
12870A292045J85840J51415J41382J89790J90912K93114L32010K80605L20874
12861C377987L85478N18646O27859P25733R05080J022384J121322J220906J263572
$$ plain form
12942 67575 79889 102786 99005 104040 137308 115500 93704 26204 -6635 42818 84951 44529
12930 44529 25136 39509 16226 -12952 34873 88755 157640 128604 148118 176817 215016 228825
12918 228825 224524 244180 239500 233354 230684 184438 183147 251505 284397 278470 267666 262014 284816
12905 284816 288101 233100 220654 251077 265585 282846 330343 371802 413618 387498 358969 403208
12893 403208 396795 391740 422025 448046 508689 538721 585756 619736 669068 658821 724842 789000
12881 789000 792087 822126 847669 921297 1041337 1068236 1111402 1168496 1207303 1171250 1292045
12870 1292045 1477885 1629300 1770682 1960472 2151384 2444498 2776508 3057113 3377987
12861 3377987 3763465 4282111 4909970 5635703 6540783 7563167 8684489 9905395 11168967
12852A1168967J401183J531694J758289K073175K552464L192180L859955M464337
12844C2002244N065717N782455O732146Q262064J1569971J8277718L1080924N1920809
12836A70694048P2768558O8728420L1075513k3490254o2688813p1429747n9085073
12829A26572652l9695355k4683997j5479826j0045538o810601m972721l856741
12822B1027873l128194k659912k192725j886291j534134j210109j057847q39167
12814F519494o50153n33296m24594m21391l40284l01825l22798l24090k54221
12805B946842j42319j90696j17197j79563j62295o6783k8250j18464q6105j17999
12795A737171j23263j35281j28937j14209p1707m6553o6886j26327l1524j132
$$ plain form
12852 11168967 12570150 14101844 15860133 17933308 20485772 23677952 27537907 32002244
12844 32002244 37067961 42850416 49582562 57844626 69414597 87692315 118773239 170694048
12836 170694048 243462606 312191026 343266539 319776285 257087472 185657725 126572652
12829 126572652 86877297 62193300 46713474 36667936 29857335 24884614 21027873
12822 21027873 17899679 15239767 13047042 11160751 9626617 8416508 7358661 6519494
12814 6519494 5869341 5336045 4911451 4490060 4149776 3847951 3525153 3201063 2946842
12805 2946842 2804523 2613827 2496630 2317067 2154772 2087989 2059739 1941275 1855170 1737171
12795 1737171 1613908 1478627 1349690 1235481 1163774 1117221 1050335 924008 892484 891352
12785H91352o4260n6913J8787j9166l2247J597n223n8554l1391K9780J7593m7632
12773F43723n1630j8468o8002O766N3150k4428p2802o0722m058J1299K7068l6357
12761D05539O870l91j5639J6727K6659j3474l8440N9208J7669o1411l3973L3464
12749D02808p4158K020P9375K6116K7669M8501m2156m2490K9233r815q306L2699
12737D71496m545j5484M573m000M1299J8140Q962R959L533O0210L4307L4381J24670
12724G87501J48185K77485L54727K79249O1853k37363l41299l86820k24379j50413
12714E68726p6561n9324m4301j8432L9605L0990Q008L2931N9483L16n2436l2368
12702D56637m2237o7653k1118l5581k3069j9905k4701l1360L6388n4094m2504
$$ plain form
12785 891352 827092 770179 788966 769800 737553 739150 733927 675373 643982 673762 691355 643723
12773 643723 592093 573625 505623 512389 565539 541111 468309 407587 403529 414828 441896 405539
12761 405539 412409 412018 396379 413106 439765 426291 387851 447059 464728 403317 369344 402808
12749 402808 328650 330670 410045 436161 463830 512331 470175 427685 456918 447103 438797 471496
12737 471496 466951 451467 456040 452040 493339 511479 520441 530400 533933 594143 628450 662831 787501
12724 787501 935686 1213171 1567898 1847147 1909000 1671637 1330338 943518 719139 568726
12714 568726 492165 432841 388540 370108 409713 440703 448711 481642 541125 541441 489005 456637
12702 456637 414400 346747 325629 290048 266979 247074 222373 191013 227401 173307 130803
12691A30803L2095Q316M8842q365j1621n470O956n972k7776l1526l5223m3605
12679E7454m2759j1380L7940k5376L7270p217Q9208L0958M027R413n7866M1439
12667A63111O7057n2498n6291q723K6224N6618j3601J612K4195j9973J844K3447
12655B13022L723j8359k6616J0503K1831K6735K38m8443K5400J5634q268o0910
12643A54490K3155o194N8791J7167m1275n009l9953L535k3977n1096Q7110L3378
12631B10122p7567j9276M3719Q996l2102l2928P912L8953Q61p7098m4415L4378
12619F1555l6784l4837m0456N0770P2956K6906m813k3795q0763L447K9133K4209
12607D7528j4308l7346N0062K1805m9693l3712L4715M2364L2269k6314L2608k9820
$$ plain form
12691 130803 162898 171214 220056 211691 200070 194600 201556 195584 167808 136282 101059 57454
12679 57454 14695 3315 41255 15879 53149 45932 135140 166098 170125 179538 121672 163111
12667 163111 230168 177670 121379 112656 138880 195498 181897 183509 207704 187731 189575 213022
12655 213022 216745 198386 171770 182273 204104 230839 231077 182634 208034 223668 215400 154490
12643 154490 177645 171451 230242 247409 206134 201125 161172 164707 140730 89634 176744 210122
12631 210122 132555 113279 156998 165994 133892 100964 108876 147829 148690 71592 27177 61555
12619 61555 24771 -10066 -50522 248 73204 100110 95297 71502 -9261 -5814 23319 47528
12607 47528 33220 -4126 45936 67741 18048 -15664 19051 61415 93684 67370 99978 70158
12595G0158J1406L4287m1048j0973N4835j2546n5555k1849L8164K4593k6262J7074
12583H2284j2431q863M6527L1065l5929n3045k6477J6577j2966J3807J9565M922
12571F5036n848M7259M4968L3185m8450n0443m3099m9164j8231l3045j628N2256
12559g204L0713l5327m7223K1831J2968O6508K681m1588j8369m6554K308J6644
12547d2612k201J1009m1252J6801J8239M4888N6879m068l1886k4352K5093J257
12535B7795m0006N9478k4637O656J6692m6078J9851K8335m9275K431R2644N172
12523I9058n8101R459N6166k3777p3814m3215J1021j5560M1486k3464j2278M548
12511b8471N0497p209K2717J0677j8856k6223k9295n377k0769R859P767M8391
$$ plain form
12595 70158 81564 115851 74803 63830 118665 106119 50564 28715 66879 91472 65210 82284
12583 82284 69853 60990 107517 138582 102653 49608 23131 39708 26742 40549 60114 65036
12571 65036 59188 106447 151415 184600 136150 85707 42608 -6556 -24787 -57832 -59460 -7204
12559 -7204 23509 -11818 -59041 -37210 -24242 42266 44947 3359 -15010 -61564 -59256 -42612
12547 -42612 -44813 -33804 -75056 -58255 -40016 4872 61751 57683 25797 1445 26538 27795
12535 27795 -12211 47267 22630 29286 45978 -100 19751 48086 -1189 1242 93886 99058
12523 99058 40957 50416 106582 82805 8991 -34224 -23203 -38763 2723 -20741 -33019 -28471
12511 -28471 22026 14817 37534 48211 29355 3132 -26163 -31540 -52309 -42450 -34683 13708
12499A3708k8965k920L5501k9933k0547R6343K4517K5240K6603q6864k8035N2729
12487G7377K4993j09198k9421L1096L8665N0296m769m2090M0220P6289n7455l5555
12475F0448J528n836j1763N4151R031k9886n5819l3971R253m0664O898N2637O2503
12462G8510p059P342k6239j7617n8408N399L7565r842L3362O831j5923j1082M6627
12449F9466L1739p283j9389m063l7954l6335j0378M2529j9069j8460K8307l99
12437A8711l8584k3154m2809k2645K1104M1921K2038r427K7528R9816L7999m2757
12425H9741n7756p623j6594m854L0834K1439l0877J1830J5087L6299L8393J7457
12413A43376m6450l3816l8805O4801Q9438J6434m783o4829q8851k8739N3312L1038
$$ plain form
12499 13708 -15257 -18177 17324 -12609 -33156 63187 87704 112944 139547 52683 24648 77377
12487 77377 102370 -6828 -36249 -5153 33512 83808 79039 36949 77169 153458 96003 60448
12475 60448 61976 56140 44377 98528 107559 77673 21854 -12117 -2864 -43528 -36630 16007 78510
12462 78510 71451 78793 52554 34937 -23471 -18072 19493 9651 43013 49844 33921 22839 69466
12449 69466 101205 93922 74533 70470 32516 -3819 -14197 28332 9263 -9197 19110 18711
12437 18711 -19873 -43027 -85836 -108481 -87377 -45456 -23418 -32845 -5317 94499 132498 89741
12425 89741 31985 24362 7768 2914 33748 55187 24310 36140 51227 87526 125919 143376
12413 143376 96926 63110 24305 89106 178544 194978 190195 125366 36515 7776 61088 92126
12401I2126J3409n119K9288P661J5461k569J6814R1362J67615K06306L00454M02947
12389A335755K89600J61091j75669k93136l18923l14260j92018j35386p3728q8802
12379A94524p0312p6779q0636m5412r946N4530N6595L6627L0280L2433o35J736
12367A23005l5536q0836M6191L8119r876j881k2857l8615r997j1706j4140l2871
12355e1000J7545N1794Q1662M4335m1406l7684j1762m7464L3438N9331J245l7433
12343F2601p2221N0334K5994o5477j8920k4910M5265Q3734M7408l6159o2835o5060
12331c0246o0034K7549L8070n601r525O2131j8247K6582M6823M7644L5437l6085
12319A24498N0354n509k3941J4597j8706l8408l3170M217L1594n0243l1710o2363
$$ plain form
12401 92126 105535 100416 129704 137365 152826 150257 167071 258433 426048 632354 932808 1335755
12389 1335755 1625355 1786446 1610777 1317641 998718 684458 492440 357054 283326 194524
12379 194524 124212 47433 -33203 -78615 -88561 -34031 22564 59191 89471 121904 121269 123005
12367 123005 87469 6633 52824 90943 81067 79186 56329 17714 7717 -3989 -18129 -51000
12355 -51000 -33455 18339 100001 144336 102930 65246 53484 6020 39458 98789 100034 62601
12343 62601 -9620 40714 66708 1231 -17689 -42599 2666 86400 133808 97649 34814 -30246
12331 -30246 -90280 -62731 -24661 -30262 -39787 22344 4097 30679 77502 125146 160583 124498
12319 124498 174852 169343 145402 159999 141293 102885 69715 73932 105526 55283 23573 -38790
12307c8790k0761M4450J5148K2752r528j1565P050M8792k9860q0321j5096j9222
12295h6951k6557n5N1015K636j6435l336Q765K951N5295J7288M289K7982R019
12282D5906N365n476K1657o0921J6476K2546k0998q056l2622k6310P2127o647
12270B3047m2802m9611L3407L0201L8975Q153L4785k035l863n298q1881o3789
12258h0711K1000M3501K8933k5785l231L3995M802j2373j8068J9238l1020J8592
12246a127J3540n7939K6521Q6417M7991n1343m5541m2465j9611l8754k8888L5887
12234g5312J8970r135M0779P2754O0l6652l3717j5554O1112L2718k1677j2135
12222B2211k1875k8651L2358n75O885J9458q5719j7807q469L5462m141M5387r01
$$ plain form
12307 -38790 -59551 -15101 47 22799 13271 1706 8756 57548 27688 -52633 -67729 -86951
12295 -86951 -113508 -113563 -62548 -59912 -76347 -79683 -70918 -67967 -12672 4616 8905 36887 45906
12282 45906 51271 45795 67452 6531 23007 45553 24555 16499 -16123 -42433 29694 23047
12270 23047 -19755 -69366 -35959 -5758 33217 41370 76155 74120 70257 64959 -16922 -80711
12258 -80711 -59711 -16210 12723 -13062 -16293 17702 22504 10131 -7937 11301 -19719 -1127
12246 -1127 12413 -45526 -19005 67412 115403 64060 18519 -23946 -43557 -82311 -111199 -75312
12234 -75312 -56342 -65477 -24698 48056 48116 11464 -22253 -37807 23305 56023 34346 22211
12222 22211 336 -28315 4043 3468 10353 29811 -55908 -73715 -82184 -46722 -50863 -5476 -6377
12209f377n226j939K7171K4337M0439L4862m177j33587q0823j3448K6971N1219
12197d0578J4370k376K8197K6273o4381q476p791K5581O4204j8569P732J6458
12185D0644j5266r3816K0104M5787N1279O427N1758m909l6900m8730p690R806
12173A8494J471Q410J2510k4628m2361R527J6419l0524l922Q797Q3262K7194n052
12160G9597l1079q4269j8319M543N3706Q2339R465q728n0292n5638l3114l5879
12148h7668O2702L7088k8656k3118M6995M9429N307l7053o283P1865M2706p6337
12136E6977k1892J5279M1719j0419q0161L9162N363o3555k5574Q4503J6050j224
12124E6228k8002p1957K0568M1928K0063m4282K4971M4344P105k1624J6478q430
$$ plain form
12209 -6377 -11603 -13542 13629 37966 78405 113267 109090 -24497 -105320 -118768 -91797 -40578
12197 -40578 -26208 -28584 -387 25886 -38495 -46971 -54762 -29181 35023 16454 24186 40644
12185 40644 25378 -68438 -48334 -2547 48732 55159 106917 102008 65108 16378 8688 18494
12173 18494 19965 28375 40885 16257 -26104 -16577 -158 -30682 -34604 -25807 57455 84649 79597
12160 79597 48518 -35751 -54070 -49527 4179 86518 95983 87255 36963 -18675 -51789 -87668
12148 -87668 -24966 12122 -16534 -39652 7343 56772 62079 25026 18743 90608 133314 56977
12136 56977 35085 50364 92083 81664 1503 40665 46028 -17527 -43101 41402 57452 56228
12124 56228 28226 -43731 -23163 18765 38828 -5454 19517 63861 70966 49342 65820 57390
12112E7390o561j4425Q903j353M3833m6246k5544J1363R102m0824j4729J5803
12100c288n1735j50J6727J7839k4852k2239L8163M4354l8569o1397j0440L9649
12088e5938J1425J5190J8897Q004O092P330J6046l0145o0200m6328L3542J4352
12076f1733Q9602K6846j9336J1181J3938k2287K6436j351p135j6395q9651o5991
12064a15876l5359r087Q182q328M6475P1236K463n9820J2540L9963J8697J8989
12052i925o1423p7596Q0465K8323P827J6886n2289M2800K5496O688n1556K089
12040d2215L583K3943N1034M366n9417n7440K4662J9047n468j6554O5626N0945
12028F2112L5189K7236k0721n3693p7477m4726N7424M058m1185N390r424J2709
$$ plain form
12112 57390 50829 36404 45307 43954 87787 41541 15997 27360 36462 -4362 -19091 -3288
12100 -3288 -55023 -55173 -38446 -20607 -45459 -67698 -29535 14819 -23750 -85147 -95587 -55938
12088 -55938 -44513 -29323 -10426 -2422 3670 11000 27046 -3099 -63299 -109627 -76085 -61733
12076 -61733 27869 54715 35379 46560 60498 38211 64647 63296 56161 39766 -49885 -115876
12064 -115876 -151235 -160322 -152140 -160468 -113993 -42757 -40294 -100114 -87574 -47611 -28914 -9925
12052 -9925 -71348 -148944 -68479 -40156 -32329 -15443 -67732 -24932 564 7252 -44304 -42215
12040 -42215 -38632 -14689 36345 40711 -18706 -76146 -51484 -32437 -37905 -54459 11167 62112
12028 62112 97301 124537 103816 50123 -27354 -72080 -14656 -10598 -51783 -46393 -55817 -43108
12016d3108L7882p223Q385M707O907j6074q9813L3059P4474J7939K0421m3213
12004D343L0116J3107N203n4553j6572K5857P811q063l0972l3836L52L7929P0035
11991E0757R253k3741k140o460K018N844m2053Q006l1053j7260j8671M1167M3741
11978A9408m7188q1884J011j7686N1542M8177K1698K4219O1984N6695j02853r4006
11966e8883M146Q420J626O7673k2939o7203l5498M274K8531K8445K7888q293k979
11953b4792L6511M0543o0056l4434K031K1672Q629k0988P9111J5503o8280l5647
11941d0197O0031N2436L6171q8035l4210k8566l20M2815p777k3668k5867O5853
11929H666P661k4042j02226N54J05631Q211m3280j4748p444L210j8455m6710J6837
$$ plain form
12016 -43108 -5226 -12449 -4064 643 7550 -8524 -98337 -65278 9196 27135 47556 4343
12004 4343 34459 47566 52769 -1784 -18356 7501 15312 7249 -23723 -57559 -57207 -19278 50757
11991 50757 60010 36269 34129 27669 29687 35531 -6522 1484 -29569 -46829 -65500 -24333 19408
11978 19408 -27780 -109664 -108653 -126339 -74797 -26620 -4922 19297 81281 137976 35123 -58883
11966 -58883 -54737 -46317 -44691 22982 43 -67160 -102658 -98384 -69853 -41408 -13520 -21813 -24792
11953 -24792 11719 52262 -7794 -42228 -40197 -18525 -9896 -30884 48227 63730 -4550 -40197
11941 -40197 19834 72270 108441 20406 -13804 -42370 -42690 125 -7652 -31320 -57187 8666
11929 8666 16327 -7715 -109941 -109387 -3756 4455 -38825 -53573 -61017 -57807 -76262 -122972 -106135
11916a06135K3496j4618P536N2265K1263K391k7374M427K5564k5565m3510L1786
11904d8474j3580J4015M4581L7504k097K7512o410q6200j3278M0344M5973L308
11892D3198l7770m8441k7761K5188l038N368J8757K1959N1431j0090p9854l2957
11880g4010N1483Q1237k7375q0680Q277j91N4263K6590k1836m5973K3615Q6754
11868H2154p0552k9795j6142K8125k842o8605L3446M9200j3314N834N3518K4567
11856G5594J5654j7727J0610J031j9955l247m2376P706k7272l6105m0740l443
11844h0270O3302M301l342P0347K0937l7770j1786J408K1997j4077K0412k815
11832E2644l5152j9867j6848O9927L5049m8134p4670K5345O5281k698p1260J3575
$$ plain form
11916 -106135 -82639 -97257 -89721 -37456 -16193 -13802 -41176 -36749 -11185 -36750 -80260 -48474
11904 -48474 -62054 -48039 -3458 34046 31949 59461 53051 -33149 -46427 -6083 39890 43198
11892 43198 5428 -43013 -70774 -45586 -48624 -43256 -24499 -2540 48891 38801 -41053 -74010
11880 -74010 -22527 58710 31335 -49345 -41068 -41259 13004 39594 17758 -28215 -4600 82154
11868 82154 11602 -18193 -34335 -6210 -9052 -77657 -44211 4989 -8325 -2491 51027 75594
11856 75594 91248 73521 84131 85162 65207 61960 19584 27290 18 -36087 -76827 -80270
11844 -80270 -16968 -12667 -16009 54338 75275 37505 25719 27127 49124 35047 55459 52644
11832 52644 17492 -2375 -19223 50704 85753 37619 -37051 -11706 53575 50877 -20383 -6808
11820f808K4808j2935J3414m6410K6895J9613j8708J6584J0463m5682K5810k8209
11808b1165k8340L8107R652j5925j5848J9647q058J546J3284M9382j0669m847
11796B6766J1693l8516l605N7398j5073n4591J5189j2542j1290j3838k5908N0301
11784a4016m1725L1249k579l5780k2241k3799N9937L1394K8214n3330J8484K6433
11772B241L3193P1297j6550l5136m7467k2551q81j1545o086m7282J0675j5543
11760h5635l2275n3878L7062M6086L5718K8528r321o2264k1496M5761o122P66
11748g7070O292L1232M9999P749j3919J3014K017n1813J6794L4188L7242k9731
11736B5994j2898k1237l3061n676J0518L2198N4028M554k7053j2925j4507J8294
$$ plain form
11820 -6808 18000 5065 18479 -27931 -1036 18577 -131 16453 26916 -18766 7044 -21165
11808 -21165 -49505 -11398 -1746 -17671 -33519 -13872 -21930 -20384 -7100 42282 31613 26766
11796 26766 38459 -57 -3662 53736 38663 -15928 -739 -13281 -24571 -38409 -64317 -14016
11784 -14016 -55741 -24492 -27071 -62851 -85092 -108891 -48954 -17560 10654 -42676 -24192 2241
11772 2241 35434 106731 90181 55045 7578 -14973 -15854 -27399 -33485 -80767 -70092 -85635
11760 -85635 -117910 -171788 -134726 -88640 -52922 -24394 -33715 -95979 -117475 -71714 -77836 -77070
11748 -77070 -70778 -39546 10453 18202 4283 17297 19314 -32499 -15705 18483 55725 25994
11736 25994 13096 -8141 -41202 -46878 -36360 -4162 49866 54420 27367 14442 -65 18229
11724A8229N337J6652L6115K3956k9932k5777l7845L2890m6708l9970M0250j9616
11712b6419M226M3749L5173j3736k1166n6863o1114M3260K3192J2714K0388N468
11700H872L6368k5127J6218j4500k6018R127J2735l5713O969p6524K4386Q3479
11688B0272M6953J0952k3691n405m1154j8630o2450r666O8531k1819j5720O496
11676d5331k0571k7203n405N1680M4083J7972j2780J9031k459l7860j3719P552
11664b5010K5316k3608j8971l3924L3086j2927o272j7350m4932m1868Q2361M8214
11652c5885m2626L3822k3547m6788P66L6364k0005L0946O1362Q453j7490N4987
11640D0359J3750N8878K098L871n7699j07468j0300R646J8886Q73M180O5907N785
$$ plain form
11724 18229 23566 40218 76333 100289 70357 44580 6735 39625 -7083 -47053 -6803 -26419
11712 -26419 -22193 21556 56729 42993 21827 -35036 -96150 -52890 -29698 -16984 3404 8872
11700 8872 45240 20113 36331 21831 -4187 4940 17675 -18038 -11069 -87593 -63207 20272
11688 20272 67225 78177 54486 49081 7927 -10703 -73153 -82819 -14288 -36107 -51827 -45331
11676 -45331 -65902 -93105 -98510 -46830 -2747 15225 2445 21476 19017 -18843 -32562 -25010
11664 -25010 306 -23302 -42273 -76197 -43111 -56038 -62310 -79660 -124592 -166460 -84099 -35885
11652 -35885 -78511 -44689 -68236 -115024 -114258 -77894 -97899 -66953 -5591 2862 -14628 40359
11640 40359 54109 112987 115085 118956 61257 -46211 -56511 -46865 -27979 -27106 -22926 42981 48766
11627D8766p321j6883m3822j4158k639n7145J5560N8629j3703l7412o387N8608
11615a7907j066n1707n3980O0098O5290N6237j04o1667n6514j0174M8106O9522
11603D6134m553M883l2486o3642k2085K3597Q3431N400o3394K5328L0830K7887
11591F1330j1492p5259k7068p048N9773J5957l4710R690k0697n488j0135n1424
11579i6571m5052r494M2622O5671R353O572J8625K5782M6905K0236L0769r075
11567A06343k7710K0183O495m0084k3357P4128k2503J3289P886q0032n1210P2760
11555E6188M1436J4907m1385J3421q475k3432j6415l3761J2693J4120l3408l4099
11543c8210j9925O7641L6672l3423k1298o8404L6133M4036o2002j1647m5167j5134
$$ plain form
11627 48766 41445 24562 -19260 -33418 -36057 -93202 -77642 -19013 -32716 -70128 -76515 -17907
11615 -17907 -18973 -70680 -124660 -64562 728 56965 56861 -4806 -61320 -71494 -23388 46134
11603 46134 41581 46464 13978 -49664 -71749 -48152 35279 40679 -22715 2613 33443 61330
11591 61330 49838 -25421 -52489 -59537 236 16193 -18517 -8827 -29524 -35012 -45147 -96571
11579 -96571 -141623 -151117 -108495 -42824 -33471 -26899 -8274 17508 64413 84649 115418 106343
11567 106343 78633 98816 105311 65227 41870 115998 93495 106784 114670 34638 -16572 56188
11555 56188 97624 112531 71146 84567 76092 52660 36245 2484 15177 29297 -4111 -38210
11543 -38210 -58135 9506 46178 12755 -8543 -76947 -40814 3222 -58780 -70427 -115594 -130728
11531a30728M4549M5288m362r19l4181l8287j4299R324L7130O3090j5241k691
11519d1327J0674Q439k819J3432J5865j2638J2725L5287l5203j4322P286K5150
11507B2549j4443K9463k5591j8444j6730j8684j1770M0478k1702m3660J1429k2957
11495i0062o1137L5240J16175J7254k9814l4571Q747M6241k5063R4257j600n1864
11483B3803l6978P3836k1815k5048M8575K7175J2871n0848j5530m7762m8245l3495
11471i3461M0226o873m4801J5621k4014K621O2078L9219j2066m101M4627O5223
11459H4299K2149R496K390o1308j028l2563m8905q792L9441K5193l7730K5420
11447A8062N5299J0039k4771n8997j0735Q246Q335L2842l4015j2208k9967P2692
$$ plain form
11531 -130728 -86179 -40891 -45253 -46172 -80353 -118640 -132939 -123615 -86485 -23395 -38636 -41327
11519 -41327 -30653 -22214 -25033 -11601 4264 -8374 4351 39638 4435 -9887 -2601 22549
11507 22549 8106 37569 11978 -6466 -23196 -41880 -53650 -13172 -34874 -78534 -67105 -90062
11495 -90062 -151199 -115959 216 17470 -12344 -46915 -38168 8073 -16990 77267 75667 23803
11483 23803 -13175 60661 38846 13798 62373 89548 102419 51571 36041 -11721 -59966 -93461
11471 -93461 -53235 -60108 -104909 -89288 -113302 -110681 -48603 -9384 -21450 -25551 19076 84299
11459 84299 106448 115944 118334 57026 55998 23435 -25470 -34262 5179 30372 -7358 18062
11447 18062 73361 83400 58629 -368 -11103 -2857 5478 38320 4305 -7903 -37870 34822
11435C4822N7213k2436r9298m3416Q7884m730j9373n4393M917K9726J2498K4643
11423H057l2275k4655J00293M1548r903q08o1401j7290k3816M98j3674o332J8466
11410b1292N4994J0197L4597L5912o7296j0614k4451k6875Q908k4205M6216J0468
11398B6559K8123K0564n1403k7159k7110n47M3059K8126M3945M597J755J65J8362
11385A09036m1967n4411o1840L2577L5513o2980R437K5639K2753j473K9989j5479
11373B6794n2261n224K1418l4547M6301J7472p22m7366j0994P3921J8335j1591
11361D1536k8540k5654j064R1709J9696R77l9532n8516K1835N847J8143k2051
11349B4386k4243N9500N2629n6993m5701j5167J4812j4066L017L2241l339m5098
$$ plain form
11435 34822 92035 69599 -29699 -73115 14769 10039 -9334 -63727 -58810 -29084 -16586 8057
11423 8057 -24218 -48873 51420 92968 83065 82257 20856 3566 -20250 -19752 -33426 -39758 -21292
11410 -21292 33702 43899 78496 114408 47112 36498 12047 -14828 -5920 -30125 16091 26559
11398 26559 54682 75246 23843 -3316 -30426 -30973 12086 40212 84157 88754 90509 90674 109036
11385 109036 67069 12658 -49182 -16605 18908 -44072 -34635 -8996 13757 12284 42273 26794
11373 26794 -25467 -30691 -9273 -43820 2481 19953 19231 -28135 -39129 34792 53127 41536
11361 41536 12996 -12658 -13722 77987 97683 98660 59128 612 22447 28294 46437 24386
11349 24386 143 59643 112272 55279 9578 -5589 9223 -4843 -1826 30415 27076 -18022
11337a8022K3308n725p6864k7590K1560j2495J8295o7744k9007P7710N2188m2064
11325h6450j7196K7778O8521M5659m3208j6420N3648J263n6375l2249l0085k2459
11313a07573j3839n601k0679m013O6453Q326l9537K7712M3463j289J5497J9655
11301a1425M4522m8786p0439m3626M1342K0816M5461N880Q593j6061M0530k0476
11289c669l0829j727k4487Q922M9642j598K2259L897j5400k1355n0902k0131O547
11276g8831L6447k4780m0050L5224K2398O90L2537O299l340L8260K1435k5554
11264B0735k4019N0615L4296p0741p7685p684K7785L5926m8949L4205J7870l037
11252a0683L4306J5453n0120k9765j02760n532N3020M2369r446M1251R595J5862
$$ plain form
11337 -18022 5286 -439 -77303 -104893 -83333 -95828 -77533 -145277 -174284 -96574 -44386 -86450
11325 -86450 -103646 -75868 -7347 38312 -4896 -21316 32332 33595 -22780 -55029 -85114 -107573
11313 -107573 -121412 -127013 -147692 -151705 -85252 -76926 -116463 -88751 -45288 -46577 -31080 -11425
11301 -11425 33097 -15689 -86128 -129754 -88412 -67596 -22135 -16255 -7662 -23723 16807 -3669
11289 -3669 -34498 -36225 -60712 -51790 -2148 -3746 18513 22410 7010 -14345 -65247 -85378 -78831
11276 -78831 -42384 -67164 -107214 -71990 -49592 -48902 -16365 -10066 -13406 24854 46289 20735
11264 20735 -3284 47331 81627 10886 -66799 -74483 -46698 -10772 -59721 -25516 -7646 -10683
11252 -10683 23623 39076 -11044 -40809 -143569 -149101 -96081 -53712 -63158 -21907 -12312 3550
11240C550N6602J7468p0826n3798k8268J3442J1138j0904j0441J3681k6683n8553
11228a43592k7014L7668M2715j5636J2118M8112k5151K3486K3648j3686J033M72
11216c5827m1839K4665L1595j0758Q926j3482q3906o233K2528J2946L1112R2097
11204C1824k809p174O159O2533j0092j2689L4202k1559p401J7291j3476n420o8377
11191C012n3402l3508L1226O2372J4693p1248l3627L1427j400K2948J4826L6627
11179B3946o690k8978j6729k4309O8597O7422K3886o1620m2581J1232O734o7775
11167d6865n10R353j330J1619K5933K6763q618o276p168k6414O765m658p174K3116
11153e464k8440J6368l3530k5767N2784M7686l2681K9418m0270o9364k6301m642
$$ plain form
11240 3550 60152 77620 6794 -47004 -75272 -61830 -50692 -61596 -72037 -58356 -85039 -143592
11228 -143592 -170606 -132938 -90223 -105859 -93741 -45629 -70780 -47294 -23646 -37332 -36299 -35827
11216 -35827 -77666 -53001 -21406 -32164 -23238 -36720 -120626 -126859 -104331 -91385 -60273 31824
11204 31824 29015 21841 28000 90533 80441 67752 101954 80395 72994 90285 76809 71389 3012
11191 3012 -50390 -83898 -52672 9700 24393 -46855 -80482 -49055 -50455 -27507 -12681 23946
11179 23946 17256 -11722 -28451 -52760 15837 83259 107145 45525 2944 14176 20910 -46865
11167 -46865 -47375 -38022 -39352 -27733 -1800 24963 16345 10069 2901 -23513 -16748 -21406 -28580 -5464
11153 -5464 -33904 -17536 -51066 -76833 -24049 23637 -9044 20374 -19896 -89260 -115561 -120203
11141a20203n5360N9170M2548L3601M4773M1795J6007l5162o4864M7323K7434
11130C7062J126J9283l1430r102m3811n8060O877L1302O0364P1529k9565k9641
11118B5934k7751l3721k5308o366k0421J9150K4052q820J1319j541m7646O2400
11106b8719M1724l6168l5363J8901N4708P6709N3477m4878j7819K525k0823k5101
11094C9173q7879j9154J1056j4773k3412M2837Q7828L7393l123r3226p0318K1150
11082g2448L9907k1230j5619J5215J9676J9722l545k680j2611M0940J2590k7048
11070g131M060M5606K4661k133k8733p3637n5543o690K4911N1062J0841J557L0091
11057A8922j3056m087N2269L7559M9180j9328j5217r2453m6027j1008K5451j5870
$$ plain form
11141 -120203 -175563 -116393 -73845 -40244 4529 46324 62331 27169 -37695 9628 37062
11130 37062 38188 57471 26041 16939 -26872 -84932 -78055 -46753 13611 85140 55575 25934
11118 25934 -1817 -35538 -60846 -67212 -87633 -68483 -44431 -53251 -41932 -43473 -91119 -28719
11106 -28719 13005 -23163 -58526 -39625 15083 91792 145269 100391 82572 85097 64274 39173
11094 39173 -48706 -67860 -56804 -71577 -94989 -52152 35676 73069 69946 -23280 -93598 -72448
11082 -72448 -32541 -53771 -69390 -54175 -34499 -14777 -18322 -21002 -33613 7327 19917 -7131
11070 -7131 -3071 42535 67196 65063 36330 -37307 -92850 -99540 -74629 -23567 -12726 -11169 18922
11057 18922 5866 1779 54048 91607 140787 121459 106242 13789 -32238 -43246 -17795 -33665
11045c3665J6455P8986M048m0436l7834J7568m830o6114j1032M1054P534N5746
11033B7480K8897m123k8393M8773m3475o5025r990K7733n567n8073k372J9617
11021f4518J1704k1202J8296N6761L9975L4259J7317o2835n4263l9917P8777N675
11009B0029m7629l6732J5439L5537j5219N1767l480k4549Q0162L9503l5634j942
10997G7252m1280n3136j4620k9041l3474K9371M7657n7868J0355N9095M1546k4554
10985A1303p433j0921J0527k2296l2455j1503M622n161R50L9977K9940n540l3591
10972c1581K573L4340m1731K1L9125L1247p408n6266K0942O6576Q475n7216m1720
10959c2623J5779j3656n1638N8007L099J3094j89K1921M6533l2497q4970m0177
$$ plain form
11045 -33665 -17210 61776 65824 25388 -12446 5122 292 -65822 -76854 -35800 -28266 27480
11033 27480 56377 52254 23861 72634 29159 -35866 -45856 -18123 -23690 -81763 -84135 -64518
11021 -64518 -52814 -74016 -55720 1041 41016 75275 92592 29757 -24506 -64423 14354 20029
11009 20029 -27600 -64332 -48893 -13356 -28575 23192 19712 -4837 75325 114828 79194 77252
10997 77252 35972 -17164 -31784 -60825 -94299 -64928 -17271 -75139 -64784 -5689 35857 11303
10985 11303 3870 -7051 3476 -18820 -51275 -62778 -58156 -63317 -62367 -22390 7550 2010 -31581
10972 -31581 -29008 5332 -36399 -36378 2747 33994 26586 -29680 -8738 57838 66313 9097 -32623
10959 -32623 -16844 -30500 -82138 -24131 -21032 -7938 -8127 13794 60327 27830 -57140 -97317
10947i7317M6760J9231J7241k0219n4444j0973n4211M4722m5634p0854K6418P1579
10935a27701P1888M428J0576M8127k5728m8236q017N1433r31m8128q879P5396
10923e772M0866l8044n063l1195J4226L9618K4123K2198k4227m7049r482K7114
10911G313K8759n0014o2723k2175R543N8957m9218l6964J8767k2829N540Q2276
10899c2768P9487j2932j7138K7802q690N9916L466n6609p274L8660p927j7213
10887D8780p061k130o9527k4440J8580L6859m1261k1979P092o8370K5439M5194
10875e2824O5370N1837K0757k0646n9415q5356l4131J7598Q9943K5246j6041K4869
10863B7207L1401l3909j5675J5681l4951R73L4484M4905R476J9054l568j1362
$$ plain form
10947 -97317 -50557 -31326 -14085 -34304 -88748 -99721 -153932 -109210 -154844 -225698 -199280 -127701
10935 -127701 -55813 -51385 -40809 7318 -18410 -66646 -74663 -23230 -24161 -72289 -81168 -5772
10923 -5772 35094 -2950 -8013 -39208 -24982 14636 38759 60957 36730 -10319 -19801 7313
10911 7313 36072 -13942 -76665 -98840 -89297 -30340 -79558 -116522 -97755 -120584 -115044 -32768
10899 -32768 46719 33787 16649 44451 35761 95677 99143 42534 35260 73920 65993 48780
10887 48780 41719 39589 -29938 -54378 -35798 1061 -40200 -62179 -55087 -123457 -98018 -52824
10875 -52824 12546 64383 85140 64494 5079 -80277 -114408 -96810 -6867 18379 2338 27207
10863 27207 58608 24699 9024 24705 -10246 -9273 25211 70116 79592 98646 95078 83716
10851H3716j9366p7934j6929q911o060J333L3571J2580j6816J835j4751n2498
10839h0230j7962k1591O3696O0343l2612L357O9727M1425n6188p2642N0928L0925
10827C9176K3170k9041J2069p1733l2289j3815M2411N7613J9615q4815j3606P5768
10815B4523N2172m003l9528J4122J5496m30n3638n638j7253r959n4424Q569L3408
10802c6583Q083J538Q72R838J4558j0084K7591k4084k8353L1249J26608l4484
10790H6749p6710j3927l751m688K9080Q513l3323k7775k3412l6346k470M9518
10778d8542N2070K2389J2164P494j32p8817p3242L1466k0947K9511J0890j9027
10766g4723m7916M1788P0421O504K897K8428K2036j6148n688o21p5753l331O5850
$$ plain form
10851 83716 64350 -13584 -30513 -39424 -45484 -44151 -10580 2000 -14816 -12981 -27732 -80230
10839 -80230 -98192 -119783 -56087 4256 -28356 -24999 44728 86153 29965 -42677 8251 39176
10827 39176 62346 33305 45374 -26359 -58648 -72463 -30052 27561 47176 -37639 -51245 24523
10815 24523 76695 72692 33164 47286 62782 62352 8714 3076 -14177 -24136 -78560 -69991 -36583
10802 -36583 -28500 -26962 -26090 -16252 -1694 -11778 15813 -8271 -36624 -5375 121233 86749
10790 86749 10039 -3888 -7639 -12327 16753 25266 -8057 -35832 -59244 -95590 -98060 -48542
10778 -48542 3528 25917 38081 45575 45443 -33374 -106616 -75150 -96097 -66586 -55696 -74723
10766 -74723 -122639 -80851 -10430 -3926 -1029 27399 49435 33287 27599 26978 -48775 -52106 13744
10753A3744M487o8582k3802j9196o417P470J00736J16028j1071p1118j1912M5213
10741G5580l9034n4694j3956M1597L8079M3157j755n3616j8573m1516r7144J5303
10729a06572O9453L3008j1817m5631L9757L4430j0948m2919k8631k9450K8258
10718g1062M8168L2360L1340m3943K2245J1602J6188j8157n4173k3379P7824K3004
10706E2017l2712l5106l59K7607m317k1479p3519o037o409N5448k1491j3949N1594
10693b8712N2077l8928l2448j4836J05786k2281k7767L9746k1203Q067m123M9664
10681F5042P7974K985j0628o0609r765j60n9940l8776o5130n5247J32576J09082
10669H7404K9503l9283p6848j49002K5N1250K4878k6643L3396Q172L4901L5381
$$ plain form
10753 13744 18231 -50351 -74153 -93349 -99766 -92296 8440 124468 113397 42279 30367 75580
10741 75580 36546 -18148 -32104 9493 47572 90729 88974 35358 16785 -24731 -121875 -106572
10729 -106572 -37119 -4111 -15928 -61559 -21802 12628 1680 -41239 -69870 -99320 -71062
10718 -71062 -22894 9466 40806 -3137 19108 30710 46898 28741 -25432 -48811 29013 52017
10706 52017 19305 -15801 -16160 11447 7130 -14349 -87868 -93905 -100314 -44866 -66357 -80306 -28712
10693 -28712 23365 -15563 -48011 -62847 42939 20658 -7109 32637 11434 19501 15378 65042
10681 65042 143016 146001 135373 74764 64999 64839 4899 -33877 -99007 -154254 -21678 87404
10669 87404 116907 77624 776 -148226 -148201 -96951 -72073 -98716 -65320 -57148 -22247 13134
10657A3134N2271j4666k5536n0408j4603J3793n2404m5264k044L2814P1589J2797
10645h527j0674m4663K1923K9219l7895q6562n903K0676M5226L9145N6019L3415
10633E1399l847j2080j1471K581L4429o4166n0315K6646k2851K8402j3979J6392
10621a8860j2926n8654o1043o477m6554K0945Q440N3761Q9899K6157R597m7005
10609d2720j3491R153j7691K7680M3489M1489j5869o5722L4686N3933j451l389
10597E0097k692K8032k8638j2667J3957K2033N9849j82l7070j9990j03063q6768
10585a17102J1922J25O0459Q7099m7447l1122J7751Q739K7569M5526K8599n6824
10573C5294P540J2530j4896n8516m9531L6750L3391q566K5864M2904K4127k3125
$$ plain form
10657 13134 65405 50739 25203 -25205 -39808 -26015 -78419 -123683 -125727 -92913 -21324 -8527
10645 -8527 -19201 -63864 -41941 -12722 -50617 -137179 -143082 -122406 -77180 -38035 17984 51399
10633 51399 47552 35472 24001 26582 61011 -3155 -53470 -26824 -49675 -21273 -35252 -18860
10621 -18860 -31786 -90440 -151483 -157960 -204514 -183569 -175129 -121368 -31469 -5312 4285 -42720
10609 -42720 -56211 -47058 -64749 -37069 6420 47909 32040 -33682 1004 54937 53486 50097
10597 50097 47405 75437 46799 34132 48089 70122 129971 129789 92719 72729 -30334 -117102
10585 -117102 -105180 -105055 -44596 42503 -4944 -36066 -18315 -9576 17993 63519 92118 35294
10573 35294 42834 55364 40468 -18048 -67579 -30829 2562 -6004 19860 62764 86891 63766
10561F3766o8978M010j8111O623nO5345l3795m4876j4124M147O3620L6399n1421
10548A2600M375L0565j8860m0888q0177O042L0158N488K7064j4990m8794k6141
10536a13558l6906l070N5642N3434M9953k4497k3758l878M8592k2195l765L9027
10524A5021O122J8812l3133j7522M8220p970n9210k7533K5415k5342k7893p016
10512i2029J5571K2239M1901j4049n2194k4939M1812O7897K4511r609m1029k8249
10500d8167M2935O4722K4818o670k9714k041M0183m9778j2605n898P412K5982
10488E1179j695o2047O321K4520o0436L3584L5567J6141m1500p970l0422p1995
10476a08753Q0785L8606r3J2802L8040J8003o0885l6750K382j4176M6056O6304
$$ plain form
10561 63766 -5212 -1202 -19313 -12690 -12695 52650 18855 -26021 -40145 -35998 27622 64021 12600
10548 12600 16975 47540 28680 -12208 -92385 -86343 -56185 -50697 -23633 -38623 -87417 -113558
10536 -113558 -150464 -153534 -97892 -44458 5495 -19002 -42760 -46638 1954 -20241 -24006 15021
10524 15021 21143 39955 6822 -10700 37520 29550 -29660 -57193 -31778 -57120 -85013 -92029
10512 -92029 -76458 -54219 -12318 -26367 -78561 -103500 -61688 6209 30720 21111 -19918 -48167
10500 -48167 -5232 59490 84308 77638 47924 45883 86066 36288 23683 17785 25197 51179
10488 51179 49484 -12563 -6242 18278 -42158 -8574 26993 43134 1634 -6336 -36758 -108753
10476 -108753 -27968 10638 10545 23347 61387 79390 18505 -18245 -15863 -30039 16017 82321
10464H2321r225k9923p5618o999R283K2612K1283j1958q4926R699J9412q301K2388
10451c9952L8114P7892l0733j4654k3484J5400q71P1977n5224l6056J4660J0092
10439B7161N6491N5117p7310p1756J8373Q456J6749m190K8339m607m967K2920
10427G0776l9014J8566j949o0907K7841K0635m0339l051J2292J5579K854k6856
10415c573l8268N1573N6390K5714j5335o8393m5477J3287N3720L092J1923L1846
10403G6499k8556m7194K4597K0161j0523J2767M40K7373K9182M540m5867n6443
10391F976L4312J0224l9498p0159m8796K7428N6721J4658J8139j7255l0998K6102
10379a2146M8333K237O9567N6301m137k4114q507K0198L896p3163r5656R187J9451
$$ plain form
10464 82321 73096 43173 -32445 -39444 -30161 -7549 13734 1776 -83150 -73451 -54039 -62340 -39952
10451 -39952 -1838 76054 45321 30667 7183 22583 21712 93689 38465 2409 17069 27161
10439 27161 83652 138769 61459 -10297 8076 16532 33281 29091 57430 52823 47856 70776
10427 70776 31762 50328 48379 -12528 15313 35948 -4391 -7442 4850 20429 23283 -3573
10415 -3573 -41841 9732 66122 91836 76501 8108 -37369 -24082 29638 32730 44653 76499
10403 76499 47943 749 25346 45507 34984 47751 48191 75564 104746 109286 63419 6976
10391 6976 41288 51512 12014 -58145 -106941 -79513 -22792 -8134 10005 -7250 -38248 -12146
10379 -12146 36187 38424 107991 164292 160155 136041 127534 147732 151628 78465 -17191 -8004 11447
10366A1447L8962J0473m2687J424k5708q914M966O5441K843o384l7999J9536M7553
10353H0953M9026M6708k9724L3680Q874l9016n0941j9866O563q1688n1174j4391
10341f0996m6922O7321N8170P102L826Q862J0320l651L0235J5134o7344l251N4876
10328G3682J3136k338j9017R7768P1140R9851J00643J29798K14165R9463N6808
10317I35099l3259q1947q591L1086L3461L3676k1375j02271j66882j68835r9728
10306C50434m939m5664o6548n8753n6476k3537M8033o892n5879k1422K454k045
10294E8766L1428L2329k8259o3680k8633M7621j5146J3035K215q3278J0437N3116
10282B9951l1789K5669J4107K8696l1658o0751J5635M3144K955P595k428L1867
$$ plain form
10366 11447 50409 60882 18195 19619 -6089 -15003 -10037 55404 58247 51863 13864 33400 80953
10353 80953 129979 176687 146963 180643 189517 150501 99560 79694 86257 4569 -46605 -60996
10341 -60996 -107918 -40597 17573 24675 28501 37363 47683 44032 74267 89401 22057 18806 73682
10328 73682 86818 84480 65463 163231 234371 334222 434865 564663 778828 878291 935099
10317 935099 901840 819893 811302 842388 875849 909525 888150 785879 618997 450162 350434
10306 350434 345495 299831 233283 174530 118054 94517 142550 135658 79779 58357 60811 58766
10294 58766 90194 122523 94264 30584 1951 49572 34426 47461 49676 -33602 -23165 29951
10282 29951 -1838 23831 37938 66634 34976 -25775 -10140 33004 35959 43554 41126 72993
10270G2993k6046m5167j10283o5833O3204N4116N9547K4205n4728J3713J0407
10259c872K1413M1433n478l4445j5373M723O8736n6045k3332L9725K5776J529
10247F4790m350J4414k8273l8719l7352r989J1055K4747M238M0007L4333J1926
10235H6827j9727k9554J7510J0651K3882Q738N8579J4017p3261j5994k9184L4188
10223H6672p3507l7471J00942p573j7140K6119j0136K6153j515l2969l6987J01433
10211A24021q184r7908q383K2672l382m9181q8901Q250K2227P1711r616J6079
10199e95M0562K5588K5285j3437l2197L7171N360m4837k3400k7651j3483L6156
10187A4522K5274j930k8632m3832o9910j714M2498L6859Q717k968p283L071l0463
$$ plain form
10270 72993 46947 1780 -108503 -174336 -111132 -57016 2531 26736 -27992 -14279 -3872
10259 -3872 17541 58974 53496 19051 3678 8401 77137 21092 -2240 37485 63261 64790
10247 64790 60440 74854 46581 7862 -29490 -39479 -28424 -3677 561 40568 74901 86827
10235 86827 67100 37546 55056 65707 89589 98327 156906 170923 97662 81668 52484 86672
10223 86672 13165 -24306 76636 69063 51923 78042 67906 94059 92544 59575 22588 124021
10211 124021 115837 17929 9546 32218 28836 -20345 -109246 -100996 -78769 -7058 -16674 -595
10199 -595 39967 65555 90840 77403 45206 82377 87737 42900 19500 -8151 -21634 14522
10187 14522 39796 37866 9234 -34598 -104508 -106222 -63724 -26865 -18148 -21116 -28399 -25328 -55791
10174e5791k8070J4354R22K8894j7704M0588L0849J5441K742l7472m8107n2276
10162a05630J4258R047O7012O1294k6996K7817K1902J9491j4629m2766m3163L7983
10150B5620R89j4785N1912J9104O851m8734k3546P485q753M9933L3625l4635k2962
10137D2104k7919O3460Q31n3909l4219j8040L7937j9038n1550M97o423L9300j7219
10124d4188j2831M9166j7482J5641M4077N6993p006j19560r610R133K5695m402
10112a4374k8348J5667K4722k6037m5258n6499N3217O6202k2267K7387L6340L8646
10100F9398J4664Q87m7972o6202K2466k0374j2854n1706K3213N7836O099j0905
10088a5450K2349P986k1738j2354l3515k383j3193m4342J4621O5972N9636K8704
$$ plain form
10174 -55791 -83861 -69507 -68585 -39691 -57395 -16807 14042 29483 32225 -5247 -53354 -105630
10162 -105630 -91372 -82325 -15313 45981 18985 46802 68704 88195 73566 30800 -12363 25620
10150 25620 26609 11824 63736 82840 89691 40957 17411 24896 16143 66076 99701 65066 42104
10137 42104 14185 77645 78476 24567 -9652 -27692 10245 -8793 -60343 -59846 -66269 -26969 -44188
10124 -44188 -57019 -7853 -25335 -9694 34383 91376 84370 -35190 -44800 -35667 -9972 -14374
10112 -14374 -42722 -27055 -2333 -28370 -73628 -130127 -76910 -10708 -32975 -5588 30752 69398
10100 69398 84062 84949 36977 -29225 -6759 -27133 -39987 -91693 -68480 -10644 -4545 -15450
10088 -15450 6899 14885 -6853 -19207 -52722 -55105 -68298 -112640 -98019 -32047 27589 56293
10076E6293k6945k5611j9166R112L0290m5274l4792K6371m119K5750P5769K3164
10064I0842r0515M0154J9911L873R0916P9767J22158Q5801n249l8355j56462j17683
10052A25158K0372L262p2792N879p394l8453m0337P97K0846p697l506M790Q436
10039A9361j1207m9932J2559Q700P516N1052o326p5658O4366M7843N282M5938
10027A19494r382m4762m8416k7623m889J8427o7392j216P6137m126J2553N7244
10015G6049m0101m4737J2367K4567q212j7466k1299k3180o288L7454K2690K1580
10003C3424O61r2846m5791L7093M3921K8912n3146m3488N8796K6429J1160n3012
9991d7887m272P8493M3140m7260p2556J8930N4370K2587L4975j4506j2041J81
$$ plain form
10076 56293 29348 3737 -15429 -6317 23973 -21301 -56093 -29722 -33841 -8091 67678 90842
10064 90842 327 40481 60392 64265 155181 234948 357106 442907 437658 399303 242841 125158
10052 125158 145530 148792 76000 81879 74485 36032 -4305 -3508 17338 9641 6135 10925 19361
10039 19361 8154 -41778 -29219 -20519 -13003 38049 31723 -43935 20431 68274 73556 119494
10027 119494 110112 65350 16934 -10689 -15578 2849 -64543 -65759 10378 6252 18805 76049
10015 76049 35948 -8789 3578 28145 19933 2467 -18832 -42012 -48300 -10846 11844 33424
10003 33424 34085 -58761 -104552 -67459 -23538 5374 -47772 -91260 -32464 -6035 5125 -47887
9991 -47887 -52159 26334 69474 22214 -50342 -31412 22958 45545 80520 66014 53973 54154
9979E4154J9359o0523l9192l97P4557Q2532L8685m1279l1352L8537l3279m7226
9967E4576K768l4832j2485N877O216m2229n2788Q1782l458j4581k0246O643P5
9954b2682n7429j1182O0779J03688m806k3406K0854m335p747K5171O1513P406
9942A47824l1657p4479m3710m1371O0873M8661m0209j9540n0185l8807J5574q729
9930g5755m900M9444L5860o2279k4464P553P4297K0988l6568K2579k9986j5381
9918c8612l3007n3812P3893N9209J9113K3338K983o339k7245k9203K6997R226
9906B6541O1618J8399k5062j723k7948j0292p1507J9418N0869l9578k6670k5754
9894e1689k4542m2327R440J3526M2281O736J0023O7563k5806K859L7698Q55o4039
$$ plain form
9979 54154 73513 12990 -26202 -26599 47958 130490 169175 127896 96544 135081 101802 54576
9967 54576 57344 22512 10027 15904 22120 -20109 -72897 8885 5427 -9154 -29400 -22757 -22682
9954 -22682 -80111 -91293 -30514 73174 68368 44962 65816 61481 53734 78905 140418 147824
9942 147824 116167 41688 -2022 -43393 17480 66141 25932 6392 -43793 -82600 -67026 -75755
9930 -75755 -80655 -31211 4649 -57630 -82094 -74541 -244 20744 -15824 6755 -23231 -38612
9918 -38612 -71619 -125431 -51538 7671 26784 50122 53105 46766 19521 -9682 17315 26541
9906 26541 88159 106558 81496 79773 51825 41533 -29974 -10556 40313 735 -25935 -51689
9894 -51689 -76231 -118558 -109118 -95592 -53311 -46575 -36552 31011 5205 8064 45762 46617 -17422
9881a7422m1993L878n045O921k0594k0830P2349J0306m3424O0531L3928p5185
9869c6580k3063j7622M0309J3407P0424M2700L7983J1191l1920k6175j183j3333
9857F6138J2034j1876k2364n0665l6060J4571P692k4732J5013P4894n8523k7675
9845d1553j3070l6607K2549j0186N2636J8172j3513j1192n995N3988n5098l9929
9833g9798o071J9010M2302j8747n126K1656K5023J0977k8436O641J0812k5509
9821b7266L229L127j9418L9341k8714l1276n0406L8873R9400M4376k1342j3064
9809C6860n769n2674M442J3483K0192J7237k9658k384J7018M18J6128j559n200
9796B8534k538m1738o0371m840N8156K7047L928j5387m2571J0961Q7873K6476
$$ plain form
9881 -17422 -59415 -55537 -60582 -53661 -74255 -95085 -22736 -12430 -55854 4677 38605 -36580
9869 -36580 -59643 -77265 -36956 -23549 46875 89575 127558 138749 106829 80654 79471 66138
9857 66138 78172 66296 43932 -6733 -42793 -28222 -20530 -45262 -30249 44645 -13878 -41553
9845 -41553 -54623 -91230 -68681 -78867 -26231 -8059 -21572 -32764 -38759 15229 -39869 -79798
9833 -79798 -85869 -66859 -24557 -43304 -48430 -26774 -1751 9226 -19210 -12569 -1757 -27266
9821 -27266 -24037 -20910 -40328 -987 -29701 -60977 -111383 -72510 26890 71266 49924 36860
9809 36860 31091 -21583 -17141 -3658 16534 33771 4113 1729 18747 19165 35293 33734 28534
9796 28534 25996 -15742 -76113 -80953 -22797 4250 8178 -7209 -49780 -38819 49054 75530
9784G5530q920K6033j2490j200p0993o7246j2690Q6350j56J434M1607M488o373
9771E5374M4730k3575J417j2777l834j0448L020Q674P831j2978M129J0129L355
9758G5047m5400m7844P0122j685k0334m6047J2738o515j6418n2659N8813N0855
9746C0673K623L2806K1482k6682m5575l074N7943K3182k2516L3190N3657q7724
9734F9985o0696k4189K3748N3729j6863j8720l3654n1103M574M8972O6534j8065
9722D4252n1895M195j6053K8830m0271K4814q021K5245j2461L0491Q4026l4887
9710G8265p2441K336O3343j58O278m572K7802n1732k6346k8575M4202M7973m0650
9697D5725p6912j9267P9853K7985L2721m2722l2077M4265o185k5392N1030K0415
$$ plain form
9784 75530 66610 92643 80153 78953 7960 -59286 -71976 14374 14218 15652 57259 61747 55374
9771 55374 100104 76529 77946 65169 61335 50887 53907 62581 70412 57434 61563 71692 75047
9758 75047 29647 -18197 51925 50240 29906 -16141 -3403 -9918 -26336 -78995 -20182 30673
9746 30673 33296 66102 87584 60902 15327 12253 70196 93378 70862 104052 157709 69985
9734 69985 9289 -14900 8848 62577 45714 26994 -6660 -57763 -53189 -4217 62317 44252
9722 44252 -7643 -3448 -19501 9329 -30942 -6128 -14149 11096 -1365 29126 113152 78265
9710 78265 5824 8160 71503 71345 77623 73051 100853 49121 22775 -5800 38402 86375 45725
9697 45725 -31187 -50454 29399 57384 90105 47383 15306 59571 53386 27994 79024 99439
9685I9439j0713r359L2k5526k7833k7803J7883p215L1434j512K55N1214J5935
9672A06231l406m747N989K7347k6940k7646J2904m4615l6183J7489P696l692l6121
9659e694j3032J2428q46L2209L1878K2222k0052l1799l9371j4540Q458j6050n887
9646d0076J5746J1674r9k6519L9156L2747L8221R829l3829R602n2210l6586j5335
9633d7679k7282O2048K4995K6735K3131N8868j3354o5811K462j0373p0021k2439
9621e8720P02l9823M2182N5795L7632n9551m6453Q3799K4444o1614m899o242J5574
9608a7174L2731N5924j5404j0238j9914O006L2728r9M9484l4898k3615R534r109
9595E5956j281l542M9938k3472k1159p8252l9609k6328N8309k6736J5342N0116
$$ plain form
9685 99439 88726 79367 79399 53873 26040 -1763 16120 8905 40339 38827 39082 90296 106231
9672 106231 102825 98078 104067 131414 104474 76828 89732 45117 8934 26423 34119 30427 -5694
9659 -5694 -18726 -6298 -7144 25065 56943 79165 59113 27314 -12057 -26597 -18139 -34189 -40076
9646 -40076 -24330 -12656 -12755 -39274 -118 32629 70850 80679 46850 56452 4242 -32344 -47679
9633 -47679 -74961 -12913 12082 38817 61948 120816 107462 41651 44113 33740 -36281 -58720
9621 -58720 -58018 -97841 -55659 136 37768 -21783 -68236 15563 40007 -21607 -26506 -32748 -17174
9608 -17174 15557 71481 56077 45839 25925 31931 64659 64560 114044 79146 55531 65065 55956
9595 55956 54675 51133 101071 77599 56440 -21812 -61421 -87749 -29440 -56176 -40834 9282
9583I282L8378O7455L3649K9200m1991m5641m9030j0727o4769o5711K2324M5998
9571c1583l0369N6144L6737k4647l5350j0447k204q36L0913m8n8500J7919M3954
9558h317R010J9345m0221j9749L8332P2758l708k3025n467j7501p476J1447L9215
9545F4643k3138r4052M8929O1819k388m2277o3560L6542j4652j7278J8234K0855
9533f323M2716j0217l6945j6051r833K8177K6877N4598J5988K4172L9924P901
9521A60984o9181p215j2724r088m8698p1591K4298L9939J674l0437l629Q3967
9509E8299L3782k0509J4522L714j5800j7370n5467k7518K6938J4686l9924J2752
9497a1895m517N0534l3572O4923M2013j9150r1990k5424k997R5672K8415j7205
$$ plain form
9583 9282 47660 115115 148764 177964 135973 90332 41302 30575 -34194 -99905 -77581 -31583
9571 -31583 -61952 -5808 30929 6282 -29068 -39515 -41719 -42555 -11642 -11690 -70190 -52271 -8317
9558 -8317 693 20038 -20183 -39932 -1600 71158 67450 44425 38958 21457 13981 25428 64643
9545 64643 41505 -52547 -3618 58201 55813 13536 -50024 -13482 -28134 -45412 -27178 -6323
9533 -6323 36393 26176 -10769 -26820 -36653 -8476 18401 72999 88987 113159 153083 160984
9521 160984 91803 84588 71864 62776 14078 -57513 -33215 6724 8398 -22039 -25668 58299
9509 58299 92081 71572 86094 89808 74008 56638 1171 -26347 591 15277 -24647 -11895
9497 -11895 -16412 34122 550 65473 107486 88336 -3654 -29078 -32075 63597 92012 74807
9485G4807o9956p8246J8245L368p328p0021J9935O6004P7044k1667O163J8794
9473C7142L2715R444m8201l4129j0166Q625k7811k8557K4188N717J0771k9758
9461e0020N0854N8214J1544K1597k886m1450P2112k6690m636k4137M2055j2440
9449I4117o7665k6443P5658K1111k7022J3626K380o656r58n7427l3789m3925L0505
9436b6488R4608K4865m5647n0998M6990L2648o1693Q973J9003k8855q821N324
9424I909K4009J7765N0743l6080l4450l3829P0230m8492m0579q49L3557J1346
9412B3280M344K8366k2687o7629k8836j531M5697J6133K9165Q1580l2887k4862
9400E0133j4989j3621M0437L1561n0127l8261J8981K2246O8381l3265p6149l4053
$$ plain form
9485 74807 4851 -73395 -55150 -51782 -59110 -129131 -109196 -43192 33852 12185 18348 37142
9473 37142 69857 79301 31100 -3029 -13195 -4570 -32381 -60938 -36750 -31033 -20262 -50020
9461 -50020 834 59048 70592 92189 89303 47853 119965 93275 88639 64502 106557 94117
9449 94117 26452 9 75667 96778 69756 83382 85762 79106 78148 20721 -13068 -56993 -26488
9436 -26488 68120 92985 47338 -3660 43330 75978 14285 23258 42261 13406 4585 9909
9424 9909 33918 51683 102426 66346 31896 -1933 68297 19805 -20774 -21623 11934 23280
9412 23280 27624 55990 33303 -34326 -63162 -64693 -18996 -2863 26302 107882 74995 50133
9400 50133 35144 21523 61960 93521 43394 5133 24114 46360 114741 81476 5327 -28726
9388b8726k0375R115K4201k9777r439N9965k069r208J3936l4426n4686J3365P0392
9375B268k159n5884J6657M8391J38484o216m2764r902o1334j4513J3971M0901
9363F7900J8083m3401l6001L0760N0419k041q643M9671o8733n1041K5024L9000
9351G0997j3387o779r274M7990k1173k7776j744O8338l013n9485M9431n0934k4399
9338A8792j2577M5825P4059L471q4650l268O2997m2973n0741m7287l5161K0065
9326e1448L2944N835o292l190O5927J1451O1800j0761p0340n355j4547j6436k2200
9313b2612N1439K5141L5314r46k4614k7013J645j3047J1495R125o171J1713K7926
9300G9395O0457J2463k6231j4070m009m2307o4127J847L2091P5186N6781J4614
$$ plain form
9388 -28726 -49101 -39986 -15785 -45562 -55001 4964 2895 -6313 7623 -26803 -81489 -68124 2268
9375 2268 109 -55775 -39118 9273 147757 141541 98777 88875 27541 13028 26999 67900
9363 67900 85983 42582 6581 37341 87760 85719 77076 126747 58014 6973 31997 70997
9351 70997 57610 50831 41557 89547 68374 40598 38854 107192 104179 44694 94125 43191 18792
9338 18792 6215 52040 126099 129570 44920 41652 104649 61676 10935 -36352 -71513 -51448
9326 -51448 -18504 -12669 -18961 -22151 43776 55227 117027 106266 35926 30571 16024 -412 -22612
9313 -22612 28827 53968 89282 88336 63722 36709 38354 25307 36802 45927 39756 51469 79395
9300 79395 139852 152315 126084 112014 108005 65698 1571 3418 35509 110695 167476 182090
9288A82090m9319o8787j7276K250k5558K6147j767k0311r0366o2998M5001N6811
9276b4083N7467P7661L058k9400K3491M7984k285J0188l6934p4880J7602J7287
9264H7156J937j1279K0473J6246J0210n8511n1421J7275M0891r186K8048m41N1300
9251A42698l8837L212m8730l8579j0018j9652M2049O9852P2252k3665k2245j4312
9239A14025J363j0280M856J6539l812K938J3774K50p994j0460M982J9666n022
9226A40825j7089p8k2380P145j7907j2073k1413m1546N5253L2623r324n3772j2217
9213B8047J1788M3735N9651j8756M7618L4066n9188l4513m7421j14577K2593N9290
9201C2333K5719n3491l7618l1650M4255Q5662K6966R3236K0983m7775j9577l5607
$$ plain form
9288 182090 132771 63984 46708 48958 23400 49547 47780 27469 -62897 -125895 -80894 -24083
9276 -24083 33384 111045 114103 84703 108194 156178 153893 164081 127147 52267 69869 87156
9264 87156 89093 77814 98287 114533 124743 66232 14811 32086 72977 63791 91839 91398 142698
9251 142698 103861 107073 58343 19764 9746 -9906 32143 101995 174247 150582 128337 114025
9239 114025 115388 105108 109964 126503 122691 125629 139403 139653 131659 121199 126181 145847 140825
9226 140825 123736 123658 101278 108423 90516 78443 57030 15484 70737 103360 94036 40264 28047
9213 28047 39835 83570 143221 124465 172083 206149 146961 112448 65027 -49550 -26957 32333
9201 32333 58052 4561 -33057 -64707 -20452 65210 92176 185412 206395 158620 139043 103436
9189A03436j0745J7892j5854L212j5024q140k7731M3493L7195l7056k319o2143
9177B6216M4101N1939Q13K2414K6932J5909j7167k1970J3865M5773O3130l130
9165B68825j5571m5607m5996k1251P3840j4992k9321J1156o6646M625L4611k2005
9153A31668O895J0167L714j1095j3534p075K3804o515j7935M2400K4421n4376
9141A32539n9608o9101O6089J27251J01213l2418n2142k108P747j0392m7800K9742
9129A91012J3127m932n6605l3365R772L483K047j9062O2104J0898N2069K0898
9117B51446l9702m8724m0845J7913L7887l040k9536J7985J9957J9065q446m324
9105A89636J9543M2335m79r7285n7905J4568M9962k233J3795J9372j9700M3655
$$ plain form
9189 103436 92691 110583 94729 97941 82917 74777 47046 90539 127734 90678 88359 26216
9177 26216 70317 122256 123069 145483 172415 188324 171157 149187 163052 208825 271955 268825
9165 268825 253254 207647 161651 140400 214240 199248 169927 181083 114437 119062 153673 131668
9153 131668 138563 148730 152444 141349 127815 120740 144544 138029 120094 162494 186915 132539
9141 132539 72931 3830 69919 197170 298383 265965 213823 211715 219462 209070 161270 191012
9129 191012 204139 199207 142602 109237 119009 122492 124539 105477 167581 178479 230548 251446
9117 251446 211744 163020 122175 140088 177975 174935 145399 163384 183341 202406 193960 189636
9105 189636 209179 251514 251035 153750 95845 110413 160375 158142 171937 191309 171609 215264
9093B15264L68N1395q503m8896k2328k7346O1448N1034K496J9829J08905K5399
9081D29065p545P6914M7413K9308R8015P8763N4243P6605K4597J55040J07806
9070A170224R6837K25312K07684K45069L08450L82265M23342M74274N00187O90390
9060D724034J064888J693232L456684O872871J1006148N600255l756058p348460
9052B3313594q722664n444630l055005j741599j043057p27018m83522l31721k43576
9043A520802j79118j78428j40422j19894q9649o6771o4436l1331m7769n444k9892
9032E67648q6843j36025j5077M0984j0081r202J7550j7938o1023n8979P619Q508
9020B47141l9236K0338M4501j9705k8854l5403j0505O490L7334L1442k5655O945
$$ plain form
9093 215264 215632 267027 258524 209628 187300 159954 221402 272436 274932 294761 403666 429065
9081 429065 421520 498434 545847 575155 673170 751933 806176 882781 907378 1062418 1170224
9070 1170224 1267061 1492373 1700057 1945126 2253576 2635841 3059183 3533457 4033644 4724034
9060 4724034 5788922 7482154 10938838 17811709 28817857 34418112 30662054 23313594
9052 23313594 14590930 9146300 6091295 4349696 3306639 2579621 2096099 1764378 1520802
9043 1520802 1341684 1163256 1022834 902940 813291 746520 682084 650753 602984 597540 567648
9032 567648 480805 344780 329703 370687 360606 351404 368954 351016 289993 231014 238633 247141
9020 247141 207905 228243 272744 253039 224185 188782 178277 184767 222101 253543 227888 234833
9008B34833L197j4847j4501m8263j7629L2003j6123J248k9698L54R894m6598K2513
8995A16383o942l7942K4381R4125k8010K7663n796j024R3625j3171k6626n130
8983B31536J026n2227l5271K9528o2660j12467l5541M9586O1875k5628l7425L2829
8971D5161L0604m0119J4966R5515Q2884o3026r1520m0681J3073l7258M1371j844
8959D9126p4560M6227Q0042J8232n7145l9036Q4l616K0961l1946l2405J4914M7513
8946C8391M6460k5485j7378k0192l364J3326P3181Q774j5171r583J326K198M846
8933I7329J573j8722k9845M6670P3585L4576J3115J085L597K0204J0113M346j07091
8920A50535o0263n8390L2411J7067Q7271K3688o8414p269k8126n4032j0766N0789
$$ plain form
9008 234833 238030 223183 208682 160419 142790 174793 158670 159918 130220 130574 140468 93870 116383
8995 116383 109441 71499 95880 190005 161995 189658 183862 182838 276463 263292 236666 231536
8983 231536 232562 180335 145064 174592 111932 -535 -36076 13510 75385 49757 12332 45161
8971 45161 75765 35646 50612 146127 229011 165985 74465 33784 46857 9599 50970 49126
8959 49126 -25434 20793 100835 119067 61922 22886 22970 19354 40315 8369 -24036 -9122 38391
8946 38391 84851 59366 41988 21796 18432 31758 104939 113713 98542 88959 90285 92483 97329
8933 97329 98902 80180 50335 97005 170590 205166 218281 219366 222963 243167 253280 257626 150535
8920 150535 90272 31882 64293 81360 168631 192319 123905 116636 88510 34478 23712 74501
8908G4501j1082k0962l7849M6780K8983m6146L9161m3132L9689M776j1228l8771
8896B4720j0236O2337N4481k0982n2624J1656m2375o581J4099M2037K5132K8727
8884A30391L9m8820n0756J5742K3477k032k311K5361O6169Q6512K0120J4150n1616
8871B26426l2798m0974k4511n8374K3335N2028q330l4837P415J5492l4183N028
8859I5717r2157n861Q1697K0253L2746K0611n9167N292l0113m7074m9468J611
8847b5913J6156K6920O890j9619l714J8250j7024J7436J7010q502q124k2424m9318
8834e1976L4530k1009J316J5031N2133J8708J5814K2993k0636K3931n8300R682
8822D2217N2923J8652M5005J09k2276k8634l8154j3364q7202l5959m454L2055
$$ plain form
8908 74501 63419 42457 4608 51388 80371 34225 73386 30254 69943 74719 63491 24720
8896 24720 14484 76821 131302 110320 57696 69352 26977 20396 34495 76532 101664 130391
8884 130391 130430 81610 30854 46596 70073 68041 65730 91091 157260 243772 263892 278042 226426
8871 226426 193628 152654 128143 69769 93104 145132 136802 101965 109380 124872 90689 95717
8859 95717 3560 -2301 79396 99649 132395 153006 93839 99131 69018 21944 -27524 -25913
8847 -25913 -9757 17163 24053 4434 720 18970 1946 19382 36392 27890 19766 -2658 -51976
8834 -51976 -17446 -38455 -37139 -22108 30025 48733 64547 87540 66904 90835 32535 42217
8822 42217 95140 113792 158797 158906 136630 107996 69842 56478 -30724 -66683 -71137 -39082
8810c9082N7330m995m4019L4690K6181K8850J8697k7063m1933O6426M5525K3439
8798A44046q1378l6170j5995k2597j8826j2035J5895M1789L9716K1226k0389O310
8786F1592K2125o727j0052k8134N784M5227J2951k494j219n0725n7963k16L6921
8773B7070L9124n5824m4833J7844k470j8584K3238J7349O5884K5608L8938L8729
8761A72073n1521l3896N5126k6968m4127o7251N7617M1601n3672r189k8281l9665
8749b8153L9660k3668P4948Q3804L4093l3668l0780L0705K1444k020l3174L1921
8737A65112m3748l4100K1016j2064l506m7107l9642k1928J8657k271j9596J8645
8725e32L5551O1283O7686J1255k1846p2403m8480P325P0175L4029l284j4855o3323
$$ plain form
8810 -39082 18248 13253 -30766 3924 30105 58955 77652 50589 8656 75082 120607 144046
8798 144046 62668 26498 10503 -12094 -30920 -42955 -27060 14729 54445 75671 55282 61592
8786 61592 83717 76990 66938 38804 44588 89815 102766 100272 99053 48328 -9635 -9851 27070
8773 27070 66194 10370 -34463 -16619 -19089 -37673 -14435 2914 68798 94406 133344 172073
8761 172073 120552 86656 141782 114814 70687 3436 61053 102654 48982 39793 11512 -28153
8749 -28153 11507 -12161 62787 146591 180684 147016 116236 146941 168385 166365 133191 165112
8737 165112 121364 87264 108280 96216 92710 45603 5961 -15967 2690 419 -19177 -532
8725 -532 35019 96302 163988 175243 153397 80994 32514 39839 110014 144043 140759 125904 62581
8712F2581n2912j473M192L1264P9519J0670P627J348l0725Q904K6316L5263Q28
8699A83402J8909O070m5060m0490J33J4631N1698l2247j1743J2346j8536K1958
8687A61071J2075l5249L6483l292J5360j6900m0914J8721l3401m1649L0395L7013
8675A39713K163N4515P60j3422o907K5794L4745l4140m2269K3152L2806p976k85
8662B08649l4230k8483j7957K2921J5206m892Q531L8689R738j5596J4261M3907
8650B60744l9347k2941J3365K5067j3236J873j0543M1523K8219L7094J6540l6691
8638C01667m962M9878J5099m060R949r852j1122Q7337K4353K211N6649M8300k7499
8625E37948l1337M2561P2140j4005O796J3773J5220M0233O446L3216K5337n81
$$ plain form
8712 62581 9669 8196 12388 43652 123171 133841 141468 142816 112091 120995 147311 182574 183402
8699 183402 202311 208381 163321 122831 122964 137595 189293 157046 145303 157649 139113 161071
8687 161071 173146 137897 174380 171088 186448 169548 128634 147355 113954 72305 102700 139713
8675 139713 141876 196391 197151 183729 176822 202616 237361 203221 160952 184104 216910 208934 208649
8662 208649 174419 145936 127979 150900 166106 161214 169745 208434 218172 202576 216837 260744
8650 260744 221397 198456 211821 236888 223652 225525 214982 256505 284724 321818 338358 301667
8638 301667 296705 346583 361682 357622 367571 357719 346597 433934 458287 460498 517147 565447 537948
8625 537948 506611 549172 621312 607307 614103 627876 643096 683329 689775 722991 748328 747747
8613G47747J29783P3049N8430M2123K8229K8478N36K2030K8526J9254M6311j710
8601A222786n1944j14642j34541j66900j26918r3434q6459j09310j5754k4247
8591B98637J5373J2972P431k3738q5404M7360o850k7130p0620k6264M2616J4156
8579A98539k6854k0052R167o330J5268j3104L4107J9693j5233M6909m4139p6241
8567A21730k3814N6383j1487J4113J9053k846O9563Q482n8495p4882l9478j7579
8555F0743p055k9726l8048O5610N0588m588n212j1867J2758K1693L3941J8003
8543A66840J3921M8081M139o7689q880J5717Q776l616n1200r7910N3969L7011
8531A19159P642m5644K3120N617j4069n5568K5897Q4378P179m6364J0258J1138
$$ plain form
8613 747747 877530 950579 1009009 1051132 1079361 1107839 1108375 1130405 1158931 1178185 1224496 1222786
8601 1222786 1170842 1056200 921659 754759 627841 534407 447948 338638 322884 298637
8591 298637 314010 326982 334413 310675 225271 272631 265781 238651 168031 141767 184383 198539
8579 198539 171685 151633 160800 154470 169738 156634 190741 210434 195201 242110 197971 121730
8567 121730 97916 154299 142812 156925 175978 173132 242695 251177 192682 117800 78322 60743
8555 60743 53688 23962 -14086 51524 102112 97524 92312 80445 93203 114896 148837 166840
8543 166840 180761 228842 232981 165292 156412 172129 180905 177289 126089 28179 82148 119159
8531 119159 126801 81157 104277 109894 95825 40257 66154 150532 157711 111347 121605 132743
8519A32743j4722K1157L1798m3586l2094J0456n261k7272n8042J4789L0299k6598
8507C3667O336Q125j3917L0239J1207M4427P051j4507n895K1377K454L8968l1761
8494A37771K176N4604m6686n6811k2082q460j0876M2163Q303P5555j6745m6412
8482A12500N338m124K9555k8912L734M6037k3444q7436l8233K2036J9643j8889
8470C7805K7551p956J0620L6781m5801m8221n032n9174m4713N4067N3078n8471
8458d9466P280K1406J7886K0592O8451J9681n8376o602N5125l7398J4658M3756
8446A16993L144n2342k4240J723M282j9845n9268m0446N144K8535M8809j4340
8434a851M7190Q1820j6118L078j9548r0574p354M4660O6548J542n0746M663J5569
$$ plain form
8519 132743 118021 139178 170976 127390 95296 105752 100491 73219 15177 29966 60265 33667
8507 33667 40003 48128 34211 64450 75657 120084 127135 112628 106733 128110 130564 169532 137771
8494 137771 139947 194551 147865 91054 68972 60512 49636 91799 100102 175657 158912 112500
8482 112500 117838 113714 143269 114357 118091 164128 140684 53248 15015 37051 56694 37805
8470 37805 65356 57400 68020 104801 59000 10779 5747 -53427 -98140 -44073 9005 -49466
8458 -49466 -42186 -20780 -2894 17698 86149 105830 47454 40852 95977 58579 73237 116993
8446 116993 120137 67795 43555 45278 49560 29715 -29553 -69999 -64855 -36320 12489 -1851
8434 -1851 45339 127159 111041 114119 94571 3997 -3357 41303 107851 109393 58647 63310 78879
8421G8879L6p309M2223l4564q6973p7057M9721p733L0915K5548q125P907J1069
8408B4537K4777M399k7569K4576k5828l1695L2182J8644k8407j7180M7639P7285
8396A23360n2365l5370n8875L482P003J1766q28K1611L14r757L7118M9269n5701
8383D1027p624n3240K9933N0949p7352j7860O513j7804P3316P1879j9485p1805
8371H447L9325O961j3353n1828J8575M6335p248k0936L7577l068k6519J9168K6463
8358G9899J0336l584k2843p5016m4102j3253J8341J3935j4029L2972J3685O178
8346B519O8979O8621j1832n9279j6176p5720j828O2723j0259J4577J0701m035
8334D8991o807l6460k4670J7470J7831k7591M2951O5479P178Q762k8578m0098
$$ plain form
8421 78879 78915 71606 113829 79265 -7708 -84765 -35044 -42777 -11862 13686 5561 13468 24537
8408 24537 49314 53713 26144 50720 24892 -6803 25379 44023 15616 -1564 46075 123360
8396 123360 70995 35625 -23250 -19768 -12765 -999 -1827 19784 20098 10341 47459 96728 41027
8383 41027 33403 -19837 10096 61045 -16307 -34167 -27654 -45458 27858 99737 80252 8447
8371 8447 47772 54733 41380 -10448 8127 54462 47214 26278 63855 60787 34268 53436 79899
8358 79899 90235 86651 63808 -11208 -55310 -68563 -50222 -36287 -50316 -17344 -3659 2519
8346 2519 71498 140119 128287 69008 52832 -22888 -24716 38007 27748 42325 53026 48991
8334 48991 42184 5724 -18946 -1476 16355 -11236 31715 97194 104372 113134 84556 44458
8322D4458J9944j437j2070L5712o429K0710k7647M905k6747M847m8124k3334M1030
8309B5818K713m1292l9774n0944j0835R6061M1607O1795M022L1314r846n0016
8297F0623m503J7526l0762o0369k2782N3322L0058N995j4278L4022J8871m5364
8285D2359p37l9324k96M9785K293q2939Q013K4827L7485m2606n3301j5993O84
8272f9750l051p73M7614l801k8305N361r16j579j6561K1017O5379K0521k0793
8259A4363r969J1261N3190k4057j9737L7465J6309K152p9032N504R3752J5808
8247A17009o3354n0129L8385M3765J795J0593k0635o2762j5245K2078k3004L6180
8235C4676L8847K3089m8019n9903p1539K0732R06n3523j9231O8525O0416J0243
$$ plain form
8322 44458 64402 62965 50895 86607 80178 100888 73241 78146 51399 56246 8122 -15212 25818
8309 25818 28531 -12761 -52535 -103479 -114314 -18253 23354 85149 89171 120485 110639 60623
8297 60623 56120 73646 42884 -17485 -40267 13055 43113 49108 34830 68852 87723 42359
8285 42359 41622 2298 2002 51787 54080 -28859 -20846 3981 41466 -1140 -54441 -70434 -69750
8272 -69750 -72801 -73574 -25960 -29761 -58066 -52705 -53621 -55200 -71761 -50744 14635 35156 14363
8259 14363 4394 15655 68845 44788 25051 62516 78825 80977 1945 7449 101201 117009
8247 117009 53655 3526 41911 85676 87471 98064 77429 14667 -578 21500 -1504 34676
8235 34676 73523 96612 48593 -11310 -82849 -62117 -61211 -114734 -133965 -65440 -5024 5219
8223E219J4929N8349l2335j961k0398k3177k1245L381K8570J192N2067J5463K0106
8210A00160n7899m5512p001j6293K0853J1134m9226L4843J5001Q109k4274L6304
8198B6199J4411l5624j5438K060J1117j7247k4490j7010J1784L6691L3183j7816
8186G820l7557M7363K3128J5789p972L3643J3889j765j5364n2235j5490L4839
8174D6088L7025M6676r998j5739q469r9442L855O312P8136P8037j6403n8791j1503
8161G5784J545J1737K6921j4025j09570L9192j7297m6041K7741N2791K7859q772
8149F7865K5237N0183l6522J0021n3506o0522O583M3211P4066l1805p7226m2503
8137b4918M839J863N0921J4374L7506L3496K4673Q912l5029n64R497l0343K9113
$$ plain form
8223 5219 20148 78497 46162 44201 23803 626 -20619 -17238 11332 12524 64591 80054 100160
8210 100160 42261 -3251 -10252 -26545 -5692 5442 -43784 -8941 6060 14169 -10105 26199
8198 26199 40610 4986 -10452 -8392 2725 -14522 -39012 -56022 -44238 -7547 25636 7820
8186 7820 -29737 17626 40754 56543 48571 82214 96103 94338 78974 26739 11249 46088
8174 46088 83113 129789 119791 104052 95583 -3859 -4 6308 84444 162481 146078 87287 75784
8161 75784 77329 89066 115987 101962 -7608 31584 14287 -31754 -4013 48778 76637 67865
8149 67865 93102 143285 106763 116784 63278 2756 9339 52550 126616 94811 17585 -24918
8137 -24918 -20079 -18216 32705 47079 84585 118081 142754 151666 116637 116073 125570 95227 124340
8124A24340K5853N572k9383j5773k1737m5314m0149m9447K6886L9603l8577K0602
8112B476L8064k3842Q556l724L5226M4941k2542j13509k1903M2327L6853O0087
8100H3010m3399J983k5765L2291m395j7753k1325m0507K4807O7271M0068j6452
8088G9834l6678J9756n075K4529J231J537m7493j3696N353j4727J4517l1566K5158
8075B2680N6880K4440o5983k2771M57m7173o3305L5252R1487M8566O1668K3315
8063A65513K0272M0267j8083j2878m2174L268P5925M1122l8267p4173m873j7232
8051A38687m9870K9620R0308j054j5451r1673n9572N4007j1642J7171l3337j846
8039F5348R8330l770K1426P186j0878l4461l4656j8784L9102K9432N3119l2213
$$ plain form
8124 124340 150193 155765 126382 110609 88872 43558 3409 -46038 -19152 20451 -18126 2476
8112 2476 40540 16698 25254 21530 56756 101697 79155 -34354 -56257 -13930 22923 83010
8100 83010 39611 41594 15829 48120 43725 25972 4647 -35860 -11053 56218 96286 79834
8088 79834 43156 62912 57837 82366 83597 85134 37641 23945 29298 14571 29088 -2478 22680
8075 22680 79560 104000 38017 15246 15703 -31470 -94775 -59523 31964 80530 142198 165513
8063 165513 185785 226052 207969 195091 152917 156185 232110 273232 234965 160792 155919 138687
8051 138687 88817 118437 208745 207691 192240 100567 40995 95002 83360 100531 67194 65348
8039 65348 163678 159908 181334 188520 177642 143181 108525 89741 128843 158275 211394 179181
8027A79181K7980j2100j9931O7800M8029j2646K4254N7575M7933J6531P5094J03178
8015F02878J6196n8563l6137k4945r6412l6078m6466j5573n743R353P0983l6393
8003C43100m0244l454j5957p5226K6624m2699K1053j5519N83m3354l3216j1024
7991A10667L0532M8927l8888n2441q645n5787N4733P6938K3060L7700L433k5294
7979B04935K7447J7883n9355l8068K8844P1806P1874L8018k2195j3853K562P0742
7967D00640Q0255k6541o9376r4495j9502j187L1835J9918J3252j6997m2018n4527
7955B21257N179k9843j2871K2563j018m7306m0979k7109l7530K4149J4464m3858
7943D7098J3212J2992L1364K2750P6052M694k2314m1720o1779J3664L7434K6914
$$ plain form
8027 179181 207161 195061 175130 242930 290959 278313 302567 360142 408075 424606 499700 602878
8015 602878 619074 560511 524374 499429 403017 366939 320473 304900 299157 308510 379493 343100
8003 343100 302856 299402 283445 208219 234843 192144 213197 197678 198261 154907 121691 110667
7991 110667 141199 190126 151238 98797 90152 34365 89098 166036 189096 226796 230229 204935
7979 204935 232382 250265 190910 152842 181686 253492 325366 363384 341189 327336 329898 400640
7967 400640 480895 454354 384978 290483 270981 269794 301629 321547 334799 317802 275784 221257
7955 221257 226436 196593 183722 206285 205267 157961 116982 89873 52343 76492 90956 47098
7943 47098 60310 73302 104666 127416 203468 208162 185848 144128 82349 96013 133447 160361
7931A60361N784Q822q82K2232K1934l6941K0199o4409n6435l1638L3144K8761
7919A10932N9986P674p3021m8728j5985K7050j1144K7789J1877l4835N4747j6964
7907I9378j14822n1247M2787o456K1625K4144k647Q5580K8067M5574j3316o9046
7895H9621l2276l5044M1185l4167j0848J1047L9900m6056l125m0461l4708O2769
7883G837M6841o968M144M284j5296n0490K6980O5829l655p040m7403l3382m0175
7870d8494l684l7387K2488O1090L7441J0430j6528p378O7273m1890k478O015k0929
7857B5969J0623l2239n4586K1898l99N91L466K972K3084L5612p1688J2894M3517
7844B1714J6286L523j3210l4639O82J0114j6573k0930L50l4075J6977M332j9251
$$ plain form
7931 160361 166145 174967 174085 196317 218251 181310 201509 137100 80665 49027 82171 110932
7919 110932 170918 178592 105571 56843 40858 67908 56764 84553 96430 61595 116342 99378
7907 99378 -15444 -66691 -23904 -30360 -8735 15409 12762 98342 126409 171983 158667 89621
7895 89621 57345 22301 63486 29319 18471 29518 69418 23362 20237 -20224 -54932 7837
7883 7837 54678 47710 51854 56138 40842 -9648 17332 83161 79506 72466 25063 -8319 -48494
7870 -48494 -52178 -89565 -67077 -5987 31454 41884 25356 17978 85251 43361 40883 46898 25969
7857 25969 36592 4353 -50233 -28335 -28734 -28143 -24677 -21705 1379 36991 -34697 -21803 21714
7844 21714 38000 41523 28313 -6326 -5644 4470 -12103 -33033 -32683 -66758 -49781 -45449 -64700
7831f4700L0629J02644k5791k2192j4754l134j1513l0468P79j5251R65k0641j8840
7818i2267L7884J6773k271M1655K0916m4623m6651M9373L9362m311K3802L2088
7806G1730K543L970j999p1843L021l3891k1819O7174Q8773r84m3586j9446l2533
7793A1110l6562m6610M5911Q1105l1606n3140P6584p708L3610r151m7752j0859
7781D932k845l5155o061P4876r935m0795j9113m4422m7381K8244j2737l3046n86
7768a44024O9616N5121J3038M1404m6984l6682N4384M6844L95j5925k2591k5377
7756a0781L1977J7965M9337K6620o755p1249n097n1590p8220L7425L8641j48R396
7743a2479K3148o488j097k027o131o731n1437r328M9146k435m2657J1022M2497
$$ plain form
7831 -64700 -34071 68573 42782 20590 5836 2702 -8811 -39279 -38500 -53751 -52786 -73427 -92267
7818 -92267 -54383 -37610 -39881 1774 22690 -21933 -68584 -19211 20151 15840 39642 71730
7806 71730 74273 78243 76244 4401 7422 -26469 -48288 18886 107659 106675 63089 43643 11110
7793 11110 -25452 -72062 -26151 54954 23348 -29792 46792 39084 72694 63543 15791 4932
7781 4932 2087 -33068 -39129 35747 25812 -14983 -34096 -78518 -125899 -97655 -110392 -143438 -144024
7768 -144024 -74408 -19287 -6249 35155 -11829 -48511 5873 52717 53112 37187 14596 -10781
7756 -10781 21196 39161 88498 115118 108363 37114 32017 -19573 -97793 -60368 -21727 -21875 -12479
7743 -12479 10669 4181 3084 1057 -5074 -11805 -63242 -72570 -23424 -25859 -68516 -57494 -14997
7730a4997J0994n628M5801p0504O439O3506N5211j0503n3062m2642l4399L8703
7718a1081L1413k2228q2915L3811N0300k5573K698N7713N7020L0996j2842j7635
7706I1677q626m3039j8628j9800n29L1051N3225k587j0083o0561J1231n1802j1915
7693d0386k5668J8384J5275L0457N9214N0587k2525N022K0189m5042r166J6018
7681G2359p6881L1068j7129m5502p724J7581k6480J7949M0892m01j7684m8355
7669f0307J1292K7820M6057K4370j7617M97j5495k3884m3658K294M5319k1905
7657b5217j0273K6534K163q483k8211L4474J2846L3329N5056O9898j3544O17R053
7644A58242j5409k9216k4485L84l7704n0708q0861K2219M3211J3542m9219r396
$$ plain form
7730 -14997 -4003 -9631 36170 -34334 -27895 35611 90822 80319 27257 -15385 -49784 -11081
7718 -11081 20332 -1896 -84811 -51000 -700 -26273 -23575 34138 91158 122154 109312 91677
7706 91677 83051 40012 21384 1584 1055 32106 85331 82744 72661 12100 23331 -28471 -40386
7693 -40386 -66054 -47670 -32395 -1938 57276 107863 85338 90360 110549 65507 56341 72359
7681 72359 -4522 26546 9417 -36085 -43809 -26228 -52708 -34759 6133 5732 -11952 -60307
7669 -60307 -49015 -21195 24862 49232 31615 32112 16617 -7267 -50925 -48631 -3312 -25217
7657 -25217 -35490 -8956 -6793 -15276 -43487 -9013 3833 37162 92218 162116 148572 149189 158242
7644 158242 142833 113617 89132 89516 51812 1104 -79757 -57538 -14327 -785 -50004 -59400
7632e9400K0950k8287O0947N1590M9516j8864k2191J2720K262m7424J021l8086
7620a5246L3369M7886k5569j7773q083n1570k3517Q358m0839j8885L4562J1836
7608f5471Q157N0892K4118O166q490k3821n3316l6771m0116j6440J9507L8996
7596i6589K7576L1715R666q73J1432p05N908J1578P1371j3285m4668o2407m346
7583e3627M7475k2632K1751j239K2718N650J4922r018j5204J6853K1932j9349
7571C0232n4545m1196P2657J1609Q37M516j1146k6710K8068J3359k2566r817L3250
7558B8548L2750j6911k3774o4181k2390M3549p668l6087j2623J7856N9927N289
7546D285p08j673K0935O4886l4174j8498M3202J7544p6744o1320l7282k3337L5859
$$ plain form
7632 -59400 -38450 -66737 -5790 45800 95316 76452 54261 66981 69243 21819 22840 -15246
7620 -15246 18123 66009 40440 22667 14584 -36986 -60503 -52145 -92984 -111869 -77307 -65471
7608 -65471 -57314 -6422 17696 23862 15372 -8449 -61765 -98536 -138652 -155092 -135585 -96589
7596 -96589 -69013 -37298 -27632 -28505 -17073 -17778 -11870 -292 71079 57794 13126 -49281 -53627
7583 -53627 -6152 -28784 -7033 -8272 14446 20096 35018 26000 10796 27649 49581 30232
7571 30232 -24313 -65509 7148 18757 19594 24110 12964 -13746 14322 27681 5115 -4702 28548
7558 28548 61298 44387 20613 -43568 -65958 -22409 -30077 -66164 -78787 -60931 -1004 4285
7546 4285 3577 1904 22839 87725 53551 35053 78255 95799 19055 -42265 -79547 -102884 -67025
7533f7025N5340K3430K71j0609l3554j1016j181m0278k6518k9720L8364O0729
7521d1767J02607M4918k3995r4658m3732m5669J5320N8115j7635L110j9104l896
7509f6386N0833J5991n4107p086j3451J2322j1221M571O8174j1712r169L4482
7497A3241j3445K4168Q324K7944o3967k4064N6307J4545n327R91L3319M710n0017
7484B6729n1576o9910r568j0472J1404L7559j1684M2083n7246j6819j8384J0376
7472a17508Q0241k879k328O675M3014N3258J3732k8241k2120k3934k870K135j5783
7459a6608J9859K7334J9606p580o2709J029O836K5621L5206J8293K2856k7742
7447F2001r647j3821l3663l1864j3336L31l4095O6778J9007n0799J1746K5334
$$ plain form
7533 -67025 -11685 11745 12016 1407 -32147 -43163 -44344 -84622 -111140 -140860 -102496 -41767
7521 -41767 60840 105758 81763 -12895 -56627 -102296 -86976 -28861 -46496 -43386 -62490 -66386
7509 -66386 -15553 438 -53669 -60755 -74206 -61884 -73105 -68534 -360 -12072 -21241 13241
7497 13241 -204 23964 32288 60232 -3735 -27799 28508 43053 37726 38717 72036 76746 26729
7484 26729 -24847 -94757 -104325 -114797 -103393 -65834 -77518 -35435 -92681 -109500 -127884 -117508
7472 -117508 -37267 -40146 -42474 -35799 7215 60473 74205 45964 23844 -90 -2960 -825 -16608
7459 -16608 3251 30585 50191 42611 -20098 -19069 -12233 13388 48594 66887 89743 62001
7447 62001 52354 38533 4870 -26994 -40330 -39999 -74094 -7316 11691 -39108 -27362 -2028
7435b028L4812j1684l1861K1384J5391o724l6063k3278P4603K7775k9675O374
7423C9026o0715n9910j7097L7568J7523M9645k8895l6250L8164L8175M169o972
7411A4431J2143K9917k143m6550l4267L0637l7166l0910J0427l7859l1579K973
7399a19946N6193N6574j4275l5846m1797m8288M0162M7481L9751L6184M5418J4086
7387G5697o4038N1943J2688l2531o5472O3923L234o9546j486m5126j5148R3334
7375G472N9672j1617j5321q278L3448o3981n13N8905o443r2159Q965L5550p768
7362b068R070q375M3736L9157m5601p5429l8399J3229N6494L2501j7849m6241
7350c9775L4833j7985J2325K9117N203k5461L9276m365o1923j7050L7165K7048
$$ plain form
7435 -2028 32784 21100 -10761 10623 26014 19290 -16773 -40051 34552 62327 32652 39026
7423 39026 -21689 -81599 -98696 -61128 -43605 6040 -22855 -59105 -20941 17234 21403 14431
7411 14431 26574 56491 54348 7798 -26469 4168 -32998 -63908 -53481 -91340 -122919 -119946
7399 -119946 -63753 -7179 -21454 -57300 -99097 -147385 -107223 -59742 -19991 16193 61611 75697
7387 75697 11659 63602 76290 43759 -21713 42210 45444 -24102 -25588 -70714 -85862 7472
7375 7472 67144 55527 40206 31928 65376 1395 882 59787 53344 -38815 -29850 5700 -2068
7362 -2068 7002 -1373 42363 81520 35919 -39510 -77909 -64680 -8186 24315 6466 -39775
7350 -39775 -4942 -22927 -10602 18515 23718 -1743 37533 33168 -28755 -45805 -8640 18408
7338A8408k4950r1935j0120N743Q0119K5401J8674J2713l5564J6206j345j0167
7326C183L8916j8056n6021R771m520k2099M9593M6361J8909k3241J0403J7735
7314G0934o0343l2273K5801J8235r4938m1039J5920l978j065K7857L9884N0965
7302A5960J2553q1163j0327Q157j360K8943k5628m2495k4347k1849J1861K3703
7290a05992O0178j0175J7168l365P955j0024K5740O2314K5644L928J8612j3911
7278G8072n0898n3272q588O3034k5106K0604k1975J2867m1977l698O0521n2283
7266b2699l4489N1673J015l6701O4172M1922k8955q849M6992o103r3327l2212
7254e7561M9534J0984m6779J8249L6626K4819M7889m4074r3680k5514L9548J03136
$$ plain form
7338 18408 -6542 -98477 -108597 -102854 -22735 2666 21340 34053 -1511 14695 13350 3183
7326 3183 42099 24043 -31978 -22207 -26727 -48826 767 47128 66037 42796 53199 70934
7314 70934 10591 -21682 4119 22354 -72584 -113623 -97703 -101681 -102746 -74889 -35005 15960
7302 15960 28513 -52650 -62977 -54820 -56180 -27237 -52865 -95360 -119707 -141556 -129695 -105992
7290 -105992 -45814 -55989 -38821 -42186 -34231 -44255 -18515 43799 69443 73371 91983 78072
7278 78072 27174 -26098 -34686 28348 3242 23846 1871 14738 -27239 -30937 29584 -22699
7266 -22699 -57188 -5515 -4500 -41201 22971 64893 35938 27089 74081 67978 -25349 -57561
7254 -57561 -8027 2957 -43822 -25573 11053 35872 83761 39687 -53993 -79507 -39959 63177
7242F3177k1132n3063M3688l3133m7239j7373p7689j3089Q5169L4539N1127j701
7230A3281K2283m9314o3791l067M0732J0186p7547J5413O7119Q601Q469k1053
7218b8688L5323M8278n160l4278j797m4154k0207n0703K6236L9371L0840K4424
7206A9485P3427n4650k4969j6760j3542K4387j1924k8184j8274Q817l2794O290
7194f8691O4761l4543J45r528m7056J0185L9219p788j26742o769O7681L8908J0161
7181g0057J6935k8575k1720K1755l1450Q4818L6287N741l9814K77j7783m4873
7169h8459L0563J257r503L4332m7109j4411O8523j988N835j6348j4050p471M7121
7156a1708K6657K8969M497J1217L594n2210Q238k4425l8438N1118r889L4188L9979
$$ plain form
7242 63177 42045 -11018 32670 -463 -47702 -65075 -142764 -155853 -70684 -36145 14982 13281
7230 13281 35564 -13750 -77541 -80608 -39876 -29690 -107237 -91824 -24705 -16104 -7635 -28688
7218 -28688 6635 54913 49753 15475 13678 -30476 -50683 -101386 -75150 -35779 -4939 19485
7206 19485 92912 38262 13293 -3467 -17009 7378 -4546 -32730 -51004 -42187 -74981 -68691
7194 -68691 -3930 -38473 -38328 -47856 -94912 -84727 -45508 -53296 -180038 -186807 -119126 -80218 -70057
7181 -70057 -53122 -81697 -103417 -81662 -113112 -28294 7993 13734 -26080 -25803 -43586 -88459
7169 -88459 -57896 -56639 -66142 -31810 -78919 -93330 -24807 -26795 -20960 -37308 -51358 -58829 -11708
7156 -11708 14949 43918 48415 59632 63226 11016 19254 -5171 -43609 7509 -2380 31808 71787
7143G1787o942n6853m1612K8316K4428M2170l800l107m1353l5491j5106L931m918
7130c8550L2596L5158p549p4586l0164j6256M255L8094l7599j1163m0406O1028
7118h5142O5851o207j1619j5640K2214K5883l5300p552M841N0497J4815N902o370
7105B2173K7808K8719k5631j4357j07552n4410J5325O2280Q52j4046Q154N713
7093d4972l3729K6863J2600j8533L7737K299j7825j6173M1677l6371j4207L5645
7081b4989M0059J1270j3410j03949j6868L0947O0491Q461P341m1035k0587K2314
7069c9955K6495P4267k6067p5206j0732L9921L2116n1059o6318M425K8014J4069
7057e0030K3505N0814j850k0404M3176j6024O377k8771m8237J1717p271l3130
$$ plain form
7143 71787 64845 7992 -33620 -5304 19124 61294 57494 54387 13034 -22457 -37563 -33632 -38550
7130 -38550 -5954 29204 21655 -52931 -83095 -99351 -95096 -57002 -94601 -105764 -146170 -85142
7118 -85142 -19291 -25498 -37117 -52757 -30543 -4660 -39960 -47512 -42671 7826 22641 28543 22173
7105 22173 49981 78700 53069 38712 -68840 -123250 -107925 -45645 -44793 -58839 -50685 -44972
7093 -44972 -78701 -51838 -39238 -57771 -20034 -17735 -35560 -51733 -10056 -46427 -60634 -24989
7081 -24989 15070 26340 12930 -91019 -107887 -76940 -16449 -7988 -647 -41682 -62269 -39955
7069 -39955 -13460 60807 34740 -40466 -51198 -11277 20839 -30220 -96538 -92113 -64099 -50030
7057 -50030 -26525 24289 22439 2035 45211 29187 35564 6793 -41444 -29727 -36998 -70128
7045g0128m4457K423L5432M1632J4344L7310m8314j8858L7679k6374Q838m6481
7033g6954J4497N0867L514l033m5043K7646M7166k2666m7393k4653J3947J8588
7021d3517K5743r500K6679m750L3056Q0173j4155O5099m4838o7877m0251P6641
7009H2503o959k827n1554p9233n6928N6562L6695J6051M2605m410K9684Q519K735
6996G3443k5121n9826n1571K1566j4344K5556O3663J5349J8557m3367l9375p5734
$$ plain form
7045 -70128 -114585 -112162 -76730 -35098 -20754 16556 -31758 -50616 -12937 -39311 -30473 -76954
7033 -76954 -62457 -11590 -8076 -11109 -56152 -28506 18660 -4006 -51399 -76052 -62105 -43517
7021 -43517 -17774 -27274 -595 -5345 27711 107884 93729 158828 113990 46113 5862 82503
7009 82503 75544 72717 21163 -58070 -114998 -58436 -21741 -5690 36915 32505 62189 70708 73443
6996 73443 48322 -11504 -63075 -41509 -55853 -30297 33366 48715 67272 23905 -15470 -91204
$$ [...]
##END NTUPLES=NMR SPECTRUM
##END=
