##TITLE=Analysis number 329802
Compound Code cc 67004
Book Reference 508/134
Project Code adrs
Chemist Name antons
##JCAMPDX= 6.0         $$ Bruker NMR JCAMP-DX V2.0
##DATA TYPE= NMR SPECTRUM
##DATA CLASS= NTUPLES
##ORIGIN= Bruker BioSpin GmbH
##OWNER= nmr
$$ XWIN-NMR		Version 3.5
$$ Mon Oct  1 11:31:05 2007 GMT Daylight Time (UT+1h)  MAYBRIDGE\nmr@NMR_250MHZ
##.OBSERVE FREQUENCY= 250.131544655141
##.OBSERVE NUCLEUS= ^1H
##.ACQUISITION MODE= SIMULTANEOUS (DQD)
##.ACQUISITION SCHEME= undefined
##.AVERAGES= 16
##.DIGITISER RES= 18
##SPECTROMETER/DATA SYSTEM= dpx250
##.PULSE SEQUENCE= zg30
##.SOLVENT NAME= CDCl3
##.SHIFT REFERENCE= (INTERNAL, CDCl3, 0, 16.522)
##AUDIT TRAIL= $$ (NUMBER, WHEN, WHO, WHERE, WHAT)
$$ ##TITLE= Audit trail, XWIN-NMR		Version 3.5
$$ ##JCAMPDX= 5.01
$$ ##ORIGIN= Bruker BioSpin GmbH
$$ ##OWNER= nmr
$$ C:\u/data/dgb/nmr/ADRS/10/pdata/1/auditp.txt
$$ ##AUDIT TRAIL=  $$ (NUMBER, WHEN, WHO, WHERE, WHAT)
(   1,<2007-10-01 11:30:43.95 +100>,<MAYBRIDGE\nmr>,<NMR_250MHZ>,
      <created by zg, POWCHK disabled, PULCHK disabled
       configuration hash MD5:
       76 6E 9A 78 1E 09 19 81 EC 84 63 8F B0 6A 59 2D
       data hash MD5: 64K
       85 4D A0 6C 6F AF 3B 57 B0 15 44 4C DA 04 8F 5E>)
(   2,<2007-10-01 11:30:55.42 +100>,<MAYBRIDGE\nmr>,<NMR_250MHZ>,
      <Start of raw data processing
       ef LB = 0.3 FT_mod = 6 PKNL = 1 SI = 32K 
       data hash MD5: 32K
       83 0B 3C AC 54 0C 29 40 A6 CA 9C 29 15 6A E9 39>)
(   3,<2007-10-01 11:30:56.98 +100>,<MAYBRIDGE\nmr>,<NMR_250MHZ>,
      <apk 
       data hash MD5: 32K
       E9 35 34 EF AB D4 30 65 4C 9D 3F E8 13 A1 CF 8C>)
(   4,<2007-10-01 11:30:57.67 +100>,<MAYBRIDGE\nmr>,<NMR_250MHZ>,
      <abs ABSG = 5 
       data hash MD5: 32K
       27 60 63 F0 6D 05 FB 21 22 0C C4 44 A6 34 A3 A6>)
$$ ##END=
$$ 
$$ hash MD5
$$ 49 85 63 4A E2 FE 42 89 B5 0A BD 27 C1 3E 57 46
##$RELAX= 
##$RELAX= 
##$RELAX= 
##$RELAX= 
##$RELAX= 
##$RELAX= 
##$RELAX= 
$$ Bruker specific parameters
$$ --------------------------
##$DU= <C:\u>
##$EXPNO= 10
##$NAME= <ADRS>
##$PROCNO= 1
##$TYPE= <nmr>
##$USER= <dgb>
##$AMP= (0..31)
100 100 100 100 100 100 100 100 100 100 100 100 100 100 100 100 100 100 
100 100 100 100 100 100 100 100 100 100 100 100 100 100 
##$AQSEQ= 0
##$AQ_mod= 3
##$AUNM= <au_zg>
##$AUTOPOS= <48 >
##$BF1= 250.13
##$BF2= 250.13
##$BF3= 250.13
##$BF4= 250.13
##$BF5= 500.13
##$BF6= 500.13
##$BF7= 500.13
##$BF8= 500.13
##$BYTORDA= 1
##$CFDGTYP= 0
##$CFRGTYP= 5
##$CHEMSTR= <none>
##$CNST= (0..31)
1 1 145 1 1 1 1 1 1 1 1 1 1 1 1 1 1 1 1 1 1 1 1 1 1 1 1 1 1 1 1 1 
##$CPDPRG= <>
##$CPDPRG1= <>
##$CPDPRG2= <>
##$CPDPRG3= <>
##$CPDPRG4= <mlev>
##$CPDPRG5= <mlev>
##$CPDPRG6= <mlev>
##$CPDPRG7= <mlev>
##$CPDPRG8= <mlev>
##$CPDPRGB= <>
##$CPDPRGT= <>
##$D= (0..31)
0 1 0 0 0 0 0 0 0 0.06 0 0 0 0 0 0 0.0002 0 0 0 0 0 0 0 0 0 0 0 0 0 0 
0 
##$DATE= 1191234642
##$DBL= (0..7)
120 120 120 120 120 120 120 120 
##$DBP= (0..7)
150 150 150 150 150 150 150 150 
##$DBP07= 0
##$DBPNAM0= <>
##$DBPNAM1= <>
$$ [...]
##$SUBNAM7= <"">
##$SUBNAM8= <"">
##$SUBNAM9= <"">
##$SW= 20.6930455092707
##$SWIBOX= (0..15)
0 0 3 0 0 0 0 0 0 0 0 0 0 0 0 0 
##$SW_h= 5175.983436853
##$TD= 65536
##$TD0= 1
##$TE= 297.16
##$TE2= 300
##$TE3= 300
##$TEG= 300
##$TL= (0..7)
0 120 120 120 120 120 120 120 
##$TP= (0..7)
150 150 150 150 150 150 150 150 
##$TP07= 0
##$TPNAME0= <>
##$TPNAME1= <>
##$TPNAME2= <>
##$TPNAME3= <>
##$TPNAME4= <>
##$TPNAME5= <>
##$TPNAME6= <>
##$TPNAME7= <>
##$TPOAL= (0..7)
0.5 0.5 0.5 0.5 0.5 0.5 0.5 0.5 
##$TPOFFS= (0..7)
0 0 0 0 0 0 0 0 
##$TUNHIN= 0
##$TUNHOUT= 0
##$TUNXOUT= 0
##$USERA1= <user>
##$USERA2= <user>
##$USERA3= <user>
##$USERA4= <user>
##$USERA5= <user>
##$V9= 5
##$VALIST= <valist>
##$VCLIST= <CCCCCCCCCCCCCCC>
##$VD= 0
##$VDLIST= <DDDDDDDDDDDDDDD>
##$VPLIST= <PPPPPPPPPPPPPPP>
##$VTLIST= <TTTTTTTTTTTTTTT>
##$WBST= 1024
##$WBSW= 4
##$XGAIN= (0..3)
0 0 0 0 
##$XL= 0
##$YL= 0
##$YMAX_a= 362918
##$YMIN_a= -445235
##$ZGOPTNS= <>
##$ZL1= 120
##$ZL2= 120
##$ZL3= 120
##$ZL4= 120
##$ABSF1= 16.522
##$ABSF2= -4.171173
##$ABSG= 5
##$ABSL= 3
##$ALPHA= 0
##$AQORDER= 0
##$ASSFAC= 0
##$ASSFACI= 0
##$ASSFACX= 0
##$ASSWID= 0
##$AUNMP= <proc_1d>
##$AZFE= 0.1
##$AZFW= 0.1
##$BCFW= 0
##$BC_mod= 0
##$BYTORDP= 0
##$COROFFS= 0
##$CY= 12.5
##$DATMOD= 1
##$DC= 0
##$DFILT= <>
##$DTYPP= 0
##$F1P= 14.0000005364418
##$F2P= -0.99999901652339
##$FCOR= 0.5
##$FTSIZE= 32768
##$FT_mod= 6
##$GAMMA= 0
##$GB= 0
##$INTBC= 1
##$INTSCL= 1
##$ISEN= 128
##$LB= 0.3
##$LEV0= 0
##$LPBIN= 0
##$MAXI= 10000
##$MC2= 0
##$MEAN= 0
##$ME_mod= 0
##$MI= 0
##$NCOEF= 0
##$NC_proc= -4
##$NLEV= 6
##$NOISF1= 0
##$NOISF2= 0
##$NSP= 0
##$NTH_PI= 0
##$NZP= 0
##$OFFSET= 16.522
##$PC= 1
##$PHC0= 155.0636
##$PHC1= 13.89689
##$PH_mod= 1
##$PKNL= yes
##$PPARMOD= 0
##$PSCAL= 4
##$PSIGN= 0
##$REVERSE= no
##$SF= 250.13
##$SI= 32768
##$SIGF1= 0
##$SIGF2= 0
##$SINO= 400
##$SIOLD= 32768
##$SREGLST= <1H.CDCl3>
##$SSB= 0
##$STSI= 32768
##$STSR= 0
##$SW_p= 5175.98343685301
##$SYMM= 0
##$S_DEV= 0
##$TDeff= 65536
##$TDoff= 0
##$TI= <Analysis number 999999
Compound Code 99
Book Reference 9
Project Code 9>
##$TILT= no
##$TM1= 0
##$TM2= 0
##$TOPLEV= 0
##$USERP1= <user>
##$USERP2= <user>
##$USERP3= <user>
##$USERP4= <user>
##$USERP5= <user>
##$WDW= 1
##$XDIM= 32768
##$YMAX_p= 461785071
##$YMIN_p= -384852
$$ End of Bruker specific parameters
$$ ---------------------------------
##NTUPLES= NMR SPECTRUM
##VAR_NAME=  FREQUENCY,     SPECTRUM/REAL,   SPECTRUM/IMAG
##SYMBOL=    X,             R,               I
##VAR_TYPE=  INDEPENDENT,   DEPENDENT,       DEPENDENT
##VAR_FORM=  AFFN,          ASDF,            ASDF
##VAR_DIM=   32768,         32768,           32768
##UNITS=     HZ,            ARBITRARY UNITS, ARBITRARY UNITS
##FACTOR=    0.157963299565203, 1,           1
##FIRST=     4132.6476996994, 0,             0
##LAST=      -1043.33573715361, 0,           0
##MIN=       -1043.33573715361, -384852,     0
##MAX=       4132.6476996994, 461785071,     0
$$ Real data points
##PAGE= N=1
##DATA TABLE= (X++(R..R)), XYDATA
$$ [...]
$$ plain form
23856 -242520 -141566 -86690 -116048 -90323 -161977 -128557 -31030 37055 69541 53770 -382
23845 -382 65982 138465 67443 -20533 -27524 6434 20954 -74444 -126657 -134636 -42618 -16077
23833 -16077 -67916 -6614 82647 85354 39192 -53470 39840 118130 -4487 -48047 -4532 1710
23821 1710 38612 -37704 -130622 -132494 -73138 -98690 -174541 -212850 -248374 -204484 -92075 -51453
23809 -51453 7885 33403 50291 37632 127565 202151 223971 290628 317365 244148 177840 124262
23797 124262 99793 118418 -30674 -146428 -162302 -111396 -39579 27777 55068 166 45131
23786 45131 186168 127957 111480 178185 115848 72313 33797 75223 95335 30188 -136277
23775 -136277 -164189 -97494 -48339 46319 65691 11432 -5593 69222 80135 18534 26647 101119
$$ packed form
23856b42520J00954N4876k9358K5725p1654L3420R7527O8085L2486j5771n4152
23845c82O6364P2483p1022q7976o991L3958J4520r5398n2213p979R2018K6541
23833a6077n1839O1302Q9261K707m6162r2662R3310P8290j22617m3560M3515O242
23821A710L6902p6316r2918j872N9356k5552p5851l8309l5524M3890J12409M0622
23809e1453N9338K5518J6888j2659Q9933P4586K1820O6657K6737p3217o6308n3578
23797A24262k4469J8625j49092j15754j5874N0906P1817O7356K7291n4902M4965
23786D5131J41037n8211j6477O6705o2337m3535l8516M1426K0112o5147j66465
23775a36277k7912O6695M9155R4658J9372n4259j7025P4815J0913o1601Q113P4472
$$ plain form
23763 101119 219416 218213 161174 -8872 -15390 49449 90821 77932 75892 110277 54244 112465
23751 112465 194735 235664 138644 115333 26425 -61603 -26278 -45089 -131608 -63425 -72585 -47481
23739 -47481 -58164 -59807 -28826 -53416 -26984 61263 74908 6241 -97935 -55611 11516 23723
23727 23723 18077 -10811 -69507 -112413 -132397 -151899 -33250 70613 106306 149127 150833 67479
23715 67479 -921 43554 183504 91466 -420 -75251 -139478 -107983 -38043 35433 -47475
23704 -47475 -68622 -101246 -118344 -99666 -2969 146777 118870 78536 69679 50665 12240 -20844
23692 -20844 -51273 -69993 -965 -32991 40906 51652 39265 39651 87606 143431 145009 39676
23680 39676 -684 -54470 -25803 95899 17158 -164910 -96743 -55746 45836 22150 -102013
$$ packed form
23763A01119J18297j203n7039j70046o518O4839M1372j2889k040L4385n6033N8221
23751A12465Q2270M0929r7020k3311q8908q8028L5325j8811q6519O8183r160K5104
23739d7481j0683j643L0981k4590K6432Q8247J3645o8667j04176M2324O7127J2207
23727B3723n646k8888n8696m2906j9984j9502J18649J03863L5693M2821J706q3354
23715F7479o8400M4475J39950r2038r1886p4831o4227L1495O9940P3476q2908
23704d7475k1147l2624j7098J8678R6697J49746k7907m0334q857j9014l8425l3084
23692b0844l0429j8720O9028l2026P3897J0746j2387L86M7955N5825J578j05333
23680C9676m0360n3786K8667J21702p8741j82068O8167M0997J01582k3686j24163
$$ plain form
23669 -102013 -150580 -110364 -68583 -25109 24225 134977 62622 54135 114942 109160 118603 99617
23657 99617 40621 39104 32435 54640 106565 120057 70526 -85847 -117865 -187928 -186256 -156458
23645 -156458 -147895 -89196 -6764 32854 -37976 -85507 -91170 21695 64378 50371 6368 59630
23633 59630 134360 177102 118057 43734 838 26175 41455 44441 67370 67389 145589 136447 32069
23620 32069 -26786 3188 79271 169351 158940 26663 -17763 67093 142228 165659 193605
23609 193605 115820 80898 126661 152764 105953 22845 -52129 -7712 94666 132902 143767
23598 143767 108346 33975 -66220 -51247 -25483 -10132 -65678 -127345 -155843 -75463 27351
23587 27351 -22360 -42236 -61061 26782 106035 192439 227073 203574 110862 -26756 -60659
$$ packed form
23669a02013m8567M0216M1781M3474M9334J10752p2355q487O0807n782R443j8986
23657I9617n8996j517o669K2205N1925J3492m9531j56373l2018p0063J672K9798
23645a56458Q563N8699Q2432L9618p0830m7531n663J12865M2683j4007m4003N3262
23633E9630P4730M2742n9045p4323m2896K5337J5280K986K2929J9P8200r142j04378
23620C2069n8855K9974P6083R0080j0411j32277m4426Q4856P5135K3431K7946
23609A93605p7785l4922M5763K6103m6811q3108p4974M4417J02378L8236J0865
23598A43767l5421p4371j00195J4973K5764J5351n5546o1667k8498Q0380J02814
23587B7351m9711j9876j8825Q7843P9253Q6404L4634k3499r2712j37618l3903
$$ plain form
23576 -60659 -108446 -94060 35267 77906 116334 93496 -2540 34935 55265 58479 173545
23565 173545 184454 155915 119063 211781 122976 15763 -19216 54322 -6396 75967 148418
23554 148418 143326 121173 85062 62497 -17823 -183471 -185980 -104879 -44040 -19270 -97012 -186490
23542 -186490 -157641 -98542 -5166 46225 -83096 -115666 -119110 -132599 -71243 -25743 40045
23531 40045 33234 -8006 -86613 -75168 -59976 -57184 54495 150086 138797 133030 160218 47806
23519 47806 -85891 -4659 126689 126054 88743 39595 72946 115522 53353 26961 25717 16317
23507 16317 31097 78875 3847 10397 10978 26422 45315 39528 50664 33268 7030 23280
23495 23280 85925 57213 68931 69966 32644 65588 131750 167936 145428 123345 55521 -50597
$$ packed form
23576f0659m7787J4386J29327M2639L8428k2838r6036L7475K0330L214J15066
23565A73545J0909k8539l6852R2718q8805j07213l4979P3538o0718Q2363P2451
23554A48418n092k2153l6111k2565q0320j65648k509Q1101O0839K4770p7742q9478
23542a86490K8849N9099R3376N1391j29321l2570l444j3489O1356M5500O5788
23531D0045o811m1240p8607J1445J5192K792J11679R5591j1289n767K7188j12412
23519D7806j33697Q1232J31348o35l7311m9148L3351M2576o2169k6392j244r400
23507A6317J4780M7778p5028O550N81J5444J8893n787J1136j7396k6238J6250
23495B3280O2645k8712J1718J035l7322L2944O6162L6186k2508k2083o7824j06118
$$ plain form
23483 -50597 22815 67440 67333 5723 67483 17740 61895 104316 116355 187630 190762 153104
23471 153104 54410 -7851 -51566 35622 147340 96829 66744 95020 88626 139382 176656
23460 176656 163281 69438 63108 77460 97893 147546 48881 2003 -23574 12001 -6997 62522
23448 62522 111284 64430 30127 25673 -17340 17184 10307 11554 -18760 -38894 -38229 -34103 22955
23435 22955 -39126 -98001 -182367 -156019 -61998 -80904 -116114 -34020 -8502 52477 117463 99720
23423 99720 91694 41904 -57179 -7216 66066 28093 -69142 20778 106629 103713 61182 550
23411 550 33478 3801 60966 135259 105931 92359 83309 91770 85666 45278 -9661 -31757 -49579
23398 -49579 -48158 8517 4713 -52017 -119774 -131847 -95888 -80428 6977 106690 91661 55203
$$ packed form
23483e0597P3412M4625j07o1610O1760m9743M4155M2421J2039P1275L132l7658
23471A53104r8694o2261m3715Q7188J11718n0511l0085K8276o394N0756L7274
23460A76656j3375r3843o330J4352K0433M9653r8665m6878k5577L5575j8998O9519
23448F2522M8762m6854l4303m454m3013L4524o877J247l0314k0134O65M126N7058
23435B2955o2081n8875q4366K6348R4021j8906l5210Q2094K5518O0979O4986j7743
23423I9720q026m9790r9083M9963P3282l7973r7235Q9920Q5851k916m2531o0632
23411E50L2928k9677N7165P4293k9328j3572r050Q461o104m0388n4939k2096j7822
23398d9579J421N6675l804n6730o7757j2073L5959J5460Q7405R9713j5029l6458
$$ plain form
23386 55203 33494 91064 129943 148189 102817 171757 134628 133091 64628 16658 -65424 3083
23374 3083 46983 -63869 -140051 -27821 32597 76074 83207 106332 131460 77982 -3949 -72111
23362 -72111 -83988 -98608 -27997 -5345 80903 143948 48064 28103 50048 79701 166329 125006
23350 125006 23295 25192 20066 -50853 -147385 -113795 -91157 -49419 -34244 -32492 -7611 -69333
23338 -69333 -26959 47041 -61121 -93787 -111360 -44484 141072 55008 -27270 27342 15935
23327 15935 78248 120239 -18028 -171085 -201985 -223080 -110899 -1776 45245 110185 225060
23316 225060 191297 94043 73944 63965 49092 124752 168610 218720 218917 128029 167382 219772
23304 219772 147887 37923 41432 -39656 -102872 12941 65813 60769 59588 137407 102444 82155
$$ packed form
23386E5203k1709N7570L8879J8246m5372O8940l7129j537o8463m7970q2082O8507
23374C083M3900j10852p6182J12230O0418M3477P133K3125K5128n3478q1931o8162
23362g2111j1877j4620P0611K2652Q6248O3045r5884j9961K1945K9653Q6628m1323
23350A25006j01711J897n126p0919r6532L3590K2638M1738J5175J752K4881o1722
23338f9333M2374P4000j08162l2666j7573O6876J85556q6064q2278N4612j1407
23327A5935O2313M1991j38267j53057l0900k1095J12181J09123M7021O4940J14875
23316B25060l3763r7254k0099r979j4873P5660M3858N0110J97r0888L9353N2390
23304B19772p1885j09964L509q1088o3216J15813N2872n044j181P7819l4963k0289
$$ plain form
23292 82155 52012 31651 15745 -87237 -91406 -48137 36859 162856 141918 75224 -31793
23281 -31793 -37472 -78607 -144514 -147469 -76895 -61292 -6110 62327 -14228 -22288 -49496 -41811
23269 -41811 -91776 -111378 -73543 -83499 -114023 -215503 -141047 -34440 12030 102791 64169
23258 64169 39538 21803 28284 183447 206770 126205 109765 87966 24933 -85533 -82817 14293
23246 14293 62707 137644 132654 58306 -66953 -57415 -8733 32453 43653 3019 -71147 -5121
23234 -5121 -4687 -43440 -51668 -48749 -12390 21672 44517 82370 22904 -34862 36781 99851 32715
23221 32715 -68855 -154906 -118733 -76717 -121977 -121456 -123492 -213031 -160801 -95235 29585 140411
23209 140411 129374 81580 127568 131132 -24489 -147713 -188234 -152252 -115988 -79874 57779
$$ packed form
23292H2155l0143k0361j5906j02982m169M3269Q4996J25997k0938o6694j07017
23281c1793n679m1135o5907k955P0574J5603N5182O8437p6555q060k7208P685
23269d1811m9965j9602L7835r956l0524j01480P4456J06607M6470R0761l8622
23258F4169k4631j7735O481J55163K3323q0565j6440k1799o3033j10466K716R7110
23246A4293M8414P4937m990p4348j25259R538M8682M1186J1200m0634p4166O6026
23234e121M34l8753q228K919L6359L4062K2845L7853n9466n7766P1643O3070o7136
23221C2715j01570q6051L6173M2016m5260N21k036q9539N2230O5566J24820J10826
23209A40411j1037m7794M5988L564j55621j23224m0521L5982L6264L6114J37653
$$ plain form
23198 57779 18568 743 9378 -33189 9627 89180 189951 123827 51902 72615 106236 103568
23186 103568 78219 91080 113578 170807 180578 58156 32392 75639 27269 -54694 -96725
23175 -96725 -69692 -26038 -12861 14477 164036 44034 -45541 -21098 -40345 -77276 -104700
23164 -104700 -124285 -112206 -103636 -87848 -133811 -120008 -53218 -63499 -85695 8449 19605 91067
23152 91067 94935 22732 1667 21754 62823 48158 64986 53832 24292 39211 77070 60373
23140 60373 79781 121504 -28766 -119112 -111951 -56013 -46463 59567 68164 -35331 -75405 89353
23128 89353 40760 -26573 -10577 92547 126762 107112 72784 -30206 1146 -31931 3431
23117 3431 46932 57469 102405 87304 120550 132769 121648 -36133 -77461 37486 76619
$$ packed form
23198E7779l9211j7825Q635m2567M2816P9553J00771o6124p1925K0713L3621k668
23186A03568k5349J2861K2498N7229R771j22422k5764M3247m8370q1963m2031
23175i6725K7033M3654J3177K7338J49559j20002q9575K4443j9247l6931k7424
23164a04700j9585J2079Q570J5788m5963J3803O6790j0281k2196R4144J1156P1462
23152I1067L868p2203k1065K0087M1069j4665J6828j1154k9540J4919L7859j6697
23140F0373J9408M1723j50270r0346P161N5938R550J06030Q597j03495m0074J64758
23128H9353m8593o7333J5996J03124L4215j9650l4328j02990L1352l3077L5362
23117C431M3501J0537M4936j5101L3246J2219j1121j57781m1328J14947L9133
$$ plain form
23106 76619 40551 44811 76060 36528 94569 98667 -8827 -22463 -47836 -18211 10679 -63396
23094 -63396 -79402 -115390 -80244 -12697 -27537 -78472 -133768 -69116 -28851 61698 -51848
23083 -51848 -170629 -158353 -135723 -53549 -64846 -31536 82971 134538 65795 -30013 -54536
23072 -54536 -31418 -107025 -216729 -301776 -240831 8303 103978 154000 95884 31052 -34586
23061 -34586 -77512 -21443 31641 21798 82346 40996 63576 82550 78508 57206 45802 39004
23049 39004 -46640 -18952 53611 93752 67527 -21883 68580 178536 274185 230711 120130
23038 120130 54624 22965 -10167 -50690 -10019 -30363 -77076 -75229 39067 -51683 -100244
23027 -100244 -34033 -614 -32190 94465 177183 121839 37588 25308 3315 10890 -36611
$$ packed form
23106G6619l6068M260L1249l9532N8041M098j07494j3636k5373K9625K8890p4075
23094f3396j6006l5988L5146O7547j4840n0935n5296O4652M0265R0549j13546
23083e1848j18781J2276K2630Q2174j1297L3310J14507N1567o8743r5808k4523
23072e4536K3118p5607j09704q5047O0945K49134R5675N0022n8116o4832o5638
23061c4586m2926N6069N3084r843O0548m1350K2580J8974m042k1302j1404o798
23049C9004q5644K7688P2563M0141k6225q9410R0463J09956R5649m3474j10581
23038A20130o5506l1659l3132m0523M0671k0344m6713J847J14296r0750m8561
23027a00244O6211L3419l1576J26655Q2718n5344q4251j2280k1993P575m7501
$$ plain form
23016 -36611 -107854 -121951 -163963 -137036 -102111 -125657 -81736 -122616 -121446 -30475 -93966 -212445
23004 -212445 -172756 -57891 3766 61548 96431 159683 110088 45644 35808 2678 -59305
22993 -59305 -26189 25658 13146 43167 32363 4346 66405 115636 179495 133642 123318 14755
22981 14755 -31137 -77883 -125037 -67945 23454 136589 136485 76996 32809 59506 9147 -22530
22969 -22530 -87811 -140778 -143321 -27803 13859 58143 133735 137208 264126 176972 13561
22958 13561 -98311 -120461 -104250 -106884 -106472 -15576 -11881 9479 -88153 -94809 -119014 -112616 -34883
22945 -34883 -32912 -83009 -121647 3366 146289 247869 245007 140684 -1935 -68694 21882
22934 21882 187202 155994 141209 271316 231931 170687 197686 266184 288184 285485 226916
$$ packed form
23016c6611p1243j4097m2012K6927L4925k3546M3921m0880J170R0971o3491j18479
23004b12445L9689J14865O1657N7782L4883O3252m9595o4444r836l3130o1983
22993e9305L3116N1847j2512L0021j0804k8017O2059M9231O3859m5853j0324j08563
22981A4755m5892m6746m7154N7092R1399J13135j04n9489m4187K6697n0359l1677
22969b2530o5281n2967k543J15518M1662M4284P5592L473J26918q7154j63411
22958A3561j11872k2150J6211k634M12R0896L695K1360r7632o656k4205O398P7733
22945c4883J971n0097l8638J25013J42923J01580k862j04323j42619o6759R0576
22934B1882J65320l1208j4785J30107l9385o1244K6999O8498K2000k699n8569
$$ plain form
22923 226916 316827 432915 626751 729254 1132146 1614462 1989357 2254165 2290613 2041514
22913 2041514 1692920 1216037 839107 603077 423236 319927 245239 293280 368948 348832
22903 348832 161614 74342 261220 302577 263078 148183 88807 -3014 44269 57790 8826
22892 8826 -61446 -85935 -15438 35211 47164 78931 111338 186289 191847 111674 167392 174469
22880 174469 79883 125664 145804 29529 17440 -10551 22868 75659 68835 -53662 -51952
22869 -51952 -66120 -72236 20560 29207 -24563 1033 109500 256898 218146 117163 74930
22858 74930 125924 124575 149716 170884 117152 37547 74345 49510 22235 24600 -27917 87369
22846 87369 216231 279849 206405 126369 55911 13537 46169 81981 -15971 7610 142632
$$ packed form
22923B26916Q9911J16088J93836J02503M02892M82316L74895K64808L6448k49099
22913B041514l48594m76883l76930k36030j79841j03309p4688M8041P5668k0116
22903C48832j87218q7272J86878M1357l9499j14895n9376r1821M7283J3521m8964
22892H826p0272k4489P0497N0649J1953L1767L2407P4951N558q0173N5718P077
22880A74469r4586M5781K0140j16275j2089k7991L3419N2791o824j22497J710
22869e1952j4168o116R2796Q647n3770K5596J08467J47398l8752j00983m2233
22858G4930N0994j349K5141K1168n3732p9605L6798k4835k7275K365n2517J15286
22846H7369J28862O3618p3444q0036p0458m2374L2632L5812r7952K3581J35022
$$ plain form
22835 142632 150284 -51533 -59505 55780 77148 98938 122930 153534 48074 -34317 11180
22824 11180 42561 83618 98966 94526 99802 104962 105868 91198 63734 106802 175224 89685 104318
22811 104318 38029 -7208 8233 145275 161858 28239 29821 95590 133018 137967 156773
22800 156773 141895 70174 7518 11161 -20964 3314 54392 64019 124664 116339 42751 104393
22788 104393 172201 105741 46906 98955 161121 183812 163321 77884 40044 80817 121720
22777 121720 134575 138937 65133 -32419 -74503 -54309 135251 184325 50759 -10107 16231
22766 16231 91053 246438 183112 133556 62242 -44212 -72728 -58738 -7730 33037 115268
22755 115268 137877 175260 192609 113165 119366 82614 82959 40071 -22590 44517 96199 169753
$$ packed form
22835A42632P652k01817p972J15285K1368K1790K3992L0604j05460q2391M5497
22824A1180L1381M1057J5348m440N276N160R06j4670k7464M3068O8422q5539J4633
22811A04318o6289m5237J5441J37042J6583j33619J582O5769L7428M949J8806
22800A56773j4878p1721o2656L643l2125K4278N1078R627O0645q325p3588O1642
22788A04393O7808o6460n8835N2049O2166K2691k0491q5437l7840M0773M0903
22777A21720J2855M362p3804r7552m2084K0194J89560M9074j33566o0866K6338
22766A6231P4822J55385o3326m9556p1314j06454k8516J3990N1008M0767Q2231
22755A15268K2609L7383J7349p9444O201l6752L45m2888o2661O7107N1682P3554
$$ plain form
22743 169753 186096 76754 59779 117861 186490 169753 94799 104434 130981 127448 77850 3122
22731 3122 -61309 -3392 158911 175048 132661 12628 52478 180445 103606 11467 32610
22720 32610 33607 -86587 -43031 72016 44038 -76477 -110201 -117418 -46576 -12053 36790 5666
22708 5666 4810 10655 -26273 -91675 -24423 57602 181391 204308 157860 172441 176077 232992
22696 232992 287824 270202 288389 288300 230923 139749 122049 50354 -18177 -6022 130559 109985
22684 109985 52569 92167 20471 5574 69588 51570 14450 32746 5075 12798 -30091 14068
22672 14068 105985 115821 101904 18221 101140 179629 302668 262193 190339 175480 132369 113740
22660 113740 80896 -7556 -81523 -167159 -187741 -227228 -157198 -93858 -132525 -160113 -187185
$$ packed form
22743A69753J6343j09342j6975N8082O8629j6737p4954R635K6547l533m9598p4728
22731C122o4431N7917J62303J6137m2387j20033L9850J27967p6839r2139K1143
22720C2610R97j20194M3556J15047k7978j20515l3724p217P0842L4523M8843l1124
22708E666q56N845l6928o5402O7252Q2025J23789K2917m6448J4581L636N6915
22696B32992N4832j7622J8187q9n7377r1174j7700p1695o8531J2155J36581k0574
22684A09985n7416L9598p1696j4897O4014j8018l7120J8296k7671P723m2889M4159
22672A4068R1917R836j3917q3683Q2919P8489J23039m0475p1854j4859m3111j8629
22660A13740l2844q8452p3967q5636k0582l9487P0030O3340l8667k7588k7072
$$ plain form
22649 -187185 -250855 -182767 -128410 -98859 -140994 -105105 -50885 18718 30371 139468 186419
22638 186419 160799 118831 81457 88406 95825 198251 135299 113816 123010 160250 121545 105626
22626 105626 162129 163947 109961 94438 83901 45929 -36798 60969 137181 72128 -29377
22615 -29377 -31698 36388 -2237 -18900 9340 61883 197342 350520 349515 384269 385924 361629
22603 361629 330669 218456 154821 184603 271322 262135 189068 178803 111420 164500 139794
22592 139794 134851 140229 222204 226454 200813 164321 144824 123113 39675 82150 143202 125243
22580 125243 109136 98717 33493 21918 105504 181308 257424 278703 173678 62512 48433
22569 48433 57798 68111 57422 75745 88386 128486 73787 -21969 29688 82937 106476 196048
$$ packed form
22649a87185o3670O8088N4357K9551m2135L5889N4220O9603J1653J09097M6951
22638A86419k5620m1968l7374O949P419J02426o2952k1483R194L7240l8705j5919
22626A05626N6503J818n3986j5523j0537l7972q2727R7767P6212o5053j01505
22615b9377k321O8086l8625j6663K8240N2543J35459J53178j005L4754J655k4295
22603C61629l0960j12213o3635K9782Q6719r187p3067j0265o7383N3080k4706
22592A39794m943N378Q1975M250k5641l6492j9497k1711q3438M2475O1052j7959
22580A25243j6107j0419o5224j1575Q3586P5804P6116K1279j05025j11166j4079
22569D8433R365J0313j0689J8323J2641M0100n4699r5756N1657N3249K3539Q9572
$$ plain form
22557 196048 285244 260702 234380 385478 377136 368454 447328 385916 259034 82222 139333
22546 139333 249874 309875 344274 326265 321251 227561 104679 83825 124780 125359 109907 149534
22534 149534 103660 72565 105871 165300 200910 138580 82008 98211 73090 145051 158229
22523 158229 113616 122230 192592 226686 266640 164889 73088 150439 218246 195728 147047
22512 147047 188414 185074 195726 95027 40561 -56535 -25643 58232 108911 128969 119955 97093
22500 97093 87924 85826 80247 764 -38210 -121230 -96910 13 96292 187183 182126 273830
22488 273830 263369 304688 217122 132478 37825 -165249 -264240 -341419 -197000 -15282 179999
22477 179999 454087 622164 650438 628558 720151 658035 565889 498852 474989 530663 622685
$$ packed form
22557A96048Q9196k4542k6322J51098q342q682P8874o1412j26882j76812N7111
22546A39333J10541O0001L4399j8009n014r3690j22882k0854M0955N79j5452L9627
22534A49534m5874l1095L3306N9429L5610o2330n6572J6203k5121P1961J3178
22523A58229m4613Q614P0362L4094L9954j01751r1801P7351O7807k2518m8681
22512A47047M1367l340J0652j00699n4466r7096L0892Q3875N0679K0058r014k2862
22500I7093r169k098n579p9483l8974q3020K4320R6923R6279R0891n057R1704
22488B73830j0461M1319q7566q4644r4653k03074r8991p7179J44419J81718J95281
22477A79999K74088J68077K8274k1880R1593o2116r2146o7037k3863N5674R2022
$$ plain form
22466 622685 688242 742588 815934 950242 1270745 1661048 2151746 2589795 2816099 2813105
22456 2813105 2630711 2246849 1806076 1491960 1263669 1049571 837753 730217 788993 757341
22446 757341 690688 655578 664454 669181 610561 564441 572394 631599 665207 710991 710902 646627 672594
22433 672594 601023 532234 563235 529292 467691 380615 438899 433706 281058 346208 479642
22422 479642 441346 432937 483488 649475 781819 796334 814428 776171 848389 942221 837287
22411 837287 804897 896596 915792 852212 906512 1035465 1099104 1063011 1053213 1105891 1214184
22400 1214184 1245844 1237990 1255307 1417456 1500168 1545836 1580161 1568097 1621971 1739617 1863385
22389 1863385 2002908 2026934 2101794 2191418 2399525 2733137 3034588 3284340 3401512 3533633
$$ packed form
22466F22685O5557N4346P3346J34308L20503L90303M90698M38049K26304k994
22456B813105j82394l83862m40773l14116k28291k14098k11818j07536N8776l1652
22446G57341o6653l5110Q876M727n8620m6120P953N9205L3608M5784q9o4275K5967
22433F72594p1571o8789L1001l3943o1601q7076N8284n193j52648O5150J33434
22422D79642l8296q409N0551J65987J32344J4515J8094l8257P2218R3832j04934
22411H37287l2390R1699J9196o3580N4300J28953O3639l6093r798N2678J08293
22400A214184L1660p854J7317J62149Q2712M5668L4325j2064N3874J17646J23768
22389A863385J39523K4026P4860Q9624K08107L33612L01451K49752J17172J32121
$$ plain form
22379 3533633 3713891 3853393 3989883 4226663 4560329 4962894 5358905 5670796 6203242
22370 6203242 6915873 7762983 8955250 10457061 12256800 14199857 16734494 20170601
22362 20170601 24653365 30769269 39423954 52463004 72988396 106660057 163128409
22355 163128409 251806354 361253087 443239324 461785071 431247817 366338723 274973737
22348 274973737 188801765 129986839 93822896 71022561 55720281 44820225 36515333
22341 36515333 30007267 24604795 20112116 16552942 13847480 11721346 10084160 8886708
22333 8886708 7777161 6753365 5833526 5056906 4499259 4102412 3690424 3242425 2876406
22324 2876406 2506836 2134610 1895344 1791998 1746543 1690780 1629522 1653154 1603712 1459713
$$ packed form
22379C533633J80258J39502J36490K36780L33666M02565L96011L11891N32446
22370F203242P12631Q47110J192267J501811J799739J943057K534637L436107
22362B0170601M482764O115904Q654685J3039050K0525392L3671661N6468352
22355A63128409Q8677945J09446733Q1986237J8545747l0537254o4909094r1364986
22348B74973737q6171972n8814926l6163943k2800335j5302280j0900056q304892
22341C6515333o508066n402472m492679l559174k705462k126134j637186j197452
22333H886708j109547j023796r19839p76620n57647l96847m11988m47999l66019
22324B876406l69570l72226k39266j03346m5455n5763o1258K3632m9442j43999
$$ plain form
22314 1459713 1355259 1245712 1158659 1160342 1156084 1020476 859335 767838 653661 457534
22304 457534 402411 387572 424887 389067 333571 339304 384399 347345 425258 544790 585754
22293 585754 524795 515085 410274 346751 341630 220441 123079 223958 283131 141746 88551
22282 88551 162735 253741 284702 247211 228651 295558 291647 317073 288679 239753 81261 37700
22270 37700 -7484 41742 -30525 -131650 -105820 -177394 -68324 61004 183305 171808 213036
22259 213036 276097 189005 162928 133953 74750 88656 170261 193509 351627 554759 869228
22248 869228 1291064 1879355 2364034 2443401 2334017 1966489 1477478 972328 618426 518399
22238 518399 338227 254236 143190 73738 46736 52478 35829 -143707 -284636 -316405 -294424
$$ packed form
22314A459713j04454j09547q7053J683m258j35608j61141r1497j14177j96127
22304D57534n5123j4839L7315l5820n5496N733M5095l7054P7913J19532M0964
22293E85754o0959r710j04811o3523n121j21189r7362J00879N9173j41385n3195
22282H8551P4184R1006L0961l7491j8560O6907l911K5426k8394m8926j58492m3561
22270C7700m5184M9226p2267j01125K5830p1574J09070J29328J22301j1497M1228
22259B13036O3061q7092k6077k8975n9203J3906Q1605K3248J58118K03132L14469
22248H69228M21836N88291M84679P9367j09384l67528m89011n05150l53902j00027
22238E18399j80172q3991j11046o9452k7002N742j6649j79536j40929l1769K1981
$$ plain form
22227 -294424 -159844 -58778 175578 386759 448538 389032 354068 294560 173635 167139 305504
22216 305504 287155 182350 229858 218440 132447 76662 18683 13114 69366 32809 132808
22205 132808 181352 247051 191836 198058 212568 226380 331422 302356 261970 211672 182079
22194 182079 225015 163878 161162 239652 166926 49081 -32605 -25634 -7350 -34179 -22260 -85229
22182 -85229 -113943 -139862 -104943 3784 -33836 -123288 -134992 -152383 -136269 -160768 -173224
22171 -173224 -99792 -21625 40664 7332 45921 -5257 -30588 -37478 -43747 -123937 -141322 -145364
22159 -145364 -78341 -70869 9560 42281 37767 -3822 -60980 -52432 -56584 -40561 -106963 -134238
22147 -134238 -133430 -99132 -13854 82523 48648 -34363 43211 78360 -31883 -90603 -45370 -39899
$$ packed form
22227b94424J34580J01066K34356K11181O1779n9506l4964n9508j20925o496J38365
22216C05504j8349j04805M7508j1418q5993n5785n7979n569N6252l6557R9999
22205A32808M8544O5699n5215O222J4510J3812J05042k9066m0386n0298k9593
22194A82079M2936o1137k716P8490p2726j17845q1686O971J8284k6829J1919o2969
22182h5229k8714k5919L4919J08727l7620q9452j1704j7391J6114k4499j2456
22171a73224P3432P8167O2289l3332L8589n1178k5331o890o269q0190j7385m042
22159a45364O7023P472Q0429L2721m514m1589n7158Q548m152J6023o6402k7275
22147a34238Q08L4298Q5278R6377l3875q3011P7574L5149j10243n8720M5233N471
$$ plain form
22135 -39899 -3554 75130 10563 67086 137022 133430 152270 -25462 -65211 -14085 61900 32800
22123 32800 -36920 -14746 -151589 -258043 -194304 -135348 -125776 -77520 -16021 14806 -3045
22112 -3045 -8486 -34434 -2397 -42803 53939 62747 43620 -5269 35810 67252 41952 -18637
22100 -18637 -135446 -174172 -34837 -18485 -122685 -153492 -132730 -89361 -5584 28111 80395
22089 80395 105452 76846 -8091 -75332 -56247 -18619 53883 157584 111370 39171 -33458
22078 -33458 2460 52327 77762 73676 69997 50474 29787 -32057 -57794 25754 690 -15123
22066 -15123 20648 30978 46634 71422 72834 134871 231970 349031 354043 257913 267015 206983
22054 206983 91016 47906 94540 151072 256147 164174 180054 123420 7694 -586 -67295
$$ packed form
22135c9899L6345P8684o4567N6523O9936l592J8840j77732l9749N1126P5985k9100
22123C2800o9720K2174j36843j06454O3739N8956R572M8256O1499L0827j7851
22112c045n441k5948L2037m0406R6742Q808j9127m8889M1079L1442k5300o0589
22100a8637j16809l8726J39335J6352j04200l0807K0762M3369Q3777L3695N2284
22089H0395K5057k8606q4937o7241J9085L7628P2502J03701m6214p2199p2629
22078c3458L5918M9867K5435m086l679j9523k0687o1844k5737Q3548k5064j5813
22066a5123L5771J0330J5656K4788J412O2037R7099J17061N012r6130R102o0032
22054B06983j15967m3110M6634N6532J05075r1973J5880n6634j15726q280o6709
$$ plain form
22043 -67295 -199421 -218259 -246229 -193620 -124621 -99288 -72961 -54146 -70936 -180854 -204742
22032 -204742 -116263 -74382 -71945 -63647 -176432 -166260 -155416 -227006 -242926 -173158 -109577 -42899
22020 -42899 -42664 -132485 -209657 -166110 -117788 -185404 -264987 -253643 -112234 -80988 -89959 -1864
22008 -1864 -17326 -47062 -12805 -62732 -226226 -247609 -235105 -331559 -292848 -154171 -130264
21997 -130264 -171345 -148912 -109758 -116199 -80239 -22111 91056 76097 10826 -102730 -132941
21986 -132941 -273899 -367159 -384852 -286861 -157669 -83245 -132823 -158842 -124128 -68493 -10235
21975 -10235 -44238 -46442 -110768 -175040 -163994 -85472 -65913 -7178 82430 79744 80084 40241
21963 40241 38997 16932 31063 -64464 -91094 -85827 -36001 -6707 30974 69392 62504 -1339
$$ packed form
22043f7295j32126j8838k7970N2609O8999K5333K6327J8815j6790j09918k3888
22032b04742Q8479M1881K437Q298j12785J0172J0844p1590j5920O9768O3581O6678
22020d2899K35q9821p7172M3547M8322o7616p9583J1344J41409L1246q971Q8095
22008a864j5462k9736L4257m9927j63494k1383J2504r6454L8711J38677K3907
21997a30264m1081K2433L9154o441L5960N8128J13167j4959o5271j13556l0211
21986a32941j40958r3260j7693R7991J29192P4424m9578k6019L4714N5635N8258
21975a0235l4003k204o4326o4272J1046P8522J9559N8735Q9608k686L40l9843
21963D0241j244k2065J4131r5527k6630N267M9826K9294L7681L8418o888o3843
$$ plain form
21951 -1339 -20813 159178 200641 151583 -6569 -9692 27919 -76222 -101844 -33944 21013
21940 21013 65588 -39063 -78493 12921 52027 -19931 28937 -12765 6448 117079 98395
21929 98395 125837 124431 90742 71433 -47016 -37155 -58503 -80156 -30689 -27668 -70315 -16110
21917 -16110 53703 158251 171338 82427 95627 113981 129968 61490 -44602 -81759 -126430
21906 -126430 -154804 -77243 -38485 -11271 -28760 -52142 -101779 -105990 -124073 -97811 -91961 -121528
21894 -121528 -46431 38155 215448 255772 131763 23546 -29078 40521 105798 158700 124311
21883 124311 172134 66271 -138053 -183251 9121 99226 70019 -22445 -69194 -57811 -13758
21872 -13758 -11340 -131329 -150258 -104957 -41631 52178 115277 87407 -11261 -64729 -104036 -74597
$$ packed form
21951a339j9474J79991M1463m9058j58152l123L7611j04141k5622O7900N4957
21940B1013M4575j04651l9430R1414L9106p1958M8868m1702J9213J10631j8684
21929I8395K7442j406l3689j9309j18449R861k1348k1653M9467L021m2647N4205
21917a6110O9813J04548J3087q8911J3200J8354J5987o8478j06092l7157m4671
21906a26430k8374P7561L8758K7214j7489k3382m9637m211j8083K6262N850k9567
21894a21528P5097Q4586J77293M0324j24009j08217n2624O9599O5277N2902l4389
21883A24311M7823j05863k04324m5198J92372R0105k9207r2464m6749J1383M4053
21872a3758K418j19989j8929M5301O3326R3809O3099k7870r8668n3468l9307K9439
$$ plain form
21860 -74597 -26569 -10802 -21883 9070 86929 90828 44715 -32514 -76331 -87835 -68156 -89117
21848 -89117 -55490 -96963 -146917 -142500 -89674 -140417 -155534 -123879 -127248 -143158 -157430 -217190
21836 -217190 -142959 37103 111755 103872 86342 182845 136236 16528 -22948 76289 158107
21825 158107 137948 -45625 -70407 -18209 -110539 -183398 -218888 -262168 -218870 -60693 9839
21814 9839 -67132 -105935 -108726 35986 -40417 -123129 -187521 -171326 -102928 -92218 -206045 -170432
21802 -170432 -131537 -156400 -120537 -37071 -29711 11580 27172 -47405 -31133 -23579 -115335 -89594
21790 -89594 -31823 -33867 58433 134079 198247 260124 465968 816281 1396542 1996546 2266814
21779 2266814 2216216 1994723 1724071 1275303 893468 604058 378257 342374 312177 154908
$$ packed form
21860g4597M8028J5767j1081L0953P7859L899m6113p7229m3817j1504J9679k0961
21848h9117L3627m1473m9954M417N2826n0743j5117L1655l369j5910j4272n9760
21836b17190P4231J80062P4652p883j7530R6503m6609j19708l9476R9237Q1818
21825A58107k0159j83573k4782N2198r2330p2859l5490m3280M3298J58177P0532
21814I839p6971l8803k791J44712p6403q2712o4392J6195O8398J0710j13827L5613
21802a70432L8895k4863L5863Q3466P360M1291J5592p4577J6272P554r1756K5741
21790h9594N7771k044R2300P5646O4168O1877K05844L50313N80261O00004K70268
21779B266814n0598k21493k70652m48768l81835k89410k25801l5883l0197j57269
$$ plain form
21769 154908 135611 35813 76909 109941 110151 41704 -15600 33643 93301 21424 108322 63315
21757 63315 2374 -66578 -55973 -53196 47559 163042 194375 127177 44811 7543 -73567
21746 -73567 -81182 -73537 -63135 -51495 -92926 -142145 -115023 -32846 -1578 -122103 -178074 -102719
21734 -102719 -63926 -155349 -130204 -34421 -75206 -130391 -63547 -131050 -239875 -179100 -59868
21723 -59868 -103619 -110379 -148633 -127038 -33761 29129 97763 -27982 -136337 -73987 -90949
21712 -90949 -176674 -138086 -64620 -16065 -26478 25919 61 -6335 2262 -38261 -116556 -58014
21700 -58014 22710 -33953 -78565 4833 6740 -8332 -96016 -115325 -92504 -133014 -85208 -79465
21688 -79465 -71357 -33677 -36226 -52974 -78023 -177931 -161346 -101342 -94831 -21275 -16195 -50254
$$ packed form
21769A54908j9297r9798M1096L3032K10o8447n7304M9243N9658p1877Q6898m5007
21757F3315o0941o8952J0605K777J00755J15483L1333o7198q2366l7268q1110
21746g3567p615P645J0402J1640m1431m9219K7122Q2177L1268j20525n5971P5355
21734a02719L8793r1423K5145R5783m0785n5185O6844o7503j08825O0775J19232
21723e9868m3751o760l8254K1595R3277O2890O8634j25745j08355O2350j6962
21712i0949q5725L8588P3466M8555j0413N2397k5858o396Q597m0523p8295N8542
21700e8014Q0724n6663m4612Q3398J907j5072q7684j9309K2821m0510M7806N743
21688g9465Q108L7680k549j6748k5049r9908J6585O0004O511P3556N080l4059
$$ plain form
21676 -50254 -82367 -47441 -19698 -79744 -47919 -1912 -65894 -65797 -93211 -96200 -33646 -80698
21664 -80698 -191014 -139346 -155618 -186156 -166438 -186955 -169536 -59215 7455 -29653 -51928
21653 -51928 39321 29338 -20030 -12185 9187 136938 231039 185817 146730 95778 60951 97832
21641 97832 139685 134072 64123 -66873 -109858 -112458 -110710 -21925 -8468 -88307 -148883 -197459
21629 -197459 -190950 -49212 -60302 -150933 -155413 -176112 -96626 -64446 -97595 -119038 -218749 -259678
21617 -259678 -297780 -200019 -58999 -66122 -85177 -23988 -53815 -127363 -211250 -158747 -71424
21606 -71424 8888 -42718 -203479 -167643 -30246 -17983 -11534 76387 8146 22859 -15583
21595 -15583 -18346 37768 15488 9334 -69671 -156676 -103398 -118733 -242078 -275570 -108689 -58665
$$ packed form
21676e0254l2113L4926K7743o0046L1825M6007o3982R7k7414k989O2554m7052
21664h0698j10316N1668j6272l0538J9718k0517J7419J10321O6670l7108k2275
21653e1928R1249r983m9368P845K1372J27751R4101m5222l9087n0952l4827L6881
21641I7832M1853n613o9949j30996m2985k600J748Q8785J3457p9839o0576m8576
21629a97459O509J41738j1090r0631m480k0699P9486L2180l3149k1443r9711m0929
21617b59678l8102R7761J41020p123j9055O1189k9827p3548q3887N2503Q7323
21606g1424Q0312n1606j60761L5836J37397J2263O449Q7921o8241J4713l8442
21595a5583k763N6114k2280o154p9005q7005N3278j5335j23345l3492J66881N0024
$$ plain form
21583 -58665 -137208 -77779 15633 -73235 -61018 -15111 29468 27806 -7896 -60455 -88058 -46671
21571 -46671 -7342 62434 29624 -75658 -1791 91364 74753 14997 36735 87066 63425
21560 63425 -22959 -86442 -121857 -126396 -114316 -146554 -175295 -63707 32283 77427 27261 -55617
21548 -55617 -44409 -35055 -62929 -96347 -68125 -25041 -58726 -117906 -24240 -17363 17533 -13086
21536 -13086 -74278 -132987 -57944 -17588 35300 54254 71442 38613 -33961 -91836 -138286 -114242
21524 -114242 -46033 -10038 -48918 -136881 -9716 93779 61056 62662 50523 -1994 18691
21513 18691 125231 112613 97855 110728 41087 -51961 -142816 11755 43099 23667 48496
21502 48496 76713 114883 152475 276415 162688 88291 78354 99765 103262 -63302 -129998
$$ packed form
21583e8665p8543N9429R3412q8868J2217M5907M4579j662l5702n2559k7603M1387
21571d6671L9329O9776l2810j05282P3867R3155j6611n9756K1738N0331k3641
21560F3425q6384o3483l5415m539J2080l2238k8741J11588R5990M5144n0166q2878
21548e5617J1208R354k7874l3418K8222M3084l3685n9180R3666O877L4896l0619
21536a3086o1192n8709P5043M0356N2888J8954J7188l2829p2574n7875m6450K4044
21524a14242O8209L5995l8880q7963J27165J03495l2723J606j2139n2517K0685
21513A8691J06540j2618j4758J2873o9641r3048r0855J54571L1344j9432K4829
21502D8496K8217L8170L7592J23940j13727p4397r937K1411L497j66564o6696
$$ plain form
21491 -129998 -66221 65450 131043 58027 59277 23949 -20009 -38094 -91867 -606 97731
21480 97731 56991 -30149 -52804 -74001 41050 -12808 -52492 -47687 -44722 49714 72417 -35068
21468 -35068 -47563 -67250 -101036 25073 193267 167374 92115 -25246 -139443 -180579 -163183
21457 -163183 -59624 21151 -31303 -71435 -66602 -60712 -63623 -64273 -51017 -70060 -90096 -106174
21445 -106174 -59202 30709 15048 49336 -18570 -102708 -89240 -86996 -55220 24886 134255
21434 134255 62085 -77591 -161102 -196663 -94163 -45270 32875 -60115 -108884 -40049 44541
21423 44541 95870 24127 -2034 -40322 -70896 -140083 -45391 17922 1077 18252 56826 14878
21411 14878 -61581 -63965 -15191 -130916 -146382 -68387 -103836 -149117 -81662 -44297 -29871 -5212
$$ packed form
21491a29998O3777J31671O5593p3016J250l5328m3958j8085n3773R1261R8337
21480I7731m0740q7140k2655k1197J15051n3858l9684M805K965R4436K2703j07485
21468c5068j2495j9687l3786J26109J68194k5893p5259j17361j14197m1136J7396
21457a63183J03559Q0775n2454m0132M833N890k911o50J3256j9043k0036j6078
21445a06174M6972Q9911j5661L4288o7906q4138J3468K244L1776Q0106J09369
21434A34255p2170j39676q3511l5561J02500M8893P8145r2990m8769O8835Q4590
21423D4541N1329p1743k6161l8288l0574o9187R4692O3313j6845J7175L8574m1948
21411A4878p6459k384M8774j15725j5466P7995l5449m5281O7455L7365J4426K4659
$$ plain form
21399 -5212 -34954 -96422 -140720 -257371 -233386 -273354 -204858 -69808 -19771 -31910 -26021 59925
21387 59925 4633 -34183 -130998 -90674 -27382 -71612 -72656 -29801 -51274 -93746 -69327 -112503
21375 -112503 -96202 -17002 16573 70651 6578 -164917 -204166 -163684 -88392 -45644 -31128
21364 -31128 -48062 29234 -57360 -148618 -113030 -93607 2333 72242 24221 12178 -8685 -22906
21352 -22906 -19847 100232 67516 -30337 37833 59600 -44716 -120432 -88796 -61558 31910
21341 31910 63291 118086 127327 69551 5278 -122537 -78646 -17538 29221 65559 26885 96987
21329 96987 68085 -43197 -133401 -84936 -21219 -82171 -118286 -53432 -99833 -129749 -102441
21318 -102441 -73185 -25404 -52586 -44206 13641 45439 106967 60438 12864 45292 -10586 -78684
$$ packed form
21399e212k9742o1468m4298j16651K3985l9968O8496J35050N0037j2139N889Q5946
21387E9925n5292l8816r6815M0324O3292m4230j044M2855k1473m2472K4419m3176
21375a12503J6301P9200L3575N4078o4073j71495l9249M0482P5292M2748J4516
21364c1128j6934P7296q6594r1258L5588J9423R5940O9909m8021j2043k0863j4221
21352b2906L059J20079l2716r7853O8170K1767j04316p5716L1636K7238R3468
21341C1910L1381N4795R241n7776o4273j27815M3891O1108M6759L6338l8674P0102
21329I6987k8902j11282r0204M8465O3717o0952l6115O4854m6401k9916K7308
21318a02441K9256M7781k7182Q380N7847L1798O1528m6529m7574L2428n5878o8098
$$ plain form
21306 -78684 -55947 -109335 -156933 -86327 -3032 44229 -5300 -91086 -122258 -159040 -99835 3079
21294 3079 46372 91705 19706 -114497 -131445 -92989 -78251 -77652 -4220 50695 -1234 -74660
21282 -74660 -58111 -38765 -70223 -156924 -173255 -101175 -38530 -58169 4078 -64449 -168299
21271 -168299 -206655 -241045 -226664 -169547 -124013 -68283 -94307 -111576 -75718 14586 77704
21260 77704 72319 24695 -94611 -172388 -119927 -102577 -179194 -161749 -142606 -51948 -56207 -34704
21248 -34704 -19493 -47117 -23125 -3334 -58716 43611 32430 -35003 -54040 -61177 -1924 -78380
21236 -78380 -24183 15315 -12661 -12723 -57865 -33138 -29039 -65847 -35692 -50689 -44338 -75098 -95996
21223 -95996 -17568 -2236 25789 -3630 61905 -59922 -96958 -16481 -14496 -18539 3716 -37652
$$ packed form
21306g8684K2737n3388m7598P0606Q3295M7261m9529q5786l1172l6782N9205J02914
21294C079M3293M5333p1999j34203j6948L8456J4738N99P3432N4915n1929p3426
21282g4660J6549J9346l1458q6701j6331P2080O2645j9639O2247o8527j03850
21271a68299l8356l4390J4381N7117M5534N5730k6024j7269L5858R0304O3118
21260G7704n385m7624j19306p7777N2461J7350p6617J7445J9143R0658m259K1503
21248c4704J5211k7624K3992J9791n5382J02327j1181o7433j9037p137N9253p6456
21236g8380N4197L9498k7976o2m5142K4727M099l6808L0155j4997O351l0760k0898
21223i5996P8428J5332K8025k9419O5535j21827l7036Q0477J985m043K2255m1368
$$ plain form
21211 -37652 -272 108019 81021 42790 121590 81926 28305 32741 217738 196753 114627
21200 114627 122024 57225 -111015 -120060 -83161 -85643 -76446 -10815 -135088 -125293 -67523 -127485
21188 -127485 -39447 -96486 -220135 -260791 -214987 -24422 117167 115945 10692 -83016 -116945
21177 -116945 -110260 -5637 40473 48846 13110 4765 23683 1460 -47522 -99501 -25992 -26202
21165 -26202 -42454 -20983 91265 87436 87823 139720 64316 -3906 31157 86336 40812 21649
21153 21649 113211 66486 28672 87597 47085 -38512 -47759 31496 -2893 -37665 -49967 -116507
21141 -116507 -8172 84835 129596 83702 -25071 6083 58226 6924 -48540 -68615 -37196
21130 -37196 -22819 -54896 -28151 -13316 -49030 -24888 65554 96214 27999 61884 56326 -33162
$$ packed form
21211c7652L7380J08291k6998l8231P8800l9664n3621M436J84997k0985q2126
21200A14627P397o4799j68240r045L6899k482R197O5631j24273R795N7770n9962
21188a27485Q8038n7039j23649m0656M5804J90565J41589j222j05253r3708l3929
21177a16945O685J04623M6110Q373l5736q345J8918k2223m8982n1979P3509k10
21165b6202j6252K1471J12248l829L87N1897p5404o8222L5063N5179m5524j9163
21153B1649R1562m6725l7814N8925m0512q5597r247P9255l4389l4772j2302o6540
21141a16507J08335R3007M4761m5894j08773L1154N2143n1302n5464k0075L1419
21130c7196J4377l2077K6745J4835l5714K4142R0442L0660o8215L3885n558q9488
$$ plain form
21118 -33162 20205 42860 -26828 -145299 -184972 -107156 -81568 59807 136983 64149 45601
21107 45601 53215 38536 7062 24111 13656 -34003 -107938 -175936 -140267 -136375 -155400 -168751
21095 -168751 -233913 -164073 -108546 -127445 -166246 -168034 -121675 -73625 -44946 -48932 77998 75428
21083 75428 -69595 -39153 14089 4640 -14006 -5132 -33147 48599 79687 7507 -92597 -50319
21071 -50319 -87184 -95878 -102327 -29992 -13673 -67706 -83710 -38747 -92232 -128588 -100889 -93066
21059 -93066 -28818 -22560 -63872 -34787 69369 74123 13896 -30510 25482 88453 51490 62311
21047 62311 63665 75440 147053 133423 97892 79412 -49515 -98309 -84319 -54660 -46747 -231
21035 -231 19983 157310 193972 179510 141262 94149 102524 4997 -688 30504 37244 49433
$$ packed form
21118c3162N3367K2655o9688j18471l9673P7816K5588J41375P7176p2834j8548
21107D5601P614j4679l1474J7049j0455m7659p3935o7998L5669L892j9025j3351
21095a68751o5162O9840N5527j8899l8801j788M6359M8050K8679l986J26930k570
21083G5428j45023L0442N3242r449j8646Q874k8015Q1746L1088p2180j00104M2278
21071e0319l6865q694o449P2335J6319n4033j6004M4963n3485l6356K7699P823
21059i3066O4248O258m1312K9085J04156M754o0227m4406N5992O2971l6963J0821
21047F2311J354J1775P1613j3630l5531j8480j28927m8794J3990K9659P913M6516
21035b31K0214J37327L6662j4462l8248m7113Q375r7527n685L1192O740J2189
$$ plain form
21023 49433 24243 51165 208738 269414 238097 212974 259876 169271 89891 31070 -72182
21012 -72182 -14236 -54426 -96622 -74927 63091 165343 147349 177435 135285 104809 127827
21001 127827 44361 -31502 -82597 -87997 -69690 -77035 -59087 -18879 20554 53360 3512 69666
20989 69666 54965 18726 -5986 -16123 -107885 -95644 5262 46798 40956 30689 55517 156513
20977 156513 189133 166602 110217 18807 37929 208332 191983 147136 132880 81329 58147
20966 58147 -20035 1506 -29004 -85449 -11210 37140 18960 -38029 -74597 2039 110440
20955 110440 242323 300762 447436 525868 548999 747047 1041963 1343978 1383494 1311928
20945 1311928 1199128 1041766 1003021 992313 886744 790561 688528 541228 438873 428025
$$ packed form
21023D9433k5190K6922J57573O0676l1317k5123M6902r0605p9380n8821j03252
21012g2182N7946m0190m2196K1695J38018J02252j7994L0086m2150l0476K3018
21001A27827q3466p5863n1095n400J8307p345J7948M0208L9433L2806m9848O6154
20989F9666j4701l6239k4712j0137r1762J2241J00906M1536n842j0267K4828J00996
20977A56513L2620k2531n6385r1410J9122J70403j6349m4847j4256n1551k3182
20966E8147p8182K1541l0510n6445P4239M8350j8180n6989l6568P6636J08401
20955A10440J31883N8439J46674P8432K3131J98048K94916L02015L9516p1566
20945A311928j12800j57362l8745j0708j05569r6183j02033j47300j02355j0848
$$ plain form
20935 428025 342771 382469 452942 523781 475763 423435 379959 231548 201524 381298 529728
20924 529728 414553 402648 490103 517344 525768 554060 604517 734867 843409 861914 823791
20913 823791 919144 1067548 1155930 1318417 1481871 1464993 1397928 1274872 1019643 811098
20903 811098 601638 493612 379395 253490 252509 182185 184227 100104 126802 187794 179469
20892 179469 216628 137491 52140 14600 51785 74467 110044 109821 55681 6220 2581 -56027
20880 -56027 12795 51174 81651 99908 123742 120262 187720 133066 122685 122249 115340 71783
20868 71783 -67956 -69213 -48316 28979 -22210 -26955 30352 -37443 -110301 -110234 -135955 -82267
20856 -82267 -136190 -104976 -25244 59063 13401 -20433 -39308 -76224 -80151 -96596 -21883 -121201
$$ packed form
20935D28025q5254L9698P0473P0839m8018n2328m3476j48411l0024J79774J48430
20924E29728j15175j1905Q7455K7241Q424K8292N0457J30350J08542J8505l8123
20913H23791R5353J48404Q8382J62487J63454j6878o7065j23056k55229k08545
20903H11098k09460j08026j14217j25905r81p0324K042q4123K6698O0992q325
20892A79469L7159p9137q5351l7540L7185K2682L5577k23n4140m9461l639n8608
20880e6027O8822L8379L0477J8257K3834l480O7458n4654j0381m36o909m3557
20868G1783j39739j257K0897P7295n1189m745N7307o7795p2858O7k5721N3688
20856h2267n3923L1214P9732Q4307m5662l3834j8875l6916l927j6445P4713r9318
$$ plain form
20844 -121201 -28334 89228 42744 -6863 -31344 71815 177538 81160 -49369 -99359 -119790
20833 -119790 -151632 -57176 -64 48973 -49155 -52214 -23883 -11701 -41489 -134159 -181915 -165197
20821 -165197 -93998 -97084 -6000 27761 58828 84750 164447 152091 152738 148561 106830 98209
20809 98209 156409 96881 66036 120235 145232 114007 120682 186382 163421 145413 140139 159634
20797 159634 105758 26656 67414 97289 132752 293533 342392 141946 88690 14275 21771
20786 21771 -19835 -73241 -53504 48432 107526 -690 33241 106554 81739 29189 -51716
20775 -51716 5315 -70119 -113825 -51949 -39081 -16076 30782 -43400 -27302 32771 -16119 59099
20763 59099 148661 195930 170733 196742 236889 222480 175504 139065 109584 150315 152410 151021
$$ packed form
20844a21201R2867J17562m6484m9607k4481J03159J05723r6378j30529m9990k0431
20833a19790l1842R4456N7112M9037r8128l059K8331J2182k9788r2670m7756J6718
20821a65197P1199l086R1084L3761L1067K5922P9697j2356O47m177m1731q621
20809I8209N8200n9528l0845N4199K4997l1225O675O5700k2961j8008n274J9495
20797A59634n3876p9102M0758K9875L5463J60781M8859k00446n3256p4415P496
20786B1771m1606n3406J9737J01936N9094j08216L3931P3313k4815n2550q0905
20775e1716N7031p5434m3706O1876J2868K3005M6858p4182J6098O0073m8890P5218
20763E9099Q9562M7269k5197K6009M0147j4409m6976l6439k9481M0731K095j389
$$ plain form
20751 151021 239325 223966 115729 -33151 -85367 -150404 -169551 -167487 -86316 29976 11994
20740 11994 -42261 -99814 3 -11161 37585 156169 120018 81573 70443 -8950 -53294
20729 -53294 -30271 -62656 -18697 19179 89547 99928 -5839 22525 105285 167627 160685 83067
20717 83067 68458 49047 -9540 -21507 83910 135995 269774 362223 332094 265357 234605
20706 234605 181499 253189 257510 192932 53314 58009 49915 63711 112127 174699 254327 354578
20694 354578 397521 388809 310814 293161 230465 189885 72124 12837 107490 104582 19512 -41067
20682 -41067 52260 73052 -22610 43733 121858 21730 78318 117606 143431 241768 298075
20671 298075 232563 192030 243784 179351 170687 241026 187102 216808 254805 188322 175706 243073
$$ packed form
20751A51021Q8304j5359j08237j48880n2216o5037j9147K064Q1171J16292j7982
20740A1994n4255n7553R9817j1164M8746J18584l6151l8445j1130p9393m4344
20729e3294K3023l2385M3959L7876P0368J0381j05767K8364Q2760O2342o942p7618
20717H3067j4609j9411n8587j1967J05417N2085J33779R2449l0129o6737l0752
20706B34605n3106P1690M321o4578j39618M695q094J3796M8416O2572P9628J00251
20694C54578M2943q712p7995j7653o2696m0580j17761n9287R4653k908q5070o0579
20682d1067R3327K0792r5662O6343P8125j00128N6588L9288K5825R8337N6307
20671B98075o5512m0533N1754o4433q664P0339n3924K9706L7997o6483j2616O7367
$$ plain form
20659 243073 194695 78899 -60949 -110216 -133243 -191716 -127986 -87024 -42509 -82441 -101324
20648 -101324 -53973 -51102 -19597 21385 -43425 -96544 126166 205893 156178 105983 53621
20637 53621 121326 234095 183867 220981 323296 326114 239540 258060 284879 205116 117636
20626 117636 135653 219363 214913 168724 203194 146870 94322 93786 60926 21642 117109 131657
20614 131657 75017 -46501 -6028 125973 103827 180710 285346 298698 240643 197786 130149
20603 130149 146373 78491 70307 125282 194621 296689 221904 70982 66563 104765 130149
20592 130149 121943 144515 54668 76410 213345 250055 241788 302634 351415 347331 286664 247090
20580 247090 229639 273452 295585 185601 163144 239232 327460 388089 348177 381219 338935
$$ packed form
20659B43073m8378j15796j39848m9267k3027n8473O3730M0962M4515l9932j8883
20648a01324M7351K871L1505M0982o4810n3119K22710P9727m9715n0195n2362
20637E3621O7705J12769n0228L7114J02315K818q6574J8520K6819p9763q7480
20626A17636J8017Q3710m450m6189L4470n6324n2548n36l2860l9284R5467J4548
20614A31657n6640j21518M0473J32001k2146P6883J04636J3352n8055m2857o7637
20603A30149J6224o7882q184N4975O9339J02068p4785j50922m419L8202K5384
20592A30149q206K2572q9847K1742J36935L6710q267O0846M8781m084o0667l9574
20580B47090j7451M3813K2133j09984k2457P6088Q8228O0629l9912L3042m2284
$$ plain form
20569 338935 247833 194523 123289 102404 65930 -54854 -74557 8097 126941 122995 87168
20558 87168 59965 118443 130561 98790 150110 85763 157823 279196 328504 204500 172628
20547 172628 230511 309428 279588 265898 256275 280495 264850 302743 366796 395495 310513 254405
20535 254405 189583 191262 164901 164275 147395 203962 335054 207618 44510 -9978 102068
20524 102068 63309 -1802 53922 136378 275713 263644 322538 250250 146748 145529 52467
20513 52467 -81634 -87129 -26910 108291 119821 162333 292677 295634 393891 411395 480367
20502 480367 557505 420406 343333 293134 307091 408205 504538 535812 421603 382281 441874
20491 441874 424953 361181 427990 481440 396114 312453 377314 466053 577310 523687 488048
$$ packed form
20569C38935r1102n3310p1234k0885l6474j20784j9703Q2654J18844l946l5827
20558H7168k7203N8478J2118l1771N1320o4347P2060J21373M9308j24004l1872
20547A72628N7883P8917k9840j3690r623K4220j5645L7893O4053K8699q4982n6108
20535B54405o4822J679k6361o26j6880N6567J31092j27436j63108n4488J12046
20524A02068l8759o5111N5724Q2456J39335j2069N8894p2288j03502j219r3062
20513E2467j34101n495O0219J35201J1530M2512J30344K957R8257J7504O8972
20502D80367P7138j37099p7073n0199J3957J01114R6333L1274j14209l9322N9593
20491D41874j6921o3772O6809N3450q5326q3661O4861Q8739J11257n3623l5639
$$ plain form
20480 488048 591996 739492 923557 1219885 1447443 1446742 1285672 1259816 1177543 1042846
20470 1042846 1125142 1190114 1203225 1380038 1536003 1623267 1609238 1548664 1479286 1366044 1324133
20459 1324133 1343039 1301608 1207876 1182086 1209904 1188063 1075950 1048612 1147994 1288107 1464747
20448 1464747 1543601 1611981 1599186 1640649 1645462 1583820 1636415 1737364 1857038 2095558 2318611
20437 2318611 2463809 2491017 2435212 2354382 2252109 2239988 2216361 2186219 2174686 2216276 2193869
20426 2193869 2314934 2381646 2411238 2477063 2632702 2924680 3293248 3650098 4077314 4402994
20416 4402994 4600931 4749224 4870662 4908437 5031007 5514160 6081741 6470420 6829211 7268629
20406 7268629 7744464 8302136 8919911 9375641 9600057 9668687 9758911 10071097 10582715 11413754
$$ packed form
20480D88048J03948J47496J84065K96328K27558p01j61070k5856q2273j34697
20470A042846Q2296O4972J3111J76813J55965Q7264j4029o0574o9378j13242m1911
20459A324133J8906m1431r3732k5790K7818k1841j12113k7338R9382J40113J76640
20448A464747P8854O8380j2795M1463M813o1642N2595J00949J19674K38520K23053
20437B318611J45198K7208n5805q0830j02273j2121k3627l0142j1533M1590k2407
20426B193869J21065O6712K9592O5825J55639K91978L68568L56850M27216L25680
20416D402994J97937J48293J21438L7775J22570M83153N67581L88679L58791M39418
20406G268629M75835N57672O17775M55730K24416O8630R0224L12186N11618Q31039
$$ plain form
20396 11413754 12732487 14256169 16258758 18923365 22233241 26636262 32601603 41310095
20388 41310095 54083678 72886772 100387538 137292996 181603481 226914629 257227730
20381 257227730 260056660 242305320 212405153 175435801 144127444 126431369 122075676
20374 122075676 129699523 146691857 164538067 171421913 164689159 148517374 125054579
20367 125054579 99433425 78863063 64954819 56109150 50649690 47773140 47086212 48770647
20359 48770647 53472724 62255412 76957646 99194344 127737747 153520723 165901377
20352 165901377 165281326 155694310 139886717 125510848 120540204 128318543 151085165 189281242
20344 189281242 234427954 266305352 274739056 263227218 231920884 187705715 145311200
$$ packed form
20396A1413754J318733J523682K002589K664607L309876M403021N965341Q708492
20388D1310095J2773583J8803094K7500766L6905458M4310485M5311148L0313101
20381B57227730K828930j7751340k9900167l6969352l1308357j7696075m355693
20374A22075676P623847J6992334J7846210O883846o732754j6171785k3462795
20367A25054579k5621154k0570362j3908244q845669n459460k876550o86928J684435
20359D8770647M702077Q782688J4702234K2236698K8543403K5782976J2380654
20352A65901377o20051r587016j5807593j4375869m970644P778339K2766622L8196077
20344A89281242M5146712L1877398Q433704j1511838l1306334m4215169m2394515
$$ plain form
20337 145311200 110627376 84340935 65462158 52112016 42601823 35347623 29691456
20330 29691456 25110239 21396383 18442447 16113563 14359638 12917173 11933062 11261868
20322 11261868 10793448 10403751 9981510 9455987 8838237 8229671 7606687 7076889 6660935
20313 6660935 6219990 5839055 5526154 5270382 5085500 5016392 4922291 4728910 4443387 4048731
20303 4048731 3566632 3132663 2835651 2577952 2367432 2224017 2008989 1831641 1706954
20294 1706954 1698590 1574462 1418297 1286473 1210098 1211957 1256070 1183934 1154977 1090262 1122607
20283 1122607 1149535 1087455 1032156 981998 1005580 995554 905845 836803 733880 724029 750059
20272 750059 778931 747438 744908 692799 675176 699205 635193 587530 526006 432204 296359
$$ packed form
20337A45311200l4683824k6286441j8878777j3350142r510193p254200n656167
20330B9691456m581217l713856k953936k328884j753925j442465r84111o71194
20322A1261868m68420l89697m22241n25523o17750o08566o22984n29798m15954
20313F660935m40945l80935l12901k55772j84882o9108r4101j93381k85523l94656
20303D048731m82099m33969k97012k57699k10520j43415k15028j77348j24687
20294A706954q364j24128j56165j31824p6375J859M4113p2136k8957o4715L2345
20283A122607K6928o2080n5299n0158K3582j0026q9709o9042j02923r851K6030
20272G50059K8872l1493k530n2109j7623K4029o4012m7663o1524r3802j35845
$$ plain form
20261 296359 325902 352328 288511 214782 148982 171831 231161 295450 261447 396115 406996
20250 406996 390515 386385 402316 436787 445077 400435 331566 324723 463738 514645 506696 457571
20238 457571 481997 574228 533671 392957 373216 524491 431248 310492 271782 312694 380187
20227 380187 417212 460884 489952 428804 305632 248739 241002 235329 248676 282638 316498 420827
20215 420827 554291 571781 599036 667155 577970 518779 536353 537634 552053 642274 628234
20204 628234 564936 492995 383039 364005 322666 385560 439265 361058 344734 406598 396374
20193 396374 351380 334917 390466 463391 473024 242492 93950 74570 140249 253450 272760
20182 272760 186483 95720 59151 169141 195278 224566 271902 272937 313240 215371 99052
$$ packed form
20261B96359K9543K6426o3817p3729o5800K2849N9330O4289l4003J34668J0881
20250D06996j6481m130J5931L4471Q290m4642o8869o843J39015N0907p949m9125
20238D57571K4426R2231m0557j40714j9741J51275r3243j20756l8710M0912O7493
20227C80187L7025M3672K9068o1148j23172n6893p737n673J3347L3962L3860J04329
20215D20827J33464J7490K7255O8119q9185n9191J7574J281J4419R0221j4040
20204F28234o3298p1941j09956j9034m1339O2894N3705p8207j6324O1864j0224
20193C96374m4994j6463N5549P2925R633k30532j48542j9380O5679J13201J9310
20182B72760q6277r0763l6569J09990K6137K9288M7336J035M0303r7869j16319
$$ plain form
20171 99052 146418 188999 146709 113694 114789 60789 12439 -24203 -56929 -60063 -51628 57326
20159 57326 109726 22384 9314 70540 110921 -2371 3319 -30274 -89603 -29473 23079 17086
20147 17086 -20150 -22511 -31827 38901 116970 17801 -2136 -76121 -79594 12641 48788 19835
20135 19835 51499 81115 130672 14049 -36460 -24063 76451 99780 80944 50572 111142
20124 111142 123387 82393 87258 78488 -27195 -76585 3551 12159 90774 197351 77794
20113 77794 5056 96464 250913 209234 192607 146249 132939 97700 126190 90444 50955
20102 50955 92143 140433 207497 264506 214489 125671 59940 31503 83212 234485 194556
20091 194556 134062 180061 212845 157068 87072 131573 127279 143591 79642 74016 62960 82912
$$ packed form
20171I9052M7366M2581m2290l3015J095n4000m8350l6642l2726l134Q435J08954
20159E7326N2400q7342j3070O1226M0381j13292N690l3593n9329O0130N2552n993
20147A7086l7236k361r316P0728P8069r9169j9937p3985l473R2235L6147k8953
20135A9835L1664K9616M9557j16623n0509J2397J00514K3329j8836l0372O0570
20124A11142J2245m0994M865q770j05683m9390Q0136Q608P8615J06577j19557
20113G7794p2738R1408J54449m1679j6627m6358j3310l5239K8490l5746l9489
20102E0955M1188M8290O7064N7009n0017q8818o5731k8437N1709J51273l9929
20091A94556o0494M5999L2784n5777o9996M4501m294J6312o3949n626j1056J9952
$$ plain form
20079 82912 145199 125384 119803 88412 47368 97561 185488 137501 21393 37674 71705 53363
20067 53363 -26425 -112962 -72224 -3677 -19122 65623 50465 52041 58257 41135 61833 108723
20055 108723 109067 120805 97108 104951 56017 87354 46575 96781 133346 109942 137628 110026
20043 110026 107209 150873 172222 143811 121313 55607 43317 27320 -22869 -112534 -68871 5762
20031 5762 3995 -82222 -169985 -261367 -220027 -146101 -80102 36111 -3431 -22466 -105604 -147742
20019 -147742 -139024 -143526 -76724 -68667 -61004 -146497 -117488 -121029 -186713 -206142 -150295 -117028
20007 -117028 -112558 -70781 10519 8040 -25567 -4271 -34220 -72243 -47690 4570 -83936 -83667
19995 -83667 -146401 -131000 -150475 -143758 -69934 1237 69626 74297 80158 92629 109299 151316
$$ packed form
20079H2912O2287j9815n581l1391m1044N0193Q7927m7987j16108J6281L4031j8342
20067E3363p9788q6537M0738O8547j5445Q4745j5158J576O216j7122K0698M6890
20055A08723L44J1738k3697P843m8934L1337m0779N0206L6565k3404K7686k7602
20043A10026k817M3664K1349k8411k2498o5706j2290j5997n0189q9665M3663P4633
20031E762j767q6217q7763r1382M1340P3926O5999J16213l9542j9035q3138m2138
20019a47742Q718m502O6802Q057P663q5493K9009l541o5684j9429N5847L3267
20007a17028M470M1777Q1300k479l3607K1296k9949l8023K4553N2260q8506K69
19995h3667o2734J5401j9475O717P3824P1171O8389M671N861J2471J6670M2017
$$ plain form
19983 151316 145300 124911 135191 47100 46432 77928 -15550 -15005 -6794 -60825 -10653 -66099 -71329
19970 -71329 -103364 -152112 -201584 -195560 -192573 -171901 -92399 -73655 -47256 -23224 -66740 -164159
19958 -164159 -111897 6834 73602 17602 -19890 -9848 9224 38922 -14494 -18969 -32267
19947 -32267 -123790 12025 107373 121122 99943 57147 -36695 -39346 -49562 44936 72645 87693
19935 87693 61202 36245 53674 77902 48145 66935 17364 14105 51769 -37632 -61258 -37092
19923 -37092 114792 110903 31808 63174 -30392 -116884 -134355 -174829 -94477 -6598 51990 139022
19911 139022 95820 18086 -9210 76068 170100 126323 78386 105204 98529 35077 56107 44518
19899 44518 -105357 -193978 -130062 -114881 -121509 12514 47100 14865 300 -9865 59039
$$ packed form
19983A51316o016k0389J0280q8091o68L1496r3478N45Q211n4031N0172n5446n230
19970g1329l2035m8748m9472O024K987K0672P9502J8744K6399K4032m3516r7419
19958a64159N2262J18731O6768n6000l7492J0042J9072K9698n3416m475j3298
19947c2267r1523J35815R5348J3749k1179m2796r3842k651j0216R4498K7709J5048
19935H7693k6491k4957J7429K4228k9757J8790m9571l259L7664q9401k3626K4166
19923c7092J51884l889p9095L1366r3566q6492j7471m0474Q0352Q7879N8588Q7032
19911A39022m3202p7734k7296Q5278R4032m3777m7937K6818o675o3452K1030j1589
19899D4518j49875q8621O3916J5181o628J34023L4586l2235j4565j0165O8904
$$ plain form
19888 59039 9311 -87544 -68671 -69300 -68543 -41430 -113912 -88676 -61632 -45092 -93546 -99590 5608
19875 5608 -8452 -27882 -42501 -4191 -101129 -93190 -55828 -58237 -33094 -9036 -127631 -208191
19863 -208191 -208768 -186367 -207916 -274859 -185244 -60806 -101985 -111489 -110655 -52124 12335 -35409
19851 -35409 -4911 94683 59885 -7834 -26982 29888 105735 85742 -16085 -33240 15050
19840 15050 16390 -121878 -195205 -124073 -91994 -123798 -110398 -131486 -156267 -72438 -14092 55209
19828 55209 -46681 -137430 -135105 -38764 65414 123098 142338 140698 172964 136087 33025
19817 33025 7869 165904 328739 415246 414878 629351 877389 1056377 1188905 1333084 1367071
19806 1367071 1256224 952703 796594 768558 710674 632094 639762 702676 691347 570659 521315
$$ packed form
19888E9039m9728r6855J8873o29P57K7113p2482K5236K7044J6540m8454o044J05198
19875E608j4060j9430j4619L8310r6938P939L7362k409K5143K4058j18595q0560
19863b08191n77K2401k1549o6943Q9615J24438m1179r504Q34N8531O4459m7744
19851c5409L0498R9594l4798o7719j9148N6870P5847j9993j01827j7155M8290
19840A5050J340j38268p3327P1132L2079l1804J3400k1088k4781Q3829N8346O9301
19828E5209j01890r0749K325R6341J04178N7684J9240j640L2266l6877j03062
19817C3025k5156J58035J62835Q6507l68K14473K48038J78988J32528J44179L3987
19806A367071j10847l03521j56109k8036n7884p8580P668O2914j1329j20688m9344
$$ plain form
19795 521315 447033 488335 488547 524275 522780 570695 605161 682388 612797 554418 546042 404358
19783 404358 382520 488016 555525 570551 645198 737256 811780 805410 737276 787249 1005926
19772 1005926 1192649 1378425 1418500 1364962 1199014 978821 845349 650934 482251 387132
19762 387132 278389 193114 148405 108863 50749 81571 138779 166633 155372 127492 32004
19751 32004 39597 9572 -7179 50502 15202 55357 107470 72061 132884 109367 33106 -30344
19739 -30344 -73984 -51439 14343 88948 93080 40737 -40886 46475 106065 3258 -9303 -20175
19727 -20175 22625 92199 78197 6895 -79400 -130010 -125678 -170057 -76079 -25957 -42899 47787
19715 47787 40260 -148935 -207964 -208827 -129712 -16783 -35296 -145287 -185215 -137797 -81647 -25529
$$ packed form
19795E21315p4282M1302K12L5728j495M7915L4466P7227o9591n8379q376j41684
19783D04358k1838J05496O7509J5026P4647R2058P4524o370o8134M9973K18677
19772A005926J86723J85776M0075n3538j65948k20193j33472j94415j68683r5119
19762C87132j08743q5275m4709l9542n8114L0822N7208K7854j1261k7880r5488
19751C2004P593l0025j6751N7681l5300M0155N2113l5409O0823k3517p6261o3450
19739c0344m3640K2545O5782P4605M132n2343q1623Q7361N9590j02807j2561j0872
19727b0175M2800O9574j4002p1302q6295n0610M332m4379R3978N0122j6942R0686
19715D7787p527j89195n9029q63P9115J12929j8513j09991l9928M7418N6150N6118
$$ plain form
19703 -25529 -92339 -149825 -151971 9582 105771 26475 28841 1676 4639 17648 -85468 -99929
19691 -99929 -108492 -108053 -43881 -106688 -107526 -22736 25382 -5462 475 31336 92789 134912 63204
19678 63204 -16798 -64299 -14073 -117321 -141363 -113702 -133382 -155641 -103395 -122026 -112554 -206184
19666 -206184 -126445 -69973 41082 149585 83779 62643 57690 39053 -11063 -58922 -76195
19655 -76195 -127585 -142653 -69552 -88596 -137833 -50336 -84128 -66225 -20794 -16858 -15899 -10858
19643 -10858 -27940 -5634 153889 185954 191007 116006 130151 102636 -12292 -18120 56712 66768
19631 66768 31920 -11685 -6413 2428 35126 -28336 -103422 -178222 -232064 -114136 -63634 -80276
19619 -80276 -135812 -130099 -73297 -6393 -1115 12061 14626 -19659 -46921 -77808 -29456 78262
$$ packed form
19703b5529o6810n7486k146J61553R6189p9296K366k7165K963J3009j03116j4461
19691i9929q563M39O4172o2807q38Q4790M8118l0844N937L0861O1453M2123p1708
19678F3204q0002m7501N0226j03248k4042K7661j9680k2259N2246j8631R472r3630
19666b06184P9739N6472J11055J08503o5806k1136m953j8637n0116m7859j7273
19655g6195n1390j5068P3101j9044m9237Q7497l3792J7903M5431L936R59N041
19643a0858j7082K2306J59523L2065N053p5001J4145k7515j14928n828P4832J0056
19631F6768l4848m3605N272Q841L2698o3462p5086p4800n3842J17928N0502j6642
19619h0276n5536N713N6802O6904N278J3176K565l4285k7262l0887M8352J07718
$$ plain form
19607 78262 141229 164297 117132 37727 126207 94634 94646 169266 155112 92073 23902 31406
19595 31406 42440 71471 79627 -14698 -35013 -67200 -124408 -71149 -1774 78346 82364 -3561
19583 -3561 -34152 38161 33488 15721 -71017 -114596 -66356 -68278 -33249 -65194 -4376 71653
19571 71653 100760 199424 157458 131379 101717 130380 47154 72790 100608 134507 181464 203310
19559 203310 186683 227246 187198 51394 -56452 -82250 -124289 -127165 -22961 -162564 -221195
19548 -221195 -195345 -88762 -63170 -112538 -162215 -102434 -26337 -19106 79006 86400 50474 -27863
19536 -27863 -62825 -70809 -100526 -120092 -78165 -84858 -60629 12532 93313 108233 86666 20238
19524 20238 -14404 -111270 -136065 -114740 -42266 -52297 -65432 -31258 44734 117618 204234 131054
$$ packed form
19607G8262O2967K3068m7165p9405Q8480l1573J2P4620j4154o3039o8171P504
19595C1406J1034K9031Q156r4325k0315l2187n7208N3259O9375Q0120M018q5925
19583c561l0591P2313m673j7767q6738m3579M8240j922L5029l1945O0818P6029
19571G1653K9107R8664m1966k6079k9662K8663q3226K5636K7818L3899M6957K1846
19559B03310j6627M0563m0048j35804j07846k5798m2039k876J04204j39603n8631
19548b21195K5850J06583K5592m9368m9677N9781P6097P231R8112P394l5926p8337
19536b7863l4962p984k9717j9566M1927o693K4229P3161Q0781J4920k1567o6428
19524B0238l4642r6866k4795K1325P2474j0031j3135L4174P5992P2884Q6616p3180
$$ plain form
19512 131054 54952 76532 -104507 -120008 47305 97165 104661 -15386 -113041 -59446 -55603
19501 -55603 -77212 -108024 -20305 1360 43924 182739 294737 299829 471512 744386 966085
19490 966085 1079395 1043748 900230 703943 496308 357676 269249 245280 195690 152398
19480 152398 207876 175228 86509 -18112 54043 197903 201687 134510 140597 209295 250435
19469 250435 361431 685259 956923 1089119 1070623 1003460 986406 880736 671719 431098
19459 431098 261919 211032 166407 114024 72707 -39217 -5456 92492 68602 -17129 -15858
19448 -15858 -78313 -28852 33550 101683 103282 8814 -8144 -31735 -77643 14490 37908 -85221
19436 -85221 -193960 -204968 -174603 -112579 -36141 43593 114554 169612 192006 150267 116376
$$ packed form
19512A31054p6102K1580j81039j5501J67313M9860P496j20047r7655N3595L843
19501e5603k1609l0812Q7719K1665M2564J38815J11998N092J71683K72874K21699
19490I66085J13310l5647j43518j96287k07635j38632q8427k3969m9590m3292
19480A52398N5478l2648q8719j04621P2155J43860L784o7177O087O8698M1140
19469B50435J10996L23828K71664J32196j8496o7163j7054j05670k09017k40621
19459D31098j69179n0887m4625n2383m1317j11924L3761R7948k3890q5731J271
19448a5858o2455M9461O2402O8133J599r4468j6958k3591m5908R2133K3418j23129
19436h5221j08739j1008L0365O2024P6438P9734P0961N5058K2394m1739l3891
$$ plain form
19425 116376 29256 -53398 -63522 -52946 -64861 -16796 64637 118659 17382 -67242 -112598
19414 -112598 -124588 -103664 -176181 -199800 -206681 -59882 38700 -8036 -36188 54148 45798 28295
19402 28295 11009 16748 32713 9988 -47802 -14179 4712 -48047 -33072 -74056 -92550 -132780
19390 -132780 -184394 -159842 -127249 -101131 -173183 -227434 -185611 -132459 -229252 -126160 -59763
19379 -59763 -49418 -54199 -147249 -222739 -135733 -101254 31114 -33874 -121907 -84468 -35384 -24259
19367 -24259 -55432 -43469 -109383 -105378 -62158 -58289 -23172 -40666 -80181 -48047 -39796 -27575
19355 -27575 -60730 -37894 40463 130142 27809 -168089 -203258 -168452 -141356 -81654 -50400
19344 -50400 -134462 -106737 -54279 -96766 -86587 -96346 -51663 42472 101465 44280 -22164 -96883
$$ packed form
19425A16376q7120q2654j0124J0576j1915M8065Q1433N4022j01277q4624m5356
19414a12598j1990K0924p2517k3619o881J46799R8582m6736k8152R0336q350j7503
19402B8295j7286N739J5965k2725n7790L3623J8891n2759J4975m0984j8494m0230
19390a32780n1614K4552L2593K6118p2052n4251M1823N3152r6793J03092O6397
19379e9763J0345m781r3050p5490Q7006L4479J32368o4988q8033L7439M9084J1125
19367b4259l1173J1963o5914M005M3220L869L5117j7494l9515L2134Q251J2221
19355b7575l3155K2836P8357Q9679j02333j95898l5169L4806K7096N9702L1254
19344e0400q4062K7725N2458m2487J0179r759M4683R4135N8993n7185o6444p4719
$$ plain form
19332 -96883 673 -3847 -75094 -33490 3667 -69305 -164056 -144388 -77312 -64976 -3533 127057
19320 127057 167798 176580 80609 -80154 -165638 -130603 -113161 -81516 -35747 56527 -1025
19309 -1025 -47387 -99013 -72401 -134916 -122551 34013 -25780 -21740 -5443 7213 9049 -18604
19297 -18604 -51500 -153131 -198410 -97673 -123571 -93362 -53475 40581 61926 -54079 -93145
19286 -93145 4935 53786 48200 62475 38443 47204 86956 -16345 24008 71416 89216 156510
19274 156510 171825 74916 5413 50957 73491 70634 42329 80307 103741 65334 30938 -66155
19262 -66155 -202261 -279961 -279460 -296628 -170678 -117331 -67371 20334 30053 -63781 -28316 40295
19250 40295 37167 73712 114890 34748 -140090 -155901 -168747 -90642 -34121 -36231 10355 25146
$$ packed form
19332i6883R7556m520p1247M1604L7157p2972r4751J9668O7076J2336O1443J30590
19320A27057M0741Q782r5971j60763q5484L5035J7442L1645M5769R2274n7552
19309a025m6362n1626K6612o2515J2365J56564n9793M040J6297J2656J836k7653
19297a8604l2896j01631m5279J00737k5898L0209L9887R4056K1345j16005l9066
19286i3145R8080M8851n586J4275k4032Q761L9752j03301M0353M7408J7800O7294
19274A56510J5315r6909o9503M5544K2534k857k8305L7978K3434l8407l4396r7093
19262f6155j36106p7700N01j7168J25950N3347M9960Q7705R719r3834L5465O8611
19250D0295l128L6545M1178q0142j74838j5811j2846P8105N6521k110M6586J4791
$$ plain form
19238 25146 39326 -14359 -5113 -5771 -37140 -37932 22197 -21483 40215 21602 -18056 10120 1481
19225 1481 24606 -27169 -39222 -1242 52106 -63333 -83313 29547 45576 89544 64553
19214 64553 125425 136922 32855 74807 122782 34107 122274 133046 -37550 -193052 -138817
19203 -138817 -100172 30544 98830 44309 -30282 40674 99461 101320 41505 19862 18363 29981
19191 29981 4165 63143 255989 307935 272309 183279 195102 231475 159831 166807 117002 151912
19179 151912 146354 87669 8994 -14107 -10222 69256 21762 2719 46871 80203 154173 172062
19167 172062 153085 49753 81954 190487 91285 112356 238239 191821 219291 225857 237282
19156 237282 265498 373068 512611 550537 595158 762223 828919 826233 843273 815804 660184
$$ packed form
19238B5146J4180n3685R246o58l1369p92O0129m3680O1698j8613l9658K8176q639
19225A481K3125n1775j2053L7980N3348j15439j9980J12860J6029M3968k4991
19214F4553O0872J1497j04067M1952M7975q8675Q8167J0772j70596j55502N4235
19203a38817L8645J30716O8286n4521p4591P0956N8787J859n9815k1643j499J1618
19191B9981k5816N8978J92846N1946l5626q9030J1823L6373p1644O976m9805L4910
19179A51912n558n8685p8675k3101L885P9478m7494j9043M4152L3332P3970J7889
19167A72062j8977j03332L2201J08533r9202K1071J25883m6418K7470O566J1425
19156B37282K8216J07570J39543L7926M4621J67065O6696k686J7040k7469j55620
$$ plain form
19145 660184 513268 334967 286997 318965 431885 459368 366487 342186 317876 311486 333220
19134 333220 365852 352960 240227 215637 229294 418567 621129 815208 1172671 1503147
19124 1503147 1449256 1288196 1133689 1006526 744834 567816 448272 322873 200302 54981
19114 54981 -20707 20126 58294 64038 65613 108531 50476 36483 19433 34147 95327 121498
19102 121498 99563 78411 33885 -34237 -83520 -16083 108464 150877 194578 113727 43694
19091 43694 41558 -86047 -163834 -69873 31956 54532 174665 274977 393814 421623 365884
19080 365884 408594 382484 468087 620640 818339 917477 915003 919865 867593 851623 890857
19069 890857 879428 849498 785014 683288 675126 746221 788570 958937 1056639 1072079 1063933
$$ packed form
19145F60184j46916j78301m7970L1968J12920K7483r2881k4301k4310o390K1734
19134C33220L2632j2892j12733k4590J3657J89273K02562J94079L57463L30476
19124A503147n3891j61060j54507j27163k61692j77018j19544j25399j22571j45321
19114E4981p5688M0833L8168N744J575M2918n8055j3993j7050J4714O1180K6171
19102A21498k1935k1152m4526o8122m9283O7437J24547M2413M3701q0851p0033
19091D3694k136j27605p7787R3961J01829K2576J20133J00312J18837K7809n5739
19080C65884M2710k6110Q5603J52553J97699R9138k474M862n2272j5970L9234
19069H90857j1429k9930o4484j01726q162P1095M2349J70367R7702J5440q146
$$ plain form
19058 1063933 1215255 1276223 1263573 1167893 1048407 1005898 953150 948417 963529 901815 721316
19047 721316 628109 671486 756428 910060 1063839 1055613 1035658 1085746 1151725 1230325 1173026
19036 1173026 1161741 1045480 1017848 986377 984643 1164826 1157629 1107989 1175738 1179095 1219021
19025 1219021 1198061 1148388 1151568 1122708 1112991 989502 849346 728995 761517 772363 677580
19014 677580 675882 674600 685699 770049 779103 664818 660907 687274 662608 698247 706679 797517
19002 797517 957648 950940 919823 916741 981739 1079744 1228976 1434175 1708396 1974470 2206887
18991 2206887 2352494 2388031 2339313 2108636 2045323 2049346 2132411 2278894 2560433 2783717
18981 2783717 3103289 3471930 3832563 4273217 4773774 5247264 5864677 6640626 7642432
$$ packed form
19058A063933J51322O0968j2650r5680j19486m2509n2748m733J5112o1714j80499
19047G21316r3207M3377Q4942J53632J53779q226j9955N0088O5979P8600n7299
19036A173026j1285j16261k7632l1471j734J80183p197m9640O7749L357L9926
19025A219021k0960m9673L180k8860r717j23489j40156j20351L2522J0846r4783
19014F77580j698j282J1099Q4350R054j14285l911K6367k4666L5639Q432R0838
19002G97517J60131o708l1117l082O4998R8005J49232K05199K74221K66074K32417
18991B206887J45607L5537m8718k30677o3313M023Q3065J46483K81539K23284
18981B783717L19572L68641L60633M40654N00557M73490O17413P75949J001806
$$ plain form
18972 7642432 8818534 10087754 11436366 13194231 15307881 17993325 21722098 27652762
18964 27652762 37003165 52503820 78468710 118689711 167027033 201151439 207386899
18957 207386899 193753036 165041874 125158334 88820886 64380438 49378713 39950243
18950 39950243 33866217 30026184 27335144 25598819 24494733 23933457 24103346 24877550
18942 24877550 26650173 30297019 36526930 46651367 63581795 92007997 136507914
18935 136507914 191258708 231711896 240236571 224699433 192037400 145937681 102449051
18928 102449051 72591562 54099781 42290204 34335737 28667231 24295166 20695548
18921 20695548 17609149 14963560 12860402 11225305 10000469 9038550 8304343 7647228
$$ packed form
18972G642432J176102J269220J348612J757865K113650K685444L728773N930664
18964B7652762R350403J5500655K5964890M0221001M8337322L4124406O235460
18957B07386899j3633863k8711162l9883540l6337448k4440448j5001725r428470
18950C9950243o084026l840033k691040j736325j104086n61276J69889P74204
18942B4877550J772623L646846O229911J0124437J6930428K8426202M4499917
18935A36507914N4750794M0453188Q524675j5537138l2662033m6099719m3488630
18928A02449051k9857489j8491781j1809577p954467n668506m372065l599618
18921B0695548l086399k645589k103158j635097j224836r61919p34207o57115
$$ plain form
18913 7647228 6973289 6184462 5569700 4921459 4213790 3706561 3260960 3051784 2930331
18904 2930331 2761493 2743207 2953234 3183495 3223764 3105769 2799151 2472846 2109306 1778364
18894 1778364 1499582 1280261 1194974 1190668 1141193 986084 898545 901936 1029632 1072234 1019943
18883 1019943 922155 852804 829167 818313 926836 952730 903001 887886 897865 889924 754073
18872 754073 733674 810750 770435 694600 637125 582703 503242 449588 454263 419638 357177 360136
18860 360136 345052 370761 374470 376905 290050 206764 147378 140112 193705 220304 219364 245100
18848 245100 279324 319549 300285 276555 285624 240183 204892 172690 212966 291334 182190
18837 182190 92430 78978 85832 88933 177146 207853 229957 214899 151946 173393 335450 364831
$$ packed form
18913G647228o73939p88827o14762o48241p07669n07229m45601k09176j21453
18904B930331j68838j8286K10027K30261M0269j17995l06618l26305l63540l30942
18894A778364k78782k19321q5287m306m9475j55109q7539L391J27696M2602n2291
18883A019943r7788o9351k3637j0854J08523K5894m9729j5115R979p941j35851
18872G54073k0399P7076m0315p5835n7475n4422p9461n3654M675l4625o2461K959
18860C60136j5084K5709L709K435q6855q3286n9386p266N3593K6599r40K5736
18848B45100L4224M0225j9264k3730R069m5441l5291l2202M0276P8368j09144
18837A82190q9760j3452O854L101Q8213L0707K2104j5058o2953K1447J62057K9381
$$ plain form
18825 364831 408158 399002 319326 252295 250332 280607 265116 98660 89292 131567 190211 220302
18813 220302 303129 392848 372639 347111 375390 417805 489189 522983 506937 585381 639970
18802 639970 641306 613718 624652 535948 455284 325541 265379 213080 178058 261684 335600
18791 335600 399668 465898 435183 431899 435047 455053 381230 326650 457898 509926 618622
18780 618622 652437 526595 378424 505338 561017 486043 397296 468012 574159 784969
18770 784969 933333 1156006 1345146 1265891 1071233 1022873 806495 621309 549559 553824
18760 553824 504937 404537 330390 181163 300594 402062 381237 295905 264060 165903 39477
18749 39477 4375 17020 -13533 -49748 40446 122059 202186 68622 54951 124496 215978
$$ packed form
18825C64831M3327r156p9676o7031j963L0275j5491j66456r368M2275N8644L0091
18813B20302Q2827Q9719k0209k5528K8279M2415P1384L3794j6046P8444N4589
18802F39970J336k7588J0934q8704q0664j29743o0162n2299l5022Q3626P3916
18791C35600O4068O6230l0715l284L148K0006p3823n4580J31248N2028J08696
18780F18622L3815j25842j48171J26914N5679p4974q8747P0716J06147K10810
18770G84969J48364K22673J89140p9255j94658m8360k16378j85186p1750M265
18760E53824m8887j00400p4147j49227J19431J01468k0825q5332l1845r8157j26426
18749C9477l5102J2645l0553l6215R0194Q1613Q0127j33564j3671O9545R1482
$$ plain form
18738 215978 264279 248346 335004 314669 340991 369146 457432 483318 447249 375985 293967
18727 293967 272719 272548 286071 335373 353404 245646 232903 292698 331130 351020 426814 563349
18715 563349 667218 649250 564479 504711 520409 587301 635268 625536 602379 650633 603573
18704 603573 541469 622338 662965 507422 488416 617291 678408 612801 610206 595988 561804
18693 561804 567433 549049 623745 628913 620826 597272 520729 469471 483009 648625 846040 878472
18681 878472 946142 1068812 1061341 918417 726248 662912 580222 611507 652798 767982 779866
18670 779866 861257 968318 991313 1104669 1158123 1175401 1133687 1075028 1127720 1209188 1252640
18659 1252640 1228441 1137209 1197767 1308250 1465442 1600322 1769629 1857554 1901398 1956863
$$ packed form
18738B15978M8301j5933Q6658k0335K6322K8155Q8286K5886l6069p1264q2018
18727B93967k1248j71J3523M9302J8031j07758j2743N9795L8432J9890P5794J36535
18715E63349J03869j7968q4771n9768J5698O6892M7967r732k3157M8254m7060
18704F03573o2104Q0869M0627j55543j9006J28875O1117o5607k595j4218l4184
18693E61804N629j8384P4696N168q087k3554p6543n1258J3538J65616J97415L2432
18681H78472O7670J22670p471j42924j92169o3336q2690L1285M1291J15184J1884
18670G79866Q1391J07061K2995J13356N3454J7278m1714n8659N2692Q1468M3452
18659A252640k4199r1232O0558J10483J57192J34880J69307Q7925M3844N5465
$$ plain form
18649 1956863 2202895 2580273 3042600 3371384 3560601 3654622 3747810 3808774 3801731 3890134
18639 3890134 4133529 4340315 4623191 5105239 5766998 6391553 7015954 7792981 8627534
18630 8627534 9409754 10322223 11523441 13154993 15279274 18266319 22380401 28336733
18622 28336733 37497140 51799571 75116172 112962001 165897701 217302988 240998838
18615 240998838 235081518 210928545 170263513 123759586 88408737 66224328 52419527
18608 52419527 43254508 36917848 32362049 28994768 26550372 24929828 24144259 24282701
18600 24282701 25422611 27765294 31869833 38735708 50097867 68909206 100050581 144897443
18592 144897443 189865619 211707244 207443427 187077469 152131241 111161985 79256046
$$ packed form
18649A956863K46032L77378M62327L28784J89217R4021R3188O0964p043Q8403
18639C890134K43395K06786K82876M82048O61759O24555O24401P77027Q34553
18630H627534P82220R12469J201218J631552K124281K987045M114082N956332
18622B8336733R160407J4302431K3316601L7845829N2935700N1405287K3695850
18615B40998838n917320k4152973m0665032m6503927l5350849k2184409j3804801
18608E2419527r165019o336660m555799l367281k444396j620544p85569J38442
18600B4282701J139910K342683M104539O865875J1362159J8811339L1141375M4846862
18592A44897443M4968176K1841625m263817k0365958l4946228m0969256l1905939
$$ plain form
18585 79256046 58963399 46125652 37620625 31594441 27375592 24227290 21701813 19911205
18577 19911205 18624784 17673088 17272720 17408400 17730372 18295232 19039152 20049394 21492058
18568 21492058 23657556 26923207 31749696 39061468 50274448 67447939 93674161 131353317
18560 131353317 179755662 234432885 279756566 292342089 275659018 244469002 201249069
18553 201249069 158421321 131327686 121304143 126415238 145335933 170598018 185653228
18546 185653228 182595577 168032443 144139393 113718666 87496726 69823173 58496537
18539 58496537 51336152 47097878 45529607 46485580 50202704 57494436 70098443 90810038
18531 90810038 120982601 153104585 171620438 172872234 163648582 145809661 124861332
$$ packed form
18585G9256046k0292647j2837747q505027o026184m218849l148302k525477j790608
18577A9911205j286421r51696m00368J35680L21972N64860P43920J010242J442664
18568B1492058K165498L265651M826489P311772J1212980J7173491K6226222L7679156
18560A31353317M8402345N4677223M5323681J2585523j6683071l1190016m3219933
18553B01249069m2827748k7093635j0023543N111095J8920695K5262085J5055210
18546A85653228l057651j4563134k3893050l0420727k6221940j7673553j1326636
18539E8496537p160385m238274j568271R55973L717124P291732J2604007K0711595
18531I0810038L0172563L2121984J8515853J251796r223652j7838921k0948329
$$ plain form
18524 124861332 112612881 114096079 131382686 167207525 217986337 262082439 279925162
18517 279925162 275973492 250922581 205372937 157693170 118596176 88689991 67705190
18510 67705190 53432902 43499030 36293999 30758704 26327276 22807035 19862777 17431434
18502 17431434 15425251 13707593 12154773 10864590 9750079 8768182 7951743 7240252
18494 7240252 6629854 6046020 5456194 5037627 4633243 4318541 4057197 3902499 3689921
18485 3689921 3504374 3378842 3305532 3079666 2928091 2884164 2803807 2743373 2743083 2600148 2450455
18474 2450455 2246074 2092701 1987829 1811749 1800255 1793928 1744397 1695493 1608268 1602012 1580291
18463 1580291 1715075 1815951 1819021 1801197 1741185 1651161 1625756 1594651 1538280 1448112 1391938
$$ packed form
18524A24861332j2248451J483198J7286607L5824839N0778812M4096102J7842723
18517B79925162l951670k5050911m5549644m7679767l9096994k9906185k0984801
18510F7705190j4272288r933872p205031n535295m431428l520241k944258k431343
18502A7431434k006183j717658j552820j290183j114511r81897q16439p11491
18494G240252o10398n83834n89826m18567m04384l14702k61344j54698k12578
18485C689921j85547j25532p3310k25866j51575m3927q0357o0434k90j42935j49693
18474B450455k04381j53373j04872j76080j1494o327m9531m8904q7225o256k1721
18463A580291J34784J00876L070j7824o0012r0024k5405l1105n6371r0168n6174
$$ plain form
18452 1391938 1343492 1359866 1423750 1396856 1302610 1284280 1224448 1189824 1097566 1073488 1080031
18441 1080031 1094507 977096 994574 977724 925710 962988 962331 880125 745134 805711 955108
18430 955108 1037331 1022781 1102052 1282465 1293597 1214066 1034870 1029998 1310773 1647118 1942805
18419 1942805 2193095 2430094 2323309 2166216 2028508 1781418 1565810 1389038 1307085 1145335
18409 1145335 992925 950073 850065 907303 874604 886938 1029933 992941 947307 938439 850008
18398 850008 887486 880430 1055941 1271251 1344210 1383819 1470456 1530631 1376347 1141114 1086672
18387 1086672 989664 775333 872382 959530 1032458 1046343 1001362 861939 752750 812238 885594
18376 885594 918526 851968 772521 805654 880073 871206 882346 804911 811121 829368 744508 775776
$$ packed form
18452A391938m8446J6374O3884k6894r4246j8330n9832l4624r2258k4078O543
18441A080031J4476j17411J7478j6850n2014L7278o57q2206j34991O0577J49397
18430I55108Q2223j4550P9271J80413J1132p9531j79196m872K80775L36345K95687
18419A942805K50290K36999j06785j57093j37708k47090k15608j76772q1953j61750
18409A145335j52410m2852j00008N7238l2699J2334J42995l6992m5634q868q8431
18398H50008L7478p056J75511K15310P2959L9609Q6637O0175j54284k35233n4442
18387A086672r7008k14331R7049Q7148P2928J3885m4981j39423j09189N9488P3356
18376H85594L2932o6558p9447L3133P4419q867J1140p7435O210J8247q4860L1268
$$ plain form
18364 775776 778852 708539 625961 595448 491108 510873 479598 482071 365839 255684 246226
18353 246226 275270 190010 171622 281672 358396 343742 320933 286856 273915 222383 237010
18342 237010 338840 339939 358739 403939 367112 354197 416083 472162 459822 424452 361344
18331 361344 253168 348022 459795 352611 175100 204294 331267 334068 304662 383442 417559
18320 417559 395991 286015 178168 282229 348228 276134 356266 391059 347937 164685 163788
18309 163788 179089 273507 366927 400124 467369 469077 493062 524379 539300 532326 517635 501145
18297 501145 517110 508436 459658 422814 455215 449602 472307 351333 280019 348608 330539 319506
18285 319506 327771 319209 306254 237049 232082 162253 205377 217908 240358 197084 255091 248424
$$ packed form
18364G75776L076p0313q2578l0513j04340J9765l1275K473j16232j10155r458
18353B46226K9044q5260j8388J10050P6724j4654k2809l4077j2941n1532J4627
18342B37010J01830J099J8800M5200l6827j2915O1886N6079j2340l5370o3108
18331C61344j08176R4854J11773j07184j77511K9194J26973K801k9406P8780L4117
18320D17559k1568j09976j07847J04061O5999p2094Q0132L4793m3122j83252q97
18309A63788J5301R4418R3420L3197O7245J708K3985L1317J4921o974j4691j6490
18297E01145J5965q674m8778l6844L2401n613K2705j20974p1314O8589j8069j1033
18285C19506Q265q562j2955o9205m967o9829M3124J2531K2450m3274N8007o667
$$ plain form
18273 248424 295755 259687 248883 292568 230938 149607 194427 241613 184556 156404 197868
18262 197868 167792 159510 95868 131465 188709 353453 445882 455254 376876 256445 243642
18251 243642 264121 278954 325331 260411 235870 185823 233137 173503 93058 159210 129626
18240 129626 37641 -53577 -55862 38677 123145 201805 154162 200901 280638 356538 417692 474728
18228 474728 502830 481961 480847 409881 336070 346847 435694 529972 615658 672561 741340 816684
18216 816684 874594 984547 1109534 1168385 1209679 1171972 1111298 1033319 1055694 1112068 1073986
18205 1073986 971576 884037 803919 768196 767697 672995 643571 645349 725608 806168 684085
18194 684085 571469 562844 486800 422595 396854 401284 399645 363828 332623 271371 359999 415506
$$ packed form
18273B48424M7331l6068j0804M3685o1630q1331M4820M7186n7057k8152M1464
18262A97868l0076q282o3642L5597N7244J64744R2429R372p8378j20431j2803
18251B43642K0479J4833M6377o4920k4541n0047M7314n9634q0445O6152k9584
18240A29626r1985r1218k285R4539Q4468P8660m7643M6739P9737P5900O1154N7036
18228D74728K8102k0869j114p0966p3811J0777Q8847R4278Q5686N6903O8779P5344
18216H16684N7910J09953J24987N8851M1294l7707o0674p7979K2375N6374l8082
18205A073986j02410q7539q0118l5723m99r4702k9424J778Q0259Q0560j22083
18194F84085j12616q625p6044o4205k5741M430j639l5817l1205o1252Q8628N5507
$$ plain form
18182 415506 456247 542533 527784 456143 460598 424727 472799 480574 295980 195321 214898
18171 214898 252402 259620 333895 366267 388285 403227 423893 400888 324169 271410 295247 341231
18159 341231 366286 448891 488017 538824 537999 513317 504064 464231 457989 482289 582931 589121
18147 589121 632321 594081 510108 574888 677690 678533 584474 507671 576483 650632 739020 864945
18135 864945 936568 992259 1038204 1121432 1349217 1415198 1425467 1495878 1610686 1926146 2243466
18124 2243466 2627091 3172753 3699971 4348164 5166313 6377905 8047748 10265026 13709634
18115 13709634 19056614 27679555 42744898 68395618 104823128 134146412 138783519
18108 138783519 129642401 112321774 82740693 55185098 38139993 28003663 21515151
$$ packed form
18182D15506M0741Q6286j4749p1641M455l5871M8072P775j84594j00659J9577
18171B14898L7504P218P4275L2372K2018J4942K0666k3005p6719n2759K3837M5984
18159C41231K5055Q2605L9126N0807q25k4682r253l9833o242K4300J00642O190
18147E89121M3200l8240q3973O4780J02802Q43r4059p6803O8812P4149Q8388J25925
18135H64945P1623N5691M5945Q3228K27785O5981J0269P0411J14808L15460L17320
18124B243466L83625N45662N27218O48193Q18149J211592J669843K217278L444608
18115A3709634N346980Q622941J5065343K5650720L6427510K9323284M637107
18108A38783519r141118j7320627k9581081k7555595j7045105j0136330o488512
$$ plain form
18101 21515151 17143491 13901156 11485657 9543847 7919178 6539516 5450518 4681671
18093 4681671 3974365 3477069 3018171 2599585 2300406 2035902 1829315 1710918 1683364 1601442
18083 1601442 1546753 1593492 1665464 1690258 1801528 1962256 2069904 1956589 1846462 1544437
18073 1544437 1333836 1138604 1008701 949531 913148 761135 724696 722406 649411 645056 681386
18062 681386 570749 539048 603104 667422 666099 761930 920060 1159789 1408264 1504033 1567560
18051 1567560 1547016 1454893 1335164 1280320 1298861 1234866 1204551 1216483 1315361 1306436 1244251
18040 1244251 1102473 1036511 1023102 938582 885341 903749 1052215 1125797 1089238 1122322 1019031
18029 1019031 1009866 1044774 1005149 875095 672687 620132 612465 550734 498096 481862 505158
$$ packed form
18101B1515151m371660l242335k415499j941810j624669j379662j088998p68847
18093D681671p07306m97296m58898m18586k99179k64504k06587j18397k7554q1922
18083A601442n4689M6739P1972K4794J11270J60728J07648j13315j10127l02025
18073A544437k10601j95232j29903n9170l6383j52013l6439k290p2995m355L6330
18062F81386j10637l1701O4056O4318j323R5831J58130K39729K48475R5769O3527
18051A567560k0544r2123j19729n4844J8541o3995l0315J1932R8878q925o2185
18040A244251j41778o5962j3409q4520n3241J8408J48466P3582l6559L3084j03291
18029A019031r165L4908l9625j30054k02408n2555p667o1731n2638j6234K3296
$$ plain form
18018 505158 551670 633365 633533 693113 873452 975094 994567 967750 961491 987362 995060 984574
18006 984574 1017718 1061042 978117 868330 807515 797657 702763 672338 715175 753350 856880
17995 856880 874506 822044 774976 726025 551294 437275 369417 217788 164577 146494 163728
17984 163728 253356 293960 209506 133415 150744 184890 174690 57545 58883 163217 218074
17973 218074 197697 131236 94360 75070 157432 201696 146498 85594 30168 -66221 -98242
17962 -98242 -40815 -29848 15039 107448 200955 231654 170783 237609 279704 198850 137588 126249
17950 126249 125332 19797 -47587 27252 90809 26993 1028 -12352 102883 134149 82341
17939 82341 68054 48057 106194 113607 -6646 -55286 -19841 -61510 41644 105568 143090
$$ packed form
18018E05158M6512Q1695J68N9580J80339J01642J9473k6817o259K5871P698j0486
18006I84574L3144M3324q2925j09787o0815r858r4894l0425M2837L8175J03530
17995H56880J7626n2462m7068m8951j74731j14019o7858j51629n3211j8083J7234
17984A63728Q9628M0604q4454p6091J7329L4146j0200j17145J338J04334N4857
17973B18074k0377o6461l6876j9290Q2362M4264n5198o0904n5426r6389l2021
17962i8242N7427J0967M4887R2409R3507L0699o0871O6826M2095q0854o1262j1339
17950A26249r17j05535o7384P4839O3557o3816k5965j3380J15235L1266n1808
17939H2341j4287j9997N8137P413j20253m8640L5445m1669J03154O3924L7522
$$ plain form
17928 143090 176656 96324 39580 -55474 -11147 126887 104246 79246 73893 170368 143845
17917 143845 133083 127000 179376 131604 491 -87428 34854 22002 6561 -98776 -73300
17906 -73300 -38588 -32219 -35475 -85077 -14949 10395 81416 142121 62878 52813 165322 115795
17894 115795 24080 -71925 -36908 -46287 -66680 58100 90527 84700 50818 11662 -17390 -32013
17882 -32013 -25887 54996 118326 79287 32417 75527 54752 20450 20818 52368 100955 176580
17870 176580 83316 112969 137912 148742 72980 -24348 21590 36476 50019 35549 -12945
17859 -12945 -1882 82926 174503 122600 50677 100991 154414 208385 171301 123848 -32800
17848 -32800 23705 80143 4235 6193 13725 -41451 -21530 10168 75720 -20858 -76506 -148917
$$ packed form
17928A43090L3566q0332n6744r5054M4327J38034k2641k5000n353R6475k6523
17917A43845j0762o083N2376m7772j31113q7919J22282j2852j5441j05337K5476
17906g3300L4712O369l256m9602P0128K5344P1021O0705p9243j0065J12509m9527
17894A15795r1715r6005L5017r379k0393J24780L2427n827l3882l9156k9052j4623
17882c2013O126Q0883O3330l9039m6870M3110k0775l4302L68L1550M8587P5625
17870A76580r3264K9653K4943J0830p5762r7328M5938J4886J3543j4470m8494
17859a2945J1063Q4808R1577n1903p1923N0314N3423N3971l7084m7453j56648
17848c2800N6505N6438p5908J958P532n5176J9921L1698O5552r6578n5648p2411
$$ plain form
17836 -148917 -248770 -100109 67357 46192 13813 63948 21005 -172398 -240848 -158605 -97559
17825 -97559 32438 106885 50464 -6127 -51132 -31954 32436 73230 83138 50097 94797 89048
17813 89048 148772 167513 194484 199793 152196 123814 85432 69086 61949 56246 14333 -21752
17801 -21752 75677 110050 53181 -1898 77029 113938 97772 144581 184201 210839 88274
17790 88274 22694 116254 95783 -7467 24016 203421 257527 152575 -29582 -41938 37294
17779 37294 -41472 -58102 19637 116135 140420 199064 190955 112824 83058 113376 104655 -49341
17767 -49341 -158159 -141188 -150073 -99977 31949 14959 -127610 -192067 -178291 -124273 -46809
17756 -46809 23931 21296 -42364 -26800 -18147 22961 26815 2065 -42205 -49800 -35757 -7036
$$ packed form
17836a48917r9853J48661J67466k1165l2379N0135m2943j93403o8450Q2243O1046
17825i7559J29997P4447n6421n6591m5005J9178O4390M0794R908l3041M4700n749
17813H9048N9724J8741K6971N309m7597k8382l8382j6346p137n703m1913l6085
17801b1752R7429L4373n6869n5079P8927L6909j6166M6809L9620K6638j22565
17790H8274o5580R3560k0471j03250L1483J79405N4106j04952j82157j2356P9232
17779C7294p8766j6630P7739R6498K4285N8644q109p8131k9766L0318q721j53996
17767d9341j08818J6971q885N0096J31926j6990j42569o4457J3776N4018P7464
17756d6809P0740k635o3660J5564Q653M1108L854k4750m4270p595J4043K8721
$$ plain form
17744 -7036 3063 -4538 -37240 -48605 24025 81560 77645 63011 88487 136836 163437 190166
17732 190166 175778 76981 54457 -8527 -143438 -86333 11322 65426 -8201 -109000 -73847
17721 -73847 -82337 -5844 44461 23218 97070 110875 5002 -9206 97955 187271 215777
17710 215777 166368 92209 83446 128755 94563 72032 22295 -13646 75204 118279 72232 36992
17698 36992 48588 29242 39781 -25868 9284 137950 162921 204194 145805 160211 97299
17687 97299 16275 22334 -9694 -41725 -87827 -142585 -149317 -190893 -120044 -12922 181247 158315
17675 158315 55835 13473 119803 109825 -50632 -41045 40934 -214 3708 68813 -21976
17664 -21976 -21691 -1009 41670 -22711 -58890 -190897 -103986 90777 200696 186810 132516
$$ packed form
17744g036J0099p601l2702j1365P2630N7535l915j4634K5476M8349K6601K6729
17732A90166j4388r8797k2524o2984j34911N7105R7655N4104p3627j00799L5153
17721g3847q490P6493N0305k1243P3852J3805j05873j4208J07161Q9316K8506
17710B15777m9409p4159q763M5309l4192k2531m9737l5941Q8850M3075m6047l5240
17698C6992J1596j9346J0539o5649L5152J28666K4971M1273n8389J4406o2912
17687I7299q1024O059l2028l2031m6102n4758o732m1576P0849J07122J94169k2932
17675A58315j02480m2362J06330r978j60457R587Q1979m1148L922O5105r0789
17664b1976K85K0682M2679o4381l6179j32007Q6911J94763J09919j3886n4294
$$ plain form
17653 132516 160874 52372 34559 49779 -14087 -59032 6800 -15345 48828 165145 196896
17642 196896 114391 2277 -18513 -24381 16142 5082 53128 76960 128788 141153 94290
17631 94290 66276 -32123 4562 30125 -122244 -202799 -107699 -95512 -71165 -41586 -19611
17620 -19611 -12983 59581 68176 117835 126232 82253 48935 19655 123324 71565 23439 -136898
17608 -136898 -154466 -75562 -123757 -108634 -3967 -21563 -67183 -124988 -67310 52875 80553
17597 80553 23408 44650 124482 220051 222834 190549 168659 119913 173612 184441 72491 -25181
17585 -25181 7951 -14205 -78328 -66356 16562 89316 99657 126466 132117 19967 22889 66131
17573 66131 89690 68970 27009 18353 18237 48883 33624 -41485 -20983 51627 84442 2814
$$ packed form
17653A32516K8358j08502j7813J5220o3866m4945O5832k2145O4173J16317L1751
17642A96896q2505j12114k0790n868M0523j1060M8046K3832N1828J2365m6863
17631I4290k8014r8399L6685K5563j52369q0555R5100J2187K4347K9579K1975
17620a9611O628P2564Q595M9659Q397m3979l3318k9280J03669n1759m8126j60337
17608a36898j7568P8904m8195J5123J04667j7596m5620n7805N7678J20185K7678
17597H0553n7145K1242P9832R5569K783l2285k1890m8746N3699J0829j11950r7672
17585b5181L3132k2156o4123J1972Q2918P2754J0341K6809N651j12150K922M3242
17573F6131K3559k0720m1961q656j16L0646j5259p5109K0502P2610L2815q1628
$$ plain form
17561 2814 28300 -6442 -28522 -2724 -45006 -125427 -81627 -134433 -135181 -60105 -8586 49652
17549 49652 -37198 -238292 -213854 -144555 -89477 -59920 -50684 -10536 -25018 -22087 -59576 -21690
17537 -21690 82759 128977 104824 24194 -47919 -59008 -88475 -57838 54438 31051 4009
17526 4009 18522 -57906 -23836 52560 51557 -43702 -61573 14751 47868 29512 -70008 -59023
17514 -59023 -89730 -155403 -223317 -211583 -218102 -90735 -28603 -76077 -178526 -284506 -333946
17503 -333946 -258354 -139947 -141005 -185570 -190490 -179076 -104269 -76440 -105828 -63391 -139725 -112035
17491 -112035 -7674 6682 102757 183709 115966 72855 67359 66714 55164 21808 12817 13074
17479 13074 27643 23982 56689 70656 107872 100722 141408 33455 -62818 -46161 28433 123076
$$ packed form
17561B814K5486l4742k2080K5798m2282q0421M3800n2806p48P5076N1519N8238
17549D9652q6850k01094K4438O9299N5078K9557R236M0148j4482K931l7489L7886
17537b1690J04449M6218k4153q0630p2113j1089k9467L0637J12276k3387k7042
17526D009J4513p6428L4070P6396j003r5259j7871P6324L3117j8356r9520J0985
17514e9023l0707o5673o7914J1734o519J27367O2132m7474j02449j05980m9440
17503c33946P5592J18407j058m4565m920J1414P4807K7829k9388M2437p6334K7690
17491a12035J04361J4356R6075Q0952o7743m3111n496o45j1550l3356q991K57
17479A3074J4569l661L2707J3967L7216p150M0686j07953r6273J6657P4594R4643
$$ plain form
17467 123076 57598 22096 65822 72165 -995 -79575 -74029 -35117 128074 191161 173488 137887
17455 137887 79121 66183 62093 -7084 44640 112676 92238 131746 187746 277506 403238
17444 403238 572047 586757 489614 500269 532441 386599 269557 280853 192333 129100 145806
17433 145806 275423 180225 66041 147584 136747 8190 -98891 -88948 -81434 -98607 -116008
17422 -116008 -69016 -41258 -651 -11125 52956 81109 13628 -96759 -16378 38147 30474
17411 30474 -56696 -25071 70933 108072 127672 61841 67521 59717 -110628 -140561 -128901 -125933
17399 -125933 -141920 -125122 -70942 -137857 -62197 63220 148445 80784 31758 -44818 7338
17388 7338 120936 42151 -12243 -11733 -45589 -81252 -150145 -90266 -16906 9219 -46785 -65198
$$ packed form
17467A23076o5478l5502M3726O343p3160p8580N546L8912J63191O3087j7673l5601
17455A37887n8766j2938m090o9177N1724O8036k0438L9508N6000Q9760J25732
17444D03238J68809J4710r7143J0655L2172j45842j17042J1296q8520o3233J6706
17433A45806J29617r5198j14184Q1543j0837j28557j07081R943P514j7173j7401
17422a16008M6992K7758M0607j0474O4081K8153o7481j10387Q0381N4525p673
17411C0474q7170L1625R6004L7139J9600o5831N680p804j70345k9933J1660K968
17399a25933j5987J6798N4180o6915P5660J25417Q5225o7661m9026p6576N2156
17388G338J13598p8785n4394N10l3856l5663o8893N9879P3360K6125n6004j8413
$$ plain form
17376 -65198 -25324 4419 -29862 31854 146828 132310 65958 41932 10076 22261 -67877
17365 -67877 -5764 50749 94092 -55359 -167310 -210361 -152917 -53168 -21845 -38088 -45335
17354 -45335 -68091 -114048 -20557 89709 33658 -65808 -78172 -49173 62630 172462 275857
17343 275857 244326 195591 126397 72439 -12017 -31589 82886 72866 91059 55826 76634
17332 76634 119340 51698 -31252 -28803 -25135 -105955 -66178 -1269 -21528 -125335 -132938 -90598
17320 -90598 -37556 -679 -7315 -112206 -205750 -185051 -51317 47753 24980 5171 83336
17309 83336 73289 109986 157293 115457 -8669 -8043 36761 103511 202254 180842 121942 100910
17297 100910 102247 55219 16209 126416 105973 -23403 41278 119232 115028 138738 13245
$$ packed form
17376f5198L9874K9743l4281O1716J14974j4518o6352k4026l1856J2185r0138
17365f7877O2113N6513M3343j49451j11951m3051N7444R9749L1323j6243p247
17354d5335k2756m5957R3491J10266n6051r9466j2364K8999J11803J09832J03395
17343B75857l1531m8735o9194n3958q4456j9572J14475j0020J8193l5233K0808
17332G6634M2706o7642q2950K449L668q0820L9777O4909k0259j03807p603M2340
17320i0598N3042L6877o636j04891r3544K0699J33734R9070k2773j9809P8165
17309H3336j0047L6697M7307m1836j24126O26M4804O6750R8743k1412n8900k1032
17297A00910J337m7028l9010J10207k0443j29376O4681P7954m204K3710j25493
$$ plain form
17286 13245 69256 215119 160318 116482 97557 135744 97036 -72881 -85763 -118927 -21801
17275 -21801 133537 159606 119882 87622 21384 41794 104127 64094 29804 70682 116486
17264 116486 187407 145303 34723 -2125 -27423 -57033 -133735 -138262 -69869 -66576 -170950
17253 -170950 -155193 -71342 -108926 -84002 -29672 2193 -52423 -113419 -48110 -9273 -28563
17242 -28563 -87423 -55770 41069 17058 -81413 -207916 -157667 -59723 -40048 -120245 -30103
17231 -30103 55220 41733 44575 121838 134806 112384 65432 -126564 -55792 -58274 -125572 -175783
17219 -175783 -129161 -136813 -191093 -99356 -144370 -136836 -159791 -161401 -61304 -41862 -108546 -116482
17207 -116482 -146487 -136377 -52464 -42648 19488 52288 -5595 -69958 -92213 -125029 -36743 -69335
$$ packed form
17286A3245N6011J45863n4801m3836j8925L8187l8708j69917j2882l3164R7126
17275b1801J55338K6069l9724l2260o6238K0410O2333m0033l4290M0878M5804
17264A16486P0921m2104j10580l6848k5298k9610p6702m527O8393L293j04374
17253a70950J5757Q3851l7584K4924N4330L1865n4616o0996O5309L8837j9290
17242b8563n8860L1653R6839k4011r8471j26503N0249R7944J9675q0197R0142
17231c0103Q5323j3487K842P7263J2968k2422m6952j91996P0772k482o7298n0211
17219a75783M6622p652n4280R1737m5014P534k2955j610J00097J9442o6684p936
17207a16482l0005J0110Q3913R816O2136L2800n7883o4363k2255l2816Q8286l2592
$$ plain form
17195 -69335 -96476 -20255 -105740 -235622 -153808 -37586 67810 -2915 -51646 4003 -6184
17184 -6184 -17713 -38578 11610 20520 -582 39932 44184 93177 66229 24046 50354 -55592
17172 -55592 -124751 -93396 15687 -17143 14375 -50099 -48232 -99165 -117019 -63327 -60352 8340
17160 8340 153988 153996 187380 176571 103821 91081 72137 38942 52041 64503 -30693 -16954
17148 -16954 6865 23440 42189 43043 35101 8969 16793 47653 12512 -68660 -74373 -154846 -171231
17135 -171231 -153879 -169591 -170673 -77949 -73851 -42545 13315 -44107 -22644 29830 72785 160719
17123 160719 82529 -11553 -56286 -35637 22849 26622 -55984 -71870 7916 -64210 -164592
17112 -164592 -144975 -112692 -39635 117384 152446 140036 58019 55008 54517 15737 3944 -61133
$$ packed form
17195f9335k7141P6221q5485j29882Q1814J16222J05396p0725m8731N5649j0187
17184f184j1529k0865N0188Q910k1102M0514M252M8993k6948m2183K6308j05946
17172e5592o9159L1355J09083l2830L1518o4474J867n0933j7854N3692K975O8692
17160H340J45648QL3384j0809p2750j2740j8944l3195J3099J2462r5196J3739
17148a6954K3819J6575J8749Q54p942k6132P824L0860l5141q1172n713q0473j6385
17135a71231J7352j5712j082R2724M098L1306N5860n7422K1463N2474M2955Q7934
17123A60719p8190r4082m4733K0649N8486L773q2606j5886P9786p2126j00382
17112a64592J9617L2283P3057J57019L5062j2410q2017l011m91l8780j1793o5077
$$ plain form
17100 -61133 -121784 -123979 -215966 -176358 -199967 -129697 -121657 -32421 58562 45152 89369 81496
17088 81496 13341 -22680 41239 125939 12938 -19181 21245 10998 -14122 -35976 3322
17077 3322 23133 21080 -80121 -40914 32897 52330 76909 176978 153739 41949 -7638
17066 -7638 -68302 13343 74041 12814 44403 79001 142059 147910 -13410 -48174 -105114 -69361
17054 -69361 3095 9753 -97507 -109932 -113887 -77471 -67032 -124078 -93927 -149811 -103558 -108894
17042 -108894 -187244 -147370 -28182 -70016 -51214 -15907 -114332 -154871 -73054 -70517 -102594
17031 -102594 -125621 -30083 64506 56665 -30571 -34809 -10135 -48250 -171073 -195026 -121440 -101893
17019 -101893 -125004 -168703 -173651 -102731 -19624 -119304 -118511 -78128 24992 -2397 31847 50477
$$ packed form
17100f1133o0651k195r1987L9608k3609P0270Q040Q9236R0983j3410M4217p873
17088H1496o8155l6021O3919Q4700j13001l2119M0426j0247k5120k1854L9298
17077C322J9811k053j01201L9207P3811J9433K4579J00069k3239j11790m9587
17066g638o0664Q1645O0698o1227L1589L4598O3058N851j61320l4764n6940L5753
17054f9361P2456O658j07260j2425l955L6416J0439n7046L0151n5884M6253n336
17042a08894p8350L9874J19188m1834J8802L5307r8425m0539Q1817K537l2077
17031a02594k3027R5538R4589p841q7236m238K4674l8115j22823k3953P3586J9547
17019a01893k3111m3699m948P0920Q3107r9680P93M0383J03120k7389L4244J8630
$$ plain form
17007 50477 45895 88957 91395 105625 193202 42685 61136 21959 -71003 -57928 -30126 -29357
16995 -29357 -75598 -116469 -166517 -196258 -143373 -151937 -141448 -72074 20483 102158 100330 5495
16983 5495 -50365 -41566 38814 162761 108488 57121 97906 232373 208188 98285 54412
16972 54412 24591 85066 -1729 -38870 7564 31740 -32600 34882 125445 105101 -130946
16961 -130946 -205908 -128477 -5083 54749 -19641 -28864 31390 45641 32026 80746 132931
16950 132931 106578 149052 36078 -44143 -39411 -103746 -76348 -46043 -14984 -20914 -47026 -45701
16938 -45701 -77209 26227 108886 49703 -29789 -64207 -155849 -156814 -96262 -4244 -524 -56088
16926 -56088 -18459 -3560 14917 32885 -65039 -108483 -75296 -74283 -11720 52357 11097 -4093
$$ packed form
17007E0477m582M3062K438J4230Q7577j50517J8451l9177r2962J3075K7802P69
16995b9357m6241m0871n0048k9741N2885q564J0489O9374R2557Q1675j828r4835
16983E495n5860Q799Q0380J23947n4273n1367M0785J34467k4185j09903m3873
16972E4412k9821O0475q6795l7141M6434K4176o4340O7482R0563k0344k36047
16961a30946p4962P7431J23394N9832p4390r223O0254J4251j3615M8720N2185
16950A32931k6353M2474j12974q0221M732o4335K7398L0305L1059n930k6112J325
16938d5701l1508J03436Q2659n9183p9492l4418r1642r65O0552R2018L720n5564
16926e6088L7629J4899J8477J7968r7924m3444L3187J013O2563O4077m1260j5190
$$ plain form
16914 -4093 -53847 -90619 -90962 -62230 -64978 -32252 -54857 -131303 -171826 -211313 -174459 -123598
16902 -123598 -66020 -23295 -143391 -95240 47232 2677 9433 39633 -1183 47990 19389
16891 19389 30817 -49779 -84528 15232 -24747 30614 -14708 -63538 -56214 -22205 11225 -9522
16879 -9522 22942 -17190 -32125 30905 17475 -17364 -689 7508 -53616 -58392 84567 125370
16867 125370 86696 83877 89826 30878 20243 -3962 -54493 -132426 -205750 -168801 -143376 -78825
16855 -78825 -37054 -64696 -32939 19045 24070 -10909 -119568 -57425 -85009 -122483 -184559 -89052
16843 -89052 -28642 -62259 -106777 -99211 -144187 -152819 -96236 -72390 -122107 -94557 -65702 -16462
16831 -16462 -51261 -224555 -265010 -222734 -191546 -153557 -91258 -53537 -125237 -152518 -47305
$$ packed form
16914d093m9754l6772l43K8732k748L2726k2605p6446m0523l9487L6854N0861
16902a23598N7578M2725j20096M8151J42472m4555O756L0200m0816M9173k8601
16891A9389J1428q0596l4749R9760l9979N5361m5322m8830P324L4009L3430k0747
16879i522L2464m0132j4935O3030j3430l4839J6675Q197o1124m776J42959M0803
16867A25370l8674k819N949n8948j0635k4205n0531p7933p3324L6949K5425O4551
16855g8825M1771k7642L1757N1984N025l4979j08659O2143k7584l7474o2076R5507
16843h9052O0410l3617m4518P566m4976q632N6583K3846m9717K7550K8855M9240
16831a6462l4799j73294m0455M2276L1188L7989O2299L7721p1700k7281J05213
$$ plain form
16820 -47305 69905 10423 21434 66141 57514 -33964 -6687 -42423 -172695 -145945 -31604
16809 -31604 92759 19175 -82571 -81907 37472 153692 168173 171158 166121 92141 40955 -17724
16797 -17724 -75408 -51650 -77409 -131592 -163528 -124164 -142935 -85296 -43845 -55954 -34893 -13990
16785 -13990 -150164 -174927 -10742 86907 68604 45764 -30557 -1849 -19142 -110254 -59375
16774 -59375 -120971 -85824 -19690 22023 -29790 -32715 -649 6575 -32449 -45610 -96999 -223768
16762 -223768 -224104 -92637 -61043 19714 61758 43491 97900 122848 59611 -22641 -60174 -121367
16750 -121367 -189285 -145172 -128279 -136527 -50945 73839 69589 -23751 -104110 -7581 21993 -83424
16738 -83424 -200242 -223159 -159596 -121289 -99864 -1132 162135 197612 150563 54078 -28722
$$ packed form
16820d7305J17210n9482J1011M4707q627r1478K7277l5736j30272K6750J14341
16809c1604J24363p3584j01746O64J19379J16220J4481K985n037p3980n1186n8679
16797a7724n7684K3758k5759n4183l1936L9364j8771N7639M1451j2109K1061K0903
16785a3990j36174k4763J64185R7649j8303k2840p6321K8708j7293r1112N0879
16774e9375o1596L5147O6134M1713n1813k925L2066P224l9024j3161n1389j26769
16762b23768l36J31467L1594Q0757M2044j8267N4409K4948o3237q2252l7533o1193
16750a21367o7918M4113J6893q248Q5582J24784m250r3340q0359R6529K9574j05417
16738h3424j16818k2917O3563L8307K1425R8732J63267L5477m7049r6485q2800
$$ plain form
16727 -28722 -3989 -34299 -53357 -51293 13935 2045 41365 -54972 -112626 -208780 -74881 -77844
16715 -77844 -106209 -131618 -71277 3830 16267 -9898 -77013 -51780 27851 43073 -43552 -97348
16703 -97348 -28645 -10102 -8398 67148 82167 -2071 19110 8587 -23820 135588 137065 76935
16691 76935 42233 -34730 -69475 -120511 -78380 -48588 -13771 58483 96127 89745 -76136 -146382
16679 -146382 -138411 -154125 -212056 -165177 -198819 -159942 -158676 -185952 -115712 -55328 -25759 -17528
16667 -17528 79512 110672 106284 91223 65727 132374 105752 11372 -23326 -8984 44209 89824
16655 89824 98235 33288 24258 139687 83925 -3950 2575 16653 -1866 -2943 -20759 -42638
16643 -42638 -70198 -36190 4264 -71821 -91179 -158354 -135630 -154104 -127473 -132132 -124729 -57554
$$ packed form
16727b8722K4733l0310j9058K064O5228j1890L9320r6337n7654r6154J33899k963
16715g7844k8365k5409O0341P5107J2437k6165o7115K5233P9631J5222q6625n3796
16703i7348O8703J8543J704P5546J5019q4238K1181j0523l2407J59408J477o0130
16691G6935l4702p6963l4745n1036M2131K9792L4817P2254L7644o382j65881p0246
16679a46382P971j5714n7931M6879l3642L8877J266k7276P0240O0384K9569Q231
16667a7528R7040L1160m388j5061k5496O6647k6622r4380l4698J4342N3193M5615
16655H9824Q411o4947r030J15429n5762q7875O525J4078j8519j077j7816k1879
16643d2638k7560L4008M0454p6085j9358o7175K2724j8474K6631m659P403O7175
$$ plain form
16631 -57554 -75634 -137901 -65286 -17434 -20068 21045 14624 5825 -12434 -19769 -16021 2894 -66943
16618 -66943 -91895 -23750 8675 14116 20607 12988 21214 -57656 -206451 -259127 -271025 -201765
16606 -201765 -100433 -92365 -87087 -70143 -96119 -119372 -125718 -170449 -131575 -60784 -47976 -77895
16594 -77895 -50379 -52483 6522 96699 40859 -39122 -65050 -64197 -82116 46223 55590 -26115
16582 -26115 9220 -50483 -69061 -82186 -40607 -33296 -97164 -137125 6634 48256 7495 -91543
16570 -91543 -71884 -93621 -83500 -111446 -183781 -170823 -190322 -143041 -34814 -8171 -69943
16559 -69943 -75091 -10945 23117 11704 -106768 -55806 75614 209536 249261 258127 189678
16548 189678 71645 89315 36289 8474 43301 -25843 -59398 -63906 -101429 -162583 -154488 -71122
$$ packed form
16631e7554j8080o2267P2615M7852k634M1113o421q799j8259p335L748J8915o9837
16618f6943k4952O8145L2425N441O491p619Q226p8870j48795n2676j1898O9260
16606b01765J01332Q068N278J6944k5976k3253o346m4731L8874P0791J2808k9919
16594g7895K7516k104N9005R0177n5840p9981k5928Q53j7919J28339R367q1705
16582b6115L5335n9703j8578j3125M1579P311o3868l9961J43759M1622m0761r9038
16570i1543J9659k1737J0121k7946p2335J2958j9499M7281J08227K6643o1772
16559f9943n148O4146L4062j1413j18472N0962J31420J33922L9725Q866o8449
16548A89678j18033J7670n3026k7815L4827o9144l3555m508l7523o1154Q095Q3366
$$ plain form
16536 -71122 28113 -13734 12159 -78892 -129380 -101884 -51065 40882 32963 -4753 -63137 -139647
16524 -139647 -258966 -348000 -198341 -69983 -23862 112511 250307 175625 140355 124775
16514 124775 54120 -82638 -156475 -108743 -126988 -160740 -145406 -124322 -110263 -177469 -206315
16503 -206315 -215298 -118447 64587 30485 -16242 -64734 -27083 25956 63031 11126 32585
16492 32585 121298 149989 73309 35844 36725 97394 93257 -37043 -130614 -139762 -178985 -103904
16480 -103904 13704 7980 8421 25375 69791 12508 45487 105520 63469 1023 -50311 -20876
16468 -20876 67791 66744 157318 238229 155189 188197 -4501 -113037 -51635 11634 23145
16457 23145 -15394 -72305 -203104 -175155 -44983 -15521 -86501 -50824 -86766 -45152 -4535
$$ packed form
16536g1122R9235m1847K5893r1051n0488K7496N0819R1947p919l7716n8384p6510
16524a39647j19319q9034J49659J28358M6121J36373J37796p4682l5270j5580
16514A24775p0655j36758p3837M7732j8245l3752J5334K1084J4059o7206k8846
16503b06315q983R6851J83034l4102m6727m8492L7651N3039L7075n1905K1459
16492C2585Q8713K8691p6680l7465Q81O0669m137j30300r3571r148l9223P5081
16480a03904J17608n724M41J6954M4416n7283L2979O0033m2051o2446n1334K9435
16468b0876Q8667j047R0574Q0911q3040L3008j92698j08536O1402O3269J1511
16457B3145l8539n6911j30799K7949J30172K9462p0980L5677l5942M1614M0617
$$ plain form
16446 -4535 -65148 -27991 -106547 -6081 -12557 -157628 -122003 -174963 -76009 -26723 -93801 -64604
16434 -64604 -80177 -150801 -54248 50328 12072 -28984 13161 70427 -31125 -107211 -75957
16423 -75957 -8341 12274 39403 89565 42824 -25453 -17321 93816 100609 64217 18602 115703
16411 115703 156529 80783 21024 -12811 14609 -1191 19949 7437 -73496 -94883 -97741 -71945
16399 -71945 -24876 28037 34092 -91203 -127443 -3457 10870 -25863 65869 168641 177773
16388 177773 141768 164696 189388 116564 63544 44423 7200 -4543 69404 92048 117694
16377 117694 126470 66423 -69548 -147410 -193132 -211492 -89679 -3849 90315 -30283 -72026
16366 -72026 -6656 -16938 -96500 -115174 -80614 -86616 -92256 26518 83456 132483 100575 77591
$$ packed form
16446d535o0613L7157p8556J00466o476j45071L5625n2960R8954M9286o7078K9197
16434f4604j5573p0624R6553J04576l8256m1056M2145N7266j01552p6086L1254
16423g5957O7616K0615K7129N0162m6741o8277Q132J11137O793l6392m5615R7101
16411A15703M0826p5746n9759l3835K7420j5800K1140j2512q0933k1387k858K5796
16399g1945M7069N2913O055j25295l6240J23986J4327l6733R1732J02772R132
16388A77773l6005K2928K4692p2824n3020j9121l7223j1743P3947K2644K5646
16377A17694Q776o0047j35971p7862m5722j8360J21813Q5830R4164j20598m1743
16366g2026O5370j0282p9562j8674L4560o002n640J18774N6938M9027l1908k2984
$$ plain form
16354 77591 92162 153085 148286 54304 -33022 -92696 -88015 -40845 -9539 120292 167082 38558
16342 38558 65891 111610 111006 136266 114216 60558 29000 50558 67193 -4681 19531 33282
16330 33282 34259 53614 33612 -47455 11395 -2175 -3215 -34699 -34339 -46396 6673 60219 147048
16317 147048 133842 130572 60008 -11407 -36986 -18041 -59141 -67394 -24728 23664 113279 80433
16305 80433 79487 67271 36299 44042 12863 103600 113309 200598 191909 63271 14647 83329
16293 83329 105003 -20343 -120751 -52962 103670 101791 417 15078 113060 108506 -19198
16282 -19198 -94239 -55889 -22682 -1385 -10887 -117165 -185481 -203447 -151813 -116736 -119196 -22763
16270 -22763 -8425 -53615 -1585 21459 83114 154327 111906 100894 144243 157365 130143 -3039
$$ packed form
16354G7591J4571O0923m799r3982q7326n9674M681M7170L1306J29831M6790j28524
16342C8558K7333M5719o04K5260k2050n3658l1558K1558J6635p1874K4212J3751
16330C3282R77J9355k0002q1067N8850j3570j040l1484L60j2057N3069N3546Q6829
16317A47048j3206l270p0564p1415k5579J8945m1100q253M2666M8392Q9615l2846
16305H0433r46j2216l0972P743l1179R0737R709Q7289q689j28638m8624O8682
16293H3329K1674j25346j00408O7789J56632j879j01374J4661R7982m554j27704
16282a9198p5041L8350L3207K1297r502j06278o8316j7966N1634L5077k460R6433
16270b2763J4338m5190N2030K3044O1655P1213m2421j1012M3349J3122k7222j33182
$$ plain form
16258 -3039 -121174 -157745 -88979 -70979 -20613 71275 148447 174177 70513 5528 -27613
16247 -27613 -117055 -62453 -17054 -87206 -129044 -196424 -230715 -131648 -24791 1076 -57897
16236 -57897 -65190 -92078 -87009 -207622 -201866 -238344 -299417 -310927 -204619 -241862 -293947 -203203
16224 -203203 -147309 -124629 -153958 -157985 -121217 -83473 -144562 -128181 -148532 -183591 -227824 -173144
16212 -173144 -106744 -98756 -91091 -67280 -70413 -150388 -196340 -186481 -121738 -64501 -8678 76406
16200 76406 59410 43292 -12815 -31868 -59413 39701 31712 -21851 -57243 -60076 -65920 55514
16188 55514 123686 123830 146135 9744 -51585 -21725 59273 22854 -180210 -9629 29649
16177 29649 14523 61118 27035 7945 17434 -57211 -60031 -60238 -61974 -122874 -113539 -105553 -84811
$$ packed form
16258c039j18135l6571O8766J8000N0366R1888P7172K5730j03664o4985l3141
16247b7613q9442N4602M5399p0152m1838o7380l4291R9067J06857K5867n8973
16236e7897p293k6888N069j20613N756l6478o1073j1510J06308l7243n2085R0744
16224b03203N5894K2680k9329m027L6768L7744o1089J6381k0351l5059m4233N4680
16212a73144O6400P988P665K3811l133p9975m5952R859O4743N7237N5823Q5084
16200G6406j6996j6118n6107j9053k7545R9114p989n3563l5392k833n844J21434
16188E5514O8172J44K2305j36391o1329K9860Q0998l6419k03064J70581L9278
16177B9649j5126M6595l4083j9090R489p4645k820k07j736o0900R335P986K0742
$$ plain form
16164 -84811 -32034 53328 49136 -55550 -98940 -72985 -76627 -101752 -143789 -205976 -175514 -132898
16152 -132898 -102613 -118177 -17118 87267 106044 103442 57205 15615 -1486 -83079 -105067
16141 -105067 23270 26778 11489 33919 14514 59604 114938 190275 172520 153762 140009
16130 140009 58282 16608 -31988 -137443 -112348 -87072 -96486 -18404 1692 15067 -51280
16119 -51280 -123881 -111224 -127758 -233255 -213042 -229133 -133132 -28342 -3852 -35674 -64904
16108 -64904 -90939 -38626 107779 111120 135590 142190 181072 118675 43887 -12943 -104019 -133553
16096 -133553 4036 9024 75014 67481 66585 55193 -98785 -210104 -102963 -69228 -26886
16085 -26886 47397 28685 -63197 -91705 -67009 -9443 36785 -85917 -22625 123691 144136
$$ packed form
16164h4811N2777Q5362m192j04686m3390K5955l642k5125m2037o2187L0462M2616
16152a32898L0285j5564J01059J04385J8777k602m6237m1590j7101q1593k1988
16141a05067J28337L508j5289K2430j9405M5090N5334P5337j7755j8758j3753
16130A40009q1727m1674m8596j05455K5095K5276r414P8082K0096J3375o6347
16119e1280p2601J2657j6534j05497K0213j6091R6001J04790K4490l1822k9230
16108f4904k6035N2313J46405L341K4470O600L8882o2397p4788n6830r1076k9534
16096a33553J37589M988O5990p533q96j1392j53978j11319J07141L3735M2342
16085b6886P4283j8712r1882k8508K4696N7566M6228j22702O3292J46316K0445
$$ plain form
16074 144136 66746 94610 113123 50999 27300 -26100 7692 -88590 -131995 8471 80926
16063 80926 111867 61787 36341 64889 52529 74414 129817 138276 74730 66169 154760 168393
16051 168393 69052 79377 99185 92254 51465 84688 50676 66294 62653 20633 -22087 -31145
16039 -31145 -94742 -129104 -36738 41893 -8871 -57437 22440 3531 -105173 -183263 -94508
16028 -94508 38079 95059 25227 61280 111062 47920 -104759 -51454 -84452 -93971 -157431
16017 -157431 -163052 -134397 -123391 -110613 -187780 -197305 -63713 -53244 -90132 -90226 -55407 -15625
16005 -15625 8822 55766 23404 -40086 19276 120733 126350 74759 31942 -15242 24329 -22732
15993 -22732 -95172 -87422 -164776 -243166 -133081 -50918 -120181 -185399 -128096 -50611 44266 147605
$$ packed form
16074A44136p7390K7864J8513o2124k3699n3400L3792r6282m3405J40466P2455
16063H0926L0941n0080k5446K8548j2360K1885N5403Q459o3546q561Q8591J3633
16051A68393r9341J0325J9808o931m0789L3223l4012J5618l641m2020m2720r058
16039c1145o3597l4362R2366P8631n0764m8566P9877j8909j08704p8090Q8755
16028i4508J32587N6980o9832L6053M9782o3142j52679N3305l2998r519o3460
16017a57431n621K8655J1006J2778p7167r525J33592J0469l6888r4L4819L9782
16005a5625K4447M6944l2362o3490N9362J01457N617n1591m2817m7184L9571m7061
15993b2732p2440P750p7354p8390J10085Q2163o9263o5218N7303P7485R4877J03339
$$ plain form
15981 147605 130399 38108 -28011 -99331 -128160 -153413 -105439 -21661 -26801 -89761 -35855 -46220
15969 -46220 -71008 -47184 -36340 3408 36457 -49822 -60117 -131550 -118878 -68820 -20217 -18307
15957 -18307 29381 118394 104113 65628 -49593 -134541 -105079 -23829 -9587 -98886 -107731 -48353
15945 -48353 -2712 -95733 -101811 -1147 21483 24388 -19634 37097 112710 125211 15278 1881
15933 1881 16336 -50601 -77943 -32021 -35918 -23991 -49857 -61538 66038 226159 181083 65064
15921 65064 -28895 114662 167330 151475 73335 42028 173577 175042 11531 35599 89350
15910 89350 82754 -2491 20856 -73356 -7720 -23658 -158470 -145593 -50646 41174 60905 106764
15898 106764 165419 160901 143927 41131 -30499 -72902 -82923 -108853 -11465 85975 122203
$$ packed form
15981A47605j7206r2291o6119p1320k8829k5253M7974Q3778n140o2960N3906j0365
15969d6220k4788K3824J0844L9748L3049q6279j0295p1433J2672N0058M8603J910
15957a8307M7688Q9013j4281l8485j15221q4948K9462Q1250J4242q9299q845N9378
15945d8353M5641r3021o078J00664K2630K905m4022N6731P5613J2501j09933j3397
15933A881J4455o6937k7342M5922l897J1927k5866j1681J27576J60121m5076j16019
15921F5064r3959J43557N2668j5855p8140l1307J31549J465j63511K4068N3751
15910H9350o596q5245K3347r4212O5636j5938j34812J2877R4947R1820J9731M5859
15898A06764N8655m518j6974j02796p1630m2403j0021k5930R7388R7440L6228
$$ plain form
15887 122203 182989 218612 139988 120866 -1477 -33985 2718 -26875 -64832 -80982 -53206
15876 -53206 38192 89200 54543 -34336 -66265 -42866 -20735 43954 35841 -16970 -32610 -74574
15864 -74574 2432 22120 9609 -104463 -205895 -108035 47646 5946 -7760 -2672 64934
15853 64934 17328 1213 -19534 59111 69277 -94761 -144203 -183025 -172492 -156637 -240348
15842 -240348 -208656 -165303 -55716 -78230 -175889 -198403 -181396 -161441 -27323 87637 71565
15831 71565 49932 -18646 4240 71015 107063 112118 82174 -78404 -175888 -124629 -50224 21764
15819 21764 92810 134485 71256 79876 144521 98366 68333 96174 80650 -59803 -137416 -125574
15807 -125574 -38813 -80500 -158868 -167898 -208275 -227490 -147856 -150035 -134746 -37958 50234 29086
$$ packed form
15887A22203O0786L5623p8624j9122j22343l2508L6703k9593l7957j6150K7776
15876e3206R1398N1008l4657q8879l1929K3399K2131O4689q113n2811j5640m1964
15864g4574P7006J9688j2511j14072j01432R7860J55681m1700j3706N088O7606
15853F4934m7606j6115k0747P8645J0166j64038m9442l8822J0533J5855q3711
15842b40348L1692M3353J09587k2514r7659k2514J7007J9955J34118J14960j6072
15831G1565k1633o8578K2886O6775L6048N055k9944j60578r7484N1259P4405P1988
15819B1764P1046M1675o3229Q620O4645m6155l0033K7841j5524j40453p7613J1842
15807a25574Q6761m1687p8368r030m0377j9215P9634k179J5289R6788Q8192k1148
$$ plain form
15795 29086 6081 -11251 -65790 -47505 -13893 156491 135202 44182 54615 80572 59841
15784 59841 88555 174619 117579 24726 -54363 -56819 -4865 -8181 31810 70565 61778 111963
15772 111963 141072 29581 -18560 -119844 -128896 -57008 50060 54282 -53851 -76776 -30518
15761 -30518 12329 -44460 -96469 -134713 -88451 -47339 -16174 -72124 -59211 -15063 139339
15750 139339 59787 -30434 -39338 28186 45510 -65566 -188066 -212984 -71687 48798 991
15739 991 -22276 84651 130101 113698 112970 -17984 -115918 -217265 -274302 -215925 -220203 -225678
15727 -225678 -236592 -175268 -79119 -68516 -190203 -183576 -200721 -289990 -249366 -136122 5129
15716 5129 116368 251680 166349 -25720 -143154 -108614 -52896 -139674 -111802 -24619 -17910
$$ packed form
15795B9086k3005j7332n4539J8285L3612J70384k1289r1020J0433K5957k0731
15784E9841K8714Q6064n7040r2853p9089k456N1954l316L9991L8755q787N0185
15772A11963K9109j11491m8141j01284r052P1888J07068M222j08133k2925M6258
15761c0518M2847n6789n2009l8244M6262M1112L1165n5950J2913M4148J54402
15750A39339p9552r0221q904O7524J7324j11076j22500k4918J41297J20485m7807
15739I91k3267J06927M5450j6403p28j30954r7934j01347n7037N8377m278n475
15727b25678j0914O1324R6149J0603j21687O627j7145q9269M0624J13244J41251
15716E129J11239J35312q5331j92069j17434L4540N5718q6778K7872Q7183O709
$$ plain form
15705 -17910 -72957 7003 -30056 -40971 -90125 -143074 -76163 58562 -18524 -134551 -130682
15694 -130682 -232126 -169665 8598 80579 46792 32262 -98865 -37205 72518 84085 51530
15683 51530 108385 148031 104461 53753 30269 64134 39412 -51473 -65358 11183 69268 -7286
15671 -7286 10545 21497 -2420 61961 60021 -21093 -6012 38422 -12471 -33428 -29032 41357
15659 41357 82435 63378 -60900 -92625 -41458 -85945 -99817 -71356 -109118 -132734 -133408 -103039
15647 -103039 12440 53470 1295 -24204 71873 84636 53278 -34061 -39403 128368 219139
15636 219139 139340 -36521 -57622 -4672 -29392 24858 13502 -72637 -166360 -164786 -139276
15625 -139276 -111401 -96838 -109082 -97802 -19242 109212 78582 13118 121688 92744 56387
$$ packed form
15705a7910n5047P9960l7059j0915m9154n2949O6911J34725p7086j16027L869
15694a30682j01444O2461J78263P1981l3787j4530j31127O1660J09723J1567l2555
15683E1530N6855L9646m3570n0708k3484L3865k4722r0885j3885P6541N8085p6554
15671g286J7831J0952k3917O4381j940q1114J5081M4434n0893k0957M396P0389
15659D1357M1078j9057j24278l1725N1167m4487j3872K8461l7762k3616o74L0369
15647a03039J15479M1030n2175k5499R6077J2763l1358q7339n342J67771R0771
15636B19139p9799j75861k1101N2950k4720N4250j1356q6139r3723J574K5510
15625a39276K7875J4563j2244J1280P8560J28454l0630o5464J08570k8944l6357
$$ plain form
15614 56387 75692 132836 162827 209709 145242 149034 137832 123686 45950 -50739 -31471 15126
15602 15126 14587 -33948 -91520 -144451 -66941 -108437 -112171 -56299 -35543 52381 70689 62793
15590 62793 5675 -48520 -40378 -189582 -160007 -62327 78426 96724 26751 -321 47509
15579 47509 89498 -31068 -109119 -42436 -1610 66721 74841 110906 121775 96148 22329 -22921
15567 -22921 -12090 3367 6702 103959 128267 59466 13804 -26104 44352 61029 49247 75711
15555 75711 35901 10338 -7462 35523 48086 70760 111391 127858 98730 8924 19870 56861
15543 56861 46569 53231 8136 15650 -36104 35619 10426 -3077 5131 6522 70186 157940
15531 157940 125541 72595 57165 34317 41535 69460 1012 -59508 18521 33242 -132614
$$ packed form
15614E6387J9305N7144K9991M6882o4467L792j1202j4146p7736r6689J9268M6597
15602A5126n39m8535n7572n2931P7510m1496l734N5872K0756Q7924J8308p896
15590F2793n7118n4195Q142j49204K9575R7680J40753J8298o9973k7072M7830
15579D7509M1989j20566p8051O6683M0826O8331Q120L6065J0869k5627p3819m5250
15567b2921J0831J5457L335R7257K4308o8801m5662l9908P0456J6677j1782K6464
15555G5711l9810k5563j7800M2985J2563K2674M0631J6467k9128q9806J0946L6991
15543E6861j0292O662m5095P514n1754P1723k5193j3503Q208J391O3664Q7754
15531A57940l2399n2946j5430k2848P218K7925o8448o0520P8029J4721j65856
$$ plain form
15520 -132614 -96177 -112963 -132506 -111806 -158618 -158095 -134956 -104657 -53981 3186 -71200 -73482
15508 -73482 21095 -9047 -119798 -79051 -6764 69750 37209 -31263 -64779 -48293 -46331 19637
15496 19637 37666 25655 30138 5728 -96514 -87280 35020 175872 147167 -17613 -48083
15485 -48083 -141734 -95194 -66937 -68905 -82291 -125915 -81346 15026 -28619 -127001 -197623 -119579
15473 -119579 -122330 -115178 -5034 123940 117987 36644 -96582 -201821 -217345 -231543 -151551
15462 -151551 -54454 -43524 -65994 -38658 55322 31691 -31296 49203 1265 79490 176315
15451 176315 120148 -443 -6240 -146 14606 75785 52977 96950 108345 118541 61897 -20216
15439 -20216 10255 -54842 -9592 25970 14749 -63682 -14282 46567 30322 -7274 -103987 -35487
$$ packed form
15520a32614L6437j6786j9543K0700m6812N23K3139L0299N0676N7167p4386k282
15508g3482R4577l0142j10751M0747P2287P6514l2541o8472l3516J6486J962O5968
15496A9637J8029j2011M483k4410j02242R234J22300J40852k8705j64780l0470
15485d8083r3651M6540K8257j968j3386m3624M4569R6372m3645r8382p0622P8044
15473a19579k751P152J10144J28974n953q1343j33226j05239j5524j4198P9992
15462a51551R7097J0930k2470K7336R3980k3631o2987Q0499m7938P8225R6825
15451A76315n6167j20591n797O094J4752O1179k2808M3973J1395J0196n6644q2113
15439b0216L0471o5097M5250L5562j1221p8431M9400O0849j6245l7596r6713O8500
$$ plain form
15427 -35487 131122 131804 165287 138190 145784 71322 110029 81826 738 6896 -26776 -14000
15415 -14000 2787 -39554 -45528 -46160 79804 111839 88877 -61053 -179656 -144641 -53064 -39502
15403 -39502 -18869 47053 43364 8289 3218 2894 -55079 -82782 -52976 44417 133677 162484
15391 162484 147380 52407 20712 -86787 -114613 -59736 -2037 49200 33414 -10747 -7975
15380 -7975 57033 121640 188910 129008 44540 43674 111495 139422 186015 190621 165431 138249
15368 138249 118105 107770 78188 122863 184566 143829 -8560 -71290 -84875 -58221 -1597
15357 -1597 -23877 -84269 -93096 -119792 1276 33317 -69556 -88474 -100436 -87105 -177512 -231100
15345 -231100 -190347 -116586 -79405 -44140 -37366 -27119 3134 -8826 -96520 -149592 -150485 -201204
$$ packed form
15427c5487J66609O82L3483k7097P594p4462L8707k8203q1088O158l3672J2776
15415a4000J6787m2341n974o32J25964L2035k2962j49930j18603L5015R1577J3562
15403c9502K0633O5922l689l5075n071l24n7973k7703K9806R7393Q9260K8807
15391A62484j5104r4973l1695j07499k7826N4877N7699N1237j5786m4161K772
15380g975O5008O4607O7270n9902q4468q66O7821K7927M6593M606k5190k7182
15368A38249k0144j0335k9582M4675O1703m0737j52389o2730j3585K6654N6624
15357a597k2280o0392q827k6696J21068L2041j02873j8918j1962J3331r0407n3588
15345b31100M0753P3761L7181L5265O774J0247L0253j1960q7694n3072q93n0719
$$ plain form
15333 -201204 -208846 -138553 -174516 -82023 2787 -35869 -86963 -41770 86359 95672 120557 45340
15321 45340 21305 -14302 -16322 -4246 -36225 -4126 -18887 -73873 -39076 52365 159706 68494
15309 68494 -48077 -47873 -97537 -61342 55035 -5234 -49149 -82913 -84192 -14533 44632 -13203
15297 -13203 -54187 -75804 -94009 -57181 -101194 -113737 -169490 -208858 -145816 -61231 -4363 -4398
15285 -4398 -60235 -164830 -145387 -102633 -73685 -119626 -181871 -178139 -107926 -128687 -68563 -4320
15273 -4320 -94552 -114996 7613 -29027 -102353 -79937 -29880 106651 153295 128843 97349
15262 97349 59664 -115647 -119930 -75106 -84516 -28101 69025 90718 -10183 -52360 -90179 -59363
15250 -59363 -106672 -91629 -144695 -116257 -159639 -190822 -42292 -32368 -137168 -72845 20098
$$ packed form
15333b01204p642P0293l5963R2493Q4810l8656n1094M5193J28129R313K4885p5217
15321D5340k4035l5607k020J2076l1979L2099j4761n4986L4797R1441J07341r1212
15309F8494j16571K04m9664L6195J16377o0269m3915l3764j279O9659N9165n7835
15297a3203m0984k1617j8205L6828m4013j2543n5753l9368O3042Q4585N6868l5
15285d398n5837j04595J9443M2754K8948m5941o2245L732P0213k0761O0124O4243
15273d320r0232k0444J22609l6640p3326K2416N0057J36531M6644k4452l1494
15262I7349l7685j75311m283M4824r410N6415R7126K1693j00901m2177l7819L0816
15250e9363m7309J5043n3066K8438m3382l1183J48530R924j04800O4323R2943
$$ plain form
15239 20098 -5257 -136120 -144055 -146683 -106678 -217547 -292999 -241099 -214109 -249237 -211118 -171617
15227 -171617 -89561 -209660 -202985 -111991 -168697 -80647 113636 134876 -4526 -46202 100852
15216 100852 127125 373 -95295 -114010 -31735 8672 -13518 -23388 42967 149864 114246
15205 114246 -4179 -85716 -135670 -96744 -81923 -50559 -18175 11042 -22078 40384 128302
15194 128302 110123 116992 67491 -72993 -118914 -78623 -55464 -12561 25996 -58941 -9372
15183 -9372 54101 18870 2958 48844 81980 64870 -73915 -49877 44728 242589 276989
15172 276989 166671 27659 -30286 -55774 -117862 -85173 -60419 -23939 121929 150700 65936
15161 65936 -37040 -25407 48110 4073 -58561 -130155 -50850 130579 333459 268105 172555
$$ packed form
15239B0098k5355j30863p935k628M0005j10869p5452N1900K6990l5128L8119L9501
15227a71617Q2056j20099O675R0994n6706Q8050J94283K1240j39402m1676J47054
15216A00852K6273j26752r5668j8715Q2275M0407k2190r870O6355J06897l5618
15205A14246j18425q1537m9954L8926J4821L1364L2384K9217l3120O2462Q7918
15194A28302j8179O869m9501j40484m5921M0291K3159M2903L8557q4937M9569
15183i372O3473l5231j5912M5886L3136j7110j38785K4038R4605J97861L4400
15172B76989j10318j39012n7945k5488o2088L2689K4754L6480J45868K8771q4764
15161F5936j02976J1633P3517m4037o2634p1594P9305J81429K02880o5354r5550
$$ plain form
15150 172555 88233 42886 -1596 -24623 35637 65129 9 61383 126238 168343 189212
15139 189212 179925 97816 91721 8480 -71107 -81687 -91010 -13960 -16551 -44715 -52720 54375
15127 54375 256212 306315 257297 192625 62315 -40144 9227 8676 -141831 -193327 -165684
15116 -165684 -130618 -84702 -63380 -42640 -89718 -73242 -27735 -76072 -143904 -116212 -23480
15105 -23480 3920 -24052 9094 -37874 15479 46257 41483 57981 73030 28346 -12650 -57790
15093 -57790 -3074 67609 53382 101831 40344 20232 105909 89760 91326 105222 53624 21837
15081 21837 19980 116858 130107 -14151 -23522 87765 79175 -39431 -67105 -48933 9290 -16205
15069 -16205 43287 29530 27994 105539 99029 73888 116615 104905 124741 131688 133267 165865
$$ packed form
15150A72555q4322m5347m4482k3027O0260K9492o5120O1374O4855M2105K0869
15139A89212r287q2109o095q3241p9587j0580r323P7050k591k8164q005J07095
15127E4375K01837N0103m9018o4672j30310j02459M9371n51j50507n1496K7643
15116a65684L5066M5916K1322K0740m7078J6476M5507m8337o7832K7692R2732
15105b3480K7400k7972L3146m6968N3353L0778m774J6498J5049m4684m0996m5140
15093e7790N4716P0683j4227M8449o1487k0112Q5677j6149J566J3896n1598l1787
15081B1837j857R6878J3249j44258r371J11287q590j18606k7674J8172N8223k5495
15069a6205N9492j3757j536P7545o510k5141M2727j1710J9836O947J579L2598
$$ plain form
15057 165865 82324 57248 50747 184082 128374 26603 -47341 -119506 -75217 -40370 3426
15046 3426 54271 47387 123390 72590 -25544 -57621 -67637 22242 44405 13944 -23757 -50785
15034 -50785 -111155 -81597 -43198 -1700 22260 86460 120934 59670 1388 -17096 -72130 -56361
15022 -56361 58552 98608 119527 75688 -17297 -14402 -780 -60847 -97896 -558 73086 10449
15010 10449 -135625 -196010 -158367 -88332 -27277 12622 41903 132251 124761 221622 154403 132037
14998 132037 121714 131410 132172 -33606 -72948 63396 63543 -68671 -95333 -102554 -94221 -48320
14986 -48320 47101 -7045 63098 81869 97817 23260 -17349 -75531 -85518 -114571 -100665 -48636
14974 -48636 -36450 -47653 15645 -46786 -85813 -12025 10527 53847 -47454 -133555 -245668
$$ packed form
15057A65865q3541k5076o501J33335n5708j01771p3944p2165M4289L4847M3796
15046C426N0845o884P6003n0800r8134l2077j0016Q9879K2163l0461l7701k7028
15034e0785o0370K9558L8399M1498K3960O4200L4474o1264n8282j8484n5034J5769
15022e6361J14913M0056K0919m3839r2985K895J3622o0067l7049R7338P3644o2637
15010A0449j46074o0385L7643P0035O1055L9899K9281R0348p490R6861o7219k2366
14998A32037j0323R696P62j65778l9342J36344J47j32214k6662p221Q333M5901
14986d8320R5421n4146P0143J8771J5948p4557m0609n8182r987k9053J3906N2029
14974d8636J2186j1203O3298o2431l9027P3788K2552M3320j01301q6101j12113
$$ plain form
14963 -245668 -100302 42112 50723 12952 -31265 -41760 40093 96558 -53936 -182626 -142429
14952 -142429 -131773 -115080 -59837 13165 -37709 -7802 13108 6304 -85142 -65195 -58871 2270
14940 2270 27270 -83121 -126478 -53899 -48250 -19792 -87717 -170055 -160771 -150445 -80231 97178
14928 97178 146646 67926 -54028 -71174 -5796 970 -56529 1771 -20168 -105582 -112880 -69388
14916 -69388 99007 31333 -59082 -102273 -100801 -44197 -33981 18602 156277 97266 5707
14905 5707 -65767 -1021 109734 54683 10848 15732 -29774 -83071 -97921 35466 104091 37153
14893 37153 55062 190903 145990 86233 163929 232642 225496 124207 -31452 -22282 -27862 81426
14881 81426 99807 -9623 -45800 -28624 7280 54945 22634 4564 28763 102848 126698
$$ packed form
14963b45668J45366J42414Q611l7771m4217j0495Q1853N6465j50494j28690M0197
14952a42429J0656J6693N5243P3002n0874K9907K0910o804r1446J9947O324O1141
14940B270K5000j10391m3357P2579N649K8458o7925q2338R284J0326P0214J77409
14928I7178M9468p8720j21954j7146O5378O766n7499N8300k1939q5414p298M3492
14916f9388J68395o7674r0415m3191J472N6604J0216N2583J37675n9011r1559
14905E707p1474O4746J10755n5051m3835M884m5506n3297j4850J33387O8625o6938
14893C7153J7909J35841m4913n9757P7696O8713p146j01289j55659R170n580J09288
14881H1426J8381j09430l6177J7176L5904M7665l2311j8070K4199P4085K3850
$$ plain form
14870 126698 63021 12211 -12385 -39762 -104579 -113885 -51785 15361 -1174 -3659 -78160 -101073
14858 -101073 32045 14680 -19380 -1512 7126 -56064 -59501 -22106 -16092 76089 106907 36983
14846 36983 50570 32145 -36816 -95754 -174177 -142536 -83304 13334 -15284 -122601 -2629
14835 -2629 134314 123277 110555 106749 22639 -21627 46110 111880 4399 -68307 -109232 -63
14823 -63 53255 76728 87817 72811 -960 -38767 -76565 -108872 -151942 -87943 -74278 -35039
14811 -35039 94631 130141 32149 -30183 81731 73992 27816 9102 -42793 -32840 26053 4366
14799 4366 -40196 -16930 -140239 -165337 -90199 -18453 54993 1328 -89091 -111643 -89655 -1186
14787 -1186 67964 13488 31010 64035 91081 198232 211789 172312 189137 141168 20616
$$ packed form
14870A26698o3677n0810k4596k7377o4817r306O2100O7146j6535k485p4501k2913
14858a01073J33118j7365l4060J7868Q638o3190l437L7395O014R2181L0818o9924
14846C6983J3587j8425o8961n8938p8423L1641N9232R6638k8618j07317J19972
14835b629J36943j1037j2722l806q4110m4266O7737O5770j07481p2706m0925J09169
14823f3N3318K3473J1089j5006p3771l7807l7798l2307m3070O3999J3665L9239
14811c5039J29670L5510r7992o2332J11914p739m6176j8714n1895R953N8893k1687
14799D366m4562K3266j23309k5098P5138P1746P3446n3665r0419k2552K1988Q8469
14787a186O9150n4476J7522L3025K7046J07151J3557l9477J6825m7969j20552
$$ plain form
14776 20616 -68515 -142145 -227624 -160481 -69908 -42724 -18827 2736 27093 25145 -44003 -104342
14764 -104342 -61466 -62260 -17325 -23919 -18478 -84438 -53942 1561 1810 33293 80535 202588
14752 202588 243706 153739 122761 81108 128611 37234 -117876 -187327 -104163 -140533 -166003
14741 -166003 -142170 -131403 -127846 -223785 -97276 -28713 -62268 -9027 -72768 -2682 98879
14730 98879 41208 -29712 3982 106615 64083 -7601 58442 -69804 -157559 -40745 76972
14719 76972 62570 97837 84953 -8195 -4841 -89567 -64215 43291 108165 45305 596 -71845
14707 -71845 -18370 57159 2852 -88011 -82854 3344 -27933 -17746 31608 101834 157962 109635
14695 109635 15753 23884 -48543 -103985 -60096 -43400 -87515 -16163 82707 65303 112002 114821
$$ packed form
14776B0616q9131p3630q5479O7143R0573K7184K3897K1563K4357j948o9148o0339
14764a04342M2876p94M4935o594N441o5960L0496N5503K49L1483M7242J22053
14752B02588M1118q9967l0978m1653M7503r1377j55110o9451Q3164l6370k5470
14741a66003K3833J0767L557r5939J26509O8563l3555N3241o3741P0086J01561
14730I8879n7671p0920L3694J02633m2532p1684O6043j28246q7755J16814J17717
14719G6972j4402L5267j2884r3148L354q4726K5352J07506O4874o2860m4709p2441
14707g1845N3475P5529n4307r0863N157Q6198l1277J0187M9354P0226N6128m8327
14695A09635r3882Q131p2427n5442M3889J6696m4115P1352R8870j7404M6699K819
$$ plain form
14683 114821 4208 -99449 46903 45135 -113660 -158632 -90641 4337 44598 76449 32423
14672 32423 65238 -11465 -32781 -95166 -124082 -80051 8612 36472 16097 -75350 -132666 -125507
14660 -125507 -46156 70663 81227 -76821 -1355 53235 83769 88755 53082 -13666 1970
14649 1970 29779 35930 33659 44977 -8279 -71003 -157506 -161291 -110344 -2156 34260 -108245
14637 -108245 -152205 -131378 -110874 -39090 -34263 -74610 -93633 -118540 -10848 86779 4716
14626 4716 -27162 -23171 60845 43754 -8458 60794 95776 -3681 -56749 -87838 -99504 -125089
14614 -125089 -88974 -70319 -6185 18059 149966 187039 222256 223870 146585 144793 238580 191702
14602 191702 158874 39714 72546 60561 31242 -97 121720 225229 151684 102230 12389
$$ packed form
14683A14821j10613j03657J46352j768j58795m4972O7991R4978M0261L1851m4026
14672C2423L2815p6703k1316o2385k8916M4031Q8663K7860k0375r1447n7316P159
14660a25507P9351J16819J0564j58048P5466N4590L0534M986l5673o6748J5636
14649A970K7809O151k271J1318n3256o2724q6503l785N0947J08188L6416j42505
14637a08245m3960K0827K0504P1784M827m0347j9023k4907J07692R7627q2063
14626D716l1878L991Q4016j7091n2212O9252L4982r9457n3068l1089j1666k5585
14614a25089L6115J8655O4134K4244J31907L7073L5217J614p7285j792R3787m6878
14602A91702l2828j19160L2832j1985k9319l1339J21817J03509p3545m9454q9841
$$ plain form
14591 12389 -41422 -50711 -160038 -113289 -53905 -65644 -70277 -79339 -83985 -70706 34383 44625
14579 44625 91350 27736 -13347 -28718 -39114 -41621 13099 86324 58842 -507 -141190 -107803
14567 -107803 -100730 51533 161504 146308 38760 -167037 -197834 -19873 -90680 -128874 -102336
14556 -102336 -88713 -47804 -63708 -31702 93311 141692 78741 -5808 50886 65158 -66522
14545 -66522 -100280 -53320 -38134 -70455 -28537 26935 10774 49269 80462 81593 153241 191779
14533 191779 216055 95721 64724 56998 134635 152099 234024 258735 156929 -92122 -34103
14522 -34103 56963 37212 970 -200646 -305342 -218603 -102857 12806 23506 -4359 30529
14511 30529 77891 95427 63003 64661 -13173 -87422 -68817 -12019 -54762 -67988 9019 43530
$$ packed form
14591A2389n3811r289j09327M6749N9384j1739m633r062m646J3279J05089J0242
14579D4625M6725o3614m1083j5371j0396k507N4720P3225k7482n9349j40683L3387
14567a07803P073J52263J09971j5196j07548k05797l0797J77961p0807l8194K6538
14556a02336J3623M0909j5904L2006J25013M8381o2951q4549N6694J4272j31680
14545f6522l3758M6960J5186l2321M1918N5472j6161L8495L1193J131P1648L8538
14533A91779K4276j20334l0997p726P7637J7464Q1925K4711j01806k49051N8019
14522c4103R1066j9751l6242k01616j04696Q6739J15746J15663J0700k7865L4888
14511C0529M7362J7536l2424J658p7834p4249J8605N6798m2743j3226P7007L4511
$$ plain form
14499 43530 -8070 -31595 30103 37923 32454 60927 11256 7485 5841 -2219 -29037 -119931 -32020
14486 -32020 38490 61720 8234 -39722 -42348 -84864 -142129 -80220 -60191 -156636 -147499 -203523
14474 -203523 -167985 -131949 -115703 -9553 124085 138529 63082 92237 173861 233372 190310
14463 190310 121092 13860 -68034 -12644 22224 -30797 -57768 -40317 -61588 -4074 49963
14452 49963 88096 95265 119290 48836 13754 -19560 -43241 34956 114522 34245 -26729 66022
14440 66022 74801 10444 122030 256809 93079 30756 -16194 -70354 -64029 -64052 64954 74523
14428 74523 39265 -34080 -166013 -149049 -131858 -169929 -90497 -88242 -171915 -215796 -176997 -44390
14416 -44390 41882 124240 101243 142994 28402 53599 83277 35884 33822 3095 95719 190430
$$ packed form
14499D3530n1600k3525O1698P820n469K8473m9671l771j644q060k6818r0894Q7911
14486c2020P0510K3230n3486m7956k626m2516n7265O1909K0029r6445R137n6024
14474b03523L5538L6036J6246J06150J33638J4444p5447K9155Q1624N9511m3062
14463A90310o9218j07232q1894N5390L4868n3021k6971J7451k1271N7514N4037
14452D9963L8133P169K4025p0454l5082l3314k3681P8197P9566q0277o0974R2751
14440F6022Q779o4357J11586J34779j63730o2323m6950n4160O325k3J29006R569
14428G4523l5258p3345j31933J6964J7191l8071P9432K255q3673m3881L8799J32607
14416d4390Q6272Q2358k2997M1751j14592K5197K9678m7393k062l0727R2624R4711
$$ plain form
14404 190430 106930 -26762 -69524 -103562 15905 83040 178748 160030 157824 134302 164774
14393 164774 230752 123090 50154 96723 115197 67133 42313 3501 -23476 -28942 39578
14382 39578 130752 160869 151562 161936 82464 38762 68020 41029 95110 111107 148257 131516
14370 131516 91124 -41443 -83095 -82774 -44040 -40415 40458 48183 40976 61285 68068 113150
14358 113150 -36145 -79960 -34954 48631 -8066 -50765 -44183 -33668 92910 189297 157688
14347 157688 108717 90525 56582 -43196 -58246 18981 100559 57298 122518 159598 55445
14336 55445 -55932 -126154 -96191 -36867 27799 102265 179483 286562 322949 292156 262332
14325 262332 266011 228621 298665 274152 169269 205534 229869 198868 316209 216089 10344
$$ packed form
14404A90430q3500j33692m2762l4038J19467O7135R5708j8718k206k3522L0472
14393A64774O5978j07662p2936M6569J8474m8064k4820l8812k6977n466O8520
14382C9578R1174L0117r307J0374p9472m3702K9258k6991N4081J5997L7150j6741
14370A31516m0392j32567m1652L21L8734L625Q0873P725p207K0309O783M5082
14358A13150j49295m3815M5006Q3585n6697m2699O582J0515J26578R6387l1609
14347A57688m8971j8192l3943r9778j5050P7227Q1578m3261O5220L7080j04153
14336E5445j11377p0222K9963N9324O4666P4466P7218J07079L6387l0793k9824
14325B62332L679l7390P0044k4513j04883L6265K4335l1001J17341j00120k05745
$$ plain form
14314 10344 -86337 -114848 -82689 -43592 -29015 -6735 38777 48022 28243 19999 63973 17036
14302 17036 -14600 -39801 -49116 -51702 -93446 -12670 47220 163619 257961 286771 293458 212692
14290 212692 146543 176519 157422 166311 270107 251640 152090 99630 44831 -58996 -101479
14279 -101479 -81398 -92197 55136 21221 -70633 51108 59209 -87655 -145925 -69593 -64252
14268 -64252 -53868 -63818 61904 74706 22874 -62474 -58360 -177201 -293395 -243546 -159287
14257 -159287 -108731 -189558 -146905 -24991 14734 -141693 -157121 -223115 -264283 -300582 -299290
14246 -299290 -208798 -135331 -116230 -121350 -110216 -38420 -20068 -74821 -138309 -131124 -103127 -27433
14234 -27433 -22800 -71148 1634 43678 -32309 26282 32997 46855 5508 -103516 -156705 -163466
$$ packed form
14314A0344r6681k8511L2159L9097J4577K2280M5512R245j9779q244M3974m6937
14302A7036l1636k5201r315k586m1744Q0776N9890J16399R4342K8810O687q0766
14290B12692o6149K9976j9097Q889J03796j8467r9550n2460n4799j03827m2483
14279a01479K0081j0799J47333l3915r1854J21741Q101j46864n8270P6332N341
14268f4252J0384r950J25722J2802n1832q5348M114j18841j16194M9849Q4259
14257a59287N0556q0827M2653J21914L9725j56427j5428o5994m1168l6299J292
14246b99290R0492P3467J9101n120J1134P1796J8352n4753o3488P185K7997P5694
14234b7433M633m8348P2782M2044p5987N8591O715J3858m1347j09024n3189o761
$$ plain form
14222 -163466 -141294 -17869 82223 131732 38208 -18145 -15672 -34963 26021 64039 37829
14211 37829 -6314 -96196 -51544 -29276 52116 30564 30514 63928 126613 179819 199620 174194
14199 174194 123984 9727 8387 42018 44647 57031 97536 118336 25938 16181 41553 53252
14187 53252 23103 -125762 -116593 -68002 -18790 -11821 -68102 -73857 -29776 9855 15651 68231
14175 68231 111568 115042 68275 -25901 -78444 -55939 -82751 61755 42133 -15946 12655 131824
14163 131824 52340 -36234 14660 -64064 -2775 54344 24371 75356 9315 -119619 -199932
14152 -199932 -153116 -87991 -27448 -27506 -50833 -25657 -36928 55761 75135 67656 54016 71043
14140 71043 -28605 -19754 47456 77123 162118 171094 89160 -30650 -63737 -67307 -58770 -16302
$$ packed form
14222a63466K2172J23425J00092M9509r3524n6353K473j9291O0984L8018k6210
14211C7829m4143q9882M4652K2268Q1392k1552n0L3414O2685N3206J9801k5426
14199A74194n0210j14257j340L3631K629J2384M0505K0800r2398r757K5372J1699
14187E3252l0149j48865R169M8591M9212O969n6281n755M4081L9631N796N2580
14175F8231M3337L474m6767r4176n2543K2505k6812J44506j9622n8079K8601J19169
14163A31824p9484q8574N0894p8724O1289N7119k9973N0985o6041j28934q0313
14152a99932M6816O5125O0543n8k3327K5176j1271R2689J9374p479j3640J7027
14140G1043r9648Q851O7210K9667Q4995Q976q1934j19810l3087l570Q537M2468
$$ plain form
14128 -16302 -48851 -20287 131986 182443 115676 56317 41213 -30531 -45625 -71784 -83040
14117 -83040 -43160 -119208 -170089 -190695 -146422 -138307 -136664 -117302 5813 118168 43554 20401
14105 20401 27444 -5223 -14535 -19850 -3336 3622 -64283 -207867 -268883 -229414 -68126 117256
14093 117256 94197 -14980 -58978 -72850 2403 92987 6484 59881 129340 95590 97077
14082 97077 44733 -92265 -112735 -85829 -40419 -55102 -65068 -41512 -7034 78327 74029 73783
14070 73783 -2180 -22514 1431 51891 17524 -89289 -36862 -114667 -83663 1559 89067
14059 89067 94124 51272 53771 79130 140228 117781 -24248 -116000 -135555 -109621 -46326 5876
14047 5876 81580 -6664 -61703 -65754 -52068 -70841 -29319 60689 39291 -77403 -126482 -30238
$$ packed form
14128a6302l2549K8564J52273N0457o6767n9359j5104p1744j5094k6159j1256
14117h3040L9880p6048n0881k0606M4273Q115J643J9362J23115J12355p4614k3153
14105B0401P043l2667r312n315J6514O958o7905j43584o1016L9469J61288J85382
14093A17256k3059j09177m3998j3872P5253R0584q6503N3397O9459l3750J487
14082I7077n2344j36998k0470K6906M5410j4683r966K3556L4478Q5361m298k46
14070G3783p5963k0334K3945N0460l4367j06813N2427p7805L1004Q5222Q7508
14059H9067N057m2852K499K5359O1098k2447j42029r1752j9555K5934O3295N2202
14047E876P5704q8244n5039m051J3686j8773M1522R0008k1398j16694m9079R6244
$$ plain form
14035 -30238 120485 113669 78391 22655 31142 33768 -45334 -74183 -137972 -156711 -112078 -133280
14023 -133280 -75269 -11499 18704 -6167 -81693 -160203 -178794 -129164 45552 82360 -53403
14012 -53403 -77700 -103428 -68574 -17729 -15961 -26120 -107084 -52192 26381 16482 2092 -40554
14000 -40554 -95719 -130291 -167871 19944 114524 177739 160931 199058 221342 189333 171231
13989 171231 106017 69713 79719 121949 113457 45132 -69785 -97255 62726 114724 158234
13978 158234 142181 104180 77434 54307 27151 29868 28820 -14782 -60878 -58220 -47631 -83033
13966 -83033 -21494 70101 32468 -67008 -177501 -112985 -36809 -56811 -82570 -123911 -198080
13955 -198080 -187420 -128824 24725 12854 -97296 -21503 1601 -12007 -8334 3839 -31095
$$ packed form
14035c0238J50723o816l5278n5736Q487K626p9102k8849o3789j8739M4633k1202
14023a33280N8011O3770L0203k4871p5526p8510j8591M9630J74716L6808j35763
14012e3403k4297k5728L4854N0845J768j0159q0964N4892P8573r899j4390m2646
14000d0554n5165l4572l7580J87815R4580O3215j6808L8127K2284l2009j8102
13989A71231o5214l6304J0006M2230q492o8325j14917k7470J59981N1998M3510
13978A58234j6053l8001k6746k3127k7156K717j048m3602m6096K658J0589l5402
13966h3033O1539R1595l7633r9476j10493O4516P6176k0002k5759m1341p4169
13955a98080J0660N8596J53549j1871j10150P5793K3104j3608L673J2173l4934
$$ plain form
13944 -31095 40052 93464 86950 14002 29750 -6204 -110330 -118114 -90909 50672 85850 125456
13932 125456 44840 6876 130299 124175 108030 167996 192734 153193 -25629 -55820 8524
13921 8524 -23625 -45794 -79503 13745 72635 4423 17393 52437 38622 67565 116281 208803
13909 208803 190760 127586 54891 30562 -59733 -41191 38852 66834 65143 54133 -28230 56206
13897 56206 -32893 -71370 -12164 110181 98494 30593 18770 52313 45047 4800 792 -3135
13885 -3135 78178 167631 123071 -65254 -179226 -235124 -215380 -224483 -218645 -265832 -183178 -137137
13873 -137137 -115742 -197000 -116067 -77822 -68780 -63611 34340 145219 131043 120088 50283 58133
13861 58133 143290 164115 119809 76398 101721 176050 237414 196465 60133 -26751 -49011
$$ packed form
13944c1095P1147N3412o514p2948J5748l5954j04126p784K7205J41581L5178L9606
13932A25456q0616l7964J23423o124j6145N9966K4738l9541j78822l0191O4344
13921H524l2149k2169l3709R3248N8890o8212J2970L5044j3815K8943M8716R2522
13909B08803j8043o3174p2695k4329r0295J8542Q0043K7982j691j1010q2363Q4436
13897E6206q9099l8477N9206J22345j1687o7901j1823L3543p266m0247m008l927
13885c135Q1313Q9453m4560j88325j13972n5898J9744r103N838m7187Q2654M6041
13873a37137K1395q1258Q0933L8245R042N169R7951J10879j4176j0955o9805P850
13861E8133Q5157K0825m4306m3411K5323P4329O1364m0949j36332q6884k2260
$$ plain form
13850 -49011 -90229 -127993 -188565 -265429 -284087 -142889 -46350 -17589 67522 108286 33462
13839 33462 16451 49953 43540 41551 109712 180489 114612 14082 59441 73249 122555 24111
13827 24111 -107971 -104138 -78927 19085 138001 136874 56711 63940 136697 155975 140659 -2579
13815 -2579 -64389 69414 109346 86902 91144 116613 90265 25289 -6018 -69214 -60386 -2609
13803 -2609 42754 17682 -6480 -27123 1277 -69019 -63467 -89353 -1232 77882 47171 15323
13791 15323 -41179 -34209 14307 6577 92190 115247 1274 -170246 -167175 -124411 -81799 -103583
13779 -103583 -163184 -63601 85932 38059 -20895 -9640 -38677 -72460 -134971 -192840 -219338
13768 -219338 -205623 -144806 -193923 -122802 -12750 -10351 1969 34279 -48084 -26501 -78326
$$ packed form
13850d9011m1218l7764o0572p6864j8658J41198R6539K8761Q5111M0764p4824
13839C3462j7011L3502o413j989O8161P0777o5877j00530M5359J3808M9306r8444
13827B4111j32082L833K5211R8012J18916j127q0163P229P2757J9278j5316j43238
13815b579o1810J33803L9932k2444M242K5469k6348o4976l1307o3196Q828N7777
13803b609M5363k5072k4162k0643K8400p0296N552k5886Q8121P9114l0711l1848
13791A5323n6502O970M8516p730Q5613K3057j13973j71520L071M2764M2612k1784
13779a03583n9601R9583J49533m7873n8954J1255k9037l3783o2511n7869k6498
13768b19338J3715O0817m9117P1121J10052K399J2320L2310q2363K1583n1825
$$ plain form
13757 -78326 -32149 -35710 -43708 6730 -36605 -62294 -100277 -102895 -87777 -185638 -138607 -100281
13745 -100281 -169597 -50259 -93756 -135597 -12750 77092 -9288 -68711 -35490 -62660 -119335
13734 -119335 -164874 -122063 -25824 75498 25272 48448 40479 -16946 -751 6689 -107645
13723 -107645 -118489 45118 -1497 -8532 2563 -48453 -60372 -180067 -144829 -91260 -44859
13712 -44859 -67531 -87196 -217182 -218616 -140770 -74374 -77217 29141 75535 126076 59257 -52357
13700 -52357 -59087 81122 87026 70994 14463 -28683 -10606 54356 24955 -21727 -29162 -127077
13688 -127077 -100712 4716 76442 23952 -57457 -44579 18287 80556 93468 123152 36314
13677 36314 -29727 -36163 -5360 124675 130734 106592 135859 158661 133121 95378 107579 139285
$$ packed form
13757g8326M6177l561p998N0438m3335k5689l7983k618J5118r7861M7031L8326
13745a00281o9316J19338m3497m1841J22847Q9842q6380n9423L3221k7170n6675
13734a19335m5539M2811R6239J01322n0226K3176p969n7425J6195P440j14334
13723a07645j0844J63607m6615p035J1095n1016j1919j19695L5238N3569M6401
13712d4859k2672j9665j29986j434P7846O6396k843J06358M6394N0541o6819j11614
13700e2357o730J40209N904j6032n6531m3146J8077O4962k9401m6682p435r7915
13688a27077K6365J05428P1726n2490q1409J2878O2866O2269J2912K9684q6838
13677C6314o6041o436L0803J30035O059k4142K9267K2802k5540l7743J2201L1706
$$ plain form
13665 139285 96544 115363 84630 61651 106510 152721 96091 65109 8993 95982 94723 61004
13653 61004 3373 71210 89626 36498 61637 115411 97882 -9218 -27807 -43687 -62411
13642 -62411 -104504 -187880 -172251 -142636 -46980 17409 20769 -38710 -31083 -47552 -100780 -76697
13630 -76697 -48912 -22059 59231 53955 53813 -2153 -89897 -104671 -62917 56293 115848 106333
13618 106333 48915 56586 62263 -17918 -34659 62826 69279 -19313 -11496 20505 -2090 2914
13606 2914 39094 84002 121791 126653 42342 -11573 -127740 -82567 -18940 -153388 -133311 -56667
13594 -56667 -34441 -7809 69894 56902 95475 45162 11470 -59704 -91500 -93858 23084 30015
13582 30015 -79365 -78464 18546 35407 -7322 -6582 -20511 -93908 -96916 -30830 24506 75694
$$ packed form
13665A39285m2741J8819l0733k2979M4859M6211n6630l0982n6116Q6989j259l3719
13653F1004n7631O7837J8416n3128K5139N3774j7529j07100j8589j5880j8724
13642f2411m2093q3376J5629K9615R5656O4389L360n9479P627j6469n3228K4083
13630g6697K7785K6853Q1290n276j42n5966q7744j4774M1754J19210N9555r515
13618A06333n7418P671N677q0181j6741R7485O453q8592P817L2001k2595N004
13606B914L6180M4908L7789M862q4311n3915j16167M5173O3627j34448K0077P6644
13594e6667K2226K6632P7703j2992L8573n0313l3692p1174l1796k358J16942O931
13582C0015j09380R01R7010J6861m2729P40j3929p3397l008O6086N5336N1188
$$ plain form
13570 75694 9577 -89990 -189979 -156995 -141827 -154220 -124883 -63842 10426 75755 35024 50545
13558 50545 27085 -73592 -109347 -73321 -115758 -62691 -21987 -53684 -9463 64432 96474
13547 96474 182439 211201 196814 226787 133218 125758 120806 139588 99041 -3531 57056 39307
13535 39307 -31358 51710 108234 44496 3532 16044 44452 127876 150520 100104 46854 -39664
13523 -39664 18672 60367 43936 86358 83878 -65185 -11240 30133 46474 44561 24406 37179
13511 37179 92982 79511 59932 15975 78398 37858 125343 191067 90203 78106 128311
13500 128311 112181 -8052 -235063 -270632 -181357 -109518 -135163 -141139 -63461 -75929 -89824
13489 -89824 -18471 -32490 -72531 -27549 -7461 554 23702 8717 36607 127764 130480 100158
$$ packed form
13570G5694o6117r9567r9989L2984J5168j2393K9337O1041P4268O5329m0731J5521
13558E0545k3460j00677l5755L6026m2437N3067M0704l1697M4221P3895L2042
13547I6474Q5965K8762j4387K9973r3569p460m952J8782m0547j02572O0587j7749
13535C9307p0665Q3068N6524o3738m0964J2512K8408Q3424K2644n0416n3250q6518
13523c9664N8336M1695j6431M2422k480j49063N3945M1373J6341j913k0155J2773
13511C7179N5803j3471j9579m3957O2423m0540Q7485O5724j00864j2097N0205
13500A28311j6130j20233k27011l5569Q9275P1839k5645n976P7678j2468j3895
13489h9824P1353j4019m0041M4982K0088Q015K3148j4985K7890R1157K716l0322
$$ plain form
13477 100158 48041 -24828 -60375 -113842 -103763 -15702 -9790 -18056 -109532 -129760 -105034 -9953
13465 -9953 21098 14800 105218 105177 17321 31374 49331 -19528 -19309 -66004 -52759 -99022 -36191
13452 -36191 10112 -27425 -104027 -116287 -17698 19583 100715 91296 85529 149503 159788 119626
13440 119626 157334 23513 -32984 89078 790 -119028 -183756 -75976 18181 17235 -28612
13429 -28612 -41754 -94158 -197192 -118750 62972 100885 55090 66557 89020 116094 159208
13418 159208 250719 283132 173988 185439 242776 166035 84024 43806 9421 30428 78241
13407 78241 62076 124350 145910 13594 -85142 -153798 -141094 -114400 -88153 -80516 -168823 -197638
13395 -197638 -92287 -120804 -184600 -126913 -78950 -29755 79761 95470 122861 167835 85181
$$ packed form
13477A00158n2117p2869l5547n3467J0079Q8061N912q266r1476k0228K4726R5081
13465i953L1051o298R0418m1q7856J4053J7957o8859K19m6695J3245m6263O2831
13452c6191M6303l7537p6602j2260R8589L7281Q1132r419n767O3974J0285m0162
13440A19626L7708j33821n6497J22062q8288j19818o4728J07780R4157r46m5847
13429b8612j3142n2404j03034P8442J81722L7913m5795J1467K2463K7074M3114
13418A59208R1511L2413j09144J1451N7337p6741q2011m0218l4385K1007M7813
13407G8241j6165O2274K1560j32316r8736o8656J2704K6694K6247P637q8307k8815
13395a97638J05351k8517o3796N7687M7963M9195J09516J5709K7391M4974q2654
$$ plain form
13384 85181 90296 -13531 -31830 -27598 112027 217978 260035 228518 102454 -32319 9252
13373 9252 107354 132748 58736 22008 18818 -51099 -28629 -55163 -113864 -38620 -16513 -71657
13361 -71657 -7362 12463 -21073 48608 51852 -33279 -55167 18696 96573 95581 55417 37012
13349 37012 1992 -8877 -41512 -38405 -22525 -18885 -140669 -245466 -206540 -96238 -16063
13338 -16063 -83579 -79306 -35388 -119942 -128855 -210270 -193178 -63471 2321 52891 97382 65232
13326 65232 -50456 -31199 -5309 -32540 50112 120285 106019 4643 -62639 -55649 2899
13315 2899 -44129 -66835 -107999 -148551 -123717 -119221 -83033 -64398 -83625 -80155 -99131 -123182
13303 -123182 -108965 -95374 -83546 -137682 -141476 -181278 -241083 -228668 -103338 7578 -9205
$$ packed form
13384H5181N115j03827j8299M232J39625J05951M2057l1517j26064j34773M1571
13373I252R8102K5394p4012l6728l190o9917K2470k6534n8701P5244K2107n5144
13361g1657O4295J9825l3536O9681L244q5131k1888P3863P7877r92m0164j8405
13349C7012l5020j0869l2635L107J5880L640j21784j04797L8926J10302Q0175
13338a6063o7516M273M3918q4554q913q1415J7092J29707O5792N0570M4491l2150
13326F5232j15688J9257K5890k7231Q2652P0173j4266j01376o7282O990N8548
13315B899m7028k2706m1164m0552K4834M496L6188J8635j9227L470j8976k4051
13303a23182J4217J3591J1828n4136l794l9802n9805J2415J25330J10916j6783
$$ plain form
13292 -9205 -84022 -82858 31059 149088 97762 31004 111375 97700 47271 69676 132317 63175
13280 63175 -72709 -221673 -199431 -118533 -116034 -122987 -44331 11776 2631 10711 15225 79430
13268 79430 71830 58538 125413 79877 100385 112538 83629 39571 61028 117023 151205 111720
13256 111720 139298 150993 172624 133449 110326 32259 -90644 -46040 -11443 -112326 -88401
13245 -88401 -85569 -244314 -173965 -121016 -110679 -37589 -18194 4793 33870 22564 -136177
13234 -136177 -211521 -116820 -65963 -52370 -129767 -93642 -116451 -103594 56426 14875 -93180
13223 -93180 -102467 -41165 5110 18298 84011 189544 133445 -25387 -114010 -132769 -97724
13212 -97724 42257 191270 225200 191736 119036 139274 68495 34260 88730 157235 112535
$$ packed form
13292i205p4817J164J13917J18029n1326o6758Q0371j3675n0429K2405O2641o9142
13280F3175j35884j48964K2242Q0898K499o953P8656N6107r145Q080M514O4205
13268G9430p600j3292O6875m5536K0508J2153k8909m4058K1457N5995L4182l9485
13256A11720K7578J1695K1631l9175k3123p8067j22903M4604L4597j00883K3925
13245h8401K832j58745P0349N2949J0337P3090J9395K2987K9077j1306j58741
13234a36177p5344R4701N0857J3593p7397L6125k2809J2857J60020m1551j08055
13223i3180r287O1302M6275J3188O5713J05533n6099j58832q8623j8759L5045
13212i7724J39981J49013L3930l3464p2700K0238p0779l4235N4470O8505m4700
$$ plain form
13201 112535 34940 9157 1709 43094 120211 188158 152385 42985 -16873 -39826 12745
13190 12745 56673 -102556 -128540 -129361 -96779 -40668 -40766 -18281 53125 -20160 -159365 -182862
13178 -182862 -107953 -73842 -122502 -98014 31440 2223 -22865 112313 112980 26994 648
13167 648 46453 62259 70359 54492 -3076 -8218 59253 105439 124273 78584 9185 15713 -7393
13154 -7393 5571 -14949 60052 72933 87087 266442 269394 203440 173524 78533 25410 -17178
13142 -17178 38842 46055 15309 6298 -34885 -78755 11478 29235 -27257 -79044 -99133 -143517
13130 -143517 -293626 -294970 -154467 -32136 -86557 -56037 69457 112514 81390 58129 74075
13119 74075 -35605 -94825 -140703 -107814 -65614 -21409 95439 126149 13616 -37289 -44341
$$ packed form
13201A12535p7595k5783p448M1385P7117O7947l5773j09400n9858k2953N2571
13190A2745M3928j59229k5984q21L2582N6111r8K2485P1406p3285j39205k3497
13178a82862P4909L4111m8660K4488J29454k9217k5088J35178O67q5986k6346
13167F48M5805J5806Q100j5867n7568n142O7471M6186J8834m5689o9399O528k3106
13154g393J2964k0520P5001J2881J4154J79355K952o5954k9916r4991n3123m2588
13142a7178N6020P213l0746r011m1183m3870R0233J7757n6492n1787k0089m4384
13130a43517j50109j344J40503J22331n4421L0520J25494M3057l1124k3261J5946
13119G4075j09680n9220m5878L2889M2200M4205J16848L0710j12533n0905p052
$$ plain form
13108 -44341 -36023 -38229 48270 185998 307768 331495 327611 284626 198499 190274 183955 327438
13096 327438 302025 222067 291625 223861 104421 59049 30835 47359 -4998 10210 9077
13085 9077 -5950 -7916 10154 46025 19761 -19654 -108683 -78528 -29557 -15985 51273 14809
13073 14809 34912 -13174 -102302 -70568 -34034 -4885 61292 96003 -6556 -50605 -98456
13062 -98456 -111565 -51009 -79902 -16454 33556 81258 128631 121406 24650 -20150 12939 -61435
13050 -61435 -4857 2814 -13523 34564 62851 59389 30648 26001 -83500 -135534 -111693 -91613
13038 -91613 1776 27374 -41298 3956 -77001 -226214 -234087 -123498 -75416 -143133 -47873
13027 -47873 5729 321 34461 33080 -64082 -77992 -127565 -35429 87007 85145 40586 -37530
$$ packed form
13108d4341Q318k206Q6499J37728J21770K3727l884m2985q6127q225o319J43483
13096C27438k5413p9958O9558o7764j19440m5372k8214J6524n2357J5208j133
13085I077j5027j966J8070L5871k6264l9415q9029L0155M8971J3572O7258l6464
13073A4809K0103m8086q9128L1734L6534K9149O6177L4711j02559m4049m7851
13062i8456j3109O0556k8893O3448N0010M7702M7373p225r6756m4800L3089p4374
13050f1435N6578P671j6337M8087K8287l462k8741m647j09501n2034K3841K0080
13038i1613R3389K5598o8672M5254q0957j49213p873J10589M8082o7717R5260
13027d7873N3602n408L4140j381r7162j3910m9573R2136J22436j862m4559p8116
$$ plain form
13015 -37530 -104914 -13780 50271 37536 32289 -24660 -88469 1419 6679 2645 33867 -54355
13003 -54355 -61822 -48415 -8915 80931 70907 -113025 -66306 -39135 -78579 -83222 -54311 -19064
12991 -19064 55812 130062 143860 55224 53560 28492 -22951 -17881 -8829 47536 97848 85057
$$ packed form
13015c7530o7384R1134O4051j2735n247n6949o3809Q9888N260m034L1222q8222
13003e4355p467J3407L9500Q9846j0024j83932M6719K7171l9444m643K8911L5247
12991a9064P4876P4250J3798q8636j664k5068n1443N070R052N6365N0312j2791
$$ [...]
##END NTUPLES=NMR SPECTRUM
##END=
