##TITLE=Analysis number 329854
Compound Code cc 67009
Book Reference 508/136
Project Code adrs
Chemist Name antons
##JCAMPDX= 6.0         $$ Bruker NMR JCAMP-DX V2.0
##DATA TYPE= NMR SPECTRUM
##DATA CLASS= NTUPLES
##ORIGIN= Bruker BioSpin GmbH
##OWNER= nmr
$$ XWIN-NMR		Version 3.5
$$ Thu Oct  4 08:37:38 2007 GMT Daylight Time (UT+1h)  MAYBRIDGE\nmr@NMR_250MHZ
##.OBSERVE FREQUENCY= 250.131544655141
##.OBSERVE NUCLEUS= ^1H
##.ACQUISITION MODE= SIMULTANEOUS (DQD)
##.ACQUISITION SCHEME= undefined
##.AVERAGES= 16
##.DIGITISER RES= 18
##SPECTROMETER/DATA SYSTEM= dpx250
##.PULSE SEQUENCE= zg30
##.SOLVENT NAME= CDCl3
##.SHIFT REFERENCE= (INTERNAL, CDCl3, 0, 16.4502)
##AUDIT TRAIL= $$ (NUMBER, WHEN, WHO, WHERE, WHAT)
$$ ##TITLE= Audit trail, XWIN-NMR		Version 3.5
$$ ##JCAMPDX= 5.01
$$ ##ORIGIN= Bruker BioSpin GmbH
$$ ##OWNER= nmr
$$ C:\u/data/dgb/nmr/ADRS/260/pdata/1/auditp.txt
$$ ##AUDIT TRAIL=  $$ (NUMBER, WHEN, WHO, WHERE, WHAT)
(   1,<2007-10-04 08:37:00.33 +100>,<MAYBRIDGE\nmr>,<NMR_250MHZ>,
      <created by zg, POWCHK disabled, PULCHK disabled
       configuration hash MD5:
       76 6E 9A 78 1E 09 19 81 EC 84 63 8F B0 6A 59 2D
       data hash MD5: 64K
       39 0F 10 26 54 47 06 63 20 7B 8E F0 C0 74 7C EE>)
(   2,<2007-10-04 08:37:25.72 +100>,<MAYBRIDGE\nmr>,<NMR_250MHZ>,
      <Start of raw data processing
       ef LB = 0.3 FT_mod = 6 PKNL = 1 SI = 32K 
       data hash MD5: 32K
       28 87 85 54 FE 34 37 8A D9 3C 6B 96 53 E0 A9 A3>)
(   3,<2007-10-04 08:37:28.83 +100>,<MAYBRIDGE\nmr>,<NMR_250MHZ>,
      <apk 
       data hash MD5: 32K
       A9 19 A8 DB 59 0D 0C E2 5C 62 1D 92 23 C5 BB 16>)
(   4,<2007-10-04 08:37:30.69 +100>,<MAYBRIDGE\nmr>,<NMR_250MHZ>,
      <abs ABSG = 5 
       data hash MD5: 32K
       D6 8E E2 FF 70 7B 39 CD 4E FA 67 EA 46 45 C4 D2>)
$$ ##END=
$$ 
$$ hash MD5
$$ 6E 64 F2 77 74 5B 4A 3D 23 73 A8 5E 0A F8 FD BC
##$RELAX= 
##$RELAX= 
##$RELAX= 
##$RELAX= 
##$RELAX= 
##$RELAX= 
##$RELAX= 
$$ Bruker specific parameters
$$ --------------------------
##$DU= <C:\u>
##$EXPNO= 260
##$NAME= <ADRS>
##$PROCNO= 1
##$TYPE= <nmr>
##$USER= <dgb>
##$AMP= (0..31)
100 100 100 100 100 100 100 100 100 100 100 100 100 100 100 100 100 100 
100 100 100 100 100 100 100 100 100 100 100 100 100 100 
##$AQSEQ= 0
##$AQ_mod= 3
##$AUNM= <au_zg>
##$AUTOPOS= <55 >
##$BF1= 250.13
##$BF2= 250.13
##$BF3= 250.13
##$BF4= 250.13
##$BF5= 500.13
##$BF6= 500.13
##$BF7= 500.13
##$BF8= 500.13
##$BYTORDA= 1
##$CFDGTYP= 0
##$CFRGTYP= 5
##$CHEMSTR= <none>
##$CNST= (0..31)
1 1 145 1 1 1 1 1 1 1 1 1 1 1 1 1 1 1 1 1 1 1 1 1 1 1 1 1 1 1 1 1 
##$CPDPRG= <>
##$CPDPRG1= <>
##$CPDPRG2= <>
##$CPDPRG3= <>
##$CPDPRG4= <mlev>
##$CPDPRG5= <mlev>
##$CPDPRG6= <mlev>
##$CPDPRG7= <mlev>
##$CPDPRG8= <mlev>
##$CPDPRGB= <>
##$CPDPRGT= <>
##$D= (0..31)
0 1 0 0 0 0 0 0 0 0.06 0 0 0 0 0 0 0.0002 0 0 0 0 0 0 0 0 0 0 0 0 0 0 
0 
##$DATE= 1191483417
##$DBL= (0..7)
120 120 120 120 120 120 120 120 
##$DBP= (0..7)
150 150 150 150 150 150 150 150 
##$DBP07= 0
##$DBPNAM0= <>
##$DBPNAM1= <>
$$ [...]
##$SUBNAM7= <"">
##$SUBNAM8= <"">
##$SUBNAM9= <"">
##$SW= 20.6930455092707
##$SWIBOX= (0..15)
0 0 3 0 0 0 0 0 0 0 0 0 0 0 0 0 
##$SW_h= 5175.983436853
##$TD= 65536
##$TD0= 1
##$TE= 296.16
##$TE2= 300
##$TE3= 300
##$TEG= 300
##$TL= (0..7)
0 120 120 120 120 120 120 120 
##$TP= (0..7)
150 150 150 150 150 150 150 150 
##$TP07= 0
##$TPNAME0= <>
##$TPNAME1= <>
##$TPNAME2= <>
##$TPNAME3= <>
##$TPNAME4= <>
##$TPNAME5= <>
##$TPNAME6= <>
##$TPNAME7= <>
##$TPOAL= (0..7)
0.5 0.5 0.5 0.5 0.5 0.5 0.5 0.5 
##$TPOFFS= (0..7)
0 0 0 0 0 0 0 0 
##$TUNHIN= 0
##$TUNHOUT= 0
##$TUNXOUT= 0
##$USERA1= <user>
##$USERA2= <user>
##$USERA3= <user>
##$USERA4= <user>
##$USERA5= <user>
##$V9= 5
##$VALIST= <valist>
##$VCLIST= <CCCCCCCCCCCCCCC>
##$VD= 0
##$VDLIST= <DDDDDDDDDDDDDDD>
##$VPLIST= <PPPPPPPPPPPPPPP>
##$VTLIST= <TTTTTTTTTTTTTTT>
##$WBST= 1024
##$WBSW= 4
##$XGAIN= (0..3)
0 0 0 0 
##$XL= 0
##$YL= 0
##$YMAX_a= 189775
##$YMIN_a= -355948
##$ZGOPTNS= <>
##$ZL1= 120
##$ZL2= 120
##$ZL3= 120
##$ZL4= 120
##$ABSF1= 16.45017
##$ABSF2= -4.243002
##$ABSG= 5
##$ABSL= 3
##$ALPHA= 0
##$AQORDER= 0
##$ASSFAC= 0
##$ASSFACI= 0
##$ASSFACX= 0
##$ASSWID= 0
##$AUNMP= <proc_1d>
##$AZFE= 0.1
##$AZFW= 0.1
##$BCFW= 0
##$BC_mod= 0
##$BYTORDP= 0
##$COROFFS= 0
##$CY= 12.5
##$DATMOD= 1
##$DC= 0
##$DFILT= <>
##$DTYPP= 0
##$F1P= 14.0000005364418
##$F2P= -0.99999901652339
##$FCOR= 0.5
##$FTSIZE= 32768
##$FT_mod= 6
##$GAMMA= 0
##$GB= 0
##$INTBC= 1
##$INTSCL= 1
##$ISEN= 128
##$LB= 0.3
##$LEV0= 0
##$LPBIN= 0
##$MAXI= 10000
##$MC2= 0
##$MEAN= 0
##$ME_mod= 0
##$MI= 0
##$NCOEF= 0
##$NC_proc= -5
##$NLEV= 6
##$NOISF1= 0
##$NOISF2= 0
##$NSP= 0
##$NTH_PI= 0
##$NZP= 0
##$OFFSET= 16.45017
##$PC= 1
##$PHC0= 161.727
##$PHC1= 3.46471
##$PH_mod= 1
##$PKNL= yes
##$PPARMOD= 0
##$PSCAL= 4
##$PSIGN= 0
##$REVERSE= no
##$SF= 250.13001796535
##$SI= 32768
##$SIGF1= 0
##$SIGF2= 0
##$SINO= 400
##$SIOLD= 32768
##$SREGLST= <1H.CDCl3>
##$SSB= 0
##$STSI= 32768
##$STSR= 0
##$SW_p= 5175.98343685301
##$SYMM= 0
##$S_DEV= 0
##$TDeff= 65536
##$TDoff= 0
##$TI= <Analysis number 999999
Compound Code 99
Book Reference 9
Project Code 9>
##$TILT= no
##$TM1= 0
##$TM2= 0
##$TOPLEV= 0
##$USERP1= <user>
##$USERP2= <user>
##$USERP3= <user>
##$USERP4= <user>
##$USERP5= <user>
##$WDW= 1
##$XDIM= 32768
##$YMAX_p= 430628245
##$YMIN_p= -966100
$$ End of Bruker specific parameters
$$ ---------------------------------
##NTUPLES= NMR SPECTRUM
##VAR_NAME=  FREQUENCY,     SPECTRUM/REAL,   SPECTRUM/IMAG
##SYMBOL=    X,             R,               I
##VAR_TYPE=  INDEPENDENT,   DEPENDENT,       DEPENDENT
##VAR_FORM=  AFFN,          ASDF,            ASDF
##VAR_DIM=   32768,         32768,           32768
##UNITS=     HZ,            ARBITRARY UNITS, ARBITRARY UNITS
##FACTOR=    0.157963299565203, 1,           1
##FIRST=     4114.68144694222, 0,            0
##LAST=      -1061.30198991079, 0,           0
##MIN=       -1061.30198991079, -966100,     0
##MAX=       4114.68144694222, 430628245,    0
$$ Real data points
##PAGE= N=1
##DATA TABLE= (X++(R..R)), XYDATA
$$ [...]
27525 -680 -93927 -138406 -67944 -74756 -102322 -13305 134176 -10649 -272163 -650103 -453487
27514 -453487 -88712 -97596 121642 114389 194744 132097 96658 76195 18352 -114568 -260441
27503 -260441 -63323 57573 31837 -33456 -5148 -43058 -92842 -137784 -95179 -20325 -70878
27492 -70878 -183887 -234841 -416602 -304001 -389915 -477589 -635363 -599266 -257373 229443
27482 229443 498280 443715 53827 -207066 -241354 -53928 -16769 -177622 62783 353926
27472 353926 601653 564388 287771 42262 -124891 -397356 -317449 136002 89668 -91503
27462 -91503 -97480 106528 133452 66559 21662 -100722 -351154 -264683 166353 7898 -169606
27451 -169606 41493 372525 169763 -189313 -68943 50929 209713 420602 393384 114988
27441 114988 37508 -162747 -162688 -45473 -80290 225226 160671 66092 142659 394105 474203
27430 474203 466146 553346 593555 144201 134870 311390 505722 387253 95706 -41248 18544
27419 18544 -1444 -224409 -263912 -14532 106212 159296 217323 11102 -245521 -300381 -200231
27408 -200231 -16505 -74878 24797 -119093 -185498 -175523 -185880 -300541 -417589 -285152 12798
27397 12798 -121055 -106669 75249 166354 -6973 -27223 -89916 -104721 118801 146816 41841
27386 41841 263 28309 353443 417904 239392 100980 49246 51339 162734 228532 125296
27375 125296 128082 183310 75095 -51908 -272889 -300586 125775 313484 191442 194289 306464
27364 306464 238809 -66717 -88070 -21099 -3869 46127 -17526 -163023 -197675 -91788 39228
27353 39228 145053 374091 449759 297426 250936 71908 -46036 -146788 -6016 111421
27343 111421 99700 38133 154668 372552 568281 644426 420290 485463 372067 310409
27333 310409 237099 298206 349879 163306 -39649 76998 194192 149179 12317 -39593
27323 -39593 216335 382655 499885 576516 553247 403676 422939 330831 238921 273880 33745
27312 33745 -164636 -39082 -137387 -138382 67063 296599 304895 150827 31819 -192304 -434158
27301 -434158 -318110 -147592 -72507 -87443 -360851 -270045 -4912 -11676 88825 199700
27291 199700 273852 227072 118395 130192 266743 319372 227006 -48342 90800 467817
27281 467817 546551 357013 15207 -32369 -129752 -242664 -305939 -314150 57885 160250 60161
27270 60161 -78776 -20952 94967 -35876 29110 284321 219255 -23728 120838 260235
27260 260235 79514 90169 70918 164838 284993 93264 219017 344284 286209 259808
27250 259808 318020 194404 -42528 10432 -90500 -13690 -165971 -471818 -470164 -417888 -250782
27239 -250782 -96657 -188972 -297486 -270374 -19448 67800 148353 -32434 -252480 -457086
27229 -457086 -201121 -2456 61703 -74878 66068 115255 -19996 -6103 23066 -55671
27219 -55671 -193592 10992 198731 441885 349682 114175 -131642 -230937 -113014 -220677
27209 -220677 -105847 -76861 50060 -199564 -375884 -254231 -291001 -459882 -436536 -152628
27199 -152628 -194182 -322786 -130768 5416 136908 280729 41535 108530 231991 32187
27189 32187 -198317 -107716 -421263 -784209 -691993 -517312 -427462 -158534 162779 176708
27179 176708 15661 -204661 136091 408497 225701 -17192 62699 41661 219883 158028
27169 158028 -140225 -287060 -340467 -267641 -71142 125837 242947 296994 264806 255632 231643
27158 231643 174081 62536 40869 89828 83123 -52660 -74513 134408 -195112 -500753 -232750
27147 -232750 -40745 -113275 -270636 -407190 -297956 86679 68665 113397 184737 146361
27137 146361 126155 164168 35545 -114703 -393793 -636274 -630201 -210534 -66529 -98180
27127 -98180 124566 232279 166846 225238 169475 -182060 -319703 -354985 -382994 -266486 -231896
27116 -231896 -333768 -93595 222987 118459 3974 163848 150840 53184 81900 -106874
27106 -106874 -63150 -82958 32478 60615 192442 126428 4504 -117608 -108606 -180919 -330154
27095 -330154 -372745 -356998 -170925 -68694 -111747 -28195 129851 62068 -1452 12777 -117257
27084 -117257 -114356 9635 -111567 -99103 -127385 -190868 -167686 -233357 7449 169705 39958
27073 39958 -220288 -421108 -283874 -189827 -16885 30437 -270990 -156234 -192838 -323875
27063 -323875 -323195 -172535 -57195 303736 347196 -21002 -173491 -272721 -519238 -556764 -339888
27052 -339888 -191707 -336611 -151544 112971 245529 277582 352225 205895 -162212 -35815
27042 -35815 176456 152547 92675 -157228 -294031 -280226 -116196 -32988 48164 -41593 -80867
27031 -80867 -335562 -424982 -459297 -360598 -194265 82345 94592 133014 199397 300552 380956
27020 380956 256579 124686 82498 72583 206986 300135 92875 46975 194367 292413 251559
27009 251559 185706 137195 103324 6755 34779 190754 207054 380052 197907 139634 123692
26998 123692 201719 287184 316177 18252 -97136 -2914 -22124 102560 97084 358088 346467
26987 346467 -21518 250502 461323 137488 -86131 -147323 -213968 -309334 -275211 -195721
26977 -195721 -220010 -313657 -106391 -80202 -193112 -348850 -465313 -432096 -238087 -206840
26967 -206840 -174738 -84546 15054 -141573 19035 29111 113255 169729 37885 38034 -560
26956 -560 -67494 143948 8007 -154111 -362662 -390299 -314577 -203838 -176965 -201860 -173506
26945 -173506 -103765 49172 169786 227149 270746 239821 -7140 -179740 -331288 -313267
26935 -313267 -304620 -151695 -123998 -22429 -130759 20691 319721 -12015 -409021 -458279
26925 -458279 -242071 -195443 -176303 -325351 -318893 -295506 -135501 -69277 73332 -109268 -104726
26914 -104726 -77098 67271 -71529 -131116 -82547 188238 217996 44203 23647 105181 45093
26903 45093 -79324 20280 97018 319790 359914 207437 330075 364832 377540 278665 228342
26892 228342 200047 425523 426847 326374 -22142 -185835 -233866 -267148 -28195 135649
26882 135649 -5207 -53845 -108138 -2700 147414 231778 244330 109202 -67680 -49936
26872 -49936 -25471 -37490 -266994 -341273 -140128 32438 -96761 -47063 165867 170799 -79859
26861 -79859 -261469 -169947 190140 453203 231597 164381 186489 258156 409736 236850
26851 236850 -47205 -212705 -196837 -188825 -197834 163822 189688 431507 493942 232149 367724
26840 367724 352324 126596 -73226 -89229 -100227 -165605 -132193 -16526 -184243 -160166 -162238
26829 -162238 -140973 17463 293259 524056 389048 193263 204402 100746 174096 207258
26819 207258 200272 262283 209108 262576 528016 439423 179983 -66166 -100809 233 129853
26808 129853 203745 59139 95205 251939 429121 499155 84634 -225451 -314570 -178308
26798 -178308 324430 247797 156053 199332 114065 -41577 -252834 -607 195979 213624
26788 213624 32017 -121904 -95974 -47904 37329 -22282 -24417 256485 124989 109409 197066
26777 197066 37196 -14097 32832 160398 211697 215068 -21860 -254409 -266544 -211727 -54077
26766 -54077 -96332 -225854 -351742 -202153 -215250 -200643 -242056 -83049 -160412 -274577 -217550
26755 -217550 -150972 -72562 34595 127202 -7998 -57751 -214243 -57916 129241 323852
26745 323852 343216 382146 381760 378683 400032 168622 40056 -86487 91986 209101 295648
26734 295648 327895 359920 393577 359828 226876 18638 -238071 -322807 -425189 -197998
26724 -197998 -67948 80338 -32586 -2249 100000 58440 -19314 67193 173773 -216032
26714 -216032 -311384 -428007 -285959 6620 223472 335188 283868 292147 273237 300756 239163
26703 239163 397580 314256 161951 134912 -216597 -302539 -177729 -21385 75574 180028
26693 180028 276601 86301 21272 11807 -22890 -73038 -51433 -190428 -154145 -91182 -28204
26682 -28204 48247 194588 87479 123622 15586 186122 548530 444972 242909 45391
26672 45391 -142477 -238993 -86198 -83523 -159057 -109492 -62309 -23002 -95135 -64867 -27167
26661 -27167 44177 179047 95150 131935 -18265 -117523 -126099 -157467 -184190 -33941 -11333
26650 -11333 -71240 -133615 -107067 34671 161098 179201 92726 -14465 -54518 30547 -11490
26639 -11490 -34569 -105329 -179308 -276551 -17133 15996 -24873 -142082 -158702 -405684 -353728
26628 -353728 -228220 -300074 -40198 330841 317073 347796 329882 127427 65285 122476 -20876
26617 -20876 113690 184476 7011 19670 -145496 -138797 -83909 -16911 44361 122770 -57801
26606 -57801 -176677 -290527 -139032 127984 196320 202755 83495 298764 306212 148060 178013
26595 178013 305426 311189 286172 254058 230753 -12125 -133937 -46208 -32492 92304 137361
26584 137361 199855 -180607 -476377 -585116 -299780 -175487 -28858 7327 12899 -204396
26574 -204396 -222352 -80580 228837 101364 58237 40022 179205 271898 401837 255855
26564 255855 157673 156782 329115 493390 469783 420906 308702 421998 458061 478643 334288
26553 334288 306523 274700 376640 460321 243983 357954 173915 -108164 -105567 -71206 65025
26542 65025 203871 115362 70865 116415 27097 -30293 -161290 -172261 -79517 52239 230420
26531 230420 345499 129409 95762 58490 -155347 -229712 -103359 51202 127917 92994
26521 92994 23734 -16627 -6505 -200137 -196211 8385 142531 -110124 -192082 -256296 -353523
26510 -353523 -234920 -328380 -151110 -19567 96953 -69177 78504 167103 -201832 -75291
26500 -75291 109173 11935 -217786 15343 216204 136277 128493 110663 148233 -19408 18645
26489 18645 -20545 -20004 14168 154041 194054 71689 -45069 -113210 -123526 40224 98511
26478 98511 201631 208342 -23258 -114637 11359 -38370 -21989 -102653 -145579 -153003 -344618
26467 -344618 -259451 96938 345516 224542 94219 -43701 -62891 -122307 -2976 131679
26457 131679 148319 33078 227501 105605 29220 -134293 -113896 -151137 -269624 -232460
26447 -232460 -225838 -103606 150392 364051 378052 61202 -133180 -152211 -155124 -164993 -17591
26436 -17591 -161402 -150632 -157279 -86465 -162375 -56151 -13416 102847 242522 33145 24471
26425 24471 294480 378356 29539 -97023 18884 -219546 -219209 25624 286867 288301 237837
26414 237837 182553 -41462 79616 175823 12163 75965 139817 114722 -19078 -80279 -108585
26403 -108585 -133243 -148783 27631 4252 -196040 -246484 47846 51359 -20954 6514 206790
26392 206790 309188 281723 45890 -51861 84767 195332 41834 -196030 -251216 -163810
26382 -163810 -97586 107864 206328 291071 335893 312496 139332 225245 11697 6960 263872
26371 263872 221626 155817 405702 436556 185045 137809 67771 104660 13820 -52273 4631
26360 4631 -17825 -126805 -57806 -92091 -324227 -99111 -209644 -335243 -318408 -435680 -433237
26349 -433237 -305177 -9002 16013 -131101 -327926 -270208 -104397 2151 -90456 -6054
26339 -6054 -51698 -30822 61680 98822 -124745 -339309 -251551 -63825 -153173 -287277 -180480
26328 -180480 -81230 -130413 -65727 85222 -1703 -173929 -340029 -301753 -62501 -248383
26318 -248383 -410656 -536248 -427551 -174762 -24872 1998 124675 90827 -34112 -114256
26308 -114256 -15452 -16199 39116 56515 12437 85356 -57416 -79423 -221086 -233339 -100404
26297 -100404 107542 -60900 -136916 30349 37655 -185272 -313157 -284897 -65060 30971
26287 30971 30501 131533 128902 116521 50037 -38820 84131 195215 -66573 -242442 -117319
26276 -117319 146542 173042 109545 15232 -73566 -113367 -187291 -340382 -295571 -313098 -204504
26265 -204504 164483 341537 187854 -127026 -299386 -362763 -364579 -61176 204487 210269
26255 210269 281935 218229 201183 248941 128319 205713 533712 368720 -42597 -192415
26245 -192415 -358793 -200410 65969 53108 170561 220725 62997 -344688 -462639 -46466
26235 -46466 97448 -70328 120122 137872 147552 193196 41934 -82597 132617 190190 88188
26224 88188 133050 195208 115251 -72823 -128754 110429 193646 53187 46743 57222 -218457
26213 -218457 -221153 -40345 -30039 -310462 -460993 -229136 -6376 23870 193340 165448
26203 165448 164793 94927 180814 227515 306082 2482 -235116 -119397 14889 90158 -85420
26192 -85420 -298890 -291361 -42488 166030 216917 229765 340420 253817 21019 -28567 -89603
26181 -89603 -79083 11072 -31939 -57047 -80097 -125040 -109301 -173981 -306516 -285287 -178730
26170 -178730 -207511 -80392 -811 -114317 -26743 201432 111289 283308 305215 333878 185000
26159 185000 149027 191402 199062 84018 -168503 -276371 -238105 -130162 39915 109231 88257
26148 88257 161935 319014 344335 293670 274865 147787 -43944 -157853 -415362 -431825 -146362
26137 -146362 -160555 -218154 5242 304941 440152 476955 292975 -10870 -169819 -173595
26127 -173595 -204752 -144887 -35476 63546 -123604 -125973 51576 336102 220751 181673 389394
26116 389394 346269 257782 204069 -169980 -325276 -194921 -169837 -79177 -207656 -355499
26106 -355499 -294907 8118 324455 405048 409476 498109 559776 504244 466350 404140 378458
26095 378458 476904 346041 378722 311117 268035 -18059 -150559 -180593 -236414 -340704 -222739
26084 -222739 -115871 -281479 -286926 -107937 -53944 88303 120814 168317 118007 219584 399332
26073 399332 254272 183876 -17272 -210095 -102743 -49811 11350 163009 224361 193370
26063 193370 54301 15990 160202 258315 171393 -9009 -80090 111434 113252 337276 477170
26052 477170 466664 242668 51511 111286 165901 -83022 -244584 -131853 39970 -109758
26042 -109758 -161149 1541 82329 107374 79211 10102 -81687 -43516 64204 -289590 -467339
26031 -467339 -134578 221594 156316 -24835 -194858 -410204 -480510 -428940 -269324 18578
26021 18578 161831 317500 237389 219551 179992 318051 337662 -82773 -369425 -449752 -337098
26010 -337098 -421325 -478900 -448027 -286355 -396875 -154392 23712 -43307 -129853 -219847 -342972
25999 -342972 -239686 340 18171 51425 10787 151980 14195 -168535 -67645 -24174
25989 -24174 -92892 127516 92588 -60945 -84508 22510 26361 1712 -64923 914 -25973
25978 -25973 -136474 -36048 -131337 -32476 -65112 -301902 -469551 -242627 63154 84224
25968 84224 374281 269290 -11931 -29767 8948 -32078 127142 195673 82467 5628 -41855
25957 -41855 34580 -199966 -199783 730 170876 125910 81420 -150985 -90934 82151 4484
25946 4484 -82028 -118042 -193164 -255716 1259 159185 479048 295694 153578 318372 333263
25935 333263 63745 -120029 5505 70143 35535 94949 207076 85890 87122 108321 27054
25924 27054 -87183 -278765 -168850 50908 92792 -107728 -165389 -109073 93086 292368
25914 292368 392299 192429 -28122 -254652 -339320 -204266 -279770 -339236 -213334 -47089
25904 -47089 -62102 59811 -12112 -115457 -193002 -106022 -65593 57060 -100034 -89287 140193
25893 140193 366595 435398 540753 393893 210325 150947 393529 433470 284976 309613
25883 309613 345918 110420 20103 31279 97338 310741 609482 631991 356453 270019 271334
25872 271334 110360 52129 -98764 -76382 -2031 -257568 -530046 -348106 -119358 242253
25862 242253 262711 47424 17874 49428 36760 77463 3282 30941 242177 342615 221052
25851 221052 161974 243020 100288 -24974 -32896 297015 476238 341206 230753 162644
25841 162644 85937 75251 84777 126550 -106203 -267201 -315059 -307532 -277519 -317131 -347787
25830 -347787 -207327 -84568 -91371 -60584 36554 112685 141061 349034 339266 184384 6920
25819 6920 -16171 49439 87334 315552 310250 281433 309756 40306 -65800 -7601 65980
25808 65980 175119 193207 176760 53728 -2368 76280 227592 381845 233029 227091 248114
25797 248114 160202 189344 -59554 -188399 -16056 199204 171739 390381 249963 -114671
25787 -114671 -52826 128258 41053 117858 39071 -136183 -28769 228790 100313 53701
25777 53701 57931 53044 79559 246026 123910 64375 -16856 -80371 51370 -30777 -44199
25766 -44199 -176456 -225190 7225 23105 -45298 23039 -49014 716 250365 196737 37885
25755 37885 89771 222787 380159 306220 265305 126059 30049 201081 187880 48203 50382
25744 50382 17383 -60808 -150050 -173066 -19781 29097 1680 -73228 25172 287739 275536
25733 275536 33415 -23267 78683 -81756 -185094 -117667 -157068 -139580 178802 242248
25723 242248 32789 17857 36187 160880 291087 89585 -73203 -92285 -112695 -82054
25713 -82054 -119294 116253 247744 381734 420466 439213 288874 -170385 -166307 -173090 -145496
25702 -145496 -2354 -95776 -175245 -59665 -162086 -381307 -359051 -328772 -260777 -319279 -258861
25691 -258861 -306420 -324951 -195735 -204602 -60614 21547 -60774 -52606 -21404 87920 196506
25680 196506 171075 49845 -150927 12730 63338 207349 232199 313564 323898 402391 119463
25669 119463 -109978 -146553 -13527 -8607 178047 286697 285318 41217 86442 -66804 -165307
25658 -165307 176 108613 117652 -33757 23295 46508 147790 287961 218985 257110 119402
25647 119402 -3330 105347 372936 272003 19099 -168586 -185640 -269438 -440486 -457623
25637 -457623 -512612 -564293 -364991 -53339 54782 159449 256548 346225 365879 392150 378299
25626 378299 327624 307358 396708 396038 398964 278566 39474 -171990 -166242 -298944 -507158
25615 -507158 -537020 -558545 -612682 -280069 -230929 63961 219767 170666 26713 92824 241377
25604 241377 274585 246608 403384 428505 537490 487073 476488 328186 236606 152292 52496
25593 52496 -87977 31955 28072 96946 46845 -34382 -134054 -118201 -56703 -72212 130504
25582 130504 205275 57778 55851 177762 64106 -240182 -268793 -242771 -94350 91654
25572 91654 362970 533956 470201 402741 407574 160037 -152595 -48036 108488 169223 139944
25561 139944 81373 -32366 -76793 -49758 -142726 -156832 -32880 61098 105283 62937 201088
25550 201088 -30576 -20581 59257 128475 212747 154071 -12739 -147920 -10994 6181 -62449
25539 -62449 -202621 -452323 -332905 -15256 288493 302949 361072 420437 205458 164862
25529 164862 88394 109380 138378 42892 -142911 -83138 69317 -73473 -166801 45671 -58295
25518 -58295 -155201 -329477 -193276 33176 -261785 -239354 -174296 -146411 -179070 -131363 -172563
25507 -172563 -272977 -227881 84367 222751 219769 384760 309506 193732 65396 -160322
25497 -160322 -250465 -157384 13613 -44813 -235390 -307104 -114993 108095 202094 472567
25487 472567 534326 410507 64259 127162 201187 213081 -115942 -402642 -232250 -103303
25477 -103303 135809 171791 279015 322246 328756 715910 621121 446133 349731 75411 190303
25466 190303 177394 174826 479526 538325 497012 403265 62562 -325509 -411260 -264810 -183587
25455 -183587 -25617 -64628 -71877 198621 307261 98079 -108001 -309843 -239024 36593
25445 36593 99888 30823 137913 96622 150824 81020 78088 292400 391255 153106 174902
25434 174902 219423 274826 398190 384554 110575 -209193 -374050 -421098 -194590 -10116
25424 -10116 99134 187062 195609 227689 301266 62019 170311 323246 192623 -40762 -62195
25413 -62195 -47578 -34002 -187178 -171275 -272565 -190192 1408 50701 306633 558427 509754
25402 509754 141073 66778 207168 541842 649619 492570 267625 22061 -86309 -39414
25392 -39414 -86153 -31719 -50345 99129 85955 133901 245536 143465 39995 116977 255578
25381 255578 437765 324864 171596 -204776 -286308 -227676 -116112 3241 28273 222925
25371 222925 265507 403955 181026 -104624 -179443 -93365 -47954 62222 -39293 229546
25361 229546 192287 205596 222677 251297 360537 350105 292989 128961 -149417 -147481 -62497
25350 -62497 178293 -22674 -277038 -348693 -525083 -394371 -291906 -75858 29059 60621
25340 60621 149121 178526 143202 312141 429927 536360 662609 619276 751375 487873
25330 487873 293560 184828 28502 -15737 202038 99681 -87562 -253713 -300502 -480240
25320 -480240 -207195 62937 346969 407157 95266 55079 -77909 172620 179026 18345
25310 18345 118160 24949 -322362 -363008 -148715 -160401 -187424 -111195 -52813 -30131 -60766
25299 -60766 -358783 -188391 26708 84369 151175 247163 147301 192836 267723 157651 -26522
25288 -26522 -135733 -153285 -376447 -505677 -360356 -99860 -150991 -356692 -249250 -299677
25278 -299677 -246752 -63472 -66592 -289996 -342662 -163913 21645 -48073 182483 314988
25268 314988 423614 382278 -94 -106073 -114827 -240465 -211524 -242056 -217975 -17949 153489
25257 153489 209610 210864 189068 170774 101463 195484 154939 85801 343654 617027 578335
25246 578335 332599 70181 -118812 -225037 -183084 -113255 81479 152002 168325 26732
25236 26732 -99034 -74284 -229804 -286998 -333875 -419740 -233689 73323 76161 -88229 -94677
25225 -94677 -251028 -158801 108368 120542 290688 -41795 -205748 -215528 -320048 -439996
25215 -439996 -191838 -2060 124141 -103998 -291469 -117449 -98965 -32374 -171328 -267150
25205 -267150 -166052 5185 -41524 179743 268738 279627 90620 168612 489381 470536
25195 470536 283722 318045 404608 289481 105934 76383 149096 159777 96610 198494 180207
25184 180207 169798 464645 340521 43791 -38376 -39765 325069 625437 623862 370331 315135
25173 315135 113855 -156130 -177653 -198583 -129811 64000 66867 9478 71013 79575 -165287
25162 -165287 -236234 -363717 -263145 59335 -59492 -78502 3135 -36038 -216277 -325693
25152 -325693 -317398 -132542 -128929 4323 171391 250595 149365 167343 129931 168390 283315
25141 283315 265359 204671 76650 -51043 -92289 -20610 11373 -107940 -137908 -323358 -483504
25130 -483504 -363142 -218174 -201517 -198381 -59817 -78975 -68257 -50480 -40251 -40990 68478
25119 68478 -57118 -361111 -482485 -363764 -289309 -224775 -45610 58700 40052 65867
25109 65867 104005 46244 -194032 -72665 289356 184847 -67281 -165946 14269 70075
25099 70075 50893 149984 23428 -76417 -135355 -198650 -282730 -265450 -224648 -46954 2332
25088 2332 -175871 -146066 -30126 46664 -123802 -101268 48132 88830 -100067 -220718 -111542
25077 -111542 -180167 -32690 135130 11355 -137370 -442272 -587701 -520579 -385228 -366368
25067 -366368 -134736 140581 177858 -85952 -186635 -66666 -184684 -102930 143420 75290
25057 75290 115941 500429 624482 600734 337800 213705 226962 298009 317133 299877 338563
25046 338563 85522 68583 -49196 -139530 55080 120585 78774 -187467 -460022 -492432
25036 -492432 -300088 -231473 -377656 -367032 -399721 -424086 -239004 -149566 48285 68516 -123509
25025 -123509 38294 194833 218336 261797 146126 72641 217676 -40172 -317512 -154988
25015 -154988 -6334 -239484 -447449 -473180 -245854 -175831 146435 276998 -37173 -35035
25005 -35035 -225851 -230043 110626 192297 -2758 75645 -168448 -92843 -20255 -218239 -409030
24994 -409030 -368359 -167594 -8866 70168 149893 58031 155287 149879 185223 148484 74213
24983 74213 203269 124859 51804 -38826 -87953 -231944 -369732 -371961 -414341 -47086 -60712
24972 -60712 35311 313722 289125 99699 -22168 85714 320439 419863 326688 219490
24962 219490 13239 -28840 100007 -65533 -104497 -122288 -421967 -422754 -268556 -300294 -390716
24951 -390716 -287939 -257984 -322223 -133956 -246219 -105868 61425 24320 -18863 -94422
24941 -94422 -314009 -342095 -214714 -197976 35190 272944 358874 298706 14324 301732
24931 301732 582947 390487 18206 16146 -16734 -38069 9147 -149769 -322816 -410655 -87014
24920 -87014 267953 301425 139064 -96638 -86583 -207024 15604 115608 12215 -59917
24910 -59917 -295263 -384606 -273742 -300890 -148008 112792 68413 139994 59370 -130445 -130795
24899 -130795 -83811 -257412 -60496 118761 -171980 -43174 296496 225912 114415 -126340
24889 -126340 -307304 -520161 -718585 -422474 -144078 -22816 -124191 -90242 6091 -57332
24879 -57332 -95323 -5620 -40459 -112056 -43048 -203669 -215069 -233578 -465268 -441974 -448300
24868 -448300 -491397 -105111 -39649 3695 95566 212600 151686 -13020 -486388 -608553
24858 -608553 -339990 -384427 -466879 -635901 -687387 -312178 35380 111084 -50786 -27164
24848 -27164 -68161 -222881 -207623 -199817 -22172 -21631 -87501 42386 90437 264128 433820
24837 433820 196706 -84782 -33369 -98840 14498 142618 -25285 -198462 -297021 -440624
24827 -440624 -205924 7248 63436 101071 -36471 -283479 -494996 -388359 -279577 -76844
24817 -76844 249052 318651 278951 146579 3664 43017 161734 302619 251340 64122
24807 64122 -3565 -44676 38942 88994 290496 362952 442554 346563 4130 -175739 -228157
24796 -228157 -127080 -195601 -192393 -258305 -204093 -64219 -81057 -213273 -193224 -1601 -61140
24785 -61140 -92099 208573 92953 -167659 -179044 -78375 82828 306451 161963 72161
24775 72161 -192557 -230991 -27204 35629 69701 38622 -19488 124607 305048 128307 -190611
24764 -190611 -378158 -208755 -31606 -147460 -50463 -128896 -82878 57291 134203 162312
24754 162312 254836 256523 223681 -153686 -307484 -372828 -258437 -134339 -294276 -347987 -223297
24743 -223297 -68911 349215 544674 562273 390718 185927 1813 58486 163819 295101
24733 295101 48195 -134834 -152642 -57905 -29688 -11849 -209781 -150631 53252 250119
24723 250119 316595 519804 367973 96817 -162790 -247757 -344995 -364439 -37521 106794
24713 106794 172548 8202 -147283 -185512 -402033 -559388 -582427 -382826 -223144 -26044
24703 -26044 397452 557128 341810 82646 44667 112382 -80929 -131990 -29140 -170770
24693 -170770 -209876 -84793 156913 43861 -37877 -30402 -114942 31872 214521 158204 20108
24682 20108 -107976 95520 280821 412004 322238 258815 124860 188541 192020 81740 80182
24671 80182 169487 304583 340244 443858 477704 179570 13075 -72500 -89053 -217608 -258736
24660 -258736 -243704 -144703 -306374 -406582 -399501 -359383 6615 -29185 -110720 92469 190378
24649 190378 9961 -124078 -80370 -4385 212186 278599 316346 46937 -121835 -266211
24639 -266211 -164763 37183 61885 207794 98731 -233018 -255915 -242270 -22250 135163
24629 135163 -82694 -81830 -83279 31336 109345 199489 104314 255525 228103 89259 942
24618 942 6295 19886 55388 228365 190351 349455 227560 51080 170470 142438 11308
24607 11308 -48308 -124269 -140130 -246067 -321963 48233 268527 221124 302185 291645 245968
24596 245968 182576 10160 98724 56536 -51841 -268542 -92583 54743 227076 228585
24586 228585 168586 222380 64319 -49251 -138055 9901 155332 186669 166036 2915
24576 2915 53386 -203294 -182829 5388 75149 196916 149256 141434 154733 206268 128794
24565 128794 40431 -48721 -188874 -294662 -189055 -78078 -224756 -281642 -28976 -138346
24555 -138346 -166130 -168980 -127715 -128287 -108068 -138783 -105925 34643 60639 -94134 -179444 -135295
24543 -135295 -4994 -48519 227915 159278 166917 314984 309826 366866 339918 40534 -60251
24532 -60251 -216931 -240147 -52661 15509 62412 -23707 -134553 -62563 27883 121325 152835
24521 152835 232905 57317 -24527 -50083 -218643 -263393 -252853 -236845 -90999 -124119 -164787
24510 -164787 -149784 -47510 -99590 -176165 -194128 -200305 -89462 -96296 -130874 -21719 32757
24499 32757 154781 422631 391248 350705 294391 89656 -100031 -47172 137948 212217 68738
24488 68738 74298 285705 122685 46506 -130519 -139577 -52885 414690 494097 498086 417962
24477 417962 -4339 -24014 94367 368454 450904 340242 293011 -2466 -127786 -45059
24467 -45059 15720 -194421 -251127 82241 373256 90274 -132361 -95688 -282211 -594818
24457 -594818 -685889 -363180 -254125 -413330 -173970 -82687 -18802 40165 -7272 108076
24447 108076 324175 370230 203920 -115900 -243185 -62836 -142999 -250314 -441268 -434094
24437 -434094 -445055 -385413 -289031 -138437 76813 71000 -1029 194389 370664 132948 -32488
24426 -32488 57653 102376 -62911 -95045 178155 67421 -197585 -202532 81838 78365 -133461
24415 -133461 -221904 -147523 22051 97094 -27842 -98921 25715 68843 -20674 -34880 -40
24404 -40 -137157 47590 -42734 -303360 -89704 -74328 115079 147508 310881 289558 327864
24393 327864 372640 504718 527543 272324 425734 421733 316160 217024 306823 141974 -266084
24382 -266084 -401719 -327279 -174077 -144103 -145729 -98469 -18119 133256 47266 54105 172079
24371 172079 356998 155500 121355 170737 190906 198599 198064 263807 377270 225015 147331
24360 147331 274161 114147 8369 -65715 44642 35209 28267 -192512 -444755 -449479 -56096
24349 -56096 51085 -140085 -307474 -569232 -555547 -125035 -105974 -193139 -238755 -116125
24339 -116125 11401 -69453 -140872 -165439 -473 -57820 -92768 -30068 -34549 89081 195742
24328 195742 185056 -89609 -141784 19222 79941 63448 -46865 18810 12454 -4524 -50723
24317 -50723 31402 -14882 -87055 -133868 -247525 -89657 -122387 -250399 -13282 68681 -44805
24306 -44805 276490 394967 151119 125505 266464 148402 -94687 -60175 37654 205948
24296 205948 -57187 -48765 150081 -13280 9754 -31374 57579 -301603 -383617 -159075 194930
24285 194930 217817 360762 137447 13342 -245207 -218974 -161708 -64161 -112577 -200184 -443953
24274 -443953 -84465 133738 85975 64796 151260 310039 311429 320837 324412 89467 -311047
24263 -311047 -286459 -131794 -335651 -329005 -166302 -49098 -127192 -247851 -125848 167985
24253 167985 382195 394663 232656 223899 178761 138373 37656 -146833 -214686 -217300 -150325
24242 -150325 -178617 8147 93736 274100 261230 -62523 -5889 -14420 -14290 74818 145495
24231 145495 153692 130443 62223 242910 382569 391094 524245 430459 483121 443611 422487
24220 422487 465558 583250 462930 209879 395223 287951 94813 117951 67413 37667
24210 37667 3859 -14623 19228 173235 236436 62742 -10404 139392 158845 185377 42647
24199 42647 -31029 7303 -82552 -271407 -137803 141387 226040 250405 130594 82936 182996
24188 182996 162758 96756 -41598 -239303 -133354 -76964 -143723 -62609 -37690 -66643 -130775
24177 -130775 -199788 -104331 -157119 -341571 -424631 -395682 -227393 -62739 117181 110098 -26368
24166 -26368 -72722 -94743 -121335 -197584 25442 298535 376166 109929 105243 95275 -53814
24155 -53814 -223934 -187798 -115861 -179115 711 61210 297487 345379 176761 17617 -160385
24144 -160385 -225708 -203027 -133487 160453 142313 116700 35171 -12991 -106363 -283113 -128306
24133 -128306 59069 131690 -64737 -171738 -128883 -122410 -20695 -83100 -107762 -107323 123057
24122 123057 193166 161862 42573 66262 -35917 -153280 -110571 235045 290292 314197 376600
24111 376600 354024 384681 252058 56080 -90603 -120075 -106843 24942 133483 185875
24101 185875 88734 85342 191044 326678 482400 454063 413203 412790 520184 520767 475156 513653
24089 513653 256898 -140223 -261439 -334463 -429521 -289895 -177550 -243787 -259712 -311110
24079 -311110 -312027 -188332 29472 -35464 -134683 11839 100194 55706 -54980 -265928 -289712
24068 -289712 -297829 -168295 -98528 55656 200887 181035 144177 -110184 -154359 -264837 -258512
24057 -258512 -400529 -433928 -338351 55178 259002 298279 267387 170938 -33537 81690
24047 81690 7063 -127567 -151114 -285249 -432271 -445520 -387620 -184910 -252257 -244424 -67957
24036 -67957 -174244 -114656 -96872 -113260 -164686 -211847 40585 61621 -170464 -340413 -127282
24025 -127282 99409 77069 -13096 -84655 -151588 -251970 -202432 -13597 392382 527301
24015 527301 644055 334174 48448 -151740 -205494 -76445 237464 216492 40132 -119871
24005 -119871 -10864 -527 -125409 -86195 77726 66680 68859 201147 128918 100196 224879
23994 224879 -7856 -475008 -290444 86591 297823 190169 164009 174842 -65913 -162821
23984 -162821 -60321 122208 44648 -91883 -95133 -185722 -418489 -311575 -117903 44622
23974 44622 -176735 -83270 17518 -63987 110982 190558 275883 266313 115207 323245 272683
23963 272683 198858 150808 -11545 -135811 -152693 -39788 -92939 41059 -75421 -143780
23953 -143780 -119031 -18354 22088 -193644 -267590 -419558 -203635 -24409 -36844 -45857 -81638
23942 -81638 -278192 -162374 -11137 166753 222011 99330 81781 230501 154379 -89496
23932 -89496 -342597 -299653 -422455 -335471 -173530 -134112 -20846 -112471 -338055 -384452 -340650
23921 -340650 -307595 -133799 287914 529607 353474 25420 -71015 -41380 43169 -35420
23911 -35420 -210886 -202581 -248581 -45539 120910 144450 318563 194257 19571 74995 192392
23900 192392 311821 119551 166339 156878 -5882 -243894 -138333 97647 257313 86602
23890 86602 -194574 -69520 -15194 -33626 -63563 -12767 -78901 324536 531100 436205 455213
23879 455213 466055 217340 114318 -41923 -105996 -46165 41671 1952 -59045 -152100 -34573
23868 -34573 67511 90431 327160 476667 209959 -101031 -128177 -88928 -122788 231695
23858 231695 244561 59274 -141805 -110255 -110022 -235773 -222459 -276669 -394185 -234893 -210798
23847 -210798 -248184 -376704 -2524 136435 -58622 87969 372857 172730 -109244 -288061
23837 -288061 -255099 -172881 -101604 -157540 -33522 23058 342661 330917 210776 205998 -27036
23826 -27036 -417677 -434815 -433753 -406404 -224120 -15423 -45049 -40077 -196091 -154657 55108
23815 55108 114972 473840 386725 57062 -79346 -48462 60571 18253 904 -77163 -22032
23804 -22032 -63808 -52258 40623 37000 -147781 -260534 -227540 5441 19564 -152821 -125645
23793 -125645 -256808 -336485 -300277 3972 121292 50362 12127 52616 97800 5078 -84877
23782 -84877 141420 233584 108097 -69300 -322024 -334109 -159415 -104072 -102807 -137881 -110457
23771 -110457 -95974 -187691 -98667 -37732 132686 186037 193900 -29222 -62569 -138083 -184910
23760 -184910 -123340 -12939 85910 -76832 -70580 -111824 -288622 -300618 -92977 -30013 -168765
23749 -168765 -250248 -26649 -25286 61682 90652 98030 32925 106678 7563 -135291 -210133
23738 -210133 -1720 233185 340567 257599 290259 117323 -39780 118501 275307 100144
23728 100144 -10309 -114117 28609 229736 274687 165995 142792 -84486 -141527 209846
23718 209846 405547 197638 19072 -109271 -96120 -25121 -124417 -108904 -65291 129713
23708 129713 290356 144152 -13033 -85160 -176893 -197300 -199276 -222611 96094 83816 103603
23697 103603 -116309 -474203 -190342 -88167 287658 320921 58895 -28198 -56692 -161493
23687 -161493 -253837 -294179 -142507 -202001 -302813 -212999 -304503 -401043 -304095 -250293 -203602
23676 -203602 -59597 5721 -181265 -174383 196078 274087 303461 281853 269099 201569 146126
23665 146126 -278244 -486094 -604379 -575780 -486123 -594939 -762493 -524466 -61805 56639
23655 56639 -95989 -266318 -199925 -255239 -235018 -128060 40194 -101200 -175580 -251557 -194592
23644 -194592 -235298 -128912 -197654 -548580 -547971 -479384 -253573 -25516 263399 252205 160729
23633 160729 22541 -151154 -261906 -457784 -499879 -405444 -188284 -308313 -451157 -327486
23623 -327486 -274348 -339419 -396799 -430934 -426739 -610772 -502544 25023 295503 176024 138628
23612 138628 153977 129657 169950 178299 89297 -88437 -90640 -142106 -168222 53963 190331
23601 190331 111663 -9085 -134669 -76602 -17333 -47221 -131007 -117759 62335 -263576 -321581
23590 -321581 -26400 218896 146611 -44844 -154506 -92780 -120946 -76910 -374835 -628945
23580 -628945 -623343 -525333 -232912 156168 13319 -170810 -147795 -103692 82470 195731
23570 195731 285078 352128 385403 289194 160510 143149 -30533 12640 -56526 40234 226333
23559 226333 233030 277814 245957 51427 -67261 -177935 73078 -53195 -178498 -121286
23549 -121286 101474 220349 68748 -101206 -122425 -64598 13515 188673 218675 234061
23539 234061 347234 173132 104873 99496 255731 355500 326368 152271 68417 71557 73354
23528 73354 -47085 -79812 -69300 -156267 1508 -126926 -151173 -103961 -42738 -155053 -56661
23517 -56661 -20764 183120 257893 255693 131030 173267 316236 387507 176251 49975 -45252
23506 -45252 -22229 166172 2809 -138416 -220690 -270937 -222718 -217941 -267894 -233196 -248884
23495 -248884 -246610 -296064 -333197 -341009 -320048 -300724 -38320 4659 -223517 -383191 -144225
23484 -144225 -130954 -54475 115400 14942 -314939 -440185 -224232 -107774 -145734 -193664
23474 -193664 -21946 -19927 -123463 -67513 -129278 -178967 -144450 -52375 -73894 18469 16599
23463 16599 148845 115185 318540 477640 259674 119454 -36508 -132399 -37960 84846
23453 84846 124470 51337 18653 16511 -12423 36519 257573 404120 212186 59754 -38868
23442 -38868 -168885 -78221 -37039 -191376 -218061 -89072 -92141 -124896 -248183 -362527 -361472
23431 -361472 -286427 -54073 -112271 5375 382974 525261 280015 184991 -96642 -174583
23421 -174583 -168170 105745 385032 316370 313545 439660 265833 41755 -154495 -144458 19971
23410 19971 -114156 -355742 -464051 -426181 -485927 -379444 -366631 -600536 -324914 -181496
23400 -181496 -163974 -103391 -90403 -103850 -298639 -457429 -451141 -237765 25068 192188 399093
23389 399093 386960 481456 535260 582468 447115 85331 -220941 -132795 -92501 -214879 10733
23378 10733 193923 285646 192733 115676 152330 211510 -161346 -357526 -530813 -393807 -180818
23367 -180818 -175924 -226771 -336767 -367138 -45017 151765 151305 178977 366929 144637 -56565
23356 -56565 -53175 4798 -69434 100360 -6574 -212813 -248809 -230608 -110510 -215336 -145855
23345 -145855 -135901 -204112 54148 86087 114505 218426 145096 10213 -40650 293747 380334
23334 380334 318955 138969 -245634 -345462 -393833 -382566 -259245 -77994 -20240 71533 -80053
23323 -80053 -236147 -337061 -412227 -208480 -120041 -18443 214599 146851 99941 183137 129827
23312 129827 179652 404305 302814 -71351 -266589 -54673 211855 112283 113573 296852
23302 296852 271778 350912 339308 346366 312847 140317 -92005 -6274 69301 40427 163080
23291 163080 64038 -111013 10648 76495 46505 -122056 38285 180933 250702 58717
23281 58717 -64095 242093 338465 12051 -145534 -107412 84098 93816 -236819 -188665 104371
23270 104371 150038 232389 175003 203328 32403 -393068 -537298 -472865 -429255 -181748 -142139
23259 -142139 -221255 56799 -130534 -116638 206617 63037 -85983 -155812 -131785 183688
23249 183688 184728 172103 101616 1587 -140198 -177054 -226926 -141941 34863 32462 6914
23238 6914 -58579 -257089 -214070 18075 33199 -31232 -232320 -27693 208898 293208 357051
23227 357051 368468 3872 -85036 113558 222616 18797 105847 61372 -24907 -191822
23217 -191822 1203 11558 -202341 -131650 -77880 -127087 -29117 -221469 -377367 -434817 -397428
23206 -397428 -358343 -259615 -162155 -83127 -136353 -277529 -176747 -106397 -24044 -54781 -57288
23195 -57288 56633 -105158 -185616 -72335 -72563 11224 695 -149078 -173606 -44653 -137757
23184 -137757 -133996 20942 102783 15101 113619 271100 188966 83752 60798 56877 72274
23173 72274 -334 163303 300065 170552 196781 282618 330000 325908 132946 -39008 -11681
23162 -11681 11716 97524 90131 82966 9744 -32871 117410 177390 95698 -110126 40988
23151 40988 124055 223487 196769 -166586 -487786 -285036 -77167 -76267 13087 53128 160727
23140 160727 227322 157684 -61716 46452 244439 131788 -55414 51148 -20158 -2386
23130 -2386 -8894 68529 188945 18753 -56736 -199143 -255564 -93594 -22284 268249 399369
23119 399369 245150 152810 74493 146673 235838 231109 -56212 -256289 -86530 127430 32960
23108 32960 34063 -31952 -33389 -65487 -196140 -179929 -106954 -313689 -196032 -19651 -113319
23097 -113319 -37239 52869 153057 204794 108943 42134 23345 -55856 -137416 -168019 -9405
23086 -9405 4763 -145614 -272510 -71653 8642 -210715 -316572 -443684 -518618 -326025
23076 -326025 -87594 120705 73717 -29808 134966 98141 -56361 -27840 139637 179818
23066 179818 509953 582396 347701 88176 184145 9790 -67231 145064 275982 398319
23056 398319 372776 273171 308671 444054 420703 303752 38870 -60536 88267 91169 58812
23045 58812 14376 -42948 -143223 70831 256460 235894 -105923 -294363 -164067 1405
23035 1405 137138 357528 343139 169937 230975 282931 206760 90257 123438 225459 222886
23024 222886 116776 222367 -24912 -227042 -225595 -121329 94958 55270 -146117 -241885
23014 -241885 -215048 -45608 -39409 -72843 -21852 -57118 12511 29186 -122890 -25545 138282
23003 138282 418865 319268 25875 79420 459016 774805 478300 161188 -35468 -66759
22993 -66759 52634 141952 97621 -307471 -352229 -399172 -429599 -385912 -109725 85392 129208
22982 129208 156401 219909 177756 102518 179909 219560 183663 228606 307158 306048 137439
22971 137439 207585 341183 324969 233821 155210 384424 539097 418661 291217 95145
22961 95145 -15554 61754 47106 149577 176273 108997 -25861 31173 -57906 182614 116848
22950 116848 22692 -27595 -216656 -224868 10575 24877 -80625 18772 48175 -221511 -398660
22939 -398660 -392560 -253532 -220222 51053 385818 384096 264697 284832 34018 -184843 -135817
22928 -135817 49279 64158 18821 96417 -48549 -186344 47064 185596 -22176 -188674
22918 -188674 -89074 -192208 -284418 -408226 -403956 -393238 -427330 -438158 -303153 -219665 -91304
22907 -91304 16204 209110 222715 163775 62898 138374 37315 -100885 -192268 -54858
22897 -54858 -15743 -259634 -16704 303378 93405 117461 231010 198386 149615 159158 183463
22886 183463 -34095 -105815 -92881 110726 382965 406790 377296 255025 86114 234061
22876 234061 312844 35719 105818 180065 294330 215516 8119 17714 227611 220495 216934
22865 216934 119437 241035 382984 313245 124010 -35891 88934 -9746 -28501 -63780
22855 -63780 -272487 -382693 -317305 -340730 -269300 -85114 369602 401590 458335 279663 -19838
22844 -19838 212842 236144 63093 -148110 -165149 -48554 -110238 -114102 -126270 99057 261086
22833 261086 113494 -131018 -373823 -353107 -332988 -321221 -357242 -361973 -151824 -180407 -173092
22822 -173092 -122427 30552 -189160 -102205 100434 -96067 -353851 -363997 -250663 -277189
22812 -277189 -329892 -216354 -28589 -17744 -10709 -57564 8146 -75739 -63780 48631 131897
22801 131897 398116 443111 370242 272516 -49903 -179607 -70194 -144379 -253051 -65438
22791 -65438 111058 330444 202486 133238 -51057 -280169 -191083 -47932 -34815 -3818
22781 -3818 -25747 15016 51615 128879 -115463 -205236 -238208 -176820 -183752 -149555 -238016 -200107
22769 -200107 -34953 148087 369494 135080 -92726 -211426 -354118 -241216 -12053 220381
22759 220381 125806 -35194 186270 355894 430835 294947 200505 95501 -116016 -147655
22749 -147655 -164576 -127336 -21953 -10905 -85638 -8832 146849 142037 116913 166222 110394
22738 110394 -8664 -80017 53622 -108887 -83492 -21980 88426 79310 -36592 -113920 34212
22727 34212 30747 -86227 126177 178864 -36983 -12044 76906 112699 -44274 -9143 -198714
22716 -198714 -270273 -381191 -393018 -11970 119321 15462 -36043 -58578 -103053 -28620 -122326
22705 -122326 -274988 -419352 -271869 -174939 194694 324835 144502 -99283 -23630 -139238
22695 -139238 115817 310823 116430 -180148 -315314 -92871 -182828 -81013 190380 138409
22685 138409 65011 78838 174233 200587 248931 142480 134488 113026 92592 94478 198132
22674 198132 5629 -226242 -305839 -176474 -11878 193347 318205 161855 23087 -117360
22664 -117360 -220532 -219025 -280209 -320384 -338234 -160012 -49000 -151886 -238205 -105784 4114
22653 4114 91606 84954 15837 94756 245220 389034 444144 81703 236462 460568 256100
22642 256100 -61142 -79230 22530 206561 -20327 -163810 -83982 97983 -66713 -91586
22632 -91586 -111992 -68623 -113251 -118348 -151180 2259 39432 250871 214307 101476 -59969
22621 -59969 -115461 -67001 108126 101481 -166495 -300171 -228499 -177846 -286147 -247131 -45523
22610 -45523 160632 302765 216366 106290 -11665 31408 41792 -31478 90587 -25718
22600 -25718 -67638 -41948 164574 144730 248225 301772 193961 -42882 -66978 -132251 104080
22589 104080 351006 123971 88744 150531 -114018 -199651 -246445 -125301 -91963 72851
22579 72851 75843 -140863 -336368 -489319 -557760 -303992 -283007 -43871 77230 -119382
22569 -119382 -348617 -530292 -399072 -537649 -383486 -124123 -7605 97208 -109443 -271696
22559 -271696 -331878 -217766 -48431 13812 -90865 -202504 -142490 -67770 -24079 -17154 3644
22548 3644 48616 266148 267543 306432 235590 66504 24814 -39733 -283453 -400205 -150700
22537 -150700 12537 60397 111823 131230 331767 288329 240005 326652 371513 298910 187900
22526 187900 -14100 -70012 -58194 243998 278017 87459 -46476 -2322 64744 180751
22516 180751 484788 511731 365777 193151 -32127 -76173 174809 216440 107504 330168
22506 330168 343996 136200 246881 310694 235474 175041 252097 298434 215056 6888 -27237
22495 -27237 148257 16895 -14560 70768 75567 134252 157357 36679 -108286 188457 347813
22484 347813 227433 50843 -180833 -337556 -133139 -110994 -198899 -153688 169844 300279
22474 300279 356846 287681 119177 56714 -274347 -264218 -214867 -274218 -137740 3900 155648
22463 155648 189169 92288 83347 75046 24675 -78958 -54146 -233786 -196633 -2207 248314
22452 248314 233852 292950 128256 -120805 -117554 -8290 99615 -53436 -27307 93838
22442 93838 187661 -18221 -195820 -218435 -270007 -131730 115009 360301 380946 103049
22432 103049 -26586 -13973 -196532 -98512 -62374 -214239 -147406 -148720 -142648 -156457 40705
22421 40705 16042 -246859 -206823 -262156 -458291 -421336 -164264 -159954 -260088 -423433 -516813
22410 -516813 -241701 -19954 49628 133172 158818 163432 -1976 -154820 9390 207563
22400 207563 141556 361751 377789 207212 17196 -219907 -270041 -85430 -9025 -174201
22390 -174201 -12419 229862 166556 4697 75686 -16577 -236255 -509545 -525624 -550974
22380 -550974 -374032 -61131 -34282 170990 128125 -226248 -550755 -806920 -920862 -710868
22370 -710868 -427301 -344357 -350407 -154487 -300395 -430573 -307519 -118260 82618 71362
22360 71362 58107 -22747 -59498 26004 154962 229765 352484 241512 337860 355497 281818
22349 281818 93858 -17842 17230 -31223 68845 128137 216886 155335 -91899 -75015 7679
22338 7679 -76505 -227549 -195803 -253435 -194106 -37700 -194887 -253948 -255923 -9139 357758
22327 357758 408713 262641 -45377 -28871 261446 564376 400800 249158 53240 109687
22317 109687 82924 -108278 -63959 126923 148445 -13844 48636 230541 202574 152101 188247
22306 188247 -81415 -71973 -61492 -65961 -208025 -164792 198613 477067 472958 200992 -10051
22295 -10051 -95427 -99506 -20514 -165347 153052 181600 -10191 -124292 33527 -48193 -178486
22284 -178486 -363075 -665086 -452951 -285377 -54698 153567 170988 160363 79460 366213
22274 366213 565899 508389 119491 -402996 -255800 -178663 -129708 -138271 -222533 -187920 -72910
22263 -72910 12184 243104 -6292 -441000 -365944 33404 34002 -91538 -168242 -259260 -261162
22252 -261162 -374726 -328457 -191475 -34489 -120975 -210007 -155921 -7258 362631 155136
22242 155136 -102087 -17016 237141 28170 -139211 -161765 -240342 -101451 -78408 97828
22232 97828 216571 295495 219657 103494 -45126 -294810 -342234 -194944 -99491 -74305 -24921
22221 -24921 -122604 -103286 -7323 -101285 -255831 -334869 -298858 -327271 -564575 -649987 -392257
22210 -392257 -220194 -272249 -300674 -384088 -214215 -194079 -122123 28891 -27648 -69142 -109078
22199 -109078 -123855 -85399 -122529 -164122 -131341 189789 326140 507512 321515 30612
22189 30612 -46668 51722 181217 254286 -60464 -151707 23213 235411 364732 405340 224254
22178 224254 -195329 -418273 -386871 -251913 -234271 -343084 -400857 -283391 -191939 56910
22168 56910 127522 353542 397862 143430 -171168 -134830 -92481 -101978 -245031 -216238 -165874
22157 -165874 -60855 -173384 -243841 -174609 -163799 -45711 -158904 -213541 -236667 -198280 -167751
22146 -167751 -259867 -338165 -396486 -449651 -169362 22802 133819 325362 168532 -27180
22136 -27180 -35464 -59260 -97347 -29303 -52654 150038 125193 63508 4762 -218625 -387165
22125 -387165 -388693 -554202 -569253 -462938 -265376 -63321 -117500 -236233 -372981 -446168
22115 -446168 -442917 -276349 -53522 -50607 78860 131660 -128307 -453446 -328954 14054
22105 14054 76106 242199 238418 106121 -293530 -315152 -149640 -386032 -573727 -495925 -331138
22094 -331138 -229322 -20680 -56313 -137821 -62954 47245 -99299 -206656 -238927 -189120
22084 -189120 -161580 -135676 -100766 -36147 -116884 -202647 -112563 -121734 -59038 111005 -13519
22073 -13519 48106 -122392 -197844 -133913 -126169 -102364 -15220 127486 144453 189757 147203
22062 147203 97903 154966 -5603 -293085 -369081 -228429 -36145 7390 211076 394812
22052 394812 482657 449665 452208 316869 109404 188808 243182 376321 316968 137907 -189967
22041 -189967 -130838 27381 322455 312769 290467 154428 115824 414854 676788 456889
22031 456889 349117 417974 458382 539700 653789 411600 267514 75684 71699 -50013
22021 -50013 -132466 38882 -113219 -73350 45405 -89888 -210905 -162243 -174191 -270324 -426733
22010 -426733 -458456 -276632 57062 181628 -4329 -1764 170150 278614 404826 449293
22000 449293 444084 353296 131600 25633 -97365 179973 352720 172856 -11925 129502
21990 129502 129792 247146 400070 314061 9422 -52540 79085 187696 309247 305798 324987
21979 324987 387417 354472 411578 512299 463561 480639 370926 257279 242039 172618 40947
21968 40947 70587 -55158 -221449 -382454 -412338 -338555 -187710 -175516 -197905 -197599 8293
21957 8293 76110 104384 32816 53610 181384 176954 37285 111162 127956 176712 180602 151578
21945 151578 171367 -187320 -410688 -284353 -343815 -359469 -240251 -177492 -160339 -342924
21935 -342924 -535841 -503455 -411826 -331550 -210058 -332673 -389499 -189239 -84438 -131235
21925 -131235 344 12355 26510 160559 59809 35837 6774 -248427 -276660 -162702
21915 -162702 -37708 87792 7267 -141867 156352 411298 414834 201958 99729 186540
21905 186540 217349 365089 98133 -129497 -150227 -169335 -294627 -270683 -403139 -340581
21895 -340581 -229049 -325967 -222552 -244126 -219088 -347460 -197843 -87666 132893 77384
21885 77384 -118949 -456761 -497522 -198660 -126116 104802 62312 69741 24743 54123 10178
21874 10178 28895 -53551 -179510 -118015 -359234 -368515 -254596 -355814 -420537 -168053 13732
21863 13732 193704 109789 -1927 101324 40908 177024 251485 161543 -136349 7509
21853 7509 100264 175361 244394 159702 8436 -151002 -130582 -123254 -197903 -207694 -346190 -348411
21841 -348411 -239672 -237004 -192366 -261962 -439510 -411436 -415257 -133939 -34803 243628 305672
21830 305672 82985 -180397 -127737 31820 147354 128334 67625 17085 -141953 -55758
21820 -55758 -110710 -115740 -97445 -270433 -235300 -63888 -173209 37757 267689 -123497 -196230
21809 -196230 -24851 -193922 -340704 -269447 -150073 -93093 -212461 -360756 -507826 -426799
21799 -426799 -330043 -327539 -593074 -641984 -235240 106953 239158 182973 120851 6287 -121867
21788 -121867 -198940 -62861 -218347 -266676 -102271 21884 199294 369971 248786 241470
21778 241470 211294 -104226 -199313 -122068 -315387 -238090 -133321 -109253 -110068 21640 -77211
21767 -77211 -7311 -10855 -270179 -317162 -301483 -253548 -111762 -65715 86804 246927 324369
21756 324369 164367 211992 294746 150719 26606 -7388 88684 55133 178608 332872
21746 332872 216368 78557 133656 106383 -117312 -222793 -218640 -73190 -179529 -315326
21736 -315326 -109936 -131090 -143123 -139152 -161402 -382012 -398893 -212282 25694 170810 72425
21725 72425 80001 -73639 -123827 -259018 -112037 -79265 -105738 -159642 -250823 -184260 -124439
21714 -124439 -203073 -198255 -316093 -357042 -362174 -547531 -468828 -154570 -17633 -134358 -352893
21703 -352893 -574282 -679547 -544421 -392114 -135011 211124 85613 -100319 -65190 112597
21693 112597 42946 -301063 -300789 -309097 -394322 -435538 -340420 -323 107174 23639 34573
21682 34573 -42451 -188441 -286649 -260541 -175808 -124344 21323 -53172 -82635 -206531 -159678
21671 -159678 -7051 14414 -236446 -140694 -56626 -98870 87628 41217 -47597 -47211 -158179
21660 -158179 -2173 160544 199351 204149 79501 274095 410321 284446 94443 -160688
21650 -160688 -190204 -191831 -164938 -173254 -373005 -586106 -569886 -206839 23873 -36738 71402
21639 71402 41679 167300 49139 40105 -51340 -129603 -160715 -114282 10229 -189947 -249453
21628 -249453 -253672 -43052 113741 69789 69836 201612 34877 -33356 -185371 -216690 -411391
21617 -411391 -429345 -415053 -182020 30998 -79451 -175758 11665 129127 115442 -58682
21607 -58682 33285 94314 -167724 -336670 -243620 -58232 -69090 -290154 -361265 -185934 -81824
21596 -81824 -35106 -78819 -197057 -158237 -71395 108744 89411 87645 146490 233805 293869
21585 293869 222286 45865 171415 88819 -98985 56243 93343 -107136 -32583 48085
21575 48085 174775 262641 361360 335169 235224 67788 77092 105438 -104605 -260227 -293914
21564 -293914 -327335 -231143 -150382 -169354 -242022 -379357 -341034 -250139 -253716 -395849 27585
21553 27585 162658 96271 -94836 -116484 41734 276448 177442 2387 -230306 -226725 -76959
21542 -76959 -115016 -196818 -277057 28983 31108 -47986 71754 287880 257141 23091 120862
21531 120862 100649 -126246 -56524 29925 15344 -145182 -318828 -189079 -58988 -28212
21521 -28212 -343439 -241117 -72868 -35265 -30413 -114973 -183713 -285068 -492741 -648618 -511045
21510 -511045 -112480 169537 275414 274137 394303 104371 -132746 -38306 249600 280199
21500 280199 194538 314364 225118 70216 -40006 -164765 32294 171169 171137 136239 -20116
21489 -20116 -57781 -87178 -117363 -178928 -294468 -163725 -187921 -155509 -304039 -362699 -101711
21478 -101711 89232 -149363 -325900 -418753 -461138 -468523 -197819 -65388 -146564 -497296
21468 -497296 -655116 -369519 -108768 -70183 -45548 -14691 101720 30509 -51731 -174395
21458 -174395 -214334 -146646 -231865 -79551 -132895 -15068 -25198 -192839 -233973 -119659 -150681
21447 -150681 -231213 -24705 186052 159766 -112102 -92501 -149612 -124713 129660 386165
21437 386165 127855 3847 3203 -80005 110570 156188 344882 358769 236647 126237 -2437
21426 -2437 51892 61592 123250 155036 168063 119776 -59801 92760 131057 11326 -103701
21415 -103701 -222571 -403546 -416595 -427502 -202472 -211043 -320383 -141556 -1601 -37524
21405 -37524 -147283 -256644 -110274 -124562 -220373 -296954 -150686 211977 -63731 -80544
21395 -80544 24010 -30838 -231186 -341161 -118427 258058 321741 488749 341888 415746
21385 415746 356509 346138 462135 300050 -76178 -237523 -73990 50804 228879 294190
21375 294190 79747 -125480 58796 131446 -11191 -143422 -163845 -285461 -281025 -381835
21365 -381835 -312969 -65458 -192481 -296174 -170882 -96237 31262 -2103 -149004 -136263
21355 -136263 -123264 -364373 -375653 -225977 -53281 -73851 -175055 31205 76999 -198637
21345 -198637 -211075 -52549 -7179 176234 111654 -27534 126794 9235 -158022 -430703
21335 -430703 -429977 -317500 -197031 -53710 128002 151262 -23795 -43537 -241977 -506121
21325 -506121 -471668 -258531 -93732 7309 76785 182675 -53171 -98687 -39955 -182386
21315 -182386 -271905 -407618 -227206 -142543 -159103 -155281 128962 166867 6177 -158555 -75856
21304 -75856 87420 -142104 -302947 -224630 -36793 -180074 -360055 -327863 -326264 -224946
21294 -224946 -461750 -470165 -307533 -389746 -368675 -259021 -161468 7627 3483 -103205 -270159
21283 -270159 -205239 -218044 -371188 -391784 -374097 -236053 -281705 -7721 12926 -144728 45485
21272 45485 92238 -115911 -221974 -158525 -40213 92317 94442 -86779 -197574 -280098 -284462
21261 -284462 -293476 -145628 -447825 -723930 -507793 -366242 -294073 -307969 -271523 5470
21251 5470 146390 245469 -43147 -188110 -225682 -72071 -116611 -187901 -40332 -101916 -117675
21240 -117675 -258540 -255057 -212631 -110560 6986 25288 -3870 -184223 -192376 -105390 -170336
21229 -170336 -244079 -126496 -27339 42832 100288 -86808 -126921 -152112 -217643 -251928 -442686
21218 -442686 -473240 -249079 27854 84483 95925 56418 28411 -279011 -447959 -333013
21208 -333013 -431853 -548169 -386506 -112561 -49405 -62186 -229489 -533956 -151420 4108
21198 4108 97304 463412 474217 538998 409991 212845 140331 50265 -157208 -101359 -167020
21187 -167020 -224194 -147105 -122602 10282 -35760 88699 118568 229028 297141 239317 287475
21176 287475 90043 -3905 142900 215774 271175 196584 57505 139838 99500 -101301 82913
21165 82913 35264 221323 315406 304510 49319 110999 -56085 -101822 -32502 -187722 -134272
21154 -134272 229406 297964 246202 150178 -1783 103675 237949 181969 -45698 -209125
21144 -209125 -288628 3377 286928 167236 56397 202520 108498 -27734 172979 656875
21134 656875 746284 379226 323743 348373 407938 187550 -82349 13401 120367 274856
21124 274856 377553 226786 -64008 -109831 -264523 -364019 -103705 -97442 -195352 -45347
21114 -45347 -37312 4582 170430 174643 158948 318050 410350 307370 119593 -193196 -212558
21103 -212558 -134599 -23495 -81539 -239721 -96860 223457 456408 475977 738994 642229
21093 642229 388362 232093 150948 241924 239831 -83207 -175869 -83420 -154564 -193235 -435264
21082 -435264 -336528 -197669 -125465 -96231 -141646 -56403 -59972 -91773 -144472 -268175 -322189
21071 -322189 -195034 -83630 -258502 -379246 -385034 -182874 -28541 -90163 100733 173409
21061 173409 285700 276705 213303 -123821 -478216 -491379 -539177 -423631 -89100 2117 -17675
21050 -17675 -239603 -269514 -164887 -306887 -321779 121965 306642 208721 -3024 25809
21040 25809 -125058 43743 105080 114164 95686 -195110 -208556 -250488 -281788 -124652 -194802
21029 -194802 -273203 -45029 256438 108599 -40287 -221509 -173036 -1576 -48575 -47294
21019 -47294 -20441 -225964 -206288 9004 155547 144872 115128 -111466 -181937 -244418 -241174
21008 -241174 -293180 -330238 -326928 -323627 -419696 -250887 -324568 -288082 -161460 -119047 -150963
20997 -150963 118285 6765 -9119 -48332 -209474 -124834 -21525 -126223 -303455 -309151
20987 -309151 -259247 -229192 -120830 -63043 -161024 -188162 -359215 -426735 -250309 -244308 -153333
20976 -153333 -225926 -525673 -285932 48943 153218 342502 190511 -98239 -111862 -259233
20966 -259233 -242368 -235768 -243478 -158945 59315 107263 57103 -9484 -13970 -172084 -259205 -81729
20954 -81729 -1810 -91504 56406 -12690 -74706 38865 148464 -1523 -150022 -107604 99463
20943 99463 228210 245129 247886 187494 95451 144969 79674 120114 181989 167962 163175 314410
20931 314410 377152 287188 -17367 -133157 -222815 -120787 118392 166432 158991 -209888 -387092
20920 -387092 -385590 -162915 -190421 -84141 92218 65189 168956 60720 85655 40063 72709
20909 72709 122532 -10705 -46484 69698 -83362 -77105 41694 65688 271443 184717 172516
20898 172516 68646 -133902 -129577 -136879 -353611 -221840 68770 204174 318330 373677
20888 373677 244103 322722 417755 509368 471917 454282 346807 127257 28045 45296 9537
20877 9537 -162467 -215853 -302251 -339325 -238145 -1370 -102689 -201142 -30421 -25009 -356889
20866 -356889 -599846 -396743 -195212 -239102 -299101 -262419 -97171 119815 210098 137536
20856 137536 197681 140303 -152807 -308472 -323627 -290430 -321844 -389617 -348882 -112128 -95280
20845 -95280 -113687 -149153 -96362 -44557 139543 166783 342585 445433 363397 310303 255468
20834 255468 117614 72771 330862 415846 370024 33917 -156210 22572 23921 57193 132371
20823 132371 -72891 -208815 -211950 -265737 -441252 -467873 -90428 158473 -10269 -33921
20813 -33921 51500 29269 -194550 -351162 -503393 -389056 -440705 -377894 -151339 42355
20803 42355 265977 161185 303842 256880 141242 -148546 -192837 813 239453 44496
20793 44496 -41506 -102070 -15603 -72716 -165317 -164684 -99431 169650 273847 192478 205214 72672
20781 72672 112575 58826 -39230 -2720 73421 -158691 -210987 -137656 171799 296677 223806
20770 223806 312390 211636 99481 -77804 -241344 -53842 98127 239211 137181 166337
20760 166337 243784 444564 412078 610790 734551 646952 582022 885139 966018 1262966
20750 1262966 1727926 1470629 1015425 797807 642098 579591 812720 861849 719442 611909
20740 611909 492055 689243 880985 988166 865090 507146 132577 91741 210974 52226
20730 52226 4283 -32852 -8357 298712 449003 656493 730986 727503 687168 623755 673074
20719 673074 658509 603374 684895 863320 1120044 1224001 1297066 1399247 1293844 1146224
20709 1146224 803547 799483 836318 796629 550749 372310 392255 423928 401520 460275 527342
20698 527342 412585 188948 -28994 -19097 169090 -34134 -283844 -226648 -59768 174424
20688 174424 217666 162647 309588 147641 168409 259093 155492 263131 579380 581383 379515
20677 379515 280934 401441 155440 -36563 -133722 -32151 171607 283875 449492 353222
20667 353222 237653 263806 189812 127080 -4663 -66898 21836 -93273 -178637 -126398 85917
20656 85917 43658 -142751 12577 146436 114400 -211556 -273427 -73316 -42225 -64517 -34743
20645 -34743 -141075 -138842 112654 249185 58783 50027 52347 100953 58415 -46510 -218318
20634 -218318 -276984 -170810 -244535 -62512 71474 -13100 -76758 -25732 262495 444524
20624 444524 102901 -249218 -412552 -375329 -169261 -195403 -203289 -429003 -315649 -161538
20614 -161538 -132946 -220136 -112100 -124100 -199508 -162042 -14830 -41342 101608 39998 -98153
20603 -98153 -220958 -438958 -417171 -301305 -317136 -406136 -374674 -213781 -209076 -166893 -72185
20592 -72185 -223992 -264927 41100 53096 -99199 -59041 294215 448681 253133 -37728
20582 -37728 -62941 362495 483214 464073 320509 73762 31933 -44599 -992 64014 189906
20571 189906 209833 75451 -110712 -32102 457 -22515 -51459 -126642 14488 198065 432014
20560 432014 466287 283014 -51982 -125300 97002 114724 250039 190329 9342 151269
20550 151269 236485 59305 38976 -34027 -123665 -147083 -151548 -105586 -27580 84106 90973
20539 90973 -127582 -274132 -163207 -101995 -201817 -186388 -56415 56926 210373 20025
20529 20025 -269559 -457874 -315149 -191329 -180397 -13472 33860 -70250 -273845 -126094
20519 -126094 -72371 -38445 63589 162557 198907 229238 246705 44085 32481 29086 36443
20508 36443 123036 266569 117949 98379 -64627 -46008 -53433 -104679 6542 -44014 -56008
20497 -56008 -206102 -279657 65386 -5338 -97545 93184 161789 70447 38486 182792 239030
20486 239030 151781 7488 108519 164792 146435 102410 53109 174376 493138 483845 400316
20475 400316 188581 318250 270822 235877 215154 201103 169728 127560 265625 391706 396258
20464 396258 328585 301914 504547 583312 530619 409480 407627 627150 594242 443071 246051
20453 246051 304686 444017 443186 128562 73382 -61589 127922 259557 219380 351823 285882
20442 285882 192799 85641 77965 253824 423150 241200 169357 136142 385049 577293
20432 577293 384394 283922 264954 457919 508275 387295 90776 -122820 62790 330082
20422 330082 139603 154840 362089 491625 744148 776539 841684 569946 341073 11870
20412 11870 -25510 -104588 -118433 -64010 259826 305213 142530 106565 280328 463610 560573
20401 560573 552030 380381 326037 360003 478875 582209 685712 544691 487763 285970
20391 285970 304935 369800 354252 333325 66343 -129062 -114031 225293 239713 15191 209050
20380 209050 180599 98166 202772 191689 184538 409164 644478 524786 308974 258459 430085
20369 430085 440748 376832 315838 341496 272310 584954 577204 452457 452775 433002 347088 358013
20357 358013 488571 420665 205340 315750 505671 430822 233148 408630 449869 146648
20347 146648 -108071 101056 114552 -138507 -264117 -117993 -75476 -90636 77074 305405
20337 305405 351903 306822 334256 367656 244726 68063 -70360 153685 438065 681367
20327 681367 796727 686551 947268 1062160 1199417 1455121 1240173 1350040 1405154 1015318
20317 1015318 667699 606189 427211 565024 667145 623087 640090 826710 733913 583628
20307 583628 821922 931817 728299 640972 348645 15163 -72779 85706 256115 741150
20297 741150 1124305 1136534 923551 988095 916875 908177 995695 1210212 1251603 1041668 1104091
20286 1104091 1038371 928618 812220 823615 1064527 1229718 1227564 1244096 1207021 1085951
20276 1085951 1167155 1003228 995996 832757 892728 992206 937991 702272 761781 1078364 1129797
20265 1129797 1149803 1105172 1064245 915977 1110450 1263234 1345803 1459557 1184017 1146155
20255 1146155 1316274 1210055 1141537 1231383 1393025 1313884 1244519 1318640 1515634 1813024
20245 1813024 1786548 1640932 1734940 1748669 1710315 1882194 2048206 2251037 2482191 2604518
20235 2604518 2710589 2622765 2934183 3255794 3358876 3791706 4099050 4412988 4810297 5223024
20225 5223024 5629470 5996920 6080908 6109468 6359004 6656842 6967935 7440875 7795380 8274816
20215 8274816 8829047 9364590 9941136 10947527 11766513 12347116 12781103 13258308 14269148
20206 14269148 15560295 17102550 18831351 21148444 24429313 28493588 33501317 39618546
20198 39618546 47558199 58201440 72712669 92561939 119431548 154379709 194707528
20191 194707528 234077916 258472150 252844362 221347566 182609543 151388311 131763052
20184 131763052 122586510 122985349 132705262 149869669 166322445 169221919 154051447 128497160
20176 128497160 103450516 84002559 70448164 61727159 56415737 53470512 52755620 54102879
20168 54102879 57472270 63128023 71620076 84703403 104066112 130240444 157686622
20161 157686622 173561927 170099482 154139124 138092750 128730106 127614320 136245900
20154 136245900 155763650 188547095 231140952 264938279 269869667 245303379 205233724
20147 205233724 162735630 125532951 96566378 75562459 60104540 48848259 40695971
20140 40695971 34482670 29367852 25399300 21948426 19429553 17497795 16164932 14633259
20132 14633259 13493623 12951814 12490222 12047826 11671559 11134592 10501875 9844813 8941114
20123 8941114 8399898 8242053 7920066 7198865 6607707 6435087 6287633 6063257 5807393
20114 5807393 5439970 4928569 4415443 3747441 3448099 3369763 3284618 3204039 3184692 3035794
20104 3035794 3054946 2764911 2402226 2084091 2220197 2360423 2158589 1910727 1735887 1631093
20094 1631093 1624684 1724009 1865531 1819622 1746166 1941414 2048567 2167484 2184506 2128958 2134458
20083 2134458 1979814 2054284 2134898 1988477 1904089 1745419 1536068 1456101 1373964 1455715
20073 1455715 1386827 1572100 1818163 1661309 1389976 1446530 1286594 1165291 1074797 940537
20063 940537 936745 855778 822703 956482 843171 699897 757418 1053888 958314 794612 622602
20052 622602 578328 972902 1240174 1083892 973447 1096182 1074201 1037988 1094455 1264061
20042 1264061 1214780 1302469 1424111 1383680 1370856 1449461 1415494 1278131 1254401 1070972 787565
20031 787565 657157 609346 464235 242520 93726 27649 -10833 -220032 -77110 126522
20021 126522 151806 240566 65351 -54048 160516 438557 593366 300317 228765 215575
20011 215575 185011 120092 299247 327151 327952 498057 295159 248514 86705 157196 282839
20000 282839 441740 557419 473130 359159 505544 510500 267689 178697 150721 234950 367370
19989 367370 504623 536055 647952 480737 45079 23279 316207 364726 417150 317365
19979 317365 202662 105150 59104 56920 -77370 -44795 123940 101486 -19192 -4309 173835
19968 173835 400840 481134 493418 366347 219791 117477 172 -136070 139218 317051
19958 317051 231208 186538 344173 248149 197923 260957 262333 272717 61064 104477 -97523
19947 -97523 -302207 134450 431765 468776 402847 80692 51199 208031 127822 17708
19937 17708 -36865 45638 185810 404973 353247 357586 166441 86421 96097 -260327 -123407
19926 -123407 -25778 -64847 -306532 -324800 -253255 -194271 -192987 -283094 -272979 -97915 42177
19915 42177 146716 133499 121905 73343 -253330 25711 405977 326541 23177 -47851 -94978
19904 -94978 60060 234579 180313 -49895 -88274 26087 313554 491216 272343 187116
19894 187116 43992 -86543 -73807 -48956 156029 288954 278874 232445 173721 184397 49925
19883 49925 91629 187050 121178 64097 19533 -28242 -56471 -637 69052 199863 144172
19872 144172 -14331 74151 -38321 -268526 -268840 -402593 -333138 -190071 -225285 -106776 -13782
19861 -13782 -270316 -286344 -98170 170596 214411 139136 104648 120332 258462 312233 281311
19850 281311 182879 39998 126691 -123032 -166806 -48070 280817 311224 49264 -139724
19840 -139724 -191988 -90588 162935 101343 -168483 -158238 -47339 -79088 146312 172561
19830 172561 -45512 -279277 -286996 -445930 -249267 -79522 -8682 -151638 72485 84833
19820 84833 235407 519542 787931 586302 390075 187004 196445 243721 159513 232538 174145
19809 174145 223707 20845 -121540 -92959 -61879 88546 61134 61911 50772 84939 82466
19798 82466 69166 275871 519449 486619 442199 347526 264573 288881 184010 88099 219795
19787 219795 431256 387197 195324 225520 380423 329341 284174 28804 -89843 -218493
19777 -218493 -219811 -28367 196009 119083 -28322 -175098 -371857 -418143 -340145 -261672 6539
19766 6539 45185 11995 63594 59216 -90978 -383078 -220487 -262005 -194299 -271552 -179838
19755 -179838 10567 56204 -15805 -38651 82840 22991 2258 175648 19131 -126866
19745 -126866 185688 589422 690419 575980 515079 310999 13212 -166157 -74498 -245747
19735 -245747 -353255 -482273 -543888 -288586 -68214 37990 69669 -112673 74812 243016
19725 243016 193144 95911 -7109 -79521 -14602 53871 25565 64191 9025 -22460 202733
19714 202733 307505 164876 -80695 149947 38732 -78859 -276241 -233972 -176395 -145863
19704 -145863 -128830 33573 -71056 -484335 -607013 -348647 -168233 -208468 -419267 -452157
19694 -452157 -75596 60230 -139454 -97896 -53817 -233347 -272341 -272767 -85746 -74297 -8517
19683 -8517 -201267 -342777 -190008 -5864 123568 147486 113156 145221 239071 77931 -24863
19672 -24863 -14263 -104146 21544 199198 256669 44669 -234674 -293365 -54915 173933
19662 173933 229928 109922 190554 -5561 1735 -324081 -476186 -155957 66605 -101148
19652 -101148 -1671 323208 188545 120881 -36268 -37605 -146472 -67922 115343 121033 95579
19641 95579 77229 245560 379963 192448 -62658 -68344 -2656 140637 471799 353622
19631 353622 16192 -162956 -247956 85870 447871 357179 263106 548515 740143 1014037
19621 1014037 1212709 1193283 1282889 1371702 1048211 736739 668168 868790 1001196 862338
19611 862338 726532 881713 817484 651756 640091 654821 426157 318976 470263 388513
19601 388513 367744 697962 1053049 1024911 780298 729903 614022 545309 214390 120718
19591 120718 273505 585624 671390 834305 942536 697083 594936 716066 972196 1295948
19581 1295948 1382184 1280811 957595 666470 469989 349722 332738 414191 567295 644156
19571 644156 693770 468526 44467 -26528 -206943 -459988 -572790 -384660 -109521 -175325
19561 -175325 -86785 -137188 -179969 -196233 -55032 -143065 -183077 60222 67002 32119 -41441
19550 -41441 -114306 -87677 -100744 96461 368846 126581 -30921 -136322 -140963 -199340 -107729
19539 -107729 -69480 -40078 140750 343511 -27254 48798 339207 277212 350590 404883 254390
19528 254390 31405 -366309 -657946 -466160 -160373 -67253 -165872 -218052 -194476 4166
19518 4166 65633 34396 -66671 -207002 -251606 -126219 -66356 53016 176909 -80313 -259199
19507 -259199 -224737 -152748 -101363 -184620 -22765 168501 6507 -131850 -234709 -241913 -327876
19496 -327876 -119933 -209799 -129236 -105112 11574 -80029 -329950 -248137 -150719 -3138 299213
19485 299213 296499 344741 278054 258845 323662 192529 8361 -14780 -33973 -147656 -396786
19474 -396786 -435361 41850 173900 -68340 -48534 55624 -145542 -192640 -110148 -117590 -72872
19463 -72872 -2905 63933 37069 -53722 -252073 -309943 -431715 -266035 7833 219341 75972
19452 75972 -22186 -133641 -117924 -33997 233137 265722 73809 130299 315490 173551 59803
19441 59803 292631 232508 -11613 -51144 -62855 35887 -66095 -303862 -339626 -343166 -197589
19430 -197589 -26784 5389 124371 275396 217188 372090 373488 59118 -130411 -332371
19420 -332371 -271049 -321194 -270425 -114199 -195751 34536 15807 -78890 -60888 -172894 -178179
19409 -178179 -44379 17930 4769 25148 226858 395350 531964 434643 319026 362507
19399 362507 424454 606998 623732 491425 212331 156563 115940 49821 -70083 267656
19389 267656 108702 64637 133089 -122509 -154563 -284066 -222404 -307701 -232788 68799 -44601
19378 -44601 -13483 46278 16108 82034 230652 238765 50141 39775 84860 142399 198387
19367 198387 -20596 -4033 -221042 -181997 80925 216730 138465 195640 295865 190508
19357 190508 110288 68815 -3158 138223 -19827 -370681 -408107 -253456 -167417 -109367 -46279
19346 -46279 106920 167948 91657 27071 19480 -57109 -8583 138317 88991 -68318 -283819
19335 -283819 -259129 -147678 -222633 -330965 -306238 -197629 -289542 -215817 -96055 -96702 66096
19324 66096 308541 250619 84973 222652 282098 80367 126149 13835 -2940 109215
19314 109215 -16808 -27457 82998 -179943 -497036 -647636 -448492 -154991 -69172 -163627
19304 -163627 -369459 -255291 -73917 -63341 3448 40528 290929 245944 119033 159244
19294 159244 253308 446153 411401 63564 -347035 -314971 -369534 -380492 -185850 -49803
19284 -49803 -245964 -307742 -73003 104219 130837 101202 167743 -23543 -222885 -105637
19274 -105637 -41496 12133 -86515 -116440 191870 236144 144989 106389 92016 18893 303970
19263 303970 340509 149071 46233 12910 68532 26985 -172360 -218682 -135334 -21998 -34765
19252 -34765 -125611 -377168 -397232 -247240 -87124 -47734 -94240 -31213 -116277 -187571 -10474
19241 -10474 -90532 -262300 -205521 108246 70209 85876 -82299 -231441 -455977 -514678 -532027
19230 -532027 -29484 305984 67751 -113834 -105848 -285749 -402878 -570613 -518101 -445817
19220 -445817 -521975 -310717 -167056 -86251 -148296 -62667 -117361 -161953 -121803 -225492 -506012
19209 -506012 -293810 -151125 -202524 -243753 44188 302028 310711 -76283 -254207 -229936
19199 -229936 -145679 -263524 -260833 -68850 45761 -54492 -128760 92066 359609 422150
19189 422150 290180 -16276 -139868 33360 72260 -22574 16009 -5993 48505 302648
19179 302648 179979 108222 -35335 -150799 -283837 -188222 90406 16376 -69146 51956
19169 51956 -39060 -17383 -176401 -151737 -79675 -327693 -308000 -292262 -144261 -145200 -69029
19158 -69029 -164691 -171769 -80815 -17997 197285 -20843 -158865 -17736 187344 148254 -22133
19147 -22133 -98944 37953 46018 -234530 -236949 -308007 -395840 -173593 -127808 -375303 -456740
19136 -456740 -302257 -255225 -238685 -252035 -336824 -429313 -317723 -140257 -28306 -166945
19126 -166945 -101714 -4096 -47291 -75646 -240639 -36727 140039 41937 -248507 -191754 -845
19115 -845 86499 340409 350560 412348 334650 42084 -98401 -67629 168956 346744 270518
19104 270518 212471 373379 573769 490020 207195 -35237 7067 167419 -68856 -198172
19094 -198172 -74413 -156573 -405101 -476810 -377625 74138 251952 203725 95784 -112898
19084 -112898 -26162 42754 34481 -195496 -493542 -294801 163938 317113 111650 191646
19074 191646 205329 206440 220699 203275 70272 -35456 117372 339962 322591 -34737 -22098
19063 -22098 337840 732201 695312 511546 442498 538162 224456 61832 45095 4669 18731
19052 18731 -33996 7016 -121834 61317 239434 133522 14211 107805 337922 126174
19042 126174 61525 196896 150004 49307 213574 271519 89307 201739 289340 166321
19032 166321 60797 107910 -30108 -243537 -127569 44332 32694 220737 198320 274762
19022 274762 303552 391912 405260 426224 283103 89035 -71563 32555 134153 227078
19012 227078 129258 156460 273132 312473 -116977 -334491 -258404 -51525 40786 5780 83011
19001 83011 -44677 -194886 -54194 99214 71196 -68955 -71445 111629 267071 18582
18991 18582 -287260 -242826 -410548 -485247 -529724 -403081 -240973 -168957 194838 351127
18981 351127 284676 258506 322781 75923 -124560 121699 35513 -113904 -62893 178610
18971 178610 216546 205001 256824 145181 104834 -20009 -148491 -363619 -258166 -275066
18961 -275066 -408487 -202499 -34258 -117291 21193 2651 -51432 -89808 -212139 9934
18951 9934 76098 -58034 -48731 -19439 -265141 -323739 -562141 -150286 381810 269276 172873
18940 172873 288272 443641 459925 610977 808179 711876 569857 693312 675010 891291
18930 891291 1168986 948803 913976 1071593 856397 824775 593160 619338 703998 821635
18920 821635 840310 897021 783195 579212 293412 147637 336315 354138 181770 39125
18910 39125 58553 357655 569238 684220 722078 840725 726371 821422 744028 607065
18900 607065 715474 768254 831473 551160 512478 859651 735807 466945 253612 272395
18890 272395 543054 625623 822442 859758 859410 962733 655552 698599 793779 714731 577510
18879 577510 485741 591788 528779 170949 -80780 -139945 20525 33920 18830 -107744
18869 -107744 -125636 -393225 -501790 -690954 -598941 -411484 -188263 58219 -3781 -122839
18859 -122839 -294949 -302657 -314801 -186416 -51866 -8837 -99715 137397 192522 -64126 28587
18848 28587 149277 258064 407908 181812 -49974 -57413 158087 448451 648811 509079
18838 509079 462452 568656 459649 290923 222642 87814 41175 161567 413693 617244
18828 617244 862302 1144425 994555 807216 808003 861046 746621 588088 311627 296577
18818 296577 462651 551636 557545 499552 249427 239295 112530 173746 225977 545768 609291
18807 609291 692245 1071358 1249481 1353626 1345956 1224081 1012803 696495 480078 185775
18797 185775 79665 170515 234810 154403 221021 382399 580156 422373 248696 536460
18787 536460 562969 222404 222705 528169 480878 475491 443755 201389 -65233 -131499 -69308
18776 -69308 153361 171057 270988 282687 397325 670927 931371 1149793 1737657 2342383
18766 2342383 2056437 1386095 760636 411813 411631 391904 356947 334840 295101 406009 506445
18755 506445 401815 280946 73508 17442 75897 176798 171097 272563 356298 282446 280948
18744 280948 457969 893790 790743 520790 297655 239628 113386 -25469 22018 203923
18734 203923 279015 469956 674119 809763 935707 728436 432247 236217 263040 364671
18724 364671 253032 246054 509445 435844 391717 482994 571674 507557 574815 642922 629841
18713 629841 450917 670884 759299 760481 749411 508357 303844 355519 271655 241378 224080
18702 224080 232176 143915 -5009 182398 410540 438487 380805 390956 320559 291241 366929
18691 366929 409842 529691 277862 146613 256296 438906 279433 348630 515648 457326
18681 457326 323496 -29318 -182148 57232 360965 323918 310278 321976 79563 711
18671 711 -12806 153531 228213 325440 436673 565140 555271 515675 427634 388486 302108 282809
18659 282809 219858 173712 257429 218947 77226 137956 321022 339871 263840 266018 568802
18648 568802 638237 352537 220712 448310 689078 584599 596679 673336 808060 848332
18638 848332 787839 873613 907925 1043721 1426535 1516925 1576540 1432477 1337019 1135325 1070657
18627 1070657 1026617 970432 993351 1056608 1084324 935862 1015195 1013237 896967 801927 818644
18616 818644 830152 948330 929895 854252 796952 676769 740695 754645 604060 272076 308241
18605 308241 438978 460811 676286 747644 978827 925930 974887 1150901 1084908 1222942
18595 1222942 1134058 1070080 1079735 1121566 1121584 1485313 1873805 1926722 1908452 1496136 1028225
18584 1028225 618256 541525 695234 980453 763820 601283 884134 899507 757424 988163
18574 988163 756889 553220 431506 399243 260582 253912 428042 519373 516705 640720 706442
18563 706442 782146 757634 782843 818665 907499 1063585 1162659 1100919 1135265 1004988 772499
18552 772499 669779 726977 710831 664183 640819 709152 722997 730529 730564 532068 433441 677438
18540 677438 951599 1103391 1260375 1212294 1224458 1127612 942950 952912 1313400 1437128
18530 1437128 1064438 1008504 1050778 906163 722580 652262 823922 931624 1003734 943491
18520 943491 983028 1129522 1088478 1108440 1106602 1041462 904459 1204333 1467981 1516772 1268099
18509 1268099 1112915 1267832 1404875 1433397 1369345 1482224 1211050 838234 919965 1323877
18499 1323877 1626972 1652637 1491457 1450530 1521385 1418575 1469745 1711348 1885146 2164701
18489 2164701 2273887 2429874 2292068 2136158 2021431 2172059 2362321 2261533 1924665
18480 1924665 1815892 1869474 1926177 1975408 2058769 1975724 2181406 2354237 2496410 2644367
18470 2644367 2794997 3123458 3292157 3318864 3367981 3628945 3858851 3960062 4107823 3857131
18460 3857131 3873669 3914607 3874267 4115724 4286716 4423453 4663092 4843234 5054937 5155734
18450 5155734 5360492 5577745 5774551 5899269 6217713 6760364 7419702 8176824 8759688
18441 8759688 9470487 10297024 11395726 12648021 13843490 15381890 17222894 19356413
18433 19356413 21688467 24081193 27590354 32360666 38060138 45863311 56692417 71719926
18425 71719926 92379533 121871302 161830328 209664412 258762215 294044205 291635174
18418 291635174 251978044 200455652 158721441 132955735 120831050 120454267 131413585
18411 131413585 153324096 178522894 188515821 172600669 141436720 110371786 86784668
18404 86784668 70874166 60374682 53947582 50502070 49319384 50443347 53913476 59862607
18396 59862607 68672778 81494313 101132270 129551570 162743015 184296842 180468867
18389 180468867 159121684 135970445 121077238 117145678 123737745 142779457 177749063
18382 177749063 227410367 272706156 284518512 260001471 215874112 167607370 125572715
18375 125572715 93477765 70669283 54954987 43954462 36310593 30821680 26685328
18368 26685328 23422370 20724129 18681542 16990667 15575412 14146833 12990945 11967986
18360 11967986 11050462 9989918 9226691 8548485 8021280 7601656 7258587 6761754 6352206
18351 6352206 6070857 5778548 5592057 5311571 5066631 4891797 4801944 4807509 4967471 5025761
18341 5025761 4958550 4834168 4989488 5004191 5108771 5412828 5886073 5945978 5749644 5528239
18331 5528239 5382714 5532658 5551672 5717525 6215152 6539841 6846074 7434840 8379155 9136943
18321 9136943 10225709 11136902 11873645 12889438 13965671 15670871 18229647 21271252
18313 21271252 25202182 30270770 37100064 46190814 59140115 78465554 106919766 143152184
18305 143152184 178912213 202510007 201460490 177543550 141771747 106655993 79327230
18298 79327230 61090391 49453362 41582151 36279617 32863809 30792203 30266163 31312834
18290 31312834 33648287 37612170 43275604 51100500 62639512 79829346 105888309 141675818
18282 141675818 181177618 212977620 221632213 202979080 166694566 126257936 91730303
18275 91730303 66882481 50397235 39567367 32113952 26762684 22426157 19209998 16926643
18267 16926643 14991454 13127193 11773386 10802608 10121138 9439186 8669031 7978004 7099027
18258 7099027 6360049 5822102 5105995 4673094 4530318 4268895 4087058 4103920 4211123 4160209
18248 4160209 4329598 4405684 4092503 3779592 3457841 3088002 2741026 2560197 2457237 2320686
18238 2320686 2533466 2629871 2422189 2182323 1569681 1303686 1231301 1241721 1348868 1470164
18228 1470164 1450382 1716424 1675903 1592675 1591695 1491158 1416739 1323819 1296252 1122914 1194184
18217 1194184 1491324 1390694 1163607 1303883 1236745 1147770 990360 1007993 1156944 1176694
18207 1176694 1101632 885866 867710 912728 912109 826465 828692 707482 678760 769985 685017
18196 685017 782640 949167 731341 751057 925161 835154 695732 827152 1026846 1107968
18186 1107968 1272288 1230445 1050916 960704 842979 919828 902786 674769 719437 759158
18176 759158 628034 771536 726904 704169 765045 846118 853684 808521 847453 696838 633572
18165 633572 553235 740558 1145796 1199672 1032363 911022 1104285 1254734 1214032 788975
18155 788975 837857 972016 837277 735869 1038381 1352823 1477031 1334487 1303994 1042797
18145 1042797 1055037 1374583 1805642 2024415 2126065 2128852 2229892 2404112 2714795 3135571
18135 3135571 3389136 3304979 3514603 3914522 4390519 4749445 5139784 5821005 6615458 7351883
18125 7351883 8140974 9050154 10531573 12330561 14337455 16891480 20733483 25879262
18117 25879262 32896045 42314154 54456183 70751878 95025717 136806443 213205164
18110 213205164 335593187 430628245 388186367 278519802 176314954 111492408 74978440
18103 74978440 53669317 40218155 30857137 24213652 19464973 16145687 13562971 11417689
18095 11417689 9625229 8252498 6967640 6039439 5521989 5076242 4798848 4408830 3837118
18086 3837118 3242563 3196023 3035967 2564506 2532009 2749141 3003413 2967273 2661674 2036886
18076 2036886 1484518 1386272 1278712 1408280 1281807 1115741 1357900 1315599 1078476 1196925
18066 1196925 1008358 691179 485767 647764 959908 1058930 873612 795750 844457 978837
18056 978837 1028157 1009881 830433 710017 756980 768151 627146 656630 611727 724186 686621
18045 686621 655917 499788 302328 395212 596761 601442 489135 371905 536383 797719
18035 797719 880931 893563 740262 555403 246297 352616 401322 396748 201093 105100 -144309
18024 -144309 13798 83003 302435 404616 641330 717757 553570 466850 216019 24740
18014 24740 -50770 196052 155237 177320 499082 622236 280392 264428 264038 372385 336581
18003 336581 232904 544988 827665 763299 451607 16292 -85361 -9282 27253 3818
17993 3818 -33408 -51332 124728 207930 274205 123808 361497 780926 872485 794927 173636
17982 173636 -333363 -366011 -199988 -173380 -316839 -388050 25176 197631 185777 233282
17972 233282 274168 107118 144099 130302 -98684 -182024 -129015 -118884 33890 247474 229379
17961 229379 294633 257861 153248 138148 133799 225571 162003 62291 166772 303226 408641
17950 408641 210277 200325 493069 484212 255608 209556 -201398 -418972 -279092 -92172
17940 -92172 -78535 -106127 156908 459161 317777 114139 -211413 -145786 -64891 -58276 -302916
17929 -302916 -485311 -653208 -501453 -153055 -37388 -161356 -15889 196763 376770 568582
17919 568582 648169 646468 648784 432435 442789 617083 817565 924530 1173107 1140794 799282
17908 799282 716070 802032 702955 789296 879529 803403 702992 535637 469597 672008 914198
17897 914198 779498 896795 1000826 989145 907452 813028 752302 654582 743478 837700 962169
17886 962169 704931 756752 705171 761296 606319 694657 802488 995330 1194052 1306425
17876 1306425 1117090 1073007 1372056 1406531 1289724 1190949 1184775 1036999 778529 694188
17866 694188 926488 1019523 890010 712986 702527 783918 691436 596306 708956 748344 517507
17855 517507 346964 334088 422089 298239 181776 489894 669142 689290 662821 693096
17845 693096 716341 543439 330364 295663 324868 476726 549918 659170 572820 539897 579997
17834 579997 723173 579544 619087 494439 743577 1251378 1328901 1295218 1223517 1036198
17824 1036198 1032334 1029189 816410 1002344 1495796 1700099 1568488 1484690 1393620 1401590 1266976
17813 1266976 1104753 1071521 1054102 942189 897638 990911 1158286 1285425 1368918 1404837
17803 1404837 1280950 1052081 1141502 1483820 1746237 1892789 1985198 2074657 1969574 1857909
17793 1857909 1822985 1831337 2007273 2013230 1784430 1968286 2271320 2407703 2342798 2306591 2327711
17782 2327711 2341761 2422906 2804730 3366033 3871818 3992411 4076133 4097473 4215213 4517025
17772 4517025 4534676 4477928 4838952 5564488 6360678 6768057 7386624 8266736 9251696 10307192
17762 10307192 11532924 12982297 14936277 17580078 20929319 25353418 31506995 40250907
17754 40250907 52844886 70285231 87938352 97978665 101429951 107040834 122144689
17747 122144689 145227849 158965407 149864529 128784340 111501407 104620424 102411177
17740 102411177 94465812 79755452 63440166 51147698 43542234 39420261 38570899 40105821
17732 40105821 44430009 52269309 64963772 80809728 92697858 96991141 99445113 108465992
17724 108465992 127021005 144792117 144019536 126396816 107024700 95722253 91987792
17717 91987792 86236064 72981479 56816477 42445797 31877675 24604676 19382028
17710 19382028 16073588 13720809 11872648 10241290 8975058 8013495 7306661 6738887
17702 6738887 6335131 5813169 5296689 4917773 4607231 4344661 4056301 3757972 3678536 3623452
17692 3623452 3343623 3207967 2927422 2636903 2442799 2086317 2006994 2059757 2276931 1936398
17682 1936398 1757119 1585495 1325011 1358197 1212852 1142937 945054 956933 994949 963932
17672 963932 1033824 924729 724313 892904 655795 480013 433403 493702 621704 384963
17662 384963 268227 106284 -23873 325311 355906 378939 339082 278732 262715 306581 508827
17651 508827 543971 578298 422709 402210 283555 385290 587142 597657 559913 660989
17641 660989 545106 138596 88762 311389 448317 215477 173072 66855 -56180 70835
17631 70835 266952 382687 463437 475678 300939 193722 61844 95557 200853 127214
17621 127214 32844 16105 24785 155772 333776 329345 516120 506558 433320 282883 154231
17610 154231 -119761 -361231 -164271 36468 310642 416789 434542 205811 273524 331485
17600 331485 137100 176345 332901 -20505 -366445 -398594 -154624 -10459 -161656 -261641
17590 -261641 -429287 -353731 -501452 -310050 309338 483964 222548 -59945 34016 17722
17580 17722 14347 213427 261556 542288 624770 402070 280109 185824 248639 254131 426307
17569 426307 340454 314884 177575 23690 -75342 -28454 41562 -47782 97594 96994 -30558
17558 -30558 -191860 -219244 -387372 -188302 164544 186312 253182 239729 -137899 -337257
17548 -337257 -251704 -99647 13090 113591 127460 66044 -90407 -85432 36916 96189 16878
17537 16878 -81745 -187173 -109727 195352 167447 -301250 -351624 -230093 -106796 70861
17527 70861 129602 78871 37486 83370 64355 256332 285268 233485 176657 194692 329718
17516 329718 264456 151326 140973 126842 127683 307387 272469 52058 -319608 -451944 -322366
17505 -322366 -185292 -180929 -243803 -91415 -35823 39707 174669 142304 16633 56772 91102
17494 91102 314849 100305 -195047 -254158 -103241 -216788 -228258 967 -66375 -30021
17484 -30021 -172537 -259339 -353549 -332967 -105212 46393 -12146 -218596 -157104 -28291 359166
17473 359166 454002 337615 86657 -141913 -394614 -473575 -406966 -189826 -157887 -226508
17463 -226508 -318263 -319515 -144832 49361 100344 14885 -111729 -13082 73434 150590 252964
17452 252964 360745 471884 337110 251895 493943 931599 1232637 1228501 1617405 2149918
17442 2149918 2042963 1575850 948337 392754 211969 212813 354964 377323 240226 57484
17432 57484 -242584 -372254 -227408 -126119 -177658 -5959 150435 177930 224119 163819
17422 163819 98980 162393 192668 34729 -51452 -27518 66980 258877 267419 8656 106948
17411 106948 105060 -26525 -190082 -93510 -34303 -47797 -68161 -160328 -248482 -319629 -479204
17400 -479204 -519858 -463515 -326872 -333367 -172477 -283934 -339117 -313018 -78328 -90614 -265304
17389 -265304 -95778 -66292 -223784 -295710 -182658 -491417 -736194 -347763 36074 -67753
17379 -67753 -139632 -177758 -80158 -87968 -218212 -402872 -365980 -369483 -277819 -214594 -179019 -35188
17367 -35188 -58048 -88504 17567 -125754 -432224 -488356 -142317 -79596 -43984 -62112 -46521
17356 -46521 -211533 -496027 -694940 -588818 -413433 -99817 -19284 29743 27784 -23080 -39081
17345 -39081 -25731 -217866 -220809 -372384 -306924 -208272 -331389 -234484 -132285 -153203 90089
17334 90089 37908 -209541 -393616 -100405 -96710 -211539 -332253 -411314 -221320 -117909
17324 -117909 -85270 -276845 -430038 -434213 -287743 -319378 -210731 -110145 -103340 -209652 -236958
17313 -236958 -105516 91133 49834 -97623 80274 236987 -110070 -4000 23785 -185017
17303 -185017 -196608 -103341 -354561 -565050 -568368 -698502 -452597 -386697 -299990 -421661 -156382
17292 -156382 -38651 -3384 -115334 -151731 3769 184858 428962 275018 26688 41457
17282 41457 -9071 191428 91324 -99949 -163635 -122491 45853 -100136 -125537 -255694
17272 -255694 -418502 -461463 -353289 -381412 -345099 -338952 -210622 -122855 -52041 -218678 -142271
17261 -142271 31882 -38240 115219 4806 -243487 -249029 -10480 68299 218162 211304 113077
17250 113077 74828 39605 -72107 -92456 -152695 194606 120759 -9258 39075 -72894 -214825
17239 -214825 -217103 -106280 -252637 -384734 -252206 105787 32413 -28847 81569 201555
17229 201555 265421 237924 148647 18636 -135058 -216345 -167014 95766 371656 359221 317078
17218 317078 436933 478937 437506 498643 697697 538387 398793 196732 87987 169589
17208 169589 164834 186540 59496 -86970 73961 20686 16344 372012 449550 269907 328452
17197 328452 406112 432735 242127 283590 532654 517878 482600 494560 73060 -97140 61027
17186 61027 176813 333714 389196 386022 385024 110935 -98820 12665 163286 67121 30751
17175 30751 -67908 -294589 -144143 -73436 -250619 -461836 -514690 -513172 -517422 -280892 -305232
17164 -305232 -298610 -171577 -205999 7451 135636 46734 -168193 -108684 -71870 2159 205903
17153 205903 186598 -204333 -366721 -295605 -65986 90961 -24242 -167784 -44758 -34729
17143 -34729 -314653 -423775 -346866 -199245 -170662 -427867 -558341 -607130 -457928 -112425
17133 -112425 -157905 -333868 -455317 -277463 -152530 -133502 117815 242913 265255 187377
17123 187377 14252 36910 39875 -43011 13909 6406 -74426 -18632 205261 198055 152818 32231
17111 32231 30050 215827 366519 41085 -178717 -278174 -572725 -781382 -651835 -553255
17101 -553255 -466508 -344502 -129646 40991 -156491 -207495 -57926 -125280 -205232 -156980
17091 -156980 -50229 -81139 41218 62680 53263 103057 70687 -10291 54824 -136736 -468473
17080 -468473 -199771 62247 160155 10128 -42531 -282355 -249297 -240611 77732 306379
17070 306379 179497 87158 68265 -85847 -125922 -62992 -135448 -357200 -326877 -95000 -21033
17059 -21033 -15381 -114516 -197909 -137442 -61094 -44873 -70134 -127036 -322506 -294126 -204759 -131074
17047 -131074 -70362 -62409 -187170 -253528 -420190 -488055 -130025 21622 80465 129222 177921
17036 177921 163571 117284 16069 -173439 -200550 -128168 -120975 -133590 -201919 -147603 -395847
17025 -395847 -657609 -607464 -485960 -338262 -240442 -298697 -234265 -93331 -86397 -16224 10818
17014 10818 -162277 -270946 -322151 -273284 -130666 -44193 -8671 -287942 -178676 -98647 -240621
17003 -240621 -162584 -146469 -71606 -74786 -211559 -53027 142303 13309 -111122 38826
16993 38826 49182 137103 63777 52192 -146870 -263598 -190103 -186787 -189214 -262494 -280104 -393027
16981 -393027 -291063 -249895 -194074 -87118 -49982 -112926 -112052 -328340 -561444 -479692 -463708
16970 -463708 -417902 -169699 124238 125986 113371 120579 199092 451076 299612 97557 -43198
16959 -43198 55045 225329 65978 -139393 15628 165266 153436 -30546 -100622 4323
16949 4323 17986 -466405 -561439 -303597 -68816 126202 280933 296650 405720 221317
16939 221317 113819 57180 134378 -119089 -222234 -287231 -244882 -250114 -236898 -48461 -110901
16928 -110901 9875 202670 130397 101199 -169218 -350031 -445112 -272308 -199616 4154
16918 4154 62426 -181901 -264465 -354524 -472129 -558779 -406840 -300160 -445971 -206246 -21132
16907 -21132 -34651 28336 132305 132330 -78542 -37918 8812 -8945 136660 198010 90674
16896 90674 164117 35741 -35995 -48842 -182044 -379841 -364201 -114611 110940 193466 99203
16885 99203 -5956 19792 54483 105747 187579 219804 148412 58315 -108448 -91285 -18590
16874 -18590 -89828 -214434 -101030 -38088 -100077 -108430 -169366 -188103 -183642 166243 105753
16863 105753 -144365 100784 169133 -275880 -620214 -624073 -594139 -318036 -184545 -171480
16853 -171480 -135756 -175802 -313959 -291504 -267511 -195505 -136925 22197 -144144 -111216 -354407
16842 -354407 -575661 -614379 -442290 -310951 -217862 -172204 -255736 -125266 -83467 -73938 -130653
16831 -130653 -138475 -123909 -45117 31261 178 30302 14950 -199408 -468302 -455147 -486306
16820 -486306 -425623 -399636 -436639 -535478 -559326 -452610 -219014 -254197 -413921 -586379 -555501
16809 -555501 -247768 -44981 -156304 42170 188420 18387 174057 61971 7048 -3082
16799 -3082 -155430 -323824 -255382 -168299 -151527 3938 -93767 -323717 -253015 -30442 -62983
16788 -62983 -124296 -99385 25803 8978 -253285 -609511 -484279 -198951 -21305 112309
16778 112309 42105 -157835 -392036 -495848 -520086 -304979 -49131 35391 -164414 -271515
16768 -271515 -117943 9139 -103463 -174727 -305497 -346354 -340053 -622297 -387142 -206114
16758 -206114 -199887 -166958 -46623 46013 180836 232103 189281 5542 -216130 -134791 -29160
16747 -29160 67049 -13552 261915 343657 566275 519689 91358 44465 53224 -1240 220471
16736 220471 35215 -193271 -252740 -149250 -83142 -113849 62856 95998 -80986 -375368
16726 -375368 -461293 -255659 -262639 -164592 16305 123573 -116889 -384212 -653988 -444859
16716 -444859 -235106 -138208 -251280 -229820 -242056 4363 -68468 -313231 -159370 172128
16706 172128 252081 89674 -75339 -202472 -156074 -113802 -223582 -398663 -539058 -688293
16696 -688293 -468806 -517573 -435782 -239386 -412994 -250104 125198 71232 -197416 -350725
16686 -350725 -226427 14226 -78584 -75629 30828 50832 46692 -7945 49628 -22192 105720
16675 105720 10242 17504 26606 -89516 -228617 -99750 84991 -151552 -419975 -504708 -308702
16664 -308702 -45445 41338 -248420 -355552 -269514 -145200 -219012 -392664 -405789 -432140
16654 -432140 -451997 -274899 -288673 -330869 -256937 -99430 -87353 45798 -110729 -338626
16644 -338626 -164442 36365 18358 -45831 -44135 -14632 -158735 -12054 198777 12653
16634 12653 18060 257997 404107 330934 154353 189846 238730 30915 -78304 -118979 -198330
16623 -198330 -293404 -360704 -87904 131196 171185 163085 158237 174367 142429 268173 454361
16612 454361 127876 93248 -102900 -351007 -416763 -354710 -411844 -433535 -407065 -595919 -417513
16601 -417513 -168035 -3901 -150113 -358119 -270646 -257498 -308527 -223236 -187725 -243317 -151604
16590 -151604 -4567 110056 -194220 -272933 -215392 -312197 -512252 -425448 -126815 -46966
16580 -46966 19511 71585 -102569 -155110 -223836 -291123 -402704 -499293 -299822 -60158 91
16569 91 -10516 -9333 -21475 -24445 -33905 -134087 -352364 -328524 -107377 67086 2479 -91775
16557 -91775 178121 62103 31806 26796 25674 -194074 -101650 -85353 -72705 593 -168112
16546 -168112 -295290 -189571 -176463 -178260 -171025 41486 -45089 49971 73382 -111593 -224560
16535 -224560 -376775 -454184 -420651 -578150 -634726 -451895 -127181 -83761 -89240 96826 201301
16524 201301 147255 73494 45938 -12176 -41368 -57233 -234718 -174847 -87572 -222380 -479985
16513 -479985 -615219 -308445 -51295 188940 108124 30406 120980 135376 178726 41805
16503 41805 -22980 -40660 22037 -104360 -34453 -160096 -115835 43457 -18495 -90209 -40959
16492 -40959 -133804 -81400 -145077 -97160 49944 159803 259641 115763 23316 -5247 -69129
16481 -69129 85791 90698 -22870 -149229 -85699 -164425 -207726 -274052 -396256 -656947 -574694
16470 -574694 -179169 116367 113340 23675 -148208 6422 -94689 -54427 3217 -58432 -353278
16459 -353278 -346425 -203537 -43518 -231 -33068 -18395 -72195 233714 507978 220100 82541
16448 82541 46828 -2593 60064 226276 110992 21491 -47479 152174 293352 330261 262785
16437 262785 374781 425174 225079 4268 -118324 -65368 12799 -136713 -193721 -29782
16427 -29782 -22880 113692 -66115 -131839 148058 50549 -156772 -224280 -138077 -489852 -540969
16416 -540969 -348682 -326908 -239954 202418 297259 61149 76254 215786 198925 -51671
16406 -51671 -109863 -109385 -108386 -136204 36610 202319 103836 309963 286817 131507 -30991
16395 -30991 -1809 -40687 -92104 -146355 -65314 -292264 -522379 -467201 -575351 -626617 -294383
16384 -294383 -164713 -196206 -231401 -125186 -427890 -487492 -511486 -301742 -162132 -151045
16374 -151045 -253372 -171860 -55686 -64084 -220863 -292817 -383714 -460330 -436935 -427536 -231197
16363 -231197 12539 57965 -67673 -139771 -112783 -268701 -149060 186764 214119 151234
16353 151234 11246 -36399 -209577 -181369 -134399 -185133 -114309 -224287 -441128 -665973
16343 -665973 -412724 -213024 -46832 42581 36720 -90904 -171973 -136751 -128877 -136890 -297229
16332 -297229 -375587 -535632 -840676 -677816 -421599 -190063 -66115 -140184 -85220 -265845
16322 -265845 -482695 -276093 25246 -21709 -77700 173309 72806 -64705 -100423 -65812
16312 -65812 131800 57028 -1870 -11770 53657 -12170 -211457 -160680 -349754 -534085 -302343
16301 -302343 -84225 -28548 -64729 -133757 -133594 -6328 -94169 136068 94821 -189432 -321842
16290 -321842 -574950 -473780 -320505 -142535 -153937 -209963 -147143 -68605 -25283 96005
16280 96005 -7794 -21512 99424 181702 347203 119404 61315 80545 106096 -84094 -509739
16269 -509739 -394534 -128931 -195376 -172089 -101139 -117253 -163693 5834 91028 67208 12117
16258 12117 -26270 -57614 -264006 -528196 -531144 -204297 -135385 -33083 118431 -44177 -258184
16247 -258184 -143302 197855 293809 187196 226144 410627 449343 435856 232499 -25204
16237 -25204 -162200 -324295 -283968 71771 165243 346832 619990 675321 657761 339715
16227 339715 -14613 -122051 -122384 -215203 -402130 -473134 -491871 -276724 -175733 -152202 -66301
16216 -66301 -34814 90755 91970 35014 -193098 -31962 113631 75660 -37227 92539 105671
16205 105671 55485 -32724 39170 -64634 -275134 -413771 -578021 -562582 -507298 -333305
16195 -333305 -105842 -281998 -276989 -244301 -57054 43308 100359 61534 82305 -124909 -469970
16184 -469970 -372794 -226033 -218070 -221688 -349312 -234328 -265038 -222953 -234676 -88574 106318
16173 106318 287920 213490 92943 108228 -24207 66705 -90638 -431531 -428362 -120683
16163 -120683 25528 -185009 -501801 -634189 -672923 -548544 -480343 -413996 -271582 -342174
16153 -342174 -226750 -126859 -138777 -325956 -258366 -288931 -215187 -105016 -187191 53712 525567
16142 525567 444463 313579 601556 534892 606614 618131 546588 234853 197188 187512 51340
16131 51340 -119074 -47203 98712 87418 -94703 214359 305646 249235 39723 73430 -24049
16120 -24049 35943 226474 125484 -15741 317750 305750 -97979 -367965 -382450 -279080
16110 -279080 -324949 -31993 90760 -69963 -397611 -361961 -213749 -136761 53077 318501
16100 318501 151564 -32022 -44952 -178062 -256972 -261322 -335321 -364550 -453354 -336889 -148593
16089 -148593 -76126 -218558 -244024 -484463 -363278 -55495 -164479 -155476 -101317 18451
16079 18451 70825 79196 101246 -138105 -222638 -346651 -254560 -263491 -122532 -62283 -43995
16068 -43995 -119989 -230832 -36964 218963 168752 191071 223509 199468 121775 188257 368689
16057 368689 114059 -48474 -107646 -134071 113442 9114 -195901 -232642 -156686 -57461
16047 -57461 37424 170365 -42721 24985 81053 48263 -127949 -198981 -170854 -185072 -129430
16036 -129430 46142 -38546 -203353 -342692 -216101 -41592 -30163 135717 400626 639512
16026 639512 534330 251752 59061 89624 -119409 -213594 -177024 -35241 -207431 -244486
16016 -244486 55747 229054 145635 16363 39678 162339 235285 -69629 -394351 -173511
16006 -173511 -62958 -269832 -343255 -331370 -218373 -53524 -222498 -447921 -573936 -546580
15996 -546580 -433536 -239009 -103996 91457 -77961 -35882 302789 403621 292148 137954
15986 137954 -94477 -31706 79270 5165 -103786 -313078 -246743 -140984 -100697 7204
15976 7204 49016 201524 71837 12190 -6691 -91044 175773 244813 295941 214451 70364
15965 70364 16238 -72633 5161 -86859 -290737 -342901 -479204 -581954 -263540 -166044 -150957
15954 -150957 -61225 -239854 -520729 -263962 -221968 -406155 -534156 -501551 -492575 -162593
15944 -162593 60080 -12885 -115534 -241184 -151208 -72500 -86228 -29319 164095 340671
15934 340671 331674 142372 -113266 -43676 133216 178201 202016 334852 276808 255816 239312
15923 239312 -79021 -273979 -216345 -149142 -93843 -54702 -190065 -250029 -167647 -307543 -302569
15912 -302569 -229794 -44857 -90883 -117583 -128038 -169086 -150928 -294632 -356849 -257506 -218749
15901 -218749 -195892 -129353 6409 187299 137830 308239 497493 630100 618182 551221
15891 551221 320583 169650 89214 -33703 -3347 -54441 -136336 -493913 -308102 13613
15881 13613 145330 90293 -59556 -39207 -6148 46460 -23773 -185280 -290005 -298534 -374891
15870 -374891 -549822 -693499 -573390 -293143 50761 252571 3736 15972 93800 -67460
15860 -67460 -197762 -299946 -247502 -139178 -115788 62825 130398 139880 322424 466522 201340
15849 201340 -13644 -181069 -203766 -76784 -121206 -162106 -118797 34419 -261832 -307509
15839 -307509 -273852 -31065 22314 -46801 -154029 -210549 -195687 -186221 -353940 -199952 -280003
15828 -280003 -342739 -395551 -396703 -246832 -176048 -135730 -257200 -5656 286890 188913 206597
15817 206597 221601 282956 263843 332149 346916 146751 69135 121300 51815 -215147 -264524
15806 -264524 -203944 -152193 -104393 -129701 -35582 -15145 158750 198918 130089 400864 491878
15795 491878 153217 -105970 -314605 -291932 -195969 -100544 -269712 -392503 -291972 -98874
15785 -98874 -119420 -101187 51714 13620 -79261 -72090 -263050 -96142 -37777 77817 299614
15774 299614 442159 292424 -15688 -207995 -183610 -117004 -113916 -179755 -129800 -298927 -394304
15763 -394304 -73736 160299 203767 211285 237769 248699 185422 44278 25022 103419 105293
15752 105293 163436 299235 147361 278688 577144 266227 -98460 -325897 -265384 -100708
15742 -100708 22380 -26665 -225677 -193018 -252523 -292588 -238238 -21746 101995 102526 -45427
15731 -45427 -24133 160762 135918 -273251 -510830 -347452 -111251 -256744 -322732 -300890
15721 -300890 -408011 -266612 -3117 -155472 -192518 -4336 87789 96928 28782 12613 63310
15710 63310 25314 205416 448703 297708 -7423 -333476 -202219 -34902 -67584 -143131
15700 -143131 -127218 9176 54005 -80031 -31488 97376 45083 -249649 -558255 -521219
15690 -521219 -301063 123084 302632 360090 217874 65482 74707 154964 331752 343984
15680 343984 226482 149818 74427 204350 260066 289698 211259 -3037 82575 51719 45559
15669 45559 -38521 -181542 -451535 -579673 -307069 -99274 -394 31476 -295462 -507215
15659 -507215 -488852 -525706 -389002 -371742 -422459 -323097 -232740 -110814 -279157 -225901 -26491
15648 -26491 102683 189376 233141 237264 204298 13765 102947 223527 205650 -132498 -189553
15637 -189553 -217535 -167544 -124080 -110720 -19717 -110837 -359669 -441002 -250827 -173875 -224689
15626 -224689 -111084 -113608 -64981 42315 -85507 -58714 -199572 -429202 -319148 -261691
15616 -261691 -292828 -153987 -159009 -20619 -100117 -131545 75546 169951 61568 -141246 -219229
15605 -219229 -158973 -48476 -7841 55920 -12281 -86682 -105104 -139768 -97858 -312498 -303392
15594 -303392 -34333 102491 272466 324084 216900 -108087 -152653 -2284 93441 -64521
15584 -64521 -355033 -79409 117267 284369 2564 -59333 173739 93748 162624 443680
15574 443680 558489 551946 509528 224833 -160009 -202707 31413 198429 453604 423347
15564 423347 29620 -129588 258218 108996 -94473 78170 152565 154776 193457 248361
15554 248361 145709 6599 -101620 -265870 -181103 -261488 -108050 245487 167351 143231
15544 143231 -61427 -81636 -171365 -241047 -118654 -69848 53643 259525 235688 -18120
15534 -18120 -60829 -75073 -204522 -394396 -587310 -586376 -499385 -308357 -396645 -337790 -106078
15523 -106078 108547 -128588 -70375 189612 176107 118085 -62198 73880 24236 -272744
15513 -272744 -388765 -312071 -277780 -234367 -236399 -115021 -108275 -181695 -183556 -54877 115796
15502 115796 134352 10949 114834 69085 -131817 -167623 5150 367254 423007 99908
15492 99908 32782 88493 52273 -55712 11651 103454 228885 249229 144318 -27211 13649
15481 13649 136770 244452 290683 190813 323400 601406 702015 506333 298132 53253
15471 53253 -55479 22316 -59574 -40739 76467 118339 -176804 -290301 -88222 16915
15461 16915 -52205 -184195 -433865 -485405 -258773 -11721 -10298 -33658 7820 276444 211322
15450 211322 49371 35230 102026 115731 -39932 57607 181343 45 127627 375093
15440 375093 497646 474370 662335 683340 519924 159398 83521 -56597 -64784 333622
15430 333622 472375 225855 96019 6262 100564 415300 432217 319579 188443 -83730
15420 -83730 109319 260768 283235 65599 -110102 -132028 -78698 -210570 -111581 -96458 41907
15409 41907 152316 61416 -56709 -162920 8892 337527 342412 115897 15461 98725
15399 98725 -132194 -48984 199803 253627 201029 58844 172138 230990 144546 23739 149143
15388 149143 243342 118667 -59894 36286 367040 393181 285100 39661 33133 102252 270675
15377 270675 464419 336837 -37316 -65115 -292867 -443433 -315229 -126656 84417 169675
15367 169675 186798 328412 296414 102490 191904 411277 620027 358298 144488 47241
15357 47241 -10156 33985 138681 -11460 -157946 -256087 -106276 -25769 -29388 -174623 -175898
15346 -175898 8082 -169365 -302342 -245497 -324731 -333515 -181903 -184491 -23315 278868 453981
15335 453981 365631 56780 -12129 51100 276238 331361 167310 93167 72310 152387 237753
15324 237753 164374 108760 117467 -86887 -282388 -19202 320557 347059 298757 448653 476180
15313 476180 74600 -124339 -179406 -322066 -269069 -125872 -112920 57863 169280 -135626
15303 -135626 -144341 -206539 -50075 -57988 -400144 -609346 -222861 91324 149762 257894 -5649
15292 -5649 -261519 -65926 115645 179124 242715 149376 -7109 -57974 28354 -61066 -248780
15281 -248780 -334127 -188649 -87543 -30748 -119263 -83739 48733 -54804 -108881 118400
15271 118400 467334 408696 331546 244152 310960 346377 500272 601514 562253 249628 193305
15260 193305 342500 210922 -15726 80725 34868 -58150 149283 204396 68404 207298
15250 207298 188296 180417 191392 176366 170785 -149939 -409252 -349386 -187646 79754 177822
15239 177822 196625 123445 -3502 46307 83060 188061 325202 309353 184974 -10704
15229 -10704 16213 85696 116764 -233302 -353407 -265662 -245677 -227920 -157643 -116292 -368477
15218 -368477 -198695 -108527 -78314 -142432 -175850 -283196 -91585 343843 104840 23949
15208 23949 296129 417993 214940 -88862 -264241 -162069 17404 142650 189281 203913
15198 203913 4509 -75527 28134 -46484 164167 314300 129179 38255 -13082 -46695
15188 -46695 -126728 -231357 -153230 25244 302868 389147 451556 401053 222020 13662 -108931
15177 -108931 -187053 -448438 -420535 -340757 -163792 74290 -108480 -190275 -142895 88103
15167 88103 81111 172162 186597 146272 143483 53251 -92997 -275412 -324194 -355166 -186774
15156 -186774 -169294 -110585 -72112 47894 31322 -149301 -95832 82678 -57014 -151031 44933
15145 44933 144178 207319 213168 253322 469816 496474 126730 86024 318841 304504 117227
15134 117227 89708 127907 24241 3912 -127240 -269876 -136385 10907 10603 -106709 -246203
15123 -246203 -275494 -422565 -399330 -348282 -289252 -349326 -224278 11962 388422 432924 225670
15112 225670 92954 -109644 -537821 -612241 -604035 -334127 -174215 35751 -71435 -10270
15102 -10270 -78501 48820 -83018 62219 374239 213690 15964 -122968 -60823 201162
15092 201162 230305 47807 124466 148548 334424 244934 161957 369336 237372 24414
15082 24414 -55852 -757 -196265 -253210 -148763 -52368 -121313 -151577 -280625 -299963 -152979
15071 -152979 -197390 -348268 -235122 161844 151829 -35502 5581 -214841 -349156 -209031
15061 -209031 -190941 72912 166835 144455 35804 -257162 -547887 -426240 -172896 -60841
15051 -60841 173651 271676 339338 386324 347894 323601 269586 -7754 58846 94744 124550
15040 124550 166379 163133 111731 17850 -129041 8375 88315 100681 5731 -233070 -53839
15029 -53839 103136 1744 -209306 -135519 -61070 15614 264685 194433 46346 15220 -325876
15018 -325876 -551047 -595442 -320863 -50108 -344568 -468163 -442953 -258677 -90483 -23360
15008 -23360 21155 -186105 -186856 22384 139282 -16807 -96632 114548 342787 280813 147826
14997 147826 -27300 -136176 49086 190656 363191 268292 80607 -41687 38705 125913
14987 125913 28015 -5622 -35475 -7364 493952 556102 49653 -55649 111 -192655 -196949
14976 -196949 219289 438012 326034 -15198 -99451 -1280 60764 193356 256137 52322
14966 52322 126452 197490 230176 187584 173348 362525 355204 439715 468463 309098 197421
14955 197421 90155 264658 391159 297050 198245 36601 -69004 11835 -130296 -264507
14945 -264507 -254595 -333568 -169685 76298 349935 391157 347522 -26924 -25148 223286 135478
14934 135478 -50814 61490 -149719 -164047 -433174 -719970 -637247 -384401 -292825 -254722
14924 -254722 -304657 -161872 -131411 -115239 -49195 -126894 -127053 -63673 -15987 182703 372834
14913 372834 324880 259726 181252 58941 178330 -13238 -348667 -474912 -461188 -375983
14903 -375983 -265136 -305551 -223657 30695 129075 132794 80662 135417 206108 416014 585536
14892 585536 410835 276699 124077 -34774 54118 155173 53330 19436 -189149 -178256
14882 -178256 35886 -35960 -207731 -91840 21312 13670 66822 152362 270793 268028 197795
14871 197795 235328 126080 31413 -96487 -123082 -147827 -406493 -137247 277022 320583
14861 320583 224273 247596 197006 -29243 -142167 4561 323453 450491 407540 307235
14851 307235 72183 104437 153109 213204 233418 111235 -189471 -350440 -294444 -141540
14841 -141540 -2840 173374 186465 110354 61810 205735 398128 204545 98876 39579
14831 39579 65993 180850 272422 147173 -16697 44989 100369 -56983 130765 385047
14821 385047 485073 515343 295746 140943 82048 140288 266288 347661 295577 429390
14811 429390 412003 417371 446049 532040 678682 685182 486404 658680 583997 293486 134448
14800 134448 137489 352611 432221 592841 739188 716923 845713 900240 818376 750881 762033
14789 762033 884114 988883 958499 856249 500917 579498 771251 728927 713747 759746
14779 759746 1020602 918514 1033474 1144622 1133399 1263931 1523613 1378370 1252945 1242056
14769 1242056 1006749 958676 1117899 1430543 1610659 1463264 1090462 691585 707451 465814
14759 465814 284908 494926 531150 604696 576825 565954 596941 568790 592186 775085 698001
14748 698001 530653 446112 390416 406592 290762 214771 131614 -53187 -174665 -191999 -116652
14737 -116652 126552 546796 454611 251819 117361 230173 297674 97683 -283777 -316910
14727 -316910 -156950 -119209 161732 494905 309675 179217 152830 155737 233618 256374 222435
14716 222435 294137 198875 158370 224182 314003 346885 364299 328504 148088 138006 205965
14705 205965 245986 417191 375485 273003 312010 373694 500634 867427 850298 551060
14695 551060 404366 380027 342408 281374 22904 51259 82596 123111 76517 130199 288530
14684 288530 444505 690010 436168 153808 46900 49971 127180 186865 298967 198458
14674 198458 32019 91733 394888 370981 196382 82068 123393 249259 252560 112095
14664 112095 -1094 175327 274028 304817 116593 22010 158389 135368 116133 248424
14654 248424 321111 330069 236284 69289 136666 90798 23664 -60750 -96651 25576 264013
14643 264013 390322 399931 394092 304276 174819 304793 380604 165172 18299 207536 220101
14632 220101 107469 207018 401136 344989 123938 215577 209570 404591 398582 326521 387008
14621 387008 294326 212921 370994 604264 294295 59915 46754 158754 107680 113686 194706
14610 194706 297873 194918 257392 402829 307477 207672 145252 172613 326644 491833
14600 491833 591387 758537 597784 622532 867106 893848 692284 731334 784549 706457 632598
14589 632598 658050 511803 354978 514479 666946 625541 570556 516146 657649 790223
14579 790223 804187 708657 539020 315279 116456 247546 530573 586532 325531 102927
14569 102927 477080 673247 862926 780653 652358 529149 485855 517055 542717 542124 700590
14558 700590 742989 594023 414652 250026 205646 276952 449264 546020 813008 821129 714414
14547 714414 415366 297327 374087 308087 365067 378845 240771 79345 194894 220879
14537 220879 337448 192833 249329 388879 278660 350087 222473 324277 278057 285150
14527 285150 598083 594703 327765 417776 624287 583084 422213 550967 509774 583539 635634
14516 635634 462553 373572 441146 464564 330562 357648 348893 240457 321913 488296 425712
14505 425712 417420 289290 122763 206591 319832 439295 562913 663077 599356 563950
14495 563950 624974 711827 754889 790673 735063 494533 279603 501313 476617 410907 412638
14484 412638 353552 498808 454581 435591 775051 765888 787572 903030 924462 789645 640191
14473 640191 503103 559541 726248 790063 803169 867308 881116 958100 1080951 1062569 908982
14462 908982 998998 1157097 1203561 1263505 972036 889331 1112983 1204354 1149374 872885 830081
14451 830081 806969 951445 1114104 1192674 1187076 1272346 1147724 1139049 1235618 1021094 963648
14440 963648 1043529 1211145 1602753 1664363 1520092 1322501 1239155 1328087 1385339 1328456 1247148
14429 1247148 1387746 1495815 1405841 1153648 1380339 1523077 1723746 1716312 1581686 1704661
14419 1704661 1688691 1641774 1536877 1450737 1435345 1573729 1727397 2048930 2289271 2118742
14409 2118742 1973241 2029594 2270716 2440176 2577975 2656300 2652263 2660792 2495514 2685683
14399 2685683 2855792 2925966 3179096 3182076 3238115 3525215 3855888 3992639 3802965 3875281
14389 3875281 4110961 4202383 4351170 4699212 5123520 5297187 5446362 5602899 5673778 5933421
14379 5933421 6139701 6750952 7358082 7866250 8237415 8653910 9204673 9625029 9974076
14370 9974076 10406584 11126099 11919294 12406921 12887748 13595094 14408390 15456225 16801347
14361 16801347 17862476 18961440 20221985 21810553 23637524 25664399 27821016 30047698
14353 30047698 32419539 34968207 38279854 41984112 45726156 49903792 54534811 59585750
14345 59585750 64953612 70872788 77054543 83526469 90391004 97537305 104838357 112257131
14337 112257131 119540733 127059870 134414524 141632191 148537421 154895186 160455899 165471310
14329 165471310 169830408 173730553 177027008 179772467 181894722 183781408 185216517 186049558
14321 186049558 186396483 186369680 185881067 184926448 183585607 181810911 179862819 177239286 173882276
14312 173882276 170023922 165754922 160783323 155287258 149490390 143096373 136150499 129007109
14304 129007109 121599763 114077263 106512822 98980282 91633325 84599165 78083840 72038074
14296 72038074 66091395 60404352 55173039 50186463 45960597 42218128 38579084 35507191
14288 35507191 32637324 29983407 27510984 25019254 22771837 21096452 19597882 18193081
14280 18193081 16751539 15280356 14039682 13066414 12167456 11304964 10640914 9808348 8850135
14271 8850135 8344081 7868696 7482850 7261113 6806989 6220352 5762945 5588055 5288017
14262 5288017 5210407 4849680 4567614 4331957 4257591 3983912 3634949 3494414 3533738 3370317
14252 3370317 3253208 2931248 2682727 2648792 2600005 2746512 2767639 2463403 2105965 1907635
14242 1907635 1869321 2064696 1938993 1812846 1746265 1450436 1307267 1092665 1362338 1597965
14232 1597965 1583521 1386090 1195458 914673 934048 993963 1030356 1144820 1168458 996268
14222 996268 624956 777203 868735 1106677 965641 688587 828826 954110 909905 758512
14212 758512 843206 787398 635323 617794 791917 630854 466051 581512 658247 617352
14202 617352 811460 736420 507075 498408 573280 582786 602035 485141 513630 463281 406653
14191 406653 542071 352905 422713 663122 575822 430363 144598 46434 -31746 62958
14181 62958 292590 493572 425043 164246 -31419 132791 314204 36728 -271312 -295090
14171 -295090 23322 192062 359471 425284 563703 437749 359429 438999 474395 240439
14161 240439 -18430 61241 458909 392986 317457 473684 533202 587428 620222 461497 553991
14150 553991 247262 9136 5998 -4280 -91938 -210588 -162616 203690 98706 -35538
14140 -35538 43023 67024 21807 69606 382845 367399 372515 500339 598827 479807 191132
14129 191132 265574 240327 72511 113475 33875 -128441 -227320 -77374 31513 112781 164156
14118 164156 111454 -111713 -80433 -130197 -219209 -185214 -118382 72198 244115 173784 170880
14107 170880 234965 233375 342890 223605 168819 -56862 17913 43608 -67975 -10318 162186
14096 162186 426581 280888 134703 122659 -21437 77302 34286 219078 362024 452435
14086 452435 113212 -118112 -159575 231282 397920 272903 51319 -37781 -171587 -158591
14076 -158591 -28914 89516 -41860 -382429 -527371 -238949 -50086 -175706 -47792 25020
14066 25020 42358 125020 -80869 -218435 -120892 -43735 123382 60585 122040 131563 214750
14055 214750 229354 117929 96887 -222159 -273317 -256115 -290175 -288402 -196188 -180689 -169739
14044 -169739 -169892 -231375 -244158 -208896 33888 192936 89815 -89857 -66562 -82536 -205697
14033 -205697 -94189 -5264 -53143 -82617 24104 112517 60829 6627 -33675 -31215 -94460
14022 -94460 135081 162879 72832 145429 283634 193266 117594 267710 116054 -99737 132176
14011 132176 339304 184139 319516 543439 520403 230418 341551 396203 198822 -124246
14001 -124246 -63326 -175208 31891 128084 103438 66957 360152 142743 116047 20385 3416
13990 3416 -183301 -103688 -205397 -385671 -265584 -323787 -195812 -262523 -412663 -375976 -4451
13979 -4451 140587 315862 327636 97866 -76685 121449 179275 140341 97126 -9907 -189622
13968 -189622 -152495 -65735 22759 171566 57084 194845 -52710 -142758 -133188 69695 143083
13957 143083 -32545 -17191 124313 144405 -28734 -55858 -196227 -279165 -173293 -231229
13947 -231229 -230053 -217912 -159106 -203072 -175121 192341 346490 333342 450107 610883 545716
13936 545716 482568 254010 109360 41654 99624 45492 95539 222925 80389 -81385
13926 -81385 -115325 -184685 -282477 -66828 -83625 -193829 -143823 -171228 -178342 -83015 -13945
13915 -13945 -32741 45311 63711 -11985 159845 388213 385416 235275 -65400 -90691 -139842
13904 -139842 -375393 -479245 -288662 -201502 -294862 -57163 303100 498652 500778 220240
13894 220240 52709 66910 192563 91535 115634 -10806 -90043 -45704 136854 337803
13884 337803 335366 329405 479691 536753 500868 400027 381416 582662 644272 841328 877812
13873 877812 935276 951989 567704 376802 445330 713030 722078 906358 988435 848410 891126
13862 891126 1041139 821964 638002 574674 865798 1063962 962129 888615 804012 792168
13852 792168 831980 1057730 1109784 1051742 891855 551394 455903 386761 544636 514828 575237
13841 575237 307318 174769 251684 412762 323358 278854 294678 190889 104501 -59964
13831 -59964 -114183 47974 -78413 17313 323398 317673 59464 -14952 -56806 99851 117558
13820 117558 155427 231441 224353 353997 405204 325006 167410 170986 -2123 41718 240231
13809 240231 290934 130865 270508 233517 209610 116424 191273 143472 184791 246987 70092
13798 70092 -72940 -108302 166697 335781 380837 249554 -3890 64349 56785 -74879 40207
13787 40207 -7563 -229756 -240304 -37418 132821 113563 248314 368622 332822 356275 361039
13776 361039 285549 32123 84026 155026 257573 255494 196739 49286 -78376 629 -101549
13765 -101549 -126307 -32917 77470 -44739 -56420 -50680 -18653 -200732 -158970 -117773 160951
13754 160951 398755 257344 -7973 103680 163175 104702 -183666 -378791 -264412 -380155
13744 -380155 -236350 45410 159781 120790 210798 246025 81376 -56401 -38167 -19936
13734 -19936 155864 276712 230072 245667 370909 351263 222735 -62988 -165693 -69492
13724 -69492 -245825 -353023 -4481 -21045 131772 43395 -1358 -200920 -389509 -224807
13714 -224807 -155067 144793 574564 395934 -126894 -300027 -287878 -104046 74143 156155
13704 156155 207543 219869 -16593 16740 -124630 -256546 -85370 -209347 -178042 48713
13694 48713 362591 742850 805193 591238 367486 51501 85366 189619 278932 174813
13684 174813 120941 -94968 -88494 -183918 -130718 -84556 -123135 -5430 1578 -62958 -11751
13673 -11751 -151552 -30310 -11955 -258773 -474180 -435719 -304914 -240238 -241073 -90552 -205616
13662 -205616 -326236 -111460 21867 78030 152994 42123 -99446 -109756 -259764 -330375
13652 -330375 -175318 -17547 126698 133944 47531 -39814 -20505 -262741 -327831 -395520 -396751
13641 -396751 -404207 -377490 -332362 -180662 -232624 -161109 -24264 -276416 -271074 -139145 -153465
13630 -153465 -155306 29821 -87566 -234989 -284242 -217067 -141436 -1708 149057 132302 -45249
13619 -45249 -92024 -201996 -200048 -320325 -392969 -359262 -346639 -416159 -189505 -116199 246213
13608 246213 165905 158509 235535 150934 -82780 -195067 -143394 -21897 190270 224279 64253
13597 64253 85026 94551 81714 6805 -10549 252103 289537 194673 191246 155882 24586 35847
13585 35847 27192 86149 176725 347266 391054 157362 126263 187038 154316 -53676 -200974
13574 -200974 -280016 -215267 -220671 -125613 -206855 -103987 -174758 -252230 -347431 -228267 -204089
13563 -204089 -150832 -139032 -204591 -370818 -569953 -465511 -286318 -228165 -19351 -104311
13553 -104311 -52912 -266183 -127402 120205 169048 145803 -2901 -27677 -342820 -453733
13543 -453733 -255078 -195744 -281574 -95798 55839 126952 156985 121283 57220 -33875 -8410
13532 -8410 -130930 -38935 35433 -10827 319324 480826 410096 192149 99738 -34478 -190863
13521 -190863 -123840 -145818 16917 37218 112810 147936 68030 -9354 4041 154121 11458
13510 11458 16473 82182 83785 124215 63590 -276660 -508778 -535960 -470438 -288068 -69043
13499 -69043 -156641 -375301 -404174 -545846 -180938 4374 -58033 -220531 -319913 -135519
13489 -135519 -248186 -455400 -371000 -85812 140499 10968 -211593 -362154 -147097 -123763
13479 -123763 -85336 -75129 -147611 -139781 -230190 -345165 -517461 -441241 -233881 -98856 69698
13468 69698 36326 50625 7473 -146863 -147971 124326 214088 310543 232939 239668 288782 281696
13456 281696 262269 181061 323360 295607 366281 295145 263859 -23733 -39204 111736 322439
13445 322439 432011 117491 -32847 -46277 92103 90612 125373 228653 38416 -104277
13435 -104277 -72737 -93188 -107345 136251 146039 -59494 -141074 49941 33912 -52761 -92627
13424 -92627 -29632 136225 -40931 -110169 -20625 10167 -40549 -165502 -127211 -21784 134484
13413 134484 123063 3264 -43936 -106974 -258308 -184120 -84987 390934 363596 -117375 -348039
13402 -348039 -432599 -416138 -335830 -297058 -375102 -276146 -137746 -69591 -99256 -229812 -192165
13391 -192165 -97686 196248 90509 -298415 -382794 -242393 -167206 -183483 -397550 -459437
13381 -459437 -589813 -483479 -387327 -268866 -58213 44056 -254142 -333797 -27642 2977
13371 2977 106902 207208 236852 414454 400678 341560 257631 172871 98306 -65160 -49025
13360 -49025 -4246 116367 173902 -30495 -294518 -488841 -349499 61201 135694 325293
13350 325293 57287 130585 367473 336612 308536 354287 219440 -101708 -67370 -85579 127241
13339 127241 85960 125960 210008 145177 231958 281994 484417 441408 327479 -23128 -264190
13328 -264190 -304579 34000 94450 117345 -24134 -255684 -440871 -337962 -82345 215241
13318 215241 174067 168417 106839 167745 222153 291347 203108 141620 47371 -78560 -27828
13307 -27828 -93154 -43499 13272 -54962 -112398 -142597 -141967 -351829 -412602 -87739 244589
13296 244589 328376 222900 -157160 -197523 -39931 -208739 -424622 -477638 -530623 -556566
13286 -556566 -554084 -113006 -7585 -223551 -125410 -86297 -15147 136575 164333 31075 15604
13275 15604 115424 77333 -80314 -201861 -218620 5353 143309 219941 96549 119309 148421
13264 148421 168667 348567 143154 107026 9807 -179946 -35841 -30323 -172234 -180753 -35113
13253 -35113 -201487 -505492 -352776 -211989 -287556 -146044 -167250 -301589 -251543 -66903
13243 -66903 -68405 5348 -1213 77806 -67634 -208792 -46492 1015 17540 -96924 -113338
13232 -113338 -112197 -216476 -146316 -115973 -200803 -369051 -587237 -328244 -108320 -1516
13222 -1516 173421 128528 180498 -10536 -64265 -96297 -434756 -585253 -408693 -21851 124580
13211 124580 137134 153315 -27693 -135370 -129134 -121667 -82739 -344585 -570474 -326683 -154007
13200 -154007 18059 47981 247402 131935 1560 -5063 -97510 -126577 -173445 -45369 48784
13189 48784 -29100 -181136 61634 170467 38249 30165 466405 533890 392636 401562 341771
13178 341771 368118 160214 79121 203330 88725 -61419 33628 -113235 -174329 119754
13168 119754 227694 101259 204746 216267 -28225 176499 62176 -146167 -186020 -106929
13158 -106929 -162555 -229730 -290347 -189811 -83365 197698 351815 187205 308634 175261
13148 175261 198132 91722 69715 230882 282956 190279 277944 408659 361142 126384 -8368
13137 -8368 11428 17186 -89418 -15288 62637 -76327 -243257 -122476 -186285 -20685 -269637
13126 -269637 -218975 -78058 -179503 -316972 -268955 -88480 -71893 6046 83327 -51264
13116 -51264 -179603 35626 2416 44269 92893 -28652 -137189 -308377 -235863 -130063
13106 -130063 -29998 -106300 -227815 -22540 67334 -2952 -74376 -121956 -185496 -269031 -121744
13095 -121744 49565 -80210 -290179 -109436 -73345 -193766 -236122 -207133 92655 140292
13085 140292 -98411 -238015 -266551 -320892 -359512 -73757 220171 94543 -253917 -189015
13075 -189015 -211630 -239484 -353662 -475513 -120838 -17287 -67462 -198321 -331785 -91297
13065 -91297 28432 -30901 -45733 -111585 -38219 -86099 -143791 51674 424 137608 330290
13054 330290 474539 536736 471821 428869 144081 198465 194080 86593 -107146 -36607 -43507
13043 -43507 -181713 -271473 -117332 -4376 -66943 -8339 -2543 -35800 -34831 -118922 -227967
13032 -227967 -328539 -277225 -11682 -48637 -195340 -336467 -120114 -3095 -75462 -58611
13022 -58611 222887 112246 -59615 -19218 -964 103057 98220 50793 -66694 -91873 2406
13011 2406 54686 -243310 -237797 -204256 74122 218642 183822 60352 -19542 -107745 -144832
13000 -144832 -37766 -8794 145635 127678 -33208 -113022 -10970 -105941 -182213 -166301 -110242
12989 -110242 -158129 -220935 81630 313932 448000 113193 -110243 8500 -91129 -367628
12979 -367628 -463403 -230710 54160 -14295 -38820 -196046 -177905 -386015 -503977 -457024
12969 -457024 -621041 -555346 -474200 -367282 -369279 -312333 -327397 -151267 -4477 -14607 -24636
12958 -24636 -203321 -322157 -326766 -536128 -659488 -577072 -474755 -279033 -50062 134832
12948 134832 202345 39271 -95289 -201688 1105 165627 323276 162283 -158639 72866
12938 72866 359633 316829 254707 220425 20719 -247173 -151885 -272682 -81854 92490
12928 92490 198184 143685 -110043 -377115 -285064 -156123 -202032 -320456 -255088 -135959
12918 -135959 -18137 -180406 47719 151279 230484 153514 55910 -153931 -405504 -396546
12908 -396546 -192808 -144265 1072 -164962 -179552 -134460 -162027 -229691 -430691 -281321
12898 -281321 -122476 -47680 -79939 -19934 -147991 -216676 -298116 -209929 -214618 -292405 -447960
12887 -447960 -512234 -75027 46416 314724 537220 101021 56071 174905 -98266 -183478
12877 -183478 -327330 -334816 -174056 -97578 -50246 127749 317805 416231 612765 615916 320577
12866 320577 157032 147132 62720 -67691 -36542 -63989 31935 35546 -104274 -78878 -47049
12855 -47049 133379 384101 414979 224809 319821 648617 569191 305730 238510 190516 330877
12844 330877 309002 361766 228376 153869 -88549 -195385 -295456 -319395 -282023 -181214
12834 -181214 -179528 -87094 -21751 -51568 -170225 -186108 -40721 35754 56062 115351 232478
12823 232478 317844 188976 -32319 -59553 -47007 -16101 17492 189666 321217 287048 293475
12812 293475 289468 158218 54857 105643 -58408 -27589 105676 155402 125401 64856 114906
12801 114906 80124 54507 61936 -110577 -290850 -391941 -457390 -257209 32412 62873 118707
12790 118707 -4459 -130205 -25814 -155469 -347793 -239629 -103687 4983 -19881 -2639
12780 -2639 -61599 -29998 101878 185386 -131413 -381704 -345447 -333270 -489155 -338650 -302067
12769 -302067 -154874 -19966 -104291 41438 82238 15875 -43209 -80491 -22612 -35367 -90961
12758 -90961 -136213 -241959 -204859 -177096 -133965 41708 -257426 -402847 -401426 -357943 -175746
12747 -175746 18774 12541 -113731 -180358 -351143 -309855 -188207 -196865 -103065 -359486 -363270
12736 -363270 -157248 -25116 201559 131764 88121 55387 271394 476764 510028 135636
12726 135636 -362004 -381323 -392011 -324406 -158521 -199318 -111136 -153804 -260803 -286340 -142995
12715 -142995 -73890 -72251 -18452 -217029 -337730 -183412 -223383 -217777 -133331 -113980 32577
12704 32577 -15005 -77452 -338101 -406755 -191058 -158989 -124073 -64797 -153711 -224338 -167354
12693 -167354 -172950 -127970 -72864 850 -22570 -1978 52878 107074 20502 86282 -223461
12682 -223461 -292649 -208252 -209943 -174507 -163128 -231839 -224442 1298 2244 65502 -58530 -167229
12670 -167229 -105012 31055 89849 -222177 -344288 -232962 -236735 -50215 140691 171185
12660 171185 68360 101600 228926 270288 31552 -245806 -381445 -359498 -355504 -398121 -94505
12649 -94505 103285 -106387 -300113 -264251 -70593 205592 202402 129362 -20403 -86187 -10412
12638 -10412 204249 256976 106680 -16168 -79074 -80993 -87792 -309599 -249850 -66949 -100789
12627 -100789 -154205 -121715 -84518 -203114 54860 5702 -176522 -299670 -200794 -278499 -456638
12616 -456638 -496435 -169998 23363 -34513 -246830 -102371 -70896 -157308 -199567 -369682
12606 -369682 -296367 -287687 -376145 -590812 -772159 -741319 -632243 -444544 -279910 -203983 -75281
12595 -75281 -225069 -428747 -489449 -106441 -54046 -87233 -2356 239362 71179 50866 304094
12584 304094 443368 441508 448631 311519 116462 60084 -52621 -18908 -68465 -39529 213218
12573 213218 193674 227170 364118 302122 45276 -227576 -134758 97802 114500 103967 58038
12562 58038 3960 -199164 -429368 -335345 -242097 -163060 116380 47343 -17603 -53163 -115485
12551 -115485 -317198 -394505 -38448 135142 202060 410770 533915 584723 328620 152929
12541 152929 62549 4110 -132632 -215202 -165333 -11304 29979 -219718 -333876 -230992
12531 -230992 -236110 -27087 102498 10341 30745 56321 -12287 -158635 138088 23715 -249354
12520 -249354 -307993 -228692 -66836 -51220 82448 243022 293546 167387 -263794 -614402
12510 -614402 -628379 -706228 -704852 -620769 -538035 -347952 -173462 -111752 -62462 217522 436987
12499 436987 195480 -89412 -408650 -357012 -34643 241931 393924 430867 344729 439685
12489 439685 226637 97464 -83716 -124204 -96978 -182461 -181716 -327718 -323458 -212394 -111091
12478 -111091 -5540 -116884 21754 1381 -169200 -174114 -183051 -131358 -103490 193042 57472
12467 57472 -207529 -245760 -187386 -31183 -170461 18086 -80230 -6035 93156 155579 10498
12456 10498 -303824 -493814 -243328 -115247 -251047 -123193 -66479 3040 -77443 -7189
12446 -7189 1650 178654 57928 162669 125227 160057 -82638 -366339 -494707 -414744 -60134
12435 -60134 19108 122083 -69991 -71864 -3803 82805 136448 -10500 -25089 322165 318379
12424 318379 35276 -241092 -351276 -235772 -103325 -37779 230896 329184 156150 93918
12414 93918 104032 282321 562987 375184 129150 56626 66521 93174 142298 220092 79387
12403 79387 -86296 29598 114174 194013 -4169 -154904 -377779 -447692 -419049 -290097
12393 -290097 -147045 154510 241108 141645 -156351 -294165 -184881 -259912 -167029 -34114
12383 -34114 -65508 12290 -106799 148242 -57093 -127504 9139 687 263674 389577 218973
12372 218973 41900 -103567 -241829 -401083 -417711 -349315 -265201 -284727 -354412 -378034 -291698
12361 -291698 -262627 -139253 -35329 -58784 -107761 49018 -144623 -94534 94572 177607
12351 177607 -226512 -119787 164341 153310 89595 101727 123236 57788 362160 270423 -14215
12340 -14215 124738 8920 -213031 34371 155246 46552 42057 289820 234827 11513
12330 11513 207910 163099 87839 283956 149424 105578 189476 338105 289301 299228 488192
12319 488192 370632 202849 203260 379425 341461 431866 365063 -2086 -90068 6815 -242001
12308 -242001 -320773 -121839 -127133 -221480 -335474 -103804 336385 503395 369607 69777
12298 69777 -115747 -222553 -263684 -183829 -172240 -197982 -162239 -148881 65511 97122 27377
12287 27377 60575 30659 112968 187063 82403 23810 -13778 -141434 -101462 64330 -71797
12276 -71797 -135173 -74493 -53395 -82310 -76177 44629 91228 -171640 -93538 88101 56916
12265 56916 6955 -50708 -155769 -52689 -45484 13749 -10856 11869 119012 70056 -48487
12254 -48487 -136622 36508 -106078 -127198 -75037 -24192 -147495 -78895 134251 268917 78549
12243 78549 -103137 15030 223253 241740 200919 79853 -144213 -150759 -148324 -154654 -230111
12232 -230111 -512252 -472434 -253544 91523 108346 -33459 -15421 92228 -15707 -186688
12222 -186688 -199880 -29186 112256 74617 -25512 -128310 -196352 18704 31143 -101462
12212 -101462 -109160 -1023 31728 -48980 -105729 -216327 -166314 24563 23873 147681 213334
12201 213334 11788 -57562 62147 92596 27484 44258 6684 7408 -30672 -222580 -389126
12190 -389126 -259901 62547 112854 76436 -76314 -121373 -231204 45744 299101 267672
12180 267672 181821 137997 205099 235043 287334 253943 84107 -28887 97411 289531 112163
12169 112163 2028 114890 121788 166321 76669 160860 214750 16365 -92888 130998 -37289
12158 -37289 -221963 -343253 -275886 -16509 153739 364134 343725 317638 235743 282038 385636
12147 385636 206318 17943 307911 569433 333367 167194 302538 356060 518214 593290
12137 593290 463701 294340 289338 394191 521696 289039 117773 219688 298414 311597
12127 311597 229650 3187 -38197 121351 29589 -75775 75869 -109166 -264022 -255450
12117 -255450 -84932 66192 198973 256298 88386 -87268 -90838 -93686 -312023 -294212 -79346
12106 -79346 -284173 -439227 -307509 -38949 191664 44822 186877 253091 44372 -8068
12096 -8068 -73910 -157477 -157533 -134156 -237380 -245939 -10739 267833 65886 -300014 -264114 -241281
12084 -241281 -321591 -321679 -359393 -290077 -111492 -50397 -38361 -49123 -71609 -37972 160405 363280
12072 363280 256361 188472 287565 362714 146780 963 -79746 1851 21702 42020 41166
12061 41166 175166 285932 312241 365308 414572 522542 285960 -71110 -38873 31432 -115516
12050 -115516 -356865 -176179 34633 -232025 -284979 -299984 -172105 -172669 -368620 -298054 -20261
12039 -20261 197234 25149 46174 118809 24706 -129066 -304375 -264145 -168209 -402894 -250772
12028 -250772 -178377 -317713 -247646 -180452 -51060 -34950 66446 -98090 -161287 91965
12018 91965 323722 304447 312293 196764 -108206 -278895 -288175 -55044 79601 -202385 -387392
12007 -387392 -390551 -395920 -164286 -15447 11835 194872 114035 29012 161407 -30243 -211769
11996 -211769 41660 89266 5617 98253 264659 47293 -103766 161426 113918 146207
11986 146207 152848 272471 146386 13899 5208 32037 5568 24781 -16385 115766 80992
11975 80992 -141253 -121810 -171965 -302988 -229798 -413069 -465741 -135356 131490 158316 217699
11964 217699 379911 352965 280706 259799 -142858 -115254 931 -291692 -590685 -524652
11954 -524652 -277001 -48799 -284462 -473316 -349943 -351819 -277961 -161602 -89247 -4125
11944 -4125 -46135 -176351 -151773 -335461 -611679 -640097 -499924 -370767 -170582 -238833 -433868
11933 -433868 -465580 -313349 -448284 -214372 241153 233379 76021 14486 160680 -5684
11923 -5684 -20348 -8906 -3585 100291 166903 37331 -382984 -433018 -231034 -159263 -66065
11912 -66065 -5713 -86998 -309913 -665249 -546799 -300808 -197975 -341246 -256923 -31977
11902 -31977 97025 -115833 -232261 -96398 126441 197066 71574 85129 263685 280013
11892 280013 104346 -114460 -57132 29051 178004 153312 -232445 -333152 -300015 -386284
11882 -386284 -365287 -315937 -153755 8093 97894 56616 11144 -190835 -177899 81239 51250
11871 51250 152513 87556 -53600 -110680 -114926 -253527 -230447 -158970 -273166 -423286 -377402
11860 -377402 -228668 -91990 -48826 -155215 -398995 -370434 -188070 45423 54303 -49756
11850 -49756 -103483 -143464 -4489 268534 106195 68307 70823 22908 74020 119896 143137
11839 143137 67667 170294 203570 222005 262810 302783 294574 145879 78770 63599 120013
11828 120013 215344 357545 205030 63766 153226 -1993 -78841 -127818 -229426 -265866
11818 -265866 -282419 8608 114863 -13930 -251446 -417888 -254319 -128550 193573 216213
11808 216213 36845 107768 -70834 -181942 -252592 -10530 -10468 -121592 -304730 -421682 -366367
11797 -366367 -193104 -50992 16248 -62601 -276609 -305085 -107782 69460 54015 -28324
11787 -28324 -225135 -210433 -109035 -46680 232332 135382 -93383 20033 210229 58044
11777 58044 -89353 -82792 -130927 -75822 -98289 -13768 75080 177486 206266 168269 20976
11766 20976 288379 329922 206792 284604 162867 488 -55411 -90996 -223113 -54444
11756 -54444 10249 -24764 -120305 -130054 -124951 -169826 -316807 -280578 -69457 -164055 -141249 -74651
11744 -74651 243787 104972 86728 -114885 -74538 208070 90820 -105167 -163291 -20500
11734 -20500 142551 -23104 31952 72656 124037 27353 52427 11975 220883 203947 289095
11723 289095 120347 -130618 164135 240607 197611 -50749 -217592 -178723 -145915 -141998 -221332
11712 -221332 -18540 199706 59437 -111551 -103994 -91204 -22921 123890 105625 -2222
11702 -2222 -208163 -499843 -900490 -474974 -101171 -30749 60810 -45921 -123442 113492
11692 113492 211739 49651 167927 165677 47138 12325 141254 215450 236033 200597 29255
11681 29255 -34628 -219195 -196440 -149398 -9285 194949 170371 -110282 -143975 -212129 -30774
11670 -30774 106715 136401 209580 384454 324369 348999 66498 -1561 -63969 -50457 -65712
11659 -65712 -60768 -82580 -109735 -141596 -168602 28633 -8278 -301402 -199951 143609 175693
11648 175693 39590 -104018 -84117 45619 8789 136105 104507 -107612 -176350 -62091
11638 -62091 -22703 159014 215949 172328 98189 31211 -260064 -445084 -591346 -806946 -719152
11627 -719152 -526522 -440975 -281856 -198240 -164683 -49943 -308928 -223008 18781 -247
11617 -247 -2480 -183064 -255403 -329793 -339260 -182522 -86040 -88061 -13637 -186916 -270979 -246988
11605 -246988 -203326 -164625 -120103 37532 53509 16566 -164904 -346050 -170557 -182860 -246401
11594 -246401 -229005 42338 123159 109513 -42845 -220767 -106268 -89339 -247675 -303612
11584 -303612 -412477 -181095 -50175 -273146 -251341 -192899 -73665 164707 58195 189992
11574 189992 207303 34649 32927 78637 -64505 -2199 -110147 -183554 -163503 -62786 9338
11563 9338 77742 -74292 -180406 -143226 -158885 -95997 -85683 -206918 -400863 -484012 -239398
11552 -239398 80834 76973 -257410 -236711 -334942 -240322 -62464 -27518 -92007 -20337 17036
11541 17036 146276 184179 302420 225541 -110224 -197079 -246197 -151092 -135933 -203902 -214515
11530 -214515 -216698 -257305 -235692 -223766 -64049 -163626 -129687 -38825 -5611 -74242 -144451
11519 -144451 -116241 88682 157199 71506 315902 320328 281142 -89582 -341961 -517886 -499901
11508 -499901 -376570 -340388 -293939 -151324 -9484 -99687 -128229 -100111 -212884 -308952 -550163
11497 -550163 -692895 -485862 30476 458878 458580 310404 79750 19300 -13434 -159703
11487 -159703 -307079 -295200 -241433 -42819 72913 32353 -24695 -18307 -45658 165790 -19958
11476 -19958 -114781 -38567 -29990 -112505 -128314 -232386 -269075 -254212 -514783 -455220 -77988
11465 -77988 175360 258249 62627 -252152 -230065 -50340 129832 79542 137172 -172128
11455 -172128 -405875 -182116 -194083 -303793 -498628 -250416 -279471 -251087 -209093 -56032
11445 -56032 6704 57212 213331 141256 62466 279994 355253 169819 -220304 -281318 -123679
11434 -123679 -40908 88761 55032 1981 -67484 -361484 -445851 -398286 -320085 80719 237641
11423 237641 152584 158377 215378 28907 -168515 -212647 -3813 -164841 -180564 -226227 -206708
11412 -206708 -325258 -494017 -577318 -371944 -145168 60281 -13457 -66608 -104117 188332
11402 188332 99104 2428 -33844 -162581 -144975 -108025 -103010 -28372 -99937 73822 278827
11391 278827 273753 113368 53206 145090 230188 294752 348319 366510 290987 265169 325393
11380 325393 153570 62296 49467 73780 142739 147931 254515 637178 776133 670687 448612
11369 448612 106851 -124183 -49352 184054 299715 473437 676757 479286 322435 113625
11359 113625 298559 244725 145858 222893 264257 302150 256523 100189 121569 326402 177060
11348 177060 111952 55115 -39923 -107868 -102313 288332 375720 443197 261108 124453 90775
11337 90775 97274 49372 -76907 -79423 -86609 -97866 -146795 -226211 -193070 -21710 168845 212598
11325 212598 -8074 -59241 -109479 166441 198640 186931 240074 364658 173508 212430 33411
11314 33411 82555 88459 24247 162083 105417 7126 -78220 -176009 -296694 -596946 -510454
11303 -510454 -489961 -395811 -399691 -484378 -486309 -246255 19826 88543 28452 -37202 58352
11292 58352 96400 -97665 -155345 44771 112288 107966 27256 195318 198837 89270 146935
11281 146935 324892 311870 -8405 17965 31180 66383 -60430 -191346 -267334 -198875 -115098
11270 -115098 40321 -56937 -51202 -121084 -197374 -106713 -105998 -264667 -295946 -194178 -131519
11259 -131519 -80541 -148681 123310 243705 271004 -77903 -335334 -197170 -154951 -5386
11249 -5386 178863 206830 136404 109994 -26299 65147 79540 16487 72981 203314 386003
11238 386003 398558 299543 347751 89009 -97925 61725 -120418 -205276 29544 243313
11228 243313 144210 274306 249994 68805 -134828 -206497 -220598 110352 199408 126324 -49940
11217 -49940 -105170 -151475 -370077 -253078 2901 34751 44968 146817 9856 -125890
11207 -125890 -131522 -3749 20174 137022 21239 -119354 -62071 -195150 -230167 24906
11197 24906 -35596 -12079 95071 -64916 -456074 -445660 -131692 -5874 91780 -95701
11187 -95701 -223024 -159540 -53545 -60029 -36886 -186169 -202606 -194744 -176642 -286440 -323197
11176 -323197 -192756 -73013 -171306 -208599 -279133 -144446 -93453 -32901 -153176 -67704 124200
11165 124200 311260 202785 4774 275768 493119 275308 48895 38789 183321 103325
11155 103325 -99925 -208666 -248304 -250522 -217228 -149188 14206 99632 52339 228743 308150
11144 308150 138621 -51589 -152023 -358226 -175205 -132348 -85639 -236355 -172746 -30134
11134 -30134 230768 223432 -89472 -153028 68618 195151 253089 182362 113539 311713 301511
11123 301511 188157 198125 209621 265092 252419 338594 208871 67896 237735 137241 88600
11112 88600 -37139 -59316 -43783 -202969 -236542 -239671 -375297 -297519 -269701 -157500 -51396
11101 -51396 85627 37938 -11430 -294077 -537531 -367215 -155861 -211322 -128336 -154263 127349
11090 127349 236462 306258 127197 12697 -52823 -90352 1147 133913 167648 -9495
11080 -9495 -43240 -111461 -18322 198283 314257 326630 368477 48182 -279914 -122539 -20683
11069 -20683 -1449 79956 205297 93149 62901 165881 365131 451259 644598 613740 492347
11058 492347 284710 354606 222615 66077 -19520 10779 87094 122607 390993 297473 69164
11047 69164 164307 75776 201590 317291 230304 36679 -26931 67167 -219181 -379948 -545023
11036 -545023 -567715 -405394 -372712 -321737 -124576 117802 213541 141952 130510 237165 158781
11025 158781 42386 -129271 -367884 -184113 44427 179331 281601 258534 279307 536956
11015 536956 364125 237901 151451 125638 61562 -127489 -278877 -22436 85798 142314
11005 142314 291195 305778 351050 597151 538715 269655 221421 147280 207811 266975 294288
10994 294288 547570 615536 639875 466307 318578 389209 526419 722646 762522 747595
10984 747595 308947 50932 160666 269725 317107 505195 580247 546169 424880 334620
10974 334620 232952 137478 -48708 94791 403511 499867 379665 364522 390363 343376
10964 343376 290032 333229 392783 375341 126760 187255 28137 96333 -120486 43807 150581
10953 150581 158339 215970 245392 385264 205944 106339 160143 143266 226210 82087 -34866
10942 -34866 177866 474654 448069 307274 214801 9209 33882 105772 187471 307368 300291
10931 300291 340213 342016 398650 509605 446943 359854 254437 17621 -12842 131500 27482
10920 27482 -104713 -61839 63962 86248 127700 399977 349891 183359 119756 151465 463356
10909 463356 344578 403813 270325 261146 338932 224650 155641 148445 244460 380418 438183
10898 438183 599577 725254 789556 675712 284897 418844 232353 205671 194250 81791
10888 81791 37407 -200806 -201121 206404 363255 296241 157260 -101748 -181203 -110960 -97620
10877 -97620 55263 -9111 -213713 -184576 -48747 180627 258244 365221 383794 287376 101616
10866 101616 -250706 -225000 -196261 -147324 -28788 90440 24233 -81610 6424 215684
10856 215684 376657 411454 241701 36534 -21952 173964 50300 50506 245651 189564 189342
10845 189342 231231 313586 331134 276901 207064 127727 81131 -24704 92923 253527 352624
10834 352624 347700 379996 254295 254645 282613 536872 473357 391097 279616 151907 295101
10823 295101 280094 170377 257406 421412 434411 387339 413371 407371 380779 385797 442529
10812 442529 869825 955069 707322 564342 305333 123290 51878 156674 95243 114199
10802 114199 -5279 93692 134278 240908 380252 355093 324283 400212 184134 111703 123642
10791 123642 153414 178512 175637 160410 40128 40452 204770 448895 381260 134546 78915
10780 78915 396484 280921 180378 254080 327523 289057 213648 64868 8769 56129 117251
10769 117251 477537 597731 508266 327547 415443 715127 632672 258058 173171 263413
10759 263413 272973 258990 338132 388516 439574 459801 591680 411425 90961 -60108 -101090
10748 -101090 -90319 -198452 -132182 42887 159729 583885 759901 832654 675500 490273
10738 490273 495824 606022 412421 440940 500982 472860 533416 414996 345717 293311 191337
10727 191337 306573 141612 37307 93988 330476 436479 230969 30673 240766 325713
10717 325713 234140 69729 321183 433871 326116 70842 -137853 -30470 -12136 39004
10707 39004 156723 28930 271805 287768 307449 345046 338517 488159 400473 147515 125330
10696 125330 418793 580336 678826 732079 558644 679089 770478 580681 412997 365169
10686 365169 716310 877729 909827 579980 312945 255269 302542 46038 -59787 64801
10676 64801 262338 277306 155254 129400 278512 404167 426029 420733 322363 512607 545227
10665 545227 579379 620969 613252 672178 806727 804697 874767 897580 813945 406417 238046
10654 238046 331963 470046 718518 789315 871434 1024487 1167484 1089479 1038237 926313
10644 926313 930921 914630 702918 445095 213342 263765 287886 455696 627380 946365
10634 946365 1188429 1226020 1248840 1347008 1229765 1215723 1228051 892974 722035 469323
10624 469323 560657 1026400 1279024 1093368 851573 786144 829176 824053 1020598 1017144 921423
10613 921423 1195408 1324384 1194884 1109630 1295908 1142989 1048892 877795 1107352 1242919
10603 1242919 1188962 1262084 1351961 1331003 1476209 1557358 1606584 1528923 1509653 1653141 1715393
10592 1715393 2057510 2198428 2171197 2137205 2118715 2238127 2282799 2613578 2443461 2385535
10582 2385535 2557641 2556484 2519454 2641984 2755894 2771967 2902899 2970890 3113172 3099756
10572 3099756 3222366 3421513 3612517 3800699 3848797 4114703 4187400 4255380 4600753 4902874
10562 4902874 4971159 5503747 5950276 6284356 6688938 7021991 7092504 7060545 7232804 7679389
10552 7679389 8233634 8642744 8768956 9303907 10135548 10590341 10927015 11438514 12031261
10543 12031261 12520176 13047097 13525372 14433347 15244909 15859445 16217034 16933835 17707470
10534 17707470 18370339 18880953 19782991 20815741 21454514 22367419 23340387 24755861 25945068
10525 25945068 26967929 27767739 28698967 29806829 30874047 31862068 32883932 33958286
10517 33958286 34995466 36138779 37096348 37785657 38566810 39208684 39967409 40737234 41487284
10508 41487284 42249323 43193785 44262354 45284412 45939220 46754850 47841311 49059458 50009222
10499 50009222 50716572 51303882 52302799 53465830 54383110 55189051 56315353 57371309 58368084
10490 58368084 59309603 59867080 60308869 60644798 60778049 60745455 60760601 60576720 59907711 59098147
10480 59098147 58207407 57171760 55973796 54472629 52988116 51229689 49483378 47689625
10472 47689625 46315360 44508082 42520929 41215281 39915867 38092102 36425443 35310352
10464 35310352 34279549 33172754 31818827 30586496 29353718 28181746 27153313 26212221
10456 26212221 25244760 23959051 23090996 22454353 21638961 20855592 20172387 19653765 19142580
10447 19142580 18511552 17754484 16975373 16347228 15684170 14874031 14270064 13648081 12875983
10438 12875983 12120244 11520972 11058530 10450966 9722347 9350523 9026964 8621280 8126767
10429 8126767 7420879 7130099 7005751 6660293 6349510 5714423 5212360 4959633 4970588 4554575
10419 4554575 4296767 4155069 4043564 4106228 3848023 3480649 3337710 2922073 2770187 2754583
10409 2754583 2827341 3032068 3102326 2927978 2714101 2709449 2462346 2103109 1834413 1613917
10399 1613917 1799367 1853804 2071790 2068401 1934016 1610533 1658871 1714006 1702831 1620653 1533129
10388 1533129 1443026 1362031 1289700 1233380 1387056 1113445 851670 821615 753889 984556
10378 984556 1053476 1241330 1402751 1124697 1030941 1067398 974144 887275 820870 966047 936636
10367 936636 690272 688058 878587 905347 949557 910686 770405 505592 590424 692488 788889
10356 788889 683595 516476 365918 628955 977150 942497 876899 730523 645595 528227
10346 528227 270835 295063 315904 338221 443442 389329 50450 25600 384516 399801 343143
10335 343143 388005 495383 574036 478432 256485 266491 314388 256766 164929 224185 342217
10324 342217 483802 555718 688619 691429 570685 653565 640169 277095 104448 117192 281281
10313 281281 297601 450378 598888 438355 539667 567053 484375 444934 355507 442858 417966
10302 417966 439870 332943 403706 355763 496980 512250 650014 431485 347227 147465
10292 147465 19209 144879 246818 349927 383391 566755 708579 825372 564434 305596
10282 305596 58814 57920 89017 127323 271972 259357 354753 485200 376022 430451 550976
10271 550976 672295 495706 234539 177064 271317 371330 347921 300622 421284 409412
10261 409412 488370 348702 389020 471359 443442 590716 744150 610323 424368 426502 606680
10250 606680 580192 488937 512907 731343 824552 657489 518144 446810 423622 412884 556816
10239 556816 711669 783836 673793 530631 416563 398534 423883 457830 624943 623411 462895
10228 462895 316281 141224 138769 41289 96027 193612 316984 519119 664117 493353
10218 493353 361810 426144 389675 121051 90661 183458 225999 382200 397752 336522 340062
10207 340062 402894 276641 186899 256339 112893 46647 126884 225378 158777 180603 223512
10196 223512 237832 134392 114445 179745 167734 240000 316741 258976 158706 152269 15793
10185 15793 -118487 139042 255820 104868 -54926 -20033 134943 240022 172423 55078
10175 55078 20872 1577 47373 261172 214149 -15536 -47005 -7261 20695 -136434 -167590
10164 -167590 -164726 -179852 33838 279206 415943 249953 18818 -51691 -5632 202607
10154 202607 275266 157825 -99620 -176759 60057 282083 134065 27599 -66486 -125289
10144 -125289 -55755 -54511 -177771 -22619 67344 112548 249547 309063 119533 109632 18926
10133 18926 52712 216791 319887 251535 75257 -152560 -280312 -216837 43745 109404
10123 109404 107455 209350 4750 19464 -118573 -277993 -284959 -100245 -65125 -11969 -24181
10112 -24181 -26318 -140822 -193441 -54127 86760 93711 182564 185575 155265 118901 269707
10101 269707 175375 64530 129564 163907 368595 323033 147981 140487 137935 100383 80139
10090 80139 -80374 -94829 -72146 -47762 -29203 -133282 -152601 -63688 -113707 99775 139746
10079 139746 -221318 -268084 -330555 -340437 -347052 -376956 -287304 -265576 -129715 -88117 -142853
10068 -142853 -161953 -317672 -146977 -112256 -103995 48026 -233842 -188165 18155 268673
10058 268673 275815 67683 45114 130282 -38747 136214 131828 -11681 65280 60852 -260746
10047 -260746 -293319 -73466 53533 85334 266331 301954 208054 377466 431178 424925 372321
10036 372321 126875 24079 -83273 60942 110538 -235273 -205452 21838 6970 -51948
10026 -51948 120225 93631 105088 198672 26516 122303 293206 242126 203331 241073 213561
10015 213561 177141 27486 -190454 42644 271227 297862 331295 388207 302393 232781 392958
10004 392958 630088 492388 276633 368742 190620 160500 250204 413400 296722 93351
9994 93351 376037 544936 250945 83705 70083 150210 65942 73696 59538 -74193 -292611
9983 -292611 -208967 -29912 17054 154178 324420 326824 128302 136994 234505 222470 407373
9972 407373 417285 389304 185523 155561 410960 436131 409439 292559 358374 454222 149456
9961 149456 54144 5195 -141045 -36409 263773 74105 -104561 -90521 35416 134125
9951 134125 204610 199603 19505 -58576 520 -119579 -190151 -23796 160932 46198 141912
9940 141912 130482 22194 -359888 -496995 -239924 144027 117526 -29403 83186 70013
9930 70013 102674 97265 24087 -81054 45606 216613 148487 -5077 175252 281403 374212
9919 374212 330792 179892 82575 -131316 -38389 -19094 -272904 -68077 35115 -134336
9909 -134336 -130468 127796 107503 180426 177983 144905 66497 28336 196295 217644 320531
9898 320531 160582 92247 260869 310920 306477 241517 75203 -17866 -2733 -29625 -71302
9887 -71302 42180 -133439 -239477 -235643 -108871 -97349 47323 2009 59643 -112047 -162800
9876 -162800 -219090 -109136 250644 366569 284170 -51664 -92681 52230 203640 434403
9866 434403 356119 302219 39923 -98897 -71564 134636 161397 326379 556811 493604 165822
9855 165822 40910 -237 -29493 37151 76942 -24303 -159432 -268706 -16322 177712
9845 177712 235381 329574 397255 396770 271371 219956 254445 330733 431961 526266 432368 613325
9833 613325 626446 216144 100068 221992 207403 204103 278154 38361 -208204 -255602 161257
9822 161257 -19892 -344918 -450968 -211684 -87460 -177972 -99913 192005 39701 97633
9812 97633 100496 141520 157498 210247 173642 298165 411261 499660 588382 584115 551294 624949
9800 624949 598281 347568 176844 86567 97864 233040 308269 245168 119121 -29668 -89593
9789 -89593 124855 343059 509688 425757 211716 -138675 -131293 -52825 -209476 -244345 -67466
9778 -67466 28 47430 84949 -70386 -226088 -96093 213597 184701 291326 195743 -59302
9767 -59302 -159621 -83081 108267 391331 471394 509300 234488 162584 59129 -21864 69504
9756 69504 -61149 72760 169608 37972 -187296 -360078 -258567 -258199 -134395 -288230 -416237
9745 -416237 -74582 92975 119759 -4208 -202517 -246724 -359172 -246669 103314 -3837
9735 -3837 -354927 -380628 -196162 -6043 188782 135104 87862 -10933 -109176 -153656 97960
9724 97960 139296 193021 450773 333667 180488 -134184 -283334 -211711 -74494 163525
9714 163525 99279 -195431 -583406 -773268 -592046 -242990 23693 221534 466194 477702
9704 477702 440721 435102 116239 253074 348370 156333 60220 -88634 -32953 179134 246504
9693 246504 215265 -173192 -91673 -20976 -94805 -115681 25141 -43393 -52376 -163022 -147988
9682 -147988 158162 265505 294772 405386 167402 135923 262215 435706 467281 125639
9672 125639 7477 246591 108220 -123945 -202901 -199118 -70573 312065 432021 473188
9662 473188 463830 516932 331060 52716 214190 219759 455376 346499 -77869 148304 304315
9651 304315 291552 441744 336333 368712 279866 246103 589167 517104 439833 297957 216230
9640 216230 337996 455142 525077 404557 196592 47920 -7136 119873 259932 526311
9630 526311 537052 385250 230220 191195 152649 273176 233653 154473 171193 103875 263924
9619 263924 241885 -36115 -117748 -30807 -10025 -84158 99767 369258 400855 311847 460069
9608 460069 375037 187080 -29946 -43915 138622 305982 459449 447994 487757 252088
9598 252088 416350 393774 330501 194051 219933 287645 463367 339059 82225 207159
9588 207159 262963 255660 211789 22743 5825 93754 14821 83304 102805 415463 468136
9577 468136 374372 526589 486103 303476 68407 44747 -52990 27330 232524 280006 375003
9566 375003 315829 130255 74549 339099 365028 355372 432653 317144 91873 252756 544307
9555 544307 563139 500744 280615 278023 496583 363296 205780 162462 256069 205706 3832
9544 3832 -8729 -20359 35411 172299 67271 -52047 1280 22408 -89269 95870 253223
9533 253223 161686 221931 145793 137277 261407 157148 528194 786327 669332 671147 595160
9522 595160 739363 701697 586915 484152 262382 326384 638789 604799 696273 799588
9512 799588 548397 526779 589920 522406 321555 292385 503398 595706 510437 623798 720612
9501 720612 585893 354143 341483 529158 585783 717283 700909 567428 656369 489628
9491 489628 282493 370185 470483 439971 171420 316025 453088 222162 66701 137019
9481 137019 173939 255791 339297 520190 692011 796692 820614 638210 597859 667333 776208
9470 776208 787736 694596 667402 489769 517896 566820 647126 821280 540194 229463 183822
9459 183822 306670 509505 613906 454610 198327 -62392 126717 318158 500715 440261
9449 440261 398136 501700 271934 74912 74149 393519 550455 520985 567487 445001 343367
9438 343367 607624 476856 417956 374473 266604 194572 113441 173654 344903 417762 396312
9427 396312 547026 585270 596426 178334 180476 571293 337379 512001 756316 591663
9417 591663 443068 424978 746728 975906 905744 907774 882325 816021 725717 881749 922794
9406 922794 962272 866281 808321 724021 854024 994720 753261 821143 867012 988088 1141651
9395 1141651 1136966 1154216 1006502 1072763 1026433 888277 793353 988783 1008768 842613 729461
$$ [...]
##END NTUPLES=NMR SPECTRUM
##END=
